##TITLE=Analysis number 317760
Compound Code tl 00437
Book Reference b
Project Code adrs
Chemist Name ugmt
##JCAMPDX= 6.0         $$ Bruker NMR JCAMP-DX V2.0
##DATA TYPE= NMR SPECTRUM
##DATA CLASS= NTUPLES
##ORIGIN= Bruker BioSpin GmbH
##OWNER= nmr
$$ XWIN-NMR		Version 3.5
$$ Thu Mar  2 15:08:30 2006 GMT Standard Time (UT+0h)  MAYBRIDGE\nmr@NMR_250MHZ
##.OBSERVE FREQUENCY= 250.131544655141
##.OBSERVE NUCLEUS= ^1H
##.ACQUISITION MODE= SIMULTANEOUS (DQD)
##.ACQUISITION SCHEME= undefined
##.AVERAGES= 16
##.DIGITISER RES= 18
##SPECTROMETER/DATA SYSTEM= dpx250
##.PULSE SEQUENCE= zg30
##.SOLVENT NAME= DMSO
##.SHIFT REFERENCE= (INTERNAL, DMSO, 0, 16.522)
##AUDIT TRAIL= $$ (NUMBER, WHEN, WHO, WHERE, WHAT)
$$ ##TITLE= Audit trail, XWIN-NMR		Version 3.5
$$ ##JCAMPDX= 5.01
$$ ##ORIGIN= Bruker BioSpin GmbH
$$ ##OWNER= nmr
$$ C:\u/data/dgb/nmr/ADRS/17330/pdata/1/auditp.txt
$$ ##AUDIT TRAIL=  $$ (NUMBER, WHEN, WHO, WHERE, WHAT)
(   1,<2006-03-02 15:08:03.22 +000>,<MAYBRIDGE\nmr>,<NMR_250MHZ>,
      <created by zg, POWCHK disabled, PULCHK disabled
       configuration hash MD5:
       84 BC 41 DB A1 6E 1D 46 DA 25 12 A5 C1 ED C5 3A
       data hash MD5: 64K
       AC D0 26 53 CF 3B FE FE 58 4B D4 B4 5C 8C 80 24>)
(   2,<2006-03-02 15:08:19.06 +000>,<MAYBRIDGE\nmr>,<NMR_250MHZ>,
      <Start of raw data processing
       ef LB = 0.3 FT_mod = 6 PKNL = 1 SI = 32K 
       data hash MD5: 32K
       1D AF 40 B6 C2 C2 A6 52 10 6B 4E 27 9A AE FB F3>)
(   3,<2006-03-02 15:08:20.92 +000>,<MAYBRIDGE\nmr>,<NMR_250MHZ>,
      <apk 
       data hash MD5: 32K
       A5 88 03 3F 92 D6 AD 94 20 4E 6F 06 CA 02 E7 65>)
(   4,<2006-03-02 15:08:21.72 +000>,<MAYBRIDGE\nmr>,<NMR_250MHZ>,
      <abs ABSG = 5 
       data hash MD5: 32K
       0D A6 9F D7 79 D9 E7 E0 D8 D7 B9 8E 6D AC 28 33>)
$$ ##END=
$$ 
$$ hash MD5
$$ F0 B8 04 99 6C 7E 78 41 E6 A3 BE 2F 07 0C 1E 1B
##$RELAX= 
##$RELAX= 
##$RELAX= 
##$RELAX= 
##$RELAX= 
##$RELAX= 
##$RELAX= 
$$ Bruker specific parameters
$$ --------------------------
##$DU= <C:\u>
##$EXPNO= 17330
##$NAME= <ADRS>
##$PROCNO= 1
##$TYPE= <nmr>
##$USER= <dgb>
##$AMP= (0..31)
100 100 100 100 100 100 100 100 100 100 100 100 100 100 100 100 100 100 
100 100 100 100 100 100 100 100 100 100 100 100 100 100 
##$AQSEQ= 0
##$AQ_mod= 3
##$AUNM= <au_zg>
##$AUTOPOS= <32 >
##$BF1= 250.13
##$BF2= 250.13
##$BF3= 250.13
##$BF4= 250.13
##$BF5= 500.13
##$BF6= 500.13
##$BF7= 500.13
##$BF8= 500.13
##$BYTORDA= 1
##$CFDGTYP= 0
##$CFRGTYP= 5
##$CHEMSTR= <none>
##$CNST= (0..31)
1 1 145 1 1 1 1 1 1 1 1 1 1 1 1 1 1 1 1 1 1 1 1 1 1 1 1 1 1 1 1 1 
##$CPDPRG= <>
##$CPDPRG1= <>
##$CPDPRG2= <>
##$CPDPRG3= <>
##$CPDPRG4= <mlev>
##$CPDPRG5= <mlev>
##$CPDPRG6= <mlev>
##$CPDPRG7= <mlev>
##$CPDPRG8= <mlev>
##$CPDPRGB= <>
##$CPDPRGT= <>
##$D= (0..31)
0 1 0 0 0 0 0 0 0 0.06 0 0 0 0 0 0 0.0002 0 0 0 0 0 0 0 0 0 0 0 0 0 0 
0 
##$DATE= 1141312081
##$DBL= (0..7)
120 120 120 120 120 120 120 120 
##$DBP= (0..7)
150 150 150 150 150 150 150 150 
##$DBP07= 0
##$DBPNAM0= <>
##$DBPNAM1= <>
$$ [...]
##$SUBNAM7= <"">
##$SUBNAM8= <"">
##$SUBNAM9= <"">
##$SW= 20.6930455092707
##$SWIBOX= (0..15)
0 0 3 0 0 0 0 0 0 0 0 0 0 0 0 0 
##$SW_h= 5175.983436853
##$TD= 65536
##$TD0= 1
##$TE= 293.16
##$TE2= 300
##$TE3= 300
##$TEG= 300
##$TL= (0..7)
0 120 120 120 120 120 120 120 
##$TP= (0..7)
150 150 150 150 150 150 150 150 
##$TP07= 0
##$TPNAME0= <>
##$TPNAME1= <>
##$TPNAME2= <>
##$TPNAME3= <>
##$TPNAME4= <>
##$TPNAME5= <>
##$TPNAME6= <>
##$TPNAME7= <>
##$TPOAL= (0..7)
0.5 0.5 0.5 0.5 0.5 0.5 0.5 0.5 
##$TPOFFS= (0..7)
0 0 0 0 0 0 0 0 
##$TUNHIN= 0
##$TUNHOUT= 0
##$TUNXOUT= 0
##$USERA1= <user>
##$USERA2= <user>
##$USERA3= <user>
##$USERA4= <user>
##$USERA5= <user>
##$V9= 5
##$VALIST= <valist>
##$VCLIST= <CCCCCCCCCCCCCCC>
##$VD= 0
##$VDLIST= <DDDDDDDDDDDDDDD>
##$VPLIST= <PPPPPPPPPPPPPPP>
##$VTLIST= <TTTTTTTTTTTTTTT>
##$WBST= 1024
##$WBSW= 4
##$XGAIN= (0..3)
0 0 0 0 
##$XL= 0
##$YL= 0
##$YMAX_a= 353790
##$YMIN_a= -430040
##$ZGOPTNS= <>
##$ZL1= 120
##$ZL2= 120
##$ZL3= 120
##$ZL4= 120
##$ABSF1= 16.522
##$ABSF2= -4.171173
##$ABSG= 5
##$ABSL= 3
##$ALPHA= 0
##$AQORDER= 0
##$ASSFAC= 0
##$ASSFACI= 0
##$ASSFACX= 0
##$ASSWID= 0
##$AUNMP= <proc_1d>
##$AZFE= 0.1
##$AZFW= 0.1
##$BCFW= 0
##$BC_mod= 0
##$BYTORDP= 0
##$COROFFS= 0
##$CY= 12.5
##$DATMOD= 1
##$DC= 0
##$DFILT= <>
##$DTYPP= 0
##$F1P= 14.0000005364418
##$F2P= -0.99999901652339
##$FCOR= 0.5
##$FTSIZE= 32768
##$FT_mod= 6
##$GAMMA= 0
##$GB= 0
##$INTBC= 1
##$INTSCL= 1
##$ISEN= 128
##$LB= 0.3
##$LEV0= 0
##$LPBIN= 0
##$MAXI= 10000
##$MC2= 0
##$MEAN= 0
##$ME_mod= 0
##$MI= 0
##$NCOEF= 0
##$NC_proc= -3
##$NLEV= 6
##$NOISF1= 0
##$NOISF2= 0
##$NSP= 0
##$NTH_PI= 0
##$NZP= 0
##$OFFSET= 16.522
##$PC= 1
##$PHC0= 238.3764
##$PHC1= 11.13053
##$PH_mod= 1
##$PKNL= yes
##$PPARMOD= 0
##$PSCAL= 4
##$PSIGN= 0
##$REVERSE= no
##$SF= 250.13
##$SI= 32768
##$SIGF1= 0
##$SIGF2= 0
##$SINO= 400
##$SIOLD= 32768
##$SREGLST= <1H.DMSO>
##$SSB= 0
##$STSI= 32768
##$STSR= 0
##$SW_p= 5175.98343685301
##$SYMM= 0
##$S_DEV= 0
##$TDeff= 65536
##$TDoff= 0
##$TI= <Analysis number 999999
Compound Code 99
Book Reference 9
Project Code 9>
##$TILT= no
##$TM1= 0
##$TM2= 0
##$TOPLEV= 0
##$USERP1= <user>
##$USERP2= <user>
##$USERP3= <user>
##$USERP4= <user>
##$USERP5= <user>
##$WDW= 1
##$XDIM= 32768
##$YMAX_p= 278446415
##$YMIN_p= -237305
$$ End of Bruker specific parameters
$$ ---------------------------------
##NTUPLES= NMR SPECTRUM
##VAR_NAME=  FREQUENCY,     SPECTRUM/REAL,   SPECTRUM/IMAG
##SYMBOL=    X,             R,               I
##VAR_TYPE=  INDEPENDENT,   DEPENDENT,       DEPENDENT
##VAR_FORM=  AFFN,          ASDF,            ASDF
##VAR_DIM=   32768,         32768,           32768
##UNITS=     HZ,            ARBITRARY UNITS, ARBITRARY UNITS
##FACTOR=    0.157963299565203, 1,           1
##FIRST=     4132.6476996994, 0,             0
##LAST=      -1043.33573715361, 0,           0
##MIN=       -1043.33573715361, -237305,     0
##MAX=       4132.6476996994, 278446415,     0
$$ Real data points
##PAGE= N=1
##DATA TABLE= (X++(R..R)), XYDATA
$$ [...]
25861f4123l395K5537J6045J2196K3730N9852k1965r671N0088J6478k2042m5499
25849C7231j3256L9950j5127j1009L968K9403K3490j245j5982l176j1515O023
25837F8755J7817K5033J9130k3401m3516L656m4920r910J1258r565n3578P441
25825c1800L0566Q686L3239M7795j7737n6533k3188k3584L0849Q240o924O3337
25813F2946K5690j9867j1664J1382J4807p2885k139N6832L3806l1928o3607j6995
25801a3622K3083k364l330L7136J8421L0297J8806k9949j5794j3484L4628J7444
25789A01272k194k1384k4836J2694K5611M2751k9879p1059L8835j6450m6077n0370
25777d1086Q813j7498K3012r07L7858O6225L4964L0550o400m2429o0633L0139
$$ y = [-64123, -67518, -41981, -25936, -13740, 9990, 69842, 47877, 38206, 88294, 104772, 82730, 37231, 23975, 63925, 48798, 37789, 41757, 71160, 94650, 93405, 77423, 74247, 62732, 68755, 86572, 111605, 130735, 107334, 63818, 67474, 22554, 12644, 23902, 14337, -39241, -31800, -1234, 7452, 40691, 88486, 70749, 14216, -8972, -32556, -1707, 6533, -391, 62946, 88636, 68769, 57105, 68487, 83294, 10409, 8270, 65102, 98908, 66980, 3373, -13622, 9461, 7097, 3767, 40903, 59324, 89621, 108427, 78478, 62684, 49200, 83828, 101272, 99078, 77694, 52858, 65552, 91163, 133914, 104035, 32976, 71811, 55361, 9284, -41086, -32273, -49771, -26759, -27666, 10192, 76417, 111381, 141931, 135531, 93102, 32469, 62608]
25765F2608N8106P80q1858n363M1177j9520j02090m7947P834k854L7255K2356
25753b9516K6253K1443K3395L6764l5079J9259k9316J7445o8106m7137j044J2121
25741e3518K8156k4894k1960m5912k8437J3721L7875P9135N7968O1489J7105o3645
25729E7083P341n3889j1059k0615j6316R1280P3338m6732k8097j3773J1116j3345
25717C6332L02R952m2074L165k617J8477k3894N7547K6904k0254o3051o8197j2565
25704g9973L5142Q809j656K4381K7297n10K4424L4030J8275O092K4285l9701l6363
25691D4532M2335k8058l6646Q887J2254k711j2891r0867n3592P598m601J2619
25679a01141k3553l1099p507K9122k846K5023K9449M6174J3591j9344q136L2572
$$ y = [62608, 120714, 121494, 39636, 34273, 75450, 55930, -46160, -94107, -86273, -89127, -51872, -29516, -3263, 18180, 41575, 78339, 43260, 62519, 33203, 50648, -17458, -64595, -65639, -53518, -25362, -50256, -72216, -118128, -146565, -132844, -94969, -15834, 42134, 103623, 120728, 57083, 64424, 10535, -524, -21139, -37455, 53825, 127163, 80431, 52334, 38561, 49677, 36332, 36634, 46586, 4512, 7677, 5060, 23537, -357, 57190, 84094, 63840, 789, -67408, -79973, -44831, -36022, -37678, -13297, 14000, 13490, 37914, 71944, 90219, 96311, 120596, 80895, 44532, 86867, 58809, 22163, 31050, 43304, 40593, 27702, -63165, -116757, -109159, -113760, -101141, -124694, -155793, -163300, -134178, -137024, -112001, -82552, -36378, -22787, -42131, -50267, -17695]
25667a7695N4149n0742j2656M0494j6779n8732l7673Q5527m3977l179Q374j5582
25655f8471K4286Q037j2260K4514j1752j791J8595m0317L6832m7546m5843N6263
25643e9453L8597L2642K1689j6022n468j3807J8320r031k3426K7120l5765K4225
25631c79O3532j9784j6715M076k0584j9600k192J1329J226m9502p149M3495O1762
25618D9515N6448n6513j8358K2795l1102q84L0099j9100l9826j8753N5508o0515
25606c0686l1756j3487K8785k6623j7811l650K2250j1142j6106N0250N1171L1288
25594C2483r544J986l4002q985K6456j889m36k4463o1273K835k605k2479n2616
25581a54532L75L3993N9051O2852J7691m5848m1821j6957K9728K7058J2652N9180
$$ y = [-17695, 36454, -14288, -26944, 13550, -3229, -61961, -99634, -14107, -58084, -61263, -52889, -68471, -44185, -36148, -48408, -23894, -35646, -37437, -18842, -59159, -22327, -69873, -115716, -59453, -20856, 11786, 33475, 17453, 11985, -1822, 16498, 7467, -15959, 11161, -24604, -379, 63153, 43369, 26654, 30730, 10146, -9454, -11646, -317, 909, -48593, -55742, -12247, 49515, 105963, 49450, 31092, 53887, 22785, 21901, 52000, 32900, -6926, -25679, 29829, -30686, -62442, -75929, -47144, -73767, -91578, -95228, -72978, -84120, -100226, -49976, 1195, 32483, 22939, 24925, -9077, -18062, 8394, 6505, 6069, -18394, -79667, -76832, -79437, -101916, -154532, -154157, -120164, -61113, 1739, 19430, -26418, -68239, -85196, -55468, -28410, -15758, 43422]
25569D3422l0326J4744K9080J1710j4230j5616M4500r662m9643m0087O044P713
25557b351m5221J1097O912M2179o490J8866j7651o181K2925J6284l489p0026k9630
25544f2776k843l2422N0225M5157M874l6016N3297m6037j5328J2290L9969J4628
25532B5018o0604k4117o4641L5506O3302R4238o6378m8528k6157K6478L0092k7198
25520d2989k4526p457Q954K4794P488J6332N091o5603l296J0660j03145K0003
25508a53694M5618L715M3537M0018m842K4723M4590O7963m3697q4912N9538M2820
25496H5377r188J8737o1170l8964M7514L7564m013j4320p1628n0279p8625J6538
25484a22457l024L7475P1043J4243Q779j926n423J748l3556p9493K1715J8193
$$ y = [43422, 13096, 27840, 56920, 68630, 54400, 38784, 83284, 73622, 23979, -16108, -10064, -2351, -47572, -36475, -29563, 12616, 6126, 24992, 7341, 1160, 24085, 40369, 36880, -33146, -62776, -65619, -98041, -47816, -2659, 2215, -33801, 19496, -26541, -41869, -29579, 10390, 25018, -35586, -59703, -124344, -88838, -25536, 68702, 2324, -46204, -72361, -45883, -15791, -42989, -67515, -74972, -66018, -41224, -33736, -17404, -12313, -77916, -81212, -70552, -173697, -153694, -108076, -104361, -60824, -20806, -25648, -925, 43665, 111628, 67931, -16981, 42557, 85377, 76189, 94926, 33756, -5208, 42306, 79870, 75857, 61537, -10091, -60370, -138995, -122457, -125481, -88006, -16963, -2720, 6059, 4133, -1290, 458, -33098, -112591, -90876, -72683]
25472g2683j9826j448j4319m220R134J3960M4139K2839p265m044K333Q330l5981
25459e9051l6303L4881R387J3739j769q911N9844L1993m8738n9237j077J3082
25447e2160K4125K3159K5131p0485l6270K9888M1637l8975n0279M5842j2189j7045
25435h7621K975J1374l9521K8925O7060R481k5822l6386j2898O1809o561m1437
25423f8622n8626Q1468P7356K4069K9070L762j4833q8561l507j4886N0437K9263
25411D6390l8957n0690n3822K6638K4333j3946M86J1316O489N8334J0171k557
25399B4185L6131L0817j8388J0994J2003m7389j6378j8299J41M8965K1102l26
25387H3558l4178j9563M2796q8514k6418k5025M5913L6436k2320k9158m836J6917
$$ y = [-72683, -92509, -93957, -108276, -112496, -103362, -89402, -45263, -22424, -29689, -33733, -31400, -23070, -59051, -95354, -60473, -51086, -37347, -39116, -48027, 11817, 43810, -4928, -64165, -65242, -52160, -28035, -4876, 20255, -50230, -86500, -56612, -14975, -53950, -104229, -58387, -70576, -87621, -84646, -73272, -112793, -83868, -16808, -7327, -33149, -69535, -82433, -20624, -27185, -68622, -127248, -45780, 31576, 55645, 84715, 88477, 73644, -14917, -18424, -33310, 17127, 46390, 7433, -43257, -97079, -70441, -46108, -60054, -59568, -48252, -41763, 16571, 26742, 24185, 60316, 91133, 72745, 83739, 95742, 48353, 31975, 13676, 13817, 62782, 83884, 83558, 49380, 29817, 72613, -15901, -42319, -67344, -21431, 15005, -7315, -36473, -41309, -24392]
25375b4392j5855n5566k208j4942N4277Q4236m4373o4630L2566N6507K5232L306
25363C4158R082r477j5369J3952K9384j7394P310J4143k5115J9045K9979N325
25351I5023q398r7108k5785J8570l8183M202N895k5914k7662J7053J4403p659
25339g5563O285J0685o5153K4947Q8487P1753Q578r6510o9104L8083Q5592P610
25327C5690p059j6608o452N2756r072p3670r7718R073Q9304K5408M537p816k1953
25314b3580l8996n7380k8039q696M7680P0282J07834K787K3117k543m5247k5170
25302B2049N461j2107m0918k7157K1703M387Q8659p403m9076K7953r536p1468
25290d7453m9538M5958J8621J3364j207K6621L6270k1219n4184m212n3276m2967
$$ y = [-24392, -40247, -95813, -98021, -112963, -58686, 25550, -18823, -83453, -50887, 5620, 30852, 34158, 43240, 33763, 18394, 32346, 61730, 44336, 51646, 65789, 40674, 59719, 89698, 95023, 86625, -10483, -36268, -17698, -55881, -51679, -45784, -71698, -99360, -82307, -67904, -75563, -69278, -58593, -123746, -98799, -10312, 61441, 70019, -26491, -95595, -57512, 28080, 35690, 28631, 12023, 5571, 58327, 49255, -24415, -122133, -113060, -23756, 1652, 6189, -1627, -23580, -62576, -119956, -147995, -156691, -109011, -38729, 69105, 71892, 95009, 92466, 47219, 22049, 27510, 15403, -25515, -52672, -30969, -26582, 62077, 54674, 5598, 33551, 24015, -47453, -96991, -51033, -32412, -19048, -20255, 6366, 42636, 21417, -32767, -36979, -90255, -133222]
25278a33222j2336j9917J7196Q6455J4058K5751l4465j0343K1499p074L9569M1928
25266B9099J9645J4387j9038j11599N349M1062J2932J7132p554J8373l2767j5363
25254b8342K2766M7501j165k5684J6559J6354k9250l519O803J8517O3603q460
25242I5683L914j7670m3000l2143j6484M3365K0364o1858J8599M8694l5956j7229
25230F279m7751n6568p06j720K1810J8181j1133R019K5392Q2456L9694L5938j4011
25217A06880N7261k4291j20633l5799K5259k0605K832j4285p757Q511k1623j1936
25205e6186M9906N0634R802L4903m490j8487l6520j2425K4508m4137k2956j5827
25193d1275k0767l6378K5724J8701m179o124J309Q124J1472P6827m246l7937K5538
$$ y = [-133222, -145558, -165475, -148279, -61824, -47766, -22015, -56480, -66823, -45324, -52398, -12829, 29099, 48744, 63131, 44093, -67506, -62157, -21095, -8163, 8969, 1415, 19788, -12979, -28342, -5576, 41925, 40760, 15076, 31635, 47989, 18739, 15220, 22023, 40540, 104143, 95683, 99597, 81927, 38927, 6784, -9700, 33665, 54029, -7829, 10770, 59464, 23508, 6279, -41472, -98040, -98746, -100466, -78656, -60475, -71608, -62589, -37197, 45259, 84953, 120891, 106880, 164141, 139850, 19217, -16582, 8677, -11928, -9096, -23381, -31138, -22627, -44250, -56186, -6280, 44354, 54156, 89059, 84569, 66082, 29562, 17137, 41645, -2492, -25448, -41275, -62042, -98420, -72696, -53995, -58174, -64298, -62989, -54865, -43393, 33434, 29188, -8749, 16789]
25180A6789Q25M5366l262o4632m7484l608J691N371m9663m076O0423P6533r09
25167C3364P7956j387l6771p4088O513L7907j2205k2925m1656o7356R304N9852
25155c1492K7573k2234L3045M0248j2935m1509q899k649J6650L8270L9441R546
25143H5055J4102k8231l5426j3893j7057k0122M1363P8144j6897m7342j2634M2663
25131F9725L902J5402j0646j8373k4015j7257J8169l6229o9890o005K5266N0188
25119B37J5864p3938q773M629m046k60J5484O587L0150l6276r364M3539N4392
25106C8225L0502L094j3604o6837q1692j4997k3245K6207j1897L8935K8826K4517
25094b1966p649R248L8917R209m921j8227k3926K0005k4550k1729N1395J00466
$$ y = [16789, 17614, 62980, 59718, -4914, -52398, -56006, -54315, -48944, -98607, -102683, -42260, 34273, 33364, 111320, 109933, 73162, -926, 5587, 43494, 31289, 8364, -33292, -100648, -91344, -31492, -3919, -26153, 6892, 47140, 34205, -7304, -16203, -18852, -2202, 36068, 75509, 85055, 99157, 70926, 35500, 21607, 4550, -15572, 25791, 103935, 87038, 39696, 27062, 69725, 73627, 89029, 78383, 60010, 35995, 18738, 36907, 678, -69212, -75217, -49951, 237, 16101, -57837, -66610, -61981, -66027, -66287, -50803, -44216, -14066, -50342, -59706, -16167, 38225, 68727, 71821, 58217, -8620, -90312, -105309, -128554, -102347, -114244, -75309, -46483, -21966, -29615, -20367, 18550, 27759, 22838, 4611, -19315, 690, -23860, -45589, 5806, 106272]
25082A06272K5463j04971q7023j8267l9401l1193O0777K7606l8249J6280j4485
25071i7191k200J6787n5607J5973K1220L7638M8831l4112L6064O7322J7588P203
25059G9516l1896L162N08p081o8794O2935O6836p5134l2522J4431L5681J7679
25047F5321l1192l1498J8321j5656M201N7138N229n5044n3886l9161M6461N6679
25035B6913r258l0268M4196O7625M792l3763q1127L4694R7381l8016m6086k5951
25023A1132L5954k359j6990J3067l358L6645P717p9755m6859j3215m678J5331
25011d7368L6284M4775L3036n9454j0289j4671r644n2312N709m622j8385j4891
24999a11832N8117O6786N2425j5717p0454r0946L3321O2420N0471n7272n508J0153
$$ y = [106272, 131735, 26764, -60259, -78526, -117927, -149120, -88343, -60737, -98986, -82706, -97191, -99391, -82604, -138211, -122238, -101018, -63380, -14549, -48661, -12597, 54725, 72313, 79516, 47620, 50782, 51290, 44209, -24585, 38350, 105186, 30052, -2470, 11961, 47642, 65321, 34129, 2631, 20952, 5296, 9497, 66635, 71864, 16820, -37066, -76227, -29766, 26913, 17655, -12613, 31583, 99208, 104000, 70237, -10890, 23804, 121185, 83169, 37083, 11132, 47086, 44727, 27737, 40804, 37446, 74091, 81808, 2053, -44806, -58021, -62699, -47368, -11084, 33691, 66727, 7273, -3016, -17687, -27331, -79643, -73934, -78556, -96941, -111832, -53715, 13071, 65496, 49779, -20675, -111621, -78300, -15880, 34591, -22681, -28189, -18036]
24987a8036o3458k0790K0770L3587K6986J4979L4701m0957j2758o043j1420O3838
24975B1399l964j0134N9155N4404J5504L1764J5086n3492j28849m6841p3769k3196
24963a42933M2669J07905N4788M5432N750p716j5124o2329q8077q8155L0170P0363
24951d7257O9788m703j516M570n954K3013J1917n9515n3722n244L4018J06378
24939G1773J12p8722n6326j4928M4385N8968j3195j11459n6373k3077L7105O6038
24927g5699M6180l7914m972J201n3586J4319l1138L6618N064M4556j431Q901q45
24914d8746p159J2834M5549K0279P396l689m4588j1191L5675l1607o6803m8943
24902a40993M3905N3483J0380j4726Q961k5736n7476p48n500p448L4250N5480
$$ y = [-18036, -81494, -102284, -81514, -47927, -20941, -5962, 28739, -12218, -24976, -31019, -42439, 21399, 17435, 7301, 66456, 120860, 136364, 168128, 183214, 129722, 873, -45968, -119737, -142933, -100264, 7641, 62429, 107861, 113611, 105895, 90771, 28442, -59635, -147790, -117620, -47257, 22531, 17828, 16312, 20882, 14928, 37941, 49858, -9657, -63379, -68623, -34605, 71773, 71885, -6837, -63163, -78091, -33706, 25262, 12067, -99392, -155765, -178842, -141737, -75699, -29519, -67433, -72405, -71204, -124790, -110471, -141609, -104991, -99927, -55371, -56802, -47901, -48746, -55905, -43071, 2478, 22757, 30153, 26464, -18124, -29315, 6360, -25247, -92050, -140993, -97088, -43605, -33225, -47951, -38990, -64726, -122202, -122950, -128450, -135898, -101648, -46168]
24890d6168J8368k2257N2194j0130j9993N3819L62n0961J420N6541O8289k5660
24878G5824k6860j7362l881n1949o2148l7968j987K812j8237K873P210K9192J5158
24865h7323K254l0189K582L7125M4487K6345P0972K0881N780K4620j9778J6807
24853A14563O263n4112o713J9848O3914l9839p8447J8437l0400Q4063K8498l1257
24841I4818m3164j9358K7831k1252m5585m1575J9393N3567r908l3718N4273K9711
24829F5033o912L1800J5643N5n4415p4393m6067P6025L9476L749m8190k5548J554
24816b2190k1566L7327L1617J2807L4263J9448k4822j4188j9682L1329l4534k4686
24804E123L2636o4075k2147M2323l3757k9474O485M8170M089o024m436k0652J879
$$ y = [-46168, -27800, -50057, 2137, -7993, -27986, 25833, 26195, -24766, -23346, 33195, 101484, 75824, 48964, 31602, 27721, -24228, -86376, -124344, -126331, -123519, -141756, -138883, -131673, -102481, -87323, -85069, -115258, -112676, -75551, -31064, -4719, 66253, 87134, 92914, 117534, 97756, 114563, 120826, 66714, 60001, 79849, 143763, 103924, 25477, 43914, 13514, 97577, 126075, 94818, 51654, 32296, 60127, 38875, -6710, -48285, -28892, 24675, 14767, -18951, 35322, 65033, 58121, 89921, 105564, 105619, 51204, -23189, -69256, 6769, 46245, 49994, 1804, -23744, -22190, -43756, -6429, 25188, 37995, 72258, 91706, 66884, 52696, 33014, 64343, 29809, 5123, 37759, -26316, -48463, -6140, -39897, -69371, -62886, -14716, -10627, -16651, -21087, -41739, -39860]
24791c9860p1160j045N2228N1065K9950k6296n8121O342J3459k519R453M749m0747
24778g2502j2110K6329N4076L2553J5868j8626L173m5703j8728j4953N5912L6499
24766D1788K7739k3813m9642m0227L1906J0683j8779N837N0506j2812j4389o1416
24754e2619J733n2728J13214L8731k6683J4793r707m868M965k1324j2666J2011
24742D852J6798l2326j0887p019L1143N358j4869n523l8265j2956N0807L3183
24730B0296n4303n8913K8951R0Q525L0887N6344k7197j5876L38J70O9401K2248
24717H0961o1911m0398j7243m6529L370M4566P9126m5308k9466N4859N4810J3865
24705I0702m7815k2163m8535L5501J626n353l7153L05K4749J4076l3053l1553
$$ y = [-39860, -111020, -112065, -59837, -8772, 21178, -5118, -63239, -56897, -43438, -45957, -36504, -31755, -72502, -84612, -58283, -4207, 28346, 44214, 25588, 28761, -16942, -35670, -50623, 5289, 41788, 69527, 45714, -3928, -44155, -12249, -1566, -20345, -14508, 35998, 23186, 8797, -52619, -50886, -103614, 9600, 48331, 21648, 36441, 26734, 21866, 26831, 5507, -7159, 4852, 21650, -10676, -21563, -28582, 2561, 7919, -6950, -12473, -50738, -63694, -12887, 20296, -34007, -92920, -63969, -63879, -55354, -24467, 31877, 4680, -11196, -10858, -10688, 58713, 80961, 19050, -21348, -38591, -85120, -81750, -37184, 41942, -3366, -32832, 22027, 76837, 90702, 42887, 20724, -27811, 7690, 9316, 3963, -33190, -32885, -8136, 5940, -27113, -58666]
24693e8666J8771j1062l3470K3680L6230J9400M962M2971q144Q976k4892j8304
24681D52m9783o8J1681k8494K1799r666M8059q685k2696m5523N071P606J3607
24668e6640J7805N4896L673m7259L8296K0955m668J5910J0751m0285k9933k4197
24656d0696L5646O7186M8459L796k9087o5347m677J6391n0723l5530N744M8998
24644A60N2384M1580o143l0693n4001m8768o2082L0038L0867J5589L8932l2603
24632b4740k7863J9523K2238m1239M7873L1742l3642J0390K224N8098P621m8607
24620B3618m9193k9012J3355N6205l023k6968Q891l0216O53j7833k023R429K0591
24607b5526J1890L5754L7319k8428k2874m3883k7416M1182K5927k549o0524j0477
$$ y = [-58666, -39895, -50957, -84427, -60747, -24517, -5117, -155, 42816, 34672, 43648, 18756, 452, -49331, -49399, -37718, -66212, -44413, -54079, -6020, -14705, -37401, -82924, -77853, -70247, -56640, -38835, 16061, 19734, -27525, 10771, 31726, 27058, 42968, 53719, 13434, -16499, -40696, -5050, 62136, 110595, 114391, 85304, 19957, 15280, 31671, -19052, -54582, -48838, 160, 52544, 94124, 87981, 57288, 3287, -45481, -107563, -77525, -46658, -31069, 7863, -24740, -52603, -33080, -10842, -52081, -4208, 27534, -6108, 4282, 6506, 64604, 72225, 23618, -25575, -54587, -41232, 14973, 11950, -15018, -6127, -36343, -35690, -53523, -55546, -46117, -25526, -13636, 22118, 59437, 31009, 8135, -35748, -63164, -21982, 3945, 1396, -59128, -69605]
24595f9605J0163K1J3064r786k5572k0882P217M2712l4500m008j6616J9812O5419
24582b2561Q5490J2417q9393k7719P3507p693j275L5017n835q903o5435J2550
24570i833l218l6215n5513j5391R3873Q6648k6862m8103J4230K7270j5882J0641
24558B1645m2877p038k3493j9525M42L454K7847K576M2014R4943q287p6594K4209
24545C9316k45l5265k3926j7272j6779P7035P7892j15l3848n96p2310p4878k1530
24532a02521N7566R0639K8121J2042k1284o0032n067J2958J8710R188k4540n9524
24520d3744l2808J0842L8277K3064M7727K0179K8756j4021n9698m4203o6793L026
24508h9396M6723K8499n162L3852M7308K2148o0915m8863l4634k2131Q917P7233
$$ y = [-69605, -59442, -59421, -46357, -56143, -81715, -102597, -95380, -52668, -87168, -91176, -107792, -87980, -22561, 62929, 75346, -14047, -41766, 31741, 24048, 22773, 57790, 51955, 43052, -22383, -9833, -13051, -49266, -104779, -120170, -26297, 60351, 33489, -14614, -384, 26886, 11004, 21645, -21232, -28270, -51763, -71288, -70846, -67392, -39545, -36969, 5045, 99988, 91701, 15107, 39316, 39071, 3806, -20120, -37392, -54171, 22864, 100756, 100641, 66793, 66197, -6113, -80991, -102521, -44955, 45684, 73805, 85847, 64563, 4531, -536, 12422, 31132, 40320, 15780, -43744, -76552, -65710, -27433, -4369, 43358, 63537, 92293, 78272, 18574, -25629, -92422, -89396, -42673, -14174, -19336, 14516, 61824, 83972, 23057, -25806, -60440, -82571, -73654, 3579]
24496C579J7326o3333j1408K6632r525J729N9502K6907q3685l9895L9728L5945
24484C502J1346M9981J1059n1506j0371L4417k4988m0507N654M7505n5511L447
24472a5972M1479K956o7647j8308k9084k0186m8199k6967J7780M5549l434j3720
24460a35753k1541K7241N265k9342l835O4140N7704R787L471P0510k4139o5174
24448d1666L6398Q0701j2005O611O886o5293o7654L648L9171j618l9005m3737
24436i7563n5910k8403O0350N8631K9806K2550m7521K3247R9707K2866n7859n4074
24424b4173k571M82N020J1448m5263l6711k3032l6829N3983M3090M898n9935J2648
24411i6945R791L9315N6470P488j3389l3812m9236m2493R699N7557j2044j7925
$$ y = [3579, 20905, -42428, -53836, -27204, -36729, -35000, 24502, 51409, -32276, -72171, -32443, 3502, 14848, 64829, 75888, 24382, 14011, 48428, 23440, -17067, -11413, 36092, -19419, -15972, 25507, 28463, -39184, -57492, -86576, -106762, -154961, -181928, -164148, -118599, -122033, -135753, -157294, -130053, -124788, -154130, -157965, -93825, -36121, -26334, -22863, 47647, 23508, -41666, -5268, 75433, 63428, 70039, 76925, 11632, -56022, -52374, -13203, -14821, -53826, -97563, -153473, -181876, -121526, -62895, -33089, -10539, -58060, -34813, 64894, 87760, 29901, -24173, -26744, -26262, -21242, -9794, -55057, -91768, -114800, -151629, -97646, -54556, -49658, -109593, -96945, -87154, -47839, 8631, 16119, 2730, -31082, -80318, -122811, -113112, -55555, -67599, -85524]
24399h5524N2842K8714j5300m987L7295l6776m6026k9051O1640J5973o050Q861
24387a8389j3418l8032q291L5330m810L616J7858K0695p1576N4543N805N806P4451
24374F3588N140m2092O9018k5943k3125q12m5487l4271L099M7644L3903L2779
24362H3441m694n2976l4986K4476L4467M8842K5140n6589j8457O649O098j0759
24350E0652k0900j7125m5393q502L8875Q8725K3986j4640o5069o8398o1616k9914
24338a29319J1284P181P696j0354O9300J01527N7287r570n6746p2674l7616M1088
24326b0916P0769K4173q4115j05398O5966n134K7334l5548N7803O6925j0791l5867
24314A5201J2282p8529l8197J5980L6096K4297P9604J2029n1303M4444L793o5016
$$ y = [-85524, -32682, -3968, -19268, -24255, 13040, -23736, -69762, -98813, -37173, -21200, -27250, -18389, -31807, -69839, -78130, -42800, -47610, -43994, -26136, -5441, -77017, -22474, -16669, -10863, 63588, 68728, 26636, 95654, 69711, 46586, 45774, 287, -33984, -30885, 16759, 50662, 83441, 78747, 25771, -9215, 15261, 49728, 98570, 123710, 67121, 48664, 55313, 61411, 50652, 29752, 12627, -32766, -41268, -2393, 86332, 110318, 95678, 30609, -37789, -99405, -129319, -118035, -110854, -103158, -113512, -44212, 57315, 114602, 105032, 48286, -24388, -62004, -20916, 49853, 74026, -10089, -115487, -49521, -54655, -27321, -62869, -5066, 61859, 51068, 15201, 27483, -51046, -89243, -73263, -37167, -12870, 66734, 78763, 27460, 71904, 75697, 10681]
24302A0681m4048M4186Mk6945j7717M8185L3823K5774k5191p2146M350j4722K8666
24289e100J4687J2099m9201l5822L3309J6614K4373k0897m9026k347K3293M9911
24277A1893l2036m179Q062m3932k193o671M6756J7778l2055O0046J890j4546m3408
24264c2595o0358J917N3888O1523L5065j6261k8390j0966J0057J1164n937l7509
24252a8402n1176o296J0333j8442K2074O6709N2643k4634J1334n2490p412k2562
24240c8321k4084J3060K7375O7429m4582q5005k3868M8570P0702Q604M2629j0406
24228E2103m2332K3449L9627l1768k55j0613j2324k516l7649p4552J4948N6201
24216b5681N4427M1076k5051m3956j2232k0384l7683Q771N3348j4872J6732K3300
$$ y = [10681, -33367, 10819, 10823, -16122, -33839, 14346, 48169, 73943, 48752, -23394, -19044, -33766, -5100, 9587, 21686, -27515, -63337, -30028, -13414, 10959, -9938, -58964, -61311, -38018, 11893, -20143, -24322, -16260, -60192, -62385, -69056, -22300, -4522, -36577, 23469, 25359, 10813, -32595, -92953, -91036, -37148, 24375, 59440, 43179, 14789, 3823, 13880, 25044, 19107, -18402, -69578, -75874, -65541, -83983, -61909, 4800, 57443, 32809, 44143, -8347, -15759, -38321, -62405, -49345, -21970, 45459, 877, -84128, -107996, -59426, 11276, 19880, 62509, 52103, 9771, 33220, 72847, 41079, 40824, 30211, 17887, 15371, -22278, -96830, -81882, -25681, 28746, 69822, 44771, 815, -11417, -31801, -69484, -60713, -7365, -22237, -5505, 17795]
24204A7795l3425k2550K1788K332K0211N926j0261M2980k2014m3186j9125M2982
24192C453q382m7666o3J4980L4540k0089J2756K7518M8444n845q078m1307J8752
24179B9013J3354k8445N077m8734K6109K5868M6629j7649Q348J1703n609j6189
24167D9475j9860m106K4756q6585l1790O405l740M6137K1521M222l6238n5868
24155h5671K4650m7356j602O8909k1877O601j387j5504R427J5934j3231J4539
24143d6568l6858K6112O334O1201P0646m8780p2099R348o121R3970J9726o2167
24131A4744K82J0365p5023l7069m1057P1495L4697M4478k3863j3720m000J6764
24119a907J7840m025l4893j7923ro2873j8556P2688O0215J8501K2053M8225L3111
$$ y = [17795, -15630, -38180, -16392, -14060, 6151, 12077, 1816, 44796, 22782, -20404, -39529, 3453, -4929, -52595, -52658, -37678, -3138, -23227, -10471, 17047, 65491, 59646, 51568, 10261, 29013, 42367, 13922, 18999, -29735, -3626, 22242, 68871, 51222, 59570, 71273, 65664, 49475, 29615, 25509, 50265, -36320, -68110, -61705, -65445, -19308, 2213, 6435, -29803, -85671, -61021, -108377, -109979, -41070, -62947, -56346, -57733, -73237, -63810, -47876, -61107, -46568, -83426, -57314, -50980, 10221, 80867, 32087, -40012, -30664, -36785, 57185, 76911, 14744, 15026, 25391, -49632, -86701, -127758, -56263, -21566, 22912, -951, -14671, -18671, -1907, 15933, 11908, -22985, -40908, -40917, -103790, -122346, -49658, 10557, 29058, 51111, 99336, 132447]
24106A32447l8692j6505L3709k516m5153J0585K761l0536m0989L3923L511l8051
24094D494J4989j5475J0487O0253J0385j3452m9995j4122M4101L7882l664K720
24082H8603j7239k4053j0477L9395o4301k2990M4160K5993j0106M6985J6382J3208
24070A25560q7007p6591o149n1875m8976J9668J02532N797N977P0491L6907j9301
24058G7033L9748l4584q0705j8725J2696j3913K7124M4661K0831k6883K4471L4822
24046A06576m423o2986p5453O986J9515J6071L3945p923m446r09J1932M9234M8457
24033A36576j1140r581j9507l5714K8866k4871o6032N0849O5458J4764m727r687
24021A15254J05160l4230l1090K19J9432q924n7449m4174N388L9084l2093l3553
$$ y = [132447, 93755, 77250, 110959, 108443, 63290, 73875, 76636, 46100, 5111, 39034, 42545, 4494, 19483, 4008, 14495, 74748, 85133, 71681, 21686, 7564, 51665, 89547, 85883, 88603, 71364, 47311, 36834, 76229, 11928, -11062, 33098, 59091, 48985, 95970, 112352, 125560, 38553, -38038, -44187, -96062, -145038, -125370, -22838, -17041, -11064, 59427, 96334, 77033, 116781, 82197, 1492, -17233, -4537, -18450, 8674, 53335, 74166, 47283, 71754, 106576, 102153, 39167, -36286, -29300, -9785, 6286, 40231, 32308, 27862, 26953, 38885, 88119, 136576, 125436, 115855, 96348, 60634, 89500, 64629, -1403, 49446, 114904, 129668, 124941, 115254, 220414, 186184, 155094, 155313, 174745, 165821, 108372, 64198, 69586, 108670, 76577, 43024]
24009D3024L071K2578l575n705m868K3223Q823p305k8309l4305j7240N9494J9440
23996G8346k3614p5039o9609L8612K1552k2040j6107p765j6400N253K3067N7224
23984f520k3739l3205N6551O7473m6348m2005j5272l6576l216J7493J4652O4315
23972A3603L0042j2366n7198o3045k5236q129N3069J04924k129l0764j1708M1740
23960C2803p8690l0743M5368M2697J1889j2393K9848L167k02p611j4284p4268
23948e2419n231O2454M3794j8601J715l3927M0156M559q4468L8771R0056l9928
23936D6931l4896n8902l5267J2916N2231L5484N4513O467Q608J9353K2096j4544
23924A14990l7768l8595o5652M557o4156l7862L0463M3255K1375q178N465j4997
$$ y = [43024, 46095, 68673, 65098, 59393, 54525, 77748, 86571, 79266, 50957, 16652, -588, 58906, 78346, 54732, -20307, -89916, -51304, -29752, -51792, -67899, -75664, -92064, -86811, -63744, -6520, -30259, -63464, -6913, 60560, 14212, -27793, -43065, -79641, -82857, -65364, -50712, 13603, 43645, 31279, -25919, -88964, -114200, -122329, -69260, 35664, 33535, 2771, -8937, 32803, -45887, -76630, -31262, 11435, 23324, 10931, 40779, 43946, 43744, 36133, 21849, -52419, -57650, 4804, 48598, 29997, 31712, -2215, 37941, 42500, -41968, -3197, 86859, 46931, 12035, -46867, -82134, -69218, -16987, 18497, 73010, 79477, 88085, 107438, 129534, 114990, 77222, 38627, -27025, -22468, -86624, -124486, -94023, -50768, -29393, -37571, -32106, -47103]
23912d7103l0761m7087k6797R9826p935k2469M3566M88M3031N094l0515L1069
23900A0407M3309l8364p024j4587l7136M4667J4357m58m8998K8323M8969k332
23888D1133j7339k0843m956n0742R64J9931L4397m1406J004l8654j9721N5324
23876d0908K1105N402q545P960J3940j7522J516j1935K3691j8223K452L2202J644
23863A2779r0193N739M985O4366O0730M178L0924K025n519M783m4186k6123j8830
23850E658l8782K8631m154R784M4790K9580l6327j1147N4788k5847n3537j1382
23838g945J414L2242J4517K1467L1401K4994m2147k9380J8508K020j3939J7900
23826G1052P379m0054J1411K2876J6503j7518q1852l8410m4653M9460O4029P3731
$$ y = [-47103, -77864, -124951, -151748, -51922, -59857, -82326, -38760, -38272, 4759, 9853, -20662, 10407, 53716, 15352, 8328, -6259, -43395, 1272, 15629, 15171, -33827, -5504, 43465, 41133, 23794, 2951, -2005, -52747, -51783, -31852, 2545, -38861, -37857, -76511, -96232, -40908, -19803, -14401, -22946, -14986, -1046, -18568, -17052, -28987, -5296, -23519, -21067, 11135, 12779, -77414, -71675, -66690, -2324, 58406, 62584, 93508, 95533, 90014, 94797, 50611, 24488, 5658, -33124, -4493, -8647, 1137, 45927, 75507, 39180, 28033, 82821, 56974, 3437, -7945, -6531, 25711, 40228, 61695, 93096, 118090, 75943, 46563, 65071, 67091, 53152, 71052, 78431, 38377, 49788, 72664, 89167, 71649, -10203, -48613, -93266, -43806, 20223, 93954]
23814I3954r946k715k3313K6976J6621j7530K371k8478o6578o0132O2052o947
23802a3665m5694J4533J0867q821K532M7674j3340K7845K0428l6193l0427O2490
23790C8229O0710L2385k7511j7287m1567j3642M4766j0880j9614k1284k2908r089
23778g692N1081j4822N270K078j608n587N075m8129k0137L2473M273N5970J5397
23765G3642q782q737j2688N5421r064k3878j2098R43r506j0989R860k4042m3579
23752b3497N1155K7022R546j7259J4769M199k1956l0464q6345J3805K3153L8607
23740B735N7804J3906L8555k5087j7984K1913k7656J7884M4826j0702l7736m2302
23728C6156L2298K562L4329k8647J6364k394N165o046M7279L2125k577l6462J7276
$$ y = [93954, 84008, 81293, 57980, 84956, 101577, 84047, 86418, 57940, -8638, -68770, -6718, -13665, -59359, -44826, -33959, -42780, -40248, 7426, -5914, 21931, 42359, 6166, -24261, 38229, 98939, 131324, 103813, 86526, 44959, 31317, 76083, 65203, 45589, 24305, 1397, -7692, 43389, 28567, 33837, 35915, 34307, 28720, 33795, -14334, -34471, -1998, 2275, 58245, 73642, 64860, 56123, 43435, 98856, 89792, 65914, 53816, 54759, 45253, 34264, 44124, 20082, -23497, 27658, 54680, 64226, 46967, 61736, 65935, 43979, 13515, -72830, -59025, -35872, 2735, 60539, 74445, 113000, 87913, 69929, 91842, 64186, 82070, 126896, 116194, 78458, 36156, 68454, 71016, 105345, 76698, 93062, 90668, 95833, 89787, 137066, 169191, 166614, 130152, 147428]
23715A47428K8914m6212l6313l6152l3052M4278O5795R013O393L1698R5312n389
23703B71713j3212L3406o1582r967L4783N2538k853k3872n692K6419K0038n804
23691C15915J1217k9405k2096N2933K7387M5246J350J2735k0424j2099l0581L4568
23679C86746O9492K4761q349L5179N6899l3811l970M4547K9685K2877L5192J14304
23667G73552Q1335P309K3568M3484L0466J17207Q1832J32558J26332J03968P6948
23656A598559P4486P7413J27883Q7475P5112K10792J63374J73586P2977P1243
23646B732900Q4854N0181Q0733K3757J2650j2851o7832j00600k7867p0003l9583
23635B666339j68753j53301j56900r7738p1643p5748m7499m9134j13695k06489
$$ y = [147428, 176342, 130130, 93817, 57665, 24613, 68891, 134686, 143699, 150092, 181790, 277102, 271713, 258501, 291907, 230325, 220358, 255141, 307679, 304826, 280954, 275262, 301681, 321719, 315915, 327132, 297727, 275631, 328564, 355951, 401197, 402547, 415282, 394858, 382759, 352178, 386746, 456238, 480999, 472650, 507829, 564728, 530917, 526947, 571494, 601179, 624056, 659248, 773552, 854887, 862196, 885764, 929248, 959714, 1076921, 1158753, 1291311, 1417643, 1521611, 1598559, 1673045, 1750458, 1878341, 1965816, 2040928, 2251720, 2415094, 2588680, 2661657, 2732900, 2817754, 2867935, 2948668, 2972425, 2985075, 2972224, 2904392, 2803792, 2775925, 2705922, 2666339, 2497586, 2344285, 2187385, 2089647, 2018004, 1942256, 1894757, 1845623, 1731928, 1525439]
23625A525439j49970o7710l0227j04739n7963j5207j2845j28611n5396n0777o493
23614H45501l3222l0146j4306n2377o5821L0373J501l1144O4772j4402j19707
23603E81022j4013L6581K1195L662K3997M4767J2749k8349l0574M741j9629M1603
23591F77752N3895K2157K5212K1610J5001J1941M1154P9518O4092R8961N8089
23580A169382N3217J1813Q1173Q1899P1199N1384J12543J52532Q0808J00955P3399
23569B040304J60838K57224J53421J13651J27484J05081J32381J00939j2508J4408
23559C193223o555m6370r4150j20038j11376j08020q1637j25378j30375j07763
23549B261561j60978j29264j07413j92674j53985o1807j20912o0599q7304p7437
$$ y = [1525439, 1375469, 1307759, 1277532, 1172793, 1114830, 1099623, 1086778, 958167, 902771, 851994, 845501, 812279, 782133, 767827, 715450, 649629, 680002, 681503, 650359, 715131, 700729, 581022, 567009, 603590, 624785, 628447, 652444, 697211, 709960, 681611, 651037, 655778, 636149, 677752, 731647, 753804, 779016, 800626, 815627, 827568, 868722, 948240, 1012332, 1111293, 1169382, 1222599, 1234412, 1315585, 1397484, 1468683, 1520067, 1632610, 1785142, 1865950, 1966905, 2040304, 2201142, 2458366, 2611787, 2725438, 2852922, 2958003, 3090384, 3191323, 3178815, 3193223, 3186668, 3140298, 3046148, 2926110, 2814734, 2706714, 2625077, 2499699, 2369324, 2261561, 2100583, 1971319, 1863906, 1671232, 1517247, 1455440, 1334528, 1273929, 1186625, 1109188]
23539A109188n4771l4636l8793p7722j02968m9555m5389J776r4n4787m2562n0992
23527E58695n3844j3355k2290r159J9691j7580q8742p2993Q788M2118L7428l5679
23515C53078k3155n2244r516j8508m650j2865k137Q352L3533L551k3938j2291
23503B39210n1723P906N158n2K1940k1865n0378K0140k1938K1288N1336j8848
23491B02174p7196L282m3771l9592N7944L2475k5237j7077J667k6946n0130J1334
23479B8927J02316P0552q7317m7510J4004N5776m4256L0318l3888j3368p3994
23468A560k2959M381M0745n04j9435o1647n0867K9937L0192N2167l0065o1545
23456h8040L3582J5364J0858N2971L7080k2390R470j9866K732l577j1356m543
$$ y = [1109188, 1054417, 1019781, 980988, 903266, 800298, 750743, 705354, 707130, 707036, 652249, 609687, 558695, 504851, 491496, 469206, 460047, 479738, 462158, 373416, 300423, 309211, 351329, 388757, 353078, 329923, 277679, 268163, 249655, 245005, 232140, 230003, 238355, 271888, 275439, 251501, 239210, 187487, 195393, 200551, 200499, 222439, 200574, 150196, 170336, 148398, 169686, 221022, 202174, 124978, 128260, 84489, 44897, 102841, 135316, 110079, 93002, 94669, 67723, 17593, 28927, 131243, 201795, 114478, 66968, 80972, 136748, 92492, 122810, 88922, 75554, 1560, -21399, -17018, 23727, 23223, 3788, -57859, -108726, -78789, -48597, 3570, -26495, -88040, -54458, -39094, -28236, 24735, 61815, 39425, 48895, 29029, 31761, 28184, 16828, 12285]
23444A2285K5889M5237J9582o3958o1747M8249o239m6006l923M1120N201k9696
23432a4006r219k3555k6132m480O9910P5852k1722n9109J6901P870J9014O6568
23420I7892L1436j4825J9244n9637p8238m5913Q971k3548j6705K7064R6376O3074
23408A05191n7329j1685l5821o3897j3044M1253K1333K8896m2503l699m0723k1491
23396i3519K6492Q3679J08588K2242o5475m6297n2354j0256L0813L0615o957n4458
23384b6887k9719L2612l3617j0999k657J9275K7840M4208L2357o229l6396m4296
23372c4508j3775K0299k6964m1235J3645K3346R306k7911M9173L1132L283m1971
23360c6180k2909j7121j0691r369N2937O4201n04m7449K7231O1224j4210k9594
$$ y = [12285, 38174, 83411, 102993, 39035, -22712, 25537, 19298, -26708, -30631, 10489, 15690, -14006, -23225, -46780, -72912, -77392, -7482, 68370, 46648, -12461, 4440, 12310, 31324, 97892, 129328, 114503, 133747, 74110, -4128, -50041, -41070, -64618, -81323, -54259, 42117, 105191, 47862, 36177, 356, -63541, -76585, -35332, -13999, 14897, -27606, -31305, -72028, -93519, -67027, 16652, 125240, 147482, 82007, 35710, -16644, -26900, 3913, 34528, 27571, -26887, -56606, -23994, -57611, -68610, -71267, -51992, -24152, 20056, 52413, 46184, 9788, -34508, -48283, -27984, -54948, -96183, -82538, -59192, -49886, -77797, -28624, 2508, 5791, -36180, -59089, -76210, -86901, -96270, -43333, 20868, 20364, -27085, 146, 61370, 47160, 17566]
23348A7566m0250m8658R95J9127k4433Q668Q9231N0378l6185n1451Q200M0466
23336C3654o4192q2379K5470O7114m918N6861M272M8873J4221o4868j2971R520
23324C0657L4859j504l0403m9746n7545K3364J435m0111j9846O327j5518N3887
23312f4144O1547P2313j0267n9960L3818J9397j9589o7278M605K6862K5949j6852
23300F401J7548M2495L5071k3258l1905k5658L251j7479Q825M4108N711q719k8038
23287B8353j7280k3249j664M2128K0580L4267O618r4603m5510l8318j1284j932
23275a01894M1330M5291N7622L7311L2875j5148P35j2791K77m8456m2209p858
23263a2915R689O6930l9769m2631L0260M8836L1246J6420k5745l6547o736n2677
$$ y = [17566, -22684, -71342, -70347, -51220, -75653, -66985, 22246, 72624, 36439, -15012, -6812, 33654, -30538, -112917, -87447, -20333, -25251, 31610, 35882, 84755, 98976, 34108, 21137, 30657, 65516, 64012, 33609, -16137, -73682, -50318, -48883, -88994, -108840, -102513, -118031, -64144, -2597, 69716, 59449, -511, 33307, 52704, 33115, -34163, -29558, -2696, 23253, 6401, 23949, 66444, 101515, 78257, 46352, 20694, 23945, 6466, 15291, 59399, 65110, 56391, 28353, 11073, -12176, -13840, 28288, 48868, 83135, 89753, -4850, -50360, -88678, -99962, -101894, -60564, -15273, 42349, 79660, 112535, 97387, 98122, 85331, 85608, 37152, -5057, -12915, -3226, 63704, 23935, -18696, 11564, 60400, 91646, 108066, 82321, 45774, 39038, -13639]
23251a3639j6149k1402M5940J26437L0045r5053r1054r788O7204p431l9653M1185
23239A6642M2456k9428n0484M124M2632p08n2404K0313j271m4303J261K1106N328
23226b4736m5623M5023O6917N1147j5283o8367P793l932l0904k5052k0181l7240
23214a00438j8790O8114J6743j0137K8493K8305p051k1829J9347K2618K0414K158
23202D7947m5650m7273N6848j9806n3491J2689P5130j8755k0505Q3994K4759o347
23190H9540M643R432m5924m8026O9532K4891p183k1376n7300r6279L307N4518
23178b0225N0809j8876k7525k0876N9462L8760J1395J1544N836q5004o2236K9838
23166b7098K0893k8457l4800j1009j7141O8493J1679n7689n2323L2981L6877M4571
$$ y = [-13639, -29788, -51190, -5250, 121187, 151232, 56179, -34875, -44663, 22541, 15110, -24543, 16642, 59098, 29670, -20814, -16690, 25942, 25234, -27170, -6857, -8128, -52431, -51170, -30064, -24736, -70359, -25336, 41581, 92728, 77445, 9078, 16871, 12939, -17965, -43017, -63198, -100438, -119228, -51114, -34371, -44508, -16015, 12290, 5239, -16590, 2757, 25375, 45789, 47947, 2297, -44976, 11872, -7934, -61425, -48736, 26394, 7639, -12866, 71128, 95887, 89540, 94183, 103615, 57691, 9665, 79197, 104088, 96905, 75529, 18229, -78050, -74743, -20225, 30584, 11708, -15817, -36693, 22769, 61529, 72924, 84468, 90304, 5300, -56936, -27098, -6205, -34662, -69462, -80471, -97612, -29119, -17440, -75129, -127452, -94471, -57594, -13023]
23154a3023L5736M8393K5004l0089n5418m6986k0451L3520j6276J469K5838P923
23142d360L5241r500p1023j2901J5438K869n2722L1449j2010n9632p3694K6623
23130a84222N0347K1379N3312O8894m3802l1827k4495N931P4504j4957o2460N134
23118h2262K8179K7806K1655n1260k2213K0231K4350j9333l3071K2202Q6443k123
23106B0604l5184j089N0603K3970J9861K674J877l631l169n8947m7620P008J4558
23093h485r155p3983o054N6867N2469J2620L946l1036l4722N684p975j485L0377
23080a0932J4596l6267L197r091l7933O874N6759k1596l1082O9302N1722j5381
23068D0168l6873n7749o760K8980K9871K306n1157m2431m3875J6499J9248J3723
$$ y = [-13023, 22713, 71106, 96110, 66021, 10603, -36383, -56834, -23314, -39590, -38121, -12283, -4360, 30881, 21381, -49642, -62543, -47105, -44236, -96958, -65509, -77519, -137151, -210845, -184222, -133875, -112496, -59184, 9710, -34092, -65919, -90414, -84483, -9979, -24936, -87396, -82262, -54083, -26277, -4622, -55882, -78095, -57864, -33514, -52847, -85918, -63716, 22727, 20604, -14580, -15669, 34934, 58904, 78765, 81439, 83316, 79685, 76516, 17569, -30051, -23043, -8485, -17640, -91623, -97677, -40810, 11659, 24279, 28225, -2811, -37533, -31849, -39824, -41309, -10932, 3664, -32603, -29406, -38497, -76430, -69556, -12797, -34393, -65475, 3827, 55549, 40168, 3295, -54454, -61214, -32234, -2363, -57, -51214, -93645, -137520, -121021, -101773, -88050]
23056h8050N698J8486J2036o802M989M1943J0503J4997j6631l8578j5316q910
23044f5635m898Q7121P5288J8988j0527j2112r515k5830J4841M0471k2399j9755
23032F6038L2058l7504j3062j0757k7722q370k2916k3718J9151K9053k9993m4004
23020g1746M021J4806J4374k9738J2459M8340p601p03o4870J6021N7375J0536
23008C274J3309j6359L1212K6816l0906n3256k1127m1190l1585j5649P0137N7271
22996h053K7164k3863Q329L0876K1357m1894o9409j2906j4581N9353k7029n9916
22984a10572K6572P2738J5775o613O005j7609p894k0222l1878J0073O2064L821
22972B260m8426k7639K3993m2676L4651J6061j5967J0064M1142L3338k6934m8685
$$ y = [-88050, -82352, -63866, -51830, -58632, -53643, -11700, -1197, 13800, -2831, -41409, -56725, -65635, -70533, 16588, 91876, 110864, 100337, 88225, 78710, 52880, 67721, 108192, 85793, 66038, 98096, 60592, 47530, 36773, 9051, 681, -22235, -45953, -26802, 2251, -27742, -71746, -67725, -52919, -38545, -68283, -55824, -7484, -15085, -15788, -80658, -64637, -7262, 3274, 16583, 224, 31436, 58252, 27346, -25910, -47037, -88227, -119812, -135461, -65324, -8053, 19111, -4752, 3577, 34453, 55810, 13916, -55493, -68399, -82980, -23627, -50656, -110572, -84000, -11262, 4513, -2100, 3905, -13704, -21598, -41820, -73698, -63625, -1561, 2260, -46166, -73805, -49812, -92488, -57837, -41776, -57743, -47679, -6537, 26801, -133, -48818]
22960d8818n0781l1781j0953L6137O4227J4830K681J6651O2874L9253p8128l5934
22948a9742J2533L8477O055k9574j5988j4801K663k962Q2912k643m0155K4292
22936D1067K0669l1093l651M6031k9254L4005Q158n652m7653Q866O0538K634m818
22923I9847n476j7465j1622L865k8490M157K5114K0684l0990j6580m506n1070
22911a2532p8419n5813L0213J3739j4291K5371J7275K4014m211J2006K1629k9515
22899e0534k9444L8412J7151j6414j7837O5558M6222k1070n7403j9616Q393L2878
22887c704O6669j986n2222r234R260j0346j0438K9270k228k2070o2793l9882M3836
22874f5868J197J042L9354J8734L5085N135M3448R296K2152k883m2723K8817k7380
$$ y = [-48818, -99599, -131380, -142333, -106196, -41969, -27139, -24458, -7807, 55067, 94320, 16192, -19742, -7209, 31268, 37323, 7749, -8239, -23040, -20377, -23339, 59573, 56930, 16775, 41067, 61736, 30643, 26992, 73023, 43769, 77774, 85932, 80280, 32627, 41493, 102031, 104665, 99847, 94371, 76906, 65284, 69149, 40659, 44816, 69930, 90614, 59624, 43044, 38538, -12532, -90951, -146764, -116551, -102812, -117103, -91732, -74457, -50443, -54654, -42648, -21019, -50534, -79978, -41566, -24415, -40829, -58666, 6892, 53114, 32044, -25359, -44975, -36582, -3704, 62965, 60979, 8757, -477, 8783, -1563, -12001, 17269, 15041, -7029, -69822, -109704, -65868, -64671, -63629, -24275, -5541, 29544, 34679, 78127, 87423, 109575, 106692, 63969, 92786, 65406]
22861F5406k0356l9950K7319L7610L7252n8721k476k6882k3531J048j5267L8652
22849B0104j244K5058j691p9054j7455J5218J1590J5032M5985l2209j488j7534
22837a7688n3104j115k916q563J9377R7890j2903j3871N8240k8028m7473m7448
22825e7602n461k3301P054k255J6455M1883N67k0118K3147K0006m0344k6579K199
22812f4349J929J4817M5914j8140j0319K0503K0562K1467m6791l687J1822M0232
22800C3960Q2541P2214k9411o0346l9842P7081K3233k3154l5292p5864l5922K962
22788g840Q363m1943M190l6616L8167M5483K6206m3471K1939O083l1049q5k898
22775a3471O384M939k434J6001J7857L0050J1054K4934n3972o9856O018N7754
$$ y = [65406, 45050, 5100, 32419, 70029, 107281, 48560, 46084, 19202, -4329, -3281, -18548, 20104, 18860, 43918, 42227, -36827, -54282, -39064, -27474, -12442, 33543, 1334, -154, -17688, -70792, -71907, -74823, -83386, -64009, 33881, 20978, 7107, 65347, 37319, -10154, -57602, -63063, -86364, -79310, -81565, -65110, -23227, -22660, -42778, -19631, 375, -39969, -66548, -64349, -62420, -47603, -1689, -19829, -30148, -9645, 10917, 32384, -14407, -18094, -6272, 33960, 116501, 188715, 159304, 98958, 59116, 136197, 159430, 136276, 100984, 25120, -10802, -7840, 523, -41420, -37230, -73846, -35679, 9804, 36010, -7461, 14478, 20561, -10488, -10573, -13471, -7087, -2148, -4582, 11419, 29276, 59326, 70380, 95314, 41342, -28514, -22496, 35258]
22763C5258n519n9851r42M1052K076j5486K2462J0428J5512j9415j5922r227j1420
22750a0994n0658L0824q631M5505M1137M88j9717o9879M327J2899m1803J5836
22738e0666J5644R137J3013M1485M5604L420k4704o1580J2424n46m270n0235m2539
22725i3813j2131K496K3991O8406Q8020m4055l5706M7595M433l8153J1410L5581
22713E8074j0743m7646J9659M2493k9789q6506M999L5490L3233j0742j7838n0597
22701e9913n2650l1895O5025J00667K5092m1967k0642j4896m0077n5796J2144
22690a14908O5805M1798q613o6287l6753L7184P6413o09L5196m8515l4834K43
22678e3880O4517M6928l3310k0684L6151J6964j0641l5524L499r187L736k4551
$$ y = [35258, 29739, -30112, -31054, 9998, 12074, -3412, 19050, 29478, 44990, 25575, 9653, 426, -10994, -61652, -30828, -39459, 6046, 47183, 47671, 27954, -41925, -37598, -24699, -66502, -50666, -35022, -25885, -12872, 28613, 74217, 77637, 52933, -8647, 3777, 3231, -1039, -51274, -93813, -105944, -103448, -79457, -11051, 76969, 32914, -2792, 44803, 49236, 11083, 22493, 58074, 47331, -315, 19344, 61837, 32048, -54458, -49459, -13969, 19264, 8522, -9316, -59913, -112563, -144458, -79433, 21234, 46326, 4359, -16283, -31179, -71256, -127052, -114908, -49103, -7305, -15918, -82205, -118958, -81774, -5361, -5970, 29226, -19289, -54123, -53880, 10637, 57565, 24255, 3571, 39722, 56686, 46045, 10521, 14020, 4833, 8569, -15982]
22666a5982K0866M8330L8033K8293l1325m629J7324l0989m7247o1286k5512P790
22654e6334L2316L3773K1404l9723j2732m116K5573L4549O3046j8730m8736k1870
22642H420m7278n730l8017K1865O3824k9588K6109L410k4971r169J6117j7796
22630c2804m451L7879j5886L7921k7826J2920m7735L9446L1054l2813j9175K4409
22618B939k9472p9153J9969N7837Q871R657p0100k8683N6544M5265j0959Q88K7909
22605A1512J00964J7290L6o7266p4115n1761o977K8680M5018K629k7096j2696
22593c3782r391j3008M3974R110m9170J5721J0145l604N3809L7232m09k3955l873
22580C2799m985K2743n4135l2288L2420O6401n8520j6554j2744N2969M3541p8593
$$ y = [-15982, 4884, 53214, 91247, 119540, 88215, 83586, 100910, 69921, 22674, -38612, -64124, -56334, -24018, 9755, 31159, -8564, -21296, -25412, 161, 34710, 97756, 79026, 30290, 8420, -38858, -44588, -82605, -60740, 3084, -26504, -395, 3015, -21956, -31125, -15008, -32804, -37255, 624, -15262, 22659, -5167, 7753, -39982, -536, 30518, -2295, -21470, 2939, -26533, -105686, -85717, -27880, -19009, -9352, -79452, -108135, -51591, -6326, -17285, -16397, 11512, 112476, 129766, 129802, 62536, -11579, -63340, -70317, -41637, 3381, 6010, -21086, -33782, -43173, -56181, -12207, -3097, -52267, -36546, -26401, -30005, 23804, 61036, 60627, 36672, 32799, 27814, 50557, -3578, -35866, -3446, 62955, 4435, -12119, -24863, 28106, 71647, -6946]
22568f946m4754K6193j4973n962k6741m1331J5909O217l653N0993o636J9764K7360
22555d560k1464K6392k3068m5039n5022P230L2496R742j298R067M2528J1840K4543
22542A3387K088O41l7974k0304M2728Q1551R72p1738j9761m0901M5129M1413j8181
22529A9050l9594L1577J6274l4520j5553J0203J1753j7117N0791j9796k5138n4125
22517f6195l1175J5010J9791O6425Q2986M3475Q380j3048J209o2625L981j5682
22505E2532n0526n6335O047j029k9523k4J8985R815J9159M1171m284K2849j6198
22492A2639J5657J7714r399L1941R586n2335l432J7070n4079J505L9134j3919
22480A2082J0071M7177o7056k4054R569P5646l6169k0906k3755K5758J2761o738
$$ y = [-6946, -51700, -25507, -40480, -46442, -73183, -114514, -98605, -92388, -96041, -45048, -51684, -31920, -4560, -26024, 368, -22700, -67739, -122761, -115531, -83035, -73293, -74591, -65524, -22996, -11156, 13387, 15475, 16116, -21858, -42162, 566, 82117, 83089, 11351, -8410, -49311, -4182, 37231, 19050, -20544, 11033, 27307, -7213, -22766, -12563, -810, -17927, 32864, 13068, -12070, -66195, -97370, -82360, -62569, 3856, 86842, 130317, 138697, 125649, 126858, 64233, 68214, 52532, 2006, -54329, -48282, -49311, -78834, -78858, -59873, -50058, -30899, 10272, 5988, 28837, 12639, 28296, 46010, 36611, 68552, 78138, 25803, 22371, 39441, -14638, -13133, 26001, 12082, 22153, 69330, 2274, -21780, -12211, 63435, 27266, 6360, -17395, 8363, 21124, 14386]
22468A4386k2237M1809k0632k4644k4380n894J706k506N6879J0008J45J0097O0707
22455I5444N1120j9672j3746k6284o8787p8465k0179L696n1746k9600K857L2132
22443a23230N8139K3196M9454K8701N2914L5869k449L2515j7622p274n2477l0128
22431D7608L4198R229k1961K3548J6375k1027k0264o3051n9960K0539O2849P9111
22419A07194n1563p8215K8728m2290k0069J2053K7511k6822j0095J5357J6213
22408b1998M9367N219m9018L5624j3963k8027L8670M0143K0312m979l1796L2409
22396G1963k9393O2203P4749j9139j4631n3018l1488J4720l1384j120k1517J84
22384B2129J0910q25j6776l4941K1986J886k8545o676N768M7789K1575m8175j17
$$ y = [14386, -7851, 33958, 13326, -11318, -35698, -41592, -39886, -42392, 14487, 24495, 24640, 34737, 95444, 146564, 126892, 113146, 86862, 18075, -60390, -80569, -76873, -128619, -158219, -155362, -123230, -65091, -41895, 7559, 36260, 89174, 125043, 122594, 155109, 137487, 130213, 77736, 47608, 81806, 91035, 69074, 92622, 108997, 87970, 67706, 4655, -55305, -34766, 28083, 107194, 55631, -22584, 6144, -36146, -56215, -44162, -16651, -43473, -53568, -38211, -21998, 27369, 32588, -16430, 19194, 5231, -22796, 15874, 56017, 76329, 71350, 39554, 71963, 42570, 104773, 179522, 160383, 145752, 92734, 61246, 75966, 44582, 43462, 21945, 22129, 33039, 32214, 15438, -19503, 2483, 4369, -24176, -30852, -25084, 22705, 44280, -3895, -4012]
22371d012j4444j3579O3372P2518m9901m1376m6641J7553O6451J9420K7137k5029
22359G1469n8614L3936o580j3735J0280K182n6226L686j248Q548L7065L2859L8354
22346A01976m7714n4964k4808j2178l9068J6087L1798K5636K965l6803L3811M3372
22334D0110P2244M0773k0481l5604p0828k0166K8392O8775M5591k027l5788m9844
22322F1147n4145J3655j4425L534M5656O503k3608L452n7426J4719N902m9400
22310d4436p1815l4543O1685M7307O6696p956m6778o67L469K5635M9008J0851
22298E8456k520K5863j3712l7996j1949j5586p6701Q478J5377K3625J4896K0145
22286H376O8108L0364n58p1162k0969O8094M6927o5823l5070m1646L1621J5720
$$ y = [-4012, -18456, -32035, 31337, 103855, 53954, 12578, -34063, -16510, 49941, 69361, 96498, 71469, 12855, 46791, 40211, 26476, 36756, 38938, -17288, -13602, -14850, -6302, 30763, 63622, 101976, 54262, -702, -25510, -37688, -76756, -60669, -28871, -3235, -270, -37073, -3262, 40110, 112354, 153127, 132646, 97042, 26214, 6048, 34440, 103215, 148806, 146779, 110991, 61147, 7002, 20657, 6232, 9766, 55422, 61925, 38317, 41769, -15657, -938, 4964, -44436, -116251, -150794, -89109, -41802, 24894, 16938, -29840, -30507, -27038, -1403, 47605, 58456, 55936, 81799, 68087, 30091, 18142, 2556, -74145, -65667, -50290, -26665, -11769, 8376, 76484, 106848, 106290, 35128, 14159, 82253, 129180, 63357, 28287, -13359, 18262, 33982]
22274C3982N706l8176Q2476N269k2073k2672l397J0509P248J0370k9967K8005
22262F7280P219k4971m5237j3466j7137l8629p7157m9072J29302O7256j1760m1120
22250d7492Q625o4j5458K3146L5054K3708j7722J8391L72j6162j07794j5772O6233
22237d4935Q3870L4429p5149n9120R69M7276J858K4987R2552K0962n9595O596
22225G4700M7866n0216j2269o292k3638K4428l1702n1426l8282j2437r650J4915
22213g4003L2731K5229m4988Q372K6862K0760K3232M6015J0849P036j9848N7972
22201A20219M2513l3565l8980l9263l5837l0180J5587O2778k920m0323m6943K0282
22189f632k166j7061L778k8551l1101K4715P0545k715l4786k7840K8586O7541
$$ y = [33982, 39688, 1512, 83988, 89257, 67184, 44512, 41115, 51624, 58872, 69242, 39275, 67280, 74499, 49528, 4291, -9175, -26312, -64941, -142098, -191170, -61868, 5388, -6372, -47492, -38867, -38931, -54389, -31243, 3811, 27519, 9797, 28188, 28560, 12398, -95396, -111168, -44935, 38935, 73364, -1785, -60905, -59936, -12660, -10802, 14185, 106737, 127699, 68104, 74700, 122566, 72350, 60081, 53789, 30151, 54579, 22877, -28549, -66831, -79268, -88918, -74003, -41272, -16043, -61031, -52659, -25797, -5037, 18195, 64210, 75059, 82095, 62247, 120219, 162732, 129167, 90187, 50924, 15087, -15093, 494, 63272, 60352, 20029, -26914, -6632, -8798, -25859, -22081, -50632, -81733, -57018, 13527, 10812, -23974, -51814, -23228, 44313]
22177D4313M4965k1959m4168N557J3361m7706p6927l5925m415O5390O887l4862
22165h5489K71O8907P900L2076k6775l5346j558j8002O5141O7824L052l4766k9035
22152A4200k1263M6450O1507n5860L680J8160l9797L2650o466J2598J0198m5400
22140C0657o1955K9468M2558N915k0096l3316N731Q029M3036P2110j3217m0206
22128F8714m8358m6002K7297L7995N9800l0846j30175m6713j0490P1345P2443
22117B5010j1716L7728k6465n9270P7039O9830q9459o4749M2428J0189j7105K334
22105d206r153m8318q67P8131L1811k7307l6157l8544n486K9067L6850k0562o148
22092b0889M3845N8879K6406p0672k0695o6204q884j7839m3998O843L7112L8316
$$ y = [44313, 89278, 67319, 23151, 28708, 42069, -5637, -82564, -118489, -122904, -57514, -50627, -85489, -85218, -16311, -8411, 23665, -3110, -38456, -40014, -58016, 7125, 74949, 78001, 43235, 14200, -7063, 39387, 100894, 45034, 48714, 66874, 27077, 59727, 53261, 65859, 76057, 30657, -31298, -1830, 40728, 46643, 26547, -6769, -1038, 6991, 50027, 122137, 108920, 68714, 20356, -25646, 1651, 39646, 99446, 68600, -61575, -108288, -118778, -47433, 25010, 13294, 51022, 24557, -34713, 42326, 112156, 22697, -42052, 376, 10565, -6540, -4206, -13359, -61677, -62544, 15587, 47398, 20091, -16066, -54610, -60096, -31029, 5821, -14741, -20889, 22956, 81835, 108241, 37569, 16874, -49330, -58214, -76053, -120051, -113208, -76096, -37780]
22080c7780q949K8730L094M8494r992p1126n522K9928J1383j2714L06k9255M2263
22067a1140N5632j566n3287j5620n553J9389K8150p076J1092j940m5025J4096
22055a2848N2096J6779O6231K0699k9309n3364o7995M2985N6236Q992m857m5846
22043D9799K9796P578L2252K2683p587o6581p7376n8925K365O8854M3942K1855
22031F8655R174J9477k9791m5719K5813K5853k6538p9290n1345k2933k0714K5636
22019a01722J1430K9862J7946N7460P539R412J4470r945j654o9306j6914q218
22007e9640j4713K8740L1818k0997J6631K2051K1361k0087j4078P0536j477j2937
21995D7208o239p4407l0416j6994j9055L3563J9184N6677K6863j9125M4240J5908
$$ y = [-37780, -46729, -17999, -14905, 33589, 23597, -47529, -53051, -23123, -11740, -24454, -24148, -53403, -11140, 44492, 42926, -10361, -25981, -31534, -12145, 16005, 8929, 20021, 18081, -26944, -12848, 39248, 56027, 122258, 142957, 113648, 60284, -7711, 35274, 91510, 100502, 95645, 49799, 79595, 87173, 119425, 142108, 134521, 67940, -9436, -68361, -65996, 2858, 46800, 68655, 77829, 97306, 67515, 21796, 47609, 73462, 46924, -32366, -83711, -106644, -127358, -101722, -90292, -60430, -42484, 14976, 22515, 31927, 46397, 36452, 34798, -34508, -51422, -59640, -74353, -45613, -13795, -34792, -18161, 3890, 25251, 5164, -8914, 61622, 60145, 47208, 40969, -33438, -63854, -80848, -99903, -66340, -47156, 9521, 36384, 17259, 61499, 77407]
21983G7407l9689m1761K0367P6255K7768k1631q907q2607o2022J0081L5890j2641
21971b1490q342n2651R33J3563j6936o261J18503k3374m2993K3554j2185M7244
21959A9565l1679j8598K4536N9441K5501j746k0790j2427l3262j6719k8739J02086
21947F7169M1829r6203l745N3268R960j8001k1819M5964K218m4706k6933J3657
21935B2658N0709O396M341J5581m2260k1466n0203O1671j2116r0040k9957Q0314
21923d372J548n201M5946o032l6568l9563J9122l0673j9556L4500j3016K3324
21911c0541O2362j8013J3621p091J6420J6916J7692l2451m0107L969m5096K5474
21899a6845j293J8100M3032M2417j4222j2714l7289K4516K6799m5220o9401L941
$$ y = [77407, 37718, -4043, 16324, 92579, 120347, 98716, 89809, 7202, -54820, -44739, -8849, -21490, -29832, -82483, -81550, -67987, -84923, -91184, 27319, 3945, -39048, -15494, -27679, 19565, -12114, -30712, -6176, 53265, 78766, 77020, 56230, 43803, 10541, -6178, -34917, 67169, 108998, 12795, 9050, 62318, 72278, 54277, 32458, 78422, 80640, 35934, 9001, 22658, 73367, 79763, 84104, 99685, 57425, 35959, -14244, 47427, 35311, -54729, -84686, -4372, -2824, -8025, 37921, 31889, -4679, -44242, -25120, -55793, -75349, -40849, -53865, -30541, 31821, 13808, 27429, 20338, 36758, 53674, 71366, 38915, -1192, 2777, -42319, -16845, -18138, -38, 42994, 85411, 71189, 58475, 21186, 45702, 72501, 27281, -42120, -38179]
21887c8179N4590J6574m9154P052K3659j2657l0309O3793J741q105J5283J4199
21875E8487K8403J6711m3878o9559k4531L423M4587L9585m7221o6274M3417N1760
21863C4910Q808J4253k0139r5218P336k723j7144N7631J9644J4206M2843m1179
21851B3228n3620K6208J2939J9490n1007L627O9534p026m7468L2829J7954m1528
21839E160j3581l8195k8269k3945K1681O5048M1987k3041L3654k6829k5511J3734
21827A893L9223L2025k4905l6567J5242k5318O999M4902K7558M046L4706N558
21815A25362l219l6055l7119k7602N036l3819J8426P0134O5345n66p8724l4246
21803C2953o790l464l3419j557m6400K8890O5111J6098J4000o969K4573K3551
$$ y = [-38179, 16411, 32985, -16169, -9117, 14542, 1885, -28424, 35369, 37110, 29005, 44288, 58487, 86890, 103601, 59723, -9836, -34367, -30944, 13643, 53228, 6007, -60267, -16850, 34910, 43718, 57971, 37832, -57386, -50050, -52773, -69917, -12286, 7358, 21564, 64407, 23228, -30392, -4184, 8755, 28245, -22762, -19135, 50399, 43373, -4095, 28734, 46688, 5160, -8421, -46616, -74885, -98830, -77149, -12101, 29886, 6845, 40499, 13670, -11841, 1893, 41116, 73141, 48236, 11669, 26911, 1593, 8592, 53494, 81052, 85098, 119804, 125362, 122143, 86088, 48969, 21367, 26403, -7416, 11010, 81144, 146489, 145923, 67199, 32953, 26163, 22699, -10720, -12277, -58677, -29787, 35324, 51422, 65422, 58453, 83026, 106577]
21791A06577q8913p5130n996k6741K8008M6404J4485J9128q637L5382j2965k3108
21779H494j9803L4464k2356J609O588l7572j4686J6747J5741l480J1123K1683
21767A8552O1816j6430j2261k3398l3231l7842J1852J3433m5618j2801L9854j72
21755c6246p119K5942Q642l7234n5366N5129j1871j3506M0146N0626K3330n280
21743C7193j9067r909J4734p6304r214M1905N3847J530q090n1061J1886J9455
21731F905k2771P414O1174j861l2305M3279K9323k3189k3840r836k7200N776K2935
21718C5804j9138J0957K3117M0489O1540L0914m3825j02589o8716o580M3570Q8494
21706I4037J3019K3226N879o3854J6454P688j9988k9482n0303M269J3497p719
$$ y = [106577, 17664, -57466, -63462, -90203, -62195, -15791, -1306, 17822, 9185, 44567, 31602, 8494, -11309, 23155, 799, 2408, 8996, -28576, -43262, -26515, -10774, -14254, -3131, 18552, 80368, 63938, 51677, 28279, -4952, -42794, -30942, -17509, -63127, -75928, -36074, -36246, -43365, -17423, -8781, -46015, -101381, -46252, -58123, -71629, -31483, 19143, 42473, 37193, 18126, 8217, 22951, -53353, -62567, -20662, 33185, 34715, 26625, -24436, -12550, 6905, -15866, -8452, 52722, 50861, 18556, 61835, 91158, 67969, 44129, 34293, 7093, 12869, 35804, 16666, 27623, 50740, 91229, 152769, 183683, 139858, 37269, -31447, -38027, 5543, 94037, 107056, 130282, 136161, 72307, 88761, 96449, 76461, 46979, -3324, 945, 14442, 6723]
21694F723j9313K9718J3403k0754l9448J0529J08735J11010L1914o4673o3949
21683A03895K4977J193l8218k5960J3664l9197l5838J0773L7408K7287k3917M741
21671F0808J2344Q148L202J4785o1786n3739K7095M1304Q574l163m7407j5109
21659d944j2326j7222N426P4338O0807j7202K0036K8901l2661j06332K475m0827
21647c9531k0144M6747M6792L5070L9659n7505m4822k0928J4838n945O128j830
21635a471J4171J7816r428M555K1377J7274K2339O561L6383L435l358N9569n482
21622A83741n3563j10377k3241J6084k038O3798K9743L2818k9246n5856j1687
21611D0176p234M8094M3973m7487o1575j5682M4362J3082L8565j7551n5807L1099
$$ y = [6723, -12590, 17128, 30531, 9777, -29671, -19142, 89593, 200603, 232517, 167844, 103895, 128872, 130065, 91847, 65887, 79551, 40354, 4516, 15289, 52697, 79984, 56067, 60808, 73152, 81300, 84502, 99287, 37501, -16238, 10857, 52161, 60735, 57572, 10165, -4944, -17270, -34492, -29066, 45272, 106079, 88877, 108913, 137814, 105153, -1179, 1296, -39531, -59675, -12928, 33864, 68934, 108593, 51088, 6266, -14662, 176, -5769, 359, -1471, 12700, 30516, 21088, 25643, 47020, 64294, 86633, 93194, 129577, 133012, 129654, 189223, 183741, 130178, 19801, -3440, 12644, 10606, 74404, 104147, 136965, 107719, 51863, 40176, 32942, 81036, 125009, 77522, 15947, 265, 44627, 57709, 96274, 78723, 22916, 54015]
21599E4015O0971l1295j06360l1942l7677M3782P6983k252k5790N6519J7409L687
21587G8050J5050p0183m6448k5075L4881N6L5171m0788j003N6871J1102j0659
21575C7025l3498o816j1239j609L0226K3935Q86m9357k4292P7564M6331O679n8441
21562C7394m704K0240N666j9850K7734M1823m2879k7283L9517O82j789L5912k0415
21549I2048q311K8882M3601j9702m5230j8722l0949J3867K3701l6084l3195l1449
21537b1543k48k2349K936J9766M5094K9549O4584k5846k6353P794J5467L185l3914
21524E8122j4443K510l8886k2745P3796l2915J3521n9770K2019o740K141L3040
21512B9650K4773p028m5509o4131M7320N6766r153J8799L3257j653m3844j4665
$$ y = [54015, 114986, 83691, -22669, -54611, -92288, -48506, 28477, 26225, 435, 56954, 74363, 78050, 93100, 22917, -23531, -48606, -13725, -13669, 21502, -19286, -20289, 36582, 47684, 37025, 3527, -3289, -14528, -16137, 14089, 38024, 38910, -10447, -34739, 42825, 89156, 95835, 37394, 32690, 52930, 58596, 38746, 66480, 108303, 65424, 38141, 77658, 78340, 76551, 112463, 92048, 83737, 112619, 156220, 136518, 91288, 72566, 41617, 55484, 79185, 43101, 9906, -21543, -21791, -44140, -41204, -21438, 23656, 53205, 117789, 91943, 65590, 73384, 88851, 92036, 58122, 43679, 46189, 7303, -15442, 58354, 25439, 38960, -20810, 1209, -5531, -3390, 29650, 54423, 47395, 1886, -62245, -14925, 41841, 32688, 51487, 84744, 83091, 39247, 24582]
21500B4582K0521k5650o9323K2794J5422J4327L7783k1898m1580K4395j1051Q9900
21488H0222J4435p7395L1957m5339n428J2807L3892m7866l9518p477N0550N9079
21476E9919m7184j9834k9769j8212J4036L8550K0843K1400J6568L7035l4733l8652
21464A9967r389J6161p898J3054j2059J3015L7323j8332q550j6753K0529n444
21452D1624M749l8652r541J7993n549j1797K9629M6043M8523N716k9878L9773
21440A38633n7334q0834J608K634K1875L2340j0462m1821r82l9384R436Q3217
21428E8926P7127j9406K4822l4163q1032j0104l547l93J6238J1660P0135J8898
21416A29161m5642n3153j7895j0886O6008l793p0996J1315K6445J1907K8579K9095
$$ y = [24582, 45103, 19453, -49870, -27076, -11654, 2673, 40456, 18558, -23022, 1373, -9678, 80222, 94657, 17262, 49219, 3880, -1548, 11259, 45151, -2715, -42233, -49710, 840, 59919, 12735, -7099, -36868, -55080, -41044, -2494, 18349, 39749, 56317, 93352, 58619, 19967, 10578, 26739, 18841, 31895, 19836, 32851, 70174, 51842, 43292, 26539, 47068, 41624, 46373, 7721, -1820, 16173, 10624, -1173, 28456, 74499, 123022, 128738, 98860, 138633, 81299, 465, 2073, 4707, 26582, 58922, 48460, 6639, 5657, -33727, -24291, 58926, 136053, 116647, 141469, 107306, 26274, 16170, 12623, 12230, 28468, 40128, 110263, 129161, 83519, 30366, 12471, 1585, 67593, 63800, -7196, 4119, 30564, 42471, 71050, 100145]
21404A00145q264p0175J8918N1550j6533J9362L9051Q6839M7318l0326o0130j20413
21392E7342j11648l4053l7703O136J1315O1850O7237K5132L9811j3565J5325o2885
21380B4294M4202N3830J5264j9671k6446m8063k5906J0902J0643n4237M1729N535
21368C2076M4239J6701k0838n4544K1728K5986j5748n765j4069j7006M1689k4150
21356C0299l4948j8610J0813N3917q102p9642O487N5498O3279N980l1419J1833
21344F5385j4828k7908p949K2896L665K6184l8484p605O0168L9669m744p6995
21332C9454j4176M0969L0157K3987l0456n2847n8348K1264Q1545J341n329k2346
21320E5215L0585j6806L202l2556P834l4761k7746J7144Q550n73K9865K1005m936
$$ y = [100145, 91881, 21706, 40624, 92174, 75641, 95003, 134054, 220893, 268211, 237885, 177755, 57342, -54306, -88359, -126062, -119926, -108611, -46761, 20476, 45608, 85419, 71854, 87179, 24294, 68496, 122326, 137590, 117919, 91473, 43410, 17504, 28406, 39049, -15188, 26541, 32076, 76315, 93016, 72178, 17634, 39362, 65348, 49600, 43835, 29766, 12760, 54449, 30299, -4649, -23259, -12446, 41471, 33369, -46273, -39786, 15712, 78991, 84971, 53552, 65385, 50557, 22649, 14700, 37596, 41261, 67445, 28961, 21356, 81524, 121193, 116449, 39454, 25278, 66247, 96404, 120391, 89935, 37088, -21260, 4, 81549, 82890, 77561, 55215, 85800, 68994, 72196, 39640, 47474, 12713, -15033, 2111, 10661, 10088, 39953, 60958, 56022]
21307E6022m89l1310k4073O0106O2495M4228M1963l8879l7622l1760n4138R392
21295E5935N8048M7833M0122l3744l5045N743L5470q2426k7126J9177j2133J9922
21283I1776Q2510L6688j3699q0274n9456K7919K5170K0993k7089N1776p89j8840
21271A36685k4290n5920K1863R5302k308K4743n7571n8824O9621Q4930j7602m8768
21259A67861k0114J9917r2747K9758j7925J4655N859o4967J0125k1443j340K0175
21247D9814m1680j0194K6091L1892J12329K4234p5141j0825J5822L680O0296J8498
21235B04816o4520o2007l3739L8037J2195Q041q394L6524n507j4333k3058k6141
21223F1914K5650r0510k0459L3631N4127M753l403q798J8307M9603q030k4128
$$ y = [56022, 55533, 24223, 150, 60256, 122751, 166979, 208942, 170063, 132441, 100681, 46543, 55935, 113983, 161816, 201938, 168194, 133149, 138892, 174362, 91936, 64810, 83987, 71854, 91776, 174286, 210974, 197275, 117001, 57545, 85464, 110634, 131627, 104538, 156314, 155525, 136685, 112395, 56475, 78338, 173640, 171332, 196075, 138504, 79680, 149301, 234231, 216629, 167861, 147747, 167664, 74917, 104675, 86750, 101405, 107264, 42297, 52422, 30979, 29639, 49814, 8134, -2060, 24031, 55923, 168252, 192486, 117345, 106520, 122342, 126022, 186318, 204816, 140296, 78289, 44550, 82587, 94782, 102823, 94429, 130953, 125446, 111113, 88055, 61914, 87564, -2946, -23405, 10226, 64353, 69106, 65703, 56905, 75212, 124815, 116785, 92657]
21211I2657L828j3419k0613L6917L7919k6244L0824j244l6043l4437L0227J4454
21199A14826M1427m3344r380Q777q322K9094K971L5001Q1454m1939p0498n275
21187A34792K9792m54l8775o1427p821N083m1516m3767l027J9806L9782l3529
21175a061l16N4159J1452k0759k7473j9912L2103K0102L2941K9430K5634J8522
21163A54822k6072m4248J579L9157l5558n4893K8544Q107J9063k5673j3956q986
21151D1886k4634l3841J8229K2226r561J3457M8181P5771l6799o9189l536K2515
21139F4705j0299M2443L042k6455l7860K8412K3346l7375k2977J4665k1643J16309
21127A36313L2816k8687l3545k6108k9296j7075K3835O136p46R683N2172N9899
$$ y = [92657, 96485, 83066, 62453, 99370, 137289, 111045, 141869, 140625, 104582, 70145, 100372, 114826, 156253, 112909, 103529, 112306, 103984, 133078, 136049, 171050, 252504, 210565, 140067, 134792, 164584, 164130, 125355, 63928, 56107, 61190, 19674, -24093, -27120, -7314, 32468, -1061, -1377, 52782, 64234, 43475, 16002, -3910, 28193, 48295, 81236, 110666, 136300, 154822, 128750, 84502, 86081, 125238, 89680, 34787, 63331, 71438, 90501, 64828, 50872, 41886, 17252, -16589, 1640, 23866, 14305, 27762, 75943, 151714, 114915, 45726, 42190, 64705, 54406, 96849, 99891, 73436, 35576, 63988, 87334, 49959, 26982, 41647, 20004, 136313, 169129, 140442, 106897, 80789, 51493, 34418, 58253, 64389, 63643, 73326, 125498, 185397]
21115A85397j866m8877o4275k7113M0508J3569n4156O0809O4554L5198J8872k1336
21103B01284m3689o3836n354r209p946K9804k542J6464l140K91q4504p2314j4790
21090e9481Q9013Q3370l3805m250l174L4942N9146k030J8810J5287J2968m7680
21078A63116k4988l4027N572R978L163J2661J6599M992M09M31L8709O609m6492
21065A56732L4161J1799o8698m8028m8386J3203J537N3225L6797J350l6464K3447
21053A30675j7954L261k4125l190Q1997n991l8712n7262k598k2268l1950k8004
21041a6121P0753J5169N8357O590k1264K5496L6260K9554q7731k1753L7933n492
21029A27751l2734m0931p887R454L5432K6075j3493k5070J1819k4889k615M4945
$$ y = [185397, 183531, 134654, 70379, 43266, 83774, 97343, 43187, 103996, 168550, 203748, 222620, 201284, 157595, 93759, 88405, 79196, 71250, 101054, 98512, 114976, 111836, 112127, 27623, -44691, -59481, 29532, 112902, 79097, 74847, 71673, 106615, 165761, 163731, 182541, 197828, 210796, 163116, 138128, 104101, 109673, 119651, 122814, 135475, 152074, 157066, 157475, 157906, 196615, 203224, 156732, 190893, 202692, 133994, 85966, 37580, 50783, 52320, 105545, 142342, 143692, 107228, 130675, 112721, 115982, 91857, 88667, 170664, 164673, 125961, 68699, 66101, 43833, 11883, -16121, 54632, 69801, 128158, 134748, 113484, 138980, 175240, 204794, 117063, 95310, 133243, 127751, 95017, 54086, 46199, 55653, 91085, 117160, 103667, 78597, 90416, 65527, 62912, 107857]
21017A07857J5437o5346L8468K3776Q343r747R6265o929n0626o0045J2142J3354
21005A22949L3150M8482P3155Q371n3311j6478k1000L7662J1273M085k3801j7778
20993B06759k3127J466j5822j2940o756l494O4464J4009L5738L6353l7639p050
20981B51961Q3458K3596p4738n3852j8190l5448K3915L8105j7395M6538K6226
20970B94176j4682p9846n2633j6159k4683M6187k3630j2150l450j4800L9642m642
20958A33330J4577M207M92n02l2688k5914k2109q4573M7190j7017k3512N5095
20946D8576Q7149N3041M7074k8438l2015n6596J8270J2136O938L6799L6086k6184
20934B02836o7038j0905L8717j2535l0225K4531l6277M9906L5448m84M457L3602
$$ y = [107857, 123294, 57948, 96416, 120192, 128535, 118788, 215053, 208124, 157498, 97453, 109595, 122949, 156099, 204581, 277736, 286107, 232796, 216318, 195318, 232980, 244253, 248338, 224537, 206759, 183632, 185098, 169276, 156336, 149580, 146086, 210550, 224559, 260297, 296650, 259011, 251961, 335419, 359015, 284277, 230425, 212235, 176787, 200702, 238807, 221412, 267950, 294176, 279494, 199648, 147015, 130856, 106173, 152360, 128730, 116580, 113130, 98330, 137972, 133330, 147907, 152114, 152606, 152104, 119416, 93502, 71393, -13180, 34010, 16993, -6519, 48576, 135725, 188766, 235840, 207402, 175387, 118791, 137061, 149197, 156135, 192934, 229020, 202836, 135798, 124893, 163610, 151075, 120850, 145381, 109104, 159010, 194458, 193974, 198431, 232033]
20922B32033k4162j2997m4843j8185k7312L4748J11952M8436J0144m9117q230
20911B52467J8822J9224m1099j3418k5678j6073N287L7524l2106j0509k753j01532
20899I0156L009R8337m6080j9888M0314N9812j7291k978N6987O3149P4621m736
20887C95412n4561o881n7201P114j6764j03741n8847N549P7368J34783j5160l6815
20875B70256Q44M1822k0689J1220K1101j9558J1726j2792k3345J5445K8031j7215
20863C06846k8505K5238N8538q15k8118l3420k52r936m9940M0079r652p0046k7341
20850A72676K2355L7372Q5123l3966k7756n1847K4729K2693p0219P0723R4970
20839C46853m1000K2218J0127N903P3559k7383j5283l7552J0420L7803l8384n4367
$$ y = [232033, 207871, 194874, 150031, 131846, 104534, 139282, 251234, 299670, 309814, 260697, 252467, 271289, 290513, 249414, 235996, 210318, 194245, 199532, 237056, 204950, 194441, 191688, 90156, 93165, 191502, 145422, 125534, 165848, 225660, 208369, 205391, 262378, 325527, 400148, 395412, 340851, 333970, 276769, 283883, 267119, 163378, 104531, 110080, 187448, 322231, 307071, 270256, 271100, 312922, 292233, 303453, 324554, 304996, 316722, 303930, 280585, 296030, 324061, 306846, 278341, 303579, 362117, 361302, 333184, 299764, 299512, 289576, 239636, 279715, 270063, 200017, 172676, 195031, 232403, 317526, 283560, 255804, 203957, 228686, 251379, 181160, 251883, 346853, 305853, 328071, 338198, 344101, 417660, 390277, 374994, 337442, 347862, 385665, 347281, 292914]
20827B92914l6417J2897M7591Q7168k7147l3329K352o8608l2849l01L8526N3945
20815C36742M6138M116M7735m1332K956m9101K6932J0677L6747N986J2315K2929
20803D62840N167K2728Q2577J13891J58470J22801J87156J39942R4387P0035n129
20792A454865n6079j24353j98900j85102j44892j20577p3149p3899K3354k2749
20782D78519q9467m248K0111q911j5118r859k9148O585o3051P974L6652N0987
20770C81026N9545l7496Q090j6456m9238j7051n1149o8244L9302P06L9298K0170
20758C08503P703M819M5354N2155m7272L990J18285K124n3346L5950K2882l0480
20746D70667j1003l5872m0528k5579n0319j7607O85p953k6348r530r587n496K8680
$$ y = [292914, 256497, 269394, 316985, 404153, 377006, 343677, 346029, 277421, 244572, 244271, 282797, 336742, 382880, 386996, 434731, 393399, 396355, 347254, 374186, 384863, 421610, 427596, 439911, 462840, 468007, 490735, 573312, 687203, 845673, 968474, 1155630, 1295572, 1389959, 1459994, 1454865, 1398786, 1274433, 1075533, 890431, 745539, 624962, 551813, 477914, 501268, 478519, 389052, 384804, 404915, 396004, 380886, 371027, 341879, 348464, 285413, 293387, 330039, 381026, 440571, 403075, 411165, 394709, 345471, 328420, 277271, 209027, 248329, 249035, 288333, 308503, 316206, 321025, 366379, 418534, 371262, 375252, 493537, 495661, 442315, 478265, 501147, 470667, 459664, 423792, 383264, 357685, 307366, 289759, 290444, 282491, 256143, 246613, 237026, 231530, 260210]
20733B60210L9451J8488j4072K026O1168k0324L7349N3661m3097p6380n8148P380
20721B67712J9810O1382J0765k8187k5352L3248Q288k5526N819m5606J6002O5425
20709C63780J5626k9236m4063J9571J4316k1349N514n23K051j7278L2975j0143
20697C31241k0614j4319o092o462Q511M2323J3848J148K2290o3041n7832L2979
20685B83980J4421J6134p806n9912J0586j7968j3000K6525P8288K4981l5063J0530
20673C31696l1917p078K5445p137p9154o845L0424Q0814J3305l0436K5140K0369
20661C64626M3249n1319k3235o960J9791K4490J8637j7809J9318N2150l1283r438
20649D02217k7520m5081n860m0154K7377j5678J7934N0033L2277j453k3658L929
$$ y = [260210, 299661, 318149, 304077, 306103, 367271, 346947, 384296, 437957, 394860, 318480, 260332, 267712, 287522, 348904, 359669, 331482, 306130, 339378, 347666, 322140, 327959, 282353, 298355, 363780, 379406, 350170, 306107, 325678, 339994, 318645, 324159, 323636, 325687, 308409, 341384, 331241, 310627, 296308, 290216, 283754, 292265, 334588, 348436, 349584, 371874, 308833, 251001, 283980, 298401, 314535, 306729, 246817, 257403, 239435, 226435, 252960, 331248, 356229, 321166, 331696, 299779, 292701, 318146, 311009, 231855, 225010, 255434, 336248, 349553, 319117, 344257, 364626, 407875, 356556, 333321, 326361, 346152, 370642, 389279, 371470, 390788, 442938, 411655, 402217, 374697, 329616, 323756, 283602, 310979, 295301, 313235, 363268, 395545, 394092, 370434, 374363]
20637C74363n505m0601K7903J6876K4618M9007N113k8709n3090M532M7680j0915
20625D11272k2138j544r2070q858J05392N3944j0273j7998P3276m4921j7052n2607
20613C76423l8009R2450N7180N4675M226k940j4045k8976l6703J0799N8544J8980
20601E52604R641P1382K6903m4871j30042j0253J6665K1578J4407k895o4550K031
20589D62600M1596m4768M1007M5046m1485J1533M5486L3415l1516l1502m8217
20578D83195R415j5652l4363j3260O1987M7173M6000k2004m4858O021n375L1978
20566E50257R0177N437k9070j5219J2324j9712K3206l4574L755R4988l5378l1196
20554F14995O358R606k1543q338m2517k8690J4011K7116P9418K8391K6969O4181
$$ y = [374363, 368858, 328257, 356160, 373036, 397654, 446661, 451774, 423065, 369975, 374507, 422187, 411272, 389134, 387590, 295520, 286662, 392054, 445998, 435725, 417727, 491003, 446082, 429030, 376423, 338414, 430864, 488044, 542719, 546945, 544005, 529960, 500984, 464281, 475080, 533624, 552604, 562245, 633627, 660530, 615659, 485617, 475364, 492029, 513607, 528014, 525119, 460569, 462600, 504196, 459428, 500435, 545481, 503996, 515529, 561015, 594430, 562914, 531412, 483195, 492610, 476958, 442595, 429335, 491322, 538495, 584495, 562491, 517633, 523654, 518279, 550257, 640434, 645871, 616801, 601582, 613906, 594194, 617400, 582826, 586581, 681569, 646191, 614995, 621353, 630959, 609416, 601078, 558561, 529871, 543882, 570998, 650416, 678807, 705776, 769957]
20542G69957j2844k9676k9466J3690N5352J5390P216L8516K3860p3622l6566O2013
20530H03820K8552J0159k7735M1348K3556M3396m5383j2212P3976o0322q3621
20519G95534l3054k9579P8922O8978J1437O195j4434L5686R167j6011N1437J03852
20507A068130j2057m1604j7833J1831Q187q224L1466l4529r5581P020J39119M2574
20495A098499m1179P363k7167m9564p4816m3981M9121Q7084j4403m9227K6824
20484I68554J10666J2400m6303l499N5362j284j4704K531J1340M3175J1169m9421
20472A099986j1053J3957O1376L6568J5638k8258n1954j3303K1640K3323k3215
20461A144705L57N239Q249n6419R1816N1951K5297M6663L3789r889M0797J10445
$$ y = [769957, 757113, 727437, 697971, 711661, 767013, 782403, 789619, 828135, 851995, 778373, 741807, 803820, 832372, 842531, 814796, 856144, 879700, 923096, 877713, 865501, 939477, 879155, 795534, 762480, 732901, 811823, 880801, 892238, 898433, 883999, 919685, 928852, 912841, 964278, 1068130, 1056073, 1014469, 996636, 1008467, 1016654, 1008430, 1039896, 1005367, 909786, 916806, 1055925, 1098499, 1057320, 1064683, 1037516, 987952, 913136, 869155, 918276, 1005360, 990957, 941730, 968554, 1079220, 1091620, 1045317, 1041818, 1097180, 1095896, 1081192, 1083723, 1095063, 1138238, 1149407, 1099986, 1088933, 1102890, 1164266, 1200834, 1216472, 1188214, 1136260, 1122957, 1144597, 1167920, 1144705, 1145062, 1150301, 1158550, 1102131, 1193947, 1245898, 1271195, 1317858, 1351647, 1341758, 1382555, 1493000]
20449A493000O6001p9311j5275l2662J2594k687l5254l1549J9336J088l2947N7229
20437A419563M8969K5701m2584K6479K9011L0821K0464L1973M1958l7060j5050
20426A580245J0683M8947l532j7111j7016J3607L0528J8352j1760n077k665O2228
20414A707429M1558M4590P3889Q355R4185M8785M3643N0354Q4652M8310R010P467
20402B262227P3193O3442J5009k848R0532J51462J88873K83423K16136J55811
20392C497260Q1054L251q7351p5178j31756j54516j44170p2497P73j9046k7878
20381B869946m3562M1629k218j8134M1822m36R920l0604k4380N1388O8236R3170
20369C056777K5274n9516K9297J33794O3029P2120M7665N9757l6703K1630Q3261
$$ y = [1493000, 1559001, 1479690, 1464415, 1431753, 1444347, 1441660, 1406406, 1374857, 1394193, 1395281, 1362334, 1419563, 1468532, 1494233, 1451649, 1478128, 1507139, 1537960, 1558424, 1590397, 1632355, 1595295, 1580245, 1590928, 1639875, 1636343, 1619232, 1602216, 1615823, 1646351, 1664703, 1652943, 1647866, 1645201, 1707429, 1748987, 1793577, 1867466, 1875821, 1970006, 2018791, 2062434, 2112788, 2197440, 2245750, 2254760, 2262227, 2335420, 2398862, 2413871, 2411023, 2501555, 2653017, 2841890, 3125313, 3341449, 3497260, 3578314, 3581565, 3494214, 3419036, 3287280, 3132764, 2988594, 2916097, 2916870, 2897824, 2869946, 2826384, 2868013, 2865795, 2847661, 2889483, 2889047, 2898967, 2868363, 2843983, 2895371, 2963607, 3056777, 3082051, 3022535, 3051832, 3185626, 3248655, 3320775, 3368440, 3428197, 3391494, 3413124, 3496385]
20358C496385M9951R9274O9992L2734K3783J5603j9121N2596M5277n397J02164
20347C963241J57599J26804P8838R4405N9718L4231Q8528M5682P8865l851J21516
20336D845576J20629J01504J13701R6923P0136N1930J37603Q8676J66868O1848
20326E855394R2191J35664J09304M6444P0558J10299J34538J51129J16920J53831
20316F976272J14081N3331J40001J23355J22392R9988J11736R8999J61927J47085
20306H149167J00184J11754J76628J55775J51595J05608J53259J80332J28471
20297I412773J51387J44802J63482J99381K02177K07142J40499J29340K25601
20288A0976584K06800J75901J81746J42654J44393K28787J54815J55104K23152
$$ y = [3496385, 3546336, 3645610, 3715602, 3748336, 3772119, 3787722, 3768601, 3821197, 3866474, 3861077, 3963241, 4120840, 4247644, 4326482, 4420887, 4480605, 4514836, 4603364, 4649046, 4727911, 4724060, 4845576, 4966205, 5067709, 5181410, 5278333, 5348469, 5400399, 5538002, 5626678, 5793546, 5855394, 5947585, 6083249, 6192553, 6238997, 6309555, 6419854, 6554392, 6705521, 6822441, 6976272, 7090353, 7143684, 7283685, 7407040, 7529432, 7629420, 7741156, 7840155, 8002082, 8149167, 8249351, 8361105, 8537733, 8693508, 8845103, 8950711, 9103970, 9284302, 9412773, 9564160, 9708962, 9872444, 10071825, 10274002, 10481144, 10621643, 10750983, 10976584, 11183384, 11359285, 11541031, 11683685, 11828078, 12056865, 12211680, 12366784, 12589936]
20279A2589936K21185J65625K00016J77069J53360J97417K23561J75252J18964
20270A4222385J38124J50539J39808J44437J91435J95514J34330J32148J93279
20261A5641999R3454Q5626J25185J14290J15625J28259J65488J75826J55528J52163
20251A6953443K00768K90470L69702L38193K28354R4798L8211o7604j78823k97592
20241A7969920k70810k07840q8123n1673n3981O9388R3629K2636M8934J0392M455
20230A7546927l9217j29654j30874j03694m5361N0488J12398K47487L49951M78346
20220A8336797O17433N65396M10850M05852L36350J79063J50642L89406N87684
20211B1979473Q27382J167516J661816K330655L414567N319940Q557067J3828676
$$ y = [12589936, 12811121, 12976746, 13176762, 13353831, 13507191, 13704608, 13928169, 14103421, 14222385, 14360509, 14511048, 14650856, 14795293, 14986728, 15182242, 15316572, 15448720, 15641999, 15735453, 15821079, 15946264, 16060554, 16176179, 16304438, 16469926, 16645752, 16801280, 16953443, 17154211, 17444681, 17814383, 18152576, 18380930, 18475728, 18513939, 18446335, 18267512, 17969920, 17699110, 17491270, 17403147, 17351474, 17297493, 17366881, 17460510, 17483146, 17532080, 17542472, 17546927, 17507710, 17378056, 17247182, 17143488, 17098127, 17148615, 17261013, 17508500, 17858451, 18336797, 18954230, 19519626, 19930476, 20336328, 20672678, 20851741, 21002383, 21391789, 21979473, 22806855, 23974371, 25636187, 27966842, 31381409, 36701349, 45258416, 59087092]
20203E9087092K1987405L3744272M7120980N2498592L9258862J9745628N003584
20196B78446415j2490052l7627255n3882399m8359317l4645732k2771324j4477489
20189E4192847r172634o069415m291938l213657k548819k093558j814671j537643
20181B3450512j325616j085152q79945p35682o85811p41412q30937p93601q04534
20172A5567822q74290q30343q28341o97036m88273l56093l23619k63266k71869
20163A0634692j89982k07234j40629k14941k77282k68032k60127k16963j50604
20154H708898j50307o2816J26692J31354M5714J3348o9407j70450l55321m62478
20144G755227m43756k87680j61782j49956j77993j91646j32816l2722k4338n7228
$$ y = [59087092, 81074497, 114818769, 161939749, 214438341, 253697203, 273442831, 278446415, 265956363, 228329108, 174446709, 126087392, 91441660, 68670336, 54192847, 45020213, 38950798, 34658860, 31445203, 28896384, 26802826, 24988155, 23450512, 22124896, 21039744, 20159799, 19424117, 18738306, 17996894, 17165957, 16372356, 15567822, 14693532, 13863189, 13034848, 12337812, 11849539, 11493446, 11169827, 10906561, 10634692, 10444710, 10237476, 10096847, 9881906, 9604624, 9336592, 9076465, 8859502, 8708898, 8558591, 8495775, 8622467, 8753821, 8799535, 8812883, 8743476, 8573026, 8217705, 7755227, 7311471, 7023791, 6862009, 6712053, 6534060, 6342414, 6209598, 6176876, 6152538, 6095310]
20134F095310q2654j28169n6815p2688j01173j36836n6873m6965m4502m0930k3874
20123E303831p4j10892j60708o6692p1285j07133l5909o0060L7421o8480o6586
20112D593433j4893m1694j22926p9635r998n767p578r664m0412j12200n7286n8994
20100D032386o7262n6581K2573k3908p7547q135k6580o8416j6469n0937L5166
20089C694290l347n7027l8233k9674k6976l3277p0012q9009k0823K0711K8298
20078C374921M1177m0895m2231L2390q339q4038l6426l9658J2487k1897m6366
20067C141125k2576k9887j09187m6182L162k0202l9313j1522J6037K2702m2946
20056B861211R220J2701J4289L5873o377l4702J8439k0158n6494j2863J9810J9471
$$ y = [6095310, 6012656, 5884487, 5827672, 5754984, 5653811, 5516975, 5460102, 5413137, 5368635, 5327705, 5303831, 5303757, 5192865, 5032157, 4965465, 4894180, 4787047, 4751138, 4691078, 4728499, 4660019, 4593433, 4578540, 4536846, 4413920, 4334285, 4324287, 4318520, 4310942, 4301278, 4260866, 4148666, 4091380, 4032386, 3965124, 3908543, 3931116, 3907208, 3829661, 3821526, 3794946, 3726530, 3710061, 3659124, 3694290, 3690943, 3633916, 3595683, 3566009, 3539033, 3505756, 3435744, 3346735, 3325912, 3346623, 3374921, 3416098, 3375203, 3332972, 3365362, 3357023, 3272985, 3236559, 3196901, 3209388, 3187491, 3141125, 3118549, 3088662, 2979475, 2933293, 2936455, 2916253, 2876940, 2865418, 2881455, 2904157, 2861211, 2870431, 2883132, 2897421, 2933294, 2926917, 2892215, 2910654, 2890496, 2834002, 2821139, 2840949, 2860420]
20044B860420J1244q492k3399K9905j5969K6056P5192R0666J01696J64295K27284
20033C538898L59189L19797K01440L5178n8906p5390k45625l85244l18860j91579
20023C178898j50518j24409r2627n1737j9030j26589q3654Q974n9928k9084m4749
20012B405547J0863O8940K6830k6636k7971J7012K641k4602m2789m2311k6076
20001B341448k3596j4933M170n1907k174J0958n1758j0928q494N9618Q886k6376
19989B234914j5579m1324n3495j9900L1613k230k6448N728P702M5411J3702M1346
19977B221440J0770q3330r9843K6528P4458j0426j9261p5289p002J1964j863j1221
19965B036925L0669O713p5634j513J19825L2976m8761K5764J627j0378O169m273
$$ y = [2860420, 2871664, 2863172, 2839773, 2869678, 2853709, 2879765, 2954957, 3045623, 3147319, 3311614, 3538898, 3898087, 4217884, 4419324, 4454502, 4395596, 4320206, 4074581, 3689337, 3370477, 3178898, 3028380, 2903971, 2811344, 2759607, 2740577, 2613988, 2530334, 2539308, 2479380, 2450296, 2405547, 2416410, 2485350, 2512180, 2485544, 2457573, 2474585, 2477226, 2452624, 2409835, 2367524, 2341448, 2317852, 2302919, 2307089, 2255182, 2253008, 2263966, 2212208, 2201280, 2192786, 2252404, 2261290, 2234914, 2219335, 2178011, 2124516, 2104616, 2136229, 2133999, 2107551, 2113279, 2120981, 2166392, 2180094, 2221440, 2232210, 2148880, 2049037, 2075565, 2150023, 2139597, 2120336, 2045047, 2038045, 2050009, 2048146, 2036925, 2067594, 2074307, 1998673, 1997160, 2116985, 2149961, 2101200, 2126964, 2128591, 2118213, 2124382, 2120109]
19953B120109K2403L389k7127r95J5688Q943L9065k612p590k087k0603k2586N5347
19940B181344j0575o0506k6884M6668q2714J8125R2271J0171o2236J0376p3490
19929B042550k342P1513O0301J3750l5587j6257o5381n913L1062M2946J1373J082
19917B149097r869j5321K3816N9446K3607m1905p435P4380l1359J5355N620l1685
19905B213747l4104J6843O5288P4729q239q8457n3448k3895N8029J9839p088n6881
19893B176363l0448M2365p478n9051K1073K7518K5298j7794n2305n618j6982L4917
19881B137858M1603K7714L2412j533J8237P0543N1100L6365p6290k2959K3931
19870B338981k7432J8588r7M4830L7730J1400j1301L7670R818n6427L3602J0439
$$ y = [2120109, 2142512, 2145901, 2118774, 2117779, 2133467, 2142410, 2181475, 2178863, 2171273, 2169186, 2148583, 2125997, 2181344, 2170769, 2110263, 2083379, 2130047, 2047333, 2065458, 2157729, 2167900, 2105664, 2116040, 2042550, 2040208, 2111721, 2172022, 2185772, 2150185, 2133928, 2068547, 2062634, 2093696, 2136642, 2148015, 2149097, 2139228, 2123907, 2147723, 2207169, 2230776, 2188871, 2181436, 2255816, 2224457, 2239812, 2245432, 2213747, 2179643, 2196486, 2261774, 2336503, 2328264, 2239807, 2186359, 2162464, 2220493, 2240332, 2233244, 2176363, 2145915, 2188280, 2180802, 2121751, 2142824, 2170342, 2195640, 2177846, 2125541, 2119923, 2102941, 2137858, 2179461, 2207175, 2239587, 2238054, 2256291, 2326834, 2377934, 2414299, 2338009, 2315050, 2338981, 2311549, 2330137, 2330040, 2374870, 2412600, 2424000, 2412699, 2450369, 2460187, 2403760, 2437362, 2447801]
19858B447801k8195N2864Q6566m3557L172K8203J9632o474J391J8005L4015N9922
19846B673345Q7615J14155L7721Q888L5594N2985M5008M4524N3793J27641J55846
19835C437115K00901K14728M35742P08318J109012J895470K638358K369618J118661
19826A4127923M56382R7289j088943k554959k554515j682508j124201p34682m39986
19817D501800j95968p1276j60763j21631r4371n7002m2267l9612l3474j5378o8763
19806C601295j01993n6451K657j8243k4512K2598M3403k1876J0492o532m3778
19795C407060k0784j7750n901O9109J28875O2825O217l0731j5713j7342M7198
19784C613063O1422O580M4136J4727K1675Q2443O5700L7M100M3704O648m5737
$$ y = [2447801, 2419606, 2472470, 2559036, 2515479, 2518651, 2546854, 2566486, 2560012, 2561403, 2579408, 2613423, 2673345, 2760960, 2875115, 2912836, 2921724, 2957318, 3010303, 3055311, 3099835, 3153628, 3281269, 3437115, 3638016, 3852744, 4288486, 4996804, 6105816, 8001286, 10639644, 13009262, 14127923, 14584305, 14681594, 13592651, 11037692, 8483177, 6800669, 5676468, 4941786, 4501800, 4305832, 4234556, 4073793, 3952162, 3857791, 3800789, 3758522, 3718910, 3685436, 3670058, 3601295, 3499302, 3442851, 3445508, 3427265, 3402753, 3425351, 3468754, 3446878, 3457370, 3450838, 3407060, 3386276, 3368526, 3362625, 3431734, 3560609, 3623434, 3629651, 3598920, 3583207, 3565865, 3613063, 3674485, 3681065, 3725201, 3739928, 3761603, 3844046, 3909746, 3909783, 3913883, 3957587, 3964235, 3918498]
19772C918498j0457M6954M3364p107K0267M7959N4205M3622M9936L4885J26124
19761D368250J30158J23800P1037L3302Q7942J65216J02563J48015J81473K58177
19751E669933M24681N50700R16842J526415K306267K512534J521296O29059K31714
19742A6289441n62185k040411k617713j898340j126339o48157m52477k74080j69828
19733F499911q1784m4844o1745j9593M2883o757J9339L2678M4592m3810l5206
19722F345664j759Q5571L0212J9220N8524K9449P5754J13591J5405R455L1763
19711F812849Q7776J59609R9617N8701P0500J28061Q8885J0247Q9577N5040P3426
19700G734288Q3247J42087J83550J11151O8711Q8379J21365R4644P4227Q7700
$$ y = [3918498, 3908041, 3954995, 3998359, 3991252, 4011519, 4059478, 4113683, 4157305, 4207241, 4242126, 4368250, 4498408, 4622208, 4693245, 4726547, 4814489, 4979705, 5082268, 5230283, 5411756, 5669933, 6094614, 6645314, 7562156, 9088571, 11394838, 13907372, 15428668, 16057727, 16289441, 15727256, 13686845, 11069132, 9170792, 8044453, 7396296, 6943819, 6669739, 6499911, 6418127, 6373283, 6311538, 6291945, 6334828, 6328071, 6347410, 6380088, 6424680, 6380870, 6345664, 6343905, 6429476, 6459688, 6478908, 6537432, 6566881, 6642635, 6756226, 6771631, 6781086, 6812849, 6900625, 7060234, 7159851, 7218552, 7289052, 7417113, 7505998, 7516245, 7605822, 7660862, 7734288, 7817535, 7959622, 8143172, 8254323, 8323034, 8411413, 8532778, 8627422, 8701649, 8789349]
19690H789349J26935J19509J25570Q8961J08478O8528R9191J48626J46516R4033
19680I915696J16418J57645J76018J36149Q2998J32308J36346J51997J38200J56052
19670A1299827J96609K04725J56024J09315J81330J31335J02528K14786J65560
19661A2762039J46436J81179J01047R1236J37887J26287J74554J13466J58843
19652A3992974K03015J54187J45167J52470J02600j2544P3748J22187J06441J29751
19642A5169996J16585R5240J16060J57293J13919P748O6214J6092N8284J9898
19632A5937329J0520K9026k3511L9950O417r939L1546J9904J7009n3766k1224
19621A5983261j3579r4439j75237o5000m6519n8768j24550j56881r3431j07451
$$ y = [8789349, 8916284, 9035793, 9161363, 9250324, 9358802, 9427330, 9526521, 9675147, 9821663, 9915696, 10032114, 10189759, 10365777, 10501926, 10584924, 10717232, 10853578, 11005575, 11143775, 11299827, 11496436, 11701161, 11857185, 11966500, 12147830, 12279165, 12381693, 12596479, 12762039, 12908475, 13089654, 13190701, 13281937, 13419824, 13546111, 13720665, 13834131, 13992974, 14195989, 14350176, 14495343, 14647813, 14750413, 14737869, 14811617, 14933804, 15040245, 15169996, 15286581, 15381821, 15497881, 15655174, 15769093, 15776841, 15843055, 15859147, 15917431, 15937329, 15947849, 15976875, 15953364, 15993314, 15999731, 15989792, 16021338, 16041242, 16058251, 16004485, 15983261, 15969682, 15875243, 15700006, 15635006, 15588487, 15529719, 15405169, 15248288, 15154857, 15047406]
19611A5047406j13912r2172p3499q2780q7558j58916k04733j67627j05183j06720
19601A3854306r3386q9110q3968m8508p789m4646j02024j4555n1362j30167k23656
19590A2965135k92253k95368k98025k62417k98663k90380k03865k38721k34646
19581A0550797j79802k03904j56892j42206j42410j49254j81035k08493k07917
19572H978884j28447j33615j50849j33232j50595j31620n3080j00064j40357j52718
19562G704307j72232j49401j56808j61316j38378j12257j24149l9412r5956j31357
19552F423041r2649j16459j50576j30465q5713q2721q2606l1023o5932j51367
19542E433530q0292q7981o0602n4892r7001j23806j14790j14703r0762o2276o2962
$$ y = [15047406, 14933494, 14841322, 14767823, 14685043, 14597485, 14438569, 14233836, 14066209, 13961026, 13854306, 13760920, 13671810, 13587842, 13539334, 13531545, 13486899, 13384875, 13370320, 13318958, 13188791, 12965135, 12672882, 12377514, 12079489, 11817072, 11518409, 11228029, 11024164, 10785443, 10550797, 10370995, 10167091, 10010199, 9867993, 9725583, 9576329, 9395294, 9186801, 8978884, 8850437, 8716822, 8565973, 8432741, 8282146, 8150526, 8097446, 7997382, 7857025, 7704307, 7532075, 7382674, 7225866, 7064550, 6926172, 6813915, 6689766, 6650354, 6554398, 6423041, 6330392, 6213933, 6063357, 5932892, 5847179, 5764458, 5681852, 5650829, 5584897, 5433530, 5353238, 5265257, 5204655, 5149763, 5052762, 4928956, 4814166, 4699463, 4608701, 4546425, 4483463]
19531D483463p1498q7788n8868o1026j05428p8814o2381q0397p0702o2931K3169
19520C766799j7792q061o1901j44182r2647o2269m4336l4009j05017l6580l0804
19509C129201l9489l7242r983k6584m7905k4565k52k116l6506r1528k3705o6301
19497B723025O428o0012p6375J7693l7865o8462j01248j17392J462J966O388l4648
19485B260960j4677L4657k509m6671q2938p1524k4285L4548M3744l8269r3536
19474A999500n8500j8090q877R260L3430J0039q426k3295k1499o2224r3852m6914
19462A710552L8160J5725j4463r1883o4113n2984j5300L4279O5502j256o0110
19451A564109k5388J8664m5411n5917J33m0033r9197m4550j3866M8035J21r256
$$ y = [4483463, 4411965, 4324177, 4265309, 4204283, 4098855, 4020041, 3957660, 3877263, 3806561, 3743630, 3766799, 3749007, 3740946, 3679045, 3534863, 3442216, 3379947, 3335611, 3301602, 3196585, 3160005, 3129201, 3089712, 3052470, 3042487, 3015903, 2967998, 2943433, 2943181, 2941065, 2904559, 2813031, 2789326, 2723025, 2729453, 2669441, 2593066, 2610759, 2572894, 2504432, 2403184, 2285792, 2287254, 2289220, 2295608, 2260960, 2246283, 2280940, 2278431, 2231760, 2148822, 2077298, 2053013, 2087561, 2131305, 2093036, 1999500, 1941000, 1922910, 1914033, 1923293, 1956723, 1966762, 1958336, 1935041, 1913542, 1851318, 1757466, 1710552, 1748712, 1764437, 1749974, 1658091, 1593978, 1540994, 1525694, 1559973, 1625475, 1624219, 1564109, 1538721, 1557385, 1511974, 1456057, 1456190, 1416157, 1316960, 1272410, 1258544, 1306579, 1306700, 1297444]
19439A297444j8509P418J7267J7064J6919l953j9839M5732k8930p1605m2327j0866
19427A205815o7702l7290Q033j5000L965P808P674l9288K041K3423M3733m6374
19415A096838l6447m214m2449l2118j2922p726L6755j9183m2994n8266o9715K3999
19403H31558k1443K4240L4960L6110m8261n3236j2427M9023J2110j5690O5521
19392I02465M2281l9789q8451m2812K0514k4296k7063K5235j2855l0787J8814
19381G43256j9573n2979k2842J6816J8254q541j9493J5208l2721o9686l3599M5962
19369E80062l7518O975L4384j6893j4493K8352K0300P1365K7919m1118l4776J3331
19357F37890J6391J072l0143n1498j9913j1303k8711K5042P0326K0312j0943m526
$$ y = [1297444, 1278935, 1286353, 1303620, 1320684, 1337603, 1333650, 1313811, 1359543, 1330613, 1259008, 1216681, 1205815, 1138113, 1100823, 1108856, 1093856, 1097821, 1105629, 1113303, 1074015, 1076056, 1099479, 1143212, 1096838, 1060391, 1056177, 1013728, 981610, 968688, 960962, 997717, 978534, 935540, 877274, 807559, 831558, 810115, 834355, 869315, 905425, 857164, 803928, 791501, 840524, 852634, 836944, 902465, 944746, 904957, 816506, 773694, 794208, 769912, 742849, 768084, 755229, 724442, 743256, 723683, 670704, 647862, 664678, 682932, 674391, 654898, 670106, 637385, 567699, 534100, 580062, 542544, 549519, 583903, 567010, 552517, 580869, 601169, 672534, 700453, 659335, 624559, 637890, 654281, 655353, 625210, 573712, 553799, 542496, 513785, 538827, 609153, 629465, 618522, 613996]
19345F13996l3267J3521l2359r2925m1402l003Q0030P845l6141k8001l2338O2919
19333D78875L6666L1628j9477m4671k6928J1437k0871k0341k6969j6875P030L3586
19321D23090M3949L1667l4400m5449K1094N0886m9698j7861N3530j0208m7469
19310D19131k9409N44m1869j9166O0782O7427L1114K5677J354j13577j13600j9944
19298B68464P4189J26454j3853l7719k208l9783p298J09840N171r9487j6073P459
19286C75156O369k1525j1295J0967J9527j225p6376q1003k9069M6717L2946K4720
19274B95909k6955k8346J2806J2878K708m8320N9970J6725M89K6189K58k0106
19262C04205n5955r014M0794J7866k0829j2972l8101m274L138K1089l3127l1408
$$ y = [613996, 580729, 594250, 561891, 468966, 427564, 424561, 504591, 512436, 476295, 448294, 415956, 478875, 515541, 547169, 527692, 483021, 456093, 467530, 446659, 426318, 399349, 382474, 389504, 423090, 467039, 498706, 464306, 418857, 439951, 490837, 441139, 423278, 476808, 466600, 419131, 389722, 390266, 348397, 329231, 390013, 457440, 488554, 514231, 515585, 402008, 288408, 268464, 342653, 469107, 455254, 417535, 415327, 375544, 368246, 478086, 483257, 383770, 367697, 375156, 381525, 360000, 348705, 359672, 379199, 377974, 301598, 220595, 191526, 238243, 271189, 295909, 268954, 240608, 253414, 266292, 269000, 220680, 280650, 297375, 297864, 324053, 324311, 304205, 248250, 239236, 280030, 297896, 277067, 264095, 225994, 221720, 224858, 245947, 212820, 181412]
19250A81412O1007j1738K3205M1974M037j18336k6662K99l2350K1699l707Q948
19238A49788L6360m8847J6471M4008K634l9640J4297N2342r2179m9544L8150L2138
19226A55978N4704Q0644L0301p8154r9335K9091o935l5944K6632M7435p087o7537
19214A29793l8262j7819l7486l4309M7508M6643N3448J3660o0489k6148j2098
19203F4441L9927O3269M4367p7301l5901P0058K6250j6044j2393K5433M7006k1184
19191B17928m8453m3462P9418k0186l4687l8656j2762J5320N9911K4782l2144
19180A67009j7579j6351J3534L3747M677n0916M6208J576R472L0081k0783R059
19168B09734j6291j4619m7931j4683J1963R604L0295q7082R968j0122j4489N9563
$$ y = [181412, 242419, 230681, 253886, 295860, 299897, 181561, 154899, 155198, 122848, 144547, 140840, 149788, 186148, 137301, 153772, 197780, 200414, 160774, 175071, 227413, 135234, 85690, 123840, 155978, 210682, 291326, 321627, 243473, 144138, 173229, 166294, 130350, 156982, 204417, 197330, 129793, 91531, 73712, 36226, 1917, 49425, 96068, 149516, 163176, 102687, 76539, 64441, 104368, 167637, 212004, 134703, 98802, 168860, 195110, 179066, 166673, 192106, 239112, 217928, 169475, 126013, 205431, 185245, 150558, 111902, 99140, 114460, 174371, 199153, 167009, 149430, 133079, 146613, 180360, 185037, 134121, 180329, 181905, 191377, 221458, 200675, 209734, 193443, 178824, 130893, 116210, 128173, 137777, 168072, 80990, 90958, 80836, 66347, 125910]
19156A25910O3768M6009J06183O09n861L9638l5522q3031n8450m9505l7208o713
19144A05827n1760M0272P2175M2243J1902l169k0589n2240J2381n8069o3063j9424
19132A6486O918L0799P235M2097O726l3357J4428J9113j4030m859p790k0347M5911
19119A09330M2583K6247o531K1563m3920n2626L179K8078K5903M3491k2723m2027
19107A32547k7971J6266P362J661n0959j278N9776J4157N9039r861o7980j470
19095A31289o0939N5555N5583K472M0799N1813J8111m1418m9518j314k2220Q694
19083A88907l5056k1507N5129L4130J26178N7238K87L463o4057j08417j735M7428
19071B81988m8184p8391l685n0576Q485L4712n1881o7264J652L7470K1509O2184
$$ y = [125910, 189678, 235687, 341870, 342479, 336618, 376256, 340734, 257703, 199253, 149748, 112540, 105827, 54067, 94339, 166514, 208757, 220659, 217490, 196901, 144661, 157042, 98973, 35910, 16486, 23404, 54203, 61438, 103535, 110261, 76904, 91332, 110445, 96415, 91556, 83766, 63419, 109330, 151913, 178160, 171629, 193192, 149272, 96646, 99825, 127903, 153806, 197297, 174574, 132547, 104576, 120842, 128204, 129865, 78906, 77628, 137404, 151561, 210600, 200739, 132759, 131289, 70350, 125905, 181488, 183960, 224759, 276572, 294683, 253265, 203747, 202433, 180213, 188907, 153851, 132344, 187473, 221603, 347781, 405019, 405306, 408769, 344712, 236295, 234560, 281988, 233804, 155413, 151728, 101152, 109637, 144349, 92468, 25204, 26856, 64326, 85835, 148019]
19059A48019L3563o8207J6597K5409m381l1144k3551n477n046j14085m5516N6386
19047a7433R501M6346Q5302Q4627K8509n9135q6332l5706J5892N887m5173l4368
19035b083O937N8904K1508m4145L4733K2297j8425q437J4191p4523j7236N0754
19023D4475N4613l1418J5746K3325l8066k8606j45L5549O107N6415J8584k4916
19011A31663k3553m1184p3502m2778J7330O7423K6958j7282l3837j7245L1201
19000B5194J2471L0469r505K1251K0340J3491l8648Q3757K4655m9604l5380l2133
18988F6358j8875M2621L9929l6480J6458K2846j0848N097n0657k8612m2985N8762
18976F3614L4150m0023L302N2910l7921r09j3009n8894p942K3671r654M236Q439
$$ y = [148019, 181582, 113375, 129972, 155381, 151000, 119856, 96305, 90828, 85782, -28303, -73819, -17433, -7932, 38414, 123716, 208343, 236852, 177717, 91385, 55679, 71571, 77458, 32285, -2083, 4854, 63758, 85266, 41121, 75854, 98151, 79726, 71289, 85480, 10957, -6279, 44475, 99088, 67670, 83416, 106741, 68675, 40069, 39924, 75473, 81580, 137995, 156579, 131663, 108110, 66926, -6576, -49354, -32024, 35399, 62357, 45075, 11238, -6007, 25194, 37665, 68134, 58629, 79880, 100220, 113711, 75063, 158820, 183475, 133871, 98491, 66358, 47483, 90104, 130033, 93553, 110011, 132857, 122009, 127106, 76449, 47837, 4852, 63614, 97764, 57741, 61043, 113953, 76032, 75123, 62114, 3220, -4722, 18949, 9295, 13531, 21970]
18963B1970P632O436m3784k6722R837K869P153M1032J9269k2285j750m9191M5006
18950A7472M105P630k2412o180j5595n7778L1709J00917O9554k584l9688l5590
18938E1560m9840n8873j2607Q6527N3820J8609l1862R803k5983P224M2151K720
18926I3249k9432N114j1249J9681Q475j6543k9469J182l622r477k9788q1983p04
18913h4566J9628L7415K4866L5017J1809M5127K4003J1393j6688j3510j1539L1180
18901A14135k3441K9516m5570k4030o9665m0035P1446K6819m2857j8728N2516
18890C0106N6774R297j3783R164o0888m5912O3916n5549m3008O6133K1783Q137
18878D6170l0563r213m658R994M3319m8294r494J6098m7963P5826P8526P619l4739
$$ y = [21970, 29602, 36038, -7746, -34468, -24631, -21762, -14609, 26423, 45692, 23407, 21657, -27534, 17472, 21577, 29207, 6795, 615, -14980, -72758, -41049, 59868, 129422, 126838, 87150, 51560, 1720, -57153, -69760, 16767, 70587, 89196, 57334, 67137, 41154, 48378, 90529, 93249, 63817, 68931, 57682, 77363, 85838, 69295, 39826, 41008, 37386, 27909, -1879, -83862, -84566, -64938, -27523, -2657, 32360, 44169, 89296, 113299, 124692, 108004, 94494, 82955, 114135, 90694, 120210, 74640, 50610, -19055, -59090, 12356, 39175, -3682, -22410, 30106, 86880, 96177, 82394, 91558, 30670, -15242, 48674, -6875, -49883, 16250, 38033, 46170, 15607, 6394, 1736, 11730, 55049, 6755, -2739, 13359, -34604, 41222, 119748, 127367, 92628]
18865I2628o6683q8367J9518J8234M2057L1222l3272R858j9222l2915j9441K8562
18853a7821O8655J8418L1499l0339n4019m2695j3780L1352j8453J0011L8308j2139
18841H997q9521M367M8826L4170J12442L5805j4104j5730K4335j7414n576o639
18829A19958r3893r2333m6158J9170J3568n380J1881N2701Q144K2518j0937j6412
18817a7173j4052J3954l304L5794j8627k925P887J7888m614L950k9219N5434Q0946
18804A25939K4349l6215k2474m4512j7024Q263L0308M3356L239L776j0963L0374
18792A38416k8657n1382J1716m2458p3546K4394K2971j8226l8630J5558p219M0779
18780f284M3376L2968J1327L258K637k545k6419n1465j6643M2673N8979O051k7335
$$ y = [92628, 25945, -62422, -42904, -24670, 17387, 48609, 15337, 25195, 5973, -26942, -46383, -17821, 50834, 69252, 100751, 70412, 16393, -26302, -40082, -8730, -27183, -17172, 21136, 8997, -80524, -76157, -27331, 6839, 119281, 155086, 140982, 125252, 149587, 132173, 126597, 119958, 26065, -66268, -112426, -93256, -79688, -85068, -73187, -20486, -12342, 10176, -761, -17173, -31225, -17271, -20575, 15219, -3408, -6333, 1554, 19442, 14828, 18778, -10441, 44993, 125939, 150288, 114073, 91599, 47087, 30063, 38326, 68634, 111990, 115229, 119005, 108042, 138416, 109759, 58377, 70093, 27635, -45911, -21517, 1454, -16772, -55402, -39844, -47063, -6284, 37092, 70060, 81387, 84645, 87282, 84737, 58318, 6853, -9790, 32883, 91862, 97913, 70578]
18767G0578P002l5660j0396L3929N9864q381p2894j2133Q7913m4434l2950k8714
18755A3724r803N4591P6983k4088m388n8077R606P7736K1011k0236N8784J7381
18743B13224o1397o7677j7976j4171K6339K0988K5815j0212m1478K8655M6579
18732A48689O438M6100m4593l5744M0333l8746K2988N0770J0503j0281k0412p6077
18720I9968l7894m213l9819m0963R2040N0573J177m4373K732K729M9282J3673
18708A44912n6504N1159N9923L3702j6223o0344j9174P7385K3063J3223r2346
18697A58776n5105N8762N7923Q91l5922K2542K7218m1660O550Q0073N4925k8056
18685C06917m7682l553l6030m4209K3643Q4616Q8227k075m0814M127k1792l4891
$$ y = [70578, 77580, 41920, 31524, 65453, 125317, 116936, 44042, 31909, 119822, 75388, 42438, 13724, 3921, 58512, 135495, 111407, 107019, 48942, 58548, 136284, 157295, 137059, 195843, 213224, 151827, 84150, 66174, 52003, 78342, 99330, 125145, 114933, 73455, 102110, 148689, 155127, 201227, 156634, 120890, 161223, 122477, 145465, 196235, 206738, 196457, 176045, 99968, 62074, 57861, 18042, -22921, 69119, 119692, 120869, 76496, 79228, 81957, 131239, 144912, 88408, 139567, 199490, 233192, 216969, 156625, 137451, 214836, 237899, 251122, 158776, 103671, 162433, 220356, 221247, 185325, 207867, 235085, 193425, 199975, 280048, 334973, 306917, 259235, 255682, 219652, 175443, 199086, 283702, 371929, 369854, 329040, 333167, 311375, 276484]
18673B76484J2715j4208m1676o2863j5220M8318N9885M8932J6554L0031l6704
18662C22248n1143n18L8996P9321l8773l7378O9461Q3699k2793j8069N2822m291
18650D73582K9491K9865j4573k0579j3604K9713K6297J5940P6429L0031o6072
18639E96520p7800o7487M1477q032k2655N8964N7712j5892j1431Q9509R5215N3034
18627G89134l9904j7062K5872M3206M3830l6834m8644l2365r703Q2884J06952
18616I07366L9745P6909m317R833k6198m4145L8114L2503j3560K0742J14149O9923
18604A221064J5254R3301K2589m3532l650J589J7953l235P4063J8003q628M3623
18592A448394K7094M182P5149J06979j1932K3917M0490J2729L5379O3709J9121
$$ y = [276484, 289199, 274991, 233315, 170452, 155232, 203550, 263435, 312367, 328921, 358952, 322248, 271105, 270587, 309583, 388904, 350131, 312753, 382214, 465913, 443120, 425051, 477873, 473582, 503073, 532938, 518365, 497786, 484182, 513895, 540192, 556132, 632561, 662592, 596520, 518720, 451233, 492710, 484678, 462023, 520987, 578699, 562807, 551376, 640885, 736100, 789134, 749230, 732168, 758040, 801246, 845076, 808242, 759598, 727233, 717530, 800414, 907366, 947111, 1024020, 1019703, 1029536, 1003338, 959193, 997307, 1029810, 1016250, 1036992, 1151141, 1221064, 1236318, 1329619, 1352208, 1308676, 1305026, 1306615, 1324568, 1321333, 1395396, 1413399, 1404771, 1448394, 1475488, 1479670, 1554819, 1661798, 1649866, 1673783, 1714273, 1727002, 1762381, 1826090, 1845211]
18581A845211j8695j98Q503k9303P672O7974P4637K5750O140J8552K7394L2430
18569B066067j3503M035K3398o0459p3068N9537j3570n1505m7824p349J184N846
18557A892789n3504N7860J056l2173m5328n3431M211J539j1693N016m3437k5163
18545A697742m6504n3872o5960k254Q656o494m5460o2330o577J002R028m575n4742
18532A367660q5551k3538J6144n6802K4528M895q4683m9977N2522M2665n0947
18521A156916o5252m7891m5317o4796p3553K1391J1835J0753j5505o8177j3264
18510H07140K4006p193K5110n955n8196J7513k3621k650O283q2839q9519J8425
18498F28504K1951p2895q0242L2915N5865j1715j7280j9718m7114J3407M6446
$$ y = [1845211, 1826516, 1826318, 1834821, 1805518, 1813190, 1881164, 1955801, 1981551, 1987691, 2006243, 2033637, 2066067, 2052564, 2056599, 2079997, 2019538, 1946470, 2006007, 1992437, 1940932, 1893108, 1885759, 1886943, 1892789, 1839285, 1897145, 1898201, 1866028, 1820700, 1767269, 1771480, 1773019, 1761326, 1766342, 1722905, 1697742, 1651238, 1597366, 1531406, 1529152, 1537808, 1531314, 1485854, 1423524, 1416947, 1417949, 1426977, 1422402, 1367660, 1282109, 1258571, 1274715, 1217913, 1242441, 1247336, 1162653, 1112676, 1165198, 1207863, 1156916, 1091664, 1043773, 998456, 933660, 860107, 881498, 893333, 904086, 888581, 820404, 807140, 831146, 823953, 849063, 843108, 784912, 802425, 778804, 776154, 782437, 699598, 610079, 628504, 650455, 577560, 497318, 530233, 586098, 574383, 557103, 537385, 490271, 503678, 550124]
18487E50124k3007m5808L1251k209p6334k8196P1759L3246j02722o4768k25J1874
18475C54985J0067o712k7735j9838M5115K4504o223L5098L1026j5949m0831n2710
18463C30797J4134N8350j5238k7153l2438j058j8829m261k3684J7033j0434O737
18451B93956j6308L4248K242J2753k389J4886K3352J5057o2663J1692p887j0767
18439C08172K9n4121l9436m2824N594l1802L4440P4981k3328o1874m592k0166
18427A45073j0239M0733o33n0146M9962Q0623j6462p3421Q652k5972N2703L5707
18415B36580nn1426o2077J445J4326n3822M4932J0944o0214m790N8605M6062J6063
18402A96623L0934n4461J946J8784n1993q892M2071L4395Q875L3829l2699k9969
$$ y = [550124, 527117, 481309, 512560, 510351, 434017, 405821, 477580, 510826, 408104, 343336, 343111, 354985, 365052, 358340, 330605, 310767, 355882, 380386, 374163, 409261, 440287, 424338, 383507, 330797, 344931, 403281, 388043, 360890, 328452, 327394, 308565, 304304, 280620, 297653, 287219, 293956, 277648, 311896, 314138, 326891, 324502, 339388, 362740, 377797, 315134, 326826, 318939, 308172, 308201, 254080, 214644, 171820, 177414, 145612, 180052, 255033, 231705, 169831, 165239, 145073, 134834, 175567, 174934, 124788, 174750, 255373, 238911, 165490, 174142, 148170, 200873, 236580, 236575, 185149, 123072, 124517, 138843, 85021, 129953, 140897, 80683, 75893, 134498, 180560, 196623, 227557, 173096, 175042, 193826, 141833, 132941, 175012, 209407, 218282, 252111, 219412, 189443]
18390A89443j4535j1213n091O107j8844m4762r0134k2294P2370O1142O8701j0072
18378A80818p5503j9713L7680j265k8856m1704k5304J3997O1989L89J5500o2996
18366E5032K3655N6579K5978P4893k4274M0700q2404o5566L9132L0181N6396k5867
18354B04435l0466N009K3390m9688O749j7690l6366J0154j8564k7381M1187l0797
18342G9972o9619k812N6393N2074N5227n9422m1090J4473J9390m6785m336k9240
18330B4225k7218Q9128N3946k8141l3590m753j4406j0604L7151Q491J6788k541
18318A08476k0315l7022k8963M1033N8247J4734m3800m507l6781j2342N5699J1134
18306A05593M4692K7853j7428o6095m6171r755J6189L3089K3038o3k5645o6253
$$ y = [189443, 174908, 163695, 158604, 164711, 145867, 101105, 10971, -11323, 61047, 122189, 190890, 180818, 105315, 85602, 123282, 122017, 93161, 51457, 26153, 40150, 102139, 102528, 118028, 55032, 78687, 135266, 161244, 236137, 211863, 252563, 170159, 104593, 143725, 173906, 230302, 204435, 173969, 178978, 202368, 152680, 159429, 141739, 105373, 115527, 96963, 69582, 110769, 79972, 10353, 7541, 63934, 116008, 171235, 111813, 70723, 85196, 104586, 57801, 53465, 24225, -2993, 86135, 140081, 111940, 78350, 73597, 59191, 48587, 85738, 94229, 111017, 108476, 88161, 51139, 22176, 63209, 121456, 136190, 92390, 87883, 51102, 38760, 94459, 105593, 150285, 178138, 160710, 94615, 48444, 38689, 54878, 87967, 111005, 110942, 85297, 19044]
18294A9044r6153L7994N6680M6802J08956Q5457m9380r7269r1564k5419N9298
18283E4446M052Q075O420L888L9375O7517J1821K880Q669O0785M553J6996K954
18270B92431N632r0718j10677l511k597K0707L9652P0449p3467o8239l0034N0301
18258I9929K920m6075k1870J3863J5850M3802l3446J0359N8647N0966J5276K1458
18246B31679o1322k3910k7437k7932k5102n1447M6891P047m5457q4003L578J28460
18234G1045L2145l340k5190j116L4938l6151m3816o743J4534k6206J7297r617
18222A7780j3803p49K897J9506l6784M0182L9462L3958j4479M0315L3806m2612
18210A19479o1165J8888q430k8856Q114M1964M8903j003L3676P915K2386J8144
$$ y = [19044, -77109, -39115, 17565, 64367, 173323, 258780, 209400, 112131, 20567, -4852, 54446, 58498, 66573, 72993, 76881, 116256, 183773, 195594, 198474, 207143, 267928, 272481, 289477, 292431, 298063, 207345, 96668, 93157, 90560, 111267, 150919, 221368, 147901, 79662, 49628, 99929, 102849, 56774, 34904, 48767, 64617, 108419, 74973, 85332, 143979, 194945, 210221, 231679, 170357, 146447, 119010, 91078, 65976, 14529, 61420, 68467, 23010, -60993, -57415, 71045, 103190, 99850, 74660, 73544, 108482, 72331, 28515, 21772, 36306, 10100, 27397, 17780, 3977, 3228, 6125, 25631, -11153, 29029, 68491, 102449, 87970, 128285, 162091, 119479, 58314, 77202, 68772, 39916, 48030, 89994, 138897, 137894, 171570, 179485, 201871, 220015]
18198B20015m1843j13738l6076R1395k8205n1088K1413J276l1208O0090j7733
18187G4298p7336P140K8831N9328L8358j4689l5649N9142J1242K0173j333m9896
18175A19609o0396m7793n9597L734O2517L1100j775r57o1239L6418j3177n5157
18163d6713l7323M3730P0575Q0977J7648j4947o0687n1348N4683M4538j1028M766
18151I4871j2084p5116m3353p753m741p5977l1039K8257k4063j66J2823P3762
18139f4579L5688k0381n23N9706M0611K6382J3127k2955m3637M685q406k3459
18127c741j2254K1090J3011l5238j8392j6941k1189L1760Q4251O9411k1387k5472
18115F4909m5030m9132N423J8018K2523m157l614L7113k8066o1351j7008k1944
$$ y = [220015, 178172, 64434, 28358, 119753, 91548, 40460, 61873, 63149, 31941, 92031, 74298, -3038, 4102, 32933, 92261, 130619, 115930, 80281, 139423, 150665, 170838, 169505, 119609, 59213, 11420, -48177, -44443, 18074, 49174, 47399, 46442, -14797, 21621, 8444, -46713, -84036, -40306, 30269, 111246, 128894, 113947, 53260, 1912, 56595, 101133, 90105, 94871, 82787, 7671, -35682, -43435, -48176, -124153, -155192, -126935, -150998, -151164, -138341, -64579, -28891, -49272, -49795, 9911, 50522, 76904, 90031, 67076, 23439, 28124, 19718, -3741, -15995, 5095, 18106, -17132, -35524, -52465, -73654, -41894, 42357, 111768, 90381, 64909, 19879, -29253, -23830, -5812, 16711, 12554, 8940, 46053, 17987, -43364, -60372, -82316]
18103h2316P2282N3999M4393j4619p1234J5271N4526j7729k6161M4776j9097o590
18091D7501M72J8743L7045r169n6949m6368j5321m8736M1064K5198N448j596l6591
18078c9259L2562K2710k4300l4638N4521L9809j4566L2864Q0350J30559L3926
18067C14538k2883p178m9168L108r8526l5533j3373m0625j3527K4737N5635P004
18055A24209p2450k7334J6923m1527k6201k7598P959N027J1437L7545J894Q5746
18043I5630N6376k9461n9688L0969p786k7225L0048K9085l0939p9393l1405K4309
18031E20M2787L596n193n1583j263j1189j4322J7113K6785N9188m2410o3077J6295
18018b2753N8068J1775J788j8809l6443n930L3933J3518p622Q053j7865l1574
$$ y = [-82316, -10034, 43965, 88358, 73739, 2505, 17776, 72302, 54573, 28412, 73188, 54091, 47501, 47973, 66716, 103761, 94592, 37643, -8725, -24046, -72782, -31718, -6520, -1072, -2668, -39259, -6697, 16013, -8287, -42925, 11596, 51405, 36839, 69703, 150053, 280612, 314538, 291655, 284477, 235309, 238417, 139891, 104358, 90985, 50360, 36833, 61570, 117205, 124209, 51759, 24425, 41348, -179, -26380, -53978, -46019, -40992, -29555, 7990, 9884, 95630, 152006, 122545, 62857, 93826, 86040, 58815, 88863, 117948, 87009, 7616, -23789, 520, 43307, 46903, 41710, -9873, -11136, -22325, -36647, -19534, 7251, 66439, 24029, -39048, -22753, 35315, 47090, 48878, 30069, -6374, -12304, 21629, 35147, 27525, 35578, 17713, -13861]
18006a3861o7809J4878k7026J0870O4576K3284N8464O927q9834o1809k2537O0026
17994d3851J2130j6636J5887N138k5422L5144j5451n75K089J9770O7640K4837
17982H0700k939j0939K4971N4461m5905n8026K0615k6413L8957L2781k919Q69
17970A06213n345J5171l891l9458k1806o0996k2818L8432L4678K9131K1321L6366
17958A26998O214M3865J3476l1628r562M4258M3980K4041o6222n3259M3206l1655
17946A53712m4905J4297q1862n8703Q494R0887J0242j8993l5516j3748j1718J6955
17934B9142L779M5458L0151l4907l6358L9067l9031k9282j1935j5661L8574Q5213
17922A04210m4331l6209j4733q4811n3405N1638R0071N2035o5654l0099K0J9040
$$ y = [-13861, -81670, -66792, -93818, -82948, -18372, 4912, 63376, 70303, -19531, -81340, -103877, -43851, -31721, -48357, -32470, -27332, -52754, -17610, -33061, -33636, -31547, -11777, 55863, 80700, 77761, 66822, 91793, 146254, 100349, 42323, 62938, 36525, 75482, 108263, 105344, 106213, 100868, 116039, 112148, 72690, 50884, -10112, -32930, 5502, 40180, 69311, 90632, 126998, 133212, 177077, 190553, 158925, 149363, 193621, 237601, 261642, 195420, 142161, 185367, 153712, 108807, 123104, 41242, -17461, -8967, 81920, 92162, 73169, 37653, 23905, 12187, 29142, 32921, 78379, 108530, 73623, 37265, 76332, 37301, 8019, -3916, -19577, 18997, 104210, 59879, 23670, 8937, -75874, -129279, -77641, 12430, 64465, -1189, -31288, -31268, -12228]
17910a2228K7196p6774l1477O6595L5932L7170J275l1297j05498P397L3645M9901
17898A837L617m8668L9115k4677K5425K2547o8124J1099J8324J4330k9401k506
17886c7082l6216l9478O872P8287L6682J7313M766k0719r925o5263L1712J0679
17874b2372M623k1074j1492L4251P482R411k2813K9235O507o608L3278J0494o2692
17861a1770N02j6362k87J4896L2483m4563l091o812O4077O212l9834o7170Q064
17848f3655J3371L5213j2210r094J5508J8909l4414J383m6714K5964J3078o963
17836d9624Q132r275L4222Q149p9355L0899P5601o1989n689O8974M8028j5654
17824E2419m9474r665K1771k6727J6750M3046J820k5469q382j6405n036K0973
$$ y = [-12228, 14968, -61806, -93283, -26688, 9244, 46414, 47689, 16392, -89106, -81709, -48064, 1837, 5454, -43214, -4099, -28776, -3351, 19196, -48928, -37829, -19505, -5175, -34576, -37082, -73298, -112776, -105904, -27617, 9065, 26378, 31144, 10425, 500, -64763, -33051, -22372, -17749, -38823, -50315, -16064, -8582, 829, -21984, 7251, 13758, 7150, 40428, 50922, -11770, -11268, -27630, -27917, -13021, 19462, -25101, -28192, -35004, 29073, 35285, -4549, -71719, -63655, -50284, -15071, -27281, -36375, -20867, -1958, -36372, -34989, -81703, -55739, -42661, -49624, -41492, -50767, -16545, -8396, -87751, -56852, 18749, -43240, -48929, 20045, 68073, 52419, 2945, -6720, 15051, -11676, 5074, 48120, 49940, 24471, 16089, -316, -5352, 15621]
17812A5621Q3127J3215m1021j5797M866N503p8458k3092m071J3864R7381N5690
17800A26828k8039J2600k9297k5434l4775R256l2621m4440J764N4111j3122l6860
17788d0029p6241L0650M9462M7202Q150k3854m5864l5007L2188J1962o257R709
17776c7929O8782O642k5371M860K352j7306k7406k3406N8515k4321K0244O179
17764A1835o2570J1512j7129k906N94j6068L4640P2335M5657K978M6916m5703
17752H2091o2832l3428m6442J0220Q0404J7005k5664p323l8260N592j9858o411
17740d4906M4796M1471l03n7491m4932j9886L0366L0765m2869l7203J8182P1020
17728a0990O0297k6925k1270k5984O2286L5185m0716m3949M2335K0542l6566j239
$$ y = [15621, 98748, 111963, 70942, 55145, 60011, 65514, -12944, -36036, -40107, -26243, 71138, 126828, 98789, 111389, 82092, 56658, 21883, 31139, -1482, -45922, -44158, 9953, -3169, -40029, -116270, -85620, -36158, 11044, 19194, -4660, -50524, -85531, -53343, -41381, -47638, -37929, 30853, 37495, 12124, 16984, 19336, 2030, -25376, -48782, 9733, -14588, 5656, 11835, -50735, -39223, -56352, -59258, -58664, -74732, -40092, 32243, 77900, 80878, 127794, 82091, 19259, -14169, -60611, -50391, 30013, 47018, 21354, 14031, -24229, -18637, -38495, -44906, -110, 41361, 41058, -16433, -61365, -81251, -50885, -20120, -62989, -100192, -82010, -10990, 49307, 22382, 1112, -24872, 37414, 72599, 31883, -12066, 30269, 50811, 14245, 13006]
17716A3006k0666l105M6656Q416R864m0860m3243M084J6109k6137N967N4974k21
17703B4844m7624l4080l7332m2206K1025P3198m8422l342R1737N0035k1201k3709
17691B923j4841m9785J7306N7551K774m9788L5309K4460m5507k6787K2222l7269
17679f1432j0391L9590L4325q268p4780K2397j2247q7256k2773k3107K5340R3173
17667h5429N8864M5162J8288n9016p3282l6263N7911J1704L8890K3752o570j1264
17655a7253K3651L1117J9270n311j2877o7569l1174M8973L6536k9776N14n1999
17643e5898L9265O6636o15k2269k0641O8186k560n2050r1110j5060O5351O3605
17631D2840J8107O4155P4553j8573n0570K3508N052J5358K4899q7598j25745m8634
$$ y = [13006, -7660, -10765, 35891, 44307, 54171, 13311, -29932, -25848, -9739, -35876, -29909, 25065, 24844, -22780, -56860, -94192, -136398, -115373, -42175, -90597, -93939, -2202, 47833, 26632, 2923, -11918, -61703, -44397, 13154, 15928, -33860, 1449, 25909, -19598, -46385, -24163, -61432, -71823, -32233, 2092, -6176, -80956, -58559, -70806, -158062, -180835, -203942, -178602, -85429, -26565, 18597, 36885, -22131, -95413, -131676, -73765, -62061, -23171, 581, -5989, -17253, 6398, 37515, 56785, 51474, 38597, -28972, -60146, -11173, 25363, -4413, -3899, -55898, -16633, 50003, 49388, 27119, 6478, 74664, 72104, 20054, -71056, -86116, -20765, 42840, 60947, 125102, 199655, 181082, 130512, 154020, 159072, 174430, 199329, 111731, -14014, -62648]
17619f2648M3622L3710o354K4197J6917k0942l4517j908k6213j9717n874L2095
17607b7632O9457j5567l0943L8775M8288p1216p6924r479O5433J4761m2795M0553
17595B711L0411q746O402J0198p920L1709k2497j2081l5374o9624q35K9593N8318
17582A2265J6371n2020R824j6143j0033N6420l747l3779K8151L8227k2826J2198
17570C4908J0556r9627J2655J572J5572P054L173m70M0200n7519o9406J1097R963
17557h0272O2451M7213j056n4603L258O5395m680M2937J5407l5374j2814l8784
17545I078l3170J1547r426L2974L5967J3216n74L0015l1198j6879O107r543m4139
17532f025l8529P127j6749K2183R288l5055K5044P8904q761q4531n7071N5990
$$ y = [-62648, -19026, 14684, 8330, 32527, 49444, 28502, -6015, -7923, -34136, -53853, -59727, -27632, 41825, 26258, -4685, 34090, 82378, 11162, -65762, -75241, -9808, 4953, -37842, 2711, 33122, 24376, 30778, 40976, 33056, 64765, 42268, 30187, -5187, -74811, -75646, -46053, 12265, 28636, -23384, -13560, -29703, -39736, 16684, 12937, -20842, 7309, 45536, 22710, 34908, 45464, -54163, -41508, -39936, -24364, -17310, -14137, -14607, 25593, -31926, -101332, -90235, -80272, -17821, 29392, 28336, -26267, -23009, 42386, 37706, 80643, 96050, 60676, 47862, 9078, -24092, -12545, -21971, 11003, 46970, 60186, 59612, 89627, 58429, 41550, 47657, 38114, -6025, -44554, -37427, -54176, -31993, -22705, -57760, -32716, 46188, 37427, -47104, -104175, -48185]
17520d8185O4569N4093L2475m171l0785l8235l3758M0288j5348n2934j3099N4942
17508I852L2220l1766r02J8008j3731j3321j0187M154l3103j4163J7105K2844
17496a2990J0291L9169n5768o040O8139m0789k4357J7719K0356J7242O2555o5527
17484C0000k4172L3346l1063j5205K6761J7752o6757M004M2179O0949j1005p150
17472E9639L5292O3092l8389n7333L0552l891M3754k2342k2041O179L24m8449
17460D6387j9796l3412L4917n0238K0833L5937l422n185m1348L083M544K6468
17448A8768J0052j1222K1588k7236L061L7170N46J810k2016n9943K4334K5182
17436B2094n311J7982n6266l43M2901M6540J0092J1064J3208L8123j090q5421
$$ y = [-48185, 16384, 70477, 102952, 98781, 67996, 29761, -3997, 36291, 20943, -31991, -45090, 9852, 42072, 10306, 9404, 27412, 13681, 360, -9827, -5673, -38776, -52939, -35834, -12990, -2699, 36470, -19298, -25338, 42801, 2012, -22345, -4626, 15730, 32972, 95527, 30000, 5828, 39174, 8111, -7094, 19667, 37419, -29338, -25334, 16845, 77794, 66789, 59639, 94931, 158023, 119634, 62301, 92853, 88962, 132716, 110374, 88333, 94512, 94836, 46387, 26591, -6821, 28096, -22142, -1309, 34628, 31206, 26021, -15327, -12244, -7700, 18768, 28820, 17598, 39186, 11950, 15011, 52181, 52727, 54537, 32521, -27422, -3088, 22094, 16783, 34765, -21501, -21844, 21057, 67597, 77689, 88753, 101961, 140084, 138994, 53573]
17424E3573j0488M7802p396J6052n1981J5602J0721K1068L7101m1850K2839j005
17412A12038j2790J4394j8883l7191l487m0537L3655P2975L4663J6818j9846j6815
17400A34994p8558n0533J53N1898M3673j7723Q42n628J5549n4345N820O9406l5301
17387H0247l4453K8212J896k6020K2114k0647M6667M2558N4281J8439l1537p6218
17375A05539o571R423k1258j235j7447O771K523M4282M850O2905l1421n47m2834
17362A14980m0141P007J692n262l2852Q4903J6265J5369Q601q55k1541M663K0515
17349A73344M3895p641l0309n09L9760r265M641l1790j6728m9387j5213L7789
17337A38587K961J2145J01580N7220j1895J822l6810q3444L7436m635m7717J5184
$$ y = [53573, 43085, 90887, 83491, 99543, 47562, 63164, 73885, 94953, 132054, 90204, 113043, 112038, 99248, 113642, 94759, 57568, 54081, 13544, 47199, 120174, 154837, 171655, 151809, 134994, 56436, 5903, 6056, 57954, 101627, 83904, 84746, 79118, 94667, 40322, 46142, 115548, 80247, 45794, 74006, 75902, 49882, 71996, 51349, 98016, 140574, 194855, 213294, 181757, 105539, 98968, 108391, 87133, 85898, 68451, 75222, 77745, 122027, 126877, 189782, 158361, 157814, 114980, 74839, 81846, 83538, 78276, 45424, 130327, 146592, 161961, 170562, 169707, 148166, 152829, 173344, 217239, 209598, 179289, 178780, 218540, 209275, 213916, 182126, 165398, 116011, 100798, 138587, 141548, 153693, 255273, 312493, 300598, 302420, 265610, 182166, 219602, 214967, 167250, 182434]
17325A82434M3777N0629L2950L1127j4944o8418L9169J3643l3803q906N9807J5510
17313C42975L695K8624k7790k4240k847p603m5841N086K1790Q65K2444M368K9323
17300C50849N1451M958q0136J212M3181M513K0997O2770M2988J3178j7260n6864
17288D41837j645K202K1450J9204N6107M134K7894j051L0821L8068J9244J4515
17276F72780J006J00618J8446k1180K7222j4524l9698L946M6721K6070k2758P912
17264H06561L1344M3293K7619P8041N545r356L5085K6579M8314J8196J7118K4430
17252A152769J0314K7681Q061K3073J5053J0189N2987j172K665o263M8831M8285
17240A392473N2731J06181P6355K905J00763M131l2644j7823P1194O6723Q7104
$$ y = [182434, 226211, 276840, 309790, 340917, 325973, 257555, 296724, 310367, 276564, 267658, 327465, 342975, 346670, 375294, 347504, 323264, 320417, 312814, 266973, 272059, 293849, 294714, 317158, 321526, 350849, 402300, 407258, 327122, 328334, 371515, 376028, 397025, 459795, 502783, 515961, 498701, 441837, 440192, 442394, 463844, 483048, 539155, 543289, 571183, 570132, 600953, 639021, 658265, 672780, 673786, 774404, 792850, 771670, 798892, 784368, 744670, 748616, 795337, 821407, 798649, 806561, 837905, 881198, 908817, 986858, 992403, 983047, 1018132, 1044711, 1093025, 1111221, 1128339, 1152769, 1163083, 1190764, 1198825, 1221898, 1236951, 1247140, 1300127, 1298955, 1301620, 1295357, 1344188, 1392473, 1445204, 1551385, 1627740, 1630645, 1731408, 1735539, 1702895, 1685072, 1756266, 1822989, 1910093]
17229A910093p359j17944j9510Q1196J3935N8182k647j756l495N116q326m3658
17217A863827J2055Q432l6718J2968K253N9128K1772M2276J9468n759k6780n9716
17205A913206o596p951n6589k3950l001O15j05729o3028n1062R361O113L68j684
17192A610073j04495m2600l5295k827p122k0826p5640k0650J4245K3441m3180
17181A295124p2329n3774l6027j0069j4029l105k2039p0121j6143l6789m1905
17170I18794m7813m0248j4901M2032m2846J3475m621K9978j0066k5265j06568
17159G11951k5647n3123k0716k0690k3141k6981j0327M6590N4552k7119n9849
17148E45500j5060q3437j7586R7040N2699J7346n7706n6552L966n3931n2153L9807
$$ y = [1910093, 1902734, 1784790, 1765280, 1846476, 1860411, 1918593, 1915946, 1914190, 1910695, 1915811, 1907485, 1863827, 1875882, 1884314, 1847596, 1860564, 1862817, 1921945, 1943717, 1985993, 2005461, 1999702, 1972922, 1913206, 1906610, 1898659, 1842070, 1818120, 1815119, 1815734, 1710005, 1646977, 1595915, 1605276, 1611389, 1611757, 1610073, 1505578, 1462978, 1427683, 1424856, 1417734, 1396908, 1321268, 1300618, 1314863, 1338304, 1295124, 1222795, 1169021, 1132994, 1122925, 1108896, 1105791, 1083752, 1013631, 997488, 960699, 918794, 870981, 830733, 815832, 857864, 815018, 828493, 823872, 853850, 843784, 818519, 711951, 686304, 633181, 612465, 591775, 568634, 541653, 531326, 577916, 632468, 605349, 545500, 530440, 447003, 429417, 526457, 579156, 596502, 538796, 482244, 486210, 432279, 380126, 419933]
17136D19933L0330O800j0002l7471L3041J1068l500k433k2072J2357l6628l1097
17124C70326q1315l3719M1406P8210M2681k9850m9921m3287l2594K0579J6078
17113B98594p643l685k4150n3198Q467J2433j0993Q308L885J9321l6396o3999
17101A50944k5772j1715K512J788l3715L4364n380J6186L2839K4931j8478M5028
17089B13532r523k4248n4323k0191N2419M454J3298n5627J8K0083m9249j6600
17077G4043j9086L5615N3889J6654p143j8196O9535J0911o1037l2111k0373N7290
17065A59991l5362n2505K021m3307q837o694n4447l8606L4934M4779J3254L1066
17053D6287J6496P2874K66j6408n1282m7862l5683K7325K8407Q177m100l907j3076
$$ y = [419933, 450263, 457063, 447061, 409590, 442631, 453699, 450199, 447766, 425694, 438051, 401423, 370326, 289011, 255292, 296698, 374908, 417589, 387739, 337818, 294531, 261937, 282516, 298594, 290951, 287266, 263116, 209918, 218385, 230818, 219825, 228133, 232018, 251339, 214943, 150944, 125172, 113457, 115969, 117757, 84042, 118406, 113026, 129212, 162051, 186982, 168504, 213532, 204009, 179761, 125438, 105247, 157666, 162120, 175418, 119791, 119809, 139892, 90643, 74043, 54957, 90572, 144461, 161115, 153972, 135776, 205311, 216222, 155185, 123074, 102701, 159991, 124629, 72124, 74145, 30838, 22001, 15307, -39140, -77746, -42812, 1967, 15221, 46287, 62783, 135657, 135923, 119515, 68233, 20371, -15312, 12013, 40420, 48597, 44497, 40590, 27514]
17040B7514j7479J7923m1746m5981l1056K1310R8910J6236m4234N833J0706k966
17028A4970k922J1436L0136M810N4787K1141L684m2390k0297J9580k3872q981
17016F2082j047k4182J7948J9783p5405l5191L7749l3239L305k8471J6679J1989
17004b8000K5430l6709n1752N0051K4648M069j8499o1903M3572N2112k7989M1362
16992A6392L2385j2898n1241l000o254k8960N4740M1324m4205j810J7436J5145
16980B9054K3018q342p2907n1829R202P136M6414K1143K8297j0571J7150K1797
16968E9562J7782m8062k1089k4265l4720l2821m828l3705j362N7003k5485j3154
16956a05144M2113J11070K1652l7912m1163r105L8923L294K5925L551K3366l6692
$$ y = [27514, 10035, 27958, -13788, -59769, -90825, -69515, 29395, 45631, 1397, 7230, 17936, 14970, 12048, 23484, 53620, 58430, 113217, 134358, 138042, 95652, 75355, 94935, 71063, 62082, 61035, 36853, 54801, 74584, -821, -36012, 1737, -31502, -28197, -56668, -39989, -28000, -2570, -39279, -91031, -40980, -16332, -12263, -30762, -92665, -49093, 3019, -24970, 16392, 48777, 35879, -15362, -18362, -24616, -53576, 1164, 42488, -1717, -3527, 13909, 29054, 52072, 43730, -29177, -81006, -71804, -64668, -18254, 2889, 31186, 20615, 37765, 59562, 77344, 29282, 8193, -16072, -50792, -83613, -88441, -122146, -123508, -66505, -91990, -105144, -63031, 48039, 69691, 31779, -9384, -18489, 20434, 23728, 49653, 53204, 76570, 39878]
16944C9878j8612k8275l6707M8981P2657l8771n5306K236R2516J3997o3723n1360
16932b2489j627M5607K1211k774k6022n2626k5594o299L7444L2280P2853J4927
16920H6891n9127j2602j8580q831J9416l7940o556l6674j3098j3024L8390M95
16908f1240p749Q6384J0258l8537q230M8502J963n5414P2441j961n663l1590K446
16895A1610K4158j7128o9244j3219K9665J8443n266L4825r0l0824R495J2181J3707
16882A8313j853k5780J3989k0548m577K2198M220k2052m5294J961L3372j6149
16870d2200m5247k1105L2068P2586J8370K6310j7699J7208m4724l1541J0697J9293
16858e984J8568q565k9852n3224K4668M3328j9487Q996M0480J0282P515k4574
$$ y = [39878, 21266, -7009, -43716, 5265, 77922, 39151, -16155, -13919, 78597, 92594, 28871, -22489, -24116, 21491, 42702, 39928, 13906, -38720, -64314, -70613, -33169, -889, 71964, 86891, 27764, 15162, -3418, -12249, 7167, -30773, -37329, -74003, -87101, -100125, -61735, -61240, -68989, 17395, 27653, -10884, -19114, 29388, 31351, -24063, 48378, 46417, 40754, 9164, 11610, 35768, 18640, -50604, -63823, -34158, -15715, -20981, 13844, 13754, -17070, -7575, 4606, 18313, 16460, -9320, 4669, -15879, -20456, 1742, 5962, -16090, -61384, -59423, -26051, -42200, -87447, -108552, -76484, -3898, 14472, 40782, 23083, 40291, -4433, -35974, -25277, -5984, 12584, 4019, -25833, -79057, -54389, -11061, -30548, -21552, 18928, 29210, 36725, 12151]
16846A2151K0040M0521M8873l1794j31528o953K6810j2623N6427L6799k1941k2287
16834A4495K9719J3997k8497j8877j2148j1468K9467o631j0450O237k2775k846
16822a9777J2793j3948K2130q979k4506K005N3052R723m7101J3367L4240N09k8250
16809E258k0616k6451j0086n540k2470N728L1067r047r0520N1563R7090J304q0735
16796g3455l9795L2429J4659N925m7986o0334p91P4728N5913Q370K3497l7983
16784d4823j625K6139N8817P5940p624p0336k1274N072m9185J2129n5988o2645
16772a35403o1734m0168O1506N6849j8953J2973K4014Q6237M150l2295J5126J2639
16760a5059k2234j2645L4324O653l9026J3588K486K0918j9057N7596m683k790
$$ y = [12151, 32191, 72712, 121585, 89791, -41737, -48690, -21880, -34503, 21924, 58723, 36782, 14495, 44214, 58211, 29714, 10837, -1311, -12779, 16688, 10057, -393, 5844, -16931, -19777, -6984, -20932, 1198, -7781, -32287, -30282, 22770, 32493, -14608, -1241, 32999, 33508, 5258, -15358, -41809, -51895, -57435, -79905, -74177, -43110, -52157, -142677, -91114, 5976, 7280, -73455, -113250, -80821, -66162, -60237, -108223, -168557, -169348, -94620, -38707, -30337, -6840, -44823, -46448, -20309, 38508, 114448, 106824, 36488, 15214, 20286, -28899, -16770, -72758, -135403, -197137, -237305, -175799, -118950, -137903, -124930, -100916, -14679, -10529, -42824, -27698, -15059, -37293, -49938, -15614, -8961, -47987, -34399, -31913, -10995, -30052, 27544, 22861, 20071]
16748B0071l2357n3992m5661L9634M6682M9247n3892K10l0859J1954O2142L4378
16736D7557K471N1910m2535o3644l9266Q66j7877L520j5789p372L5217M8449p543
16723d036r6198n9647J226P3291K9921k7306m5714O4501L4114N4639J1671o2315
16711b5853n501j8904m05J0496J6716Q471m5552L1903Q673m9147M3425j2506k7689
16698f5873J5214M0650L495m8572l6080l3897J2634J6434K4192k0079k4552m6776
16686a63210L3263J22918k8970l2986l4132q5906k4506O6060J6475L3437J22026
16675B4469J01275j2583l3961k6953o5903k8202K2673L5714l416l1308j649m7671
16663f7515k5272J1725J2264M245j5402j4315Q737j2808r152J798K9621P2927
$$ y = [20071, -12286, -66278, -111939, -72305, -25623, 23624, -30268, -30058, -60917, -48963, 13179, 47557, 50028, 101938, 59403, -4241, -43507, -42641, -60518, -56998, -72787, -80159, -44942, 3507, -4036, -100234, -159881, -158655, -85364, -55443, -82749, -128463, -63962, -29848, 24791, 36462, -25853, -31354, -50258, -50663, -40167, -23451, -14980, -60532, -28629, -19956, -69103, -25678, -38184, -65873, -50659, -10009, -6514, -55086, -91166, -125063, -112429, -95995, -71803, -91882, -116434, -163210, -129947, -7029, -35999, -68985, -103117, -189023, -213529, -147469, -130994, -97557, 24469, 125744, 113161, 79200, 52247, -13656, -41858, -19185, 16529, 13113, -18195, -19844, -67515, -92787, -81062, -68798, -64553, -79955, -94270, -85533, -98341, -107493, -105695, -76074, -3147]
16651c147j5723m2997O5923M4347q5102k4827J1273o539L113l0257N388Q4283
16639E735M9478n2762p0395k9723J5746M3388L3348N514O8045r567q4163j791
16627b7147M4885K743M804j6158k0312L403L8467P766r8514p7481K2822J7015
16615i7707j3994k556L8452R2525J4369k8512l6426l4842m411M388K6735K674
16603c9305N7912o3413k0344R972M8311k8126o0315N7519j1618l6673q643n6019
16591a50742L0364K4987J9905L0826P499j5685j4706j0175J8414M3231j0643l1539
16579e8264P633k0665J6358N9582o4810Q610j2095k8102L2569J2748m1449J9776
16567f8109Q5859j69n7329l3708R426J7647m5403n4434j0590R660L8243m843k2302
$$ y = [-3147, -18870, -61867, 4056, 48403, -36699, -61526, -50253, -56792, -53679, -83936, -78548, 5735, 55213, 2451, -67944, -97667, -81921, -38533, -5185, 329, 68374, 58807, -25356, -27147, 17738, 20481, 25285, 9127, -11185, -7782, 30685, 38451, -60063, -137544, -114722, -97707, -111701, -114257, -75805, 16720, 31089, 2577, -33849, -68691, -73102, -68714, -41979, -39305, 18607, -44806, -65150, -55178, -6867, -34993, -95308, -37789, -49407, -86080, -94723, -150742, -120378, -95391, -75486, -44660, -37161, -52846, -67552, -77727, -59313, -16082, -26725, -58264, -50631, -71296, -54938, 4644, -60166, -51556, -63651, -91753, -59184, -46436, -87885, -68109, 17750, 17581, -39748, -73456, -64030, -46383, -91786, -146220, -156810, -147150, -108907, -113750, -136052]
16554a36052K2752K3529L9304K3402J7161J7846K8727O3411R070K866n943k3450
16542H2623M571l3431j7449O289J4879m4763n2123q462J2001O8972L1472n4401
16530A0178k4998L6593m654L5146j2826Q454n7552m7436J5168j1117k2197K5608
16518d9633M2181k3081K018L1995j8516k593l1179k7444K8967P3573k0331K0913
16506B6870J8972O7725K1647n8042p3492n6721l9583k5197M614J4437M7972M3842
16494f956K0666p6357m2411M2504K4000M4869j6350j2716l9117K371l902Q637
16482e4762k9960r101M0976j1772j2480l7913j3408N7176l3246l6597o505P7486
16470g0106N9553K8958o737K3061p6914N859K5933o6814m3981J8930M6329k5808
$$ y = [-136052, -113300, -89771, -50467, -27065, -9904, 7942, 36669, 100080, 109150, 112016, 106073, 82623, 87194, 53763, 36314, 42603, 57482, 12719, -39404, -47866, -35865, 33107, 64579, 10178, -14820, 21773, 17119, 52265, 39439, 47893, -9659, -57095, -41927, -53044, -75241, -49633, -7452, -30533, -28515, 3480, -15036, -17629, -48808, -76252, -47285, 26288, 5957, 26870, 45842, 113567, 135214, 77172, 3680, -53041, -92624, -117821, -113207, -98770, -50798, -6956, 13710, -62647, -105058, -62554, -38554, 6315, -10035, -22751, -61868, -59497, -63399, -54762, -84722, -93823, -52847, -64619, -77099, -115012, -128420, -71244, -104490, -141087, -147592, -70106, -10553, 18405, 11668, 34729, -42185, -36326, -10393, -77207, -121188, -102258, -55929, -81737]
16458h1737R224m8322K7320M1839L4378K3614j8755p6525l1397K560N9899K5891
16446c2011N2011k1358m5763m6123J4440q883K1307k4495l0965N9303Q8533K2856
16434D8852j1653o8868n6215M044K8934L4642N524l9285k9817K0872R213J5544
16422c8213J3381m103j8929J8421l3937j7000j1316N3751j7080m1292K2946k7448
16410a00819j93Q7378m3825j6173j4895K02m6013r2514J1927J06401K0835N4179
16398c3510J01272p8531l5460n1529K4688K0054K5216j2438l5656k1916k9613
16387a27423M818O2881N8973m5925L3022K3230q736J590J4695j6104K795k7036
16375b3220m9418k2898K6160m553j7161l7113r054P021L2462J8226O0437L0570
$$ y = [-81737, -72513, -120835, -93515, -51676, -17298, 6316, -12439, -88964, -120361, -117801, -57902, -32011, 20000, -1358, -47121, -93244, -78804, -87687, -66380, -90875, -121840, -62537, 25996, 48852, 37199, -31669, -87884, -83840, -54906, -20264, -14740, -54025, -83842, -62970, -53757, -38213, -24832, -28935, -47864, -29443, -63380, -80380, -91696, -37945, -55025, -96317, -73371, -100819, -101012, -13634, -57459, -73632, -88527, -88325, -134338, -226852, -214925, -108524, -87689, -33510, 67762, -10769, -46229, -97758, -73070, -53016, -27800, -40238, -75894, -97810, -127423, -122605, -59724, -751, -46676, -13654, 9576, 840, 2430, 17125, 1021, 3816, -23220, -72638, -95536, -69376, -73929, -91090, -128203, -137257, -130236, -97774, -79548, -19111, 11459]
16363A1459m8405j3438j3357j8193K1286r385K9749O7563J8736l3378j9284k6890
16351c3537j6434L2123M6832J5371r1437p9935J0466K4046M4526J5721j5740p9804
16339a27802j8963Q9684K0283J4437n4057n4742k828Q349J2069r96K7291K3570
16327f3705k7414j0731j0137J5331r834J4701N7366L9837j8802L1633J9335p0975
16315c3395n4313N3212J8031N542J7650K3014m9339m3540m0322J7534K0796l7037
16303a02167n2022m5345N3650K9734n7882m2877K0888Q4091N9378P3184K3663
16292D4295J5256j7445o8398k0077L553k7937R663P5670k4417p242j9138k7201
16280f3418K0161J779Q1290K5261m7737j9669J6028m0982q3795L5623k4439M0693
$$ y = [11459, -36946, -50384, -63741, -81934, -60648, -70033, -40284, 27279, 46015, 12637, -6647, -33537, -49971, -17848, 28984, 44355, -47082, -127017, -116551, -92505, -47979, -32258, -47998, -127802, -146765, -57081, -36798, -22361, -76418, -131160, -133988, -125639, -113570, -114566, -87275, -63705, -91119, -101850, -111987, -96656, -106490, -91789, -34423, 5414, -13388, 18245, 37580, -33395, -87708, -34496, -16465, -10923, 6727, 29741, -19598, -63138, -103460, -85926, -65130, -102167, -154189, -199534, -145884, -116150, -174032, -216909, -196021, -111930, -52552, 20632, 44295, 59551, 42106, -26292, -46369, -42816, -70753, -61090, 14580, -9837, -17079, -36217, -63418, -43257, -41478, 39812, 65073, 17336, -2333, 13695, -27287, -111082, -75459, -99898, -59205]
16268e9205k7848M9096J04605m063m4643l7638k1788j7179j6843O1108J1281k9441
16256c2558L1641q365l5684K5404J1259J3744K0369L0637n9821k5781k5651N1223
16244c583O430J7982p2084k5324o160k2780m4564n8394M5362P5582M951K9549
16232e3033P5493O860m0944M2441k9595r3235o523j0016K5278M1027J5132r027
16220c6142j0997M8173K904o2481o8989J018J9550j8707M4322O0705K8664L729
16208A1749n614m3461K7035O3628k5472j5861L6608N053p3006m1292K6282k9471
16196f3822k8650M2832N9811J8222m8021l1682K4616J418Q731k5874J1779N8924
16184B8284K1960o8207p9294o2499k8500J2879O0359j2053m8392J3095K1810N132
$$ y = [-59205, -87053, -37957, 66648, 62585, 17942, -19696, -41484, -58663, -75506, -14398, -3117, -32558, -917, -9282, -44966, -19562, -8303, 5441, 25810, 56447, -3374, -29155, -54806, -3583, 2847, 20829, -51255, -76579, -82739, -105519, -150083, -208477, -163115, -87533, -82582, -53033, 22460, 29320, -11624, 30817, 1222, -92013, -98536, -108552, -83274, -42247, -27115, -36142, -47139, 1034, 3938, -58543, -127532, -126514, -106964, -125671, -81349, -20644, 8020, 11749, 6135, -37326, -10291, 53337, 27865, 12004, 48612, 53665, -19341, -60633, -34351, -63822, -92472, -49640, 10171, 28393, -19628, -51310, -26694, -25276, -16545, -42419, -30640, 28284, 50244, -17963, -97257, -159756, -188256, -175377, -115018, -127071, -175463, -162368, -140558, -135426]
16172a35426J6351L7505K7105l3149j8334L6626k0027J4320J5498n306J3167J7755
16160c3915l1670r188N202K6003K3168L5720l6237J6752k7074n8433J6530N7166
16148a5976P978k2477k558N5746L3681R846p9211q8859M6281m8383L9818K3476
16136d0638k1997J186n699l7821j2405Q9079J407J0673M6357L5774L5332P33n4504
16123D7477j2682n136j4579l6535O708K90n7102j9432j2375L4430K2518p6325
16111a22743l0576J4764K8438L8341L5394M120l6168k9974N1769j6168k3643N1377
16099c5069L9909K7879l7605l3824J7591r448k087K5036M2059K8238q8479p3865
16087i9665l3949L6541L3761J3048l9122j0386j1437M0020O1944m7372m4254P748
$$ y = [-135426, -119075, -81570, -54465, -87614, -105948, -69322, -89349, -75029, -59531, -64837, -51670, -33915, -65585, -74773, -69571, -43568, -20400, 15320, -20917, -4165, -31239, -89672, -73142, -15976, -7998, -30475, -33033, 22713, 56394, 66240, -12971, -101830, -55549, -103932, -64114, -40638, -62635, -61449, -67148, -104969, -117374, -28295, -26888, -16215, 30142, 65916, 101248, 101981, 47477, 34795, 29659, 15080, -21455, -14747, -14457, -71559, -90991, -103366, -68936, -46418, -122743, -153319, -138555, -110117, -71776, -36382, -32262, -68430, -98404, -46635, -62803, -86446, -35069, 4840, 32719, -4886, -38710, -21119, -30567, -32654, -7618, 34441, 62679, -25800, -99665, -133614, -97073, -63312, -50264, -89386, -99772, -111209, -71189, -9245, -56617, -100871, -93123]
16075i3123K2217Q4863k249j2583O3234O9068k136o2890n6321L6610j4839m2395
16063a0544k4536j7686L741L1544K9001M6068P888k2485k0275R306o831p5367
16051e0176m6110m6789L1375O1049l903q3760L6427L2914J7380N969J3707L9540
16039G623l2985o2726l692l0704n4339j1566M8031J09568K6554O369l5197l31
16027c3395j4993K1308L342k7626n6355m9372J1192M8298O7982K3596J0527O990
16015A1494l8394q434j2185j898m4341N3580O884O872P099j7509J5836N1965L1843
16002F2812K477r2782r3322L8906J1061M0604K3419k2779m0803j0713l149j9872
15990a04141J2585l7959L5447M2563m6953k1976j1557q53N6368N2708P345J9765
$$ y = [-93123, -70906, 13957, 11708, -875, 62359, 131427, 129291, 66401, 10080, 46690, 31851, -10544, -35080, -52766, -49025, -17481, 11520, 57588, 65476, 42991, 22716, 32022, 25191, -50176, -96286, -143075, -111700, -50651, -54554, -138314, -101887, -68973, -51593, -45624, -31917, 7623, -25362, -88088, -91780, -122484, -176823, -188389, -140358, -30790, -4236, 2133, -33064, -33395, -48388, -27080, -23738, -51364, -107719, -157091, -145899, -97601, -29619, -6023, 4504, 11494, -26900, -35334, -47519, -49417, -93758, -40178, -33294, -26422, -19323, -36832, -20996, 30969, 62812, 65289, -27493, -120815, -81909, -70848, -30244, -6825, -29604, -70407, -81120, -84269, -104141, -91556, -129515, -94068, -51505, -98458, -120434, -131991, -132844, -76476, -23768, -16423, 3342]
15978C342J3256K5738r4k8740j6586m6368m2344j1420R13N1871J6666J4956l4785
15965e3595o2250M1473M5642K6376m7487J2624J8744n326j9144k480j0107j3300
15953f8830m383K2751J4873K3044J0461n332j5283p8594J8315M1809j2882k1978
15941g6029Q973O35O93m8539l2181k2623K1295N5794M1946O8521l709k4312k95
15928i831k799m3197k3847m6538K0819K6911N2222m8187r793M4373P080L6548
15916C761k7797j2948J4145j8170J8114n06n509n122o5495L65O2596j5817j1815
15903f4198P497L4510K3100o1973k7879J3419l3084J2929j1895L015N1625J2691
15891d0243o5274o949O2119J9778r093j849m944Q403o4527m652L3987k140J7991
$$ y = [3342, 16598, 42336, 42242, 13502, -3084, -49452, -91796, -103216, -102303, -50432, -33766, -18810, -53595, -115845, -74372, -28730, -2354, -49841, -37217, -18473, -23799, -42943, -45423, -55530, -68830, -73213, -50462, -35589, -12545, -2084, -7416, -22699, -101293, -82978, -41169, -54051, -76029, -67056, -66421, -65728, -114267, -146448, -169071, -147776, -91982, -50036, 18485, 14776, -9536, -9831, -12630, -55827, -79674, -126212, -105393, -78482, -26260, -74447, -84240, -39867, -32787, 3761, -24036, -36984, -22839, -41009, -22895, -23401, -28910, -34032, -99527, -99162, -36566, -52383, -64198, -56701, -22191, 909, -61064, -88943, -75524, -108608, -95679, -107574, -104559, -52934, -40243, -105517, -112466, -50347, -30569, -39662, -41511, -46455, -38052, -102579, -107231, -73244, -75384, -57393]
15878e7393l1880K360j2057K7375J1046K1468J2152k1094k2044K9494n0570j7248
15866a08391O4444M3782j6222j5402k3769k5599M0700J49241L1901k8448j8205
15855I4032o562j7812p5340k2856L015K1818O9745K0173j941n6995m5138p3464
15843i1325j8613M159r82J4955N926n184O579N884J5511R515l1502k3095o499
15830a14671K9998M3728K8860L6553j663q1196j2025O1283K2259n0348o7319J5557
15818h8984K1689L7592L1629r768l0007q8824J24152J2451p1586r492M0639m949
15806c5458q341j2358P0680J0496j4046j3286n8594l7285k6269j457L2681K9530
15794f3707K4411R420J075N3788J6456l7849o9637l4254l2467M0758O1107J5291
$$ y = [-57393, -89273, -86913, -98970, -71595, -60549, -39081, -26929, -48023, -70067, -40573, -91143, -108391, -43947, -165, -16387, -31789, -55558, -81157, -40457, 108784, 140685, 112237, 94032, 87470, 69658, -5682, -28538, -25523, -3705, 66040, 86213, 84272, 27277, -17861, -91325, -109938, -105779, -106761, -91806, -85880, -91064, -84485, -78601, -63090, -53575, -85077, -108172, -114671, -84673, -40945, -12085, 24468, 22805, -58391, -70416, -9133, 13126, -37222, -104541, -88984, -67295, -29703, 1926, -7842, -37849, -126673, -2521, 9930, -61656, -71148, -30509, -35458, -43799, -56157, 14523, 25019, 10973, -2313, -60907, -98192, -124461, -125918, -93237, -63707, -39296, -29876, -28801, 24987, 41443, 3594, -66043, -100297, -132764, -92006, -30899, -15608]
15782a5608K5747n9886k7353Q643M0397J2767q7763k8837q080K9472O3992L2593
15770a3916j4113M8056M093L3577j0963o709n7756l194P7359m8223n2370Q610
15758c5549p841j4502J0093l5829k5440j1019r964M3415M1549P662j6442J2107
15746d1760l2596l1590k9479k279p3423Q1783N7532N1511K3421l7815p554K8724
15734a3525L7247l9738L594K4781m8382J698J520J9983L0761m862l2403r9572
15722a18898o1266O9433L1007L0826L4725l3844m0633M0101J1345j30848p984
15711a76036O4070M1703L8699j527o5862J0919K3755J3719O9955k6225j830k8867
15699c7527p7138m0093J3569M4726L8693J0846l9384j2180q94L8669Q746K3838
$$ y = [-15608, 10139, -49747, -77100, -68457, -28060, -15293, -103056, -131893, -139973, -110501, -46509, -13916, -28029, 20027, 24120, 57697, 46734, 40025, -17731, -20925, 56434, 8211, -44159, -35549, -43390, -57892, -47799, -83628, -109068, -120087, -130051, -86636, -45087, -37425, -53867, -41760, -74356, -105946, -135425, -137704, -211127, -129344, -71812, -20301, 3120, -34695, -42249, -13525, 23722, -16016, -12422, 12359, -36023, -34325, -32805, -12822, 17939, 13077, -19326, -118898, -180164, -110731, -79724, -48898, -14173, -48017, -88650, -48549, -37204, -168052, -176036, -111966, -70263, -31564, -33091, -98953, -88034, -64279, -50560, 19395, -6830, -8660, -37527, -114665, -154758, -141189, -96463, -57770, -46924, -86308, -98488, -99382, -60713, -51967, -28129]
15687b8129J3780m2273Q089j529j3309n2452l3839M3318n0130M1557L1114l8846
15675a22649l148L8810Q906k8114J892J9322N2938M224n2469j180L7844M7180
15663C556n3931n7545J3983Q934K6090m5037j6360L1174Q1208N2604K5215m7871
15651B2020m293k8204k0664k9779l1730K4538K2204l386J1067r32j5083K535k1712
15638g3419k3749j6314J00683J05276n9189j07123k6991J5655K9911l1699J9106
15627f7853Q6745m498J9853n5940q9649L4179Q9367O3370l5751l2277k0131J2858
15615B73K908O279J7635O939l5840n3254j8377K4237J9903j6418k2025N812n8510
15602a20438j1432P77L7858K2059J3083m7565l8824L0806K3396N2913L9540M3692
$$ y = [-28129, -14349, -56622, -48533, -50062, -63371, -115823, -149662, -106344, -156474, -114917, -83803, -122649, -125797, -86987, -78081, -106195, -104303, -84981, -32043, -27819, -80288, -81468, -43624, 3556, -50375, -107920, -93937, -85003, -58913, -103950, -120310, -89136, -7928, 44676, 69891, 22020, 17727, -10477, -31141, -60920, -92650, -68112, -45908, -49294, -38227, -39159, -54242, -51707, -73419, -97168, -113482, -12799, 92477, 33288, -73835, -100826, -85171, -55260, -86959, -67853, 18892, 14394, 34247, -21693, -111342, -77163, 12204, 75574, 39823, 7546, -12585, 273, 3181, 9460, 27095, 34034, -1806, -55060, -73437, -49200, -29297, -45715, -67740, -61928, -120438, -131870, -131093, -93235, -71176, -58093, -105658, -144482, -113676, -90280, -37367, 2173, 45865]
15590D5865K4016l2780j0694o964L55n3341m805m393M2141J7972l1082m0640k0419
15577g4769J4364j5997P7326k7662m3333j4152q931L8798J8026Q2903l8975m6160
15565c8562j3831O1786p929m9435O3939p687q1502l3361l67K4718K9486J7124
15553c5621j7984P7142L9288n2183l0242k1173j1178N9570q190l2195P700m1082
15541f6148k4784o306K6551J3934k5302N4651n7532J2621M0385K9007J9646n238
15529A1485J5012k7701l8675m1246L3734N8065L5655j5618j9707l7459o161k0085
15517e2701M61j0853M8067k233Q086K9400k3751J8277J0815K3437m5736n7741
15505e4472n8762l6444K1768n946L5811J6403L3221K4011P872K284J2881k1753
$$ y = [45865, 69881, 37101, 26407, 19443, 19798, -33543, -38348, -42741, -600, 17372, -13710, -54350, -74769, -60405, -76402, 924, -26738, -70071, -84223, -93154, -54356, -36330, 46573, 7598, -38562, -52393, 9393, 1464, -47971, 15968, 8281, -73221, -106582, -106949, -82231, -52745, -35621, -53605, 23537, 62825, 10642, -19600, -40773, -51951, 7619, -571, -32766, -25066, -66148, -90932, -97238, -70687, -56753, -82055, -27404, -84936, -72315, -31930, -2923, 16723, 11485, 26497, -1204, -39879, -81125, -47391, 10674, 46329, 30711, 11004, -26455, -32616, -52701, -52240, -63093, -15026, -17259, -9173, 20227, -3524, 14753, 25568, 49005, 3269, -54472, -113234, -149678, -127910, -133856, -98045, -81642, -48421, -24410, -16538, -14254, -1373, -23126]
15493b3126p2861k1153M0240L0358j1834j9566m7082m064N0443K52k0059J8853
15481g9599J0400m805k6546l482l418q814O0317O615j1594K8513Q4437L119J7824
15468G2967q8320L514P4757P79j8314o0056K4235J3923J6152O0323l8207k9410
15456C2343n871q2706q1771O818M1379K9660M5362j684j0758n181L9612l4471
15444b7268n635J985j0962L4940O3097k3583o8342l2252O2236J3939m2136n280
15432c9261m458M3719J9659q4504l4968J8661O0398O130M3495L6504J6908k7439
15420E4844r1381J1812P0258o5158k4309O0519J4969k2249n6136k1253n8214K8472
15408i7826K6345m263K803M3540P4199L747j9808L060j0168m8206j9480l0443
$$ y = [-23126, -95987, -117140, -76900, -46542, -58376, -77942, -125024, -129088, -78645, -78393, -98452, -79599, -69199, -74004, -100550, -104032, -107450, -116264, -55947, -49332, -60926, -32413, 52024, 55143, 72967, -15353, -11839, 62918, 63697, 45383, -14673, 9562, 23485, 39637, 99960, 61753, 32343, 26472, -56234, -138005, -131187, -89808, -60148, -14786, -16470, -27228, -32409, 7203, -27268, -32903, -30918, -41880, -6940, 56157, 32574, -35768, -68020, -5784, 8155, -33981, -39261, -43719, 0, 19659, -64845, -99813, -81152, -20754, -14624, 28871, 65375, 82283, 54844, -36537, -24725, 45533, -19625, -43934, 16585, 31554, 9305, -46831, -68084, -126298, -97826, -71481, -75744, -72941, -29401, 44798, 48545, 28737, 31797, 21629, -26577, -46057, -76500]
15396g6500k6779J8464N3258k5238n8338K5248P0948N0481j3866k657j234L2395
15384D6182O4633o6476q5965k7716K0469N0105l6284j1609q461J2238k4392m6078
15372a13354N0015j1565p409J7078M0623O3617n0486Q630j2623p9908j8187j2018
15360a25587j742R446j2661O5868P8323K2732n1917k0769K3070L7255k9851m7959
15348e3792N4526k2574j299M925k0556j1808n9972o9941O9792J23084j1097j215
15336G3L607r483K5266K0874N220l465L9438L0453o4644j1567k6370k4184q237
15323b3019j5985k6756J8003r6363j4178O5607M3919n4138k8538K536k5840P9739
15311g5013O4690L9722J5941l1901k7396k8714L0499J04718K1321p1569o1603
$$ y = [-76500, -103279, -84815, -31557, -56795, -115133, -89885, -18937, 31544, 17678, 15021, 13787, 46182, 110815, 44339, -41626, -69342, -48873, 1232, -35052, -46661, -55122, -42884, -67276, -113354, -63339, -74904, -82313, -65235, -24612, 39005, -11481, -2851, -15474, -95382, -113569, -125587, -127329, -117883, -130544, -64676, 13647, 36379, -15538, -36307, -13237, 24018, -5833, -53792, 734, -21840, -23139, -18214, -38770, -50578, -110550, -180491, -110699, 12385, 1288, 73, 3680, -5803, 19463, 40337, 45557, 42092, 81530, 111983, 47339, 35772, 9402, -14782, -23019, -39004, -65760, -47757, -144120, -158298, -92691, -48772, -102910, -131448, -128912, -154752, -75013, -10323, 29399, 45340, 13439, -13957, -42671, -12172, 92546, 113867, 42298, -19305]
15300a9305m4127K5003P5652J4766m5443j6492K9788K8147L5025l6077k8710l1297
15288a3070p2616j5431j1840L7528M997R488j0792J7003r806k3523K5846n321
15276f7537P26o8417L5646N5525m072K1829M5748N28J3448r206n0805J1529L1270
15263A6212l9265m652J4449O884l6998k518J8983m504j8192Q914K6319N1449l8557
15250a476k7906J0397l3577j7123L9k0899P7586L3446l0143k3030m1609k0224
15238i4519J7848M199J7737q2984l9996J7710J1635N2070K0568k8794K7437R414
15226f7675O7534O629k6267P298J8499K0548K0943K2484n608J6276p477j6237
15214E6947R195l9605K8879K1694l6185L7366n742r6247m7427J3439J6700L2062
$$ y = [-19305, -63432, -38429, 37223, 51989, 6546, -9946, 19842, 47989, 83014, 46937, 18227, -13070, -85686, -101117, -112957, -75429, -70432, -60944, -71736, -54733, -64539, -88062, -62216, -67537, -66811, -135228, -99582, -44057, -48129, -26300, 19448, 19976, 33424, 24218, -26587, -15058, 16212, -23053, -27705, -13256, -6372, -43370, -45888, -26905, -31409, -49601, -40687, -14368, 37081, -1476, -29382, -18985, -52562, -69685, -69646, -90545, -12959, 20487, -9656, -32686, -74295, -94519, -76671, -72472, -54735, -137719, -177715, -160005, -148370, -96300, -75732, -104526, -77089, -67675, -141, 6488, -19779, -12481, 6018, 26566, 47509, 69993, 64385, 80661, 73184, 56947, 66142, 26537, 55416, 77110, 40925, 78291, 72549, -23698, -71125, -57686, -40986, -8924]
15202h924O8756J0808n4903o6554K5301J8998k5648q1770r291K4417J05242J2175
15190A8607j5919L9035k3895p4989j5717J3902J2764L2040k6654N268O0615k2825
15178B232J2286j4560L3193k6092K3368N4049l7875m6150J8123m203r6801o752
15166h9182j1853N6153L6980k2485k2060J1282M709L4648P255M1757m2386j9324
15154a4506p150n5785j4704L7701o774J499J2564M6790K1049p4513o2766J7224
15142i9371K6902j1788j3780L1186j2133J5345j5562K4087L3035m045q6767k9139
15130a42030l4776o762P4949N8758l768J2644L1052N2702j4316l0756J1831L7760
15118D7288M9868J1831L2858l2820k8526j8496L30j0463l0609k8413m798J04225
$$ y = [-8924, 59832, 70640, 15737, -50817, -25516, -6518, -32166, -113936, -123227, -98810, 6432, 18607, 2688, 41723, 17828, -57161, -72878, -58976, -46212, -14172, -40826, -35558, 25057, 2232, 14518, -42, 33151, 7059, 30427, 84476, 46601, 451, 18574, 14371, -82430, -89182, -101035, -44882, -7902, -30387, -52447, -41165, -36456, -1808, 5447, 47204, 4818, -14506, -21656, -77441, -92145, -54444, -61218, -59719, -47155, -365, 20684, -53829, -116595, -99371, -72469, -84257, -98037, -66851, -78984, -63639, -79201, -55114, -22079, -26124, -112891, -142030, -176806, -183568, -108619, -49861, -53629, -40985, -9933, 42769, 28453, -2303, 9528, 47288, 97156, 108987, 141845, 109025, 80499, 62003, 62333, 51870, 21261, -7152, -11950, 92275]
15106I2275M3290M1358M1055o3897o9911k7473j9687p976J5459M1524k2772p0595
15094g350m1236N910J8080K0341L3307K9355k9125j3788j3221k7232l4084L5727
15082b3316k909m3133j2482j3276r472L4523j8755k2854M4306K6420j7627N237
15070e3338m7778o51L249o9553j7468K7295J467M6838P3810M1973K2299N8n3337
15057b5136m6881n5808J3584N9251L2934k1607k6855j1564M6822R819j9431k081
15045d6953n613L5642J6712M9669l023k0153K6029m5151j500j7006q1703J0094
15033h2956J9780L2672K801n7106k1389j629L1514j530K0751R042L7197J075j108
15020a0886l7531n442N4466m739n9204k1157K4712L314K1394l5562J1740K6533
$$ y = [92275, 135565, 176923, 217978, 154081, 84170, 56697, 37010, 29034, 44493, 86017, 63245, -7350, -48586, -42676, -24596, -4255, 29052, 58407, 29282, 15494, 2273, -24959, -59043, -23316, -26225, -69358, -81840, -95116, -104588, -70065, -88820, -111674, -67368, -40948, -58575, -53338, -101116, -101767, -98518, -168071, -185539, -158244, -156777, -109939, -36129, 5844, 28143, 28201, -25136, -72017, -127825, -114241, -54990, -22056, -43663, -70518, -82082, -35260, -25441, -44872, -46953, -52566, -16924, -212, 49457, 46434, 26281, 52310, 7159, 5659, -11347, -93050, -82956, -63176, -30504, -27703, -84809, -106198, -107827, -76313, -77843, -57092, -48050, -10853, -9778, -10886, -48417, -53859, 607, -4132, -63336, -84493, -59781, -56467, -35073, -70635, -58895, -32362]
15008c2362M301j9270P538k242k1578l824q438L748P816k5025o5751l5395j9263
14995b09745M7792M3454K8359K2163M2649m0590K726Q5389j1359r5J5803n6073
14983b9527r608M8394p2073j0430L17l367J0531k3096L5759M9111J8652Q675P949
14970C1287J8450k6552q5338L840M9103O40j2728K5616K6358M3726q8093j2007
14958b5698K1397l4532J6202L8435N752l2165N177q050r17N5609O265r0063o1104
14945a03692R717O1504L999n5618K0853N4919N0809J7230n5349k6978o124m3261
14933g1991q956L446J146J5926k3130j2420o588L2273Q964L8246J8709L8121M42
14920C4188J1357L4056r739m2053O34m1374m3805k1742L2472P1865l1627n7646
$$ y = [-32362, -28061, -47331, -39793, -42035, -63613, -67437, -75875, -72127, -64311, -89336, -155087, -190482, -209745, -161953, -118499, -90140, -67977, -25328, -65918, -63192, 22197, 10838, 10743, 26546, -29527, -39135, 9259, -62814, -73244, -72927, -76294, -65763, -88859, -53100, -3989, 14663, 23338, 31287, 49737, 23185, -62153, -58313, -9210, -8570, -21298, 4318, 30676, 74402, -13691, -25698, -4301, -38833, -22631, 15804, 21556, -10609, -5432, -13482, -14399, 41210, 47475, -42588, -103692, -93975, -32471, -28472, -84090, -63237, -8318, 42491, 59721, 4372, -22606, -28730, -71991, -80947, -77501, -76355, -60429, -83559, -95979, -102567, -70294, -61330, -23084, -4375, 33746, 34188, 45545, 79601, 69862, 27809, 28443, -12931, -56736, -78478, -46006, 25859, -5768, -63414]
14908f3414R850k3264m7293M5950P5206o477M6911L9181k5671J2225P1441j1489
14896A23156p2881j9307p7n468r551l0275L9260O158l3405j0058q505n345J7795
14883h503O6427N6195o8366j18343K1066K6685O418n0028j4712L8809L8558J065
14871d729j0310j575K1222o138j7470M4925J2044l358K1369m6541l0563o135J000
14858b6259j6859p6812k221O6499j220k4289o575o1980J0705M7811N9561N3332
14846B1693l9881n5971n036L5822N8062L0566m5110n2798l0064K4312N910j2574
14834f5069M5859j2704N0568m7889k3151j1359L2381o48p0431j3696P0981J13157
14822F7999J0687p3736m5553R740j4434j4157J3625l9904j0914K4338R773m619
$$ y = [-63414, -53564, -76828, -124121, -78171, -2965, -9442, 37469, 76650, 50979, 63204, 134645, 123156, 50275, 30968, 30891, 25423, 15872, -14403, 24857, 31015, -2390, -12448, -20953, -26298, -8503, 57924, 114119, 45753, -72590, -51524, -24839, -18421, -68449, -83161, -44352, -5794, -4729, -15039, -16614, 4608, -1530, -19000, 25925, 37969, 34611, 55980, 9439, -21124, -27259, -26259, -43118, -119930, -122151, -55652, -56872, -81161, -87736, -149716, -139011, -91200, -31639, 21693, -18188, -74159, -79195, -43373, 14689, 45255, 145, -52653, -82717, -58405, -52495, -65069, -19210, -31914, 18654, -29235, -52386, -63745, -31364, -32012, -102443, -116139, -45158, 67999, 78686, 4950, -40603, -30863, -45297, -59454, -45829, -85733, -96647, -72309, -62536, -67155]
14810f7155M8095L2211m2859r587L4146Q504k2912k9157N7998K879p538n0402
14798d5777m1275M085N5722l3032J9538J8745k5493N663K8777m1650J9899L503
14786c1295K5192O4486P9683m3348n3471o3650J2617M1390J4859Q036k1588n0564
14774a7653p1348k5347L1460j0380N1662k06M8393N2577k8057j07126O345k7465
14762i7145L7235K6057j4614J9049K1481k1169j4614Q093K224q625k7768l2315
14750a02111o9803P6631j0806K183P560P0739O9753L8422j7884m5658k2347m6087
14738d9408L231J9461K5304l3005J7284L4286n46M6Q230M8855m1008n6106j325
14725b4701l0633l948j0976j334J573L9505m1836K9889j3836l8738L813O2460
$$ y = [-67155, -19060, 13151, -29708, -39295, -5149, 3355, -19557, -48714, 9284, 12163, 4625, -45777, -87052, -82967, -27245, -60277, -40739, -21994, -47487, -41824, -13047, -54697, -34798, -31295, -6103, 58383, 138066, 94718, 41247, -22403, -9786, 31604, 46463, 54499, 32911, -17653, -89001, -114348, -82888, -93268, -41606, -41812, 6581, 59158, 31101, -76025, -69680, -97145, -59910, -33853, -48467, -29418, -7937, -29106, -43720, -35627, -33403, -42028, -69796, -102111, -171914, -95283, -106089, -103906, -96346, -25607, 44146, 82568, 64684, 19026, -3321, -49408, -46177, -26716, -1412, -34417, -17133, 17153, 16607, 16653, 24883, 73738, 32730, -23376, -24701, -55334, -59282, -70258, -71592, -70019, -30514, -72350, -42461, -56297, -95035, -91222, -28762]
14713b8762P5406l1838o2681J1561J8097k3005r752L0302k6997L3493M5334Q258
14701C9416o0918j6691O3377p559p4163j8855K7197j0503J943J9049J4991l2832
14689e5548R7663J385p6781q189l2432J9914O4429j7460n3707K2643J9192J4139
14677d752j498k6915M1694j9734L5694J2993m8344k3711K3088R876M0400P386
14665D6177n7631K236L7301j4641J0537k7358m1684m2602p1118L6800J3262J1516
14653i7205N9076P2781n2100o7584K2042L7187O2880M7312j8756l9999j5198K558
14641A2994k0209p428r2259j04032L207M4734r35O7991O1395l3288j2929q1124
14629a61883N9207P3253l8640p515Q946M04M1907j9465l7332q774m8136n5713
$$ y = [-28762, 46644, 14806, -47875, -36314, -18217, -41222, -50974, -20672, -47669, -14176, 31158, 39416, -21502, -38193, 25184, 17625, -56538, -75393, -48196, -58699, -56756, -37707, -22716, -55548, 42115, 43500, -33281, -41470, -73902, -53988, 10441, -7019, -60726, -38083, -18891, -4752, -6250, -33165, 8529, -11205, 24489, 37482, -10862, -34573, -11485, -1609, 38791, 46177, -11454, -9218, 28083, 13442, 23979, -3379, -45063, -87665, -158783, -121983, -108721, -97205, -38129, 34652, -17448, -85032, -62990, -25803, 37077, 84389, 65633, 25634, 10436, 12994, -7215, -14643, -106902, -210934, -207727, -162993, -163928, -95937, -34542, -67830, -80759, -161883, -102676, -29423, -68063, -75578, -66632, -66228, -24321, -43786, -81118, -89892, -138028, -193741]
14617a93741L8533J07229J2012o691o7510k2110p244L1824J4694J5730L8575K9877
14605h822k0152j9099k4264M8962k9253k889M4918N4035J7758k2450m0437J2423
14593A0730M1916l5889n186j596l4837J0727K2767p0311l4171L5768N1443j4464
14581b3103j0308J8086k1202m8693n046K344j2192N3110L999l5582K2876q329
$$ y = [-193741, -155208, -47979, -35967, -42658, -110168, -132278, -139522, -107698, -93004, -77274, -38699, -8822, -28974, -48073, -72337, -23375, -52628, -55517, -10599, 43436, 61194, 38744, -1693, 10730, 52646, 16757, 11571, 9975, -24862, -14135, 8632, -61679, -95850, -60082, -8639, -23103, -33411, -15325, -36527, -85220, -90266, -87922, -100114, -47004, -43005, -78587, -55711, -64040]
$$ [...]
##END NTUPLES=NMR SPECTRUM
##END=
