##TITLE=Analysis number 315703
Compound Code tl 00656
Book Reference 461/200/2
Project Code adrs
Chemist Name toml
##JCAMPDX= 6.0         $$ Bruker NMR JCAMP-DX V2.0
##DATA TYPE= NMR SPECTRUM
##DATA CLASS= NTUPLES
##ORIGIN= Bruker BioSpin GmbH
##OWNER= NMR
$$ XWIN-NMR		Version 3.5
$$ Tue Nov 29 14:35:32 2005 GMT Standard Time (UT+0h)  MAYBRIDGE\NMR@NMR_250MHZ
##.OBSERVE FREQUENCY= 250.131544655141
##.OBSERVE NUCLEUS= ^1H
##.ACQUISITION MODE= SIMULTANEOUS (DQD)
##.ACQUISITION SCHEME= undefined
##.AVERAGES= 16
##.DIGITISER RES= 18
##SPECTROMETER/DATA SYSTEM= dpx250
##.PULSE SEQUENCE= zg30
##.SOLVENT NAME= CDCl3
##.SHIFT REFERENCE= (INTERNAL, CDCl3, 0, 16.522)
##AUDIT TRAIL= $$ (NUMBER, WHEN, WHO, WHERE, WHAT)
$$ ##TITLE= Audit trail, XWIN-NMR		Version 3.5
$$ ##JCAMPDX= 5.01
$$ ##ORIGIN= Bruker BioSpin GmbH
$$ ##OWNER= NMR
$$ C:\u/data/dgb/nmr/ADRS/13170/pdata/1/auditp.txt
$$ ##AUDIT TRAIL=  $$ (NUMBER, WHEN, WHO, WHERE, WHAT)
(   1,<2005-11-29 14:35:10.90 +000>,<MAYBRIDGE\NMR>,<NMR_250MHZ>,
      <created by zg, POWCHK disabled, PULCHK disabled
       configuration hash MD5:
       62 19 C7 07 E1 42 D1 B7 37 6C 3D D0 77 39 F9 E6
       data hash MD5: 64K
       33 FE 02 2A DF 38 2D 94 FB AC D6 F0 4A 1F 87 E5>)
(   2,<2005-11-29 14:35:23.00 +000>,<MAYBRIDGE\NMR>,<NMR_250MHZ>,
      <Start of raw data processing
       ef LB = 0.3 FT_mod = 6 PKNL = 1 SI = 32K 
       data hash MD5: 32K
       7E 44 EC 1C D5 D6 D8 ED 3C 5E BA 8E CD 87 06 43>)
(   3,<2005-11-29 14:35:24.89 +000>,<MAYBRIDGE\NMR>,<NMR_250MHZ>,
      <apk 
       data hash MD5: 32K
       11 BD 6D 61 72 30 0A 5C 8E 19 C7 2A 7F 85 91 5B>)
(   4,<2005-11-29 14:35:25.70 +000>,<MAYBRIDGE\NMR>,<NMR_250MHZ>,
      <abs ABSG = 5 
       data hash MD5: 32K
       2D CD 69 D3 E6 B7 71 0B 7F 4C 81 D7 C6 40 4D 39>)
$$ ##END=
$$ 
$$ hash MD5
$$ 33 02 F1 D5 EC 81 CA A6 14 8D 28 9A 60 12 44 4B
##$RELAX= 
##$RELAX= 
##$RELAX= 
##$RELAX= 
##$RELAX= 
##$RELAX= 
##$RELAX= 
$$ Bruker specific parameters
$$ --------------------------
##$DU= <C:\u>
##$EXPNO= 13170
##$NAME= <ADRS>
##$PROCNO= 1
##$TYPE= <nmr>
##$USER= <dgb>
##$AMP= (0..31)
100 100 100 100 100 100 100 100 100 100 100 100 100 100 100 100 100 100 
100 100 100 100 100 100 100 100 100 100 100 100 100 100 
##$AQSEQ= 0
##$AQ_mod= 3
##$AUNM= <au_zg>
##$AUTOPOS= <9 >
##$BF1= 250.13
##$BF2= 250.13
##$BF3= 250.13
##$BF4= 250.13
##$BF5= 500.13
##$BF6= 500.13
##$BF7= 500.13
##$BF8= 500.13
##$BYTORDA= 1
##$CFDGTYP= 0
##$CFRGTYP= 5
##$CHEMSTR= <none>
##$CNST= (0..31)
1 1 145 1 1 1 1 1 1 1 1 1 1 1 1 1 1 1 1 1 1 1 1 1 1 1 1 1 1 1 1 1 
##$CPDPRG= <>
##$CPDPRG1= <>
##$CPDPRG2= <>
##$CPDPRG3= <>
##$CPDPRG4= <mlev>
##$CPDPRG5= <mlev>
##$CPDPRG6= <mlev>
##$CPDPRG7= <mlev>
##$CPDPRG8= <mlev>
##$CPDPRGB= <>
##$CPDPRGT= <>
##$D= (0..31)
0 1 0 0 0 0 0 0 0 0.06 0 0 0 0 0 0 0.0002 0 0 0 0 0 0 0 0 0 0 0 0 0 0 
0 
##$DATE= 1133274909
##$DBL= (0..7)
120 120 120 120 120 120 120 120 
##$DBP= (0..7)
150 150 150 150 150 150 150 150 
##$DBP07= 0
##$DBPNAM0= <>
##$DBPNAM1= <>
$$ [...]
##$SUBNAM7= <"">
##$SUBNAM8= <"">
##$SUBNAM9= <"">
##$SW= 20.6930455092707
##$SWIBOX= (0..15)
0 0 3 0 0 0 0 0 0 0 0 0 0 0 0 0 
##$SW_h= 5175.983436853
##$TD= 65536
##$TD0= 1
##$TE= 294.16
##$TE2= 300
##$TE3= 300
##$TEG= 300
##$TL= (0..7)
0 120 120 120 120 120 120 120 
##$TP= (0..7)
150 150 150 150 150 150 150 150 
##$TP07= 0
##$TPNAME0= <>
##$TPNAME1= <>
##$TPNAME2= <>
##$TPNAME3= <>
##$TPNAME4= <>
##$TPNAME5= <>
##$TPNAME6= <>
##$TPNAME7= <>
##$TPOAL= (0..7)
0.5 0.5 0.5 0.5 0.5 0.5 0.5 0.5 
##$TPOFFS= (0..7)
0 0 0 0 0 0 0 0 
##$TUNHIN= 0
##$TUNHOUT= 0
##$TUNXOUT= 0
##$USERA1= <user>
##$USERA2= <user>
##$USERA3= <user>
##$USERA4= <user>
##$USERA5= <user>
##$V9= 5
##$VALIST= <valist>
##$VCLIST= <CCCCCCCCCCCCCCC>
##$VD= 0
##$VDLIST= <DDDDDDDDDDDDDDD>
##$VPLIST= <PPPPPPPPPPPPPPP>
##$VTLIST= <TTTTTTTTTTTTTTT>
##$WBST= 1024
##$WBSW= 4
##$XGAIN= (0..3)
0 0 0 0 
##$XL= 0
##$YL= 0
##$YMAX_a= 453698
##$YMIN_a= -480964
##$ZGOPTNS= <>
##$ZL1= 120
##$ZL2= 120
##$ZL3= 120
##$ZL4= 120
##$ABSF1= 16.522
##$ABSF2= -4.171173
##$ABSG= 5
##$ABSL= 3
##$ALPHA= 0
##$AQORDER= 0
##$ASSFAC= 0
##$ASSFACI= 0
##$ASSFACX= 0
##$ASSWID= 0
##$AUNMP= <proc_1d>
##$AZFE= 0.1
##$AZFW= 0.1
##$BCFW= 0
##$BC_mod= 0
##$BYTORDP= 0
##$COROFFS= 0
##$CY= 12.5
##$DATMOD= 1
##$DC= 0
##$DFILT= <>
##$DTYPP= 0
##$F1P= 14.0000005364418
##$F2P= -0.99999901652339
##$FCOR= 0.5
##$FTSIZE= 32768
##$FT_mod= 6
##$GAMMA= 0
##$GB= 0
##$INTBC= 1
##$INTSCL= 1
##$ISEN= 128
##$LB= 0.3
##$LEV0= 0
##$LPBIN= 0
##$MAXI= 10000
##$MC2= 0
##$MEAN= 0
##$ME_mod= 0
##$MI= 0
##$NCOEF= 0
##$NC_proc= -4
##$NLEV= 6
##$NOISF1= 0
##$NOISF2= 0
##$NSP= 0
##$NTH_PI= 0
##$NZP= 0
##$OFFSET= 16.522
##$PC= 1
##$PHC0= 88.68932
##$PHC1= 7.57634
##$PH_mod= 1
##$PKNL= yes
##$PPARMOD= 0
##$PSCAL= 4
##$PSIGN= 0
##$REVERSE= no
##$SF= 250.13
##$SI= 32768
##$SIGF1= 0
##$SIGF2= 0
##$SINO= 400
##$SIOLD= 32768
##$SREGLST= <1H.CDCl3>
##$SSB= 0
##$STSI= 32768
##$STSR= 0
##$SW_p= 5175.98343685301
##$SYMM= 0
##$S_DEV= 0
##$TDeff= 65536
##$TDoff= 0
##$TI= <Analysis number 999999
Compound Code 99
Book Reference 9
Project Code 9>
##$TILT= no
##$TM1= 0
##$TM2= 0
##$TOPLEV= 0
##$USERP1= <user>
##$USERP2= <user>
##$USERP3= <user>
##$USERP4= <user>
##$USERP5= <user>
##$WDW= 1
##$XDIM= 32768
##$YMAX_p= 348112007
##$YMIN_p= -322288
$$ End of Bruker specific parameters
$$ ---------------------------------
##NTUPLES= NMR SPECTRUM
##VAR_NAME=  FREQUENCY,     SPECTRUM/REAL,   SPECTRUM/IMAG
##SYMBOL=    X,             R,               I
##VAR_TYPE=  INDEPENDENT,   DEPENDENT,       DEPENDENT
##VAR_FORM=  AFFN,          ASDF,            ASDF
##VAR_DIM=   32768,         32768,           32768
##UNITS=     HZ,            ARBITRARY UNITS, ARBITRARY UNITS
##FACTOR=    0.157963299565203, 1,           1
##FIRST=     4132.6476996994, 0,             0
##LAST=      -1043.33573715361, 0,           0
##MIN=       -1043.33573715361, -322288,     0
##MAX=       4132.6476996994, 348112007,     0
$$ Real data points
##PAGE= N=1
##DATA TABLE= (X++(R..R)), XYDATA
$$ [...]
24036a8144P8358o5867Q588J3936Q058m7757r215J0451L7790K4644J17102j08514
24024D9430q2966o5036O8933P1448j1194m9801l5680k8872l273o0874L5280L4671
24012g7934j1671k7183o7500Q4256P7805N2742L1610r5547j0317P178J4834j43271
24000a64998j17704N1751N9599N8305K8086J2794M598M942R803J039J9854P1715
23988C9784M5796n5272m8157m8717j7039n7656k8787P4670L0492K6155L9012m4850
23976d4569o0626K2201Q987L2720r395j4968L7981L6191K9012M8002n3373j42875
23964a10712N9380P9705j063K97l3343k5620R502k3735P7726j0961o5567m4186
23952h8577R30M3010K3394o1214N876L4532M4476M910k0063j44821l1009O7119
$$ plain form
24036 -18144 60214 -5653 2935 16871 24929 -22828 -32043 -21592 16198 40842 157944 49430
24024 49430 -33536 -98572 -29639 41809 30615 -19186 -54866 -83738 -87011 -147885 -112605 -77934
24012 -77934 -89605 -116788 -184288 -100032 -22227 30515 62125 -33422 -43739 -36561 -21727 -164998
24000 -164998 -282702 -230951 -171352 -113047 -84961 -72167 -67569 -62627 -52824 -51785 -31931 39784
23988 39784 85580 30308 -17849 -66566 -83605 -141261 -170048 -95378 -64886 -38731 281 -44569
23976 -44569 -105195 -82994 -74007 -41287 -50682 -65650 -27669 8522 37534 85536 32163 -110712
23964 -110712 -51332 28373 27310 27607 -5736 -31356 -21854 -45589 32137 21176 -44391 -88577
23952 -88577 -87647 -44637 -21243 -82457 -76581 -42049 2427 7337 -12726 -157547 -188556 -121437
23940a21437J4392q1635N3169O2623N9984k6445o2894l4461M9472N5469k1549
23929e3312R3555k1226r99N013J15215R0527l070j36285j22758k9885k3933j8240
23917a05398n5857j3622J00867k225n6276k1504R068r949P8730J5324q568K7094
23905d2316J2741k5660L3827q1952j1753k45O5610N3552P5081p930k6757j8621
23893B5577k4318n0562N8901M7715l7802p0021o0217L7247O1093n020O8884o8295
23881a6818l5357l5900K5364O7630L800o8348J9576R959Q1008K359N8535m3907
23869F7901p2776K8676N4829M525m845r4346P957Q5437q915M3936o838j6091n514
23856H3936Q197k6855n9532M648K647n5697q227l2031L1551j475L4781j0173q6387
$$ plain form
23940 -121437 -107045 -188680 -135511 -72888 -12904 -39349 -102243 -136704 -87232 -31763 -53312
23929 -53312 40243 19017 18018 23031 138246 228773 225703 89418 -33340 -63225 -87158 -105398
23917 -105398 -161255 -174877 -74010 -76235 -132511 -154015 -144947 -154896 -76166 -60842 -69410 -42316
23905 -42316 -29575 -55235 -21408 -103360 -115113 -115358 -49748 3804 78885 70955 44198 25577
23893 25577 1259 -49303 9598 57313 19511 -50510 -110727 -73480 -12387 -17407 51477 -16818
23881 -16818 -52175 -88075 -62711 4919 8719 -59629 -40053 -30094 50914 53273 111808 67901
23869 67901 -4875 23801 78630 83155 78310 -16036 -8079 77358 68443 112379 105541 89450 83936
23856 83936 92133 65278 5746 10394 13041 -42656 -50883 -82914 -51363 -52838 -18057 -28230 -114617
23843a14617J4735p33L6628P7195J121N1177R109O4767Q9391p6923n4840m0857
23831E6153j26894k401J1548k6882M5113Q9674l9603k8348K4645M1482N7293Q969
23819A10749n5881K1482N7705l2825J7355r089n6715j619O0708O8206m1409n5198
23807H3469l2946j8383p404l8064Q856O4721j7099n3545K0439L1631j37205p9004
23795a74534K6202Q0843J06266J08246k5753p2214m9524m4018q891N4627L2537
23784C3787k0493J7123n018M5849r7230l8023M8894j6853j6404N1022K4838L8774
23772F6266M9110k4079j203m4162p3856q2301k1406J8025Q8541n6647k4068O0728
23760d5052p51l1994R3737R0651J1660j6917L6467l5405j04306k9772N919J3717
$$ plain form
23843 -114617 -99882 -100615 -63987 13208 14329 65506 74615 139382 228773 151850 97010 56153
23831 56153 -70741 -73142 -61594 -88476 -43363 46311 6708 -21640 3005 44487 101780 110749
23819 110749 54868 76350 134055 101230 118585 109496 52781 51162 111870 180076 138667 83469
23807 83469 50523 32140 24736 -13328 -4472 60249 43150 -10395 10044 41675 -95530 -174534
23795 -174534 -148332 -67489 38777 147023 121270 49056 -468 -44486 -53377 1250 33787
23784 33787 13294 30417 25399 71248 -25982 -64005 -15111 -31964 -48368 2654 27492 66266
23772 66266 115376 91297 90094 45932 -27924 -110225 -131631 -113606 -25065 -81712 -105780 -45052
23760 -45052 -45803 -77797 15940 106591 118251 101334 137801 102396 -1910 -31682 -25763 -12046
23748a2046p9672J1540l427l554j5461L2982R1613N9931p1463Q209J4736k2496
23736A0892j3754K2849k6096n8006K1763J7698m7748k1689m2925Q3317Q7678q989
23724B4990l7715J429K0710L1505n6706k3881M5962O1739K9205Q175q3789m583
23712A7041j586M4917n7036M1092l2339p4570j7893P3668M2438k1012P9445L8786
23700A32951o6944p0489m5815j429J9527n0191M0561R444j1750q679j1728M7268
23688a7274L1013O522k5503p8225j4998K9966k9595q631L282O1749j1253N0195
23676b752J0885p7272M1237j732l3192P3306J9004L2271k1517m6774l8524O0101
23664A5041k251r1150j958j65N154J9351J4722Q8437k5259j3130R0702J2347l4744
$$ plain form
23748 -12046 -91718 -80178 -83605 -87159 -102620 -69638 21975 81906 10443 18652 33388 10892
23736 10892 -2862 19987 -6109 -64115 -42352 -24654 -72402 -94091 -137016 -53699 33979 24990
23724 24990 -12725 -11296 9414 40919 -15787 -39668 6294 68033 97238 105413 21624 17041
23712 17041 15455 60372 3336 44428 12089 -62481 -80374 -6706 35732 14720 94165 132951
23700 132951 66007 -4482 -50297 -51726 -32199 -82390 -41829 -32385 -44135 -52814 -64542 -17274
23688 -17274 13739 20261 -5242 -83467 -98465 -68499 -98094 -106725 -103443 -41694 -52947 -2752
23676 -2752 8133 -69139 -27902 -29634 -62826 10480 29484 61755 40238 -6536 -45060 15041
23664 15041 12790 -78360 -80318 -80483 -75329 -55978 -41256 47181 21922 8792 99494 111841 77097
23651G7097m5273k0004m7322j23913o765N0171l1103J0340j3008N379K2631P9029
23639d2741j6060J8015K4982K8412n5655l2366J14882K0752j62323L1K5326M2654
23627c4091j9286k0501O0907L4448M4088j1141J4172m6972r5854l5337O4007M4317
23615a243n1831k7556J5943O0257l8911k1229Q0924L1135r291p7144J4792j7947
23603d2101m7827M5367M4833K8737J6007n0044L1938j8849J1000n4123o8022n5755
23591a58839M6180L1503Q1010O4314J6965n8671j9385J0777k6266p5895o2203
23580a50510J809R0424K6656p529N7499J17442J4132j04411j13707k4314Q642
23569h3867N0648N8282l1389j0514R4833N1437M1581j0380j504k3773n2862m4956
$$ plain form
23651 77097 31824 11820 -35502 -159415 -166180 -116009 -147112 -136772 -149780 -144401 -121770 -42741
23639 -42741 -58801 -40786 -15804 12608 -43047 -75413 39469 60221 -102102 -102071 -76745 -34091
23627 -34091 -53377 -73878 -12971 21477 65565 54424 68596 21624 -74230 -109567 -45560 -1243
23615 -1243 -53074 -80630 -64687 -4430 -43341 -64570 16354 47489 38198 -38946 -24154 -42101
23603 -42101 -89928 -44561 272 29009 45016 -5028 26910 8061 19061 -35062 -103084 -158839
23591 -158839 -112659 -81156 -146 64168 81133 22462 3077 13854 -12412 -88307 -150510
23580 -150510 -148701 -58277 -31621 -39150 18349 135791 149923 45512 -68195 -92509 -83867
23569 -83867 -33219 25063 -6326 -16840 77993 129430 171011 160631 159127 135354 82492 37536
23557C7536n4083j5812l5522n1506L2630K6706l1773K6640l4126l0176L5054N3820
23545d0612J03428j2957j11542q8738N5665N1033j01756j5788L2284O3554O4152
23534a277P5735J4046j8276L1210Q4901P3484r0879j67182L779R0436m9151q8675
23522d1849J7430j0557o609j6903m4030J115l1721Q1550Q7913K1563p2833q6849
23510a01780K4579J8501Q5L2131J1393M5842J0997m7433J4852m6401m8729j9669
23498a05632k328M0739j1081j0393p8837l740L6384k6335Q5871L4567p4872j7080
23486a32737J7236M05p681L4966M1294k1048K4346K4367J5994p50p610k8817l5457
23473g5492R0859J23969K2682n6217l7422o6886o0728R222K6672m0973j1916N369
$$ plain form
23557 37536 -16547 -32359 -67881 -119387 -86757 -60051 -91824 -65184 -99310 -129486 -94432 -40612
23545 -40612 62816 49859 -61683 -150421 -94756 -43723 -145479 -161267 -128983 -65429 -1277
23534 -1277 74458 88504 70228 101438 186339 259823 168944 1762 5541 95977 46826 -41849
23522 -41849 -24419 -34976 -41585 -58488 -102518 -101403 -133124 -51574 36339 57902 -14931 -101780
23510 -101780 -77201 -58700 -58615 -26484 -15091 30751 41748 -5685 9167 -37234 -85963 -105632
23498 -105632 -107960 -67221 -78302 -88695 -167532 -171272 -134888 -161223 -75352 -40785 -115657 -132737
23486 -132737 -115501 -115096 -122777 -87811 -46517 -67565 -43219 -18852 -2858 -3608 -11218 -40035 -75492
23473 -75492 15367 139336 162018 105801 68379 1493 -59235 -50013 -23341 -64314 -76230 -70861
23461g0861r661J9024J538L2637o3066k2031Q8471M8332K1564P1379o985j0936
23449I9405m1586j6677J2714M3109L5035o5106q9424P373K2945M7234l8965l6720
23437b0663M084j1094j3506k8713r91k465m03K2980N0537o1000K5746J9425n0569
23424f6632P2156N2813l9481M2540K9121r4896K9236M4753m0612k4504q1448M0724
23412c6230N8642k0532q7979J04571Q4372k820m4889j531p169J6969n2317r7864
23400h6777n5890O2777K0045P840J9248L527M0253m9484n5133K08j6052N0492
23388e8946L0008k6595J7498L4895o5831J6602N9410n629p4383k8347o4620o4443
23376b30381l848O2974l2933P0083M6272l5883k0340N8529J33039L9319j4260
$$ plain form
23461 -70861 -80522 -61498 -59960 -27323 -90389 -112420 -23949 24383 45947 117326 110341 99405
23449 99405 57819 41142 53856 96965 132000 66894 -22530 -15157 7788 55022 16057 -20663
23437 -20663 -16579 -27673 -41179 -69892 -70883 -73348 -73751 -50771 -234 -61234 -35488 -16063 -66632
23424 -66632 5524 58337 18856 61396 90517 -4379 24857 69610 28998 4494 -76954 -36230
23412 -36230 22412 1880 -86099 18472 102844 100024 55135 53604 46435 63404 11087 -86777
23400 -86777 -142667 -79890 -59845 -52005 -32757 -29230 11023 -38461 -93594 -93386 -109438 -58946
23388 -58946 -28938 -55533 -38035 -3140 -68971 -52369 7041 1412 -72971 -101318 -165938 -230381
23376 -230381 -234229 -171255 -204188 -134105 -87833 -123716 -144056 -85527 47512 86831 72571
23365G2571j2299K1968r237p1286l1185O8351O2711K8893N3468J4993k1387j6490
23353A61071P368r9996o0496m4487j07485l8262N9972J52803O8374O6830k9576
23342A36116j01176q0745m543l8012l6370j2429L0042j8011P4000R6738J2387
23331E7997L1996l1643R901l3486p2990m479J08838Q6220p2204p3761l1892j16497
23319a42000R9432N6188M1198q743P327J4151J3571n5569n9837K481M2492J9938
23307C0629m8864O1583K8002p7612k1111k4800r754O4981L7315L5694k5774K8483
23295G8772p0044j09753k4624o5560M4274K7533L1575L9110j6810N0855k9827
23284d4499o3142Q809J6632K1158M6362L8275k7761m9560n1257k4892L1421J2684
$$ plain form
23365 72571 60272 82240 73003 1717 -29468 38883 101594 130487 183955 198948 177561 161071
23353 161071 168439 68443 7947 -36540 -144025 -182287 -122315 30488 98862 165692 136116
23342 136116 34940 -45805 -50348 -88360 -124730 -137159 -107117 -125128 -51128 45610 57997
23331 57997 89993 58350 68251 34765 -38225 -42704 66134 152354 80150 6389 -25503 -142000
23319 -142000 -42568 13620 54818 46075 53402 67553 81124 25555 -34282 -31801 10691 30629
23307 30629 -18235 43348 71350 -6262 -27373 -52173 -61927 3054 40369 76063 50289 78772
23295 78772 8728 -101025 -125649 -191209 -146935 -119402 -87827 -48717 -65527 -14672 -44499
23284 -44499 -107641 -98832 -82200 -61042 -14680 23595 -4166 -53726 -104983 -129875 -98454 -85770
23272h5770K2970M9469M0103p0775p6018l062J2805K7816P9263P9450M9974Q918
23260A35143j4222L0396p4408j11278l9683R297M0281q791R788O601j30877p122
23248a54875J05188L2945l7964O037p7222p6961N0387N7416P6376K2146Q02L833
23236H108P2375M6935r4360j0814K7845m9317o675p9542o3233M4028P1820p3253
23224a06083k3738O473O7344o205l9467j9439M8499L0677J28392m5724o1715l3337
23212e4323o9002K9127K9953P1295k4002N658l3086L9577M4489o7594j01187L1503
23200i7592Q6433K3719m0517r5465M660Q2028k3961N2846L8845o302r294N6097
23188G1497k8541l8900o7403j00505M4366M2288M2633M7831m9891j07307O8425
$$ plain form
23272 -85770 -62800 -13331 26772 -44003 -120021 -123083 -110278 -82462 -3199 76251 126225 135143
23260 135143 120921 151317 76909 -34369 -74052 -64755 -24474 -33265 -23477 -16876 -147753 -154875
23248 -154875 -49687 -16742 -54706 -48669 -125891 -202852 -152465 -95049 -18673 3473 4275 8108
23236 8108 80483 127418 33058 22244 50089 772 -5903 -85445 -148678 -104650 -32830 -106083
23224 -106083 -129821 -123348 -56004 -62209 -101676 -121115 -72616 -41939 86453 40729 -20986 -54323
23212 -54323 -123325 -94198 -64245 7050 -16952 -11294 -44380 -4803 39686 -27908 -129095 -97592
23200 -97592 -11159 12560 -27957 -123422 -118762 -36734 -60695 -7849 30996 24694 15400 71497
23188 71497 42956 4056 -63347 -163852 -119486 -77198 -34565 13266 -36625 -143932 -75507
23177g5507l273r0420L3798N5758J05853m1639j11984l5260O0139O7539j4229
23166d9225j7587L3119N3454n63k536r7426m6050L0449Q8982R969o7544n1225
23154a16183O5763m0353k9122p0342j2068J07223J1685M8130K7748p5009m5050
23143a27578J8036J8940m6418Q2772J0512n4768N0602J23r940k5555K4253n5634
23131a14655R6849R5296k2625m8821l7699L2181o6821M2190o4361k0987Q8134
23120b1319L502p4539k4544L1826M1906K717K4298N3664O2649L628p7526r4636
23108f8374l5321K4753m5914l4811l4717J9878N495L5632R9854Q3648K470r9693
23096d7100k3211N4913M8403j2362k2552J3006Q2279L2603o3799r5956R36M2531
$$ plain form
23177 -75507 -78780 -169200 -135402 -79644 26209 -15430 -127414 -162674 -102535 -34996 -49225
23166 -49225 -66812 -33693 19761 19198 16662 -80764 -126814 -96365 -7383 2586 -64958 -116183
23154 -116183 -50420 -90773 -119895 -190237 -202305 -95082 -83397 -35267 -7519 -82528 -127578
23143 -127578 -109542 -90602 -137020 -54248 -43736 -98504 -47902 -47779 -57719 -83274 -59021 -114655
23131 -114655 -17806 77490 54865 6044 -31655 526 -66295 -24105 -88466 -109453 -21319
23120 -21319 -17817 -92356 -116900 -85074 -43168 -40451 -16153 37511 100160 103788 26262 -68374
23108 -68374 -103695 -78942 -124856 -159667 -194384 -174506 -169011 -133379 -33525 50123 52593 -47100
23096 -47100 -70311 -15398 33005 20643 -1909 11097 93376 125979 62180 -33776 -32840 9691
23084I691o4756K2430L5934j2561j0721n2820P7849j5699o709O5318N1200j4929
23072H4227k6837r9056K8922L6660p097k7099n5389j2787J60029O2315k4626l263
23060A15999p5285n4845L9103R284n0231n5965n631L7013O7841j0983j7110J4274
23048A3464J7305j19846k0403L7642J2468n3939j0059K1222J1879J8734Q156q4667
23036a48044K2Q6050N8682L5476R191p8584k7374L0122R9898k2842o1427l4500
23024e3330k2791o691r756K1972K1177N5268j5213k4354l6787n886L6268L2621
23012g502N4340M6326J00508M4732j21117r8118m2095m80K6247N475K5214m06
23000C3124l6516O2945Q0698J10102j4665r0408o1395p4429k4946K6739P9801
$$ plain form
23084 9691 -55065 -32635 3299 -9262 -19983 -72803 5046 -10653 -17362 47956 99156 84227
23072 84227 57390 -41666 -12744 23916 16819 -10280 -65669 -78456 81573 143888 119262 115999
23060 115999 40714 -14131 24972 34256 -15975 -71940 -77571 -40558 27283 16300 -810 13464
23048 13464 30769 -89077 -109480 -71838 -59370 -113309 -123368 -102146 -90267 -71533 -63377 -148044
23036 -148044 -148022 -61972 -3290 32186 41377 -37207 -64581 -34459 65439 42597 -18830 -53330
23024 -53330 -76121 -82812 -92568 -70596 -49419 5849 -9364 -33718 -70505 -76391 -40123 -7502
23012 -7502 46838 93164 193672 238404 117287 19169 -22926 -23406 2841 8316 33530 33124
23000 33124 -3392 59553 140251 250353 235688 145280 83885 9456 -15490 11249 91050
22989I1050M0569M2595j25204j00430l5673j9796k6848o5225M060O9333P2330
22978e3239n0075l5962r123J1985O3029L5289k985L7021L4567J9591l8084k4320
22966a2306k9944K7645K4759M2705L6461j9368k1136l429l7214L5231M3035o7099
22954A9340J8393l5639m1222m31O6155L4664O2600m6364j1728p5389N7084M7420
22942I4883m4184k7120l2420K4656l2138L4886M8458L2610k7070r5358p7644k5143
22930a25584P4001M0861K525n2482n3668M8640L7347j21770k9926O1044p6760
22919a95772p6564P9510O6297J20658R7464J6247j34080p8716k9343N5415L3235
22908d5649L9146J00633l7898J7853q4799p2035K6277j4685j1700q839j0157J22451
$$ plain form
22989 91050 131619 174214 49010 -51420 -87093 -106889 -133737 -198962 -194902 -125569 -53239
22978 -53239 -103314 -139276 -148399 -136414 -73385 -38096 -41081 -4060 30507 50098 12014 -12306
22966 -12306 -42250 -14605 10154 52859 89320 69952 48816 45387 8173 43404 86439 19340
22954 19340 37733 2094 -39128 -39559 26596 61260 123860 77496 65768 -9621 47463 94883
22942 94883 50699 23579 -8841 15815 -16323 18563 67021 99631 72561 -22797 -100441 -125584
22930 -125584 -51583 -10722 -8197 -60679 -114347 -65707 -28360 -150130 -180056 -119012 -195772
22919 -195772 -272336 -192826 -126529 -5871 91593 107840 -26240 -104956 -134299 -78884 -45649
22908 -45649 -6503 94130 56232 74085 -10714 -82749 -56472 -71157 -82857 -91696 -101853 20598
22896B0598l1265l5078J8700j1191m8261o679R073O9193K1886J2569n6410M9238
22884A2373N4784k4290k8425J3495n7577q054K7464N835R0894Q9042r727j23050
22872D2764p0796J199K2016r1239k3103L9061L8450m640L0379L8133J3343J2439
22860D8006l0891j9575o7054m9220O552J00063L5489J8200p90l3180r3881m9882
22848a36163K0086L0102l3324P586N9813J9986j9605M0790M3498M2968Q3263l3995
22836A25005r9022j5645L1495J02268j2302o4118M6547K4864J4747n3557m8464
22825E1818k7672K717j6626J4313j0713M9307K0273O075o0480p0380p4801L9775
22813g6394M333n183L5508N2628R232k711j7189r3137j13967R1826N1758j981
$$ plain form
22896 20598 -10667 -45745 -27045 -38236 -86497 -93176 -84103 -14910 6976 19545 -36865 12373
22884 12373 67157 42867 14442 27937 -29640 -37694 -10230 -4395 86499 175541 165814 42764
22872 42764 -28032 -26833 -4817 -96056 -119159 -80098 -41648 -46288 -15909 22224 35567 48006
22860 48006 17115 -2460 -69514 -118734 -112182 -12119 23370 41570 40780 7600 -86281 -136163
22848 -136163 -116077 -85975 -119299 -111713 -51900 -31914 -51519 -10729 32769 75737 159000 125005
22836 125005 25983 10338 41833 144101 131799 67681 114228 139092 153839 100282 51818
22825 51818 24146 26863 10237 24550 13837 63144 83417 89492 29012 -41368 -116169 -76394
22813 -76394 -72061 -77244 -41736 10892 20124 17413 224 -92913 -206880 -115054 -63296 -65277
22801f5277K4962R1519p0581j8127j02067k778N2779P360K1925N6897M7767N6528
22789A00907l1453n4892o3713L3434R198K2492j8581O1299o2055k0189N2488K1830
22777E0765n2704K8954J7235l5712k8803M1967J8475K7227O5038q1129m2125M7037
22765E6225m6261m7579n5917J5792j651J8316M6728j1332l3557k8480k0076N0911
22753e6881K349M2926M9041P1008o4181l7418j12454p0434j0519P0435Q2065O981
22741b7082j1598R036L1089J507o6191N1101k682p4020O3729j0898m3872l1904
22729a11785J8755K3637m67N3538n8776k9163J8641O0176L3449k1114j4568J8380
22717i297O715l2762q661N6679N9947p6288n4646K7540O4847l4890q1791o08M6004
$$ plain form
22801 -65277 -40315 51204 -19377 -37504 -139571 -142349 -89570 -82210 -60285 -3388 44379 100907
22789 100907 69454 14562 -49151 -15717 -6519 15973 -2608 58691 -3364 -23553 28935 50765
22777 50765 -1939 27015 44250 8538 -20265 21702 40177 67404 132442 51313 9188 56225
22765 56225 9964 -37615 -93532 -77740 -79391 -61075 -14347 -25679 -59236 -87716 -107792 -56881
22753 -56881 -54532 -11606 37435 108443 44262 6844 -105610 -176044 -186563 -116128 -34063 -27082
22741 -27082 -38680 -29644 1445 2952 -63239 -12138 -14820 -88840 -25111 -36009 -79881 -111785
22729 -111785 -93030 -69393 -69860 -16322 -75098 -104261 -85620 -25444 8005 -13109 -27677 -9297
22717 -9297 -2582 -35344 -44005 12674 72621 -3667 -58313 -30773 34074 -816 -82607 -83215 -37211
22704c7211J3023l5140n4788L890K1607L6897r343o5912j2636L6263P7019m924
22692c1255L743l3445m9443l6410J7641N5733M6254L6606J8424o3408k4645k1716
22680h1921K8001O0940J776Q429L2930J2788j4100j5880n6195J1693N4713L3878
22668G7052K972n4833k4825q3263K3376K8242N5447m8534j15179J2041R663M7974
22656f9867j9088n1059j65079K6208J06338J55284O8928l137m8702O5089L3742
22645I8657r2481m6268J1750L3927P681n2412k0304J03206R1392o132o9561n0603
22633H852M2123j338o2106M3491N2873n9981r4426n8386O1540Q2908n1893J0886
22621b5457k6879k1650j5224m7954k4582k5620K8021P8671k0003P2837J76220
$$ plain form
22704 -37211 -24188 -59328 -114116 -110226 -88619 -51722 -61065 -126977 -139613 -103350 -26331 -31255
22692 -31255 -27512 -60957 -110400 -146810 -129169 -73436 -27182 9424 27848 -35560 -60205 -81921
22680 -81921 -53920 7020 8796 17225 50155 62943 48843 32963 -23232 -11539 43174 77052
22668 77052 80024 25191 366 -82897 -59521 -31279 24168 -24366 -139545 -127504 -117841 -69867
22656 -69867 -88955 -140014 -305093 -278885 -172547 -17263 51665 48528 -174 64915 98657
22645 98657 6176 -40092 -28342 5585 13266 -39146 -59450 43756 135148 129016 59455 8852
22633 8852 50975 49637 -12469 31022 83895 23914 -70512 -128898 -67358 15550 -36343 -25457
22621 -25457 -52336 -73986 -89210 -137164 -161746 -187366 -159345 -80674 -100677 -27840 148380
22610A48380j16477n2039k6728k3027M1274K9662M5118K6621q3698M613M3627
22599C7326j2887J9053L2172J5200j31473q2798R566O7760O880r830Q5316n4579
22587a8294j9515k185J7211j2204K706o1764n554o4896K3655J00284Q8657Q1633
22575A29734o135o775l1947l1475o856m11q743K9142M2463L7651l5625j3321o7325
22562C0377n5834q0056M0108M780q62N0798N9823k6268k436n3251k9034M6220
22550a5635N4202q97l0790K1430M85p9695l0017R8215O4658O1481m3433r3712
22538F292k7297P770J3014N1399L4456n403N4754r9943j05628L1598n2703k1006
22526a12697N060K2714P2569N4577j4388L0981n3192m6172n2664N4719O5058J3005
$$ plain form
22610 148380 31903 -20136 -46864 -69891 -28617 1045 46163 72784 -10914 -6301 37326
22599 37326 24439 43492 75664 90864 -40609 -123407 -113841 -46081 -39201 -49031 36285 -18294
22587 -18294 -37809 -39994 -22783 -34987 -32281 -94045 -99599 -164495 -140840 -40556 48101 129734
22575 129734 123599 116824 84877 53402 46546 46135 37392 66534 108997 146648 111023 97702 30377
22562 30377 -25457 -105513 -65405 -60625 -61487 -10689 49134 22866 20430 -32821 -61855 -15635
22550 -15635 38567 37670 6880 28310 28795 -50900 -80917 17298 81956 143437 100004 6292
22538 6292 -21005 -13235 -221 51178 85634 80231 134985 35042 -70586 -38988 -91691 -112697
22526 -112697 -107637 -84923 -12354 42223 27835 58816 5624 -40548 -93212 -38493 26565 39570
22514C9570l2620j2381K9872M648p1341k8040P2306j398M1780J3315M2810m6256
22502E2265l5885p495l9372j7469P7619O0241l0962k4255N8247o0098M5626O2833
22490A41295K0800L3720K0296n5349m2807p1802q8042J220J9209J07022O5744
22479A51306p6524j0008P974q0663M0739N3606l1748q0266j20727k3679J35299
22468c4691Q0715p3812m711M0138K3300j12057q4082N2435L0047P1750O0528J4958
22456F4518K5314p5205j08065q298J00135R7847N1677n4669j02907n1923R5044
22445C3468N3468K8983k1838m089o4488l3118J2949J0463O7361J08869n635p2025
22433A14368m9730l850m6429m0427M944j1380K4202M940j19775L5332p409m6954
$$ plain form
22514 39570 6950 -5431 24441 29089 -42252 -70292 2014 616 42396 55711 98521 52265
22502 52265 16380 8885 -30487 -47956 29663 89904 58942 34687 92934 32836 78462 141295
22490 141295 162095 195815 216111 160762 117955 46153 -41889 -40669 -21460 85562 151306
22479 151306 74782 64774 72748 -7915 32824 86430 54682 -25584 -146311 -169990 -34691
22468 -34691 46024 -27788 -32499 7639 30939 -81118 -165200 -112765 -82718 -10968 49560 64518
22456 64518 89832 14627 -93438 -101736 -1601 96246 147923 93254 -9653 -61576 33468
22445 33468 86936 115919 94081 89992 25504 -7614 5335 15798 83159 192028 186393 114368
22433 114368 64638 60788 14359 -26068 -21124 -32504 -8302 -3362 -123137 -87805 -95214 -142168
22421a42168P6008P1464n586L7143l0173o27L2957m8610K8990n9393r1415J48927
22409A7517R3413m2351J2752K1738K9142k3880o7621r3479n5115p1008M1667N9074
22397g8151L4057Q3126j139k3547k2016J4790n056k1921K3320N3455l0172n1407
22385b4661M617q3876Q8673P8350K2171Q3786j2345q1579l7966o582K2690j0316
22373D2962o7409k8503P3684J5533l7353l5385j6652L00l1115R7258J01162M0031
22361A54513j16031l5223o3989l9365N094k9382j372M4063k7669N8931R145N5929
22349A4644l0902j167K7707J0544K6680j418q0528j08636K669p428j4777P1066
22337i1546J40100j118J4586j5666j0066q5410p895P051K2974j16850K9664Q1067
$$ plain form
22421 -142168 -66160 5304 -282 36861 6688 6061 39018 -9592 19398 -39995 -131410 17517
22409 17517 110930 68579 81331 103069 132211 108331 40710 -52769 -107884 -178892 -137225 -78151
22397 -78151 -44094 39032 37893 14346 -7670 7120 2064 -19857 3463 56918 26746 -24661
22385 -24661 -20044 -103920 -15247 63103 85274 169060 156715 75136 37170 30588 53278 42962
22373 42962 -24447 -52950 20734 36267 -1086 -36471 -53123 -52823 -83938 13320 114482 154513
22361 154513 38482 3259 -60730 -100095 -95001 -124383 -125755 -81692 -109361 -50430 -41285 14644
22349 14644 -16258 -17425 10282 20826 47506 46088 -34440 -143076 -140407 -147835 -162612 -91546
22337 -91546 48554 47436 62022 46356 36290 -49120 -57015 -49964 -26990 -143840 -114176 -33109
22325c3109p22j7020J1886k7916M7545l6285p5291k4795Q5454K6323J15792P5592
22313A47454j03093l807J29977n1428l5299n0337L8421K7194l9217l8559K5198
22302D6504m834K2189l4513m6581J4083j6163p477Q175j3166Q3132K5707q7212
22290a0156m3843P9583L982k837L05J03346J8389p8064n702m353M9402j5642j2551
22277H1859N7189Q7551m3701p7788n5073j2443N6341o8280j942M8321J8434N9911
22265A50379m1278p6621m1707j4373L0764J36140P7247j29317k9529l4193j9020
22254H492k4575N0678j0120q0207k7268L9773J20168N2058l3762K9645J2302n7448
22242G9736q2005M0309n9538l2390o224j9132K9248Q8207M1926K4512p213j04622
$$ plain form
22325 -33109 -33831 -50851 -38965 -66881 -19336 -55621 -130912 -155707 -70253 -43930 71862 147454
22313 147454 44361 40554 170531 119103 83804 33467 71888 99082 59865 21306 46504
22302 46504 41670 63859 29346 -17235 -3152 -19315 -26792 -18617 -31783 51349 77056 -10156
22290 -10156 -53999 25584 29566 26729 27034 130380 148769 70705 65003 60650 110052 94410 81859
22277 81859 139048 226599 182898 105110 50037 37594 93935 25655 23713 72034 90468 150379
22265 150379 109101 32480 -9227 -23600 7164 143304 220551 91234 61705 27512 8492
22254 8492 -16083 34595 24475 -55732 -83000 -43227 76941 128999 95237 124882 137184 79736
22242 79736 -2269 38040 -21498 -53888 -60112 -79244 -49996 38211 80137 104649 97436 -7186
22230g186P0923Q051q6075m2285L2607M5290L0702j01370j0629L4134K9161n5347
22218e2024k8534O3699L8947P1832j3809O14K0089n5378l8745j8024N685r3355
22206i9003N3245R4566J0938l3500m5205k4171K0569l3247l3675m1099R8593M6963
22194A4974M7593N3935j9011k6179m6493m4467K4776N7j477k1582q2877j282J40628
22181C8595N7038n4409l4575J8369Q0572n7571o1383l8177K77j3520l5542J5467
22169h4859J59L8984J06944R9255p819j3770J441r6655o2495R1092Q1547J7010
22157A70834j7275r4828m6042K5216M1876j6525N9638o4187o5842N0692j2157
22146C1400n8319M8026l2317L3717o0474k5468K5134K3442Q7736j3153n7189N2595
$$ plain form
22230 -7186 63737 71788 -14287 -56572 -23965 21325 52027 -49343 -59972 -25838 3323 -52024
22218 -52024 -80558 -16859 22088 93920 80111 80725 100814 45436 6691 -11333 -5648 -99003
22206 -99003 -45758 48808 59746 26246 -18959 -43130 -22561 -55808 -89483 -130582 -31989 14974
22194 14974 62567 116502 97491 71312 24819 -19648 5128 5185 3708 -17874 -100751 -102033 38595
22181 38595 95633 41224 6649 25018 105590 48019 -13364 -51541 -51264 -64784 -100326 -84859
22169 -84859 -84700 -45716 61228 160483 152664 138894 140335 43680 -18815 72277 153824 170834
22157 170834 153559 58731 12689 37905 79781 63256 122894 58707 -7135 43557 31400
22146 31400 -26919 21107 -11210 22507 -37967 -63435 -38301 -14859 72877 59724 2535 55130
22134E5130l3620L3027o3933m2284R9682M4080m974o3033l4343j191M621Q67l6797
22121d2768m864k2478O4146k347l139K3062l2392K1268O2996q7821k3188p1799
22109a19324O554M8813J741Q1202j6019p5851o9469j2504O9433J23274J05567
22098A43417P016l1629j8713j18659j10011l5170l1468J11302R1345M2194k9218
22087B0406R669j7648P94n9120O167O1721L0177j0770J12916J4522M741p2921
22075A00654l2675L0346J6813j4234l3592l0956p3617K4195m105n89M0293J4587
22063C7120J7557J3254Q8629r470r4295r252n7220m6331r805m5123J05543P194
22051b199N473J9757r951M1807r839k7980K7287p482K2482k8574j3950P2123M8848
$$ plain form
22134 55130 21510 54537 -9396 -51680 48002 92082 87108 24075 -10268 -11459 -6838 -5971 -42768
22121 -42768 -47632 -70110 -5964 -8311 -11450 11612 -20780 488 63484 -24337 -47525 -119324
22109 -119324 -112770 -63957 -62216 18986 2967 -72884 -142353 -154857 -85424 37850 143417
22098 143417 150433 118804 100091 -18568 -128579 -163749 -195217 -83915 7430 49624 20406
22087 20406 30075 12427 13221 -45899 -39732 21989 52166 41396 154312 168834 173575 100654
22075 100654 67979 98325 115138 100904 67312 36356 -37261 -13066 -17171 -17760 22533 37120
22063 37120 54677 67931 156560 147090 52795 43543 -13677 -60008 -69813 -114936 -9393 -2199
22051 -2199 3274 23031 13080 54887 45048 17068 44355 36873 59355 30781 16831 88954 137802
22038A37802k2920n6045p8164o3852o5751j5446j2901O5298M8650K0473K6995
22027a5861L1199N640k127J6179J2801l3086o8451J9180M2528m3417p0664m3624
22015a49703J6908R807J0088O44J1630K6430j2723n3922O9743M7647q896O3661
22003C1314Q7084J4160k5279k8083p0378r1801J105K2790J1637q294N3230R6596
21991I4081N13j03686l2472P3465m3699p6074j7640P9305J2229k368j45645j4379
21979a76370L8706R3463O644n6623L891R2162m4149K7321m455p114K8335L4282
21967C6093k421p0605L3189k5706m4212l1134q681r5O08O2116J0118K9554J0532
21954f44K018M241R6604J1608o4462L2507L6966j22036r0892K8596N7423M1671
$$ plain form
22038 137802 114882 58837 -19327 -83179 -148930 -164376 -177277 -111979 -63329 -42856 -15861
22027 -15861 15338 20978 18851 35030 47831 14745 -53706 -34526 8002 -35415 -106079 -149703
22015 -149703 -132795 -122988 -112900 -112256 -100626 -74196 -86919 -140841 -71098 -23451 -32347 31314
22003 31314 118398 132558 107279 79196 8818 -82983 -81878 -59088 -47451 -55745 -2515 94081
21991 94081 94594 -9092 -41564 31901 -11798 -87872 -105512 -26207 -13978 -16346 -161991 -176370
21979 -176370 -137664 -44201 -37557 -94180 -90289 1873 -42276 -14955 -19410 -26524 1811 36093
21967 36093 33672 -36933 -3744 -29450 -73662 -104796 -113477 -113572 -112964 -50848 -40730 -11176 -644
21954 -644 1374 5615 102219 113827 49365 81872 118838 -3198 -94090 -65494 -8071 33600
21942C3600K2147K179j9124l4079J619j4258N5126k0727K3634l0713l4231o6620
21930h1447j8978L7938l7681O3983J6636m1830K0898N5846k8323q3392N8825J7396
21918b0129j3614R235M7486k2458K1297M9459n1935l1479J8988M107O9583j5293
21906F5247o3166l3959l3752J0706O7877K5983p1978r436L6595k5979M0788M1848
21894E0774K2989q9374q4045J08443K6658M3121K6791L7289K5888l4115q0696
21883E3723J5243Q3849l5236j13148N2886k8782m1302N794L2531k0207J1224J9576
21871C6151m5706n4576p4797J1462P3335O3524j5448m6273p4603p1259J0619K4944
21859a62627M8354j824j1167l0188j720O9662l2834r3109R7206O8765M4255M2458
$$ plain form
21942 33600 55747 57926 38802 4723 6342 -7916 47210 26483 50117 19404 -14827 -81447
21930 -81447 -100425 -62487 -100168 -36185 -19549 -61379 -40481 15365 -12958 -96350 -37525 -20129
21918 -20129 -33743 -24508 22978 520 21817 71276 19341 -12138 6850 10957 80540 65247
21906 65247 2081 -31878 -65630 -54924 12953 38936 -33042 -42478 -5883 -31862 8926 50774
21894 50774 73763 -15611 -99656 8787 35445 78566 105357 142646 168534 134419 53723
21883 53723 68966 152815 117579 4431 57317 28535 -12767 -6973 25558 5351 16575 36151
21871 36151 -9555 -64131 -138928 -127466 -54131 9393 -6055 -52328 -126931 -198190 -187571 -162627
21859 -162627 -114273 -116097 -127264 -157452 -159172 -89510 -122344 -215453 -118247 -49482 -5227 37231
21847C7231m9741K5123j9854M0748n317o863j8606l467M7928L1202j6571j2776
21835D9037m8739m0480j5356N1487m4782j4725O2262j8881K3401Q580p6463o0453
21823a25112o3883L162M8677o3487O8540L3725p6529J8968N0113N0786r45n695
21811f1680M6961j5779Q7972Q2946M3187L4355j1307o8622o0416k9163k0878n4425
21799b6849j9951j9590q44o6254M1613J6918L6144K4973O5123j7776k3364J6576
21787B6719q4941j5687K5331N049K2498k6202L8518J6804K509M6256q336j37706
21775h9188P1926N0291l1804o794n8065N8689J23663J6284k81k5279j10451r4530
21763i5539l5210J3371P556J3266N6905O1945K9256J365r8610n8646R2888J8739
$$ plain form
21847 37231 -12510 12613 -7241 33507 28190 21327 2721 -746 47182 78384 61813 49037
21835 49037 298 -40182 -55538 -4051 -48833 -63558 -1296 -20177 3224 11804 -64659 -125112
21823 -125112 -188995 -185833 -137156 -200643 -132103 -98378 -174907 -155939 -105826 -55040 -55985 -61680
21811 -61680 -14719 -30498 57474 140420 183607 217962 206655 138033 77617 48454 27576 -26849
21799 -26849 -46800 -66390 -67234 -133488 -91875 -74957 -38813 -13840 51283 33507 10143 26719
21787 26719 -58222 -73909 -48578 -43529 -21031 -47233 -8715 8089 10598 56854 48518 -89188
21775 -89188 -17262 33029 1225 -5569 -63634 -4945 118718 135002 134721 109442 -1009 -95539
21763 -95539 -130749 -117378 -109822 -96556 -39651 22294 51550 52915 -45695 -104341 -11453 7286
21751G286J7464k6033L762q0848m0407L6944J2422K2250l783l3456L3375J3164
21739c7860N3681l2721j4282l1204k8962J23269P5613m310N3112j9906j52518
21728a6088o7529j7792Q2310L0236q0056j9452P9804p792L7065j8577p2708m0929
21716a11508P2359L9572J21014j9751o4117L712m6305K3854k4978l228J5913r9497
21704i2960l8319J0323j5366j0378N5166P9584M2352M8173j4087L5882J30446
21693B30816p3235q4299J5999p9618R796j7032L3122q3680k0081N4623N7010k7740
21681A5681j00775q4784k9711J1735O5602L6742L1226M906K1154J2893J5283J0163
21669A0115k4600L2629O7480p642k3505L6585L7022m9098J7546j2919n1996l3056
$$ plain form
21751 7286 24750 -1283 2479 -78369 -118776 -81832 -69410 -47160 -50943 -84399 -51024 -37860
21739 -37860 15821 -16900 -31182 -62386 -91348 31921 107534 103224 156336 136430 -16088
21728 -16088 -83617 -101409 -19099 11137 -68919 -88371 -8567 -16359 20706 2129 -70579 -111508
21716 -111508 -39149 423 121437 101686 37569 41281 -5024 18830 -6148 -9376 6537 -92960
21704 -92960 -131279 -120956 -136322 -146700 -91534 -11950 30402 78575 64488 100370 230816
21693 230816 157581 73282 89281 9663 19459 2427 35549 -48131 -68212 -13589 43421 15681
21681 15681 -85094 -169878 -199589 -187854 -122252 -85510 -54284 -49378 -28224 -15331 -48 10115
21669 10115 -14485 18144 85624 77982 54477 91062 128084 78986 96532 83613 31617 -1439
21657a439n0939j83P3048K0816n7162p4225K0601l9589M5542J2532M8419K6556
21645B3977j2767k8629j3239O914k0937l3009l2942R474J4426N8465J0732J2776
21633d759p7864m7032J07565l0391j6233J7809J20326k5248k872m0979r3137l014
21621i5829J00873L0541J9517P3139j2164K2932K0525n0818q1068J8289p81l5336
21609I820n2974p4471m1456L101K5869K0940K1984q1410N7619K2564L6554Q6165
21597C4305K4727m8676N9938j0979o6919m995J21979M0684p7764r5534J1936N9035
21585D7737j5924r1066p887j0766O693R572J3020M4582m1775m1408L1933O4470
21573I181k8005j1135m0458L5632N0822N0788j4041K7407m6984j9647L7091o0525
$$ plain form
21657 -1439 -52378 -52561 20487 41303 -15859 -90084 -69483 -109072 -63530 -50998 -2579 23977
21645 23977 11210 -17419 -30658 -23744 -44681 -77690 -110632 -101158 -86732 -28267 -17535 -4759
21633 -4759 -82623 -129655 -22090 -52481 -68714 -50905 69421 44173 41301 322 -92815 -95829
21621 -95829 5044 35585 55102 128241 116077 139009 159534 108716 27648 45937 45156 9820
21609 9820 -43154 -117625 -159081 -155980 -130111 -109171 -87187 -168597 -110978 -88414 -51860 34305
21597 34305 59032 10356 70294 59315 -7604 -12599 109380 150064 72300 -23234 -11298 47737
21585 47737 31813 -59253 -67140 -77906 -71213 -61641 -48621 -4039 -45814 -87222 -55289 9181
21573 9181 -18824 -29959 -70417 -34785 16037 66825 52784 80191 33207 13560 50651 -9874
21561i874l4233M048o441j2042j3999O127M0303N6190r749j43328r8142n898l610
21548b30648O9248O9863l6363o2319M0466P8060o636O0250L8670L3531k5864J4836
21536D3094j0954R9153l5602p6032p9628k5026k592K599K1302m0414K8380L8516
21524c7204K9256k8286l4522P7118M3114l6376l1105l5428k5002K3059O9513O9024
21512H3161M2550l5191k0827L5875l3256J1610l4886k2541l4552L0778n3449n305
21500c6033p2654n2897R0739P5130K0521o1701l9310Q2995K6124j1555n673N6529
21488G2215m1466o2520k7388M9685k816k9827r020r789J45234P0625L2271l1441
21476A55763k8278N2844J4436j07405n4065N6650l4133M4359j1552n7174K8845
$$ plain form
21561 -9874 -44107 -40059 -46500 -58542 -72541 -66414 -26111 30079 20330 -122998 -221140 -227038 -230648
21548 -230648 -161400 -91537 -127900 -190219 -149753 -71693 -78329 -18079 20591 54122 28258 43094
21536 43094 32140 131293 95691 19659 -59969 -84995 -87587 -84988 -63686 -104100 -75720 -37204
21524 -37204 -7948 -36234 -70756 6362 49476 13100 -18005 -53433 -78435 -55376 14137 83161
21512 83161 125711 90520 69693 105568 72312 83922 49036 26495 -8057 22721 -30728 -36033
21500 -36033 -108687 -161584 -70845 4285 24806 -36895 -76205 6790 32914 21359 15686 72215
21488 72215 30749 -31771 -59159 -9474 -12290 -42117 -51137 -60926 84308 154933 187204 155763
21476 155763 127485 180329 194765 87360 33295 89945 55812 100171 88619 31445 60290
21465F0290Q0001J2578j10900l7504k0858L1079Q870k2321N9866Q2276q3841n3723
21453E813O0898j2223p8455K1593P6282L9846n5684k3601L0480l5568p7671m3057
21441i1347l3829j1843N7576j8199N228N9428k9677n0924Q5320j8702j9207O1636
21429d540n030J5119J1867Q727J7243j1265q289j5561n1991l8026j7055N1350
21417d7451O721l7705N305l7983J8879Q3971N6886N1807K5387j5488p9588p0340
21405c9599o8342j19J3242j433Q057l4758J000O6456m2925o9198l4168j3056j3829
21392b28672J1935M4911J9333J25292J28284j0363k1545q5935o2284o0154Q627
21381a30571J12320O6174k1248N8263P4858m6619j31363l8178k8239P1856R2693
$$ plain form
21465 60290 140291 152869 41969 4465 -16393 14686 23556 1235 61101 143377 59536 5813
21453 5813 66711 54488 -23967 -2374 73908 113754 58070 34469 64949 29381 -48290 -91347
21441 -91347 -125176 -137019 -79443 -97642 -92414 -32986 -62663 -113587 -28267 -46969 -66176 -4540
21429 -4540 -9570 5549 17416 26143 43386 32121 23832 8271 -43720 -81746 -98801 -47451
21417 -47451 -40730 -78435 -73130 -111113 -92234 -8263 48623 100430 125817 110329 30741 -39599
21405 -39599 -107941 -108060 -94818 -96251 -88194 -122952 -121952 -55496 -98421 -167619 -201787 -214843 -228672
21392 -228672 -216737 -171826 -152493 -27201 101083 90720 69175 -16760 -79044 -139198 -130571
21381 -130571 -18251 47923 26675 84938 159796 113177 -18186 -56364 -84603 -12747 79946
21370G9946R245k7892J247o823k3573n4963L8852J3864q1557p5335M7596P2209
21358g184J07408N9749P4873q019n766p8818j28677l2185Q0773r1761O678P0402
21346D7473Q8225m9066j20158l4649L4553m763J1119K0464p6120J7946J20261
21335E5285J4488l0956o1466N6112Q6145J9127j2489r2667m4845l2691q009O8012
21323A6046Q436q7321l475O8023J33542O0377p7058o7659n7213n1324p6761J4540
21311a19847M4792Q625k992M3898M9661J2759J7440J6991J09611N3739j44565
21300I0112j62314J3536Q8761l9008k8971o4542n4732J1545q68n423K3299K5189
21288a03416M3689K1253K6890N6781K302o5333o3103l7715P4589M0548K6854J7507
$$ plain form
21370 79946 89191 61299 62546 55723 32150 -22813 16039 29903 -51654 -126989 -79393 -7184
21358 -7184 100224 159973 234846 226827 221061 142243 13566 -18619 62154 -29607 -22929 47473
21346 47473 135698 86632 -33526 -68175 -33622 -38385 -27266 -6802 -82922 -64976 55285
21335 55285 69773 38817 -22649 33463 119608 138735 126246 33579 -11266 -43957 -51966 16046
21323 16046 24482 -62839 -66314 1709 135251 195628 118570 50911 -6302 -57626 -134387 -119847
21311 -119847 -75055 -66430 -69422 -25524 24137 36896 54336 71327 180938 234677 90112
21300 90112 -72202 -58666 30095 -8913 -37884 -102426 -157158 -145613 -146481 -151904 -128605 -103416
21288 -103416 -59727 -38474 -11584 45197 47499 -17834 -80937 -118652 -44063 -3515 23339 40846
21276D0846p6074n1939k773M9288K5552L4035l1065k9621j4062j13366l7408M9675
21264a56912J15698P5338q0969n8597j6099L0209P1715Q1439J2046o3503k1973
21253a1608K5798K402j8040L1512o7192n5156J7951J19587K9865o1806q2973k3829
21241i3489O9440M5571j1096o0113R0560O8494r6488p8473N3439P3497j878j42217
21229h2753j0067P2922R4802L2642K3910N820j13741j05301J5926L9136L5511
21218H807K1836r1325k4240J5240J6630J9158j7461P033k050l858j3352l2874
21206i6456L7550J9142n0688J969M5403M2057J3927k0570k5776K6457J3794m4971
21194c8162K0540K2046N4317M348K9652q7277k336K7005M6150O667p0748p5973
$$ plain form
21276 40846 -35228 -87167 -89940 -40652 -15100 18935 -12130 -41751 -55813 -169179 -206587 -156912
21264 -156912 -41214 34124 -46845 -105442 -121541 -91332 -19617 61822 73868 10365 -11608
21253 -11608 14190 16592 -1448 30064 -37128 -92284 -74333 45254 75119 13313 -69660 -93489
21241 -93489 -24049 21522 10426 -49687 40873 109367 12879 -65594 -12155 61342 59464 -82753
21229 -82753 -92820 -19898 74904 107546 131456 137276 23535 -81766 -65840 -26704 8807
21218 8807 30643 -60682 -84922 -69682 -53052 -33894 -51355 -44322 -46372 -50230 -63582 -96456
21206 -96456 -58906 -39764 -90452 -88483 -43080 -1023 12904 -7666 -33442 -6985 6809 -38162
21194 -38162 -17622 4424 58741 63089 92741 5464 3128 30133 76283 82950 12202 -63771
21182f3771k2406J6160L8474M8842k2691l0831n5521O9151J12681l2138K0241
21171G8191N143m2288n589j4299p7806o7190j5126n9006J46872K4414m0441j6371
21159h3496O5428P9139K6139O118l4909j42766j46031P4481J6763N9844L9556
21148c9734M1826K6442j22052p5311K2842M7655m1097K4848J31489l6302m6213
21137f5607n623N6555Q305N3906N6254J8811K1859m6766J6064m3613j6159j4032
21125C9954k3590k8288L5376K3538o0522j4612N2036J02315J110M0591j31767
21114C6141n052M6361k9180J5971K545l694O7204p3952l7774o9985K6340l5739
21102f0814p249Q1858O3472J3961l7513L6806L9038j6957n6833o7178m4246k1595
$$ plain form
21182 -63771 -86177 -70017 -31543 17299 -5392 -36223 -91744 -22593 90088 57950 78191
21171 78191 83334 41046 35457 21158 -56648 -123838 -138964 -197970 -51098 -26684 -67125 -83496
21159 -83496 -18068 61071 87210 93328 58419 -84347 -230378 -155897 -139134 -79290 -39734
21148 -39734 2092 28534 -93518 -168829 -145987 -98332 -139429 -114581 16908 -19394 -65607
21137 -65607 -71230 -14675 -6370 47536 103790 122601 144460 97694 113758 70145 53986 39954
21125 39954 16364 -11924 23452 46990 -13532 -28144 23892 126207 127317 167908 36141
21114 36141 31089 77450 48270 64241 66786 63092 130296 56344 18570 -51415 -25075 -60814
21102 -60814 -68063 13795 77267 91228 53715 90521 129559 112602 55769 -11409 -55655 -77250
21090g7250O1352L2551M5423N0583Q304q836L0846m9382n9787P0210M469r3714
21078A4769j9254n1915P653L2561J01139N5625j0279n7008J4119j6876j6820L5816
21066H9530l5340m9967m7460l2014J866J02705R9875M065o7004l4465M8520J4080
21054I4391O0998k0187n0817r7114j08616j8981J34174N4416J427L177K4354l1480
21042D5742o2381p2205l0379N6148M8309M3802k5536k3475j3617L2104l2826j1576
21030d5890m028R042M4892l4339K0722Q3633j7549L2279N5281l5457l0543n9402
21018A8641j4966j4730o212K3875J6501o8154k7978m6260K1162k2592m583M5382
21006g9914P2889Q2539j3006l2270K3133Q067L7185k8592l366j5964p5243o0458
$$ plain form
21090 -77250 -15898 16653 62076 112659 120963 112127 142973 93591 33804 104014 108483 14769
21078 14769 -4485 -56400 -48747 -16186 84953 140578 130299 73291 87410 70534 53714 89530
21066 89530 54190 4223 -43237 -75251 -73385 29320 129195 133260 66256 31791 80311 94391
21054 94391 155389 135202 84385 -12729 -121345 -140326 -6152 48264 49691 52868 77222 45742
21042 45742 -16639 -88844 -119223 -63075 -14766 29036 3500 -19975 -33592 -1488 -34314 -45890
21030 -45890 -49918 -40876 4016 -30323 -9601 74032 56483 88762 144043 108586 78043 18641
21018 18641 3675 -11055 -17267 6608 23109 -45045 -73023 -119283 -98121 -120713 -125296 -79914
21006 -79914 -7025 75514 62508 30238 53371 61438 98623 70031 66665 50701 -24542 -85000
20994h5000J10970J10093j09987j32837o2122N576M1776P2609L0865j907m7739
20983f7703J13746J7646o5253n5537N932M2061o5963n2725O1017P2464M3138r3023
20971d4200j03341M2531P11M5121M1794O1036l349r8719m7253K5313j4390K6407
20959f8339N287j9140M8055Q0376J2388o3337l5603l2508O660P8155J06154k4348
20947I3800j2963K5114q6278K6935M9269k2762n9482q728O1724J9381k4996r285
20935E1729j14787L0785O2859J2766N372l7433n7983L5301M5651m6117p6973k7986
20923a16816J3402O2939n4412k4347J138o7970J7703M8938M5217J36698O5784
20912A28274L6076j5356p2118q3471M4264M8928K0501l4019m7242K3665N9346
$$ plain form
20994 -85000 25970 136063 26076 -106761 -168883 -163307 -121531 -48922 -18057 -19964 -67703
20983 -67703 46043 63689 -1564 -57101 -51169 -9108 -75071 -127796 -66779 5685 48823 -44200
20971 -44200 -147541 -105010 -104299 -59178 -17384 43652 40303 -58416 -105669 -80356 -94746 -68339
20959 -68339 -63052 -82192 -34137 46239 58627 -4710 -40313 -72821 -66161 11994 118148 93800
20947 93800 80837 105951 19673 46608 95877 73115 13633 4905 66629 86010 61014 51729
20935 51729 -63058 -32273 30586 43352 48724 11291 -46692 -11391 34260 -11857 -88830 -116816
20923 -116816 -103414 -40475 -94887 -119234 -118096 -186066 -168363 -119425 -74208 62490 128274
20912 128274 164350 148994 76876 -6595 37669 86597 107098 73079 25837 49502 108848
20901A08848n1193m3222l3451M117M3278j9242J0087k0398l5550j880N7711j0367
20889H738o9938P825l3044m5192K5799M9138P0639r129m3206k0041O6145L3887
20877D1621R1684n3147j05692O2928P4280m1903j03746n5930l6258l7126Q5022
20866g8267P6516N7473j6939k2426M1997Q8340o9802j09126n7441M3466M4326
20855a883l5595J407m9969Q008k7207K8800P2829P3356J1095l7151l3988m5639
20843c5937l101N0006K2262L3950Q637j49955m0922q187q0958l3314L5244K5937
20831a76338L1985O7062R2400J0413p1297q1325j9008J3589M5112m3767q5569
20820b16743M0262L9417K2945K3164O7834L7456m320J7134k8479l8194K5479N7028
$$ plain form
20901 108848 57655 14433 -19018 -14901 28377 9135 19222 -1176 -36726 -38606 19105 8738
20889 8738 -61200 -53375 -86419 -131611 -105812 -56674 13965 4836 -38370 -58411 7734 41621
20877 41621 133305 80158 -25534 37394 111674 69771 -33975 -89905 -126163 -163289 -78267
20866 -78267 -1751 55722 38783 16357 58354 146694 76892 -32234 -89675 -46209 -1883
20855 -1883 -37478 -36071 -86040 -78032 -105239 -76439 -3610 69746 80841 43690 9702 -35937
20843 -35937 -39038 10968 33230 67180 75817 -74138 -115060 -123247 -204205 -237519 -202275 -176338
20831 -176338 -144353 -77291 15109 25522 -45775 -127100 -146108 -132519 -87407 -131174 -216743
20820 -216743 -176481 -137064 -114119 -90955 -23121 14335 10015 27149 -1330 -39524 -14045 42983
20808D2983l4529k250O3979j2219l8857R048p0751m3042n8569O7600N1795K2800
20796b012k3924p0693m721p5238K2394M2278L7234J27694J23o0958J2692J6717
20784B1586m1062k8004K5578M4577K0857j16128l4476J03569P6522j2953q3428
20773b3362n9013J16386N8749J9876j9755l2883k5154J0743p6995q1434n50j2526
20761a25918K6522N4607J25512N8093o5997m3209O5194q3527j7594L8054J6722
20750D8459K7710j3909J3776n6665n7504J3855P5141p3309p9582k12j9821L8715
20738h3346L7621j16239j8263Q5053O5042k1945j0638l474M6937L9280K0887O5505
20726A06420q3548k8748M0709l561m4937J861M7671K6172j4434j6842q678n858
$$ plain form
20808 42983 8454 6204 70183 57964 19107 28155 -42596 -85638 -144207 -76607 -24812 -2012
20796 -2012 -25936 -96629 -101350 -176588 -154194 -111916 -74682 53012 53135 -7823 4869 21586
20784 21586 -19476 -47480 -21902 22675 43532 -72596 -107072 -3503 73019 60066 -23362
20773 -23362 -82375 34011 92760 112636 92881 59998 34844 45587 -31408 -112842 -113392 -125918
20761 -125918 -99396 -44789 80723 138816 72819 29610 94804 11277 -6317 31737 48459
20750 48459 76169 62260 76036 19371 -38133 -24278 50863 -22446 -102028 -102240 -122061 -83346
20738 -83346 -45725 -161964 -180227 -95174 -30132 -52077 -62715 -66189 -19252 20028 40915 106420
20726 106420 22872 -5876 34833 31272 -13665 -11804 35867 62039 47605 30763 22085 16227
20714A6227l4693l2152R015J4857R581r138K9242P1882L5813n5090M296r4598
20702c4758o6980j538K772J10618J9644k2608k3956J0364P58K3610O886r9601
20690g4789J6590O8533N8825m1814j36058l8927P4953Q3581l4123J8398k2686
20679b7517j8781o7404q7856M9806P6604j2654o9040K510J0900R0404q579p638
20667f9245P6768N8061m6861k5789n3434L1140J7419p4126j3565k6236L1410K2150
20655g2308o5994L2253P196N0075Q2869N7950p8635k395J7277P6514J61870q4129
20643A82543j32086k792O769L4210M4060o5155p9416j1812P248k4068J2296K7745
20631d58L8448q606l4275m4324J12661J9524o6543M888K5186J6682L5546M0276
$$ plain form
20714 16227 -18466 -50618 -41603 -26746 -17165 -26303 2939 74821 110634 55544 59840 -34758
20702 -34758 -101738 -103276 -100504 10114 29758 7150 -16806 -6442 -5684 17926 24812 -74789
20690 -74789 -58199 10334 69159 27345 -108713 -147640 -72687 10894 -23229 -4831 -27517
20679 -27517 -46298 -113702 -201558 -151752 -75148 -87802 -156842 -154332 -143432 -53028 -61607 -69245
20667 -69245 7523 65584 18723 -7066 -60500 -29360 -11941 -86067 -99632 -125868 -94458 -72308
20655 -72308 -138302 -106049 -98853 -48778 34091 92041 13406 11011 28288 104802 266672 182543
20643 182543 50457 47665 54434 88644 132704 67549 -11867 -23679 -16431 -40499 -28203 -458
20631 -458 37990 29384 -4891 -49215 63446 82970 16427 21315 46501 63183 98729 139005
20619A39005K6802j10809M846J4560J6636r2182r0789l4849n058K3285N5468j1984
20607f5069j7705J2673L361M7499M4200j5540j8710k3972J4601j2352L0924k597
20595b687M426K9012l9850L9178K1851p2437j0858N4630L1367P978K9859n5465
20583C7004j00402N5927K012L8671J5147k8723r4151L5712J41697n8114m6345
20572a565p746N2481P7216j7107O829p4673q5694K4917K4052J3342J53826p2635
20560I3243j35672O9744Q1491j5025j063O8326j3929l0391k0648k3682j3081j5168
20548D4145o8130l1231o3548o0424K0758P0103R1044N7413K3587k399j18199j509
20536c8390K1382k8417L532r4288Q7821O7427L5722K408P648K1479O232n2167
$$ plain form
20619 139005 165807 54998 59844 74404 91040 -1142 -91931 -126780 -131838 -108553 -53085 -65069
20607 -65069 -82774 -70101 -66740 -19241 24959 9419 -9291 -33263 -18662 -31014 -90 -2687
20595 -2687 1739 30751 -9099 30079 51930 -20507 -31365 23265 54632 62610 92469 37004
20583 37004 -63398 -7471 -5459 33212 48359 19636 -74515 -38803 102894 44780 -1565
20572 -1565 -9311 43170 120386 103279 110108 35435 -50259 -25342 -1290 12052 165878 93243
20560 93243 -42429 27315 108806 93781 92718 161044 147115 116724 96076 72394 59313 44145
20548 44145 -23985 -55216 -118764 -179188 -158430 -88327 2717 60130 83717 81318 -36881 -38390
20536 -38390 -17008 -45425 -41893 -136181 -48360 19067 54789 57197 64845 86324 92556 40389
20524D0389q4817N0739M3908m1108p2833k0711O0934J11334J8519o4199j09437
20513f7282L4514K4346N1206P8328k5281k5742k8041o4287k5887J2994O5260N1560
20501H1688j5358n8019q495J7351m6488K3453j3470P3157M6650m1335j8414J0198
20489E0918j5284l993m3316L3737P3134O9997q8420q9943r1900M0615K6274N644
20477c2537L0115J2122m1784m1692Q2812O8048m6723o3916R1611j7591m2892p1255
20465g3682l9964J1435N7039J08274N0005L9272j03524o5777j5205m4759m8484
20454a25370N4158J46218q2798n9327J25004K6441P700o9957m0536N7921M5383
20443H4837j0153j2494L0919j01239q81Q2377o2087l5537j658j9114M3158O5084
$$ plain form
20524 40389 -44428 6311 50219 9111 -63722 -84433 -23499 87835 106354 42155 -67282
20513 -67282 -32768 -8422 42784 121112 95831 70089 42048 -22239 -48126 -35132 30128 81688
20501 81688 66330 8311 -184 17167 -29321 -5868 -19338 53819 100469 59134 40720 50918
20489 50918 35634 31641 -11675 22062 95196 165193 76773 -13170 -105070 -64455 -38181 -32537
20477 -32537 -2422 9700 -32084 -73776 9036 77084 30361 -33555 58056 40465 -2427 -73682
20465 -73682 -113646 -102211 -45172 63102 113107 152379 48855 -16922 -32127 -76886 -125370
20454 -125370 -71212 75006 -7792 -67119 57885 84326 92026 22069 -18467 39454 84837
20443 84837 74684 62190 93109 -8130 -9011 73366 11279 -24258 -25916 -45030 -1872 63212
20431F3212N7892Q304L5589k0948k0327l5988P2922L5340q1018n8349m8474o2480
20419e4325j5596L0310K0776j00193J0072N4848L1615L4233J3598k0428j6433
20408a1523N0073O1725J3715k3963m2274m2417K9249P388q2277m0643n6648K2255
20396a15340J25355N8818q5026n3535j1029J6411O1070l0222n661O6143j6037
20385A0947j9064O2554N7651k1550m6917q1668K5969M4542N2918K5856N565j1688
20373A05115p864N0425K8916l8146r8004k2887L8712R740j7313n2474k6330K5567
20361d543M0867k5360J5006k8464O4565K3817r6774n0260n650m857N9295J8300
20349E942j13584l7655J22482O1286l9756K4229M7235j06564n1730K6594P2718
$$ plain form
20431 63212 121104 129408 164997 144049 123722 87734 160656 195996 114978 56629 8155 -54325
20419 -54325 -69921 -39611 -18835 -119028 -108956 -54108 -22493 11740 25338 4910 -11523
20408 -11523 38550 100275 113990 90027 47753 5336 34585 41973 -40304 -80947 -137595 -115340
20396 -115340 10015 68833 -16193 -69728 -80757 -64346 -3276 -33498 -39159 26984 10947
20385 10947 -8117 54437 112088 90538 43621 -38047 -12078 32464 85382 111238 116803 105115
20373 105115 97251 147676 176592 138446 40442 17555 56267 66007 48694 -3780 -30110 -4543
20361 -4543 36324 10964 25970 -2494 62071 85888 -10886 -61146 -66796 -71653 -12358 5942
20349 5942 -107642 -145297 -22815 38471 -1285 22944 70179 -36385 -88115 -61521 11197
20338A1197k8594k3316L1776l776N8583J1393K0910M781l5810N5464K6191l4075
20326I4724Q412r4544o2004K1329m7895j9880J347j5341Q5618Q6074J0554L2970
20314A01364M6296Q5160k8404k02050o4561NO600O0285K7195K5965o0824k2712
20302b5681P0497R6419j8276q9828P3007M5784m369K1282j7675r6200l8888m4629
20290b8557L4576L4101M8643K7033K5020p6964j03193j1604M3552Q6155r9438
20279b0676j3067p970M8694O6097L8798L5271m3566l4173j53448j1622J6930Q362
20267g0370m7591l9178k9200L61R4520P7882L0830Q8011m3719l5629L9785n8267
20255G435k5254j3680j7559L1966J27247o1651L794K0968J3785M3463l0925l5416
$$ plain form
20338 11197 -17397 -40713 -8937 -12713 45870 57263 78173 82954 47144 102608 128799 94724
20326 94724 103136 8592 -53412 -32083 -79978 -99858 -98511 -113852 -28234 57840 68394 101364
20314 101364 147660 232820 204416 2366 -62195 -62190 -55590 4695 31890 57855 -2969 -25681
20302 -25681 44816 141235 122959 33131 106138 151922 147553 168835 151160 54960 16072 -28557
20290 -28557 6019 40120 88763 115796 140816 63852 -39341 -50945 -7393 78762 -20676
20279 -20676 -33743 -41713 6981 73078 111876 147147 103581 69408 -84040 -95662 -78732 -70370
20267 -70370 -117961 -157139 -186339 -185978 -91458 -13576 17254 105265 61546 25917 65702 7435
20255 7435 -17819 -31499 -49058 -17092 110155 48504 52298 73266 87051 130514 99589 64173
20243F4173j2811l4532k4187L9118J3953J5931M2952n6886r7791o9234K1840j2879
20231a10353N5957L4309l4477J3447j3083J5493K5722j1453O2997J10495L046
20220A52100n8189p9690j00357l651O7727M9642k3506l0378J5575O9032p7345
20209a9040m459K1304n2431k2635O6281R7914M4750p4160o3942k0969R5925m9893
20197A8645l1984K7096n7214k8082k7622M0809P3141K8824k197R4070j0483p1060
20185E3943j1072P4223M1952n85r8654o3331N2774m758j36340l7738J27268m5381
20173d7699n7433L6955L2604K2909J02140R5829k1813j24711n6887n9125m2246
20162a19477Q800R0529Q5735Q847L8705L8249j31529r531L2905M9972j6986l9895
$$ plain form
20243 64173 51362 16830 -7357 31761 45714 61645 104597 47711 -50080 -119314 -97474 -110353
20231 -110353 -54396 -20087 -54564 -41117 -54200 -38707 -12985 -24438 38559 149054 152100
20220 152100 93911 14221 -86136 -89787 -22060 27582 4076 -26302 -10727 58305 -19040
20209 -19040 -23499 -2195 -54626 -77261 -10980 86934 131684 57524 -6418 -27387 68538 18645
20197 18645 -13339 13757 -43457 -71539 -99161 -58352 14789 43613 41416 135486 125003 53943
20185 53943 42871 117094 159046 158461 59807 -3524 49250 44492 -91848 -129586 -2318 -47699
20173 -47699 -105132 -68177 -35573 -12664 89476 185305 163492 38781 -18106 -77231 -119477
20162 -119477 -110677 -20148 65587 74434 113139 151388 19859 10328 43233 93205 76219 36324
20150C6324n564j263M5008J00602j1852J9236J5902o73j35857j18147O8550O9572
20138H1838o1312j11569q671K8006K1019J15385M1277n3953O036l5016j05754
20127h2714M2510Q2541m7794P907J7185m1644k7926P6201j2082k4168l3035k3609
20115f6628J5927Q4394P8790m2475o4657o0880R8986M6511p6813q0461L1738J03323
20103F7755L2754j03546j6068k4738j24q217j4396L7166N0277l2196m5302J8479
20091c8156L6662M16j0404N6563J1232m0587O0456l8150j15133J719N100O2860
20079g422Q1740O318r9183k072O1388j6249O4556J6877q6529N008j3935K925m5956
20066c2534M8772O0091L039K0067K9803P308m4561p3254l7369Q168j1204J8057
$$ plain form
20150 36324 30760 29497 74505 175107 163255 182491 198393 197720 61863 -56284 12266 81838
20138 81838 20526 -91043 -99714 -71708 -50689 64696 105973 52020 58056 23040 -82714
20127 -82714 -40204 42337 -5457 2450 19635 -22009 -49935 26266 14184 -9984 -43019 -66628
20115 -66628 -50701 33693 112483 70008 5351 -55529 43457 89968 13155 -67306 -35568 67755
20103 67755 100509 -3037 -19105 -43843 -43967 -52184 -66580 -29414 20863 -11333 -56635 -38156
20091 -38156 -1494 -1078 -11482 45081 56313 15726 76182 38032 -77101 -75382 -70282 -7422
20079 -7422 74318 80636 -18547 -20619 40769 24520 89076 105953 19424 24432 10497 13422 -32534
20066 -32534 16238 76329 79368 99435 129238 136546 91985 18731 -18638 -10470 -21674 -3617
20054c617n9315P402M0421K6199M0085L7352K8465O0674l6383n9307J9911p598
20042I4289N5643k7258k8369o136m3422o4731J9155P3062K0089l1215l735J1291
20030F8663p6305M0720n3073j2005L7522J6576L4419k8557m7988N0839Q0827k5241
20018H6397L6885j2441l7647O091k0770m4140j18967L3040N8798R2892L6284m7996
20006F8426j01263r9502n7456M3994N1100K7993M8268p863J1842N6209j5148J7321
19994D3921J9678j7326K3995N3906p952j2000n4961J6869l4703n8339K1564M7285
19982D1937L4464q9563j2292p8561l5998Q4336P4356Q5556L2061p9965n3339O2218
19970F5210p2191m4049L3745R5443N8787j5679j08595p8978j10797p780K3983
$$ plain form
20054 -3617 -62932 -55530 -15109 11090 51175 88527 116992 177666 141283 81976 101887 94289
20042 94289 149932 122674 94305 88169 44747 -19984 -829 72233 92322 61107 57372 68663
20030 68663 -7642 33078 -19995 -32000 5522 22098 56517 27960 -20028 30811 111638 86397
20018 86397 123282 110841 73194 79285 58515 14375 -104592 -71552 -12754 80138 116422 68426
20006 68426 -32837 -132339 -189795 -145801 -94701 -66708 -18440 -26303 -14461 41748 26600 43921
19994 43921 63599 46273 70268 124174 116222 104222 49261 66130 31427 -26912 -5348 41937
19982 41937 76401 -13162 -25454 -104015 -140013 -55677 18679 104235 136296 56331 2992 65210
19970 65210 -6981 -51030 -17285 78158 136945 121266 12671 -66307 -177104 -184884 -160901
19959a60901N0055N7832K3498q261r721K0502J3640l936M4115J4377J8657k3023
19947C6834l7491l610K1387k8972L1980o1604N8907p703K5154J8135l8714J7237
19935C1540q6080M6626K9406n8129o7721l8826N703j526j0110l8113M8286L5354
19923a03590J3540L2417L9656N5621K0745p327j10709q7676K2831K6023J4856
19912h3613R4068J6784O2370m3970q4092M6957J748j1756O3537P2285L8861J4818
19900A87997n1538n8785j4682J1686P134R566l0943r9103K4067R4894N3588k1147
19888A12734J04187k4134j09604n9760l3078O1934P8383k2231k6171J1628M5840
19877A39728J4415p0074q4533K0199L5272L4612K292q4203j4574l0973P2088p8041
$$ plain form
19959 -160901 -110846 -53014 -29516 -37777 -47498 -26996 -13356 -17292 26823 41200 59857 36834
19947 36834 -657 -4267 17120 -11852 20128 -41476 17431 9728 34882 53017 14303 31540
19935 31540 -54540 -7914 21492 -36637 -104358 -143184 -137481 -139007 -149117 -187230 -138944 -103590
19923 -103590 -90050 -57633 -17977 37644 58389 51062 -59647 -147323 -124492 -98469 -83613
19912 -83613 10455 27239 89609 45639 -38453 8504 10252 -1504 62033 134318 173179 187997
19900 187997 136459 77674 62992 74678 81812 91378 60435 -38668 -14601 80293 133881 112734
19888 112734 216921 192787 83183 23423 -9655 52279 130662 108431 82260 93888 139728
19877 139728 154143 84069 -464 19735 55007 89619 91911 7708 -6866 -37839 34249 -43792
19865d3792l4310k5054m7238M6158N0483k1505K8694J09373N6854K998J5249L7144
19853A75054M0056k9831r8328q1074m4771l5788k8742k1188J05343j276M6510
19842B5965m0031j5211L297K9183m854l663P0896K538K8414L2531l6652J2077
19830A04490k8732j9774k5519l1310j8613p0139O6571J5956k6986r654N4022n1375
19818d1063o4228M0951N0126p908n2131J9174M7240k738O9903l9842m1743P142
19806a5117R2655l1806k4220K1511l053p705p5617q445Q002p3475K8111M9136
19794d0023K4953N0253L2330j8218k1229n080n3159J4326N5486L5426L1696M8543
19782A55304l4333j78661j6832K6246O6661M3347K4431L7037k4944j2061j7091
$$ plain form
19865 -43792 -78102 -103156 -150394 -104236 -53753 -75258 -46564 62809 119663 122661 137910 175054
19853 175054 215110 185279 86951 5877 -38894 -74682 -103424 -124612 -19269 -20545 25965
19842 25965 -14066 -29277 -25980 3203 -1651 -5314 65582 68120 96534 129065 92413 104490
19830 104490 75758 55984 30465 -845 -19458 -89597 -23026 -7070 -34056 -43710 10312 -41063
19818 -41063 -105291 -64340 -14214 -22122 -74253 -55079 -7839 -10577 59326 19484 -22259 -15117
19806 -15117 77538 45732 21512 43023 39970 32265 -43352 -51797 -43795 -117270 -89159 -40023
19794 -40023 -15070 35183 67513 49295 28066 22986 -30173 -15847 39639 75065 106761 155304
19782 155304 120971 -57690 -74522 -48276 18385 61732 86163 123200 98256 86195 69104
19771F9104O6694K1646K9625n7230l9057k4308q7309k9391o8412J0497N9809P8414
19759C0082l3514j8998k1751l3183o447L413J1374n564L31K0948r561o5750j6819
19746a45439j7493J10464j1415j321K3622J9325M4147p864M7420m3080p1153J1934
19734d0853J25899N1209o6036p6323K6398K6660M59j04945P380P4766j5822o5332
19722e6540j7085O924L9191N7994J18890J37350p0256j45366l0427M4822J3845
19711I9342L638m1042n4683m956j6034l8960J7597k571Q7965l217m9641m2806
19699d5368J0839l85K689n2516o669j6181j1957P927L8857J6737j8834j5431j0204
19686a00496M2876l4407O1261n6742J4412P5265p867O869K1458O6871j2350P011
$$ plain form
19771 69104 135798 157444 187069 129839 90782 66474 -20835 -50226 -118638 -108141 -48332 30082
19759 30082 -3432 -22430 -44181 -77364 -83811 -80398 -69024 -74588 -74257 -53309 -62870 -128620 -145439
19746 -145439 -162932 -52468 -63883 -65204 -41582 -22257 21890 14026 61446 18366 -52787 -40853
19734 -40853 85046 136255 70219 -6104 20294 46954 47413 -57532 -50152 24614 8792 -56540
19722 -56540 -73625 -66701 -27510 30484 149374 286724 216468 71102 40675 85497 99342
19711 99342 102980 61938 7255 2299 -13735 -52695 -35098 -37669 50296 47079 -2562 -45368
19699 -45368 -34529 -34914 -32225 -84741 -91410 -107591 -119548 -111621 -72764 -56027 -74861 -90292 -100496
19686 -100496 -57620 -92027 -30766 -87508 -73096 2169 -5698 1171 22629 89500 77150 84161
19674H4161K0340n0130m1207k9565J0170N7492l8615j8071Q6716l66n5773P1358
19662I6510P3387m6847r2728J943J5915m5291K0565N5523j6651p6966P119p513
19650a5034q4115k6168Q5839O5892J3935N8733N946J3786j19118l7817R4054O7292
19638A23225k2161r2823K7110N4749n94q0042N6502P1429n360n9204n2166p3679
19626e3014o8860n546J5288R0789J23308r7614r7211P0372P0155L2847M661l7852
19614D7323K7072K9654O9861j3971r6070L6592o0224j6430K2070l9612J8604K4469
19602D9338l364j8409o2921j0513n219j3952r076k8394O1277Q8128k070k7654
19590A7171N6364m754l0950m1149j8676k8159K594L3670L2448J6031n233J6361
$$ plain form
19674 84161 104501 54371 13164 -16401 -6231 51261 12646 -5425 81291 80925 25152 96510
19662 96510 169897 123050 30322 32265 48180 2889 23454 78977 62326 -14640 -7521 -15034
19650 -15034 -99149 -125317 -39478 26414 40349 99082 105028 118814 -304 -38121 55933 123225
19638 123225 101064 8241 35351 90100 89506 9464 65966 137395 132035 72831 20665 -53014
19626 -53014 -121874 -127420 -112132 -21343 101965 4351 -92860 -22488 47667 80514 85175 47323
19614 47323 74395 104049 173910 159939 63869 100461 40237 23807 45877 6265 24869 49338
19602 49338 45974 27565 -35356 -45869 -51088 -65040 -74116 -102510 -41233 46895 44825 17171
19590 17171 73535 68781 37831 -3318 -21994 -50153 -47559 -13889 18559 34590 29357 45718
19578D5718m1500K873M5960J8954p225L2774j0564p3996j5004o022r796Q982K7341
19565A8495M5292q16j8142r3692k8614Q8070l3978r8093O8851O0790k8705J6537
19553d005M8855m3444m6574l656J4727Q013N2343O379O261j148J1158m3573L2360
19540C7696K7454J9387l6371M5324l0858n847J4086l6663P5076l3823J99k6114
19528D9546J9452O063l3248M8346k3148o4306L3368m2890q946K5878n346L2680
19516C7449O3123j9821l409J4684j4667M4030N4491k5980j24115m2032J3880O2561
19504F0194O206o4807M4392O3705k0037K0652l5360p960M9220L7303k5412k6364
19492A01732k7598r504j00624j9035P7084J26689n2082p3834k5804P3921L9960
$$ plain form
19578 45718 4218 7091 53051 72005 64780 97554 86990 12994 -2010 -8032 -17828 -8846 18495
19565 18495 63787 62971 44829 -48863 -77477 10593 -23385 -121478 -52627 8163 -20542 -4005
19553 -4005 44850 1406 -45168 -48824 -34097 -26084 26259 32638 38899 37751 48909 5336 37696
19540 37696 65150 84537 48166 93490 62632 56785 70871 34208 109284 75461 75660 49546
19528 49546 68998 75061 41813 90159 67011 2705 36073 -6817 -15763 10115 4769 37449
19516 37449 100572 80751 77342 92026 77359 121389 175880 149900 25785 -16247 -2367 60194
19504 60194 66400 1593 45985 109690 89653 110305 74945 66985 116205 153508 128096 101732
19492 101732 74134 64630 -35994 -55029 22055 148744 96662 22828 -2976 70945 110905
19481A10905q9221q0968m3230K6070L0488K223l5152N9991J01138q8024k7990
19470c3770L4704K1039M2705L0756j2350k8361Q1448M4643n3923k1044K6125j12738
19458A9234j14693N5043O8422j9635M5663j8228l3934k1673J52507K927n1959
19447H3674l6505j7227m7129K7399j8140r627K7407m722j6665Q693M6206J4759
19435E8123q587M871O9277J2787j16157n3157J12054L5886O070j6316P0423K6717
19423B01991j12516o6762L2181Q1293o6732o6483j9673R1968J9684M2699j6979
19412A20671j13564l3328J1943J3119P2277J01128p1894j04750q1541L0144R2182
19401C6387l4206o8293k5785N2888L5793k1045n8815N2930P6913k942k5583k9492
$$ plain form
19481 110905 21684 -59284 -102514 -76444 -45956 -43733 -78885 -18894 82244 -5780 -33770
19470 -33770 934 21973 64678 95434 83084 54723 136171 180814 126891 105847 131972 19234
19458 19234 -95459 -40416 28006 8371 54034 35806 1872 -19801 132706 135633 83674
19447 83674 47169 29942 -17187 10212 -7928 -17555 9852 5130 -11535 -2842 43364 58123
19435 58123 49536 54407 123684 136471 20314 -32843 79211 115097 121167 104851 175274 201991
19423 201991 89475 22713 54894 136187 69455 2972 -16701 75267 94951 137650 120671
19412 120671 7107 -26221 -14278 -1159 71118 172246 100352 -4398 -85939 -55795 36387
19401 36387 2181 -66112 -91897 -39009 -3216 -24261 -83076 -30146 46767 43825 18242 -11250
19389a1250l9590r968p453R3284N9361L7058j0736k2710R398j1288q3210J7277
19377B0173p2917L2905o9468K50K6957J83L6149P9210k0379j38107l2377Q1118
19365e6303O3231L4924K0792L1051K6971n2839L0837K7261j7585l7622l3060m362
19353C3296q109l4112K9351J18168P41P8735j8979o7447J7061K0662r402n7052
19341A02913r7739r0813K4480Q0489K2150J331q4228l4324K2119N4932N3929j3081
19329D2158K8028k9845L280O5585k6759K6434O6170R177j1153o191o3750q8057
19317A5077L5713l523M2726Q6790j9891p9152J8141o6345r7201j6105N4034K8666
19305a070q8613J00198M6018j0658R336k8670j1777j06793J4587Q9923M1199J3043
$$ plain form
19389 -11250 -50840 -60808 -68261 25023 84384 121442 110706 87996 97394 86106 2896 20173
19377 20173 -52744 -19839 -89307 -89057 -62100 -61917 -25768 53442 33063 -105044 -137421 -56303
19365 -56303 6928 41852 62644 93695 120666 67827 98664 125925 108340 70718 37658 33296
19353 33296 25187 -8925 20426 138594 139335 218070 199091 131644 148705 169367 159965 102913
19341 102913 5174 -85639 -61159 19330 41480 42811 -41417 -75741 -53622 1310 55239 42158
19329 42158 70186 40341 43621 109206 82447 108881 175051 184228 173075 166884 103134 15077
19317 15077 50790 47267 89993 176783 156892 77740 95881 29536 -67665 -83770 -29736 -1070
19305 -1070 -89683 10515 56533 45875 55211 26541 14764 -92029 -77442 12481 53680 66723
19293F6723K6230O5026l5071K6836Q3181p4362j31792k4586l8206J04008M9207
19282A17194j3397m0396n3025l526N7410J431K8495j3197R702r1747q0960O2598
19270a9418R9283J5530L070L2868J8884m9095J128K5455m6560K8198M843M8678
19258A62864J8041q1873k3644M82L9046l9593p6717j1099N5434R0880L083p5437
19246F1467j14676j986Q6321J8491L1341M7489l3353p3690m8724P0738L5504j7947
19234F0975K3962J73418O5229j37939o9616n7093k6579L0562p3048K5451O947
19223B2269m9351P3824Q6686n4161l5216P6815M089J6787J05426K3006L5084n2720
19211B52538p4876J3536j7505o4372K6005J8846o0992K401K8091J048P031l084
$$ plain form
19293 66723 92953 157979 122908 149744 232925 158563 26771 2185 -36021 67987 117194
19282 117194 103797 63401 10376 6850 64260 65691 94186 80989 90691 -1056 -82016 -19418
19270 -19418 79865 95395 98465 131333 150217 101122 102250 127705 81145 109343 114186 162864
19258 162864 180905 99032 75388 75870 114916 75323 -1394 -12493 42941 133821 136904 61467
19246 61467 -53209 -55195 31126 49617 80958 128447 95094 21404 -27320 43418 78922 60975
19234 60975 84937 258355 323584 185645 116029 58936 32357 62919 -10129 15322 22269
19223 22269 -27082 46742 133428 79267 44051 120866 124955 141742 247168 270174 305258 252538
19211 252538 177662 191198 173693 109321 135326 154172 93180 95581 123672 124720 131751 128667
19199A28667j0937L417L0747R674k5318j15370j4829L9160Q020J2263M9602K4709
19187A39805j6410k7424n1062r7094l5252N9845O8200J16601m7430n4388K5686
19176H1077o836r09p886M3721K6625p005L8648K0050j02290q9878j2781k1868
19164c9332L3075M6160Q3879j9175m0724Q699k8249m4093Q133J16548M0808M452
19152A70181N3L664o2105K3170j8631P4294J9992l5825K9242m8703n5821L3575
19140A33086K2325L2962M0585l0655m6120J3346l6231k7501N5892J04140p4493
19129A87336j14374L3300M0396K5653m603n5604P368l3434O305N5346l2337m6697
19117F8655N6900J1472n9651Q2610J05703n116l5149r3225k8440j7557q5321k199
$$ plain form
19199 128667 117730 121147 151894 161568 136250 20880 6051 45211 53231 65494 115096 139805
19187 139805 123395 95971 44909 -52185 -87437 -27592 40608 157209 109779 55391 81077
19176 81077 74241 73332 65446 109167 135792 128787 167435 187485 85195 -4683 -17464 -39332
19164 -39332 -6257 39903 123782 104607 63883 72582 44333 240 8373 124921 165729 170181
19152 170181 170234 173898 111793 134963 116332 190626 210618 174793 204035 155332 99511 133086
19140 133086 155411 188373 228958 198303 152183 165529 129298 101797 157689 261829 187336
19129 187336 72962 106262 146658 172311 167708 112104 119472 86038 92343 147689 115352 68655
19117 68655 125555 137027 77376 159986 265689 260573 225424 132199 103759 86202 881 -1318
19105a318P9977n8685N4941L0097P1677K8062P6999K17109R6118O8949O6647l2128
19093F98445j59014j31277k2810L0214l916q7202l5366k2246J43145J74454J33274
19082G17701J32766l0510q6652j67181j75356r7225o839J7352q6950p5885k0345
19071A20876J7624m7469J035k804M5712J39637R1061r9264r3565m5135l8009L6193
19059A25892O1536n6390M0935K5896K9103J02983J21579Q3687J63193O6019K1635
19048G86068q1212r7849r8043o8574J7155N6212J03570M2516J12294J23853J43653
19037A039643J75911K24116O5839n0298j43905k04269k43726j89189l8836n937
19027F29349k6902P5793J97439J97422K02595K5044q7969r3814k05762j39721
$$ plain form
19105 -1318 78659 19974 74915 105012 176689 204751 281750 498859 594977 663926 730573 698445
19093 698445 539431 408154 385344 415558 411642 324440 289074 266828 409973 584427 717701
19082 717701 850467 819957 733305 566124 390768 293543 286704 304056 217106 141221 120876
19071 120876 138500 91031 92066 89262 134974 274611 365672 266408 172843 127708 89699 125892
19059 125892 187428 131038 171973 197869 226972 329955 451534 535221 698414 764433 786068
19048 786068 704856 607007 508964 440390 457545 513757 617327 659843 772137 895990 1039643
19037 1039643 1215554 1439670 1505509 1455211 1311306 1107037 863311 674122 635286 629349
19027 629349 602447 678240 875679 1073101 1275696 1300740 1212771 1118957 913195 773474
19017G73474M9120q545l0665P7215L8616k8541O2039r5509j01484p2203j53309
19006E10208j13520r4604P0048J14606J69072Q500k6578Q8166J85254K0744j15726
18995H16170r2406l7165L9361K290N7953J41694K33637K20955m5066k733j06231
18984A228459k05485p1410o9194o6804j6972n3061J40745J62770J44811L4602
18974A228461m4914K346q5283l6982J8320j01222q3778j21116j40120o2935j0488
18963E62289l5283L2474M6978O3130N3541P9230J50835l244q9050j07799l5521
18952G17580j17370j02269Q2657q4037J5712J66265J79884P8043K1437J0665j11852
18941H56715j68043r4584p7577l9061P0465J6108N4924J11459R6257J383J5997
$$ plain form
19017 773474 822594 814049 783384 860599 899215 870674 932713 837204 735720 663517 510208
19006 510208 396688 302084 372132 486738 655810 664310 637732 725898 911152 931896 816170
18995 816170 723764 686599 725960 728250 786203 927897 1161534 1382489 1337423 1334690 1228459
18984 1228459 1022974 951564 882370 815566 798594 745533 886278 1049048 1193859 1228461
18974 1228461 1183547 1185893 1100610 1063628 1081948 980726 896948 775832 635712 572777 562289
18963 562289 527006 559480 606458 669588 723129 802359 953194 949950 860900 753101 717580
18952 717580 600210 497941 580598 496561 512273 678538 858422 936465 957902 968567 856715
18941 856715 688672 594088 516511 477450 547915 564023 618947 730406 826663 828046 844043
18930H44043m0034p0917j49581j62169j40719q270L2J69200J28521N837L773n4679
18918E25037j7926m6247j08310j53421k4336o1630j19953J4817R972N9245K7913
18907A05161M3465J2476P137p146K5921J6934m4973n9393q7568K1013P2537L9238
18895A44802M7616k3774k7369j342J2362M093J8240j8226L9119N0480L4935J5061
18883B95997j01493r6948N9085K6953P8930O6168O6352K4765j18364j56449j8285
18872A26711J6421J8608L8650J8383L0668M4054J3189n3800m0917j789m5832j09697
18860E4649M9239N3753l4184R548O7691O2107n4734l831N8626k8081j17652L9909
18848A57040R4463N6846l3764r2198R53K1940P0599K2905O6067p957m2860O601
$$ plain form
18930 844043 804009 733092 583511 421342 280623 272353 272385 441585 570106 575943 579716 525037
18918 525037 507111 460864 352554 199133 174797 113167 -6786 8031 18003 77248 105161
18907 105161 148626 161102 168239 161093 187014 203948 158975 99582 12014 33027 105564 144802
18895 144802 192418 168644 141275 139933 152295 156388 174628 156402 195521 246001 280936 295997
18883 295997 194504 97556 156641 183594 262524 328692 395044 419809 301445 144996 126711
18872 126711 143132 161740 200390 218773 249441 293495 306684 252884 211967 210178 164346 54649
18860 54649 103888 157641 123457 133005 200696 262803 208069 204238 262864 234783 117131 157040
18848 157040 251503 308349 274585 182387 183340 205280 275879 298784 364851 356894 314034 320635
18836C20635q430k5041K8269m5445o5022N0093P6108N4767p6296o9836j38565
18825A01237m9251O5288J4363Q8509O9900J1744o5032J7338N3607K6447m6187
18814B87963r1263k2459j868J0220N3289L7639q065K108k8389L1815N7211O4080
18802C92281O7191M8131n8931o7439m5471K7739k9849r287l5397J10016J09339
18791E08323J37274K18673P2230j1326j04288r1808p6851r4626j09393j04470
18781C43738j8293o1531k061K2683K96J3986m9901l7758J7310J48796J30985R961
18769E18211l358k6283K1439J29192K18798J75529j25331j56647m0292l6070N2188
18758G27376l6512m9234m7805M830N748l3557n8698K6798K1212m7422K4875J08130
$$ plain form
18836 320635 312205 287164 315433 269988 204966 255059 331167 385934 309638 239802 101237
18825 101237 51986 117274 131637 220146 290046 301790 236758 254096 307703 334150 287963
18814 287963 196700 174241 172373 182593 235882 273521 265456 267564 239175 270990 328201 392281
18802 392281 459472 507603 448672 381233 335762 363501 333652 324365 288968 398984 508323
18791 508323 645597 864270 936500 925174 820886 729078 652227 557601 448208 343738
18781 343738 325445 263914 261853 284536 284832 298818 248917 211159 228469 377265 508250 518211
18769 518211 514853 488570 510009 639201 857999 1033528 908197 751550 711258 675188 727376
18758 727376 690864 641630 593825 598655 604403 570846 512148 538946 560158 512736 537611 645741
18746F45741J17489O9662N2209P0086J23600M5854m243P4891J2656P0375J40135
18735A418455N6244O3053m9684j68445j76468m7097O3501m338j09750j07735j24635
18724H13101p9519k1713o1985m0104M3486l0725J4541j6998j6364N8625J4292
18713F76637m0291M9959N0856O5429J8713n8790M6974N159p3230o1859k8761j6983
18701F33813j7844J1377J1252K5231j1798R8761R1493P1284O5412l7721J18651
18690A059911J80868p7416j5897J04020J04548M1658O8172K8059m0703m0921J4669
18679A426968k3558o7572j5105J03107Q3468K890j4718l8800j28704p7593j12977
18668A137406j88033m9738p1162o3314j7563R9729P3257j1402l5730o7190n9804
$$ plain form
18746 645741 763230 832892 885101 955187 1078787 1124641 1120398 1195289 1207945 1278320 1418455
18735 1418455 1474699 1537752 1488068 1319623 1143155 1096058 1159559 1155221 1045471 937736 813101
18724 813101 733582 711869 649884 609780 653266 622541 637082 620084 603720 662345 676637
18713 676637 636346 686305 737161 802590 821303 762513 809487 814646 741416 679557 650796 633813
18701 633813 615969 627346 638598 663829 652031 750792 842285 913569 978981 941260 1059911
18690 1059911 1240779 1163363 1147466 1251486 1356034 1397692 1465864 1493923 1453220 1412299 1426968
18679 1426968 1403410 1335838 1320733 1423840 1507308 1510198 1495480 1456680 1327976 1250383 1137406
18668 1137406 949373 899635 828473 765159 747596 847325 920582 909180 873450 806260 746456
18657G46456j02341P13R8771N2653L5285k4349K2026l0192q7659M2114J24223
18646H77700J13875O5113K2521K8718l7307k6311j2890J0811K121N2753N0521
18635A147625L2304O0963k8466o7372O935K8357p3501Q2272J22519J00666J36506
18624A548808J46389M1665r03j12534j26119o6142M3633m281o8119k3094L008
18613A382311J6961J3765K2614L5137p0432q6342n3437L5155J03864P0358Q6426
18602A556380N3819N3375J04208K6322J5466R457M8704m7077P0914J55091J58297
18591B204956J58968L19305N04296M02284L52873K50249J21380K12869K90051
18582D817231J81129K38905L09722J73673L72990N34844O29464P50348R86555
$$ plain form
18657 746456 644115 644828 743599 796252 831537 807188 829214 799022 711363 753477 877700
18646 877700 991575 1056688 1079209 1107927 1070620 1044309 1031419 1042230 1044351 1097104 1147625
18635 1147625 1179929 1240892 1212426 1145054 1151989 1180346 1106845 1189117 1311636 1412302 1548808
18624 1548808 1695197 1736862 1735959 1623425 1497306 1431164 1474797 1470516 1402397 1379303 1382311
18613 1382311 1399272 1413037 1435651 1470788 1400356 1314014 1260577 1295732 1399596 1469954 1556380
18602 1556380 1610199 1663574 1767782 1794104 1809570 1819027 1867731 1820654 1891568 2046659 2204956
18591 2204956 2363924 2683229 3187525 3589809 3942682 4192931 4314311 4527180 4817231
18582 4817231 4998360 5237265 5546987 5720660 6093650 6628494 7257958 8008306 8994861
18573H994861J314503J741026K522691L565793M848996P550165J2637029K1369224
18565F4544288K5434483J4571182R010758m160545j5899739j5210357j2287165
18558F6002905r758485o337375p51549O220242J5905566K8568083K7374995J1613394
18550A38837776N415466j3431130k3235492k1279598j8160661j5916207j2552768
18543C9677386q174307n095514l301762k414854j809769j350217j198210p60692
18535A5572061m88801l75793j91997O469M31960P82292P96718J080237J439840
18526A9052986J945227K733944L756304N687959R251711J5817763K3871928J9925510
18518A02043332J0731727N731845j0075572j5456529j2674208r478715o600584
$$ plain form
18573 8994861 10309364 12050390 14573081 18138874 22987870 30538035 43175064 64544288
18565 64544288 89978771 104549953 113560711 109400166 93500427 78290070 66002905
18558 66002905 56244420 49907045 49155496 55375738 71281304 99849387 127224382 138837776
18550 138837776 144253242 130822112 107586620 86307022 68146361 52230154 39677386
18543 39677386 31503079 26407565 23105803 20690949 18881180 17530963 16332753 15572061
18535 15572061 15083260 14707467 14515470 14521939 14953899 15736191 16532909 17613146 19052986
18526 19052986 20998213 23732157 27488461 33176420 42428131 58245894 82117822 102043332
18518 102043332 112775059 118506904 108431332 92974803 80300595 70821880 64221296
18511F4221296j728451N303097J4927372K9459489M1924144K6391192J2562522
18504A93060661Q752907m871418j8060751k8511769k4490129j7857135j1302215
18497I6720151k654435J0263941K7802479L6849418J3258153L008719K2746927
18490B07995353M0507178J0732663l6539095l7412599k6167103k1959580j7033223
18483A20123594l965559K780279j0507925j4856089j0383739p583021o171797
18476F9435743o251690o683188l849935n84604K152183O143325J2321497Q526575
18468H1209906n184105p367170n097727m087124l062198m5925M267792R295646
18460F9929095J6690736K9829089N2674597P7393612P0926367L0668511k6010228
$$ plain form
18511 64221296 62492845 67795942 82723314 112182803 154106947 180498139 193060661
18504 193060661 201813568 196942150 178881399 150369630 125879501 108022366 96720151
18497 96720151 94065716 104329657 132132136 168981554 182239707 185248426 207995353
18490 207995353 248502531 259235194 222696099 185283500 159116397 137156817 120123594
18483 120123594 116158035 118938314 108430389 93574300 83190561 75607540 69435743
18476 69435743 63184053 56500865 52650930 52066326 54218509 60361834 72683331 81209906
18468 81209906 76025801 68658631 63560904 59473780 56411582 56365657 60633449 69929095
18460 69929095 86619831 116448920 169123517 246517129 317443496 348112007 322101779
18453C22101779n1493490m5933992m1644060l8307353k9120747j5184269j688418
18446I8729450J2405512K7047456K4724746M867982p033356j4153034j1996947
18439A34591809l994617R455353J3791790j0044533k0464866j4448495j0377700
18432I8508741r154721m770114N940689K0576881K5985602M594675m698313N555277
18424A42538717M081709j6543969k1248396j4791736j0128867p145586j443417
18417G5318455Q403014K0062879J7901355k064979l669832Q411387J9888316Q322093
18409A52572688j8496371k0039709j3228728j0384570q236206j171265J1157836
18402I2173675K3939641J6721277n437999l864580N262363m256031j9900851j8150282
$$ plain form
18453 322101779 270608289 224674297 183030237 144722884 115602137 100417868 98729450
18446 98729450 111134962 138182418 162907164 167775146 160741790 146588756 134591809
18439 134591809 130597192 140052545 153844335 143799802 123334936 108886441 98508741
18432 98508741 89354020 84583906 90524595 111101476 137087078 141681753 136983440 142538717
18424 142538717 146620426 130076457 108828061 94036325 83907458 76761872 75318455
18417 75318455 83721469 103784348 121685703 119620724 115950892 124362279 144250595 152572688
18409 152572688 134076317 114036608 100807880 90423310 82187104 81015839 92173675
18402 92173675 116113316 132834593 127396594 123532014 128794377 124538346 104637495 86487213
18394H6487213j1755337q570447n599672O92841J0469470J7827526M453729j3387096
18386H0618227j3446712j0496440j0797024j0861399q232867n312963l587892
18379A7882930k580442j793853j402932j178908r59950q25274p27269o48802o78444
18370G087056n98071m88719l08665j97372j99499j78013k18499k03163l67730
18361D327325l92495l39931m20024l70141j88564l2682M0406J2647j1196p1810
18351B553535j66169j59218j56855j03363r8357q8600p0804k8045p8248n281J0667
18340A609262J0723P4170J2613r4059N0523r5155l8043q2559j14900k9962N8639
18329A361252J6854p766j06622n8642j03341k3809m6123o4473N9592K493J4213
$$ plain form
18394 86487213 74731876 66161429 60561757 61254598 71724068 89551594 94005323 80618227
18386 80618227 67171515 56675075 45878051 35016652 26783785 21470822 17882930
18379 17882930 15302488 13508635 12105703 10926795 9966845 9141571 8414302 7765500 7087056
18370 7087056 6488985 6000266 5691601 5494229 5294730 5116717 4898218 4695055 4327325
18361 4327325 3934830 3594899 3174875 2804734 2616170 2583488 2623894 2636541 2625345 2553535
18351 2553535 2387366 2228148 2071293 1967930 1869573 1780973 1710169 1682124 1603876 1598595 1609262
18340 1609262 1619985 1694155 1706768 1612709 1663232 1568077 1530034 1447475 1332575 1302613 1361252
18329 1361252 1378106 1370340 1263718 1205076 1101735 1077926 1031803 967330 1026922 1029415 1043628
18318A043628L3553j4989j28967m7294o4576J38350N9353q9291k2373M704N6295
18307I68393J6152n9095m4010M9195L0222P6974Q738o257l4604n0049R1327Q6783
18295A133769J39160Q8942J58446J87277J66169J40377J86403J01223L2770Q3781
18285B418317l6449j07369P70J08021R0184J87217R5064J10615J99756P7085J57622
18274C300833K20856K65798L84378L79336L99535L93165L53647N31819Q58975
18265G088342J202534J777248K569345L608169N034327P178515J1092430J9062230
18257E8613140L1711561L4980740J8064103J0130509r238413k4643076k4115350
18250I5503214k0883863j8822397j5553155j0698606o572045m124606k791493
$$ plain form
18318 1043628 1077181 1062192 933225 885931 821355 959705 1019058 929767 907394 912098 968393
18307 968393 984545 925450 881440 930635 960857 1037831 1046569 1040312 1005708 955659 1046986 1133769
18295 1133769 1272929 1361871 1520317 1707594 1873763 2014140 2200543 2301766 2334536 2418317
18285 2418317 2381868 2274499 2275269 2383290 2473474 2660691 2755755 2866370 3066126 3143211 3300833
18274 3300833 3521689 3787487 4171865 4551201 4950736 5343901 5697548 6229367 7088342
18265 7088342 8290876 10068124 12637469 16245638 21279965 28458480 39550910 58613140
18257 58613140 90324701 125305441 143369544 153500053 144261640 119618564 95503214
18250 95503214 74619351 55796954 40243799 29545193 22973148 18848542 16057049
18243A6057049j916917j519813j247680r30502o46263k82379j40464m8927k42055
18234I082049j19096q6953j18572r2048o0177k0370P7389K30310L84343N90658
18224I867533J207055K076929L014969K223890r5898p13158k67187J64509N04846
18215A7983488J312311K509440M076236O218264R582367J6034046K6549699K9203033
18207A13468884Q463155J778842J4215854K2735216J0058268J759833k314631
18200A70165421j748613r393646j5024438l959371J3257377J7749679L812884
18193A74859293J277120j4759179k7948573k6043127k2035298j9539001j6090731
18186D9720504j1081478o949548m513009l100259k348519j974861j740536j382242
$$ plain form
18243 16057049 14140132 12620319 11372639 10442137 9795874 9513495 9373031 9324104 9082049
18234 9082049 8962953 8876000 8757428 8665380 8605203 8584833 8662222 8892532 9276875 9867533
18224 9867533 11074588 13151517 16166486 18390376 18294478 17581320 17314133 17478642 17983488
18215 17983488 19295799 21805239 25881475 32099739 41682106 57716152 84265851 113468884
18207 113468884 121932039 123710881 137926735 160661951 170720219 172480052 170165421
18200 170165421 168416808 159023162 143998724 140039353 153296730 171046409 174859293
18193 174859293 176136413 161377234 133428661 107385534 85350236 65811235 49720504
18186 49720504 38639026 31689478 27176469 24076210 21727691 19752830 18012294 16630052
18178A6630052j006967p52595n39037m95763k90672o3784R161M1716j61954l17981
18168A3052176j64756Q077K78033N49248Q42942J299336J904583K691374L962049
18159B4423062N917729R418231J5429510J9709538J0418860L474703J0929440
18152I9721073J9486808J3693666P889226R162380P818947P390089j2524789k1981314
18144A30656086j4916555n285145M606657R215101L015792K931215p011907j5400524
18136A07810720j1414632p331400j2725815j6067937j2158947q477870p018109
18129C2616010n927380m374181l199085k289833j448244r25744q11969p52910
18121A2886664m45692l30108j75394J30414L44679L74775O87406J167871J818894
$$ plain form
18178 16630052 15623085 14870490 14331453 13835690 13545018 13481234 13490395 13532111 13370157 13052176
18168 13052176 12887420 12895497 13173530 13722778 14565720 15865056 17769639 20461013 24423062
18159 24423062 30340791 39759022 55188532 74898070 85316930 88791633 99721073
18152 99721073 119207881 132901547 140790773 149953153 157772100 165162189 152637400 130656086
18144 130656086 115739531 110454386 115061043 124276144 127291936 130223151 123211244 107810720
18136 107810720 96396088 89064688 76338873 60270936 48111989 39634119 32616010
18129 32616010 26688630 22314449 19115364 16825531 15377287 14451543 13639574 12886664
18121 12886664 12440972 12110864 11935470 12065884 12410563 12785338 13472744 14640615 16459509
18112A6459509K528739L649266N772489R711952J8009985L6259573N8852661J9603099
18104A70847273k7346478j8483313j4595118k1815027k3417669j6488657j0124828
18097C8576183n897764k893025k27641K574340O219896J2681467J9371667J2333244
18089H2738367Q82774j067812r260707j3970250j2950865j0781352q890875o762888
18081A9936392m562482k986544j968116j418965j071668q97883o32975m69049
18073E928710l53234l25844l87216l23269k34711m04954k41841k60578l71852
18064C025211k86678k61880k56852j54550r7361j33876m9578r992q902m2942j17368
18053A605232j37649p9911j13294l9469q5599n5559j25341N566k7937l9274q1654
$$ plain form
18112 16459509 18988248 22637514 28410003 38121955 56131940 92391513 151244174 170847273
18104 170847273 143500795 125017482 110422364 88607337 65189668 48701011 38576183
18097 38576183 32678419 29785394 29557753 32132093 38351989 51033456 70405123 82738367
18089 82738367 83621141 82553329 73292622 59322372 46371507 35590155 26699280 19936392
18081 19936392 15373910 12387366 10419250 9000285 7928617 7030734 6397759 5928710
18073 5928710 5575476 5249632 4862416 4539147 4304436 3899482 3657641 3397063 3025211
18064 3025211 2738533 2476653 2219801 2065251 1967890 1834014 1784436 1774444 1765542 1722600 1605232
18053 1605232 1467583 1387672 1274378 1234909 1149310 1093751 968410 973976 946039 906765 825111
18042H25111q476j7630l1791p5813n0041q4357q0890Q9346o4257M2778R8491J77980
18030H20451P3724Q6606P3441J71684R7672j9944j9519r2454j04978p4510p6199
18019I35974j23946o6781n1292l4616K5729J41043Q6926M1854l7376j04388j12713
18008G00414j45002j82918m9322m6323q0563M9581P2998Q5341n1461m2761M114
17997C14098k1871k9844j07120p0011M9567M2784J34005N211m9237k9480K1408
17986B59510M0240J06447L6962J17971J52303K16801J04351l8190l7709j09181
17976H49505j10859j40775j63050j6222L6041L977Q1728K03176K13879K31959
17966A189359J22681L5926m0567k01979j51833k12956k53624q8609k8153N865
$$ plain form
18042 825111 816635 799005 767214 691401 641360 557003 476113 565459 501202 543980 642471 820451
18030 820451 894175 980781 1054222 1225906 1323578 1303634 1284115 1191661 1086683 1012173 935974
18019 935974 812028 745247 693955 659339 685068 826111 913037 954891 917515 813127 700414
18008 700414 555412 372494 323172 276849 196286 245867 318865 404206 352745 309984 314098
17997 314098 292227 262383 155263 85252 134819 177603 311608 316819 267582 238102 259510
17986 259510 299750 406197 443159 561130 713433 930234 1034585 996395 958686 849505
17976 849505 738646 597871 434821 418599 454640 458617 540345 743521 957400 1189359
17966 1189359 1312040 1347966 1307399 1105420 953587 740631 487007 398398 370245 376110
17956C76110j0185Q5917K15974J50282K7339L5243p1477j27692n1721O0552R3947
17945G84289n0470k2329j0912p3030n1900l9416k6110j0442J25422J57935R9863
17934H82900K5094M470p3981j09262r1017m9057n9275L2695N8044J65379J75068
17923I61058L9326O8527J92032K40444j8819j39268k39090k02032j59126m0894
17913G02158l7178J05516K25580J98429J20893K09043J44598k3549k58856k69974
17903A116660k34980j93426r9155l1093L9257J14975J3682o1276n4934M0005J01924
17892G51639Q786J6377j04820o7611l9096j16628j59908j8597J06155J58806N0155
17881E85258j6191L0741J0658r7654j06388j76868j71180Q676J54652P7815J38000
$$ plain form
17956 376110 365925 451842 667816 818098 845437 880680 809203 681511 629790 690342 784289
17945 784289 733819 711490 700578 627548 575648 536232 510122 499680 625102 783037 882900
17934 882900 907994 912464 838483 729221 638204 589147 529872 562567 620611 785990 961058
17923 961058 1000384 1068911 1260943 1501387 1482568 1343300 1104210 902178 743052 702158
17913 702158 664980 770496 996076 1194505 1315398 1524441 1669039 1645490 1386634 1116660
17903 1116660 881680 688254 589099 558006 597263 712238 725920 664644 609710 649715 751639
17892 751639 760425 776802 671982 604371 565275 448647 288739 270142 376297 535103 585258
17881 585258 569067 599808 610466 512812 406424 229556 58376 67052 221704 299519 437519
17870D37519J71105m0582j200J0193N0439j9711j34459j30798j9533p6639j48826
17859I7508M5633Q6206J60799J61391l179m0392o05o2863J7071j8385j24403j39738
17847A79043o9144J27889J75159P8860L8946r1855n7454j18058p9418n841L8976
17836B17103m2016k3430L3131J7063n9190n2010m0586n2557Q478J5832J20052
17825A41870l7133k116o2680m0857K280J12992K8174n4638j04977K0128j2251
17814i208j641n3244L5616m56K1984P9659J03864J5856k5072m6610k2090n0394
17802D8264m3652K9423K3103R1234J3277l8263k7790N5848J9814k6410q2105m466
17790E8277k5794N3257L4236n724m000Q619L61L5016k180m5806o175K0014m1747
$$ plain form
17870 437519 608624 568042 566842 577035 627474 607763 473304 342506 322973 246334 97508
17859 97508 143141 229347 390146 551537 548358 507966 507361 444498 461569 443184 318781 179043
17847 179043 109899 237788 412947 491807 530753 438898 381444 263386 183968 178127 217103
17836 217103 175087 151657 184788 201851 142661 90651 50065 -2492 5986 21818 141870
17825 141870 104737 102621 39941 -916 1364 114356 142530 87892 -17085 3043 -9208
17814 -9208 -10849 -64093 -28477 -28933 -6949 72710 176574 192430 167358 120748 98658 48264
17802 48264 4612 34035 57138 148372 161649 123386 95596 151444 171258 144848 62743 58277
17790 58277 32483 85740 119976 114252 110252 118871 119232 154248 152068 106262 100087 120101 78354
17777G8354M1285q605o6805l9470k6763M0953K9827J3472o3427m5020R7979O4658
17765A16438k5536o4604N130K4489M6702K7011l7336M5199l0391j01756K3126
17754B8472N0908L7843M8722n485j2188p3074j7246l213J3471j33489l4215M1476
17742e8018O4362n8560K8920N0781M5727l8729o0791O0977J18971q369J1996j4712
17730A42555m651K0257J11289R5061J40262J82766O8189K6988M841j16530j62629
17719E08398o6141r5102n4063p5583l3031J8779k0374j4960o2302l6547P4168
17708A43242k218K104N066p0322J7571J720l0585j1451k5975p9617P0159L7023
17696E6717K4663p0378M150K9823l5296j300K3696j8216J7690K3519N2208l0009
$$ plain form
17777 78354 119639 111034 44229 4759 -22004 18949 48776 62248 -1179 -46199 51780 116438
17765 116438 90902 26298 31428 55917 102619 129630 92294 137493 107102 5346 28472
17754 28472 79380 117223 165945 160460 148272 75198 57952 54739 68210 -65279 -99494 -58018
17742 -58018 6344 -52216 -23296 27485 73212 34483 -26308 34669 153640 145271 157267 142555
17730 142555 137904 158161 269450 364511 504773 687539 755728 782716 787557 671027 508398
17719 508398 442257 347155 293092 217509 184478 203257 182883 167923 105621 69074 143242
17708 143242 141024 143128 148194 77872 95443 97163 66578 55127 29152 -50465 19694 56717
17696 56717 81380 11002 15152 44975 9679 8379 32075 13859 31549 55068 107276 77267
17684G7267O3672n611o9970K6503N9494N3128J2917J46763J07659O2268J28263
17673F62353J70634R8169R8866J2662o2885N1607q0877n8192p0085r511J10430
17662I23171k5610k8006j1088p5752k04431r9065o7219n9856j16390o3609m8088
17651A24057J189N7267o441l1480M2514k970m4404l2029M2104n011p421r6924
17639D0451o4571N53j649L428M4556O7684K2621M3708k3417o2791O1897k3094
17627A09376P040N3140N5285R0129J24348J20256J09227J15418Q3602p9957j04570
17616F83294K4998J0772j1446l9435q3962N3790J18496J57864K02430J4969o8549
17605A063221k17464k10606j82352k19052q193J5981j3254O2482k7461j58110
$$ plain form
17684 77267 140939 135328 65358 91861 151355 204483 217400 364163 471822 534090 662353
17673 662353 832987 931156 1030022 1042684 979799 1031406 950529 892337 822252 812741 923171
17662 923171 897561 869555 858467 782715 578284 479219 412000 352144 235754 172145 124057
17651 124057 125246 182513 176072 144592 187106 184136 139732 107703 149807 144796 137375 40451
17639 40451 -24120 -23567 -25216 -21788 22768 90452 113073 156781 133364 70573 132470 109376
17627 109376 116416 169556 224841 314970 439318 559574 668801 784219 867821 787864 683294
17616 683294 708292 719064 707618 668183 584221 638011 756507 914371 1116801 1131770 1063221
17605 1063221 845757 635151 452799 233747 225554 241535 228281 290763 263302 105192
17595A05192j33111R75P9951L4452k5664J982N1857j1058p3563k5810J0641L9349
17583E5193M7305O4883l1860j09225k4788J1665M5023m7569n6137J00986J5658
17572G1134P742O69M3958N199L9274J16849M4263j9n9939P583n2924m144R8333
17559C17978J35396P6770k2984r6070j06656o8315m3680l2727n0965p7983k4609
17548F155J2326O9708K0142r2014o9610j5907l0630K1023n7999N6161P3745l5260
17536d2160J4858M170q0428l2484N7114K7554Q536k5547l1919K5382M760k1857
17524i2021J7056M7691j9482K3362n0965m5904K2540J6567o0019O4644K6826L3877
17512a5828m562l8983K3442O1517L7517n9334r8128n4897Q811J9928R4107K6553
$$ plain form
17595 105192 -27919 -26944 53007 87459 61795 63777 115634 104576 31013 5203 15844 55193
17583 55193 102498 167381 135521 26296 1508 13173 58196 10627 -45510 55476 71134
17572 71134 78876 79545 123503 128702 167976 284825 329088 329069 269130 276713 223789 219645 317978
17559 317978 453374 530144 507160 411090 304434 236119 192439 159712 108747 30764 6155
17548 6155 18481 88189 108331 16317 -53293 -69200 -99830 -78807 -136806 -80645 -6900 -42160
17536 -42160 -27302 -23132 -103560 -136044 -78930 -51376 -42840 -68387 -100306 -74924 -70164 -92021
17524 -92021 -74965 -27274 -46756 -23394 -74359 -120263 -97723 -81156 -141175 -76531 -49705 -15828
17512 -15828 -20390 -59373 -35931 25586 63103 3769 -94359 -149256 -140445 -120517 -26410 143
17500A43n800O0223J9276m7525J4324J6286k6022l8526p604K4631k6590n705l092
17487b5981M2027L4577J2728L832n189j6888Q243n8092j33316K7530N8260K9927
17475b2342l1012K3272p888q078N557L5568J5819j0080N1109O2496j6157Q830
17463A07094m9786k9728n3576n2367N3984N9249L492l0700j07261J2377N8068
17452b9154l064M5105O741k3694j2834N9933k1865K5482J2681O1119N7705P2306
17440B50461K39834K93985j5143j19352m7654q1094k30570j29291p5280o0677
17430B5219j0665J5223j7312o4995n6455n923K8367O9589J7643k7190m7378Q2876
17418H999k070p3126J60J16518j4965o333m6644m442K859K3553Q8914N6404k8669
$$ plain form
17500 143 -5657 54566 73842 26317 40641 56927 30905 -7621 -15225 9406 -17184 -22889 -25981
17487 -25981 16046 50623 63351 67183 61994 45106 53349 -4743 -138059 -110529 -52269 -22342
17475 -22342 -53354 -30082 -37970 -46048 -40491 -4923 10896 816 51925 114421 98264 107094
17463 107094 57308 27580 -25996 -78363 -24379 34870 38362 7662 -99599 -87222 -29154
17452 -29154 -32218 12887 19628 -4066 -16900 43033 21168 46650 59331 120450 178155 250461
17440 250461 490295 784280 769137 649785 602131 521037 290467 161176 85896 25219
17430 25219 14554 29777 12465 -52530 -108985 -114908 -86541 -16952 691 -26499 -73877 8999
17418 8999 6929 -66197 -66037 50481 35516 29183 -17461 -21903 -19044 4509 93423 149827 121158
17405A21158J345m6235p0943o1087l640L2555O6421r616K0180j6601l7759R620
17393E398k58K9425o4795j5024K4824K5807m056k002m7865N623o4419J0594P9612
17380a7136k9881j292K153J8933o444N4764L0005m7165l9580l2720k0830L988
17368h5205J03588N0371l3533l9910m6093k0821M7178r402m5122P950k2603l547
17356i7149j3808J6980O5370J1066j3133j6671O0232n7500r6775N66p078M6176
17344a01724O8557M9442k3506o2823o7654O896O5140o4483l3748M9715M246j6916
17332a26858M8660J2413q040L5365L6398P131p6695j09290l0172k4252J12472
17321a22868R054m961M3005K2908R5906M8077Q413K2686j3657o4842j72401q5644
$$ plain form
17405 121158 122503 76268 5325 -55762 -59402 -26847 39574 29958 50138 33537 -4222 5398
17393 5398 5140 34565 -30230 -45254 -20430 5377 1321 -681 -48546 -42923 -107342 -96748 -17136
17380 -17136 -47017 -48309 -46156 -27223 -33667 21097 51102 3937 -35643 -68363 -89193 -85205
17368 -85205 18383 68754 35221 -4689 -50782 -71603 -24425 -33827 -78949 -70999 -93602 -97149
17356 -97149 -110957 -93977 -28607 -17541 -30674 -47345 12887 -44613 -141388 -140822 -147900 -101724
17344 -101724 -33167 16275 -7231 -70054 -137708 -130812 -65672 -130155 -163903 -114188 -109942 -126858
17332 -126858 -78198 -65785 -73825 -38460 -2062 5069 -71626 -180916 -211088 -235340 -122868
17321 -122868 -113814 -118775 -75770 -52862 43044 91121 99534 122220 108563 43721 -128680 -214324
17309b14324L9815R0636J6753j3642K9865J8575R200l1549M391J0041p277N113
17297d2403O5712L1225N6164n7492o1948p2263P0015L0660o7485L5340m398k4457
17285d1330J1830l8575j6248L1352Q3239O2141o1577j45184k5275N5554K5584
17274e8489m0394j4460N9090j5734J2431k0618Q0142K9340l4763m3422o2700J4687
17262i4890J6775n6055K9279N8032j0931Q4800O5845M501m5778j05628K0410M7143
17250A3503M0657m0908m5778N2635M0078j6464J0425n6233l3980l4417l3893L512
17238a00863J435n4126P706Q3128J7850o0669j2409j1494l8894N9842P2059l281
17226c9716q3569L8785O2218o8661q8937Q081R7843M3578K5327k9031l5082m6344
$$ plain form
17309 -214324 -174509 -83873 -67120 -80762 -50897 -32322 -23122 -54671 -50280 -40239 -47516 -42403
17297 -42403 23309 54534 110698 53206 -8742 -81005 -10990 19670 -47815 -12475 -16873 -41330
17285 -41330 -29500 -68075 -84323 -52971 30268 92409 30832 -114352 -139627 -84073 -58489
17274 -58489 -98883 -113343 -54253 -69987 -57556 -78174 1968 31308 -3455 -46877 -109577 -94890
17262 -94890 -78115 -134170 -104891 -46859 -57790 27010 92855 97356 51578 -54050 -33640 13503
17250 13503 54160 13252 -32526 20109 60187 43723 54148 -2085 -36065 -70482 -104375 -100863
17238 -100863 -99428 -153554 -145848 -62720 -44870 -105539 -117948 -129442 -168336 -108494 -36435 -39716
17226 -39716 -123285 -84500 -22282 -90943 -179880 -171799 -73956 -30378 -5051 -34082 -69164 -115508
17214a15508J5670n0488J3367J13656o1397j5518K3915K3394O6869L2230n4680
17203h490m1878J2992N270J7309P2573l891m1722n3572n374L2076K0425q0951
17191g5233m3819Q1838L8434P2912L2119k6415m8084j20767l6921M8894N7637
17180a9405J2974k7905n2114K367J3073l9244q6438N484J03061Q3888p154k9046
17168d0459J8661q8745k1856M3667k536j12686K0354J02726L3079J6750P6688
17157D5643j1069q5992m211l8270J6165M1611o327N5276m3600k5566l1638P730
17145h0248o2512m4028L8349K1925n1390P097k8502M2836m201N9128O7037K6494
17133h015K9333n1446o7009J4169J0161Q2027M4259R307k5436k2378o841P8514
$$ plain form
17214 -115508 -99838 -150326 -136959 -23303 -84700 -100218 -76303 -52909 13960 46190 -8490
17203 -8490 -50368 -37376 -32106 -14797 57776 53885 12163 -41409 -46783 -14707 5718 -75233
17191 -75233 -119052 -37214 1220 74132 106251 79836 31752 -89015 -125936 -77042 -19405
17180 -19405 -6431 -34336 -86450 -84083 -71010 -110254 -196692 -191208 -88147 -4259 -11413 -40459
17168 -40459 -21798 -110543 -132399 -88732 -91268 -203954 -183600 -80874 -47795 -31045 45643
17157 45643 34574 -51418 -55629 -93899 -77734 -36123 -42450 12826 -30774 -56340 -87978 -80248
17145 -80248 -142760 -186788 -148439 -126514 -177904 -170807 -199309 -156473 -160674 -101546 -34509 -8015
17133 -8015 21318 -30128 -97137 -82968 -72807 9220 53479 62786 37350 14972 8131 86645
17121H6645p136n8298n1673K801R638q2632r527N4244M480j7095j9715J8689k3346
17108i2925K3011J6004n2104p7390p7997L3278L7483K7325J0693q7181P2942R4902
17096g1959J0113M4379J126J4068M9023j1318j47731r2868O1824M7772m1211K998
17084a33784N351J823K7244k4945l4278L5964j9020q408N3985N3694J7977L8406
17072A4009O2103l6774m2017M9687K8939L161n0067o6837n724j4523p8043P440
17060a28646N5300O1784n0517k6268N3081J922L2568J8910o9305L5458K8434K7057
17048C9778M8628n6901j6032M5418N3047l8645j1398J02K0917M3048J5602M7853
17036A91417j24818q3568j0580q749l0949p585m9382k0949m1638r83J11028O8571
$$ plain form
17121 86645 79509 21211 -30462 -27661 -18023 -100655 -110182 -55938 -51458 -68553 -88268 -69579 -92925
17108 -92925 -69914 -53910 -106014 -183404 -261401 -228123 -190640 -163315 -152622 -239803 -166861 -71959
17096 -71959 -61846 -17467 -16341 -2273 46750 35432 -112299 -205167 -143343 -95571 -136782 -133784
17084 -133784 -128433 -126610 -99366 -124311 -158589 -122625 -141645 -150053 -96068 -42374 -24397 14009
17072 14009 76112 39338 -2679 47008 75947 79108 29041 -37796 -43520 -58043 -136086 -128646
17060 -128646 -73346 -11562 -62079 -88347 -35266 -33344 -776 18134 -51171 -15713 12721 39778
17048 39778 88406 31505 15473 60891 113938 75293 63895 63997 84914 127962 143564 191417
17036 191417 66599 -16969 -27549 -36298 -67247 -74832 -124214 -145163 -186801 -187784 -76756 -8185
17024h185N897l6123k8267r442J6933J2123J9135P8362O721m4895j7275P141L9469
17011D1594k9051n0700K9069P271M500r635q4763n8256J03272J8119M9870m9964
16999b8674M0170L2897o4828o475k2071K451P882N2814p1776P8085K2015J0168
16987E2658J8364p3964j1201J4015L5924M4539n3943j7365K1342o3467n9318K0701
16975g1715K3537o0191K1298P1764m0460q0165Q099J03097J2705j8125r9988M5682
16963h4462J22177L1063q9814m8272M430m1599J6778P5980n0919j185J3607o990
16951e9206O0611M1437J679l1237J3487K5356N2380J6703M6503o3773m7115m3915
16939A2910J07958P9925k5401p3232r9552n6236P2979N8190N6426o9253m6612
$$ plain form
17024 -8185 -2288 -38411 -66678 -76120 -59187 -47064 -27929 50433 57154 12259 -5016 2125 41594
17011 41594 12543 -38157 -9088 -1817 2683 -6952 -91715 -149971 -46699 -28580 21290 -28674
16999 -28674 11496 44393 -20435 -26910 -48981 -46530 -38648 14166 -57610 20475 42490 52658
16987 52658 71022 -2942 -14143 -128 35796 80335 26392 9027 30369 -33098 -92416 -71715
16975 -71715 -48178 -108369 -87071 -15307 -55767 -135932 -127833 -24736 -12031 -30156 -130144 -84462
16963 -84462 37715 68778 -21036 -69308 -64878 -106477 -89699 -13719 -64638 -65823 -52216 -59206
16951 -59206 1405 42842 44521 13284 26771 52127 104507 121210 167713 103940 56825 12910
16939 12910 120868 200793 175392 102160 2608 -53628 19351 77541 133967 64714 18102
16928A8102K8784k1714k5079L9908o5272P694l0497o301K1290j85J4758j9063
16916c7575K1203L2115r3925j18382j0531M9178j8114J04R0949L2378J19728Q0656
16904A47784p9356l5942m3m3694O262p4489l6302J5193k7970p885O3685j8404
16892i1161Q75L4765O7154P1037o5395o2189J6967M4624M5770M944n4534L6960
16880D9817R5002r1285r1596n4770J04159J2768n8616n2942l3339K3526M5058
16869e2218l4372n879J1009N0603k9624k1494L9728K2043M2024l8570j9437P941
16857b8246J0873N929N2212N1225k7388j7421J2341k5146n7758j6982K2079O734
16845a1548p3134j4672j0521K5412p010J26048P6267j10322L420R9805J7702j0858
$$ plain form
16928 18102 46886 25172 93 40001 -25271 -17577 -48074 -54375 -33085 -33270 -18512 -37575
16916 -37575 -16372 15743 -78182 -196564 -207095 -157917 -176031 -175927 -84978 -52600 67128 147784
16904 147784 68428 32486 32443 -11251 -4989 -79478 -115780 -100587 -128557 -136442 -72757 -91161
16892 -91161 -90286 -55521 11633 82670 17275 -44914 -27947 16677 62447 67391 12857 49817
16880 49817 144819 53534 -38062 -92832 11327 24095 -34521 -87463 -120802 -97276 -52218
16869 -52218 -86590 -92469 -81460 -30857 -60481 -81975 -42247 -20204 21820 -16750 -36187 -28246
16857 -28246 -17373 -11444 40768 91993 64605 47184 59525 34379 -23379 -40361 -18282 -11548
16845 -11548 -84682 -99354 -109875 -84463 -91473 34575 110842 520 3940 103745 121447 110589
16833A10589P806l9610p4255j0175l5137j0814Q650K118K6457P4515j7043r9148
16821e6047j38446j5293j1328L6399J22789J5339M9509L001n6249j531M4661k5451
16809c2647J013K6833j6075j2686K0585M2805l0278k000Q5528Q6796n1595p2326
16797D5953n4300l0107O176J8402L3629N7925l7034J7118r535O2126K5412L1442
16785A67207o8044n3813q941r4286J7760n8051J1264p119J0636M1221o050r555
16773e7771l8410J02834Q3044J0328o1663k7443l2218k0449j26437M3662K4467
16762a00056l7688J05483J05814o4260m5689n602M9696m8571p2261J6608O3599
16751c2927q6760j3977N8415k5428K9385M9895L6631R290l3683q8948j7609K5949
$$ plain form
16833 110589 118395 78785 4530 -5645 -40782 -51596 -42946 -40828 -14371 60144 43101 -56047
16821 -56047 -194493 -209786 -221114 -184715 -61926 -46587 2922 5923 -50326 -51857 -7196 -32647
16809 -32647 -31634 -4801 -20876 -33562 -12977 29828 -450 -2450 83078 169874 118279 45953
16797 45953 -8347 -38454 -32278 -13876 19753 77678 40644 57762 48227 110353 135765 167207
16785 167207 99163 45350 36409 -57877 -40117 -98168 -86904 -94023 -83387 -42166 -48216 -57771
16773 -57771 -96181 6653 89697 100025 38362 10919 -21299 -41748 -168185 -124523 -100056
16762 -100056 -137744 -32261 73553 9293 -36396 -41998 7698 -40873 -113134 -96526 -32927
16751 -32927 -119687 -133664 -75249 -100677 -71292 -21397 15234 24524 -9159 -98107 -115716 -89767
16739h9767K6090m265q9846l8466P5586N5837O5829r2068k2799K6550J08721K9197
16727E0599O952n8622Q093M1578R4486J3542j9046J0987M3045J9300n4387l6836
16715A19691j09312r4834R7417N7112j8388m6645n3091J2133l354M7150j0135
16704b256m3700j336M7283k394R1828l6128p6802k713K8313J7301o3614n8966
16692a03184K3871J20572N847r6034L587Q900l1445n8350k9653N1158R8757O920
16680I46o3898m2134K8626K2390K4257P888K9620J17029k0906j22977K7217Q9444
16668I7502L7779J826j15259n7772l0565O922L5871P4631l8850q3567M6791P0662
16656D5971J5494J9067n0161j2168K1994L1602L565O8591l2901j4993k5523N1844
$$ plain form
16739 -89767 -63677 -67942 -157788 -196254 -120668 -64831 998 -91070 -113869 -87319 21402 50599
16727 50599 57551 -1071 7022 48600 143086 156628 137582 148569 191614 210914 156527 119691
16715 119691 10379 -84455 12962 70074 51686 5041 -48050 -35917 -39271 7879 -2256
16704 -2256 -45956 -47292 -9 -2403 89425 53297 -23505 -26218 2095 19396 -44218 -103184
16692 -103184 -79313 41259 47106 -48928 -45341 -36441 -67886 -126236 -155889 -104731 -5974 946
16680 946 -62952 -105086 -76460 -54070 -29813 -21925 7695 124724 103818 -19159 8058 97502
16668 97502 135281 137107 21848 -35924 -66489 -59567 -23696 50935 12085 -71482 -24691 45971
16656 45971 61465 80532 30371 18203 40197 71799 75364 143955 111054 96061 70538 122382
16644A22382M5340J6427j7037Q0794j20o4098J1720p550q3642M6583J1093j41578
16632B0314r7719o2372q150k1461j1935R526J00307M0460j28217R961L218N8759
16620h7309J4515K5693o468n2096J3863N1929P7667K9649j5298K7899r7615n0479
16608f8050k3266j5557O3482o8216m7137P4780N3708M9957k648l6644r059n3497
16596h2147q617P2442K4298K548L1550m3129p7073j9407J06399J9289q2810l7754
16584i4411L0316k687l1894K950N3980K52j01264O3915j19K9936n905j7800n8667
16571a31398L7285M042N034L0688o298J5468n0539J3707N3121J5945l3376p2664
16559a18985L5578J98956N6588r8701j26137k6356Q559R195j12872r231J5624
$$ plain form
16644 122382 167722 184149 167112 247906 247786 183688 195408 187858 104216 150799 161892 20314
16632 20314 -77405 -139777 -147927 -169388 -181323 -171797 -71490 -31030 -159247 -149286 -146068 -87309
16620 -87309 -72794 -47101 -53569 -105665 -91802 -39873 37794 67443 52145 80044 -17571 -68050
16608 -68050 -91316 -106873 -43391 -111607 -158744 -83964 -30256 19701 17053 -19591 -28650 -82147
16596 -82147 -90764 -18322 5976 8524 40074 -3055 -80128 -99535 6864 26153 -56657 -94411
16584 -94411 -64095 -66782 -98676 -95726 -41746 -41494 -142758 -78843 -78962 -49026 -54931 -72731 -131398
16571 -131398 -94113 -90071 -85037 -54349 -60647 -45179 -95718 -82011 -28890 -12945 -46321 -118985
16559 -118985 -83407 115549 172137 73436 -52701 -79057 -70498 -61303 -174175 -183406 -167782
16548a67782J68065P5006j15655k3582L7898j6954m8286R0411P9677r9266m0725
16537f1193n2084P0896R8621r547k6614K8541p753o3459j6422O011m0772L1661
16525d2114R3900O8195q1276O3657j4044p0936o8048J21063R0496P763m4646k8021
16513I5989N2551J4376k0170r7887l0326K5374J4735n8903n125M1720l9782q8985
16501i6433L2807O2135K3667j5606p7148j8367M8033J4616j7612m9284o2888o7201
16489b23281N7391P0348Q6087M0750J4893k0228k000j9405j2654J51N0997L1763
16477G4812j6506k4856k6025L342J7751L0637J5193r3313n4146l395K0298j8232
16465g4440m0829P469O506J480o135J7147p6528R2243J4375j2658M6348M9783
$$ plain form
16548 -167782 283 75289 -40366 -63948 -26050 -43004 -91290 -879 78798 -20468 -61193
16537 -61193 -113277 -42381 56240 46693 20079 48620 40867 -22592 -39014 -33003 -73775 -42114
16525 -42114 51786 119981 38705 102362 88318 17382 -50666 70397 160893 168656 124010 95989
16513 95989 148540 162916 142746 44859 14533 39907 54642 -4261 -9386 32334 -7448 -96433
16501 -96433 -63626 -1491 22176 6570 -70578 -88945 -40912 -26296 -43908 -93192 -156080 -223281
16489 -223281 -165890 -95542 -9455 31295 46188 25960 23960 4555 -8099 -7948 43049 74812
16477 74812 58306 33450 7425 10767 28518 59155 74348 -18965 -73111 -76506 -56208 -74440
16465 -74440 -115269 -107800 -101294 -99814 -105949 -88802 -165330 -73087 -58712 -71370 -25022 24761
16453B4761K4151N4739m4179m7755k617k6369O8788Q2462R144o7356m6755m8943
16441a9929Q1755j5826k9191M346l673J8277j00254K0257M7544K7p372L4863M3856
16428G4680k4060j2544p9478j0591J17795L84q2175O98O485m7723j1156K589l1204
16415i6300J1495P1124m6331l031J49788P0370k2753o519M5109j58269p2901l0669
16403h8887J4857N4728N8596m8676K0165R1503J0245p6739j08361m4616K2050
16392i5135j2898k855M2855K027j9476n5646m5188M7911M6647J10624n660m6690
16380c3484Q00O7870k31j899j0023k2521N1856o6222m4439n5187p7814P9258O2385
16367d9651q394r636Q4264J9041K9566N1900m7651l5885L2703l5193m5220M87
$$ plain form
16453 24761 48912 103651 59472 11717 9100 -17269 51519 133981 143125 75769 29014 -19929
16441 -19929 61826 46000 16809 21155 17482 35759 -64495 -44238 3306 3333 -4039 30824 74680
16428 74680 50620 38076 -41402 -51993 65802 66186 -15989 -15291 -8806 -56529 -67685 -65096 -96300
16415 -96300 -84805 -13681 -60012 -63043 86745 157115 134362 127843 172952 14683 -58218 -88887
16403 -88887 -74030 -19302 39294 -9382 10783 102286 112531 35792 -72569 -117185 -95135
16392 -95135 -108033 -110888 -68033 -66006 -85482 -141128 -186316 -138405 -91758 18866 13206 -33484
16380 -33484 -32684 35186 34955 33056 23033 512 52368 -13854 -58293 -113480 -191294 -112036 -49651
16367 -49651 -58045 -67681 16583 35624 65190 117090 69439 33554 66257 31064 -14156 -13669
16355a3669J3805Q626n538o1069l2o2264j6512J08974K0160j2605O594J1450n8539
16342f0619M4293N8002o799q5548l787k1649L3255k2474O347J22730l9762q6747
16330f2758M0180O4135N0270k0645q0610n5738l7278r999J4836P1249J1931J1537
16318b890M9900r413m2383K9199K3442l1438j4176M6347R510p5207k1453L1156
16306g406j4278l7526k3147N0581K4246l2908j14750J28426P2255j114L1915m4476
16294C1818m9438J2684N4767k4661K6330m6274o8446O3585l672j1918m2847r1794
16282a49866O006M3805O6150J6262M0244n7189k4669l3616m2694J27942R8000
16271I0375M1249l3413m3247k0853o201M4048k1029n6380j8598l307O8304l4570
$$ plain form
16355 -13669 136 8762 3224 -57845 -57877 -120141 -136653 -27679 -7519 -20124 -13530 -2080 -60619
16342 -60619 -16326 41676 34877 -50671 -54458 -76107 -42852 -65326 -58979 63751 23989 -62758
16330 -62758 -22578 41557 91827 71182 -9428 -65166 -102444 -112443 -97607 -26358 -14427 -2890
16318 -2890 47010 37597 -4786 24413 47855 16417 2241 48588 58098 -17109 -38562 -7406
16306 -7406 -21684 -59210 -82357 -31776 -7530 -40438 -155188 -26762 45493 44379 76294 31818
16294 31818 -17620 -4936 49831 25170 51500 5226 -63220 365 -3307 -15225 -58072 -149866
16282 -149866 -143860 -100055 -33905 -17643 22601 -34588 -59257 -92873 -135567 -7625 90375
16271 90375 131624 98211 54964 34111 27910 71958 50929 -5451 -24049 -27356 40948 6378
16259F378L1581j5894K3144q5705N032N6775J8332o2974j26226M6663P6927M5782
16247A9815N6837N1906q8856m8456M5208J5672k5470n5152m5816N3936L3590J7692
16235C0906J8268J8891k9003L6870N3036p8467j014M32q8243M5665L0055N1628
16223H9024k3048l197r4438K8530L6401k2404j8485o8265j11895K2918P8607N7609
16211b8643J1047o8332m2273L4796k5989j6635L1615N5624Q8730L2447o1768K595
16199A3214J6127k9379m0922Q6989L7825j7082O025k3448j18364l3050N6696K9988
16187a5381K2699n4768j7966J23828l445m5998q9142R449P8457L1989n8780m772
16175b3830M2454k3114K2873p790k4904P2647o3074l2275O649L7754K6080M1483
$$ plain form
16259 6378 37959 22065 45209 -40496 -35464 21311 39643 -23331 -149557 -102894 -25967 19815
16247 19815 76652 128558 39702 -8754 36454 52126 26656 -28496 -74312 -20376 13214 30906
16235 30906 49174 68065 39062 75932 128968 50501 49487 49919 -38324 7341 37396 89024
16223 89024 65976 62779 -31659 -3129 33272 10868 -7617 -75882 -187777 -164859 -86252 -28643
16211 -28643 -17596 -85928 -128201 -93405 -119394 -136029 -104414 -48790 39940 72387 10619 13214
16199 13214 29341 -38 -40960 46029 83854 66772 72797 49349 -69015 -102065 -45369 -15381
16187 -15381 7318 -47450 -65416 58412 54967 8969 -80173 -70724 7733 39722 -19058 -23830
16175 -23830 18624 -4490 18383 10593 -14311 58336 -4738 -37013 -30364 7390 33470 74953
16163G4953J4446q9066r83L0079l7212j11697J8127M4245Q951k7241m5712j9829
16151a40939R7290L5526n0840L0392L3342j4809k1585Q5341M3385j6506j2045
16140F8552r934m7367q9223Q446N5026j3634Q590Q8635Q7400m5991K2344m1112
16128I1732j15205M1137J02880l3613j50321p2609J3088L0494M3117N8947k378
16117G269k6889K4131P4328j2569o1482J8540J4412J5853p5744M3045M4784k5335
16105D0343L4676J6649K1521o0702j23243L6457N0827O879k368j04602p2162K3419
16093a32306K7175P1180N3984o7821L0383o8851J6273M2046K3950n8821j4865
16082g7673L4645O6927L7191k1859O2822J1520k2295k9793m4677l7201P0262m0424
$$ plain form
16163 74953 89399 333 -650 29429 -7783 -119480 -101353 -57108 -48157 -75398 -121110 -140939
16151 -140939 -43649 -8123 -58963 -28571 4771 -10038 -31623 53718 97103 80597 68552
16140 68552 58618 11251 -77972 -69526 -14500 -28134 -19544 69091 156491 110500 132844 91732
16128 91732 -23473 17664 120544 86931 -63390 -135999 -122911 -92417 -49300 9647 7269
16117 7269 -19620 4511 78839 66270 4788 23328 37740 53593 -22151 20894 65678 40343
16105 40343 75019 91668 113189 52487 -70756 -34299 16528 23407 21039 -83563 -155725 -132306
16093 -132306 -105131 -33951 20033 -47788 -17405 -86256 -69983 -27937 -3987 -62808 -77673
16082 -77673 -43028 23899 61090 39231 102053 113573 91278 61485 16808 -20393 49869 9445
16070I445l2980J0540M479P2015P7840j19677j33063k2986R4996N966J997M3352
16058A1924N2333j3413p3822K6688j0490l3796N2887k8161j7867R0245K1434j2724
16046F5238j8592J9322K9985n0518l9247n5722l3284N8431j4809M2864O3016o4649
16034B035q5004m5049N6863K681K6057L538P5841P299K407l5992l5357J4473j1276
16021b1484K7370P0116j028l9593L207n6948K3388Q259n0628J1205k1786j0821
16009e8743o5024J5464P1385J6570J604J7759N5841k0363M5158k145j4629j2452
15997E0425J4743p1330j1948M7720r340J3300j1697n5460L6580p5488m692j800
15985g8987j030J18856K6419j18045M7927n254k2664K4470N231N0556J2211l1660
$$ plain form
16070 9445 -23535 -12995 -8516 63499 141339 21662 -111401 -134387 -39391 -33425 -31428 11924
16058 11924 64257 50844 -22978 3710 -6780 -40576 12311 -15850 -33717 56528 77962 65238
16046 65238 46646 65968 95953 45435 6188 -49534 -82818 -24387 -39196 3668 66684 2035
16034 2035 -82969 -128018 -71155 -68474 -42417 -38879 36962 44261 46668 10676 -24681 -10208 -21484
16021 -21484 5886 76002 74974 35381 38588 -18360 5028 13287 -37341 -26136 -47922 -58743
16009 -58743 -123767 -108303 -36918 -20348 -18744 -985 54856 34493 79651 77506 62877 50425
15997 50425 65168 -6162 -18110 29610 20270 33570 21873 -33587 2993 -72495 -77187 -78987
15985 -78987 -80017 38839 65258 -52787 -4860 -10114 -32778 -8308 -3077 47479 59690 28030
15973B8030l9815r7923R39R2508J31893N30o0783N5627o6930M1379J9123q666
15961I5912k6669K4191l465r783n5499p7372q8831j6391M0359R8355R7887n3936
15949B4758p6993J0429j4286P2148Q2776k3048m2551L9240k9541n3844r5420K3380
15937h2952P9102J5134K6784l1212P5023R093k8508k2886p1025O2694P6568J0932
15925A18747p2640l3859p7725N133j4118J9126j6713l6720m4972j4212P0728l8659
15913a35884M0698J64298K3955l2287l0167r7953L4838N0252k0778L7463q5018
15902e0583l0001j1981N0702N2243j2535l3441l524l5129k3177N5888j47J1234
15890c0451p797q817M8111M9176m7624j15105J9018J6278k6832J7839O8919o403
$$ plain form
15973 28030 -11785 -109708 -108769 -16261 115632 116162 55379 111006 44076 85455 104578 95912
15961 95912 69243 93434 89969 80186 24687 -52685 -141516 -157907 -117548 -19193 78694 24758
15949 24758 -52235 -41806 -56092 16056 98832 75784 33233 72473 42932 -10912 -106332 -82952
15937 -82952 -3850 11284 38068 6856 81879 90972 62464 39578 -31447 31247 107815 118747
15925 118747 46107 12248 -65477 -60344 -74462 -55336 -72049 -108769 -153741 -167953 -97225 -135884
15913 -135884 -95186 69112 93067 60780 30613 -67340 -32502 17750 -3028 34435 -50583
15902 -50583 -80584 -92565 -41863 10380 -2155 -35596 -39120 -74249 -97426 -41538 -41685 -30451
15890 -30451 -38248 -47065 1046 50222 2598 -112507 -93489 -77211 -104043 -86204 -17285 -23688
15878b3688l6692M177P3126N0102O7018j00757O3274L3017j160p2984r6759J4631
15866b6695J05163l9148m3709O6629K8569k9881j6328j7060k2225N8472J16415
15855A80202j0735j48864n8812K4777p714O039L6398M6365K3184l4429J8169n8428
15843A6152k0334K0456l2822o4482j9362J5057N7074K072n9015m1334Q7934M3031
15831D427K5974r610m7175M6296N7890o0791j8264k8143n3569p769N359l9318
15819a24693K0888N6942L3323J1738j6153M8894k3433j9951O5299O8335J4029
15808A35218o1743r2173J6215J25855N5019K7450k8661j78217n7380l3060Q2350
15797i127J26945O930j8504n7417m2747J6312J1997n629L8135j2550m7478m7337
$$ plain form
15878 -23688 -60380 -56203 16923 67025 134043 33286 96560 129577 128417 55433 -41326 -26695
15866 -26695 78468 39320 -4389 62240 90809 60928 44600 27540 5315 63787 180202
15855 180202 169467 20603 -38209 -13432 -21146 -15107 21291 67656 90840 56411 74580 16152
15843 16152 -4182 16274 -16548 -81030 -100392 -85335 -28261 -26189 -85204 -126538 -38604 4427
15831 4427 30401 20791 -26384 19912 77802 17011 -1253 -29396 -82965 -90734 -85375 -124693
15819 -124693 -103805 -46863 -13540 -1802 -17955 30939 7506 -12445 52854 121189 135218
15808 135218 73475 -18698 -2483 123372 178391 205841 177180 -1037 -58417 -91477 -9127
15797 -9127 117818 124748 106244 48827 6080 22392 34389 28760 66895 54345 6867 -40470
15785d0470l6033M7183M9694k6745o7700J7180O4440q96R6392L8744m6156n1867
15773D3766m1092L8835K4181L1267k6322n8767L7982J7743n6488j1081O0799M4688
15761A05511l3135j29243j7636j510P7889m139r2321M3469j9822j3670N8980j4856
15749d0483k6542m2364k052L5070J0585n5049J3191J3076N5854n8105p9170j7270
15737a93259O0275k2107L84P7181J8172J9698J06973j0033O5312N8525r3388o9131
15725A8602m3385K1423l3892L6145l7105j2179n5868K0146P1368L0928J1545k9511
15713a783q0097o0554O6829K8320j1322o1246R239N0626O7192N3913j773m6821
15701A2523K1803l9601r4706P553J5211k2037p4549J08101P3807M179N892K0602
$$ plain form
15785 -40470 -76503 -29320 20374 -6371 -74071 -56891 7549 6653 103045 141789 95633 43766
15773 43766 2674 41509 65690 96957 70635 11868 49850 67593 11105 24 60823 105511
15761 105511 72376 -56867 -74503 -76013 1876 -2263 -94584 -51115 -70937 -84607 -25627 -40483
15749 -40483 -67025 -109389 -111441 -76371 -65786 -120835 -107644 -94568 -38714 -96819 -175989 -193259
15737 -193259 -132984 -155091 -154707 -77526 -59354 -39656 67317 57284 122596 181121 87733 18602
15725 18602 -24783 -3360 -37252 -1107 -38212 -50391 -106259 -86113 -14745 16183 27728 -1783
15713 -1783 -81880 -142434 -75605 -47285 -58607 -119853 -110614 -59988 7204 61117 59344 12523
15701 12523 34326 -5275 -99981 -92428 -77217 -99254 -173803 -65702 8105 12284 18176 38778
15689C8778N2094R481k1139o7254j572n1611j0040j3903k7960m54N8809n078J2405
15676b7444l6088l3358p04K4478r592j6630k9197O1540O6850L4643m2034p2995
15664h0531K3224P7741J04705r9606q0779j5712L2301M1673N8203k077n2234j42777
15652a35869L4330P1021L5664N0673m6702l2337k3648o266k1324l664k2217L9082
15640f1257l256M8019N3148J8605L3967P2241j12282r5670q98M2144p035j5331
15628b7605K7701K309k238K7120N0686j6953o5329m4495M9945l3670j9598j0058
15616f2185j9600o2361O3865J18732K6825M1879L4505m5615j31353q1325K0027
15605i6606N2015J4297P8481N3534q6387j638o3873N775k5656m2988J1053L7592
$$ plain form
15689 38778 90872 100353 79214 11960 10388 -41223 -51263 -65166 -93126 -93580 -34771 -39849 -27444
15676 -27444 -63532 -96890 -97594 -73116 -82708 -99338 -128535 -66995 -145 34498 -7536 -80531
15664 -80531 -57307 20434 125139 25533 -55246 -70958 -38657 3016 61219 59142 6908 -135869
15652 -135869 -101539 -30518 5146 55819 9117 -23220 -46868 -53134 -74458 -78122 -100339 -61257
15640 -61257 -64513 -16494 36654 55259 89226 161467 49185 -46485 -47383 -5239 -12274 -27605
15628 -27605 96 2405 167 27287 77973 61020 -4309 -48804 1141 -32529 -52127 -62185
15616 -62185 -81785 -144146 -80281 38451 65276 107155 141660 96045 -35308 -116633 -96606
15605 -96606 -44591 -30294 48187 101721 15334 13696 -50177 -44402 -70058 -113046 -101993 -64401
15593f4401J08878O4559M4393p2599m0824k0097K3171k3325o8688Q796R2499N0426
15581A02788n2410O298p5725j2073P2715K6937m4761N3743M2755m9383l6984r8966
15569f5066m8693k5399k9021j443m74M9971L2115k2806K6143L805j0498L5825
15557e5541M041K107R384N5998o9845j8172P8236J6125k1191J0286M1167l60K7421
15544G9656m1592N8454j4121J2192j7168P6541o3999r5736Q9092m6871p6211m9810
15532h9573l7596P1947J27557N9144o0068p6075l9912o8598P95J06112J3421J3636
15520B0790P616L9551J2457j6452n3250j8069j1846K0691L8812K6204k7123j09667
15508g0286o8510Q6889P2097j2573p8337l9094K2883p0707K9653N2528M9487N655
$$ plain form
15593 -64401 44477 109036 153429 80830 40006 19909 43080 19755 -48933 -40137 52362 102788
15581 102788 50378 56676 -19049 -31122 41593 68530 23769 77512 120267 70884 33900 -65066
15569 -65066 -113759 -139158 -168179 -169622 -170096 -120125 -88010 -110816 -84673 -80868 -91366 -55541
15557 -55541 -51500 -49393 -40009 15989 -53856 -72028 6208 22333 1142 11428 52595 52235 79656
15544 79656 38064 96518 82397 94589 77421 153962 89963 -5773 83319 36448 -39763 -89573
15532 -89573 -127169 -55222 72335 131479 71411 -4664 -44576 -113174 -112379 -6267 7154 20790
15520 20790 28406 67957 80414 63962 10712 -7357 -19203 1488 40300 66504 39381 -70286
15508 -70286 -138796 -51907 20190 7617 -70720 -109814 -86931 -157638 -127985 -75457 -25970 -20315
15496b0315m0809M6710M6297p0556j05920k1088J03864j1408L8832l2087o7578
15485a34058N8125O4646o2117J5016P2053M6092J1485l4704J0075N3072L2789
15474A32474p0591j22695l5943k5342Q2680M7661M2678K7732K7406Q732Q383n8021
15462F5154o5544m7474P4909M7680K2185n5691k6774k4671p6531P3201M5505n4779
15450b2830J3688O0839J901k7905K5800o175j7464L94n6257M5712k8849K4594
15438A3448j0541l7437n886K3771j2580K8567M6899k8786q343o2335k4798K1960
15426e6061K9410P8875N3265L6579j45473r2532J9180K229K2639L2474J9293k202
15414b324p5025r7121L8622L1255L1760L0744j6346o5388l9139j9021J2786K7788
$$ plain form
15496 -20315 -61124 -14414 31883 -38673 -144593 -165681 -61817 -73225 -34393 -66480 -134058
15485 -134058 -75933 -11287 -73404 -58388 13665 59757 71242 36538 46613 99685 132474
15474 132474 61883 -60812 -96755 -122097 -39417 8244 50922 78654 106060 114792 123175 65154
15462 65154 -390 -47864 27045 74725 96910 41219 14445 -10226 -86757 -13556 31949 -22830
15450 -22830 -9142 51697 53598 25693 51493 45318 27854 28248 -28009 17703 -11146 13448
15438 13448 2907 -34530 -40416 -16645 -29225 -658 46241 17455 9112 -53223 -78021 -56061
15426 -56061 -26651 52224 105489 142068 -3405 -95937 -76757 -74528 -51889 -19415 -122 -2324
15414 -2324 -77349 -174470 -135848 -104593 -72833 -42089 -58435 -123823 -162962 -181983 -169197 -141409
15402a41409J0239K1682J4261p3555J27376P8070J9907l7945Q971j20026P606
15391h4823K5572R874k9189L736J0929j7409P0110l1061M1067O8714p3167l3910
15379c9557m2520N3894N8767O441j3815k5308M4904j3548R768n03n4401J6540
15367F62J3807n1942P2890O4013m1232R098J703j9920n442L7754m7095j19086
15355h4790K5844K8018J2244K0614r263p037K235L4711N0284O0988r165n4969
15343F9714r3238m1010M1675N7538O9767m5550k3335O4676n4319n7114j5807m133
15331c1136P5017M4572R2158M3500q7371J7404N2204r3515q0760N984J1874k9140
15319B0791P239m1594L8150J25424P7910o7420m1006j7461q800l8262K7875J2521
$$ plain form
15402 -141409 -131170 -109488 -95227 -168782 -41406 36664 56571 18626 27597 -92429 -84823
15391 -84823 -59251 -49377 -78566 -74830 -63901 -81310 -11200 -42261 -1194 67520 -5647 -39557
15379 -39557 -82077 -28183 30584 37025 23210 -2098 42806 29258 39026 38523 -15878 662
15367 662 14469 -37473 35417 99430 58198 67296 68999 49079 43637 81391 34296 -84790
15355 -84790 -58946 -30928 -18684 1930 -7333 -14370 -12135 22576 72860 133848 124683 69714
15343 69714 -23524 -64534 -22859 34679 104446 58896 35561 100237 45918 -11196 -27003 -31136
15331 -31136 43881 88453 180611 224111 136740 154144 206348 112833 32073 38057 49931 20791
15319 20791 28030 -13564 24586 150010 227920 160500 119494 102033 93233 54971 82846 95367
15307I5367m3517L5830N16K1993k7501q1847k0094J2523L0361O83l2232j0516
15295a8434k7065k5269O1908O4907l7496n3362P0602P747j1174M9328p9194M5432
15283D7930N9938k6521L6488k0742m4080J1389n020q7299j9438N953l4536N1694
15271b4244k9619k3827O7611o6698m1994p092N6986j4405J33569M0931n2547j168
15259C7503o3331p1141P171P3259M1104J5873l0539k1298L8632n1436r4261l3135
15247a51599n7285l592k6681J64723J09677K7239k4973K7404L308j6924N7336
15236A08633o5188j16904m4624K7894N9248l7368M1518O3870p481K9866L1861
15225I1325M3364l5280k7191O733L2955J3763j942o8304o8539K7812M5298P3490
$$ plain form
15307 95367 51850 87680 88196 110189 82688 841 -19253 -6730 23631 24314 -7918 -18434
15295 -18434 -45499 -70768 -8860 56047 18551 -34811 35791 43538 32364 81692 2498 47930
15283 47930 107868 81347 117835 97093 53013 64402 59382 -27917 -47355 -41402 -75938 -24244
15271 -24244 -53863 -77690 -10079 -76777 -118771 -125863 -68877 -83282 50287 91218 38671 37503
15259 37503 -25828 -96969 -89798 -16539 24565 40438 9899 -11399 27233 -24203 -118464 -151599
15247 -151599 -208884 -212476 -239157 -74434 35243 62482 37509 64913 68221 51297 108633
15236 108633 43445 -73459 -118083 -90189 -30941 -68309 -26791 37079 29598 59464 91325
15225 91325 134689 99409 72218 78951 111906 125669 123727 55423 -13116 14696 59994 133484
15213A33484O0567q2248j06473o9884l8019L5056K2111j6037K480l3400N3743
15202c8620M7901P5441N4135o9135p9310l2062R428P0636O7419k6982J3342j2679
15190G9514k627K6627m9088l6062J0771j0861K1099k0373J2074N1058o7283j00102
15178h5253J7041M6200O2440M3246J0323q0153r0104j21796o8782R2712O6237
15167a07889l53n7p441N8337Q5351q242j16857N8454J07933N719J489N5591o3273
15154F8762j1130L9773J5298j13436k4141n3O2881N845l3455K318L6385P758n4115
15141B690J6066r327l3679J05955m0842j16343M4748O4287K8457p0054j7175r367
15129c4584J206j9766L4044O7875M6974j6991p6826o2845P995j2598K4543Q1490
$$ plain form
15213 133484 194051 111803 5330 -64554 -102573 -67517 -45406 -61443 -58963 -92363 -38620
15202 -38620 9281 84722 138857 69722 -9588 -41650 -32222 38414 105833 78851 92193 79514
15190 79514 76887 103514 54426 18364 29135 18274 39373 19000 31074 82132 14849 -85253
15178 -85253 -68212 -22012 40428 83674 93997 13844 -76260 -198056 -266838 -174126 -107889
15167 -107889 -108242 -108299 -115740 -57403 27948 19706 -97151 -38697 69236 74955 76444 132035 68762
15154 68762 57632 97405 112703 -733 -24874 -24927 37954 43799 10344 12662 49047 56805 2690
15141 2690 18756 9429 -24250 81705 40863 -75480 -30732 33555 62012 -8042 -25217 -34584
15129 -34584 -33378 -53144 -19100 48775 95749 78758 1932 -60913 -52918 -65516 -40973 40517
15117D0517J0215l1834m9838K6001K7021o4426Q8765N2128o5569L9361M2221m6433
15105F8129M9205l9677o2334m851K2347l9957m0755j1627R6830K092r9674L0046
15093c0226P2505l1685j2091O2695q7694k9252O675j7722J4642P1835m733k1275
15081f326J8267j6300M4082N6916n922Q9485j5112q3208r1331m3748P687k3454
15069f8964K3762m953p0464k1951K2590J5441Q7403K6452n468n1303N0969K9162
15057C2676o817L1731K3521O7154K1856m3981P76N8444l5108j15723j03538N1017
15045a7992J6779j8516M2032k8245n0844m0084p5048m9497J04557L0618J9800
15034f6440o267P468J774N7144K5295m3928j7148n4334m3601M4003j961k7789
$$ plain form
15117 40517 50732 18898 -30940 -4939 22082 -42344 46421 98549 32980 72341 114562 68129
15105 68129 117334 77657 15323 10472 32819 -7138 -47893 -59520 37310 39402 -60272 -30226
15093 -30226 42279 10594 -1497 61198 -26496 -55748 -49073 -66795 -52153 19682 14949 -6326
15081 -6326 11941 -4359 39723 96639 90717 180202 165090 81882 -9449 -53197 -45510 -68964
15069 -68964 -45202 -50155 -120619 -142570 -119980 -104539 -17136 9316 3848 -47455 3514 32676
15057 32676 25859 57590 81111 148265 170121 126140 126916 185360 150252 34529 -69009 -17992
15045 -17992 -1213 -19729 22303 -5942 -56786 -96870 -171918 -221415 -116858 -86240 -66440
15034 -66440 -72707 -65239 -63465 -6321 18974 -24954 -42102 -96436 -140037 -96034 -97995 -125784
15022a25784M865K9645k7762r771N9569M0471K1406O8545l9778k9545j4076k819
15010b5034P610p294L0452j1416l8303M6352M5361R2399N1670Q6077p7379k2198
14998A78297j1919n2920k8554O159P7723J5404l2935j0902j1654O731J4803m3600
14986A06633k5802l9822N87n5597m5430R7060J2887K516o11P7826N5185p771O63
14973A78324o8621m6575l4454N7477O19q4088r5821p3801N9958P1651K4592q130
14961a8869L6845l5338n5107N000K6519M8368r8234q1005M3333R8534L5890k4571
14949a8635K1840m1453L886J5849l4303M4050J08344L5121j08419o8076K4494
14938a7302P7793M7581k7466p3425L9342r068q9068n8318j6675l7368J0607R4170
$$ plain form
15022 -125784 -120919 -91274 -119036 -128807 -69238 -28767 -7361 61184 21406 -8139 -22215 -25034
15010 -25034 -17424 -24718 5734 -5682 -43985 2367 47728 140127 191797 277874 200495 178297
14998 178297 166378 113458 84904 91063 168786 184190 151255 140353 128699 135430 150233 106633
14986 106633 80831 41009 41596 -14001 -59431 37629 50516 53032 52421 130247 185432 177661 178324
14973 178324 109703 63128 28674 86151 86770 2682 -93139 -166940 -106982 -35331 -10739 -18869
14961 -18869 17976 -17362 -72469 -67469 -40950 7418 -90816 -171821 -128488 -29954 5936 -18635
14949 -18635 3205 -38248 -34362 -18513 -52816 -8766 99578 134699 26280 -41796 -17302
14938 -17302 60491 108072 80606 7181 46523 37455 -51613 -109931 -126606 -163974 -153367 -59197
14926e9197L0982J6621Q7227M5532o7897K9504M7757N0969j7751o9615j40005
14915d5873o0911O7674O5851Q240K1731K0742j6699j39401l3513R2746J25880
14904A06467m3241j36151J2422K6015J8476n4807k0676n7306k3592J8076K4912
14893a29405O3323q150k6432N1233J909k390k3189J7422j19466m5592P3002Q9744
14881e7991J52792N596j52440k2818P4243O0073j9340n6510r158N6707l3301O6739
14869F4592k0736o5254j9949n0061P1624J22044m3860m8025l7012k6454L2481
14858b0610l2793J1776Q3997K9535L6277O2619n733j43775m6489o9907m7424k6930
14846a69457m5487O8365R8469m978O5241k0407m894J11916j2196n0288j07689
$$ plain form
14926 -59197 -28215 -11594 75633 121165 53268 82772 130529 181498 163747 94132 -45873
14915 -45873 -106784 -39110 26741 34981 56712 77454 60755 -78646 -112159 -19413 106467
14904 106467 63226 -72925 -60503 -34488 -16012 -70819 -91495 -148801 -172393 -154317 -129405
14893 -129405 -66082 -74232 -100664 -49431 -47522 -49912 -73101 -55679 -175145 -220737 -147735 -57991
14881 -57991 94801 100397 -52043 -74861 -618 59455 40115 -16395 -25553 31154 -2147 64592
14869 64592 43856 -21398 -41347 -91408 -19784 102260 58400 10375 -26637 -53091 -20610
14858 -20610 -53403 -41627 42370 71905 108182 170801 165068 21293 -25196 -95103 -142527 -169457
14846 -169457 -214944 -146579 -48110 -53088 12153 -8254 -13148 98768 86572 36284 -71405
14835g1405n9235k9120R052N6786O7800J7715r2870l822R3590J9283N9740J26518
14823A94032m6701q3350m1093J5975P7286q8371n4543J7467K1178j457m4207m5728
14811g9512M612Q3546L0772j20146l8617M0701N3188n2651J4080J01589K5218
14800F2780j0927l8269l2244L0874L9133K3100m0258k296j7411j02531r0125k6085
14788b04259J04962j2168p1012M9940Q0745J15488k1138r0744p607J61919O2447
14777A68573r4847j04045k353l988j8833k2805k262j7945j6172J2834j8358l5568
14765a55769N1346J03755J7523q6141j1517O6573M3398j1416P0236q4145r560
14754e717L5439R9652R1103m8003m5919L7296L0743j07378M1578J5782n760J51
$$ plain form
14835 -71405 -130640 -159760 -150708 -93922 -26122 -8407 -101277 -105099 -11509 7774 67514 194032
14823 194032 147331 63981 22888 38863 116149 27778 -26765 -9298 11880 10423 -33784 -79512
14811 -79512 -74900 8646 39418 -80728 -119345 -78644 -25456 -78107 -64027 37562 62780
14800 62780 51853 13584 -18660 12214 51347 74447 34189 31893 14482 -88049 -178174 -204259
14788 -204259 -99297 -111465 -182477 -132537 -51792 63696 42558 -48186 -55793 106126 168573
14777 168573 73726 -30319 -32672 -36660 -55493 -78298 -80560 -98505 -114677 -101843 -120201 -155769
14765 -155769 -104423 -668 16855 -69286 -80803 -14230 29168 17752 87988 3843 -5717
14754 -5717 29722 129374 220477 172474 126555 163851 194594 87216 128794 144576 138816 138967
14742A38967k3082n8295m9244n75N6382j0234L891L1672R47l6344M5116l3705
14730F5496n1603J212j7721J3486o9818j613P3312P3990N1329q8819o3902k6384
14718d1035Q4251J10972p5186p7448p0525n9555O4677O6422o478J3489J6043p595
14706A8032k8864J9440J4812j9250J10039L9737j29131r9569N5943J6114j15297
14695a17994o7455O607j0281M2753l348r513j1540k6395Q5622Q3098P0993O074
14683D8621J6622j7630J7570M9386p2176R403J7016o1542r4826p5454m5997j4796
14671b23803K5998M3146k4266K1359M0196M5425J0019j5282M6454N5940R3307
14660A18493j17769p3323O0142N591J9515J5103M1825j4123m81L4914r2777J02974
$$ plain form
14742 138967 115885 57590 8346 7771 64153 53919 57810 89482 90429 54085 99201 65496
14730 65496 13893 15105 -2616 10870 -58948 -60561 12751 86741 138070 49251 -14651 -41035
14718 -41035 43216 154188 79002 1554 -68971 -128526 -63849 2573 -3905 9584 25627 18032
14706 18032 -10832 8608 23420 4170 114209 153946 24815 -74754 -18811 -2697 -117994
14695 -117994 -185449 -178842 -189123 -146370 -149718 -159231 -170771 -197166 -111544 -28446 42547 48621
14683 48621 65243 47613 65183 114569 42393 51796 68812 7270 -87556 -163010 -209007 -223803
14671 -223803 -197805 -154659 -178925 -157566 -117370 -71945 -61926 -77208 -30754 25186 118493
14660 118493 724 -72599 -12457 -6866 12649 27752 69577 55454 54973 89887 -2890 100084
14648A00084n2665m8929m0838J22219L2645j5066n3321q2644N6955k5944N556
14637a948n5478n761J9894M1019Q896P2980N6763m7792p9663r990J5471L1128
14625D5519j2859j4204M1504m8069r5144L4356K9020K7044m3283N2012j0850j9679
14613a4633K3270L4200k2791k5231q5148j051K4674L8165k2375j0390m5780J3150
14601i3940O4562R882L4061J13449r584n4546n7546K6651k6040J0426K9772o4197
14589a7050K7870n663K8431l7774n3616l7221n254K5666R0525Q0153Q0220o2494
14577A13793l413l9425K820l6761l0890J8565M9894m1812n9401J5108M9157j7599
14565B0036m5285k3222L1892M8080k5411j1463j555j6680M4863L506m3713J2012
$$ plain form
14648 100084 47419 -1510 -42348 79871 112516 97450 44129 -38515 18440 -7504 -1948
14637 -1948 -57426 -63187 -43293 -2274 6622 79602 136365 88573 8910 -1080 14391 45519
14625 45519 32660 18456 59960 11891 -83253 -48897 -19877 7167 -36116 15896 5046 -14633
14613 -14633 8637 42837 20046 -5185 -90333 -91384 -66710 -28545 -50920 -61310 -107090 -93940
14601 -93940 -29378 -19496 14565 128014 118430 63884 6338 32989 6949 17375 47147 -17050
14589 -17050 10820 5157 33588 -4186 -57802 -95023 -100277 -74611 15914 96067 176287 113793
14577 113793 110380 70955 73775 37014 6124 24689 74583 32771 -26630 -11522 37635 20036
14565 20036 -25249 -48471 -16579 31501 6090 -5373 -6928 -23608 21255 24761 -18952 -6940
14553f940K1616N2860N0593q7592m1198L2817O6390k8297l0410L1278O6399o594
14541A20922J1984o0458L785j17507j09174k2005L9152M2057M2235J2835j2322
14530d8496N8216o478m8442K3575O0576Q8347n4887o1539J7117n559r5784l5916
14518a09270Q1391Q6325m122k7930K6917J0874n3089L471J9527N8525L6528m6618
14506H2529n7741K971R7379O693n8450n8328j95724L0576N2594K4384j8204M5382
14494d5939j7037n9524k7682K4399Q0600J6599m4270k8112O0950Q3510K8071N0654
14482A22219r1112m9394j34556n9799p285M3876N7491J8125l1325N4472P6084
14471a204N2773n4875j9659o616J0311j3060j5267K9571J7791k117K282K6953
$$ plain form
14553 -6940 14676 67536 118129 30537 -10661 22156 88546 60249 29839 61117 127516 120922
14541 120922 132906 72448 76233 -41274 -150448 -172453 -133301 -91244 -49009 -36174 -48496
14530 -48496 9720 3242 -45200 -21625 38951 127298 72411 10872 27989 22430 -73354 -109270
14518 -109270 -27879 58446 54324 26394 53311 64185 11096 14567 34094 92619 129147 82529
14506 82529 24788 27759 125138 131831 73381 15053 -180671 -150095 -97501 -73117 -91321 -45939
14494 -45939 -62976 -122500 -150182 -125783 -45183 -28584 -72854 -100966 -40016 43494 71565 122219
14482 122219 31107 -18287 -152843 -212642 -219927 -176051 -118560 -100435 -131760 -77288 -1204
14471 -1204 51569 -3306 -22965 -29581 -19270 -32330 -47597 -18026 -235 -2352 -70 26883
14459B6883j9142l1781k0522m8437N2253J11784m8654k1536j5026j3074J877n7779
14447h3154k3188M5965M7053P5211J0410r106M4786N9388N8813j4891n9810j17949
14435C3528j5912k1887L9684Q956q8014j7184O8681R1598m1851q8825p5156Q8410
14423a7972O4795r1117n1252M226O9444m6890R077j2268n1043l1245K0315P8830
14411e5100N6805J4478r613q5695J788K8525K2842m3417k1107M4312K1504k1389
14399d6067L1027Q6522J7848R4506J5228m8150j55615k8115n92P0536m1803o4145
14387f8820J0814L1271Q0603j315n3557L2864M2875L9468M6590k4402m0289M762
14375A00864K1192O2074N7148k3397o343m7662L495K9252j8847m6440j08739n5833
$$ plain form
14459 26883 7741 -24040 -44562 -92999 -40746 71038 22384 848 -14178 -27252 -25375 -83154
14447 -83154 -106342 -60377 -13324 61887 72297 63191 107977 167365 226178 211287 151477 33528
14435 33528 17616 -4271 35413 44369 -43645 -60829 7852 99450 57599 -31226 -106382 -17972
14423 -17972 46823 -44294 -95546 -91320 -21876 -68766 -59689 -71957 -123000 -154245 -133930 -55100
14411 -55100 1705 16183 6570 -79125 -77337 -48812 -25970 -69387 -90494 -46182 -24678 -46067
14399 -46067 -15040 71482 89330 183836 199064 150914 -4701 -32816 -33408 37128 -4675 -68820
14387 -68820 -58006 -26735 53868 52553 -1004 31860 74735 114203 160793 136391 96102 100864
14375 100864 122056 184130 241278 217881 211538 163876 167371 196623 177776 131336 22597 -33236
14363c3236K2378Q0267L1097q7561q8475M5377K5133J458n8877j00137j4541M8774
14351a28343O588n3055p8906J164J04756L0777k0567q2376J07553O2959P9399
14340B9949m7123o6069J18165P853k9066k9209l8879L4939M1864o4692M3601L7895
14328C9228j5617m0526q18O3887K588m5124o135K9845m3829l2659L7434l2946
14316d4672l2636k520L9200N1231j0579n3670k121o294M1973k4906M029J0117
14304c0848K4585m1361P3088K584k715M0691k3160K4759O1405P554o8004j15492
14292d6914M0108J1110n749m5690J2334j918k1682k1260l0735L103O9668J07487
14280F9862j6063m3855K1176K1877m5403n0827O393j0933L5638J8398P4889l3796
$$ plain form
14363 -33236 -10858 69409 100506 12945 -75530 -30153 -5020 -3562 -62439 -162576 -177117 -128343
14351 -128343 -121755 -174810 -253716 -252552 -147796 -117019 -137586 -219962 -112409 -49450 29949
14340 29949 -17174 -83243 34922 42775 13709 -15500 -54379 -19440 22424 -42268 1333 39228
14328 39228 23611 -16915 -17733 46154 48742 3618 -2517 27328 -16501 -49160 -11726 -44672
14316 -44672 -77308 -79828 -40628 10603 24 -53646 -55767 -62061 -20088 -44994 -40965 -30848
14304 -30848 -6263 -47624 25464 28048 25333 66024 42864 67623 129028 136582 68578 -46914
14292 -46914 -6806 4304 -1445 -47135 -34801 -36719 -58401 -79661 -110396 -107293 -37625 69862
14280 69862 53799 9944 31120 52997 7594 -43233 -36840 -47773 -12135 6263 81152 47356
14268D7356K1158k8404N5759J8660j3367q8539m066J8990l3860m7409l6212J08663
14256A8729L3464o2861m1286O0160K754J465N5278J3919J6910J0498m8185n6278
14244D567N1336m5246m3411k5089R0233L5265o7428K4409P6939L3534L322N7p0281
14231F8207k2795K965l8093m634n6338n205Q1566J09252p0923r7689j0798o105
14219e0590k555n6827K889O2131M0790l8367L8371j938p0822l8574Q0876J9353
14207a5263m3351L2007k1832k2513K1581n1860M1893N5631q935J1014k5761j18052
14195a45441J9721Q5550L9305K2582l1666n1931k92L1874l4612q020M0016J7342
14183a5572o3808k2371O8328Q2147K9507m8704O6137j9978o5424j0288j0601j4114
$$ plain form
14268 47356 68514 40110 95869 114529 101162 12623 8557 27547 -6313 -53722 -89934 18729
14256 18729 52193 -10668 -51954 8206 10960 12425 67703 81622 98532 109030 60845 4567
14244 4567 55903 10657 -32754 -57843 32390 67655 227 24636 101575 135109 138431 138488 68207
14231 68207 45412 48377 10284 5650 -50688 -55893 25673 134925 64002 -33687 -44485 -50590
14219 -50590 -53145 -109972 -107083 -44952 -4162 -42529 -4158 -6096 -76918 -115492 -34616 -15263
14207 -15263 -58614 -26607 -48439 -70952 -49371 -101231 -59338 -3707 -12642 -1628 -27389 -145441
14195 -145441 -125720 -40170 -865 21717 -9949 -61880 -62172 -30298 -64910 -72930 -32914 -15572
14183 -15572 -79380 -101751 -33423 48724 78231 29527 95664 75686 10262 -26 -10627 -24741
14171b4741K3748l816L202L2369J6926n4670l8890k1579O1094K8671n1427k5433
14159e4546M2148K089o2811n583N3029N5268O0476N0557P2771n4832j62719o0130
14147f4283j7590Q9953k2024j08671L5371L9876K9504N9063Q157p1469J625P21
14135a9767O0297J5377K8981k110Q170j1815p8835J2639K0984K3259O2258K4417
14123A43855k117j8483J3843p5489p5821j1774m7936M2912K2772l2370K0146l7006
14111e7468M5696M7984J202k1000j3126n1886k077k2557L1478J04390n1951j07033
14099i6348M1440J40855N0009o7786m3024p1446J3667Q5086k7984l001K5935K5104
14087G2507J3300M2999J523J2041l7941j07378Q6364o190n5972p7693K4110O6972
$$ plain form
14171 -24741 -993 -4809 -1607 30762 47688 -6982 -45872 -67451 -6357 22314 -29113 -54546
14159 -54546 -12398 -10309 -73120 -78703 -25674 29594 90070 140627 213398 158566 -4153 -64283
14147 -64283 -81873 8080 -13944 -122615 -87244 -47368 -17864 41199 49356 -22113 -20488 -19767
14135 -19767 40530 55907 84888 82778 90948 79133 298 12937 33921 57180 119438 143855
14123 143855 141738 123255 137098 61609 -14212 -25986 -73922 -31010 -8238 -40608 -20462 -57468
14111 -57468 -11772 36212 37414 16414 3288 -48598 -50675 -73232 -41754 62636 10685 -96348
14099 -96348 -54908 85947 135956 68170 25146 -46300 -32633 52453 24469 21468 47403 72507
14087 72507 85807 128806 130329 142370 104429 -2949 83415 77225 21253 -56440 -32330 34642
14075C4642P3409P2682j40890m2376Q9403L5626O8936k4546j8055r0260l9837
14064A8734p6202J4176K864N3446J4916m1193j1277o4672k4803L8016O9724m0986
14052d7257r8336p4681P6978M9288k4747M7762O3923k819K0856o991J581J0913
14040A6470O6910J093m3555l7614r762l4779l6965J171M7633N5174M8499j1077
14028F3198k9115l9072k0128J7841K1309N343j9858k5318O1662J4913l0430j9989
14016C56J025O5050L7492k665o010K9180j7961o2039l2791j6426n3439K343P2376
14003A6491L2001K6092n0160n9755l1190j4141L2827M9369K0064n9017l1391J12217
13991D3407N1024J1573R8402n2908k2179P237p6032O040O3680m6197j2887J6209
$$ plain form
14075 34642 108051 180733 39843 -2533 86870 122496 191432 166886 148831 58571 18734
14064 18734 -57468 -43292 -40428 13018 27934 -13259 -24536 -89208 -114011 -75995 -6271 -47257
14052 -47257 -145593 -220274 -143296 -94008 -118755 -70993 -7070 -9889 10967 3976 5557 16470
14040 16470 83380 84473 40918 3304 -6458 -41237 -78202 -77031 -29398 25776 74275 63198
14028 63198 34083 -4989 -25117 -7276 14033 19376 -482 -25800 35862 50775 20345 356
14016 356 1381 66431 103923 101258 95248 124428 106467 44428 11637 -4789 -58228 -55885 16491
14003 16491 48492 74584 24424 -35331 -66521 -80662 -47835 1534 21598 -37419 -68810 43407
13991 43407 94431 106004 204406 151498 129319 136556 60524 66564 130244 84047 71160 87369
13979H7369k7536q6874k543Q3884M3455m8207o3395j2845n7699m0455P3803J12760
13967F1717J08285M5772k8486p4763k2197n2916o7918P114J9909o7685L8574L2011
13955e83Q3604K8017m773j3183K153k4658j3710n8450O6156O2557p0757K4984
13943H1357n7054m4319j1486j2864L6783o0607j2840N6278n1621O6904N1693m859
13931C7365k2512P3347Q0627j8254k7294J5491m3325k9775J6017q5734L4597J3615
13919D4165l5202J8350J1487n3004P811k1087o2376J6273R227M419n0776J00324
13907a0389O0448j7388m6034r0740j9659R6453k1705Q342M1897K7259K7277M1420
13895I7181M0463n7059J4591l1756j61561k8205m9654p1261J54194J40173l449
$$ plain form
13979 87369 59833 -27041 -29584 54300 97755 49548 -13847 -26692 -84391 -124846 -51043 61717
13967 61717 170002 215774 187288 112525 90328 37412 -30506 -23392 -3483 -71168 -32594 -583
13955 -583 83021 111038 106265 93082 95235 70577 56867 -1583 64573 127130 56373 81357
13943 81357 24303 -20016 -31502 -44366 -7583 -68190 -81030 -24752 -76373 -9469 42224 37365
13931 37365 14853 88200 168827 150573 123279 138770 95445 65670 81687 -4047 30550 44165
13919 44165 8963 27313 38800 -14204 -6393 -27480 -89856 -73583 -64356 -59937 -110713 -10389
13907 -10389 50059 32671 -13363 -104103 -123762 -27309 -49014 -40672 1225 28484 55761 97181
13895 97181 137644 80585 95176 63420 -98141 -126346 -176000 -247261 -93067 47106 43657
13884D3657J6100J9101r692L9353j9461p3087k519J4679J6095P2152p113j5653
13872I3612l1302q0102m1087J5335m5731N401N8382Q5638M5650j3975K0002J0050
13860A21873j0947m8646q485k3506l9392l5809k8735N662j8863L1834J13876M7360
13848A06222l8418j5198J8586M282l9394q9798J4825J0753K2799R9385n7410n4356
13836a7722L9865N9574l4506k4229q9414n3660P3219K8522N6586J5295l4434K2853
13824D1949l0015k0277m1953q3427L041J20205M4987M031r979k2179L2359K1054
13812E9796m5113P642O6703P4557N876j09454q1842o42q4481o8730k4808R2955
13800a07541O9340K2002q226k4190o3417J390K0735m279J6424M2285P0063p44
$$ plain form
13884 43657 59757 78858 69166 108519 89058 15971 13452 28131 44226 116378 109265 93612
13872 93612 62310 -17792 -58879 -43544 -89275 -83874 -25492 60146 105796 91821 111823 121873
13860 121873 110926 62280 53795 30289 -9103 -44912 -73647 -67985 -86848 -55014 58862 106222
13848 106222 67804 52606 71192 75474 36080 -53718 -38893 -28140 -5341 94044 36634 -17722
13836 -17722 22143 81717 47211 22982 -66432 -120092 -46873 -18351 38235 53530 19096 41949
13824 41949 11934 -8343 -50296 -133723 -130682 -10477 34510 38541 28562 6383 38742 59796
13812 59796 14683 22325 89028 163585 169461 60007 -21835 -22477 -106958 -175688 -200496 -107541
13800 -107541 -38201 -16199 -24425 -48615 -112032 -110642 -89907 -94186 -77762 -35477 34586 33842
13788C3842l3167J7309Q2169l6228k274j1211l3501P1393M2888j16833r9688J5908
13776f9393p780Q642K7920J16483J33884m2535j6422K770q4815r2358j10812M9637
13764h4779N4774J18487p216l9133l0574Q5692j0108j5979o2981o6663k2513o1985
13752a42978r1732P879J0861N2113J714L1564P0803M0523j19447j2738N7358Q8707
13740e373O460q2416L6228M7347O1162J3710j3057l3530n6947J0195K192J5670
13728A641J9507j7462j7760l6323p4901K9637J06727L5963J7232n3609K1665J5615
13716D7932l15n4384n454O8428l5279j1971N403N1356k8732n4478M446M2986J8092
13703D8030m4915m1425L2912P8107K5307k0189P8619l2381m0282k4050N873Q67
$$ plain form
13788 33842 675 17984 100153 63925 61651 50440 16939 88332 131220 14387 -85301 -69393
13776 -69393 -77173 -68531 -40611 75872 209756 167221 150799 153569 68754 -23604 -134416 -84779
13764 -84779 -30005 88482 81266 42133 11559 97251 87143 71164 8183 -58480 -80993 -142978
13752 -142978 -234710 -226831 -215970 -163857 -162143 -130579 -59776 -19253 -138700 -151438 -94080 -5373
13740 -5373 1087 -81329 -45101 2246 63408 77118 64061 30531 -26416 -16221 -14029 1641
13728 1641 21148 3686 -14074 -50397 -125298 -95661 11066 47029 64261 10652 32317 47932
13716 47932 47617 -6767 -12221 56207 20928 8957 14360 65716 36984 -17494 -13048 29938 48030
13703 48030 3115 -38310 -5398 72709 98016 77827 156446 124065 83783 59733 65606 66473
13691F6473J9604N9443m2728l2296l0455n7293q4387L861L2819o230M9942J27267
13679A06020N5713p211o6221q5076l5982J3350J4977J6253l3277M5747m814l5186
13667a5707p3747l9908J62584Q3691j7704q3044K6157K7402q9636n6207j5718
13656i1837K1527o9538K4437N8845L4922Q1543j4560j16119k5502j706p9199J05591
13644g1596R4317O0055o8750j10888k8011J833L9282J2208N4524k092J037M332
13632a3749o7518k6089M8608Q6237N7151K1078L0052q341r0028o3833L7455M2524
13620E3547K9966j21623n1159N8608M9471l9337M46r072r0455j8511L1519N6588
13608e0012J05913j2788K0961m5620k04m977L652L1201J8891n7982k9937L0430
$$ plain form
13691 66473 86077 145520 102792 70496 40041 -17252 -101639 -97778 -64959 -71189 -21247 106020
13679 106020 161733 154522 88301 3225 -32757 -19407 -4430 11823 -21454 24293 19479 -15707
13667 -15707 -89454 -129362 33222 116913 99209 16165 42322 69724 -19912 -76119 -91837
13656 -91837 -70310 -139848 -115411 -56566 -21644 59899 45339 -70780 -96282 -97988 -177187 -71596
13644 -71596 22721 82776 14026 -96862 -124873 -123040 -83758 -71550 -17026 -19118 -18081 -13749
13632 -13749 -81267 -107356 -58748 27489 84640 105718 135770 127429 37401 -26432 11023 53547
13620 53547 83513 -38110 -89269 -30661 18810 -20527 -20081 -29153 -119608 -138119 -106600 -50012
13608 -50012 55901 43113 64074 18454 18250 13273 16925 48126 67017 9035 -20902 9528
13596I528p787N8958l626j18978M762o0983k6386M7072Q876m995m4696j4533Q9602
13583f3186N8317o0344k4519k6008m1687j0196L3955O7603L9262j0015q2428J758
13571a17488n162Q5544M6093r9227M6919n118J7451R4721N8295N807k4289j33080
13559b9534l2894M6662O060R0386k2347l7688k5187O728n4488j08176p043J1332
13547a56189K8188P4733k588j9008J7851L5508J2534n169M3889O6310O6376m7914
13535A14521J740m1467j4072q289j4767m1563n5416k9627n3161P8892O9714N9060
13523F5565L1107k8131K1084j05p67l4681o698K7911m7868l3117l1228J3971N7203
13510C4246l0129J4947K254k833k1861j9315M5752j2656q2256j1625J20030M7051
$$ plain form
13596 9528 1741 60699 57073 -61905 -57143 -118126 -144512 -97440 -88564 -93559 -138255 -152788 -63186
13583 -63186 -4869 -65213 -89732 -115740 -157427 -167623 -133668 -66065 -26803 -36818 -119246 -117488
13571 -117488 -122650 -37106 8987 -90240 -43321 -48439 -30988 63733 122028 127835 103546 -29534
13559 -29534 -62428 -15766 -9706 80680 58333 20645 -4542 2186 -52302 -160478 -167521 -156189
13547 -156189 -128001 -53268 -55856 -74864 -57013 -21505 -8971 -14140 29749 96059 162435 114521
13535 114521 116261 74794 60722 52433 37666 -3897 -59313 -88940 -142101 -63209 6505 65565
13523 65565 96672 68541 89625 89520 88753 54072 47374 75285 27417 -5700 -36928 -22957 34246
13510 34246 4117 19064 21318 18485 -3376 -22691 23061 10405 -71851 -83476 36554 83605
13498H3605m2898m3843j09955o0055Q3331R557j4538P3239N7803J6746J3460N117
13486G1569R949R34o0885p479K4977P1484k8033K2149r3571k4113K4348J861k0168
13473f978N6929Q176k9766o9717k2860m1356q9221n2923M9640P9700K2057J6732
13461g9587O1388K4169M8376Q492K4029m551l6439n9631n7582m6842j08044k8527
13449b54749O5479J43451N7184j28436k8496j630P2284l5519j1689N7419m127
13438f8829J2110N857P1687J3924j3992m9065M7385M1345R097j0388k661Q0233
13426A36703K767l6003o1151M005P227K8075k4771k4313p0107r5910J9375J28826
13414A4723L1927n4786r5826J2674P3690N2891j04213o6392N0355P3010M5091
$$ plain form
13498 83605 40707 -3136 -113091 -173146 -89815 -80258 -94796 -21557 36246 52992 66452 71569
13486 71569 81518 82452 21567 14088 39065 110549 82516 104665 11094 -13019 11329 13190 -6978
13473 -6978 49951 58127 28361 -41356 -64216 -105572 -194793 -247716 -198076 -118376 -96319 -79587
13461 -79587 -18199 5970 54346 62838 86867 82316 45877 -13754 -71336 -118178 -226222 -254749
13449 -254749 -189270 -45819 11365 -117071 -145567 -147197 -74913 -110432 -122121 -64702 -68829
13438 -68829 -56719 -50862 20825 34749 20757 -28308 19077 60422 69519 59131 56470 136703
13426 136703 139470 103467 42316 46321 53548 81623 56852 32539 -37568 -133478 -114103 14723
13414 14723 46650 -8136 -103962 -91288 -17598 35293 -68920 -135312 -84957 -11947 33144
13403C3144l3814n6482K0972m5261M1915M7345N4016j7737l652K895j6548P2984
13391I9777J9663j1606m351k9548p820q5699k5801K1184m9371M2999O9396n30
13379C8293p2968l0504O949k4626J7742N4270J9787q815j1232o573Q1845K2858
13367H7026l4212J6704l2548r9889M3955l9729K5460l9937n7587R3703M7660p496
13355C110l876J2780P9242o4755q6495L5037j9157J938j048N0520P1379r7630
13343a8955q5090J7909N1370J8347J4490M5371l5390j4241m0292p2816L7756M2417
13331c9124p268l234L372N981l4329R6496K6575K605N5051k9967k8694J1546L4650
13318I3660o0257j02846P2280j537n996M4193J7253l1019O2376k823o5004K5742
$$ plain form
13403 33144 -670 -57152 -36180 -81441 -39526 7819 61835 44098 40446 43341 26793 99777
13391 99777 119440 107834 103483 73935 66115 -19584 -45385 -24201 -73572 -30573 38823 38293
13379 38293 -34675 -65179 -58230 -82856 -65114 -10844 8943 128 -11104 -17677 64168 87026
13367 87026 52814 69518 36970 -62919 -18964 -58693 -33233 -73170 -130757 -37054 10606 3110
13355 3110 -766 12014 91256 26501 -59994 -24957 -44114 -42176 -43224 7296 78675 -18955
13343 -18955 -104045 -86136 -34766 -16419 -1929 43442 8052 -6189 -46481 -119297 -81541 -39124
13331 -39124 -46392 -49626 -46254 -40273 -74602 21894 48469 51074 106125 76158 47464 59010 93660
13318 93660 33403 -69443 2837 1300 -4696 39497 56750 25731 88107 85284 20280 46022
13306D6022N8319l9182p0760M3617P851m49j2960n0050K0192J29309K4449r840
13294A46518n4573n3441k9343Q0421J6365o9290j6240K7294R7739r929n0813j669
13282H3039L8469M6129K4177n6169r5571o598K988m269O6329m9305j6058m6011
13270a2850J25177j5590k0119O2354k5452k2243k0853J13344l1425o5692M8435
13259A35086O870q5748p9528L2906j4807O9980l2294q2777L6896J7315m7651q0808
13247a24560N5952j5035m5599J31195M5797l4324n5667J1007n6243l7695k1398
13236a46570R5556o565O6270J14157N9243k5907j32507q956O4873O7606N298j20752
13224C1746j10623N4796Q224l7268M9232J49504O1210p4358j10279j22121k1846
$$ plain form
13306 46022 104341 65159 -5601 38016 45867 45418 32458 -17592 2600 131909 156358 146518
13294 146518 91945 38504 9161 89582 105947 36657 20417 47711 145450 135521 84708 83039
13282 83039 121508 167637 191814 135645 40074 33476 36464 32195 98524 49219 33161 -12850
13270 -12850 112327 96737 76618 138972 113520 91277 70424 183768 152343 86651 135086
13259 135086 141956 56208 -23320 9586 -5221 64759 32465 -50312 -13416 3899 -43752 -124560
13247 -124560 -68608 -83643 -129242 1953 47750 13426 -42241 -31234 -87477 -125172 -146570
13236 -146570 -51014 -57579 8691 122848 182091 156184 23677 14721 79594 147200 152498 31746
13224 31746 -78877 -24081 -15857 -53125 -3893 145611 206821 132463 22184 -99937 -121783
13213a21783n6435m2799P7966Q3997k2707Q9893P7009l8147j28703J1756M720
13202f5233n2875L130j9304O2925J3416J27321j9611m7509m0551k3475N6756J16005
13190A10995O0423p2801j46761m1737R2106k838m1444L8961Q7427j09448p8363
13179a03480Q7910P3867L4086j0290q924n3565j6318m3608q066J1822P3072j8876
13167A7630N5566m1109J6240m234m1480N9793O6141n1523o8323Q2068m7495n0696
13155g422J3242M9806K3810L717k6148J6852n984j9061m6668r5000M8942M575
13143c9339K326j9355j3035O5647N9832l9245L9141r413o7201J6887L6297k6728
13131E814k2406l5529M4882L3344P0883O5434K596l2935l296J0156j2924j02279
$$ plain form
13213 -121783 -178218 -221017 -143051 -59054 -81761 8132 85141 46994 -81709 -69953 -65233
13202 -65233 -118108 -114978 -134282 -71357 -57941 69380 49769 2260 -38291 -61766 -5010 110995
13190 110995 171418 98617 -48144 -89881 2225 -613 -42057 -3096 84331 -25117 -103480
13179 -103480 -15570 58297 92383 82093 73169 19604 3286 -40322 -48388 -36566 36506 17630
13167 17630 73196 32087 48327 44093 2613 62406 128547 77024 8701 90769 43274 -7422
13155 -7422 5820 55626 79436 83153 57005 73857 67873 48812 2144 -92856 -43914 -39339
13143 -39339 -37013 -56368 -69403 -3756 56076 16831 55972 46559 -20642 -3755 32542 5814
13131 5814 -16592 -52121 -7239 26105 96988 162422 165018 132083 128787 138943 126019 23740
13119B3740J8463n62j3298Q5897r360m3531n3034m205J5402l5287M9362o8781
13107c5194r4791M333l9664l7431n421K5773R402N7747L7887P8029m972P1120
13095F6818M4915q450j4095o1363j0947n073l2812l6042J0551N2745K5020L6585
13083F7852o3868p1885r062j57824J11993R5405m674P5236r998k232m7439J699
13071a4797l1687L3297R1289n501q034J4861m5480l2624o3995j1086O4552j4412
13059b3617k0847m3193O5841J9993j6052m1139O2119K6584k0672m9208k4370j06037
13047a70598m386P2335M1228M7998j6823j1509J3294K8873M3371L9378p4654n0079
13035d1572O016O0772K3751M512M4540L577j24680l8190K7711M8725K3813L9869
$$ plain form
13119 23740 42203 41641 28343 114240 104880 61349 8315 4110 19512 -15775 33587 -35194
13107 -35194 -129985 -125652 -165316 -202747 -208168 -182395 -172993 -115246 -77359 670 -4302 66818
13095 66818 111733 103283 89188 27825 16878 11805 -21007 -57049 -46498 6247 31267 67852
13083 67852 3984 -67901 -76963 -234787 -122794 -27389 -32063 43173 33175 30943 -16496 -14797
13071 -14797 -46484 -13187 78102 72601 64567 79428 33948 1324 -62671 -73757 -9205 -23617
13059 -23617 -44464 -87657 -21816 -1823 -17875 -59014 3105 29689 9017 -40191 -64561 -170598
13047 -170598 -174984 -102649 -61421 -13423 -30246 -41755 -28461 412 43783 83161 8507 -41572
13035 -41572 -35556 25216 48967 53479 98019 101596 -23084 -61274 -33563 15162 38975 78844
13023G8844q3527K2699K5242j7557J1666m5866K628l5953m8627Q783o687P0243
13011a8112M6089M236K7637j2976l3774J6545K2848P5482m9198p7598l4399M3312
12999A0092O229k4674j5234J6293M4972L6433J9186n927r018m6092n1241j7618
12987c6599K5954o158Q1330n1300j04200N2423R0113J5782p550k8858k0651M785
12975A5071j9717O9579O554l931j16724n5693J05463R940n5612k2997J2904M9326
12963e837L7572k3409j2341o2235M1974N3939j5328p1266J4829J4602m2223M9706
12951b0017k1115k0157L3901J49201k7282j05004J9537Q7911J2451o5582o438
12940C7406O2675K1962l8959m7042k5715L5160L1229p7068N531n8393L362O5774
$$ plain form
13023 78844 -4683 18016 43258 25701 37367 -8499 -5871 -41824 -90451 -81668 -88355 -18112
13011 -18112 27977 32213 59850 46874 13100 29645 52493 127975 78777 1179 -33220 10092
12999 10092 16321 -8353 -23587 -7294 37678 74111 93297 87370 78352 32260 -18981 -36599
12987 -36599 -10645 -16803 64527 13227 -90973 -38550 51563 67345 59795 30937 10286 15071
12975 15071 -4646 64933 71487 67556 -49168 -104861 602 10542 -45070 -68067 -55163 -5837
12963 -5837 31735 8326 -4015 -66250 -24276 29663 14335 -56931 -42102 -27500 -69723 -20017
12951 -20017 -41132 -61289 -27388 121813 94531 -10473 9064 96975 109426 43844 37406
12940 37406 100081 122043 83084 36042 10327 45487 76716 -352 5179 -53214 -49852 15922
12928A5922m3551R825N3689O3543K5604O9440L3276p8636j20857q0263N7134m7240
$$ plain form
12928 15922 -27629 -17804 35885 99428 125032 194472 227748 149112 28255 -52008 5126 -42114
$$ [...]
##END NTUPLES=NMR SPECTRUM
##END=
