##TITLE=Analysis number 325598
Compound Code cc 52246
Book Reference 467/110/2
Project Code adrs
Chemist Name benw
##JCAMPDX= 6.0         $$ Bruker NMR JCAMP-DX V2.0
##DATA TYPE= NMR SPECTRUM
##DATA CLASS= NTUPLES
##ORIGIN= Bruker BioSpin GmbH
##OWNER= nmr
$$ XWIN-NMR		Version 3.5
$$ Mon Jan  8 11:36:44 2007 GMT Standard Time (UT+0h)  MAYBRIDGE\nmr@NMR_250MHZ
##.OBSERVE FREQUENCY= 250.131544655141
##.OBSERVE NUCLEUS= ^1H
##.ACQUISITION MODE= SIMULTANEOUS (DQD)
##.ACQUISITION SCHEME= undefined
##.AVERAGES= 16
##.DIGITISER RES= 18
##SPECTROMETER/DATA SYSTEM= dpx250
##.PULSE SEQUENCE= zg30
##.SOLVENT NAME= CDCl3
##.SHIFT REFERENCE= (INTERNAL, CDCl3, 0, 16.5215)
##AUDIT TRAIL= $$ (NUMBER, WHEN, WHO, WHERE, WHAT)
$$ ##TITLE= Audit trail, XWIN-NMR		Version 3.5
$$ ##JCAMPDX= 5.01
$$ ##ORIGIN= Bruker BioSpin GmbH
$$ ##OWNER= nmr
$$ C:\u/data/dgb/nmr/ADRS/740/pdata/1/auditp.txt
$$ ##AUDIT TRAIL=  $$ (NUMBER, WHEN, WHO, WHERE, WHAT)
(   1,<2007-01-08 11:36:24.42 +000>,<MAYBRIDGE\nmr>,<NMR_250MHZ>,
      <created by zg, POWCHK disabled, PULCHK disabled
       configuration hash MD5:
       49 4B E0 1D 92 C2 6B 37 9F E6 65 BC 52 41 86 1D
       data hash MD5: 64K
       4C 82 8F 39 D5 D8 BD D0 FE AC EF AB C8 D8 70 9C>)
(   2,<2007-01-08 11:36:36.49 +000>,<MAYBRIDGE\nmr>,<NMR_250MHZ>,
      <Start of raw data processing
       ef LB = 0.3 FT_mod = 6 PKNL = 1 SI = 32K 
       data hash MD5: 32K
       EF C8 37 2C C8 E7 E8 9A B5 42 79 0C 8E E2 92 6B>)
(   3,<2007-01-08 11:36:38.17 +000>,<MAYBRIDGE\nmr>,<NMR_250MHZ>,
      <apk 
       data hash MD5: 32K
       C9 60 33 AB F3 31 8A B0 BF C7 74 8C EC B3 61 FD>)
(   4,<2007-01-08 11:36:38.94 +000>,<MAYBRIDGE\nmr>,<NMR_250MHZ>,
      <abs ABSG = 5 
       data hash MD5: 32K
       21 DB AD C9 70 43 6A 3C 21 2A CE 73 1D 3C 68 DC>)
$$ ##END=
$$ 
$$ hash MD5
$$ 2C D2 98 E2 40 E8 B3 AB 6C 4B D9 96 CE 1C 24 C0
##$RELAX= 
##$RELAX= 
##$RELAX= 
##$RELAX= 
##$RELAX= 
##$RELAX= 
##$RELAX= 
$$ Bruker specific parameters
$$ --------------------------
##$DU= <C:\u>
##$EXPNO= 740
##$NAME= <ADRS>
##$PROCNO= 1
##$TYPE= <nmr>
##$USER= <dgb>
##$AMP= (0..31)
100 100 100 100 100 100 100 100 100 100 100 100 100 100 100 100 100 100 
100 100 100 100 100 100 100 100 100 100 100 100 100 100 
##$AQSEQ= 0
##$AQ_mod= 3
##$AUNM= <au_zg>
##$AUTOPOS= <17 >
##$BF1= 250.13
##$BF2= 250.13
##$BF3= 250.13
##$BF4= 250.13
##$BF5= 500.13
##$BF6= 500.13
##$BF7= 500.13
##$BF8= 500.13
##$BYTORDA= 1
##$CFDGTYP= 0
##$CFRGTYP= 5
##$CHEMSTR= <none>
##$CNST= (0..31)
1 1 145 1 1 1 1 1 1 1 1 1 1 1 1 1 1 1 1 1 1 1 1 1 1 1 1 1 1 1 1 1 
##$CPDPRG= <>
##$CPDPRG1= <>
##$CPDPRG2= <>
##$CPDPRG3= <>
##$CPDPRG4= <mlev>
##$CPDPRG5= <mlev>
##$CPDPRG6= <mlev>
##$CPDPRG7= <mlev>
##$CPDPRG8= <mlev>
##$CPDPRGB= <>
##$CPDPRGT= <>
##$D= (0..31)
0 1 0 0 0 0 0 0 0 0.06 0 0 0 0 0 0 0.0002 0 0 0 0 0 0 0 0 0 0 0 0 0 0 
0 
##$DATE= 1168256183
##$DBL= (0..7)
120 120 120 120 120 120 120 120 
##$DBP= (0..7)
150 150 150 150 150 150 150 150 
##$DBP07= 0
##$DBPNAM0= <>
##$DBPNAM1= <>
$$ [...]
##$SUBNAM7= <"">
##$SUBNAM8= <"">
##$SUBNAM9= <"">
##$SW= 20.6930455092707
##$SWIBOX= (0..15)
0 0 3 0 0 0 0 0 0 0 0 0 0 0 0 0 
##$SW_h= 5175.983436853
##$TD= 65536
##$TD0= 1
##$TE= 294.16
##$TE2= 300
##$TE3= 300
##$TEG= 300
##$TL= (0..7)
0 120 120 120 120 120 120 120 
##$TP= (0..7)
150 150 150 150 150 150 150 150 
##$TP07= 0
##$TPNAME0= <>
##$TPNAME1= <>
##$TPNAME2= <>
##$TPNAME3= <>
##$TPNAME4= <>
##$TPNAME5= <>
##$TPNAME6= <>
##$TPNAME7= <>
##$TPOAL= (0..7)
0.5 0.5 0.5 0.5 0.5 0.5 0.5 0.5 
##$TPOFFS= (0..7)
0 0 0 0 0 0 0 0 
##$TUNHIN= 0
##$TUNHOUT= 0
##$TUNXOUT= 0
##$USERA1= <user>
##$USERA2= <user>
##$USERA3= <user>
##$USERA4= <user>
##$USERA5= <user>
##$V9= 5
##$VALIST= <valist>
##$VCLIST= <CCCCCCCCCCCCCCC>
##$VD= 0
##$VDLIST= <DDDDDDDDDDDDDDD>
##$VPLIST= <PPPPPPPPPPPPPPP>
##$VTLIST= <TTTTTTTTTTTTTTT>
##$WBST= 1024
##$WBSW= 4
##$XGAIN= (0..3)
0 0 0 0 
##$XL= 0
##$YL= 0
##$YMAX_a= 295677
##$YMIN_a= -410314
##$ZGOPTNS= <>
##$ZL1= 120
##$ZL2= 120
##$ZL3= 120
##$ZL4= 120
##$ABSF1= 16.5215
##$ABSF2= -4.171673
##$ABSG= 5
##$ABSL= 3
##$ALPHA= 0
##$AQORDER= 0
##$ASSFAC= 0
##$ASSFACI= 0
##$ASSFACX= 0
##$ASSWID= 0
##$AUNMP= <proc_1d>
##$AZFE= 0.1
##$AZFW= 0.1
##$BCFW= 0
##$BC_mod= 0
##$BYTORDP= 0
##$COROFFS= 0
##$CY= 12.5
##$DATMOD= 1
##$DC= 0
##$DFILT= <>
##$DTYPP= 0
##$F1P= 14.0000005364418
##$F2P= -0.99999901652339
##$FCOR= 0.5
##$FTSIZE= 32768
##$FT_mod= 6
##$GAMMA= 0
##$GB= 0
##$INTBC= 1
##$INTSCL= 1
##$ISEN= 128
##$LB= 0.3
##$LEV0= 0
##$LPBIN= 0
##$MAXI= 10000
##$MC2= 0
##$MEAN= 0
##$ME_mod= 0
##$MI= 0
##$NCOEF= 0
##$NC_proc= -3
##$NLEV= 6
##$NOISF1= 0
##$NOISF2= 0
##$NSP= 0
##$NTH_PI= 0
##$NZP= 0
##$OFFSET= 16.5215
##$PC= 1
##$PHC0= 224.4426
##$PHC1= 7.509977
##$PH_mod= 1
##$PKNL= yes
##$PPARMOD= 0
##$PSCAL= 4
##$PSIGN= 0
##$REVERSE= no
##$SF= 250.130000124063
##$SI= 32768
##$SIGF1= 0
##$SIGF2= 0
##$SINO= 400
##$SIOLD= 32768
##$SREGLST= <1H.CDCl3>
##$SSB= 0
##$STSI= 32768
##$STSR= 0
##$SW_p= 5175.98343685301
##$SYMM= 0
##$S_DEV= 0
##$TDeff= 65536
##$TDoff= 0
##$TI= <Analysis number 999999
Compound Code 99
Book Reference 9
Project Code 9>
##$TILT= no
##$TM1= 0
##$TM2= 0
##$TOPLEV= 0
##$USERP1= <user>
##$USERP2= <user>
##$USERP3= <user>
##$USERP4= <user>
##$USERP5= <user>
##$WDW= 1
##$XDIM= 32768
##$YMAX_p= 329153530
##$YMIN_p= -257934
$$ End of Bruker specific parameters
$$ ---------------------------------
##NTUPLES= NMR SPECTRUM
##VAR_NAME=  FREQUENCY,     SPECTRUM/REAL,   SPECTRUM/IMAG
##SYMBOL=    X,             R,               I
##VAR_TYPE=  INDEPENDENT,   DEPENDENT,       DEPENDENT
##VAR_FORM=  AFFN,          ASDF,            ASDF
##VAR_DIM=   32768,         32768,           32768
##UNITS=     HZ,            ARBITRARY UNITS, ARBITRARY UNITS
##FACTOR=    0.157963299565203, 1,           1
##FIRST=     4132.52270544937, 0,            0
##LAST=      -1043.46073140364, 0,           0
##MIN=       -1043.46073140364, -257934,     0
##MAX=       4132.52270544937, 329153530,    0
$$ Real data points
##PAGE= N=1
##DATA TABLE= (X++(R..R)), XYDATA
$$ [...]
##PAGE= N=2
##DATA TABLE= (X++(I..I)), XYDATA
18306 4573572 4594977 4625628 4631419 4656093 4688129 4706972 4714993 4735664 4769279 4812116 4806827 4797323
18294 4797323 4822714 4856456 4897072 4915347 4937765 4976513 5021921 5055330 5072760 5077150 5097180
18283 5097180 5126122 5145795 5141543 5176094 5213653 5252961 5280433 5306798 5337251 5389362 5440446
18272 5440446 5473544 5491995 5533058 5582102 5595832 5600767 5576805 5544573 5501476 5463889 5443191
18261 5443191 5461466 5494278 5533956 5574362 5614563 5638375 5607790 5578025 5546333 5493957 5457999
18250 5457999 5410448 5413013 5448374 5479529 5524108 5588900 5658315 5696773 5750634 5805232 5850606
18239 5850606 5882874 5949996 6004931 6061995 6123629 6193909 6255576 6314628 6350279 6398123 6457399
18228 6457399 6526619 6574130 6638685 6711775 6773409 6817417 6862335 6931652 6969942 6950918 6911686
18217 6911686 6863246 6832409 6827782 6872043 6942065 7009081 7059622 7128946 7207605 7247360 7227660
18206 7227660 7199553 7147397 7126456 7149262 7207296 7265452 7332500 7426404 7499208 7555736 7647181
18195 7647181 7751991 7835244 7924925 8024391 8132430 8233850 8335764 8437608 8545455 8632902
18185 8632902 8745530 8853881 8956137 9053590 9164098 9298870 9429900 9568633 9714489 9871456
18175 9871456 10041644 10183222 10316604 10461800 10621949 10795674 10935960 11105055 11268490
18166 11268490 11438306 11636744 11858160 12119791 12348170 12614981 12924899 13230560 13535246
18157 13535246 13889110 14245285 14618016 15055860 15548281 16123946 16805430 17598566 18497775
18148 18497775 19538942 20696919 21772535 22512616 22885027 22900127 22212570 20608344 18629021
18139 18629021 16780943 14864646 13505159 13276966 13757670 14291972 14668639 14948588 14807765
18130 14807765 13440117 10884348 8248820 5652528 3190676 1766618 1413055 1700943
18122 1700943 2590145 4088836 5918197 7861624 9890078 12020785 14263365 16721708
18114 16721708 19669527 23347290 27940513 33265275 36708574 28133312 1472092 -17634401
18106 -17634401 -18929637 -14289564 -9463505 -5376090 -1862376 1241290 4007056 6258856
18098 6258856 7874541 8972221 9387667 8559173 6912875 5349522 3605099 1909047
18090 1909047 1364256 1946706 2801775 3498028 4120314 4531358 3872728 1524648 -1506235
18081 -1506235 -4349948 -7320503 -9632306 -10431436 -10102425 -9281536 -8272940 -7620047 -7889944
18072 -7889944 -9256801 -10877510 -11726855 -11607100 -10642667 -9178345 -7534662 -5982897 -4732999
18063 -4732999 -4132083 -4403254 -5605362 -7432658 -8932433 -9609506 -9556824 -8976844 -8142284
18054 -8142284 -7240013 -6431143 -5693512 -5003067 -4359775 -3750438 -3169571 -2627951 -2116831
18045 -2116831 -1642557 -1166347 -665964 -159160 386825 941686 1509279 2141560 2791263
18036 2791263 3505458 4237117 5096142 6044145 7154603 8442886 9913633 11456589 12777844
18027 12777844 13313468 12714218 10725294 7636531 4553075 1801911 -886477 -3386652
18019 -3386652 -4929481 -5179774 -4430866 -3198065 -2244257 -2084717 -3030119 -4772148 -6747254
18010 -6747254 -8951948 -11485370 -13661650 -14762475 -14910614 -14254940 -13153715 -11972151
18002 -11972151 -10897027 -9950508 -9096674 -8363712 -7742101 -7136774 -6559100 -6065926 -5636191
17993 -5636191 -5246497 -4820123 -4407473 -3976520 -3485026 -2985565 -2439614 -1875036 -1263234
17984 -1263234 -669581 -91061 575842 1383505 2330950 3434167 4655869 5703900 6017938
17975 6017938 5068893 2620976 -1298162 -5213614 -7663581 -8572230 -8157934 -6931742 -5394446
17966 -5394446 -3895772 -2867131 -2746897 -3804640 -6201617 -9420049 -12051113 -13519527
17958 -13519527 -13883198 -13398862 -12554382 -11657818 -10836652 -10147163 -9538050 -9000261 -8586715
17949 -8586715 -8214296 -7919876 -7698683 -7483651 -7239027 -7014010 -6792835 -6548746 -6343416
17940 -6343416 -6161534 -5963256 -5765869 -5580809 -5399040 -5261344 -5143708 -5045626 -4956935 -4879037
17930 -4879037 -4775929 -4646522 -4538369 -4444495 -4331768 -4215851 -4114961 -4018557 -3942157 -3866985
17920 -3866985 -3768739 -3687489 -3633185 -3562940 -3481797 -3421418 -3351790 -3266976 -3191266 -3132095 -3091681
17909 -3091681 -3023483 -2974726 -2916073 -2854325 -2800235 -2735757 -2687585 -2644547 -2611208 -2533104 -2470297
17898 -2470297 -2434155 -2384131 -2355316 -2331315 -2281635 -2235684 -2215443 -2171736 -2110921 -2060313 -2009764
17887 -2009764 -1957067 -1910197 -1886218 -1839637 -1817446 -1813613 -1762137 -1713812 -1682758 -1649055 -1613267
17876 -1613267 -1569352 -1523586 -1508777 -1487060 -1429185 -1391323 -1352515 -1325684 -1312612 -1289763 -1263467
17865 -1263467 -1230930 -1201617 -1164391 -1117946 -1081575 -1081016 -1076410 -1061810 -1006457 -956153 -907886 -893273
17853 -893273 -874937 -843245 -826393 -810695 -774876 -735865 -710071 -717026 -697643 -690610 -666390 -614914
17841 -614914 -589484 -567057 -557844 -538166 -516162 -477522 -452235 -451252 -447037 -403592 -353169 -321159
17829 -321159 -298502 -280023 -264683 -227787 -197390 -181528 -172893 -136022 -150776 -151110 -120014 -79843
17817 -79843 -30127 18663 48790 42114 61567 83893 93126 107772 120671 136543 174749 177184
17805 177184 210205 271134 277470 289459 317774 345228 370546 395265 411869 435857 457311 473579
17793 473579 504956 548773 577272 567009 586248 608097 619229 658095 691261 707575 728933
17782 728933 747138 758295 772538 785196 829531 893859 911076 910114 925620 972226 1004357 1004510
17770 1004510 1019357 1082044 1129167 1137084 1146514 1176984 1193525 1194911 1196186 1247686 1302652 1347012
17758 1347012 1386345 1380903 1312440 1259947 1289111 1339540 1376752 1387114 1288716 1214354 1231044
17747 1231044 1272452 1324980 1343417 1363148 1413470 1449739 1482464 1519725 1552932 1579438 1628830
17736 1628830 1682090 1700675 1732946 1779973 1798351 1807416 1853646 1916410 1937672 1959623 1985540
17725 1985540 2027986 2066619 2101999 2140310 2140005 2215846 2252694 2289773 2340128 2380926 2421109 2504034
17713 2504034 2574771 2616315 2689231 2726178 2712963 2636114 2579469 2578148 2646092 2712083 2707267 2581065
17701 2581065 2405874 2383457 2430433 2502468 2574493 2659797 2737452 2799701 2861237 2940696 3014595
17690 3014595 3073438 3137784 3234871 3327516 3395515 3407972 3416250 3448771 3443705 3418816 3390878 3371008
17678 3371008 3361983 3371599 3383828 3384579 3434123 3481493 3543840 3597154 3685277 3767230 3834365 3910290
17666 3910290 3984125 4059395 4149685 4240414 4322167 4395438 4403421 4397155 4474565 4562809 4650734 4703958
17654 4703958 4710117 4713557 4781371 4893785 5012034 5123945 5237346 5348796 5466319 5634783
17644 5634783 5790896 5938261 6085771 6236554 6383449 6538919 6665797 6757134 6814013 6897908
17634 6897908 7052380 7217878 7370970 7489424 7579110 7680538 7786688 7949977 8211398 8486881
17624 8486881 8790842 9154783 9544889 9972661 10534431 11194675 11973793 12894455 13969709
17615 13969709 15205040 16503169 17455040 17298723 15380231 11911384 8694605 7201260
17607 7201260 7403126 8222402 8078794 5807565 1388522 -3200985 -5937576 -6520981 -5684180
17598 -5684180 -4348862 -3032741 -1842535 -773324 158256 930484 1585302 2101538 2523005
17589 2523005 2927907 3365220 3813762 4232055 4573750 4893805 5190748 5520269 5860701
17580 5860701 6243607 6752287 7353962 8015957 8759361 9605390 10518726 11524004 12660754
17571 12660754 13948993 15453657 17222687 19224508 21186929 22386622 21774607 18496666
17563 18496666 13268780 8497689 6233061 6376817 7146557 6148617 1724588 -5517751
17555 -5517751 -12406903 -16253058 -16831214 -15401446 -13350851 -11378065 -9624205 -8056752
17547 -8056752 -6698911 -5435421 -4317595 -3382739 -2557828 -1814678 -1089064 -392036 277805
17538 277805 918220 1528794 2095320 2642393 3206900 3844475 4506701 5208060 5978535 6833416
17528 6833416 7756989 8771111 9913801 11200029 12632191 14262026 16174800 18388748
17520 18388748 20785774 23048336 24387196 23973862 21713652 18693770 15878557 13368796
17512 13368796 10450694 6534185 1316405 -5023328 -11140288 -15632395 -18411157 -20361555
17504 -20361555 -22100105 -23527422 -24454430 -24756620 -24292394 -23135053 -21563593 -19854320
17496 -19854320 -18242423 -16781559 -15476375 -14285981 -13230560 -12308261 -11470178 -10663180
17488 -10663180 -9905930 -9187313 -8528554 -7916930 -7321304 -6763759 -6194617 -5645370 -5115025
17479 -5115025 -4599564 -4057054 -3486992 -2831804 -2135639 -1397330 -610315 264109 1234126
17470 1234126 2320828 3535970 4881206 6295314 7634523 8626566 8857700 8150319 6626957
17461 6626957 4365719 1616585 -1286954 -4092904 -6890315 -9520993 -11807974 -13960962
17453 -13960962 -16191924 -18357943 -20088438 -21301664 -21769753 -21433072 -20504695 -19311199
17445 -19311199 -18069476 -16937555 -15958038 -15232026 -14635594 -14045725 -13473927 -12970751 -12525707
17436 -12525707 -12076184 -11680066 -11323291 -11019032 -10758966 -10491701 -10216081 -9952931 -9742732
17427 -9742732 -9551343 -9344078 -9147446 -8954090 -8765097 -8590701 -8416864 -8250444 -8101032
17418 -8101032 -7976270 -7840285 -7703788 -7529553 -7389319 -7275098 -7169865 -7053059 -6939204
17409 -6939204 -6866397 -6776645 -6700632 -6650848 -6537010 -6450587 -6369959 -6271498 -6181807 -6106027 -6017174
17398 -6017174 -5924359 -5856172 -5775322 -5720409 -5669791 -5591885 -5520174 -5472882 -5421247 -5374340 -5313557
17387 -5313557 -5259971 -5231120 -5192709 -5164618 -5125715 -5088146 -5052005 -5028704 -5024724 -4978110 -4936307
17376 -4936307 -4891050 -4817432 -4763908 -4728251 -4687183 -4627774 -4584817 -4557666 -4538278 -4500306 -4456022
17365 -4456022 -4417843 -4388043 -4347286 -4302202 -4269287 -4223408 -4177853 -4156220 -4146678 -4108667 -4069594
17354 -4069594 -4044476 -4009732 -3981145 -3969950 -3957465 -3925884 -3934793 -3907757 -3874284 -3830243 -3797569
17343 -3797569 -3795421 -3765005 -3710738 -3687073 -3656103 -3619937 -3572821 -3555098 -3557871 -3543606 -3512286 -3486973
17331 -3486973 -3468853 -3449520 -3437486 -3415973 -3422826 -3411865 -3369231 -3334856 -3315022 -3306448 -3282079 -3270874
17319 -3270874 -3236554 -3204138 -3207809 -3180191 -3161473 -3143127 -3118398 -3101535 -3117574 -3117355 -3066386 -3057692
17307 -3057692 -3058266 -3033008 -3023723 -3004525 -2976066 -2960506 -2944739 -2950925 -2930908 -2897418 -2885908 -2859548
17295 -2859548 -2834571 -2834662 -2814402 -2808257 -2789986 -2768392 -2769727 -2772856 -2741072 -2720198 -2702970 -2701283 -2685121
17282 -2685121 -2680605 -2668749 -2658157 -2646497 -2655819 -2643013 -2620086 -2594019 -2551448 -2519999 -2501918 -2486316
17270 -2486316 -2480056 -2470621 -2480261 -2462039 -2428944 -2435729 -2417686 -2421168 -2429387 -2433965 -2420282 -2399682 -2379431
17257 -2379431 -2381085 -2363174 -2356321 -2329684 -2329024 -2335108 -2326202 -2318041 -2324073 -2324871 -2290608 -2271875 -2240490
17244 -2240490 -2230547 -2219307 -2223708 -2209153 -2193149 -2177293 -2184409 -2175704 -2173506 -2170579 -2180264 -2168619 -2142554
17231 -2142554 -2121188 -2103379 -2086779 -2070412 -2074750 -2089976 -2091470 -2097829 -2082422 -2069594 -2040236 -2019797
17219 -2019797 -2028623 -2020434 -1987806 -1950789 -1954657 -1940623 -1938193 -1955350 -1964179 -1951340 -1962695 -1967797
17207 -1967797 -1930497 -1897829 -1901960 -1891705 -1883480 -1864548 -1862850 -1884237 -1885417 -1850275 -1839277 -1835816
17195 -1835816 -1798678 -1778631 -1790513 -1793017 -1769222 -1744935 -1731573 -1735722 -1751025 -1768514 -1756998 -1763781
17183 -1763781 -1764885 -1750251 -1749561 -1727051 -1702966 -1683452 -1694299 -1674082 -1662464 -1667701 -1668473 -1644230
17171 -1644230 -1617429 -1602879 -1633107 -1653244 -1671357 -1653370 -1619914 -1620593 -1629728 -1624299 -1594266 -1564465
17159 -1564465 -1578768 -1596633 -1577192 -1583533 -1564432 -1555848 -1553212 -1539440 -1511698 -1519373 -1508176 -1533458
17147 -1533458 -1538428 -1519370 -1503061 -1496664 -1499045 -1521725 -1530157 -1521738 -1475958 -1435560 -1424235 -1436078
17135 -1436078 -1439596 -1416821 -1402201 -1423693 -1409109 -1394831 -1386741 -1385962 -1361973 -1335701 -1333455 -1359278
17123 -1359278 -1371137 -1369840 -1365218 -1358008 -1353570 -1342083 -1312590 -1293365 -1290714 -1296466 -1296310 -1292456 -1268617
17110 -1268617 -1275926 -1267764 -1248654 -1250492 -1239150 -1237681 -1229667 -1233510 -1201912 -1184451 -1202260 -1230271
17098 -1230271 -1263175 -1287245 -1276117 -1249880 -1239955 -1243773 -1278358 -1301291 -1310079 -1280525 -1250761 -1228671
17086 -1228671 -1219988 -1210265 -1212524 -1226106 -1206588 -1178320 -1172818 -1173578 -1178526 -1156369 -1137743 -1125922 -1138279
17073 -1138279 -1141103 -1166346 -1174567 -1158978 -1141915 -1113728 -1117413 -1116560 -1128595 -1115547 -1101277 -1073828
17061 -1073828 -1046714 -1072770 -1063520 -1035931 -1018942 -1000064 -1000816 -1009716 -999806 -1008003 -1035148 -1073052
17049 -1073052 -1100505 -1084786 -1075277 -1073316 -1085098 -1125383 -1126919 -1120834 -1124409 -1098315 -1080696 -1061551
17037 -1061551 -1064426 -1078906 -1066373 -1079571 -1043620 -1020105 -1019839 -1013256 -994438 -988388 -990043 -982367 -962386
17024 -962386 -933762 -919504 -908810 -893146 -878364 -873939 -862133 -868843 -897596 -922860 -920075 -905694
17012 -905694 -889057 -899910 -909939 -904853 -907612 -937498 -965142 -986543 -1023345 -1031209 -1034967 -1020349
17000 -1020349 -1017393 -1026950 -1030421 -1034279 -1052129 -1063663 -1039917 -1004517 -985228 -974058 -990838 -1002548
16988 -1002548 -995172 -968490 -959006 -974730 -985311 -928901 -883073 -888157 -876970 -875621 -860652 -851041
16976 -851041 -842690 -847401 -847335 -870614 -865212 -829210 -815336 -806624 -813402 -800374 -781780 -776489 -775977 -771682
16962 -771682 -780089 -798064 -789468 -796631 -822732 -844458 -854605 -874659 -885522 -867834 -873507 -868608
16950 -868608 -884221 -880742 -879890 -874892 -838605 -824698 -837920 -854830 -857346 -852631 -836722 -832225 -825391
16937 -825391 -808503 -802179 -799956 -795426 -783970 -790874 -782324 -792221 -791929 -776056 -763652 -775729 -792861
16924 -792861 -773886 -753056 -759524 -769746 -778003 -772423 -758969 -734927 -729790 -729927 -735162 -760376 -756753
16911 -756753 -737011 -723752 -702543 -704636 -723112 -723646 -693822 -677248 -671492 -672391 -673139 -667987 -661474
16898 -661474 -652747 -665276 -687693 -679717 -686734 -678091 -670479 -688766 -703244 -692407 -707624 -691540
16886 -691540 -696551 -686385 -676292 -660310 -653702 -665687 -654398 -636937 -617946 -600115 -616546 -637539
16874 -637539 -631440 -618670 -607653 -596201 -580908 -583283 -599546 -622234 -652131 -662467 -675095 -677795
16862 -677795 -687170 -693805 -658315 -623857 -591335 -565957 -583960 -599131 -595100 -592786 -576034 -573918
16850 -573918 -571723 -565572 -591031 -588808 -588354 -575045 -580524 -578241 -559195 -569148 -580397 -589501 -604585
16837 -604585 -580105 -552021 -522667 -519533 -527434 -523971 -511264 -511468 -514211 -513273 -526417 -524581 -504853
16824 -504853 -492398 -499761 -486085 -449117 -436391 -465961 -510298 -522214 -492993 -497324 -514855 -504131
16812 -504131 -472691 -441780 -444457 -466526 -457588 -458542 -479535 -474588 -457437 -463050 -466758 -491130 -496978
16799 -496978 -470645 -479569 -511507 -495113 -460891 -447599 -444670 -475877 -471505 -487562 -490958 -466508
16787 -466508 -453184 -450140 -464660 -451183 -428733 -441046 -438092 -434945 -428290 -427314 -432781 -439266 -458531
16774 -458531 -457869 -455638 -455143 -439951 -439261 -444031 -421120 -395927 -381857 -372121 -346755 -346482 -358719 -393021
16760 -393021 -398167 -394879 -386162 -361801 -357136 -362948 -373203 -375991 -357759 -335166 -340968 -365009 -371277
16747 -371277 -387795 -407090 -403580 -399497 -391424 -398259 -395405 -383202 -386191 -382316 -336163 -312825 -326046
16734 -326046 -353479 -369909 -370377 -355130 -354483 -347577 -314113 -326839 -321439 -331797 -332028 -308466 -328790
16721 -328790 -332270 -314086 -307295 -301993 -324850 -314719 -308464 -325563 -314717 -290936 -286346 -315503
16709 -315503 -317316 -311262 -321512 -320319 -314104 -290433 -296738 -316241 -331110 -331267 -314293 -303043 -293444
16696 -293444 -279085 -253324 -247190 -245517 -250927 -273857 -276006 -251902 -240187 -240996 -257365 -268160 -295635
16683 -295635 -287027 -265762 -256129 -249104 -278724 -282411 -284647 -296259 -305902 -295121 -275015 -277186 -255977
16670 -255977 -240445 -238736 -234236 -239441 -229884 -227206 -244739 -242053 -249525 -241337 -211119 -203809 -207803
16657 -207803 -214643 -215385 -206332 -208154 -204004 -198866 -190528 -222741 -229097 -205099 -186485 -209078 -216179
16644 -216179 -239901 -231964 -231660 -222032 -206635 -197555 -208610 -179894 -202885 -209260 -194348 -193306 -207068
16631 -207068 -204266 -182860 -213253 -201719 -191174 -186021 -166862 -141923 -153764 -161635 -158711 -170506
16619 -170506 -174299 -158325 -155299 -164843 -170255 -149842 -134330 -126773 -153238 -189383 -184450 -175730 -202173
16606 -202173 -201785 -177432 -152385 -161298 -171397 -176508 -186962 -171380 -159338 -156146 -153303 -148821 -158136
16593 -158136 -141493 -126733 -117516 -121708 -122030 -149755 -143405 -129276 -123960 -128523 -131519 -128850 -128292 -129778
16579 -129778 -130090 -127865 -148891 -143983 -161498 -154930 -146620 -117318 -94167 -92994 -112269 -116996 -114393
16566 -114393 -118230 -125574 -126360 -144489 -126738 -138825 -145433 -119066 -111324 -107496 -121906 -119705 -96322
16553 -96322 -84742 -88015 -73078 -78208 -85870 -79931 -102085 -109748 -88670 -88750 -85545 -81117 -95689 -106830
16539 -106830 -81025 -76625 -61576 -63479 -71559 -76161 -86895 -96737 -93355 -82415 -88084 -82973 -74329
16526 -74329 -53363 -53172 -63380 -61853 -78730 -86019 -96393 -79450 -48156 -57235 -88136 -67818 -44871
16513 -44871 -38441 -24884 -29782 -43559 -56656 -46147 -43435 -55865 -65510 -71075 -57943 -54309 -67256
16500 -67256 -60669 -52541 -72414 -44430 -28207 -50676 -56360 -52607 -51871 -40915 -39599 -52166 -40533
16487 -40533 -36835 -32745 -27681 -15372 -16867 -13681 -33937 -33090 -21247 -27053 -18210 1641 5394 5418
16473 5418 -13153 -290 -19246 -34896 6221 18761 21289 38916 28434 26370 19691 10072 6165
16460 6165 6567 -17708 -21168 -16615 -2628 -3251 -15392 -27938 -18299 -21234 -15161 9315 21098 14220
16446 14220 3724 8394 30532 10788 5535 20575 1496 13774 31976 57080 58484 59343 42344
16433 42344 41354 54217 44221 42466 41586 53560 60278 65199 71362 66985 50493 48841 54867 29282
16419 29282 -404 2880 22215 37370 69162 76016 62060 61610 54097 71116 76231 66145 60691
16406 60691 57077 67119 79178 89352 102661 89557 87888 86617 83683 73683 63788 57007 61496
16393 61496 45975 51488 42094 4971 -7783 32699 42855 45873 43218 29934 38018 42327 62568
16380 62568 75306 78135 75769 80910 77305 75853 91364 71296 57841 96133 124686 113913 108538
16367 108538 129175 142201 126131 114268 87974 71119 54268 46809 50389 56166 61774 74124
16355 74124 83257 76515 108690 122135 124771 114179 110944 98042 74959 74179 84139 91455 111312
16342 111312 110489 123455 138367 123842 127299 149245 116546 88152 95973 100296 117346 132525
16330 132525 119756 138950 154833 134518 138209 145199 153694 133545 123845 126756 145558 117540
16318 117540 85454 97879 113544 116593 130843 131774 116936 125548 128745 157047 180656 177481 160164
16305 160164 140405 125221 133820 122472 129667 135189 148748 149602 138431 142956 182438 207250 187675
16292 187675 189047 180805 172022 178626 182660 158237 153902 129690 120518 152201 172474 162665 149198
16279 149198 170294 170907 164603 169860 174402 183663 176030 186507 187240 178883 178362 190986 181503 166790
16265 166790 172311 179963 183086 212855 221861 230489 222811 233629 210089 169200 153669 177343 185823
16252 185823 183076 195372 201293 190583 210241 226229 232068 221689 195372 192642 212644 198342
16240 198342 194920 204841 220015 214965 205099 186672 207402 222322 229034 241920 259755 265249 252204
16227 252204 243596 223376 212771 207957 205205 184873 189431 212125 216951 216074 209356 215731 214735 209306
16213 209306 225850 256776 243192 250102 259299 255653 257838 251536 249493 250973 261252 262302 257721
16200 257721 252828 258202 257211 243048 243263 238750 235720 239527 260994 261089 252930 268046 301766 322882
16186 322882 307051 288771 271361 270964 261889 275691 270597 262062 271074 263923 257635 276400 265686
16173 265686 288123 270181 240181 237019 237893 243161 250515 247243 250751 252664 266200 275569 261116
16160 261116 254578 274754 296747 291623 264428 258712 292608 314075 321275 310520 334571 335713
16148 335713 329654 306143 292146 289050 281186 263673 251865 253987 281311 289109 294510 284182 276376
16135 276376 285545 290366 310341 338341 328642 306559 291064 305819 334148 349185 310393 276936
16123 276936 277820 306263 339105 355220 333429 343346 334788 332910 331957 308107 287345 295301 307827
16110 307827 320368 341557 373201 370289 337191 321791 304490 317354 319344 319399 318845 308598 312420
16097 312420 338025 349316 351896 375046 388987 376679 342627 303919 306195 304996 302856 307416
16085 307416 313296 329049 338671 324496 340244 341973 336857 368856 390724 389048 399331 391812 396513
16072 396513 368880 323711 313399 297182 300452 335001 341380 346633 366719 351368 340276 354843
16060 354843 338555 329392 331742 325919 328367 343321 372646 369891 360317 370387 398684 402295 396333
16047 396333 382801 367579 384652 401762 417220 408074 392944 382166 384579 387013 382746 371617
16035 371617 380703 376613 361591 392021 406002 402091 411928 415611 420497 404533 413365 416103 390016
16022 390016 371425 362562 349940 352305 381556 392589 395489 406868 407315 409063 415775 402809 381686
16009 381686 368549 392048 429392 441789 416275 411813 406484 413906 424421 417059 417454 412927 404671
15996 404671 415712 421153 402137 391690 395065 400565 412934 409862 402035 396469 396180 387463 396122
15983 396122 384263 392353 403625 399290 388513 396420 433379 455082 476027 476659 486301 466938 427987
15970 427987 432403 430348 425508 418219 404715 413113 432631 441289 422890 431803 432920 423119 432282
15957 432282 437347 427472 463985 446913 437340 441231 461747 472223 446476 436089 444549 422473
15945 422473 421035 430077 408937 384816 388460 406601 411082 421256 417376 422376 411115 434102 436300
15932 436300 442581 453249 457125 461155 464431 466548 445631 432437 429031 417693 420934 430190 453620
15919 453620 483407 489511 478636 484732 496651 518858 516599 510433 515355 494079 478312 474698 477330
15906 477330 471990 456650 472554 493248 502781 486933 484252 453057 430774 451565 474448 442696
15894 442696 463817 492498 509809 518964 507892 520284 522485 522847 492007 466289 466034 465978 462662
15881 462662 462857 469083 452971 461863 465362 456493 470899 483965 501456 513224 519173 532519 544596
15868 544596 533064 522457 520615 518460 529393 539015 525774 519409 518916 493974 499288 499800 491768
15855 491768 506744 495744 460863 480684 498550 489734 465737 493639 499619 479112 465685 469807
15843 469807 470210 505643 544453 550475 532194 520067 513882 533033 532730 534603 529153 505927 506379
15830 506379 533881 511685 491237 494819 516376 524702 496045 469972 472629 525242 555273 535997
15818 535997 538490 546835 538388 563468 578035 566086 578482 581029 590131 594165 586052 571618 575159
15805 575159 564585 556034 532770 523604 529297 513092 494566 505630 529282 510565 510325 519899 526461
15792 526461 556641 551175 532026 536333 531271 535146 547687 537979 533412 550003 550672 552650 546634
15779 546634 547081 546339 553970 533090 521196 523683 552947 577924 588093 585080 576167 559749 545161
15766 545161 571325 581862 570055 553517 550143 563997 569848 555091 537115 536295 558263 560431
15754 560431 558215 586042 568866 558028 555399 571232 600488 597413 583665 571100 562474 572821
15742 572821 590451 569852 545503 571340 586539 581333 574115 566051 574657 573654 577810 601309 621449
15729 621449 614128 618691 601251 605647 599838 586109 584544 569851 563574 581569 579437 579421 599049
15716 599049 625632 613134 589002 557503 568841 600607 624835 658658 652461 641562 623402 605525
15704 605525 609405 595161 579700 603419 617024 603915 593165 572572 590778 621825 644130 632638
15692 632638 605952 572340 578439 598262 603328 629099 614649 613568 629735 634758 621886 619373
15680 619373 618723 633065 625631 610093 606324 598459 608456 626199 628853 635137 621712 589242 584808
15667 584808 631871 666694 652397 633469 647917 652894 627100 592888 609023 618262 619062 626861
15655 626861 610580 587668 596997 598988 592011 593987 618384 624405 618026 612463 605063 613789 620793
15642 620793 653651 685303 674553 670569 666070 661162 650880 672515 685771 668518 631447 608862
15630 608862 631167 660655 657595 652138 675366 690117 707877 699493 663192 668207 681917 667741
15618 667741 681837 650830 635046 634469 622094 651698 671999 680697 693307 677596 674129 686680
15606 686680 687201 696031 706327 687244 662404 671926 683744 710568 718891 686483 683004 702893 709824
15593 709824 714438 713914 694484 686999 694001 672267 646644 644881 638084 619389 626534 622053 602033
15580 602033 605751 636034 656508 674664 659776 646443 677006 701510 691911 674438 671023 688725
15568 688725 668116 676217 684113 692463 697301 704006 718747 734040 728652 713886 707836 697124 703277
15555 703277 694763 699356 721108 740825 737628 715353 688441 697492 700764 693780 692403 694895 718391
15542 718391 740008 742884 736497 735109 708785 699348 711048 715300 712189 719946 716848 712398 711214
15529 711214 729256 730244 758725 764219 764771 746291 739638 762927 736945 721459 708928 702397 702138
15516 702138 702414 703120 703063 723717 737884 733584 740995 743355 741890 758391 748955 715772 722957 767303
15502 767303 769065 759686 767603 770494 779819 748524 738537 739048 739924 745567 737406 732230 718444 745151
15488 745151 757475 751758 761503 776204 774224 767611 772150 785294 777042 756010 758977 774673 770020
15475 770020 780694 786352 775337 775103 773229 753965 766233 780464 788051 794222 766354 739291 740968
15462 740968 741670 760612 756710 769330 779717 771333 772269 768605 766211 781245 797457 794477 797950
15449 797950 821902 832430 802170 783198 782085 764158 744355 775136 790097 789421 786887 794437
15437 794437 784617 783236 779998 770784 778089 800898 801934 793697 802240 814103 803130 790051 788152
15424 788152 799721 793612 797382 816288 817213 811660 829148 836403 828420 821936 812561 804865 801061 828937
15410 828937 825630 803170 817929 805848 788064 798484 824826 842190 861996 872959 865133 854638
15398 854638 832587 831360 814757 825612 830191 807998 817791 812250 828632 842710 857210 861132
15386 861132 851745 824040 821234 808567 841547 860578 836067 842924 810798 791653 800938 808758
15374 808758 789643 773656 794898 813351 817331 811916 830945 836779 838126 844994 839629 821728 827356
15361 827356 831888 809250 809293 810552 820637 819183 815458 847952 878021 880614 865051 886148 890448
15348 890448 885420 897955 901464 866018 855891 853119 841738 843908 834827 852638 878360 884904 850595
15335 850595 859924 861940 862984 872111 864251 883461 899171 914303 925501 906282 883985 884869 879223
15322 879223 878405 880390 886739 891311 860185 839257 856076 845074 829348 856429 861755 881893 876398
15309 876398 874255 860009 883600 914033 907865 900188 884247 884710 878021 889578 896667 905330 884563
15296 884563 878727 895545 892848 885359 904349 905457 898901 897367 911742 909155 892501 889649 891665
15283 891665 885513 860401 860475 881146 882304 880632 900303 896836 894161 898250 892210 873789 889227
15270 889227 904991 899645 897295 893862 889427 908603 926112 916730 921574 922576 929357 914094 905162
15257 905162 923134 946766 942459 946281 931723 936406 957761 976460 968114 946470 935783 929007
15245 929007 911697 925786 932425 926035 917104 950934 952175 945855 953857 961498 937962 930616 922036
15232 922036 910267 932619 934333 950074 935093 923149 898674 922084 918380 913907 939279 934332
15220 934332 943250 932998 906981 906446 913895 936585 938061 916372 914239 934938 915198 921439 914268
15207 914268 898048 884408 903799 944485 946329 943855 954886 962763 971702 985504 997614 988712
15195 988712 953973 935735 914092 922650 916674 903667 910204 925179 930259 918742 903530 911994
15183 911994 933463 965130 968780 955157 966818 972655 980666 963613 954390 967665 987013 966933
15171 966933 960592 971897 992265 974622 938722 939154 968296 973555 963006 957565 954833 970078 973747
15158 973747 971530 970408 960718 951682 961435 942586 948869 944028 933657 960531 968768 977906 994312
15145 994312 982796 969679 977578 992676 1002108 1010115 1015156 1015352 1006311 982432 961784 986687 988038
15132 988038 982855 996527 1016346 1024770 1044480 1028115 1017304 1002663 1003954 1007622 1003692 1007900 1030004
15119 1030004 1052943 1034004 1034769 1044042 1036253 1018673 1027214 1038300 1025561 1017113 1045946 1036768 1062309
15106 1062309 1094263 1079453 1055394 1042738 1025393 1003937 1021587 1008739 987921 985375 1006391
15095 1006391 1024000 1026681 1027286 1024107 1012755 1000308 986189 985911 1019797 1033773 1044398 1024583
15083 1024583 1020083 1043719 1059795 1061634 1051271 1056159 1063504 1071962 1083954 1074875 1071149 1056306 1058782
15070 1058782 1077232 1078994 1089624 1073984 1061562 1052294 1051504 1074192 1058227 1050065 1064137 1067006
15058 1067006 1033296 1022402 1039680 1051994 1059929 1069878 1083440 1081920 1042212 1032938 1073020 1081554
15046 1081554 1072651 1075301 1062663 1060610 1090810 1072173 1080138 1102292 1086560 1086829 1089362 1116821 1104407
15033 1104407 1088632 1114869 1140509 1125038 1092877 1077605 1067056 1067425 1068501 1054913 1080817 1105094
15021 1105094 1077161 1061287 1058789 1087180 1089617 1084042 1087173 1079958 1073986 1053774 1036143 1048119
15009 1048119 1054663 1064366 1064741 1063278 1050940 1042203 1076052 1102153 1125547 1133136 1100076 1082389 1100958
14996 1100958 1090714 1064578 1063000 1100999 1123764 1119888 1118184 1107845 1101860 1111441 1123306 1125962
14984 1125962 1130329 1122747 1092598 1102039 1122283 1114068 1117300 1121990 1120351 1096297 1125841 1110984 1088393
14971 1088393 1108858 1115094 1108746 1102390 1133951 1134565 1139496 1141859 1128254 1131262 1146850 1145352 1150965
14958 1150965 1149272 1143973 1129738 1145209 1151731 1139552 1135187 1110166 1123810 1137912 1150944 1155110
14946 1155110 1150690 1159447 1173548 1166313 1154523 1148897 1157731 1178461 1172926 1166496 1139681 1123874 1110065
14933 1110065 1116113 1136801 1170570 1176764 1163502 1145186 1134269 1144771 1151779 1155194 1149964 1163924
14921 1163924 1157911 1142130 1155014 1169808 1192037 1190213 1179219 1169484 1172581 1182120 1189510 1200789
14909 1200789 1195416 1185020 1180869 1151095 1137716 1142900 1146826 1151321 1166609 1197919 1214493 1217777
14897 1217777 1198307 1174642 1167336 1198514 1209707 1196293 1206713 1214633 1226004 1216703 1182499 1181004
14885 1181004 1195929 1187783 1187436 1201121 1197091 1204483 1235953 1230443 1208353 1182915 1202249 1200627 1225693
14872 1225693 1244538 1254948 1242712 1195645 1199347 1206332 1217310 1222490 1220021 1228333 1216996 1195662
14860 1195662 1206536 1223195 1248702 1249359 1249829 1264462 1303358 1303623 1298849 1275941 1271760 1247009 1215898
14847 1215898 1192453 1231107 1259767 1269238 1256646 1239552 1233318 1224882 1222772 1226377 1247537 1255546
14835 1255546 1263410 1299320 1308675 1306370 1301978 1283292 1256238 1235026 1240127 1231466 1223134 1230696 1248453
14822 1248453 1251556 1268987 1267516 1262450 1252388 1250662 1259725 1277029 1270933 1270570 1264833 1280188 1297963
14809 1297963 1283082 1269162 1264840 1267309 1254282 1228040 1242808 1268568 1277105 1270488 1262032 1264967
14797 1264967 1262930 1244108 1235521 1234909 1257756 1253712 1244265 1273710 1296655 1307300 1307067 1307636 1301261
14784 1301261 1278449 1252397 1270253 1291037 1289286 1281482 1303277 1308599 1317142 1331262 1337217 1348724
14772 1348724 1344827 1347214 1341208 1321310 1311586 1317847 1313326 1331984 1334945 1338577 1336108 1313000 1328990
14759 1328990 1329226 1320893 1339602 1353093 1336854 1327437 1340580 1354374 1353016 1327876 1323994 1334483
14747 1334483 1343379 1337551 1333052 1322911 1363265 1368679 1344026 1331819 1336184 1351039 1354704 1335446
14735 1335446 1324475 1337629 1338990 1336665 1340908 1379023 1379324 1342889 1346436 1338772 1351244 1362534 1365781
14722 1365781 1343942 1369385 1390374 1388218 1388189 1384976 1376988 1374634 1366976 1374938 1401775 1423208 1425238
14709 1425238 1406824 1389571 1408494 1425495 1440733 1434088 1407563 1402439 1390402 1369297 1363695 1385868
14697 1385868 1392125 1393661 1405942 1401848 1413272 1411226 1415547 1407935 1427295 1459271 1451580 1422866 1405927
14684 1405927 1400786 1411373 1412885 1380129 1368685 1387718 1392353 1402509 1415901 1414556 1378471 1370468
14672 1370468 1370809 1400271 1411319 1374247 1374487 1395131 1394091 1412795 1413999 1428617 1435138 1434492 1431429
14659 1431429 1442843 1424091 1440627 1472483 1483566 1484748 1477308 1472655 1483811 1483208 1453345 1436031
14647 1436031 1428763 1440548 1444865 1447677 1455772 1472369 1480441 1480563 1480869 1468116 1464709 1451404 1471013
14634 1471013 1497818 1506257 1490364 1469652 1456963 1476176 1492805 1463601 1449327 1455079 1453374 1460886
14622 1460886 1476120 1499957 1508820 1508150 1475042 1456963 1475096 1479991 1498439 1526823 1522821 1498876
14610 1498876 1483761 1486446 1502670 1527133 1539097 1538602 1525004 1495592 1454093 1470849 1486535 1482722
14598 1482722 1476598 1477614 1503239 1517559 1498286 1471040 1513655 1549562 1556608 1545806 1519466 1521170
14586 1521170 1532411 1530272 1545413 1551644 1554601 1563932 1544912 1524209 1512083 1519048 1529570 1543020
14574 1543020 1554632 1549271 1535538 1534015 1559600 1555992 1564515 1562963 1546494 1530653 1539675 1539017 1532101
14561 1532101 1536203 1518282 1524479 1521451 1555368 1557829 1543479 1562319 1585551 1592380 1602359 1608339 1610894
14548 1610894 1609519 1609480 1599601 1586002 1596835 1588999 1589495 1588484 1600773 1626504 1609690 1614158 1618495
14535 1618495 1588311 1570434 1575464 1573337 1573075 1568281 1564069 1595210 1609858 1620608 1600938 1571795
14523 1571795 1584962 1583327 1553502 1565281 1591231 1618802 1621887 1622560 1609536 1610613 1623085 1660093
14511 1660093 1659035 1630371 1616507 1615403 1616083 1638140 1660276 1669249 1639024 1616243 1607448 1606224 1616068
14498 1616068 1647129 1640455 1631194 1633979 1615096 1618217 1624221 1620976 1601316 1611063 1617342 1637904 1672460
14485 1672460 1667241 1666468 1660739 1661825 1672810 1648312 1648265 1655241 1676081 1679731 1693960 1732024 1736491
14472 1736491 1718068 1696293 1681382 1675000 1696703 1705383 1686210 1671465 1673163 1692649 1696462 1677766
14460 1677766 1676371 1666584 1663936 1686382 1702205 1714890 1681779 1669302 1685272 1693859 1719405 1719477 1715331
14447 1715331 1706542 1706961 1720272 1724045 1740323 1749241 1757026 1761463 1743992 1741363 1746486 1725307 1739927
14434 1739927 1749522 1772390 1762484 1749927 1759846 1777445 1747874 1759221 1800439 1785559 1772685 1752895
14422 1752895 1759662 1771821 1785576 1786086 1772808 1770398 1748767 1737290 1767981 1790803 1797680 1793082
14410 1793082 1809407 1814545 1802054 1797340 1780320 1779231 1764063 1777036 1783046 1777491 1774522 1793171
14398 1793171 1810474 1813045 1785573 1800351 1808559 1823272 1818595 1823488 1836675 1830216 1805140 1802049
14386 1802049 1816978 1819797 1844639 1849707 1849166 1861449 1862827 1845072 1825736 1835199 1828439 1820166 1841495
14373 1841495 1849685 1832471 1842062 1863630 1873374 1842541 1839633 1862237 1868838 1869448 1883631 1935705 1941974
14360 1941974 1930279 1914747 1899171 1925467 1942110 1967897 1958798 1952557 1920097 1920776 1943846 1959498
14348 1959498 1942592 1922251 1927059 1933028 1939581 1913694 1932084 1963306 1969158 1960220 1990840 1995414
14336 1995414 1987385 2010366 2015695 2003457 1986404 1957443 1965292 1963629 1968870 1971981 1973014 1968932 1966403
14323 1966403 1979057 2000802 2016467 2004974 2009642 2031314 2021091 2014730 2023258 2027197 2030348 2016627
14311 2016627 2023120 2014946 2002320 2010728 2024598 2047349 2045101 2012923 2004655 1978161 1994211 1992454
14299 1992454 1989340 2013316 2033236 2027588 2024602 2029538 2033285 2046898 2074201 2082486 2099266 2085646
14287 2085646 2079372 2087890 2088180 2087886 2088119 2064131 2029677 2029485 2033372 2003578 2011882 2019107 2004264 1986734
14273 1986734 1996740 2009974 2026652 2043767 2068195 2056594 2065058 2055040 2046500 2036277 2051621 2097550
14261 2097550 2127660 2136713 2136528 2119437 2122416 2119957 2104797 2087334 2095169 2112858 2103458 2093689 2086642
14248 2086642 2107069 2119991 2128981 2123376 2115185 2128003 2130532 2112132 2109952 2113522 2127127 2139501
14236 2139501 2142219 2151442 2138420 2154579 2149208 2131703 2150022 2176662 2180481 2176729 2146377 2127572
14224 2127572 2143691 2156295 2189415 2220528 2202296 2205693 2204385 2204288 2219876 2212873 2216613 2252985 2252700
14211 2252700 2242970 2249235 2244628 2232085 2215463 2221087 2229410 2230283 2227139 2237334 2259730 2261133 2253045
14198 2253045 2255384 2262211 2247990 2239414 2261834 2277404 2267553 2269464 2274621 2251154 2233997 2255909
14186 2255909 2285950 2291447 2287443 2283101 2287954 2318905 2328673 2316797 2323843 2362025 2399534 2393446 2362135
14173 2362135 2340424 2337184 2346849 2370080 2395202 2390142 2378568 2410847 2417020 2415421 2406129 2412215 2436516
14160 2436516 2447043 2469371 2467151 2437994 2421790 2393290 2390901 2418213 2435522 2427911 2427393 2447471
14148 2447471 2428188 2422701 2452794 2461388 2442437 2448690 2486406 2486481 2475923 2482978 2490453 2500171 2501753
14135 2501753 2522870 2511054 2497155 2523471 2516788 2514060 2521959 2535159 2578706 2617765 2606989 2587860
14123 2587860 2590362 2591231 2598774 2600674 2599641 2592870 2600141 2613013 2606691 2610311 2610381 2619223 2614113 2608575
14109 2608575 2601069 2599875 2634614 2649939 2652155 2664720 2677431 2708384 2699610 2693175 2685332 2673893
14097 2673893 2698583 2717448 2724403 2745855 2748868 2729951 2721903 2748751 2775962 2781937 2782673 2786835 2791298
14084 2791298 2786850 2803765 2835125 2840341 2828973 2834318 2827905 2850515 2824898 2816487 2820762 2835805
14072 2835805 2852082 2826724 2853097 2895719 2899375 2906092 2929984 2935416 2931170 2925576 2926760 2938511
14060 2938511 2956399 2972539 2976042 2980552 3006241 3030967 3036245 3055968 3058077 3050425 3042308 3046716 3064812
14047 3064812 3094468 3109329 3123192 3096995 3067375 3063087 3050966 3055813 3068654 3107849 3127729 3124370
14035 3124370 3143362 3154699 3194950 3208826 3221519 3243557 3285546 3318007 3329313 3338828 3328012
14024 3328012 3312597 3307451 3304595 3311876 3323341 3278480 3269165 3283434 3288719 3319788 3329258 3342892
14012 3342892 3363107 3394708 3431700 3429886 3446768 3492687 3528756 3527117 3503815 3537946 3545270 3531862
14000 3531862 3525517 3537886 3544132 3532940 3516296 3527180 3531806 3538959 3571929 3605159 3630132 3649437
13988 3649437 3656438 3690502 3749293 3785351 3818986 3861932 3886656 3886707 3879373 3882564 3838224 3822170
13976 3822170 3817204 3821097 3815641 3848816 3855468 3846078 3868197 3901892 3929898 3954259 3983715 4016183
13964 4016183 4056858 4112729 4160418 4183079 4200380 4227164 4224984 4261920 4304916 4337670 4333925 4332311
13952 4332311 4330397 4354268 4368404 4373075 4411035 4472335 4500654 4516708 4570999 4624384 4665474 4700950
13940 4700950 4750648 4774119 4807530 4854390 4896420 4955282 5003818 5043776 5090037 5147836 5179866
13929 5179866 5229846 5294551 5347065 5389310 5439498 5512058 5608750 5712843 5803736 5894858 5966121
13918 5966121 6038003 6162529 6312088 6445936 6589780 6743599 6903455 7079760 7270561 7438945
13908 7438945 7642556 7851030 8019286 8136537 8157704 8043570 7796307 7442274 7017430 6592487
13898 6592487 6142629 5753496 5508168 5385227 5398245 5495151 5691725 5971162 6305391 6690599
13888 6690599 7061898 7457741 7905182 8351988 8775963 9184479 9525842 9736345 9776795 9557669
13878 9557669 9052585 8284292 7344848 6346380 5386140 4568594 3982203 3676565 3625822 3784362
13868 3784362 4117390 4623870 5193597 5784369 6428020 7079993 7759815 8460064 9150476
13859 9150476 9736687 10134167 10299635 10138285 9571663 8535329 7159450 5648357 4136859
13850 4136859 2729899 1573771 846537 515205 530801 847361 1407132 2128378 2927433
13841 2927433 3737694 4570378 5455962 6385786 7325456 8173818 8870553 9276817 9284090 8818175
13831 8818175 7806477 6209124 4221038 2134473 27803 -1919354 -3434614 -4387886
13823 -4387886 -4774683 -4738200 -4358543 -3678152 -2875737 -2051786 -1205734 -375408 464516 1320832
13813 1320832 2139548 2896054 3483027 3844698 3858149 3504172 2719542 1488411 12285
13804 12285 -1530142 -3017946 -4335091 -5305399 -5840841 -5992261 -5850919 -5473879 -4931122
13795 -4931122 -4350716 -3734708 -3086887 -2450704 -1824192 -1206990 -603417 -83102 318341
13786 318341 540171 479194 94993 -571313 -1453365 -2464349 -3480586 -4445423 -5193341
13777 -5193341 -5667077 -5873041 -5844302 -5663869 -5352474 -4989820 -4605887 -4187161 -3810231 -3454422
13767 -3454422 -3105255 -2727307 -2369360 -2058669 -1827090 -1691437 -1678716 -1790494 -2081176 -2481062
13757 -2481062 -2916031 -3372847 -3804943 -4155134 -4404772 -4499600 -4482314 -4386217 -4239770 -4094390
13747 -4094390 -3928069 -3783478 -3605214 -3428148 -3263227 -3104812 -2963539 -2803494 -2652044
13738 -2652044 -2546591 -2449423 -2354592 -2239950 -2133168 -2068307 -1986139 -1890477 -1822131 -1735826 -1651068
13727 -1651068 -1587590 -1542047 -1507194 -1468993 -1443314 -1406032 -1345965 -1304012 -1266485 -1209504 -1178861
13716 -1178861 -1166686 -1124783 -1044703 -996530 -945127 -897162 -884007 -841955 -768260 -709578 -698924
13705 -698924 -655156 -645576 -650218 -617034 -589367 -566864 -507506 -455157 -426751 -393216 -385452 -354990
13693 -354990 -334237 -305455 -267525 -265098 -250634 -228949 -228004 -219068 -173271 -119078 -100097 -106085
13681 -106085 -66604 -45648 -47774 -48401 -13805 21860 40251 63142 89752 93662 103891 131767
13669 131767 156692 155961 179255 210067 208104 203362 208772 229410 264493 267031 271209 299705 357527
13656 357527 402162 417995 389376 374291 379905 394740 395516 406248 436074 434249 463235 482325
13644 482325 490533 519009 502847 524534 561605 575913 573640 582668 591636 578158 616419 659799
13632 659799 695755 710614 717934 705887 701605 718857 704595 699314 716599 738779 753702 766166
13620 766166 799965 800718 788724 795357 814661 858986 871243 879726 893422 907647 906065 923277
13608 923277 941224 941743 948800 948007 957528 945426 940619 939647 928963 962390 995694 998091 982162
13595 982162 1003510 1035444 1073310 1086104 1099272 1117009 1116058 1104236 1071532 1062127 1084501 1099608
13583 1099608 1110767 1134621 1127999 1143290 1154061 1182786 1195691 1193127 1211919 1201677 1180455 1193747
13571 1193747 1218525 1216406 1217268 1222587 1246954 1257581 1259929 1259131 1267569 1282097 1278247 1294363 1312518
13558 1312518 1328366 1354506 1363946 1345560 1350896 1345878 1358132 1371712 1391570 1411061 1443105 1441864
13546 1441864 1428122 1414487 1420796 1427507 1407850 1406128 1402746 1402093 1416451 1431682 1487203 1508378
13534 1508378 1499021 1490489 1503259 1502301 1506035 1497217 1516049 1542596 1534619 1531402 1538356 1541727 1577605
13521 1577605 1620853 1618466 1616734 1596007 1594161 1625752 1627471 1635626 1650512 1665699 1679274 1676208
13509 1676208 1667877 1653058 1644594 1654761 1674571 1707315 1712981 1712273 1700963 1693089 1700239 1690508 1687265
13496 1687265 1706134 1708079 1727565 1758640 1796573 1796362 1783743 1786223 1785892 1791040 1790140 1785005 1814340
13483 1814340 1824813 1846243 1859794 1864344 1867696 1872157 1878648 1890737 1898080 1896500 1895203 1880528 1886253
13470 1886253 1902671 1914313 1930479 1939231 1959350 1988078 1984972 1975328 1988417 1994164 2005620 2009249
13458 2009249 2029788 2014981 1988546 1996609 1991993 1974784 1956309 1983873 2017008 2052838 2060977 2063964
13446 2063964 2078030 2072969 2073636 2080075 2091126 2084317 2088987 2086824 2089478 2098288 2128921 2146889 2149413
13433 2149413 2142498 2140483 2158840 2193028 2210131 2209292 2196114 2213162 2267126 2294954 2314592 2297107
13421 2297107 2278375 2275624 2260022 2273564 2309927 2302318 2302542 2299248 2249995 2233271 2230064 2232954 2234477
13408 2234477 2221203 2220869 2225217 2239336 2272984 2275495 2300993 2300279 2302673 2298682 2322949 2344935 2377384
13395 2377384 2395922 2386050 2383340 2369513 2374665 2380991 2384016 2350245 2304631 2323244 2336935 2364775
13383 2364775 2382340 2386626 2410272 2431505 2465755 2478605 2465249 2465080 2487965 2510694 2506226 2474307
13371 2474307 2484632 2481495 2463840 2453888 2461167 2464950 2458158 2454930 2450446 2444354 2460551 2498491 2531248
13358 2531248 2536344 2542931 2530594 2531701 2555098 2584882 2588520 2632047 2656183 2640888 2646283 2671497
13346 2671497 2661640 2623990 2591494 2597737 2617770 2599361 2586527 2571567 2561438 2589216 2587968 2577661
13334 2577661 2576351 2600147 2628231 2644800 2641296 2649234 2664046 2679479 2712341 2735615 2753129 2759184
13322 2759184 2755993 2755372 2748235 2756637 2740759 2725902 2720109 2726888 2737609 2747849 2750498 2779798 2809038
13309 2809038 2822369 2846659 2846357 2848191 2850499 2853408 2851905 2864927 2861461 2862721 2878638 2882527 2865454
13296 2865454 2862246 2873921 2869666 2860079 2873264 2843956 2834724 2864370 2876619 2863379 2860062 2910617
13284 2910617 2968406 2975645 2991709 3007082 3033870 3045036 3036300 3022049 3038570 3067170 3061247 3054505
13272 3054505 3070038 3074293 3041355 3031490 3048972 3048455 3052254 3046481 3041427 3040106 3046555 3073332 3108922
13259 3108922 3119076 3112080 3117999 3138871 3173213 3195884 3198859 3191814 3227771 3245766 3250565 3276084
13247 3276084 3279584 3280116 3270321 3258623 3258606 3262231 3284413 3297047 3302663 3311249 3317238 3330262 3324860 3341462
13233 3341462 3366475 3383140 3380459 3400652 3390135 3399310 3423210 3438949 3430713 3440027 3440635 3442457 3470477
13220 3470477 3487600 3502738 3520383 3515388 3534031 3551134 3528782 3523529 3536163 3556536 3583554 3615913
13208 3615913 3645164 3636599 3620976 3613987 3627229 3620834 3632444 3635553 3645223 3686782 3718984 3742859
13196 3742859 3740531 3742022 3741956 3746397 3761251 3787090 3800016 3798213 3820330 3835264 3861594 3874690 3872237
13183 3872237 3860257 3863311 3887124 3908987 3929507 3928394 3920735 3920878 3942459 3967528 3975567 3974668 3998205
13170 3998205 4037319 4029295 4032088 4034839 4031838 4062555 4077663 4121431 4158363 4184906 4188989 4188497 4186047
13157 4186047 4217760 4216196 4207793 4198159 4206506 4237318 4260965 4265632 4277717 4276968 4306116 4313310 4304201
13144 4304201 4311849 4339826 4373585 4401469 4416256 4418331 4425734 4435087 4433398 4439605 4442267 4448753 4489033
13131 4489033 4521792 4542571 4566546 4564146 4551179 4582040 4617402 4664343 4687957 4697936 4718919 4757432
13119 4757432 4793539 4780220 4785169 4796073 4806347 4809962 4826134 4873785 4923239 4936002 4934667 4949708
13107 4949708 4970320 4987380 5032198 5043762 5053656 5070441 5082766 5099512 5117175 5142067 5148086 5175534
13095 5175534 5203774 5218617 5236835 5262609 5260275 5290070 5318932 5358184 5384862 5409796 5415257 5423769
13083 5423769 5452287 5475347 5508700 5521047 5543815 5564289 5601545 5614049 5631936 5662330 5710843
13072 5710843 5747374 5775921 5808849 5833410 5866655 5899210 5919072 5933552 5969754 6028959 6080450
13061 6080450 6103642 6159430 6224796 6255769 6285763 6346246 6366343 6382826 6402456 6407339 6414154 6434279
13049 6434279 6454866 6459508 6473070 6478872 6480064 6503339 6555631 6609066 6665664 6749704 6833125 6900621
13037 6900621 6964188 7036944 7098234 7129754 7170807 7206054 7252321 7325774 7363104 7391701 7411985
13026 7411985 7423735 7457728 7504323 7554754 7617887 7674681 7738356 7787758 7867881 7988478 8090129
13015 8090129 8186338 8307550 8429934 8547048 8646921 8717635 8762513 8761640 8742819 8680931 8627297
13004 8627297 8582126 8509226 8503667 8538975 8586141 8686541 8820084 8963120 9121559 9283096
12994 9283096 9450743 9623407 9796518 9954690 10102143 10252153 10401989 10513582 10620239
12985 10620239 10730732 10840078 10974765 11108466 11247752 11393272 11584009 11787063 11999161
12976 11999161 12254585 12560697 12914235 13325615 13784434 14280287 14799339 15348562 15930424
12967 15930424 16545662 17180804 17778371 18149675 18113877 17491260 16375440 14958352 13219940
12958 13219940 11237797 9365656 7888919 6826973 6146357 5870209 6012453 6520128 7273902
12949 7273902 8163389 9092382 10072433 11010934 11950649 12907407 13834435 14679043 15419535
12940 15419535 15860601 15791340 15107946 13984555 12552838 10764457 8743598 6965708 5711815
12931 5711815 4910847 4539335 4723121 5416848 6411894 7531022 8697199 9785340 10703852
12922 10703852 11319571 11521942 11297584 10590694 9554540 8368154 7067158 5666432 4429433
12913 4429433 3529570 2970592 2645476 2636408 3027065 3770874 4750107 5871738 7027144
12904 7027144 8216132 9438840 10662782 11833999 12872980 13677184 14214344 14527704 14525140
12895 14525140 14134214 13465495 12594143 11530674 10192888 8673507 7102378 5506504
12887 5506504 3807192 1976333 206676 -1406663 -2866503 -4054683 -4854924 -5176123
12879 -5176123 -5094951 -4634334 -3847852 -2792432 -1546660 -179482 1201186 2595903 3997033
12870 3997033 5296329 6461698 7326638 7712717 7650620 7257493 6483111 5218783 3586990
12861 3586990 1883480 228352 -1359448 -2746801 -3609246 -3823462 -3470881 -2647739 -1435564
12852 -1435564 -34828 1402123 2741530 3784216 4353403 4315327 3661363 2408294 512271
12843 512271 -1912933 -4451180 -6663621 -8455875 -9801764 -10513868 -10469129 -9870177 -8952733
12834 -8952733 -7884373 -6735793 -5553231 -4354235 -3128277 -1919111 -704744 433114
12826 433114 1333238 1907949 1968009 1516386 557859 -922486 -3010189 -5509505 -8056884
12817 -8056884 -10316325 -12187081 -13544442 -14219792 -14186449 -13676053 -12958468 -12209124 -11486424
12808 -11486424 -10850015 -10226722 -9642279 -9068305 -8542737 -8075303 -7661521 -7280421 -6934109
12799 -6934109 -6597540 -6282751 -5997774 -5765478 -5518644 -5248772 -4982105 -4747684 -4552206
12790 -4552206 -4334179 -4126906 -3951904 -3796504 -3641074 -3448886 -3253954 -3083013 -2920149
12781 -2920149 -2780572 -2673634 -2543599 -2422741 -2333521 -2233756 -2139761 -2053606 -1943711 -1821192
12771 -1821192 -1708958 -1585168 -1495918 -1398114 -1301534 -1217436 -1104309 -967956 -873584 -778105
12761 -778105 -691505 -615548 -523059 -440508 -373586 -296827 -217209 -168191 -104717 -32902 47136
12750 47136 106051 153695 216809 316774 407489 490776 576290 638697 692814 761158 867136
12739 867136 959550 1022060 1092014 1133038 1182588 1263693 1363131 1450403 1536062 1578488 1623828
12728 1623828 1691619 1741686 1764418 1797132 1847125 1919855 1978000 2034460 2091405 2185708 2263418
12717 2263418 2329797 2376117 2426442 2476183 2516768 2598422 2674441 2747659 2837386 2907794 3007975
12706 3007975 3107976 3195908 3261861 3317754 3389673 3455487 3516590 3597079 3654135 3710560 3752964
12695 3752964 3795375 3879845 3970088 4031068 4099348 4173763 4261556 4352254 4424762 4478180 4511559
12684 4511559 4576910 4666355 4767410 4869900 4956681 5040775 5113144 5186585 5283834 5380195 5464267
12673 5464267 5536362 5629527 5729706 5817310 5901862 6003728 6115103 6213718 6322733 6420337
12663 6420337 6519971 6619261 6721187 6846676 6971993 7102650 7207689 7310513 7440528 7578305
12653 7578305 7716859 7859025 7993066 8135480 8273919 8447616 8596391 8724792 8870552
12644 8870552 9026095 9195013 9375434 9574727 9746198 9947780 10146502 10350554 10538697
12635 10538697 10721316 10929047 11152901 11379095 11624586 11883032 12158060 12449271 12733634
12626 12733634 13012843 13293327 13614463 13952535 14302652 14651248 15022431 15434011 15885579
12617 15885579 16346900 16774611 17268268 17827108 18431375 19050967 19683719 20355589 21097058
12608 21097058 21908284 22755392 23660131 24674917 25773787 26959472 28289698 29697483
12600 29697483 31194475 32779925 34463825 36224836 38137994 40236055 42667091 45533719
12592 45533719 49003414 53241351 58354493 64329905 70763380 76640574 80255449 79544132
12584 79544132 72888508 59604729 40429712 17216730 -7500567 -30985811 -50854135
12577 -50854135 -65233033 -73103730 -74963945 -72360847 -67295623 -61561275 -56119143 -51327573
12569 -51327573 -47243176 -43830246 -40942462 -38523791 -36464993 -34651132 -33006711 -31437951
12561 -31437951 -29906516 -28431237 -27044024 -25714274 -24467746 -23324314 -22278660 -21325276
12553 -21325276 -20428376 -19603764 -18835441 -18142544 -17490178 -16871893 -16280493 -15723654 -15217604
12544 -15217604 -14719894 -14230102 -13756245 -13324438 -12888182 -12485674 -12100989 -11718179 -11373798
12535 -11373798 -11028081 -10731931 -10428270 -10114964 -9826908 -9574079 -9335366 -9062315 -8809515
12526 -8809515 -8587918 -8354156 -8130292 -7905051 -7721981 -7530078 -7333760 -7149157 -6987079
12517 -6987079 -6794317 -6643695 -6495967 -6336376 -6184790 -6042931 -5880381 -5716387 -5545051
12508 -5545051 -5397541 -5262371 -5106784 -4940906 -4787172 -4663937 -4532170 -4408112 -4296328
12499 -4296328 -4172124 -4054318 -3933571 -3816949 -3711915 -3586077 -3456343 -3344614 -3245445 -3130123
12489 -3130123 -2995600 -2895848 -2814058 -2703679 -2579506 -2455896 -2346796 -2242678 -2113617 -1978849
12479 -1978849 -1868783 -1770590 -1673907 -1581220 -1484263 -1393611 -1291652 -1169231 -1061432 -968489
12469 -968489 -879697 -773669 -676155 -571163 -445528 -303829 -163343 -11246 92584 199736
12459 199736 321699 438681 524695 579445 631318 701853 784817 895052 983105 1114082 1226160
12448 1226160 1342270 1481268 1619487 1770354 1917690 2059725 2241407 2442339 2614570
12439 2614570 2785766 2940243 3131244 3328104 3527673 3714881 3913837 4138849 4342694
12430 4342694 4559020 4786262 5018999 5235546 5461226 5681383 5939333 6225192 6542579
12421 6542579 6905674 7327904 7798232 8290485 8819757 9410544 10072950 10822831 11606345
12412 11606345 12453168 13373180 14258498 14967446 15315641 14969966 13561298 10982913 7387354
12403 7387354 3332026 -232715 -2522886 -3396600 -3177707 -2384409 -1328741 -151906 1062209
12394 1062209 2283654 3560102 4861253 6164769 7425341 8623612 9611602 10311790
12386 10311790 10538577 9982400 8377547 5670177 2177774 -1559877 -4863032 -7222194
12378 -7222194 -8393164 -8462979 -7738367 -6630097 -5374885 -4115885 -2910180 -1711578 -550855
12369 -550855 548610 1642933 2790169 3927553 5088454 6247983 7371186 8452274
12361 8452274 9385904 10029040 10201034 9599031 7965493 5151657 1561683 -1936747 -4656115
12352 -4656115 -6367092 -7068098 -6919683 -6096585 -4849703 -3333384 -1764779 -137955 1545733
12343 1545733 3300131 5090666 6901224 8654122 10180848 11201507 11485631 10794573
12335 10794573 8988515 5961480 1717502 -3340917 -8467019 -12839277 -15993860 -17981881
12327 -17981881 -19021953 -19211691 -18694394 -17667345 -16294033 -14755919 -13190085 -11677490
12319 -11677490 -10159213 -8663740 -7208986 -5820076 -4499467 -3393857 -2663902 -2548725
12311 -2548725 -3210229 -4703410 -6964753 -9678273 -12202998 -14033932 -15068652 -15401694
12303 -15401694 -15156285 -14546453 -13741902 -12831223 -11865168 -10908283 -9972789 -9057844 -8176760
12294 -8176760 -7290053 -6379262 -5441616 -4464154 -3443038 -2369540 -1290020 -353565 234001
12285 234001 191599 -819091 -2805574 -5431692 -8251468 -10830760 -12794633 -13846256 -14169627
12276 -14169627 -14007798 -13530584 -12822660 -11967357 -11013077 -9979552 -8925243 -7863659 -6763576
12267 -6763576 -5670631 -4562073 -3487359 -2713176 -2578976 -3514900 -5757295 -8963732 -12341369
12258 -12341369 -15182996 -17115706 -18094570 -18309229 -18034514 -17510784 -16870823 -16175446 -15566510
12249 -15566510 -15014651 -14453671 -13925199 -13445274 -13006675 -12614856 -12284973 -11964661 -11689789
12240 -11689789 -11471853 -11307472 -11148100 -10975199 -10800417 -10616233 -10427211 -10213925 -10036557
12231 -10036557 -9870996 -9725840 -9561322 -9393085 -9235248 -9092050 -8964455 -8851126 -8723847
12222 -8723847 -8601027 -8462104 -8327155 -8225720 -8131767 -8044413 -7952624 -7853483 -7752324 -7658047
12212 -7658047 -7556444 -7494162 -7414566 -7332397 -7241066 -7159691 -7091479 -7033599 -6974695 -6904602 -6842805
12201 -6842805 -6790049 -6738778 -6676030 -6635097 -6589548 -6506038 -6425554 -6369558 -6319508 -6245787 -6202324
12190 -6202324 -6142187 -6067324 -5989301 -5941904 -5895857 -5858688 -5813381 -5760942 -5740929 -5684103 -5629967
12179 -5629967 -5599742 -5555046 -5479767 -5419098 -5372262 -5313181 -5240130 -5192061 -5162265 -5108357 -5043188
12168 -5043188 -4974264 -4934612 -4898222 -4819482 -4750332 -4709128 -4664052 -4559894 -4491258 -4451470 -4393002
12157 -4393002 -4299407 -4217580 -4144707 -4105744 -4101059 -4115614 -4150049 -4177712 -4240573 -4322262 -4345205
12146 -4345205 -4329930 -4286919 -4218617 -4106429 -3997182 -3874562 -3715952 -3546010 -3362151 -3157982
12136 -3157982 -2938644 -2753663 -2662371 -2693097 -2832066 -3135882 -3581035 -4137483 -4713779 -5295615
12126 -5295615 -5824926 -6210723 -6445933 -6518141 -6462614 -6328749 -6183982 -6035600 -5886924 -5730567
12116 -5730567 -5624144 -5524505 -5413569 -5335456 -5238928 -5164047 -5098155 -5025734 -4968997 -4938052 -4879574
12105 -4879574 -4830260 -4769428 -4712787 -4648900 -4618927 -4586121 -4540898 -4497765 -4449352 -4408775 -4376520
12094 -4376520 -4328864 -4315647 -4267423 -4220862 -4239348 -4254052 -4236289 -4190644 -4162385 -4158017 -4161086 -4139761
12082 -4139761 -4105756 -4041176 -4012786 -3992377 -3978148 -3968911 -3950926 -3902593 -3885508 -3841695 -3801224
12071 -3801224 -3770521 -3758142 -3767539 -3774494 -3747348 -3701154 -3666363 -3644626 -3649611 -3639591 -3618169 -3606574
12059 -3606574 -3597395 -3558885 -3521168 -3502051 -3515113 -3526279 -3512764 -3498510 -3498572 -3496997 -3491279 -3486989 -3470943
12046 -3470943 -3440724 -3432149 -3411073 -3371201 -3359401 -3349379 -3310301 -3261416 -3242723 -3265530 -3278422
12035 -3278422 -3302361 -3290274 -3225682 -3207537 -3198158 -3173883 -3161383 -3171110 -3171190 -3177684 -3149670 -3114838
12023 -3114838 -3077236 -3078368 -3036792 -3025787 -3003310 -2981882 -2977325 -2978215 -2972874 -2955531 -2952464 -2961056 -2927432
12010 -2927432 -2907751 -2902897 -2894861 -2871554 -2868644 -2849541 -2821766 -2795353 -2767827 -2761174 -2772868 -2783614
11998 -2783614 -2794919 -2773786 -2723099 -2699009 -2698934 -2666044 -2647389 -2629972 -2610435 -2578622 -2562077 -2559058
11986 -2559058 -2560150 -2534803 -2471493 -2444920 -2409151 -2378233 -2450127 -2686383 -2845963 -2865591 -2825369
11975 -2825369 -2797129 -2764706 -2707292 -2675258 -2656121 -2641313 -2618415 -2586262 -2566392 -2578005 -2569762
11964 -2569762 -2575009 -2558874 -2521077 -2503996 -2496813 -2472348 -2443356 -2430377 -2427000 -2421345 -2394616 -2378705
11952 -2378705 -2366193 -2384830 -2409459 -2424129 -2445888 -2461480 -2463436 -2446314 -2417559 -2395785 -2340062
11941 -2340062 -2305479 -2293233 -2258232 -2255948 -2278833 -2291393 -2259593 -2228136 -2203706 -2210498 -2217425 -2231946
11929 -2231946 -2239998 -2253976 -2276235 -2279052 -2269988 -2265899 -2257763 -2231513 -2207349 -2203365 -2213860 -2189601
11917 -2189601 -2178922 -2167247 -2137735 -2118547 -2120530 -2118673 -2088288 -2067074 -2057608 -2064809 -2042364 -2011737
11905 -2011737 -2021545 -2039383 -2051805 -2056759 -2067126 -2088608 -2100734 -2084552 -2056513 -2056400 -2057672 -2057213 -2053518
11892 -2053518 -2039017 -2003431 -1968238 -1966168 -1960969 -1933937 -1907865 -1905611 -1905044 -1908829 -1920194 -1925728 -1936038
11879 -1936038 -1961586 -1988714 -1997505 -2009462 -1997524 -2000637 -1996727 -1991933 -1967222 -1953616 -1931677 -1909372
11867 -1909372 -1901151 -1895578 -1893376 -1890018 -1860218 -1839280 -1817830 -1806032 -1814806 -1834546 -1838750 -1829602 -1859948
11854 -1859948 -1870039 -1863100 -1850472 -1859881 -1858678 -1831926 -1803548 -1777687 -1750304 -1749971 -1760318 -1747141
11842 -1747141 -1737300 -1706113 -1678924 -1676472 -1677431 -1677033 -1685274 -1714268 -1694025 -1686300 -1680724 -1673539 -1663505
11829 -1663505 -1660348 -1638045 -1625817 -1658067 -1669900 -1662613 -1656519 -1674360 -1668132 -1654798 -1652708 -1636157
11817 -1636157 -1633611 -1629187 -1602880 -1594963 -1596166 -1601571 -1592682 -1565437 -1553620 -1547368 -1543176 -1561610 -1573620
11804 -1573620 -1553481 -1562620 -1580158 -1585986 -1580476 -1572907 -1554738 -1536906 -1524657 -1524511 -1528525 -1549215 -1547510
11791 -1547510 -1538584 -1503984 -1490279 -1495765 -1518863 -1538110 -1511821 -1487698 -1463955 -1448251 -1440393 -1445656
11779 -1445656 -1450862 -1464972 -1459379 -1452847 -1426808 -1409020 -1399312 -1404510 -1408751 -1411949 -1396379 -1377769 -1365091
11766 -1365091 -1355206 -1335417 -1321824 -1343527 -1341569 -1346542 -1368442 -1374623 -1344538 -1343547 -1334951 -1314982 -1287623
11753 -1287623 -1267715 -1260621 -1280113 -1279489 -1282163 -1276492 -1279258 -1284681 -1281369 -1285375 -1285893 -1288708 -1288711 -1293255 -1288051
11738 -1288051 -1249170 -1220940 -1237450 -1253330 -1267349 -1267112 -1260121 -1234052 -1209042 -1211637 -1213316 -1225858
11726 -1225858 -1264009 -1264553 -1231680 -1215358 -1209937 -1188578 -1153560 -1155936 -1183919 -1195716 -1185376 -1173428
11714 -1173428 -1175760 -1156166 -1140397 -1144160 -1147770 -1128119 -1083851 -1084326 -1081065 -1077457 -1092914 -1132539 -1153539
11701 -1153539 -1139452 -1113430 -1107932 -1108358 -1099027 -1062284 -1081369 -1097000 -1062104 -1051632 -1053166 -1023831
11689 -1023831 -1022405 -1042557 -1058333 -1061931 -1046897 -1032019 -1013109 -1006248 -1011651 -1000176 -1000169 -984636 -963502
11676 -963502 -974124 -1001868 -1003255 -1002871 -1007606 -1007968 -980243 -988492 -1016614 -1011785 -984324 -979069 -985580
11663 -985580 -976589 -954137 -951975 -946649 -925350 -911102 -897146 -908570 -899268 -884255 -904357 -912333
11651 -912333 -907487 -910333 -889793 -893882 -903004 -901091 -895201 -902007 -891415 -858333 -864976 -847510 -862481
11638 -862481 -839489 -819221 -822909 -826642 -835591 -825885 -826021 -824970 -844764 -864347 -861623 -834656 -838782
11625 -838782 -832254 -810862 -803125 -793531 -792460 -786904 -767562 -756460 -766947 -781251 -789665 -766014 -754888
11612 -754888 -727282 -753803 -761633 -755300 -756297 -763067 -783052 -785731 -762697 -756830 -759600 -751283 -734646
11599 -734646 -725800 -715069 -736167 -733449 -724127 -711201 -701275 -700284 -705886 -683208 -670119 -692315 -713363
11586 -713363 -719858 -715647 -703166 -690359 -673566 -649861 -630554 -640364 -649583 -650548 -655460 -646272 -629348
11573 -629348 -633795 -607684 -599578 -619904 -644879 -661718 -654005 -648986 -642843 -603841 -589492 -590685 -582576
11560 -582576 -582384 -570986 -586724 -564065 -544297 -546475 -548065 -539797 -535819 -538873 -545839 -532530 -508841
11547 -508841 -505154 -503578 -515689 -508109 -487486 -480133 -504097 -522319 -516917 -512103 -498575 -501300 -524907
11534 -524907 -512912 -507095 -514226 -488778 -468638 -453670 -454050 -467467 -467976 -483289 -470695 -452678 -456403
11521 -456403 -458774 -474032 -484344 -473549 -461951 -441398 -444544 -456470 -460535 -456173 -457369 -450984 -447298
11508 -447298 -429926 -411702 -423036 -431332 -412366 -381029 -363648 -375219 -392844 -396013 -378715 -369493
11496 -369493 -344097 -332645 -334834 -334292 -316576 -296710 -310240 -339916 -366150 -352749 -346219 -340876
11484 -340876 -328729 -303165 -306993 -292770 -286000 -301137 -322769 -309279 -294390 -288004 -279071 -273377
11472 -273377 -265662 -254023 -244173 -261593 -256935 -236620 -244814 -267293 -266971 -260509 -266146 -265539 -259841 -255741
11458 -255741 -249616 -239086 -219507 -199776 -212219 -225593 -228766 -210390 -187248 -184038 -199550 -214249
11446 -214249 -206199 -190544 -179232 -167231 -151508 -171017 -198378 -196188 -184008 -192122 -190729 -189335
11434 -189335 -183295 -153895 -162953 -179661 -162365 -139772 -150440 -175353 -156763 -167129 -168035 -126219
11422 -126219 -98532 -79866 -102216 -127117 -141420 -155543 -162642 -163179 -148267 -127244 -118339 -103585
11410 -103585 -132705 -113274 -52008 -51646 -69742 -58343 -84728 -71523 -45996 -51808 -59209 -70350
11398 -70350 -52559 -67965 -77746 -69844 -58560 -76837 -86119 -61931 -57517 -57012 -52266 -35396 -24565
11385 -24565 -23652 -26751 -25672 -25780 -21488 -5966 -6005 2994 24483 23958 19558 9493 1958 9095 28324
11370 28324 35844 47329 57096 57437 67638 70618 62407 53253 53981 53472 52447 59755 65516 68017 60603
11355 60603 85335 108434 99249 95728 103887 100328 91140 82553 72510 66160 93055 123072 111302
11342 111302 120900 130777 104923 110279 117979 117631 115390 102861 105934 126829 136919 126722 124140
11329 124140 150342 147257 149947 158023 146086 142049 175822 190674 185782 179673 161170 164307 161493
11316 161493 186814 214817 229065 219439 208701 226590 242515 252449 253859 232914 242025 240476
11304 240476 229294 246130 268501 252516 232818 233188 224607 221661 255110 268297 271640 272040 260469
11291 260469 241296 256016 267271 261734 269676 278402 285669 284634 293077 321307 346770 332795 326365
11278 326365 326085 321129 322029 314830 303142 290299 282704 293058 301526 310092 308179 315959 314530 308139
11264 308139 306486 325969 340385 334221 325513 329777 350627 376604 398726 429669 424471 415320 431974
11251 431974 448016 438976 418225 422257 390158 364269 373991 401878 429169 441582 445318 453831
11239 453831 451964 425049 414703 433740 439680 443235 458212 459485 490661 505938 502950 496002 481452
11226 481452 457939 445355 466039 496442 501270 500052 498779 510948 533950 577741 601008 568769
11214 568769 572383 580579 546733 507599 500311 508286 518264 541839 563480 557052 541515 542080 537815
11201 537815 548964 555670 565769 583419 570597 570092 581230 603460 610738 597671 604339 611708 614554
11188 614554 597240 596757 609052 636661 630744 610190 607912 613723 624929 645669 668414 679420
11176 679420 693663 686499 679929 648191 642256 659971 661645 656606 638588 648858 664973 690505
11164 690505 697974 722506 761136 769314 724163 703666 704541 730461 757371 748923 745239 753052 742378
11151 742378 762241 777655 783155 792832 812371 800037 802788 800355 780243 783368 794833 792904 774542
11138 774542 758856 751187 759148 772840 793086 817833 834464 845222 847533 839419 830830 834876 870052
11125 870052 878161 852616 849539 861599 847143 850044 863156 860697 833296 816941 835887 841350
11113 841350 846221 859351 867274 863810 874828 879535 888014 907993 898201 901679 908700 930533 936613
11100 936613 936143 936957 931396 925395 899817 893171 922430 918045 924630 950149 985960 992447 991307 993903
11086 993903 992681 993064 973171 959270 972851 961147 963096 970963 991150 1038052 1058664 1066072 1077141
11073 1077141 1081264 1084827 1075579 1074362 1091071 1080568 1065894 1061989 1085721 1086603 1071203 1082274 1102757
11060 1102757 1096929 1080071 1057800 1086602 1104287 1123514 1122609 1110943 1110963 1109624 1127954 1132093 1133224
11047 1133224 1147495 1170772 1169677 1153562 1173640 1203530 1217947 1249007 1237904 1220612 1193803
11036 1193803 1198142 1199342 1218780 1229036 1240251 1254623 1255673 1251033 1234746 1235184 1247024 1259366
11024 1259366 1264833 1273312 1252276 1246938 1281018 1315040 1336760 1347830 1338652 1331895 1344359 1345884
11012 1345884 1332704 1319512 1303522 1332787 1341492 1328063 1322758 1336156 1331819 1336027 1340094 1360701
11000 1360701 1365114 1389969 1411859 1379548 1372325 1385792 1400841 1423210 1437493 1447937 1442313 1461964
10988 1461964 1472439 1447706 1443422 1448946 1448468 1431322 1462215 1480298 1483631 1480180 1474037 1479847 1482786
10975 1482786 1473553 1471646 1509030 1533953 1509512 1499983 1508704 1499139 1518954 1555553 1575381 1580112
10963 1580112 1593414 1594594 1596076 1597867 1598747 1599705 1582656 1592158 1599078 1600487 1602331 1626782 1655635
10950 1655635 1670467 1674764 1670743 1684353 1697981 1700173 1693327 1688212 1673694 1670008 1683986 1699151
10938 1699151 1721149 1721450 1699821 1716272 1749082 1736629 1765181 1768101 1743917 1755389 1772476 1789635
10926 1789635 1824920 1823512 1801755 1812118 1841919 1847874 1852966 1841069 1853529 1846241 1828955 1860845
10914 1860845 1913693 1944431 1968022 1978643 1994376 1993520 1985309 1985410 1972585 1955790 1952772 1973056
10902 1973056 1995169 2006963 2018764 2035774 2061772 2086510 2114463 2151054 2154771 2178033 2175367 2178049
10890 2178049 2185538 2209307 2259451 2298562 2312501 2329735 2357809 2409149 2473213 2550906 2626951
10879 2626951 2703430 2807424 2897054 2896224 2689402 2245520 1714518 1352152 1239222 1258011
10869 1258011 1326854 1423663 1504933 1538024 1568647 1637360 1721415 1781967 1827809 1868907 1891861
10858 1891861 1884049 1891285 1907495 1928303 1960707 1990534 1998938 2011955 2039624 2070781 2091443 2089592
10846 2089592 2108463 2125614 2126034 2117514 2123944 2140508 2149746 2173045 2182087 2201934 2202780 2224329 2229526
10833 2229526 2231262 2243657 2275011 2290956 2312841 2307487 2317947 2321895 2331576 2320380 2323598 2347696
10821 2347696 2362909 2377420 2398129 2397526 2397965 2415394 2457524 2480899 2476244 2471724 2482396 2499489
10809 2499489 2503401 2512711 2503772 2514187 2520486 2511267 2519072 2542501 2552267 2546225 2564742 2587226 2620488
10796 2620488 2633369 2647067 2658691 2667276 2684736 2685683 2701707 2690424 2720029 2731931 2738952 2741480
10784 2741480 2747169 2778945 2793823 2822379 2836496 2851540 2869889 2877932 2881968 2906367 2897238 2904641
10772 2904641 2934408 2942167 2947366 2973322 2989576 2965715 2929410 2911379 2926863 2942057 2955773 2989075
10760 2989075 2995322 2992972 2969161 2961991 3009627 3029673 3064047 3067680 3084447 3101605 3124726 3149393
10748 3149393 3165597 3172238 3168149 3193702 3220628 3224089 3225389 3240213 3256631 3295410 3320403 3319152
10736 3319152 3325645 3334318 3356783 3390553 3421835 3464623 3475002 3457355 3457820 3486567 3503718 3499009
10724 3499009 3509683 3529578 3548973 3575256 3605625 3632942 3667171 3691506 3739087 3743057 3732747
10713 3732747 3704527 3684267 3703022 3726012 3723951 3734544 3726290 3670725 3642399 3660118 3687818 3711497
10701 3711497 3744850 3790014 3815495 3820292 3848652 3878068 3913708 3941670 3944117 3955832 3949556 3965571
10689 3965571 4011989 4055142 4048206 4054370 4071852 4103257 4133120 4153350 4173724 4181878 4187359 4221538
10677 4221538 4231902 4230693 4242243 4262112 4299186 4344849 4376733 4395076 4422242 4444526 4460285
10666 4460285 4490637 4558549 4611537 4640107 4636583 4644516 4653820 4672553 4671396 4687644 4705995 4723055
10654 4723055 4779078 4827375 4866430 4934641 4963826 4994606 5034895 5069582 5079661 5082689 5086974 5108124
10642 5108124 5142734 5179748 5234213 5292089 5323167 5344042 5355701 5379519 5372997 5382426 5397469 5409564
10630 5409564 5443911 5481456 5496008 5507397 5530066 5559677 5597956 5646304 5702287 5743201 5752248
10619 5752248 5799588 5844227 5868963 5903452 5951232 5963268 5963420 6002829 6079398 6128575 6140260 6176341
10607 6176341 6234540 6278863 6326284 6363548 6402104 6442915 6487906 6532902 6598057 6629290 6654303
10596 6654303 6694382 6759857 6818054 6830848 6848424 6861202 6911791 6984936 7008294 7027009 7057385
10585 7057385 7129113 7210278 7299803 7452550 7634597 7801168 7904936 7942858 7968349 8003855
10575 8003855 8046649 8109062 8152064 8192071 8260530 8339120 8380148 8437172 8497435 8589850 8673140
10564 8673140 8737218 8823475 8911748 8988152 9067715 9164033 9240250 9334055 9431146 9512096 9578531
10553 9578531 9627877 9688794 9776269 9889326 10005019 10126548 10236362 10348886 10471857 10598387
10543 10598387 10706763 10826858 10946091 11076414 11230000 11367276 11530355 11641839 11747946
10534 11747946 11908383 12033474 12152692 12301831 12477992 12615331 12771770 12941354 13130185
10525 13130185 13348477 13550420 13755971 13958144 14156119 14347706 14584956 14831304 15082376
10516 15082376 15326377 15557413 15806634 16050930 16298908 16565971 16878354 17203488 17498157
10507 17498157 17811385 18137178 18487227 18852707 19236970 19668280 20094183 20478363 20878194
10498 20878194 21373703 21901037 22465471 23035683 23603284 24197451 24815524 25487482 26182728
10489 26182728 26923962 27742899 28657792 29653520 30695841 31825249 33005841 34221514 35458183
10480 35458183 36822684 38330117 40026316 41904408 43878568 45881668 47880035 50015836
10472 50015836 52598730 55735697 59453573 63784775 68777545 74558781 81360351 89381078
10464 89381078 98958662 110471883 124441161 141156747 159571361 174848941 172558867
10457 172558867 126158166 24401132 -85690658 -147532584 -161164514 -152463444 -137876084
10450 -137876084 -123393625 -110612839 -99689678 -90445133 -82579672 -75794609 -69900744
10443 -69900744 -64772325 -60251474 -56237341 -52776153 -49887818 -47559935 -45605356 -43731409
10435 -43731409 -41802389 -39913628 -38119243 -36452534 -34859932 -33362319 -32044148 -30873341
10427 -30873341 -29795071 -28800582 -27860001 -26975182 -26122509 -25288420 -24531715 -23849818 -23184702
10418 -23184702 -22516478 -21866923 -21274420 -20714423 -20196341 -19700859 -19199000 -18705403 -18220669
10409 -18220669 -17784330 -17381323 -16976713 -16605188 -16257347 -15919678 -15602515 -15297558 -15005815
10400 -15005815 -14690817 -14381400 -14090630 -13834375 -13575869 -13319908 -13089322 -12854575 -12602950
10391 -12602950 -12379956 -12146921 -11935494 -11762633 -11613612 -11426321 -11232167 -11027888 -10855990
10382 -10855990 -10698466 -10524493 -10340845 -10165427 -10024002 -9866003 -9700156 -9533753 -9377615
10373 -9377615 -9239883 -9142113 -9013705 -8903082 -8783712 -8659474 -8516647 -8374379 -8237328 -8120268
10363 -8120268 -8017858 -7934192 -7810270 -7678684 -7594047 -7500269 -7382751 -7273171 -7193002 -7116330
10353 -7116330 -7022743 -6955849 -6898813 -6828485 -6724588 -6611288 -6515053 -6407037 -6297927 -6214218
10343 -6214218 -6119429 -6024762 -5935168 -5849241 -5782899 -5704818 -5610365 -5477637 -5345553 -5240296 -5176175
10332 -5176175 -5167936 -5227064 -5348385 -5462927 -5495778 -5445845 -5382327 -5292280 -5185168 -5095333 -5036810
10321 -5036810 -4970472 -4915541 -4842805 -4754333 -4681666 -4642129 -4591685 -4513470 -4459506 -4402567 -4324804
10310 -4324804 -4275017 -4266283 -4227370 -4168952 -4108176 -4081421 -4061604 -4001845 -3933105 -3873936 -3833162
10299 -3833162 -3776574 -3713360 -3658015 -3609899 -3555347 -3528672 -3502293 -3450644 -3402559 -3334760 -3260707
10288 -3260707 -3218517 -3181034 -3175328 -3157239 -3102469 -3043057 -2985494 -2917176 -2876704 -2832044 -2780458
10277 -2780458 -2696104 -2618445 -2581032 -2519073 -2483065 -2461483 -2430045 -2422083 -2373984 -2308347 -2232228
10266 -2232228 -2177015 -2117528 -2075353 -2052939 -2016865 -2001253 -1967815 -1912643 -1864173 -1809424 -1767463
10255 -1767463 -1701203 -1633190 -1575491 -1527348 -1457214 -1385534 -1309316 -1251751 -1210651 -1148323 -1066680
10244 -1066680 -997441 -936611 -871666 -782243 -706878 -591238 -444828 -327915 -221129 -92360
10234 -92360 31046 140994 289619 431835 583358 744431 907138 1107018 1381349 1713432
10224 1713432 2080491 2534874 3048909 3655081 4385454 5261086 6222001 6989170 6943749 5145384
10214 5145384 1103419 -4034556 -8002829 -9786210 -9918845 -9340343 -8591163 -7868890 -7247485
10205 -7247485 -6761327 -6341132 -5896131 -5506562 -5218122 -4956832 -4754686 -4552779 -4375997
10196 -4375997 -4218976 -4075372 -3943432 -3809820 -3680863 -3564800 -3462857 -3385307 -3293956 -3207850
10186 -3207850 -3132144 -3048989 -2960160 -2881381 -2814781 -2735255 -2661294 -2598372 -2539473 -2493719 -2452762
10175 -2452762 -2400505 -2348728 -2281832 -2223408 -2190686 -2124112 -2057373 -2015249 -1982702 -1948376 -1921843
10164 -1921843 -1882649 -1845524 -1822773 -1800897 -1782409 -1748642 -1715913 -1680585 -1663022 -1633221 -1637186
10153 -1637186 -1606495 -1575771 -1553108 -1488326 -1466281 -1454834 -1411125 -1354419 -1299529 -1268280 -1202567
10142 -1202567 -1147284 -1109455 -1077296 -1060561 -1044962 -1021535 -986683 -958326 -935707 -913639 -909755
10131 -909755 -882175 -861971 -839993 -814297 -802061 -769374 -712422 -656640 -618303 -613625 -591739 -560859
10119 -560859 -552347 -554925 -531364 -507920 -452594 -405976 -365591 -337833 -329107 -312744 -298407 -286432
10107 -286432 -235094 -213195 -193631 -160553 -157652 -154143 -131297 -85078 -39736 -12158 11674 25634
10095 25634 40091 52383 75579 115145 126549 144796 166106 190210 195549 230741 263012 292543
10083 292543 288592 298559 312908 331949 388723 472915 518773 553627 581493 583809 587979 615674
10071 615674 612091 602995 623010 673838 723071 750208 795905 852724 893067 888569 911958 966975
10059 966975 986727 987271 1017910 1032794 1056565 1099860 1151989 1196661 1244640 1292553 1334638 1369312
10047 1369312 1409101 1475462 1509676 1560575 1639950 1698537 1753414 1832563 1915427 2010954 2122066
10036 2122066 2233636 2303202 2283289 2086488 1675248 1207721 899881 804335 846251 930535
10026 930535 1027047 1131378 1223229 1305295 1376458 1426696 1497929 1573269 1635833 1678643 1750853
10015 1750853 1808178 1871441 1923713 1967108 2002451 2030294 2038764 2073992 2150024 2223663 2284045
10004 2284045 2323641 2356029 2384343 2436954 2477476 2548693 2613633 2653456 2677991 2728088 2791390
9993 2791390 2830530 2866322 2921860 3014934 3063138 3086646 3152002 3200998 3238423 3271920 3321702
9982 3321702 3363376 3436176 3523291 3568208 3611194 3683691 3745976 3812753 3882636 3967689 4050906
9971 4050906 4143750 4218087 4286449 4357608 4445804 4544068 4620713 4701851 4792922 4894680 4987013
9960 4987013 5085682 5200920 5312368 5419551 5560905 5726864 5859417 6007013 6191903 6380462
9950 6380462 6562851 6789793 7018860 7235770 7475965 7737141 8007465 8274707 8511915 8719464
9940 8719464 8906346 9025644 8987055 8770333 8466793 8163801 7944132 7829554 7764621 7729931
9930 7729931 7584977 7229358 6708276 6212805 5971371 6078806 6421007 6953013 7580792 8236719
9920 8236719 8890122 9502799 9996978 10374079 10467764 10284406 9843572 9242542 8555037 7902942
9910 7902942 7490351 7311388 7206719 6880932 6158431 5076018 3923938 3062774 2752851
9901 2752851 3032018 3687082 4505520 5288704 5909181 6264196 6358698 6350879 6369471 6375623 6205626
9890 6205626 5863998 5457744 4982713 4423883 3798707 3369898 3141024 2957454 2704140 2460053
9880 2460053 2370090 2599698 3173813 3960808 4743572 5306417 5577485 5533716 5250833 4797279
9870 4797279 4408392 4261582 4314603 4403663 4387538 4191354 3770064 3112495 2370200 1845852
9860 1845852 1772839 2172397 2953764 3912265 4868643 5680498 6245854 6364023 6018425 5332711
9850 5332711 4588570 3988182 3540021 3244631 3127323 3090415 2906639 2432038 1815845 1129802
9840 1129802 506808 124251 193472 749672 1683062 2829685 4035655 5114286 5858639
9831 5858639 6070536 5600379 4491314 3166399 2017557 1177996 660646 423645 312224
9822 312224 118631 -413147 -1298139 -2258766 -2989233 -3309487 -3100863 -2386164 -1351249 -310822
9812 -310822 398612 595338 403708 97391 -187955 -506792 -1052858 -1877832 -2832791 -3688151
9802 -3688151 -4441655 -5199807 -5798815 -6122351 -6249216 -6377203 -6529200 -6438208 -5953677 -5124327
9792 -5124327 -4025251 -2871025 -2010205 -1740868 -2284438 -3598415 -5230640 -6675372 -7619089
9783 -7619089 -8072298 -8352720 -8798405 -9575861 -10640781 -11811942 -12858802 -13569734 -13896853
9774 -13896853 -13787083 -13287046 -12552389 -11643325 -10659405 -9685750 -8762550 -8026658 -7608252
9765 -7608252 -7609771 -8027456 -8703756 -9355516 -9809732 -10029182 -10145230 -10298780 -10600257 -11064642
9755 -11064642 -11624699 -12143860 -12450332 -12511346 -12405240 -12180145 -11869040 -11498563 -11092569 -10661266
9745 -10661266 -10261428 -9894065 -9533274 -9221838 -8914360 -8638647 -8398111 -8183915 -7970964
9736 -7970964 -7786958 -7618221 -7419637 -7249121 -7099100 -6946422 -6793193 -6666800 -6557255 -6440389
9726 -6440389 -6306037 -6154728 -6017198 -5893316 -5776989 -5659360 -5560992 -5441940 -5323606 -5213145
9716 -5213145 -5125444 -5033899 -4935481 -4831099 -4748282 -4633356 -4529921 -4442025 -4339338 -4240202 -4131182
9705 -4131182 -4040138 -3965718 -3880509 -3812602 -3734676 -3675748 -3607357 -3513546 -3427567 -3369240 -3312468
9694 -3312468 -3249690 -3209268 -3169000 -3126516 -3061465 -2989758 -2958511 -2893473 -2820502 -2776866 -2707830
9683 -2707830 -2651833 -2608141 -2523364 -2438811 -2360605 -2307113 -2249271 -2220644 -2152639 -2065987 -2001788
9672 -2001788 -1945034 -1877938 -1812472 -1788302 -1760791 -1704077 -1626148 -1561969 -1514989 -1488143 -1445019
9661 -1445019 -1377732 -1330483 -1261189 -1182522 -1102379 -1007592 -930230 -867985 -804487 -744440 -688027
9650 -688027 -627025 -565038 -515490 -493275 -472543 -449762 -418560 -361121 -331001 -313378 -278352 -206833
9638 -206833 -119311 -13909 80239 175833 259360 351633 454005 561513 682132 777307 858367
9627 858367 920161 959029 1007845 1076199 1158610 1236609 1296289 1357389 1426727 1485983 1574705 1673959
9615 1673959 1801527 1917298 2053331 2197777 2349770 2531414 2669601 2812895 2966879 3089543
9605 3089543 3227992 3401674 3580551 3745626 3941741 4145753 4362525 4592071 4830742 5109268
9595 5109268 5416971 5756954 6136501 6493042 6846630 7209360 7628807 8062314 8538923 8964775
9585 8964775 9109205 8711423 7633087 6059875 4474522 3098839 1852258 769606 38665
9576 38665 -193892 -27630 375423 918270 1539917 2185269 2828634 3505943 4171236 4844880
9566 4844880 5496723 6111563 6666528 7043351 7174642 6947682 6330454 5398327 4343667
9557 4343667 3419623 2660436 1879151 1083375 447490 185778 307337 768486 1489851 2358946
9547 2358946 3269679 4190632 5107256 6023764 6965051 7920023 8880280 9768850 10493434 10893207
9537 10893207 10618404 9451438 7594379 5480582 3265456 809347 -1722987 -3910822
9529 -3910822 -5349680 -5928745 -5726745 -5031456 -4067877 -3007200 -1918532 -785264 434096
9520 434096 1684165 2899895 4058750 5128592 5966951 6370079 6139693 5162388 3671281
9511 3671281 2055282 665068 -611635 -2112179 -4012417 -5912477 -7297096 -7916794
9503 -7916794 -7791765 -7156362 -6371236 -5760407 -5409578 -5299052 -5247622 -5098025 -4721868 -4231239
9493 -4231239 -3848466 -3645678 -3566075 -3534599 -3521928 -3550858 -3682326 -4005752 -4572646 -5380797
9483 -5380797 -6217217 -6823865 -7058871 -6837035 -6252376 -5499966 -4825872 -4393034 -4243399 -4350939
9473 -4350939 -4581303 -4742757 -4726622 -4554060 -4348113 -4202339 -4193329 -4360893 -4617444 -4786938
9463 -4786938 -4785159 -4772048 -4980638 -5455348 -6063662 -6551115 -6710230 -6449745 -5903288 -5352096
9453 -5352096 -5084334 -5322539 -6062232 -7136744 -8186754 -8992368 -9667209 -10448821 -11358308
9444 -11358308 -12155392 -12641329 -12716111 -12372587 -11723379 -10941840 -10143769 -9379233 -8577048 -7761609
9434 -7761609 -6943813 -6149103 -5374142 -4660413 -4096652 -3835092 -4110792 -4980788 -6332461
9425 -6332461 -7883311 -9299529 -10604925 -11925310 -13088102 -13801017 -13930377 -13647474 -13115462
9416 -13115462 -12514479 -11923965 -11350448 -10765707 -10158883 -9548800 -8954215 -8347001 -7784727
9407 -7784727 -7278321 -6918161 -6790364 -6952412 -7338970 -7817452 -8238758 -8702848 -9267624 -9887800
9397 -9887800 -10431429 -10806467 -10951394 -10872661 -10604354 -10258428 -9884689 -9485452 -9071457 -8646626
9387 -8646626 -8236411 -7833680 -7426084 -7019621 -6640527 -6342934 -6219995 -6353712 -6756602 -7376274
9377 -7376274 -8089480 -8848574 -9735207 -10682237 -11353373 -11590879 -11533527 -11301167 -11006973 -10729541
9367 -10729541 -10486385 -10257320 -10026977 -9804952 -9594846 -9367952 -9146028 -8956878 -8839457
9358 -8839457 -8712562 -8591974 -8474239 -8344122 -8219249 -8105390 -7984859 -7876996 -7778501 -7686303
9348 -7686303 -7592580 -7522927 -7445492 -7378099 -7323640 -7233287 -7132232 -7045345 -7012311 -6933860 -6863361
9337 -6863361 -6793480 -6727950 -6665686 -6613397 -6539105 -6479524 -6438207 -6398447 -6350632 -6301233 -6236684
9326 -6236684 -6178545 -6129158 -6097123 -6056402 -6011258 -5967620 -5907381 -5894612 -5858676 -5818313 -5782855
9315 -5782855 -5722202 -5669264 -5649335 -5628239 -5583327 -5531502 -5509495 -5473804 -5434561 -5415124 -5364185
9304 -5364185 -5326829 -5289674 -5245310 -5195267 -5174078 -5179620 -5133606 -5073850 -5054625 -5023603 -5019684 -4992369
9292 -4992369 -4976726 -4969634 -4925918 -4881557 -4854802 -4834330 -4804305 -4785078 -4750247 -4704370 -4663787 -4654903
9280 -4654903 -4641781 -4631554 -4610542 -4599496 -4590121 -4541065 -4468441 -4443246 -4435586 -4424803 -4410551 -4381247
9268 -4381247 -4361720 -4325897 -4308652 -4271002 -4221000 -4211084 -4212837 -4175153 -4149936 -4134597 -4133536 -4090031
9256 -4090031 -4048397 -4020607 -4009531 -3983475 -3990034 -3982352 -3973254 -3939342 -3920349 -3895110 -3863252 -3833169
9244 -3833169 -3786440 -3765922 -3755087 -3733279 -3690706 -3673819 -3679857 -3653916 -3619496 -3606999 -3607008 -3614613 -3586444
9231 -3586444 -3528351 -3491900 -3486185 -3482064 -3469258 -3444700 -3418726 -3378466 -3361207 -3339403 -3325401 -3308667
9219 -3308667 -3293425 -3298395 -3271223 -3240301 -3216607 -3201136 -3186056 -3183612 -3173143 -3153708 -3100818 -3087351
9207 -3087351 -3060191 -3037075 -3048761 -3045623 -3012447 -2988719 -2965099 -2930722 -2930918 -2929637 -2902596 -2861404
9195 -2861404 -2837667 -2804214 -2776487 -2754471 -2759555 -2768780 -2731840 -2676966 -2682434 -2669299 -2619300 -2596879
9183 -2596879 -2583258 -2546657 -2535580 -2524043 -2513819 -2504832 -2485446 -2439152 -2399577 -2407823 -2413738 -2414826
9171 -2414826 -2401691 -2360530 -2347483 -2331725 -2322306 -2285679 -2282511 -2277002 -2269726 -2232542 -2207706 -2179200
9159 -2179200 -2157956 -2141417 -2091745 -2057576 -2014556 -1990214 -1991349 -2000931 -1979094 -1951121 -1903994 -1874480
9147 -1874480 -1852671 -1828997 -1814039 -1814510 -1799772 -1797964 -1785932 -1772701 -1743370 -1723427 -1690592 -1653109
9135 -1653109 -1603559 -1574403 -1578010 -1545871 -1493364 -1479736 -1473805 -1439992 -1417406 -1394772 -1390454 -1352437
9123 -1352437 -1311663 -1303183 -1295473 -1287040 -1268048 -1260542 -1273515 -1284526 -1259940 -1213520 -1176576 -1146195
9111 -1146195 -1111510 -1089148 -1041854 -995513 -969533 -976311 -951232 -894570 -846321 -808796 -770615 -782829
9099 -782829 -787150 -767125 -748222 -711173 -689182 -685953 -660717 -634226 -618610 -587101 -569998 -546295
9087 -546295 -511430 -462063 -420699 -390111 -344048 -333255 -330434 -284674 -242273 -244936 -233584 -204056
9075 -204056 -186355 -155537 -137454 -118471 -91519 -77013 -64061 -51773 -37820 -32915 3084 31375
9063 31375 58155 83265 110176 111156 112979 114802 131376 128138 104192 98735 97703 119361 124849
9050 124849 108819 89362 61879 48513 40578 35094 16471 -5963 -3146 1331 -36362 -85405
9038 -85405 -129153 -186706 -259573 -307088 -375490 -451242 -514915 -590038 -698780 -796104 -896358
9027 -896358 -995729 -1102654 -1221985 -1299277 -1379506 -1478455 -1625023 -1760924 -1879744 -2013857
9017 -2013857 -2157318 -2315647 -2475353 -2617089 -2791192 -2936820 -3073137 -3206313 -3361743 -3506089
9007 -3506089 -3681275 -3874686 -4051310 -4207919 -4329377 -4471388 -4594358 -4745345 -4904306 -5037103
8997 -5037103 -5152811 -5284255 -5405040 -5520364 -5632007 -5722631 -5810230 -5904421 -5995758 -6129872
8987 -6129872 -6244865 -6306787 -6373386 -6447714 -6524628 -6597531 -6653839 -6719624 -6751374 -6796184 -6831665
8976 -6831665 -6860811 -6899195 -6924717 -6929588 -6955019 -6950910 -6952037 -6981155 -7006000 -7005257 -7005321 -7005179 -7003729 -7020447
8962 -7020447 -7022800 -6999190 -6987215 -7018829 -7034876 -7039900 -7032032 -7011413 -6996692 -6952775 -6934886 -6921651
8950 -6921651 -6881519 -6852664 -6843772 -6826895 -6799344 -6774866 -6762387 -6741597 -6727900 -6730991 -6732675 -6705976
8938 -6705976 -6657469 -6612837 -6579866 -6557271 -6529326 -6499064 -6474561 -6437976 -6433767 -6436635 -6422108 -6364638
8926 -6364638 -6329370 -6316119 -6297347 -6259464 -6242812 -6222377 -6193149 -6175637 -6144758 -6116981 -6104571
8915 -6104571 -6076194 -6024297 -5964784 -5918936 -5890675 -5885420 -5873163 -5870309 -5847170 -5820562 -5802561 -5780453
8903 -5780453 -5755783 -5731568 -5691978 -5649354 -5627416 -5638920 -5622097 -5593896 -5552102 -5544379 -5507570 -5466596
8891 -5466596 -5449960 -5441295 -5415598 -5386679 -5334693 -5312682 -5272923 -5228674 -5181890 -5125634 -5062490 -4974127
8879 -4974127 -4866964 -4757011 -4673387 -4649331 -4781647 -5212682 -5699921 -5912126 -5919415 -5855319
8869 -5855319 -5774936 -5693119 -5631570 -5560263 -5485452 -5438673 -5404505 -5391681 -5362989 -5339922 -5313255
8858 -5313255 -5281204 -5237414 -5218736 -5218191 -5207816 -5166366 -5135118 -5121980 -5121979 -5105260 -5079037 -5060600 -5041583
8845 -5041583 -5034965 -5003772 -4986939 -4978804 -4952514 -4913084 -4883190 -4859844 -4851974 -4852606 -4844648 -4813211 -4763743
8832 -4763743 -4753529 -4778399 -4786254 -4785756 -4776631 -4752450 -4737375 -4725674 -4735631 -4736872 -4729162 -4687095 -4653196
8819 -4653196 -4637577 -4638589 -4606654 -4591610 -4585790 -4578408 -4580336 -4576918 -4557096 -4553822 -4542143 -4499511 -4497016
8806 -4497016 -4500991 -4478357 -4443472 -4418357 -4440401 -4457486 -4447980 -4449084 -4452440 -4430925 -4426899 -4415397
8794 -4415397 -4399671 -4371742 -4354582 -4336056 -4346839 -4366198 -4367643 -4343853 -4326338 -4291520 -4260975 -4240159
8782 -4240159 -4261758 -4280460 -4266118 -4253477 -4242899 -4242106 -4230151 -4215885 -4188581 -4155040 -4148562 -4158840
8770 -4158840 -4157128 -4117448 -4095463 -4141963 -4161213 -4149575 -4128178 -4091698 -4106733 -4132895 -4132854 -4101678
8758 -4101678 -4089708 -4087110 -4059183 -4061509 -4100380 -4105816 -4087673 -4062913 -4049927 -3999377 -3985498 -4014797
8746 -4014797 -4002360 -3998546 -4005409 -3998394 -3983314 -3988478 -3999396 -3978400 -3979274 -3957908 -3926187 -3896013 -3873509
8733 -3873509 -3875890 -3901044 -3907332 -3879411 -3869443 -3845502 -3841748 -3838612 -3833233 -3828090 -3835888 -3834044 -3817046
8720 -3817046 -3812811 -3820218 -3827744 -3809602 -3780477 -3777189 -3771332 -3751614 -3737615 -3727669 -3725144 -3743991 -3742929
8707 -3742929 -3719813 -3694020 -3694426 -3687478 -3692762 -3673754 -3678194 -3664636 -3669253 -3664624 -3648169 -3640283 -3664882
8694 -3664882 -3658350 -3648967 -3668231 -3672277 -3633504 -3604161 -3612673 -3611610 -3606219 -3589151 -3573024 -3572311 -3607115
8681 -3607115 -3596513 -3572427 -3576137 -3570883 -3545023 -3525383 -3523900 -3529215 -3536875 -3532912 -3531662 -3538115 -3534637
8668 -3534637 -3521305 -3518986 -3513077 -3533730 -3538551 -3488411 -3476016 -3479569 -3466120 -3460953 -3479382 -3461017
8656 -3461017 -3447465 -3449470 -3434082 -3446561 -3450519 -3450193 -3430883 -3409771 -3406277 -3413930 -3411277 -3399443 -3414349
8643 -3414349 -3437769 -3432142 -3392160 -3386381 -3372589 -3384438 -3393038 -3377894 -3361713 -3357575 -3377240 -3399757
8631 -3399757 -3402878 -3383478 -3361261 -3348824 -3349230 -3332562 -3335922 -3333798 -3311896 -3303100 -3300706 -3318643 -3325999
8618 -3325999 -3327221 -3317283 -3304197 -3276948 -3231254 -3204063 -3209543 -3198211 -3216166 -3222151 -3208144 -3210354
8606 -3210354 -3234622 -3258802 -3240035 -3233721 -3203888 -3206263 -3214324 -3214372 -3208945 -3211290 -3219749 -3232790 -3247751
8593 -3247751 -3260395 -3260450 -3265878 -3268005 -3262228 -3261879 -3260498 -3263924 -3267617 -3256247 -3247802 -3248298 -3253118 -3250206 -3234092
8578 -3234092 -3234389 -3226469 -3206230 -3196999 -3189585 -3188717 -3179209 -3173999 -3181520 -3184940 -3172893 -3174011 -3163910 -3138413
8564 -3138413 -3163367 -3179411 -3178114 -3185220 -3173437 -3156751 -3148562 -3144821 -3151801 -3147849 -3148246 -3142392 -3141345
8551 -3141345 -3140922 -3096604 -3094370 -3082912 -3082010 -3087582 -3102350 -3105497 -3102490 -3101609 -3084106 -3091390 -3091649 -3059268
8537 -3059268 -3051066 -3036634 -3028683 -3019818 -3020988 -3025952 -3030176 -3018447 -3021877 -3045138 -3055943 -3054152 -3036973
8524 -3036973 -3023838 -3037982 -3035059 -3041188 -3046643 -3043735 -3011646 -3003554 -3000331 -2990256 -2995331 -2988994 -2965615
8511 -2965615 -2966262 -2981381 -2976380 -2947987 -2945617 -2945447 -2947741 -2943608 -2949885 -2970948 -2981193 -2978987 -2962193
8498 -2962193 -2947177 -2920658 -2900849 -2906662 -2902255 -2903083 -2901601 -2903714 -2910197 -2895585 -2887144 -2918491 -2909731
8485 -2909731 -2912776 -2926730 -2938119 -2937050 -2904154 -2906978 -2903302 -2887733 -2878498 -2874901 -2876895 -2861177 -2848814
8472 -2848814 -2861340 -2847913 -2848634 -2848809 -2871003 -2861104 -2830172 -2838408 -2846686 -2852396 -2831594 -2829098 -2828159 -2836025
8458 -2836025 -2845108 -2851413 -2869477 -2867253 -2850941 -2831820 -2833181 -2843120 -2823145 -2797669 -2799962 -2829705 -2831701
8445 -2831701 -2831367 -2822889 -2832661 -2816096 -2792948 -2786032 -2774043 -2797621 -2832417 -2834899 -2816927 -2778183 -2727465
8432 -2727465 -2717963 -2725644 -2734587 -2759963 -2770380 -2768241 -2742367 -2742401 -2753133 -2743687 -2733977 -2743668 -2739683 -2757371
8418 -2757371 -2744453 -2745972 -2748272 -2738485 -2731594 -2717530 -2697105 -2715371 -2724514 -2704608 -2683196 -2664237
8406 -2664237 -2652433 -2682345 -2715194 -2718958 -2713570 -2696342 -2660065 -2674119 -2704227 -2700055 -2707408 -2723522
8394 -2723522 -2735459 -2748829 -2719686 -2690749 -2678290 -2690368 -2678925 -2696546 -2693063 -2685594 -2678917 -2694207
8382 -2694207 -2708033 -2684944 -2667633 -2663612 -2668937 -2662583 -2631987 -2626286 -2618424 -2630462 -2659249 -2660302 -2641157
8369 -2641157 -2625373 -2632750 -2622447 -2592466 -2603467 -2628468 -2624638 -2598160 -2604759 -2597902 -2573132 -2568194
8357 -2568194 -2566451 -2568445 -2578005 -2606378 -2611033 -2584950 -2583133 -2604509 -2577384 -2556766 -2526288 -2527915 -2533412
8344 -2533412 -2513552 -2522951 -2530369 -2536916 -2551078 -2564527 -2556360 -2556280 -2561417 -2560622 -2577637 -2584349 -2595165 -2589633
8330 -2589633 -2585216 -2584530 -2585956 -2596694 -2599801 -2590919 -2548501 -2547556 -2550719 -2556975 -2537625 -2542713 -2557295 -2550820
8316 -2550820 -2534738 -2530589 -2543468 -2542657 -2539581 -2518834 -2536865 -2551293 -2546746 -2533369 -2527508 -2527324 -2534730
8303 -2534730 -2505578 -2484512 -2483979 -2484508 -2498676 -2502766 -2520106 -2541276 -2522628 -2538457 -2560302 -2562358 -2551898
8290 -2551898 -2532415 -2546648 -2533595 -2488225 -2476054 -2470214 -2493056 -2474934 -2438345 -2430256 -2429903 -2449091
8278 -2449091 -2456551 -2460824 -2473666 -2477369 -2473290 -2474192 -2491545 -2467185 -2444626 -2458645 -2475833 -2470118 -2450511
8265 -2450511 -2445345 -2458630 -2457844 -2451765 -2453634 -2459313 -2440183 -2439759 -2448628 -2422931 -2401941 -2407787 -2421187
8252 -2421187 -2441248 -2440888 -2428143 -2423059 -2417628 -2406405 -2410832 -2428330 -2424465 -2418643 -2405359 -2394236 -2373997
8239 -2373997 -2354831 -2362345 -2372139 -2377519 -2391201 -2391296 -2371421 -2344245 -2353864 -2385508 -2382478 -2377734 -2387953
8226 -2387953 -2378713 -2373162 -2375407 -2369832 -2376899 -2379939 -2388824 -2378664 -2374805 -2382772 -2377425 -2369412 -2368203 -2357755
8212 -2357755 -2352207 -2351920 -2354966 -2358133 -2339911 -2308870 -2312946 -2349294 -2381460 -2371080 -2357088 -2354871 -2369732
8199 -2369732 -2359262 -2351334 -2327177 -2332495 -2325004 -2320506 -2331743 -2336186 -2337228 -2321161 -2346149 -2341775 -2323329
8186 -2323329 -2310942 -2330929 -2327798 -2329807 -2341011 -2316473 -2295483 -2295229 -2299149 -2295756 -2279086 -2249599 -2249199
8173 -2249199 -2267379 -2299074 -2310376 -2291771 -2281194 -2281255 -2289201 -2283370 -2293362 -2298958 -2263355 -2261944 -2283463
8160 -2283463 -2287854 -2276851 -2276314 -2283569 -2281924 -2270243 -2259420 -2257228 -2264027 -2243526 -2220342 -2208523 -2210045
8147 -2210045 -2213410 -2208444 -2218962 -2256622 -2260021 -2258455 -2253287 -2251602 -2246223 -2245206 -2223110 -2216225 -2200905
8134 -2200905 -2208491 -2205878 -2193327 -2191774 -2184135 -2197555 -2238853 -2255892 -2248508 -2249894 -2262139 -2260457 -2248605
8121 -2248605 -2265670 -2270705 -2269643 -2278939 -2302890 -2280465 -2282659 -2281326 -2263801 -2254967 -2251083 -2252281 -2264337
8108 -2264337 -2253089 -2225318 -2218611 -2220023 -2202813 -2179687 -2174076 -2179528 -2184903 -2204405 -2217138 -2225327 -2229935
8095 -2229935 -2231447 -2213616 -2207416 -2175653 -2181022 -2214281 -2223307 -2199322 -2174350 -2165605 -2174431 -2161380 -2169763
8082 -2169763 -2151312 -2160574 -2178070 -2201407 -2203654 -2207631 -2199961 -2184689 -2180264 -2187181 -2200566 -2196920 -2186567
8069 -2186567 -2185942 -2199263 -2195954 -2190516 -2181824 -2176289 -2174315 -2177951 -2170749 -2151282 -2147266 -2147684 -2184189 -2192437
8055 -2192437 -2150630 -2118387 -2115538 -2162670 -2156274 -2155525 -2159997 -2142750 -2119950 -2110647 -2134138 -2153995 -2148120
8042 -2148120 -2141469 -2149173 -2142158 -2116077 -2090486 -2073241 -2057927 -2086408 -2109838 -2111793 -2101356 -2098435
8030 -2098435 -2103444 -2099216 -2105714 -2118602 -2142910 -2120166 -2110275 -2116157 -2122969 -2136428 -2154878 -2154537 -2141588
8017 -2141588 -2119160 -2099548 -2081252 -2058730 -2039101 -2044600 -2052936 -2054265 -2058456 -2062819 -2059416 -2075301 -2068028
8004 -2068028 -2045885 -2030999 -2033264 -2056574 -2062155 -2069242 -2057885 -2059605 -2096745 -2108067 -2089902 -2071576
7992 -2071576 -2056906 -2069722 -2079573 -2072893 -2059598 -2062630 -2075916 -2063575 -2039601 -2045320 -2068194 -2059510
7980 -2059510 -2051305 -2074787 -2074279 -2063863 -2054708 -2066602 -2054991 -2028773 -2023837 -2036138 -2030281 -2006196 -2003755
7967 -2003755 -2020380 -2026246 -2034819 -2036931 -2030706 -2004144 -2005493 -2017881 -2026934 -2045728 -2059024 -2054421 -2046842
7954 -2046842 -2038660 -2011513 -2012772 -2056178 -2071502 -2063510 -2082365 -2081629 -2062246 -2052816 -2070986 -2073078 -2061990
7941 -2061990 -2058166 -2054642 -2034746 -2044788 -2042241 -2040760 -2008306 -2014034 -2043150 -2031996 -2014872 -2006814 -2007988
7928 -2007988 -2010316 -2008765 -2020784 -2051070 -2069398 -2079921 -2072834 -2058889 -2059182 -2058456 -2037837 -2048824 -2071003
7915 -2071003 -2062748 -2048333 -2041035 -2048050 -2034528 -2023085 -2022164 -2026638 -2028555 -2031166 -2050883 -2050574 -2024937
7902 -2024937 -2018802 -2018741 -2015858 -1995107 -1995252 -1990330 -2002547 -2025517 -2019393 -2012015 -1989456 -1995496 -1993325 -1984137
7888 -1984137 -1995692 -2002601 -1965404 -1969044 -1984251 -1986528 -1986958 -1975165 -1984082 -2007613 -1999048 -1999450 -2000130 -1995774
7874 -1995774 -1992403 -1998562 -1988125 -1964485 -1945297 -1966554 -1988703 -1994618 -1987808 -1974679 -2003085 -2010130
7862 -2010130 -1995524 -1987023 -1968771 -1960589 -1939671 -1936480 -1953321 -1971326 -1946824 -1936824 -1948558 -1942968
7850 -1942968 -1960982 -1975260 -2002656 -2019737 -2010164 -2004750 -2009787 -1991956 -1983805 -1963043 -1933382 -1939017
7838 -1939017 -1951535 -1952488 -1961429 -1970153 -1952890 -1948075 -1969093 -1981361 -1990060 -1985249 -1982557 -1976210 -1963174
7825 -1963174 -1929896 -1925883 -1945721 -1950074 -1930899 -1934164 -1941909 -1938178 -1936359 -1946173 -1932926 -1924701 -1937885
7812 -1937885 -1951953 -1928660 -1907785 -1926970 -1933212 -1945074 -1947661 -1941986 -1923592 -1920889 -1923748 -1936291
7800 -1936291 -1947478 -1962339 -1954102 -1936665 -1938854 -1920342 -1890888 -1906112 -1922016 -1922710 -1922284 -1930122 -1936932
7787 -1936932 -1954683 -1954431 -1957169 -1954165 -1924743 -1888878 -1886275 -1880906 -1881620 -1870581 -1879804 -1882429 -1869996
7774 -1869996 -1864058 -1876724 -1866929 -1880387 -1898323 -1911437 -1902205 -1884682 -1868518 -1854801 -1868100 -1850850
7762 -1850850 -1831909 -1840894 -1863229 -1868425 -1865885 -1855597 -1883386 -1889606 -1908166 -1888618 -1872384 -1855980
7750 -1855980 -1856327 -1856345 -1869943 -1895680 -1886015 -1892027 -1882065 -1839853 -1825082 -1856876 -1880892 -1862763 -1834562
7737 -1834562 -1838525 -1818853 -1810144 -1825223 -1842520 -1853445 -1825862 -1848626 -1877305 -1874827 -1869590 -1884318
7725 -1884318 -1864591 -1864179 -1851357 -1837081 -1830499 -1816232 -1824429 -1838416 -1837133 -1840027 -1857253 -1862528 -1887929
7712 -1887929 -1872168 -1856381 -1856008 -1849191 -1826906 -1811816 -1833717 -1833373 -1835671 -1832689 -1845918 -1870633 -1856996
7699 -1856996 -1810324 -1796139 -1808442 -1809101 -1795626 -1801269 -1812585 -1823737 -1825119 -1812132 -1808488 -1832365
7687 -1832365 -1834452 -1816462 -1812787 -1810000 -1791542 -1803712 -1813735 -1796936 -1797954 -1788489 -1790037 -1784567 -1785985
7674 -1785985 -1784312 -1804305 -1808163 -1803227 -1815134 -1820088 -1797826 -1810081 -1821825 -1804200 -1804812 -1798903 -1799336
7661 -1799336 -1790168 -1794956 -1803986 -1796913 -1786669 -1800384 -1822814 -1845313 -1863347 -1848597 -1846009 -1840712 -1839062
7648 -1839062 -1842905 -1833492 -1813973 -1812414 -1797740 -1792192 -1788729 -1775009 -1754818 -1735874 -1739271 -1769358 -1774116
7635 -1774116 -1764335 -1739402 -1759498 -1766909 -1774530 -1771668 -1756502 -1739633 -1743025 -1746523 -1766212 -1785689 -1797160
7622 -1797160 -1813021 -1804203 -1797735 -1799059 -1799569 -1797439 -1782629 -1796173 -1802751 -1793717 -1770813 -1742696 -1724542
7609 -1724542 -1745440 -1764984 -1772500 -1780724 -1785774 -1799609 -1808697 -1812495 -1794402 -1759514 -1753732 -1751230 -1720638
7596 -1720638 -1721147 -1770397 -1797849 -1768759 -1758782 -1740165 -1730171 -1737902 -1744308 -1754050 -1749791 -1735779 -1728875
7583 -1728875 -1733225 -1724692 -1731039 -1715141 -1715271 -1707527 -1708673 -1707592 -1702345 -1716897 -1731523 -1736987 -1721584
7570 -1721584 -1716098 -1722563 -1745637 -1734246 -1731393 -1761092 -1759051 -1765073 -1748124 -1732569 -1726085 -1715840 -1705862
7557 -1705862 -1716912 -1716453 -1731143 -1731288 -1702926 -1689888 -1693518 -1694062 -1677921 -1684518 -1725009 -1733756 -1714753
7544 -1714753 -1695097 -1701161 -1701860 -1706421 -1717939 -1721752 -1721392 -1714860 -1715439 -1720119 -1726455 -1731935 -1727700 -1718624
7530 -1718624 -1721575 -1722668 -1722034 -1685587 -1668206 -1675493 -1687565 -1701216 -1705407 -1712547 -1707912 -1711099 -1708292
7517 -1708292 -1694489 -1663788 -1662069 -1661716 -1662984 -1680748 -1692203 -1693510 -1690242 -1708859 -1692993 -1680018 -1685224
7504 -1685224 -1692574 -1690387 -1685878 -1674355 -1684928 -1687826 -1675683 -1664643 -1650426 -1661795 -1674082 -1664235
7492 -1664235 -1644297 -1642782 -1654825 -1670694 -1692797 -1685567 -1712262 -1715257 -1708249 -1699100 -1677551 -1670318 -1656834
7479 -1656834 -1660010 -1662621 -1656223 -1651537 -1673181 -1676036 -1661479 -1678380 -1702301 -1669805 -1668633 -1667249 -1690758
7466 -1690758 -1682945 -1646682 -1652222 -1653466 -1662224 -1658458 -1676963 -1686211 -1667609 -1666649 -1671764 -1676493 -1668063 -1673133
7452 -1673133 -1668587 -1671794 -1643404 -1612922 -1610380 -1629431 -1634747 -1643020 -1659772 -1649353 -1636915 -1645283 -1638191
7439 -1638191 -1648866 -1654155 -1660452 -1649962 -1628116 -1635816 -1654796 -1648152 -1638386 -1622561 -1615830 -1605945 -1610817
7426 -1610817 -1600001 -1606280 -1652370 -1675160 -1651369 -1638831 -1645138 -1646355 -1632991 -1619316 -1649650 -1668921
7414 -1668921 -1629191 -1614498 -1620006 -1620610 -1611131 -1592478 -1588846 -1606926 -1627314 -1649324 -1645287 -1635799 -1631255
7401 -1631255 -1640668 -1651714 -1640197 -1628113 -1619007 -1643638 -1633128 -1641185 -1650682 -1644625 -1632845 -1632957 -1627937
7388 -1627937 -1612230 -1599660 -1612383 -1639342 -1644326 -1663029 -1650975 -1610328 -1592678 -1582149 -1578299 -1606367
7376 -1606367 -1611847 -1630075 -1639253 -1645043 -1635987 -1612373 -1630545 -1624346 -1609288 -1635564 -1630785 -1640416 -1632075
7363 -1632075 -1613730 -1593607 -1606808 -1611341 -1597930 -1604304 -1625390 -1623799 -1615108 -1614842 -1611542 -1615896 -1620669
7350 -1620669 -1604903 -1587872 -1567332 -1589047 -1600582 -1593889 -1595991 -1623369 -1635473 -1593580 -1573580 -1567267
7338 -1567267 -1557634 -1570322 -1588863 -1588340 -1603340 -1606917 -1594634 -1592223 -1596879 -1601671 -1593890 -1579654 -1610559
7325 -1610559 -1619694 -1607061 -1569046 -1566493 -1574062 -1586049 -1588812 -1583243 -1584456 -1587097 -1614381 -1608554 -1583113
7312 -1583113 -1583186 -1578802 -1549671 -1523035 -1545624 -1567638 -1559798 -1557660 -1574050 -1565053 -1544859 -1551656 -1547987
7299 -1547987 -1550479 -1546578 -1562803 -1559107 -1542967 -1534376 -1556062 -1572080 -1570026 -1541581 -1515297 -1505492 -1510130
7286 -1510130 -1523984 -1522498 -1525374 -1542086 -1547827 -1535808 -1530122 -1556022 -1563588 -1544458 -1554942 -1561597 -1563640
7273 -1563640 -1561593 -1556928 -1553166 -1563698 -1561270 -1541629 -1527662 -1522356 -1541222 -1551204 -1549760 -1539424 -1549363
7260 -1549363 -1576489 -1590347 -1576440 -1574465 -1561201 -1537910 -1557213 -1556095 -1538925 -1546419 -1550091 -1531202
7248 -1531202 -1549314 -1580192 -1583813 -1557904 -1545441 -1538464 -1526219 -1514022 -1492900 -1497786 -1496629 -1492758
7236 -1492758 -1529088 -1547322 -1549857 -1560448 -1555682 -1544502 -1555614 -1585969 -1570463 -1551583 -1558292 -1552943
7224 -1552943 -1533561 -1538938 -1524391 -1519117 -1529576 -1534119 -1555947 -1556383 -1540717 -1533571 -1525343 -1516019 -1504169
7211 -1504169 -1526721 -1516065 -1513986 -1516084 -1528980 -1526225 -1507476 -1523802 -1531374 -1508398 -1501328 -1510838 -1517167
7198 -1517167 -1514301 -1496769 -1498090 -1489440 -1501187 -1532578 -1531875 -1529506 -1525064 -1527980 -1511623 -1508500 -1524797
7185 -1524797 -1535357 -1534711 -1520415 -1494919 -1483464 -1506765 -1518167 -1502304 -1502820 -1505954 -1470618 -1459303
7173 -1459303 -1483438 -1491157 -1492088 -1492034 -1483692 -1491846 -1486850 -1473404 -1494057 -1515997 -1507513 -1487284 -1483453 -1470811
7159 -1470811 -1456008 -1457652 -1480042 -1503231 -1479889 -1474090 -1480383 -1477098 -1461787 -1439804 -1457990 -1509349
7147 -1509349 -1534526 -1526298 -1508654 -1517554 -1477922 -1458404 -1467716 -1482945 -1489057 -1483504 -1476792 -1468039 -1462964
7134 -1462964 -1473515 -1485833 -1487225 -1506121 -1484065 -1473436 -1472833 -1454108 -1440840 -1443291 -1459933 -1479091
7122 -1479091 -1482848 -1467778 -1455824 -1429062 -1428699 -1438538 -1454171 -1477753 -1482499 -1482761 -1469839 -1473795 -1469319
7109 -1469319 -1479730 -1467914 -1449531 -1459668 -1471715 -1438405 -1440001 -1455396 -1460238 -1461549 -1471418 -1489226
7097 -1489226 -1473749 -1472784 -1484102 -1499860 -1484725 -1454148 -1438024 -1435412 -1432836 -1429658 -1432735 -1437271 -1441916
7084 -1441916 -1439664 -1424333 -1445823 -1452875 -1452248 -1440270 -1453774 -1484672 -1493189 -1499456 -1469977 -1450089 -1435477
7071 -1435477 -1429130 -1429784 -1454386 -1449537 -1438244 -1420362 -1403303 -1386333 -1418386 -1453706 -1470287 -1474299
7059 -1474299 -1449840 -1448582 -1453506 -1450577 -1458918 -1460330 -1448824 -1433993 -1436836 -1450689 -1437740 -1437363 -1428666
7046 -1428666 -1431428 -1426717 -1393249 -1386201 -1410367 -1388921 -1400366 -1406989 -1424847 -1433083 -1428913 -1420038 -1405195
7033 -1405195 -1374168 -1377484 -1398498 -1427194 -1437461 -1442532 -1433320 -1428644 -1459247 -1470944 -1448992 -1450859
7021 -1450859 -1440966 -1413186 -1425778 -1432574 -1457618 -1441151 -1440122 -1424349 -1424593 -1434784 -1425077 -1419957 -1394199
7008 -1394199 -1391247 -1404821 -1398422 -1402270 -1423357 -1425093 -1426777 -1425868 -1428278 -1436362 -1445998 -1446560 -1433694 -1427823
6994 -1427823 -1433967 -1441015 -1442617 -1454518 -1445192 -1418659 -1415408 -1433902 -1454017 -1440594 -1420436 -1420605 -1433403
6981 -1433403 -1461394 -1480153 -1453700 -1421632 -1412481 -1436681 -1441618 -1435357 -1451345 -1458839 -1440935 -1426254
6969 -1426254 -1440580 -1430833 -1402128 -1414534 -1439146 -1437384 -1418757 -1421752 -1442880 -1413474 -1377289 -1362149
6957 -1362149 -1362614 -1376272 -1386780 -1410463 -1423956 -1435636 -1438652 -1412618 -1420261 -1417867 -1409926 -1399090 -1381538
6944 -1381538 -1380120 -1388507 -1367750 -1373340 -1369824 -1387453 -1385676 -1375451 -1385406 -1398450 -1380169 -1364333 -1365629
6931 -1365629 -1366323 -1367566 -1391990 -1399609 -1397422 -1398123 -1399044 -1399544 -1390054 -1404884 -1424754 -1419295 -1416589 -1418174
6917 -1418174 -1400573 -1378999 -1381635 -1390505 -1362003 -1343709 -1384306 -1401864 -1403595 -1410675 -1397543 -1406665
6905 -1406665 -1404583 -1396913 -1392065 -1354323 -1357006 -1381858 -1379571 -1381152 -1377741 -1381812 -1388793 -1403924 -1412884
6892 -1412884 -1399412 -1395779 -1403453 -1412119 -1413254 -1415091 -1391779 -1387006 -1409740 -1425970 -1426329 -1391147 -1382242
6879 -1382242 -1387987 -1354817 -1332885 -1338363 -1337548 -1331727 -1332710 -1358577 -1365041 -1350825 -1341505 -1355616 -1356984
6866 -1356984 -1353799 -1361091 -1364483 -1349699 -1339276 -1340084 -1346991 -1338304 -1323807 -1316970 -1338796 -1359313 -1365520
6853 -1365520 -1364573 -1359760 -1352765 -1343743 -1346124 -1351439 -1344886 -1326980 -1308774 -1328383 -1359115 -1372021 -1365488
6840 -1365488 -1354129 -1344822 -1349679 -1363272 -1365492 -1365601 -1368216 -1365357 -1349886 -1324069 -1313129 -1320815 -1348827
6827 -1348827 -1367089 -1368605 -1346752 -1331628 -1357905 -1377532 -1381059 -1362915 -1359853 -1346610 -1347318 -1339011 -1340534
6814 -1340534 -1326701 -1329244 -1347341 -1349310 -1338505 -1332517 -1325287 -1336965 -1342819 -1369102 -1366771 -1336925 -1297925
6801 -1297925 -1320477 -1330134 -1325004 -1330962 -1329289 -1312699 -1307114 -1321202 -1349368 -1362948 -1366850 -1368222 -1365508
6788 -1365508 -1373947 -1362861 -1352993 -1355123 -1359514 -1395494 -1385448 -1360044 -1363222 -1341954 -1334189 -1324032 -1322797
6775 -1322797 -1336332 -1348034 -1351714 -1350925 -1355295 -1349472 -1353004 -1341766 -1308611 -1292841 -1319883 -1314621 -1303867
6762 -1303867 -1306366 -1327056 -1313561 -1286898 -1278538 -1282069 -1291219 -1310351 -1326885 -1324801 -1347860 -1354437 -1327054
6749 -1327054 -1317933 -1354408 -1331465 -1320773 -1334675 -1331395 -1340708 -1357645 -1359424 -1346383 -1336862 -1326732
6737 -1326732 -1326887 -1332134 -1324283 -1336085 -1333373 -1323820 -1317996 -1322998 -1332770 -1308051 -1284489 -1285188 -1302683 -1299230
6723 -1299230 -1296092 -1312712 -1288963 -1293651 -1283007 -1280557 -1302753 -1312307 -1317855 -1313464 -1327056 -1329513 -1340609
6710 -1340609 -1339237 -1332931 -1309281 -1300796 -1294678 -1285778 -1265229 -1260306 -1282213 -1302944 -1300579 -1330953 -1327701
6697 -1327701 -1301088 -1307027 -1309000 -1327873 -1346064 -1339248 -1327914 -1338875 -1331076 -1342699 -1340923 -1319471
6685 -1319471 -1312472 -1310730 -1323904 -1318992 -1287359 -1296756 -1314377 -1342880 -1345440 -1319368 -1303238 -1302063 -1309809
6672 -1309809 -1321169 -1332498 -1335054 -1322535 -1311197 -1292667 -1296329 -1308700 -1297125 -1303839 -1305508 -1299274
6660 -1299274 -1305045 -1299809 -1292837 -1290530 -1276999 -1290426 -1283798 -1255695 -1238438 -1232444 -1245663 -1245132 -1241614
6647 -1241614 -1235351 -1251568 -1248143 -1245923 -1278897 -1296757 -1286374 -1262094 -1238601 -1244077 -1265432 -1271248
6635 -1271248 -1239918 -1227853 -1232637 -1238965 -1263260 -1249399 -1257236 -1240467 -1237497 -1254344 -1250279 -1264400
6623 -1264400 -1283855 -1265054 -1218817 -1189005 -1206324 -1204561 -1210579 -1218563 -1197228 -1194433 -1205882 -1199039
6611 -1199039 -1181359 -1126948 -1097642 -1090280 -1101987 -1263412 -1440254 -1492558 -1476114 -1413562 -1376552
6600 -1376552 -1380363 -1373797 -1362163 -1359829 -1363689 -1354284 -1336357 -1345881 -1344961 -1333492 -1328108 -1320496 -1332367
6587 -1332367 -1325858 -1307271 -1301140 -1316708 -1307902 -1288047 -1294218 -1297043 -1296196 -1268562 -1270711 -1279340 -1286293
6574 -1286293 -1316830 -1334634 -1340393 -1325802 -1321481 -1301659 -1274952 -1279956 -1274435 -1269143 -1302920 -1310252 -1288296
6561 -1288296 -1284640 -1295672 -1283666 -1274106 -1274169 -1272736 -1265548 -1284557 -1311183 -1303813 -1297768 -1302691 -1307571 -1290227
6547 -1290227 -1287044 -1281019 -1298928 -1311569 -1304474 -1277360 -1264887 -1265940 -1275783 -1273075 -1283878 -1283051 -1275792
6534 -1275792 -1254004 -1258741 -1269275 -1252806 -1249761 -1253409 -1241640 -1242768 -1278200 -1287921 -1266276 -1249275
6522 -1249275 -1246365 -1245791 -1238978 -1236702 -1253672 -1263741 -1251691 -1268746 -1254980 -1250787 -1259898 -1257987 -1265627
6509 -1265627 -1281638 -1269094 -1244500 -1233738 -1224500 -1235690 -1268559 -1264279 -1237393 -1228088 -1230419 -1234720
6497 -1234720 -1237847 -1249665 -1251224 -1245243 -1233619 -1216060 -1226536 -1241668 -1235479 -1253799 -1257873 -1277355
6485 -1277355 -1295890 -1316666 -1307659 -1290813 -1268703 -1260481 -1235421 -1211914 -1195969 -1213517 -1215199 -1232450
6473 -1232450 -1244583 -1245511 -1243929 -1241865 -1246375 -1245329 -1230404 -1222850 -1233145 -1245312 -1234909 -1252000 -1257178
6460 -1257178 -1239096 -1228833 -1217234 -1221339 -1226252 -1245547 -1247339 -1256839 -1269967 -1241465 -1227890 -1226186
6448 -1226186 -1263376 -1269315 -1255255 -1240270 -1232117 -1229263 -1253798 -1262696 -1263419 -1251635 -1233105 -1240479 -1248326
6435 -1248326 -1235128 -1230173 -1237466 -1223984 -1191592 -1205833 -1206815 -1228638 -1225926 -1227782 -1209721 -1217245 -1206487
6422 -1206487 -1206876 -1200864 -1229581 -1234449 -1225912 -1214336 -1213924 -1180209 -1168195 -1176381 -1177610 -1197448 -1180787
6409 -1180787 -1201055 -1199593 -1191017 -1185639 -1197788 -1204876 -1213221 -1214383 -1203017 -1192480 -1172343 -1172672 -1184679
6396 -1184679 -1198802 -1191775 -1192873 -1193828 -1209847 -1207884 -1219318 -1218310 -1219742 -1210426 -1221728 -1208263 -1190676
6383 -1190676 -1220793 -1241846 -1241581 -1239265 -1222163 -1220570 -1229551 -1249318 -1251520 -1242486 -1216566 -1209530 -1230139
6370 -1230139 -1228921 -1254595 -1256638 -1221577 -1200076 -1190656 -1196019 -1208685 -1228277 -1235538 -1227592 -1206292 -1190906
6357 -1190906 -1180225 -1193032 -1202570 -1206459 -1195690 -1179430 -1198893 -1188663 -1178465 -1206402 -1229920 -1204927
6345 -1204927 -1205554 -1214108 -1214802 -1215787 -1207950 -1198045 -1194294 -1185180 -1175217 -1178952 -1176756 -1215294 -1244402 -1231370
6331 -1231370 -1225055 -1207945 -1188162 -1180015 -1190940 -1215543 -1227412 -1215595 -1212901 -1188412 -1163924 -1151454
6319 -1151454 -1173058 -1204022 -1209610 -1192461 -1194121 -1196888 -1201253 -1221720 -1207257 -1203968 -1188920 -1180315 -1188691
6306 -1188691 -1172988 -1177119 -1190643 -1205463 -1215680 -1229357 -1209774 -1179797 -1158069 -1145221 -1154628 -1174658
6294 -1174658 -1183607 -1187181 -1187706 -1209771 -1232856 -1235423 -1192804 -1160560 -1156134 -1173341 -1158231 -1158622 -1184889
6281 -1184889 -1226370 -1235816 -1228699 -1222140 -1211203 -1200195 -1199250 -1213986 -1210028 -1187766 -1176007 -1150948 -1142039
6268 -1142039 -1146771 -1159674 -1176322 -1191836 -1164092 -1166543 -1176368 -1177497 -1168221 -1166032 -1142963 -1139008 -1155644
6255 -1155644 -1167213 -1185886 -1192463 -1182663 -1183925 -1220361 -1213094 -1188844 -1154720 -1175496 -1180749 -1184146 -1193006
6242 -1193006 -1196172 -1192006 -1170604 -1150599 -1181999 -1194589 -1187064 -1178345 -1190418 -1194267 -1173198 -1181551 -1181184
6229 -1181184 -1179417 -1190566 -1202624 -1212683 -1201363 -1179444 -1198187 -1206615 -1209717 -1206197 -1195945 -1172512
6217 -1172512 -1169542 -1194748 -1206542 -1197108 -1183972 -1170401 -1188730 -1198183 -1165834 -1143967 -1157506 -1169256
6205 -1169256 -1153554 -1149410 -1160562 -1150659 -1139487 -1139328 -1142754 -1136479 -1116677 -1124887 -1125500 -1113242 -1127142
6192 -1127142 -1135865 -1120808 -1135497 -1144071 -1130424 -1154627 -1141176 -1142263 -1148859 -1127685 -1123638 -1125187 -1128634
6179 -1128634 -1135762 -1159171 -1180740 -1158972 -1168561 -1172709 -1166321 -1167410 -1153097 -1156425 -1167473 -1151199 -1139849
6166 -1139849 -1132577 -1136675 -1112541 -1134774 -1164541 -1173816 -1163718 -1183000 -1193738 -1181133 -1173793 -1172115
6154 -1172115 -1176634 -1182732 -1168569 -1152726 -1141047 -1136247 -1132160 -1138064 -1162834 -1163438 -1163596 -1152315 -1154580
6141 -1154580 -1159686 -1147420 -1116682 -1106804 -1111336 -1103009 -1107594 -1113960 -1099126 -1110206 -1137793 -1146566 -1130552
6128 -1130552 -1113240 -1100587 -1115697 -1129612 -1138086 -1129832 -1142096 -1138162 -1126392 -1129282 -1138601 -1136974 -1142535
6115 -1142535 -1143227 -1139325 -1113145 -1124454 -1147216 -1146077 -1123995 -1158867 -1186853 -1168465 -1158021 -1141446
6103 -1141446 -1140106 -1120711 -1107409 -1119255 -1132774 -1146925 -1141647 -1126586 -1148337 -1166454 -1131883 -1114821
6091 -1114821 -1128035 -1138253 -1136962 -1131054 -1133903 -1138485 -1145849 -1143572 -1138670 -1131115 -1118303 -1108928 -1106573
6078 -1106573 -1091878 -1081193 -1076485 -1066587 -1082679 -1090758 -1095160 -1101778 -1121306 -1130647 -1123962 -1124843 -1132689
6065 -1132689 -1133941 -1116724 -1105290 -1111256 -1109913 -1110614 -1105928 -1107774 -1109110 -1097812 -1119160 -1139390 -1117772
6052 -1117772 -1105178 -1112999 -1137427 -1136229 -1131133 -1106993 -1098591 -1095499 -1124725 -1140621 -1141956 -1136560 -1127349
6039 -1127349 -1112665 -1106411 -1119641 -1124875 -1100157 -1094225 -1123464 -1149485 -1147284 -1114148 -1108621 -1112954 -1114980
6026 -1114980 -1131640 -1143470 -1150039 -1144517 -1138766 -1146410 -1138738 -1133712 -1116835 -1126934 -1137076 -1128577 -1129169
6013 -1129169 -1138275 -1146700 -1151396 -1119338 -1106723 -1090694 -1113746 -1129769 -1121882 -1117724 -1128407 -1129864 -1142326
6000 -1142326 -1123575 -1100276 -1100625 -1109371 -1105303 -1092372 -1095720 -1108359 -1123711 -1122033 -1117037 -1120362 -1087306
5987 -1087306 -1084872 -1109949 -1133210 -1133386 -1106378 -1087371 -1091185 -1087610 -1086364 -1076131 -1089156 -1093990 -1107167
5974 -1107167 -1098895 -1106601 -1112230 -1124257 -1127260 -1126596 -1139586 -1128042 -1112753 -1105719 -1116327 -1112512 -1101827
5961 -1101827 -1100457 -1091503 -1098832 -1095877 -1110776 -1105138 -1090233 -1123510 -1124205 -1115292 -1108868 -1074841 -1070036
5948 -1070036 -1071193 -1065790 -1064176 -1063597 -1073591 -1077128 -1080226 -1077932 -1079155 -1072343 -1096621 -1107072 -1118416 -1127005
5934 -1127005 -1108096 -1107023 -1130555 -1142379 -1132715 -1131076 -1133376 -1116651 -1089250 -1076819 -1064660 -1053341
5922 -1053341 -1075021 -1079851 -1068901 -1077674 -1077388 -1081265 -1081957 -1091198 -1090654 -1108102 -1105875 -1101390 -1086445 -1081219
5908 -1081219 -1080495 -1094245 -1121019 -1118138 -1089823 -1074656 -1049969 -1038423 -1037741 -1060293 -1084776 -1104916
5896 -1104916 -1109130 -1083476 -1088253 -1089215 -1061793 -1052049 -1046771 -1065160 -1067214 -1074870 -1085922 -1091475 -1078123
5883 -1078123 -1060357 -1066200 -1072799 -1081839 -1065705 -1056729 -1059492 -1059494 -1068059 -1086033 -1081179 -1079402 -1096821 -1089716
5869 -1089716 -1096593 -1099586 -1071488 -1068168 -1093524 -1095819 -1098357 -1084586 -1080809 -1087873 -1077179 -1060406 -1075537
5856 -1075537 -1090091 -1071815 -1058553 -1081178 -1080780 -1082157 -1087676 -1096093 -1080200 -1069852 -1085338 -1100535
5844 -1100535 -1079262 -1064808 -1063078 -1065059 -1075040 -1063780 -1063545 -1095092 -1099524 -1062783 -1056249 -1082868 -1095368
5831 -1095368 -1091375 -1067116 -1068431 -1065478 -1088297 -1080698 -1060914 -1076101 -1088480 -1069704 -1049143 -1045883
5819 -1045883 -1074337 -1088885 -1063945 -1042764 -1063166 -1079076 -1075739 -1071497 -1068496 -1069341 -1063847 -1065357 -1090127
5806 -1090127 -1076197 -1048761 -1041535 -1042418 -1066052 -1088960 -1069647 -1059898 -1052216 -1050384 -1043690 -1046417 -1071754
5793 -1071754 -1087383 -1068998 -1084036 -1079059 -1077168 -1068483 -1079565 -1085960 -1071918 -1059560 -1048705 -1026728
5781 -1026728 -1017340 -1011454 -1004681 -1028238 -1059886 -1066288 -1044618 -1057225 -1075721 -1067993 -1084749 -1087644 -1067314
5768 -1067314 -1068094 -1056580 -1038819 -1051005 -1053737 -1053141 -1061396 -1076892 -1055376 -1030037 -1028755 -1045679 -1040283
5755 -1040283 -1025753 -1017190 -1019825 -1026536 -1031220 -1051735 -1045802 -1054037 -1078355 -1108619 -1089119 -1081944 -1098063
5742 -1098063 -1095420 -1087597 -1085804 -1094394 -1100411 -1073833 -1073676 -1075719 -1045211 -1043672 -1046807 -1051142 -1062897 -1074646
5728 -1074646 -1062068 -1062566 -1053260 -1056330 -1064740 -1062010 -1072609 -1078563 -1084958 -1089456 -1062970 -1073007 -1082800
5715 -1082800 -1069878 -1054804 -1068841 -1090342 -1098758 -1082173 -1061887 -1045828 -1050224 -1037201 -1025359 -1014867
5703 -1014867 -1011995 -1008406 -1009803 -1036160 -1035045 -1016217 -1022556 -1025430 -1041611 -1040351 -1022306 -1030017 -1059584
5690 -1059584 -1066933 -1060581 -1028620 -1037161 -1057710 -1077152 -1069821 -1051679 -1061511 -1058346 -1050350 -1052648 -1067684
5677 -1067684 -1087634 -1095225 -1084321 -1058665 -1045992 -1065494 -1062057 -1051927 -1052764 -1061636 -1057078 -1081884 -1061227
5664 -1061227 -1053835 -1070663 -1072566 -1054758 -1020624 -1010421 -1012612 -1019987 -1029012 -1028798 -1020411 -1008510 -1010998
5651 -1010998 -1022242 -1042537 -1049482 -1038823 -1050199 -1053458 -1063864 -1058725 -1052291 -1056090 -1040832 -1027842
5639 -1027842 -1012927 -981895 -1006410 -1019134 -1017196 -1006830 -997931 -1022053 -1045192 -1037151 -1032814 -1032268 -1038780
5626 -1038780 -1037431 -1035484 -1024669 -1030984 -1023375 -1012111 -992635 -992539 -997707 -1008959 -1048024 -1063111 -1057229
5613 -1057229 -1056934 -1055660 -1065859 -1087695 -1078737 -1083104 -1084449 -1058112 -1026408 -1021611 -1031215 -1035765 -1022906
5600 -1022906 -1013241 -1019282 -1038166 -1039837 -1028533 -1035143 -1038912 -1040457 -1041505 -1045840 -1032263 -1048889 -1035367
5587 -1035367 -1009831 -1005046 -1008594 -1007031 -1015135 -1015286 -987433 -977323 -963491 -956719 -982721 -990748 -984142
5574 -984142 -993025 -1015846 -1037865 -1034470 -1026762 -1028291 -1009561 -1026680 -1047601 -1040390 -1025210 -1023047 -1021066
5561 -1021066 -1015342 -1009204 -1031266 -1016493 -994941 -999351 -993126 -1008304 -1008220 -1007520 -1001096 -991014 -996130 -992114
5547 -992114 -1001575 -1016132 -1012372 -995826 -1001090 -1009004 -1002372 -989449 -988594 -995712 -987587 -1000500 -993229 -978445
5533 -978445 -986325 -999373 -1000963 -999354 -996514 -993618 -993451 -1002874 -1023335 -1042318 -1025504 -1025263 -1021973 -1015844
5519 -1015844 -1012450 -1010324 -1022291 -1038892 -1017672 -1000379 -1003368 -1001248 -994452 -987540 -990116 -1011551 -1018712
5506 -1018712 -999017 -1020004 -999246 -985700 -1012676 -1028476 -1032844 -1012189 -997685 -975454 -960005 -970288
5494 -970288 -976976 -989778 -984924 -990999 -979730 -989997 -988201 -993112 -1003560 -993679 -977942 -977945 -968606 -976868
5480 -976868 -983120 -1004645 -1006425 -1003727 -994247 -1008146 -999660 -1011582 -1006898 -990546 -972147 -967932 -967676
5467 -967676 -956153 -941869 -984438 -1008986 -1018537 -1021911 -1018928 -1004556 -960806 -971137 -988880 -988162 -984898
5454 -984898 -985945 -990342 -984009 -981041 -973218 -949930 -956774 -979220 -992960 -998271 -1002625 -975687 -973141
5441 -973141 -963715 -959394 -947491 -950114 -955184 -958449 -974482 -991411 -985367 -998305 -994132 -971246 -959529
5428 -959529 -948184 -959617 -988776 -1012016 -1012700 -1000310 -997840 -995559 -988134 -976982 -981819 -995754 -1011798
5415 -1011798 -1018429 -1027744 -996843 -982756 -992001 -1008939 -1012290 -1000173 -1003719 -1004196 -996325 -976270 -973709
5402 -973709 -963058 -959675 -969759 -985647 -965735 -952474 -950988 -977046 -1002939 -1024887 -1015340 -1023936
5390 -1023936 -1011941 -993968 -989821 -993553 -1006046 -1008486 -1004868 -1009460 -1004083 -977840 -970931 -973447 -978128
5377 -978128 -982847 -961773 -951386 -967005 -971317 -963436 -976440 -980382 -978832 -989560 -960520 -938838 -934761
5364 -934761 -966671 -990071 -982241 -981705 -965305 -962264 -966707 -978128 -978746 -995695 -998990 -973409 -971383
5351 -971383 -976063 -970331 -953233 -949915 -966549 -971161 -970383 -943283 -950461 -949061 -963207 -978309 -978774 -980589
5337 -980589 -965122 -935039 -932800 -930244 -927797 -940241 -957829 -975012 -983275 -988325 -993207 -990932 -1002500
5324 -1002500 -990533 -984571 -983370 -962778 -948935 -963657 -969742 -1006327 -1026739 -1005654 -985143 -964802
5312 -964802 -961346 -966096 -966473 -946197 -954057 -963464 -964768 -961771 -964892 -974123 -958494 -951737 -946625 -960119
5298 -960119 -977205 -985410 -987769 -978369 -974556 -978514 -986502 -997984 -989193 -984817 -1002902 -982732 -973404
5285 -973404 -962956 -960102 -949198 -971366 -978314 -962406 -950996 -967294 -955300 -939297 -944764 -982799
5273 -982799 -969474 -970713 -974391 -963674 -952461 -949802 -953768 -949779 -929037 -921499 -938372 -953441 -939191
5260 -939191 -956327 -952616 -928960 -942148 -960454 -961986 -932871 -928418 -920338 -899140 -888436 -906674
5248 -906674 -912666 -931368 -935011 -930559 -937255 -945776 -963666 -969721 -954654 -952599 -942162 -933993 -916116
5235 -916116 -914377 -910490 -933704 -972032 -984212 -969271 -959002 -934719 -912138 -916733 -929676 -937040
5223 -937040 -965594 -975704 -981188 -963259 -947069 -942946 -950249 -954450 -956423 -957709 -953867 -947233 -977704
5210 -977704 -980053 -943537 -925983 -931481 -928197 -917554 -926039 -940285 -953575 -934920 -936856 -931586 -937482
5197 -937482 -924177 -934457 -932726 -962872 -960601 -946613 -960524 -974687 -951730 -944816 -951065 -950024 -937625
5184 -937625 -923164 -911051 -914279 -917677 -912878 -908016 -915706 -932158 -938936 -962746 -968902 -955464 -939548
5171 -939548 -931677 -938806 -929585 -917589 -916780 -923447 -912698 -913487 -910009 -896114 -914661 -925467 -919380 -919600
5157 -919600 -904162 -921622 -950111 -945494 -935366 -958085 -952049 -921872 -926773 -910419 -923618 -953212
5145 -953212 -956367 -952778 -954831 -935587 -904407 -926025 -964268 -976222 -942023 -933354 -925247 -919204 -895796
5132 -895796 -902298 -930879 -969977 -975409 -958518 -957644 -948770 -912495 -893633 -906285 -919636 -918740 -922194
5119 -922194 -932228 -937268 -946583 -947618 -946919 -937577 -952682 -976801 -983046 -968977 -974763 -1001304 -987285
5106 -987285 -972260 -952184 -938334 -947521 -974317 -983961 -981066 -974523 -961982 -950561 -943471 -943828 -927881
5093 -927881 -916478 -932078 -946040 -951892 -966382 -971248 -973446 -963575 -936780 -979973 -981520 -959594 -963222
5080 -963222 -951332 -941961 -934220 -926542 -961359 -980592 -943214 -906602 -893342 -882964 -915324 -921913
5068 -921913 -939037 -943523 -956409 -940397 -920518 -925963 -936049 -922409 -926079 -915428 -923136 -916208 -915847
5055 -915847 -914743 -913847 -929545 -935758 -933682 -942087 -925501 -898597 -893491 -906700 -898100 -904312 -922638
5042 -922638 -916351 -908231 -916787 -935433 -935651 -920997 -926394 -923203 -905873 -928066 -938134 -926816 -958965
5029 -958965 -962293 -920535 -876558 -897116 -926680 -928904 -946094 -946959 -924600 -905033 -905772 -905736 -889908
5016 -889908 -889016 -904532 -922910 -934597 -924714 -913255 -911232 -894080 -883662 -886184 -879816 -876707 -896030
5003 -896030 -916817 -913652 -911199 -939479 -949188 -944148 -937801 -940617 -943983 -932607 -909852 -895030 -890369
4990 -890369 -882231 -885562 -874544 -869165 -895804 -897576 -902322 -935381 -929561 -902627 -903102 -909059 -907016 -900217
4976 -900217 -898458 -894600 -871527 -883596 -877727 -891144 -894982 -894917 -894954 -902614 -900733 -891046 -899595 -908029 -897521
4961 -897521 -904511 -906577 -878214 -855868 -863279 -894181 -900814 -902417 -903485 -920456 -926955 -899166 -877445
4948 -877445 -890635 -905500 -903359 -895166 -903313 -916903 -927510 -911893 -890264 -901942 -908061 -923317
4936 -923317 -912877 -886166 -869419 -890791 -900492 -893821 -860478 -862513 -879936 -898259 -903180 -908883 -908264
4923 -908264 -918298 -947868 -950785 -947157 -944929 -928473 -911230 -908588 -898251 -923045 -934310 -918176
4911 -918176 -914442 -911455 -881736 -855443 -856035 -863357 -862262 -869897 -876008 -892141 -920374 -939034 -953476
4898 -953476 -937411 -905266 -897694 -891252 -877589 -879660 -889916 -889370 -881885 -882692 -885019 -904087 -919460
4885 -919460 -918247 -887978 -884117 -884386 -895262 -883985 -900150 -922258 -935627 -922585 -886724 -875479
4873 -875479 -874267 -889906 -899267 -913075 -911943 -928858 -931436 -899916 -894292 -899158 -908226 -922883 -898015
4860 -898015 -861636 -868825 -886387 -921676 -904723 -893156 -892702 -861610 -859813 -852193 -862569 -866148 -853975
4847 -853975 -859873 -863398 -874736 -845538 -836750 -877239 -891963 -883963 -861043 -871126 -891639 -888001 -877406
4834 -877406 -859893 -850987 -848329 -870398 -872536 -868447 -888604 -897745 -872607 -880092 -892141 -877426 -897065
4821 -897065 -895737 -882306 -876153 -862477 -852363 -863691 -882556 -903790 -902788 -873496 -873938 -878704 -894155
4808 -894155 -892919 -877598 -870385 -876304 -894374 -893425 -887620 -880690 -858002 -862629 -880951 -891461 -877990
4795 -877990 -857108 -876347 -897679 -891938 -893931 -867867 -835732 -848356 -889812 -888542 -886822 -887518 -906594
4782 -906594 -923157 -929904 -905882 -901736 -899359 -915455 -923009 -906864 -906006 -900099 -905077 -887380 -889866
4769 -889866 -910342 -944613 -942871 -912617 -886858 -873621 -880502 -881470 -881129 -902400 -925598 -939251 -921528
4756 -921528 -909151 -913838 -892259 -887197 -878352 -886646 -901251 -900012 -898107 -907038 -902166 -900769 -898752 -882236
4742 -882236 -851141 -857523 -881270 -905261 -923611 -889887 -853409 -854548 -862475 -872401 -880512 -885087 -888623
4729 -888623 -876844 -868209 -858456 -867115 -869451 -853646 -859299 -866538 -872463 -872037 -893407 -906611 -883897
4716 -883897 -859661 -858048 -872145 -858744 -854530 -882131 -895690 -886922 -891789 -893445 -868227 -856128 -859801
4703 -859801 -877820 -883828 -882383 -865294 -876322 -902538 -899911 -904301 -908842 -915676 -886112 -869941 -881968
4690 -881968 -886558 -912905 -917083 -903847 -908289 -915512 -916611 -902266 -880363 -879616 -880031 -881493 -881080 -890337
4676 -890337 -902613 -896428 -904542 -894863 -876034 -886415 -877426 -867303 -890409 -900518 -876466 -871264 -894664
4663 -894664 -894045 -867801 -881543 -897455 -870345 -851878 -856867 -866541 -864254 -871245 -897479 -903937 -913831
4650 -913831 -897148 -867289 -859616 -846742 -871193 -880820 -859445 -873751 -895519 -891004 -875764 -875666 -876461
4637 -876461 -857124 -833648 -849938 -861756 -829714 -833536 -845610 -870530 -890845 -868586 -859804 -859105
4625 -859105 -853596 -849659 -860457 -876052 -894795 -901956 -900595 -915691 -906458 -889095 -884116 -882522 -888712
4612 -888712 -863111 -840359 -848521 -854085 -847514 -853201 -854301 -861933 -884100 -910148 -907583 -883979 -850558
4599 -850558 -883076 -900929 -889171 -877496 -854117 -854755 -864227 -885472 -893952 -893296 -870722 -858122 -891927
4586 -891927 -899144 -891889 -860424 -868348 -876633 -852439 -838656 -841071 -835717 -830990 -827294 -821273 -844524
4573 -844524 -852878 -830785 -832247 -846425 -855341 -850316 -843520 -831498 -848165 -860198 -862828 -855629 -847699
4560 -847699 -846300 -839327 -821574 -798356 -810282 -808680 -824782 -849997 -862867 -860608 -848703 -849288 -847287
4547 -847287 -855069 -845206 -842354 -822543 -801440 -848192 -844851 -855054 -857557 -826813 -814095 -835046 -871036
4534 -871036 -874037 -867469 -863462 -878151 -886400 -866385 -847465 -825315 -803989 -787856 -788926 -789409 -781607
4521 -781607 -816092 -857683 -863690 -866714 -865925 -856723 -837271 -830409 -827686 -811621 -823179 -847332 -856333
4508 -856333 -838459 -825853 -806614 -790096 -797277 -789120 -803169 -817570 -836459 -845442 -860403 -862040
4496 -862040 -865583 -868723 -855227 -839509 -840121 -846963 -833944 -830324 -841114 -843092 -838963 -833729 -821647
4483 -821647 -831532 -856532 -842474 -823615 -834944 -863924 -863030 -853729 -837709 -834862 -862963 -858201 -850605
4470 -850605 -853016 -857487 -850824 -854228 -853974 -851119 -848299 -831456 -831088 -844380 -850595 -849052 -854246 -861433
4456 -861433 -881848 -882776 -873414 -866016 -869866 -861200 -841340 -825500 -836133 -853872 -869138 -877383 -870614
4443 -870614 -861687 -868542 -852501 -832919 -811296 -795530 -816635 -861871 -850913 -833888 -828620 -818846
4431 -818846 -811796 -808241 -802798 -793995 -798029 -800298 -818230 -838574 -843436 -843129 -857335 -862048 -849654 -838568
4417 -838568 -835366 -855140 -854814 -843478 -845433 -845005 -839227 -814391 -825354 -856217 -878851 -850345 -836912
4404 -836912 -827154 -825343 -836765 -844635 -857504 -860682 -856080 -858001 -832983 -824368 -837441 -821803 -813963
4391 -813963 -832796 -827490 -820885 -819075 -839207 -837120 -826434 -817629 -832826 -845104 -855748 -847572 -838000
4378 -838000 -852636 -840195 -828139 -832735 -853489 -861793 -858509 -846646 -843823 -842730 -836918 -839156 -835383
4365 -835383 -834323 -830557 -823842 -815465 -789668 -795247 -828716 -822457 -828497 -822001 -823196 -826750 -842465 -841549
4351 -841549 -821959 -805957 -818564 -827192 -821942 -804139 -789093 -823381 -822833 -822243 -840082 -851214 -820403
4338 -820403 -815925 -803963 -789972 -802794 -827862 -843027 -829397 -807480 -801276 -793262 -802480 -828457
4326 -828457 -835911 -819458 -829968 -835287 -840653 -843889 -835122 -813424 -790433 -794194 -796438 -795867 -789069 -769795
4312 -769795 -781486 -802040 -839475 -859440 -865701 -856420 -836985 -826376 -829855 -837385 -828763 -823365 -833961
4299 -833961 -836065 -834812 -834163 -833669 -838701 -864420 -869893 -860957 -837837 -808783 -789863 -796268 -795928 -837993
4285 -837993 -859428 -859155 -863279 -849649 -850800 -850588 -823906 -795561 -812645 -812925 -816595 -824471 -831871 -793517
4271 -793517 -765588 -774755 -788849 -774281 -780474 -795248 -818891 -847286 -845948 -835016 -828558 -801188
4259 -801188 -794326 -805284 -801336 -822858 -844600 -819954 -803038 -805841 -813109 -834834 -823571 -838633
4247 -838633 -847519 -836047 -818838 -809302 -801864 -790485 -775248 -790414 -791266 -791142 -806495 -824725 -819263
4234 -819263 -824424 -843662 -830658 -808469 -803162 -805577 -812672 -821754 -824684 -806654 -813627 -819737 -822767
4221 -822767 -833873 -842900 -828387 -844237 -840902 -827888 -809974 -790731 -813041 -796944 -779960 -788102
4209 -788102 -796108 -791635 -780920 -781395 -787479 -800714 -814345 -808161 -813558 -812561 -806866 -794624 -772586 -774586
4195 -774586 -799656 -786469 -785909 -798562 -804581 -802909 -811674 -817328 -817604 -821104 -798243 -782800 -768827
4182 -768827 -749079 -748911 -786916 -795937 -808521 -816891 -797361 -776306 -765034 -765864 -794181 -823881 -832523
4169 -832523 -813222 -814243 -809489 -792179 -786927 -807499 -811791 -791141 -771425 -775730 -773344 -768435 -776597
4156 -776597 -779062 -802562 -792159 -793738 -780823 -771938 -773517 -794119 -792251 -808253 -829642 -828941 -829839
4143 -829839 -846496 -842052 -848822 -836129 -832227 -836293 -816064 -824066 -796016 -798391 -814522 -812038 -810421
4130 -810421 -792376 -759571 -764703 -784831 -800071 -784957 -787554 -818849 -813102 -789958 -804558 -819184
4118 -819184 -819953 -821598 -820612 -847716 -826139 -804460 -815664 -827154 -831384 -828896 -825803 -794727 -790190
4105 -790190 -802963 -802611 -798560 -811878 -785012 -766186 -758878 -772112 -788970 -796430 -789494 -768915 -751489
4092 -751489 -762343 -795394 -835600 -827663 -816009 -803773 -805098 -796725 -784454 -790078 -801890 -810901 -801582
4079 -801582 -782610 -773364 -804486 -820253 -842999 -827185 -827552 -830048 -820220 -829542 -808363 -776836 -784823
4066 -784823 -764135 -769462 -773701 -756013 -757145 -776813 -795584 -794893 -798314 -800188 -780577 -774550 -809654
4053 -809654 -828073 -819917 -810391 -789900 -773984 -786340 -787246 -783636 -794651 -794151 -805218 -814704 -801824
4040 -801824 -774840 -785665 -806018 -810801 -803625 -789405 -778774 -792576 -816910 -819044 -821801 -802616
4028 -802616 -794783 -788776 -798775 -810220 -794319 -786009 -785812 -804201 -789806 -789271 -807305 -786109 -757569
4015 -757569 -750002 -747205 -777553 -789615 -793670 -791790 -795601 -782913 -790361 -811764 -790672 -768786 -761285
4002 -761285 -792975 -791856 -772275 -776848 -773629 -784935 -783473 -800514 -801799 -784722 -798542 -834808 -835501
3989 -835501 -826012 -813820 -803541 -790531 -790943 -793797 -789610 -789573 -796266 -803002 -814541 -824341 -812207 -789375
3975 -789375 -780713 -795534 -811109 -774146 -756465 -767906 -784865 -804752 -801751 -775955 -787459 -799740
3963 -799740 -803000 -822436 -810925 -806471 -813415 -795482 -772516 -774401 -796356 -818975 -810681 -787680 -800691
3950 -800691 -814225 -833599 -825852 -778017 -771933 -782506 -781281 -769964 -782274 -806464 -800122 -789101
3938 -789101 -785705 -782443 -804888 -798292 -782100 -776969 -776314 -749977 -748497 -767717 -760909 -778893 -820228
3925 -820228 -829732 -811407 -805867 -798997 -791345 -788609 -805281 -822922 -792878 -795059 -807969 -803147 -792790
3912 -792790 -793274 -795640 -782163 -772503 -771164 -784421 -786861 -753833 -744691 -769242 -787084 -800077 -803462
3899 -803462 -793852 -778409 -786223 -774586 -764829 -773458 -755562 -759094 -785130 -782652 -792312 -800410 -789397
3886 -789397 -780960 -779033 -782782 -769582 -752447 -753547 -763563 -764982 -761227 -756430 -761135 -763457 -769917 -783485
3872 -783485 -805403 -814466 -813800 -819749 -805371 -793501 -786171 -795279 -782688 -745018 -742008 -757026 -747447
3859 -747447 -748796 -767471 -776898 -769095 -772340 -763573 -750125 -750519 -748346 -758149 -767770 -772801 -765373 -771644
3845 -771644 -789684 -784206 -761112 -759565 -755413 -744250 -739997 -744750 -756099 -747670 -742549 -736048 -749248
3832 -749248 -732652 -725771 -753205 -774160 -741977 -760656 -780714 -782542 -765213 -745809 -752092 -799434
3820 -799434 -830676 -817681 -793155 -778088 -779925 -782676 -794543 -765783 -764083 -741506 -727051 -721588
3808 -721588 -720378 -723769 -711615 -706763 -704871 -728561 -748909 -774575 -796146 -783541 -789366 -794604 -812055
3795 -812055 -811768 -798388 -789714 -781803 -795555 -800478 -814824 -799355 -788506 -757167 -731317 -749892 -779935
3782 -779935 -786277 -758276 -761910 -793150 -793236 -762578 -785678 -794165 -785529 -775736 -760640 -740230 -741960
3769 -741960 -777461 -806166 -793629 -782511 -751815 -769406 -808982 -801898 -765445 -765203 -779837 -761766
3757 -761766 -787037 -801321 -811099 -784423 -737323 -742078 -759694 -760021 -771407 -749979 -737977 -737450 -728462
3744 -728462 -725332 -729914 -739123 -758013 -773474 -764707 -745532 -742298 -774171 -790535 -784158 -791216 -792733
3731 -792733 -792080 -774316 -757626 -745625 -763087 -780905 -803904 -795734 -788288 -796257 -796434 -795918 -795666 -770681
3717 -770681 -763663 -757459 -749232 -756552 -743879 -754241 -760657 -757520 -762889 -755071 -772905 -781899 -768996
3704 -768996 -747751 -748760 -754417 -771579 -742885 -709920 -716068 -749985 -765774 -755022 -744895 -697480
3692 -697480 -688210 -700364 -703920 -713653 -747625 -772862 -765103 -743262 -728714 -715730 -724126 -723448 -740922
3679 -740922 -731753 -739642 -751455 -736909 -746181 -763170 -752172 -730218 -728833 -719730 -746607 -740856 -759549
3666 -759549 -758350 -728764 -740085 -746544 -751224 -772037 -789106 -788301 -773835 -748199 -749545 -758329 -765382
3653 -765382 -779898 -781961 -753088 -751363 -749686 -748566 -744661 -730615 -732310 -719760 -710951 -728691 -725499
3640 -725499 -734157 -730184 -715275 -756406 -774737 -756670 -738207 -740643 -757906 -776552 -797653 -778630
3628 -778630 -752272 -752648 -737102 -741960 -747926 -749910 -736622 -731432 -717094 -714550 -747376 -745655 -736299
3615 -736299 -729749 -729049 -742611 -729976 -716866 -728951 -731451 -755385 -748849 -746570 -758080 -762675 -762395
3602 -762395 -729843 -724111 -740715 -758738 -765908 -747695 -742147 -761465 -766491 -773824 -760281 -737499 -732627
3589 -732627 -731238 -718920 -728364 -733855 -742698 -771189 -781781 -771599 -759818 -760127 -764692 -769741 -774076
3576 -774076 -758939 -738860 -740285 -730033 -712821 -701847 -706919 -706980 -707913 -728078 -725547 -743961 -743249 -716228
3562 -716228 -697834 -682105 -716212 -746269 -749424 -744351 -768282 -763518 -766732 -781535 -791569 -766951
3550 -766951 -759807 -754271 -740418 -744962 -744955 -741050 -740262 -728537 -745636 -749983 -748012 -726300 -728177 -753642
3536 -753642 -754382 -740884 -719820 -725494 -730568 -743411 -768774 -767542 -775266 -772123 -754202 -744678 -746664
3523 -746664 -773609 -792676 -811298 -802828 -792424 -791615 -769016 -736103 -720418 -708964 -727955 -733305
3511 -733305 -744124 -751383 -751736 -733750 -721033 -722359 -737995 -756005 -772171 -752382 -758875 -734660 -718707
3498 -718707 -747105 -742870 -738490 -729102 -719639 -727663 -740988 -754164 -763292 -753425 -730321 -709763 -702743
3485 -702743 -735552 -740793 -726066 -711999 -741421 -747083 -737855 -728174 -719168 -712814 -716876 -716009 -715376 -738042
3471 -738042 -756698 -752588 -757210 -770246 -784031 -781278 -744542 -711236 -709598 -731668 -737274 -726503 -734840
3458 -734840 -736514 -719026 -727540 -763763 -771169 -776193 -767815 -748936 -750727 -742043 -730185 -751598 -733170
3445 -733170 -703372 -707517 -709825 -719815 -730505 -742128 -752329 -754998 -745330 -764079 -774628 -782120 -756477
3432 -756477 -743097 -725490 -728252 -716857 -722549 -752202 -771759 -777222 -753143 -741251 -740278 -728802 -726888
3419 -726888 -722240 -715394 -697233 -683606 -685806 -709785 -709991 -708668 -728210 -741386 -727973 -719152 -703288
3406 -703288 -703007 -690297 -703220 -708501 -723014 -737840 -729533 -725213 -722580 -725223 -721937 -709283 -707791
3393 -707791 -714529 -731946 -749136 -760593 -743588 -748437 -753266 -751318 -742851 -751140 -735561 -721224 -730253
3380 -730253 -742648 -751146 -726505 -700222 -709221 -735423 -734167 -721507 -716351 -711121 -716880 -710415 -722388
3367 -722388 -717790 -710559 -756631 -761676 -733168 -719997 -692742 -702797 -714385 -703531 -692732 -687958
3355 -687958 -702946 -720603 -727167 -738287 -734051 -725540 -726864 -731633 -754738 -742930 -725620 -730453 -723202
3342 -723202 -718044 -725004 -712717 -691153 -691092 -700321 -697024 -689859 -713945 -723535 -730968 -726224 -737638 -759616
3328 -759616 -739022 -719908 -728017 -717483 -701990 -694640 -688762 -692153 -704494 -728422 -722161 -709565 -708496
3315 -708496 -718522 -694039 -688747 -691785 -684305 -697071 -698109 -693181 -690905 -711461 -724840 -731599 -711543
3302 -711543 -697793 -711150 -726510 -733988 -733633 -731987 -737866 -726754 -714258 -696227 -678742 -681142 -704135
3289 -704135 -714637 -720268 -726096 -735259 -733014 -726774 -741749 -759483 -740842 -696031 -688289 -698097 -723115
3276 -723115 -728522 -713379 -720817 -736826 -746482 -741068 -734832 -720463 -688343 -699260 -709008 -714991 -705596
3263 -705596 -690724 -717087 -718500 -707194 -693097 -685066 -683998 -680196 -679562 -670533 -673939 -701406 -701010 -691846
3249 -691846 -680353 -703563 -731663 -727001 -719742 -727343 -732623 -736671 -721870 -703623 -709436 -720736 -711619
3236 -711619 -708883 -693850 -702822 -738744 -755976 -755205 -753884 -732356 -731078 -750353 -730371 -701147 -689842
3223 -689842 -705129 -702164 -696580 -723708 -731315 -728394 -718253 -739200 -735372 -723405 -729675 -727897 -702662
3210 -702662 -703269 -722070 -727939 -726626 -705553 -705927 -699999 -697574 -697357 -709091 -718610 -706486 -693855 -687351
3196 -687351 -661802 -670079 -700691 -708560 -721817 -725636 -731680 -723569 -683316 -686906 -703286 -681305 -663546
3183 -663546 -661760 -651756 -657009 -666531 -663582 -670583 -688813 -707297 -736099 -728817 -716391 -696585 -684323
3170 -684323 -682116 -684764 -693698 -702678 -680664 -685248 -702262 -710456 -706972 -711568 -682905 -693245 -712936
3157 -712936 -711633 -705181 -723293 -712870 -703020 -721921 -728038 -733851 -737294 -713792 -689968 -689378 -723710
3144 -723710 -718138 -700746 -726328 -735919 -729555 -726627 -722447 -710168 -712269 -735500 -731202 -700802 -691213
3131 -691213 -665174 -669177 -681674 -699764 -709715 -741735 -730401 -704289 -685410 -687656 -712377 -711972 -690110
3118 -690110 -686916 -709320 -729275 -732547 -739305 -741035 -731931 -734525 -737648 -727638 -733693 -725574 -726929 -723734
3104 -723734 -720911 -713188 -705196 -692853 -697874 -706104 -691560 -682931 -695781 -704862 -702553 -714208 -709244
3091 -709244 -716043 -728695 -722127 -703706 -705361 -716253 -718499 -718931 -719931 -694516 -676981 -666445 -689245
3078 -689245 -695459 -694434 -710716 -716540 -715677 -694120 -688663 -699842 -705069 -698889 -707148 -708213 -702081 -708659
3064 -708659 -702191 -715716 -710432 -707971 -714623 -702185 -705927 -696050 -690985 -689342 -686470 -672987 -682395 -693447
3050 -693447 -692762 -679949 -699199 -732736 -717501 -680997 -675812 -675872 -670121 -671405 -704352 -709280 -707961 -694449
3036 -694449 -697151 -703052 -688588 -683751 -682608 -667728 -652588 -666482 -656740 -655760 -652601 -657946 -694379
3023 -694379 -712824 -696452 -681697 -697716 -696949 -689393 -698581 -693953 -669676 -651711 -628263 -645842 -677925
3010 -677925 -682401 -672015 -672756 -671808 -662745 -663965 -657574 -655276 -641749 -626156 -633256 -659626 -660781 -649335
2996 -649335 -660190 -659689 -663191 -684516 -698449 -692975 -685159 -683810 -699673 -701659 -708715 -699894 -682119
2983 -682119 -697748 -685352 -694142 -726633 -739492 -726446 -721450 -720916 -709310 -684528 -679820 -673659 -681788
2970 -681788 -706044 -723326 -700012 -673905 -660738 -660339 -661166 -672388 -691459 -722852 -716835 -695938 -703786
2957 -703786 -677727 -660814 -658044 -650605 -674554 -710262 -694305 -685623 -692988 -708270 -724880 -724092 -734567
2944 -734567 -702948 -682512 -699603 -715081 -728508 -730203 -716354 -694397 -689184 -667636 -634562 -639880
2932 -639880 -644755 -688416 -710090 -697774 -690176 -685025 -681618 -684849 -673510 -667760 -672451 -674217 -701615
2919 -701615 -711137 -689881 -677886 -683329 -664679 -664060 -670975 -683836 -689497 -696006 -697579 -698615 -701023 -686195
2905 -686195 -699192 -702947 -687790 -681792 -667026 -677454 -700155 -700900 -686490 -679375 -678925 -710727 -708382
2892 -708382 -704086 -708996 -678729 -661386 -671488 -700515 -723196 -701879 -650193 -632559 -667799 -689420
2880 -689420 -685383 -680154 -693788 -691170 -690202 -684437 -662490 -661144 -654049 -660292 -672245 -667429 -705065 -707374
2866 -707374 -689878 -672957 -696705 -697743 -690045 -718360 -711700 -677946 -666021 -663210 -656408 -660745 -653254
2853 -653254 -650638 -657120 -681025 -709828 -725379 -705072 -692746 -684501 -697420 -715344 -704552 -693835
2841 -693835 -706770 -728740 -711528 -683037 -682571 -670857 -662039 -666964 -666560 -661296 -660740 -658024 -681377 -683062
2827 -683062 -688426 -692970 -659619 -632625 -640825 -656261 -672367 -666832 -666401 -676362 -679691 -673199 -679548 -701069
2813 -701069 -692602 -694267 -670541 -615393 -587134 -579745 -590438 -612583 -636477 -667338 -685724 -705063
2801 -705063 -702435 -666998 -655007 -658077 -657679 -662533 -670178 -660727 -655799 -674163 -667669 -664430 -668349 -684030
2787 -684030 -673126 -672941 -686006 -693237 -667442 -658692 -679188 -676893 -681918 -698894 -693825 -674895 -652691
2774 -652691 -683702 -709298 -698008 -686259 -688625 -713828 -713441 -702565 -705579 -713089 -709126 -692012 -690544
2761 -690544 -692774 -684727 -682385 -690801 -710837 -707876 -705286 -703794 -690266 -695130 -708102 -704511 -676626
2748 -676626 -652943 -659823 -678563 -649886 -659947 -676116 -658160 -671927 -701539 -712707 -707824 -692392
2736 -692392 -671624 -675735 -669590 -684005 -690804 -694464 -709307 -729242 -724064 -702222 -690592 -679838 -659299
2723 -659299 -648220 -665887 -678319 -670501 -661553 -664287 -705957 -712622 -719494 -686237 -658123 -653749 -664004
2710 -664004 -674726 -691921 -701851 -693953 -696487 -708684 -707358 -680045 -673527 -678086 -686287 -695752 -698607
2697 -698607 -670167 -658535 -660449 -644579 -626154 -606051 -625917 -661397 -680573 -674434 -660694 -667628
2685 -667628 -664851 -639185 -641353 -674723 -694503 -691664 -646944 -635120 -653832 -644133 -655758 -660633 -647185
2672 -647185 -653877 -659033 -671840 -686812 -674764 -647271 -664858 -664915 -653629 -640096 -648611 -658389 -674317
2659 -674317 -684677 -674300 -681564 -673665 -665908 -680626 -688486 -686411 -668398 -641698 -648508 -642836 -643578
2646 -643578 -639869 -638212 -616237 -609028 -642914 -656515 -660209 -665363 -663560 -650730 -654812 -642447 -641493
2633 -641493 -633162 -633740 -647158 -659490 -667652 -687180 -691306 -662155 -658757 -667823 -636658 -623133 -646587
2620 -646587 -670342 -659758 -654050 -648772 -655070 -667793 -663172 -647005 -638695 -650571 -656493 -648283 -639206
2607 -639206 -650912 -642791 -647400 -647331 -648572 -660667 -660647 -663342 -652207 -661250 -671534 -694977 -709535 -697863
2593 -697863 -689603 -679357 -667858 -688621 -683258 -658325 -675469 -685992 -682183 -685407 -666240 -652696
2581 -652696 -661166 -677290 -688851 -705652 -698237 -670856 -683185 -675326 -679665 -685494 -691699 -686062 -684588
2568 -684588 -661516 -647461 -656144 -669822 -672522 -691211 -686209 -684125 -667472 -675887 -658142 -672342 -675853
2555 -675853 -666121 -679270 -684457 -651829 -638056 -651342 -662736 -677162 -658104 -656611 -658784 -657654 -632563
2542 -632563 -616419 -610627 -607797 -615567 -627028 -641252 -637783 -618722 -622061 -612437 -635008 -670750 -677736
2529 -677736 -662047 -685151 -687931 -677883 -663920 -646259 -623468 -642676 -664163 -653622 -642007 -630147
2517 -630147 -620038 -602317 -600359 -619724 -625071 -653825 -675530 -675726 -664253 -656168 -663808 -651647 -641669
2504 -641669 -624848 -629340 -640169 -617347 -639977 -666384 -666922 -658627 -648885 -633882 -636581 -634867 -637259
2491 -637259 -643433 -638656 -662832 -676539 -659444 -659240 -680936 -668417 -651851 -657354 -652422 -653639 -669821
2478 -669821 -695416 -686584 -672690 -652929 -651953 -640831 -635180 -626172 -638216 -650671 -648337 -655667 -657938
2465 -657938 -659509 -653045 -664609 -670274 -675072 -666883 -650182 -645085 -624552 -612604 -625739 -665535 -667319
2452 -667319 -627107 -628292 -645769 -661054 -670378 -674529 -657519 -657291 -651223 -658008 -646031 -654182 -667264
2439 -667264 -652933 -647799 -664731 -651375 -632201 -622860 -628794 -641461 -663274 -676149 -653942 -612243
2427 -612243 -607547 -616652 -621388 -628240 -629964 -619362 -617057 -613931 -621826 -628310 -644493 -673480 -685529
2414 -685529 -673859 -670183 -662160 -655454 -660887 -673382 -669901 -701797 -697308 -694100 -697315 -683956 -659702
2401 -659702 -645717 -624047 -623662 -639483 -671244 -684029 -659527 -657833 -657463 -645884 -657123 -673256 -654936
2388 -654936 -647739 -680697 -683611 -672358 -669136 -675219 -670399 -647658 -634879 -651002 -667980 -675702 -660565
2375 -660565 -646457 -643905 -677171 -691978 -693837 -663672 -640858 -629738 -608850 -616131 -621009 -629008 -640281
2362 -640281 -663487 -650113 -634293 -632570 -658309 -672636 -676799 -675650 -671863 -691897 -698033 -702828 -693816
2349 -693816 -662614 -659916 -661891 -643913 -637287 -647084 -655138 -640803 -652179 -657369 -662785 -669975 -657215
2336 -657215 -620475 -607778 -615464 -627132 -638402 -608662 -577327 -587235 -632424 -643973 -629069 -611601
2324 -611601 -621476 -639599 -632177 -644452 -629646 -619036 -614292 -594025 -587723 -614346 -653136 -655427 -662316
2311 -662316 -686994 -682054 -669591 -636085 -602901 -623437 -648914 -661618 -673353 -676120 -655898 -648024
2299 -648024 -660113 -665455 -669708 -645693 -647223 -661283 -656356 -649539 -636863 -648605 -649256 -656286 -649570
2286 -649570 -632525 -608676 -593809 -611197 -620754 -609127 -604392 -641305 -666324 -656578 -649003 -670350
2274 -670350 -675190 -658871 -634326 -650400 -645282 -636522 -653704 -674425 -657375 -639387 -622876 -611084
2262 -611084 -627928 -628361 -641807 -660455 -652581 -659613 -665044 -658154 -670652 -660579 -637059 -608598 -628195
2249 -628195 -644314 -655835 -647287 -658079 -677866 -672248 -655341 -635784 -637050 -627863 -630986 -621247 -616342
2236 -616342 -633877 -655317 -631379 -628198 -628119 -631539 -630791 -634072 -623184 -613857 -632556 -637492 -649224 -655552
2222 -655552 -642553 -663018 -647996 -652386 -664797 -642347 -641768 -637483 -633072 -646861 -638573 -611802 -605232
2209 -605232 -591515 -618521 -631816 -631970 -623351 -622338 -623155 -609609 -586643 -587255 -593722 -609931 -642345
2196 -642345 -648478 -635476 -642048 -634739 -641428 -647939 -642370 -637977 -640261 -637679 -651641 -628119 -636591 -646299
2182 -646299 -637987 -609497 -581563 -580681 -594517 -602620 -628700 -635590 -632560 -631993 -623042 -627373 -621023 -627787
2168 -627787 -638460 -630680 -634679 -643937 -643083 -629000 -622202 -613773 -607390 -638420 -669492 -663702 -628903
2155 -628903 -612234 -624819 -621795 -623790 -630796 -633379 -624989 -611980 -607429 -619370 -617701 -617040 -627299
2142 -627299 -648768 -644508 -640193 -641582 -649038 -638135 -626513 -621959 -634427 -623214 -611932 -623234 -618493
2129 -618493 -638307 -657407 -640119 -620124 -585333 -591214 -602599 -605188 -621156 -626129 -618112 -618535 -615954
2116 -615954 -636455 -616201 -615092 -624597 -643014 -638865 -653264 -673900 -645373 -617313 -631890 -634718
2104 -634718 -614914 -611731 -634892 -650870 -660177 -648170 -655463 -659944 -656942 -670999 -671917 -645758 -639004
2091 -639004 -650118 -643903 -648131 -634151 -642264 -666346 -665987 -638495 -629680 -611055 -595072 -623899 -644042
2078 -644042 -655991 -657406 -661457 -653606 -635883 -656751 -661475 -629111 -588536 -591286 -608073 -596258 -575878
2065 -575878 -596414 -601433 -592490 -584035 -591317 -603297 -618742 -626768 -635647 -647051 -625007 -625383 -604503
2052 -604503 -615202 -651227 -659218 -636007 -642159 -643478 -636274 -614422 -621984 -636643 -629416 -625204 -623710
2039 -623710 -619695 -625548 -627289 -625933 -622708 -602854 -581299 -577891 -596349 -616625 -630039 -641323 -642348
2026 -642348 -626221 -632180 -651740 -650818 -634587 -636108 -639921 -677236 -676058 -641429 -615219 -622031 -636035
2013 -636035 -626696 -632561 -633222 -632425 -614378 -603048 -590373 -579976 -578196 -595705 -608733 -611014 -599520
2000 -599520 -595516 -628205 -623674 -624200 -630378 -610477 -619201 -632151 -634962 -635623 -645223 -647781 -650412 -650892
1986 -650892 -627727 -617450 -609615 -625828 -608318 -606972 -606869 -599390 -601379 -581845 -572795 -582281 -605147
$$ [...]
##END NTUPLES=NMR SPECTRUM
##END=
