##TITLE=Analysis number 325822
Compound Code cc 52402
Book Reference 464/96/1
Project Code adrs
Chemist Name chrisr
##JCAMPDX= 6.0         $$ Bruker NMR JCAMP-DX V2.0
##DATA TYPE= NMR SPECTRUM
##DATA CLASS= NTUPLES
##ORIGIN= Bruker BioSpin GmbH
##OWNER= nmr
$$ XWIN-NMR		Version 3.5
$$ Tue Jan 16 08:52:59 2007 GMT Standard Time (UT+0h)  MAYBRIDGE\nmr@NMR_250MHZ
##.OBSERVE FREQUENCY= 250.131544655141
##.OBSERVE NUCLEUS= ^1H
##.ACQUISITION MODE= SIMULTANEOUS (DQD)
##.ACQUISITION SCHEME= undefined
##.AVERAGES= 16
##.DIGITISER RES= 18
##SPECTROMETER/DATA SYSTEM= dpx250
##.PULSE SEQUENCE= zg30
##.SOLVENT NAME= CDCl3
##.SHIFT REFERENCE= (INTERNAL, CDCl3, 0, 16.522)
##AUDIT TRAIL= $$ (NUMBER, WHEN, WHO, WHERE, WHAT)
$$ ##TITLE= Audit trail, XWIN-NMR		Version 3.5
$$ ##JCAMPDX= 5.01
$$ ##ORIGIN= Bruker BioSpin GmbH
$$ ##OWNER= nmr
$$ C:\u/data/dgb/nmr/ADRS/1170/pdata/1/auditp.txt
$$ ##AUDIT TRAIL=  $$ (NUMBER, WHEN, WHO, WHERE, WHAT)
(   1,<2007-01-16 08:52:36.74 +000>,<MAYBRIDGE\nmr>,<NMR_250MHZ>,
      <created by zg, POWCHK disabled, PULCHK disabled
       configuration hash MD5:
       49 4B E0 1D 92 C2 6B 37 9F E6 65 BC 52 41 86 1D
       data hash MD5: 64K
       0F 35 96 9B 51 54 32 80 EF 37 E7 7B C1 71 1F CF>)
(   2,<2007-01-16 08:52:49.90 +000>,<MAYBRIDGE\nmr>,<NMR_250MHZ>,
      <Start of raw data processing
       ef LB = 0.3 FT_mod = 6 PKNL = 1 SI = 32K 
       data hash MD5: 32K
       6C E1 9D C2 21 C1 AF FC D7 1C 45 3D 77 DD 53 C3>)
(   3,<2007-01-16 08:52:51.61 +000>,<MAYBRIDGE\nmr>,<NMR_250MHZ>,
      <apk 
       data hash MD5: 32K
       9A 2F FF 07 82 9A F7 A1 24 BC 7E D2 2E 22 28 DC>)
(   4,<2007-01-16 08:52:52.40 +000>,<MAYBRIDGE\nmr>,<NMR_250MHZ>,
      <abs ABSG = 5 
       data hash MD5: 32K
       DB 3F 1E F6 BB 50 E8 E3 B8 E1 D1 44 1B 16 E4 7E>)
$$ ##END=
$$ 
$$ hash MD5
$$ D6 2F 81 CF 7E 5A 80 9B FB 6F 17 FD 7C 16 BE 55
##$RELAX= 
##$RELAX= 
##$RELAX= 
##$RELAX= 
##$RELAX= 
##$RELAX= 
##$RELAX= 
$$ Bruker specific parameters
$$ --------------------------
##$DU= <C:\u>
##$EXPNO= 1170
##$NAME= <ADRS>
##$PROCNO= 1
##$TYPE= <nmr>
##$USER= <dgb>
##$AMP= (0..31)
100 100 100 100 100 100 100 100 100 100 100 100 100 100 100 100 100 100 
100 100 100 100 100 100 100 100 100 100 100 100 100 100 
##$AQSEQ= 0
##$AQ_mod= 3
##$AUNM= <au_zg>
##$AUTOPOS= <2 >
##$BF1= 250.13
##$BF2= 250.13
##$BF3= 250.13
##$BF4= 250.13
##$BF5= 500.13
##$BF6= 500.13
##$BF7= 500.13
##$BF8= 500.13
##$BYTORDA= 1
##$CFDGTYP= 0
##$CFRGTYP= 5
##$CHEMSTR= <none>
##$CNST= (0..31)
1 1 145 1 1 1 1 1 1 1 1 1 1 1 1 1 1 1 1 1 1 1 1 1 1 1 1 1 1 1 1 1 
##$CPDPRG= <>
##$CPDPRG1= <>
##$CPDPRG2= <>
##$CPDPRG3= <>
##$CPDPRG4= <mlev>
##$CPDPRG5= <mlev>
##$CPDPRG6= <mlev>
##$CPDPRG7= <mlev>
##$CPDPRG8= <mlev>
##$CPDPRGB= <>
##$CPDPRGT= <>
##$D= (0..31)
0 1 0 0 0 0 0 0 0 0.06 0 0 0 0 0 0 0.0002 0 0 0 0 0 0 0 0 0 0 0 0 0 0 
0 
##$DATE= 1168937555
##$DBL= (0..7)
120 120 120 120 120 120 120 120 
##$DBP= (0..7)
150 150 150 150 150 150 150 150 
##$DBP07= 0
##$DBPNAM0= <>
##$DBPNAM1= <>
$$ [...]
##$SUBNAM7= <"">
##$SUBNAM8= <"">
##$SUBNAM9= <"">
##$SW= 20.6930455092707
##$SWIBOX= (0..15)
0 0 3 0 0 0 0 0 0 0 0 0 0 0 0 0 
##$SW_h= 5175.983436853
##$TD= 65536
##$TD0= 1
##$TE= 294.16
##$TE2= 300
##$TE3= 300
##$TEG= 300
##$TL= (0..7)
0 120 120 120 120 120 120 120 
##$TP= (0..7)
150 150 150 150 150 150 150 150 
##$TP07= 0
##$TPNAME0= <>
##$TPNAME1= <>
##$TPNAME2= <>
##$TPNAME3= <>
##$TPNAME4= <>
##$TPNAME5= <>
##$TPNAME6= <>
##$TPNAME7= <>
##$TPOAL= (0..7)
0.5 0.5 0.5 0.5 0.5 0.5 0.5 0.5 
##$TPOFFS= (0..7)
0 0 0 0 0 0 0 0 
##$TUNHIN= 0
##$TUNHOUT= 0
##$TUNXOUT= 0
##$USERA1= <user>
##$USERA2= <user>
##$USERA3= <user>
##$USERA4= <user>
##$USERA5= <user>
##$V9= 5
##$VALIST= <valist>
##$VCLIST= <CCCCCCCCCCCCCCC>
##$VD= 0
##$VDLIST= <DDDDDDDDDDDDDDD>
##$VPLIST= <PPPPPPPPPPPPPPP>
##$VTLIST= <TTTTTTTTTTTTTTT>
##$WBST= 1024
##$WBSW= 4
##$XGAIN= (0..3)
0 0 0 0 
##$XL= 0
##$YL= 0
##$YMAX_a= 367610
##$YMIN_a= -617707
##$ZGOPTNS= <>
##$ZL1= 120
##$ZL2= 120
##$ZL3= 120
##$ZL4= 120
##$ABSF1= 16.522
##$ABSF2= -4.171173
##$ABSG= 5
##$ABSL= 3
##$ALPHA= 0
##$AQORDER= 0
##$ASSFAC= 0
##$ASSFACI= 0
##$ASSFACX= 0
##$ASSWID= 0
##$AUNMP= <proc_1d>
##$AZFE= 0.1
##$AZFW= 0.1
##$BCFW= 0
##$BC_mod= 0
##$BYTORDP= 0
##$COROFFS= 0
##$CY= 12.5
##$DATMOD= 1
##$DC= 0
##$DFILT= <>
##$DTYPP= 0
##$F1P= 14.0000005364418
##$F2P= -0.99999901652339
##$FCOR= 0.5
##$FTSIZE= 32768
##$FT_mod= 6
##$GAMMA= 0
##$GB= 0
##$INTBC= 1
##$INTSCL= 1
##$ISEN= 128
##$LB= 0.3
##$LEV0= 0
##$LPBIN= 0
##$MAXI= 10000
##$MC2= 0
##$MEAN= 0
##$ME_mod= 0
##$MI= 0
##$NCOEF= 0
##$NC_proc= -4
##$NLEV= 6
##$NOISF1= 0
##$NOISF2= 0
##$NSP= 0
##$NTH_PI= 0
##$NZP= 0
##$OFFSET= 16.522
##$PC= 1
##$PHC0= 226.7535
##$PHC1= 7.229127
##$PH_mod= 1
##$PKNL= yes
##$PPARMOD= 0
##$PSCAL= 4
##$PSIGN= 0
##$REVERSE= no
##$SF= 250.13
##$SI= 32768
##$SIGF1= 0
##$SIGF2= 0
##$SINO= 400
##$SIOLD= 32768
##$SREGLST= <1H.CDCl3>
##$SSB= 0
##$STSI= 32768
##$STSR= 0
##$SW_p= 5175.98343685301
##$SYMM= 0
##$S_DEV= 0
##$TDeff= 65536
##$TDoff= 0
##$TI= <Analysis number 999999
Compound Code 99
Book Reference 9
Project Code 9>
##$TILT= no
##$TM1= 0
##$TM2= 0
##$TOPLEV= 0
##$USERP1= <user>
##$USERP2= <user>
##$USERP3= <user>
##$USERP4= <user>
##$USERP5= <user>
##$WDW= 1
##$XDIM= 32768
##$YMAX_p= 283760446
##$YMIN_p= -126359
$$ End of Bruker specific parameters
$$ ---------------------------------
##NTUPLES= NMR SPECTRUM
##VAR_NAME=  FREQUENCY,     SPECTRUM/REAL,   SPECTRUM/IMAG
##SYMBOL=    X,             R,               I
##VAR_TYPE=  INDEPENDENT,   DEPENDENT,       DEPENDENT
##VAR_FORM=  AFFN,          ASDF,            ASDF
##VAR_DIM=   32768,         32768,           32768
##UNITS=     HZ,            ARBITRARY UNITS, ARBITRARY UNITS
##FACTOR=    0.157963299565203, 1,           1
##FIRST=     4132.6476996994, 0,             0
##LAST=      -1043.33573715361, 0,           0
##MIN=       -1043.33573715361, -126359,     0
##MAX=       4132.6476996994, 283760446,     0
$$ Real data points
##PAGE= N=1
##DATA TABLE= (X++(R..R)), XYDATA
$$ [...]
23412A7472J275j3106n790k2426r610Q427j1442J4688j0615r208Q106O350L13
$$ 17472 18747 5641 -149 -22575 -32185 -23758 -35200 -20512 -31127 -40335 -32229 -25879 -25566
23399b5566K8526J0924R315J1454j5220J226p249o578j2493m739P851N755j3615
$$ -25566 2960 13884 23199 34653 19433 20659 13410 6832 -5661 -10400 -2549 3206 -10409
23386a0409n097J8263n780o745M335J1644J5869l3561L665J0603l334j7975k6786
$$ -10409 -15506 2757 -3023 -9768 -5433 6211 22080 -11481 -7816 2787 -547 -18522 -45308
23373d5308o202J5264p41l649J142J4551L0666Q622j898k7398r446j789J5382
$$ -45308 -51510 -36246 -36987 -40636 -39494 -24943 5723 14345 12447 -14951 -24397 -26186 -10804
23360a0804J1745k2675j3928L4772j3694J766m072O096P920P725K0997k1648k3401
$$ -10804 941 -21734 -35662 -890 -14584 -12818 -16890 -10794 -2874 4851 25848 4200 -19201
23347a9201m282n555l6074J586N5441L5032o492R437p16j0415L505P809p577k9475
$$ -19201 -23483 -29038 -65112 -63526 -8085 26947 20455 29892 29176 18761 22266 30075 22498 -6977
23333f977n485j4802k4461L5592O2983j683m3736n947J162j5222k461N812P867
$$ -6977 -12462 -27264 -51725 -16133 46850 45167 1431 -4516 -3354 -18576 -21037 -15225 -7358
23320g358K1499n456R513n007n7873k6275M5139K2338j5480J430J2375J4800j168
$$ -7358 14141 8685 18198 13191 -44682 -70957 -25818 -3480 -18960 -17530 -5155 9645 8477
23307H477k3974M809K5300k3236o939j0661n1309k1367K0092J8407p238J2875
$$ 8477 -15497 -10688 14612 -8624 -15563 -26224 -77533 -98900 -78808 -60401 -67639 -54764
23295e4764L5255q298k3341j0888K3264L7291r785l9892K519J1004j3792M69J2047
$$ -54764 -19509 -27807 -51148 -62036 -38772 -1481 -11266 -51158 -48639 -37635 -51427 -50958 -38911
23282c8911J6452L5643N029l134k3129l389j0511l3613K5423O533K6860j361k046
$$ -38911 -22459 13184 18213 15079 -8050 -11439 -21950 -55563 -30140 -23607 3253 1892 -154
23269a54J4792J8815j060k5215R03L003k4328j3477j5498L2731L154l558L399
$$ -154 14638 33453 32393 7178 8081 11084 -13244 -26721 -42219 -9488 -6334 -9892 -6493
23256f493j8909J5078K8134Q19j2863j5046j1549j978K1474l251j5612j59K6751
$$ -6493 -25402 -10324 17810 18629 5766 -9280 -20829 -22807 -1333 -4584 -20196 -20355 6396
23243F396J9067K15l6569k2888J0550m916R267J8718n824p821j0542Q704L7015
$$ 6396 25463 25678 -10891 -33779 -23229 -28145 -18878 -160 -5984 -13805 -24347 -15643 21372
23230B1372l951M430l466r58k4008k2533K0416J1866J1981k4024l7958J0902Q611
$$ 21372 17421 21851 18385 17427 -6581 -29114 -8698 3168 15149 -8875 -46833 -35931 -27320
23217b7320L5588K6218J5570m718j7359k7948l705J8464K273j4282J673k1371
$$ -27320 8268 34486 50056 45338 27979 31 -3674 14790 17063 2781 4454 -16917
23205a6917l2042J7893J8928l086M583q789R15J0320r924j2664K3861J1233j5067
$$ -16917 -48959 -31066 -12138 -15224 -10641 -19430 -18515 -8195 -18119 -30783 -6922 4311 -10756
23192a0756j8785J7621L9755l992j5846P879j0464k8876l5256r347K5651J0302
$$ -10756 -29541 -11920 27835 23843 7997 15876 5412 -23464 -58720 -68067 -42416 -32114
23180c2114K4105K3341J803k2864K909Q751q526J8770l579j0379k110R475J5087
$$ -32114 -8009 15332 17135 -5729 -2820 5931 -2595 16175 12596 2217 107 9582 24669
23167B4669n664M594J2716n008j0924l2062j2477P057P261O273j8497l5120J3847
$$ 24669 19005 23599 36315 31307 20383 -11679 -24156 -17099 -9838 -3565 -22062 -57182 -43335
23154d3335L1347R967R752L621P875p301l872R314K0313J756J2332j1705k0090
$$ -43335 -11988 -2021 7731 11352 19227 11926 8054 17368 37681 39437 51769 40064 19974
23141A9974j3405K0218k2314k3437j9970o454k280L946P615L5439J1255l6220
$$ 19974 6569 26787 4473 -18964 -38934 -45388 -47668 -43722 -36107 -668 10587 -25633
23129b5633j0000J7512l2807J98j2731n737K5464p467J6443m263l618J3407k2110
$$ -25633 -35633 -18121 -50928 -50730 -63461 -69198 -43734 -51201 -34758 -39021 -42639 -29232 -51342
23116e1342J6952R363L936r391o895q910k481o152L363K0633K3239K4784n463
$$ -51342 -34390 -25027 -21091 -30482 -37377 -46287 -48768 -54920 -51557 -30924 -7685 17099 11636
23103A1636j1836J0766K5365J8307r800j5009k4957j9759j5975k001N533J0356
$$ 11636 -200 10566 35931 54238 44438 29429 4472 -15287 -31262 -33263 -27730 -17374
23091a7374r255k390J8333n66j6722J1078K7436O803n085J3334q401P623P951
$$ -17374 -26629 -29019 -10686 -11252 -27974 -16896 10540 17343 12258 25592 17191 24814 32765
23078C2765K1405K900j548k412k3065j9908J1694j0784m369m321k88M322Q266
$$ 32765 54170 57070 55522 53110 30045 10137 21831 11047 6678 2357 2069 6391 14657
23065A4657O446m469J6331O303o378m480o051k2964QK1226j590p403J7363J6207
$$ 14657 21103 16634 32965 39268 32890 28410 22359 -605 -597 20629 19039 11636 28999 45206
23051D5206r319j9541o69Q38k5569l7971k181R600j2777J6269J3772N1580J6683
$$ 45206 35887 16346 15677 16515 -9054 -47025 -49206 -39606 -52383 -36114 -22342 29238 45921
23038D5921m2435j2305J0760J6914K2077q278j6064l8M624k4734p539j8113m442
$$ 45921 3486 -8819 1941 18855 40932 32654 16590 16552 21176 -3558 -11097 -29210 -33652
23025c3652R282J523L3055L2476l6796k470Q013k1606J3353N178j2283j3634q485
$$ -33652 -24370 -22847 10208 42684 5888 3418 11431 -10175 3178 8356 -3927 -17561 -26046
23012b6046J143N40n436k877J1321L2638J1799k1159K4028J9878j2622J2083l3214
$$ -26046 -24903 -24363 -29799 -32676 -21355 11283 23082 1923 25951 45829 33207 45290 12076
22999A2076n914J5798N192o349m851K6327Q923J8807k70J34K738j1400j5645l0923
$$ 12076 6162 21960 27152 20803 15952 42279 51202 70009 69739 69873 72611 61211 45566 14643
22985A4643j267j0823l531m92l4972L489P710q528J2413J2493Q053j2236O266
$$ 14643 13376 2553 -978 -1470 -36442 -32953 -25243 -33771 -21358 -8865 -812 -13048 -6782
22972f782M316j2383L0103K8823J9497j0118n450o655j5493q253k5845p253J5883
$$ -6782 -2466 -14849 15254 44077 63574 53456 48006 41351 25858 17605 -8240 -15493 390
22959C90O046J2693J697P170J0219l7734k6953R615J1377N818o815p440j7355
$$ 390 6436 19129 20826 27996 38215 481 -26472 -16857 -5480 338 -6477 -13917 -31272
22946c1272j5917J558j5549m865J3973n023r177L1151N1338l190k2598m891Q417
$$ -31272 -47189 -45631 -61180 -66045 -52072 -57095 -66272 -35121 16217 13027 -9571 -14462 -6045
22933f045j6619K3004K066k4996j4742K8537P377O767K8775r957k4643J3206k3476
$$ -6045 -22664 340 2406 -22590 -37332 -8795 -1418 5349 34124 24167 -476 12730 -10746
22920a0746j1832K4085J3065N146r58Q901j619k4173r391j2775l0928L2905P739
$$ -10746 -22578 1507 14572 19718 18760 27661 26042 1869 -7522 -20297 -51225 -18320 -10581
22907a0581R711N814Q151L0967J939K819K0995M178j3794j3010r370j7409R006
$$ -10581 -870 4944 13095 44062 46001 48820 69815 73993 60199 47189 37819 20410 29416
22894B9416J7139k731l2188k8152K264K3745J9244J1493k7007j1966J3659K5086
$$ 29416 46555 43824 11636 -16516 -14252 9493 28737 40230 13223 1257 14916 40002
22882D0002j8073j5670m387j2497R805J1224N243j01j7459j6434j1850n731j4761
$$ 40002 21929 6259 1872 -10625 -820 10404 15647 15546 -1913 -18347 -30197 -35928 -50689
22869e0689P424M5713J5076M0J4109j3742k0526R833R632J7373K61k1905r867
$$ -50689 -43265 2448 17524 17564 31673 17931 -2595 7238 16870 34243 34504 12599 2732
22856B732N216L496P393k283j4101R367j8195L365L4360K2860j3644m950p103
$$ 2732 7948 11444 18837 16554 2453 11820 -6375 -3010 31350 54210 40566 35616 28513
22843B8513j745K235n961l4701k9781J672n513L895j9017K9358R359M604K4084
$$ 28513 26768 29003 23042 -11659 -41440 -39768 -45281 -41386 -60403 -31045 -21686 -17082 7002
22830G002J4529k9002k7544K6979K5539J7056j4419p51J1102N594M098Q956k3237
$$ 7002 21531 -7471 -35015 -8036 17503 34559 20140 19389 30491 36085 40183 49139 25902
22817B5902k1402l161J3208N46j7607k365N251J4039j248k0625n45L8557J0825
$$ 25902 4500 1339 14547 15093 -2514 -4879 372 14411 13163 -7462 -8007 30550 41375
22804D1375L37j970n825j2924m0656l3007K5362J4887J3677K7702n681k2580k0939
$$ 41375 41712 39742 33917 20993 -19663 -52670 -27308 -12421 1256 28958 23277 697 -20242
22791b0242r851j6068J1734J1704J4746k460l317J9745j664M895l86N82j4812
$$ -20242 -30093 -46161 -34427 -22723 -7977 -10437 -13754 5991 4327 9222 8836 9418 -5394
22778e394k2663k1035J4582M1097p6r55J9551o063j6653j1571n678J5154O934
$$ -5394 -28057 -49092 -34510 6587 6511 5556 25107 19044 2391 -9180 -14858 296 7230
22765G230J1763j2961k0192J667j7429j3509O283L8572r906k4040m472L3069L578
$$ 7230 18993 6032 -14160 -12493 -29922 -43431 -37148 1424 -8482 -32522 -36994 -3925 -347
22752c47k469j2787k6990J6622j2794j9420k407P559m322J829J4575J9185J0345
$$ -347 -2816 -15603 -42593 -25971 -38765 -58185 -60592 -53033 -57355 -55526 -40951 -21766 -11421
22739a1421J0747k0373Q778K1529K3k4929q033Q202k4974L9182M1239j6138k1829
$$ -11421 -674 -21047 -12269 9260 9283 -15646 -23679 -15477 -40451 -1269 39970 23832 2003
22726B003J9768j8556j9025l0146j5746m531M781J1528K7180j8803j4269L4085
$$ 2003 21771 3215 -15810 -45956 -61702 -66233 -61452 -49924 -22744 -41547 -55816 -21731
22714b1731K7045J9118l3980j3380P854M209J512l583J4667O502o765K976N687
$$ -21731 5314 24432 -9548 -22928 -15074 -10865 -9353 -12936 1731 8233 1468 4444 10131
22701A0131k7785J5021R865r049j9962k0133J1180n961J4429L4933o743k5966
$$ 10131 -17654 -2633 7232 -1817 -21779 -41912 -30732 -36693 -22264 12669 5926 -20040
22689b0040q945K88M4809K5391J5746j5064k9386k6312o107j6034j8579L665J1577
$$ -20040 -28985 -28697 16112 41503 57249 42185 12799 -13513 -19620 -35654 -54233 -50568 -38991
22676c8991J0290J1792L1724l903j2212j606r206P365j7577j2690J9106O757j4603
$$ -38991 -28701 -16909 14815 10912 -1300 -2906 -12112 -4747 -22324 -35014 -15908 -9151 -23754
22663b3754j0986J015L5354k0670o595K7276J6048j7014R268j359j0531J2642
$$ -23754 -34740 -33725 1629 -19041 -25636 1640 17688 674 9942 8583 -1948 10694
22651A0694j9643P588n689o556K1894k1125J7881k283j0553k7743Q407L337R970
$$ 10694 -8949 -1361 -7050 -13606 8288 -12837 5044 2761 -7792 -35535 -27128 -23791 -13821
22638a3821j6201k3971j20J2761P112K2682K763J809J2852O605R5p43j5759l061
$$ -13821 -30022 -53993 -54113 -41352 -34240 -11558 -8795 -6986 5866 12471 12566 11823 -3936 -6997
22624f997o629q39J9777J3715k850o049J1550K2458R773J494q242r954j2879j095
$$ -6997 -13626 -14465 5312 19027 16177 10128 21678 44136 53909 55403 47161 37207 24328 23233
22610B3233o678l2497m804K2662M7971P654m2900J1552L907j497l922k2511j7533
$$ 23233 16555 -15942 -20746 1916 49887 57541 14641 26193 30100 28603 24681 2170 -15363
22597a5363N209n156m156K1180m117J4566K7585k8737k8873N732J9409K9814k5515
$$ -15363 -10154 -15310 -19466 1714 -2403 12163 39748 11011 -17862 -12130 7279 37093 11578
22584A1578l4824j8204J955k578J9373K979j8052N465N399m321J3759l91k4019
$$ 11578 -23246 -41450 -39495 -42073 -22700 -19721 -37773 -32308 -26909 -31230 -17471 -17862 -41881
22571d1881L990L7406K1560J874j553l1046j1606L135J4372J3767r075K661Q044
$$ -41881 -37891 -485 21075 22949 21396 -9650 -21256 -18121 -3749 10018 943 3604 11648
22558A1648L25j5554L570Q522k200k5799j1113N510L27K1910j513K3697J9528
$$ 11648 11973 -3581 -11 8511 6311 -19488 -30601 -25091 -24764 -2854 -4367 19330 38858
22545C8858j2188j0215J8067n964k83k6176j8319k284j0413J4517O989k3222j7403
$$ 38858 26670 16455 34522 28558 28275 2099 -16220 -18504 -28917 -14400 -7411 -30633 -48036
22532d8036K5861J7896O623J8304L82k5648j8565j5890j88K6275m679j8127J0390
$$ -48036 -22175 -4279 2344 20648 21030 -4618 -23183 -39073 -39261 -12986 -17665 -35792 -25402
22519b5402J7194J3452K727J4285J6972p370p026R364k3111k1039J3083j9532
$$ -25402 -8208 5244 7971 22256 39228 31858 24832 34196 11085 -9954 3129 -16403
22507a6403k7419j7262j1946M8306J7527N662L296k0521J72K1599j8394l4994
$$ -16403 -43822 -61084 -73030 -24724 -7197 -1535 1761 -18760 -18588 3011 -15383 -50377
22495e0377J5401L193q57j825N97r471J4008J5028P987M292K642P317N520j199
$$ -50377 -34976 -31783 -32640 -34465 -33868 -43339 -29331 -14303 -6316 -2024 618 7935 13455 12256
22481A2256n089l4632k7848j395N649P933P259j7147m9403k0720K6449N2037O478
$$ 12256 7167 -27465 -55313 -56708 -51059 -43126 -35867 -53014 -102417 -123137 -96688 -44651 -38173
22468c8173K4207K9893j1728O603m118l127L271j236O58j3409j4722L113J8108
$$ -38173 -13966 15927 4199 10802 6684 3557 6828 5592 6250 -7159 -21881 -18768 -660
22455f60O554M701M380p516P870p495r506j5444o053J274l221M527r394j892o754
$$ -660 5894 10595 14975 7459 15329 7834 -1672 -17116 -23169 -21895 -25116 -20589 -29983 -31875 -38629
22440c8629M358K427k4637P963N1696K648J7746k904l1588j4609M0582K5838R643
$$ -38629 -34271 -31844 -56481 -48518 3178 5826 23572 20668 -10920 -25529 15053 40891 50534
22427E0534j9525j0571j3061k6550j3012J8233J4597J1784m0749j4258L9105J4650
$$ 50534 31009 20438 7377 -19173 -32185 -13952 645 12429 -28320 -42578 -3473 11177
22415A1177J5631l3086j3699J303j9239J1609K147k7154J3863p705j6204P497
$$ 11177 26808 -6278 -19977 -18674 -37913 -26304 -24157 -51311 -37448 -45153 -61357 -53860
22403e3860N0825L9447O260p823k1098k1818j4346K9383K2473j4702n318p169
$$ -53860 -3035 36412 42672 34849 13751 -8067 -22413 6970 29443 14741 9423 2254
22391B254o571J3685j2873n987J7167L3067l725k2786j5701m764q509K7604J2251
$$ 2254 -4317 9368 -3505 -9492 7675 40742 37017 14231 -1470 -6234 -14743 12861 25112
22378B5112J6890j2706K123k4103o130J0930r206q463K5952j5669k948o281M154
$$ 25112 42002 29296 31419 7316 1186 12116 2910 -5553 20399 4730 1782 -4499 -345
22365c45k012P673R371j7483j5320J6630O601l647J0190o440k4899l3000k1545
$$ -345 -2357 5316 14687 -2796 -18116 -1486 5115 1468 11658 5218 -19681 -52681 -74226
22352g4226J4940K2257J3133r967O271P717k900J3528j7313J0701K7844N182k1793
$$ -74226 -59286 -37029 -23896 -33863 -27592 -19875 -22775 -9247 -26560 -15859 11985 17167 -4626
22339d626L0497k807k0696K3474J6979J3398l8364k7882k2204m756J1744K1484
$$ -4626 25871 23064 2368 25842 42821 56219 17855 -10027 -32231 -36987 -25243 -3759
22327c759l3160J640o152J1353j565q826j1379R072O981N242L649J190J8654J1572
$$ -3759 -36919 -35279 -41431 -30078 -31643 -40469 -51848 -42776 -35795 -30553 -26904 -25714 -7060 4512
22313D512J642K888k8395r194M580K4128L5546J637o627j3297j2122r419L801
$$ 4512 6154 9042 -19353 -28547 -23967 161 35707 37344 30717 17420 5298 -4121 -320
22300c20Q386M170j5240k4522K4990J6342K9087J094k4515j9134j5018l119Q21
$$ -320 8066 12236 -3004 -27526 -2536 13806 42893 43987 19472 338 -14680 -17799 -16978
22287a6978N888K20j5623p409L2972M706J8960j7669k685M425m17n121j4894j563
$$ -16978 -11090 -10870 -26493 -33902 -930 3776 22736 5067 2382 6807 6390 1269 -13625 -15188
22273a5188Q341r59m995q524Q192l274R130K4383j3600k4138j6658l39J8413K3336
$$ -15188 -6847 -7806 -12801 -21325 -13133 -16407 -7277 17106 3506 -20632 -37290 -37629 -19216 4120
22259D120J0820J1318J2516J518l2788k0604j3957q860J9946J7985j5278o929
$$ 4120 14940 26258 38774 40292 7504 -13100 -27057 -35917 -15971 2014 -13264 -20193
22247b0193P317j8460O926q540J0989n04j4874q653J6086Q997j0709J2909K5459
$$ -20193 -12876 -31336 -24410 -32950 -21961 -22465 -37339 -45992 -29906 -20909 -31618 -18709 6750
22234F750J0125R169l754j5135j1018q036j468N281j0197O810J8653J6068N222
$$ 6750 16875 26044 22290 7155 -3863 -11899 -13367 -8086 -18283 -11473 7180 23248 28470
22221B8470Q515J0266j846m2351J7280J431J92K4539n335j4138j3782j4304j4019
$$ 28470 36985 47251 45405 3054 20334 21765 21957 46496 41161 27023 13241 -1063 -15082
22208a5082J7109K4410k669M132k6901j2700R154J6528r511k0036p063o587K2828
$$ -15082 2027 26437 23768 27900 999 -11701 -2547 13981 4470 -15566 -22629 -29216 -6388
22195f388K04l1228j0565r868J7180J4448j6027J7514q304M558J5276J3562L5559
$$ -6388 -6184 -37412 -47977 -57845 -40665 -26217 -42244 -24730 -33034 -28476 -13200 362 35921
22182C5921k401p111J3611Q595j3394l7206r407J0660k856J5630J8633k4525k6039
$$ 35921 33520 26409 40020 48615 35221 -1985 -11392 -732 -3588 12042 30675 6150 -19889
22169a9889j7759L764j1208O042L885R360Q191q257R408K7809K993R178k7416
$$ -19889 -37648 -33884 -45092 -39050 -35165 -25805 -17614 -25871 -16463 11346 14339 23517 -3899
22156c899m3808j3361L5203K1831k606j5562j1082k906J1728k3251P583K7506
$$ -3899 -47707 -61068 -25865 -4034 -6640 -22202 -33284 -36190 -24462 -47713 -40130 -12624
22144a2624M419L272N199J916J7643l4955l7624J6078J6568r592j3185m245k61
$$ -12624 -8205 -4933 266 2182 19825 -15130 -52754 -36676 -20108 -29700 -42885 -47130 -47391
22131d7391j2201k709MK455L2503J3118j0822R434l2292k372K1076p977Q148K4905
$$ -47391 -59592 -62301 -62297 -59842 -27339 -14221 -25043 -15609 -47901 -50273 -29197 -37174 -29026 -4121
22117d121j1156j0660L0588N9177O224k4383k8546j3213R079J0886O657k3456
$$ -4121 -15277 -25937 4651 63828 70052 45669 17123 3910 12989 23875 30532 7076
22105G076J0543O606n5112k0298L5145K1529l912j7694p341K790J7988K2744M778
$$ 7076 17619 24225 -30887 -51185 -16040 5489 1577 -16117 -23458 -20668 -2680 20064 24842
22092B4842j2199J920j7397L794j7075j6642k1252J2351L859j1505K4975J6664
$$ 24842 12643 14563 -2834 960 -16115 -32757 -54009 -41658 -37799 -49304 -24329 -7665
22080g665L462J8015j6689M304M601l9141p152J8289L1454j8220k1537J1096L8779
$$ -7665 -4203 13812 -2877 1427 6028 -33113 -40265 -21976 9478 -8742 -30279 -19183 19596
22067A9596j4229R671J9614p058l0166j5205J2977J4666K3565j0013k6601l4266
$$ 19596 5367 15038 34652 27594 -2572 -17777 -4800 9866 33431 23418 -3183 -37449
22055c7449j0176J1200j5389O654J1406J0444M636J2646k05M767O909k605Q006
$$ -37449 -47625 -36425 -51814 -45160 -33754 -23310 -18674 -6028 -6233 -1466 5443 2838 10844
22042A0844r117N828r171l404j3219N013p77J6519J8362l3108K5O307J6260R036
$$ 10844 1727 7555 -1616 -5020 -18239 -13226 -14003 2516 20878 -12230 -12205 -5898 10362 19398
22028A9398m2740k3758R741M2458j3827j0319J6603J0986j4995k5795k3659J0411
$$ 19398 -23342 -47100 -37359 5099 -8728 -19047 -2444 8542 -6453 -32248 -55907 -45496
22016d5496K2291k961j231J7619O465j773M946j0698l879n834m828O076p033n316
$$ -45496 -23205 -26166 -27397 -9778 -3313 -5086 -140 -10838 -14717 -20551 -25379 -19303 -26336 -31652
22002c1652O19M958J9236j3570J9211K8996n734k1082o125M540k4979M280K6912
$$ -31652 -31033 -26075 -6839 -20409 -1198 27798 22064 982 -5143 -603 -25582 -21302 5610
21989E610p798l1374q333q839J8366K1178K1348Q770J142k340M41j1701m139K0710
$$ 5610 -2188 -33562 -41895 -50734 -32368 -11190 10158 18928 20070 17730 18171 6470 2331 23041
21975B3041l035P415M936o523k8178j8921m3022M269J8772N579K3112N9656J1856
$$ 23041 20006 27421 32357 25834 -2344 -21265 -64287 -60018 -41246 -35667 -12555 47101 58957
21962E8957q014j9860j9096l7034O163r827j2501J8214J1075K1843j6396o512
$$ 58957 50943 31083 11987 -25047 -18884 -28711 -41212 -22998 -11923 9920 -6476 -12988
21950a2988j2891n511L001J4782K1717L189L116k1593l4563O775K940j970N730
$$ -12988 -25879 -31390 -28389 -13607 8110 11299 14415 -7178 -41741 -34966 -32026 -33996 -28266
21937b8266M0023j7546j0413J1949R365J1425o327j5900p751l515J6712j3842
$$ -28266 11757 -5789 -16202 -4253 5112 16537 10210 -5690 -13441 -16956 -244 -14086
21925a4086k0591M514o797M675L0176l615J5343O509o935n399n885j1310K2703
$$ -14086 -34677 -30163 -36960 -32285 -2109 -5724 9619 16128 9193 3794 -2091 -13401 9302
21912I302J5618q832p007P555K3574l5869k3689p452N530j3523p500K4681L8151
$$ 9302 24920 16088 9081 16636 40210 4341 -19348 -26800 -21270 -34793 -42293 -17612 20539
21899B0539K1570j2926l2790p545o273r878J2195j7158K29K3801j8007j6187J1656
$$ 20539 42109 29183 -3607 -11152 -17425 -27303 -15108 -32266 -32037 -8236 -26243 -42430 -30774
21886c0774K4585q919J6660L9413j7289j5028o660j596K131J5917n566R205j620
$$ -30774 -6189 -15108 1552 40965 23676 8648 1988 392 2523 18440 12874 22079 20459
21873B0459j570k6826j4129j8547l705P19K8078K0270j216K1369j1383R849m929
$$ 20459 18889 -7937 -22066 -40613 -44318 -43599 -15521 4749 3533 24902 13519 23368 18439
21860A8439n366L202j3004j6976k074M8760j4960k5819J3953j3179k4015k5390
$$ 18439 13073 16275 3271 -13705 -15779 32981 18021 -7798 6155 -7024 -31039 -56429
21848e6429k9134J8654N6236r713l974L217j2584j1409O772O031J297r326L714
$$ -56429 -85563 -66909 -10673 -20386 -24360 -21143 -33727 -45136 -38364 -32333 -31036 -40362 -36648
21835c6648K0999N738O06l553p303J6879L579j3341J4825j4617m30n441l37l5083
$$ -36648 -15649 -9911 -9305 -12858 -20161 -3282 297 -13044 1781 -12836 -13266 -18707 -19044 -54127
21821e4127k1838l501K4335K7646K8444J6045k564k980K0293k3017R215J5080
$$ -54127 -75965 -79466 -55131 -27485 959 17004 14440 11460 31753 8736 17951 33031
21809C3031q199k0591N859l867j9451J964m561k8262J1064L6351J7021J304l9532
$$ 33031 24832 4241 10100 6233 -13218 -11254 -15815 -44077 -33013 3338 20359 21663 -17869
21796a7869n806J960j3865L307M728J5980M2372k304o120j8715j278L574j6863
$$ -17869 -23675 -21715 -35580 -32273 -27545 -11565 30807 28503 22383 3668 2390 5964 -10899
21783a0899k2584J2091r108o016L8842L3975J7984l0468k4654j1989k0953M971
$$ -10899 -33483 -21392 -30500 -36516 2326 36301 54285 23817 -837 -12826 -33779 -28808
21771b8808k989K4882J1368o381K113L172p957J5999K333j6260r302K1094L3621
$$ -28808 -31797 -6915 4453 -1928 185 3357 -4600 11399 13732 -2528 -11830 9264 42885
21758D2885p492j9527P347j3228O875K1623K2740k6644j1446J0118r791m1444
$$ 42885 35393 15866 23213 9985 16860 38483 61223 34579 23133 33251 23460 -17984
21746a7984k344O157j0826j4067R905J7067J1626J5975J992n444l226j6036k2762
$$ -17984 -20328 -14171 -24997 -39064 -29159 -12092 -466 15509 17501 12057 8831 -7205 -29967
21733b9967k8640J5914R592J9210J8627m243N606k3890O060M754K110P971R839
$$ -29967 -58607 -42693 -33101 -13891 4736 493 6099 -17791 -11731 -6977 -4867 3104 12943
21720A2943R354J3192q659J1240L3170p714k6062k4285J7945K3064k7827l5932
$$ 12943 22297 35489 26830 38070 71240 63526 37464 13179 31124 54188 26361 -9571
21708i571N378K0324J2892m110k5075k9370Q8o007R43Q826J149J2905j3642p443
$$ -9571 -4193 16131 29023 24913 -162 -29532 -29444 -35451 -34508 -25682 -24533 -11628 -25270 -32713
21694c2713J2516J4608j5187j6807N489n179N228R835J2349K3483L3116j9959
$$ -32713 -20197 -5589 -20776 -37583 -32094 -37273 -32045 -22210 -9861 13622 46738 26779
21682B6779j1746J6540k2569O06J7020Q543p186k5083l218K6058n78n962k2243
$$ 26779 15033 31573 9004 9610 26630 35173 27987 2904 -314 25744 25166 19204 -3039
21669c039N717j7662k216K1284m699m1571J4629J0366K5270Q567r581P976j0404
$$ -3039 2678 -14984 -17200 4084 -615 -42186 -27557 -17191 8079 16646 7065 15041 4637
21656D637L605J4963l022J2698j110k5165r268n296l949Q067L012j667R820O709
$$ 4637 8242 23205 20183 32881 31771 6606 -2662 -7958 -11907 -3840 -828 -2495 7325 14034
21642A4034M251o022j8078J2097J443K405r738j3249J4278J2804O392j1991l50
$$ 14034 18285 12263 -5815 6282 7725 10130 392 -12857 1421 14225 20617 8626 8276
21629H276K9646K8023l0771l8822J6406K4246k6741j7962j5002j2724J5758K2984
$$ 8276 37922 65945 35174 -3648 12758 37004 10263 -7699 -22701 -35425 -19667 3317
21617C317J0190l651Q047k4656n659J050Q432q262l306J1118N572l5124k866K2430
$$ 3317 13507 9856 17903 -6753 -12412 -11362 -2930 -11192 -14498 -3380 2192 -32932 -35798 -13368
21603a3368J6016r636K8658J641k0295k2951j5420O421J6659m70p075j3708k2090
$$ -13368 2648 -6988 21670 23311 3016 -19935 -35355 -28934 -12275 -12745 -19820 -33528 -55618
21590e5618M898K6718K3399J0844J0574l0873m0569k299K6945K1055J2580j3387
$$ -55618 -50720 -24002 -603 10241 20815 -10058 -50627 -52926 -25981 -4926 7654 -5733
21578e733j4716Q716J9896L0298l2737k0890k562Q135K805O803k393J8304j1011
$$ -5733 -20449 -11733 8163 38461 5724 -15166 -17728 -9593 -6788 15 -2378 15926 4915
21565D915q228p258J4721O901j2199K1551N850l0222P15O926J9894L867k7436
$$ 4915 -3313 -10571 4150 11051 -1148 20403 26253 -3969 -3254 3672 23566 27433 -3
21552ck3480q90q03J0963j2534N861J6504J4097L256j1944r208j836k1140M817
$$ -3 -23483 -24373 -25176 -14213 -26747 -20886 -4382 9715 12971 1027 -8181 -10017 -31157 -26340
21538b6340L1885K2308l7665k0794R966l771l10J9255J1538K1043m819r889K052
$$ -26340 5545 27853 -9812 -30606 -20640 -24411 -24721 -5466 6072 27115 22296 12407 14459
21525A4459j9843j9694J350R874l3867k709L8025l235r48l190j6172K7514K5097
$$ 14459 -5384 -25078 -23728 -13854 -47721 -50430 -12405 -15640 -16588 -19778 -35950 -8436 16661
21512A6661l662j5300K9070k7130m003l2301k3955J1070L5430K0608O812l6129
$$ 16661 12999 -2301 26769 -361 -4364 -36665 -60620 -49550 -14120 6488 13300 -22829
21500b2829P552J7502J976j9625K629r363n800j44J5090Q312m290j0945p085R567
$$ -22829 -15277 2225 4201 -15424 -12795 -22158 -27958 -28102 -13012 -4700 -8990 -19935 -27020 -17453
21486a7453P078j4073q879K9117K1685l859M087j4185k1075L910J233n739r530
$$ -17453 -10375 -24448 -33327 -4210 17475 13616 17703 3518 -17557 -13647 -12414 -18153 -27683
21473b7683j0354o759N929j8258K016r073J2564K5290J0174j1279Q9K572j4572
$$ -27683 -38037 -44796 -38867 -57125 -55109 -64182 -51618 -26328 -16154 -27433 -27344 -24772 -39344
21460c9344O407R609K5049J0230k1806j8145j509K0867J5883J8577k1001j1079
$$ -39344 -32937 -23328 1721 11951 -9855 -28000 -29509 -8642 7241 25818 4817 -6262
21448f262j6758j6363o725J6743r269J3780r732n084r080K7629l7760P558K7936
$$ -6262 -23020 -39383 -46108 -29365 -38634 -24854 -34586 -39670 -48750 -21121 -58881 -51323 -23387
21435b3387O721r822R018j7201j1544J5707R809o844l3223L557k3419J2123K5096
$$ -23387 -16666 -26488 -17470 -34671 -46215 -30508 -20699 -27543 -60766 -57209 -80628 -68505 -43409
21422d3409K285K0045l595K2183K0878r355k2826j3700j9048J3117K4059L2110
$$ -43409 -41124 -21079 -24674 -2491 18387 9032 -13794 -27494 -46542 -33425 -9366 22744
21410B2744o339j2304L933k3613J0777P337k2148Q217P755n643K164K6505J7799
$$ 22744 16405 4101 8034 -15579 -4802 2535 -19613 -11396 -3641 -9284 -7120 19385 37184
21397C7184l0249j5162j1068M0394J0573m761o757P088j0145k5148j4238J4024
$$ 37184 6935 -8227 -19295 21099 31672 26911 20154 27242 17097 -8051 -22289 -8265
21385h265k867l515K0323J6323J693n133Q523N717j3967l5643j5695K1443J9688
$$ -8265 -11132 -14647 5676 21999 23692 18559 27082 32799 18832 -16811 -32506 -11063 8625
21372H625j7486j5306P480J2025K50K9624m131l1633k5505L305j872R540j3827
$$ 8625 -8861 -24167 -16687 -4662 -4412 25212 21081 -10552 -36057 -32752 -34624 -25084 -38911
21359c8911M86j2573M31K8378J3946q402j0791J8336K0731q837j7101R71J2698
$$ -38911 -38425 -50998 -50567 -22189 -8243 -16645 -27436 -9100 11631 2794 -14307 -13336 -638
21346f38J494O836n959k2391O508J7002J4558q741r890q620P996J8829j1782q966
$$ -638 856 7692 1733 -20658 -14150 2852 17410 8669 -1221 -9841 -1845 16984 5202 -3764
21332c764n019L615K1792O740j0625k618m439q731J5771m420l0544j5374J28J4227
$$ -3764 -8783 -5168 16624 23364 12739 10121 5682 -3049 12722 8302 -22242 -37616 -37488 -23261
21318b3261L0421L5620p121j8479K3677L165l384k9650l2256L2636J5552k5326
$$ -23261 7160 42780 35659 17180 40857 44022 40638 10988 -21268 11368 26920 1594
21306A594k36m548j7003J4174k369p204j799o391j6429J7464K8664p245J9048
$$ 1594 1358 -3190 -20193 -6019 -8388 -15592 -17391 -23782 -40211 -22747 5917 -1328 17720
21293A7720j2854l1818l52J957J2777Q633J1812J0938K7069J0125j8635j1919
$$ 17720 4866 -26952 -27304 -25347 -12570 -3937 7875 18813 45882 56007 37372 25453
21281B5453o920j5687j8174j2204K3188L228j6450L24K351J1335o021k4183k6421
$$ 25453 18533 2846 -15328 -27532 -4344 -1116 -17566 -17242 -14891 -3556 -9577 -33760 -60181
21268f0181l027K1641k622j4247k304k022J248P882L4447K2524k7621k7519l414
$$ -60181 -63208 -41567 -44189 -58436 -60740 -62762 -61514 -53632 -19185 3339 -24282 -51801 -55215
21255e5215J5254M035Q761R082J8308J0515N826N262l6699j8481l020J8054J7142
$$ -55215 -39961 -35926 -27165 -18083 225 10740 16566 21828 -14871 -33352 -36372 -18318 -1176
21242a176J1665j896o207k5623O00L0961J1615l521q093k7144n09q59R078K5968
$$ -1176 10489 8593 2386 -23237 -22637 8324 19939 16418 8325 -18819 -19328 -20187 -11109 14859
21228A4859N19K48K1425l348j0122j9160k6853l545J1603q68N357J3846K320j3914
$$ 14859 15378 15626 37051 33703 23581 4421 -22432 -25977 -14374 -15242 -9885 3961 6281 -7633
21214g633l166l639k4996r236l0850J9781L1985M1382J1240j5314m923K851k6214
$$ -7633 -10799 -14438 -39434 -48670 -79520 -59739 -27754 13628 24868 9554 4631 7482 -18732
21201a8732j9402k01K0909J5355L0487j3586j6253j0628j3484J438M650j4221
$$ -18732 -38134 -38335 -17426 -2071 28416 14830 -1423 -12051 -25535 -24097 -19447 -33668
21189c3668O815p92K9853K9523J827j3533k1200l9160Q121L626J3131J0583n098
$$ -33668 -26853 -27645 2208 31731 33558 20025 -1175 -40335 -32214 -28588 -15457 -4874 -9972
21176i972j768o577q086r547n985J9093K0024j5005k0249M518j926O142M405M1614
$$ -9972 -11740 -18317 -26403 -35950 -41935 -22842 -2818 -17823 -38072 -33554 -35480 -29338 -24933 16681
21162A6681J2257k0594k5968j0765J428L0316K417l637j0309j1605k7709J7902
$$ 16681 28938 8344 -17624 -28389 -26961 3355 5772 2135 -8174 -19779 -47488 -29586
21150b9586L7362L5095r375l0522J4704K9734O514P715j9020o538l4942k9720
$$ -29586 7776 42871 33496 2974 17678 47412 53926 61641 42621 36083 1141 -28579
21138b8579n498K385J3167J1591J61K1027J8873L978k7689k3352L907K1256l1859
$$ -28579 -34077 -31692 -18525 -6934 -6773 14254 33127 37105 9416 -13936 -10029 11227 -20632
21125b0632k1552K9164O146l99j5630o263R556L415O94k4008J9690J3215l51o760
$$ -20632 -42184 -13020 -6874 -7273 -22903 -29166 -19610 -16195 -15501 -39509 -19819 -6604 -6955 -13715
21111a3715r911n908K2886K2251Q18l5973O683k0215N980K8061J4709L3127q767
$$ -13715 -23626 -29534 -6648 15603 16421 -19552 -12869 -33084 -27104 957 15666 48793 40026
21098D0026k2684j8402j8141j7186K7126L6146K8138j0338K315R242k7532J655
$$ 40026 17342 -1060 -19201 -36387 -9261 26885 55023 44685 47000 56242 28710 30365
21086C0365M767J0705j0140k6726n8011n579K3847n862j477J6751p784m853L6477
$$ 30365 35132 45837 35697 8971 -49040 -54619 -30772 -36634 -38111 -21360 -29144 -33997 2480
21073B480p777r644J9283J3140M775N235j5299q802q322k5039l3461N317J5828
$$ 2480 -5297 -14941 4342 17482 22257 27492 12193 3391 -4931 -29970 -63431 -58114 -42286
21060d2286J9204K2927K7259K9311j4046j4039J3337N368j8405J7428P764r216
$$ -42286 -23082 -155 27104 56415 42369 28330 41667 47035 28630 46058 53822 44606
21048D4606m555n064j3114O983r536j5788m465M487j5113j2290Q566j159J1629
$$ 44606 40051 34987 21873 28856 19320 3532 -933 3554 -11559 -23849 -15283 -16442 -4813
21035d813P418o417l47l969l0567k3266P725K2808K485R843K0753J5265q302r100
$$ -4813 2605 -3812 -4159 -8128 -38695 -61961 -54236 -31428 -28943 -19100 1653 16918 8616 -484
21021d84k104P778m171j829J5397J7087k513j5344j3457J8178k347l1532j386
$$ -484 -2588 5190 1019 -810 14587 31674 29161 13817 360 18538 16191 -15341 -16727
21008a6727J8428m906J432J5406K6525k1120J3934J3159l834k6196k1764k2644
$$ -16727 1701 -3205 -1773 13633 40158 19038 32972 46131 42297 16101 -5663 -28307
20996b8307K4946N0592J9705j7852j7954j8477j6213K2082M095M095r081L619
$$ -28307 -3361 47231 66936 49084 31130 12653 -3560 18522 22617 26712 17631 21250
20984B1250N7N439p893j9160k6567L2605K7766k0785m1519p798O573L5126L516
$$ 21250 21307 26746 18853 -307 -26874 5731 33497 12712 -28807 -36605 -30032 5094 8610
20971H610K667R148J0618O078k7139l9236j1693K0354k51j065n066n420j4248
$$ 8610 11277 20425 31043 37121 9982 -29254 -40947 -20593 -20844 -21909 -26975 -32395 -46643
20958d6643K5503P916J2660K3076L492o673J443M962m5010L827K6253O018o344
$$ -46643 -21140 -13224 -564 22512 26004 19331 20774 25736 -19274 -15447 10806 16824 10480
20945A0480j6640L243K0133J1612P933p349J76j9718j8186j0277j6286L3961J3461
$$ 10480 -6160 -2917 17216 28828 36761 29412 29588 9870 -8316 -18593 -34879 -918 12543
20932A2543r715r990j6291Q884L7088R54q429j2610j0040q743M23J5016J4051
$$ 12543 2828 -7162 -23453 -14569 22519 23473 15044 2434 -7606 -16349 -15926 -910 13141
20919A3141k4290Q609l825K4617m081l5267j3162J4401j1260l249K5699J8365
$$ 13141 -11149 -2540 -6365 18252 14171 -21096 -34258 -19857 -31117 -34366 -8667 9698
20907I698j9521j9537J5320J6555J7665r868K0798N088l6116M692J2435j0003
$$ 9698 -9823 -29360 -14040 2515 20180 10312 31110 36198 82 4774 17209 7206
20895G206j0177j2699j0438O333j3345L035K5096j0508L736j087J2754J0587j592
$$ 7206 -2971 -15670 -26108 -19775 -33120 -30085 -4989 -15497 -11761 -12848 -94 10493 8901
20882H901l214q605K951K0311r575j8972P976K5460J3633k1414M895j4829p861
$$ 8901 5687 -2918 33 20344 10769 -8203 -227 25233 38866 17452 22347 7518 -343
20869c43P018j4039N167j4891O87j4174j9711K3689L8091o145n583l1933k4568
$$ -343 6675 -7364 -2197 -17088 -16401 -30575 -50286 -26597 11494 5349 -234 -32167 -56735
20856e6735J0732L7041K5033k2912J4030q664j897Q538o857m306P816k8081j7016
$$ -56735 -46003 -8962 16071 -6841 7189 -1475 -3372 5166 -1691 -5997 1819 -26262 -43278
20843d3278K1702L136J3753j6503M874J5832m666n592R782O598o129L750l596
$$ -43278 -21576 -18440 -4687 -21190 -16316 -484 -5150 -10742 -960 5638 -491 3259 -337
20830c37P669L2349K5917j7961j9510j5446j1167j1906L141J3736M660j9430K5483
$$ -337 7332 39681 65598 47637 28127 12681 1514 -10392 -7251 6485 11145 -8285 17198
20817A7198J2538J8090k965k8526m0811J0257J9911J404l7389n624K7565J2408
$$ 17198 29736 47826 44861 16335 -24476 -14219 5692 7096 -30293 -35917 -8352 4056
20805D056J4861J6804j1105j6666P467K2904Q003O492l5492k3567j2085J0883
$$ 4056 18917 35721 24616 7950 15417 38321 46324 52816 17324 -6243 -18328 -7445
20793g445J8905l1241K632O934K9424j0092j8508j3981J9688J5331P316q070l9726
$$ -7445 11460 -19781 -17149 -10215 19209 9117 -9391 -23372 -3684 11647 18963 10893 -28833
20780b8833j6811k507K8223J0359m394N865K5994J4936L261R46M059P933j9721
$$ -28833 -45644 -48151 -19928 -9569 -13963 -8098 17896 32832 36093 37039 41098 49031 29310
20767B9310k2868k891k1106q917P119q616n131R613Q298r759m97K0409J2033p747
$$ 29310 6442 3551 -17555 -26472 -19353 -27969 -33100 -23487 -15189 -24948 -25445 -5036 6997 -750
20753g50K07J6316P644j5739L143R623k100j487l0947m649k123m139J1465K6114
$$ -750 -543 15773 23417 7678 10821 20444 18344 16857 -14090 -18739 -20862 -25001 -13536 12578
20739A2578K7785j493j1401j3692j9414J3358J4792j4429J5745n252j1294k8308
$$ 12578 40363 38870 27469 13777 -5637 7721 22513 8084 23829 18577 7283 -21025
20727b1025o31K4115J5586J5070J1139J4456k1300k2856j0656L2751K0235q568
$$ -21025 -21656 2459 18045 33115 44254 58710 37410 14554 3898 36649 56884 48316
20715D8316j6451j3594j2657k3714K274l262j4286J817N1887K4598k6646j2522
$$ 48316 31865 18271 5614 -18100 -15826 -19088 -33374 -31557 20330 44928 18282 5760
20703E760O127K6039R548Q616m923r677k8138J3231m059j3246k0185q283j263
$$ 5760 11887 37926 47474 56090 51167 41490 13352 26583 22524 9278 -10907 -19190 -20453
20690b0453j996k130J3242J8018j771j4377J7916o109j7173p887J6566r452J8144
$$ -20453 -22449 -24579 -11337 6681 4910 -9467 8449 2340 -14833 -22720 -6154 -15606 2538
20677B538q872j8775J3529J3547k5831r179K318K3561j718j9462R803j1552M323
$$ 2538 -6334 -25109 -11580 1967 -23864 -33043 -30725 -7164 -8882 -28344 -18541 -30093 -25770
20664b5770q444r883k590j8982J2841K5578J1716J7148J8442N278M870L3404K0178
$$ -25770 -34214 -44097 -46687 -65669 -52828 -27250 -15534 1614 20056 25334 30204 63608 83786
20651H3786l5248l9319j2956j3151j741l1082K3602Q391j175J6691K4537P661
$$ 83786 48538 9219 -3737 -16888 -18629 -49711 -26109 -17718 -18893 -2202 22335 29996
20639B9996j8657m495N265k2373k513o985R351k1864K2976J7657K0688J5073o992
$$ 29996 11339 6844 12109 -10264 -12777 -19762 -10411 -32275 -9299 8358 29046 44119 37127
20626C7127L322l5884n592O727o833J2041k543K6350K6828J8468l6854l1901k017
$$ 37127 40449 4565 -1027 5700 -1133 10908 8365 34715 61543 80011 43157 11256 9239
20613I239j5080k7026j7197K9945K6872J8740m930j5622k7276n659m859J8848
$$ 9239 -5841 -32867 -50064 -20119 6753 25493 20563 4941 -22335 -27994 -32853 -14005
20601a4005q039K5220L0649O349m0081J9668K0041j8229l4197j6976J2217J2503
$$ -14005 -22044 3176 33825 40174 93 19761 39802 21573 -12624 -29600 -17383 -4880
20589d880N11L070k0417J609J3828j550o333K2563Q007O95j4474p408j712J080
$$ -4880 -4369 -1299 -21716 -20107 -6279 -7829 -14162 8401 16408 17103 2629 -4779 -6491 -5411
20575e411L28O124M8704j0605l1234r192l730j2754P791k314N212k0184k967K8109
$$ -5411 -5083 1041 49745 39140 7906 -1286 -5016 -17770 -9979 -12293 -7081 -27265 -30232 -2123
20561b123L7916M086k0529J334r441J0795J5832q964m325P556M84O658J4157R566
$$ -2123 35793 39879 19350 20684 11243 22038 37870 28906 24581 32137 32621 39279 53436 63002
20547F3002q174k9386M519j1983p270j5027J0116J9353j082q166j5978p659K8124
$$ 63002 54828 25442 29961 17978 10708 -4319 5797 25150 24068 15902 -76 -7735 20389
20534B0389p62j4625j2722j0464K2108O188k8702K1293K3608j1067l273j6151
$$ 20389 19627 5002 -7720 -18184 3924 10112 -18590 2703 26311 15244 11971 -4180
20522d180j5382k6135R017j154J8578L823J3886R359J3639J2243k1409k7605R765
$$ -4180 -19562 -45697 -36680 -37834 -19256 -15433 -1547 7812 21451 33694 12285 -15320 -5555
20509e555J4575O436j9822J518m328Q755K053K7285L1386j8964M377L413j732
$$ -5555 9020 15456 -4366 -2848 -7176 1579 3632 30917 62303 43339 47716 51129 49397
20496D9397j1143n004r873K853M429Q785j8494j0493j1084P9l737K0627O437J003
$$ 49397 38254 33250 23377 26230 30659 39444 20950 10457 -627 -548 -4285 16342 22779 23782
20482B3782N833j1298q823j696L495L197m678J2743Q619j544k5193J478l0309
$$ 23782 29615 18317 9494 7798 11293 14490 9812 22555 31174 29630 4437 5915 -24394
20469b4394l4400L6056K2931j7498K6750J1119j3938Q256M376J225o739k5797
$$ -24394 -58794 -22738 193 -17305 9445 20564 6626 14882 19258 20483 13744 -12053
20457a2053J1192p278R781J3686j9529J2967J9743J6871M441n589j9464p686J8417
$$ -12053 -861 -8139 1642 15328 -4201 8766 28509 45380 49821 44232 24768 17082 35499
20444C5499K142k2199j0400j695j8296j9179K0028p972O782j1352K5904L2227
$$ 35499 37641 15442 5042 3347 -14949 -34128 -14100 -22072 -15290 -26642 -738 31489
20432C1489j294Q723J4869K2462l0915j4507Q896j7517k5467R867J0918n522Q867
$$ 31489 30195 38918 53787 76249 45334 30827 39723 22206 -3261 6606 17524 12002 20869
20419B0869J222o834L5233O320k0883K0473j0346m1442m0848J952M4348K8081
$$ 20869 22091 15257 50490 56810 35927 56400 46054 4612 -36236 -34284 10064 38145
20407C8145n594j2994J5175n708q947o040j4182k8443J609J6279K4033K6307Q09
$$ 38145 32551 19557 34732 29024 20077 14037 -145 -28588 -26979 -10700 13333 39640 40449
20394D0449J6707j1745l1861L929j6933k0534l0452J1093K5598m88J0407L645
$$ 40449 57156 45411 13550 17479 546 -19988 -50440 -39347 -13749 -14237 -3830 -185
20382a85J1118O644J6826l34n697K0541K524j6827n239j2630m4031M570q24O995
$$ -185 10933 17577 34403 34069 28372 48913 51437 34610 29371 16741 -27290 -22720 -23544 -16549
20368a6549j9290J3187L609K1807L0975J8773m2643k368m323m802n75O145k189
$$ -16549 -35839 -22652 -19043 2764 33739 52512 9869 7501 3178 -1624 -2199 3946 1757
20355A757q348j1526J5723L9987J050k8739k0061n572J6537J5932M379j165j4194
$$ 1757 -6591 -18117 -2394 37593 38643 9904 -10157 -15729 808 16740 21119 19954 5760
20342E760Q484P965j208j3924m199O019J5271k54J1039K9149k9885m5672l738
$$ 5760 14244 22209 21001 7077 2878 8897 24168 23914 34953 64102 34217 -11455 -15193
20329a5193J4270J8459K5165r999N693K0396j6548o569O952m635j6553j2894R601
$$ -15193 -923 17536 42701 32702 38395 58791 42243 35674 42626 37991 21438 8544 18145
20316A8145q780k3323j3524P350M2878N201j4119J0907Q08J4721j1812k5804k8135
$$ 18145 9365 -13958 -27482 -20132 22746 27947 13828 24735 25543 40264 28452 2648 -25487
20303b5487r584L6751J8977N32j5628n363n020j5295K140p18J2267Q34n904J5399
$$ -25487 -35071 1680 20657 21189 5561 198 -4822 -20117 -17977 -18695 -6428 -5594 -11498 3901
20289C901K0525j1100j0952N618o649J804k85k4493O08K7787K380j6596q195O83
$$ 3901 24426 13326 2374 7992 1343 3147 2862 -21631 -21023 6764 9144 -7452 -15647 -14964
20275a4964j582k599J5813K9937j807J5260N819l3195p490k5642J5157J0233J3229
$$ -14964 -16546 -19145 -3332 26605 24798 40058 45877 12682 5192 -20450 -5293 4940 18169
20262A8169O171L6490K178j4448j9616K238K2882l5649j1272J4719O306j2913
$$ 18169 24340 60830 63008 48560 28944 31182 54064 18415 7143 21862 28168 15255
20250A5255m0081j1281J5310L885l823J4200J6902m82J7079N737l131q307j7041
$$ 15255 -24826 -36107 -20797 -16912 -20735 -6535 10367 9885 26964 32701 29570 21263 4222
20237D222j5607j334Q149j812k896K4659J5554J5083l1275J225j766m884O15J167
$$ 4222 -11385 -12719 -4570 -6382 -9278 15381 30935 46018 14743 15968 14202 9318 9933 11100
20223A1100K3368l1997l9870J6891K9134P528p985r050j3111J4472L1167P355
$$ 11100 34468 2471 -37399 -20508 8626 16154 8169 -881 -13992 480 31647 39002
20211C9002P043K355o53n874k1580o598q328R224n152j6942J5840j581k471K7113
$$ 39002 46045 48400 47747 41873 20293 13695 5367 14591 9439 -7503 8337 6756 4285 31398
20197C1398J0141k759K852R180j0159k0136J1226J8556K046k895J7420j0118j3402
$$ 31398 41539 38780 41632 50812 40653 20517 31743 50299 52345 49450 66870 56752 43350
20184D3350j4120L127J704l35n546j2670n117j0615q603L2666J7838K8245l959
$$ 43350 29230 32357 34061 33726 28180 15510 10393 -222 -8825 23841 41679 69924 65965
20171F5965j3337p063j5236j8996m526K4883m740k477J1802k2179l4948K849K0361
$$ 65965 52628 45565 30329 11333 6807 31690 26950 24473 36275 14096 -20852 -18003 2358
20158B358m971K1910J2990m869K3468J6786J4583k9606l186j5887N10K633K141
$$ 2358 -2613 19297 32287 27418 50886 67672 82255 52649 49463 33576 34086 36719 38860
20145C8860K1594q854k7077j5748R604p623Q517J2625M360l830j1976M3820K8273
$$ 38860 60454 51600 24523 8775 18379 10756 19273 31898 36258 32428 20452 64272 92545
20132I2545q486m2334j4926O462p6k4204k1908J5598K7033M524Q580m487K6424
$$ 92545 84059 41725 26799 33261 33185 8981 -12927 2671 29704 34228 42808 38321 64745
20119F4745L443j7595J5444L756l6321l886j3410k4941Q702J8448K853L2259J8395
$$ 64745 68188 50593 66037 69793 33472 29586 16176 -8765 -63 18385 21238 53497 71892
20106G1892l525j5429j3828k6996p466j4008P747J7169J6642K7063L995j5319
$$ 71892 68367 52938 39110 12114 4648 -9360 -1613 15556 32198 59261 63256 47937
20094D7937O272p3j9579k5870p782J3009J7052K903K1435N305N206p361j6466
$$ 47937 54209 54136 34557 8687 905 13914 30966 33869 55304 60609 65815 58454 41988
20081D1988L998J6922p778m4744j8982J1811L0620J0188p167J0676j4491j2523
$$ 41988 45986 62908 55130 10386 -8596 3215 33835 44023 36856 47532 33041 20518
20069B0518k4613K6116J2480K284q50J4602J7845n255k0987j1674k0234k0561
$$ 20518 -4095 22021 34501 36785 35935 50537 68382 63127 42140 30466 10232 -10329
20057a0329k6665J2006M2222J4029L1140p610l2483j4797R900j1485J3493J1622
$$ -10329 -36994 -24988 17234 31263 62403 54793 22310 7513 17413 5928 19421 31043
20045C1043J5780j3333k9357Q02o50K9082O772O520k1179k85j520m039K175o265
$$ 31043 46823 33490 4133 4935 4285 33367 40139 46659 25480 25195 23675 19636 21811 15546
20031A5546J706j0065J6641P280P723n662l1514J029L907J8018J8832O135J3744
$$ 15546 17252 7187 23828 31108 38831 33169 1655 2684 6591 24609 43441 49576 63320
20018F3320k190k4753j8828J2109l977j2280N473L990O297K6553k2797N67K3708
$$ 63320 61130 36377 17549 29658 25681 13401 18874 22864 29161 55714 32917 33484 57192
20005E7192K034j7216J0628j4477k0429R102k0446L214K5004K6149j3151j222
$$ 57192 59226 42010 52638 38161 17732 26834 6388 9602 34606 60755 47604 46382
19993D6382R361J4382p799j3749J9463k240j8592j0143J1012j1856j4572k8050
$$ 46382 55743 70125 62326 48577 68040 65800 47208 37065 48077 36221 21649 -6401
19981f401K0216J7939j1275o770K4750K4488o887r778O559j1945l17P283L389
$$ -6401 13815 31754 20479 13709 38459 62947 56060 46282 52841 40896 40579 47862 51251
19968E1251L539k106l693J8482J1J8883R939k9962j1603K4560J9203j3048j6280
$$ 51251 54790 52684 48991 67473 67484 86367 96306 66344 54741 79301 98504 85456 69176
19955F9176L8581J8526L445j9579j6145n648J9164O84j2971L610J0587J2352q519
$$ 69176 107757 126283 129728 110149 94004 88356 107520 108204 95233 98843 109430 121782 113263
19942A13263J2985O060J1467j3704L9245M0409L3155N5618M4374K7356L1584L9078
$$ 113263 126248 132308 143775 130071 169316 209725 242880 298498 342872 370228 401812 440890
19930D40890P5027R9187M6563l5430m1346l5675l4709m8058K7624N5573L1896
$$ 440890 515917 615104 661667 626237 584891 549216 514507 466449 494073 549646 581542
19919E81542N3395L6073j0544K763K5391L2047J1751k9070l8829p2136o0896j7513
$$ 581542 634937 671010 660466 663229 688620 720667 732418 703348 664519 592383 531487 513974
19907E13974o686N408j0362l0352m7427m8570q2771l1040k8656n7233R585J5743
$$ 513974 507288 512696 502334 471982 424555 375985 293214 262174 233518 176285 185870 201613
19895B01613k3381j9291j0179O48K6232O235N143L0640K7960j6693Q752J4334
$$ 201613 178232 158941 148762 149410 175642 181877 187020 217660 245620 228927 237679 252013
19883B52013K4727K6339L6966K8310K0170j0484j890k6722m0451K6146P4610R2668
$$ 252013 276740 303079 340045 368355 388525 378041 376151 349429 308978 335124 409734 502402
19871E02402R2885N3467P982k4252k5004L4996R0175O1170L829n2024q3559n4997
$$ 502402 595287 648754 656736 632484 607480 642476 732651 793821 797650 745626 662067 607070
19859F07070l9946j9695K7518Q1882M3705j541l6826o7162q0401m9916n4215k5086
$$ 607070 567124 547429 574947 656829 700534 698993 662167 595005 514604 464688 410473 385387
19847C85387j050k7118k8224k8978p2459m2435k075j2886l2388j1023k0124k1278
$$ 385387 384337 357219 328995 300017 227558 185123 183048 170162 137774 126751 106627 85349
19835H5349K036l637L2015j2415k1732K7771N329M665j1571l2983r883K5701P615
$$ 85349 87385 83748 115763 103348 81616 109387 114716 119381 107810 74827 64944 90645 98260
19822I8260J698k629r899j1902j7937R60J0394O151J0728k3314P905J9642m574
$$ 98260 99958 97329 87430 75528 57591 58551 68945 75096 85824 62510 70415 90057 85483
19809H5483j5201K0070J7770K7900j3677k7358k8321Q775j1628l2405K2397J9520
$$ 85483 70282 90352 108122 136022 122345 94987 66666 75441 63813 31408 53805 73325
19797G3325j5566K3122K5110k0026r780j1662K6635Q345j8350M528l142O912J0140
$$ 73325 57759 80881 105991 85965 76185 64523 91158 99503 81153 85681 82539 89451 99591
19784I9591j7699p260k8830J584K378K4631j1470N938M811M101R615j1191j394
$$ 99591 81892 74632 45802 47386 49764 74395 62925 68863 73674 77775 87390 76199 74805
19771G4805R835L1991N860k5678L4344K1385Q085K668j3096j4341M462k9427m619
$$ 74805 84640 116631 122491 96813 131157 152542 160627 163295 150199 135858 140320 110893 106274
19758A06274J974q033j9186k5163j855Q306O959k0961L2612J7189Q295j9673r225
$$ 106274 108248 100215 81029 55866 54011 62317 69276 48315 80927 98116 106411 86738 77513
19745G7513j2830k726K7039J0026K6173J1747k7545j0078K9883K6308J0505j2303
$$ 77513 64683 61957 88996 99022 125195 136942 109397 99319 129202 155510 166015 153712
19733A53712j4679n947j3867k306J1221m846N83l4516k3643M713q276j221Q075
$$ 153712 139033 133086 119219 116913 128134 123288 123871 89355 65712 70425 62149 60928 69003
19720F9003j1202o891K0k1178j9205p06J4373J1705K2048N6157L9478J3102j4037
$$ 69003 57801 50910 50930 29752 10547 9841 24214 35919 57967 114124 153602 166704 152667
19707A52667k0710M866q283j1384n640j4714L9785N465r685J2116J1264l339J8628
$$ 152667 131957 136823 128540 117156 111516 96802 136587 142052 132367 144483 155747 152408 171036
19694A71036o423K2685k615j0112R074q153J315J0080l0239j3607R830o37k9583
$$ 171036 164613 187298 184683 174571 183645 175492 176807 186887 156648 143041 152871 152234 122651
19681A22651Q0j0099k241P653Q017n591O543j4473o887N515J0560L1271k824J0142
$$ 122651 122731 112632 110391 118044 126061 120470 127013 112540 105653 111168 121728 152999 150175 160317
19667A60317J3786L7101K6020l4145k5973O184J7296L9681M3831M3554M4150K7026
$$ 160317 174103 211204 237224 203079 177106 183290 200586 240267 284098 327652 371802 398828
19655C98828J1368j3769k3294m6102j9892j0236n521j256j4405j6702j675N88
$$ 398828 410196 396427 373133 327031 307139 296903 291382 290126 275721 259019 257344 257932
19643B57932J9347j0279m2255k3550N97l3504o100k6815K8896J3399J0007m042
$$ 257932 277279 267000 224745 201195 201792 168288 162188 135373 164269 177668 187675 183633
19631A83633M274J0613J4795M0608J1914n535J5189q482M738j3776l779l199J47
$$ 183633 187907 198520 213315 253923 265837 260302 275491 267009 271747 257971 254192 250993 251140
19618B51140L349K0081J7494Q711N932M2101l7925j5870J4734q546j6597N7084
$$ 251140 254489 274570 292064 300775 306707 348808 310883 295013 309747 301201 284604 341688
19606C41688K3615K1347J8558K9974O8142J7796j195j5432k1473m8303o0992k5169
$$ 341688 365303 386650 405208 435182 503324 521120 519925 504493 483020 434717 373725 348556
19594C48556j040j287Q056j3133O790p52l7143r481k122p102k8594N257J4933
$$ 348556 347516 346229 354285 341152 347942 347190 310047 300566 298444 291342 262748 268005 282938
19581B82938j9605j0202k3703J6155p81L1749O848j1896J5586L6203J5236j2279
$$ 282938 263333 253131 229428 245583 244802 276551 283399 271503 287089 323292 338528 326249
19569C26249n743J5408L5021j0883m6766J0388M9398O226k984K3110J4572r832
$$ 326249 320506 335914 370935 360052 313286 323674 373072 379298 376314 399424 413996 404164
19557D04164L750j4516j3840K636n190N024L4672Q569J2772K4867J5051M049K601
$$ 404164 407914 393398 379558 382194 377004 382028 416700 425269 438041 462908 477959 482008 484609
19544D84609k9976m4580l7146m1317l1376k3160j804M7901k514j6999K3793K3506
$$ 484609 454633 410053 372907 331590 300214 277054 275250 323151 320637 303638 327431 350937
19532C50937J1349N709M4266O3190N4521J5790r334j8585k907K0606L008j3226
$$ 350937 362286 367995 412261 475451 529972 545762 536428 517843 514936 535542 538550 525324
19520E25324J2098K0797J8183J096k2561L852L1675L0757j5404l1106K4558J4461
$$ 525324 537422 558219 576402 577498 554937 558789 590464 621221 605817 574711 599269 613730
19508F13730P298j1907R514J1636j4269n855j601K1427M7407K1219J4617K6810
$$ 613730 621028 609121 618635 630271 616002 610147 608546 629973 677380 698599 713216 740026
19496G40026o240k7301N338P806j5231Q289J6514K1912K895k1228J7943M6778
$$ 740026 733786 706485 711823 719629 704398 712687 729201 751113 754008 732780 750723 797501
19484G97501K1059P980J980J9792P215L3866M1741K7124k2630K63N0664N5760
$$ 797501 818560 826540 828520 848312 855527 889393 931134 958258 935628 935891 986555 1042315
19472A042315O9505K8017K5275M0474K5412J9422J9138K4803N0857K7899M3659
$$ 1042315 1111820 1139837 1165112 1205586 1230998 1250420 1269558 1294361 1345218 1373117 1416776
19461A416776L7737N5820K9480M0628O2016N4152O9039M9610R5342J24029J19554
$$ 1416776 1454513 1510333 1539813 1580441 1642457 1696609 1765648 1815258 1910600 2034629 2154183
19450B154183R6015M6855P4412J09046J08831J60611J79505J73116J72936K44314
$$ 2154183 2250198 2297053 2371465 2480511 2589342 2749953 2929458 3102574 3275510 3519824
19440C519824K42401K59717L11751M21654N26434P02904P39083O29909N11180
$$ 3519824 3762225 4021942 4333693 4755347 5281781 5984685 6723768 7353677 7864857
19431G864857N22088P18142J035980J433994J962543K650826L538081M336813
$$ 7864857 8386945 9105087 10141067 11575061 13537604 16188430 19726511 24063324
19423B4063324M103064J996504q21221k435469k555467j822638q82427K191Q81003
$$ 24063324 28166388 30162892 29341671 26906202 24350735 22528097 21645670 21647861 22528864
19414B2528864J752087K787127M112097N956360Q796064J3312189K0503449L1075940
$$ 22528864 24280951 27068078 31180175 37136535 45932599 59244788 79748237 110824177
19406A10824177M4238097N3086600M2550332J1014822j8590658l5851191m1470608
$$ 110824177 155062274 208148874 250699206 261714028 243123370 207272179 165801571
19399A65801571l7001425k8026785j8928380j1488596n657810p20687L599600
$$ 165801571 128800146 100773361 81844981 70356385 64698575 63977888 67577488
19392F7577488O555904O262150J183218o268034j1091572j1827393j0169723p700893
$$ 67577488 74133392 80395542 81578760 75310726 64219154 52391761 42222038 34521145
19384C4521145n510831l937638k833537k026669j394742q32605l72083r378K24307
$$ 34521145 29010314 25072676 22239139 20212470 18817728 17985123 17613040 17603662 17827969
19375A7827969K41636Q8047m059O4220K53840M60452O84254R76194J514833K412484
$$ 17827969 18069605 18157652 18153593 18217813 18471653 18932105 19616359 20592553 22107386 24519870
19365B4519870L786397N674151Q136171J0924452J2706855J1100213M824252k512502
$$ 24519870 28306267 33980418 42116589 53041041 65747896 76848109 81672361 79159859
19357G9159859o328008o037528l199371Q05460N730443J1991639K0321040L1022157
$$ 79159859 72831851 66794323 63594952 64400412 70130855 82122494 102443534 133465691
19349A33465691M1809331M6896550M1305085K0283789j6759161m6711669n2977385
$$ 133465691 175275022 222171572 263476657 283760446 267001285 220289616 167312231
19342A67312231m4600417l2296407k1919605j4784717j0078614o977447m856620
$$ 167312231 122711814 90415407 68495802 53711085 43632471 36655024 31798404
19335C1798404l329320k135356j134040j16966R54516K032505K834739K521910
$$ 31798404 28469084 26333728 25199688 25082722 26037238 28069743 30904482 33426392
19327C3426392J08278l160956m924121m864736l981514k923896k032358j390876
$$ 33426392 33534670 30373714 25449593 20584857 16603343 13679447 11647089 10256213
19319A0256213r19932o21405n05234n31316o75530p56346o81715n62296m65561
$$ 10256213 9336281 8714876 8209642 7678326 7002796 6246450 5564735 5002439 4536878
19310D536878l68796k72442k58319j87064j83887j88747j57614j65388j80262
$$ 4536878 4168082 3895640 3637321 3450257 3266370 3077623 2920009 2754621 2574359
19301B574359j42176q7460q3122r2178r3490p5561j15852m0799j3802k9516l8117
$$ 2574359 2432183 2344723 2261601 2169423 2075933 2000372 1884520 1843721 1829919 1800403 1762286
19290A762286l5283j9489k6064l1968l8087n8064n6505m23K7188L167K3416N4113
$$ 1762286 1727003 1707514 1681450 1649482 1611395 1553331 1496826 1496403 1523591 1526758 1550174 1604287
19278A604287K1877P011j0353j412J6203P744J9540r992K498j1322k0392k8806
$$ 1604287 1626164 1633175 1622822 1621410 1637613 1645357 1664897 1654905 1657403 1646081 1625689 1596883
19266A596883m6715n1891m9615n0213q0033j06992m7062l2720n5165n1699o6720
$$ 1596883 1550168 1498277 1448662 1398449 1318416 1211424 1164362 1131642 1076477 1024778 958058
19255I58058p6477l9880j8252j8478l0211k9793m5240l9029l7149l5023k9476
$$ 958058 881581 841701 823449 804971 774760 744967 699727 660698 623549 588526 559050
19244E59050k2502l8893k0119j7828K9224k1051j357k0325k8706k5874j2740M869
$$ 559050 536548 497655 477536 459708 488932 467881 466524 446199 417493 391619 378879 383748
19232C83748R187J7999O728r137k3574N531L8551L4962K926J5052J1052J4048
$$ 383748 392935 410934 417662 408525 384951 390482 429033 463995 466921 481973 493025 507073
19220E07073J5816K3662k5370m0407j6896k6979n231j3184l1450k2373o165q672
$$ 507073 522889 546551 521181 480774 463878 436899 431668 418484 387034 364661 358496 349824
19208C49824j5419j1384j0313j4438m7284l6117K3736J0590o203j2915k3206k6082
$$ 349824 334405 323021 312708 298270 250986 214869 238605 249195 242992 230077 206871 180789
19196A80789R176L6868M159K1835k3846l2459k66J6428O601n668k2852k0366p999
$$ 180789 189965 226833 230992 252827 228981 196522 196256 212684 219285 213617 190765 170399 162400
19183A62400J2156J3692J354K2502J4079j1055j3993J7448L0575k0676k7204K7601
$$ 162400 174556 188248 189602 212104 226183 215128 201135 218583 249158 228482 201278 228879
19171B28879K6075r450m4748k682n432m10k2485M60J4722k0629J0426j3304J2413
$$ 228879 254954 245504 200756 198074 192642 192232 169747 170207 184929 164300 174726 161422 173835
19158A73835J6257Q029J9310o294o747j6238L716k7253l3263m1405m4570n495
$$ 173835 190092 198121 217431 211137 204390 188152 191868 164615 131352 89947 45377 39882
19146C9882j396J0573M393R674J289R690K1140L7466K7340n947k5056K4438k850
$$ 39882 38486 49059 53452 63126 64415 74105 95245 132711 160051 154104 129048 153486 150636
19133A50636q918k6024k4795o112J1329k730k2957q847j1421K6113J2266p41k320
$$ 150636 141718 115694 90899 84787 96116 93386 70429 61582 50161 76274 88540 87799 85479
19120H5479J9164Q11k6904P584K2056L61K0265J6345m2231k9581K487J1091J0171
$$ 85479 104643 105454 78550 86134 108190 108551 128816 145161 102930 73349 75836 86927 97098
19107I7098J480J5599J4027j0517j9451Q703j3677r347j6418J36K002n375K4786
$$ 97098 98578 114177 128204 117687 98236 106939 93262 83915 67497 67633 69635 64260 89046
19094H9046O007L518K3882J0812k5238M9J2692L158l58j9774k5811j0590k6637
$$ 89046 95053 98571 122453 133265 108027 108076 120768 123926 123568 103794 77983 67393 40756
19081D0756n365K968L3736K7016J8396q859j1898J0666J9339p53m325m1346j4419
$$ 40756 35391 38359 72095 99111 117507 108648 96750 107416 126755 126002 121677 80331 65912
19068F5912j054l9402K516M7520J1296k0112k6917L929K2768J6107l2761l866
$$ 65912 64858 25456 27972 75492 86788 66676 39759 43688 66456 82563 49802 45936
19056D5936J0259l7198L250L3285J3291N927L0803K7591j6823k9949l3280p532
$$ 45936 56195 18997 22247 55532 68823 74750 105553 133144 116321 86372 53092 45560
19044D5560K697k4656m160N390J3506l464J2331K1460J6774K3944R590l5202l0202
$$ 45560 48257 23601 19441 24831 38337 34873 47204 68664 85438 109382 118972 83770 53568
19031E3568L77J1851n964j5016J9330J1237j9954k5774Q638J7380Q961p54k8628
$$ 53568 53945 65796 59832 44816 64146 75383 55429 29655 38293 55673 64634 63880 35252
19018C5252q376J8212O046N861j5456j6119J5927J3636J2447j533k0870j212J5978
$$ 35252 26876 45088 51134 56995 41539 25420 41347 54983 67430 65897 45027 43815 59793
19005E9793j4002M592l417j0592J4676j5586j0691p846K094O575K5657o922j5803
$$ 59793 45791 50383 46966 36374 51050 35464 24773 16927 19021 25596 51253 44331 28528
18992B8528Q8m1743n646J2028M4658L0964j6676j2126M86j8567n236K643K017
$$ 28528 28616 -13127 -18773 -6745 37913 68877 52201 40075 40561 21994 16758 19401 21418
18979B1418k838K932J5448k4287o640k684J3820j8626J9232l988L268Q423L386
$$ 21418 18580 21512 36960 12673 6033 3349 17169 -1457 17775 13787 17055 25478 28864
18966B8864k677J6977O100j7335M608J2301l934j8223j5919J2851J0527K23k2324
$$ 28864 26187 43164 49264 31929 36537 48838 44904 26681 10762 23613 34140 34363 12039
18953A2039J4653P077j2226L0431J7437j1170l201j5358j5565k3140j2754K0962
$$ 12039 26692 33769 21543 51974 69411 58241 55040 39682 24117 977 -11777 9185
18941I185L4238l1934k6167j336K0539K2250J0599M355o179k1404k8432K77L077
$$ 9185 43423 11489 -14678 -16014 4525 26775 37374 41729 35550 14146 -14286 -14009 -10932
18928a0932J138K1745j0539K5721j1448l325M708Q618k2079j1155J609L1542L5704
$$ -10932 -9794 11951 1412 27133 15685 12360 17068 25686 3607 -7548 -5939 25603 61307
18915F1307J3720n730J4305K658J7440j655O487r643j0705j7205l223J9739K761
$$ 61307 75027 69297 83602 86260 103700 102045 108532 98889 88184 70979 67756 87495 90256
18902I0256L2290N0541M8404K7240K402j5001j2936k2967M815M7538R4454Q6819
$$ 90256 122546 173087 221491 248731 251133 236132 223196 200229 205044 252582 347036 433855
18890D33855Q4843O3762j3764m8796l6028j6944L0021O1130P7082L5080k4392
$$ 433855 518698 582460 568696 519900 483872 466928 496949 558079 635161 670241 645849
18879F45849l1844j4910j2168J2810K8582L210l3023q4962q5760q1285m1966l4771
$$ 645849 614005 599095 586927 599737 628319 631529 598506 513544 427784 346499 304533 269762
18867B69762n795k3098J6070O2080L7094J5908j7405k9867m7726k1010n7193n9211
$$ 269762 263967 240869 256939 319019 356113 372021 354616 324749 277023 256013 198820 139609
18855A39609k2734Q690k1714m2206j5691j9103J9271K4351L5578O334M284L792
$$ 139609 116875 125565 103851 61645 45954 26851 46122 70473 106051 112385 116669 120461
18843A20461K6807N6714P2599Q4088J01376M7031L078L2576J5152J5267M1694
$$ 120461 147268 203982 276581 360669 462045 509076 512154 544730 559882 575149 616843
18832F16843Q2062N0444K5235m7699n1792n4826p0023q2284m3060k9083k5150
$$ 616843 698905 749349 774584 726885 675093 620267 550244 467960 424900 395817 370667
18821C70667J8562L2555L7908M6966M0680P6076J8610m5621n8796j1682j0980
$$ 370667 389229 421784 459692 506658 547338 623414 642024 596403 537607 525925 514945
18810E14945n0635o6083o9162p9869m8304k4229k6828j0515n4320j4157l0980
$$ 514945 464310 398227 329065 249196 200892 176663 149835 139320 85000 70843 39863
18799C9863k7072N507j0627N062J871J951J2047J739O314k844K987q978k7742
$$ 39863 12791 18298 7671 12733 14604 16555 28602 30341 36655 33811 36798 27820 78
18786G8n951k5445J1444J9271Q865j945j586K623O122q939J1606L8363K56l0278
$$ 78 -5873 -31318 -19874 -603 8262 6317 4731 7354 13476 4537 16143 54506 54762 24484
18772B4484K1825L5705J5523M7428O3733P0202K8290o987o6258q6142m8171j6691
$$ 24484 46309 82014 97537 144965 208698 278900 307190 300203 233945 147803 99632 82941
18760H2941j5653m6654m677k3867p942N41p619j2331R249Q465K6050K6664k8133
$$ 82941 67288 20634 15957 -7910 -15852 -15311 -22930 -35261 -26012 -17547 8503 35167 7034
18747G034l64M613j1421n479m344L0182P106l0457p172J448n547R263R530p06
$$ 7034 6670 11283 -138 -5617 -9961 20221 27327 -3130 -10302 -8854 -14401 -5138 4392 3686
18733C686p20K5765j3900l345J3836k420K8391J9559k5339j542J0543j0244l5369
$$ 3686 2966 28731 14831 11486 25322 22902 51293 70852 45513 43971 54514 44270 8901
18720H901k6207N881K1954M298n176J0173P475k05J5362k83N038n056M738M870
$$ 8901 -17306 -11425 10529 14827 9651 19824 27299 27094 42456 42173 47211 42155 46893 51763
18706E1763k4146j9510p001K5759J8565l3021R84J3682k6672M754O044j041k1686
$$ 51763 27617 8107 1106 26865 45430 12409 13393 27075 403 5157 11201 10160 -11526
18693a1526o468K3614K8357j8729J2683R713l904l9885J5476J4725J6M617j5809
$$ -11526 -17994 5620 33977 15248 27931 37644 33740 -6145 9331 24056 24072 28689 12880
18680A2880j0629l524L705K218k5689K3472K6411Q667J2309K0996l6918l6147
$$ 12880 2251 -1273 2432 4650 -21039 2433 28844 37511 49820 70816 33898 -2249
18668b249k0684R653M0989Q932j6713O49L3457M7253n726m5335l738j5544K7960
$$ -2249 -22933 -13280 27709 36641 19928 20577 54034 101287 95561 50226 46488 30944 58904
18655E8904K5380L3702J9085j248J1147k7407j5421j4380M3013P3387L4854R474
$$ 58904 84284 117986 137071 135823 146970 119563 104142 89762 132775 206162 241016 250490
18643B50490j2133j9662R502j5622q727L7946L3092K6159M4891P7439J48855J49023
$$ 250490 238357 218695 228197 212575 203848 241794 274886 301045 345936 423375 572230 721253
18631G21253K16156L64152M52474L56076O7619j57718k68837k57082k58175k33197
$$ 721253 937409 1301561 1754035 2110111 2177730 2020012 1751175 1494093 1235918 1002721
18621A002721j76793j04261q7424l6666K5924L8953L8195N339m6268r0110j08528
$$ 1002721 825928 721667 634243 597577 623501 662454 700649 705988 659720 569610 461082
18610D61082j01113n4827m2980m7582k2504j4497J0310J9745n090r33M243k6379
$$ 461082 359969 305142 262162 214580 192076 177579 187889 207634 202544 201611 205854 179475
18598A79475m6050m903L1282J7986K0735n53j5312L8100L8200N3474P7998Q7860
$$ 179475 133425 128522 159804 177790 198525 197972 182660 220760 258960 312434 390432 478292
18586D78292J12120J07311O8400N060n3365o3484j595K2376M1998J52221K14172
$$ 478292 590412 697723 766123 771183 717818 654334 652739 675115 717113 869334 1083506
18575A083506K37095K74675L13187L52161J99401j24038l61756m18698l89748
$$ 1083506 1320601 1595276 1908463 2260624 2460025 2335987 1974231 1555533 1165785
18566A165785k90089k00807j53405r0158p7537n9046m0318J1466O426K7676J1979
$$ 1165785 875696 674889 521484 431326 353789 294743 254425 265891 272317 299993 311972
18555C11972R099L829R864k2194n5659l2756k9282j8454k4283k1213k5189r296
$$ 311972 321071 324900 334764 312570 256911 224155 194873 176419 152136 130923 105734 96438
18543I6438k6000P67R992j1822j5700m0554j4164M0510p782j1771J9345O910j7630
$$ 96438 70438 71205 81197 69375 53675 13121 -1043 39467 31685 19914 39259 46169 28539
18530B8539J643k346J4028J3116q097k5328l7627R407K3958K336j9561k153l0345
$$ 28539 30182 27836 41864 54980 46883 21555 -16072 -6665 17293 19629 68 -2085 -32430
18517c2430J0948L0055p291j2918l1260K8030P472l011j259j3737K7071L0841
$$ -32430 -21482 8573 1282 -11636 -42896 -14866 -7394 -10405 -11664 -25401 1670 32511
18505C2511N499j8077q775J2448J8942L353j0386j4142j6570l77R783k9283K756
$$ 32511 38010 19933 11158 23606 42548 45901 35515 21373 4803 4426 14209 -15074 -12318
18492a2318J1372O210J1645k5101j8468L5410J2731j7936L421n119J573J5368
$$ -12318 -946 5264 16909 -8192 -26660 8750 21481 3545 6966 1847 3420 18788
18480A8788K6510J295k6525K424R177j0200j0399J298j0528K7018J0472l7175
$$ 18788 45298 46593 20068 22492 31669 21469 11070 12368 1840 28858 39330 2155
18468B155k5502l6J7191K0930J5792j443K784J639k0365N640K1527j2777n20l476
$$ 2155 -23347 -23383 -6192 14738 30530 29087 31871 33510 13145 18785 40312 27535 27015 23539
18454B3539K817k057J8675J688j4640J695O112K212k3288l7663k448K6161M6036
$$ 23539 26356 24299 42974 44662 30022 31717 37829 40041 16753 -20910 -23358 2803 48839
18441D8839K8700k4380j8579l40j554L581o173Q360M226k1426K911K1760j743
$$ 48839 77539 53159 34580 34240 32686 36267 30094 38454 42680 21254 24165 45925 44182
18428D4182j9758l2527k538K5725Q459j5522J478k7112N895J3328J1261m936K3701
$$ 44182 24424 -8103 -10641 15084 23543 8021 9499 -17613 -11718 1610 12871 7935 31636
18415C1636J724k5729J4128K3821j2267r686N13o003j9796j9217j2450K8194P470
$$ 31636 33360 7631 21759 45580 33313 23627 24140 18137 -1659 -20876 -33326 -5132 2338
18402B338j2439K2866m049J4167R188K1300j6384l0016n12K9874j6575N815l977
$$ 2338 -10101 12765 8716 22883 32071 53371 36987 6971 6459 36333 19758 25573 21596
18389B1596j6735j4945L0477k252j466L005j229J5414P488o833j779j5472j1323
$$ 21596 4861 -10084 20393 18141 16675 19680 18451 33865 41353 34520 32741 17269 5946
18376E946L3359P796k3715m634J2768J9353L3386K9238m5939p042K5610k6871
$$ 5946 39305 47101 23386 18752 31520 50873 84259 113497 67558 60516 86126 59255
18364E9255j2496P567L3256m55j4783k8502P653P668K2605l7658m0463o753r494
$$ 59255 46759 54326 87582 87127 72344 43842 51495 59163 81768 44110 3647 -3106 -12600
18351a2600K7369K0791J7395J3548K987j1503R769n585m5189j7359K6537Q009
$$ -12600 14769 35560 52955 66503 69490 57987 67756 62171 16982 -377 26160 34169
18339C4169L4885j99k6541j8770j5298j1278L310J8532J1427j4274R883J6247
$$ 34169 69054 68855 42314 23544 8246 -3032 278 18810 30237 15963 25846 42093
18327D2093K2114J0176o344P848L1739K0571l2646l3981j8824j8759k6583j5307
$$ 42093 64207 74383 68039 75887 107626 128197 95551 61570 42746 23987 -2596 -17903
18315a7903N546K719K7953j908K7455K3778P545j6159K758l665K227j4154p67
$$ -17903 -12357 -9638 18315 16407 43862 67640 75185 59026 61784 58119 60346 46192 45425
18302D5425N545p175q812j4600j974M778J4509J2157j4354r1p524k6291Q101N122
$$ 45425 50970 43795 34983 20383 18409 23187 37696 49853 35499 35408 27884 1593 9694 14816
18288A4816J4021J1559j3211l4669J2154L2989R638l1709K0437M1570j4659k9010
$$ 14816 28837 40396 27185 -7484 4670 37659 47297 15588 36025 77595 62936 33926
18276C3926j7505k2217J0617J4157K4416J4759L5997K6769J2307k4249P109J6665
$$ 33926 16421 -5796 4821 18978 43394 58153 94150 120919 133226 108977 116086 132751
18264A32751j6664k4799l0884j9539L537J4158p501m4516k0586K1673l113R754
$$ 132751 116087 91288 60404 40865 44402 58560 51059 6543 -14043 7630 4517 14271
18252A4271L2118K3580K4102J1964Q77m3516r978N183J0376k4313k0872L5611
$$ 14271 46389 69969 94071 106035 106912 63396 53418 58601 68977 44664 23792 59403
18240E9403J0510j8950O65Q540j1320j418J4866J5449K1972j992m566q100j5684
$$ 59403 69913 50963 51628 60168 48848 47430 62296 77745 99717 97725 93159 85059 69375
18227F9375l468L050j1200k1007J2321K8473N332K272J3447K5362L277j0852j117
$$ 69375 65907 68957 57757 36750 49071 77544 82876 85148 98595 123957 127234 116382 115265
18214A15265k2861k3591j1648n905J3249J8584L4649J4069j5816r677M5278M8101
$$ 115265 92404 68813 57165 51260 64509 83093 117742 131811 115995 106318 151596 199697
18202A99697P446j4921o0119n4230N816J3185R595K5885J1203R45L1823L8475
$$ 199697 207143 192222 132103 77873 83689 96874 106469 132354 143557 144502 176325 214800
18190B14800M0032O2624O9448R1748N0320L7768O6492M4510K8801j3665k1293
$$ 214800 254832 317456 386904 478652 528972 566740 633232 677742 706543 692878 671585
18179F71585m9249q0934l8053o93J2294J0924N5409L2630K377K4362N1616L6825
$$ 671585 622336 541402 503349 502656 514950 525874 581283 613913 616290 640652 692268 729093
18167G29093k009L3563M0857r685m7774j8136o863j6156j4883j1488l1574l0822
$$ 729093 727084 760647 801504 791819 744045 725909 719046 702890 688007 676519 644945 614123
18155F14123n6873m6264k8529n9286l0190m822j5083k0792j1487P147L9107N4462
$$ 614123 557250 510986 482457 423171 392981 388159 373076 352284 340797 347944 387051 441513
18143D41513L8382L6008J0015J4869J7489L9740P3431R2654Q7801P3005L0667
$$ 441513 479895 515903 525918 540787 558276 598016 671447 764101 851902 924907 955574
18132I55574n411m1772K765J9334K7159J08694K10352J95458J81230J39108J10579
$$ 955574 950163 908391 911156 930490 957649 1066343 1276695 1472153 1653383 1792491 1903070
18121A903070J66084K47492L19841M07911N18464P15204R90200J446306K313926
$$ 1903070 2069154 2316646 2636487 3044398 3562862 4278066 5268266 6714572 9028498
18112I028498L890877O651891J0934895J4917071J0815842l898126j2695206j2438116
$$ 9028498 12919375 19571266 30506161 45423232 56239074 52340948 39645742 27207626
18104B7207626r131047n688805l427236k179884j445444j002249o84046n41798
$$ 27207626 18076579 12387774 8960538 6780654 5335210 4332961 3648915 3107117
18096C107117m46442l31739k25125k38118k17712j43185r7070o3279n9903m6143
$$ 3107117 2660675 2328936 2103811 1865693 1647981 1504796 1407726 1344447 1284544 1238401
18086A238401j01119j24895j06660n5192k7232m1902k1308K169l9513p2646l6526
$$ 1238401 1137282 1012387 905727 850535 823303 781401 760093 762262 722749 650103 613577
18075F13577o3264p7067p1922p5380l6603J7494K8774j7945j4646J6827l653m201
$$ 613577 550313 473246 401324 325944 289341 306835 335609 317664 303018 319845 316192 311991
18063C11991R239o798k4632j4691j5200J694j9353r763O186L6463P136L706q103
$$ 311991 321230 314432 289800 275109 259909 261603 242250 232487 238673 275136 282272 285978 277875
18050B77875j3574M2640O2120M8422N4997N6242J8033M307J1461j9031l3205J027
$$ 277875 264301 306941 369061 417483 472480 528722 546755 551062 562523 543492 510287 511314
18038E11314j1358l7226m9239n8426l1819j6129m7058k5281j5136k5438m2396
$$ 511314 499956 462730 413491 355065 323246 307117 260059 234778 219642 194204 151808
18027A51808j0998o288l324J0859l651N577k708J1629J8680r649J2733j3022k7795
$$ 151808 140810 134522 131198 142057 138406 143983 141275 152904 171584 161935 174668 161646 133851
18014A33851k4214O933J1309j5481k5329K703L5977k127J1685J4541P26K0011
$$ 133851 109637 116570 127879 112398 87069 89772 125749 123622 135307 149848 150574 170585
18002A70585K9145k5141m9572p925K1870L11j6433K6194K8526J1967L527K5588
$$ 170585 199730 174589 125017 117092 138962 139273 122840 149034 177560 189527 193054 218642
17990B18642M354q338M242N0735Q5126O4792L5532L8026K6005K2886M0240N5052
$$ 218642 222996 214658 218900 269635 354761 419553 455085 493111 519116 542002 582242 637294
17978F37294M7814K5108M059m608P64o612p693j4540j8520j7786k6327n1784n4828
$$ 637294 685108 710216 714275 709667 710431 703819 696126 681586 663066 645280 618953 567169 512341
17965E12341n5413l7683m1964l2503l9508K384k5363j3201j188j402J2180R680
$$ 512341 456928 419245 377281 344778 305270 307654 282291 269090 267902 266500 278680 288360
17953B88360j559l0404j6147P170k0334k3947J0783k613l332k8293O288J7699
$$ 288360 286801 256397 240250 247420 227086 203139 213922 211309 207977 179684 185972 203671
17941B03671J3665N1697L1955K2719K7131J761K9269K3132n7k542k207p950J0609
$$ 203671 217336 269033 300988 323707 350838 352599 381868 405000 404943 402401 400194 392244 402853
17928D02853L0845j878M935J6439R783j3421L212j5492j1472Q549R124l6206q795
$$ 402853 433698 431820 436755 453194 462977 449556 452768 437276 425804 434353 443477 407271 398476
17915C98476L0082K0551o738k0222n7584k3529k477k5307j8100k4783Q18K1902
$$ 398476 428558 449109 442371 422149 364565 341036 338559 313252 295152 270369 271187 293089
17903B93089k434m676J5612l123j1811j4373l7564j0030j0821J85K9269K014Q03
$$ 293089 290655 285979 301591 298468 286657 272284 234720 224690 213869 214054 243323 245337 246140
17890B46140J8234k1837o041q665l137J3859J2206L1609J3569Q481q606j5796
$$ 246140 264374 242537 236496 227831 224694 238553 250759 282368 295937 304418 295812 280016
17878B80016N177J5356J1869k9082m4610j0921j646N0956K5472l217p269L149
$$ 280016 285193 300549 312418 283336 238726 227805 226159 277115 302587 299370 292101 295250
17866B95250J7190N209K1464N8143K4600J8463K8300K1154P688j4181k3536l1805
$$ 295250 312440 317649 339113 397256 421856 440319 468619 489773 497461 483280 459744 427939
17854D27939m8875n8354n1106j7508O604j1688L7887K1010o196k0662l2149k2116
$$ 427939 379064 320710 269604 252096 258700 247012 284899 305909 299713 279051 246902 224786
17842B24786J470J1689P754J0161J9139k688j1878k9091N204M251J5703K721R
$$ 224786 226256 237945 245699 255860 274999 272311 260433 231342 236546 240797 256500 259221 259230
17829B59230J4013L7052J5312p553J9801J9926J7370k1327k1291M442k762l0311
$$ 259230 273243 310295 325607 318054 337855 357781 375151 353824 332533 336975 334213 303902
17817C03902l63K8436J2821n303j7890j5440K4437J4053l855L5736J5684J1182
$$ 303902 303539 331975 344796 339493 321603 306163 330600 344653 340798 376534 392218 403400
17805D03400P429J981k0894l481L722j0609j3700m27R988j0056j6641r135m65
$$ 403400 410829 412810 391916 388435 392157 381548 367848 367421 377409 367353 350712 341577 341112
17792C41112J9799j4616j4416l911N8378O7253O2662k473M34J1298J363j4110
$$ 341112 360911 346295 331879 327968 386346 453599 516261 513788 514222 525520 526883 512773
17780E12773j2566l5371L5139L2222Q50P792J6936K0594K2517K1792J4690J3052
$$ 512773 500207 464836 499975 532197 533047 540839 557775 578369 600886 622678 637368 650420
17768F50420k3525r838l521K400J64p083K3125J5237L9521K9188N4894L8550j790
$$ 650420 626895 617057 613536 615936 616100 609017 632142 647379 686900 716088 770982 809532 807742
17755H07742o631l0086j8041j2548j0870K4308J3244MJ6212N3919p133j5545J1106
$$ 807742 801111 771025 752984 740436 729566 753874 767118 767122 783334 837253 830120 814575 825681
17742H25681K5561N4335K2820J1321q142j0939p443j3674K2101N5338M3824M1995
$$ 825681 851242 905577 928397 939718 931576 920637 913194 899520 921621 976959 1020783 1062778
17730A062778Q9386P3722M6821M1344O8408P412O040M6411K9050N6279L4377L1383
$$ 1062778 1152164 1225886 1272707 1314051 1382459 1389871 1395911 1442322 1471372 1527651 1562028 1593411
17718A593411M8441N8515N5252N1970L3222L1352P7215J28445J09566J11608J31828
$$ 1593411 1641852 1700367 1755619 1807589 1840811 1872163 1949378 2077823 2187389 2298997 2430825
17707B430825J50496J21383R3877O5555P9190J01259R3731J31985K28362K66524
$$ 2430825 2581321 2702704 2796581 2862136 2941326 3042585 3136316 3268301 3496663 3763187
17697C763187K90618L66454L76094M21380N32621O70590R13406J082661J203888
$$ 3763187 4053805 4420259 4796353 5217733 5750354 6420944 7334350 8417011 9620899
17688I620899J349047J436677J457756J688087K246950L083570L844748L686330
$$ 9620899 10969946 12406623 13864379 15552466 17799416 20882986 24727734 28414064
17680B8414064K180759K9232j757548k418276j949857r44099J55997J206308K252304
$$ 28414064 30594823 30624055 28866507 26448231 24498374 23554275 23710272 24916580 27168884
17671B7168884L384522M854353O897552R857840J4302623K1237405L1165493M2059486
$$ 27168884 30553406 35407759 42305311 52163151 66465774 87703179 118868672 160928158
17663A60928158M7037556L8082622J6169116r967835k9698304l8058416l6941950
$$ 160928158 207965714 246048336 262217452 252249617 222551313 184492897 147550947
17656A47550947l0158126k1786672j4162651p877391k766902J374344M087014
$$ 147550947 117392821 95606149 81443498 73566107 70799205 72173549 76260563
17649G6260563M264758J170261l934525q538198j0611272j0052904q138985n974933
$$ 76260563 80525321 81695582 77761057 69222859 58611587 48558683 40419698 34444765
17641C4444765m180939l009594k289503j780554j446773j189067r15843o55450
$$ 34444765 30263826 27254232 24964729 23184175 21737402 20548335 19632492 18977042
17633A8977042l86860j51923Q7597K38571K81715L50349N01088Q35475J403463
$$ 18977042 18590182 18438259 18525856 18764427 19046142 19396491 19897579 20733054 22136517
17624B2136517K235801L389538N005678P026457R203547J0575461R588971N808581
$$ 22136517 24372318 27761856 32767534 39793991 48997538 59572999 69161970 74970551
17616G4970551P07494l263722m332187k678815O61530N049053J0482748J7351553
$$ 74970551 75678045 72414323 68082136 65403321 66064851 71113904 81596652 98948205
17608I8948205K5496655L3264210L7271046L3406777J8193401n438581k8350486
$$ 98948205 124444860 157709070 194980116 228386893 246580294 241141713 212791227
17601B12791227m1114790m0590639l2612014k3457211j6060858j0968844p682061
$$ 212791227 171676437 131085798 98473784 75016573 58955715 47986871 40304810
17594D0304810n605952m183727l073679k035042r90947Q6216J243507K105605
$$ 40304810 34698858 30515131 27441452 25406410 24415463 24501679 25745186 27850791
17586B7850791K089231Q60410j156863k977022l804520l669836l064140k421329
$$ 27850791 29940022 30800432 29643569 26666547 22862027 19192191 16128051 13706722
17578A3706722j976796j615637j328112j086776q58288o67189m98087m21469l30793
$$ 13706722 11729926 10114289 8786177 7699401 6841113 6173924 5675837 5254368 4923575
17569D923575k76069k10667j57335j50234j69209j48728j35887j32116j32977
$$ 4923575 4647506 4436839 4279504 4129270 3960061 3811333 3675446 3543330 3410353
17560C410353j78446j83867j80339j39669j52868j60324j46450r1525q8210j06338
$$ 3410353 3231907 3048040 2867701 2728032 2575164 2414840 2268390 2176865 2088655 1982317
17550A982317n7503m4149m7654p2060p1515o3317q9023n9304n1301p2539k6014
$$ 1982317 1924814 1880665 1833011 1760951 1689436 1626119 1537096 1477792 1426491 1353952 1327938
17539A327938n616o123k1407n953j8068n2501k5089l5261n9669k0147m7256n1543
$$ 1327938 1322322 1316199 1294792 1288839 1270771 1218270 1193181 1157920 1098251 1078104 1030848 979305
17527I79305p05j2431k1443J808q150l1306m3761k8624n7166l2219l6729l5010
$$ 979305 978600 966169 944726 946534 938384 907078 863317 834693 777527 745308 708579 673569
17515F73569r019k7937l4497k0428l138j9015l0666R761O785n973j8066r553m888
$$ 673569 664550 636613 602116 581688 578550 559535 528869 538630 545415 539442 521376 511823 506935
17502E06935l4554j9726l994j5267j4904R707k8215j2173J1182K403k1804q245
$$ 506935 472381 452655 448661 433394 418490 428197 399982 387809 398991 401394 379590 371345
17490C71345j4698Q9M703L976J2175J1986r98J2174L4591J1049k301L1830J4755
$$ 371345 356647 356736 361439 365415 377590 389576 388578 400752 435343 446392 444091 475921 490676
17477D90676N77n359m601m0880m6714k1357j4247j2911L2533J8628l0810o551
$$ 490676 491253 485894 481293 440413 393699 372342 358095 345184 377717 396345 365535 358984
17465C58984o981m5956q1191k5621M438j2239j8807Q762K231j237K2922L2208
$$ 358984 352003 306047 224856 199235 203673 191434 172627 181389 183620 182383 205305 237513
17453B37513J6440q425L856J321j1723k10P477R871K3281L2929N9792P4755J9688
$$ 237513 253953 245528 249384 250705 238982 238772 246249 256120 279401 312330 372122 446877 466565
17440D66565k6456p4152m1878n2312m2299k5464j3388J3544p277J8650K6961j7964
$$ 466565 440109 365957 324079 271767 229468 204004 190616 204160 196883 215533 242494 224530
17428B24530m0639J4323Q282n784k1070k0075N581R64r248k248J0843j5569m634
$$ 224530 183891 198214 206496 200712 179642 159567 165148 166112 156864 154616 165459 149890 145256
17415A45256o939L445O107N176n218k0544j0789r140k3882l7433j7777o89k2574
$$ 145256 138317 141762 147869 153045 147827 127283 116494 107354 83472 46039 28262 27573 4999
17402D999k9055K9058N4821J6955n16J5578K6957r520L695J0108M22p251l0779
$$ 4999 -24056 5002 59823 76778 76262 91840 118797 109277 112972 123080 123502 116251 85472
17389H5472J2157K1833q00r475j6304R301m566l7453l6059j2666j179J246j5123
$$ 85472 97629 119462 118662 109187 92883 102184 97618 60165 24106 11440 10261 11507 -3616
17376c616J5512J8445J7582J4208j8910J7801J3577L701o717j53J6991q402M671
$$ -3616 11896 30341 47923 62131 43221 61022 74599 78300 71583 71430 88421 80019 84690
17363H4690N147k5165n926l0379l6173N601j0513n255K6006L2002N070j1921j6491
$$ 84690 89837 64672 58746 28367 -7806 -2205 -12718 -17973 8033 40035 45105 33184 16693
17350A6693n433L3114R389n221J6675J2238j1480p857O491l8652l917P129O962
$$ 16693 11260 44374 53763 48542 65217 77455 65975 58118 64609 25957 22040 29169 36131
17337C6131P513R82J9551O528J9842J8555l931P331J7795k6460k4950J4018q744
$$ 36131 43644 44626 64177 70705 90547 109102 105171 112502 130297 103837 78887 92905 84161
17324H4161m9779r792N406J1306K0501n259o902k1567J7512R245k0890l835N749
$$ 84161 34382 24590 29996 41302 61803 56544 49642 28075 45587 54832 33942 30107 35856
17311C5856j8389j7144j391J1298L753J173n397P221N237k0642o535q79j174j3676
$$ 35856 17467 323 -1068 10230 13983 15156 9759 16980 22217 1575 -4960 -5839 -7013 -20689
17297b0689k2749J8788M4993M3607O501j7528j1606l2758j3635J9335k434L912
$$ -20689 -43438 -24650 20343 63950 70451 52923 41317 8559 -5076 14259 11825 15737
17285A5737J238J8349J8711j6213l6611K0038K4565L819j5447r421j1413k1754
$$ 15737 16975 35324 54035 37822 1211 21249 45814 49633 34186 24765 13352 -8402
17273h402j0107n01l482O302J3272P709L1312O278l3792j0298M837K1368j161
$$ -8402 -18509 -19010 -22492 -16190 -2918 4791 36103 42381 8589 -1709 3128 24496 23335
17260B3335K507p58J5665j3368o333K2690m794k5636J1452K0353J4518k926k3042
$$ 23335 25842 25084 40749 27381 21048 43738 38944 13308 24760 45113 59631 56705 33663
17247C3663j6942P203K3748l7588k2582N999J4867J1798j4808k0089O396N947
$$ 33663 16721 23924 47672 10084 -12498 -6499 8368 20166 5358 -14731 -8335 -2388
17235b388J7015q18q585m486j6121R711P032K897l77j2542l2203J3711N1786L4675
$$ -2388 14627 13809 5224 738 -15383 -5672 1360 4257 3880 -8662 -40865 -27154 24632 59307
17221E9307k6101r275n179j6158l807K4105j6089j9901m638J4124K8256L3992
$$ 59307 33206 23931 18752 2594 -1213 22892 6803 -13098 -17736 -3612 24644 58636
17209E8636r160L10k1237j9299m134k7882N367J466J14j7047J8325J0213J2272
$$ 58636 49476 49786 28549 9250 5116 -22766 -17399 -15933 -15819 -32866 -14541 -4328 7944
17196G944j6228J5928K5817j9127j9379R104J2431J2305J489j8541j7508p655
$$ 7944 -8284 7644 33461 14334 -5045 4059 16490 28795 30284 11743 -5765 -13420
17184a3420J1237P177l06J5674L2997O321j3659o512K3125j4231o567j776m1040
$$ -13420 -2183 4994 4688 20362 53359 59680 46021 39509 62634 48403 41836 40060 -980
17171i80K4226K3226J2232K7585J3386o43K6077K9323j0119j6424R603N854q383
$$ -980 23246 46472 58704 86289 99675 99032 125109 154432 144313 127889 137492 143346 134963
17158A34963N0274P7863N9349R5138O9224N9838M5083P108N06J5979J6899j128
$$ 134963 185237 263100 322449 417587 486811 546649 591732 598840 599346 615325 632224 631096
17146F31096j6375n3429k7588j5215J3391K7323L0223K5263J4668j0725j7422
$$ 631096 614721 561292 533704 518489 531880 559203 589426 614689 629357 618632 601210
17135F01210o3570q4838o2615k7547n5940p6562O15j3568k0949J210L0102K2003
$$ 601210 537640 452802 390187 362640 306700 230138 230753 217185 196236 197446 227548 249551
17123B49551j9750k3158j7522j1232k4340j1452k4433k1622K471j2933J1023j3831
$$ 249551 229801 206643 189121 177889 153549 142097 117664 96042 98513 85580 96603 82772
17111H2772J1942M5552J0182k582o143K4468M5971M3737P0494R2553O0004L0774
$$ 82772 94714 140266 150448 147866 141723 166191 212162 255899 326393 418946 478950 509724
17099E09724L1904K2494K7995M7619N8034J2028j2944n7571j00137r2648o5650
$$ 509724 541628 564122 592117 639736 697770 709798 696854 639283 539146 446498 380848
17088C80848k5974J2672j3955k5282J4264K5589N4903K3932M4942N8127N3538
$$ 380848 354874 367546 353591 328309 342573 368162 423065 446997 491939 550066 603604
17077F03604J5078j2596m9939n8257o6472o8530m5879n4042m8948m6085m8151
$$ 603604 618682 606086 556147 497890 431418 362888 317009 262967 214019 167934 119783
17066A19783k3450l9064k0803J0113k3359j8334k1821M089L864k482N986J3991
$$ 119783 96333 57269 36466 46579 23220 4886 -16935 -12846 -8982 -11464 -5478 8513
17054H513o437k0622j4299N641J5387j549M445n702O66K6562K1681l2751k1264
$$ 8513 2076 -18546 -32845 -27204 -11817 -13366 -8921 -14623 -13957 12605 34286 1535 -19729
17041a9729j3575J6618Q192K506o425j1279m370Q612L7261J1524J515k8170q488
$$ -19729 -33304 -16686 -8494 -5988 -12413 -23692 -28062 -19450 17811 29335 30850 2680 -5808
17028e808K5679K4967j5021k6889L154l095q341m6327l808N3305q046l1980O173
$$ -5808 19871 44838 29817 2928 6082 2987 -5354 -51681 -55489 -2184 -10230 -42210 -36037
17015c6037O377N276j0050r852J3072O993j4959P927K2398J3583l992j0643o739
$$ -36037 -29660 -24384 -34434 -44286 -31214 -24221 -39180 -31253 -8855 4728 736 -9907 -16646
17002a6646M611J2521k2599q289K9055j7996j785J639l009K1323J2487k8416q690
$$ -16646 -12035 486 -22113 -30402 -1347 -19343 -21128 -19489 -22498 -1175 11312 -17104 -25794
16989b5794j2904K382o125J2987K471P292l84k13N932Q07j977L3348k9485k46
$$ -25794 -38698 -36316 -42441 -29454 -26983 -19691 -20075 -20288 -14356 -13549 -15526 17822 -11663 -11909
16975a1909M470O08q323j4057k2068J1757J9612L955q368k7979p022J8275P704
$$ -11909 -7439 -6831 -15154 -29211 -51279 -39522 -19910 -15955 -24323 -52302 -59324 -41049 -33345
16962c3345j743q367K8900K6648L764j5944N724R576J9851L463o0055k8233O552
$$ -33345 -35088 -43455 -14555 12093 15857 -87 5637 15213 35064 38527 -21528 -49761 -43209
16949d3209m032k113J1935L258j5134j448P508J0818o65R268n137j3615j6980
$$ -43209 -47241 -49354 -37419 -34161 -49295 -50743 -43235 -32417 -33082 -23814 -28951 -42566 -59546
16936e9546R48J6606J2070j8491k730L2578J0860L20k0986k565J5372m078o234
$$ -59546 -58598 -41992 -29922 -48413 -51143 -18565 -7705 -7385 -28371 -30936 -15564 -19642 -25876
16923b5876n524j8545L5131N528j8420l851K525J7593o894k0522q323j2807O627
$$ -25876 -31400 -49945 -14814 -9286 -27706 -31557 -29032 -11439 -18333 -38855 -47178 -59985 -53358
16910e3358J6125l259J0369k534k3325J1961O826j942m019J0765k865O51j3061
$$ -53358 -37233 -40492 -30123 -32657 -55982 -44021 -37195 -39137 -43156 -32391 -35256 -34605 -47666
16897d7666j9414O055K064J8414J9998L1817j5782j4621m235j210j1989J0118
$$ -47666 -67080 -61025 -58961 -40547 -20549 11268 -4514 -19135 -23370 -24580 -36569 -26451
16885b6451k2236l0569N880K0464M269j0914J100L4894K9116o661j576j1703j6502
$$ -26451 -48687 -79256 -73376 -52912 -48643 -59557 -58457 -23563 5553 -1108 -2684 -14387 -30889
16872c0889r590n463K9499J1959Q851k4432r780J9840J3187J2492k2209k1116
$$ -30889 -40479 -45942 -16443 -4484 4367 -20065 -29845 -10005 3182 15674 -6535 -27651
16860b7651J305K4699J1785J9753n250k0046l585j401l076m932j6715k1345L5191
$$ -27651 -26346 -1647 10138 29891 24641 4595 1010 -391 -3467 -8399 -25114 -46459 -11268
16847a1268L2377k1654l9719J4939J3592j3505J0225J2602j2268P03K8718o980
$$ -11268 21109 -545 -40264 -25325 -11733 -25238 -15013 -2411 -14679 -13976 14742 7762
16835G762j7560p572r6n015P596J2240o219j449k1481jP82K0146j2026k1468J83
$$ 7762 -9798 -17370 -17466 -22481 -14885 -2645 -8864 -10313 -31794 -31795 -31013 -10867 -22893 -44361 -44178
16820d4178j855j5310J51K8208K1648r37j8174n605M051j929k5174j0479K5879
$$ -44178 -46033 -61343 -61192 -32984 -11336 -12273 -30447 -36052 -32001 -33930 -59104 -69583 -43704
16807d3704l077J2978j2670j0911O71J8411J8279m587L58J014m613J289L904j4732
$$ -43704 -46781 -33803 -46473 -57384 -56713 -38302 -20023 -24610 -24252 -23238 -27851 -26562 -22658 -37390
16793c7390K0395J7970R606j9508j2186O760j8036k418J9707J7934j9370o650
$$ -37390 -16995 975 10581 -8927 -21113 -14353 -32389 -34807 -15100 2834 -16536 -23186
16781b3186q55j5267k4074q608j139K3136K16j5205l4807L10Q061J8077K188r891
$$ -23186 -24041 -39308 -63382 -71990 -73129 -49993 -49777 -64982 -99789 -99479 -91418 -73341 -71153 -81044
16767h1044j1019L416K8920J7703L5620q06k5663j4471J867N667l768J3955J4576
$$ -81044 -92063 -88647 -59727 -42024 -6404 -7210 -32873 -47344 -45477 -39810 -43578 -29623 -15047
16754a5047k703P416j3821j3231j625o511m9973j1153m596N006j9508K9718M2005
$$ -15047 -17750 -10334 -24155 -37386 -39011 -45522 -95495 -106648 -111244 -106238 -125746 -96028 -54023
16741e4023L7375J1890p740p499p025j2183J3327p379k1870l67q252J6666J7332
$$ -54023 -16648 -4758 -12498 -19997 -27022 -39205 -25878 -33257 -55127 -55494 -63746 -47080 -29748
16728b9748j4053l5625l2333J2258K5816K7833J7852J72m596J9011J706l2190
$$ -29748 -43801 -79426 -111759 -99501 -73685 -45852 -28000 -27828 -32424 -13413 -11707 -43897
16716d3897j0806K0911k959n299n993r282r329L1684J5502j540j5802j3473K6714
$$ -43897 -54703 -33792 -36751 -42050 -48043 -57325 -66654 -34970 -19468 -21008 -36810 -50283 -23569
16703b3569P238o99L5712N826j0493j2373k1585O236Q600l7474k8419J4141J5780
$$ -23569 -16331 -17030 18682 24508 14015 1642 -19943 -13707 -5107 -42581 -71000 -56859 -41079
16690d1079K0770L181p701j5981J375N448j765K546j0984N321K609q416J2966
$$ -41079 -20309 -17128 -24829 -40810 -39435 -33987 -35752 -33206 -44190 -38869 -36260 -44676 -31710
16677c1710j0983O298k875J9021K876j8133n690J8535P382l5143Q962J6298q299
$$ -31710 -42693 -36395 -39270 -20249 -17373 -35506 -41196 -22661 -15279 -50422 -41460 -25162 -33461
16664c3461m803l1621R856K9347J1931J1701q547j5887j9478K5781J6808M636
$$ -33461 -38264 -69885 -60029 -30682 -18751 -7050 -15597 -31484 -50962 -25181 -8373 -3737
16652c737P44J5989k4479j9512k059M933j3583j5775R015K0585J8130k433n63
$$ -3737 -2993 12996 -11483 -30995 -33054 -28121 -41704 -57479 -48464 -27879 -9749 -12182 -12745
16639a2745n384O364k5033j1140K4149N200M33M769m832k2332J443j3190j1680
$$ -12745 -18129 -11765 -36798 -47938 -23789 -18589 -18156 -13387 -18219 -40551 -39108 -52298 -63978
16626f3978Q345K1382L438L960L230j0267k375o381p699m393j4812q195M2408
$$ -63978 -55633 -34251 -30813 -26853 -23623 -33890 -36265 -42646 -50345 -54738 -69550 -77745 -35337
16613c5337O3206L1541j8799n1043j2570J497K031m557j9570K764k5892q885K8126
$$ -35337 27869 59410 40611 -10432 -23002 -21505 -19474 -24031 -43601 -40837 -66729 -75614 -47488
16600d7488K2682J8023Q52J1383O533N082j5189n068K048K821K0799K684l5532
$$ -47488 -24806 -6783 -5931 5452 11985 17067 1878 -3190 -1142 1679 22478 25162 -10370
16587a0370J1372K2217p898l1090k1256J2482N105k536K4532j4035j904P18j1210
$$ -10370 1002 23219 15321 -15769 -37025 -24543 -19438 -21974 2558 -11477 -13381 -12663 -23873
16574b3873P705J0759k7191j5180J7886J946j1265k0894J850L870K6971m557j1732
$$ -23873 -16168 -5409 -32600 -47780 -29894 -27948 -39213 -60107 -58257 -54387 -27416 -31973 -43705
16561d3705K0579o088J3180J3052k1564n844K4573p98j8241L5500J4802j3514
$$ -43705 -23126 -29214 -16034 -2982 -24546 -30390 -5817 -6615 -24856 10644 25446 11932
16549A1932l5767k3061j0445J3572P636o769N347J7234O772j9153j1983j515K7199
$$ 11932 -23835 -46896 -57341 -43769 -36133 -42902 -37555 -20321 -13549 -32702 -44685 -46200 -19001
16536a9001PK695O550q576j7667Q19q332j1173J1714L3120K0772k5681P914k4062
$$ -19001 -18994 -16299 -9749 -18325 -35992 -35173 -43505 -54678 -42964 -9844 10928 -14753 -6839 -30901
16522c0901k9111L323K7574J8594p568q727L502R53J2723k3356j0108J3114N826
$$ -30901 -60012 -56689 -29115 -10521 -18089 -26816 -23314 -22361 -9638 -32994 -43102 -29988 -24162
16509b4162M291o364J5918l201p110j9425l3384j8019J4653K2273r765N231K7431
$$ -24162 -19871 -26235 -10317 -13518 -20628 -40053 -73437 -91456 -76803 -54530 -64295 -59064 -31633
16496c1633K2262J49j6715M305J4983j9674j3466k2244k1042q533m44N535J3312
$$ -31633 -9371 -9222 -25937 -21632 -6649 -26323 -39789 -62033 -83075 -91608 -92052 -86517 -73205
16483g3205K2963L0298n452o967J9334J8201j7291r900K9445j632k2381k4599
$$ -73205 -50242 -19944 -25396 -32363 -13029 5172 -12119 -22019 7426 5794 -16587 -41186
16471d1186k5902j451P169M2860Q662k7048R153L494k0426P769L4031R379l350
$$ -41186 -67088 -68539 -61370 -18510 -9848 -36896 -27743 -24249 -44675 -36906 -2875 6504 3154
16458C154j2746N019j1954k7151k157j7099j5464Q003J6235Q606J5495R011J3952
$$ 3154 -9592 -4573 -16527 -43678 -45835 -62934 -78398 -70395 -54160 -45554 -30059 -21048 -7096
16445g096R876k2843l0561L2356K0500O747J8216m4617j7291L0214j3254j8817
$$ -7096 2780 -20063 -50624 -18268 2232 8979 27195 -17422 -34713 -4499 -17753 -36570
16433c6570r715J9399L6259m78o401o822l531n990r947k2812k500K620K1648j7746
$$ -36570 -46285 -26886 9373 8895 2494 -4328 -7859 -13849 -23796 -46608 -49108 -46488 -24840 -42586
16419d2586R036J1455k4611J1645L4249q622j4200M287J1555j8459J4581K0436
$$ -42586 -33550 -22095 -46706 -35061 -812 -9434 -23634 -19347 -7792 -26251 -11670 8766
16407H766N301m1814k4683K087R914J067l964m909K9243L2018Q630k4805k4028
$$ 8766 14067 -27747 -52430 -50343 -40429 -39362 -43326 -48235 -18992 13026 21656 -3149 -27177
16394b7177J919k1656P565L2398J1624k271j4483k7655K1631k1819l5659M203
$$ -27177 -25258 -46914 -39349 -6951 4673 2402 -12081 -39736 -18105 -39924 -75583 -71380
16382g1380J3066O64q305l324J1196K1086k900q614k3208k252k372K9570L592
$$ -71380 -58314 -57650 -65955 -69279 -58083 -36997 -39897 -48511 -71719 -73971 -76343 -46773 -43181
16369d3181J3694J9986J351M615q342Q126j4282k2446j6655O878J794m589q579
$$ -43181 -29487 -9501 -8150 -3535 -11877 -3751 -18033 -40479 -57134 -50256 -48462 -53051 -61630
16356f1630L0733L616k5029j7814J0866K6933Q821m1881p088K1922K5316J7766
$$ -61630 -30897 -27281 -52310 -70124 -59258 -32325 -23504 -65385 -72473 -50551 -25235 -7469
16344g469j1188j0401r280m573j0466J4101L2556J3997p479j9197r294J6553P896
$$ -7469 -18657 -29058 -38338 -42911 -53377 -39276 -6720 7277 -202 -19399 -28693 -12140 -4244
16331d244J923j8773k1953M155J4564j2292K364j1199M091K054j4242k5052J3079
$$ -4244 -2321 -21094 -43047 -38892 -24328 -36620 -34256 -45455 -41364 -39310 -53552 -78604 -65525
16318f5525R951L028j031L06m830L959K871j0517J5064K9450P175J4654p548k0195
$$ -65525 -55574 -52546 -53577 -53271 -58101 -54142 -51271 -61788 -46724 -17274 -10099 4555 -2993 -23188
16304b3188M618p915j5580j4616J3606R343J4695k9417Q980R825j6149n340q996
$$ -23188 -18570 -26485 -42065 -56681 -43075 -33732 -19037 -48454 -39474 -29649 -45798 -51138 -60134
16291f0134m803N129O550K776k2685j2645K7388r454J1060k269J1115q025R159
$$ -60134 -64937 -59808 -53258 -50482 -73167 -85812 -58424 -67878 -56818 -59087 -47972 -55997 -46838
16278d6838J3786K191J0250J1077N857O794j3360J9109k0662j6165j9407j7509
$$ -46838 -33052 -30861 -20611 -9534 -3677 3117 -10243 8866 -11796 -27961 -47368 -64877
16266f4877J5344R400q173J2716J6738l338j4430J3193P758M629j6058k9122j1454
$$ -64877 -49533 -40133 -48306 -35590 -18852 -22190 -36620 -23427 -15669 -11040 -27098 -56220 -67674
16253f7674n777n939K0568L5880j0806j7475J1974J000J7298J5271o064K683O805
$$ -67674 -73451 -79390 -58822 -22942 -33748 -51223 -39249 -38249 -20951 -5680 -11744 -9061 -2256
16240b256k8352j5718J1890K988R829m054k0199R997n969j5574K9025o035l6765
$$ -2256 -30608 -46326 -34436 -31448 -21619 -25673 -45872 -35875 -41844 -57418 -28393 -34428 -71193
16227g1193J7893q45l831K3510p264j0256L2576J03n502R957J4408j6396J2124
$$ -71193 -53300 -54145 -57976 -34466 -41730 -51986 -19410 -19307 -24809 -14852 -444 -16840 -4716
16214d716L3797j5267k8754k119j2918q509J689L16j3731N369L1154q439j7350
$$ -4716 29081 13814 -14940 -17059 -29977 -38486 -36797 -36481 -50212 -44843 -13689 -22128 -39478
16201c9478K739J8975j146l569N085P245j6546l008j1723O865M2143j034l1631
$$ -39478 -36739 -17764 -18910 -22479 -17394 -10149 -26695 -29703 -41426 -34561 7582 6548 -25083
16188b5083R477P670k459k6517J317J697j3910O30n298k8912m209K7716J479J0640
$$ -25083 -15606 -7936 -10395 -36912 -35595 -33898 -47808 -47178 -52476 -81388 -85597 -57881 -56402 -45762
16174d5762J2176K3876J4781J1779j7077j5069K2954K3078J161k2717l9276r428
$$ -45762 -33586 -9710 5071 16850 -227 -15296 7658 30736 31897 9180 -30096 -39524
16162c9524L898j3317J8411m680q537O516P929q661j116J6412p718j3598j2999
$$ -39524 -35626 -48943 -30532 -35212 -43749 -37233 -29304 -37965 -39081 -22669 -30387 -43985 -56984
16149e6984J9915K7833N080N159j0925j7900m591K588j6129J3009K9104M644l3827
$$ -56984 -37069 -9236 -4156 1003 -9922 -27822 -32413 -29825 -45954 -32945 -3841 803 -33024
16136c3024k6270K5535q054k3515L552K3427k166j7749O965M6032J8115n305K0932
$$ -33024 -59294 -33759 -41813 -65328 -61776 -38349 -40515 -58264 -51299 -5267 12848 7543 28475
16123B8475K5057K804n009n4674l3544j2318J3317l1107J8144J7914j9376n041
$$ 28475 53532 56336 51327 -3347 -36891 -49209 -35892 -66999 -48855 -30941 -50317 -55358
16111e5358O857p943Q26M0288K0349l4005p808J1901L6999j3010l207j8885n442
$$ -55358 -48501 -56444 -55618 -15330 5019 -28986 -36794 -24893 12106 -904 -4111 -22996 -28438
16098b8438j861j2702k376k3924n951J8968l361l319l777J1747M4490J9804j4332
$$ -28438 -30299 -43001 -45377 -69301 -75252 -56284 -59645 -62964 -66741 -54994 -10504 9300 -5032
16085e032N82l970k0285k279J0211R944p015M002J2225R82N406j0352k6537j6263
$$ -5032 -4450 -8420 -28705 -30984 -20773 -10829 -17844 -13842 -1617 -635 4771 -5581 -32118 -48381
16071d8381K7023L7792k0016n854o704k1663k0070p413K6173J348j2679J4246
$$ -48381 -21358 16434 -3582 -9436 -16140 -37803 -57873 -65286 -39113 -37765 -50444 -36198
16059c6198J2013J1562k1753j1139j9422l2397m432n031j1624L2947M9550N052
$$ -36198 -24185 -12623 -34376 -45515 -64937 -97334 -101766 -106797 -118421 -85474 -35924 -30872
16047c0872k9041k2566p975K9693L0663Q727j3919O267Q289L4289J5012j2861
$$ -30872 -59913 -82479 -90454 -60761 -30098 -21371 -35290 -29023 -20734 13555 28567 15706
16035A5706j3462l6071j049Q817Q316M294J1195P564l7319l633k3764k4282r65
$$ 15706 2244 -33827 -34876 -26059 -17743 -13449 -2254 5310 -32009 -35642 -59406 -83688 -84653
16022h4653P449q270J2819M9685K4436k0583m4639k0452M4494j248O196L5165
$$ -84653 -77204 -85474 -72655 -22970 1466 -19117 -63756 -84208 -39714 -40962 -34766 399
16010C99k607k5224k6605P436J1292J5555J2139K6546J4180m4872l5178l742q86
$$ 399 -2208 -27432 -54037 -46601 -35309 -19754 -7615 18931 33111 -11761 -46939 -50681 -51567
15997e1567L2404N0248L177k9378j6212l53j1252p328r448J0593P175Q000J7699
$$ -51567 -19163 31085 34262 4884 -11328 -11681 -22933 -30261 -39709 -29116 -21941 -13941 3758
15984C758m736o131n203j8583k321j7885O784K9900R880j504j1898m1890k585
$$ 3758 -978 -7109 -12312 -30895 -33216 -51101 -44317 -14417 -4537 -6041 -17939 -59829 -62414
15971f2414n733J2713R667k4542l9371j6679J5294J00J1798L5908K8026J624J9562
$$ -62414 -68147 -55434 -45767 -70309 -109680 -126359 -111065 -110965 -99167 -63259 -35233 -33609 -14047
15958a4047J2754l2931j0682K4446R656j6644j6323K0329Q971q524R970j9278
$$ -14047 -1293 -34224 -44906 -20460 -10804 -27448 -43771 -23442 -14471 -22995 -13025 -32303
15946c2303j485L1319K375l150n712j6515j8204k6036j2338J2278L7685K2727
$$ -32303 -33788 -2469 -94 -3244 -8956 -25471 -43675 -69711 -82049 -69771 -32086 -9359
15934i359j1159K198J5620J094j8428j3926k4004k168K212j1989L5154L9290n299
$$ -9359 -20518 -18320 -2700 -1606 -20034 -33960 -57964 -60132 -57920 -69909 -34755 4535 -764
15921g64P328J7762K1453l226k0970j2555K0780M71n436j7157n5454l723J3328
$$ -764 6564 24326 45779 42553 21583 9028 29808 30279 24843 7686 -47768 -51491 -38163
15908c8163L6519J4975r062n73j2315j37j9250o216j9316j6134j5454R656K2924
$$ -38163 -1644 13331 4269 3696 -8619 -8756 -28006 -34222 -53538 -69672 -85126 -75470 -52546
15895e2546j529j9888M109J6138J3245r518j8271o438N050N936L49q052J2720
$$ -52546 -54075 -73963 -69854 -53716 -40471 -49989 -68260 -74698 -69648 -63712 -63363 -71415 -58695
15882e8695K4548J1132J5981K2026O792k7833p516K1434L378o007k5258L464l1316
$$ -58695 -34147 -23015 -7034 14992 21784 -6049 -13565 7869 11247 5240 -20018 -16554 -47870
15869d7870j1580J3914O138K5310L4938K3348K759q839p588n195j8298k8652L785
$$ -47870 -59450 -45536 -39398 -14088 20850 44198 46957 38118 30530 25335 7037 -21615 -17830
15856a7830N502k2023J3382J8897K3807l197j9254l1368j8492J4858J1985j1352
$$ -17830 -12328 -34351 -20969 -2072 21735 18538 -716 -32084 -50576 -35718 -23733 -35085
15844c5085M1104Q28q105J0150j6250k4702k470K4952M777j2799j885J058p373
$$ -35085 6019 6847 -1258 8892 -7358 -32060 -34530 -9578 -4801 -17600 -19485 -18427 -25800
15831b5800n308n349K141J9477J493J088J1684j7177l2201L694P854r18j4273
$$ -25800 -31108 -36457 -34316 -14839 -13346 -12258 -574 -17751 -49952 -46258 -38404 -39322 -53595
15818e3595j989J9569J7956q208J1431k7136J132K1845j5025j0666K3234K3800
$$ -53595 -55584 -36015 -18059 -26267 -14836 -41972 -40840 -18995 -34020 -44686 -21452 2348
15806B348l597j7284N952o867j3020k0667j2329Q777K1448M230J8995k4750j6239
$$ 2348 -1249 -18533 -12581 -19448 -32468 -53135 -65464 -56687 -35239 -31009 -12014 -36764 -53003
15793e3003K1671K1800P278M061n880n771l8326J7741k448N931J2163j752R99
$$ -53003 -31332 -9532 -2254 1807 -4073 -9844 -48170 -30429 -32877 -26946 -14783 -16535 -15536
15780a5536r549j995K925J5012N395O462K321j9197j2538K0011o771j581k95N128
$$ -15536 -25085 -27080 -24155 -9143 -3748 2714 5035 -14162 -26700 -6689 -13460 -15041 -15336 -10208
15766a0208M73k6842J6455K1801k4732o433j2571J613k993j446m046j7078J1930
$$ -10208 -9735 -36577 -20122 1679 -23053 -29486 -42057 -40444 -43437 -44883 -48929 -66007 -54077
15753e4077r174j9188M2746P139J3471n331P024n5228q849k489J4189M3733j0672
$$ -54077 -63251 -82439 -39693 -32554 -19083 -24414 -17390 -72618 -81467 -83956 -69767 -26034 -36706
15740c6706q889L552K5538L2322R339p638j8856J0571J0603k2961k9956R83J9562
$$ -36706 -45595 -42043 -16505 15817 25156 17518 -1338 9233 19836 -3125 -33081 -32098 -12536
15727a2536k278r690k5236o497J7942l778J414M283K7075Q755j2597p900K0914
$$ -12536 -14814 -24504 -49740 -56237 -38295 -42073 -40659 -36376 -9301 -546 -13143 -21043 -129
15714a29l227R23j7233j3855N249L2416l28k150N008l292l485K0262Q022k5888
$$ -129 -3356 -2433 -19666 -33521 -28272 4144 3816 1666 6674 3382 -103 20159 28181 2293
15700B293p912l996L1508k5399j7910j2435J3171n155K6465K0633J5278Q583j7392
$$ 2293 -5619 -9615 21893 -3506 -21416 -33851 -20680 -25835 630 21263 36541 45124 27732
15687B7732P985q598r626j0077l827J0111m195k5877j8870j0989m822R125j0856
$$ 27732 35717 27119 17493 7416 3589 13700 9505 -16372 -35242 -46231 -51053 -41928 -52784
15674e2784l013j1376n961J7681L9355n982j4738L15l001l861q324j4195q832
$$ -52784 -55797 -67173 -73134 -55453 -16098 -22080 -36818 -36503 -39504 -43365 -51689 -65884 -74716
15661g4716o02L5216M1199l130k3719R283J8655j3841M991L905J3052j3380l8729
$$ -74716 -75318 -40102 1097 -2033 -25752 -16469 2186 -11655 -6664 -2759 10293 -3087 -41816
15648d1816j523m990Q605P518J3308K4370j1723j4266P559j9090j5591J7322J1376
$$ -41816 -43339 -48329 -39724 -32206 -18898 5472 -6251 -20517 -12958 -32048 -47639 -30317 -18941
15635a8941N005k9178K84n201M508m467p618J411L546J5869J2394m600j6363L1445
$$ -18941 -13936 -43114 -42830 -48031 -43523 -47990 -55608 -54197 -50651 -34782 -22388 -26988 -43351 -11906
15621a1906K356J141k2068o396j3740N284J163J1348L221K3099J5271J9871k851
$$ -11906 -9550 -8409 -30477 -36873 -50613 -45329 -44166 -32818 -29597 -6498 8773 28644 25793
15608B5793p009j0274j6483o154j1205J4423J0695J4264j5764k1001J3619M919
$$ 25793 18784 8510 -7973 -14127 -25332 -10909 -214 14050 -1714 -22715 -9096 -4177
15596d177j6010j4186J163K4635l210j5296J6072J0852p860j4157J0456R82n0994
$$ -4177 -20187 -34373 -33210 -8575 -11785 -27081 -11009 -157 -8017 -22174 -11718 -10736 -61730
15583f1730k205O779K1310K3604j9244j5884k438l800R916K1195J9927K570K2360
$$ -61730 -63935 -57156 -35846 -12242 -31486 -47370 -49808 -53608 -43692 -22497 -2570 0 22360
15570B2360j3370j4849m207k0761j1395m740J6835J5794M150k1491k4551O449
$$ 22360 8990 -5859 -10066 -30827 -42222 -46962 -30127 -14333 -10183 -31674 -56225 -49776
15558d9776N0798O898K4849K0674p984j6562j7171r43m44K6118l8318M69j2720
$$ -49776 1022 7920 32769 53443 45459 28897 11726 10783 10339 36457 -1861 -1392 -14112
15545a4112m5428j8236P724K4077P572j4449k73J0850R701J6041j5714j9858k2352
$$ -14112 -59540 -77776 -70052 -45975 -38403 -52852 -53125 -42275 -32574 -16533 -32247 -52105 -74457
15532g4457m158J8855L729K1778r948M42J3453N873k4637J2227K3495k2498j964
$$ -74457 -78615 -59760 -56031 -34253 -44201 -43759 -30306 -24433 -49070 -36843 -13348 -35846 -37810
15519c7810N341J1574O470P760j6123M181K3657J1695O183j7518k6283j9653L1069
$$ -37810 -32469 -20895 -14425 -6665 -22788 -18607 5050 16745 22928 5410 -20873 -40526 -9457
15506i457K0593r93J6427L1162l632m8283n491P230r614j7369k8293p857J8313
$$ -9457 11136 10143 26570 57732 54100 5817 326 7556 -2058 -19427 -47720 -55577 -37264
15493c7264K7229j8022L784K5910j9067l169J9370k0285J3197j336J4333j583
$$ -37264 -10035 -28057 -24273 1637 -17430 -20599 -1229 -21514 -8317 -9653 4680 3097
15481C097J218L050Q514l7179m1841k4108l983K8473K9787j5999J4027K0864j3098
$$ 3097 4315 7365 15879 -21300 -63141 -87249 -91232 -62759 -32972 -48971 -34944 -14080 -27178
15468b7178m958j802k4365k3762J4092L6043J5933k921j8275J3777J2670K5811
$$ -27178 -32136 -33938 -58303 -82065 -67973 -31930 -15997 -18918 -37193 -23416 -10746 15065
15456A5065l611J9406j0939o028k9397j6089k5668J0052j2951j4379L5333K1637
$$ 15065 11454 30860 19921 13893 -15504 -31593 -57261 -47209 -60160 -74539 -39206 -17569
15444a7569L5136k3391k3170J617J3982K7555j222k3415l1702j802O335R322j9761
$$ -17569 17567 -5824 -28994 -27377 -13395 14160 12938 -10477 -42179 -43981 -37646 -28324 -48085
15431d8085j0229L046j954l686l468L815J5327k6463j043K2565M05p202J702J8648
$$ -48085 -58314 -55268 -57222 -60908 -64376 -60561 -45234 -71697 -72740 -50175 -49770 -56972 -55270 -36622
15417c6622N435p926J7962J9501j5127j6163L5348J3053j1417p499l911q402K5705
$$ -36622 -31187 -39113 -21151 -1650 -16777 -32940 2408 15461 4044 -3455 -7366 -15768 9937
15404I937k349j4026k6948K888J4167o699p725J5109j4687M853J4553R827j937
$$ 9937 7588 -6438 -33386 -30498 -16331 -23030 -30755 -15646 -30333 -25480 -10927 -1100 -3037
15391c037J4118J7540r159k2279p73l735L360J229j1615l2331K0025P412j2463
$$ -3037 11081 28621 19462 -2817 -3590 -7325 -3965 -2736 -14351 -46682 -26657 -19245 -31708
15378c1708O290k1536l785r312L7058n750j1112P784J1458N509k5040l3094j6496
$$ -31708 -25418 -46954 -50739 -60051 -22993 -28743 -39855 -32071 -20613 -15104 -40144 -73238 -89734
15365h9734L7202J7914J3132K2674l085O760j2999P182o684P019q79J0125J7473
$$ -89734 -52532 -34618 -21486 1188 -1897 4863 -8136 -954 -7638 -619 -1498 8627 26100
15352B6100r629j4777q999K28N120j6302M621J5641k3222l4613k3199J7523J2937
$$ 26100 16471 1694 -7305 -7077 -1957 -18259 -13638 2003 -21219 -55832 -79031 -61508 -48571
15339d8571J0526k6905r901K5943L0445K9486M3520Q637k5267j2744k3928j4090
$$ -48571 -38045 -64950 -74851 -48908 -18463 11023 54543 63180 37913 25169 1241 -12849
15327a2849N099j253O600L5764J3253k5097n5277j2306L3820J2420j2610j6009
$$ -12849 -7750 -9003 -2403 33361 46614 21517 -33760 -46066 -12246 174 -12436 -28445
15315b8445J6648K2247L933N163j9333j9119Q83L8248K911j2787l7807l5562O669
$$ -28445 -11797 10450 14383 19546 213 -18906 -18023 20225 23136 10349 -27458 -63020 -56351
15302e6351L2148J5959L696K0947R676k6795j5573j167J370R512R382q442n6788
$$ -56351 -24203 -8244 -4548 16399 26075 -720 -16293 -17460 -16090 -6578 2804 -5638 -62426
15289f2426L177K4555j5804l50K890R958j382J414L925L3858K3015j406k2736
$$ -62426 -59249 -34694 -50498 -50848 -47958 -38000 -39382 -37968 -34043 -185 22830 21424 -1312
15276a312l761j1289n655R398k42l124J2362K2717J3777j2921j5805K369q040
$$ -1312 -5073 -16362 -22017 -12619 -12861 -15985 -3623 19094 32871 19950 4145 6514 -1526
15263a526j592R549L675o827P449J2740k1189l2204J1884N992j2302j0236J6637
$$ -1526 -3118 6431 10106 3279 10728 23468 2279 -29925 -18041 -12049 -24351 -34587 -17950
15250a7950L598J461j4464L865J2177J4672M300o322K947J3231m9508l3626q193
$$ -17950 -14352 -12891 -27355 -23490 -11313 3359 7659 1337 4284 17515 -31993 -65619 -73812
15237g3812j0809L3257Q587k424O031J1069j0955J3578k269J7000j2242k9270
$$ -73812 -84621 -51364 -42777 -45201 -39170 -28101 -39056 -25478 -27747 -10747 -22989 -52259
15225e2259k6746Q300J9911j0984R069o403Q089J9768J5993J8311l891j0187k5242
$$ -52259 -79005 -70705 -50794 -61778 -52709 -59112 -51023 -31255 -15262 3049 -842 -11029 -36271
15212c6271P370J5897k3068j9158j058J1870K6063K3316k101j2355J3684p962
$$ -36271 -28901 -13004 -36072 -55230 -56288 -44418 -18355 4961 2860 -9495 4189 -3773
15200c773j8594N048L2032P776j1303l4378j375J8566J5929k176q572l4881j4415
$$ -3773 -22367 -17319 14713 22489 11186 -23192 -24567 -6001 9928 7752 -820 -35701 -50116
15187e0116K8146J027j6070L091J0481O520J1872j0983r655M929o22j508n651
$$ -50116 -21970 -20943 -37013 -33922 -23441 -16921 -5049 -16032 -25687 -20758 -21380 -22888 -28539
15174b8539J5354R001j8091j2065J0073K551j7376J3062p737q559J1130j6079
$$ -28539 -13185 -4184 -22275 -34340 -24267 -21716 -39092 -26030 -33767 -42326 -31196 -47275
15162d7275j1060K505n056O334M0336K7989j5694K1353R167J793J900n685l1643
$$ -47275 -58335 -55830 -60886 -54552 -14216 13773 -1921 19432 28599 30392 32292 26607 -5036
15149e036l3591n891K3223J7708P463L546j7700O976k8211l1555J6285L7428m769
$$ -5036 -38627 -44518 -21295 -3587 3876 7422 -10278 -3302 -31513 -63068 -46783 -9355 -14124
15136a4124j42q280p008p512J367N889k906k275O877J9739N867j0682M1225P391
$$ -14124 -14266 -22546 -29554 -37066 -35699 -29810 -32716 -34991 -28114 -8375 -2508 -13190 28035 35426
15122C5426j8064j3363l2356J0497R754K5486m186k4449J0816J790M811j6943
$$ 35426 17362 3999 -28357 -17860 -8106 17380 13194 -11255 -439 1351 6162 -10781
15110a0781m345k1117N044K3435j1367j3739o889Q655K842j1710J2413K6990j4972
$$ -10781 -15126 -36243 -31199 -7764 -19131 -32870 -39759 -31104 -28262 -39972 -27559 -569 -15541
15097a5541K358K537k1902k282K3418p7K872J1262l886k1761m241K3241l6144
$$ -15541 -13183 -10646 -32548 -34830 -11412 -11489 -8617 2645 -1241 -23002 -27243 -4002 -40146
15084d0146j7553M805r88K4894K8775r897p477k9725K0665J0704r281J4117J4009
$$ -40146 -57699 -52894 -53882 -28988 -213 -10110 -17587 -47312 -26647 -15943 -25224 -11107 2902
15071B902r237k1974o067J4597K8123l586j0881N472j8013J193k5312j8705K5229
$$ 2902 -6335 -28309 -34376 -19779 8344 4758 -6123 -651 -18664 -17471 -42783 -61488 -36259
15058c6259K3463K0225q926j1083J3192j9540k0108Q524k74J858J565o384R116
$$ -36259 -12796 7429 -1497 -12580 612 -18928 -39036 -30512 -30786 -28928 -27363 -33747 -24631
15045b4631J2293j5612j7734J0570K0302J7628J6681L0014j838j9299m4549P036
$$ -24631 -12338 -27950 -45684 -35114 -14812 2816 19497 49511 47673 28374 -16175 -9139
15033i139K0576J0017L203P75j8777l4876j3674J5559K4540N344l116k4749L910
$$ -9139 11437 21454 24657 25432 6655 -28221 -41895 -26336 -1796 3548 432 -24317 -20407
15020b0407N285J6120L110M076l4483k1045L4345L0451k8062n185Q917L024M380
$$ -20407 -15122 998 4108 8184 -26299 -47344 -12999 17452 -10610 -15795 -6878 -3854 526
15007E26j432K595K4238M34n897n608o574P397J4818k0691o788n374j535Q044
$$ 526 -906 1689 25927 26361 20464 14856 8282 15679 30497 9806 3018 -2356 -3891 4153
14993D153J156J0355P524p956J5594J8128j4218j187R386K634k6912m0022n571
$$ 4153 5309 15664 23188 15232 30826 48954 34736 33549 42935 45569 18657 -21365 -26936
14980b6936J9317j6027J9396J2956j2593n358J2955J0116j8469k0838M026J1632
$$ -26936 -7619 -23646 -4250 8706 -3887 -9245 3710 13826 -4643 -25481 -21455 -9823
14968i823K5830j2217M152J115J8385k240k4179j4293k4533k1643K832J0787R046
$$ -9823 16007 3790 7942 9057 27442 25202 1023 -13270 -37803 -59446 -56614 -45827 -36781
14955c6781J4781J1120J0710K5924J0708q325N685k3620P238q053K5849l956r234
$$ -36781 -22000 -10880 -170 25754 36462 28137 33822 10202 17440 9387 35236 31280 22046
14942B2046j3411k8866P957L4427J7457o206j8652j1462j1923j5939Q345K9801
$$ 22046 8635 -20231 -12274 22153 39610 33404 14752 3290 -8633 -24572 -16227 13574
14930A3574K1625O476j4772k9556L0205j795L98J381j9926P307J3149j4388O427
$$ 13574 35199 41675 26903 -2653 27552 25757 26155 27536 7610 14917 28066 13678 20105
14917B0105J2623p17l4394p145Q272J6590K7422n972j0044P878j8985l5698k2164
$$ 20105 32728 32011 -2383 -9528 -1256 15334 42756 36784 26740 34618 15633 -20065 -42229
14904d2229j9406J4883J7516L2494q47k9911J2076K5055r404p764p239o462P919
$$ -42229 -61635 -46752 -29236 3258 2411 -27500 -15424 9631 227 -7537 -14776 -21238 -13319
14891a3319L208j6514K437R24L6197q011k2964r695K2718L670j946j8796J8191
$$ -13319 -10111 -26625 -24188 -23264 12933 4922 -18042 -27737 -5019 -1349 -3295 -22091 -3900
14878c900j520J2988Q51K6304j113k4323J814o124J5547r775j2001j1022j126
$$ -3900 -5420 7568 8419 34723 33610 9287 11101 4977 20524 10749 -1252 -12274 -13400
14865a3400j1269o807L5673L1484p581j9162o278k903K300P420K996k3736J4570
$$ -13400 -24669 -31476 4197 35681 28100 8938 2660 -243 2057 9477 12473 -11263 3307
14852C307Q523n1950k5893p82L3130J9532k1191Q179J9281J0657j7230K6106L2191
$$ 3307 11830 -40120 -66013 -66795 -33665 -14133 -35324 -27145 -7864 2793 -14437 11669 43860
14839D3860L7823r34k2615k8402m2070L2605K1051R712K4303O215j9398m498k9926
$$ 43860 81683 80749 58134 29732 -12338 20267 41318 51030 75333 81548 62150 57652 27726
14826B7726j2850J4098J2371R047M75j596l0618o28P012R987k0358j2608n9J2581
$$ 27726 14876 28974 41345 50392 50867 49271 18653 18025 25037 35024 14666 2058 1999 14580
14812A4580K7235L972p381k0767k0530l6313K1179n421m665M831J1533J202r642
$$ 14580 41815 45787 38406 17639 -2891 -39204 -18025 -23446 -28111 -23280 -11747 -10545 -20187
14799b0187P81N190L3084O670r008j3886n398J654j5044J599K3805p571n831N710
$$ -20187 -19406 -14216 18868 25538 16530 2644 -2754 -1100 -16144 -14545 9260 1689 -4142 1568
14785A568j7748J283J6381j0434j450j5834J3890p47l2152J8102L9264l3318o716
$$ 1568 -16180 -14897 1484 -8950 -10400 -26234 -12344 -13091 -45243 -27141 12123 -21195 -27911
14772b7911M090K6048L593J9048L867l1086q216J4945J7186j0540j1826J4861
$$ -27911 -23821 2227 5820 24868 28735 -2351 -10567 4378 21564 11024 -802 14059
14760A4059J4819J6233r911j6854j8040n485j5710R216K9801P033j9343n681j7305
$$ 14059 28878 45111 35200 18346 306 -5179 -20889 -11673 18128 25161 5818 137 -17168
14747a7168o002K5050n930k5352J6112J2308J4619o255j8589J5128J4770M419
$$ -17168 -23170 1880 -4050 -29402 -13290 -982 13637 7382 -11207 3921 18691 23110
14735B3110p056J6835J5149k6313l6996j2853L1477N6038J4029k7630L610j2414
$$ 23110 16054 32889 48038 21725 -15271 -28124 3353 59391 73420 45790 49400 36986
14723C6986J7905O611k0605K950j2915k4521J5627K2844n644J1995k076k5437
$$ 36986 54891 61502 40897 43847 30932 6411 22038 44882 39238 51233 49157 23720
14711B3720K053J394j7345J346J2703J7232J371j1594q696R260R879l9641k1193
$$ 23720 25773 27167 9822 11168 23871 41103 42474 30880 22184 31444 41323 1682 -19511
14698a9511j6516n269K8912J4674K4401J5578J0031J727k7873l6396k67M444O180
$$ -19511 -36027 -41296 -12384 2290 26691 42269 52300 54027 26154 -10242 -10509 -6065 115
14685A15P346M737j7970J9421J2325j0681q590j8959k0928J7510K0282o960j0094
$$ 115 7461 12198 -5772 13649 25974 15293 6703 -12256 -33184 -15674 4608 -2352 -12446
14672a2446k23j870O628Q109K242K1071K0440k0471l0428j6775r322J6518R624
$$ -12446 -12669 -14539 -7911 198 2440 23511 43951 23480 -6948 -23723 -33045 -16527 -6903
14659f903J6748P005m300j245j9575Q709L1677R443r869Q381k4662k6870j8308
$$ -6903 9845 16850 12550 11305 -8270 439 32116 41559 31690 40071 15409 -11461 -29769
14646b9769p236j560J8627J8790K3047J670J0139J2482J127k0638j3461r485j9053
$$ -29769 -37005 -38565 -19938 -1148 21899 23569 33708 46190 47317 26679 13218 3733 -15320
14633a5320l990k038P810K6998N349j2431j3810j5048q632M745N1622J1359l5312
$$ -15320 -19310 -21348 -13538 13460 18809 6378 -7432 -22480 -31112 -26367 25255 36614 1302
14620A302j4942K0767J0779M362J0183j1030n067J046k6845J9190n799l306k1384
$$ 1302 -13640 7127 17906 22268 32451 21421 16354 17400 -9445 9745 3946 640 -20744
14607b0744o234L402K2951L419j9426j4205K172J8161K2231J0647J0917k4768
$$ -20744 -26978 -23576 -625 2794 -16632 -30837 -28665 -10504 11727 22374 33291 8523
14595H523j3651L936K3741J2637k9659l6202J7366K6407k1281k4125J1740P372
$$ 8523 -5128 -1192 22549 35186 5527 -30675 -13309 13098 -8183 -32308 -20568 -13196
14583a3196J1519R446j1252M205J958l375K0344k886J3720J9711p278J1489j0670
$$ -13196 -1677 7769 -3483 722 2680 -695 19649 16763 30483 50194 42916 54405 43735
14570D3735j1159k414j963J6494j1512K267j0539l088j4577m689l847j7116J2050
$$ 43735 32576 30162 28199 44693 33181 35448 24909 21821 7244 2555 -1292 -18408 -6358
14557f358M874J2999Q92j4033J4786j0286J3201K9897q277m1358J0297r392r312
$$ -6358 -1484 11515 12407 -1626 13160 2874 16075 45972 37695 -3663 6634 -2758 -12070
14544a2070k588J1121J8229K2906L8125J477j7781p255k5223k956L996k010q382
$$ -12070 -14658 -3537 14692 37598 75723 77200 59419 52164 26941 23985 27981 25971 17589
14531A7589l685O367m719j687L1367j6969j8349j4303J6169J2348j63J2009k0450
$$ 17589 13904 20271 15552 13865 45232 28263 9914 -4389 11780 24128 23965 35974 15524
14518A5524k4888J7720j2039k9220J0294L5441J8715J0195J1010j0395J0115j6049
$$ 15524 -9364 8356 -3683 -32903 -22609 12832 31547 41742 52752 42357 52472 36423
14506C6423j8073q538l182j3420K6513m778k3425J6743K4550P694k9190k5666
$$ 36423 18350 9812 6630 -6790 19723 14945 -8480 8263 32813 40507 11317 -14349
14494a4349J1406j0908J6750J1441J2263K371J2232J0936O811k0922J721N843
$$ -14349 -2943 -13851 2899 14340 26603 28974 41206 52142 58953 38031 39752 45595
14482D5595J5191J35j542k1193K4349r284J4207K453M048q252K2825J4893j5980
$$ 45595 60786 60921 59379 38186 62535 53251 67458 69911 73959 65707 88532 103425 87445
14469H7445k4966K979L502J4355P481j1045l530j847n716j3956K9929L9036Q026
$$ 87445 62479 65458 68960 83315 90796 79751 76221 74374 68658 54702 84631 123667 131693
14456A31693J0227K1518L573K0186K4299j1542j6030J9353r833l0460l8552p849
$$ 131693 141920 163438 167011 187197 211496 199954 183924 203277 193444 162984 124432 116583
14444A16583j4926m897m653p64J3550R826J0767L14J7287K4636L0524M798q231
$$ 116583 101657 96760 92107 91343 104893 114719 125486 125800 143087 167723 198247 203045 194814
14431A94814K4581P040J1523M9934J9245j3074j8737o0467n0389o281P31j7900
$$ 194814 219395 226435 237958 287892 307137 294063 275326 214859 164470 158189 158920 141020
14419A41020k2198j9416j4503K4772K4856M252j2570J740k963J9073K0630K4131
$$ 141020 118822 99406 84903 109675 134531 138783 126213 127953 124990 144063 164693 188824
14407A88824L2965N8525K3782L463m944L582K882j4004m0166m4900l4492k4241
$$ 188824 221789 280314 304096 307559 302615 306197 309079 295075 254909 210009 175517 151276
14395A51276r779l0642l121Q854k873o120J2296K2925J8876K1762K91J2295j0413
$$ 151276 141497 110855 107734 116588 113715 107595 119891 142816 161692 183454 183745 196040 185627
14382A85627n242J867J7488K0021J9694m641p571q491k3836l6657l2186l1039
$$ 185627 180385 182252 199740 219761 239455 234814 227243 218752 194916 158259 126073 95034
14370I5034P047n176J2653J4904J0594n716p087j3027p03K4233K9659K1970p830
$$ 95034 102081 96905 109558 124462 135056 129340 122253 109226 108523 132756 162415 184385 176555
14357A76555p803J5501K6851j4812j1267q349m224K275k7502l2919k1375J023
$$ 176555 168752 184253 211104 196292 185025 176676 172452 174727 147225 114306 92931 93954
14345I3954N831j1408q934q40l0222r889j480L746j4817R331L9481K9466J0408
$$ 93954 99785 88377 79443 78603 48381 38492 37012 40758 25941 35272 74753 104219 114627
14332A14627J7126N263p896J6657n078K0967q431m2426l2698k3034K307K1964
$$ 114627 131753 137016 129120 145777 140699 161666 153235 110809 78111 55077 57384 79348
14320G9348K4449K0763j3298l1081j914j2709N668l482j7002J6393J1383j3063
$$ 79348 103797 124560 111262 80181 78267 65558 71226 67744 50742 67135 78518 65455
14308F5455k1965J4348o155L781j4607n544k10M594J5845o30k6113p984K847J9321
$$ 65455 43490 57838 51683 55464 40857 35313 35103 39697 55542 54912 28799 20815 23662 42983
14294D2983r848j0027L1300M8453J9839k6888m6677l2060l2901Q732K6821J906
$$ 42983 33135 23108 54408 102861 122700 95812 49135 17075 -15826 -7094 19727 21633
14282B1633j0542K8683L1090K7053j3472J6068K9382L4834j4612m0049j1925K50
$$ 21633 11091 39774 70864 97917 84445 100513 129895 164729 150117 110068 98143 98393
14270I8393j6906k2500n773j9504O918J8392J0970o36K6330K1542m0839l3195
$$ 98393 81487 58987 53214 33710 40628 59020 69990 69354 95684 117226 76387 43192
14258D3192j1527q312L8306M5545O136n288r420k660L319J2578m8986j290K8313
$$ 43192 31665 23353 61659 107204 113340 108052 98632 95972 99291 111869 62883 61593 89906
14245H9906k2304j6911N666J4100K7808q909l472j8237o385L307n762j0585J5809
$$ 89906 67602 50691 56357 70457 98265 89356 85884 67647 61262 64569 58807 48222 64031
14232F4031J6608L974M7281J8874m671m799n071k9200j0049J0132K8387j8776
$$ 64031 80639 84613 131894 150768 146097 141298 136227 107027 96978 107110 135497 116721
14220A16721m6668k2165M90m243j57O480Q313K051J9259K0929M2802J0220j9418
$$ 116721 70053 47888 48378 44135 43978 50458 58771 60822 80081 101010 143812 154032 134614
14207A34614m141q461r968o315K452J5192n438l0503k7713J5547L3992q747k0713
$$ 134614 130473 122012 112044 105729 108181 123373 117935 87432 59719 75266 109258 100511 79798
14194G9798o256L712l606J1275J7984K972N587J1697M909J0645r021l435q113
$$ 79798 73542 77254 73648 84923 102907 105879 111466 123163 128072 138717 129696 126261 118148
14181A18148l662P969k8028j7790J7540L4913j520l853j7743M753R236O126L617
$$ 118148 114486 122455 94427 76637 94177 129090 127570 123717 105974 110727 119963 126089 129706
14168A29706j6656k603K3495k0465N891J3136J6256p589o161K9408J3842m100
$$ 129706 113050 110447 133942 113477 119368 132504 148760 141171 135010 164418 178260 174160
14156A74160J363K2344j647l516k9392n719L7631L4814j1771j13J3446k4011l5265
$$ 174160 175523 197867 196220 192704 163312 157593 195224 230038 218267 218154 231600 207589 172324
14143A72324l5208l583j9847J6988R563J0707j4281q3L887K3540P681J7034j511
$$ 172324 137116 133533 113686 130674 140237 150944 136663 136580 140467 164007 171688 188722 187211
14130A87211M423K0310K6893K2221k679l2394j3046n029q909L4138J6789k3279
$$ 187211 191634 211944 238837 261058 258379 225985 212939 207910 199001 233139 249928 226649
14118B26649m3416j7301L1889N557k5471L272R629l0087j1843J2590L2907N994
$$ 226649 183233 165932 197821 203378 177907 181179 190808 160721 148878 161468 194375 200369
14106B00369L2240J0459j0445J2238L415J9841K0464R853k5905k5539J5006L4810
$$ 200369 232609 243068 232623 244861 248276 268117 288581 298434 272529 246990 261996 296806
14094B96806K2220J1770j2812P828k1194j4405k1040M071K7728K4138K3395p419
$$ 296806 319026 330796 317984 325812 304618 290213 269173 273244 300972 325110 348505 341086
14082C41086j3174J7605N507J261N541Q593p747j432J6059J9903j060K1594O1930
$$ 341086 327912 345517 351024 352285 357826 366419 358672 357240 373299 393202 392142 413736 475666
14069D75666J2570j1281M0649J3046R686k127r16l520K770J4512K3668K4825K0879
$$ 475666 488236 476955 517604 530650 540336 538209 537293 533773 536543 551055 574723 599548 620427
14056F20427M6832L2401P109K3051K8014L7867P5985M9380M8652M9364N0304O7289
$$ 620427 667259 699660 706769 729820 757834 795701 871686 921066 969718 1019082 1069386 1136675
14044A136675M3946N2206R5603J03641J33323J70778J85028K44815L02668L52403
$$ 1136675 1180621 1232827 1328430 1432071 1565394 1736172 1921200 2166015 2468683 2821086
14034B821086M97624O01832P51432R43180J160908J390431J527476J577636J467747
$$ 2821086 3318710 3920542 4671974 5615154 6776062 8166493 9693969 11271605 12739352
14025A2739352J195512P60624K39471k83937p44189j037922j173363j182025j101135
$$ 12739352 13934864 14695488 14934959 14651022 13906833 12868911 11695548 10513523 9412388
14016I412388q85255o16972l99673j76307N7888K77161M65429P49208J078622
$$ 9412388 8527133 7910161 7510488 7334181 7392069 7669230 8134659 8883867 9962489
14007I962489J450133J879016K363695K818638L039311K971767K619534J947320
$$ 9962489 11412622 13291638 15655333 18473971 21513282 24485049 27104583 29051903
13999B9051903R67980j48855j158770j975055k528959k707426k600207k284795
$$ 29051903 30019883 29871028 28712258 26737203 24208244 21500818 18900611 16615816
13991A6615816j734656j265748q61510m76014n2622K91744P12582J155249J710795
$$ 16615816 14881160 13615412 12753902 12277888 12225266 12517010 13229592 14384841 16095636
13982A6095636K357677L072729L819099M416255M633705M437535L736074K450961
$$ 16095636 18453313 21526042 25345141 29761396 34395101 38832636 42568710 45019671
13974D5019671Q42108q56566k370296l461761m096560m224163l922651l303708
$$ 45019671 45861779 45005213 42634917 39173156 35076596 30852433 26929782 23626074
13966B3626074k588717j823002j195562o24640p4561M56624J034783J737484K507147
$$ 23626074 21037357 19214355 18018793 17394153 17319592 17776216 18810999 20548483 23055630
13957B3055630L438997M416354N309590N927446O033814N515740M225283K288799
$$ 23055630 26494627 30910981 36220571 42148017 48181831 53697571 57922854 60211653
13949F0211653Q6306k162588m070785n319182n847304n770085n205154m365226
$$ 60211653 60297959 58135371 54064586 48745404 42898100 37128015 31922861 27557635
13941B7557635l423324k566692j848655j171014o34110r4047M74178J128573J807329
$$ 27557635 24134311 21567619 19718964 18547950 17913840 17819793 18293971 19422544 21229873
13932B1229873K551387L349212L976293M356584M333951L724788K616054J064796
$$ 21229873 23781260 27130472 31106765 35463349 39797300 43522088 46138142 47202938
13924D7202938o67645k313608l619143m380467m622851m386272l880440l197212
$$ 47202938 46535293 44221685 40602542 36222075 31599224 27212952 23332512 20135300
13916B0135300k489317j835245j313205q43419m45148p2073L97476Q58789J312040
$$ 20135300 17645983 15810738 14497533 13654114 13208966 13136893 13534369 14393158 15705198
13907A5705198J850724K380453K789865K942211K803461K282966J395047K60259
$$ 15705198 17555922 19936375 22726240 25668451 28471912 30754878 32149925 32410184
13899C2410184r37651j954794k686410l113602l179225k926262k508629k048897
$$ 32410184 31472533 29517739 26831329 23717727 20538502 17612240 15103611 13054714
13891A3054714j585425j170064q71516o24628l61909r2231J09953L67831O57652
$$ 13054714 11469289 10299225 9427709 8803081 8441172 8348941 8458894 8826725 9484377
13882I484377R32020J158791J311444J322991J169479Q52879L87047j80735p11577
$$ 9484377 10416397 11575188 12886632 14209623 15379102 16231981 16619028 16438293 15726716
13873A5726716j205828j498275j620683j597147j476688j247546j036693q51352
$$ 15726716 14520888 13022613 11401930 9804783 8328095 7080549 6043856 5192504
13865E192504o79367n66316m55411l78205k87491k44694j99782j66425j41572
$$ 5192504 4513137 3946821 3491410 3113205 2825714 2581020 2381238 2214813 2073241
13856B073241j35579j06476l2873j4814k5095k7393k1241k2591m9708o0903q7213
$$ 2073241 1937662 1831186 1798313 1783499 1758404 1731011 1709770 1687179 1637471 1576568 1489355
13845A489355q0546q0786j07818q8920p2606k6725j4387l3707l5579l1548j8202
$$ 1489355 1408809 1328023 1220205 1131285 1058679 1031954 1017567 983860 948281 916733 898531
13834H98531J0525j0346p687r245m356J7200K0554K734J0546K8709J8507J4886
$$ 898531 909056 898710 891023 881778 877422 894622 915176 917910 928456 957165 975672 990558
13822I90558k6570o7405m5336l4905n4413o1332m4019m7275k4674J0700o085l1725
$$ 990558 963988 896583 851247 816342 761929 700597 656578 609303 584629 595329 589244 557519
13810E57519l4359k2267J591K7935K5655L6182J7490j7019O884M961J0324R789
$$ 557519 523160 500893 502484 530419 556074 592256 609746 592727 599611 604572 614896 624685
13798F24685j0866k4256m6093l6971k3262m4750k6408n5791k5728O511R920K150
$$ 624685 613819 589563 543470 506499 483237 438487 412079 356288 330560 337071 346991 349141
13786C49141m066r786k8092n608K1066j249M340K1918R983J0211M361Q730K7446
$$ 349141 345075 335289 307197 301589 322655 321406 325746 347664 357647 367858 372219 380949 408395
13773D08395k3919m7723m6966j1844J5615L811j5507k8146l0738o448J0881k1862
$$ 408395 384476 336753 289787 277943 293558 297369 281862 253716 222978 216530 227411 205549
13761B05549k9549J1697J4462M028J3719R767n74l4498p732O220l8626k1790k1174
$$ 205549 176000 187697 202159 206187 219906 229673 229099 194601 186869 193089 154463 132673 111499
13748A11499J5243L5665J4934K3816n455J6974k524j9941J236j6931k4997J5906
$$ 111499 126742 162407 177341 201157 195702 212676 210152 190211 191447 174516 149519 165425
13736A65425J5078l1075J4071J5029j904k481j499j96p915l9398j0986L816m515
$$ 165425 180503 149428 163499 178528 176624 174143 172644 172448 164533 125135 114149 117965 113450
13723A13450j8218j4310J563J3770j9146K8586K9265M315j0019j5678q85K9698
$$ 113450 95232 80922 82485 96255 77109 105695 134960 139275 129256 113578 112693 142391
13711A42391k7727l0265J4341J5828k011k047K6903M082k8808j9890J2252l823
$$ 142391 114664 84399 98740 114568 112557 110510 137413 141495 112687 92797 105049 101226
13699A01226j5351R484J2545R71k3071p57K3787k7803j091L0559L4566j259k2893
$$ 101226 85875 95359 107904 108875 85804 85047 108834 81031 79940 110499 145065 143806 120913
13686A20913o32r123J289L995q045K9783m7j2581J2270J4831k605j3224j3044
$$ 120913 120281 111158 112447 116442 108397 138180 138133 125552 137822 152653 150048 136824 123780
13673A23780o469j5584j2005k0716K229K4111K8904l347l8281p872K4494N715
$$ 123780 117311 101727 89722 69006 71235 95346 124250 120903 82622 74750 99244 104959
13661A04959J387m171j4773l92J669o393J2192m411j3853N476N514j4559k3858
$$ 104959 106346 102175 87402 87010 88679 82286 94478 90067 76214 81690 87204 72645 48787
13648D8787j0527K7308L2966l4690q744J8961L1815P22O700j6040k6634J974k2101
$$ 48787 38260 65568 98534 63844 55100 74061 105876 106598 113298 97258 70624 72598 50497
13635E0497j5411O618Q108p61o537O848n145Q112J6598l570n178K9843P292k1953
$$ 50497 35086 41704 49812 49051 42514 49362 44217 52329 68927 65357 60179 90022 97314 75361
13621G5361J2868Q707p129J3152Q463J1673J6871L714j3548l6981l474j9032j4263
$$ 75361 88229 96936 89807 102959 111422 123095 139966 143680 130132 93151 89677 70645 56382
13608E6382R203K0984K7207P874m46l8464j5005p013J3090j703k0518o29N1401
$$ 56382 65585 86569 113776 121650 121204 82740 67735 60722 73812 72109 51591 50962 102363
13595A02363M2817l126l3816k2657J5592N945J4504j8354j911K277J1736J4191
$$ 102363 145180 142054 108238 85581 101173 107118 121622 103268 101357 103634 115370 129561
13583A29561r943j9077k48J3094q518j2016j5271p879k032j0275k040J0595J1844
$$ 129561 119618 100541 100293 113387 104869 92853 77582 69703 67671 57396 55356 65951 77795
13570G7795J9690P386j7192J6970J7414N573K4563J9758n688J3365k4176k2862
$$ 77795 97485 104871 87679 104649 122063 127636 152199 171957 166269 179634 155458 132596
13558A32596j0273M648P871k816K1840j2125j8330J5864K3275q611J5358l913
$$ 132596 122323 126971 134842 132026 153866 141741 123411 139275 162550 153939 169297 165384
13546A65384K228r813J2036K2616N764L577j0420j632m281j3889K247P378M776
$$ 165384 167612 157799 169835 192451 198215 201792 191372 189740 185459 171570 173817 181195 185971
13533A85971m799j9171j3455q287o524p548j8469K4847q01O054K0975l352l222
$$ 185971 181172 162001 148546 140259 133735 126187 107718 132565 131764 137818 158793 155441 152219
13520A52219N107K6960L2418K7771K6138j4952K5547M7568J9019j4363o739j4307
$$ 152219 157326 184286 216704 244475 270613 255661 281208 328776 347795 333432 326693 312386
13508C12386l9508l9060O886J6379j8999l0588j729k029K4320n104J2726j5635
$$ 312386 272878 233818 240704 257083 238084 207496 205767 203738 228058 222954 235680 220045
13496B20045j7312K3267L4588M2723M638J5822N2916L7538N85m5229k5502M90
$$ 220045 202733 226000 260588 303311 307949 323771 376687 414225 414810 369581 344079 344569
13484C44569j6779l1552j9499l0780j3891l3200l1011J5082J5745J7237o587M373
$$ 344569 327790 296238 276739 245959 232068 198868 167857 182939 198684 215921 209334 213707
13472B13707j3377J785L3838K0723M753L4611J0093j556J2364P811j7911K1085
$$ 213707 200330 202115 235953 256676 261429 296040 306133 304577 316941 324752 306841 327926
13460C27926j622l4051j2223k7960k8713J9869K3581k011m087K29k3466K8385
$$ 327926 326304 292253 280030 252070 223357 243226 266807 264796 260709 260938 237472 265857
13448B65857L2229m175L5468L6334m634R891L3933L5551L6623n275l2052k6100
$$ 265857 298086 293911 329379 365713 361079 370970 404903 440454 477077 471802 439750 413650
13436D13650j827m4741l9783l5595J1800l2448o739j2428j1127J0058J100m85
$$ 413650 411823 367082 327299 291704 303504 271056 264317 251889 240762 250820 251920 251435
13424B51435J2415M0160L1200L1577M0058L7731K6491j7316R901O697l109r096
$$ 251435 263850 304010 335210 366787 406845 444576 471067 453751 463652 470349 467240 458144
13412D58144k0356l2422k1660K07P757K9666n526j3694j0869M41j512k9334m5872
$$ 458144 437788 405366 383706 383913 391670 421336 415810 402116 391247 391688 390176 360842 314970
13399C14970q293K948j7218k2230k4484k6895r161k6118k7146J4808L9341L2208
$$ 314970 306677 309625 292407 270177 245693 218798 209637 183519 156373 171181 210522 242730
13387B42730k4656J0439N8308K2214M263L759R904L7750L5757K0507K0172j7261
$$ 242730 218074 228513 286821 309035 313298 317057 326961 364711 400468 420975 441147 423886
13375D23886q301M4582K4057L32M81j4568p103P233r777j7593j0107l1272m7562
$$ 423886 415585 460167 484224 484556 485037 470469 463366 470599 460822 443229 433122 401850 354288
13362C54288k3367q005l1917r602p736j2907j2702k7961k040J1859K6445L6451
$$ 354288 330921 322916 290999 281397 273661 260754 248052 220091 218051 229910 256355 292806
13350B92806L6459J6099J9801L6365L726J2844K7429P669j8164j7144l518J0073
$$ 292806 329265 345364 365165 401530 405256 418100 445529 453198 435034 417890 414372 424445
13338D24445J5805q155k7194j7351K246J9017J2899K9446J5637m199J7317j2172
$$ 424445 440250 432095 404901 387550 389796 408813 421712 451158 466795 462596 479913 467741
13326D67741j7308j9450m4036k5954j3779l0901k9654L450K586j6033j1779k0609
$$ 467741 450433 430983 386947 360993 347214 316313 286659 290109 292695 276662 264883 244274
13314B44274k068J6757m540M341L7311L0891M7917K4394J4027P760j9566j3294
$$ 244274 242206 258963 254423 258764 296075 326966 374883 399277 413304 421064 401498 388204
13302C88204n283K059k5008m4456k3124J6110N164k6286j8314j938j4017j1790
$$ 388204 382921 384980 359972 315516 292392 308502 313666 287380 269066 267128 253111 241321
13290B41321j353j9008l9524k9636k769K729j6492k1389q622N249K254j8595r476
$$ 241321 239968 220960 181436 151800 149031 151760 135268 113879 105257 110506 112760 94165 84689
13277H4689J0793L4705k054L039R065p227n114j2889J3776L2472j0735j0795P907
$$ 84689 95482 130187 128133 131172 140237 133010 127896 115007 128783 161255 150520 139725 147632
13264A47632J3956K125J2690P854k6608j6784k2210j6333K4909L0656K622K0936
$$ 147632 161588 163713 176403 184257 157649 140865 118655 102322 127231 157887 160509 181445
13252A81445j4281l7498j932K9989K1403j3029j1276M173J4650N379j9333L237
$$ 181445 167164 129666 127734 157723 179126 166097 154821 158994 173644 179023 159690 162927
13240A62927J6439O194K4071m785l2863J0303j1876l3218J8466K4143j0655q953
$$ 162927 179366 185560 209631 204846 171983 182286 170410 137192 155658 179801 169146 160193
13228A60193J240J8649K4438N482l9936O119J3872k0833J582P54J3412J8818J1372
$$ 160193 161433 180082 204520 210002 170066 176185 190057 169224 170806 171560 184972 203790 215162
13215B15162m894j0262k505J3965l377P392j0549j2744j2471q33N553J9306J4639
$$ 215162 210268 200006 197501 211466 208089 215481 204932 192188 179717 178884 184437 203743 218382
13202B18382K206k5428Q72J1110k1681m820M0672K498j8374j0598j7886m828J0436
$$ 218382 220588 195160 196032 207142 185461 180641 221313 223811 205437 194839 176953 172125 182561
13189A82561O779K4529n365l926q165K832N847K1510k6753L1918K4822q976k2769
$$ 182561 189340 213869 208504 204578 196413 199245 205092 226602 199849 231767 256589 247613 224844
13176B24844j6852M640K0586M2973J0280K4034j767m2237J6479K3796n481L0672
$$ 224844 207992 212632 233218 276191 286471 310505 308738 266501 282980 306776 301295 331967
13164C31967J1513J953l198k2072m0778J1304J1738p59k0021K8356J9651k6724
$$ 331967 343480 345433 342235 320163 279385 290689 302427 301668 281647 310003 329654 302930
13152C02930q483r630K546j852j505K2872o595k3016j1342J4677M6516n828m4014
$$ 302930 294447 284817 287363 285511 284006 306878 300283 277267 265925 280602 327118 321290 277276
13139B77276j4548M387J9839n586Q329J6356Q221j5013J58K9708Q836J6224K2880
$$ 277276 262728 267115 286954 281368 289697 306053 314274 299261 299419 329127 337963 354187 377067
13126C77067p396l9108r536K1536K28Q534k13M804K4958M053l9472R326J5651
$$ 377067 369671 330563 321027 342563 342791 351325 351112 355916 380874 384927 345455 354781 370432
13113C70432N414r631M950M333j3922j1645Q105M3105j2879j1979l3017o151J4670
$$ 370432 375846 366215 371165 375498 361576 349931 358036 401141 388262 376283 343266 337115 351785
13100C51785j013J3888j0672J262K2537J162m643o848P467K4511j3488n401K6977
$$ 351785 350772 364660 353988 355250 377787 378949 374306 367458 374925 399436 385948 380547 407524
13087D07524m57L378O506K236n761k4597P616K2055J2449j494K285p116K731L0291
$$ 407524 407067 410445 416951 419187 413426 388829 396445 418500 430949 429455 431740 424624 427355 457646
13073D57646L8786P495J749J6622j977Q146j359k3056l3601k932j8363K3049L8141
$$ 457646 496432 503927 505676 522298 520321 528467 527108 504052 470451 467519 449156 472205 510346
13060E10346K5407KR838R05p516K14M9348L2420K0818K2086K8572j0374j962J7252
$$ 510346 535753 535755 545593 546498 538982 539196 588544 620964 641782 663868 692440 682066 680104 697356
13046F97356L3627K2116J7729K9979L2917J5162R344K9056O650j5258M5463N8182
$$ 697356 730983 753099 770828 800807 833724 848886 858230 887286 893936 878678 924141 982323
13034I82323Q83J2297J5146J2738L9079L7117J1450L6153N0546O4815M1251N2056
$$ 982323 983206 995503 1010649 1023387 1062466 1099583 1111033 1147186 1197732 1262547 1303798 1355854
13022A355854O1455R2369O9470P1685J16053P8267P6440J16498J56400J30638
$$ 1355854 1417309 1509678 1579148 1650833 1766886 1845153 1921593 2038091 2194491 2325129
13012B325129J43226J51244J81816J99269K38143K50542K27016K85008K93204
$$ 2325129 2468355 2619599 2801415 3000684 3238827 3489369 3716385 4001393 4294597
13003D294597L54276M65941N61736O77407Q36086J007111J280177J553459J893691
$$ 4294597 4648873 5114814 5676550 6353957 7190043 8197154 9477331 11030790 12924481
12994A2924481K344059K972743L753919M543282N120646N180889M732989L839513
$$ 12924481 15268540 18241283 21995202 26538484 31659130 36840019 41573008 45412521
12986D5412521K597204J011313o69051k130966l139487l796370m156100m109837
$$ 45412521 48009725 49021038 48351987 46221021 43081534 39285164 35129064 31019227
12978C1019227l672696l020805k254946j488272p77972j04458N06649J169108
$$ 31019227 27346531 24325726 22070780 20582508 19804536 19700078 20206727 21375835
12970B1375835J845163K577804L478756M387350N118759N425713N181292M459903
$$ 21375835 23220998 25798802 29277558 33664908 38783667 44209380 49390672 53850575
12962E3850575L378012J977164L09659j263193k357688k946304l031611k613167
$$ 53850575 57228587 59205751 59515410 58252217 55894529 52948225 49916614 47303447
12954D7303447j703375m68178P56116J696174K230114K308012J845471J057042
$$ 47303447 45600072 45131894 45888010 47584184 49814298 52122310 53967781 55024823
12946E5024823J93504p95685j793065k642443l309348l693704l910204l822245
$$ 55024823 55218327 54422642 52629577 49987134 46677786 42984082 39073878 35251633
12938C5251633l466120k806417j997608j203706m29026K87476J036537J823610
$$ 35251633 31785513 28979096 26981488 25777782 25348756 25636232 26672769 28496379
12930B8496379K609744L377661L936337M291165M452455M320054L937029L348726
$$ 28496379 31106123 34483784 38420121 42711286 47163741 51483795 55420824 58769550
12922E8769550K712811K094889J565087J146811R45035R26839R75712J050279
$$ 58769550 61482361 63577250 65142337 66289148 67234183 68161022 69136734 70187013
12914G0187013J066755Q23104K54191n82293j552066k569021l656243m555414
$$ 70187013 71253768 72076872 72331063 71748770 70196704 67627683 63971440 59416026
12906E9416026n043439n162102m931424m431429l740594k893105j943792r93460
$$ 59416026 54372587 49210485 44279061 39847632 36107038 33213933 31270141 30276681
12898C0276681m7297R33499J955655K969495L937484M648416M944339M909068
$$ 30276681 30229384 31162883 33118538 36088033 40025517 44673933 49618272 54527340
12890E4527340M651517M158715L351726K242884J021556k22479j457627k484018
$$ 54527340 59178857 63337572 66689298 68932182 69953738 69731259 68273632 65789614
12882F5789614k901902k631703j690232k97942J267189K626395L481219L759811
$$ 65789614 62887712 60256009 58565777 58267835 59535024 62161419 65642638 69402449
12874F9402449L425471K474728R13662j027957k948650m595946n906324o644367
$$ 69402449 72827920 75302648 76216310 75188353 72239703 67643757 61737433 55093066
12866E5093066o650475o039567n136458m079207l052330k103540j282040m21223
$$ 55093066 48442591 42403024 37266566 33187359 30135029 28031489 26749449 26328226
12858B6328226M44133J342324K322148L334506M299827N079634N447720N300091
$$ 26328226 26772359 28114683 30436831 33771337 38071164 43150798 48598518 53898609
12850E3898609M829503L861969K386364M06462j722190l697744n347364o495056
$$ 53898609 58728112 62590081 64976445 65382907 63660717 59962973 54615609 48120553
12842D8120553o898614o558673n692370m651590l721595k936228k360207j932915
$$ 48120553 41221939 34663266 28970896 24319306 20597711 17661483 15301276 13368361
12834A3368361j607645j296137j039371q60499p20891n76695m92471m39996m11041
$$ 13368361 11760716 10464579 9425208 8564709 7843818 7267123 6774652 6334656 5923615
12825E923615l90464l68134l86500l61380l42144l43343l32335k86944k12679
$$ 5923615 5533151 5165017 4778517 4417137 4074993 3731650 3399315 3112371 2899692
12816B899692j69153j40088j34435j35701j46534j03484p8355n3219q3514r7848
$$ 2899692 2730539 2590451 2456016 2320315 2173781 2070297 1991942 1938723 1855209 1757361
12806A757361n9599k9015l4689n2374m1361k3144K0302n956K210K7229K8162n429
$$ 1757361 1697762 1668747 1634058 1581684 1540323 1517179 1537481 1531525 1533735 1560964 1589126 1583697
12794A583697q162n5877q9417p0178l7442o5769l9186m450k4051l3668k046l2468
$$ 1583697 1575535 1519658 1430241 1360063 1322621 1256852 1217666 1213216 1189165 1155497 1153451 1120983
12782A120983l6586N720P571J6898L1945O6935O1015M9039L4294l726k0740k3822
$$ 1120983 1084397 1090117 1097688 1114586 1146531 1213466 1274481 1323520 1357814 1354088 1333348 1309526
12770A309526n6771o6761q9942p8688q3076n8704m4156m7972m0410K233p268k1799
$$ 1309526 1252755 1185994 1096052 1017364 934288 875584 831428 783456 743046 745279 738011 716212
12758G16212K430K0381M1525J4446K9583M0380K6576j5301l4839j6882r451l9797
$$ 716212 718642 739023 780548 794994 824577 864957 891533 876232 841393 824511 815060 775263
12746G75263m7951j9787j7003l3772m3261m863j0111j0328J1226n629L716k5192
$$ 775263 727312 707525 690522 656750 613489 608626 598515 588187 599413 593784 597500 572308
12734E72308l1984k8554J6614p669o658j4643j5127J6688P282M0588L8650K5513
$$ 572308 540324 511770 528384 520715 514057 499414 484287 500975 508257 548845 587495 613008
12722F13008J8774K5970J2150j2419o742j7739k3455l6491p1197o325M6j1903
$$ 613008 631782 657752 669902 657483 650741 633002 609547 573056 501859 495534 495580 483677
12710D83677r734N306M8381P967j134o685J3898J518K2133K9812J5930j2914k3702
$$ 483677 473943 479249 527630 535597 534463 527778 541676 543194 565327 595139 611069 598155 574453
12697E74453l2217k7269o417l7417m1073j2909l0176m1431j8946k3572J3678J6542
$$ 574453 542236 514967 508550 471133 430060 417151 386975 345544 326598 303026 316704 333246
12685C33246O695k8899k1142J020j735J1137K2772k998J30K151r218j0748p274
$$ 333246 339941 311042 289900 290920 289185 300322 323094 320096 320226 322377 313159 302411 295137
12672B95137l8249M051M8832J1937j8739m6280k025O399J7092K2888j466p058
$$ 295137 256888 260939 309771 321708 302969 256689 254664 261063 278155 301043 299577 292519
12660B92519J013L612m874J1860j5169m6629j5927L3442J4701R412J4410q984
$$ 292519 293532 297144 292270 304130 288961 242332 226405 259847 274548 283960 298370 289386
12648B89386l6403k0024l18K9401K3996k4508K38q056R589J0959L437K9143P145
$$ 289386 252983 232959 232641 262042 286038 261530 261768 253712 263301 274260 277697 306840 313985
12635C13985J6392K7280J3282N620l6958r846l17K843l940l1663j9844j731k1246
$$ 313985 330377 357657 370939 376559 339601 329755 329438 332281 328341 296678 276834 275103 253857
12622B53857j5678J2873J8994k7123l0302J5731L6487l745k7084O975J4352K0105
$$ 253857 238179 251052 270046 242923 212621 228352 264839 261094 234010 240985 255337 275442
12610B75442J7j5018j10j4591n54K0483J8036j787O87M163K5206p94j7220K8511
$$ 275442 275459 260441 260331 245740 245186 265669 283705 281918 282605 286768 311974 311180 293960 322471
12596C22471J4900k3922k2259k579j5613k3333l486L0084L5672K2645L698P937
$$ 322471 337371 313449 291190 288611 272998 249665 246179 276263 311935 334580 338278 346215
12584C46215m670M978R162m62r093q388J3900N590l0685j910L212n47l240j3928
$$ 346215 341545 346523 355685 355223 346130 337742 351642 357232 326547 324637 327849 327302 324062 310134
12570C10134j9356j5046J1478n210Q616J2720J9388J1049K3780K0195o727J5811
$$ 310134 290778 275732 287210 282000 290616 303336 322724 333773 357553 377748 371021 386832
12558C86832J0120N387L606M497j6167j7702r086l832l871P297P993p417j1523
$$ 386832 396952 402339 405945 410442 394275 376573 367487 363655 359784 367081 375074 367657 356134
12545C56134k5869j4728k0053J6343L8413J5270k2829j0375J3358Q548K8077K4814
$$ 356134 330265 315537 295484 311827 350240 365510 342681 332306 345664 354212 382289 407103
12533D07103n014J0161L0290M2877K9156J9088K8082L0553j9772K4905O1855K6373
$$ 407103 402089 412250 442540 485417 514573 533661 561743 592296 572524 597429 659284 685657
12521F85657k2187k8082j5159n276N758k5358j6047k0031Q403J5457p182M601
$$ 685657 663470 635388 620229 614953 620711 595353 579306 559275 567678 583135 575953 580554
12509E80554J6473j1103J4021N0220n223r38j545L4281L9954K0125M291J305L3412
$$ 580554 597027 585924 599945 650165 644942 644004 642459 676740 716694 736819 741110 742415 775827
12496G75827L0487O669l2132k7237J3411L467k1257j1361p412k975M2538K6032
$$ 775827 806314 812983 780851 753614 767025 770492 749235 737874 730462 727487 770025 796057
12484G96057K1916K0645J2044m860K063O186j6784J808J1917M619J4960n6418
$$ 796057 817973 838618 850662 845802 847865 854051 837267 839075 850992 855611 870571 814153
12472H14153j1302K3464J9839R930k1414j8225J2711O2758L8752M7114L4669K1955
$$ 814153 802851 826315 846154 856084 834670 816445 829156 891914 930666 977780 1012449 1034404
12460A034404M1470O6375N2534O6894L8585k77L3805L5259L9895K9736N2479L0160
$$ 1034404 1075874 1142249 1194783 1261677 1300262 1299985 1333790 1369049 1408944 1438680 1491159 1521319
12448A521319K5865J6627J8545L127L536L5385L3531L2053M4488J2553K6143M7949
$$ 1521319 1547184 1563811 1582356 1585483 1589019 1624404 1657935 1689988 1734476 1747029 1773172 1821121
12436A821121N7772P1332J12841J11539J31086J22919J10679J48627J86974K03475
$$ 1821121 1878893 1950225 2063066 2174605 2305691 2428610 2539289 2687916 2874890 3078365
12426C078365K12641K11700K39193K60069K86075L15273M08055M87218N98846
$$ 3078365 3291006 3502706 3741899 4001968 4288043 4603316 5011371 5498589 6097435
12417F097435O82233P58747R27141J123433J359062J675112K071152K536995L235389
$$ 6097435 6779668 7538415 8465556 9588989 10948051 12623163 14694315 17231310 20466699
12408B0466699M069389N187955O468623P784325Q695389Q687015P265092M239382
$$ 20466699 24536088 29724043 36192666 43976991 52672380 61359395 68624487 72863869
12400G2863869J3084m284657p228038q233420p776532o455333m868598l406797
$$ 72863869 72876953 68592296 61364258 53130838 45354306 38898973 34030375 30623578
12392C0623578k093353r67716O9262J159165K253180L437741M646896N843335
$$ 30623578 28530225 27562509 27631771 28790936 31044116 34481857 39128753 44972088
12384D4972088O941632P629402P472723O000851L175744n20674m111489o888484
$$ 44972088 51913720 59543122 67015845 73016696 76192440 75671766 71560277 64671793
12376F4671793q356881q522599p730972o442083n114099l889116k874651k071408
$$ 64671793 56314912 47792313 40061341 33619258 28505159 24616043 21741392 19669984
12368A9669984j395872q57990m41104j54597Q8721L00103N69043R32211J413510
$$ 19669984 18274112 17416122 16975018 16820421 16909142 17209245 17778288 18710499 20124009
12359B0124009K014271K760372L632769M740159N951853P201513Q277161Q687384
$$ 20124009 22138280 24898652 28531421 33271580 39223433 46424946 54702107 63389491
12351F3389491P881405N426850J756889k104122n123912o889930p391110o897462
$$ 63389491 71270896 76697746 78454635 76350513 71226601 64336671 56945561 50048099
12343E0048099n798882m425585k930702j511202j45978J244756K756692M453262
$$ 50048099 44249217 39823632 36892930 35381728 35235750 36480506 39237198 43690460
12335D3690460O384038Q429139J0518478J2354417J3423825J3141397J0959286
$$ 43690460 50074498 58503637 69022115 81376532 94800357 107941754 118901040
12328A18901040O562494N88148n448311r998759j2407698j3034586j2355546j0922913
$$ 118901040 125463534 126051682 120603371 110604612 98196914 85162328 72806782 61883869
12320F1883869r117761p234617n480575l905072k519416j285938j30759J067102
$$ 61883869 52766108 45531491 40050916 36145844 33626428 32340490 32209731 33276833
12312C3276833K326966L602002M724284N500901N602638M755746K853698O3953
$$ 33276833 35603799 39205801 43930085 49430986 55033624 59789370 62643068 62707021
12304F2707021k884570n139414o361436o630626o169180n327435m364071l458530
$$ 62707021 59822451 54683037 48321601 41690975 35521795 30194360 25830289 22371759
12296B2371759k669132k006626j440613j030644p22810m44321k34485p4620J19301
$$ 22371759 19702627 17696001 16255388 15224744 14501934 14057613 13823128 13748508 13867809
12287A3867809L43248O43583J102383J683832K394381L342893M453085N680678
$$ 13867809 14211057 14854640 15957023 17640855 20035236 23378129 27831214 33511892
12279C3511892O743371P271699O714379M916729K212855q35512l572648n412348
$$ 33511892 40255263 47526962 54241341 59158070 61370925 60535413 56962765 51550417
12271E1550417o049596n779596n103714m287387l404628k456570j553686o80771
$$ 51550417 45500821 39721225 34617511 30330124 26925496 24468926 22915240 22234469
12263B2234469K02792J132203K173757L387912M778749O212375P212674P107735
$$ 22234469 22437261 23569464 25743221 29131133 33909882 40122257 47334931 54442666
12255E4442666N303832K025559j722262m816298o626943p199546o776929n859703
$$ 54442666 59746498 61772057 60049795 55233497 48606554 41407008 34630079 28770376
12247B8770376m808620l855003l055059k393489j977317j593867j332592j095947
$$ 28770376 23961756 20106753 17051694 14658205 12680888 11087021 9754429 8658482
12239H658482q86117p38562o37941n80326m96518m35863l35996k78949k41858
$$ 8658482 7772365 7033803 6395862 5815536 5319018 4883155 4547159 4268210 4026352
12230D026352j92218k04450k21711k21946k05182j90124j74569j64188j98737
$$ 4026352 3834134 3629684 3407973 3186027 2980845 2790721 2616152 2451964 2253227
12221B253227j55050j01169q0225o8236q3094j12516p6550o4163m5282m4980n3238
$$ 2253227 2098177 1997008 1916783 1848547 1765453 1652937 1576387 1512224 1466942 1421962 1368724
12210A368724m6839n7965q4221j7836q802j362k8752m2065k3816m6167j8474J2135
$$ 1368724 1321885 1263920 1179699 1161863 1153061 1151699 1122947 1080882 1057066 1010899 992425 1004560
12198A004560l2109p355N998j2865l1359m9803o4608j4667k410k5410o073l0861
$$ 1004560 972451 965096 971094 958229 926870 877067 812459 797792 795382 769972 763899 733038
12186G33038k3326k936J3632l8759k4418r037j1387Q029o244N361J1012j303l4827
$$ 733038 709712 706776 720408 681649 657231 648194 636807 644836 638592 643953 654965 653662 618835
12173F18835l9826j1652j9826n313J4535J7685j7022q189k4808k8716j9296k2050
$$ 618835 579009 567357 547531 542218 556753 574438 557416 549227 524419 495703 476407 454357
12161D54357m731L5054l387j0424r314p773m868l409k869l5475P224J7864K4147
$$ 454357 449626 484680 481293 470869 461555 453782 448914 445505 442636 407161 414385 432249 456396
12148D56396k6702j3643J240M376O312l2632k4593r911l77J8632K8144m950O62
$$ 456396 429694 416051 417291 421667 427979 395347 370754 360843 360466 379098 407242 402292 402954
12135D02954l0806k3250K02k6640l5435j2225K8527q57l884J1161l054k7843l987
$$ 402954 372148 348898 349100 322460 287025 274800 303327 302470 298586 309747 306693 278850 274863
12122B74863L1552L792J222K579j0686j3217R669K2150J2352l2253k3171l5656
$$ 274863 306415 310207 311429 314008 303322 290105 299774 321924 334276 302023 278852 243196
12110B43196n196R792k598k776m851m026o164K3562J6936l387k7902K022j0459
$$ 243196 238000 247792 245194 242418 237567 233541 227377 250939 267875 264488 236586 238608 228149
12097B28149o064K4509k7309k8019j243L943K8810K5563j442l8390k5485N132
$$ 228149 222085 246594 219285 191266 190023 193966 222776 248339 246897 208507 183022 188154
12085A88154J0362J9489j7479J2597M684N038j1444j3031o731k2897J970J1198
$$ 188154 198516 218005 200526 213123 217807 222845 211401 198370 191639 168742 170712 181910
12073A81910J4888q847j4181Q148j6812J4315l672n871p800K454K9958Q729q8
$$ 181910 196798 187951 173770 181918 165106 179421 175749 169878 162078 164532 194490 203219 203131
12060B03131k0977k454j2946l4623q53R055P14J4219j2778j4825L2434J2222k0313
$$ 203131 182154 179700 166754 132131 131278 140333 141047 155266 142488 127663 160097 172319 152006
12047A52006j3370k3152k2281O6J8546Q112k738O021l921O621J9202l793M042
$$ 152006 138636 115484 93203 93269 111815 119927 117189 123210 119289 125910 145112 141319 145361
12034A45361Q822j8847j1027k3807K1366K7025k0282J536J5967j8740j3041L1465
$$ 145361 154183 135336 124309 100502 121868 148893 128611 130147 146114 127374 114333 145798
12022A45798j5677p372K18k1936m671K0288K3549j5038k6442R992J6337K1530
$$ 145798 130121 122749 122967 101031 96360 116648 140197 125159 98717 108709 125046 146576
12010A46576k3393k1028p121J2053J9215K459m45N351k2587j1178M027k629k4683
$$ 146576 123183 102155 95034 107087 126302 128761 128316 133667 111080 99902 103929 101300 76617
11997G6617J8533o255R568n707J015J4303m017P226L787j651K2605J5692J177
$$ 76617 95150 88895 98463 92756 93771 108074 104057 111283 115070 113419 136024 151716 152893
11984A52893L1037L3731k3469k0830k9330j4370j3768j8004j9964J0089k1164
$$ 152893 183930 217661 194192 173362 144032 129662 115894 97890 77926 88015 66851
11973F6851k16J5113N4741K0256J260j6794q375j9536Q776J889K3481K5425K5749
$$ 66851 66635 81748 136489 156745 158005 141211 132836 113300 122076 123965 147446 172871 198620
$$ [...]
##END NTUPLES=NMR SPECTRUM
##END=
