##TITLE=Analysis number 325957
Compound Code cc 52409
Book Reference 464/94/1
Project Code adrs
Chemist Name chrisr
##JCAMPDX= 6.0         $$ Bruker NMR JCAMP-DX V2.0
##DATA TYPE= NMR SPECTRUM
##DATA CLASS= NTUPLES
##ORIGIN= Bruker BioSpin GmbH
##OWNER= nmr
$$ XWIN-NMR		Version 3.5
$$ Mon Jan 22 09:51:53 2007 GMT Standard Time (UT+0h)  MAYBRIDGE\nmr@NMR_250MHZ
##.OBSERVE FREQUENCY= 250.131544655141
##.OBSERVE NUCLEUS= ^1H
##.ACQUISITION MODE= SIMULTANEOUS (DQD)
##.ACQUISITION SCHEME= undefined
##.AVERAGES= 16
##.DIGITISER RES= 18
##SPECTROMETER/DATA SYSTEM= dpx250
##.PULSE SEQUENCE= zg30
##.SOLVENT NAME= CDCl3
##.SHIFT REFERENCE= (INTERNAL, CDCl3, 0, 16.522)
##AUDIT TRAIL= $$ (NUMBER, WHEN, WHO, WHERE, WHAT)
$$ ##TITLE= Audit trail, XWIN-NMR		Version 3.5
$$ ##JCAMPDX= 5.01
$$ ##ORIGIN= Bruker BioSpin GmbH
$$ ##OWNER= nmr
$$ C:\u/data/dgb/nmr/ADRS/1530/pdata/1/auditp.txt
$$ ##AUDIT TRAIL=  $$ (NUMBER, WHEN, WHO, WHERE, WHAT)
(   1,<2007-01-22 09:51:29.10 +000>,<MAYBRIDGE\nmr>,<NMR_250MHZ>,
      <created by zg, POWCHK disabled, PULCHK disabled
       configuration hash MD5:
       49 4B E0 1D 92 C2 6B 37 9F E6 65 BC 52 41 86 1D
       data hash MD5: 64K
       B7 A6 3B C4 86 9F E7 39 2B 40 53 0C A1 02 B8 33>)
(   2,<2007-01-22 09:51:44.69 +000>,<MAYBRIDGE\nmr>,<NMR_250MHZ>,
      <Start of raw data processing
       ef LB = 0.3 FT_mod = 6 PKNL = 1 SI = 32K 
       data hash MD5: 32K
       81 2C 29 5E 60 CB 52 F7 56 54 6D 8A CF 45 AC E4>)
(   3,<2007-01-22 09:51:46.33 +000>,<MAYBRIDGE\nmr>,<NMR_250MHZ>,
      <apk 
       data hash MD5: 32K
       91 85 4E 99 85 63 19 01 FF DC 3C 65 EF 30 50 18>)
(   4,<2007-01-22 09:51:47.13 +000>,<MAYBRIDGE\nmr>,<NMR_250MHZ>,
      <abs ABSG = 5 
       data hash MD5: 32K
       62 FB F0 70 AD 16 EC 12 DF F3 03 CE 63 A0 F4 D2>)
$$ ##END=
$$ 
$$ hash MD5
$$ 15 A5 6B D6 23 3A C6 4B 62 A4 2D D6 4E E5 C9 5F
##$RELAX= 
##$RELAX= 
##$RELAX= 
##$RELAX= 
##$RELAX= 
##$RELAX= 
##$RELAX= 
$$ Bruker specific parameters
$$ --------------------------
##$DU= <C:\u>
##$EXPNO= 1530
##$NAME= <ADRS>
##$PROCNO= 1
##$TYPE= <nmr>
##$USER= <dgb>
##$AMP= (0..31)
100 100 100 100 100 100 100 100 100 100 100 100 100 100 100 100 100 100 
100 100 100 100 100 100 100 100 100 100 100 100 100 100 
##$AQSEQ= 0
##$AQ_mod= 3
##$AUNM= <au_zg>
##$AUTOPOS= <8 >
##$BF1= 250.13
##$BF2= 250.13
##$BF3= 250.13
##$BF4= 250.13
##$BF5= 500.13
##$BF6= 500.13
##$BF7= 500.13
##$BF8= 500.13
##$BYTORDA= 1
##$CFDGTYP= 0
##$CFRGTYP= 5
##$CHEMSTR= <none>
##$CNST= (0..31)
1 1 145 1 1 1 1 1 1 1 1 1 1 1 1 1 1 1 1 1 1 1 1 1 1 1 1 1 1 1 1 1 
##$CPDPRG= <>
##$CPDPRG1= <>
##$CPDPRG2= <>
##$CPDPRG3= <>
##$CPDPRG4= <mlev>
##$CPDPRG5= <mlev>
##$CPDPRG6= <mlev>
##$CPDPRG7= <mlev>
##$CPDPRG8= <mlev>
##$CPDPRGB= <>
##$CPDPRGT= <>
##$D= (0..31)
0 1 0 0 0 0 0 0 0 0.06 0 0 0 0 0 0 0.0002 0 0 0 0 0 0 0 0 0 0 0 0 0 0 
0 
##$DATE= 1169459487
##$DBL= (0..7)
120 120 120 120 120 120 120 120 
##$DBP= (0..7)
150 150 150 150 150 150 150 150 
##$DBP07= 0
##$DBPNAM0= <>
##$DBPNAM1= <>
$$ [...]
##$SUBNAM7= <"">
##$SUBNAM8= <"">
##$SUBNAM9= <"">
##$SW= 20.6930455092707
##$SWIBOX= (0..15)
0 0 3 0 0 0 0 0 0 0 0 0 0 0 0 0 
##$SW_h= 5175.983436853
##$TD= 65536
##$TD0= 1
##$TE= 294.16
##$TE2= 300
##$TE3= 300
##$TEG= 300
##$TL= (0..7)
0 120 120 120 120 120 120 120 
##$TP= (0..7)
150 150 150 150 150 150 150 150 
##$TP07= 0
##$TPNAME0= <>
##$TPNAME1= <>
##$TPNAME2= <>
##$TPNAME3= <>
##$TPNAME4= <>
##$TPNAME5= <>
##$TPNAME6= <>
##$TPNAME7= <>
##$TPOAL= (0..7)
0.5 0.5 0.5 0.5 0.5 0.5 0.5 0.5 
##$TPOFFS= (0..7)
0 0 0 0 0 0 0 0 
##$TUNHIN= 0
##$TUNHOUT= 0
##$TUNXOUT= 0
##$USERA1= <user>
##$USERA2= <user>
##$USERA3= <user>
##$USERA4= <user>
##$USERA5= <user>
##$V9= 5
##$VALIST= <valist>
##$VCLIST= <CCCCCCCCCCCCCCC>
##$VD= 0
##$VDLIST= <DDDDDDDDDDDDDDD>
##$VPLIST= <PPPPPPPPPPPPPPP>
##$VTLIST= <TTTTTTTTTTTTTTT>
##$WBST= 1024
##$WBSW= 4
##$XGAIN= (0..3)
0 0 0 0 
##$XL= 0
##$YL= 0
##$YMAX_a= 335482
##$YMIN_a= -399643
##$ZGOPTNS= <>
##$ZL1= 120
##$ZL2= 120
##$ZL3= 120
##$ZL4= 120
##$ABSF1= 16.522
##$ABSF2= -4.171173
##$ABSG= 5
##$ABSL= 3
##$ALPHA= 0
##$AQORDER= 0
##$ASSFAC= 0
##$ASSFACI= 0
##$ASSFACX= 0
##$ASSWID= 0
##$AUNMP= <proc_1d>
##$AZFE= 0.1
##$AZFW= 0.1
##$BCFW= 0
##$BC_mod= 0
##$BYTORDP= 0
##$COROFFS= 0
##$CY= 12.5
##$DATMOD= 1
##$DC= 0
##$DFILT= <>
##$DTYPP= 0
##$F1P= 14.0000005364418
##$F2P= -0.99999901652339
##$FCOR= 0.5
##$FTSIZE= 32768
##$FT_mod= 6
##$GAMMA= 0
##$GB= 0
##$INTBC= 1
##$INTSCL= 1
##$ISEN= 128
##$LB= 0.3
##$LEV0= 0
##$LPBIN= 0
##$MAXI= 10000
##$MC2= 0
##$MEAN= 0
##$ME_mod= 0
##$MI= 0
##$NCOEF= 0
##$NC_proc= -5
##$NLEV= 6
##$NOISF1= 0
##$NOISF2= 0
##$NSP= 0
##$NTH_PI= 0
##$NZP= 0
##$OFFSET= 16.522
##$PC= 1
##$PHC0= 228.321
##$PHC1= 8.018253
##$PH_mod= 1
##$PKNL= yes
##$PPARMOD= 0
##$PSCAL= 4
##$PSIGN= 0
##$REVERSE= no
##$SF= 250.13
##$SI= 32768
##$SIGF1= 0
##$SIGF2= 0
##$SINO= 400
##$SIOLD= 32768
##$SREGLST= <1H.CDCl3>
##$SSB= 0
##$STSI= 32768
##$STSR= 0
##$SW_p= 5175.98343685301
##$SYMM= 0
##$S_DEV= 0
##$TDeff= 65536
##$TDoff= 0
##$TI= <Analysis number 999999
Compound Code 99
Book Reference 9
Project Code 9>
##$TILT= no
##$TM1= 0
##$TM2= 0
##$TOPLEV= 0
##$USERP1= <user>
##$USERP2= <user>
##$USERP3= <user>
##$USERP4= <user>
##$USERP5= <user>
##$WDW= 1
##$XDIM= 32768
##$YMAX_p= 322391801
##$YMIN_p= -317382
$$ End of Bruker specific parameters
$$ ---------------------------------
##NTUPLES= NMR SPECTRUM
##VAR_NAME=  FREQUENCY,     SPECTRUM/REAL,   SPECTRUM/IMAG
##SYMBOL=    X,             R,               I
##VAR_TYPE=  INDEPENDENT,   DEPENDENT,       DEPENDENT
##VAR_FORM=  AFFN,          ASDF,            ASDF
##VAR_DIM=   32768,         32768,           32768
##UNITS=     HZ,            ARBITRARY UNITS, ARBITRARY UNITS
##FACTOR=    0.157963299565203, 1,           1
##FIRST=     4132.6476996994, 0,             0
##LAST=      -1043.33573715361, 0,           0
##MIN=       -1043.33573715361, -317382,     0
##MAX=       4132.6476996994, 322391801,     0
$$ Real data points
##PAGE= N=1
##DATA TABLE= (X++(R..R)), XYDATA
$$ [...]
27539 82134 45318 12054 85843 113316 64132 54123 24894 542 -16808 -30282 -91827 -68655
27527 -68655 -35259 -34106 12287 7639 -16140 7431 74927 25140 52160 82875 15805 -28162
27515 -28162 -52034 -78643 -40716 -1661 53748 -55438 -69665 -12513 41333 31042 95169
27504 95169 173570 164856 149110 82595 -34104 -76189 -84206 -68126 10317 7758 41533 39680
27492 39680 25317 4953 3875 14306 27438 34361 57730 40683 55975 35109 60792 38007
27480 38007 15076 42532 89176 109039 80251 56601 1048 -15642 -18603 12975 36288 87804
27468 87804 84244 28734 79196 97494 1277 -52940 54979 110121 93486 76664 161258 150880
27456 150880 103232 57726 16515 -20569 -78595 -71682 -74322 -76078 -148016 -119557 -39234 25461
27444 25461 47818 77517 46119 -74179 -136307 -165525 -72063 -47810 -23208 47152 69045
27433 69045 58806 2418 -16163 2486 -17541 -2544 -47191 -25014 99306 36948 -29509
27422 -29509 -60516 -78137 -58835 -51689 -37437 26158 27081 -63268 6130 60557 43460 -14203
27410 -14203 -1998 95935 77446 8790 18800 2889 -5679 73755 53349 78444 14865 -80717
27398 -80717 -80001 13633 70631 108205 122309 138299 77066 35620 11603 85067 105708 72470
27386 72470 42596 -8779 -55625 -67737 -18028 47620 -2184 -11084 458 -32302 -92653 -33696
27374 -33696 66142 81560 8166 -51194 -89352 -22548 22765 75638 95205 66351 24496 6959
27362 6959 -12993 -12235 -75273 -75666 -46048 -9024 -30901 -51409 -15272 69369 59612 103492 131748
27349 131748 34884 46535 80180 161503 190267 26656 -18495 11088 26936 10813 43358
27338 43358 60549 124062 103782 35428 55109 98415 62722 30845 45653 57429 76214 52547
27326 52547 87259 81281 66592 31395 31679 90699 91062 78411 23054 64369 102695 2679
27314 2679 -63777 -132324 -123073 -93167 -129476 -170497 -91629 -9746 30127 -4264 -30756 11685
27302 11685 18017 -1482 -23456 21700 -5816 42712 92042 60124 69420 23255 -36248 -40137
27290 -40137 -20346 -41667 -79941 -46058 -116449 -158408 -135154 -78329 -99540 -159205 -165817 -143301
27278 -143301 -113520 -37947 20267 49709 23413 -49706 -66804 -4546 56102 61821 62778 -16492
27266 -16492 -70363 6711 30225 33393 92865 98069 103513 159143 93658 17533 10355 6620 8013
27253 8013 11550 -37271 9261 25136 -1211 7308 4968 -33889 -35717 -105995 -72342 12508 78858
27240 78858 92304 40470 82877 57586 59471 43275 77650 15581 42545 25083 -45605 36733
27228 36733 151455 95819 59147 50492 112242 46407 58308 31738 1721 -54150 -64359 -3622
27216 -3622 72106 -1089 -61532 -35284 -42509 -34814 -52896 -88364 -59058 12074 8671 -43900
27204 -43900 7707 32051 -24363 54872 136183 163899 139253 74481 67943 13142 -36424 31348
27192 31348 98201 46046 86481 183608 268028 221932 150465 68017 109054 91899 65141 68226
27180 68226 90691 11908 -21644 20045 14490 9822 68391 65730 68564 70068 10054 31280 44422
27167 44422 19602 -31395 15789 68423 50507 58117 95359 137693 146765 195358 177922 99616
27155 99616 111250 101613 47961 74263 107075 32514 35851 -6463 18828 15757 -120183 -113285
27143 -113285 -12773 4037 27989 -34337 -62459 -31262 -51644 -16841 -105233 -119243 -154006
27132 -154006 -186229 -140040 -82391 -78344 -100581 -147654 -144161 -88322 -32187 -55468 -40027 -138482
27120 -138482 -166737 -76753 -8383 -4084 -24802 -108867 -115476 -7640 54919 65591 5333 -90116
27108 -90116 -26623 15050 -5640 -52579 -41246 -43286 45058 65105 41405 65807 31383 19858
27096 19858 45850 93010 103443 132078 156079 73852 20704 -37524 -9520 -63706 -107720 -117876
27084 -117876 -150483 -55682 -80681 -113618 -91412 -81921 -52163 -62194 -82937 -64702 -102732 -71165
27072 -71165 5671 50065 45772 48811 52503 27185 67931 9398 -6972 -3862 -68868 -9614
27060 -9614 -36347 -14664 84201 71436 -15843 -1728 31932 25652 67457 95490 48112 -28550
27048 -28550 -12385 -5837 -14750 -7674 8560 59708 20196 -19170 -21438 -127538 -191557 -116925
27036 -116925 -50591 -40088 16793 1643 -42586 -17792 524 -51634 -97626 -110385 -108653 -83392
27024 -83392 14674 22813 -10557 -36780 -72171 -57984 48665 69239 87735 66500 6476 -30689
27012 -30689 -65732 -106074 -63097 -55013 -126636 -137778 -51760 25572 -16227 28200 83306 79626
27000 79626 38575 -116175 -215295 -200433 -130228 -132104 -149097 -99750 -31025 25739 86684 82773
26988 82773 46069 56208 1445 18536 97043 93204 100063 146447 115840 48163 33499 9889
26976 9889 -25001 40756 40857 62308 100138 156645 147972 -5822 -96008 -24798 -29792 -44796
26964 -44796 8167 47231 61458 62681 38738 125128 34646 -46632 -71425 -81063 -120027 -117714
26952 -117714 -48561 11428 70882 80198 41064 140743 149544 83241 44271 75005 86429 16400
26940 16400 9938 125634 141010 80139 -14585 -64004 -62080 -45858 53868 69068 13921 30183
26928 30183 -1321 -22530 12619 65692 113941 111050 57805 27494 18637 -1232 -39758 -57320
26916 -57320 -46409 -20969 -59933 -83884 -80226 -18560 -4204 -19667 -41544 -11827 62828 20216
26904 20216 44710 45647 63574 80477 -9521 -60606 -67863 -120853 -126109 -93092 -50808 -7329
26892 -7329 -69823 -118166 -122631 -126590 -129667 -8090 144061 140450 111267 176573 131851 12278
26880 12278 30258 46875 32642 -1987 -5362 65328 64822 114276 95605 55445 -24143 -70009
26868 -70009 -82598 -70926 -106340 -74335 -35749 -48131 -32073 -58327 -66880 -111871 -64753 286
26856 286 21459 -22746 -11573 -11296 2473 59748 68278 28845 7709 51244 100645 73907 14975
26843 14975 -33114 -82259 -85767 -21193 49047 -19287 -85124 -86922 -47332 -66943 -11125 21013
26831 21013 -4480 -143 -21992 8469 -9741 -75487 -67030 -79639 -51205 9001 25288 4931
26819 4931 -10661 -41077 5962 -1403 -33849 58721 57673 40765 30545 -4939 27140 -14323
26807 -14323 -6786 -93346 -105626 -165222 -123174 -68072 -18878 -33753 -36616 19958 124998 179620
26795 179620 183794 158088 51189 68110 117892 83706 63924 -34742 -14165 13628 17737 20313
26783 20313 22345 51469 74524 56834 10825 -51022 -67749 -28745 -21654 17853 82066 88218
26771 88218 55970 -3707 6970 33981 45404 38166 -32625 -42130 -62841 -33774 -2054 54178
26759 54178 75999 -24024 -16665 16762 -89980 -87714 -54405 -53001 -8906 -92982 -96628 -64267
26747 -64267 -55819 -15665 1251 125281 179827 125306 63488 4137 65175 105468 45502 64819
26735 64819 77154 109737 54012 -23105 -9826 41506 121491 123923 139705 188281 194005 85288
26723 85288 118322 134120 34032 51168 22556 31899 47293 67242 32477 19493 -21185 -57878
26711 -57878 -9479 26514 14260 40895 40576 18749 -81998 -126603 -64786 -28623 -79409 -78953
26699 -78953 45689 15745 33441 27581 55790 56199 57657 100517 69687 64105 27595 20397 79
26686 79 -35067 -18462 19294 10735 38684 -84335 -119996 -79508 -83620 -42877 -25435 -64325
26674 -64325 -72239 -34763 14674 26468 15081 6849 1661 -82878 -76477 -1167 14632 -2778
26662 -2778 11183 33465 3183 19132 -16261 -93483 -145521 -216877 -232142 -167247 -38927 -39240
26650 -39240 -48364 3736 22005 24416 32125 46820 -1875 1751 -14371 -46546 -87857 -56417
26638 -56417 35059 125369 128461 41084 8203 -770 -14615 46039 33950 -34456 -53505 7403
26626 7403 74107 142458 92419 12019 -48206 -13512 10407 -7938 -69145 -16952 -31715 -43162
26614 -43162 -35027 42436 146517 103199 9291 -3130 9715 5269 20648 64573 -4240 -57302
26602 -57302 -70143 -33044 -101752 -186679 -156396 23202 107075 54027 -53415 -102366 -88624
26591 -88624 -125462 -32037 6918 38566 33653 14600 -13693 -6032 -1095 29497 49774 64213
26579 64213 48999 -14804 -76556 -60927 -2427 26820 -10226 -28860 -14771 -60094 -52382 -12799
26567 -12799 24554 82215 37484 -68348 -126121 -123032 -126330 -73495 -77543 -9660 17407 39183
26555 39183 20960 -4455 -10143 6017 -38919 -14459 70664 101086 49374 -33591 -36382 -3361
26543 -3361 -20962 27179 25647 57234 57309 -48279 -9658 -1639 -55526 -102168 -140946 -102949 -28872
26530 -28872 -33574 -69020 -105772 -34548 17720 61364 -1676 -58679 -34328 -15798 -7558 -8291
26518 -8291 -33453 -53080 -66422 -91632 -49713 -19050 -26989 -193247 -262553 -156802 -19633
26507 -19633 45510 57608 109228 75239 -8078 16056 -5019 -20724 -5410 -12119 -51139 -67901
26495 -67901 -30503 -59339 -85200 -51266 -38248 -64571 -43975 12887 67228 104417 -27178
26484 -27178 -72676 5958 113069 148781 84859 74247 38714 18785 59088 26275 52296
26473 52296 41723 27964 46402 65806 75342 106879 124551 76419 54210 64927 144624 174857
26461 174857 137056 63639 31543 36850 149206 181011 182851 104862 34649 10612 -11243 -12505
26449 -12505 28490 27423 13030 48700 51466 52155 37946 18232 -9475 -30350 -34365 9428 -66217
26436 -66217 -88309 -107944 -136805 -101245 -60920 -73971 -69919 30527 32690 -45094 -81683 -85105
26424 -85105 -4384 21757 -57360 -100428 -80957 -115592 -149393 -77986 -22622 -3616 -23732 -29383
26412 -29383 7160 3292 10364 14846 30745 32515 -117 -12457 70501 59418 -25249 -88055
26400 -88055 -46068 -27133 -61165 -52870 -34676 -55341 -18365 15266 57156 64833 89148 57541
26388 57541 20297 24702 23123 -12415 -68064 -56357 29821 100608 97722 76052 12935 -26232
26376 -26232 -15532 47772 10971 29296 55538 70832 97649 75230 55507 -21732 -49137 -59451
26364 -59451 -74098 15531 140243 181373 155224 93226 -10516 17546 47546 35047 28698
26353 28698 15980 14108 27439 -15148 -65073 -24755 90077 117739 71389 92479 47225 -15085
26341 -15085 -49983 -8138 -10574 -100951 -71537 -57350 -26813 -28035 19725 23944 18882 -55374
26329 -55374 -70363 -68733 -39327 -35582 -10926 48564 62667 54276 67275 5461 -5989 33094
26317 33094 42323 23856 10557 49681 46909 88999 57103 52004 -35180 -70058 -29587 -48723
26305 -48723 -11454 -40900 -49060 -62139 8580 45781 -22934 -64012 -51812 -77095 -70795 32681
26293 32681 67347 130671 158326 114056 56888 65714 34373 -19831 -45253 -49768 -83115 8829
26281 8829 42568 38727 12284 65616 63760 90337 108465 53053 66265 49090 90059 121936
26269 121936 8518 -24589 43529 93522 103594 75165 35582 56836 61334 -2813 38621
26258 38621 73115 20273 26716 -73847 -69410 78432 70645 -297 13710 44847 11359 33563
26246 33563 46573 -31830 -33193 -19182 -67376 -83700 -51021 -32095 -21793 -13702 30461 95187
26234 95187 69729 21152 829 17821 -40102 -10023 68887 14359 38893 52128 66552 -8415
26222 -8415 35315 25547 -3053 43757 72352 88029 115610 145741 118118 90467 13510 14488
26210 14488 -26200 -82562 -56124 49486 93953 164837 211251 205291 178198 103522 53477 24517
26198 24517 44317 -11691 -76897 -24532 69069 37123 13670 84618 52843 20380 -11034 -24059
26186 -24059 505 18050 -17338 -57119 -74154 -90133 -87608 -72708 -15222 -8747 -45489 -75432
26174 -75432 -91008 -101701 -91886 -75166 -20496 47439 51223 -4582 -60972 -74172 -91722 -71976
26162 -71976 -56982 16430 55813 88757 95737 39787 -19814 21592 -76955 -143362 -123483 -71138
26150 -71138 -77918 -43378 6895 670 -56309 -49406 -50822 -84155 -25466 4809 -21859 -25876 23579
26137 23579 -7605 13150 27215 13768 23331 -3579 -35130 11753 44424 65097 23946 27238
26125 27238 49037 88079 17468 -79672 -30620 47422 80035 119132 133813 132715 100939 -4254
26113 -4254 -61721 -67450 -10655 20349 19368 126856 142552 57657 -18748 26037 68519 76070
26101 76070 60281 71090 -21310 -104688 -23424 -26863 -36993 1233 35205 -63059 -61000 -10275
26089 -10275 43648 132755 135621 146750 124405 42964 399 6513 -23095 -68648 -40587 3160
26077 3160 -35971 -101732 -61340 -69357 -94473 -63445 -69165 -97839 -54099 -30775 -51172 -60848
26065 -60848 -28976 -29215 -36362 -93707 -112583 -68386 24079 -8340 -40296 18601 -29337 -43165
26053 -43165 -97295 -112678 -40058 -12945 -9341 7052 -37286 -60249 36200 17851 -109362 -93836
26041 -93836 -23656 -80452 -63992 -22389 4551 -34093 -30802 -39061 -73715 -26150 26318 -18195
26029 -18195 -28398 16195 997 -25878 -7373 11137 -22256 4496 43707 80275 84466 36214
26017 36214 86333 58477 -21834 -129973 -124552 -107487 -21186 10969 -16946 -59166 -323 6872
26005 6872 21267 -12786 -40859 -45921 58197 108773 29068 -7697 -27641 2757 -215 -14615
25993 -14615 -21620 -16618 37960 84919 45615 4627 -23962 17117 -28973 -17719 11112 76988
25981 76988 79489 90839 9660 1267 33035 67536 110472 107967 125212 85091 82194 69255
25969 69255 17977 -98932 -44918 3096 -49992 -91392 -74847 -1631 50297 -26322 -56383
25958 -56383 -57514 -72700 -24507 -91422 14999 94085 70548 45039 70321 72571 128532 246709
25946 246709 197018 87983 77891 72691 8494 -5165 3311 15447 43982 113695 130712 89883
25934 89883 -1304 -47042 11602 64410 96169 21326 -31346 -116660 -156154 -201874 -110512 -70624
25922 -70624 -33958 -43418 5132 59776 -17308 -14309 527 -60253 -51842 -77639 -141583 -141999 -61187
25909 -61187 382 -13811 34826 36519 74 -19414 -112107 -159121 -116479 -69164 -26430 -651
25897 -651 -15399 -49633 -1797 84412 101332 120668 149274 111712 56616 -67643 -79141 -37697
25885 -37697 12796 -3519 -50312 13491 21655 18246 30557 16784 -8763 26748 -7171 -45517
25873 -45517 -2272 67746 74450 70982 32862 49747 17853 71788 108664 72643 90065 91730
25861 91730 2921 -83088 -40476 17892 -1024 -102456 -145395 -66900 -17086 -76434 -122602
25850 -122602 -110173 -78390 -56707 -28924 57346 73256 -7723 8528 -15 -22875 910 12556
25838 12556 54128 60359 76373 78857 49256 -38139 -9956 42363 4370 -58019 -52919 -71910
25826 -71910 -21721 28444 30332 15534 -24718 41478 11439 18858 70468 5069 13498 -27112
25814 -27112 -65786 9615 121088 183230 166179 70446 62468 100900 110153 135694 107931 107719
25802 107719 58862 -34518 -19163 16881 21451 -29319 -65291 -25087 39474 53605 66188 37330
25790 37330 49384 64653 124473 55945 -22942 -70998 -95369 -83899 -84603 -37653 -37652 -81035 -61870
25777 -61870 -60675 -45902 -40231 -47313 20880 56674 512 26105 40415 38272 42180 97871 70904
25764 70904 27271 92229 95608 -3398 -40156 -23291 -25601 -93889 -76628 -1324 82848 88067
25752 88067 79488 31196 -16628 6777 -34398 -94232 -69830 -4679 -33888 2179 31854 -11630
25740 -11630 -73655 -51252 3811 39472 36631 17230 4083 -36944 -5450 37938 23201 8433
25728 8433 41979 21054 -65429 -23381 -1686 -24654 -590 -3337 18555 -9828 -90215 -66993
25716 -66993 -17812 15916 -57310 -55496 -13520 72759 96005 42655 -34925 -43245 65988 82093
25704 82093 96303 29418 21789 -22101 -65124 -35562 -42557 -53695 -38971 -55319 -28997 -42559
25692 -42559 -75700 -86561 -65682 -35426 -42626 30173 99980 112032 132590 52500 -13752 -23718
25680 -23718 -37621 -28180 -3012 36984 20157 -6986 35473 52682 33775 -42282 -118784 -134759
25668 -134759 -62291 -39090 -28100 6706 -14307 -91896 -97033 -30773 -33208 -44800 -11616 -4127
25656 -4127 -42308 9960 19415 29648 94994 70428 72244 91378 99468 77108 145778 168905
25644 168905 184379 82656 -18941 9400 6919 20413 107683 161898 149557 148771 158522 137242
25632 137242 63608 19325 -3555 -21748 -47643 19874 29891 -39494 7090 16728 -22990 -48410
25620 -48410 3620 -22713 -6276 43117 128147 37479 -8337 11297 -46305 -87684 -86328 -6767
25608 -6767 67348 41115 69010 25773 54313 16106 26173 -45875 -46426 -5209 39611 48326
25596 48326 60693 38490 29703 112697 68623 85535 151722 137037 131161 31649 19664 35546
25584 35546 66499 17728 -23847 24517 777 -23058 -16954 -28640 32941 52831 79465 39451
25572 39451 -24350 -48971 -50492 20122 80827 70587 99951 99070 118842 84898 81992 74836 39801
25559 39801 -45536 -26020 -3712 23115 132599 183440 143123 111329 29843 -70858 -105664
25548 -105664 -100096 -55858 -8876 36732 54109 5654 42125 15034 13778 71002 161925 224044
25536 224044 111948 90981 53101 37924 120673 132561 68598 51614 5758 58916 56559
25525 56559 -13429 -5820 -8047 -21167 23326 33254 50955 158038 173167 99558 65688 76547
25513 76547 7324 -47607 -83129 -20221 -60539 -84489 -64058 -17154 -25912 -17688 3079 16099
25501 16099 -3893 -8867 70302 80063 63626 142718 105429 40694 -39351 -42986 -118097 -126691
25489 -126691 -78549 -39210 41976 82271 69197 -5929 -40350 -17455 -27644 -42681 -58119
25478 -58119 -32506 -19146 11879 -29504 12722 109906 156489 75076 66627 45326 -42071 -26374
25466 -26374 16488 -66811 -54503 -1878 57422 74917 120572 77372 22620 -10181 -83887 -142460
25454 -142460 -169564 -218685 -109118 -11711 34108 78456 8161 -24815 -67101 -67887 -74980 -1634
25442 -1634 -21152 -77452 -74279 -59813 -91236 -116379 -91965 -131387 -118618 -18523 56212 34076
25430 34076 -59730 -108652 -55993 28308 84021 42599 55041 -6571 -61507 -54288 -16676 26189
25418 26189 1446 -44744 -89882 -87573 -51242 -35329 7022 5724 -44692 -65066 -84252 -87350
25406 -87350 -115567 -145483 -59262 7528 67186 58843 -445 -39773 -442 55820 97568 88374
25394 88374 57936 102393 115153 85293 115591 70903 54550 -4690 -3606 18793 27261 14514
25382 14514 -41320 -83722 -83350 -12222 66273 24186 -21991 -36906 56067 60950 -46016 -24606
25370 -24606 12405 6792 -34271 -23612 -60544 3205 45824 119395 122677 69962 37557 43805
25358 43805 92203 182158 200841 142873 69385 33098 -10772 -30352 8570 32995 12156 24390
25346 24390 103502 80565 -45849 -135883 -112140 -22410 -8594 22548 109193 158358 171419
25335 171419 184742 121857 -7468 -92339 -48184 40898 34686 6161 -1301 28395 8709 22814
25323 22814 78668 123470 87451 63704 64723 95542 103661 110584 39664 8296 -7810 -8107 11099
25310 11099 37316 51624 68628 -1260 31764 92357 61336 61883 101635 123773 -11816 -10494
25298 -10494 51527 52441 45470 67504 45514 -651 2676 -1577 -28659 -9726 54034 12365 10277
25285 10277 50503 -60093 -50458 4951 79231 117126 40032 -31743 12026 46320 42700 -24532
25273 -24532 -56530 -4432 21835 44385 37236 -50498 -60208 8904 9403 79092 80900 118888 37866
25260 37866 -53044 -25378 8993 52377 61565 9704 -90676 -140966 -143204 -66736 -12262 -76676
25248 -76676 -26200 17442 23584 -51994 -123652 -75175 -84008 -53199 11623 -29385 -33343 -39491
25236 -39491 76375 96531 49918 20134 20163 -75127 -50620 -25868 -40436 8952 46222 53166
25224 53166 90491 105305 111644 97242 22498 8119 48255 70165 -26691 -83654 -53276 -1620
25212 -1620 -23473 -29187 -5843 57373 51231 50584 90977 17264 -14718 2461 69334 61843 36621
25199 36621 84299 87865 65053 133957 109881 87617 82014 84795 47201 22827 94980 98509
25187 98509 53579 79021 91187 18160 37981 43343 116637 170839 165103 131899 142496 153315
25175 153315 156071 116517 97707 103879 124369 93415 85811 113563 98637 116145 124485 96927
25163 96927 50308 78229 105978 127227 181660 148753 42391 39790 -6266 -70975 -58233 -23320
25151 -23320 -12698 -54618 -27072 13093 -43671 -68702 -59048 -26437 -8952 -48308 -56432 -27061
25139 -27061 -7549 4073 22756 23427 52471 59997 49749 55893 15988 38783 -20614 -90284
25127 -90284 -81458 -38280 -76171 -82642 -53879 -40046 -50951 -58975 -39542 -81908 -93529 -82706
25115 -82706 -21127 -12921 15079 -1077 -103532 -70966 -7536 44859 5861 8793 -20445 17790
25103 17790 48291 -22502 -88159 -123355 -84633 -31620 -28739 -55210 -37564 -7809 31677 -34069
25091 -34069 3441 74744 93959 72357 -40428 -87231 -41217 -24127 2671 -6780 -26670 4597
25079 4597 -36231 -58842 -50311 -11230 25933 33543 12322 16668 -9931 29577 71128 -20632
25067 -20632 -27384 56268 43549 -34144 -90372 -54974 15961 60055 159676 125998 27701 28340
25055 28340 60264 53690 34683 33045 -36088 -118839 -81250 68775 130392 137130 97709 45821
25043 45821 8937 28181 14853 54030 76393 7676 -985 -31061 -17377 14252 60503 25024
25031 25024 -43564 -5167 -15300 -27444 -11024 -72577 -130495 -139423 -112540 -34832 22386 -12136
25019 -12136 -7695 -7554 48647 138197 193748 204024 153065 87162 -12786 -55100 -36975 17219
25007 17219 26263 36223 101525 106721 79007 70349 30118 -12004 -14513 8096 -20721 42180 42618
24994 42618 50485 76461 67990 -5414 -42385 7401 12320 -40907 -20589 -24526 8943 7204 13452
24981 13452 21427 -13176 -68738 -84597 -91858 -42786 -38305 -71248 -86146 -122329 -145433 -121202
24969 -121202 -69743 32358 70118 75575 37429 19514 57932 47930 52715 37855 -6739 -41050
24957 -41050 -27490 70031 89677 113028 9475 -18296 -27375 -70248 -100566 -82537 -69088 -20396
24945 -20396 6009 50159 105427 45769 1347 2653 -13082 9646 -9828 -56695 -22873 50868
24933 50868 38283 13279 25161 55759 97164 125281 141253 191117 96693 50119 49725 78186
24921 78186 76854 65669 98769 87007 12935 -23291 17236 1119 -20760 -100259 -125441 -77011
24909 -77011 -63827 34921 -14772 -20063 30294 67895 28242 -34323 44167 49742 10624 -24201
24897 -24201 21334 -8977 62898 98466 90623 12500 46867 117372 125085 74719 89041 62584
24885 62584 7622 -4240 27869 93818 49059 -33921 -83895 -61810 -15724 -22281 -48681 -43631
24873 -43631 -40551 -63113 -97027 13128 28612 -20303 24353 97243 121150 63734 10620 40273
24861 40273 73707 34191 52517 -917 -41891 -20385 -69491 -122247 -119675 -105117 -13744 56334
24849 56334 77549 115867 132938 161458 88431 -13683 -16573 23999 -40958 -12673 14806 56420
24837 56420 63028 88740 95905 53677 46139 80655 69170 32696 42198 59867 3853 60569
24825 60569 84246 98564 65111 89901 73550 53161 32398 47676 39191 12566 -45836 -80064
24813 -80064 -83961 -142561 -152021 -118767 -57152 -13896 -26103 4584 87655 87390 42690 -4633
24801 -4633 -51115 19584 30230 111862 56131 -14356 -40303 -114941 -73279 -15079 -79623 -34228
24789 -34228 -18311 -29539 -89548 -121508 -122201 -3383 51488 17915 -25751 -30324 34488 87142
24777 87142 96553 85561 116027 89896 76028 125593 79249 47868 48955 112366 45100 2960
24765 2960 -10693 -50614 -87235 -80245 -83033 7812 75430 141759 156835 178557 167425 141209
24753 141209 100140 -49679 -58694 -33764 -21745 17752 54143 68056 11681 -21200 -46424
24742 -46424 -54445 -77960 -128729 -77463 -1358 21034 -13678 -80231 -101967 -65878 -64470 -164469
24730 -164469 -178923 -106966 -145545 -99483 7673 16773 -37296 -82520 -51474 19004 -16933
24719 -16933 68327 128436 77097 676 -82060 -114023 -8767 90271 48473 -36951 -77243
24708 -77243 -60177 1483 13711 -34137 -97436 -105959 -106321 -88443 -49439 34391 154484 70003
24696 70003 12326 27810 -21242 -76931 -113177 -108363 -158994 -131520 -137383 -92346 -86976 2944
24684 2944 57286 33701 -57301 -12730 54004 70021 114074 124145 101449 35225 3740 29761
24672 29761 56484 51285 -12883 -80008 -123747 -110417 -117381 -104317 -89803 -54057 -43823 -37769
24660 -37769 19274 9150 -6816 22165 24583 -32088 -120838 -123207 -95428 -80538 -79097 -4089
24648 -4089 76685 75021 -48909 -88825 -92142 -60052 -18190 -70253 -24347 -6615 -13268 -51692
24636 -51692 -40256 -20675 -28186 954 18978 63005 62952 13741 -10206 -10810 56115 41526 -41292
24623 -41292 -36666 -16690 13531 52353 14607 -97935 -113183 -38143 -43058 17390 -15343 13756
24611 13756 -8788 -76087 -77188 -95790 -13342 48709 30350 2744 16479 -3853 6667 5106
24599 5106 -20379 20570 91544 66118 12973 55510 126202 109678 94123 157073 263154 273279
24587 273279 219643 170723 86597 -42281 -58295 -42526 -95708 -104585 264 15143 15534 -40565
24575 -40565 -46810 23172 -11154 -109153 -88171 -58560 -17716 -23253 -44318 -51 26221 19901
24563 19901 22756 23127 32013 45909 -68301 -112086 -71448 -102259 -61966 -30933 -38254 -38238 -54553
24550 -54553 -46815 -11740 -81225 -56282 39685 56433 -824 8996 58742 85812 70086 63067
24538 63067 -31629 -60584 -54738 43726 110546 76882 58634 123242 120738 96348 66388 69349
24526 69349 82210 51474 36842 56295 72278 27102 59769 53758 23158 -5821 -9186 -51279
24514 -51279 -28507 86150 82328 17908 3701 8485 -86605 -81454 -44796 4581 -66266 -136881
24502 -136881 -147138 -79893 -66922 10768 37710 -4284 -25463 7428 72844 140283 201456
24491 201456 190518 180192 191675 166150 127021 137935 94541 -10338 -58055 1190 14136
24480 14136 -24984 37286 70437 38260 -3608 21379 65322 55740 12900 30156 -44083 -119191
24468 -119191 -63703 -2296 -10004 -24167 9449 97 -45063 -21090 91145 87872 49284 -3212
24456 -3212 -39026 -54531 -85667 -85804 -29288 24022 -29381 -44767 -51684 -38136 -14135 18567
24444 18567 61076 36596 -46549 -74757 -43571 -18395 37337 55120 67743 104643 105870 42184
24432 42184 -48245 41420 145737 145282 64025 70550 108989 43880 4426 21429 37373 49595
24420 49595 30046 -12699 -29110 -38644 -48988 -71406 21867 56951 108182 78654 -2699 9153
24408 9153 -21701 -75516 -60769 -40754 -100 -4690 33930 54071 -21647 -94199 -27129 1778
24396 1778 -4155 38100 3894 3356 8892 34664 40161 86529 129150 71336 105799 143102 124029
24383 124029 63896 53912 40998 36536 52209 30135 -16682 -31805 -12468 -3628 2082 -26721
24371 -26721 -23379 64188 109048 87760 -5529 -14131 -113080 -118115 -10476 32120 3062 11307
24359 11307 3351 -22163 -23029 -9719 -91658 -159582 -89563 -29885 -15376 -1461 -3831 17756
24347 17756 28676 -57883 -39246 44500 37730 102666 98734 141127 90109 116992 98883 51058
24335 51058 55343 23782 -32456 3969 50414 120687 66396 42935 19122 46645 40503 -15489
24323 -15489 50657 -451 37418 58728 56138 86401 106979 112401 123532 103736 81640 78662
24311 78662 29348 982 -9710 10322 -5303 -15810 -27125 -72849 -50607 -47144 -153579 -160173
24299 -160173 -98492 -62550 -106838 -101292 -57011 -56846 -18897 -6488 -27597 31399 -35842 -100742
24287 -100742 -62313 -2752 -46907 -108606 -118383 -23482 -55473 -54236 12205 97870 78598 -12122
24275 -12122 -27725 -19791 75324 80040 41534 11581 -77336 -81687 -12231 -8276 1701 65861 108336
24262 108336 136483 83833 4393 11614 57782 91620 84541 27096 -3844 -84500 -72801 -45519
24250 -45519 -18391 -66688 -121810 -82488 -88830 -108622 -58514 -78380 -125735 -110636 -129598 -89677
24238 -89677 -100078 -108799 -67881 -60440 9398 43664 80155 62770 67739 52204 43035 -26654
24226 -26654 -7847 18488 -80921 -118415 -92833 -88293 -79044 -95617 -99431 -134858 -71215 -12599
24214 -12599 -27382 -93805 -74709 12203 -18077 -56669 -86975 -121647 -116434 -46374 24636 30915
24202 30915 -1191 -13113 -40735 -25708 40785 58584 31680 28485 2560 -31253 -85657 -105510
24190 -105510 -65006 -56862 28585 69586 43634 36194 -27394 -55411 -44498 -12133 16832 3658
24178 3658 -28493 -56452 -40977 26469 77336 76888 51436 115108 140024 136606 214844 149360
24166 149360 46806 -5827 27637 -32976 -61228 -66152 -91689 -117890 -77363 -82991 -109401 -147992
24154 -147992 -130213 -97494 -60198 -24145 29862 -25387 -93146 -128637 -83920 -11661 51927
24143 51927 31009 12032 28417 40383 52857 42194 -41363 -100801 -74869 -72637 -55469 -24474
24131 -24474 -7495 -24131 20301 -30532 -46810 -33705 8206 -13693 -46767 -5750 -64279 -35441
24119 -35441 -8386 -48987 5840 38476 18722 64396 144110 111052 106812 150741 123459 14298
24107 14298 -49186 -1421 8514 56152 38173 -19525 -14687 85198 148049 104386 46629 26341
24095 26341 50994 -17910 -111551 -67815 479 116023 113937 104347 115282 96593 75839 49450
24083 49450 8938 -18968 41702 65261 -1968 -9905 30053 109126 104951 43416 -13876 -57585
24071 -57585 -49995 36731 78650 35118 -2281 24136 78170 87882 28765 -20361 -52885 -56120
24059 -56120 -8333 36487 85897 32930 -22438 -2111 -49531 -70497 -43801 -36483 -16559 -27875
24047 -27875 -34720 -47931 21510 65982 83317 63998 11119 -51345 -83460 -87837 -101963 -25368
24035 -25368 -42557 -52698 -72901 -32309 -51719 -96437 -68933 -42980 -16879 36162 -22552 -8650
24023 -8650 37485 -2961 55537 70536 47121 17808 78191 11710 -42801 -28499 -22746 -15282
24011 -15282 -71040 -53472 -35389 16568 -43844 6438 89316 63982 46809 57595 71899 107886
23999 107886 133011 118885 146987 226881 200028 103825 58690 15316 30982 63617 44327
23988 44327 10062 53302 123069 163805 57634 -65316 -95698 -35075 -98171 -59775 8077
23977 8077 -66864 -60402 22131 49676 109147 104953 47713 42644 58559 46114 17999 -23191
23965 -23191 -83411 -117396 -161459 -86071 20216 58253 67890 35165 13256 -10543 -4293 -17423
23953 -17423 55988 -16036 -64866 -68910 -139717 -155048 -139930 -92631 -125372 -176256 -149420 -67515
23941 -67515 -69616 -44050 -22893 -16124 -50144 -51458 -65297 -126406 -112808 -97991 -82726 -13521
23929 -13521 48797 72091 13791 -36295 -3120 121188 61137 66928 133175 106113 69881 79333
23917 79333 59381 7199 -12473 -115743 -125277 -28103 3841 70129 121750 84964 38319 15558
23905 15558 22477 18856 -14060 -13396 12907 -26990 -72924 -27355 7853 16754 -41215 27446 46361
23892 46361 46252 -3690 -33018 166 -22721 -66443 -123181 -110757 -94031 10175 51558 7825
23880 7825 -32520 -69895 -110780 -60236 -12399 -26164 -50559 -32994 -31864 -17570 42790 109823
23868 109823 135453 125552 117474 68880 25149 43211 50049 -17620 -14747 64311 97908 89151
23856 89151 61991 37567 6149 15016 -18647 20613 63950 6206 -52458 -78360 -59310 -10739
23844 -10739 17105 21227 27128 -838 17560 3272 5970 34740 10800 -31950 -30273 -15415
23832 -15415 -27868 -32603 -42464 -96776 -71804 -44108 -50627 -84313 -124181 -65034 -84796 -73593
23820 -73593 18415 -15909 -117665 -106019 -79081 -21971 -79204 -108197 -36269 2423 -4657 -26269
23808 -26269 -23116 -39849 24879 32091 48185 79522 25656 9418 -25903 -72247 1949 86558
23796 86558 80987 59421 64574 39102 26838 -22429 11013 16707 38915 -40377 -46025 -31880
23784 -31880 -82564 -64132 -79873 -103184 -88770 -76045 -76800 -91363 -152207 -103325 61072 80186
23772 80186 -21630 21021 18532 -29834 -42662 -78381 -51043 -32233 3468 26105 -38932 -40228
23760 -40228 -72270 -116991 -41630 -58368 -17699 -30298 -45166 -64245 -124662 -135530 -165467 -184451
23748 -184451 -105578 -19707 46353 107513 165436 107349 33971 -34612 -68976 41249 102027
23737 102027 11001 -22706 23024 -358 26446 54455 39815 108050 115013 42154 64234 61816
23725 61816 6331 6361 42434 65239 35083 28970 -11815 -42954 -46968 25295 70901 36792 38736
23712 38736 32854 32118 -106260 -116701 -35504 -54203 -142872 -155525 -90615 -48732 -36213 -34534
23700 -34534 -48609 -107786 -157361 -109786 -43323 -86760 -112207 -118137 -67546 -80374 -82857 -72929
23688 -72929 -78055 -102347 -71391 -53822 -52056 -50402 -36303 -100287 -127697 -25087 9247 69855
23676 69855 157783 127468 93126 24554 -44360 -38306 75528 71230 30254 15442 39430 1711
23664 1711 -12713 35625 99664 86596 -23109 -110695 -90879 -108651 -89561 5765 25641 90116
23652 90116 66017 -4916 22158 97640 76465 55416 76609 78855 44393 -53336 -57315 41323
23640 41323 39241 -20534 -27711 -2652 49987 106844 144913 192927 103189 76233 82329 75172
23628 75172 53736 -75490 -113289 20717 112694 135139 49617 -31374 -76092 -26676 -40612
23617 -40612 -71392 -36305 -59378 -30188 35820 154012 142248 55443 36091 51062 61159
23606 61159 21493 -92434 -90253 -99359 -102763 -23495 -12674 -46288 -64586 -96738 -41310 4572
23594 4572 71348 74352 13686 -23707 -16981 -67419 -7440 41352 35240 -438 -31388 -134732
23582 -134732 -86385 -90234 -86715 -43728 -6019 -9524 -41093 6341 -41382 -52374 -128692 -226940
23570 -226940 -157394 -105983 -8815 62620 113165 54542 24904 34522 17350 86927 129145 145871
23558 145871 164762 97235 68760 40658 11019 17590 -11359 45810 82453 28261 72797 102561
23546 102561 98593 91796 26847 3055 43367 53119 27887 -3145 -7391 -51190 -3397 15485
23534 15485 17954 -7220 -59526 -72875 -21015 -35076 -17480 41701 74232 38629 -15471 12914
23522 12914 18668 67193 47241 9503 36164 36534 -35051 -11927 19849 -39840 9825 65852
23510 65852 52715 100392 146286 127775 58097 -85515 -85118 -27374 -35679 -17889 -1447 -27516
23498 -27516 -91689 -76157 -58051 -37127 -39661 -43874 -20898 -37443 -32248 -16248 3130 2581 -10975
23485 -10975 -25978 -39994 -97213 -157735 -153346 -46434 -60563 -42968 -45175 -56548 28740 32397
23473 32397 -37988 -77832 -18472 -17200 -22033 -16995 19080 -25415 12011 16828 -61738 -24262
23461 -24262 29586 9255 3653 -49636 2626 11753 54919 89202 124859 106983 82832 -27826
23449 -27826 -22026 43552 64609 50446 -2084 19595 51033 38059 -33021 -75298 92 89928
23437 89928 191416 135133 91835 105658 40775 -25778 38014 23990 6268 -93705 -146486
23426 -146486 -148745 -77374 -1345 -64976 -36695 -40436 -41528 -21794 -18724 18068 60234 151814
23414 151814 173750 142353 169721 146724 87303 -31798 -91922 -99410 -135866 -151302 -92991
23403 -92991 -13744 31118 46202 4939 -10318 -63016 -64112 -55262 -15224 72141 43161 16449
23391 16449 -3469 -7275 -26187 35570 55543 49606 34947 33762 46509 -710 44850 114184
23379 114184 105283 34365 -19132 40534 79219 92541 63122 32623 17937 47099 40892 19963
23367 19963 -4910 -7604 -6491 -44420 -30360 -32255 -95413 -78673 -77307 -76655 -56688 -45550 -45195
23354 -45195 -56136 -118049 -73134 -95212 -155013 -143102 -47163 -49838 -50761 -39794 -83509 -74087
23342 -74087 -41864 -63412 -99919 -72221 -97612 -93062 -50391 53115 92718 102859 85742 67619
23330 67619 35435 29885 17171 15135 -76585 -88963 -44973 20463 35884 -18944 -33238 17685
23318 17685 -7567 -20119 -110482 -117645 -141850 -137869 -94076 -110912 -95379 -119704 -120349 -24438
23306 -24438 42811 58207 47053 98238 28455 -64685 -59462 -52828 -23045 -40198 -6491 28827
23294 28827 74025 54631 16096 27659 104708 117812 47342 89515 110662 26469 -45752 -49084
23282 -49084 -27023 38137 35055 52743 105900 149638 73775 97141 38459 -23259 -49891 -48094
23270 -48094 -59445 -9329 12836 -68084 -109576 -63749 -39779 -53391 -70354 -24950 -21421 -135966
23258 -135966 -186106 -126250 499 10350 -5244 -4456 -25824 -10595 -39501 -48890 -36936 212
23246 212 17722 -28746 -37451 32595 58982 32871 -11653 49659 72099 53332 84730 -15338
23234 -15338 -78573 -84575 20558 54974 -46111 -116313 -127537 -176149 -76650 -20387 -44383
23223 -44383 36068 92199 32004 -12931 -70876 -123163 -76366 -46741 -24378 -82911 -96955 -97111
23211 -97111 -132320 -130216 -129523 -30451 -22934 -15367 26620 13431 6689 66855 77006 24207 4983
23198 4983 17407 43721 -6556 -57427 -115774 -101143 -81749 -36139 17780 99278 135189 126267
23186 126267 52559 -513 3835 51460 19345 -13291 79674 73030 45769 47573 18457 -39671
23174 -39671 -99115 -88424 26933 59275 75780 55474 89690 54888 -46290 -114634 -80054
23163 -80054 -52173 -78261 -68281 -12444 47413 24366 13562 -63335 -50667 -3582 49614 46912
23151 46912 69232 88536 -20624 -66362 -30078 -29449 -44962 -20846 33140 2177 24126 35583
23139 35583 7461 -48242 -58497 -129769 -151987 -163451 -178345 -131465 -81231 -58312 -56103 -15489
23127 -15489 36994 3824 -49057 -76562 -43502 -69810 -58153 3757 4542 -92788 -45283 -16927
23115 -16927 36792 -23996 -41195 74443 73661 99413 44267 -20774 -9677 28171 18706 -32569
23103 -32569 -113712 -62449 -41764 -48844 -78785 -116553 -108188 -33931 -4628 -23682 -40385 6225
23091 6225 -45473 -30320 497 12247 -12126 20462 55546 16970 -7180 -72313 -24738 -47703
23079 -47703 -24044 1485 16521 38524 65654 14433 -35276 -65542 -75437 -76018 -78862 -112243
23067 -112243 -22982 -8994 -49081 -13619 13273 -29510 -83012 -105593 -162265 -115275 -70081
23056 -70081 -65403 -86262 -122421 -94488 -70131 -35954 -43572 -76944 -103258 -9239 107905 120512
23044 120512 72367 36434 34285 -9676 -5516 -47387 30229 83013 37136 -9002 -56109 -109792
23032 -109792 -126194 -127446 -103974 -61753 -84913 -141560 -38872 3638 22068 75996 85055 63496
23020 63496 56928 43045 58402 99598 53947 -5314 31289 30395 -5126 11130 -22228 34821
23008 34821 22266 57416 75494 23777 -5922 -69198 -51565 34425 80717 68150 78011 46257
22996 46257 23860 28512 87702 76255 59202 -35019 -43034 -16232 16910 58254 62642 40190
22984 40190 -44170 -84613 -76966 -69660 -16774 11610 -95943 -120511 -74651 8026 -2309 -29006
22972 -29006 10783 7999 12027 70155 57400 10434 -6683 -16795 -109166 -108465 -68507 -42578
22960 -42578 -65317 -100311 -43836 -79 36907 57499 -1042 4690 57582 97673 24647 -7093
22948 -7093 -36422 -22171 37417 53371 59335 -18430 -30085 34607 56672 32429 4742 -6045
22936 -6045 16043 -912 -34710 -63594 -32901 -12856 10641 -10738 -59312 -23043 23175 14248
22924 14248 -48087 -87534 -10347 -31173 -42874 -34479 -1852 7260 48638 33656 21369 19546
22912 19546 869 -14085 28508 137419 96892 53242 81983 93568 51299 73047 144162
22901 144162 117192 109342 48312 16233 -1405 -1711 34321 -18041 -81784 -58635 1307 54127
22889 54127 20904 20456 -11914 -9155 -4551 -90079 -140805 -65842 -21852 -68371 -90378 -54389
22877 -54389 -42198 -91683 -57119 11495 16007 -1436 -4915 -33376 2358 15288 38822 53829
22865 53829 11225 -48502 -67561 -128743 -173597 -143638 -128460 -127987 -136265 -156984 -115369 -80413
22853 -80413 -135695 -58434 -40343 -26424 -28462 -29324 -13672 27810 91418 53900 88126 103793
22841 103793 75113 74898 174682 163307 53750 17601 30752 65187 39301 -25248 51225 119643
22829 119643 102405 102934 33296 -22387 -17496 -58745 -103793 -45504 9500 -11688 -132453 -163917
22817 -163917 -44714 -707 -14801 2096 51522 62570 53493 130534 87957 45256 76577
22806 76577 67240 54686 -59412 -81365 -61548 -46826 -70594 -42248 12279 19515 26853 31008
22794 31008 72842 160510 127053 47243 -3456 -21417 -23525 55756 135692 131726 83734 123757
22782 123757 139871 105658 53819 28873 -15017 35899 97924 76551 83627 63354 7617 -38269
22770 -38269 -55770 -46556 -43590 -27005 37686 5332 -14378 -15637 -14334 -8523 25014 46689 32817
22757 32817 6245 -23455 -52076 -63943 -83710 -153122 -145137 -94032 -137946 -94633 -25050 -78407
22745 -78407 -62952 -36787 -46619 -128292 -137024 -62379 -66076 -21796 12927 9591 -44724 -125658
22733 -125658 -112947 -66912 -86142 -132631 -87257 -54417 -55722 -167395 -139821 -72182 -31640
22722 -31640 53418 44298 19017 42595 122565 208017 186154 103673 118313 82357 19845 -2499
22710 -2499 2650 17220 -8399 -54367 530 -7629 -35702 95 60934 -10399 -170662 -153173
22698 -153173 -159390 -125547 -44986 16269 104103 156726 159631 92339 94766 187545 101179 11674
22686 11674 -24480 -7024 39148 -20528 -32071 -52089 -7457 21207 14535 83988 107014 87337
22674 87337 124702 171139 188679 142494 74955 28882 113335 166047 74783 42727 -4682 -5118
22662 -5118 -55166 -79929 -6973 92923 86710 -27026 -76364 -108948 -48729 -62119 -49716 -74243
22650 -74243 -91972 -71580 -78167 -99507 -86975 -60935 -95391 -53978 -3063 -4718 4695 1316
22638 1316 -6909 -34296 -5557 1096 593 -22260 24915 36886 39830 -81482 -204557 -209448 -163675
22625 -163675 -124392 -132959 -172031 -162485 -77036 -45259 -8464 -7285 13231 33095 75696 47715
22613 47715 4856 43915 23767 -28191 -78941 -126710 -98704 -50124 2189 -28813 33313 47563
22601 47563 48942 14425 -9223 -32557 -30002 -15639 -45328 15253 80812 69627 30068 59310
22589 59310 109428 135225 57893 -4318 -66946 -88929 -108626 -122650 -90895 -73058 -91812 -87313
22577 -87313 -67085 -64551 -63425 -35530 -18707 7553 97674 161668 188391 142308 136199 138774
22565 138774 169276 146980 167772 119365 1876 -2984 3639 7895 56173 44131 11813 -98370
22553 -98370 -68050 -41693 -79992 -116168 -92239 -96339 -66457 -4946 58018 29996 -50708 -109522
22541 -109522 -115740 -57612 -36038 -38580 -43955 -60312 -24971 -34491 -50420 -43599 -7532 18924
22529 18924 29384 17168 -25035 -31463 -34143 36276 10467 22312 22252 -18393 -29954 -106772 -81433
22516 -81433 -71065 -89507 -72292 -58302 -25109 -18382 22396 -32152 -31021 19150 48950 5226
22504 5226 -29036 -59339 -53449 -115088 -130299 -152856 -132899 -63372 12772 91630 22947 -75017
22492 -75017 1135 10698 48360 66825 29235 2689 69924 83029 45855 11643 -17130 -37337
22480 -37337 -73224 -55224 -44985 32137 79135 60868 90712 67764 87977 139745 140736 85686
22468 85686 52719 22458 16094 56509 49252 65392 -9389 16358 -19406 -259 -29795 -180680
22456 -180680 -186179 -189534 -75231 -16309 -35677 -61167 -59627 -18923 -33500 -55551 -1061 -7502
22444 -7502 -70685 -82031 -23091 -58684 -39374 -4280 19651 4450 -66240 -54294 -23628 45430
22432 45430 66036 1612 -38569 -16103 4065 81532 115882 110784 123733 98325 78282 73686
22420 73686 68192 84361 -10522 -94950 -140895 -107817 -101921 -55705 -58940 -89966 -105391 -67526
22408 -67526 -42042 18522 -8580 -23689 52057 90681 61896 91517 139652 139084 121387 28634
22396 28634 -31190 13099 95138 10758 -54836 32731 11765 13931 58272 22490 20118 -62314
22384 -62314 -92874 -59694 15460 72379 63043 36438 -199 23912 34474 60294 49941 73116
22372 73116 81338 57175 3031 -51396 -137724 -139033 -151881 -150900 -136478 -160333 -138022 -90288
22360 -90288 -54812 17530 60058 -59034 -115784 -136593 -131433 -118871 -42546 14336 44382 -5881
22348 -5881 -36723 6813 25846 38438 67016 126568 60093 36531 70897 105476 3145 -24183
22336 -24183 -8095 -69602 -22630 71108 96066 60896 94839 70225 29843 -59202 -53554 -23332
22324 -23332 -34939 -45493 31809 38455 31947 -33777 -118979 -115294 -44339 -9442 22578 -11494
22312 -11494 -32490 2732 -42702 -30976 41268 108227 72278 74242 105026 135295 148444 96412
22300 96412 64431 90579 95016 41622 24152 104255 96993 116389 107398 18702 36917 56844
22288 56844 52366 37479 -2336 56644 108225 117211 93934 71679 -35192 -52771 -77562 -23155
22276 -23155 -22496 25040 39592 8654 -11319 -92892 -112707 -59588 -4426 -20320 -49333 -103660
22264 -103660 -68984 -23499 31681 77783 91337 73886 22699 12977 42130 90921 107753 76278
22252 76278 95000 93617 135732 87251 62534 56068 29979 25316 -24537 -32860 -29701 5026 25302
22239 25302 -21666 -77421 -54588 -42265 -55493 -27071 -33294 28684 -31299 -100725 -123995 -59702
22227 -59702 972 8669 51858 102399 78040 72762 72023 -29194 -106559 -123966 -92216 -12453
22215 -12453 -16276 -2845 -17685 -27616 29601 83023 107633 78248 72071 -12827 -74075 -99607
22203 -99607 -126630 -97213 -137556 -128228 -99227 20804 -13354 -79860 -48688 -29554 4890 -23938
22191 -23938 -22617 -47607 -55615 -31400 -20490 8604 24416 19167 18509 -98813 -112089 -11050
22179 -11050 45860 -2991 44583 70750 34479 32928 78689 125790 135966 50529 10490 110236
22167 110236 78586 16695 87271 140535 116333 110864 87917 50209 -21278 -21412 -10911 16051
22155 16051 101594 136310 77153 11942 23603 99286 130732 116336 101700 49842 12356 -39248
22143 -39248 -47731 13985 95042 90070 36406 -12273 18777 -11078 -18478 20873 58264 44764
22131 44764 -17909 -130604 -46360 58669 40978 32869 -42162 -2183 126242 177182 73150
22120 73150 -2257 51133 41860 -5176 -42494 -16794 -3592 -28867 -67910 -64328 -40239 -81738
22108 -81738 -22576 33310 37769 80576 57209 47306 53258 47948 -6931 -49799 47951 46464 73681
22095 73681 83768 110909 10268 -91060 -101358 -89632 -81043 -89978 -101686 -107088 -162348 -145974
22083 -145974 -131088 -63814 -21271 -25952 -61746 -73474 -38424 -9026 -60826 -32285 -45744 -12511
22071 -12511 6539 -22531 -29518 -45218 10969 46543 35240 -13705 -55784 -22485 8846 3328
22059 3328 -38593 -31749 53881 35285 -44852 -37185 -19743 -30282 -49865 -25724 -34577 -40337 5070
22046 5070 -27457 -82972 -147303 -134212 -35452 16427 25245 26689 88466 66006 54826 86100
22034 86100 22832 -32550 -20688 -6823 -60895 -48145 7643 4848 -14622 -102938 -82141 -56977
22022 -56977 20011 102618 68447 57983 37545 28387 82576 163611 174006 132744 70393 62068
22010 62068 62271 26069 42555 -3864 16356 63906 90983 127721 110913 132394 144410 131612
21998 131612 130194 78760 72372 43849 25834 30214 56230 90040 103170 -14013 -3860 56889
21986 56889 87516 60754 36541 18053 -46131 -5800 53251 39681 -26526 -27624 2538 10344
21974 10344 -44165 -40353 -38598 -37226 -72720 -100128 -85527 -74976 -110823 -54312 -15254 -36956
21962 -36956 -54677 -13259 50767 30433 80695 94440 53114 -13249 -40658 -55993 -73695 -39349
21950 -39349 -34127 55566 40125 -46394 -8213 -19293 -47700 -48637 36684 45313 34137 62458
21938 62458 91267 52239 -33580 -9865 38220 65422 37419 54065 75017 32211 -23368 5023
21926 5023 -8897 24668 50981 33236 3919 -33166 -35531 -98130 -15665 60012 58983 68259
21914 68259 24615 73685 19939 86753 70071 74924 83054 59601 34199 3069 118863 99800
21902 99800 9930 -4704 3555 -14274 -81951 -57555 36222 -110310 -210402 -113199 -35016
21891 -35016 17082 74803 -3999 8048 53050 6844 -64876 -88075 -55466 -79774 -23227 -30294
21879 -30294 -6971 40509 39938 -10627 -105348 -194907 -50257 73637 105510 75550 47722 -10795
21867 -10795 -33961 -103151 -153308 -159266 -116074 -59374 -8427 57613 34611 23729 64930 88252
21855 88252 106977 88363 85621 84042 37125 37542 10434 -20678 -20343 -46571 -32593 -25952 -6100
21842 -6100 -3806 8104 -49642 -73189 43500 128254 161295 86285 67185 76985 132013 104002
21830 104002 68260 -5656 4765 -14103 -155604 -95549 15272 34410 -55636 -81530 -52941
21819 -52941 -52466 -53785 32842 30116 12395 -27120 -54876 -28992 81468 82545 -7827 -59303
21807 -59303 -40354 -42299 -46557 -16211 -13088 -58412 -104782 -102562 -35663 24097 -14445 -104658
21795 -104658 -112302 -55080 30958 22591 27388 -32035 -28111 -18644 -3426 -2158 -20669 27017 152164
21782 152164 188591 127457 60073 48501 26450 -15184 35773 89103 -6364 -26445 -10904
21771 -10904 -36828 -6657 -56556 -62718 20950 25229 -11696 -2120 -53595 -115978 -101204 -68985
21759 -68985 -64748 -96376 -52579 -16207 -69079 -133602 -84621 -64201 -50147 -22539 -60878 -55237
21747 -55237 -85526 -26712 7623 -3217 -35705 -47718 -64399 -60074 -58400 -64299 -1347 1245
21735 1245 -80597 -179644 -161859 -79965 -16262 -63874 -38003 14622 3878 -5515 81989 40502
21723 40502 -17755 -71725 -81608 -108558 -58501 -12874 20123 17487 -4849 -75833 -86574 -37519
21711 -37519 49184 14846 21670 3407 -63628 -20896 5730 14991 -282 -24657 50635 61040
21699 61040 46361 104932 155083 88277 20518 16672 -1390 10690 27120 89166 93966 71977
21687 71977 120092 117890 39537 8039 9457 -7626 54682 97187 39973 -60796 -67017 -33193
21675 -33193 -40984 -64742 -35323 -55300 -36128 -46344 -66195 14165 -46091 -77054 -47699 -57467
21663 -57467 11077 -10657 -40222 -95412 -83932 -102296 -40765 2292 -3547 -70088 -63383 21795
21651 21795 136948 73426 -33310 -48083 -43439 -42127 -21165 -21323 -16523 20401 11757 38507
21639 38507 47086 58229 103402 114547 113280 61794 -28791 -48060 18455 39352 57875 92944
21627 92944 111543 212698 235443 133754 112018 103339 80080 -48034 -84927 -14652 11989
21616 11989 44488 68597 75650 113061 81083 18072 13258 70197 68307 9291 11003 21130
21604 21130 2866 -6894 3903 -8176 -10256 52733 52867 7321 -75866 -82756 -8339 66305 93491
21591 93491 119268 97591 -43209 -81709 -32270 -66001 -77147 24950 -11858 -54877 -10161
21580 -10161 14939 -23986 13616 27092 80855 83664 64564 28390 41511 41887 46341 54189 112738
21567 112738 103109 83323 103824 71366 43690 58122 -7277 -92742 -139837 -147968 -68524 -26751
21555 -26751 -68055 -33044 -61342 -30405 -24559 -88827 -144480 -69200 -18434 -31158 -34113 2415
21543 2415 39471 -6408 -45610 -16247 12566 -29519 -31060 49914 31795 -20749 7575 67439
21531 67439 49173 -574 -67989 -97544 -71233 -18272 -6239 -30183 -40396 -46614 -23400 -46573
21519 -46573 -59974 -66372 -4789 50857 -10317 11634 -31811 -5539 23512 -70306 -65610 -65390
21507 -65390 -93291 -124816 -168989 -110763 -91823 -85811 -47570 -32618 -75948 -7212 94848 83748
21495 83748 56779 59053 41822 32525 39096 25763 29423 45757 37503 10428 -39367 -43661 -43443
21482 -43443 9302 54716 75661 123605 63658 26090 7244 -9283 -27864 119 -37068 -71713
21470 -71713 -38132 -28456 -39536 -18539 -23683 -16584 3415 -35066 -74484 -48945 -17857 -65202
21458 -65202 -123172 -109457 -140511 -168501 -113240 -113379 -124752 -68608 -98270 -35843 53040 80085
21446 80085 13942 -79900 -98579 -27075 -20228 31368 70857 -11420 -24180 22543 18197 -14019
21434 -14019 -28323 -50678 -13418 17811 -5448 -17161 -61829 -57356 -28702 -3400 -7733 18843
21422 18843 14953 -50356 9055 10618 52993 -10354 -41848 -4534 -1052 -56709 -111505 -92550
21410 -92550 -20297 -7307 17544 65847 75856 63450 45789 33718 94988 94683 62355 43584
21398 43584 -8555 -4422 -65786 -117673 -152794 -30723 54542 55544 91913 58608 51701 -40483
21386 -40483 -69846 -33480 -20104 -13171 -6053 11124 47520 49626 30923 47432 26432 -44666
21374 -44666 -73518 -62328 -71307 -6727 42019 151529 139864 137993 180409 177691 61178 10214
21362 10214 -8411 -48129 6910 74305 124968 82830 101692 68924 -35043 21261 -17060
21351 -17060 -14429 -3076 13721 22500 -10679 -23342 -10609 9018 66130 62654 56659 32774
21339 32774 -21663 -20928 -19062 -58658 -97970 -52025 16843 -80041 -35672 21333 59610 54614
21327 54614 -32812 -42716 -35529 -75431 -84998 -31147 -24630 22079 33458 -73118 -34048 -56192
21315 -56192 44625 32055 14896 -37914 -92355 -132610 -136221 -78502 -38022 -69071 -50838 -34898
21303 -34898 9041 -55541 -79003 10779 116689 172793 142413 138865 68881 -82804 -64786
21292 -64786 10676 20979 97928 99852 85972 -27046 -23803 65449 85505 46383 -10890 -24478
21280 -24478 46945 50883 -30387 -70441 -26718 24896 14431 -19479 -41588 -67883 -30761 15752
21268 15752 -5132 -15308 1761 32366 90346 81650 75646 53298 8690 -62066 -24541 -22332
21256 -22332 -127120 -117680 -47021 -22072 -16058 -83705 -152885 -78599 -54257 -83024 -150541 -109514
21244 -109514 -39804 -13487 -27191 -75862 -99171 -104097 -77069 -40554 -51923 -66703 -40162 -5268
21232 -5268 14835 -957 -9855 -47466 -16909 -23265 -102753 -97177 -111061 -149216 -171204 -164225 -155565
21219 -155565 -123949 -29856 -67164 -29426 -20144 -66129 -77991 -63405 -58224 -69575 -45424 -14063
21207 -14063 22622 74463 81178 58064 675 -872 10826 7044 30789 96981 82452 37611
21195 37611 45895 19098 -26789 -29118 -31030 -70861 -69370 -78092 -24237 82730 78167 46513 33789
21182 33789 38994 55788 33260 46100 21971 -63911 -97586 -76747 43321 117255 77787 42716
21170 42716 -10476 -45701 -58290 -53772 -7916 -3269 -29485 -8895 1722 -45968 -100659 -103074
21158 -103074 -131686 -99525 -77726 -134948 -34619 1640 -44832 -76942 -28260 34008 29805
21147 29805 -49191 -71291 -27223 22683 41392 33270 -62298 -94613 -96452 -87259 -115253 -88694
21135 -88694 -121187 -112683 -78665 -109394 -67324 -1948 77241 137828 137936 94111 37241 5185
21123 5185 -2166 -125332 -166710 -120801 -11324 52020 -3119 -29070 -10557 -63587 -67360 -10983
21111 -10983 16143 9579 29344 -3842 17668 18342 -8432 -41724 -13727 -787 80734 104178
21099 104178 71383 35186 53861 56078 43699 66619 39466 20666 34250 39387 83036 104161
21087 104161 27356 11019 -5194 -10802 65693 75912 26018 -70492 -58900 -17356 -10926 14522
21075 14522 48325 60643 77775 76058 39238 16696 -49698 -19319 11630 35824 28064 -19154
21063 -19154 -112411 -102075 -77176 -54824 -25326 -51924 -43387 -5181 73393 107041 15276 -20110
21051 -20110 13718 -5565 -32960 -86933 -70700 -22078 122078 94628 8740 -38107 -15561
21040 -15561 -34705 -21945 61511 149410 124861 80924 39453 -24037 -26183 2915 7857 61212
21028 61212 94986 41288 -30860 -44574 -114892 -44281 -26587 -12641 12149 18738 -34013 -43697
21016 -43697 -32838 -8782 25073 55778 42915 -73381 -141704 -130088 -129329 -128900 -97196 -49178
21004 -49178 -51947 -89687 -122166 -158642 -180887 -103142 -33293 10616 33695 16765 10691 833
20992 833 -951 -38655 -113676 -140458 -93976 -67172 -34722 -13354 31993 32549 19787 54527 34257
20979 34257 74011 111920 108533 75134 83393 77658 64791 115584 79254 113188 87665 34844
20967 34844 -1869 -47360 -35556 4729 -15585 -26726 -33917 -60718 -65643 -66510 -94353 -68967
20955 -68967 -62240 -79073 25459 89393 110438 107434 49506 -64750 -86802 -43830 -10851 16554
20943 16554 695 -1722 -68693 -38390 21920 73925 52907 -18594 -36929 14519 85895 85509
20931 85509 99103 116223 94862 140287 140376 103817 66849 -36303 -83084 32897 39321 37971
20919 37971 18119 18782 -55190 -109164 -36731 31605 51289 47586 48936 -6060 -13385 65143 160769
20906 160769 91311 24969 -9544 22269 47690 -7731 -69936 -39172 -32993 -77904 -158721 -106049
20894 -106049 -26097 -24667 -71903 -112510 -58132 -16673 -13524 25637 -5376 -3145 13680 69210
20882 69210 9372 -31828 -39128 7916 -473 -64692 -89487 -95417 -36993 19156 59799 104919
20870 104919 66258 4939 12204 -27746 -67284 35922 47593 -27357 -67990 -67063 -71872 -36903
20858 -36903 -32411 -60723 -112632 -155392 -124991 -45929 -42833 27525 25194 38469 30692 4707
20846 4707 -34569 12781 24119 17052 -26920 -36502 -68918 -34535 -35081 -88153 -187596 -185232 -64293
20833 -64293 -68526 -73969 -122731 -89760 -101382 -112244 -158392 -177242 -197831 -210895 -162531 -74018
20821 -74018 -46749 -72319 -26756 -80189 -116224 -156614 -29664 63665 31677 -7104 36349
20810 36349 -54102 -103723 -60926 -57002 -44906 6625 50128 68898 93630 5155 -39089 -62741
20798 -62741 13216 36173 567 -59097 -79457 -123556 -147704 -145409 -119376 -41572 -52932 -6933
20786 -6933 -11697 -26499 -117974 -127240 -141664 -114764 -102226 -41312 66523 120362 66955 2165
20774 2165 -47838 -65840 -68593 -89934 -76081 -114866 -218938 -161851 -122305 -100480 -23720 31928
20762 31928 10553 33791 110948 97310 -16187 -55786 -46932 -56359 -3447 15030 42410 60421
20750 60421 52521 86149 105300 -9227 -2178 35879 58961 10640 -49197 -43646 -4884 -21071
20738 -21071 -59628 -60064 -48668 -87096 -79872 -44667 -46038 -14544 40436 68000 63214 108352 95267
20725 95267 84607 115119 43947 -14372 -70122 -110601 -41200 68233 49574 3649 -50055
20714 -50055 -74132 -59405 -11400 -83790 -113274 -65097 1611 4407 19848 2325 46441 4059
20702 4059 -68045 -44174 8807 11655 27211 71581 44806 17649 39211 32584 -9324 -18462
20690 -18462 -1423 -49093 -124138 -124731 -37844 11471 59890 94704 106075 136422 144366 16953
20678 16953 -6804 -83882 -139863 -88630 -44281 6480 37193 78542 140090 87548 -22934
20667 -22934 -34970 -98801 -118379 -117068 -174881 -130032 -26452 21584 6529 39823 78372 105440
20655 105440 97453 21042 21793 45953 64949 65888 -76605 -89231 -18562 3274 34080 96173
20643 96173 70161 -23632 -30775 -40321 -44571 21979 8007 3175 13863 18909 20267 -10299 -39722
20630 -39722 -22787 -47578 -39800 31362 57440 30819 15730 -2038 -56960 -82997 -56364 -52117
20618 -52117 -27582 23146 -6135 -55842 26610 50042 -16560 -38581 -60257 -87128 -41437 -87338
20606 -87338 -77630 -73699 -74294 -35295 -37159 -15273 -8582 -69951 -14963 -29903 -116366 -152237 -94208
20593 -94208 -55263 -110520 -99252 -143040 -230183 -194565 -82012 35470 25025 2050 -159
20582 -159 24942 -14245 24726 71505 161383 90754 44313 26534 -10550 14799 30449 56551
20570 56551 45093 35630 14333 -57561 -199723 -221617 -172126 -36500 60401 32328 -12370
20559 -12370 -127521 -125782 -94763 -66785 3775 26048 -88981 -185284 -119366 -103744 -113981
20548 -113981 -71722 -38630 29121 24613 31833 -13010 6835 -39809 -58607 -80793 -146033 -110311
20536 -110311 -103969 -121381 -36197 31543 35486 -15245 -131131 -135610 -145661 -173487 -169266 -167330
20524 -167330 -107234 -8179 -28349 -29308 -44223 -9655 -1409 -48057 -64694 -67176 -93770 -96848
20512 -96848 6735 58555 77983 82228 102137 19698 15025 -3434 -29256 -73290 -104154 -54229
20500 -54229 -27069 -71897 -134949 -106691 -28050 52679 10312 -15053 67 -109370 -194403
20489 -194403 -113827 -53712 -42735 -8129 64119 94388 133380 38286 -4077 81594 108905
20478 108905 113861 89064 48824 68267 96502 149672 31169 -17830 -25592 -33341 -44860 -87575
20466 -87575 -89118 -38989 29762 78963 55196 42675 -7105 -64410 -94104 -63326 -10943 5826
20454 5826 25089 -11721 -42219 -61843 -54140 -12418 -22609 -84770 -69687 -109326 -139369 -101336
20442 -101336 -104715 -116641 -121530 -153197 -191115 -120478 -55504 -22921 -43129 -56128 -31086 -3082
20430 -3082 -25033 -17770 -24215 -18999 -23337 -3617 -6028 15453 161 -46535 -61632 -141473 -201706
20417 -201706 -107391 -9648 52255 33523 -19823 25476 38899 13680 -40979 -64943 -34600
20406 -34600 -15998 -89799 -120179 -93739 14395 31558 29374 46207 32147 -86832 -170654
20395 -170654 -147494 -113432 -74108 -4932 -26471 -87549 -91022 -56058 -49485 22701 84745 14119
20383 14119 -20589 -66782 -53570 -56856 -16188 25370 114372 140064 116222 67352 64837 63150
20371 63150 35173 8822 60343 29641 7876 33267 21456 -40852 -26278 -14011 -34858 -49486
20359 -49486 5232 -26562 15786 -34509 -108588 -188863 -172169 -141151 -109196 -92700 -87585 -79136
20347 -79136 -30187 -4477 -42742 -17419 -40396 2272 45901 46502 51839 31701 1214 20641
20335 20641 24930 -44386 -76859 -14603 17497 494 -24802 -51914 -66840 -86077 -78607 -107575
20323 -107575 -92862 -33534 -12060 -39685 -77785 -21921 37871 21393 13432 -46709 -114786 -92102
20311 -92102 -52231 15517 55815 -38335 -90152 -131921 -111302 -37480 11159 30297 1790 -20188
20299 -20188 -64899 -64616 -28028 -25568 -64461 -138388 -164494 -139920 -44527 -53834 -116639 -46767
20287 -46767 77448 78246 55446 44475 127125 65964 -25006 -66703 -41756 -37541 -64843 -57525
20275 -57525 2217 67534 60216 5400 12319 20060 8958 13988 -67354 -89284 -100283 -134013
20263 -134013 -145261 -188321 -163196 -128461 -121077 -92583 -131500 -146951 -49062 16996 55096 77824
20251 77824 88037 101305 -53322 -35599 -59410 -61489 -27260 -13297 18091 37817 23395 -80506
20239 -80506 -101542 -80156 -93456 -81501 -17780 31085 -10758 -51022 -45145 -19922 27163 68707
20227 68707 65351 17340 -47949 9757 15267 -60143 -24659 -20456 17388 -33938 -64382 -56599
20215 -56599 -55793 -33997 14920 -61728 -144246 -146752 -91828 -36210 -72672 -84825 -114089 -66805
20203 -66805 3331 -24355 -25046 -1456 25036 38360 17302 -39866 -43225 -47761 -66568 1402
20191 1402 56012 3010 -46682 -62104 -40778 -46810 -11694 4487 -14430 6465 -19578 -25911
20179 -25911 -58799 -87895 -40169 18740 47812 37120 -7640 -63767 -102535 -97487 -28955 28061
20167 28061 21687 -4754 -28040 18057 -13280 -83817 -134351 -115078 -88675 -12127 -34170 -78864
20155 -78864 -63908 7008 725 -40190 -13418 54698 183609 111974 11480 17270 43980 81712
20143 81712 23348 -59130 -10566 8231 -36403 -92090 -89214 -53039 -81231 -107529 -77671 -78909
20131 -78909 -122962 -156365 -109242 -24221 29582 32577 61505 10394 29161 32803 -3835 4108
20119 4108 58528 60022 5619 -101523 -83813 -40027 68136 8565 -22816 -26498 -63427 -71816
20107 -71816 -35193 -31488 -127407 -107960 -27955 16350 84533 156569 37454 -88803 -91499 -114391
20095 -114391 -82659 -49182 -63828 -58375 -46278 -45433 -16428 10445 67959 78574 64117 -22015
20083 -22015 -84322 -103001 -24556 64306 50723 25034 8105 -62532 -66220 -29586 34057 75483
20071 75483 68305 57520 38629 97840 149907 116743 56762 -8465 -33121 -43875 -111045 -137477
20059 -137477 -143408 -61314 -16773 -85887 -105623 -80502 -84160 -28975 11727 -18210 9989 -47617
20047 -47617 -107100 -101604 -14690 63474 79245 79249 63296 7019 9019 -78902 -112331 -82613 20469
20034 20469 36029 -64185 -71053 -92396 -68507 -81620 -134934 -123792 -76440 -33976 3684 -95825
20022 -95825 -111644 -97922 -44159 -60959 -71659 -69591 -122688 -150317 -149553 -85422 13890 42010
20010 42010 -50397 -124557 -69486 -54420 -9082 27428 -8866 -19679 -61851 -64214 5209 27565
19998 27565 79591 97377 85399 67878 5256 3593 -31847 -51644 35844 59457 79878 120552
19986 120552 147398 110425 77662 5835 -40724 16652 69338 59813 53076 -3823 -23678 -37798
19974 -37798 44986 -7208 -77183 -112042 -48435 -46330 -63636 -11326 -12673 30394 96161 40830
19962 40830 -9451 -4527 17531 -23961 -93853 -83896 -53496 -26719 -32214 -128532 -127397 -100582
19950 -100582 -111307 -64733 -43060 -33546 9869 57058 2513 -23408 -9329 -35195 4511 10785
19938 10785 -7590 -20670 -41466 -82618 -120819 -81721 -69179 -55793 28558 25311 -72851 -118022
19926 -118022 -77274 -28020 20330 27614 -78683 -9552 6933 -54554 -90466 -36636 -44410 -82526
19914 -82526 -129376 -228985 -261469 -192279 -99157 -35956 -29855 18624 69398 -14467 -61620 -77480
19902 -77480 -98955 -39407 -6672 44286 -47128 -62496 -56793 -63809 -66673 -21357 44435 8854
19890 8854 -61960 -32451 7150 18618 34872 32487 44891 33879 25300 81868 113199 52375
19878 52375 -4698 -44936 -13298 21657 -25860 -28853 -41305 -119606 -79635 -57206 -44704 -43802
19866 -43802 -98461 -102165 -82687 -46586 -55848 -101212 -78473 1140 30416 -10230 1053 31434
19854 31434 24806 43583 57675 -7162 -24680 18153 -23419 14029 90 79058 140338 73087
19842 73087 41396 -17921 -21327 -31084 -32824 -135142 -184903 -162420 -90158 -7397 38006 8558
19830 8558 -8990 -95650 -125332 -62514 -17672 27408 52789 9134 -24766 -62937 -103684 -104805
19818 -104805 -143801 -79866 -7856 -4628 -95986 -124934 -97635 21241 97286 111675 38900
19807 38900 22565 68739 47169 78269 50086 34972 16325 -38524 -64460 -54697 -62163 -50035
19795 -50035 -27406 -12742 -25928 -117413 -173030 -153111 -151937 -122896 -34854 -25046 -42586 41625
19783 41625 41514 -64087 -99207 -67504 -8399 -67438 -112719 -100066 -110661 -91630 -109737 -46815
19771 -46815 -34404 -63695 -64807 -16940 -19255 -11744 -54933 -58805 -78338 -23594 94070 51142
19759 51142 -9493 -23505 -4575 -66720 -123372 -107992 -129139 -112598 -6962 69151 90360
19748 90360 85332 5935 -38156 -906 11991 2091 9950 3605 10488 36496 16662 -116863
19736 -116863 -163965 -157905 -153850 -63809 -5045 -10562 65908 9280 -35829 -38118 -11407 -30395
19724 -30395 -50715 -34235 28626 19940 -16044 3014 50513 37954 10243 -31286 -12169 2516
19712 2516 -5434 76 53059 1321 61176 134217 84521 -5786 -59117 -85483 -112233 -96336
19700 -96336 -81641 -151149 -176657 -125889 -34720 -2100 -91826 -105998 -81862 -115065 -124341 -92683
19688 -92683 -93569 -105573 -119599 -136666 -68952 -24835 -523 43427 52723 34271 81073 127723
19676 127723 146750 142018 73628 102806 57914 2004 -19823 -24378 -101166 -148244 -106981 23419
19664 23419 96617 48082 -8633 -59883 -76840 -101757 -151315 -159435 -17267 20752 -54114 -69098
19652 -69098 -81947 -55609 -65795 -42595 41427 56209 96830 79307 28522 -26566 -45886 -21706
19640 -21706 -36272 -128809 8345 49378 -1737 -17474 31337 50972 15911 -11967 -44331
19629 -44331 -59281 -12524 66905 113074 180300 208239 214471 121430 75539 70222 4070 -40926
19617 -40926 -35900 -58489 -64108 15351 91822 -32972 -95916 -103915 -162326 -158980 -68794 11375
19605 11375 26933 100975 140071 109782 15282 19340 72662 31608 -14431 -25419 -110246 -110518
19593 -110518 -29595 16984 94619 42960 4674 -14005 -43671 -39179 46039 80600 56584 40068
19581 40068 62312 90530 75712 75635 34979 4025 13947 24546 42710 13403 -68878 -76292 -15907
19568 -15907 -18905 -38630 -69329 -102991 -69437 -52010 -98444 -24357 63927 45741 19175 -15439
19556 -15439 -1998 -51903 -38867 5990 -39613 -67630 -65476 -98725 -47932 -13725 -2618 20581
19544 20581 72707 14733 -42430 -60140 -34502 54507 37438 -37585 5199 57319 -21354 -67277
19532 -67277 -83637 -57032 -30397 -3981 29811 -37394 -103749 -35176 116165 93116 -25055
19521 -25055 9055 29316 43479 74257 35243 164 78301 55683 -59763 -68521 20353 97856
19509 97856 109206 48995 17882 20022 59470 -6394 -66763 -51476 -22012 1793 2803 -71281
19497 -71281 -85455 -92360 -89724 -69481 940 17069 15398 45204 47227 -11634 -39168 -24357
19485 -24357 -33081 -73890 -51019 6655 22625 40764 65254 49384 -18989 -40118 -85314 -65706
19473 -65706 -64791 -58038 -14515 25879 131556 62335 -103636 -75543 -36525 -78240 -46770 47871
19461 47871 -18526 -124459 -138674 -52756 32176 37541 -45062 -40953 6294 22829 26696 25106
19449 25106 -4132 14883 12022 11874 4578 -26582 -65392 -71491 -111207 -110417 -108363 -128118 -152077
19436 -152077 -136249 -82224 -18853 15157 -57350 -89699 -52434 -106844 -74614 -111116 -103733 -92237
19424 -92237 -64166 -38367 -37215 -5674 28128 26887 18205 18010 52120 -2433 -135564 -122864
19412 -122864 -87867 -77189 -35629 -38639 -94056 -64072 -63021 -52923 -63013 -63415 -44387 26522
19400 26522 73426 -24059 -65959 -48463 -7044 -13981 -75294 8900 42450 50090 10317 48257
19388 48257 56824 22434 -57638 -90661 -19974 50364 19079 -30576 15594 5838 -58798 -48107
19376 -48107 15709 -17748 -35344 -17351 47602 27480 -64242 -97753 -59422 2483 54478 76919
19364 76919 19332 38326 -13463 -15963 -50048 -20434 -14453 15371 39250 20681 -22290 48486
19352 48486 93456 11828 -8145 41942 70548 27550 30178 -3451 34025 814 -58920 16401
19340 16401 90289 3662 -97038 -98526 15485 10355 36549 41368 43424 -51366 -103896 -47709
19328 -47709 -76082 -52830 6247 72848 87124 67485 32208 -37078 -35022 -10341 -39295 -95588
19316 -95588 -40170 8203 37612 13925 14427 8936 22254 -29015 -44697 -99163 -84366 -15389
19304 -15389 36879 6027 -18125 19043 48195 -50794 -91317 -56541 -95061 -65566 20297 74535
19292 74535 66729 -36243 -81663 -70845 -37769 -64844 -80444 -36600 58513 24567 -34557 -36737
19280 -36737 41090 51541 33385 1910 46358 50393 55479 12767 -23008 2333 -56813 -31156
19268 -31156 -36355 12966 101098 40468 1637 -19085 -19355 -18979 -9416 -12764 -31352 23877 13873
19255 13873 12276 21735 42838 57854 71468 81928 40382 -49947 -59910 -62725 -65816 -95244 -105113
19242 -105113 -59615 -9872 51992 86019 -12610 -55043 -35303 -5526 -19729 -7540 -12727 -16380
19230 -16380 -315 -19539 69 69598 33962 56624 52398 82038 14572 -17936 -17280 -42149
19218 -42149 -51504 -67969 -17651 76058 67639 -25534 25741 41283 -4622 -24200 -87254 -62266
19206 -62266 -41236 30688 56566 49871 81218 30565 -62019 -112515 -151683 -146770 -79023 -53629
19194 -53629 -60976 -109483 -121615 -135163 -143679 -116630 -99604 -109127 -51309 12734 30669 39094
19182 39094 39309 -1808 -44831 -83147 -81993 -24031 57315 77040 71831 116275 56702 21333
19170 21333 72029 150118 108612 84768 70230 883 36577 34510 60758 34185 -5307 -118213
19158 -118213 -105333 30896 47851 28572 103172 165284 153335 105927 57813 43646 63372
19147 63372 -26235 -65228 -24408 23133 61570 66414 28844 -30180 -22209 5604 62821 74097
19135 74097 3629 -36089 -28422 47288 76983 -9152 -28626 -30423 20301 23967 -56616 -136217
19123 -136217 -129432 -124094 -134043 -95010 -93601 -84162 -84332 -74969 -76345 -87909 -126393 -64102 52228
19110 52228 -47919 -99239 -61319 -129464 -103805 -84567 -86651 -38830 -26405 -27662 -66071 -72765
19098 -72765 -57038 -35138 21676 58959 115751 119341 97162 -3961 31342 100110 71561 -25915
19086 -25915 -54015 -34643 16373 58492 60722 44284 -822 -94421 -154333 -161412 -129028 -116271
19074 -116271 -87846 -80171 -151557 -199969 -142729 -42205 -30660 5491 -24563 -31167 4580 -7398
19062 -7398 -13712 6155 49515 33275 3099 -16124 -2520 75281 111851 56333 92368 117270
19050 117270 20933 -87533 -108257 -123051 -111803 -114969 -124242 -46954 50858 46859 84710 90315
19038 90315 43152 -13347 -71026 -46211 -22378 30276 227 -50212 -6006 92130 107236 86697
19026 86697 85612 78248 99507 101285 78445 30512 40282 82873 53916 65813 50546 24320
19014 24320 -14445 -28769 89518 120515 102659 75395 45888 11470 49432 89543 116349
19003 116349 99855 24004 -92109 -70602 66050 90727 36208 15290 40672 34064 9428
18992 9428 31824 113627 159781 120184 20565 29562 58508 93774 68657 15594 22481 -17282
18980 -17282 -41574 -11905 39211 2992 -37640 -26508 -22982 -5877 47978 69303 74573 54864
18968 54864 37811 21153 14996 27543 43260 -36869 -20103 42819 17265 -12829 -16438 -23861
18956 -23861 -9897 47092 39915 -35392 -80980 -79974 24487 64349 23683 31577 -6922 24386
18944 24386 73713 18137 491 -25833 -45778 61787 136522 153623 71488 34084 68602
18933 68602 80603 136115 150419 111970 93490 5389 12656 83661 62809 1569 20068 15584
18921 15584 4439 -26140 -31000 -3978 60891 40146 -25454 -17354 -9655 15744 -23576 -110581
18909 -110581 -125063 -180945 -153697 -70345 -59265 -49813 28592 63224 48106 98508 101156 136325
18897 136325 50330 -45977 -115980 -85494 -67257 -45942 16026 66381 58948 70299 22107 -93628
18885 -93628 -90140 -37275 4896 -12080 -44581 23336 48591 78821 92234 75153 86069 118204
18873 118204 142858 77359 66102 61688 17023 -41901 -3085 53357 99795 74949 72629 39147
18861 39147 2875 43456 88158 28664 -10997 -4858 -6857 26203 -25663 -66264 25071 18158
18849 18158 -1938 81585 -2152 -45726 -600 48431 76482 108027 104346 71949 20199 50079
18837 50079 73947 158404 171315 193023 233113 207112 227448 246348 139361 155037 213401
18826 213401 221338 163444 114529 80236 56031 62361 181581 224864 154586 54061 35258
18815 35258 -7855 30870 78257 48732 39483 -43689 -11669 65404 73506 54257 -24554 -60862
18803 -60862 -119084 -116122 -102263 -100202 -86315 -39290 -61304 -55921 -6369 15053 86975 102550
18791 102550 37299 4687 -23378 46363 108445 86564 5277 -42710 -58200 -70238 -15866
18780 -15866 97014 135529 178028 174476 181652 223940 236550 203862 184049 237455 284046 415628
18768 415628 661980 1024183 1185179 894975 480956 299376 231564 185397 126492 53870
18758 53870 -15250 4697 -68717 -75637 -32059 5475 -112304 -209699 -147676 544 34159
18747 34159 31503 -48830 -52328 -13683 67457 107693 116635 92290 78487 2268 -34147 -36008
18735 -36008 17456 -12955 -96314 -130083 -98814 -73057 -80010 -34347 54461 51542 92335 105230
18723 105230 140406 199791 186646 142663 38750 25207 -2124 -9048 43335 65623 53036
18712 53036 23241 97274 113466 87053 107979 162109 111971 96754 90431 26748 65625 26363
18700 26363 18100 11671 -121993 -167546 -67059 24740 53877 50273 -24858 -18682 92351 205399
18688 205399 243836 180796 204823 258119 351084 414136 465450 443648 408819 448133 488846
18677 488846 593034 558385 483396 454440 521482 582429 589950 630641 679654 682228 727637 727436
18665 727436 679406 688387 686467 615238 614031 637147 608556 588777 555756 464756 491120 537138
18653 537138 460808 372649 290369 240464 115578 115708 201127 188487 199773 107160 72325 18702
18641 18702 48492 77079 195548 218090 197716 198357 190570 241785 363242 454799 414501 393976
18629 393976 428531 496869 434194 421553 493843 569425 621687 706122 716598 724180 762500 756373
18617 756373 692084 691926 724595 743290 688498 616988 542557 492916 497955 611738 675022 666728
18605 666728 604833 573897 499472 434041 405970 335526 192810 170751 126174 46162 94458
18594 94458 83810 8318 17127 991 6347 20131 -54665 -29733 -35485 -54737 -33318 -93417
18582 -93417 -181706 -183413 -105036 -35373 13986 59077 136581 104796 -354 -73347 -36785 71618
18570 71618 108587 12455 -21145 43549 46139 24779 39623 1094 83358 64146 29245 214
18558 214 20534 61039 63705 67564 94235 42585 69514 170486 200658 212299 96884 -17670
18546 -17670 -4841 39342 44553 67629 176961 25889 -49436 23474 24902 -2113 22953 46029
18534 46029 41915 8825 -5567 69497 133284 190045 169898 166651 209567 153350 136247 153907
18522 153907 161754 133340 71174 50001 109600 138669 144405 147858 152233 121580 61880 9296
18510 9296 -55094 -49312 32283 64492 102259 120561 107063 55850 12204 4649 5774 36034
18498 36034 46129 74689 105970 70578 73265 145888 180318 108952 105788 84628 -38122 3246
18486 3246 48830 125498 75330 75353 34565 -24744 37078 91962 64097 107440 137412 154711
18474 154711 81406 82012 116912 140153 96744 41088 -9615 -54010 -53513 -71819 -56525 -42553
18462 -42553 -3490 -30769 13818 116660 87215 22510 4531 62209 59346 -68982 -82275
18451 -82275 27566 123802 129679 71902 -5437 21671 74659 46908 83531 104466 120985 123697
18439 123697 202929 262313 167233 90795 23859 126373 163993 178405 246976 264036 328304
18428 328304 394399 335456 247953 160617 138183 143992 138693 52919 33408 -51544 -63601 14965
18416 14965 32122 41071 47345 73180 105471 76663 58604 135431 85420 28724 -3086 -59688
18404 -59688 -23919 46332 45595 59638 125531 153329 200104 252807 204243 152576 161302 166103
18392 166103 129220 2454 -69439 -7895 57395 52982 58352 160415 212554 188849 243179
18381 243179 311104 311383 280596 188640 147063 109584 152387 222493 261663 216413 172570 231033
18369 231033 251657 260137 137701 206325 247101 264646 238051 200153 231493 302239 243903
18358 243903 195508 126628 121831 67922 -7958 10810 14093 -28038 -73765 -86780 -101913 -57618
18346 -57618 -2707 122607 174376 128401 117015 134454 217130 265475 234767 214227 198441
18335 198441 201474 231150 213944 162084 188494 222965 230687 237805 239360 236548 214891 188111
18323 188111 201245 202732 222159 309363 252011 188563 85678 18816 -21874 -66178 -14145
18312 -14145 78390 105516 110987 95929 65414 136076 117847 111936 87399 104948 75380 51856
18300 51856 80971 138983 170666 192978 99711 57705 76077 97213 29973 -21576 19124 96007
18288 96007 169583 180315 216025 252147 207095 85238 58650 111115 135369 128323 100056 94761
18276 94761 96685 163819 217842 210105 110748 111935 153163 260747 419115 431686 319699 222169
18264 222169 169911 282829 322182 328923 350816 373490 388661 350566 334466 338197 379386 385770
18252 385770 353657 351545 403520 484585 487327 523995 482495 402051 349799 274464 273379 340599
18240 340599 419885 447827 419284 357452 389256 432329 451568 563739 710531 739047 729435
18229 729435 778856 898843 897196 898086 935209 944508 990768 966804 940076 957449 1056676 1189552
18217 1189552 1244303 1272110 1438842 1584347 1764262 1973576 2225661 2539640 2828582 3110140
18207 3110140 3553274 4032685 4341128 4560604 4768083 5190379 5922038 7026931 8752791
18198 8752791 11256991 14038861 16195828 18385582 21286083 23237155 22363420 20878964
18190 20878964 20274477 19702104 18736484 18396069 19387378 21777390 25912555 33040984 45089201
18181 45089201 64518970 92809919 123609861 147340955 174016959 209853263 228072532
18174 228072532 212936539 195313141 184601889 163414387 130712966 104279480 88478999
18167 88478999 79027877 74072865 72382788 71913951 74268593 78170555 75820339 66640686
18159 66640686 58296669 51386962 42753934 33659744 26681134 22182423 19341237 17490527
18151 17490527 16428405 15901931 15536915 15289966 15295391 15539388 15765508 16264396 17326795
18142 17326795 19225088 22287808 27255679 34762768 44521306 54111403 61966295 70734345
18134 70734345 80180037 82881777 78424718 75599846 76047396 77744546 83275575 95655349
18126 95655349 114671537 143831134 183672756 218265305 234609758 253779926 277721633
18119 277721633 270297961 228141909 193720232 169157541 137424793 104838909 84939431
18112 84939431 79642435 89804999 120830342 181483951 248809055 217705150 138483591
18105 138483591 92954808 70716700 59956947 53496369 45943967 38511716 33306334
18098 33306334 28505599 23243099 18884193 15909029 13876700 12336085 11180504 10338915
18090 10338915 9592663 8738094 7886971 7182685 6574562 5913236 5355297 4965970 4687365
18081 4687365 4543463 4672406 4873631 4877422 4724923 4421984 4023720 3558076 3183521 3019575
18071 3019575 2862786 2646167 2499498 2457230 2438337 2351663 2288363 2398585 2585333 2716022
18061 2716022 2888244 3025490 3054873 2923880 2824959 2828673 2860028 2814905 2735870 2559207 2356151
18050 2356151 2183541 2041281 1846640 1682196 1623639 1583791 1570083 1504266 1374970 1312218
18040 1312218 1369025 1359337 1280295 1231813 1194558 1213607 1145689 1078123 1063939 1006524 921160
18029 921160 912688 962549 972068 934933 963318 996100 1042311 1101594 1174427 1133164 1009420 1029107
18017 1029107 1073527 1041431 1137277 1250523 1197834 1215171 1268269 1252204 1325447 1313189 1316465
18006 1316465 1331537 1405203 1509518 1571832 1599322 1554112 1569069 1600638 1570560 1463818 1318021
17995 1318021 1220294 1137729 991258 817963 807362 853195 741109 687895 704301 697695 598439
17984 598439 572819 621523 695641 698149 668789 594146 491965 405951 375398 394253 384389 372772
17972 372772 317193 341407 309847 264444 334333 347454 348989 329087 279759 316742 408850 422133
17960 422133 311674 251113 250626 263303 257009 246172 239468 255570 273195 255071 310241 375508
17948 375508 366366 366369 318529 310810 343315 292054 236701 176546 274549 334064 265683 260402 324987
17935 324987 338640 256766 123497 73030 119482 154886 197126 236353 263913 223252 178407
17924 178407 256924 273977 222232 181269 166149 65463 75216 142686 110899 112750 210737 196195
17912 196195 181615 228271 276503 267054 265678 287664 261298 191268 130797 145372 182659 161401
17900 161401 129131 97098 87916 124762 168240 220787 191646 203902 260751 223082 129288 114550
17888 114550 134013 120705 123988 132999 183623 194843 130754 156539 169874 187025 253238 256969
17876 256969 260664 230553 170621 131770 98389 59314 51709 67666 95124 133030 146030 166570
17864 166570 211728 267847 219484 152036 119946 184704 264810 228194 195985 157759 128737
17853 128737 167685 202686 185023 205970 255236 161424 76108 87503 11024 -15861 92697
17842 92697 151648 141753 219234 290852 270980 254416 189087 151963 161606 187233 278338 293828
17830 293828 376134 412355 444104 465672 418342 335555 351819 270738 206722 215646 173849 145569
17818 145569 140060 87217 49058 42466 31095 106335 165596 164142 128458 112736 152817 156137
17806 156137 176353 92031 70107 130050 197795 237378 221569 171421 126423 136932 140741 200539
17794 200539 189012 61104 17163 84303 232703 244998 252308 269057 318639 249537 199453
17783 199453 192321 219114 168861 175484 206047 171259 194513 227488 273095 287611 265614 321178
17771 321178 336867 279367 183575 77120 11854 52731 25852 45445 111029 148405 161997
17760 161997 186047 211649 232012 145857 121477 201078 244193 258047 214527 134596 48269
17749 48269 27890 34278 -9820 -20014 30946 74458 102237 90539 31438 48518 54246 134272
17737 134272 211808 175948 162674 203049 195171 182713 209165 212727 215930 172511 111437 178890
17725 178890 324191 369837 294974 136204 104812 151823 179290 196103 175047 184062 112253
17714 112253 87960 61809 97939 94868 109137 93312 73729 111638 159986 172032 193703 158356
17702 158356 179715 157710 200331 181916 204999 158900 135038 119807 155076 201471 271999
17691 271999 312348 363577 403988 419552 448060 466570 431180 429634 463730 525915 546612 524770
17679 524770 538393 571554 607497 646967 629015 646682 707566 729515 614202 535397 498427
17668 498427 434840 315047 272830 334664 482119 533123 468977 499994 532893 494122 479071
17657 479071 456100 450457 463372 497904 496361 454527 592592 693989 706199 696176 664490
17646 664490 616173 570757 565110 575054 725763 867364 848698 939137 1014598 1009496 1143269
17635 1143269 1305328 1399961 1521036 1658307 1739862 1721542 1741306 1781381 1755754 1742097 1637878
17624 1637878 1513264 1453086 1462248 1544742 1679129 1826145 2023553 2301273 2525514 2556334
17614 2556334 2574415 2644132 2681997 2599343 2492251 2513989 2625425 2768156 2857712 3091007
17604 3091007 3388752 3767764 4332951 5086649 6064533 7295016 8903903 10922770 13872728
17595 13872728 18008879 23396820 29260210 33637759 34511255 31987617 27553110 23419902
17587 23419902 20781560 20013610 20958668 23281424 26858277 31989024 39420688 51145488
17579 51145488 70247437 101609795 149256556 210555914 273273553 315043686 322391801
17572 322391801 295189023 249039542 198949780 154771802 119326382 93608477 77214278
17565 77214278 69423976 69031862 74851070 84484413 93707105 97081207 91532390 78329695
17557 78329695 62132961 47502366 36569963 29282192 24623384 21592931 19533843 17998383
17549 17998383 16698896 15600152 14660363 14093505 13904665 14030793 14482742 15107844 15933849
17540 15933849 17115388 19074298 22268437 27612249 36028231 48033137 62620494 76381949
17532 76381949 84554033 84550060 77579962 68273246 61422584 59940052 64982192 77361716
17524 77361716 97467741 125451274 160171984 199994454 238375265 264698306 264976152
17517 264976152 236901648 188247333 137261729 95974315 67886113 50448113 39626626
17510 39626626 32641983 27837572 24403350 21934234 20344748 19911474 20922623 23246173
17502 23246173 26233178 28599578 28771723 26410256 22261568 17999406 14476924 11892476
17494 11892476 9917502 8424149 7187006 6215778 5424553 4757007 4275553 3944990 3664041
17485 3664041 3430973 3299874 3262995 3199743 3209958 3256010 3176125 2985758 2761344 2488786
17475 2488786 2240755 2037547 1927195 1804520 1707151 1656214 1592859 1494710 1449576 1441680 1396361
17464 1396361 1386893 1427476 1490823 1412528 1317479 1260721 1232138 1195542 1192689 1171575 1125839 1161070
17452 1161070 1199903 1148897 1081924 1121798 1129065 1181208 1227176 1295961 1357347 1615256 1914760
17441 1914760 1938169 1480757 1151003 1040293 914553 852072 824565 736392 713956 762979
17431 762979 710527 668553 616035 622082 605573 528425 515701 499115 540235 566804 591825 534994
17419 534994 495128 510038 510384 467646 460425 445100 406269 454780 414046 382099 372948 371327
17407 371327 449849 433294 384417 412137 462127 463373 479460 433346 377132 398556 381885 399025
17395 399025 419259 538490 601379 573657 571962 538956 548852 534855 543681 497632 451855 416845
17383 416845 386675 283075 268700 254679 200721 162457 160559 191367 303264 383191 362075
17372 362075 300246 254941 249672 233578 188403 224577 225384 260680 189460 191531 210235 222786
17360 222786 182403 138371 125764 196431 243265 255658 325323 356548 361806 334442 361648 328242
17348 328242 242364 207117 193191 191698 218483 204100 216448 303072 372376 396025 314054 223227
17336 223227 157053 188361 181728 198463 204957 160295 96789 63999 73730 157157 169451 222920
17324 222920 308399 289927 273212 225817 133709 53496 77918 62302 56295 38154 54039 70160
17312 70160 22513 30112 49061 14406 -23002 -70751 -141303 -69772 -17492 -15061 29991 72626
17300 72626 87213 14108 -7855 61331 99013 114012 64351 96556 208954 224120 243862
17289 243862 259930 237485 183747 119164 190700 176958 127587 82323 32036 55774 90875
17278 90875 154285 153954 183644 180201 143345 147060 132975 135969 171604 179486 119116 93047 -7525
17265 -7525 -30940 29872 53822 112694 137739 106713 35759 -27645 -52946 -22378 -69401 -39889
17253 -39889 -46156 -26019 -35094 -23702 10899 85546 57962 -14234 64438 21809 -26974 4548
17241 4548 15575 -5540 66368 93615 72737 54627 77744 120839 109590 91650 92285 35906
17229 35906 -2764 39094 111723 155054 111187 61086 106435 90126 118182 139503 143252 121338
17217 121338 88256 123230 235044 213200 115009 47107 57400 81454 109072 63853 35520
17206 35520 99138 112331 52029 -1615 -11248 38392 98906 92504 66958 28032 39172 18748
17194 18748 21 -11169 -41808 -43422 51475 57600 13554 14497 11840 64537 97660 88522 88003
17181 88003 97395 97431 85763 60575 -58127 -27935 -6768 -3832 -16635 -49674 -18801 -38430
17169 -38430 -101206 -102766 -72283 -18149 26273 82184 173070 183657 136038 100860 94312 124059
17157 124059 163015 129507 85714 65416 102449 104882 90573 90192 69270 1726 60522 25305
17145 25305 32526 71153 37481 77538 81444 10085 -33446 -35860 18246 90448 115466 140897
17133 140897 137074 52070 60673 98045 133609 110433 61495 38016 88054 101603 23599 80766
17121 80766 142260 73611 3088 -54169 -58739 -42222 -79294 -107480 -20186 -13944 19475 -4851
17109 -4851 -9320 -1814 -14061 17355 1354 -6331 -6121 98803 122201 48800 54801 111422 58528
17096 58528 1147 15904 -9824 -11746 91171 195748 198367 200218 204533 177399 194973 188884
17084 188884 163427 110007 122154 184015 316778 440567 555043 689523 793270 777701
17074 777701 814195 766397 794788 822910 728109 571326 454984 425062 468616 509241 552376
17063 552376 677170 819770 903231 819810 716447 581409 479475 309998 136799 86335
17053 86335 101508 122985 105485 94052 121953 158239 171307 149059 143770 191458 248472 238213
17041 238213 219110 239453 260125 259152 218323 195775 113844 103538 156805 202879 315885 498568
17029 498568 612611 632859 650098 751992 766617 838073 922976 981380 880382 749769 742669
17018 742669 667111 576554 443356 325670 273528 295953 288081 243813 268135 284213 343711
17007 343711 437217 504794 539840 596106 635652 585596 569274 538558 455274 330918 201144
16996 201144 160208 71155 10605 -25937 -24303 -128238 -148563 -72703 -42505 -65810 -31526
16985 -31526 138006 206262 79720 56090 126465 105748 55902 26595 80181 20180 23738
16974 23738 116019 164952 215862 184708 149337 76159 74964 72782 40782 -25904 -71913 -54924
16962 -54924 -84139 -108895 -8488 14006 -7005 -71878 -15243 51825 83872 -6733 -68362
16951 -68362 -19050 35015 46692 58503 106318 136480 122872 66531 -57475 -86079 -37757
16940 -37757 11180 -66465 -68937 -78167 -13544 17144 20593 -7356 20677 -25637 -82132 -94632
16928 -94632 11468 4381 54876 43328 83513 69449 50026 1403 -14366 22609 72904 87104
16916 87104 38187 23501 -84876 -124234 -110627 -74986 25544 4943 -39115 -96169 -100494
16905 -100494 -71659 -88637 -12644 64087 46038 -6203 46287 -14141 -28679 -4679 21083
16894 21083 7188 -73054 -37283 35332 23599 6632 2403 -69399 -131069 -94008 40589 58078
16882 58078 96152 92721 48977 7387 64693 141762 101357 24747 19503 45145 31834 25116
16870 25116 40727 35992 32340 66139 19651 32899 70940 -15964 -35968 -7441 -25518 14470
16858 14470 27550 44063 24511 74441 57429 1083 -36477 -65650 -90464 -94675 -26204 1631
16846 1631 49565 58931 29332 -48035 -20742 2143 28269 8067 14681 9692 -35082 6735
16834 6735 36061 42903 -51436 -21473 -4131 39881 47230 7207 -65780 -81033 -39410 -9818
16822 -9818 -18669 -92829 -137798 -170130 -190106 -153302 -37081 -16800 -57624 -81262 -82799 -109613
16810 -109613 -167326 -187915 -117158 -51807 -29841 -81191 -51668 7627 -14702 -75270 -72682 -38738
16798 -38738 47198 54321 38296 26789 -4844 -75528 -53340 -6227 43643 81078 43801 25957
16786 25957 12743 -24737 -34434 -27647 83952 97829 60077 63505 53096 38013 27674 29084
16774 29084 22239 -38749 -75619 -125391 -115761 -61202 7993 43828 87372 99909 83126 56012
16762 56012 61027 31262 76270 121231 71725 20958 -24396 -19907 -12722 -75494 -92337 -5290
16750 -5290 31144 102159 112155 60544 -18646 -38528 -10244 -15077 -8961 -45894 -126143 -96237
16738 -96237 -108828 -71656 -83026 -79405 -25329 -60045 -63978 -11436 9362 47181 4147 14997
16726 14997 52848 -9773 -1611 -908 525 -4762 14282 13355 9018 7257 84589 98337 91164 -6930
16712 -6930 -9851 33865 -47908 -18595 -22605 -5602 -12897 -21447 -22168 -68460 -69483 9726 29324
16699 29324 -47349 -30911 -68786 -53847 5112 -10432 -7742 -62356 -34894 86664 114898 89415
16687 89415 79649 127084 52156 -23909 -20731 27752 -13173 -73619 28362 86164 77763 70339
16675 70339 60015 -60749 -59456 -62557 -127360 -113773 -66068 -56517 -66208 -81271 -49188 9704
16663 9704 24272 -74472 -106872 -55778 10454 59730 121648 125079 34897 -30353 -12289 9214
16651 9214 -9974 -3930 3587 -46542 -69034 -87328 -65536 -85125 -49589 -17785 -18582 -13557 -73313
16638 -73313 -101544 -66422 -122653 -120251 -55075 20017 42774 -19728 -42274 69875 81216 64820
16626 64820 37216 -28556 -12367 114588 161813 143579 166633 68201 -21598 -10548 21292
16615 21292 -11360 15876 66429 95369 53718 6499 -16731 2008 -33368 2930 -15949 -39236
16603 -39236 -33306 8352 12074 -5831 -32097 -57040 -3834 79625 65914 68732 55819 -9736
16591 -9736 -54865 -18043 23517 -422 -17083 10401 33645 89793 79899 108238 140321 75493
16579 75493 13252 -17867 -16307 12200 -23690 -55361 -40606 -37089 -78333 -60781 -56042 48858
16567 48858 16921 22656 -10637 -1268 -66172 -23353 -89973 -145642 -170923 -120901 -81478 -35534
16555 -35534 -3209 9198 16012 -12629 10315 50971 100334 66059 34615 -25533 -39716 -17283
16543 -17283 -24377 -67070 -144184 -126436 -46423 -22692 -81220 -108394 -135370 -77513 -54004 -23647
16531 -23647 -6311 -19051 -72113 -16764 -9958 -25891 13818 12988 -56064 -51778 -34448 -10116
16519 -10116 28144 64618 47747 -29858 -80020 -34788 -48822 -70394 -33086 -19900 -1510 43187
16507 43187 7542 -25163 -58427 -104212 -173766 -171535 -84526 -8133 -35348 -129015 -40751 1816
16495 1816 -43390 -32542 -26526 -1754 2995 10492 28931 43821 58521 49107 59064 -51312 -154775
16482 -154775 -158590 -125285 -63655 -14990 25387 25000 -40552 -99452 -21171 3368 -60044 -113027
16470 -113027 -23239 -20790 -72335 -105320 -56794 -102765 -146766 -50975 84250 101330 71856
16459 71856 77286 8785 -29248 -54164 -43036 -52809 -59915 -72091 -38732 -6212 44880 74059
16447 74059 56048 -37466 -13024 9387 7226 30217 54079 37469 -83363 -78304 -69195 -93436
16435 -93436 -83650 -92756 -96409 -82036 -15905 17451 -139236 -183547 -81789 -39352 -1061 21719
16423 21719 48819 -13911 -8272 -36949 27302 55859 6313 -51027 -24418 26881 690 -6633
16411 -6633 35296 67048 90705 123810 116555 52453 34438 111832 178067 151178 109611 125923
16399 125923 40143 2915 111363 123129 43835 -2555 13567 24472 -17567 624 76983
16388 76983 62164 100019 73729 64070 30220 -61144 -99975 -63972 -3385 99667 87168 -9281
16376 -9281 -26298 -72190 -94669 -93342 -151674 -146166 -92128 -84451 -131426 -145800 -126671 -92581
16364 -92581 -47929 -110903 -64483 -30541 -38427 -29759 -94365 -123132 -69053 -21207 -4545 94299
16352 94299 68358 18324 84428 86349 49379 59431 76864 67879 39817 15134 -4470 50917
16340 50917 4263 -18731 -15531 -52413 -111122 -102698 -72043 -148959 -133725 -49717 46406 37101
16328 37101 33712 -23678 -161409 -127341 -84933 -66253 -35793 -48930 -11553 61278 115923 32482
16316 32482 29826 56542 59551 39271 28712 28512 13850 67111 35311 -33106 -62307 -18851
16304 -18851 24716 63696 122358 114671 47782 95398 127217 55148 122302 138007 71104 73044
16292 73044 22935 19528 59274 53576 -17993 -26818 10118 44887 142189 139607 121036 95628
16280 95628 65048 53839 15260 -42509 -4850 27101 10095 54885 -3175 -46554 -26539 -40386
16268 -40386 -54093 -81390 -79625 -72570 -40400 -48329 -67963 -56155 3988 -74601 -58445 -16119
16256 -16119 30939 -3490 36793 57028 -19617 -79593 -58018 -108402 -104443 -110769 -81619 -46784
16244 -46784 25335 35800 -20998 -42362 -60226 -73350 -13243 43026 -8014 -51791 -83907 -110957
16232 -110957 -96835 39408 114993 30907 46004 78519 83291 70838 -1160 -89344 -93790 -152508
16220 -152508 -74872 5133 42434 61306 17839 -35788 -115987 -85507 -62415 -18205 -42741
16209 -42741 -32135 76995 95195 87103 32434 44315 -1183 -3211 10235 60394 42962 23492
16197 23492 -9309 -63608 -219693 -182775 -78715 -12331 19958 79144 24356 -115557 -156345
16186 -156345 -138471 -43484 30087 45001 41474 38361 6129 19562 16171 -67940 -99639 -150470
16174 -150470 -98137 -56965 -96494 -99258 -151776 -44801 2849 -92981 -124676 -79573 -96148
16163 -96148 -106414 -75950 -16318 -27507 -95976 -125327 -70729 -7539 -37225 -15656 12705 -2338
16151 -2338 1188 26031 -10645 -81171 -104356 -43091 11416 21653 39529 48888 50304 53668 47657
16138 47657 9678 -65795 1350 71362 133406 81187 -6360 -137826 -161192 -63100 50087
16127 50087 74668 36242 17106 62073 96385 64292 3328 -44653 -119414 -101333 -56756 -89486
16115 -89486 -90308 20392 55493 25293 79798 95379 86020 51585 -15063 14749 81213 39034
16103 39034 -39036 -113077 -156905 -99617 7747 70775 12458 -82784 -76703 17210 40515 18351
16091 18351 -16283 -65743 -42649 75670 132760 64850 31786 37657 25559 106467 51204 34633
16079 34633 8349 59716 46869 40069 59140 50699 -12298 -102544 -99815 -65737 -95610 -127893
16067 -127893 -120840 -47634 45188 94698 120717 -32513 -128425 -144047 -159358 -131695 -22155
16056 -22155 -36496 24471 69269 52934 -26179 -65713 -62312 -46048 -71263 -90349 -102688 -131347
16044 -131347 -119408 -172284 -119738 -20824 30184 92495 6458 29233 34437 -26155 -75679 -151075
16032 -151075 -164951 -193297 -111341 -33179 -28958 -122576 -160123 -63113 -50053 -23038 5965 3640
16020 3640 -9678 -52983 -87357 -41082 12521 10159 30564 67297 79171 42806 -28904 -61960
16008 -61960 -78349 -29814 21049 52336 8100 42155 11613 -31895 -51401 -48659 -27642 -63653
15996 -63653 -51342 -62015 -29596 -73047 -29274 76098 81019 84151 -5209 -78784 -104546 -89961
15984 -89961 -25157 12996 33986 28513 -43950 -94136 -33343 1345 1548 35724 18958 9257
15972 9257 -687 -19402 -68906 -138377 -150447 -91378 -78763 -91433 -12299 14515 66937 68495
15960 68495 41257 48466 42759 -142 -44117 -154747 -108401 -99364 -31376 23905 45556 55826
15948 55826 53618 45378 15595 -18541 -4651 -10755 4384 13983 -8473 -43385 5597 -790 104775
15935 104775 48775 -100196 -101214 -67152 -48640 39825 89647 27079 11565 63320 57354 52464
15923 52464 82789 152039 73989 42416 52262 -47831 -40367 72146 49689 -12374 -6051 13466
15911 13466 2339 -35898 -42706 -14607 -10433 3032 -65958 -79402 -63532 -36874 -29980 -12274
15899 -12274 6806 10791 28082 72348 97393 57903 -20067 -88102 -3516 77430 64307 44475
15887 44475 48391 87471 103941 36495 76595 75868 17977 -58178 -24605 -8986 -59769 12849
15875 12849 -28826 -56485 -29149 -12485 -39804 -65496 -26132 37106 35746 35348 30306 52497
15863 52497 17220 -31041 -17075 -16866 -40009 -11589 -51797 -94577 -104916 -115881 -96789 -77373
15851 -77373 -30628 -59876 -131795 -144571 -179848 -137611 -108244 -68116 -3967 -36991 -107293 -115966
15839 -115966 -165971 -203507 -146928 -94678 44476 137796 96143 28866 15061 -14643 -13309
15828 -13309 -20224 -26150 -41410 -40603 23385 11815 -41886 -69245 -22919 12571 23423 35249
15816 35249 -28459 -87523 -21649 -11661 13750 73679 47212 15371 -62500 -50018 -94163 -63800
15804 -63800 12535 58009 -18012 -81705 -28793 3817 -32191 -32164 -51223 -10859 -75262 -154601
15792 -154601 -59757 -52645 -78165 -61050 -58950 -11216 5541 34082 45756 9214 8857 -606
15780 -606 -16750 -38273 37237 102630 97126 63194 54439 25576 63989 -8792 -95371 -160885
15768 -160885 -143642 -61714 -2198 36646 -47063 -32391 23057 35965 61176 133298 86682
15757 86682 -38422 -76940 -35743 31916 71608 17023 -37066 -52943 -11250 23694 38031
15746 38031 109244 43436 -61645 -80160 -16115 54077 81133 55662 -14769 -95506 -82047
15735 -82047 -72228 -66349 34750 63217 7419 39496 94994 71348 28373 83893 27960 -9951
15723 -9951 -28169 -61152 -86500 -76094 -19732 -28310 -65449 -64468 -85186 -167337 -130283 -60034
15711 -60034 -44749 -37924 -30399 35387 102026 86284 54993 54656 40945 -120378 -202260 -221520
15699 -221520 -231497 -192881 -138373 -44784 -240 -35843 -21427 700 72628 80073 48900 53581
15687 53581 83818 105234 86282 71550 72821 31283 72166 46355 17433 -69405 -94393 -54887
15675 -54887 -21826 -17758 -77993 1561 -20663 -50662 1019 73646 84268 54615 10957 102906
15663 102906 75462 66891 78710 45181 55572 48680 26243 -17231 -65648 -28647 -7706 -8613
15651 -8613 -13290 -2 -70444 -70733 -39329 -14911 -6658 -60840 -66921 -11975 -33101 -9341 62935
15638 62935 24123 -2284 -60613 -115753 -119424 -83116 -103055 -84935 -35420 -10313 52798 49115
15626 49115 45845 58470 51723 26181 -51941 -36574 -4841 22940 52626 3976 -32877 -96468
15614 -96468 -67423 -3642 21489 99096 58458 52985 37758 91590 56626 13686 -55781 -65251
15602 -65251 -68542 4104 10559 24023 65427 3552 20819 43178 58341 39428 52359 52825
15590 52825 41393 41812 95829 103228 54716 -5599 40239 10031 65614 98777 51315 -4015
15578 -4015 50142 66013 83689 54849 49452 48920 13337 50024 71155 47484 6845 -79333
15566 -79333 -47480 72538 80634 45973 13514 38397 66427 26994 -20371 -56495 -109245 -45828
15554 -45828 22141 89103 111815 -4161 -14272 15590 20270 65069 21972 43193 -69549
15543 -69549 -107398 -120243 -117603 -138821 -89282 -52745 -125866 -269325 -256371 -181053 -182185 -88055
15531 -88055 -38125 -6741 -38881 -16941 -36196 -57658 -69622 -13808 18179 15460 -59465 -66124
15519 -66124 -66833 -62560 -51211 -76904 -99284 -53965 -54900 32260 74069 10003 -36105 8390 -33593
15506 -33593 17929 41062 27227 6519 -59056 -72110 -67840 -53379 5493 -64066 -81756 -88101
15494 -88101 -87680 -44680 -45192 17394 20362 -20147 -46191 20164 83159 46329 33198 19192 -55759
15481 -55759 -118042 -81897 -59807 -40558 -67694 -119669 -66561 -33349 -37149 -52318 -66712 -25970
15469 -25970 -23643 -47824 -65980 -39916 -62254 -114555 -103855 -35162 31979 -34216 -127100 -139740
15457 -139740 -125061 -71656 -20426 17417 55599 47441 10837 78796 120400 86217 43826 4095
15445 4095 -61225 -25579 -36368 -30209 13554 54261 49630 81440 112315 -5896 -47995 -120543
15433 -120543 -122459 -39095 -31356 -52007 -134345 -208862 -192349 -144086 -109858 -67775 2737 46215
15421 46215 24834 26893 -58398 -91858 -185991 -176139 -151904 -74999 -26517 -87354 -89989 8356
15409 8356 -2339 -24661 -88906 -154103 -133374 -124606 -45433 79056 61553 4562 20925 35682
15397 35682 55973 85576 106741 163393 137152 134980 107018 58135 42270 -9640 -70220 -115520
15385 -115520 -93748 -60816 -27516 -39845 -81952 -74020 -22851 -44148 -118503 -63989 34040 10964
15373 10964 16784 120247 118635 136853 103305 22196 -10777 28551 6919 -57809 -86832 -88265
15361 -88265 2124 49808 23846 31752 -39778 -7478 25022 56900 65144 82966 3975 -25030
15349 -25030 19752 29759 66047 85919 126635 117063 49854 -42476 -89993 -39802 -37257 -90364
15337 -90364 -36804 3051 -53111 -44052 -89303 -35474 62738 90040 46390 17294 29806 15221
15325 15221 37549 11900 -90927 -116783 -113338 -40069 36818 50776 -24718 -129174 -105618
15314 -105618 -34083 -78811 -8575 14965 16860 40563 61527 -21290 -89419 -3081 63018 155726
15302 155726 87699 13678 -73689 -97012 -24890 -38643 -24240 21208 -4713 -15247 31014
15291 31014 -6318 22411 -22146 -46179 11747 110660 105429 161391 128900 97409 144040 136935
15279 136935 60138 -12452 -81803 -184834 -96839 -38811 16616 42883 25429 40297 106747
15268 106747 129711 123167 144141 152889 62870 -25150 -107890 -173046 -104013 -118232 -69736 -2150
15256 -2150 25364 39992 -3807 18416 23923 -12059 52192 -21934 6736 100841 91551 55788
15244 55788 -14989 -86208 -96457 -108679 -138895 -74678 33887 113203 59254 16954 2038
15233 2038 -75431 -29074 -28201 -60846 -102392 -70201 10819 -37953 -49242 14615 57942 -44849
15221 -44849 -71889 -41511 -37384 -41050 -64121 -87562 -6722 15032 11294 21505 -18906 -20956
15209 -20956 -16275 60249 65473 3423 -12150 21234 24272 -5996 -2731 45243 25332 -133336
15197 -133336 -161124 -131519 -71703 -69019 -72575 -56959 -44988 -9751 -471 -14847 -68363 -31166
15185 -31166 12967 -65454 -74216 -55736 48098 41893 38874 38471 -9476 -26042 -20515 16140 29572
15172 29572 -1460 -24381 -46855 -25792 -31459 12839 57348 73318 53653 -1213 -74682 -69396
15160 -69396 -87825 -74998 -32471 27043 -45113 -77628 -48280 10555 29277 10749 48094 87870
15148 87870 134045 127507 127750 89786 106088 153715 107233 44087 -9134 50315 26344 -32972
15136 -32972 -68401 -56593 -37300 -23676 -13889 -9525 -26727 -60956 -71435 -89824 -98648 -104507
15124 -104507 -112053 -83666 6403 10903 -93421 -203495 -247998 -247856 -183463 -141368 -69986 -35585
15112 -35585 18258 39126 27094 -32410 -54092 -42751 -70422 -75593 -45455 14962 113239 137601
15100 137601 61853 -35103 -66982 -150557 -133647 -56939 29026 -1947 -36763 -7418 3426
15089 3426 -13556 -42837 -28150 -13360 -17404 -13786 -29518 -36146 -31715 5765 -7759 -67274 -68482
15076 -68482 -121587 -109316 -60037 -16718 19080 55418 23913 -9230 -84781 -130710 -88518 -23502
15064 -23502 -17751 -21544 -50136 -62116 -94149 -119038 -91633 -100696 -100255 -46894 -34755 -28480 -27052
15051 -27052 -7978 -5711 98775 150397 40362 5240 -76119 -25784 2909 74416 89257
15040 89257 92203 71023 11061 9953 -94384 -141777 -165736 -143836 -177018 -92831 -101261 -144197
15028 -144197 -106716 -44197 -97791 -129573 -109073 -127011 -145315 -164366 -45958 59983 96332
15017 96332 115258 145962 119376 64477 33838 -8465 -34792 14126 29070 -3810 -68179 -49102
15005 -49102 -12955 -23630 -45833 -2562 -29926 -1619 38393 40831 4951 -31350 -15887 -55320
14993 -55320 -49532 -38661 19768 3098 -100348 -142195 -100391 -4963 41212 19238 35663 -8221
14981 -8221 -62719 -46912 -94602 -60495 31149 59902 114087 12999 -15704 -91941 -30347 69349
14969 69349 38783 -48971 4978 55560 -20948 -16979 12837 57248 48105 26245 -21671 -33781
14957 -33781 -34993 -67957 -142542 -51153 4202 -25205 -6369 -48311 -48547 62129 81236 123967
14945 123967 55076 -72510 -90852 -31285 -32000 -16706 -55287 -32272 -24174 -36778 -25245 16488
14933 16488 -12678 -32186 -101487 -62609 -26222 -20855 29338 -9063 -84680 -63424 -31375 -141783
14921 -141783 -214264 -196638 -156699 -144074 -66683 17124 63435 32824 7818 -56292 -148917
14910 -148917 -81709 -42176 -32676 -25508 -20006 11125 14322 21026 68351 116778 127027 -2801
14898 -2801 -108408 -79996 -94156 -80359 -32349 -68706 -106221 -75738 -42287 -38870 -16174 -5813
14886 -5813 44688 5880 -38734 -20826 3181 -30622 -46548 -46160 -43992 -53909 -97397 -53486 37992
14873 37992 23413 43776 21877 -33467 -38101 -11614 -74150 -124913 -79153 -24575 -38867 -48380
14861 -48380 -36473 -47564 712 -9477 -73359 -47196 3444 -11679 -46996 -47798 21646 56839
14849 56839 30770 35977 -5951 -3283 17661 -3255 -51233 -36759 23521 208 53211 20783
14837 20783 1093 -36883 -58858 -91795 -97298 -12689 31304 11199 -89372 -95704 -118111 -53685
14825 -53685 52977 10891 4760 -2573 18716 67267 94665 31023 -33974 -80811 -81731 -142013
14813 -142013 -171907 -79405 -7071 -22809 -40218 -59223 -106592 -117335 -87369 -78863 -26398 38730
14801 38730 27804 -58940 -65473 -77275 -48325 11552 1863 -21032 -2529 15437 -13046 -22727
14789 -22727 103154 104038 68856 92536 65001 40847 52369 36011 26242 23275 40741 -6548
14777 -6548 -76599 -95388 -111479 -135368 -41254 7329 21739 8648 -49049 -82684 -5681 53957
14765 53957 45021 35814 26384 58887 31832 16431 -13558 -1424 17897 25610 23958 15780 5658
14752 5658 -2331 63803 37900 -27270 -51239 -72854 -81032 -26796 50678 50875 -7970 -17952 12020
14739 12020 -46642 -50219 -55189 -14754 65242 64963 -22647 -39782 -78541 -151024 -151856 -80448 26897
14726 26897 47583 -28377 -32085 8788 -3671 31098 -21105 -12191 -22582 -56336 -59900 -36682
14714 -36682 -17316 -65573 -180115 -152622 -58344 2975 19867 15752 47621 20912 21148 -12980
14702 -12980 -91233 -41101 -70914 -32440 11009 -7208 24966 37177 55900 59584 58119 67983
14690 67983 -3464 -4350 11115 2111 -70356 -106683 -9617 49769 51733 63075 111722 67758
14678 67758 4902 61900 91701 100437 128254 113423 93295 97346 879 37832 21864 -23606
14666 -23606 -1669 127321 172595 72735 -1993 13997 -51785 -48140 14401 -18067 -46366 -41920
14654 -41920 -41507 13258 48646 53284 95171 36636 -73482 -140693 -130641 -145667 -125123 -47013
14642 -47013 -817 65190 52726 83923 73962 -40042 -124131 -209195 -127867 -93976 34957
14631 34957 50847 61181 -9316 -80663 -72941 -16447 52694 105923 52958 -63863 -77200 -33740
14619 -33740 -87711 -93561 -61167 -33718 -85983 -111093 -111066 -49764 -47995 -104072 -91625 -77267 -136212
14606 -136212 -78262 9164 5999 -13764 -66288 -65071 -78624 -36557 30718 57509 19888 -35312
14594 -35312 -88555 -117979 -71077 -36772 -13598 -74980 -86751 -79249 -70990 17580 102827 117074
14582 117074 147692 127018 98479 61244 -4367 30970 -6199 -75038 -23983 -14079 -115808
14571 -115808 -195846 -143845 -47143 -15513 -47077 -24822 -18657 -43756 -31533 11284 -14662 -1814
14559 -1814 37698 33745 -11215 -37436 25482 68914 114751 147133 60830 40003 37598 57559
14547 57559 31771 -21384 -38618 -84852 -186564 -180767 -65323 -5417 -22978 48334 46034 -29105
14535 -29105 -48325 -33866 -49627 -41620 18800 28971 22882 34209 65672 36892 88471 83460
14523 83460 50009 15325 -58806 -66241 -23549 -5007 8166 -44185 -48056 -32438 1662 -35461
14511 -35461 -88946 -60234 -25464 -41230 -81378 -80641 -13082 3408 -59334 -110470 -77987 -100890
14499 -100890 -67804 -17181 -15585 -35349 -80684 -126449 -100300 -21543 2073 -10024 23738 89738
14487 89738 67271 37766 8173 87230 150161 127900 52969 45237 47045 6581 15336 -18873
14475 -18873 -99078 -71714 5936 39398 3475 38598 50009 572 -2645 67866 121102 124499
14463 124499 108948 101354 89962 65751 9993 5236 -10627 -13990 -1081 -11149 850 32338
14451 32338 37494 -14992 12904 8405 -12169 4254 -44028 -104410 -67522 2631 50978 73967
14439 73967 46455 13796 -71451 -117632 -39913 -9370 -95640 -148865 -81235 16447 106150 55046
14427 55046 -61319 -57303 -26940 -26482 16079 2635 -20277 -20708 -74317 -80374 -30732 18432 -123199
14414 -123199 -167146 -86286 -112769 -133485 -141328 -111519 -27722 44192 36654 44174 44142 24370 14999
14401 14999 72686 104379 45880 -32403 -14804 -14600 -16283 68534 92366 139765 165111 200845
14389 200845 184788 240577 343832 369330 391383 364974 414220 513511 598488 755419 805699
14378 805699 792773 736900 787791 830761 840025 803269 769387 768219 760021 770147 699252 696112
14366 696112 776994 794438 796445 758627 708674 731667 753580 762465 642120 632786 741316 764371
14354 764371 777475 828065 899675 905907 897228 952852 927220 859977 835425 774183 706242 724160
14342 724160 620483 517501 497874 406325 297647 223554 274342 336318 355327 342538 300952
14331 300952 198505 131323 51351 7364 -16589 -8205 -104913 -54916 -39055 -71907 -59737
14320 -59737 -24315 29344 54983 -1402 1917 106067 84038 96959 153680 165930 150296 86334
14308 86334 49460 9851 26440 55624 45033 28127 -62209 -51267 -14027 32240 -14765 -49785
14296 -49785 21451 42594 30512 25762 42404 35377 -43328 -71501 -75974 -80148 -52618 39125
14284 39125 -7430 10653 20210 7797 37625 38827 9373 -43707 -69083 -13907 -6107 -36948
14272 -36948 -19190 66825 76365 -5203 -32527 -39673 -100182 -98400 -118466 -124904 -8859 64008
14260 64008 98269 58440 41925 55856 98577 91957 39090 5117 40681 38297 14654 -13143
14248 -13143 -14880 -38292 36306 50183 31860 40369 89348 154315 80727 88690 103453 163387
14236 163387 176242 114510 105501 145217 132115 104471 56540 57018 89511 51490 16801 38793
14224 38793 109273 51237 16405 34384 35199 36494 53411 87976 70643 478 -5422 98366
14212 98366 158647 182225 225956 249696 268266 300753 251970 149669 135080 38326 15663
14201 15663 -6151 -65728 -17912 52905 120533 126574 133591 225823 187827 177218 185757 280564
14189 280564 361611 371554 391253 367616 425741 443400 361926 277950 144656 93288 97251 48269
14177 48269 -24708 54036 141645 125230 101392 174556 170984 188990 316209 290875 285804 286982
14165 286982 290212 368558 427407 494358 485547 492483 440235 367802 292959 237024 183180 135602
14153 135602 149825 140367 85819 87049 105093 151226 153058 109199 91039 182904 277902 340825
14141 340825 335425 320037 300366 315908 354148 356478 393107 397692 377270 341835 344371 313790
14129 313790 206954 170131 133952 80464 43588 25672 77 58776 66462 60222 42524 87001
14117 87001 176213 199419 228142 258676 281303 242812 320040 410663 399872 298519 194598
14106 194598 74564 129517 153906 123706 115017 97859 69138 38129 11968 66412 57996 84521
14094 84521 89683 3730 -99092 -48738 86095 172854 316115 179612 78136 18668 10605
14083 10605 -18556 -24363 -21644 3034 -33050 -48064 -37523 14163 105273 222257 195371 206876
14071 206876 214449 201526 167311 150055 144018 170155 134662 173829 290110 305184 292289 226986
14059 226986 205405 132097 92382 192270 230453 221346 203190 259049 244942 219982 194741 213829
14047 213829 258152 256740 161248 152178 182392 175966 191786 134485 133199 154969 124265 171449
14035 171449 199932 171374 197916 229897 238796 202664 260565 324731 346710 301096 323939 386224
14023 386224 359524 379837 352036 352349 331002 282560 309600 392169 398124 286555 292046 289248
14011 289248 377868 392735 392311 435129 510826 505384 544461 582219 660059 664295 586230 568754
13999 568754 657897 662990 592955 613102 644924 667646 788612 818494 870732 904199 960152
13988 960152 1097261 1221103 1292077 1332886 1418509 1581489 1647943 1633721 1658955 1723017 1852824
13977 1852824 1935747 1981007 2077069 2251202 2444461 2605383 2721862 2868868 3148567 3414158
13967 3414158 3724768 4029577 4378195 4672547 5068454 5495502 5913679 6424268 7032140
13958 7032140 7688800 8380514 9189092 10148587 11224782 12438925 13787978 15263850 16933781
13949 16933781 19002656 21300347 23911595 27004004 30502554 34409150 38845177 43920155
13941 43920155 49680624 56159692 63342841 71228731 79715265 88750743 98105180 107410925
13933 107410925 116391200 124661993 132027348 138288822 143241652 146731621 148711926 149457688
13925 149457688 149072797 147689352 145696853 143290402 140718159 138072788 135749523 133814797
13917 133814797 132221666 131043051 130397970 130293768 130578160 131436569 132761745 134506274
13909 134506274 136669076 139349605 142274592 145169419 147866461 150240716 152079466 153094402
13901 153094402 153038813 151604692 148703125 144317339 138539319 131564868 123521636 114771210
13893 114771210 105616413 96363983 87314270 78827734 70747939 63266022 56516704 50492576
13885 50492576 45066388 40258307 36026422 32357919 29092109 26134692 23533994 21221616
13877 21221616 19226930 17495208 15985192 14585242 13283940 12166320 11169580 10264982
13869 10264982 9403478 8713035 8092559 7482968 6965317 6606264 6260130 5849566 5534680
13860 5534680 5336610 4992467 4662609 4437390 4258265 4056755 3832022 3657471 3484653
13851 3484653 3259781 3087872 2964289 2829527 2655270 2571891 2487112 2449526 2410857 2324487
13841 2324487 2290954 2246308 2166067 2053307 1952996 1881255 1866232 1835199 1723378 1591814
13831 1591814 1530914 1533171 1579003 1636795 1563587 1494739 1428048 1357712 1329709 1271688 1236679
13820 1236679 1232545 1149231 1197241 1298448 1326844 1221103 1228603 1318348 1350016 1321071 1377229
13809 1377229 1366358 1367311 1366416 1451168 1557864 1517831 1515671 1531358 1598987 1713150 1828778 1985475
13797 1985475 2185084 2320960 2645561 3035787 3589869 4358681 5446809 6829483 8564368
13788 8564368 10680817 12959915 15197614 17054583 18203664 18431081 17803636 16403103
13780 16403103 14554603 12445872 10455747 8861134 7695129 6969058 6511261 6285203
13772 6285203 6245789 6311292 6720272 7470134 8609928 10290403 12598654 15667440 19547336
13763 19547336 24017915 28625863 32729405 35736208 37083727 36508277 34128108 30420627
13755 30420627 26197782 21936561 18113090 15079427 12796458 11220248 10239189 9747911
13747 9747911 9553575 9704131 10254256 11242488 12806575 15323815 18774906 23493089 29573861
13738 29573861 36471184 43507311 49841623 54495978 56488910 55491961 51781519 46062954
13730 46062954 39486352 32878627 26913518 22059747 18582929 16180168 14640784 13792423
13722 13792423 13471086 13743441 14521730 15983140 18317506 21776389 26785492 33674327
13714 33674327 42192249 51542037 60758644 68634678 73785564 75262085 72717739 66746477
13706 66746477 58556432 49481411 40533042 32620294 26351769 21848975 18729329 16532541
13698 16532541 15059245 14187392 13949847 14220083 15046409 16723642 19439767 23348392 28530484
13689 28530484 34819408 41798128 48548082 54038989 57275380 57596343 54991415 49973232
13681 49973232 43421852 36369639 29728686 24076941 19557799 16267184 13992860 12341809
13673 12341809 11152629 10466106 10248288 10320789 10788136 11767716 13536043 16212934 19832347
13664 19832347 24177285 28946235 33446283 37044557 39127829 39293589 37535171 34108250
13656 34108250 29693181 24948035 20349917 16381440 13278403 11031218 9434301 8311779
13648 8311779 7502313 7000386 6662608 6526154 6865672 7539342 8539580 10033002 11928481
13639 11928481 13995493 16054381 17933886 19328963 19881117 19422796 18057138 15978020
13631 15978020 13645899 11277123 9135003 7312188 5874234 4844423 4128786 3574594
13623 3574594 3121586 2704040 2381510 2091574 1852383 1670914 1613191 1538629 1397505 1371936
13613 1371936 1371016 1359128 1248509 1148797 1036924 1041465 1029322 962054 840730 819337 803660
13602 803660 757767 775767 793403 818619 789632 697419 590889 571611 575343 619710 636588
13591 636588 572661 522557 491142 509007 541977 529220 541180 520407 461829 459272 531260 482676
13579 482676 423401 377173 336332 372578 335038 407342 395641 340938 361441 356486 338756 428584
13567 428584 513571 468860 356444 284619 350621 382040 395167 437196 430725 386004 339589
13556 339589 330410 374965 359725 377644 431956 352974 341239 282320 222589 223463 246911 235570
13544 235570 162651 231744 304270 301176 262499 298111 399410 372927 330040 382094 336576
13533 336576 351187 347126 339818 312388 402920 410553 288453 301606 297690 332968 286576 285427
13521 285427 344103 282257 248806 212500 135285 127170 170719 203989 263590 243376 214683 226035
13509 226035 258394 296943 353240 360279 415488 467843 398681 325245 303479 274611 272094 241888
13497 241888 234665 330345 345341 340476 359514 388511 419803 405813 408365 460149 484934 527878
13485 527878 568826 617800 660872 738499 856458 881752 904371 892583 834476 844638 883894
13474 883894 925361 980556 969897 999715 1008747 994642 1011566 1053473 1000297 898046 891188 852376
13462 852376 858799 890856 944044 898917 807418 791767 799293 802121 799871 903198 907444 870522
13450 870522 855672 872711 893127 874178 874094 851000 940663 1004520 964411 945590 907657 833163
13438 833163 787878 729535 762189 808492 730755 649719 622314 588233 505007 412408 340350
13427 340350 287724 257471 264335 275572 334971 333725 275837 259439 207204 259462 297414 367278
13415 367278 355139 402643 427109 424517 447051 452319 397191 454755 429853 396793 353129 369625
13403 369625 379368 365125 329569 293677 290115 243266 271962 329811 420647 391051 339615 333296
13391 333296 237996 174553 266158 279710 271045 270998 232984 179273 211990 266419 324847 338719
13379 338719 368716 370224 381374 446002 512515 518818 457259 421369 420242 363279 347929 459605
13367 459605 537362 499481 466995 475040 460742 509109 462240 466910 448197 425634 430518 409449
13355 409449 322977 252853 226832 236105 234564 271563 295745 269415 244917 255139 248215 271982
13343 271982 245948 272842 319490 383079 355028 427370 489644 487178 541240 631832 580164 467454
13331 467454 399218 354130 382477 352777 470631 562007 487405 441225 425119 489164 486751
13320 486751 505212 484216 458097 437415 369506 350432 249132 238011 256818 273134 254451
13309 254451 232789 161865 198893 248073 334156 437937 628290 682402 684468 760385 706282
13298 706282 662065 593246 524434 478977 467995 385455 368275 379221 379135 328896 281900 312674
13286 312674 317566 329487 323538 299914 305435 329913 373189 295767 275974 313534 362012 419906
13274 419906 369283 293004 288907 317334 283851 216290 200298 141410 65685 108726 127702 85388
13262 85388 66693 88662 144302 113421 83653 154313 162731 198447 320746 362106 429793 464908
13250 464908 510629 561963 477548 397168 312184 206095 230464 230667 164092 136539 147298 145681
13238 145681 163316 189112 294439 250059 212598 263649 338163 361427 313775 304971 306589 287513
13226 287513 343359 470663 505473 367658 254723 232137 208434 211167 206960 212028 226256
13215 226256 123888 49339 54195 154474 242577 282878 250893 277660 333748 305669 199052
13204 199052 256308 342965 359075 371140 347389 355395 406883 358430 268491 198356 180765 173217
13192 173217 146596 162804 168033 174296 144084 132686 60846 -12670 34274 36952 11819 105651
13180 105651 150642 76731 55040 31907 35796 145060 240576 213260 89911 68695 188749
13169 188749 208730 180528 181608 123435 45888 12239 64849 70877 83308 159454 248641 285784
13157 285784 306684 394823 512421 548487 569812 474535 430188 362460 251648 208151 236992
13146 236992 187613 150890 96245 103237 134847 111877 89565 52013 91646 190100 174373 129625
13134 129625 179247 170847 21092 -15927 46946 76239 15753 -36830 -49583 11964 -15354
13123 -15354 -30115 9845 -18786 -16195 -26691 65253 52272 45752 114846 186280 277958 307401
13111 307401 335094 435823 576555 686337 598639 454446 388000 370378 325256 265584 209765
13100 209765 116674 13861 -24170 83869 137561 165164 195602 177356 204692 162807 137168
13089 137168 147789 120880 77428 97042 184709 189869 109596 103017 115876 159023 126750 -4535
13077 -4535 -27697 16463 -11069 -28305 -50609 -16638 71162 154489 169702 210010 263005 247042
13065 247042 267668 294388 271923 259864 316747 293419 168090 70130 55868 147559 164998
13054 164998 134666 119156 31113 48036 84133 193704 202496 223674 177403 90631 79316
13043 79316 90643 81070 133871 158991 168997 166757 134838 96300 88480 170739 219804 223299
13031 223299 220170 251707 282875 276825 211205 275956 331688 328795 338347 311456 352968 421676
13019 421676 437235 478908 532972 528494 499275 569573 606221 651135 744859 802691 829169 934331
13007 934331 1069580 1173966 1280760 1415239 1549116 1735306 1901800 2066817 2214606 2393932
12997 2393932 2571530 2797692 3068300 3406178 4020195 4723417 5576130 6684942 8108571
12988 8108571 9824896 12062214 15119874 19246086 24871642 32141806 39962094 46655516
12980 46655516 51854337 55905356 58097158 57284705 53919649 49366244 44329948 38751061
12972 38751061 32715552 27074289 22525726 19066361 16768471 15529827 15169132 15524250
12964 15524250 16489766 18299078 21151455 25075920 30245987 37004226 44802730 52504036
12956 52504036 58678440 63400053 67224371 68718406 66894248 63288203 59385139 55331030
12948 55331030 51524112 48945112 48413123 49807889 52421557 55696727 58900221 60687100
12940 60687100 60958837 60741618 59410101 56371429 52191458 47628490 42779662 37515278
12932 37515278 32269992 27732281 24313123 22133867 20897560 20580087 21237827 22854868
12924 22854868 25480121 29241598 34050538 39419709 44874038 50407974 55824355 60607003
12916 60607003 64267555 66966444 69277892 70978008 71896865 72495904 73341797 74480758
12908 74480758 75869087 77500703 78697646 78740656 77611270 75502484 71987573 66634716
12900 66634716 59992312 53240036 46820643 40635714 34941909 30411135 27176908 25078220
12892 25078220 24224097 24582750 26105724 28962819 33332944 39124743 45752846 52141767
12884 52141767 58180595 63983153 69246640 73233455 75222875 75969811 75883619 73758993
12876 73758993 69595476 65482205 62691036 61653720 63017356 66755445 71632395 76689023
12868 76689023 81307002 85202888 87021083 85236882 80744740 74690248 66803097 57382517
12860 57382517 48015853 40022579 33696749 28904073 25356271 22980639 21553194 20983282
12852 20983282 21396657 23075047 26121206 30591103 36495823 43687801 51460929 58676644
12844 58676644 65245225 71163661 75338823 76519342 74267731 69291513 62546386 53908232
12836 53908232 44042882 34902724 27715202 22519603 18597159 15579150 13211539 11332299
12828 11332299 9705505 8364655 7335735 6532072 5918620 5522842 5139685 4811039 4595170
12819 4595170 4389078 4113976 3842712 3568369 3274211 3043588 2832133 2670457 2461956
12810 2461956 2157460 1974654 1892584 1746498 1649358 1556827 1534200 1554648 1539489 1538581 1523186
12799 1523186 1473574 1356055 1313377 1357708 1320473 1272300 1214488 1162513 1149335 1134377 1204002
12788 1204002 1159464 1130550 1088255 1093824 1141483 1169329 1232966 1295612 1349054 1415360 1452649
12777 1452649 1420771 1418436 1321032 1139500 1013516 936102 881814 859175 885826 859785 833553
12766 833553 854493 777709 773957 719067 840024 974728 1129794 1231489 1254771 1164310 1078674
12755 1078674 912918 799695 685379 670117 689993 703691 598867 597483 600610 615667 637613
12744 637613 637226 628453 652331 554798 517022 610622 547003 546093 609479 620153 604062 636164
12732 636164 648438 744325 859357 940191 1061111 1000602 991257 973079 920015 747974 643966
12721 643966 557175 561438 533525 498986 412911 429654 473844 532712 609924 743671 791131
12710 791131 807358 795642 842246 1040880 1207514 1251974 1218350 1080547 901655 789213
12700 789213 686790 597382 563935 525965 490971 465710 424038 501950 538152 547144 494829
12689 494829 452652 465105 531142 640521 646294 672079 697975 631067 546431 561856 492315
12678 492315 353654 351133 338733 347451 393592 366445 349068 302795 283253 270000 262242 251688
12666 251688 219227 196578 194214 207141 246160 266789 317650 405344 403509 439769 538173 563814
12654 563814 608201 620719 606107 613854 582284 452484 365394 355733 330717 316471 248198 268893
12642 268893 246324 218286 184998 183339 219490 224418 340049 439363 523841 529228 499646 478003
12630 478003 485302 396637 388100 297480 261310 291368 236082 160395 133282 154783 217001 200505
12618 200505 181168 249130 253765 158897 166029 228804 306002 381010 322713 260611 233806 165980
12606 165980 234524 312846 311150 393228 458733 540728 685739 837105 962947 1101411 1360666
12595 1360666 1526000 1729040 1833216 1868461 1831717 1714369 1572820 1445370 1290244 1068176
12585 1068176 836069 714928 538256 410108 372522 372375 296576 231163 152892 147058 185177
12574 185177 182368 162156 213429 269525 199460 196224 182668 175572 165027 134445 123877 137756
12562 137756 169409 203490 223436 274448 216044 158144 131142 134945 114408 127748 116281 187035
12550 187035 178721 158791 176679 117315 33873 50072 134267 106025 108895 170364 224112 194676
12538 194676 106845 110069 189982 222211 198438 189026 187660 194224 160831 178415 184119 151776
12526 151776 93181 73060 130742 237592 319817 327841 356542 413772 459918 519062 523076 560071
12514 560071 536071 536826 519655 445203 384664 336129 339539 305888 239601 293266 350814 358798
12502 358798 401264 410374 374715 419215 534227 566535 565321 689275 793786 890603 852479
12491 852479 729092 699707 693194 707812 786303 761043 653588 513802 388862 340536 416936
12480 416936 395528 397607 455605 501444 486076 426493 394631 393176 418783 395232 416165 449690
12468 449690 477920 434867 360653 324205 270258 234774 336004 385348 421227 443575 358034
12457 358034 367229 486727 435964 352807 412702 459702 494332 473726 545813 623103 641956
12446 641956 588139 581759 618971 558456 522674 516714 540486 463884 418755 419335 428165 418349 372683
12433 372683 299848 217702 210680 226939 216232 169530 133310 183113 189882 290764 372218 437125
12421 437125 481747 520011 521413 500394 549744 554098 566421 611192 599090 562549 565550 488821
12409 488821 399158 401359 486398 513696 515483 579876 550168 561307 618210 664433 601204 557105
12397 557105 536949 524661 514711 479902 472450 445454 538302 544369 490403 484654 526141 635633
12385 635633 649025 660872 588772 688344 799412 787707 773177 807963 835454 779903 713773
12374 713773 759405 810716 861612 948528 995086 1028144 1026768 1057180 1149063 1199964 1189723 1192725
12362 1192725 1294247 1388870 1457901 1629276 1813728 1959444 2116433 2406870 2822342 3254043
12352 3254043 3705978 4325113 5042775 5783429 6760214 7974079 9511088 11455882 13873587
12343 13873587 17006674 21336763 27238627 35193364 45585674 58361477 72080325 84088802
12335 84088802 91490395 91090944 81792004 67498339 53401928 42070580 33943667 28505774
12327 28505774 25033196 22996406 22173191 22516448 24085755 27274528 32179739 38666377
12319 38666377 46645467 56370960 67848986 79621309 88519240 91880438 88775446 79967913
12311 79967913 67774297 54638613 42714038 33429669 26674374 21779043 18261359 15911962
12303 15911962 14264584 13201012 12594872 12219062 12047610 11987545 12142329 12434355 12905678
12294 12905678 13857533 15279614 17392165 20400770 24569621 30294530 37935443 47798019
12286 47798019 59860605 73295145 85940743 93872621 93898607 87106617 77165468 66163729
12278 66163729 55443630 46122409 38841666 33811682 31009288 29922755 30418213 32654967
12270 32654967 36931284 43707944 53724698 67490262 84857535 105206109 126909249
12263 126909249 147182282 160790802 161423401 148538902 128456880 107230236 87729385
12256 87729385 71050722 57534194 47117563 39496888 34110980 30582539 28784520 28409814
12248 28409814 29544055 32476085 37417162 44399066 52808863 61676262 69806855 75626036
12240 75626036 76606884 71478249 62363377 52060575 42391664 34288744 27696697 22671125
12232 22671125 18985870 16268052 14164540 12658194 11721980 11194383 10799187 10540452 10394689
12223 10394689 10411619 10527959 10710341 11239914 12154249 13638890 15946035 19330462 24248238
12214 24248238 31321009 40930563 52176086 62954901 71225280 75085349 73982887 68057911
12206 68057911 58825805 49483779 41638292 35036705 29455388 24925742 21709533 19785249
12198 19785249 18890452 18969458 20136370 22687322 26959357 33550012 42948457 55177854
12190 55177854 68097378 77473568 79466706 74346339 64949288 53685505 42766206 33690851
12182 33690851 26839421 21726399 17852169 14965038 12834486 11033035 9532019 8396569
12174 8396569 7410763 6525105 5830858 5211291 4678630 4246685 3832310 3517798 3250187
12165 3250187 3096837 2902393 2665892 2437527 2268089 2173352 2048310 2034248 1928781 1829392
12155 1829392 1778926 1735994 1627614 1557440 1448772 1431666 1388876 1328050 1243995 1198528 1199501
12144 1199501 1242696 1209776 1207550 1167711 1137620 1105833 1136695 1202045 1171231 1141581 1037295
12133 1037295 1008634 1033608 974904 933338 885664 825030 815677 765892 734509 706121 674915
12122 674915 588177 578181 514994 610169 733397 732504 599876 610138 683038 617441 641590 643018
12110 643018 593427 583216 561549 511616 479671 436009 399185 397324 432162 477296 487193 472420
12098 472420 485164 548419 573104 569346 541577 504292 522108 549215 546471 563608 563211 537733
12086 537733 575607 554215 494907 541656 582866 615243 595189 550402 523661 532357 423682
12075 423682 334044 401633 454310 422572 427409 389454 362910 347080 304620 377623 357615 356190
12063 356190 368853 451242 468467 391878 356447 359363 363004 330940 294643 278807 258315 268229
12051 268229 329423 270911 236989 259236 267624 313215 361070 351852 345678 312486 251821 280618
12039 280618 337773 369483 309262 259071 233338 202723 194663 294022 399504 405548 341976 245734
12027 245734 191044 226555 276942 307058 312664 251825 221369 260332 262349 222869 186265 141435
12015 141435 195337 216263 217763 200785 195348 196968 279584 293780 273062 233326 188916 99645
12003 99645 133811 247316 290867 356738 337151 271289 247157 172556 123483 144529 145591 152552
11991 152552 191822 190260 133937 48053 87620 124959 205754 230238 236222 254962 186884 178193
11979 178193 121952 104916 143513 156488 118346 78824 -2681 45138 110195 98114 125990
11968 125990 173497 178734 191176 144581 169114 205524 142393 118730 134734 190322 142567 84913
11956 84913 60650 118600 175874 212067 155837 118562 182816 174766 182390 165184 195942 173091
11944 173091 79116 31234 -18256 32246 110088 129028 133689 130657 147303 69856 -2999 36299
11932 36299 117076 163808 196699 185840 136825 98611 58605 5842 27941 95545 101148 115676
11920 115676 160318 219231 256323 234030 192883 160982 207838 265624 275869 305012 246260
11909 246260 125970 79917 51200 56402 7554 -14059 105429 186642 258725 256346 177597
11898 177597 73051 75695 27420 -42370 33067 125710 174799 132371 148308 187640 299697
11887 299697 345197 385845 439996 457904 488167 515633 482034 462866 348803 333647 342090
11876 342090 307678 251679 172680 146688 125408 100184 181389 206780 260787 302486 363353
11865 363353 467405 500975 557033 583283 604247 531519 424790 249229 166883 214203 163028
11854 163028 113153 191255 154613 99003 139241 146171 159247 165584 211611 223561 240541 254914
11842 254914 274049 308613 302275 319522 348635 365399 342456 361438 394045 387789 480406 572893
11830 572893 566114 529254 539469 457526 359267 229148 196494 245023 289095 364555 389188
11819 389188 319710 306887 324435 401778 483565 613910 760819 857351 934413 998931 946288
11808 946288 783124 618446 535058 518508 439173 340919 350613 337467 308305 348860 346518
11797 346518 360458 308278 291901 366468 421624 413191 413145 479411 617807 690566 661972 623601
11785 623601 470011 336772 284359 174094 130440 120677 138927 120535 131387 143711 64823
11774 64823 25723 38482 119740 174730 125652 139554 137171 118391 149285 173254 176226 166057
11762 166057 228058 328413 303103 304907 420824 475601 419522 400795 387419 421018 454683
11751 454683 442423 398083 326893 228214 156167 219570 181738 185511 149443 221912 298975 305655
11739 305655 399732 466935 588580 573277 514463 438574 396919 332344 306885 192363 149102
11728 149102 184996 237265 246325 218059 135604 1973 -14428 96032 115785 110464 69195
11717 69195 104268 101873 132265 147504 164652 180103 192450 146442 137410 139302 100966 165517
11705 165517 176537 156142 94867 79161 36729 35651 88826 85507 81799 22385 -34163 12694
11693 12694 -5769 38287 67135 43344 -17900 12657 44752 40839 57502 51885 11627 -33090
11681 -33090 -2555 743 48997 66023 97352 -8506 -83682 -72964 -65585 -103565 -109390 -127988
11669 -127988 -157043 -104747 -52676 -40327 -90245 -103617 -6720 61760 77078 107959 156786
11658 156786 172287 158218 183136 244414 210194 170361 158442 111329 113775 140250 140168 105414
11646 105414 24781 46855 67659 56885 39827 52246 47010 60917 98015 103992 170209 115650
11634 115650 -2138 -61587 -86735 -85960 -59348 -62906 -58142 23882 77416 58122 115658 112481
11622 112481 61794 11940 -16855 -26277 -42046 -55859 -87319 -69012 -3169 108125 194324
11611 194324 119070 76084 79530 45022 -21044 -68599 -24690 25679 4840 78044 68216 131118
11599 131118 162375 161310 159047 208451 217475 108077 106169 67887 20708 72212 113936 108138
11587 108138 91693 -1174 -28859 69225 92836 100727 44944 10032 20923 120286 93591 -26032
11575 -26032 -7238 34969 43971 40970 18009 21707 24210 110137 89427 21799 -15966 -49737
11563 -49737 -59506 12327 53448 -14556 -116163 -148997 -102390 -38939 -52545 -84873 -78808 -27934
11551 -27934 -41405 -66574 -43841 -12444 -22191 -16655 43109 86495 111870 78421 73485 92932
11539 92932 139798 126623 -915 -71643 -118208 -146454 -52155 -86082 -99842 -131809 -125251 -9503
11527 -9503 42875 -74 4305 8299 -49228 -72612 -62035 -22701 -31916 18218 60336 29789
11515 29789 -59864 -102255 -60356 -68648 -105964 -74520 -17955 6838 7000 30754 85170 74444
11503 74444 95178 98020 17025 24227 -60248 -64294 -6604 38910 88431 104730 133375 63391
11491 63391 -28382 -67480 -16486 78883 102322 21277 16190 15390 30885 9032 8229 -1557 -5393
11478 -5393 -60413 -88633 -79313 -49434 -45648 -59972 -159105 -155976 -112272 -96601 -119630 -135317
11466 -135317 -115260 -54408 -36712 68206 12277 -87533 -79520 -45541 -72083 -45503 40053
11455 40053 63096 -8208 22642 30882 54835 19939 -9011 7635 4500 43646 32416 51478
11443 51478 108116 99257 32902 -61875 -36887 62598 112503 126097 125505 74807 20456 -40867
11431 -40867 -49989 7777 574 12648 5920 -7671 34572 121822 131280 89006 65980 25712
11419 25712 10704 -17199 13187 24457 52512 70961 68016 70404 82265 284 -61680 -45176
11407 -45176 5061 26998 60234 145411 11512 -30067 7644 -9546 39994 27533 -27994
11396 -27994 -74408 -151 80779 75857 87448 138155 67995 -71235 -18831 2565 -13355 29121
11384 29121 75302 76476 79408 98732 59433 27396 46008 22956 32705 49613 40578 26976
11372 26976 39319 27862 7875 -53687 5370 41555 62991 26029 48082 78467 10979 -26547
11360 -26547 -16592 -25820 -27646 -27107 -80300 -33519 36371 11842 23246 -8256 -38754 -19102 23942
11347 23942 12210 50911 89238 -55661 -68009 -1482 1282 -71814 -81424 -84859 -101256 -78656
11335 -78656 -59173 -43895 17247 26848 -26622 -97501 -66365 8256 29230 -3320 -89907 -181081
11323 -181081 -128755 -99719 -130790 -134850 -74715 -40151 13881 -10582 -76192 -48417 -20529 -79237
11311 -79237 -29188 -2008 34764 4422 -41680 16005 85376 82939 51561 52614 60960 15482
11299 15482 43486 100229 68184 -17983 68986 83334 8709 -6477 -18378 -45389 -6998 106221
11287 106221 130674 129150 52778 40116 36399 -25610 -97301 -111461 -39533 44800 29166 51697
11275 51697 66497 54074 76884 97205 94130 -23728 -143169 -46860 11855 60964 56659 11381
11263 11381 -6481 39305 59037 26138 -544 6346 13894 -17151 34978 -16357 -41269 -19056
11251 -19056 -50281 -43047 -13146 14515 93596 128034 118479 18205 -23967 44740 76556 69157
11239 69157 22212 -6 24803 21085 20568 -55961 -94933 -63139 -54474 -14146 22996 16218 -47083
11226 -47083 -40818 -81231 -67079 -34032 -73262 -79271 -54634 -76601 -118965 -127642 -142117 -124178
11214 -124178 -8775 7864 36151 3788 39371 16636 -6962 4264 22278 44153 32324
11203 32324 59552 44842 43356 23366 9474 31258 -8190 -60148 -2016 80862 81085 37201
11191 37201 -17724 -92204 -76696 -28212 -28690 -46862 -30831 -33071 -59507 -62154 -28186 -23667 41059
11178 41059 13449 -42335 -44062 11704 45555 64143 23905 47213 57894 22665 17279 -12856
11166 -12856 5321 31185 -22637 -75020 -96338 -67823 -65881 -33713 35385 -6383 -16650 -13022
11154 -13022 -41591 -8894 26970 13094 6712 62305 153063 139147 20452 -84668 -27439
11143 -27439 55848 55908 -35264 25694 110716 43631 30689 36999 25313 78913 54354 -36501
11131 -36501 -78948 -47887 -55874 -48498 34678 9591 -21321 -73959 -73794 -12044 -6294 -12676 -59467
11118 -59467 -47803 -30440 -31103 1444 3780 -33139 -20171 -38462 28341 -14761 -79537 -48916
11106 -48916 -1762 -34436 -154705 -175858 -108118 -12821 64697 86527 65153 70891 42945 13622
11094 13622 31177 46004 39135 26332 37322 25946 -50679 -89351 -37008 -44259 -73692 5592
11082 5592 -3820 44795 9988 -20212 22409 21165 49440 -11963 -33149 -9751 -54991 -19255
11070 -19255 40561 54011 71112 87626 15152 15117 68822 38731 -13507 3621 68707 -1893
11058 -1893 -110165 -170065 -67259 9013 14110 -74196 -149331 -171120 -143111 -90563 -93302 -109430
11046 -109430 -111469 -88602 -18999 -12648 8125 -17072 -53711 -27427 -74145 -90714 -45390 35949
11034 35949 29056 75308 143595 108708 44906 -54128 -21986 14768 27179 43665 -11240 -46786
11022 -46786 -135182 -172197 -153119 -68008 -56183 -80639 -73072 -73784 -44162 8601 -18670 -39739
11010 -39739 -14242 4482 26437 -7750 -9739 -33689 28534 82048 172824 233110 180114 108131
10998 108131 70316 43866 49186 -23570 -45463 -120898 -161124 -132467 -29871 -76971 -46585
10987 -46585 -27344 -72880 -29864 -10307 -47528 -141384 -172309 -100672 -37486 48381 57559 21249
10975 21249 27426 41492 63184 54638 -8200 -125188 -169458 -97902 -24127 64155 59318 10054
10963 10054 29290 16190 -7501 57067 70933 52706 140311 100599 12000 -24613 -36261 -24319
10951 -24319 -6348 -55657 -63960 -22268 -16573 -41331 -115463 -107623 -108429 -19213 11506 -19181 -8270
10938 -8270 30645 37857 -16210 -109347 -138037 17538 12764 26405 -7297 -50748 -22368 -32964
10926 -32964 -38578 -2910 -50245 -78346 -74518 -65699 -99004 -61555 -38943 4177 -93348 -144300
10914 -144300 -97293 -30476 -43262 -16556 -41005 -74492 -125796 -88410 -55962 -100724 -69273
10903 -69273 -3846 -38392 -92647 -84020 -30587 32924 -47902 -94774 -43037 -13875 -52913 -63843
10891 -63843 -126427 -21241 -5675 -49469 -87231 -102818 -94190 -96371 -85783 -41041 -12199 -35359
10879 -35359 -76459 -116430 -100822 -3118 43579 -5596 -26958 -73195 -83060 -6942 -15655 -27376
10867 -27376 -53356 -70221 -94566 -108010 -112954 -9931 -22276 -102655 -178896 -143785 -130497 -149268
10855 -149268 -166477 -160079 -91402 33551 8114 33593 71970 33941 26073 18200 -1746 2130
10843 2130 -25150 57362 54037 29582 26332 -9140 25249 50589 -1668 -93826 -87259 -95319 -81497
10830 -81497 -108923 -116651 -51796 -78577 -131227 -140463 -71612 -75882 -61231 -19016 -18549 -36817 14995
10817 14995 -28071 4361 36259 -56827 -148832 -123130 -132780 -85442 -11741 -24210 -34713 -40078
10805 -40078 -82051 -75999 -45751 -9812 24175 5158 -8045 -71561 -92070 -65535 -111236 -108665
10793 -108665 47969 83795 -52105 -71711 -17353 -23128 -24810 -74367 -86002 -67384 -84193
10782 -84193 -106617 2123 63219 58117 51783 85932 123772 114204 132094 147659 127441 71624
10770 71624 47114 -19456 -60574 -44855 19895 20403 24018 -22005 -79375 -10844 28265 72195
10758 72195 139492 88957 99552 69877 14797 29764 -32384 -73338 -68134 -106117 -86358 -65730
10746 -65730 -76032 -115171 -87977 -21878 27299 -51291 3608 30646 -36272 -59868 13803 33286
10734 33286 -2464 7212 2987 -29418 -11908 22713 4212 -4452 28125 -3205 17330 46970
10722 46970 34478 -18987 -37430 -20905 -56919 -92734 -112195 -130666 -32079 23425 -20874 -80708
10710 -80708 -161536 -199662 -128448 -27219 68619 4375 -33538 -88714 -130884 -108840 -70264
10699 -70264 -87599 -69016 -47681 -12872 -85291 -99464 -92035 -92117 -121954 -119418 -52028 -16842 -24875
10686 -24875 -80290 -62331 -22623 31708 134659 134452 51298 61591 99931 64342 -13288 -31701
10674 -31701 -50844 -139374 -135338 -105685 -100806 -163265 -199071 -193838 -179729 -152331 -202013 -205673
10662 -205673 -218603 -144805 -99286 -91262 3226 50433 -2965 -148939 -215824 -224422 -104568
10651 -104568 -60457 -128203 -155720 -123179 -120957 -111956 -64754 3844 16084 51603 -91615 -87533
10639 -87533 -32116 -40361 -53809 -20732 -12981 -34248 -55877 -58170 2877 76659 54183 82797
10627 82797 71999 17455 -74072 -148081 -168433 -110296 -51192 -61728 -18473 18129 51807 27273
10615 27273 34191 49377 1770 -45202 -68478 -71896 -52315 13306 68533 -3824 -29315 -19147
10603 -19147 -42051 -119975 -146096 -145399 -151752 -73571 -373 -35758 -52597 -47040 1932 -40991
10591 -40991 -107312 -115147 -116764 -143839 -88923 -8228 -12744 -70807 -112654 -93603 -72462 12213
10579 12213 -44403 -83994 -71671 -92030 -81129 -56896 5879 8416 29776 69841 50927 -48502
10567 -48502 -48269 -37728 -94886 -30426 52292 71198 9929 -23768 22599 87749 82880 81652
10555 81652 -25156 -55929 -17572 14702 24883 -2376 -106749 -153161 -108604 -116750 -136586
10544 -136586 -116386 -88890 -43017 -840 39342 6876 -22586 -10510 -81039 -79430 -53701 -92730
10532 -92730 -85696 -75743 -100505 -92164 -83440 -67827 -47449 -144685 -172808 -82048 50756 42167
10520 42167 -24175 -162634 -131628 -78964 -159454 -209339 -166383 -117189 -63855 -1648 11297
10509 11297 -59957 -18585 -37497 -83421 -112926 -124924 -79090 -61294 -131661 -121085 -91165 -28124
10497 -28124 -80096 -157376 -180291 -116540 -98695 -72967 -20402 -3134 -60892 -134282 -129864 -22566
10485 -22566 -37896 -118680 -158755 -170169 -132981 -4792 36273 -60431 -72355 -96421 -89393 -184817
10473 -184817 -138740 -85740 -54229 -23375 -5951 43575 18355 16939 -27513 -83823 -102308 -143312
10461 -143312 -135859 -101313 -91852 -21102 216 -39704 17361 76627 34860 -10784 -5342 19682
10449 19682 50750 16749 8909 -69963 -7649 -25723 -69765 -162110 -103767 -78696 -59081 -76290
10437 -76290 -51895 -89937 -96991 -6712 84903 90780 79540 46702 39532 12924 -17532 10965
10425 10965 37212 28373 -85011 -175804 -171464 -200472 -167642 -36052 79135 46321 -58372
10414 -58372 -135423 -170858 -177013 -92508 -99173 -98337 -39944 -132101 -205513 -118783 -32016 -27820 38577
10401 38577 -41951 -21035 5741 -39190 -53058 69730 110980 -33136 -149039 -113106 -90836
10390 -90836 -70666 -21641 -38853 -20519 -102767 -122720 -37006 -24324 24030 75808 83193 10296
10378 10296 -45360 -16970 125508 151908 97694 34810 -4087 -31596 20592 64692 -20315
10367 -20315 -55792 -56572 -23264 59109 106998 87880 8108 -29264 -84228 -91473 -123301 -108524
10355 -108524 -39745 -37801 -54212 10182 84311 83629 -799 -51589 -95067 -133019 -5229 46469
10343 46469 30852 -41904 -22053 53927 64212 112408 149476 101106 80145 39914 -71078
10332 -71078 -37016 10988 -19155 -45997 -33982 -6379 9311 -49553 -89953 -121562 -130829 -170051
10320 -170051 -178358 -153213 -138003 -145437 -179573 -183120 -187366 -174238 -211074 -213455 -170571 -116990
10308 -116990 -78493 -72286 -151868 -127921 -69027 -29448 -76484 -141325 -117039 -33429 -65610 -90463
10296 -90463 -62557 -45177 -43063 -80368 -75492 12572 128466 46499 -29833 -98590 -27457 -32319
10284 -32319 -87069 -70490 -25387 41594 113570 76723 98296 142511 132859 106932 54002 85303
10272 85303 81346 76080 70722 153824 158627 188557 227005 212206 143158 92754 68914 65730 59202
10259 59202 40163 44047 198902 267443 198202 117155 187557 232636 225168 159759 187161 112414
10247 112414 99024 178839 235454 257246 215125 270402 308473 250619 152983 95319 106289
10236 106289 107413 93033 76150 61864 13601 40139 87167 84331 18003 8869 52018 87153
10224 87153 82970 104994 60222 49242 143844 200802 237568 227867 224779 151166 208303 223185
10212 223185 176175 150285 162226 185389 174984 212943 271380 242601 142738 119109 148257
10201 148257 126855 61969 42328 98738 177040 212354 204889 78715 3606 2953 14910 43607
10189 43607 89962 114552 104690 164699 282198 324594 278750 316842 358256 331477 347619 329485
10177 329485 294337 248988 228799 274453 241649 265202 206600 194350 213927 246863 230695
10166 230695 221170 290569 361158 282212 250857 220286 214555 151565 197764 311244 325607 288408
10154 288408 318323 322208 301888 307454 360001 333373 298593 331534 281240 139332 152932 245161
10142 245161 220314 201285 226870 242367 220188 226625 289908 316381 334659 261725 229018 225159
10130 225159 108779 41182 17985 35000 102689 135816 135298 184463 224199 138095 51100 45409
10118 45409 123390 151368 212344 189678 196091 147702 36380 50248 45566 73872 41520 33694
10106 33694 -16795 -49677 -71788 -27585 6833 24095 47467 17521 37760 54940 92805 102482
10094 102482 20190 12174 62971 79303 104456 116965 49660 -43935 -59520 -73960 -78208 -89143
10082 -89143 -107373 -38616 37670 30906 -36797 -87480 -68375 -44780 3916 53830 40324 3427
10070 3427 -67256 -62327 -17194 -3048 2487 98897 125061 131362 45916 -41541 52073 100424
10058 100424 98449 36202 36743 117805 169326 227112 304628 524994 965175 1762558 2956077
10047 2956077 4800985 4683325 2733330 1560755 1018007 659402 398297 267343 132848
10038 132848 61306 46975 83554 111016 82449 102441 93735 61638 122690 96725 97810 34459
10026 34459 35365 56877 142083 108228 27451 -64091 -17553 108200 85497 53387 94928 66919
10014 66919 57899 139078 166014 97673 64784 8737 -103743 -129760 -80392 -55101 4773 9814
10002 9814 64831 46655 61639 50370 1969 55199 24032 90019 116824 94811 16291 -11561
9990 -11561 -39181 69417 43113 -22393 29018 55690 -33625 -86663 -87694 -45071 -1598 31912
9978 31912 90994 70994 14668 1721 -7631 25369 39889 -73333 -172429 -131746 -18023 46865
9966 46865 78598 135148 154655 107233 -971 -37882 -19041 20515 -53538 -101141 -57249 -16572
9954 -16572 -17790 -22517 12596 66297 85702 104832 71588 92240 135559 158852 126707 128970
9942 128970 206585 235488 266641 256046 225975 196377 96288 40149 60009 32768 99288
9931 99288 167545 145373 112471 99862 177693 283289 332955 349766 407849 431916 485800 464225
9919 464225 450799 435329 406197 449866 535262 578272 600452 581655 566009 567502 610275 629838
9907 629838 660450 792624 887425 1038110 1190967 1321109 1538738 1795907 2110014 2524940
9897 2524940 3091853 3804345 4782630 6003132 7426621 9013690 10947753 13272324 15510495
9888 15510495 17014691 17715643 18021350 18025433 18084378 18634508 19978618 21834114 23193847
9879 23193847 23408584 22058919 19501030 16839415 14942616 14038215 14211704 15287459 17193569
9870 17193569 20010214 23544820 27202893 30432341 33227710 35660798 37223587 37510061
9862 37510061 37281499 37777798 39424487 41723564 43831303 45234490 45516812 44564449 42804204
9853 42804204 40563093 38243908 36407959 34943875 33494085 32521251 33116998 35278290
9845 35278290 37956999 40181961 42044062 43677625 44429536 43407150 40742976 37388244
9837 37388244 34961119 34447815 35667872 37764015 39578305 40471997 40391901 39814032 39724219
9828 39724219 40209227 40762610 40960565 40452492 39189330 37977001 37744695 38788734 40255857
9819 40255857 40916645 40651682 39891468 38280339 35153967 31182035 27505108 25021386 24101600
9810 24101600 24906931 27713122 32348132 38112995 43831716 48466978 51032117 50942265 49099781
9801 49099781 47422192 46926154 46957449 47274198 48750262 51360941 53632233 53798631 51240043
9792 51240043 46509427 40754946 35509808 32099837 31059334 32235758 35462159 40469849
9784 40469849 46809819 53173840 57763789 60282325 61650495 62093775 61153591 59461807
9776 59461807 58956491 60414371 62878841 65004104 65908656 65987058 65771523 65532922 65514658
9767 65514658 65037895 63313145 60463691 57127247 54655467 54447405 56887952 61391440
9759 61391440 66007383 68570770 68221452 65635306 62185982 58411790 54708788 51854870
9751 51854870 50769010 51852514 54401956 56978178 59197018 61623947 64463423 67338715
9743 67338715 69649097 70559858 69433198 66697777 63502364 60739072 59240765 59174869 59499533
9734 59499533 58625424 56289559 52905319 48555032 43161836 37269178 31855381 27739125
9726 27739125 25083573 23953815 24334973 26316083 29714330 33520743 36286231 36859420
9718 36859420 35474004 33133724 30883802 29613988 29423060 29502313 29496111 29070081 27614791
9709 27614791 24857345 21377774 17967635 14940678 12389366 10254430 8476831 7110042
9701 7110042 6096097 5326816 4796480 4412927 4041879 3651575 3401664 3119084 2865911
9692 2865911 2679398 2526750 2344098 2254178 2101213 1969759 1920706 1822053 1770504 1716157
9682 1716157 1659922 1605508 1575877 1474123 1392259 1392942 1266745 1204774 1237574 1253133 1161099
9671 1161099 1146553 1169985 1142216 1105114 1140178 1192469 1122325 1043233 1041308 974726 937241 915688
9659 915688 815955 786641 785427 758659 782892 769529 818967 849543 796357 636956 553561 618021
9647 618021 721419 752580 775876 745557 714413 699844 691372 720142 734060 700481 706093 663966
9635 663966 650012 618286 550176 524940 593695 645191 643597 649462 619002 625116 648824 660863
9623 660863 693169 681956 606849 592122 561027 599221 521817 444427 413196 436458 404571 426604
9611 426604 506439 599302 587085 549445 544409 457453 399847 428060 441893 441801 501922 539845
9599 539845 503553 486167 536853 488516 532308 596168 559363 530310 458047 438357 386158 374940
9587 374940 348812 320301 332269 348912 393335 515272 545060 463248 456259 442626 521945 503353
9575 503353 444217 602347 663729 622442 694991 738359 749862 825373 900812 1000040 1103689
9564 1103689 1161505 1269527 1318415 1459242 1522270 1522763 1584040 1687266 1807926 1983266 2190848
9553 2190848 2385448 2631766 3051192 3488235 4054009 4844476 5788199 6942779 8435486
9544 8435486 10130361 12272395 15215723 19269736 24938530 32331460 40285909 46455659
9536 46455659 48812506 47937828 45030648 40080113 33638323 27356521 22306617 18546858
9528 18546858 15735463 13644470 12268214 11400332 11042281 11135433 11615002 12639252 14230647
9519 14230647 16410381 19368815 23319601 28244161 33772540 39009638 42874255 44755016
9511 44755016 44851527 43956688 41948576 38375600 33576107 28586999 24033589 20218729 17315149
9502 17315149 15190229 13840072 13233519 13163793 13534648 14403370 15702474 17432111 19783265
9493 19783265 23115570 27688414 34236760 43072698 53898230 65394690 75102575 81481761
9485 81481761 85100912 86065780 83097954 75656870 66091561 56398118 47371575 39574152
9477 39574152 33610414 29488056 26573757 24602060 23494528 23259594 24045025 26020039
9469 26020039 29129806 33713582 40075121 48407194 58145385 67807892 75689682 80388433
9461 80388433 82642583 84413684 85571380 84515553 80899228 75705338 70150660 64736643
9453 64736643 59765897 55134028 50308467 45552128 41721971 38721801 35689242 32205530
9445 32205530 28850761 26357964 25005021 24852609 25916548 28030526 31277877 35509952
9437 35509952 40356352 45537012 50786930 55619720 58619536 59235492 58477272 57052444
9429 57052444 55181948 53079973 50453092 46653046 42090453 37651440 33461362 29814698
9421 29814698 26840202 24829742 23785494 23799731 25105531 27769884 31739646 36489641
9413 36489641 40792514 43917537 46515157 49662324 53398243 56809271 59147750 60720824
9405 60720824 61901152 62961750 64022239 64535351 63610365 61560541 59384344 56946385
9397 56946385 52981690 47165389 40659565 34462924 29172783 25000718 21970857 19918034
9389 19918034 18581431 17771467 17632033 18227981 19330017 21021557 23578844 27298789 32363138
9380 32363138 38423514 44935869 51182227 55789185 57337331 56421510 54182735 50355282
9372 50355282 44405366 37370446 30862694 25804433 22244097 19884844 18311272 17190265
9364 17190265 16437870 15910863 15666485 15760843 16261950 17200396 18537347 20330641 22737750
9355 22737750 25781047 29533265 33719856 37840894 41124573 43300120 44891809 46120665
9347 46120665 46154806 44808948 42705327 40420358 38378041 36690785 35489244 34757744 34263028
9338 34263028 33899074 33752244 33839791 34131695 34726153 35689721 37041924 38947164 41583767
9329 41583767 45231238 49732200 54275898 57782616 60163209 61565432 61463450 59385127
9321 59385127 56360612 53951772 52894918 53087312 54336490 56283839 58737470 61475346
9313 61475346 64580817 67895426 71248826 74297773 76828792 78617223 79648845 79801065
9305 79801065 78885006 77112243 74645783 71643202 68314847 64904828 61475721 58155678
9297 58155678 54952753 52060469 49532725 47313503 45387500 43614688 41996833 40623685
9289 40623685 39565225 38650412 37894136 37235937 36764074 36370768 36089922 35842433 35607438
9280 35607438 35496077 35372275 35060665 34784363 34398553 33903040 33212512 32402389 31459051
9271 31459051 30353581 29122257 27766722 26373886 24991457 23612211 22244827 20874242
9263 20874242 19606884 18441289 17275867 16163684 15057459 14136931 13281174 12524033 11847253
9254 11847253 11271450 10768273 10233631 9723779 9308774 8944566 8668129 8460928 8308244
9245 8308244 8147517 7907296 7641157 7405990 7391899 7434913 7474053 7473280 7471966 7469994 7607139
9234 7607139 7608513 7600803 7721608 7932834 8041443 8063544 8132840 8140595 8230591 8260849 8209630
9223 8209630 8022989 7775851 7586334 7351504 7050008 6755933 6483259 6097196 5751434 5399555
9213 5399555 5067952 4752904 4509844 4234866 3995096 3711156 3460218 3244458 3100113 2969133
9203 2969133 2803443 2703950 2575526 2395892 2225235 2187560 2131022 2003428 1944678 1906645
9193 1906645 1799486 1767612 1772950 1813011 1763692 1718621 1617596 1515166 1388414 1313236 1298764
9182 1298764 1311955 1290633 1229272 1156077 1111688 1089986 1150311 1139754 1179403 1171900 1126464 1051535
9170 1051535 987724 950700 892124 906115 975152 1005705 1058379 1074137 951612 872689 758104
9159 758104 711305 763503 807866 824772 809531 716677 737835 793595 801333 745834 674618 627333
9147 627333 635796 659456 697771 666049 651361 648999 681426 665815 668277 659756 621937 571901
9135 571901 606565 614410 608191 588315 564671 583987 594444 695139 750313 746975 745327 715771
9123 715771 724533 747446 791123 763125 685618 752648 713244 646146 655014 596462 584109 577313
9111 577313 588726 518062 495727 605011 597425 579993 588530 539156 487244 569174 563501 590605
9099 590605 674265 585904 445579 494106 533214 536636 585238 582819 574143 535053 503802 459141
9087 459141 435148 472609 529758 435410 313455 404337 459431 515687 593670 601304 605428 582663
9075 582663 562732 580486 567613 610217 637453 620191 558627 572404 531046 474992 464212 442613
9063 442613 405110 445981 406709 353873 363656 413658 412091 413539 456756 576156 668894 738564
9051 738564 726423 717470 705805 737990 764496 735111 719245 715494 689635 671506 579048 485771
9039 485771 465379 532440 579571 624896 623543 513579 434495 381215 359150 401377 352734 360472
9027 360472 365953 391242 459451 540075 522786 481676 595498 598038 491048 498098 480949 500382
9015 500382 524903 595542 468940 308165 267115 362189 356687 376131 353842 275702 333177
9004 333177 384618 422004 390181 366105 402134 451890 413047 451543 490213 537182 549250 650332
8992 650332 755258 806491 813853 741498 661274 668467 702105 713382 633573 552774 502659 446085
8980 446085 346834 347380 396231 424569 304830 157246 152078 181906 245804 261508 220912 259916
8968 259916 364349 556079 587663 534073 493045 450150 455552 550466 524789 493000 498026 480557
8956 480557 410227 374545 310113 236400 216725 230366 231316 306290 250192 210191 192848 216021
8944 216021 366682 485541 376683 303312 305923 307183 358466 418317 474903 499252 410335
8933 410335 412644 369490 335013 249192 151027 130431 171536 258375 194443 85314 165020 237935
8921 237935 203927 158591 245287 260480 192314 263459 357074 376027 325543 341720 451482
8910 451482 459004 423075 431094 436020 377104 319272 296412 284462 254654 213922 161248 209912
8898 209912 170675 164748 237579 231501 181794 161078 162421 226420 238899 269241 323895 320670
8886 320670 272413 272347 263356 210252 158786 118644 242046 304014 230324 177624 176051 147972
8874 147972 179978 247426 229989 186793 155119 137199 107588 129950 162414 257379 234218 251353
8862 251353 262419 221759 190045 171693 171575 137504 112360 91760 84607 172909 161293 120936
8850 120936 137736 157016 202042 222656 166407 141491 79138 78879 101804 83745 123933 146603
8838 146603 189575 261721 275412 226271 134827 95558 93817 146984 125790 143838 164788 130336
8826 130336 62213 59193 149600 207265 246081 125843 30740 -18306 3639 23973 34370 76256
8814 76256 112951 79211 51476 95817 189215 203157 104866 158129 225904 200601 175201 170640
8802 170640 114397 99093 57252 117228 91928 50301 48149 72938 86054 87625 122599 134756
8790 134756 97843 67835 108047 147029 153970 184879 160630 46151 -12479 -24315 -101642 -104235
8778 -104235 11363 36377 104546 182561 184088 85169 74173 121952 110919 163220 192771 189271
8766 189271 195583 163216 138847 155313 219040 203856 116565 62969 102539 198190 237012 153483
8754 153483 135441 134720 137817 152883 168205 183435 210431 181623 156661 86712 123983 129652
8742 129652 127421 182833 182898 168832 46918 22208 102103 63115 35165 62573 64071 98101
8730 98101 90655 146351 186487 80640 103967 118586 106392 167226 131851 53261 121298 136836
8718 136836 40568 12731 -65775 -144192 -54007 20871 70537 177775 188523 131286 151687
8707 151687 153601 98335 96354 109519 110193 128094 132515 96614 23666 -24636 -23938 -60750 -112807
8694 -112807 -111115 -62584 -23225 -25370 9301 23603 47163 84778 152099 160749 125130 117976
8682 117976 49258 81710 117651 143641 167567 147807 92379 140639 151956 128776 165997 160025
8670 160025 164712 112364 142372 196519 170257 218356 168065 117261 45200 55373 132795 201521
8658 201521 230241 152535 62333 87933 221695 268070 280653 258497 255530 328435 433924
8647 433924 621840 738945 611332 393362 305755 238592 186029 107079 -22865 -33835 -216
8636 -216 13671 57418 62503 58151 94513 139580 225281 192786 223782 194415 168406 233818 152356
8623 152356 54491 75393 27127 38728 103340 109578 97731 34198 22434 31622 32391 -16664
8611 -16664 -18341 -50454 -38739 -24763 92611 219617 427349 633087 898083 1289628 1604795
8600 1604795 1352746 888442 587973 452445 333403 251024 195898 189422 210113 162764 132314
8589 132314 156373 172155 123654 97547 70723 -23693 38400 70256 32267 50605 99756 61766
8577 61766 71194 107845 149834 166204 91930 150974 157640 154001 196621 129176 19399 -3750
8565 -3750 46528 101298 117135 75838 73711 145430 213699 272285 495566 698068 607101 348060
8553 348060 174641 105879 77733 18214 4009 29198 61646 30071 11904 -18874 -56846
8542 -56846 -47890 18263 48126 102568 160075 212203 251296 290520 264969 152107 129497 162978
8530 162978 185960 170268 199847 203828 203688 167578 109560 48417 50748 11229 58606 47707
8518 47707 88054 48685 -2415 12238 32929 82603 45984 79448 99474 66713 59572 -8961
8506 -8961 -42802 12176 56032 39969 -19673 -12632 -3762 41638 -6423 -34677 91753 179411
8494 179411 102163 38305 75558 148880 136485 79826 56343 129956 134894 57860 43521 73064
8482 73064 126967 154804 110925 129386 140540 45175 -20591 -22597 -82608 -44599 42043 74887
8470 74887 146559 143847 121394 94824 26074 8742 38169 80291 83973 20441 -30985 -1500
8458 -1500 24828 -4540 16252 17785 61226 20255 65174 91723 -18729 -58251 -12483 -36835
8446 -36835 -2837 4831 753 88325 119454 122209 137285 120545 39706 -138 -21495 34984
8434 34984 129412 168833 145951 120522 181096 156436 139045 90286 75461 49599 105232 83540
8422 83540 48587 23809 17326 -39538 -69243 -19729 78445 82182 97485 136041 94528 9568
8410 9568 -80136 -19067 92356 132194 60816 22604 74019 85605 88288 88800 122869 77266
8398 77266 69983 106779 155447 159962 96543 96244 1825 -66576 33018 82197 143085 121363 105444
8385 105444 94070 79822 3113 -23620 -17952 7266 98693 154158 144233 153001 169842 44857
8373 44857 -5679 -2964 39893 98351 47068 -52020 -46275 -9185 62618 133671 153098 108402
8361 108402 102896 136271 118678 64158 36237 23730 35139 34264 94891 135278 111352 72537
8349 72537 -8348 24122 52339 68186 72050 60724 43183 77677 39409 14305 56328 133282
8337 133282 119590 48287 17886 83318 49268 12279 113573 122383 88987 55918 -41468 -64739
8325 -64739 -55399 5248 69260 -8780 -5101 11470 19619 42948 57344 70938 84293 50166
8313 50166 53581 -4827 -46583 -40651 12051 91057 80545 135235 153621 165948 195981 181744
8301 181744 159591 148804 132877 98626 89867 87412 73759 50606 18074 -74525 -69027 -46928
8289 -46928 -54090 -72772 -38221 -48130 -32811 -15458 -69654 -81049 -76701 -59482 -17450 10779
8277 10779 88197 113058 83142 4148 21973 103741 133085 41413 -33555 -14417 86233 77920
8265 77920 44398 53251 8363 -45266 -78223 -46741 9725 25999 21789 8260 -38327 -51599
8253 -51599 49377 62523 99126 -5271 -19179 80920 121042 122091 116588 148028 160258 104530
8241 104530 89203 68537 54565 25072 -63449 -25512 -5984 -40969 -26080 -11637 2055 -8209
8229 -8209 -7028 -66435 33245 62325 24381 23914 28980 -40834 -61948 36806 134002 108385 154665
8216 154665 155244 167407 143049 162406 148458 117348 118764 60190 27297 42596 72235 76528
8204 76528 78788 105747 62167 31023 -83271 -39963 15821 10308 -1442 25743 48960 -6798
8192 -6798 -17809 -25260 -50896 -10619 16782 45862 109678 79347 51224 67080 101169 32013
8180 32013 -20300 26395 36915 31807 60840 95448 115563 119262 48133 54671 37729 72753
$$ [...]
##END NTUPLES=NMR SPECTRUM
##END=
