##TITLE=Analysis number 325024
Compound Code cc 58946
Book Reference 494/88
Project Code adrs
Chemist Name craigr
##JCAMPDX= 6.0         $$ Bruker NMR JCAMP-DX V2.0
##DATA TYPE= NMR SPECTRUM
##DATA CLASS= NTUPLES
##ORIGIN= Bruker BioSpin GmbH
##OWNER= nmr
$$ XWIN-NMR		Version 3.5
$$ Thu Dec  7 10:09:13 2006 GMT Standard Time (UT+0h)  MAYBRIDGE\nmr@NMR_250MHZ
##.OBSERVE FREQUENCY= 250.131544655141
##.OBSERVE NUCLEUS= ^1H
##.ACQUISITION MODE= SIMULTANEOUS (DQD)
##.ACQUISITION SCHEME= undefined
##.AVERAGES= 16
##.DIGITISER RES= 18
##SPECTROMETER/DATA SYSTEM= dpx250
##.PULSE SEQUENCE= zg30
##.SOLVENT NAME= CDCl3
##.SHIFT REFERENCE= (INTERNAL, CDCl3, 0, 16.522)
##AUDIT TRAIL= $$ (NUMBER, WHEN, WHO, WHERE, WHAT)
$$ ##TITLE= Audit trail, XWIN-NMR		Version 3.5
$$ ##JCAMPDX= 5.01
$$ ##ORIGIN= Bruker BioSpin GmbH
$$ ##OWNER= nmr
$$ C:\u/data/dgb/nmr/ADRS/440/pdata/1/auditp.txt
$$ ##AUDIT TRAIL=  $$ (NUMBER, WHEN, WHO, WHERE, WHAT)
(   1,<2006-12-07 10:08:51.15 +000>,<MAYBRIDGE\nmr>,<NMR_250MHZ>,
      <created by zg, POWCHK disabled, PULCHK disabled
       configuration hash MD5:
       49 4B E0 1D 92 C2 6B 37 9F E6 65 BC 52 41 86 1D
       data hash MD5: 64K
       EB F0 4A 62 46 43 4D 2B EA DD 90 23 F9 BF A2 DB>)
(   2,<2006-12-07 10:09:03.85 +000>,<MAYBRIDGE\nmr>,<NMR_250MHZ>,
      <Start of raw data processing
       ef LB = 0.3 FT_mod = 6 PKNL = 1 SI = 32K 
       data hash MD5: 32K
       CB D7 F1 B6 42 06 D0 E7 57 5D 8D 40 64 46 05 71>)
(   3,<2006-12-07 10:09:05.45 +000>,<MAYBRIDGE\nmr>,<NMR_250MHZ>,
      <apk 
       data hash MD5: 32K
       40 09 4D A3 A7 4E 63 8D 6F DC C6 C0 95 E4 9F 25>)
(   4,<2006-12-07 10:09:06.23 +000>,<MAYBRIDGE\nmr>,<NMR_250MHZ>,
      <abs ABSG = 5 
       data hash MD5: 32K
       77 AF 44 8A 8E 15 EF 96 89 D5 C5 72 50 3E 19 B2>)
$$ ##END=
$$ 
$$ hash MD5
$$ 03 4D 7A 2B 05 2D 4B E2 CB B3 12 5E 99 E7 59 B7
##$RELAX= 
##$RELAX= 
##$RELAX= 
##$RELAX= 
##$RELAX= 
##$RELAX= 
##$RELAX= 
$$ Bruker specific parameters
$$ --------------------------
##$DU= <C:\u>
##$EXPNO= 440
##$NAME= <ADRS>
##$PROCNO= 1
##$TYPE= <nmr>
##$USER= <dgb>
##$AMP= (0..31)
100 100 100 100 100 100 100 100 100 100 100 100 100 100 100 100 100 100 
100 100 100 100 100 100 100 100 100 100 100 100 100 100 
##$AQSEQ= 0
##$AQ_mod= 3
##$AUNM= <au_zg>
##$AUTOPOS= <8 >
##$BF1= 250.13
##$BF2= 250.13
##$BF3= 250.13
##$BF4= 250.13
##$BF5= 500.13
##$BF6= 500.13
##$BF7= 500.13
##$BF8= 500.13
##$BYTORDA= 1
##$CFDGTYP= 0
##$CFRGTYP= 5
##$CHEMSTR= <none>
##$CNST= (0..31)
1 1 145 1 1 1 1 1 1 1 1 1 1 1 1 1 1 1 1 1 1 1 1 1 1 1 1 1 1 1 1 1 
##$CPDPRG= <>
##$CPDPRG1= <>
##$CPDPRG2= <>
##$CPDPRG3= <>
##$CPDPRG4= <mlev>
##$CPDPRG5= <mlev>
##$CPDPRG6= <mlev>
##$CPDPRG7= <mlev>
##$CPDPRG8= <mlev>
##$CPDPRGB= <>
##$CPDPRGT= <>
##$D= (0..31)
0 1 0 0 0 0 0 0 0 0.06 0 0 0 0 0 0 0.0002 0 0 0 0 0 0 0 0 0 0 0 0 0 0 
0 
##$DATE= 1165486130
##$DBL= (0..7)
120 120 120 120 120 120 120 120 
##$DBP= (0..7)
150 150 150 150 150 150 150 150 
##$DBP07= 0
##$DBPNAM0= <>
##$DBPNAM1= <>
$$ [...]
##$SUBNAM7= <"">
##$SUBNAM8= <"">
##$SUBNAM9= <"">
##$SW= 20.6930455092707
##$SWIBOX= (0..15)
0 0 3 0 0 0 0 0 0 0 0 0 0 0 0 0 
##$SW_h= 5175.983436853
##$TD= 65536
##$TD0= 1
##$TE= 295.16
##$TE2= 300
##$TE3= 300
##$TEG= 300
##$TL= (0..7)
0 120 120 120 120 120 120 120 
##$TP= (0..7)
150 150 150 150 150 150 150 150 
##$TP07= 0
##$TPNAME0= <>
##$TPNAME1= <>
##$TPNAME2= <>
##$TPNAME3= <>
##$TPNAME4= <>
##$TPNAME5= <>
##$TPNAME6= <>
##$TPNAME7= <>
##$TPOAL= (0..7)
0.5 0.5 0.5 0.5 0.5 0.5 0.5 0.5 
##$TPOFFS= (0..7)
0 0 0 0 0 0 0 0 
##$TUNHIN= 0
##$TUNHOUT= 0
##$TUNXOUT= 0
##$USERA1= <user>
##$USERA2= <user>
##$USERA3= <user>
##$USERA4= <user>
##$USERA5= <user>
##$V9= 5
##$VALIST= <valist>
##$VCLIST= <CCCCCCCCCCCCCCC>
##$VD= 0
##$VDLIST= <DDDDDDDDDDDDDDD>
##$VPLIST= <PPPPPPPPPPPPPPP>
##$VTLIST= <TTTTTTTTTTTTTTT>
##$WBST= 1024
##$WBSW= 4
##$XGAIN= (0..3)
0 0 0 0 
##$XL= 0
##$YL= 0
##$YMAX_a= 311205
##$YMIN_a= -369590
##$ZGOPTNS= <>
##$ZL1= 120
##$ZL2= 120
##$ZL3= 120
##$ZL4= 120
##$ABSF1= 16.522
##$ABSF2= -4.171173
##$ABSG= 5
##$ABSL= 3
##$ALPHA= 0
##$AQORDER= 0
##$ASSFAC= 0
##$ASSFACI= 0
##$ASSFACX= 0
##$ASSWID= 0
##$AUNMP= <proc_1d>
##$AZFE= 0.1
##$AZFW= 0.1
##$BCFW= 0
##$BC_mod= 0
##$BYTORDP= 0
##$COROFFS= 0
##$CY= 12.5
##$DATMOD= 1
##$DC= 0
##$DFILT= <>
##$DTYPP= 0
##$F1P= 14.0000005364418
##$F2P= -0.99999901652339
##$FCOR= 0.5
##$FTSIZE= 32768
##$FT_mod= 6
##$GAMMA= 0
##$GB= 0
##$INTBC= 1
##$INTSCL= 1
##$ISEN= 128
##$LB= 0.3
##$LEV0= 0
##$LPBIN= 0
##$MAXI= 10000
##$MC2= 0
##$MEAN= 0
##$ME_mod= 0
##$MI= 0
##$NCOEF= 0
##$NC_proc= -4
##$NLEV= 6
##$NOISF1= 0
##$NOISF2= 0
##$NSP= 0
##$NTH_PI= 0
##$NZP= 0
##$OFFSET= 16.522
##$PC= 1
##$PHC0= 224.6035
##$PHC1= 5.227517
##$PH_mod= 1
##$PKNL= yes
##$PPARMOD= 0
##$PSCAL= 4
##$PSIGN= 0
##$REVERSE= no
##$SF= 250.13
##$SI= 32768
##$SIGF1= 0
##$SIGF2= 0
##$SINO= 400
##$SIOLD= 32768
##$SREGLST= <1H.CDCl3>
##$SSB= 0
##$STSI= 32768
##$STSR= 0
##$SW_p= 5175.98343685301
##$SYMM= 0
##$S_DEV= 0
##$TDeff= 65536
##$TDoff= 0
##$TI= <Analysis number 999999
Compound Code 99
Book Reference 9
Project Code 9>
##$TILT= no
##$TM1= 0
##$TM2= 0
##$TOPLEV= 0
##$USERP1= <user>
##$USERP2= <user>
##$USERP3= <user>
##$USERP4= <user>
##$USERP5= <user>
##$WDW= 1
##$XDIM= 32768
##$YMAX_p= 553996199
##$YMIN_p= -99957
$$ End of Bruker specific parameters
$$ ---------------------------------
##NTUPLES= NMR SPECTRUM
##VAR_NAME=  FREQUENCY,     SPECTRUM/REAL,   SPECTRUM/IMAG
##SYMBOL=    X,             R,               I
##VAR_TYPE=  INDEPENDENT,   DEPENDENT,       DEPENDENT
##VAR_FORM=  AFFN,          ASDF,            ASDF
##VAR_DIM=   32768,         32768,           32768
##UNITS=     HZ,            ARBITRARY UNITS, ARBITRARY UNITS
##FACTOR=    0.157963299565203, 1,           1
##FIRST=     4132.6476996994, 0,             0
##LAST=      -1043.33573715361, 0,           0
##MIN=       -1043.33573715361, -99957,      0
##MAX=       4132.6476996994, 553996199,     0
$$ Real data points
##PAGE= N=1
##DATA TABLE= (X++(R..R)), XYDATA
$$ [...]
20670 55980 21144 19339 5276 -45434 -62174 -28648 1765 -14628 -19638 -5546 36761 49727
20658 49727 22701 14175 23848 25061 25968 -522 -13204 -29579 -39669 -35030 -49394 -48296 -29970
20645 -29970 17543 4681 -1412 9687 25416 47774 29088 11791 -4389 -17031 -9636 -21830
20633 -21830 -15226 -13071 -13481 -14199 -23784 -15525 -27603 -25525 -17031 13410 7176 4472 5687 6651 9954
20618 9954 261 998 -1410 -28651 -37936 -39791 -38810 -32714 -32790 -22681 -23286 2835 3454 13348 27721
20603 27721 28526 8611 -1367 -27768 -27657 -23938 -23605 -4257 12765 36687 50903 43275 41988 27000
20589 27000 21180 17307 467 -14861 -19732 -10914 -15740 -49651 -48081 -40442 -40868 -8048 25355
20576 25355 40445 53199 54355 66214 84258 65019 25891 -3735 -5944 -5920 -4108 6639 27061
20563 27061 41702 44062 20789 6954 21513 33615 9285 2194 26786 31031 64820 48796
20551 48796 1064 -8940 -1708 5009 37162 58041 3539 -19935 11854 26814 16992 -12149
20539 -12149 -16704 -4540 -14416 -44045 -72492 -72570 -25518 1741 10492 4211 -2437 -524 -10736
20526 -10736 1293 -1222 1373 24130 51424 42319 24301 -3162 -33587 -28135 1439 13753
20514 13753 -7892 -1011 15852 17585 7303 -3649 15880 23687 33997 13198 5068 14552 36977
20501 36977 29832 17865 -7338 -21770 -20900 -35830 -24832 -3786 -12667 -18771 -7642 859 7536
20488 7536 6268 1344 -28022 -29929 -5744 2993 -8230 18033 52655 28710 20042 2566 -2903
20475 -2903 2973 -5928 -18747 -8801 5665 10338 -11302 2891 16790 26691 -11720 -58503 -64068
20462 -64068 -57433 -25195 -1153 -282 -19060 -15267 3577 753 14569 7738 -35296 -31607 -21646
20449 -21646 12040 20841 -6553 -274 -33832 -21098 -8743 21454 43412 44638 25637 4137
20437 4137 -14525 -13883 8498 40850 61766 51041 29023 9863 6675 2739 -7495 -3873 13545
20424 13545 19834 717 17782 -1026 -18439 -15753 -13502 -13883 2718 -10602 -15176 1072 -11003
20411 -11003 -21079 -37302 -48985 -76243 -75137 -42392 -13310 -2530 12851 29760 27846 23351
20399 23351 18436 31269 39927 60678 54139 38833 -1760 2515 20415 32401 41606 59448 71028
20386 71028 64781 47722 27631 -384 -4839 -33436 -50298 -29413 17576 54877 16526 -2426
20374 -2426 11175 22746 30487 9547 15266 9087 -6923 -3400 13921 20001 4020 -5633 -4449
20361 -4449 11411 9619 -23864 -27387 8712 20413 19166 44590 69803 46148 29600 14481
20349 14481 23521 23715 -5355 -14391 -6333 -12038 -31405 -46025 -44111 -40590 -14249 12993 15712
20336 15712 15046 21690 14396 15167 11395 -25263 -36224 -32592 -20943 -8052 24231 16655 10942 22453
20322 22453 -4870 2996 1560 -7448 -24180 -30614 -29026 -18480 -22251 -44067 -67901 -55789 -21564
20309 -21564 25691 30183 39567 56994 65175 80986 54672 22460 10091 -6765 -10984 -6560 -11813
20296 -11813 -28736 -14841 -8194 -12798 -5721 -15824 -22529 13783 29514 17973 28132 19863 -6270
20283 -6270 -23627 -11004 14963 40950 17159 -1943 16049 43808 26874 -17575 -35447 -9479
20271 -9479 9137 -1236 -19481 -3012 14909 26420 8510 3101 2285 19304 20981 37811 13765
20258 13765 -1292 -8595 -33316 -26572 -8929 -2029 -8961 -2187 24247 35185 20731 -21983 -45628
20245 -45628 -57975 -45139 -50282 -53591 -29502 -20124 -19431 -18115 -38269 -37503 -4236 -13665 -4263 -3414
20231 -3414 5578 -6977 -5141 6551 4055 -7090 -20351 -5508 5578 23057 52396 71139
20219 71139 53709 17486 5693 23613 21946 13430 23923 7854 2150 -6300 -3923 -3672 -7457
20206 -7457 -10390 -2468 11164 16580 -1985 -5421 -29796 -24604 -7381 -33839 -43599 -14519 14684
20193 14684 -1786 -27023 -24855 -33853 -48874 -16676 15357 23269 19040 24079 11800 23179 17625
20180 17625 851 7776 33138 32413 12560 -9144 -4934 -11755 -16332 -26890 -22482 -8730 -29671
20167 -29671 -67401 -79262 -38035 -10525 5074 8027 -22248 -26630 3324 37066 29322 -5729
20155 -5729 -12062 -29516 -33420 -16367 -8219 19197 -6053 -19794 -2161 1029 882 -7914 -34559
20142 -34559 -30948 -27590 -14274 2654 4587 -10235 -40299 -22383 1870 -3165 30633 28106 10430
20129 10430 -13726 -42471 -83386 -76786 -60572 -44533 -27051 -26592 -10278 -20164 -27330 -9356 -3504
20116 -3504 -3782 -11487 -22890 -12123 -3175 20466 20739 25521 7311 895 9745 -11432 10710 33444
20102 33444 31141 36603 37126 25661 14218 -3571 3326 2952 12193 9561 -4167 -5975 -26833 -29293
20088 -29293 -36809 -56573 -28165 -13276 4527 17074 -12516 3613 8298 -4002 -10775 -11734 -4109
20075 -4109 4493 -23825 -34432 -30217 514 16641 665 -28378 -39211 -27767 -15945 -7436
20063 -7436 13651 45465 59812 34880 12026 12104 -5577 574 -8716 3033 622 -1081 16215
20050 16215 19396 1397 -14336 -5436 -7567 -14790 -15561 -542 34873 27610 13698 18479 33447
20037 33447 45066 28913 15946 16350 -6348 -1923 27874 22626 22981 20539 33231 38879 31222
20024 31222 23449 25071 -8782 -2624 -9634 -16865 -18093 -20363 -10406 -85 -1663 -768 -15712 -37572
20010 -37572 -38044 -20897 4210 12531 -9221 4869 14663 -2487 17127 32308 8885 -19616
19998 -19616 -37201 -58461 -46408 -27719 -25229 -20191 -18671 1951 21140 23615 21168 416 15923
19985 15923 24453 41494 47960 38845 28395 8465 -2229 2284 22260 30272 20078 14561 9581
19972 9581 5870 2784 32554 28505 21593 -6867 -12674 -21108 -26565 -16808 -9656 -19403 -15303 -3536
19958 -3536 -1327 -15370 -16321 -4433 10741 -6811 -227 -2678 18022 31179 3460 13131 36888
19945 36888 28914 -944 -35531 -49144 -37880 -14689 -4389 4273 -10936 -23173 -37666 -38546
19933 -38546 -38701 -36613 -28956 -27898 -33063 -26185 -15507 115 33177 39961 10577 3812 -23970
19920 -23970 -36016 -33417 -18503 -2594 6878 -33293 -47662 -22444 -176 -648 -6039 671 613
19907 613 -4112 9854 24438 6017 9842 11730 -6527 -23438 -42566 -45158 -58227 -62028 -46509
19894 -46509 -20938 13364 -10927 -32633 -19313 -5499 9277 10872 -4424 9892 -796 -27661
19882 -27661 -31562 5290 21351 -8447 -30168 -38105 -5065 1711 -36621 -43818 -48901 -56369 -40039
19869 -40039 -51893 -30673 -15359 3493 853 -13651 -24331 -32341 -34086 -29960 -28193 -28482 -29553
19856 -29553 -41223 -53221 -71573 -48186 -33667 -47350 -74806 -50631 -5337 18344 16174 1708
19844 1708 -14746 -49894 -40727 -38519 -28663 -2340 8945 -4870 -4811 2122 -11846 -33967 -37541
19831 -37541 -38322 -56749 -37337 -28526 -18145 -14323 -21603 -1821 -11190 311 14015 49221 29316
19818 29316 -14764 -47656 -48894 -48596 -60269 -28210 10597 13650 -2146 -28945 -35442 -28275 -39260
19805 -39260 -50187 -28806 -3308 6296 33337 47735 13221 7973 -3910 4165 2728 8873 10091
19792 10091 19400 -420 -14628 32608 35152 43620 80130 73754 58400 66368 53396 29873 33596
19779 33596 26472 6229 -10318 17435 3721 -17074 -26559 -4818 24352 12393 4356 1963
19767 1963 17866 20503 29149 22214 28526 21051 25821 36599 19485 7787 -5156 -37190 -16922
19754 -16922 -3630 5403 14748 48 11609 31379 45319 34379 14589 21383 32937 23801
19742 23801 1309 -29644 -34861 -20754 560 22097 35360 65827 49098 52613 69154 77508
19730 77508 106444 128658 202388 260159 302385 359586 385798 437029 468356 470206 470896 453704
19718 453704 433872 403336 342836 282821 241022 200174 187876 178776 130066 106993 96811 84953
19706 84953 64086 72384 69886 67899 60469 54286 68125 71941 32794 237 14445 31446 37868
19693 37868 25201 7925 17337 23354 18641 17100 29804 14326 10854 949 -33114 -44767 -23811
19680 -23811 -12990 -18586 -25096 -17571 -12369 -20302 -22506 -15313 -246 20694 13574 9911 20647
19667 20647 23694 32262 14373 -11227 -29760 -36284 -28934 11574 37877 13445 -13017 -8009 10302
19654 10302 12782 -2885 -18203 -35386 -15705 20183 -1314 -30463 -27352 -16755 -13422 -15554
19642 -15554 -1630 -1423 -15001 -18298 -16766 -29029 -36238 -29951 -46515 -59887 -49578 -40782 -33756
19629 -33756 -20343 -17684 403 27987 16952 5849 22457 17635 12990 8477 12460 18516 -16522
19616 -16522 -15222 9399 -16088 -39391 -24861 3034 22453 13833 10998 15943 10713 2291 -19891
19603 -19891 -22886 -37443 -51767 -42509 -31537 -8808 5021 -12339 -15561 -18652 -14921 21207 21105
19590 21105 22276 43587 24845 18733 4456 9937 -335 -2438 1659 -4573 3944 -589 -2175
19577 -2175 -15234 -17021 9244 -10657 -24794 -24582 290 22053 -6319 -12986 14246 15611 23771
19564 23771 10379 -12119 -26385 -34982 -27841 -23324 -9161 -1156 -7309 -11457 -13785 -22729 -38430
19551 -38430 -52332 -52846 -39464 -5047 8857 161 -5428 -26234 -44757 -43056 -47411 -53421 -26051
19538 -26051 390 2053 3370 -1134 27661 25190 30779 41249 68526 65013 16813 -5546 -2756
19525 -2756 -12548 -15822 -14209 -6151 901 11001 -21991 -19010 -8873 -9202 -23676 -9428 7435
19512 7435 -7251 13890 7100 -36582 -49725 -29291 13570 22683 20593 20251 2077 -15487 -20259
19499 -20259 -11622 -226 13282 -9383 -9770 -18034 -44013 -47483 -37734 -19275 -34503 -47027 -51348
19486 -51348 -36053 -2957 7476 -10274 -6773 -11744 -24664 -33072 -39357 -34483 -40927 -42883 -41005
19473 -41005 -28211 -45592 -69451 -40767 -1695 4277 3730 6520 27546 31091 36958 17572 -5201
19460 -5201 -1254 17413 10723 -4777 -5376 -10745 -13278 8522 18002 11257 -12410 -19772 -33042 -43564
19446 -43564 -42364 -45939 -46680 -46254 -36158 -31085 -32742 -45785 -18014 -11529 -20507 -6556 5712 18869
19432 18869 29398 17653 11638 5605 -24036 -46192 -37383 8381 30733 12084 -5086 -3590
19420 -3590 12156 24653 28184 20460 -23925 -11976 -14112 -21737 -13441 7275 8370 12597 18490
19407 18490 11058 -3036 -14457 -7171 7538 28269 39392 21784 36030 40105 32221 16807
19395 16807 -8846 -33780 -28871 -15657 -28098 -9661 -8989 2038 2877 11709 18288 -13859 -22258
19382 -22258 2716 29554 8966 -10937 -22184 -23722 -25434 -8526 25599 65623 54742 31276
19370 31276 5550 -3809 19860 10181 9377 -3294 17117 36903 47992 42965 45232 52132 54757
19357 54757 57661 35626 51226 48134 58706 50696 48489 46032 29405 26378 36468 25882 48850
19344 48850 95152 119846 66335 46261 59279 100925 136477 146670 156175 159895 158999 205510
19332 205510 259157 312157 355048 429572 502490 530955 541777 529399 503534 483047 430409
19321 430409 380674 327832 266554 226242 195094 171972 126150 83427 35667 21185 22137 -19148
19309 -19148 -29458 -8051 -5046 -9418 2986 26828 40743 39323 54445 73218 89185 91900
19297 91900 76006 60065 38845 20757 39205 54600 48792 71849 62709 54926 56658 56144 30343
19284 30343 20521 37989 27695 38093 54742 50925 58657 96010 94967 82992 94950 92787 82004
19271 82004 97328 78811 63587 46758 40707 50156 57594 50469 59023 101709 97817 88979 112027
19258 112027 80908 59012 76435 111898 114019 117170 139517 152899 139497 137820 133290 112301
19246 112301 75998 89703 105826 100509 98328 80755 58667 46726 51932 66434 80929 100412
19234 100412 115123 118507 105188 77429 78671 87999 90869 82117 55600 66699 75259 76074 90925
19221 90925 103497 115821 113505 132529 129127 110678 92826 113148 141664 168193 183738 220378
19209 220378 210259 199623 228890 255513 265621 267209 269069 250008 250626 290545 309864 327506
19197 327506 342825 347533 359698 416745 432582 456503 485696 510392 565077 644476 748487
19186 748487 878576 1021604 1174585 1283371 1364740 1512602 1716494 1896164 2009042 2104417
19176 2104417 2184813 2274771 2340696 2379188 2467182 2573246 2717265 2874380 3104793 3392986
19166 3392986 3815124 4380553 5145218 6201331 7715686 9958049 13237367 17840675 23751533
19157 23751533 30829728 39252605 49377094 60463043 70453606 78336983 84881847 90191471
19149 90191471 92269127 90020016 85120373 79092065 71270517 61179348 50425821 40813222
19141 40813222 32724948 25756373 19849803 15215919 11833891 9457861 7714970 6422330
19133 6422330 5444719 4689245 4129484 3690727 3348336 3090841 2921923 2791601 2696984 2613544
19123 2613544 2556061 2520974 2483200 2430198 2346319 2224674 2098198 1970297 1809986 1624137
19113 1624137 1466332 1305549 1148608 1020598 896260 795688 723961 638714 582889 562143
19103 562143 537822 531378 520782 488384 477358 451125 417858 367322 342379 341687 338338 328792
19091 328792 324489 323941 309019 278935 257879 229169 218405 206982 216815 246677 261564 260258
19079 260258 263665 295093 330960 315707 282754 288631 302443 303009 305482 286062 300878 317560
19067 317560 305878 310766 320972 348666 360749 399679 441969 474392 463833 473081 495353 476510
19055 476510 462986 430181 391101 354176 331990 288787 268883 284973 292078 291874 283518 252354
19043 252354 260237 290190 309951 293432 261518 215408 216006 219746 211283 211723 168295 148152 152950
19030 152950 118255 92447 91149 83809 86279 97125 96323 70490 63394 49099 18989 32521 54704
19017 54704 75813 70744 67693 84612 102012 95276 97732 109976 128145 139892 141130 154992 170992
19004 170992 151374 153076 153908 133305 121603 129719 98644 82489 82871 78825 80073 79594 68146
18991 68146 90780 97518 78226 26418 31170 48204 46727 24966 19323 38048 20666 -588
18979 -588 -11857 -7827 10959 1961 3408 -3627 20680 -4445 704 3188 21203 18306 34185
18966 34185 53286 52412 67105 46284 39338 31826 15729 44574 51311 66444 63699 53867 59107
18953 59107 78727 97784 88637 82001 81968 83830 60988 48967 52479 70663 97998 80285 73178
18940 73178 100592 73010 42201 26247 16090 31844 50434 90231 92286 74001 76578 67171
18928 67171 64084 50614 40427 32861 42897 26934 23156 9024 2493 5565 11844 64580 84710
18915 84710 67916 58803 76326 70667 41930 1953 -19238 -5866 12133 26904 32468 55232
18903 55232 60514 59179 43628 33406 48086 35211 42203 43525 27612 35981 72303 74920 53666
18890 53666 34368 18226 20999 20004 23558 20322 51663 64397 75286 62074 63203 78501 90128
18877 90128 76648 55099 48799 50544 10638 7023 7749 25234 53903 77944 74171 48084 46845
18864 46845 42374 67775 93209 87439 100346 127804 152079 157613 142684 112596 108860 119727
18852 119727 90922 48713 63001 69895 108795 109913 79261 61459 62488 96187 103621 125031
18840 125031 132727 115274 86186 60891 38964 22816 -6051 -1503 17477 -6883 998 17448
18828 17448 38393 34819 43929 33806 50031 61172 83648 93606 107860 124906 153917 158761
18816 158761 163024 164124 160133 181530 175397 168282 186611 177578 199710 215991 220008 234663 255823
18803 255823 280206 286176 299337 285817 302375 354205 380633 423403 500291 609895 713518
18792 713518 847792 991362 1131610 1304606 1463805 1613705 1739009 1833132 1885068 1887558
18782 1887558 1866279 1825506 1769439 1723453 1739671 1814437 1907126 2040455 2200031 2402849 2660797
18771 2660797 2998478 3428100 4022135 4839866 5846622 7139614 9139713 12214465 16816911
18762 16816911 23218767 31368795 41419294 53671941 67068497 79053982 88606996
18755 88606996 96487952 101062110 99840715 94213859 86486366 76198786 63491468 50833105
18747 50833105 39869984 30640605 23104216 17372801 13258066 10342677 8295578 6821193
18739 6821193 5743288 4918017 4281747 3803179 3413344 3056946 2804507 2580222 2418468
18730 2418468 2268058 2151208 2128783 2104397 2130768 2175221 2181966 2188028 2174956 2141272 2060405
18719 2060405 1954619 1819065 1657782 1489683 1322845 1146284 996440 850277 726040
18710 726040 629733 535963 482358 465596 446941 400532 384589 392641 379579 365685 363127 343513
18698 343513 326413 300605 290207 272892 256579 248816 224093 228952 260381 263988 267907 277330
18686 277330 260418 263191 252900 216749 199031 192529 182804 192006 190890 212299 221505 234037 224192
18673 224192 173257 153770 138013 142933 118667 102910 97434 101620 130335 142548 133319 102343
18661 102343 87741 95173 141058 152880 179250 182350 151810 126609 121626 85636 86303 92745 96439
18648 96439 80653 88386 106324 91414 122358 117074 123426 115533 129834 149898 168478 154668
18636 154668 104967 88787 87711 79765 65194 55306 50411 54158 48918 21056 8592 55831 95044
18623 95044 98511 80693 45877 43092 72247 62483 62200 71919 39971 42441 56118 59472 89424
18610 89424 114474 119631 99294 106400 121511 126338 139012 122583 83666 79289 72634 71983 61877
18597 61877 38196 21187 24130 20249 9823 31042 43889 41254 6446 41696 87469 129054
18585 129054 123486 91330 75614 92305 140378 177125 202422 247591 309038 327469 342499 401915
18573 401915 445422 505310 508255 488389 466874 439679 408449 344833 282171 248965 233549 202147
18561 202147 167664 146793 118498 121550 138663 121236 87867 97436 111470 118050 111318 101638
18549 101638 81814 64928 74030 69044 66796 75354 78646 55309 39658 45680 59986 57686 48449
18536 48449 64511 61266 39222 33909 39018 62065 63226 65009 58920 39322 37458 62115 65680
18523 65680 43693 14733 -82 4366 49627 72825 60153 50491 43784 35242 23831 30257 46113
18510 46113 60773 56598 21370 -17485 -17516 3967 20625 12197 9209 -3814 8584 19508 16317
18497 16317 19898 54016 59461 24506 28890 46819 37055 17641 39287 27725 23433 27312 6791
18484 6791 10131 26730 32121 14258 18636 42236 50764 34201 51688 54982 94573 77521 51727
18471 51727 43795 32835 35783 20614 26809 17339 1837 -8900 -31827 -41536 -13090 15242 28723
18458 28723 26320 20056 401 -22294 -16187 -6742 1463 15498 25994 50009 33208 12584 -32855
18445 -32855 -55740 -61643 -26181 -10568 -15002 5 19896 32474 22844 18861 10617 34378 46932
18432 46932 50997 45146 30996 34265 41219 25419 12142 6964 2430 -17678 -13595 -6366 -6630 6152
18418 6152 43393 70235 66762 35478 -10263 -23466 -31427 -16964 -10195 -2926 9450 909 -14605
18405 -14605 -44432 -43872 -19179 -35966 -58668 -36278 -34346 -18271 -214 13708 22038 -1101
18393 -1101 -9980 -16032 -27389 -30289 -26884 -27590 -10984 14169 14202 -15040 -20930 -3814 13581 -14334
18379 -14334 -11365 -27272 -22990 -495 27717 25807 16317 38746 55345 6672 -18734 332
18367 332 -18381 -35071 -18983 -37292 -3375 14574 -7116 -4597 12455 28255 3790 -17994
18355 -17994 7145 34 -24493 -13668 4033 14013 -5382 -7867 46 1212 11487 36537 28417
18342 28417 8292 10583 19550 31383 22909 28718 15621 -6528 -25345 -8948 -27192 -15881
18330 -15881 13596 47208 43572 45802 27760 31013 40120 13438 13973 -10974 -22429 -23553 -19538
18317 -19538 -21209 -55699 -51440 -52330 -66801 -38919 954 1613 -5575 -12606 -26132 -51390 -50320
18304 -50320 -24638 -358 -4106 -6691 -3937 -26295 -23505 -24403 -3715 -2311 -24191 -33602 -4878
18291 -4878 974 19073 16093 19204 7872 22877 2178 -6860 -3759 -10676 -27575 132 34545
18278 34545 29865 26460 15660 -2290 -25153 -16528 -8026 9853 34146 32658 6448 -4942 8615
18265 8615 -12088 -39386 -10683 9903 -2431 -14717 -19167 4516 7819 2289 11213 14079 11597
18252 11597 11431 685 -22982 -16726 -16795 -9525 -7568 3968 31949 32367 37805 33025 16335 11675
18238 11675 16622 44393 75056 50600 37314 58711 54230 37925 16044 2559 12239 -20106
18226 -20106 -37559 -29486 -20378 -10429 21972 83006 77209 42353 48216 50831 64101 76592 94863
18213 94863 98690 84942 33248 14134 37643 56177 40062 22424 9603 -24269 -37305 10856
18201 10856 31385 39854 43288 44004 47892 44105 49455 47709 44906 34236 24294 19843 33834 36787
18187 36787 43598 88947 119891 170854 216293 248526 300341 364510 418604 495251 542857 557723
18175 557723 550266 524170 477154 429151 382684 335269 301419 261292 213644 144355 98941 100248
18163 100248 84961 63161 75533 104976 108064 83237 57459 64739 44947 32760 43512 70452
18151 70452 82663 78917 75413 89535 99386 111211 118134 116037 124766 109442 94762 116959 131559
18138 131559 146636 186574 215702 212759 204839 209202 220418 267322 314245 325241 328718 350766
18126 350766 349916 410173 507762 638049 708711 739596 846061 1062159 1402147 1834792 2438392
18115 2438392 3379693 5039865 8164446 14395295 26878797 48488161 64426103 47262437
18107 47262437 25983745 14827508 9498943 6639041 4916943 3775200 3008587 2459472
18099 2459472 2030533 1688454 1415557 1179732 1016032 893834 740834 626228 567103 536643
18089 536643 500769 472251 422050 378108 340004 319372 273925 217883 211218 205415 203774 217460
18077 217460 250369 246500 225710 192310 173594 174721 175019 155463 123531 133144 145323 155944
18065 155944 189435 209468 261304 264107 257922 268572 225942 155276 116683 92983 73341 62952
18053 62952 66843 93621 115810 115873 82239 63093 74732 56990 47843 40418 70514 90323 88612
18040 88612 84637 87994 86507 69985 25328 27013 33197 32225 28204 24218 61986 76227 120595
18027 120595 178026 200223 207246 198733 156116 125052 85258 54565 51568 52974 47458 41362 39274
18014 39274 38236 18575 1753 20938 3434 -5433 9987 3798 -2615 -4546 3926 9346 3708
18001 3708 11596 1588 -30864 -19411 -20073 -31157 -6835 4849 2152 10796 37867 15510 -1551
17988 -1551 -6271 -20437 -9415 34089 45696 5309 -22785 -49121 -43773 -30681 6776 24634
17976 24634 29435 40047 33718 11416 -22524 -35330 -33029 2882 28497 31157 868 12083
17964 12083 10981 16256 22415 11600 14039 -9458 -14056 -11667 -18145 -36860 -38231 -24916 -7505
17951 -7505 7435 -11649 -12109 -17886 2263 7039 -6 12495 13661 12736 3345 22792 21533 28114
17937 28114 22729 -30308 -69817 -76097 -32295 8316 12154 48261 46965 48365 59225 49762 29025
17924 29025 31896 36096 42464 64212 72271 67481 49770 71437 61891 28405 1276 18316 35824
17911 35824 36719 39260 59850 53096 35745 25539 20623 29062 12656 7219 33779 40913 12512
17898 12512 29520 35523 46554 55405 49408 40803 21273 17059 25524 20477 27641 16027 4474
17885 4474 25132 50172 57124 40190 45332 42821 81078 72488 50470 21224 27152 23245 26384
17872 26384 25535 19747 24765 18153 2283 22266 31100 -224 1407 9441 -848 -18493 -21746
17859 -21746 6968 47502 61195 61481 53052 62676 59578 33574 12885 12784 32136 41157 12776
17846 12776 -6199 -28331 -34268 -38331 -35962 -30475 -2291 215 -15922 -38734 -28515 -5305 23186
17833 23186 2065 7121 12187 14536 -4007 13821 47727 43303 50565 50217 47543 65250 68916
17820 68916 74573 59230 43698 40097 38677 36545 38963 44627 78652 67539 37269 14996 -347
17807 -347 2595 20115 3112 -7452 -30073 -64573 -53439 -22754 -18163 -10165 499 15642 30465
17794 30465 4380 13198 10490 -15500 -19836 -3944 -27218 -37957 -25907 -4362 22511 50808
17782 50808 38411 8037 5710 -1891 -5946 8457 1833 -3123 -7003 -10691 -1297 -15705 -28307
17769 -28307 -26122 -5418 6567 15110 9296 -3243 -5438 -13983 -39056 -22405 -11200 7868 33448
17756 33448 22831 23222 12397 -24586 -12304 7340 2877 -4140 -11917 -4324 -6300 -20500 -7764
17743 -7764 8443 -3345 -49843 -49818 -33772 -13675 4944 -20745 -32809 -14600 -11209 -23305 -12274
17730 -12274 8912 14805 13102 -5270 -13927 -32147 -15847 18469 10955 4670 6785 2458 -26476
17717 -26476 -28228 -27823 -24300 -37142 -32621 -25410 -39971 -41639 -42839 -32155 -32623 -35446 -33693 -9883
17703 -9883 -8477 -23303 -29802 1661 23185 30397 23984 17986 15596 17859 28719 22297 11255
17690 11255 9547 8907 22547 22125 21237 14433 7099 4457 14440 18574 23895 16582 -33246 -45425
17676 -45425 8140 46711 25987 -432 13427 7898 16839 8350 8828 43594 70110 59312 44191
17663 44191 45177 30403 37930 17309 23710 42982 47730 18681 -6083 -22424 -40591 -6879 9016
17650 9016 6157 865 9840 7927 -6647 4304 9787 21111 49513 68737 58506 50419 35204
17637 35204 31279 45595 38506 26607 -7904 -22905 -25243 -29021 -37808 -34439 -13778 -25656 -21973
17624 -21973 451 -4783 -12464 762 6807 12485 15114 -10615 -18844 -3245 -9234 -8057 5189
17611 5189 -23199 -19832 -16498 -25755 -55744 -63960 -51796 -56830 -52353 -41286 -10249 45012 111440
17598 111440 137163 154712 168666 166320 146115 136498 114910 71599 55185 32881 33189 32422 17334
17585 17334 11055 -9071 -14301 -9454 8698 30112 23536 35426 31098 11092 -2501 8139 2463
17572 2463 -22209 -18331 -2046 -5656 -19294 -8798 -4172 22922 73686 124003 140747 160290
17560 160290 159956 124988 67746 12140 27694 39484 20125 12424 29800 4538 -2818 -14564
17548 -14564 -32664 -13598 22882 16197 6657 14713 19431 -3707 -35700 -35002 -12648 2591 10341
17535 10341 16189 25994 18546 1897 1329 -9730 -36809 -57746 -53964 -36244 -51292 -71494 -45189
17522 -45189 -24191 -24040 -23529 -39970 -29644 -30930 -22663 -48795 -27898 13245 22284 28679 39382
17509 39382 17746 -6453 -22801 -17247 20155 11523 14536 14803 -3142 -30702 -33456 -20768 -24671
17496 -24671 -28153 -12318 1023 19464 29585 10179 -17059 -4116 23729 4599 2299 33700
17484 33700 61529 33523 25117 17498 -12192 -13595 -27582 5488 57263 54632 31866 16922
17472 16922 -17843 -13545 911 -4668 -5865 1621 -2464 -34480 -33345 -34828 -39730 -31595 -4017
17459 -4017 5440 -19038 -45014 -27280 -14647 -22830 -21844 -11345 8889 4901 -1490 -3033 17493
17446 17493 45097 89640 194025 308398 293001 177043 104680 78084 63150 66290 80243
17435 80243 40223 2578 -32940 -19445 4392 -25095 9433 26206 18538 -18317 -41598 -63375
17423 -63375 -47765 -21341 0 -12044 -27095 -9893 -10245 -8514 -17782 -13393 -21755 -16906 -19133
17410 -19133 2959 -16040 -26265 -48927 -27686 7469 -12262 -32547 -22823 -12066 11901 34498
17398 34498 21415 5705 -20934 -12047 -4446 161 -40155 -54947 -34394 -41234 -23531 -2354
17386 -2354 1826 -12559 11118 26939 4592 26439 35013 35404 37657 10463 -3994 256 27532
17373 27532 21591 25807 50277 36132 24288 -11381 -3742 12726 3397 -26192 -49077 -34101
17361 -34101 -17008 -12223 -10211 368 -1543 -4434 -6125 -15724 7292 3051 14481 5763 16494
17348 16494 44620 28155 28540 23907 -20175 -29241 -23190 -28858 -18842 -34397 -38216 -31968 -48728
17335 -48728 -34037 -28244 -34665 -29675 8494 18547 20204 13980 -9549 7615 17060 14799 -2684
17322 -2684 -21027 6957 20166 9088 -39944 -39881 -16837 -5242 -4526 20398 13781 3589 685
17309 685 -6085 2326 3008 42410 39600 -5712 -28870 -36734 -7046 -4715 -31409 -8842 31294
17296 31294 21809 5023 -2919 -31191 -7674 21284 8729 -7779 -7740 -2280 -9723 -11952 -3797
17283 -3797 6151 -25553 -34882 -6625 -8470 -33009 -31415 -19509 -9049 -1521 -21304 -29866 -5884
17270 -5884 17104 26509 5964 -25271 -30076 -47151 -38440 -19306 -16905 -32515 -22220 -7589 -8423
17257 -8423 -12453 -17635 -24861 -46300 -45545 -36430 -32050 -26696 -26881 -2542 -7962 -32983 -22257 -8921
17243 -8921 1093 -25185 -41152 -36029 -12135 -12374 -16941 -9302 -8880 -23695 -43297 -46210 -31
17230 -31 22418 -718 15823 21634 18888 28424 16597 -9146 -27286 -4846 -14599 -30895 -14005
17217 -14005 -11477 -28947 -32659 -25432 26475 26873 28430 14349 51582 60348 38110 17186 28478
17204 28478 38458 15768 37871 37383 28980 14802 -6432 23306 19658 -625 -6167 -35585 -27077
17191 -27077 -23920 -7868 -5748 -20884 -12655 -21217 -39770 -12105 8513 11762 4204 1042 -13629
17178 -13629 -18913 -6985 -37738 -40536 -20071 3901 14381 -4042 -9749 -15539 -14892 -23227 -33350
17165 -33350 -24991 -23300 -10276 -12814 -24524 -17578 -7227 9643 -1545 -16578 -18848 -9042 427
17152 427 8779 23598 25991 27808 2542 -14620 -6569 -26750 -27027 -10466 -10612 -31346 -36320 -41222
17138 -41222 -48487 -43195 -26387 -26496 -17651 -7607 1915 -13533 -38490 -42914 -41438 -36377 -57590
17125 -57590 -43797 -49518 -60861 -43284 -45884 -49185 -43010 -23913 -41005 -20716 -4240 -8264 18460
17112 18460 21651 5459 8630 -20005 -38591 -26150 -13463 771 -8028 2861 -538 -26618
17100 -26618 -41873 -43002 -13432 -10112 -44581 -15255 12191 -3950 -15382 -274 -3154 -6987
17088 -6987 5368 23148 20548 -6896 -27931 -40433 -42309 -39773 -24990 -28041 8390 23452 -12796
17075 -12796 3500 16768 -5793 -6541 -3010 1389 3261 -10998 -11506 -10962 -13411 -30869 -51122 -23777
17061 -23777 23456 18215 6992 -22268 -37855 -36357 -16581 16391 21784 28016 33349 50036 57921
17048 57921 64815 35792 -5490 -28044 -43910 -32197 2728 10962 3857 -6607 -16326 -3024
17036 -3024 13164 20415 4954 -20238 -43712 -35805 -19305 -35728 -21664 -20438 -18778 12449 16605
17023 16605 5177 15047 4328 48769 66268 37848 28631 44058 30860 14544 13497 20397
17011 20397 11262 -27483 -40919 -27067 -12335 14885 37533 28633 21067 4089 11108 19275 30965
16998 30965 33401 22909 8291 -7110 -7698 -4870 -28670 -25096 4748 10385 7388 20777 29625
16985 29625 -276 -35997 -28553 -7910 -6440 -16401 1926 17157 26840 45292 37764 29392 59501
16972 59501 74779 62919 36505 21898 33448 50479 14664 -19454 -30932 -8250 22667 21880
16960 21880 -6381 -17193 -14273 -514 1374 -28120 -22573 -8512 -8746 -14572 -13349 -16858 -8460
16947 -8460 -25892 -9115 -24171 -46578 -62356 -61392 -45310 -9827 -27123 -57501 -75722 -70182
16935 -70182 -52484 -27597 1754 -265 -13255 -19068 -36763 -40477 -37180 -51156 -70415 -54355
16923 -54355 -39346 -28051 -28287 -28824 -31686 -14199 -18951 -33392 -14630 1741 308 13437 27946
16910 27946 22250 -2674 -15445 -15471 -10413 -2108 26160 25023 9034 13401 1450 -2286 6721 -2866
16896 -2866 -25920 -26890 -9356 3855 -2426 3659 -5989 -13901 -11947 -5025 -3626 -27530 -16015 -7176
16882 -7176 -14691 12034 6718 22537 56178 38135 7120 9710 56565 67435 53667 46419 42367
16869 42367 26251 11662 995 12836 18525 8702 4844 38502 17938 -1511 662 5129 -38902
16856 -38902 -21008 32028 42293 28789 3511 -4120 7621 -8289 -24504 -20709 -28667 -39071
16844 -39071 969 19737 22480 31060 39320 36644 5376 19936 2431 -10327 -18930 -18163 -2532
16831 -2532 -10890 -18322 -17202 17261 43783 16958 -22296 -14462 -10412 -7754 8446 8993 18828 17214
16817 17214 9471 -19490 2816 16514 7613 -15586 -38947 -42217 -41662 -42354 -40015 -57611 -48067
16804 -48067 -47650 -36836 -25305 -7086 -23045 -41421 -9886 -2557 -15199 5020 -18283 -16117
16792 -16117 -14987 -20786 -15031 -22626 -14028 -11260 -13741 -3466 4396 -10332 -10378 -9280 -12462 -764
16778 -764 973 -8212 -10119 -11722 -24580 -27339 -2809 18083 14047 14137 12474 12145 -19621 -25620 -12883
16763 -12883 1070 -1225 -25869 -33151 -44757 -55810 -31177 17852 6044 -30063 -20405 5950
16751 5950 27072 14572 21994 37327 30837 43519 46052 13957 -18041 -30687 -28888 -23691 -13402
16738 -13402 -15956 -26824 -14218 -3475 9626 13224 4732 5526 18104 -7345 -22890 -29958 -14188
16725 -14188 -5470 1766 -11485 -10333 -9915 20129 20189 -2628 2490 -7731 -34210 -33476 -8203 24476
16711 24476 27380 22827 6922 5587 -23810 -11843 25067 3661 -13293 -3941 -51384 -73386
16699 -73386 -77729 -84030 -87111 -65780 -49450 -47146 -36085 -7455 -8796 -15224 1382 -6288 30406
16686 30406 43262 20469 -29375 -43955 -56562 -25741 2440 6296 -16264 -36020 -51777 -33350
16674 -33350 -24455 -2871 -9851 -9053 2924 -10037 1938 3052 10963 23535 32362 29645 24201
16661 24201 28599 29820 46086 47969 29637 1667 -25019 -42732 -14660 -22624 -18358 -23301 -21392
16648 -21392 -12868 -14072 -8894 -819 -17897 -15429 7638 5942 9658 444 -7517 -20292 -17441 -21673
16634 -21673 -6155 11459 890 13665 25867 21310 -11257 -48330 -42737 -3074 8205 304
16622 304 -9284 -24251 -18043 114 -1401 -8427 -24713 -34440 -31577 -41161 -44582 -48791 -20191 -532
16608 -532 30060 12460 -8865 7968 33525 8951 -30941 -40871 -28190 -18952 -17668 -12360 8087
16595 8087 24794 33774 20652 30304 3821 -28572 -7006 10275 -2550 -38923 -32609 -23045 12857
16582 12857 23303 5661 9321 22282 27357 16467 -12595 -4731 -28806 -45178 -24917 -8123
16570 -8123 20055 -5 -9606 -12267 -29428 -14838 -6327 -10823 -22047 -24723 -48237 -70533 -99957
16557 -99957 -81205 -35917 6607 17637 2317 10722 -10443 -25692 -25126 -11914 -14457 -14558 -10472
16544 -10472 -14351 -45573 -55180 -29555 -13304 -1272 3838 -8083 -19629 -32699 -26106 6702
16532 6702 24300 2711 -31725 -39968 -40482 -19999 -17812 -21363 -13860 -13370 413 32125 9768
16519 9768 -6400 -3901 -8480 -32609 -22544 -23276 -8118 -11958 -4917 -10364 -17895 -6014 -7409 7317
16505 7317 18763 15950 -3220 -54836 -65279 -35361 -7853 19693 13918 11010 -12370 -5464 -13736
16492 -13736 4841 -5339 -13707 -5607 4915 7399 5372 13661 2789 -19120 -22275 -39404 -13831
16479 -13831 6338 2466 -6005 -8099 -16485 -36312 -21072 8571 5853 -1778 -3978 -205 -19489
16466 -19489 -45647 -54807 -55050 -58219 -32167 -23630 -14026 4466 -6532 -12549 -4377 13360 23875
16453 23875 -2851 5481 37834 19361 7414 -4060 -2513 -13135 -8261 -10673 -1464 21652 22163
16440 22163 -31067 -47511 -53551 -43646 -26758 -4961 12375 42685 42523 6759 -8626 -13741 -19336
16427 -19336 -14051 -10756 -22186 -1381 15486 -2114 9329 9135 2949 20439 353 4268 -439
16414 -439 -4014 -1840 16084 16714 23441 21327 14024 10586 -13099 -42421 -49711 -30370 25583 22868
16400 22868 31555 26181 -2731 -9727 -12043 -23659 -2915 11363 6169 17151 16580 37785 49756
16387 49756 32377 25780 29416 26984 7651 -44586 -53273 -48874 -20090 -20358 -30674 -40303 -25823
16374 -25823 -2830 -20633 -32470 -23516 -46742 -18668 -12037 -13955 -29636 -47768 -57527 -52976 -16687
16361 -16687 -8816 -17869 -20714 -6030 -1343 -6145 -1034 -2250 -9722 -7545 -21391 464 6486 -8703
16347 -8703 5810 -1710 38263 45189 21157 -1715 -31935 -44706 -33735 1973 24492 29815
16335 29815 23998 15625 12463 4407 9929 1866 -13483 -1373 9325 16758 11100 20380 10352
16322 10352 7921 15061 55433 60765 53923 41023 34314 40517 13394 -2215 9035 8481 4104
16309 4104 24714 12073 20961 20520 342 -10057 -40291 -35623 -16601 2081 -1980 -23066 -39225
16296 -39225 -42723 -42054 -37468 -24172 13065 -10727 -23265 14644 33626 13129 14319 -1050 -9447
16283 -9447 -48239 -41661 -18533 -7293 -15747 -21017 -4360 4747 22071 34717 13146 4337 11080
16270 11080 22982 26345 9624 17923 -631 -22780 -33331 -24411 -24044 -36558 -60592 -56683 -57585
16257 -57585 -59135 -31647 -25180 -30828 -20909 -11143 -23772 -17654 -23594 -39193 -19774 -87 11671
16244 11671 8145 4112 -1871 -31303 -31143 -7200 -19874 -28558 -16694 -24719 -271 30032 26323
16231 26323 4698 1736 33013 17181 7474 6597 13429 7087 -18241 -30208 -31191 -23635 19916
16218 19916 11812 4907 18657 -2597 21057 19260 1135 -19005 -29012 -38519 -6167 26296
16206 26296 38563 48338 46437 25845 52421 39985 8920 -11434 -26790 -13405 -1326 4497
16194 4497 -10596 -24882 -16298 -21307 -8393 -8444 -38736 -37895 -21931 -16001 -1328 -7113 -36512 -33665
16180 -33665 -27651 -16245 -9765 -23996 -33629 -32470 -22667 -2937 13678 30388 8802 -6913 5761
16167 5761 5473 13776 6667 -6821 1884 -4957 -19751 -40455 -50086 -23228 -18828 -18878 -15306 5045
16153 5045 -6942 -2313 2347 -13007 -11733 -14915 -35757 -47155 -63082 -67938 -34021 -31575 -24347
16140 -24347 1690 -16852 -39730 -33961 -24542 687 10718 4576 17903 21555 25809 36590 28251
16127 28251 17480 22028 32841 19328 15289 21357 25279 20624 28365 22908 18718 -8813 -6016
16114 -6016 9446 -302 -14973 497 -20221 -19563 -19780 -27128 -26662 -23698 -26916 -36375 -21756 -12500
16100 -12500 -15512 -357 6759 2761 -3428 -6515 -15495 -14283 7589 7484 18360 23509 14021 -4920
16086 -4920 -6398 -2325 -8305 5942 1003 -19059 -37463 -56294 -78422 -72897 -44755 -21573 -42406
16073 -42406 -56348 -21084 -11629 -10126 -4774 -24950 -34269 -37908 -29284 -14108 -11491 -22554 -21512
16060 -21512 -18182 -4405 -11011 6463 -22624 -19217 7329 4318 -17343 -12247 19249 29279 22419
16047 22419 26820 26043 16108 12702 6207 8370 12366 26888 45285 37191 32446 22169 -1222 -5863
16033 -5863 2524 2134 13600 18124 -6539 -36822 -24983 -2857 15877 20198 18776 -5 -13220
16020 -13220 -25108 -22375 -4876 15670 55237 45836 18976 44989 41469 22661 36193 45237
16008 45237 10543 -1473 20126 23685 21903 27589 14998 -6893 -19996 -34915 -20395 -21856
15996 -21856 -14759 -8005 -10591 -14429 -45643 -40689 -38655 -26206 -17458 2989 13616 -4306 -24371
15983 -24371 -32506 -47051 -48033 -41950 -23770 -10279 -2218 -25952 -40317 -32086 -14878 -8108 -17166
15970 -17166 -23026 -20777 -45185 -27262 10878 -5849 7450 -5407 4178 26301 9012 -23655
15958 -23655 -37046 -43193 -34291 -46462 -23143 7322 -2362 -14847 -6293 -8510 -4911 -14161 10917
15945 10917 30133 7589 -36179 -70875 -55761 -37397 -52431 -70302 -30382 -11129 -12654 -12542
15933 -12542 -6778 -28039 -30359 -2161 7716 20579 7031 -20597 -25819 -15376 -26850 13363
15921 13363 37240 21028 27146 41018 46559 22588 9717 33349 13139 21312 31735 19006
15909 19006 -579 -53613 -66000 -30859 -22890 -33349 -8549 20851 25764 10520 -20348 -27116
15897 -27116 3292 25593 4711 -54352 -61191 -56717 -28775 -11149 -10912 9031 -4941 -40792
15885 -40792 -20791 -8205 -929 -4975 13909 -37 -21401 -25281 3508 7272 6129 9408 -7698
15872 -7698 8071 17834 -146 -8657 -17693 2647 14616 19716 8746 14639 4331 2048 24667
15859 24667 21434 25852 25507 18428 -1091 -3111 -34592 -37079 -4268 7664 -6711 -18261 -33804
15846 -33804 -29627 -8948 -501 -26150 -21446 7216 1622 1757 12987 13200 -818 -4165 -34155
15833 -34155 -47258 -45515 -52476 -58899 -28956 -19677 -35834 -57945 -33501 -21002 20190 58318
15821 58318 45072 3172 -14645 -3373 19621 26131 19038 55522 72448 75112 42743 25679
15809 25679 19818 10957 18022 31065 19642 1860 27157 44778 36693 14600 14968 32515 26412
15796 26412 3885 -1297 8663 -4556 8578 24729 12283 6426 -15849 -33336 -33972 -30731 -44481
15783 -44481 -41746 -58295 -58900 -29960 -10585 8076 6170 -1157 -24000 -22963 -11363 -1446 -1173
15770 -1173 6107 1273 -9368 -19812 1036 -17393 -6273 7664 13052 10392 21753 32471 27700
15757 27700 -25898 -25085 -24069 -27416 -4389 -14413 -32033 -34030 -8472 -1061 -24756 -45829 -36478
15744 -36478 -38451 -39137 -47784 -35465 -33293 -54700 -25365 -970 -12065 -16537 -16554 -13643 -5230 34339
15730 34339 50640 53971 44408 24070 14383 18362 26454 22540 19623 -501 -11536 -15415 -5163
15717 -5163 -11912 -24844 -24635 -26396 -27664 -13510 12982 -7485 -8480 10962 18825 -1226 -1875 3621
15703 3621 2112 -31406 -34403 -16459 12032 18053 17240 18012 19506 -26213 -23287 -9486 4083 10213
15689 10213 -2274 -27066 -31145 -47310 -74401 -85022 -55205 -33679 -27067 -30223 -12551 8020
15677 8020 40420 49139 33570 24377 31714 47512 27467 -4646 -33765 -22662 -5195 -10015 -14241
15664 -14241 -45210 -63913 -51733 -36416 -34938 -14788 -3182 -12942 -30378 -38165 5156 22676
15652 22676 -15021 -21119 -9312 -14235 -33428 -48102 -42924 -34743 -13474 -17198 -45532 -29880 -6024
15639 -6024 -6501 16775 31848 24644 13851 7367 -13150 -20142 -30490 -36498 -17444 18052 23621
15626 23621 -1812 -12082 2004 9461 -3697 -39006 -42717 -14526 3004 25629 22630 20157
15614 20157 -7689 -11466 7775 5195 -9878 -4430 -25194 -30562 -12035 -9707 -24815 -43046 -36788
15601 -36788 -27881 -11193 -649 -13215 5208 -4460 -5326 11946 18327 19729 24732 20010 4775
15588 4775 4117 32580 39288 18826 514 -11698 -8849 11182 11135 13583 25995 2884 -8282
15575 -8282 -8523 -16138 -31402 -51535 -37890 -17464 -13293 -17200 4601 43889 34196 12383 -5942
15562 -5942 292 -14096 -9435 -17874 -29467 -13931 -6389 4352 20916 11355 -7290 12440 -10793
15549 -10793 -36750 -37254 -30461 -31668 -25238 -50886 -70443 -68613 -42536 -37576 -44393 -29175 -3433
15536 -3433 20910 29221 33212 22407 21527 5526 -12215 2784 22068 19007 -4327 -16831 -9107
15523 -9107 8774 26648 10426 -24156 -22035 -20040 -32545 -29981 -41451 -5325 -24752 -44412
15511 -44412 -37750 -14515 863 15343 16010 10540 8847 -17701 -33785 -38243 -57294 -27769 5584
15498 5584 24341 -16792 -23478 -23788 -3979 10430 11302 36384 9648 -11177 -28377 -15542 -2645
15485 -2645 -13604 -17632 -8986 5978 31743 36436 9382 4551 8036 -3127 -8248 28668 28146
15472 28146 10589 528 -27331 -10595 3797 34516 35333 36745 55859 54279 42247 23089
15460 23089 6893 17169 35361 16036 -5443 -10862 -911 9642 21918 30540 41268 47521
15448 47521 47739 35907 14709 -11243 -13220 8478 9554 -3379 18123 15062 19687 2209 13517
15435 13517 18426 -12704 -17784 14560 19745 14594 21056 -10082 -35710 -38687 -51378 -65342 -41574
15422 -41574 -3162 37942 32842 -4127 -11335 -15188 -19117 -33789 -43046 -53088 -31362 -31589 -31327
15409 -31327 -20847 -10257 -766 -17916 -19510 -19775 -18023 -19744 -17617 -19975 -17182 -3770 11370
15396 11370 2021 -8959 -8238 26898 10308 5364 152 -14023 -19756 -1730 33574 43240 12935
15383 12935 31610 29344 23297 -13517 -28096 1835 35294 47824 47908 13451 -15504 -2094 -6886
15370 -6886 -4538 661 18833 -1918 -10723 -12144 -31152 -13059 -23342 2305 -20326 -25761 -3363
15357 -3363 6756 -2621 3692 -9921 -20262 -26043 -25287 -6103 26168 22859 -6285 -23153 -11035
15344 -11035 6055 -8366 -22427 -27791 -32397 -13689 12342 -25522 -43741 -21301 -2026 1281
15332 1281 11498 10225 8892 -683 -1748 24950 12938 -19816 -47533 -39373 -20459 -2415 -27821
15319 -27821 -31915 -35946 -29013 11789 11054 28030 30360 4503 -9029 -18587 -28601 -14437 -21240
15306 -21240 -33746 -41839 -53345 -79659 -78411 -24646 -7568 2148 24115 4437 11753 31691
15294 31691 31759 -5299 -22256 -50475 -60712 -38901 -22111 -3608 34251 40855 26825 11897
15282 11897 -8113 9535 -9425 -32699 -16672 -10242 25638 54281 17909 10550 7475 -15032
15270 -15032 -31646 -25242 -3818 15142 8039 5845 31371 14896 -2434 -14828 -30148 -22122
15258 -22122 -7838 3157 10864 -4455 -2652 -3635 -16929 -31694 -18174 -222 7214 16642 9153
15245 9153 -9399 -44005 -27245 -19061 -30897 -21599 -13810 2641 -13121 -16222 6198 14751 -2614
15232 -2614 -23755 -35031 -21357 -8409 28164 26893 5515 -2422 -33957 -46255 -38055 -24863
15220 -24863 1416 22828 32696 12721 -8808 29398 37701 32044 10816 -3291 -34795 -28642
15208 -28642 -14741 -10492 796 5382 21609 46935 23506 -13843 -31250 -26767 -13571 -2292
15196 -2292 3534 -4834 -7380 -10065 -5906 5283 25851 46200 55081 34427 33444 24116 32435 -12810
15182 -12810 -26414 -20399 -4768 16344 454 -17852 -29075 -44124 -37085 -11092 -6473 -32857
15170 -32857 -41456 -30380 -15765 16241 22818 10476 1301 -10134 -10553 -24339 -61666 -54723 -18831
15157 -18831 -22195 -25794 -21201 -6496 -19762 -27297 -24448 -20366 -3647 -6505 4007 7085 -3092
15144 -3092 17693 10446 4481 -8383 -9722 -2923 14735 18616 37280 48920 27661 -178 -4978
15131 -4978 9331 -3330 9682 9747 17273 -5273 -16740 -7916 -3286 -5924 37388 54234 22865
15118 22865 -364 -28104 -53687 -43432 -45756 -27900 -29807 -4374 -7596 -20772 -24120 -37338
15106 -37338 -34562 -20806 -15983 -12807 -12376 -20593 -2726 8176 -20157 -4289 14739 14832 -7709
15093 -7709 -31921 -17170 -13390 -26444 -17373 -9875 -4000 20105 24263 35569 14823 2368 -7354
15080 -7354 -12455 -26127 -35947 -43702 -48184 -34195 -17506 2149 -28302 -22204 -740 7065 21880
15067 21880 2980 -24957 2398 31005 44396 47207 43822 16269 6610 -4118 1447 40001
15055 40001 46135 12023 -27492 -43479 -10975 -24554 -39233 -34672 -13305 -6963 -6562 -5275 2673
15042 2673 -12451 6060 1121 18626 25517 -2794 18401 9662 3804 -2822 19495 44420 31465
15029 31465 10750 -17629 -31748 -16178 -4214 -8529 -25526 -33580 6548 11962 -26260 -22882
15017 -22882 2772 4087 -8541 17181 28482 -10128 -33686 -39185 -47667 -31644 9640 11047
15005 11047 -19612 -34961 -30009 -23801 -6608 -10076 -20954 -38647 -41340 -10671 -36779 -28248 -28053
14992 -28053 -35130 -27325 -25323 -8134 -15510 -14022 -9970 -8246 4484 -12322 -20743 5562 9841
14979 9841 4633 16942 19937 -5358 -17963 -24011 -7705 -3882 11130 28178 8615 8642 16348
14966 16348 4524 -33839 -47035 -36849 -21154 -18913 -2212 23495 47067 65634 44424 31772
14954 31772 -1712 -18215 -3880 30127 32442 6561 2792 -6238 -27647 -9040 21233 2049
14942 2049 -41816 -68348 -51501 -22019 -68 7167 20054 20224 -18719 -40911 -40908 -22987 -26608
14929 -26608 -37439 -40801 -43811 -52170 -46280 -24949 -14304 -20421 -14690 -20344 -23827 -42542 -31332
14916 -31332 -11219 -16745 -40347 -52636 -49290 -44295 -1442 30151 -1970 -36497 -44906 -9247
14904 -9247 24298 33348 19853 14012 129 2268 27698 30923 33819 30755 25134 13712 6244
14891 6244 -199 19066 9264 -535 -8064 -4864 -4321 3289 21165 12250 -15747 -6312 15959 1833
14877 1833 -27162 -32283 -14509 10199 13707 1438 1897 6122 23408 27481 -9306 -38429 -40292
14864 -40292 -14103 -14392 -26299 -36436 -6643 22642 -3372 -33816 -35386 -9391 -25795 -38980
14852 -38980 -38441 -39242 -14131 -4897 -4416 -3126 10979 13659 13016 25542 36477 16634 -29636 -32988
14838 -32988 -6830 23489 37027 33244 29061 56439 51882 31988 18317 4921 8060 -8718
14826 -8718 -12421 -34228 -35308 -15856 -19337 -1428 1616 -7725 -12836 6590 20939 13662 29789
14813 29789 2728 18722 33086 52717 43074 48577 36734 -13781 -16767 -8288 5359 -8974
14801 -8974 -38909 -33569 -39757 -30707 -42650 -37126 659 18010 2796 2809 655 -12667 -17508 -18256
14787 -18256 -25432 -39717 -53264 -52192 -58320 -42524 -29855 -24420 -4215 1531 3389 3290 -12642
14774 -12642 -33449 -40308 -79783 -72240 -31607 -14319 -29190 -35056 -18393 -34999 -41195 -31726 -38490
14761 -38490 -21242 -34914 -24310 -19633 -13579 -21272 -5218 -11146 510 14248 19212 12879 14834
14748 14834 17695 17050 27711 12368 -4150 14374 11507 -20973 -49386 -30877 -35097 -37359 -24820
14735 -24820 -33742 -26209 -23594 -26362 -25406 -9431 -7551 -14170 -8211 -5576 18118 16400 6132 -23817
14721 -23817 -30689 -43682 -18695 12226 20837 -2448 -13218 -26648 -21316 -35169 -35504 -56727 -68713
14708 -68713 -62144 -15427 44570 19242 -6818 -49849 -62709 -67683 -36381 -24885 -36907 -58559
14696 -58559 -18376 4980 227 -39493 -55519 -4731 9549 -6040 -32840 -33082 -14122 -18229
14684 -18229 -18552 14069 9113 38302 27118 5191 22760 29908 17918 15048 -23359 -31334 -16155
14671 -16155 -23227 -18385 -5301 -12908 874 -2986 -19604 -19540 -9855 -19082 13436 25460 11333
14658 11333 -15368 -39645 -21708 -6548 -4050 -31000 -36439 -13530 -32955 -67420 -77580 -70224
14646 -70224 -49368 -44207 -26766 -14032 -24031 -20158 18898 41599 60338 54048 29822 -1499
14634 -1499 -23035 -6400 6671 42645 59817 35050 6973 -33866 -56185 -50013 -44850 -22736
14622 -22736 -30001 -13081 -21663 -14590 12049 -4555 -49187 -36110 -16685 10914 17815 34899
14610 34899 35014 10002 -39389 -34907 -7419 11552 9758 17297 22146 -2305 -32654 -44879 -37830
14597 -37830 -33052 -29628 -53933 -46829 -32393 -12076 -13357 -2839 4687 -13420 -19542 -11089 -5276
14584 -5276 -104 29141 17131 25012 11073 -16737 -20784 -13210 -3509 19999 -15500 -19325 3713
14571 3713 -10386 -19411 5490 2072 14904 14467 -8328 -29875 -48098 -35491 -14629 -36481 -32343
14558 -32343 -9213 -10857 -11690 -2996 5477 14452 1505 -2123 -11390 -22045 -4030 6696 11780
14545 11780 28775 31202 21486 28710 40155 27948 15756 11951 11088 -780 940 35222 45722
14532 45722 23970 -9647 12376 20256 13747 -10407 -6323 13911 3862 -23378 -27239 -6456
14520 -6456 1444 -9332 -12232 -21963 -9480 -25217 -41977 -39240 -19459 -2605 17082 25683 32169
14507 32169 10670 6271 6606 10097 8373 -21358 -27763 -29375 -26697 -2556 6557 -9390 7976
14494 7976 45586 47251 27896 -4561 -1647 -11048 1017 14165 -3955 3805 19734 8855 -2452
14481 -2452 946 17989 22215 35245 25609 8368 -4166 -48106 -48936 -21175 -4474 13416 30857
14468 30857 42034 43006 57413 34656 3240 -12975 -50328 -74611 -26335 18446 22070 499
14456 499 18319 26046 13356 17590 6557 -6823 -47256 -42705 -33301 -22843 -17720 -32075 -33337
14443 -33337 -44980 -59638 -53126 -49548 -16563 -7248 -8695 18831 28795 -3436 -11029 -23310 -23575
14430 -23575 -10473 14841 -7633 -22635 -5790 3079 -5971 -17195 -20917 2314 693 -8993 12588
14417 12588 53703 22275 3024 31908 36729 17810 23509 25628 21113 19791 40498 19111 -7928
14404 -7928 -6783 -4811 -12509 -10363 -5987 558 -9730 -13853 98 2912 7272 6607 7542 -6973
14390 -6973 -22228 2993 -26565 -51623 -32772 -24738 -16359 -37364 -19335 -1724 10216 8321
14378 8321 1363 4378 -5857 5188 33021 56599 50066 53004 15889 -13151 4704 23163 -103
14365 -103 -11155 -21941 -25175 -17304 10197 19022 -25588 -39793 -22782 13995 40827 46782 15652
14352 15652 13202 4979 15078 -3117 -22486 -3581 5524 11996 44843 42476 3821 -27057 -33597
14339 -33597 -17966 7594 13157 6595 -18044 -42442 -7700 7883 4550 -11450 -32217 -25990
14327 -25990 -8433 9899 3397 23332 7076 13794 23925 36281 36136 -13194 -31538 -43315
14315 -43315 -46526 -58437 -24794 -30080 -38929 -25045 7937 37112 13262 8044 -13177 -40009
14303 -40009 -59346 -63761 -67292 -44510 -15920 -12381 -33650 -47276 -46452 -28426 10665 25041 38127
14290 38127 27435 -22824 -26543 -366 -35675 -51744 -34358 -42164 -30106 -41510 -36249 -23773
14278 -23773 -27041 -20503 2473 18199 31903 20859 11156 9256 13812 9530 10734 13643 -67
14265 -67 -4620 1601 -25944 -24540 -12066 16353 43601 48035 39863 45500 51617 67924 73429 49474
14251 49474 22266 31881 22178 31323 43021 17194 3931 5356 -22597 -2564 10412 1258 -22365
14238 -22365 -17605 -15347 -19143 -2126 7008 10361 -4016 -1932 -26406 -37384 -3057 1495 -8484
14225 -8484 10272 29877 13317 -7529 -40543 -38052 -39635 -30792 -40575 -43602 -36018 -12010 -11786
14212 -11786 -27682 -13964 -822 8510 -22140 -24850 -5185 21189 31474 22207 17310 -10966
14200 -10966 -5950 29607 8138 -36775 -31364 -2972 -12558 -21706 -18038 -26291 -23115 -15628 -22553
14187 -22553 -44216 -34383 -34756 -33562 -30934 -22026 -18900 -29923 -58499 -59343 -9759 19029 18912 16271
14173 16271 9392 -29193 -34473 -22969 -12958 17207 20800 13761 18787 -2394 -2247 42451 49030
14160 49030 24664 11921 12495 110 6567 -12672 -40096 -27733 -17512 -13027 8483 13959 14666
14147 14666 -9268 -14119 -9305 3328 -2349 -17150 -22349 -26377 -27916 -38013 -23882 -1961 -3466
14134 -3466 -28790 -55277 -67267 -57278 -45393 -22000 -12519 -21709 -47271 -62941 -43140 -30605
14122 -30605 -20782 -29825 -44796 -40073 -23931 -21246 -49407 -44324 -14930 -12502 -8869 -17193 -24865
14109 -24865 -22746 -19963 -11844 12892 24722 30655 25559 22036 22577 42180 31796 42961 46191
14096 46191 12325 10461 10377 26153 46690 21489 7390 1194 2688 -8644 -17301 -26878 -24355
14083 -24355 -19001 -37887 -27145 9141 -11992 -36967 -40430 -27650 18661 17623 13729 -8971
14071 -8971 3308 28985 558 -16630 5150 -15465 -7491 5351 13057 46494 76442 41594
14059 41594 15848 13855 22216 18040 4796 22051 6587 49 23203 20505 21999 20424 11129
14046 11129 9619 21839 7549 12417 17072 23999 20693 2825 -6444 -2262 11161 19418 9350
14033 9350 5246 -13434 -4596 -7213 -19523 -38443 -57847 -33184 -7515 -18298 -27805 -22805 -8505
14020 -8505 -3073 6227 22151 1753 -10808 -14120 -25777 -25750 -30331 -18176 -15425 -13459 -12356 -7396
14006 -7396 17513 43445 11328 37298 30370 5053 10551 12484 -393 6004 977 -17293 5219
13993 5219 35615 14342 1593 22755 18833 28357 71498 99779 97854 120342 113627 94999 83198
13980 83198 67104 60491 78883 101255 115539 119366 128235 124567 135801 149550 138973 138237 168634
13967 168634 175153 152044 126126 146889 150614 143124 136459 147003 165089 155239 162494 193039 169043
13954 169043 154408 157533 145696 139271 103313 119589 137104 116814 120058 115488 109202 123484
13942 123484 151382 162439 142155 80716 73376 89631 127911 127540 79516 51326 22497 27738
13930 27738 77119 122016 120412 115657 96124 79786 90495 95826 73545 51142 33123 19552
13918 19552 -4391 2081 14789 23369 41412 61194 53049 25496 4307 890 38318 76729
13906 76729 81245 58244 41796 73670 60132 14662 15992 62883 68485 65753 76654 92269
13894 92269 87762 69459 94964 139676 170554 177756 194390 193162 168059 150363 133897 142353
13882 142353 135680 115501 101534 110823 127628 148772 163224 165723 179869 193646 192548 186405
13870 186405 171122 123012 104786 109650 109862 148543 153033 149433 154590 161667 155101 139902 115162
13857 115162 119792 154761 135348 97059 86215 101690 124804 124221 104375 91106 79071 92503
13845 92503 123661 141366 124554 132489 97541 64090 64377 55679 50471 40501 25753 40483 52521
13832 52521 45392 37345 48923 37183 40160 39083 34491 29520 37813 35665 47673 39583 50802
13819 50802 106198 94314 42539 31304 -1969 -5932 19879 7582 -21371 -28149 -4097 3772
13807 3772 13413 451 9600 35310 49285 45283 20473 -1979 -12104 -21130 -13192 3227 46228
13794 46228 66516 56620 55243 55463 29868 9906 11384 25233 30441 43657 67396 65717 58644
13781 58644 57019 78344 70264 49344 84293 90184 54277 28906 16350 12710 16314 20475 6489
13768 6489 24799 48154 44831 54534 62973 59558 61098 43203 41282 49895 69877 73691 43475
13755 43475 53258 39081 43430 46226 50560 42156 16247 19237 43138 50417 46258 46338 23301 14888
13741 14888 27948 22738 -5240 -13550 8267 51279 49528 42526 43857 50946 50274 53908 39268
13728 39268 10988 -5675 30930 40911 50502 42009 34080 1579 -10777 19073 24415 23452 41953
13715 41953 53283 73094 77974 81309 61700 33122 69677 103388 109204 73783 74450 67832 58298
13702 58298 61539 44946 35146 37089 32935 146 6278 36437 65231 43368 46331 57177 56119
13689 56119 70598 62750 43653 19339 11727 24320 9864 -20754 -27845 -670 30651 55973
13677 55973 67708 114252 112376 95129 91936 55411 35540 36861 65548 77033 69846 72771 85927
13664 85927 61332 29090 -5202 13072 50959 49139 75509 66205 83471 88615 56428 62248
13652 62248 69994 87319 100166 109481 116663 109963 130295 147657 171593 151168 102889 97714 117381
13639 117381 145721 130193 97889 93744 105313 87329 68343 76863 90328 95402 84123 68122
13627 68122 86061 98966 122248 113003 137935 163730 185549 183076 165508 156034 133326 110769
13615 110769 104424 115001 107189 119951 141062 148502 176012 152702 153858 170076 180461 181962
13603 181962 195730 182244 187889 193291 215427 242447 260459 280594 288429 286772 271584 271711 262762
13590 262762 264209 298495 304361 310055 304172 296708 321315 376004 405096 441439 464848 475212
13578 475212 516645 542549 538154 548943 608625 682220 724702 792930 798948 805029 876698 954324
13566 954324 1028025 1072776 1123617 1215065 1324942 1432537 1581039 1736995 1924525 2191348
13556 2191348 2559844 3023789 3602112 4361844 5338263 6518652 7888037 9318245 10570113
13547 10570113 11551830 12223267 12637460 12971195 13390050 13914038 14625881 15611212 16849090
13538 16849090 18213001 19437281 20286069 20705241 20771587 20628018 20442013 20229414 20028981
13529 20028981 19849736 19722074 19826262 20338081 21394817 22932262 24735022 26615356 28357897
13520 28357897 29772869 30676502 30828561 30018082 28353139 26162537 23958345 22164818
13512 22164818 21058623 20618320 20643225 20834083 20993005 21112897 21179730 21313627 21506035
13503 21506035 21570284 21343714 20811321 20055761 19329766 18681898 18165363 17760634 17387995
13494 17387995 17004574 16590102 16125824 15632751 14984569 14030504 12788802 11396929 9942013
13485 9942013 8599555 7492914 6664627 6068502 5670086 5380078 5168371 5034967 4948346
13476 4948346 4927582 4999632 5186629 5521737 6000911 6693255 7572841 8681687 10044888
13467 10044888 11616522 13101491 14315392 15185289 15738311 16091609 16394406 16746695 17176708
13458 17176708 17708050 18410579 19376487 20499959 21525601 22202461 22479973 22475812 22351659
13449 22351659 22271441 22255294 22147186 21871058 21544509 21492011 22039142 23337372 25319135
13440 25319135 27585407 29698964 31319347 32294126 32621291 32325076 31408340 29942661 28107832
13431 28107832 26203922 24526568 23254563 22500597 22211470 22253115 22430442 22573300 22594226
13422 22594226 22511901 22381927 22165625 21773555 21137424 20337955 19484300 18692277 18103476
13413 18103476 17728274 17476279 17314090 17063956 16598697 15834224 14775918 13391659 11822904
13404 11822904 10255319 8800139 7533829 6487016 5643757 4975508 4448669 4063829 3760123
13395 3760123 3514093 3321937 3120555 2912343 2750159 2629567 2542510 2457010 2342220 2225035
13385 2225035 2128800 2025144 1946154 1868556 1796004 1703318 1651101 1555987 1458153 1354509 1259231
13374 1259231 1136339 1028333 924769 822121 723836 678829 626535 598531 584673 546734
13364 546734 539211 546533 547600 542194 505538 514922 527551 524369 516482 525087 502774 492394 490147
13351 490147 469460 486731 499644 500494 482520 471688 481173 467480 468911 456247 451127 455932 456866
13338 456866 440866 440338 461514 498312 512202 514542 543214 554404 549826 512795 507864 499101 460766
13325 460766 430461 422243 429600 419460 423872 420436 405436 418857 418304 413929 438096 442451 395453
13312 395453 389594 398987 388711 378114 369631 382214 378477 366037 337912 336409 325798 286040
13300 286040 273986 278339 264701 250933 231004 237679 232188 229262 212137 180030 192814 205646
13288 205646 222451 226135 207751 200304 207500 196637 198624 235230 229507 212760 203184 200660 208713
13275 208713 218481 196389 193431 202824 185326 164228 162453 174714 190258 167859 155853 137980
13263 137980 140979 176373 188529 208071 207921 192935 179066 187948 208350 211473 202704 206934 210086
13250 210086 222556 216489 172022 169935 180025 177249 163744 159303 147554 115995 113129 106689 116006
13237 116006 110983 109004 124810 144068 127544 102545 100719 119946 145611 153372 158617 155606 139829
13224 139829 126351 95669 96589 135000 139473 151888 138289 110280 92959 89584 87503 77739 61008
13211 61008 50441 40108 55507 95706 117032 87292 52001 37761 76784 69070 53971 42234
13199 42234 31905 28150 49408 55636 59603 48930 44913 54900 37881 20396 20897 23307 30017
13186 30017 33455 24942 48541 68855 74853 78317 44803 21064 41447 43252 5256 11872 23048
13173 23048 -13077 -29613 -12065 10548 20930 42558 38896 18878 42060 -722 -19975 -26426
13161 -26426 -26992 -3484 6442 -2837 -6858 5599 30785 49112 40210 23305 15863 -2252 -5624
13148 -5624 -7155 5357 7710 -14333 -22950 -13432 5821 -4625 -8340 2967 27142 22654 14629
13135 14629 13162 27014 4154 -3680 9503 14497 12946 5755 11570 42547 47245 12834 43282
13122 43282 47909 42283 34059 25203 23317 34078 39366 46268 51793 63441 77272 61525 58543
13109 58543 48172 32673 40282 51121 60836 73041 96338 93304 79642 83187 103908 100974 94449
13096 94449 86605 101260 88684 84394 108346 111528 115494 125977 128600 113378 120209 150927 166038
13083 166038 159682 146210 152487 173680 147452 146538 155204 165195 164368 177661 200731 210672 164278
13070 164278 112748 84501 83123 109469 147159 151376 117262 126899 151097 150469 128647 120897 130528
13057 130528 133329 164015 142543 121532 116442 136526 121380 97764 98926 98239 101951 105211 92772
13044 92772 85819 57175 51407 72223 66080 64124 41061 15637 21140 25157 62973 69928 53985
13031 53985 52692 52718 47076 38561 46381 26868 41596 66956 68339 74173 72374 91090 86678 87149
13017 87149 58883 61803 68007 66034 53691 66975 95635 111356 112734 139939 166767 158309 143641
13004 143641 155949 170597 160183 153472 149176 118174 100111 111003 114060 129671 153977 193974
12992 193974 235019 217705 196897 181828 158037 127904 119545 132769 127318 109842 90735 120452
12980 120452 128041 127973 106182 99718 112571 116546 113659 95758 100893 94558 62942 61244 78880
12967 78880 93573 83550 100098 130540 138136 117115 135022 99799 59857 48173 27982 41117
12955 41117 61839 51180 30369 11056 25829 42399 28136 18403 13675 11888 3659 29008
12943 29008 53286 55723 27165 -8749 -5798 32759 42572 24765 -9182 10478 64867 70796
12931 70796 46641 61608 79356 90525 99982 98466 60475 38270 41796 61782 88314 93468
12919 93468 64698 69673 45278 31936 40668 20470 16606 26478 48963 65900 81669 68649
12907 68649 24601 17432 37895 37998 45845 28941 31749 52871 73483 59016 50408 29669 24161
12894 24161 22985 33948 31443 17008 28295 36597 9699 7166 12883 35451 19259 23939 15304
12881 15304 10050 -7062 -26385 -34381 -7037 24076 35303 34034 35617 66875 72270 68686 70544
12868 70544 60175 55456 67042 57828 34560 60117 69762 65963 78602 68483 68111 91041 109446
12855 109446 92683 69855 54237 53942 61682 63734 48433 46207 37294 22514 4635 6400 25907
12842 25907 35277 8329 -23738 -6773 13495 19009 28051 62829 85162 87876 69926 53748
12830 53748 17366 -1994 26039 44287 50610 37462 14067 4045 -9249 -20061 -14304 18972
12818 18972 22090 -12363 -1888 -19575 -36946 -10396 1926 3999 35786 42907 23483 20277
12806 20277 14457 10455 1946 -3998 -329 11141 3772 -5827 14132 45142 41402 22650 21309
12793 21309 2655 13015 12654 22782 8717 -2779 -2929 26682 29595 37703 54289 33900 22901
12780 22901 35285 48883 49302 58368 73240 79241 71509 41696 28201 57622 90905 70717 53431
12767 53431 27258 1834 21683 14566 -18951 -26460 -13373 -3758 -6364 5247 25871 29553 35705
12754 35705 45463 51967 48099 28388 -1115 14702 -11026 -45892 -27911 -22616 -24863 -10829 11018
12741 11018 30900 39216 40346 58853 70249 33410 8629 -23114 -41661 -29217 16107 27139
12729 27139 21417 27613 58417 43150 10243 21687 -908 -12916 23141 56917 47425 40197
12717 40197 16160 50124 60114 61615 23351 -5610 9063 29906 18631 11435 -4206 9528
12705 9528 28746 27060 20782 24532 16087 11252 26949 32551 5828 -11502 2431 15499 10835
12692 10835 23275 3244 -24482 -37481 -44478 -48015 -56663 -57003 -34575 -3664 20981 20676 15927
12679 15927 2163 25093 24026 21045 3995 -18073 -10575 -1556 711 7978 19763 -1780 9473
12666 9473 13618 -8816 -21903 -577 13133 36529 28387 10801 -7765 -2956 1240 24041 -1190
12653 -1190 -29771 -20911 -27885 -6530 -2858 -25294 -8700 -21843 -19351 4883 26352 30090 18854
12640 18854 -9089 12828 35928 40371 32526 31669 3883 -23739 -15562 8187 -15880 -29037 -18509
12627 -18509 2278 5947 2881 4825 36000 12654 -20758 -24021 -7574 3311 8820 8683 -14237
12614 -14237 4986 34534 33766 18330 44870 77488 98610 106292 79347 66691 71766 62971 55211
12601 55211 56675 47405 40451 51179 30172 6250 18204 12252 20538 52003 43889 10053 6610
12588 6610 -14929 -25070 -46495 -46811 -24029 -31848 -30216 -10466 -22285 -51415 -25206 -11743 -25367
12575 -25367 -2122 9317 31166 31261 44103 54279 32542 26281 23074 23323 36027 68688 83526
12562 83526 73453 49935 40187 31136 30397 39736 46635 30561 36242 32867 24326 27611 30517 34348
12548 34348 34117 55851 42815 34191 42498 21065 20259 43417 28684 20413 63389 54973 35995
12535 35995 19358 31011 38872 32489 31159 35184 52515 44469 66700 89601 72440 52886 31076
12522 31076 29889 47528 77373 90892 66062 49807 34807 17029 13022 10729 28975 54131
12510 54131 41170 29931 37270 26400 39263 55896 19688 -15498 12296 35891 23142 19105
12498 19105 20448 11285 -10973 2623 2179 11280 11435 20792 28556 39694 64831 65120 72771 70832
12484 70832 45028 33099 31868 20453 12689 6053 28123 51361 48839 65290 80677 78903 85226
12471 85226 62009 48162 58107 57224 51448 67561 80436 99455 110889 148006 193338 243441
12459 243441 318122 440276 568521 645845 649956 612231 540912 451740 326231 212242 184906
12448 184906 159408 134051 132305 107711 79382 66995 55458 51038 63633 63283 43160 40855
12436 40855 52071 38758 16179 3212 14238 9585 34927 39477 16406 4688 2892 11945
12424 11945 3041 12456 1475 2614 32626 33425 7786 2902 29839 50080 41492 24990 23971
12411 23971 -20268 -13255 -3878 -8924 -41097 -20516 14592 9964 8388 28058 29539 28562 12624
12398 12624 1618 3933 15345 34068 75635 51404 -2590 -8992 5221 3978 6966 4753 -10515
12385 -10515 -19971 -10177 6278 9315 -14751 -44011 -30943 -17086 -19475 -29635 -17654 4684
12373 4684 6370 -4397 -2722 17906 33409 28261 17741 36716 1490 2235 8307 20897 15354
12360 15354 19976 6371 16095 29633 66641 102820 71870 42900 47535 25535 -12713 -21325
12348 -21325 9931 51603 87209 80687 72012 74552 78666 93739 57957 31027 24598 20382 8454
12335 8454 6608 2527 -39427 -41187 -20132 -5258 -10250 -7852 -6731 -12905 15553 47049 46118 37637
12321 37637 18248 8972 -3681 2360 36840 40852 41986 44684 48123 31881 38354 15381 5009
12308 5009 -17247 -32998 -31052 -11076 3427 28987 26139 17251 6614 30396 40537 38991 9005
12295 9005 10043 19583 -9009 -23723 -9123 -5103 1232 -11513 15069 12845 20915 43294 46347
12282 46347 24641 1730 -13637 -27017 -7060 31232 25399 10364 21014 8512 -2111 12415
12270 12415 25388 15164 19085 27581 -20456 -5767 25328 10811 10588 -19154 -7845 30894
12258 30894 49060 28841 17859 38528 70179 64405 38482 31124 52848 67516 75485 79729
12246 79729 76239 71128 57586 57568 51554 38239 36838 52571 90153 96841 65707 51772 54767
12233 54767 49173 19969 2200 6268 17888 20514 30429 -9340 -27179 -1196 7712 26538 31681
12220 31681 19924 -530 -23722 -35221 -20639 1764 9508 41031 37945 24869 4221 20685
12208 20685 22907 34017 44584 51435 56453 66271 71231 65051 75940 74452 115634 146360 182514
12195 182514 266201 340095 381866 406480 387899 339324 300562 259468 193024 138677 108787
12184 108787 125806 127169 110580 93894 86454 80425 74026 53272 60674 58244 66899 85593 100887
12171 100887 100212 88607 65840 68380 83422 70603 69672 77471 77200 85882 84526 99680 138220
12158 138220 181515 181287 222737 336951 453028 496722 446663 366999 315426 244349 177486
12147 177486 157559 146462 130028 127050 113836 129890 116725 117559 85299 61449 58014 76564
12135 76564 73225 62225 34333 10041 18875 25778 20132 7907 39552 64201 79404 63226
12123 63226 48417 27708 33711 19618 32902 38023 36718 54691 81983 80891 58947 43208
12111 43208 11963 26515 48320 37906 26754 28578 35289 65872 60070 54551 69499 48720
12099 48720 42418 24253 57823 52975 41476 71775 106264 92287 73166 36327 24229 35289
12087 35289 21911 -4064 19000 28050 19349 19922 3732 8734 24832 17188 21973 21974 6110 -1828
12073 -1828 30483 63953 66897 48398 24147 6799 20463 41643 54916 44865 20016 242
12061 242 42682 44110 40865 41016 33253 11797 11877 16452 35381 22771 43110 74995 74564 64635
12047 64635 76109 65991 18231 -12193 10786 16007 1921 7723 11269 2682 11722 28301 43422
12034 43422 39047 55888 39216 8937 12697 41439 57916 53842 28766 48230 43914 29003
12022 29003 61057 62383 38051 8770 -18352 -24542 -2671 21381 15840 11350 20554 13985 22039
12009 22039 25211 41542 46065 44918 21057 21301 47075 46185 26697 7354 20081 27869 33088
11996 33088 25016 4089 -26283 -22704 -10305 16852 -3403 -4977 123 8212 18261 24375 39830
11983 39830 34596 37189 27348 30539 32657 23157 -3124 -11282 -3543 7286 18040 30185 9953
11970 9953 10431 7101 9422 -9471 -3284 -13266 -21828 10020 6458 -6388 5693 12486 14945 -6619
11956 -6619 -12792 -15542 -32432 -26680 -19457 3845 10833 9527 -2418 -16307 4407 40124 27526
11943 27526 8763 7735 1638 17623 57856 50006 44063 42112 47864 -2215 -21203 -861 21204
11930 21204 4672 -21902 -18131 -3137 9299 -788 -7459 6260 -2286 -1542 -40483 -37485 -32012
11917 -32012 -18024 8906 18254 44615 33741 51833 76182 62694 30884 35050 25395 3300
11905 3300 14762 30016 -4502 3343 3448 13072 35231 34579 -50 -21192 -7971 7720 36140
11892 36140 22806 10947 11769 17240 -12651 -22631 -14171 -7212 13741 36958 46423 43603 47647
11879 47647 57260 34250 14562 15828 18363 26882 33766 21203 13217 6743 -6307 -31631 -4567
11866 -4567 -8056 -21645 -16336 8278 30036 13139 -8487 -10479 -20076 -10630 7400 1535 -23923
11853 -23923 -38098 -27394 3675 8163 -16563 -38956 -48327 -35484 -19404 -4131 -39982 -14597
11841 -14597 5902 -2101 -19636 -32865 -51330 -29826 -21225 -5043 22739 14800 -1731 -6382
11829 -6382 23635 41900 32419 27604 46414 6642 34936 59304 15662 -19825 4604 9093
11817 9093 -2761 17117 32845 37380 41914 29391 14800 10538 15130 26131 31296 19448 19526
11804 19526 -3122 -10578 21842 27225 10564 14675 13594 13029 22390 7045 -15782 -15667 2976
11791 2976 28946 31182 58786 87617 85029 29804 41585 75038 48859 44302 12211 608
11779 608 -16095 -59224 -59720 -26803 -11749 -4011 -1029 -13963 6426 35120 30659 9511 18371
11766 18371 28822 -4671 -28874 -26927 -17148 1901 34559 51180 71807 51970 37199 51122
11754 51122 14017 -16985 -10712 -8585 6799 11651 8665 22560 31613 38215 26210 16151 904
11741 904 -17503 -3063 -4117 -4314 -35604 -41620 -30133 -2241 20369 4204 -20239 -1274 9113
11728 9113 -96 -20240 -23541 -15893 -12762 -1036 -5280 -11011 -30270 -31080 -31142 -27444 -25832 -32961 -12066
11713 -12066 11897 17389 37005 35396 30288 49039 39867 41201 29779 9776 21467 17809 10378
11700 10378 18132 24653 32381 44137 40035 17192 4475 11135 3791 9360 31668 33653 33016 42199
11686 42199 44045 43987 37673 16032 12151 29041 45718 56734 49972 29100 18931 10539 13620
11673 13620 27787 17905 -12112 -40419 -31551 5130 33590 37320 40352 17716 14431 -5086 -20660
11660 -20660 4884 42259 14051 -5513 3259 -12349 -1568 -245 -9876 -20285 15189 30174
11648 30174 14508 4553 24281 27157 28293 14598 8627 3377 28787 29798 12732 9489 30589
11635 30589 56051 38705 38329 72283 67355 49136 62236 21881 -11086 22465 32387 12760
11623 12760 10765 10587 11428 21937 54018 44580 17522 43104 57003 49269 45008 70918 108689
11610 108689 121216 140128 171083 191061 153345 128722 132636 87487 82142 80609 91991 123950
11598 123950 172929 177028 169511 165318 179072 190962 190253 191955 214475 195127 165667 171628 140891
11585 140891 117782 114820 102808 100574 91837 64075 28200 46395 42131 31198 31929 7993 -4545
11572 -4545 6224 22128 21111 24378 16521 14654 12596 27667 27765 12724 15940 4432 2566 -9753
11558 -9753 -7682 37974 69333 60212 45215 41135 62151 107070 102511 51307 33540 36960 35935
11545 35935 43456 50430 54088 32872 52564 71025 73607 73830 101620 124979 143696 136879 167933
11532 167933 202705 248297 301972 323749 328232 324910 307484 295562 282889 275022 251728 213037
11520 213037 215442 228045 204972 203292 225816 267033 281396 297191 284721 290123 286864 301193
11508 301193 291809 271983 256518 227197 199445 171987 149299 129342 127946 122673 126884 114579
11496 114579 90348 72169 90153 85504 81966 76238 80394 89727 74046 60456 39698 33238 34872
11483 34872 37628 47044 59351 17638 -18123 21836 26003 8723 11367 25015 32865 69856 85378
11470 85378 59301 38399 43935 20499 10993 28917 54413 87302 94547 67391 28505 12994
11458 12994 3393 8916 43382 77909 111286 141875 149226 160888 177943 172567 176317 175832 171465
11445 171465 171449 158777 169681 176395 176898 139935 112411 110090 105906 146841 190010 192211 196576
11432 196576 181481 168730 172147 194502 195928 181717 154808 133886 142666 123452 123432 110029 89470
11419 89470 84509 92374 117303 102020 72780 69339 67241 78007 82343 61583 31722 21477 33753
11406 33753 23156 36864 64919 53907 50134 40664 64845 98058 112490 97687 104954 127545
11394 127545 122236 120104 100187 88957 87406 72662 73802 84839 89505 83547 62721 41503 55470
11381 55470 84622 92155 73715 72798 94050 77944 83859 87939 120074 116441 121525 127973 109069
11368 109069 100244 80183 99704 126332 108479 93155 79872 122921 150062 137226 88875 70231
11356 70231 101015 120441 129206 157118 136960 114333 128657 131924 117464 128060 133804 136923
11344 136923 138770 109208 83607 80143 83115 91150 99401 89590 79959 80123 71230 80819 77831 71665
11330 71665 99172 87775 75899 67302 101820 109513 80080 63254 68581 94366 87693 82854 96251
11317 96251 110587 108912 118000 103128 116575 127480 116344 122948 128114 114245 112059 110016 102327
11304 102327 102716 104927 108753 113949 94558 105084 139476 157455 148823 139209 148302 158770 188975
11291 188975 215235 210856 198860 193382 196686 220249 221099 204789 217835 200705 207723 216575 183715
11278 183715 156543 149666 169502 193231 186497 170474 188550 202982 211058 229784 246423 195152
11266 195152 194322 188465 174988 164997 139478 127675 125978 119039 139457 134052 120860 131043 156061
11253 156061 168468 175187 173511 162717 128220 115966 135439 147449 180638 210908 218706 242677
11241 242677 286158 275583 249620 248541 265625 285173 313668 351012 395741 443224 457089 437888
11229 437888 448789 474963 465154 446654 437043 457060 481001 490959 511577 553909 568558 591377
11217 591377 608381 657053 719584 768229 827974 873885 930942 982631 1020872 1100961 1175855
11206 1175855 1265275 1365848 1454908 1563949 1766424 1991280 2245511 2603424 3021639 3563362
11196 3563362 4230921 5106166 6267876 7743603 9552384 11794297 14438742 17312819
11188 17312819 20176066 22572607 23952388 24028468 22976871 21339547 19654142 18201853
11180 18201853 17057389 16248823 15732584 15584595 15851898 16530295 17617904 19059902 20754174
11171 20754174 22504942 23964703 24744141 24539204 23290576 21255623 18786845 16270179
11163 16270179 13913566 11840891 10042237 8570267 7368550 6386154 5588767 4977857
11155 4977857 4458291 3979848 3573661 3212509 2967540 2775063 2601562 2437462 2318723
11146 2318723 2215431 2160475 2137184 2077709 2029591 1988863 1985526 1989777 2009979 2011937 2002570 2012166
11134 2012166 2037576 2100603 2161972 2237827 2329959 2419955 2569624 2739733 2947128 3212621
11124 3212621 3513389 3897984 4357624 4939513 5689526 6604807 7724475 9058148 10643745
11115 10643745 12592892 15023350 18074452 21858858 26272433 30839392 34908785 37949895
11107 37949895 39910555 41258324 42372713 43108047 42836840 41216994 38473753 35483715
11099 35483715 33053623 31558759 31035377 31410840 32647504 34653604 37253711 40040863
11091 40040863 42491446 43939646 44093939 43298998 42050110 40498282 38288178 35049601
11083 35049601 30883786 26411605 22245878 18639361 15582877 13058834 11009811 9341189
11075 9341189 8027491 6941490 6115173 5424437 4829463 4324632 3896255 3550956 3273170
11066 3273170 3050760 2846799 2683299 2564457 2455395 2345246 2302181 2253898 2192474 2194148
11056 2194148 2177619 2175973 2179698 2197019 2191845 2179597 2195526 2185863 2161831 2188250 2216330 2264262
11044 2264262 2384207 2521628 2710720 3007064 3324810 3711134 4195592 4763478 5522028
11035 5522028 6449760 7564441 8887186 10451422 12286016 14391115 16752067 19214438
11027 19214438 21523354 23388421 24479338 24555295 23657249 22020041 20014680 17986973
11019 17986973 16257285 15023203 14355056 14301556 14781260 15646628 16877448 18340436 19949818
11010 19949818 21637289 23135638 24049986 24021216 22895975 20832306 18297631 15730740
11002 15730740 13369320 11289048 9485074 7983506 6722148 5669026 4797653 4092206
10994 4092206 3495215 2999794 2636724 2355706 2115033 1902996 1743290 1636798 1557320 1515049
10984 1515049 1515819 1500212 1497316 1502919 1475363 1414499 1367092 1237610 1116416 995873 897775
10973 897775 840839 792716 739118 719402 704201 666320 649022 613690 550556 522502 512194
10962 512194 502164 467400 438743 450853 481849 489151 458134 448456 451013 465823 468875 471826
10950 471826 478583 467713 468702 474312 495805 521780 540218 578094 669350 748957 833939 898196
10938 898196 896207 870130 795993 681502 576770 501466 454115 417794 380077 362349 351462
10927 351462 355580 317952 291709 278581 289830 321130 314405 314621 374267 425579 422637 366682
10915 366682 310715 281498 298540 326489 309785 269164 277193 276687 270125 273178 292232 293027 283080
10902 283080 280170 264123 271489 321187 355848 380316 388948 429365 508744 602191 713978 949799
10890 949799 1316592 1911061 2667232 3042861 2656211 1950303 1333461 936850 695834 567926
10880 567926 488464 405539 355075 349128 322225 271867 218097 209033 209853 179808 176918 159597
10868 159597 140250 144690 131948 122541 106393 115911 137197 162788 137555 144112 147357 153086 176168
10855 176168 186907 187229 189004 179986 218076 269925 280314 271910 244511 239990 217072 187984 179735
10842 179735 173940 165272 154254 156872 154106 131201 113612 124713 111497 119237 132997 120214
10830 120214 122009 136301 135650 115130 126947 138583 178432 180135 141178 118681 140661 139902 132471
10817 132471 155962 186278 154836 108562 76716 83731 95457 89579 104503 132569 170702 195461
10805 195461 201203 177712 194197 222705 189673 178550 188279 163280 157452 156007 176494 177707
10793 177707 174478 159383 158589 152446 133823 137640 136068 135744 152933 175761 178765 209653 232051
10780 232051 260617 284307 270543 234024 207762 239972 264604 266651 241584 222671 218954 238620
10768 238620 246698 217910 180178 174232 194341 221317 203910 213044 247770 298347 323198 313406
10756 313406 322535 337518 331748 322892 348518 337167 330297 340652 326783 325102 321814 301836 337511
10743 337511 366560 379058 404214 417298 433220 432008 436212 449179 470197 461925 414544 440831
10731 440831 489680 538715 661351 898705 1220955 1475608 1586447 1791713 2118725 2263363
10721 2263363 2038348 1781956 1668732 1525916 1237059 975963 775956 614871 528079 491160
10711 491160 439325 413183 401943 384888 385827 378681 369356 362136 380118 396203 422555 421187 418083
10698 418083 397834 376377 355960 352843 357866 357180 367406 352816 324142 342796 343258 360889 395162
10685 395162 446464 504082 541284 552423 573953 566758 590042 644815 694317 716105 708318 676611
10673 676611 643858 601536 549567 509742 482088 469407 467489 443342 458316 499107 561716 617643
10661 617643 664333 639256 603337 613570 607905 611305 634455 610856 593878 600893 599612 595724
10649 595724 595256 571667 555214 553423 547611 511123 491558 499326 524235 537995 520686 527287 575089
10636 575089 577259 561868 563128 614896 681711 747075 810748 886505 905377 887164 877240 865788
10624 865788 821353 773101 826768 910061 940043 992496 1020307 1002849 993489 994993 919773 866957
10612 866957 856565 915821 962708 993483 1039013 1094699 1169421 1244967 1291630 1291082 1305199 1396279
10600 1396279 1503008 1618724 1802344 1999198 2151656 2284774 2390120 2468566 2568910 2694212
10590 2694212 2858864 3054353 3216750 3473448 3853065 4302384 4821364 5434045 6161223
10581 6161223 7054719 8127125 9332146 10669182 12258108 14233151 16958067 20882527
10573 20882527 26606933 35073969 47055726 62432167 79445399 94596772 103807699
10566 103807699 104499801 96998800 84185757 69734096 56329439 45349665 37175937
10559 37175937 31593885 27688100 23944597 20490047 17799095 15642883 13802385 12241299
10551 12241299 10911088 9825795 8984588 8373101 7993150 7778059 7745740 7840133 8057670
10542 8057670 8472603 9126979 10055016 11240362 12669104 14082138 15344462 16834769 18881321
10533 18881321 21877005 26403038 33158902 43160955 57494505 76653997 99050111
10526 99050111 119533712 130043761 124825955 106210441 82893875 62244991 46764957
10519 46764957 35920746 28455471 23314335 19730600 17177043 15340218 13897095 12704287
10511 12704287 11737093 10862299 9862314 8676835 7660837 6983246 6531068 6189877 5898007
10502 5898007 5686642 5572236 5599578 5681439 5781076 5867943 6019616 6232888 6508308 6957511
10492 6957511 7684652 8713801 10120254 11680288 12973468 14393152 15966138 17311795
10484 17311795 18045565 18330391 18856264 20177905 22638068 26557142 32323136 40515204
10476 40515204 52466999 71132029 101699792 153033802 239225733 371224584 517067922
10469 517067922 553996199 437073954 294866524 197263577 137547190 99984624 75548351
10462 75548351 58982362 47393904 39056379 32810384 28106293 24458223 21360739 18855795
10454 18855795 17081165 15873893 14693626 13191273 11600055 10261900 9161999 8278986
10446 8278986 7591520 6947479 6348807 5884261 5521817 5234569 5046221 4918605 4751734
10437 4751734 4496362 4234380 3934293 3600538 3361798 3196868 3047654 2851407 2648925
10428 2648925 2548424 2541707 2516495 2439240 2372222 2329924 2251619 2113572 1964677 1865206 1820879
10417 1820879 1783378 1749979 1695231 1629050 1547974 1501648 1429960 1359443 1315204 1304147 1292141
10406 1292141 1278115 1271028 1283564 1279902 1244347 1167809 1109224 1088000 1101662 1124850 1140959 1162465
10394 1162465 1151579 1137482 1142877 1152818 1190787 1247389 1318752 1443473 1648198 1882166 1917316
10383 1917316 1879481 1947208 2030727 2001814 1940154 1995763 2193587 2529442 2859102 2942051 2848526
10372 2848526 2853918 2928001 2824052 2511320 2195251 1970341 1829983 1767724 1827214 1941343
10362 1941343 2023459 2105560 2141267 2137360 2165187 2237684 2398193 2605601 2890022 3269070 3526890
10351 3526890 3610728 3777012 4147920 4590846 5026034 5515572 6005772 6591503 7441362 8451144
10341 8451144 9327023 10160168 11155686 12400575 13893372 15758008 18031303 21015830 25544125
10332 25544125 32632009 43671949 61402538 91190478 139584683 202478717 247380056
10325 247380056 267313826 306931593 366958152 380878240 328985805 280448192 260721790
10318 260721790 229515841 169168956 114993620 80362090 59453249 46289593 37288206
10311 37288206 30772885 26095503 22560483 19653495 17327125 15540539 13972668 12565265
10303 12565265 11487799 10653757 9631737 8592162 7821405 7192055 6455640 5658790 5041861
10294 5041861 4561613 4159538 3834944 3573452 3334488 3118375 2913951 2753448 2585396
10285 2585396 2423921 2294941 2148610 2040043 1952679 1888662 1799364 1734857 1724693 1772428
10275 1772428 1922915 2041870 1893130 1628939 1459851 1404048 1362200 1308193 1230078 1176077
10265 1176077 1157378 1103724 1040723 1003968 974092 943893 892498 854734 846847 850567 849119 854832
10253 854832 876158 895146 892764 866518 867499 858273 844728 824861 814038 779536 742246 747777
10241 747777 748562 715424 663123 632862 640772 638346 627286 606864 605516 577229 557241 560104 582095
10228 582095 604778 621570 618073 584436 568559 551359 525055 514674 466187 419402 441609 448011
10216 448011 453548 444278 473686 528345 527040 491941 481510 496038 473977 470400 467686 445760
10204 445760 445693 394039 356988 344241 293584 279071 270754 247120 225083 243620 293174 336118
10192 336118 335054 288680 300873 318152 319431 324753 292242 297986 279560 283781 336896 390310
10180 390310 420744 423305 505136 538576 516923 561550 590584 538520 512774 539934 539459 469335
10168 469335 395678 392581 446954 453631 416713 401394 432178 453579 455471 493416 511947 480119
10156 480119 440706 433425 429356 452597 519100 587384 651585 728128 783550 842793 866235 835388
10144 835388 783902 736812 696305 668683 674934 690169 659010 645061 696980 750852 812616 890843
10132 890843 966192 1068152 1216901 1376514 1532439 1707201 1866329 2033955 2155025 2339300
10122 2339300 2598731 2949380 3430248 4131141 5090984 6454897 8513608 11737513 16994862
10113 16994862 25304432 36941575 49017070 54104396 47921966 36117500 25710209
10106 25710209 18667042 14110927 10974343 8650131 6943212 5707845 4825116 4249716
10098 4249716 3847741 3594181 3462596 3401007 3276327 3015364 2658782 2267782 1963829 1735289
10088 1735289 1585842 1483806 1413019 1372634 1317942 1220445 1128834 1040627 983312 921261 855203
10077 855203 783793 749693 708285 643455 648496 641662 604339 536804 523319 575762 611750 621435
10065 621435 659452 649693 616003 599937 573686 562458 540408 507571 519070 534323 524554 530164
10053 530164 546483 604314 686786 837558 1101987 1567567 2237091 2940313 3196468 2754153
10043 2754153 2114888 1625542 1314692 1102239 954254 832896 735453 653387 566606 510149
10033 510149 485130 457961 403179 366667 346316 324123 297009 297595 313108 316097 319380 351509
10021 351509 333117 287591 277660 294686 315887 357250 405867 448842 454314 459597 520769 610943
10009 610943 695036 772679 851333 989769 1194481 1527364 2027171 2674564 3498989 4394188
9999 4394188 5192220 5707834 5835551 5497873 4826350 4050069 3266369 2601905 2088142 1674541
9989 1674541 1381528 1134823 967353 896177 788051 692669 660259 644094 618274 584927 545935
9978 545935 496569 485049 494575 503779 496482 487951 484263 491917 527891 581834 642563 707087 749083
9965 749083 812154 903514 990975 1086777 1287266 1543446 1876508 2371085 3066502 3977264
9955 3977264 5047655 6119410 6892810 7120288 6714140 5824519 4747663 3703633 2884994
9946 2884994 2310993 1908127 1601179 1373850 1216945 1098572 981724 862642 777093 715973
9936 715973 687712 668156 650358 588386 537109 525694 524389 522014 543343 579632 587045 656540
9924 656540 791178 986549 1296649 1618249 1743776 1884881 2129956 2310045 2136690 1857359
9914 1857359 1703012 1550225 1252605 945888 723896 580298 474981 414353 367264 351050
9904 351050 332798 315018 329722 330591 319553 263780 235797 236107 247121 242021 230208 251402 245272
9891 245272 207751 197481 200960 189738 179110 180108 216418 219621 226293 227941 210574 219111 245674
9878 245674 285075 276470 253250 238116 215641 206592 204716 225420 217261 229604 236747 214955 196453
9865 196453 201565 220716 219522 217544 217199 252055 263405 295815 326633 292206 255980 254799 270264
9852 270264 291295 273294 230289 207271 227081 269888 249048 238472 240214 225820 220614 211354
9840 211354 221112 237063 257695 233961 212413 204158 231134 228765 204650 186713 170940 145284
9828 145284 136012 162231 183142 180576 152375 123099 137485 148486 171759 191044 174899 154375
9816 154375 130683 150829 168954 161784 167278 155499 165764 174885 185423 190990 189424 182835 185589
9803 185589 197674 176333 149111 152872 181416 186918 166076 150603 152185 150345 184927 181028 182127
9790 182127 190350 190740 161810 151298 175201 211131 207394 164040 141905 126831 129992 139343 162653
9777 162653 195148 181943 160747 136395 139740 126859 160267 210556 223200 226104 203334 226963
9765 226963 230269 234620 216204 213127 228788 237904 233722 220607 179754 181137 155742 142185 173496
9752 173496 187843 163241 127795 109781 104733 120766 126797 161625 180878 175888 173838 164846 147936
9739 147936 164043 179373 176179 173417 165296 149532 160630 173962 191930 192117 160448 144965 127492
9726 127492 144263 158493 193125 204800 195480 175474 185182 195314 204261 232734 272047 311151
9714 311151 323600 294890 273367 248632 235716 234192 221124 196567 211116 240102 205759 208173
9702 208173 252668 255200 235316 230210 220022 219516 240143 247751 268882 283075 305412 342582 368031
9689 368031 421498 481213 484983 465796 414202 368811 337206 306585 282200 252546 241725 256840
9677 256840 253307 246945 270584 269818 240700 246747 275366 297077 334805 390687 430399 414557 356573
9664 356573 298408 292680 302928 290378 270291 248584 243061 252740 256122 266177 256815 271052 272440
9651 272440 242316 244869 260467 276889 273512 292704 306224 305299 288694 277968 273756 295552 290870
9638 290870 274184 266820 253415 252169 239753 248964 264467 278547 325369 314889 315534 313834 312281
9625 312281 327506 344358 348355 389326 387727 393080 415649 417531 446788 454673 495323 492563 523345
9612 523345 590142 632204 648795 701246 734621 766483 772704 790734 850233 922489 988041 1009908
9600 1009908 1065532 1138999 1178553 1239392 1314537 1359491 1447853 1545370 1677882 1821834 1949670
9589 1949670 2072949 2187708 2336068 2482871 2642810 2865302 3146780 3500696 3927229 4441197
9579 4441197 5036328 5622967 6148446 6614353 6979253 7261591 7507852 7779101 8048523 8352178
9569 8352178 8694281 9143262 9700870 10342615 11027175 11762340 12527641 13311931 14172370 15157924
9559 15157924 16160667 17105203 17926323 18674388 19436834 20173295 20698675 20860325 20777713
9550 20777713 20609625 20643490 20989980 21572514 22241369 22809768 23170979 23307969 23320991 23258040
9540 23258040 23229572 23287772 23364987 23427561 23406750 23316102 23194658 23106718 23155130 23358760 23602046
9529 23602046 23649305 23413755 22906205 22273047 21659993 21091295 20538811 19882608 19079447 18249698
9519 18249698 17441128 16625127 15758993 14902570 14062110 13300028 12637606 12050718 11564497
9510 11564497 11136942 10749784 10457019 10300690 10274984 10298151 10241636 10070718 9825171 9589963
9500 9589963 9432121 9422246 9590757 9908421 10180831 10299897 10220245 9983946 9643910 9324953
9490 9324953 9133255 9130385 9365290 9812556 10462951 11275034 12283443 13442656 14679239
9481 14679239 15975180 17296337 18492886 19435983 20064639 20356457 20371930 20245442 20094520
9472 20094520 20040354 20176648 20593895 21266480 22161844 23308113 24582025 25818030 26859254
9463 26859254 27532603 27804724 27841945 27770032 27692285 27750950 28129649 28853918 29877768 31013759
9453 31013759 32121799 32985236 33569974 33937045 34184345 34258616 34057426 33480989 32551284
9444 32551284 31361423 30073385 28821949 27677157 26688161 25808062 24954137 23965910 22711694
9435 22711694 21232336 19665828 18083778 16502960 14957511 13555047 12342528 11355866
9427 11355866 10607355 10118993 9821997 9613696 9442007 9166751 8776920 8364908 8002264
9418 8002264 7789195 7859681 8196585 8748495 9222625 9289805 8776204 7857957 6829225 5921028
9408 5921028 5194653 4623763 4174905 3861870 3658664 3535098 3479210 3543021 3669888 3845384
9398 3845384 4121697 4403563 4671632 4937628 5198946 5479994 5809240 6167526 6622688 7152749
9388 7152749 7634214 7944989 7966525 7602144 7007244 6321356 5662069 5109237 4762799 4590593
9378 4590593 4522179 4587333 4739573 4942680 5159044 5351266 5528762 5707003 5924310 6216097
9368 6216097 6601130 7071331 7591457 8035126 8345088 8413284 8129307 7597912 6930179 6304737
9358 6304737 5820471 5510580 5392971 5404162 5581360 5877093 6309232 6897842 7658965 8572206
9348 8572206 9571835 10523692 11232851 11514734 11340473 10818626 10056056 9213633 8381734 7581777
9338 7581777 6877086 6243030 5706619 5346008 5124021 4978419 5049176 5290628 5665123 6216587
9328 6216587 6985969 7952632 9152071 10548666 12044235 13339735 14110295 14144816 13507505
9319 13507505 12467440 11337817 10281952 9368494 8549084 7788773 7100189 6491748 6039700
9310 6039700 5768438 5687260 5772329 6075205 6544163 7110692 7751803 8383588 8925719 9352344
9300 9352344 9621009 9682402 9499528 9225076 8945111 8723724 8514289 8301024 8045571 7680367
9290 7680367 7186336 6678960 6254675 5954308 5858977 5955903 6228151 6731770 7392019 8028137
9280 8028137 8568753 8972876 9162094 9196201 9198949 9207544 9142661 8986885 8649809 8125051 7512554
9269 7512554 6873277 6213770 5628336 5140435 4721848 4449054 4304875 4252269 4332114 4551461
9259 4551461 4879987 5279080 5726995 6203466 6756668 7377942 8081252 8815148 9363059 9526357
9249 9526357 9267866 8616576 7662408 6650166 5671556 4837149 4169832 3675001 3345357
9240 3345357 3103809 2963949 2918266 2968908 3098279 3342154 3664426 4099571 4608624 5104607
9230 5104607 5497047 5771813 5887585 5825314 5558443 5118664 4525870 3947520 3451782 3030632
9220 3030632 2670270 2407946 2238353 2132454 2104132 2142256 2224570 2434845 2723766 3106642
9210 3106642 3548028 3958372 4242219 4359344 4218670 3871335 3396352 2900848 2460686 2094563
9200 2094563 1801192 1591720 1425460 1276429 1177050 1124080 1098832 1086905 1113537 1186966 1292958
9189 1292958 1382951 1546527 1733511 1933075 2086010 2167205 2152878 2005382 1750256 1474708
9179 1474708 1259612 1105128 969424 828636 714616 622214 571232 546591 523170 498296
9169 498296 437681 394122 361411 365458 379711 422062 445773 444633 430295 437521 430016 422269 418620
9156 418620 395120 407299 395518 365348 359531 364907 364596 365742 377791 373553 355764 359927 361793
9143 361793 370494 387072 391774 354917 341018 334918 341881 377166 373047 360830 358972 351150 332799
9130 332799 332679 342389 339621 318739 279652 274117 280239 293984 298682 283304 290604 304271 321899
9117 321899 315726 314608 316515 318382 291217 262850 248890 237644 229306 248148 250780 237755 238310
9104 238310 246957 252719 274548 318273 329480 333454 308902 269445 241898 225124 227346 232649 238552
9091 238552 186196 156416 173538 193183 183549 198142 194898 198484 208997 195869 194679 247277
9079 247277 295858 291061 293853 296302 325295 372456 388097 340700 280021 276826 295848 306334
9067 306334 305043 291074 286883 291083 295332 290931 261568 251670 268597 266145 277043 299180 310592
9054 310592 332166 342681 360131 362800 344416 347708 356493 322479 327319 307117 295843 313029
9042 313029 324930 350125 352989 373653 377909 351533 324464 301841 318111 354639 369763 347699
9030 347699 333007 331176 347817 374988 382765 371538 352582 340454 333152 322783 317353 299332
9018 299332 275760 281103 302033 305198 287374 225163 201362 176346 172815 201008 201771 221500 215165
9005 215165 237636 276170 277939 268278 267242 277510 271168 310465 346838 364685 354014 318478
8993 318478 300372 304611 290652 281395 284631 243285 235502 226560 232459 207812 190404 208666 216990
8980 216990 210312 189869 178157 179609 181980 185022 208313 205951 210589 214302 227304 239221 216227
8967 216227 186323 204050 221943 231967 204302 212893 231434 222635 207216 205291 227144 233374
8955 233374 259402 278766 282607 284848 302947 307492 304577 301099 276151 288504 288621 293121 280842
8942 280842 266811 276694 275481 261021 259075 270681 273970 268889 248136 253116 259335 261783 298709
8929 298709 317270 298165 285130 304461 312628 297824 291185 310636 315114 288561 281216 298349
8917 298349 309843 338316 310972 279700 263948 264052 256792 262891 256824 241157 235752 245244 242837
8904 242837 258469 265766 243917 219123 231716 240640 250384 245840 225979 227227 237904 228603 220607
8891 220607 222696 219397 215333 212405 229727 237488 241053 244428 258763 266885 262231 254198 263061 278177
8877 278177 283688 281593 270851 265565 270613 305901 342506 377993 370259 317470 286936 296454 312293
8864 312293 279725 278362 316999 337215 316394 301643 332966 360462 357783 330011 305050 315099
8852 315099 304528 295732 292293 292256 302768 300112 303117 338855 336922 333288 327461 306364 286883 288572
8838 288572 306174 299964 291181 305305 290848 294229 312204 341267 359063 354552 324918 287229
8826 287229 258688 260929 248732 252771 291345 308616 302413 298500 310709 296511 311885 319766 315838
8813 315838 306346 298869 294293 287152 298437 307659 339565 343049 350188 318261 303793 338932 359228
8800 359228 359333 348936 351017 346616 356674 379725 362658 349810 357009 375112 376550 375002 366189
8787 366189 326214 324741 385702 406420 401171 380143 364772 393206 408651 406998 402718 408875 403172
8774 403172 374172 401279 433282 420516 398973 387888 366431 367522 408461 432675 458243 486440
8762 486440 491902 496539 504418 461335 469661 511972 522008 522808 517527 541029 566327 569966 545000
8749 545000 534690 542558 530400 536234 546063 548515 550884 558586 559970 586288 608040 624931 644499
8736 644499 663522 714671 751269 769291 785680 856376 919904 979525 1011286 1079914 1152307 1256137
8724 1256137 1364455 1470642 1620853 1816712 2073627 2406390 2815204 3325758 3943527 4666510
8714 4666510 5500568 6542759 7760267 9140387 10457127 11434379 11996635 12141556 11948490
8705 11948490 11477989 10812383 10072120 9302525 8506623 7664110 6849522 6133903 5497420
8696 5497420 4996162 4638167 4375570 4267112 4267613 4424704 4751130 5196093 5803913 6578916
8686 6578916 7461909 8430455 9399569 10338634 11113515 11576776 11677036 11529508 11224674 10745201
8676 10745201 10154567 9465322 8785997 8089223 7356653 6647287 5971765 5341219 4809106
8667 4809106 4336277 3939643 3655537 3498273 3457624 3556117 3553493 3338788 3148418 2989786
8657 2989786 2914283 2897053 2904792 2934294 3006693 3126795 3307347 3539299 3800276 4136676 4554303
8646 4554303 5112382 5793459 6601379 7537367 8623186 9870613 11328798 12969155 14670893
8637 14670893 16211835 17454527 18436805 19284385 20123110 21081889 22156463 23268616 24282903
8628 24282903 25163127 25785338 25981906 25554002 24423052 22753532 20819466 18970158 17381875
8619 17381875 16088335 15188270 14655377 14507112 14666993 15031593 15603146 16354074 17297881
8610 17297881 18250515 19077211 19701475 20196806 20687152 21294578 22043758 22853100 23673609
8601 23673609 24387591 24818859 24702826 23807380 22178034 20135968 17980537 15912993 14010203
8592 14010203 12305979 10789707 9534725 8520968 7681506 6959267 6352365 5840181 5408420
8583 5408420 5058422 4783038 4577635 4452200 4342346 4278644 4263408 4311999 4419210 4587929
8573 4587929 4815359 5134318 5516865 5985460 6615708 7346975 8174682 9125193 10121736 11166017
8563 11166017 12260930 13421603 14650833 15969803 17313491 18552122 19515185 20133647
8555 20133647 20464112 20660061 20811282 20933670 20977309 20960652 20864568 20602816 20111126 19325676
8545 19325676 18294363 17144389 16040738 15128960 14548113 14286095 14349009 14699365 15306338
8536 15306338 16071773 16884747 17686256 18514803 19292318 19895240 20205209 20159043 19866003 19494705
8526 19494705 19140082 18889030 18779493 18711178 18533408 18088773 17346827 16253455 14802995
8517 14802995 13140689 11508384 10044257 8781440 7700949 6833790 6118104 5494529 4949674
8508 4949674 4483694 4103241 3788001 3583101 3451933 3363535 3293520 3246631 3215130 3202496
8498 3202496 3203452 3203095 3195265 3249780 3343870 3486767 3654097 3851662 4122045 4452329 4845600
8487 4845600 5253274 5620879 5972067 6304721 6654295 7001200 7389874 7774936 8178136 8596159
8477 8596159 8906026 8981346 8830620 8514922 8030021 7489184 7010749 6569440 6157911 5796183
8467 5796183 5435620 5146262 4931387 4743710 4650606 4663039 4770499 4957432 5243005 5588145
8457 5588145 5936672 6307729 6711589 7173639 7660495 8152400 8533038 8662136 8548836 8161342
8447 8161342 7517087 6735221 5941102 5234285 4639151 4159923 3769400 3388248 3080966 2867223
8437 2867223 2691076 2546122 2443244 2342084 2280676 2214252 2110655 2045973 1941621 1843498
8427 1843498 1748627 1717980 1689791 1630054 1607895 1585119 1567508 1588279 1600746 1622679 1636509
8416 1636509 1637226 1626828 1639628 1687986 1746016 1779943 1813815 1845704 1829316 1825005 1825956 1803447
8404 1803447 1772277 1697242 1634629 1611217 1603976 1575695 1534219 1510515 1510159 1523237 1538294 1532449
8392 1532449 1568883 1586284 1629047 1659190 1671933 1732038 1776866 1812113 1839063 1851788 1890079
8381 1890079 1920059 1897243 1876486 1840220 1801068 1772780 1745735 1702792 1681170 1686266 1695443 1699582
8369 1699582 1697654 1667174 1647625 1660480 1652616 1649126 1669631 1686129 1673829 1677828 1699153 1726763
8357 1726763 1727753 1727849 1757135 1771652 1784381 1812414 1858230 1892547 1916407 1921353 1919194 1929084 1978454
8344 1978454 1992622 2012923 2060218 2074743 2080068 2111656 2148106 2194455 2229576 2257562 2266830 2275375
8332 2275375 2300047 2352541 2398653 2421124 2433520 2471855 2475408 2497658 2560666 2596751 2627551 2667276
8320 2667276 2701971 2743056 2788888 2815672 2841304 2887475 2954636 3013753 3060569 3103125 3140724
8309 3140724 3165114 3184770 3219807 3267768 3347558 3391530 3379114 3401132 3475398 3550343 3605648
8298 3605648 3651420 3726103 3789154 3834116 3856148 3890045 3948479 4001929 4044268 4110320 4177392
8287 4177392 4262737 4342548 4404342 4461228 4519620 4608552 4671245 4731679 4816857 4899679 4960855
8276 4960855 5017113 5062295 5136886 5211650 5262309 5322781 5398001 5463715 5520768 5591883 5693359
8265 5693359 5790240 5880557 5965210 6048493 6095432 6171040 6273217 6344372 6378460 6432500 6511148
8254 6511148 6576342 6605656 6673963 6761000 6841353 6912882 6977879 7015955 7048775 7093373 7169409
8243 7169409 7225387 7285964 7382623 7434717 7489632 7542602 7600616 7610737 7630538 7666824 7701995
8232 7701995 7733493 7754027 7781743 7790041 7820159 7830904 7834397 7815723 7762624 7734284 7730754 7711298
8220 7711298 7682027 7639858 7601898 7557306 7534332 7491950 7465031 7434090 7381929 7353967 7328267
8209 7328267 7286924 7220344 7158710 7096113 7030333 6969302 6926834 6866163 6791803 6749699 6704611
8198 6704611 6662005 6581847 6517333 6428644 6343717 6255637 6156717 6065629 6002371 5915952 5861072
8187 5861072 5794631 5718544 5628988 5533622 5443499 5322637 5266011 5233158 5158377 5083794 5002178
8176 5002178 4912746 4857846 4779665 4704729 4622754 4554091 4488585 4418716 4389089 4354190 4319429
8165 4319429 4248856 4212217 4177461 4098749 4051594 4030879 3982017 3944733 3918224 3864701 3857021 3906687
8153 3906687 3954218 4077742 4267297 4496905 4674978 4570341 4248517 3947997 3712036 3507983
8143 3507983 3363039 3292164 3197473 3096839 3037798 2994906 2957133 2949207 2933636 2892771 2858770
8132 2858770 2787216 2718046 2680536 2648903 2596056 2550023 2536656 2532146 2522491 2495360 2479238 2443232
8120 2443232 2410231 2351529 2313639 2305256 2291860 2242876 2227762 2231463 2272570 2367020 2509719 2721364
8108 2721364 2995192 3124162 2954113 2638333 2404286 2213707 2056513 1964486 1898794 1847898
8098 1847898 1804757 1768074 1755406 1734011 1724933 1699638 1669327 1646626 1632106 1609839 1575533 1536568
8086 1536568 1506090 1474539 1489390 1486856 1464872 1423360 1389929 1357629 1353121 1388923 1417796 1404780
8074 1404780 1411237 1416426 1393518 1338051 1288874 1261056 1243096 1203383 1190988 1204006 1187747 1163012
8062 1163012 1147445 1133851 1118248 1110742 1107132 1085113 1057663 1048020 1031210 1049698 1043323 1026161
8050 1026161 1005460 1022124 1031553 1031306 1038347 1046618 1015405 988565 987003 974404 953476 952644 947793
8037 947793 942282 948946 962896 963332 970521 957072 944876 905310 870833 865997 874658 854983 826900
8024 826900 827364 810111 806416 812017 778199 727352 732179 755686 770880 754296 733687 717778 733309
8011 733309 738305 716402 712870 703146 701148 692368 685068 701513 702597 676164 672454 665298 625498
7998 625498 626368 632899 623432 606208 584293 606165 622199 619623 622545 616970 604030 611523 628934
7985 628934 629672 635569 622704 581500 580077 583745 590804 616823 628249 624705 656581 632246 574469
7972 574469 543548 525368 525060 529456 541927 535421 586680 587954 552515 490091 460394 484317 499763
7959 499763 487538 496118 490432 486408 481272 492254 476635 444024 425558 408136 447838 446626 428366
7946 428366 415324 425724 431546 456334 460466 448792 473989 497204 467062 458856 464505 472119 440680
7933 440680 429162 431932 452242 445017 454181 448771 427833 434134 408863 371552 378673 403722 412768
7920 412768 390968 373086 377464 381741 383352 371387 378548 392449 386790 378949 355238 365340 367533
7907 367533 353990 351362 354287 345348 352401 362980 377432 350391 333777 353994 343807 354579
7895 354579 345424 342033 342986 346210 351833 352391 356955 354436 323748 337897 350692 334964 320165 330325
7881 330325 329210 295540 292867 307325 318241 325825 306970 291683 300055 311266 307189 281215 303914
7868 303914 297982 267045 242668 240850 236290 249968 269456 258987 259116 258779 263413 253210 246996
7855 246996 222566 210494 209101 220540 227759 223765 232226 238876 243813 209335 199920 181847 200428
7842 200428 200386 212781 252014 273805 249944 239305 229332 210253 189953 211199 211812 222628 213346
7829 213346 198370 215574 216928 203810 197444 179751 174549 187308 186688 178889 169727 186881 182209
7816 182209 193863 235315 218148 184460 186780 201473 168225 187939 199971 196877 209609 195094
7804 195094 184690 166789 167524 182748 202217 197628 183871 195919 212020 195894 194483 198986 187792
7791 187792 183476 184025 165028 147593 147698 147449 149284 160265 192328 169485 185486 199424 172692
7778 172692 180262 170486 177310 220142 231396 218929 193818 166767 147311 124686 99722 121214
7766 121214 160999 170770 147026 135734 110008 130103 167806 153274 117709 125296 112917 130052
7754 130052 139712 180214 163195 125469 138296 137081 133584 115393 112233 127092 147419 146298 153929
7741 153929 151639 153657 159827 141695 111797 100403 116178 109643 105924 135785 179643 182379 151729
7728 151729 128071 91450 90954 142820 145640 126923 106508 106523 99232 82657 122685 131655 103169
7715 103169 106887 90508 106389 117201 136785 156818 157317 143166 147343 138750 131895 102671 104591
7702 104591 114490 122818 128161 132881 116843 115282 113741 101514 113503 101235 85795 96538 106718
7689 106718 122938 95816 76678 103141 128655 128158 116982 118049 102280 120426 117740 71259
7677 71259 55922 71892 78621 85199 76540 76827 71746 52856 58752 86103 127022 146629 139402
7664 139402 123953 110022 104716 97542 82542 75683 84869 106111 132834 141948 149583 170070 145129
7651 145129 89034 72940 70036 62327 68603 95816 123208 101995 82371 83134 79324 87342 62990
7638 62990 52838 68876 92130 97203 91327 97250 100702 90332 77173 73485 76484 68239 90113
7625 90113 126361 111136 89242 108059 117238 117140 95010 87160 76892 60129 45912 26235 49989
7612 49989 65458 94454 99813 104696 113820 107671 91000 78496 89729 77243 62596 77121 76601
7599 76601 69931 65344 62165 59929 55851 67128 78326 78706 56310 82481 95571 91512 115304
7586 115304 91249 69986 69975 75424 66760 70594 94173 104430 106744 93352 74478 55014 41984
7573 41984 38833 29437 46538 49848 57640 65553 61584 77375 62514 58956 61862 66018 81876 75543
7559 75543 81225 75608 58455 64463 58432 60559 55340 53128 51842 60980 81268 91141 93117 121886
7545 121886 149594 120895 78978 47646 27841 35886 20336 2410 9893 46742 92725 134811
7533 134811 133991 125893 105884 104452 88579 117500 98572 68230 89150 99113 82884 86640 77690
7520 77690 42115 36360 56913 71511 49513 35280 63125 101289 77287 63478 39468 43460
7508 43460 34317 27993 58898 71398 71221 57362 24311 22679 42085 59000 95296 119816 115967
7495 115967 93724 86135 58623 54201 25475 43836 43257 53664 57768 59688 63319 38998 20601
7482 20601 17245 19198 44358 30069 27816 13032 15363 21259 50239 56101 82994 83954 95948
7469 95948 72713 57506 65882 91878 104794 105061 106713 86578 55358 51874 53479 62269 76828
7456 76828 35512 4920 42795 70614 54051 82554 99329 100663 99177 99217 108935 84420 84686
7443 84686 109669 92917 86389 84220 68316 63691 61997 54202 62147 39769 44799 75298 68493
7430 68493 76851 55775 31690 20001 41645 40459 44630 49829 44698 37036 31261 41422 33080
7417 33080 33175 60019 68353 74488 49857 40049 51992 45583 67231 90828 97737 82063 53483
7404 53483 32596 36598 65798 69069 54694 28840 45227 23533 12424 52895 78410 55362
7392 55362 32813 50570 54783 64553 57372 57428 52945 53611 68055 82597 55505 70780 68847 50543
7378 50543 56981 46501 33569 59490 82738 58781 33007 23803 16646 43251 30438 16912
7366 16912 34849 43748 51270 57170 60558 49932 63214 70335 73519 73631 70065 98747 94693 83079
7352 83079 96265 102314 94673 63971 81590 73999 77442 69969 45264 23898 2774 -12587 38588
7339 38588 73262 50372 44957 38483 36764 76167 82735 55569 70795 81297 56443 30680 116
7326 116 14501 29974 22443 51691 51568 52958 66657 85916 64477 49128 33115 24367 41434
7313 41434 49445 67164 35836 20124 18360 4098 32892 57920 61052 32805 34054 41016 33893
7300 33893 26166 25478 5766 -15072 11048 32585 41532 55190 31634 10291 12356 19883 30716
7287 30716 65728 71105 65015 37928 37372 59246 44591 26882 24640 60247 60763 52460 54964 49998
7273 49998 57136 51061 58827 31481 18985 59623 48241 39447 14890 1232 -5475 7522 28402
7260 28402 15649 -12728 125 38014 60256 68436 63382 42693 22392 -2079 1354 1476 27807
7247 27807 38038 20945 17717 30024 30533 39056 51311 46222 3393 -20600 -3325 26303 16552
7234 16552 15622 -8371 699 -5475 8073 20954 11143 15779 31076 45082 48400 19260 12000
7221 12000 56418 52853 39484 57618 58538 62416 61166 41130 24729 32203 18884 11446 26795
7208 26795 56814 74412 69727 57530 24777 19748 35698 49707 57478 74553 67572 38869 13244
7195 13244 17215 15981 15153 28428 37326 17824 32574 54058 41019 -1084 730 8120 8217 31061
7181 31061 29112 25366 -2041 10040 4331 9868 12601 16378 27755 12611 -18128 -2084 19206
7168 19206 67247 76150 72026 58850 47642 40548 28384 9329 18949 34814 35350 33797 42464
7155 42464 18798 17758 39883 54167 41699 33813 27729 35895 52935 16577 1595 20211 -295
7142 -295 -9885 -9225 -2118 -7087 -33219 -6096 32859 27691 19198 2539 3170 23807 33610 42428
7128 42428 18624 9644 -1000 5197 23679 44762 40530 60135 53356 28428 7692 32262 36329
7115 36329 45522 32793 21027 36014 69838 50822 46022 42438 35047 27952 32241 23672 17507
7102 17507 5177 -7996 -24330 -3309 33992 40464 47386 52935 21989 13734 21775 -4653 11486
7089 11486 12073 18891 22826 27928 42388 25578 19681 -16205 -3428 26485 36123 8897 5633
7076 5633 32245 64105 70870 54556 49719 24886 19294 24098 43245 44507 39780 40549 10796 -19416
7062 -19416 4842 32929 29873 8994 8506 -9821 -19768 20306 25587 27416 25115 25175 24574 5131
7048 5131 -8037 -10020 11386 5468 -12936 -17480 -13382 11335 20176 -6491 19864 11706 3563
7035 3563 5664 19312 37393 10087 -11926 11100 37134 36545 26662 17766 15465 33905 35332
7022 35332 23559 30970 41312 21599 39038 42143 47981 53882 26669 23006 39816 55290 55286 36641
7008 36641 40191 25685 11091 -21230 -27991 -9934 -11246 -10416 -17418 -17643 -2333 32098 73024
6995 73024 65623 27191 22080 26308 17089 29407 41740 39031 4588 -21218 -3292 6604 8270
6982 8270 17867 15375 8192 10049 13077 71 3761 26453 34630 38433 35878 31348 10275 16244
6968 16244 42219 57020 28704 6665 11863 12260 6195 20851 11262 -2456 3048 -15873 -22685
6955 -22685 -9120 16783 20885 5633 5845 -5772 -11938 -14219 -15197 -19687 -12273 -15449 -16882 -11146
6941 -11146 5111 13271 19212 43726 35804 19672 33594 43176 48287 45942 37033 43170 45206 16419
6927 16419 5301 7248 30726 31593 38477 30973 25080 53506 50381 13853 -9213 -1979 12189
6914 12189 504 7505 19941 19730 27428 62141 54498 38664 11702 7760 39555 40896 16560
6901 16560 -3550 -4762 -5602 -8087 -5648 27449 42777 48945 40076 11127 22628 7643 24148
6888 24148 49506 11131 -9700 11157 14303 13176 28332 32717 10618 -5913 -5923 10756 22821
6875 22821 19480 19122 -1828 -8343 -28876 -21529 447 24592 23955 38303 23298 -4827 9461
6862 9461 22709 19822 30575 8305 -9709 -9116 -9158 -6507 9640 -11528 -25898 -28715 -11116 10966
6848 10966 31530 21440 16363 27335 12765 14172 36831 32616 29568 33954 8203 -2225 12647
6835 12647 -6928 -17450 6268 15822 4968 -1048 -29245 -81 26124 11943 -15458 -30597
6823 -30597 -10234 -4589 32108 39065 58049 43884 4525 -11753 4202 -13980 3583 27318
6811 27318 20594 18089 26251 25859 1749 -9673 12377 4210 12100 -17096 -13013 19519 11724 34293
6797 34293 43626 38213 45485 23185 18311 1196 -6727 -16502 -24654 4155 977 4963 5371 17168
6783 17168 43669 49805 45453 46522 54256 33300 3791 987 22034 22793 18736 14467 21838 -6438
6769 -6438 -12587 -16117 -3081 -4472 -11285 -10996 -27206 -41206 -22313 15462 50569 51994 44040 23680
6755 23680 26384 35674 26825 19251 6074 -9755 -12674 -14343 -14892 -30211 -64418 -27253 -705
6742 -705 -7572 -20560 -18298 -7954 -6805 -7849 -9613 25365 29487 38689 17172 4012 -1556 -7782
6728 -7782 -28262 -24894 -24205 -29092 -32744 -21850 -10804 -22952 17718 26110 14767 0 -6914
6715 -6914 -13619 12650 20575 20259 7332 33118 40323 33857 56507 102019 123685 93989 36974
6702 36974 10975 19569 21859 25607 15759 18088 14952 171 -8615 -6507 -2581 3089 -3810 2559
6688 2559 -7601 9180 14241 18767 21284 -24798 -34593 2085 -2085 -22498 -12222 9630 24576
6675 24576 20618 5168 27816 48175 29214 10563 14472 -1720 -2164 -4192 -798 28165 31610
6662 31610 11011 27470 37389 9232 31786 46664 28412 9878 9640 17722 23792 38037 45136
6649 45136 18010 -462 13620 24161 2124 -26982 -27528 -10799 1414 18612 44710 39424
6637 39424 6158 -34049 -54954 -30476 11965 11556 2666 5481 8286 9643 -8683 -2468 23267
6624 23267 37341 52105 39812 18813 3022 3592 3827 38471 35306 23137 64085 61500 56162
6611 56162 22728 -17588 -26143 -30301 -27500 -38507 -20951 -14091 4126 335 -3998 3403 9733
6598 9733 -116 -15524 -24985 6883 4103 -4605 -18851 -36904 -37603 -21936 7586 47935 44941
6585 44941 37728 29697 25927 30833 45560 11488 5413 8515 4269 9715 7530 28266 50434 40558
6571 40558 -2272 -12801 -21464 -22305 -12969 27262 20558 21899 19945 3878 11482 47978 66807
6558 66807 38237 30596 53118 84062 68406 65660 33043 16697 2601 -2828 5026 20216 13065
6545 13065 -10982 -19026 -6642 -14031 -23996 -24895 -13446 15147 -1620 -36323 -22182 -6538 2195
6532 2195 -1683 -6990 4529 1727 15227 15190 4615 -19479 -28459 -31012 -2416 19691 26369 42657
6518 42657 38040 15944 -11795 -2600 15892 12602 2640 20850 -2950 -18169 6035 17200 9663
6505 9663 -4782 3335 34468 71206 56401 35429 46476 48242 45738 45052 56335 56318 68583 52595
6491 52595 30450 20795 46836 23264 4876 3800 10265 18930 30776 25789 46475 22140 -27398
6478 -27398 -38264 -36506 3499 30653 25778 17044 -430 -23885 -34311 -54452 -39104 -3882
6466 -3882 3103 -23512 -20462 -38082 -45033 -37897 -35565 -32166 -40650 -38876 -21159 19558 46113 56312
6452 56312 58165 40308 27045 36017 63258 70593 30338 5143 -3316 5691 9724 38101 55481
6439 55481 37174 31379 31966 18620 -13776 7021 30318 30608 6318 -3486 -9483 -3505 -11985 -31011
6425 -31011 -27921 -36980 -32345 -2336 -25059 -17318 6828 22458 29270 17114 -7539 -22553 -18271
6412 -18271 -34803 -21866 -3249 -9395 -4872 12350 39320 8542 -26294 -14530 -4910 -12230 -28332
6399 -28332 -17991 17205 7168 -15761 -33543 -28710 -27172 -23946 -7143 10978 24670 10372
6387 10372 -10052 -32760 -17778 -3568 -8107 -14019 1629 -2523 -17362 -5739 9306 23307
6375 23307 32516 9440 -2150 6633 -15573 -21255 -19064 -1623 12996 9914 1330 11578 -9426
6362 -9426 -44506 -37100 -31530 -7275 9672 20783 23881 15647 8025 26492 31593 13792 10182
6349 10182 23183 19089 20689 41325 17214 -10209 -31660 -21039 -29217 -20746 8959 9784 3590
6336 3590 -497 -19172 -14756 -6530 -2340 2511 1170 -22644 -34598 -7221 -4787 -4426 -11815 -5388
6322 -5388 -2490 26951 36844 32861 14003 16674 14618 888 2329 3303 2381 -4386 10965 18555
6308 18555 27527 16163 1038 4308 12305 9914 -5970 9094 -11368 -20283 -21104 40 8250
6295 8250 585 -8344 -4794 37390 29208 15303 11595 21003 32570 44558 37086 514 -21354
6282 -21354 -28597 -23090 -6652 -5165 960 23945 36721 9277 -14407 -13360 -8100 -20161 -23832
6269 -23832 -8020 -33230 -20069 199 -5287 -24349 -17993 -22503 -24155 -7997 -1060 15641 17092
6256 17092 6733 244 3143 3519 9928 9464 -20316 -22925 -1421 11587 10616 38354 74077 68793
6242 68793 47269 21089 -18066 -8244 -7046 14670 33436 17415 -4305 9051 10999 1768 13702
6229 13702 -4832 -14885 -15854 -18479 -26312 -17773 -1558 27833 26854 48416 58906 35351 21131
6216 21131 31197 61410 69321 54034 25070 47363 29136 27599 12845 -17791 -25848 -26168 -16507
6203 -16507 15141 4214 7235 2300 -30654 -61254 -49068 -41681 -29655 -32148 -41036 -33715 -28124
6190 -28124 -883 11209 -23992 -41906 -33436 -33045 -26004 3232 1920 -8624 -13491 -30150 -27765
6177 -27765 -11047 -17159 -7521 -9443 -12390 -29409 -20871 1533 18185 10003 12479 6755 -8111
6164 -8111 -1638 9897 -12017 -22166 -39035 -55128 -40757 -17507 -19441 -27726 -37421 -41616 -27194
6151 -27194 -21567 -42623 -49746 -41546 -17924 -2009 -9701 -7423 9715 8960 7520 28163 17597
6138 17597 28724 16732 7672 21053 26227 10585 -6458 -15764 -11463 1820 -7381 -18515 -6815
6125 -6815 11842 8450 -6653 -7436 -12526 -13015 -25131 -18851 -5729 1304 16992 15208 14768 -20192
6111 -20192 -32540 1148 25361 9470 -1523 -11741 -16319 -22517 -27831 -18736 -16777 -33459 -38652
6098 -38652 -28023 -11835 -12135 -4877 13571 31638 11776 -5715 -17795 -7694 13044 37289
6086 37289 43399 35489 -4785 -11449 28505 46086 53819 55567 8498 -11870 14012 22300 11563
6073 11563 11594 18591 33992 39062 45457 43528 37198 53144 37737 35565 30175 59853 67180 82304
6059 82304 75637 49351 22398 6887 12860 16618 -15745 -28439 -30540 -37108 -55099 -58344 -39917
6046 -39917 -40898 -2789 35470 49468 23580 -6856 20624 9517 -3479 -8775 -2678 3941 -6408
6033 -6408 -36853 -63482 -56987 -20396 -3720 1572 -12452 -14972 -27001 -21249 -12007 -10236 3752
6020 3752 8310 22866 17647 -1555 2236 -6904 -24792 -22061 -9580 12626 25430 33407 40759
6007 40759 10812 -4905 -4648 -21027 -18725 -8236 -13506 -5991 -15879 -21635 -21953 -16726 2850 -2537
5993 -2537 -21270 -23287 -12160 57 -9433 -6143 -8613 -14230 -7457 6124 17904 -13409 -57111
5980 -57111 -34354 6517 -7890 -35505 -34063 -34846 -25089 -24200 -14511 -17987 -12452 -12120 1411 13605
5966 13605 -1706 -5429 -2127 -2307 -2631 -8345 -24444 -41061 -53178 -50098 -53370 -38392 -25547 79
5952 79 26656 5736 -34797 -21581 -8554 11781 10512 5122 -3297 -3515 -8156 -13761 -2845 4621
5938 4621 9264 7494 -12160 -40843 -6368 16581 16110 19084 19908 6401 -39934 -49910 -17727 -32149
5924 -32149 -28913 -24095 -24039 -30889 -22892 -10281 -7683 -360 -2555 -7846 2240 19865 19337 -4398
5910 -4398 -26149 -14820 4045 -15293 -26899 -36996 -52623 -44489 -21086 -29954 -22594 -29024 -11705
5897 -11705 -1504 11902 27207 39837 36179 3371 -11174 -1770 -15913 -32376 -23741 -16770 -7681
5884 -7681 2505 -11275 -14449 2028 18965 15997 6819 -13078 14850 8685 9352 -5091 17937
5871 17937 27241 12214 -3185 -11289 -14006 -5333 3017 26258 18002 -7856 -16258 -34567 -51046
5858 -51046 -39705 -19722 -13059 -757 9239 19021 5289 -6585 -5754 1173 -167 28711 44961
5845 44961 24165 -3368 -35607 -30622 -22862 -17302 -10201 5574 19351 24895 23203 -14832 -12582
5832 -12582 -2986 -12087 -18080 -22769 -21260 -31913 -27162 -45236 -59001 -31839 -11789 -19754 -19197 -21619
5818 -21619 -10869 24278 32653 6799 -22545 -49258 -44707 -32516 -2095 -1448 -20212 -33107 -18830
5805 -18830 -20455 -20293 -23035 -50773 -58205 -40051 -12469 997 -4934 7249 6771 14596 34594 17149
5791 17149 24246 42420 63743 41201 -5418 -37113 6521 27328 42948 50080 45576 25953
5779 25953 9302 9910 46380 82932 61480 44328 17951 5449 8171 1632 15020 29037 20044
5766 20044 17806 -37268 -52704 -26120 -22650 -33797 -13484 21455 21385 13173 20980 6780 -17120
5753 -17120 -24454 -14623 -29409 -18871 -2509 -2908 -18279 -26902 -22964 -33258 -66002 -70559 -63646
5740 -63646 -66717 -50351 -38746 2985 -6338 -29160 -44784 -22398 -3596 -10582 -6278 2551 -369
5727 -369 -24533 -25473 -33844 -28142 -16262 -21736 -18431 -13056 -9544 -7177 2185 12273 20852 -8215
5713 -8215 -11621 -28736 -27818 3360 6324 22 -6576 -24057 -8100 8759 13345 10236 5603 -4436
5699 -4436 10638 14450 11681 26971 13462 6809 7411 14566 2395 4167 -13040 -13313 -29441 -9615
5685 -9615 1750 -29977 -45750 -51050 -23738 10954 5971 -13553 -10074 1363 -120 -11491 -16409
5672 -16409 -6089 -4773 7682 -1681 -7337 -26989 -33635 -24474 -38788 -45119 -35311 -32300 -25446 -27352
5658 -27352 -23545 -2367 7224 -9146 -6284 1224 10729 -3366 1786 -6523 -15750 -31744 -13129
5645 -13129 4595 -106 -32143 -22560 -24219 -22751 -7424 -4659 -18244 -34296 -24673 3867 14491
5632 14491 18837 17853 22271 19506 36471 52578 44270 26123 -18134 -11118 -27438 -43620 -21721
5619 -21721 17657 15211 10500 11964 -9857 13285 34422 17922 -242 20037 6168 -29593
5607 -29593 -44314 -14864 -6164 -6179 -8081 -23450 -27983 -31498 -35957 -47340 -43543 -8791 9962 -8173
5593 -8173 -3096 -7571 8928 24694 41856 43101 72802 62216 30282 10516 18684 27256 16200
5580 16200 5126 15136 34289 49255 44572 9901 -32805 -6650 24547 12238 -14404 -19809
5568 -19809 -1130 386 -28186 -45330 -54846 -52892 -13515 22430 39595 32516 24102 -2703 -1670
5555 -1670 -17105 -16359 -35775 -25343 24272 40741 29373 24563 18566 -6604 -16388 -24163 -25817
5542 -25817 -20522 -31179 -30714 -12484 -16372 -15592 11085 12619 -4526 -13457 -21956 -23478 -26695 -20142
5528 -20142 -17557 8986 3610 -19061 -25718 -21025 5468 32305 62214 59306 26036 -5997 -2630
5515 -2630 10788 11571 15307 -15799 -3914 31766 42663 38760 55845 77285 68843 54551 66737
5502 66737 83288 71819 30312 14520 18657 51401 57834 23593 7293 -6327 -25376 -41375
5490 -41375 -47546 -25160 -7542 12119 29954 14678 25307 28915 28724 30239 28816 3670 -15421
5477 -15421 -493 -12547 -3615 -29326 -42215 -34170 -33675 -31882 18015 34610 15256 -6486 -4350
5464 -4350 -10630 7951 -14301 -30927 -16921 -27027 -29374 -35642 -29314 -5456 -7599 -22252 -34148
5451 -34148 -3872 -17289 -7629 -4397 -7264 5657 10902 11182 1917 771 12500 21085 46034 52843
5437 52843 38174 21809 23174 10559 30 -31726 -39020 -16953 -12934 4414 19318 32431
5425 32431 17987 13767 27369 32684 24379 -15601 -22427 -36129 -22964 17519 14019 -24220 -2415
5412 -2415 30616 26801 2627 6306 -6221 -13907 -9505 -2518 -4271 -25394 -13072 -9805 5981
5399 5981 -11599 -14519 -18738 -27857 -22996 -37 4556 26411 14214 8928 15749 5966 -7985 3247
5385 3247 4464 4134 8509 8536 20047 -10471 -22905 -12403 -14634 -9749 26439 38396 19329 14015
5371 14015 6976 -21021 -25254 -32367 -20497 -460 15224 27151 11862 16293 16720 5671 4348
5358 4348 3205 25440 42648 51383 35473 26820 28148 32775 17154 -2184 -7243 -2681 -4996 -7712
5344 -7712 16264 16855 -9956 -23185 -35284 -9103 10616 -10712 -42478 -53328 -31872 -14840
5332 -14840 5766 17313 -1967 5468 -16409 -47456 -40316 -21050 -6146 -2996 -19444 -9808 3777
5319 3777 15027 23959 5602 -13045 -24768 -51238 -64813 -31697 1880 12112 16719 23832 2644
5306 2644 -15163 -42621 -48611 -38649 -35384 -16894 8907 12508 6843 19333 27944 34821 44509 27329
5292 27329 4102 -4079 5522 -8979 -30769 -28335 -35259 -29360 -16020 -37296 -32974 -30430 -11260
5279 -11260 863 -28331 -32495 12460 24441 -7919 -16612 -18583 -10335 -6968 -25387 -20655 -32025
5266 -32025 -39387 -36499 -13737 -14197 -24098 -22686 -4655 -21297 -31320 -23388 -2358 6480 23440
5253 23440 31451 20612 12375 5685 9620 1278 -15659 -18120 22109 -2580 -185 12012 28896
5240 28896 10025 -9527 -50699 -25557 -1085 -12835 -43951 -50564 -6800 33118 16696 -37071
5228 -37071 -55622 -82285 -70187 -37733 -17356 -12406 -32231 -58165 -60399 -40888 -32267 -16498
5216 -16498 2935 14815 -4130 -29678 -44003 -61744 -47661 -22498 -38884 -46999 -34043 -12150
5204 -12150 6824 12049 13131 -3814 -12013 12418 6898 -10282 -8061 -25885 -13081 -3429 -5427
5191 -5427 7133 19915 13666 15122 6465 -6178 -3860 -10695 1766 16455 34258 62002 33700
5178 33700 47654 42406 55832 52813 28691 38295 4907 -21523 -2794 7699 14057 23969 5309
5165 5309 -10949 -10892 11797 -2346 -25214 -36736 -44760 -9490 13034 4278 13986 -10122 -17095
5152 -17095 -40020 -37833 -29465 -32226 -9522 -13096 -14710 -22640 -14535 14526 9698 -8507 -13204 -15002
5138 -15002 -32153 -14588 -19520 -47223 -44657 -69012 -79422 -77492 -48228 -18418 4373 11504 14712
5125 14712 14891 39260 55525 36411 17507 -23377 -21197 -18586 -11597 -17944 -18428 -30304 -29357 -39421
5111 -39421 -25991 -5751 8106 -1120 -2508 17554 7375 10031 8845 -2796 -14268 -20179 -24221
5098 -24221 -16530 -758 11664 -22798 -28883 -3323 6794 5081 7768 -2528 15295 42279 43623
5085 43623 16883 32045 17785 -271 19934 8702 6089 1449 -10800 14171 19350 15792 -800
5072 -800 -11813 -29198 -40277 -20327 -18798 11767 1310 -32109 -19159 -15300 -12891 -21056 -28050
5059 -28050 -44543 -40010 -41057 -29285 -16491 -8785 -1055 -10703 -37897 -23172 -17064 -18178 -4041
5046 -4041 -16844 -10676 -4599 -19710 9177 11187 14607 28402 35028 34948 12099 -33342 -73159 -48679
5032 -48679 -49255 -23926 -318 68698 51983 9947 -2883 2065 -9946 -31267 -36016 -27475 -18599
5019 -18599 -20281 -42713 -28914 -3052 34571 15982 -727 -7563 -23847 -4821 356 21807
5007 21807 32273 22843 -22898 -17955 -12119 6303 -9783 -19455 -2807 7264 478 3582 6052
4994 6052 -968 -7304 -23683 -34078 -26149 -31953 -40511 -14554 -21794 -11964 -20393 -14930 -25619 -48822
4980 -48822 -33138 -3205 12189 17850 17857 3670 -21753 -59385 -76017 -61229 -39105 -12160 5863
4967 5863 1237 -19179 -39992 -3220 13327 -6405 -46456 -48801 -24668 -16780 -6376 -7786 4796
4954 4796 -10784 10303 19254 2576 12852 2379 -23917 -36668 -57329 -49174 -43174 -39207 -10319
4941 -10319 2815 18738 23918 1001 -22423 -7670 -19783 -14460 2345 27295 44203 58997
4929 58997 35677 8506 -24874 -65692 -57391 -31773 -33721 -42498 -47551 -31627 -18440 -4579 -6269
4916 -6269 -2972 -4443 -5550 22291 43446 30624 16705 18983 10162 28615 39851 41339 8108
4903 8108 -7889 -8194 18929 25236 36670 30983 29200 29661 7152 -32980 -24809 -456 -2888 14759
4889 14759 17838 15326 10204 26063 24237 30376 -6608 -24944 6971 28060 16884 12680 31323
4876 31323 26284 9760 11429 2909 2436 -1345 230 -9489 22207 26295 30081 9365 -11369 -22768
4862 -22768 -32770 14982 64826 59840 43235 21289 32265 26976 26932 15829 3181 -26582 -30660
4849 -30660 -16353 24633 6982 -11775 -21807 -20765 -19318 -34604 -26398 2837 -2957 14241 38296
4836 38296 31597 24157 4854 11624 6112 -15654 -42866 -41656 -28978 -18975 -17222 25958 35471
4823 35471 16292 -4940 -9716 -14548 -11299 -37084 -44088 -30863 12155 36432 25076 20351 36885
4810 36885 43632 44794 6980 -1471 -20927 -20406 -27661 -12521 -3498 4529 9774 -11671 -19346 -37122
4796 -37122 -14073 -6755 -14617 -20072 -30402 -9874 -8035 1318 4408 3247 17375 -25115 -46933
4783 -46933 -14989 -2341 -31962 -42583 -22487 -24611 -1993 16895 1577 12562 -1675 -19930
4771 -19930 -27837 -5574 -4630 -69 7263 -3874 -17723 -27374 -4396 14580 399 2176 -2849
4758 -2849 -14673 -17099 -20315 -38961 3005 14563 7851 -17359 -8144 -22249 -13029 2292 -9249
4745 -9249 -42452 -53023 -69558 -60134 -8758 20627 34534 39162 44117 36011 1608 -373 -3491
4732 -3491 -7039 -13896 -2426 14411 30479 32226 27451 15324 -1862 5018 -8240 2798 2272
4719 2272 22947 22885 23545 9508 18464 26224 32352 36921 38231 29212 15444 255 -21211 -3881
4705 -3881 362 1725 8079 2406 7963 35222 15750 -27065 -34130 -17583 212 548 -8559 7043
4691 7043 24536 16168 16033 26892 50679 39508 22871 31937 46376 33758 -7504 -43546 -25340
4678 -25340 -17677 -16226 2189 5158 -17199 -13897 -5040 -9541 -42042 -44042 -27257 -33318 -14686
4665 -14686 -6996 16448 12872 25964 951 -10494 -10460 -30875 -44580 -36350 -20168 -19982 -8782
4652 -8782 -12522 -1503 -1274 6616 9631 -13197 -48231 -77082 -38008 -28589 -6425 -29791 -17253
4639 -17253 -5646 -33163 -67174 -53963 -15456 -33452 -68141 -52942 -34567 -19342 -28196 -11002
4627 -11002 -2287 -10152 -8519 7103 20901 3930 -18547 -11765 -17466 -34524 -19876 -15174 -19830
4614 -19830 -13551 20160 23485 2304 -6043 12797 -12614 -5802 14453 11942 6658 20406 -2734
4601 -2734 -1031 38219 47095 35840 32688 17930 -17579 -31851 -60262 -59454 -17227 -32889 -41394
4588 -41394 -41257 -56920 -73918 -33361 -18706 -26864 -8126 30325 29767 26641 21105 16027 26570
4575 26570 38098 16654 -1874 16123 11799 -4075 -2714 -473 -4796 -5313 -18247 -2606 -22295
4562 -22295 -52808 -57535 -33774 -8618 8462 36132 46187 29955 63644 77685 21367 -8204
4550 -8204 14535 40679 8285 -30818 -30863 -28326 -26414 -36653 -36719 -9593 25821 16862 6031 -10308
4536 -10308 -27747 -12298 4419 10416 -18399 -29838 -42303 -51149 -44479 -18072 -12724 -17004 -10057
4523 -10057 -22723 -17635 -9395 23799 33335 6689 -4922 -11879 -17062 -41131 -49935 -38617 -35458
4510 -35458 6915 6048 -4096 -30289 -25939 -1360 2666 12729 26293 2074 -27955 -16647 -30558
4497 -30558 -38073 -38338 -62106 -41515 -28317 -24587 -3703 -10578 -30144 -23570 -9954 20285 23316
4484 23316 -4716 -39448 -34925 -19003 -35959 -30243 -32626 -14139 2693 -7040 -19560 -26864 -35883
4471 -35883 -17316 -17868 -23738 -16789 -1681 -13620 -3408 18064 18621 7111 1260 11588 14103
4458 14103 9236 11183 1834 -12974 -19837 8942 27382 7349 -19063 -3194 -15784 -7128 -14193
4445 -14193 -19968 -20379 -29664 -25139 -1948 2264 1241 13721 -3710 -3525 11757 27418 17400 3866
4431 3866 -4827 -14813 -6165 29362 38559 7361 -10232 6369 16663 13544 19712 15872 16959 18727
4417 18727 18760 8913 10216 25298 12714 2884 -16868 -36466 -30894 -42038 -40884 -34323 -26580 -5675
4403 -5675 25908 29699 25275 30720 60959 56372 41748 52820 40238 25034 11739 5127 8809
4390 8809 -15053 -17181 -12207 313 -704 7040 25379 36358 40730 32853 34680 30610 31354 23252
4376 23252 10554 12844 -996 20980 25150 3712 7843 -1783 14951 21289 19072 21601 19049
4363 19049 16333 18244 22266 15253 -4830 11343 29680 26811 39806 29377 11592 6807 2168
4350 2168 2410 -1711 -16242 -15810 -4754 -9948 -19194 -22958 4696 4995 -2033 -2856 1063 -466 1928
4335 1928 8093 24464 34892 48069 62338 46298 6235 -5637 -4065 -699 13882 11779 3486
4322 3486 -4183 -21660 -48077 -32014 -10262 478 -8336 -36310 -50898 -31520 -19139 -13558 -11626
4309 -11626 15065 10930 -3790 3591 11540 -7461 -22004 -31997 -24745 -5221 22466 23723 14633
4296 14633 -23203 -27127 -47536 -57774 -37393 -16853 -799 -1125 14201 23206 10075 23872 11229
4283 11229 -13615 -13485 -22015 -38244 -23115 563 -24330 -8341 11218 -9386 -13828 8723 6667
4270 6667 358 -6629 -14568 -13596 3341 -1812 250 -17480 6263 40648 41588 16060 961 -19478
4256 -19478 -25181 -34993 -24737 -3726 -11761 -3822 20357 34491 55532 44935 19385 1726 -29077
4243 -29077 -12880 21006 28488 -6741 -14224 -10688 -1924 5755 10845 -5607 -29000 -7205 -6183
4230 -6183 9022 -2600 -17438 -10264 11108 14816 3302 25930 8266 -7942 -9356 -12216 -17457
4217 -17457 -30406 -34963 -16582 12948 29137 37415 32149 13986 26789 43597 30465 62693
4205 62693 62290 31732 25230 -643 -12142 -24356 -25307 -17405 1054 6986 1348 -4381 -25431 -33843
4191 -33843 -24983 368 40471 43172 36867 12735 737 -4027 12826 18194 -17404 -41038 -37278
4178 -37278 -28081 -20815 -3416 4993 -12378 -10993 -7394 1701 -2570 -42783 -81722 -81702 -35320 -19930
4164 -19930 -8858 17027 26161 -2230 -26381 -26242 -1849 31996 21003 -16436 -43095 -26333
4152 -26333 -23767 5902 9540 6559 -17580 -38108 -33889 -20752 13442 -4819 -3205 15325 16511
4139 16511 -367 -24002 -32164 -25153 -42653 -42931 -7407 7171 -13408 -13430 -10961 1726 41076
4126 41076 35472 4261 -311 -24557 -37390 -37840 -21760 3613 1046 7878 -9024 -44439 -42784
4113 -42784 -6464 5533 -20521 10031 10297 -12052 -16342 2766 -12425 -15575 9875 961 -1978
4100 -1978 5308 -1845 -14019 -32957 -32341 -55684 -18288 14880 11333 -16037 -8149 29622 31135
4087 31135 2637 -23313 -11480 12030 18824 22067 29604 37991 59134 50024 7432 -8659 -32628
4074 -32628 -23963 -19595 -13193 -2567 9884 15625 11603 20531 9412 -3926 2164 19994 6095
4061 6095 22862 24062 9024 8163 25547 6326 -9828 -18950 -22041 -8316 -854 -27398 -28591
4048 -28591 -22133 -18843 -10287 17665 24125 10667 -25485 -31629 -8598 -1986 -2965 -4604 -23352 -43602
4034 -43602 -40697 -44492 -22850 -29574 -42092 -35321 -4858 -24382 -39659 -26246 -8155 -748 -16144
4021 -16144 -21155 -41899 -39198 -25264 -31159 -11485 -5001 -7787 -2584 -18588 -23199 -30414 -25403 -13170
4007 -13170 -348 -9967 11685 52272 62653 31721 10056 22996 26069 27406 26677 24387 9322
3994 9322 36183 64316 91197 92524 43147 1608 -23491 2007 4009 9837 -17053 -31771 -18386
3981 -18386 -8180 -28907 -39309 -39833 -22784 -22060 -4092 14061 10804 21187 23072 15193 -20030
3968 -20030 -19210 19122 11020 11568 19216 -3039 -15830 -40383 -33209 -8822 8480 5846 6361 -12849
3954 -12849 -19002 -5846 11200 499 -3999 -10310 -32513 -43949 -47376 -11182 17889 45876 44626
3941 44626 34826 23709 12854 6887 32480 41475 30499 24705 4217 -7256 -16719 -29355 -2076
3928 -2076 11908 -9907 -20714 -7074 3130 2159 3245 -20754 -16332 -8882 -901 3353 5038 -17280
3914 -17280 -20842 -17981 -3794 2090 7045 11678 -20760 -19836 -2062 3422 -9210 -80 31236 38913
3900 38913 12054 2010 11997 16212 -2475 -34123 -45699 -14549 2010 5362 -24442 -17170 12368
3887 12368 26694 38003 24654 -2236 -17334 -14094 -1561 -6969 6644 17317 30365 56793
3875 56793 43713 7014 -4848 -11950 -30954 -21996 27885 40171 28839 21063 10668 -8999
3863 -8999 17430 20090 17918 -10145 -30488 -24524 -23084 -2956 14683 29105 33529 7651 9466
3850 9466 3433 -29440 -28967 4122 21450 12412 4300 17888 11228 -5349 -9129 16222 19680 14657
3836 14657 -1111 -31252 -35580 -27919 -27617 -15134 3875 -8834 -28174 -40369 -47745 -21096 -3795
3823 -3795 -2548 28944 14738 -3079 8134 1687 15424 21036 -4802 -863 -17848 -40284 -55273
3810 -55273 -45333 -39667 -11381 -10345 -6162 -12433 -8344 -3001 20167 21429 9811 5155 -16068 -42058
3796 -42058 -20011 7585 17555 27865 31171 22870 -9346 -13529 4407 15059 47727 34311 6052
3783 6052 -13800 -6481 -2012 -16754 -62 -1808 -19860 -31148 -40238 -69975 -63138 -39534 -33100
3770 -33100 -40327 -26347 -10968 -19396 -31886 -34564 3447 -11274 -5382 15489 25143 9879 -10188
3757 -10188 -48425 -33388 -34647 -26672 -7254 7533 -16726 -45454 -37037 -19150 11470 44760
3745 44760 56920 38733 -2102 -15420 1981 15289 19406 2995 9167 -7493 -3656 12939
3733 12939 21621 12380 -5290 -16531 -26399 -10210 -15320 -10432 -4849 13786 15084 -3326 -1658
3720 -1658 -18682 -21665 -4602 12884 -4379 -17359 -37918 -28722 -31202 -44 17950 13752 1500
3707 1500 -14308 -35932 -51441 -41130 -40544 -21957 4265 1152 -26897 -57330 -75168 -50118 -40025
3694 -40025 -25709 -12694 7226 9024 12800 8824 -3949 -16740 -11328 8877 1765 -5476 -7265
3681 -7265 -12400 -20098 -15556 -18438 -10461 164 -6080 14923 54908 37259 7402 6437 6938 -11984
3667 -11984 -10958 14272 12408 -4059 -3497 20021 38135 13388 -19423 -23244 -13983 -1241 16988
3654 16988 3330 -33670 -72483 -75278 -44553 -13617 -12071 -14847 -3135 -10723 -3114 -3209 2042 17721
3640 17721 -2326 -13292 14469 55695 72746 55255 15618 19674 3496 -37968 -19931 -2399
3628 -2399 17660 14927 -1516 -35580 -48235 -39612 -57017 -49220 -5746 38899 10607 -16940 -27605
3615 -27605 -24198 -35344 -23941 20073 30261 18922 -12935 -32474 -49334 -32140 -32232 -7277 -9290
3602 -9290 -8340 -17040 -26191 -50199 -51332 -12342 -18022 -44839 -61868 -59216 -47050 -43720 -21977 -15962
3588 -15962 -44669 -53883 -39994 -34004 -9989 18325 33064 45360 47029 38197 16236 7691 20075
3575 20075 15156 -1656 -6617 -1032 -28840 -37327 -52950 -59325 -55689 -65011 -52305 -35173 -44865
3562 -44865 -36361 -18768 -22746 -22862 -20485 -28121 -28390 -26158 -13633 4595 4866 -11351 -16106 13626
3548 13626 14993 -18556 -39918 -57623 -35502 -15944 -30361 -13398 -22287 -31282 -50980 -31806
3536 -31806 -32634 -40136 -9196 -274 16511 25923 -2318 -16253 -23973 -53335 -37303 -23097 -24336
3523 -24336 -37691 -48561 -37335 -25112 15449 11507 -7629 -19047 -25347 12880 22309 7093
3511 7093 -18760 -6593 23177 13097 52 11858 16215 23642 15106 20478 29293 3267 -14228
3498 -14228 4408 14768 26413 26973 15849 11020 -2034 24873 45834 42086 50673 55721 13565
3485 13565 -15712 5613 3128 17568 6354 -15264 -4281 -2666 -6771 -20134 -15383 -14653 -29612
3472 -29612 -5612 40872 49695 43533 59244 25572 2720 2194 3180 18627 -17771 -16171 24911
3459 24911 3024 -10036 3512 4051 13670 14596 -1454 23245 53256 44243 24949 11301 10863
3446 10863 -7271 -40233 -28098 -21642 -2765 -13284 -40586 -42426 -40331 -62631 -43520 954
3434 954 32024 23172 18104 4499 -10585 -29811 -48560 -36323 8314 29173 46248 49447 23673
3421 23673 -8332 -32959 -45509 -36879 -39426 -28501 4379 3804 12090 11437 11319 12899 15426 3832
3407 3832 -22250 -38682 -8930 11851 1101 -678 8204 4344 -26622 -36883 -37262 -31712 -21834
3394 -21834 -34104 -17865 -31242 -14093 24404 34527 10356 -2486 -10412 -19024 -13861 -43618
3382 -43618 -22665 -11899 5854 5721 -7861 -10942 24946 31013 18559 9747 3753 11685 8162
3369 8162 12755 9715 18119 -6788 -26593 -16551 -17232 -31674 -24118 -15866 3431 -14543 3175
3356 3175 11567 14771 23896 10103 7170 24179 32823 17675 4206 -15478 -31749 -21172 -42
3343 -42 17370 37683 38842 23344 18472 12584 41889 44792 22799 16909 8922 13894 7750 -40379
3329 -40379 -39505 -18148 -5048 -6930 -16385 -16588 -22253 -13436 2572 -1596 -14649 -21433 2721 -1297
3315 -1297 -16014 -34655 -30804 -45702 -39085 -11565 -6579 -19932 -28803 -20121 -15012 -20544 -1900
3302 -1900 4577 10918 22932 34403 41218 45871 36498 10304 12068 21775 18286 2082 25627 27828
3288 27828 26623 5081 -11479 -17801 -10977 11559 16790 32452 37949 14159 4915 19597 -5589
3275 -5589 -23001 -66223 -43858 12173 16071 -8942 -28424 -10528 -1127 8953 5433 9991 21982
3262 21982 8421 -26659 -26074 -11787 -15864 -20551 -13140 -16319 -14035 -4821 9667 1247 -8421 -27959
3248 -27959 -41925 -44502 -23754 -14346 -3224 -2330 4291 -25051 -22362 -19122 -7946 29121 31911
3235 31911 25737 13742 -5833 -35447 -14225 17805 -20229 -50395 -15042 -1449 -5221 -3880
3223 -3880 -25449 -24351 -33128 -29863 -14022 -28420 -35664 -42412 -22616 -5125 -20226 -17592 -13806
3210 -13806 -8286 -18611 -17520 -9459 -10942 5379 11873 2865 15220 47241 73565 51662 16016
3197 16016 -10708 -40683 -33126 -38852 -51480 -46274 -29777 -11793 -6161 8300 -11011 -36505 -32688
3184 -32688 -5803 9683 9622 -16110 4250 -4364 -18340 -16159 -4857 -13867 -15374 -7950 4481
3171 4481 -7079 -32347 -46501 -23099 22402 34521 28514 12486 -12078 -22817 -50623 -43230
3159 -43230 -47361 -43142 -35718 -18305 -24839 -43506 -64297 -57934 -14403 -25889 -17622 2500 -15035
3146 -15035 -22540 -35254 -29514 -41460 -50579 -39846 -16697 -10900 -3956 1560 25083 22522 5296
3133 5296 23128 23609 -2980 -16920 2804 14360 31609 17867 7549 2822 -7195 -7779 2572
3120 2572 10807 -14317 -33287 -4532 16408 11903 -20356 -7244 -4835 1533 -2663 -15228 -21825
3107 -21825 5528 11389 -16717 -8401 -29496 -32798 -41984 -25162 -12891 -20613 -20788 -33389 -47424
3094 -47424 -53976 -54677 -40462 -20123 -28632 -40362 -24934 -32129 -8566 -23882 -39609 -29745 -8511
3081 -8511 2632 13295 22994 46827 36057 15899 12242 -5916 -6280 -9661 -4280 -33649 -23932
3068 -23932 -12837 -20707 -5970 14193 -13335 -8772 22761 50126 64790 70598 40574 22598
3056 22598 4903 -14607 -10985 1514 -8803 -29401 -50398 -52199 -37566 -19005 9907 24286
3044 24286 26294 20898 12152 20076 50880 47053 29967 13148 18441 16275 -677 -4490 6069
3031 6069 -5526 10066 9208 19435 35454 10636 14579 16036 43324 75782 68260 5631 -13592
3018 -13592 -10988 -7335 -17822 -3816 3852 20232 8560 24878 20796 2664 -15619 -13011 12436
3005 12436 21306 10920 34497 21852 1056 -3912 20903 30283 28600 16181 2509 -6366 1214
2992 1214 -949 4381 2072 -7273 21025 15663 -13306 -39430 -34171 -26430 -29874 -22236 -26147 -38101
2978 -38101 -37811 -55842 -65631 -50784 -26005 9045 973 -3253 -20230 -57587 -60059 -27747 -22569
2965 -22569 -29363 -45558 -46994 -35700 -216 12443 32105 11376 -23458 -30356 -10167 520
2953 520 11110 21729 22320 38478 47334 29867 24472 -4861 -22588 -10647 -8534 -13040 4618
2940 4618 9955 26888 12593 -10400 -18885 -22410 -22706 14928 21084 10140 4941 5994 11010 11647
2926 11647 21596 12682 12141 3183 -19844 -9941 -12207 -4559 -9153 -21842 -20093 -12624 -46365 -52820
2912 -52820 -11510 -17512 -4898 640 -3668 -4346 -27521 -37228 -20744 -24934 -393 22415 21623 10089
2898 10089 31061 22935 -19836 -21063 -16154 -18854 13464 38568 18142 19989 13392 -13677 2377
2885 2377 -5544 -7313 -6754 22318 46117 63103 63515 41186 16942 17705 18097 11330 42989 18890
2871 18890 9045 8201 -5532 -36343 -13172 -1287 -12268 7998 14563 -13976 -20982 -11268 9034
2858 9034 23108 30777 14053 16595 12819 28860 32186 19137 15001 -7017 -21597 -29764 -38060
2845 -38060 -40331 -53478 -38183 -44684 -35620 -17634 1928 10390 -16452 -14698 -17958 -21303 -28163
2832 -28163 8624 34779 55657 53664 24516 9717 -17004 -38687 -38021 1355 34053 31787 24414
2819 24414 -3160 -14996 -35097 -55519 -38805 -42926 -54246 -53971 -53120 -45380 -30800 -36336 -9914
2806 -9914 10397 10880 8632 16676 21973 28643 12549 3107 -4144 -12795 -6192 -25429 -10028 24749
2792 24749 18260 -15125 3896 10964 21627 31440 46162 39719 31576 -6325 -3890 15292 26907
2779 26907 13884 10701 7856 -8782 -13368 12886 24052 33296 23674 29843 53846 43174 20154
2766 20154 43347 38264 9822 1811 -20516 -32288 4230 866 7286 3849 -6406 -17083 -40074
2753 -40074 -38617 -10915 -11757 -10867 19431 22131 991 -23049 -44422 -32988 -71558 -95934 -87162
2740 -87162 -67389 -23428 16405 38708 31415 24401 31764 18859 2853 -4011 -54792 -65633 -56428
2727 -56428 -19405 -2291 -20408 -18292 -30382 -32283 -35532 -55197 -41241 -23348 -24798 -18972 -6526
2714 -6526 20500 13006 8114 18400 2796 25382 10029 4966 22249 40078 9390 -21890 -28535
2701 -28535 -25998 -5962 12301 10173 17666 447 -20239 -31578 -21948 -6124 1893 35280 36689
2688 36689 42860 22417 -50907 -54581 -4592 -7567 5204 -6549 -21683 11739 49848 27352
2676 27352 10089 29853 21252 -74 -9382 -14300 -10548 -10513 -1997 14579 19334 2929 -13556 -4779
2662 -4779 5272 15552 42540 39202 31655 28701 9041 93 11009 -3985 341 -21292 -15942
2649 -15942 -21858 -34499 -22604 -10332 -7877 -7108 -17940 -27578 -37298 -41272 -26080 -19325 4164
2636 4164 14325 25157 19816 -2113 -33201 -39145 -40076 -39131 -27067 -8253 4483 6034 875 -11178
2622 -11178 5330 -8800 -42243 -44877 -32866 -29075 -36872 -51091 -46139 -33806 -46587 -45672 -34756
2609 -34756 -45080 -25691 -5148 47582 47646 25723 25566 -1518 -7355 -2127 10065 -5473 -15474
2596 -15474 -13895 -12096 -16530 -12357 -13715 -26235 -21649 -9946 -24852 -36742 -25014 -26948 -17102
2583 -17102 22463 38864 35387 33289 22575 -18453 -28802 13412 18865 24557 -338 -13386 7555
2570 7555 17129 14298 9166 17461 13780 -11668 -24145 -7893 406 10647 8975 3624 5110 22218
2556 22218 20875 -604 -726 -4407 -2783 -6564 -7874 14163 23898 8873 26090 36363 31483 33827
2542 33827 28642 33602 35785 25710 14495 37106 39816 12403 13890 40478 29122 18064 7517
2529 7517 -233 -18045 -20201 1935 -277 -29619 -48344 -40511 -46639 -45827 -43987 -57733 -57483 -17098
2515 -17098 25453 44079 13839 1437 -15380 -35281 -36540 -47184 -50893 -40579 -15845 -49629
2503 -49629 -62692 -59522 -42334 -30378 11830 11534 5844 -11393 -30823 -49441 -44193 -19632 -25341
2490 -25341 -9269 9583 -19548 -27718 -24595 -3668 6954 7093 21212 25054 14905 10093 -14689
2477 -14689 4170 -12148 -23275 -16096 13805 6855 5834 12397 10593 34340 52298 37236 27370
2464 27370 22951 -10894 -11883 10727 5531 -26347 -45253 -56532 -51608 -37794 -7772 -1613 8651
2451 8651 12777 10147 21858 3352 -16532 -4692 -5897 -23103 -6745 7166 1026 10447 17860
2438 17860 25793 12689 -4769 9332 8809 -17349 -37609 -35091 -22341 -21989 -48149 -26193 172
2425 172 21363 34606 13095 3091 4006 -19364 -4525 21875 -1048 -29357 -9715 5291 -5732
2412 -5732 -3556 -17761 -40942 -20237 14551 34453 19938 994 21810 41265 36755 32832 6578
2399 6578 -21328 -23733 -18185 -16093 -22648 -15323 -28743 -44029 -32101 -9775 -7731 -10634 5563
2386 5563 -9548 -49168 -58748 -19192 14067 5492 -2602 -23027 -8806 -11534 6244 14145 3948
2373 3948 -11013 -36290 -51799 -48495 -37716 -21049 -10502 -31967 -82090 -50621 -8373 8645
2361 8645 -15180 -7280 1264 5774 -3314 24540 43335 26857 -352 -23794 2856 26371 26629
2348 26629 35030 -1757 6636 16724 7004 15106 -6071 -17823 -44499 -53246 -33308 -26454 -18324
2335 -18324 -15784 -10826 -3539 10506 6689 -24936 -33328 -2815 -4565 8829 38582 24795 9247
2322 9247 15941 26128 7957 -12994 -3274 -5483 -13861 -9362 5412 19494 37752 33347 11415
2309 11415 20537 27585 12945 -25860 -20833 -15968 -33143 -44477 -34573 -31768 -33027 -13586 9068
2296 9068 6721 -14616 -25893 -13978 11543 22477 17442 11606 -29901 -54463 -34560 -2897 -17856
2283 -17856 -36451 -37879 -16114 101 -866 25722 16302 -22595 -25046 -40880 -19904 22019 28869
2270 28869 17235 4588 -8689 -21855 -18369 -32851 -48265 -32847 -3223 23685 34311 42270
2258 42270 19477 -12720 -37507 -29726 -25201 -9156 -25083 -43015 -39174 -34058 -30582 -808 7817
2245 7817 6347 5023 -14531 -18203 -1162 17249 17293 20717 32470 18024 555 19185 39269
2232 39269 23105 -476 5006 -8178 14052 34963 40455 30128 21517 35627 10396 10148 34441
2219 34441 41527 59101 45249 40348 33609 -3475 -15550 -13805 -21004 1575 3922 3849 -2066 -28819
2205 -28819 -20526 1869 18775 -5962 -17177 33061 55783 41962 27240 23287 25595 21793 16305
2192 16305 23039 13057 -28087 -41213 -19247 6615 4397 403 11246 5661 9986 14866 6157
2179 6157 5338 -1920 -18779 -5070 12884 10983 -9547 -16300 -8674 -5460 27789 53763 76136
2166 76136 39275 15199 11710 25311 26475 5265 17186 10790 12716 14812 42584 31478 -2764
2153 -2764 -7559 12054 26307 22208 393 372 11599 33005 33199 17880 19160 38597 41007 27203
2139 27203 24941 43507 45832 34480 15210 424 -9537 14381 15429 5845 13516 6929 21112
2126 21112 8449 21688 45242 38956 35144 19350 -5754 15310 9777 13956 -14103 -11216 15947
2113 15947 14387 5080 -3371 -20627 -16782 -12287 -21508 -12958 10088 19245 31192 33270 174 -23040
2099 -23040 -22247 5294 5539 30626 49567 35284 19139 17798 16672 20145 10146 10473 5093 26053
2085 26053 44419 27306 11686 5518 5550 -14001 -18403 -8565 -24840 -19577 1655 2424 -6004 -113
2071 -113 15660 -8948 18091 42539 75788 91603 73525 38231 20827 40490 61701 14890
2059 14890 -11884 -18903 -17718 -2762 -3911 5259 21527 16153 -20891 -21542 -12820 -3853 -689 -30147
2045 -30147 -8412 12678 16637 23460 39683 42864 57911 57173 62820 67803 57231 27531 7515
2032 7515 -10798 300 -3188 -25636 -2962 3056 12661 15795 25828 20704 3837 16671 40366
2019 40366 31040 14832 5517 31927 30613 16030 -3493 -25458 -7487 -13521 -29963 -56739 -56018
2006 -56018 -42425 -22988 -19809 -33971 -34898 -19169 4766 12171 -15783 -8614 1838 10413 19611
1993 19611 18766 15899 47072 23243 -673 -3737 -995 -759 16774 27863 47 -20344 -10655
1980 -10655 -2270 11245 18762 20127 14497 -13596 -32679 -38626 -24146 -14871 -29845 -23044 -21359
1967 -21359 -23137 -6955 -126 -15219 -23418 -12899 -24914 -23276 -11163 -1818 -17348 -2561 -3087
1954 -3087 3054 10518 31843 39832 17179 12230 17507 10586 22223 11773 1009 12032 9302
1941 9302 32845 33700 41142 13909 -1691 -22238 5086 21362 8972 -2254 -11963 3298 357
1928 357 3353 36591 31767 26557 -14300 -44430 -35101 -33440 -26367 -9919 -9204 -1804 -14125 -3359
1914 -3359 6395 7224 -14173 -18196 -26830 -62182 -51042 -17858 -1466 17875 21220 31973 22310
1901 22310 14852 19798 11884 -2728 -22208 -17597 -2343 -20769 -33505 -8578 2911 -3186 12264
1888 12264 15226 25428 54615 30401 21344 13328 18382 -1547 -29774 -19931 -8925 101 20949
1875 20949 16910 4180 7571 6043 -4238 -15045 -10220 -8088 18998 41844 65710 33661 2768
1862 2768 2131 9539 4561 -21214 -32885 -32875 -23206 -69915 -72556 -59691 -39573 -11162 2844 9322
1848 9322 -7485 -9045 -29387 -30819 -21810 -35475 -47916 -36691 -22946 -29168 16171 27367 27218
1835 27218 -2235 -10690 -3039 -3551 -3596 8090 -13722 -16978 15634 41544 32018 22867 -16622 -31955
1821 -31955 -15263 5008 -14172 -2427 -27249 -51778 -50229 -36611 -21230 -32350 -42779 -45594
1809 -45594 -33200 -23776 -30822 -25138 -3283 11786 -12367 4395 26563 19168 -2999 -26357 -18761
1796 -18761 -20062 -14675 1319 11601 12718 3747 -6999 -1677 -4397 -16033 -8758 -2414 -16139
1783 -16139 -24758 -35418 -31396 -60537 -24769 -24735 -16910 7385 3883 200 12991 19009 35663 19257
1769 19257 15552 -19587 -35550 -3873 32282 10157 -128 -17581 -22193 -12663 -11529 -15238 -18635
1756 -18635 -12910 8444 10023 6586 6153 8671 5843 -27835 -43719 -41343 -34112 -19201 -18574 -36142
1742 -36142 -48704 -51472 -53192 -12379 -2289 -1627 -6775 -22679 -12089 -1235 7141 16541 28815
1729 28815 14978 568 5370 -11834 3108 7569 -12915 -15448 -18726 -12612 -47509 -50106 -39922
1716 -39922 -23505 5827 19699 26096 47800 40289 22327 6189 2920 -3235 3144 -22330 -26016
1703 -26016 5332 22378 36863 38217 19149 -2709 -6672 -12491 -2403 16893 30249 11750
1691 11750 13047 37409 22674 11790 -640 -42286 -48946 -25643 -6227 4912 -10632 -19231
1679 -19231 -23618 -13920 -8562 4880 13911 14438 8811 15547 10972 -17878 -38750 -36863 -27303 -1636
1665 -1636 28176 21570 -5551 1105 31383 27041 -3220 -8194 8836 3822 -12787 -23850 -29358
1652 -29358 -25200 930 23484 44063 38086 18555 -2592 -3275 9895 48088 56559 61850 63291
1639 63291 86135 70492 61088 32549 19127 18664 -5577 -2870 23166 16616 -10904 -18056 -9382
1626 -9382 -21425 -16009 -22173 -9468 -32451 -18413 -7777 14337 34312 42941 31484 19097 12300
1613 12300 37332 33826 33028 19498 35074 19539 9692 11918 13935 14659 37440 28441 2095 26399
1599 26399 51880 22731 -370 -10365 -8596 13433 16266 15720 44478 40186 28410 -568 2906
1586 2906 23147 27778 29137 34223 27925 28940 53337 57481 13978 3047 -991 27959 35646 8820
1572 8820 10901 18384 -15094 -39456 9546 48513 30215 38200 25050 15906 21476 10244 -22266
1559 -22266 -35070 -1919 41159 47097 35407 8613 15285 39176 28361 -6177 -13294 -13318 3463
1546 3463 11582 -16027 -32921 -16034 11710 20637 31495 36656 26754 39168 56421 55678 30121
1533 30121 31861 35242 40159 58385 64694 53086 42396 37084 32189 35006 31659 14975 10707 -1211
1519 -1211 5922 27020 8043 -9675 -3009 3035 -4204 -6786 -2012 4474 -6324 4313 -12381
1506 -12381 -5240 22501 48058 52464 17420 11680 12862 -7679 -28830 -12419 -1867 15643 16643
1493 16643 -3751 -13018 -22462 -28242 -27236 10443 29467 34377 19924 13675 23259 22033 9802
1480 9802 14717 15884 -1947 848 -3141 -26881 -53744 -49650 -47867 -37644 -26911 -7968 8796
1467 8796 11431 -3523 20961 29827 6132 -5231 -8426 4525 16588 14939 -6199 -20022 -12946
1454 -12946 -16111 -17971 3256 16254 6800 10200 20270 15529 22153 15912 -10472 19998 11961
1441 11961 -5915 -5631 15842 33803 18833 9353 -7904 1442 21246 29988 32229 41501 44837
1428 44837 44262 29384 18512 9817 -16584 -35474 -12490 -6058 -27872 -26085 8048 46801 57244
1415 57244 45301 50740 60989 49914 57892 47644 16825 9768 3052 -168 17860 15243 -1504
1402 -1504 707 -12141 -7346 -7708 -4705 -4276 -15511 -41706 -32371 -15754 -17982 -21264 -35162 -22194
1388 -22194 -1068 -21397 -44920 -26400 -6782 10224 -10723 -26429 -9420 -9126 -19729 -5064
1376 -5064 12781 31035 54417 54909 35828 39403 22066 594 3475 13342 12073 5807 11911 -14459
1362 -14459 -45325 -27673 4607 2925 -19021 -26615 -29911 -29979 -52050 -41920 -34587 -28021 -26474 -24376
1348 -24376 -23994 -5390 9849 13930 4536 3813 12384 3900 -26791 -19673 -15708 -14591 -12550 7458
1334 7458 -3573 -1703 -30182 -22788 514 6092 16261 20621 10070 1272 -10194 9874 33701
1321 33701 38145 32089 27567 6257 -10509 -11500 -18351 -15659 -11192 17949 22205 15162 15251 12655 20426
1306 20426 23747 35117 15787 9254 8202 21322 37138 15581 -14150 -20264 5006 7099 28524
1293 28524 37077 53067 67067 72008 45804 24160 33708 41018 51640 38065 15274 -23960 -32509
1280 -32509 -10684 4601 -21437 -23248 20844 21471 6600 713 5971 -28678 -34505 -31276 -12031
1267 -12031 -23950 -14598 850 33634 38398 10409 5090 4899 12460 26042 36250 28155 29517
1254 29517 20414 -725 665 17595 24363 36014 43137 34800 6041 1034 -4656 -6262 -18164
1241 -18164 -38335 -33989 -14840 -5277 1805 -3640 -8149 -16289 -10273 204 -10531 -13044 -10301 13306
1227 13306 7944 11645 389 -7294 8874 1776 3824 -6922 -11622 -14866 -6364 -27123 -26876 -543
1213 -543 18978 31448 27046 43259 44737 56918 28893 15969 22531 37234 7231 2959 -12947
1200 -12947 -17696 -6730 12601 40614 21065 -15018 -39122 -34489 -49078 -63421 -46002 -26443
1188 -26443 -10128 896 16654 -1549 -35109 -16708 -20769 -56061 -55029 -39307 -15292 -16237 -29676
1175 -29676 -18375 -32428 -29658 -34 24346 28718 22498 16787 19520 13645 26723 23216 16830
1162 16830 46219 52569 59568 55684 44581 490 2603 45645 59170 63263 70474 53507 22511
1149 22511 -6317 1768 10422 7679 5213 -13652 346 -8317 5841 4651 -1991 8767 13477
1136 13477 -11377 -4131 17936 33184 17428 20424 27985 21086 35677 47428 61424 21443 -18364
1123 -18364 -27191 -31129 -27291 -11081 2404 2144 3566 10396 4486 16421 14432 -7682 -2122 25336
1109 25336 51372 31003 13086 -11721 -3610 10909 3549 11459 9842 -1549 -63356 -55226 -9786
1096 -9786 34586 15092 43774 58889 26034 30230 28798 5027 -28805 -34841 -35694 -41429 -25234
1083 -25234 -1992 18853 11969 -6008 -18186 -30952 -23568 12396 32507 24991 25954 47900 51906
1070 51906 30467 52983 53502 52125 51268 10124 13823 23392 25913 13635 7124 12031 7514 42565
1056 42565 37451 15008 19112 25628 18554 26283 13437 2971 31672 31967 38403 26634 22992 10643
1042 10643 -4225 -4087 -18094 -6424 24877 21580 14598 -18060 -32637 -34992 -36061 -44302 -33288
1029 -33288 -13018 -9494 -6768 12784 -5440 -17669 4650 -6428 16043 35040 40345 51601
1017 51601 62501 71402 42418 -16871 4053 40459 33266 23981 40826 47957 35686 37486 17745
1004 17745 -24506 -22769 6387 5748 -10779 -7122 -23734 -29100 -52021 -21333 8372 16095 -1761
991 -1761 -16792 -22484 -7753 -5824 -706 -979 30621 57627 34013 25542 -9436 -26495 -8132
978 -8132 6212 25346 15133 -4227 4739 3915 -11579 -10600 -13629 3891 11360 7968 23588 9991
964 9991 28877 19037 17843 30732 13536 2522 -2256 5675 1145 -21841 -21112 -25806 -8958 -17157
950 -17157 -14112 -10711 -14151 -15200 113 4121 415 -2454 15855 24459 27302 53511 40915 1758
936 1758 -30274 -335 -4091 25269 59152 39047 25900 21675 24530 29165 24244 6881 10782
923 10782 12951 -3045 -14263 2171 7184 -16 -7979 -19719 -34653 -25568 -18869 -4662 -24678
910 -24678 -40781 -38623 -7224 2899 19532 32808 38604 28311 19007 6703 -17702 -32231 -9092
897 -9092 -217 -3787 -9357 1789 25357 43513 32310 34199 14661 180 892 6372 19288 7197
883 7197 -10145 10191 3274 -6089 12633 23378 21625 32445 24771 27572 28997 34696 57674 42301
869 42301 23552 -8570 -17193 -13657 -16284 -39408 -45177 -42784 -5064 14793 27609 2200 -8251
856 -8251 11820 12096 6627 -13557 -35048 -38369 -38908 -7952 -5149 -42779 -53471 -51409 -14335 -5485
842 -5485 -28033 -33689 -47144 -40411 -38411 -34055 -15511 2487 15437 14324 27830 24964 19766 27285
828 27285 42301 51973 43906 24138 30326 8497 9791 23050 29581 57113 63295 27836 7100
815 7100 4882 6956 14091 32124 35562 11951 -13974 -32932 -26299 -20082 -7055 -7142 -9032 1842
801 1842 15373 29547 37793 32592 28357 33936 5875 -6670 -11423 -16722 1403 26085 32753 25053
787 25053 36423 35379 8299 -4785 -3797 -7905 14364 25859 21770 22496 34936 32464 29213 28810
773 28810 22464 34391 62727 74593 70587 80146 35545 5591 -6481 -7868 17666 31536 55970
760 55970 45943 -1399 -13615 -21772 1851 30406 27439 22952 14456 5568 13025 26524 59455
747 59455 67667 20563 -27469 -30219 -9632 21265 37084 45414 31128 37150 70828 72429 37786
734 37786 16273 2548 -3093 31737 50496 34544 13196 6172 14786 13271 6493 18257 4721
721 4721 -16089 -33324 -23417 762 -7364 -21484 -8218 14324 10789 1996 11072 -683 -98 -886
707 -886 -16877 -15635 -2243 -16663 -24270 -13177 232 2023 20017 31355 189 -28048 -38762
694 -38762 -29759 -26461 11502 9730 12993 31489 10075 -12554 22808 52371 62123 34489 16080
681 16080 10045 7332 21199 17691 -6848 21785 37952 18271 21995 36498 38754 3073 -4038
668 -4038 -6410 -10257 -7290 27672 41458 47413 17551 14455 35610 32259 20238 5767 -1469 18372
654 18372 31246 39418 25864 13893 8735 48921 48189 39853 36082 59950 55952 21420 -897
641 -897 8680 11121 6050 9274 3061 -388 11822 32940 38830 30007 38659 47053 47372 41227 36027
626 36027 31730 8386 47 25517 36055 15376 33760 50538 45233 54945 74438 71129 79441
613 79441 78325 30990 18330 19966 -1512 -16447 6852 27090 31997 17251 9350 18510 18654
600 18654 33005 46222 33589 31082 25614 19270 41748 38020 -7223 -13871 22329 35119 40026
587 40026 43421 27926 10284 -6829 -29721 -28954 -7328 -25926 -49610 -20106 589 -2547 -4163
574 -4163 13840 38439 39739 -7327 -24103 4562 19165 28673 7183 -19580 -36663 -27125 -14477
561 -14477 -20336 -9492 10657 2427 3875 -1374 -13433 2877 8078 5716 -8266 -10665 -5039 3309
547 3309 -9564 17800 14676 30232 34249 39516 26726 13511 5515 26892 15502 3317 1274
534 1274 -47 -6105 13296 2340 -1125 -7834 5624 17457 25220 39499 37986 16030 -8630
521 -8630 -19878 -23327 -16492 -6973 1167 7899 -13132 -2970 31509 10151 1821 12275 16873 2792
507 2792 1920 -6422 -12054 -15533 6786 25017 54056 48149 29887 16161 1663 -3836 -11609 -11074
493 -11074 -5513 -8336 4733 18736 18300 25365 15839 12675 11468 31001 38941 45962 18923 8582
479 8582 18658 6529 -135 -1628 10588 19530 6117 -29454 -56539 -34729 -14004 7094 19972
466 19972 19184 63323 42066 20283 50030 46879 20681 30270 -2612 -5806 10835 -1256 7582
453 7582 13389 21248 70381 91565 57536 20388 11274 -233 15158 36331 48393 47107 22194
440 22194 8545 11554 51151 62962 55687 90301 82603 36431 -6941 -11417 5493 8113 22226
427 22226 21671 31370 41855 27450 10022 23992 25143 5339 -30925 -36221 -17907 -8713 -7204
414 -7204 19311 12258 -8453 -10578 -14797 -15547 27643 33970 19795 28391 47607 65514 63356 51485
400 51485 30631 10857 14371 32113 38869 30770 33709 27472 38725 29526 15865 18279 14122 12584
386 12584 25953 27298 36753 32823 15002 23490 20067 -15419 -34109 -26509 315 -12040 1087
373 1087 28451 32096 22449 -11037 -14917 42035 56342 30847 29538 28910 14702 6173 14113 8560
359 8560 9620 31124 51198 43599 31203 18378 13923 20785 14927 -2252 28227 41800 26376
346 26376 18423 19931 10552 14726 -13117 -28852 -10549 15738 37179 20765 -20222 -17489 -20356
333 -20356 2769 15524 -3436 -1424 3807 18316 13012 30741 43823 43755 21358 -11510 -26584
320 -26584 -9842 1243 11395 30682 46323 19825 -11516 -15531 1738 27880 37909 34272
308 34272 26175 27017 23087 9448 22748 -853 -6880 -22148 -33649 -41794 -43401 -30467 -30986 -31155
294 -31155 -19035 -22342 -39720 -20431 -3325 13995 5544 2375 -3739 -11618 -29822 -27724 -23031
281 -23031 -712 8267 42837 37936 15837 -2355 29209 22708 38508 46605 30915 20080 12060
268 12060 11998 31910 45884 50449 31490 14561 16639 20999 13731 -21475 -12381 -13683 -5906 -12457
254 -12457 -29805 -25995 -38745 -24318 -18631 -4276 16679 18583 29733 23064 7188 14068 17674
241 17674 25494 26311 32985 60038 42560 49872 55062 38597 63238 58788 13531 11258 22669 22776
227 22776 4192 -3183 -2620 -8597 -670 -262 11488 22111 25012 1829 -12885 -17031 -15802 14094
213 14094 40648 32540 14499 -5281 -14784 -1677 30561 49469 36204 37537 21423 18777 34040
200 34040 36455 6346 6122 6701 13142 28789 39344 58808 47325 15206 33647 36246 28032 34779
186 34779 30980 26196 23049 17050 8154 2894 11132 2805 -3832 10272 16030 -6603 -362 -8032
172 -8032 -5542 900 25733 27642 2315 -5025 925 -27130 -39248 -25078 -23731 -12826 -22870
159 -22870 -24490 -8008 19254 19834 12406 6034 -4055 -8920 -8064 -2 11384 44164 32373 35224
145 35224 30037 10104 5573 -10740 -2238 21406 33024 39830 29092 24816 -3632 -14188 -19243
132 -19243 6149 33828 32738 34166 44825 42633 48838 41608 17968 9899 3890 16151 33656
119 33656 31818 14379 21403 25684 33460 46434 39791 4257 1954 -4467 -5840 10116 22976 26834
105 26834 18559 9685 10783 10481 15694 14846 24612 29540 37682 36124 31079 20779 29095 39757 18893
90 18893 9846 -3236 -12165 -20341 -8079 -10618 -8617 -2214 542 -16156 -15059 -10125 11407 15911
76 15911 -7863 -28732 -39920 -22652 -15866 -4063 3665 6004 11721 3898 -8964 -5080 -1146 2312
$$ [...]
##END NTUPLES=NMR SPECTRUM
##END=
