##TITLE=Analysis number 324840
Compound Code cc 60409
Book Reference 470/144/1
Project Code adrs
Chemist Name mikem
##JCAMPDX= 6.0         $$ Bruker NMR JCAMP-DX V2.0
##DATA TYPE= NMR SPECTRUM
##DATA CLASS= NTUPLES
##ORIGIN= Bruker BioSpin GmbH
##OWNER= nmr
$$ XWIN-NMR		Version 3.5
$$ Mon Dec  4 09:51:31 2006 GMT Standard Time (UT+0h)  MAYBRIDGE\nmr@NMR_250MHZ
##.OBSERVE FREQUENCY= 250.131544655141
##.OBSERVE NUCLEUS= ^1H
##.ACQUISITION MODE= SIMULTANEOUS (DQD)
##.ACQUISITION SCHEME= undefined
##.AVERAGES= 16
##.DIGITISER RES= 18
##SPECTROMETER/DATA SYSTEM= dpx250
##.PULSE SEQUENCE= zg30
##.SOLVENT NAME= CDCl3
##.SHIFT REFERENCE= (INTERNAL, CDCl3, 0, 16.522)
##AUDIT TRAIL= $$ (NUMBER, WHEN, WHO, WHERE, WHAT)
$$ ##TITLE= Audit trail, XWIN-NMR		Version 3.5
$$ ##JCAMPDX= 5.01
$$ ##ORIGIN= Bruker BioSpin GmbH
$$ ##OWNER= nmr
$$ C:\u/data/dgb/nmr/ADRS/80/pdata/1/auditp.txt
$$ ##AUDIT TRAIL=  $$ (NUMBER, WHEN, WHO, WHERE, WHAT)
(   1,<2006-12-04 09:51:03.94 +000>,<MAYBRIDGE\nmr>,<NMR_250MHZ>,
      <created by zg, POWCHK disabled, PULCHK disabled
       configuration hash MD5:
       49 4B E0 1D 92 C2 6B 37 9F E6 65 BC 52 41 86 1D
       data hash MD5: 64K
       96 2D C4 BE 70 EA 45 BF 95 14 1E A4 F9 CC 68 A2>)
(   2,<2006-12-04 09:51:20.30 +000>,<MAYBRIDGE\nmr>,<NMR_250MHZ>,
      <Start of raw data processing
       ef LB = 0.3 FT_mod = 6 PKNL = 1 SI = 32K 
       data hash MD5: 32K
       8A 22 97 A4 A3 45 9F CD 19 C1 24 47 D0 40 1C 29>)
(   3,<2006-12-04 09:51:22.33 +000>,<MAYBRIDGE\nmr>,<NMR_250MHZ>,
      <apk 
       data hash MD5: 32K
       C7 00 C9 99 57 C9 DF 37 5C AB 10 79 4D 83 42 5B>)
(   4,<2006-12-04 09:51:23.04 +000>,<MAYBRIDGE\nmr>,<NMR_250MHZ>,
      <abs ABSG = 5 
       data hash MD5: 32K
       D2 23 F9 68 76 54 7D 39 61 57 AA AA 54 B4 6A E8>)
$$ ##END=
$$ 
$$ hash MD5
$$ B3 AA 2F 88 32 F1 C6 3E AF 01 82 0A 01 38 88 5F
##$RELAX= 
##$RELAX= 
##$RELAX= 
##$RELAX= 
##$RELAX= 
##$RELAX= 
##$RELAX= 
$$ Bruker specific parameters
$$ --------------------------
##$DU= <C:\u>
##$EXPNO= 80
##$NAME= <ADRS>
##$PROCNO= 1
##$TYPE= <nmr>
##$USER= <dgb>
##$AMP= (0..31)
100 100 100 100 100 100 100 100 100 100 100 100 100 100 100 100 100 100 
100 100 100 100 100 100 100 100 100 100 100 100 100 100 
##$AQSEQ= 0
##$AQ_mod= 3
##$AUNM= <au_zg>
##$AUTOPOS= <3 >
##$BF1= 250.13
##$BF2= 250.13
##$BF3= 250.13
##$BF4= 250.13
##$BF5= 500.13
##$BF6= 500.13
##$BF7= 500.13
##$BF8= 500.13
##$BYTORDA= 1
##$CFDGTYP= 0
##$CFRGTYP= 5
##$CHEMSTR= <none>
##$CNST= (0..31)
1 1 145 1 1 1 1 1 1 1 1 1 1 1 1 1 1 1 1 1 1 1 1 1 1 1 1 1 1 1 1 1 
##$CPDPRG= <>
##$CPDPRG1= <>
##$CPDPRG2= <>
##$CPDPRG3= <>
##$CPDPRG4= <mlev>
##$CPDPRG5= <mlev>
##$CPDPRG6= <mlev>
##$CPDPRG7= <mlev>
##$CPDPRG8= <mlev>
##$CPDPRGB= <>
##$CPDPRGT= <>
##$D= (0..31)
0 1 0 0 0 0 0 0 0 0.06 0 0 0 0 0 0 0.0002 0 0 0 0 0 0 0 0 0 0 0 0 0 0 
0 
##$DATE= 1165225863
##$DBL= (0..7)
120 120 120 120 120 120 120 120 
##$DBP= (0..7)
150 150 150 150 150 150 150 150 
##$DBP07= 0
##$DBPNAM0= <>
##$DBPNAM1= <>
$$ [...]
##$SUBNAM6= <"">
##$SUBNAM7= <"">
##$SUBNAM8= <"">
##$SUBNAM9= <"">
##$SW= 20.6930455092707
##$SWIBOX= (0..15)
0 0 3 0 0 0 0 0 0 0 0 0 0 0 0 0 
##$SW_h= 5175.983436853
##$TD= 65536
##$TD0= 1
##$TE= 294.16
##$TE2= 300
##$TE3= 300
##$TEG= 300
##$TL= (0..7)
0 120 120 120 120 120 120 120 
##$TP= (0..7)
150 150 150 150 150 150 150 150 
##$TP07= 0
##$TPNAME0= <>
##$TPNAME1= <>
##$TPNAME2= <>
##$TPNAME3= <>
##$TPNAME4= <>
##$TPNAME5= <>
##$TPNAME6= <>
##$TPNAME7= <>
##$TPOAL= (0..7)
0.5 0.5 0.5 0.5 0.5 0.5 0.5 0.5 
##$TPOFFS= (0..7)
0 0 0 0 0 0 0 0 
##$TUNHIN= 0
##$TUNHOUT= 0
##$TUNXOUT= 0
##$USERA1= <user>
##$USERA2= <user>
##$USERA3= <user>
##$USERA4= <user>
##$USERA5= <user>
##$V9= 5
##$VALIST= <valist>
##$VCLIST= <CCCCCCCCCCCCCCC>
##$VD= 0
##$VDLIST= <DDDDDDDDDDDDDDD>
##$VPLIST= <PPPPPPPPPPPPPPP>
##$VTLIST= <TTTTTTTTTTTTTTT>
##$WBST= 1024
##$WBSW= 4
##$XGAIN= (0..3)
0 0 0 0 
##$XL= 0
##$YL= 0
##$YMAX_a= 563917
##$YMIN_a= -411536
##$ZGOPTNS= <>
##$ZL1= 120
##$ZL2= 120
##$ZL3= 120
##$ZL4= 120
##$ABSF1= 16.522
##$ABSF2= -4.171173
##$ABSG= 5
##$ABSL= 3
##$ALPHA= 0
##$AQORDER= 0
##$ASSFAC= 0
##$ASSFACI= 0
##$ASSFACX= 0
##$ASSWID= 0
##$AUNMP= <proc_1d>
##$AZFE= 0.1
##$AZFW= 0.1
##$BCFW= 0
##$BC_mod= 0
##$BYTORDP= 0
##$COROFFS= 0
##$CY= 12.5
##$DATMOD= 1
##$DC= 0
##$DFILT= <>
##$DTYPP= 0
##$F1P= 14.0000005364418
##$F2P= -0.99999901652339
##$FCOR= 0.5
##$FTSIZE= 32768
##$FT_mod= 6
##$GAMMA= 0
##$GB= 0
##$INTBC= 1
##$INTSCL= 1
##$ISEN= 128
##$LB= 0.3
##$LEV0= 0
##$LPBIN= 0
##$MAXI= 10000
##$MC2= 0
##$MEAN= 0
##$ME_mod= 0
##$MI= 0
##$NCOEF= 0
##$NC_proc= -4
##$NLEV= 6
##$NOISF1= 0
##$NOISF2= 0
##$NSP= 0
##$NTH_PI= 0
##$NZP= 0
##$OFFSET= 16.522
##$PC= 1
##$PHC0= 71.4305
##$PHC1= 8.594673
##$PH_mod= 1
##$PKNL= yes
##$PPARMOD= 0
##$PSCAL= 4
##$PSIGN= 0
##$REVERSE= no
##$SF= 250.13
##$SI= 32768
##$SIGF1= 0
##$SIGF2= 0
##$SINO= 400
##$SIOLD= 32768
##$SREGLST= <1H.CDCl3>
##$SSB= 0
##$STSI= 32768
##$STSR= 0
##$SW_p= 5175.98343685301
##$SYMM= 0
##$S_DEV= 0
##$TDeff= 65536
##$TDoff= 0
##$TI= <Analysis number 999999
Compound Code 99
Book Reference 9
Project Code 9>
##$TILT= no
##$TM1= 0
##$TM2= 0
##$TOPLEV= 0
##$USERP1= <user>
##$USERP2= <user>
##$USERP3= <user>
##$USERP4= <user>
##$USERP5= <user>
##$WDW= 1
##$XDIM= 32768
##$YMAX_p= 520783269
##$YMIN_p= -69436
$$ End of Bruker specific parameters
$$ ---------------------------------
##NTUPLES= NMR SPECTRUM
##VAR_NAME=  FREQUENCY,     SPECTRUM/REAL,   SPECTRUM/IMAG
##SYMBOL=    X,             R,               I
##VAR_TYPE=  INDEPENDENT,   DEPENDENT,       DEPENDENT
##VAR_FORM=  AFFN,          ASDF,            ASDF
##VAR_DIM=   32768,         32768,           32768
##UNITS=     HZ,            ARBITRARY UNITS, ARBITRARY UNITS
##FACTOR=    0.157963299565203, 1,           1
##FIRST=     4132.6476996994, 0,             0
##LAST=      -1043.33573715361, 0,           0
##MIN=       -1043.33573715361, -69436,      0
##MAX=       4132.6476996994, 520783269,     0
$$ Real data points
##PAGE= N=1
##DATA TABLE= (X++(R..R)), XYDATA
$$ [...]
$$ plain form
16131 18265 -506 -6670 -2031 10977 12844 -7492 -12917 -19806 -11570 8480 23115 39487 35091
16118 35091 33694 22790 34862 26363 9610 19169 13322 19184 7773 10708 11953 17625 31560
16105 31560 49925 45864 32741 30317 -1584 -15119 -544 9684 15200 12934 20051 41594 38675
16092 38675 33308 36518 43568 30625 50414 55550 52733 48113 46783 49868 20030 22125 35098
16079 35098 29346 29583 33384 24991 16224 20954 25334 14547 27310 24430 28595 29128 38510 52971
16065 52971 47248 43246 29601 12028 10971 15865 18950 20025 13211 10343 18205 5070 -9549
16052 -9549 -11566 -6004 14371 37618 22055 17642 37620 41434 41254 35470 29574 38636 31717 27033
16038 27033 30396 18274 21741 36696 44332 48242 46569 37476 27056 41604 41478 38343 21171
$$ packed form
16131A8265j8771o164M639J3008J867k0336n425o889Q236K0050J4635J6372m396
16118C5091j397j0904J2072q499j6753R559n847N862j1411K935J245N672J3935
16105C1560J8365m061j3123k424l1901j3535J4575J0228N516k266P117K1543k919
16092C8675n367L210P050j2943J9789N136k817m620j330L085k9838K095J2973
16079C5098n752K37L801q393q767M730M380j0787J2763k880M165N33R382J4461
16065E2971n723m002j3645j7573j057M894L085J075o814k868P862j3135j4619
16052i549k017N562K0375K3247j5563m413J9978L814j80n784n896R062o919m684
16038B7033L363j2122L467J4955P636L910j673r093j0420J4548j26l135j7172
$$ plain form
16025 21171 19921 18920 24810 26534 23750 39751 43619 39896 37117 27998 25420 32652 32369 38222
16011 38222 47346 37635 33592 18586 5636 13508 9824 16475 23982 46667 52415 58167 52255 47758
15997 47758 53680 37612 28167 24563 15456 24963 32592 38806 48194 45098 34610 27480 26819 33504
15983 33504 35996 54394 63151 79916 77578 67866 51754 47440 36616 24614 13208 2638 22784
15970 22784 56032 68444 70480 56492 72246 81432 70473 51618 52724 44054 44504 48459 59687
15957 59687 72142 73546 65109 60217 38432 20863 31761 56591 62373 73778 67206 59772 53355
15944 53355 49187 58008 68578 72686 75031 63592 65280 63545 71337 69240 49042 54727 66300
15931 66300 69064 67671 59835 55812 63570 68103 71876 62033 64247 86856 77465 80206 93234 105950
$$ packed form
16025B1171j250j001N890J724k784J6001L868l723k779r119k578P232k83N853
16011C8222R124r711m043j5006j2950P872l684O651P507K2685N748N752n912m497
15997D7758N922j6068r445l604r107R507P629O214R388l096j0488p130o61O685
15983C3504K492J8398Q757J6765k338r712j6112m314j0824j2002j1406j0570K0146
15970B2784L3248J2412K036j3988J5754R186j0959j8855J106q670M50L955J1228
15957E9687J2455J404q437m892k1785j7569J0898K4830N782J1405o572p434o417
15944E3355m168Q821J0570M108K345j1439J688j735P792k097k0198N685J1573
15931F6300K764j393p836m023P758M533L773r843K214K2609r391K741J3028J2716
$$ plain form
15917 105950 115293 106293 109453 113203 120262 115440 111728 123808 138054 112712 88689 88843 86663
15904 86663 82553 95534 103747 99267 109943 112445 116641 114107 114649 114656 126174 135311 126145 120726 125672
15889 125672 135046 133591 129927 123661 134029 147484 144152 137861 157994 155825 144547 146589 156232
15876 156232 142861 147202 157012 158435 155103 148591 153302 141444 138979 144124 145283 147578 152608 191377
15862 191377 200819 175326 160035 145667 151748 174302 189189 207752 207517 170420 154109 174683
15850 174683 177971 174189 177880 159090 149857 157871 172191 199518 184662 175381 183480 177461 198515
15837 198515 209519 217235 213807 197386 203136 221913 227538 224481 213496 215189 210330 210243 219805 209892
15823 209892 219154 241908 259881 273969 276894 265894 260216 260061 257053 267580 259846 261769 268876
$$ packed form
15917A05950R343r000L160L750P059m822l712J2080J4246k5342k4023J54k180
15904H6663m110J2981Q213m480J0676K502M196k534N42PJ1518R137r166n419M946
15889A25672R374j455l664o266J0368J3455l332o291K0133k169j1278K042R643
15876A56232j3371M341R810J423l332o512M711j1858k465N145J159K295N030L8769
15862A91377R442k5493j5291j4368O081K2554J4887J8563k35l7097j6311K0574
15850A74683L288l782L691j8790r233Q014J4320K7327j4856r281Q099o019K1054
15837A98515J1004P716l428j6421N750J8777N625l057j0985J693m859q7R562r913
15823B09892R262K2754J7973J4088K925j1000n678j55l008J0527p734J923P107
$$ plain form
15810 268876 294806 302244 300785 303344 288080 292577 298079 295001 295661 290651 278790 294364 300747
15797 300747 295076 290399 297376 308824 311737 325116 320417 320377 331604 335198 345667 346724 353084 355244
15783 355244 342267 338128 344801 360331 371863 383180 403109 429056 436269 442902 437392 435963 450364
15770 450364 467094 478813 474433 465068 464133 471110 489984 519138 538332 539926 544732 547557 562785
15757 562785 569289 569216 566490 563722 588870 624711 644495 639104 652087 670783 692144 715958 710943
15744 710943 722161 738624 755558 778108 793836 804409 820087 833761 865681 887715 898223
15733 898223 912717 931592 950950 979879 1005999 1016819 1029850 1064648 1105313 1133342 1158114
15722 1158114 1174572 1183027 1204404 1233713 1269059 1296878 1331265 1365146 1408703 1449014 1488532
$$ packed form
15810B68876K5930P438j459K559j5264M497N502l078O60n010j1861J5574O383
15797C00747n671m677O977J1448K913J3379m699m0J1227L594J0469J057O360K160
15783C55244j2977m139O673J5530J1532J1317J9929K5947P213O633n510j429J4401
15770D50364J6730J1719m380r365r35O977J8874K9154J9194J594M806K825J5228
15757E62785O504p3k726k768K5148L5841J9784n391J2983J8696K1361K3814n015
15744G10943J1218J6463J6934K2550J5728J0573J5678J3674L1920K2034J0508
15733H98223J4494J8875J9358K8929K6120J0820J3031L4798M0665K8029K4772
15722A158114J6458Q455K1377K9309L5346K7819L4387L3881M3557M0311L9518
$$ plain form
15711 1488532 1528951 1561601 1596229 1632678 1682385 1743975 1784624 1822538 1866395 1931965 1990870
15700 1990870 2050112 2117224 2193612 2257914 2323896 2385031 2436047 2500639 2571937 2655582 2741148
15689 2741148 2822420 2915070 3017987 3131982 3230473 3335449 3447343 3579065 3699530 3821274
15679 3821274 3948521 4093093 4228525 4389724 4551262 4711592 4894792 5089342 5293312
15670 5293312 5490730 5693932 5915452 6128310 6347361 6595476 6865347 7154001 7450718
15661 7450718 7741845 8031117 8358506 8702913 9070768 9443570 9810074 10208408 10620301
15652 10620301 11048934 11490238 11939840 12434033 12939670 13450412 13987096 14537944 15108068
15643 15108068 15667446 16219746 16811986 17418604 18005655 18611892 19230551 19842683 20439095
$$ packed form
15711A488532M0419L2650L4628L6449M9707O1590M0649L7914M3857O5570N8905
15700A990870N9242O7112P6388O4302O5982O1135N1016O4592P1298Q3645Q5566
15689B741148Q1272R2650J02917J13995R8491J04976J11894J31722J20465J21744
15679C821274J27247J44572J35432J61199J61538J60330J83200J94550K03970
15670E293312J97418K03202K21520K12858K19051K48115K69871K88654K96717
15661G450718K91127K89272L27389L44407L67855L72802L66504L98334M11893
15652A0620301M28633M41304M49602M94193N05637N10742N36684N50848N70124
15643A5108068N59378N52300N92240O06618N87051O06237O18659O12132N96412
$$ plain form
15634 20439095 21027511 21600844 22162227 22694861 23195567 23648187 24076878 24446595 24751466
15625 24751466 25018003 25211323 25332513 25388523 25385907 25317334 25162083 24955786 24691045 24371195
15615 24371195 23984578 23560248 23091774 22565566 22030617 21440743 20833120 20220654 19605215
15606 19605215 18997618 18388308 17772629 17173552 16582106 15963655 15357215 14800702 14252790
15597 14252790 13690205 13166181 12680949 12199873 11721762 11259493 10820548 10415326 10014262
15588 10014262 9633177 9275415 8903911 8545423 8219412 7914919 7619820 7326679 7058937
15579 7058937 6808621 6555400 6299586 6064613 5827708 5635512 5446235 5254419 5063094
15570 5063094 4884209 4730076 4589743 4427568 4275835 4144371 4004035 3854832 3729732
$$ packed form
15634B0439095N88416N73333N61383N32634N00706M52620M28691L69717L04871
15625B4751466K66537J93320J21190N6010k616o8573j55251k06297k64741l19850
15615B4371195l86617m24330m68474n26208n34949n89874o07623o12466o15439
15606A9605215o07597o09310o15679n99077n91446o18451o06440n56513n47912
15597A4252790n62585n24024m85232m81076m78111m62269m38945m05222m01064
15588A0014262l81085l57762l71504l58488l26011l04493k95099k93141k67742
15579G058937k50316k53221k55814k34973k36905j92196j89277j91816j91325
15570E063094j78885j54133j40333j62175j51733j31464j40336j49203j25100
$$ plain form
15561 3729732 3617866 3500792 3376379 3295518 3186047 3078581 2979974 2886190 2797958 2720972
15551 2720972 2646107 2561844 2483597 2408746 2362125 2294480 2221090 2160554 2105536 2043259 1974776
15540 1974776 1935164 1901039 1847193 1786250 1739686 1698511 1651816 1597912 1551159 1511176 1475791
15529 1475791 1459069 1434979 1411464 1373730 1325206 1297943 1273988 1250899 1217651 1175440 1162861
15518 1162861 1165180 1150873 1115948 1076870 1045170 1014971 978697 966749 963812 959083 942374 904917
15506 904917 881436 881082 870127 863628 847461 822650 812754 781503 754255 746017 725062 707029
15494 707029 691152 686973 687216 659101 658641 672280 652896 653281 637348 615444 598145 595478 609447
15481 609447 602668 580247 570069 563041 551356 545511 544883 541621 522039 504693 497594 497040 492622
$$ packed form
15561C729732j11866j17074j24413q0861j09471j07466r8607r3784q8232p6986
15551B720972p4865q4263p8247p4851m6621o7645p3390o0536n5018o2277o8483
15540A974776l9612l4125n3846o0943m6564m1175m6695n3904m6753l9983l5385
15529A475791j6722k4090k3515l7734m8524k7263k3955k3089l3248m2211j2579
15518A162861K319j4307l4925l9078l1700l0199l6274j1948k937m729j6709l7457
15506I04917k3481l54j0955o499j6167k4811r896l1251k7248q238k0955j8033
15494G07029j5877m179K43k8115m60J3639j9384L85j5933k1904j7299k667J3969
15481F09447o779k2421j0178p028j1685n845o28l262j9582j7346p099n54m418
$$ plain form
15468 492622 479058 464289 455021 452028 443839 449702 453559 440840 420975 417177 407304 411133 414037
15455 414037 413880 409840 405242 390298 379970 379487 363731 354353 345690 337178 337772 331299 319614 308984
15441 308984 301384 305318 317200 328947 334914 339386 322677 319966 323734 313762 299324 284587 265410
15428 265410 253090 252477 241744 224471 233845 237209 254165 284418 268483 256982 251970 247411 238430
15415 238430 238487 223390 217068 218662 225286 220308 220330 228368 223199 218709 225772 213549 194153 212818
15401 212818 208044 190341 190446 189188 171748 179644 173968 178421 177999 178358 167287 176036 183446 181036
15387 181036 172335 159668 153489 158657 173247 169106 158229 169248 168592 169544 156734 147860 153965
15374 153965 159136 140443 137580 137539 153399 166285 167773 159501 151212 142790 129776 137308 146782 152409
$$ packed form
15468D92622j3564j4769r268k993q189N863L857j2719j9865l798r873L829K904
15455D14037j57m040m598j4944j0328m83j5756r378q663q512N94o473j1685j0630
15441C08984p600L934J1882J1747N967M472j6709k711L768r972j4438j4737j9177
15428B65410j2320o13j0733j7273R374L364J6956L0253j5935j1501n012m559q981
15415B38430N7j5097o322J594O624m978K2Q038n169m490P063j2223j9396J8665
15401B12818m774j7703J05j258j7440P896n676M453m22L59j1071Q749P410k410
15387A81036q701j2667o179N168J4590m141j0877J1019o56R52j2810q874O105
15374A53965N171j8693k863m1J5860J2886J488q272q289q422j3014P532R474N627
$$ plain form
15360 152409 148184 135423 150729 156642 160756 166612 166346 144774 126728 133539 133350 135223 131161 141117
15346 141117 139115 132450 118378 118847 113515 122228 134229 120885 112964 101911 93357 93882 115085
15333 115085 130771 119580 123250 133987 137653 123473 121045 111494 106703 106370 122834 128716 106784
15320 106784 101656 110183 108420 106780 109551 107626 102404 112528 102897 90070 84017 93727 102783 90516
15306 90516 72225 67519 69495 69630 71902 68537 59950 54927 72010 83549 86172 81021 75205 53857
15292 53857 45752 69892 85064 84574 90864 85136 88793 90210 76662 62579 59042 53364 71109
15279 71109 89533 85266 48890 25153 43311 72748 65501 42191 30260 35324 60363 78818
15267 78818 76228 74055 67274 59229 57963 54050 57636 74510 80024 63837 54840 57834 59110 62805
$$ packed form
15360A52409m225j2761J5306N913M114N856k66k1572j8046O811j89J873m062R956
15346A41117k002o665j4072M69n332Q713J2001j3344p921j1053q554N25K1203
15333A15085J5686j1191L670J0737L666j4180k428r551m791l33J6464N882k1932
15320A06784n128Q527j763j640K771j925n222J0124r631j2827o053R710R056j2267
15306I0516j8291m706J976J35K272l365q587n023J7083J1539K623n151n816k1348
15292E3857q105K4140J5172m90O290n728L657J417j3548j4083l537n678J7745
15279G1109J8424m267l6376k3737J8158K9437p247k3310j1931N064K5039J8455
15267G8818k590k173o781q045j266l913L586J6874N514j6187q997K994J276L695
$$ plain form
15253 62805 51437 48694 54577 51613 52548 53045 63743 70146 59353 47043 43925 60570 71962
15240 71962 64226 43079 46039 59563 68606 60898 79592 72408 54946 53975 49220 54131 76302
15227 76302 77135 69785 55742 34470 25798 32286 28749 8362 -15783 -1554 22897 39043 58178
15214 58178 59659 56448 52035 47913 27436 29771 39897 41739 45898 46409 67355 59319 42280 46043
15200 46043 45469 37627 41971 35443 42352 60528 80894 76801 63590 45724 48650 51637 38827
15187 38827 28010 17691 31036 18559 8576 12068 21497 32583 35776 36516 31733 23298 15154
15174 15154 -6136 -8943 2093 10179 19676 30295 34519 17699 11851 11871 8658 4608 7698 -30
15160 -30 2692 17269 20823 25311 19416 29143 33663 4974 8187 25440 35036 27088 17655 12900
$$ packed form
15253F2805j1368k743N883k964R35M97J0698O403j0793j2310l118J6645J1392
15240G1962p736k1147K960J3524R043p708J8694p184j7462r71m755M911K2171
15227G6302Q33p350j4043k1272q672O488l537k0387k4145J4229K4451J6146J9135
15214E8178J481l211m413m122k0477K335J0126J842M159N11K0946q036j7039L763
15200D6043n74p842M344o528O909J8176K0366m093j3211j7866K926K987j2810
15187C8827j0817j0319J3345j2477r983L492R429J1086L193P40m783q435q144
15174A5154k1290k807J1036Q086R497J0619M224j6820n848K0l213m050L090p728
15160c0K722J4577L554M488n895R727M520k8689L213J7253R596p948r433m755
$$ plain form
15146 12900 17665 30539 37267 36948 33228 38057 41350 32215 25877 37844 32034 29578 17961 13353
15132 13353 21250 34384 45351 51174 31063 2556 -1087 12869 39998 45509 40792 31469 16185
15119 16185 14820 10310 19895 26392 14528 3044 11683 22650 25323 23164 27391 18274 5836
15106 5836 11677 17414 33785 42576 42329 33051 34476 40223 40026 27101 11308 25573 20640 14327
15092 14327 18076 6702 6247 9928 23564 34921 38836 36827 43934 38172 46731 53213 47804 55978
15078 55978 58651 43627 29517 18978 22857 28026 31312 24022 11385 700 11337 3468 127
15065 127 6103 22222 14757 -3671 -7927 -3309 -165 10892 28697 43816 47614 35409 21170
15052 21170 12179 25841 20964 2410 7179 -612 -30 11117 28968 24685 5492 2155 596
$$ packed form
15146A2900M765J2874O728l19l720M829L293r135o338J1967n810k456j1617m608
15132A3353P897J3134J0967N823k0111k8507l643J3956K7129N511m717r323j5284
15119A6185j365m510R585O497j1864j1484Q639J0967K673k159M227r117j2438
15106E836N841N737J6371Q791k47r278J425N747j97j2925j5793J4265m933o313
15092A4327L749j1374m55L681J3636J1357L915k009P107n762Q559O482n409Q174
15078E5978K673j5024j4110j0539L879N169L286p290j2637j0685J0637p869l341
15065A27N976J6119p465j8428m256M618L144J1057J7805J5119L798j2205j4239
15052B1170q991J3662m877j8554M769p791N82J1147J7851m283j9193l337j559
$$ plain form
15039 596 15375 24676 43193 40823 28298 18660 16857 18429 17670 4094 -18557 -21849 -6833 -3989
15025 -3989 -7584 7283 12789 12377 17121 26406 21507 18807 -4248 -6104 1516 490 -3109 -2976 7253
15010 7253 24580 20105 22122 31084 22778 4937 -2461 -14802 -14092 8474 12239 10540 6860 5519
14996 5519 870 -5148 -8390 2322 3454 -3517 -22928 -23192 -452 11728 25048 29503 14033
14983 14033 6097 874 18647 28734 19188 14947 16931 1874 -13954 -6266 10979 15800 44353
14970 44353 40992 38218 33653 24722 25891 27217 17696 6104 7775 813 -9864 -9095 -6244 4275
14956 4275 6394 9240 22323 26231 7326 3935 13939 -404 -16678 -23252 -15714 -7976 -17608
14943 -17608 -2044 3448 -4795 -10938 -8798 -6916 6764 12862 -7312 13265 21146 30510 36001
$$ packed form
15039E96J4779R301J8517k370j2525r638j803J572p59j3576k2651l292J5016K844
15025c989l595J4867N506m12M744R285m899k700k3055j856P620j026l599J33J0229
15010G253J7327m475K017Q962q306j7841p398j2341P10K2566L765j699l680j341
14996E519m649o018l242J0712J132o971j9411k64K2740J2180J3320M455j5470
14983A4033p936n223J7773J0087r546m241J984j5057j5828P688J7245M821K8553
14970D4353l361k774m565q931J169J326r521j1592J671o962j0677P69K851J0519
14956D275K119K846J3083L908j8905l391J0004j4343j6274o574P538P738r632
14943a7608J5564N492q243o143K140J882J3680O098k0174K0577P881R364N491
$$ plain form
14930 36001 32881 44224 47955 38548 29502 14304 632 19091 48019 55010 52225 57700 66808
14917 66808 62822 61356 54423 46147 36224 25578 32133 40020 37581 34723 27747 27667 43060 47967
14903 47967 36393 23515 13089 33052 45181 49750 40868 31306 29861 18857 7656 23204
14891 23204 29039 36141 24935 18571 21957 22888 22933 15409 11271 20577 26764 32322 27793 16451 19881
14876 19881 15215 11734 15030 18734 8925 1130 -15817 6940 4511 3635 7051 20023 30467 26219
14862 26219 24171 26477 14736 27903 24498 23619 30668 47195 41899 27217 22571 25752 18912 17718
14848 17718 20983 24991 10994 -9919 -2297 14880 35821 43905 36678 -1931 -9701 15526 36206
14835 36206 43324 36420 39018 28336 -1376 -5086 11770 19674 29004 35730 21598 17618 18195 11044
$$ packed form
14930C6001l120J1343L731r407r046j5198j3672J8459K8928O991k785N475R108
14917F6808l986j466o933q276r923j0646O555P887k439k858o976q0J5393M907
14903D7967j1574j2878j0426J9963J2129M569q882r562j445j1004j1201J5548
14891B3204N835P102j1206o364L386R31M5p524m138R306O187N558m529j1342L430
14876A9881m666l481L296L704r809p795j6947K2757k429q76L416J2972J0444m248
14862B6219k048K306j1741J3167l405q79P049J6527n296j4682m646L181o840j194
14848A7718L265M008j3997k0913P622J7177K0941Q084p227l8609p770K5227K0680
14835C6206P118o904K598j0682k9712l710J6856P904R330O726j4132l980N77p151
$$ plain form
14821 11044 5825 16404 18560 10356 -821 11225 22385 42064 38999 10540 -10256 -20471
14809 -20471 -18848 -8151 -6028 -8214 3751 4842 -1000 2077 4341 -4193 -7732 -25243 -25379 -23856
14795 -23856 -17443 -315 3918 12964 19618 8004 6202 3699 -8017 -11509 -6085 9992 17596
14782 17596 9626 19471 28528 19227 4364 3431 7299 17148 12076 -1507 -15416 -8456 -12791 -4944
14768 -4944 1702 -6226 -16843 -17232 -5885 -5708 -15306 -10848 -4077 4468 15760 20631 12550 16335
14754 16335 25135 22322 14519 14620 38359 53883 51301 36055 25416 1177 -4821 3202 24976
14741 24976 12878 3531 -1658 94 10880 3367 -7110 -2673 26142 33222 11577 19708 33970
14728 33970 16625 -1391 5481 129 1974 7461 24489 45215 38113 18608 1900 -4001 3050
$$ packed form
14821A1044n219J0579K156q204j1177J2046J1160J9679l065k8459k0796j0215
14809b0471J623J0697K123k186J1965J091n842L077K264q534l539j7511j36J523
14795b3856O413J7128M233R046O654j1614j802k503j1716l492N424J6077P604
14782A7596p970R845R057r301j4863r33L868R849n072j3583j3909O960m335P847
14768d944O646p928j0617l89J1347J77r598M458O771Q545J1292M871q081L785
14754A6335Q800k813p803J01K3739J5524k582j5246j0639k4239n998Q023K1774
14741B4976j2098r347n189J752J0786p513j0477M437K8815P080k1645Q131J4262
14728C3970j7345j8016O872n352J845N487J7028K0726p102j9505j6708n901P051
$$ plain form
14715 3050 -3186 7040 14596 19036 12636 12533 31158 43132 36963 36564 44578 43338 26234 14263
14701 14263 26004 24278 8361 -747 -2130 -501 22287 18436 5 12292 18567 21355 35412
14688 35412 55767 61928 41224 10942 15380 9944 5288 3167 6265 -1913 -1495 7031 39471 44217
14674 44217 26150 32431 26704 33390 48106 62511 64571 39113 39720 55762 62602 78042 89227
14661 89227 89242 82514 64304 61092 58538 56118 60613 75926 73143 61909 55983 56326 69316 90691
14647 90691 114115 121494 131096 138380 163720 190691 190986 190795 196984 201752 202568 219090 243128 263485
14633 263485 284987 311416 349534 373211 409323 459534 502203 538502 584250 627670 671602
14622 671602 698271 733455 744717 725765 698486 649721 609780 567551 521793 471122 406952
$$ packed form
14715C050o236J0226P556M440o400j03J8625J1974o169l99Q014j240j7104j1971
14701A4263J1741j726j5917r108j383J629K2788l851j8431J2287O275K788J4057
14688C5412K0355O161k0704l0282M438n436m656k121L098q178M18Q526L2440M746
14674D4217j8067O281n727O686J4716J4405K060k5458O07J6042O840J5440J1185
14661H9227J5o728j8210l212k554k420M495J5313k783j1234n926L43J2990K1375
14647I0691K3424P379R602P284K5340K6971K95j91O189M768Q16J6522K4038K0357
14633B63485K1502K6429L8118K3677L6112N0211M2669L6299M5748M3420M3932
14622F71602K6669L5184J1262j8952k7279m8765l9941m2229m5758n0671o4170
$$ plain form
14611 406952 373805 341786 309536 274904 255688 225126 183923 150299 131338 131493 125085 133868
14599 133868 121347 124745 108827 101219 80711 78142 71187 56817 62069 81095 83074 93089 98553
14586 98553 93141 95434 92233 76432 71748 66421 66879 65840 63713 59521 75971 72756 61758 51262
14572 51262 54144 47256 46191 46087 55332 66827 48808 20913 18419 19992 21417 30024 40564 41109
14558 41109 25012 16516 24820 29392 34769 30417 39030 58193 68282 59838 50010 49167 52975 26665
14544 26665 13962 18133 13575 23209 38529 53386 49964 36098 16983 8707 11899 15854 30186
14531 30186 18685 10553 17621 21401 14265 14667 11350 27530 42517 40636 27214 24639 13760
14518 13760 18377 28366 19680 19051 14895 8659 13592 24982 47027 49642 33194 27743 25784 28183
$$ packed form
14611D06952l3147l2019l2250l4632j9216l0562m1203l3624j8961J55o408Q783
14599A33868j2521L398j5918p608k0508k569o955j4370N252J9026J979J0015N464
14586I8553n412K293l201j5801m684n327M58j039k127m192J6450l215j0998j0496
14572E1262K882o888j065j04R245J1495j8019k7895k494J573J425Q607J0540N45
14558D1109j6097q496Q304M572N377m352Q613J9163J0089q444r828q43L808k6310
14544B6665j2703M171m558R634J5320J4857l422j3866j9115q276L192L955J4332
14531C0186j1501q132P068L780p136M02l317J6180J4987j881j3422k575j0879
14518A3760M617R989q686o29m156o236M933J1390K2045K615j6448n451j959K399
$$ plain form
14504 28183 23712 34141 25964 10684 12001 32179 56803 68443 51863 21009 6249 7439
14492 7439 21920 44130 53118 57421 57499 45483 36656 34579 39577 28819 30664 29831 34631 28645
14478 28645 49756 75894 80011 62848 55128 63842 71763 60370 44767 54038 54759 26562 23656
14465 23656 39051 49099 63744 69645 61111 75206 69449 57242 67860 76726 64779 53949
14453 53949 61945 61336 62059 72764 64092 75625 76130 74549 99769 92555 88860 92547 90897 90433 96428
14438 96428 98032 109491 115431 106462 113957 114554 122469 123160 140999 158303 135259 116353 106804 108912
14424 108912 114113 121586 114002 116272 137712 149560 133113 129328 130670 133747 127964 130469 118873
14411 118873 116057 102476 91329 99225 102771 92717 77071 62940 64542 100303 126979 127506 120099
$$ packed form
14504B8183m471J0429q177j5280J317K0178K4624J1640j6580l0854j4760J190
14492G439J4481K2210Q988M303P8j2016q827k077M998j0758J845q33M800n986
14478B8645K1111K6138M117j7163p720Q714P921j1393j5603R271P21k8197k906
14465B3656J5395J0048J4645N901q534J4095n757j2207J0618Q866j1947j0830
14453E3949P996o09P23J0705q672J1533N05j581K5220p214l695L687j650m64N995
14438I6428J604J1459N940q969P495N97P915O91J7839J7304k3044j8906r549K108
14424A08912N201P473p584K270K1440J1848j6447l785J342L077n783K505j1596
14411A18873k816j3581j1147P896L546j0054j5646j4131J602L5761K6676N27p407
$$ plain form
14398 120099 106591 109040 123948 130632 134176 135673 131414 128026 138104 129081 124083 137226 150329
14385 150329 159492 160146 157800 159492 166328 148028 137238 151087 148194 151586 166408 182036 189389
14372 189389 195950 189885 202153 189615 173742 166607 167431 161796 152885 153384 151407 156609 174090 180157
14358 180157 181272 172198 163713 161264 170046 176084 175146 176943 162409 142124 143756 148472 159523 168182
14344 168182 164168 170052 186784 203593 195310 184247 183205 181841 205715 216571 217104 216318 210853
14331 210853 203782 222942 221530 219014 190595 190097 195117 204285 197423 211634 213772 215880 231911
14318 231911 209225 192549 185532 203254 221695 239015 235849 239237 252273 273642 279763 282599
14306 282599 280512 274869 274842 285005 299955 301572 319236 341523 352989 348787 362396 384148 391394
$$ packed form
14398A20099j3508K449J4908O684L544J497m259l388J0078r023m998J3143J3103
14385A50329R163O54k346J692O836j8300j0790J3849k893L392J4822J5628P353
14372A89389O561o065J2268j2538j5873p135Q24n635q911M99j977N202J7481O067
14358A80157J115r074q485k449Q782O038r38J797j4534k0285J632M716J1051Q659
14344A68182m014N884J6732J6809q283j1063j042j364K3874J0856N33p86n465
14331B10853p071J9160j412k516k8419m98N020R168o862J4211K138K108J6031
14318B31911k2686j6676p017J7722J8441J7320l166L388J3036K1369O121K836
14306B82599k087n643k7J0163J4950J617J7664K2287J1466m202J3609K1752P246
$$ plain form
14293 391394 398112 413953 416440 436396 470802 474001 465737 476757 491877 505671 516054 520993
14281 520993 524807 513948 515102 537028 565493 583458 596316 605737 621716 645983 662031 655705
14269 655705 657336 673433 677846 686766 707190 745735 773479 784247 805765 818255 834847 853693
14257 853693 871476 901654 936304 963999 997152 1020830 1053642 1099801 1137824 1171406 1218485
14246 1218485 1273463 1302477 1336667 1395204 1451804 1507892 1565504 1629561 1689109 1742420 1819136
14235 1819136 1897721 1969607 2061187 2167819 2276820 2398503 2517830 2639828 2776439 2923533
14225 2923533 3071053 3255688 3445905 3627675 3822738 4033117 4265611 4513911 4777309
14216 4777309 5051676 5359648 5710178 6059857 6437688 6871894 7342933 7841770 8387953
$$ packed form
14293C91394O718J5841K487J9956L4406L199q264J1020J5120J3794J0383M939
14281E20993L814j0859J154K1926K8465J7965J2858R421J5979K4267J6048o326
14269F55705J631J6097M413Q920K0424L8545K7744J0768K1518J2490J6592J8846
14257H53693J7783L0178L4650K7695L3153K3678L2812M6159L8023L3582M7079
14246A218485N4978K9014L4190N8537N6600N6088N7612O4057N9548N3311P6716
14235A819136P8585P1886R1580J06632J09001J21683J19327J21998J36611J47094
14225B923533J47520J84635J90217J81770J95063K10379K32494K48300K63398
14216D777309K74367L07972L50530L49679L77831M34206M71039M98837N46183
$$ plain form
14207 8387953 8989499 9644204 10368888 11163557 12032209 13021302 14101384 15282589 16599095
14198 16599095 18048989 19647253 21388857 23324905 25466457 27819625 30424806 33297850
14190 33297850 36476536 39985802 43862593 48137300 52856320 58106341 63931454 70381570
14182 70381570 77491714 85210255 93489312 102147887 110945379 119440580 127148878 133539342
14174 133539342 138078249 140328817 140042403 137173070 131903770 124615007 115817155 106084685
14166 106084685 95983174 86056426 76696203 68122770 60431526 53654655 47704826 42493508
14158 42493508 37975755 34014616 30545131 27484282 24812325 22446415 20379787 18536824
14150 18536824 16902257 15467549 14191984 13032433 11998822 11069068 10254159 9506447
$$ packed form
14207H387953O01546O54705P24684P94669Q68652R89093J080082J181205J316506
14198A6599095J449894J598264J741604J936048K141552K353168K605181K873044
14190C3297850L178686L509266L876791M274707M719020N250021N825113O450116
14182G0381570P110144P718541Q279057Q658575Q797492Q495201P708298O390464
14174A33539342M538907K250568k86414k869333n269300p288763q797852r732470
14166A06084685j0101511r926748r360223q573433p691244o776871n949829n211318
14158D2493508m517753l961139l469485l060849k671957k365910k066628j842963
14150A8536824j634567j434708j275565j159551j033611r29754q14909p47712
$$ plain form
14142 9506447 8820263 8220349 7684173 7171983 6724452 6318015 5932386 5611320 5307246
14133 5307246 5050345 4836090 4651127 4484793 4356133 4246783 4153489 4080276 4033247 3999902
14123 3999902 3957213 3900581 3836778 3796007 3732910 3628681 3513948 3399289 3266219 3113949
14113 3113949 2951579 2770204 2573203 2383344 2198916 2038957 1905847 1762853 1635810
14104 1635810 1529159 1451992 1367836 1294566 1224781 1154759 1102455 1064138 1029051 992106 953823
14093 953823 895769 850136 834040 807879 789695 761808 730482 704235 665440 636016 640842 648142
14081 648142 642363 618389 609894 603383 577037 564538 521460 512663 510852 505113 486058 456203 449448
14068 449448 430676 419467 412009 410690 397005 383225 381584 354939 334333 316478 307640 310812
$$ packed form
14142I506447o86184n99914n36176n12190m47531m06437l85629l21066l04074
14133E307246k56901k14255j84963j66334j28660j09350r3294p3213m7029l3345
14123C999902m2689n6632o3803m0771o3097j04229j14733j14659j33070j52270
14113C113949j62370j81375j97001j89859j84428j59959j33110j42994j27043
14104A635810j06651p7167q4156p3270o9785p0022n2304l8317l5087l6945l8283
14093I53823n8054m5633j6096k6161j8184k7887l1326k6247l8795k9424M826P300
14081F48142n779k3974q495o511k6346j2499m3078q797j811n739j9055k9855o755
14068D49448j8772j1209p458j319j3685j3780j641k6645k0606j7855q838L172
$$ plain form
14056 310812 318717 302677 298833 307318 312059 307352 314306 316394 322724 332309 327131 308007 293060
14043 293060 293989 308573 294580 273718 289213 301664 295940 299490 296231 299555 292559 290528 283254
14030 283254 278310 298583 289666 279754 283427 275583 281784 288507 286286 271464 254036 227047 221713
14017 221713 231893 241515 243496 225294 206234 191301 185156 188524 183101 176646 190234 199149 208125
14004 208125 204458 195624 195637 212647 215654 211325 185323 179408 173292 156290 154933 156098 148351 134600
13990 134600 133831 121327 108155 87018 83018 91691 97841 99755 94348 77110 83771 92234 97684
13977 97684 109079 97225 75224 75943 82575 100146 97517 95028 91028 77789 92312 107473 140567
13964 140567 148541 122412 110814 132884 150712 157236 158946 175501 202908 212704 226571 235321
$$ packed form
14056C10812P905j6040l844Q485M741m707O954K088O330R585n178j9124j4947
14043B93060R29J4584j3993k0862J5495J2451n724L550l259L324o996k031p274
14030B83254m944K0273q917r912L673p844O201O723k221j4822j7428k6989n334
14017B21713J0180R622J981j8202j9060j4933o145L368n423o455J3588Q915Q976
14004B08125l667q834J3J7010L007m329k6002n915o116j7002j357J165p747j3751
13990A34600p69j2504j3172k1137m000Q673O150J914n407j7238O661Q463N450
13977I7684J1395j1854k2001P19O632J7571k629k489m000j3239J4523J5161L3094
13964A40567P974k6129j1598K2070J7828O524J710J6555K7407R796J3867Q750
$$ plain form
13952 235321 271567 313990 358694 370170 348383 352762 343192 340279 338172 321930 341846 382537
13940 382537 412815 435835 461434 485911 520338 573708 640847 698759 763680 833454 884588
13929 884588 930789 963657 992518 989800 995048 978127 943330 914472 867032 824052 791279 749331
13917 749331 686483 631171 569642 482723 419064 373456 325435 291190 282201 265065 220137 189097
13905 189097 164027 143163 131729 119254 107151 105222 120964 106249 88566 89974 92394 94178
13893 94178 81437 90381 100787 104119 96289 77337 85907 70054 64829 52685 55796 66834 79053
13880 79053 80704 82646 61810 44992 67030 86323 86973 77324 54155 50788 39243 35071 46477
13867 46477 50089 43839 20131 19947 32071 48556 44804 37614 20577 25319 34261 48326 49594
$$ packed form
13952B35321L6246M2423M4704J1476k1787M379r570k913k107j6242J9916M0691
13940C82537L0278K3020K5599K4477L4427N3370O7139N7912O4921O9774N1134
13929H84588M6201L2868K8861k718N248j6921l4797k8858m7440m2980l2773m1948
13917G49331o2848n5312o1529q6919o3659m5608m8021l4245q989j7136m4928l1040
13905A89097k5070k0864j1434j2475j2103j929J5742j4715j7683J408K420J784
13893I4178j2741Q944J0406L332p830j8952Q570j5853n225j2144L111J1038J2219
13880G9053J651J942k0836j6818K2038J9293O50r649k3169l367j1545m172J1406
13867D6477L612o250k3708j84J2124J6485l752p190j7037M742Q942J4065J268
$$ plain form
13854 49594 24424 18003 32024 38336 51007 46229 42598 70506 75836 63480 52818 38766 44400
13841 44400 36870 38755 48421 60850 71092 54002 38217 33643 37221 53128 52584 34967 24838
13828 24838 31906 44849 38110 44634 56965 60670 58492 45729 45364 48847 33044 31750 37277 35876
13814 35876 37500 45615 61986 58102 49116 34927 29050 36930 40207 42593 69741 91739 106235
13801 106235 120706 118883 120292 113006 84339 68470 70263 67826 55544 63084 59022 51168 38855
13788 38855 23177 25784 26079 42874 29692 13198 14513 20541 32269 37172 47537 43713 30528
13775 30528 27752 39363 47418 59481 64618 59227 46338 39155 39773 28260 19619 37557 51556
13762 51556 48787 34452 21202 21125 5809 5415 19191 36427 54096 71186 84671 88226 71847
$$ packed form
13854D9594k5170o421J4021O312J2671m778l631K7908N330j2356j0662j4052N634
13841D4400p530J885R666J2429J0242j7090j5785m574L578J5907n44j7617j0129
13828B4838P068J2943o739O524J2331L705k178j2763l65L483j5803j294N527j401
13814C5876J624Q115J6371l884q986j4189n877P880L277K386K7148K1998J4496
13801A06235J4471j823J409p286k8667j5869J793k437j2282P540m062p854j2313
13788C8855j5678K607K95J6795j3182j6494J315O028J1728M903J0365l824j3185
13775C0528k776J1611Q055J2063N137n391j2889p183O18j1513q641J7938J3999
13762E1556k769j4335j3250p7j5316l94J3776J7236J7669J7090J3485L555j6379
$$ plain form
13749 71847 60734 65552 68882 77868 94152 93206 111709 121931 128324 123539 143084 161636 170281
13736 170281 187881 207269 217685 232264 261555 301650 333424 363076 408848 439530 471815
13725 471815 518573 579630 630003 667706 710481 729078 738846 726657 708295 685281 645638 611186
13713 611186 565621 516619 470726 415175 369462 323800 305710 292996 256358 206233 157075
13702 157075 139442 142369 145386 130629 128515 102504 72096 60962 40103 52546 63654 55428
13690 55428 53796 62365 58772 49478 38665 46881 43876 39372 36543 27001 29454 19534 17012 20094
13676 20094 21264 15960 18373 26415 12424 -5617 -17895 -31912 -26848 -16027 -24052 -8492 1528
13663 1528 -2598 -11204 -411 7854 10275 -2126 -18294 -20030 -11151 3572 3003 11815 22361 9459
$$ packed form
13749G1847j1113M818L330Q986J6284r46J8503J0222O393m785J9545J8552Q645
13736A70281J7600J9388J0416J4579K9291M0095L1774K9652M5772L0682L2285
13725D71815M6758O1057N0373L7703M2775J8597R768j2189j8362k3014l9643l4452
13713F11186m5565m9002m5893n5551m5713m5662j8090j2714l6638n0125m9158
13702A57075j7633K927L017j4757k114k6011l0408j1134k0859J2443J1108q226
13690E5428j632Q569l593r294j0813Q216l005m504k829r542K453r920k522L082
13676B0094J170n304K413Q042j3991j8041j2278j4017N064J0821q025J5560J0020
13663A528m126q606J0793Q265K421j2401j6168j736Q879J4723n69Q812J0546j2902
$$ plain form
13649 9459 1913 10180 15271 18009 14067 15792 7053 20113 9085 2425 8162 182 1687 35559
13635 35559 31124 1779 -6235 -3467 2139 12453 -3558 -5825 -5529 -26310 -35820 -34630 -21620
13622 -21620 -15827 -8084 -9496 -19706 -29615 -35320 -22172 -10704 -14626 -21136 -25163 -32305 -27628 6186
13608 6186 4099 -20595 -29781 -34360 -40373 -34915 -31001 -36495 -16812 -10611 -14278 -9402 -16224 -20931
13594 -20931 -13363 -7820 -12678 -10552 -9846 -12857 -26740 -27090 -11830 -18446 -30458 -29216 -2646 22837
13580 22837 32610 -6505 -13771 -13633 -13425 -12319 -11602 -25944 -23469 -37574 -22125 -36284 -34334 -23288
13566 -23288 -18150 -15554 -6843 -2551 8048 13850 -4239 -32042 -31982 -10611 3971 4189 -4205 -18705
13552 -18705 -26418 -33909 -34171 -32871 -35261 -20980 -14344 -12596 -11256 9270 2225 -30697 -39154 -29037
$$ packed form
13649I459p546Q267N091K738l942J725q739J3060j1028o660N737p980J505L3872
13635C5559m435k9345q014K768N606J0314j6011k267K96k0781r510J190J3010
13622b1620N793P743j412j0210r909n705J3148J1468l922o510m027p142M677L3814
13608F186k087k4694r186m579o013N458L914n494J9683O201l667M876o822m707
13594b0931P568N543m858K126P06l011j3883l50J5260o616j2012J242K6570K5483
13580B2837R773l9115p266J38K08J106P17j4342K475j4105J5449j4159J950J1046
13566b3288N138K596Q711M292J0599N802j8089k7803O0K1371J4582K18q394j4500
13552a8705p713p491k62J300k390J4281O636J748J340K0526p045l2922q457J0117
$$ plain form
13538 -29037 -21662 -5414 -16734 -14464 -22510 -28212 -31711 -30457 -24996 -25107 -27696 -26629 -17519 -10980
13524 -10980 -9658 -18159 -23549 -29317 -45482 -47314 -37117 -25552 -10966 -6797 -15170 -19542 -23398
13511 -23398 -23349 -15411 -33153 -52686 -43046 -37979 -27848 -51029 -35986 -38028 -34831 -33025 -16684
13498 -16684 -15458 -23205 -16690 -17180 -30028 -33006 -39155 -46904 -41110 -36193 -38855 -28692 -34997 -32159
13484 -32159 -19853 -3814 -21996 -24351 -25637 -32273 -39013 -20417 14947 18348 5678 -9529 -18762
13471 -18762 -29528 -36308 -38712 -35054 -38288 -29837 -43049 -52611 -38415 -37181 -32153 -119 -3170
13458 -3170 -8281 -16023 -19316 -26511 -29022 -26767 -28527 -39876 -45388 -31646 -12746 -3623 -10452 -9238
13444 -9238 -22807 -29217 -25583 -26369 -22830 -11450 -4572 -12071 -22757 -35135 -31253 -16703 12061
$$ packed form
13538b9037P375J6248j1320K270q046n702l499J254N461j11k589J067R110O539
13524a0980J322q501n390n768j6165j832J0197J1565J4586M169q373m372l856
13511b3398M9P938j7742j9533R640N067J0131k3181J5043k042L197J806J6341
13498a6684J226p747O515m90j2848k978o149p749N794M917k662J0163o305K838
13484c2159J2306J6039j8182k355j286o636o740J8596L5364L401j2670j5207r233
13471a8762j0766o780k404L658l234Q451j3212r562J4196J234N028L2034l051
13458c170n111p742l293p195k511K255j760j1349n512J3742J8900R123o829J214
13444i238j3569o410L634p86L539J1380O878p499j0686j2378L882J4550K8764
$$ plain form
13431 12061 10160 -5616 -5835 -4911 -18240 -30330 -40067 -39751 -29418 -28542 -40744 -35846 -38548 -50439
13417 -50439 -47903 -34552 -44679 -45216 -34725 -33204 -23441 -8101 -27424 -25255 -15501 -15519 -23691 -26390
13403 -26390 -21735 -18727 -10533 -6289 115 -5110 -12584 -28244 -36631 -10686 -7400 -7344 -22402 -35400
13389 -35400 -41564 -15095 -20761 -27031 -19654 -17158 -40678 -52477 -40134 -21795 -14840 -18785 -25198
13376 -25198 -21042 -19889 -15272 -8445 -925 7493 -1886 -4748 -5706 -118 -3638 -141 3433 -27200
13362 -27200 -38158 -35447 -26573 -16668 -687 -172 325 -12367 -24747 -39752 -47109 -57159 -45330
13349 -45330 -30930 -32249 -29797 -1913 -2016 -19073 -5674 -9316 -6170 4660 -3479 493 -1291
13336 -1291 -2556 5421 5748 -4005 -6104 -9889 -7946 -3343 -10520 -4883 -518 1972 5709 -1768 -5702
$$ packed form
13431A2061j901j5776k19R24j3329j2090r737L16J0333Q76j2202M898k702j1891
13417e0439K536J3351j0127n37J0491J521R763J5340j9323K169R754j8q172k699
13403b6390M655L008Q194M244O404n225p474j5660q387K5945L286N6j5058j2998
13389c5400o164K6469n666o270P377K496k3520j1799J2343J8339O955l945o413
13376b5198M156J153M617O827P520Q418r379k862r58N588l520L497L574l0633
13362b7200j0958K711Q874R905J5981N15M97j2692j2380j5005p357j0050J1829
13349d5330J4400j319K452K7884j03j7057J3399l642L146J0830q139L972j784
13336a291j265P977L27r753k099l785J943M603p177N637M365K490L737p477l934
$$ plain form
13321 -5702 13412 21048 -5765 -17152 -26343 -35311 -36991 -33355 -1744 3395 -12719 -17670 -15213
13308 -15213 -24881 -28640 -28395 -18313 -9619 -16025 -23016 -30822 -43198 -44511 -38885 -26339 -15702 -14981
13294 -14981 -33536 -46079 -35188 -14046 -15639 -14404 -11805 -5035 -13288 -10260 -20383 -10106 -21890
13281 -21890 -28710 -23733 -24929 -20093 -26300 -41036 -53458 -39920 -20767 -23253 -27998 -19025 -32215
13268 -32215 -42273 -25577 -23736 -13964 -8350 813 13019 9432 -596 -3586 11175 4327 -6682
13255 -6682 -686 1789 -9178 -29698 -42490 -38197 -10851 -6231 -10764 -12176 -17701 -17622 -17769 -20749
13241 -20749 -11226 -5858 -7707 -10974 -7317 -17642 -35195 -20630 -4839 -1361 1240 -7088 -12609
13228 -12609 -16753 -26903 -50535 -26853 -5751 -15449 -21161 -16529 -18863 -15232 4476 5414 -5806
$$ packed form
13321e702J9114P636k6813j1387r191q968j680L636L1611N139j6114m951K457
13308a5213r668l759K45J0082Q694o406o991p806j2376j313N626J2546J0637P21
13294a4981j8555j2543J0891K1142j593J235K599O770q253L028j0123J0277j1784
13281b1890o820M977j196M836o207j4736j2422J3538J9153k486m745Q973j3190
13268c2215j0058J6696J841R772N614R163J2206l587j0028k990J4761o848j1009
13255f682N996K475j0967k0520j2792M293K7346M620m533j412n525P9j47k980
13241b0749R523N368j849l267L657j0325j7553J4565J5791L478K601q328n521
13228a2609m144j0150k3632K3682K1102r698n712M632k334L631J9708R38j1220
$$ plain form
13215 -5806 -7380 -12253 -25134 -28086 -14529 -20541 -26758 -25798 -7183 1042 -459 -6448 -20409 -27831
13201 -27831 -30689 -32864 -30059 -25993 -26607 -24282 -27031 -21601 -19819 -21764 -18870 -3079 15909 -835
13187 -835 -14600 -13453 -19348 -38772 -43326 -14258 -4279 -7461 -6827 1949 4503 -4560 -7993 -35905
13173 -35905 -46095 -29819 -9222 -11165 -20855 -9623 -8542 -14119 -3697 -1624 -9348 -25352 -21536
13160 -21536 -16845 -25664 -32245 -26927 -23032 -20980 -2834 11285 -2599 -10455 -26674 -29854 -32985
13147 -32985 -29825 -27933 -20994 -27835 -20373 -24618 -35741 -37301 -38592 -43363 -44155 -26643 -18013 -30960
13133 -30960 -20612 -32095 -42060 -35368 -19987 -7377 -18526 -24955 -26348 -20686 -16992 -31752 -36923
13120 -36923 -29536 -48700 -49702 -30230 -31635 -37154 -31628 -26397 -23185 -32255 -25651 -26331 -38218 -20258
$$ packed form
13215e806j574m873j2881k952J3557o012o217R60J8615Q225j501n989j3961p422
13201b7831k858k175K805M066o14K325k749N430J782j945K894J5791J8988j6744
13187h35j3765J147n895j9424m554K9068R979l182O34Q776K554r063l433k7912
13173c5905j0190J6276K0597j943r690J1232J081n577J0422K073p724j6004L816
13160b1536M691q819o581N318L895K052J8146J4119j3884p856j6219l180l131
13147c2985L160J892O939o841P462m245j1123j560j291m771p92J7512Q630j2947
13133c0960J0348j1483r965O692J5381J2610j1149o429j393N662L694j4760n171
13120c6923P387j9164j002J9472j405n519N526N231L212r070O604o80j1887J7960
$$ plain form
13106 -20258 -2432 -4784 -6025 -8499 -10973 -6048 2793 -4118 -2854 -1700 -11287 -27079 -35140 -29593
13092 -29593 -27300 -15097 6026 20347 6892 -4390 -22943 -28503 -26081 -21982 -19515 -28200 -28248
13079 -28248 -22922 -16405 -23701 -17520 -24246 -25028 -31709 -37898 -27657 -31455 -16513 -4523 104 16499
13065 16499 4833 296 -1346 -10230 -18666 -15597 -13142 -24469 -17982 -8016 -15175 -25055 -31503 -24828
13051 -24828 -24118 -14031 -14973 -37735 -53623 -23839 -11855 -461 -480 1431 -4079 -3408 9128 24947
13037 24947 8791 3281 -240 -14264 -26945 -17809 -13344 -3529 -14963 -19279 -12966 -9880 -13931
13024 -13931 -26825 -35110 -17660 94 -1715 5231 -13854 -13585 -8334 -10267 -20193 -22226 -25629 -22138
13010 -22138 -36610 -22851 -7920 -22843 -25344 -22581 -40833 -38145 -28418 -14998 -2517 -8645 -26043
$$ packed form
13106b0258J7826k352j241k474k474M925Q841o911J264J154r587j5792q061N547
13092b9593K293J2203K1123J4321j3455j1282j8553n560K422M099K467q685m8
13079b8248N326O517p296O181o726p82o681o189J0241l798J4942J1990M627J6395
13065A6499j1666m537j642q884q436L069K455j1327O487R966p159r880o448O675
13051b4828P10J0087r42k2762j5888K9784J1984J1394j9J911n510O71J2536J5819
13037B4947j6156n510l521j4024j2681R136M465R815j1434m316O313L086m051
13024a3931j2894q285J7450J7754j809O946j9085K69N251j933r926k033l403L491
13010b2138j4472J3759J4931j4923k501K763j8252K688R727J3420J2481o128j7398
$$ plain form
12997 -26043 -41371 -44772 -44442 -32786 -29637 -26701 -30156 -37260 -33646 -23889 -10255 -10149 -14979 -20727
12983 -20727 -24813 -26270 -21020 -21621 -22151 -19195 -32473 -47788 -51415 -34750 -17184 -4558 -57 9165
12969 9165 11031 623 6028 86 1410 -6123 -8554 10559 15739 844 -1538 -14833 -8782 -9509
12955 -9509 -16210 -22006 -22851 -20230 -16327 -15868 -25027 -31131 -18069 -28898 -36764 -36938 -13787 15718
12941 15718 16651 12251 17191 19383 -2277 -3790 481 -9677 -6261 3634 -5140 5469 14420 16214
12927 16214 36904 26593 22649 19065 21356 16180 7669 -6309 -12225 -4423 18221 43816 39258
12914 39258 15550 297 -8111 -13367 -20942 -21239 -14391 -10462 -29928 -37560 -36743 -22709 -18566 -16908
12900 -16908 -20871 -24489 -16485 -3999 11488 10723 -4736 -11293 -21064 -18630 -15061 -9560 -11378 -15280
$$ packed form
12997b6043j5328l401L30J1656L149K936l455p104L614R757J3634J06m830n748
12983b0727m086j457N250o01n30K956j3278j5315l627J6665J7566J2626M501R222
12969I165J866j0408N405n942J324p533k431J9113N180j4895k382j3295O051p27
12955i509o701n796q45K621L903M59r159o104J3062j0829p866j74K3151K9505
12941A5718R33m400M940K192k1660j513M271j0158L416R895q774J0609Q951J794
12927A6214K0690j0311l944l584K291n176q511j3978n916P802K2644K5595m558
12914C9258k3708j5253q408n256p575k97O848L929j9466p632Q17J4034M143J658
12900a6908l963l618Q004J2486J5487p65j5459o557r771K434L569N501j818l902
$$ plain form
12886 -15280 -9480 -11054 -16085 -15203 -24826 -32514 -15787 -5204 -17153 -22854 -29090 -18641 -35125
12873 -35125 -35986 -25215 -12161 1449 -261 -9453 -16 -16227 -25236 -34456 -38123 -26647 -10111
12860 -10111 -10861 -18961 -19646 -23355 -15959 -19763 -28156 -25850 -23105 -20135 -14993 -3179 17221 26002
12846 26002 -1220 -5104 1278 -3207 -6989 -645 8919 3636 10365 20612 27415 2612 -4879 -7919
12832 -7919 -6569 -15023 -42073 -40506 -25230 -23485 -24203 -23778 -21289 -11857 -14240 -17152 -23618 -40484
12818 -40484 -32963 -15070 -6765 16 12043 2658 -8489 141 -7897 -2397 13042 22641 13318
12805 13318 -6966 -17719 -30594 -38293 -33685 -26051 -12787 -9384 -7076 -439 44 561 -7905 -3854
12791 -3854 1237 3659 10173 -7727 -10692 -2176 8869 2045 2193 24771 19557 3242 -3738 -7542
$$ packed form
12886a5280N800j574n031Q82r623p688J6727J0583j1949n701o236J0449j6484
12873c5125q61J0771J3054J3610j710r192R437j6211r009r220l667J1476J6536
12860a0111p50q100o85l709P396l804q393K306K745K970N142J1814K0400Q781
12846B6002k7222l884O382m485l782O344R564n283O729J0247O803k4803p491l040
12832g919J350q454k7050J567J5276J745p18M25K489R432k383k912o466j6866
12818d0484P521J7893Q305O781J2027r385j1147Q630q038N500J5439R599r323
12805A3318k0284j0753j2875p699M608P634J3264L403K308O637M83N17q466M051
12791c854N091K422O514j7900k965Q516J1045o824J48K2578n214j6315o980l804
$$ plain form
12777 -7542 -21022 -22935 -13950 -15474 -25033 -27189 -25412 -20651 -22268 -17311 -8714 -11309 -20166 -11676
12763 -11676 -16718 -25551 -28940 -29395 -30866 -37167 -34252 -18006 -5737 3801 5891 16132 19901 13829
12749 13829 10681 6092 911 5885 8021 3166 1039 5383 288 5258 -474 6725 11907 6925
12735 6925 4268 22883 27081 14772 1812 -13999 -9812 802 1833 4941 12864 -5062 -18946
12722 -18946 -15248 -11444 -3324 -8729 -21337 -38384 -34531 -38391 -23477 -23112 -15026 -5697 -352 2531
12708 2531 -13428 -36060 -33950 -24820 -23825 -7900 -3577 -2195 -1763 -9188 -15415 -19273 -15122 -24057
12694 -24057 -49627 -59132 -40780 -34651 -25097 -17280 -5418 871 -6316 -374 -6241 -20433 -15087
12681 -15087 -1289 2597 5283 -7053 -11086 -21268 -37688 -20474 -31444 -23226 -20270 -9671 -10621
$$ packed form
12777g542j3480j913Q985j524r559k156J777M761j617M957Q597k595q857Q490
12763a1676n042q833l389m55j471o301K915J6246J2269R538K090J0241L769o072
12749A3829l148m589n181M974K136m855k127M344n095M970n732P199N182m982
12735F925k657J8615M198j2309j2960j5811M187J0614J031L108P923j7926j3884
12722a8946L698L804Q120n405j2608j7047L853l860J4914L65Q086R329N345K883
12708B531j5959k2632K110R130R95J5925M323J382M32p425o227l858M151q935
12694b4057k5570r505J8352O129R554P817J1862O289p187N942n867j4192N346
12681a5087J3798L886K686j2336m033j0182j6420J7214j0970Q218K956J0599r50
$$ plain form
12668 -10621 3912 -14820 -16591 -19419 -8589 -21923 -23602 -31023 -32193 -7718 15279 15259 -1224
12655 -1224 -11436 -1938 -17604 -34570 -36479 -30992 -22118 -34914 -30646 -34012 -39120 -12833 -1886
12642 -1886 -7505 -7803 7387 13204 11874 10926 30043 29617 435 -5851 -1610 -1966 5797 10817 24641
12627 24641 34964 31511 26441 19952 15126 20800 31372 34901 28162 7058 24382 33424 17517
12614 17517 19244 21567 30915 27426 33845 43173 35301 52719 80112 90317 92918 108353 127009
12601 127009 133502 134299 150105 172935 187091 185731 163262 121533 96276 105339 101762 86872 71191
12588 71191 49937 40088 23144 22267 31305 27760 28381 15568 1173 -13006 1878 12227 31643
12575 31643 30785 41823 22161 7109 18358 33958 38083 25111 -5968 -11832 -9769 -10645 10411
$$ packed form
12668a0621J4533j8732j771k828J0830j3334j679p421j170K4475K2997k0j6483
12655a224j0212R498j5666j6966j909N487Q874j2796M268l366n108K6287J0947
12642a886n619k98J5190N817j330r48J9117m26k9182o286M241l56P763N020J3824
12627B4641J0323l453n070o489m826N674J0572L529o739k1104J7324R042j5907
12614A7517J727K323R348l489O419R328p872J7418K7393J0205K601J5435J8656
12601A27009O493P97J5806K2830J4156j360k2469m1729k5257R063l577j4890j5681
12588G1191k1254r849j6944q77R038l545O21j2813j4395j4179J4884J0349J9416
12575C1643q58J1038j9662j5052J1249J5600M125j2972l1079n864K063q76K1056
$$ plain form
12562 10411 31016 31359 31257 27802 38843 41683 25266 8061 13205 27705 30518 32613 42021 48993
12548 48993 40145 41653 37940 27227 21963 26484 32634 40053 28152 246 8890 32214 48691
12535 48691 61749 60727 52517 46103 37759 40283 56089 53370 54634 66855 73805 72487 74022 74424
12521 74424 86742 111165 117575 101179 89044 73336 59599 39927 41442 52090 53163 51224
12509 51224 50232 21037 14265 11646 31871 34160 37077 42200 36060 32140 20547 9181 12591 17015
12495 17015 27694 48562 60097 68585 48628 25357 30788 42605 45258 53584 51862 65066 80925
12482 80925 75165 78762 95700 91583 90692 85162 44073 28816 31153 49711 63753 64836 46452
12469 46452 24720 31601 26146 45266 59289 62136 58633 86573 100429 87248 76588 82537 102843
$$ packed form
12562A0411K0605L43j02l455J1041K840j6417j7205N144J4500K813K095R408O972
12548D8993q848J508l713j0713n264M521O150P419j1901k7906Q644K3324J6477
12535D8691J3058j022q210o414q344K524J5806k719J264J2221O950j318J535M02
12521G4424J2318K4423O410j6396j2135j5708j3737j9672J515J0648J073j939
12509E1224r92k9195o772k619K0225K289K917N123o140l920j1593j1366L410M424
12495A7015J0679K0868J1535Q488j9957k3271N431J1817K653Q326j722J3204J5859
12482H0925n760L597J6938m117q91n530m1089j5257K337J8558J4042J083j8384
12469D6452k1732O881n455J9120J4023K847l503K7940J3856j3181j0660N949K0306
$$ plain form
12456 102843 106573 94045 90596 103588 98229 85012 85476 94937 90298 82787 85642 101143 94829
12443 94829 96307 98219 101154 106290 85558 89181 110372 110729 114965 117318 98852 75864 82457 92838
12429 92838 100664 93114 85928 94303 111504 129690 128112 102495 102785 98162 101499 111883 121921
12416 121921 134418 125932 102625 98877 92313 104553 127605 150741 137360 119024 140748 152542
12404 152542 148801 156013 143741 126828 128567 125805 127290 123424 115248 105878 106068 107312 116625 97319
12390 97319 85924 90516 102680 108611 111586 106878 79678 86271 97349 100339 105198 77632 91705
12377 91705 101226 98494 107663 130697 123691 116375 134723 139855 135688 124475 120055 91647 69487
12364 69487 72168 73461 71202 56138 52758 44901 45347 55144 47640 34725 41273 52180 51086 43068
$$ packed form
12456A02843L730j2528l449J2992n359j3217M64R461m639p511K855J5501o314
12443I4829J478J912K935N136k0732L623K1191L57M236K353j8466k2988O593J0381
12429I2838P826p550p186Q375J7201J8186j578k5617K90m623L337J0384J0038
12416A21921J2497q486k3307l748o564J2240K3052K3136j3381j8336K1724J1794
12404A52542l741P212j2272j6913J739k762J485l866q176r370J90J244R313j9306
12390I7319j1395M592J2164N931K975m708k7200O593J1078K990M859k7566J4073
12377I1705R521k732R169K3034p006p316J8348N132m167j1213m420k8408k2160
12364F9487K681J293k259j5064l380p857M46R797p504j2915O548J0907j094q018
$$ plain form
12350 43068 43203 41897 51342 55954 47555 43935 50451 77621 83050 59809 41291 27530 42013
12337 42013 41696 38769 21747 18675 11294 7633 13256 15537 9409 11843 35729 46169 52546 40676
12323 40676 33156 36142 43888 55288 68285 77953 73057 50979 31671 33726 20983 20084 23057
12310 23057 28003 45130 39406 49923 56025 49148 46229 53941 55915 55169 38512 46107 56667 60360
12296 60360 61910 54898 24175 11179 24557 36029 46100 43420 41951 41710 42232 38299 30645 40610
12282 40610 51469 48118 53391 52341 48236 45554 47819 50189 58498 61517 53940 66032 67942 72813
12268 72813 81672 68401 65478 61096 72349 84406 88162 70610 45383 44849 54220 52972 37273
12255 37273 42803 44042 41637 57092 55781 60518 70480 86305 86095 85087 91696 105496 88361 71585
$$ packed form
12350D3068J35j306R445M612q399l620O516K7170N429k3241j8518j3761J4483
12337D2013l17k927j7022l072p381l661N623K281o128K434K3886J0440O377j1870
12323D0676p520K986P746J1400J2997R668m896k2078j9308K055j2743q99K973
12310B3057M946J7127n724J0517O102o877k919P712J974p46j6657P595J0560L693
12296F0360J550p012l0723j2996J3378J1472J0071k680j469k41N22l933p654R965
12282D0610J0859l351N273j050m105k682K265K370Q309L019p577J2092J910M871
12268G2813Q859j3271k923m382J1253J2057L756j7552k5227n34R371j248j5699
12255C7273N530J239k405J5455j311M737R962J5825k10j008O609J3800j7135j6776
$$ plain form
12241 71585 73319 85127 85415 73627 65631 73951 81206 55292 55872 67985 89268 98457 95465 92361
12227 92361 79378 96751 115489 100384 93904 77831 69041 71542 79299 88053 87472 92621 101278
12214 101278 104347 88732 80574 91715 103485 123882 118876 119346 121113 136428 150222 139400 132258
12201 132258 128261 99684 86528 88445 88256 73683 76329 90721 85388 69587 67812 71088 75990
12188 75990 69329 77590 84194 85045 88459 94876 86077 85828 76707 88052 93190 90036 80484 68250
12174 68250 74443 88617 70079 77633 94752 107274 112669 121108 121852 111728 112751 121802 119668
12161 119668 136997 142389 142788 151013 156448 161021 180353 185114 185679 212636 254297 298245 330488
12148 330488 372497 406556 422859 452679 473103 470884 454784 462870 464765 465968 463031 460809 476002
$$ packed form
12241G1585J734J1808K88j1788p996Q320P255k5914N80J2113K1283R189k992l104
12227I2361j2983J7373J8738j5105o480j6073q790K501P757Q754n81N149Q657
12214A01278L069j5615q158J1141J1770K0397n006M70J767J5315J3794j0822p142
12201A32258l997k8577j3156J917j89j4573K646J4392n333j5801j775L276M902
12188G5990o661Q261O604Q51L414O417q799k49r121J1345N138l154r552j2234
12174F8250O193J4174j8538P554J7119J2522N395Q439P44j0124J023R051k134
12161A19668J7329N392L99Q225N435M573J9332M761N65K6957M1661M3948L2243
12148C30488M2009L4059J6303K9820K0424k219j6100Q086J895J203k937k222J5193
$$ plain form
12135 476002 514025 548399 570807 572852 556220 539256 493464 465491 427828 376934 339695 321706
12123 321706 317002 297180 288317 309643 342988 373697 389084 393957 433886 467371 483689 497861
12111 497861 485517 459815 442561 427125 424972 419086 423306 434057 470963 520095 561285 626434
12099 626434 686142 752230 800878 827490 826807 834918 812498 754867 684278 621385 582270 535729
12087 535729 504577 482575 454950 441411 462870 474463 467409 472115 463748 430391 384324 337767
12075 337767 294051 267994 253949 229922 208849 206371 205379 207694 203553 201568 220057 220149 216183
12062 216183 231870 248373 267709 286226 321144 375087 403905 401082 396258 376329 346110 311561
12050 311561 277748 244519 207449 153834 118700 90678 90025 69012 68778 87523 100801 102568
$$ packed form
12135D76002L8023L4374K2408K045j6632j6964m5792k7973l7663n0894l7239j7989
12123C21706m704j9822q863K1326L3345L0709J5387M873L9929L3485J6318J4172
12111D97861j2344k5702j7254j5436k153n886M220J0751L6906M9132M1190O5149
12099F26434N9708O6088M8648K6612o83Q111k2420n7631p0589o2893l9115m6541
12087E35729l1152k2002k7625j3539K1459J1593p054M706q367l3357m6067m6557
12075C37767m3716k6057j4045k4027k1073k478r92K315m141j985J8489R2l966
12062B16183J5687J6503J9336J8517L4918N3943K8818k823m824j9929l0219l4549
12050C11561l3813l3229l7070n3615l5134k8022o53k1013k34J8745J3278J767
$$ plain form
12038 102568 88791 67848 59400 49261 57180 66738 66828 70416 61553 56374 58634 70207 74387 78758
12024 78758 76913 57987 73779 68811 53827 70114 77287 61221 46185 54502 66587 80497
12012 80497 79028 87846 90532 74825 56445 72188 64288 59423 73723 77415 82503 71320 65551
11999 65551 70772 76841 80189 101661 98100 105874 111239 109249 101171 82245 82710 88703 95405 101851
11985 101851 103478 120838 129473 121479 97840 90048 93156 115368 115264 116366 120747 131506 134578
11972 134578 143589 138814 128152 143564 158303 148474 135307 132159 134041 153294 148080 141316 148128
11959 148128 144333 126448 129800 142189 152171 144256 117532 116255 131412 136034 134931 134613 137342
11946 137342 140893 150381 165047 158925 143970 152003 143155 157980 167980 191248 204177 200282 184240
$$ packed form
12038A02568j3777k0943q448j0139P919R558R0L588q863n179K260J1573M180M371
12024G8758j845j8926J5792m968j4984J6287P173j6066j5036Q317J2085J3910
12012H0497j469Q818K686j5707j8380J5743p900m865J4300L692N088j1183n769
11999F5551N221O069L348K1472l561P774N365j990q078j8926M65N993O702O446
11985A01851J627J7360Q635p994k3639p792L108K2212j04J102M381J0759L072
11972A34578R011m775j0662J5412J4739r829j3167l148J882J9253n214o764O812
11959A48128l795j7885L352J2389R982p915k6724j277J5157M622j103l18K729
11946A37342L551R488J4666o122j4955Q033q848J4825J0000K3268J2929l895j6042
$$ plain form
11933 184240 176958 176803 187325 197675 186251 191996 205879 206985 189500 191275 206330 221702 231148
11920 231148 221529 229662 234409 228568 211002 198623 202864 213271 208959 211239 202114 192356 197562
11907 197562 187275 177413 196365 205855 194027 187559 188824 185061 187599 196373 207885 202681 189278
11894 189278 175392 185617 207001 185755 165322 178171 184502 186082 198170 209263 202406 203584
11882 203584 205437 207414 208357 200276 192612 192349 207549 222324 231297 237110 237647 239800 263032 295248
11868 295248 313102 338831 373745 380782 395303 409549 412776 410393 401080 385601 348799 316991
11856 316991 307183 310482 305008 301456 313730 310186 313781 312729 286680 283988 296615 302536 299441
11843 299441 277564 261326 252503 258844 264846 274083 265768 259819 277991 286484 305347 300926 309320
$$ packed form
11933A84240p282j55J0522J0350j1424N745J3883J106j7485J775J5055J5372R446
11920B31148r619Q133M747n841j7566j2379M241J0407m312K280r125r758N206
11907A97562j0287r862J8952R490j1828o468J265l763K538Q774J1512n204j3403
11894A89278j3886J0225K1384k1246k0433J2849O331J580J2088J1093o857J178
11882B03584J853J977R43q081p664k63J5200J4775Q973N813N37K153K3232L2216
11868B95248J7854K5729L4914P037J4521J4246L227k383r313j5479l6802l1808
11856C16991r808L299n474l552J2274l544L595j052k6049k692J2627N921l095
11843B99441k1877j6238q823O341O002R237q315n949J8172Q493J8863m421Q394
$$ plain form
11830 309320 329977 337724 337700 338934 336605 351788 351302 355757 358963 364111 376672 391021 408020 423668
11816 423668 415867 425747 421040 414828 405757 391856 406567 414001 424024 450001 461732 466134 486593
11803 486593 485519 489550 505313 509616 512564 544660 569633 596202 624437 637314 641379 657264
11791 657264 682839 703962 720126 750447 779756 801405 815587 831655 850290 867820 900460
11780 900460 937278 965036 1006884 1032983 1062236 1093887 1123416 1155300 1164410 1176904 1213114 1257345
11768 1257345 1305458 1346257 1399446 1450095 1531622 1626252 1707844 1794200 1897354 1988177 2107031
11757 2107031 2237396 2387730 2556506 2712810 2907160 3150919 3418486 3748204 4105685
11748 4105685 4466059 4884975 5369902 5898804 6484122 7136157 7830023 8592889 9473040
$$ packed form
11830C09320K0657P747k4J234k329J5183m86M455L206N148J2561J4349J6999J5648
11816D23668p801R880m707o212r071j3901J4711P434J0023K5977J1731M402K0459
11803D86593j074M031J5763M303K948L2096K4973K6569K8235J2877M065J5885
11791F57264K5575K1123J6164L0321K9309K1649J4182J6068J8635J7530L2640
11780I00460L6818K7758M1848K6099K9253L1651K9529L1884R110J2494L6210M4231
11768A257345M8113M0799N3189N0649Q1527R4630Q1592Q6356J03154R0823J18854
11757B107031J30365J50334J68776J56304J94350K43759K67567L29718L57481
11748D105685L60374M18916M84927N28902N85318O52035O93866P62866Q80151
$$ plain form
11739 9473040 10466285 11605317 12925735 14494451 16360049 18600907 21328096 24665470
11731 24665470 28765841 33746479 39680257 46329909 53219770 59537426 64394870 67209171
11723 67209171 67830051 66434483 63410181 59487555 55841302 53654125 53631639 56084025
11715 56084025 61031343 68328114 77530382 87669043 97185091 104296473 107279525 105038811
11707 105038811 97762544 87244032 76089580 66418506 59264903 54768839 52617220 52422635
11699 52422635 53822187 56441827 59945201 63905658 67792914 71058686 73200725 73769792
11691 73769792 72656268 70145964 66765931 63088859 59670902 57081725 55693806 55686271
11683 55686271 57148150 60123279 64719739 71054152 79114843 88760358 99722813 111345209
$$ packed form
11739I473040R93245J139032J320418J568716J865598K240858K727189L337374
11731B4665470M100371M980638N933778O649652O889861O317656M857444K814301
11723F7209171O20880j395568l024302l922626l646253k187177k2486K452386
11715E6084025M947318P296771R202268J0138661R516048P111382K983052k240714
11707A05038811p276267j0518512j1154452r671074p153603m496064k151619j94585
11699E2422635J399552K619640L503374L960457L887256L265772K142039N69067
11691G3769792j113524k510304l380033l677072l417957k589177j387919p535
11683E5686271J461879K975129M596460O334413Q060691R645515J0962455J1622396
$$ plain form
11675 111345209 122528653 132000422 138692503 142094349 142292721 139685152 134804543 128521951
11667 128521951 121897901 115809981 110658355 106378413 102575577 98546935 93703964 87857100
11659 87857100 80960912 73036191 64348154 55569667 47555352 40878579 35699824 31778547
11651 31778547 28752834 26351121 24420371 22904819 21787468 21011415 20564167 20487262 20812607
11642 20812607 21581926 22840639 24727993 27435165 31145447 36113964 42441182 49936541
11634 49936541 57831450 64760002 69251273 70364354 67540692 61003376 51999725 42103040
11626 42103040 32794701 25173862 19532311 15556277 12763688 10749582 9247513 8102250
11618 8102250 7204885 6480003 5897595 5413437 4969546 4549905 4164940 3791466 3464036
$$ packed form
11675A11345209J1183444R471769O692081L401846J98372k607569m880609o282592
11667A28521951o624050o087920n151626m279942l802836m028642m842971n846864
11659H7857100o896188p924721q688037q778487q014315o676773n178755l921277
11651C1778547l025713k401713j930750j515552j117351p76053m47248p6905L25345
11642B0812607P69319J258713J887354K707172L710282M968517O327218P495359
11634D9936541P894909O928552M491271J113081k823662o537316r003651r896685
11626D2103040r308339p620839n641551l976034k792589k014106j502069j145263
11618H102250q97365p24882n82408m84158m43891m19641l84965l73474l27430
$$ plain form
11609 3464036 3168552 2913800 2692846 2516904 2381336 2251242 2124063 2018229 1934901 1824703
11599 1824703 1733944 1641026 1544922 1479059 1416360 1338015 1280467 1243554 1210012 1172747 1144621
11588 1144621 1122719 1087718 1063557 1064501 1043762 1015071 975054 959468 944613 912334 890542 887921
11576 887921 865900 853287 850708 837448 819978 777238 755194 741884 734129 717851 709116 701501
11564 701501 689196 666254 646420 635786 619570 606421 586769 578915 588388 577225 567974 562809
11552 562809 552576 552827 555548 556833 556321 548280 537751 541028 555551 569689 572775 589348 606362
11539 606362 605966 601366 596360 579731 585452 611400 628259 630383 644022 686666 712435 730254 767915
11526 767915 806011 849108 856896 858863 850623 807516 754337 707443 628523 555752 544699 537130
$$ packed form
11609C464036k95484k54752k20954j75942j35568j30094j27179j05834q3328j10198
11599A824703r0759r2918r6104o5863o2699p8345n7548l6913l3542l7265k8126
11588A144621k1902l5001k4161R44k0739k8691m0017j5586j4855l2279k1792k621
11576H87921k2021j2613k579j3260j7470m2740k2044j3310p755j6278q735p615
11564G01501j2305k2942j9834j0634j6216j3149j9652p854R473j1163r251n165
11552E62809j0233K51K721J285n12q041j0529L277J4523J4138L086J6573J7014
11539F06362l96m600n006j6629N721K5948J6859K124J3639M2644K5769J7819L7661
11526G67915L8096M3097P788J967q240m3107n3179m6894p8920p2771j1053p569
$$ plain form
11514 537130 515315 479946 455442 441447 430310 402680 385713 380154 382091 382197 364387 355707
11502 355707 359405 366584 389246 402652 387303 393093 395020 405716 411086 403961 399162 410594 420367
11489 420367 419726 406343 390369 381458 397640 422495 431465 414998 413670 426915 407783 385246
11477 385246 361325 317584 282447 277116 275367 286646 269750 272414 273337 268581 271239 271992 280916
11464 280916 265301 258747 271627 281298 267301 283601 317701 335111 338747 351856 368115 384467
11452 384467 391089 402173 403355 411482 422854 434055 418339 393748 396543 387068 352602 330142
11440 330142 337376 337165 338986 324261 319927 339381 344361 328016 332305 330681 314662 298833 296915
11427 296915 279986 279538 283420 282745 271380 268898 276271 280576 280962 294283 320456 326006 345006 369840
$$ packed form
11514E37130k1815l5369k4504j3995j1137k7630j6967n559J937J06j7810q680
11502C55707L698P179K2662J3406j5349N790J927J0696N370p125m799J1432R773
11489D20367o41j3383j5974q911J6182K4855Q970j6467j328J3245j9132k2537
11477C85246k3921m3741l5137n331j749J1279j6896K664R23m756K658P53Q924
11464B80916j5615o554J2880R671j3997J6300L4100J7410L636J3109J6259J6352
11452C84467O622J1084J182Q127J1372J1201j5716k4591K795r475l4466k2460
11440C30142P234k11J821j4725m334J9454M980j6345M289j624j6019j5829j918
11427B96915j6929m48L882o75j1365k482P373M305L86J3321K6173N550J9000K4834
$$ plain form
11413 369840 385730 410763 423138 450230 485802 505548 524512 541394 554455 543171 525318
11402 525318 520337 493027 449471 415396 375531 328479 305898 266843 248951 246066 244989 235868
11390 235868 243090 251653 271254 281098 278181 299325 314645 305762 298205 271090 289973 320992 339884
11377 339884 354027 393347 420178 438372 472595 510092 546565 569346 615379 656695 686151
11366 686151 717409 746746 739850 722496 721473 736719 753888 757354 749261 738141 699935 659325
11354 659325 614699 574403 544893 521160 472523 447982 432232 444253 459208 475775 486979
11343 486979 481194 483198 467350 452176 435914 419652 413488 423844 439021 454127 482226 529037
11331 529037 595402 635592 689888 730477 757499 774288 756786 708910 650343 598491 556572
$$ packed form
11413C69840J5890K5033J2375K7092L5572J9746J8964J6882J3061j1284j7853
11402E25318m981k7310m3556l4075l9865m7052k2581l9055j7892k885j077r121
11390B35868P222Q563J9601R844k917K1144J5320q883p557k7115J8883L1019J8892
11377C39884J4143L9320K6831J8194L4223L7497L6473K2781M6033M1316K9456
11366F86151L1258K9337o896j7354j023J5246J7169L466q093j1120l8206m0610
11354F59325m4626m0296k9510k3733m8637k4541j5750J2021J4955J6567J1204
11343D86979n785K004j5848j5174j6262j6262o164J0356J5177J5106K8099M6811
11331E29037O6365M0190N4296M0589K7022J6789j7502m7876n8567n1852m1919
$$ plain form
11320 556572 496053 456160 405677 377308 391500 386786 384323 374268 385233 413721 420938 404670
11308 404670 403847 411911 415613 431832 442460 456185 489978 544299 579501 611115 631709 641307
11296 641307 646330 642193 637428 622408 593841 588912 589942 586077 580266 589793 618820 640283 683068
11283 683068 703556 754928 784072 796588 798174 762223 717854 666636 625916 592945 561297 558035
11271 558035 561373 556863 574166 578174 570417 552545 548504 531834 512723 503477 481709 466800 466567
11258 466567 442782 435065 434312 436640 450166 480675 509146 525966 550922 601764 637351 678499
11246 678499 743596 793752 823234 861456 900370 921305 912920 908582 881623 875595 854520 812956
11234 812956 760729 709000 643485 564394 499363 448132 395436 362324 332834 311456 297502
$$ packed form
11320E56572o0519l9893n0483k8369J4192m714k463j0055J0965K8488P217j6268
11308D04670q23Q064L702J6219J0628J3725L3793N4321L5202L1614K0594R598
11296F41307N023m137m765j5020k8567m929J030l865n811R527K9027K1463M2785
11283F83068K0488N1372K9144J2516J586l5951m4369n1218m0720l2971l1648l262
11271E58035L338m510J7303M008p757j7872m041j6670j9111r246k1768j4909k33
11258D66567k3785p717p53K328J3526L0509K8471J6820K4956N0842L5587M1148
11246F78499O5097N0156K9482L8222L8914K0935q385m338k6959o028k1075m1564
11234H12956n2227n1729o5515p9091o5031n1231n2696l3112k9490k1378j3954
$$ plain form
11223 297502 285861 283973 265664 260841 249151 248899 251976 252538 256658 264116 260429 268507 282226 285766
11209 285766 294677 316556 362561 385945 412359 443510 472976 513746 523053 506076 469263 435864
11197 435864 405419 375955 362349 325956 288882 276288 268774 250895 226549 208154 210776 218928
11185 218928 223348 222696 214592 205829 212013 231897 243962 255434 270256 286907 309916 335382 371384
11172 371384 404553 445892 491276 509584 492902 438519 372320 321064 294255 280276 255735
11161 255735 230019 204621 205323 212740 216981 226708 247798 258771 241931 238902 231679 227562 237585
11148 237585 239693 240115 233208 257281 286255 291852 288802 282281 259604 243836 247417 255561 253013
11135 253013 251717 275780 291932 308745 327709 346553 346676 336471 317799 289537 273820 257730
$$ packed form
11223B97502j1641j888j8309m823j1690k52L077N62M120P458l687Q078J3719L540
11209B85766Q911K1879M6005K3384K6414L1151K9466M0770R307j6977l6813l3399
11197D35864l0445k9464j3606l6393l7074j2594p514j7879k4346j8395K622Q152
11185B18928M420o52q104q763O184J9884J2065J1472J4822J6651K3009K5466L6002
11172C71384L3169M1339M5384J8308j6682n4383o6199n1256k6809j3979k4541
11161B55735k5716k5398P02P417M241R727K1090J0973j6840l029p223m117J0023
11148B37585K108M22o907K4073K8974N597l050o521k2677j5768L581Q144k548
11135B53013j296K4063J6152J6813J8964J8844J23j0205j8672k8262j5717j6090
$$ plain form
11123 257730 252253 256182 240960 220486 192430 182731 193967 207626 201320 207770 223275 247160
11111 247160 240620 229062 212299 228980 259904 288397 318357 347209 369836 378622 367904 356283
11099 356283 347957 331212 311302 299365 294923 295545 303903 326128 357809 382243 410262 451952
11087 451952 502672 541182 591261 635323 664885 699461 699858 668522 631028 589944 553089 513761
11075 513761 483902 473857 455064 456632 462467 461193 468784 490637 504722 485193 476430 460856
11063 460856 440236 458853 464601 469646 482139 471553 487420 508539 525189 531695 544159 554666
11051 554666 572138 586401 579803 592123 607582 621321 638331 653471 678926 722399 743982 778941
11039 778941 821380 861014 911273 947257 978437 1024092 1067683 1094780 1122294 1166008 1238569
$$ packed form
11123B57730n477L929j5222k0474k8056r699J1236J3659o306O450J5505K3885
11111B47160o540j1558j6763J6681L0924K8493K9960K8852K2627Q786j0718j1621
11099C56283q326j6745j9910j1937m442O22Q358K2225L1681K4434K8019M1690
11087D51952N0720L8510N0079M4062K9562L4576L97l1336l7494m1084l6855l9328
11075E13761k9859j0045j8793J568N835j274P591K1853J4085j9529q763j5574
11063D60856k0620J8617N748N045J2493j0586J5867K1119J6650O506J2464J0507
11051E54666J7472J4263o598J2320J5459J3739J7010J5140K5455M3473K1583L4959
11039G78941M2439L9634N0259L5984L1180M5655M3591K7097K7514M3714P2561
$$ plain form
11028 1238569 1318695 1382726 1430100 1482316 1556535 1642074 1727354 1816600 1947947 2069324 2194329
11017 2194329 2331020 2512773 2744094 2991507 3258448 3596914 3989808 4407039 4876335
11008 4876335 5371184 5900707 6482733 7072451 7711396 8431986 9270768 10229995 11396994
10999 11396994 12811455 14514880 16629098 19293302 22728885 27179864 32800814 39606397
10991 39606397 47238090 54674506 60495304 63463389 63049604 59372841 53007926 45041752
10983 45041752 36966852 30108557 25035541 21607649 19485221 18301258 17796357 17827348
10975 17827348 18258728 18982221 19910710 20931464 21929990 22853944 23683042 24471865 25378234
10966 25378234 26555073 28195264 30409159 33295317 36950433 41382060 46627395 52711270
$$ packed form
11028A238569Q0126O4031M7374N2216P4219Q5539Q5280Q9246J31347J21377J25005
11017B194329J36691J81753K31321K47413K66941L38466L92894M17231M69296
11008D876335M94849N29523N82026N89718O38945P20590Q38782R59227J166999
10999A1396994J414461J703425K114218K664204L435583M450979N620950O805583
10991C9606397P631693P436416N820798K968085m13785l676763o364915p966174
10983D5041752q074900o858295n073016l427892k122428j183963n04901L0991
10975A7827348M31380P23493R28489J020754R98526R23954Q29098P88823R06369
10966B5378234J176839J640191K213895K886158L655116M431627N245335O083875
$$ plain form
10958 52711270 59580236 67026448 74735149 82578977 90599293 98683771 106424729 113432367
10950 113432367 119549284 124672472 128498697 130600374 130550241 128088687 123025499 115215236
10942 115215236 104947271 93292816 81659285 71371029 63272366 57626312 54347332
10935 54347332 53184868 53894769 56214101 59578100 63143002 65913789 67115849 66451399
10927 66451399 64074703 60718588 57405564 54948137 53777704 54134471 56040447 59632527
10919 59632527 65165968 72865118 82900177 95094555 108574036 121459392 131082674
10912 131082674 134846018 131005055 119936442 104575217 88534485 74431949 63333320
10905 63333320 55313890 50003761 46969304 45679754 45672005 46516944 47667397 48536247 48629370
$$ packed form
10958E2711270O868966P446212P708701P843828Q020316Q084478P740958P007638
10950A13432367O116917N123188L826225K101677n0133k461554n063188p810263
10942A15215236j0267965j1654455j1633531j0288256q098663n646054l278980
10935E4347332j162464P09901K319332L363999L564902K770787J202060o64450
10927F6451399k376696l356115l313024k457427j170433L56767J905976L592080
10919E9632527N533441P699150J0035059J2194378J3479481J2885356R623282
10912A31082674L763344l840963j1068613j5361225j6040732j4102536j1098629
10905F3333320q019430n310129l034457j289550p749Q44939J150453Q68850R3123
$$ plain form
10896 48629370 47660047 45539674 42449994 38984049 35862778 33569561 32345473 32278263
10888 32278263 33341945 35547425 38842977 43064754 47826260 52468379 55971115 57301358
10880 57301358 56153562 52975353 48196434 42122955 35276359 28553546 22819365 18354487
10872 18354487 15030016 12551892 10685898 9245294 8125083 7199035 6424079 5780554
10864 5780554 5249757 4823906 4469625 4178382 3900355 3650150 3447884 3258198 3073110
10855 3073110 2889686 2719323 2595422 2473370 2380234 2307424 2244164 2207475 2137348 2075463
10845 2075463 2015016 1997573 2005687 2020256 2026914 2068693 2156637 2284037 2476675 2729930 3061360
10834 3061360 3495431 3964463 4352177 4468892 4196755 3669139 3085095 2526223 2089977
$$ packed form
10896D8629370r69323k120373l089680l465945l121271k293217j224088o7210
10888C2278263J063682K205480L295552M221777M761506M642119L502736J330243
10880E7301358j147796l178209m778919o073479o846596o722813n734181m464878
10872A8354487l324471k478124j865994j440604j120211r26048p74956o43525
10864E780554n30797m25851l54281k91243k78027k50205k02266j89686j85088
10855C073110j83424j70363j23901j22052r3136p2810o3260l6689p0127o1885
10845B075463o0447j7443Q114J4569O658M1779Q7944J27400J92638K53255L31430
10834C061360M34071M69032L87714J16715k72137n27616n84044n58872m36246
$$ plain form
10825 2089977 1777227 1572234 1455286 1375911 1298761 1224832 1168533 1115691 1070920 1043146 1039782
10814 1039782 1000926 955691 921165 882812 865182 853577 825464 799626 791807 782561 750805 739594
10802 739594 714647 693070 686511 665771 645753 630866 633469 615963 606541 628670 661529 657333
10790 657333 646663 653021 651726 649615 661781 674676 672467 673232 670430 661073 667996 667901 684253 701530
10776 701530 726540 733815 722589 715904 698135 668249 663658 660030 630069 596799 588464 582464 566178
10763 566178 540984 522782 514717 508037 507203 502549 495499 498810 521966 538227 560314 596791 600351
10750 600351 601967 599014 621661 629552 649178 680123 713604 734848 732392 707358 674876 641518
10738 641518 593659 559683 541927 518028 497513 488152 480193 467009 476901 476628 456783 455809 439937
$$ packed form
10825B089977l12750k04993j16948p9375p7150p3929n6299n2842m4771k7774l364
10814A039782l8856m5235l4526l8353j7630j1605k8113k5838p819r246l1756j1211
10802G39594k4947k1577o559k0740k0018j4887K603j7506r422K2129L2859m196
10790F57333j0670O358j295k111J2166J2895k209P65k802r357O923r5J6352J7277
10776G01530K5010P275j1226o685j7769k9886m591l628k9961l3270q335o000j6286
10763E66178k5194j8202q065o680q34m654p050L311K3156J6261K2087L6477L560
10750F00351J616k953K2647P891J9626L0945L3481K1244k456k5034l2482l3358
10738F41518m7859l3976j7756k3899k0515r361p959j3184R892k73j9845r74j5872
$$ plain form
10725 439937 412543 391623 397143 401334 392007 387544 380210 381295 399799 404433 404756 428442 432422
10712 432422 424858 440758 473828 482284 481432 478628 475506 458241 447111 448406 437771 427771 417145
10699 417145 412487 410049 409644 402873 403996 407194 402613 381686 349641 350416 354971 348854 349575 358935
10685 358935 362300 372317 377781 388536 383829 386287 389157 410492 430382 461559 481737 503819
10673 503819 502070 486858 479910 456403 431183 430880 444893 420162 394906 397278 396672 385327 380418
10660 380418 375477 383115 374646 377036 355395 328457 294672 276989 267927 241954 235518 226999 231900
10647 231900 218775 214704 222507 225279 225141 226480 233159 235742 241331 246221 240877 244212 238463 231579
10633 231579 237971 231459 235005 253548 271579 284447 286326 281334 281163 295719 292116 274709 258703
$$ packed form
10725D39937k7394k0920N520M191r327m463p334J085J8504M634L23K3686L980
10712D32422p564J5900L3070Q456q52k804l122j7265j1130J295j0635j0000j0626
10699D17145m658k438m05o771J123L198m581k0927l2045P75M555o117P21R360
10685C58935L365J0017N464J0755m707K458K870K1335J9890L1177K0178K2082
10673E03819j749j5212o948k3507k5220l03J4013k4731k5256K372o06j1345m909
10660C80418m941P638q469K390k1641k6938l3785j7683r062k5973o436q519M901
10647B31900j3125m071P803K772j38J339O679K583N589M890n344L335n749o884
10633B31579O392o512L546J8543J8031J2868J879m992j71J4556l603j7407j6006
$$ plain form
10620 258703 259285 264272 276935 297642 310021 333389 346841 332956 297686 277962 302728 344313
10608 344313 371846 400620 427796 441672 460305 456017 446271 430808 388887 308475 245449 199553
10596 199553 181588 193240 210661 224170 232881 252406 269468 289270 309717 306995 319958 321693
10584 321693 330385 347732 375913 405416 433897 454435 442764 419643 400644 405760 420809 435612
10572 435612 453829 488188 519387 519388 522019 516799 505931 478921 448607 391280 379224 399623 405936
10559 405936 398091 400964 411897 446778 476668 479028 477876 454377 444397 447223 471526 488345 494661
10546 494661 508549 522926 495318 505281 544471 612168 699307 772664 833133 874755 931595 1009483
10534 1009483 1109364 1180057 1243167 1298380 1339214 1379273 1393353 1403272 1416335 1444916 1446200 1411337
$$ packed form
10620B58703N82M987J2663K0707J2379K3368J3452j3885l5270j9724K4766M1585
10608C44313K7533K8774K7176J3876J8633m288r746j5463m1921q0412o3026m5896
10596A99553j7965J1652J7421J3509Q711J9525J7062J9802K0447k722J2963J735
10584C21693Q692J7347K8181K9503K8481K0538j1671k3121j8999N116J5049J4803
10572D35612J8217L4359L1199JK631n220j0868k7010l0314n7327j2056K0399O313
10559D05936p845K873J0933L4881K9890K360j152k3499r980K826K4303J6819O316
10546D94661J3888J4377k7608R963L9190O7697Q7139P3357O0469M1622N6840P7888
10534A009483R9881P0693O3110N5213M0834M0059J4080R919J3063K8581J284l4863
$$ plain form
10522 1411337 1374152 1309573 1226971 1144931 1063556 1003996 972286 982592 991993 987530 984771 993916
10510 993916 999534 1002961 1023359 1042640 1047262 1030215 1040385 1047521 1042485 1061693 1073998 1092804
10498 1092804 1134429 1193775 1275084 1386337 1493460 1584598 1647694 1657037 1645227 1608747 1567999
10487 1567999 1521766 1481617 1446243 1409765 1390213 1383495 1402126 1417565 1451978 1463079 1473307
10476 1473307 1509166 1533687 1541641 1584010 1629058 1702098 1786949 1879807 1984128 2100514 2250673
10465 2250673 2415585 2569629 2697185 2829080 2931517 3025729 3148002 3302637 3477112 3663197
10455 3663197 3903895 4160653 4426635 4678268 4922220 5224094 5593675 5999548 6428448
10446 6428448 6929072 7534646 8215825 9000014 9911569 11002922 12285754 13786526 15529675
$$ packed form
10522A411337l7185o4579q2602q2040q1375n9560l1710J0306R401m463k759R145
10510I93916N618L427K0398J9281M622j7047J0170P136n036J9208J2305J8806
10498A092804M1625N9346Q1309J11253J07123R1138O3096R343j1810l6480m0748
10487A567999m6233m0149l5374l6478j9552o718J8631J5439L4413J1101J0228
10476A473307L5859K4521P954M2369M5048P3040Q4851R2858J04321J16386J50159
10465B250673J64912J54044J27556J31895J02437R4212J22273J54635J74475J86085
10455C663197K40698K56758K65982K51633K43952L01874L69581M05873M28900
10446F428448N00624O05574O81179P84189R11555J091353J282832J500772J743149
$$ plain form
10437 15529675 17510392 19778126 22398116 25391989 28811701 32649401 36768683 40933645
10429 40933645 44809587 48522711 52806844 58163387 64794747 73061720 83523555 96826525
10421 96826525 114072736 137260256 169521612 214809736 276169076 351574500 432121360
10414 432121360 501795802 520783269 449012038 329393302 228158050 160460339 117216595
10407 117216595 89093540 70266784 57139358 47579776 40345518 34802726 30568157
10400 30568157 27402266 25124896 23479100 22152992 20651216 18591083 16197298 14030655
10392 14030655 12299921 10969775 9904414 9045061 8337557 7699366 7128965 6601702 6104983
10383 6104983 5660459 5270449 4961397 4660383 4364172 4067906 3793427 3549815 3341127
$$ packed form
10437A5529675J980717K267734K619990K993873L419712L837700M119282M164962
10429D0933645L875942L713124M284133N356543O631360Q266973J0461835J3302970
10421I6826525J7246211K3187520L2261356M5288124O1359340P5405424Q0546860
10414D32121360O9674442J8987467p1771231j19618736j01235252o7697711m3243744
10407A17216595k8123055j8826756j3127426r559582p234258n542792m234569
10400C0568157l165891k277370j645796j326108j501776k060133k393785k166643
10392A4030655j730734j330146j065361q59353p07504o38191n70401n27263m96719
10383F104983m44524l90010l09052l01014k96211k96266k74479k43612k08688
$$ plain form
10374 3341127 3179638 3034938 2926913 2840676 2758099 2670458 2577254 2478921 2368274 2246590
10364 2246590 2183667 2146231 2105037 2073650 2038739 2002964 1977195 1962596 1931842 1899909 1869813
10353 1869813 1848980 1780281 1725656 1666118 1609707 1552968 1496644 1452174 1414265 1383793 1361089
10342 1361089 1343216 1322159 1297866 1272169 1266901 1262613 1245976 1211036 1186545 1176969 1202291 1251035
10330 1251035 1305786 1366491 1388997 1352100 1262189 1212329 1153386 1097769 1051234 1019704 1023091
10319 1023091 1020702 1000101 981539 963920 943506 924661 938337 957964 968424 983757 1006146
10308 1006146 1019974 1002423 982609 981386 933248 889234 834711 795824 753999 717582 690532
10297 690532 677550 680096 708449 722017 726228 741339 800976 873367 881932 849836 844891 877908
$$ packed form
10374C341127j61489j44700j08025q6237q2577q7641r3204r8333j10647j21684
10364B246590o2923l7436m1194l1387l4911l5775k5769j4599l0754l1933l0096
10353A869813k0833o8699n4625n9538n6411n6739n6324m4470l7909l0472k2704
10342A361089j7873k1057k4293k5697n268m288j6637l4940k4491r576K5322M8744
10330A251035N4751O0705K2506l6897q9911m9860n8943n5617m6535l1530L387
10319A023091k389k0601j8562j7619k0414j8845J3676J9627J0460J5333K2389
10308A006146J3828j7551j9814j223m8138m4014n4523l8887m1825l6417k7050
10297F90532j2982K546K8353J3568M211J5111N9637P2391Q565l2096m945L3017
$$ plain form
10285 877908 904802 924762 928328 931510 939139 910213 867117 859307 862534 849179 835914 828823 822146
10272 822146 809101 801920 818421 822153 832475 852646 866043 877184 867648 854258 845935 826216
10260 826216 800200 770354 720812 660370 627695 640741 644315 646843 638422 633170 638888 652259
10248 652259 670542 671470 691545 717212 732572 742315 742768 748140 737454 735333 742994 760546 761285
10235 761285 736278 736673 746416 756433 767205 759177 727769 689892 635451 608659 623741 640223
10223 640223 654297 693725 730677 774089 839378 926227 1045033 1168691 1315987 1467237 1670478
10212 1670478 1923021 2182683 2371351 2355139 2079193 1705525 1386271 1157656 1008488 912280
10202 912280 851905 797748 773742 753914 754252 777419 775553 767159 743414 726742 737989 738037 723273
$$ packed form
10285H77908K6894J9960L566L182P629k8926m3096p810L227j3355j3265p091o677
10272H22146j3045p181J6501L732J0322K0171J3397J1141r536j3390q323j9719
10260H26216k6016k9846m9542o0442l2675J3046L574K528q421n252N718J3371
10248F52259J8283R28K0075K5667J5360R743M53N372j0686k121P661J7552P39
10235G61285k5007L95R743J0017J0772q028l1408l7877n4441k6792J5082J6482
10223F40223J4074L9428L6952M3412O5289Q6849J18806J23658J47296J51250K03241
10212A670478K52543K59662J88668j6212k75946l73668l19254k28615j49168r6208
10202I12280o0375n4157k4006j9828L38K3167j866q394k3745j6672J1247M8j4764
$$ plain form
10189 723273 716275 719449 685619 662342 666024 678898 699329 684590 678561 674543 675562 685698 689807
10176 689807 694526 687903 654530 620899 595919 577504 584939 595485 592510 594670 601339 597522 589652
10163 589652 591155 587666 595465 595584 576122 562556 545848 538553 530745 523672 505425 505650 510107 519404
10149 519404 520817 510556 531454 553486 570783 579894 595156 607586 631177 665196 707674 730429
10137 730429 728356 701514 668512 646574 615406 574875 540976 511065 499207 500437 529062 545131
10125 545131 560702 570100 580368 579175 571629 580996 607226 625668 654933 658105 649262 672995 674994
10112 674994 680763 688942 743921 789815 810233 833219 838861 822708 798327 793933 787928 757491
10100 757491 736777 741535 749130 699827 654991 632596 601011 581696 556026 528402 503853 494982
$$ packed form
10189G23273o998L174l3830k3277L682J2874K0431j4739o029m018J019J0136M109
10176F89807M719o623l3373l3631k4980j8415P435J0546k975K160O669l817p870
10163E89652J503l489P799J19j9462j3566j6708p295p808p073j8247K25M457R297
10149E19404J413j0261K0898K2032J7297R111J5262J2430K3591L4019M2478K2755
10137G30429k073k6842l3002k1938l1168m0531l3899k9911j1858J230K8625J6069
10125E45131J5571R398J0268j193p546R367K6230J8442K9265L172q843K3733J999
10112F74994N769Q179N4979M5894K0418K2986N642j6153k4381m394o005l0437
10100G57491k0714M758P595m9303m4836k2395l1585j9315k5670k7624k4549q871
$$ plain form
10088 494982 491814 477556 474039 465286 443127 426696 417611 414752 417019 440499 442486 431505 445663
10075 445663 460013 486547 500534 501734 508052 516500 527967 546398 546575 535774 549577 554370 538476
10062 538476 543202 555085 559315 564477 560822 536247 507705 495124 501209 484187 461396 446729
10050 446729 436507 417770 407117 385006 365301 353063 347479 339708 343888 337238 326044 317258
10038 317258 293596 298659 312585 314459 306754 306735 318597 337332 339605 341002 368595 385812 366798
10025 366798 369594 394647 407967 411845 403102 398826 402637 395836 393311 400034 421778 435171 461023
10012 461023 474192 489518 498978 499497 491721 484202 527467 569866 598967 628337 670792 703343
10000 703343 736801 774216 824605 894907 986822 1127206 1310509 1565682 1877871 2240447
$$ packed form
10088D94982l168j4258l517q753k2159j6431r085k859K267K3480J987j0981J4158
10075D45663J4350K6534J3987J200O318Q448J1467J8431J77j0801J3803M793j5894
10062E38476M726J1883M230N162l655k4575k8542j2581O085j7022k2791j4667
10050D46729j0222j8737j0653k2111j9705j2238n584p771M180o650j1194q786
10038C17258k3662N063J3926J874p705j9J1862J8735K273J397K7593J7217j9014
10025C66798K796K5053J3320L878q743m276L811o801k525O723K1744J3393K5852
10012D61023J3169J5326R460N19p776p519M3265M2399K9101K9370M2455L2551
10000G03343L3458L7415N0389P0302R1915J40384J83303K55173L12189L62576
$$ plain form
9990 2240447 2602600 2871160 2891294 2549338 2043357 1596968 1272233 1052480 897318 780272
9980 780272 687742 619973 557851 512931 486788 472409 455519 426791 406691 395374 377695 367891
9968 367891 348386 337375 326397 316848 306463 288922 276305 262329 253432 257026 262160 287397
9956 287397 281258 261869 272999 278226 270935 269230 253809 255121 274309 298317 293675 271676 266835
9943 266835 259332 259672 254089 236290 233795 235379 245232 248209 245189 257129 264559 262540 269198 282881
9929 282881 277270 290147 304084 320692 339970 345354 337149 357379 370405 395337 425347 445240
9917 445240 446133 431816 426670 416189 388852 362734 326588 311705 314903 312793 302670 320814 326099
9904 326099 315668 304690 306093 325539 357821 365048 350730 324357 300954 283435 291912 286827
$$ packed form
9990B240447L62153K68560K0134l41956n05981m46389l24735k19753j55162j17046
9980G80272r2530o7769o2122m4920k6143j4379j6890k8728k0100j1317j7679r804
9968C67891j9505j1011j0978r549j0385j7541j2617j3976q897L594N134K5237
9956B87397o139j9389J1130N227p291j705j5421J312J9188K4008m642k1999m841
9943B66835p503L40n583j7799k495J584R853K977l020J1940P430k019O658J3683
9929B82881n611J2877J3937J6608J9278N384q205K0230J3026K4932L0010J9893
9917D45240Q93j4317n146j0481k7337k6118l6146j4883L198k110j0123J8144N285
9904C26099j0431j0978J403J9446L2282P227j4318k6373k3403j7519Q477n085
$$ plain form
9892 286827 279189 266187 270831 295603 304265 308095 314738 337914 339175 354030 373418 379737 383539
9879 383539 358942 329806 302128 291439 280535 275727 269364 256953 251877 252324 256128 242718 247733
9866 247733 259249 269190 260024 262004 275788 284280 300053 308225 294398 291216 299056 326308 335753
9853 335753 335609 328580 307723 305512 315738 329121 337456 356859 387378 394161 381716 388662 399105
9840 399105 398169 394793 407521 401135 399344 395784 396580 396583 399353 445231 475491 466945 476271 500412 523237
9825 523237 539905 553320 586197 610168 627780 655672 668828 685029 716100 746890 767780 793477
9813 793477 835022 875708 909958 944059 981144 1049396 1152410 1264014 1365393 1472790 1589612
9802 1589612 1716758 1869128 2058450 2265535 2503208 2778499 3082950 3401428 3775274 4205091
$$ packed form
9892B86827p638j3002M644K4772Q662L830O643K3176J261J4855J9388O319L802
9879C83539k4597k9136k7678j0689j0904m808o363j2411n076M47L804j3410N015
9866B47733J1516R941r166J980J3784Q492J5773Q172j3827l182P840K7252R445
9853C35753j44p029k0857k211J0226J3383Q335J9403L0519O783j2445O946J0443
9840C99105r36l376J2728o386j791l560P96LK770M5878L0260q546R326K4141K2825
9825E23237J6668J3415L2877K3971J7612K7892J3156J6201L1071L0790K0890K5697
9813G93477M1545M0686L4250L4101L7085O8252J03014J11604J01379J07397J16822
9802A589612J27146J52370J89322K07085K37673K75291L04451L18478L73846M29817
$$ plain form
9792 4205091 4721815 5349781 6110965 7061130 8254758 9771210 11631868 13763171 15947822
9783 15947822 17789763 18816063 18630559 17183574 14853835 12400872 10360005 8879595
9775 8879595 7866037 7201981 6822250 6637973 6639099 6798564 7099490 7528735 8033491 8552943
9765 8552943 9020170 9417257 9796907 10199192 10654737 11152612 11667742 12330795 13254730 14463754
9755 14463754 16040714 17999137 20302995 22879403 25615400 28312184 30977696 33974707
9747 33974707 37562178 41395115 44736420 47109725 48371798 48251763 46523742 43451664
9739 43451664 39473958 34977331 30427434 26324994 23105981 20896482 19523639 18807880
9731 18807880 18530204 18495807 18531913 18581800 18680162 18834387 18950976 18950786 18885987 18932742 19314086
$$ packed form
9792D205091N16724O27966P61184R50165J193628J516452J860658K131303K184651
9783A5947822J841941J026300j85504j446985k329739k452963k040867j480410
9775H879595j013558o64056l79731j84277J126J59465L00926M29245N04756N19452
9765H552943M67227L97087L79650M02285M55545M97875N15130O63053R23935J209024
9755A4463754J576960J958423K303858K576408K735997K696784K665512K997011
9747C3974707L587471L832937L341305K373305J262073j20035j728021l072078
9739D3451664l977706m496627m549897m102440l219013k209499j372843p15759
9731A8807880k77676l4397L6106M9887R8362J54225J16589j90o4799M6755L81344
$$ plain form
9720 19314086 20206348 21695704 23773040 26371545 29366628 32407263 35021942 36733126
9712 36733126 37809443 39432169 42451647 46954872 52584802 58546340 63637984 66464785
9704 66464785 66089856 62588495 56858067 50308470 44304008 39580272 36095021 33263740
9696 33263740 30404887 27351526 24471969 21987328 19982865 18544513 17634707 17183224
9688 17183224 17068081 17190271 17409014 17578394 17719557 17901302 18117550 18271731 18343597 18521977
9678 18521977 19114830 20290185 22065390 24384109 27124262 30024614 32687641 34723743
9670 34723743 36092305 37228393 38473113 39610335 40119361 39650145 38126892 35656675
9662 35656675 32389288 28741090 25243393 22031425 18928187 15967480 13471378 11630161
$$ packed form
9720A9314086Q92262J489356K077336K598505K995083L040635K614679J711184
9712C6733126J076317J622726L019478M503225N629930N961538N091644K826801
9704F6464785l74929l501361n730428o549597o004462m723736l485251k831281
9696C3263740k858853l053361k879557k484641k004463j438352r09806m51483
9688A7183224j15143J22190K18743J69380J41163J81745K16248J54181P1866J78380
9678A8521977N92853J175355J775205K318719K740153K900352K663027K036102
9670C4723743J368562J136088J244720J137222N09026m69216j523253k470217
9662C5656675l267387l648198l497697l211968l103238k960707k496102j841217
$$ plain form
9654 11630161 10332486 9441880 8835621 8460143 8209767 8013455 7815172 7585685 7323545
9645 7323545 7024632 6672420 6309101 5994611 5785335 5714394 5766883 5923268 6187749 6568183
9635 6568183 7131900 7938983 8947726 10183655 11616105 13108153 14406794 15082144 14764345
9626 14764345 13480421 11506708 9309477 7364410 5842043 4708614 3907405 3314527
9618 3314527 2872043 2533920 2270997 2051759 1862981 1703364 1547255 1405529 1283959 1182328
9608 1182328 1103234 1043641 986010 923789 870506 828239 800571 756497 717415 689764 672255
9597 672255 635959 607667 577576 567037 566184 557447 532680 500947 477446 470776 459994 443884
9585 443884 425522 430553 430812 427747 417227 405327 416495 415862 412713 410550 411363 403674 423649 440933
$$ packed form
9654A1630161j297675q90606o06259l75478k50376j96312j98283k29487k62140
9645G323545k98913l52212l63319l14490k09276p0941N2489J56385K64481L80434
9635F568183N63717Q07083J008743J235929J432450J492048J298641O75350l17799
9626A4764345j283924j973713k197231j945067j522367j133429q01209n92878
9618C314527m42484l38123k62923k19238j88778j59617j56109j41726j21570j01631
9608A182328p9094n9593n7631o2221n3283m2267k7668m4074l9082k7651j7509
9597F72255l6296k8292l0091j0539q53q737k4767l1733k3501o670j0782j6110
9585D43884j8362N031K59l065j0520j1900J1168o33l149k163Q13p689J9975J7284
$$ plain form
9571 440933 432714 437878 439678 440698 434718 428694 424533 419831 397519 378859 361279 350316 348160
9558 348160 338098 325393 323632 338969 342574 341036 348976 349897 358002 355819 333640 308791 313388
9545 313388 330620 335694 328013 329275 334648 353448 355377 353428 342276 338464 332832 326579 328606 318585
9531 318585 326460 343963 368382 367280 347272 332990 332466 340913 374096 379831 384809 375649 341371
9518 341371 309563 303921 282061 272251 270828 257309 243416 232812 255620 275442 287774 302222
9506 302222 305283 289040 268906 263198 255481 258133 259090 258334 266250 252650 229108 207509 212808 233480
9492 233480 249544 254628 248999 258611 264492 260180 234227 211475 199628 195782 208930 226013 241816
9479 241816 223348 186504 173188 168177 165990 168810 170540 163740 166789 186130 212287 220282 210359
$$ packed form
9571D40933q219N164J800J020n980o024m161m702k2312j8660j7580j0963k156
9558C48160j0062j2705j761J5337L605j538P940R21Q105k183k2179k4849M597
9545C13388J7232N074p681J262N373J8800J929j949j1152l812n632o253K027j0021
9531C18585P875J7503K4419j102k0008j4282n24Q447L3183N735M978r160l4278
9518C41371l1808n642k1860r810j423j3519j3893j0604K2808J9822J2332J4448
9506C02222L061j6243k0134n708p717K652R57p56P916j3600k3542k1599N299K0672
9492B33480J6064N084n629R612N881m312k5953k2752j1847l846J3148J7083J5803
9479B41816j8468l6844j3316n011k187K820J730o800L049J9341K6157P995r923
$$ plain form
9466 210359 192451 186101 190380 202156 200174 210333 203138 189757 185611 184961 189189 182442 186754 179998
9452 179998 167483 160844 156691 156236 161860 159635 158863 157431 165972 150486 132925 138178 141522 145030
9438 145030 125930 112369 126186 130927 133687 136169 133502 136337 128473 135913 141144 137706 142232 151524
9424 151524 147962 142700 141959 130988 126909 121778 114186 115531 130234 151325 147421 144262 150329 148588
9410 148588 141955 138493 125842 140794 162368 143361 132910 125634 129647 117967 123190 121247 133295
9397 133295 143374 121436 134923 130543 114312 136451 142274 143767 139926 140412 137147 134175 134643 141757
9383 141757 168237 191314 205162 209409 208335 200468 167617 131825 102775 115256 121379 122316 124258
9370 124258 132720 141405 149982 135314 145198 160647 142024 154050 160191 159992 151189 158989 178838
$$ packed form
9466B10359j7908o350M279J1776j982J0159p195j3381m146o50M228o747M312o756
9452A79998j2515o639m153m55N624k225p72j432Q541j5486j7561N253L344L508
9438A45030j9100j3561J3817M741K760K482k667K835p864P440N231l438M526R292
9424A51524l562n262p41j0971m079n131p592J345J4703K1091l904l159O067j741
9410A48588o633l462j2651J4952K1574j9007j0451p276M013j1680N223j943J2048
9397A33295J0079k1938J3487m380j6231K2139N823J493l841M86l265k972M68P114
9383A41757K6480K3077J3848M247j074p867l2851l5792k9050J2481O123R37J942
9370A24258Q462Q685Q577j4668R884J5449j8623J2026O141j99q803P800J9849
$$ plain form
9357 178838 197228 187405 179564 171705 170926 178281 205384 215386 230541 251936 264496 280345 313250
9344 313250 327037 327250 333755 315639 314099 303037 277327 263999 247581 232409 214966 202827
9332 202827 201408 214376 210704 204122 189287 187532 185632 174251 163310 178505 187825 186046 199122
9319 199122 221640 234720 244749 262339 255309 246240 264903 282152 282484 288270 311436 350495 399427
9306 399427 415035 425103 437373 426963 393722 366360 333364 311009 304940 288379 277713 282655
9294 282655 292151 290372 268952 252682 224275 199490 189236 195569 179704 177460 199187 218565
9282 218565 207139 201216 210836 210715 204457 203140 217076 249269 276855 286036 299364 308075 323114
9269 323114 333306 334745 315342 311669 291802 290334 302970 309478 314590 312288 309675 307883 323377
$$ packed form
9357A78838J8390r823p841p859p79P355K7103J0002J5155K1395J2560J5849L2905
9344C13250J3787K13O505j8116j540j1062k5710j3328j6418j5172j7443j2139
9332B02827j419J2968l672o582j4835j755j900j1381j0941J5195R320j779J3076
9319A99122K2518J3080J0029J7590p030r069J8663J7249L32N786K3166L9059M8932
9306C99427J5608J0068J2270j0410l3241k7362l2996k2355o069j6561j0666M942
9294B82655R496j779k1420j6270k8407k4785j0254O333j5865k244K1727J9378
9282B18565j1426n923R620j21o258j317J3936L2193K7586R181J3328Q711J5039
9269C23114J0192J439j9403l673j9867j468J2636O508N112k302k613j792J5494
$$ plain form
9256 323377 322514 294061 265127 235358 217023 189018 172177 172202 167870 170159 166324 164890 176218
9243 176218 169645 173292 165190 145425 133156 139731 138574 151138 153228 152560 163078 164188 174463
9230 174463 168976 170557 168906 168511 182858 171374 157468 155455 149417 146440 155151 156172 141694 123348
9216 123348 103473 95672 85974 89422 85841 61668 67714 80442 86104 78644 68365 64884 55780
9203 55780 61987 71801 82997 82837 98346 115720 116292 113092 115866 107561 93889 64995 57053 52100
9189 52100 49052 55801 63538 74901 76504 67823 57112 62015 63194 71036 68647 69886 83555 79466
9175 79466 86140 86687 105789 119186 117237 127318 125107 127969 134547 129743 122586 112141 110724 87584
9161 87584 102594 119645 125607 131492 141648 129061 118916 95741 109132 100071 68044 56576
$$ packed form
9256C23377q63k8453k8934k9769j8335k8005j6841K5m332K289l835j434J1328
9243A76218o573L647q102j9765j2269O575j157J2564K090o68J0518J110J0275
9230A74463n487J581j651l95J4347j1484j3906k013o038k977Q711J021j4478j8346
9216A23348j9875p801r698L448l581k4173O046J2728N662p460j0279l481r104
9203E5780O207R814J1196j60J5509J7374N72l200K774q305j3672k8894p942m953
9189E2100l048O749P737J1363J603q681j0711M903J179P842k389J239J3669m089
9175G9466O674N47J9102J3397j949J0081k211K862O578m804p157j0445j417k3140
9161H7584J5010J7051N962N885J0156j2587j0145k3175J3391r061l2027j1468
$$ plain form
9149 56576 64972 84453 105113 95784 85361 57699 65117 79554 89758 94744 94520 115723 111649
9136 111649 121207 140234 137652 130927 143137 153688 160189 162765 157102 142601 124008 134889 137602
9123 137602 154762 160326 154981 166318 162056 167654 175239 182836 179302 180395 157144 150696 159665 168000
9109 168000 165238 170113 180070 178388 187025 196044 191984 174872 157303 140734 137336 141093 121016
9096 121016 98746 90634 100981 108274 101876 98441 86735 78574 91308 94228 90929 89133 90162
9083 90162 102603 104200 110000 118213 111678 120914 136407 132536 105885 98712 115613 116917 115891 128418
9069 128418 149565 142164 132986 128355 127915 124114 118824 118712 112907 100198 92826 113110 133602 157796
9055 157796 156907 153759 151058 153884 171547 184122 181715 184793 181199 159893 180964 195222 180860
$$ packed form
9149E6576Q396J9481K0660r329j0423k7662P418J4437J0204M986k24K1203m074
9136A11649R558J9027k582o725J2210J0551O501K576n663j4501j8593J0881K713
9123A37602J7160N564n345J1337m262N598P585P597l534J093k3251o448Q969Q335
9109A68000k762M875R957j682Q637R019m060j7112j7569j6569l398L757k0077
9096A21016k2270q112J0347P293o398l435j1706q161J2734K920l299j796J029
9083I0162J2441J597N800Q213o535R236J5493l871k6651p173J6901J304j026J2527
9069A28418K1147p401r178m631m40l801n290j12n805j2709p372K0284K0492K4194
9055A57796q89l148k701K826J7663J2575k407L078l594k1306K1071J4258j4362
$$ plain form
9042 180860 157344 160365 163050 157732 148670 139060 136100 151912 155990 149465 145981 131183 141735
9029 141735 141646 133510 138586 161472 157035 161495 167484 188806 208805 199269 191752 179118 167727 164570
9015 164570 161086 184690 165144 145816 144816 164219 159228 128422 98497 86025 73885 71670
9003 71670 83073 71498 57483 44296 49655 66653 66233 65330 62310 47365 51838 65748 77927
8990 77927 72299 66144 70027 74545 76978 89019 104092 100156 100823 108384 121195 133772 127849 122961
8976 122961 115655 130542 139355 141600 140354 140309 141007 135654 130790 147474 171227 183897 198911 218831
8962 218831 220431 209908 194632 178606 159844 131732 102665 102551 113270 102510 81994 63743
8950 63743 72189 85247 86592 72753 69377 63106 48485 51266 59573 60026 67878 65478 69281 72142
$$ packed form
9042A80860k3516L021K685n318r062r610k960J5812M078o525l484j4798J0552
9029A41735q9q136N076K2886m437M460N989K1322J9999r536p517j2634j1391l157
9015A64570l484K3604j9546j9328j000J9403m991l0806k9925j2472j2140k215
9003G1670J1403j1575j4015j3187N359J6998m20r03l020j4945M473J3910J2179
8990G7927n628o155L883M518K433J2041J5073l936O67P561J2811J2577n923m888
8976A22961p306J4887Q813K245j246m5O98n353m864J6684K3753J2670J5014J9920
8962B18831J600j0523j5276j6026j8762k8112k9067j14J0719j0760k0516j8251
8950F3743Q446J3058J345j3839l376o271j4621K781Q307M53P852k400L803K861
$$ plain form
8936 72142 78089 78062 96338 95227 103528 92747 73577 71183 73926 68506 63712 90610 122693 134620
8922 134620 137883 153780 157895 141174 149809 153477 168500 176746 171736 140974 103830 98062 101185
8909 101185 92170 79628 79354 83093 71122 70056 63491 71517 78192 77425 77178 62423 37302 43698
8895 43698 42883 38013 50319 56188 48581 15470 13494 34051 39424 55584 65529 68538 67007 68812
8881 68812 82054 83515 79129 84195 119068 134428 138300 166949 188812 205269 226559 233082 243990
8868 243990 270404 277948 282524 324452 381047 473798 597652 727678 850888 896149 743062
8857 743062 531382 383636 269881 198094 156811 130640 123700 120775 122042 115288 96942 85697
8845 85697 74137 53753 46761 57093 62616 63875 77126 79467 84250 71607 51491 46619 53911
$$ packed form
8936G2142N947k7J8276j111Q301j0781j9170k394K743n420m794K6898L2083J1927
8922A34620L263J5897M115j6721Q635L668J5023Q246n010l0762l7144n768L123
8909A01185r015j2542k74L739j1971j066o565Q026O675p67k47j4755k5121O396
8895D3698q15m870J2306N869p607l3111j976K0557N373J6160R945L009j531J805
8881F8812J3242J461m386N066L4873J5360L872K8649K1863J6457K1290O523J0908
8868B43990K6414P544M576M1928N6595R2751J23854J30026J23210M5261j53087
8857G43062k11680j47746j13755p1787m1283k6171o940k925J267o754j8346j1245
8845H5697j1560k0384o992J0332N523J259J3251K341M783j2643k0116m872P292
$$ plain form
8832 53911 67877 82418 85528 84222 88896 72709 74566 77145 71464 63726 57363 41829 34583 49905
8818 49905 53780 57685 52792 53905 61504 71578 80165 78355 62196 35808 32791 40149 55663 53462
8804 53462 61670 54146 39076 46386 57114 55178 60809 55487 62661 53110 54681 47670 52227 43288
8790 43288 39447 40372 38307 26734 29761 42961 48071 41528 35637 35857 40657 68286 69634 42525
8776 42525 41129 52917 71189 74720 62785 59332 61364 46166 47898 51110 43241 33744 44543
8763 44543 39702 14655 26380 16519 7636 13898 30349 26001 11443 9682 17078 36204 50132
8750 50132 36909 8929 -5694 -8714 -5353 14585 36719 38816 38552 25010 31431 35234 30428
8737 30428 22208 35832 58346 63247 62380 53242 30113 14857 8124 13751 31382 47743 58056
$$ packed form
8832E3911J3966J4541L110j306M674j6187J857K579n681p738o363j5534p246J5322
8818D9905L875L905m893J113P599J0074Q587j810j6159k6388l017P358J5514k201
8804E3462Q208p524j5070P310J0728j936N631n322P174r551J571p011M557q939
8790D3288l841R25k065j1573L027J3200N110o543n891K20M800K7629J348k7109
8776D2525j396J1788J8272L531j1935l453K032j5198J732L212p869r497J0799
8763D4543m841k5047J1725r861q883O262J6451m348j4558j761P396J9126J3928
8750E0132j3223k7980j4623l020L361J9938K2134K097k64j3542O421L803m806
8737C0428q220J3624K2514M901q67r138k3129j5256o733N627J7631J6361J0313
$$ plain form
8724 58056 61113 47844 33345 29197 30653 36002 41646 30240 37668 46926 28126 14852 5922
8711 5922 22890 27356 29171 28511 28608 23915 25661 21131 13592 20955 22034 22534 20269 18427 31915
8696 31915 18742 7918 17061 24406 28316 7808 5769 3149 238 12228 18174 23151 29483 33639
8682 33639 30044 13608 8704 32743 69370 59032 53156 35933 21472 15101 20796 26489 25624
8669 25624 19123 32966 38983 40527 32662 44343 51913 71239 51650 48999 60352 61759 59933
8656 59933 74412 84759 70234 47310 26689 33197 41420 37858 33946 35815 37103 42495 57229
8643 57229 62722 43061 35232 52001 42068 21812 27586 27788 43191 31347 34154 47410 48726
8630 48726 49008 47837 58645 59988 46131 36585 41106 40547 30518 29853 29867 40404 57868 67152 60836
$$ packed form
8724E8056L057j3269j4499m148J456N349N644j1406P428R258j8800j3274q930
8711E922J6968M466J815o60R7m693J746m530p539P363J079N00k265j842J3488
8696C1915j3173j0824R143P345L910k0508k039k620k911J1990N946M977O332M156
8682C3639l595j6436m904K4039L6627j0338n876j7223j4461o371N695N693q65
8669B5624o501J3843O017J544p865J1681P570J9326j9589k651J1353J407j826
8656E9933J4479J0347j4525k2924k0621O508Q223l562l912J869J288N392J4734
8643E7229N493j9661p829J6769r933k0256N774K02J5403j1844K807J3256J316
8630D8726K82j171J0808J343j3857r546M521n59j0029o65J4J0537J7464R284o316
$$ plain form
8615 60836 51938 49573 54853 63928 54545 68615 75518 80615 87635 75410 74150 76075 79533 80813
8601 80813 83111 79945 75166 76682 94299 100939 98370 110111 139011 179036 191845 178354 170152
8588 170152 178898 195615 207487 213574 208370 203698 207724 202971 208678 214103 194984 163182 146865
8575 146865 121582 104362 96850 103809 101971 80120 73452 74777 72763 68989 60702 65275 67635 60286
8561 60286 67792 74773 73819 67143 62147 48749 43739 57055 55432 65395 74108 90653 88197 78964
8547 78964 79271 79353 60859 67458 66177 70370 76978 75949 67676 63348 53162 47529 64386 64100 59047
8532 59047 65086 77701 78315 78217 74875 65920 51640 21570 28706 46935 55316 53522 54499 40082
8518 40082 17012 13415 30573 45415 63520 55966 50363 47969 45102 38210 38615 41069 47800 57013
$$ packed form
8615F0836q898k365N280R075r383J4070O903N097P020j2225j260J925L458J280
8601H0813K298l166m779J516J7617O640k569J1741K8900M0025J2809j3491q202
8588A70152Q746J6717J1872O087n204m672M026m753N707N425j9119l1802j6317
8575A46865k5283j7220p512O959j838k1851o668J325k014l774q287M573K360p349
8561F0286P506O981r54o676m996j3398n010J3316j623R963Q713J6545k456r233
8547G8964L07Q2j8494O599j281M193O608j029q273m328j0186n633J6857k86n053
8532E9047O039J2615O14r8l342q955j4280l0070P136J8229Q381j794R77j4417
8518D0082k3070l597J7158J4842J8105p554n603k394k867o892M05K454O731R213
$$ plain form
8504 57013 47905 43463 55813 54087 49141 36259 39574 44022 40199 39177 13807 5893 8694 29201
8490 29201 32534 38747 50022 53380 62356 63426 44135 40696 51689 40444 27005 24972 32714
8477 32714 26249 31276 39531 33626 40441 40182 44157 43203 33486 20262 9428 3647 9802 16280 1700
8462 1700 7050 26444 35415 28879 20694 14340 6051 10056 6562 16285 24954 28925 21228 15763 26830
8447 26830 35012 35527 48964 57550 45220 32809 23249 25463 19043 15513 14463 21089 30519 30232
8433 30232 29442 27299 22440 14502 12025 5419 15149 41035 41555 40147 24966 11970 16843 10018
8419 10018 15007 9352 25305 38790 28745 26062 18858 20393 23087 30333 38192 19702 15633 20256
8405 20256 27652 34735 36959 26909 16945 20927 21781 16323 15425 1013 -1370 15887 24611 31020
$$ packed form
8504E7013r108m442J2350j726m946j2882L315M448l823j022k5370p914K801K0507
8490B9201L333O213J1275L358Q976J070j9291l439J0993j1245j3439k033P742
8477C2714o465N027Q255n905O815k59L975r54r717j3224j0834n781O155O478j4580
8462A700N350J9394Q971o536q185o354q289M005l494R723Q669L971p697n465J1067
8447B6830Q182N15J3437Q586j2330j2411r560K214o420l530j050O626R430k87
8433C0232p90k143m859p938k477o606R730K5886N20j408j5181j2996M873o825
8419A0018M989n655J5953J3485j0045k683p204J535K694P246P859j8490m069M623
8405B0256P396P083K224j0050r964L982Q54n458q98j4412k383J7257Q724O409
$$ plain form
8391 31020 37619 40724 39084 31879 26012 37327 35198 24786 26939 25141 26948 24504 29331 33124
8377 33124 39227 50084 51049 37028 27804 31886 45255 60554 64871 66710 60103 59025 61047 52878
8363 52878 49736 41168 38535 34357 30204 26308 19226 13458 27584 46708 40651 48021 55588 46360
8349 46360 42929 53205 49082 42557 38383 53160 75961 68354 41255 27001 18013 10622 7797
8336 7797 24952 34467 38958 56492 49143 54420 56562 64080 76924 78433 66884 69340 67695 62234
8322 62234 35506 19995 40036 53899 56420 68437 89283 94949 87195 68545 55877 47315 36090
8309 36090 30830 39365 46512 51757 39837 45850 44432 50405 28435 15522 14050 40780 53618
8296 53618 51517 37296 26182 28233 17027 8206 21909 25327 22252 25071 25805 38890 50943
$$ packed form
8391C1020O599L105j640p205n867J1315k129j0412K153j798J807k444M827L793
8377C3124O103J0857R65j4021r224M082J3369J5299M317J839o607j078K022q169
8363E2878l142q568k633m178m153l896p082n768J4126J9124o057P370P567r228
8349D6360l431J0276m123o525m174J4777K2801p607k7099j4254q988p391k825
8336G797J7155R515M491J7534p349N277K142P518J2844J509j1549K456j645n461
8322F2234k6728j5511K0041J3863K521J2017K0846N666p754j8650j2668q562j1225
8309C6090n260Q535P147N245j1920O013j418N973k1970j2913j472K6730J2838
8296E3618k101j4221j1114K051j1206q821J3703L418l075K819P34J3085J2053
$$ plain form
8283 50943 53462 53386 45287 59568 61335 68809 67589 51616 24722 43141 73666 86096 107598
8270 107598 139717 163068 150302 111520 91354 83616 58405 61284 75555 77501 61696 65244
8258 65244 57631 45357 59288 55367 42998 8144 12115 19541 20043 21190 26172 31773 34021 44842
8244 44842 42977 42047 36139 31086 21215 12868 30106 45447 44065 62723 54561 49586 45260 38996
8230 38996 27996 31124 49283 64894 74530 90136 103649 114480 102365 81538 64882 61622
8218 61622 62641 45928 35171 35640 31112 15366 10321 16536 -6223 -15053 4258 33915 50907
8205 50907 42652 36881 30793 15912 21159 26591 20808 11477 10078 7212 16788 28061 23686 30649
8191 30649 33486 30036 42020 45408 49868 43263 30907 26388 23103 11268 8574 18911 12067 10494
$$ packed form
8283E0943K519p6q099J4281J767P474j220j5973k6894J8419L0525J2430K1502
8270A07598L2119K3351j2766l8782k0166p738k5211K879J4271J946j5805L548
8258F5244p613j2274J3931l921j2369l4854L971P426N02J147M982N601K248J0821
8244D4842j865r30n908n053r871q347J7238J5341j382J8658q162m975m326o264
8230C8996j1000L128J8159J5611R636J5606J3513J0831j2115k0827j6656l260
8218F1622J019j6713j0757M69m528j5746n045O215k2759q830J9311K9657J6992
8205E0907q255n771o088j4881N247N432n783r331j399k866R576J1273m375O963
8191C0649K837l450J1984L388M460o605j2356m519l285j1835k694J0337o844j573
$$ plain form
8177 10494 7870 13246 19264 24772 33213 49039 41829 27966 16550 14751 9343 -94 -3351 3205
8163 3205 -4947 -2834 6115 12531 7944 10155 22612 30508 34114 16071 -490 1331 17193 21430
8149 21430 8314 7707 5856 6648 10991 14991 18660 16755 36197 39831 36040 45182 44914 49637 40723
8134 40723 25345 21565 25425 6078 3383 15618 17505 12433 10633 3654 10931 9159 -10026 3967
8120 3967 13263 13386 27663 35191 44270 61325 53328 49011 39778 33167 20853 -183 -552 19549
8106 19549 21753 19821 13992 22770 47833 63122 49374 41709 40437 31842 28570 44099 47196 37854
8092 37854 32854 13507 11157 16729 29119 50320 45520 33139 29399 47805 48393 52412 69430
8079 69430 73150 36023 19303 30768 18306 5930 5602 21129 44145 45280 40442 29693 26448
$$ packed form
8177A0494k624N376O018N508Q441J5826p210j3863j1416j799n408r437l257O556
8163C205q152K113Q949O416m587K211J2457P896L606j8043j6561J821J5862M237
8149B1430j3116o07j851P92M343M000L669j905J9442L634l791R142k68M723q914
8134D0723j5378l780L860j9347k695J2235J887n072j800o979P277j772j9185J3993
8120C967R296J23J4277P528R079J7055p997m317r233o611j2314k1036l69K0101
8106A9549K204j932n829Q778K5063J5289j3748p665j272q595l272J5529L097r342
8092C7854n000j9347k350N572J2390K1201m800j2381l740J8406N88M019J7018
8079F9430L720l7127j6720J1465j2462j2376l28J5527K3016J135m838j0749l245
$$ plain form
8066 26448 23297 25817 28924 24429 16915 6387 2845 14015 27773 45673 56895 58653 59301 80115
8052 80115 94337 96499 111019 111930 116849 124828 137999 137569 111175 98693 101743 108131 100979 102106
8038 102106 99080 105787 126391 140302 158925 186552 221598 254613 276138 298337 319922 291068
8026 291068 246513 197416 165968 149132 110020 84173 66005 70452 75385 76819 68474 67901 81807
8013 81807 86446 85087 94027 106971 117791 112659 118961 115908 124363 138904 152356 181920 220578
8000 220578 255334 263758 239464 209500 169965 144515 135725 110781 107708 132558 158716 188537
7988 188537 210257 245157 299679 392537 468622 531289 555648 540775 469498 353875 248873
7977 248873 187426 143806 103855 86425 92339 91875 71995 65730 66145 77285 91425 72422 45824
$$ packed form
8066B6448l151K520L107m495p514j0528l542J1170J3758J7900J1222J758O48K0814
8052H0115J4222K162J4520R11M919P979J3171m30k6394j2482L050O388p152J127
8038A02106l026O707K0604J3911J8623K7627L5046L3015K1525K2199K1585k8854
8026B91068m4555m9097l1448j6836l9112k5847j8168M447M933J434q345n73J3906
8013H1807M639j359Q940J2944J0820n132O302l053Q455J4541J3452K9564L8658
8000B20578L4756Q424k4294k9964l9535k5450q790k4944l073K4850K6158K9821
7988A88537K1720L4900N4522R2858P6085O2667K4359j4873p1277j15623j05002
7977B48873o1447m3620l9951j7430N914m64j9880o265M15J1140J4140j9003k6598
$$ plain form
7964 45824 40637 71136 73456 80725 79811 74464 91579 99243 113428 123627 141932 164380 154903
7951 154903 144550 112375 97377 80866 86714 109002 102999 107143 113515 133271 158809 178177
7939 178177 185841 203707 220697 223571 230511 221130 191494 148886 111752 90677 85145 80808 84887
7926 84887 84387 76807 78194 81812 88535 80770 70421 50427 40038 37044 31586 35260 30649 33326
7912 33326 36264 35484 33548 39375 46534 39952 37033 41387 38851 31947 32087 25347 35651 49549 25525
7897 25525 39066 40639 41994 58109 48721 36138 22267 20910 5434 9796 34782 34320 8222
7884 8222 7007 8570 22128 38232 45229 35381 28281 43666 48579 28810 22992 16260 11394 13494
7870 13494 13180 8770 773 4799 11875 12564 6701 12173 11557 10898 16354 26335 19188 17244 22986 12855
$$ packed form
7964D5824n187L0499K320P269r14n347J7115P664J4185J0199J8305K2448r477
7951A54903j0353l2175j4998j6511N848K2288o003M144O372J9756K5538J9368
7939A78177P664J7866J6990K874O940r381k9636m2608l7134k1075n532m337M079
7926H4887n00p580J387L618O723p765j0349j9994j0389k994n458L674m611K677
7912C3326K938p80j936N827P159o582k919M354k536o904J40o740J0304J3898k4024
7897B5525J3541J573J355J6115r388j2583j3871j357j5476M362K4986m62k6098
7884H222j215J563J3558J6104O997r848p100J5385M913j9769n818o732m866K100
7870A3494l14m410p997M026P076O89n863N472o16o59N456R981p147j944N742j0131
$$ plain form
7854 12855 22420 29889 17053 2840 13997 22796 4324 18522 29485 12152 325 9434 -1765
7841 -1765 -6914 -245 16605 33903 20755 16707 27193 50212 55745 40626 18236 10443 21213
7828 21213 38494 17155 17206 10465 10975 15909 -1667 -15929 -4006 4694 8028 21158 36680 43794
7814 43794 47765 47681 37774 21813 -348 1052 -8866 -11671 -8828 17512 18222 23361 11399 9806
7800 9806 3966 -3159 6699 -1161 -3248 4697 -2135 3242 15455 17251 4786 -5449 -6369 -1132
7786 -1132 -2635 2356 -2680 2558 471 -2586 2747 2538 -4566 24647 29196 43164 47614 42337 30183
7771 30183 -46 -11309 -12293 -14361 2308 -3056 -8601 -1971 2231 12902 16407 16404 5414 -7507
7757 -7507 -10156 1526 1336 -13904 5252 9014 14679 3259 -16225 6504 5037 1311 29787
$$ packed form
7854A2855R565P469j2836j4213J1157Q799j8472J4198J0963j7333j1827R109j1199
7841a765n149O669J6850J7298j3148m048J0486K3019N533j5119k2390p793J0770
7828B1213J7281k1339N1o741N10M934j7576j4262J1923Q700L334J3130J5522P114
7814D3794L971q4r907j5961k2161J400r918k805K843K6340P10N139j1962j593
7800I806n840p125R858p860k087P945o832N377J2213J796j2465j0235r20N237
7786a132j503M991n036N238k087l057N333k09p104K9213M549J3968M450n277j2154
7771C0183l0229j1263r84k068J6669n364n545O630M202J0671L505lj0990j2921
7757g507k649J1682j90j5240J9156L762N665j1420j9484K2729j467l726K8476
$$ plain form
7744 29787 36605 27137 6778 -9201 -104 26444 31500 16860 16767 21569 12196 -7031 -28331 -38071
7730 -38071 -17810 -20747 -24336 -27252 -33069 -16735 17754 28297 16974 5453 20733 17527 -3372
7717 -3372 1956 12197 188 -19218 -14415 1077 -11000 -8955 1188 -794 -9876 -16413 -10875
7704 -10875 -4400 -12221 -14551 -10868 -781 -6164 -24821 -10582 -2554 3224 28020 38379 22746
7691 22746 5596 2819 9712 2052 8985 22356 9196 12351 23679 32972 29735 10501 -6941
7678 -6941 -12952 2643 13147 -1711 -4311 9172 22071 28484 36148 19160 12095 9911 18013
7665 18013 18792 4443 5145 5189 7404 4978 8563 8482 12671 6102 -754 -8885 -8884 -8006 -19807 -20214 -29440
7648 -29440 -21053 -12664 -701 -4444 7221 18836 38492 46078 43887 23509 15360 23305 29039
$$ packed form
7744B9787O818r468k0359j5979R097K6548N056j4640r3M802r373j9227k1300r740
7730c8071K0261k937l589k916n817J6334L4489J0543j1323j1521J5280l206k0899
7717c372N328J0241j2009j9406M803J5492j2077K045J0143j982r082o537N538
7704a0875O475p821k330L683J0087n383j8657J4239Q028N778K4796J0359j5633
7691B2746j7150k777O893p660O933J3371j3160L155J1328R293l237j9234j7442
7678f941o011J5595J0504j4858k600J3483J2899O413P664j6988p065k184Q102
7665A8013P79j4349P02M4K215k426L585q1M189o569o856q131JQ78j1801m07r226
7648b9440Q387Q389J1963l743J1665J1615J9656P586k191k0378q149P945N734
$$ plain form
7635 29039 10225 5776 9266 10562 12704 16944 16856 10934 11681 9336 4965 2058 -5777 -10362 -17876
7620 -17876 -16795 -34649 -26502 -15853 8413 19298 8022 -12670 -24649 -29174 -37502 -33767 -22373
7607 -22373 -17599 -11579 -28975 -18781 -6166 -3910 -5181 -126 -982 3298 829 2968 -11743 -19538
7593 -19538 -24731 -28888 -21277 -7593 10705 24849 30274 23075 12615 579 8459 3127 2778 2680
7579 2680 -3694 -16639 -13873 -7279 12283 10500 -15588 -32907 -36329 -19862 3444 -155 -8459
7566 -8459 -4855 -7177 -3660 -283 802 -8641 -23041 -4135 -460 -417 3734 7338 17152 22135 18350
7551 18350 16640 -7812 -29348 -18828 1841 12858 11647 2861 -18179 -31228 -16223 -2417
7539 -2417 -462 -7587 -2785 3252 -1144 8582 19686 11060 -2981 -4371 15152 34102 28697 22206
$$ packed form
7635B9039j8814m449L490J296K142M240q8n922P47k345m371k907p835m585p514
7620a7876J081j7854Q147J0649K4266J0885j1276k0692j1979m525q328L735J1394
7607b2373M774O020j7396J0194J2615K256j271N055q56M280k469K139j4711p795
7593a9538n193m157P611J3684J8298J4144N425p199j0460j2036P880n332l49r8
7579B680o374j2945K766O594J9562j783k6088j7319l422J6467K3306l599q304
7566h459L604k322L517L377J085r443j4400J8906L675M3M151L604R814M983l785
7551A8350j710k4452k1536J0520K0669J1017j211q786k1040j3049J5005J3806
7539b417J955p125M802O037m396R726J1104q626j4041j390J9523J8950n405o491
$$ plain form
7525 22206 26118 27644 41605 21780 -8282 -1183 -6835 443 20490 24018 3216 -18542 -5106
7512 -5106 13879 18633 504 -26681 -31249 -18697 -9335 2666 19323 27895 20915 19238 24923
7499 24923 19037 2186 7999 -6727 -19479 -20255 -16865 -3882 -2725 -9796 -22835 -1315 15834
7486 15834 12895 219 2722 6750 7849 -350 -419 15318 23832 23385 3430 -930 -6276 -11081 -7269
7471 -7269 8413 11439 15442 17390 19097 31018 19125 -984 3171 19652 14510 14403 8189 14564
7457 14564 37137 44204 43076 38918 12928 8925 17754 13889 14541 26092 18077 3941 14749 -2825
7443 -2825 -9919 2379 4873 3524 2938 23041 25804 3776 -9751 -10620 -8495 8564 9167 -4677
7429 -4677 -6381 20063 34103 7602 -2480 152 7643 5613 80 -12995 -22811 -21621 -598
$$ packed form
7525B2206L912J526J3961j9825l0062P099n652P278K0047L528k0802k1758J3436
7512e106J8985M754j8129k7185m568J2552R362J2001J6657Q572o980j677N685
7499B4923n886j6851N813j4726j2752p76L390J2983J157p071j3039K1520J7149
7486A5834k939j2676K503M028J099q199o9J5737Q514m47j9955m360n346m805L812
7471g269J5682L026M003J948J707J1921j1893k0109M155J6481n142j07o214O375
7457A4564K2573P067j128m158k5990m003Q829l865O52J1551q015j4136J0808j7574
7443b825p094J2298K494j349n86K0103K763k2028j3527q69K125J7059O03j3844
7429d677j704K6444J4040k6501j0082K632P491k030n533j3075r816J190K1023
$$ plain form
7416 -598 12863 5799 -2846 1022 15947 10219 545 -8092 -13277 -11028 9117 9102 8999 -11705 -19601
7401 -19601 7718 20207 14762 9278 -9642 -13309 -7608 -2427 -4607 1618 7948 -6141 -5418 -10417
7387 -10417 -11728 -1463 12988 20131 7479 -7930 -2679 13460 8011 -309 -4246 -9255 -1144
7374 -1144 -8641 -25335 -17692 -7739 -4825 -9164 818 19336 46210 36212 19865 4206 17361
7361 17361 27319 10680 17536 21993 5546 276 1352 5279 1759 -18871 -21147 -16500 -13913 -21030
7347 -21030 -13827 -14592 -148 -7452 -21559 -27094 -22383 -11785 -3482 910 -1072 11516 17226 23332
7333 23332 3952 -12362 -1300 9580 14954 8384 15292 8789 -4048 -161 7039 24679 31208
7320 31208 29016 2222 -8122 -2393 -5275 1590 8632 103 939 131 7999 1547 -4094 -1597 6333
$$ packed form
7416e98J3461p064q645L868J4925n728r674q637n185K249K0145j5j03k0704p896
7401a9601K7319J2489n445n484j8920l667N701N181k180O225O330j4089P23m999
7387a0417j311J0265J4451P143j2652j5409N251J6139n449q320l937n009Q111
7374a144p497j6694P643R953K914m339R982J8518K6874r998j6347j5659J3155
7361A7361R958j6639O856M457j6447n270J076L927l520k0630k276M647K587p117
7347b1030P203p65J4444p304j4107n535M711J0598Q303M392j982J2588N710O106
7333B3332j9380j6314J1062J0880N374o570O908o503j2837L887P200J7640O529
7320C1208k192k6794j0344N729k882O865P042q529Q36q08P868o452n641K497P930
$$ plain form
7305 6333 1973 9339 12107 15963 17016 -169 -9729 -12808 -15091 -17968 -6210 11035 8636 -319
7291 -319 19372 28118 32285 30800 21612 27158 26477 11629 -4375 -3086 255 -15312 -25679 -5651
7277 -5651 3548 5233 12075 19174 14227 13634 8358 6571 14006 25424 12159 12681 4169 6224 1495
7262 1495 -14581 -25835 -26713 -13659 -6458 2455 -7367 -14939 -11190 -5931 -15925 -30845 -40789 -35780
7248 -35780 -26776 -21175 -16475 -7796 -11852 -5588 -10281 -10928 -12599 -26116 -31849 -13006 -1815 -5671
7234 -5671 -7494 -11186 -4856 9702 6453 11017 18204 18477 31393 26163 15347 701 5138 8375
7220 8375 18245 20894 18634 14774 14148 12336 -4044 -12374 -2603 10281 10869 -2126 4887 14964
7206 14964 9157 -1337 413 -2393 5084 2538 7044 6800 -5534 -8519 1470 9803 -8575 -11335
$$ packed form
7305F333m360P366K768L856J053j7185r560l079k283k877J1758J7245k399q955
7291c19J9691Q746M167j485r188N546o81j4848j6004J289L341j5567j0367K0028
7277e651R199J685O842P099m947n93n276j787P435J1418j3265N22q512K055m729
7262A495j6076j1254q78J3054P201Q913r822p572L749N259r994j4920r944N009
7248c5780R004N601M700Q679m056O264m693o47j671j3517n733J8843J1191l856
7234e671j823l692O330J4558l249M564P187K73J2916n230j0816j4646M437L237
7220H375R870K649k260l860o26j812j6380q330R771J2884N88j2995P013J0077
7206A4964n807j0494J750k806P477k546M506k44j2334k985R989Q333j8378k760
$$ plain form
7192 -11335 -14295 -7178 11225 11137 6648 22563 25836 6725 -26269 -46993 -37990 -31909 -16251 -4550
7178 -4550 -2216 12051 9484 -791 2460 6383 14924 882 -527 765 1107 -9097 -4592 4139
7164 4139 6964 12185 1244 9481 39964 53947 48687 21062 30473 28007 21299 16634 20319 8622
7150 8622 12750 -1327 -10641 -6433 -4833 -677 -3932 9185 651 -1921 3350 -1492 9117 2159
7136 2159 -3800 79 6110 19400 10042 -9732 -8635 -1383 21210 35633 25652 22403 12638 14481
7122 14481 15428 779 -8526 2223 19412 19867 16667 24447 19941 3539 7404 -3217 9159 14693
7108 14693 11689 -196 13845 5721 51 726 -12561 -30056 -32987 -23285 -16771 10265 19674 -8148
7094 -8148 -3257 12737 4719 -11317 -13735 -25966 -13643 -3402 7407 4815 -1180 -7165 -6084
$$ packed form
7192a1335k960P117J8403q8m489J5915L273j9111l2994k0724R003O081J5658J1701
7178d550K334J4267k567j0275L251L923Q541j4042j409J292L42j0204M505Q731
7164D139K825N221j0941Q237L0483J3983n260k7625R411k466o708m665L685j1697
7150H622M128j4077r314M208J600M156l255J3117q534k572N271m842J0609o958
7136B159n959L879O031J3290r358j9774J097P252K2593J4423r981l249r765J843
7122A4481R47j4649r305J0749J7189M55l200P780m506j6402L865j0621J2376N534
7108A4693l004j1885J4041q124n670O75j3287j7495k931R702O514K7036R409k7822
7094h148M891J5994q018j6036k418j2231J2323J0241J0809k592n995n985J081
$$ plain form
7081 -6084 -16006 -19278 -19108 -11700 -4324 5783 15087 4976 -19498 -18613 -9038 -7362 -12230 -17842 -4778
7066 -4778 -4636 5041 5216 -9452 -18336 -15866 -13167 -10265 -19546 -41240 -23743 -11982 949 -7966
7052 -7966 -8939 -1550 5547 -15800 -25442 -24133 -33680 -31212 -26952 -17074 -1962 3256 -7615 18987
7038 18987 6050 -4532 14173 17324 17383 6299 9296 -1176 -10329 -8070 -538 6844 -6867 -2158
7024 -2158 6496 6947 23523 19200 10715 18841 14913 -5826 -15627 -573 -8168 -17224 -15941 5163
7010 5163 15477 180 -11204 -18628 -24821 -46334 -33012 -9991 -8782 -10225 1237 7287 11126
6997 11126 1711 14677 1231 -35785 -45303 -32124 -17834 -4687 6425 6707 -8168 -26974 -31497
6984 -31497 -34204 -17966 -12446 -14037 -11540 -22395 -21853 -10503 -15995 -18199 -12171 -4438 -5985 -957
$$ packed form
7081f084r922l272J70P408P376J0107R304j0111k4474Q85R575J676m868n612J3064
7066d778J42R677J75j4668q884K470K699K902r281k1694J7497J1761J2931q915
7052g966r73P389P097k1347r642J309r547K468M260R878J5112N218j0871K6602
7038A8987j2937j0582J8705L151N9j1084K997j0472r153K259P532P382j3711M709
7024b158Q654M51J6576m323q485Q126l928k0739r801J5054p595r056J283K1104
7010E163J0314j5297j1384p424o193k1513J3322K3021J209j443J1462O050L839
6997A1126r415J2966j3446l7016r518J3179J4290J3147J1112K82j4875j8806m523
6984c1497k707J6238N520j591K497j0855N42J1350n492k204O028P733j547N028
$$ plain form
6970 -957 -3758 5224 5769 17570 -5954 -8540 -19912 -31217 -23408 -14213 -18209 -10907 7947 9080
6956 9080 -9508 -10287 589 5822 -17318 -12226 -13962 8055 25446 20669 26410 16034 1097
6943 1097 -11447 -16742 -17520 6932 14868 554 -18386 -4901 5129 -6019 -37053 -43610 -34806
6930 -34806 -20645 -10290 13544 10569 19486 38076 39013 30750 9182 -9322 -11580 8938 15783
6917 15783 6642 -2299 -994 1045 7989 11805 22543 8975 3369 -6070 -19826 -12658 -15790 -16127
6903 -16127 -11412 1537 5514 4955 1333 9442 12946 14310 20252 24918 32490 23838 21689 13522 -9934
6888 -9934 -9876 -14746 -28238 -24349 -17221 -7632 -3279 1080 13982 8103 -2497 -9793 -13171 -7523 -8481
6873 -8481 -17511 -1762 11887 5477 -2639 1158 -10739 -19552 -13502 -20804 -29109 -25995 -17785 457
$$ packed form
6970i57k801Q982N45J1801k3524k586j1372j1305P809R195l996P302J8854J133
6956I080j8588p79J0876N233k3140N092j736K2017J7391m777N741j0376j4937
6943A097j2544n295p78K4452P936j4314j8940J3485J0030j1148l1034o557Q804
6930c4806J4161J0355K3834k975Q917J8590R37q263k1568j8504k258K0518O845
6917A5783r141q941J305K039O944L816J0738j3568n606r439j3756P168l132l37
6903a6127M715J2949L977n59l622Q109L504J364N942M666P572q652k149q167k3456
6888i934N8m870j3492L889P128R589M353M359J2902n879j0600p296l378N648r58
6873h481r030J5749J3649o410q116L797j1897q813O050p302q305L114Q210J8242
$$ plain form
6859 457 8096 -3390 -5672 -922 -11657 -9315 -4039 16781 17608 2354 -8635 4203 16481 27337
6845 27337 21420 20763 23025 29346 29957 10010 12623 25952 36416 24931 15904 7335 -11980 -11911
6831 -11911 -3860 -16787 -18715 -8876 15306 10880 -4184 3184 9484 1802 -4695 -4621 1687 140
6817 140 -3043 -16276 -16174 -15947 -20278 -9796 -8354 -4738 -6169 -3675 -17967 -11881 -4501 -11356 -16247
6802 -16247 -4641 4542 6089 15488 37442 43371 35705 18748 8318 6456 16696 29136 31670
6789 31670 21876 13941 7013 1911 4769 17520 10820 7152 -6934 -14487 3267 1733 -11682 -24490
6775 -24490 -23564 -26242 -25118 -11224 -7921 -3258 -2303 -25843 -16048 -3672 -5944 -10197 817 12514
6761 12514 7370 5556 -2671 5632 -8095 -10181 5499 8692 19448 24536 29283 20236 2820 1444
$$ packed form
6859D57P639j1486k282M750j0735K342N276K0820Q27j5254j0989J2838J2278J0856
6845B7337n917o57K262O321O11j9947K613J3329J0464j1485r027q569j9315O9
6831a1911Q051j2927j928R839K4182m426j5064P368O300p682o497P4O308j547
6817A40l183j3233J02K27m331J0482J442L616j431K494j4292O086P380o855m891
6802a6247J1606R183J547R399K1954N929p666j6957j0430j862J0240J2440K534
6789C1670r794p935o928n102K858J2751o700l668j4086p553J7754j534j3415j2808
6775b4490R26k678J124J3894L303M663R55k3540R795J2376k272m253J1014J1697
6761A2514n144j814q227Q303j3727k086J5680L193J0756N088M747r047j7416j376
$$ plain form
6747 1444 17575 20684 24964 27810 6252 8363 2254 -19027 -14450 -5135 9752 2372 -9187 -6797
6733 -6797 -17859 -25714 -28904 -29256 -27592 -8727 6155 5846 -9615 -9750 -17641 5619 23909 26582
6719 26582 30368 32755 22863 12816 9829 9683 -5219 -8845 13490 25277 14338 -12375 -34052
6706 -34052 -32719 -17614 1828 -2244 -6457 -15187 -30247 -27566 -33039 -49355 -40529 -39247 -34369 -31731
6692 -31731 -26297 -20893 -9654 -2613 -11159 -13530 -12535 -13485 -11850 2115 -8546 -23807 -11903 -19828
6678 -19828 -25639 -12280 -4062 1215 -3062 8249 7296 11834 3539 -10028 -3990 1768 28560 30408
6664 30408 20936 16535 3552 4845 -16186 10969 31983 38926 46156 61483 61072 47368 31329
6651 31329 23227 2973 4387 10168 7262 5133 -12202 -14914 -16519 -18258 -16121 -12295 -17170 -25519
$$ packed form
6747A444J6131L109M280K846k1558K111o109k1281M577R315J4887p380j1559K390
6733f797j1062p855l190l52J664J8865J4882l09j5461j35p891K3260J8290K673
6719B6582L786K387r892j0047k987j46j4902l626K2335J1787j0939k6713k1677
6706c4052J333J5105J9442m072m213q730j5060K681n473j6316Q826J282M878K638
6692c1731N434N404J1239P041q546k371R95r50J635J3965j0661j5261J1904p925
6678a9828n811J3359Q218N277m277J1311r53M538q295j3567O038N758K6792J848
6664C0408r472m401j2983J293k1031K7155K1014O943P230J5327m11j3704j6039
6651C1329q102k0254J414N781k906k129j7335k712j605j739K137L826m875q349
$$ plain form
6637 -25519 -21571 -6702 -4547 -16654 -18197 -13545 -21720 -28829 -32257 -24246 -14584 -846 3573 4851
6623 4851 -9281 -17865 -26323 -30677 -12645 -3420 -1777 -13026 -8257 -24151 -36563 -19543 -16514
6610 -16514 -24108 -22722 -5551 -2545 1618 3903 1448 -4479 -11936 -5597 -5605 -17278 -8356 -9562 -13535
6595 -13535 -12312 -19233 -25310 -24904 -31468 -25864 -11906 -1039 3048 1085 7090 17125 16881 2948
6581 2948 -20709 -16173 11602 27987 31770 17199 -2788 -5871 6093 1018 3998 2785 6069
6568 6069 7576 9580 14182 4000 2124 -8696 -19318 -19269 -17252 -15323 -2226 -2453 -24390 -16654
6554 -16654 6555 11345 4532 10596 11962 10538 6566 -12025 -16690 -10612 -7276 4357 14287 -5948
6540 -5948 -10659 -6312 949 -3488 -18718 -32088 -18355 7906 22098 19544 5162 -6436 -11706
$$ packed form
6637b5519L948J4869K155j2107j543M652q175p109l428Q011R662J3738M419J278
6623D851j4132q584q458m354J8032R225J643j1249M769j5894j2412J7020L029
6610a6514p594J386J7171L006M163K285k455n927p457O339qj1673Q922j206l973
6595a3535J223o921o077M06o564N604J3958J0867M087j963O005J0035k44j3933
6581B948k3657M536K7775J6385L783j4571j9987l083J1964n075K980j213L284
6568F069J507K004M602j0182j876j0820j0622M9K017J929J3097k27k1937P736
6554a6654K3209M790o813O064J366j424l972j8591m665O078L336J1633R930k0235
6540e948m711M347P261m437j5230j3370J3733K6261J4192k554j4382j1598n270
$$ plain form
6527 -11706 -19245 -10765 -12800 9301 17046 16707 10338 7968 12540 9627 8019 5793 6191 8674 13411
6512 13411 12436 21621 23981 28500 43226 38814 23863 8365 3055 859 -1653 -2563 -8679 -18359
6498 -18359 -31166 -19921 -21324 -17064 617 14275 8692 1411 4606 -11117 -16070 -16841 -14428 -2562
6484 -2562 6683 -10425 -12882 -5047 8286 21114 12980 456 -2214 -4578 -5360 -11005 -5868 5432
6470 5432 6668 -1792 1774 -9906 -23669 -33444 -33584 -24170 -16357 -15853 -24689 -15291 -12186 -17946 -23249
6455 -23249 -30465 -32811 -12897 -16805 -39467 -39511 -24943 -8158 1689 8479 1333 1440 3342 -6682
6441 -6682 -7288 -8740 -10909 -11367 -20401 -22313 4977 15559 15279 4227 11108 14240 -3255 -9594 -11326
6426 -11326 -13121 -27858 -40015 -37071 -23503 -18754 -2326 -2245 2742 -862 -1872 -17163 -21152 -18803
$$ packed form
6527a1706p539Q480k035K2101P745l39o369k370M572k913j608k226L98K483M737
6512A3411r75R185K360M519J4726m412j4951j5498n310k196k512r10o116r680
6498a8359j2807J1245j403M260J7681J3658n583p281L195j5723m953p71K413J1866
6484b562R245j7108k457P835J3333J2828q134j2524k670k364p82n645N137J1300
6470E432J236q460L566j1680j3763r775j40R414P813N04q836R398L105n760n303
6455b3249p216k346J9914l908k2662m4J4568J6785R847O790p146J07J902j0024
6441f682o06j452k169m58r034j912K7290J0582k80j1052O881L132j7495o339j732
6426a1326j795j4737j2157K944J3568M749J6428Q1M987l604j010j5291l989K349
$$ plain form
6412 -18803 -20528 -29334 -25059 -15191 -5604 -4562 -15287 -27910 -36753 -35653 -27346 -3826 18317 14906
6398 14906 13003 8914 16037 4753 -9229 -7741 -1967 2147 5911 12718 22908 5072 -18727
6385 -18727 -15115 -11504 -13647 -18581 1247 -5073 -17822 -21349 -18064 -18297 -8943 -7254 -3798 -11927
6371 -11927 -35015 -54945 -49723 -37899 -35930 -31660 -38686 -46627 -32821 -26115 -3027 -1059 -1736 -13303
6357 -13303 -17274 -6944 1624 -1912 -20263 -17144 -2830 8558 1128 -14799 -17218 -24881 -12248
6344 -12248 -11820 -11984 -6292 5992 4547 -6329 52 16179 14950 7955 -7219 -1721 -15912 -22357
6330 -22357 -9496 12919 10903 -8581 -8344 10073 20240 17888 5697 -5719 -2120 -4711 -4970
6317 -4970 3219 -21557 -41341 -39902 -36426 -19799 -16519 -29724 -43266 -33023 -29061 -25203 -5604
$$ packed form
6412a8803j725q806M275R868R587J042j0725j2623q843J100Q307K3520K2143l411
6398A4906j903m089P123j1284j3982J488N774M114L764O807J0190j7836k3799
6385a8727L612L611k143m934J9828o320j2749l527L285k33R354J689L456q129
6371a1927k3088j9930N222J1824J969M270p026p941J3806O706K3088J968o77j1567
6357a3303l971J0330Q568l536j8351L119J4314J1388p430j5927k419p663J2633
6344a2248M28j64N692J2284j445j0876O381J6127j229o995j5174N498j4191o445
6330b2357J2861K2415k016j9484K37J8417J0167k352j2191j1416L599k591k59
6317d970Q189k4776j9784J439L476J6627L280j3205j3542J0243L962L858J9599
$$ plain form
6304 -5604 10458 17168 27958 31845 26605 3865 -5148 -2373 -12192 -19769 -22231 -23561 -18749 -1355
6290 -1355 5399 7482 -1293 7182 3826 796 -4916 -11463 -16456 -5878 -14210 -11053 -13826 -7253 -1450
6275 -1450 -5760 4550 19517 14576 -688 -232 -12376 -31358 -42744 -42730 -23306 -5322 -8574 -26582
6261 -26582 -43659 -35376 -4044 6671 17069 14935 1803 -7248 -12381 -6687 -11786 -3959 4623
6248 4623 6317 -7009 -13690 -6431 -6019 12504 20617 28748 18578 10510 3308 7896 36770 57008
6234 57008 47916 50116 39505 24123 2208 5416 1838 -10554 -4414 15122 11798 7610 3248
6221 3248 -11034 -2507 1164 15442 10818 8247 6816 8165 8043 14720 27413 29164 26988 10353
6207 10353 8364 11714 11610 3426 5444 -644 -6035 -10356 -14965 -34751 -17913 6393 6984 10948
$$ packed form
6304e604J6062O710J0790L887n240k2740r013K775r819p577k462j330M812J7394
6290a355O754K083q775Q475l356l030n712o547m993J0578q332L157k773O573N803
6275a450m310J0310J4967m941j5264M56j2144j8982j1386J4J9424J7984l252j8008
6261b6582j7077Q283L1332J0715J0398k134j3132r051n133N694n099P827Q582
6248D623J694j3326o681P259M12J8523Q113Q131j0170q068p202M588K8874K0238
6234E7008r092K200j0611j5382k1915L208l578j2392O140J9536l324m188m362
6221C248j4282Q527L671J4278m624k571j431J349j22O677J2693J751k176j6635
6207A0353j989L350j04q184K018o088n391m321m609j9786J6838K4306N91L964
$$ plain form
6193 10948 758 -10362 -18771 -17249 -6125 -17394 -23694 -26710 -32649 -19072 -8928 -4443 -13510
6180 -13510 -13050 -11390 8778 22090 -7432 -21925 -28238 -21282 -12367 -13439 -19472 -16030 -5454 2800
6166 2800 -5425 2945 4919 10172 -5156 -10640 -6512 -1774 3552 8702 16794 15312 7788 884 -1931
6151 -1931 -13851 -6083 10800 11534 14791 12876 16524 11519 -37 -11980 -16276 -19239 -8519 2491
6137 2491 7385 -5532 -21697 -23277 -2175 -5178 -17917 -16239 -3045 14483 8493 -2979 -1939
6124 -1939 -9261 -20680 -22290 -8237 -16697 -18572 -31004 -31127 -21018 -2269 2315 -2795 1538 10781
6110 10781 13265 11700 13178 27252 36535 34157 13060 13903 7368 4691 10317 2676 -16188 -22627
6096 -22627 -9262 -21255 -29157 -33769 -9381 -6074 2394 5589 -1114 8169 9925 1555 15832 -5096
$$ packed form
6193A0948j0190j1120q409J522J1124j1269o300l016n939J3577J0144M485r067
6180a3510M60J660K0168J3312k9522j4493o313O956Q915j072o033L442J0576Q254
6166B800q225Q370J974N253j5328n484M128M738N326N150Q092j482p524o904k815
6151a931j1920P768J6883P34L257j915L648n005j1556j1943m296k963J0720J1010
6137B491M894j2917j6165j580K1102l003j2739J678J3194J7528n990j1472J040
6124a939p322j1419j610J4053q460j875j2432j23J0109J8749M584n110M333R243
6110A0781K484j565J478J4074R283k378k1097Q43o535k677N626p641j8864o439
6096b2627J3365j1993p902m612K4388L307Q468L195o703R283J756q370J4277k0928
$$ plain form
6082 -5096 -21701 -4008 3228 3235 14209 19788 14475 7365 -11874 -10258 4055 -4519 -13191 -14327
6068 -14327 -17909 3824 -853 -19470 -5985 421 -9502 -12189 -5159 -9589 -8025 -9011 -15732 -29361
6054 -29361 -41187 -37125 -32249 -11464 -4917 -746 17689 17668 3629 821 -489 -10678 -13120 -4067
6040 -4067 -6440 -2396 -3055 -4137 4264 -3933 -6866 -8808 -4890 -313 -10248 -3288 7782 17413 13974
6025 13974 -3828 -10244 -2892 -6056 -8312 2181 14147 7470 -4716 -9911 -24307 -36200 -28126
6012 -28126 -21673 -7379 5660 13765 1869 -6547 -8581 -6748 12566 2585 4869 15142 13748
5999 13748 22455 24254 10145 10256 11889 23468 21268 24091 26785 28924 6995 4212 9915 -38
5985 -38 -5498 -8773 -19820 -3325 -1378 1398 14677 10433 5236 -2512 -7027 -13653 -25528 -6338
$$ packed form
6082e096j6605J7693P236PJ0974N579n313p110j9239J616J4313q574q672j136
6068a4327l582K1733m677j8617J3485O406r923k687P030m430J564r86o721j3629
6054b9361j1826M062M876K0785O547M171J8435k1j4039k808j310j0189k442R053
6040d067k373M044o59j082Q401q197k933j942L918M577r935O960J1070R631l439
6025A3974j7802o416P352l164k256J0493J1966o677j2186n195j4396j1893Q074
6012b8126O453J4294J3039Q105j1896q416k034J833J9314r981K284J0273j394
5999A3748Q707J799j4109J11J633J1579k200K823K694K139k1929k783N703r953
5985c8n460l275j1047J6495J947K776J3279m244n197p748m515o626j1875J9190
$$ plain form
5971 -6338 4988 2087 -27791 -37208 -41754 -28256 -23334 -8551 -2979 -3350 -6175 243 10439 7514
5957 7514 11785 8897 11522 14014 16190 11212 14953 10507 3439 -7136 -16917 -8990 -17154 -13745 -84
5942 -84 -2986 7681 13295 6839 -2468 -1346 -10543 -29146 -29104 -20899 -16175 5676 -955 -10005 -11258
5927 -11258 -17784 -22117 -15484 4422 9764 18034 10668 9871 6107 9946 7751 7605 3201 294 4859
5912 4859 -817 3297 7660 3706 2747 11624 -3598 -18283 -8234 -14880 -13220 -4509 -16583 -27459
5898 -27459 -25798 -29575 -8242 21 -8920 -14762 -9206 -21841 -21277 -23826 -20342 -14791 -1604 -4502
5884 -4502 -16658 -21611 -17892 -13543 -5049 11640 2238 -6947 -1409 4342 6059 3332 -14339 -13224
5870 -13224 -19197 -13724 -2204 6482 19732 28695 18277 10275 7750 -6003 6103 16510 7720
$$ packed form
5971f338J1326k901k9878r417m546J3498M922J4783N572l71k825O418J0196k925
5957G514M271k888K625K492K176m978L741m446p068j0575r781P927q164L409J3661
5942h4k902J0667N614o456r307J122r197j8603M2Q205M724K1851o631r050j253
5927a1258o526m333O633J9906N342Q270p366p97l764L839k195j46m404k907M565
5912D859n676M114M363l954r59Q877j5222j4685J0049o646J660Q711j2074j0876
5898b7459J661l777K1333Q263q941n842N556j2635N64k549L484N551J3187k898
5884d502j2156m953L719M349Q494J6689r402r185N538N751J717k727j7671J115
5870a3224n973N473J1520Q686J3250Q963j0418q002k525j3753J2106J0407q790
$$ plain form
5857 7720 4651 2673 5272 18295 34413 52433 54809 42776 14893 8768 16743 15602 1672
5844 1672 -23445 -19680 666 7162 -1808 -12557 -1014 -5370 -5671 6819 10749 18042 18232 16091
5830 16091 9611 -6494 -15870 -3587 -191 -15342 -15828 -15707 -18950 -17360 -13939 -5319 -12789 -8543
5816 -8543 -17358 -24553 -10985 6374 4632 3093 11565 4981 11291 5970 -4475 -5403 -11220 -27491
5802 -27491 -25762 -15263 -3084 4309 8131 9955 -15461 -22474 -19908 -18837 -27065 -15801 -1497
5789 -1497 3299 -5422 -15919 -18042 -7561 4808 -9637 -8983 3084 -12603 -12175 -5594 -184 -7002
5775 -7002 -12166 -25025 -31000 -16086 -16147 -18925 -5698 -2570 -3010 -158 7051 5058 -3861 -17374 -27670
5760 -27670 -25941 -9777 1881 -11933 -2924 6264 -4562 -16973 -6418 3296 13910 31934 33992
$$ packed form
5857G720l069j978K599J3023J6118J8020K376j2033k7883o125P975j141j3930
5844A672k5117L765K0346O496q970j0749J1543m356l01J2490L930P293J90k141
5830A6091o480j6105r376J2283L396j5151m86J21l243J590L421Q620p470M246
5816h543q815p195J3568J7359j742j539Q472o584O310n321j0445r28n817j6271
5802b7491J729J0499J2179P393L822J824k5416p013K566J071q228J1264J4304
5789a497M796q721j0497k123J0481J2369j4445O54J2067j5687M28O581N410o818
5775g002n164j2859n975J4914o1k778J3227L128m40K852P209j993q919j3513j0296
5760b7670J729J6164J1658j3814R009R188j0826j2411J0555R714J0614J8024K058
$$ plain form
5747 33992 13670 -23642 -16068 -11380 -19378 -12460 2574 14750 -1317 -12692 -7376 -5564 -5404
5734 -5404 -4737 9397 24043 13502 -18472 -10277 5878 10355 11229 19594 10493 1504 9858 15023
5720 15023 6398 854 -4646 -6611 5836 2135 2257 1556 -13846 -11014 -10322 -11215 -25037 -28089 -16484
5705 -16484 -24767 -17507 -11219 -11472 -22796 -5619 -11453 -19433 -5757 -2830 -7858 -13615 7255 9999
5691 9999 -4577 -25138 -31223 -19731 -20527 -27467 -32286 -33408 -27449 -16094 -914 2532 3527 -1797
5677 -1797 4809 -1984 6629 16750 18412 26664 26317 12832 9464 6661 9830 12675 15505 36827
5663 36827 32789 26222 22339 15703 21590 35298 24908 18423 15009 9786 -2977 -10107 -22193 -30772
5649 -30772 -28820 -10036 10740 8782 13858 9605 -1726 -2500 3298 -3554 7778 15734 14888 11692
$$ packed form
5747C3992k0322l7312P574M688p998O918J5034J2176j6067j1375N316J812J60
5734e404O67J4134J4646j0541l1974Q195J6155M477Q74Q365r101q989Q354N165
5720A5023q625n544n500j965J2447l701J22p01j5402K832O92q93j3822l052J1605
5705a6484q283P260O288k53j1324J7177n834p980J3676K927n028n757K0870K744
5691I999j4576k0561o085J1492p96o940m819j122N959J1355J5180L446R95n324
5677a797O606o793Q613J0121J662Q252l47j3485l368k803L169K845K830K1322
5663C6827m038o567l883o636N887J3708j0390o485l414n223j2763p130j2086q579
5649c0772J952J8784K0776j958N076m253j1331p74N798o852J1332P956q46l196
$$ plain form
5635 11692 -2918 -3730 -3127 -796 -16065 -25129 -14405 3982 15529 23638 24135 23922 -430 -11328
5621 -11328 -6145 5953 13701 18196 10087 -5456 -14808 -6537 -4774 -7844 -1684 -5222 -2538 4557
5607 4557 -306 6719 8848 18709 12938 8102 3701 13340 32114 21483 13936 16554 19461 -1515
5593 -1515 -7877 -6073 -8900 3942 -5777 -7389 -20381 -29525 -35612 -29640 -8978 -8333 -33016 -22555
5579 -22555 -14454 -3184 11857 336 -8706 -2072 3136 4933 5501 7130 4727 1439 2531 13651
5565 13651 13356 21859 14442 -7401 -18999 -29176 -44337 -28015 -4818 -5409 -7664 -5665 1621 5265
5551 5265 9072 -4203 3096 -10917 -26908 -40419 -30171 -28497 -18362 -8463 -6766 -15190 -17214
5538 -17214 -9216 1361 9782 4212 -14735 -18947 -8272 -2583 3580 -8868 -13391 -4886 -8733 -9830
$$ packed form
5635A1692j4610q12O03K331j5269r064J0724J8387J1547Q109M97k13k4352j0898
5621a1328N183J2098P748M495q109j5543r352Q271J763l070O160l538K684P095
5607D557m863P025K129R861n771m836m401R639J8774j0631p547K618K907k0976
5593a515o362J804k827J2842r719j612j2992r144o087N972K0662O45k4683J0461
5579b2555Q101J1270J5041j1521r042O634N208J797N68J629k403l288J092J1120
5565A3651k95Q503p417k1843j1598j0177j5161J6322K3197n91k255J999P286L644
5551E265L807j3275P299j4013j5991j3511J0248J674J0135R899J697q424k024
5538a7214P998J0577Q421n570j8947m212J0675N689O163j2448m523Q505l847j097
$$ plain form
5524 -9830 -2207 -1043 5462 -1364 -24214 -26296 -25909 -25158 -16941 -11179 -11431 -13923 2178 8516 6278
5509 6278 8487 -51 2886 18178 23964 1507 -12666 -9210 -7463 -32839 -30975 -15727 -18893 -17021
5495 -17021 -14577 -22741 -21322 -1263 3737 -5107 -15642 -8740 -12794 -9297 -3450 -7661 -8922 -22234
5481 -22234 -23753 3847 -854 -14642 -9848 -9464 -13721 -9404 -2180 -3541 -14165 -20668 -5162 11486
5467 11486 19410 17055 7784 6061 29765 11638 -24099 -20484 -15136 -28375 -19950 -17459 -18606 -21224
5453 -21224 -38581 -43639 -55476 -49714 -43138 -24533 -759 -2461 3946 277 -4363 10334 16252
5440 16252 -4062 283 6521 14753 28417 28871 3455 -20068 -23350 -14957 -1150 -228 -12145 -1260
5426 -1260 13777 35036 37252 15294 3624 -8207 -6791 -6672 -14223 -9352 -23331 -25238 -30974 -25976
$$ packed form
5524i830P623J164O505o826k2850k082L87P51Q217N762k52k492J6101O338k238
5509F278K209q538K937J5292N786k2457j4173L456J747k5376J864J5248l166J872
5495a7021K444q164J419K0059N000q844j0535O902m054L497N847m211j261j3312
5481b2234j519K7600m701j3788M794L84m257M317P224j361j0624o503J5506J6648
5467A1486P924k355r271j723K3704j8127l5737L615N348j3239Q425K491j147k618
5453b1224j7357n058j1837N762O576J8605K3774j702O407l669m640J4697N918
5440A6252k0314M345O238Q232J3664M54k5416k3523l282Q393J3807R22j1917J0885
5426a260J5037K1259K216k1958j1670j1831J416J19p551M871j3979j907n736M998
$$ plain form
5412 -25976 -34600 -24656 -26649 -24812 -17842 -19242 -28823 -16198 -21082 -17201 -13346 -17853 -29267 -7880
5398 -7880 -11267 -16810 -21672 -4960 17291 16935 -3700 -7126 7295 27004 9742 -809 -11386
5385 -11386 -3007 -13795 -7111 -13555 -14641 -2296 -1641 -6163 -22115 -32081 -26181 -27026 -22258 -34463
5371 -34463 -12478 -6951 6059 6934 -7465 1196 -56 -20696 -25829 -8882 -8211 -14492 -10934 7985
5357 7985 17260 -6761 -12173 13370 -2660 -24258 -13979 75 7433 11025 1169 -455 -8238
5344 -8238 -8925 -8995 -1628 -902 6214 -4978 -12821 -16869 -17100 -21846 -13553 -3061 3972 21874 8671
5329 8671 7885 -1924 5166 1395 -15788 -15959 -9772 -11656 -1499 15401 7767 -18313 -13966 645
5315 645 -7587 -15445 -11559 -15746 -18923 -16155 -29845 -12510 1261 1517 8264 3127 -10470 -1064
$$ packed form
5412b5976q624R944j993J837O970j400r581J2625m884L881L855m507j1414K1387
5398g880l387n543m862J6712K2251l56k0635l426J4421J9709j7262j0551j0577
5385a1386Q379j0788O684o444j086J2345O55m522j5952r966N900q45M768j2205
5371c4463K1985N527J3010Q75j4399Q661j252k0640n133J6947O71o281L558J8919
5357G985R275k4021n412K5543j6030k1598J0279J4054P358L592r856j624p783
5344h238o87p0P367P26P116j1192p843m048k31m746Q293J0492P033J7902j3203
5329H671p86r809P090l771j7183j71O187j884J0157J6900p634k6080M347J4611
5315F45q232p858L886m187l177K768j3690J7335J3771K56O747n137j3597R406
$$ plain form
5301 -1064 888 2448 -9088 -24220 -21244 -2681 12973 10388 -6114 -10157 -8070 6965 23705
5288 23705 28860 22344 19146 27584 23660 10540 6757 1396 6644 12915 4355 3527 17168 23970
5274 23970 11780 -4455 10953 20874 17982 -5415 -6756 7946 17418 17221 6934 1523 1839 -2156
5260 -2156 -13479 -14161 -8161 -86 3602 5273 4612 494 -7198 -10122 4474 4047 124 -11679 -33488
5245 -33488 -18322 4993 2657 2684 13983 8445 -13030 -43559 -35896 3052 20530 14265 8047
5232 8047 10782 16347 13007 -2839 -19670 -13333 -4765 3877 -877 -3363 -23986 -16535 -4571 -125
5218 -125 7056 5265 -9249 -10603 -6403 -2604 -4340 -4651 -18482 -17448 24159 34028 28646 34332 45194
5203 45194 45771 38256 22537 12030 -8095 -8973 -7278 7809 6416 -24469 -23467 -14747 -16604 -22040
$$ packed form
5301a064J952J560j1536j5132K976J8563J5654k585j6502m043K087J5035J6740
5288B3705N155o516l198Q438l924j3120l783n361N248O271q560q28J3641O802
5274B3970j2190j6235J5408R921k892k3397j341J4702R472j97j0287n411L16l995
5260b156j1323o82O000Q075L688J671o61m118p692k924J4596m27l923j1803k1809
5245c3488J5166K3315k336K7J1299n538k1475l0529P663L8948J7478o265o218
5232H047K735N565l340j5846j6831O337Q568Q642m754k486k0623P451J1964M446
5218a25P181j791j4514j354M200L799j736l11j3831J034M1607R869n382N686J0862
5203D5194N77p515j5719j0507k0125q78J695J5087j393l0885J002Q720j857n436
$$ plain form
5189 -22040 -8813 -18057 -1544 11156 -1402 -5743 -8100 -19415 -6105 15408 2770 3174 9335
5176 9335 5775 5481 6964 -1610 1832 -1196 12625 6084 -587 1507 1133 -434 3453 3314 13114
5161 13114 12186 3187 7393 1608 5614 -1328 -10128 -11489 -5592 -9909 -22878 -21067 -32482 -32190 -23519
5146 -23519 -25425 -26005 -5615 5307 2098 -8811 -20648 -20643 -21080 -19918 -4055 -1317 -12789 -14968
5132 -14968 -7403 9109 23520 28830 27545 11333 10022 -750 267 -5337 -13435 -19323 -3047
5119 -3047 2955 3848 -1237 2685 2957 -11266 -20590 -516 3974 -9300 -10277 -11847 -13805 -18854 -8491
5104 -8491 -1763 15422 26575 18810 12676 13495 9204 7265 17523 21119 35680 34388 24612 2511
5090 2511 -11098 -21577 -18566 -23570 -19370 -9323 -2850 9432 13135 375 -7004 -15756 -10026 -4284
$$ packed form
5189b2040J3227r244J6513J2700j2558m341k357j1315J3310K1513j2638M04O161
5176I335l560k94J483q574L442l028J3821o541o671K094l74j567L887j39R800
5161A3114r28q999M206n785M006o942q800j361N897m317j2969J811j1415K92Q671
5146b3519j906n80K0390J0922l209j0909j1837Nm37J162J5863K738j1472k179
5132a4968P565J6512J4411N310j285j6212j311j0772J017n604q098n888J6276
5119c047O002Q93n085L922K72j4223r324K0074M490j3274r77j570j958n049J0363
5104h491O728J7185J1153p765o134Q19m291j939J0258L596J4561j292r776k2101
5090B511j3609j0479L011n004M200J0047O473J2282L703j2760p379q752N730N742
$$ plain form
5076 -4284 18104 18213 22495 17685 13155 15279 -3038 -10351 -7706 7656 2876 10195 12649 10305
5062 10305 7843 3258 10638 2931 3241 23613 22963 -2706 -8330 5221 -1617 -4005 1784 1677 -3115
5047 -3115 -9669 -4900 2685 -23176 -39729 -37550 -17001 -2542 28252 39017 22045 2176 -10872
5034 -10872 -23280 -35025 -34363 -27562 -20187 4065 19473 8206 -14180 -14218 -10664 -5553 12346 5398
5020 5398 -17424 -18931 -9623 1241 -2095 3550 -104 -6250 -22671 -27661 -21944 -14869 -17224 -19527
5006 -19527 -10404 -9510 -12663 -25535 -21936 -13588 -12524 -17563 -30208 -36008 -38852 -29460 -19286 48
4992 48 -2165 -12227 -3789 21287 16958 1437 3025 -4050 -46 10941 406 -25999 -36012 -25755
4978 -25755 3038 -2380 -9116 -1349 9035 4689 10931 10031 19 -3952 -14422 -21597 -20542 -18295
$$ packed form
5076d284K2388J09M282m810m530K124j8317p313K645J5362m780P319K454k344
5062A0305k462m585P380p707L10K0372o50k5669n624J3551o838k388N789j07m792
5047c115o554M769P585k5861j6553K179K0549J4459L0794J0765j6972j9869j3048
5034a0872j2408j1745O62O801P375K4252J5408j1267k2386l8L554N111J7899o948
5020E398k2822j507R308J0864l336N645l654o146j6421m990N717P075k355k303
5006a9527R123Q94l153j2872L599Q348J064n039j2645n800k844R392J0174J9334
4992D8k213j0062Q438K5076m329j5521J588p075M004J0987j0535k6405j0013J0257
4978b5755K8793n418o736P767J0384m346O242r00j0012l971j0470p175J055K247
$$ plain form
4964 -18295 -21740 -13145 14633 17792 2625 -15643 -12820 -5359 -7101 -6587 -2000 -9656 -13338 -13064
4950 -13064 -7682 -7302 -16573 -27567 -22589 -9669 6667 10376 10781 24095 34631 20693 3606
4937 3606 468 -8379 -12944 -5886 6477 727 -22114 -36684 -31805 -13697 -3261 -2533 -9408 -7447
4923 -7447 -3083 7640 15667 35694 40023 26843 16637 8303 5538 2312 5914 3001 4822 15025
4909 15025 6740 5036 10370 -3276 -14608 -23082 -19819 -23926 -9890 251 7760 10708 5542 14520
4895 14520 18815 848 -2587 4245 -3604 -16886 -21474 -26772 -29899 -21508 -11946 -20128 -19288 -2176
4881 -2176 7911 13420 1364 -3163 -19803 -38639 -29329 -2820 2506 -1589 5546 15109 6995 5856
4867 5856 1901 -14570 -16093 -9978 -19526 -31142 -29952 -16357 -24128 -35593 -27941 -22587 -8760 -4643
$$ packed form
4964a8295l445Q595K7778L159j5167j8268K823P461j742N14M587p656l682K74
4950a3064N382L80r271j0994M978J2920J6336L709M05J3314J0536j3938j7087
4937C606l138q847m565P058J2363n750k2841j4570M879J8108J0436P28o875J961
4923g447M364J0723Q027K0027M329j3180j0206q334k765l226L602k913J821J0203
4909A5025q285j704N334j3646j1332q474L263m107J4036J0141P509K948n166Q978
4895A4520M295j7967l435O832p849j3282m588n298l127Q391R562q182Q40J7112
4881b176J0087N509j2056m527j6640j8836R310K6509N326m095P135R563q114j139
4867E856l955j6471j523O115r548j1616J190J3595p771j1465P652N354J3827M117
$$ plain form
4853 -4643 -20685 -32751 -17800 2589 -10749 -16569 -21181 -16641 -7059 4180 344 -10774 -3343
4840 -3343 171 8903 601 94 14275 11939 46 -9747 -249 5753 -5169 -2527 -6887 -8826
4826 -8826 -10057 1913 17325 27598 21482 27395 33594 21877 -5599 -14938 6880 -3816 -6623
4813 -6623 -4105 -350 11744 -3122 -9812 -9956 2369 12570 -14023 -35480 -29963 -32888 -34735 -26750
4799 -26750 -26846 -28800 -2403 16265 11275 15593 21963 31567 28710 11455 -6986 -107 11223 983
4785 983 -565 -6366 814 10189 -1956 -2016 5449 11617 11263 2768 -1833 1719 1241 7824 12904 3655
4769 3655 -3520 -20228 -29563 -9642 -1428 -15136 -25644 -16117 -12952 -7402 -8173 -10738 -6992 -10996
4755 -10996 -22245 -20348 -12091 -8207 -15148 -5192 11479 12303 7598 22150 23182 16887 7971 -1645
$$ packed form
4853d643j6042j2066J4951K0389j3338n820m612M540R582J1239l836j1118P431
4840c343L514Q732q302n07J4181k336j1893r793R498O002j0922K642m360j939
4826h826j231J1970J5412J0273o116N913O199j1717k7476r339K1818j0696k807
4813f623K518L755J2094j4866o690j44J2325J0201k6593k1457N517k925j847P985
4799b6750r6j954K6397J8668m990M318O370R604k857j7255j8441O879J1330j0240
4785I83j548n801P180R375j2145o0P465O168l54q495m601L552m78O583N080r249
4769C655p175j6708r335J9921Q214j3708j0508R527L165N550p71k565L746m004
4755a0996j1249J897Q257L884o941R956J6671Q24m705J4552J032o295q916r616
$$ plain form
4741 -1645 -2773 7277 5737 14175 6871 -2692 -14811 -9838 -14374 -6722 11731 1226 1376 -10781
4727 -10781 -14136 -10837 -12210 -15126 -25364 -14611 749 867 4157 9398 15747 24615 17153 5756
4713 5756 11125 3920 -3523 -3516 -6819 -34127 -38007 -35519 -33491 -27459 -22875 -19961 -24442 -23090 -22133 -28793
4697 -28793 -41079 -26994 -15007 -26259 -16316 16310 7449 4992 23115 19457 14272 3717 -7311
4684 -7311 -5688 3294 20413 18965 9432 877 17778 15832 558 -5209 -10546 -5329 3511 11091
4670 11091 -5267 1401 -9851 -26033 -22783 -32249 -28425 -35191 -31381 -10560 -9770 -8642 -26567 -26015
4656 -26015 -18179 -12597 -21650 -17518 -19300 -7536 16161 17494 -1075 -8442 -19243 -19811 -11376 -1843
4642 -1843 -8752 -24558 -17749 -18626 9784 25527 15442 5569 1353 24 1977 899 -8189 -11629
$$ packed form
4741a645j128J0050j540Q438p304r563j2119M973m536P652J8453j0505J50j2157
4727a0781l355L299j373k916j0238J0753J5360J18L290N241O349Q868p462j1397
4713E756N369p205p443Pl303k7308l880K488K028O032M584K914m481J352R57o660
4697b8793j2286J4085J1987j1252R943L2626q861k457J8123l658n185j0555j1028
4684g311J623Q982J7119j448r533q555J6901j946j5274n767n337N217Q840P580
4670A1091j6358O668j1252j6182L250r466L824o766L810K0821P90J128j7925N52
4656b6015P836N582r053M132j782J1764K3697J333j8569p367j0801n68Q435R533
4642a843o909j5806O809q77K8410J5743j0085r873m216j329J953j078r088l440
$$ plain form
4628 -11629 -12991 -2387 2663 -960 -2843 -3577 -11558 -4365 9257 9910 5147 -4278 474 -701 5269
4613 5269 2779 11296 28762 19110 2396 6186 8371 2393 -2577 -17467 -21767 -11923 -16948 -11560
4599 -11560 -19148 -14049 -14464 -18133 -8314 -4401 -5398 3255 -3062 -6410 -8348 -8551 -2881 8026 4099
4584 4099 -16711 -10106 439 2762 9912 6753 -2231 13963 2141 -5690 -14466 -4319 -667 10685
4570 10685 9159 -9300 -15470 -10213 -12643 -10421 8058 15417 -2582 -2131 1002 -7804 -21137 -22242
4556 -22242 -19559 -7497 6379 9209 17851 15595 151 -4684 -7074 -8909 -14872 -17983 -31497 -29165
4542 -29165 -22187 -5941 -2064 -874 -1716 -3614 -10844 -8506 -8179 -3452 969 6886 8801 -1079 3514
4527 3514 16542 15929 17816 30744 40170 30749 21018 17595 10627 14582 13752 4743 -4646 -10880 -4151
$$ packed form
4628a1629j362J0604N050l623j883p34p981P193J3622O53m763r425M752j175N970
4613E269k490Q517J7466r652j6714L790K185n978m970j4890m300R844n025N388
4599a1560p588N099m15l669R819L913r97Q653o317l348j938k03N670J0907l927
4584D099k0810O605J0545K323P150l159q984J6194j1822p831q776J0147L652J1352
4570A0685j526j8459o170N257k430K222J8479P359j7999M51L133q806j3333j105
4556b2242K683J2062J3876K830Q642k256j5444m835k390j835n963l111j3514K332
4542b9165O978J6246L877J190q42j898p230K338L27M727M421N917J915r880M593
4527C514J3028o13J887J2928R426r421r731l423o968L955q30r009r389o234O729
$$ plain form
4512 -4151 9818 4214 10352 8793 -6864 -366 21473 26184 17145 2524 7529 16791 10695 12568
4498 12568 7840 2631 6066 6491 11766 9970 18801 11452 -8104 -18837 -26210 -27992 -27347 -11296
4484 -11296 -18795 -6978 1738 -11083 -12530 -10651 -15647 -5006 -29141 -28212 -17203 -20461 -8773
4471 -8773 -808 6760 1547 -8312 5267 12993 9573 1278 -28256 -51937 -39565 -9411 4891
4458 4891 -10156 -14166 -16109 -10077 -1925 1347 -23891 -26503 992 2790 7739 3175 -10942 -22503
4444 -22503 -10570 132 10155 6564 -1916 -558 -13410 -10374 -17288 -21364 -24275 -19521 -20741 -25581
4430 -25581 -22072 -1181 28939 18444 -7885 -9882 5121 14416 3330 -5612 -7145 -9182 -4472
4417 -4472 -7986 -37641 -20376 7497 -61 13890 26201 5494 -2701 5092 8492 -6228 -14085
$$ packed form
4512d151J3969n604O138j559j5657O498K1839M711r039j4621N005R262o096J873
4498A2568m728n209L435M25N275j796Q831p349j9556j0733p373j782O45J6051
4484a1296p499J1817Q716j2821j447J879m996J0641k4135R29J1009l258J1688
4471h773P965P568n213r859J3579P726l420q295k9534k3681J2372L0154J4302
4458D891j5047m010j943O032Q152L272k5238k612K7495J798M949m564j4117j1561
4444b2503J1933J0702J0023l591q480J358j2852L036o914m076k911M754j220m840
4430b5581L509K0891L0120j0495k6329j997J5003R295j1086q942j533k037M710
4417d472l514k9655J7265K7873p558J3951J2311k0707q195P793L400j4720p857
$$ plain form
4404 -14085 -972 18395 21540 7017 4117 -91 3702 -3505 -11233 -1275 18133 38971 41058
4391 41058 34474 34638 16780 11993 5418 -16144 -23252 -15048 -6301 -6951 -10595 1092 -8699 -11853
4377 -11853 -10260 -9988 -4164 1232 8809 23701 10457 -3136 -22790 -23851 -10314 -4896 -12276 -8197
4363 -8197 5490 753 -7790 -11316 -21866 -34251 -20357 -2911 6571 -640 -5158 9478 13023
4350 13023 10243 6031 5097 -8188 -18245 -4180 8222 10200 -3828 -3068 -4846 -5825 6493 419
4336 419 -5095 -16078 -27479 -28674 -17702 -7919 -5754 172 10025 1042 -15217 -5311 15933 42081
4322 42081 30605 23541 6731 1440 6758 -4774 -6059 -5083 -4422 -377 -2763 6580 20674 1304
4308 1304 -25006 -16267 11213 13480 3651 2539 11686 27263 35777 37630 30874 16157 15095 23089
$$ packed form
4404a4085J3113J9367L145j4523k900m208L793p207p728R958J9408K0838K087
4391D1058o584J64j7858m787o575k1562p108Q204Q747o50l644J1687r791l154
4377a1853J593K72N824N396P577J4892j3244j3593j9654j061J3537N418p380M079
4363h197J3687m737q543l526j0550j2385J3894J7446R482p211m518J4636L545
4350A3023k780m212r34j3285j0057J4065J2402J978j4028P60j778r79J2318o074
4336D19n514j0983j1401j195J0972R783K165N926R853q983j6259R906K1244K6148
4322D2081j1476p064j6810n291N318j1532j285R76O61M045k386R343J4094j9370
4308A304k6310Q739K7480K267r829j112R147J5577Q514J853o756j4717j062P994
$$ plain form
4294 23089 25324 27659 31069 26157 12154 -5881 -33565 -40763 -26672 1916 7790 1032 4416
4281 4416 2336 11966 28651 17199 -2584 -13843 -21477 -19447 -3138 12094 -4699 -22322 -7755
4268 -7755 3068 -3803 -16226 -7885 9416 -4158 -13469 -5000 -3731 -13704 -24117 -31276 -40469 -38345
4254 -38345 -24360 -14276 -4105 -11095 -33926 -37099 -30274 -18722 -27408 -18345 -19171 -17211 8614
4241 8614 6326 -7302 -13954 -26587 -30221 -27772 -6149 -2241 -13082 -19204 -8648 -926 2779 7959
4227 7959 5308 850 -1867 -11186 -12940 -14546 -16696 -24528 -24633 -9193 -7460 -11889 -16483 -9858 -6908
4212 -6908 -2942 13252 27225 21136 5956 10227 5141 -8037 -37830 -24503 -14765 -6311 -25086
$$ packed form
4294B3089K235K335L410m912j4003j8035k7684p198J4091K8588N874o758L384
4281D416k080R630J6685j1452j9783j1259p634K030J6309J5232j6793j7623J4567
4268g755J0823o871j2423Q341J7301j3574r311Q469J269r973j0413p159r193K124
4254c8345J3985J0084J0171o990k2831l173O825J1552q686R063q26J960K5825
4241H614k288j3628o652j2633l634K449K1623L908j0841o122J0556P722L705N180
4227G959k651m458k717r319j754j606k150p832j05J5440J733m429m594O625K950
4212f908L966J6194J3973o089j5180M271n086j3178k9793J3327R738Q454j8775
$$ [...]
##END NTUPLES=NMR SPECTRUM
##END=
