##TITLE=Analysis number 324848
Compound Code cc 60446
Book Reference 510/9
Project Code adrs
Chemist Name jimp
##JCAMPDX= 6.0         $$ Bruker NMR JCAMP-DX V2.0
##DATA TYPE= NMR SPECTRUM
##DATA CLASS= NTUPLES
##ORIGIN= Bruker BioSpin GmbH
##OWNER= nmr
$$ XWIN-NMR		Version 3.5
$$ Mon Dec  4 10:06:55 2006 GMT Standard Time (UT+0h)  MAYBRIDGE\nmr@NMR_250MHZ
##.OBSERVE FREQUENCY= 250.131544655141
##.OBSERVE NUCLEUS= ^1H
##.ACQUISITION MODE= SIMULTANEOUS (DQD)
##.ACQUISITION SCHEME= undefined
##.AVERAGES= 16
##.DIGITISER RES= 18
##SPECTROMETER/DATA SYSTEM= dpx250
##.PULSE SEQUENCE= zg30
##.SOLVENT NAME= CDCl3
##.SHIFT REFERENCE= (INTERNAL, CDCl3, 0, 16.522)
##AUDIT TRAIL= $$ (NUMBER, WHEN, WHO, WHERE, WHAT)
$$ ##TITLE= Audit trail, XWIN-NMR		Version 3.5
$$ ##JCAMPDX= 5.01
$$ ##ORIGIN= Bruker BioSpin GmbH
$$ ##OWNER= nmr
$$ C:\u/data/dgb/nmr/ADRS/100/pdata/1/auditp.txt
$$ ##AUDIT TRAIL=  $$ (NUMBER, WHEN, WHO, WHERE, WHAT)
(   1,<2006-12-04 10:06:33.30 +000>,<MAYBRIDGE\nmr>,<NMR_250MHZ>,
      <created by zg, POWCHK disabled, PULCHK disabled
       configuration hash MD5:
       49 4B E0 1D 92 C2 6B 37 9F E6 65 BC 52 41 86 1D
       data hash MD5: 64K
       01 93 54 10 0F 8B 81 63 4A E7 FD F6 A1 CA 3B 48>)
(   2,<2006-12-04 10:06:46.61 +000>,<MAYBRIDGE\nmr>,<NMR_250MHZ>,
      <Start of raw data processing
       ef LB = 0.3 FT_mod = 6 PKNL = 1 SI = 32K 
       data hash MD5: 32K
       79 65 1E EE 2C C6 80 77 A4 2F 48 1B 6C 1A 81 E2>)
(   3,<2006-12-04 10:06:48.61 +000>,<MAYBRIDGE\nmr>,<NMR_250MHZ>,
      <apk 
       data hash MD5: 32K
       80 6B EA 62 1E 2F 7B 5B 3E B7 AD 56 1C D4 5B EC>)
(   4,<2006-12-04 10:06:49.39 +000>,<MAYBRIDGE\nmr>,<NMR_250MHZ>,
      <abs ABSG = 5 
       data hash MD5: 32K
       C9 98 D3 A2 72 D1 BC 85 AD 04 AA 78 38 27 54 82>)
$$ ##END=
$$ 
$$ hash MD5
$$ 1A 8F 77 DD 29 7B 6A 6D 57 61 FC D3 45 81 24 59
##$RELAX= 
##$RELAX= 
##$RELAX= 
##$RELAX= 
##$RELAX= 
##$RELAX= 
##$RELAX= 
$$ Bruker specific parameters
$$ --------------------------
##$DU= <C:\u>
##$EXPNO= 100
##$NAME= <ADRS>
##$PROCNO= 1
##$TYPE= <nmr>
##$USER= <dgb>
##$AMP= (0..31)
100 100 100 100 100 100 100 100 100 100 100 100 100 100 100 100 100 100 
100 100 100 100 100 100 100 100 100 100 100 100 100 100 
##$AQSEQ= 0
##$AQ_mod= 3
##$AUNM= <au_zg>
##$AUTOPOS= <5 >
##$BF1= 250.13
##$BF2= 250.13
##$BF3= 250.13
##$BF4= 250.13
##$BF5= 500.13
##$BF6= 500.13
##$BF7= 500.13
##$BF8= 500.13
##$BYTORDA= 1
##$CFDGTYP= 0
##$CFRGTYP= 5
##$CHEMSTR= <none>
##$CNST= (0..31)
1 1 145 1 1 1 1 1 1 1 1 1 1 1 1 1 1 1 1 1 1 1 1 1 1 1 1 1 1 1 1 1 
##$CPDPRG= <>
##$CPDPRG1= <>
##$CPDPRG2= <>
##$CPDPRG3= <>
##$CPDPRG4= <mlev>
##$CPDPRG5= <mlev>
##$CPDPRG6= <mlev>
##$CPDPRG7= <mlev>
##$CPDPRG8= <mlev>
##$CPDPRGB= <>
##$CPDPRGT= <>
##$D= (0..31)
0 1 0 0 0 0 0 0 0 0.06 0 0 0 0 0 0 0.0002 0 0 0 0 0 0 0 0 0 0 0 0 0 0 
0 
##$DATE= 1165226792
##$DBL= (0..7)
120 120 120 120 120 120 120 120 
##$DBP= (0..7)
150 150 150 150 150 150 150 150 
##$DBP07= 0
##$DBPNAM0= <>
##$DBPNAM1= <>
$$ [...]
##$SUBNAM7= <"">
##$SUBNAM8= <"">
##$SUBNAM9= <"">
##$SW= 20.6930455092707
##$SWIBOX= (0..15)
0 0 3 0 0 0 0 0 0 0 0 0 0 0 0 0 
##$SW_h= 5175.983436853
##$TD= 65536
##$TD0= 1
##$TE= 294.16
##$TE2= 300
##$TE3= 300
##$TEG= 300
##$TL= (0..7)
0 120 120 120 120 120 120 120 
##$TP= (0..7)
150 150 150 150 150 150 150 150 
##$TP07= 0
##$TPNAME0= <>
##$TPNAME1= <>
##$TPNAME2= <>
##$TPNAME3= <>
##$TPNAME4= <>
##$TPNAME5= <>
##$TPNAME6= <>
##$TPNAME7= <>
##$TPOAL= (0..7)
0.5 0.5 0.5 0.5 0.5 0.5 0.5 0.5 
##$TPOFFS= (0..7)
0 0 0 0 0 0 0 0 
##$TUNHIN= 0
##$TUNHOUT= 0
##$TUNXOUT= 0
##$USERA1= <user>
##$USERA2= <user>
##$USERA3= <user>
##$USERA4= <user>
##$USERA5= <user>
##$V9= 5
##$VALIST= <valist>
##$VCLIST= <CCCCCCCCCCCCCCC>
##$VD= 0
##$VDLIST= <DDDDDDDDDDDDDDD>
##$VPLIST= <PPPPPPPPPPPPPPP>
##$VTLIST= <TTTTTTTTTTTTTTT>
##$WBST= 1024
##$WBSW= 4
##$XGAIN= (0..3)
0 0 0 0 
##$XL= 0
##$YL= 0
##$YMAX_a= 619933
##$YMIN_a= -526321
##$ZGOPTNS= <>
##$ZL1= 120
##$ZL2= 120
##$ZL3= 120
##$ZL4= 120
##$ABSF1= 16.522
##$ABSF2= -4.171173
##$ABSG= 5
##$ABSL= 3
##$ALPHA= 0
##$AQORDER= 0
##$ASSFAC= 0
##$ASSFACI= 0
##$ASSFACX= 0
##$ASSWID= 0
##$AUNMP= <proc_1d>
##$AZFE= 0.1
##$AZFW= 0.1
##$BCFW= 0
##$BC_mod= 0
##$BYTORDP= 0
##$COROFFS= 0
##$CY= 12.5
##$DATMOD= 1
##$DC= 0
##$DFILT= <>
##$DTYPP= 0
##$F1P= 14.0000005364418
##$F2P= -0.99999901652339
##$FCOR= 0.5
##$FTSIZE= 32768
##$FT_mod= 6
##$GAMMA= 0
##$GB= 0
##$INTBC= 1
##$INTSCL= 1
##$ISEN= 128
##$LB= 0.3
##$LEV0= 0
##$LPBIN= 0
##$MAXI= 10000
##$MC2= 0
##$MEAN= 0
##$ME_mod= 0
##$MI= 0
##$NCOEF= 0
##$NC_proc= -3
##$NLEV= 6
##$NOISF1= 0
##$NOISF2= 0
##$NSP= 0
##$NTH_PI= 0
##$NZP= 0
##$OFFSET= 16.522
##$PC= 1
##$PHC0= 73.09399
##$PHC1= 5.528345
##$PH_mod= 1
##$PKNL= yes
##$PPARMOD= 0
##$PSCAL= 4
##$PSIGN= 0
##$REVERSE= no
##$SF= 250.13
##$SI= 32768
##$SIGF1= 0
##$SIGF2= 0
##$SINO= 400
##$SIOLD= 32768
##$SREGLST= <1H.CDCl3>
##$SSB= 0
##$STSI= 32768
##$STSR= 0
##$SW_p= 5175.98343685301
##$SYMM= 0
##$S_DEV= 0
##$TDeff= 65536
##$TDoff= 0
##$TI= <Analysis number 999999
Compound Code 99
Book Reference 9
Project Code 9>
##$TILT= no
##$TM1= 0
##$TM2= 0
##$TOPLEV= 0
##$USERP1= <user>
##$USERP2= <user>
##$USERP3= <user>
##$USERP4= <user>
##$USERP5= <user>
##$WDW= 1
##$XDIM= 32768
##$YMAX_p= 315296837
##$YMIN_p= -27306
$$ End of Bruker specific parameters
$$ ---------------------------------
##NTUPLES= NMR SPECTRUM
##VAR_NAME=  FREQUENCY,     SPECTRUM/REAL,   SPECTRUM/IMAG
##SYMBOL=    X,             R,               I
##VAR_TYPE=  INDEPENDENT,   DEPENDENT,       DEPENDENT
##VAR_FORM=  AFFN,          ASDF,            ASDF
##VAR_DIM=   32768,         32768,           32768
##UNITS=     HZ,            ARBITRARY UNITS, ARBITRARY UNITS
##FACTOR=    0.157963299565203, 1,           1
##FIRST=     4132.6476996994, 0,             0
##LAST=      -1043.33573715361, 0,           0
##MIN=       -1043.33573715361, -27306,      0
##MAX=       4132.6476996994, 315296837,     0
$$ Real data points
##PAGE= N=1
##DATA TABLE= (X++(R..R)), XYDATA
$$ [...]
16745A1546m164L496L322l491k343j717n595L860Q96l794m294k036m332m40O314
16730b772N648Q77j016L259q48o505l110k403m529l772P43J406J1844l805m577
16715i560N879L989Q01k784l837N841M001l744N82P52M302N479o965k417n699
16700c380m550l215l432p09N281L770l849k921O086m362K856P17n580l386N236
16685a1438O717o091n226J071J487Q83O528N489N700j29J869p92l941p275q8M125
16669a111M601L109P76m793o361n548L997L020J651k878l105J170k67O35L170
16654a934N385J414o977q017j40L924L893K04j586O16j470k203J563L198j034
16639c164J381L122n09o082J94p42J2344R636k918r231r247n59P21m54j884o93
$$ plain form
16745 11546 7382 10878 14200 10709 8366 6649 1054 4914 5810 2016 -2278 -4314 -8646 -9086 -2772
16730 -2772 2876 3753 2737 5996 5148 -1357 -4467 -6870 -11399 -15171 -14428 -13022 -1178 -4983 -9560
16715 -9560 -3681 308 1109 -1675 -5512 329 4330 586 1168 1920 6222 11701 4736 2319 -3380
16700 -3380 -7930 -11145 -14577 -15286 -10005 -6235 -10084 -13005 -6919 -11281 -8425 -7708 -13288 -16674 -11438
16685 -11438 -4721 -10812 -16038 -14967 -13480 -12597 -6069 -580 5120 4991 6860 6068 2127 -5148 -5236 -1111
16669 -1111 3490 6599 7375 2582 -3779 -9327 -5330 -2310 -659 -3537 -6642 -5472 -5739 -5104 -1934
16654 -1934 3451 4865 -2112 -10129 -10269 -6345 -2452 -2248 -3834 -3218 -4688 -6891 -5328 -2130 -3164
16639 -3164 -1783 1339 830 -5252 -5058 -5800 6544 16180 13262 4031 -5216 -5775 -5054 -5508 -7392 -8085
16623h085O105O367L316m434L181L19J533N410J089o189j815L103L011m441m895
16608C575K434Q564q14j096m676M857j287p826K1m430q84N622l07o782n351J665
16592f715J368P685O017K502o440l229j3050k111K750K58N624P713J729n460j393
16577b752K596J224k814N909K606r726n299K948j226k102J219K248O04J308n69
16562c826n194j796P237M307L924M955l550n679k129n9N061R176o77n337l539
16547B874L289n027l263J521n745K30J0591J646N261n783m389K112k171p249K549
16532c554M141j227k842o599o561L009L690K743O247l684L294J335k669L05j852
16517d224k760K076M594j0063l31l844J301M133O5j319K370P86l919Q177M749
$$ plain form
16623 -8085 -1980 4387 7703 3269 6450 6769 8302 13712 14801 8612 6797 9900 12911 8470 3575
16608 3575 6009 14573 13759 12663 7987 12844 11557 3731 3752 -678 -1562 4060 3753 -3029 -8380 -6715
16592 -6715 -5347 2338 8355 10857 4417 1188 -11862 -13973 -11223 -10965 -5341 2372 4101 -1359 -2752
16577 -2752 -156 1068 -1746 4163 6769 -2957 -8256 -5308 -6534 -8636 -7417 -5169 -4565 -3257 -3826
16562 -3826 -9020 -10816 -3579 728 4652 9607 6057 378 -1751 -1810 3251 12427 11750 6413 2874
16547 2874 6163 1136 -2127 -606 -6351 -6121 4470 6116 11377 5594 1205 3317 1146 -6103 -3554
16532 -3554 587 -640 -3482 -10081 -16642 -13633 -9943 -7200 -953 -4637 -1343 -8 -2677 -2372 -4224
16517 -4224 -6984 -4908 -314 -10377 -10708 -14552 -13251 -9118 -9053 -10372 -8002 -7216 -11135 -2958 1791
16502A791l03J876N704o368r338m482L323K911J191j72n689R057N973L186q838
16487a78r701J944k711J207K029k854j910L592l002o70N997O954O33J035J733
16472D098n054l224j204K544K066o102M08N604l954l005K041m226k961p00N297
16457h372O307m010k466J0788m14p167Q94%l834m229L657j367m189k184L158N183
16441h245l97J1532k862k323l631L291K013L084L713l534Mk175l130n708O916
16426a452N642p14l707l204P51j430j78O503n933q652M105K309L207J574K101
16411I22N073K033J34p292q607M690M349r083k80K132J836N166L364k390p111
16396e064j870O856R937O921n040p048k465k630l697j162J846N039j468l576m30
$$ plain form
16502 1791 1488 3364 9068 2700 -6638 -11120 -7797 -4886 -3695 -3867 -9556 -499 5474 8660 -178
16487 -178 -9879 -7935 -10646 -9439 -7410 -10264 -12174 -8582 -11584 -12254 -6257 697 1330 2365 4098
16472 4098 -956 -4180 -5384 -2840 -774 -6876 -6468 -864 -4818 -7823 -5782 -10008 -12969 -13669 -8372
16457 -8372 -2065 -6075 -8541 2247 1833 -5334 -4440 -4440 -8274 -12503 -8846 -10213 -14402 -16586 -13428 -8245
16441 -8245 -8642 2890 28 -2295 -5926 -2635 -622 2462 6175 2641 2645 470 -2660 -8368 -1452
16426 -1452 4190 3476 -231 -3435 -2684 -4114 -4292 2211 -3722 -12374 -8269 -5960 -2753 -1179 922
16411 922 5995 8028 8162 870 -7737 -3047 1302 -7781 -8061 -5929 -4093 1073 4437 2047 -5064
16396 -5064 -6934 -78 9859 16780 11740 4692 2227 -403 -4100 -5262 -3416 1623 155 -3421 -3851
16381c851J002r92L484M119L413J004p345m244J363k784J14Q90L90J289j135o734
16365a0017Q65J0764j14J633K176M60j299L229l615j176p60n232j280j274l51
16350e991J457N784K719k265m753l344J513K794l099K016K276nl581m360k999
16335a1838N913k84K695k793J581M473k705K502k270l716k869l815N774Q615N029
16320F292J537j176j014P640L679n382n665p455k868N579K172N12M100m268n635
16305a952l700k054n232L783K559m031K69P39J65P532J2361J120p524o790r76
16290c731p30j018L636j882m725M31L171L20K428k808p98k706l627k002L629K416
16274g996K163l137L388J0502K518r177m084o41N35k345l74j602l675j906j439
$$ plain form
16381 -3851 -2849 -3841 -357 3762 7175 8179 834 -3410 -2047 -4831 -4717 -3827 -3437 -2148 -3283 -10017
16365 -10017 -9152 1612 1498 3131 5307 5767 4468 7697 4082 2906 2146 -3086 -4366 -5640 -5991
16350 -5991 -4534 1250 3969 1704 -3049 -6393 -4880 -2086 -5185 -3169 -893 -898 -4479 -8839 -11838
16335 -11838 -5925 -6209 -3514 -6307 -4726 -253 -2958 -456 -2726 -6442 -9311 -13126 -7352 1263 6292
16320 6292 7829 6653 5639 13279 16958 11576 5911 -1544 -4412 1167 3339 3851 7951 3683 -1952
16305 -1952 -5652 -7706 -12938 -9155 -6596 -10627 -10358 -9619 -9454 -1922 10439 11559 4035 -2755 -3731
16290 -3731 -4461 -5479 -1843 -3725 -8450 -8019 -4848 -4528 -2100 -4908 -5706 -8412 -12039 -14041 -10412 -7996
16274 -7996 -5833 -8970 -5582 4920 7438 -1739 -5823 -6464 -5929 -8274 -8648 -10250 -13925 -15831 -17270
16259a7270N233P442K029J009l536k634P958M702m419m921J696O210R360n94l922
16244H343O14l300q740j762N047L338m695p711q673K758q53K97q52K281K739J985
16228i184l307j265R05O960m28K941K678k369O93m683J2j445J226L725m118k333
16212i992j99m586l153M856m17j377L885L625M705j054l759l541l41L370P897
16197h1q62K744J472J947m855r149l568j609k621J367l973L877J2010O660J527
16182D886j14j082k979j662J010J1662j316r338p718n905l32N430K338L601j117
16167b636J729p337o25k254R54l891P88N90L970J499O252n591j714N639L362n87
16151A48k349J548j916k696K333L897L589L947l251j923n260j682J365n030k305
$$ plain form
16259 -17270 -12037 -4595 -2566 -1557 -5093 -7727 231 4933 514 -4407 -2711 3499 12859 12265 8343
16244 8343 8957 5657 -3083 -4845 202 3540 -1155 -8866 -17539 -14781 -15634 -15337 -16189 -13908 -11169 -9184
16228 -9184 -12491 -13756 -12851 -5891 -6319 -3378 -700 -3069 -2376 -7059 -7047 -8492 -7266 -3541 -7659 -9992
16212 -9992 -10191 -14777 -17930 -13074 -13491 -14868 -10983 -7358 -2653 -3707 -7466 -11007 -11348 -7978 -81
16197 -81 -943 1801 3273 5220 365 -8784 -12352 -13961 -16582 -15215 -19188 -15311 -3301 3359 4886
16182 4886 4772 3690 711 -951 59 11721 10405 1067 -6651 -12556 -12888 -7458 -5120 -1519 -2636
16167 -2636 -907 -8244 -8869 -11123 -10169 -14060 -13272 -12682 -8712 -7213 -961 -6552 -8266 -2627 735 148
16151 148 -2201 -653 -2569 -5265 -2932 965 4554 8501 5250 3327 -1933 -3615 -2250 -7280 -9585
16136i585J130k527r84L173P261K391L37q553l311K294k65n234n496M37J061O040
16120a1831M679J689Q8Q341L936n438m285r521r93l394K191J355K273L153n49
16105h306o97K170K273L298J49J225r32l21K062o561k690K503J695o020M765M769
16089f18J67N790J019J217o475n394M58k354K356K518k81J163R222k049m742l362
16073a365p754L113K212k792n901k369Q16P452Q06l876n317k253k885j334n67
16058b2014R113Q750P820j849J336K234n676r131J0731P33l776k364m229O807
16044a515l095k52L060L486K172n487o601l075J536J469O13l48l844N506m138
16029a0513O70R844K483r16P597L9q817m517p71n486l5J119O34l350m322j725
$$ plain form
16136 -9585 -8455 -10982 -11966 -8793 -1532 859 1196 -7357 -10668 -8374 -8639 -13873 -19369 -18932 -17871 -11831
16120 -11831 -7152 -5463 -5375 2966 6902 1464 -2821 -12342 -13335 -16729 -14538 -13183 -10910 -7757 -8306
16105 -8306 -9003 -6833 -4560 -1262 -1113 112 -820 -1141 921 -5640 -8330 -5827 -4132 -10152 -5387 -618
16089 -618 -451 5339 6358 7575 1100 -4294 -3836 -6190 -3834 -1316 -1597 -434 8788 6739 1997 -1365
16073 -1365 -9119 -6006 -3794 -6586 -12487 -14856 -14040 -6588 -5782 -9658 -14975 -17228 -20113 -21447 -22014
16058 -22014 -12901 -4151 3669 1820 3156 5390 -286 -9417 1314 2047 -1729 -4093 -8322 -1515
16044 -1515 -4610 -4862 -1802 1684 3856 -1631 -8232 -11307 -9771 -8302 -7689 -8037 -11881 -6375 -10513
16029 -10513 -9843 1 2484 1568 9165 9204 387 -4130 -4901 -10387 -10422 -9303 -8669 -12019 -16341 -18066
16013a8066N776K189N68n41k369l254o17n69N436N54O69K70N827L505m914N331
15997b05O927o967k376n426k030J097j0986m468J5271P408K1P2R95n71L923o653
15981c968R63L406q042k883k837P246J0851M733n823n251k282J996Q35r220j201
15966a1477p66M885R437j135j2043l065K677L146P306k973m899P47N67j77m78
15951h248J128J057P56l51o438J010O656L164M825k538n279L497j713q084k573
15936a3131P120J063m214j154J422L969l744M13j017n362K616M607J776k455K147
15921e944m56M30K998m18L272l67O402J506m97k350q621k613L206Q58j148m262
15905h004r998M66K285K947L87K707M765J818l699J212K334L777k392n463j779
$$ plain form
16013 -18066 -12290 -10101 -9533 -10074 -12443 -15697 -16314 -16883 -11447 -10893 -10224 -9954 -4127 -622 -5536 -205
15997 -205 6722 -245 -2621 -8047 -10077 -8980 -19966 -24434 -9163 -1755 -1734 -1662 -667 -1238 2685 -3968
15981 -3968 -3005 401 -7641 -10524 -13361 -6115 4736 9469 3646 -1605 -3887 -1891 -1056 -10276 -11477
15966 -11477 -12243 -7358 2079 944 -11099 -14164 -11487 -8341 -1035 -4008 -8907 -8160 -7593 -7770 -8248
15951 -8248 -7120 -6063 -5307 -5658 -12096 -11086 -4430 -1266 3559 1021 -4258 -761 -2474 -10558 -13131
15936 -13131 -6011 -4948 -9162 -10316 -8894 -4925 -8669 -8256 -9273 -14635 -12019 -7412 -5636 -8091 -5944
15921 -5944 -6400 -5970 -2972 -3390 -118 -485 5917 7423 6926 4576 -4045 -6658 -3452 -2594 -3742 -8004
15905 -8004 -18002 -17536 -15251 -12304 -11917 -9210 -4445 -2627 -6326 -5114 -2780 997 -1395 -6858 -8637
15890h637L213m407m5N201M695O047r063l321j347K730N273J064l427l190J203
15875d011k214n167P885P260o571n501l867p241N758O074n173J916l301j762j959
15860a7874n736Q31O371K923K933J466Mr86N648K313n73j835q42N261J493r181
15844g784q20O26K228l551K38N297n623j144N204p25J25K210J552j651K42j335
15828d911N438L213N375j603o556l274m332J505N82L834O178n77m335n886m315
15813i664M978P65j777M281O513N931p125J053j405m700q564j721K03J082J200
15798h950L269L56r50M385Q842k295K205m36k150l999q91J499n985p644r47J496
15782a2195L287K198L151P209K56l521n475r69j819o799N151K191q01o02K793
$$ plain form
15890 -8637 -5424 -9831 -9876 -4675 20 6067 -2996 -6317 -7664 -4934 339 1403 -2024 -5214 -4011
15875 -4011 -6225 -11392 -3507 3753 -2818 -8319 -12186 -19427 -13669 -7595 -12768 -10852 -14153 -15915 -17874
15860 -17874 -23610 -22779 -16408 -13485 -10552 -9086 -9082 -10068 -4420 -2107 -2680 -4515 -5357 -96 1397 -7784
15844 -7784 -8604 -7978 -5750 -9301 -9063 -3766 -9389 -10533 -5329 -6054 -5929 -3719 -2167 -3818 -3576 -4911
15828 -4911 527 3740 9115 7512 956 -2318 -6650 -5145 -4563 -729 5449 4872 537 -5349 -9664
15813 -9664 -4686 -3921 -5698 -1417 5096 11027 3902 4955 3550 -1150 -9714 -11435 -11232 -10150 -8950
15798 -8950 -5681 -5325 -6275 -1890 6952 4657 6862 6426 4276 277 -614 885 -5100 -12744 -13691 -12195
15782 -12195 -8908 -6710 -3559 3650 3906 385 -5090 -6059 -7878 -14677 -9526 -7335 -8136 -8738 -5945
15767e945J194n05j840N351K406j372K275N278k291m626l125q6J05j785J20K920
15751a926Q04J248m257j919N788l076j293o912k958N734O252K919N079p035j171
15736b723K456k952l333K808m84k759k109R04l847m300k856M789P04L062J0579
15721f1K830L102o882p329L932O941K200R17k395l94m543q608k618K833L755N485
15705h35N47J388L883r64j806j62J667p660l361K389L142N967qj050p988l246
15689h097l38l69J283L812P398k71k635p072l260M366K629k720o359j554M177
15674i010J0505Q131l789q847j4408m468L576P343N63K575J998O145Q852J614
15660A0780n243p114K137j773l905M73k5O770Q709n387j1748l702o430j042J908
$$ plain form
15767 -5945 -4751 -5256 -7096 -1745 661 -711 1564 6842 4551 -75 -3200 -3286 -3181 -4966 -4846 -1926
15751 -1926 -1122 126 -4131 -6050 -262 -3338 -4631 -11543 -14501 -8767 -2515 404 5483 -1552 -2723
15736 -2723 -267 -3219 -6552 -3744 -4228 -6987 -9096 -8192 -12039 -16339 -19195 -14406 -13702 -10640 -61
15721 -61 2769 5871 -1011 -8340 -4408 2533 4733 5650 3255 2861 -1682 -10290 -12908 -10075 -6320 -835
15705 -835 -288 1100 4983 4019 2213 2051 3718 -3942 -7303 -4914 -1772 4195 4187 3137 -4851 -8097
15689 -8097 -8435 -8804 -7521 -3709 3689 3418 783 -6289 -9549 -5183 -2554 -5274 -11633 -13187 -9010
15674 -9010 1495 9626 5837 -3010 -17418 -21886 -18310 -10967 -10404 -7829 -5831 314 9166 10780
15660 10780 5537 -1577 560 -1213 -5118 -4645 -4670 2100 10809 5422 -6326 -10028 -16458 -17500 -15592
15645a5592P797O428J542P31j654J724M084j927n607l531n973J036M119R610J357
15630D144n132n47j71o50J733J536n623k530r12k915L628R363j29p480L149P029
15614D493m320m013N362j249k90n742q684J221l962K116M203L547m809K26P822
15599d079O058L83N828l167o812O787r99m435l714l869J569N027k963o114M856
15584e644Q201l010m039j232N867m06o527k852O891P067L234q119n990m071N555
15569e075M784R27m67m930O733L899n230J688N91r184m595K520l625J266l172
15554a3870M829Q266j216k328k986Q89l335j155O56L157j532J142L319k062k781
15539i007l038n570j065O499O030p55j003n100j2572K156N998J0005K468o143
$$ plain form
15645 -15592 -7795 -1367 175 906 -748 976 5060 3133 -2474 -6005 -11978 -10942 -6823 2787 4144
15630 4144 -988 -1535 -1706 -2356 -623 913 -4710 -7240 -8152 -11067 -7439 1924 1795 -5685 -2536 4493
15614 4493 173 -3840 1522 273 -17 -5759 -14443 -13222 -17184 -15068 -10865 -7318 -12127 -11901 -4079
15599 -4079 1979 2362 8190 5023 -1789 4998 3999 -436 -4150 -8019 -6450 -1423 -4386 -10500 -5644
15584 -5644 2557 -453 -4492 -5724 143 -263 -6790 -9642 -2751 4316 7550 -569 -6559 -10630 -5075
15569 -5075 -291 636 169 -4761 1972 5871 641 2329 2920 -6264 -10859 -8339 -11964 -10698 -13870
15554 -13870 -9041 -775 -1991 -4319 -7305 -6416 -9751 -10906 -10250 -7093 -8625 -7483 -4164 -6226 -9007
15539 -9007 -12045 -17615 -18680 -12181 -6151 -6906 -7909 -13009 -25581 -23425 -17427 -7422 -4954 -11097
15525a1097Q12R052k155k481M22q786m930J455J126M435M060P94m159k664J814
15510a2302N286j641K294k772n818J0J0320M037j254j847j926L654n320j881N705
15495c455N401m539p733j305L696J256J977L493K462j578l857p692j660Q399N514
15480C79j619L491m518L546o448o704k611p47l553j914l905j678M573M652P430
15465i626j84m674N842R008o029k618k826m844J882K506R17L921o197M235j160
15450i847k763R116qQ20n63l628m104J231k425M189j381O03K631K991R10l346
15434e574j608M269j17q250l290L574J778K881k389l855n991J941L841N517K590
15419d683o562J312P744m02j145k617N34N189K754l459q394nO358K275R33M41
$$ plain form
15525 -11097 -10285 -1233 -3388 -5869 -5447 -14233 -19163 -17708 -16582 -12147 -8087 -7293 -11452 -14116 -12302
15510 -12302 -7016 -8657 -6363 -9135 -14953 -14943 -4623 -586 -1840 -3687 -5613 -1959 -7279 -9160 -3455
15495 -3455 1946 -2593 -10326 -11631 -7935 -6679 -4702 -1209 1253 -325 -4182 -11874 -13534 -5135 379
15480 379 -1240 2251 -2267 1279 -5169 -11873 -14484 -15231 -18784 -20698 -24603 -26281 -21708 -17056 -9626
15465 -9626 -9810 -14484 -8642 366 -5663 -8281 -11107 -15951 -14069 -11563 -10646 -6725 -12922 -8687 -9847
15450 -9847 -12610 -3494 -3502 -2682 -3245 -6873 -10977 -9746 -12171 -7982 -9363 -8760 -6129 -3138 -2228 -5574
15434 -5574 -7182 -2913 -3030 -11280 -14570 -10996 -9218 -6337 -8726 -12581 -18572 -16631 -12790 -7273 -4683
15419 -4683 -11245 -9933 -2189 -2591 -3736 -6353 -5819 -630 2124 -1335 -9729 -9734 -3376 -1101 -168 273
15403B73J408j804J334L325m082q55l595j979k567o586J040m337k137J0305O099
15388d158O592j707M04K411J628K543K758m180r015M624m082m907j482l63m828
15373a3762l211M471R587o262k337n926k86M48j740m2k636J373J222L404j474
15358a7171N81L887M074J831L580m400m564p00M029r11L30m87N701M915j472m501
15342e278j91K526o266J422l276j481M223l18M127K267q032q196N832M055M170
15327d416J688J84r40k458r96K467K452Q0r49l621K250L368K80k620o764K365
15311g630J716K186J686j0316p241P259M500M164l805M47L739j64j983K047J008
15296b387j2686l383K738j831L216K826k381L120l744R489L068k128o899M721
$$ plain form
15403 273 1681 -123 1211 4536 454 -401 -3996 -5975 -8542 -15128 -14088 -18425 -20562 -10257 -4158
15388 -4158 2434 727 1131 3542 5170 7713 10471 6291 -2724 1900 -2182 -7089 -8571 -8934 -13762
15373 -13762 -16973 -12502 -2915 -9177 -11514 -17440 -17726 -17278 -19018 -19060 -21696 -20323 -19101 -15697 -17171
15358 -17171 -16590 -12703 -8629 -6798 -3218 -7618 -12182 -12882 -8853 -9764 -9434 -9921 -4220 695 -777 -5278
15342 -5278 -5469 -2943 -9209 -7787 -11063 -12544 -8321 -8639 -4512 -2245 -10277 -18473 -12641 -8586 -4416
15327 -4416 -2728 -2544 -3484 -5942 -6938 -4471 -2019 -1939 -2888 -6509 -4259 -891 -611 -3231 -9995 -7630
15311 -7630 -5914 -3728 -2042 -12358 -19599 -12340 -7840 -3676 -7481 -7034 -3295 -3459 -5442 -3395 -2387
15296 -2387 -15073 -18456 -15718 -17549 -14333 -11507 -13888 -10768 -14512 -5023 -1955 -4083 -10982 -6261
15282f261L737n743k31j463K742j258M423L078Q67l839l178o255l348K797M181
15267i751L532M008K88k237n738n29J103j944k99K256K234k89N053m716j312K434
15251e907L39L165N723O588k500o304j465m01k566M808m13m602n663l61M648L448
15235a463n768J497n342K194K648J722O248r82o395p873M244L858k290k796L836
15220f662M02k509k152j034j630N614O232j975l798N841K938J047p636j016M868
15205a470Q12l485J100q9l947k545K772j931K01O18M287J358r596p235O444P360
15189e346L193q488q635L682R732Q56J647M66j680n1L182j387O580J023k399k453
15173g8j975J570K434j234L04R77l309M823l359j418n56K550M753l520n955J792
$$ plain form
15282 -6261 -2524 -8267 -8498 -9961 -7219 -8477 -4054 -976 -109 -3948 -7126 -13381 -16729 -13932 -9751
15267 -9751 -6219 -2211 -1923 -4160 -9898 -10427 -9324 -11268 -11567 -9311 -7077 -7366 -2313 -7029 -8341 -5907
15251 -5907 -5568 -2403 3320 9908 7408 1104 -361 -762 -3328 1480 1067 -3535 -9198 -9559 -4911 -1463
15235 -1463 -7231 -5734 -11076 -8882 -6234 -4512 1736 754 -5641 -13514 -9270 -5412 -7702 -10498 -6662
15220 -6662 -6260 -8769 -10921 -11955 -13585 -7971 -1739 -3714 -7512 -1671 1267 2314 -5322 -6338 -1470
15205 -1470 -658 -4143 -3043 -3132 -7079 -9624 -6852 -8783 -8582 -7964 -3677 -2319 -11915 -19150 -12706 -5346
15189 -5346 -2153 -10641 -19276 -15594 -5862 -5006 -3359 -2893 -4573 -4624 -1442 -2829 3751 4774 2375 -78
15173 -78 -2053 -483 1951 717 1021 1998 -1311 3512 153 -1265 -1821 729 5482 1962 -3993 -2201
15157b201M183j556m498M41J810p137k901K038M470Q863l120p02N092k540m529
15142b287L92M006M110j915n258j929K661P260j791j361R66l945l603k51j118
15127d063O414l495j1049L271K5Q66j522P057k12j976M641J273J471k949r71J894
15111F75J417M714l615j996j220J452j0497k373j481K536Q874j273J344L009J136
15096B702k020m625N7O298J832K195m931k385O516Q007j725n447n616k489Q13
15081h18K721j770L95k103J08l767o259J123J935J180M912j931l272J960m247
15066i833K191k650N177L919m680n379J192O5n756k757N411R857P170p644l101
15051f818L720J456L86j772m964M165O323o18L414P4p146l412l181J201M184O409
$$ plain form
15157 -2201 1982 426 -4072 -3631 -1821 -8958 -11859 -9821 -5351 3512 392 -310 4782 2242 -2287
15142 -2287 -1895 2111 6221 4306 -952 -2881 -220 7040 5249 3888 4854 909 -2694 -2945 -4063
15127 -4063 2351 -1144 -12193 -8922 -8897 -8031 -9553 -2496 -2708 -4684 -43 1230 2701 -248 -1219 675
15111 675 2092 6806 3191 1195 -25 1427 -9070 -11443 -12924 -10388 -1514 -2787 -1443 1566 2702
15096 2702 682 -3943 -3886 2412 4244 6439 1508 -877 5639 13646 11921 6474 858 -1631 -818
15081 -818 1903 133 528 -1575 -1467 -5234 -11493 -10370 -8435 -7255 -2343 -4274 -7546 -5586 -9833
15066 -9833 -7642 -10292 -5115 -1196 -5876 -11255 -10063 -9998 -15754 -18511 -13100 -3243 3927 -3717 -6818
15051 -6818 -3098 -1642 -1256 -3028 -7992 -3827 2496 1878 5292 5366 -1780 -5192 -8373 -7172 -2988 3421
15035C421N0n568o900M757O030r658l781M145L769o41k94m635l427j621j179L8
15019a5494q23M178l167K181o54j940J174L123O33K810N466O782K337m759k887
15004a040p637j700r0k186N251M38L003m27o971K770k400o46J856M161O918k35
14988A065J88j065q62o98K494k139l687l449K815J684j345L745r32J977P003k162
14972D632p538J976O818l066n486P99n172K599l613l113M897N318M186j791L059
14957D505j79j537l226P16L620j611O15P81j139M311L300R7l000k825J512N27
14941F467l955n320M346k599j982P05Q41l36M44L283j941L444L469j648n179M336
14925D375K615j890p709k193O52k563J499K459j851J952k707m794o003J215K78
$$ plain form
15035 3421 3471 -2097 -8997 -4240 1790 -7868 -11649 -7504 -3735 -4376 -4670 -9305 -12732 -14353 -15532 -15494
15019 -15494 -16317 -12139 -15306 -13125 -13779 -15719 -14545 -11422 -10789 -7979 -2513 4269 6606 1847 -1040
15004 -1040 -8677 -10377 -10467 -12653 -7402 -6964 -3961 -4388 -11359 -8589 -10989 -11635 -9779 -5618 1300 1065
14988 1065 1253 188 -674 -1372 1122 -1017 -4704 -8153 -5338 -3654 -4999 -1254 -2186 -209 6794 4632
14972 4632 -2906 -930 5888 2822 -2664 -1865 -7037 -4438 -8051 -11164 -6267 -949 3237 1446 4505
14957 4505 4326 2789 -437 279 3899 2288 2903 3684 2545 6856 10156 10253 7253 4428 5940 6467
14941 6467 2512 -2808 1538 -1061 -3043 -2338 -1497 -1833 -1389 1894 -47 3397 6866 5218 39 4375
14925 4375 6990 5100 -2609 -4802 -4150 -6713 -5214 -2755 -4606 -2654 -5361 -10155 -16158 -14943 -14665
14910a4665j042K102l52J496O363L947O280O549m064o637n315L828J336M814m273
14895C67k744o7Q348l292j1742k140O315k513O53O226m781n256Q269J0676j975
14880F344q073l106j343M233J034l145O678N798m883K803J0487L116n269m400
14866A0274M162P787l027j1199o981K412M160q059p079k828J301N76m661m79K273
14851a1368K688j375K097j732J34J341J744l919L715O511O709n462o198j312n372
14836a1799j419J989j775K27M793O075n185R51K046k748j941k487K398N521O26
14821b728J37P85K866M227J468l412p600J43K321k647J875k434K343P91M501n8
14805B578O22m024o804N364P294K213L280R47n057n532J502K639j930j866M560
$$ plain form
14910 -14665 -15707 -13605 -13957 -12461 -6098 -2151 4129 10678 6614 -23 -5338 -1510 -174 4640 367
14895 367 -2377 -2444 5904 2612 -9130 -11270 -4955 -7468 -6815 -589 -5370 -10626 -2357 8319 6344
14880 6344 -1729 -4835 -6178 -1945 -911 -4056 2622 8420 3537 6340 16827 19943 14674 10274
14866 10274 14436 22223 19196 7997 1016 3428 7588 -471 -7550 -10378 -9077 -8501 -13162 -13641 -11368
14851 -11368 -8680 -10055 -7958 -9690 -9556 -8215 -6471 -10390 -6675 -164 6545 1083 -5115 -6427 -11799
14836 -11799 -13218 -11229 -13004 -12777 -7984 -1909 -7094 -6143 -4097 -6845 -8786 -11273 -8875 -3354 -2728
14821 -2728 -2591 -1806 1060 5287 6755 3343 -4257 -4114 -1793 -4440 -2565 -4999 -2656 -1865 2636 2578
14805 2578 3200 -824 -7628 -2264 5030 7243 10523 11470 6413 881 2383 5022 3092 1226 5786
14790E786J095p302K330o81j810J036L809N567K785J676j779m489n132m361M82
14775i88L657J929j821l931j200M209l095Q84L831J54K839j141m771J775P93l735
14759f11k660o559o030M011N536N32K43j300O605M658J659l245k196J645m542
14744b254l74L047N841O819L515m206o046l132L920l231n347J981l29K185K608
14729D997m716m740N915K754n92K879L173j863n690J404Q679m610q740j849N54
14714b445j548n187j882K435K718N761P400O12p232j1381k146J423k461O634J1759
14699D460M462l018k007k87K267m142p321n660l362R778j566p279J634j530j663
14684a5234L522p19L143M204N783k597o067L857k536j483j407K542P94l360J818
$$ plain form
14790 5786 6881 -421 1909 1228 -582 454 4263 9830 12615 14291 12512 8023 2891 -1470 -988
14775 -988 2669 4598 2777 -1154 -2354 1855 -1240 -356 3475 3629 6468 5327 556 2331 3124 -611
14759 -611 -3271 -9830 -15860 -11849 -6313 -5781 -5538 -6838 -233 4425 6084 2839 643 2288 -2254
14744 -2254 -2628 419 6260 13079 16594 12388 6342 3210 7130 3899 -1448 533 204 2389 4997
14729 4997 281 -4459 1456 4210 3618 6497 9670 7807 2117 3521 12200 7590 -1150 -2999 -2445
14714 -2445 -3993 -9180 -11062 -8627 -5909 -148 7252 7864 632 -10749 -12895 -11472 -13933 -7299 4460
14699 4460 8922 5904 3897 3610 5877 1735 -5586 -11246 -14608 -4830 -6396 -13675 -12041 -13571 -15234
14684 -15234 -11712 -12431 -9288 -5084 699 -1898 -7965 -4108 -6644 -8127 -9534 -6992 -6198 -9558 -7740
14669g740L192P786k707R4k875J768o83l301p75M931O678L421K53l029k380o596
14653a963r43k02L38O936J988o034m607k349L140L955J68M441j604j954o57n927
14637e274j291j368k009K304J203l737K406P149R14N08N119L96K814k391L169
14622I912M970j310n151r349R7P918n600m626j77m090o21N770K607K565k776k157
14606b018M98L104j516m071L312O18m9l64j442j0396m576J574N214N419o33J365
14590c961N624m678r8K162J725j290Q47L862L185k952q666m70q5m345j771Q425
14574b486J885K009q72J086m000q80L54L551K579j0877n708J0721J071M425p44
14559B114J994K742m600P98K008j481l680m585R85p39J2391L434o963j054k098
$$ plain form
14669 -7740 -4548 3238 531 625 -2250 -482 -1165 -4466 -5241 -310 6368 9789 10042 7013 4633 -1963
14653 -1963 -2906 -3108 -2770 4166 6154 120 -4487 -6836 -3696 259 427 4868 3264 1310 653 -5274
14637 -5274 -6565 -7933 -9942 -7638 -6435 -10172 -7766 -617 297 805 5924 6320 9134 6743 9912
14622 9912 14882 13572 8421 -928 -831 7087 1487 -3139 -3316 -7406 -8027 -2257 350 2915 139 -2018
14606 -2018 -1520 1584 68 -4003 -691 -73 -122 -486 -1928 -12324 -16900 -15326 -10112 -4693 -5326 -3961
14590 -3961 1663 -3015 -3113 -951 774 -516 331 4193 7378 4426 -4240 -4710 -4795 -9140 -10911 -2486
14574 -2486 -601 1408 536 1622 -2378 -3258 -2904 647 3226 -7651 -13359 -2638 -1567 2858 2114
14559 2114 4108 6850 2250 3048 5056 3575 -105 -4690 -3705 -4444 7947 11381 4418 3364 1266
14544A266P19p451N456N717j94M59k527M073Q34p089j506P019k429K125l215j953
14528A304J970j365p382o915j985O774J860m90l826j250M48N949o35J9j91K596
14512c119L196j44L479m11m416k095k830M963K246p6L029k398K042m922j135m891
14496g482k760N016k89j027L894L837j2195k093M288p319K435K092j314N993Q179
14481A255L820P346j81o567r15K487p070j215M270J710q46l604J888l756j0904
14466a2282M56M127P83J083M293K965M065R04k895n902l387m927l031L91k67J0238
14450c386Q3l771KO79J039K472k910k532J65Q007O091j057n68Q452n852j0046
14434c132M788o06p101k102M861q23Q593K582J665l504n439L752o44j975P263
$$ plain form
14544 1266 1985 -5466 -10 5707 5513 5972 3445 7518 8352 1263 -243 6776 4347 6472 3257 1304
14528 1304 3274 1909 -5473 -12388 -14373 -7599 -5739 -6229 -10055 -11305 -10857 -4908 -5543 -5524 -5715 -3119
14512 -3119 77 -67 3412 3001 -1415 -3510 -6340 -1377 869 793 3822 1424 3466 -1456 -2591 -7482
14496 -7482 -10242 -5226 -5515 -6542 -2648 1189 -11006 -13099 -8811 -16130 -13695 -11603 -12917 -6924 1255
14481 1255 5075 12421 12240 5673 4758 7245 175 -1040 3230 4940 4094 490 2378 -1378 -12282
14466 -12282 -11826 -7699 -6916 -5833 -1540 1425 5490 6394 3499 -2403 -5790 -10717 -13748 -13357 -13624 -3386
14450 -3386 -3303 -7074 -7072 -6393 -5354 -2882 -5792 -8324 -8159 -152 5939 4882 4314 12766 6914 -3132
14434 -3132 1656 1050 -6051 -8153 -3292 -4115 4478 7060 8725 5221 -218 3534 2890 915 8178
14419H178J649l370k551m900j879J057j196m463Q83K503M31M9K225k045O936k540
14403I67m822r21j660j49P51J497o324J372J41n96O738k856k688M073L202j167
14387b442l131m466k085k139j766O434O08O103J064j315j896J213K415N755J700
14372F052k024J7l366L761K986m591j1728j446J710N052O402l685k162K717m001
14357d306l646J153r32k531P1o341Q115O830j33m854n530J607P687N246o277M460
14341F19N489K099j0417l343K31l382R09M774j051k125m004M998q44p904J281
14326a2670O976N242L459p328N4J97k520K21O714l99k71k619m280K89J490L953
14310a492J191N27L96j402r83j569k905O78L187p53o97p39j427K507m271m721
$$ plain form
14419 8178 9827 6457 3906 -994 -2873 -1816 -3012 -7475 -6592 -4089 -3658 -3609 -1384 -3429 3507 967
14403 967 -3855 -4776 -6436 -6585 -5834 -4337 -10661 -9289 -9148 -9744 -3006 -5862 -8550 -4477 -1275 -2442
14387 -2442 -5573 -10039 -12124 -14263 -16029 -9595 -8987 -2884 -1820 -3135 -5031 -3818 -1403 4352 6052
14372 6052 4028 4045 679 4440 7426 2835 -8893 -10339 -8629 -3577 2825 -860 -3022 -305 -4306
14357 -4306 -7952 -6799 -7731 -10262 -10191 -16532 -8417 -1587 -1720 -6574 -12104 -10497 -2810 2436 -3841 619
14341 619 6108 8207 -2210 -5553 -5322 -8704 -7795 -3021 -4072 -6197 -10201 -5203 -6047 -13951 -12670
14326 -12670 -5694 -452 3007 -4321 -4267 -4070 -6590 -6369 345 -54 -325 -2944 -7224 -6935 -5445 -1492
14310 -1492 -301 226 622 -780 -1763 -3332 -6237 -5559 -2372 -3125 -3822 -4561 -5988 -3481 -7752 -12473
14294a2473p530K839Q172O95l99l506P111O543J182J100j158n992n598M729K604
14279a681M636Q915l934o94L820m308l147j298o456l056l962K03O521J838J604
14264i99l511Q519k484j0717l035k52K251O133R72p902J822M875M701J358l09
14249A422j404q008j880P89J321M955Q03j85j916n376q752K947Q368k586o477
14234a5979j38J2702Q008o031l754J36K578O529o69k500J694R8q010r19M611q485
14218a0129q214J749N157L915Q411n85p14N552l112m123l249p613m81J009O215
14203f212l29P17O29j621K283M643o678l713m39L736N567k993o298q18M599N67
14187f360L081J97n62j330j55k012R36l750M818n91k229m125k029L823L195K647
$$ plain form
14294 -12473 -20003 -17164 -8992 -8297 -8696 -12202 -5091 1452 2634 3734 2576 -3416 -9014 -4285 -1681
14279 -1681 2955 11870 7936 7242 11062 6754 3607 2309 -4147 -7203 -11165 -10962 -4441 -2603 -999
14264 -999 -4510 4009 1525 -9192 -12227 -12479 -10228 -4095 -3123 -11025 -9203 -4328 373 1731 1422
14249 1422 18 -7990 -9870 -9081 -7760 -2805 -2002 -2187 -4103 -9479 -18231 -15284 -6916 -9502 -15979
14234 -15979 -16117 -3415 4593 -1438 -5192 -5056 -2478 4051 3382 882 2576 2674 -5336 -6255 -1644 -10129
14218 -10129 -18343 -16594 -11437 -7522 889 304 -410 5142 2030 -2093 -5342 -12955 -13436 -12427 -6212
14203 -6212 -6541 -5824 -5195 -6816 -4533 110 -6568 -10281 -10720 -6984 -1417 -4410 -10708 -11526 -6927 -6360
14187 -6360 -3279 -3082 -3644 -4974 -5129 -7141 -6205 -9955 -5137 -5728 -7957 -12082 -14111 -10288 -7093 -4446
14171d446N25L119n981q124k271K948K562L708P295o38k184l876J62L098j234
14156e337j888M671l016J026O372M887k402L941N611n918n153Q53P086L939k679
14141A1993n456j281L87m4k174j766j922K359q35q027k361o57k293N979Q134o
14125B030l276j992M762K08P25R666k409q810k664k288j402o700l56R477K583
14110d46k099k898L944K022k109n595k449m530K10M673j211l096l403O144J96
14095a0647M801O822m337j922K327L285n505N960O20r276k817l252K624N391L38
14080e588r36J158k847p325O444K742j546m76M678J316K390p24n970Q31M250p354
14064h957M89J0320K060o906n035p381n598J269J075K433m74J354K607L346L933
$$ plain form
14171 -4446 -3921 -802 -6783 -14907 -17178 -14230 -11668 -7960 -665 -1303 -3487 -7363 -7201 -4103 -5337
14156 -5337 -7225 -2554 -5570 -4544 1828 6715 4313 8254 13865 7947 2794 3647 10733 14672 11993
14141 11993 6537 5256 5643 5599 3425 1659 -263 2096 1261 -6766 -9127 -9784 -12077 -6098 2036 2030
14125 2030 -1246 -3238 1524 1732 2457 12123 9714 904 -1760 -4048 -5450 -12150 -12506 -3029 -446
14110 -446 -2545 -5443 -1499 523 -1586 -7181 -9630 -14160 -13950 -9277 -10488 -13584 -16987 -10843 -10647
14095 -10647 -5846 976 -3361 -5283 -2956 329 -5176 784 1404 -7872 -10689 -13941 -11317 -5926 -5588
14080 -5588 -6524 -5366 -8213 -15538 -9094 -6352 -7898 -8374 -3696 -2380 10 -714 -6684 -5853 -1603 -8957
14064 -8957 -8468 1852 3912 -2994 -8029 -15410 -21008 -19739 -18664 -16231 -16705 -15351 -12744 -9398 -5465
14049e465M332m330k941k7R645P544l788q535l74k841M09L226j157j052l739l399
14033a2492L136P108N451o955j920K345M494J117o792J049k618M429L144K12L16
14018B024R92M691K255k169J406M555o32Q787K939j069n7p959N591M733J856M727
14002C2670L365J0380J6044J5966Q788L841M986m28j765n71L756J2132L054p185
13988A05033j1505j1056L57k276j2044r568r934o460p013j140j1515j3633p474
13975A772L923J1404j402n204o766k622L89P2n420N059N197J976J078m198k719
13960B539n110p307L471J841Q7J551o141m016K093J3915N942J930N726j905q078
13945F538k147M275J063o063l288L495J232j853m885q34l823L637K861N602O59
$$ plain form
14049 -5465 -1133 -5463 -8404 -8431 1214 8758 4970 -3565 -3939 -6780 -6371 -3145 -4302 -5354 -9093 -12492
14033 -12492 -9356 -2248 3203 -3752 -5672 -3327 1167 2284 -4508 -3459 -6077 -1648 1496 1708 2024
14018 2024 3016 7707 9962 7793 9199 13754 13122 21909 24848 23779 23722 15763 21354 26087 27943 32670
14002 32670 36035 46415 62459 78425 87213 91054 96040 95612 93847 93276 97032 109164 112218 105033
13988 105033 93528 82472 82829 80553 68509 58941 49007 42547 35534 34394 22879 9246 1772
13975 1772 5695 17099 15697 10493 3727 1105 1494 1566 -3854 1205 6402 8378 9456 5258 2539
13960 2539 -2571 -9878 -6407 -4566 -4479 -2928 -9069 -13085 -10992 2923 8865 10795 16521 14616 6538
13945 6538 4391 8666 9729 3666 378 3873 5105 3252 -1633 -2467 -6290 -2653 208 5810 6469
13930F469k361M174O68l278L682l730q296J16P376q3j711K512j158J22J72l333
13914A341l104k511n528J096O995N900N424n874l841K463j383J01M418L637K435
13899A1569j001K338J41p95m177l506q807n428M184o03j733R76r08O51P187J481
13883A569j715J073o647k583J642M384J28k930n344O167J044o89L42L804l869
13868c624j339O594M614J099k243q23k820L253L03K478J350L351O41k652p683
13853B499q658J426L828L053q018M1J401L890M752L571J48k052k877K803J781
13838G588j767n798O85J688O429L913J59j866j403l947j297n891o792K377J2167
13823F245O815j166j563P01j317q45l123k469O399P454P26l876r567l502n261
$$ plain form
13930 6469 4108 8282 8950 5672 9354 5624 -2672 -2556 4820 4737 3026 5538 4380 4502 4674 1341
13914 1341 -1763 -4274 -9802 -8706 -1711 4189 9613 3739 -102 2361 978 1079 5497 9134 11569
13899 11569 10568 12906 13047 12252 8075 4569 -4238 -9666 -5482 -6085 -7818 -6842 -7750 -7099 88 1569
13883 1569 -146 927 -5720 -8303 -6661 -2277 -2149 -5079 -10423 -4256 -3212 -3901 -3559 245 -3624
13868 -3624 -4963 1631 6245 7344 5101 4278 1458 4711 5014 7492 8842 12193 12834 10182 2499
13853 2499 -6159 -4733 -905 2148 -5870 -5829 -4428 -538 4214 7785 7933 5881 3004 5807 7588
13838 7588 5821 23 708 2396 8825 12738 12897 11031 9628 5681 4384 -1507 -8299 -5922 6245
13823 6245 13060 11894 10331 11032 9715 8870 5747 3278 9677 17131 17857 13981 4414 912 -4349
13808d349l595K930O075O533L079q661l003L521k942O418l58n827k969N327Q775
13793A0954N823K815o892l958l201K241k692l142o492m597p80M754R106K012j36
13778E815o274j635l1J0929M485m439m797n314m425L807L800M717m477n921K546
13763a214j324j76L387K670o53K340K263k770Q031J855n087l834k743l189o332
13748f776j340O329K962n132L07K464l88l01K085N84p367k789R018j062j405J569
13732a242L377L138J441J833m616j0192k821O764P32L645J278J381q9n549m091
13717e011Q73q084k522J500L919j406k437K074K368j48l502n05k85L525N016j027
13701e652k820m83k670l99r33M31R383M422J101j299k65k462J896j573J728m071
$$ plain form
13808 -4349 -7944 -5014 1061 7594 10673 2012 -991 2530 -412 6006 5648 -179 -3148 2179 10954
13793 10954 16777 19592 12700 8742 5541 7782 5090 1948 -4544 -9141 -9921 -5167 3939 5951 5815
13778 5815 -459 -2094 -2125 8804 13289 8850 4053 -1261 -5686 -1879 1921 6638 2161 -3760 -1214
13763 -1214 -2538 -2714 673 3343 2690 5030 7293 4523 12554 14409 9322 5488 2745 -444 -6776
13748 -6776 -8116 -1787 1175 -3957 -3650 -1186 -1574 -1875 210 794 -6573 -9362 -344 -1406 -2811 -1242
13732 -1242 2135 5273 6714 8547 3931 -6261 -9082 -2318 -1586 2059 3337 4718 4629 -920 -5011
13717 -5011 -4138 -12222 -14744 -13244 -9325 -10731 -13168 -11094 -8726 -8874 -12376 -12881 -13166 -9641 -4625 -5652
13701 -5652 -8472 -8955 -11625 -12024 -12957 -12526 -3143 1279 2380 1081 816 -1646 250 -1323 405 -3666
13685c666o061p289n826Q989Q686L957M781j284q663M05N329k269J029J131l729
13670d480J295N030j086j2068R38M198J0577n206o753J873L721q49l013Q32m96
13655e487l766M54M555K631O558j74n706p43j431l810J752j695M428K108k096
13640b422q87K253O9q69P235J800M932m463j5082o096K954M977P540j226J046
13625A761j647J301N778k14m615o135N805j952K788K045k984m587n26k880n48
13610f610M754k248k362K933k239o500L850M468P631Q21q129M94K448m742n357
13595a0788m575K72M096K667O957L808K35O36o384l451K529N84K148R98j241m735
13579f244k642m433k419l653N129O404j185M869L012o62j512JJ570M206L479j406
$$ plain form
13685 -3666 -9727 -17016 -22842 -13853 -5167 -1210 3571 2287 -6376 -5971 -642 -2911 -1882 -751 -4480
13670 -4480 -3185 1845 759 -11309 -10371 -6173 4404 -802 -7555 -5682 -1961 -2810 -5823 -4991 -5487
13655 -5487 -9253 -8799 -4244 -1613 4945 4771 -935 -1678 -3109 -6919 -5167 -6862 -2434 -326 -2422
13640 -2422 -3309 -1056 -987 -1856 5379 7179 12111 7648 -7434 -13530 -10576 -5599 1941 715 1761
13625 1761 114 1415 7193 6979 2364 -3771 2034 82 2870 4915 1931 -2656 -3182 -6062 -6610
13610 -6610 -1856 -4104 -6466 -3533 -5772 -12272 -8422 -3954 3677 4498 -3631 -3137 -689 -5431 -10788
13595 -10788 -15363 -15091 -10995 -8328 -1371 2437 2672 3308 -3076 -6527 -3998 -3414 -1266 -268 -1509 -6244
13579 -6244 -8886 -13319 -15738 -19391 -14262 -7858 -9043 -4174 -1162 -1824 -3336 -3335 -1765 2441 5920 4514
13563D514l191m56N502k90K963K436l556M86j093p70O978P993o935r574j650L926
13547G283l10K722j341k896r50L969O333j477n957m096n725j121K682R617K283
13532A1016K0l666k599J173J124M437j3m482M894n663r825p489k563Q381N285
13517C0N604M1p182j883K491L743J343L104j405K649l183m558q20K741k381n325
13501d991KK812K809k404K106Q61k679j094L420r68k19K429L966j719M117L226
13485A1674Q593J241L052M744k609n915k122n62p097q821N463M930l49k377j466
13470H379N092J418j636L529m028L222J140l027J125n174o60l674l865N060l740
13455C161M767L175j696K107L879n206n806M07N575L758J183l404P070R818m60
$$ plain form
13563 4514 1323 867 6369 6079 9042 11478 7922 8408 7315 6545 13523 21516 14581 5007 3357 7283
13547 7283 6973 9695 8354 5458 4508 8477 14810 13333 7376 3280 -2445 -3566 -884 8733 11016
13532 11016 11036 7370 4771 5944 7068 11505 11492 7010 11904 6241 -3584 -11073 -13636 -5255 30
13517 30 5634 5675 -1507 -3390 -899 2844 4187 7291 5886 8535 5352 794 -26 2715 334 -4991
13501 -4991 -4989 -2177 632 -1772 334 1195 -1484 -2578 842 -126 -345 2084 6050 4331 8448 11674
13485 11674 20267 21508 24560 29304 26695 20780 18658 18096 10999 2178 7641 12571 12222 9845 8379
13470 8379 13471 14889 13253 16782 12754 15976 17116 14089 15214 10040 9380 5706 1841 6901 3161
13455 3161 7928 11103 9407 11514 15393 10187 4381 4788 10363 14121 15304 11900 18970 28788 28328
13440B8328k049m955K4N347N253l317k579O29o787l677k501K610L186l503o000
13425A0009K612L11p675m381N829Q932L923k441n862l479p250n275J031M241m033
13410c508k432M572O567o19M407K280m963k400K847n36M332O592k890l96N321
13395A9174q76R79L900m398m032k081j233J041M461J523L249P658p810j0360k087
13380I108L474L166j889J466N964l935j1046m075K797L13m225L424Q37l371m573
13365b565O709K478L761L005R1o155m801n180n38K936n82K546l156r592k318k313
13349a5674N428N89O499L023K683P754R67o570p827j188l63N083L355j348m304
13334a893q55j340M570O861M878l357m258m73M20K406m047p999n55J0455N805
$$ plain form
13440 28328 26279 21324 21348 26695 31948 28631 26052 26681 19894 16217 13716 16326 19512 16009 10009
13425 10009 12621 12932 5257 876 6705 15637 19560 17119 11257 7778 528 -4747 -3716 525 -3508
13410 -3508 -5940 -1368 5199 4580 8987 11267 6304 3904 6751 6215 10547 17139 14249 13853 19174
13395 19174 18298 19277 23177 18779 14747 12666 11433 12474 16935 18458 21707 29365 21555 11195 9108
13380 9108 12582 15748 13859 15325 21289 17354 6308 2233 5030 5343 1118 4542 5379 2008 -2565
13365 -2565 4144 6622 10383 13388 13479 7324 2523 -2657 -3195 -259 -841 1705 -1451 -11043 -13361 -15674
13349 -15674 -10246 -9657 -3158 -135 2548 10302 11269 4699 -3128 -4316 -4679 404 3759 2411 -1893
13334 -1893 -2748 -4088 482 7343 12221 8864 4606 4133 4553 6959 2912 -5087 -5642 4813 10618
13319A0618l489l268j256k627J22j413O248N682M220j157k952N877N278r24r139
13304A1820o286P11m369o53k898l706N45o25k870m73N304O284Q019M154p809J384
13288H532j231O24J170j992p18O872J1489j887o266n296n521K461L538J229k249
13273A0755j462l317k843o233J56q66M422j688K056P686J205j963P15J760M047
13258A4430K072n275k492J993N765M571m725k069p73L071o256l119l252k259k100
13243d18N886k508n26J332l326l090J24M814O436M790L39m235j274N966K925k292
13227A4943o898k298P977J91j138R705R57p446p536m870L004k192o94l853J09
13212c9L783j829J139Q048Q274J698k281l067o329n96N407j357J009J209l740
$$ plain form
13319 10618 7129 3861 2605 -22 100 -1313 4935 10617 14837 13680 10728 16605 21883 20959 11820
13304 11820 5534 6245 1876 1223 -1675 -5381 -4836 -5461 -8331 -8804 -3500 2784 10803 14957 7148 8532
13288 8532 7301 7925 9095 7103 6385 13257 24746 22859 16593 11297 5776 8237 11775 13004 10755
13273 10755 9293 5976 3133 -3100 -2944 -3810 612 -1076 980 8666 9871 7908 8623 10383 14430
13258 14430 16502 11227 8735 10728 16493 21064 16339 14270 13497 16568 10312 7193 3941 1682 -418
13243 -418 5468 2960 2434 3766 440 -2650 -2526 2288 8724 13514 13853 9618 8344 14310 17235 14943
13227 14943 8045 5747 13724 13915 12777 22482 23439 15993 8457 3587 6591 4399 3705 -148 -39
13212 -39 3744 1915 3054 11102 19376 21074 18793 15726 9397 8801 14208 12851 13860 15069 11329
13197A1329m968j190P721p22p232k167j166N158K845j756M9j714k769L659O688
13182A3765P132M062o036m367o288k955N664N238j074l000j517L875N542k524
13168A7517l557J83K706K686L409J894k904k762n16m231M532J329k563k696J74
13153A5201P785J095n360j917p76n214j416n727k522M148P510P238k423n07q36
13138A6279K066P61m402o50K67L377k620L855L751q91K314k854n035j168J827
13123A6877K950o010o951N329K751k064L406P801r162j324O914L406L198J483
13109B8604K023L985m142l487N950m595n16l296m320J969L41k878R73M452o666
13094A8397j073J409m882q57N152M731n515K349L091M420j146l401k853L120l098
$$ plain form
13197 11329 6361 5171 12892 12170 4938 2771 1605 6763 9608 7852 7901 6187 3418 7077 13765
13182 13765 20897 24959 18923 14556 8268 5313 10977 16215 15141 12141 10624 14499 20041 17517
13168 17517 13960 14143 16849 19535 22944 24838 21934 19172 18656 14425 18957 20286 17723 15027 15201
13153 15201 22986 24081 18721 16804 16028 10814 9398 3671 1149 5297 12807 20045 17622 17115 16279
13138 16279 18345 19106 14704 14054 14321 17698 15078 18933 22684 21793 24107 21253 16218 15050 16877
13123 16877 19827 13817 6866 12195 14946 12882 16288 24089 14927 13603 20517 23923 27121 28604
13109 28604 30627 34612 30470 26983 32933 28338 27822 24526 20206 22175 22516 19638 20611 25063 18397
13094 18397 17324 18733 13851 12994 18146 22877 17362 19711 22802 27222 26076 22675 19822 22942 19844
13079A9844q021n785l52n365j725L925L739M542l519o469k607O295O497N726k199
13064A4526O512m539K339L919K576p11j856K130m894M11M578O343N29K744J313
13049C5920k73K056K407K086l309o642k6R927N237M500O890J2964R036M184L585
13034H8542J5287J3490J3824J5666J7945K9543M8311N5568O7000P3057P6972O4193
13022E79398M5338K0949q330k8606n2051p4040p9707o6073o1463n2337l5583k5097
13010A62398j8215j9899j0293p480o441j2723j3657r958L733l851K108L205p617
12997F1310k849n515p674j060n923L462J130m724p146k079J282P63M88J207o25
12982C2047n340l364l229P06P091J0618p95o645m177K879N620L104j656p528q720
$$ plain form
13079 19844 11823 6038 5686 321 -1404 2521 6260 10802 7283 814 -1793 4502 10999 16725 14526
13064 14526 21038 16499 18838 22757 25333 24622 22766 24896 20002 20413 24991 31334 31863 34607 35920
13049 35920 35647 37703 40110 42196 38887 32245 32219 42146 47383 51883 58773 71737 80773 84957 88542
13034 88542 103829 117319 131143 146809 164754 194297 242608 298176 365176 438233 515205 579398
13022 579398 624736 645685 637355 608749 556698 482658 402951 336878 275415 223078 187495 162398
13010 162398 144183 124284 113991 106511 100070 87347 73690 63732 67465 63614 65722 68927 61310
12997 61310 58461 52946 45272 44212 38289 41751 42881 38157 31011 28932 30214 30977 31465 32672 32047
12982 32047 26707 23343 20114 20820 27911 38529 37734 31089 26912 29791 35411 38515 36859 29331 20611
12967B0611M010O604M347m840R81M811M015L029J051K891n163r627l331j270j594
12952B6525M666M989o456l352L270L711J373m369r390K99L098J674L783J952J343
12937C3116K753K019J714k86K501J352j155K43K313o812j1175l11O395L413M810
12922D0890o840K019Q214k608J200j623l818o595o789N468l20J878K361n658n709
12907B2070j85M418m532m756K557N944O417k251m027P420K318J62N30K297O613
12892D4995P55P372Q316M442O043Q513K224n916R49J315J889j306l871k329q262
12877F5129j5251P33o81k25l549m721m209O19N543j541P74M60M897j348M987J3110
12861F4727R687O561j69L988J0690K984j765o269L456Q39N151k877M1L668l15
$$ plain form
12967 20611 24621 31225 35572 30732 31713 36524 40539 43568 44619 47510 42347 32720 29389 28119 26525
12952 26525 31191 36180 29724 26372 29642 33353 34726 30357 20967 21266 24364 26038 29821 31773 33116
12937 33116 35869 37888 39602 39316 41817 43169 42014 42257 44570 37758 26583 26272 32667 36080 40890
12922 40890 34050 36069 44283 41675 42875 41252 37434 30839 24050 29518 29198 31076 33437 27779 22070
12907 22070 21885 26303 21771 17015 19572 25516 31933 29682 25655 33075 35393 35555 36085 38382 44995
12892 44995 45750 53122 61438 65880 71923 80436 82660 76744 77693 79008 80897 79591 75720 73391 65129
12877 65129 49878 50611 49930 49705 46156 41435 37226 37845 43388 41847 42621 43081 47978 46630 51617 64727
12861 64727 74414 80975 80806 84794 95484 98468 96703 90434 93890 94729 99880 97003 97044 100712 100397
12846A00397k245k939K431J2533m401l764l322j801p697j050J020n433j1250j0966
12832F1513J112J774o730j0611l253L470l31O113O987p382o415K179M814k626
12818E0614n304J461N71k08M976K485k846m642n892p043P041P095O684l805J574
12803E2761R383R841O652J4124J1405M275J135K668p641l879j2053n308m647o210
12789G2506k32n69j0366n196k663m752k074P817K868l173L709O457P34r15l86
12774F3765q11L421R466J2544J2185L753J5271K0744J9317J4079J4380M007r409
12761A82712j3087j0969j1498j6416j0067n683R8l638q411j1924m952Q782P072
12748A02019K767j575J045M922n925K520k475q239p651L134o016m163j370K5m727
$$ plain form
12846 100397 98152 95213 97644 110177 105776 102012 98690 96889 89192 88142 89162 83729 72479 61513
12832 61513 62625 64399 57669 47058 43805 47275 46944 53057 60044 52662 46247 48426 53240 50614
12818 50614 45310 46771 47342 47134 52110 54595 51749 47107 41215 34172 41213 48308 54992 51187 52761
12803 52761 62144 71985 78637 92761 104166 108441 109576 112244 104603 100724 88671 83363 78716 72506
12789 72506 72274 71705 61339 56143 53480 48728 46654 54471 57339 54166 57875 64332 65066 64151 63765
12774 63765 62954 66375 75841 88385 100570 104323 119594 140338 159655 173734 188114 192121 182712
12761 182712 169625 158656 147158 130742 120675 114992 115090 111452 103041 91117 86165 94947 102019
12748 102019 104786 103211 104256 109178 103253 105773 103298 95059 87408 90542 84526 80363 78993 79018 74291
12733G4291j0080m356M140p83k675J614K1871K3117J5290J8736J9236J7656L637
12720A81694K674L062L420J094M177l422p379L761L127m225M71P653K375O387
12706B04869m778n711P250P879J001l000m341L381L06R849J2136J723j0246l015
12692B17303P875o57L696Q493J2279M240L303J5576J7556N669J1506J2803Q628
12679C28270J87M97L799J1176P439J860L075p851M408J5241J9959J4464J3515
12666D16039J6184J3438J3328J2953K1806J6131P003J3611J4105J2029J5176J4597
12654E86400J2996K3386K6714K9464L7358L6203L8703M4025M8759M0614M6200
12643I70822M8409M4620M5187M4506M3789N0378M7467M9749O6110P8561R1663
$$ plain form
12733 74291 64211 59855 63995 63212 60537 62151 84022 107139 122429 141165 160401 178057 181694
12720 181694 184368 187430 190850 191944 196121 192699 185320 189081 192208 187983 188454 196107 198482 204869
12706 204869 200091 194380 201630 209509 210510 207510 203169 206550 206856 216705 228841 230564 220318 217303
12692 217303 225178 224521 228217 236710 248989 253229 256532 272108 289664 295333 306839 319642 328270
12679 328270 328457 328954 332753 343929 351368 353228 356303 348452 352860 368101 388060 402524 416039
12666 416039 432223 445661 458989 471942 493748 509879 516882 530493 544598 556627 571803 586400
12654 586400 599396 622782 649496 678960 716318 752521 791224 835249 884008 924622 970822
12643 970822 1019231 1063851 1109038 1153544 1197333 1247711 1295178 1344927 1411037 1489598 1581261
12632A581261J03632J11600J22383J40545J66628J84052K14665K44185K69450
12623C138401L09279L61360M25283N09373O19839P49090Q82878J019712J157859
12614I173074J292814J438943J657042J982267K486720L243426M373481O018826
12606C1666593Q245736J0897623J3427794J5153308J5357339J3551692R746561
12599A18046646M552296j170335o615008j1109377j4107851j5161404j4294187
12592F0140780j2111548r504647p141272n290688l943240l007686k375096j956505
12584A4810098j675831j496447j343216j212679j079832r48435q20862o98519
12576E534277n86879m94239m17770l53179l03746k63099k35435k12025j88763
$$ plain form
12632 1581261 1684893 1796493 1918876 2059421 2226049 2410101 2624766 2868951 3138401
12623 3138401 3447680 3809040 4234323 4743696 5363535 6112625 6995503 8015215 9173074
12614 9173074 10465888 11904831 13561873 15544140 18030860 21274286 25647767 31666593
12606 31666593 39912329 50809952 64237746 79391054 94748393 108300085 118046646
12599 118046646 122598942 121428607 114813599 103704222 89596371 74434967 60140780
12592 60140780 48029232 38524585 31383313 26092625 22149385 19141699 16766603 14810098
12584 14810098 13134267 11637820 10294604 9081925 8002093 7053658 6232796 5534277
12576 5534277 4947398 4453159 4035389 3682210 3378464 3115365 2879930 2667905 2479142
12567B479142j69415j52219j39865j28690j18785j11634r8270q8845p8303o8328
12557A324788o6603o1018n8226n3608n2979m9116l6849l4530l3653l7022l4031
12546H07153k5989l1679l2416k3337k1857k9472k8356j7847j6747k4189j8552
12535E36712j9294j8481j3340j9279j0911n877l785p048r838n384o238j1228j1111
12522C94898o579q002q575q855o942l271l469o66m334j2140j0740q332j2999o150
12508B93844q100r184m707l277p690m434L256j2898m287K517r646j913q577j1914
12494B12990k459k45R1q009q808j827k973n562j1906m349l140p853J215L967N368
12479A66500P625J5349J5532J6391J5383J4159J0996J9781J6820R548N283j937
$$ plain form
12567 2479142 2309727 2157508 2017643 1888953 1770168 1658534 1560264 1471419 1393116 1324788
12557 1324788 1258185 1197167 1138941 1085333 1032354 983238 946389 911859 878206 841184 807153
12546 807153 781164 749485 717069 693732 671875 642403 614047 596200 579453 555264 536712
12535 536712 517418 498937 485597 466318 455407 449530 445745 438697 428859 423475 417237 406009 394898
12522 394898 388319 380317 371742 362887 355945 352674 349205 348539 344205 332065 321325 312993 299994 293844
12508 293844 285744 276560 271853 268576 260886 256452 259708 246810 242523 245040 235394 233481 224904 212990
12494 212990 210531 210286 210377 202368 193560 191733 188760 183198 171292 166943 163803 155950 157165 161132 166500
12479 166500 174125 189474 205006 221397 236780 250939 261935 281716 298536 308084 313367 311430
12467C11430l439j1842o320j4869k2280j6457j1154o833p434p000m659K945m824
12454A97264j1730q506k024K242M177k892l889m457k356o925j1333j0118r78K70
12440A38745K29j4310k188r77M51O413M398J249L287P81l901l44O79k528o904
12425A25080J527n620n83J578l522l636q63O369J2336J7512J3092L236j473m621
12411A60412r839o336o416j983L85j737K517J2568N873J4000K0582K2202K3180
12398B35408J9990J0886P091N012R05r199j8200j4867j6844k1433j7375j3021
12386A68353j8286n326o091k823m43j2594q942q191Q90o190o729l13l313J556
12372I1558j734j906k315J574j495p23N99J989o178j935l166n702m790K921j294
$$ plain form
12467 311430 307991 296149 289829 274960 252680 236223 225069 218236 210802 203802 199143 202088 197264
12454 197264 185534 177028 175004 177246 181423 178531 174642 170185 167829 160904 149571 139453 138475 138745
12440 138745 138974 124664 122476 121499 121950 128363 132761 134010 137297 138078 134177 133833 134512 131984 125080
12425 125080 126607 120987 120404 121982 118460 114824 113961 120330 132666 150178 163270 166506 165033 160412
12411 160412 150573 144237 137821 135838 136223 134486 137003 149571 155444 169444 190026 212228 235408
12398 235408 255398 266284 273375 278387 279292 270093 251893 237026 220182 198749 181374 168353
12386 168353 150067 144741 138650 135827 135384 122790 113848 105657 106547 100357 93628 93315 90002 91558
12372 91558 89824 87918 85603 87177 85682 84959 85558 87547 81369 79434 76268 70566 65776 68697 67403
12357F7403k045j414l754K24Q221Q990M078M573k137L496M557Q4n591k48M678
12342I1115l489J659O484R093J2957J4396J6791K1444K1182K1706K1251J2496
12330B47085J111k06m342o420j2131r459n404j2664l974n604q127m91n826q514
12316A65034p215l164j303k36j1848j1485j6851j8612q571p830o289r577j096
12303F0957N318O128M944J255J109m008m267N30m1P7j175j1466m810L398K758
12288F0707n398P269O595L755j649k716o509p75J101l294p765n351j486m35M35
12273D4484P839J0515k446n216N973l803m864K107Q091K041J11n765l376N341
12259F1032K053L167O189p38P031P594M231M780L864l82L286k517J995m60j0009
$$ plain form
12357 67403 65358 63944 60190 60414 68635 77625 81703 86276 84139 87635 92192 92276 86685 86437 91115
12342 91115 87626 89285 95769 104862 117819 132215 149006 170450 191632 213338 234589 247085
12330 247085 248196 247990 243648 237228 225097 215638 210234 197570 193596 187992 179865 179374 173548 165034
12316 165034 157819 154655 153352 153116 141268 129783 112932 94320 85749 77919 71630 62053 60957
12303 60957 66275 72403 77347 78602 79711 75703 71436 71966 71925 72002 70827 59361 54551 57949 60707
12288 60707 55309 62578 69173 72928 71279 68563 62054 61279 62380 59086 51321 45970 44484 44049 44484
12273 44484 52323 62838 60392 55176 61149 57346 52482 54589 62680 64721 64832 59067 55691 61032
12259 61032 63085 66252 72441 71703 78734 86328 90559 95339 99203 98821 102107 99590 101585 101125 91116
12244I1116q795K311j637q750p562l455l578N184L238M406j821P118M967O08J03
12229H3453j618K861N895N495J237r908M09M844K774k650m472j0374M5Q448n623
12214H0816p51R517R820P242K343N553M890N598l440r422j0889J65k518j188R012
12199A06748J3317J3144J0720O489L917l678j2236j059J650P74l487P7K484r45
12185A37915N615K731M72J6821J8622J5505K4399M2523N4266P2093P4974P7161
12173E43097P6052O8197M6499R472j4581l9324o3375o0084n7881l8272k5287J113
12161D45626K8479M6916P2876Q8018R3666P9352M8912J6097k3499o3541r3500
12150G39402j09359j04354r8008q2182o8362n1654l4351k5124q892j8255j1633
$$ plain form
12244 91116 82321 84632 82995 74245 66683 63228 59650 64834 68072 72478 70657 77775 82742 83350 83453
12229 83453 81835 84696 90591 96086 97323 87415 87824 92668 95442 92792 88320 77946 77991 86439 80816
12214 80816 80065 89582 99402 106644 108987 114540 119430 125028 121588 112166 101277 101442 98924 97736 106748
12199 106748 120065 133209 143929 150418 154335 150657 138421 137362 139012 139786 136299 136376 138860 137915
12185 137915 143530 146261 146733 163554 182176 197681 222080 264603 318869 390962 465936 543097
12173 543097 619149 687346 733845 743317 728736 689412 626037 565953 508072 469800 444513 445626
12161 445626 474105 521021 593897 681915 775581 854933 903845 919942 896443 832902 739402
12150 739402 630043 525689 427681 345499 277137 225483 191132 166008 157116 138861 127228
12139A27228o679q905p043o439n921K179N166j0029P02K305L733k524k219J308
12125I2862L384l52M4N794L59Q433N772M952L339j07O003M288O697R863J4067
12110A65398K0853J8251J8749J5256O491m494o443n692j1489k3158k3674j0551
12098A59497k321j115R955O890J0349L538J00m323r88n010j0730m948j310N055
12084A64639J6305J3907J2648K0577L7086L4867M2319L6493L5709K8585O621l394
12072D46362j9974l1192l7265l6697l8960m0085k6776r544k189m531O9q52j633
12059A96733M235K83l794l477o68p42j193j794J3557J3600R112J5839K0309O072
12045B68072K0751J2238R694L311P040J4934K3257K1110K8735K2373J5757K861
$$ plain form
12139 127228 120549 111644 104601 98162 92241 94420 99586 89557 90259 92564 96297 93773 91554 92862
12125 92862 96246 95894 95938 101732 102091 110524 116296 121248 124587 124480 130483 134771 141468 151331 165398
12110 165398 186251 204502 223251 238507 244998 240504 234061 228369 216880 193722 170048 159497
12098 159497 157176 156061 166016 172906 183255 186793 186893 182570 181582 176572 165842 160894 159584 164639
12084 164639 180944 194851 207499 228076 265162 300029 342348 378841 414550 443135 449756 446362
12072 446362 426388 395196 357931 321234 282274 242189 215413 205869 203680 199149 199218 198366 196733
12059 196733 200968 201251 197457 193980 193312 192570 191377 189583 203140 216740 225852 241691 262000 268072
12045 268072 288823 301061 310755 314066 321106 336040 359297 380407 409142 431515 447272 450133
12033D50133o931k7020l2851l7429l7665l8033l7744k6847l0408k3460k0482j7137
12021A14126m916q015n725K616K622J967K646N252N915j152o563m593N214n91
12007A08803m252l625O044N527l154M011P367R077J0266J9621K1887J8758K1455
11994B21785P383J310j748j7230j7259k1653k6471j8763o072j2775p926M837r84
11981A04434n923l590n029k216q040o576j675l618N209j61K502n76Q19m05J698
11966G6853J598L852K280k985l010L854l422l468m733k070M129N542O581k843
11952H2158m37j207p373m000l97O967n68N872L095K658N09l119L388m800o851
11937G5895m86p57M121M112p860n346Q348L099J327J09k665m581j6Q543K409n392
$$ plain form
12033 450133 443202 416182 383331 345902 308237 270204 232460 205613 175205 151745 131263 114126
12021 114126 109210 101195 95470 98086 100708 102675 105321 110573 116488 115336 108773 104180 109394 108803
12007 108803 104551 100926 106970 112497 109343 113354 120721 129798 140064 159685 181572 200330 221785
11994 221785 229168 230478 228730 211500 194241 172588 146117 127354 121282 108507 100581 105418 104434
11981 104434 98511 94921 89892 87676 79636 73060 71385 67767 72976 72815 75317 74741 75560 75155 76853
11966 76853 78451 82303 84583 81598 78588 82442 79020 75552 70819 68749 72878 78420 85001 82158
11952 82158 81721 80514 73141 69141 68744 75711 75143 81015 84110 86768 87277 84158 87546 82746 75895
11937 75895 75409 74652 78773 82885 75025 69679 78027 81126 82453 82562 79897 75316 75300 83843 86252 80860
11921H0860J881N276K200J536O453K997L533k422m877l637k424j907m066J260
11907H6663Q65L814P173P138M776j074o465r114o829n057M452J317o582J257J0606
11892I2940q72L58k655M951L668j113m522l284k082k607l749K807M643Q324j463
11877I5344l016m03j911M591P440K507j481m888m890P75J0256R255J358m320k909
11862A07708K642O213m849j849n981K593M980O613O415J842o960n974l268K202
11848A12327L439m37k571j347q354l332J975j047J424J2918Q442M043O016O044
11834A39540J5889K5809J9676J6337J9389K2303N413n894j0754p093j7515k4381
11822A98719k3239j4435n177m254r644M911L177l26O857O064P12O365j127q517
$$ plain form
11921 80860 82741 88017 90217 91753 98206 101203 104736 102314 97437 93800 91376 89469 85403 86663
11907 86663 87528 91342 98515 105653 110429 109355 102890 93776 86947 81890 86342 87659 81077 82334 92940
11892 92940 92068 92426 89771 94722 98390 97277 92755 89471 87389 84782 81033 83840 88483 96807 95344
11877 95344 92328 91925 90014 94605 102045 104552 103071 98183 93293 94068 104324 113579 114937 110617 107708
11862 107708 110350 116563 111714 109865 103884 106477 111457 118070 124485 126327 119367 113393 110125 112327
11848 112327 115766 115329 112758 111411 103057 99725 101700 100653 102077 114995 123437 127480 133496 139540
11834 139540 155429 181238 200914 217251 236640 258943 264356 258462 247708 240615 223100 198719
11822 198719 175480 161045 155868 151614 141970 146881 150058 149732 156589 162653 163365 169730 168603 160086
11808A60086m014K660q889n417O73K166k72J777J375J497j605j63l5M220r49m913
11792A48197O981P049P049J181o888o290m167L285R83K574P744J0539P276J0194
11778A95707O012O210J0385N032J462J2035J0236n578n032J432Q65k009l718L99
11764B33438l38O68l9J117N843L085l324J545P859J3262J0445J2918M530O914
11750B97923R258R282l250O53K604k030j933P642J2241J6843J9254J4876K6613
11737D09976K6852J8388K5108K9483K4017J6042R979J1062J1065J1960J2994J1006
11725F17932J6991J5903K0208K6110L7086L1255L6176L8614M6469N6482O4844
11714A008070O8356P2688Q5618J08894J22018J31617J57984J75649J90830K31470
$$ plain form
11808 160086 156072 158732 149843 144426 145099 147265 146993 148770 150145 151642 150037 149874 149839 154059 153110 148197
11792 148197 155178 162227 169276 170457 163569 157279 153112 156397 157380 159954 167698 178237 185513 195707
11778 195707 201719 207929 218314 223346 224808 236843 247079 241501 236469 237901 238766 236757 233039 233438
11764 233438 233100 233768 233729 234846 240689 243774 240450 241995 249854 263116 273561 286479 291009 297923
11750 297923 307181 316463 313213 313866 316470 314440 312507 320149 332390 349233 368487 383363 409976
11737 409976 436828 455216 480324 509807 533824 549866 559845 570907 581972 593932 606926 617932
11725 617932 634923 650826 671034 697144 734230 765485 801661 840275 886744 943226 1008070
11714 1008070 1076426 1149114 1234732 1343626 1465644 1597261 1755245 1930894 2121724 2353194
11704B353194K79900L24288L81994M71027N98178P82156J037803J388893J898179
11695I515612K588467L382969M036000M256133L897501K952550J549313R730j387899
11686C0800376k502595l198365l237625k636113j695838p17182J22510P61065
11678A7696233J144008J154921Q45395M76794J25999k91177o96331r15077r30752
11669A8610013p91542m61604Q9545P76608J493849K170068K762793L255355L591775
11660C1496860L704865L688470L726649L810304L664624L036136J889276L82668
11652E5399852j301454k998365m306756m974861m911378m148099k920268j649055
11644B8189616o16390O9395K73873M3725k93192n41374p60550q84871p61774l57684
$$ plain form
11704 2353194 2633094 2957382 3339376 3810403 4408581 5190737 6228540 7617433 9515612
11695 9515612 12104079 15487048 19523048 23779181 27676682 30629232 32178545 32188275 30800376
11686 30800376 28297781 25099416 21861791 19225678 17529840 16812658 16935168 17696233
11678 17696233 18840241 19995162 20840557 21317351 21443350 21152173 20455842 19540765 18610013
11669 18610013 17818471 17356867 17446412 18223020 19716869 21886937 24649730 27905085 31496860
11660 31496860 35201725 38890195 42616844 46427148 50091772 53127908 55017184 55399852
11652 55399852 54098398 51100033 46793277 41818416 36907038 32758939 29838671 28189616
11644 28189616 27573226 27642621 27916494 27960219 27667027 27125653 26365103 25480232 24718458 24360774
11634B4360774L11668J270169K440616L491510M040631L910972L107197J648099
11626D4581636j10305j616247k636718l085428k740528j595615J00587K048645
11618C4946027L931113N446447O282018O113356M879681K748231n8186k977601
11610F1311086n285858o685732p216015o996110o209490n172968m118992l177225
11602A6448696k413530j825864j361996j000887p35559n44622m09165l47654l51539
11593G457880l56536l21359k77331k24868j77519j18734n3698K1580J18395K55883
11583F323693M72135P71828J194921J798991K617590L663914M696268N261705
11575B6801045N103103M189280K415199r3568k595444m377828n285789n326566
$$ plain form
11634 24360774 24672442 25942611 28383227 31874737 35915368 39826340 42933537 44581636
11626 44581636 44471331 42855084 40218366 37132938 34392410 32796795 32897382 34946027
11618 34946027 38877140 44323587 50605605 56718961 61598642 64346873 64288687 61311086
11610 61311086 56025228 49339496 42123481 35127371 28917881 23744913 19625921 16448696
11602 16448696 14035166 12209302 10847306 9846419 9110860 8566238 8157073 7809419 7457880
11593 7457880 7101344 6779985 6502654 6277786 6100267 5981533 5927835 5949415 6067810 6323693
11583 6323693 6795828 7567656 8762577 10561568 13179158 16843072 21539340 26801045
11575 26801045 31904148 36093428 38508627 38415059 35819615 31441787 26155998 20829432
11567B0829432m646432l615628k646747j915167j383868j024248p72818n94978
11559D229546m70581l77001l14408k63417k41355k26957j94113j64086j41003
11550A836625j23688j07575r5415q3363r1467j00331q5972p1499o6588o3381n6414
11539H90932n4411m5922m2680l9349k1984l2770k8905k0656j6717j6697q915j1233
11527E50693j3376r891j1473p740j0462o108r039q433m989j1355k2565j5732r358
11514D10172j6807j6987o077m876n617k582l336Q51L407R352j431K598J1647l415
11500C76899j110K642N822J0978J6497K2994L5718M2216L2401K4752R320k588
11488E76541j3052k7926k4813k1423k6029k7244k5640j3798k3725k9927j9429
$$ plain form
11567 20829432 16183000 12567372 9920625 8005458 6621590 5597342 4824524 4229546
11559 4229546 3758965 3381964 3067556 2804139 2562784 2335827 2141714 1977628 1836625
11550 1836625 1712937 1605362 1509947 1426584 1335117 1234786 1148814 1077315 1010727 947346 890932
11539 890932 836521 790599 747919 708570 686586 653816 624911 604255 587538 570841 561926 550693
11527 550693 537317 527426 515953 508213 497751 491643 482604 474171 469182 457827 435262 419530 410172
11514 410172 393365 376378 370301 365425 359808 357226 353890 354741 358148 367500 366069 368667 380314 376899
11500 376899 375789 378431 384253 395231 411728 434722 470440 512656 545057 569809 579129 576541
11488 576541 563489 535563 510750 489327 463298 436054 410414 396616 372891 342964 323535
11477C23535k0110o183j909j1351j3662r657p115l747r43J163p141p371j1081
11464B24428o146q21L431l357k646j489J204l834o354J72j130l859q032J076J0484
11449B03127J3688J3103R044N293J2957Q914K497L521J461m726r845o172o329
11436B46533j4701j3841q474J852N298O264p155j455N328k252p529j0048o977
11423A92843r98L973j3765j3336o413o487p241q208L049Q301R814Q823P266Q304
11409A85925K1154K6467L2130K6084K8240J7201P868J359k0584k4925k3254l0368
11397B47297j2950k735j0129j0041j0344p332m796l606J42K631o230q568j430
11384A71909l127M96k162p16k659J585J1255M998N717J5414J9339K4318J6848
$$ plain form
11477 323535 303425 297242 295333 283982 270320 260663 253548 249801 248858 250021 242880 235509 224428
11464 224428 218282 217461 220892 217535 214889 213400 214604 210770 204416 204588 203458 199599 191567 192643 203127
11449 203127 216815 229918 238962 244255 257212 266126 268623 272144 273605 268879 259034 252862 246533
11436 246533 231832 217991 209517 211369 216667 222931 215776 214321 219649 217397 209868 199820 192843
11423 192843 191845 195818 182053 168717 162304 155817 148576 140368 143417 151718 161532 170355 177621 185925
11409 185925 207079 233546 265676 291760 320000 337201 345069 346428 325844 300919 277665 247297
11397 247297 234347 231612 221483 211442 201098 193766 188970 185364 185506 188137 181907 173339 171909
11384 171909 168782 169278 167116 166400 163741 165326 176581 181579 187296 202710 222049 246367 263215
11371B63215J3014J7719K1920J7602J2478M903m913j3412j5239j9452j0558k632
11359B84645j0798j0729j0026j1608q552l296j4019k1181j4785o932l684m681
11347A64354j02K947Q311O071M937K150k094j156m451p51J391O68K991P849J5395
11332B08510J8207K7751K6833K0787J1794m869j7359k1892k0297j8403j9124j5909
11320A96029p637M704O287J2015J4522K1517K8065J9978K4879K5360R769p033
11308C48455j6878j9398j2353k2895k9320j1652j226K033j40J005j362j0840r353
11295B16076q640j0771j1113j925p720q947o56R328P823P571J860J488J5601K6672
11281B36647K0864J9237L112p029j0775K217n453j2580L269M621J4667J5033J0539
$$ plain form
11371 263215 276229 293948 315868 333470 345948 350851 345938 332526 317287 297835 287277 284645
11359 284645 273847 263118 253092 241484 232932 229636 215617 194436 179651 172719 169035 164354
11347 164354 164252 167199 175510 181581 186518 188668 186574 185418 180967 180216 181607 182275 185266 193115 208510
11332 208510 226717 254468 281301 302088 313882 309013 291654 269762 249465 231062 211938 196029
11320 196029 188392 193096 199383 211398 225920 247437 275502 295480 320359 345719 355488 348455
11308 348455 331577 312179 299826 276931 247611 235959 234733 236766 236626 237631 236269 225429 216076
11295 216076 207436 196665 185552 183627 175907 166960 166304 175632 183455 191026 192886 194374 209975 236647
11281 236647 257511 276748 279860 272831 262056 264273 258820 246240 249509 254130 268797 283830 294369
11268B94369J2796J9440J3933K645q399n293o112j1396j0240p347m903j302N315
11255B93506J2057J4644J6391J6705Q260L195N419N353p0k146j4097j6981k1917
11242C20319p685m849k377K596l38M277m8k85K398r135q684K673J2904J4669J3662
11227C40097J5463J9419J2977N361j3056j4137j5105j7253j6056r668n906L215
11215C05351r50l458n077K372J964P761J5447J9060K0657K7594K6667K6056K4219
11202D67663L6067L3442J5078j3768m4102o2699o0801m5722k0464j4058j150K0270
11190C09756K7546L0670L6205L4443K2141J770j8283k7107l0248m1236l4213l0291
11178B81153l2393k6900k3446j1392j2457n877J704O085Q368k567n513k293p12
$$ plain form
11268 294369 307165 326605 340538 343183 334784 329491 323379 311983 301743 294396 289493 288191 293506
11255 293506 305563 320207 336598 353303 361563 364758 370177 375530 375460 373314 359217 342236 320319
11242 320319 312634 307785 305408 308004 307666 311943 311895 311610 314008 304873 296189 298862 311766 326435 340097
11227 340097 355560 374979 387956 393317 380261 366124 351019 333766 317710 308042 302136 305351
11215 305351 304401 300943 295866 298238 300202 307963 323410 342470 363127 390721 417388 443444 467663
11202 467663 503730 537172 552250 538482 494380 431681 370880 325158 304694 290636 289486 309756
11190 309756 337302 367972 404177 438620 460761 462531 444248 417141 386893 345657 311444 281153
11178 281153 248760 221860 198414 187022 174565 168688 170392 176477 184845 182278 176765 174472 173760
11165A73760l422j735K622Q02R796Q917j424N298J3682K4872K6400M978r798m809
11151B49939O271J7988K1979K1656K3138R596j2795k1901j5297k6156k3062k6536
11139B24820j7962q962j0094o823m533j1451K641Q416M707L002O883K788j959
11126A91473n882m925K742l022j6716k3168j0049k089m111N248Q316Q882N38O569
11112A53806M600O877m210K258J032M431L317n303n589n154k675j053N433q09
11098A56961L719K111K627L588m71K543n418l704j799j585L185k076J337J094
11084A62112k769p286j476P329Q228N539K070O890P932P635K167J779L349M276
11070B07775J2443m13j253L620K137P27P933J721P909O124K509M823j510q08N240
$$ plain form
11165 173760 170338 168603 171225 172027 181823 190740 189316 194614 208296 233168 259568 264546 254748 249939
11151 249939 256210 274198 296177 317833 340971 350567 337772 315871 300574 274418 251356 224820
11139 224820 206858 197896 187802 180979 176446 164995 167636 176052 180759 183761 190644 193432 191473
11126 191473 185591 180666 183408 180386 163670 140502 130453 128364 124253 129501 137817 146699 147237 153806
11112 153806 158406 165283 161073 163331 164363 168794 172111 166808 161219 156065 153390 152337 157770 156961
11098 156961 160680 162791 165418 169006 168535 171078 165660 161956 160157 158572 161757 159681 161018 162112
11084 162112 159343 152057 150581 157910 166138 171677 173747 180637 188569 196204 198371 200150 203499 207775
11070 207775 220218 219805 218552 222172 224309 225036 232969 234690 242599 248723 251232 256055 254545 253737 258977
11055B58977J734L305J4078J3390N057L17L464L705L283L850J1689J7642K6802
11042C67293L9416M9764M6683N9089O6004M9997K9821L220j0768k9981l0985k3484
11030F16069j9038l094k48K122J5553J4611J4548J5387K0227K7308L5896N8517
11018G97858O7776O3067O6467O2229N0297M5720N8297O4814Q3612J06065J13316
11007A579518J26188J32910J33571J45095J94862K50067L18098M03720N18876
10998C802905O75000R14857J278266J844893K649519L704995M801428N415782
10990B5087645N044693L637565J584506o22548k656883m212338m869256m531231
10982A8462153l609691k584450j723292j081033o06418k42904k236J46281J82977
$$ plain form
11055 258977 260711 264016 278094 291484 296541 296858 300322 304027 307310 311160 322849 340491 367293
11042 367293 406709 456473 503156 562245 628249 678246 708067 711287 700519 670538 639553 616069
11030 616069 597031 593937 593689 595811 611364 625975 640523 655910 676137 703445 739341 797858
11018 797858 865634 928701 995168 1057397 1107694 1153414 1211711 1276525 1360137 1466202 1579518
11007 1579518 1705706 1838616 1972187 2117282 2312144 2562211 2880309 3284029 3802905
10998 3802905 4477905 5392762 6671028 8515921 11165440 14870435 19671863 25087645
10990 25087645 30132338 33769903 35354409 34731861 32074978 27862640 22993384 18462153
10982 18462153 14852462 12268012 10544720 9463687 8857269 8614365 8612129 8758410 8941387
10973H941387J22152l132j30436k32703k53917j80513j3705K39457O02157J083099
10963A0173846J655739K259615K831858L194246L190912K883360K586559K574537
10955C1350672K795131K979486K768663J911321M43289j206445k488566l123415
10947C5430136l024904k428584j744532j338075j391645j810467k316790k629609
10939A8745530k601446k316548j873310j382483r11569n03034j54122J29101L28048
10930I460167M18778L48810J68748k5581j53871j81967n8859K26899O59019J259124
10920A2121267K089026L174032M453925N579256N971394N233811L410896Q90290
10912D2923897j696414l772488m872016m762801l695997k214767o73063Q28384
$$ plain form
10973 8941387 9063539 9060407 8929971 8697268 8443351 8262838 8249133 8488590 9090747 10173846
10963 10173846 11829585 14089200 16921058 20115304 23306216 26189576 28776135 31350672
10955 31350672 34145803 37125289 39893952 41805273 42248562 41042117 38553551 35430136
10947 35430136 32405232 29976648 28232116 26894041 25502396 23691929 21375139 18745530
10939 18745530 16144084 13827536 11954226 10571743 9660174 9157140 9003018 9132119 9460167
10930 9460167 9878945 10227755 10396503 10370922 10217051 10035084 9976225 10203124 10862143 12121267
10920 12121267 14210293 17384325 21838250 27417506 33388900 38622711 42033607 42923897
10912 42923897 41227483 37454995 32582979 27820178 24124181 21909414 21236351 22064735
10904B2064735K268190L531322M301816M184342L063097J317199n22445k188132
10896C8020124l510453m143284l900417k960166j697285m67224M56195R53031
10888B2750521J048500Q86651N36324n1639q31379j466627j689564j673470j623093
10879A7886224j482282j086111m99196J49978Q02991J498425K240785K897122
10871B2407936L333822L414204K932702J685021K0837j522712k615069l107039
10863B6549702l109088k791384k265626j652902j010162l55078L34374R77626
10855A6677462J412920J610402J569753J084875J77685o38479j036068j158555
10847A9699995j184143j065137o76915L4457J021811K125997L145135L713966
$$ plain form
10904 22064735 24332925 27864247 32166063 36350405 39413502 40730701 40208256 38020124
10896 38020124 34509671 30366387 26465970 23505804 21808519 21341295 21797490 22750521
10888 22750521 23799021 24685672 25221996 25170357 24338978 22872351 21182787 19509317 17886224
10879 17886224 16403942 15317831 14818635 14968613 15771604 17270029 19510814 22407936
10871 22407936 25741758 29155962 32088664 33773685 33794522 32271810 29656741 26549702
10863 26549702 23440614 20649230 18383604 16730702 15720540 15365462 15699836 16677462
10855 16677462 18090382 19700784 21270537 22355412 22533097 21894618 20858550 19699995
10847 19699995 18515852 17450715 16773800 16808257 17830068 19956065 23101200 26815166
10839B6815166L464096K440311J053987m59615k073833l522898m347221m351168
10831A9018825l762139k967840k243833j681351j274333r86086p95268o49208
10823D658767n28737m43045l67968l11797k60131k25537k00746j91933j75137
10814A953736j52090j31021j22510j16048r2270q4821p4719o4798o1014n1814
10804A002631m4582m1886m6611l7774l1965l6352l5477k6770k6787k1701j4812
10793F37914j1610o213K86J1216O421M420L120n495l064m517m419r2k989M867
10779F29845O264K671K135m402j6340k9206k7910j7808k6289j6735k1964j8103
10767D62158j7125j5607j4561j1503J377p94J527n177j481M92k226j0275j0812
$$ plain form
10839 26815166 30279262 32719573 33773560 33313945 31240112 27717214 23369993 19018825
10831 19018825 15256686 12288846 10045013 8363662 7089329 6103243 5307975 4658767
10823 4658767 4130030 3686985 3319017 3007220 2747089 2521552 2320806 2128873 1953736
10814 1953736 1801646 1670625 1548115 1432067 1339797 1254976 1180257 1115459 1054445 1002631
10804 1002631 958049 916163 869552 831778 799813 763461 727984 701214 674427 652726 637914
10793 637914 626304 620091 620377 631593 638014 642434 645554 640059 636995 632478 628059 627967 624978 629845
10779 629845 636109 638780 640915 636513 620173 590967 563057 545249 518960 502225 480261 462158
10767 462158 445033 429426 414865 403362 404739 403945 405472 400295 398814 399306 397080 386805 375993
10754C75993r789j3614j0571o148r282q41L042J957P33Q614O596Q786J2957J1133
10740C79566K452L458p542j3639n2m081j3333j3843k0057J324J0799N835O972
10727C37859k229l485l973r60P561J3866R516M343Q282J7043J7978J5939M846
10714D26586K486O197M241J3130J4303K3951J1497o04p377k0493k9497l2825j6510
10701C95085K813O617L766J769l578j9537l6208k8597j7388k4958j6130n765P381
10688B65270J0024j510J852l980m214J16N823M123m388P11j041J2188J4959k932
10674B97001O87m309q248r86J2797K7114K8311K9123K8782M0047L6942K3397O921
10661E17579m386k6208l7160l5771l5219k6443j8445j4642j8065j8707k7533l0782
$$ plain form
10754 375993 366204 352590 342019 335871 326589 325748 328790 330747 331480 340094 346690 355476 368433 379566
10740 379566 382018 385476 377934 364295 364243 360162 346829 332986 312929 314253 325052 330887 337859
10727 337859 335630 332145 328172 327212 334773 348639 358155 362498 370780 387823 405801 421740 426586
10714 426586 429072 435269 439510 452640 466943 490894 502391 501787 494410 473917 444420 411595 395085
10701 395085 397898 404515 408281 410050 406472 386935 350727 322130 304742 279784 263654 257889 265270
10688 265270 275294 273784 275636 271656 267442 267558 273381 277504 273116 273827 272786 284974 299933 297001
10674 297001 297688 293379 285131 284145 296942 324056 352367 381490 410272 450319 487261 510658 517579
10661 517579 513193 486985 449825 414054 378835 352392 333947 319305 301240 282533 255000 224218
10649B24218k2096j6707m336P358J6781J9918J7686Q304J26m476j2815k2360j7768
10636A93833l784J259N012o796m977K611J148M820J6441J8385J3287P602J3966
10623B62807J5897J6678K8871L2119L2027L4934J9606J1094Q598K808j3658l3856
10611D17925l0670k4844k8727k5598k8710l7674l0251j6405p175J058J8423K0219
10599B27571J8391J4029p471l1255p1417r1972m5638M1934R3483Q1483N0121L1893
10587C11152J8968J0721J9831M9626O2290M1455J2770K075k372r159k0181k1408
10575D75768j5254q677k794N745J9264L7915L9269L5598J9724j315p96k7869k9100
10562E47478l0577k8920l0166j5542Q256J5854J2190q311j7462j1956j3551m7066
$$ plain form
10649 224218 202122 185415 181079 188437 205218 225136 242822 251126 251252 246776 233961 211601 193833
10636 193833 190049 191308 196320 189524 184547 187158 188306 193126 209567 227952 241239 248841 262807
10623 262807 278704 295382 324253 356372 388399 423333 442939 454033 462631 465439 451781 417925
10611 417925 387255 362411 333684 308086 279376 241702 211451 195046 187871 188929 207352 227571
10599 227571 245962 259991 252520 221265 149848 57876 12238 54172 147655 229138 279259 311152
10587 311152 330120 340841 360672 410298 472588 514043 526813 528888 526516 517357 497176 475768
10575 475768 460514 451837 449043 454788 474052 511967 551236 586834 606558 605243 604447 576578 547478
10562 547478 516901 487981 457815 442273 450529 466383 478573 470262 452800 440844 427293 380227
10550C80227r1051n7965O0145J34022J15114O3420K5483K3008K1976K3710K6569
10539G24658L4761L4367L0398L1109J7706J7782K5333L0132K5548J4089N44J432
10527I87859P044J7675J9542K0017J7953O433o710p668L18R01Q319L4581M0547
10514A146811M4910L4714L0090N3037R1250J13804J05611R2265Q3805N6531L1029
10503A883857K7636N3579P7557Q9948J03282J11662J30968J52057J53116J51474
10493B935136J71293J97340K29518K84659L22966L39914L50820L83204M46847
10484E661697N64591P10185Q73008R66024R17814Q35561Q49920J012019J300260
10475A3691079J714775K299248L052519M058774N460901P528826J0744732J5840426
$$ plain form
10550 380227 289176 231211 291356 425378 540492 603912 629395 652403 674379 698089 724658
10539 724658 759419 793786 824184 855293 872999 890781 916114 946246 971794 985883 986427 987859
10527 987859 994903 1012578 1032120 1052137 1070090 1076523 1069813 1062145 1062463 1063364 1071683 1106264 1146811
10514 1146811 1191721 1226435 1256525 1309562 1400812 1514616 1620227 1712492 1796297 1852828 1883857
10503 1883857 1911493 1965072 2042629 2132577 2235859 2347521 2478489 2630546 2783662 2935136
10493 2935136 3106429 3303769 3533287 3817946 4140912 4480826 4831646 5214850 5661697
10484 5661697 6226288 6936473 7809481 8775505 9693319 10528880 11378800 12390819 13691079
10475 13691079 15405854 17705102 20757621 24816395 30277296 37806122 48550854 64391280
10467F4391280K3837828L5857066N1291090O1772319M7272102J438436m2354035
10460B43506086n6774131m8531731l4832763k4001918j6702123j2096484r215905
10453D1351031p077500n350041m029274l061808k329863j749464j288450r69136
10445A5495495p84739p00632o55304o86658p08008n25686k03267J80943O05133
10436A2017277R42571R52197O08936L45353M58560Q81947J497284K234672L153648
10427B3092445M417179O367543R430979J4218109K1766342L4144854N2887526
10420A66324977P1531214O4777422J2663224m6056955o7831915n7976199l9996350
10413A03435418k6236066j7650786j2382287q970263o619383m943201l766168
$$ plain form
10467 64391280 88229108 124086174 175377264 237149583 284421685 285860121 243506086
10460 243506086 186731955 138200224 103367461 79365543 62663420 50566936 41351031
10453 41351031 34273531 28923490 24894216 21832408 19502545 17753081 16464631 15495495
10445 15495495 14710756 14010124 13354820 12668162 11960154 11434468 11231201 11412144 12017277
10436 12017277 12959848 13912045 14520981 14866334 15324894 16206841 17704125 19938797 23092445
10427 23092445 27509624 33877167 43308146 57526255 79292597 113437451 166324977
10420 166324977 237856191 302633613 315296837 269239882 201407967 143431768 103435418
10413 103435418 77199352 59548566 47166279 38196016 31576633 26633432 22867264
10406B2867264k918791k233137j596792j050146q05519j009710j366594j479252
10398A0407323j330434j101501q95966p31589o03462m81010l89345l12684k56157
10389D305175k20136k13874k31203k42543k35626k00578j39789j12405j38108
10380B570913j67746j64996j21915r7725q9559q2752m9198k9838m9807q1392p8909
10369A557076m5408j5194j0733k9658l8362k8917l2826n0904n8966n5390m6188
10358A144530l7754l1490k3186j9103r827j4192j1379o119O328J6672J6294r826
10346A020948k8955l1078l4498j7096J4161L7267L8735J6074J2724L8743O7218
10335A134243Q1396O9482K1089n0732j35085j51187j21035p2400l4897q685j2767
$$ plain form
10406 22867264 19948473 17715336 16118544 15068398 14262879 13253169 11886575 10407323
10398 10407323 9076889 7975388 7079422 6347833 5744371 5263361 4874016 4561332 4305175
10389 4305175 4085039 3871165 3639962 3397419 3161793 2961215 2821426 2709021 2570913
10380 2570913 2403167 2238171 2116256 2018531 1928972 1846220 1797022 1767184 1717377 1635985 1557076
10369 1557076 1511668 1496474 1485741 1456083 1417721 1388804 1355978 1305074 1246108 1190718 1144530
10358 1144530 1106776 1075286 1052100 1032997 1023170 1008978 997599 991480 997808 1014480 1030774 1020948
10346 1020948 991993 960915 926417 909321 923482 960749 999484 1015558 1028282 1067025 1134243
10335 1134243 1215639 1285121 1306210 1255478 1120393 969206 848171 775771 740874 732189 719422
10324G19422k2063k8142k2952j8064j0253m627m677j04J5567L7882O0457O1252
10312G83698L1694k8594o8974p2203o3656m7127l7050l6817l4033l1258k1358
10301C74322k0725j3034J9307M8679P2702O9745L1347K889P651L5885N1002M5595
10289G25365O5442L4299n7519j13798r0241m8107k2848j9136j1632N646J0140
10278D77611J0429M334k3330m3689n3061l0299j8630j1737j1235j8353j2381j970
10266B67689m83l56j0965j1589j32J6328J4019J4078K4566K1725J4849J8105J0860
10253C78694K7463N6903N2337K7761j4994l9853m1345l5212k3546j0465q595p136
10241C62012k8051l0359j9789L289K5411L8345L7646K6836J0756j4945k3921k5604
$$ plain form
10324 719422 697359 669217 646265 628201 617948 613321 608644 608540 624107 661989 722446 783698
10312 783698 815392 786798 717824 645621 581965 534838 497788 460971 426938 395680 374322
10301 374322 353597 340563 359870 408549 481251 550996 582343 585232 592883 628768 679770 725365
10289 725365 790807 825106 767587 653789 563548 515441 492593 473457 461825 467471 477611
10278 477611 488040 492374 469044 425355 372294 341995 323365 311628 300393 282040 269659 267689
10266 267689 267206 266850 255885 244296 244164 260492 274511 288589 313155 334880 349729 367834 378694
10253 378694 406157 463060 515397 543158 528164 488311 446966 411754 388208 377743 369148 362012
10241 362012 333961 303602 283813 287102 312513 350858 388504 415340 426096 411151 387230 361626
10229C61626k2348k4240k0435j5225k2361k9410k5367k2290k0997j2401k528J8746
10217A62770K8681K5948L1947J8639L174N982Q852k419r456j0092n525j056K861
10204B60306Q683P996n062l961o946L93O250L108L775J3868P116l73m112l821
10190B87220n207j679M455K702O424j583j160J152R286J1694N504L960P864J0546
10176C41178R425J2786J9576M1820O4978R1170J24491K01727L56861M85530M09575
10165B159117L15479M61370O45448M62585j17596o40148p86122o48879m56372
10156A394882k99398k10528j49075j06725p3376m8748m1032l3784k6786k5688
10146C79742k5457j5350l0417k9471j6047o781j147o261o584j627n988l384l941
$$ plain form
10229 361626 339278 315038 294603 279378 257017 227607 202240 179950 158953 146552 144024 162770
10217 162770 191451 217399 249346 267985 271159 277141 285993 283574 274118 264026 258501 257445 260306
10204 260306 268989 276985 271923 267962 261016 261409 267659 270767 274542 288410 295526 295153 291041 287220
10190 287220 282013 280334 284789 287491 293915 292332 291172 292324 301610 313304 318808 322768 330632 341178
10176 341178 350603 363389 382965 424785 489763 580933 705424 907151 1264012 1749542 2159117
10165 2159117 2474596 2935966 3581414 4043999 3926403 3286255 2500133 1851254 1394882
10156 1394882 1095484 884956 735881 629156 555780 507032 466000 432216 405430 379742
10146 379742 354285 338935 308518 279047 263000 256219 255072 248811 242227 240600 234612 231228 227287
10133B27287N899K087l807L227Q335k125j6722j7148j3990q129J835N3L421R329
10119A99552N932P728P743J001j0519r6O070Q350k717p107l497k222L159J6256
10105B29633J4130J0756K0547L3821K7077q95j8492j4767q80R052L7587M5027
10093C92596L7613K5551M253J0670J9997J7247J3042M279J929k688k6008l3700
10081D64781l4538l9197l1421k6046l0230k6465k0276j1138p357r221j4583p909
10069B06400J528J3578R102J0713R030J4565R422j544q837m0P15j256J3036K7997
10055C04409K7079J7561J8167J5680J6525J1340J1696P257J7358L4192N2643Q2080
10043F15987J27633J88577K59139K90599J87280l6984k30513k76369k27900j66080
$$ plain form
10133 227287 233186 235273 231466 234693 243028 240903 224181 207033 193043 184914 186749 186802 190223 199552
10119 199552 205484 213212 220955 221956 211437 211341 217411 225761 223044 215937 212440 210218 213377 229633
10105 229633 243763 254519 275066 308887 335964 335069 316577 301810 300930 309982 347569 392596
10093 392596 430209 455760 460013 470683 490680 507927 520969 525248 527177 524489 498481 464781
10081 464781 430243 391046 359625 333579 303349 276884 256608 245470 238113 228892 214309 206400
10069 206400 207928 221506 230608 241321 250351 264916 274338 272794 263957 263917 264632 263376 276412 304409
10055 304409 331488 349049 367216 382896 399421 410761 422457 429714 447072 481264 533907 615987
10043 615987 743620 932197 1191336 1481935 1669215 1632231 1401718 1125349 897449 731369
10033G31369j09881o8850m2923k2175j7287k6265m9600m7215l4638j8374j751
10022B92410L626J2150J1827J2997J8076L0097O3755O8265j8326o3194n0348l8162
10010C43173j6198p141r454r237l644o889J173J7768L5777N0961O5928J03070
9998E65287J61901K32790L07981K92793J18088j40828k87126k84977k10036j43727
9988F12146r8583o8871m6547l1732k9306k9366k8377k1566j2968j3470j079O619
9976B36900r0r050n293o824p525j1928o272j0379l924M540J182j0813r160j2601
9962A48763r293j0083n733l73M282k00K137Q803P313K728L590K714J0047L017
9948A67712j256J033p01N44N606P426M830k797m043q284j3115l044R72l251o72
$$ plain form
10033 731369 621488 552638 509715 487540 470253 443988 394388 347173 312535 294161 292410
10022 292410 296036 308186 320013 333010 351086 381183 444938 513203 494877 431683 381335 343173
10010 343173 326975 319834 310380 301143 297499 290610 291783 309551 345328 396289 462217 565287
9998 565287 727188 959978 1267959 1560752 1678840 1538012 1250886 965909 755873 612146
9988 612146 513563 444692 398145 366413 337107 307741 279364 257798 244830 231360 230281 236900
9976 236900 236810 227760 222467 215643 208118 196190 189918 179539 175615 180155 181337 170524 161364 148763
9962 148763 139470 129387 123654 123281 127563 127363 129500 138303 145616 148344 151934 154648 164695 167712
9948 167712 166456 167489 166788 167332 172938 180364 185194 182397 178354 170070 156955 153911 154883 151632 150960
9933A50960N352k32l531N257M498l224m744n049M417L185K823o204l628K974L56
9918A53210J084l057N344R365q08P96m484L08M943J493j024j131o760K233k447
9903A59065K826J040o421J998J782k565p01N376M450M373l439M440l16k791p645
9888A61472m762n43Q08k541l610J48o50j054K489N664L000M384P175J2614Q808
9873A93402L553l303J0578R590m921p077q403j0433n8M653L245l026K532o040
9859A84292J492J543M439m864l866j975K951P164J001p226M798N867K594L854
9845B02064k62j932n21L338Q880J427l596K240O555L603J5786K0982L206n689
9831B56081q480o781p439m246k112L225m68Q92M34J401P918M917j457l893J021
$$ plain form
9933 150960 156312 156080 152549 157806 162304 159080 154336 149287 153704 156889 159712 153508 149880 152854 153210
9918 153210 154294 151237 156581 165946 165138 165934 161450 161758 166701 168194 167170 166039 159279 161512 159065
9903 159065 161891 162931 156510 158508 160290 157725 157024 162400 166850 171223 167784 172224 171908 169117 161472
9888 161472 156710 156167 156975 154434 150824 150972 150322 149268 151757 157421 160421 164805 171980 184594 193402
9873 193402 196955 193652 204230 213820 208899 201822 193419 182986 182928 187581 190826 187800 190332 184292
9859 184292 185784 187327 191766 186902 183036 181061 184012 191176 192177 184951 189749 195616 198210 202064
9845 202064 201802 199870 199349 202687 211567 212994 209398 211638 218193 221796 237582 258564 261770 256081
9831 256081 247601 240820 233381 229135 227023 230248 229780 230672 231106 232507 240425 245342 243885 239992 241013
9816B41013J0560L830O79N090k589q189o421N466P853M359L696J3032P380j143
9802B84616M434M279O038J363N546J1324Q592M635J3714O580j979n233p593L43
9788C36659L068M263M542L727L279P502J5094M404J613J275O68p27M770L707r206
9773C84638J382N587M642R618L63M248J4928J5373J4202J3164J6007J2446K0789
9760E17387K8584K2088J9225K8608K9843L0071M2664N0515O3519P0648Q8974J07889
9748A100015J20770J42902J57861J85030K37575L27363M56289O63210R66502J379654
9738E737171J845720K081282J651650M81223q54101j634882j726336j425659j053550
9729E102518p41632n14310l48152k03806r1803J4229J21001K10840K35031J37705
$$ plain form
9816 241013 251573 255403 256082 261172 258583 250394 243973 249439 257292 261651 265347 278379 285759 284616
9802 284616 289050 293329 299367 300730 306276 317600 326192 330827 344541 351121 349142 343909 336316 336659
9788 336659 339727 343990 348532 352259 355538 363040 378134 382538 384151 385426 386094 385367 390137 393844 384638
9773 384638 386020 391607 396249 405867 406230 410478 425406 440779 454981 468145 484152 496598 517387
9760 517387 545971 568059 587284 615892 645735 675806 718470 768985 832504 903152 992126 1100015
9748 1100015 1220785 1363687 1521548 1706578 1944153 2271516 2727805 3391015 4357517 5737171
9738 5737171 7582891 9664173 11315823 11797046 10942945 9308063 7581727 6156068 5102518
9729 5102518 4360886 3846576 3498424 3294618 3202815 3217044 3338045 3548885 3783916 3921621
9719C921621k7179j35089j06047J8670J67127K93778L47022L28437L30520M72194
9709E611054P37590J009236J108834R28637O05249N29668Q66123J556427K445484
9700A5398302L257460L467572K865756J924089R60091r7378j222399k195888k812052
9691B1545553l055587k940933k471532j804931j146383n83094j58175L3475l1010
9682I387383r8807j00701j37890k42736l36802l70090l12276j37194J38974N03172
9672H293033R35002J445094J911173K012977J331629L34381J0134N87498J692806
9663A8553727K925662L830432L964383L288159K216151R87230l98592k062558
9655C3304594l490872l821288k987555j748410j078223j409379j975516k173302
$$ plain form
9719 3921621 3894442 3759353 3653306 3671976 3839103 4132881 4479903 4808340 5138860 5611054
9709 5611054 6348644 7357880 8466714 9395351 10000600 10530268 11396391 12952818 15398302
9700 15398302 18655762 22123334 24989090 26913179 27873270 27775892 26553493 24357605 21545553
9691 21545553 18489966 15549033 13077501 11272570 10126187 9543093 9384918 9418393 9387383
9682 9387383 9288576 9187875 9049985 8807249 8470447 8100357 7788081 7650887 7789861 8293033
9672 8293033 9228035 10673129 12584302 14597279 15928908 16263289 16273423 16860921 18553727
9663 18553727 21479389 25309821 29274204 32562363 34778514 35765744 35367152 33304594
9655 33304594 29813722 25992434 23004879 21256469 20178246 18768867 16793351 14620049
9647A4620049k005495j640560j192168p64634m04472j58233n6232k1308R680O0436
9637H447063J19571J05860o8008k53419k23052K0823L70654P95337J275474J698777
9627A2289080J926877J832222J487662J166182J209435J487969J541556J079157
9619B4020140N6588j291898k365944k695639k316236j618415j062994r99853j327840
9610A0397909j513431j343024j005512o83214m51089l33454l10864l31926k91177
9601D134218j96335p8789j643R579o7942j68911k02662j63312j02831m2223L0014
9590C149163J10149K11489L62391N69995Q39201J159256J448059J472727R75437
9581A0297867p1381j128011j614904j519555j171281q45068n96976m19035l09401
$$ plain form
9647 14620049 12614554 10973994 9781826 9017192 8612720 8454487 8398255 8376947 8386627 8447063
9637 8447063 8566634 8672494 8604486 8351067 8128015 8148838 8519492 9314829 10590303 12289080
9627 12289080 14215957 16048179 17535841 18702023 19911458 21399427 22940983 24020140
9619 24020140 24076728 22784830 20418886 17723247 15407011 13788596 12725602 11725749 10397909
9610 10397909 8884478 7541454 6535942 5852728 5401639 5068185 4757321 4425395 4134218
9601 4134218 3937883 3859094 3857451 3867030 3799088 3630177 3427515 3264203 3161372 3119149 3149163
9590 3149163 3259312 3470801 3833192 4403187 5242388 6401644 7849703 9322430 10297867
9581 10297867 10226486 9098475 7483571 5964016 4792735 3947667 3350691 2931656 2622255
9572B622255k33237j74003j32695j09668r8767j00436q1349n5701n1263m8974
9562A536162m7416l9670l4983k9291k0629j4887j2836j2033l916j933n071k939
9550A310558K072L071k421p16J3082J2733L686L479N523N341Q740J1601J8073
9537A394822J2622J0999Q777O008K0070J7894K8778K8517K7147K2141K1274J9720
9525A618769J2584J1417J6475J8448J1530J0971L714J0022J5811J0318J8442L0060
9513A788561K0386J4282J9893K9028K7714K0255J5255J7339K2997K7858K5305
9502B028873K5389K4310K7696L0617L1701L6036M1876M0483L3718L0176L2233
9491B383108L7414L5944L8284L5688L9334M0846M0667L3538K4826K9390K8907
$$ plain form
9572 2622255 2389018 2215015 2082320 1972652 1873885 1773449 1692100 1636399 1585136 1536162
9562 1536162 1488746 1449076 1414093 1384802 1364173 1349286 1336450 1324417 1320501 1318568 1313497 1310558
9550 1310558 1312630 1315701 1313280 1312564 1325646 1338379 1342065 1345544 1351067 1356408 1365148 1376749 1394822
9537 1394822 1407444 1418443 1427220 1433228 1453298 1471192 1499970 1528487 1555634 1577775 1599049 1618769
9525 1618769 1631353 1642770 1659245 1677693 1689223 1700194 1703908 1713930 1729741 1740059 1758501 1788561
9513 1788561 1808947 1823229 1843122 1872150 1899864 1920119 1935374 1952713 1975710 2003568 2028873
9502 2028873 2054262 2078572 2106268 2136885 2168586 2204622 2246498 2286981 2320699 2350875 2383108
9491 2383108 2420522 2456466 2494750 2530438 2569772 2610618 2651285 2684823 2709649 2739039 2767946
9480B767946K2915K9761L8173L9223M4156M4076L7530M0338M4991M5706L7502
9469C192317L7277M3227L5811L4440M4889M8413L6670M5735M4695M1355M7436
9458C652265M4457M2062N4135N4268M8293M3692M7690M7473L7289L8743M5604
9447D155971N5206M6171L6020L9406M0894L5239L6577L6250L5369L4646L1618
9436D583367K6405K2495K9331K7781J9492K0417K6845K8953K4008J7486K6259
9425D852839K2658R127J4618J2735L640M528N599L091Q256L465l761n756k674
9412D928365m886n602j4473j3628j2994j4562j8231k0354k4350k4703k0261k2696
9400D731625k9757l1518l1850l0083l7534m7355m9309m2338m1710l9535m1500
$$ plain form
9480 2767946 2790861 2820622 2858795 2898018 2942174 2986250 3023780 3064118 3109109 3154815 3192317
9469 3192317 3229594 3272821 3308632 3343072 3387961 3436374 3473044 3518779 3563474 3604829 3652265
9458 3652265 3696722 3738784 3792919 3847187 3895480 3939172 3986862 4034335 4071624 4110367 4155971
9447 4155971 4211177 4257348 4293368 4332774 4373668 4408907 4445484 4481734 4517103 4551749 4583367
9436 4583367 4609772 4632267 4661598 4689379 4708871 4729288 4756133 4785086 4809094 4826580 4852839
9425 4852839 4875497 4884624 4899242 4911977 4915617 4920145 4925744 4928835 4937091 4940556 4936795 4931039 4928365
9412 4928365 4923479 4917877 4903404 4889776 4876782 4862220 4843989 4823635 4799285 4774582 4754321 4731625
9400 4731625 4701868 4670350 4638500 4608417 4570883 4523528 4474219 4431881 4390171 4350636 4309136
9389D309136m9745n0599l9227l9385m0865m8722n2246m5468l3251m6658n3399
9378C809571m9087n4159n3327m5837l4541m4480n2104n0305m1846m0306m0926
9367C302653m7645m8832m2837m4864m0972m2557m3258l5910l5496l4802m7006
9356B838474m5629m1037m0663m2107m2939m4048l7864l4280m0320m0689l3805
9345B395093l6956l3946l1258l2128k6916j8646k2334k5710k5220k3068l6575
9334B082336l6150k6598l5677k8035k3283k8556l4508k8495k4907k7850k3228
9323A765049k7579j8505j9269j6435l0593k3948j9392j8397j5414j5423k5021
9312A535073j8489j0612j3684j1465j1496k1743j9892j5597j2017r419j0024j2653
$$ plain form
9389 4309136 4259391 4208792 4169565 4130180 4089315 4040593 3988347 3942879 3909628 3862970 3809571
9378 3809571 3760484 3706325 3652998 3607161 3572620 3528140 3476036 3425731 3383885 3343579 3302653
9367 3302653 3255008 3206176 3163339 3118475 3077503 3034946 2991688 2955778 2920282 2885480 2838474
9356 2838474 2792845 2751808 2711145 2669038 2626099 2582051 2544187 2509907 2469587 2428898 2395093
9345 2395093 2358137 2324191 2292933 2260805 2233889 2215243 2192909 2167199 2141979 2118911 2082336
9334 2082336 2046186 2019588 1983911 1955876 1932593 1904037 1869529 1841034 1816127 1788277 1765049
9323 1765049 1737470 1718965 1699696 1683261 1652668 1628720 1609328 1590931 1575517 1560094 1535073
9312 1535073 1516584 1505972 1492288 1480823 1469327 1447584 1427692 1412095 1400078 1390659 1380635 1367982
9300A367982P0N939n817j4648j8103p875r722k4536l4156m3515l3896j8564j1856
9287A151303k2418r557p741j5088j6835j0560j5650r343j2975j0046j0019k254
9275A008817j0893j2921j0401M526N831l255n591j871p298m281p044o422j27Q433
9261I57503L705K638N88M220j0363k1200k0050j6968j9295k2339j6893j4886k0317
9248H06343j9329j6937j8953j3076j1822n390j0276m310p815p393q63k298j2954
9235F74927p558r112m562l558k864N798R204K711N733Q366K914m512j1114j34
9221F66239n78n814l578j0899j9002j9023j1154q349m992n399m251j8100j7952
9208E37148j3901j5936j1569o249l752j482r594L48M881O831n468o299o868l046
$$ plain form
9300 1367982 1368052 1373991 1368174 1353526 1335423 1327548 1317826 1293290 1259134 1215619 1181723 1163159 1151303
9287 1151303 1128885 1119328 1111587 1096499 1079664 1069104 1053454 1044111 1031136 1021090 1011071 1008817
9275 1008817 997924 985003 974602 979128 984959 981704 976113 974242 966944 962663 955619 949197 949070 957503
9261 957503 961208 963846 964434 968654 958291 937091 917041 900073 880778 858439 841546 826660 806343
9248 806343 787014 770077 751124 738048 726226 720836 710560 706250 698435 691042 690179 687881 674927
9235 674927 667369 658257 653695 650137 647273 653071 662275 664986 670719 679085 681999 677487 666373 666239
9221 666239 665661 659847 656269 645370 626368 607345 596191 587842 582850 577451 573200 555100 537148
9208 537148 523247 507311 495742 489493 485741 484259 474665 475013 479894 486725 481257 474958 468090 465044
9194D65044o486L421n626m272q363n179K943k357M747J205K110j421m239n060
9180D36467r351o809j2150j0625k295l847o878l243n243n370p933q065L83J230
9166C56271J604k363m624n574J7R67K653r025p872j314j480j037q850p528K203
9151C14048L05r48M32m574J872M585k643j107o328r623k884J825j422J492K841
9136B97871O02n604j699n109m624q126j1727J983j279k944J178M904K577m697
9122B63306R55p54l380p945j0089L38N438m137k155K539K547J44m847j438M431
9107B44953P07l01l238r253n388K612k491k375n392Q62K293q55m612m817o879
9092B05826L834K311k10J131m548O07J961J28q79k727j153M489K755p611l420
$$ plain form
9194 465044 458558 461979 456353 452081 443718 438539 441482 439125 443872 445077 447187 445766 441527 436467
9180 436467 427116 420307 408157 397532 395237 391390 384512 381269 376026 370656 362723 354658 355041 356271
9166 356271 357875 355512 350888 345314 345331 346298 348951 339926 332054 330740 329260 328223 319373 311845 314048
9151 314048 314353 313405 313837 309263 311135 315720 313077 311970 305642 296019 293135 294960 293538 295030 297871
9136 297871 298473 292869 291170 286061 281437 273311 261584 263567 262288 259344 260522 265426 268003 263306
9122 263306 264261 263507 260127 252182 242093 242431 247869 243732 241577 244116 246663 246807 241960 240522 244953
9107 244953 245660 245359 242121 232868 227480 230092 227601 225226 219834 220696 222989 222134 217522 212705 205826
9092 205826 209660 211971 211761 212892 208344 208951 210912 211040 210161 207434 206281 210770 213525 205914 202494
9077B02494k187j753j683j437J282L054M85n566k052l91L68K632k589m731O027
9062A93953j348r751o599p161M734J972Qn290J870l640J765J863l066r80L280
9047A71610Q56k054N87J430K501o052n861L921J0038p01J197N3K984Q178J734
9032A90421N21k997r204q270p035n333j2010k786M018J071P127K51j879k663m133
9017A47099o919k74K895K40n570n120L760J266K81r45l028J589M357J197K394
9002A43222O06j361m915O729N432n71l872O870L905K237Q413j213O681R717O078
8987A87958M704j078l397J228n549j5345j0851j0751p811R60l09J455o56m852
8973A35706q625qn20j573K290o786p079K121O089K642n644l659L096N026q91j652
$$ plain form
9077 202494 200307 198554 196871 195434 196716 199770 200255 194689 192637 192246 192614 195246 192657 187926 193953
9062 193953 192605 182854 176255 169094 173828 175800 175808 170518 172388 168748 170513 172376 169310 168330 171610
9047 171610 172466 170412 170999 172429 174930 168878 163017 166938 176976 176275 177472 177525 180509 188687 190421
9032 190421 190942 187945 178741 170471 163436 158103 146093 143307 147325 148396 155523 155774 153895 151232 147099
9017 147099 140180 139906 142801 143041 137471 132351 136111 137377 137658 136713 133685 135274 139631 140828 143222
9002 143222 143828 142467 137552 144281 149713 149142 145270 152140 156045 158282 166695 165482 172163 181880 187958
8987 187958 192662 191584 188187 189415 183866 168521 157670 146919 139108 140068 139759 141214 140558 135706
8973 135706 127081 127073 126553 124980 127270 120484 113405 115526 121615 124257 118613 114954 118050 123076 122185 120533
8957A20533N479K205m27k278J472L917m914K84L981l092n48O469J5665J3262K934
8942A64942L56j239L938O790j0202l141o977j0520j4107o101m970p132m365j888
8928A05384l652n13J527N581L723o675M359O437j210O84m153p056k740O352R137
8913A17185J761R22L857K475L084o553r048r646j447O468p64M416j916L110O647
8898A20551k057L540M125L362J177O118j509r129p402l281K480J78J227J659o501
8883A14538n721o392r893J080K259n331k043k534q548o1N911L958q04p813N341
8868H3947K029n00K35L608k826l283N063M504J696m827Q51n092j127J1033K902
8853I8213j731k850n170L398O482j449K980N926k140j583O38M26L600M183N776
$$ plain form
8957 120533 126012 128217 127790 125512 126984 130901 125987 126271 130252 127160 126612 133081 148746 162008 164942
8942 164942 165298 164059 167997 174787 164585 161444 154467 143947 129840 123739 118769 111637 107272 105384
8928 105384 101732 101219 102746 108327 112050 105375 109734 116171 114961 115645 111492 104436 101696 108048 117185
8913 117185 118946 119868 123725 126200 129284 122731 113683 104037 102590 109058 108294 112710 110794 113904 120551
8898 120551 118494 122034 126159 129521 130698 136816 135307 126178 118776 115495 117975 118153 119380 121039 114538
8883 114538 108817 102425 92532 93612 95871 90540 88497 85963 77415 77354 83265 87223 86419 78606 83947
8868 83947 85976 85476 85711 89319 86493 83210 88273 92777 94473 89646 90497 85405 84278 95311 98213
8853 98213 96482 93632 88462 91860 98342 96893 99873 105799 103659 102076 102714 103140 106740 110923 116699
8838A16699n764m484q98m629K712N181P277N017o526J698p604o013K064O398N27
8823A11655J103k343n703n321k770O88L008M502L266Q078J5214K926K30m389l766
8808A26378R023P872j816j1477j0595j7017j3819m685r683p680J477K863O811
8795G7652p199o248l918l267K859N893j896r528K159N348Q449Q178R42l059N890
8780H2255Q59l187k20m003K891J180j471L501R821O978K064l319N666L291L96
8765A06702R889J9351J6419O759j448j7398j9435j3634j0972j922k494k865p936
8752H1016J29L390o042k814M246K215L143J478p226n390n946M169N505j301J161
8737G7733J486l205K554O980o143q638j670l044l014J958J170M023J217j68q89
$$ plain form
8838 116699 110935 106451 105553 100924 103636 108817 116094 121111 114585 116283 108679 102666 104730 111128 111655
8823 111655 112758 110415 104712 99391 96621 97309 100317 104819 108085 116163 131377 134303 134533 130144 126378
8808 126378 135401 143273 141457 129980 119385 102368 88549 83864 74181 66501 67978 70841 77652
8795 77652 70453 64205 60287 57020 59879 65772 63876 54348 56507 61855 70304 78482 79424 76365 82255
8780 82255 83114 79927 79707 75704 78595 79775 78304 81805 91626 98604 100668 97349 103015 106306 106702
8765 106702 116591 135942 152361 159120 157672 140274 120839 107205 96233 94311 91817 88952 81016
8752 81016 81145 84535 78493 75679 79925 82140 85283 86761 79535 74145 68199 72368 77873 76572 77733
8737 77733 79219 76014 78568 85548 79405 70767 69097 66053 63039 64997 66167 70190 71407 71239 70350
8722G0350j345K517K706P207J0875O989m22o211q284r173o368j110q540K921L45
8707F2457J655K281q258p627L059Q7P769N881j697q694j921q22J82M745J543J180
8691F1820q05p855m093M603l445M764O617Q40L206j15n705m214j412m330o955
8676D2921L381J1264N007Q5R22M006M18o534m571J230j578M355N41n787l650K329
8660E4339m694l413j620Q26k69J214l344p91Q86k38O344l746o138K083l658N65
8644C8346O680R77j608N731N730l424m702l77J945L61O33j0419K727J230n432
8629C8398N459k362m935M160O433p95m218L626q89q046L446K566q40M706q286
8614C8423m397O096k069K186J386J46l808N695N344M660m294l85M35l803Q77L848
$$ plain form
8722 70350 69005 71522 74228 81435 92310 99299 98877 92666 84382 75209 68841 67731 59191 62112 62457
8707 62457 64112 66393 58135 50508 53567 53654 61423 67304 65607 56913 54992 54170 54352 59097 60640 61820
8691 61820 61015 53160 49067 53670 50225 54989 61606 62446 65652 65537 59832 55618 54206 49876 42921
8676 42921 46302 57566 62573 62658 63580 67586 68004 61470 56899 58129 56551 60906 61447 55660 52010 54339
8660 54339 49645 46232 44612 45438 45169 46383 43039 42248 43134 42896 49240 45494 39356 41439 37781 38346
8644 38346 45026 46003 44395 50126 55856 52432 47730 47353 49298 49659 50292 39873 42600 43830 38398
8629 38398 43857 41495 36560 40720 47153 46358 42140 45766 44877 36831 40277 42843 42003 46709 38423
8614 38423 34026 40122 38053 40239 41625 41771 37963 43658 49002 53662 49368 48983 49418 45615 46492 50340
8598E0340J39l528K9n36j254m576k551k248L44J428Q163P648J943o043o92K403
8582E1009N091J701j193L09L462K13M728K626k883O532P630N891l612p797k809
8567G0898n038m252m249p761j477o870K174J083n639J331l641m530m890q40k617
8552B3682l93N889k234J164L264P344k7J962J652K093j267p077o082K154k304
8537B9820r862j686P256l95k7k117R447J17k504p803k671J255L401L164J210K342
8521C0947L396J87q155J210O412L101p111n307q506J556P535m168L461O767P892
8506C9217O354r565o758j657M662k10p343k735J610K746O183l994m572m327j862
8491A7749P543L572n800L433P60K211M368M169J703j661q988J174M919n041l732
$$ plain form
8598 50340 50479 46951 46980 46444 45190 40614 38063 35815 36159 37587 45750 53398 55341 49298 48606 51009
8582 51009 56100 57801 56608 56917 60379 60592 65320 67946 65063 71595 79225 85116 81504 73707 70898
8567 70898 65860 61608 57359 49598 48121 41251 43425 44508 38869 40200 36559 32029 27139 26299 23682
8552 23682 23289 29178 26944 28108 31372 38716 38689 40651 42303 44396 43129 36052 29970 32124 29820
8537 29820 19958 18272 25528 25133 25106 22989 32436 32553 30049 22246 19575 20830 24231 27395 28605 30947
8521 30947 34343 34530 26375 27585 33997 37098 29987 24680 16174 17730 25265 21097 24558 31325 39217
8506 39217 45571 36006 29248 27591 32253 32043 24700 21965 23575 26321 32504 28510 23938 19611 17749
8491 17749 25292 28864 23064 26497 27257 29468 33836 38005 39708 38047 29059 30233 35152 30111 26379
8476B6379j584J503L606m718l919L396n964l708l61M147p76l680K337l322N391
8461A8727P772l374k422j393P84P239O174j265k983n366l321K079m63m27J0q31
8445B0940n469K782J816K353L312P183p10l23m485m461o103p134L41Q438K639
8430B1119R13M508K257q354m203J483L077m016n19j327N002P969M883J428k18
8415C4002L427n304L03L808J406o008p578m262K576K394K004n33p578r70N233
8400B2920M350J53m343p27K113m857m961j540j718K570M585J0137l192l524M719
8385B6685j998l369j904q571o206J915R588P821L490o3l035j995o331k399r38
8370A2690l719R19k501j312J0330J4864l60k022K55n824n781M843N69J161K419
$$ plain form
8476 26379 24795 26298 29904 25186 21267 24663 18699 14991 14630 18777 18001 14321 16658 13336 18727
8461 18727 26499 23125 20703 19310 20094 27333 33507 32242 29259 23893 20572 22651 22188 21761 21771 20940
8445 20940 15471 18253 20069 22422 25734 32917 32207 31884 27399 22938 16835 9701 10042 18480 21119
8430 21119 22032 26540 28797 20443 16240 17723 20800 16784 16265 14938 19940 27909 32792 34220 34002
8415 34002 37429 32125 32428 36236 37642 31634 24056 19794 22370 24764 26768 26235 18657 17687 22920
8400 22920 27270 27423 23080 22353 24466 19609 14648 13108 11390 13960 18545 28682 25490 21966 26685
8385 26685 24687 21318 19414 10843 4637 6552 16140 23961 27451 27388 24353 22358 16027 13628 12690
8370 12690 8971 9890 7389 6077 16407 31271 30911 28889 29144 23320 17539 22382 22951 24112 26531
8355B6531N524L314l587M346N61l491k281j103k435j2992l471k289n95L526K601
8340A4159M600j00l193K955M835K517k889j993l465j240j67k094K688k160o13
8325A3840K514l355l978M936Q257o13l695J222R081n112o434L005l513J285P450
8310B4890N026J0979M428Q129L565j4029q779l788o40J110m668q946L106M010
8296B4393l105r062p406P08O597M875m388M315Q097J997L491K634J2147P972N504
8281E8769o794j898n612p070n61r329j1510l916J210l562K317N139J806M49J266
8266B0704L357N534N972j126p887q283J944M54Q795k058M84l939j475K705m674
8251B0507q767q577p98j548k702N351o2n25L260J615N821J178M05m98L041K673
$$ plain form
8355 26531 32055 35369 31782 36128 36689 33198 30917 29814 27379 14387 10916 8627 8032 11558 14159
8340 14159 18759 18659 15466 18421 23256 25773 22884 20891 17426 16186 16019 13925 16613 14453 13840
8325 13840 16354 12999 9021 13957 22214 21601 17906 19128 28209 23097 16663 19668 16155 17440 24890
8310 24890 29916 40895 45323 53452 57017 42988 34209 30421 29781 30891 26223 17277 20383 24393
8296 24393 21288 12226 4820 5528 12125 17000 12612 16927 25024 27021 30512 33146 45293 53265 58769
8281 58769 51975 50077 44465 37395 36834 27505 15995 12079 13289 9727 12044 17183 18989 19438 20704
8266 20704 24061 29595 35567 34441 26554 18271 20215 20669 29464 27406 27890 23951 22476 25181 20507
8251 20507 11740 3163 2365 817 -1885 3466 3404 2879 6139 7754 13575 14753 15158 14660 17701 20374
8235B0374j121n16N708M487n544o065l792P47M568M768n014P3J586J357P101o376
8219B2341j0231k251Q805J960N793N201j950K51m480k984n414p654M078Q671q47
8204B1289K5J118l124M623M311j0659o934M195j602J87J256p697p445Q494O178
8189A4215L69o638M60L368K116L378l428M583n680n173k328K980k827m452K883
8174C826j837k690K359j704j089N247k60p184j17J088m65p40P413O566J9l137
8158G295K863J633r06m50N795N290J09j214L18L903M303M851q099q754K140r07
8142A8170l768o207n644R026J874l962K622J0172l106o454K873K09R22N20L922
8127B1169M416j977p217P149Q014n728J268R110J1849P900J4997J3685Q980L4
$$ plain form
8235 20374 19253 18737 24445 28932 23388 17323 13531 14278 18846 23614 18600 18673 20259 21616 28717 22341
8219 22341 12110 9859 18664 20624 26417 31618 29668 29919 25439 22455 17041 9387 13465 22136 21289
8204 21289 21314 22432 19308 23931 28242 17583 10649 14844 13242 13429 14685 6988 -457 8037 14215
8189 14215 14584 7946 8406 11774 13890 17268 13840 18423 12743 7570 5242 8222 5395 943 3826
8174 3826 1989 -701 1658 -46 -1135 4112 3852 -3332 -3449 -2361 -2826 -3566 3847 10413 10432 7295
8158 7295 10158 11791 10885 10435 16230 21520 21629 20415 20733 24636 28939 33790 25691 16937 19077 18170
8142 18170 14402 8195 2551 11577 13451 9489 12111 22283 19177 12723 15596 15805 16727 17247 21169
8127 21169 25585 23608 16391 23540 31554 25826 27094 36204 48053 55953 70950 84635 93615 93649
8113I3649J684K669K263q978j1802j4197j1200l660n279j3272j490Q450k141p168
8099B9528M801K074p670q64O753R65p78M366M065L16k746L909J6732K6591J7240
8084A05282K6310K7540J3907M805p553k6567l3368k7199k4984j9223m643N131
8072C9438k297o707O22L050L186p16l059M49Or065m209m24N524J687l465n214
8056A8806j123L822Q002O688O0N437m57j625L049p441m491J450L116P532Q565
8041E1390J1094N247K3515N0954N7853O8597L8349j1268m6343o6228n4910l5720
8029I2530j7042o966q249n514N05q963j1370l503k167p463m185M742K277J361
8015B5993K45n60n744j0094N022L449M238J0133K029K851m87q15K596M489m35
$$ plain form
8113 93649 95333 98002 100265 91287 79485 65288 54088 50428 45149 31877 30387 38837 36696 29528
8099 29528 34329 36403 28733 27869 34622 35587 34809 39175 43240 43556 40810 44719 61451 88042 105282
8084 105282 131592 159132 173039 177844 170291 143724 110356 83157 58173 38950 34307 39438
8072 39438 37141 30434 31056 34106 37292 36576 33517 33966 33972 24907 20698 20274 25798 27485 24020 18806
8056 18806 17683 21505 29507 36195 36255 41692 41235 39610 42659 35218 30727 32177 35293 42825 51390
8041 51390 62484 67731 91246 142200 200053 268650 306999 295731 249388 183160 128250 92530
8029 92530 75488 68522 60273 54759 55264 46301 34931 31428 29261 21798 17613 22355 24632 25993
8015 25993 26238 25678 19934 9840 14862 18311 22549 32682 34711 37562 37075 36260 38856 43345 42910
8000D2910K88L616l19j496N197L113J85P829J2513J6444K2841K4400R585q156
7986A38950j2763j5706k1695j9795p163j0431j0693j465m244r754l802l432l545
7973A4462o876N584K318j890L315O829J31q988r973M696K537m065j408J581O535
7958A4788J274O466Q79L955Q906M608O7o37P322N960l142m332K135K040k609o372
7942D1308o186j0405n059M395L212L355J152p673J776L264q696l884J150L744
7928B1453R787j767n866m619J532J474J283n215p120M544J498k889k680N775q087
7913I103J485K860k523J414N668R586J0626J0825Q997M42K435k670J286q420j7514
7898C3600m051k735l622k676P21L691m297p357J659Q42m492p038K262j256k937
$$ plain form
8000 42910 43198 46814 46495 44999 50196 53309 53494 61323 73836 90280 113121 137521 147106 138950
7986 138950 126187 110481 88786 68991 61828 51397 40704 39239 34995 25241 21439 18007 14462
7973 14462 7586 13170 15488 13598 16913 23742 23873 14885 4912 9608 12145 8080 6672 8253 14788
7958 14788 16062 22528 23407 27362 36268 40876 40943 40306 47628 53588 50446 46114 48249 50289 47680 41308
7942 41308 35122 24717 19658 24053 27265 30620 31772 24099 25875 29139 20443 16559 17709 21453
7928 21453 31240 29473 23607 18988 20520 21994 23277 18062 10942 15486 16984 14095 11415 17190 9103
7913 9103 10588 13448 10925 12339 18007 27593 38219 49044 58041 58483 60918 58248 59534 51114 33600
7898 33600 29549 26814 23192 20516 21237 24928 20631 13274 14933 15775 11283 4245 6507 5251 2314
7883B314O40P432J557O53j080K714l021p527N721M360n792N623N923k256j565
7868A5696o720j1697J1008J0011Q778O133Q860P627J3557J4887J9199R114l258
7855A03195j2358j5726j7028j9275j2544j209m407L162M445n574n602J29m569
7842A2639K546Q929J353l829m312M366J333k445m060l887R40L27k91m341j9Q39
7826A0088m400M2K335Q011M576K27q354n851K102K818O769Q301j473P241R640
7811D2072P733K595k790j3351j5064j1628j423l170p00L972K612m870K192K589
7797A0769J173j338l335r23p813J981m59n130k701K434L104K590M66P67L162J563
7781F310l770J661n506Q80K069k55j703N786J620m193j764O175j212j906M632
$$ plain form
7883 2314 2954 10386 11943 12596 11516 14230 11209 3682 9403 13763 7971 13594 19517 17261 15696
7868 15696 8976 -2721 8287 18298 27076 33209 42069 49696 63253 78140 97339 106453 103195
7855 103195 90837 75111 58083 38808 26264 25055 20648 23810 28255 22681 17079 17208 12639
7842 12639 15185 24114 25467 21638 17326 21692 23025 20580 16520 12633 13573 13900 13609 9268 9249 10088
7826 10088 5688 5730 8065 16076 20652 20879 12525 6674 8776 11594 18363 26664 25191 32432 42072
7811 42072 49805 52400 49610 36259 21195 9567 8144 4974 4274 8246 10858 5988 8180 10769
7797 10769 11942 10604 7269 6346 -1467 514 55 -5075 -7776 -5342 -2238 352 818 1585 4747 6310
7781 6310 2540 4201 -1305 -425 1644 1389 -314 5472 7092 2899 1135 7310 6098 4192 8824
7766H824k231K643L422m008p731k649K125M910L581j728J504M886l775r392p489
7751g108N29J0466O309M720k435l007j107o63n857l93O087L879M925m084O49N71
7735A3481M267k140m267J578M038K08k019J191m808L4K292K52l29m659m011j381
7719C727m189l481l081N870J259K521K367k529L818J491l68o8m47l760j967m437
7703c274K13j272L635K367J976L192m789k610k744M07N102R277q23o291k571l741
7687a946J165M389K120L825q36j590p367l286k162O712J450N32O070L803N043
7672A7922n805n751n323l922j562P099Q498N211q753l740K294l139j314j058K400
7657C057L530j567k38M889j700m969J786L905l704K6m68l488m888n170M64J2093
$$ plain form
7766 8824 6593 9236 12658 8650 919 -1730 395 5305 8886 7158 8662 13548 9773 381 -7108
7751 -7108 -6579 3887 10196 14916 12481 9474 8367 7704 1847 1454 7541 11420 16345 12261 12910 13481
7735 13481 17748 15608 11341 12919 16957 17165 15146 16337 11529 11563 13855 14107 13778 9119 5108 3727
7719 3727 -462 -3943 -7024 -1154 105 2626 4993 2464 6282 7773 7405 7337 6890 3130 1163 -3274
7703 -3274 -3061 -4333 -698 1669 3645 6837 2048 -562 -3306 -2899 2203 11480 10657 4366 1795 -1946
7687 -1946 -781 3608 5728 9553 8717 7127 -240 -3526 -5688 1024 2474 3006 9076 12879 17922
7672 17922 12117 6366 1043 -2879 -4441 2658 11156 16367 7614 3874 6168 3029 1715 657 3057
7657 3057 6587 5020 4782 9671 7971 3002 4788 8693 4989 5015 4547 1059 -3829 -8999 -8535 3558
7641C558Q154j315q679n083N382l528k34M103O218k180n83N691n056j913l678
7626H57j328n70k545l584N53J530J765L014L468P735l942O790n2n866Q16J61L481
7609A2283Q79k464K129Q46j655k588p740K763J057k072m906j48J34K411K536n77
7593B888L312M738k299j354l861j362j122M51N170k499k880N308K588m446r629
7578d997j0844J151M070N65M220J0984J816m771L038O752N827k500j3244k311
7564b44J896l629k634O658M949Q597j245j3792m267l096K292l581O063M154k556
7549d35K918m679k400P918L41l765J810K313J457k057m066M042Q595J655K228
7534A5875J026r638n374k556k040N255P393o406p192j360L429m129N441Q857R05
$$ plain form
7641 3558 11712 10397 1718 -3365 2017 -1511 -1745 2358 8576 6396 5813 11504 6448 4535 857
7626 857 -471 -1041 -3586 -7170 -6617 -5087 -3322 -308 3160 10895 6953 13743 13691 7825 8641 8802 12283
7609 12283 13162 10698 12827 13673 12018 9430 1690 4453 5510 3438 -1468 -1616 -1482 929 3465 2888
7593 2888 6200 10938 8639 7285 3424 2062 940 1391 6561 4062 1182 6490 9078 4632 -4997
7578 -4997 -15841 -14690 -10620 -10055 -5835 5149 6965 2194 5232 11984 17811 15311 2067 -244
7564 -244 1652 -1977 -4611 2047 6996 15593 14348 556 -3711 -6807 -4515 -8096 -2033 2121 -435
7549 -435 2483 -2196 -4596 3322 3663 -102 1708 4021 5478 3421 -645 3397 11992 13647 15875
7534 15875 16901 7263 1889 -667 -2707 2548 9941 3535 -3657 -5017 -1588 -5717 -276 8581 9486
7519I486K210l027k663m468j0130j678M128L711r84j577O184J92K130o103p314
7504i903k08K494k125M045J0769k768M505K985r024m983O78J794M118K256N11
7489E144J328l056o815k68m55k593K1L510n082Q220K767P2r44l972l055j482O574
7472h6o47N233l590M604M135M065j678j475q16k555p271m147J482K353p19k916
7456d028K236M397k218L884L215K227n420m301P16O634P434k140q549k197J28
7441B018n654n060K410L760J0303r76m113K084Q91r298m074p279O713P369N334
7426D428J991q90J093l326k430L480j093k03k3Q15M824j901q6L030k038k122j485
7409D064k220j861j621m889P892K258j1006m421j417J726j211L648Q767M90M121
$$ plain form
7519 9486 11696 8669 6006 1538 -8592 -10270 -6142 -2431 -3415 -4992 1192 1384 3514 -2589 -9903
7504 -9903 -10111 -7617 -9742 -5697 5072 2304 6809 9794 770 -4213 -3535 -1741 2377 4633 5144
7489 5144 6472 3416 -3399 -3667 -4122 -6715 -6694 -3184 -8266 -46 2721 2793 1849 -2123 -5178 -6660 -86
7472 -86 -733 4500 910 5514 9649 13714 12036 10561 9745 7190 -81 -4228 -2746 -393 -1112 -4028
7456 -4028 -1792 2605 387 4271 7486 9713 4293 -8 708 7342 14776 12636 4087 1890 2018
7441 2018 -3636 -8696 -6286 -2526 7777 6801 2688 4772 5663 -3635 -7709 -14988 -8275 -906 4428
7426 4428 6419 5529 6622 3296 866 4346 3253 3050 3027 3842 8666 6765 6679 9709 7671 5549 4064
7409 4064 1844 -17 -1638 -6527 1365 3623 -7383 -11804 -13221 -11495 -12706 -9058 -291 199 4320
7394D320p54J627Q776p768k419P58l010m732M429m53l188P648M713L15J94n971
7378D485k375N50l034k767J296O028q46L153l51n804n517m910J1725R448J810
7363A2891m809o737O04p40j315K824l57j499p70J169Q85l789M36Q13K921q154
7347e627r244K215N348K052M534O09m89o588p190m219J023n69k343M278M474P134
7331d602P867l606k712j117J371o240o40J258J743m288L232J613K564k523o707
7316a2787J628N577j064o84K478j354M794N516J565N54p213j526M794k478J811
7301A611R074l633k979N333m067J196Q18j2732n880M194O379n38N064O431q38
7286I433M828m373p021q954M132K972L656K710P32j2081n582K303k85O266O837
$$ plain form
7394 4320 3566 5193 13969 6201 3782 4540 1530 -3202 1227 774 -2414 5234 9947 10262 10456 4485
7378 4485 2110 2660 -374 -3141 -1845 4183 3337 6490 6139 335 -5182 -10092 1633 11081 12891
7363 12891 8082 1345 1949 1209 -106 2718 2361 862 92 1261 2146 -1643 -1207 -394 2527 -5627
7347 -5627 -14871 -12656 -7308 -5256 -722 -113 -602 -7190 -14380 -18599 -17576 -18145 -20488 -16210 -11736 -4602
7331 -4602 3265 -341 -3053 -4170 -2799 -9039 -9679 -8421 -6678 -10966 -7734 -6121 -3557 -6080 -12787
7316 -12787 -11159 -5582 -6646 -7330 -4852 -6206 -1412 4104 5669 6223 -990 -2516 2278 -200 1611
7301 1611 10685 7052 4073 9406 5339 6535 7353 -5379 -11259 -7065 -686 -1224 3840 10271 9433
7286 9433 14261 9888 2867 -6087 -1955 1017 4673 7383 8115 -3966 -9548 -7245 -7530 -1264 5573
7271E573o60l869l263P42l64R7j043L708j422k141m952J344J8l15l641p20N803
7254e105J1003N263n498m936M10K752k416o506M2O697J055k964k032J360k474
7239c349q287k096P062P254J72L449l075p80j550j767J499J090L216m558o777
7224h497J200K712L77J761P970M93n946M053M613J262Q79L195o984n52J193N738
7208A3467K718m230l501r797m058k222K018J93j806N983O399j181l357M21M93
7193A540L492m150l430J565m633l846n602N163O817N576m826k401J1496L402j925
7178H238j23m552q573R69K400o123L12J135Q496O528J267m027n772k488k46J634
7162i25Q509O588l324k368K109K184k543r14j026O74k886j157J995nO96l396j271
$$ plain form
7271 5573 4913 1044 -2219 -1477 -1841 -1744 -2787 921 -501 -2642 -7594 -6250 -6232 -6547 -10188 -10908 -5105
7254 -5105 5898 11161 5663 727 1137 3889 1473 -5033 -4991 1706 2761 -203 -2235 -875 -3349
7239 -3349 -11636 -13732 -6670 584 756 4205 1130 350 -1200 -2967 -1468 -378 2838 -1720 -8497
7224 -8497 -7297 -4585 -4208 -2447 5523 6016 70 4123 8736 9998 10877 14072 7088 6536 7729 13467
7208 13467 16185 11955 8454 -1343 -5401 -7623 -5605 -5412 -7218 -1235 5164 3983 626 1047 1540
7193 1540 5032 882 -2548 -983 -5616 -9462 -15064 -9901 -3084 2492 -2334 -4735 6761 10163 8238
7178 8238 8115 3563 -5010 -4041 -1641 -7764 -7452 -6317 2179 8707 9974 5947 175 -2313 -2559 -925
7162 -925 7584 14172 10848 8480 10589 12773 10230 9316 8290 8964 6078 4921 6916 6911 7607 4211 2940
7145B940k263k161k710L511J1490m20K471O745M12o883J19L716o826k074n308
7130B759m522k437o989r36L308O387M63M045l26n10j757l084l101j829J651J0809
7114C931k081n072k52J141k338J124L450J304o15j783p11L751j872m634M049N66
7098d2k990L891N144m858n489m858O807P268N791l095q258k439L66j614J141K744
7082d91J984k330n952M113N110m202l089J702l535l616k221M080k076N234M745
7067e44o922j911L471o271P480P51J06O8m126J670k800J738k425k847n105K719
7051a4948J689L608N96R47q91q684o32N089L713J896m010N147K431m262L692K008
7035b611K256j487K373J881k335M598j579n877j346q55j691M183k49j368M884
$$ plain form
7145 2940 677 -1484 -4194 -683 10807 10387 12858 19603 20015 13132 13251 16967 10141 8067 2759
7130 2759 -1763 -4200 -11189 -12125 -8817 -2430 -1967 2078 1752 1242 -515 -3599 -6700 -8529 -6878 3931
7114 3931 1850 -3222 -3474 -2333 -4671 -3547 -97 1207 592 -1191 -1902 1849 -23 -4657 -608 -42
7098 -42 -3032 859 6003 1145 -4344 -9202 -2395 4873 10664 7569 -689 -3128 -2762 -4376 -3235 -491
7082 -491 1493 -837 -6789 -2676 2434 -1768 -4857 -3155 -6690 -10306 -12527 -8447 -10523 -5289 -544
7067 -544 -7466 -9377 -5906 -12177 -4697 -3946 -3840 -3772 -7898 -6228 -9028 -7290 -9715 -12562 -17667 -14948
7051 -14948 -13259 -9651 -9055 -8108 -8999 -17683 -18315 -13226 -9513 -7617 -11627 -6480 -4049 -8311 -4619 -2611
7035 -2611 -355 -1842 531 2412 77 4675 3096 -2781 -4127 -4982 -6673 -2490 -2739 -4107 777
7020G77K535j372n49K352m324o584l633J333j520j126K78J901j279O873J694n121
7004g765k207J109M340P43Q58K682P906l284m30k716m394l2J864j552M394j348
6988A68k47K014m99n072m296k408M09O485k534p211K160J33K847M090J582J455
6972i24M76j520Q320N205N49k800j788n934m153K308J786n640k917k97j225K686
6956e868R83L695j525q44N53m76m507K08Q365K142j021K033o39q94n601p439l978
6939a4813l243O40J3649R806m36l216l756n368l969J974j370K230L214L427M359
6924C128J105j959n677q113J647j457j752L498N371J344l676J028M386J0064N140
6909A4077j949l024j652m540j120J293R15J209m410n753k344J927o79m306j556
$$ plain form
7020 777 3312 1940 1391 3743 -581 -7165 -10798 -9465 -10985 -12111 -11833 -9932 -11211 -4338 -2644 -7765
7004 -7765 -9972 -8863 -4523 -3780 -2922 -240 7666 4382 3952 1236 -3158 -3190 -1326 -2878 1516 168
6988 168 -79 1935 1436 -3636 -7932 -10340 -9931 -3446 -5980 -13191 -11031 -10898 -8051 -3961 -2379 -924
6972 -924 -448 -1968 6352 11557 12106 9306 7518 1584 -2569 -261 1525 -4115 -7032 -7329 -8554 -5868
6956 -5868 -4885 -1190 -2715 -3559 -3006 -3482 -7989 -7781 584 2726 1705 3738 3099 2205 -3396 -10835 -14813
6939 -14813 -18056 -17416 -3767 6039 5603 2387 -1369 -6737 -10706 -8732 -10102 -7872 -4658 -1231 3128
6924 3128 4233 2274 -3403 -11516 -9869 -11326 -13078 -9580 -4209 -2865 -6541 -5513 -1127 8937 14077
6909 14077 12128 9104 7452 2912 1792 3085 4000 5209 799 -4954 -7298 -5371 -6050 -10356 -11912
6894a1912Q300Q799o97k719L78n756R67k100q054K234O297R331J324j0916k112
6879f636o52p53L918L045L02O18Q31J354q78m686R593K663l906P94j422p936n31
6862d282L861J433q87q537M203Q9m392k17m788Q62K786k358K535J1084M12k80
6846A524N100q18K698j598J483L183K214m316o863m999Q37R82L666l524q447l39
6830i217O864N639L565o687l250M05k949o802l28K418R74L512j60n114J451O437
6814c242po30J42l354K392M630n0n509N114P635k210j770n608K59m798J780L306
6797a920Q425K380j0402n820l557L160j040M175R633K003r027L85K323m089p013
6782a0384O139J371J07j681j513R214O137j937o52n153k421Q554M873m315m891
$$ plain form
6894 -11912 -3612 5187 4490 1771 2149 -3607 -2640 -4740 -12794 -10560 -4263 5068 6392 -4524 -6636
6879 -6636 -7288 -8041 -4123 -1078 -776 -158 673 2027 1149 -3537 6056 8719 4813 5607 4185 -3751 -4282
6862 -4282 -421 1012 125 -8412 -4209 -4120 -8512 -8729 -13517 -12655 -9869 -12227 -9692 1392 1804 1524
6846 1524 6624 5806 8504 6906 8389 11572 13786 9470 2607 -2392 -1555 -573 3093 -431 -8878 -9217
6830 -9217 -2353 3286 6851 164 -3086 -2681 -5630 -12432 -12760 -10342 -9368 -5856 -6016 -11130 -9679 -3242
6814 -3242 -3249 -3879 -3737 -7091 -4699 -69 -119 -5628 -514 7121 4911 3141 -2467 -2208 -7006 -5226 -1920
6797 -1920 6505 8885 -1517 -7337 -10894 -7734 -8774 -4599 5034 7037 -1990 -1605 718 -3371 -10384
6782 -10384 -4245 -2874 -2767 -4448 -5961 3253 9390 7453 6801 1648 -773 7781 12654 8339 3448
6767C448l479m038K339l322K450M724n381j483R76M126k570j807M475M684M563
6752I705k561K832K302r900r401M715M095j501j941K196M013m844k953J935k431
6737c739J872L028o324O036J361L24j348o838L492L329L062j391L824o171j781
6722a264k625L314J86Q423r82k181Q32l968o543K767K299l385l724j696P698J1184
6706A0335O897N480j833o062j490M80j548L740l385p865L516J737K89n022j0775
6691e506j490K790O7M497K535Q219k80m867j700k891o021K240M935l525l016n290
6675i303m704J084K411k034o339M439L523n054K060j900O104P133k213l61K529
6660b625n72Q87j958K833P576p8J714q57j0403r425M241J353L080l2J359j633
$$ plain form
6767 3448 -31 -4069 -1730 -5052 -2602 2122 -3259 -4742 -3766 360 -2210 -4017 458 5142 9705
6752 9705 7144 9976 12278 2378 -7023 -2308 1787 286 -1655 541 4554 -290 -3243 -1308 -3739
6737 -3739 -1867 1161 -5163 873 2234 2558 1210 -5628 -2136 1193 4255 2864 6688 517 -1264
6722 -1264 -3889 -575 -389 8034 7052 4871 5703 1735 -4808 -2041 258 -3127 -6851 -8547 -849 10335
6706 10335 17232 22712 20879 14817 13327 13807 12259 15999 12614 4749 8265 10002 10291 5269 -5506
6691 -5506 -6996 -4206 -4139 358 2893 11112 10832 5965 4265 1374 -4647 -2407 2528 -997 -4013 -9303
6675 -9303 -14007 -12923 -10512 -12546 -18885 -14446 -10923 -15977 -13917 -15817 -9713 -2580 -4793 -5154 -2625
6660 -2625 -3197 -2310 -4268 -1435 6141 6063 7777 6920 -3483 -12908 -8667 -7314 -4234 -4266 -2907 -4540
6644d540J015J335J390j076k210J293K945n58k325M247O66j535m66j13J017l879
6628b794K788p266l445L467O807M340j037k674M17L60j904K692q9l410k522l072
6612g342L173K716l46J794m47m43L094m8p249q65m76k879j871M182K47J270N050
6595d40l070q084M043Q882N722n292k692K724m866k066k509n915L917R610J002
6580I66n42J489k382M01n974J308l516q687K191J605O71j036J305O303K57r55
6564f596N07J1115N342q075M181K957q971o130r0Q044l735j44R2l562o856k408
6548a4329P673j668m353l832o25O648Q126q35l986M69J00m711P13r28O495j02
6532e145l578j554J176r08p07l96M107L764K268K85J144M172J180k975q355j922
$$ plain form
6644 -4540 -3525 -2190 -800 -1876 -4086 -2793 152 -406 -2731 1516 2182 647 181 68 1085 -2794
6628 -2794 -6 -7272 -10717 -7250 -443 3897 2860 186 603 963 -941 1751 1662 -1748 -4270 -7342
6612 -7342 -4169 -1453 -1799 -5 -452 -895 2199 2151 -5098 -5963 -6439 -9318 -11189 -7007 -6760 -5490 -440
6595 -440 -3510 -11594 -7551 1331 7053 1761 -931 1793 -3073 -5139 -7648 -13563 -9646 -36 966
6580 966 424 1913 -469 -68 -6042 -4734 -8250 -16937 -14746 -13141 -12470 -13506 -12201 -5898 -5641 -6596
6564 -6596 -6089 5026 10368 2293 6474 9431 460 -5670 -5760 2284 -1451 -1595 -1503 -5065 -11921 -14329
6548 -14329 -6656 -8324 -12677 -16509 -17134 -10486 -2360 -3195 -7181 -6712 -6612 -11323 -10610 -11538 -5043 -5145
6532 -5145 -8723 -10277 -9101 -10009 -10716 -11112 -7005 -3241 -973 -688 456 4628 5808 2833 -5522 -7444
6516g444M50R42L149J259J208R287J63p081m956o581k836R82M583k075o48O388
6500c210o453j753N693M576O90k208J293M36j023p857L702R684O55q764m135K707
6484e967j348k548R84M181L870L639j983K961k551J0656l502q342l509k93Q513
6469D761m42l863K923J399n066o497l023L314O742o469m501P81N327q51L882N45
6453a038j543J111M441K393N920l437k348n228o007N720P360p86q421j504m85
6438c852J220K210J716l510J082k286p07l86j243R943N645j577N163o486l236
6423C696k408K987P63n731P49j493k217M451j633n244j438K454K074m933j11O125
6407a909K231l546l651N601Q72j838L504k003j500j25N469L035m585r04Q48j965
$$ plain form
6516 -7444 -6994 -6052 -2903 -1644 -436 8851 9014 1933 -3023 -9604 -12440 -11458 -6875 -8950 -9598 -3210
6500 -3210 -9663 -11416 -5723 -1147 -457 -2665 -1372 -936 -1959 -9816 -6114 3570 4225 -4539 -8674 -5967
6484 -5967 -7315 -9863 -8879 -4698 -828 2811 828 3789 1238 11894 8392 50 -3459 -3752 4761
6469 4761 4319 456 3379 4778 -288 -6785 -9808 -6494 248 -6221 -10722 -9941 -4614 -5465 -1583 -1038
6453 -1038 -2581 -1470 2971 5364 11284 7847 5499 271 -5736 -16 7344 6558 -1863 -3367 -3852
6438 -3852 -2632 -422 1294 -2216 -1134 -3420 -4127 -4513 -5756 4187 9832 8255 13418 6932 3696
6423 3696 1288 4275 5038 -693 56 -1437 -3654 797 -836 -6080 -7518 -5064 -2990 -7923 -8034 -1909
6407 -1909 322 -3224 -6875 -1274 -402 -2240 1264 -739 -2239 -2364 3105 6140 1555 651 1499 -466
6391d66K657J054n914k905K156l54J548n189K550P166L964n718J268O852k174
6376F495o469J272o39n56O090k04k807k208N16k347l042J755p197n376L47j607
6360a5977L808Q420N492L98K855o241J407K227K317m925j852l993N028K470p729
6345f295n65L586N056R242N823o14o117r895n963m775n439M658K251M75L948j768
6329f392N57M405k947m233j998L41M587J012n987o232K318Q536m464K415K695
6314e387l294O309K919k862m51L105j055K290l906J497k67N32m36L027n173k742
6298e894R18K268j599k762j265k748K536O416Q923j608r824O394n76K410o302
6283b713l598j371N958M131k715j159K000N807m601j0033p707L950K283J1423
$$ plain form
6391 -466 2191 3245 -2669 -5574 -3418 -3772 -2224 -7413 -4863 2303 6267 549 1817 8669 6495
6376 6495 26 1298 659 103 6193 5989 3182 974 1490 -857 -3899 -2144 -9341 -14717 -14370 -15977
6360 -15977 -12169 -3749 1743 2141 4996 -1245 162 2389 4706 -219 -2071 -6064 -1036 1434 -6295
6345 -6295 -6860 -3274 1782 11024 16847 16233 10116 221 -5742 -10517 -15956 -11298 -9047 -8572 -4624 -6392
6329 -6392 -5835 -1430 -4377 -8610 -10608 -10267 -5680 -4668 -10655 -16887 -14569 -6033 -10497 -8082 -5387
6314 -5387 -8681 -2372 547 -2315 -2766 339 -716 1574 -2332 -835 -1102 -570 -1006 2021 -3152 -5894
6298 -5894 -4976 -2708 -4307 -7069 -8334 -11082 -8546 -2130 6793 5185 -4639 1755 1179 3589 -2713
6283 -2713 -6311 -7682 -1724 2407 -308 -1467 533 6340 1739 -8294 -16001 -12051 -9768 1655
6269A655J224n236J135l127j515j623K277j389K273J407M021M659l762l610j851
6254c462L011O10p587K430r94n778N229M287l070l505L217L273N717p605n002
6239i229L42J840J402O755J506n174r059j280K050Q436O808K831M049q995j1075
6224h793q064L318M560L025M101J672J539l200O33p53M273J15j1431K568K58R33
6208e246J769M44l549k003J897k718n405m202O257L740O617L281J314k564k627
6193b995R88M026L734k547Q48Q46n725j804j09K429L969R58R06O996p66l157n927
6176B670o778L178k002K953K249k542m088p190R69R049Q703J53n582l686K383
6161D39k730l487j931K132K086J126l060l601L585l213j736j439n331J403M157
$$ plain form
6269 1655 2879 -2357 -1222 -4349 -5864 -7487 -5210 -6599 -4326 -2919 1102 5761 1999 -1611 -3462
6254 -3462 -451 159 -7428 -4998 -5992 -11770 -6541 -2254 -5324 -8829 -5612 -2339 3378 -4227 -9229
6239 -9229 -8887 -7047 -5645 1110 2616 -2558 -11617 -12897 -10847 -2411 4397 7228 11277 2282 -8793
6224 -8793 -16857 -13539 -8979 -5954 -1853 -181 1358 -1842 -1209 -1962 2311 2426 -9005 -6437 -6179 -5246
6208 -5246 -3477 -3033 -6582 -8585 -6688 -9406 -14811 -19013 -12756 -9016 -2399 882 2196 -368 -2995
6193 -2995 -2007 2019 5753 3206 4054 4900 -825 -2629 -2738 -309 3660 4618 5524 12520 11754 8597 2670
6176 2670 -4108 -930 -2932 21 2270 -272 -4360 -11550 -10581 -1532 7171 7324 1742 -1944 439
6161 439 -2291 -5778 -7709 -5577 -3491 -2365 -5425 -9026 -5441 -8654 -10390 -11829 -17160 -15757 -11600
6146a1600R45J3081O931l604k695j129n041N92P170L778q922p394o223j568j652
6131a7331O424O536R705k477k56N056k663O233J174l753m382n576k964k141N128
6116a287M685Q15M452m538n993J403L554q0l235j715m740n716K351j641p056o305
6100b5046K786j577K101p30q70L905N417L551K30j300J387R85o28N343O435m04
6084A585M669l53l016q114m389J0146J418M995K232l775p106o470J536N366J669
6069C93p927R37O404M458P571k38p022m601M353K558m683K618n16k172j468p20
6053e5J349Q219j0655r396J295L704K216M998N047J149l732p42m398k590n9j117
6037d767o1N36J870J198O229k217k405J724q05J571l716l084J35J239k088J714
$$ plain form
6146 -11600 -10655 2426 9357 5753 3058 1929 -3112 -2520 4650 8428 -494 -7888 -14111 -15679 -17331
6131 -17331 -10907 -4371 5334 2857 2601 7657 4994 11227 12401 8648 4266 -1310 -4274 -6415 -1287
6116 -1287 3398 4213 8665 4127 -1866 -463 3091 3011 -224 -1939 -6679 -12395 -10044 -11685 -18741 -25046
6100 -25046 -22260 -23837 -21736 -22466 -23336 -19431 -14014 -10463 -10233 -11533 -10146 -9161 -9789 -4446 1989 1585
6084 1585 6254 5901 2885 -5229 -9618 528 1946 6941 9173 5398 -1708 -8178 -6642 -1276 393
6069 393 -7534 -6597 -193 4265 11836 11598 4576 -25 4328 6886 2203 4821 4305 2133 665 -55
6053 -55 1294 9513 -1142 -10538 -9243 -5539 -3323 1675 6722 7871 4139 3397 -1001 -3591 -3650 -4767
6037 -4767 -4828 -4292 -2422 -1224 5005 2788 383 2107 1302 2873 -843 -3927 -3792 -2553 -4641 -2927
6021b927J119m331J562m815P58O970O684k385j733k562J028L893j862Q41j429
6006H11k048n97n157J896k532R81o805j539P310K846J639L910o148k415J681P596
5990A429L912q477J286k519q11J084J954P10J526K9o273o86N731L694J134k303
5974A420k723Q38m359n322K195m85K087O639K312m054o377p115k142O916O058
5959d112L384k592K086K039o379J594N939K298o1k055p723n013O823M609k576
5944a739K811m800m205J2389N226j100m085m929p992j212J958K491J947l33J486
5929b087l654M321l66n09L580j613j302J94l497m155l630P72M220L463M042Q489
5913H268p33j143k301J648k246k691P037j743m677P88L416o13j033q71r057j028
$$ plain form
6021 -2927 -1808 -6139 -4577 -9392 -8634 -1664 5020 2635 902 -1660 -632 3261 1399 2240 811
6006 811 -1237 -1834 -6991 -5095 -7627 -6646 -13451 -14990 -7680 -4834 -3195 715 -5433 -7848 -6167 1429
5990 1429 5341 -3136 -1850 -4369 -5180 -4096 -2142 -1432 94 123 -6150 -6836 -1105 2589 3723 1420
5974 1420 -1303 -465 -4824 -10146 -7951 -8436 -6349 290 2602 -1452 -7829 -14944 -17086 -10170 -4112
5959 -4112 -728 -3320 -1234 805 -5574 -3980 1959 4257 4196 2141 -5582 -10595 -3772 837 -1739
5944 -1739 1072 -3728 -7933 4456 9682 8582 4497 -432 -8424 -9636 -7678 -5187 -3240 -3573 -2087
5929 -2087 -5741 -1420 -1786 -2295 1285 -328 -1630 -1436 -4933 -9088 -12718 -11946 -7726 -4263 -221 8268
5913 8268 7535 6392 4091 5739 3493 802 7839 6096 1419 2207 5623 5010 3977 3106 -5951 -6979
5897f979M806L179l56n22n274M064L987L451K197m767m885J533Q34l021j238k617
5881e608L684M113m587J57m775K814k700k009Q380j151k992J856K86j625r28L639
5865a446j467j334k118r32n604M120N366M397j196k455J183K08J810L271m189
5850c86m431o611n345N141L653J424q8q58nJ693N845J454n068J065L694m317r08
5833d048r27L085L448M396O344k480j0300L933K76M763N670L487q01k802n078
5818H966n397o87p930l830J247N137M059M078o60k165j005l244n258k130J348
5803g471j883K338J788L41J064k254P87p9K014j352K882K104m266O96j157K474
5787a974O998Q8q08Q25N87k381r91p334j866r58P95r36l101K116L632j149n5j309
$$ plain form
5897 -6979 -2173 1006 650 128 -5146 -1082 2905 6356 8553 3786 -1099 434 1268 -1753 -2991 -5608
5881 -5608 -1924 2189 -2398 -2241 -7016 -4202 -6902 -8911 -531 -1682 -4674 -2818 -2532 -4157 -5085 -1446
5865 -1446 -2913 -4247 -6365 -7297 -12901 -8781 -3415 982 -214 -2669 -1486 -1278 532 3803 -386
5850 -386 -4817 -11428 -16773 -11632 -7979 -6555 -6643 -7501 -7506 -5813 32 1486 -3582 -2517 1177 -3140 -4048
5833 -4048 -4975 -1890 1558 5954 12298 9818 -482 3451 3727 8490 14160 17647 16846 14044 8966
5818 8966 3569 2882 -5048 -8878 -7631 -2494 1565 5643 4983 2818 1813 -1431 -6689 -8819 -7471
5803 -7471 -9354 -7016 -5228 -4887 -3823 -6077 -5290 -5369 -3355 -4707 -1825 279 -3987 -3291 -4448 -1974
5787 -1974 5024 5112 4304 5129 5716 3335 2344 -4990 -6856 -7814 -7019 -7955 -11056 -8940 -5308 -6457 -6512 -7821
5769g821n068k412P428P808K38n519o421L490O738P068K368p596p420N62M106
5754b451K636P26P566l242p562k446j1932J377J0090N444j892R28m605k130L325
5739d168L815m400O60K484o11m156K718N761N411O30q337o683k088M642Q91m381
5723g812j453Q382Q223l577r173j386P77P007J718l916r044o961L178j904l331
5708a9272O328l802k224K749J0272K366j190m37K786o91P484K64K93o534m774
5693f382L900p84n294n345J640K437N856Q52n211K075O232N218j624o331j643
5678d404M804n83l370p455J617m068L694l91O738L660P362N820m812j1345r187
5663a1920L117l580l139O91L948o61N187N076P77r038J23P185M680k104k960K70
$$ plain form
5769 -7821 -12889 -15301 -7873 -65 173 -5346 -11767 -8277 -1539 5529 7897 301 -7119 -6557 -2451
5754 -2451 185 911 8477 5235 -2327 -4773 -16705 -15328 -5238 206 -1686 -758 -5363 -7493 -4168
5739 -4168 -353 -4753 -4093 -1609 -2220 -6376 -3658 2103 7514 8144 -193 -6876 -8964 -4322 -3431 -7812
5723 -7812 -9265 -883 7340 3763 -5410 -6796 -6019 988 2706 -1210 -10254 -17215 -14037 -15941 -19272
5708 -19272 -12944 -16746 -18970 -16221 -5949 -3583 -4773 -5210 -2424 -3115 4369 4633 4926 -1608 -6382
5693 -6382 -2482 -3266 -8560 -13905 -12265 -9828 -3972 -3120 -8331 -6256 -24 5194 3570 -2761 -4404
5678 -4404 400 -183 -3553 -11008 -9391 -13459 -9765 -10156 -3418 242 7604 13424 8612 -2733 -11920
5663 -11920 -8803 -12383 -15522 -14831 -10883 -11544 -6357 -1281 -504 -9542 -9419 -2234 2446 342 -2618 -2348
5647b348k994M420n192j0735J732j48k442K246K031Q605N182J054j984j444l386
5632e403k475K416N297n273o033k417L026N787R892n599k919n571q94L601J122
5617e443J709Q475J315p573k596m32K160l188K988J51k772J229k298l339l547
5602a3161L114M180Q95L27M336M130N941k675p338m604L806J211k765N91n522
5587g534R042L824j523O446J35j541m482m353n752p050l621k206O93Q099o01o55
5571a1079q12k822K844K704k799N914N177Q79N031P04k665j449J283r95j390k013
5555a488k748o649l183K126k205J924M314M836m61P712L994n29j744l815m974
5540b890P531K590r851p083n326J101P320O857p36p246P66O743j769o515j050
$$ plain form
5647 -2348 -5342 -922 -6114 -16849 -15117 -15265 -17707 -15461 -13430 -4825 357 1411 -573 -2017 -5403
5632 -5403 -7878 -5462 -165 -5438 -11471 -13888 -10862 -5075 4817 -782 -3701 -9272 -10166 -6565 -5443
5617 -5443 -3734 4741 6056 -1517 -4113 -4545 -2385 -5573 -2585 -2434 -5206 -3977 -6275 -9614 -13161
5602 -13161 -10047 -5867 -4972 -4645 -309 3821 9762 7087 -251 -4855 -1049 162 -2603 -2012 -7534
5587 -7534 1508 5332 3809 10255 10390 8849 4367 14 -5738 -12788 -16409 -18615 -17922 -9823 -10424 -11079
5571 -11079 -11891 -14713 -11869 -9165 -11964 -6050 -873 6 5037 5741 3076 1627 2910 1915 525 -1488
5555 -1488 -4236 -10885 -14068 -11942 -14147 -12223 -7909 -3073 -3534 4178 8172 7643 5899 2084 -2890
5540 -2890 4641 7231 -2620 -9703 -15029 -13928 -6608 249 -487 -7733 -6967 -224 -1993 -8508 -9558
5525i558M170L117n212k522M266R7J497N249m245J205K712L461k772J30m418J289
5509a534O636L563M820J614Q88q71r693k554j166r34M142j935m212L170J159o314
5493c221J507J359j564j708L476M140M5n279k500j415J17L27J343J2039j798k857
5477D011J860k136k340p34J857q549o004N28O440M837j865p45l031p428J0730
5462b569O008J647m141o046m301J237J1744L498m219o733K387j778q64K200Q626
5447F696O467q79m042n32K375Q88O9j437o669n414L719L105Q60N95j246o028j575
5430c048n766n894m214r92J0647R289M004L166k626j613J865p43N344l243k770
5415C406k581j731N23K27r65Q528J256n051J509J661p395l265l791l474k546P370
$$ plain form
5525 -9558 -5388 -2271 -7483 -10005 -5739 -5642 -4145 1104 -3141 -1936 776 4237 1465 1595 -2823 -1534
5509 -1534 5102 8665 13485 15099 15987 15116 5423 2869 1703 769 4911 2976 -1236 1934 3093 -3221
5493 -3221 -1714 -355 -1919 -3627 -151 3989 4034 -1245 -3745 -5160 -5043 -4716 -3373 8666 6868 4011
5477 4011 5871 3735 1395 661 2518 -6031 -12035 -11507 -5067 -230 -2095 -2840 -5871 -13299 -2569
5462 -2569 3439 5086 945 -5101 -9402 -8165 3579 7077 2858 -3875 -1488 -3266 -4130 -1930 6696
5447 6696 13163 12284 8242 7710 10085 10973 11042 9605 2936 -2478 1241 4346 5206 5801 4555 -1473 -3048
5430 -3048 -8814 -14708 -18922 -19914 -9267 22 4026 7192 4566 2953 4818 4075 9419 6176 3406
5415 3406 825 -906 -383 -156 -1121 7407 8663 3612 5121 6782 -613 -3878 -7669 -11143 -13689 -6319
5399f319O795K330n508j744M670K901R00L66o560q342q169k129O015O032K981
5384e781p50K038l36p484L251M678R244J954K155n183j99j656p280K685M274j811
5368b01n427j679j382L14K187K011M318l313l286M299l411L203m08n036k291P556
5352b546J985p076k813p522j985M433l9K229N785k959k889L579O899J731n71P80
5336i79K870k198q60J361M713l088J972J556k336L377o149r719J1087J0349m342
5321G614l741l647m49l124j64Q756L4r442l580M544N291j18J083m000N73O109
5305E739k87p180k708j092k59K742l91j580K84L102L773m610L172L912n689n934
5289g006k079J703O037j90L53K637n729L466M822M823n452n581J575k59p9p823
$$ plain form
5399 -6319 476 2806 -2702 -4446 224 3125 4025 4391 -2169 -10511 -18680 -20809 -14794 -8762 -5781
5384 -5781 -6531 -4493 -4829 -12313 -9062 -4384 4860 6814 8969 3786 3587 1931 -5349 -2664 1610 -201
5368 -201 -5628 -7307 -8689 -8375 -6188 -4177 141 -3172 -6458 -2159 -5570 -2367 -2775 -7811 -10102 -2546
5352 -2546 -561 -7637 -10450 -17972 -19957 -15524 -15563 -13334 -7549 -10508 -13397 -9818 -2919 -1188 -1759 -979
5336 -979 1891 -307 -1167 194 4907 1819 3791 5347 3011 6388 239 -9480 1607 11956 7614
5321 7614 3873 226 -223 -3347 -3511 5245 5279 -4163 -7743 -3199 2092 1974 3057 -943 -370 5739
5305 5739 5452 -1728 -4436 -5528 -5787 -3045 -3436 -5016 -4732 -1630 2143 -2467 705 4617 -1072 -7006
5289 -7006 -9085 -7382 -1345 -1535 -1182 1455 -4274 -808 4014 8837 3385 -2196 -621 -880 -959 -8782
5273h782o976K413N388J131j733l529m328J85O544K178p403m967R324L264J708
5258e583L572k69m241N8J0476M578J379M4j237m635l682m023p296R089M042q84
5242A388J301N383K37o236J115K94q338p288n258L067O975Q907L301p378q589
5227a1119J756O021J536M51J772l598J258N783j115p0k695p062j962J696k111
5212i459k100j085p38l71J008N817R788K699n708P65L753N094l893j953j802k583
5196g68o160k927l378M858L385R4r89k6J426O629L915j329o739l425n927l123
5180a4484Q332K910q841l070P666M943n551M592K267j256J321K169J321o058J233
5165b506j935K38M512j586o07K233O183k733p034n634O096K935j0633n082j812
$$ plain form
5273 -8782 -15758 -13345 -7957 -6826 -8559 -12088 -16416 -16231 -9687 -7509 -14912 -19879 -10555 -7291 -5583
5258 -5583 -2011 -2280 -6521 -6463 4013 8591 9970 10014 8777 4142 460 -3563 -10859 -1770 2272 1388
5242 1388 2689 8072 8309 2073 3188 3482 -4856 -12144 -17402 -14335 -7360 1547 4848 -2530 -11119
5227 -11119 -9363 -3342 -1806 -1355 417 -3181 -1923 3860 2745 2675 -20 -7082 -9044 -7348 -9459
5212 -9459 -11559 -12644 -13382 -13753 -12745 -6928 2860 5559 -149 616 4369 9463 5570 3617 1815 -768
5196 -768 -6928 -9855 -13233 -8375 -4990 -4896 -5885 -5911 -4485 2144 6059 4730 -2009 -5434 -11361 -14484
5180 -14484 -6152 -3242 -12083 -15153 -7487 -2544 -8095 -3503 -1236 -2492 -1171 998 2319 -3739 -2506
5165 -2506 -4441 -4203 309 -1277 -1884 349 6532 3799 -3235 -8869 -2773 162 -10471 -15553 -17365
5150a7365P224J0580k405p338L956K145J510r522J906L838O62J061j99O247R37
5135C237o295o874J299q02M83L181N114j801J580L037L199j794K036M870O515
5120A6985J989p061q406k519Q68q86M27M635p55j322L938m167p875l94L465L050
5104A972N018j133j509k300m64l958k290K036l010J496O767J780J139K360N00
5089H404J853j257O8j880m143m129j034N850N151M939j390j5375l163J997N497
5074A388R9o275n801L653O130k299l407N56O439l737k512N819J29L023K406k434
5058C177j365N112R85n469m246N365o18j233j29p724l950N960k554l930N342N030
5042b47N09k917J739l957L705r408n170P168l158N309P686J983k465m336J670
$$ plain form
5150 -17365 -10141 439 -1966 -9304 -5348 -3203 -1693 -11215 -9309 -5471 -4809 -3748 -3947 2300 3237
5135 3237 -3058 -9932 -8633 -9435 -8952 -5771 -657 -2458 -878 2159 5358 3564 5600 10470 16985
5120 16985 18974 11913 3507 988 1856 970 1397 6032 5277 3955 7893 3726 -4149 -4543 -1078 1972
5104 1972 6990 5857 4348 2048 1584 -2374 -4664 -2628 -5638 -4142 2625 4405 5544 7904 8404
5089 8404 10257 9000 9068 7188 3045 -1084 -2118 3732 8883 13822 12432 -2943 -6106 -4109 1388
5074 1388 1487 -4788 -10589 -6936 -806 -3105 -6512 -5956 483 -3254 -5766 53 182 3205 5611 3177
5058 3177 1812 6924 7909 2440 -1806 3559 2941 1708 1579 -6145 -10095 -4135 -6689 -10619 -5277 -247
5042 -247 262 -2655 -916 -4873 -1168 -10576 -15746 -8578 -11736 -6427 1259 3242 777 -3559 -1889
5027a889M506q32o75Q777N474m152m846m211M385l809l859K313k506j753K068
5012a009J196K078O77l36l760o283n736j625M332J835l700R957R17L044P48q621
4996f286j769k000R43j904L969K944N807O87k515K387R4n353m510J872M182l902
4980e354L088J418k429k68R4K285J569O19o853l157K061k652R106N585o004k257
4964c149N68K120j149j891m840K725L737K510j514N353J986J424K239p215n541
4949b637l271J128O878K802m390J846m008q0K371K291r59p76p513j121L453J734
4933b252K431J820J278J130k164L12K39k121J290L293n76j340l118m554M555P733
4917G956r38j211K43J877k056M938m326m399l323J010q81q505k153O549O659J832
$$ plain form
5027 -1889 2617 1785 1110 9887 15361 11209 6363 2152 6537 2728 -1131 1182 -1324 -3077 -1009
5012 -1009 187 2265 2942 2606 -1154 -7437 -13173 -14798 -10466 -8631 -12331 -2374 -1457 1587 2335 -6286
4996 -6286 -8055 -10055 -9112 -11016 -7047 -4103 1704 2391 -124 2263 2357 -2996 -7506 -5634 -1452 -5354
4980 -5354 -2266 -848 -3277 -3545 -3451 -1166 403 1022 -5831 -8988 -6927 -9579 -473 5112 -892 -3149
4964 -3149 -2581 -461 -1610 -3501 -8341 -5616 -1879 631 -883 4470 6456 7880 10119 2904 -2637
4949 -2637 -5908 -4780 2098 4900 510 2356 -1652 -1732 639 2930 1971 1195 -6318 -7439 -3986 -2252
4933 -2252 179 1999 3277 4407 2243 2555 2794 673 1963 5256 4680 3340 222 -4332 223 7956
4917 7956 7018 5807 6050 7927 5871 10809 6483 2084 -1239 -229 -1110 -9615 -11768 -5219 1440 3272
4901C272J95k291m049q196L956O301n606o670k522J775Q47K647L955k917K753
4886f550J1261j098n739m225j436K564J167o143r20M741m85K928j216j068J914
4871d305K001M58k841k199j125P164k12K861K759m092n938l867n990J063J1659
4856b604J0479k235k951j270J946K004j289j581K979K009l427k917j463p47M420
4841C353R98Q77p306l313L957N071R2k126k505m960j61M040K562l635k620Q524
4825B848K536o439N441J829m883q93N337l712l627k186l7O446K106J573l594J491
4809D236r217n376M288M391m458k872p372o921m17R643R358o15m836L825K288
4794d055J253N57L303L155J305l690N483k003J964l636l797k896J408m350n482
$$ plain form
4901 3272 3467 1176 -2873 -11069 -7113 -812 -6418 -13088 -15610 -13835 -12988 -10341 -6386 -9303 -6550
4886 -6550 4711 3613 -2126 -6351 -7787 -5223 -4056 -10199 -11119 -6378 -6863 -3935 -5151 -6219 -4305
4871 -4305 -2304 -1846 -4687 -6886 -8011 -847 -1059 1802 4561 469 -5469 -9336 -15326 -14263 -2604
4856 -2604 7875 5640 2689 1419 3365 5369 4080 2499 5478 7487 4060 1143 -320 -1067 3353
4841 3353 4351 5228 -2078 -5391 -1434 3637 3729 1603 -902 -5862 -6023 -1983 579 -3056 -5676 2848
4825 2848 5384 -1055 4386 6215 1332 439 5776 2064 -1563 -3749 -3786 2660 4766 6339 2745 4236
4809 4236 -4981 -10357 -6069 -1678 -6136 -9008 -16380 -23301 -23718 -14075 -4717 -5332 -10168 -6343 -4055
4794 -4055 -2802 -2245 1058 4213 5518 1828 7311 5308 7272 3636 -161 -3057 -1649 -5999 -11481
4779a1481K174N454j331j710K99O1j048L92L368J051M163Q051j993o566m532l5
4763c683K368J571J565o704p728k49O18M8K827O698Q401n471m488m028K284L497
4747b474J362j591k746l478M377Q81J942k075l205l300m013J408Q006K240o77
4732c343M94l26m64O833J818j62J421k717n476J018j141N413J484j63K037k963
4716C763q406k851l015J117o84Q66l786l43N896M375O074L496J867R14J398m195
4700F486q330q150K254J1567N904N958o182j5605o991J22Q84J565q5J651l190
4685a2142K475j228j759l370J366M619M281o7k840m998K951j38K687P087N472
4670D396m811m183k687n92J1517m39r964j534R75K840l035l924N857M488m03l049
$$ plain form
4779 -11481 -9307 -3853 -5184 -6894 -6595 -6534 -7582 -7190 -3822 -2771 1392 9443 7450 884 -3648 -3683
4763 -3683 -1315 256 1821 -4883 -12611 -12860 -12242 -12194 -9367 -2669 5732 261 -4227 -8255 -5971 -2474
4747 -2474 -1112 -2703 -5449 -8927 -4550 -3669 -1727 -3802 -7007 -10307 -14320 -12912 -4906 -2666 -3343
4732 -3343 -2849 -3175 -3639 3194 5012 4850 6271 3554 -1922 -904 -2045 3368 4852 4689 6726 3763
4716 3763 -4643 -7494 -10509 -9392 -10076 -9210 -12996 -13339 -7443 -3068 3006 6502 8369 9283 10681 6486
4700 6486 -1844 -9994 -7740 3827 9731 15689 9507 -6098 -13089 -12967 -12083 -10518 -10603 -8952 -12142
4685 -12142 -9667 -10895 -12654 -16024 -14658 -10039 -5758 -5825 -8665 -13663 -10712 -10850 -8163 -1076 4396
4670 4396 -415 -4598 -7285 -7877 3640 3201 -6763 -8297 -7322 -4482 -7517 -11441 -5584 -1096 -1499 -4548
4654d548k240q307k58Q513M671L690Q279M58q581o916J690O437K792n478n202
4639e000j411o51K537j33m074P780N117j0280j925N153j32j611O76j964R63j775
4623f730O370J0373l221L66M814j871j1012l614P989J834L23K032L606o804k261
4608B194J95J866L826k990l870L052n257n875n355J815K557K756p296l7Q674j306
4592e051L288O817L61k208J050l127l083J825k96J905j381J957J135j554J53P072
4576H863m07k390m574l522o283q92L291J2935M738o0m239o010k97L300j070M158
4560G541J430n122j769J896L969J3931P878j0516j2440p481m201M322J376l878
4546c064K106M111J3301K721p203n187k101l771o328m802j221J473L752M748m375
$$ plain form
4654 -4548 -6788 -15095 -15353 -6840 -2169 1521 9800 10258 1677 -5239 -3549 2888 5680 202 -5000
4639 -5000 -6411 -7062 -4525 -4658 -8732 -952 4165 -6115 -8040 -2887 -3019 -4630 -3954 -5918 -4955 -6730
4623 -6730 -360 10013 6792 7158 11972 10101 -911 -4525 3464 5298 5621 7653 11259 4455 2194
4608 2194 2389 4255 8081 5091 1221 4273 -984 -6859 -12214 -10399 -7842 -5086 -12382 -12419 -3745 -5051
4592 -5051 -1763 5054 5415 3207 4257 1130 -1953 -128 -424 1481 100 2057 3192 1638 1791 8863
4576 8863 8456 6066 1492 -2030 -8313 -9205 -5914 7021 11759 11699 7460 1450 1153 4453 3383 7541
4560 7541 8971 3849 2080 3976 7945 21876 29754 19238 6798 -683 -4884 -562 814 -3064
4546 -3064 -958 3153 16454 19175 11972 6785 4684 913 -5415 -10217 -11438 -9965 -6213 -1465 -5840
4531e840k691J1N019R51l21K693n263l031J234K404M071O418r35o642N653k587
4515A144l344p088l19L769L823R30j385k768O353M487l91j714k257K952K303k535
4499C960P44m553j343p48Q035o13M51K545N058n181r121r950P29O151P040k538
4483F66j1816k235K976P535N575k940K38K50K928N8j485l52n987k9k447k017L963
4466e119m82l664j129M298J343P32l12J962J63l120o734J817L708M663M550K477
4450E153r80K787m815j0241n271J672M374K665j131N805O586J152n723j243K809
4435C599j28J675j311l733m462K013K579k96q008p447P176K662l334j503N260
4420e258Q784J26J038J0700N86o587m866m371k00k320o96r55K597r82k398J966
$$ plain form
4531 -5840 -8531 -8520 -3501 -2550 -2871 -178 -5441 -8472 -7238 -4834 -763 5655 4720 -1922 3731 1144
4515 1144 -2200 -9288 -9607 -5838 -2015 -1085 -2470 -5238 1115 5602 5211 3497 1240 4192 6495 3960
4499 3960 4704 151 -1192 -1940 6095 5482 5933 8478 13536 8355 -766 -10716 -9987 -3836 3204 666
4483 666 -11150 -13385 -10409 -2874 2701 -239 -1 249 3177 3235 1750 1398 -4589 -4618 -7065 -9082 -5119
4466 -5119 -5601 -9265 -10394 -6096 -4753 -4021 -4333 -2371 -2208 -5328 -12062 -10245 -6537 -1874 2676 5153
4450 5153 4173 6960 2145 -8096 -13367 -11695 -7321 -4656 -5787 18 6604 7756 2033 790 3599
4435 3599 3471 5146 3835 102 -4360 -2347 232 -64 -8072 -15519 -8343 -5681 -9015 -10518 -5258
4420 -5258 3526 3652 4690 15390 15976 9389 4523 152 -48 -2368 -3064 -4019 -1422 -2404 -4802 -2836
4404b836N843k02l200m362J218l203M337J0424J0671l216q326l021k383k793k097
4389c146j363L010j662N543N805p407q311l588J465N393L243l163Q8Q897l085
4374A719n042j250j073m928J073O158J813N143Q08l274m728N372j620K184j288
4359A067O59J793N242j211p772r161M849J881j488p261n87K967l204M552K565
4344e109L983n87M761n101K948k589o99M817m668M56o48R69k666l967o694Q0P559
4327g155J633j162J40N179L956o66j498l369P53O424J605k964p121K447N300R66
4311D468j040l540J34K838K99j974n061Q57K027j19j153L633K481N67M226r76
4295G667l172j554J298n458r072K946R011L994k340j839o231m788M996J044o0
$$ plain form
4404 -2836 3007 2805 -395 -4757 -3539 -6742 -2405 8019 18690 15474 7148 4127 1744 -1049 -3146
4389 -3146 -4509 -1499 -3161 2382 8187 780 -7531 -11119 -9654 -4261 -1018 -4181 -4093 4804 1719
4374 1719 -3323 -4573 -5646 -10574 -9501 -3343 -1530 3613 4421 1147 -3581 1791 171 2355 1067
4359 1067 1726 3519 8761 7550 -222 -9383 -4534 -2653 -4141 -11402 -11989 -9022 -12226 -7674 -5109
4344 -5109 -1126 -1713 3048 -2053 895 -1694 -2393 2424 -2244 -1788 -2436 -1467 -4133 -8100 -14794 -14714 -7155
4327 -7155 -5522 -6684 -6544 -1365 2591 1925 427 -2942 -2189 4235 5840 2876 -4245 -1798 3502 4468
4311 4468 3428 -112 22 2860 3159 1185 -3876 -3019 -992 -1111 -2264 1369 3850 4417 8643 7667
4295 7667 4495 2941 4239 -1219 -10291 -7345 1666 5660 3320 1481 -4750 -9538 -4542 -3498 -3558
4280c558N717M58O587q01R4l624j246o37o955J049J162n80R11k967l087K065P85
4263d627Q789K474l296j01p1L343L582l739j1130m090J732L634J959O78J443O389
4247F969j700j1124m442K860L609N184l180J783J044K995j779l212M083M324o60
4232F754j211j306N148n09k967M58J152K061o488l117J882n086O36L3l496J383
4216d673K834L733n115O419n640p471R699J0100Q564p696p339M188N282p513o650
4201a278k412N925l21J436j0o667P32N247l90p29L595J990J688j926j63J588j772
4184F533k166p651p003m845K014P713R131K312r90R761l187m979o60K4p060M63
4168e90L900J652n58n381j34q8K757L24l63o14o56J263j02R15O65k622J546p21
$$ plain form
4280 -3558 2159 2617 9204 8403 8497 4873 3627 2990 -3965 -2916 -1754 -2334 -1423 -4390 -7477 -5412 -4627
4263 -4627 4162 6636 3340 3239 3168 6511 10093 6354 -4776 -8866 -7134 -3500 -1541 -863 580 6969
4247 6969 5269 -5855 -10297 -7437 -3828 1356 -1824 -41 1003 3998 2219 -993 3090 7414 6754
4232 6754 5543 4237 9385 8876 5909 6367 7519 9580 3092 -25 1857 -3229 -2593 -2560 -6056 -4673
4216 -4673 -1839 1894 -3221 3198 -2442 -9913 -214 9886 18450 10754 3415 7603 12885 5372 -1278
4201 -1278 -3690 2235 1914 3350 3340 -3327 -2595 2652 2262 1533 5128 7118 8806 6880 6717 8305 6533
4184 6533 4367 -3284 -10287 -15132 -13118 -5405 3726 6038 5048 14809 11622 6643 5983 6007 -1053 -590
4168 -590 3310 4962 4404 -977 -1111 -1199 1558 1882 1519 905 249 1512 1410 2325 2990 368 1914 1193
4150A193j343M860K218k9j989J016l090J239N227J506N19J959m264n793j910k642
4134a323J982M506M256m312l41J208j573n291m324L223jj8l927L176P586r56p473
4117c602o65K270k885k888M497j073P69O81J568N304k260l068M423J112k309K38
4101B112m332k54j86M71j188m202J071O290o00k447p41O181K846j777j11j2953
4085i820j14J504L123N532r55m305l891O14N570K168l30m687l102J222k404j527
4069a1402N653M718L013K895J677k249l482o207n67L195o170j982L155k499M433
4054e819k362k121J366O597R807L46p371L25R79J604k17K360j916l817j772J127
4038h84k030p846k339P744L069o860L780N55O820O599o961K75R373j0938n139
$$ plain form
4150 1193 -150 4710 6928 6899 4910 5926 2836 4075 9302 10808 11327 13286 9022 3229 1319 -1323
4134 -1323 659 5165 9421 5109 4768 5976 4403 -888 -5212 -1989 -1990 -2008 -5935 -2759 4827 3871 -3602
4117 -3602 -4267 -1997 -4882 -7770 -3273 -4346 -3577 -2896 -1328 3976 1716 -1352 3071 4183 1874 2112
4101 2112 -2220 -2474 -2660 -2189 -3377 -7579 -6508 -218 -818 -3265 -4006 2175 5021 3244 3133 -9820
4085 -9820 -9934 -8430 -5307 225 -730 -5035 -8926 -8312 -2742 -574 -904 -5591 -8693 -7471 -9875 -11402
4069 -11402 -5749 -1031 1982 4877 6554 4305 823 -5384 -5951 -2756 -8926 -10908 -7753 -10252 -5819
4054 -5819 -8181 -10302 -8936 -2339 7468 7814 443 768 1747 3351 3134 5494 3578 -239 -2011 -884
4038 -884 -2914 -10760 -13099 -5355 -2286 -9146 -5366 -4811 2009 8608 1647 1922 11295 357 -4782
4023d782J091K924j469O694j157n878n012k360k14K931m914N530l206m25L750
4008f497P87M265K26j151J509k336j361L3P520K314n927L97R115M42m646k913
3992A777J663j248O25K839k928j160j679J51m547j583K908m645p82N017Q079l884
3976F03o266N214P365L44o062N442M64m853m725l312L38K290n201k449r85O787
3960e006R12j820K512N91J482J188J66p35m16j46P28o252L604N996Q931r32n879
3943D924K002k950p21k733j0346K599K886K734j948j538L222O02N91K506m797
3928b967l763j429N283P369o946m350M274r319j740N317N78J543r361m405Q223
3913a1693L425k532J591k418Q669K468L398q90p668n427l418J0507L851l335q9
$$ plain form
4023 -4782 -3691 -767 -2236 4458 3301 -2577 -7589 -9949 -10163 -7232 -12146 -6616 -9822 -10247 -6497
4008 -6497 -5710 -1445 -1219 -2370 -861 -3197 -4558 -4525 2995 5309 -618 -221 8894 9336 4690 1777
3992 1777 3440 2192 2817 5656 2728 1568 -111 40 -4507 -6090 -3182 -7827 -8609 -3592 4487 603
3976 603 -5663 -449 6916 7260 1198 6640 7104 2251 -2474 -5786 -5448 -3158 -8359 -10808 -11793 -5006
3960 -5006 -4094 -5914 -3402 -2811 -1329 -141 25 -710 -1126 -1272 -544 -6796 -3192 2804 11735 10803 4924
3943 4924 6926 3976 3255 522 -9824 -7225 -4339 -1605 -3553 -5091 -1869 -1267 -676 1830 -2967
3928 -2967 -6730 -8159 -2876 4493 -2453 -6803 -2529 -11848 -13588 -8271 -7693 -6150 -15511 -19916 -11693
3913 -11693 -8268 -10800 -9209 -11627 -2958 -490 2908 2018 -5650 -11077 -14495 -3988 -137 -3472 -3561
3898c561n166J041J0677J695l956j708k27j400j783N75j632K432Q504k75o635
3883a419j294j038n90N272n121M634l653l500L918N50M236J155o430q22m855N825
3867c132J008N623O015K947m471k859m518J389o074N148k652r178k254N552j4
3852g470n34O564R560j419k717L515M097J863J911o334n213J014n641k195M771
$$ plain form
3898 -3561 -8727 -7686 2991 4686 730 -978 -1205 -2605 -4388 -3813 -5445 -3013 5491 5216 -1419
3883 -1419 -2713 -3751 -4341 931 -4190 444 -3209 -6709 -2791 -2241 1995 3150 -3280 -4102 -8957 -3132
3867 -3132 -2124 3499 9514 12461 7990 5131 613 2002 -4072 1076 -1576 -10754 -13008 -7456 -7470
3852 -7470 -8004 -1440 8120 6701 3984 7499 11596 13459 15370 9036 3823 4837 -804 -2999 1772
$$ [...]
##END NTUPLES=NMR SPECTRUM
##END=
