##TITLE=Analysis number 325698
Compound Code cc 60609
Book Reference 486/96
Project Code adrs
Chemist Name simons
##JCAMPDX= 6.0         $$ Bruker NMR JCAMP-DX V2.0
##DATA TYPE= NMR SPECTRUM
##DATA CLASS= NTUPLES
##ORIGIN= Bruker BioSpin GmbH
##OWNER= nmr
$$ XWIN-NMR		Version 3.5
$$ Wed Jan 10 12:13:27 2007 GMT Standard Time (UT+0h)  MAYBRIDGE\nmr@NMR_250MHZ
##.OBSERVE FREQUENCY= 250.131544655141
##.OBSERVE NUCLEUS= ^1H
##.ACQUISITION MODE= SIMULTANEOUS (DQD)
##.ACQUISITION SCHEME= undefined
##.AVERAGES= 16
##.DIGITISER RES= 18
##SPECTROMETER/DATA SYSTEM= dpx250
##.PULSE SEQUENCE= zg30
##.SOLVENT NAME= CDCl3
##.SHIFT REFERENCE= (INTERNAL, CDCl3, 0, 16.4428)
##AUDIT TRAIL= $$ (NUMBER, WHEN, WHO, WHERE, WHAT)
$$ ##TITLE= Audit trail, XWIN-NMR		Version 3.5
$$ ##JCAMPDX= 5.01
$$ ##ORIGIN= Bruker BioSpin GmbH
$$ ##OWNER= nmr
$$ C:\u/data/dgb/nmr/ADRS/810/pdata/1/auditp.txt
$$ ##AUDIT TRAIL=  $$ (NUMBER, WHEN, WHO, WHERE, WHAT)
(   1,<2007-01-10 12:12:51.76 +000>,<MAYBRIDGE\nmr>,<NMR_250MHZ>,
      <created by zg, POWCHK disabled, PULCHK disabled
       configuration hash MD5:
       49 4B E0 1D 92 C2 6B 37 9F E6 65 BC 52 41 86 1D
       data hash MD5: 64K
       0E D7 34 AC 97 06 51 08 7D 8C AA 3A FC 29 D9 89>)
(   2,<2007-01-10 12:13:06.51 +000>,<MAYBRIDGE\nmr>,<NMR_250MHZ>,
      <Start of raw data processing
       ef LB = 0.3 FT_mod = 6 PKNL = 1 SI = 32K 
       data hash MD5: 32K
       62 C2 F5 93 9D 08 56 1E F1 E3 C2 44 8F EC 74 2B>)
(   3,<2007-01-10 12:13:08.88 +000>,<MAYBRIDGE\nmr>,<NMR_250MHZ>,
      <apk 
       data hash MD5: 32K
       A4 D2 22 A4 3D E8 F9 F1 2B BD AC C1 FC 74 52 5F>)
(   4,<2007-01-10 12:13:09.81 +000>,<MAYBRIDGE\nmr>,<NMR_250MHZ>,
      <abs ABSG = 5 
       data hash MD5: 32K
       1B 8F EE 67 63 86 A3 34 52 B1 A5 88 B8 B1 C8 8D>)
$$ ##END=
$$ 
$$ hash MD5
$$ 00 37 3C 12 43 64 3E 8C 90 51 38 28 2F CD D9 0C
##$RELAX= 
##$RELAX= 
##$RELAX= 
##$RELAX= 
##$RELAX= 
##$RELAX= 
##$RELAX= 
$$ Bruker specific parameters
$$ --------------------------
##$DU= <C:\u>
##$EXPNO= 810
##$NAME= <ADRS>
##$PROCNO= 1
##$TYPE= <nmr>
##$USER= <dgb>
##$AMP= (0..31)
100 100 100 100 100 100 100 100 100 100 100 100 100 100 100 100 100 100 
100 100 100 100 100 100 100 100 100 100 100 100 100 100 
##$AQSEQ= 0
##$AQ_mod= 3
##$AUNM= <au_zg>
##$AUTOPOS= <22 >
##$BF1= 250.13
##$BF2= 250.13
##$BF3= 250.13
##$BF4= 250.13
##$BF5= 500.13
##$BF6= 500.13
##$BF7= 500.13
##$BF8= 500.13
##$BYTORDA= 1
##$CFDGTYP= 0
##$CFRGTYP= 5
##$CHEMSTR= <none>
##$CNST= (0..31)
1 1 145 1 1 1 1 1 1 1 1 1 1 1 1 1 1 1 1 1 1 1 1 1 1 1 1 1 1 1 1 1 
##$CPDPRG= <>
##$CPDPRG1= <>
##$CPDPRG2= <>
##$CPDPRG3= <>
##$CPDPRG4= <mlev>
##$CPDPRG5= <mlev>
##$CPDPRG6= <mlev>
##$CPDPRG7= <mlev>
##$CPDPRG8= <mlev>
##$CPDPRGB= <>
##$CPDPRGT= <>
##$D= (0..31)
0 1 0 0 0 0 0 0 0 0.06 0 0 0 0 0 0 0.0002 0 0 0 0 0 0 0 0 0 0 0 0 0 0 
0 
##$DATE= 1168431170
##$DBL= (0..7)
120 120 120 120 120 120 120 120 
##$DBP= (0..7)
150 150 150 150 150 150 150 150 
##$DBP07= 0
##$DBPNAM0= <>
##$DBPNAM1= <>
$$ [...]
##$SUBNAM7= <"">
##$SUBNAM8= <"">
##$SUBNAM9= <"">
##$SW= 20.6930455092707
##$SWIBOX= (0..15)
0 0 3 0 0 0 0 0 0 0 0 0 0 0 0 0 
##$SW_h= 5175.983436853
##$TD= 65536
##$TD0= 1
##$TE= 294.16
##$TE2= 300
##$TE3= 300
##$TEG= 300
##$TL= (0..7)
0 120 120 120 120 120 120 120 
##$TP= (0..7)
150 150 150 150 150 150 150 150 
##$TP07= 0
##$TPNAME0= <>
##$TPNAME1= <>
##$TPNAME2= <>
##$TPNAME3= <>
##$TPNAME4= <>
##$TPNAME5= <>
##$TPNAME6= <>
##$TPNAME7= <>
##$TPOAL= (0..7)
0.5 0.5 0.5 0.5 0.5 0.5 0.5 0.5 
##$TPOFFS= (0..7)
0 0 0 0 0 0 0 0 
##$TUNHIN= 0
##$TUNHOUT= 0
##$TUNXOUT= 0
##$USERA1= <user>
##$USERA2= <user>
##$USERA3= <user>
##$USERA4= <user>
##$USERA5= <user>
##$V9= 5
##$VALIST= <valist>
##$VCLIST= <CCCCCCCCCCCCCCC>
##$VD= 0
##$VDLIST= <DDDDDDDDDDDDDDD>
##$VPLIST= <PPPPPPPPPPPPPPP>
##$VTLIST= <TTTTTTTTTTTTTTT>
##$WBST= 1024
##$WBSW= 4
##$XGAIN= (0..3)
0 0 0 0 
##$XL= 0
##$YL= 0
##$YMAX_a= 279213
##$YMIN_a= -541512
##$ZGOPTNS= <>
##$ZL1= 120
##$ZL2= 120
##$ZL3= 120
##$ZL4= 120
##$ABSF1= 16.44283
##$ABSF2= -4.250343
##$ABSG= 5
##$ABSL= 3
##$ALPHA= 0
##$AQORDER= 0
##$ASSFAC= 0
##$ASSFACI= 0
##$ASSFACX= 0
##$ASSWID= 0
##$AUNMP= <proc_1d>
##$AZFE= 0.1
##$AZFW= 0.1
##$BCFW= 0
##$BC_mod= 0
##$BYTORDP= 0
##$COROFFS= 0
##$CY= 12.5
##$DATMOD= 1
##$DC= 0
##$DFILT= <>
##$DTYPP= 0
##$F1P= 14.0000005364418
##$F2P= -0.99999901652339
##$FCOR= 0.5
##$FTSIZE= 32768
##$FT_mod= 6
##$GAMMA= 0
##$GB= 0
##$INTBC= 1
##$INTSCL= 1
##$ISEN= 128
##$LB= 0.3
##$LEV0= 0
##$LPBIN= 0
##$MAXI= 10000
##$MC2= 0
##$MEAN= 0
##$ME_mod= 0
##$MI= 0
##$NCOEF= 0
##$NC_proc= -3
##$NLEV= 6
##$NOISF1= 0
##$NOISF2= 0
##$NSP= 0
##$NTH_PI= 0
##$NZP= 0
##$OFFSET= 16.44283
##$PC= 1
##$PHC0= 226.7882
##$PHC1= 9.272012
##$PH_mod= 1
##$PKNL= yes
##$PPARMOD= 0
##$PSCAL= 4
##$PSIGN= 0
##$REVERSE= no
##$SF= 250.130019800383
##$SI= 32768
##$SIGF1= 0
##$SIGF2= 0
##$SINO= 400
##$SIOLD= 32768
##$SREGLST= <1H.CDCl3>
##$SSB= 0
##$STSI= 32768
##$STSR= 0
##$SW_p= 5175.98343685301
##$SYMM= 0
##$S_DEV= 0
##$TDeff= 65536
##$TDoff= 0
##$TI= <Analysis number 999999
Compound Code 99
Book Reference 9
Project Code 9>
##$TILT= no
##$TM1= 0
##$TM2= 0
##$TOPLEV= 0
##$USERP1= <user>
##$USERP2= <user>
##$USERP3= <user>
##$USERP4= <user>
##$USERP5= <user>
##$WDW= 1
##$XDIM= 32768
##$YMAX_p= 479211250
##$YMIN_p= -179011
$$ End of Bruker specific parameters
$$ ---------------------------------
##NTUPLES= NMR SPECTRUM
##VAR_NAME=  FREQUENCY,     SPECTRUM/REAL,   SPECTRUM/IMAG
##SYMBOL=    X,             R,               I
##VAR_TYPE=  INDEPENDENT,   DEPENDENT,       DEPENDENT
##VAR_FORM=  AFFN,          ASDF,            ASDF
##VAR_DIM=   32768,         32768,           32768
##UNITS=     HZ,            ARBITRARY UNITS, ARBITRARY UNITS
##FACTOR=    0.157963299565203, 1,           1
##FIRST=     4112.8451763815, 0,             0
##LAST=      -1063.13826047151, 0,           0
##MIN=       -1063.13826047151, -179011,     0
##MAX=       4112.8451763815, 479211250,     0
$$ Real data points
##PAGE= N=1
##DATA TABLE= (X++(R..R)), XYDATA
$$ [...]
$$ plain form
18735 3009698 2680206 2340783 2042655 1794757 1599550 1448611 1332661 1228778 1138965 1048594
18725 1048594 959136 886366 819020 778226 737645 714376 696995 647128 607585 574694 522428
18714 522428 475580 438603 422947 430658 436517 431343 418333 420675 426870 433345 440170 436969 419724
18701 419724 409199 399117 379097 362085 373663 391149 405011 410424 392607 364835 359811 353943
18689 353943 340012 338246 340455 343174 337900 336551 324338 306857 284586 278114 281077 277532 285394
18676 285394 309550 320690 331596 321700 311982 320948 325304 326746 330387 358011 371794 374445 355034
18663 355034 333044 320911 314889 309322 315661 313754 325718 346272 344686 321946 305035 299718 276063
18650 276063 242571 234064 238877 218640 209265 207578 213474 197519 189936 191644 201455 208576 206491
$$ packed form
18735C009698l29492l39423k98128k47898j95207j50939j15950j03883q9813r0371
18725A048594q9458p2770o7346m0794m0581k3269j7381m9867l9543l2891n2266
18714E22428m6848l6977j5656P711N859n174j3010K342O195O475O825l201j7245
18701D19724j0525j0082k0020j7012J1578J7486J3862N413j7817k7772n024n868
18689C53943j3931j766K209K719n274j349j2213j7481k2271o472K963l545P862
18676B85394K4156J1140J0906r896r718Q966M356J442L641K7624J3783K651j9411
18663C55034k1990j2133o022n567O339j907J1964K0554j586k2740j6911n317k3655
18650B76063l3492q507M813k0237r375j687N896j5955p583J708R811P121k085
$$ plain form
18637 206491 208517 192805 176689 177217 187828 189627 210160 236977 236560 237470 232806 248873 264307
18624 264307 266071 273056 281652 289593 285748 284461 285988 288333 295857 295457 289120 283087 263372 239534
18610 239534 225550 216311 205759 193369 178958 167929 169771 167786 171232 168627 170616 161805 145674
18597 145674 136646 131471 116834 119241 122153 108418 102458 91171 85260 91224 95335 102288 110024
18584 110024 110762 107740 106967 104890 107620 103217 107734 127765 133216 140353 136182 138173 123915 105269
18570 105269 112126 110837 108860 116834 110952 98428 88246 86422 76900 87406 85662 93772 104844
18557 104844 114099 112541 100261 95629 94655 86127 89893 99112 108845 111392 108416 117313 122750 110999
18543 110999 107869 114520 108273 106124 128095 149191 140774 111767 103844 108763 118183 139436 146936
$$ packed form
18637B06491K026j5712j6116N28J0611J799K0533K6817m17R10m664J6067J5434
18624B64307J764O985Q596P941l845j287J527K345P524m00o337o033j9715k3838
18610B39534j3984r239j0552j2390j4411j1029J842j985L446k605J989q811j6131
18597A45674r028n175j4637K407K912j3735n960j1287n911N964M111O953P736
18584A10024P38l022p73k077K730m403M517K0031N451P137m171J991j4258j8646
18570A05269O857j289j977P974n882j2524j0182j824r522J0506j744Q110J1072
18557A04844R255j558j2280m632r74q528L766R219R733K547k976Q897N437j1751
18543A10999l130O651o247k149K1971K1096q417k9007p923M919R420K1253P500
$$ plain form
18530 146936 153696 155214 147965 141279 134267 131281 152288 162104 156651 151360 153364 166701 179406
18517 179406 177034 164768 181007 188763 189254 199972 199558 199413 194625 180397 181379 176814 171345 175075
18503 175075 176021 169342 173110 173994 181559 178964 192967 198522 205111 219482 223483 218359 218257 213578
18489 213578 217359 225033 232021 242529 270832 308688 325178 342647 374552 408507 459839 523372
18477 523372 621409 759738 965405 1320220 1817098 2384126 2794279 2788979 2493695 2169717
18467 2169717 1826779 1504513 1303904 1240076 1295195 1514420 1918165 2432040 2845955 2852139
18457 2852139 2502951 2106321 1704788 1307376 993705 781032 630711 557892 502942 461225
18447 461225 422551 389345 375986 378886 371040 348393 334572 335817 327596 329531 337321 345497 344250
$$ packed form
18530A46936O760J518p249o686p012k986K1007R816n453n291K004J3337J2705
18517A79406k372j2266J6239P756M91J0718m14j45m788j4228R82m565n469L730
18503A75075R46o679L768Q84P565k595J4003N555O589J4371M001n124j02m679
18489B13578L781P674O988J0508K8303L7856J6490J7469L1905L3955N1332O3533
18477E23372R8037J38329K05667L54815M96878N67028M10153n300k95284l23978
18467B169717l42938l22266k00609o3828N5119K19225M03745N13875M13915O184
18457B852139l49188l96630m01533l97412l13671k12673j50321p2819n4950m1717
18447D61225l8674l3206j3359K900p846k2647j3821J245q221J935P790Q176j247
$$ plain form
18434 344250 354202 371469 399559 416387 436889 453586 470750 489289 499978 515124 511765 515945
18422 515945 520859 521641 522776 522958 517158 501341 476505 442295 433853 433606 433075 439622 438045 436795
18408 436795 433684 458256 504407 558309 616853 663868 679801 648679 589157 528011 472528 437736
18396 437736 403804 375675 358566 340741 334093 340088 360990 376829 386420 390151 378999 366888
18384 366888 370682 362823 362760 377311 377240 365947 352678 341070 349448 354717 350441 344363 337889 349291
18370 349291 359022 383421 412189 445909 465778 484196 508426 530373 580912 664947 778345
18359 778345 855392 846044 800472 794607 853681 995219 1219745 1458890 1620384 1632073 1484131
18348 1484131 1266196 1077186 968934 937040 973981 1037690 1079020 1073716 1075421 1098390 1133535
$$ packed form
18434C44250R952J7267K8090J6828K0502J6697J7164J8539J0689J5146l359M180
18422E15945M914P82J135J82n800j5817k4836l4210q442k47n31O547j577j250
18408D36795l111K4572M6151N3902N8544M7015J5933l1122n9522o1146n5483l4792
18396D37736l3932k8129j7109j7825o648N995K0902J5839R591L731j1152j2111
18384C66888L794p859o3J4551p1j1293j3269j1608Q378N269m276o078o474J1402
18370C49291R731K4399K8768L3720J9869J8418K4230K1947N0539Q4035J13398
18359G78345P7047r348m5572n865N9074J41538K24526K39145J61494J1689j47942
18348A484131k17935j89010j08252l1894L6941O3709M1330n304J705K2969L5145
$$ plain form
18337 1133535 1182293 1239110 1283436 1296552 1288340 1291872 1339926 1413437 1532203 1710607 1921707
18326 1921707 2218176 2638943 3200431 3980035 5104081 6790596 9298231 12662809 16424095
18317 16424095 19704468 21588693 22181012 22010055 20934925 18476728 15152411 12088757
18309 12088757 9967861 8805267 8073243 7305523 6522444 5945895 5659675 5601871 5681875
18300 5681875 5872683 6149108 6404947 6531404 6648385 6863832 7015989 6947531 6776754 6701939
18290 6701939 6746867 6806108 6869793 6933655 6949245 6973027 7170503 7537705 7897544 8155815
18280 8155815 8450983 8988717 9815897 10960983 12612324 15164529 19208900 25654174 35630868
18271 35630868 49853257 67538391 86124939 102330689 113708400 117035361 112284445
$$ packed form
18337A133535M8758N6817M4326J3116q212L532M8054P3511J18766J78404K11100
18326A921707K96469M20767N61488P79604J124046J686515K507635L364578L761286
18317A6424095L280373J884225N92319j70957j075130k458197l324317l063654
18309A2088757k120896j162594p32024p67720p83079n76549k86220n7804Q0004
18300E681875J90808K76425K55839J26457J16981K15447J52157o8458j70777p4815
18290F701939M4928N9241O3685O3862J5590K3782J97476L67202L59839K58271
18280H155815K95168N37734Q27180J145086J651341K552205M044371O445274R976694
18271C5630868J4222389J7685134J8586548J6205750J1377711L326961m750916
$$ plain form
18264 112284445 98648590 79083844 60765275 46922474 38550097 34779006 34310470
18257 34310470 36339055 41142481 48805185 58500398 68604558 74970186 75009773 69975089
18249 69975089 59155248 47085561 37085285 29789329 24991501 21958182 19744070 17752074
18241 17752074 15832549 13717021 11762900 10206126 9039669 8232389 7676139 7310804
18233 7310804 7084475 6986310 7024175 7234884 7663243 8420994 9656277 11636600 14757803
18224 14757803 19415674 25550447 31954950 36611204 38288271 38152972 37211641 34729466
18216 34729466 29642019 23189457 17333858 13081278 10345689 8620654 7552090 6897011
18208 6897011 6514997 6359096 6434747 6742159 7147486 7415717 7396537 7244147 7084192 6785108
$$ packed form
18264A12284445j3635855j9564746j8318569j3842801q372377l771091m68536
18257C4310470K028585M803426P662704R695213J0104160O365628L9587n034684
18249F9975089j0819841j2069687j0000276p295956m797828l033319k214112j991996
18241A7752074j919525k115528j954121j556774j166457q07280n56250l65335
18233G310804k26329r8165L7865K10709M28359P57751J235283J980323L121203
18224A4757803M657871O134773O404503M656254J677067j35299r41331k482175
18216C4729466n087447o452562n855599m252580k735589j725035j068564o55079
18208F897011l82014j55901P5651L07412M05327K68231j9180j52390j59955k99084
$$ plain form
18198 6785108 6199688 5453256 4797077 4370760 4159697 4102133 4157489 4288990 4477705 4682322
18188 4682322 4792641 4796425 4754354 4723898 4732342 4802082 4915558 5100910 5436328 5951836 6688662
18177 6688662 7746738 9262629 11412764 14173054 16914070 19093589 21426923 24367411
18169 24367411 26373179 26148703 25781604 27219153 29891350 32524343 34907440 37719604
18161 37719604 40901610 42994202 42815341 41264996 38525718 35293841 32771552 31103821
18153 31103821 29337187 27539654 27007217 27491010 26572749 23349390 20175282 17876563
18145 17876563 15351308 12335863 9727583 7919899 6694461 5827265 5212066 4786091
18137 4786091 4490900 4273096 4110983 3986542 3919205 3908790 3977580 4165023 4508383 5100952
$$ packed form
18198F785108n85420p46432o56179m26317k11063n7564N5356J31501J88715K04617
18188D682322J10319L784m2071l0456Q444O9740J13476J85352L35418N15508P36826
18177F688662J058076J515891K150135K760290K741016K179519K333334K940488
18169B4367411K005768k24476l67099J437549K672197K632993K383097K812164
18161C7719604L182006K092592j78861j550345k739278l231877k522289j667731
18153C1103821j766634j797533n32437M83793r18261l223359l174108k298719
18145A7876563k525255l015445k608280j807684j225438q67196o15199m25975
18137D786091k95191k17804j62113j24441o7337j0415O8790J87443L43360N92569
$$ plain form
18127 5100952 6050416 7343242 8719133 9821813 10939022 12442777 13618474 13548729 13158062
18118 13158062 13626890 14741819 15890795 17093103 18740480 20884795 23516710 26721041
18110 26721041 31205955 37620954 44344089 41549913 30346457 22333221 17868385 15590772
18102 15590772 14661194 13666431 11825845 10000547 8652102 7345155 5873160 4589776
18094 4589776 3673030 3036028 2589846 2265900 2016238 1812919 1633838 1473936 1328209
18085 1328209 1223143 1150776 1082771 1014362 961692 919303 857098 802886 765437 724185 688045
18074 688045 660335 633954 605970 583560 543475 508896 484922 470873 453829 423140 403763
18063 403763 385200 357471 347438 332138 302063 282477 294136 313530 321257 336171 356602 354979
$$ packed form
18127E100952R49464J292826J375891J102680J117209J503755J175697o9745l90667
18118A3158062M68828J114929J148976J202308J647377K144315K631915L204331
18110B6721041M484914O414999O723135k794176j1203456q013236m464836k277613
18102A5590772r29578r94763j840586j825298j348445j306947j471995j283384
18094D589776r16746o37002m46182l23946k49662k03319j79081j59902j45727
18085A328209j05066p2367o8005o8409n2670m2389o2205n4212l7449m1252l6140
18074F88045k7710k6381k7984k2410m0085l4579k3974j4049j7044l0689j9377
18063D03763j8563k7729j0033j5300l0075j9586J1659J9394P727J4914K0431j623
$$ plain form
18051 354979 353693 361731 372201 364068 350206 345338 344527 348322 361488 369324 382143 394760 399109
18038 399109 402317 394408 370262 367998 352025 333023 328044 331287 340250 329946 313982 280623 268882
18025 268882 266767 261506 254323 237423 223699 207080 203984 204305 185848 173509 177108 186230 195658
18012 195658 192631 191421 198764 199353 197206 192391 200113 208525 212255 220911 218688 213261 213701 220304 237377
17997 237377 237082 236758 237833 245589 243453 233925 238382 255014 251439 234984 226249 213244 216801 215905
17983 215905 188921 188908 198514 194774 167086 150523 136796 124976 124548 118852 131354 139240 143979
17970 143979 145589 135162 127354 129118 124310 123126 112805 108288 104381 101266 71157 66538 77105
17957 77105 84453 79788 70992 72920 74746 91444 98602 102248 96062 75841 64486 53321 50310
$$ packed form
18051C54979j286Q038J0470q133j3862m868q11L795J3166P836J2819J2617M349
18038C99109L208p909k4146k264j5973j9002m979L243Q963j0304j5964l3359j1741
18025B68882k115n261p183j6900j3724j6619l096L21j8457j2339L599R122R428
18012A95658l027j210P343N89k147m815P722Q412L730Q656k223n427M40O603J7073
17997B37377k95l24J075P756k136r528M457J6632l575j6455q735j3005L557q96
17983B15905k6984j3R606l740k7688j6563j3727j1820m28n696J2502P886M739
17970A43979J610j0427p808J764m808j184j0321m517l907l115l0109m619J0567
17957G7105P348m665q796J928J826J6698P158L646o186k0221j1355j1165l011
$$ plain form
17944 50310 51865 56427 56699 66813 57057 39314 40733 56688 68076 82955 75333 53706 51776
17931 51776 65947 72805 77426 73918 67713 74095 68069 70051 62101 57199 76797 73440 63518 64699
17917 64699 64973 56081 48635 40405 28981 38684 43432 45603 61820 61452 50316 57484 59854 58902
17903 58902 59668 62507 67740 69545 66011 62466 61394 81759 90928 95560 82007 64898 67768 74819
17889 74819 76479 58950 58812 67872 84904 78057 75532 86423 92164 86894 82306 75581 74886 68668
17875 68668 59512 60798 52569 51912 58277 69340 73129 69912 66285 69080 85630 72534 69816 55935
17861 55935 49484 45351 42971 48576 65291 71324 68071 53786 40834 37745 33474 47693 44817
17848 44817 40648 34915 47811 55337 46601 43235 40855 40620 31319 37465 52464 50489 51478 56836
$$ packed form
17944E0310J555M562K72J0114r756j7743J419J5955J1388J4879p622k1627j930
17931E1776J4171O858M621l508o205O382o026J982p950m902J9598l357r922J181
17917F4699K74q892p446q230j1424R703M748K171J6217l68j1136P168K370r52
17903E8902P66K839N233J805l534l545j072K0365R169M632j3553j7109K870P051
17889G4819J660j7529j38R060J7032o847k525J0891N741n270m588o725o95o218
17875F8668r156J286q229o57O365J1063L789l217l627K795J6550j3096k718j3881
17861E5935o451m133k380N605J6715O033l253j4285j2952l089m271J4219k876
17848D4817m169n733J2896P526q736l366k380k35r301O146J4999j975R89N358
$$ plain form
17834 56836 68106 71874 71390 64685 56852 67083 58454 55495 44084 36019 35209 45922 56694 69964
17820 69964 78766 72030 64951 65625 59846 52694 60128 68173 60665 51035 51517 77075 104555 120181
17806 120181 156138 190088 219854 228940 233321 231042 210865 180734 141090 113263 99693 87382
17794 87382 77932 75204 69343 48722 33086 34119 46022 39073 36881 55566 63796 55799 54274
17781 54274 55754 69627 72005 75769 80143 81386 75174 56827 47740 44070 43194 38439 31880 27918
17767 27918 23365 23902 24440 33976 52133 71451 82441 90293 114109 166352 226269 262152 291464
17754 291464 303697 291227 273044 242033 204930 169550 131729 111852 89035 72842 69184 63418
17742 63418 59882 39315 36311 46722 53929 57644 54879 57390 54408 39793 30077 31596 21005
$$ packed form
17834E6836J1270L768m84o705p833J0231q629k959j1411q065q10J0713J0772J3270
17820F9964Q802o736p079O74n779p152P434Q045p508r630M82K5558K7480J5626
17806A20181L5957L3950K9766R086M381k279k0177l0131l9644k7827j3570j2311
17794H7382r450k728n861k0621j5636J033J1903o949k192J8685Q230p997j525
17781E4274J480J3873K378L764M374J243o212j8347r087l670q76m755o559l962
17767B7918m553N37N38R536J8157J9318J0990P852K3816N2243N9917L5883K9312
17754B91464J2233j2470j8183l1011l7103l5380l7821j9877k2817j6193l658n766
17742F3418l536k0567l004J0411P207L715k765K511k982j4615r716J519j0591
$$ plain form
17729 21005 23895 37812 36517 27459 33169 27111 25426 23136 19721 15697 11432 18795 37091 25633
17715 25633 24302 28870 33377 56111 71621 83957 105797 115685 127275 131941 152334 150500 125190
17702 125190 111487 81093 59216 50034 41042 36968 23757 29317 51854 69367 66541 55184
17690 55184 49545 52839 66132 66063 72053 83161 88230 112051 121520 128662 155385 191314 262001
17677 262001 316134 359790 392194 376325 338758 301874 277496 268890 263417 284632 290895 300113
17665 300113 331717 374675 415245 447386 462827 469283 437779 398361 351000 300592 262113 242230
17653 242230 215246 205020 192664 167776 153251 128600 126750 126971 109497 87445 59957 54842
17641 54842 51161 57004 46794 40122 24192 35475 53382 43646 36997 37414 28521 26080 28235 34231
$$ packed form
17729B1005K890J3917j295r058N710o058j685k290l415m024m265P363J8296j1458
17715B5633j331M568M507K2734J5510J2336K1840R888J1590M666K0393j834k5310
17702A25190j3703l0394k1877r182q992m074j3211N560K2537J7513k826j1357
17690E5184n639L294J3293o9N990J1108N069K3821R469P142K6723L5929P0687
17677B62001N4133M3656L2404j5869l7567l6884k4378q606n473K1215O263R218
17665C00113L1604M2958M0570L2141J5441O456l1504l9418m7361n0408l8479j9883
17653B42230k6984j0226j2356k4888j4525k4651j850K21j7474k2052k7488n115
17641E4842l681N843j0210o672j5930J1283J7907r736o649M17q893k441K155N996
$$ plain form
17627 34231 30795 30870 50216 70778 82365 96886 112437 128302 130906 115103 107717 127833 147226
17614 147226 157550 159152 157998 156964 159220 157181 147703 132113 127897 125736 124359 116619 115566 113929
17600 113929 109896 103197 81467 62345 48321 47626 48116 36456 25375 32820 46123 36518 23287
17587 23287 25795 18344 33475 44183 41526 16178 10019 17242 20821 25490 32192 19409 17976
17574 17976 24862 36711 36931 34894 19699 2924 1708 3457 5876 9296 2958 1723 10668 18369
17560 18369 20182 21293 22966 16023 2809 -200 17071 30455 35949 34505 35423 28424 20986 10108
17546 10108 -6166 1529 16273 3833 7680 6976 10974 16702 15512 26894 34977 34888 31930 36193
17532 36193 34797 18798 20558 42608 60099 68507 59930 49460 44275 44215 46648 41200 32553 18782
$$ packed form
17627C4231l436P5J9346K0562J1587J4521J5551J5865K604j5803p386K0116J9393
17614A47226J0324J602j154j034K256k039r478j5590m216k161j377p740j053j637
17600A13929m033o699k1730j9122j4024o95M90j1660j1081P445J3303r605j3231
17587B3287K508p451J5131J0708k657k5348o159P223L579M669O702j2783j433
17574A7976O886J1849K20k037j5195j6775j216J749K419L420o338j235Q945P701
17560A8369J813J111J673o943j3214l009J7271J3384N494j444R18o999p438j0878
17546A0108j6274P695J4744j2440L847p04L998N728j190J1382Q083q9k958M263
17532C6193j396j5999J760K2050J7491Q408q577j0470n185o0K433n448q647j3771
$$ plain form
17518 18782 19859 38647 55054 65159 78212 78136 77019 78901 80328 94963 145198 216273 295266
17505 295266 381422 449497 404107 300431 231632 181890 145102 124744 126985 126134 139737 168636
17493 168636 199050 251301 323974 416851 428395 336518 226409 148987 109361 86320 70150
17482 70150 40499 19513 23095 33939 32961 30237 15668 335 7932 17409 14131 17895 16428
17469 16428 4789 -6763 -6979 -2141 5943 7070 4371 -6751 -6469 8598 19400 10693 -3280
17456 -3280 -6258 9741 4964 7596 9397 4532 3279 12905 19426 25927 36969 45628 52774 72055
17442 72055 113078 148793 135389 88087 47632 18880 12156 11993 15515 26604 34566 42991 17040
17429 17040 9056 10318 8774 -1132 9134 13004 3401 -1483 7870 17950 11743 14879 7539 812
$$ packed form
17518A8782J077J8788J6407J0105J3053p6j117J882J427J4635N0235P1075P8993
17505B95266Q6156O8075m5390j03676o8799m9742l6788k0358K241q51J3603K8899
17493A68636L0414N2251P2673R2877J1544r1877j10109p7422l9626k3041j6170
17482G0150k9651k0986L582J0844r78k724j4569j5333P597R477l278L764j467
17469A6428j1639j1552k16M838Q084J127k699j1122K82J5067J0802q707j3973
17456c280k978J5999m777K632J801m865j253R626O521O501J1042Q659P146J9281
17442G2055M1023L5715j3404m7302m0455k8752o724j63L522J1089P962Q425k5951
17429A7040p984J262j544r906J0266L870r603m884R353J0080o207L136p340o727
$$ plain form
17415 812 -10368 -5747 1035 -5524 1298 13089 27512 16773 9997 18947 18031 19986 9349 -8029
17401 -8029 -16879 -9873 5115 14536 15087 20290 15625 22759 22316 19674 23483 26324 11693 -10670
17387 -10670 -16021 -11466 -3781 12883 33187 38660 20517 4679 -4763 -541 11846 26444 14687
17374 14687 -439 6118 16498 10007 5098 10588 7709 -2294 4020 8605 15737 20062 7395
17361 7395 -6722 -9130 3299 3575 3589 -888 1552 4019 -662 -4871 -1123 -1099 -2471 -15625 -13292
17346 -13292 -11436 -5317 2013 2529 9577 16324 2703 -2324 4552 7674 23054 36758 23648 4729
17332 4729 -4761 -3998 4289 13262 28670 36123 29760 17067 11528 16675 16725 20569 30624 26461 7345
17317 7345 -3292 -15108 -12789 -10577 -15259 -20692 -16076 -8497 -8227 -2711 4322 -4588 7123 13345
$$ packed form
17415H12j1180M621O782o559O822J1791J4423j0739o776Q950r16J955j0637j7378
17401h029q850P006J4988R421N51N203m665P134m43k642L809K841j4631k2363
17387a0670n351M555P685J6664K0304N473j8143j5838r442M222J2387J4598j1757
17374A4687j5126O557J0380o491m909N490k879j0003O314M585P132M325j2667
17361G395j4117k408J2429K76J4m477K440K467m681m209L748K4j372j3154K333
17346a3292J856O119P330N16P048O747j3621n027O876L122J5380J3704j3110j8919
17332D729r490P63Q287Q973J5408P453o363j2693n539N147N0L844J0055m163j9116
17317G345j0637j1816K319K212m682n433M616P579K70N516P033q910J1711O222
$$ plain form
17303 13345 23342 18406 3002 6331 11904 15993 17116 25689 20076 26224 14880 460 5451 9828
17289 9828 21765 27268 28636 22988 24292 29337 24135 23872 6799 788 -734 22331 36782 30891
17275 30891 20170 2124 10277 6644 8590 10181 11674 15058 17302 24499 14230 14245 33091 27912
17261 27912 12795 18935 30215 14115 1613 4110 2704 6370 -11104 -25350 -24125 -18092 -12827
17248 -12827 -14244 -17213 -19465 -23875 -21190 -7783 16291 6123 -7255 -3802 3997 7129 4178
17235 4178 2835 4610 5322 -917 491 1623 1163 -386 89 4434 10747 8177 863 -16488 -36906
17220 -36906 -7428 24590 28451 22160 26903 43479 34688 22206 29463 29827 7321 796 10356
17207 10356 14639 7644 15762 25291 33899 30909 28342 34305 50615 60223 59514 66968 56779 38892
$$ packed form
17303A3345R997m936j5404L329N573M089J123Q573n613O148j1344j4420M991M377
17289I828J1937N503J368n648J304N045n202k63j7073o011j522K3065J4451n891
17275C0891j0721j8046Q153l633J946J591J493L384K244P197j0269J5J8846n179
17261B7912j5117O140J1280j6100j2502K497j406L666j7474j4246J225O033N265
17248a2827j417k969k252m410K685J3407K4074j0168j3378L453P799L132k951
17235D178j343J775P12o239J408J132m60j549M75M345O313k570p314j7351k0418
17220c6906K9478L2018L861o291M743J6576q791j2482P257L64k2506o525R560
17207A0356M283o995Q118R529Q608k990k567N963J6310R608p09P454j0189j7887
$$ plain form
17193 38892 30770 34295 37881 30768 25620 23727 20741 35524 47166 50213 39962 31745 29858 19264
17179 19264 20008 37142 36278 25145 23898 26157 29287 25253 24341 26414 16153 14204 14059 13226 19413
17164 19413 9814 13576 25565 24156 28815 35575 25186 20920 21422 18350 23813 19495 12789 12032
17150 12032 25920 39980 64505 67406 65521 57451 56352 43929 44311 49271 45352 30260 19600
17137 19600 17936 19989 34431 48673 48129 39678 25478 23166 28519 23373 13426 28063 34883 26056
17123 26056 22319 24383 30524 53557 68768 79085 84408 75524 64529 54292 50562 51786 54611
17110 54611 58577 53390 63636 74399 72881 75243 54667 6208 -3541 10668 13709 15169 24972
17097 24972 34818 36747 22395 31273 46343 54307 54210 27063 3803 -4407 7554 26985 62102
$$ packed form
17193C8892q122L525L586p113n148j893k986J4783J1642L047j0251q217j887j0594
17179A9264P44J7134q64j1133j247K259L130m034r12K073j0261j949j45q33O187
17164A9413r599L762J1989j409M659O760j0389m266N02l072N463m318o706p57
17150A2032J3888J4060K4525K901j885q070j099j2423L82M960l919j5092j0660
17137A9600j664K053J4442J4242n44q451j4200k312N353n146r947J4637O820q827
17123B6056l737K064O141K3033J5211J0317N323q884j0995j0237l730J224K825
17110E4611L966n187J0246J0763j518K362k0576m8459r749J4209L041J460R803
17097B4972R846J929j4352Q878J5070P964r7k7147k3260q210J1961J9431L5117
$$ plain form
17084 62102 85534 81432 76848 61564 53811 53135 62162 73343 84820 74952 65309 46702 54952
17071 54952 77920 91124 106965 98643 82300 75483 80853 77359 79130 88931 80678 53620 28614
17058 28614 24806 34968 52635 59864 75973 73450 71045 77377 71896 67829 66766 69043 71694 78682
17044 78682 69758 74823 73755 82256 77908 74843 80707 85369 94083 91078 90905 85335 87106 87429 93315
17029 93315 111600 110225 115434 133624 132920 130647 119138 123026 143337 156413 173263 175365 189325
17016 189325 185914 196580 208454 214257 229903 236234 231964 229261 243202 262050 287137 306113
17004 306113 327097 344250 355388 359358 366920 371892 372659 399520 438509 482021 499823 509561 541051
16991 541051 574839 624616 680415 722225 757160 801396 866441 975677 1170631 1464493 1920618
$$ packed form
17084F2102K3432m102m584j5284p753o76R027J1181J1477r868r643j8607Q250
17071E4952K2968J3204J5841q322j6343o817N370l494J771R801q253k7058k5006
17058B8614l808J0162J7667P229J6109k523k405O332n481m067j063K277K651O988
17044G8682q924N065j068Q501m348l065N864M662Q714l005j73n570J771L23N886
17029I3315J8285j375N209J8190p04k273j1509L888K0311J3076J6850K102J3960
17016A89325l411J0666J1874N803J5646O331m270k703J3941J8848K5087J8976
17004C06113K0984J7153J1138L970P562M972P67K6861L8989M3512J7802R738L1490
16991E41051L3788M9777N5799M1810L4935M4236O5045J09236J94954K93862M56125
$$ plain form
16980 1920618 2640919 3751328 5414531 7576227 9312741 8781137 6576364 4826886
16972 4826886 3881072 3390633 3165157 3182896 3444841 3951855 4747499 5861349 7500057
16963 7500057 9884006 12573003 13908366 13154419 12665433 14092789 18016066 25313626
16955 25313626 37593481 56278602 78516856 89900624 76544412 53074071 36100356
16948 36100356 26338181 20911520 17923872 16581478 16812160 18961792 23870828 32900735
16940 32900735 47699316 68158166 86125385 83781499 61755275 40602506 27253881
16933 27253881 19372587 14535209 11324164 9035685 7372506 6180331 5340804 4776657
16925 4776657 4399517 4121639 3866226 3579942 3239430 2844274 2515668 2277279 2078380
$$ packed form
16980A920618P20301J110409J663203K161696J736514n31604k204773j749478
16972D826886r45814m90439k25476J7739K61945N07014P95644J113850J638708
16963G500057K383949K688997J335363p53947m88986J427356L923277P297560
16955B5313626J2279855J8685121K2238254J1383768j3356212k3470341j6973715
16948C6100356r762175n426661k987648j342394K30682K149632M909036R029907
16940C2900735J4798581K0458850J7967219k343886k2026224k1152769j3348625
16933B7253881p881294m837378l211045k288479j663179j192175q39527n64147
16925D776657l77140k77878k55413k86284l40512l95156l28606k38389j98899
$$ plain form
16916 2078380 1874300 1719119 1613257 1582836 1562443 1540161 1537654 1509747 1433941 1298987 1157199
16905 1157199 1047276 950009 888815 838292 788758 737224 702675 699375 696644 682241 665186
16894 665186 658634 648863 633647 610612 595084 574007 560935 560148 563446 555762 552971 543693 552491
16881 552491 570472 603652 650237 711265 782769 877075 988135 1119468 1275478 1429842 1544367
16870 1544367 1580960 1538142 1422624 1281907 1147480 1042415 976090 946997 964789 1014480
16860 1014480 1093485 1203737 1322129 1422935 1454289 1404203 1283476 1125588 972292 830758
16850 830758 696594 581665 495884 436810 404465 375051 340492 307571 273484 262386 250401
16839 250401 239095 239055 236257 221823 211278 197653 180015 184055 180863 168901 160513 147453 151842
$$ packed form
16916B078380k04080j55181j05862l0421k0393k2282k507k7907p5806j34954j41788
16905A157199j09923r7267o1194n0523m9534n1534l4549l300k731j4403j7055
16894F65186o552r771j5216k3035j5528k1077j3072p87L298p684k791r278Q798
16881E52491J7981L3180M6585O1028P1504R4306J11060J31333J56010J54364J14525
16870A544367L6593m2818j15518j40717j34427j05065o6325k9093J7792M9691
16860A014480P9005J10252J18392J00806L1354n0086j20727j57888j53296j41534
16850H30758j34164j14929q5781n9074l2345k9414l4559l2921l4087j1098j1985
16839B50401j1306m0k798j4434j0545j3625j7638M040l192j1962q388j3060M389
$$ plain form
16826 151842 161786 157104 158738 148935 120490 93062 74160 82868 101365 106668 109475 119392 120783
16813 120783 113626 95307 96126 93777 97199 84055 62833 53758 52039 71669 82817 100507 91405
16800 91405 47667 12392 13246 49768 62595 51199 51864 49599 61930 60414 69647 85641 84336
16787 84336 69660 39989 23740 32684 32510 34138 41992 51599 55887 48337 46764 41946 28304 19837
16773 19837 16848 24281 35458 32353 27043 18932 9958 11727 27289 22284 26216 37242 51228
16760 51228 43522 35410 33518 20347 7757 9749 14806 26359 20618 6126 4850 6769 5659
16747 5659 -4281 -2614 22079 25997 18955 7351 3763 3869 12451 24450 18213 13190 -4239 -12758
16733 -12758 -5819 9631 13181 6128 -6754 -6197 -420 6933 -1000 6939 16895 6371 9132 7263
$$ packed form
16826A51842R944m682J634r803k8445k7428j8902Q708J8497N303K807R917J391
16813A20783p157j8319Q19k349L422j3144k1222r075j719J9630J1148J7690r102
16800I1405m3738l5275Q54L6522J2827j1396O65k265J2331j516R233J5994j305
16787H4336j4676k9671j6249Q944j74J628P854R607M288p550j573m818j3642q467
16773A9837k989P433J1177l105n310q111q974J769J5562n005L932J1026J3986
16760E1228p706q112j892j3171j2590J992N057J1553n741j4492j276J919j110
16747E659r940J667K4693L918p042j1604l588J06Q582J1999o237n023j7429q519
16733a2758O939J5450L550p053j2882N57N777P353p933P939R956j0524K761j869
$$ plain form
16719 7263 -1343 1701 4252 2626 2376 15917 24116 24788 14566 19571 6982 5803 1438 17305
16705 17305 12802 761 3415 12442 20272 37604 38188 18860 6943 24900 38344 30981 30536
16692 30536 17268 15774 10411 7428 -5043 -479 11772 22876 23426 34079 26414 17300 13286
16679 13286 21928 10683 -4950 5371 22184 30356 26514 27562 38210 37341 39242 41667 27646
16666 27646 1512 -5874 -8658 -9579 7754 11817 18113 29769 24707 28508 28973 29468 38490 43458
16652 43458 35186 31707 21593 5529 -7236 -13318 -3961 6828 14537 6552 15799 21638 34450
16639 34450 45279 27757 4796 -39 -4720 -5014 -2459 10325 13056 4084 -1600 -6181 -5625 -840
16625 -840 7560 16508 7428 4315 1156 -8288 -12994 -18689 -11604 -4008 3416 12304 23386 22111 23494
$$ packed form
16719G263q606L044K551j626k50J3541Q199O72j0222N005j2589j179m365J5867
16705A7305m503j2041K654R027P830J7332N84j9328j1917J7957J3444p363m45
16692C0536j3268j494n363k983j2471M564J2251J1104N50J0653p665r114m014
16679A3286Q642j1245j5633J0321J6813Q172l842J048J0648q69J901K425j4021
16666B7646k6134p386k784r21J7333M063O296J1656n062L801M65M95R022M968
16652D3458q272l479j0114j6064j2765o082R357J0789P709p985R247N839J2812
16639C4450J0829j7522k2961m835m681k94K555J2784K731q972n684m581N56M785
16625h40Q400Q948r080l113l159r444m706n695P085P596P424Q888J1082j275J383
$$ plain form
16610 23494 16133 10926 5047 6094 25439 22969 14843 25448 24826 25141 42655 50304 57817 72901
16596 72901 97477 134735 205370 320659 475483 677334 777894 656964 455179 321521
16586 321521 241688 205874 204788 237711 286780 378371 508351 709516 838819 765751 583349
16575 583349 434212 341259 277284 238402 222866 218635 232425 246547 284191 350717 464762
16564 464762 655969 940131 1361469 1945004 2545161 2705311 2203064 1534281 1083442 839808
16554 839808 730901 717607 797389 999957 1359285 1900577 2493084 2692592 2212346 1507270
16544 1507270 1008657 704678 516047 402082 318982 262909 214681 182008 166674 148248
16534 148248 132325 124827 110243 94068 87536 81551 85511 78417 59828 45654 42533 42432 50638
$$ packed form
16610B3494p361n207n879J047J9345k470q126J0605o22L15J7514P649P513J5084
16596G2901K4576L7258P0635J15289J54824K01851J00560j20930k01785j33658
16586C21521p9833l5814j086L2923M9069R1591J29980K01165J29303p3068j82402
16575E83349j49137r2953o3975l8882j5536m231J3790J4122L7644O6526J14045
16564D64762J91207K84162M21338N83535O00157J60150n02247o68783m50839k43634
16554H39808j08907j3294P9782K02568L59328N41292N92507J99508m80246p05076
16544A507270m98613l03979j88631j13965q3100n6073m8228l2673j5334j8426
16534A48248j5923p498j4584j6175o532n985L960p094j8589j4174l121j01Q206
$$ plain form
16521 50638 62155 61213 53093 47999 58132 85862 91269 76787 65590 59923 46366 38962 42029
16508 42029 54849 58748 64282 52493 47393 49738 69812 58421 46701 30637 21448 5417 -4133
16495 -4133 2850 6171 5840 6591 2059 1776 8397 -1158 -5943 -3409 -11203 -24222 -24489 -20639 -6068
16480 -6068 6450 12725 11385 14857 4695 -16966 -18121 -11136 -6355 -3922 -5997 -11719 -6731 -6453
16466 -6453 -7424 -16344 -29471 -24099 -32632 -31161 -31074 -21995 -11617 -2705 -295 -9288 -27772 -15104
16452 -15104 -16905 -23604 -21847 -11418 -8558 -3264 -674 -866 -13399 -10795 -20708 -17775 -17845 -21988 -11868
16437 -11868 -4152 -12114 4021 13538 4041 1787 6575 -3693 -18774 -27702 -32897 -20992 -7037
16424 -7037 8877 5016 3644 6433 17268 20848 10720 2178 6767 27182 37368 27664 18509
$$ packed form
16521E0638J1517r42q120n094J0133K7730N407j4482j1197n667j3557p404L067
16508D2029J2820L899N534j1789n100K345K0074j1391j1720j6064r189j6031r550
16495d133O983L321l31P51m532k83O621r555m785K534p794j3019k67L850J4571
16480f068J2518O275j340L472j0162k1661j155O985M781K433k075n722M988K78
16466f453r71q920j3127N372q533J471Q7R079J0378Q912K410q993j8484J2668
16452a5104j801o699J757J0429K860N294K590j92j2533K604r913K933p0m143J0120
16437a1868P716p962J6135R517r497k254M788j0268j5081q928n195J1905J3955
16424g037J5914l861j372K789J0835L580j0128q542M589K0415J0186r704r155
$$ plain form
16411 18509 19273 25956 25826 19193 17727 22915 29685 25007 22578 34518 55467 56539 79928 114851
16397 114851 172562 267322 362720 429433 411082 313549 218000 152342 105525 85720 80056 78990
16385 78990 83574 104992 149518 214946 298889 407178 437813 345245 232687 151726 108558
16374 108558 82601 65147 41536 23402 24222 23502 5477 2411 4798 14767 8523 -2125 -7332
16361 -7332 -13053 4252 14146 26508 29389 12636 -1896 8058 2587 -3626 -9305 -25691 -38958
16348 -38958 -33998 -26140 -15325 2990 -11821 -23180 -32974 -33591 -22502 -4989 -7633 -12401 -16780
16335 -16780 -12349 475 -5298 -12897 -11678 -18194 -20022 -10516 1372 12686 4284 -7029 -3156
16322 -3156 2463 16793 12546 16873 18145 6597 -5924 1302 -5950 -14785 -9756 -4399 -15897 -11993
$$ packed form
16411A8509P64O683j30o633j466N188O770m678k429J1940K0949J072K3389L4923
16397A14851N7711R4760R5398O6713j8351r7533r5549o5658m6817j9805n664j066
16385G8990M584K1418M4526O5428Q3943J08289L0635r2568j12558q0961m3168
16374A08558k5957j7454k3611j8134Q20p20j8025l066K387R969o244j0648n207
16361g332n721J7305R894J2362K881j6753j4532R954n471o213n679j6386j3267
16348c8958M960P858J0815J8315j4811j1359r794o17J1089J7513k644m768m379
16335a6780M431J2824n773p599J219o516j828R506J1888J1314q402j1313L873
16322c156N619J4330m247M327J272j1548j2521P226p252q835N029N357j1498L904
$$ plain form
16308 -11993 8700 14423 14945 5329 -10663 -9468 2666 2563 17765 27164 11888 -11127 -7888
16295 -7888 -73 747 -1111 -6277 2742 2104 -1547 -5049 -6186 -21449 -28764 -31836 -19353 -15534 -24347
16280 -24347 -28554 -34536 -39199 -33803 -24132 -16212 -13519 -14582 -7131 1181 -6806 1602 7844 -3989
16266 -3989 -11323 -14306 -16143 -20990 -6691 -1939 38 -1586 -14394 -39947 -53319 -45475 -40242 -39036
16252 -39036 -30271 -17504 -17140 -21079 -28601 -27198 -25674 -32252 -19434 -18190 -25583 -23195 -31533 -40859
16238 -40859 -28880 -16918 -32894 -28709 -19251 -8902 -22050 -27824 -10345 -8151 -10262 -3773 -15510
16225 -15510 -11173 -4390 -13828 -19640 -12963 -16717 -18200 -13976 -12210 -9259 -10918 -21137 -20427 -9657
16211 -9657 6955 3118 -13199 -25185 -23996 -24726 -686 16035 7649 5120 15454 2519 -13120
$$ packed form
16308a1993K0693N723N22r616j5992J195J2134j03J5202R399j5276k3015L239
16295g888P815Q20j858n166R019o38l651l502j137j5263p315l072J2483L819q813
16280b4347m207n982m663N396R671P920K693j063P451Q312p987Q408O242j1833
16266c989p334k983j837m847J4299M752J977j624j2808k5553j3372P844N233J206
16252c9036Q765J2767L64l939p522J403J524o578J2818J244p393K388q338r326
16238d0859J1979J1962j5976M185R458J0349j3148n774J7479K194k111O489j1737
16225a5510M337O783r438n812O677l754j483M224J766K951j659j0219P10J0770
16211i657J6612l837j6317j1986J189p30K4040J6721q386k529J0334j2935j5639
$$ plain form
16198 -13120 -5337 -4641 -3782 11499 16460 -251 917 -8048 -7390 47 6333 5344 -13552 -25530
16184 -25530 -22279 -10814 -2847 -18370 -42035 -37532 -26903 -3895 -13195 -15454 -11635 -16795 -8110
16171 -8110 -2130 -1103 -2374 -9366 -13240 -2008 2665 -13013 -17856 -12915 -18942 -21096 -22840 -20675
16157 -20675 -19388 -9436 -5822 -14344 -8014 -3622 -12489 -24267 -31130 -26959 -32830 -29197 -37108 -24420
16143 -24420 -9706 1499 -4000 -12827 -29082 -27088 -12380 -8042 -16779 -29299 -32922 -30440 -21052
16130 -21052 -28195 -27050 -18711 -3954 2550 1514 -8618 -19285 -17145 -11146 -8397 -6114 -12419 -21133
16116 -21133 -28792 -10803 8503 12428 14209 8873 -2623 -21949 -19114 -6867 -393 -3946 -25030
16103 -25030 -31673 -28247 -21441 -19453 -22683 -19278 -19184 -6134 5628 344 4519 -5967 -1819 -15861
$$ packed form
16198a3120P783O96Q59J5281M961j6711J168q965O58P437O286r89j8896j1978
16184b5530L251J1465P967j5523k3665M503J0629K3008r300k259L819n160Q685
16171h110N980J027j271o992l874J1232M673j5678m843M941o027k154j744K165
16157b0675J287R952L614q522O330M392q867j1778o863M171n871L633p911J2688
16143b4420J4714J1205n499q827j6255J994J4708M338q737j2520l623K482R388
16130b1052p143J145Q339J4757O504j036j0132j0667K140N999K749K283o305q714
16116b1133p659J7989J9306L925J781n336j1496j9326K835J2247O474l553k1084
16103b5030o643L426O806J988l230L405R4J3050J1762n284M175j0486M148j4042
$$ plain form
16089 -15861 -16887 -18803 -23501 -26433 -21366 -12623 -17886 -21190 -23968 -27142 -33622 -30167 -32486 -33776
16075 -33776 -26246 -13274 -26642 -33053 -10420 2200 4204 -13261 -26683 -11411 -3402 -6573 -5376
16062 -5376 7068 12058 1547 -1661 -3176 -11141 -24129 -33940 -17023 -4955 -12023 -6360 2649
16049 2649 7803 11804 4094 -2502 3893 -10415 -23077 -30771 -23033 -11573 -17274 -20131 -14233 -7027
16035 -7027 5140 1091 2133 7343 2439 -7680 -11715 -10311 -12616 -16278 -7743 -5062 -4410 -7877
16021 -7877 -17722 -14083 -3145 -5409 -8971 -14617 -29800 -22796 -19541 -20669 3215 16315 2778
16008 2778 8316 -3799 -20872 -714 469 -746 2356 -3207 4670 251 -5279 -3922 -8052 3600
15994 3600 8244 5336 10335 1214 -9468 -6744 -10112 -13729 -19259 -39542 -40466 -33554 -27664 -13902
$$ packed form
16089a5861j026j916m698k932N067Q743n263l304k778l174o480L455k319j290
16075c3776P530J2972j3368o411K2633J2620K004j7465j3422J5272Q009l171J197
16062e376J2444M990j0511l208j515p965j2988r811J6917J2068p068N663R009
16049B649N154M001p710o596O395j4308j2662p694P738J1460n701k857N898P206
16035g027J2167m049J042N210m904j0119m035J404k305l662Q535K681O52l467
16021g877r845L639J0938k264l562n646j5183P004L255j128K3884J3100j3537
16008B778N538j2115j7073K0158J183j215L102n563P877m419n530J357m130J1652
15994C600M644k908M999r121j0682K724l368l617n530k0283r24O912N890J3762
$$ plain form
15980 -13902 1612 16450 20275 8730 -11666 -15621 -5642 -6074 -4839 -15515 -29179 -28769 -22512
15967 -22512 -21391 -16165 -9036 -2644 -8444 -9390 -6917 -9605 -16609 -11189 -10346 -6897 553 -3047 2425
15952 2425 17324 20116 24688 14840 7404 12821 -982 -2212 6462 11865 6820 -3383 -11290 -22061
15938 -22061 -27565 -26478 -28506 -28155 -18171 -25487 -12995 -8501 -12906 -12884 -26133 -17432 -22062 -22267 -17057
15923 -17057 -19001 -22355 -21360 -28859 -27563 -28843 -19006 -12122 -12928 -14778 -16882 -7246 2271 -9552 -13762
15908 -13762 -21173 -22745 -18428 -18431 -25037 -37297 -38935 -36729 -48325 -39882 -38965 -24789 -6102 -7954
15894 -7954 -18558 -28368 -25166 -16090 -18666 -4594 4042 -7722 -15341 -20680 -12156 135 -890 -11019
15880 -11019 -27740 -24649 -18154 -13704 -9100 -448 -7852 -11409 -5635 2617 3583 -6864 -18361 -23565
$$ packed form
15980a3902J5514J4838L825j1545k0396l955R979m32J235j0676j3664M10O257
15967b2512J121N226P129O392n800r46K473k688p004N420Q43L449P450l600N472
15952B425J4899K792M572r848p436N417j3803j230Q674N403n045j0203p907j0771
15938b2061n504J087k028L51R984p316J2492M494m405K2j3249Q701m630k05N210
15923a7057j944l354R95p499J296j280R837O884q06j850k104R636R517j1823m210
15908a3762p411j572M317lo606j2260j638K206j1596Q443R17J4176J8687j852
15894g954j0604r810L202R076k576J4072Q636j1764p619n339Q524J2291j025j0129
15880a1019j6721L091O495M450M604Q652p404l557N774Q252R66j0447j1497n204
$$ plain form
15866 -23565 -27117 -31888 -24752 -25492 -32516 -32074 -22041 -22330 -15618 -10829 -20825 -27150 -11163 -15497 -29826
15851 -29826 -39257 -34841 -34775 -28326 -14119 -15144 -16001 -30260 -32059 -51844 -44744 -34683 -36833 -28675
15837 -28675 -12055 -10724 -21632 -24934 -19494 -21306 -19956 -11891 -25898 -26637 -32559 -32858 -20879 -6578
15823 -6578 9219 10221 6855 -2325 3306 7712 -5734 -13739 -21478 -22081 -5404 10782 15978 7080
15809 7080 1501 3901 -3379 -12780 -20145 -8778 -4130 -14068 -30487 -31236 -25608 -28066 -26486 -26406 -23434
15794 -23434 -30619 -31838 -27036 -27294 -29673 -20112 -36040 -39779 -26798 -12789 -13194 -33048 -30848 -17403
15780 -17403 -6373 -17480 -33016 -24295 -21348 -12814 -7151 -7011 -15012 -10409 -10817 -22260 -25295 -20252
15766 -20252 -7388 -17749 -24207 -20977 -35084 -37713 -25620 -41709 -42234 -34557 -36249 -38317 -40059
$$ packed form
15866b3565l552m771P136p40p024M42J0033k89O712M789r996o325J5987m334j4329
15851b9826r431M416O6O449J4207j025q57j4259j799j9785P100J0061k150Q158
15837b8675J6620J331j0908l302N440j812J350Q065j4007p39n922k99J1979J4301
15823f578J5797J002l366r180N631M406j3446q005p739o03J6677J6186N196q898
15809G080n579K400p280r401p365J1367M648r938j6419p49N628k458J580Q0K972
15794b3434p185j219M802k58k379R561j5928l739J2981J4009m05j9854K200J3445
15780a7403J1030j1107j5536Q721K947Q534N663J40q001M603m08j1443l035N043
15766b0252J2864j0361o458L230j4107k629J2093j6089n25P677j692k068j742
$$ plain form
15753 -40059 -22833 -3235 -3175 -1277 -9497 -13580 -1572 27 5022 1715 -3910 -4955 -11234 685
15739 685 -4805 -6416 -6936 -12274 -19421 -4092 -6375 -15214 -8458 -3553 -6305 -6253 6457 20774 5163
15724 5163 -5841 -5641 -4356 -10552 -6252 -1860 -10089 -6509 -5274 1265 11992 15360 16256 -4216
15710 -4216 -4785 3785 476 17506 14778 5162 -10210 -15870 -9994 -12335 -8007 -8538 -2322 -8955 -7173
15695 -7173 -7266 -7906 2170 -8502 -7024 294 3340 5738 -993 -2488 -3952 1354 -12192 -23557
15681 -23557 -20447 -4205 -4330 -12544 -13569 -8443 -855 939 6721 12247 5 -16165 -32597 -38160
15667 -38160 -32905 -30293 -29554 -20276 -8025 -18520 -15221 -11258 -12939 -4121 4718 -3132 -430 10405
15653 10405 -1908 -20930 -29657 -31303 -11426 -11240 -14453 -12909 -8752 -8676 -10560 -9250 -4430 -9928
$$ packed form
15753d0059J7226J9598O0J898q220m083J2008J599M995l307n625j045o279J1919
15739F85n490j611n20n338p147J5329k283q839O756M905k752N2J2710J4317j5611
15724E163j1004K00J285o196M300M392q229L580J235O539J0727L368Q96k0472
15710d216n69Q570l309J7030k728r616j5372n660N876k341M328n31O216o633J782
15695g173r3o40J0076j0672J478P318L046K398o731j495j464N306j3546j1365
15681b3557L110J6242j25q214j025N126P588J794N782N526j2242j6170j6432n563
15667c8160N255K612P39R278J2251j0495L299L963j681Q818Q839p850K702J0835
15653A0405j2313j9022q727j646J9877J86l213J544M157P6j884J310M820n498
$$ plain form
15639 -9928 -17191 -21021 -18971 -7665 -12831 -13541 -16508 -19030 -13403 -4050 -7918 -10434 -16212 -26909
15625 -26909 -19642 -24128 -24008 -18274 -6434 -2552 5591 4165 -4853 -16318 -5782 -4394 -11256 -20663
15611 -20663 -18379 -29682 -30262 -21937 -16838 -7969 -4455 -7468 -6265 -5648 -8400 -2155 6787 -7858
15597 -7858 -21929 -25443 -36307 -40456 -36443 -33936 -25561 -25040 -33656 -27165 -14757 -3409 -150 4104
15583 4104 -3231 -4825 -3072 -3650 10969 17959 12069 5763 3068 5363 6541 15992 17241 5692
15569 5692 3803 6036 -12757 -13525 -12088 -16404 -19455 -29764 -18726 -23011 -24949 -15452 -12023 -3903
15555 -3903 13982 12180 3446 -1233 8777 5543 -2213 -5130 -5543 -9273 -10428 -5018 7879 9980
15541 9980 -8 -3577 1970 2366 -2825 -11144 -2071 1506 -3982 10062 11749 12479 -3616 5722 3240
$$ packed form
15639i928p263l830K050J1306n166p10k967k522N627R353l868k516n778j0697
15625b6909P267m486J20N734J1840L882Q143j426r018j1465J0536J388o862r407
15611b0663K284j1303n80Q325N099Q869L514l013J203O17k752O245Q942j4645
15597g858j4071l514j0864m149M013K507Q375N21q616O491J2408J1348L259M254
15583D104p335j594J753n78J4619O990n890o306k695K295J178R451J249j1549
15569E692j889K233j8793p68J437m316l051j0309J1038m285j938R497L429Q120
15555c903J7885j802q734m679J0010l234p756k917m13l730j155N410J2897K101
15541I980r988l569N547L96n191q319R073L577n488J4044J687P30j6095R338k482
$$ plain form
15526 3240 -3874 -5014 1609 -352 -15451 -11987 -4408 1879 8728 7626 17000 17188 -1884 -11830
15512 -11830 -4435 2395 -5954 -8996 -10677 -11512 -20566 -28562 -6902 -5550 -12843 -7583 -8327 -19473
15498 -19473 -9986 -5461 -9729 -11476 -12479 -5097 5713 29781 17670 1410 3764 -4159 -7915
15485 -7915 -13685 -16818 448 12586 5329 -1598 4027 -7030 -10362 -10518 -1281 -7308 -6226 -8927
15471 -8927 -17289 -13962 -9727 -3508 6639 -3733 -4972 -11491 -14468 -9673 -3093 -8206 4013 -6972
15457 -6972 -11825 -13392 -9840 -15867 -17642 -17711 -27921 -24196 -34563 -26401 -25393 -6876 -3821 -9472
15443 -9472 -20304 -13697 -5881 6869 8519 1705 -9511 -13363 -8786 4146 1838 -6778 -15666 -13304
15429 -13304 -19823 -27896 -30150 -34472 -48461 -50671 -28040 -19820 -5387 3261 2339 87 -7079 -22341
$$ packed form
15526C240p114j140O623j961j5099L464P579O287O849j102R374J88j9072r946
15512a1830P395O830q349l042j681q35r054p996K1660J352p293N260p44j1146
15498a9473R487M525m268j747j003P382J0810K4068j2111j6260K354p923l756
15485g915n770l133J7266J2138p257o927N625j1057l332j56R237o027J082k701
15471h927q362L327M235O219J0147j0372j239o519k977M795O580n113J2219j0985
15457f972m853j567L552o027j775o9j0210L725j0367Q162J008J8517L055n651
15443i472j0832O607P816J2750J650o814j1216l852M577J2932k308q616q888K362
15429a3304o519q073k254m322j3989k210K2631Q220J4433Q648r22k252p166j5262
$$ plain form
15415 -22341 -39371 -35111 -31885 -30655 -24427 -18647 -6259 3499 -2068 -8690 -6089 -20682 -21442 -3651
15401 -3651 -16824 -16588 -15885 -9686 5376 -3974 -26668 -25476 -20992 -30608 -24608 -12903 -23804 -17738
15387 -17738 -15116 -11355 -2399 121 10326 8022 -4617 -6470 -10494 -5175 -12170 -5480 -4969 -10066
15373 -10066 -8641 -4623 -17897 -8633 -3920 1160 5667 -21052 -25544 -13644 -11310 -3965 -5798 -13708
15359 -13708 -14471 -25597 -43006 -40033 -31384 -14290 -17488 -29916 -30923 -15559 -2078 -6379 -3704
15346 -3704 -3465 -11780 3345 7236 -3629 -6974 6110 8967 -1692 -16851 5873 11984 2950
15333 2950 1724 2414 -39 -12258 -16465 -9031 -1635 -6874 -2158 3133 -1457 -4697 -14196 -12782 -13150
15318 -13150 -21689 -7048 -900 -5014 -4203 -2629 1322 5697 9453 -3108 -6017 2008 11445 26111
$$ packed form
15415b2341j7030M260L226J230O228N780J2388R758n567o622K601j4593p60J7791
15401c651j3173K36P03O199J5062r350k2694J192M484r616O000J1705j0901O066
15387a7738K622L761Q956K520J0205k304j2639j853m024N319o995O690N11n097
15373a0066J425M018j3274R264M713N080M507k6719m492J1900K334P345j833p910
15359a3708p63j1126j7409K973Q649J7094l198j2428j007J5364J3481m301K675
15346c704K39q315J5125L891j0865l345J3084K857j0659j5159K2724O111r034
15333B950j226O90k453j2219m207P434P396n239M716N291m590l240r499J414l68
15318a3150q539J4641O148m114Q11J574L951M375L756j2561k909Q025R437J4666
$$ plain form
15304 26111 41463 10204 -17036 -18217 -6408 -10926 -13436 -15243 -7121 2024 -933 -19998 -29411
15291 -29411 -22747 -22110 -20157 -14488 -26442 -21024 -15988 -17497 -21178 -19663 -28541 -38041 -15954 -259
15277 -259 -3791 -8085 -9854 -1065 6714 13399 6282 -6028 -14408 -12707 -9739 -11353 386 -1583
15263 -1583 -377 77 -19480 -18858 -15460 -26811 -22631 -22971 -10972 -17496 -18540 -17836 -10683 -17468 -24549
15248 -24549 -17071 -10979 -11839 -8898 8567 8030 -11345 -20324 -19150 -30325 -24173 -18764 -684 14402
15234 14402 19541 12070 4600 2093 7080 8166 -3327 -3992 5024 11235 15008 -5828 -9019 -3928
15220 -3928 -5459 1211 2662 3418 3815 -4088 -5977 -8163 -32031 -43228 -34584 -26352 -30600 -34963 -29202
15205 -29202 -7875 6237 -10579 -2007 3936 7057 7038 -1379 11187 14624 12865 -41 -10047
$$ packed form
15304B6111J5352l1259k7240j181J1809m518k510j807Q122R145k957j9065r413
15291b9411O664O37J953N669j1954N418N036j509l681J515q878r500K2087J5695
15277b59l532m294j769Q789P779O685p117j2310q380J701K968j614J1739j969
15263a583J206M54j9557O22L398j1351M180l40J1999o524j044P04P153o785p081
15248b4549P478O092q60K941J7465n37j9375q979J174j1175O152N409J8080J5086
15234A4402N139p471p470k507M987J086j1493o65R016O211L773k0836l191N091
15220c928j531O670J451P56L97p903j889k186k3868j1197Q644Q232m248m363N761
15205b9202K1327J4112j6816Q572N943L121j9q417J2566L437j759j2906j0006
$$ plain form
15192 -10047 -12208 -8135 -2644 3978 -1007 -20767 -17581 7520 19868 5579 -1661 -7977 -19170
15179 -19170 -33171 -9764 -8313 -21482 -25743 -12385 3053 16067 25884 29607 16896 3133
15167 3133 -17812 -23203 -16014 -14777 -10743 -417 8987 -1739 -12891 -17193 -7679 -1716 -2165 7660
15153 7660 11064 5667 89 4282 11405 4703 -6714 -5891 -13588 -22191 -13804 2946 1938 -5298
15139 -5298 -4150 -197 14106 15408 1408 -8103 -7016 -7707 -21065 -25414 -27317 -25318 -26580 -20310
15125 -20310 -18584 -24672 -13245 -4746 6592 1440 2939 -1748 -591 3616 6811 3096 8238 -2500
15111 -2500 -18906 -18275 -6670 -6260 -6676 -7878 -14671 -13690 -4648 -12249 -9018 -641 -11439 -10959 -8004
15096 -8004 -1633 -7608 -11572 -9667 -6342 1576 7723 10253 641 2238 1465 -9378 -14711 -19182 -15049
$$ packed form
15192a0047k161M073N491O622m985j9760L186K5101J2348j4289p240o316j1193
15179a9170j4001K3407J451j3169m261J3358J5438J3014R817L723j2711j3763
15167C133k0945n391P189J237M034J0326R404j0726j1152m302R514N963m49R825
15153G660L404n397n578M193P123o702j1417Q23p697q603Q387J6750j008p236
15139e298J148L953J4303J302j4000r511J087o91j3358m349j903J999j262O270
15125b0310J726o088J1427Q499J1338n152J499m687J157M207L195l715N142j0738
15111b500j6406O31J1605M10m16j202o793R81R042p601L231Q377j0798M80K955
15096h004O371n975l964J905L325P918O147K530r612J597p73j0843n333m471M133
$$ plain form
15081 -15049 -15040 -18260 -19591 -27524 -29176 -32857 -8401 12666 1387 -12827 -14603 -4920 -6439 -1003
15067 -1003 -1014 -1424 2369 -5749 -12336 -6655 -3657 -48 5314 10166 7682 12389 13569 10931 18684
15052 18684 30206 36458 33581 25446 20837 15954 7614 8450 5342 3527 -2854 -4431 4120 10626
15038 10626 -100 -7076 -10615 -2582 -10461 -16874 -14333 -5261 9956 13610 9168 17787 11111 -2606
15024 -2606 -1600 -902 5739 5341 3029 -679 2079 -2897 -252 759 6915 2513 -4453 -4894 1571
15009 1571 -6446 2873 8745 11176 8046 -5810 -26268 -21066 397 15751 17808 4046 10320
14996 10320 18718 19752 13427 -4352 -17017 -6393 -5749 -12345 -8972 -2889 -7930 -17900 -16245 -16106
14982 -16106 -17734 -8088 -11901 -14003 -5369 -13539 -19682 -17248 -3677 7036 -7806 -20045 -19555 -12028
$$ packed form
15081a5049Rl220j331p933j652l681K4456K1067j1279j4214j776R683j519N436
15067a003j1m10L793q118o587N681K998L609N362M852k484M707J180k638P753
15052A8684J1522O252k877q135m609m883q340Q36l108j815o381j577Q551O506
15038A0626j0726o976l539Q033p879o413K541R072J5217L654m442Q619o676j3717
15024b606J006O98O641l98k312l708K758m976K645J011O156m402o966m41O465
15009A571q017R319N872K431l130j3856k0458N202K1463J5354K057j3762O274
14996A0320Q398J034o325j7779j2665J0624O44o596L373O083n041r970J655J39
14982a6106j628R646l813k102Q634q170o143K434J3571J0713j4842j2239M90P527
$$ plain form
14968 -12028 -13380 7424 5132 2374 -1364 -3515 -9251 -23737 -27605 -29828 -19538 -12118 895
14955 895 -6077 -3368 -4477 -11258 1750 14296 8257 -6499 -2563 -6652 -15186 -13263 -23272 -32488
14941 -32488 -39342 -26617 -23150 -23203 -22189 -15125 -1500 -2030 4036 12408 11925 10372 7078 -1545 -4333
14926 -4333 -14211 -16456 -27705 -30248 -8480 -1917 -3819 -16467 -23525 -41842 -34408 -21007 -13068
14913 -13068 -10757 -7741 -1429 5070 18357 19205 -2304 -15457 -7316 -7415 -14018 -12668 -5439 -2663
14899 -2663 7920 3842 -11882 -12201 -1572 1167 1278 -5363 6611 8003 -1250 -20093 -29996 -33234
14885 -33234 -23583 -16260 -18449 -14841 -23764 -22832 -17290 -13202 -18004 -15770 -6710 -9689 -5698 -1222 -4038
14870 -4038 -13347 -7763 -1932 2856 -2084 -6363 -2894 -9508 -13521 -2378 -2363 -7464 -2409 -12373 -15572
$$ packed form
14968a2028j352K0804k292k758l738k151n736j4486l868k223J0290P420J3013
14955H95o972K709j109o781J3008J2546o039j4756L936m089q534J923j0009r216
14941c2488o854J2725L467n3J014P064J3625n30O066Q372m83j553l294q623k788
14926d333r878k245j1249k543K1768O563j902j2648p058j8317P434J3401P939
14913a3068K311L016O312O499J3287Q48k1509j3153Q141r9o603J350P229K776
14899b663J0583m078j5724l19J0629K739J11o641J1974J392r253j8843r903l238
14885c3234R651P323k189L608q923R32N542M088m802K234R060k979L991M476k816
14870d038r309N584N831M788m940m279L469o614m013J1143J5n101N055r964l199
$$ plain form
14855 -15572 -5931 -5372 -9240 -10997 -4927 -4176 -1849 3611 16044 19711 6841 -3811 -1064 8197
14841 8197 -2207 -8732 -16609 -21915 -19271 -10590 414 3332 -5959 1815 16194 13210 8283 -1130
14827 -1130 120 10354 5706 11555 8122 421 -787 7286 -339 1741 -394 -6775 -2897 -2250 -3340
14812 -3340 2769 8427 -370 4004 2054 14090 24810 31159 26093 19228 18006 34098 34066 22963
14798 22963 17757 20812 21001 19311 34550 29693 -7722 -23387 -7764 10888 12932 12576 23502
14785 23502 16420 9877 24627 41951 45199 29929 31656 22252 9813 6198 3290 -1943 -5103
14772 -5103 -3739 4736 -7469 -8268 -1235 2602 71 1177 8971 4334 3075 -10596 -12026 -16049
14758 -16049 -3783 7385 16480 34108 33248 26389 19265 11788 15718 23476 14617 16254 16506 15441
$$ packed form
14855a5572R641N59l868j757O070P51K327N460J2433L667j2870j0652K747R261
14841H197j0404o525p877n306K644Q681J1004K918r291P774J4379k984m927r413
14827a130J250J0234m648N849l433p701j208Q073p625K080k135o381L878O47j090
14812c340O109N658q797M374j950J2036J0720O349n066o865j222J6092l2j1103
14798B2963n206L055J89j690J5239m857l7415j5665J5623J8652K044l56J0926
14785B3502p082o543J4750J7324L248j5270J727r404j2439l615k908n233l160
14772e103J364Q475j2205p99P033L837k531J106P794m637j259j3671j430m023
14758a6049J2266J1168R095J7628q60o859p124p477L930P758q859J637K52j065
$$ plain form
14744 15441 8480 9019 15811 25650 30420 42061 47203 55475 81053 100421 108553 111405 120001 121894
14730 121894 114792 102249 83762 84265 72884 62884 55921 54041 49751 32134 30114 31073 32778
14717 32778 31323 24650 20912 29630 41354 37807 40121 22011 15071 13330 17496 8303 680 9953
14703 9953 2766 9601 15873 9294 23960 23700 22127 28772 15487 3607 -4120 -7949 -9455 -4650
14689 -4650 5455 13793 14185 5754 4137 12241 25699 30440 26554 21069 18784 16895 22150 15589
14675 15589 13065 4155 5096 21312 31768 31729 26155 21996 37471 48228 40092 32037 22451 17375
14661 17375 21684 18486 22560 39402 50881 48400 45439 36346 45703 50531 44328 36929 37674 33720
14647 33720 39622 28941 17365 22683 44398 43313 33967 28390 23062 35277 54906 51017 43040
$$ packed form
14744A5441o961N39O792R839M770J1641N142Q272K5578J9368Q132K852Q596J893
14730A21894p102j2543j8487N03j1381j0000o963j880m290j7617k020R59J705
14717C2778j455o673l738Q718J1724l547K314j8110o940j741M166r193p623R273
14703I953p187O835O272o579J4666k60j573O645j3285j1880p727l829j506M805
14689d650J0105Q338L92q431j617Q104J3458M741l886n485k285j889N255o561
14675A5589k524q910R41J6216J0456l9n574m159J5475J0757q136q055r586n076
14661A7375M309l198M074J6842J1479k481k961r093R357M828o203p399P45l954
14647C3720N902j0681j1576N318K1715j085r346n577n328J2215J9629l889p977
$$ plain form
14634 43040 40754 37369 49467 66925 70018 70624 79888 95228 96390 90317 108819 121454 114997
14621 114997 125465 132221 146666 154653 166400 189279 207349 211542 222946 255053 296705 328005
14609 328005 363251 412989 474419 549685 638590 738737 844229 968941 1125200 1306954
14599 1306954 1519202 1759977 2005040 2251173 2513807 2732977 2906230 2998343 3034030 3019643
14589 3019643 2943679 2815531 2635062 2429685 2204120 1980140 1787332 1614288 1457050 1317729
14579 1317729 1206725 1129815 1071103 1009851 932439 877101 818911 751070 689673 639282 587346
14568 587346 543042 487908 456026 437760 407744 382649 351024 320121 293069 279428 274109 269334
14556 269334 264055 252603 254762 254168 250931 251595 242757 237458 224721 223797 232847 235765 229853 232862
$$ packed form
14634D3040k286l385J2098J7458L093O06R264J5340J162o073J8502J2635o457
14621A14997J0468O756J4445P987J1747K2879J8070M193J1404L2107M1652L1300
14609C28005L5246M9738O1430P5266Q8905J00147J05492J24712J56259J81754
14599A306954K12248K40775K45063K46133K62634K19170J73253R2113L5687j4387
14589C019643p5964j28148j80469k05377k25565k23980j92808j73044j57238j39321
14579A317729j11004p6910n8712o1252p7412n5338n8190o7841o1397n0391n1936
14568E87346m4304n5134l1882j8266l0016k5095l1625l0903k7052j3641n319m775
14556B69334n279j1452K159n94l237O64q838n299j2737r24R050K918n912L009
$$ plain form
14542 232862 232680 232331 248750 263653 268654 265897 287026 290993 279256 284435 289735 280272 293760
14529 293760 310243 314071 300900 301992 309282 334372 346915 361605 357556 330174 331349 357742
14517 357742 365348 346172 325822 322831 325523 316118 317741 338006 352494 370767 397865 420861
14505 420861 448893 502655 581421 661541 758246 865543 951176 1010349 1030964 1016573 993799
14494 993799 935546 846872 735131 631654 541555 440292 379504 338606 294501 263806 227096
14483 227096 199126 172343 154227 156987 160121 150088 129703 120169 108434 95101 95456 108658
14471 108658 101646 101436 96653 91027 85910 85154 87592 89035 84314 70624 80132 91482 96323 84493
14457 84493 88924 73811 61660 54710 52439 52806 47704 53537 59687 63492 64386 57606 60702 65963
$$ packed form
14542B32862j82l49J6419J4903N001k757K1129L967j1737N179N300r463J3488
14529B93760J6483L828j3171J092P290K5090J2543J4690m049k7382J175K6393
14517C57742P606j9176k0350k991K692r405J623K0265J4488J8273K7098K2996
14505D20861K8032N3762P8766Q0120R6705J07297Q5633N9173K0615j4391k2774
14494I93799n8253q8674j11741j03477r0099j01263o0788m0898m4105l0695l6710
14483B27096k7970k6783j8116K760L134j0033k0385r534j1735j3333L55J3202
14471A08658p012k10m783n626n117p56K438J443m721j3690R508J1350M841j1830
14457H4493M431j5113j2151o950k271L67n102N833O150L805Q94o780L096N261
$$ plain form
14443 65963 76960 76735 76046 70196 62995 62020 59519 58388 60737 66410 63374 54914 64671 65522 61896
14428 61896 72313 71349 48155 42751 48235 56382 45516 40812 44177 45011 50291 55477 53847 46386
14414 46386 40549 43089 48451 51652 51206 29979 15108 22531 29609 43275 46203 33602 17236
14401 17236 6726 18763 27611 41270 51219 41879 56382 62295 65632 61518 61543 58928 52421 47404
14387 47404 45748 51240 44875 45983 49549 55584 63296 62423 57665 62484 64925 71541 68179 66899 54528
14372 54528 57035 67713 74698 68606 70851 64448 50890 44190 46443 39411 37090 39379 48412 46243
14358 46243 30868 27089 37314 41239 35898 21668 -4517 -14339 -5602 -493 -5574 -14143 -17982
14345 -17982 -19347 -8770 5498 24924 32242 24262 15090 5695 675 5009 17095 17742 23364 26223
$$ packed form
14443F5963J0997k25o89n850p201r75k501j131K349N673l036q460R757Q51l626
14428F1896J0417r64k3194n404N484Q147j0866m704L365Q34N280N186j630p461
14414D6386n837K540N362L201m46k1227j4871P423P078J3666K928j2601j6366
14401A7236j0510J2037Q848J3659R949r340J4503N913L337m114K5k615o507n017
14387D7404j656N492o365J108L566O035P712q73m758M819K441O616l362j280j2371
14372E4528K507J0678O985o092K245o403j3558o700K253p032k321K289R033k169
14358D6243j5375l779J0225L925n341j4230k6185r822Q737N109n081q569l839
14345a7982j365J0577J4268J9426P318p980r172r395n020M334J2086O47N622K859
$$ plain form
14331 26223 25168 33850 33708 34723 21116 23502 25167 21674 32191 35861 35301 44310 47197 57068
14317 57068 64488 54891 52433 69953 84730 86847 84851 91008 98632 109143 101112 91274 86063 97929
14303 97929 104141 107731 113607 113201 102148 114792 125674 124167 132794 132440 125138 105767 79700 70424
14289 70424 81152 95112 79490 77007 69406 64726 52069 48364 44577 28590 29421 36070 43551
14276 43551 50279 45972 48416 65863 57747 49548 49839 56096 49400 47635 53336 53459 44330 48225 54861
14261 54861 53987 51947 72399 74783 73670 64785 58717 63718 58027 67659 81797 78008 87767 85146
14247 85146 74514 76598 79777 76143 79654 92034 85415 62928 68198 78541 87300 86657 80528 81804
14233 81804 75218 61598 53271 47252 45275 49929 58405 64474 66520 65800 62367 61671 66099 73418 74979
$$ packed form
14331B6223j055Q682j42J015j3607K386J665l493J0517L670n60R009K887R871
14317E7068P420r597k458J7520J4777K117j996O157P624J0511q031r838n211J1866
14303I7929O212L590N876m06j1053J2644J0882j507Q627l54p302j9371k6067r276
14289G0424J0728J3960j5622k483p601m680j2657l705l787j5987Q31O649P481
14276D3551O728m307K444J7447q116q199K91O257o696j765N701J23r129L895O636
14261E4861q74k040K0452K384j113q885o068N001n691R632J4138l789R759k621
14247H5146j0632K084L179l634L511J2380o619k2487N270J0343Q759o43o129J276
14233H1804o586j3620q327o019j977M654Q476O069K046p20l433o96M428P319J561
$$ plain form
14218 74979 73377 58339 64580 78296 84547 97491 92740 95687 96595 94430 93058 84009 79663 69182
14204 69182 69620 59713 42246 13901 4233 2850 -7308 -20541 -8294 -2921 8756 19008 18421
14191 18421 25133 43907 69091 99952 124067 132964 150561 173024 196756 219144 228365 222157
14179 222157 210252 208408 202168 183264 158371 165651 141343 108395 90862 89722 84778 92783 78721
14166 78721 67262 77356 79562 91417 83684 97336 112585 104261 92392 104048 109843 109157 111502
14153 111502 116659 133592 125478 117341 121070 142788 153197 172974 189435 193204 203413 201591 198637
14140 198637 202201 217253 224363 217337 209156 210424 215003 206207 201244 202114 215524 234150 245290
14127 245290 241156 255235 269964 272439 276336 296258 315778 319976 321008 351662 371725 372916 395307
$$ packed form
14218G4979j602j5038O241J3716O251J2944m751K947R08k165j372r049m346j0481
14204F9182M38r907j7467k8345r668j383j0158j3233J2247N373J1677J0252n87
14191A8421O712J8774K5184L0861K4115Q897J7597K2463K3732K2388R221o208
14179B22157j1905j844o240j8904k4893P280k4308l2948j7533j140m944Q005j4062
14166G8721j1459J0094K206J1855p733J3652J5249q324j1869J1656N795o86K345
14153A11502N157J6933q114q137L729K1718J0409J9777J6461L769J0209j822k954
14140A98637L564J5052P110p026q181J268M579q796m963Q70J3410J8626J1140
14127B45290m134J4079J4729K475L897J9922J9520M198J032L0654K0063J191K2391
$$ plain form
14114 395307 415879 429253 440652 450981 459212 485796 502546 538702 561267 588826 624483 658302
14102 658302 687921 709847 729361 756060 781911 803088 838141 888344 934957 982360 1052075
14091 1052075 1134632 1224376 1306960 1405470 1517115 1631756 1764815 1931895 2149386 2447585
14081 2447585 2862164 3428906 4145596 4943147 5772289 6609780 7434320 8098892 8539620
14072 8539620 8859687 9097232 9205819 9235724 9391575 9778181 10373718 11205097 12353709
14063 12353709 13900687 15969022 18760727 22630457 28176017 36212193 47630402 62746656
14055 62746656 80646134 99920599 119763346 139114277 155444716 165724081 169147432
14048 169147432 166413218 157567644 142503491 123399677 103785422 85387580 68374047
$$ packed form
14114C95307K0572J3374J1399J0329Q231K6584J6750L6156K2565K7559L5657L3819
14102F58302K9619K1926J9514K6699K5851K1177L5053N0203M6613M7403O9715
14091A052075Q2557Q9744Q2584R8510J11645J14641J33059J67080K17491K98199
14081B447585M14579N66742P16690P97551Q29142Q37491Q24540O64572M40728
14072H539620L20067K37545J08587K9905J55851L86606N95537Q31379J148612
14063A2353709J546978K068335K791705L869730N545560Q036176J1418209J5116254
14055F2746656J7899478J9274465J9842747J9350931J6330439J0279365L423351
14048A69147432k734214q845574j5064153j9103814j9614255j8397842j7013533
$$ plain form
14041 68374047 53295389 41443264 32951838 26955238 22593925 19290372 16688820 14547452
14033 14547452 12700018 11102684 9711659 8522066 7499948 6631444 5916452 5327684
14025 5327684 4839626 4427941 4081115 3777227 3526435 3290300 3067086 2868061 2687365
14016 2687365 2497882 2322775 2174615 2040008 1914050 1810617 1713765 1642281 1579520 1521353
14006 1521353 1469139 1413420 1353741 1301434 1252069 1179734 1107230 1035110 979829 937135 902405
13995 902405 876599 849408 820989 800017 788800 771766 748734 738651 724265 707064 687239
13984 687239 666273 638960 631281 633356 620170 605451 595947 569656 560029 549115 540482 532233 523363
13971 523363 514363 503166 503688 500608 482742 457119 433875 423066 422545 417296 404996 408413 407906
$$ packed form
14041F8374047j5078658j1852125q491426n996600m361313l303553k601552k141368
14033A4547452j847434j597334j391025j189593j022118q68504p14992n88768
14025E327684m88058m11685l46826l03888k50792k36135k23214j99025j80696
14016B687365j89483j75107j48160j34607j25958j03433r6852p1484o2761n8167
14006A521353n2214n5719n9679n2307m9365p2335p2504p2120n5281m2694l4730
13995I02405k5806k7191k8419k0972j1217j7034k3032j0083j4386j7201j9825
13984F87239k0966k7313p679K075j3186j4719r504k6291r627j0914q633q249q870
13971E23363r000j1197N22l080j7866k5623k3244j0809n21n249j2300L417n07
$$ plain form
13958 407906 400885 380793 377652 378944 362400 348548 359209 348591 340151 328862 323242 321994 326245
13945 326245 321175 314416 331426 342884 337586 338455 355393 360837 360969 375181 365105 360583 361624
13932 361624 360433 367048 359762 355079 350513 339883 323964 307599 283174 288803 296279 280161 265028
13919 265028 237820 209105 186377 175121 169703 166727 157804 169763 193718 195975 194539 208326
13907 208326 209611 224060 240453 237041 228893 221128 221340 227914 225001 206307 197172 175510 161378
13894 161378 136600 123753 119863 118448 110802 108567 102093 89456 84907 75764 79855 87266 92899
13881 92899 96085 94629 87635 79795 89301 103688 106806 101978 94763 94656 103546 115214 111854 102169
13867 102169 98963 90543 92468 97896 93693 86014 84569 90928 96110 93810 78637 64515 60550 62326
$$ packed form
13958D07906p021k0092l141J292j6544j3852J0661j0618q440j1289n620j248M251
13945C26245n070o759J7010J1458n298Q69J6938N444J32J4212j0076m522J041
13932C61624j191O615p286m683m566j0630j5919j6365k4425N629P476j6118j5133
13919B65028k7208k8715k2728j1256n418k976q923J1959K3955K257j436J3787
13907B08326J285J4449J6393l412q148p765K12O574k913j8694r135k1662j4132
13894A61378k4778j2847l890j415p646k235o474j2637m549r143M091P411N633
13881I2899L186j456o994p840R506J4387L118m828p215j07Q890J1668l360r685
13867A02169l206q420J925N428m203p679j445O359N182k300j5173j4122l965J776
$$ plain form
13853 62326 72642 81246 69132 64996 69349 60660 48204 56528 65904 65763 65016 69827 86068 94638
13839 94638 81438 80894 73686 83309 85284 84709 84665 80449 78431 71595 64504 52189 42859 35735 53700
13824 53700 70505 69826 66939 58565 50616 52625 49524 50832 43884 57615 69817 68932 69616 67441
13810 67441 54996 43115 54547 56021 54853 52349 58312 46445 51699 59516 57377 52480 57760
13797 57760 52221 59308 62402 61174 67106 68870 60023 52669 66718 76787 83041 77474 85652 80285
13783 80285 65972 61181 67436 84425 88174 93233 78567 66708 66718 56040 49092 48613 45717 43145
13769 43145 46606 47623 60435 55028 55827 71040 70299 60187 63544 74298 80104 71847 68575 76910
13755 76910 76964 77664 83138 85059 85316 93212 84090 73207 64450 71235 66188 59787 46738 45270 40833
$$ packed form
13853F2326J0316Q604j2114m136M353q689j2456Q324R376j41p47M811J6241Q570
13839I4638j3200n44p208R623J975n75m4m216k018o836p091j2315r330p124J7965
13824E3700J6805o79k887q374p949K009l101J308o948J3731J2202q85O84k175
13810F7441j2445j1881J1432J474j168k504N963j1867N254P817k139m897N280
13797E7760n539P087L094j228N932J764q847p354J4049J0069O254n567Q178n367
13783H0285j4313m791O255J6989L749N059j4666j1859J0j0678o948m79k896k572
13769D3145L461J017J2812n407P99J5213p41j0112L357J0754N806q257l272Q335
13755G6910N4P00N474J921K57P896r122j0883q757O785n047o401j3049j468m437
$$ plain form
13740 40833 27822 18195 22315 24414 33115 37202 15737 21664 19013 13712 12091 20058 31893 40699
13726 40699 48554 48370 44523 50656 40621 21160 3250 6685 13429 14425 23554 37015 31418 26597
13712 26597 29318 23198 29275 23225 13664 38336 45044 45824 60084 47571 37179 34836 32804 31569
13698 31569 39382 50311 35241 23187 24710 34015 33445 24246 26937 32164 29766 31858 44721 38099
13684 38099 43244 44137 36891 41534 32669 23105 16511 17592 20678 21346 22191 31819 31994 23713 26930
13669 26930 18800 15309 8932 9579 10907 19628 26691 23232 19153 13969 18524 17472 20616 28028 25135
13654 25135 32662 33496 32915 31841 51850 61682 60116 59820 57069 54897 48586 34265 30538 41232
13640 41232 39740 34426 30470 28102 40399 33964 24854 25162 35908 29516 24872 18224 17141 38550
$$ packed form
13740D0833j3011r627M120K099Q701M087k1465N927k651n301j621P967J1835Q806
13726D0699P855j84l847O133j0035j9461j7910L435O744R96R129J3461n597m821
13712B6597K721o120O077o050r561K4672O708P80J4260j2513j0392k343k032j235
13698C1569P813J0929j5070j2054J523R305n70r199K691N227k398K092J2863o622
13684C8099N145Q93p246M643q865r564o594J081L086O68Q45R628J75q281L217
13669B6930q130l491o377O47J328Q721P063l459m079n184M555j052L144P412k893
13654B5135P527Q34n81j074K0009R832j566k96k751k172o311j4321l727J0694
13640D1232j492n314l956k368J2297o435r110L08J0746o392m644o648j083K1409
$$ plain form
13626 38550 53682 56448 52539 40897 27570 34080 38617 60647 60839 42416 45584 66756 72071
13613 72071 68567 66478 86305 109385 121930 115317 123826 142730 166228 208620 260188 344354
13601 344354 445544 542119 642089 732211 823201 884699 908887 900980 857122 782623 685226
13590 685226 597762 506657 421809 343221 292193 237136 192024 155835 145507 140190 131037 114071
13578 114071 93739 75841 71880 75345 73000 59923 45077 57006 66404 56384 46549 45438 43532
13565 43532 33961 20437 6553 10700 14726 29796 32682 28981 36068 26792 19632 18439 20960 24440
13551 24440 15227 20805 16116 4258 8515 15654 14258 8261 9336 13948 17301 22713 34608 31882
13537 31882 18145 17809 21366 29370 19398 11695 10264 16769 9271 5150 890 7226 1886 7970
$$ packed form
13626C8550J5132K766l909j1642j3327O510M537K2030J92j8423L168K1172N315
13613G2071l504k089J9827K3080J2545o613Q509J8904K3498M2392N1568Q4166
13601C44354J01190R6575R9970R0122R0990O1498K4188p907m3858p4499r7397
13590F85226q7464r1105q4848p8588n1028n5057m5112l6189j0328n317r153j6966
13578A14071k0332j7898l961L465k345j3077j4846J1929R398j0020r835j111j906
13565D3532r571j3524j3884M147M026J5070K886l701P087r276p160j193K521L480
13551B4440r213N578m689j1858M257P139j396n997J075M612L353N412J1895k726
13537C1882j3737l36L557Q004r972p703j431O505p498m121m260O336n340O084
$$ plain form
13523 7970 27279 37223 41830 32996 31751 45342 46329 30974 27722 31822 26751 17611 4800 13799
13509 13799 13939 31750 49984 36040 33425 31780 24866 24366 22949 14001 10557 4921 -823 -3305
13495 -3305 -3018 8073 18150 21213 15763 24084 34883 39691 41240 50333 49716 43173 19753 14289
13481 14289 25962 27789 21159 33652 37316 30498 15441 16096 13054 14832 19776 32045 23153 17552
13467 17552 10469 21195 18291 20124 31833 24843 13737 1978 -8001 6998 22768 23542 16671
13454 16671 18974 12687 6958 1128 14694 19052 8457 9104 24787 25504 18519 38287 57825 49688
13440 49688 33393 22272 24610 29568 34375 24805 11762 14253 14726 26724 23261 18002 21397 26394
13426 26394 46156 63901 61627 51730 44220 37993 41621 44914 28243 26526 28644 28730 25446 23716
$$ packed form
13523G970J9309R944M607q834j245J3591R87j5355l252M100n071r140j2811Q999
13509A3799J40J7811J8234j3944k615j645o914n00j417q948l444n636n744k482
13495c305K87J1091J0077L063n450Q321J0799M808J549R093o17o543k3420n464
13481A4289J1673J827o630J2493L664o818j5057O55l042J778M944J2269q892n601
13467A7552p083J0726k904J833J1709o990j1106j1759r979J4999J5770P74o871
13454A6671K303o287n729n830J3566M358j0595O47J5683P17o985J9768J9538q137
13440D9688j6295j1121K338M958M807r570j3043K491M73J1998l463n259L395M997
13426B6394J9762J7745k274r897p510o227L628L293j6671j717K118Q6l284j730
$$ plain form
13412 23716 17827 22504 24751 24821 9648 632 -9444 -4745 7195 20375 10858 10916 16950 14446
13398 14446 16932 17910 23439 34962 32132 30757 23499 19124 36841 49153 37774 35233 31133 20961
13384 20961 7900 13881 28534 40067 40468 23351 8680 -10706 -7383 3681 2847 -1411 1957
13371 1957 11359 17582 35295 39402 15197 10498 23539 45304 60906 51020 41189 28329 15022
13358 15022 7864 4627 3705 4586 12996 24179 31250 34268 34689 32491 29336 21820 22027 32243 31881
13343 31881 29160 28150 26360 30406 43384 40068 28128 23183 14364 23229 43062 43960 43350 41760
13329 41760 34678 35162 37397 35792 20824 11653 -4225 -9626 -10551 -1726 17697 30630 26906 27584
13315 27584 43549 51254 40948 38530 32062 22812 30276 40671 40898 40306 32575 41062 45497 39799
$$ packed form
13412B3716n889M677K247P0j5173r016j0076M699J1940J3180r517N8O034k504
13398A4446K486R78N529J1523k830j375p258m375J7717J2312j1379k541m100j0172
13384B0961j3061N981J4653J1533M01j7117j4671j9386L323J1064q34m258L368
13371A957R402O223J7713M107k4205m699J3041K1765J5602r886r831j2860j3307
13358A5022p158l237r22Q81Q410J1183P071L018M21k198l155p516K07J0216l62
13343C1881k721j010j790M046J2978l316j1940m945q819Q865J9833Q98o10j590
13329D1760p082M84K235j605j4968r171j5878n401r25Q825J9423J2933l724O78
13315B7584J5965P705j0306k418o468r250P464J0395K27n92p731Q487M435n698
$$ plain form
13301 39799 36285 52659 68480 66439 56754 46687 27422 14316 16147 10806 2211 8962 21617
13288 21617 28458 25093 21151 24295 24867 28912 37652 23292 2203 5509 27564 47005 57423
13275 57423 79709 89032 100522 105179 103435 101662 91320 99593 106945 124651 156622 215212 285868
13262 285868 381104 551594 819570 1207260 1740267 2284675 2556594 2485710 2080689 1500321
13252 1500321 1048438 754705 576675 457376 364313 302392 266966 246628 218679 192567
13242 192567 165020 145680 142580 117526 97462 102637 100420 88833 81679 67597 55979 57306
13230 57306 60428 68381 66988 60058 63346 56572 53606 64146 64575 56980 50060 49376 57302 51544 45172
13215 45172 44794 54558 69973 57536 69459 75282 74423 61455 43195 38822 38289 37679 31794 31489
$$ packed form
13301C9799l514J6374J5821k041r685j0067j9265j3106J831n341q595O751J2655
13288B1617O841l365l942L144N72M045Q740j4360k1089L306K2055J9441J0418
13275E7423K2286R323J1490M657j744j773j0342Q273P352J7706L1971N8590P0656
13262B85868R5236J70490K67976L87690N33007N44408K71919p0884m05021n80368
13252A500321m51883k93733j78030j19299r3063o1921l5426k0338k7949k6112
13242A92567k7547j9340l100k5054k0064N175k217j1587p154j4082j1618J327
13230E7306L122P953j393o930L288o774k966J0540M29p595o920o84P926n758o372
13215D5172l78R764J5415j2437J1923N823q59j2968j8260m373n33o10n885l05
$$ plain form
13201 31489 34805 36897 25752 18248 9769 -3808 -470 22783 39662 29164 20543 7090 7227
13188 7227 10309 17723 12638 -1710 -11708 -7330 -827 -6439 -4143 -2940 4280 10871 20307 17778
13174 17778 14514 2767 2273 3838 6127 -9014 -11194 -2882 4877 8064 18064 38591 46865 61887
13160 61887 50911 48317 59103 57376 51885 39899 32911 49356 67893 65536 49228 48024 34312
13147 34312 37992 55327 58504 56148 56826 67142 65413 66674 69095 64670 73630 53294 46491 60808
13133 60808 80514 77435 95216 99760 102513 102953 101860 100189 110841 125523 132356 127205 123109 103142
13119 103142 67583 37180 21213 18495 6976 -12508 -10843 14336 47672 78542 107911 93964
13107 93964 81605 76067 60022 60404 59748 63513 58303 53633 30830 11956 13494 17782 12203 22378
$$ packed form
13201C1489L316K092j1145p504q479j3577L338K3253J6879j0498q621j3453J37
13188G227L082P414n085j4348r998M378O503n612K296J203P220O591R436k529
13174A7778l264j1747m94J565K289j5141k180Q312P759L187J0000K0527Q274J5022
13160F1887j0976k594J0786j727n491j1986o988J6445J8537k357j6308j204j3712
13147C4312L680J7335L177k356O78J0316j729J261K421m425Q960k0336o803J4317
13133F0808J9706l079J7781M544K753M40j093j671J0652J4682O833n151m096j9967
13119A03142l5559l0403j5967k718j1519j9484J665K5179L3336L0870K9369j3947
13107I3964j2359n538j6045L82o56L765n210m670k2803j8874J538M288n579J0175
$$ plain form
13093 22378 29730 26037 26988 28336 17499 11466 19424 20167 29076 39851 51703 58865 77215 102168
13079 102168 114635 141722 164176 165866 139133 88467 71453 76991 96061 126111 165027 190452
13067 190452 191648 200199 213114 228860 225938 224771 207380 178443 131519 101192 88794 81118
13055 81118 61846 61756 70735 63656 49402 41324 47868 49259 55022 59522 57487 58600 61219 79893
13041 79893 104938 90549 80776 84957 76944 66250 56384 40757 27540 13242 25461 29435 47566
13028 47566 53635 60680 58415 77526 94295 93969 94592 92878 82989 73910 81491 80054 85845 92175
13014 92175 105539 110350 110354 107740 101709 101516 107570 113414 121958 115230 115671 110241 99687 93226 74051
12999 74051 62806 63834 61798 54741 56730 46632 38359 50553 52632 64012 76222 75255 83194
$$ packed form
13093B2378P352l693R51J348j0837o033P958P43Q909J0775J1852P162J8350K4953
13079A02168J2467K7087K2454J690k6733n0666j7014N538J9070L0050L8916K5425
13067A90452J196Q551J2915J5746k922j167j7391k8937m6924l0327j2398p676
13055H1118j9272r0Q979p079j4254q078O544J391N763M500k035J113K619J8674
13041G9893K5045j4389r773M181q013j0694r866j5627j3217j4298J2219L974J8131
13028D7566O069P045k265J9111J6769l26O23j714r889r079P581j437N791O330
13014I2175J3364M811Mk614o031j93O054N844Q544o728M41n430j0554o461j9175
12999G4051j1245J028k036p057J989j0098q273J2194K079J1380J2210r67P939
$$ plain form
12986 83194 106359 125128 125536 122047 121163 119296 134937 147440 153417 145675 128846 108099 95399
12973 95399 99012 115725 114872 78974 -18371 -108008 -170836 -179011 -144869 -115152 -83749 -44737
12961 -44737 -16490 5056 14557 20784 31465 44472 68811 86167 122641 192607 280034 371444
12949 371444 434250 443641 391454 293409 202969 179824 209410 246095 253495 213941 158172 89105
12937 89105 37564 43183 55106 53601 40677 48578 62057 89589 99589 101350 123887 139572
12925 139572 156004 156388 143215 136483 160035 183726 203531 224978 241892 263943 289216 317876
12913 317876 346637 377572 391655 405276 402494 379970 369547 352017 311567 274165 246774 234962
12901 234962 214143 203197 211545 212118 213692 214453 229970 245031 271656 290992 309664 326735 338592
$$ packed form
12986H3194K3165J8769M08l489q84j867J5641J2503N977p742j6829k0747j2700
12973I5399L613J6713q53l5898r7345q9637o2828q175L4142K9717L1403L9012
12961d4737K8247K1546R501O227J0681J3007K4339J7356L6474O9966Q7427R1410
12949C71444O2806R391n2187r8045r0440k3145K9586L6685P400l9554n5769o9067
12937H9105n1541N619J1923j505j2924P901J3479K7532J0000J761K2537J5685
12925A39572J6432L84j3173o732K3552K3691J9805K1447J6914K2051K5273K8660
12913C17876K8761L0935J4083J3621k782k2524j0423j7530m0450l7402k7391j1812
12901B34962k0819j0946Q348N73J574P61J5517J5061K6625J9336J8672J7071J1857
$$ plain form
12888 338592 353319 364994 382628 391305 401319 411706 436905 441051 434023 450673 481521 511830
12876 511830 551915 595479 636771 687686 750919 804637 827772 840198 839543 829989 805422 781317
12864 781317 781730 806433 871241 952140 1036877 1101047 1170498 1227147 1293877 1381846 1446790 1491642
12852 1491642 1523305 1557822 1598646 1676087 1811599 2010660 2235425 2462184 2725357 3010304
12842 3010304 3321416 3698784 4131284 4599378 5117603 5723115 6405306 7183258 8039238
12833 8039238 9049078 10345002 12044516 14345931 17429193 21517507 26926655 34023137
12825 34023137 43389035 56441252 76039731 107437251 158632660 238536783 345636581
12818 345636581 443481343 479211250 453366086 369617594 259750449 176946576 126648899
$$ packed form
12888C38592J4727J1675J7634Q677J0014J0387K5199M146p028J6650L0848L0309
12876E11830M0085M3564M1292N0915O3233N3718K3135J2426o55r554k4567k4105
12864G81317M13K4703O4808Q0899Q4737O4170O9451N6649O6730Q7969O4944M4852
12852A491642L1663L4517M0824P7441J35512J99061K24765K26759K63173K84947
12842C010304L11112L77368M32500M68094N18225O05512O82191P77952Q55980
12833H039238J009840J295924J699514K301415L083262M088314N409148P096482
12825C4023137R365898J3052217J9598479L1397520N1195409P9904123J07099798
12818C45636581R7844762L5729907k5845164q3748492j09867145q2803873n0297677
$$ plain form
12811 126648899 96196314 76673581 63187085 53194014 45412914 39077109 33821117
12804 33821117 29378868 25477326 22056996 19084808 16549600 14415614 12686521 11266715
12796 11266715 10101884 9147974 8353740 7686053 7121888 6624522 6154343 5729982 5366280
12787 5366280 5048275 4763179 4476798 4162807 3857765 3583543 3345440 3164294 3029858
12778 3029858 2907362 2785743 2667908 2573818 2549242 2602506 2705179 2772718 2719210 2557252
12768 2557252 2301708 2012322 1785491 1640535 1539078 1465669 1407312 1392700 1394390 1425672
12758 1425672 1466791 1504768 1518350 1492406 1446528 1375234 1293170 1230466 1193730 1164935 1144881
12747 1144881 1126860 1103232 1078008 1070179 1062490 1061482 1065356 1074993 1093945 1099474 1121092 1134219
$$ packed form
12811A26648899l0452585j9522733j3486496r993071p781100o335805n255992
12804C3821117m442249l901542l420330k972188k535208k133986j729093j419806
12796A1266715j164831r53910p94234o67687n64165m97366m70179m24361l63702
12787E366280l18005k85096k86381l13991l05042k74222k38103j81146j34436
12778C029858j22496j21619j17835r4090k4576N3264J02673O7539n3508j61958
12768B557252k55544k89386k26831j44956j01457p3409n8357j4612J690L1282
12758A425672M1119L7977J3582k5944m5878p1294q2064o2704l6736k8795k0054
12747A144881j8021k3628k5224p829p689j008L874R637J8952N529K1618J3127
$$ plain form
12735 1134219 1156565 1169650 1164302 1138218 1113324 1108716 1099580 1102027 1122692 1151413 1198429 1248563
12723 1248563 1304511 1387339 1507129 1660843 1904738 2284369 2907840 3877717 5164910 6162312
12713 6162312 5949892 4999048 4314055 4018429 4022839 4287849 4730111 5325891 6055122 6969124
12703 6969124 8156646 9618930 11287201 13019299 14696895 16115626 17065720 17388690
12695 17388690 17039167 16076562 14605983 12850100 11008978 9227407 7585139 6154587
12687 6154587 4992282 4121656 3516582 3112816 2875160 2717560 2629302 2565328 2541322 2575801
12677 2575801 2694977 2960383 3455004 4335859 5887635 8460096 12231580 16101853 16748380
12668 16748380 13124734 8918361 6119375 4434431 3384751 2725110 2281778 1920150
$$ packed form
12735A134219K2346J3085n348k6084k4894m608r136K447K0665K8721M7016N0134
12723A248563N5948Q2828J19790J53714K43895L79631O23471R69877J287193R97402
12713F162312k12420r50844o84993k95626M410K65010M42262N95780P29231R14002
12703F969124J187522J462284J668271J732098J677596J418731R50094L22970
12695A7388690l49523r62605j470579j755883j841122j781571j642268j430552
12687F154587j162305q70626o05074m03766k37656j57600q8258o3974k4006L4479
12677B575801J19176K65406M94621Q80855J551776K572461L771484L870273O46527
12668A6748380l623646m206373k798986j684944j049680o59641m43332l61628
$$ plain form
12660 1920150 1627909 1416304 1259484 1124097 1014953 919138 848819 799549 734037 672936
12650 672936 631147 589974 575310 558104 541940 531778 497700 488005 479947 471981 477951 461061
12638 461061 449200 430042 423288 418427 403765 391743 375422 351653 323746 306465 300995 294582
12626 294582 296800 307730 320647 310436 304962 289588 265545 260489 276129 282727 275518 284009 297119
12613 297119 306749 301512 292687 307864 339228 379109 409458 430455 469179 511588 550615 578785
12601 578785 597438 576982 530007 465933 421070 363442 317665 281396 269006 260964 250605 238522
12589 238522 226020 215527 224518 229751 212709 217618 215329 215774 208534 205179 215129 219500 216974 192908
12575 192908 188113 189582 191168 182392 170422 155822 151570 138731 145807 152372 162936 171580 176019
$$ packed form
12660A920150k92241k11605j56820j35387j09144r5815p0319m9270o5512o1101
12650F72936m1789m1173j4664j7206j6164j0162l4078r695q058p966N970j6890
12638D61061j1861j9158o754m861j4662j2022j6321k3769k7907j7281n470o413
12626B94582K218J0930J2917j0211n474j5374k4043n056J5640O598p209Q491J3110
12613B97119R630n237q825J5177L1364L9881L0349K0997L8724M2409L9027K8170
12601E78785J8653k0456m6975o4074m4863n7628m5777l6269j2390q042j0359j2083
12589B38522j2502j0493Q991N233j7042M909k289M45p240l355R950M371k526k4066
12575A92908m795J469J586q776j1970j4600m252j2839P076O565J0564Q644M439
$$ plain form
12562 176019 182599 185608 171562 168602 179934 180182 184651 198971 196814 187857 176511 171226 163369
12549 163369 175371 171155 162604 176716 183354 175824 169311 156725 151357 160703 162943 148260 146094
12536 146094 135083 132582 123881 126464 126811 128207 128034 135638 136750 145460 156058 167509 172655 186520
12522 186520 197980 205608 215379 215719 217841 215171 185717 142297 133722 128464 99010 70165 60442
12509 60442 67197 61087 43274 13803 18639 31587 46187 51968 47568 47517 61501 76090 70767
12496 70767 68645 66609 59334 66767 75664 69332 70572 66411 73500 73087 62587 52025 53083 58889
12482 58889 65976 68977 64484 75854 68829 53874 71425 79124 81170 78017 65746 67287 74013
12469 74013 72710 64756 72575 80912 75108 65285 70919 73703 61110 66434 62390 65401 65850 81949
$$ packed form
12562A76019O580L009j4046k960J1332K48M469J4320k157q957j1346n285p857
12549A63369J2002m216q551J4112O638p530o513j2586n368R346K240j4683k166
12536A46094j1011k501q701K583L47J396j73P604J112Q710J0598J1451N146J3865
12522A86520J1460P628R771L40K122k670k9454m3420q575n258k9454k8845r723
12509F0442O755o110j7813k9471M836J2948J4600N781m400n1J3984J4589n323
12496G0767k122k036p275P433Q897o332J240m161P089m13j0500j0562J058N806
12482E8889P087L001m493J1370p025j4955J7551P699K046l153j2271J541O726
12469G4013j303p954P819Q337n804r823N634K784j2593N324m044L011M49J6099
$$ plain form
12455 81949 98168 90745 75949 74656 81629 92765 90355 82157 83253 80208 74744 78054 82424 68712
12441 68712 74993 78417 81692 80153 67684 60083 58635 58965 59723 59196 69876 80216 72059 62272
12427 62272 53584 46011 47759 47623 29507 35281 46268 52576 37584 33318 38389 44350 46065 58392
12413 58392 51915 51944 53366 60555 52285 63825 61988 50234 46140 46223 54521 61882 67345 83752 90841
12398 90841 85807 89949 89273 85838 90094 91510 96324 95410 105458 118369 120284 143411 158048 165269
12384 165269 185669 217456 254082 285556 331430 394002 464186 578991 767420 1077524 1566888
12373 1566888 2154397 2579120 2650519 2409731 1882585 1349855 981566 733440 568734 454439
12363 454439 365102 304315 261690 224992 210629 202792 186054 182825 168483 148042 126671 118001
$$ packed form
12455H1949J6219p423j4796j293O973J1136k410q198J096l045n464L310M370j3712
12441F8712O281L424L275j539j2469p601j448L30P58n27J0680J0340q157r787
12427F2272q688p573J748j36j8116N774J0987O308j4992m266N071N961J715J2327
12413E8392o477K9J422P189q270J1540j837j1754m094Q3Q298P361N463J6407P089
12398I0841n034M142o76l435M256J416M814r14J0048J2911J915K3127J4637P221
12384A65269K0400L1787L6626L1474M5874O2572P0184J14805J88429L10104M89364
12373A566888N87509M24723P1399k40788n27146n32730l68289k48126j64706j14295
12363D54439q9337o0787m2625l6698j4363p837j6738l229j4342k0441k1371q670
$$ plain form
12351 118001 105716 96341 90454 86658 88173 94926 98613 92840 91178 85305 68134 48858 42081
12338 42081 43914 43736 40745 42562 36351 47630 53159 64952 68992 73128 79116 82898 79119 67885
12324 67885 62427 58527 55721 50968 51080 44635 41816 47671 63017 65704 66300 64836 60744 57911 54086
12309 54086 54695 62371 67688 55418 48162 46282 58462 61708 55337 53211 48898 53683 62601 49286
12295 49286 36621 50890 63655 66978 46268 47330 63486 70931 66202 56784 37905 46747 55695
12282 55695 54895 49750 41356 56421 69805 81267 79252 71007 86727 88081 104628 123940 141005
12269 141005 149688 155243 140638 122288 125269 112887 101771 90635 91297 94528 90334 56875 43154
12256 43154 50301 47972 53636 60975 53914 42250 34735 38644 33712 32260 48963 63434 60659 54054
$$ packed form
12351A18001j2285r375n887l796J515O753L687n773j662n873j7171j9276o777
12338D2081J833j78k991J817o211J1279N529J1793M040M136N988L782l779j1234
12324F7885n458l900k806m753J12o445k819N855J5346K687N96j464m092k833l825
12309E4086O09P676N317j2270p256j880J2180L246o371k126m313M785Q918j3315
12295D9286j2665J4269J2765L323k0710J062J6156P445m729r418j8879Q842Q948
12282E5695q00n145q394J5065J3384J1462k015q245J5720J354J6547J9312J7065
12269A41005Q683N555j4605j8350K981j2382j1116j1136O62L231m194l3459j3721
12256D3154P147k329N664P339p061j1664p515L909m932j452J6703J4471k775o605
$$ plain form
12242 54054 43460 39777 11711 2856 14822 17223 27584 36340 44416 47669 43247 46187 39609
12229 39609 39824 39337 44027 64828 88280 102317 110352 94741 62439 38713 26630 21088 17632
12216 17632 15768 16424 30956 44035 41716 46697 52801 59648 55687 54387 58458 64480 57750 49741
12202 49741 44872 43840 45371 47753 48659 43854 28150 21933 25066 27504 22452 17853 23525 31144
12188 31144 37964 31682 19855 16782 6645 10487 10184 14059 26455 46257 47150 40714 42458 39105
12174 39105 41399 30073 27597 38147 35164 8867 2802 3081 327 11078 21660 14147 17404
12161 17404 10801 6137 12042 22066 17470 12982 5021 -5676 -418 5544 25960 36313 31756
12148 31756 28258 17785 14496 33949 39046 38938 49313 51840 25818 7193 5309 11533 10821 22520
$$ packed form
12242E4054j0594l683k8066q855J1966K401J0361Q756Q076L253m422K940o578
12229C9609K15m87M690K0801K3452J4037Q035j5611l2302k3726j2083n542l456
12216A7632j864O56J4532J3079k319M981O104O847l961j300M071O022o730q009
12202D9741m869j032J531K382R06m805j5704o217L133K438n052m599N672P619
12188C1144O820o282j1827l073j0137L842l03L875J2396J9802Q93o436J744l353
12174C9105K294j1326k476J0550k983k6297o065K79k754J0751J0582p513L257
12161A7404o603m664N905J0024m596m488p961j0697N258N962K0416J0353m557
12148C1756l498j0473l289J9453N097j08J0375K527k6022j8625j884O224p12J1699
$$ plain form
12134 22520 27634 19848 4784 -544 8221 27441 36576 28764 31534 23309 19572 19935 17137 3363
12120 3363 8576 25210 14213 16701 13764 12472 14804 9681 19064 26724 16728 9632 6456 22650
12106 22650 30365 32342 38644 46251 43943 30459 24027 19515 11416 -3257 -4246 -491 643 4460
12092 4460 15222 27756 26690 18407 9378 11352 14201 20293 8571 -5596 -10327 2885 19222
12079 19222 28565 19323 31343 33158 28282 21425 20944 31028 26797 28491 19957 29324 32387 27052
12065 27052 25983 26425 23633 20791 13784 10943 8288 23932 23777 29624 36433 44881 49752 41027 21116
12050 21116 20820 27870 35618 26098 32081 30658 14447 3346 7693 4737 15843 19977 13069 19616
12036 19616 22273 21904 29609 21325 24720 23731 28688 25503 9140 4947 8622 15715 17551 15946 11032
$$ packed form
12134B2520N114p786j5064n328Q765J9220R135p812K770q225l737L63k798j3774
12120C363N213J6634j0997K488k937j292K332n123R383P660r996p096l176J6194
12106B2650P715J977O302P607k308j3484o432m512q099j4673r89L755J134L817
12092D460J0762J2534j066q283r029J974K849O092j1722j4167m731J3212J6337
12079A9222R343r242J2020J815m876o857m81J0084m231J694q534R367L063n335
12065B7052j069M42k792k842p007k841k655J5644j55N847O809Q448M871q725j9911
12050B1116k96P050P748r520N983j423j6211j1101M347k956J1106M134o908O547
12036A9616K657l69P705q284L395r89M957l185j6363m193L675P093J836j605m914
$$ plain form
12021 11032 5768 795 1285 5405 -2565 3868 20268 14528 6458 4123 7739 17399 30231 15457
12007 15457 12680 22803 18668 32200 29943 24488 27251 19620 23605 34658 37745 29751 5980
11994 5980 9000 29849 34317 18298 17255 19984 15617 24719 19357 7979 -6227 176 -1362 886
11980 886 3874 16288 16821 10218 11080 9250 13539 22138 24749 23536 26687 22462 7433 8516 14492
11965 14492 1411 6355 33965 36121 13323 11325 19806 12080 22329 32728 31983 31022 16896
11952 16896 9461 -2422 7367 8955 6946 15290 25558 29839 17727 2193 2097 -1163 11797 11322
11938 11322 5078 4057 8107 23316 30759 27692 23027 4078 3664 12362 33105 37256 26517 14758
11924 14758 6945 13012 7761 11971 18116 23798 28946 13875 4702 3353 10937 29689 35596 28485
$$ packed form
12021A1032n264m973M90M120p970O433J6400n740q070k335L616R660J2832j4774
12007A5457k777J0123m135J3532k257n455K763p631L985J1053L087p994k3771
11994E980L020K0849M468j6019j043K729m367R102n362j1378j4206O403j538K248
11980H86K988J2414N33o603Q62j830M289Q599K611j213L151m225j5029J083N976
11965A4492j3081M944K7610K156k2798j998Q481p726J0249J0399p45r61j4126
11952A6896p435j1883R789J588k009Q344J0268M281j2112j5534r6l260J2960m75
11938A1322o244j021M050J5209P443l067m665j8949m14Q698K0743M151j0739j1759
11924A4758p813O067n251M210O145N682N148j5071r173j349P584J8752N907p111
$$ plain form
11910 28485 19500 9773 8466 11812 17410 20899 7243 -8754 -12339 -620 615 -3952 15824
11897 15824 24627 24356 17837 10478 24280 14599 4049 -1100 -6801 5241 5563 -3845 -4671 6995
11883 6995 24729 24701 13735 17710 19557 20206 32981 38957 30889 29686 32658 36930 43822 41929 41992
11868 41992 33441 25393 22610 15508 10647 15411 10445 2251 -494 -9857 -10301 -230 9135 8615 21125
11853 21125 31083 38926 47301 40730 30667 16234 6801 10444 20534 27881 38599 26499 24300
11840 24300 16067 23387 15355 1533 -10765 -9275 2017 22021 37090 29330 18927 16260 8945
11827 8945 13593 10005 5494 11121 13343 7195 25102 23363 19675 28703 34105 32636 21096 28287
11813 28287 36381 30849 26695 24182 27300 29104 19656 21250 18585 8454 10940 -5434 -7883 -42
$$ packed form
11910B8485q985r727j307L346N598L489j3656j5997l585J1719J235m567J9776
11897A5824Q803k71o519p359J3802r681j0550n149n701J2042L22r408q26J1666
11883F995J7734k8j0966L975J847O49J2775N976q068j203K972M272O892j893O3
11868D1992q551q048k783p102m861M764m966q194k745r363m44J0071R365n20J2510
11853B1125R958P843Q375o571j0063j4433r433L643J0090P347J0718j2100k199
11840B4300q233P320q032j3822j2298J490J1292K0004J5069p760j0403k667p315
11827H945M648l588m511N627K222o148J7907j739l688R028N402j469j1540P191
11813B8287Q094n532m154k513L118J804r448J594k665j0131K486j6374k449P841
$$ plain form
11799 -42 9612 8936 8015 15029 19611 16743 3628 13297 16715 20436 29470 27014 8689 -4500 4720
11784 4720 14710 20889 14505 17039 20817 16890 17124 18676 20212 10381 329 9977 20412 20255 15517
11769 15517 16304 8087 4715 12839 12881 16167 21471 27331 19879 21337 14499 99 13637 5992 2757
11754 2757 9461 14420 15884 19508 22572 21385 24748 20900 17576 20250 33291 34272 35159 34666 36119
11739 36119 37765 26816 28475 18640 1381 -6253 -9313 -298 10904 17017 8409 7925 23236 18456
11725 18456 13843 11772 11154 11207 6568 20094 21586 25740 30124 20579 9299 -1049 8909 7309
11711 7309 -1338 9724 5223 1459 -9706 -7913 -3378 224 -907 -7989 -21635 -20057 -12556 -7665
11697 -7665 -2730 -5062 -4227 -4586 11282 15465 8732 10611 1244 6991 10883 17663 23594 22015 18041
$$ packed form
11799d2R654o76r21P014M582k868j3115R669L418L721R034k456j8325j3189R220
11784D720R990O179o384K534L778l927K34J552J536r831j0052R648J0435j57m738
11769A5517P87q217l372Q124M2L286N304N860p452J458o838j4400J3538p645l235
11754B757O704M959J464L624L064j187L363l848l324K674J3041R81Q87m93J453
11739C6119J646j0949J659r835j7259p634l060R015J1202O113q608m84J5311m780
11725A8456m613k071o18N3m639J3526J492M154M384r545j1280j0348R958j600
11711G309q647J1062m501l764j1165J793M535L602j131p082j3646J578P501M891
11697g665M935k332Q35l59J5868M183o733J879r367N747L892O780N931j579l974
$$ plain form
11682 18041 16760 17763 9067 3152 -2285 3899 -2152 9923 24749 29530 14404 6066 6904 23973
11668 23973 36832 37310 41995 41680 26935 23678 31716 42199 37028 43082 37991 35461 45346 44528
11654 44528 35751 23576 10243 2896 9871 27147 41868 33309 16449 11176 21636 24957 29874
11641 29874 32934 32901 17469 9249 10577 28386 34484 27180 14815 6857 2251 3013 13480 32663
11627 32663 25290 11140 5644 13130 5381 5220 -8342 -5186 13604 19639 15883 14198 18340 15381
11613 15381 21363 32236 25118 13728 15364 20001 23235 36092 29288 15971 11625 15490 23599
11600 23599 10373 -4697 1704 11526 19451 34879 24049 20833 18421 32948 39658 39712 47807 55766
11586 55766 62119 50721 45740 45841 34412 24989 23556 26224 23314 16458 792 -3763 -1194 -2869
$$ packed form
11682A8041j281J003q696n915n437O184o051J2075J4826M781j5126q338Q38J7069
11668B3973J2859M78M685l15j4745l257Q038J0483n171O054n091k530R885q18
11654D4528q777j2175j3333p347O975J7276J4721q559j6860n273J0460L321M917
11641B9874L060l3j5432q220J328J7809O098p304j2365p958m606P62J0467J9183
11627C2663p373j4150n496P486p749j61j3562L156J8790O035l756j685M142k959
11613A5381N982J0873p118j1390J636M637L234J2857o804j3317m346L865Q109
11600B3599j3226j5070O401R822P925J5428j0830l216k412J4527O710N4Q095P959
11586E5766O353j1398m981J01j1429r423j433K668k910o856j5666m555K569j675
$$ plain form
11572 -2869 8231 10807 5188 6841 8989 669 -314 7890 24945 21835 16163 15920 15549 12210 7003
11557 7003 19506 22985 18102 7248 -8748 -19534 -1153 16694 16497 13455 24160 21792 26209
11544 26209 25322 21127 16263 12027 16390 4969 6154 14044 37196 22923 24054 20252 5945 10073
11530 10073 21798 25457 26323 13203 12987 13907 31847 46008 42462 42117 42110 49600 48545 36653 31457
11515 31457 26870 27285 27246 12901 12641 13918 10333 5742 5010 23546 27150 30727 24243 30168 25280
11500 25280 20460 27079 31464 31279 28566 18917 8576 -6032 -3284 -387 13047 19363 19075 16188
11486 16188 7989 4818 18067 22041 15541 7413 13391 19045 16447 10500 4330 10245 14510 13640
11472 13640 20282 24049 23448 16506 12837 16289 22497 14077 1422 -2746 17877 25597 20777 11518
$$ packed form
11572b869J1100K576n619J653K148q320r83Q204J7055l110n672k43l71l339n207
11557G003J2503L479m883j0854j5996j0786J8381J7847j97l042J0705k368M417
11544B6209q87m195m864m236M363j1421J185P890K3152j4273J131l802j4307M128
11530A0073J1725L659Q66j3120k16R20J7940J4161l546l45pP490j055j1892n196
11515C1457m587M15l9j4345k60J277l585m591p32J8536L604L577o484N925m888
11500B5280m820O619M385j85k713r649j0341j4608K748K897J3434O316k88k887
11486A6188q199l171J3249L974o500q128N978N654k598n947o170N915M265q70
11472A3640O642L767o01o942l669L452O208q420j2655m168K0623P720m820r259
$$ plain form
11458 11518 9832 13468 26601 23894 34000 38221 43553 39788 39783 44197 43454 34422 23797 16028 13965
11443 13965 29968 27109 12544 13133 13618 12376 11130 13974 30629 48518 47856 45899 33544 20374
11429 20374 1808 7955 12491 23436 32752 32233 24139 23285 20714 12182 15212 27418 42060 42613
11415 42613 58114 48427 25644 17982 13469 11192 10717 18410 28594 35941 33067 15805 7350 -5293
11401 -5293 5128 11797 4089 1425 3670 4641 9000 10111 14327 21244 27098 28280 26067 18710 29642
11386 29642 24419 8377 11275 8392 2391 6365 12423 14862 16153 24989 25090 31566 32072 33845 37912
11371 37912 44073 31942 27690 14023 14006 26049 36182 36486 24236 32839 41542 35896 35348 22578
11357 22578 18180 33804 39148 43844 34807 28303 30996 38731 35440 39733 42367 28831 29732 28162
$$ packed form
11458A1518j686L636J3133k707J0106M221N332l765nM414p43r032j0625p769k063
11443A3965J6003k859j4565N89M85j242j246K844J6655J7889o62j957j2355j3170
11429B0374j8566O147M536J0945R316n19q094q54k571q532L030J2206J4642N53
11415D2613J5501r687k2783p662m513k277m75P693J0184P347k874j7262q455j2643
11401e293J0421O669p708k664K245R71M359J111M216O917N854J182k213p357J0932
11386B9642n223j6042K898k883o001L974O058K439J291Q836J01O476N06J773M067
11371C7912O161j2131m252j3667j7J2043J0133L04j2250Q603Q703n646n48j2770
11357B2578m398J5624N344M696r037o504K693P735l291M293K634j3536R01j570
$$ plain form
11343 28162 29214 27979 28328 37437 37256 46321 44214 42414 53007 48970 41241 41143 45778 38780 32148
11328 32148 28307 25546 31615 33709 28615 32563 40066 49179 41053 46932 33499 21874 15838 21057
11314 21057 30598 32651 32375 34441 33701 30185 27749 33094 27339 24868 25850 11995 -3612 -1641 29605
11299 29605 49482 59708 58489 49879 59858 54127 34405 23825 35443 43484 41631 30586 24316
11286 24316 19182 28957 38677 51813 57449 52543 50486 45384 40955 43259 60535 62913 44758 31790
11272 31790 31150 38133 53394 67921 66386 59001 57786 58170 56887 61038 58121 39559 41752 53262
11258 53262 52588 55581 33489 21398 32601 37925 35697 28064 28698 33632 43002 48962 56724 62025
11244 62025 67971 73189 63535 44408 41585 55535 59067 57422 53637 51358 52487 59966 64031 84105
$$ packed form
11343B8162J052j235L49R109j81R065k107j800J0593m037p729r8M635o998o632
11328C2148l841k761O069K094n094L948P503R113q126N879j3433j1625o036N219
11314B1057R541K053k76K066p40l516k436N345n755k471R82j3855j5607J971L1246
11299B9605J9877J0226j219q610R979n731j9722j0580J1618Q041j853j1045o270
11286B4316n134R775R720J3136N636m906k057n102m429K304J7276K378j8155j2968
11272C1790o40O983J5261J4527j535p385j215L84j283M151k917j8562K193J1510
11258E3262o74K993k2092j2091J1203N324k228p633O34M934R370N960P762N301
11244F2025N946N218r654j9127k823J3950L532j645l785k279J129P479M065K0074
$$ plain form
11230 84105 99337 82462 63438 64207 62523 57965 43336 41439 38344 35461 26101 29601 36404 37646
11216 37646 33276 34884 52061 64659 48562 44762 51781 62327 50022 21607 20344 37162 49228
11203 49228 52135 55620 55769 52464 40410 38296 47431 48813 37693 38056 26339 24974 36787 44515
11189 44515 40892 39040 44443 46411 49128 62048 62712 59420 53957 45628 38781 49477 58004 60337
11175 60337 53633 46330 37304 33657 36207 41676 35525 34015 29974 39170 49363 67953 69479 45804
11161 45804 38580 45835 60986 59420 52247 61467 67691 71842 62089 52135 53218 56370 59436 70472
11147 70472 92204 110634 123764 115861 126811 161043 167496 149926 130657 106099 85152 74000
11135 74000 88648 80506 77684 91560 97073 86533 90269 84856 83658 89777 94424 92406 77828
$$ packed form
11230H4105J5232j6875j9024P69j684m558j4629j897l095k883r360L500O803J242
11216C7646m370J608J7177J2598j6097l800P019J0546j2305k8415j263J6818J2066
11203D9228K907L485J49l305j2054k114R135J382j1120L63j1717j365J1813P728
11189D4515l623j852N403J968K717J2920O64l292n463q329o847J0696Q527K333
11175F0337o704p303r026l647K550N469o151j510m041R196J0193J8590J526k3675
11161D5804p224P255J5151j566p173R220O224M151r753r954J083L152L066J1036
11147G0472K1732J8430J3130p903J0950L4232O453j7570j9269k4558k0947j1152
11135G4000J4648q142k822J3876N513j0540L736n413j198O119M647k018j4578
$$ plain form
11122 77828 69255 70010 59843 62377 62681 54156 61371 65562 55127 46230 40742 52672 56484 49002
11108 49002 47146 52773 61869 70841 75394 83156 76019 66305 57887 54750 67515 74180 76288 76660
11094 76660 72010 49421 33041 31034 40154 55291 57635 55519 54397 48401 38326 53781 63707
11081 63707 65452 71568 67763 78071 79524 70853 65104 63092 71499 72497 62667 61410 59622 64614
11067 64614 69559 70402 64459 66825 62696 60848 60713 66444 77107 79770 79201 83288 86251 80363 77334
11052 77334 81744 84053 79292 79370 79522 78681 73286 80234 77111 79149 94319 87843 91043 91961 86302
11037 86302 85968 86305 90398 97951 96874 81227 55318 45721 51514 54460 53660 55182 58560 70018
11023 70018 67775 69254 73990 81720 87866 75607 85750 95571 93957 80463 77559 76378 84982 80718
$$ packed form
11122G7828q573P55j0167K534L04q525P215M191j0435q897n488J1930L812p482
11108D9002j856N627R096Q972M553P762p137r714q418l137J2765O665K108L72
11094G6660m650k2589j6380k007R120J5137K344k116j122n996j0075J5455R926
11081F3707J745O116l805J0308J453q671n749k012Q407R98r830j257j788M992
11067F4614M945Q43n943K366m129j848j35N731J0663K663n69M087K963n888l029
11052G7334M410K309m761P8J52q41n395O948l123K038J5170o476L200R18n659
11037H6302l34L37M093P553j077j5647k5909r597N793K946q00J522L378J1458
11023G0018k243J479M736P730O146j2259J0143R821j614j3494k904j181Q604m264
$$ plain form
11009 80718 96962 102416 95761 96010 89053 84215 76938 76103 80667 83855 85300 88631 85324 82490 97365
10994 97365 107778 102924 80840 80104 93340 94606 88934 88381 96545 96502 106134 105230 97466 79213 80750
10979 80750 85293 80019 71248 84245 84827 84674 87425 91281 104106 101476 92854 77629 77846 88497
10965 88497 86657 77862 80359 96293 100726 109102 112179 118047 124193 117807 104553 95774 87618 91406
10951 91406 101934 107404 102552 107192 117934 107632 109898 102510 94168 97424 106214 115206 122735 115279
10937 115279 105776 100456 102718 111793 106761 109631 109553 106528 105473 102312 106159 107410 106105 107345 119196
10922 119196 114123 113696 111036 115447 120656 121401 129315 138431 131650 127141 137643 129025 108717 117055
10908 117055 109183 98519 103441 114667 117830 115567 119674 119840 129285 127551 130218 125181 124998 125556
$$ packed form
11009H0718J6244N454o655K49o957m838p277q35M564L188J445L331l307k834J4875
10994I7365J0413m854k2084p36J3236J266n672n53Q164m3R632r04p764j8253J537
10979H0750M543n274q771J2997N82j53K751L856J2825k630q622j5225K17J0651
10965H8497j840q795K497J5934M433Q376L077N868O146o386j3254q779q156L788
10951I1406J0528N470m852M640J0742j0302K266p388q342L256Q790Q992P529p456
10937A15279r503n320K262R075n032K870p8l025j055l161L847J251j305J240J1851
10922A19196n073m27k660M411N209P45P914R116o781m509J0502q618k0308Q338
10908A17055p872j0664M922J1226L163k263M107J66R445j734K667n037j83N58
$$ plain form
10894 125556 123500 136618 162904 161622 149361 155621 151785 153722 142222 136845 138998 153607 157981
10881 157981 159416 175491 183489 182900 170780 170359 172974 174936 172975 153952 136150 124528 121968
10868 121968 130429 133769 143463 133054 139329 144157 152465 159364 172237 185310 185210 172682 158690
10855 158690 142565 140786 149960 150785 154416 166307 179182 179676 172700 193698 189866 164810 149072
10842 149072 157918 164323 165345 173460 179274 186482 190547 178012 190782 193446 179713 186449 195465
10829 195465 186261 172825 175876 182115 180024 188835 192615 200686 213464 213523 206817 202697 205625 198748
10815 198748 193198 204042 221991 233941 230448 230280 222705 216646 223357 217872 207491 196070 198254
10802 198254 217705 217574 212459 216871 214523 204286 208590 213150 219939 243164 239380 248955 257969 253432
$$ packed form
10894A25556k056J3118K6286j282j2261O260l836J937j1500n377K153J4609M374
10881A57981J435J6075P998n89j2120m21K615J962j961j9023j7802j1622k560
10868A21968Q461L340R694j0409O275M828Q308O899J2873J3073j00j2528j3992
10855A58690j6125j779R174Q25L631J1891J2875M94o976K0998l832k5056j5738
10842A49072Q846O405J022Q115N814P208M065j2535J2770K664j3733O736R016
10829A95465r204j3436L051O239k091Q811L780Q071J2778N9o706m120K928o877
10815A98748n550J0844J7949J1950l493j68p575o059O711n485j0381j1421K184
10802A98254J9451j31n115M412k348j0237M304M560O789K3225l784R575R014m537
$$ plain form
10788 253432 244634 239359 229806 225182 224863 213554 210359 223118 229136 231661 231573 234306 244556 238874
10774 238874 233299 253446 260182 259450 262121 270839 271821 282696 273476 263513 256067 261962 274830 286266
10760 286266 284949 279854 284376 290713 300551 300910 310063 321858 306962 298751 294533 296770 296876 305113
10746 305113 322610 328210 335432 331247 318692 313526 307318 295521 303057 319345 339806 345162 334593
10733 334593 339159 349676 355409 364784 360034 362158 375363 376070 362941 357939 350615 352757 358081 352047
10719 352047 356601 373981 388788 397320 398543 402757 394946 401947 403774 401537 397159 398159 416887
10706 416887 435269 448633 450929 450720 452960 447624 442031 441139 445977 447751 443542 458131 468815 482299
10692 482299 488553 490974 483864 476621 480708 499554 504903 511852 523609 532922 532485 532828 536016 532170
$$ packed form
10788B53432q798n275r553m624l19j1309l195J2759O018K525q8K733J0250n682
10774B38874n575K0147O736p32K671Q718R82J0875r220r963p446N895J2868J1436
10760B86266j317n095M522O337R838L59R153J1795j4896q211m218K237J06Q237
10746C05113J7497N600P222m185j2555n166o208j1797P536J6288K0461N356j0569
10733C34593M566J0517N733R375m750K124J3205P07j3129n002p324K142N324o034
10719C52047M554J7380J4807Q532J223M214p811P001J827k237m378J000J8728
10706D16887J8382J3364K296k09K240n336n593q92M838J774m209J4589J0684J3484
10692D82299O254K421p110p243M087J8846N349O949J1757R313m37L43L188l846
$$ plain form
10678 532170 541389 553784 559691 563694 561270 547810 563371 584785 585050 578438 582282 594570 598171
10665 598171 594600 594223 597550 618097 623054 624362 635879 644803 648759 663708 682862 676717 684010
10652 684010 695776 710431 725928 717678 710020 725731 726990 733182 746902 755037 749362 753774 774962
10639 774962 775645 782041 787032 795567 806733 811859 821796 845328 850115 855553 866840 874666 884811
10626 884811 894020 896262 908390 907321 913384 934556 955085 982157 981541 968985 973972 979636 1003511
10613 1003511 1026055 1039932 1059861 1063040 1065777 1078134 1092233 1125631 1152399 1178290 1204991 1205807
10601 1205807 1211645 1220389 1220309 1222035 1232953 1243813 1267733 1290126 1320073 1347222 1361509 1376004
10589 1376004 1392286 1406946 1431136 1451497 1464723 1489012 1500088 1504582 1542396 1554739 1567816
$$ packed form
10678E32170R219J2395N907M003k424j3460J5561K1414K65o612L844J2288L601
10665E98171l571l77L327K0547M957J308J1517Q924L956J4949J9154o145P293
10652F84010J1766J4655J5497q250p658J5711J259O192J3720Q135n675M412K1188
10639G74962O83O396M991Q535J1166N126R937K3532M787N438J1287P826J0145
10626H84811R209K242J2128j069O063K1172K0529K7072o16j2556M987N664K3875
10613A003511K2544J3877J9929L179K737J2357J4099L3398K6768K5891K6701Q16
10601A205807N838Q744q0J726J0918J0860K3920K2393K9947K7149J4287J4495
10589A376004J6282J4660K4190K0361J3226K4289J1076M494L7814J2343J3077
$$ plain form
10578 1567816 1593918 1625781 1651115 1669498 1703898 1751976 1757619 1770775 1804148 1834774 1856390
10567 1856390 1871922 1904912 1936051 1972512 2009129 2048686 2077667 2109191 2140233 2180863 2219325
10556 2219325 2257447 2291696 2332321 2370225 2397399 2436307 2478203 2528730 2564333 2620017 2671848
10545 2671848 2719262 2758720 2807117 2853679 2899038 2934674 3011444 3086905 3143974 3204365 3291881
10534 3291881 3372451 3430499 3478101 3543968 3609079 3669055 3726757 3785983 3851731 3930235 4005837
10523 4005837 4074329 4136472 4212530 4277612 4346531 4436616 4524339 4587153 4654935 4754575 4851227
10512 4851227 4941112 5018913 5094871 5176784 5262982 5362550 5462635 5560614 5650090 5752031 5882302
10501 5882302 5991529 6105578 6189286 6289604 6400312 6508939 6607811 6703864 6812090 6930228
$$ packed form
10578A567816K6102L1863K5334J8383L4400M8078N643J3156L3373L0626K1616
10567A856390J5532L2990L1139L6461L6617L9557K8981L1524L1042M0630L8462
10556B219325L8122L4249M0625L7904K7174L8908M1896N0527L5603N5684N1831
10545B671848M7414L9458M8397M6562M5359L5636P6770P5461N7069O0391Q7516
10534C291881Q0570N8048M7602O5867O5111N9976N7702N9226O5748P8504P5602
10523D005837O8492O2143P6058O5082O8919R0085Q7723O2814O7782R9640R6652
10512D851227Q9885P7801P5958Q1913Q6198R9568J00085R7979Q9476J01941J30271
10501E882302J09227J14049Q3708J00318J10708J08627R8872R6053J08226J18138
$$ plain form
10491 6930228 7049048 7148170 7248271 7348015 7451272 7549383 7646293 7753499 7858595 7959770
10481 7959770 8051007 8137908 8229274 8320913 8416408 8500457 8571391 8622293 8672436 8720398 8778912
10470 8778912 8849630 8898109 8918594 8937794 8957181 8980730 9004535 9010369 9002402 9010542 9018724 9016920
10458 9016920 8997301 8967840 8927587 8902899 8872957 8831174 8776177 8713988 8650758 8577893 8511368
10447 8511368 8445052 8365308 8285412 8206185 8118373 8021221 7929472 7842261 7759235 7671338 7561982
10436 7561982 7446037 7328594 7237106 7145706 7062411 6953985 6842514 6749654 6652595 6548260
10426 6548260 6436963 6324700 6219278 6103479 6002021 5910450 5818050 5721186 5628193 5534358
10416 5534358 5443493 5338355 5250784 5177058 5079912 4972826 4886007 4806573 4732897 4646872 4553976
$$ packed form
10491F930228J18820R9122J00101R9744J03257R8111R6910J07206J05096J01175
10481G959770R1237Q6901R1366R1639R5495Q4049P0934N0902N0143M7962N8514
10470H778912P0718M8479K0485J9200J9387K3549K3805N834p967Q140Q182j804
10458I016920j9619k9461m0253k4688k9942m1783n4997o2189o3230p2865o6525
10447H511368o6316p9744p9896p9227q7812r7152r1749q7211q3026q7897j09356
10436G561982j15945j17443r1488r1400q3295j08426j11471r2860r7059j04335
10426F548260j11297j12263j05422j15799j01458r1571r2400r6864r2993r3835
10416E534358r0865j05138q7571p3726r7146j07086q6819p9434p3676q6025r2896
$$ plain form
10405 4553976 4485578 4397117 4322572 4257043 4190810 4117463 4046397 3980119 3911827 3848435 3792019
10394 3792019 3732981 3660575 3590029 3540613 3488406 3426864 3374155 3307975 3249253 3189925 3129888
10383 3129888 3082163 3021374 2976487 2936910 2884645 2835363 2789333 2745837 2696985 2650496 2611793
10372 2611793 2580554 2535838 2498624 2458793 2415472 2384465 2362324 2324204 2282209 2238139 2202659
10361 2202659 2182649 2164369 2140674 2104972 2063758 2037245 2009154 1984820 1967410 1938680 1908947
10350 1908947 1883331 1850811 1814011 1787812 1769819 1744923 1717677 1700070 1669684 1645351 1637840
10339 1637840 1609915 1594381 1571395 1549603 1544811 1521519 1491331 1483326 1479358 1461670 1427635 1405630
10327 1405630 1380255 1357633 1358183 1347922 1319486 1296454 1290216 1278455 1259218 1252513 1244917 1227264
$$ packed form
10405D553976o8398q8461p4545o5529o6233p3347p1066o6278o8292o3392n6416
10394C792019n9038p2406p0546m9416n2207o1542n2709o6180n8722n9328o0037
10383C129888m7725o0789m4887l9577n2265m9282m6030m3496m8852m6489l8703
10372B611793l1239m4716l7214l9831m3321l1007k2141l8120m1995m4070l5480
10361B202659k0010j8280k3695l5702m1214k6513k8091k4334j7410k8730k9733
10350A908947k5616l2520l6800k6199j7993k4896k7246j7607l0386k4333p511
10339A637840k7925j5534k2986k1792m792k3292l0188q005l968j7688l4035k2005
10327A405630k5375k2622N50j0261k8436k3032o238j1761j9237o705p596j7653
$$ plain form
10315 1227264 1210767 1221334 1205772 1171352 1157097 1130788 1119010 1125923 1131356 1113105 1097693 1082106
10303 1082106 1060861 1045538 1018522 989832 987568 994368 985101 975330 960171 947928 926743 923150
10291 923150 918786 907818 898654 875889 864087 863713 861593 856282 856980 840911 839533 839092 833321 820714
10277 820714 818202 801055 787487 788134 781946 779894 764547 759340 751532 750937 752862 749658 717437 698587
10263 698587 681158 664073 661025 656417 644286 657299 671249 670633 669659 670608 666084 663259 671043 662181
10249 662181 637256 628758 630619 627046 616180 603660 598659 604730 612185 605241 587809 582522 572659
10236 572659 566718 571056 554829 538132 550369 563767 560494 555909 539912 522270 502419 505664
10224 505664 520139 525960 527598 531818 528347 519418 519892 513877 505885 514180 518697 500797 498342 496914
$$ packed form
10315A227264j6497J0567j5562l4420j4255k6309j1778O913N433j8251j5412j5587
10303A082106k1245j5323k7016k8690k264O800r267r771j5159j2243k1185l593
10291I23150m364j0968r164k2765j1802l74k120n311O98j6069j378m41n771j2607
10277H20714k512j7147j3568O47o188k052j5347n207p808n95J925l204l2221j8850
10263F98587j7429j7085l048m608j2131J3013J3950o16r74R49m524k825P784q862
10249F62181k4925q498J861l573j0866j2520n001O071P455o944j7432n287r863
10236E72659n941M338j6227j6697J2237J3398l273m585j5997j7642j9851L245
10224E05664J4475N821J638M220l471q929M74o015p992Q295M517j7900k455j428
$$ plain form
10210 496914 487817 486214 476843 468308 461436 454109 446021 445468 445924 439482 444325 439461 438648 434500 428341
10195 428341 420539 426174 422114 413020 398431 393882 394063 392616 397289 392502 398287 390160 378569 371827
10181 371827 361018 352179 358552 350955 356993 360469 354524 350492 364470 365444 353960 343746 348816
10168 348816 353264 360836 368503 367342 349529 339111 331606 321959 331168 353276 362387 342142 341219
10155 341219 326609 318120 328106 329169 323775 301081 289236 289470 292183 303966 307651 302141 296444
10142 296444 289023 286167 282987 268126 261273 261198 264333 269784 275275 283117 276573 271214 264829 261397
10128 261397 247337 243169 250651 269136 280758 291120 274943 253331 260429 266193 266127 270179 281193
10115 281193 286069 295491 293184 273505 267702 274745 281621 275882 276178 283598 275737 271560 257560 249862
$$ packed form
10210D96914r097j603r371q535o872p327q088n53M56o442M843m864q13m148o159
10195D28341p802N635m060r094j4589m549J81j447M673m787N785q127j1591o742
10181C71827j0809q839O373p597O038L476n945m032J3978R74j1484j0214N070
10168C48816M448P572P667j161j7813j0418p505r647R209K2108R111k0245r23
10155C41219j4610q489R986J063n394k2694j1845K34K713J1783L685n510n697
10142B96444p421k856l180j4861o853p5L135N451N491P842o544n359o385l432
10128B61397j4060m168P482J8485J1622J0362j6177k1612P098N764o6M052J1014
10115B81193M876R422k307j9679n803P043O876n739K96P420p861m177j4000p698
$$ plain form
10101 249862 242798 231049 234209 240733 230240 228769 229307 233919 236927 216103 209336 217409 220488 226350
10087 226350 226424 217111 212335 210462 208791 213623 218346 212225 206163 196643 182366 185704 197329 195057
10073 195057 195927 200586 193514 183650 176835 180628 186372 195505 199649 196531 193860 197088 183514 180307
10059 180307 178367 179141 180894 191491 195588 189789 183496 178720 177146 191226 197815 202052 197260 208927
10045 208927 221438 222398 227152 227236 228220 227832 232812 241091 257999 277954 300055 324883 375803 432607
10031 432607 548199 776431 1192853 1919563 3114819 4373259 3961603 2379894 1417677
10022 1417677 960233 732569 591699 483062 420627 368642 323843 295353 285462 272281 242582
10011 242582 235325 232863 217102 224488 231070 228737 218215 190588 172842 171365 163087 165590 169857
$$ packed form
10101B49862p064j1749L160O524j0493j471N38M612L008k0824o767Q073L079N862
10087B26350P4r313m776j873j671M832M723o121o062r520j4277L338J1625k272
10073A95057Q70M659p072r864o815L793N744R133M144l118k671L228j3574l207
10059A80307j940P74J753J0597M097n799o293m776j574J4080O589M237m792J1667
10045B08927J2511R60M754Q4R84l88M980Q279J6908J9955K2101K4828N0920N6804
10031D32607J15592K28232M16422P26710J195256J258440m11656j581709r62217
10022A417677m57444k27664j40870j08637o2435n1985m4799k8490r891j3181k9699
10011B42582p257k462j5761P386O582k333j0522k7627j7746j477q278K503M267
$$ plain form
9998 169857 169165 173749 183626 189169 184068 169801 162461 163789 155544 134342 132532 132542 134863 145309
9984 145309 164161 159807 149369 147113 161371 166421 145436 143864 147593 151471 140134 138132 136728
9971 136728 136568 138874 131213 125149 126581 127336 123293 126419 130428 108852 117495 130926 128749 123946
9957 123946 126922 124574 138238 146695 149775 151032 151441 140323 144261 152679 152302 150008 157428 187302
9943 187302 217515 272440 354349 414272 402382 343057 258370 205458 178955 165687 161746 145220
9931 145220 150489 149613 147043 140492 139068 143668 134235 127200 120973 116887 119726 113300 109603 110634 128687
9916 128687 129742 129548 118061 105829 106492 112950 110824 112702 119634 114753 116324 111598 105091 103802
9902 103802 95095 96087 98365 96659 91295 98804 102567 97472 96095 87491 101953 142643 134528 109838
$$ packed form
9998A69857o92M584R877N543n101j4267p340J328q245k1202j810J0K321J0446
9984A45309J8852m354j0438k256J4258N050k0985j572L729L878j1337k002j404
9971A36728j60K306p661o064J432P55m043L126M009k1576Q643J3431k177m803
9957A23946K976k348J3664Q457L080J257M09j1118L938Q418l77k294P420K9874
9943A87302L0213N4925Q1909N9923j1890n9325q4687n2912k6503j3268l941j6526
9931A45220N269q76k570o551j424M600r433p035o227m086K839o426l697J031J8053
9916A28687J055j94j1487j2232O63O458k126J878O932m881J571m726o507j289
9902A03802q707R92K278j706n364P509L763n095j377q604J4462M0690q115k4690
$$ plain form
9888 109838 106419 91317 99095 93515 77389 76965 100083 114813 116971 104859 99372 112603 105897
9875 105897 102782 91070 102278 99197 100236 97202 75954 83776 95964 90665 102348 108807 99666
9862 99666 100600 111667 104771 98287 102911 103048 94949 101815 117834 119771 118677 119233 113894 114573 103160
9847 103160 99027 100418 92150 95050 86024 81001 97984 114097 118515 125060 111742 116503 127349
9834 127349 129360 128182 114894 118598 121641 143891 152747 149392 134087 121237 107389 95910 102060
9821 102060 98445 94820 96613 96224 93801 94697 97549 95832 101700 98523 98781 102772 80412 68743 72089
9806 72089 77678 78461 62103 55520 59059 66813 65536 70599 84150 73557 74695 71230 67100 59566
9792 59566 61485 67240 70065 73690 77353 90467 93678 74578 69696 56955 69098 87086 84431
$$ packed form
9888A09838l419j5102P778n580j6126m24K3118J4730K158j2112n487J3231o706
9875A05897l115j1712J1208l081J039l034k1248P822J2188n299J1683O459r141
9862I9666R34J1067o896o484M624J37q099O866J6019J937j094N56n339O79j1413
9847A03160m133J391q268K900r026n023J6983J6113M418O545j3318M761J0846
9834A27349K011j178j3288L704L043K2250Q856l355j5305j2850j3848j1479O150
9821A02060l615l625J793l89k423Q96K852j717N868l177K58L991k2360j1669L346
9806G2089N589P83j6358o583L539P754j277N063J3551j0593J138l465m130p534
9792E9566J919N755K825L625L663J3114L211j9100m882j2741J2143J7988k655
$$ plain form
9779 84431 70517 59916 57558 47511 50424 71407 81202 74807 83196 97638 97712 93701 83337 82456
9765 82456 90052 84460 82527 88266 75993 55999 62764 71167 75043 79032 87931 101345 116536 136210
9751 136210 146064 147773 145651 127333 106053 88431 80349 74925 75851 75389 71980 75381 71828 76788
9737 76788 88052 86355 89132 90109 87536 82710 81008 76064 70799 60040 79438 85717 65246 63045
9723 63045 54113 55073 62967 75568 92920 95482 95186 93404 105917 94748 82178 62993 52150
9710 52150 56422 56413 56981 62001 65287 64220 73474 81133 69907 56831 47733 65155 79741 65248
9696 65248 56734 75070 81696 87669 75125 54188 49210 51364 60477 62494 47439 47348 41790 41310
9682 41310 54984 64851 80250 85147 80915 74111 57485 52512 59944 50720 47196 50886 61333 73993
$$ packed form
9779H4431j3914j0601k358j0047K913K0983R795o395Q389J4442P4m011j0364q81
9765H2456P596n592j933N739j2273j9994O765Q403L876L989Q899J3414J5191J9674
9751A36210R854J709k122j8318k1280j7622q082n424R26m62l409L401l553M960
9737G6788J1264j697K777R77k573m826j702m944n265j0759J9398O279k0471k201
9723F3045q932R60P894J2601J7352K562k96j782J2513j1169j2570j9185j0843
9710E2150M272rN68N020L286j067R254P659j1226j3076r098J7422J4586j4493
9696F5248q514J8336O626N973j2544k0937m978K154R113K017j5055r1n558m80
9682D1310J3674R867J5399M897m232o804j6626m973P432r224l524L690J0447J2660
$$ plain form
9668 73993 78584 79598 77781 75167 70005 72648 77272 77553 78496 66641 59721 50868 56896 61070 48754
9653 48754 46670 48074 50578 48500 58097 58794 69072 73475 66294 61070 65645 62346 61720 69927 81712
9638 81712 87450 89074 84386 84087 81505 74098 54526 58873 67038 69623 66774 85151 87426 69334
9624 69334 66634 64052 63438 57659 68318 84671 84033 82446 80821 80091 91422 93687 100310 105126 111159
9609 111159 93292 77906 72704 76579 74711 77645 72055 66780 61180 69649 72158 85115 82214 84642
9595 84642 80801 72487 69316 65362 57682 50758 48349 59518 68600 62402 58413 72194 71980 67207
9581 67207 57502 64174 51013 53601 62198 48284 42653 43864 42679 43077 49239 58417 57884 57053 61749
9566 61749 53097 43748 54494 64514 61006 53930 59491 74897 65043 46278 42754 54838 67597
$$ packed form
9668G3993M591J014j817k614n162K643M624K81R43j1855o920q853O028M174j2316
9653D8754k084J404K504k078R597O97J0278M403p181n224M575l299o26Q207J1785
9638H1712N738J624m688k99k582p407j9572M347Q165K585k849J8377K275j8092
9624F9334k700k582o14n779J0659J6353o38j587j625p30J1331K265O623M816O033
9609A11159j7867j5386n202L875j868K934n590n275n600Q469K509J2957k901K428
9595H4642l841q314l171l954p680o924k409J1169R082o198l989J3781k14m773
9581F7207r705O672j3161K588Q597j3914n631J211j185L98O162R178n33q31M696
9566F1749q652r349J0746J0020l508p076N561J5406r854j8765l524J2084J2759
$$ plain form
9553 67597 75154 76396 76683 59217 41186 36057 53725 66152 61457 51334 45804 51109 59741 68069
9539 68069 52909 72383 94982 98422 78766 75037 75815 82093 77272 78343 82575 78037 68839 71745
9525 71745 71976 71126 58209 53314 74758 78979 88118 85542 64349 65602 66643 59529 62857 64260
9511 64260 63939 65747 59703 46291 45858 55777 66582 71185 66383 71601 72066 62803 56481 62487 61162
9496 61162 57648 60646 75105 68718 61173 65137 74164 74191 66975 49684 47762 60324 76803 84906
9482 84906 77493 75736 71141 62665 63708 64355 57775 55300 49457 57465 58378 65232 78315 83472 83393
9467 83393 59938 62461 74213 64385 68189 90425 96215 80231 69454 72125 63211 68106 57165
9454 57165 67175 61677 64646 68052 50944 48333 59579 60356 62779 71194 69264 63457 69770 65372
$$ packed form
9553F7597P557J242K87j7466j8031n129J7668J2427m695j0123n530N305Q632Q328
9539F8069j5160J9474K2599L440j9656l729P78O278m821J071M232m538r198K906
9525G1745K31q50j2917m895K1444M221R139k576k1193J253J041p114L328J403
9511F4260l21J808o044j3412m33R919J0805M603m802N218M65r263o322O006j325
9496F1162l514K998J4459o387p545L964R027K7p216j7291j922J2562J6479Q103
9482H4906p413j757m595q476J043O47o580k475n843Q008R13O854J3083N157p9
9467H3393k3455K523J1752r828L804K2236N790j5984j0777K671q914M895j0941
9454E7165J0010n498K969L406j7108k611J1246P77K423Q415j930n807O313m398
$$ plain form
9440 65372 60130 54228 54940 54553 49228 47911 48852 50537 51117 50547 66381 74598 76650 82600 70756
9425 70756 57673 48954 68966 78479 73918 75408 66980 49872 47699 44020 50769 71768 72770 65966
9411 65966 62535 47882 48033 59666 75168 89894 105357 95822 83725 67343 66034 63714 64926
9398 64926 61002 60354 57418 58238 47680 41226 42237 45933 44285 38550 31390 33668 49357 72158
9384 72158 84298 66648 61878 63024 69495 78277 85041 82360 80234 81809 80179 70154 72060 77006
9370 77006 92483 97107 93511 81278 78229 87900 75264 74669 63292 56047 79301 79100 63178 69557
9356 69557 74017 76754 76170 91146 87782 82405 94514 96852 90800 90775 91247 86101 84390 90651 89517
9341 89517 74432 72651 74405 81700 85009 80078 74243 70049 75724 76080 91420 99427 106061 107725
$$ packed form
9440F5372n242n902P12l87n325j317R41J685N80n70J5834Q217K052N950j1844
9425G0756j3083q719K0012R513m561J490q428j7108k173l679O749K0999J002o804
9411F5966l431j4653J51J1633J5502J4726J5463r535j2097j6382j309k320J212
9398F4926l924o48k936Q20j0558o454J011L696j648n735p160K278J5689K2801
9384G2158J2140j7650m770J146O471Q782O764k681k126J575j630j0025J906M946
9370G7006J5477M624l596j2233l049R671j2636n95j1377p245K3254k01j5922O379
9356F9557M460K737n84J4976l364n377J2109K338o052k5M72n146j711O261j134
9341H9517j5085j781J754P295L309m931n835m194N675L56J5340Q007O634J664
$$ plain form
9327 107725 104067 101309 97660 92371 82402 73097 77878 78840 84427 94321 101029 102586 108970 110937 117760
9312 117760 116945 107034 104352 97792 103819 110208 99164 92499 94358 89465 79556 77094 86084 103496
9298 103496 104044 93925 98317 97436 96034 91157 90989 103414 99382 93164 98868 88435 78995 83030
9284 83030 73636 72625 71456 80701 93291 91901 84358 85932 92447 100308 108180 95610 100691 96646
9270 96646 81841 76587 76413 76682 89206 102941 105901 110562 105277 115525 120934 105271 90227 93453
9256 93453 92857 88146 92898 94867 105425 99995 97645 89163 90948 93629 111533 116658 100289 83575
9242 83575 87982 94319 84677 89499 106699 110445 109077 101680 92002 84995 90286 92148 90707 88922
9228 88922 95091 98624 86767 74750 73120 75147 74874 74561 76525 71673 77426 72508 58622 78367
$$ packed form
9327A07725l658k758l649n289r969r305M781R62N587R894O708J557O384J967O823
9312A17760q15r911k682o560O027O389j1044o665J859m893r909k462Q990J7412
9298A03496N48j0119M392q81j402m877j68J2425m032o218N704j0433r440M035
9284H3030r394j011j169R245J2590j390p543J574O515P861P872j2570N081m045
9270I6646j4805n254j74K69J2524J3735K960M661n285J0248N409j5663j5044L226
9256I3453n96m711M752J969J0558n430k350q482J785K681J7904N125j6369j6714
9242H3575M407O337r642M822J7200L746j368p397r678p007N291J862j441j785
9228H8922O169L533j1857j2017j630K027k73l13J964m852N753m918j3886J9745
$$ plain form
9214 78367 89944 74876 65831 70905 75959 75834 78777 88194 100089 94399 87260 88966 90717 74718
9200 74718 73728 82255 78329 79645 77190 79330 74427 70996 80105 71940 58070 55516 57841 72566
9186 72566 76244 79417 72895 72080 66709 65639 72405 73002 73866 68133 75530 86669 90129 97410 97846
9171 97846 85974 73986 76052 79346 62390 57366 73346 75786 77175 80091 79525 78362 79279 96665
9157 96665 98706 86093 80096 75784 92297 101453 88625 80369 80319 80368 76773 57505 62626 63868 64406
9142 64406 68621 69377 69272 59177 56812 60891 68641 84359 86344 80477 73379 89519 88361 76254
9128 76254 72381 70529 84184 106119 96542 78603 82885 83049 74506 69479 71033 77114 89310 98664
9114 98664 101328 83803 69535 74733 65886 74417 85895 85872 68689 64406 66888 69921 65825 70711
$$ packed form
9214G8367J1577j5068r045N074N054j25K943R417J1895n690p139J706J751j5999
9200G4718r90Q527l926J316k455K140m903l431R109q165j3870k554K325J4725
9186G2566L678L173o522q15n371j070O766N97Q64n733P397J1139L460P281M36
9171I7846j1872j1988K066L294j6956n024J5980K440J389K916n66j163R17J7386
9157I6665K041j2613n997m312J6513R156j2828q256n0M9l595j9268N121J242N38
9142F4406M215P56j05j0095k365M079P750J5718J985n867p098J6140j158j2107
9128G6254l873j852J3655K1935r577j7939M282J64q543n027J554O081J2196R354
9114I8664K664j7525j4268N198q847Q531J1478k3j7183m283K482L033m096M886
$$ plain form
9100 70711 69959 78446 85358 90785 101057 92234 77584 72858 66058 66253 84283 91224 92159 73575
9086 73575 76898 83078 96231 94146 81390 83046 97480 97532 79396 90125 101292 98143 99304 113858
9072 113858 104030 114911 126300 103559 82576 87469 92411 104897 107358 104320 98172 92117 94193
9059 94193 90482 85966 70035 62685 65119 79292 79544 76623 78675 89733 107740 109674 109141 108987
9045 108987 94468 89611 91160 97179 103041 102715 90343 82669 84454 90904 94164 97182 88540 91388
9031 91388 96294 82302 82281 85713 99581 99931 100202 100738 97444 92647 93613 97813 100880 106297 104613 104461
9015 104461 105874 73403 73596 79139 84749 84313 95245 103691 90692 96228 102661 107820 98275 93546
9001 93546 86533 86269 91709 97116 92756 91646 87679 93857 108684 109578 111596 103951 92868 96302 108013
$$ packed form
9100G0711p52Q487O912N427J0272q823j4650m726o800J95J8030O941R35j8584
9086G3575L323O180J3153k085j2756J656J4434N2j8136J0729J1167l149J161J4554
9072A13858r828J0881J1389k2741k0983M893M942J2486K461l038o148o055K076
9059I4193l711m516j5931p350K434J4173K52k921K052J1058J8007J934n33j54
9045A08987j4519m857J549O019N862l26j2372p674J785O450L260L018q642K848
9031I1388M906j3992k1L432J3868L50K71N36l294m797R66M200L067N417j684j52
9015A04461J413l2471J93N543N610m36J0932Q446j2999N536O433N159r545m729
9001I3546p013k64N440N407m360j110l967O178J4827Q94K018p645j1083L434J1711
$$ plain form
8986 108013 123935 117705 107535 98859 95923 98735 97157 93654 104949 117634 123127 117850 126730
8973 126730 138355 132288 125964 108495 91248 96391 105851 96533 103438 121000 116247 119971 133333
8960 133333 128720 114228 95179 95701 107250 103331 102350 113521 115803 116565 114109 92885 100273 107463
8946 107463 112869 110027 103089 104462 114388 114112 108572 106899 125385 124689 120946 118400 122378 112510 102263
8931 102263 110587 115337 105934 100561 84531 88672 88637 90798 97348 101751 103536 100331 92464 84615 85395
8916 85395 92722 98495 92189 84898 89815 97189 92089 96521 112782 118414 120290 127437 121572 107860
8902 107860 108100 106497 111619 130812 120910 86816 86094 100012 98847 95358 96572 92616 96903 96119
8888 96119 96631 93508 83731 87326 97247 111364 123358 114327 118405 116358 118442 121970 115559 118259
$$ packed form
8986A08013J5922o230j0170q676k936K812j578l503J1295J2685N493n277Q880
8973A26730J1625o067o324j7469j7247N143R460r318O905J7562m753L724J3362
8960A33333m613j4492j9049N22J1549l919r81J1171K282P62k456k1224P388P190
8946A07463N406k842o938J373R926k76n540j673J8486o96l743k546L978r868j0247
8931A02263Q324M750r403n373j6030M141l5K161O550M403J785l205p867p849P80
8916H5395P327N773o306p291M917P374n100M432J6261N632J876P147n865j3712
8902A07860K40j603N122J9193r902l4094p22J3918j165l489J214l956M287p84
8888I6119N12l123r777L595R921J4117J1994r031M078k047K084L528o411K700
$$ plain form
8874 118259 111397 106881 107998 110621 107394 114692 120290 113579 101204 116049 122977 118129 99673 88251
8860 88251 78773 84119 110358 111108 97731 105387 115168 127952 127710 113773 102109 103976 129786 137242
8846 137242 135920 122204 116768 134945 133386 132709 120174 120426 133666 133427 123644 125344 130370 137236
8832 137236 127008 116614 105735 106013 97849 100682 104795 101891 113267 112700 106784 108960 117698 116838
8818 116838 117885 129351 129858 130549 122846 114383 117672 131166 147825 144168 140423 144856 147066 158660
8804 158660 150524 136935 121386 120635 108800 118366 130643 140399 135208 137050 139794 148468 138539 153834
8790 153834 155426 160520 151710 141811 136788 146961 160154 153697 155926 140008 142146 143781 143118 140190
8776 140190 136896 139320 138710 144568 133534 134551 153191 155246 157405 154676 153940 155671 162709 166550
$$ packed form
8874A18259o862m516J117K623l227P298N598o711j2375J4845O928m848j8456j1422
8860H8251r478N346K6239P50j3377P656R781J2784k42j3937j1664J867K5810P456
8846A37242j322j3716n436J8177j559o77j2535K52J3240k39r783J700N026O866
8832A37236j0228j0394j0879K78q164K833M113k904J1376n67n916K176Q738q60
8818A16838J047J1466N07O91p703q463L289J3494J6659l657l745M433K210J1594
8804A58660q136j3589j5549p51j1835R566J2277R756n191J842K744Q674r929J5295
8790A53834J592N094q810r899n023J0173J3193o457K229j5918K138J635o63k928
8776A40190l294K424o10N858j1034J017J8640K055K159k729p36J731P038L841
$$ plain form
8762 166550 158548 147081 148330 154195 152542 155960 156954 163840 168509 172395 166038 164655 163278 165564
8748 165564 167699 171888 177934 188147 185350 182731 185019 198057 209099 203261 205589 202040 195999 192154
8734 192154 182283 183998 196317 196698 191219 192842 198102 213259 223333 215960 201706 211061 224889
8721 224889 210370 199849 205503 199157 196371 198713 194295 180729 186885 200831 212045 211182 222912
8708 222912 222264 227868 246730 246039 247546 243920 233432 216184 215897 244162 274060 282249 284748 291248
8694 291248 273121 253652 251693 281731 299316 298633 298191 302776 299462 313422 343051 354936 358404
8681 358404 367595 372789 359721 345790 357190 364931 359906 373446 378533 371187 361072 367496 383233
8668 383233 383321 379808 376422 372323 377147 385495 396275 408702 414505 402893 403515 425432 423496 427947
$$ packed form
8762A66550q002j1467J249N865j653L418R94O886M669L886o357j383j377K286
8748A65564K135M189O046J0213k797k619K288J3038J1042n838K328l549o041l845
8734A92154r871J715J2319L81n479J623N260J5157J0074p373j4254R355J3828
8721B24889j4519j0521N654o346k786K342m418j3566O156J3946J1214q63J1730
8708B22912o48N604J8862o91J507l626j0488j7248k87K8265K9898Q189K499O500
8694B91248j8127j9469j959L0038J7585o83m42M585l314J3960K9629J1885L468
8681C58404R191N194j3068j3931J1400P741n025J3540N087p346j0115O424J5737
8668C83233Q8l513l386m099M824Q348J0780J2427N803j1612O22K1917j936M451
$$ plain form
8654 427947 444746 444181 444921 448110 452251 465700 463831 475630 486471 497321 516104 531099 538510
8641 538510 563028 584610 599262 612228 615290 613640 621460 613448 625296 649956 678592 689088
8629 689088 696429 724246 750221 772934 792739 833578 872942 900504 940616 997318 1067429 1135091
8617 1135091 1203449 1276188 1363251 1433380 1498721 1594972 1705847 1824965 1946358 2083839 2219343
8606 2219343 2342452 2484683 2645065 2802452 2924977 3017734 3058978 3028747 2941010 2796830
8596 2796830 2600984 2378718 2159595 1972776 1811476 1663239 1549502 1454733 1352570 1263125
8586 1263125 1193161 1113343 1060339 1028360 985899 935825 902988 884637 862708 824675 784383
8575 784383 751346 732029 713226 696763 687275 662727 645137 630394 604573 584090 578570 567584
$$ packed form
8654D27947J6799n65P40L189M141J3449j869J1799J0841J0850J8783J4995P411
8641E38510K4518K1582J4652J2966L062j650P820q012J1848K4660K8636J0496
8629F89088P341K7817K5975K2713J9805M0839L9364K7562M0112N6702P0111O7662
8617A135091O8358P2739Q7063P0129O5341R6251J10875J19118J21393J37481J35504
8606B219343J23109J42231J60382J57387J22525R2757M1244l0231q7737j44180
8596B796830j95846k22266k19123j86819j61300j48237j13737r4769j02163q9445
8586A263125o9964p9818n3004l1979m2461n0074l2837j8351k1929l8033m0292
8575G84383l3037j9317j8803j6463r488k4548j7590j4743k5821k0483n520j0986
$$ plain form
8563 567584 555674 552757 562449 570334 562610 529820 515820 512702 513070 508386 501118 491257 492781 488831
8549 488831 480143 467316 453211 446864 456877 461976 454674 441846 437420 442109 424488 409217 411116
8536 411116 422190 435025 441902 436129 420678 394110 380348 377752 371231 368922 361801 337545 333553
8523 333553 338121 326689 313280 303265 299140 308947 308474 307703 315069 297810 289808 298507 292061 285531
8509 285531 287051 279927 272623 268815 268561 280670 285354 281637 287702 281520 277321 265921 256270 244539
8495 244539 251082 247953 262257 276465 278538 276520 289714 283533 273878 262187 259702 248329 229015
8482 229015 227300 235382 237786 241335 240491 232006 239680 247406 252317 234400 227966 227118 224911 225308 228523
8467 228523 215306 201861 197033 210513 213272 209962 219697 215997 204732 201054 200337 201246 196242 197340
$$ packed form
8563E67584j1910k917R692P885p724l2790j4000l118L68m684p268r861J524l950
8549D88831q688j2827j4105o347J0013N099p302j2828m426M689j7621j5271J899
8536D11116J1074J2835O877n773j5451k6568j3762k596o521k309p121k4256l992
8523C33553M568j1432j3409j0015m125R807m73p71P366j7259q002Q699o446o530
8509B85531J520p124p304l808k54J2109M684l717O065o182m199j1400r651j1731
8495B44539O543l129J4304J4208K073k018J3194o181r655j1691k485j1373j9314
8482B29015j715Q082K404L549q44q485P674P726M911j7917o434q48k207L97L215
8467B28523j3217j3445m828J3480K759l310R735l700j1265l678p17R09n004J098
$$ plain form
8453 197340 186437 194824 210945 219145 220223 218087 211317 196219 205022 203471 192142 195575 208835
8440 208835 209471 208066 219912 225924 206743 195084 183489 191521 201733 201245 201230 194758 190899 206199
8426 206199 206915 196239 196042 212011 226319 214084 212581 210869 209273 211795 191740 176836 186336
8413 186336 190844 194223 193738 187067 175453 175380 185499 196128 188861 178112 173872 189281 186720 185626
8399 185626 190208 174886 180402 190152 197079 203481 204348 210578 206477 201900 197720 199088 196242 190328
8385 190328 184762 183687 184239 187078 176201 162921 155058 167162 181696 188506 193499 189871 173817
8372 173817 170813 181697 189053 191818 194419 188176 177430 179757 184797 182572 190472 204727 215494
8359 215494 215671 209979 195123 197853 179532 167071 157968 162541 172609 173633 172062 166865 157995 156162
$$ packed form
8453A97340j0903Q387J6121Q200J078k136o770j5098Q803j551j1329L433J3260
8440B08835O36j405J1846O012j9181j1659j1595Q032J0212m88j5o472l859J5300
8426B06199P16j0676j97J5969J4308j2235j503j712j596K522k0055j4904R500
8413A86336M508L379m85o671j1614p3J0119J0629p267j0749m240J5409k561j094
8399A85626M582j5322N516R750O927O402Q67O230m101m577m180J368k846n914
8385A90328n566j075N52K839j0877j3280p863J2104J4534O810M993l628j6054
8372A73817l004J0884P356K765K601o243j0746K327N040k225P900J4255J0767
8359B15494J77n692j4856K730j8321j2461r103M573J0068J024j571n197q870j833
$$ plain form
8345 156162 167445 177183 177496 167459 148669 137310 142694 144699 159881 178970 179893 176170 175788 185494
8331 185494 174032 163395 162001 161530 158207 160520 167409 165435 159570 170893 170031 172752 164862 157414
8317 157414 158807 169450 162657 147395 134990 130086 137492 152125 150914 154506 154255 128889 119068
8304 119068 139474 156375 155768 164407 179795 170160 173239 176081 177529 164148 158808 150897 149020 146977
8290 146977 142611 149814 146529 151136 139845 133809 143994 147175 143241 140868 138208 137320 148615 154553
8276 154553 157123 148955 142137 146471 154631 141563 135935 141704 147537 138338 139965 131930 125461 127373
8262 127373 128627 122347 120237 110935 111768 104474 113396 114363 129950 129529 121253 121883 122935 117062 122819
8247 122819 125316 127083 107385 95204 94158 104194 101668 100000 103754 105615 93102 97991 96728
$$ packed form
8345A56162J1283R738L13j0037j8790j1359N384K005J5182J9089R23l723l82R706
8331A85494j1462j0637j394m71l323K313O889j974n865J1323q62K721p890p448
8317A57414J393J0643o793j5262j2405m904P406J4633j211L592k51k5366r821
8304A19068K0406J6901o07Q639J5388r635L079K842J448j3381n340p911j877k043
8290A46977m366P203l285M607j1291o036J0185L181l934k373k660q88J1295N938
8276A54553K570q168o818M334Q160j3068n628N769N833r199J627q035o469J912
8262A27373J254o280k110r302Q33p294Q922R67J5587m21q276O30J052n873N757
8247A22819K497J767j9698j2181j046J0036k526j668L754J861j2513M889j263
$$ plain form
8234 96728 84683 99151 90800 82297 76796 80067 104425 119855 122979 112073 103334 99915 97886
8221 97886 94873 100674 98435 96296 93416 93407 94728 99771 112155 98821 87418 96507 95201 105057 101128
8206 101128 91760 101830 109236 95505 84114 88140 94974 96999 87695 92389 107157 109686 101639
8193 101639 98905 95719 108884 116783 112849 114338 105140 100619 98356 89852 82520 79658 95871 97870
8179 97870 90267 95255 98895 104258 114571 110737 107484 113588 114660 112422 106369 100817 92206 95244
8165 95244 96731 96990 88442 93574 89763 89216 103009 122376 130596 128062 129771 137219 124029 104696
8151 104696 100440 100201 106880 116476 107936 98559 104742 114622 116559 117769 115822 121885 129016 138399 132398
8136 132398 132939 136442 145089 147205 156582 158026 158320 170428 153863 148439 142894 117163 118384 131339
$$ packed form
8234I6728j2045J4468q351q503n501L271K4358J5430L124j0906q739l419k029
8221I7886l013N801k239k139k880rJ321N043J2384j3334j1403R089j306R856l929
8206A01128r368J0070P406j3731j1391M026O834K025r304M694J4768K529q047
8193A01639k734l186J3165P899l934J489r198m521k263q504p332k862J6213J999
8179I7870p603M988L640N363J0313l834l253O104J072k238o053n552q611L038
8165I5244J487K59q548N132l811n47J3793J9367Q220k534J709P448j3190j9333
8151A04696m256k39O679R596q540r377O183R880J937J210j947O063P131R383o001
8136A32398N41L503Q647K116R377J444K94J2108j6565n424n545k5731J221J2955
$$ plain form
8122 131339 134795 127030 123779 120389 112586 124632 141055 149614 142204 142627 144515 143006 134782 135995
8108 135995 137189 151427 164584 164607 157548 157687 157032 145763 139148 134866 148689 155073 134202 129221
8094 129221 147363 152061 152593 162492 147258 142974 146050 150079 144290 143262 150475 146894 153261 160730
8080 160730 173342 174393 172362 165103 157543 153000 157903 169662 177694 192074 210704 213837 205212
8067 205212 185864 193253 198236 194448 189555 196643 208306 214667 220219 229280 242752 246074 254830 255134
8053 255134 248674 265683 281769 295979 317926 327276 350127 358684 355089 353216 340237 334918 344207
8040 344207 334294 326344 307748 310144 322971 320138 321330 329307 328421 318846 311124 308583 323113 330180
8026 330180 341619 349520 353396 351454 352660 369383 389890 402017 429311 452871 464408 492480
$$ packed form
8122A31339L456p765l251l390p803J2046J6423Q559p410M23J888j509q224J213
8108A35995J194J4238J3157K3p059J39o55j1269o615m282J3823O384k0871m981
8094A29221J8142M698N32R899j5234m284L076M029n789j028P213l581O367P469
8080A60730J2612J051k031p259p560m543M903J1759Q032J4380J8630L133q625
8067B05212j9348P389M983l788m893P088J1663O361N552R061J3472L322Q756L04
8053B55134o460J7009J6086J4210K1947R350K2851Q557l595j873j2979n319R289
8040C44207r913p950j8596K396J2827k833J192P977q86r575p722k541J4530P067
8026C30180J1439P901L876j942J206J6723K0507J2127K7294K3560J1537K8072
$$ plain form
8014 492480 516159 529055 569532 599108 634044 672093 726462 777200 827274 848101 834267 792553
8002 792553 751667 706841 691146 664098 647323 636072 636925 613627 565808 544507 516336 485980
7990 485980 454015 446494 446986 455470 467435 474318 464082 465000 482870 496660 505123 516958 525563
7977 525563 511449 520666 567452 593615 613103 644726 675750 711341 734312 749412 766420 798183
7965 798183 820113 829600 841828 838825 836020 833974 830727 835400 820035 803426 782699 757035 719693
7952 719693 663765 612291 561615 543511 526608 516321 500328 478894 456171 443242 427922 427241
7940 427241 426072 433116 446835 454428 464917 470383 479879 505186 507421 521846 529631 530586 524235 522583
7926 522583 509178 492063 494485 494007 505325 503604 497325 497661 500973 489494 488283 489558 470682 445507
$$ packed form
8014D92480K3679J2896M0477K9576L4936L8049N4369N0738N0074K0827j3834m1714
8002G92553m0886m4826j5695k7048j6775j1251Q53k3298m7819k1301k8171l0356
7990D85980l1965p521M92Q484J1965O883j0236R18J7870J3790Q463J1835Q605
7977E25563j4114R217M6786K6163J9488L1623L1024L5591K2971J5100J7008L1763
7965G98183K1930R487J2228l003k805k046l247M673j5365j6609k0727k5664l7342
7952G19693n5928n1474n0676j8104j6903j0287j5993k1434k2723j2929j5320o81
7940D27241j169P044J3719P593J0489N466R496K5307K235J4425P785R55o351j652
7926E22583j3405j7115K422m78J1318j721o279L36L312j1479j211J275j8876k5175
$$ plain form
7912 445507 421943 379249 340362 312998 287880 281967 284166 284043 266282 247741 239241 239691 240866
7899 240866 257653 260728 246633 246686 251346 244061 245670 241626 234929 230866 224056 223528 209059 199579
7885 199579 208082 203113 205864 202254 191106 187981 176301 170287 168003 176785 176269 157293 165426 180166
7871 180166 176374 171164 183874 181800 163895 153246 153783 144324 146113 133210 123519 125141 123084 109469
7857 109469 108730 108233 96590 106223 119881 125257 123703 114486 114752 115204 103194 104741 105192 104299 113112
7842 113112 121743 128648 125563 112333 95481 89852 85946 88637 91531 82437 71035 64262 65567 68826
7828 68826 75824 92269 90138 83974 82852 84353 75390 72722 82820 80280 81376 82121 77943 64840
7814 64840 70232 80505 80783 82534 71351 59147 49711 65006 73091 66810 72313 68973 71813 73667
$$ packed form
7912D45507k3564m2694l8887k7364k5118n913K199j23j7761j8541q500M50J175
7899B40866J6787L075j4095N3M660p285J609m044o697m063o810n28j4469r480
7885A99579Q503m969K751l610j1148l125j1680o014k284Q782n16j8976Q133J4740
7871A80166l792n210J2710k074j7905j0649N37r459J789j2903r691J622k057j3615
7857A09469p39m97j1643R633J3658N376j554r217K66M52j2010J547M51q93Q813
7842A13112Q631O905l085j3230j6852n629l906K691K894r094j1402o773J305L259
7828F8826O998J6445k131o164j122J501q963k668J0098k540J096P45m178j3103
7814F4840N392J0273K78J751j1183j2204r436J5295Q085o281N503l340K840J854
$$ plain form
7800 73667 69596 71103 69180 71752 78844 89730 80653 63856 60275 56903 50983 43792 54462 50476
7786 50476 53748 52822 55204 56496 47492 48076 44073 45130 54184 60770 59774 53629 59128 61225 56174
7771 56174 51758 53670 57280 51745 42950 38884 43472 47617 40439 46719 46959 49847 47386 53295 60663
7756 60663 60766 41971 33611 23853 32875 48185 53751 53297 67198 78156 74660 62228 41924 37395
7742 37395 40010 33972 37247 49501 43528 33474 32762 32876 36274 37727 41141 38987 29064 37187 48109
7727 48109 50856 36399 33795 28845 34071 40605 35431 17814 6426 4416 22036 42860 41998 31376
7713 31376 35991 33341 28712 29463 36285 39664 40379 39363 37875 31418 34437 31606 27458 28341 21269
7698 21269 32459 41441 35058 34376 26645 14916 8011 16022 20713 25215 29987 40697 48932 52230
$$ packed form
7800G3667m071J507j923K572P092J0886r077j6797l581l372n920p191J0670l986
7786E0476L272r26K382J292r004N84m003J057R054O586r96o145N499K097n051
7771E6174m416J912L610n535q795m066M588M145p178O280K40K888k461N909P368
7756F0663J03j8795q360r758R022J5310N566m54J3901J0958l496j2432k0304m529
7742C7395K615o038L275J2254n973j0054p12J14L398J453L414k154r923Q123J0922
7727D8109K747j4457k604m950N226O534n174j7617j1388k010J7620K0824q62j0622
7713C1376M615k650m629P51O822L379P15j016j488o457L019k831m148Q83p072
7698B1269J1190Q982o383o82p731j1729o905Q011M691M502M772J0710Q235L298
$$ plain form
7684 52230 46563 48113 47843 41973 41051 27579 24961 23969 35134 31396 20011 26246 32125 34454 34299
7669 34299 23258 12949 7545 1229 -7170 13117 30654 32342 17735 20506 27568 28139 20490 21905
7655 21905 17911 4108 -3487 14160 12714 17411 25062 23404 6410 6429 13680 24683 19315 21184
7641 21184 24021 13452 24348 30468 32784 47205 43094 23794 7699 9849 5717 -9795 -19495
7628 -19495 3422 14990 5269 -740 7026 5562 6349 1945 1474 5831 4217 16301 24596 17358
7614 17358 25637 23525 18610 15057 -8325 4710 25431 39929 49813 36633 27888 19285 18870 19998
7600 19998 19333 15415 10966 21700 29622 21063 14040 10040 17794 19168 11579 73 -1344 -3540
7586 -3540 10454 19467 20298 41555 34574 27924 23793 13937 9129 9940 9462 26660 24604 21161 22771
$$ packed form
7684E2230n667J550k70n870r22j3472k618r92J1165l738j1385O235N879K329j55
7669C4299j1041j0309n404o316q399K0287J7537J688j4607K771P062N71p649J415
7655B1905l994j3803p595J7647j446M697P651j658j6994J9P251J1003n368J869
7641B1184K837j0569J0896O120K316J4421m111j9300j6095K150m132j5512r700
7628a9495K2917J1568r721o009P766j464P87m404m71M357j614J2084Q295p238
7614A7358Q279k112m915l553k3382J3035K0721J4498R884j3180q745q603m15J128
7600A9998o65l918m449J0734P922q559p023m000P754J374p589j1506j417k196
7586c540J3994R013Q31K1257o981o650m131r856m808Q11m78J7198k056l443J610
$$ plain form
7571 22771 29731 43249 54850 52677 42272 45804 41388 41478 33832 36518 31975 17644 19040 29558
7557 29558 16196 3771 8597 23732 18732 13415 32219 36434 17346 8845 5281 6325 -2061
7544 -2061 -12557 -26661 -16090 -2933 7454 13654 18168 18065 28697 17893 7988 3161 -2886
7531 -2886 8239 27646 27666 23528 30633 33220 22488 13528 13301 7914 -8607 -6564 7003 15988
7517 15988 9153 7907 1384 6776 19880 23612 11985 10709 19726 15004 7106 -9295 -20562 -11095
7503 -11095 9273 10487 2448 -1392 494 17416 25347 7671 6287 -794 1784 5584 9450 10847
7489 10847 3280 6079 3393 16348 26538 30920 34583 28449 20434 19365 27545 16160 18436 15297
7475 15297 12870 18329 19837 17014 13631 5280 1843 -1225 5805 12269 3310 -8929 24 6270
$$ packed form
7571B2771O960J3518J1601k173j0405L532m416R0p646K686m543j4331J396J0518
7557B9558j3362j2425M826J5135n000n317J8804M215j9088q501l564J044q386
7544b061j0496j4104J0571J3157J0387O200M514j03J0632j0804r905m827o047
7531b886J1125J9407K0m138P105K587j0732q960k27n387j6521K043J3567Q985
7517A5988o835j246o523N392J3104L732j1627j276R017m722p898j6401j1267R467
7503a1095K0368J214q039l840J886J6922P931j7676j384p081K578L800L866J397
7489A0847p567K799k686J2955J0190M382L663o134q015j069Q180j1385K276l139
7475A5297k427N459J508k823l383q351l437l068P030O464q959j2239Q953O246
$$ plain form
7461 6270 3968 5590 4785 666 5463 7035 12216 5685 10764 16993 21082 14302 10207 5538 6814
7446 6814 9119 15876 11851 10022 -7946 -19351 -6614 -6988 -9154 -7718 -10572 -13217 -12571 -14306 -8240
7431 -8240 -12007 -11319 825 4361 5638 2694 -5519 -3254 -338 -1124 6535 11643 19496 31083 29027
7416 29027 23518 21611 22051 12292 567 -4825 -15209 -21347 -15640 -10713 -8413 -1647 17448 11853
7402 11853 13998 13735 14561 8508 5630 6538 10049 10972 17223 22440 17610 2577 4279 13093 25541
7387 25541 28702 23923 21775 18305 7364 -1033 3410 -4281 85 4688 5042 1292 -14696 -9878
7373 -9878 1753 11910 15675 14605 29615 33414 24990 6734 -6110 -4104 -10470 -15154 -18731 -9416
7359 -9416 -8927 62 4114 -735 -3659 -600 -2113 -4835 18498 30491 15688 13215 13761 17683 13325
$$ packed form
7461F270k302J622q05m119M797J572N181o531N079O229M089o780m095m669J276
7446F814K305O757m025j829j7968j1405J2737l74k166J436k854k645O46j735O066
7431h240l767O88J2144L536J277k944q213K265K916p86P659N108P853J1587k056
7416B9027n509j907M40r759j1725n392j0384o138N707M927K300O766J9095n595
7402A1853K145k63Q26o053k878R08L511R23O251N217m830j5033J702Q814J2448
7387B5541L161m779k148l470j0941q397M443p691M366M603L54l750j5988M818
7373i878J1631J0157L765j070J5010L799q424j8256j2844K006o366m684l577R315
7359i416M89Q989M052m849k924L059j513k722K3333J1993j4803k473N46L922m358
$$ plain form
7344 13325 10547 5877 1038 -260 -5037 -14810 -9807 -12731 -5650 11509 18918 18667 10595 -1866
7330 -1866 5474 8307 1520 -4194 -10608 -16241 -16181 7021 14189 3256 13670 13020 11590 8769 15952
7315 15952 23140 9266 -10109 -26874 -22711 -17257 -7343 337 -5577 -9480 -10906 -7768 -4060 -17176
7301 -17176 -19540 -6633 -5484 3247 12028 -3969 -4944 -448 -13307 -25329 -30475 -13261 -6105 -2370
7287 -2370 4674 22159 13713 8894 19154 16323 17994 16822 9138 21366 10383 3625 11449 6282
7273 6282 6312 17589 22242 14615 3905 3044 2942 -13340 -11399 7144 21884 20430 8101 -2383
7259 -2383 11 -4068 -853 7491 -8613 -14128 -16484 -26769 -21109 -4077 12160 12472 6641 -2252
7245 -2252 1177 12461 11411 23251 37226 30070 13732 11385 4012 546 8421 19895 26173 23717
$$ packed form
7344A3325k778m670m839j298m777r773N003k924P081J7159P409k51q072j2461
7330a866P340K833o787n714o414n633O0K3202P168j0933J0414o50j430k821P183
7315A5952P188j3874j9375j6765M163N454R914P680n914l903j426L138L708j3116
7301a7176k364J2907J149Q731Q781j5997r75M496j2859j2022n146J7214P156L735
7287b370P044J7485q446m819J0260k831J671j172p684J2228j0983o758P824n167
7273F282L0J1277M653p627j0710q61j02j6282J941J8543J4740j454j2329j0484
7259b383K394m079L215Q344j6104n515k356j0285N660J7032J6237L12n831q893
7245b252L429J1284j050J1840J3975p156j6338k347p373l466P875J1474O278k456
$$ plain form
7231 23717 8355 -5374 10903 3163 -9905 -8401 -26610 -23511 -16188 -21068 -23018 -6827 -5007
7218 -5007 -4848 -2790 -883 6433 10317 7322 9371 16665 16562 3558 -3420 -3238 8480 10359 -3528
7203 -3528 -17120 -10966 -3912 -3670 1314 -2614 -15797 -10156 -1105 6187 22515 20855 14504 13636 16566
7188 16566 15655 220 -13651 -17413 -15862 -4012 10649 13394 3636 -3696 9841 21276 14904
7175 14904 8627 1249 2385 5894 1445 -12732 -5683 -4008 5805 12768 6574 -2082 -4362 -3305
7161 -3305 -10192 -1709 3669 9708 -3242 -8154 689 5669 14450 22615 14653 9612 14248 4828 -1933
7146 -1933 4725 -4374 -10971 -20423 -15052 -1572 1983 17442 18281 2273 7106 19904 18943 2308
7132 2308 -7828 -1573 4346 1020 -3759 -6776 1871 -3761 -9995 7256 13467 10791 7126 11878
$$ packed form
7231B3717j5362j3729J6277p740j3068J504j8209L099P323m880j950J6191J820
7218e007J59K058J907P316L884k995K049P294j03j3004o978J82J1718J879j3887
7203c528j3592O154P054K42M984l928j3183N641R051P292J6328j660o351q68K930
7188A6566r11j5435j3871l762J551J1850J4661K745r758p332J3537J1435o372
7175A4904o277p378J136L509m449j4177P049J675R813O963o194q656k280J057
7161c305o887Q483N378O039j2950m912Q843M980Q781Q165p962n041M636r420o761
7146a933O658r099o597r452N371J3480L555J5459Q39j6008M833J2798r61j6635
7132B308j0136O255N919l326m779l017Q647n632o234J7251O211k676l665M752
$$ plain form
7118 11878 33709 53193 45331 31717 7005 -7067 -13425 1881 -59 -11245 -6582 2196 9910
7105 9910 20793 19508 25099 33520 45375 42960 28878 19018 1523 -5514 779 12004 13074 7755
7091 7755 5008 -6256 -3342 -8599 -4472 -889 -190 -6514 2624 13915 23824 16831 4060 9775
7077 9775 11134 1318 1770 4550 676 7201 3600 -173 3152 11281 16576 13895 8470 10449 5
7062 5 -5772 -7280 -3319 -8610 -14457 -20063 -17951 -11349 -1119 -8328 4702 -2900 -4684 -6608 -6358
7047 -6358 -17889 -8927 -2019 -2811 544 5680 4248 1856 10895 8078 5017 -506 5444 9448 2656
7032 2656 -17641 -22667 -14204 -8774 -10273 2922 4570 1664 -8626 -5428 12617 12755 1561 -15450
7018 -15450 -31339 -34393 -19542 -9128 -5673 4852 10700 3009 11181 6275 1059 -2982 -12724 -19328
$$ packed form
7118A1878K1831J9484p862j3614k4712j4072o358J5306j940j1186M663Q778P714
7105I910J0883j285N591Q421J1855k415j4082r860j7495p037O293J1225J070n319
7091G755k747j1264K914n257M127L583O99o324R138J1291R909o993j2771N715
7077I775J359r816M52K780l874O525l601l773L325Q129N295k681n425J979j0444
7062En777j508L961n291n847n606K112O602J0230p209J3030p602j784j924K50
7047f358j1531Q962O908p92L355N136j432k392R039k817l061n523N950M004o792
7032B656k0297n026Q463N430j499J3195J648k906j0290L198J8045J38j1194j7011
7018a5450j5889l054J4851J0414L455J0525N848p691Q172m906n216m041r742o604
$$ plain form
7004 -19328 -14186 -19082 -12453 -11143 -2493 -4299 -8485 -12251 -8916 -1052 11776 13096 16198 16257 21367
6989 21367 15746 9661 -6447 -11325 7489 16336 11165 10808 11633 3464 -17310 -24314 -4867 17605
6975 17605 23532 20676 11762 503 -1187 -5544 -12105 -13066 -19955 -21171 -4871 -5342 -27042 -25942
6961 -25942 -25115 -21512 -11051 4276 14806 13853 -10534 -18032 236 11315 8992 2455 -274 -8289
6947 -8289 -21869 -21713 -33710 -41120 -36685 -14299 -11248 -6055 -727 -3111 -5285 -4379 -13389 -14710 -13817
6932 -13817 -13767 -20517 -22188 -10052 -13778 -9090 -551 -3198 3736 11933 8514 -2045 2772 16201
6918 16201 16370 12088 9771 16872 14453 14330 1846 -12464 -24110 -29184 -15628 -6860 -4419 5573
6904 5573 7686 4423 361 230 5765 7093 13662 17978 24931 26689 10900 -544 -8541 -13522 -20939
$$ packed form
7004a9328N142m896O629J310Q650j806m186l766L335P864J2828J320L102N9N110
6989B1367n621o085j6108m878J8814Q847n171l57Q25q169k0774p004J9447K2472
6975A7605N927k856q914j1259j690m357o561r61o889j216J6300m71k1700J100
6961b5942Q27L603J0461J5327J0530r53k4387p498J8268J1079k323o537k729q015
6947h289j3580J56j1997p410M435K2386L051N193N328k384k174R06r010j321Q93
6932a3817N0o750j671J2136l726M688Q539k647O934Q197l419j0559M817J3429
6918A6201J69m282k317P101k419j23j2484j4310j1646n074J3556Q768K441R992
6904E573K113l263m062j31N535J328O569M316O953J758j5789j1444p997m981p417
$$ plain form
6889 -20939 -18389 -20814 -34808 -18706 -1184 4611 3355 -2423 -10132 -11456 2999 -1177 -6652 9235
6875 9235 -2363 -19177 -17973 -10875 -8323 -9211 -17663 -24932 -24724 -6260 15611 17627 14841 17802
6861 17802 14666 18630 20254 18232 7189 527 -1175 -9033 -10074 -8358 -8448 -4824 -2145 -5557 -12363
6846 -12363 -15932 -2827 6545 -4668 -2171 12518 4917 -2371 -8195 -4476 -3005 295 -114 8271
6832 8271 5573 8438 -4154 -17121 -7254 1313 4956 3739 -2708 6625 5950 12665 7909 18261
6818 18261 7744 -1602 517 7181 20216 18055 11667 10673 16694 15910 24706 25225 10546 9969 18950
6803 18950 28181 26518 23647 22579 15460 13106 12155 6328 13086 7245 418 3912 9736 1961 6354
6788 6354 6468 3937 13887 7204 -10860 -1685 18708 18614 17484 11880 7308 4000 3510 -347 11014
$$ packed form
6889b0939K550k425j3994J6102J7522N795j256n778p709j324J4455m176n475J5887
6875I235j1598j6814J204P098K552q88q452p269K08J8464K1871K016k786K961
6861A7802l136L964J624k022j1043o662j702p858j041J716r0L624K679l412o806
6846a2363l569J3105R372j1213K497J4689p601p288n824L719J471L300m09Q385
6832H271k698K865j2592j2967R867Q567L643j217o447R333o75O715m756J0352
6818A8261j0517r346K119O664J3035k161o388r94O021p84Q796N19j4679n77Q981
6803A8950R231j663k871j068p119k354r51n827O758n841o827L494N824p775M393
6788F354J14k531R950o683j8064R175K0393r4j130n604m572l308m90l857J1361
$$ plain form
6773 11014 33654 25452 16629 14724 5353 -7884 1096 2945 9408 15248 25958 31131 31269 40603
6759 40603 57508 87712 140742 194113 259821 313457 297433 239969 204354 189543 180903 173040
6747 173040 161748 161278 166370 187868 210050 240120 301189 388666 498811 630242 844960 1208900
6735 1208900 1788393 2666822 4015271 5884747 7662839 7693605 5692096 3703692 2466778
6726 2466778 1739778 1295090 996975 773437 625536 528160 446839 380496 332472 291158
6716 291158 251832 229560 214167 180043 164176 181433 196665 218606 259073 284137 257774 179560
6704 179560 137016 103854 84398 67231 68631 67875 36906 36411 42161 29644 37195 51354 68671
6691 68671 74191 82217 72678 54411 47706 45153 43682 43969 28938 19346 14554 12106 12758 13633 9880
$$ packed form
6773A1014K2640q202q823j905r371j3237Q980J849O463N840J0710N173J38R334
6759D0603J6905L0204N3030N3371O5708N3636j6024n7464l5615j4811q640p863
6747A73040j1292m70N092K1498K2182L0070O1069Q7477J10145J31431K14718L63940
6735A208900N79493Q78429J348449J869476J778092L0766k001509j988404j236914
6726B466778p27000m44688k98115k23538j47901r7376q1321o6343m8024m1314
6716B91158l9326k2272j5393l4124j5867J7257J5232K1941M0467K5064k6363p8214
6704A79560m2544l3162j9456j7167J400p56l0969m95N750j2517P551J4159J7317
6691F8671N520Q026r539j8267o705k553j471K87j5031r592m792k448O52Q75l753
$$ plain form
6676 9880 -5631 -7195 1128 9861 6182 12852 25325 34140 24837 20615 27100 20521 17703 14287
6662 14287 20361 16785 26040 28267 19525 3824 3169 3709 7764 11653 25147 23930 19944 19828 37990
6647 37990 36610 20194 13110 13697 17946 25344 19359 7964 7153 15517 16591 12084 16524 18068 14844
6632 14844 7507 2272 3138 7394 7031 -2631 1501 -65 -3735 -14301 -5249 12788 25133 47627
6618 47627 54900 55180 73152 87144 98104 138091 187833 208961 143939 80233 47981 41296 27444
6605 27444 31927 25318 13791 -863 -1201 3487 11758 10385 -2423 -1539 7660 -5517 -3050 -4382
6591 -4382 -7663 -4380 7800 21467 30707 41634 23196 14438 8520 -4277 -11568 -14273 9440
6578 9440 15892 15995 15743 13660 14415 4458 7108 10535 10529 6497 9393 2417 3009 724 -5630 -3381 -4788
$$ packed form
6676I880j5511j564Q323Q733l679O670J2473Q815r303m222O485o579k818l416
6662A4287O074l576R255K227q742j5701o55N40M055L889J3494j217l986j16J8162
6647C7990j380j6416p084N87M249P398n985j1395q11Q364J074m507M440J544l224
6632A4844p337n235Q66M256l63r662M132j566l670j0566R052J8037J2345K2494
6618D7627P273K80J7972J3992J0960L9987M9742K1128o5022o3706l2252o685j3852
6605B7444M483o609j1527j4654l38M688Q271j373j2808Q84R199j3177K467j332
6591d382l281L283J2180J3667R240J0927j8438q758n918j2797p291k705K3713
6578I440O452J03k52k083P55r957K650L427om032K896o976N92k285o354K249j407
$$ [...]
##END NTUPLES=NMR SPECTRUM
##END=
