##TITLE=Analysis number 324654
Compound Code cc 60616
Book Reference 486/78
Project Code adrs
Chemist Name simons
##JCAMPDX= 6.0         $$ Bruker NMR JCAMP-DX V2.0
##DATA TYPE= NMR SPECTRUM
##DATA CLASS= NTUPLES
##ORIGIN= Bruker BioSpin GmbH
##OWNER= nmr
$$ XWIN-NMR		Version 3.5
$$ Wed Nov 29 12:48:17 2006 GMT Standard Time (UT+0h)  MAYBRIDGE\nmr@NMR_250MHZ
##.OBSERVE FREQUENCY= 250.131544655141
##.OBSERVE NUCLEUS= ^1H
##.ACQUISITION MODE= SIMULTANEOUS (DQD)
##.ACQUISITION SCHEME= undefined
##.AVERAGES= 16
##.DIGITISER RES= 18
##SPECTROMETER/DATA SYSTEM= dpx250
##.PULSE SEQUENCE= zg30
##.SOLVENT NAME= CDCl3
##.SHIFT REFERENCE= (INTERNAL, CDCl3, 0, 16.522)
##AUDIT TRAIL= $$ (NUMBER, WHEN, WHO, WHERE, WHAT)
$$ ##TITLE= Audit trail, XWIN-NMR		Version 3.5
$$ ##JCAMPDX= 5.01
$$ ##ORIGIN= Bruker BioSpin GmbH
$$ ##OWNER= nmr
$$ C:\u/data/dgb/nmr/ADRS/1420/pdata/1/auditp.txt
$$ ##AUDIT TRAIL=  $$ (NUMBER, WHEN, WHO, WHERE, WHAT)
(   1,<2006-11-29 12:47:40.86 +000>,<MAYBRIDGE\nmr>,<NMR_250MHZ>,
      <created by zg, POWCHK disabled, PULCHK disabled
       configuration hash MD5:
       49 4B E0 1D 92 C2 6B 37 9F E6 65 BC 52 41 86 1D
       data hash MD5: 64K
       B2 B8 EB 42 24 EC F2 EE B0 C6 29 1F BC 56 89 CB>)
(   2,<2006-11-29 12:47:58.30 +000>,<MAYBRIDGE\nmr>,<NMR_250MHZ>,
      <Start of raw data processing
       ef LB = 0.3 FT_mod = 6 PKNL = 1 SI = 32K 
       data hash MD5: 32K
       95 EF 88 69 5F 5A 9D EA E5 BE F4 5D CE 37 74 ED>)
(   3,<2006-11-29 12:48:00.24 +000>,<MAYBRIDGE\nmr>,<NMR_250MHZ>,
      <apk 
       data hash MD5: 32K
       96 32 17 F4 91 8C C4 D7 2E A7 49 E9 A9 52 2A 0D>)
(   4,<2006-11-29 12:48:01.22 +000>,<MAYBRIDGE\nmr>,<NMR_250MHZ>,
      <abs ABSG = 5 
       data hash MD5: 32K
       7A 15 B8 F9 37 18 71 F5 66 38 50 C5 1A 87 DF 50>)
$$ ##END=
$$ 
$$ hash MD5
$$ D7 90 BE F1 85 08 AA E7 A8 27 05 4B 17 92 43 F1
##$RELAX= 
##$RELAX= 
##$RELAX= 
##$RELAX= 
##$RELAX= 
##$RELAX= 
##$RELAX= 
$$ Bruker specific parameters
$$ --------------------------
##$DU= <C:\u>
##$EXPNO= 1420
##$NAME= <ADRS>
##$PROCNO= 1
##$TYPE= <nmr>
##$USER= <dgb>
##$AMP= (0..31)
100 100 100 100 100 100 100 100 100 100 100 100 100 100 100 100 100 100 
100 100 100 100 100 100 100 100 100 100 100 100 100 100 
##$AQSEQ= 0
##$AQ_mod= 3
##$AUNM= <au_zg>
##$AUTOPOS= <23 >
##$BF1= 250.13
##$BF2= 250.13
##$BF3= 250.13
##$BF4= 250.13
##$BF5= 500.13
##$BF6= 500.13
##$BF7= 500.13
##$BF8= 500.13
##$BYTORDA= 1
##$CFDGTYP= 0
##$CFRGTYP= 5
##$CHEMSTR= <none>
##$CNST= (0..31)
1 1 145 1 1 1 1 1 1 1 1 1 1 1 1 1 1 1 1 1 1 1 1 1 1 1 1 1 1 1 1 1 
##$CPDPRG= <>
##$CPDPRG1= <>
##$CPDPRG2= <>
##$CPDPRG3= <>
##$CPDPRG4= <mlev>
##$CPDPRG5= <mlev>
##$CPDPRG6= <mlev>
##$CPDPRG7= <mlev>
##$CPDPRG8= <mlev>
##$CPDPRGB= <>
##$CPDPRGT= <>
##$D= (0..31)
0 1 0 0 0 0 0 0 0 0.06 0 0 0 0 0 0 0.0002 0 0 0 0 0 0 0 0 0 0 0 0 0 0 
0 
##$DATE= 1164804459
##$DBL= (0..7)
120 120 120 120 120 120 120 120 
##$DBP= (0..7)
150 150 150 150 150 150 150 150 
##$DBP07= 0
##$DBPNAM0= <>
##$DBPNAM1= <>
$$ [...]
##$SUBNAM7= <"">
##$SUBNAM8= <"">
##$SUBNAM9= <"">
##$SW= 20.6930455092707
##$SWIBOX= (0..15)
0 0 3 0 0 0 0 0 0 0 0 0 0 0 0 0 
##$SW_h= 5175.983436853
##$TD= 65536
##$TD0= 1
##$TE= 294.16
##$TE2= 300
##$TE3= 300
##$TEG= 300
##$TL= (0..7)
0 120 120 120 120 120 120 120 
##$TP= (0..7)
150 150 150 150 150 150 150 150 
##$TP07= 0
##$TPNAME0= <>
##$TPNAME1= <>
##$TPNAME2= <>
##$TPNAME3= <>
##$TPNAME4= <>
##$TPNAME5= <>
##$TPNAME6= <>
##$TPNAME7= <>
##$TPOAL= (0..7)
0.5 0.5 0.5 0.5 0.5 0.5 0.5 0.5 
##$TPOFFS= (0..7)
0 0 0 0 0 0 0 0 
##$TUNHIN= 0
##$TUNHOUT= 0
##$TUNXOUT= 0
##$USERA1= <user>
##$USERA2= <user>
##$USERA3= <user>
##$USERA4= <user>
##$USERA5= <user>
##$V9= 5
##$VALIST= <valist>
##$VCLIST= <CCCCCCCCCCCCCCC>
##$VD= 0
##$VDLIST= <DDDDDDDDDDDDDDD>
##$VPLIST= <PPPPPPPPPPPPPPP>
##$VTLIST= <TTTTTTTTTTTTTTT>
##$WBST= 1024
##$WBSW= 4
##$XGAIN= (0..3)
0 0 0 0 
##$XL= 0
##$YL= 0
##$YMAX_a= 335749
##$YMIN_a= -508061
##$ZGOPTNS= <>
##$ZL1= 120
##$ZL2= 120
##$ZL3= 120
##$ZL4= 120
##$ABSF1= 16.522
##$ABSF2= -4.171173
##$ABSG= 5
##$ABSL= 3
##$ALPHA= 0
##$AQORDER= 0
##$ASSFAC= 0
##$ASSFACI= 0
##$ASSFACX= 0
##$ASSWID= 0
##$AUNMP= <proc_1d>
##$AZFE= 0.1
##$AZFW= 0.1
##$BCFW= 0
##$BC_mod= 0
##$BYTORDP= 0
##$COROFFS= 0
##$CY= 12.5
##$DATMOD= 1
##$DC= 0
##$DFILT= <>
##$DTYPP= 0
##$F1P= 14.0000005364418
##$F2P= -0.99999901652339
##$FCOR= 0.5
##$FTSIZE= 32768
##$FT_mod= 6
##$GAMMA= 0
##$GB= 0
##$INTBC= 1
##$INTSCL= 1
##$ISEN= 128
##$LB= 0.3
##$LEV0= 0
##$LPBIN= 0
##$MAXI= 10000
##$MC2= 0
##$MEAN= 0
##$ME_mod= 0
##$MI= 0
##$NCOEF= 0
##$NC_proc= -3
##$NLEV= 6
##$NOISF1= 0
##$NOISF2= 0
##$NSP= 0
##$NTH_PI= 0
##$NZP= 0
##$OFFSET= 16.522
##$PC= 1
##$PHC0= 219.5505
##$PHC1= 8.840329
##$PH_mod= 1
##$PKNL= yes
##$PPARMOD= 0
##$PSCAL= 4
##$PSIGN= 0
##$REVERSE= no
##$SF= 250.13
##$SI= 32768
##$SIGF1= 0
##$SIGF2= 0
##$SINO= 400
##$SIOLD= 32768
##$SREGLST= <1H.CDCl3>
##$SSB= 0
##$STSI= 32768
##$STSR= 0
##$SW_p= 5175.98343685301
##$SYMM= 0
##$S_DEV= 0
##$TDeff= 65536
##$TDoff= 0
##$TI= <Analysis number 999999
Compound Code 99
Book Reference 9
Project Code 9>
##$TILT= no
##$TM1= 0
##$TM2= 0
##$TOPLEV= 0
##$USERP1= <user>
##$USERP2= <user>
##$USERP3= <user>
##$USERP4= <user>
##$USERP5= <user>
##$WDW= 1
##$XDIM= 32768
##$YMAX_p= 463876906
##$YMIN_p= -101424
$$ End of Bruker specific parameters
$$ ---------------------------------
##NTUPLES= NMR SPECTRUM
##VAR_NAME=  FREQUENCY,     SPECTRUM/REAL,   SPECTRUM/IMAG
##SYMBOL=    X,             R,               I
##VAR_TYPE=  INDEPENDENT,   DEPENDENT,       DEPENDENT
##VAR_FORM=  AFFN,          ASDF,            ASDF
##VAR_DIM=   32768,         32768,           32768
##UNITS=     HZ,            ARBITRARY UNITS, ARBITRARY UNITS
##FACTOR=    0.157963299565203, 1,           1
##FIRST=     4132.6476996994, 0,             0
##LAST=      -1043.33573715361, 0,           0
##MIN=       -1043.33573715361, -101424,     0
##MAX=       4132.6476996994, 463876906,     0
$$ Real data points
##PAGE= N=1
##DATA TABLE= (X++(R..R)), XYDATA
$$ [...]
$$ plain form
18757 1391546 1370720 1167200 962258 837458 747574 705023 720519 748934 751727 774679 811149
18746 811149 807937 775106 753305 753839 763423 800174 852248 920604 1015071 1121938 1236070 1359253
18734 1359253 1545212 1822894 2112946 2419658 2722274 3008999 2940517 2488689 2166109 2023113
18724 2023113 2049925 2255701 2585066 2935539 3304557 3639698 3678316 3095730 2330322 1801080
18714 1801080 1483593 1370893 1358762 1426342 1499680 1569846 1611765 1512724 1231016 961257
18704 961257 768129 669597 603236 568238 547732 554117 549458 533470 523778 510328 498031 525446
18692 525446 508051 490484 510219 511682 499552 498368 500323 517402 531048 562228 595326 648975
18680 648975 704780 735514 774433 807686 863253 913782 996894 1131372 1325355 1548199 1866430
$$ packed form
18757A391546k0826k03520k04942j24800q9884m2551J5496K8415K793K2952L6470
18746H11149l212l2831k1801N34R584L6751N2074O8356R4467J06867J14132J23183
18734A359253J85959K77682K90052L06712L02616K86725o8482m51828l22580j42996
18724B023113K6812K05776L29365L50473L69018L35141L8618n82586p65408n29242
18714A801080l17487j12700j2131O7580P3338P0166M1919r9041k81708k69759
18704I61257j93128r8532o6361l4998k0506O385m659j5988r692j3450j2297K7415
18692E25446j7395j7567J9735J463j2130j184J955J7079J3646L1180L3098N3649
18680F48975N5805L0734L8919L3253N5567N0529Q3112J34478J93983K22844L18231
$$ plain form
18669 1866430 2281721 2721823 3161310 3571197 3893721 3612039 2764511 2081799 1721020
18660 1721020 1544026 1465317 1448084 1485332 1537058 1596119 1539109 1319080 1114969 1023639 954504
18649 954504 885209 850152 847632 870332 858825 851959 860703 886620 929704 972110 995195 1012895
18637 1012895 1035894 1081514 1138247 1180418 1280974 1387867 1496752 1626715 1788573 1966875
18627 1966875 2157199 2363938 2619614 2844197 3025616 3183523 3415484 3759910 4242492
18618 4242492 4816972 5465657 6171094 6894964 7393433 7450859 7514798 8082401 9203471 10786519
18608 10786519 12571708 14441780 16478260 17733184 16380019 14414096 13954860 14992586
18600 14992586 17158888 20028588 23074412 26153009 28376161 26519468 20927414 15959575
$$ packed form
18669A866430M15291M40102M39487M09887L22524k81682q47528o82712l60779
18660A721020j76994p8709j7233L7248N1726N9061n7010k20029k04111r1330o9135
18649I54504o9295l5057k520K2700j1507o866Q744K5917M3084M2406K3085J7700
18637A012895K2999M5620N6733M2171J00556J06893J08885J29963J61858J78302
18627A966875J90324K06739K55676K24583J81419J57907K31961L44426M82582
18618D242492N74480O48685P05437P23870M98469N7426O3939N67603J121070J583048
18608A0786519J785189J870072K036480J254924j353165j965923m59236J037726
18600A4992586K166302K869700L045824L078597K223152j856693n592054m967839
$$ plain form
18592 15959575 13403431 12678286 13094145 14083950 15217950 16457145 17284899 15288910 11313190
18583 11313190 8463973 6951686 6153073 5745637 5520521 5426988 5468751 5607697 5848388
18574 5848388 6101857 6401662 6763361 7202725 7717271 8366587 9170082 10168158 11390727
18565 11390727 12891160 14692406 16767380 19484306 23190693 27703593 32496548 37333205
18557 37333205 42203448 43543796 38704835 34117422 33324488 35893489 40907058 47252211
18549 47252211 53946020 60451780 63883083 58041994 44902053 34015158 28355768 26471779
18541 26471779 26826599 28216484 29892250 31746506 31759230 26089624 18429479 13207726
18533 13207726 10164616 8284926 7050784 6149178 5454393 4956792 4566940 4297608 4126435
$$ packed form
18592A5959575k556144p25145M15859R89805J134000J239195Q27754j995989l975720
18583A1313190k849217j512287p98613m07436k25116r3533M1763J38946K40691
18574E848388K53469K99805L61699M39364N14546O49316Q03495R98076J222569
18565A1390727J500433J801246K074974K716926L706387M512900M792955M836657
18557C7333205M870243J340348m838961m587413p92934K569001N013569O345153
18549D7252211O693809O505760L431303n841089j3139941j0886895n659390j883989
18541B6471779L54820J389885J675766J854256J2724n669606p660145n221753
18533A3207726l043110j879690j234142r01606o94785m97601l89852k69332j71173
$$ plain form
18524 4126435 4034028 3967236 3888939 3799188 3730056 3724325 3758248 3827702 3866398 3952017 4086882
18513 4086882 4262639 4474193 4714169 5048779 5448356 5905856 6429633 7072752 7857112
18504 7857112 8879797 10213479 11921539 14194110 17379867 21683526 26896267 32603513
18496 32603513 38770328 45655763 49369112 45961246 41854247 40441311 38569185 30441669
18488 30441669 20659548 14276488 10523276 8166165 6625911 5576752 4843341 4261524
18480 4261524 3852162 3589941 3409720 3304017 3264067 3292832 3334733 3409415 3486153 3599635
18470 3599635 3729778 3848547 3964993 4128051 4312227 4509679 4736378 5028992 5395531
18461 5395531 5808724 6297492 6901866 7607393 8421427 9498470 10877130 12647736 14945193
$$ packed form
18524D126435r2407o6792p8297q9751o9132n731L3923O9454L8696Q5619J34865
18513D086882J75757K11554K39976L34610L99577M57500N23777O43119P84360
18504G857112J022685J333682J708060K272571L185757M303659N212741N707246
18496C2603513O166815O885435L713349l407866m106999j412936j872126q127516
18488C0441669r782121o383060l753212k357111j540254j049159p33411n81817
18480D261524m09362k62221j80221j05703l9950K8765M1901P4682P6738J13482
18470C599635J30143J18769J16446J63058J84176J97452K26699K92614L66539
18461E395531M13193M88768O04374P05527Q14034J077043J378660J770606K297457
$$ plain form
18452 14945193 18072245 22466241 28243627 34947357 42122135 50127544 58503224 60108886
18444 60108886 54215684 49970708 48632157 43073406 30612962 20278001 14163922 10499185
18436 10499185 8149197 6574130 5456771 4646608 4067615 3611656 3270868 3024632 2871364
18427 2871364 2743211 2692394 2676008 2650132 2669956 2735182 2748312 2740057 2755171 2807757 2813742
18416 2813742 2801775 2810559 2852998 2959174 3059577 3153368 3302584 3512233 3817910 4209922
18406 4209922 4735148 5401490 6264110 7442297 9090617 11203913 13612574 16173841 19088336
18397 19088336 21739263 21324782 19134621 18033932 17541643 14589995 10214112 7267271
18389 7267271 5613636 4627418 4035224 3705946 3549509 3524580 3567250 3658274 3774418 3867162
$$ packed form
18452A4945193L127052M393996N777386O703730P174778Q005409Q375680J605662
18444F0108886n893202m244976j338551n558751j2460444j0334961o114079l664737
18436A0499185k349988j575067j117359q10163n78993m55959l40788k46236j53268
18427B871364j28153n0817j6386k5876J9824O5226J3130q255J5114N2586N985
18416B813742j1967Q784M2439J06176J00403R3791J49216K09649L05677L92012
18406D209922N25226O66342Q62620J178187J648320K113296K408661K561267K914495
18397A9088336K650927m14481k190161j100689m92289k951648m375883k946841
18389G267271j653635r86218n92194l29278j56437k4929M2670R1024J16144R2744
$$ plain form
18379 3867162 4004052 4159207 4327454 4592890 4917481 5341165 5865782 6444778 7118041
18370 7118041 7885595 8739232 9669215 10680904 11890046 13416190 15341799 17854562 21246466
18361 21246466 25816054 31804959 39253712 47984033 57241936 65561537 71459986 72044940
18353 72044940 67662747 59973040 49655763 40653646 34387196 31323208 31317161 33833176
18345 33833176 38510981 45017375 52810234 60661171 67017394 69947535 66811418 59679775
18337 59679775 48918031 36861570 26726185 19135599 14065362 10820379 8707058 7247925
18329 7247925 6223775 5432085 4818484 4334142 3882762 3457389 3091567 2783000 2531143
18320 2531143 2348036 2184418 2087522 2038430 1976936 1919953 1866253 1806797 1721667 1596251 1437638
$$ packed form
18379C867162J36890J55155J68247K65436L24591M23684N24617N78996O73263
18370G118041P67554Q53637R29983J011689J209142J526144J925609K512763L391904
18361B1246466M569588N988905P448753Q730321R257903Q319601N898449N84954
18353G2044940m382193p689707j0317277r002117o266450l063988o047K516015
18345C3833176M677805O506394P792859P850937O356223K930141l136117p131643
18337E9679775j0761744j2056461j0135385p590586n070237l244983k113321j459133
18329G247925j024150p91690o13601m84342m51380m25373l65822l08567k51857
18320B531143j83107j63618r6896m9092o1494n6983n3700n9456q5130j25416j58613
$$ plain form
18309 1437638 1274671 1125375 1019445 933845 830441 769621 739152 703723 687122 654550
18299 654550 623671 603334 579929 546056 497778 442378 421267 396775 377196 361221 377958
18288 377958 368280 358828 344184 329798 309356 286174 270528 267044 259814 242409 226567 234315
18276 234315 212674 193825 217100 228099 223787 225900 213176 223322 209431 202396 201238 183605
18264 183605 197101 204481 216654 208608 215760 219697 219073 208876 217741 231692 210512 192722 183248
18251 183248 206266 207281 193981 186740 171567 149686 178580 166149 136030 131227 147755 172920
18239 172920 180705 165668 121582 97942 99276 121334 122073 122962 134128 174192 184125 185615 176920
18226 176920 164979 145453 150389 141683 132014 135958 140286 139156 143619 130982 110706 127849 156635
$$ packed form
18309A437638j62967j49296j05930q5600j03404o0820l0469l5429j6601l2572
18299F54550l0879k0337k3405l3873m8278n5400k1111k4492j9579j5975J6737
18288C77958r678r452j4644j4386k0442k3182j5646l484p230j7405j5842P748
18276B34315k1641j8849K3275J0999m312K113j2724J0146j3891p035j158j7633
18264A83605J3496P380J2173q046P152L937o24j0197Q865J3951k1180j7790r474
18251A83248K3018J015j3300p241j5173k1881K8894j2431l0119m803J6528K5165
18239A72920P785j5037m4086k3640J334K2058P39Q89J1166M0064R933J490q695
18226A76920j1941j9526M936q706r669L944M328j130M463j2637k0276J7143K8786
$$ plain form
18213 156635 161175 158618 146830 143760 135754 137019 137406 120092 126407 147803 144787 142858 145001 142373
18199 142373 119406 121263 124873 83067 49259 48249 72521 79193 77812 90320 78541 86858 93464
18186 93464 93936 93357 101585 101148 109598 104100 87168 94947 110593 93015 105497 121521 129113 164704
18172 164704 192704 195683 187083 165397 139498 159958 176670 173104 169291 170960 160883 163688 171003
18159 171003 205030 209133 200559 197461 224456 239913 245275 224953 233433 270669 284787 280186 311946
18146 311946 344212 353296 364187 362051 360485 378169 411375 458061 509934 541944 602818 662940
18134 662940 724039 779007 865379 997278 1136975 1295203 1473268 1680431 1910708 2141125
18124 2141125 2369083 2649310 2943929 3293484 3665576 4092065 4654999 5432199 6540806
$$ packed form
18213A56635M540k557j1788l070q006J265L87j7314O315K1396l016j929K143k628
18199A42373k2967J857L610m1806l3808j010K4272O672j381J2508j1779Q317O606
18186I3464M72n79Q228m37Q450n498j6932P779J5646j7578J2482J6024P592L5591
18172A64704K8000K979q600k1686k5899K0460J6712l566l813J669j0077K805P315
18159A71003L4027M103q574l098K6995J5457N362k0322Q480L7236J4118m601L1760
18146C11946L2266R084J0891k136j566J7684L3206M6686N1873L2010O0874O0122
18134F62940O1099N4968Q6372J31899J39697J58228J78065K07163K30277K30417
18124B141125K27958K80227K94619L49555L72092M26489N62934P77200J108607
$$ plain form
18115 6540806 8023791 10019395 13021832 17488196 23120394 29064931 34549413 41255757
18107 41255757 45364547 32607521 18187778 10826314 7151647 5103304 3826512 2977128
18099 2977128 2411260 1996471 1669691 1394927 1164537 1010606 908184 829627 759384 685147
18089 685147 590784 529555 479148 453373 445398 417562 413238 398177 356699 321955 302042 277530
18077 277530 267710 251021 256432 252461 243998 234832 245190 277949 296601 288966 254305 230850 239317
18064 239317 264952 279764 289013 311507 310688 269664 224255 203387 184796 166870 172862 178391
18052 178391 184684 167078 141168 116919 88371 52783 27286 32467 13168 27746 47040 49487
18040 49487 54892 58974 57845 48549 44122 41940 48295 56805 75931 84134 92151 101756 107448 96466
$$ packed form
18115F540806J482985J995604L002437M466364N632198N944537N484482O706344
18107D1255757M108790j2757026j4419743p361464l674667k048343j276792q49384
18099B977128n65868m14789l26780k74764k30390j53931j02422p8557p0243p4237
18089F85147r4363o1229n0407k5775p975k7836m324j5061m1478l4744j9913k4512
18077B77530r820j6689N411l971q463r166J0358L2759J8652p635l4661k3455Q467
18064B39317K5635J4812R249K2494q19m1024m5409k0868j8591j7926N992N529
18052A78391O293j7606k5910k4249k8548l5588k5497N181j9299J4578J9294K447
18040D9487N405M082j129r296m427k182O355Q510J9126Q203Q017R605N692j0982
$$ plain form
18026 96466 78059 77989 96151 120092 163281 181533 192339 173944 159022 154070 159045 192676 231878
18013 231878 230190 222461 189072 161756 131528 132170 136137 137923 129248 117642 138089 145295 116828
18000 116828 70092 41061 42697 73321 60254 33832 46842 51851 55387 75025 90348 79459
17988 79459 64818 51173 61814 80515 82888 113925 155637 169541 176598 217286 233450 224293
17976 224293 211957 181630 143714 117486 102944 100277 73854 63430 42948 16775 26296 57946
17964 57946 87880 91527 64774 61078 67888 54482 49638 24484 -16205 4606 21715 39210
17952 39210 55523 42415 18465 6996 27238 30491 19763 6013 6471 4829 20594 24447 30791
17939 30791 57833 86345 99533 117852 133200 161101 189615 224558 281527 289547 279506 254208
$$ packed form
18026I6466j8407p0J8162K3941M3189J8252J0806j8395j4922m952M975L3631L9202
18013B31878j688p729l3389k7316l0228O42L967J786q675j1606K0447P206k8467
18000A16828m6736k9031J636L0624j3067k6422J3010N009L536J9638J5323j0889
17988G9459j4641j3645J0641J8701K373L1037M1712J3904P057M0688J6164r157
17976B24293j2336l0327l7916k6228j4542k667k6423j0424k0482k6173R521L1650
17964E7946K9934L647k6753l696O810j3406m844k5154m0689K0811J7109J7495
17952C9210J6313j3108k3950j1469K0242L253j0728j3750M58j642J5765L853O344
17939C0791K7042K8512J3188J8319J5348K7901K8514L4943N6969Q020j0041k5298
$$ plain form
17927 254208 234879 211796 177728 109236 40258 16520 10179 -2628 -20535 -16796 -19981 -32891
17915 -32891 -36781 -41783 -45358 -16693 -23619 -16895 7419 -3091 -12616 -13441 -28810 -41347 -30453
17902 -30453 -12370 -432 5817 25026 2617 -8470 -27250 -40337 -34950 -15793 2611 20110
17890 20110 36656 31666 7906 14674 6384 33612 54736 68067 99479 103215 136816 152765
17878 152765 142313 130321 117985 103003 73433 56518 32891 24319 8037 -17976 -35336 -48203
17866 -48203 -31845 -17438 -5502 -166 2685 -5460 -10190 -28307 -23714 -21458 -15376 -3104 1174
17853 1174 -42071 -30381 6590 21337 21561 -3278 -14458 8035 5653 -3780 -24209 -27453 -18909
17840 -18909 -15311 3463 -5052 -26068 -13315 13022 20665 14219 -16546 -22382 -5671 12130 7437
$$ packed form
17927B54208j9329k3083l4068o8492o8978k3738o341j2807j7907L739l185j2910
17915c2891l890n002l575K8665o926O724K4314j0510r525q25j5369j2537J0894
17902c0453J8083J1938O249J9209k2409j1087j8780j3087N387J9157J8404J7499
17890B0110J6546m990k3760O768q290K7228K1124J3331L1412L736L3601J5949
17878A52765j0452j1992j2336j4982k9570j6915k3627q572j6282k6013j7360j2867
17866d8203J6358J4407J1936N336K851q145m730j8117M593K256O082J2272M278
17853A174m3245J1690L6971J4747K24k4839j1180K2493k382r433k0429l244Q544
17840a8909L598J8774q515k1016J2753K6337P643o446l0765n836J6711J7801m693
$$ plain form
17827 7437 -2681 -38789 -51180 -13513 8115 -865 32 -7045 3796 3140 -14109 -20683 -11706
17814 -11706 1667 -15538 -14020 -9215 -15888 -12944 4903 15778 -12441 -10384 -4231 12249 27580
17801 27580 29696 24591 28018 28769 48027 67218 29575 8159 14768 14706 39166 47967 34109 28373
17787 28373 16099 16240 14668 3474 17767 33982 26890 34961 58435 60401 52846 51429 51192 68604
17773 68604 85252 87980 76861 76638 89262 121287 130674 127831 165087 224553 307661 367683 387561
17760 387561 354350 315799 280310 213609 180929 180528 186289 187935 194380 188646 216229 258106 308340
17747 308340 332367 331562 302621 247115 200041 157346 116156 57903 15294 1004 12977 9154
17735 9154 12539 -7645 -12821 28843 39934 19761 6418 15493 16679 30797 32787 15948 8426
$$ packed form
17827G437j0118l6108j2391L7667K1628q980Q97p077J0841o56j7249o574Q977
17814a1706J3373j7205J518M805o673K944J7847J0875k8219K057O153J6480J5331
17801B7580K116n105L427P51J9258J9191l7643k1416O609o2K4460Q801j3858n736
17787B8373j2274J41j572j1194J4293J6215p092Q071K3474J966p555j417k37J7412
17773F8604J6648K728j1119k23J2624L2025R387k843L7256N9466Q3108O0022J9878
17760C87561l3211l8551l5489o6701l2680m01N761J646O445n734K7583M1877N0234
17747C08340K4027q05k8941n5506m7074m2695m1190n8253m2609j4290J1973l823
17735I154L385k0184n176M1664J1091k0173j3343R075J186J4118J990j6839p522
$$ plain form
17722 8426 -11337 -6822 2216 12231 11117 -7158 -6039 3483 -3818 6112 9626 12415 1671 348
17708 348 -5086 -12480 -13590 -21205 -12220 17107 -13014 -19573 -57022 -64036 -41925 -38385 -68586 -88861
17694 -88861 -71923 -47067 -41396 -33007 -16355 3779 10534 1209 -21722 -25440 -16260 -24932 -30452
17681 -30452 -39669 -10333 15399 9946 20811 -11015 -31641 -57711 -62554 -44580 -17577 -8176
17669 -8176 135 13112 20190 5741 -17756 -9344 -4323 -11188 14706 20008 -7249 -15981 -20139
17656 -20139 -23055 -8179 -23493 -23391 -22894 -7147 17025 2724 -9975 -1586 1120 -16302 -11273
17643 -11273 -4378 -10930 -11627 -30456 -47611 -56487 -37493 -24633 -23029 -32691 -37168 -22237 -17861
17630 -17861 -11779 -8338 -6705 -10023 -7113 -9048 -22940 -19130 -32589 -45796 -29778 3032 11503
$$ packed form
17722H426j9763M515R038J0015j114j8275J119R522p301R930L514K789j0744j323
17708C48n434p394j110p615Q985K9327l0121o559l7449p014K2111L540l0201k0275
17694h8861J6938K4856N671Q389J6652K0134O755r325k2931l718R180q672n520
17681c0452r217K9336K5732n453J0865l1826k0626k6070m843J7974K7003R401
17669h176Q311J2977P078j4449k3497Q412N021o865K5894N302k7257q732m158
17656b0139k916J4876j5314J02M97J5747K4172j4301j2699Q389K706j7422N029
17643a1273O895o552o97j8829j7155q876J8994J2860J604r662m477J4931M376
17630a7861O082L441J633l318K910j935j3892L810j3459j3207J6018L2810Q471
$$ plain form
17617 11503 -5867 -15824 -14048 -8332 -11636 -862 2780 -4963 9245 29932 7067 9826 -7894
17604 -7894 -12859 15162 34243 35846 29826 12571 -11095 -12567 8822 -4900 -21726 -2452 14240
17591 14240 11763 11787 5261 -4262 -15621 -10376 2119 11278 29189 48307 41362 43165 33058 10273
17577 10273 -31027 -29187 -9582 9356 18772 15310 25784 30635 45324 52596 35051 4146 13587
17564 13587 23180 17731 16720 28794 36015 43414 63610 100563 131772 138460 143639 181690 217703
17551 217703 258934 298929 344476 396346 419002 387312 297204 193159 143627 135089 138449 156919
17539 156919 147488 162411 202460 268605 336709 384536 426087 439981 367305 259982 181800
17528 181800 136309 109357 90613 73200 78450 82157 72339 52125 28497 31306 32401 34470 11994
$$ packed form
17617A1503j7370r957J776N716l304J0774L642p743J4208K0687k2865K759j7720
17604g894m965K8021J9081J603o020j7255k3666j472K1389j3722j6826J9274J6692
17591A4240k477K4o526r523j1359N245J2495R159J7911J9118o945J803j0107k2785
17577A0273m1300J840J9605J8938R416l462J0474M851J4689P272j7545l0905R441
17564A3587R593n449j011J2074P221P399K0196L6953L1209O688N179L8051L6013
17551B17703M1231L9995M5547N1870K2656l1690r0108j04045m9532q538L360J8470
17539A56919r431J4923M0049O6145O8104M7827M1551J3894p2676j07323p8182
17528A81800m5491k6952j8744j7413N250L707r818k0214k3628K809J095K069k2476
$$ plain form
17515 11994 5588 -6364 8538 26705 5276 -11869 -21266 -13055 -5981 -8150 -25242 -32842 -25882
17502 -25882 -24215 -4818 18143 28113 15323 19362 5165 16916 13514 9198 34890 43648 40039
17489 40039 46202 27987 11711 10634 -1393 -1017 -8437 981 16164 49250 51183 21195 -2453
17476 -2453 14711 4414 2396 3991 -15357 -14856 -25902 -19800 860 18644 4555 -18982 -15109
17463 -15109 18417 9318 898 27958 41992 24092 17688 8526 -1566 -4549 -13709 -9374 10375
17450 10375 17087 22175 14558 17991 46444 108744 139728 180804 228256 294498 240002 145109
17438 145109 89095 53935 7186 -21497 -19485 -851 -2046 6000 3870 5570 12150 23295 2806
17425 2806 -22232 -10995 1082 10678 30274 54169 67469 53243 37278 18630 -6937 99
$$ packed form
17515A1994o406j1952J4902J8167k1429j7145r397Q211P074k169j7092p600O960
17502b5882J667J9397K2961R970j2790M039j4197J1751l402m316K5692Q758l609
17489D0039O163j8215j6276j077j2027L76p420R418J5183L3086J933k9988k3648
17476b453J7164j0297k018J595j9348N01j1046O102K0660J7784j4089k3537L873
17463a5109L3526r099q420K7060J4034j7900o404r162j0092k983r160M335J9749
17450A0375O712N088p617L433K8453O2300L0984M1076M7452O6242n4496r4893
17438A45109n6014l5160m6749k8683K012J8634j195Q046k130J700O580J1145k0489
17425B806k5038J1237J2077R596J9596K3895J3300j4226j5965j8648k5567P036
$$ plain form
17413 99 -8134 -14363 -2617 -4751 -1126 -14167 -5671 -7231 -7246 3906 -18783 -34263 -41540 -29000
17399 -29000 -18255 2105 29564 45834 21548 -849 -7404 -17065 -9718 22945 42817 36916
17387 36916 40764 25406 2649 15763 20805 24072 23770 9134 29853 41509 40621 21031 -2791
17374 -2791 -19995 -22012 -23928 -27631 -15637 6371 6282 -5554 -17881 -20781 -26352 -13944 13967
17361 13967 8911 -14073 -14314 -21491 -22268 2394 1081 -40344 -40141 -7161 -3281 -17707 -20513 -25242
17347 -25242 -31606 -15410 -15415 -30815 -36527 -17519 3498 -2142 -11634 -10802 -2006 12516 24549 21209
17333 21209 3402 6051 8611 9103 15633 -1586 -3214 -18145 -44700 -35232 -12827 -1318 -12055
17320 -12055 -33778 -17256 5799 15953 264 13744 17192 14147 7889 -9431 -24308 -19240
$$ packed form
17413I9q233o229J1746k134L625j3041Q496j560j5J1152k2689j5480p277J2540
17399b9000J0745K0360K7459J6270k4286k2397o555r661P347L2663J9872n901
17387C6916L848j5358k2757J3114N042L267l02j4636K0719J1656q88j9590k3822
17374b791j7204k017j916l703J1994K2008q9j1836j2327k900n571J2408K7911
17361A3967n056k2984k41p177p77K4662j313m1425K03L2980L880j4426k806m729
17347b5242o364J6196nj5400n712J9008K1017n640r492Q32Q796J4522J2033l340
17333B1209j7807K649K560M92O530j7219j628j4931k6555R468K2405J1509j0737
17320a2055k1723J6522K3055J0154j5689J3480L448l045o258j7320j4877N068
$$ plain form
17308 -19240 7230 26841 24368 21221 11629 13109 5282 296 -7712 -6772 633 -7393 -1137 18631
17294 18631 7759 -6435 -9198 -13948 -5510 15642 34281 42571 8876 -4236 27446 61410
17282 61410 39754 38929 27840 22318 10445 12022 8063 24545 30793 17936 21398 29813 23604
17269 23604 37708 45671 34657 49758 57936 66128 86381 83049 65049 54661 48414 61693 72566
17256 72566 63807 55563 77771 82111 63380 58443 74659 73015 68267 42806 27706 31698 39643
17243 39643 51855 46687 36194 28632 17614 26479 49296 59648 51519 52111 67455 80497 63758
17230 63758 51633 65309 74877 91827 92249 75314 58213 47695 41262 38361 35854 31433 46210
17217 46210 62863 44938 51522 55613 38851 30777 35366 56706 60426 65363 98851 75380 49021
$$ packed form
17308a9240K6470J9611k473l147r592J480p827m986q008R40P405q026O256J9768
17294A8631j0872j4194k763m750Q438K1152J8639Q290l3695j3112L1682L3964
17282F1410k1656q25j1089n522j1873J577l959J6482O248j2857L462Q415o209
17269B3604J4104P963j1014J5101Q178Q192K0253l332j8000j0388o247J3279J0873
17256G2566q759q244K2208M340j8731m937J6216j644m748k5461j5100L992P945
17243C9643J2212n168j0493p562j1018Q865K2817J0352q129N92J5344J3042j6739
17230F3758j2125J3676R568J6950M22j6935j7101j0518o433k901k507m421J4777
17217D6210J6653j7925O584M091j6762q074M589K1340L720M937L3488k3471k6359
$$ plain form
17204 49021 50159 53191 35616 47250 52199 65349 55243 53556 38792 51434 57206 37355 29236
17191 29236 37423 38712 53995 60620 62365 61935 62145 44099 31967 50867 71654 33442 24204
17178 24204 25263 46242 49421 49170 51949 64517 63283 67293 57004 58537 40618 53116 62709
17165 62709 66776 68945 74732 81158 75722 89958 106149 91587 66231 75768 84949 73007 64460
17152 64460 73284 80527 67279 85846 108531 134041 133584 138022 144475 142801 123244 99288 89253
17139 89253 78270 74724 94267 62436 66811 107249 124730 135048 125704 104727 89425 126566
17127 126566 148552 132944 85189 73336 95146 105126 79967 90463 89770 92091 113601 130390
17115 130390 118163 120907 113995 108588 138423 153635 139798 115638 98769 115457 112124 121774
$$ packed form
17204D9021J138L032j7575J1634M949J3150j0106j687j4764J2642N772j9851q119
17191B9236Q187J289J5283O625J745m30K10j8046j2132J8900K0787l8212r238
17178B4204J059K0979L179k51K779J2568j234M010j0289J533j7919J2498R593
17165F2709M067K169N787O426n436J4236J6191j4562k5356R537R181j1942q547
17152F4460Q824P243j3248J8567K2685K5510m57M438O453j674j9557k3956j0035
17139H9253j0983l546J9543l1831M375M0438J7481J0318r344k0977j5302L7141
17127A26566K1986j5608m7755j1853K1810R980k5159J0496o93K321K1510J6789
17115A30390j2227K744o912n407K9835J5212j3837k4160j6869J6688l333R650
$$ plain form
17103 121774 149188 151862 140289 137873 156849 183847 165017 144158 134169 150636 145700 152364
17091 152364 180872 180166 205996 220239 234248 230999 230852 235360 231486 220645 214284 230477 259042
17078 259042 259706 255060 265501 269693 266149 244835 265903 284169 286376 299360 329388 365030 365323
17065 365323 349306 340632 354592 375329 388542 373615 376302 401834 419403 444805 479107 495668
17053 495668 502198 495832 517960 543455 557117 568275 584721 606552 650961 656477 684607 724228
17041 724228 744762 780657 829961 841073 881647 929550 970441 1016468 1071918 1140189 1202337
17030 1202337 1299233 1379277 1451405 1547425 1654370 1770174 1905672 2076575 2295340 2528409
17020 2528409 2766501 3052766 3385618 3700668 4060959 4502900 5029985 5585597 6188863
$$ packed form
17103A21774K7414K674j1573k416J8976K6998j8830k0859r989J6467m936O664
17091A52364K8508p06K5830J4243J4009l249j47M508l874j0841o361J6193K8565
17078B59042O64m646J0441M192l544k1314K1068J8266K207J2984L0028L5642K93
17065C65323j6017q674J3960K0737J3213j4927K687K5532J7569K5402L4302J6561
17053D95668O530o366K2128K5495J3662J1158J6446K1831M4409N516K8130L9621
17041G24228K0534L5895M9304J1112M0574M7903M0891M6027N5450O8271O2148
17030A202337R6896Q0044P2128R6020J06945J15804J35498J70903K18765K33069
17020B528409K38092K86265L32852L15050L60291M41941N27085N55612O03266
$$ plain form
17011 6188863 6853402 7606191 8460458 9401593 10417355 11550356 13000255 14956459 17564423
17002 17564423 20959032 25528006 31817834 40316006 50731696 61959352 72893596 83087858
16994 83087858 87253361 75200707 55078116 40300341 32155799 28355649 27328167 28383171
16986 28383171 31419138 36760355 44486196 53849959 63577142 72841569 80450820 77834347
16978 77834347 59687017 39886650 26751895 18917860 14096515 10967702 8855734 7357479
16970 7357479 6258316 5475062 4887574 4449291 4089874 3762781 3446095 3127609 2793071
16961 2793071 2493835 2242692 2013757 1852469 1717623 1610999 1536762 1468514 1413602 1343581
16951 1343581 1233377 1089538 948882 837903 781424 726021 656139 619413 600862 580412
$$ packed form
17011F188863O64539P52789Q54267R41135J015762J133001J449899J956204K607964
17002A7564423L394609M568974O289828Q498172J0415690J1227656J0934244J0194262
16994H3087858M165503j2052654k0122591j4777775q144542l800150j027482J055004
16986B8383171L035967N341217P725841R363763R727183R264427P609251k616473
16978G7834347j8147330j9800367j3134755p834035m821345l128813k111968j498255
16970G357479j099163p83254n87488m38283l59417l27093l16686l18486l34538
16961B793071k99236k51143k28935j61288j34846j06624p4237o8248n4912p0021
16951A343581j10204j43839j40656j10979n6479n5403o9882l6726j8551k0450
$$ plain form
16941 580412 557182 562772 549914 520687 489198 431517 407176 401096 354175 315745 289357 284268
16929 284268 282494 289762 291117 270845 259748 280371 273581 269465 246142 230883 217357 193363
16917 193363 197416 204984 186776 194707 220337 196134 195726 190959 154241 143981 153664 156814 126666
16904 126666 146911 142607 141266 160742 151116 119657 102320 106064 107634 107425 109213 108636 91350
16891 91350 96498 106996 111184 130956 119375 133883 134477 138563 140761 129685 116393 104989 110329
16878 110329 119792 115851 105556 88845 77166 79425 60599 71980 87767 93064 119235 139735
16866 139735 137695 101738 102588 86310 81673 86586 78754 86534 95585 71428 55327 72173 93472
16853 93472 118446 104590 69484 62684 65850 30097 -371 2051 33489 40944 27004 38759
$$ packed form
16941E80412k3230N590j2858k9227l1489n7681k4341o080m6921l8430k6388n089
16929B84268j774P268J355k0272j1097K0623o790m116k3323j5259j3526k3994
16917A93363M053P568j8208P931K5630k4203m08m767l6718j0260R683L150l0148
16904A26666K0245m304j341J9476r626l1459j7337L744J570k09J788n77j7286
16891I1350N148J0498M188J9772j1581J4508N94M086K198j1076j3292j1404N340
16878A10329R463l941j0295j6711j1679K259j8826J1381J5787N297K6171K0500
16866A39735k040l5957Q50j6278m637M913p832P780R051k4157j6101J6846K1299
16853I3472K4974j3856l5106o800L166l5753l0468K422L1438P455j3940J1755
$$ plain form
16841 38759 45929 42797 36102 29899 31504 16848 30931 51272 43910 40595 38550 37665 46634 34083
16827 34083 46242 58220 60905 67709 41231 27174 53439 31984 32460 66193 48368 15394
16815 15394 2197 -1850 9633 31303 25373 16917 34543 28050 37162 67784 91173 92542 60818
16802 60818 52706 66003 61598 54766 33775 35887 53196 52030 39127 31654 45689 45948 40050
16789 40050 28740 22335 32350 52253 68225 90478 91138 83658 62094 56150 62046 49157 22184
16776 22184 10646 25335 25457 31256 47096 49451 56464 51847 31148 4909 10172 24490 30696
16763 30696 40681 72355 102276 101425 70255 56709 76791 68973 73373 61874 57387 62522 54227
16750 54227 72748 77534 93801 82936 79810 73439 68552 64283 54044 87424 105845 106005 99064
$$ packed form
16841C8759P170l132o695o203J605j4656J4083K0341p362l315k045q85Q969j2551
16827C4083J2159J1978K685O804k6478j4057K6265k1455M76L3733j7825l2974
16815A5394j3197m047J1483K1670n930q456J7626o493R112L0622K3389J369l1724
16802F0818q112J3297m405o832k0991K112J7309j166j2903p473J4035K59n898
16789D0050j1310o405J0015J9903J5972K2253O60p480k1564n944N896j2889k6973
16776B2184j1538J4689J22N799J5840K355P013m617k0699k6239N263J4318O206
16763C0696R985L1674K9921q51l1170j3546K0082p818M400j1499m487N135q295
16750E4227J8521M786J6267j0865l126o371m887m269j0239L3380J8421J60o941
$$ plain form
16737 99064 108843 117905 95395 95305 102302 100427 110903 126021 139072 143813 130846 139122 131513 140721
16723 140721 147497 172922 182252 174076 193197 208493 206648 206325 223173 244643 267287 301261 320951
16710 320951 332951 360671 376145 392784 412438 438214 465770 511534 576741 634485 678177
16699 678177 722428 745406 790652 863102 942884 1029025 1102702 1189906 1295986 1406501 1496464
16688 1496464 1604045 1700244 1799794 1886775 1967858 2041899 2105022 2160807 2193478 2220185 2227981
16677 2227981 2217347 2191512 2167611 2132466 2108191 2079636 2016287 1959066 1886853 1808872 1726808
16666 1726808 1635343 1530176 1417201 1304545 1213316 1115230 990606 872787 774309 724752
16656 724752 682957 652820 602295 515157 441205 408444 407362 377069 323136 305774 308675 276366
$$ packed form
16737I9064R779R062k2510r0O997j875J0476J5118J3051M741j2967Q276p609R208
16723A40721O776K5425R330q176J9121J5296j845l23J6848K1470K2644L3974J9690
16710C20951J2000K7720J5474J6639J9654K5776K7556M5764O5207N7744M3692
16699F78177M4251K2978M5246P2450P9782Q6141P3677Q7204J06080J10515Q9963
16688A496464J07581R6199R9550Q6981Q1083P4041O3123N5785L2671K6707P796
16677B227981j0634k5835k3901l5145k4275k8555o3349n7221p2213p7981q2064
16666A726808r1465j05167j12975j12656r1229r8086j24624j17819r8478m9557
16656G24752m1795l0137n0525q7138p3952l2761j082l0293n3933j7362K901l2309
$$ plain form
16644 276366 253393 277484 273060 262322 256312 272500 254903 229443 207273 200794 197100 173868
16632 173868 168782 145718 147503 148070 127038 105792 104613 103190 86879 72598 78644 82092 71820
16619 71820 67907 91913 110154 79198 59709 54673 74019 92839 95598 70204 58865 69781
16607 69781 76616 81951 81083 63729 56241 61341 51751 30792 27239 11641 8136 -1163 -8958 -9199
16593 -9199 8395 10106 -7767 -9239 -4465 -10591 -13203 -8294 -12316 1584 18177 1778 -14321
16580 -14321 -6179 3307 14531 4165 -4617 -1465 8467 15135 14038 -1702 -19010 -4583 36228
16567 36228 32346 17100 -7230 -5002 -3458 23101 21710 13168 5168 -518 -10971 -6600 -13592
16554 -13592 -27449 -12161 -74 -18683 -5405 20924 8730 -16992 -7221 -10405 36 2538
$$ packed form
16644B76366k2973K4091m424j0738o010J6188j7597k5460k2170o479l694k3232
16632A73868n086k3064J785N67k1032k1246j179j423j6311j4281O046L448j0272
16619G1820l913K4006J8241l0956j9489n036J9346J8820K759k5394j1339J0916
16607F9781O835N335q68j7354p488N100r590k0959l553j5598l505r299p795k41
16593i199J7594J711j7873j472M774o126k612M909m022J3900J6593j6399j6099
16580a4321Q142R486J1224j0366q782L152R932O668j097j5740j7308J4427M0811
16567C6228l882j5246k4330K228J544K6559j391q542q000n686j0453M371o992
16554a3592j3857J5288J2087j8609J3278K6329j2194k5722R771l184J0441K502
$$ plain form
16542 2538 20040 46548 31721 24563 -5287 -16077 -30474 -14165 8688 15399 -3879 -6569
16530 -6569 -17711 -20875 -17829 -7620 -15172 -13733 8933 372 -27087 -56098 -68629 -50750 -36322
16517 -36322 -33677 -27621 -13431 -11955 2614 11149 3010 -8096 -21675 -13134 -10620 1438 3625
16504 3625 -30310 -16091 -6713 -13248 -12049 -3828 -12752 -23349 -3648 5788 5260 17058 10911 380
16490 380 -9175 -16584 -6687 -6569 -7909 -18178 -15083 14437 -374 -10475 -12784 -16429 -16595 -9036
16476 -9036 -21783 -18788 -23205 -10518 1623 -27647 -28579 -19312 -15836 -25320 -12793 -5289 -13471 -4370
16462 -4370 1263 8114 6524 11147 35923 41035 56431 39737 28658 41420 46039 41441 30186
16449 30186 25114 43370 64772 84259 88708 88698 93950 104836 158778 214807 281310 333464 387201
$$ packed form
16542B538J7502K6508j4827p158k9850j0790j4397J6309K2853O711j9278k690
16530f569j1142l164L046J0209p552J439K2666q561k7459k9011j2531J7879J4428
16517c6322K645O056J4190J476J4569Q535q139j1106j3579Q541K514J2058K187
16504C625l3935J4219R378o535J199Q221q924j0597J9701R436n28J1798o147j0531
16490C80r555p409R897J18j340j0269L095K9520j4811j0101k309l645j66P559
16476i036j2747K995m417J2687J2141k9270r32R267L476r484J2527P504q182R101
16462d370N633O851j590M623K4776N112J5396j6694j1079J2762M619m598j1255
16449C0186n072J8256K1402J9487M449j0N252J0886N3942N6029O6503N2154N3737
$$ plain form
16436 387201 428994 444921 385815 297034 234991 175348 143954 131285 143329 161529 191675
16425 191675 229162 258758 321462 369704 394059 399828 331753 214298 132121 109148 78519
16414 78519 34202 3825 6118 -6009 -28323 -5079 20850 30546 18845 4182 10653 385
16402 385 -13696 -11587 -41473 -52247 -40281 -29499 -13194 -7544 -9973 -14014 -16888 -3338 5823
16389 5823 -5888 -1837 -3416 -6159 -8430 -12116 -415 -9560 -22573 -40338 -43927 -24107 2342
16376 2342 17424 17092 10696 25287 9995 -14081 -30302 -21671 -1139 24315 22743 16091 14166
16363 14166 23157 17645 -7303 -3866 3457 -7033 -3397 447 -2655 6154 9061 12447 33958 38205
16349 38205 472 -40594 -28280 -25818 -21851 -14955 -6536 5972 323 4095 2659 24104 17040
$$ packed form
16436C87201M1793J5927n9106q8781o2043n9643l1394j2669J2044J8200L0146
16425A91675L7487K9596O2704M8242K4355N769o8075j17455q2177k2973l0629
16414G8519m4317l0377K293j2127k2314K3244K5929R696j1701j4663O471j0268
16402C85j4081K109k9886j0774J1966J0782J6305N650k429m041k874J3550R161
16389E823j1711M051j579k743k271l686J1701r145j3013j7765l589J9820K6449
16376B342J5082l32o396J4591j5292k4076j6221Q631K0532K5454j572o652j925
16363A4166Q991n512k4948L437P323j0490L636L844l102Q809K907L386K1511M247
16349C8205l7733m1066J2314K462L967O896Q419J2508n649L772j436K1445p064
$$ plain form
16336 17040 -4724 -21026 -10225 -8602 -13003 -16809 -21978 -45139 -46272 -37940 -16140 -23595 -44842
16323 -44842 -55290 -38644 -8502 -1782 -15698 -16858 -27359 -53144 -40686 -24003 -40291 -32096
16311 -32096 -18009 -17701 2719 3516 781 -10160 -8021 -34988 -20073 -200 -15910 -29470 -1857
16298 -1857 1327 -34252 -67749 -45856 -43765 -31469 -2014 5187 -6933 -21855 -30980 -53367 -31794
16285 -31794 -33594 -41197 -40934 -8715 -643 12615 5261 -15226 321 -4593 -21760 -51456 -58362
16272 -58362 -40063 -13808 -516 3941 5794 20846 6526 -626 -2695 -17277 -30625 -16015
16260 -16015 -9052 8175 19989 29466 26017 1324 -26276 -25770 -28862 -4025 -7724 -22640 -19065
16247 -19065 -6997 -10378 -25958 -10946 -22411 -14491 -6685 -1147 10966 6572 1880 -8798 -20542
$$ packed form
16336A7040k1764j6302J0801J623m401l806n169k3161j133Q332K1800p455k1247
16323d4842j0448J6646L0142O720j3916j160j0501k5785J2458J6683j6288Q195
16311c2096J4087L08K0420P97k735j0941K139k6967J4915J9873j5710j3560K7613
16298a857L184l5579l3497K1893K091J2296K9455P201j2120j4922r125k2387K1573
16285c1794j800p603K63L2219Q072J3258p354k0487J5547m914j7167k9696o906
16272e8362J8299K6255J3292M457J853J5052j4320p152k069j4582j3348J4610
16260a6015O963J7227J1814R477l449k4693k7600N06l092K4837l699j4916L575
16247a9065J2068l381j5580J5012j1465P920P806N538J2113m394m692j0678j1744
$$ plain form
16234 -20542 -13485 11026 33607 22754 -6403 -33147 -13037 -6233 -9987 -2923 -17864 -21720 -3813
16221 -3813 -14293 -16685 -8725 5073 -8794 -21346 -2057 -26169 -41281 -33314 -21916 -14284 -3815
16208 -3815 -27213 -23560 -13830 -10949 6176 12479 -19782 -47323 -36012 -21993 -29999 -25171 -23932
16195 -23932 -35745 -19924 -11781 10707 6933 2911 -1672 -23404 -30004 -9482 -10801 -8287 -1132
16182 -1132 15810 4583 -8890 -16312 -18804 -19569 -12823 -45454 -61311 -47558 -48507 -47791 -36862 -37406
16168 -37406 -48645 -27040 -13452 -11070 -28776 -26679 -26170 -30353 -26656 -27857 -36839 -40335 -16252
16155 -16252 -18095 -22183 -8188 6627 2279 -8668 -15263 -29369 -16695 -7678 -15861 -16497 -36656
16142 -36656 -47736 -50812 -37530 -31986 -24504 -24364 -54017 -57235 -53832 -31041 -4461 -10613 12367
$$ packed form
16234b0542P057K4511K2581j0853k9157k6744K0110O804l754P064j4941l856J7907
16221c813j0480k392P960J3798j3867j2552J9289k4112j5112P967J1398P632J0469
16208c815k3398L653R730K881J7125O303l2261k7541J1311J4019q006M828J239
16195b3932j1813J5821Q143K2488l774m022m583k1732o600K0522j319K514P155
16182a132J6942j1227j3473p422k492p65O746l2631j5857J3753r49P16J0929n44
16168c7406j1239K1605J3588K382j7706K097N09m183L697j201q982l496K4083
16155a6252j843m088J3995J4815m348j0947o595j4106J2674R017q183o36k0159
16142c6656j1080l076J3282N544P482J40k9653l218L403K2791K6580o152K2980
$$ plain form
16129 12367 24322 -166 -31294 -49197 -44502 -36136 -29031 -31956 -23798 -32173 -10240 8287 -5029
16116 -5029 -29599 -52116 -47491 -43310 -16361 15102 22681 15014 16212 6045 5814 4874 7003 95
16102 95 5951 25483 8208 -18941 -26193 -21183 -21464 -20903 -17917 14703 -19323 -28213 -6914 -9334
16088 -9334 -7307 -2172 5993 2068 8568 -20931 -24338 6558 9629 18415 -4221 3582 5517 -7280
16074 -7280 1267 234 -5162 -23287 -8031 847 9950 21317 4187 -24699 -2045 -3561 4276
16061 4276 16986 9748 -14508 -24480 -16971 -11581 -26240 -30394 -21954 6334 18475 -5146 -6659
16048 -6659 9347 5661 -24483 -35666 -30786 -20158 -679 28821 24101 6394 20371 26535 2819
16035 2819 -5308 1537 335 4121 10922 17520 829 -6816 -8855 -19740 -47220 -36234 -35114 -23608
$$ packed form
16129A2367J1955k4488l1128j7903M695Q366P105k925Q158q375K1933J8527j3316
16116e029k4570k2517M625M181K6949L1463P579p667J198j0167k31r40K129o908
16102I5N856J9532j7275k7149p252N010k81N61K986L2620l4026q890K1299k420
16088i334K027N135Q165l925O500k9499l407L0896L071Q786k2636P803J935j2797
16074g280Q547j033n396j8125J5256Q878R103J1367j7130k8886K2654j516P837
16061D276J2710p238k4256r972P509N390j4659m154Q440K8288J2141k3621j513
16048f659J6006l686l0144j1183M880J0628J9479K9500m720j7707J3977O164k3716
16035B819q127O845j202L786O801O598j6691p645k039j0885k7480J0986J120J1506
$$ plain form
16021 -23608 -33304 -11911 -3483 -17269 -1483 -11005 -36155 -38495 -24939 1229 -11763 -42120
16009 -42120 -64957 -42611 10519 28115 22395 4676 -4009 -2913 11727 15044 14099 11806 34486
15996 34486 26099 16729 -3295 -18653 -33417 -17716 -3012 -36893 -58061 -72366 -54446 -31920
15984 -31920 -8545 -2354 -12206 6080 6447 -34577 -55635 -54681 -45996 -46645 -48197 -25163 -11843 -18427
15970 -18427 -4370 143 -5305 -5964 7052 8638 -8278 -16019 3136 7848 24633 24778 102
15957 102 8060 28865 6482 -13283 -11828 -21675 -31092 -39269 -53418 -54481 -61683 -75643 -99178
15944 -99178 -85063 -54520 -46369 -21323 -17103 -28871 -18130 -25416 -52257 -45409 -13604 -6466 -12029
15931 -12029 -17893 1418 1939 -4174 -4385 -8216 -35743 -42602 -39985 -40466 -37876 -16512 -3111 -6090
$$ packed form
16021b3608r696K1393Q428j3786J5786r522k5150k340J3556K6168j2992l0357
16009d2120k2837K2346N3130J7596n720j7719q685J096J4640L317r45k293K2680
15996C4486q387r370k0024j5358j4764J5701J4704l3881k1168j4305J7920K2526
15984c1920K3375O191r852J8286L67m1024k1058R54Q685o49j552K3034J3320o584
15970a8427J4057M513n448o59J3016J586j6916p741J9155M712J6785J45k4676
15957A02P958K0805k2383j9765J455r847r417q177j4149j063p202j3960k3535
15944i9178J4115L0543Q151K5046M220j1768J0741p286k6841O848L1805P138n563
15931a2029n864J9311N21o113k11l831k7527o859K617m81K590K1364J3401k979
$$ plain form
15917 -6090 -10017 10782 19870 28111 12804 -6824 1514 -716 5858 16095 -12978 -14066 -7106
15904 -7106 -16939 -21345 -11169 -5847 1761 -6682 -27685 -27054 -15834 6662 14280 2454 8539 20598
15890 20598 10639 -10894 -20657 -22170 -12329 -4248 -16204 -6099 -14971 -24589 -32029 -31950 -42177 -48055
15876 -48055 -51906 -64398 -44140 -3637 26272 11463 -17981 -26306 -36291 -31364 -24193 -16275 -20314
15863 -20314 -30632 -2761 -9039 -19223 -10111 28261 19670 10221 7035 15165 24081 22118 -3798
15850 -3798 -16410 -25456 -37179 -40246 -48662 -46956 -38559 -12034 -1345 -3060 -4796 -6148 -20028
15837 -20028 -22891 -218 -2247 -2664 -14780 11832 13569 11344 4728 -15652 -27174 -20400 -21336 -23444
15823 -23444 -6850 17717 28792 -3267 -31216 -18325 -14882 -39983 -22545 -28784 -18934 -26758
$$ packed form
15917f090l927K0799R088Q241j5307j9628Q338k230O574J0237k9073j088O960
15904g106r833m406J0176N322P608q443k1003O31J1220K2496P618j1826O085J2059
15890B0598r959k1533r763j513R841Q081j1956J0105q872r618p440P9j0227n878
15876d8055l851j2492K0258M0503K9909j4809k9444q325r985M927P171P918m039
15863b0314j0318K7871o278j0184R112L8372q591r449l186Q130Q916j963k5916
15850c798j2612r046j1723l067q416J706Q397K6525J0689j715j736j352j3880
15837b0028k863K2673k029m17j2116K6612J737k225o616k0380j1522O774r36k108
15823b3444J6594K4567J1075l2059k7949J2891L443k5101J7438o239R850p824
$$ plain form
15811 -26758 -14431 1659 -13274 -10745 -5423 -11248 -42343 -45934 -10334 -6907 -19125 -25882 -57347
15798 -57347 -62808 -71988 -72762 -54034 -32200 -25697 -20167 -6998 -21050 -34160 -39085 -28430 7561
15785 7561 24629 18424 3279 7609 -3533 -11043 -29923 -44726 -40430 -18106 204 -13485 -22614
15772 -22614 -24110 4567 27803 22140 236 3614 -2883 -20613 -15918 -14301 -31512 -34127 -14868
15759 -14868 19269 27594 20955 5292 3289 508 6141 31064 39425 40856 38101 30533 40893
15746 40893 22609 24280 27069 9270 -17042 -52238 -42153 -25753 -28757 -24105 -19475 -16804 14177
15733 14177 30410 26136 20871 12176 -102 10206 30825 26608 24666 37317 17559 -11370 -23796
15720 -23796 -12186 1111 3595 -6516 5713 32800 44073 26948 28104 16957 16826 31089
$$ packed form
15811b6758J2327J6090j4933K529N322n825l1095l591L5600L427j2218o757l1465
15798e7347n461r180p74J8728K1834O503N530J3169j4052j3110m925J0655L5991
15785G561J7068o205j5145M330j1142p510j8880j4803M296K2324J8310j3689r129
15772b2614j496K8677K3236n663k1904L378o497j7730M695J617j7211k615J9259
15759a4868L4137Q325o639j5663k003k781N633K4923Q361J431k755p568J0360
15746D0893j8284J671K789j7799k6312l5196J0085J6400l004M652M630K671L0981
15733A4177J6233m274n265q695j2278J0308K0619m217j942J2651j9758k8929j2426
15720b3796J1610J3297K484j0111J2229K7087J1273j7125J156j1147j31J4263
$$ plain form
15708 31089 43008 46494 37058 45462 53436 48876 52921 44533 11868 -16966 -16370 5954 -5878
15695 -5878 -25902 -10610 -6410 -9741 -3424 -5045 -15602 -29163 -36407 -23345 -28894 -45520 -37195
15682 -37195 -32910 -18988 -9894 2644 10154 -28293 -58272 -50895 -20290 -9860 -18244 -6992 -6844
15669 -6844 -27419 -30214 -30010 -39301 -56570 -33180 -42888 -54808 -44714 -45089 -46669 -50743 -39253 -37998
15655 -37998 -36376 -37146 -27754 -11880 -4658 6851 24557 27752 16313 1569 -16602 -30641 -22678
15642 -22678 -15835 -14496 -38616 -43443 -20866 -4017 -4430 -447 -2108 -14540 -22029 -45020 -48679
15629 -48679 -41296 -24419 -5299 -10395 -27913 -21362 -30618 -47200 -48136 -9697 5987 2807 -7361
15616 -7361 -22599 -20754 3419 3400 -3350 9914 22606 14924 10430 -4581 -27007 -47374 -27587
$$ packed form
15708C1089J1919L486r436Q404P974m560M045q388l2665k8834N96K2324j1832
15695e878k0024J5292M200l331O317j621j0557j3561p244J3062n549j6626Q325
15682c7195M285J3922R094J2538P510l8447k9979P377L0605J0430q384J1252J48
15669f844k0575k795K04r291j7269K3390r708j1920J0094l75j580m074J1490J255
15655c7998J622p70R392J5874P222J1509J7706L195j1439j4744j8171j4039P963
15642b2678O843J339k4120m827K2577J6849m13L983j661j2432p489k2991l659
15629d8679P383J6877J9120n096j7518O551r256j6582r36L8439J5684l180j0168
15616g361j5238J845K4173j9o750J3264J2692p682m494j5011k2426k0367J9787
$$ plain form
15603 -27587 4295 19517 8623 648 -10581 2720 20719 14826 -903 -13149 -13278 -40373
15591 -40373 -43710 -31314 -28474 -27460 -17022 2073 20983 22054 -15199 -30230 -38923 -8880 30987
15578 30987 30134 22345 -14986 -36630 -19410 2459 -803 -18809 -24294 -32141 -25638 1642 8390
15565 8390 -5391 -6227 2594 9947 2422 10081 -9112 -36388 -36564 -34889 -49423 -38951 -12304 20150
15551 20150 14296 -18988 -16556 -21068 -16912 -19921 -22995 -10193 -14587 -18925 -18980 -10430 15706 27209
15537 27209 10529 -6732 -14499 7808 9208 -55 -11526 -32181 -39419 -33097 -23343 -13989 -23601
15524 -23601 -12787 -28 10124 19448 15935 337 6385 -11672 -25390 -39534 -36512 -23150
15512 -23150 -23455 -46451 -52297 -26628 -14546 -27671 -31901 -27408 -37130 -10356 461 -552 10257
$$ packed form
15603b7587L1882J5222j0894p975j1229J3301J7999n893j5729j2246j29k7095
15591d0373l337J2396K840J014J0438J9095J8910J071l7253j5031q693L0043L9867
15578C0987q53p789l7331k1644J7220K1869l262j8006n485p847O503K7280O748
15565H390j3781q36Q821P353p525P659j9193k7276j76J675j4534J0472K6647L2454
15551B0150n854l3284K432m512M156l009l074J2802m394m338n5Q550K6136J1503
15537B7209j6680j7261p767K2307J400r263j1471k0655p238O322R754R354r612
15524b3601J0814J2759J0152R324l513j5598O048j8057j3718j4144L022J3362
15512b3150l05k2996n846K5669J2082j3125m230M493r722K6774J0817j013J0809
$$ plain form
15499 10257 39605 33858 9930 530 -3428 -14012 -40308 -27459 -20785 -33436 -31653 -6561 14477
15486 14477 2913 -1344 -21960 -35543 -17975 -7813 -1715 1763 3672 5048 17858 2044 -263
15473 -263 -5539 -18549 -11326 -23342 10412 2047 -5236 4092 1797 -23146 -19848 -14184 -16186 -23059
15459 -23059 -35388 -10673 4480 16866 16722 8167 7875 8694 -16694 -17715 2610 3049 -10407 2860
15445 2860 9699 10837 12914 8394 11410 8308 -21357 -36737 -23585 -31380 -37486 -3638 9642
15432 9642 16640 -2229 -11868 -11542 -4082 4201 10668 37289 41950 56292 16440 -7710 18230
15419 18230 37233 23788 -4991 -3765 -3723 -1676 -11364 -25722 -34450 -20800 -19971 -35154 -23930
15406 -23930 5397 25596 29708 11610 18796 4616 -1839 -2072 -18316 -21829 -10087 -1292 14019
$$ packed form
15499A0257K9348n747k3928r400l958j0584k6296J2849O674j2651J783K5092K1038
15486A4477j1564m257k0616j3583J7568J0162O098L478J909J376J2810j5814k307
15473b63n276j3010P223j2016L3754q365p283R328k295k4943L298N664k002o873
15459b3059j2329K4715J5153J2386j44q555k92Q19k5388j021K0325M39j3456J3267
15445B860O839J138K077m520L016l102k9665j5380J3152p795o106L3848J3280
15432I642O998j8869r639L26P460Q283O467K6621M661J4342l9852k4150K5940
15419A8230J9003j3445k8779J226M2K047r688j4358q728J3650Q29j5183J1224
15406b3930K9327K0199M112j8098P186j4180o455k33j6244l513J1742Q795J5311
$$ plain form
15393 14019 -2031 -5527 -6120 -29767 -7109 -3840 -4507 -5629 -7832 -955 26693 18904 -6067 -27310
15379 -27310 -9387 -1826 -7615 -155 10539 1244 -1147 -27959 -31569 -31509 -32581 -32572 -25471 -37101 -26944
15364 -26944 -20113 -6551 -2114 3431 5300 -6806 -25293 -29431 -44607 -6868 16154 16703 -6175
15351 -6175 -22341 -18353 -12135 9253 -2540 -15048 -29546 -45645 -24209 -35870 -48226 -48477 -28291
15338 -28291 -12009 -23665 -43610 -49465 -49786 -21555 -1360 -1672 -14302 -20340 -45331 -63250 -38067
15325 -38067 2819 -3051 3830 20522 31520 7957 -23947 -36931 -24373 -38521 -20907 -18890
15313 -18890 -15298 -18691 -36578 -40567 -41987 -24976 -28027 -18082 10441 16851 15428 28406 48474
15300 48474 43928 28259 10644 -7501 -12756 -26047 -39396 -35975 -8748 2908 11852 12184 -5011
$$ packed form
15393A4019j6050l496n93k3647K2658L269o67j122k203O877K7648p789k4971k1243
15379b7310J7923P561n789P460J0694r295k391k6812l610O0j072RP101j1630J0157
15364b6944O831J3562M437N545J869j2106j8487m138j5176L7739K3022N49k2878
15351f175j6166L988O218K1388j1793j2508j4498j6099K1436j1661j2356k51K0186
15338b8291J6282j1656j9945n855l21K8231K0195l12j2630o038k4991j7919K5183
15325c8067M0886n870O881J6692J0998k3563l1904j2984J2558j4148J7614K017
15313a8890L592l393j7887l989j420J7011l051R945K8523O410j423J2978K0068
15300D8474m546j5669j7615j8145n255j3291j3349L421K7227J1656Q944L32j7195
$$ plain form
15287 -5011 -16770 1321 -3575 -18520 -38447 -27912 -21105 -25033 168 -4555 -41205 -55776 -42382
15274 -42382 -42028 -17756 -13454 -35885 -36151 -23057 -13925 -25533 -37824 -43279 -11941 27153 38652
15261 38652 16651 -21011 -24867 -12056 -21487 -23619 -22903 -29180 -32084 -22217 -11424 -8638 -36978
15248 -36978 -19494 -22618 -30888 -10753 17356 -2447 1118 8797 18453 30675 1314 -24963 -5744
15235 -5744 15278 242 -24304 -19924 -15978 -2738 490 -15974 -9636 -21890 -20541 6004 19087
15222 19087 23792 54393 59674 44657 32133 8353 -24183 -24923 -21657 -17263 -11937 6397 616
15209 616 24925 49177 41427 2015 -18875 -15175 -26181 -23162 -32403 -43363 -35663 -19924 -15243
15196 -15243 -3411 -21037 -43656 -60165 -52336 -23498 -6854 28562 16595 -11329 -3664 5314
$$ packed form
15287e011j1759J8091m896j4945j9927J0535O807l928K5201m723l6650j4571J3394
15274d2382L54K4272M302k2431k66J3094R132j1608j2291n455L1338L9094J1499
15261C8652k2001l7662l856J2811r431k132P16o277k904R867J0793K786k8340
15248c6978J7484l124q270K0135K8109j9803L565P679R656J2222k9361k6277J9219
15235e744K1022j5036k4546M380L946J3240L228j6464O338j2254J349K6545J3083
15222A9087M705L0601N281j5017j2524k3780l2536p40L266M394N326J8334n781
15209F16K4309K4252p750l9412k0890L700j1006L019r241j0960P700J5739M681
15196a5243J1832j7626k2619j6509P829K8838J6644L5416j1967k7924P665Q978
$$ plain form
15184 5314 19213 3000 -19034 -26119 -30151 -33993 -34604 -4171 3983 -4263 -5416 -18589 -23703 -17060
15170 -17060 -8977 -6352 -6693 -26358 -31957 -29188 -4647 -1681 8921 11764 1787 -5848 -4117 13151
15156 13151 28673 17221 22994 26101 4502 -14018 -34442 -36540 -43180 -34794 -11880 -18835 -25732
15143 -25732 -37944 -34500 -43221 -29716 -12356 8635 -10310 -10613 -19481 -24961 -25270 -41755 -41617 -17910
15129 -17910 -21902 -4066 10992 13232 9493 1187 18371 19156 -198 -19286 -24649 -33172 -40645
15116 -40645 -14158 7421 -2003 -25519 -54416 -66002 -49405 2541 23773 14300 -1840 -1126
15104 -1126 -106 -11534 -10613 8990 20457 20859 24369 18745 20284 18907 19162 1259 -14575 -36090
15090 -36090 -19071 -16911 -23930 -21835 -11733 -3779 7146 16784 12508 14071 17775 8104 -11299
$$ packed form
15184E314J3899j6213k2034p085m032l842o11L0433Q154q246j153j3173n114O643
15170a7060Q083K625l41j9665n599K769K4541K966J0602K843r977p635J731J7268
15156A3151J5522j1452N773L107k1599j8520k0424k098o640Q386K2914o955o897
15143b5732j2212L444q721J3505J7360K0991j8945l03q868n480l09j6485J38K3707
15129a7910l992J7836J5058K240l739q306J7184P85j9354j9088n363q523p473
15116d0645K6487K1579r424k3516k8897j1586J6597N1946K1232r473j6140P14
15104a126J020j1428R21J9603J1467M02L510n624J539j377K55j7903j5834k1515
15090c6090J7019K160p019K095J0102P954J0925R638m276J563L704r671j9403
$$ plain form
15077 -11299 -20925 -38250 -37709 -24424 -16149 -19306 -13281 -37447 -48513 -27306 -674 1183 1616
15064 1616 3463 -13068 -19479 -5922 6845 12754 8435 7746 -13499 -36860 -57319 -42292 -36852
15051 -36852 -17628 -15407 -32504 -6246 19162 23232 10438 -6256 10622 15579 -16548 -29892
15039 -29892 -29169 -39970 -43059 -33301 -36038 -35744 -12713 -9793 -12966 -6731 -2759 -1638 -4668 7527
15025 7527 13638 -6907 -1027 17930 2063 -5408 3523 2154 4070 -12201 -34615 -31930 -16280
15012 -16280 220 1815 15850 5893 -13116 -14985 -2818 21763 33770 20650 -1451 -28435
15000 -28435 -30832 -34896 -26725 -36656 -26838 -34755 -24923 -223 7118 7977 -578 -26287 -23050 2792
14986 2792 6423 8817 25672 22295 12775 -3390 17457 14723 15687 33483 27443 11694 -2370
$$ packed form
15077a1299r626j7325N41J3285Q275l157O025k4166j1066K1207K6632J857M33
15064A616J847j6531o411J3557J2767N909m319o89k1245k3361k0459J5027N440
15051c6852J9224K221j7097K6258K5408M070j2794j6694J6878M957l2127j3344
15039b9892P23j0801l089R758k737K94K3031K920l173O235L972J121l030J2195
15025G527O111k0545N880J8957j5867p471Q931j369J916j6271k2414K685J5650
15012a6280J6500J595J4035r957j9009j869J2167K4581J2007j3120k2101k6984
15000b8435k397m064Q171r931R818p917R832K4700P341Q59q555k5709L237K5842
14986B792L631K394J6855l377r520j6165K0847k734R64J7796o040j5749j4064
$$ plain form
14973 -2370 -4854 11855 33975 27850 12903 10688 11066 868 -10837 -9456 -12744 -49833 -31467
14960 -31467 -3472 3996 21200 20891 28252 19561 -19776 -36219 -33734 -36062 -18390 -15042 -28516
14947 -28516 -26729 -13722 -16414 -27237 -53462 -42998 -18315 -23005 -16316 -4319 -6562 4483 -11705
14934 -11705 -11765 4965 9956 10364 18304 10776 5333 -13585 -19242 -24605 -13218 -228 -23451 -18164
14920 -18164 -3987 -22047 -40320 -75168 -88776 -72432 -61735 -54673 -70480 -83268 -77916 -61090
14908 -61090 -40442 -22367 24729 17262 -11301 -25412 -19392 -21941 -34183 -26003 -23737 3110 20489
14895 20489 -12780 -27501 -23559 1998 9802 -652 -10317 22398 40890 48574 33258 22122
14883 22122 10445 10819 -6363 960 11480 14194 4931 -531 6728 25847 20110 5723 1854
$$ packed form
14973b370k484J6709K2120o125j4947k215L78j0198j1705J381l288l7089J8366
14960c1467K7995P468J7204l09P361q691l9337j6443K485k328J7672L348j3474
14947b8516J787J3007k692j0823k6225J0464K4683m690O689J1997k243J1045j6188
14934a1705o0J6730M991M08P940p528n443j8918n657n363J1387J2990k3223N287
14920a8164J4177j8060j8273l4848j3608J6344J0697P062j5807j2788N352J6826
14908f1090K0648J8075M7096p467k8563j4111O020k549j2242Q180K266K6847J7379
14895B0489l3269j4721L942K5557P804j0454r665L2715J8492P684j5316j1136
14883B2122j1677L74j7182P323J0520K714r263n462P259J9119n737j4387l869
$$ plain form
14870 1854 12033 11405 1473 -7956 -34097 -20711 -5929 -19275 -19456 -31777 -39607 -24307 -38213
14857 -38213 -32074 -2199 -15721 -13976 614 14408 33108 30798 25756 19348 17206 33879 23345
14844 23345 4284 12006 11607 -12434 -28754 -9011 4227 -32018 -55071 -12499 6615 -7121
14832 -7121 -19356 -38235 -12146 14199 9268 -11013 -16823 -16152 -13767 6825 18682 -6948 -14381
14819 -14381 -3106 -8894 -25676 -34090 -31746 -23108 26946 38101 34126 -5674 -32517 -22964 -7045
14806 -7045 -9784 -1228 -3867 -6305 -5024 -12645 -1589 14997 7939 -2493 9853 25556 20308
14793 20308 -7902 -13643 -6702 5157 3231 -10896 -4374 11725 13346 29123 34547 12892 -2405
14780 -2405 -34254 -65402 -51265 -32926 -17074 2340 8573 13168 -8790 -4317 -2512 -34466 -53882
$$ packed form
14870A854J0179o28r932r429k6141J3386J4782j3346j81j2321p830J5300j3906
14857c8213O139K9875j3522J745J4590J3794J8700k310n042o408k142J6673j0534
14844B3345j9061P722l99k4041j6320J9743J3238l6245k3053M2572J9114j3736
14832g121j2235j8879K6089K6345m931k0281n810O71K385K0592J1857k5630p433
14819a4381J1275n788j6782q414K344Q638N0054J1155l975l9800k6843R553J5919
14806g045k739Q556k639k438J281p621J1056J6586p058j0432J2346J5703n248
14793B0308k8210n741O941J1859j926j4127O522J6099J621J5777N424k1655j5297
14780b405l1849l1148J4137J8339J5852J9414O233M595k1958M473J805l1954j9416
$$ plain form
14767 -53882 -35762 -17736 12846 -4569 -15152 -22951 -36522 -32599 -26158 -47735 -54371 -58899 -44683
14754 -44683 -24312 -21696 -9040 1623 6266 27537 29018 17398 15814 17193 19430 8798 -5783
14741 -5783 -13130 4492 -8199 -18255 -28045 -48806 -34753 -24832 -31285 -16069 -13787 -5778 16345
14728 16345 15710 13410 25942 29150 754 10636 -7177 -13885 7987 43659 37552 -12681 -27987
14715 -27987 -16556 -30087 -42691 -31651 -17178 5922 11189 5895 28509 35168 12819 -22745
14703 -22745 -54722 -57349 -24829 -6953 2402 -1158 -6066 2490 7595 20379 12000 14532 7562
14690 7562 -8379 -32393 -25447 -5863 12868 26650 17550 5138 16542 5632 -2319 6589 10910
14677 10910 8287 6702 15546 29204 20779 15946 -2672 2758 2774 -8281 -17068 -29517 -21918 -3140
$$ packed form
14767e3882J8120J8026L0582j7415j0583p799j3571L923O441k1577o636m528J4216
14754d4683K0371K616J2656J0663M643K1271J481j1620j584J379K237j0632j4581
14741e783p347J7622j2691j0056r790k0761J4053R921o453J5216K282Q009K2123
14728A6345o35k300J2532L208k8396R882j7813o708K1872L5672o107n0233j5306
14715b7987J1431j3531j2604J1040J4473K3100N267n294K2614O659k2349l5564
14703b2745l1977k627L2520J7876R355l560m908Q556N105J2784q379K532o970
14690G562j5941k4014O946J9584J8731J3782r100j2412J1404j0910p951Q908M321
14677A0910k623j585Q844J3658q425m833j8618N430J6j1055q787j2449P599J8778
$$ plain form
14663 -3140 -16857 -16768 4916 19484 31051 35075 27513 19526 11853 -1157 -23715 -1627 8012
14650 8012 -1843 5309 -7815 -3575 175 -6403 -25809 -36819 -22749 2454 26127 25727 -241
14637 -241 -23544 1636 17245 1008 -4238 -3506 -17292 -24208 1965 17640 24125 -2035 -26514
14624 -26514 -35465 -2902 -8457 -24885 -31672 -32644 -30190 13308 30126 50517 17849 -2432 -3128
14611 -3128 -4359 -16097 -16232 -25321 -19147 17316 38431 24463 3245 -14288 -28805 -19659 19131
14598 19131 47538 33644 28192 27822 21943 25589 9520 5644 14912 -7247 -31626 -12575 -3220
14585 -3220 -19669 -5084 7858 -23793 -37309 -13693 -9911 -4428 -5339 -3618 -5127 3248 -10668
14572 -10668 -19437 4728 -18069 -33341 6804 14653 17299 -20441 -26283 -42447 -54417 -55076 -43455
$$ packed form
14663c140j3717Q9K1684J4568J1567M024p562p987p673j3010k2558K2088R639
14650H012r855P152j3124M240L750o578j9406j1010J4070K5203K3673m00k5968
14637b41k3303K5180J5609j6237n246P32j3786o916K6173J5675O485k6160k4479
14624b6514q951L2563n555j6428o787r72K454M3498J6818K0391l2668k0281o96
14611c128j231j1738j35r089O174L6463K1115j3968k1218j7533j4517R146L8790
14598A9131K8407j3894n452l70n879L646j6069l876R268k2159k4379J9051R355
14585c220j6449J4585J2942l1651j3516K3616L782N483r11J721j509Q375j3916
14572a0668q769K4165k2797j5272M0145P849K646l7740n842j6164j1970o59J1621
$$ plain form
14559 -43455 -39329 -11909 -9158 -41925 -30622 -14128 -10964 -23276 -3625 4032 -6887 -9943 -5314
14546 -5314 -21074 -47666 -37963 -13232 -222 11254 41580 30570 45023 46565 34343 36523
14534 36523 23643 3085 27851 46351 50402 20788 19292 11144 8509 -6165 -24075 -26658 -32583
14521 -32583 -31092 -55273 -25780 -2739 -2375 -33017 -32817 -21197 -8404 -13865 -1781 -636 -493
14508 -493 30967 41588 43446 35196 34228 13525 2695 -7582 -52182 -66973 -61574 -41094 -33967
14495 -33967 -14364 -7972 -3178 1036 20402 14011 -4306 -29054 -38212 -34851 -3966 7004 21564
14482 21564 29517 2243 3555 -3244 -29001 -52096 -42404 -47727 -57382 -48614 -35820 -37882 -32285
14469 -32285 -13216 -4733 -16106 -10973 -21831 -39242 -39603 -33996 -20529 -13979 -13236 4215 -10401
$$ packed form
14559d3455M126K7420K751l2767J1303J6494L164j2312J9651P657j0919l056M629
14546e314j5760k6592R703K4731J3010J1476L0326j1010J4453J542j2222K180
14534C6523j2880k0558K4766J8500M051k9614j496q148k635j4674j7910k583n925
14521c2583J491k4181K9493K3041L64l0642K00J1620J2793n461J2084J145J43
14508d93L1460J0621J858q250r68k0703j0830j0277m4600j4791N399K0480P127
14495c3967J9603O392M794M214J9366o391j8317k4748r158L361L0885J0970J4560
14482B1564P953k7274J312o799k5757k3095R692n323r655Q768J2794k062N597
14469c2285J9069Q483j1373N133j0858j7411l61N607J3467O550P43J7451j4616
$$ plain form
14456 -10401 -9146 2050 -8009 -18425 -766 25720 57630 57684 44545 44103 21468 4567 -8228
14443 -8228 -15612 -17189 -1552 12114 2744 21204 35874 35497 17118 9577 2373 -13475 -5667
14430 -5667 -1494 -8473 -438 -13473 -16778 -34722 -44723 -14788 -3883 1975 6789 -2218 2650
14417 2650 4442 6315 10173 4999 -2677 7271 18776 37652 25942 22418 26185 17532 18055 29672
14403 29672 10056 -10429 -26935 -996 -10465 -34448 -16661 15886 16090 48421 41088 15046
14391 15046 -4263 -5941 -38 7266 -24385 -34968 -22799 -4349 8899 9486 6681 3145 4662
14378 4662 -11632 -12145 -45596 -45031 -32243 -35756 -3032 21087 37128 40209 26673 8210 -13172
14365 -13172 -23372 -15156 -23156 -51916 -64508 -22599 23170 35012 18205 11469 1408 -24005
$$ packed form
14456a0401J255J1196j0059j0416J7659K6486L1910N4j3139m42k2635j6901j2795
14443h228p384j577J5637J3666r370J8460J4670l77j8379p541p204j5848P808
14430e667M173o979Q035j3035l305j7944j0001K9935J0905N858M814r007M868
14417B650J792J873L858n174p676R948J1505J8876j1710l524L767q653N23J1617
14403B9672j9616k0485j6506K5939r469k3983J7787L2547K04L2331p333k6042
14391A5046j9309j678N903P304l1651j0583J2169J8450J3248N87k805l536J517
14378D662j6294n13l3451N65J2788l513L2724K4119J6041L081j3536j8463k1382
14365a3172j0200Q216q000k8760j2592M1909M5769J1842j6807o736j0061k5413
$$ plain form
14353 -24005 -19385 9721 -5992 -20310 -24884 2972 39179 28903 21304 13957 -13778 -22014 -22773
14340 -22773 -37064 -27031 -23111 -27096 -35573 -33094 -8466 3343 -9067 -15063 -4385 -17006 -2677
14327 -2677 -15016 -19934 -10772 -3894 -1666 21192 31348 30514 12070 13207 18795 14078 16661 14226
14313 14226 16611 20482 29336 25622 -80 -11332 -20602 -24646 -20916 -12500 19181 38202 33010
14300 33010 48470 33878 11444 1632 3560 17379 21471 -2904 -2013 -17058 -36429 -41175 -6927
14287 -6927 47679 38718 15605 15331 11608 8115 -7453 -12076 -19214 -16355 -24100 -28995 -21436 -17023
14273 -17023 12264 20571 39670 28859 19302 14812 24463 18324 -1270 15480 1763 -1100 19586
14260 19586 33749 40655 38439 39931 41430 25525 15137 -7536 -17904 10882 8951 -5132 -5850
$$ packed form
14353b4005M620K9106j5713j4318m574K7856L6207j0276p599p347k7735q236p59
14340b2773j4291J0033L920l985q477K479K4628J1809j2410n996J0678j2621J4329
14327b677j2339m918R162O878K228K2858J0156q34j8444J137N588m717K583k435
14313A4226K385L871Q854l714k5702j1252r270m044L730Q416L1681J9021n192
14300C3010J5460j4592k2434r812J928J3819M092k4375Q91j5045j9371m746L4248
14287f927N4606q961k3113k74l723l493j5568m623p138K859p745m895P559M413
14273a7023K9287Q307J9099j0811r557m490R651o139j9594J6750j3717k863K0686
14260A9586J4163O906k216J492J499j5905j0388k2673j0368K8786j931j4083p18
$$ plain form
14247 -5850 16062 11717 31998 35620 30430 30097 -16697 -50787 -51769 -53558 -38469 -51275 -43340 -10394
14233 -10394 -6122 4048 3428 2770 9320 17441 -5610 -15139 -29775 -23245 -27948 -26499 -33938 -13352
14219 -13352 -15888 -19124 -39583 -25937 -21977 -20813 -571 -11714 -24496 -7941 -13872 -263 16139
14206 16139 -6440 -20672 -14375 6651 8404 19319 28692 38837 30085 22299 22930 18402 4136
14193 4136 -10228 -11116 -21670 -43447 -49631 -16293 -5653 -13252 -4867 9667 8834 -1954 -14012
14180 -14012 -9123 -6835 -15316 -29934 -4464 -6119 -6259 21524 17519 2152 -8619 -20323 -20850
14167 -20850 -9336 -1530 23638 37465 39818 30618 21422 8299 -5731 -13881 -11824 -5564 12747
14154 12747 4445 -7303 -9223 -16945 -52838 -45423 -28088 3238 27390 12835 2592 -11708
$$ packed form
14247e850K1912m345K0281L622n190l33m6794l4090r82j789J5089j2806P935L2946
14233a0394M272J0170o20o58O550Q121k3051r529j4636O530m703J449p439K0586
14219a3352k536l236k0459J3646L960J164K0242j1143j2782J6555n931J3609J6402
14206A6139k2579j4232O297K1026J753J0915R373J0145q752p786O31m528j4266
14193D136j4364q88j0554k1777o184L3338J0640p599Q385J4534q33j0788j2058
14180a4012M889K288q481j4618K5470j655j40K7783m005j5367j0771j1704n27
14167b0850J1514P806K5168J3827K353r200r196j3123j4030q150K057O260J8311
14154A2747q302j1748j920p722l5893P415J7335L1326K4152j4555j0243j4300
$$ plain form
14142 -11708 -22838 -40614 -43948 -25385 -32334 -49277 -41316 -12824 -32881 -48349 -23033 9454
14130 9454 11604 25666 42503 9607 -16199 -25728 -40757 -20291 -20248 -25466 -7291 3043 -459
14117 -459 6462 4371 13496 18259 2289 2963 11142 15371 5552 -6954 1001 33026 21840 10694
14103 10694 5033 21083 29750 11787 29593 38216 30326 22592 4150 -19364 -23025 -7153 12226
14090 12226 21220 7488 -6258 -3027 11392 22133 18683 3014 -6811 -8698 -6537 -3549 5858
14077 5858 11260 39636 49321 39403 32433 3979 -3341 18689 23355 15710 22360 21312 26505 25080
14063 25080 22330 15828 -10549 -18436 -14768 -17180 -40489 -25944 -27462 -21359 -17019 -18862 -24096 -33951
14049 -33951 -32564 -12561 9967 28749 34167 18554 -5722 -27016 -40685 -53842 -52662 -51605
$$ packed form
14142a1708j1130j7776l334J8563o949j6943P961K8492k0057j5468K5316L2487
14130I454K150J4062J6837l2896k5806r529j5029K0466M3n218J8175J0334l502
14117d59O921k091R125M763j5970O74Q179M229r819j2506P955L2025j1186j1146
14103A0694n661J6050Q667j7963J7806Q623p890p734j8442k3514l661J5872J9379
14090A2226Q994j3732j3746L231J4419J0741l450j5669r825j887K161K988R407
14077E858N402K8376R685r918o970k8454p320K2030M666p645O650j048N193j425
14063B5080k750o502k6377p887L668k412k3309J4545j518O103M340j843n234r855
14049c3951J387K0003K2528J8782N418j5613k4276k1294j3669j3157J180J057
$$ plain form
14037 -51605 -44745 -43457 -21121 -30838 -6311 12436 929 2864 21275 34978 50141 40610 36330
14024 36330 29905 45077 55291 47561 38597 32643 31440 23924 14152 -1543 15796 16877 13719
14011 13719 18415 -11299 -13286 -2933 -18748 -47334 -50327 -38769 -27358 -32562 -4843 40678
13999 40678 45035 58061 43456 21067 13061 8809 1855 13968 22222 24898 46320 36547 27114
13986 27114 21342 25422 128 2443 28932 27299 2632 -8209 9384 4354 -16352 -9715 -13908
13973 -13908 -18294 -20578 -9427 -6687 17845 24413 21206 18137 2471 2178 2268 7903 43116 64643
13959 64643 56384 43482 40823 49958 36706 3479 -17004 -14327 -27708 -26837 -3246 -29847 -22357
13946 -22357 -4777 17822 -573 -15912 -13352 -15213 -571 2279 7646 21023 17578 -2192 -4158
$$ packed form
14037e1605O860J288K2336r717K4527J8747j1507J935J8411J3703J5163r531m280
14024C6330o425J5172J0214p730q964n954j203p516r772j5695J7339J081l158
14011A3719M696k9714j987J0353j5815k8586k993J1558J1411n204K7719M5521
13999D0678M357J3026j4605k2389q006m252o954J2113Q254K676K1422r773r433
13986B7114n772M080k5294K315K6489j633k4667j0841J7593n030k0706O637m193
13973a3908m386k284J1151K740K4532O568l207l069j5666k93R0N635L5213K1527
13959F4643q259j2902k659R135j3252l3227k0483K677j3381Q71K3591k6601P490
13946b2357J7580K2599j8395j5339K560j861J4642K850N367J3377l445j9770j966
$$ plain form
13933 -4158 -687 9106 19948 7568 16202 -127 8929 7114 6486 10087 12297 11487 19229 31600
13919 31600 33226 47291 53957 47549 31151 25009 14744 39010 36139 20029 7568 12232 29097
13906 29097 45588 32986 26681 17623 7621 31667 32399 26533 33257 26679 -8789 -13608 -7254
13893 -7254 -5408 -9300 -21528 -17273 -11755 5377 -737 11047 21061 39127 24937 29410 10677
13880 10677 -5641 -10556 -8681 14920 150 -20933 -31319 -25722 -32317 -23847 -31738 -40535 -24909
13867 -24909 -45816 -35657 1375 -10192 -9694 -9844 5327 28016 34117 10184 -18616 -17354 -13291
13854 -13291 5386 46498 42509 23428 11996 -9351 -7425 -10890 12570 10085 1192 -14834 -12039
13841 -12039 -12921 -8850 26680 34414 33606 19286 -2005 -14396 -13914 7414 20985 19537 -1117
$$ packed form
13933d158L471R793J0842j2380Q634j6329R056j815o28L601K210q10P742J2371
13919C1600J626J4065O666o408j6398o142j0265K4266k871j6110j2461M664J6865
13906B9097J6491j2602o305r058j0002K4046P32n866O724o578l5468m819O354
13893g254J846l892j2228M255N518J7132o114J1784J0014J8066j4190M473j8733
13880A0677j6318m915J875K3601j4770k1083j0386N597o595Q470p891q797J5626
13867b4909k0907J0159L7032j1567M98j50J5171K2689O101k3933k8800J262M063
13854a3291J8677M1112l989j9081j1432k1347J926l465K3460k485q893j6026K795
13841a2039q82M071L5530P734q08j4320k1291j2391M82K1328J3571j448k0654
$$ plain form
13828 -1117 -14344 -11967 -8726 27212 38580 39737 25230 20969 22067 28171 43318 48584 48253 41400
13814 41400 30533 14258 10816 4274 577 -3338 1086 -11687 -33838 -26417 -8571 3957 8273
13801 8273 12497 8036 -2382 -9546 -8402 -12391 -12427 -18457 -33505 -28688 -16884 19877 28999 -4119
13787 -4119 -17898 -54436 -62487 -42126 -6969 6687 10313 6855 -4716 448 6338 4333 -21684
13774 -21684 -22513 -7638 -11745 -14236 -7433 4660 -9647 -6554 -471 5228 5545 3544 9608 27151
13760 27151 13256 4852 -2162 11781 23112 27670 26749 14458 10282 21169 7664 -1074 5126
13747 5126 14434 18161 10928 20009 13896 8245 17354 11298 -9553 -6484 15479 21886 30890 9086
13733 9086 17317 15210 -12907 -9625 2252 8648 7942 -2024 -1862 4879 9266 -2865 -1637 -10893
$$ packed form
13828a117j3227K377L241L5938J1368J157j4507m261J098O104J5147N266l31o853
13814D1400j0867j6275l442o542l697l915M424j2773k2151P421J7846J2528M316
13801H273M224m461j0418p164J144l989l6o030j5048M817J1804L6761R122l3118
13787d119j3779l6538q051K0361L5157J3656L626l458j1571N164N890k005k6017
13774b1684q29J4875m107k491O803J2093j4307L093O083N699L17k001O064J7543
13760B7151j3895q404p014J3943J1331M558r21j2291m176J0887j3505q738O200
13747E126R308L727p233R081o113n651R109o056k0851L069K1963O407R004k1804
13733I086Q231k107k8117L282J1877O396p06r966J62O741M387j2131J228r256
$$ plain form
13719 -10893 -18093 -13183 3724 -4001 -12115 -1461 15619 4330 -24504 -12149 3339 12775 -3707
13706 -3707 -8834 7609 14173 10055 -8084 12368 32621 55511 67801 56329 35284 722
13694 722 8474 21956 22692 32361 26696 31038 7841 8997 21755 19026 29710 14398 24255 21596
13680 21596 11582 -7729 -25330 -7887 -5323 16336 15476 -604 677 23453 8880 -20455
13668 -20455 -25366 -5358 20458 6226 -1243 -16508 -28761 -14826 3978 17479 18572 37200
13656 37200 47630 33176 34537 45879 47326 42713 28011 33343 42635 35181 40750 54859 49963
13643 49963 27828 38468 41157 5416 -11526 -18763 -10327 7159 -25800 -23575 -1020 19908
13631 19908 31258 27214 15009 11780 35908 30298 26162 16793 5579 4176 -14031 -1202 14475
$$ packed form
13719a0893p200M910J6907p725q114J0654J7080j1289k8834J2355J5488R436j6482
13706c707n127J6443O564m118j8139K0452K0253K2890J2290j1472k1045l4562
13694G22P752J3482P36R669n665M342k3197J156J2758k729J0684j5312R857k659
13680B1596j0014j9311j7601J7443K564K1659q60j6080J281K2776j4573k9335
13668b0455m911K0008K5816j4232p469j5265j2253J3935J8804J3501J093J8628
13656C7200J0430j4454J361J1342J447m613j4702N332R292p454N569J4109m896
13643D9963k2135J0640K689l5741j6942p237Q436J7486l2959K225K2555K0928
13631A9908J1350m044j2205l229K4128n610m136r369j1214j403j8207J2829J5677
$$ plain form
13618 14475 4374 23640 51434 44115 17788 -3155 -4265 24732 49933 66891 79760 80429
13606 80429 73373 55154 43210 59743 47953 42319 47983 50656 29989 2025 -4882 19336 10673
13593 10673 -12227 -19839 -5125 -4582 6494 43883 57722 58058 52501 73235 75325 67345 51985
13580 51985 19691 17775 19811 14858 9197 144 20101 39628 45720 20539 2637 -42 3564
13567 3564 1646 5516 13952 19224 12311 25779 40904 19600 7780 24244 24477 1799 -7856
13554 -7856 -16397 -22353 -14084 14976 20690 33716 44137 14435 -2605 -11821 -2733 7612 -3967
13541 -3967 217 36024 50625 48417 55401 27660 13121 17659 38262 32297 29384 33486 20452
13528 20452 19549 30591 56954 72081 63361 59268 48146 34446 27389 41274 54263 38057 20637
$$ packed form
13618A4475j0101J9266K7794p319k6327k0943j110K8997K5201J6958J2869O69
13606H0429p056j8219j1944J6533j1790n634N664K673k0667k7964o907K4218q663
13593A0673k2900p612J4714N43J1076L7389J3839L36n557K0734K090p980j5360
13580E1985l2294j916K036m953n661r053J9957J9527O092k5181j7902k679L606
13567C564j918L870Q436N272o913J3468J5125k1304j1820J6464K33k2678r655
13554g856q541n956Q269K9060N714J3026J0421k9702j7040r216R088J0345j1579
13541c967M184L5807J4601k208O984k7741j4539M538K0603n965k913M102j3034
13528B0452r03J1042K6363J5127q720m093j1122j3700p057J3885J2989j6206j7420
$$ plain form
13515 20637 30191 39752 49005 66193 65562 41101 58205 52508 25590 -174 4931 1693 -21730
13502 -21730 -44964 -26541 -14426 -13521 4832 15505 14175 6896 -8596 -658 169 13546 25259
13489 25259 26760 9469 736 26658 32607 20266 20434 32485 35397 15349 46806 49688 33935
13476 33935 13639 11758 30053 23362 17287 10251 760 -3395 -3613 30207 50930 52273 38542
13463 38542 49883 59821 40753 32785 35835 28228 11876 -5666 5666 28204 25247 2602 9887
13450 9887 21013 48668 43926 28899 27557 31651 27091 13022 15863 4088 -17233 -9466 4121
13437 4121 39610 51231 33563 16596 14035 5732 -181 4476 31104 30461 37023 34428 22973
13424 22973 31000 38254 41007 39384 371 -7370 2383 13903 33480 55634 40674 14441 25244
$$ packed form
13515B0637R554R561R253J7188o31k4461J7104n697k6918k5764N105l238k3423
13502b1730k3234J8423J2115R05J8353J0673j330p279j5492P938Q27J3377J1713
13489B5259J501j7291q733K5922N949j2341J68J2051K912k0048L1457K882j5753
13476C3935k0296j881J8295o691o075p036r491m155k18L3820K0723J343j3731
13463C8542J1341R938j9068p968L050p607j6352j7542J1332K2538k957k2645P285
13450I887J1126K7655m742j5027j342M094m560j4069K841j1775k1321P767J3587
13437D121L5489J1621j7668j6967k561q303n913M657K6628o43O562k595j1455
13424B2973Q027P254K753j623l9013p741R753J1520J9577K2154j4960k6233J0803
$$ plain form
13411 25244 23497 29167 20347 50862 48751 33771 36752 46167 40160 46095 23083 11928 17304
13398 17304 20901 19975 19224 12979 16018 9980 -1333 15153 50117 67147 61727 64839 64658 46702
13384 46702 15322 13511 24213 19677 29197 43866 41844 26089 451 3114 6348 949 34562
13371 34562 34593 24418 34684 37596 39659 24858 41866 73399 65476 40068 26889 34085 29151
13358 29151 21102 39835 42678 43460 34245 55341 53898 55638 52001 57366 59340 83652 108133 141385
13344 141385 165640 185549 200464 204490 181997 186741 193194 201372 225529 269537 314439 349912
13332 349912 397665 464747 535892 625739 725368 863876 1106777 1413816 1766718 2108135
13322 2108135 2402818 2461452 2233121 1825716 1286852 877263 613576 458093 375149 320687
$$ packed form
13411B5244j747N670q820L0515k111j4980K981R415o007N935k3012j1155N376
13398A7304L597r26p51o245L039o038j1313J6486L4964J7030n420L112j81j7956
13384D6702l1380j811J0702m536R520J4669k022j5755k5638K663L234n399L3613
13371C4562L1j0175J0266K912K063j4801J7008L1533p923k5408j3179P196m934
13358B9151q049J8733K843P82r215K1096j443J740l637N365J974K4312K4481L3252
13344A41385K4255J9909J4915M026k2493M744O453Q178K4157M4008M4902L5473
13332C49912M7753O7082P1145Q9847R9629J38508K42901L07039L52902L41417
13322B108135K94683N8634k28331m07405n38864m09589k63687j55483q2944n4462
$$ plain form
13312 320687 272123 203181 165184 150454 146906 125370 109773 80284 90812 134940 126164 117788
13300 117788 132323 135826 124799 118549 102551 79593 65891 67897 44769 47907 71726 89196
13288 89196 73375 72830 65490 74023 76637 78913 64368 55981 60167 56768 50757 54103 59668 60188
13274 60188 33166 38899 66884 85814 69097 58340 63485 91545 99031 85549 73996 70550
13262 70550 74553 39917 34019 22513 17614 22052 15066 -2482 1222 -3400 21100 52553 68445
13249 68445 74396 76533 72884 56957 28227 30463 29142 46874 72679 67692 61607 42273 64473
13236 64473 102620 136041 132565 115104 105204 98046 103552 124404 166253 195866 214020 180240
13224 180240 123061 88880 50579 43513 32120 -1726 12348 15028 13514 23085 58979 92881
$$ packed form
13312C20687m8564o8942l7997j4730l548k1536j5597k9489J0528M4128q776q376
13300A17788J4535L503j1027o250j5998k2958j3702K006k3128L138K3819J7470
13288H9196j5821n45p340Q533K614K276j4545q387M186l399o011L346N565N20
13274F0188k7022N733K7985J8930j6717j0757N145K8060P486j3482j1553l446
13262G0550M003l4636n898j1506m899M438o986j7548L704m622K4500L1453J5892
13249F8445N951K137l649j5927k8730K236j321J7732K5805m987o085j9334K2200
13236F4473L8147L3421l476j7461r900p158N506K0852M1849K9613J8154l3780
13224A80240n7179l4181l8301p066j1393l3846J4074K680j514R571L5894L3902
$$ plain form
13212 92881 104554 95688 91057 93549 79371 71546 70176 70057 64872 74357 60930 20815 18476 19581
13198 19581 28417 47365 51628 57441 61601 71352 61653 42802 29638 19416 40655 50282 76809
13185 76809 91744 68435 64835 95848 104991 112903 97560 113049 112233 96753 88247 102447 95386
13172 95386 95050 85117 96826 100852 97072 97937 85917 86202 102502 110460 122134 121566 118301 141953
13158 141953 144050 118496 117957 113999 107417 103989 126258 146868 172462 187322 197536 197265 166240
13145 166240 156523 174314 198246 226148 259810 295280 309416 304896 319211 323644 282884 237238
13133 237238 226299 211582 201362 194482 201733 170851 153709 133825 129789 100472 85281 81553
13121 81553 89207 98085 107766 106821 76099 58765 44085 40810 59777 95239 96002 94827 105677
$$ packed form
13212I2881J1673q866m631K492j4178p825j370j19n185R485j3427m0115k339J105
13198A9581Q836J8948M263N813M160R751r699j8851j3164j0222K1239R627K6527
13185G6809J4935k3309l600L1013R143P912j5343J5489q16j5480q506J4200p061
13172I5386l36r933J1709M026l780Q65j2020K85J6300P958J1674n68l265K3652
13158A41953K097k5554n39l958o582l428K2269K0610K5594J4860J0214k71l1025
13145A66240r717J7791K3932K7902L3662L5470J4136m520J4315M433m0760m5646
13133B37238j0939j4717j0220o880P251l0882j7142j9884m036k9317j5191l728
13121H1553P654Q878R681r45l0722j7334j4680l275J8967L5462P63j175J0850
$$ plain form
13108 105677 88309 89635 82908 106519 103261 107097 108478 94400 90850 104492 102162 101939 123963
13095 123963 138367 107455 109469 138176 142414 120503 132391 155667 141076 124109 153470 175506
13083 175506 171665 164333 165640 178665 150469 129834 114964 97359 68120 88654 110786 80580
13071 80580 51603 53977 88305 119250 143874 144220 164654 162766 141654 135157 146214 145317 132971
13058 132971 134650 147502 184643 192185 205299 208090 184821 194206 205725 217727 236470 277057
13046 277057 280975 266198 240743 256030 284398 278821 300087 304290 327664 343068 328822 330945
13034 330945 317377 292861 272007 262505 243129 233163 212678 208782 210635 226718 227736 225929 210596
13021 210596 210842 206070 206274 226039 193622 181802 185306 205499 250654 244048 214216 166109 104797
$$ packed form
13108A05677j7368J326o727K3611l258L836J381j4078l550J3642k330k23K2024
13095A23963J4404l0912K014K8707M238k1911J1888K3276j4591j6967K9361K2036
13083A75506l841p332J307J3025k8196k0635j4870j7605k9239K0534K2132l0206
13071H0580k8977K374L4328L0945K4624L46K0434j888k1112o497J1057q97j2346
13058A32971J679J2852L7141P542J3114K791k3269R385J1519J2002J8743M0587
13046B77057L918j4777k5455J5287K8368n577K1266M203K3374J5404j4246K123
13034C30945j3568k4516k0854r502j9376r966k0485l896J853J6083J018j807j5333
13021B10596K46m772K04J9765l2417j1820L504K0193M5155o606k9832m8107o1312
$$ plain form
13008 104797 103072 144148 176281 211649 257183 289745 300093 282828 276650 322601 359739 369902
12996 369902 394170 405261 399131 410495 411521 427745 447575 460418 478431 497007 516592 547330
12984 547330 560416 506685 492396 509860 519540 518155 504632 500094 518706 543436 551506 590446
12972 590446 631369 628419 635210 649145 648763 648439 661669 700233 760979 773839 770197 790926 806267
12959 806267 818297 818639 819830 829997 865863 924061 969020 985577 1005894 1040476 1103725 1169670
12947 1169670 1215850 1285303 1353518 1406303 1453703 1465999 1494559 1560088 1628567 1655920 1704767
12936 1704767 1753656 1810420 1886663 1957633 2050178 2146663 2244090 2340449 2425252 2526590 2613488
12925 2613488 2710220 2841207 2980694 3138977 3336622 3590610 3861968 4170148 4478878 4790178
$$ packed form
13008A04797j725M1076L2133L5368M5534L2562J0348j7265o178M5951L7138J0163
12996C69902K4268J1091o130J1364J026J6224J9830J2843J8013J8576J9585L0738
12984E47330J3086n3731j4289J7464R680j385j3523m538J8612K4730Q070L8940
12972E90446M0923k950O791J3935l82l24J3230L8564O0746J2860l642K0729J5341
12959H06267J2030L42J191J0167L5866N8198M4959J6557K0317L4582O3249O5945
12947A169670M6180O9453O8215N2785M7400J2296K8560O5529O8479K7353M8847
12936A704767M8889N6764P6243P0970R2545R6485R7427R6359Q4803J01338Q6898
12925B613488R6732J30987J39487J58283J97645K53988K71358L08180L08730L11300
$$ plain form
12915 4790178 5120441 5481778 5898202 6350372 6889770 7532748 8297001 9216159 10300543
12906 10300543 11589635 13111726 14902795 17016784 19429945 22077169 24959635 28138249
12898 28138249 31602201 35416037 39703811 44519951 50097970 56903295 65585723 77092458
12890 77092458 92327640 112576737 140431705 178716321 228419413 287479569 351529693
12883 351529693 417942154 463876906 448784728 392169639 297947809 196581841 129716570
12876 129716570 91505984 68642796 53774609 43341535 35500528 29413358 24571122
12869 24571122 20806583 17970339 15791759 14033841 12577136 11331978 10252944 9307536
12861 9307536 8510640 7835245 7234399 6675726 6134454 5657285 5210830 4761515 4376318
$$ packed form
12915D790178L30263L61337M16424M52170N39398O42978P64253R19158J084384
12906A0300543J289092J522091J791069K113989K413161K647224K882466L178614
12898B8138249L463952L813836M287774M816140N578019O805325Q682428J1506735
12890G7092458J5235182K0249097K7854968L8284616M9703092N9060156O4050124
12883C51529693O6412461M5934752j5092178n6615089r4221830j01365968o6865271
12876A29716570l8210586k2863188j4868187j0433074p841007o087170m842236
12869B4571122l764539k836244k178580j757918j456705j245158j079034r45408
12861I307536p96896o75395o00846n58673n41272m77169m46455m49315l85197
$$ plain form
12852 4376318 4055301 3805639 3552010 3327585 3109188 2962565 2832004 2722128 2662845 2567416
12842 2567416 2453702 2353394 2251114 2132299 2044746 2006498 1968190 1928474 1907059 1855418
12832 1855418 1725723 1609399 1533587 1466699 1419230 1363673 1314588 1324733 1293010 1260600 1255299
12821 1255299 1236993 1206202 1185691 1190893 1221598 1256735 1288899 1344572 1396180 1465386 1551432
12810 1551432 1627381 1717859 1836583 1978631 2099710 2225743 2377705 2551844 2786512 3045244
12800 3045244 3315139 3632937 4010246 4491634 5141291 5979130 7103538 8538643 10418128
12791 10418128 12846563 15765988 18920700 21968365 24556273 25440562 22652561 17244730
12783 17244730 12354004 8961380 6752660 5283589 4279643 3558777 2969727 2507805
$$ packed form
12852D376318l21017k49662k53629k24425k18397j46623j30561j09876n9283r5429
12842B567416j13714j00308j02280j18815q7553l8248l8308l9716k1415n1641
12832A855418j29695j16324p5812o6888m7469n5557m9085J0145l1723l2410n301
12821A255299j8306l0791k0511N202L0705L5137L2164N5673N1608O9206Q6046
12810A551432P5949R0478J18724J42048J21079J26033J51962J74139K34668K58732
12800C045244K69895L17798L77309M81388O49657Q37839J124408J435105J879485
12791A0418128K428435K919425L154712L047665K587908Q84289k788001n407831
12783A7244730m890726l392624k208720j469071j003946p20866n89050m61922
$$ plain form
12775 2507805 2177024 1934912 1723554 1571673 1482133 1393127 1280073 1180530 1094195 1058391
12765 1058391 1015545 938894 869940 851266 826964 800652 772431 773876 787901 794987 780688 767291
12753 767291 750157 718667 686136 645934 588609 567913 600773 592159 538764 517432 496007 473110
12741 473110 453874 444580 410406 379231 350289 315642 299567 289453 288066 291682 273910 270086
12729 270086 252167 234648 234585 198487 175251 181786 178968 160805 163376 155724 174124 204825 198944
12716 198944 186031 214425 212524 216508 237914 265499 262530 207415 211376 212829 199707 170586
12704 170586 173495 187037 205056 186994 206313 217437 229579 234116 247495 243305 234201 216225
12692 216225 234015 248907 225250 200677 191617 191715 171231 145207 114185 96075 99182 111437
$$ packed form
12775B507805l30781k42112k11358j51881q9540q9006j13054r9543q6335l5804
12765A058391m2846p6651o8954j8674k4302k6312k8221J445J4025P086j4299j3397
12753G67291j7134l1490l2531m0202n7325k0696L2860q614n3395k1332k1425k2897
12741D73110j9236r294l4174l1175k8942l4647j6075j0114j387L616j7772l824
12729B70086j7919j7519o3l6098k3236O535k818j8163K571p652J8400L0701n881
12716A98944j2913K8394j901L984K1406K7585k969n5115L961J453j3122k9121
12704A70586K909J3542J8019j8062J9319J1124J2142M537J3379m190r104j7976
12692B16225J7790J4892k3657k4573r060R8k0484k6024l1022j8110L107J2255
$$ plain form
12680 111437 124904 157144 172665 152195 149304 174035 181438 190733 187919 189852 194543 166523 160924
12667 160924 178484 171239 152093 142615 123884 131551 143360 156823 149228 143767 155418 167568
12655 167568 187067 193642 199049 210262 206537 178656 187225 173224 152930 128983 134957 148516
12643 148516 135157 113664 133687 143940 135308 161669 166789 139055 122820 128394 122391 134061
12631 134061 144870 137302 119686 106071 107237 80537 71027 74096 109303 123392 110709 114865
12619 114865 123525 95461 98664 100557 84934 67115 63975 66633 73055 69938 71790 84376 75732
12606 75732 63309 37844 34310 38165 60460 66654 46506 39485 41942 39060 33434 30380 20382
12593 20382 27325 39670 50804 47631 49232 70175 78513 57338 45108 17917 24934 34725 40359
$$ packed form
12680A11437J3467L2240J5521k0470k891K4731P403R295k814J933M691k8020n599
12667A60924J7560p245j9146r478j8731P667J1809J3463p595n461J1651J2150
12655A67568J9499O575N407J1213l725k7881Q569j4001k0294k3947N974J3559
12643A48516j3359k1493K0023J0253q632K6361N120k7734j6235N574o003J1670
12631A34061J0809p568j7616j3615J166k6700r510L069L5207J4089j2683M156
12619A14865Q660k8064L203J893j5623j7819l140K658O422l117J852J2586q644
12606G5732j2423k5465l534L855K2295O194k0148p021K457k882n626l054r998
12593B0382O943J2345J1134l173J601K0943Q338k1175j2230k7191P017R791N634
$$ plain form
12580 40359 24465 40298 75699 80060 67717 41455 51787 63209 78272 72983 74444 82667
12568 82667 76039 79884 77533 84928 99071 109482 113554 97152 96768 103572 90882 74620 97871
12555 97871 80442 65858 55588 32554 35455 59560 89536 75973 58869 70575 92172 97612
12543 97612 78950 39836 17936 22679 48613 54750 60401 71055 83999 105605 97190 58616
12531 58616 59207 77531 78581 67615 77759 64430 81337 88278 75555 69028 47736 29977 6026
12518 6026 12870 26238 32821 54508 75504 74321 75994 87051 71165 65222 56358 59605 58695 64569
12504 64569 51185 36921 18701 -36 -7760 23112 42742 23837 31649 23383 -8225 3681
12492 3681 33573 37629 54492 37454 19877 35840 30029 -16030 -25556 1049 6018 11487 23686
$$ packed form
12580D0359j5894J5833L5401M361j2343k6262J0332J1422J5063n289J461Q223
12568H2667o628L845k351P395J4143J0411M072j6402l84O804j2690j6262K3251
12555I7871j7429j4584j0270k3034K901K4105K9976j3563j7104J1706K1597N440
12543I7612j8662l9114k1900M743K5934O137N651J0654J2944K1606q415l8574
12531E8616N91J8324J050j0966J0144j3329J6907O941j2723o527k1292j7759k3951
12518F026O844J3368O583K1687K0996j183J673J1057j5886n943q864L247r10N874
12504F4569j3384j4264j8220j8737p724L0872J9630j8905P812q266l1608J1906
12492C681K9892M056J6863j7038j7577J5963n811m6059r526K6605M969N469J2199
$$ plain form
12479 23686 11587 10521 2957 13502 27850 21658 36420 22193 2640 1558 1483 -1644 22481
12466 22481 38270 43065 13948 23811 44404 52064 60207 75570 81418 105650 114093 84886 95717
12453 95717 113048 123333 156658 196698 244909 280543 307625 317194 369877 447058 532958 669198
12441 669198 848684 1102634 1373444 1674690 2013915 2331280 2426056 2237635 1827554 1298249
12431 1298249 855459 592768 449556 350177 272459 195013 140683 113627 83944 51853 52391
12420 52391 31984 26770 38618 52384 63840 72303 59367 47260 38988 41880 52387 79882
12408 79882 79770 62377 26164 -5857 5840 23666 1029 -2243 17560 8387 -11441 -18291 -30027
12395 -30027 -11116 3581 24214 33790 41690 60018 55960 31543 14843 29551 18619 -25591
$$ packed form
12479B3686j2099j066p564J0545J4348o192J4762j4227j9553j082p5l127K4125
12466B2481J5789M795k9117R863K0593P660Q143J5363N848K4232Q443k9207J0831
12453I5717J7331J0285L3325M0040M8211L5634K7082R569N2683P7181Q5900J36240
12441F69198J79486K53950K70810L01246L39225L17365R4776j88421m10081n29305
12431A298249m42790k62691j43212r9379p7718p7446n4330k7056k9683l2091N38
12420E2391k0407n214J1848J3766J1456Q463j2936j2107q272K892J0507K7495
12408G9882j12j7393l6213l2021J1697J7826k2637l272J9803r173j9828o850j1736
12395c0027J8911J4697K0633R576P900J8328m058k4417j6700J4708j0932m4210
$$ plain form
12383 -25591 -44874 -46425 -32955 -10850 -355 19731 19909 40743 49573 41436 6801 -4652 -9293
12370 -9293 -5993 6725 4477 4048 18219 26788 55457 32384 28098 13190 -11563 -93 21202
12357 21202 29875 28683 44950 48586 46627 48056 47303 45754 77573 94905 84524 97436 101236
12344 101236 122580 155281 161480 144653 148588 158817 138517 110124 89511 66956 68031 76644
12332 76644 54829 41363 41524 45929 56317 24488 16733 34857 36003 29975 14459 22412 689
12319 689 -11297 13685 1007 -18783 10295 11758 -6127 26527 58377 50059 26811 24842 39282
12306 39282 34064 16218 12568 8205 4063 -345 10750 35088 25749 -5342 -30487 -38649 -24834
12293 -24834 -6005 -7963 -24042 -9421 -1199 -14152 5621 -8770 -9615 -4183 4587 13700 19062
$$ packed form
12383b5591j9283j551J3470K2105J0495K0086J78K0834Q830q137l4635j1453m641
12370i293L300J2718k248m29J4171Q569K8669k3073m286j4908k4753J1470K1295
12357B1202Q673j192J6267L636j959J429p53j549L1819J7332j0381J2912L800
12344A01236K1344L2701O199j6827L935J0229k0300k8393k0613k2555J075Q613
12332G6644k1815j3466J61M405J0388l1829p755J8124J146o028j5516P953k1723
12319F89j1986K4982j2678j9790K9078J463j7885L2654L1850q318k3248j969J4440
12306C9282n218j7846l650m363m142m408J1095K4338r339l1091k5145q162J3815
12293b4834J8829j958j6079J4621Q222j2953J9773j4391q45N432Q770R113N362
$$ plain form
12280 19062 -400 3615 23535 42164 42536 15884 12279 18191 17243 27506 52506 23571 3716
12267 3716 23343 37178 31906 24371 12490 -398 -21024 -24633 4104 17079 16079 23140 30617
12254 30617 20394 36871 45667 41806 15611 -1538 28892 29317 12241 -10014 -3623 13432 8871
12241 8871 12328 22479 -4159 -11755 -19844 -30138 -43667 -56931 -19145 -9377 8407 9669 -16085
12228 -16085 -13695 1503 15414 16404 16546 13551 13155 8578 14410 44499 56566 38422 32946 36832
12214 36832 51573 37155 37243 33844 13152 3101 13565 17110 22668 41436 44616 20490 36580
12201 36580 48204 44405 7485 9822 24667 43344 42413 23413 30792 31224 28608 18995 7654
12188 7654 30723 42360 47867 60492 64276 51138 30754 36171 47678 41944 29373 1392 -3128
$$ packed form
12280A9062j9462M015J9920J8629L72k6652l605N912r48J0263K5000k8935j9855
12267C716J9627J3835n272p535j1881j2888k0626l609K8737J2975j000P061P477
12254C0617j0223J6477Q796l861k6195j7149L0430M25j7076k2255O391J7055m561
12241H871L457J0151k6638p596q089j0294j3529j3264L7786R768J7784J262k5754
12228a6085K390J5198J3911R90J42k995l96m577N832L0089J2067j8144n476L886
12214C6832J4741j4418Q8l399k0692j0051J0464L545N558J8768L180k4126J6090
12201C6580J1624l799l6920K337J4845J8677r31j9000P379M32k616r613j1341
12188G654K3069J1637N507J2625L784j3138k0384N417J1507n734j2571k7981m520
$$ plain form
12175 -3128 -146 35716 84934 77495 80876 79246 81491 87908 59633 17669 12622 27322 32912
12162 32912 59594 75026 71371 54863 69099 102665 105664 98767 72562 88411 113161 128691
12150 128691 147945 161299 182502 207772 224614 260045 297433 319806 327469 333527 371178 379319
12138 379319 372988 388216 406394 437631 466386 468757 468331 490472 508513 517337 495825 480332
12126 480332 488007 480422 452341 451420 463841 483872 481200 463631 472391 499029 516681 494599 486137
12113 486137 474516 448435 462418 480365 435658 411024 419817 417681 420978 427273 386635 347145
12101 347145 311652 282757 243768 209992 165295 156783 130796 107171 132803 141116 112687 73683
12089 73683 65299 84023 57969 41201 76398 100538 75017 51994 19204 11399 -10712 421
$$ packed form
12175c128K982L5862M9218p439L381j630K245O417k8275m1964n047J4700N590
12162C2912K6682J5432l655j6508J4236L3566K999o897k6205J5849K4750J5530
12150A28691J9254J3354K1203K5270J6842L5431L7388K2373P663O058L7651Q141
12138C79319o331J5228J8178L1237K8755K371m26K2141J8041Q824k1512j5493
12126D80332P675p585k8081r21J2421K0031k672j7569Q760K6638J7652k2082q462
12113D86137j1621k6081J3983J7947m4707k4634Q793k136L297O295m0638l9490
12101C47145l5493k8895l8989l3776m4697q512k5987k3625K5632Q313k8429l9004
12089G3683q384J8724k6054j6768L5197K4140k5521k3023l2790p805k2111J1133
$$ plain form
12077 421 27145 24463 10996 8046 -6597 -3101 -86 -24775 -14731 -4385 -692 10438 -3345
12064 -3345 -24941 -17728 -13935 72 -8127 -9553 4268 6655 7794 -16102 -17846 -20782 -6542
12051 -6542 -15768 -34192 -17448 33325 51401 34384 10228 1944 5506 17421 10819 -1180 8747
12038 8747 -2190 -326 4123 -7425 -2737 13939 11195 -852 16510 5380 8586 19538 29751
12025 29751 55957 46882 33189 27289 21536 3924 -6226 -15949 -6067 16914 15659 -10823 -17116
12012 -17116 791 28293 41974 37488 23751 7919 -4982 -21399 -31930 -33290 -16561 3393
12000 3393 2651 32629 60543 47008 20748 33413 50055 77349 52153 9354 -11914 -14541
11988 -14541 -1184 -7632 -11311 -25204 -27381 -7372 -18834 -34035 -28262 -9576 -4793 -697 7926
$$ packed form
12077D21K6724k682j3467k950j4643L496L015k4689J0044J0346L693J1130j3783
12064c345k1596P213L793J4007q199j426J3821K387J139k3896j744k936J4240
12051f542r226j8424J6744N0773J8076j7017k4156q284L562J1915o602j1999R927
12038H747j0937J864M449j1548M688J6676k744j2047J7362j1130L206J0952J0213
12025B9751K6206r075j3693n900n753j7612j0150r723R882K2981j255k6482o293
12012a7116J7907K7502J3681m486j3737j5832j2901j6417j0531j360J6729J9954
12000C393p42K9978K7914j3535k6260J2665J6642K7294k5196m2799k1268k627
11988a4541J3357o448l679j3893k177K0009j1462j5201N773J8686M783M096Q623
$$ plain form
11975 7926 34187 43113 8122 2631 15032 30047 40114 57066 40124 -2627 -16094 -11269
11963 -11269 -10888 -26305 -33896 -23181 -12914 -4511 5186 37010 48189 24218 -9119 -10928 5506
11950 5506 11072 21678 36896 16822 21933 28139 29989 52815 54215 16591 -6592 4543 -4902
11937 -4902 -10654 892 21964 25573 207 -6866 8533 19538 13442 9427 15903 -8774 -35812
11924 -35812 -25858 -9855 17888 29410 17390 4410 9823 21495 16716 15077 10762 243 -4880
11911 -4880 -24112 -23976 4850 15584 23062 17321 17022 5098 6615 -9095 68 20480 21444 15452
11897 15452 17415 -99 -6866 -28868 -35886 -36618 -42469 -10839 13777 -17676 -7818 -1412 8296
11884 8296 26269 40297 32796 20361 11219 13752 -3440 -21246 -8150 -8581 -454 21258 5688
$$ packed form
11975G926K6261Q926l4991n491J2401J5015J0067J6952j6942m2751j3467M825
11963a1269L81j5417p591J0715J0267Q403R697L1824J1179k3971l3337j809J6434
11950E506N566J0606J5218k0074N111O206J850K2826J400l7624k3183J1135r445
11937d902n752J1546K1072L609k5366p073J5399J1005o096m015O476k4677k7038
11924c5812R954J6003K7743J1522j2020j2980N413J1672m779j639m315j0519n123
11911d880j9232J36K8826J0734P478n741k99j1924J517j5710R163K0412R64n992
11897A5452J963j7514o767k2002p018p32n851L1630K4616l1453R858O406R708
11884H296J7973J4028p501j2435r142K533j7192j7806J3096m31Q127K1712j5570
$$ plain form
11871 5688 -4984 -10953 -8749 -2499 -10109 -4508 25980 43443 38742 6527 -5316 -21213 -22504
11858 -22504 -16642 1645 -3087 -9855 -439 -7312 -14332 -14387 -13852 11817 25715 10259 139 -24941
11844 -24941 -26919 -29681 -13582 12147 17228 3377 -16979 -21994 -30052 -10112 -6197 12195 34877
11831 34877 13964 -417 -12142 14237 13250 -24038 -33769 -21253 -2454 -3223 3230 9153 15302
11818 15302 3836 -34815 -37011 -17465 -1988 15570 32013 29652 48379 51033 49363 45301 44216
11805 44216 74278 67448 48081 49332 64161 50093 21916 4071 -24474 -16708 -13409 4023
11793 4023 23127 2655 -15942 -14587 -3414 -8447 19023 13992 10177 6477 35483 33388 30405
11780 30405 11168 29629 17552 16131 14423 14283 21083 -3492 -13875 -8707 -12664 -15610 -15514 -6980
$$ packed form
11871E688j0672n969K204O250p610N601L0488J7463m701l2215j1843j5897j291
11858b2504N862J8287m732o768R416o873p020n5N35K5669J3898j5456j0120k5080
11844b4941j978k762J6099K5729N081j3851k0356n015q058J9940L915J8392K2682
11831C4877k0913j4381j1725K6379r87l7288r731J2516J8799p69O453N923O149
11818A5302j1466l8651k196J9546J5477J7558J6443k361J8727K654j670m062j085
11805D4216L0062o830j9367J251J4829j4068k8177j7845k8545P766L299J7432
11793D023J9104k0472j8597J355J1173n033K7470n031l815l700K9006k095k983
11780C0405j9237J8461j2077j421j708j40O800k4575j0383N168l957k946R6Q534
$$ plain form
11766 -6980 -16053 -4080 12528 13825 2929 -8522 -9487 4305 17648 5459 13124 -1988 -15087
11753 -15087 -28445 -5948 23168 912 -8492 -21202 -22068 -37802 -39205 -25739 -35697 -28326 -27944
11740 -27944 -33563 -9185 -15306 -26656 -44978 -33812 -24756 -3676 -17988 -24724 -15707 606 17799
11727 17799 3087 19933 27434 12413 -16571 -26498 -9260 4623 13110 16461 14642 -7136 -19389
11714 -19389 -18586 -19054 -11427 1683 16921 -8563 -39223 -39464 -38082 -36401 -8686 -5397 -1807 -2194
11700 -2194 -7007 6821 12332 -7877 -15758 -27864 -35642 -27925 -29902 -17455 -9578 -9686 -7253 8776
11686 8776 6243 8110 31857 19351 18441 5551 -5100 -107 -11574 -6327 8999 -4861 2826
11673 2826 22054 4090 24501 12525 1490 -38732 -39294 -12035 10951 16616 35864 54846
$$ packed form
11766f980r073J1973J6608J297j0896j1451r65J3792J3343j2189P665j5112j3099
11753a5087j3358K2497K9116k2256r404j2710q66j5734j403J3466r958P371L82
11740b7944n619K4378o121j1350j8322J1166R056K1080j4312o736R017J6313J7193
11727A7799j4712J6846P501j5021k8984r927J7238J3883Q487L351j819k1778j2253
11714a9389Q03m68P627J3110J5238k5484l0660k41J382J681K7715L289L590l87
11700b194m813J3828N511k0209p881j2106p778P717j977J2447P877j08K433J6029
11686H776k533J867K3747j2506r10j2890j0651M993j1467N247J5326j3860P687
11673B826J9228j7964K0411j1976j1035m0222n62K7259K2986N665J9248J8982
$$ plain form
11661 54846 47264 43183 35893 12991 17426 -9973 -35675 -16754 11580 17369 20594 18254 22916
11648 22916 6030 -5895 -6561 -15006 -30680 -32600 -23506 6263 37296 26175 25250 12578 -19259
11635 -19259 -7140 -19298 -31952 -16635 -23483 -34213 -26579 -35357 -18114 -36291 -58904 -42782
11623 -42782 -25568 -22466 -13017 20780 27583 31544 16274 -3990 -15197 -29566 -59210 -52362 -22402
11610 -22402 -14051 -7596 -1789 -4938 22695 24022 18015 26703 11171 906 23321 25805 5296
11597 5296 -15840 -11823 -26054 -13585 -11682 3318 1529 -18554 -18537 -25172 1045 16409 7769
11584 7769 -26650 -42839 -15022 -21052 -48165 -39404 -43514 -62544 -30781 -32845 -12292 -15981 -14474
11571 -14474 -1010 14061 3730 -17200 -10528 -7438 -6647 -11266 -4042 -27614 -43368 -66270 -67496
$$ packed form
11661E4846p582m081p290k2902M435k7399k5702J8921K8334N789L225k340M662
11648B2916j6886j1925o66q445j5674j920R094K9769L1033j1121r25j2672l1837
11635a9259J2119j2158j2654J5317o848j0730P634q778J7243j8177k2613J6122
11623d2782J7214L102R449L3797O803L961j5270k0264j1207j4369k9644O848K9960
11610b2402Q351O455N807l149K7633J327o007Q688j5532j0265K2415K484k0509
11597E296k1136M017j4231J2469J903J5000j789k0083J7o635K6217J5364q640
11584G769l4419j6189K7817o030k7113Q761m110j9030L1763k064K0553l689J507
11571a4474J3464J5071j0331k0930O672L090P91m619P224k3572j5754k2902j226
$$ plain form
11558 -67496 -47065 -27410 -18127 -30223 -20275 -30240 -36653 -7197 -2578 -22739 -26135 -40384 -45173
11545 -45173 -35272 -26458 -2445 -4496 -37618 -55623 -21557 -26650 -17748 3074 -5900 1170 -7479
11532 -7479 -14651 -22269 -26878 -8968 11134 32715 21968 16856 25049 14732 30697 52088 47683
11519 47683 7835 -17975 -32246 -18447 -8472 3148 -4426 -8343 -6599 -9025 -8163 -9471 9919
11506 9919 -5035 -7265 17472 29922 25387 7386 1004 -17202 -33396 -7797 489 -15610 -21557
11493 -21557 -23946 -9205 -16681 -54603 -82913 -67565 -20232 -2278 -12592 -37261 -40894 -24772
11481 -24772 -14920 -11823 17802 29310 22067 11216 12881 -4095 -22656 -28330 -26714 -36722 -27446
11468 -27446 -19166 -24475 1165 2213 -33122 -44311 -38910 -25427 -39789 -37708 -13618 11287 16520
$$ packed form
11558f7496K0431J9655R283j2096R948r965o413K9456M619k0161l396j4249m789
11545d5173R901Q814K4013k051l3122j8005L4066n093Q902K0822q974P070q649
11532g479p172p618m609J7910K0102K1581j0747n112Q193j0317J5965K1391m405
11519D7683l9848k5810j4271J3799R975J1620p574l917J744k426Q62j308J9390
11506I919j4954k230K4737J2450m535j8001o382j8206j6194K5599Q286j6099n947
11493b1557k389J4741p476l7922k8310J5348M7333J7954j0314k4669l633J6122
11481b4772R852L097K9625J1508p243j0851J665j6976j8561n674J616j0008R276
11468b7446Q280n309K5640J048l5335j1189N401J3483j4362K081K4090K4905N233
$$ plain form
11455 16520 20116 26180 23214 -676 -18784 -19995 -1638 -3926 -2078 21574 14455 -26951 -48418
11442 -48418 -31949 -21765 -36799 -35849 -29552 -30662 -23398 -30395 -33494 -35575 -49441 -53492 -61367 -26691
11428 -26691 -2776 -13137 -6456 -10744 5641 15148 443 4127 18132 -5545 848 1765 12495
11415 12495 17695 8076 8365 14891 25929 11827 -22713 -36098 -13718 -8157 -8597 -4792 20562
11402 20562 44423 43118 20683 13248 35723 54839 17682 2708 1300 12018 29673 -476
11390 -476 1029 -19800 -38116 -42814 -47545 -67555 -37998 -9292 -7718 -31662 -51049 -58103 -30298
11377 -30298 -26603 2339 5064 -14798 -16469 -4962 -2182 2857 15618 17226 5775 25070 36971
11364 36971 25756 8448 -8254 -15246 -17649 -18062 -46609 -51639 -24321 -29125 -40156 -25819 -21155
$$ packed form
11455A6520L596O064k966k3890j8108j211J8357k288J848K3652p119m1406k1467
11442d8418J6469J0184j5034R50O297j110P264o997l099k081j3866m051p875L4676
11428b6691K3915j0361O681m288J6385R507j4705L684J4005k3677O393R17J0730
11415A2495N200r619K89O526J1038j4102l4540j3385K2380N561m40L805K5354
11402B0562K3861j305k2435p435K2475J9116l7157j4974j408J0718J7655l0149
11390d76J505k0829j8316m698m731k0010K9557K8706J574k3944j9387p054K7805
11377c0298L695K8942K725j9862j671J1507K780N039J2761J608j1451J9295J1901
11364C6971j1215j7308j6702o992k403m13k8547n030K7318m804j1031J4337M664
$$ plain form
11351 -21155 -26054 7828 4416 -760 6254 10223 22237 19295 -3852 -2950 -12293 -8302 6333 22231
11337 22231 24926 5247 23151 40490 23822 17038 5782 6598 -7309 -20495 -12310 -11481 -18502
11324 -18502 -21599 -35530 -46249 -45247 -28319 -13978 -19883 -13912 3943 -4303 -4702 20234 10409
11311 10409 -2038 -15904 -8938 7869 29437 11934 -14526 -24679 -12201 -8797 -23233 -9653
11299 -9653 5743 13844 -14538 -23110 -9377 -12745 4066 14525 5648 -17278 -30356 -32962 -13584
11286 -13584 112 6564 -9838 -11348 9238 18863 8445 -17689 -41430 -23286 -19874 -18185 -11360
11273 -11360 1182 -13481 -22014 -13427 6003 6104 -4942 -4917 -3679 -4316 -5976 -28302 -23803 -27652
11259 -27652 -31518 -26949 3784 29622 17400 4020 8476 21703 10319 834 -14821 -4693
$$ packed form
11351b1155m899L3882l412n176P014L969J2014k942k3147R02r343L991J4635J5898
11337B2231K695j9679J7904J7339j6668o784j1256Q16j3907j3186Q185Q29p021
11324a8502l097j3931j0719J002J6928J4341n905N971J7855q246l99K4936r825
11311A0409j2447j3866O966J6807K1568j7503k6460j0153J2478L404j4436J3580
11299i653J5396Q101k8382q572J3733l368J6811J0459q877k2926j3078k606J9378
11286a3584J3696O452j6402j510K0586R625j0418k6134k3741J8144L412J689O825
11273a1360J2542j4663q533Q587J9430J01j1046K5J238o37j660k2326M499l849
11259b7652l866M569L0733K5838j2222j3380M456J3227j1384r485j5655J0128
$$ plain form
11247 -4693 -12466 -587 -28743 -27074 213 -1795 7368 22192 17730 12545 3900 -20729 -52971
11234 -52971 -41805 -39959 -23198 -34099 -32858 -14806 -6702 -4990 -847 676 13328 31149 29657
11221 29657 25033 14469 -3071 -7199 -3488 7389 12987 -9130 -12383 14958 10511 7250 21678
11208 21678 35106 27063 -8264 -12746 -12474 7181 932 13359 32732 21266 -20845 -18471 888
11195 888 15966 29980 48310 36258 17562 12646 9833 -7100 -10014 -18082 1773 27476 36735
11182 36735 39326 32913 49414 37399 11128 -5708 -2173 -23753 -30622 -10453 3837 -417 -3984
11169 -3984 20811 32510 19360 9149 -4447 -12650 13698 22260 25554 28425 -168 -12341 -6271
11156 -6271 -17288 -20859 -6729 14987 30637 29571 4413 -4125 -2013 -321 15011 -8621 10720
$$ packed form
11247d693p773J1879k8156J669K7287k008R163J4824m462n185q645k4629l2242
11234e2971J1166J846J6761j0901J241J8052Q104J712M143J523J2652J7821j492
11221B9657m624j0564j7540m128L711J0877N598k2117l253K7341m447l261J4428
11208B1678J3428q043l5327m482K72J9655o249J2427J9373j1466m2111K374J9359
11195H88J5078J4014J8330j2052j8696m916k813j6933k914q068J9855K5703R259
11182C6735K591o413J6501j2015k6271j6836L535k1580o869K0169J4290m254l567
11169c984K4795J1699j3150j0211j3596q203K6348Q562L294K871k8593j2173O070
11156f271j1017l571J4130K1716J5650j066k5158q538K112J692J5332k3632J9341
$$ plain form
11143 10720 55363 53132 16030 -8770 -26044 -28970 -18898 -10639 -7793 22375 31242 5727 -12145
11130 -12145 -5483 -2960 -5619 -30704 -20147 -17275 -17250 -19707 -12309 -11195 -12538 -9452 21384 29827
11116 29827 21003 -2473 -21821 -27064 -4264 14767 17462 9180 -9831 -15655 1699 -5915 -14133
11103 -14133 -14230 13206 18852 -21573 -51259 -22520 6236 -3763 -17781 -25221 -16868 9098 27470
11090 27470 23659 20302 -509 -18168 -34137 -21190 -14410 -7824 23639 36076 31859 13859 9795
11077 9795 16937 32504 26352 42496 37679 25394 17590 18556 -574 -7646 -14299 -10315 -12652 -8290
11063 -8290 -83 -11786 -30312 -36083 -44861 -28978 -2368 -8639 -24277 -32649 -15437 11071 -3094
11050 -3094 -9493 -22111 -24890 -12853 -25838 -22718 19078 14420 -11598 -26260 -19936 -13528 4927
$$ packed form
11143A0720M4643k231l7102k4800j7274k926J0072Q259K846L0168Q867k5515j7872
11130a2145O662K523k659k5085J0557K872K5k457P398J114j343L086L0836Q443
11116B9827q824k3476j9348n243K2800J9031K695q282j9011n824J7354p614q218
11103a4133r7K7436N646m0425k9686K8739K8756r999j4018p440Q353K5966J8372
11090B7470l811l357k0811j7659j5969J2947O780O586L1463J2437m217j8000m064
11077I795P142J5567o152J6144m817j2285p804R66j9130p072o653L984k337M362
11063h290Q207j1703j8526n771q778J5883K6610o271j5638q372J7212K6508j4165
11050c094o399j2618k779J2037j2985L120M1796m658k6018j4662O324O408J8455
$$ plain form
11037 4927 23644 11442 11404 27705 39636 30331 24709 19849 3439 6981 11870 12046 28903 5442
11023 5442 -12500 -15164 2251 14861 22304 25357 11289 -10 -21438 -41394 -13032 -1617
11011 -1617 -5171 -7892 -9763 -45986 -54112 -30481 -17780 -24146 -3235 6622 7620 1047 -20096 -22558
10997 -22558 -8575 -10073 -26791 -22555 725 12705 34223 31377 5939 -2546 -10096 -30133 -23011
10984 -23011 -19220 -6717 -4437 23870 20750 -11244 -11391 -9648 -3112 -290 -11452 -10827 -3749 -8265
10970 -8265 -17705 -33322 -29217 -5112 16580 4043 13861 19687 15466 8922 -19787 -17236 6513
10957 6513 12780 14015 -3292 -3472 -2964 3614 -22821 -39820 -48244 -15130 1608 -1127 3186 -13961
10943 -13961 -17934 -16364 -11737 4889 17202 2510 -8813 9664 16487 -1293 -12231 11911
$$ packed form
11037D927J8717j2202l8J6301J1931r305n622m860j6410L542M889J76J6857k3461
11023E442j7942k664J7415J2610P443L053j4068j1299k1428j9956K8362J1415
11011a617l554k721j871l6223q126K3631J2701o366K0911R857R98o573k1143k462
10997b2558J3983j498j6718M236K3280J1980K1518k846k5438q485p550k0037P122
10984b3011L791J2503K280K8307l120l1994j47J743O536K822j1162O25P078m516
10970h265r440j5617M105K4105K1692j2537R818N826m221o544k8709K551K3749
10957F513O267J235j7307j80N08O578k6435j6999q424L3114J6738k735M313j7147
10943a3961l973J570M627J6626J2313j4692j1323J8477O823j7780j0938K4142
$$ plain form
10931 11911 21297 -6365 -10313 -5990 -10869 12854 23920 22856 14437 9426 12285 -5687 -4265
10918 -4265 -6271 11670 1249 -8566 -17763 -6497 -2291 -16006 -34225 -27404 13624 32703 42807
10905 42807 34665 20984 7868 -9213 -9047 -458 15119 1293 -407 -8076 -511 -11962 -18700
10892 -18700 5056 -2187 -996 -7570 -7689 15369 8708 25193 57951 71747 45913 20994 1261
10879 1261 4657 -5390 -8846 -10200 -23193 -15873 -8199 -33241 -39834 -21006 -19038 -21547 -19672 -13195
10865 -13195 -18491 -30051 -8538 -3536 -14766 -36693 -27168 -28516 -37257 -46483 -63675 -41144 -11767
10852 -11767 -3219 -14494 -29294 -20412 -6875 -21696 -26617 -42763 -37385 -27409 -14680 -10620 -13771
10839 -13771 -19167 -10701 -7244 -4728 -12233 9619 25790 35872 14506 -16122 -6713 7216 7424
$$ packed form
10931A1911R386k7662l948M323m879K3723J1066j064q419n011K859j7972J422
10918d265k006J7941j0421r815r197J1266M206j3715j8219O821M1028J9079J0104
10905D2807q142j3681j3116j7081J66Q589J5577j3826j700p669P565j1451o738
10892a8700K3756p243J191o574j19K3058o661J6485L2758J3796k5834k4919j9733
10879A261L396j0047l456j354j2993P320P674k5042o593J8828J968k509J875O477
10865a3195n296j1560K1513N002j1230k1927R525j348q741r226j7192K2531K9377
10852a1767Q548j1275j4800Q882J3537j4821m921j6146N378R976J2729M060l151
10839a3771n396Q466L457K516p505K1852J6171J0082k1366l0628R409J3929K08
$$ plain form
10826 7424 10992 -25751 -21120 6481 28123 19589 12315 8954 -7904 -11084 7008 10889 12695
10813 12695 11645 259 -13927 -4882 11269 39709 26761 7182 13961 1506 -13430 -5414
10801 -5414 11145 42561 61407 54225 37596 37662 38664 25487 5609 -5517 -10570 22899 27029
10788 27029 7297 -26474 -19636 -4970 3400 18253 14001 19313 15953 14680 -2686 12891 21090
10775 21090 23215 10179 4617 -11317 -7920 -5266 9336 17861 26969 18850 -2205 -27039 -17176
10762 -17176 -9484 -11474 -14144 -33722 -47425 -10218 -922 -15063 -11462 -18503 -7717 -8700 -26061
10749 -26061 -16989 -20312 -8314 -13992 -24332 -13198 10982 -15592 -40839 -59217 -46928 -29434
10737 -29434 -13365 792 2771 -16531 -13915 -24894 -21039 -18141 -36296 -42472 -11592 5730 524
$$ packed form
10826G424L568l6743M631K7601K1642q534p274l361j6858l180J8092L881J806
10813A2695j050j1386j4186R045J6151K8440j2948j9579O779j2455j4936Q016
10801e414J6559L1416J8846p182j6629O6J002j3177j9878j1126n053L3469M130
10788B7029j9732l3771O838J4666Q370J4853m252N312l360j273j7366J5577Q199
10775B1090K125j3036n562j5934L397K654J4602Q525R108q119k1055k4834R863
10762a7176P692j990k670j9578j3703L7207R296j4141L601p041J0786r83j7361
10749b6061R072l323J1998n678j0340J1134K4180k6574k5247j8378J2289J7494
10737b9434J6069J4157J979j9302K616j0979L855K898j8155o176L0880J7322n206
$$ plain form
10724 524 -13842 -39071 -46816 -29071 -9151 10056 28393 21748 3660 -15274 -8380 -10386 -12808
10711 -12808 -27774 -16606 -12489 -20375 10596 24790 23364 23488 35681 21807 7798 1549 19430
10698 19430 12949 -11878 -10294 3290 12605 -2727 -14146 -33425 -31230 -22057 -5213 -5987 -11926
10685 -11926 -26115 -41319 -27912 -3811 -9534 -23161 -26783 -18267 -17010 -28289 -22875 -10709 5652
10672 5652 15055 7914 -30399 -61127 -49176 6088 8798 -16033 1783 -170 9281 -655 -11564
10659 -11564 -31106 -24608 -15767 -22958 -25815 -13554 -22220 -11532 20920 25853 7512 2212 25905
10646 25905 44083 23594 17793 -10882 -12223 793 -5954 11770 18983 11050 2754 8025 -12863
10633 -12863 -3867 -4718 -4645 936 29866 32617 8453 1983 17043 20154 22860 9627 4875 6812
$$ packed form
10724E24j4366k5229p745J7745J9920J9207J8337o645j8088j8934O894k006k422
10711a2808j4966J1168M117p886L0971J4194j426J24J2193j3874j4009o249J7881
10698A9430o481k4827J584J3584R315j5332j1419j9279K195R173J6844p74n939
10685a1926j4189j5204J3407K4101n723j3627l622Q516J257j1279N414J2166J6361
10672E652R403p141l8313l0728J1951N5264K710k4831J7816j953R451r936j0909
10659a1564j9542O498Q841p191k857J2261q666J0688L2452M933j8341n300K3693
10646B5905J8178k0489n801k8675j341J3016o747J7724P213p933q296N271k0888
10633a2863Q996q51P3N581K8930K751k4164o470J5060L111K706j3233m752J937
$$ plain form
10619 6812 2727 -2951 798 3512 21030 36206 27652 23176 40000 25258 24846 36189 27460 -6944
10605 -6944 -20529 -11264 -5400 -13912 -22221 -25131 -18924 -21054 -23602 -9077 -18314 -26041 -27109 -23917
10591 -23917 -4932 9039 -15180 -18828 -16517 -21012 -19465 -30716 -44585 -42763 -45425 -59570 -53425
10578 -53425 -31930 -24665 -22275 -19606 -13891 -20825 -7949 -5727 -15246 6818 30061 39153 28521
10565 28521 16435 6481 -20703 -21430 -23715 -19285 -23357 -44561 -33212 6734 30489 13517 1511
10552 1511 -18437 -28046 -27545 -27717 -22493 -35636 -30883 -29930 -41121 -32917 -24740 -21527 -26529 -18855 -43217
10537 -43217 -57140 -34795 -3836 60 -9390 -19907 -14785 -12828 -27276 -57058 -39314 -19680
10525 -19680 -10036 -24781 -27198 -11389 -22193 -14559 4094 9927 12101 17308 7808 4608 77
$$ packed form
10619F812m085n678L749K714J7518J5176q554m476J6824j4742m12J1343q729l4404
10605f944j3585R265N864q512q309k910O207k130k548J4525r237p727j068L192
10591b3917J8985J3971k4219l648K311m495J547j1251j3869J822k662j4145O145
10578e3425K1495P265K390K669N715o934J2876K222r519K2064K3243R092j0632
10565B8521j2086r954k7184p27k285M430m072k1204J1349L9946K3755j6972j2006
10552A511j9948r609N01j72N224j3143M753R53j1191Q204Q177L213n002P674k4362
10537d3217j3923K2345L0959L896r450j0517N122J957j4448k9782J7744J9634
10525a9680R644j4745k417J5809j0804P634J8653N833K174N207r500l200m531
$$ plain form
10512 77 8521 9847 -3953 -2943 -11143 3691 10895 21137 12329 -6071 -5746 -3272 -10760 -4151
10498 -4151 -69 17796 11757 -21636 7136 21453 29574 41100 27085 4386 14175 7654 3471
10485 3471 -2918 15350 44785 43038 17987 5755 4438 -2011 -10305 4094 16519 12546 -14454
10472 -14454 -15415 -3055 -5434 6320 30438 32455 39948 41407 39156 32660 13945 14987 16972 14174
10458 14174 8728 7527 9711 -29244 -23205 -12988 3042 5744 22069 7936 8408 9833 65
10445 65 -20482 -10569 5809 10027 8363 21932 67835 69435 21821 9792 15970 43835 30630
10432 30630 22741 -3042 187 30774 39978 13241 -9546 195 16112 27854 30964 20567 -10484
10419 -10484 -47542 -52145 -62460 -45937 -26634 -11329 -6597 1890 -2985 1206 12748 22666 32565
$$ packed form
10512G7Q444J326j3800J010q200J4834P204J0242q808j8400L25K474p488O609
10498d151M082J7865o039l3393K8772J4317Q121J1526j4015k2699R789o521m183
10485C471o389J8268K9435j747k5051j2232j317o449q294J4399J2425l973k7000
10472a4454r61J2360k379J1754K4118K017P493J459k251o496j8715J042J985k798
10458A4174n446j201K184l8955O039J0217J6030K702J6325j4133M72J425r768
10445F5k0547R913J6378M218j664J3569M5903J600m7614j2029O178K7865j3205
10432C0630p889k5783L229L0587R204k6737k2787R741J5917J1742L110j0397l1051
10419a0484l7058m603j0315J6523J9303J5305M732Q487m875M191J1542R918R899
$$ plain form
10406 32565 44104 14937 1069 -2448 -22545 -36327 -41306 -54533 -55454 -35416 -27200 -52911 -58212
10393 -58212 -60244 -44900 -24822 -15842 -27976 -27167 -28461 3061 26300 25770 20529 20711 23600 10718
10379 10718 -16186 -53298 -39381 -10363 8657 -2005 -4331 -9572 -30282 -21663 20970 30429
10367 30429 22200 -1495 -1276 1358 -13241 6188 14586 19258 8590 11680 21294 12047 7446 -7984
10353 -7984 4582 17828 29989 27197 13226 8465 -9789 -19743 -6348 12613 971 -17265
10341 -17265 -34744 -41091 -35682 -16975 -32864 -53159 -41203 -3144 -13200 -29207 -23917 -12199
10329 -12199 11936 15915 10747 16308 -4731 -30926 -3726 -15120 -15707 -23174 -11139 22874 23808
10316 23808 19680 31355 8085 2528 524 -22345 -16457 -4446 -18067 -27641 -3824 17422 5261
$$ packed form
10406C2565J1539k9167j3868l517k0097j3782m979j3227r21K0038Q216k5711n301
10393e8212k032J5344K0078Q980j2134Q09j294L1522K3239n30n241J82K889j2882
10379A0718k6904l7112J3917K9018J9020j0662k326n241k0710Q619M2633R459
10367C0429q229k3695K19K634j4599J9429Q398M672j0668L090R614r247m601j5430
10353g984J2566J3246J2161k792j3971m761j8254r954J3395J8961j1642j8236
10341a7265j7479o347N409J8707j5889k0295J1956L8059j0056j6007N290J1718
10329a2199K4135L979n168N561k1039k6195K7200j1394n87p467J2035L4013R34
10316B3808m128J1675k3270n557k004k2869N888J2011j3621r574K3817K1246j2161
$$ plain form
10303 5261 -23650 -33621 -25258 -12557 -6270 17782 25914 20592 1533 -9331 -30218 -927 -743
10290 -743 4881 26329 54370 42837 11871 9380 6675 -7832 5736 14523 14209 12411 15611 1990
10276 1990 -11266 -13625 8880 22359 27877 12746 32194 34593 13892 -18363 -14492 2494 11382
10263 11382 29688 15631 21681 24225 18460 31297 15369 2049 10439 18143 8336 -19033 -46939
10250 -46939 -42137 -45559 -44985 -29670 -14401 -8857 1598 -1916 -164 3033 176 22156 5890
10237 5890 -12130 -864 7665 -6180 8650 36649 26305 -3270 7459 38637 24068 5696
10225 5696 -7438 -3736 19776 23825 -1845 10173 9199 -2631 -11478 -3241 8400 12447 10137
10212 10137 19612 26811 32589 44007 17248 -4648 -8778 11362 2374 -7254 13734 24036 18510
$$ packed form
10303E261k8911r971Q363J2701O287K4052Q132n322j9059j0864k0887K9291J84
10290g43N624K1448K8041j1533l0966k491k705j4507J3568Q787l14j798L200j3621
10276A990j3256k359K2505J3479N518j5131J9448K399k0701l2255L871J6986Q888
10263A1382J8306j4057O050K544n765J2837j5928j3320Q390P704r807k7369k7906
10250d6939M802l422N74J5315J5269N544J0455l514J752L197k857K1980j6266
10237E890j8020J1266Q529j3845J4830K7999j0344k9575J0729L1178j4569j8372
10225E696j3134L702K3512M049k5670J2018r74j1830q847Q237J1641M047k310
10212A0137R475P199N778J1418k6759k1896m130K0140q988r628K0988J0302n526
$$ plain form
10199 18510 16756 32561 18512 -8722 -23186 -35147 -7646 1149 -20624 -28416 -33021 -29995 -13975
10186 -13975 1700 31174 29696 -7047 -28896 -23196 1446 24615 -1853 -12071 -2823 -8260
10174 -8260 -13139 -16665 -23740 -30510 -24530 -20835 -12101 -4634 1445 -5573 -7408 17574 56612 56669 32709
10159 32709 24405 9368 19771 -7625 -2515 6908 5537 10130 -4205 -2511 25899 35683 2956
10146 2956 -26165 -11362 -8033 379 31805 22965 28795 23681 13232 -7059 7536 -4848 -18104
10133 -18104 -25421 -9401 15927 4503 12645 23357 30795 35270 25107 32127 11001 -1518 684
10120 684 -6107 -4642 18826 30792 10991 -17678 -11839 2420 -8746 -46408 -58959 -35985 4064
10107 4064 18405 20151 21481 25878 24540 21205 26704 11608 -20305 -17861 -24966 -35026 5446
$$ packed form
10199A8510j754J5805j4049k7234j4464j1961K7501Q795k1773p792m605L026J6020
10186a3975J5675K9474j478l6743k1849N700K4642K3169k6468j0218R248n437
10174h260m879l526p075o770N980L695Q734P467O079p018j835K4982L9038N7k3960
10159C2709q304j5037J0403k7396N110R423j371M593j4335J694K8410R784l2727
10146B956k9121J4803L329Q412L1426q840N830n114j0449k0291J4595j2384j3256
10133a8104p317J6020K5328j1424Q142J0712P438M475j0163P020k1126j2519K202
10120F84o791J465K3468J1966j9801k8669N839J4259j1166l7662j2551K2974M0049
10107D064J4341J746J330M397j338l335N499j5096l1913K444p105j0060M0472
$$ plain form
10094 5446 21383 25715 23512 39234 39017 17515 -10950 -5801 27937 50702 76448 79329 66416
10081 66416 67736 49952 75291 92144 102207 95205 103460 110476 116259 131189 143493 142144 152365
10068 152365 157506 168226 170341 188822 232683 293399 332660 404564 482522 554363 623466 687002
10056 687002 731643 772370 863058 953894 1069892 1207145 1425196 1735530 2122234 2661719
10046 2661719 3508779 4765420 6355972 8017674 9526759 11454900 12873330 9071007
10038 9071007 4971667 2973912 2003788 1473929 1142466 894507 724545 597370 498621
10029 498621 431158 382202 350225 309846 276515 240142 216745 205908 201017 189785 153210 171540
10017 171540 156740 120026 105629 83551 64713 54519 68443 88444 86102 57883 26733 28669
$$ packed form
10094E446J5937M332k203J5722k17k1502k8465N149L3738K2765K5746K881j2913
10081F6416J320j7784K5339J6853J0063p002Q255P016N783J4930J2304j349J0221
10068A52365N141J0720K115J8481M3861O0716L9261P1904P7958P1841O9103O3536
10056F87002M4641M0727R0688R0836J15998J37253K18051L10334L86704N39485
10046B661719Q47060J256641J590552J661702J509085J928141J418430l802323
10038I071007m099340j997755r70124n29859l31463k47959j69962j27175r8749
10029D98621o7463m8956l1977m0379l3331l6373k3397j0837m891j1232l6575J8330
10017A71540j4800l6714j4397k2078j8838j0194J3924K0001k342k8219l1150J936
$$ plain form
10005 28669 47527 32109 42346 35292 29140 30367 25227 26799 31329 27510 46037 64260 64011
9992 64011 68323 33662 20445 34586 23948 27135 14940 -5394 5365 21860 13462 11043 10882
9979 10882 -16740 4622 27812 19292 32539 46658 31784 10936 10154 15281 23429 21729 27163
9966 27163 52519 17040 -13949 -28932 12222 33251 33914 23567 14228 22452 22568 8573 -912
9953 -912 2719 24358 24443 21730 10651 -2495 -15203 -24723 -41527 -28971 -1756 -6402 -17355 -10658
9939 -10658 -2788 8677 19973 -8250 -18882 -17314 -1386 8493 36391 57207 60936 31635 27858
9926 27858 19138 33365 49858 38744 38387 18254 -10883 -25480 -22683 3936 38923 32371 23217
9913 23217 3400 -5485 7260 8687 -4203 -9275 -11263 -1393 -17217 738 7564 2353 8046
$$ packed form
10005B8669J8858j5418J0237p054o152J227n140J572M530l819J8527J8223k49
9992F4011M312l4661j3217J4141j0638L187j2195k0334J0759J6495q398k419j61
9979A0882k7622K1362K3190q520J3247J4119j4874k0848p82N127Q148j700N434
9966B7163K5356l5479l0989j4983M1154K1029O63j0347r339Q224J16j3995r485
9953i12L631K1639Q5k713j1079j3146j2708r520j6804J2556K7215m646j0953O697
9939a0658P870J1465J1296k8223j0632J568J5928R879K7898K0816L729k9301l777
9926B7858q720J4227J6493j1114l57k0133k9137j4597K797K6619L4987o552r154
9913B3217j9817q885J2745J427j2890n072j988R870j5824J7955O826n211N693
$$ plain form
9900 8046 21445 39975 24614 1476 23025 13745 23768 15869 22598 30608 29589 -846 -6090
9887 -6090 -2442 -19001 -29735 -12028 -1169 -1937 -155 -26513 -22634 8486 20920 10636 10006
9874 10006 19415 36974 48578 37372 7257 1721 11113 16245 15712 7395 -7761 -1545 6280 -18075
9860 -18075 -48549 -38112 -23528 -1534 -2277 -1960 -7495 -6989 -1519 20933 24207 11197 -14878 -32772
9846 -32772 -24229 -18226 -8392 -10613 -9565 -21934 -9830 1257 3978 -7577 -4220 1416 7302 3019
9832 3019 7583 15269 24340 8585 -441 -15076 -11900 -20117 -40527 -26864 -40440 -45386 -19512
9819 -19512 -13579 744 2836 15545 -4984 -4385 4003 -15661 -27312 -22232 -23478 -369 6562
9806 6562 -3382 -10278 -15911 -15406 10229 5018 4328 2620 -8305 -17055 -8500 -17937 -342 -3464 -26494
$$ packed form
9900H046J3399J8530j5361k3138K1549r280J0023p899O729Q010j019l0435n244
9887f090L648j6559j0734J7707J0859p68J782k6358L879L1120J2434j0284o30
9874A0006R409J7559J1604j1206l0115n536R392N132n33q317j5156O216P825k4355
9860a8075l0474J0437J4584K1994p43L17n535N06N470K2452L274j3010k6075j7894
9846c2772Q543O003R834k221J048j2369J2104J1087K721j1555L357N636N886m283
9832C019M564P686R071j5755r026j4635L176q217k0410J3663j3576m946K5874
9819a9512N933J4323K092J2709k0529N99Q388j9664j1651N080j246K3109O931
9806F562r944o896n633N05K5635n211o90j708j0925q750Q555r437J7595l122k3030
$$ plain form
9791 -26494 -21042 -9823 -12185 -7832 2719 -1075 -24376 -9260 7445 -11655 -27030 -27070 6464
9778 6464 14010 -7345 -16440 -1694 9236 18205 10784 9204 12433 -13667 -18825 -5492 6043
9765 6043 5595 15677 31699 68488 56444 38032 -374 -20216 -12396 2116 -7890 -39259 -51289
9752 -51289 -41529 -32750 -24240 -18522 14114 24890 34415 40812 10954 10569 28390 -2857 -18426
9739 -18426 -16820 -25073 -18944 6959 19127 26663 56 -22938 -15219 -55 8957 15592 9165
9726 9165 9788 19993 23488 14492 -1322 -154 -7021 1091 -6625 12984 25201 42032 58436 48251
9712 48251 29698 44147 30820 27674 5713 -28461 -44916 -45198 -22719 -24668 -31077 -9691 16055
9699 16055 27056 21927 32823 24694 10091 -1198 17223 23964 -12734 -29986 -10765 -13659 -25624
$$ packed form
9791b6494N452J1219k362M353J0551l794k3301J5116J6705j9100j5375m0L3534
9778F464P546k1355r095J4746J0930Q969p421j580L229k6100n158J3333J1535
9765F043m48J0082J6022L6789j2044j8412l8406j9842P820J4512j0006l1369j2030
9752e1289R760Q779Q510N718L2636J0776R525O397k9858l85J7821l1247j5569
9739a8426J606q253O129K5903J2168P536k6607k2994P719J5164R012O635o427
9726I165O23J0205L495q996j5814J168o867Q112p716J9609J2217J6831J6404j0185
9712D8251j8553J4449j3327l146k1961l4174j6455k82K2479j949o409K1386K5746
9699A6055J1001n129J0896q129j4603j1289J8421O741l6698j7252J9221k894j1965
$$ plain form
9686 -25624 -15977 3079 16249 27135 39848 47677 40844 11353 -16122 -12497 -518 787 13574
9673 13574 11516 9308 8482 -14929 -13292 -18438 -31445 -27838 -10860 1972 -7495 -13893 -2845 874
9659 874 16266 10024 -6177 15373 56532 58294 41769 36673 27478 16845 23655 35204 37009
9646 37009 53206 32326 25181 7972 38219 61140 42609 12495 16617 34838 40190 25354
9634 25354 35068 80989 101664 86435 57922 20142 2717 2793 13691 13846 21404 15226 3191
9621 3191 -3495 -8974 -40311 -42543 -15122 -740 -507 784 7439 5725 -14774 -26207 -28264 -41249
9607 -41249 -16644 -4936 5185 -2531 -1807 9052 6391 3486 -21176 -11888 1790 19911 42063
9594 42063 29219 513 -14703 -20741 18475 13677 9657 24669 15242 -14259 -10543 5027 10838
$$ packed form
9686b5624R647J9056J3170J0886J2713P829o833k9491k7475L625J1979J305J2787
9673A3574k058k208q26k3411J637n146j3007L607J6978J2832r467o398J1048L719
9659H74J5392o242j6201K1550M1159J762j6525n096r195j0633O810J1549J805
9646C7009J6197k0880p145j7209L0247K2921j8531l0114M122J8221N352j4836
9634B5354R714M5921K0675j5229k8513l7780j7425P6J0898J55P558o178j2035
9621C191o686n479l1337k232K7421J4382K33J291O655j714k0499j1433k057j2985
9607d1249K4605J1708J0121p716P24J0859k661k905k4662R288J3678J8121K2152
9594D2063j2844k8706j5216o038L9216m798m020J5012r427k9501L716J5570N811
$$ plain form
9581 10838 -7763 -9980 27383 47963 66844 22109 6911 15863 -3699 4800 11299 -3566 -3297
9568 -3297 27088 18788 8586 6073 19409 27042 17578 2834 -13574 -31446 -21168 -7397 -1550
9555 -1550 -11576 -14730 -8665 25739 39494 23097 25931 14506 -20518 -9746 -17352 -21597 -6718
9542 -6718 -14934 -15114 -2128 -10065 -12817 -14923 18318 26844 12867 11011 12745 -5050 -10813 -151
9528 -151 19863 26455 26724 15439 45305 51336 35808 23716 -196 -24329 -47640 -45781 -18136
9515 -18136 17937 68377 62456 62682 38589 33091 13316 -10766 13559 24811 45828 41670 38337
9502 38337 26311 20863 21865 14673 29086 26730 17304 22111 29374 35485 57929 55177 33909 20217
9488 20217 17189 15058 14392 11326 17045 14845 5831 -16374 -20312 -37999 -47667 -31452 -22496 -7813
$$ packed form
9581A0838j8601k217L7363K0580J8881m4735j5198Q952j9562Q499O499j4865K69
9568c297L0385q300j0202k513J3336P633r464j4744j6408j7872J0278J3771N847
9555a550j0026l154O065L4404J3755j6397K834j1425l5024J0772p606m245J4879
9542f718q216j80J2986p937k752k106L3241Q526j3977j856J734j7795n763J0662
9528a51K0014O592K69j1285K9866O031j5528j2092k3912k4133k3311J859K7645
9515a8136L6073N0440n921K26k4093n498j9775k4082K4325J1252K1017m158l333
9502C8337j2026n448J002p192J4413k356r426M807P263O111K2444k752k1268j3692
9488B0217l028k131o66l066N719k200r014k2205l938j7687r668J6215Q956J4683
$$ plain form
9474 -7813 12194 7567 36244 46352 51616 47412 6114 2881 2231 13909 14576 35013 63124 50876
9460 50876 26781 19339 -5057 -14440 -5465 7705 28212 33716 43939 31139 24513 46143 25227
9447 25227 13475 15100 10448 29621 44986 30436 8533 6282 -965 -6204 1549 7797 37169
9434 37169 51492 66479 59602 48817 48587 33971 51387 44033 39984 49944 66658 67102 72271 25130
9420 25130 -10785 1452 8690 3533 3453 -10357 -22908 -13387 15994 31857 41833 62075 57001
9407 57001 30804 43263 45143 22823 23027 23768 39221 47748 47279 34016 50390 58320 70683 78048
9393 78048 52927 39430 70481 74511 75937 68717 46058 32729 62284 73389 52913 44188 37236
9380 37236 28917 43133 69183 87673 99874 114765 109175 87997 75117 57562 66461 99344
$$ packed form
9474g813K0007m627K8677J0108N264m204m1298l233o50J1678O67K0437K8111j2248
9460E0876k4095p442k4396r383Q975J3170K0507N504J0223j2800o626K1630k0916
9447B5227j1752J625m652J9173J5365j4550k1903k251p247n239P753O248K9372
9434C7169J4323J4987o877j0785k30j4616J7416p354m049R960J6714M44N169m7141
9420B5130l5915J2237P238n157q0j3810j2551R521K9381J5863R976K0242n074
9407E7001k6197J2459J880k2320K04P41J5453Q527m69j3263J6374P930J2363P365
9393G8048k5121j3497L1051M030J426p220k2659j3329K9555J1105k0476q725o952
9380C7236q319J4216K6050J8490J2201J4891n590k1178j2880j7555Q899L2883
$$ plain form
9368 99344 115316 121336 119617 122392 127599 123373 136806 142938 109740 103300 76044 63670 82683
9355 82683 90092 93145 133528 143868 150600 154193 156431 171599 178638 186332 175475 178119 172094 178926
9341 178926 196064 187597 193490 185820 185394 209080 227381 238284 252686 262512 266899 245428 218345
9328 218345 237582 249347 258260 277080 284874 335377 356832 390525 415103 414703 418935 437954 469464
9315 469464 511421 538558 527150 530158 560271 597273 645461 695893 721022 734467 785761 858373
9303 858373 939435 1005209 1078221 1149203 1232913 1332597 1431219 1530872 1651946 1779564 1934541
9292 1934541 2097672 2260455 2418736 2592370 2788284 3003796 3235028 3477971 3729872 3960354
9282 3960354 4180900 4413485 4625099 4805556 4947148 5039567 5085358 5038428 4919181 4753973
$$ packed form
9368I9344J5972O020j719K775N207m226J3433O132l3198o440k7256j2374J9013
9355H2683P409L053M0383J0340O732L593K238J5168P039P694j0857K644o025O832
9341A78926J7138q467N893p670m26K3686J8301J0903J4402R826M387k1471k7083
9328B18345J9237J1765Q913J8820P794N0503K1455L3693K4578m00M232J9019L1510
9315D69464M1957K7137j1408L008L0113L7002M8188N0432K5129J3445N1294P2612
9303H58373Q1062O5774P3012P0982Q3710R9684R8622R9653J21074J27618J54977
9292A934541J63131J62783J58281J73634J95914K15512K31232K42943K51901K30482
9282C960354K20546K32585K11614J80457J41592R2419M5791m6930j19247j65208
$$ plain form
9272 4753973 4570388 4350696 4094207 3837432 3560064 3279439 3034753 2786864 2575324 2371200
9262 2371200 2174070 1995642 1833013 1704050 1587044 1469833 1361405 1252890 1167808 1076799
9252 1076799 998391 942527 871766 810190 768044 732119 699584 670718 649906 608011 544248
9241 544248 507521 484335 483860 462626 449336 436331 433772 429165 379564 337606 323216 341374
9229 341374 333291 291225 287171 276711 248667 223494 257509 254652 231901 225844 246879 236120
9217 236120 237767 239839 208507 175746 162431 169215 186958 209110 174020 161077 179575 156521
9205 156521 149652 146533 135909 126579 136811 124369 104294 102785 104074 105387 135170 135759 115630
9192 115630 109872 104660 114091 127915 131878 130775 131140 136007 102601 82464 97504 93588 88145 96824
$$ packed form
9272D753973j83585k19692k56489k56775k77368k80625k44686k47889k11540k04124
9262B371200j97130j78428j62629j28963j17006j17211j08428j08515q5082r1009
9252A076799p8408n5864p0761o1576m2146l5925l2535k8866k0812m1895o3763
9241E44248l6727k3186m75k1234j3290j3005k559m607m9601m1958j4390J8158
9229C41374q083m2066m054j0460k8044k5173L4015k857k2751o057K1035j0759
9217B36120J647K072l1332l2761j3315O784J7743K2152l5090j2943J8498k3054
9205A56521o869l119j0624r330J0232j2442k0075j509J289J313K9783N89k0129
9192A15630n758n212R431J3824L963j103L65M867l3406k0137J5040l916n443Q679
$$ plain form
9178 96824 102139 110595 97349 90206 58205 31170 27144 35900 51280 68620 68077 65648 72790 89471
9164 89471 69266 34381 24429 18141 18170 11983 15796 31929 52702 78973 84959 67666 70124 61359
9150 61359 60969 61148 56653 53265 60276 80759 71872 67671 70696 41084 49578 66401 66936 80872
9136 80872 67764 66923 86912 72677 49461 35723 39263 52223 44122 27486 20767 29223 48239
9123 48239 51243 51317 25701 31815 19586 14472 25397 34167 50751 47180 34767 53664 66016
9110 66016 73972 62393 64796 70927 56683 37033 7535 -8095 -41169 -59036 -36749 -22805
9098 -22805 20998 41169 44791 50402 26737 18536 33447 28686 30624 45400 26818 -24944 -47835
9085 -47835 -35898 -16212 -3741 22589 23890 37502 56430 73650 55779 40013 44300 37244
$$ packed form
9178I6824N315Q456j3246p143l2001k7035m026Q756J5380J7340n43k429P142J6681
9164H9471k0205l4885r952o288K9o187L813J6133K0773K6271N986j7293K458q765
9150F1359l90J79m495l388P011K0483q887m201L025k9612Q494J6823N35J3936
9136H0872j3108q41J9989j4235k3216j3738L540J2960q101j6636o719Q456J9016
9123D8239L004P4k5616O114j2229n114J0925Q770J6584l571j2413J8897J2352
9110F6016P956j1579K403O131j4244j9650k9498j5630l3074j7867K2287J3944
9098b2805M3803K0171L622N611k3665q201J4911m761J938J4776j8582n1762k2891
9085d7835J1937J9686J2471K6330J301J3612J8928J7220j7871j5766M287p056
$$ plain form
9073 37244 26524 44709 24233 27813 26122 25697 28385 22618 58159 76191 55661 49823 30215
9060 30215 21786 36738 28453 10941 4757 16465 15973 23749 8644 -13730 -1584 16609 821
9047 821 -8985 -4978 -17557 -18307 1367 6811 -1114 9375 24687 1000 5146 -14098 -11861 -4865
9033 -4865 -7423 12629 10762 14919 26377 29655 22318 18438 23687 43876 42834 37440 -1672 -38758
9019 -38758 -33948 -18177 11607 7960 1677 3617 10768 16164 15685 921 19036 1829 -12502
9006 -12502 -918 24956 9262 -8833 5714 15537 21182 8384 5244 -17809 -20520 -15159 -14034
8993 -14034 -8158 6351 -6695 -17155 -1323 -13583 -26186 -35625 -31476 -28305 -19986 15102 49107
8980 49107 45576 15287 10077 23947 14368 5656 -8302 -6257 -17916 -10066 15558 19740 8984
$$ packed form
9073C7244j0720J8185k0476L580j691m25K688n767L5541J8032k0530n838j9608
9060C0215q429J4952q285j7512o184J1708m92P776j5105k2374J2146J8193j5788
9047H21r806M007j2579p50J9674N444p925J0489J5312k3687M146j9244K237O996
9033d865k558K0052j867M157J1458L278p337l880N249K0189j042n394l9112l7086
9019c8758M810J5771K9784l647o283J940P151N396m79j4764J8115j7207j4331
9006a2502J1584K5874j5694j8095J4547R823N645j2798l140k3053k711N361J125
8993a4034N876J4509j3046j0460J5832j2260j2603r439M149L171Q319L5088L4005
8980D9107l531l0289n210J3870r579q712j3958K045j1659P850K5624M182j0756
$$ plain form
8967 8984 19825 28182 10383 -8615 -14867 -10511 13335 12960 -431 -7514 -1994 12701 17700 23735
8953 23735 30899 9307 2143 -165 2857 26317 11300 9475 27938 31583 -835 -24025 -20315
8940 -20315 -18989 -4181 5873 -2868 -11923 548 20495 24773 12718 12296 -8201 -3244 13341
8927 13341 6129 3455 4749 -11619 -10634 -1929 18006 14998 -126 -6969 -12505 -3362 -2352 15589
8913 15589 10338 -8975 2183 32590 21720 14636 10405 20093 25495 5391 6907 16011 19040
8900 19040 14112 12865 1202 14157 -4368 -5697 -15217 14100 35345 27122 23182 27288 46917
8887 46917 40563 6398 -35452 -44144 -56913 -55441 -46562 -45665 -37625 -26993 -17350 -2625 8201
8874 8201 39217 38028 31508 24142 17866 23305 50129 42354 16651 4326 -8458 -12432 3698
$$ packed form
8967H984J0841Q357j7799j8998o252M356K3846l75j3391p083N520J4695M999O035
8953B3735P164k1592p164k308L022K3460j5017j825J8463L645l2418k3190L710
8940b0315J326J4808J0054q741r055J2471J9947M278j2055m22k0497M957J6585
8927A3341p212k674J294j6368R85Q705J9935l008j5124o843n536R143J010J7941
8913A5589n251j9313J1158L0407j0870p084m231R688N402k0104J516R104L029
8900A9040m928j247j1663J2955j8525j329r520K9317K1245q223l940M106J9629
8887D6917o354l4165m1850q692j2769J472Q879Q97Q040J0632R643J4725J0826
8874H201L1016j189o520p366o276N439K6824p775k5703j2325j2784l974J6130
$$ plain form
8861 3698 -10852 -16099 -17419 -4385 9162 32869 15330 -351 177 -9088 -21241 -21645 -24011 -14303
8847 -14303 5635 -17578 -2235 24401 5945 -31532 -28329 -19800 17208 27808 2092 1532 -5765
8834 -5765 -10538 -7382 2426 24419 34312 24666 21226 12951 -10002 -17714 -8404 19841 16935 -8388
8820 -8388 -20433 -18854 -3089 18337 12327 5267 2728 -12818 10367 33731 13852 -16315 -35253
8807 -35253 -17379 -8334 3180 6745 -2979 -11022 -34235 11247 29644 34127 19497 16001 7791
8794 7791 -21592 -38448 -20777 7377 11603 2863 -4881 -4125 -5019 4350 24123 20420 46946 43453
8780 43453 9308 -22874 -23069 -132 22008 23357 -9239 -39846 -35718 -12388 21055 45989 50250
8767 50250 43988 22116 -1885 1299 -5636 1039 -4817 18338 43162 54755 43769 19368 -14696
$$ packed form
8861C698j4550n247j320J3034J3547K3707j7539j5681N28r265j2153m04k366R708
8847a4303J9938k3213J5343K6636j8456l7477L203Q529L7008J0600k5716n60p297
8834e765m773L156R808K1993R893r646l440q275k2953p712R310K8245k906k5323
8820h388j2045J579J5765K1426o010p060k539j5546K3185K3364j9879l0167j8938
8807c5253J7874R045J1514L565r724q043k3213M5482J8397M483j4630l496q210
8794G791k9383j6856J7671K8154M226q740p744P56q94R369J9773l703K6526l493
8780D3453l4145l2182j95K2937K2140J349l2596l0607M128K3330L3443K4934M261
8767E0250o262k1872k4001L184o935O675n856K3155K4824J1593j0986k4401l4064
$$ plain form
8754 -14696 -8928 -12114 527 -16115 -50722 -42613 -22751 -39039 -18834 -6099 -29265 -27945 -25697
8741 -25697 -11623 3481 8259 221 4392 5963 -6349 3100 2153 -3828 24169 40090 29707
8728 29707 27035 59671 56471 19378 25595 39598 27546 -382 -10461 8211 22206 -5740
8716 -5740 -32929 -33677 -24840 -31810 -19053 3293 23969 35655 28308 17827 1234 -6293 7933
8703 7933 26727 35526 38661 35602 39422 35788 -12596 -40332 -17092 -2711 9494 40880 48453
8690 48453 28827 15048 16684 2309 -4217 -20713 -41784 -19563 4623 -12650 -33548 -30909
8678 -30909 -17570 -25638 -5593 1249 27251 16054 16095 3728 2414 -21049 -13070 -3443 -9894 1464
8664 1464 23385 30275 14058 -11795 -2860 -7916 -30294 -30519 -10032 14545 23489 25589 39934
$$ packed form
8754a4696N768l186J2641j6642l4607Q109J9862j6288K0205J2735k3166J320K248
8741b5697J4074J5104M778q038M171J571j2312R449r47n981K7997J5921j0383
8728B9707k672L2636l200l7093O217J4003j2052k7928j0079J8672J3995k7946
8716e740k7189p48Q837o970J2757K2346K0676J1686p347j0481j6593p527J4226
8703G933J8794Q799L135l059L820l634m8384k7736K3240J4381J2205L1386P573
8690D8453j9626j3779J636j4375o526j6496k1071K2221K4186j7273k0898K639
8678c0909J3339q068K0045O842K6002j1197M1j2367j314k3463P979R627o451J1358
8664A464K1921O890j6217k5853Q935n056k2378k25K0487K4577Q944K100J4345
$$ plain form
8651 39934 39672 27980 18756 18651 38951 45123 39410 15901 25645 42911 27354 1727 9688 35530
8637 35530 45293 22370 -2670 -551 15757 21775 46921 45075 28816 32706 44931 36559 5712
8624 5712 12334 37327 54315 35865 30728 42966 43318 42977 37866 31367 21841 25249 50958 50257
8610 50257 30291 21390 37521 23022 6779 6398 33073 59400 52910 28510 24238 45369 56779
8597 56779 41743 27351 13992 42328 50903 74026 98269 106900 117176 122590 138999 168898
8585 168898 173608 163451 140583 116252 106132 110155 95008 83641 81629 58134 43547 48659
8573 48659 67784 56691 34371 49910 43504 33930 27640 18540 10880 17218 7946 -10369 -15224
8560 -15224 12753 26598 11870 1966 2941 6107 21321 46161 57504 58282 39665 27642 21023
$$ packed form
8651C9934k62j1692r224j05K0300O172n713k3509R744J7266j5557k5627P961K5842
8637C5530R763k2923k5040K119J6308O018K5146j846j6259L890J2225q372l0847
8624E712O622K4993J6988j8450n137J2238L52l41n111o499r526L408K5709p01
8610E0257j9966q901J6131j4499j6243l81K6675K6327o490k4400m272K1131J1410
8597E6779j5036j4392j3359K8336Q575K3123K4243Q631J0276N414J6409K9899
8585A68898M710j0157k2868k4331j0120M023j5147j1367k012k3495j4587N112
8573D8659J9125j1093k2320J5539o406r574o290r100p660O338r272j8315m855
8560a5224K7977J3845j4728r904R75L166J5214K4840J1343P78j8617j2023o619
$$ plain form
8547 21023 3264 -9047 -1547 24361 29431 27977 27908 12194 -25675 -26987 -22327 -9125 -1467 -2378
8533 -2378 3356 30916 36988 31036 18253 -775 -6841 -26871 -34790 -17694 13978 43939 38571
8520 38571 36413 20316 21091 41328 43268 18842 10792 794 4342 -261 -13619 -34828 -38028 5987
8506 5987 44441 34505 24284 43962 31056 36760 46234 52963 39143 3273 -15983 3881 19177
8493 19177 15557 44473 41061 32844 9472 21524 20990 23883 13574 16360 24851 30496 30309 22136
8479 22136 5081 -888 42586 78137 69810 69136 51257 30693 4325 -2691 14341 31832 37726
8466 37726 40013 39049 33069 40103 47496 40273 35518 36755 40882 44152 46987 46553 41394 46648 73866
8451 73866 79408 82487 94185 95008 81869 70609 57803 50487 53830 77194 67239 49197 54785
$$ packed form
8547B1023j7759j2311P500K5908N070j454o9j5714l7869j312M660J3202P658r11
8533b378N734K7560O072n952j2783j9028o066k0030p919J7096L1672K9961n368
8520C8571k158j6097P75K0237J940k4426q050r998L548m603j3358k1209l200M4015
8506E987L8454r936j0221J9678j2906N704R474O729j3820l5870j9256J9864J5296
8493A9177l620K8916l412q217k3372J2052n34K893j0309K786Q491N645j87q173
8479B2136j7055n969M3474L5551q327o74j7879k0564k6368p016J7032J7491N894
8466C7726K287r64n980P034P393p223m755J237M127L270K835m34n159N254K7218
8451G3866N542L079J1698Q23j3139j1260j2806p316L343K3364r955j8042N588
$$ plain form
8438 54785 69875 57218 74338 77295 65669 51289 58092 60849 34248 59449 77493 58696
8426 58696 49616 41568 47399 70715 80955 80139 70069 51590 50890 63293 72140 71669 88402 51685
8412 51685 54173 73552 87234 97516 68976 57795 58609 71844 71554 58295 57263 58691 52123
8399 52123 30497 14927 19728 37751 73376 87301 43097 28505 47208 71524 71716 64378 70663
8386 70663 61746 19163 18562 36137 43380 39880 32356 32075 48409 58049 74332 81493 54091 45534
8372 45534 24384 4717 21784 40104 37745 28549 29536 31269 48254 58167 57291 35639 -24
8359 -24 -5710 16134 22098 18695 29603 24447 22594 37979 35213 49097 73867 62464 36386 14588
8345 14588 -26011 -22453 -18216 -14510 -3199 -23887 -13727 20155 43592 38124 32840 22910 22500
$$ packed form
8438E4785J5090j2657J7120K957j1626j4380O803K757k6601K5201J8044j8797
8426E8696r080q048N831K3316J0240q16j0070j8479p00J2403Q847m71J6733l6717
8412E1685K488J9379J3682J0282k8540j1181Q14J3235k90j3259j032J428o568
8399E2123k1626j5570M801J8023L5625J3925m4204j4592J8703K4316J92p338O285
8386G0663q917m2583o01J7575P243l500p524k81J6334R640J6283P161k7402q557
8372D5534k1150j9667J7067J8320k359r196R87J733J6985R913q76k1652l5663
8359b4n686K1844N964l403J0908n156j853J5385k766J3884K4770j1403k6078k1798
8345A4588m0599L558M237L706J1311k0688J0160L3882K3437n468n284r930m10
$$ plain form
8332 22500 30936 40641 46978 28803 17651 -6340 -7635 -19203 -28155 -23915 2501 24780 18674
8319 18674 8278 7956 -10233 3372 23897 25652 9376 5801 -4596 6329 38055 25174 25274
8306 25274 18132 629 -1085 17447 27532 23949 39038 51360 44542 37192 16016 33580 60323
8293 60323 55704 33651 26225 30176 21320 -5916 -8318 13614 16910 29309 24306 17053 4747
8280 4747 -6649 5860 7183 22746 15338 11937 21449 15267 -5212 -16385 17072 26296 4259
8267 4259 -4944 -7300 -16669 4727 13013 -10471 -8358 -7717 6309 22680 18085 3783 23340 54308
8253 54308 54451 47729 39928 44285 29010 18324 13159 -1862 -23794 -47955 -36859 -27324 -14902
8240 -14902 -4773 2915 17966 15246 10148 -18898 -26472 -27668 -42768 -40632 -32150 -5632 12909
$$ packed form
8332B2500Q436R705O337j8175j1152k3991j295j1568q952M240K6416K2279o106
8319A8674j0396l22j8189J3605K0525J755j6276l575j0397J0925L1726j2881J00
8306B5274p142j7503j714J8532J0085l583J5089J2322o818p350k1176J7564K6743
8293F0323m619k2053p426L951q856k7236k402K1932L296J2399n003p253j2306
8280D747j1396J2509J323J5563p408l401R512o182k0479j1173L3457R224k2037
8267D259r203k356r369K1396Q286k3484K113O41J4026J6371m595j4302J9557L0968
8253E4308J43o722p801M357j5275j0686n165j5021k1932k4161J1096R535J2422
8240a4902J0129P688J5051k720n098k9046p574j196j5100K136Q482K6518J8541
$$ plain form
8227 12909 14440 -7888 -12977 -19225 -22395 -24136 -30441 -48014 -49858 -39272 -62125 -54645 -29379
8214 -29379 -12572 -28683 -33240 -28010 -36719 -54355 -30151 -21529 -15874 -6408 -21 3082 -5941 -18585
8200 -18585 -9646 -17649 -3316 16857 4296 -10252 14457 6784 -12518 -16581 -2125 11754 2733
8187 2733 -3125 -29350 -38460 -31491 -3255 32858 23495 -6741 5816 2058 -2940 -1923 -4132 -9814
8173 -9814 -355 5549 6092 7044 4871 -2884 2432 11662 12734 23118 37624 5149 30892 58317
8159 58317 52761 21603 22951 3270 -21323 -16090 -14749 -17041 -28514 -438 27028 10459 -10781
8146 -10781 -26476 -10222 3670 12827 4839 9426 30635 11125 -13417 3903 18916 17214 26511
8133 26511 23831 5507 5463 4369 16489 18538 3284 -6024 -17321 -10044 -3605 15224 19834 12887
$$ packed form
8227A2909J531k2328n089o248l170j741o305j7573j844J0586k2853P480K5266
8214b9379J6807j6111m557N230q709j7636K4204Q622N655R466O387L103r023j2644
8200a8585Q939q003J4333K0173j2561j4548K4709p673j9302m063J4456J3879r021
8187B733n858k6225r110O969K8236L6113r363l0236J2557l758m998J017k209n682
8173i814R459N904N43R52k173p755N316R230J072J0384J4506l2475K5743K7425
8159E8317n556l1158J348j9681k4593N233J341k292j1473K8076K7466j6569k1240
8146a0781j5695J6254J3892R157p988M587K1209j9510k4542J7320J5013j702R297
8133B6511k680j8324m4j094J2120K049j5254r308j1297P277O439J8829M610o947
$$ plain form
8119 12887 18005 4813 682 -3260 -6602 18680 21120 21132 13716 9116 27645 30565 10999 -7613
8105 -7613 -258 22998 13312 -5335 2833 4144 -1722 -5628 -28408 -13616 -4655 5173 11316 19754
8091 19754 31770 24074 17111 34374 48140 27370 4859 11070 -1566 -24328 -17559 -6121 -3231
8078 -3231 4801 7938 2800 21672 35125 24303 11337 -285 -16152 -12519 -8708 -18089 -26600
8065 -26600 -6619 1007 5991 5027 18565 -1298 -14987 -51137 -47639 -23319 -18493 -12981 -13208 -7158
8051 -7158 -11559 -31877 -44103 -38077 -40578 -37339 -24213 -26134 -22019 -9070 -11945 11536 17863 21537
8037 21537 46240 54973 35610 21574 -8103 -6309 -14273 -42986 -22220 -15145 10881 11064 -8368
8024 -8368 -28632 -44788 -42114 -47089 -53062 -40236 -26481 9823 16356 9651 -18190 -16939 -7123
$$ packed form
8119A2887N118j3192m131l942l342K5282K440J2p416m600J8529K920j9566j8612
8105g613P355K3256r686j8647Q168J311n866l906k2780J4792Q961R828O143Q438
8091A9754J2016p696o963J7263J3766k0770k2511O211j2636k2762O769J1438K890
8078c231Q032L137n138J8872J3453j0822j2966j1622j5867L633L811r381q511
8065b6600J9981P626M984r64J3538j9863j3689l6150L498K4320M826N512k27O050
8051g158m401k0318j2226O026k501L239J3126j921M115J2949k875K3481O327L674
8037B1537K4703Q733j9363j4036k9677J794p964k8713K0766P075K6026J83j9432
8024h368k0264j6156K674m975n973J2826J3755L6304O533o705k7841J251R816
$$ plain form
8011 -7123 -12848 -14830 -14060 9899 18765 32452 24226 7182 -11666 -9549 -10930 8662 16852 18935
7997 18935 18247 27046 29943 11432 1518 7846 13863 53482 72518 60338 50418 42562 47397 52721
7983 52721 40410 27207 27766 27005 18263 1051 5581 21049 25053 19205 46247 65632 51011
7970 51011 7187 -10449 -21442 -24066 -11570 10833 3854 8144 16746 12710 -19017 -37039 -36543
7957 -36543 -20381 2487 -7152 2491 10278 18688 29106 27112 22146 8543 -5357 -6819 11067
7944 11067 30822 30276 30780 36381 26949 23455 18993 6496 -3062 15522 8859 10883 14002 4248
7930 4248 -2116 -132 -391 -6430 -6655 -11824 -10865 -3532 -3283 21062 6626 4645 28769 49514 24143
7915 24143 7745 21117 26518 -944 -21300 1618 10825 20872 35333 39277 17828 6300
$$ packed form
8011g123n725j982P70K3959Q866J3687q226j7044j8848K117j381J9592Q190K083
7997A8935o88Q799K897j8511r914O328O017L9619J9036j2180r920p856M835N324
7983E2721j2311j3203N59p61q742j7212M530J5468M004n848K7042J9385j4621
7970E1011m3824j7636j0993k624J2496K2403o979M290Q602m036l1727j8022M96
7957c6543J6162K2868r639R643P787Q410J0418j994m966j3603j3900j462J7886
7944A1067J9755n46N04N601r432l494m462j2497r558J8584o663K024L119r754
7930D248o364J984k59o039k25n169R59P333K49K4345j4436j981K4124K0745k5371
7915B4143j6398J3372N401k7462k0356K2918R207J0047J4461L944k1449j1528
$$ plain form
7903 6300 -1691 -10443 -9383 3953 -6911 -6751 3996 -4410 1220 11067 15450 446 6904 14064
7889 14064 13995 11592 -395 2332 11444 137 -8861 -12861 -1231 678 6828 -18592 -20223 -16169
7875 -16169 -19375 2284 -11407 -19899 -21792 -15122 -39663 -41306 -18365 -452 -1199 -29474 -19820
7862 -19820 -3149 -14216 -20804 -38302 -20006 8491 -396 -2500 -846 -3791 5467 357 -9501
7849 -9501 2800 32274 37415 43247 45002 10383 5560 -15937 -23158 -21603 -9922 -4008 2384 -14208
7835 -14208 -17345 918 5271 -13787 -4933 -12677 -9512 -3831 -24491 -28484 -14207 -3630 -22969
7822 -22969 -29379 -39601 -17143 10847 6584 12754 -1381 13389 2679 -7975 -18936 -21187 -26811
7809 -26811 -10124 536 -35536 -62611 -55335 -37134 -20427 -15301 -24097 -25878 1157 10864 -2052
$$ packed form
7903F300p991q752J060J3336j0864J60J0747q406N630R847M383j5004O458P160
7889A4064o9k403j1987K727R112j1307q998m000J1630J909O150k5420j631M054
7875a6169l206K1659j3691q492j893O670k4541j643K2941J7913p47k8275R654
7862a9820J6671j1067o588j7498J8296K8497q887k104J654k945R258n110r858
7849i501J2301K9474N141N832J755l4619m823k1497p221J555J1681N914O392j6592
7835a4208l137J8263M353j9058Q854p744L165N681k0660l993J4277J0577j9339
7822b2969o410j0222K2458K7990m263O170j4135J4770j0710j0654j0961k251n624
7809b6811J6687J0660l6072k7075P276J8201J6707N126q796j781K7035R707j2916
$$ plain form
7796 -2052 -6870 28565 41259 18483 2718 3756 -7141 -17918 -6340 666 -21010 -29223 -34044
7783 -34044 -26367 -13421 -1350 15068 20846 18628 -8374 -22621 -25386 -17755 -15679 -5605 -5416
7770 -5416 3611 -5873 -4154 -6744 -33826 -40404 -7720 5842 4529 -4443 -15100 -27597 -19316 -10485
7756 -10485 -2407 5219 -6156 -4088 -14496 -19737 -17262 4220 24297 43200 17447 4125 9833
7743 9833 28078 50004 13234 3594 -19084 2289 -2080 -20892 -11557 -136 -12090 -5097 -14467
7730 -14467 6766 8273 -37992 -25029 18413 -6469 -23565 -31179 -20862 1899 27611 8829
7718 8829 -26947 -15500 4062 805 11314 6413 8624 -12109 -10152 -845 -20092 -57 20845
7705 20845 30680 31524 550 -4143 -31947 -30753 -21560 -26490 -22619 6184 19050 13155 3056 7000
$$ packed form
7796b052m818L5435J2694k2776j5765J038j0897j0777J1578P006k1676q213m821
7783c4044P677J2946J2071J6418N778k218k7002j4247k765P631K076J0074J89
7770e416R027r484J719k590k7082o578L2684J3562j313q972j0657j2497Q281Q831
7756a0485Q078P626j1375K068j0408n241K475K1482K0077J8903k5753j3322N708
7743I833J8245K1926l6770r640k2678K1373m369j8812R335J1421j1954O993r370
7730a4467K1233J507m6265J2963M3442k4882j7096p614J0317K2761K5712j8782
7718H829l5776J1447J9562l257J0509m901K211k0733J957R307j9247K0035K0902
7705B0845R835Q44l0974m693k7804J194R193m930L871K8803J2866n895j0099L944
$$ plain form
7691 7000 2140 -10486 -18714 259 -13251 -28577 -15217 -11121 636 13656 17003 2068 13009
7678 13009 30155 29361 41562 63169 45108 -423 -7893 14294 47949 50272 9322 -8670 1778
7665 1778 2523 30935 52076 39255 29217 36140 48682 34692 32207 25319 21403 16802 15335 21703
7651 21703 17670 7619 21929 41340 51819 41737 49266 43176 25089 36482 49152 43529 41384
7638 41384 19203 13880 10714 13773 9912 1063 17214 9091 27612 61227 48161 12560 16385
7625 16385 17881 19230 13138 3849 12703 26543 16117 10214 6636 17669 18203 12873 26109 36430
7611 36430 45321 32185 -11458 -25266 -19056 -42090 -37617 -35922 -41358 -37444 -21955 -13546 -19512
7598 -19512 -12112 -11316 -27512 -21243 3261 5502 -6114 -25372 -21374 4242 -6579 -30340 -24395
$$ packed form
7691G000m860j2626q228J8973j3510j5326J3360M096J1757J3020L347j4935J0941
7678A3009J7146p94J2201K1607j8061m5531p470K2187L3655K323m0950j7992J0448
7665A778P45K8412K1141j2821j0038O923J2542j3990k485o888l916m601j467O368
7651B1703m033j0051J4310J9411J0479j0082P529o090j8087J1393J2670n623k145
7638D1384k2181n323l166L059l861q849J6151q123J8521L3615j3066l5601L825
7625A6385J496J349o092r289Q854J3840j0426n903l578J1033N34n330J3236J0321
7611C6430Q891j3136m3643j3808O210k3034M473J695n436L914J5489Q409n966
7598a9512P400P96j6196O269K4504K241j1616j9258L998K5616j0821k3761N945
$$ plain form
7585 -24395 3140 842 -10391 7754 9996 3823 -284 -13536 -17418 9829 25141 14825 3258
7572 3258 -14130 -3761 -2832 2420 23174 8469 -28057 -14456 -11957 -19439 -3383 6724 13147
7559 13147 -5180 -5035 -18203 -42449 -18109 10936 -11444 -6617 -4166 -16897 -16795 5454 12275
7546 12275 -6625 -7224 -13488 16413 37668 7072 -751 17512 6925 -3149 -2776 -7408 -11002
7533 -11002 -19144 -21721 -27080 -26011 -17974 -32160 -39384 -16317 -7226 946 5800 3106 8358 14320
7519 14320 14978 15781 -6987 -25266 -14785 7734 10825 23709 -4728 -37766 -29618 -26954 -18850
7506 -18850 -26523 -39797 -12810 -9904 -15737 -9150 11762 20513 -3097 4145 -11885 -12528 5876
7493 5876 16296 2633 -10303 -17260 -18237 -27374 -35858 -23626 -20179 -9048 -7684 -3965 29581 40768
$$ packed form
7585b4395K7535k298j1233J8145K242o173m107j3252l882K7247J5312j0316j1567
7572C258j7388J0369R29N252K0754j4705l6526J3601K499p482J6056J0107O423
7559A3147j8327J45j3168k4246K4340K9045k2380M827K451j2731J02K2249O821
7546A2275j8900n99o264K9901K1255l0596p823J8263j0587j0074L73m632l594
7533a1002q142k577n359J069Q037j4186p224K3067R091Q172M854k694N252N962
7519A4320O58Q03k2768j8279J0481K2519L091J2884k8437l3038Q148K664Q104
7506a8850p673j3274K6987K906n833O587K0912Q751k3610P242j6030o43J8404
7493E876J0420j3663j2936o957r77r137q484J2232L447J1131J364L719L3546J1187
$$ plain form
7479 40768 33180 20592 19524 16093 16294 33971 21728 5746 2955 -2684 -9582 -21252 -32917
7466 -32917 -23946 -20685 -6964 -8763 -21717 -19390 -16509 -21503 -21698 -22237 -22939 -29134 -34820 -63556 -64197
7451 -64197 -41150 -11573 11416 11987 14223 32871 15505 4312 -11749 -10723 11955 11898 17549
7438 17549 14916 5665 9830 14399 16280 37079 25572 22945 8635 -13201 -13773 -3533 11306
7425 11306 12608 13358 20098 22640 28036 33651 24456 -766 -7484 -3057 -251 7096 24414 49837
7411 49837 23799 -16826 -28569 -7387 -12817 -22970 -32182 -35057 -24930 -33421 -45829 -34429 -26180
7398 -26180 -19988 -31979 -35936 -14796 -3260 1404 -4643 -11123 5970 29905 36426 45263 24058
7385 24058 -14828 -17010 -27236 -15155 -8226 50 10808 5561 -15559 -34598 -23490 -28661 -13666
$$ packed form
7479D0768p588j2588j068l431K01J7677j2243j5982k791n639o898j1670j1665
7466c2917Q971L261J3721j799j2954K327K881m994j95n39p02o195n686k8736o41
7451f4197K3047K9577K2989N71K236J8648j7366j1193j6061J026K2678n7N651
7438A7549k633r251M165M569J881K0799j1507k627j4310k1836n72J0240J4839
7425A1306J302P50O740K542N396N615r195k5222o718M427K806P347J7318K5423
7411D9837k6038m0625j1743K1182n430j0153r212k875J0127q491j2408J1400Q249
7398b6180O192j1991l957K1140J1536M664o047o480J7093K3935O521Q837k1205
7385B4058l8886k182j0226J2081O929Q276J0758n247k1120j9039J1108n171J4995
$$ plain form
7372 -13666 7941 6925 -2838 4688 6711 -15354 -21029 -3115 -743 3515 3734 1957 -4680 -23061
7358 -23061 -51059 -40896 -19656 -10850 -18863 -16750 -22756 -9265 -11259 2068 -5985 -35918 -56095
7345 -56095 -33020 -10801 -18286 -20029 -6071 -16175 -6350 -7879 3801 7541 -17364 -6901 9936
7332 9936 -9003 -19043 -12024 -20990 -23693 -13604 2624 1939 -10073 -12508 -6382 13118 32356
7319 32356 42300 9971 -18122 -27406 -51005 -37338 -45157 -41533 -29450 -29802 -15323 8802 -5614
7306 -5614 -25525 -38478 -34845 -21812 2492 23044 12212 6501 10236 3135 -10836 -4314 -12659
7293 -12659 -27340 -23176 -22045 -29103 -32311 -49214 -41360 -26573 -25557 -10878 -25010 -14418 16381
7280 16381 37375 33563 11337 14261 19291 -4769 4256 16990 17683 22511 -805 21157 51682
$$ packed form
7372a3666K1607j016r763P526K023k2065n675J7914K372M258K19j777o637j8381
7358b3061k7998J0163K1240Q806q013K113o006J3491j994J3327q053k9933k0177
7345e6095K3075K2219p485j743J3958j0104R825j529J1680L740k4905J0463J6837
7332I936j8939j0040P019q966k703J0089J6228o85j2012k435O126J9500J9238
7319C2356R944l2329k8093r284k3599J3667p819L624J2083l52J4479K4125j4416
7306e614j9911j2953L633J3033K4304K0552j0832n711L735p101j3971O522q345
7293a2659j4681M164J131p058l208j6903P854J4787J016J4679j4132J0592L0799
7280A6381K0994l812k2226K924N030k4060R025J2734O93M828k3316K1962L0525
$$ plain form
7267 51682 45507 44016 11629 -19076 -37739 -18151 -52361 -74977 -27942 -10726 -5342 28444
7255 28444 48576 34230 339 -27757 -40185 -42644 -23706 -40343 -42933 -12435 -5066 -11485 -15934
7242 -15934 -6322 -10765 -13654 -16543 -8867 3302 -11371 -26381 -7976 3690 6023 -4706 -511
7229 -511 -14908 -24133 -20352 -25435 -23323 -2474 -5983 -3251 14223 2319 8938 9875 -3182 -15185
7215 -15185 -11994 2983 6590 8135 -1337 -14405 -5113 11053 -79 -12950 6616 14325 -14050
7202 -14050 -37897 -35081 -25986 -14190 -624 -4654 -452 23220 15224 -2796 4423 -8282 -26198
7189 -26198 -31027 -18234 -9541 -27635 -26876 -24967 -1651 4071 7365 19608 10598 -38122 -47639 -31189
7175 -31189 -51702 -38572 -21903 -3786 -9678 -15478 -14207 -7914 -11364 2233 15349 19950 4309
$$ packed form
7267E1682o175j491l2387l0705j8663J9588l4210k2616M7035J7216N384L3786
7255B8444K0132j4346l3891k8096j2428k459J8938j6637k590L0498P369o419m449
7242a5934R612m443k889k889P676J2169j4673j5010J8405J1666K333j0729M195
7229e11j4397r225L781n083K112K0849l509K732J7474j1904O619R37j3057j2003
7215a5185L191J4977L607J545r472j3068R292J6166j1132j2871J9566P709k8375
7202a4050k3847K816R095J1796J3566m030M202K3672p996j8020P219j2705j7916
7189b6198m829J2793Q693j8094P59J909K3316N722L294J2243r010m8720r517J6450
7175c1189k0513J3130J6669J8117n892n800J271O293l450J3597J3116M601j5641
$$ plain form
7162 4309 10843 7963 18947 35352 49310 49609 45936 49638 51252 46400 55617 46395 27553 39083
7148 39083 45189 13471 6095 1669 -10552 -19017 -25409 -17261 1302 -17607 -23812 -2720 10531
7135 10531 7649 7055 34475 30528 29614 30662 28154 15365 7027 -3875 -15108 -20582 -16416 12987
7121 12987 28247 13178 -9963 -3974 -18591 -21202 -7943 20137 23090 6145 2273 5906 -6875
7108 -6875 -12648 -792 8797 10606 14353 5636 20660 43066 36313 18329 16221 -12088 -13306 -9054
7094 -9054 -624 4128 8622 16138 6906 -13366 -2350 -221 -19820 -38990 -29208 -17717 -25684 -12212
7080 -12212 4737 -19770 -35158 -10049 -9941 1153 17700 30170 -1474 -42936 -45926 -20247
7068 -20247 -16563 -13349 -3415 -16376 -22504 -41009 -60654 -61015 -41550 -47373 -41115 -34232 -37931 -161
$$ packed form
7162D309O534k880J0984J6405J3958K99l673L702J614m852R217r222j8842J1530
7148C9083O106l1718p376m426j2221q465o392Q148J8563j8909o205K1092J3251
7135A0531k882n94K7420l947r14J048k508j2789q338j0902j1233n474M166K9403
7121A2987J5260j5069k3141N989j4617k611J3259K8080K953j6945l872L633j2781
7108f875n773J1856R589J809L747q717J5024K2406o753j7984k108k8309j218M252
7094i054Q430M752M494P516r232k0272J1016K129j9599j9170R782J1491p967J3472
7080a2212J6949k4507j5388K5109J08J1094J6547J2470l1644m1462k990K5679
7068b0247L684L214R934j2961o128j8505j9645l61J9465n823O258O883l699L7770
$$ plain form
7054 -161 29695 24112 -7889 -20885 -8856 7144 4423 -4600 -5454 -25336 -32376 -20221 -28400 -27268
7040 -27268 -22646 -22318 -5470 -1932 25605 -10331 4713 24752 -7180 -16735 -12512 -18703 -37478
7027 -37478 -11508 5590 11654 4281 -2097 -3146 -20528 8177 16774 9874 -6346 12787 35474
7014 35474 47678 31105 18645 9762 -12946 -23737 -28240 -28245 17066 23720 10229 7057 18038
7001 18038 3500 -6649 -5106 -4820 19748 25139 17079 23901 -6986 2511 9367 8136 -1420 798
6987 798 2535 11697 -9790 -27207 -36862 -42775 -53001 -36266 -19652 -12459 -8701 -15275 -17656 -4008
6973 -4008 14774 49820 32757 7547 -8522 -13230 -8948 -5092 -28964 -30967 -23675 -19265 -26158
6960 -26158 -43202 -30118 -5297 -7126 -18477 -10726 2469 -18595 -22653 -30822 -31477 -19138 -20369
$$ packed form
7054a61K9856n583l2001j2996J2029J6000k721r023q54j9882p040J2155q179J132
7040b7268M622L28J6848L538K7537l5936J5044K0039l1932r555M223o191j8775
7027c7478K5970J7098O064p373o378j049j7382K8705Q597o900j6220J9133K2687
7014C5474J2204j6573j2460q883k2708j0791m503nM5311O654j3491l172J0981
7001A8038j4538j0149J543K86K4568N391q060O822l0887R497O856j231r556K218
6987G98J737R162k1487j7417r655n913j0226J6735J6614P193L758o574k381J3648
6973d008J8782L5046j7063k5210j6069m708M282L856k3872k003P292M410o893
6960b6158j7044J3084K4821j829j1351P751J3195k1064m058q169o55J2339j231
$$ plain form
6947 -20369 -25648 -39221 -33726 -3060 1871 22069 36543 33846 25063 10856 -9165 -15916 -41594
6934 -41594 -29131 -21211 -29583 5401 28601 10509 -14467 -21444 -11044 13946 -6815 -27258
6922 -27258 -16360 -6679 -10988 -21623 -24884 -41182 -61443 -65957 -43080 -13740 -10451 -18992 -27535
6909 -27535 -30272 -23431 3032 2842 -13795 -14049 -43461 -64572 -37824 -23453 -40529 -43105 -21236
6896 -21236 -21203 -31145 -40651 -25117 -16275 -45338 -44669 -25385 -7446 -3397 -9118 7825 23671 16093
6882 16093 -1100 -17602 -4352 14640 38322 31528 206 3302 20322 21490 16154 2978 -14731
6869 -14731 -2453 -14621 -15155 12808 17191 1936 -6963 -18575 -22984 -15587 -19667 -27522 -14691
6856 -14691 -9814 12393 28982 27820 17576 -14010 -32082 -24528 -42560 -25654 -13624 -16661 -36315
$$ packed form
6947b0369n279j3573N495L0666M931K0198J4474k697q783j4207k0021o751k5678
6934d1594J2463P920q372L4984K3200j8092k4976o977J0400K4990k0761k0443
6922b7258J0898R681m309j0635l261j6298k0261m514K2877K9340L289q541q543
6909b7535k737O841K6463j90j6637k54k9412k1111K6748J4371j7076k576K1869
6896b1236L3r942r506J5534Q842k9063O69J9284J7939M049n721J6943J5846p578
6882A6093j7193j6502J3250J8992K3682o794l1322L096J7020J168n336j3176j7709
6869a4731J2278j2168n34K7963M383j5255q899j1612m409P397m080p855J2831
6856a4691M877K2207J6589j162j0244l1586j8072P554j8032J6906J2030l037j9654
$$ plain form
6843 -36315 -44050 -23857 6438 14196 16715 1924 10669 6584 -1734 7105 -6319 -2780 4185 16314
6829 16314 7075 14376 22656 18449 14504 36118 27597 28448 26379 32310 41674 23365 15130 11815
6815 11815 33095 46747 41046 10801 -1543 8471 -6108 -30580 -21482 -2574 -16307 -31250
6803 -31250 -47024 -36383 -30586 -25145 -23363 -32710 -24220 -23800 -26796 -26588 -24928 -41125 -50933 -40931
6789 -40931 -30628 -38156 -33292 -28486 -41301 -53499 -49858 -17177 -7434 4434 16712 13220 -12454
6776 -12454 -30072 -46954 -38144 -18913 -5610 -14824 -27565 -33635 -22747 -2537 3864 -7812 -19029
6763 -19029 -20581 -43041 -30147 -17310 -9829 13617 29353 27388 -2438 -12054 -9996 4902 8266
6750 8266 9419 22423 13394 -4093 -12286 -1311 17045 28169 15806 9556 8117 4969 6386
$$ packed form
6843c6315p735K0193L0295P758K519j4791Q745m085q318Q839j3424L539O965J2129
6829A6314r239P301Q280m207l945K1614q521Q51k069N931R364j8309q235l315
6815A1815K1280J3652n701l0245j2344J0014j4579k4472R098J8908j3733j4943
6803c1250j5774J0641N797N441J782r347Q490M20k996K08J660j6197r808J0002
6789d0931J0303p528M864M806j2815j2198L641L2681R743J1868J2278l492k5674
6776a2454j7618j6882Q810J9231J3303r214j2741o070J0888K0210O401j1676j1217
6763a9029j552k2460J2894J2837P481K3446J5736j965k9826r616K058J4898L364
6750H266J153J3004r029j7487q193J0975J8356J1124j2363o250j439l148J417
$$ plain form
6737 6386 13745 -2348 6571 -6751 -14706 -15789 -19337 -29501 1045 7794 -5034 -7433 -15592 -9885
$$ packed form
6737F386P359j6093Q919j3322p955j083l548j0164L0546O749j2828k399q159N707
$$ [...]
##END NTUPLES=NMR SPECTRUM
##END=
