##TITLE=Analysis number 325571
Compound Code cc 60626
Book Reference 486/94
Project Code adrs
Chemist Name simons
##JCAMPDX= 6.0         $$ Bruker NMR JCAMP-DX V2.0
##DATA TYPE= NMR SPECTRUM
##DATA CLASS= NTUPLES
##ORIGIN= Bruker BioSpin GmbH
##OWNER= nmr
$$ XWIN-NMR		Version 3.5
$$ Fri Jan  5 09:22:26 2007 GMT Standard Time (UT+0h)  MAYBRIDGE\nmr@NMR_250MHZ
##.OBSERVE FREQUENCY= 250.131544655141
##.OBSERVE NUCLEUS= ^1H
##.ACQUISITION MODE= SIMULTANEOUS (DQD)
##.ACQUISITION SCHEME= undefined
##.AVERAGES= 16
##.DIGITISER RES= 18
##SPECTROMETER/DATA SYSTEM= dpx250
##.PULSE SEQUENCE= zg30
##.SOLVENT NAME= CDCl3
##.SHIFT REFERENCE= (INTERNAL, CDCl3, 0, 16.5197)
##AUDIT TRAIL= $$ (NUMBER, WHEN, WHO, WHERE, WHAT)
$$ ##TITLE= Audit trail, XWIN-NMR		Version 3.5
$$ ##JCAMPDX= 5.01
$$ ##ORIGIN= Bruker BioSpin GmbH
$$ ##OWNER= nmr
$$ C:\u/data/dgb/nmr/ADRS/340/pdata/1/auditp.txt
$$ ##AUDIT TRAIL=  $$ (NUMBER, WHEN, WHO, WHERE, WHAT)
(   1,<2007-01-05 09:22:00.43 +000>,<MAYBRIDGE\nmr>,<NMR_250MHZ>,
      <created by zg, POWCHK disabled, PULCHK disabled
       configuration hash MD5:
       49 4B E0 1D 92 C2 6B 37 9F E6 65 BC 52 41 86 1D
       data hash MD5: 64K
       B5 56 81 0C 46 4F 9E 6C 23 88 DE F6 42 FE 4B 4E>)
(   2,<2007-01-05 09:22:15.32 +000>,<MAYBRIDGE\nmr>,<NMR_250MHZ>,
      <Start of raw data processing
       ef LB = 0.3 FT_mod = 6 PKNL = 1 SI = 32K 
       data hash MD5: 32K
       A3 93 BA CE 79 90 59 09 80 2C 3E 91 E4 F8 ED 71>)
(   3,<2007-01-05 09:22:17.06 +000>,<MAYBRIDGE\nmr>,<NMR_250MHZ>,
      <apk 
       data hash MD5: 32K
       60 DB 38 14 26 1B 57 BB C4 56 EE E2 64 9F 61 55>)
(   4,<2007-01-05 09:22:17.91 +000>,<MAYBRIDGE\nmr>,<NMR_250MHZ>,
      <abs ABSG = 5 
       data hash MD5: 32K
       18 9D 3D AC 44 C6 22 32 A5 36 82 25 B8 E7 CD C3>)
$$ ##END=
$$ 
$$ hash MD5
$$ A3 98 30 F8 73 E8 AA 25 41 5D 34 EC 52 72 5F A1
##$RELAX= 
##$RELAX= 
##$RELAX= 
##$RELAX= 
##$RELAX= 
##$RELAX= 
##$RELAX= 
$$ Bruker specific parameters
$$ --------------------------
##$DU= <C:\u>
##$EXPNO= 340
##$NAME= <ADRS>
##$PROCNO= 1
##$TYPE= <nmr>
##$USER= <dgb>
##$AMP= (0..31)
100 100 100 100 100 100 100 100 100 100 100 100 100 100 100 100 100 100 
100 100 100 100 100 100 100 100 100 100 100 100 100 100 
##$AQSEQ= 0
##$AQ_mod= 3
##$AUNM= <au_zg>
##$AUTOPOS= <23 >
##$BF1= 250.13
##$BF2= 250.13
##$BF3= 250.13
##$BF4= 250.13
##$BF5= 500.13
##$BF6= 500.13
##$BF7= 500.13
##$BF8= 500.13
##$BYTORDA= 1
##$CFDGTYP= 0
##$CFRGTYP= 5
##$CHEMSTR= <none>
##$CNST= (0..31)
1 1 145 1 1 1 1 1 1 1 1 1 1 1 1 1 1 1 1 1 1 1 1 1 1 1 1 1 1 1 1 1 
##$CPDPRG= <>
##$CPDPRG1= <>
##$CPDPRG2= <>
##$CPDPRG3= <>
##$CPDPRG4= <mlev>
##$CPDPRG5= <mlev>
##$CPDPRG6= <mlev>
##$CPDPRG7= <mlev>
##$CPDPRG8= <mlev>
##$CPDPRGB= <>
##$CPDPRGT= <>
##$D= (0..31)
0 1 0 0 0 0 0 0 0 0.06 0 0 0 0 0 0 0.0002 0 0 0 0 0 0 0 0 0 0 0 0 0 0 
0 
##$DATE= 1167988918
##$DBL= (0..7)
120 120 120 120 120 120 120 120 
##$DBP= (0..7)
150 150 150 150 150 150 150 150 
##$DBP07= 0
##$DBPNAM0= <>
##$DBPNAM1= <>
$$ [...]
##$SUBNAM7= <"">
##$SUBNAM8= <"">
##$SUBNAM9= <"">
##$SW= 20.6930455092707
##$SWIBOX= (0..15)
0 0 3 0 0 0 0 0 0 0 0 0 0 0 0 0 
##$SW_h= 5175.983436853
##$TD= 65536
##$TD0= 1
##$TE= 294.16
##$TE2= 300
##$TE3= 300
##$TEG= 300
##$TL= (0..7)
0 120 120 120 120 120 120 120 
##$TP= (0..7)
150 150 150 150 150 150 150 150 
##$TP07= 0
##$TPNAME0= <>
##$TPNAME1= <>
##$TPNAME2= <>
##$TPNAME3= <>
##$TPNAME4= <>
##$TPNAME5= <>
##$TPNAME6= <>
##$TPNAME7= <>
##$TPOAL= (0..7)
0.5 0.5 0.5 0.5 0.5 0.5 0.5 0.5 
##$TPOFFS= (0..7)
0 0 0 0 0 0 0 0 
##$TUNHIN= 0
##$TUNHOUT= 0
##$TUNXOUT= 0
##$USERA1= <user>
##$USERA2= <user>
##$USERA3= <user>
##$USERA4= <user>
##$USERA5= <user>
##$V9= 5
##$VALIST= <valist>
##$VCLIST= <CCCCCCCCCCCCCCC>
##$VD= 0
##$VDLIST= <DDDDDDDDDDDDDDD>
##$VPLIST= <PPPPPPPPPPPPPPP>
##$VTLIST= <TTTTTTTTTTTTTTT>
##$WBST= 1024
##$WBSW= 4
##$XGAIN= (0..3)
0 0 0 0 
##$XL= 0
##$YL= 0
##$YMAX_a= 257225
##$YMIN_a= -409454
##$ZGOPTNS= <>
##$ZL1= 120
##$ZL2= 120
##$ZL3= 120
##$ZL4= 120
##$ABSF1= 16.5197
##$ABSF2= -4.173473
##$ABSG= 5
##$ABSL= 3
##$ALPHA= 0
##$AQORDER= 0
##$ASSFAC= 0
##$ASSFACI= 0
##$ASSFACX= 0
##$ASSWID= 0
##$AUNMP= <proc_1d>
##$AZFE= 0.1
##$AZFW= 0.1
##$BCFW= 0
##$BC_mod= 0
##$BYTORDP= 0
##$COROFFS= 0
##$CY= 12.5
##$DATMOD= 1
##$DC= 0
##$DFILT= <>
##$DTYPP= 0
##$F1P= 14.0000005364418
##$F2P= -0.99999901652339
##$FCOR= 0.5
##$FTSIZE= 32768
##$FT_mod= 6
##$GAMMA= 0
##$GB= 0
##$INTBC= 1
##$INTSCL= 1
##$ISEN= 128
##$LB= 0.3
##$LEV0= 0
##$LPBIN= 0
##$MAXI= 10000
##$MC2= 0
##$MEAN= 0
##$ME_mod= 0
##$MI= 0
##$NCOEF= 0
##$NC_proc= -3
##$NLEV= 6
##$NOISF1= 0
##$NOISF2= 0
##$NSP= 0
##$NTH_PI= 0
##$NZP= 0
##$OFFSET= 16.5197
##$PC= 1
##$PHC0= 224.3096
##$PHC1= 7.356134
##$PH_mod= 1
##$PKNL= yes
##$PPARMOD= 0
##$PSCAL= 4
##$PSIGN= 0
##$REVERSE= no
##$SF= 250.130000572949
##$SI= 32768
##$SIGF1= 0
##$SIGF2= 0
##$SINO= 400
##$SIOLD= 32768
##$SREGLST= <1H.CDCl3>
##$SSB= 0
##$STSI= 32768
##$STSR= 0
##$SW_p= 5175.98343685301
##$SYMM= 0
##$S_DEV= 0
##$TDeff= 65536
##$TDoff= 0
##$TI= <Analysis number 999999
Compound Code 99
Book Reference 9
Project Code 9>
##$TILT= no
##$TM1= 0
##$TM2= 0
##$TOPLEV= 0
##$USERP1= <user>
##$USERP2= <user>
##$USERP3= <user>
##$USERP4= <user>
##$USERP5= <user>
##$WDW= 1
##$XDIM= 32768
##$YMAX_p= 463215292
##$YMIN_p= -254961
$$ End of Bruker specific parameters
$$ ---------------------------------
##NTUPLES= NMR SPECTRUM
##VAR_NAME=  FREQUENCY,     SPECTRUM/REAL,   SPECTRUM/IMAG
##SYMBOL=    X,             R,               I
##VAR_TYPE=  INDEPENDENT,   DEPENDENT,       DEPENDENT
##VAR_FORM=  AFFN,          ASDF,            ASDF
##VAR_DIM=   32768,         32768,           32768
##UNITS=     HZ,            ARBITRARY UNITS, ARBITRARY UNITS
##FACTOR=    0.157963299565203, 1,           1
##FIRST=     4132.07234451744, 0,            0
##LAST=      -1043.91109233557, 0,           0
##MIN=       -1043.91109233557, -254961,     0
##MAX=       4132.07234451744, 463215292,    0
$$ Real data points
##PAGE= N=1
##DATA TABLE= (X++(R..R)), XYDATA
$$ [...]
18726G8313M611j7604k200M6227J3144K041l8192K38N63P790M8299N772J7177
18713A66179L1004J2148r490l3348K1586R134O181J653n715j8140k0500p712j1615
18700A41365L7402K6546K130r955j3416J3947K9488M4669L2789J6721n315m565
18688C11806L960j047K7213L9619j1082J8280K8630K3880L01P4988J27576J17266
18676G61390P8359N7396J5248J7396R435m7668l3674j0100L7370P6721J08291
18665A070164J39183J63604J76755K15743K76254L64808N25406P57622R97026
18656D686565J471974K235266L501495N795909Q451938P160595Q14222q86666
18648C3231298J223514k175166p868200p728748m953609l029199j928826j295710
$$ plain form
18726 78313 82924 65320 63120 109347 122491 124532 86340 86578 87141 94931 143230 149002 166179
18713 166179 197183 209331 199841 166493 188079 197213 203394 205047 199332 181192 160692 152980 141365
18700 141365 178767 205313 207443 197488 184072 198019 227507 272176 304965 321686 316371 311806
18688 311806 315766 314719 341932 381551 370469 388749 417379 441259 441560 516548 644124 761390
18676 761390 839749 897145 912393 929789 939224 891556 857882 847782 885152 961873 1070164
18665 1070164 1209347 1372951 1549706 1765449 2041703 2406511 2931917 3689539 4686565
18656 4686565 6158539 8393805 11895300 17691209 26143147 33303742 34117964 33231298
18648 33231298 34454812 32279646 24411446 16682698 11729089 8699890 6771064 5475354
18640E475354q85043o27998n49179m31668l31994k48237k19117j29546q7775m2577
18630A922220k1515O7690J34525J51893Q9126K3343N047m2018j07216j89502r8351
18619A935242k3299M9486Q7911J18867J90315K71960L56976M46629N64728P83035
18609D781850J084839J548711K249191L301993N147756Q406702J3176259J4918037
18601E4615338O478907j534484P65544j2616j0466699j4992783j1067387o747760
18593A7038060m274629k838016j940677j385051j103704q56818o56817m70824
18585C511524l97128l32835k77298k08667j64719m1652L2909N5401M9965J6912
18575B244412m4645p7440q3337j76008k27049j72248j02938m7722k816M1016Q2910
$$ plain form
18640 5475354 4590311 3962313 3413134 2981466 2649472 2401235 2182118 2052572 1964797 1922220
18630 1922220 1900705 1968395 2102920 2254813 2343939 2367282 2372329 2330311 2223095 2033593 1935242
18619 1935242 1911943 1961429 2049340 2168207 2358522 2630482 2987458 3434087 3998815 4781850
18609 4781850 5866689 7415400 9664591 12966584 18114340 26521042 39697301 54615338
18601 54615338 61094245 59559761 60325305 60312689 49845990 34853207 23785820 17038060
18593 17038060 12763431 9925415 7984738 6599687 5495983 4639165 3982348 3511524
18585 3511524 3114396 2781561 2504263 2295596 2130877 2089225 2122134 2177535 2227500 2244412
18575 2244412 2199767 2122327 2038990 1862982 1635933 1463685 1360747 1313025 1310209 1351225 1434135
18564A434135J51839J52010K35778L15948M27800O01580P83774J182551J854972
18555G140387L000994M960464P001053N234609J4951n65713J126242k507524o925427
18546A8480036o113351l712718k266948j491536j023693p39556n40871m25579
18538B165784l67300k62575j61233j56784j24367r7031r0993n9398K4043J1655
18528H81801o992k9190l0156j9285p3180p2974n9969o6008n4397n3713n1777l8156
18516C26004l1445k6010L1505K9426j0821l6022l905j3548k4120m8282l8100J065
18504A55747J6350K4366J3666n225K579j0847j6856m647J6018k2583k3116k922
18492A42530k4558j4978m972O799J2742J5240J261K0165L5928J0105K3638l1737
$$ plain form
18564 1434135 1585974 1737984 1973762 2289710 2717510 3319090 4102864 5285415 7140387
18555 7140387 10141381 15101845 22102898 27337507 27352458 26786745 27912987 25405463 18480036
18546 18480036 12366685 8653967 6387019 4895483 3871790 3132234 2591363 2165784
18538 2165784 1798484 1535909 1374676 1217892 1093525 996494 905501 846103 870146 881801
18528 881801 874809 845619 815463 796178 722998 650024 590055 524047 469650 415937 364160 326004
18516 326004 294559 268549 300054 329480 318659 282637 278732 265184 241064 192782 154682 155747
18504 155747 172097 196463 210129 204904 207483 196636 179780 175133 191151 168568 145452 142530
18492 142530 117972 102994 98022 104821 117563 132803 134064 154229 190157 200262 223900 192163
18480A92163l8269J2498R953K1879l161j7190J5911m962K4639K3557k2949l2579
18468A81490k3334j626J1426o034O763J3700j6874k0315j1673P382P684O474p0
18455A54993J4067L7250n453J992l0819p660j6968n63K3921L1222L9866K1003
18443B62851P350m507k6831Q782J5268K8542L7608n0029j581P032L927K237J0966
18430C01615J1698L9916J5427p780J2727K0752J5176j9372K0246J1630K4054M9427
18418D95516L4859J7416K9537O068M4256O1604N6718Q8129J00307J18497J60932
18407A213839J17488J27938Q0692L7053L2123O914j7812J5998M3097O1879J11948
18396A831157K20317K43662L55222M63226N35853N13596N95948P03712Q56938
$$ plain form
18480 192163 153894 166392 176345 198224 195063 177873 193784 188822 213461 237018 214069 181490
18468 181490 158156 156530 167956 161922 168685 182385 165511 145196 133523 140905 148589 155063 154993
18455 154993 169060 206310 200857 202849 172030 164370 147402 146839 170760 201982 241848 262851
18443 262851 270201 265694 238863 247645 262913 291455 329063 279034 277453 284485 288412 290649 301615
18430 301615 313313 353229 368656 360876 373603 394355 409531 390159 410405 422035 446089 495516
18418 495516 530375 547791 577328 583396 627652 689256 745974 834103 934410 1052907 1213839
18407 1213839 1331327 1459265 1539957 1577010 1609133 1616047 1598235 1614233 1657330 1719209 1831157
18396 1831157 2051474 2295136 2650358 3113584 3649437 4163033 4758981 5462693 6319631
18387F319631J300614K048191L176385N127292Q050437J1413069J4051829J2962507
18379F4449955N706655l56040p543985j2874665j2055742q973887n555403k623740
18371B0173148k40222K169366N078419Q641976J1974701J3647417R485626J699405
18363G2629836m259978j1877395j4390058j2150473q832137n815649l690188k397006
18355I216952j595114j088936q23943o72066n70294n38129m93051m68256l87979
18346B579184l43493k64537j94636j65232q8805j8689J3043j9180m0049n0411
18336A407195j09156j40606j36948j45379j32743q2780p9166m1488J1486j8537
18326E31878l6192l4890l9930J750m1634l0522m2358j3062k5554n0260l3123o72
$$ plain form
18387 6319631 7620245 9668436 12844821 17972113 26022550 37435619 51487448 64449955
18379 64449955 70156610 69800570 62256585 49381920 37326178 28352291 22796888 20173148
18371 20173148 19932926 22102292 27180711 35822687 47797388 61444805 70930431 72629836
18363 72629836 68369858 56492463 42102405 29951932 21119795 15304146 11613958 9216952
18355 9216952 7621838 6532902 5708959 5036893 4466599 3928470 3435419 2967163 2579184
18346 2579184 2235691 1971154 1776518 1611286 1522481 1503792 1516835 1497655 1457606 1407195
18336 1407195 1298039 1157433 1020485 875106 742363 659583 580417 538929 550415 531878
18326 531878 495686 460796 420866 422616 380982 350460 308102 295040 269486 219226 186103 185431
18314A85431j4597J6327J9024q781k3996K2550R700J9231j0676n3437m5293p145
18302A08338j7668k5062j288L4209q896K5779J2225n259J629j8919k4118k1243
18290E9727L402q79J7770j3289m63j1893j5929p878J4962J1907k2133j415J3982
18277D7871J7282K3947k9477m8635k5941K6922n270r959Q05P762L2800K5731j0266
18264E3572j7351k1120j008O075K9969M3934k7738n3578j4703O336O1497M6868
18252A12753M803k0878m9604j1270L3871J3512N188J1045m5515l1481K015K7022
18240E1461L5496N027K5379L133q7462p3127J2500O3039M7547k5811n8333K376
18228A225o20j815M738q808l310K1373p840j4661l711P402J0663P688l6700r523
$$ plain form
18314 185431 170834 187161 206185 197404 173408 195958 205658 224889 214213 160776 115483 108338
18302 108338 90670 65608 64320 98529 89633 115412 127637 122378 124007 105088 80970 59727
18290 59727 63129 62250 80020 66731 66268 54375 38446 30568 45530 57437 35304 33889 47871
18277 47871 65153 89100 59623 10988 -14953 11969 6699 -3260 -2455 5307 38107 63838 53572
18264 53572 36221 15101 14093 20168 50137 94071 66333 12755 -1948 4388 65885 112753
18252 112753 117556 96678 47074 35804 69675 83187 88375 99420 53905 22424 24439 51461
18240 51461 86957 91984 117363 120496 33034 -40093 -27593 35446 82993 57182 -1151 1225
18228 1225 605 -1210 3528 -5280 -8590 12783 4943 -9718 -13429 -6027 4636 12324 -24376 -33899
18214c3899R751j7066j5298J3950O5477O5069K4024l7141n1691P440j0938Q678
18202B8356K5979P710J1816N339k8141m3062l9837J0398N4000K3975n165J2428
18190F3796J0777n65k0318p379K7715L1990k0545n758N828n045O932R222J5584
18177A12234Q783q172J782M3126j2701k3064k1094l5014j2282J8666o5033l2109
18165b4878R057J635N9901M7617J8047J3525l594K1954K1555o510l0600j8381
18153A09328K9974M3768l066J6029L8068o353n777j1171M1511K0269N781N790
18141B84151N066N0904K0144L5723L3398K557M1085M8485M1033K1443P4920O7071
18129G25980M0990M1851R361M6078P2903J26601J45169J55952K23572K69969L57432
$$ plain form
18214 -33899 -24148 -41214 -56512 -42562 22915 87984 112008 74867 23176 30616 19678 28356
18202 28356 54335 62045 73861 79200 51059 7997 -31840 -21442 32558 56533 51368 63796
18190 63796 74573 74008 53690 46311 74026 106016 85471 79713 85541 80496 87428 96650 112234
18177 112234 121017 112845 114627 157753 145052 121988 100894 65880 53598 72264 7231 -24878
18165 -24878 -15821 -14186 45715 93332 111379 124904 121310 143264 164819 158309 127709 109328
18153 109328 139302 183070 180004 196033 234101 227748 221971 210800 252311 272580 278361 284151
18141 284151 289217 340121 360265 395988 429386 431943 473028 521513 562546 583989 658909 725980
18129 725980 766970 808821 818182 864260 937163 1063764 1208933 1364885 1588457 1858426 2215858
18118B215858M75904O22422Q19766J188591J733243K750329M738672Q969938J7656662
18109D1171385L0155034J9867511k1789114k9573553j6258213q080418m585996
18102A0906636k865972j845225j236218q92241o62034n24114l83359k97999l18199
18093A881275k18884k10682j31277j37146j42326j06538m2322m3641l6618r396
18083H02445m4180o2059k0856q2036r4845j07722o1230K3523o6845o3053J1843
18072B34985K699j4950l2070m2576k7j9432j8439M07j8548j0597J972k1906M204
18059F5722J7777N822r622L850j0470r164M164K946K4936q762k3387l4000m0596
18046a0784J2715N0068J5649n895l9563J5023J0559j9892l8559L7248K0288M3500
$$ plain form
18118 2215858 2691762 3314184 4133950 5322541 7055784 9806113 14544785 23514723 41171385
18109 41171385 71326419 91193930 69404816 39831263 23573050 15492632 10906636
18102 10906636 8040664 6195439 4959221 4066980 3404946 2880832 2497473 2199474 1881275
18093 1881275 1662391 1451709 1320432 1183286 1040960 934422 892100 848459 811841 802445
18083 802445 758265 696206 675350 593314 498469 390747 329517 353040 286195 223142 234985
18072 234985 237684 222734 190664 148088 148061 128629 110190 110597 92049 81452 83424 61518 65722
18059 65722 83499 89321 79699 83549 73079 63915 68079 71025 95961 87199 63812 29812 -10784
18046 -10784 1931 51999 67648 61753 22190 37213 47772 27880 -10679 26569 46857 90357
18034I0357J1561j0198K6664L0340m9611l0254m1885o0955l4608K244L2519K2508
18022a1318K0578K0753L890n130k8993J4280J9875N859l6708l8703K0940K7376
18010A2699j0853J4765K0364j4679k4686j5540K4019N466k6820l4433k8340L5756
17998d2282j0314J7673K9001J8522K3905k751n4305l1778P261N649Q384K3287
17986g748J2415j2008r090N7292N2064K8018n7249o3004j3864k4388j9282k6754
17974h3598J2264J1771j6562J4064k7794k3929L8906N8230K2002L5522k1051L576
17962B3401m8619k2031m4206k6485R803P814M6080K9688K0549k7682j8365o187
17950e6240j0630q3L1961J9811j6502j896L8642K381k5408J5776m0312J2155L9863
$$ plain form
18034 90357 101918 91720 118384 148724 99113 68859 26974 -33981 -68589 -66345 -33826 -11318
18022 -11318 9260 30013 33903 28773 -220 14060 33935 39794 3086 -35617 -14677 12699
18010 12699 1846 16611 36975 22296 -2390 -17930 6089 11555 -15265 -49698 -78038 -42282
17998 -42282 -52596 -34923 -5922 12600 36505 33754 -20551 -52329 -45068 -39419 -31035 -7748
17986 -7748 4667 -7341 -16431 40861 92925 120943 63694 690 -13174 -37562 -56844 -83598
17974 -83598 -71334 -59563 -76125 -62061 -89855 -113784 -74878 -16648 5354 40876 19825 23401
17962 23401 -25218 -47249 -91455 -117940 -108137 -100323 -54243 -24555 -4006 -31688 -50053 -56240
17950 -56240 -66870 -66953 -34992 -15181 -31683 -33579 5063 7444 -17964 -2188 -42500 -30345 9518
17937I518k0659j0356L3117k5274o3177j5989p636k1274R216L0288J4390K0205
17925d7631M3503N093l9155r232K5511L3732M3041q671k8190j2947j3397k7635
17913c5978P641J4654j3347J735K7392q801R677j7373k7722K0863l483k9178L1015
17900b2905L8573l0047n1423P470J4589j1431K4516J9134k4728K1243L1107j1328
17888D770k6951o0324K3861L9712J188k9827K167l8052P957N1740L1794l657j2851
17875h473k2907M118r464K6877J7564k31j124p813k9468l2487J5964K454j1975
17862e6965K6827j0995k8034M606P689j243J2148P041K019K9215k4863r397O521
17849c5431M53K6778j0567k7978k8372q277J357K5182K7172L4277j0084l6853
$$ plain form
17937 9518 -11141 -21497 11620 -13654 -76831 -92820 -100456 -121730 -112514 -82226 -67836 -47631
17925 -47631 -4128 965 -38190 -47422 -21911 11821 54862 46191 18001 5054 -8343 -35978
17913 -35978 -28337 -13683 -27030 -25295 2097 -6704 2973 -14400 -42122 -21259 -24742 -53920 -22905
17900 -22905 15668 -14379 -65802 -58332 -43743 -55174 -30658 -11524 -36252 -15009 16098 4770
17888 4770 -22181 -82505 -58644 -18932 -17744 -47571 -45404 -83456 -75499 -23759 8035 4378 -8473
17875 -8473 -31380 -27262 -36726 -9849 7715 7484 6360 -1453 -30921 -63408 -47444 -44990 -56965
17862 -56965 -30138 -41133 -69167 -64561 -56872 -58115 -45967 -38926 -36907 -7692 -32555 -41952 -35431
17849 -35431 -34978 -8200 -18767 -46745 -75117 -83394 -82037 -56855 -29683 4594 -5490 -42343
17837d2343J5267L8186L2269N394p656n875N233m367m553k5820P972K3339k12
17824C6834j4407j4718k1661l947M378l561R669P500J3989K0557l9869j2937M647
17811a3526p129L0423m4913n706L5434N625j1331K5772P644r916k9303l718j372
17798b2016J2225J2038L1857L3991o089o708P035K0026Q7889M1399J5212J0052
17786B36911k143L483j1013m0177m8377l9138J076M287L859j827O3291N6152Q2908
17773C09292P0943M5248J6609k7142q2633q6710p0850l8403m3882n8204j3413
17762B0855K2389K345m5560k3082P266j4638J0547J1379K2289J8837J0000k605
17750D0022l884N285o922n9282k0650K8288K8058j8733J0435K263l352k0277k541
$$ plain form
17837 -42343 -27076 11110 43379 48773 41117 35242 40475 36108 31555 5735 13707 37046 36834
17824 36834 22427 7709 -13952 -17899 -13521 -17082 -7413 87 14076 34633 -5236 -18173 -13526
17811 -13526 -20655 9768 -35145 -40851 -5417 208 -11123 14649 22293 12377 -16926 -20644 -22016
17798 -22016 -9791 2247 34104 68095 62006 55298 62333 82359 170248 211647 226859 236911
17786 236911 234768 238251 227238 187061 138684 99546 100622 104909 108768 106941 170232 226384 309292
17773 309292 380235 425483 442092 414950 332317 245607 174757 136354 92472 34268 20855
17762 20855 43244 45589 29 -23053 -15787 -30425 -19878 -8499 13790 32627 42627 40022
17750 40022 36138 41423 34501 -24781 -45431 -17143 10915 -7818 2617 4880 1528 -18749 -21290
17737b1290O181L3326m914j1677J473k678P435J1365R32j2577K0120J8389M60
17724D6545k6922q297L6896k6108k9433j027J9943Q033M357L206L4206k1766O474
17711D6107J5761R199j767N195k9048k0950k0692r119J7457P294M712N817k9478
17698D88k8497j1026K7167L6336j1593j0665J5387Q109L03o291j5998k372k8948
17685b7600k2164L0724J8525L832J3906o820K5004n738k9513K3763L2177J3042
17673F9138L9210K6510M5022O9533Q0202P3169n7059j08452o3075l0091m5634
17662I8473r41l286o42K796j492K5227P5755J10693Q9687j7879o2181p8753r8976
17649A38481l9812k8705J4254J0550K1065m3809o7611R725Q364J6567N684j284
$$ plain form
17737 -21290 -15109 18217 13303 1626 3099 421 7856 19221 20153 7576 27696 46085 46545
17724 46545 19623 11326 48222 22114 -7319 -8346 11597 19630 23987 27193 61399 39633 46107
17711 46107 61868 71067 69300 74495 45447 24497 3805 -5314 12143 19437 24149 29966 488
17698 488 -28009 -39035 -11868 24468 12875 2210 17597 25706 26009 19718 3720 1348 -27600
17685 -27600 -49764 -19040 -515 3317 17223 10403 35407 29669 156 23919 56096 69138
17673 69138 108348 134858 179880 249413 329615 402784 345725 237273 174198 144107 98473
17662 98473 97532 94246 93604 96400 94908 120135 195890 306583 396270 378391 316210 237457 138481
17649 138481 98669 69964 84218 94768 115833 72024 4413 14138 22502 39069 44753 43469
17637D3469k2570j7939J1540k2938k9760l815j0230K2537J6470m212q008M193
17625b1263m225K394k913j6229j1803P883k93j0537J3899P850j6593J496k9769
17612h0103k208L2079L5126J4348j0098o540K8175J4160J2562k0137l3552k0729
17600c6917K3358J2025j7375k3393l898L223k42j0796J5985j6246l2182L1033
17588e5425K5733k6372J5084K056j0392J5351K5239k100j4809J2203j5462L60
17576b8534Q723j7170l7315m908R9R347L8301K4552M127N488r75J219l0909j5167
17562d3122p323L0794K1130k2631j0080q631J9717M972J6648J3581j9222j2159
17550a6326k4210j0279J5746P448J5036J7065k4476R576R468l1893j8481j2344
$$ plain form
17637 43469 20899 2960 14500 -8438 -38198 -42013 -52243 -29706 -13236 -17448 -25456 -21263
17625 -21263 -25488 -23094 -26007 -42236 -54039 -46156 -46449 -56986 -43087 -35237 -51830 -50334 -80103
17612 -80103 -82311 -50232 -15106 -758 -10856 -17396 10779 24939 37501 17364 -16188 -36917
17600 -36917 -13559 -1534 -18909 -42302 -46200 -42977 -43219 -54015 -38030 -54276 -86458 -55425
17588 -55425 -29692 -56064 -40980 -38924 -49316 -33965 -8726 -10826 -25635 -13432 -28894 -28534
17576 -28534 -19811 -36981 -74296 -79204 -79105 -69758 -31457 -6905 -2778 2710 1735 2954 -27955 -43122
17562 -43122 -50445 -19651 1479 -21152 -31232 -39863 -20146 -15174 1474 15055 -4167 -16326
17550 -16326 -40536 -50815 -35069 -27621 -12585 4480 -19996 -10420 -952 -32845 -51326 -63670
17538f3670j935j1767o471J4223J5893p988M5441L2731k8902k7938n0702L299
17526h7786J045J9295J9355l1996J5076J1457J5560M2913l7235k3827k5149M955
17514g6337K2224L597M193K0561J5020N91j7731o647J3575J2132p361j965j9506
17501c7654j2911K073K1247K818J7015l2199r052M6088L3182j7754k7125m0298
17489e4570K418k1531M575J9704K1984l9618k3689N370N5995K6239l1711K5220
17477i614k496k8869n435j2612J1440J3090K5509L0003j5556l1551k2161k589
17465e0841M890M59p648j099K0428L2133M809j1729j8042L1712q125J421L623
17452A991N806j8262Q472L749J4421L4556M5447J4577N0806J38584J63110n6124
$$ plain form
17538 -63670 -65605 -77372 -83843 -69620 -53727 -61715 -16274 16457 -12445 -40383 -91085 -87786
17526 -87786 -86741 -67446 -48091 -80087 -65011 -53554 -37994 4919 -32316 -56143 -81292 -76337
17514 -76337 -54113 -50516 -46323 -25762 -10742 -10151 -27882 -34529 -20954 -8822 -16183 -18148 -37654
17501 -37654 -50565 -48492 -27245 -24427 -7412 -39611 -48663 -2575 30607 12853 -14272 -54570
17489 -54570 -52152 -73683 -69108 -49404 -27420 -67038 -90727 -85357 -29362 -3123 -34834 -9614
17477 -9614 -12110 -40979 -46414 -59026 -47586 -34496 -8987 21016 5460 -26091 -48252 -50841
17465 -50841 -45951 -45492 -53140 -54239 -33811 -1678 3131 -8598 -26640 5072 -3053 -1632 1991
17452 1991 7797 -10465 -1993 1756 16177 50733 96180 110757 161563 300147 463257 407133
17440D07133j77233j05339p0368n4103k098n895k5592M191P059J4171M1811L2593
17428F6330q913k7903o978R109J8833l203j7894l8341L7132K1340n2304k936n850
17415a1578j989O378k9192Q246m21L519K2021O958j2437q01J6418j8656J7885
17402F351P190j6441J7639j3968l1296M320N270R830L444r095N705L1866J1263
17389C2078J97l2147j7139j4522J8432P7376L2879k385o0218l3976Q270K5668
17377C4513J1720K383o145J9647j6852m4004l3292J1571K9912J2556K2644j417
17365D3236K1412O724K3406k7570n7134k9856j9785l029n686L322J5211J031Q794
17352a9924K2348J446K1266M440l911k812J4128q597j2601N315L600j321l484
$$ plain form
17440 407133 229900 124561 54193 90 -2008 -7903 -33495 -29304 -22245 -8074 33737 66330
17428 66330 57417 29514 22536 31645 50478 47275 29381 -8960 28172 49512 -2792 -5728 -11578
17415 -11578 -13567 -7189 -36381 -28135 -28556 -25037 -3016 3942 -8495 -9296 7122 -11534 6351
17402 6351 13541 -2900 14739 771 -30525 -26205 -20935 -11105 -7661 -16756 -11051 20815 32078
17389 32078 32275 128 -17011 -31533 -13101 64275 97154 94769 34551 575 8845 34513
17377 34513 46233 48616 42471 62118 45266 1262 -32030 -20459 9453 22009 44653 43236
17365 43236 64648 71372 94778 67208 10074 -19782 -39567 -42596 -48282 -44960 -29749 -28718 -19924
17352 -19924 2424 3870 25136 29576 25665 22853 36981 28384 15783 21098 24698 23377 19893
17339A9893p256j532j0444j459j3676j1577n749P849j0820j8654K7678L2767N163
17326A2183l2161m9086j5833R102l474J9758N4771j600l3188O514o269j9755J6314
17313d2724L1948L731K1382k0822m995J9472r321L5137L9898m398k7001K1086
17301F3393n246k992J1k7558Q030l1878m9418k4168J9233N1976K2775J5470O606
17288D6234J1866q339j5999J7609j366r53J186Q983Q584Q667j2879j0068J8511
17275G2036k3861l6806L321L976j4953k0229K0960L2613K9984P810n442o4M0578
17262A09923J7410k3365l9288r176K364l1841q270J0918K6975Q727M8270M5808
17250A58455m4289k0689J0265k000l4505J399m8292m5853p878L1293N8973J6261
$$ plain form
17339 19893 12637 11105 661 -798 -14474 -26051 -31800 -23951 -34771 -53425 -25747 7020 12183
17326 12183 -19978 -69064 -84897 -75795 -79269 -59511 -4740 -6340 -39528 -33014 -39283 -59038 -42724
17313 -42724 -10776 -7045 14337 -6485 -11480 7992 -1329 33808 73706 69308 42307 63393
17301 63393 58147 55155 55166 27608 35638 3760 -45658 -69826 -50593 1383 24158 39628 46234
17288 46234 58100 49761 33762 51371 50005 49052 50238 59221 67805 76472 63593 53525 72036
17275 72036 48175 11369 14690 18666 3713 -16516 4444 37057 67041 74851 69409 69345 109923
17262 109923 127333 103968 64680 55504 57868 26027 17757 28675 55650 64377 112647 158455
17250 158455 114166 93477 103742 101742 67237 68636 20344 -25509 -33387 -2094 56879 73140
17238G3140N113J9374k9711j8475K2532J4375O623k5456l4787k4093k3101M048
17226a0418N9229L8486M0412k4529n0780k584m152J3815J5318J2557L7629p321
17214A17662k4717r664j7312K3929J1312j0500J5177J2140m2516K2780n33l6951
17202F0807r974J3696r091J8714M0452K8638Q634J0840J376j5751l6926L6780
17190A48195L5677n357l854j824j7459j8574j0003N170L5686M4281K6775K0350
17178B59063L5070j7179j1758j148j9825j2378J7468M0492p202L979k1976K06
17166B64812K7715k026J7242J2606K5790k013n257j0401L2034M2079q836L0856
17154D24601P0585N5822L0313P9071O7655O605j5759O7840Q3547P7685M9353N3864
$$ plain form
17238 73140 78253 97627 67916 49441 71973 86348 92971 67515 32728 8635 -14466 -10418
17226 -10418 48811 87297 127709 103180 52400 49816 45664 59479 74797 87354 124983 117662
17214 117662 92945 83281 65969 89898 101210 90710 105887 118027 75511 98291 97758 60807
17202 60807 50833 64529 55438 74152 114604 143242 151876 162716 164092 148341 111415 148195
17190 148195 183872 178515 174661 172837 155378 136804 126801 131971 167657 211938 238713 259063
17178 259063 294133 276954 265196 264048 244223 231845 249313 289805 282603 286582 264606 264812
17166 264812 292527 290501 307743 320349 346139 344126 338869 328468 360502 402581 393745 424601
17154 424601 495186 551008 581321 660392 728047 734652 718893 786733 870280 947965 997318 1051182
17142A051182R5656J59136J09803Q3125O6043P2814J39889J47818Q5644J13762
17132B124872K21045K90754L59468M51227M09220M86636O48358Q02663J066905
17123F861148J508103K256012L392045N263645Q832762J5485298K4776631K6269351
17115I4644995J671489k4307474k4315277j4871592q269169m551395k272912n78279
17107A7150386R71911K768207N408405J0138312J8065714K6138452J7654057j2753330
17099H5542114k7373350k0729609j2155981p165009m537547l005210k041463j430213
17091G103732j057457q00160n41763l81871l62832l70620l03977l31335m29485
17082B524232l49027k83758k82055k16856j15013n9264m0399k1033k5389n0680
$$ plain form
17142 1051182 1146838 1305974 1415777 1498902 1564945 1637759 1777648 1925466 2011110 2124872
17132 2124872 2345917 2636671 2996139 3447366 3856586 4343222 4991580 5794243 6861148
17123 6861148 8369251 10625263 14017308 19280953 28113715 43599013 68375644 94644995
17115 94644995 96316484 72009010 47693733 32822141 24552972 20001577 17728665 17150386
17107 17150386 18122297 20890504 26298909 36437221 54502935 80641387 98295444 85542114
17099 85542114 58168764 37439155 25283174 18118165 13580618 10575408 8533945 7103732
17091 7103732 6046275 5246115 4704352 4322481 3959649 3589029 3285052 2953717 2524232
17082 2524232 2175205 1891447 1609392 1392536 1277523 1218259 1177860 1156827 1131438 1080758
17072A080758o4351j06082j34068j01323r0643o3338m9210j2178L413j6466m177
17061D42335m8090k7071j0026j6798j5634j40k9520n7450j1490J0547j1672l6896
17049A88095j0936j7025K5211M4305n542l1683l1588J9620K0283l761j4175k1303
17037A61501o1373j6400L427K6000R658o687Q640r728Q426l8791k6093L139K7635
17024H9354j2576l4741k8218J5776L0274N887j7285J0973J6240n870q864l5212
17012B5738k1874L2338L6065L1523j8204q125J402o529r877R715J1219M479l4696
16999E3174j2702K7537K1989p604j6821j3295j8628J7087Q936J2245O2255l173
16987A31000p610j6285O790N841n878l220m13p1485j5610J4053L799K0510O0187
$$ plain form
17072 1080758 1016407 910325 776257 674934 584291 520953 471743 459565 462978 446512 442335
17061 442335 394245 367174 357148 340350 324716 324576 295056 237606 226116 236663 224991 188095
17049 188095 177159 160134 185345 229650 224108 192425 160837 180457 200740 196979 182804 161501
17037 161501 100128 83728 87155 113155 122813 116126 124766 115038 123464 84673 58580 61719 89354
17024 89354 76778 42037 13819 29595 59869 65756 48471 59444 75684 69814 60950 25738
17012 25738 3864 36202 72267 103790 85586 77461 78863 72334 62457 72172 83391 87870 53174
16999 53174 40472 68009 89998 82394 65573 52278 33650 50737 59673 71918 134173 131000
16987 131000 123390 107105 113895 119736 113858 110638 110225 38740 23130 37183 40982 61492 121679
16974A21679L4088o143k8136k7381m7310l0049K804K9966j6317n982L0066r576
16962D7709l1704L2078L608m2987l3775k4121J308K8434J4216k7760J3074k1868
16950d1788j5262K4606K6393K5271K7642M605j0667k6866k1471p182j8239m654
16938c7612J6775K1779K9840J2392j0180J6411l5551k3597k890J8862p34j962
16926C533k8090m5652K1979J7510J0310R664P776k26k8649L2438K3401P294q225
16913B3063k5312j1945J9998L4933j5505j6806J3721k4920L2007J2338k4474m4163
16901b7065l5464j079k5008K2793K1393K2317N202p189M257J6734j5404n554J4077
16888i990K6435J7587R277k3184j1545M795k4221q246k2224o323J276J5227l0476
$$ plain form
16974 121679 155767 149624 121488 94107 46797 16748 19552 49518 33201 27219 57285 47709
16962 47709 16005 48083 51691 8704 -25071 -49192 -47884 -19450 -5234 -32994 -19920 -41788
16950 -41788 -57050 -32444 -6051 19220 46862 51467 40800 13934 -7537 -14719 -32958 -37612
16938 -37612 -20837 942 30782 43174 32994 49405 13854 -9743 -12633 6229 5495 3533
16926 3533 -24557 -70209 -48230 -30720 -20410 -10746 -2970 -3196 -31845 593 23994 31288 23063
16913 23063 -2249 -14194 5804 40737 25232 8426 22147 -2773 29234 41572 17098 -27065
16901 -27065 -62529 -63608 -88616 -65823 -44430 -22113 -16911 -24100 -19843 -3109 -18513 -24067 -9990
16888 -9990 16445 34032 43309 20125 8580 13375 -10846 -19092 -41316 -47639 -46363 -31136 -61612
16875f1612O223j3218k3563K5315M8266m971n06M0039J0780j9564m0556l7952
16863g1319n138J1282K0396J3459j4667Q92m932L277K8187l101l501Q441k948
16850a9672J3493p506j5515J6371J5713j1342Q472l856n637j386R77r775k2378
16837d2041p940K0768J5290O90j7357J580j1777O172j5171O477m1155l4469k9125
16824a48058J4055J3690J9777J5227J0740J1344J5273P25J3930K5725l7610N86
16812d4596J7467j3167l27J8638J5899k091n11n505j2714J6669K6412m659j0003
16799A512J8091k5305k8561J318J8278j3264m010M835j2714n474J752J0006J6103
16786a7433r373j1695j613j855M8546K914k5170l8668p759M1154O4459l672j1795
$$ plain form
16875 -61612 -55389 -68607 -92170 -66855 -18589 -23560 -24066 15973 26753 7189 -33367 -71319
16863 -71319 -76457 -65175 -44779 -31320 -45987 -45095 -50027 -46750 -18563 -21664 -25165 -16724 -19672
16850 -19672 -6179 -13685 -29200 -12829 2884 -8458 14 -3842 -9479 -10865 -9888 -19663 -42041
16837 -42041 -49981 -29213 -13923 -13233 -30590 -29010 -40787 -34615 -49786 -43309 -84464 -118933 -148058
16824 -148058 -134003 -120313 -100536 -85309 -74569 -63225 -47952 -47227 -33297 -7572 -45182 -44596
16812 -44596 -27129 -40296 -40623 -21985 -6086 -8177 -8688 -14193 -26907 -10238 16174 11515 1512
16799 1512 19603 -5702 -34263 -32945 -14667 -27931 -31941 -27106 -39820 -45294 -43542 -33536 -17433
16786 -17433 -26806 -38501 -40114 -41969 6577 9491 -15679 -54347 -62106 -20952 43507 39835 28040
16773B8040j5714j2090N458J4828m2432m7970j9614M0123J9956p238N085m834
16761c6402J545N005J4974K5033k0363k644K0468m447k3732Q852L9727K0388L209
16748E1613l312k7685j8442J1155k2990l7297j4788J0815Q95j5208n435N509k105
16735f7275O95O101K3575k1339j9535L3119L2259l6241j6504J2198n757K5376
16723c3328q625K497J3924K3620p166j1754k7800J2791K8237j9298j3381L663
16711c6620J4092j3963L636N095K150K437J2198Q52j2039k5109p954L2269M1533
16698A8577j478l5322R550P938k2698J4386K4782l2749k8837Q799O13j5030J579
16685d9890K8404j3443m532J2107k8401j5257K8399m140J5906j1491j9367R380
$$ plain form
16773 28040 12326 236 5694 20522 -21910 -69880 -89494 -49371 -29415 -36653 -31568 -36402
16761 -36402 -34857 -29852 -14878 10155 -10208 -12852 7616 3169 -20563 -11711 28016 48404 51613
16748 51613 48301 20616 2174 13329 -9661 -46958 -61746 -50931 -50036 -65244 -70679 -65170 -67275
16735 -67275 -66580 -60479 -36904 -58243 -77778 -44659 -12400 -48641 -65145 -52947 -58704 -33328
16723 -33328 -41953 -39456 -25532 -1912 -9078 -20832 -48632 -35841 -7604 -26902 -40283 -36620
16711 -36620 -22528 -36491 -32855 -27760 -25610 -23173 -10975 -10123 -22162 -47271 -55225 -22956 18577
16698 18577 17099 -18223 -8673 -735 -23433 -9047 15735 -17014 -45851 -37052 -36439 -51469 -49890
16685 -49890 -21486 -34929 -39461 -27354 -55755 -71012 -42613 -46753 -30847 -42338 -61705 -52325
16673e2325J7267o779Q290L9476P731Q497j4433j3542l5133J6441l665l1419L694
16660e5900q539L0030M1861J8715J0567m4126l3340k5549k6346K838L1709r66
16648e9046K6958L1347o964k3751O00j0349Q810j3279j8673Q426k072K028J4482
16635d1483j4988J1118K078N731q954K6107J4875j077j0888J4095J1998O91j5452
16622f149k177J9339N071j9138J6994l3070j4940J0644J6478p262K6513R37j5674
16609b434P136o735k998k9930m964q614N928k657j0895q759J4567M666q981J5834
16595c8836J9738J3120j7607k7214J0185K4971J5554J4339o06l1324j3677Q138
16583b3219J591j3203p987J1954K5619J5044m7299Q902p049J8155J4986L9495
$$ plain form
16673 -52325 -35058 -41837 -33547 5929 13660 22157 7724 -5818 -40951 -24510 -28175 -59594 -55900
16660 -55900 -64439 -34409 7452 26167 36734 -7392 -40732 -66281 -92627 -89789 -58080 -59046
16648 -59046 -32088 -741 -7705 -31456 -30856 -41205 -32395 -45674 -64347 -55921 -57993 -55965 -41483
16635 -41483 -56471 -45353 -43275 -37544 -46498 -20391 -5516 -6593 -17481 -3386 8612 9303 -6149
16622 -6149 -8326 11013 16084 -3054 13940 -19130 -34070 -23426 -6948 -14210 12303 13240 -2434
16609 -2434 4702 -2033 -5031 -34961 -39925 -48539 -42611 -45268 -56163 -64922 -50355 -45689 -54670 -38836
16595 -38836 -19098 -5978 -23585 -50799 -40614 -15643 -89 14250 13644 -17680 -31357 -23219
16583 -23219 -21628 -34831 -42818 -30864 -5245 9799 -37500 -28598 -35647 -17492 -2506 36989
16571C6989j6914o783k8807m8369K7358J8539J0188o190L5855M6478J0283J6056
16559I4683L2845J03001J04109N0784o1608j04086j03371m2197l8443j883K2059
16548E5893K1480M7819K7477M5830M9875J03355Q7119l8775j41647q9184o5752
16537A03490j6647j9104k2568j805j1932J8402n639K2189Q511k7078j4284k9889
16525C646l3806k3763j3686j7022R142J308m5J0155N589K1517J7349n880J0151
16512a5345O183K4452j0958m1375q496L4311J8281K100l4203l6804K0536n646
16500d6964J7408p992k0384J8888J8174j5610j4215m53J2299J4844l3664K9904
16488b7765K6690j8107l1389N702O804J7009L4348J976k1287j9337K560k9005
$$ plain form
16571 36989 20075 13292 -15515 -63884 -36526 -17987 -7799 -13989 21866 68344 78627 94683
16559 94683 127528 230529 334638 385422 323814 219728 116357 74160 35717 33834 55893
16548 55893 77373 125192 152669 198499 248374 351729 438848 400073 258426 169242 103490
16537 103490 86843 67739 45171 43366 31434 49836 44197 66386 74897 47819 33535 3646
16525 3646 -30160 -53923 -67609 -84631 -75489 -74181 -74226 -64071 -58482 -36965 -19616 -25496 -15345
16512 -15345 -9162 15290 4332 -37043 -45539 -11228 7053 9153 -25050 -61854 -41318 -46964
16500 -46964 -29556 -37548 -57932 -39044 -20870 -36480 -50695 -51148 -38849 -24005 -57669 -27765
16488 -27765 -1075 -19182 -50571 -44869 -38065 -21056 13292 15268 -6019 -25356 -22796 -51801
16476e1801J227j3275j4472o622l374J1091k2o711j8984Q598M4143J5830p560
16463d1932J1208j8847J0333J3452P30J3612M3008L6799j9574n0875k1264k3169
16451d6519n103j676J2424L0833J2511k1198k9606j326Q96M558J0329l5557j8597
16438h8031K3595L4123K6907m349o089K3119J2180k1075k4627l5421n039K3528
16426d1179j3561j7192L1011r706r879J9214k7272J2503N411l040M0199J1184
16414b307p589n850j7807K3423k018R054l09J7053r711k6441k5121q300K2475
16401c3448K6508L902k6226r319p108K7188k08j7278K6676l5851o0973K9596N0032
16388b6509J2506R992K4362P785P892m0020l0933m29K4897q928J1710J4506J5608
$$ plain form
16476 -51801 -50574 -63849 -78321 -84943 -88317 -77226 -77248 -83959 -102943 -94345 -50202 -34372 -41932
16463 -41932 -30724 -49571 -39238 -25786 -25056 -11444 31564 68363 48789 -2086 -23350 -46519
16451 -46519 -51622 -53298 -40874 -10041 2470 -18728 -48334 -49660 -48764 -44206 -33877 -69434 -88031
16438 -88031 -64436 -30313 -3406 -7755 -13844 9275 21455 380 -24247 -59668 -64707 -41179
16426 -41179 -54740 -71932 -40921 -50627 -60506 -41292 -68564 -56061 -50650 -53690 -13491 -2307
16414 -2307 -9896 -15746 -33553 -10130 -12148 -3094 -3403 13650 3939 -22502 -47623 -55923 -33448
16401 -33448 -6940 -3038 -29264 -38583 -45691 -18503 -18711 -35989 -9313 -45164 -106137 -76541 -26509
16388 -26509 -14003 -4011 20351 28136 36028 -3992 -34925 -35354 -10457 -19385 -7675 6831 22439
16375B2439l992r170J7464L2078K3125j8401l8760l4279j5313J4732n648k6916
16363d2641p124J511j392M854K6851K9150l540k3757m9722K6414N686P284N3k4638
16349e1011m292L1658K3012n3616j5695K6838O934j4520K801k4078j4748k1312
16337a08029q51K5857O574k7000K8756L3923J5413k0810j3533K7817K5854j5078
16325b1107j7733L170R303L514j1822j1657M405M5889J2921l2762l753k6798k8328
16312g4758L5817J9425N519j955j7322l0459K2856L8458L130p061k4953k1639
16300e2942J1609P163J3492O570L104L7490J3770l8584N4K2474j4794l5907j0997
16287c7498J6008j5314j4611j6958J5605j2518l115L435K5967M9204J6253n2094
$$ plain form
16375 22439 18447 9277 26741 58819 81944 63543 24783 -9496 -24809 -10077 -15725 -42641
16363 -42641 -49765 -48254 -49646 -44792 -17941 11209 7669 -16088 -65810 -39396 -33710 -26426 -26373 -51011
16349 -51011 -55303 -23645 -633 -54249 -69944 -43106 -36172 -50692 -47891 -71969 -86717 -108029
16337 -108029 -108880 -83023 -76449 -103449 -74693 -40770 -25357 -46167 -59700 -31883 -6029 -21107
16325 -21107 -38840 -35670 -26367 -22853 -34675 -46332 -41927 3962 16883 -15879 -19632 -46430 -74758
16312 -74758 -38941 -19516 -13997 -15952 -33274 -63733 -40877 -2419 711 -6350 -31303 -52942
16300 -52942 -41333 -34170 -20678 -14108 -11004 26486 40256 1672 1726 24200 9406 -26501 -37498
16287 -37498 -21490 -36804 -51415 -68373 -52768 -65286 -68401 -64966 -38999 10205 26458 -25636
16275b5636j1887Q43J4921n22j2029K434J1945m87M882J446k111r849j488j1268
16261c8806j729J5188l583J8407N239n087J5381j4254r933j252j2527j1393j2174
16248e6523r806P142m920L3395K3236K0952k7758j513l620K3538k1254j0906p077
16235c5114P492M1930R580k2245n937l4222j8208j6422m104K1746L5388K504j2259
16222b9871j8933O381J0299L3005k807k052r91r759j7136j7270K1824J2202k8320
16209d3428K327J4270j2036R604M1227Q274K5071j2089n2506K1213k807p726J2123
16196C517L366k711L001o342J8675j3957n3578R220L9630M421j6188j1971j0260
16183c3177q786J2718J6706R622k5606j0413j7391L3395J7886Q341J656k2784
$$ plain form
16275 -25636 -37523 -36680 -21759 -22281 -34310 -31876 -19931 -20418 -15536 -14090 -16201 -26050 -27538 -38806
16261 -38806 -40535 -25347 -28930 -10523 -5284 -10371 5010 -9244 -19177 -20429 -32956 -44349 -56523
16248 -56523 -66329 -59187 -64107 -30712 -7476 13476 -14282 -15795 -19415 4123 -17131 -28037 -35114
16235 -35114 -27622 14308 23888 1643 -4294 -38516 -56724 -73146 -77250 -55504 -20116 -17612 -29871
16222 -29871 -48804 -42423 -32124 881 -1926 -3978 -4969 -14728 -31864 -49134 -27310 -15108 -43428
16209 -43428 -41101 -26831 -38867 -29263 11964 20238 45309 33220 -19286 1927 -880 -8606 3517
16196 3517 6883 4172 7173 831 19506 5549 -48029 -38809 821 5242 -10946 -22917 -33177
16183 -33177 -41963 -29245 -12539 -2917 -28523 -38936 -56327 -22932 -5046 3295 4951 -17833
16171a7833k1160m3082k9609M8655J6204L0436M1581q995k6897j5603k2473j016
16159d9792K8270J1575N382k4081j0401J6236J2353K6632k3469k7277j857j2257
16147d8686j2719k8357J0884J8475q805R14J305m786k224L9685K0682O189N1042
16134D3599p969k4764l2137j6053R218J2229j3966j0204n3404J5745p2K1881M5771
16121a0126q57j9051J5302K3098j9280l6361j6480k7481R056N1635j5975k172
16109d8692K1467k5863j0576K2179O874R707j4719k9158L0836J1652k9538L350
16097e2481K3461J8403m2736j5575l4643J9535M7051J3975Q46j4403l1097j1218
16085g8882k0298L2609m112K4626K3843j888k4421l0435N27J5679o833R982j1214
$$ plain form
16171 -17833 -38993 -82075 -111684 -63029 -46825 -16389 25192 16197 -10700 -26303 -48776 -49792
16159 -49792 -21522 -9947 -4565 -28646 -39047 -22811 -10458 16174 -7295 -34572 -36429 -48686
16147 -48686 -61405 -89762 -78878 -60403 -69208 -68294 -66989 -71775 -73999 -34314 -13632 -7443 43599
16134 43599 35630 10866 -21271 -37324 -28106 -15877 -29843 -40047 -93451 -77706 -77778 -55897 -10126
16121 -10126 -10983 -30034 -14732 8366 -10914 -47275 -63755 -91236 -82180 -30545 -46520 -48692
16109 -48692 -27225 -53088 -63664 -41485 -34611 -24904 -39623 -68781 -37945 -26293 -55831 -52481
16097 -52481 -29020 -10617 -53353 -68928 -103571 -84036 -36985 -23010 -22164 -36567 -67664 -78882
16085 -78882 -99180 -66571 -70683 -46057 -22214 -24102 -48523 -78958 -78431 -62752 -69585 -59603 -70817
16072g0817k8089j708N8477R809k6242P825J9017m333m3188J4761K0381j8732
16060f2839J4319J2693K2170k711q5K0437O97P351j2833l5062j9480j8748O693
16047f7398L9521L6188k6778k7214k2733R82n191j3094L1017j3791L769K8137
16035c6585j7478p115N670M4959J2897m563Q694L025k2286R845K6978j2390j3115
16022a464m955j0934L2897P970k6139k2709p755L370K250j4007n029J537l0404
16009g5372J1434Q383K1452M1754N173m5832k4398K103K9338M0888p665l3139
15997b5881R00K2329L960l062j840l8167K5955J3669P853J6430k586J783l7391
15984a6048K669K0033j8455p176j4909n418k3232k108j3646j4880j0336L4009
$$ plain form
16072 -70817 -98906 -100614 -42137 -32328 -58570 -50745 -31728 -36061 -79249 -64488 -44107 -62839
16060 -62839 -48520 -35827 -13657 -16368 -16453 3984 4681 12032 -801 -35863 -55343 -74091 -67398
16047 -67398 -27877 8311 -18467 -45681 -68414 -67432 -72623 -85717 -54700 -68491 -64722 -36585
16035 -36585 -54063 -61178 -55508 -10549 2348 -2215 6479 9504 -12782 -2937 24041 11651 -1464
16022 -1464 -6419 -17353 15544 23514 -2625 -25334 -33089 -29719 -27469 -41476 -46505 -44968 -75372
16009 -75372 -63938 -55555 -34103 7651 12824 -33008 -57406 -55303 -25965 14923 7258 -25881
15997 -25881 -24981 -2652 1308 -1754 -3594 -41761 -15806 -2137 5716 22146 19560 21343 -16048
15984 -16048 -13379 6654 -11801 -18977 -33886 -39304 -62536 -64644 -78290 -93170 -103506 -69497
15972f9497J2087k566P124K106k8168L5387L5253k7533j1312K6536J6769J1724
15960G910J8506K171l4293j5338n972J4565j4670J1043j1782J906J4105j0075
15948b1924r807J4886J4583q339J6164L5060k7934j0142L1798L361j1836k0302
15936E568k835j6218k2660K8407K9518r253j6235k1179l2328L2965K8277j4038
15924a0011p323M088k8120p178J5858j4449K8456J392J7327K9026k3098m2822
15912c6854k9211j0089J5248R492J4659N020K6713J7768n773J502j3445l0330
15900c5300L496l241M26j4542j6999J6684j0132m259M597K7746M088p315p533
15887d2284J2572K575L862N848k7894J4268K0606J3977j4302j7124O048L2188
$$ plain form
15972 -69497 -57410 -59976 -52852 -50746 -78914 -43527 -8274 -35807 -47119 -20583 -3814 7910
15960 7910 26416 28587 -5706 -21044 -27016 -12451 -27121 -16078 -27860 -25954 -11849 -21924
15948 -21924 -31731 -16845 -2262 -10601 5563 40623 12689 2547 34345 37706 25870 5568
15936 5568 2733 -13485 -36145 -7738 21780 12527 -3708 -24887 -57215 -24250 4027 -10011
15924 -10011 -17334 -13246 -41366 -48544 -32686 -47135 -18679 -17287 40 29066 5968 -36854
15912 -36854 -66065 -76154 -60906 -51414 -36755 -31735 -5022 12746 6973 8475 -4970 -35300
15900 -35300 -31804 -35045 -34619 -49161 -66160 -49476 -59608 -63867 -59270 -31524 -27436 -34751 -42284
15887 -42284 -29712 -27137 -23275 -17427 -45321 -31053 -10447 3530 -10772 -27896 -21848 10340
15875A0340r136L664j2741J1330l4913l6264J8979K3710j1408j8469K5943j9119
15863d8084j6832M3281K5589j1798q503K118N404m7435O080N2633J7195k8027
15851h379l2331j9201J7888J1768K131m902J5196M938j7731j4770j1219k1389
15839g8001L5180J7122K6400K907p146j7305j3800o982J2751k9607M851L3631
15827a9999L664J9630L326k2565Q851j2063J7615N025j1775o394R152k1924q298
15814c5755l407J130L7700L8369j5864k9480p046k0940k4683M067L2581K4306
15802I78K793Q894L5157J0549j5180j8715l0344l2564J5867N816K2107M0950p829
15789C8479q831j5771k2623j8969Q525K9509Q451r561l2897k635J5218j6322l4551
$$ plain form
15875 10340 1204 4868 -7873 3457 -31456 -67720 -48741 -25031 -36439 -54908 -28965 -48084
15863 -48084 -64916 -21635 3954 -7844 -16347 -14229 -8825 -56260 -50180 2453 19648 -8379
15851 -8379 -40710 -59911 -42023 -30255 -28124 -33026 -17830 -12892 -30623 -45393 -56612 -78001
15839 -78001 -42821 -25699 701 3608 -3538 -20843 -34643 -41625 -28874 -58481 -53630 -19999
15827 -19999 -16335 3295 6621 -15944 -7093 -19156 -1541 3484 -8291 -14685 -5533 -27457 -35755
15814 -35755 -39162 -38032 -332 38037 22173 -7307 -14353 -35293 -59976 -55909 -23328 978
15802 978 3771 12665 47822 58371 43191 24476 -5868 -38432 -22565 -16749 5358 46308 38479
15789 38479 29648 13877 -8746 -27715 -19190 10319 18770 9209 -23688 -26323 -11105 -27427 -61978
15776f1978J7839O515j9283j7759N2236L4850j3921P136k4813k5567k7220L713
15764f8252L6541O380j2694O66K8780J3564J6447l0199p607k655j5231J9017J2369
15751b874n276N269k8027m160L4968p19O689k6537o483j8155j2250L9594k078
15738b0039r194J6123K0424j5637k7621K3546L8470K801j0441j7728K859L8905
15726D2468j1176k5991J1863k296j6920j2724j6514K478j3708J6227r615K9705
15714f203J1715k3100j0738j721k6150J4908Q815J6672N404K0414J2405p755l215
15701A1451J131k839k6993j2782k369P092L7119k0392m2543J3325L1431r576J565
15688a4380R768j6993k4137K520j0573j182K5790J0848p756N507K5951k5247o57
$$ plain form
15776 -61978 -44139 -37624 -56907 -74666 -22430 12420 -1501 5635 -19178 -44745 -71965 -68252
15764 -68252 -31711 -25331 -38025 -37359 -8579 4985 21432 -8767 -16374 -19029 -34260 -15243 -2874
15751 -2874 -8150 -2881 -30908 -35068 -100 -819 5870 -20667 -27150 -45305 -57555 -17961 -20039
15738 -20039 -29233 -13110 7314 -8323 -35944 -12398 26072 28873 18432 704 3563 42468
15726 42468 31292 5301 17164 14868 -2052 -14776 -31290 -28812 -42520 -26293 -35908 -6203
15714 -6203 5512 -17588 -28326 -30047 -56197 -41289 -32474 -15802 -10398 10016 22421 14666 11451
15701 11451 12582 9743 -17250 -30032 -32401 -25309 11810 -8582 -51125 -37800 -6369 -15945 -14380
15688 -14380 -4612 -21605 -45742 -43222 -53795 -54977 -29187 -18339 -26095 -20588 5363 -19884 -20541
15675b0541M1185J936j813o6179j8964L3738j5975k4111M3039M7548K1402l383
15663C7882m2946m5002L1109K1980m6611j3796P890L4038J2235M05L456Q640p300
15650A980n577k306j1501m614K179L851J2984J6430K0382L4k3350j9631J1765
15637B626K853m679J1893j7465l7374K4946K1604j6522l3767r783K3415j1988
15625d4241P720K7118L8614K286l725Q516j2206J1153N2612q489l5287n0334k5247
15612c1510K5300K2708j132J2931J2997j847o822k6101O513P101m1924R091K1631
15599H936J375k1317N649J3986R917l6373j0088j4041k1543j9164K0769J7943
15587d3951j7080l1134N0364M9086Q703k2784j1403J0774j9229J0229J1675L165
$$ plain form
15675 -20541 20644 22580 20767 -45412 -64376 -30638 -46613 -70724 -27685 19863 41265 37882
15663 37882 -5064 -50066 -18957 3023 -43588 -57384 -49494 -15456 -3221 -2816 640 9280 1980
15650 1980 -3597 -5903 -17404 -22018 -19839 -15988 -3004 13426 33808 33842 10492 -9139 2626
15637 2626 5479 800 12693 -4772 -42146 -17200 4404 -12118 -45885 -55668 -32253 -44241
15625 -44241 -36521 -9403 29211 31497 27772 36288 24082 35235 87847 79358 44071 -6263 -31510
15612 -31510 -6210 16498 15366 28297 41294 39447 32625 6524 13037 20138 -21786 -12695 8936
15599 8936 10311 -11006 -5357 8629 18546 -17827 -27915 -41956 -63499 -82663 -61894 -43951
15587 -43951 -61031 -92165 -41801 7285 15988 -6796 -18199 -7425 -26654 -16425 -4750 -1585
15575a585L882k4013r722K2261O572n079J8838K751j8029j3600J7762J3283J8868
15562C2189K858l8631M697m64j5347J5301m400K0177N0222j0733l0819j3679m1611
15549c0240j3071K575j2655K1329k4509q988K935J541M7805J6356m950k9199j4246
15536d5317J0146r920J0893J0227J7703j487K4566J5003q136o401k2896r535O413
15523h741P311L6946k1527n3970j6398K6649J3410J7314j0583k6925p255K922
15511d0847J9094j7513N891J3470K1750P590j6167k0958J3519L4459J5286l2001
15499C573r809m388K462l396j7490j7198O92L011l335J9855L1845J5207j0487
15486A0542l9602j1681o371M7810M2405j0928j0976K3729K0120l2854n4384k5637
$$ plain form
15575 -1585 2297 -21716 -31438 -9177 -2605 -7684 11154 13905 -4124 -17724 38 13321 32189
15562 32189 35047 -3584 1113 649 -14698 603 -3797 16380 66602 55869 25050 11371 -30240
15549 -30240 -43311 -40736 -53391 -32062 -56571 -65559 -62624 -61083 -13278 3078 -1872 -31071 -45317
15536 -45317 -35171 -45091 -34198 -23971 -6268 -7755 16811 31814 23678 17277 -5619 -15154 -8741
15523 -8741 -1430 35516 13989 -39981 -56379 -29730 -16320 994 -9589 -36514 -43769 -40847
15511 -40847 -21753 -39266 -33375 -19905 1845 9435 -6732 -27690 -14171 20288 35574 3573
15499 3573 -6236 -10624 -8162 -11558 -29048 -46246 -45554 -42543 -45878 -26023 5822 21029 10542
15486 10542 -29060 -40741 -47112 698 43103 32175 21199 44928 65048 32194 -22190 -47827
15474d7827K9767j2598K4362K5519j765K94j2578j2601m99J2630j9246N499R657
15461F14J4215J4979l6941l5062M317J3945k2757J1561J3325J1877j5953l103
15449b8983N0217o898J4596R90k0815J2871K9762l9871j0955Q146J515P048j0805
15436F818k0108k8665k3880K5675j3099J3365j7865l7737K7595L981J0542N1896
15424a482O036j4r599Q582M518J2588l0207j578L680k8616m307K8390K3582K3797
15410C5370O228l3109l6267q144k906N104O941K725R470p026j6993N836M4027
15397A1256N1759j4107M624Q672j1638m0831o687k463O662J6829p456k1876j1441
15384a6697J8752j6102o829J0082O231r576k2883J7760q764k0188J6308K7382
$$ plain form
15474 -47827 -18060 -30658 -6296 19223 17458 17752 5174 -7427 -7926 4704 -14542 -9043 614
15461 614 14829 29808 -7133 -42195 -37878 -23933 -46690 -35129 -21804 -9927 -25880 -28983
15449 -28983 21234 14336 28932 29922 9107 21978 51740 11869 914 9060 10575 17623 6818
15436 6818 -13290 -41955 -65835 -40160 -53259 -39894 -57759 -95496 -67901 -63920 -53378 -1482
15424 -1482 4554 4540 -5059 3523 8041 20629 -9578 -11156 -7476 -36092 -40399 -12009 11573 35370
15410 35370 41598 8489 -27778 -35922 -38828 -33724 -26783 -24058 -14588 -21614 -38607 -32771 11256
15397 11256 63015 48908 53532 62204 50566 9735 3048 585 7247 24076 16620 -5256 -16697
15384 -16697 2055 -14047 -20876 -10794 -4563 -14139 -37022 -19262 -28026 -48214 -31906 -4524
15372d524L387k298K1351o540j3543l022K5537r139n054k9623K849K0511J423
15359A315k6232j7108J2807K6831l628j5465R569l7778j3780K1402n034M749R263
15346c3089J2738j961k452M3063L0646k9565m248J1920O994Q063k7491J0415p679
15333A7354r286K5461J3960J8536j9021o0802Q395Q696R628K8353j20l4160j1704
15320d710O464l562o946J0624N927P058K8968j9997j6424j3913L790N478N690
15307H447j9784L3034J0684j8936j5874j9275J696K4973m360L042J3861j3776
15295C732l7768n313K0018J4526k085M0461N977j5575r151L555j7764r223j7047
15282b5657l0628r955Q416k313J5064L0038k240l1550n9M599O33N3618J5012k8041
$$ plain form
15372 -4524 -1137 -3435 17916 11376 -2167 -5189 20348 11209 6155 -23468 -20619 -108 1315
15359 1315 -24917 -42025 -29218 -2387 -6015 -21480 -11911 -49689 -63469 -42067 -47101 -42352 -33089
15346 -33089 -20351 -22312 -24764 18299 48945 19380 15132 27052 34046 42109 14618 25033 17354
15333 17354 8068 33529 47489 66025 47004 -13798 -5403 3293 12921 41274 41154 6994 -4710
15320 -4710 1754 -1808 -8754 1870 7797 14855 43823 23826 7402 -6511 -2721 2757 8447
15307 8447 -11337 21697 32381 13445 -2429 -21704 -20008 4965 605 3647 17508 3732
15295 3732 -34036 -39349 -19331 -4805 -6890 33571 39548 23973 14822 18377 613 -8610 -25657
15282 -25657 -56285 -66240 -57824 -60137 -45073 -15035 -17275 -48825 -48884 -44285 -43652 9966 24978 -3063
15268c063m407k2505k190J254K2492L6383k2261K234K0078J9898j43k8082l7727
15255a8039j7153M0923P321j8200l1275k9009K302P415J4862P768L255j928J0383
15242b1375L0604M162Q637k1775k0700m577p931n943k3687L690M552L755J1405
15229c9183J8973m1762j6572J6785K8947J2635J2322K91O619k6529J4162j6652
15217b9964l529o282J4776k3379j494R022K1040K9212L449j704m3293J903J914
15204b8329J398J2237L2944r618J0692l5236l4976M829Q003L8656J3700j9794
15192e494k64K54K694K9899j2712n3044l5240J1861K4684J393j4418J3773J370
15179c5244j728J4524k9054M0858K6748n7103l774M7334J8527K131j4684j9661
$$ plain form
15268 -3063 -7470 -29975 -32165 -30911 -8419 27964 5703 7937 28015 47913 47770 19688 -18039
15255 -18039 -35192 5731 13052 -5148 -36423 -65432 -63130 -55715 -40853 -33085 -29830 -31758 -21375
15242 -21375 9229 13391 22028 253 -20447 -25024 -32955 -38898 -62585 -58895 -54343 -50588 -39183
15229 -39183 -20210 -61972 -78544 -61759 -32812 -20177 -7855 -7564 -945 -27474 -13312 -29964
15217 -29964 -33493 -39775 -24999 -48378 -49872 -40850 -19810 9402 12851 11147 -32146 -30243 -28329
15204 -28329 -26931 -14694 18250 8632 19324 -15912 -50888 -46059 -38056 600 14300 -5494
15192 -5494 -5758 -5504 -2810 27089 14377 -38667 -73907 -62046 -37362 -35969 -50387 -36614 -35244
15179 -35244 -36972 -22448 -51502 -10644 16104 -40999 -44773 2561 21088 23219 8535 -11126
15167a1126r150l782K4166J4356J8794M4225K9247k7397m5061m0936J0465L684
15155G485O125p269k9972K2608p18l794p649k0776L2334j3123J0530L2809K0160
15142D8750q653j7401m61n483l9401l3733K553k4528P826L5302P760k4350l573
15129e5392K6413J3278K3631K0760M825j3341l1573k4602m861J429J4971j913
15117b6375q966N090J9517O735R902J1079J8183k774j9475M198m957l248L8624
15104D7533j1847k2662j0547j21N738j8900n3251l344L8766K3593r866J3190J5047
15091A3329K821l7943R44J8654R791L960j9883k00j3081l1155p658O2183J9278
15078B1040j0672N11R485R833j8031K7207J7666%k007Q172k4888j4652j2368l470
$$ plain form
15167 -11126 -20276 -24058 108 14464 33258 77483 106730 79333 34272 -6664 3801 7485
15155 7485 13610 6341 -23631 -1023 -1741 -5535 -13184 -33960 -1626 -14749 -4219 28590 48750
15142 48750 40097 22696 22235 16752 -22649 -56382 -53829 -78357 -70531 -35229 -27469 -51819 -55392
15129 -55392 -28979 -15701 7930 28690 33515 20174 -11399 -36001 -40862 -39433 -24462 -26375
15117 -26375 -35341 -30251 -10734 -3999 5903 16982 35165 32391 12916 17114 12157 8909 47533
15104 47533 35686 13024 2477 2356 8094 -10806 -64057 -67401 -28635 -5042 -14908 -1718 13329
15091 13329 16150 -21793 -20849 -2195 7596 11556 -8327 -8527 -21608 -52763 -60421 1762 21040
15078 21040 10368 10879 20364 30197 12166 39373 57039 57039 55032 63204 38316 23664 11296 7826
15064G826J3196j6891m1826K8328M7984O327m3100j1712O225Q50j996M100J9155
15051A8466j1946k899J7729k47J5210J2842j9510L074k0488j0690K6737p19O728
15038C4287m048M161j7910J824m496j3048j981O280K0999K3380j5663j9776J0640
15025B4649J2232N740O994j3158J3135N0326k0375o821J1709l5152r432M2241
15013H2088N603K6768M8744m842J6036N8612Q7383J61127K17061K80804N29606
15002A508990J127996J880169P91634j577042j622198p72484l83267k63141j72687
14993E17970j27459q8423m5396m8423k4792J431j5035n8461l868L3488k609j7636
14981A20787k3730k7696l3524K1414J0974J6674J1908p238J6024j3722j3194J144
$$ plain form
15064 7826 21022 4131 -37695 -9367 38617 44944 1844 -9868 -3643 -2793 -4789 -689 18466
15051 18466 6520 3621 21350 21103 36313 49155 29645 32719 12231 1541 28278 27559 34287
15038 34287 30239 34400 16490 18314 13818 770 -1211 5069 26068 49448 33785 14009 24649
15025 24649 36881 42621 49615 36457 49592 99918 79543 72722 84431 49279 39847 82088
15013 82088 87691 114459 163203 158361 174397 233009 320392 481519 698580 979384 1508990
15002 1508990 2636986 4517155 5308789 3731747 2109549 1337065 953798 690657 517970
14993 517970 390511 302088 256692 208269 183477 184908 169873 111412 107544 141032 138423 120787
14981 120787 97057 69361 35837 57251 68225 84899 96807 89569 105593 91871 78677 79821
14969G9821k6198N348j7430J4469K2732j4951o869q013j568j3253l3169j4706
14957a3787Q609K0849K4952J8227K584m466k9694K109J8682k833K563P851j9626
14944C6020k2555k8167N409K718L93M304j973l571j499M1697K8630k256j7400
14931D1750j0292k6492k9288M305M411K5480L6490L2397J3164m1597l9839l8670
14919b8181j672M1911K1067J1906m3836l141K177j8175j1358K6592j1630n833
14907b0173L833r442k0424j3517J1602M667j688J5497j3356K2910K2046j5831
14895a3876k4896j1895m602J1292J4355J4146K4374q330p146N88j2163l5399R703
14882d3849K0937j0677K4894L3060J7802J8667j8233k9666K7025k8743k8820R938
$$ plain form
14969 79821 53623 58971 41541 56010 78742 63791 56922 48909 47341 34088 919 -13787
14957 -13787 -5178 15671 40623 58850 61434 56968 27274 29383 48065 45232 47795 55646 36020
14944 36020 13465 -14702 -9293 -6575 -6182 -1878 -3851 -7422 -8921 32776 61406 59150 41750
14931 41750 31458 4966 -24322 -20017 -15606 9874 46364 78761 91925 50328 10489 -28181
14919 -28181 -29853 12058 33125 45031 1195 -1946 231 -17944 -29302 -2710 -14340 -20173
14907 -20173 -16340 -25782 -46206 -59723 -48121 -43454 -45142 -29645 -43001 -20091 1955 -13876
14895 -13876 -38772 -50667 -55269 -43977 -29622 -15476 8898 568 -6578 -5990 -18153 -53552 -43849
14882 -43849 -22912 -33589 -8695 24365 42167 60834 42601 12935 39960 11217 -17603 -7665
14870g665j4465k124J5446P791l620k9877k5829m769L433J7011J1751K1813K0681
14857I577L71J1872Q875j3673k0594J1614r823k0940J4737m51j1669j3490j0648
14844d4242K5633J9906J8568L0293j2234l8484k1909k9667O767J1013j1886L0832
14832a5410O348N720O159p059j7952k3216K2278J036k1507j0622N997J8336P158
14819b2734J9853o439j3196j2079J8241M9122L265q247k5789P721j2709l5201
14807c8192L532K2335l8333K4077J7065P716Q412K4032k1276p547K4593L2139
14795E8553k1175k2541m4676l169K1840J3487m630j1799J8431K9522J397L016
14783C8256l4856k1995P934J3522L4562P758l769j2826P702J6589j7780k3359
$$ plain form
14870 -7665 -22130 -24254 -8808 -1017 -4637 -34514 -60343 -65112 -61679 -44668 -32917 -11104 9577
14857 9577 9948 21820 30695 17022 -3572 8042 -1781 -22721 -7984 -8435 -20104 -33594 -44242
14844 -44242 -18609 1297 19865 50158 37924 -560 -22469 -52136 -45369 -34356 -46242 -15410
14832 -15410 -9062 -3342 2817 -4242 -22194 -45410 -23132 -22096 -43603 -54225 -48228 -29892 -22734
14819 -22734 -2881 -9320 -22516 -34595 -16354 32768 36033 27786 1997 9718 -2991 -38192
14807 -38192 -34660 -12325 -50658 -26581 -9516 -1800 6612 30644 9368 1821 26414 58553
14795 58553 37378 14837 -29839 -33008 -11168 2319 -2311 -14110 4321 33843 35240 38256
14783 38256 3400 -18595 -10661 2861 37423 45181 41412 28586 36288 52877 35097 11738
14771A1738o3423o354P063O514K7712K1073o877M4721j0150l1522P17j4188m4235
14758e7211p435K1406K4840Q866J0145J2033P099j4588j4610O787K6096J4306
14746C7734M958m985m8746J390j8665M259Q013l2555M2134N5541n0217n3588J389
14733e3338L5844L5461M647j0567J9381O570k8833J8518K5588k0361j1276j2366
14721I268k6343j5189n966J3947J9792k411j436J3297J2877k3504m2450k844j503
14708e2465J6834K8303k378j0070q558j0050J2151J7690L0792J4891k0246l1946
14696a5052j3189P634K3502J0954J7554O525k622k6012j4376l3379j3660P799
14684d4322K3202Q1493N282k4002k0476M776J8855Q210j569l2139J0694j593k4129
$$ plain form
14771 11738 -51685 -58039 -50976 -44462 -16750 4323 -2554 42167 32017 495 1212 -12976 -57211
14758 -57211 -64646 -43240 -18400 -9534 611 12644 19743 5155 -9455 -2668 23428 37734
14746 37734 42692 37707 -11039 -9649 -28314 -24055 -16042 -48597 -6463 49078 -1139 -54727 -53338
14733 -53338 -17494 17967 22614 12047 31428 37998 9165 27683 53271 32910 21634 9268
14721 9268 -17075 -32264 -38230 -24283 -4491 -6902 -8338 4959 17836 -5668 -48118 -50962 -52465
14708 -52465 -35631 -7328 -9706 -19776 -28334 -38384 -26233 -8543 22249 37140 16894 -15052
14696 -15052 -28241 -20607 2895 13849 31403 37928 35306 9294 -5082 -38461 -52121 -44322
14684 -44322 -21120 60373 65655 41653 21177 25953 44808 53018 51449 19310 30004 28411 4282
14671D282k0230k0359N289m257K499J6833K5460j5105Q543J5703r810j0037j973
14658c162J6278P067L48r544p0K5259l3554j0705R637J087k1007j100M627k6679
14644d1518o033n229r920L333K3837p91J4326L3513M1164j214l0070k6360Q14
14631d148m2011R150j1302j1294L8726J2272L724J1376j6278J2732K4100j4745
14619A2302L819j5380q689k355K809M798j0264R794j7434L3983M5628k644k1515
14606C4852j2612l6665K835P540J8717j4387j9640o528J0581m186j7673M206J9128
14593a3832o395j5339J8519q06R494O920K168L1403Q415J9531p009j3735k50J858
14579D0942k6596k9558M237J2668M3046J4148k1146P54l2451J6749J7140j5067
$$ plain form
14671 4282 -15948 -36307 -31018 -35275 -32776 -15943 9517 -5588 2955 18658 8848 -1189 -3162
14658 -3162 13116 20183 20531 10987 10917 36176 2622 -8083 1554 2641 -18366 -19466 -14839 -41518
14644 -41518 -47551 -52780 -62700 -59367 -35530 -36321 -21995 11518 52682 51468 21398 -4962 -4148
14631 -4148 -46159 -37009 -48311 -59605 -20879 -8607 -4883 6493 -9785 2947 27047 12302
14619 12302 16121 741 -7948 -10303 -7494 -2696 -12960 -3166 -20600 13383 59011 56367 34852
14606 34852 22240 -14425 -11590 -4050 14667 280 -19360 -25888 -15307 -19493 -37166 -32960 -13832
14593 -13832 -20227 -35566 -17047 -17853 -8359 -1439 729 32132 40547 60078 53069 39334 39084 40942
14579 40942 14346 -15212 -10975 1693 44739 58887 37741 38495 6044 22793 39933 24866
14567B4866l3444J4418Q937p655p731q711j0406l3463j8182K6544N8525o990J3890
14554B0598j3381p391j6155q950K0900J1845K078p002o713L1672k1181m8405j7315
14541e9400J8798J3432R894J2358L392K747j0197k937J7352k3651m8850N514J4256
14528d7292K2650M9147l83m7647l7719N120K4264J6237L2073J8764N7248j7829
14516G4633n1851L703l415o016p354K7049R329k2742p683k1509k3160J3133q206
14503b4089R33M5053Q919j9376n32N480M053n332k3175J4058Q63k1158M113n392
14489a5582J574J4637P296L5225J0978k6871O62O177l4166m5581k6655r684N465
14476g6525L2960O4732K5868L618l0221j5858j1137J590M117J9162R906j3546
$$ plain form
14567 24866 -8578 5840 14777 7122 -609 -9320 -19726 -53189 -71371 -44827 13698 6708 20598
14554 20598 7217 -174 -16329 -25279 -4379 7466 9544 2542 -4171 27501 6320 -42085 -59400
14541 -59400 -40602 -27170 -17276 -4918 -1526 1221 -8976 -11913 5439 -18212 -67062 -61548 -47292
14528 -47292 -24642 24505 24122 -23525 -61244 -56124 -31860 -15623 16450 35214 92462 74633
14516 74633 22782 26485 23070 17054 9700 36749 46078 23336 15653 -5856 -29016 -15883 -24089
14503 -24089 -23156 21897 30816 11440 10908 16388 20441 15109 -8066 5992 6855 -14303 -10190 -15582
14489 -15582 -14008 629 7925 43150 54128 27257 27919 34096 -70 -45651 -72306 -81990 -76525
14476 -76525 -43565 21167 47035 50653 20432 4574 -6563 -4973 -856 18306 28212 14666
14464A4666k0899J2683L5836k9867j4823j2721m702L4475Q448o194R847N44k1352
14451E941k7765k1829K9734N589l3442L969N516K1855j2070m744p299j4848j3908
14438f3301K5174Q593L298L9359J2619j8485l862M617p990l0004k3276K2590L7836
14425G168j8850J2777J9659j345j3632k4260R899M708m360m5413n952K0926L1819
14412f856K0667p581J5470O258n432K436j6490m5980l3999j3817J474L2066N7431
14399E647J4733Q652J2057m1698m8399L2791L9689j2018o727K759n5354r503M241
14386e3130J5700k2492P321K3563O070J2018L838l1497N663L0332K4478N400l4406
14373g142k4396L7664J3440l6952m9995P78M4851L3954J154j0758k5777L3090
$$ plain form
14464 14666 -6233 6450 42286 12419 -2404 -15125 -19827 14648 23096 16902 26749 27293 5941
14451 5941 -21824 -43653 -13919 -8330 -41772 -37803 -32287 -10432 -22502 -27246 -34545 -49393 -63301
14438 -63301 -38127 -29534 -26236 13123 25742 7257 3395 8012 22 -29982 -53258 -30668 7168
14425 7168 -11682 1095 20754 19409 5777 -18483 -8584 -3876 -8236 -53649 -59601 -38675 -6856
14412 -6856 13811 6230 21700 27958 22526 24962 8472 -37508 -71507 -85324 -83850 -51784 5647
14399 5647 20380 29032 41089 -609 -49008 -16217 23472 11454 4727 7486 -47868 -57371 -53130
14386 -53130 -37430 -59922 -52601 -29038 -22968 -10950 -7112 -38609 -32946 -2614 21864 27264 -7142
14373 -7142 -31538 6126 19566 -17386 -67381 -66603 -21752 12202 13356 2598 -23179 9911
14361I911N903Q677K0910k059p718k8861l932N131j3405J3855L0015N856m2337
14348A946k2466j8570q64L3677L2081k0704r386J7130M0617K3892j6208J0702
14336G1847l5838l7146k3102J4357J8056l4540P04L2810J1299k9618K6839J8101
14324C3769R023l2053m5234p281j084M343j7920J6775L4328R447K5257M522j8236
14311A5656j2098K309j0323l943J5156j222n86J0093j7895P086L9787L398k292
14298D5126k3952k6120q790r603O011m548J4678q623n82K3190L6814K230k8791
14285A7040j1830k590J971J7393q154l0680J9600R791l3623k6412j310j975j347
14272e2126L8320Q347J741J0899k9433J9605K0864l422m6483l8658J1647R654
$$ plain form
14361 9911 15814 24491 45401 43342 35624 6763 2831 7962 -5443 8412 38427 44283 1946
14348 1946 -20520 -39090 -39954 -6277 25804 5100 -4286 12844 53461 77353 61145 71847
14336 71847 36009 -1137 -24239 -9882 8174 -26366 -25662 7148 18447 -11171 15668 33769
14324 33769 42792 10739 -34495 -41776 -42860 -38517 -56437 -39662 -5334 4113 29370 33892 15656
14311 15656 3558 5867 -4456 -8399 6757 5535 4949 15042 -2853 4233 44020 47418 45126
14298 45126 21174 -4946 -13736 -23339 -17328 -21876 -7198 -15821 -16403 6787 43601 45831 17040
14285 17040 5210 2620 4591 21984 13830 -16850 2750 12541 -21082 -47494 -48804 -50779 -52126
14272 -52126 -13806 -5459 -3718 7181 -22252 -2647 18217 14795 -31688 -70346 -58699 -49045
14260d9045j9691J102J7818N5526J1351l8006k2159k223M7385K54l4975R688O199
14247a6776k852K8538J3241Q101K7603M572k8565Q271r702k6954j5398m336J6371
14234B114r31j0852m1414j0490R394L80K3852J0071n564l4466j2991l7663J0544
14221i8016M6767J9017L6885J2640j8458J212p53j2819L473R462J1215K1284m8597
14208a6688l5523O47J8980J2071j6210m23N6059N388l1867J9064K2013P484l4388
14195F607k3573K0386N274J931n81p574q587J9089n515j2254j3704L342J063n933
14181b0029k0876o848Q472J1647k3915j0709J6195N668J6158M6568L699m2500
14169a6470j4476J8069M823Q278Q278L4J932J3040p628m4376j4857L0214J9044
$$ plain form
14260 -49045 -68736 -67634 -49816 5710 17061 -20945 -43104 -45327 2058 2312 -32663 -22975 -16776
14247 -16776 -19628 8910 22151 30252 57855 62427 33862 42133 32431 5477 -9921 -14257 2114
14234 2114 1183 -9669 -51083 -61573 -52179 -51799 -27947 -17876 -23440 -57906 -70897 -108560 -98016
14221 -98016 -51249 -32232 4653 17293 -1165 47 -706 -13525 -10052 -590 10625 31909 -16688
14208 -16688 -52211 -51564 -32584 -20513 -36723 -37146 18913 24301 -7566 11498 33511 40995 6607
14195 6607 -16966 3420 8694 10625 10044 2470 -6117 12972 7457 -4797 -18501 -15159 -14096 -20029
14181 -20029 -40905 -47753 -39281 -27634 -51549 -62258 -46063 -40395 -24237 22331 26030 -16470
14169 -16470 -30946 -12877 -8054 224 8502 8536 10468 23508 15880 -28496 -43353 -13139 5905
14156E905j3314j8568J6811J8457J1968r30K6826k0931k7730L1347j3069j0915
14144E857n645j0254J3252K7860K2823k9306k0667P551O365n405j0867l6079k5851
14131f0366n299K1597R250j0495k860k2469J9679L2238N790L5743K8664k4223
14119B7249l6942j4888k66K043J8281r814J3600L7980K4299j8408j4528P646K91
14106C6543m815m962r699J8934J1726j7538K130J2810o1519J3098j914Q100J7842
14093B0736R748j8387K713j3265p246L348R50n201j1068L3637K8839J2946q615
14080D9135o082L1239J5837k6975k2006j4041j4671J6708o096m7333j6536K936
14068c7885P293J8953R222l3857n089K4194M8541K0099m8499k079L1432j4272
$$ plain form
14156 5905 -7409 -25977 -9166 9291 21259 20329 47155 26224 -1506 29841 16772 5857
14144 5857 212 -10042 3210 31070 53893 24587 3920 11471 17836 12431 1564 -34515 -60366
14131 -60366 -65665 -44068 -34818 -45313 -48173 -70642 -50963 -18725 -12935 22808 51472 27249
14119 27249 -9693 -24581 -24847 -22804 -4523 -14337 -737 37243 61542 43134 28606 36252 36543
14106 36543 31728 26766 17067 36001 47727 30189 32319 45129 -16390 -3292 -5206 2894 20736
14093 20736 30484 12097 14810 1545 -5701 -2353 -1403 -6604 -17672 15965 44804 57750 49135
14080 49135 43053 74292 90129 63154 41148 27107 12436 29144 23048 -24285 -40821 -37885
14068 -37885 -30592 -11639 -2417 -36274 -41363 -17169 31372 51471 2972 893 32325 18053
14056A8053l1721o390J9038L4336M801j8340j3906j754K0030J73j8571l851n76
14043A322j9181M910n493O343j2586N042j1672P825l450k734r593L6607K8057
14030B5397K0105J8244k2734k6065k6792K0269R012J2496O122O974j0187k1531
14018A1310o845J7631L5592J7803J073l8585j7167j0310J4650L0962k497l4413
14006A9204l2310k0396J9441k307J4987K7606N064J4030L776n7323p169o094j1581
13993c3072R226J7074O506j1311j8110M5913K7528j1941l5233p487K7110J3223
13981B9426r422k3479L3378L2686m4640l5571J2461J7425j1020k5657N623L2387
13969A3597m89O314l5409o323J3328K6669j0301k0008q259j5574J8779K3180K3174
$$ plain form
14056 18053 -13668 -20058 -1020 33316 38117 19777 5871 4117 24147 24320 5749 1898 1322
14043 1322 -17859 -12949 -18442 -12099 -24685 -19643 -31315 -23490 -26940 -29674 -39267 -2660 25397
14030 25397 45502 63746 41012 14947 -11845 8424 17436 29932 36054 43028 32841 11310
14018 11310 4465 22096 57688 75491 76564 37979 20812 10502 25152 56114 53617 19204
14006 19204 -13106 -33502 -14061 -16368 -1381 26225 31289 45319 49095 -8228 -15397 -21491 -33072
13993 -33072 -23846 -6772 -266 -11577 -29687 16226 43754 31813 -3420 -10907 16203 29426
13981 29426 20004 -3475 29903 62589 17949 -17622 -5161 12264 1244 -24413 -18790 13597
13969 13597 13108 19422 -15987 -22310 -8982 17687 7386 -12622 -20881 -36455 -17676 5504 28678
13956B8678q918J7052k4047k1309J891K0593K5928n547j0455p928j842J2521O97
13943B7314q272J3481m1461m7058O606K3651J8111J6709k0088j8109k5767r9J0571
13930d4411L7391O542k2530J7543K4493K252k5641O449K2691J4618k1835l1263
13918a3701k6648l262J6729K4277j4692k2269m990K744J204q849J1724J3199p491
13905c2025r335J1731J6749K5122R226j8480J5569j910L146R507M301q973o522
13892A8106l222n9099J4265J9571k6255J5917j419l164J0412j1720N378j6150
13880c7380L793j8338k8341k214j0459M387J2680M2231J789J9450K6833r652J3396
13867A8175k7812l088J1974L474R259L3058O29j3062j539j9184Q151m7985n2259
$$ plain form
13956 28678 19760 36812 12765 -8544 -6653 13940 39868 34321 23866 15938 14096 26617 27314
13943 27314 19042 32523 -8938 -55996 -49390 -25739 -7628 9081 -11007 -29116 -54883 -54982 -44411
13930 -44411 -7020 -478 -23008 -5465 19028 21280 -4361 2088 24779 39397 17562 -13701
13918 -13701 -40349 -43611 -26882 -2605 -17297 -39566 -44556 -41812 -40608 -49457 -37733 -24534 -32025
13905 -32025 -41360 -29629 -12880 12242 21468 2988 18557 16647 19793 29300 33601 24628 18106
13892 18106 14884 -44215 -29950 -10379 -36634 -20717 -22136 -25300 -14888 -26608 -21230 -37380
13880 -37380 -33587 -51925 -80266 -82480 -92939 -88552 -75872 -33641 -31852 -12402 14431 4779 18175
13867 18175 -9637 -12725 -751 2723 11982 45040 45669 32607 31068 11884 20035 -27950 -80209
13854h0209M3599M8670J3250m244j9015m5037J4049L3173O971J1987p430J0008
13842B5772K6195J7120M2164k0998k7871n237k667l9028J4528l612l5089R19K5232
13829A7428P276k4856j3131K6642K1017l4563k0311j6881r538j1414L701J6662
13817c7968L5610K827j143J8814j8867L513K7833J2017L648k7332m0218j6256
13805c7522q39J1914L0349J5239k5935k3080j714K8568R454m332j6741M027Q910
13792a702K9524J3043J7031L00j2179j2079m3848l4969J6403L352L4180K1016
13780C0072K296j8792k007R732j6256N216q85n205j7851J126K860j6467M631M1483
13766A9953K4499k182k2341p706n0326q725o365J283k507J8225L7063R689m370
$$ plain form
13854 -80209 -36610 12060 25310 21066 2051 -42986 -28937 4236 11207 23194 15764 25772
13842 25772 51967 69087 111251 90253 62382 57145 54478 15450 29978 26366 -8723 -7804 17428
13829 17428 24704 -152 -13283 13359 34376 -187 -20498 -37379 -46917 -58331 -54630 -37968
13817 -37968 -2358 469 -674 18140 -727 2786 30619 42636 46284 18952 -21266 -37522
13805 -37522 -38361 -26447 3902 19141 -6794 -29874 -31588 -3020 6434 2102 -14639 -10612 -1702
13792 -1702 27822 40865 57896 58196 46017 33938 -9910 -44879 -28476 -25124 9056 30072
13780 30072 32368 13576 11569 21301 5045 10261 9376 4171 -13680 -12554 -9694 -26161 -21530 19953
13766 19953 44452 42270 19929 12223 -38103 -46828 -53193 -51910 -54417 -36192 871 10560 6190
13753F190j2735k913J2513p176J0437q557K2485O194p949q021R559K9548P45j722
13739D8598R65l0319M07J3763J015k0537n010J5632L2369l0431n2559K4090J1495
13726I478J8404N016j5680N180k1643p072l3167Q840R682r418K1419o767j5789
13713c1517K1976o151L0682N5632k6298m5670j4839J3763K3344J4447l3758p202
13701e591m1138p176J2428L3400m000j2248R155j852P097K4562n209R138k9381
13688a0815j5335K8487L1271L228j2876j0786l3582K6079K268k5372j4644Q513
13676b3564R372O2854K5069j9561n070m4440j0777k7810J2998J3287J2800J0630
13664A5788k1398m365L2654M9690K6766n0659n4037j3687J2237o075p165K2567
$$ plain form
13753 6190 -6545 -9458 3055 -4121 6316 -2241 20244 26438 18489 10468 20027 49575 50320 48598
13739 48598 49563 19244 19651 33414 34429 13892 8882 24514 56883 26452 -26107 -2017 9478
13726 9478 27882 32898 17218 22398 755 -6317 -39484 -30644 -20962 -30380 -8961 -15728 -31517
13713 -31517 -9541 -15692 14990 70622 44324 -1346 -16185 -2422 20922 35369 1611 -5591
13701 -5591 -46729 -53905 -41477 -8077 -12077 -24325 -15170 -17022 -9925 14637 9428 18566 -10815
13688 -10815 -26150 2337 33608 36836 23960 13174 -20408 5671 7939 -17433 -32077 -23564
13676 -23564 -14192 48662 73731 54170 49100 4660 -6117 -33927 -20929 -7642 5158 15788
13664 15788 -5610 -9975 22679 72369 99135 48476 -5561 -19248 -7011 -13086 -20251 2316
13652B316K2605n519k8235n284j7764m142K057L7764l90k9083P4094L2313n9500
13639B1232j9632j3483j1737L2859J33k7341M20J7858J3796l7552k3981n373J8982
13626c3819k6497j2028j7505L2114L3616N199j0814J8478N6588J0155m9328m7058
13614d0899L1461J6534J2330J0504M2329J3752j1781l1547j9707l9076p902L9774
13602A5772J5433j0742k2178k2968J1428j011l852p275k404J4723J8111J7807
13590B2844k0988J1061p483l6094l3674k198L0018L4333K2065K8108m793k1978
13578B1221k1883P756P617L234j1795k6384l390L9451K7724L5562j7072n7598
13566D443k5908J025J005j0306Q986K1224Q205L6283J1428l8474l2680k5829K7912
$$ plain form
13652 2316 24921 19402 -8833 -14117 -31881 -36023 -33966 3798 3408 -25675 48419 80732 21232
13639 21232 1600 -11883 -23620 9239 9372 -17969 -17549 309 14105 -23447 -47428 -52801 -33819
13626 -33819 -60316 -72344 -89849 -57735 -24119 -18920 -29734 -11256 45332 55487 6159 -40899
13614 -40899 -9438 7096 19426 29930 72259 86011 74230 42683 22976 -16100 -24002 15772
13602 15772 31205 20463 -1715 -24683 -13255 -14266 -18118 -25393 -27797 -13074 5037 22844
13590 22844 1856 12917 5434 -30660 -64334 -66532 -36514 -2181 19884 47992 43199 21221
13578 21221 -662 7094 14711 17945 6150 -20234 -23624 15827 43551 79113 62041 4443
13566 4443 -21465 -20440 -19435 -29741 -20755 469 8674 44957 56385 17911 -14769 -40598 -12686
13553a2686L6251J4461R284o225k5307n7848M276L8156K0528K652k3803j1647
13541a1908R378j8587R792K7177K1645K7216L364m6291n1685J1315K7921J2135
13529B1472K3565J0393k0622O074J4417J3475r435j2061r069K3913J4871m6942
13517C0051k1822K9746O912j8306N125J7408K0572J5839k8218n0616r443K0578
13505A7826J0j1306L4169R607l7884k0037M2084L219j1349o402j2261K3587J4387
13492D5650j3714L584m610k3681j8326m521j0644K28j0052J9196L272K4560K1504
13479C2446j1413O15l7716j0137K4937J4653j7709n083J351K9636N607l017j5077
13466I093M197J9044K3146K051j8570l5564O266J3419k1002N0532K3521j1831
$$ plain form
13553 -12686 23565 38026 47310 41085 15778 -42070 -37794 362 20890 23542 -261 -11908
13541 -11908 -2530 -21117 -11325 15852 37497 64713 68077 21786 -29899 -18584 9337 21472
13529 21472 45037 55430 34808 40882 55299 68774 59339 47278 38209 62122 76993 30051
13517 30051 8229 37975 44887 26581 31706 49114 69686 85525 57307 6691 -2752 17826
13505 17826 17836 6530 40699 50306 12422 -7615 34469 37688 26339 19937 7676 31263 45650
13492 45650 31936 35520 30910 7229 -11097 -15618 -26262 -26034 -36086 -16890 -13618 10942 32446
13479 32446 21033 21648 -16068 -26205 -1268 13385 -4324 -9407 -8056 21580 27187 24170 9093
13466 9093 13290 32334 55480 57531 38961 3397 9663 23082 2080 52612 76133 64302
13454F4302j200q065j1715j891j2270k4352r581L0056J3901n19q267j8930j3354
13441a885K144J6946L3582M6187k475l1997m7050K854K0488k1010k1374j4004
13429a7594J0971J8073J3378K3468j6490j0586N195j7264j1288J4729q587k5394
13417b1389N1001N189j2225l0173M919K3063j4783J2239Q094m104j3520R663K058
13404B0032m594j8137q850N1260J5275j3229l1131j4715K7739J8343J2345J020
13392E5358k0924l000K5042p679k191j7832K0368N662j180r397k827k4747j9876
13379c223J3392K3043o357j401J1537N2145L1629k5072N486J5916m034r4M137
13366A17104L209N6981O1196J00603J13367J05919J51852K83778M57334N21018
$$ plain form
13454 64302 63102 55037 43322 41431 29161 4809 -4772 25284 39185 38666 30399 11469 -1885
13441 -1885 259 17205 50787 96974 94499 62502 15452 18306 38794 17784 -3590 -17594
13429 -17594 -6623 11450 24828 48296 31806 21220 26415 9151 -2137 12592 4005 -21389
13417 -21389 29612 34801 22576 -7597 -2678 20385 5602 17841 25935 21831 8311 17974 20032
13404 20032 15438 -2699 -11549 39711 54986 41757 10626 -4089 23650 41993 54338 55358
13392 55358 34434 31434 56476 48797 46606 28774 49142 54804 53624 44227 41400 16653 -3223
13379 -3223 10169 33212 26855 25454 36991 89136 120765 95693 101179 117095 113061 112967 117104
13366 117104 120313 177294 238490 339093 452460 558379 710231 994009 1451343 1972361
13356A972361L28742J1870l03195n18158m73208l09530j62804j00869r4616n7911
13346B92682l7272l1440l5042l7839k0644k5024J148K5933k2088j1018j8607l5023
13334D5766k787j2490k2460j4008M3201K6679J7031L5418j2408n8943l1971k3268
13322a0240L8817J5254p884j365k513j1348j3266l7982n350J2727J1393M14R801
13309a542J8628L551o259P813O550K6015J9146l536L190p955O809k4107j035N996
13295E3264r627n264J2458l3372j9171l609K2389L7500J2526k7504k6391n557
13283G642J2100O876q492J6370p305O3582K7635K0277k3208m4968o7105J3181
13271A6585M5085k6025l8303J5865M5951l649R085j9097j8513L2413m001M107
$$ plain form
13356 1972361 2301103 2312973 2009778 1491620 1018412 708882 546078 445209 350593 292682
13346 292682 255410 223970 188928 151089 130445 105421 106569 132502 110414 99396 80789 45766
13334 45766 42979 30489 8029 -5979 37222 63901 80932 116350 103942 44999 13028 -10240
13322 -10240 28577 43831 35947 34582 32069 20721 7455 -30527 -35877 -23150 -11757 -11343 -1542
13309 -1542 17086 20637 14378 22191 28741 54756 73902 70366 73556 65601 72410 48303 47268 53264
13295 53264 43637 38373 50831 17459 -1712 -5321 17068 54568 67094 39590 13199 7642
13283 7642 19742 26618 18126 34496 27191 90773 118408 138685 115477 70509 3404 16585
13271 16585 61670 35645 -2658 13207 59158 55509 64594 45497 26984 59397 55396 59503
13259E9503k0395K1209P828l8332r648k926p17J4120K6077N671k8167k4864L3848
13246D3207J2683j6865L8532J6272j2620j5465O9m9327J473J2972J2939L747R021
13233E6638q979n773J6550k810J6018L2004J8124r919j1958j1079j8199P007O958
13220H4582k8725j5191O399k4530J2301M6850K2671J0234l0726l327L0438p5j1992
13207I8909j6766p002n864J1635j6638k0638J5668J3451J6681K268k6110p691
13195E7903O814m836O798K1483k716j3528k8682o817K7178L5331o66p255O3928
13182A54935K9840J1268r227j2952L7084L3678L4173K0606k3625m6843k3253j2458
13170A93226j7461M2893L3456m2204J6064j2554m8322k5933p298M735P172k243
$$ plain form
13259 59503 39108 60317 68145 29813 20165 17239 16522 30642 56719 62390 34223 9359 43207
13246 43207 55890 39025 77557 93829 81209 65744 65813 16486 17959 30931 43870 47617 56638
13233 56638 47659 41886 58436 55626 71644 103648 121772 111853 99895 88816 70617 77624 84582
13220 84582 55857 40666 47065 22535 34836 81686 104357 114591 83865 80538 110976 110901 98909
13207 98909 82143 75141 69277 80912 64274 43636 59304 72755 89436 91704 65594 57903
13195 57903 64717 59881 66679 88162 85446 71918 43236 36419 63597 98928 98262 91007 154935
13182 154935 184775 196043 186816 173864 210948 244626 278799 299405 275780 228937 205684 193226
13170 193226 175765 218658 252114 209910 225974 213420 165098 139165 131867 136602 143774 141531
13158A41531J6058j7832N634L2303N849K2010Q003l1222m8363M846J3868l6174
13146A16511o5369J2154P7739L1565j6302k9319m2370J1508J646N393J4327j5138
13134A02345j0120n0288J847J8741n682j1586j94n851k0985J7676N648j1033j2882
13121A7636L030L0040O6962m770n4020J7116M6522J2446l339k1745k6718J6286
13109I9446Q132j0128M2955L4951J1874K3262j1012l3039K3973N939k187l2407
13097A61759j2946K0942k2260j9703j8005R07j2485O948j3024J3996L0442M895
13085A41466j2808J1757j4172l5985m575L8404M9701J1224K3968l3k7666n54m1636
13072A39091J6114L2519O0569P6672N1368O7723L5157n065m7733n6097n5382m1491
$$ plain form
13158 141531 157589 139757 145391 177694 183543 205553 213556 182334 133971 138817 152685 116511
13146 116511 51142 63296 141035 172600 156298 126979 84609 96117 97763 103156 117483 102345
13134 102345 92225 41937 43784 62525 56843 45257 45063 39212 18227 35903 41551 30518 17636
13121 17636 20666 50706 117668 112898 58878 75994 122516 134962 131623 109878 83160 99446
13109 99446 107578 97450 140405 175356 187230 210492 199480 166441 190414 196353 194166 161759
13097 161759 148813 169755 147495 127792 109787 110694 98209 105157 92133 106129 136571 141466
13085 141466 128658 140415 126243 90258 85683 124087 173788 185012 208980 208947 181281 180727 139091
13072 139091 155205 187724 248293 324965 376333 444056 479213 474148 426415 370318 314936 273445
13060B73445n1856l2128K9686L8122L2262l6580m810L1206M9895j459l1836O918
13048C02865j865j7213p5541j79357k06491p7359R1088K11538K28038J32134j2249
13037C95588q7795n5884R79P364Q297K7870j0704L3036J9346M0442M0307m822
13025D14024l175j0792k8188l2955n061N464J4437O984j375k4614j786J7466Q802
13012C59231k3998J3341L7478O525K3312K1208K89J7891L0436K7404J3729m061
13000E22785O409L0998J0638m972r250k7696k952J9776R835J5652N5516M8220
12988F74959m667K0901P1779J6502n081j709K0996L6171K9738M3355O345o5j1090
12975H98134J2687R888J784L0415M7558N0715O2353O8662J03501O3611L5981P3403
$$ plain form
13060 273445 221589 189461 219147 257269 289531 252951 248141 279347 329242 327783 295947 302865
13048 302865 301000 283787 208246 28889 -177602 -254961 -163873 47665 275703 407837 395588
13037 395588 307793 251909 252888 260252 268549 296419 285715 318751 338097 378539 418846 414024
13025 414024 410849 400057 371869 338914 333853 339317 353754 360738 359363 334749 332963 350429 359231
13012 359231 335233 348574 386052 392577 415889 437097 437386 455277 485713 513117 526846 522785
13000 522785 529194 560192 570830 565858 556608 528912 525960 545736 555571 571223 626739 674959
12988 674959 670292 691193 762972 779474 774393 772684 793680 829851 859589 902944 909289 909224 898134
12975 898134 910821 920709 922493 952908 1000466 1051181 1113534 1182196 1285697 1349308 1385289 1458692
12963A458692L7649K2612M8394O6424M8270M2397P8491J05497J30497J41869J39711
12952B320503J65976J25100J38595J33170J44645J84655K01768J67629J63164
12943C745205K05143K45382K84851L73113M34709M96757N70593O20841P37760
12934G714354Q61900J071051J306496J581669J920016K509850L252784M204872
12926B4422992N480855P095698R390767J3008422J9110948L0230218N0033224
12919A58773124Q0918881J09112316Q9103451K5307520l7735637r6400270j03484817
12912B25594568p2074821m3861115k7230081j7869925j2383604r211644p242673
12905C5720705n777963m573992l630213k937131k416050k046872j702387j464094
$$ plain form
12963 1458692 1496341 1518953 1567347 1633771 1682041 1724438 1802929 1908426 2038923 2180792 2320503
12952 2320503 2486479 2611579 2750174 2883344 3027989 3212644 3414412 3582041 3745205
12943 3745205 3950348 4195730 4480581 4853694 5288403 5785160 6355753 6976594 7714354
12934 7714354 8576254 9647305 10953801 12535470 14455486 16965336 20218120 24422992
12926 24422992 29903847 36999545 46390312 59398734 78509682 108739900 158773124
12919 158773124 239692005 348804321 437907772 463215292 425479655 329079385 225594568
12912 225594568 153519747 109658632 82428551 64558626 52175022 42963378 35720705
12905 35720705 29942742 25368750 21738537 18801406 16385356 14338484 12636097 11172003
12897A1172003j293088j086697q73638p60459o82401n93565n58810m96121m47843
12888D379381m44401l75140k79151k53035k32627k14468j80078j29338p0894n9297
12878B140952q3119q5337j00017j07010r0233p9713p1248j09819j23932p8455
12868A212069l3853m719j4933J0841j174J8931n333l8387n5954r3138r4235l7945
12856H62170n8291q5631j2894K4011K3580L6293p7002n4695m1764k6908n1239
12845E37630l8076J1776K2051k7232o6398L353L405m8257k6408k6338k0205Q970
12833C34271O18J268l0662L7980L1757j8667k8188n4352j6523j3213n162j1477
12821B27650J3489J2307O3181j6371l1353j2424J5903p3888m1656Q262R795K2347
$$ plain form
12897 11172003 9878915 8792218 7918580 7158121 6475720 5882155 5323345 4827224 4379381
12888 4379381 3934980 3559840 3280689 3027654 2795027 2580559 2400481 2271143 2200249 2140952
12878 2140952 2057833 1972496 1872479 1765469 1675236 1595523 1524275 1414456 1290524 1212069
12868 1212069 1178216 1173497 1158564 1169405 1168231 1187162 1181829 1143442 1087488 994350 900115 862170
12856 862170 803879 718248 705354 729365 752945 789238 712236 657541 615777 588869 537630
12845 537630 499554 511330 533381 506149 439751 443104 446509 398252 371844 345506 325301 334271
12833 334271 334889 336157 305495 343475 375232 356565 328377 274025 257502 244289 239127 227650
12821 227650 241139 253446 316627 300256 268903 256479 272382 198494 156838 165100 174895 197242
12809A97242P239k9358k7510l7651J932k0205j5462J7243M5654K7588K9890J8381
12797B14983P937p673l9073k0730N3038J37077J99899J76308O4624o3964j02843
12786F19583j03315q9618p5650k2707J8070N08m3546k7186j8756m3198l4329m8530
12774A31326l8331J2798K4127p701p6291m6156j01354o9270n341K2743O3589R8078
12762H217R7323J9467o548k8817j546r133k3079K7255J2926L8225L9512l2l4770
12749A39000k8631K8874K4773q596j5327K4527k5139n9633M395M1263J0530j6405
12737A19631k4038k5451q877j2747j8623l1638j0436l064M501J5851L7361L280
12725D5750k5344N063J1178N226k4411J1382M144j4557n966N306J6916M4951K1489
$$ plain form
12809 197242 204481 175123 147613 109962 111894 91689 76227 93470 139124 166712 196602 214983
12797 214983 222920 215247 176174 155444 208482 345559 545458 721766 786390 722426 619583
12786 619583 516268 426650 351000 328293 346363 346871 303325 276139 257383 214185 179856 131326
12774 131326 92995 105793 129920 122219 45928 -228 -101582 -170852 -176193 -153450 -89861 8217
12762 8217 105540 125007 118459 89642 88096 78963 55884 83139 96065 134290 173802 173770 139000
12749 139000 110369 139243 164016 155420 140093 164620 139481 79848 84243 125506 136036 119631
12737 119631 95593 70142 61265 48518 29895 -1743 -12179 -15243 -10742 5109 42470 45750
12725 45750 20406 25469 36647 41873 17462 28844 32988 18431 12465 17771 34687 79638 101127
12712A01127K5267M4484K2066l4085m0891l654o696j778M1887J7153n856m3809
12700A15215k5892l617l565R228l7181j8011L0821K7619m537j1210m0217O450
12688D5103K3023l7783k2537j4620J485P829J7941O897L9782L204j3183R254p458
12675E8937k5980k5671N513Q501j1357M5652K1124j8013O006r287j232K561L5971
12662I2725K2815k0806n9559j3435M1789J7139j6021k6938j4929J723o786k338
12650A5379p594M441O1969K0224p4K584Q979m2114m8234l4387P464O761L0553
12637B5951L1985J7805R238l2462P409J8930j3843l1379J2369K8374k8895n4392
12625h910R352N912j8151p518j6025q093K1416j0893R798P941N786M3683K3269
$$ plain form
12712 101127 126394 170878 192944 158859 117968 114314 107618 105840 147727 164880 159024 115215
12700 115215 89323 85706 82141 91369 54188 36177 66998 94617 90080 78870 38653 45103
12688 45103 68126 30343 7806 -6814 -5329 2500 20441 27338 67120 70324 57141 66395 58937
12675 58937 32957 7286 12799 21300 9943 55595 76719 58706 64712 55425 54193 56754 92725
12662 92725 115540 94734 35175 21740 63529 80668 64647 37709 22780 24503 17717 15379
12650 15379 7785 12226 74195 94419 94345 96929 105908 63794 15560 -18827 -11363 -4602 25951
12637 25951 57936 75741 84979 52517 59926 78856 65013 33634 46003 74377 45482 -8910
12625 -8910 442 6354 -11797 -19315 -35340 -43433 -22017 -32910 -23112 -15171 -9385 34298 57567
12612E7567J8586k8646j3989l8026j3302K0961m0289k947K3501L2037J7845l6679
12600c381j8362R80M500r787J7866j7599k702J9405K8904L070J4739Q530k3276
12587B2887m627K6287K2424j4621k2888j2347j3130J9058K1059p785P315N240
12575D8872K8685l9412r326p862O820J3456k0201j7115J3119J4068j5765k3244
12563g905l165n03k4593k4556K5964R789k5271J0261L0729j5055M556J2009M4312
12550C6572J9624l9995l1404j0940J1215J4286K4878p430j1279K4898m417k9872
12538c864o86K4625K8869j3335k4761P059l68j0247j7654r312J089K2437J4811
12525A8663L852J2237m1435j4585Q886j1688K7736R433l099j0083Q488J1119K4934
$$ plain form
12612 57567 76153 47507 33518 -4508 -17810 3151 -37138 -40085 -16584 15453 33298 -3381
12600 -3381 -21743 -20763 -16263 -26050 -8184 -25783 -28485 -9080 19824 22894 37633 46163 22887
12587 22887 18260 44547 66971 52350 29462 17115 3985 23043 44102 36317 43632 48872
12575 48872 77557 38145 28819 20957 27777 41233 21032 3917 17036 31104 15339 -7905
12563 -7905 -11070 -11573 -36166 -60722 -34758 -24969 -50240 -39979 -9250 -24305 -19749 -7740 36572
12550 36572 56196 16201 -15203 -26143 -14928 -642 24236 16806 5527 30425 26008 -3864
12538 -3864 -4550 20075 48944 35609 10848 17907 17539 7292 -10362 -19674 -18585 3852 18663
12525 18663 22515 34752 -6683 -21268 -12382 -24070 3666 13099 10000 -83 8405 19524 44458
12512D4458J3103l573m880j3101J781K27L993L60l1265J4024L0487j1553j5855
12499B8206j5938j6028K2222M8386K2091q020k4814J9300K6787k0645j096J918
12487H2369K3300J3784J3157j1479j4613K2594P7650N0053M0215M5103P1416Q7555
12475E01104J60184K34637L72660N35976M75950J67331j40423m51680n30173l83785
12465I41781k12152j50370j29357j15849p2578m6035l8835k7531k0652k1591j6136
12454I0695k8419n841p482j6772o899m86J2246q637J1862J5796j1655k630l0779
12441A0999r29l2479O012J1437r415K3611J4133K9305k2880k6999N805J3471l1628
12428i557j3005L6301M199k2365j478j859j7758l447K9447R206L2874J3422m699
$$ plain form
12512 44458 57561 53988 49108 36007 37788 38015 42008 42368 11103 25127 55614 44061 28206
12499 28206 12268 -3760 18462 66848 88939 80919 56105 75405 102192 81547 80451 82369
12487 82369 105669 119453 132610 121131 106518 129112 206762 256815 297030 342133 413549 501104
12475 501104 661288 895925 1268585 1804561 2280511 2447842 2307419 1855739 1325566 941781
12465 941781 729629 579259 449902 334053 261475 215440 176605 149074 128422 106831 90695
12454 90695 62276 56435 48953 32181 25282 24796 37042 28405 40267 56063 44408 41778 10999
12441 10999 10070 -22409 -16397 -4960 -14375 9236 23369 52674 29794 2795 8600 22071 -9557
12428 -9557 -22562 13739 17938 -4427 -5905 -7764 -25522 -28969 478 9684 42558 55980 51281
12415E1281k9412m4945k764K2772M130r086j5030L5481m039j2617P617O983K7550
12402C7921J1720o979k8234k6910m1315l4753m085N6940L3035j0626k5501N525
12390c3262o122k6944p020j8116j2219M8290L4726q882j627k052M2347J4378r558
12377A3939o163K127j2963K8419j3453j5286j793l5852j7352J3959P1264J9070
12365D5916m0768k8385r029K5385j709o075k8017J0783K2472K5941K0792J3050
12353E0356k8159q157k1646M224j1414L902K2668L894l5075j8425M419M2561J5510
12340B4658l7475p619L2317j9047o123J3N966j3140J4350N630n305J9998N880
12327B0103N790K66K467l85j6522L760m47l1562j0495j2514l8628J2164L6723
$$ plain form
12415 51281 21869 -23076 -25840 -3068 1062 -8024 -23054 12427 8388 -4229 3388 10371 37921
12402 37921 49641 42662 14428 -12482 -53797 -88550 -92635 -35695 -2660 -13286 -38787 -33262
12390 -33262 -39384 -66328 -73348 -91464 -103683 -55393 -20667 -29549 -31176 -33228 9119 23497 13939
12377 13939 7776 9903 -3060 25359 11906 -3380 -5173 -41025 -58377 -44418 26846 45916
12365 45916 5148 -23237 -32266 -6881 -8590 -14665 -42682 -31899 -9427 16514 37306 50356
12353 50356 22197 14040 -7606 -3382 -14796 -10894 11774 15668 -19407 -37832 -33413 9148 24658
12340 24658 -12817 -20436 11881 -7166 -13289 -13276 -7310 -20450 -6100 -470 -5775 14223 20103
12327 20103 25893 26159 28626 28241 11719 15479 15032 -16530 -27025 -39539 -78167 -66003 -29280
12314b9280N33N622J1420k7639k026M3347q259j4584m10J5696k3243K51K0837
12301g735q827m849j9918o04N3479K4441Q127k5755k5527j8793K7670J4924K131
12288A8764m7575n2371Q594M3819N3298J7257k2148l7395M076L0404O543q446
12276A4820k8094j1815M3717K2772l162k4789j8438j7295Q06L89l181j6199J9596
12263b0873K1161m2187j3374L7839M3350J6259M626L1105r114k3941n9290J016
12251a3423L3687M62m6234m4100L0595J1798j6365J1824R559P361k4857J1111
12239b8582R475J350Q938K2867k7880m2866l842J3187L6051q76R077K9064J5628
12226D1591J077r215K0877j2613j5622L201j580m777M725J4375K0562o026j1314
$$ plain form
12314 -29280 -28747 -23125 -11705 -39344 -41370 1977 -6282 -20866 -21276 -5580 -28823 -28572 -7735
12301 -7735 -16562 -21411 -41329 -41933 11546 35987 44114 18359 -7168 -25961 1709 16633 18764
12288 18764 -28811 -81182 -72588 -28769 24529 41786 19638 -17757 -13681 16723 23266 14820
12276 14820 -13274 -25089 18628 41400 38238 13449 -4989 -22284 -21478 -21089 -24270 -40469 -20873
12263 -20873 288 -41899 -55273 -17434 25916 42175 46801 77906 68792 44851 -14439 -13423
12251 -13423 20264 20726 -25508 -69608 -39013 -27215 -43580 -31756 -22197 -14836 -39693 -28582
12239 -28582 -19107 -17757 -8819 14048 -13832 -56698 -60540 -47353 -11302 -12178 -3101 25963 41591
12226 41591 42668 33453 54330 41717 26095 29296 27716 22939 27664 42039 62601 56575 45261
12213D5261O373n686l8522j7264J0403k7748j5986m931m755L7428K0093j8786
12201a4120k0629J2087L7984N091K467R940j7363j8555k8659j7029K6631O2829
12189D0674K5574j1890k4564k407k2504n211K5442M2176k334k6745j5569k4416
12177a774k8830K2452k7950j6899j0927q078J5834P171Q5q742k5248K0667K4699
12164c7540k801j5385p528j0164J6913K1149k0628L5886J8131m210n94k5012j3797
12151d5580r929j933K7452J7737K7127K080l40J4589m356M3746J411l3915m1305
12138c216k1485J0666o863O030q212R922L4694M6309p374p484J8451r049j5238
12125D7151j2875j8035J7331k7744k7842K8610N4308j5383k8880p947k2084j8749
$$ plain form
12213 45261 51634 45948 7426 -9838 565 -27183 -43169 -48100 -52855 -15427 4666 -14120
12201 -14120 -34749 -22662 15322 20413 22880 32820 15457 -3098 -31757 -48786 -22155 40674
12189 40674 66248 54358 29794 27387 4883 -328 25114 67290 64956 38211 22642 -1774
12177 -1774 -30604 -8152 -36102 -53001 -63928 -72006 -56172 -49001 -48916 -57658 -82906 -62239 -37540
12164 -37540 -40341 -55726 -63254 -73418 -56505 -35356 -55984 -20098 -1967 -6177 -6771 -31783 -45580
12151 -45580 -55509 -57442 -29990 -12253 14874 16954 16614 31203 26847 70593 72004 38089 -3216
12138 -3216 -24701 -14035 -20898 -14868 -23080 -13158 21536 67845 60471 52987 71438 62389 47151
12125 47151 34276 16241 33572 5828 -22014 6596 60904 45521 16641 8694 -13390 -32139
12113c2139M3949J9823l0299j9578j6813j1534J4979K7223N683l454J6301o664
12101G477K1138K5867J95J6626j368j3179k3450m1087l5248k3377J9750M8511
12089A855L3342J1802J5883j3774l4606n427m070p433M538K9217p626j9019j5947
12076a1265P895l1517K0809L2350Q286n364k8532O463K7898j6520J0175q361J7796
12063C0113k0021n4035r823N2573J9185L45k3388K1430L3599j9843N70l6952j5315
12050b1562j9038p890l724j4451J0351L6833J5971k3129J8499K2535L3861R388
12038E7644j2503p176O852M4623m790l8025l070j8795k3213K8539L0701r422k9273
12025B2092K0929K8429l3415J2158M4252L2935j9288k5662j1064j8825Q619J5471
$$ plain form
12113 -32139 11810 31633 1334 -18244 -35057 -46591 -31612 -4389 1294 -2160 14141 7477
12101 7477 28615 54482 54677 71303 69935 56756 33306 -7781 -43029 -66406 -46656 1855
12089 1855 35197 46999 62882 49108 14502 9075 5005 -2428 2110 31327 23701 4682 -11265
12076 -11265 -3370 -34887 -14078 18272 26558 21194 -7338 -875 27023 10503 20678 12317 30113
12063 30113 10092 -43943 -53766 -1193 17992 18337 -5051 16379 49978 30135 30705 -6247 -21562
12050 -21562 -40600 -48490 -52214 -66665 -56314 -19481 -3510 -26639 -8140 14395 48256 57644
12038 57644 45141 37965 44817 89440 84650 46625 43555 24760 1547 30086 60787 51365 22092
12025 22092 43021 71450 38035 50193 94445 127380 108092 82430 71366 52541 61160 76631
12013G6631n962p283M285J5870n3980l1038K6164L0503K8708O445k0942l2043
12001C7358N070L0661j9857k2959J3025k0255J2094J0993K4885k123Q683K1860
11989I9435L041j1484j5256K3897K5771j6443m0500j6777j280l0460j4171K1858
11977B7631N5559J9135k047J5035Q691L3464k1843J203K3035P98l741j2361l2029
11964A12530j8178k455L0586J4481J2782J0463j6454l1078J0799J3119L148r618
11952A30125J1051N632o943l6801N634J6549J3047k5092k3968j6740O44J3801
11940H6939K0625J3845n443p964M349K7395j8643j1426M35q043k4190j6402L130
11927F4607K3361Q511L477r801K3340N309K6186m01k8440O853J6743j9763L287
$$ plain form
12013 76631 70669 63386 67671 83541 29561 -1477 24687 55190 83898 90343 69401 37358
12001 37358 42428 73089 53232 30273 43298 23043 35137 46130 71015 68892 77575 99435
11989 99435 102476 90992 75736 99633 125404 108961 68461 51684 50404 19944 5773 27631
11977 27631 83190 102325 100278 115313 124004 157468 135625 136828 159863 160661 156920 144559 112530
11964 112530 94352 91897 122483 136964 149746 160209 143755 112677 123476 136595 139743 130125
11952 130125 141176 146808 139865 103064 108698 125247 138294 113202 89234 72494 73138 86939
11940 86939 107564 121409 115966 108002 112351 139746 121103 109677 110112 102069 77879 61477 64607
11927 64607 87968 96479 99956 90155 113495 118804 144990 144589 116149 123002 139745 119982 123269
11914A23269l596K997Q890j4672J469p485m1470J1998N917J861K4034j998l0188
11901H1026l3281K2762J0066J499k8960m167J8134k476L332J313j2238j9292q925
11888B8793J4439J4246l1172k803J1641O555q843r166k759O092M329j4061q928
11875H363O374K6635J3728l642m979k4247l8104k7846L2907J2265k0809j8818
11863c8173j3611P633J9363L0185L2839l8161L52J3142M2572N4218j4182r904
11851H6273K3978P036J3750k1061n0840m3809o704J3271L0542J0104J2991L6277
11839A11808J818L240j1214k962l2738J2752j1728k8773L949j306m835n147M064
11826C8928j3252l14j5583J090k932M588K25o979O374O757j3344q772l454j5756
$$ plain form
11914 123269 119673 122670 131560 116888 118357 110872 69402 81400 87317 89178 113212 111214 81026
11901 81026 47745 70507 80573 82072 53112 48945 67079 64603 67935 69248 57010 37718 28793
11888 28793 43232 57478 26306 23503 35144 41699 32856 23690 20931 27023 31352 17291 8363
11875 8363 14737 41372 55100 51458 46479 22232 -15872 -43718 -10811 1454 -19355 -38173
11863 -38173 -51784 -44151 -24788 5397 38236 75 427 13569 56141 110359 96177 86273
11851 86273 110251 117287 131037 109976 59136 15327 8623 21894 52436 62540 75531 111808
11839 111808 113626 116866 105652 102690 69952 82704 70976 42203 46152 44846 40011 34864 38928
11826 38928 25676 25362 9779 10869 7937 12525 12750 5771 12145 18902 5558 -3214 -6668 -22424
11812b2424P677J5583R817M6403j0795q442j2121J1669n922l6683J2622J2236
11800A9620m917j924J437J7081N70q54j0320j8877K1846n359k1929k6924k2487
11787e3037J1022N1806M0170j264j6961j8194k7795j7621j4286K6978L3347L8567
11775E2732J3684j92k16j5732k657l6303j4149J1116P32R020K4078Q028R429M847
11761F4417j0843n200l6045L8973L3256o8K269P036J5807J2226K2073r877k3503
11748A10521J0046M107j2456l794j3317k3069Q447O661K6195J4453J3793J4650
11736A56237N005K4644K1064J2445m4433j8600j2551r882j4588k1828L389j8481
11724H2421O325j6685p215R359k1780l2538k0094j0714k3456l377L9997j4847
$$ plain form
11812 -22424 -14747 836 10653 57056 46261 37819 25698 37367 31445 -5238 7384 19620
11800 19620 14703 12779 14216 31297 31867 31013 20693 1816 23662 18303 -3626 -30550 -53037
11787 -53037 -42015 9791 49961 48697 31736 13542 -14253 -31874 -46160 -19182 14165 52732
11775 52732 66416 66224 66008 50276 47619 11316 -2833 8283 9015 18035 42113 50141 59570 64417
11761 64417 53574 48374 12329 51302 84558 84490 86759 93795 109602 121828 143901 134024 110521
11748 110521 120567 124674 112218 108424 95107 72038 80485 87146 113341 127794 141587 156237
11736 156237 161242 185886 206950 219395 174962 156362 143811 133929 119341 97513 100902 82421
11724 82421 88746 72061 64846 74205 52425 19887 -207 -10921 -34377 -37754 2243 -12604
11712a2604q327K2990j3326l4716K2659K7281L4063j0064j773M5412K5727n49
11700I6773J6460R636r955k0600M811Q020Q445O485M3412L7020j0389K4261R012
11687B23391m3961k8623j4299o333q073m1509k4386j2701j4011n258J6303l7183
11675C357j7067O736r287j1322L6596J9617O276m676m970O620O809K0815J0074
11662F9578n6080j7127M1259J6164L1184M0502L5028j2701j4564M533j7951n3660
11650F6165j6172K3315j9457r497k542K1168J6481k7777k488N0146J7193l6673
11638G9862m9160k819M0395m894l3388l1614K2934J5621Q568j6544J5607J6108
11626F0676l3110l8470L0437J9138J4297K597n904m0392K2689L8844K2552k6987
$$ plain form
11712 -12604 -20931 2059 -11267 -45983 -23324 3957 38020 27956 26183 71595 97322 96773
11700 96773 113233 122869 112914 92314 97125 105145 113590 120075 163487 200507 190118 214379 223391
11687 223391 179430 150807 136508 130175 122102 80593 56207 43506 29495 24237 40540 3357
11675 3357 -13710 -6974 -16261 -27583 9013 28630 34906 30230 25260 31880 38689 59504 69578
11662 69578 13498 -3629 37630 53794 84978 125480 160508 147807 133243 137776 119825 66165
11650 66165 49993 73308 53851 44354 41812 62980 79461 51684 49196 99342 116535 79862
11638 79862 30702 27883 68278 63384 29996 -1618 21316 36937 45505 28961 44568 60676
11626 60676 27566 -10904 19533 38671 52968 55565 49661 9269 31958 70802 93354 66367
11614F6367n8661r554J8520K7749J2593k155m5261j344r301l8359q605J2836K2671
11601a2504J5363k9904j8215K5409N957j9466o741J9964O986M8536J2962J074
11589D9421k9676l8291R973L022k500J396O06R537K129j1130J1781J5731r169
11576A2830j2915K0552J1131j4597J878N136K9265k729j268l6439k0433k211J9560
11563I760k36J9514L179l4200J019K2905k6852m7084L3622K2889K2149n232J6231
11550C7664M5593j3081P370K2399K1139J9707k0320l1213k9954k6857n598M33
11538B7282q353N527K7263J4262p230j7148k5339j7310l1558J0850K2511j1019
11526a0262k1981R677K6494Q601m893M051K7920N6970p152p488p776k9424M081
$$ plain form
11614 66367 7706 -1848 16672 44421 57014 54859 9598 8254 -1047 -39406 -48011 -35175 -12504
11601 -12504 2859 -27045 -45260 -19851 -13894 -33360 -40101 -20137 -13151 35385 48347 49421
11589 49421 19745 -18546 -8573 -5551 -8051 -6655 -6049 3488 5617 -5513 6268 21999 12830
11576 12830 -85 20467 31598 17001 18879 24015 53280 50551 49283 12844 -7589 -9800 9760
11563 9760 9524 29038 32217 -1983 -964 21941 -4911 -51995 -18373 4516 26665 21433 37664
11550 37664 83257 70176 77546 99945 121084 140791 120471 89258 59304 32447 26849 27282
11538 27282 18929 24456 51719 65981 58751 41603 16264 -1046 -32604 -21754 757 -10262
11526 -10262 -32243 -22566 3928 12529 7636 11687 39607 96577 89425 81937 74161 44737 48818
11513D8818J4002j4495K6753n341K8000j7453k2213k6408k1024J9985K5387J6286
11501G2297N445l639q110K933R454p017j1548j952K0834n3155j0580L4672L8062
11488H7696j5319n5806k5894K3865K2517J8185k345q027L6467Q633L2341O216
11476A28529L3062n724o5722j0775J0644J0766N8812L2334j751k170o509J3776
11464A95272m864r226k4936n118K2678J6224m227k9303k3497j6530J3407j9756
11452A10124k9366m248r114m869q245K5450J8075k5406m7425l133K2512P811j247
11439E0919J7517k3159j1444O299J4089K8390L6921k782k2055k2651m243Q282
11427G6083J9832m480k1841K0834L1853J1788j153k0156l7007j1566l653j4637
$$ plain form
11513 48818 62820 48325 75078 69737 97737 80284 58071 31663 10639 30624 56011 72297
11501 72297 77742 74103 65993 68926 78380 71363 59815 57863 78697 25542 14962 49634 87696
11488 87696 72377 16571 -9323 14542 37059 55244 52899 44872 81339 89972 122313 128529
11476 128529 161591 155867 90145 79370 90014 100780 159592 191926 190175 188005 181496 195272
11464 195272 190408 181182 156246 151128 173806 190030 185803 156500 133003 116473 129880 110124
11452 110124 80758 76510 67396 62527 54282 79732 97807 72401 24976 21843 44355 52166 50919
11439 50919 68436 45277 33833 40132 54221 82611 119532 116750 94695 72044 67801 76083
11427 76083 95915 91435 69594 90428 122281 134069 132916 112760 75753 64187 60534 45897
11415D5897j0812j4649n203Q596J2750N168k863%j4731J6812n276p544q679k509
11401A6957o722k3483l8928L3165R527j2965K799J4655O690j9104k4539M757J0154
11388b7037J956K5086j4623O268J5957J0585m620N237P522K2037j1376m0501q362
11375a1871j4798O63k5158j0118O841k1467j3014K7205L0501J6835l600r016k0703
11362d7700n04L5645J7475K5551N147k4283n061j993q950r753r049K6035J978
11349D538J6677M939k1622j6101m1142L006N0792K3505j7904n590k4365j6358
11337c9625q318J0813k781J7207L0668M360P716J07l8579k8917K0351K590J9982
11324d426J872k7347k5387J2132L2031K8514j0448j8513K796k2858r585N1708
$$ plain form
11415 45897 35085 20436 15233 23829 36579 41747 38884 38884 24153 40965 35689 28145 19466 16957
11401 16957 10235 -13248 -52176 -19011 -9484 -22449 -19650 -4995 1695 -17409 -41948 -37191 -27037
11388 -27037 -25081 5 -14618 -8350 7607 18192 13572 18809 26331 48368 36992 -3509 -11871
11375 -11871 -26669 -26006 -51164 -61282 -54441 -75908 -88922 -61717 -31216 -14381 -17981 -26997 -47700
11362 -47700 -48204 -12559 4916 30467 35614 11331 6270 4277 -4673 -14426 -23475 2560 4538
11349 4538 21215 26154 4532 -11569 -52711 -49705 1087 24592 6688 1098 -23267 -39625
11337 -39625 -47943 -37130 -39911 -22704 7964 12324 20040 20147 -18432 -47349 -26998 -24408 -4426
11324 -4426 -2554 -29901 -55288 -43156 -11125 17389 6941 -11572 -8776 -31634 -41219 10489
11312A0489J7120l1291j0190L1158l569k442k4069J682K3884l5619l547q94Q31
11299b6457k6339P257L8908J2335r052l7416o471J3989J1366J0302J6076O661
11287A1159j5323k287K3538l6554p232M3437J106L025n543K0235p171k1997P605
11274A3998q18k2797k4329j4921J4396M435k152J8403L5038j4416k5639j4706
11262c3508J095J896p52l164j3496j2636k426L879K1229L277J6855q962K2916
11249c797P508P760r847l1444k218j824M132j9035O302L5187R900j2345J4891
11236E170K0586J4701J784k9823l5501j1585K9079L656J0525j1591l3603J6070
11224b0532O096j8799k0678m522l659N1601K3217j1667m940J703m4673j1066K885
$$ plain form
11312 10489 27609 -3682 -13872 17286 13717 11275 -12794 -11112 12772 -22847 -26394 -27288 -26457
11299 -26457 -52796 -45539 -6631 5704 -3348 -40764 -47235 -33246 -21880 -11578 4498 11159
11287 11159 -4164 -6451 17087 -19467 -26699 16738 17844 20869 15326 35561 28390 6393 13998
11274 13998 13180 -9617 -33946 -48867 -34471 -30036 -32188 -13785 21253 6837 -18802 -33508
11262 -33508 -32413 -30517 -31269 -34433 -47929 -60565 -62991 -59112 -37883 -34606 -17751 -26713 -3797
11249 -3797 3711 11471 1624 -29820 -32038 -33862 -29730 -48765 -42463 -7276 2624 -9721 5170
11236 5170 25756 40457 42241 12418 -23083 -34668 -5589 -1933 8592 -2999 -36602 -20532
11224 -20532 -14436 -33235 -53913 -58435 -62094 -10493 12724 1057 -3883 -2180 -46853 -57919 -55034
11211e5034K2186K3039K3580K241o143K2182n568n3677j905k5074N047M9476K4182
11198B4532j9981j8421k8131J409o783J3176M1208L603m2690j5990L8222q013
11186a7859j1188L6538K6332j6424k3980j8676Q892J1504K8553L5042J6338l2137
11174D2935j7014k2667n876p502j820J4954J7124k6345J4692K6435K5422k1761
11162C8577l3107n180K3537P855k852J1949Q411q275o050j7819R61M861J728l875
11148B0721j2482o389k1342j7827J9490J8045L157J9528p834l740L1039J8401
11136F0767j0283j3279j8666m12k5093J230j1660k437J8199K0920m268K553j7181
11123C90m200J1334k6419O510O2273q275j5408j8130L6488m777j1389j6546j2427
$$ plain form
11211 -55034 -32848 -9809 13771 16012 9869 32051 26483 -27194 -29099 -54173 -49126 350 24532
11198 24532 4551 -13870 -42001 -40592 -47375 -34199 7009 10612 -32078 -48068 -9846 -17859
11186 -17859 -29047 7491 33823 17399 -6581 -25257 -16365 -4861 23692 58734 75072 42935
11174 42935 25921 3254 -2622 -10124 -11944 3010 20134 -6211 8481 34916 60338 38577
11162 38577 5470 290 23827 31682 28830 40779 49190 40915 34865 17046 18007 22868 24596 20721
11148 20721 8239 1850 -19492 -37319 -17829 216 3373 22901 15067 11327 42366 60767
11136 60767 50484 37205 18539 18127 -6966 -5736 -17396 -19833 -1634 19286 15018 17571 390
11123 390 -3810 7524 -18895 -12385 49888 41613 26205 8075 44563 39786 28397 11851 -576
11110e76L469K0398L0853J2564K4513q699k8097J945J3486k9092j3589m993n472
11097A6710q258m5324j214L4185J3038k1525K882m371l0485k9197J5302K676R389
11084d6192L6797M9135j1022l1074Q100M737J2065M3732L0212p926l3912n540
11072D9112n736K7002J2875k3714r817J9451L618m712k7092M071K448K837j9782
11059C0561l4722K1389L5397O486L0962M2951K1928l8943l1552k8647J1662K8740
11047I6212k8098j8835K0714M0184L1766J1047k7121k0714j7255K0703N3798M2703
11035B05104K6522L6236q999j6472J6016N7794M7015L4085L9872M2625P5965P3384
11023F29147J06784J30264P5349Q3656R2641J17772P9046K8720l1983m3213q2926
$$ plain form
11110 -576 2893 23291 54144 66708 91221 82522 54425 56370 69856 40764 27175 22182 16710
11097 16710 8452 -36872 -38086 -3901 9137 -12388 -9506 -13877 -44362 -73559 -58257 -55581 -46192
11084 -46192 -9395 39740 28718 -2356 5744 10481 22546 66278 96490 88564 54652 49112
11072 49112 43376 70378 83253 59539 49722 69173 72791 68079 40987 45058 47506 50343 30561
11059 30561 -4161 17228 52625 59111 90073 133024 154952 116009 84457 55810 67472 96212
11047 96212 68114 49279 69993 110177 141943 152990 125869 105155 87900 108603 162401 205104
11035 205104 231626 267862 258863 242391 258407 316201 363216 397301 437173 479798 555763 629147
11023 629147 735931 866195 941544 1025200 1117841 1235613 1314659 1343379 1311396 1268183 1185257
11012A185257j13159j07120j00375q6469r5026q3799q4643p3452m0188r8826j3663
11001B88537m721k0081k0500m580l7760O898l2694j184j3892l1545k9107j9518
10989G9853j5855k822j1361p323q686L0963J678j615r851m408o353Q44K066j8720
10975B8410j8967K7674M2366M7531m3960m6415Q679j0571p758k8299j1948L2267
10963A9009M693J905K1466k5715N371P925j7597K3637O507J0810k0938k7795m839
10950D439J5030q797q731k6728J7978J9937O50k413l485o976k6169J305j606J0561
10936a5005K9301K70o03j2535P156j5001M794K2301L5739m44j2384J1406N292
10923F0287k5251l776j8487J475J7916j6949m2171k8873r13K0186J1987J8562
$$ plain form
11012 1185257 1072098 964978 864603 778134 683108 599309 514666 441214 401026 302200 288537
11001 288537 283816 263735 243235 238655 200895 207793 175099 173915 160023 128478 99371 79853
10989 79853 63998 61176 49815 42492 33806 64769 66447 64832 54981 50573 44220 45064 47130 28410
10975 28410 9443 37117 79483 127014 83054 36639 45318 34747 26989 -1310 -13258 19009
10963 19009 23702 25607 47073 21358 26729 34654 17057 40694 47201 58011 37073 9278 4439
10950 4439 19469 10672 1941 -24787 -6809 13128 13778 11365 7880 904 -25265 -23960 -25566 -15005
10936 -15005 14296 14566 13963 1428 8584 -6417 -1623 20678 56417 55973 43589 54995 60287
10923 60287 35036 31260 12773 14248 32164 15215 -26956 -55829 -56742 -36556 -24569 -6007
10911f007J3788m496J3311J1495J4509j6940j3146l2217L104N181k2089j2184
10899d5691n03Q024j9353j2841L6964J5465l0267R652L5699k8563j7668M612L6486
10886g984L5249k710J2224k4471j4231o42J2701j1422k0067K1056J7849J6810
10874C4362J8862q869k7001l3717r484N0854L067M030L9112k4726p595m434j2653
10861B1808j8p664K5926j4576n40K165J0882k5524l7902O186J7960J1323J2834
10848B2860M056m3968j8323J7059j3520Q357j6737L5092j1085j7689N601J488
10836b6809M5702M0118n293L107j241k2556m229N123j539J1365j2009j3046J8651
10823C7344k2970q594k0875J4842k958k3794j1392J8469N053M1054K795k0975
$$ plain form
10911 -6007 7781 3285 16596 28091 42600 25660 12514 -19703 -16599 -11418 -33507 -45691
10899 -45691 -46194 -38170 -57523 -70364 -33400 -17935 -48202 -38550 -2851 -31414 -49082 -44470 -7984
10886 -7984 27265 24555 36779 12308 -1923 -2565 10136 -1286 -21353 -297 17552 34362
10874 34362 53224 44355 17354 -16363 -25847 25007 28074 32104 71216 46490 38895 34461 21808
10861 21808 21790 14126 40052 25476 24936 27101 37983 12459 -25443 -19257 -1297 10026 22860
10848 22860 26916 -17052 -35375 -18316 -31836 -23479 -40216 -5124 -16209 -33898 -28297 -26809
10836 -26809 18893 59011 53718 56825 55584 33028 28799 33922 32383 43748 31739 18693 37344
10823 37344 14374 5780 -15095 -253 -3211 -27005 -38397 -19928 -14875 26179 28974 7999
10811G999p53J3430l895j9623j1805j3109L100p96o936P234p671N477n905O012
10797b7241n459J445J0690K1911m793K2048L8365r515l9636k3662l9924j4320
10785g0091J4336L4007j2452J7637Q05M7101K1055r586R1R820j7492k8254L0385
10772C7362r991j1526n453m8091J3336M2254K0572J3702j5492J7542j4782p864
10760C1569n692M263j3890j5555m923O415J4628K0075l07k8660J2067m3961k2327
10747d6298k3542j762k8789J6548L2065L3253K9725j0075k0097k8579p25J7429
10735c0847P584J3820K06k4356l3851M438J188k984L8446J3540j302j6441m183
10722c4742K7542j5151j7309L4039K2458Q650j2652k8234r669R385M3311M1853
$$ plain form
10811 7999 7246 20676 16781 -2842 -14647 -27756 -24656 -25452 -32388 -25154 -32825 -27348 -33253 -27241
10797 -27241 -32700 -31255 -20565 1346 -3447 18601 56966 47451 7815 -15847 -55771 -70091
10785 -70091 -55755 -21748 -34200 -16563 -15758 31343 52398 42812 42903 52723 35231 6977 37362
10772 37362 27371 15845 10392 -37699 -24363 17891 38463 52165 36673 54215 39433 31569
10760 31569 25877 30140 16250 695 -4228 2187 16815 36890 36583 7923 19990 -23971 -46298
10747 -46298 -69840 -71602 -100391 -83843 -51778 -18525 11200 1125 -18972 -47551 -48276 -30847
10735 -30847 -23263 -9443 -9237 -33593 -67444 -63006 -61818 -64802 -26356 -12816 -14118 -30559 -34742
10722 -34742 -7200 -22351 -39660 -5621 16837 25487 12835 -15399 -25068 -15683 27628 69481
10710F9481l3472k5543J1009j155J1592j8621m4235j036K7674L2696N237Q033
10698D1660K2913o938m8860m4855j078p386N0165R680q182J9498k2118j4196j072
10685a0769K4926J4470k208m391k8767k2495o717J6005j320K7274L2041K4425
10673F2474K6515r904K313m7684o2090L7428K1057N009l2922k3084k5618k2218
10661f8724J7496M2878j1134R46J3477N735M8734J1037J083k2766n42p240k2833
10648H147j8491J5132l309r213n770Q528Q291r867j6450k6528k1898j3247J6477
10635f8198M355K2634m465j3037J141L91J4726j9415M4622N4878j8488l995L7229
10622E2378j0393l5838j6476N001K3105K7738N073m5223l2711k408K7535P573
$$ plain form
10710 69481 36009 10466 21475 20320 31912 13291 -30944 -31980 -4306 28390 33627 41660
10698 41660 64573 57635 8775 -36080 -37158 -44544 5621 15301 7119 26617 4499 -9697 -10769
10685 -10769 14157 28627 26419 22028 -6739 -29234 -35951 -19946 -21266 6008 38049 62474
10673 62474 88989 79085 81398 33714 -28376 9052 30109 35118 2196 -20888 -46506 -68724
10661 -68724 -51228 -8350 -19484 -18538 -5061 674 49408 60445 61528 38762 38220 30980 8147
10648 8147 -10344 4788 1479 -7734 -13504 -4976 3315 -6552 -23002 -49530 -71428 -84675 -68198
10635 -68198 -63843 -41209 -45674 -58711 -57570 -57179 -42453 -61868 -17246 37632 19144 15149 52378
10622 52378 41985 6147 -10329 -5328 17777 45515 50588 5365 -27346 -29754 -2219 5354
10610E354K1328M1207J3732n069K5322l9062o2044m2440k2978M3359L6329L819
10598A8857j3574r495L2602J4633J5707L448k6055M773k6191j5542J2600N482
10586A7245l5585j7247K4248K6783p118K3853j5566l2198k6492J6792J0727o558
10574b1116K049K4726K8463r55k2181r888k048m499N619K0109L9240O522L033
10561F9074k9789k1433j9679Q268M956J0134Q729K2435j4856j8011l187j763R038
10548B3916q913j5067j1115o160K0464k7724Q343K4142K6546n039j9080m7815
10536c7502l794L6175N0058n440n3449k2333J411o914J3555r546l3808J2303K4664
10523c4620M4656Q038o0429J2783N1940l061J3323k2870j8001K0845L5958j6423
$$ plain form
10610 5354 26682 67889 81621 76552 101874 62812 768 -41672 -64650 -21291 15038 18857
10598 18857 5283 -4212 28390 43023 58730 62178 36123 40896 14705 -837 11763 17245
10586 17245 -18340 -35587 -11339 15444 8326 32179 16613 -15585 -42077 -25285 -14558 -21116
10574 -21116 -19067 5659 34122 33167 10986 1098 -950 -5449 170 20279 59519 66041 69074
10561 69074 39285 17852 -1827 6441 11397 21531 30260 52695 37839 19828 16641 14878 23916
10548 23916 15003 -64 -11179 -17339 3125 -24599 -16256 7886 34432 29393 10313 -37502
10536 -37502 -41296 -5121 44937 39497 -13952 -36285 -34874 -41788 -28233 -37779 -71587 -59284 -34620
10523 -34620 10036 18074 -42355 -29572 22368 19307 32630 9760 -8241 12604 48562 32139
10511C2139m1744j2944K983o713k1859j4883K284O660j385J2789J8132J4356k8671
10498c8856L55J755K1990K181j7733L1320j042m1198M433L0636J525j0909N7316
10485D1773j9533j4666J4492j0019p010J9846k3229p623J2487O378k149l2408
10473b1661l738p145j6938k772J7375m109J3407M819n534k056J029K3905J7938
10460A4520l152l3281q161K6727j8765q348J1493M8503J7530j7236k4904l6556
10448c1630q002J1899O119K8168p196k5518p789J922Q017p400J1959J4437k6753
10435c1767j457J5128j5956Q268l274M205J5655J8221r931k9416K5333M1743K248
10422C9000l685N1831l5378m0633q127J8403Q208N970p784k7594j2898J9687N145
$$ plain form
10511 32139 -9605 -22549 -19566 -26279 -48138 -63021 -60737 -54077 -55462 -42673 -24541 -10185 -38856
10498 -38856 -38501 -36746 -14756 -12575 -30308 1012 -30 -41228 -36795 -6159 -4634 -15543 41773
10485 41773 22240 7574 22066 12047 5037 24883 1654 -5969 6518 12896 10747 -21661
10473 -21661 -25399 -32544 -49482 -52254 -34879 -38988 -25581 -20762 -26296 -28352 -27323 -3418 14520
10460 14520 11368 -21913 -30074 -3347 -22112 -30460 -18967 29536 47066 29830 4926 -31630
10448 -31630 -39632 -27733 -21614 6554 -642 -26160 -33949 -32027 -24010 -31410 -19451 -5014 -31767
10435 -31767 -33224 -18096 -34052 -25784 -29058 -24853 -9198 9023 -908 -30324 -4991 36752 39000
10422 39000 35315 87146 51768 11135 3008 21411 29619 35589 27805 211 -12687 7000 12145
10409A2145l7276j060L1654J4600k5341k3677N801K0564L9824L681j8010j5991
10397F914j0747k8067j206J3108P088r898j1253N595j433K6591Q207l599J1632
10384A2932N338J5598j1533j4539J8776K0057J3802k9390J0921J6999J9440O158
10372H4559R831k2024M770j1532j0688l288j100O33J5764j3428k5919j1089n967
10359A0522J074M196O575r439L63J4100j1983r338O268K155n619P411k1584n5525
10345f0824k9133N3463J9691P414J9980j3528k4363r796K4720j9125J6093K0588
10333E180l213j6906k0021K2037N577k5495K626O302O213K5063j1360l1612O660
10320b8949J0810p954j5621k0188j7154N3747J1443N473K7912K1508J5816M757
$$ plain form
10409 12145 -25131 -26191 5463 20063 -5278 -28955 -23154 -2590 37234 40915 22905 6914
10397 6914 -3833 -31900 -33106 -19998 -12910 -22808 -34061 -28466 -29899 -3308 4899 1300 12932
10384 12932 18270 33868 22335 7796 26572 46629 60431 31041 41962 58961 78401 84559
10372 84559 94390 72366 77136 65604 54916 51628 50528 51161 66925 53497 27578 16489 10522
10359 10522 11596 15792 22367 12928 13291 27391 15408 6070 12338 14493 8874 16285 -5299 -60824
10345 -60824 -89957 -36494 -16803 -9389 10591 -2937 -27300 -37096 -12376 -31501 -15408 5180
10333 5180 1967 -14939 -34960 -12923 -7346 -32841 -30215 -23913 -17700 7363 -3997 -35609 -28949
10320 -28949 -18139 -26093 -41714 -61902 -79056 -25309 -13866 -8393 19519 41027 56843 61600
10308F1600k6048J9616J8445J5866l7248m6992j2950K0491J0981k184k315j0908
10296H354q970p534J993j6871R774J0298J5068J6462p140j9803r48J7327m127
10283A3883K3722j9075j8468k8843l2552O918J5478Q786K6974k9762K5765J6981
10271I807k2526M83j062O787k2103M988M444j9968N486J3576J3730J9283J3808
10258B6733l3628J275K3538L240k8959m998K3503M975o308l223K5997q645o4980
10245d1480R090M2763K7647K4544j8898k1690r601l8296J075n16O293K7851N753
10232A4535K8062j6150n7493N033m360O543M7363K5742j0799l3056m0261l1524
10220f6365J296K9804L6443J4355j069p390j6816J8951J3228K4528K109j5929
$$ plain form
10308 61600 35552 55168 73613 89479 52231 5239 -7711 12780 23761 21577 19262 8354
10296 8354 -616 -8150 -6157 -23028 -13254 -2956 12112 28574 21434 1631 683 18010 13883
10283 13883 37605 18530 62 -28781 -61333 -54415 -38937 -30151 -3177 -32939 -7174 9807
10271 9807 -12719 -12236 -13298 -6511 -28614 -23626 -19182 -39150 -33664 -20088 -6358 12925 26733
10258 26733 -6895 -5620 17918 21158 -7801 -12799 10704 15679 9371 6148 32145 23500 -41480
10245 -41480 -32390 10373 38020 62564 43666 21976 12375 -25921 -24846 -25362 -19069 8782 14535
10232 14535 42597 26447 -31046 -26013 -30373 -23830 23533 49275 38476 5420 -34841 -66365
10220 -66365 -65069 -35265 1178 15533 14464 7074 -9742 9209 22437 46965 49074 33145
10208C3145j5235Q0J0676J5093J7951k2326M385j5474j4033k5829K0298K9507
10196C8238J2203j8501l5881k8594p303J3173J0466N492m722J0747l968l9723
10184d8373J2271K3908j3727m729r444p025k409K3303K6799k4250m956P023J1907
10171i702J0850P840k543k9239p130K5555P438K0701m400M638J1667l7650l2353
10158c4328o990K2509J3473J9171K4333j5669m061m5788l9895O684k198J6248
10146d6511J1021r68J648j0444j7325J7898L9967M7846R179j8066J9127n594k1179
10133B6599k3831j5997M281o323M514q282N070O44k3805K5625K2630m381K139
10120H883J9363j6092j3884n443K3025l189l139q269J1167n71k0402N150p521
$$ plain form
10208 33145 17910 17990 28666 43759 61710 39384 43769 28295 14262 -11567 8731 38238
10196 38238 50441 31940 -3941 -32535 -39838 -26665 -16199 -10707 -15429 -4682 -8650 -48373
10184 -48373 -36102 -12194 -25921 -30650 -40094 -47119 -49528 -26225 574 -23676 -28632 -21609 -9702
10171 -9702 1148 8988 6445 -22794 -29924 -4369 3069 23770 19370 24008 35675 -1975 -34328
10158 -34328 -41318 -18809 -5336 13835 38168 22499 18438 -27350 -67245 -60561 -62759 -46511
10146 -46511 -35490 -36458 -34810 -45254 -62579 -44681 -4714 43132 52311 34245 53372 47778 26599
10133 26599 2768 -13229 -8948 -15271 -10757 -19039 -13969 -13325 -37130 -11505 11125 6744 8883
10120 8883 28246 12154 -1730 -7173 15852 12663 9524 1255 12422 11851 -8551 -3401 -10922
10107a0922q289p125j0125J6475J0769J5017K2580l4452J6890j5895l7101l64
10095d2542K1989k100K7543J1697k6482l3818J3285L8957J5564O607o8m535l606
10082B2491K4554M008l3603j3542J6254k4775k4964J2681J8221J7250J8266J8276
10070E5117L2754Q430j6620j7895r182M5511M0538l914p754j6597j526J459K7569
10057A37890N7575N5278P1037J55977K51448N07493J026545J269191k44599j292495
10047A995340q82739m31925k28795j55854j04705q2013M28m171j488P935j1411
10036A00602J1997l255l1455m1984K291p471l0840J8042L8567K0517k6562j1335
10024C9114j7059J3081k853J655l885m8849O590p99K0512k335R83j2215J0305
$$ plain form
10107 -10922 -19211 -26336 -36461 -19986 -9217 5800 28380 -6072 10818 -5077 -42178 -42542
10095 -42542 -20553 -22653 4890 16587 -9895 -43713 -30428 8529 24093 30700 30632 26097 22491
10082 22491 47045 51053 17450 3908 20162 -4613 -29577 -16896 1325 18575 36841 55117
10070 55117 87871 96301 79681 61786 52604 98115 138653 134739 126985 110388 108862 110321 137890
10057 137890 195465 250743 321780 477757 729205 1236698 2263243 3532434 3287835 1995340
10047 1995340 1112601 680676 451881 296027 191322 109309 109737 105566 104078 112013 100602
10036 100602 112599 109344 77889 35905 38196 30725 -115 17927 56494 77011 50449 39114
10024 39114 22055 35136 32283 33938 30053 -18796 -12206 -13005 7507 5172 6155 -6060 4245
10011D245j41J779L3310k7377j9326L837L25Q135J0836L547J1048J5138J5545
9998F0901N656k1635k0527k5016k6802K3418j0624k438L6832j299L206N465J9890
9985D7027j3617J263k8655M2J6494p779k0852j0145R79r310Q932L5790j001m355
9971A4813o792q719j2297j0660O873J5939J8408j7877l6979K0299p326k997K9685
9958B370K3909P961j1467m2714M644L6873j8174K0871J8501k4689j8073k8415
9946b8403j7741j8229k0842P234N8180L112R060q77k1527l813J336K7393O013
9933H96J568p563j6954P834J0723J2436n8497k5103P288k1104L0098L2927K67
9920b5184j7685k7414j010R044L6859L3121K259K4490J5217L4012R765j683M050
$$ plain form
10011 4245 4104 5883 39193 11816 -7510 -3673 -3348 4787 15623 19170 30218 45356 60901
9998 60901 66557 44922 24395 -621 -27423 -4005 -14629 -17067 19765 18466 21672 27137 47027
9985 47027 33410 34673 6018 6060 22554 14775 -6077 -16222 -15243 -24553 -15621 20169 19168 14813
9971 14813 8021 -698 -12995 -23655 -16782 -843 17565 -312 -37291 -16992 -24318 -27315 2370
9958 2370 26279 34240 22773 -19941 -15297 21576 3402 24273 42774 18085 12 -28403
9946 -28403 -46144 -64373 -85215 -77981 -19801 -16689 -7629 -8506 -30033 -33846 -32510 -5117 896
9933 896 2464 -5099 -22053 -14219 -3496 8940 -49557 -74660 -67372 -88476 -58378 -25451 -25184
9920 -25184 -42869 -70283 -71293 -62249 -25390 7731 9990 34480 49697 83709 93474 91791 95841
9907I5841N093n5543m8015K4715j4514j544k7197K262J4038k6780l045j1101L6238
9894i552L4581K841J1227k1052l1906J6046J0818k497o417j0635m6058j5678N2361
9881a5921J7428J8101J670k0451P984R204j9403j330L0545K2342k1911m590j6473
9868G195L0958P300J6255K550k5570j6137O707L1151O571k8721k879M5954P289
9855H8623n177j7437j8371k0293j9420k687Q712J6272K3003j3069j8838K1590
9843D2908Q375j1042j3934l1888J2173O320K612J6143J8067L6450M90l4053K2931
9830G5552q414p373J2042N6576O934l546l7625r395K1615K905j7746L143J1764
9817A06432J7120J6912p490j0551l2538k3829O15J8382q979j76K6715j7588o4341
$$ plain form
9907 95841 100934 45391 -2624 22091 7577 6033 -21164 -18902 -4864 -31644 -34689 -45790 -9552
9894 -9552 25029 27870 39097 18045 -13861 2185 13003 10506 4089 -6546 -52604 -68282 -15921
9881 -15921 1507 19608 21278 827 8811 18015 -1388 -2718 27827 50169 28258 23668 7195
9868 7195 38153 45453 61708 64258 38688 22551 29258 60409 66980 38259 35380 81334 88623
9855 88623 83446 66009 47638 27345 7925 5238 13950 30222 53225 40156 21318 42908
9843 42908 51283 40241 26307 -5581 6592 12912 15524 31667 49734 86184 86674 52621 75552
9830 75552 67138 59765 71807 128383 135317 131771 94146 84751 106366 109271 91525 94668 106432
9817 106432 123552 140464 132974 122423 89885 66056 66671 85053 76074 75898 102613 85025 20684
9804B0684l672J4900K3607M940R412k576M272k2357j8326O3569N9242j6948n6869
9791G9878M360N8117O916O616L198l43M84O827J1380j4009J268O090j7746j7574
9777A35462j824L7893L889m0177j1092l5800k8769l005O026K8385j822q289L7739
9764A18616J4596N041l2994j8762Q196m4468P871M3333K1047N220J388N888J0501
9751A45473q751j9049l8784K2371L7174l188n3054j5208K8356k738k7164r688
9739E5750L558l922n801P982o354J0913q802K3871k334j6723j4898J9475J3861
9726G6576R695m1459k463m423L2396K105l7055j8895p942K4993J1965K4124j1104
9713E8513j8902j481k515j1216k3977m22K1811K392O7K1737l939J7557K4748O087
$$ plain form
9804 20684 17012 31912 55519 60459 69871 67295 71567 49210 30884 94453 153695 136747 79878
9791 79878 84238 142355 149271 155887 159085 158742 159226 166053 177433 163424 164692 170782 153036 135462
9777 135462 133638 171531 175420 135243 124151 88351 59582 56577 62603 90988 89166 80877 118616
9764 118616 133212 138253 105259 86497 94693 50225 58096 101429 122476 127696 129084 134972 145473
9751 145473 136722 117673 78889 101260 138434 135246 82192 66984 95340 92602 65438 55750
9739 55750 59308 55386 49585 57567 51213 62126 53324 77195 74861 58138 43240 62715 76576
9726 76576 86271 44812 42349 37926 70322 72427 35372 16477 8535 33528 45493 69617 58513
9713 58513 39611 38130 35615 24399 422 0 21811 24203 24270 46007 42068 59625 84373 90460
9699I0460k1951n082J315l3430j6865j2656k5731r406J2668K7844J2334K141R048
9686C0689j8599j8091K3042k1547k2802K564J9793K4437l7372l9234L3986O2985
9674C9851J9724l3525k7930j5329R329P503N878q782L409k7545j4836J5598J3954
9661a2701p328M5406K5015o84k0602J598J5131M105n068J5761j0616n853n008
9648C9156J2576J8235j6314N769J5550l4737k0186l927R567J5427J4541q643j5052
9635C1962J4353k2045m4488l0970K2473N5035l413j9518K8710n972Q278m182j2463
9622A7760l6400q805o275r558K3275k0R395q304K0074J2326j8512o970K8894k209
9608A4671n5586n662N072L7693J2733j2921k0551r948M962K0979J6587j4075m7490
$$ plain form
9699 90460 68509 63427 64742 31312 14447 1791 -23940 -33346 -20678 7166 19500 21641 30689
9686 30689 12090 -6001 17041 -4506 -27308 -24744 -4951 19486 -17886 -57120 -23134 39851
9674 39851 59575 26050 -1880 -17209 -7880 -377 5501 -3281 128 -27417 -42253 -26655 -12701
9661 -12701 -20029 25377 50392 49708 29106 30704 45835 49940 44872 60633 50017 44164 39156
9648 39156 51732 69967 53653 59422 74972 40235 20049 16122 25689 41116 55657 47014 31962
9635 31962 46315 24270 -20218 -51188 -28715 26320 22907 3389 32099 26127 34405 30223 17760
9622 17760 -18640 -27445 -33720 -43278 -20003 -20023 -10628 -18932 1142 13468 -5044 -12014 16880 14671
9608 14671 -40915 -46577 -41505 -3812 8921 -4000 -24551 -34499 -29537 -8558 8029 -6046 -53536
9595e3536L912Q987n345Q432k0254J9171j741N8261L3136j8134j2335n863m308
9582A0383m484l1227K267L0374k6495k932k7519o260L3509R197j6996J0792L6128
9569A6737P664l6079N065J2717J5451m843K2002K592R522J2254k8123k6503m5088
9556c6632m859j7472L3998M7253k1207k8781L585K0609K1856J6762J387k1855
9544A4644l8882k889r121j3992M3436J8058k3285k2697K1117J6624K0058J6241
9532C9312m92K2582p99m4853m8259m989P021J1422r919k1749J8120k372Q464L3114
9518F603J8086n231j6394O808l3091j8574N505K4515p55K834K5852j1975J3064
9505A7247K1381j6247p779j699k2780J8502O208k8726k0054q88M148Q478K2792
$$ plain form
9595 -53536 -49624 -40637 -45982 -37550 -57804 -38633 -40374 17887 51023 32889 20554 14691 10383
9582 10383 5899 -25328 -23061 7313 -19182 -22114 -49633 -55893 -22384 -13187 -30183 -19391 16737
9569 16737 24401 -11678 -6613 6104 21555 16712 38714 41306 50828 63082 34959 8456 -36632
9556 -36632 -41491 -58963 -24965 22288 1081 -27700 -24115 -3506 18350 35112 36499 14644
9544 14644 -24238 -27127 -36248 -50240 -6804 11254 -12031 -34728 -13611 3013 23071 39312
9532 39312 38820 61402 60603 15750 -32509 -37498 -30477 -19055 -28974 -50723 -32603 -34975 -26511 6603
9518 6603 24689 19458 3064 9872 -23219 -41793 -36288 -11773 -12528 -9694 16158 4183 17247
9505 17247 38628 22381 14602 12903 -9877 8625 14833 -13893 -33947 -34835 -30687 -22209 583
9492E83Q040j9539J0042n05l0224k5218o29J2746K0553M586j3829J0673M1057
9479A8336K7349k6577p260O922j9499j6422j5780M734K2878n38M0913K6753j7047
9466D4762m1531k034j3369K1055P258p812J2218P487k1560M438Q227k9974k7006
9453c7841K7112K0516j0772j6858j2803J4546J9625l0556k0056J216J4449m511
9441c5933j598L7383M2574j2119k8472k8437j4181k867N405K1442K9639k2824
9429i988n311Q652J6409M2330l5680j1171j47P566J3102k590j6640k067J1383
9416A5848j6990J0472K5225r282N432r984k5611N509J1634K2723R167l1015k7222
9403a4094m103L4419K779Q41K3229M00l2518R853K1818L8559N199k4141l1904
$$ plain form
9492 583 8623 -10916 -874 -1379 -31603 -56821 -57450 -44704 -24151 -19565 -33394 -22721 18336
9479 18336 45685 19108 11848 18770 -729 -17151 -32931 -28197 -5319 -5857 35056 61809 44762
9466 44762 3231 1197 -12172 8883 16141 8329 20547 28034 6474 10912 19139 -10835 -37841
9453 -37841 -10729 9787 -985 -17843 -30646 -16100 3525 -27031 -47087 -45871 -31422 -35933
9441 -35933 -37531 -148 42426 30307 1835 -26602 -40783 -43650 -38245 -16803 12836 -9988
9429 -9988 -15299 -6647 9762 52092 16412 5241 5094 12660 25762 23172 6532 4465 15848
9416 15848 -1142 9330 34555 25273 30705 20721 -4890 619 12253 34976 44143 13128 -14094
9403 -14094 -18197 16222 19001 19842 43071 43471 10953 20806 42624 81183 86382 62241 30337
9390C0337k1678K7345J6773J4643M266k4884k4688J3570K1749j9794R003k051
9378D4591J5210J8742k0922q375j6634m3201o1764J2409Q153L7658o280q598J3997
9365a5014K4217M3809M2318m77J162k416k6382J0494Q733r728O18M3418r348m9230
9351F2174O883j6571j9862K0901J7107O384J3526j6279k9544K703L1111k7067
9339E1466J3271R512j9228O922k1613j0245K5548k5658m670r445K1685M4303L7289
9326A19137m372k3556l031p909K6444P554K7405l6237j7359j2156j2304J2995
9314G6611o811r20K6139O298j3536P965R372L522K7051P949l1611L572L817o954
9300A12464j6340j1086L3371J2633K7697L831J0190l9616n62K5266k018J5443
$$ plain form
9390 30337 8659 36004 52777 67420 71686 46802 22114 35684 57433 37639 46642 44591
9378 44591 59801 78543 57621 49246 32612 -10589 -72353 -59944 -51791 -14133 -20413 -29011 -15014
9365 -15014 9203 53012 95330 94853 96015 93599 67217 77711 86444 76716 77334 120752 111404 62174
9351 62174 69057 52486 32624 53525 70632 77016 90542 74263 44719 47422 78533 51466
9339 51466 64737 74249 55021 61943 40330 30085 55633 29975 25305 15860 37545 81848 119137
9326 119137 114765 91209 88178 80269 106713 114267 141672 105435 88076 75920 63616 76611
9314 76611 69800 68880 95019 101317 87781 95746 105118 108640 135691 143640 112029 115601 119418 112464
9300 112464 96124 85038 118409 131042 158739 162570 172760 133144 132582 157848 155830 171273
9288A71273r024P253J604j6304m042K0344K5145R364k0131L060Q2K5512L0062
9275B44198J4189j7800l1498L3200N6301O4695j8600k1880l0494j1530K237K247
9263B85265M4142o010M519k435J1057Q509n551J5269K0313M0926M0140L1755m2633
9250D45266j4797L9179L5592M68P004M6920J5467m864n394J7134K0017K3243N7662
9237F82897K7302k5156K1643P2079N4053K0409P399J0244K5353K9981O3763N0043
9225A040010o938J0670N4742M7841J4988L9540Q8545O2988P3083N6808L6783P6420
9213A595480O7097M7762P6969P5997M6679P2065Q4101J08988P0183O8909O0346
9202B374576P7686O2897P1868O7502K9965L7559J9473P336N5101M4953M2510j6071
$$ plain form
9288 171273 162249 169502 171106 154802 150760 171104 196249 205613 185482 188542 188624 214136 244198
9275 244198 258387 240587 209089 242289 298590 363285 344685 322805 292311 280781 283018 285265
9263 285265 329407 323397 327916 325481 336538 345047 339496 354765 375078 416004 456144 487899 445266
9250 445266 430469 469648 505240 505708 512712 559632 575099 570235 564841 581975 601992 625235 682897
9237 682897 710199 685043 706686 778765 832818 853227 860626 870870 896223 926204 989967 1040010
9225 1040010 1033072 1043742 1098484 1146325 1161313 1200853 1289398 1352386 1425469 1482277 1519060 1595480
9213 1595480 1662577 1710339 1787308 1863305 1909984 1982049 2066150 2175138 2245321 2314230 2374576
9202 2374576 2452262 2515159 2587027 2654529 2684494 2722053 2741526 2748862 2803963 2848916 2891426 2875355
9190B875355m4883J2353J8397j8601k6085j3484o2341q0954n4834l2541l2671
9179B539711p8842p3263n5392l8373q4390p2103o7372j26921j04221p7183o1501
9168A700150k1530l6866q0066n7881m8112p8142p6728p7500l7876j4008j8957
9157A152484j0705o3904l3689o8301l0650l7326n5175j8749k7216n7598l2764
9146G16407j5616m0632m7988o899m2126k6838M1927O321j0197k8042k9369j5750
9134E01198j8522l9538O397J9624m9602l2428J3190j3911J9694L8094m1031O238
9122D09403k4029j484P61k0385j1078j7230j6232j0912j9777K557L5247J7185
9110C44026J4698J6599n4004n0989j5740L051k0765O517k3865j8779j8738j9451
$$ plain form
9190 2875355 2830472 2842825 2861222 2842621 2816536 2803052 2740711 2659757 2604923 2572382 2539711
9179 2539711 2460869 2387606 2332214 2293841 2209451 2137348 2069976 1943055 1838834 1761651 1700150
9168 1700150 1678620 1641754 1561688 1503807 1455695 1377553 1300825 1223325 1185449 1171441 1152484
9157 1152484 1141779 1077875 1044186 975885 945235 907909 852734 833985 806769 749171 716407
9146 716407 700791 660159 612171 605272 563146 536308 578235 584556 574359 546317 516948 501198
9134 501198 482676 443138 449535 469159 419557 387129 400319 386408 406102 444196 403165 409403
9122 409403 385374 383890 384651 364266 353188 335958 319726 308814 289037 291594 326841 344026
9110 344026 358724 375323 321319 270330 254590 257641 236876 243393 219528 200749 182011 162560
9098A62560o584K3979N59J179K6254O398J3863J2277l2582m2313K774K8061Q706
9085B05131k8862J630j5726m2393k2652L4589L1124o264K6937J3664k5076K718
9073A74820q134l1025J1284k851m3859j1767L1284J9034k4863j3440L954M5903
9061A50340J0876k6827j7191Q970L485j5439n4136J3167P193k2163q573K3842
9049G3544L4146M8688O181p057m915n0768J137j4360j4579l4331M100J3502o905
9036D8383K7801K6395J4771M862N167k0581r745J5060j0357j549l297K6861K0606
9023A44377N387J7103l0958j8125j1803m9681J0345L449j3687j4394j3232J5866
9011D4647M369l6454j5305q004K0944L1324K2702K765k2752j6256J0911j0161
$$ plain form
9098 162560 155976 179955 180514 181693 207947 214345 228208 240485 207903 165590 168364 196425 205131
9085 205131 176269 177899 162173 119780 97128 131717 162841 156577 183514 197178 172102 174820
9073 174820 166686 135661 146945 144094 100235 88468 119752 138786 113923 100483 104437 150340
9061 150340 161216 134389 117198 126168 129653 114214 60078 73245 80438 58275 49702 73544
9049 73544 107690 156378 162559 155502 150587 99819 100956 86596 72017 37686 41786 55288 48383
9036 48383 76184 102579 117350 122212 127379 106798 97053 112113 101756 100207 96910 123771 144377
9023 144377 149764 166867 135909 117784 105981 56300 66645 70094 56407 42013 28781 44647
9011 44647 49016 12562 -2743 -10747 10197 41521 64223 66988 44236 27980 38891 28730
8999B8730k2504j9757J6266k772P820K885Q262M988r392j9358j8264N385p116
8986b4827m823J2494L0445M8582R391K6105l3930k6993J9120m2957O63q662m10
8973D198K6753j4276q974K7723K43j71j310k639K5489K8j113m570K6812J7327
8959I5520j6595j7152j5647O859k1963k71n148N522j4449o186Q76K865q710J323
8945F844J3552j404j5471j239L6798j2590r203J0621L959K615j4109k591J7028
8932C4810M9739m859m0453j2812r416k5847J0559M0133p744J0395n544L7485l368
8919G3078l9039j0878P276K2742j1446J9947L3977j6099j3593k1046P077k5185
8907B6811j6202M2N0211K9012l1024o2740J7981L125k6379L37j107K6105J7301
$$ plain form
8999 28730 6226 -13531 2735 -37 7783 10668 18930 23918 14526 -4832 -23096 -17711 -24827
8986 -24827 -29650 -17156 13289 61871 71262 97367 63437 36444 55564 12607 13270 4608 4198
8973 4198 30951 16675 7701 35424 35667 35496 34186 31547 57036 57064 55951 51381 78193 95520
8959 95520 78925 61773 46126 52985 31022 30751 25603 31125 16676 10490 11366 14231 5521 6844
8945 6844 20396 18992 3521 2282 39080 26490 17287 27908 31867 34482 20373 17782 34810
8932 34810 84549 79690 39237 26425 17009 -8838 1721 41854 34110 44505 38961 76446 73078
8919 73078 34039 23161 30437 53179 41733 61680 95657 79558 65965 44919 51996 26811
8907 26811 10609 10651 60862 89874 58850 -3890 14091 17216 -9163 -8826 -9933 16172 33473
8894C3473K33K41k8063j0793o276j5239k0680j8102j6278k016L2164K2578L1088
8881B330J5394K9973K6871K5139O292k1940j4066j4461k3631J5908P315k0445
8869C4679j6858N076M877p864L534o094j1015k3297P792J716L4467j4842k5602
8856a3431O354q489q200J4138J3354k5200K4323K0608P647l2970j2747q514j0505
8843c3632J4348r671M934M0678L0243l7432j7256k509j3338p594j0116n605K9369
8830a7581Q064J0419j0025o695K454j6927O488N053K4909L3968Q912j5498k4109
8817I432j041l0129j2706R068L2290j5398m6646k808M0858K7264K5151k1242l3720
8804a9627r12k1368p229J5154K5804K4651J2371k7147p199n35J0154K3996M44
$$ plain form
8894 33473 33706 33947 5884 -4909 -11185 -26424 -47104 -65206 -81484 -83500 -51336 -28758 2330
8881 2330 17724 47697 74568 99707 105999 84059 69993 55532 31901 47809 55124 34679
8869 34679 17821 22897 27774 19910 23444 17350 6335 -16962 -9170 -7454 27013 12171 -13431
8856 -13431 -7077 -15566 -23766 -9628 3726 -21474 2849 23457 31104 -1866 -14613 -23127 -33632
8843 -33632 -19284 -28955 -24021 16657 46900 9468 -7788 -10297 -23635 -31229 -41345 -46950 -17581
8830 -17581 -9517 902 -9123 -15818 -13364 -30291 -23803 -18750 6159 40127 49039 33541 9432
8817 9432 8391 -21738 -34444 -25376 6914 -8484 -55130 -57938 -17080 10184 35335 14093 -19627
8804 -19627 -20539 -41907 -49136 -33982 -8178 16473 28844 1697 -5502 -6037 4117 28113 28557
8791B8557p119m4519j2266L2573J9979j7389k0057j6803Q756K8105N490K5222
8779C0529J8530j1173J0488N807k6224J575J47k1362K210J3720M131K916J2428
8766D3722l180k0735L385q961n382j7502r768k2132j01Q77O234L0878J7896M3775
8752E9006O406j7264j3047j9143j8833K338k3687n087j8382J1978J9876N3211
8740C7372M1268j669R743j1258l5218j2040R214O419J594n48j3185n1900Q382
8727a1826K3608Q891j9305J5992M037K2J1762j1658N616J3661K0556m763j2425
8714D4168J0638k5226k6517j6848j0018K4840J3375m450j9649p749J7333J3419
8702A3316O841K069L3498K7228N693l0379J2383K5800j9387Q221J065j5879m792
$$ plain form
8791 28557 21438 -23081 -35347 -2774 17205 -184 -20241 -37044 -28288 -183 5307 30529
8779 30529 49059 37886 48374 54181 27957 29532 29679 8317 10527 24247 28378 31294 43722
8766 43722 40542 19807 23192 14231 8849 -8653 -18421 -40553 -40654 -39777 -33543 -2665 15231 59006
8752 59006 65412 48148 35101 15958 -2875 -537 -24224 -29311 -47693 -35715 -15839 37372
8740 37372 78640 76971 86714 75456 40238 28198 37412 43831 45425 44877 31692 -20208 -11826
8727 -11826 11782 20673 1368 17360 21397 21419 33181 21523 27139 40800 61356 56593 44168
8714 44168 54806 29580 3063 -13785 -23803 1037 14412 9962 -9687 -17436 -103 13316
8702 13316 20157 22226 55724 82952 88645 58266 70649 96449 77062 85283 86348 70469 65677
8689F5677M944J8554r556Q589l3710j8401k2318M1578Q780l6450R349J0253k4793
8676B2496J2694j7925p947J7164j2168j2157L1161K2150J4413k9628J1786M2905
8664I4944j2200n3403j8662m776J8024J4527j4916n0907J199M1441M9280j1632
8652E2919l504j716K053J1059k7107k713K8161J7524l499l6073l9069L04J7687
8639A6026Q597J7855k5505l1559O478L0610n853q126J8026L6436J5680j2459j689
8626F4517J5465j4006l2461L968k8583p637J2274J6529P936j5436l8468K4485
8614H583J4759J2291p114J6556K4859l732p628k3145p865o298l3746M429N5481
8601D7430K9172Q22k6053n85K9178J532k2435j7368M828R311r782J1896p76m2162
$$ plain form
8689 65677 70621 89175 79619 88208 54498 36097 13779 55357 64137 27687 37036 47289 22496
8676 22496 35190 17265 9318 26482 14314 2157 33318 55468 69881 40253 52039 94944
8664 94944 82744 29341 10679 5903 23927 38454 23538 -27369 -26170 15271 64551 52919
8652 52919 49415 47699 49752 60811 33704 30991 59152 76676 73177 37104 -1965 -1661 16026
8639 16026 24623 42478 16973 -14586 -8108 22502 16649 8523 26549 62985 78665 66206 64517
8626 64517 79982 65976 33515 37483 8900 1263 13537 30066 38002 22566 -15902 8583
8614 8583 23342 35633 28519 45075 69934 66202 58574 35429 27564 21266 -12480 -8051 47430
8601 47430 76602 77424 51371 50786 79964 81496 59061 41693 46521 55832 46050 57946 57170 15008
8587A5008N216M744m262j0650K9130M65k1657K392K9350L8910j866r968j3517
8574F3295R715j8865j7458j0938K0644K6803L4K0246m3468j0569K5845j7500k4344
8561B3440k5760J4463l039L692o613j4782k0650p548K6019k7745r397J3323L6648
8548B051j3099l621K4547q474N883K5959M345k9656j0562J2934k8107L3630M6550
8535F2380j985J7603J6939R816k7804l6692k0677L34J3240K9791L0588J9336N997
8522A18866m9415m0070n433j7003m890L8883M003j0775l0275p074L0763j1117
8510A6463Q943m637j4107J314m465K9218N989R250J874j1351N876j5359k2973
8497F035k778j9147K4065j8604j654K7790N364M676J2689r235J5386J9262K4806
$$ plain form
8587 15008 20224 24968 20706 10056 39186 39651 17994 20386 49736 88646 86780 76812 63295
8574 63295 73010 54145 36687 25749 46393 73196 73230 93476 50008 39439 65284 47784 23440
8561 23440 -2320 12143 9104 12796 6183 -8599 -29249 -36797 -10778 -38523 -47920 -34597 2051
8548 2051 -11048 -14669 9878 1404 7287 33246 37591 7935 -2627 10307 -17800 15830 62380
8535 62380 60395 77998 94937 104753 76949 40257 19580 19914 33154 62945 93533 112869 118866
8522 118866 69451 29381 23948 6945 2055 40938 44941 34166 3891 -3183 27580 16463
8510 16463 25406 20769 6662 7976 3511 32729 38718 47968 49842 38491 44367 29008 6035
8497 6035 3257 -15890 8175 -10429 -12083 15707 21071 25747 38436 29201 44587 63849 88655
8484H8655K1588j4836l2254L0485j0989j4420p835j4226p695j8788n6896J5141
8472b2070K7918o226p621j0385K4686L4804l1457K584j7253j5595J0284k4897
8460c5228O509L087P660M8995J7511J6599k7979j5927k046m152K642p718N0643
8447F0596L5960J5760m2221k8418J333M1038O6211L9854M4611Q5809R3265O6082
8435D79880j3125r3256j14241n6234k2390m0769k8251j8801o479k0540n467J2370
8423G2697m8779l8834N517M8967k1615l7176K3293L2194k5019J4887M6563N401
8411G8096l3975n2747r861L84K0409K8980K3652K525j421J9721j8850k4750O656
8398C8819O7787Q2732P0609O1517J01103J14105J63508J63766P8601q5958j96676
$$ plain form
8484 88655 110243 95407 63153 93638 82649 68229 60394 46168 38473 19685 -37211 -22070
8472 -22070 5848 -378 -7999 -18384 6302 41106 9649 12233 -5020 -20615 -10331 -35228
8460 -35228 -28719 -25632 -17972 31023 48534 65133 37154 21227 19181 15029 17671 9953 60596
8447 60596 96556 112316 70095 41677 43010 84048 150259 190113 234724 320533 413798 479880
8435 479880 466755 373499 259258 203024 180634 139865 111614 92813 86334 65794 60327 72697
8423 72697 23918 -14916 -9399 39568 17953 -19223 4070 36264 11245 26132 72695 78096
8411 78096 44121 -8626 -18487 -18103 2306 31286 54938 57463 56042 75763 56913 32163 38819
8398 38819 106606 189338 259947 321464 422567 536672 700180 863946 942547 856589 659913
8387F59913j93942j27349p0540n5895l8554k2152L887q903n2928m4789m778l883
8375D0087L156j7238J3492N0972N42l0702k1970m5478o99K9844J4562l2016o229
8362a677Q59L0917M2597M766m103n604l6418j4075K8402J9m267m774M3738N6713
8348A37093P3967L9261P2619P7246J3361l6909p4115q4308n8313m1837J210q956
8336A10319k3281m0719n236O215j3827k796M357J0836j3804p574J0862L5853k0686
8323E0519O646p132p938j4558L2679J1341m2976J0515o033j8568k0799K6411O868
8310B6975N323k1476J6419l2971j5137k2121J8088Q615L827k2217k2296J4918
8298d2053L0276q896o724j9261L4190O0341O68l3210J00R580r971K050N98l3830
$$ plain form
8387 659913 465971 338622 268082 212187 173633 151481 155368 146465 93537 48748 43970 40087
8375 40087 43243 26005 39497 90469 91011 60309 38339 -7139 -7838 22006 36568 4552 -1677
8362 -1677 -818 30099 72696 77462 73359 67755 31337 17262 45664 45683 41416 36642 80380 137093
8348 137093 211060 250321 322940 400186 413547 376638 302523 218215 159902 118065 119275 110319
8336 110319 87038 46319 41083 47298 33471 30675 35032 45868 32064 24490 35352 71205 50519
8323 50519 57165 50033 42095 27537 60216 71557 28581 39096 33063 14495 -6304 20107 26975
8310 26975 32298 10822 27241 -5730 -20867 -42988 -24900 -16285 -12458 -34675 -56971 -42053
8298 -42053 -11777 -20673 -27397 -46658 -12468 47873 48541 15331 15431 25011 15040 17090 17688 -16142
8284a6142J847l015l0179J8238J1612k8227J4124J0122q252J6769K0301J1016
8272A8214q942J9589r473j0478m214j0054J1084k2042k0278j172j5454n618O655
8259e2183K8702K842j238O795l5082k1222M0476J4207l6446l9484q406R821K3477
8246f7741M0746m098r728P687Q78J0669k7120k7609J7488K2536R973k6045m071
8233e6435K4178q228J8726l828M492j0880m2045P820K2240r042j2634L1551J4373
8220a9712J1479J8273Q610k2554j7984k2145J9725L6236J2973l4498K301k7855
8208c5151q775K0707J4589J0315L8172O503k8506r122k2118n793j565L5450K6729
8195D1435N24k6444n305J9367Q876m3256j7069M1990M426N418m8988l4321M971
$$ plain form
8284 -16142 -14295 -17310 -47489 -29251 -17639 -45866 -31742 -21620 -29872 -13103 7198 18214
8272 18214 9272 28861 19388 8910 4696 -5358 5726 -16316 -36594 -37766 -53220 -58838 -52183
8259 -52183 -23481 -20639 -21877 -15082 -50164 -71386 -30910 -16703 -53149 -92633 -101039 -91218 -67741
8246 -67741 -26995 -31093 -40821 -33134 -32256 -21587 -48707 -76316 -58828 -36292 -26319 -52364 -56435
8233 -56435 -32257 -40485 -21759 -25587 -21095 -31975 -74020 -66200 -43960 -53002 -65636 -34085 -19712
8220 -19712 -8233 10040 18650 -3904 -21888 -44033 -24308 11928 24901 -9597 -7296 -35151
8208 -35151 -43926 -23219 -8630 1685 39857 46360 17854 8732 -13386 -19179 -20744 14706 41435
8195 41435 41959 15515 10210 29577 38453 -4803 -21872 20118 24544 29962 -19026 -53347 -48376
8182d8376L1797L1539j2558J1240J0732R250j5093J2131J5329l7453j4920k8915
8170c5297l1654k775J2348n498o900K7618M0228K2518j6J5820j4038l6325k1420
8157c5391K0391K3878j3899K866R499j1341O362J6114l419j5632k7853j40k1234
8144d9799K1637L2539k4671k1049J3958k3930m006L3013j1158l7348J1844K4844
8132c4126L1580J8460j6847j0064J3261J3054j0257l2082l0871L045J5743o80
8120c9784J7561K8739l761j5791j6294l2703r305K2923J8016L5437j5696j232
8108a1890K5548n018j9352o221r069k6146K983K8993M5428K0836l2010j6109J8138
8095A6111J095R143o095l5237L049L7720j6763j4358k5000J219j8080l786J9556
$$ plain form
8182 -48376 -16579 14960 2402 13642 24374 33624 18531 30662 45991 8538 -6382 -35297
8170 -35297 -66951 -69726 -57378 -62876 -69776 -42158 -1930 20588 20572 36392 22354 -13971 -35391
8157 -35391 -15000 8878 -5021 -2155 7344 -3997 2365 18479 15060 -572 -28425 -28565 -49799
8144 -49799 -28162 4377 -20294 -41343 -27385 -51315 -55321 -22308 -33466 -70814 -58970 -34126
8132 -34126 -2546 15914 -933 -10997 2264 15318 5061 -27021 -57892 -54847 -39104 -39784
8120 -39784 -22223 6516 2755 -13036 -29330 -62033 -71338 -48415 -30399 5038 -10658 -11890
8108 -11890 13658 8640 -10712 -16933 -26002 -52148 -49165 -20172 25256 46092 14082 -2027 16111
8095 16111 17206 26349 20254 -14983 -11934 25786 9023 -5335 -30335 -29116 -47196 -50982 -31426
8082c1426j1731k342j4230K9290O495q279L698K4906j1089j5092M2046J6417O49
8069B9312n0943l906K9078l645Q948k539j0804R434J8367k809k1801r832J3754
8056B614O596l6308J569J3155p344J0832k1120j530L2450N027m6665k1099J2943
8043d8880Q897K5539J5042J4463j8237k0440n8237l3824L8502K2651Q821j1588
8031e7291j3516K2890O050J0909M1234j6942m3081l0054K3369M0115L4037P638
8019B5358j1878j697k4865j1172P126j251K9072R163O296j9920k2423L0681J3993
8006B8483L722j7480P967r456k7304j0471k0192K5348R621j4884J4516P887l3597
7993c5840r166N580J5487N600K7501l5626o480J3778J9203J7159k7259L652k284
$$ plain form
8082 -31426 -43157 -45499 -59729 -30439 -23944 -32223 -28525 -3619 -14708 -29800 12246 28663 29312
8069 29312 -21631 -25537 3541 -104 8844 6305 -4499 4935 23302 20493 -1308 -11140 2614
8056 2614 9210 -27098 -25529 -12374 -19718 -8886 -30006 -31536 914 5941 -40724 -61823 -48880
8043 -48880 -39983 -14444 598 15061 -3176 -23616 -81853 -115677 -77175 -54524 -45703 -57291
8031 -57291 -70807 -47917 -41867 -30958 10276 -6666 -49747 -79801 -56432 -16317 17720 25358
8019 25358 13480 11783 -13082 -24254 -17128 -18379 10693 19856 26152 6232 -16191 14490 28483
8006 28483 32205 14725 22692 13236 -14068 -24539 -44731 -19383 -9762 -24646 -10130 -2243 -35840
7993 -35840 -45006 -39426 -23939 -18339 9162 -26464 -32944 -19166 37 17196 -10063 -6411 -8695
7980h695n020J7439k854J2103p553m9172J4028R034J3981O1575O201k5479k7741
7967G847k5996K0752j3476l916K4808L6859m1012m2552n677J807J6269M880j7539
7954c6946J1226K6167j8117Q456O747p331K0539j5696k9718K2716r174k5231N355
7941d1007p004K4877K5934J1152o3023m0925J1920J3680L8318K1556J5221k3706
7929a3007r516m5418k6489K9468K2460K0971j0404j3696J9026K954K1680L7879
7917C5908K7886l8483j4390j8167m7481l4975J4897L3138J8664k201n4345J1941
7905f7608L8886L8853N2464j3875m6387L18L7972l1935l6146r947J327J9409j74
7892a6843j6938l377L7184J2199j1691K2966k4872J2829O032J5525n940J0233
$$ plain form
7980 -8695 -13715 3724 870 12973 5420 -43752 -29724 -20690 -6709 54866 61067 35588 7847
7967 7847 -18149 2603 -10873 -14789 10019 46878 5866 -36686 -42363 -40556 -24287 -19407 -36946
7954 -36946 -25720 447 -17670 -9214 -2467 -9798 10741 -4955 -34673 -11957 -21131 -46362 -41007
7941 -41007 -48011 -23134 2800 13952 -49071 -89996 -78076 -64396 -26078 -4522 10699 -13007
7929 -13007 -22523 -67941 -94430 -64962 -42502 -21531 -31935 -45631 -26605 -23651 -1971 35908
7917 35908 63794 25311 10921 -7246 -54727 -89702 -74805 -41667 -23003 -25204 -79549 -67608
7905 -67608 -28722 10131 62595 48720 2333 2651 40623 8688 -27458 -37405 -36078 -16669 -16843
7892 -16843 -33781 -37158 26 12225 534 23500 -1372 11457 17489 33014 27074 37307
7880C7307l0213j9329m006L070j6992r131L9260M5887J7247j9337j7442Q993j615
7867C3699l463m0029k0931J8660L880l709o470J122p527Q887L0417N211k0894
7854a147l116J4001r209j3198o27K3172k0071N644k1590j0581K3170J4474L18
7841A240j5938J5717J8180l0668l3293O264K738n194l068l046P133J5188K4250
7828d97N456J6687K216r216k8812M5468J0737k4210k5115k4537l072j9561j2566
7815f7022l163L822M684Q416L0229K5764J0515l798p481k6441k2618J2366Q013
7802b6714J3414J0102L0027J1224L0363k1407J5579j2905m3489k5996P08M46J8317
7789c31j8713l1666j4039L6655M1603o675j1592J2023K6838k360j0096N112o074
$$ plain form
7880 37307 7094 -12235 -16241 -13171 -30163 -39294 -34 45853 63100 43763 26321 35314 33699
7867 33699 30236 -9793 -30724 -12064 -8184 -11893 -18363 -17241 -24768 -15881 14536 19747 -1147
7854 -1147 -4263 9738 529 -12669 -13296 9876 -10195 -4551 -26141 -36722 -13552 922 1240
7841 1240 -14698 1019 19199 -11469 -44762 -38498 -35760 -40954 -44022 -47068 -39935 -24747 -497
7828 -497 4959 21646 23862 14646 -14166 31302 42039 17829 -7286 -31823 -34895 -54456 -67022
7815 -67022 -70185 -66363 -61679 -53263 -23034 2730 13245 9447 1966 -24475 -47093 -34727 -26714
7802 -26714 -13300 -3198 26829 38053 68416 47009 62588 49683 6194 -19802 -19094 -18648 -331
7789 -331 -19044 -50710 -64749 -28094 13509 6834 -4758 7265 34103 31743 21647 26759 20685
7776B0685j818j4157K4788J4840m145l0735j7483k4706q721J5243P979J9380L276
7763D426J0897M2182M058n5905j5123J3510j1927k4913Q777K5793N523M302p531
7750D069k397L6515N847M04K016l1115j914j507j0513k7893j4140k628R925J9509
7736a3822J3945n610n5114o863L7792j3649P20J7301K2609K4409j8801n471n0201
7723e2755k44M414K4139J1037O898N252j5760L1221O323k8595l4142p763L5271
7710a4704K4637J532M865n060K4497r40k0003j8591k5413L198J1639J0055L511
7697g77j4719K8409J6669q809m0065K6272K9495j0731j5161j7819j6062o458j8467
7684d8223J3800K1275l330L216j5339j6139j5218j7528M040j0968j2496J0096
$$ plain form
7776 20685 18867 4710 29498 44338 40193 9458 -8025 -32731 -41452 -26209 -18230 1150 4426
7763 4426 15323 57505 61563 5658 -9465 4045 -7882 -32795 -24018 1775 7298 11600 4069
7750 4069 1672 38187 44034 44438 46454 15339 13425 11918 1405 -26488 -40628 -43256 -33331 -13822
7736 -13822 123 -5487 -60601 -67464 -29672 -43321 -42601 -25300 -2691 21718 2917 -2554 -52755
7723 -52755 -52999 -48585 -24446 -13409 -6511 -1259 -17019 14202 20525 -8070 -42212 -49975 -14704
7710 -14704 9933 11465 16330 11270 35767 34827 14824 -3767 -29180 -25982 -14343 -4288 -777
7697 -777 -15496 12913 29582 20773 -19292 6980 36475 25744 10583 -7236 -23298 -29756 -48223
7684 -48223 -34423 -13148 -16478 -13262 -28601 -44740 -59958 -77486 -73446 -84414 -96910 -86814
7672h6814P1478M3100P417k0210P283J9624j7543k0102m908J1624m782j018m2451
7659c7302n482J1495j636J2291L2676j0212l3319n323M536N374J685P851P448
7646i918J6670K576p203j3116l2676l901k076J5247q911l3147K0744O3345J1049
7633A8683j6116Q916K103J3856k848n893K5169Q747k4721k1642L541j4689J0028
7620E134J1189k3943K0661p736m192j7966l5114j7224J2540J3518R968J9226q027
7607b1966m0778j4593K7801K8584K1510k4018j3463N130o307M208q218M248K363
7594c5499m602L574K0981J8837M245l8615j1804K3959O477J0747K1484N666k440
7581B3010O898l962O931J9728j4619j6907m306J3893Q91n1149L694L1886J9643
$$ plain form
7672 -86814 -15336 27764 35181 14971 22254 41878 24335 4233 -675 10949 6167 5149 -37302
7659 -37302 -42784 -31289 -32925 -20634 12042 1830 -31489 -36812 -32276 -26902 -25217 -17366 -9918
7646 -9918 6752 9328 2125 -10991 -43667 -47568 -49644 -34397 -43308 -76455 -55711 7634 18683
7633 18683 2567 11483 13586 27442 24594 18701 43870 52617 27896 6254 9795 -4894 5134
7620 5134 16323 -7620 13041 5305 1113 -16853 -51967 -69191 -56651 -43133 -33165 -13939 -21966
7607 -21966 -62744 -77337 -49536 -20952 558 -23460 -36923 -31793 -38100 -33892 -42110 -37862 -35499
7594 -35499 -40101 -36527 -15546 3291 7536 -31079 -42883 -18924 -12447 -1700 19784 25450 23010
7581 23010 29908 25946 32877 52605 37986 21079 16773 30666 31557 -19592 -15898 15988 35631
7568C5631m0950n3710j6497K3530M3332J1606m56O282J7190J9449k3655j4709
7556G043J7123K9852m4624l9188r227N676p047l7692n946K4601j1389J0016L5189
7543b5613K618j436K6363J8158k9547j9847j4347N424J0455j8532M093R34R236
7530c2041K175R116K163j2186l4377j5583K8355J0540K2249L932o916k2082J4170
7517c0485K1356L0485P416k6108q50J1846k2069l2028L1800M5274R10k4937k7921
7504a5311N574k5748k8949N3074J9234j8036K6854N1281k2683k0030j485K8346
7492E2121m3370m1177R407K7300j5592p655J2274K5646L2961k9251m2474j0423
7480c0233Q212P831k5641k7256J4477P56n784J2406O1991N8262r24n396l0245
$$ plain form
7568 35631 -5319 -59029 -75526 -51996 -8664 2942 2486 8768 25958 45407 21752 7043
7556 7043 24166 54018 9394 -29794 -39021 -33345 -40392 -78084 -84030 -59429 -70818 -60802 -25613
7543 -25613 -22995 -24431 1932 20090 -9457 -29304 -43651 -38227 -27772 -46304 -42211 -41277 -32041
7530 -32041 -29866 -20750 -18587 -30773 -65150 -80733 -52378 -41838 -19589 -15657 -22573 -44655 -30485
7517 -30485 -9129 21356 28772 2664 1814 13660 -8409 -40437 -8637 36637 37547 12610 -15311
7504 -15311 -9737 -35485 -64434 -11360 7874 -10162 16692 67973 45290 25260 23775 52121
7492 52121 8751 -32426 -23019 4281 -11311 -18966 -6692 18954 51915 22664 -19810 -30233
7480 -30233 -22021 -14190 -39831 -67087 -52610 -51854 -57638 -45232 16759 75021 74097 68701 38456
7467C8456j0367k2864k6706k4586l560J0503L6371j9338k9786L3477L440j1575
7455b6535J9587L7920K5804J6894J581o3217m2835j0869J8252Q687P767k346M769
7442d541k3666Q939K337J6468K657J688k0884l4M2277m2396j2124L1651K2898
7429B5270j094j4604m3394k1238m148J2850J387M324k4883o17J5015K6698Q614
7416a5820J801K2630j9344j1341J2022J9141K9774l522m7657l4025J3599K3175
7404i567L1714n2177j0527j0587k0382J5443K6108J1804K0261o525P718Q92k0649
7391a6474l0790K094K7570K7551j5695r985J8120k752p188J7332k5522j6003j0420
7378d2162j3971l1798O486K0648J4149l667k1331K2128J3023J0552j2381L181
$$ plain form
7467 38456 28089 5225 -21481 -46067 -49627 -39124 -2753 -22091 -51877 -18400 -14960 -26535
7455 -26535 -6948 30972 56776 73670 75251 12034 -30801 -41670 -23418 -14731 -6964 -9310 -4541
7442 -4541 -28207 -19268 -16931 -463 2194 3882 -17002 -17036 25241 -17155 -29279 2372 25270
7429 25270 24176 9572 -33822 -55060 -59208 -46358 -44971 -40647 -65530 -66147 -51132 -24434 -15820
7416 -15820 -14019 8611 -10733 -22074 -10052 9089 38863 35341 -12316 -46341 -32742 -9567
7404 -9567 22147 -30030 -40557 -51144 -71526 -56083 -29975 -18171 2090 -4435 3283 4175 -16474
7391 -16474 -47264 -45170 -17600 9951 -5744 -15729 2391 -361 -7549 9783 -15739 -31742 -42162
7378 -42162 -56133 -87931 -81445 -60797 -46648 -50315 -71646 -49518 -36495 -25943 -38324 -35143
7366c5143r210J7931Q160o81m776K154j7881K924l0321l5218M5340J0307P47J7348
7352b8319q934K0436K0253p436K5312m9586m0094k7999K5209L8596J6244L0111
7340A3793K1289k1996l1980j1332J9080J9720n4088J7040l771l3161J7014O3990
7328A5598J2352j3419l2867r804J9491O975N487j9684K9944L9042j298J705j6837
7315C6685m2883k4150l5261M594m266K0704M8422L3462J2447l3382j1955J431
7303E848R272q743l918J8999J0507l6277k5470l418J2370n0727N571L9530o502
7290c2958O755J0292k4288l4322K1300N949K228L500J1200L3523K5153j3222k0077
7277d967J3454L0228j9927k1586j4282j3606L6146J5933R217K7143j3396m244
$$ plain form
7366 -35143 -44353 -26422 -18262 -18943 -23719 -21565 -39446 -36522 -66843 -102061 -56721 -46414 -45667 -28319
7352 -28319 -37253 -16817 3436 -4000 21312 -28274 -68368 -96367 -71158 -32562 -16318 13793
7340 13793 35082 13086 -18894 -30226 -11146 8574 -45514 -28474 -32245 -65406 -48392 15598
7328 15598 27950 14531 -18336 -28140 -8649 -1674 3813 -15871 14073 53115 51817 53522 36685
7315 36685 -6198 -30348 -65609 -61015 -65281 -44577 3845 37307 49754 16372 4417 5848
7303 5848 15120 6377 2459 21458 31965 -4312 -29782 -33200 -20830 -71557 -65986 -26456 -32958
7290 -32958 -26203 -15911 -40199 -74521 -53221 -47272 -45044 -41544 -30344 3179 28332 15110 -4967
7277 -4967 8487 38715 18788 -2798 -17080 -30686 5460 21393 30610 57753 44357 40113
7265D0113L777k8694j0549K1439m450j4191J2682j1786J0806J8239l3127j9163
7253a4904J8863k261P389l526j7362q437n551M337l679j4266N614K4889K1632
7240A2738k141o959J5366L6795j3784p277k8291o208k6093n565m552N0854K6263
7227D1146j4811j2876J4068J5647j1230j720j6497k7808l2066j2408j0073j7067
7215h5695K0894M3317L0534q142N603K6M048k7093l141J55L6000L6486m09j5100
7201C7483k1755m0901k8426j688J9802j2386K4885K2738L2857k6581k3243m9492
7189f6707q75K1028N298j9768k5459J9820N7604J8451l1583j8477j5343M7642
7177h369M4570K1464k038m4733k6081N341l636J3177k1937l658j6948L058J029
$$ plain form
7265 40113 43890 15196 4647 26086 21636 7445 20127 8341 19147 37386 4259 -14904
7253 -14904 3959 1698 9087 5561 -11801 -20238 -25789 -21452 -25131 -39397 -33783 -8894 12738
7240 12738 10597 3638 19004 55799 42015 34738 6447 239 -25854 -31419 -35971 14883 41146
7227 41146 26335 13459 27527 43174 31944 30224 13727 -14081 -46147 -58555 -68628 -85695
7215 -85695 -64801 -21484 9050 908 6511 6537 10585 -16508 -19649 -19494 16506 52992 52583 37483
7201 37483 15728 -25173 -53599 -55287 -35485 -47871 -22986 -248 32609 6028 -17215 -66707
7189 -66707 -67582 -46554 -41256 -61024 -86483 -66663 -9059 9392 -22191 -40668 -56011 -8369
7177 -8369 36201 57665 55627 10894 -15187 -9846 -13482 -305 -22242 -25900 -42848 -39790 -38761
7164c8761K0062K9002k8981j159j2043J6463J7249p579n792r173Q70q893J5468
7151a3267J3813J969k5024n3727K7880N1946J0215P932N14Q986M027J91J052l1230
7137E277n5741O675N984j877M567J4127L0700K4307K344k7710k3299k6093n505
7124d6244j2097J3681J9210j840M650J1606j0347K5684J9235r108j6300l4354
7112c6224j2175J2511K3804K481l2528m227K992N659k881K0727Q169k7497P386
7099c1803P377N462J7728R182k37K890j2970Q673K3166l518m1789k2345M096p698
7085d1786n185j2376Q779P84K2821J0153L7052j1518k5591j1040j6672J5060K7707
7072a812k0188J0400K0360R129J5272k366j2714k6606j2975n628j1503j043k729
$$ plain form
7164 -38761 -18699 10303 -18678 -19837 -31880 -15417 1832 -5747 -11539 -20712 -19842 -28735 -13267
7151 -13267 546 2515 -22509 -76236 -48356 3590 13805 21737 22251 31237 35264 35455 36507 5277
7137 5277 -50464 -43789 -37805 -39682 -35115 -20988 9712 34019 36363 8653 -14646 -40739 -46244
7124 -46244 -58341 -44660 -25450 -27290 -22640 -11034 -21381 4303 23538 14430 -1870 -36224
7112 -36224 -48399 -35888 -12084 -9603 -42131 -46358 -43366 -37707 -40588 -19861 -11692 -39189 -31803
7099 -31803 -24426 -18964 -1236 7946 7709 10599 -2371 6302 29468 25950 -15839 -38184 -34088 -41786
7085 -41786 -46971 -59347 -50568 -49784 -26963 -16810 20242 8724 -16867 -27907 -44579 -29519 -1812
7072 -1812 -22000 -11600 8760 17889 33161 30795 18081 -8525 -21500 -27128 -38631 -39674 -42403
7059d2403l634K3597j3032J9179K1557j9433J893n14q61K7907m342j4848m04L167
7045b171k4446j0341J1129P107L1629J5099m0142J6137J5995j2737N432Q149J3796
7032C4636k0075j1386k0652j5147o749K250L3502J1068j9532j996K1776n0477
7020d2782k1548M8417n368r454j1301J650j3214L232L6595K1793k7828k7147o856
7007e3811K7484P088P201K0254m0829j2846k6539q194O113J2118K6966k393J3514
6994b3874m608J9079k3035J355K7623J4433J7729j2182m1945n799J983j9985m009
6981e3235J8534r875J0761j645L684L9093j2065k3209K9854M0946K193j5618O675
6968C6093J9744j773k0348m0166q363M1030n740k7901p485k3808n061P371Q208
$$ plain form
7059 -42403 -46037 -22440 -35472 -16293 5264 -14169 -12276 -12790 -13651 14256 9914 -4934 -5338 -2171
7045 -2171 -26617 -36958 -25829 -18722 12907 28006 -12136 4001 19996 7259 12691 20840 34636
7032 34636 14561 3175 -17477 -32624 -39373 -37123 -3621 7447 -12085 -14081 7695 -42782
7020 -42782 -64330 -15913 -21281 -30735 -42036 -40386 -53600 -50368 -13773 8020 -19808 -46955 -53811
7007 -53811 -26327 -19239 -12038 8216 -32613 -45459 -71998 -80192 -74079 -61961 -34995 -37388 -23874
6994 -23874 -28482 -9403 -32438 -31083 -3460 10973 28702 16520 -25425 -31224 -29241 -49226 -53235
6981 -53235 -34701 -44576 -33815 -35460 -31776 7317 -4748 -27957 1897 42843 45036 29418 36093
6968 36093 55837 54064 33716 -6450 -14813 26217 20477 -7424 -14909 -38717 -43778 -36407 -28199
6955b8199R731N698L3021L1568n3320l906O468j2568J6000J4555K274O909m208
6942B4023m1924j925o010j2698R439k1711K6439L4634k4441l829l3745K729N8060
6929I041J0014k997K1374m2440m9576k80j706J3689K373p417k746J3137O195J6130
6915a5209l709J1023L0065J4111k6816m0158J4114L6017K9995J2864q547l1099
6903B2651l1145q189k6328j6750K531M2239K7174j9232l2161q606K0730J0703
6891a6383L1628J4495j0970j1898j4318N71j481J9714J3568k2140l5973O151M891
$$ plain form
6955 -28199 -18468 -12770 20251 51819 -1501 -5407 1061 -11507 4493 19048 21322 28231 24023
6942 24023 -17901 -19826 -25836 -38534 -29095 -50806 -24367 10267 -14174 -18003 -51748 -49019 9041
6929 9041 19055 16058 37432 -5008 -54584 -54864 -56570 -42881 -40508 -47925 -50671 -37534 -31339 -15209
6915 -15209 -18918 -7895 22170 36281 9465 -30693 -16579 19438 49433 62297 53750 22651
6903 22651 -8494 -16683 -43011 -59761 -57230 -14991 12183 -7049 -39210 -47816 -27086 -16383
6891 -16383 15245 29740 18770 6872 -7446 -6875 -8356 11358 24926 2786 -33187 -27036 -22145
$$ [...]
##END NTUPLES=NMR SPECTRUM
##END=
