##TITLE=Analysis number 325394
Compound Code cc 61416
Book Reference 449/176/2
Project Code adrs
Chemist Name davee
##JCAMPDX= 6.0         $$ Bruker NMR JCAMP-DX V2.0
##DATA TYPE= NMR SPECTRUM
##DATA CLASS= NTUPLES
##ORIGIN= Bruker BioSpin GmbH
##OWNER= nmr
$$ XWIN-NMR		Version 3.5
$$ Tue Jan  2 11:25:06 2007 GMT Standard Time (UT+0h)  MAYBRIDGE\nmr@NMR_250MHZ
##.OBSERVE FREQUENCY= 250.131544655141
##.OBSERVE NUCLEUS= ^1H
##.ACQUISITION MODE= SIMULTANEOUS (DQD)
##.ACQUISITION SCHEME= undefined
##.AVERAGES= 16
##.DIGITISER RES= 18
##SPECTROMETER/DATA SYSTEM= dpx250
##.PULSE SEQUENCE= zg30
##.SOLVENT NAME= CDCl3
##.SHIFT REFERENCE= (INTERNAL, CDCl3, 0, 16.5422)
##AUDIT TRAIL= $$ (NUMBER, WHEN, WHO, WHERE, WHAT)
$$ ##TITLE= Audit trail, XWIN-NMR		Version 3.5
$$ ##JCAMPDX= 5.01
$$ ##ORIGIN= Bruker BioSpin GmbH
$$ ##OWNER= nmr
$$ C:\u/data/dgb/nmr/ADRS/100/pdata/1/auditp.txt
$$ ##AUDIT TRAIL=  $$ (NUMBER, WHEN, WHO, WHERE, WHAT)
(   1,<2007-01-02 11:24:46.74 +000>,<MAYBRIDGE\nmr>,<NMR_250MHZ>,
      <created by zg, POWCHK disabled, PULCHK disabled
       configuration hash MD5:
       49 4B E0 1D 92 C2 6B 37 9F E6 65 BC 52 41 86 1D
       data hash MD5: 64K
       7D 72 8F E8 32 A0 4F 02 B0 90 99 2A 10 2E F1 96>)
(   2,<2007-01-02 11:24:57.91 +000>,<MAYBRIDGE\nmr>,<NMR_250MHZ>,
      <Start of raw data processing
       ef LB = 0.3 FT_mod = 6 PKNL = 1 SI = 32K 
       data hash MD5: 32K
       A6 CE D9 0E 9B A2 C5 97 EB F3 36 FF 15 4E 94 CA>)
(   3,<2007-01-02 11:24:59.66 +000>,<MAYBRIDGE\nmr>,<NMR_250MHZ>,
      <apk 
       data hash MD5: 32K
       D8 95 F9 83 D3 D5 AF 54 06 FE FE 8E A6 FF AC 5A>)
(   4,<2007-01-02 11:25:00.35 +000>,<MAYBRIDGE\nmr>,<NMR_250MHZ>,
      <abs ABSG = 5 
       data hash MD5: 32K
       54 C0 91 4D C3 7E E1 B6 3D 6D D3 60 D5 D3 74 72>)
$$ ##END=
$$ 
$$ hash MD5
$$ 18 44 DC 61 92 B2 8E CA 56 B0 57 AC CD E7 D5 3A
##$RELAX= 
##$RELAX= 
##$RELAX= 
##$RELAX= 
##$RELAX= 
##$RELAX= 
##$RELAX= 
$$ Bruker specific parameters
$$ --------------------------
##$DU= <C:\u>
##$EXPNO= 100
##$NAME= <ADRS>
##$PROCNO= 1
##$TYPE= <nmr>
##$USER= <dgb>
##$AMP= (0..31)
100 100 100 100 100 100 100 100 100 100 100 100 100 100 100 100 100 100 
100 100 100 100 100 100 100 100 100 100 100 100 100 100 
##$AQSEQ= 0
##$AQ_mod= 3
##$AUNM= <au_zg>
##$AUTOPOS= <14 >
##$BF1= 250.13
##$BF2= 250.13
##$BF3= 250.13
##$BF4= 250.13
##$BF5= 500.13
##$BF6= 500.13
##$BF7= 500.13
##$BF8= 500.13
##$BYTORDA= 1
##$CFDGTYP= 0
##$CFRGTYP= 5
##$CHEMSTR= <none>
##$CNST= (0..31)
1 1 145 1 1 1 1 1 1 1 1 1 1 1 1 1 1 1 1 1 1 1 1 1 1 1 1 1 1 1 1 1 
##$CPDPRG= <>
##$CPDPRG1= <>
##$CPDPRG2= <>
##$CPDPRG3= <>
##$CPDPRG4= <mlev>
##$CPDPRG5= <mlev>
##$CPDPRG6= <mlev>
##$CPDPRG7= <mlev>
##$CPDPRG8= <mlev>
##$CPDPRGB= <>
##$CPDPRGT= <>
##$D= (0..31)
0 1 0 0 0 0 0 0 0 0.06 0 0 0 0 0 0 0.0002 0 0 0 0 0 0 0 0 0 0 0 0 0 0 
0 
##$DATE= 1167737085
##$DBL= (0..7)
120 120 120 120 120 120 120 120 
##$DBP= (0..7)
150 150 150 150 150 150 150 150 
##$DBP07= 0
##$DBPNAM0= <>
##$DBPNAM1= <>
$$ [...]
##$SUBNAM7= <"">
##$SUBNAM8= <"">
##$SUBNAM9= <"">
##$SW= 20.6930455092707
##$SWIBOX= (0..15)
0 0 3 0 0 0 0 0 0 0 0 0 0 0 0 0 
##$SW_h= 5175.983436853
##$TD= 65536
##$TD0= 1
##$TE= 294.16
##$TE2= 300
##$TE3= 300
##$TEG= 300
##$TL= (0..7)
0 120 120 120 120 120 120 120 
##$TP= (0..7)
150 150 150 150 150 150 150 150 
##$TP07= 0
##$TPNAME0= <>
##$TPNAME1= <>
##$TPNAME2= <>
##$TPNAME3= <>
##$TPNAME4= <>
##$TPNAME5= <>
##$TPNAME6= <>
##$TPNAME7= <>
##$TPOAL= (0..7)
0.5 0.5 0.5 0.5 0.5 0.5 0.5 0.5 
##$TPOFFS= (0..7)
0 0 0 0 0 0 0 0 
##$TUNHIN= 0
##$TUNHOUT= 0
##$TUNXOUT= 0
##$USERA1= <user>
##$USERA2= <user>
##$USERA3= <user>
##$USERA4= <user>
##$USERA5= <user>
##$V9= 5
##$VALIST= <valist>
##$VCLIST= <CCCCCCCCCCCCCCC>
##$VD= 0
##$VDLIST= <DDDDDDDDDDDDDDD>
##$VPLIST= <PPPPPPPPPPPPPPP>
##$VTLIST= <TTTTTTTTTTTTTTT>
##$WBST= 1024
##$WBSW= 4
##$XGAIN= (0..3)
0 0 0 0 
##$XL= 0
##$YL= 0
##$YMAX_a= 471885
##$YMIN_a= -458230
##$ZGOPTNS= <>
##$ZL1= 120
##$ZL2= 120
##$ZL3= 120
##$ZL4= 120
##$ABSF1= 16.54223
##$ABSF2= -4.150944
##$ABSG= 5
##$ABSL= 3
##$ALPHA= 0
##$AQORDER= 0
##$ASSFAC= 0
##$ASSFACI= 0
##$ASSFACX= 0
##$ASSWID= 0
##$AUNMP= <proc_1d>
##$AZFE= 0.1
##$AZFW= 0.1
##$BCFW= 0
##$BC_mod= 0
##$BYTORDP= 0
##$COROFFS= 0
##$CY= 12.5
##$DATMOD= 1
##$DC= 0
##$DFILT= <>
##$DTYPP= 0
##$F1P= 14.0000005364418
##$F2P= -0.99999901652339
##$FCOR= 0.5
##$FTSIZE= 32768
##$FT_mod= 6
##$GAMMA= 0
##$GB= 0
##$INTBC= 1
##$INTSCL= 1
##$ISEN= 128
##$LB= 0.3
##$LEV0= 0
##$LPBIN= 0
##$MAXI= 10000
##$MC2= 0
##$MEAN= 0
##$ME_mod= 0
##$MI= 0
##$NCOEF= 0
##$NC_proc= -2
##$NLEV= 6
##$NOISF1= 0
##$NOISF2= 0
##$NSP= 0
##$NTH_PI= 0
##$NZP= 0
##$OFFSET= 16.54223
##$PC= 1
##$PHC0= 227.0836
##$PHC1= 7.087817
##$PH_mod= 1
##$PKNL= yes
##$PPARMOD= 0
##$PSCAL= 4
##$PSIGN= 0
##$REVERSE= no
##$SF= 250.129994938891
##$SI= 32768
##$SIGF1= 0
##$SIGF2= 0
##$SINO= 400
##$SIOLD= 32768
##$SREGLST= <1H.CDCl3>
##$SSB= 0
##$STSI= 32768
##$STSR= 0
##$SW_p= 5175.98343685301
##$SYMM= 0
##$S_DEV= 0
##$TDeff= 65536
##$TDoff= 0
##$TI= <Analysis number 999999
Compound Code 99
Book Reference 9
Project Code 9>
##$TILT= no
##$TM1= 0
##$TM2= 0
##$TOPLEV= 0
##$USERP1= <user>
##$USERP2= <user>
##$USERP3= <user>
##$USERP4= <user>
##$USERP5= <user>
##$WDW= 1
##$XDIM= 32768
##$YMAX_p= 345403129
##$YMIN_p= -63671
$$ End of Bruker specific parameters
$$ ---------------------------------
##NTUPLES= NMR SPECTRUM
##VAR_NAME=  FREQUENCY,     SPECTRUM/REAL,   SPECTRUM/IMAG
##SYMBOL=    X,             R,               I
##VAR_TYPE=  INDEPENDENT,   DEPENDENT,       DEPENDENT
##VAR_FORM=  AFFN,          ASDF,            ASDF
##VAR_DIM=   32768,         32768,           32768
##UNITS=     HZ,            ARBITRARY UNITS, ARBITRARY UNITS
##FACTOR=    0.157963299565203, 1,           1
##FIRST=     4137.70805777653, 0,            0
##LAST=      -1038.27537907648, 0,           0
##MIN=       -1038.27537907648, -63671,      0
##MAX=       4137.70805777653, 345403129,    0
$$ Real data points
##PAGE= N=1
##DATA TABLE= (X++(R..R)), XYDATA
$$ [...]
17231F130m362k985r93M747K175L082Q485j360O061O58J189j5910j3264M169N657
$$ 6130 1768 -1217 -2210 2537 4712 7794 16279 14919 20980 21638 22827 6917 -6347 -2178 3479
17216C479l095P576J469K740L871N734j937j7446j2619o75K051M771K344K601
$$ 3479 384 7960 9429 12169 16040 21774 19837 2391 -10228 -10903 -8852 -4081 -1737 864
17202H64q510k046J2326J4780L83r90l551p715Q445j888o995M218Q545N690J3222
$$ 864 -7646 -9692 2634 17414 17797 16807 13256 5541 13986 12098 5103 9321 17866 23556 36778
17187C6778J4713J0037L0964L9385M5727M8736L3857m414k3749j5837j9671j4633
$$ 36778 51491 61528 92492 131877 177604 226340 260197 255783 232034 216197 196526 181893
17175A81893Q061K1424L2412K6644K516l3180n5545m5880l2044k9229j6586m979
$$ 181893 189954 211378 243790 270434 272950 239770 184225 138345 106301 77072 60486 55507
17163E5507m249k236k512r949m007k294P80q733j5921R519P066K281o679o156
$$ 55507 51258 49022 46510 36561 32554 30260 31040 22307 6386 15905 22971 25252 18573 12417
17149A2417l231J496J0728m843r982N533J3595O493J1499J3195M156J1336J9182
$$ 12417 9186 10682 21410 16567 6585 12118 25713 32206 43705 56900 61056 72392 91574
17136I1574K3469L9340N3828N0461M2298l017n7131n0812k1628j2129M717M2941
$$ 91574 115043 154383 208211 258672 300970 297953 240822 190010 168382 156253 160970 203911
17124B03911O0168L8804j2664n4218o2842n6413l1717j6893j7433j3929q376J208
$$ 203911 264079 302883 290219 236001 173159 116746 85029 68136 50703 36774 28398 29606
17112B9606n8r878n059L663R234N77p599o759L662Q100l717J448p004l958m729
$$ 29606 29548 19670 14611 18274 27508 28085 20486 13727 17389 25489 21772 23220 16216 12258 7529
17097G529L499k026m495m131l885l277L578P20L304O194R47k182P88k526m347
$$ 7529 11028 9002 4507 376 -3509 -6786 -3208 -2488 816 7010 7957 5775 6563 4037 -310
17082c10M69M236p68L869n523o752q491N418P545N191L09K401K407o064j0722
$$ -310 159 4395 3627 7496 1973 -4779 -13270 -7852 -307 4884 5193 7594 10001 3937 -6785
17067f785k875P127K01k585J4839k519q201M045L507J519M39k549M414j345N91
$$ -6785 -9660 -2533 -2332 -4917 9922 7403 -798 3247 6754 8273 8712 6163 10577 9232 9823
17052I823j228l335K21L395O332N157P067J151r078p990j958P61O447j946k098
$$ 9823 8595 5260 5481 8876 15208 20365 27432 28583 19505 11515 9557 10318 16765 14819 12721
17037A2721l07O61O007N151j2595q153m030j229l153L202J691j59J815J0517J1573
$$ 12721 12414 13075 19082 24233 11638 3485 -545 -1774 -4927 -1725 -34 -193 1622 12139 23712
17022B3712O308j721r024M60o252k211M346Q158M953L475j0586r404Q481K253
$$ 23712 30020 28299 19275 19735 13483 11272 15618 23776 28729 32204 21618 12214 20695 22948
17008B2948n459J191k668m445l427O633K414j0105p314K151K168n349l500J791
$$ 22948 17489 18680 16012 11567 8140 14773 17187 7082 -232 1919 4087 -1262 -4762 -2971
16994b971M620P603O178k706j063m106j595l847n631J151k161K480J0600L176
$$ -2971 1649 9252 15430 12724 11661 7555 5960 2113 -3518 -2367 -4528 -2048 8552 11728
16980A1728p245l726N07N369P163l124m641j421L156J411k30L207O916P177M610
$$ 11728 4483 757 1264 6633 13796 10672 6031 4610 7766 9177 8947 12154 19070 26247 30857
16965C0857N316J312k893p425p766j2452j720Q498K082m021j324q097k783J295
$$ 30857 36173 37485 34592 27167 19401 6949 5229 13727 15809 11788 10464 2367 -416 879
16951H79P426R484O487j174j2096n390J0102n51k2L062J870j0828n835N52n341
$$ 879 8305 17789 24276 23102 11006 5616 15718 15167 15145 18207 20077 9249 3414 3966 -1375
16936a375O910j2616L075P463o94M189P51J676N610j950m895M607Q33L363J61
$$ -1375 5535 -7081 -4006 3457 2763 6952 7703 9379 14989 13039 8144 12751 13584 16947 17108
16921A7108r093L95J228p279M653q720j0652P443K220N592o0L550P865r457p872
$$ 17108 8015 8410 9638 2359 7012 -1708 -12360 -4917 -2697 2895 2835 6385 14250 4793 -3079
16906c079J889k345R79K942M752L617j1708P527L075j387k3L398R33R73o557q002
$$ -3079 -1190 -3535 -2556 386 5138 8755 -2953 4574 7649 6262 6239 9637 10570 11543 4986 -3016
16890c016j396p383K273J2900K561N32m699o066L4l930q083R01M977Q767O252
$$ -3016 -4412 -11795 -9522 3378 5939 6471 1772 -4294 -4260 -8190 -16273 -15372 -10395 -1628 4624
16875D624m666j2134Q56N378J269L964l824j45P64N376K260J137k981j878m46
$$ 4624 -42 -12176 -11320 -5942 -4673 -709 -4533 -4678 -3914 1462 3722 4859 1878 0 -446
16860d46J0715J2663L698p900m409m999o032k864P00k522M726j40n429L129J0628
$$ -446 10269 22932 26630 18730 14321 9322 3290 426 1126 -1396 3330 3190 -2239 890 11518
16845A1518Q679K264p642o932o22j931l40j0947m16m572j4045N237J0838Q403
$$ 11518 20197 22461 14819 7887 7265 5334 4994 -5953 -6369 -10941 -24986 -19749 -8911 -508
16831e08N314j876m315l936k888j2298N216N529K312o94l366L882Q852J690n905
$$ -508 4806 2930 -1385 -5321 -8209 -20507 -15291 -9762 -7450 -8144 -11510 -7628 1224 2914 -2991
16816b991n077O478M541J359j0324n874J142L124m753O019l872L570L734n837
$$ -2991 -8068 -1590 2951 4310 -6014 -11888 -10746 -7622 -12375 -6356 -10228 -6658 -2924 -8761
16802h761q333L668O520K949q09J1130k497Jj264M122m198m111M986M509L181
$$ -8761 -17094 -13426 -6906 -3957 -4766 6364 3867 3868 2604 6726 2528 -1583 3403 7912 11093
16787A1093J164q540r708q51k418J0597L736n821m875o928K142J0211M874M495
$$ 11093 12257 3717 -5991 -6842 -9260 1337 5073 -748 -5623 -12551 -10409 -198 4676 9171
16773I171j883r157O783j658j201n399j742Q752N876L895j073k644j1206j412
$$ 9171 7288 -1869 4914 3256 2055 -3344 -5086 3666 9542 13437 12364 9720 -1486 -2898
16759b898n235m490j252P615J464p105j929L907Q53p667M061o390L162N45J288
$$ -2898 -8133 -12623 -13875 -6260 -4796 -11901 -13830 -9923 -9070 -16737 -12676 -19066 -15904 -15359 -14071
16744a4071l553m949J0016K940N61R114L083l502q823j970Q208J010L946N500
$$ -14071 -17624 -22573 -12557 -9617 -9056 58 3141 -361 -9184 -11154 -2946 -1936 2010 7510
16730G510l682j4021N41J808P070K086l520P136K733O078j255J1095K54j1051
$$ 7510 3828 -10193 -9652 -7844 -774 1312 -2208 4928 7661 13739 12484 23579 23833 12782
16716A2782q578m644l069k151m280l655K748J0666K876j179O879Q669r638j3086
$$ 12782 4204 -440 -3509 -5660 -9940 -13595 -10847 -181 2695 1516 8395 17064 7426 -5660
16702e660K78K686O774O745K429j726q462o163k173J638n399j312J818O381n594
$$ -5660 -5382 -2696 4078 10823 13252 11526 3064 -3099 -5272 -3634 -9033 -10345 -8527 -2146 -7740
16687g740m364J062m48O617j914m168J393P970M978M052k56r367l116J565M378
$$ -7740 -12104 -11042 -11490 -4873 -6787 -10955 -9562 -1592 3386 7438 7182 -2185 -5301 -3736 642
16672F42k353j577p068M46R417j019M568O805M011j131l361p467j231k700q554
$$ 642 -1711 -3288 -10356 -9910 -493 -1512 3056 9861 13872 12741 9380 1913 682 -2018 -10572
16657a0572j4666l808R667L145L490P080J4545N323K77j3818j4789j859j1305
$$ -10572 -25238 -29046 -19379 -16234 -12744 -5664 8881 14204 14481 663 -14126 -15985 -27290
16644b7290J1176Q783j350J952Q201o42N539J112o630M435Q91m463J534M131N447
$$ -27290 -16114 -7331 -8681 -6729 1472 830 6369 7481 851 5286 6177 1714 3248 7379 12826
16629A2826l663o920n175M315j757j0801N773N793k121J1901L439k898o773r269
$$ 12826 9163 2243 -2932 1383 -374 -11175 -5402 391 -1730 10171 13610 10712 3939 -5330
16615e330P11j581K788m857R16J919L342Q187n107o809j653J1246P242n013l848
$$ -5330 -4619 -6200 -3412 -8269 -7353 -5434 -2092 6095 988 -5821 -7474 3772 11014 6001 2153
16600B153n531M341L677M324J1020m27R56m745j1170k898P03O097j284p932J138
$$ 2153 -3378 963 4640 8964 19984 19557 20513 15768 4598 1700 2403 8500 7216 -716 422
16585D22j797j989m789j254j098L746J0879P185j54L592k812j3054j0164l109
$$ 422 -1375 -3364 -8153 -9407 -10505 -6759 4120 11305 11151 14743 11931 -1123 -11287 -14396
16571a4396J5009N307J180j0428n478m573J984n269R25J2326N928m454j033Q971
$$ -14396 613 5920 7100 -3328 -8806 -13379 -11395 -16664 -15739 -3413 2515 -1939 -2972 5999
16557E999N619j1236m936R35K070r392m491Q58R581j483n216r803k147L37o00
$$ 5999 11618 382 -4554 -3619 -1549 -10941 -15432 -14574 -4993 -6476 -11692 -21495 -23642 -23305 -23905
16542b3905P062J1766J1189o009r653K538N697j346o883o052k199l44O931O965
$$ -23905 -16843 -5077 6112 103 -9550 -7012 -1315 -2661 -9544 -15596 -17795 -18139 -11208 -4243
16528d243l318n801Q101O020N500N39j1334j2990m982K589J231M347j464Q80P547
$$ -4243 -7561 -13362 -5261 759 6259 6798 -4536 -17526 -22508 -19919 -18688 -14341 -15805 -14925 -7378
16513g378P765n757p218M540P50r103J0410J1049m46R49j171o235k549o897M5
$$ -7378 387 -5370 -12588 -8048 -7298 -16401 -5991 5058 4612 5561 4390 -1845 -4394 -11291 -11246
16498a1246m660O916K648o630l245K737m272m878O560O032j531q09l719K483O965
$$ -11246 -15906 -8990 -6342 -12972 -16217 -13480 -17752 -22630 -16070 -10038 -11569 -12378 -16097 -13614 -6649
16483f649m219p492N768Q997q824n236j172N838L604L910K714M43j53m931J801
$$ -6649 -10868 -18360 -12592 -3595 -12419 -17655 -18827 -12989 -9385 -5475 -2761 -2318 -2471 -7402 -5601
16468e601m040j098O0j981j0386m781o319J54M757O596N738k938n59J3026P036
$$ -5601 -9641 -10739 -10679 -12660 -23046 -27827 -34146 -33992 -29235 -22639 -16901 -19839 -20398 -7372 -336
16453c36j414J988K211L234p441M753O277n395o032j49N338Q59o545j0409N098
$$ -336 -1750 238 2449 5683 -1758 2995 9272 3877 -2155 -2304 3034 3893 -2652 -13061 -7963
16438g963j086l166L150K824j063M473j614J592R085j93r521n777m602P144J3227
$$ -7963 -9049 -12215 -9065 -6241 -7304 -2831 -4445 -2853 6232 6039 -3482 -9259 -13861 -6717 6510
16423F510M374k921j1542r263N253R968j845n321k776k057m66J2210J971Q835
$$ 6510 10884 7963 -3579 -12842 -7589 2379 534 -4787 -7563 -9620 -10086 2124 4095 12930
16409A2930Q1M572j2769J494P887m997J459q005j6675M389J1537K678L288J039
$$ 12930 13011 17583 4814 6308 14195 9198 10657 2652 -14023 -9634 1903 4581 7869 8908
16395H908j591p038N869O727j423m927l749q895m585O161Q807m077k815n678K03
$$ 8908 7317 279 6148 12875 11452 6525 2776 -6119 -10704 -4543 4264 187 -2628 -8306 -8103
16380h103j755O935J316J567J271l291K688L380N340j1260q035K958q044L603
$$ -8103 -9858 -2923 -1607 -40 1231 -2060 628 4008 9348 -1912 -9947 -6989 -15033 -11430
16366a1430M827R87Q133N062m463j747j235K174J1316k036m289j478N51n000L478
$$ -11430 -6603 -5616 2517 7579 3116 1369 134 2308 13624 11588 7299 5821 6372 1372 4850
16351D850M168q739r004j3198k717r6L948J0765J2269L703p21p849m152P106j1260
$$ 4850 9018 279 -8725 -21923 -24640 -24736 -20788 -10023 2246 5949 5228 -2621 -6773 333 -10927
16336a0927n291M666J0095K049J0619l00J064j975j944o6j0954j3373O179J3096
$$ -10927 -16218 -11552 -1457 592 11211 10911 11975 10000 8056 7990 -2964 -16337 -10158 2938
16322B938O635R36k314q113J358j602p1k116N743M701o621j0815R752J428m618
$$ 2938 9573 10509 8195 82 1440 -162 -233 -2349 3394 8095 1474 -9341 411 1839 -2779
16307b779k848J791q032J751P58j97K974O47O490Q005K500p460r586o841m656
$$ -2779 -5627 -3836 -11868 -10117 -9359 -9556 -6582 -5935 555 8560 11060 3600 -5986 -12827 -17483
16292a7483O746M223R75N883J02L707l661J260o40j1209J1086J2145j616j0045
$$ -17483 -10737 -6514 -5539 344 446 4153 492 1752 1112 -10097 989 13134 11518 1473
16278A473K387O212p724L702J028k923K42Q254j785k729l129q888l23P100J178
$$ 1473 3860 10072 2348 6050 7078 4155 4397 12651 10866 8137 5008 -3880 -4203 2897 4075
16263D075k915J780K469o936O786J37N884o329o598j746N088N163k337j92L199
$$ 4075 1160 2940 5409 -1527 5259 5396 11280 4951 -1647 -3393 1695 6858 4521 4329 7528
16248G528k436k732L366j0813l033Q68K439J0416M267J973Q704K342o645n249
$$ 7528 5092 2360 5726 -5087 -8120 -7252 -4813 5603 9870 11843 20547 22889 16244 10995
16234A0995J325k157j0975m692Q630R029M295n431j458J0117j5532j7465M778
$$ 10995 12320 10163 -812 -5504 3126 12155 16450 11019 9561 19678 4146 -13319 -8541
16221h541K786L585k904p651L431R630P931k300K966k206m327m990j826k145p026
$$ -8541 -5755 -2170 -5074 -12725 -9294 336 8267 5967 8933 6727 2400 -2590 -4416 -6561 -13587
16206a3587Q44J6019O180k49o970o784r705r365L043N966N220L191R63k287l954
$$ -13587 -12743 3276 9456 9207 2237 -4547 -14252 -23617 -20574 -14608 -9388 -6197 -5234 -7521 -11475
16191a1475l442N34J2340J1582L268l416J571N992o051n298N863n552p407M432
$$ -11475 -14917 -14383 -2043 9539 12807 9391 10962 16954 10903 5605 11468 5916 -1491 2941
16177B941m044p535O069L532J151l887q67l070k731P089L102k326j151J900p838
$$ 2941 -1103 -8638 -2569 963 2114 -1773 -2640 -5710 -8441 -1352 1750 -576 -1727 173 -7665
16162g665o427Q46M223O986N561l22k66j523K64M122l631q6L972k937k721r24
$$ -7665 -14092 -13246 -9023 -2037 3524 3202 2936 1413 1677 5799 2168 2082 6054 3117 396 -528
16146e28k13o273n399k205P462O986J399J808q697j921N5j641J2303J2235L119
$$ -528 -741 -7014 -12413 -14618 -7156 -170 1229 3037 -5660 -7581 -7526 -9167 3136 15371 18490
16131A8490o605l19L184r393j1146j3165M321R02L584K444R842M83J839o53q22
$$ 18490 11885 11566 14750 5357 -5789 -18954 -14633 -13731 -10147 -7703 2139 2622 4461 3808 2986
16116B986P31L341l464p541l11J281l972n460J463M125K871K762n176j4952Q0
$$ 2986 3717 7058 3594 -3947 -4258 -2977 -6949 -12409 -10946 -6821 -3950 -1188 -6364 -21316 -21236
16101b1236Q765J2081n900o975M925Q504l743o524k629j07O495R463J1203m585
$$ -21236 -12471 -390 -6290 -13265 -8340 164 -3579 -10103 -12732 -12839 -6344 3119 14322 9737
16087I737j463j5722O451J0888K166o67p837N675j4459j1794J0437Q060J6807
$$ 9737 8274 -7448 -997 9891 12057 11390 3553 9228 -5231 -17025 -6588 1472 18279
16074A8279N15q915O19K910M0n821j5787o766K246N816m387k147M50K689k819
$$ 18279 18794 9879 10498 13408 13448 7627 -8160 -14926 -12680 -6864 -11251 -13398 -12948 -10259 -13078
16059a3078j640j85J423K348L738l973q085P819J5608J73o674J558m321k061p570
$$ -13078 -14718 -14903 -13480 -11132 -7394 -11367 -19452 -11633 3975 4148 -2526 -968 -5289 -7350 -14920
16044a4920k842M163o367J2849P799K459n613j1188j1950K454K446J948J0070
$$ -14920 -17762 -13599 -19966 -7117 682 3141 -2472 -13660 -25610 -23156 -20710 -18762 -8692
16031h692J551K129J9539O100k144r660r332k214N264L472J91j469K365m460k143
$$ -8692 -7141 -5012 14527 20627 18483 8823 -509 -2723 2541 6013 6204 4735 7100 2640 497
16016D97n588Q64j093k967j128J238K386M79L925r52q43l249k052O050K25n79
$$ 497 -5091 -4227 -5320 -8287 -9415 -8177 -5791 -5312 -1387 -2339 -3182 -6431 -8483 -2433 -2208 -2787
16000b787L524J392J47L342K158p64p677P97M989M289l925L667J613j3940j2726
$$ -2787 737 2129 2276 5618 7776 7012 -665 132 5121 9410 5485 9152 10765 -3175 -15901
15985a5901k028L5J2133N49K833k1k346J399N708r530q362m369R462Q771R827
$$ -15901 -17929 -17894 -5761 -5212 -2379 -2400 -4746 -3347 2361 -7169 -15531 -19900 -10438 -1667 8160
15970H160j342j417q528o43k29J202l786N500J0558k335j669J634p736j9332J800
$$ 8160 6818 5401 -3127 -3770 -3999 -2797 -6583 -1083 9475 7140 5471 7105 -631 -19963 -18163
15955a8163J5201Q977L727j826o295o41O057O040p979O868L99l156O992K874j654
$$ -18163 -2962 6015 9742 7916 1621 980 7037 13077 5098 11966 12365 9209 16201 19075 17421
15940A7421R089l755j1858j214M981n007l331k285k756n197M080j429j0620k846
$$ 17421 26510 22755 10897 9683 14664 9657 6326 4041 1285 -3912 168 -1261 -11881 -14727
15926a4727j01R848m08M995Q738q806K00q11N160M242q072J147m135O35j847k086
$$ -14727 -14828 -4980 -5388 -393 8345 -461 -261 -1072 4088 8330 258 1405 -2730 -2095 -3942 -6028
15910f028J327r390J847O817J1688l082K756J0498J253q274l346Q150Q059O953
$$ -6028 -4701 -14091 -12244 -5427 6261 3179 5935 16433 17686 9412 6066 14216 22275 29228
15896B9228k375K366j0977j1794m946k345P984N201p674J923J0810O255m182j3100
$$ 29228 26853 29219 18242 6448 1502 -843 7141 12342 4668 6591 17401 23656 19474 6374
15882F374j840M66n740k028J732K346j200j462N326N631k594m595J576J1275m840
$$ 6374 4534 5000 -740 -2768 -1036 1310 110 -1352 3974 9605 7011 2416 3992 15267 10427
15867A0427j5319m994J135M068k935n746K487L706L223n20q370P792J3874N346
$$ 10427 -4892 -9886 -8751 -4683 -7618 -13364 -10877 -7171 -3948 -4468 -12838 -5046 8828 14174
15853A4174L493n049j5843j1749J306J0361k598L02J636P245M441m528M569q09
$$ 14174 17667 12618 -3225 -14974 -13668 -3307 -5905 -5603 -3967 3278 7719 3191 7760 6951
15839F951P773O410p47K528n467o404l387n570o42J865R274r183p829K666P573
$$ 6951 14724 21134 20387 22915 17448 11044 7657 2087 1445 3310 12584 3401 -4428 -1762 5811
15824E811P290M545j552q447j0053M301Q446PJ0236k281J867m650l859P003p260
$$ 5811 13101 17646 16094 7647 -2406 1895 10341 10348 20584 18303 20170 15520 11661 18664 11404
15809A1404j3915J314r88L547J210M141M845n429l590J224Q713j078l944p461
$$ 11404 -2511 -1197 -2185 1362 2572 6713 11558 6129 2539 3763 12476 11398 7454 -7
15795gK673L679m490j614Q810J320l969l950j733p223k527Q28M352R762J1032
$$ -7 2666 6345 1855 241 9051 10371 6402 2452 719 -6504 -9031 -8203 -3851 5911 16943
15780A6943l90k358o642q17M587j339K882m810l669J08R526Q313m743m734k816
$$ 16943 16553 14195 7553 6736 11323 9984 12866 8056 4387 4495 14021 22334 17591 12857 10041
15765A0041P27l763J404q359J525Q142R722r93j3551j868m35N84K717J4038L242
$$ 10041 10768 7005 8409 50 1575 9717 19439 18446 4895 3027 2592 3176 5893 19931 23173
15750B3173j997n485j6307l647L06L131O877O926l229K51O925N01k927P090M042
$$ 23173 21176 15691 -616 -4263 -3957 -826 6051 12977 9748 9999 16924 17425 14498 21588 25630
15735B5630j1929q456j0251L170J0763n38Q156P122J016L25k071q627K215M912
$$ 25630 13701 5245 -5006 -1836 8927 8389 16545 23667 24683 25008 22937 14310 16525 21437
15721B1437K12j660k046m264l009r90R60Q23l82j1385p406J0620Q492M314J379
$$ 21437 21649 19989 17943 13679 10670 9680 10640 11463 11081 -304 -7710 2910 11402 15716 17095
15706A7095J037p57n149n562j983N191N268j135K691M79j0267p377J23J2124O636
$$ 17095 18132 17375 12226 6664 4681 9872 15140 14005 16696 17175 6908 -469 -346 11778 18414
15691A8414N05l9j512J423K242O639J15r944J140l182N74j18j813J63K271j1203
$$ 18414 18919 18880 17368 18791 21033 27672 27787 17843 18983 15801 16375 16257 14444 14607 16878 5675
15675E675q676J0807m627l5J939Q286l420N287Q740n50L053j1263j2201L994J2048
$$ 5675 -3001 7806 3179 3144 5083 13369 9949 15236 23976 23426 26479 15216 3015 7009 19057
15660A9057n164j550r271k16J3938K92n183N758P246j3230p925n614j740O850
$$ 19057 13893 12343 3072 2856 16794 17086 11903 17661 24907 11677 3752 -1862 -3602 3248
15646C248N588k270n835j496O832J1452P821m693j7323R67L077k013o719M054
$$ 3248 8836 6566 731 -765 6067 17519 25340 20647 3324 4291 7368 5355 -1364 2690
15632B690J2511K929K592m934N016J550k825j0277j5413p431M120J5671R196J86
$$ 2690 15201 18130 20722 15788 20804 22354 19529 9252 -6161 -13592 -9472 6199 15395 15581
15618A5581K823M41j1098o479n17n276Q293J0506K307m604q980n276K175j257
$$ 15581 18404 18845 7747 1268 751 -4525 3768 14274 16581 11977 2997 -2279 -104 -1361
15604a361J87K412o877N828J1536j878j0243K43P543M038M021m614L016M500j0118
$$ -1361 -1174 1238 -5639 189 11725 9847 -396 -153 7390 11428 15449 10835 13851 18351 8233
15589H233r739j769M455j235p48K100j924P62p902L599N265l19J896J223O639
$$ 8233 -1506 -3275 1180 -55 -803 1297 -627 135 -7767 -4168 1097 778 2674 3897 10536
15574A0536L037k881M84j0329p985k81N19J1976K466L689p934K30l250j4327o164
$$ 10536 13573 10692 11176 847 -7138 -7419 -6900 5076 7542 11231 3297 3527 277 -14050 -20214
15559b0214K736N408J2020K207N402k836J1029J0307p179j4482l068K426J380
$$ -20214 -17478 -12070 -50 2157 7559 4723 15752 26059 18880 4398 1330 3756 5136
15546E136j473j510Q314j442Q4l322r265m465R883L090K489k675j1925m931O178
$$ 5136 3663 2153 10467 9025 9109 5787 -3478 -7943 1940 5030 7519 4844 -7081 -12012 -5834
15531e834M450J580N452k345k798o710R524N283M200O142k299J859p96q638o008
$$ -5834 -1384 196 5648 3303 505 -6205 3319 8602 12802 18944 16645 18504 17708 9070 3062
15516C062L549O524N472l7l481o401K30j085m729m851J445m495M994Q371j44o646
$$ 3062 6611 13135 18607 18570 15089 8688 8918 7833 3104 -1747 -302 -4797 197 8568 8424 1778
15500A778r003Q402R633o377q701m234J755P134P879q61q899j4465j994J1226
$$ 1778 -7225 1177 10810 4433 -4268 -8502 -6747 387 8266 7405 -1494 -15959 -17953 -6727
15486f727K633R09m486P318l623P654K863J58q421L80K113K58M896M626k106j338
$$ -6727 -4094 -3185 -7671 -353 -3976 3678 6541 6699 -1722 -1342 771 1029 5925 10551 8445 7107
15470G107q650q986p013N75M465J357L370M554J382k497o004P64j625o41K361
$$ 7107 -1543 -10529 -17542 -16967 -12502 -11145 -7775 -3221 -1839 -4336 -10340 -9576 -11201 -11842 -9481
15455i481M257p83J628J072J5366J4434k314r926m379r632m818J2415q125P441
$$ -9481 -5224 -6007 -4379 -3307 12059 26493 24179 14253 9874 242 -4576 7839 -286 7155
15441G155K857p477j3098j2705R572J4387J4000L773p386r380K164l203k499J658
$$ 7155 10012 2535 -10563 -23268 -13696 691 14691 18464 11078 1698 3862 659 -1840 -182
15427a82p109j3130o01Q471J0185n415n248J633j006N159K708o971j855J186J1422
$$ -182 -7291 -20421 -21022 -12551 -2366 -7781 -13029 -11396 -12402 -7243 -4535 -11506 -13361 -12175 -753
15412g53J9576n996q991K154K714m503l551m009k478j99L173R66l69r538M812
$$ -753 18823 12827 3836 5990 8704 4201 650 -3359 -5837 -6036 -2863 -1897 -2266 -11804 -6992
15397f992J0447O821j940r854r087o60j349N487J242j720k275n29j276N252J667
$$ -6992 3455 10276 8336 -1518 -10605 -11265 -12614 -7127 -5885 -7605 -9880 -10409 -11685 -6433 -4766
15382d766k172q885R97n145J1513M951P865R179J453O48K883k659m258l016o059
$$ -4766 -6938 -15823 -14826 -19971 -8458 -3507 4358 13537 14990 15638 18521 15862 11604 8588 2529
15367B529j26N525o34L11P11L663n348r38j31j053k260m488R106R195p374j0386
$$ 2529 2403 7928 7294 7605 8316 11979 6631 5693 5562 4509 2249 -2239 6867 16062 8688 -1698
15351a698j907J879k828Q21Q385K007L77j3964m575l105L411J0156M377P786k412
$$ -1698 -3605 -1726 -4554 -3733 4652 6659 7036 -6928 -11503 -14608 -11197 -1041 3336 11122 8710
15336H710j0691r499m914R235M505l951k912L720L534J32k918N007o370M450N711
$$ 8710 -1981 -11480 -16394 -7159 -2654 -6605 -9517 -5797 -2263 -2131 -5049 -42 -6412 -1962 3749
15321C749Q5K69m493Q01j999j445j3005M571k746Q042r58l361n270j37M061J985
$$ 3749 3834 4103 -390 411 -1588 -3033 -16038 -11467 -14213 -6171 -7129 -10490 -15760 -15897 -11836 -9851
15305i851J024J0387J0256K85j0754P76Q11k477M564p247p326n43K95M899L193
$$ -9851 -8827 1560 11816 12101 1347 2123 2934 457 5021 -2226 -9552 -10095 -9800 -4901 -1708
15290a708k017J0138o489p165M698k524j738Q03j756n324K875L234Q010j003J1602
$$ -1708 -3725 6413 -76 -7241 -2543 -5067 -6805 -6002 -7758 -13082 -10207 -6973 1037 34 11636
15275A1636k369o62J0494j847l260m122N31j6R54o472n013L729p741p914j985
$$ 11636 9267 8605 19099 17252 13992 9870 10401 10385 11339 4867 -146 3583 -4158 -12072 -14057
15260a4057n3Q554k75J331K54O718l195p377N343K253J3872K589o605o211L591
$$ -14057 -14110 -5556 -5831 -4500 -4246 2472 -723 -8100 -2757 -504 13368 15957 9352 3141 6732
15245F732P071O380j5729j7411o567Q442L188M556N28n02K872l489L863Q479j283
$$ 6732 13803 20183 4454 -12957 -19524 -11082 -7894 -3338 -2810 -3312 -440 -3929 -66 8413 7130
15230G130N97O23p867J615N65q740j0520p53P986k32l459M826j1507N345J3388
$$ 7130 7727 8350 483 2098 2663 -6077 -16597 -17350 -9364 -9596 -13055 -8229 -19736 -14391 -1003
15215a003P801p892K766R50J943m022m605O318M357N355N359M662n398o635o286
$$ -1003 6798 -1094 1672 2622 4565 543 -4062 2256 6613 11968 17327 21989 16591 9956 3670
15200C670l249j0116l083R441P99n656k025P638k396l118J889M612M545P846K944
$$ 3670 421 -9695 -12778 -3337 -2538 -8194 -10219 -2581 -4977 -8095 -6206 -1594 2951 10797 13741
15185A3741j2143m372J448p898N474J2683m7N4r108o236N110J131n007P98j173
$$ 13741 1598 -2774 -1326 -9224 -3750 8933 8886 8940 -168 -6404 -1294 -163 -5170 -4372 -5545
15170e545O539M679l506O609K805o232n705l585J7060m968l752jQ934M57j0215
$$ -5545 994 5673 2167 8776 11581 5349 -356 -3941 13119 8151 4399 4398 13332 13789 3574
15155C574o114P479O227l891k873n506Q87L683J849L88j0822p83q76K578K548
$$ 3574 -2540 4939 11166 7275 4402 -1104 -217 3466 5315 5703 -5119 -5902 -6778 -4200 -1652
15140a652K333j6125m873J4705P793j829j0110L139J0641l137n568O825R334N002
$$ -1652 681 -15444 -20317 -5612 2181 352 -9758 -6619 4022 885 -4683 2142 11476 16478
15126A6478J03o61n876q843j5552M116J0063N691p849n195O505K966k946n763
$$ 16478 16581 15920 10044 1201 -14351 -10235 -172 5519 -2330 -7525 -1020 1946 -1000 -6763
15112f763K617K156l367m039r998L560J0517P57m420k719L132P490j601l097r284
$$ -6763 -4146 -1990 -5357 -9396 -19394 -15834 -5317 -4560 -8980 -11699 -8567 -1077 -2678 -5775 -15059
15097a5059O304P030j657p14k566O844J14J627N632L149j643O189N762q178p932
$$ -15059 -8755 -1725 -3382 -4096 -6662 182 296 1923 7555 10704 9061 15250 21012 12834 4902
15082D902J1368M52N02o835r990n143j0204j198J0988R644l868p022O121j150
$$ 4902 16270 16722 17224 10389 399 -4744 -14948 -16146 -5158 4486 618 -6404 -283 -1433
15068a433N854M479P23m55n686j413J588Q478o380j6835o454Q3L420n86N179N760
$$ -1433 4421 8900 9623 9168 3482 2069 3657 12135 5755 -11080 -17534 -17451 -14031 -14617 -9438 -3678
15052c678K268n052P65o90O90P045j148j3674n116j1193j081Q941P071K936n123
$$ -3678 -1410 -6462 -5697 -6387 -5697 1348 200 -13474 -18590 -29783 -30864 -21923 -14852 -11916 -17039
15037a7039K045Q204M720k960O257M028N801K800m948j1013j83k115n448L658
$$ -17039 -14994 -6790 -2070 -5030 1227 5255 11056 13856 8908 -2105 -2288 -4403 -9851 -6193
15023f193O04m98Q647K143j726k204k122j427m528m05M351j869M63l692p395J211
$$ -6193 -5589 -6087 2560 4703 2977 773 -1349 -2776 -7304 -7709 -3358 -5227 -4764 -8456 -15851 -14640
15007a4640Q377J789r48R43K479r69m883J509Q995O811l533q524o574R65M884
$$ -14640 -6263 -4474 -5422 -4479 -2000 -2969 -7852 -6343 2652 9463 5930 -2594 -9168 -8203 -3319
14992c319J0788p79o299J228J0555O619n521p617o811N432O901k463j610o8J0491
$$ -3319 7469 6690 391 1619 12174 18793 13272 5655 -1156 4276 11177 8714 7104 7036 17527
14977A7527K710r316j530j00j1391q87M641L665m37Q24j586j0649K635j406P522
$$ 17527 20237 10921 9391 9291 -2100 -2987 1654 5319 4882 5706 4120 -6529 -3894 -5300 2222
14962B222P449j339L51j022q746k104J0108j474M480J635j1304J543J1901L485
$$ 2222 9671 8332 8683 7661 -1085 -3189 6919 5445 9925 11560 256 1799 13700 17185
14948A7185j1791j0120L11K147J67L28j650N995M108n060k031O39K003L148q393
$$ 17185 5394 -4726 -4415 -2268 -2101 -1773 -3423 2572 6680 1620 -411 228 2231 5379 -3014
14933c014j904L378L710Q05r94o318j032M98q685k491J1069L062K788q72j899
$$ -3014 -4918 -1540 2170 2975 1981 -4337 -5369 -4871 -13556 -16047 -4978 -1916 872 0 -1899
14918a899M305P249N367j4257j1662m33K876o71Q056l637K188k412N108Q149Q68
$$ -1899 2406 9655 15022 765 -10897 -11330 -8454 -9125 -1069 -4706 -2518 -4930 178 8327 9195
14903I195N99n919k820J547j901l843Q749K269k378j325j448l358j0048m22N17
$$ 9195 9794 3875 1055 2602 701 -3142 5607 7876 5498 4173 2725 -633 -10681 -11103 -10586
14888a0586O219j0259n850M204J0908M055m795P266l235n190R744j067n893o376
$$ -10586 -4367 -14626 -20476 -16272 -5364 -1309 -6104 1162 -2073 -7263 2481 1414 -4479 -10855
14874a0855K470O46l531L316l809n610J1255O354L554N41k164r107J611k222L255
$$ -10855 -8385 -7739 -11270 -7954 -11763 -17373 -6118 236 3790 4331 2167 -6940 -5329 -7551 -4296
14859d296K475o536K103J204l051o739Q232R208J218r33j0184J884N107l600j38
$$ -4296 -1821 -8357 -6254 -5050 -8101 -14840 -6608 2600 3818 2885 -7299 -5415 -308 -3908 -4046
14844d046J149K628n614o875j134M496m06l994o049M43J89N045O518P015P652
$$ -4046 -2897 -269 -5883 -12758 -13892 -9396 -9802 -13796 -19845 -19402 -19213 -14168 -7650 -635 7017
14829G017P51R3p081Q556O512l921n365n358k722K315K606P065k062l473j916
$$ 7017 7768 7861 780 9336 15848 11927 6562 1204 -1518 797 3403 10468 8406 4933 3017
14814C017L931l77l272m379j0931K921J4703Q70K053m902m523l589k125l531N895
$$ 3017 6948 6571 3299 -1080 -12011 -9090 5613 6483 8536 3634 -889 -4478 -6603 -10134 -4239
14799d239L768J043q66K82M968o156K024K176j270n394j770M61Q902j040j3670
$$ -4239 -471 572 -294 -12 4956 -1200 824 3000 1730 -3664 -5434 -4973 3929 2889 -10781
14784a0781j922L828J064L437Q206k573l420p02l202l410L736L283j170M052L412
$$ -10781 -12703 -8875 -7811 -4374 3832 1259 -2161 -2863 -6065 -9475 -5739 -2456 -3626 426 3838
14769C838N125n021l261o891o237L522J1815P611l431k802p13j2936R68M138P856
$$ 3838 8963 3942 681 -6210 -12447 -8925 2890 10501 7070 4268 3555 -9381 -8413 -4275 3581
14754C581Q675J562J005Q93o688k356Q32J604o225k811o011n164K448P553P41
$$ 3581 12256 13818 14823 15716 9028 6672 7504 9108 2883 72 -5939 -11103 -8655 -1102 -361
14739c61L154K231l267N549N056k552K435r083O18l469l117q95Q015L734l404
$$ -361 2793 5024 1757 7306 12362 9810 12245 3162 3780 311 -2806 -3701 4314 8048 4644
14724D644L007L708j107r364j75P8K277J1527o287r465J652r573m680M639J024
$$ 4644 7651 11359 10252 888 713 791 3068 14595 8308 -1157 495 -9078 -13758 -9119 -8095
14709h095j754p17K295P594O614O615q29K067Q714n866k362o357l217K115L257
$$ -8095 -9849 -10566 -8271 -677 5937 12552 11723 13790 22504 16638 14276 7919 4702 6817 10074
14694A0074K297l054N514o585K96N176q613n613j414J476k66L514O477K076L917
$$ 10074 12371 9317 14831 8246 8542 13718 5105 -508 -1922 -446 -712 2802 9279 11355 15272
14679A5272n105k883j744j0585p617K379P153L410K501r859o923l97J505j260
$$ 15272 10167 7284 5540 -5045 -12662 -10283 -3130 280 2781 -7078 -14001 -14398 -12893 -14153
14665a4153J0819J294nk037P190N284n499q636R39L293l915k281J001j363K303
$$ -14153 -3334 -2040 -2045 -4082 3108 8392 2893 -5743 -4804 -1511 -5426 -7707 -6706 -8069 -5766
14650e766P303L02K73m070R54l073k886O480k280q273L446J1758n586j0720o66
$$ -5766 1537 1839 2112 -1958 -1004 -4077 -6963 -483 -2763 -11036 -7590 4168 -1418 -12138 -12804
14635a2804J088m235o99N004O507k730L969K358J083Q245L334j1567o483o324
$$ -12804 -11716 -15951 -16650 -11646 -5139 -7869 -3900 -1542 -459 7786 11120 -447 -6930 -13254
14621a3254k449o153j1295R308J1996k515q24j188P916Q642o911J582J691R62
$$ -13254 -15703 -21856 -33151 -23843 -11847 -14362 -15186 -16374 -8458 184 -6727 -5145 -3454 -2492
14607b492L370R52P847O554k082j0649K652P16k600L782O554n901J221P888q892
$$ -2492 878 1830 9677 16231 14149 3500 6152 6868 4268 8050 14604 8703 9924 17812 8920
14592H920o966j277o968k592K985Q622O167J977M839n214l800K66j758o469K077
$$ 8920 1954 677 -6291 -8883 -5898 2724 8891 10868 15707 10493 6693 6959 5201 -1268 809
14577H09o635n815L342P948p67L972j873M891n986r526M022K447J418o447j950
$$ 809 -5826 -11641 -8299 -351 -1118 2854 981 5872 -114 -9640 -5618 -3171 -1753 -8200 -10150
14562a0150M909q414l091K705P093p189m985p79m650J1623M873J53J939j186K589
$$ -10150 -5241 -13655 -16746 -14041 -6948 -14137 -19122 -19901 -24551 -12928 -8055 -7902 -5963 -7149 -4560
14547d560O642K151k129q193o10Q400k683k102N5l077j131L998J426m771j187
$$ -4560 2082 4233 2104 -6089 -6699 1701 -982 -3084 -3029 -6106 -7237 -3239 -1813 -6584 -7771
14532g771j076M495N883J141P39k130M08R345l212l193o531m104k710K483l64
$$ -7771 -8847 -4352 1531 2672 3411 1281 1689 11034 7822 4629 -1902 -6006 -8716 -6233 -6597
14517f597M709L52j1935k689P807P146l971J1148K404q375m829R500k956j960
$$ -6597 -1888 -1536 -13471 -16160 -8353 -1207 -5178 5970 8374 -1 -4830 4670 1714 -246
14503b46p541n62L011k531J890J188m464k323L30J0713Q733o27j153l036o36j479
$$ -246 -7787 -8349 -5338 -7869 -5979 -4791 -9255 -11578 -11248 -535 8198 7571 6418 3382 2746 1267
14487A267M243M65j1189M082K990P876l766q638n846j701J736N777n421L454p00
$$ 1267 5510 5975 -5214 -1132 1858 9734 5968 -2670 -8516 -10217 -8481 -2704 -8125 -4671 -5371
14472e371k033n662M6j416k866J1997j750l680m640j626J4236M405r576K35J895
$$ -5371 -7404 -13066 -13020 -14436 -17302 -5305 -7055 -10735 -15375 -17001 -2765 1640 -7936 -7701 -5806
14457e806M65p013K015N737N714r054j211L947k614J0025N208l549l714m122Q451
$$ -5806 -5341 -12354 -10339 -4602 1112 -7942 -9153 -5206 -7820 2205 7413 3864 150 -3972 4479
14442D479k091l345l469J2875m467j2082O67p120n641N140J2769M211j915n211
$$ 4479 2388 -957 -4426 8449 3982 -8100 -7433 -14553 -20194 -15054 -2285 1926 11 -5200
14428e200k509Q120k233j279K051L394R486o68k99k963m903m32P327k283J342
$$ -5200 -7709 411 -1822 -3101 -1050 2344 11830 11162 10863 7900 2997 2565 9892 7609 8951
14413H951n88M369n195p331p95q04J7714o3O8J1798r261j532j617j0867p318o960
$$ 8951 8363 12732 7537 206 -589 -1393 16321 16258 16326 28124 18863 17331 15714 4847 -2471 -9431
14397i431M699J0655K602p813L196J577o070n464K354O57p239p266J2348K487
$$ -9431 -4732 5923 8525 712 3908 5485 -585 -6049 -3695 -3038 -10277 -17543 -5195 -2708
14383b708m049K987k571O316L326o030n525K768J421L850j521o973Q444p05K479
$$ -2708 -6757 -3770 -6341 -25 3301 -2729 -8254 -5486 -4065 -215 -1736 -8709 -265 -970 1509
14368A509l401L063K945k091k603P31q750q043R924N244j559Q198m457n276m940
$$ 1509 -1892 1171 4116 2025 -578 153 -8597 -16640 -6716 -1472 -3031 5167 710 -4566 -9506
14353i506N204R72l436L144J673q08l272L070J0013l025J838P74l630l703j1092
$$ -9506 -4302 -3330 -6766 -3622 -1949 -2757 -6029 -2959 7054 4029 5867 6641 3011 -692 -11784
14338a1784j493R915n92j0121j004q04R667Q983J203m202m672o30j318j890m778
$$ -11784 -13277 -3362 -3954 -14075 -15079 -15883 -6216 2767 3970 -232 -4904 -5534 -6852 -8742 -13520
14323a3520P286Q192k870n411m713L839M210K551N255M411P59K636o707j0040
$$ -13520 -6234 1958 -912 -6323 -11036 -7197 -2987 -436 4819 9230 9989 12625 5918 -4122
14309d122k68M585L930p998k077K367J2316m95q75l365O003j0993p310j440Q073
$$ -4122 -4390 195 4125 -3873 -5950 -3583 8733 8238 7363 3998 10001 -992 -8302 -9742 -1669
14294a669n036O956O449k707l247m183P82J700p003J003k788J3903J929q406n37
$$ -1669 -6705 251 6700 3993 746 -3437 -2655 -955 -7958 -6955 -9743 4160 6089 -2317 -2854
14279b854K952j0405o421j378j036l261J0234P799M511P956n708j0270L137O489
$$ -2854 98 -10307 -16728 -18106 -19142 -22403 -12169 -4370 141 8097 2389 -7881 -4744 1745
14265A745r15O97J196M406n49m686o46K202o51L291N089m652k813J3402Q42j880
$$ 1745 830 1527 2723 7129 6580 1894 1248 3450 2799 6090 11179 6527 3714 17116 17958 16078
14249A6078o572j691q553q999N017P145k663j533P91K924N715J609P85l212q221
$$ 16078 9506 7815 -738 -9737 -4720 2425 -238 -1771 -980 1944 7659 9268 10053 6841 -1380
14234a380L840Q42q625k539r997O014J2291o03k845Q56k89N15K885J506r031j404
$$ -1380 2460 3302 -5323 -7862 -17859 -11845 446 -157 -3002 -2146 -2435 -1920 965 2471 -6560 -7964
14218g964M091R528o606M943M738k173M531O977o586n566M063K934L061n108j005
$$ -7964 -3873 5655 -951 3992 8730 6557 11088 18065 11479 5913 9976 12910 15971 10863 9858
14203I858jM21M02n701K073q91M633N760N88o698n497P819l070j825J22q276j015
$$ 9858 9857 10278 10680 4979 7052 6161 10794 16554 17142 10444 4947 12766 9696 7871 7993 -283 -1298
14186a298l703J358L408K347n020j0380L006M825K517L896Q070J391r691m776
$$ -1298 -5001 -3643 -235 2112 -2908 -13288 -10282 -5457 -2940 956 9026 10417 726 -4050
14172d050l61N594J049j290K380p540K980J711J601J0844Q877p55k921j0660q229
$$ -4050 -4411 1183 2232 942 3322 -4218 -1238 473 2074 12918 21795 21040 18119 7459 -770
14157g70j203P63O15J878m389k841j2562m89J2352K596Q52k227K26j429K035K304
$$ -770 -1973 -1210 -595 1283 -3106 -5947 -18509 -18998 -6646 -4050 -3198 -5425 -5199 -6628 -4593 -2289
14141b289m381j886J0425J740m546j859J586J129L457K47j4953r308m580Q568
$$ -2289 -6670 -8556 1869 3609 -937 -2796 -1210 -81 3376 3623 -11330 -20638 -25218 -16650
14127a6650R256K744L361j203l465m140l963P13O771K613p44P378J873K302l127
$$ -16650 -7394 -4650 -1289 -2492 -5957 -10097 -14060 -13347 -6576 -3963 -4707 2671 4544 6846 3719
14112C719o028L54j151M455K94P894N58l543K36M272j925l681p692J84O735k412
$$ 3719 -2309 -1955 -3106 1349 1643 9537 10095 6552 6788 11060 9135 5454 -2238 -2054 4681 2269
14096B269o419k993j73p139l497P102K14n37L31j621k62L896j694n115j2180L975
$$ 2269 -4150 -7143 -7316 -14455 -17952 -10850 -10636 -11173 -10842 -12463 -12725 -8829 -10523 -15638 -27818 -23843
14080b3843R427O748k842r164q36l677O799P508J006L513R034N524P98N671n76
$$ -23843 -14416 -7668 -10510 -19674 -20510 -24187 -17388 -9880 -8874 -5361 3673 9197 9995 15666 15090
14065A5090j4460p314n502m633k945M738P23m882P303O492O455M091J490k667
$$ 15090 630 -6684 -12186 -16819 -19764 -15026 -14303 -19185 -11882 -5390 1065 5156 6646 3979
14051C979O089K149n201o208J405r308K321P035n264m882P082N662K200K024j2635
$$ 3979 10068 12217 7016 808 2213 -7095 -4774 2261 -3003 -7885 -803 4859 7059 9083 -3552
14036c552l554n171p523L394J5013n213k576J2397K166j95o338O335l950m460
$$ -3552 -7106 -12277 -19800 -16406 -1393 -6606 -9182 3215 5381 5186 -1152 5183 1233 -3227
14022c227j93K537J213j5183o340O08L946J0230O217K198m811j2276K719J418
$$ -3227 -3420 -883 330 -14853 -21193 -20585 -16639 -6409 -192 2006 -2805 -15081 -12362 -10944
14008a0944r859m52R179J1533r86o498k28N076N042J330k592o477j172k366O180
$$ -10944 -20803 -21255 -12076 -543 -1529 -8027 -8255 -3179 1863 3193 601 -5876 -7048 -9414 -3234
13993c234L721M115q24m614M142O751m291j1855L791O141K395j731P64n206N386
$$ -3234 487 4602 3778 -836 3306 10057 5766 -6089 -2298 3843 6238 4507 5271 65 5451
13978E451r55r601n185l695Q973L874l579K460J0020J618o120j1406M062J2793
$$ 5451 4496 -5105 -10290 -13985 -5012 -1138 -4717 -2257 7763 9381 3261 -8145 -4083 8710
13964H710j588n922L201R95J343k366n50p094m272k637l289N635q112N333J1422
$$ 8710 7122 1200 4401 5396 6739 4373 3823 -3271 -7543 -10180 -13469 -7834 -15946 -10613 809
13949H09l46j240l413k426L454M153k372m030N015N609o0o8J3062j200L764j1080
$$ 809 463 -777 -4190 -6616 -3162 991 -1381 -5411 -396 5213 5153 5085 18147 16947 20711 9631
13933I631j0289n802O74M223L810l802n832P138J414j189p647P622L084n250K794
$$ 9631 -658 -6460 -5786 -1563 2247 -1555 -7387 -249 1165 -24 -7671 -49 3035 -2215 579
13918E79k731N9N437n394o712k168M153M649Q644J006p495q633N670K242k535
$$ 579 -2152 -2093 3344 -2050 -8762 -10930 -6777 -2128 6516 7522 27 -8606 -2936 -694 -3229
13903c229J036j080L075k766j053N232N215P921l959l686m598n242p413p92k947
$$ -3229 -2193 -3273 -198 -2964 -4017 1215 6430 14351 10392 6706 2108 -3134 -10547 -11339 -14286
13888a4286O621Q844J1027n48j177k187m347N279K787m42l057j492m463p610L462
$$ -14286 -7665 1179 12206 11658 10481 8294 3947 9226 12013 11571 8514 7022 2559 -5051 -1589
13873a589O96j1621j915J0046J030m463N042k294k885k477n262K381Q649K047
$$ -1589 -893 -12514 -14429 -4383 -3353 -7816 -2774 -5068 -7953 -10430 -15692 -13311 -4662 -2615
13859b615K091M162r577o695J0122J374l963k623P94N731k611j5912n034L916
$$ -2615 -524 3638 -5939 -12634 -2512 -1138 -5101 -7724 -6930 -1199 -3810 -19722 -24756 -20840
13845b0840M529j372L781K620K783K975K238R308k674q209o561J487o712l565
$$ -20840 -16311 -17683 -13902 -11282 -8499 -5524 -3286 6022 3348 -4861 -11422 -9935 -16647 -20212
13831b0212R004J2459J251o613l42L494N121J221k207j557K957n152k645l87k079
$$ -20212 -11208 1251 2502 -4111 -4453 -959 4162 5383 3176 1619 4576 -576 -3221 -3608 -5687
13816e687L996n883k216J1017O49k623L525J0729j311r030K609O059k556k315
$$ -5687 -1691 -7574 -9790 1227 1876 -747 2778 13507 12196 3166 5775 11834 9278 6963
13802F963p498J924L333N300k31J593N092q598K383P383R417q318p047k417l139
$$ 6963 -535 1389 4722 10022 9791 11384 16476 7878 10261 17644 27061 18743 11696 9279 6140
13787F140L296J057o219m691R114M507j0529m924j808l408k227P375N708M322
$$ 6140 9436 10493 4274 -417 8697 13204 2675 -2249 -4057 -7465 -9692 -2317 3391 7713
13773G713J669j0609N533K867J0694j1469j2743n49J4994M623l774r684j0763
$$ 7713 9382 -1227 4306 7173 17867 6398 -6345 -6894 8100 12723 8949 -735 -11498
13760a1498M444M135R068K199o618j3588r151M258J2040M473O732N401M783p00
$$ -11498 -7054 -2919 6149 8348 1730 -11858 -21009 -16751 -4711 -238 6494 11895 16678 15978
13746A5978j604p453l258K656J2960l667m203p287j2272n952j924O881K634j804
$$ 15978 14374 6921 3663 6319 19279 15612 11409 4122 -8150 -14102 -16026 -9145 -6511 -8315
13732h315k330K885M799k793r02O83k139P414J0138N068k203P572r146K74j78
$$ -8315 -10645 -7760 -2961 -5754 -6656 -5973 -8112 -698 9440 14508 12305 19877 10731 11005 10827
13717A0827j3586m898R196L297L07l927q46p05Q992Q676M018l508Q85o321P155
$$ 10827 -2759 -7657 1539 4836 5143 1216 370 -335 8657 17333 21351 17843 18728 12407 19562
13702A9562l437n757p540q02M171n474p555l722K748J221n15k412jn041J3275
$$ 19562 16125 10368 2828 2026 6197 723 -6832 -10554 -7806 -6585 -7100 -9512 -9513 -14554 -1279
13687a279M238L331O518o181o352k781j2M31m442M218Q437n335p473o813K919
$$ -1279 2959 6290 12808 6627 275 -2506 -2518 -2087 -6529 -2311 6126 791 -6682 -13495 -10576
13672a0576J3067Q288O245l098n135n774q234K307M301M737N883N065k795M96
$$ -10576 2491 10779 17024 13926 8791 3017 -5217 -2910 1391 6128 12011 17076 14281 14777
13658A4777j072p157o313L054L005l194q678P695P206O49k002p384J547J1232
$$ 14777 13705 6548 235 3289 6294 3100 -5578 2117 9323 9972 7970 586 2133 13365
13644A3365M944j117k867L344l967j6757l059J0195M691k791l159m673q852P187
$$ 13365 18309 17192 14325 17669 13702 -3055 -6114 4081 8772 5981 2822 -1851 -10703 -3516
13630c516R125n631j302j283J825q16L456n10o255m370M737R384J168j4882J994
$$ -3516 5609 -22 -1324 -2607 -782 -1598 1858 1348 -4907 -9277 -4540 4844 6012 -8870 -6876
13615f876k057O59N991J2591M316n317q5K480n363m868P650K846j0405j4966L634
$$ -6876 -8933 -8274 -2283 10308 14624 9307 9222 11702 6339 1471 9121 11967 1562 -13404 -9770
13600i770O780Q103r475n168K267j137N032J1622k400p000r562M237J0972l912
$$ -9770 -2990 5113 -4362 -9530 -7263 -8400 -3368 8254 5854 -1146 -10708 -6471 4501 589
13586E89p025l064k122j357M910N832p72l295k413P52L004N551R028k793l336
$$ 589 -6436 -9500 -11622 -12979 -8069 -2237 -3009 -6304 -8717 -7965 -4961 590 9618 6825 3489
13571C489j089P975L176L722l404o253j846M767m180K463q192m737j880k468r020
$$ 3489 2400 10375 13551 17273 13869 7616 5770 10537 6357 8820 628 -4109 -5989 -8457 -17477
13556a7477N364L109O225Q951m354m771O368j913l520r02K129O201L008m056L693
$$ -17477 -12113 -9004 -2779 6172 1818 -2953 3415 1502 -2018 -2920 -791 5410 8418 4362 8055
13541H055Q416J774J053o07j5152R56j0830r651N522J0265k708L816k955r665
$$ 8055 16471 18245 19298 18691 3539 4495 -6335 -15986 -10464 -199 -2907 909 -2046 -11711
13527a1711J243K499l532m657kk506M359M353K824L091P536K60j0383k61k190
$$ -11711 -10468 -7969 -11501 -16158 -16160 -18666 -14307 -9954 -7130 -4039 3497 3757 -6626 -6887 -9077
13512i077M339q139j75J824m44k225K41m173P850J2829N867j66m687j0932J1438
$$ -9077 -4738 -12877 -13052 -11228 -11672 -13897 -13656 -17829 -9979 2850 8717 8551 3864 -7068 4370
13497D370M647p362P28l168p598m467o052R230N20O38O460m947j0757J35J654
$$ 4370 9017 1655 2383 -785 -8383 -12850 -18902 -9672 -9152 -8514 -2054 -7001 -17758 -17623 -15969
13482a5969Q761J639Q744M184j483m609K809j1537l133L48j526q05J109k094J0262
$$ -15969 -7208 -5569 3175 7359 5876 1267 4076 -7461 -10594 -10246 -11772 -12577 -11468 -13562 -3300
13467c300J1737M671q012q668L210L49J3276M862j1543j2811m48P464j52l467
$$ -3300 8437 13108 5096 -3572 -362 -13 13263 18125 6582 -6229 -6677 787 635 -2832
13453b832N802j738q656L069l767l81N758k294o059j091P135j318m159K2n110
$$ -2832 2970 1232 -7424 -4355 -8122 -8503 -2745 -5039 -11098 -12189 -5054 -6372 -10531 -10509 -15619
13438a5619N554J0089j418M237j802m665j639m854j697K709K614O99N36J0364
$$ -15619 -10065 24 -1394 2843 1041 -3624 -5263 -10117 -11814 -9105 -6491 -5792 -5256 5108
13424E108j642o555J885Q4n154k890n436l138J1990J2971r649j196n643M410K259
$$ 5108 3466 -3089 -1204 -1120 -6274 -9164 -14600 -17738 -5748 7223 -2426 -3622 -9265 -4855 -2596
13409b596j332Q237N682j0535n957o394L507N896Q874k664k807l054q59p49J1446
$$ -2596 -3928 4309 9991 -544 -6501 -12895 -9388 -3492 5382 2718 -89 -3143 -4002 -4751 6695
13394F695P188p9o314n485k463N41n723r661l719L86N164J3541m027k04N010j0403
$$ 6695 13883 13804 7490 2005 -458 83 -5640 -15301 -19020 -18634 -13470 71 -3956 -4160 850 -9553
13378i553N31N893L404L572n224O037N632m237n682n049m774L838O009l618n366
$$ -9553 -9022 -3129 275 3847 -1377 4660 10292 6055 373 -4676 -9450 -5612 397 -3221 -8587
13363h587n606M974M684J022K412L950J77j986k568N13l097k901P639R721N081
$$ -8587 -14193 -9219 -4535 -3513 -1101 2849 3026 1040 -1528 -1015 -4112 -7013 626 10347 15428
13348A5428j11J4O06j0244j4215L097K38m492m339n854J2922J9364L971q920l544
$$ 15428 15317 15331 15937 5693 -8522 -5425 -5187 -9679 -14018 -19872 -6950 12414 16385 7465 3921
13333C921p804J294n452p027P81R131l576M708J034K75J652J73O705O409p495
$$ 3921 -3883 -2589 -8041 -15068 -14287 -5156 -8732 -4024 -2990 -2715 -1063 -890 5815 12224 4729
13318D729r540k119N464L206m453m156m515k03J9467P363j5224O48K267L499k645
$$ 4729 -4811 -6930 -1466 1740 -2713 -6869 -11384 -11587 7880 15243 19 667 2934 6433 3788
13303C788m647L001k73M708l904k867j078m516l637r972R90O763L660N256L734
$$ 3788 -859 2142 1869 6577 2673 -194 -1272 -5788 -9425 -19397 -18407 -11644 -7984 -2728 1006
13288A006k24J977l25p663J709O028o82L395J3324L70p588p591l552n011j957
$$ 1006 782 2759 2434 -5229 -3520 2508 1826 5221 18545 18915 11327 3736 184 -4827 -6784
13273f784M570R706l069p05k365k204P301J2333r816J106Q53K769J469j2704j6614
$$ -6784 -2214 7492 4423 3718 1353 -851 6450 18783 8967 10073 10926 13695 15164 2460 -14154
13258a4154L506K2459J1249j1297n728k565K3J941R0R33l848n692K458k506m444
$$ -14154 -10648 11811 23060 11763 6035 3470 3493 5434 5524 6457 2609 -3083 -625 -3131 -7575
13243g575O403r13j410m51p330k363J9617R422q468p743M330L041L62M313o340
$$ -7575 -1172 -2085 -3495 -3946 -11276 -13639 5978 15400 6932 -811 3519 6560 6922 11235 4895
13228D895j04K542r593n705L359Q192N904m659J469m049R23O714J3553N040q384
$$ 4895 4791 7333 -2260 -7965 -4606 3586 9490 4831 6300 2251 3174 9888 23441 28481 20097
13213B0097j9149L42O199l226n03K687o340J477m394j305M437n246r121j917K8
$$ 20097 948 1290 7489 4263 3760 6447 107 1584 -2810 -4115 322 -4924 -14045 -15962 -15934
13198a5934K511j095m810l104L718k066R030J3427J776j825j912K694n333l392
$$ -15934 -13423 -14518 -19328 -22432 -18714 -20780 -11750 1677 3453 1628 -284 2410 -2923 -6315
13184f315N81J0840j1662p704P974K594j0065N361J4054P314K553P788P484J4643
$$ -6315 -5734 5106 -6556 -14260 -6286 -3692 -13757 -8396 5658 12972 15525 23313 30797 45440
13170D5440K6450J6164p932n554p812j9602k2430l912R96k346n184p374j954O785
$$ 45440 71890 88054 80122 74568 66756 47154 24724 20812 21808 19462 14278 6904 4950 11735
13156A1735k499l061l725n405n061M384J1332L487l525j2826J574Q817j291j59
$$ 11735 9236 6175 2450 -2955 -8016 -3632 7700 11187 7662 -5164 -3590 5227 3936 3777
13142C777l566K213m607q120M830M761M098L447R391L685K95O089O65L484J4805
$$ 3777 211 2424 -2183 -10303 -5473 -712 3386 6833 16224 19909 20204 26293 26958 30442 45247
13127D5247L1228M0674N3983O0487K6043j7001n3178n6266m5007l4548j4491j2665
$$ 45247 76475 117149 171132 231619 257662 240661 187483 131217 86210 51662 37171 24506
13115B4506q499m049K253N968l870m280p490M84j0369n695N51N086L829N422m376
$$ 24506 16007 11958 14211 20179 16309 12029 4539 5023 -5346 -11041 -10490 -5404 -1575 3847 -529
13100e29j088M431N130N887M360P540r143k775K079l716j255J05P3m943L852J2798
$$ -529 -1617 2814 7944 13831 18191 25731 16588 13813 15892 12176 10921 11026 11099 6156 10008 22806
13084B2806J0358Q689L6787M2510N5595N7753L1944j2815n2583n6681m1940l4375
$$ 22806 33164 41853 78640 121150 176745 234498 266442 253627 201044 144363 102423 68048
13072F8048k4376j7739j2627j4467m515m005M531N956N646R96M569K977K242j8351
$$ 68048 43672 25933 13306 -1161 -5676 -9681 -5150 806 6452 7448 12017 14994 17236 -1115
13058a115M56M905L089q48l791j2564J427O930K637K691k791o778L261Q362l385
$$ -1115 -659 4246 7335 6487 2696 -9868 -8441 -1511 1126 3817 1026 -5752 -2491 5871 2486
13043B486k014n239P364N000P135R463N524J7956K1563O590J7611J691j2458k5334
$$ 2486 472 -4767 2597 7597 14732 24195 29719 47675 69238 75828 93439 95130 82672 57338
13029E7338k0620n991n185p80k954l158j0045K533L911J1503l161k814N569j1831
$$ 57338 36718 30727 25542 24762 21808 18650 8605 11138 15049 26552 23391 20577 26146 14315
13015A4315j8178j422J006m462K600L832o331O356Q25k323j668m615P841N951
$$ 14315 -3863 -5285 -4279 -8741 -6141 -2309 -8640 -2284 -1459 -3782 -5450 -10065 -2224 3727
13001C727J696K246l323l157K119O466Q79p309j0683M958J2016J155J349p747
$$ 3727 5423 7669 4346 1189 3308 9774 10653 3344 -7339 -2381 9635 10790 12139 4392
12987D392o302p564K051k632L482N764M019k695o933j684R943N98m384L309k742
$$ 4392 -1910 -9474 -7423 -10055 -6573 -809 3210 515 -6418 -8102 1841 2439 -1945 1364 -1378
12972a378j697j538K295M690l435J841j625K918N32r569L855K396m191J326k820
$$ -1378 -3075 -4613 -2318 2372 -1063 778 -847 2071 2603 -6966 -3111 -715 -4906 -3580 -6400
12957f400p359N681O549l215m597K409P035j608l748O972N700O079j962M258p286
$$ -6400 -13759 -8078 -1529 -4744 -9341 -6932 103 -1505 -5253 1719 7419 13498 11536 15794 8508
12942H508j5148o652Q907L455o133l500l637R049O40n969k365o373l178J043M972
$$ 8508 -6640 -13292 -4385 -930 -7063 -10563 -14200 -5151 -4511 -10480 -12845 -19218 -22396 -21353 -16381
12927a6381J0286L508K072o906j351M023R042j569N65Q48J853k735J745J435j292
$$ -16381 -6095 -2587 -515 -7421 -8772 -4749 4293 2724 3289 4137 5990 3255 5000 6435 5143
12912E143k151j2757j747M308q03n224l449L296N163L894k047O432P739q319j777
$$ 5143 2992 -9765 -11512 -7204 -8007 -13231 -16680 -13384 -8221 -4327 -6374 58 7797 -522 -2299
12897b299k917j73J2407m121M946k001o99m769p541M351M260M114l365Q2O245
$$ -2299 -5216 -5389 7018 2897 7843 5842 5143 374 -7167 -2816 1444 5558 2193 2275 8520
12882H520j0389p137O508l823k643k480K29K621P338m701m126M847o858K187J1154
$$ 8520 -1869 -9006 -2498 -6321 -8964 -11444 -11215 -8594 -1256 -5957 -10083 -5236 -12094 -9907 1247
12867A247P801m084q128j551J1666L251j708K149k127l989q440N478k67j331J506
$$ 1247 9048 4964 -3164 -4715 6951 10202 8494 10643 8516 4527 -3913 1565 1298 -33 1473
12852A473J363N695R3J572j054q119j1987r54m665o95J0034m039p218K794p996
$$ 1473 2836 8531 8624 10196 9142 1023 -10964 -11918 -16583 -17278 -7244 -11283 -18501 -15707 -23703
12837b3703R687O211M12l187O289J3386j171j6482N42J672K208L043J064P398
$$ -23703 -14016 -7805 -7393 -10580 -4291 9095 7924 -8558 -8016 -6344 -4136 -1093 -29 7369
12823G369m559J607r409l386J952J0467M414m878p208K6J1028l637q780P050j369
$$ 7369 2810 4417 -4992 -8378 -6426 4041 8455 3577 -3631 -3605 7423 3786 -4994 2056 687
12808F87m05P921J74o065q443N26k613L733K529M738o48q055m447J2249p124k260
$$ 687 282 8203 8377 2312 -6131 -5605 -8218 -4485 -1956 2782 2134 -5921 -10368 1881 -5243 -7503
12792g503N525L464O044P495N772k970k455P63n031l930p622q519J0825P06r447
$$ -7503 -1978 1486 7530 15025 20797 17827 15372 16135 11104 7174 -448 -8967 1858 2564 -6883
12777f883P556M806o063P45Q92l97J308n875m71J459p43m666P567R101J812l087
$$ -6883 673 5479 -584 161 1053 656 1964 -3911 -4382 -2923 -3666 -8332 -765 8336 10148 7061
12761G061r560k719N247L722r223l448J004k69j404n257o956m96Q343L692o066
$$ 7061 -2499 -5218 29 3751 -5472 -8920 -7916 -8185 -9589 -14846 -21802 -22298 -13955 -10263 -16329
12746a6329R358L336k852N151K21j1512n119n682R042J3291r714j158j478O387
$$ -16329 -6971 -3635 -6487 -1336 -1115 -12627 -17746 -23428 -14386 -1095 -10809 -11967 -13445 -7058
12732g058m818j581p362L980L286l666R005P240m519k89j111n806R084M727M609
$$ -7058 -11876 -13457 -20819 -16839 -13553 -17219 -8214 -974 -5493 -5782 -6893 -12699 -3615 1112 5721
12717E721m02Q389r794l943l793J527P55k913j253J1803M542j0318j3061o601
$$ 5721 5319 13708 3914 -29 -3822 -2295 -1540 -4453 -5706 6097 10639 321 -12740 -19341
12703a9341j4154M705J2702L190K615l458J558K43J750N097M162j180n384L321
$$ -19341 -33495 -28790 -16088 -12898 -10283 -13741 -12183 -11940 -10190 -5093 -931 -2111 -7495 -4174
12689d174L718J4096K124j0440l061P355J792K974n242k752K994p298j1835m635
$$ -4174 -456 13640 15764 5324 2263 9618 11410 14384 9142 6390 9384 2086 -9749 -14384
12675a4384P948K024l287J735J244l990j466o07K431J584l540l831k380R587J43
$$ -14384 -6436 -4412 -7699 -5964 -4720 -8710 -10176 -10783 -8352 -6768 -10308 -14139 -16519 -6932 -6789
12660f789k113J098k771q139Q212O543P339M29P19m239l4q327r100j053P072J87
$$ -6789 -8902 -7804 -10575 -18714 -10502 -3959 3380 3809 4528 289 255 -8072 -17172 -18225 -11153 -10966
12644a0966p167j544O388N729K744M74J6640k410p668p196J107J2638J433j055
$$ -10966 -18133 -19677 -13289 -7560 -4816 -4342 12298 9888 2220 -4976 -3869 8769 10202 9147
12630I147j0169q74J4438o283o071M720R059L972p343n886j405p51N218J553r981
$$ 9147 -1022 -1896 12542 6259 188 4908 13967 17939 10596 4710 3305 2554 7772 9325 -656
12615f56j1144J034R831m043r925Q562K117n136K223J684K830p71j053n005j1140
$$ -656 -11800 -10766 -935 -4978 -14903 -6341 -4224 -9360 -7137 -5453 -2623 -3394 -4447 -9452 -20592
12600b0592N431J5496L895r291k388j755O266J4527L177K750k273Q07j3086n034
$$ -20592 -15161 335 4230 -5061 -7449 -9204 -2938 11589 14766 17516 15243 16050 2964 -2070
12586b070P421M66m288k723k163J069N930l598O95N740P080J004j3717j1087P180
$$ -2070 5351 5817 1529 -1194 -3357 -2288 3642 44 739 6479 13559 14563 846 -10241 -3061
12571c061N260N67j650N515R421l794L929K867P61j8649k275p03J650K450M753
$$ -3061 2199 2766 1116 6631 16052 12258 16187 19054 19815 1166 -1109 -1812 -162 2288 7041
12556G041r768j2357J2836k482L318O474L472l227o798K728K044O12K928j168
$$ 7041 -2727 -15084 -2248 -4730 -1412 5062 8534 5307 -1491 1237 3281 3893 6821 5653
12542E653J091O25j0355j2337Q867K668m705n470R194Q852o53p121k204n760O306
$$ 5653 6744 7369 -2986 -15323 -6456 -3788 -8493 -13963 -4769 4083 3430 -3691 -5895 -11655 -5349
12527e349Q789L783l960k144j63J078J2130K501N68j9206o245J413k804p078N746
$$ -5349 3440 7223 3263 1119 956 2034 14164 16665 17233 -1973 -8218 -6805 -9609 -16687 -10941
12512a0941J926k97N907J78j879k630k455m909J1580K643R89L211l234q90n943
$$ -10941 -9015 -9312 -3405 -3227 -5106 -7736 -10191 -15100 -3520 -877 112 3323 89 -801 -6744
12497f744m113N566M405q273j3781J0539P974l564j372n197J535M485L413l361
$$ -6744 -10857 -5291 -886 -9159 -22940 -12401 -4427 -7991 -9363 -14560 -13025 -8540 -5127 -8488
12483h488J394L895n696P355P641n985L589N484N15q68k540J028K932Q744p202
$$ -8488 -7094 -3199 -8895 -1540 6101 116 3705 9189 9704 8836 6296 7324 10256 19000 11798
12468A1798o570J855j4943O23O36j0203m221Q441P730J464L572J779m942k906
$$ 11798 5228 7083 -7860 -7237 -6601 -16804 -21025 -12584 -4854 -3390 182 1961 -2981 -5887
12454e887J383n91M790p044o894L876p17p389P25o508J123J05M600O503N906m64
$$ -5887 -4504 -5095 -305 -7349 -14243 -10367 -11084 -18473 -17748 -24256 -23133 -23028 -18428 -11925 -6019 -6483
12438f483J825R712n740o058R199R433k771O055J104k29o993r861J124J2743j910
$$ -6483 -4658 5054 -686 -6744 2455 11888 9117 15172 16276 16047 9054 -807 317 13060 11150
12423A1150j2644m924J0059P577m52j7031o1J2951Q74n511p545n930N748N823
$$ 11150 -1494 -6418 3641 11218 10766 -6265 -6326 6625 7499 1988 -5557 -11487 -5739 84
12409H4r638n118L146R916k881o658k513M618O327J172P16L859L385q401j0759
$$ 84 -9554 -14672 -11526 -1610 -4491 -11149 -13662 -9044 -2717 -1545 -829 3030 6415 -1986 -12745
12394a2745j0926k720J843P520R480j144j2150J1784J4199m047p519K652j539
$$ -12745 -23671 -26391 -24548 -17028 -7548 -8692 -20842 -9058 5141 1094 -6425 -3773 -5312
12381e312k857O292R603M563K001j610l919r028n375N87L335J741J015j173q524
$$ -5312 -8169 -1877 7726 12289 14290 12680 8761 -267 -5642 -5055 -1720 21 1036 -137 -8661
12366h661L529K485L265j282j2741N690K960n842q377j0927J79K727Q913p17j935
$$ -8661 -5132 -2647 618 -664 -13405 -7715 -4755 -10597 -18974 -29901 -29722 -26995 -18082 -18799 -20734
12351b0734p268P497P839R696k837L152l427l031M702O887M365k610k880q06j455
$$ -20734 -28002 -20505 -12666 -2970 -5807 -2655 -6082 -9113 -4411 2476 6841 4231 1351 545 -910
12336i10j2469N876Q116Q783l837q50o83L181J177l279l361M922J842M6k872l713
$$ -910 -13379 -7503 613 9396 5559 4709 4026 7207 8384 5105 1744 6666 8508 8554 5682 1969
12320A969r719j654L833J5581Q622q784q040J33k509n598n195J959q99m80M581
$$ 1969 -7750 -9404 -5571 10010 18632 9848 1808 1941 -568 -6166 -11361 -9402 -10301 -10781 -6200
12305f200l480L09O438j232K924K126J204o701q432L901O136M912k357O425J193
$$ -6200 -9680 -9371 -2933 -4165 -1241 885 2089 -4612 -13044 -9143 -3007 1905 -452 5973 7166
12290G166k264J300J752l166j1290o880L843M855J445R863L229n012k073j0623
$$ 7166 4902 6202 7954 4788 -6502 -13382 -9539 -4684 -3239 6624 9853 4841 2768 -7855
12276g855m291L491M067l224j112M872R916L900q58n074k23m009K946L013r794
$$ -7855 -12146 -8655 -4588 -7812 -8924 -4052 5864 9764 8906 3832 3609 -400 2546 5559 -4235
12261d235o155q92m28K511O107R53l93l655O793l20M148k782p516l913K975Q73
$$ -4235 -10390 -11282 -11710 -9199 -3092 -2139 -2532 -6187 606 286 4434 1652 -5864 -9777 -6802 -5929
12245e929Q18j035j822o880k887p126N008j726m218J552Q308R335J2081K280J73
$$ -5929 -5111 -6146 -7968 -14848 -17735 -24861 -19853 -21579 -25797 -24245 -15937 -6602 5479 7759 7932
12230G932m156o128j273J718n268l131l21P812L516N694l665q226K079J386n375
$$ 7932 3776 -2352 -3625 -1907 -7175 -10306 -10627 -2815 701 6395 2730 -5496 -3417 -2031 -7406
12215g406R601Q696J114K592J45j1766j3707k407J92P051l067J442q810j899l591
$$ -7406 2195 10891 12005 14597 14742 2976 -10731 -13138 -12946 -5895 -8962 -7520 -16330 -18229 -21820
12200b1820M434J376J494m78o693M216R904L302N20n564k357J0535J0364l830
$$ -21820 -17386 -16010 -14516 -14994 -21687 -17471 -7567 -4265 -3745 -9309 -11666 -1131 9233 5403
12186E403l831M313M359m401p883k537j257j413O902N59L702k93l107N256J211
$$ 5403 1572 5885 10244 5843 -2040 -4577 -5834 -7247 -345 214 3916 3623 516 5772 6983
12171F983k233k694O472k544p814M005k767j1326O431O472o52p585K55l118P92
$$ 6983 4750 2056 8528 5984 -1830 2175 -592 -11918 -5487 985 333 -7252 -6997 -10115 -9323
12156i323l827l334J2283J572j238o951q62L555L655O656n439Q83N7K962n427
$$ -9323 -13150 -16484 -4201 -2629 -3867 -10818 -11680 -8125 -4470 2186 -3253 -2370 -2313 649 -4778
12141d778J474M31n768l523J757O350J0203k672J06M250j82r365j195K122J373
$$ -4778 -3304 -2873 -8641 -12164 -10407 -4057 6146 3474 3580 7830 7648 -1717 -2912 -790 583
12126E83k460J541K868L338m097N467m678m361J989L470k619P976o782j3087J460
$$ 583 -1877 -336 2532 5870 1773 7240 2562 -1799 190 3660 1041 9017 2235 -10852 -9392
12111i392J718o413K659J4220k260L200Q95j19q440m718K548P817J882j3081j582
$$ -9392 -7674 -14087 -11428 2792 532 3732 4627 4508 -3932 -8650 -6102 1715 3597 -9484 -11066
12096a1066K597M843J7855K877l950n474k573j187j765P67l343K678o37K788j0599
$$ -11066 -8469 -3626 14229 17106 13156 7682 5109 3922 2157 2924 -419 2259 1622 4410 -6189
12081f189p736J093m460l222J4752N631j1146J894P845L001l801j32o425m005
$$ -6189 -13925 -12832 -17292 -20514 -5762 -131 -11277 -9383 -1538 1463 -2338 -2470 -8895 -12900
12067a2900L600L780J4842J413k910m304N300J320n148m58n685p099M14O244M873
$$ -12900 -9300 -5520 9322 10735 7825 3521 8821 10141 4993 4535 -1150 -8249 -7835 -1591 3282
12052C282K274R40j549k359L47j213J491O373L179P70r601j423R586K533j1316
$$ 3282 5556 6496 4947 2588 2935 1722 3213 9586 12765 13535 3934 2511 12097 14630 3314
12037C314L441j029p183M713J308q129J531P49j679O261N023Q972O589k828l836
$$ 3314 6755 5726 -1457 3256 4564 -3565 -2034 -1285 -2964 3297 8320 17292 23881 21053 17217
12022A7217m670j939p986M13Q109j761M693n410k434M078J530K321l487p840J175
$$ 17217 12547 10608 2622 3035 11144 9383 14076 8666 6232 10310 11840 14161 10674 2834 4009
12007D009L680j0416M188J1324L283k739j2230j846O826N149N1l502n123N647
$$ 4009 7689 -2727 1461 12785 16068 13329 1099 -747 6079 11228 11279 7777 2654 8301
11993H301k47n375o350j743m619J582L425K40k43J323k807Q196N494M805M009
$$ 8301 8054 2679 -3671 -5414 -10033 -8451 -5026 -4786 -5029 -3706 -6513 1683 7177 11982 15991
11978A5991k411j4264n989j414L514N667M234p71j5273j0674K882J6894J2696
$$ 15991 13580 -684 -6673 -8087 -4573 1094 5328 4557 -10716 -21390 -18508 -1614 11082
11965A1082m002j7751j0449M400K44O833O807O96o307M178P190O586N850P604
$$ 11082 7080 -10671 -21120 -16720 -16476 -9643 -2836 -2140 -8447 -4269 2921 9507 15357 22961
11951B2961l104m411n878n194q46N223l41m850k352r031M092m918N653O133L054
$$ 22961 19857 15446 9568 4374 3528 8751 8410 3560 1208 -7823 -3731 -8649 -2996 3137 6191
11936F191L409j683j038K159k165p416P87k610J96m099k942M993L570p268k606
$$ 6191 9600 7917 6879 9038 6873 -543 244 -2366 -2170 -6269 -9211 -4218 -648 -7916 -10522
11921a0522K408J146P687M480j5061n712K588Q322N099j601N054k500L813m96
$$ -10522 -8114 -6968 719 5199 -9862 -15574 -12986 -4664 435 -1166 3888 1388 5201 4705
11907D705j2389p185M077K048O816J981l42n323M263N798j741n078J661N033Q456
$$ 4705 -7684 -14869 -10792 -8744 -1928 53 -289 -5612 -1349 4449 2708 -2370 -709 4324 12780
11892A2780J130r66K69J379k312j2363o085P135K766j192N259l36l931l806k788
$$ 12780 13910 12944 13213 14592 12280 -83 -6168 967 3733 2541 7800 7464 3533 -273 -3061
11877c061n57k24k055k668J734k956p068J138K059O336J6390k49o519j307K814
$$ -3061 -3618 -3842 -5897 -8565 -6831 -9787 -16855 -15717 -13658 -7322 9068 8819 2300 993 3807
11862C807R1L832O344p743k955k595q010J65K087M25k172J040k220K807o705N003
$$ 3807 3898 7730 14074 6331 3376 781 -7229 -7064 -4977 -4552 -6724 -5684 -7904 -5097 -11802 -6799
11846f799Q949k577m280n45k098J334m247k781l476K805M718J0185o30m571l217
$$ -6799 2150 -427 -4707 -5252 -7350 -6016 -10263 -13044 -16520 -13715 -8997 1188 558 -4013 -7230
11831g230J428l31j680L72m13K395j339O851l013l428L513k267j3490J975L239
$$ -7230 -5802 -6133 -7813 -7441 -7854 -5459 -6798 53 -2960 -6388 -2875 -5142 -18632 -16657 -13418
11816a3418J4449Q795J328k703P6M284J339L853q693j1418j00Q081L382R17o548
$$ -13418 1031 9826 11154 8451 8527 12811 14150 18003 9310 -2108 -2208 5873 9255 10172 3624
11801C624p772q133r96M149M06O796N69k92p246n303M007O563Q080K40k942N89
$$ 3624 -4148 -12281 -13277 -9128 -8722 -1926 -1357 -1649 -8895 -14198 -10191 -3628 4452 4692 1750 2339
11785B339J542q088r420o56J3022L36m796J757j728J468L3l519L396P556K54o007
$$ 2339 3881 -4207 -13627 -14283 -1261 -925 -5721 -3964 -5692 -4224 -4191 -7710 -4314 3242 3496 -2511
11769b511k496m300K536J2340L493l721m941K724K824K552O74r716q235J0483
$$ -2511 -5007 -9307 -6771 5569 9062 5341 400 3124 5948 8500 9174 -542 -8777 1706
11755A706N311o581J455L136K993j2924l61O624Q486L592r35J99j0171o545j105
$$ 1706 7017 436 1891 5027 8020 -4904 -5265 1359 9845 13437 12502 12701 2530 -4015 -5120
11740e120j005J123p350n37J1471o071M879O380l037n217j0076o813J957J5619
$$ -5120 -6125 -5002 -12352 -12889 -1418 -7489 -2610 3770 733 -4484 -14560 -21373 -19416 -3797
11726c797P159J02M982j378o412K226O15l775K967P536m213j0267p921p221M407
$$ -3797 3362 3464 8446 7068 656 2882 3497 -278 2689 10225 6012 -4255 -12176 -19397 -14990
11711a4990l418j513N311j706J2518N995p980n201q032J613R654l784j5749Q08
$$ -14990 -18408 -19921 -14610 -16316 -3798 2197 -5783 -10984 -19016 -17403 -7749 -11533 -27282 -26474
11697b6474J7763J802m372m089L70J696J0019L298L891l000Q09J424r032l84M169
$$ -26474 -8711 -6909 -11281 -15370 -15000 -13304 -3285 13 3904 904 1713 3137 -5895 -6279 -2110
11682b110J645J4020Q58J02j0228m534J0375N34n092l515n165J672P732o52l097
$$ -2110 -465 13555 14413 14515 4287 -247 10128 10662 5570 2055 -3110 -1438 6294 5642 2545
11667B545k015K874M012q007n481r086P941O225o581L394J860L757k651j680m362
$$ 2545 530 3404 7416 -591 -6072 -15158 -7217 -992 -7573 -4179 -2319 1438 -1213 -2893 -7255
11652g255K683Q680r30l924o123M827P644K605j728M709K73j0881J444N557N902
$$ -7255 -4572 4108 3178 -746 -6869 -2042 5602 8207 6479 11188 11461 580 2024 7581 13483
11637A3483N032k478r480n715n936j978J0665P718J502O208l250q50n345l296
$$ 13483 18515 16037 6557 842 -5094 -7072 3593 11311 12813 19021 15771 14921 9576 6280
11623F280J096l735o353o396O930q33J0743K185q307o072L265l594j554j90P105
$$ 6280 7376 3641 -2712 -9108 -2178 -3011 7732 9917 1610 -4462 -1197 -4791 -6345 -6535 570
11608E70O634m916q333m101N663P12L586J4570P574q89q796j9065M260N764J434
$$ 570 7204 2288 -6045 -10146 -4483 -3771 -185 14385 21959 21070 12274 -6791 -2531 3233 4667
11593D667n989k344KK827K40o215o01p92p78K575n404O65J75N841L530L93J012
$$ 4667 -1322 -3666 -3664 -837 -597 -6812 -7413 -8205 -8983 -6408 -11812 -11147 -10972 -5131 -1601 -1208 -196
11576a96R163n272N05K928p441J1042J491j1114p197K877K145K692k883m104m405
$$ -196 8967 3695 4200 7128 -313 10729 12220 1106 -6091 -3214 -1069 1623 -1260 -5364 -9769
11561i769j148l711K970N921l92N464n326J356n602j4769P970J0577M575Q37o00
$$ -9769 -10917 -14628 -11658 -5737 -6129 -665 -5991 -4635 -10237 -25006 -17036 -6459 -1884 -1047 -1647
11546a647r910n494Q766L875P384O384j355l38k391k764p691N011l539k454O120
$$ -1647 -11557 -17051 -8285 -4410 2974 9358 8003 7665 5274 2510 -5181 -170 -3709 -6163 -43
11531d3M048k052J481j071J388j265M545Q55%K165o682L407m458k856P056P13
$$ -43 4005 1953 3434 2363 3751 2486 7031 7886 7886 10051 3369 6776 2318 -538 6518 7231
11515G231p606k880J3628J509o731k161K737j5677K287M987L621O641J476j0461
$$ 7231 -375 -3255 10373 11882 5151 2990 5727 -9950 -7663 -2676 945 7586 9062 -1399
11501a399p683M880P666l108r23J377k68N48O304j384k669Q75l862J1618j129
$$ -1399 -9082 -4202 3464 356 -567 810 542 1090 7394 6010 3341 4216 354 11972 10843
11486A0843m745J524n040o27M649M202k429j6461l171L423p09J370r200O369O769
$$ 10843 6098 7622 2582 1955 6604 10806 8377 -8084 -11255 -7832 -8541 -7171 -16371 -10002 -3233
11471c233k367P30P576o526L427j1808o454K902j902R103j304J740j567K023P80
$$ -3233 -5600 -4870 2706 -3820 -393 -12201 -18655 -15753 -17655 -8552 -9856 -8116 -9683 -7660 -6880
11456f880J154N951o565N652j519r318n38Q741P682K713L187L137K712p82m534
$$ -6880 -5726 225 -6340 -688 -2207 -11525 -12063 -3322 4360 7073 10260 13397 16109 15327 10793
11441A0793k658J492O646o283o553N732p508o120k612j440L330m36K890K018q10
$$ 10793 8135 9627 16273 9990 3437 9169 1661 -4459 -7071 -8511 -5181 -5617 -2727 -709 -1519
11426a519M760j101p841q382J887o001m618M078k875M289N629J0585P192l829
$$ -1519 3241 2140 -5701 -14083 -12196 -18197 -22815 -18737 -21612 -17323 -11694 -1109 6083 2254
11412B254k082P605o012r269M052O826j2236n497K75L082k834l165J509R846M374
$$ 2254 172 7777 1765 -7504 -3452 3374 -8862 -14359 -14084 -11002 -13836 -17001 -15492 -5646 -1272
11397a272q71R512O982m421j2227p239J0363k789o913N15o096m366J5756N760
$$ -1272 -2143 7369 14351 9930 -2297 -9536 827 -1962 -8875 -8360 -14456 -18822 -3066 2694
11383B694J36o414l579L322q96p02j641j316L798J1319L239J452m633Q55j103
$$ 2694 2830 -3584 -7163 -3841 -4737 -5439 -7080 -8396 -4598 6721 9960 11412 6779 7634 6531
11368F531p559o758L801J289m168m581o357N041L771Q274P45k237k3o231O22R587
$$ 6531 -1028 -7786 -3985 -2696 -6864 -11445 -17802 -12761 -8990 -716 29 -2208 -2231 -8462 -7840 1747
11352A747N375k255k49j11m546q382K537J801q351J329P419j39k277M998L856
$$ 1747 7122 4867 4618 4507 -39 -8421 -5884 -4083 -12434 -11105 -3686 -3825 -6102 -1104 2752
11337B752P786j520m944N836l912j1349J547R399O740N75L281n710k708k325J86
$$ 2752 10538 9018 4074 9910 5998 -5351 -3804 5595 12335 12910 16191 10481 7773 5448 5634
11322E634m569n042L57r839j595R726R412N033l396j897k733j5697q91M004m716
$$ 5634 1065 -3977 -3620 -13459 -15054 -5328 4084 9117 5721 3824 1091 -14606 -15497 -11493 -16209
11307a6209M575N409r014j0537P42j452R99N560O122L494M480L834l769l005m129
$$ -16209 -11634 -6225 -15239 -25776 -25034 -26486 -25487 -19927 -13805 -10311 -5831 -1997 -5766 -8771 -12900
11292a2900K77N086R751J536k982m527P993M594j1244k78O525J0476m287j0748
$$ -12900 -12623 -7537 2214 3750 768 -3759 4234 8828 -2416 -2694 3831 14307 10020 -728
11278g28K809l960r02N713M021R77k586K448N99L324K656j2462j072K658N299
$$ -728 2081 -1879 -2781 2932 6953 7930 5344 7792 8391 11715 14371 1909 837 3495 8794
11263H794p179m454O885n19K204J3088J771j0910m010M919l581p588L65l715n52
$$ 8794 1615 -2839 4046 3527 5731 18819 20590 9680 5670 10589 7008 -580 -215 -3930 -4482
11248d482j198K449J167m809k573q928P8P097n32n037q21K027J768M555L265Q675
$$ -4482 -5680 -3231 -2064 -6873 -9446 -18374 -18296 -11199 -11731 -16768 -17589 -15562 -13794 -9239 -5974 2701
11232B701J459Q73p238n218N574M271o174N354J1018M25n189l87k324l809q675
$$ 2701 4160 5033 -2205 -7423 -1849 2422 -3752 1602 12620 13045 7856 7469 5145 1336 -7339
11217g339k305R820L40j2279l404P393P803k536m675j0840m072O45J1276P315
$$ -7339 -9644 176 516 -11763 -15167 -7774 29 -2507 -7182 -18022 -22094 -21449 -10173 -2858
11203b858L43k000L450J209o14p639j1059j062R247L931n57k010J673k144M360
$$ -2858 -2515 -4515 -1065 144 -470 -8109 -19168 -20230 -10983 -7052 -7609 -9619 -7946 -10090 -5730
11188e730l13R861L423r342n976J533R33p578K4M1P56J430K802Q720J052K005
$$ -5730 -6043 3818 7241 -2101 -8077 -6544 -5611 -13189 -13165 -13124 -12368 -10938 -8136 584 1636 3641
11172C641K883n703p155K108N122J258l25J269k721j42R35n914K629j715K74j494
$$ 3641 6524 821 -6334 -4226 896 2154 1829 3098 377 235 1170 -4744 -2115 -3830 -3556 -5050
11156e050M161J0701J303j4466l300p025l065R859R856r39K184P750K122O194
$$ -5050 -889 9812 11115 -3351 -6651 -13676 -16741 -6882 2974 2035 4219 11969 14091 20285
11142B0285p866n469n692q148j916m50M213J661L56k86N84J883k865j0592Q334
$$ 20285 12419 6950 1258 -6890 -8806 -9256 -5043 -3382 -3026 -3312 -2728 -845 -3710 -14302 -5968
11127e968N154R897R241j3428j0529j2179Q256J2857R004L857m398N056n752p741
$$ -5968 -814 9083 18324 4896 -5633 -17812 -9556 3301 12305 16162 11764 16820 11068 3327
11113C327n676l447J577L19L366o045p803O183P57Q622J3581j1636l415K35j1657
$$ 3327 -2349 -5796 -4219 -3900 -534 -6579 -14382 -8199 -7442 1180 14761 3125 -290 -55 -11712
11098a1712p267L293R88K244O702P752Q473O509m797k772K214p22J090O807n449
$$ -11712 -18979 -15686 -14698 -12454 -5752 2000 10473 16982 12185 9413 11627 10905 11995 18802 13353
11083A3353p312n126n22m779j792o664j285O465M185J1429O636n488p025l021
$$ 13353 6041 915 393 -4386 -6178 -12842 -14127 -7662 -3477 7952 14588 9100 2075 -946
11069i46L977m441L163P593N218j383j2559l783L733k422j70J0365l660r422k87
$$ -946 3031 -1410 1753 9346 14564 13181 622 -3161 572 -1850 -2020 8345 4685 -4737 -5024
11054e024J1459J119n841q504l783l478Q388j68L991R436P554O738j840n328q939
$$ -5024 6435 7554 1713 -6791 -10574 -14052 -5664 -5832 -1841 7595 15149 21887 20047 14719 5780
11039E780j3367pO563O205M758K219l239J807Q10o718n352l120Q920K505n673
$$ 5780 -7587 -7594 -1031 5174 9932 12151 8912 10719 11529 4811 -541 -3661 5259 7764 2091
11024B091Q79N33L995M431O860k688o571N626L936m097k206n365L020K79m712
$$ 2091 2970 3503 7498 11929 18789 16101 9530 15156 19092 14995 12789 7424 10444 10723 6011
11009F011O690j897p225O182Q653o591K399K643j21p111o948j132L1k580J980
$$ 6011 12701 10804 3579 9761 18414 11823 14222 16865 16744 9633 2685 1553 1584 -996 984
10994I84n217K525L475N33P973k92j539M682n966p613Q627K897M703j747q110
$$ 984 -4233 -1708 1767 2300 10273 9981 8442 13124 7158 -455 8172 11069 15772 14025 5915
10979E915j0023j2509K421Q745j778O680O290j0658K03K097O25P922o967m973
$$ 5915 -4108 -16617 -14196 -5451 -7229 -549 5741 -4917 -4714 -2617 -1992 5930 -1037 -6010
10965f010L935Q714l768n920k668P717m18j891L718J13Q769P417m285p692l80
$$ -6010 -2075 6639 2871 -3049 -5717 2000 1582 -309 3409 3522 12291 19708 15423 7731 7351
10950G351j657j1277K545O527j937N463q205m999j760Q127R308M49P664P757j6229
$$ 7351 5694 -5583 -3038 3489 1552 7015 -1190 -6189 -7949 178 9486 9935 17599 25356 9127
10935I127p121l11Q509K889j1798j0687j495N006N270k023L009O109K233M36J579
$$ 9127 2006 1695 10204 13093 1295 -9392 -10887 -5881 -611 -2634 375 6484 8717 9153 10732
10920A0732l089j974K588k504k989j1673J255j269N471p963l344O325K665l815
$$ 10732 7643 5669 8257 5753 2764 -8909 -7654 -8923 -3452 -11415 -14759 -8434 -5769 -9584
10906i584M715O168M955N816M702r570J517L214O532o363q124o514O635K801q29
$$ -9584 -4869 1299 6254 12070 16772 7202 8719 11933 18465 12102 3978 -2536 4099 6900 6071
10891F071M769J972k043k784M661j0246n568P832Q566N114q364l733M95j987j574
$$ 6071 10840 12812 10769 7985 12646 2400 -3168 4664 13230 18344 9980 6247 6742 4755 3181
10876C181L627O834n114m243l488J2195Q140j1472j3014l080r39r757N033J3884
$$ 3181 6808 13642 8528 4285 797 12992 21132 9660 -3354 -6434 -7373 -17130 -12097 1787
10862A787M754o396L764l031M671M804J311o83P618J7968O57j6533j6597J588
$$ 1787 6541 145 3909 878 5549 10353 11664 10981 18599 36567 37224 20691 4094 5682
10848E682N402r17L572K185L260j924N246P521J1476P79J273j323R757L33n004
$$ 5682 11084 10167 13739 15924 19184 17260 22506 30027 41503 42282 43555 42232 51989 52322 47318
10833D7318L681J0711J1755J9816Q595K2004M7479N3045O9707J19598J98115L07282
$$ 47318 50999 61710 73465 93281 101876 123880 171359 224404 294111 413709 611824 919106
10821I19106M23046M29078J30694l23934m96832l80313k21405j30326r3459n8863
$$ 919106 1342152 1771230 1901924 1577990 1081158 700845 479440 349114 255655 196792
10811A96792l4042k8145k1934j5387j7938q411K663K052j4951j1990o253l535
$$ 196792 162750 134605 112671 97284 79346 70935 73598 75650 60699 48709 42456 38921
10799C8921j482j520p744m607K058p912J370j011R034J2962J012j1543k2251k947
$$ 38921 37439 35919 28175 23568 25626 17714 19084 18073 27107 40069 41081 29538 7287 4340
10785D340j566N375Q548n6j2712n101P869m673n425J2131J176j325q03J937M803
$$ 4340 2774 8149 16697 16641 3929 -1172 6697 2024 -3401 8730 9906 8581 7778 9715 14518
10770A4518J785j379R22N572L581r298j3060K014R340L163N957q280l544O726
$$ 14518 16303 14924 15846 21418 24999 15701 2641 4655 13995 17158 23115 14835 11291 18017
10756A8017J415j4058m189M681L42l736K471N34j3131J160J3916L966k542j617
$$ 18017 19432 5374 1185 5866 6208 2472 4943 5477 -7654 -6494 7422 11388 8846 7229
10742G229j78K732Q987N532K317M700K270l105K435N029j5297j5196p660o847
$$ 7229 7051 9783 18770 24302 26619 31319 33589 30484 32919 37948 22651 7455 -205 -7052
10728g052J0111J6341M582M482j3227j2375J040j9951j5981K519M893L729p035
$$ -7052 3059 19400 23982 28464 15237 2862 3902 -16049 -32030 -29511 -24618 -20889 -27924
10715b7924J3918R322K1916P269m72k323P89j0162q536N234J0113M691j1979m534
$$ -27924 -14006 -4684 17232 24501 24029 21706 22495 12333 3797 9031 19144 23835 11856 7322
10701G322O386Q160L144L640N447J32K281M202n811K162N533l562l413j2601j0261
$$ 7322 13708 21868 25012 28652 34099 34231 36512 40714 34903 37065 42598 39036 35623 23022 12761
10686A2761M199M045J710K219J395p54N512l351J111l193l233k887Q5Q367J3912
$$ 12761 16960 21005 22715 24934 26329 25575 31087 27736 28847 25654 22421 19534 19619 27986 41898
10671D1898J5044J0694K601J3060K4743K6696J6822J94j340M853J7222m05j7685
$$ 41898 56942 67636 70237 83297 108040 134736 151558 151752 150412 155265 172487 172082 154397
10658A54397k4201k6314j8865k2585j1552P337q452j015J2011R205Q561L922L527
$$ 154397 130196 103882 85017 62432 50880 58217 49765 48750 60761 69966 78527 82449 85976
10645H5976j4868j5538j1360l325k858K195J875J4459J8082p58j0440l013J0037
$$ 85976 71108 55570 44210 40885 38027 40222 42097 56556 74638 73880 63440 60427 70464
10632G0464K792o569q544O278N139N187M670K23m594n96P151o667p087j842j2442
$$ 70464 73256 66687 58143 64421 69560 74747 79417 79640 75046 74450 81601 74934 67847 66005 53563
10617E3563q167r882J2173Q425K705J2652Q460j0743j7318j4054j5068k4053m908
$$ 53563 45396 35514 47687 56112 58817 71469 79929 69186 51868 37814 22746 -1307 -6215
10604f215J0205P442M381J431p487j4101p005J5500K1257J7654J3237R286O809
$$ -6215 3990 11432 15813 17244 9757 -4344 -11349 4151 25408 43062 56299 65585 72394
10591G2394N562N531J5092k42j8453j4731n782M512N566n213o15j2803q495L800
$$ 72394 77956 83487 98579 98337 79884 65153 59371 63883 69449 64236 63621 50818 42323 46123
10577D6123K006P88M550Q512k806J2108L6698K9878K1320L1764K0130K125j2514
$$ 46123 48129 48917 53467 61979 59173 71281 107979 137857 159177 190941 211071 213196 200682
10564B00682m5295m4388k1144j6394m503p017p548j725L324q18O304J2827L02
$$ 200682 155387 110999 89855 73461 68958 61941 54393 52668 55992 55174 61478 74305 74607
10551G4607o357J792R775Q252J6456L207k1081p685p638J7816M0450N1635J6622
$$ 74607 68250 70042 79817 88069 104525 107732 86651 78966 71328 89144 129594 181229 197851
10538A97851k0686l6949l8616l8415q232L83J294J864P447K1438J6645O844O620
$$ 197851 177165 140216 101600 63185 54953 55336 56630 58494 65941 87379 104024 110868 117488
10525A17488K932j7020n525N20k930L209J382R978J2992R885J0966K404r735q420
$$ 117488 120420 103400 97875 98395 95465 98674 100056 110034 123026 132911 143877 146281 136546 128126
10511A28126r774P151J6336Q85Q753J1096o5r846j2567j3031q188M209N620K237
$$ 128126 118352 125503 141839 142724 151477 162573 162508 152662 140095 127064 118876 123085 128705 130942
10497A30942n327N420K3267K9311K4040J3086L235N870J4768K8619J4970N436
$$ 130942 125615 131035 154302 183613 207653 220739 223974 229844 244612 273231 288201 293637
10485B93637n605K408l378j2637j977J83P8P634K030M429J7189L7006K1326K2807
$$ 293637 288032 290440 287062 274425 272448 272631 272709 280343 282373 286802 303991 340997 362323 385130
10471C85130L1426J8551Q659R770N176K8175K6264K6780K6300L3649K8973K8905
$$ 385130 416556 435107 443766 453536 458712 486887 513151 539931 566231 599880 628853 657758
10459F57758L3914M5459L3562K7167L4874K1753J3601K9862M0527O5076P9299
$$ 657758 691672 737131 770693 797860 832734 854487 868088 897950 938477 1003553 1082852
10448A082852R6932R3667R3229Q3176Q8507J28304J78154K20458K65676L67604
$$ 1082852 1179784 1273451 1366680 1449856 1538363 1666667 1844821 2065279 2330955 2698559
10438B698559N19734O66582P00233L80770o3251j57374L5092K50799M55605O91363
$$ 2698559 3218293 3884875 4585108 4965878 4902627 4745253 4780345 5031144 5486749 6178112
10428F178112R45292J189852J422253J721246K305085L296759M621159O393366
$$ 6178112 7123404 8313256 9735509 11456755 13761840 17058599 21679758 28073124
10420B8073124R274170J4495366K3830996L9441787O1175839Q1301885P5388327
$$ 28073124 37347294 51842660 75673656 115115443 176291282 257593167 332981494
10413C32981494J2421635o7674752r0878136o6460636l9183545k2930300j4346004
$$ 332981494 345403129 277728377 186850241 120389605 81206060 58275760 43929756
10406D3929756r579875o749571n027866l890883l079667k437882j847485j391116
$$ 43929756 34349881 27600310 22572444 18681561 15601894 13164012 11316527 9925411
10398I925411j116255r59333q29015o51752m65974k46458l5805J45999J36009
$$ 9925411 8809156 7849823 7020808 6369056 5903082 5656624 5620819 5766818 5902827
10389E902827k34296n44588m32926p6348K26858K23800k84176p78903p90423n43193
$$ 5902827 5668531 5123943 4691017 4614669 4841527 5065327 4781151 4002248 3211825 2668632
10379B668632l27867k34051j68853j33791j29482j36800j25807j18940r7934p1836
$$ 2668632 2340765 2106714 1937861 1804070 1674588 1537788 1411981 1293041 1195107 1123271
10369A123271o3337m8025l7337l4010m6126m6410l4119k6022k8885l0838l3506
$$ 1123271 1059934 1011909 974572 940562 894436 848026 813907 787885 759000 728162 694656
10358F94656m0606l1307j3806m580M992l070j1951j7769k9083k1235j6859j7588
$$ 694656 654050 622743 608937 604357 609349 606279 594328 576559 547476 526241 509382 491794
10346D91794j6548j3993l3614l9021l4868j7365j1006K073M302Q435P39p591n151
$$ 491794 475246 461253 427639 388618 353750 336385 325379 327452 331754 340189 340928 333337 328186
10333C28186o763k587N576N987K251O934j1403k0696k0847j4297j1746o500J145
$$ 328186 321423 318836 324412 330399 332650 339584 328181 307485 286638 272341 260595 254095 255240
10320B55240J245m122k699j1287p771j6926r400m872j0955P409M252j729R205
$$ 255240 256485 252363 249664 238377 230606 213680 204280 199408 188453 195862 200114 198385 207590
10307B07590L001l873l595j543n423j70k70K804K1461J8266J7854J6143R556k201
$$ 207590 210591 206718 203123 201580 196157 195987 195717 198521 219982 238248 256102 272245 281801 279600
10293B79600J1148J6836N847k02j3868k7108j4481j4432j2015j7248k2613j4453
$$ 279600 290748 307584 313431 313229 299361 272253 257772 243340 231325 214077 191464 177011
10281A77011k459q337r690K562N763o083r490p622l580o18J2440O811N40m604
$$ 177011 174552 166215 156525 159087 164850 158767 149277 141655 138075 137457 149897 156708 157248 152644
10267A52644n313k3973k2960k9224m5039n5865l3941J1091K0360K4351M0647M2213
$$ 152644 147331 123358 100398 71174 26135 -29730 -63671 -52580 -32220 -7869 32778 74991
10255G4991K5213P447j0443j376R79K159J596L314l416j2396j1191j648j652K468
$$ 74991 100204 107651 97208 95832 96811 98970 100566 103880 100464 88068 76877 75229 73577 76045
10241G6045l406j4289q835J037j875k645Q231N302P339K080O987J4280J4790J1245
$$ 76045 72639 58350 49515 50552 48677 46032 54263 59565 66904 68984 75971 90251 105041 116286
10227A16286j1518j4463R866J5437N102J260j6733k5920k7536j1741m268q032
$$ 116286 104768 90305 100171 115608 120710 121970 105237 79317 51781 40040 35772 27740
10215B7740M2K0180O575k379N368r581j3591o780K051R310P56o283K378k145p963
$$ 27740 27782 47962 54537 52158 57526 47945 34354 27574 29625 38935 39691 33408 35786 33641 25678
10200B5678q199k764K1540J8547J2541p164j8877j1637N105L24J5135J0357L460
$$ 25678 17479 14715 36255 54802 67343 60179 41302 29665 34770 35094 50229 60586 64046
10187F4046P98M972k791o868n042j2286k668Q184J6961Q383J0977J0309M035J2188
$$ 64046 64844 69816 67025 60157 55115 42829 40161 48345 65306 73689 84666 94975 99010 111198
10173A11198O043n072r933O101M309O308J85l430n322J740O951J1684R064O687
$$ 111198 117241 112169 102236 108337 112646 118954 119139 115709 110387 112127 119078 130762 139826 146513
10159A46513L956N482K0754J8992J0016J0716K3836K7502K7051K7259L4717N2691
$$ 146513 150469 155951 176705 195697 205713 216429 240265 267767 294818 322077 356794 409485
10147D09485O9422P1869R0436J02391J30543J54604J67421J97693J94316J54400
$$ 409485 478907 550776 641212 743603 874146 1028750 1196171 1393864 1588180 1742580
10137A742580R2106K076p8042j36531j82913j98322j85887j55940j23336j03448
$$ 1742580 1834686 1836762 1758720 1622189 1439276 1240954 1055067 899127 775791 672343
10127F72343q7249p8827o3675o0286m6606m8427k8753j5659j1421k3225k2568
$$ 672343 585094 506267 442592 382306 335700 287273 258520 242861 231440 208215 185647
10116A85647j4134Q82j182j0511m667Q11J584o737p966l816o702j6483j4540m299
$$ 185647 171513 172395 171213 160702 156035 156846 158430 151693 143727 139911 133209 116726 102186 97887
10102I7887j0081j3966m353M293L456k31r767r040J131O442J006l814n458L350
$$ 97887 87806 73840 69487 73780 77236 77005 67238 58198 59329 65771 66777 62963 57505 60855
10088F0855O776j821j866q373j1997M23L909P857J116m639N778j177p660M822
$$ 60855 67631 65810 63944 55571 43574 43997 47906 55763 56879 52240 58018 56841 49181 54003
10074E4003m55l855K841o472k493p73j236m525p688k0149P922J1785q09l659Q349
$$ 54003 53548 49693 52534 46062 43569 42796 41560 37035 29347 9198 17120 28905 28096 24437 32786
10059C2786k93p20J749M571J0035l63r247o423m2N413j669q593k358P507o69p531
$$ 32786 32493 31773 33522 38093 48128 47765 38518 32095 32053 37466 35797 27204 24846 32353 31684 24153
10043B4153n45j0156k297M884M743J685j231J018O660k371q098K084K475O904
$$ 24153 23608 13452 11155 16039 20782 22467 21236 22254 28914 26543 18445 20529 23004 29908
10029B9908R132K621N941J895J699R040M177j4336N312P401J6846o65m291K900
$$ 29908 39040 41661 47602 49497 51196 60236 64413 50077 55389 62790 79636 78971 74680 77580
10015G7580K846M883J2625J4268K7929L3922M8690O5066J01365J73863K70571
$$ 77580 80426 85309 97934 112202 140131 174053 222743 287809 389174 563037 833608
10004H33608L94341M39722K35504k04101m66302m15142k80322j68648r7203o0555
$$ 833608 1227949 1667671 1903175 1699074 1232772 817630 537308 368660 271457 210902
9994B10902l6590l2581k1312j9650n765m224r344q859p927j1168n047O871p86
$$ 210902 174312 141731 120419 100769 95004 90780 81436 72577 64650 53482 48435 55306 54520
9981E4520o123J244J882l382l163n633m017N447P115r749J990M285l632p177j113
$$ 54520 48397 49641 51523 48141 44978 39345 35328 40775 47890 38141 40131 44416 40784 33607 32494
9966C2494K539j078m76O679K64J898m741n966k611l93R59J744l390r88l633o778
$$ 32494 35033 33955 33479 40158 40422 42320 37579 31613 29002 28609 29568 31312 27922 26934 23301 16523
9950A6523q601k828K911n9l901l266n49J5158M750p8q61j6189j088N420L552N188
$$ 16523 7922 5094 8005 7946 4045 779 230 15388 20138 20060 19199 3010 1922 7342 10894 16082
9934A6082N811k71n500m221p946l108k459k406J569j028K921O15J410J627O181
$$ 16082 21893 21622 16122 11901 3955 847 -1612 -4018 -2449 -3477 -556 59 1469 3096 9277
9919I277N493N30j426r126L803j166j0753P416N137J396P271N206j386L733j3478
$$ 9277 14770 15300 13874 4748 8551 7385 -3368 4048 9185 10581 17852 23058 21672 25405 11927
9904A1927j1920J1304j715M280l361K232J0654m177j3430o146M780J2038K014
$$ 11927 7 11311 9596 13876 10515 12747 23401 19224 5794 -352 4428 16466 18480
9891A8480n109m51K114Q780q922q817p773L161k454O602P310K365Q00m631o560
$$ 18480 13371 12920 15034 23814 14892 6075 -1698 1463 -991 5611 12921 15286 16086 11455 4895
9876D895L705M713o745r047J1541R889j917K63j645K467M455j24q076m727k439
$$ 4895 8600 13313 6568 -2479 9062 18951 17034 17297 15652 18119 22574 22450 14374 9647 7208
9861G208M81O689N149J527q99N105o919m254K14K736O937L031q472l931K687K111
$$ 7208 7689 14378 19527 21054 20155 25260 18341 14087 14301 17037 23974 27005 18533 14602 17289 19400
9845A9400Q631L135r34o786l603o34M252l418p249r91J0267P417Q33Q957P538
$$ 19400 28031 31166 30232 23446 19843 19209 23461 20043 12794 11803 22070 29487 30320 39277 46815
9830D6815j2535P047P432J154J4051J3370J1892K3966M8641R9155J56340K52581
$$ 46815 34280 41327 48759 49913 63964 77334 89226 113192 161833 260988 417328 669909
9818F69909L32003K56113j6003k92959l49326k35569j36084o7603l7524k5877
$$ 669909 1001912 1258025 1242022 949063 599737 364168 228084 160481 122957 97080
9808I7080j8701j4355r881j1380n149n306r093l074j651R940L395m937N354N958
$$ 97080 78379 64024 54143 42763 37614 32308 23215 20141 18490 28430 31825 26888 32242 38200
9794C8200k392o545o871J530k759m580p47k197o95o163K282N139n124j693M559
$$ 38200 35808 29263 22392 23922 21163 16583 15836 13639 12944 6781 9063 14202 9078 7385 11944
9779A1944p564m343O264L788k63K798L856n465j3311r623j221K959l392j273O337
$$ 11944 4380 37 6301 10089 9826 12624 16480 11015 -2296 -11919 -13140 -10181 -13573 -14846 -8509
9764h509M074Q992J0739L943M20j1824n98r238Q248K918m512n491N162N815J446
$$ -8509 -4435 4557 15296 19239 19659 7835 7237 -2001 6247 9165 4653 -838 4324 10139 11585
9749A1585l047K777J740j979n436n180L024n618J497L643n48l043J173Q5L985
$$ 11585 8538 11315 13055 11076 5640 460 3484 -2134 -637 3006 2458 -585 588 673 4658
9734D658Q974n405p806N99k90P271n075q109O50m037K881N726R783k821k647n42
$$ 4658 13632 8227 421 1020 730 8001 2926 -5183 -4533 -8570 -5689 37 9820 6999 4352 3810
9718C810Q294N199J426m624j0387L972q407m712R048m735m697k061l885J615M288
$$ 3810 12104 17303 18729 14105 3718 7690 -717 -5429 3619 -1116 -5813 -7874 -11759 -10144 -5856
9703e856Q286K055m904K806N863L059l098r16K533j61k942l780l118P728K936
$$ -5856 2430 4485 -419 2387 8250 11309 8211 7295 9828 9667 6725 2945 -173 7555 10491
9688A0491L788q336L80p481m142o91k645r182N03J744P707J1134k62O992n93n569
$$ 10491 14279 5943 6323 -1158 -5300 -5991 -8636 -17818 -17315 -15571 -7864 3270 3008 10000 9407 3838
9672C838j543M557p06m485o606m120M884M443M376m75J280M927P325P770J655
$$ 3838 2295 6852 6146 1661 -4945 -9065 -4181 262 4638 4163 5443 10370 17695 25465 27120
9657B7120L3r737p985q02R105L975l271q344o138J192q994j113N190N848Q368
$$ 27120 27153 17416 9431 8629 17734 21709 18438 10094 3956 5148 -3846 -4959 231 6079 14447
9642A4447o403l12K471j3960j4316L895J0372M786P548M959o282j680K822k618
$$ 14447 8044 7732 10203 -3757 -18073 -14178 -3806 980 8528 13487 7205 5525 8347 5729
9628E729j1855m310J6707L976p141q047J43k191r99q357k431J3763J0355l673
$$ 5729 -6126 -10436 6271 10247 3106 -4941 -4798 -6989 -7988 -16345 -18776 -5013 5342 1669
9614A669q3L099P74L08j0988o917J2157k52j5857q15R104R261j806k061J335K355
$$ 1669 1586 4685 5459 5767 -5221 -12138 19 -233 -16090 -16905 -7801 1460 -346 -2407 -1072 1283
9598A283R141N889q580N43o855j3064j1034k972J1147P688L335N84Q38J213Q310
$$ 1283 10424 16313 7733 8276 1421 -11643 -22677 -25649 -14502 -6814 -3479 -2895 -2057 -844 7466
9583G466n07m492L707l436J088l941Q507o103j1569J711R136n772n658P553P425
$$ 7466 6959 2467 6174 2738 3826 -115 8392 2289 -9280 -7569 1567 -4205 -9863 -2310 5115
9568E115p27J692j067L778o56n806P46q418k854J0475K607J553J664m837K465
$$ 5115 4388 6080 5013 8791 8135 2329 3075 -5343 -8197 2278 4885 6438 8102 3265 5730
9553E730j419q964k280Q774O444l580q772K147L245O123L893o722p405P211J596
$$ 5730 4311 -4653 -6933 1841 8285 4705 -4067 -1920 1325 7448 11341 4619 -2786 4425 6021
9538F021j0005j33P995k6Q438q4o835j0039K684P837N114r073j0638J7367J3041
$$ 6021 -3984 -4117 3878 3852 12290 12206 5371 -4668 -1984 5853 10967 1894 -8744 8623 21664
9523B1664o133q331O607R22n782m032p722l313L648J457K229n671l067M586J1687
$$ 21664 15531 7200 13807 14729 8947 4915 -2807 -6120 -2472 -1015 1214 -4457 -7524 -2938 8749
9508H749R654J187k652o9m411r035j360n275L206L862k003O310M883J463o717
$$ 8749 18403 19590 16938 16869 12458 3423 2063 -3212 -6 3856 1853 8163 13046 14509 7792
9493G792n040K90L443Q48M309j693l092Q789o492j1652J399j569L206l582K584
$$ 7792 2752 3042 6485 7333 11642 9949 6857 15646 9154 -2498 -1099 -2668 538 -3044 -460
9478d60m366N87l299n744K64l146j527J487J555L5j0123P512J0657N345O047K122
$$ -460 -4826 -4239 -7538 -13282 -13018 -16164 -17691 -16204 -14649 -14614 -24737 -17225 -6568 -1223 4824 6946
9462F946m378M823K25k363q438k561N258J67J742j951j1359k94M508K948K456
$$ 6946 2568 7391 7616 5253 -3185 -5746 -488 -321 1421 -530 -11889 -12183 -7675 -4727 -2271
9447b271j3j4382j390J1613P150P67P0m363J220P813k14l807o949r890L646P614
$$ -2271 -2284 -16666 -18056 -6443 707 1474 1544 -2819 -1599 6214 6000 2193 -4756 -14646 -11000 -3386
9431c386L112N742L517K237L938J663n839k202J294r31J28m705k136j1876K093
$$ -3386 -274 5468 8985 11222 15160 16823 10984 8782 10076 9145 9273 4568 2432 -9444 -7351
9416g351l707K811o880q866K835P263m372O31K505J969M918M596p47m829L522
$$ -7351 -11058 -8247 -15127 -23993 -21158 -13895 -18267 -17636 -15131 -13162 -8244 -3648 -4395 -9224 -5702
9401e702L958l027O196O233O84k719p130k522Q462L860o612P581n016J079O962
$$ -5702 -1744 -4771 1425 7658 8342 5623 -1507 -4029 4433 8293 1681 9262 4246 5325 12287
9386A2287j063k248j913l032j0107j3963R12O22J280J4343K482K461R74j48k300
$$ 12287 11224 8976 7063 4031 -6076 -20039 -19127 -18505 -17225 -2882 -400 2061 3035 2887 587
9371E87j0731K638R644M931j2785j250l469J986M067n92O935l905j451J1757o167
$$ 587 -10144 -7506 2138 7069 -5716 -6966 -10435 -8449 -4382 -4974 1961 -1944 -3395 8362 2195
9356B195j0266P435k086L928k966j163K322q63o557m963M09k590Q308N334k509
$$ 2195 -8071 -636 -2722 1206 -1760 -2923 -601 -1464 -8021 -12984 -12575 -15165 -6857 -1523 -4032
9341d032o176j066P2J710l647j1141J1704J0212n929k051M227K490O928k207K822
$$ -4032 -10208 -11274 -11202 -9492 -13139 -24280 -12576 -2364 -8293 -10344 -6117 -3627 3301 1094 3916
9326C916J308M525k139q705n362M273K527n607N104r38o366o985O128K242k971
$$ 3916 5224 9749 7610 -1095 -6457 -2184 343 -5264 -160 -1098 -7464 -14449 -8321 -6079 -9050
9311i050N36L026k051k426R062J498M739j725k463r218j3307L305J2124O094n414
$$ -9050 -8514 -5488 -7539 -9965 -903 595 5334 3609 1146 -8072 -21379 -18074 -5950 144 -5270
9296e270m486K541M026N988R611k438m615R519j754m769n163o521J36K090O642
$$ -5270 -9756 -7215 -3189 2799 12410 9972 5357 14876 13122 8353 3190 -3331 -3195 -1105 5537
9281E537N952r538j2617J093R984K312o76O221j355N93q703r759P50J5602R509
$$ 5537 11489 1951 -10666 -9573 411 2723 2047 8268 6913 7506 -1197 -10956 -10206 5396 14905
9266A4905l310r83R34n561k664J710J13O383J780o894j090n444N65q306n996J6256
$$ 14905 11595 10612 11546 5985 3321 5031 5144 11527 13307 6413 5323 -121 444 -7862 -13858 2398
9250B398m15k083R425j61m476n153j398K605J431n931n127L863J5186J3430n578
$$ 2398 1983 -100 9325 9164 4688 -465 -1863 742 2173 -3758 -8885 -5022 10164 23594 18016
9235A8016o33J048p096m76M44R47j894k199l435n494m779n094N069L471N783k528
$$ 18016 17383 18431 11335 10859 11303 12250 10356 8157 4722 -772 -5551 -10645 -5576 -2105 3678 1150
9219A150r42l674j25J458M100R022K755p849N928J665p880j301j184L757q01n914
$$ 1150 208 -3466 -3591 -2133 1967 10989 13744 5895 11823 13488 5608 4307 3123 6880 6079 165
9203A65j0178o915N703K805l008N19N544J191k116J540M47k780L42N663Q545p287
$$ 165 -10013 -16928 -11225 -8420 -11428 -10909 -5365 -4174 -6290 -4750 -4303 -7083 -6741 -1078 7467 180
9187A80n033N322j66J95j912L42k066q02M435K268M159L010m959j478q978n608
$$ 180 -4853 469 303 498 -1414 -1072 -3138 -3940 495 2763 6922 9932 4973 3495 -5483 -11091
9171a1091J602m008J045J008L872M736j213P128O926m813L517j061j7M390J39
$$ -11091 -9489 -13497 -12452 -11444 -7572 -2836 -4049 3079 10005 5192 8709 7648 7631 12021 12160
9156A2160J170M561l4p050N205K769l807o280q392n812O459K087P356k156K516
$$ 12160 13330 17891 17857 10807 16012 18781 14974 8694 302 -5510 949 3036 10392 8236 10752
9141A0752k641k170k89m566O095j089k755n119l060r306k797o54K334J383R893
$$ 10752 8111 5941 5652 1086 7181 6092 3337 -1782 -4842 -14148 -16945 -17599 -15265 -13882 -3989
9126c989r146k202l021o798P7L446J8552N362J770m956j47j0429k883L767M20
$$ -3989 -13135 -15337 -18358 -25156 -25079 -21633 -3081 2281 4051 -905 -1052 -11481 -14364 -10597 -10177
9111a0177o104P819L539k269O687M425L710M634o940r565Q096j143J888r79j761
$$ -10177 -16281 -8462 -4923 -7192 -505 3920 7630 12264 5324 -4241 3855 2712 4600 3621 1860
9096A860j492j914L963m428n703k383J0034J265k979l152K820M144k558l060m363
$$ 1860 368 -1546 2417 -2011 -7714 -10097 -63 1202 -1777 -4929 -2109 2035 -523 -3583 -7946
9081g946j567Q494J177M586J010j240O233N89o882j1838q333m90M932Q46r7l828
$$ -7946 -9513 -1019 158 4744 5754 4514 10747 11336 4454 -7384 -15717 -16207 -11275 -10429 -10526 -14354
9065a4354J2596L927L230K491l324k840L705j268o484M062M210m902j6591m217
$$ -14354 -1758 2169 5399 7890 4566 1726 5431 4163 -2321 1741 5951 1049 -15542 -19759
9051a9759K897p048J3380J8229R13k863n271l867k397k715p51l81M399o325l538
$$ -19759 -16862 -23910 -10530 7699 8612 5749 478 -3389 -5786 -8501 -9252 -9633 -5234 -11559 -15097
9036a5097N972j597J2098k035j776K420M459m66l1o489m423j1747m228J03N540
$$ -15097 -9125 -10722 1376 -659 -2435 -15 4444 3978 3947 -2542 -6965 -18712 -22940 -22837 -17297
9021a7297J2974O017j435r808M173J341R882J046N293M093j5633j2635N058R660
$$ -17297 -4323 1694 259 -9549 -5376 -4035 5847 6893 12186 16279 646 -11989 -6931 2729
9007B729R280L56q328n219O9q32j2157O729O597M630l231p240k39q48J20j126
$$ 2729 12009 12365 4037 -1182 -1113 -1945 -14102 -7373 -776 3854 623 -6617 -6856 -7704 -7584 -8710
8991h710J878J67Q128O597o860l690m18n804k821r231M942R92K615N657L212R11
$$ -8710 -6832 -6665 1463 8060 1200 -2490 -2908 -8712 -11533 -20764 -15822 -14830 -12215 -6558 -3346 -2435
8975b435l400q513k128M990J3958J2465k708M72j5626N229P544n633o091K900
$$ -2435 -5835 -14348 -16476 -11486 2472 14937 12229 12701 -2925 2304 9848 4215 -1876 1024
8961A024K831j386j249k538K124M867m502j2569L486L504j799j831l830Q523J176
$$ 1024 3855 2469 1220 -1318 806 5673 1171 -11398 -7912 -4408 -6207 -8038 -11868 -3345 -2169
8946b169J198L673J0469j436L63P73o284j1475L241L177l644j339m338L242J946
$$ -2169 -971 2702 13171 11735 12098 12871 6587 -4888 -1647 1530 -2114 -3453 -7791 -4549 -2603
8931b603m84j0734o720R370J0919O28L434n879o043o65j8K005P075n201l06n871
$$ -2603 -3087 -13821 -20541 -11171 -252 376 3810 -2069 -8112 -8777 -8795 -6790 285 -4916 -5222 -11093
8915a1093l97O794M928j941l909m898j535L824M609J118n42n25o429M174P21P356
$$ -11093 -11490 -4696 232 -1709 -5618 -10516 -12051 -8227 -3618 -2500 -3042 -3567 -9996 -5822 -5101 2255
8899B255R355k977M07r611j1402l345J1776O822q88N579l393k012l615q53o871
$$ 2255 11610 8633 9040 -571 -11973 -15318 -3542 3280 2392 7971 4578 2566 -1049 -1902 -8773
8884h773m418J569r658k62n32N199P864J280q19r183k667O696K610J1887J584
$$ -8773 -13191 -11622 -21280 -21542 -22074 -16875 -9011 -7731 -8550 -17733 -20400 -13704 -11094 793 2377
8869B377J0807M482l070l810p85n66r906q401K107Q320M661m527J984j1871r444
$$ 2377 13184 17666 14596 10786 10001 9435 -471 -8872 -6765 1555 6216 1689 3673 -8198 -17642
8854a7642M954M746j878J590L741L42p396J883O75m546R358k055N331l744l846
$$ -17642 -12688 -7942 -9820 -8230 -4489 -4147 -11543 -9660 -8985 -13531 -4173 -6228 -897 -4641 -8487
8839h487L355o155P575k76n008k538M066P685J0208n306k362M938M381n829o752
$$ -8487 -5132 -11287 -3712 -3988 -8996 -11534 -7468 217 10425 5119 2757 7695 12076 6247 -505
8824e05n431Q131L657m85p622n151J93N368O251M987M139L127J701q758l799j325
$$ -505 -5936 2195 5852 5367 -2255 -7406 -7213 -1845 4406 9393 13532 16659 18360 9602 5803 4478
8808D478j0862K3o376N883L260l663J1085K73n592N801p650m096o642K358M047
$$ 4478 -6384 -6361 -12737 -6854 -3594 -7257 3828 4101 -1491 4310 -3340 -7436 -14078 -11720 -7673
8793g673R382N375n09j393k031K775n372Q071N999J684p556o350j214M800P27
$$ -7673 1709 7084 6575 5182 3151 5926 554 8625 14624 16308 8752 2402 1188 5988 6715
8778F715k76l78J518r55q892J830Q960q60K320j360m487o666L262M624N598K008
$$ 6715 6439 6061 7579 6624 -2268 -438 8522 7662 9982 8622 4135 -2531 731 5355 10953 12961
8762A2961m304J296j440l009L669j027q514Q79J530L985j1300q96M088L555m106
$$ 12961 8657 9953 8513 5504 9173 8146 -368 511 2041 6026 -5274 -6170 -2082 1473 -2633
8747b633J2129K008j2076J247K817L244n490K854j597n395p260K380J0203K920
$$ -2633 9496 11504 -572 675 3492 6736 1246 4100 2503 -2892 -10152 -7772 2431 5351
8733E351J962k139l94J723j228K081O385j67k714o719K560R776R542o877r705
$$ 5351 7313 5174 4780 6503 5275 7356 13741 13574 10860 4141 6701 16477 26019 19142 9437
8718I437m704j2519J201J3909O595j3432P253J3778k655j3147p122L518L314j212
$$ 9437 4733 -7786 -6585 7324 13919 487 7740 21518 18863 5716 -1406 2112 5426 4214
8704D214n483J501k875O259K411K516k390l633q620l598M430P586J5232J0887
$$ 4214 -1269 232 -2643 3616 6027 8543 6153 2520 -6100 -9698 -5268 2318 17550 28437
8690B8437j3242q127o102q787l181j23P546J0987K629L46N976M302k358j0641
$$ 28437 15195 7068 966 -7821 -11002 -11125 -3579 7408 10037 10383 16359 20661 18303 7662
8676G662n318J625p82o61M882L511m154n008j915j334P489Q747k967k753k761
$$ 7662 2344 3969 3187 2526 7408 10919 6765 1757 -158 -1492 5997 14744 11777 9024 6263
8661F263n828M52O927M620J479j4432j1977J805J0593L588k443p50M654L37k828
$$ 6263 435 887 7814 12434 13913 -519 -12496 -10691 -98 3490 1047 297 4951 5288 2460
8646B460m06M524n410m962k970O63N40R930R619N900j634j1590l637R473r59l483
$$ 2460 2054 6578 1168 -3794 -6764 -6101 -5561 4369 13988 19888 18254 6664 3027 12500 11541 8058
8630H058p489p809M602N740O809k631M263J6707K4846K5164M6075Q2396R0385
$$ 8058 569 -7240 -2638 3102 9911 7280 11543 28250 53096 78260 124335 206731 297116
8617B97116O2302l4500r8981p7600m9932l0352j4779j3890k737J796q606k803
$$ 297116 359418 324918 225937 148337 98405 68053 53274 39384 36647 38443 29837 27034
8605B7034J37R563R22m363j3156r61L162L285n533l893l680N414P742k472O62
$$ 27034 27171 36734 37656 33293 20137 19176 22338 25623 20090 16197 12517 17931 25673 23201 23863
8590B3863P87K173J538L492l951K152J672O324M595l589J030J8846J4849K5537
$$ 23863 24650 26823 28361 31853 27902 30054 31726 38050 42645 39056 40086 58932 73781 99318
8576I9318L9431O7596J13341J69217J79257j4243k00282j76582r6370n0396l2032
$$ 99318 138749 206345 319686 488903 668160 653917 453635 277053 180683 130287 98255
8565I8255k6411j6214m800j0408j217M861L89j116o417N636j2354j0163n013N770
$$ 98255 71844 55630 50830 40422 39205 44066 44455 43339 36922 42558 30204 20041 15028 20798
8551B0798K325j1325J410m164n946m638J529O625R365K601j3014K221J2661M14
$$ 20798 23123 11798 13208 9044 3098 -1540 -11 6614 15979 18580 5566 7787 20448 20862
8537B0862J555r596N008J0975O375O565J9866L2630N5563P3526Q1297K6025r0671
$$ 20862 22417 12821 17829 28804 35179 41744 61610 94240 149803 223329 304626 330651 239980
8524B39980j00623m9574k5798j6063j5601p8m240r407L964N447n115o364K68Q60
$$ 239980 139357 89783 63985 47922 32321 32243 28003 18596 22560 28007 22892 16528 16796 17656
8510A7656j103j6202r71R52k417k323R270l59M457q830J45Q86K818J655o767p169
$$ 17656 16553 351 -620 332 -2085 -4408 4862 4503 8960 130 275 1161 3979 5634 -1133 -8302
8494h302n960n253J4017N927K592J5371j446j1460j6349q629N791k923j2P342
$$ -8302 -14262 -19515 -5498 429 3021 18392 16946 5486 -10863 -19492 -13701 -16624 -16636 -9294
8480i294Q365Q914L91n976k842p570l528J0625O095n897o655K590L711J739q78
$$ -9294 -929 7985 8376 2400 -442 -8012 -11540 -915 5180 -717 -7372 -4782 -1071 668 -210
8465b10L54L705L76m149k556J0876L609j0312m031L271j580L401J718o427p136
$$ -210 144 3849 4225 76 -2480 8396 12005 1693 -2338 933 -647 2754 4472 -1955 -9091
8450i091m235M463R111k83J655o670P620M942n598k879o206l90P187J489R063
$$ -9091 -13326 -8863 248 -35 1620 -5050 2570 7512 1914 -965 -7171 -7561 -374 1115 10178
8435A0178K273p375j1922L78O288m56j082k779l451N596J4368K525j2919l810
$$ 10178 12451 5076 -6846 -6468 -180 -636 -1718 -4497 -7948 -2352 12016 14541 1622 -2188
8421b188n302N744J254o763J0221l693p517q677J985l335O112Q757J067J1779
$$ -2188 -7490 -1746 -492 -7255 2966 -727 -8244 -16921 -14936 -18271 -12159 -3402 -2335 9444
8407I444P679o139k492p280J113N396j151r96J0372l707k863K26L510j076p021
$$ 9444 17123 10984 8492 1212 2325 7721 6570 5574 15946 12239 9376 9602 13112 12036 5015
8392E015p66Q965l031o836m487n737k545o456N315Q153J1947j897j2377J190L204
$$ 5015 4249 13214 10183 3347 -1140 -6877 -9422 -15878 -10563 -2410 9537 7640 -4737 -3547 -343
8377c43M11l990N727J996L931O87k144K996l01Q996p631n007K175m497j3943k31
$$ -343 68 -3922 1805 3801 7732 8419 6275 9271 8970 17966 10335 5328 7503 3006 -10937 -11168
8361a1168o02J3074N171j367o69J102l919l868m975O746j630o305L053J038P012
$$ -11168 -11770 1304 6475 5108 4439 5541 1622 -2246 -7221 -475 -2105 -8410 -5357 -4319 2693
8346B693Q819o360j2337o032M805N455k551m116M954L619j967q278O656R267J712
$$ 2693 11512 5152 -7185 -13217 -8412 -2957 -5508 -9624 -4670 -1051 -3018 -11296 -4640 4627 6339
8331F339j246m021o393K775K866L512P137n956r312n559M35J1469P484j574P715
$$ 6339 5093 1072 -5321 -2546 320 3832 10969 5013 -4299 -9858 -9423 2046 9530 7956 15671
8316A5671n682j2643j1024p51L384J5030L397J216j1644p963m282N351r703j0391
$$ 15671 9989 -2654 -13678 -14429 -11045 3985 7382 8598 -3046 -11009 -15291 -9940 -19643 -30034
8302c0034j553Q165R573q99j071K716m26k62J0121J2454M34L109K540p317r46
$$ -30034 -31587 -23422 -13849 -14748 -15819 -13103 -13529 -13791 -3670 8784 9218 12327 14867 7550 6604
8287F604N721m100l479R050o5j1932o314K706k081o764M512O008R399N80m981
$$ 6604 12325 8225 4746 13796 13731 1799 -4515 -1809 -3890 -10654 -6142 -134 9265 9845 4864
8272D864J053M237L97k859j5043k060O413Q874M840M95l731N911L82m618r636
$$ 4864 5917 10154 10551 7692 -7351 -9411 -2998 5876 10716 11211 7480 13391 13773 9155 -481
8257d81m412k93J553J509M2M453N7J0428J123q158j487k268o7N078J990l447m878
$$ -481 -4893 -5186 -3633 -2124 -2082 2371 2428 12856 13979 5821 4334 2066 1999 7077 9067 5620 742
8240G42J325k623K87O111q712j166O706O567L343M04j642j147O219R45j2016k429
$$ 742 2067 -556 -269 5842 -2870 -4036 2670 9237 12580 12984 11342 10195 16414 17359 5343 2914
8224B914Q042k509L534l588r743n706r385O170J1843l326m823P558o268J447J1194
$$ 2914 10956 8447 11981 8393 -1350 -7056 -16441 -10271 1572 -1754 -6577 981 -5287 -3840 7354
8209G354k629j992O828J669m341k111r579l486k077J688R310J2428k258l971J461
$$ 7354 4725 2733 9561 11230 6889 4778 -4801 -8287 -10364 -8676 634 13062 10804 6833 8294
8194H294j681j1013l229M740P341L277j171Q739O312o070m113j2774n092j813
$$ 8294 6613 -4400 -7629 -2889 4452 7729 6558 15297 21609 15539 11426 -1348 -6440 -8253
8180h253r10n333M727J3286M245J106n100Q293J0601r233j2395q485o15L760R26
$$ -8253 -9163 -14496 -9769 3517 7762 8868 3768 12061 22662 13429 1034 -7451 -8066 -4306 -3380
8165c380O692K08n665J054J974j356p88o246j085L224l97l238L626R63j142l728
$$ -3380 3312 3520 -2145 -1091 883 -473 -1261 -7507 -8592 -5368 -5765 -9003 -5377 -4414 -5556 -9284
8149i284O876M686j0610K210J633M525J1067n43k671j0221J546J044p116M627
$$ -9284 -2408 2278 -8332 -6122 -4489 36 11103 10560 7889 -2332 -786 258 -6858 -2231
8135b231O388P37q586m80K205o817P930N224P330k404r935O203J13J32j4757K343
$$ -2231 4157 4894 -3692 -4172 -1967 -8784 -854 4370 11700 9296 -639 5564 5677 5809 -8948 -6605
8119f605M353Q745M193L128K927q090q786j830M530m093o259r88P864O952R93
$$ -6605 -2252 6493 10686 13814 16741 8651 -135 -1965 2565 -1528 -7787 -8775 -911 6041 7034
8104G034j303m174K154p91r080p123O358L708N875m978j5657M129L336j0074o240
$$ 7034 5731 1557 3711 2920 -6160 -13283 -6925 -3217 2658 -2320 -17977 -13848 -10512 -20586 -26826
8089b6826R860K742O073R539q296j3928j739J0649P938l948q090K948k066m565
$$ -26826 -16966 -14224 -8151 1388 -6908 -20836 -22575 -11926 -3988 -7936 -16026 -13078 -15144 -19709
8075a9709j545P175m476R432J5159K772r133r191r68k334o429R250O252J154Q430
$$ -19709 -21254 -14079 -18555 -9123 6036 8808 -325 -9516 -10484 -12818 -19247 -9997 -3745 -2591 5839
8060E839K227o645o074m660k137L875J5734n665j0769l972Q653J909k348J3096
$$ 5839 8066 1421 -4653 -9313 -11450 -7575 8159 2494 -8275 -12247 -3594 -1685 -4033 9063
8046I063O702M814p939l741l020m409M902P4o770l868m103j1553P123J41L204
$$ 9063 15765 20579 12640 8899 5879 1470 6372 6446 -324 -4192 -8295 -19848 -12725 -12584 -9380
8031i380O364L547O67l387r268J156P501O424P894n760m468m124m406r59N397
$$ -9380 -3016 531 1198 -2189 -11457 -10301 -2800 3624 11518 5758 1290 -2834 -7240 -8199 -2802
8016b802L944k234K641M498j249o015l633Q726J1342R058O033k499q049j4846
$$ -2802 1142 -1092 1549 6047 4798 -1217 -4850 3876 15218 24276 30309 27810 19761 4915
8002D915k060R099J0616O438p781J17M40j0270j6235o854P151M699o367L430P575
$$ 4915 2855 11954 22570 29008 21227 21344 21784 11514 -4721 -11575 -4424 275 -6092 -2662 4913
7987D913o608l780K845l756j1533k913J4896J5353J76p74M91l334l073M110M288
$$ 4913 -1695 -5475 -2630 -6386 -17919 -20832 -5936 9417 9593 8819 9310 5976 2903 7013 11301
7972A1301R473l32j0224k325l135J512l434m838L669P819Q048l416j846J1660
$$ 11301 20774 20442 10218 7893 4758 6270 2836 -2002 1667 9486 17534 14118 12272 23932
7958B3932J6651P527j4811o199j0787n447n692K535j493k052M920M873m062q815
$$ 23932 40583 48110 33299 27100 16313 10866 5174 7709 6216 4164 9084 13957 9895 1080
7944A080k897q45Q51n70q304M603O993R760M850L25m095N908p242n874J912m17
$$ 1080 -1817 -2662 -1811 -2381 -10685 -6082 911 10671 15521 15846 11751 17659 10417 4543 6455 6038
7928F038p760L983j189J016K759K860j133o16l761M376M788L141K842p307q689
$$ 6038 -1722 2261 1072 2088 4847 7707 6574 5958 2197 6573 11361 14502 17344 10037 1348
7913A348o432l035R910J5060n698m268j1861r54l453O388O229J490l499J222j725
$$ 1348 -5084 -8119 1791 16851 11153 6885 -4976 -5930 -9383 -2995 3234 4724 1225 2447 722
7898G22m46l826Q844l539l122j719n951K948J2311K610k489k975L908N86k914
$$ 722 276 -3550 5294 1755 -1367 -3086 -9037 -6089 6222 8832 6343 3368 7276 7862 4948
7883D948M11O375K439J797p693l846K964m3J1738J1758q213j1312m10M68j3068
$$ 4948 5359 11734 14173 15970 8277 4431 7395 7352 19090 30848 22635 11323 10913 11381 -1687
7868a687p607L436P943k329k122Q122P270K81l118M335R86m330P466m105q271
$$ -1687 -9294 -5858 2085 -244 -2366 5756 13026 13307 10189 14524 15510 11180 18646 14541 6270
7853F270n983K159j158o748j863J1931L098r176k562K47j913r797M884J102n225
$$ 6270 287 2446 1288 -5460 -7323 4608 7706 -1470 -4032 -3785 -5698 -15495 -10611 -9509 -14734
7838a4734j29R413L06K948l22J62p754l211j0002l867J4480J0236M909P469k189
$$ -14734 -14863 -5450 -5144 -2196 -2518 -2356 -10110 -13321 -23323 -27190 -12710 -2474 2435 9904 7715
7823G715J979R707J668m36j0220j638k980o463K772l178K884J187n600n582J072
$$ 7715 9694 19401 21069 20633 10413 8775 5795 -668 2104 -1074 1810 2997 -2603 -8185 -7113
7808g113J87m900J742K256L214l194Q175O409l158k872l225q687K841J811k513
$$ -7113 -6926 -11826 -10084 -7828 -4614 -7808 367 6776 3618 746 -2479 -11166 -8325 -6514 -9027
7793i027K710L262K887K907K803L428L2r713o493k82M222q44L849N23l903k715
$$ -9027 -6317 -3055 -168 2739 5542 8970 9002 -711 -7204 -7486 -3264 -4108 -259 264 -3639 -6354
7777f354O418P697j968j0113p235J650P112M379J340m407m713O031m03k670p765
$$ -6354 64 7761 5793 -4320 -11555 -9905 -2793 1586 2926 -1481 -6194 -163 -566 -3236 -11001
7762a1001J412Q000j040K934j446j826l742k167O470Q806k713r222o203K37J013
$$ -11001 -9589 -1589 -2629 305 -1141 -2967 -6709 -8876 -2406 6400 3687 -5535 -11738 -11501 -10488
7747a0488N896J2960Q729P839m090j3548Q80l965O44m344m383J09K672j2700O13
$$ -10488 -4592 8368 17097 24936 20846 7298 8178 4213 4857 513 -3870 -3761 -1089 -13789 -13176
7732a3176J4422L48P075J816M636j246j8373j659j0623j381J216R381P219k619
$$ -13176 1246 1594 8669 10485 15121 13875 -4498 -6157 -16780 -18161 -16945 -7564 -345 -2964
7718b964p746P80J4762R803K601o91j4595q176J0983N267j0340j67j0073j681
$$ -2964 -10710 -9930 4832 14635 17236 16545 1950 -6226 4757 10024 -316 -483 -10556 -12237
7704a2237J0114K620q96J1405k54k875M590Q14q127j77K811L154m788j905L10
$$ -12237 -2123 497 -399 11006 10752 7877 12467 13281 5154 4977 7788 10942 6154 4249 4559
7689D559j270O001m183r912K948K14p107j959J698k868n752o158M670P292j797
$$ 4559 3289 9290 5107 -4805 -1857 -1643 -8750 -10709 -9011 -11879 -17631 -23789 -19119 -11827 -13624
7674a3624J1591O257q396K04K221L465J429l494j589j87R571N789l073m038n925
$$ -13624 -2033 4224 -4172 -3968 -1747 1718 3147 -347 -1936 -2123 7448 13237 10164 6126 201
7659B01J0919O101j94k997j276J399L874p482o680j476M499l969r007j926J503
$$ 201 11120 17221 17027 14030 12754 14153 18027 10545 3865 2389 6888 2919 -6088 -8014 -6511
7644f511J0977J167K53o027j0126j182L894j843Q598R81m352o003p414K68N549
$$ -6511 4466 5633 5886 -141 -10267 -11449 -7555 -9398 -800 181 -4171 -10174 -17588 -17320 -11771
7629a1771P239O592M524J0351N5j1924m584l487M565k349m3N204l037m969M094
$$ -11771 -4532 2060 6584 16935 16990 5066 482 -3005 1560 -789 -832 4372 1335 -3634 460
7614D60M793j702l220o699r539p69J0582J5916M528m180r464K426N491m554n55
$$ 460 5253 3551 331 -6368 -15907 -16676 -6094 9822 14350 10170 706 3132 8623 4069 3514
7599C514j1595n966M962K643Q056j906N393M971l212K787P65j275L28K726p667
$$ 3514 -8081 -14047 -9085 -6442 1614 -292 5101 10072 6860 9647 10412 9137 9465 12191 4524
7584D524j0338p56J031R52l762P849K137K408M47j228p582R4J861o088O315N494
$$ 4524 -5814 -6570 -5539 -4587 -8349 -500 1637 4045 4492 3264 -4318 -4224 -2363 -8451 -2136 3358
7568C358n4m140L140J849J0609j1807j344j163r971Q54O893j399k432J515N98
$$ 3358 3304 -836 2304 4153 14762 2955 1611 448 -9523 -8669 -1776 -3175 -5607 -4092 -3494
7553c494L412K091o905l102k015Q94N777l97O511j15m414p524M343J493J617j206
$$ -3494 -82 2009 -4896 -7998 -10013 -9119 -3342 -3739 2772 2657 -1757 -9281 -4938 -3445 -1828 -3034
7537c034p900P810O733l900l497J1810O749r395n225O176m750n285j362o818l945
$$ -3034 -10934 -3124 3609 -291 -3788 8022 14771 5376 151 6327 1577 -3708 -5070 -11888 -15833
7522a5833K080N155Q819j446n481J823J248q411P590M478n338J873L042k392j2099
$$ -15833 -13753 -8598 221 -1225 -6706 -4883 -3635 -12046 -4456 22 -5316 -3443 -401 -2793 -14892
7507a4892L365P805M396K931k668j097M044l587k949R774M306n993j918k22r066
$$ -14892 -11527 -3722 674 3605 937 -160 3884 297 -2652 7122 11428 5435 3517 3295 -5771
7492e771k850J798Q7J161P175l457r276k657K643N631M311K237R201n853r79M750
$$ -5771 -8621 -6823 -6736 -5575 1600 -1857 -11133 -13790 -11147 -5516 -1205 1032 10233 4380 3401 8151
7476H151q31j1900r379q627O513M937l562R582j522r737K156J0266m097j676J399
$$ 8151 7320 -4580 -13959 -22586 -16073 -11136 -14698 -5116 -6638 -16375 -14219 -3953 -8050 -9726 -8327
7461h327j227P234J686L234k03m027k116j068n363q650n27P316K174M233l260
$$ -8327 -9554 -2320 -634 2600 2397 -1630 -3746 -4814 -10177 -18827 -19354 -12038 -9864 -5631 -8891
7446h891L673Q548N077k428r646n974L540p56M528O51j013Q339R952p199l766
$$ -8891 -5218 3330 8407 5979 -3667 -9641 -6101 -6857 -2329 -1678 -2691 5648 15600 8401 4635
7431D635j921J0729o194o626m043N022M018j730r313n332K497N459O304J512J522
$$ 4635 2714 13443 7249 623 -3420 1602 5620 3890 -5423 -10755 -8258 -2799 3505 5017 6539
7416F539J404q012J552l362O95M115k91n889o720n162r397M906J2179J8188L986
$$ 6539 7943 -69 1483 -1879 -1184 2931 2640 -3249 -9969 -15131 -24528 -19622 -7443 10745 14731
7401A4731J432J181j0572o254P42l471r783K118P598J1013j733j969k497O388
$$ 14731 16163 17344 6772 518 1260 -2211 -11994 -9876 -2278 8735 7002 5033 2536 8924
7387H924N410p753p009o358j55J12M150O372N656m14J291j0597q842N572N259
$$ 8924 14334 6581 -428 -6786 -6941 -6829 -2679 3693 9349 8935 10226 -371 -9213 -3641 1618
7372A618O959j313n055m14J916J559m159j934L374r56O24M56j456l605j176P691
$$ 1618 8577 7264 2209 1795 3711 5270 1111 -823 2551 1595 2219 2675 1219 -2386 -3562 4129
7356D129N905j3449o16N037n198N624m45l599N974N062M836R345m706j7800j2486
$$ 4129 10034 -3415 -4031 1006 -4192 1432 987 -2612 3362 8424 13260 22605 17899 99 -12387
7341a2387O997P620k697r554K000P154k176J613l867P919Q302L84m170j1059n234
$$ -12387 -5390 2230 -467 -10021 -8021 -867 -3043 -1430 -5297 2622 10924 11308 7138 -3921 -9155
7326i155L836Q875K883Q84Q52r893n664j846N08J033J220K482o310L64J914J207
$$ -9155 -5319 3556 6439 7323 8175 -1718 -7382 -9228 -8720 -7687 -6467 -3985 -10295 -9931 -8017 -6810
7310f810K211J947R183N343j1303o274k497K470k030q55R526q342k198P185R31
$$ -6810 -4599 -2652 6531 11874 571 -5703 -8200 -5730 -7760 -8615 911 -7431 -9629 -2444 -1513
7295a513m417m63K893O075p697k027K608L825J13o324P3R408J85J375J26K252
$$ -1513 -5930 -6393 -3500 2575 -5122 -7149 -4541 -716 -603 -6927 -6854 2554 2739 4114 4240 6492
7279F492n33j295j107L862m359o258j310m244o238P420J8459J2795n564q277K08
$$ 6492 5959 4664 3557 7419 3060 -3198 -4508 -8752 -14990 -7570 10889 23684 18120 9843 10051
7264A0051K206m436m696r2m453n627J0132R977o701j4228Q79P884k452n397p176
$$ 10051 12257 7821 3125 3033 -1420 -7047 3085 13062 6361 -7867 -6988 896 -1556 -6953 -14129
7249a4129o097M086J2078l665l85l169l938l039l863Q154J1831J2042k881o691
$$ -14129 -20226 -16140 -4062 -7727 -8112 -11281 -15219 -18258 -22121 -13967 -2136 9906 7025 334
7235C34K896R021n432j992K189m833n220n002n461R358J1086J2r486p774o728
$$ 334 3230 12251 6819 4827 7016 2183 -3037 -8039 -13500 -4142 6944 6956 -2530 -10304 -17032
7220a7032M148J0525j021L81o076m818M236j020n789p598M039J1002p27J930J2736
$$ -17032 -12884 -2359 -3380 -2999 -9075 -13893 -9657 -10677 -16466 -24064 -20025 -9023 -9750 -7820 4916
7205D916K557M56q09K288j0084n970O605J891J943O801N05p042r04m080N976o21
$$ 4916 7473 7929 7120 9408 -676 -6646 -41 1850 3793 10594 11099 4057 3153 -927 5049 4428
7189D428q320K549o932l259K603L252L905M222Q459l315m009J97L45r379q545
$$ 4428 -3892 -1343 -8275 -11534 -8931 -5679 -1774 2448 10907 7592 3583 3780 4125 -5254 -13799
7174a3799j655J0504R847p521L785L89N468k410R38o000p224L624p84j318Q064
$$ -13799 -15454 -4950 4897 -2624 1161 1550 7018 4608 5546 -454 -7678 -4054 -4838 -6156 1908
7159A908K126j1319o077m261m997M249P411N814k672k936P263Q776N238r549j661
$$ 1908 4034 -7285 -13362 -17623 -22620 -18371 -10960 -5146 -7818 -10754 -3491 5285 10523 974 -687
7144f87M534k399Q15N172N944R6m552j3520k50K545l828J175J2511M596k791K938
$$ -687 3847 1448 2263 7435 13379 13475 8923 -4597 -4847 -2302 -6130 -4955 7556 12152 9361 12299
7128A2299j2148m400n536m767J726L142O082M049K528L29J792K621n207Q643Q29
$$ 12299 151 -4249 -9785 -14552 -12826 -9684 -3602 447 2975 3304 5096 7717 2510 11153 11982
7113A1982j831K244k639n419P335N410m507q245L481P381m63k179k25k269l419
$$ 11982 10151 12395 9756 4337 11672 17082 12575 4330 7811 15192 14729 12550 12325 10056 6637
7098F637j694k713l322L911M191Q095J62L969M58j5144l668L677K685R50m231
$$ 6637 4943 2230 -1092 2819 7010 15105 15267 19236 19694 4550 882 4559 7244 8194 3963
7083C963K624R67k819l573Q23p537P171N890K258J026J749j671m624K591L86M55
$$ 3963 6587 7554 4735 1162 1985 -5552 1619 7509 9767 10793 12542 10871 6247 8838 9224 9679
7067I679P67k035k358J576L522m307J009M596p569j833L189M403L544k253l385
$$ 9679 10446 8411 6053 7629 11151 6844 7853 12449 4880 3047 6236 10639 14183 11930 8545
7052H545k044Q86r36K434n090o766o609O784N558j229K31K342p454k969n873J0911
$$ 8545 6501 7387 6451 8885 3795 -2971 -9580 -2796 2762 1533 1764 4106 -3348 -6317 -12190 -1279
7036a279P204J478n718l844L320R57K667L24N029p999p053p10j987Q679Q506J480
$$ -1279 5925 7403 1685 -2159 1161 2118 4785 5109 10138 2139 -4914 -5624 -7611 1068 9574 11054
7020A1054Q331R746q545r955o377J1069l864q123l727j1553n720N413J1787P020
$$ 11054 19385 29131 20586 10631 4254 15323 11459 3336 -391 -11944 -17664 -12251 -464 6556
7006F556n132p577n52M65m499m670R28J4266K596p123K856o79j92j0918j024N572
$$ 6556 1424 -6153 -6705 -6240 -10739 -15409 -14481 -215 2381 -4742 -1886 -2565 -2757 -13675 -14699 -9127
6990i127J703L653j3832l981J2996k30J014P224L466L929j88k841o771l736O47
$$ -9127 -7424 -3771 -17603 -21584 -8588 -8818 -7804 -580 2886 6815 6627 3786 -2985 -6721 -6074
6975f074L759l880N548M531o15l35K024l776n540O398O249K828M258j500k184
$$ -6074 -2315 -6195 -647 3884 3269 2934 4958 1182 -4358 2040 8289 11117 15375 13875 11691
6960A1691q812p406l909p274p52J0386Q013N48n065M30Q485M60m50P31N786l254
$$ 11691 2879 -4527 -8436 -15710 -16462 -6076 1937 2485 -2580 -2150 6335 6795 6345 7076 12862 9608
6944I608J1542J132j4923j266j653J086q8j678n528K806R351L330n678m866M23
$$ 9608 21150 22282 7359 6093 4440 5526 5438 3760 -1768 1038 10389 13719 8041 3175 3598
6929C598q178j0874J339k105q046k579J2480L915R477R77l218j0288R008J1530
$$ 3598 -4580 -15454 -14115 -16220 -24266 -26845 -14365 -10450 -973 4 -3214 -13502 -4494 7036
6915G036n587k91L392K377J02P708j350n464J501M30j1599l222K240O947j0103
$$ 7036 1449 1158 4550 6927 7029 14737 13387 7923 9424 9854 -1745 -4967 -2727 4220 -5883
6900e883k679J0128Q185o298m612N583J880K841j1708l594M004L486o1o559L132
$$ -5883 -8562 1566 9751 3453 -1159 4424 6304 9145 -2563 -6157 -2153 1333 1272 -5287 -2155
6885b155j283P517P906r916p981L829j267o830k408L750r933L434J0283N997m211
$$ -2155 -3438 4079 11985 2069 -5912 -2083 -3350 -10180 -12588 -8838 -18771 -15337 -5054 943 -3268
6870c268j482l970N280n088L547J002j015K392K456Q386J1867L38l550r849M648
$$ -3268 -4750 -8720 -3440 -8528 -4981 -3979 -4994 -2602 -146 8240 20107 20445 16895 7046 11694
6855A1694J0399j859p154r017M94q979m376L460l386M71n81k9Q81j10j583J2308
$$ 11694 22093 20234 13080 4063 4557 -4422 -8798 -5338 -8724 -8253 -8834 -8863 -7982 -8092 -9675 2633
6839B633J521k054p590k354J33M954N888l790q535K83j591M067J2991J189l029
$$ 2633 4154 2100 -5490 -7844 -7711 -2757 3131 -659 -9194 -8911 -10502 -6435 6556 7745 4716
6824D716k535r115K840n258K518m071r453N833O523J20N87m160O11J590J584j585
$$ 4716 2181 -6934 -4094 -9352 -6834 -10905 -20358 -14525 -8002 -7882 -7295 -11455 -10844 -9254 -7670 -9255
6808i255K545Q566J320k898K9j2675j702P886J597n506K999l719n856L620O080
$$ -9255 -6710 1856 3176 278 307 -12368 -14070 -6184 -4587 -10093 -7094 -10813 -16669 -13049 -6969
6793f969l295o602N193J6578Q707L752n536p038m538m510P337L819p186o110r767
$$ -6969 -10264 -16866 -11673 4905 13612 17364 11828 4790 252 -4258 3079 6898 -288 -6398 -16165
6778a6165n480K864L40L23P220J5235M105K735K981O81o629j0753q924j1432M269
$$ -16165 -21645 -18781 -18441 -18118 -10898 4337 8442 11177 14158 14839 8210 -2543 -11467 -22899 -18630
6763a8630J0763l684n331Q599N536j0700r30M459P084K755q303k352R918L065
$$ -18630 -7867 -11551 -16882 -8283 -2747 -13447 -14377 -9918 -2834 -79 -8382 -10734 -816 2249
6749B249p602J385k602Q40j596p311M012j217L167J373J701j293m599N056K781
$$ 2249 -5353 -3968 -6570 -5730 -7326 -14637 -10625 -11842 -8675 -7302 -5601 -6894 -11493 -6437 -3656
6734c656j481k15R245k037N710L826m337m839l216M121J085n815L239q075K647
$$ -3656 -5137 -5352 3893 1856 7566 11392 7055 2216 -1000 3121 4206 -1609 1630 -6445 -3798
6719c798M89L890O278Q777R415K997r743j1281n861o599m643O569M254k90J388
$$ -3798 -3309 581 6859 15636 25051 28048 18305 7024 1163 -5436 -10079 -3510 744 454 1842
6704A842j321o877K541J0770N002j284J869o03n773O066O389l850j811j1476r335
$$ 1842 521 -6356 -3815 6955 11957 10673 12542 11939 6166 12232 18621 14771 12960 1484 -7851
6689g851j753L719M897j852m409K406N476J635j462J691Q809L675r365n207O184
$$ -7851 -9604 -5885 -988 -2840 -7249 -4843 633 2268 806 2497 11306 14981 5616 409 6593
6674F593L742l633o192j1851m403J4004J1128p604m886M536J400N93K035N02K045
$$ 6593 10335 6702 510 -11341 -15744 -1740 9388 1784 -3102 1434 2834 3427 5462 5964 8009
6659H009Q82Q28q439n319Q0q10l370J683O074l701j6L860P136p299p509j351r22
$$ 8009 8891 9719 1280 -4039 -3959 -4769 -8139 -6456 -382 -4083 -4099 -239 6897 -402 -7911 -9262 -10184
6642a0184M580J0605P532j355j456l664l520J1062k553n628j855L851m374j1713
$$ -10184 -5604 5001 12533 11178 9722 6058 2538 13600 11047 5419 3564 7415 3041 -8672
6628h672K012J839m606J194k351j576R514R154k709j576k363o47J890J0331k048
$$ -8672 -6660 -4821 -9427 -8233 -10584 -12160 -2646 6508 3799 2223 -140 -787 1103 11434 9386
6613I386M846J663j870N9k533O185K052L160m918N848N082k293K330j766Q739
$$ 9386 14232 15895 14025 14084 11551 17736 19788 22948 18030 23878 28960 26667 28997 27231 35970
6598C5970J4873K5888K0188M1310L6784j6702m0623l1993j3939K248O632Q048
$$ 35970 50843 76731 96919 138229 175013 158311 117688 85695 71756 74004 80636 88684
6586H8684J2997J9000K4968L0406N2176Q3391J01204J28850K17583L93815P29954
$$ 88684 101681 120681 145649 176055 228231 311622 412826 541676 759259 1153074 1883028
6575A883028J194447J625693R29649j349114j787127j018732n06034k67448j54842
$$ 1883028 3077475 4703168 5632817 4283703 2496576 1477844 971810 704362 549520
6566E49520j08259r2645p4515n2761k6627l4222l1248j0583j2219j9371j660J5695
$$ 549520 441261 348616 274101 221340 194713 160491 129243 118660 106441 87070 85410 101105
6554A01105K5558L8595J5266m1334l9424j9765j7515j4863j6035m95L920L666
$$ 101105 126663 165258 180524 139190 99766 80001 62486 47623 31588 31093 35013 38679
6542C8679n675n7m659m635m417q059N91P536N627n07J199p19r271r804N25j80
$$ 38679 33004 32947 28288 23653 19236 11177 11768 19304 24931 24424 25623 24904 15633 5829 6354 6174
6526F174n403P532Q036o25j851o669J2881L288o022l389p737q938P654l491k345
$$ 6174 771 8303 16339 15714 13863 7194 20075 23363 17341 13952 6215 -2723 4931 1440 -905
6511i05K818O984Q269r479J781k12r17O269L384k97P009j094k430j63J069J606
$$ -905 1913 8897 17166 7687 9468 9256 8339 14608 17992 17695 24704 23610 21180 21017 22086 23692
6495B3692m461n897l248O699L935q011j0049K310J619j381m950k602R31L995M094
$$ 23692 19231 13334 10086 16785 20720 12709 2660 4970 6589 5208 258 -2344 -1413 2582 6676
6480F676l858l114M471K002m477o625l611j549N669j64j853K461l161j513L824
$$ 6676 2818 -296 4175 6177 1700 -4925 -8536 -10085 -4416 -4580 -6433 -3972 -7133 -8646 -4822
6465d822J419m81l479j148J2271P739l632j1561l245l809L215R094P448q185o381
$$ -4822 -3403 -3884 -7363 -8511 3760 11499 7867 -3694 -6939 -10748 -7533 1561 9009 824 -5557
6450e557K673q184K162J0790P888k20K582P09k143o379M010j785o135l042K134
$$ -5557 -2884 -11068 -8906 1884 9772 9552 12134 12843 10700 4321 8331 6546 411 -2631 -497
6435d97m53j444j180O20q745L566J1957J0447r26o504P54Q82m747l93l392o011
$$ -497 -950 -2394 -3574 -2954 -11699 -8133 3824 14271 13345 6841 7595 8477 3730 3337 -55 -6066
6419f066M922L379P123K600J547p472n056j663R488K887J344m708o777n426k280
$$ -6066 -1144 2235 9358 11958 13505 6033 977 -686 8802 11689 13033 8325 1548 -3878 -6158
6404f158j906n819J6012O724j748J95N455m44l744k675m280J747L6P500M746j8642
$$ -6158 -8064 -13883 2129 8853 7105 7300 12755 12311 8567 5892 1612 3359 3395 10895 15641 -3001
6388c001P07L936j968k831j168l970K218R169Q638J807n402p206o529j6862k398
$$ -3001 -2294 1642 -326 -3157 -4325 -8295 -6077 3092 11730 13537 8135 929 -5600 -22462 -24860
6373b4860Q034N513K381J778Q417K408k291l519k880O585K308l779J198k329K876
$$ -24860 -16826 -11313 -8932 -7154 1263 3671 1380 -2139 -5019 1566 3874 95 1293 -1036 1840
6358A840M329L590l591Q1O931m493j1937O97M244l396j2626q528K05J6062J5426
$$ 1840 6169 9759 6168 6249 13180 8687 -3250 -2553 1691 -1705 -14331 -22859 -22654 -6592 8834
6343H834o911J46J870R40j53P225o00k223r204K861r200o043M444J258n056J623
$$ 8834 1923 2069 3939 4879 4726 11951 11351 9128 -76 2785 -6415 -12458 -8014 -6756 -11812 -10189
6327a0189J1O164L656N722J6332J001L94j1701o833n906J324Q259R551l309K659
$$ -10189 -10178 -4014 -358 5364 21696 22697 23091 11390 4557 -1349 -25 8234 17785 14476 17135
6312A7135J193j3304k477J348l358J5362Q596j556m552q203j421q925k606m44
$$ 17135 18328 5024 2547 3895 537 15899 24495 22939 18387 10184 8763 -162 -2768 -3212
6298c212M493n23N546K344j173J181l953l623J10l22k814o925l096O845Q885O195
$$ -3212 1281 758 6304 8648 7475 8656 4703 1080 1190 868 -1946 -8871 -11967 -5122 3763 9958
6282I958k643n42J677k861N98q785n110r262O05L572L222m30j842K112q989o355
$$ 9958 7315 6773 8450 5589 6187 -2598 -7708 -16970 -16365 -12793 -9571 -10001 -11843 -9731 -18720 -25075
6266b5075M924M083Q05N836j303j356K813k465l365J094J0967O989m136q493N73
$$ -25075 -20151 -16068 -15263 -9427 -10730 -12086 -9273 -11738 -15103 -14009 -3042 3947 -189 -8682 -8109
6251h109N336J912J947r262l191q16j089l583K048o314Q35N246J1801J5867J0081
$$ -8109 -2773 -861 1086 -8176 -11367 -12183 -13272 -16855 -14807 -21121 -20286 -15040 -3239 12628 22709
6236B2709j8501j2027O862P866J085l176K923P969L0j0418o442M690O355K853
$$ 22709 4208 -7819 -957 6909 7994 4818 7741 15710 15740 5322 -1120 3570 9925 12778
6222A2778o050j4543p208J1420n53J32P700J180p145o63M145j605j5013J13Q889
$$ 12778 6728 -7815 -15023 -3603 -4156 -4024 3676 4856 -2289 -2952 1193 -412 -15425 -15312 -6423
6207f423M109m243r006J0026J3151l425r383J858J6978N335j1130q482J430l661
$$ -6423 -2314 -6557 -15563 -5537 7614 4189 -5194 -3336 13642 18977 7847 -635 795 -2866
6193b866n500k688J0027p9Q321M930K432j534n578p094J022j30J408p697J141
$$ -2866 -8366 -11054 -1027 -1106 7215 12145 14577 13043 7465 371 1393 1263 2671 -5026 -3885
6178c885J560l425j2326j761Q196J296k120j121K357P103k307n27m860K119M222
$$ -3885 -2325 -5750 -18076 -19837 -11641 -10345 -12465 -13586 -11229 -4126 -6433 -6960 -11820 -9701 -5479
6163e479J611p176k265O117L086R374J12K737J752p83l216r702j946p591L214
$$ -5479 -3868 -11044 -13309 -7192 -4106 5268 5380 8117 9869 9086 5870 -3832 -5778 -13369 -10155
6148a0155J3237Q647n247l27l94q624q92L075K44l445K735K432M309N968P66j0037
$$ -10155 3082 11729 6482 6155 5761 -2863 -3755 -680 -436 -3881 -1146 1286 5595 11563 12329 2292
6132B292j8017k144J4053N816j354j0410o583J2963N291M022m539m236j47q708
$$ 2292 -15725 -17869 -3816 2000 646 -9764 -16347 -3384 1907 5929 1390 -2846 -2993 -11701
6118a1701p405J0186J1517m493r02P986J368k171O66p948j1388j548K923P991
$$ -11701 -19106 -8920 2597 -1896 -2798 5188 6556 4385 5051 -2897 -14285 -15833 -12910 -4919
6104d919Q649M885P568O174q164j5139l701M420Q1o487k817L665N180p460O20
$$ -4919 3730 8615 16183 22357 14193 -946 -4647 -227 -146 -6633 -9450 -5785 -605 -8065 -7445
6089g445k911l690r239L164M487J7064J0246o358q965j336J854J0409L184l440
$$ -7445 -10356 -14046 -23285 -20121 -15634 1430 11676 5318 -3647 -4983 -3129 7280 10464 7024
6075G024j0199L427k153m780J377k107k940m069M334L577k425k41O05J0257P426
$$ 7024 -3175 252 -1901 -6681 -5304 -7411 -10351 -14420 -10086 -6509 -8934 -9175 -8570 1687 9113
6060I113r638M07r440j058L603n733j854K95P084j330k10K285q22L424L509n575
$$ 9113 -525 -118 -9558 -10616 -7013 -12746 -14600 -14305 -7221 -8551 -8761 -6476 -7298 -3874 -365 -5940
6044e940j943J361O761p11m512m240J3642n86m211K940J657m538M100M277K812
$$ -5940 -7883 -6522 239 -472 -4984 -9224 4418 3832 -379 2561 4218 -320 3780 8057 10869
6029A0869j4286K7j424m217K880J0459l487K158k991k291l64K568O779k008j771
$$ 10869 -3417 -3390 -4814 -9031 -6151 4308 821 2979 -12 -2303 -2667 -99 6680 4672 2901
6014B901j4663m392p38k208J75L334J0641R743L433p076k77Q61J025j551P28k944
$$ 2901 -11762 -16154 -16892 -19100 -18925 -15591 -4950 4793 8226 1150 873 1734 2759 1208 1936 -1008
5998a008L904Q337L056Q951m079n259l345K145n875j045j87j0277j1587K378r14
$$ -1008 2896 11233 14289 23240 19161 13902 10557 12702 6827 5782 5595 -4682 -16269 -13891 -14805
5983a4805L899K717k07L134K636j853N009J406N193J597m477L89M33q834j2849
$$ -14805 -10906 -8189 -8396 -5262 -2626 -4479 530 1936 7129 8726 4249 4638 5071 -3763 -16612
5968a6612N526Q342J0505K848q354k085j643o51Q02N620k779o696J912m34q870
$$ -16612 -11086 -2744 7761 10609 2255 170 -1473 -2124 -1322 4298 1519 -5177 -3265 -3699 -12569
5953a2569L319k907K282j667N601k27m330J193k077k640L192L962J912k926r076
$$ -12569 -9250 -12157 -9875 -11542 -5941 -6168 -10498 -9305 -11382 -14022 -10830 -6868 -4956 -7882 -16958
5938a6958L043N539J0483m461j2803K962M709O406O211k881j0306n306K306N237
$$ -16958 -13915 -8376 2107 -2354 -15157 -12195 -7486 -1080 5131 2250 -8056 -13362 -11056 -5819
5924e819J081O745L435p855J083k186o105j566J761R066M240p056n617N91O335
$$ -5819 -4738 2007 5442 -2413 -1330 -3516 -9621 -11187 -9426 -360 3880 -3176 -8793 -8202 -1867
5909a867l535N061J055o521n278N814j52k673j2380Q18l0P379J0118L390o387
$$ -1867 -5402 -341 714 -5807 -11085 -5271 -5423 -8096 -20476 -19658 -19688 -12309 -2191 1199 -5188
5894e188R844K118q760k88R63k68k912P586n033l566K415k584L256Q305n528q202
$$ -5188 4656 6774 -1986 -2274 -1311 -1579 -4491 3095 -1938 -5504 -3089 -5673 -2417 5888 360 -7842
5878g842O560P639o480j151R988j910q657N218Q313J685n515p531J392m793K694
$$ -7842 -1282 6357 -123 -1274 8714 6804 -1853 3365 11678 13363 7848 317 1709 -3084 -390
5863c90M903k736l689k513j13K50P66N851J0050J096p667m441M6l708m443R19
$$ -390 4513 1777 -1912 -4425 -4538 -4288 -3522 2329 12379 13475 5808 1367 1413 -2295 -6738 -5819
5847e819P429m279o241r77M145O235J673k052j452J0395J826j160p955n360p233
$$ -5819 1610 -2669 -8910 -9887 -5742 493 2166 114 -1338 9057 10883 9723 1768 -3592 -10825
5832a0825K478l355j483L826J434L782Q41L195L818n600o40l393O842N686M728
$$ -10825 -8347 -11702 -13185 -9359 -7925 -4143 -3302 -107 3711 -1889 -2529 -5922 920 6606 11334
5817A1334k935o103j162k331K70J843o275k861Q879L447m472P089n846K330l433
$$ 11334 8399 2296 1134 -1197 -927 916 -5359 -8220 659 4106 -366 6723 877 3207 -226
5802b26N258j321J070k919p45O084j490n328o854j435L761L752O402o276o482
$$ -226 5032 3711 4781 1862 1117 7201 5711 383 -6471 -7906 -4145 -393 6009 -267 -6749
5787f749N709P95L413L364m644k363l292o01O203l586M890j783q22j768l460q605
$$ -6749 -1040 -245 3168 6532 1888 -475 -3767 -4368 1835 -1751 3139 1356 534 -1234 -4694 -13299
5771a3299n025R455K570M115O146k147j35k739j150n242k079J545L331l510m858
$$ -13299 -18324 -8869 -6299 -2184 3962 1815 1680 -1059 -2209 -7451 -9530 -7985 -4654 -8164 -13022
5756a3022K831m072N751J0718Q904l778k182m189r214j2042J0878N083r337j123
$$ -13022 -10191 -14263 -8512 2206 11110 7332 5150 961 -8253 -20295 -9417 -4334 -13671 -14794
5742a4794P641R968m449l241q429m189P904J7005R379n377j1247k225k129n665
$$ -14794 -7153 2815 -1634 -4875 -13304 -17493 -9589 7416 16795 11418 171 -2054 -4183 -9848
5728i848k329L950J324P11k606n305K318L075Q189J01L086K165j479r022o220
$$ -9848 -12177 -8227 -6903 -6192 -8798 -14103 -11785 -8710 -521 -420 2666 4831 3352 -5670 -11890
5713a1890o94Q149J0287J0127N596l605r035o694r524M178m97N057j1653J778
$$ -11890 -12584 -4435 5852 15979 21575 17970 8935 2241 -7283 -3105 -3602 1455 -10198 -8420
5699h420q78n31j431J4802N568n44r82P518J1096r946J77k994p055p8J966r02
$$ -8420 -9298 -9829 -11260 3542 9110 8566 7584 15102 26198 16252 16429 13435 6380 6302 8268 7366
5683G366p483p142M555L702j012k509N024k571O69O212j2014j0081j525j657j878
$$ 7366 -117 -7259 -2704 998 -14 -2523 2501 -70 599 6811 -5203 -15284 -16809 -18466 -20344
5668b0344K047J3907P05O226N686m071m309p270o115j0648O939J0089J396k731
$$ -20344 -18297 -4390 -3685 2541 8227 4156 -153 -7423 -13538 -24186 -17247 -7158 -5762 -8493
5654h493k320P825k375m267Q492P621p547n420N366N439N109K082r480q201j074
$$ -8493 -10813 -2988 -5363 -9630 -1138 6483 -1064 -6484 -1118 4321 9430 11512 2032 -6169 -7243
5639g243J784k454l712j673p200J5468J0038J240j6412q389l53J1685J1986M560
$$ -7243 -5459 -7913 -11625 -13298 -20498 -5030 5008 6248 -10164 -18553 -18906 -7221 4765 9325
5625I325J588K066m560M604M740o411k664k663J332m030o619m885q267J1628O191
$$ 9325 10913 12979 8419 13023 17763 11352 8688 6025 7357 3327 -3292 -8177 -16444 -4816 1375
5610A375k10J0013Q060l905l109n303r872n025l82J2151J0869r921j3598o198
$$ 1375 1165 11178 19238 15333 12224 6921 -2951 -7976 -8358 3793 14662 4741 -8857 -15055
5596a5055J1101Q44l133N949J444L400k738k964j755m735r74p77Q785P730l68
$$ -15055 -3954 -3110 -6243 -294 1150 4550 1812 -1152 -2907 -7642 -8616 -9393 -608 7122 6754
5581F754n004q123J887K125j095K734K561k555J5984k654r613n738m363n215K464
$$ 6754 1750 -6373 -4486 -2361 -3456 -722 1839 -716 15268 12614 3001 -2737 -7100 -12315 -9851
5566i851N671K973k219L266p796n658K494Q113J766R864M46n372l718O15M446
$$ -9851 -4180 -1207 -3426 -160 -7956 -13614 -11120 -3007 -1241 8623 9069 3697 -21 594 5040
5551E040J2835m202j802L68n188q927N59r987N026N597L55K542K828j808o614
$$ 5040 17875 13673 11871 12239 7051 -1876 -1317 -11304 -6278 -681 -326 2216 5044 3236 -3378
5536c378M597L49K583k455o459K691Q195q73M491M07j278P424O25o596k772m93
$$ -3378 1219 1568 4151 1696 -4763 -2072 6123 5250 9741 10148 8870 16294 16919 10323 7551 7058
5520G058K273R226n514o713p000m278O88J441o72l865J90P541K33J052j242m101
$$ 7058 9331 18557 13043 6330 -670 -4948 -4260 -2819 -3491 -7356 -7166 375 608 1660 418 -3683
5504c683O497O439n775L179m590k484p356j4790L993m821L465Q188O080R828R58
$$ -3683 2814 9253 3478 6657 2067 -417 -7773 -22563 -18570 -23391 -19926 -11738 -5658 4170 5128
5489E128O5L471m265L060m460J935J520M613o50L806J413k518K974r908m851m379
$$ 5128 5193 8664 4399 7459 2999 4934 6454 11067 10417 14223 15636 13118 16092 6184 1333 -3046
5473c046J22l542m69J0690q646n236m799J650Q254Q369J461o393J315K465o599
$$ -3046 -2924 -6466 -6935 3755 -4891 -10127 -14926 -13276 -5022 3347 4808 -1585 -270 2195 -4404
5458d404m031R22Q289M611q200n83N716J0232rm980k751r563m823J882m960Q023
$$ -4404 -8435 -7513 776 5387 -2813 -3396 2320 12552 12543 7563 4812 -4751 -9574 -7692 -12652 -4629
5442d629l019l618j590o03K524P088m918p213l240Q443R397J157K457m462r185
$$ -4629 -7648 -11266 -12856 -13459 -10935 -3847 -8765 -15978 -19218 -10775 -1378 -221 2236 -2226 -11411
5427a1411Q57J797l374J933J4447J125j653l038j332l922P124O993j293J009k9
$$ -11411 -10554 -8757 -12131 -10198 4249 5374 3721 683 -649 -4571 2553 9546 8253 9262 9233
5412I233j394J83j1606L76p36R402M263r495q431L240N672j238K463m573m51j418
$$ 9233 7839 8022 -3584 -3208 -3944 5458 9721 226 -8205 -4965 707 -531 1932 -2641 -3092 -4510
5396d510N337N945J46L033n844m701m345j408k852j827M307Q659k723j3367p796
$$ -4510 827 6772 6918 9951 4107 -594 -4939 -6347 -9199 -11026 -6719 1940 -783 -14150 -21946
5381b1946N362J4546R583j0750m249N824O31N986o0m761j0315l95L386L561q907
$$ -21946 -16584 -2038 7545 -3205 -7454 -1630 -999 4987 4927 166 -10149 -10544 -7158 -3597 -12504
5366a2504Q471R096L637l357K515q32l199j1710n780o405L119P941n469j375R829
$$ -12504 -4033 5063 8700 5343 7858 7026 3827 -7883 -13663 -20068 -16949 -9008 -14477 -15852 -6023
5351f023P027L868m342q764p987K290K08Q335O035J0483M645O826k65k473L391
$$ -6023 1004 4872 530 -8234 -16221 -13931 -13723 -5388 647 11130 15775 22601 22336 19863 23254
5336B3254L216p243P061q902j5652k885p476J004l468J842j0275L149L240K815
$$ 23254 26470 19227 26288 17386 1734 -1151 -8627 -7623 -11091 -9249 -19524 -16375 -13135 -10320
5322a0320J025j541j884m665K898M673Q991r791p980P210O90O443Q803m960j365
$$ -10320 -9295 -10836 -12720 -17385 -14487 -9814 -823 -10614 -18594 -11384 -10694 -4251 4552 -408 -1773
5307a773K348L383k58n440q302j784p33p325J549Q851J1846Q331p525q753m355
$$ -1773 575 3958 3700 -1740 -10042 -11826 -12559 -19884 -18335 -9484 2362 10693 3168 -5585 -9940
5292i940o61R529N365l87o75m082L083r689j381J1750R184L470k999M424J82q722
$$ -9940 -10601 -1072 4293 3906 3231 -851 2232 -7457 -8838 2912 12096 15566 12567 16991 17173 8451
5276H451l674j1639j490P033Q482j857L650j90p824l646K640j027J9m885M02N90
$$ 8451 4777 -6862 -8352 -1319 7163 5306 8956 8766 942 -2704 -64 -1091 -1072 -5957 -5555 -4965
5260d965p782J1287k489n023K949K774R179O355j911L269l921k217L3m457j661
$$ -4965 -12747 -1460 -3949 -8972 -6023 -3249 5930 12285 10374 13643 9722 7505 7538 3081 1420
5245A420O1O216N47j086m150m386o389J0598Q245J550r666p174K809L578n98J17
$$ 1420 1481 7697 8244 7158 3008 -1378 -7767 2831 11076 12626 2960 -4214 -1405 2173 1575 1692
5229A692O172j757q512j450j407m355l82N505j189k696K448r332m545J528J1424
$$ 1692 7864 6107 -2405 -3855 -5262 -9617 -9999 -4494 -5683 -8379 -5931 -15263 -19808 -18280 -6856
5214f856O583N57P137O542M122p466n195m114k693Q278P413o313n283J440j717
$$ -6856 -273 284 7421 13963 18085 10619 5424 1310 -1383 6895 14308 7995 2712 4152 2435
5199B435o848j474N431j1R824k509r556J420p622q293M629J232k754N889O005
$$ 2435 -4413 -5887 -456 -467 9357 6848 -2708 -1288 -8910 -17203 -12574 -11342 -14096 -8207 -2202
5184b202K740m963L40O498Q738o670o534J339J187m801P903P98K177o364l271
$$ -2202 538 -4425 -4085 2413 11151 4481 -2053 -714 473 -4328 3575 4373 6550 186 -3085
5169c085Q659q893j0488k398k501J0060O564j939l635J414O156J5042l160j9006
$$ -3085 5574 -3319 -13807 -16205 -18706 -8646 -2082 -4021 -7656 -6242 -86 14956 11796 -7210
5155g210m480K656K930N991M511l172P58K190J1157j865m287m638m440m42R594
$$ -7210 -11690 -9034 -6104 -113 4398 1226 1984 4174 15331 13466 9179 4541 101 -341 9253
5140I253J123o063j0600j659N534N600M712j1625l307L719n21l248N678R14O219
$$ 9253 10376 4313 -6287 -7946 -2412 3188 7900 -3725 -7032 -3313 -3834 -7082 -1404 -490 5729
5125E729J021m787j515K263Q901N41o87p3K42q772l478N34Q63M731J359K451n593
$$ 5729 6750 1963 448 2711 11612 12153 11466 11393 11635 2863 -615 -81 782 5513 6872 9323 3730
5108C730J889K737k543O419o552K419m00N832J0202j0970o598o984K13L126J0313
$$ 3730 5619 8356 5813 12232 5680 8099 7699 13531 23733 12763 6165 -819 -606 2520 12833
5093A2833K632n538j3553o598J966l715j110k089j813N900J0368J969L13j0714
$$ 12833 15465 9927 -3626 -10224 -8258 -11973 -13083 -15172 -16985 -11085 -717 1252 1565 -9149
5079i149L280J4402P37r725n221r429L444j598k885r40J050Q511P505J849J216
$$ -9149 -5869 8533 9270 -455 -5676 -15105 -11661 -13259 -16144 -17084 -16034 -7523 -18 1831 3047
5064C047q28N82N815M616j0090m400j225l786q201o829J859N356N534R374L246
$$ 3047 2219 2801 8616 13232 3142 -1258 -2483 -6269 -14470 -21299 -19440 -14084 -8550 824 4070
5049D070q136q37P498R065o669p369j262n39Q661K909N964M565o573l324m006
$$ 4070 -4066 -4903 2595 11660 4991 -2378 -3640 -4179 4482 7391 13355 17920 11347 8023 4017
5034D017k030k847j2219n889L725P239l614l506N369O209M049L026M012k267j1041
$$ 4017 1987 -860 -13079 -18968 -15243 -8004 -11618 -15124 -9755 -3546 503 3529 7541 5274 -5767
5019e767l615m520L503J757Q999j650j644Q281n264m472K487J2842L278n992k333
$$ -5767 -9382 -13902 -10399 -8642 357 -1293 -2937 5344 80 -4392 -1905 10937 14215 8223 5890
5004E890p656j174k916M987M597L695P166k603r27j45n727j3783M440P657N333
$$ 5890 -1766 -2940 -5856 -869 3728 7423 14589 11986 11059 10914 5187 -8596 -4156 3501 8834
4989H834n268o398p85p065p24P562J997L198N697J0633L767j1108l135N729M24
$$ 8834 3566 -2832 -3617 -10682 -11406 -3844 -1847 1351 7048 17681 21448 10340 7205 12934 13358
4974A3358n866j949q034j321J861O400J016j0264M353N082j17o547P30l627N271
$$ 13358 7492 5543 -2491 -3812 -1951 4449 5465 -4799 -446 4636 4519 -2028 -1298 -4925 346
4959C46O032o048l279l209L874M999r801K150o084M450P969M772L312p60k817
$$ 346 6378 330 -2949 -6158 -2284 2715 -7086 -4936 -11020 -6570 1399 6171 9483 8723 5906
4944E906J21p844l667J15l579p574L109M723O357L380O41L730M489L771o093p718
$$ 5906 6027 -1817 -5484 -5369 -8948 -16522 -13413 -8690 -2333 1047 1688 5418 9907 13678 7585 -133
4928a33k630O053L70J642O166j715l893R228m976j4709m94P734Q571M750k999
$$ -133 -2763 3290 3660 5302 11468 9753 5860 15088 10112 -4597 -5091 2643 11214 15964 12965
4913A2965k496n566m491J655N176M360j534J949L977L313j566o651q168j0418
$$ 12965 10469 4903 412 2067 7243 11603 10069 12018 15995 19308 17742 11091 2923 -7495
4899g495n510K233K694M205M614L808j40l427m073M330l834k652P69m190J676
$$ -7495 -13005 -10772 -8078 -3873 741 4549 4409 982 -3091 1239 -2595 -5247 -4478 -8668 -6992
4884f992q9J529J943J23J21L33m677j3560p807K781Q137O530M563Q366P131K527
$$ -6992 -7081 -5552 -3609 -3486 -3365 -3032 -7709 -21269 -29076 -26295 -18158 -11628 -7065 1301 8432 10959
4868A0959L825M447j902J344n92p148K341J589p32l123m93Q78O116k608j3342
$$ 10959 14784 19231 17329 18673 18081 10933 13274 14863 14131 11008 10515 11393 17509 14901 1559
4853A559q316k717J3843N248r810k100P229J004p617k528M503N20R878Q00l395
$$ 1559 -6757 -9474 4369 9617 -193 -2293 4936 5940 -1677 -4205 298 818 10696 11496 8101
4838H101j512q045p696j978K648J0277J0130j4468q473N035n54l389K1O835N584
$$ 8101 6589 -1456 -9152 -11130 -8482 1795 11925 -2543 -11016 -5981 -6535 -9924 -9903 -3068 2516
4823B516o491P033J873q000l980J05n751O750n183l333P6Q68J756N07K308K17
$$ 2516 -3975 3058 4931 -3069 -7049 -6944 -12695 -5945 -11128 -14461 -14385 -13517 -11761 -11254 -8946 -8729
4807h729J4187Q275N657q181j6899m262O775K046L972L258N626N66o394r133j0077
$$ -8729 5458 13733 19390 11209 -5690 -9952 -3177 -1131 2841 6099 11725 12291 5897 -3236 -13313
4792a3313K68m99l200J021J0460J1689j3368l151Q78K729R464N121k513l85k643
$$ -13313 -13045 -13544 -16744 -15723 -5263 6426 -6942 -10093 -9215 -6486 2978 8099 5586 5201 2558
4777B558Q99J5379l392o857q84j174m05J063l18n140p163M814J0635P32N690J795
$$ 2558 3457 18836 15444 8587 7703 6529 6124 7187 6869 1729 -5434 -620 10015 10747 16437 18232
4761A8232qj1035j083k294j657R759n314k465l051l05N26M688k063l987j3J64
$$ 18232 18224 7189 6106 3812 2155 11914 6600 4135 1084 779 1305 5993 3930 -57 -70 94
4745I4n75r695q252N735J2648Q820L44L080K521j9051K937J2401q802p765N124
$$ 94 -481 -10176 -18428 -12693 -45 8775 9119 12199 14720 -4331 -1394 11007 2205 -5560 -436
4730d36M349J8608l222q822o366m190j807Q799Q23p854k076O678K887k96j147
$$ -436 3913 22521 19299 10477 4111 -79 -1886 6913 7736 -118 -2194 4484 7371 7075 5928
4715E928K437k792n364j0403q830K149R278Q809r46K90L234k755J84J0517j961
$$ 5928 8365 5573 209 -10194 -19024 -16875 -7597 1212 266 556 3790 1035 1219 11736 9775
4700I775o952j587J070k682j572P211j802J568O163M264o544p016m048j650j690
$$ 9775 2823 1236 2306 -376 -1948 5263 3461 5029 11192 15456 8912 1896 -2152 -3802 -5492
4685e492l421m819n53L319O035L394j639Q465M980j312k085p469r549M83K860
$$ -5492 -8913 -13732 -14285 -10966 -4931 -1537 -3176 5289 10269 8957 6872 -597 -10146 -9663 -6803
4670f803k991o884R950k88k008N981l80L614J581J784Q40l978R16J0052l511j1374
$$ -6803 -9794 -16678 -6728 -7016 -9024 -3043 -3423 191 1772 3556 4396 418 1334 11386 7875 -3499
4654c499j486J1762R070p8l696N874m542q360K78o20l886j010k227J021J301r249
$$ -3499 -4985 6777 15847 15769 12073 17947 13405 5045 5323 4703 817 -193 -2420 -1399 -98 -9347
4638i347N728Q184M532m327m029K523r864M024K101J091P211M56k452p445O08
$$ -9347 -3619 4565 9097 4770 741 3264 -6600 -2576 -475 616 7827 8283 5831 -1614 -1006
4623a006M638j2591O898J0696N695j532n264l216J425k976Q03r127j455K925J863
$$ -1006 3632 -8959 -2061 8635 14330 12798 7534 4318 5743 2767 3570 -5557 -7012 -4087 -2224
4608b224Q587k966l656m131L072k515M394P871k039j283l190j09K422r109J772
$$ -2224 6363 3397 -259 -4390 -1318 -3833 561 8432 6393 5110 1920 1811 4233 -4876 -3104
4593c104J586K942P797O313K100k498q509L090k141j524p772j144O67N238M040
$$ -3104 -1518 1424 9221 15534 17634 15136 6627 9717 7576 6052 -1720 -2864 -2197 3041 7081
4578G081M547n595N114n337k477J102J76o840o026m213P454R662p09O04O933l201
$$ 7081 11628 6033 11147 5810 3333 4435 4611 -2229 -8255 -12468 -5014 4648 3939 4543 11476 8275
4562H275k808r573r648J859P060o19j2893J025J449R478N577R36j983j1865K472
$$ 8275 5467 -4106 -13754 -11895 -4835 -5454 -18347 -17322 -15873 -6395 -818 118 -1865 -13730 -11258
4547a1258L140M124P262j941J628l653M49m243K326J0226l296l578K32l421l200
$$ -11258 -8118 -3994 3268 1327 2955 -698 -249 -4492 -2166 8060 4764 1186 1418 -2003 -5203
4532e203m428m285N838j262k65P061p773j188L988K559o47P538J623J321l165
$$ -5203 -9631 -13916 -8078 -9340 -9605 -2544 -10317 -11505 -7517 -4958 -5605 1933 3556 4877 1712
4517A712m017p512n700M591N972l930O07O320R672j578j1062K589K409r52K993
$$ 1712 -2305 -9817 -15517 -10926 -4954 -8884 -8277 -1957 7715 6137 -4925 -2336 73 -879 2114
4502B114L177k523J444j28J5573J707K285j261l718j0961M61o22n320m785n245
$$ 2114 5291 2768 4212 4084 19657 21364 23649 22388 18670 7709 8170 7548 2228 -2557 -7802
4487g802K656J493k682M149M641R39n379p026j107J504R540N801P033k397r667
$$ -7802 -5146 -3653 -6335 -2186 2455 3394 -1985 -9011 -10118 -8614 926 6727 13760 11363 1696
4472A696L64L536P398o449J654L516L35p173j1503M120O36o689N130N247m709
$$ 1696 2060 5596 12994 6545 8199 11715 12050 4877 -6626 -2506 -1870 -8559 -3429 1818 -2891
4457b891o894M878N527n540l569R976P986m80j715R95M945L862m326l698m688
$$ -2891 -9785 -4907 620 -4920 -8489 1487 9473 8993 7278 8273 13218 17080 12754 9056 4368
4442D368k253l739q552j136J357L354M177K300R49o035j9125K550Q008Q814J1940
$$ 4368 2115 -1624 -10176 -11312 -9955 -6601 -2424 -124 825 -5210 -24335 -21785 -13777 -4963 6977
4427F977p397P51J2041N21K148n892l764K376K603M54j1142m752R694J791j943
$$ 6977 -420 331 12372 12893 15041 9149 5385 7761 10364 10818 -324 -5076 4618 6409 4466
4412D466j417r968M295j918k407k042p88M507l727p35o74K904R43p27m702m031
$$ 4466 3049 -6919 -2624 -4542 -6949 -8991 -9779 -5272 -8999 -9734 -10408 -7504 -6561 -7288 -11990 -16021
4396a6021N623M537m801K625J4022O815K096J015o340q073p133L450Q715N026
$$ -16021 -10398 -5861 -10662 -8037 5985 12800 14896 15911 9571 1498 -5635 -2185 6530 11556
4382A1556N33j5j0969k424q593k661L111N333O276L349P422j1139j0569M210P622
$$ 11556 12089 12074 1105 -1319 -9912 -12573 -9462 -4129 2147 5496 12918 1779 -8790 -4580 3042
4367C042P54p19M127k322n778l913O515L600j214m352o265l151q351P734M003
$$ 3042 3796 3077 7204 4882 -896 -4809 1706 5306 4092 -260 -6525 -9676 -18027 -10293 -6290
4352f290l72n701N297J0886m683p784j337P60K749j770r74M028J3702j55n900
$$ -6290 -6662 -12363 -7066 3820 -863 -8647 -9984 -9224 -6475 -8245 -9219 -5191 8511 8356 2456
4337B456L092J3985M617j1785p328o351o676N083J1182p357m200k164K095M496
$$ 2456 5548 19533 24150 12365 5037 -1314 -7990 -2907 8275 918 -3282 -5446 -3351 1145
4323A145j139l776M595J1291r80r708q268Q204P642n257j1242N869J4238j3342
$$ 1145 6 -3770 825 12116 11136 1428 -6840 1364 9006 3749 -7493 -1624 12614 -728
4309g28j4791P103M328O251K630M446L063r8j365q685o878K603M019K276J682
$$ -728 -15519 -8416 -4088 2163 4793 9239 12302 12204 10839 2154 -4724 -2121 1898 4174 5856
4294E856m722m423J0090P528j3025j2980m910j989J042M436Q362J4151Q857p068
$$ 5856 1134 -3289 6801 14329 1304 -11676 -16586 -18575 -17533 -13097 -4735 9416 18273 11205
4280A1205r271p242J003o226l630J0094N609K048o684j177R424N889o818q467
$$ 11205 1934 -5308 -4305 -10531 -14161 -4067 1542 3590 -3094 -4271 5153 11042 4224 -4243
4266d243k145J83k56K936J465J753o155r99M914O722n48k788O08K192k240N561
$$ -4243 -6388 -6205 -6461 -3525 -2060 -307 -6462 -7461 -2547 4175 3627 839 1447 3639 1399 6960
4250F960n201N829L955o711j4158O640J0683M425m102k733j6316n945K065Q361
$$ 6960 1759 7588 11543 4832 -9326 -2686 7997 12422 8320 5587 -10729 -16674 -14609 -6248
4236f248R358m948l270l460J419M181J5101J707j138o246k323n649k50O57N789
$$ -6248 3110 -1838 -5108 -8568 -7149 -2968 12133 13840 12702 6456 4133 -1516 -1766 -1109 4680
4221D680k329o903L904L283K617O564L171o006n153O914R099o763j8252q546Q11
$$ 4680 2351 -4552 -648 2635 5252 11816 14987 8981 3828 10742 19841 13078 -5174 -13720 -12909
4206a2909L775O147n756n597P309K699l109R02N377K993n25l275O634j127o822
$$ -12909 -9134 -2987 -8743 -14340 -7031 -4332 -7441 -6539 -1162 1831 1306 -1969 4665 3538 -3284
4191c284K998l278J274Q964j005k684m234o072N192L61J183k220q958k917N602
$$ -3284 -286 -3564 -2290 6674 5669 2985 -1249 -7321 -2129 -1768 -585 -2805 -11763 -14680 -9078
4176i078Q130o275l992m14N687N427K975k77o431r546M920L57n718l642K965O605
$$ -9078 -948 -7223 -11215 -11629 -5942 -515 2460 2183 -4248 -13794 -8874 -8517 -14235 -17877 -14912 -8307
4160h307o487J976M931K172L825L562k239n034N655J693r408j624m190m260J407
$$ -8307 -14794 -12818 -7887 -5715 -1890 1672 -567 -5601 54 1747 -7661 -9285 -13475 -17735 -16328
4145a6328J0116L417p176l87J3332L410M121J03L160Q43n360o775k507k290r868
$$ -16328 -6212 -2795 -9971 -10358 2974 6384 10505 10608 13768 14611 9251 2476 -31 -2321 -12189
4130a2189N878M922K119o098r325Q651N000j887L305k276J593q514l307m711L289
$$ -12189 -6311 -1389 730 -5368 -14693 -6042 -1042 -2929 376 -1900 -307 -8821 -12128 -16839 -13550
4115a3550N551P383R082J890j688j136r537k266J968n722K088J0341l811J412
$$ -13550 -7999 -616 8466 10356 8668 7532 -2005 -4271 -2303 -8025 -5937 4404 593 2005
4101B005l85j55k005j913q302l7N055O939K812Q8o800O36M776N894J589r64o912
$$ 2005 1620 1465 -540 -2453 -10755 -10792 -5737 1202 4014 4102 -2698 -2062 2714 8608 10197 9233 2321
4084B321r427N462R439J1910o162R09p937J84k789q050R337M587p202r550j613
$$ 2321 -7106 -1644 7795 19705 13543 14452 6515 6699 3910 -4140 5197 9784 2582 -6968 -8581
4069h581M808k754Q353M869k41J601k073o007M414J6k07m851j217o54O096r910
$$ -8581 -3773 -6527 1826 6695 6454 8055 5982 -25 4389 4405 4198 -653 -1870 -2524 3572 -6338
4053f338J838M833J300J073p674l207M983j257J630K689J1352P083o382n630j4378
$$ -6338 -4500 333 1633 2706 -4968 -8175 -3192 -4449 -2819 -130 11222 18305 11923 6293 -8085
4038h085j808R771L286m657k771L189N472m173j311l525r384J995R982O245M465
$$ -8085 -9893 -122 3164 -1493 -4264 -1075 4397 224 -1087 -4612 -13996 -12001 -2019 4226 8691
4023H691M397p330j2842Q859R23j151j4957k477K672L120M525J173j082K066Q504
$$ 8691 13088 5758 -7084 1775 2698 1547 -13410 -15887 -13215 -10095 -5570 -4397 -5479 -3413 5091
4008E091m76L886L228q776n486k693q64K915K0098P070q770m251j0190n180o992
$$ 5091 4615 8501 11729 2953 -2533 -5226 -6090 -3175 16923 23993 15223 10972 782 -4398 -11390
3993a1390O280L817n78q292L842L138J940k4J0335P100o363j0975j353K263j785
$$ -11390 -5110 -1293 -1871 -10163 -6321 -3183 -1243 -1267 9068 16168 9805 -1170 -2523 -260 -2045
3978b045J3747K072j0043l78O40o932j4330p795J410N217Q561N79J0382L281K289
$$ -2045 11702 13774 3731 3353 3993 -2939 -17269 -25064 -23654 -18437 -9876 -9297 1085 4366 6655
3963F655j469n22m831M534J752j0100M583j67l413k873O168l329R60K064j226
$$ 6655 5186 4664 -167 4367 6119 -3981 602 435 -2978 -5851 317 -3012 -2052 12 -1214
3948a214N044R151p030k696Q826k288q115l756n004O509k47M65q56j400l36l708
$$ -1214 3830 12981 5951 3255 12081 9793 1678 -2078 -7082 -573 -820 -355 -1211 -2611 -2947 -6655
3932f655Q631K9m628o558O55J0917J723r615k257M559N579J1681J926N473O87
$$ -6655 1976 2005 -2623 -9181 -8526 2391 4114 -5501 -7758 -3199 2380 14061 15987 21460 22147
3917B2147j9861o759O631L4M224P830N49P4M042J839o37n39n166j2692j0373q204
$$ 22147 2286 -4473 2158 2192 6416 14246 14795 14869 18911 20750 20113 19574 14408 1716 -8657 -16861
3901a6861Q69J641r49J977n963N41j255K858O380j161m682J3308N543k892J951
$$ -16861 -15992 -14351 -15300 -13323 -19286 -18745 -20000 -17142 -10762 -11923 -16605 -3297 2246 -646 1305
3886A305L546m357l934Q677Q216P489j8770j2942N273n023j65P492L621L537p165
$$ 1305 4851 494 -3440 5237 13453 20942 2172 -10770 -5497 -10520 -10685 -3193 428 3965 -3200
3871c200o480j509k401p279O273M009K081J663p90m10M928J624n421J993n000
$$ -3200 -9680 -11189 -13590 -20869 -14596 -10587 -8506 -6843 -7633 -8043 -3115 -1491 -6912 -4919 -9919
3856i919q682M874P814K534M634l475n759K93j58K728k280N287m025o718M19J184
$$ -9919 -18601 -13727 -5913 -3379 1255 -2220 -7979 -7686 -7844 -5116 -7396 -2109 -6134 -12852 -12433 -11249
3840a1249O633O405p425k56o147N975N910k87n739n451k917J041J1630M73J2496
$$ -11249 -4616 1789 -5636 -5892 -12039 -6064 -154 -441 -6180 -11631 -14548 -13507 -1877 -1404 11092
3825A1092J54n818O243N19o177j921K939J824r1p643j804N707l698n922L382k635
$$ 11092 11246 5428 11671 12190 6013 4092 7031 8855 8764 1121 -683 5024 1326 -4596 -1214 -3849
3809c849K76Q254K902j200j0330J011L718N153j480K828k679p687n148m771K645
$$ -3849 -3573 4681 7583 6383 -3947 -2936 782 5935 4455 7283 4604 -3083 -8231 -13002 -10357
3794a0357L60k707N131R331Q164q87p114l832P561M865p940j211K080n502Q616
$$ -10357 -9997 -12704 -7573 1758 9922 9035 1921 -1911 5650 10515 2575 1364 3444 -2058 6558
3779F558J1915n933j3483K763q73R52J882k927O92M963J416q159l141l829q893
$$ 6558 18473 12540 -943 1820 947 1899 3781 854 1546 6509 7925 -234 -3375 -7204 -16097
3764a6097P208N852L038Q30l278J533l648j2213r401L062O430J5775P246m385
$$ -16097 -8889 -3037 1 831 -2447 -914 -4562 -16775 -26176 -23114 -16684 -909 6337 1952
3750A952q112K734P713l799J0932N911n307j2125p118J0872J71J388Q7j2944m898
$$ 1952 -6160 -3426 4287 488 11420 17331 12024 -101 -7219 3653 3824 5212 5299 -7645 -12543
3735a2543R544J1382J509n311m311k190O617J91o93j233J121K58l372p418K808
$$ -12543 -2999 8383 9892 4581 270 -1920 4697 4888 4195 2962 4083 4341 969 -6449 -3641
3720c641L467N930R769o111q904q089l022j286O807M385O180K350p130j1339K447
$$ -3641 -174 5756 15525 9414 510 -7579 -10601 -11887 -5080 -695 5485 7835 705 -10634 -8187
3705h187Q022Q341j692o730q54J2016M199l337k683P341j856j1566n648j0051
$$ -8187 -165 8176 6484 -246 -1100 10916 15115 11778 9095 16436 14580 3014 -2634 -12685
3691a2685O240J0041R47j1725o080O306j852l005K480J1861Q266o107j3964M891
$$ -12685 -6445 3596 4543 -7182 -13262 -6956 -8808 -11813 -9333 2528 10794 4687 -9277 -4386
3677d386R78M472N771J590p478j727L109N441N781l289l710n880J020n087n474
$$ -4386 -3408 1064 6835 8425 947 -780 2329 7770 13551 10262 6552 672 1692 -3395 -8869
3662h869j266l175N638j46L451J0016L624k491o052m005j282j0705N644m381n176
$$ -8869 -10135 -13310 -7672 -7818 -4367 5649 9273 6782 730 -3275 -4557 -15262 -9618 -13999 -19175
3647a9175N463J3275Q158N308O426k079r459q19J97j258n879m981o392L819J0897
$$ -19175 -13712 -437 7721 13029 19455 17376 7917 7098 7295 6037 158 -4823 -11215 -7396 3501
3632C501q290j832R539m158p583m100J74N754J0496K308n617k821q378m326M994
$$ 3501 -4789 -6621 2918 -1240 -8823 -12923 -12749 -6995 3501 5809 192 -2629 -11007 -15333 -10339
3617a0339N960j337M358k658l673k88N459j19p759M737N737o860J356J1655k503
$$ -10339 -4379 -5716 -1358 -4016 -7689 -7977 -2518 -2637 -10396 -5659 78 -6782 -5426 6229 3726
3602C726l723r740m609J5450M819N026o504j0501j979k901K667J0491O15o896
$$ 3726 3 -9737 -14346 1104 5923 10949 4445 -6056 -8035 -10936 -8269 2222 2837 -4059
3588d059J088N183j363o174j06K372N740L324q360M977k302p944J322m887J079
$$ -4059 -2971 2212 849 -5325 -5431 -3059 2681 6005 -2355 2622 320 -7624 -6302 -11189 -10110
3573a0110O792K100o665o846J29O792r99J710Q370K431p57j1613q600k027J7487
$$ -10110 -3318 -1218 -7883 -14729 -14600 -7808 -8807 -7097 1273 3704 2947 -8666 -17266 -19293 -1806
3558a806M076m008o548J206L862Q430N071j0424N353o09o78n60m8k307K865R03
$$ -1806 2270 -1738 -8286 -7080 -3218 5212 10283 -141 5212 4603 3925 3365 3317 1010 3875 4778
3542D778L148l282o878l29N291K697j643O410j0364q831O927Q94j705m941L065
$$ 4778 7926 4644 -2234 -2563 2728 5425 3782 10192 -172 -9003 -2076 -1182 -2887 -7828 -4763
3527d763J2919j676r624K262M037m01q87O547R110j228o42k345m034k7J603N302
$$ -4763 8156 6480 -3144 -882 3155 2754 1867 8414 17524 16296 15654 13309 9275 9248 10851 16153
3511A6153j59n938l264m599p179l585j649J2105P381j011J80l056N61O402k168
$$ 16153 15994 10056 6792 2193 -4986 -8571 -10220 1885 9266 8255 8435 5379 5940 12342 10174
3496A0174o733r267O748L921q803r244P69Q708M263j591m564n012P041L188L532
$$ 10174 3441 -5826 922 4843 -3960 -13204 -12435 -3727 536 -1055 -5619 -10631 -3590 -402 3130
$$ [...]
##END NTUPLES=NMR SPECTRUM
##END=
