##TITLE=Analysis number 325390
Compound Code cc 63010
Book Reference 498/158/4
Project Code adrs
Chemist Name davec
##JCAMPDX= 6.0         $$ Bruker NMR JCAMP-DX V2.0
##DATA TYPE= NMR SPECTRUM
##DATA CLASS= NTUPLES
##ORIGIN= Bruker BioSpin GmbH
##OWNER= nmr
$$ XWIN-NMR		Version 3.5
$$ Tue Jan  2 10:54:17 2007 GMT Standard Time (UT+0h)  MAYBRIDGE\nmr@NMR_250MHZ
##.OBSERVE FREQUENCY= 250.131544655141
##.OBSERVE NUCLEUS= ^1H
##.ACQUISITION MODE= SIMULTANEOUS (DQD)
##.ACQUISITION SCHEME= undefined
##.AVERAGES= 16
##.DIGITISER RES= 18
##SPECTROMETER/DATA SYSTEM= dpx250
##.PULSE SEQUENCE= zg30
##.SOLVENT NAME= CDCl3
##.SHIFT REFERENCE= (INTERNAL, CDCl3, 0, 16.5323)
##AUDIT TRAIL= $$ (NUMBER, WHEN, WHO, WHERE, WHAT)
$$ ##TITLE= Audit trail, XWIN-NMR		Version 3.5
$$ ##JCAMPDX= 5.01
$$ ##ORIGIN= Bruker BioSpin GmbH
$$ ##OWNER= nmr
$$ C:\u/data/dgb/nmr/ADRS/60/pdata/1/auditp.txt
$$ ##AUDIT TRAIL=  $$ (NUMBER, WHEN, WHO, WHERE, WHAT)
(   1,<2007-01-02 10:53:57.72 +000>,<MAYBRIDGE\nmr>,<NMR_250MHZ>,
      <created by zg, POWCHK disabled, PULCHK disabled
       configuration hash MD5:
       49 4B E0 1D 92 C2 6B 37 9F E6 65 BC 52 41 86 1D
       data hash MD5: 64K
       57 12 C4 0F E8 B8 51 4A 6D D8 5C EB E7 66 CC D4>)
(   2,<2007-01-02 10:54:09.63 +000>,<MAYBRIDGE\nmr>,<NMR_250MHZ>,
      <Start of raw data processing
       ef LB = 0.3 FT_mod = 6 PKNL = 1 SI = 32K 
       data hash MD5: 32K
       78 46 EF 66 03 74 DA E3 C9 89 7B E4 A1 FE 7B 21>)
(   3,<2007-01-02 10:54:11.33 +000>,<MAYBRIDGE\nmr>,<NMR_250MHZ>,
      <apk 
       data hash MD5: 32K
       B2 8B B1 88 CD 2C 5E 85 06 CA E9 4F E6 1B 6C 25>)
(   4,<2007-01-02 10:54:12.02 +000>,<MAYBRIDGE\nmr>,<NMR_250MHZ>,
      <abs ABSG = 5 
       data hash MD5: 32K
       97 3A 9D 71 05 E3 27 F7 0B 4C BC 6A 44 3F F3 81>)
$$ ##END=
$$ 
$$ hash MD5
$$ 95 2E 76 6C 9D B6 90 F0 8F 3C 87 01 81 19 FB 3E
##$RELAX= 
##$RELAX= 
##$RELAX= 
##$RELAX= 
##$RELAX= 
##$RELAX= 
##$RELAX= 
$$ Bruker specific parameters
$$ --------------------------
##$DU= <C:\u>
##$EXPNO= 60
##$NAME= <ADRS>
##$PROCNO= 1
##$TYPE= <nmr>
##$USER= <dgb>
##$AMP= (0..31)
100 100 100 100 100 100 100 100 100 100 100 100 100 100 100 100 100 100 
100 100 100 100 100 100 100 100 100 100 100 100 100 100 
##$AQSEQ= 0
##$AQ_mod= 3
##$AUNM= <au_zg>
##$AUTOPOS= <10 >
##$BF1= 250.13
##$BF2= 250.13
##$BF3= 250.13
##$BF4= 250.13
##$BF5= 500.13
##$BF6= 500.13
##$BF7= 500.13
##$BF8= 500.13
##$BYTORDA= 1
##$CFDGTYP= 0
##$CFRGTYP= 5
##$CHEMSTR= <none>
##$CNST= (0..31)
1 1 145 1 1 1 1 1 1 1 1 1 1 1 1 1 1 1 1 1 1 1 1 1 1 1 1 1 1 1 1 1 
##$CPDPRG= <>
##$CPDPRG1= <>
##$CPDPRG2= <>
##$CPDPRG3= <>
##$CPDPRG4= <mlev>
##$CPDPRG5= <mlev>
##$CPDPRG6= <mlev>
##$CPDPRG7= <mlev>
##$CPDPRG8= <mlev>
##$CPDPRGB= <>
##$CPDPRGT= <>
##$D= (0..31)
0 1 0 0 0 0 0 0 0 0.06 0 0 0 0 0 0 0.0002 0 0 0 0 0 0 0 0 0 0 0 0 0 0 
0 
##$DATE= 1167735236
##$DBL= (0..7)
120 120 120 120 120 120 120 120 
##$DBP= (0..7)
150 150 150 150 150 150 150 150 
##$DBP07= 0
##$DBPNAM0= <>
##$DBPNAM1= <>
$$ [...]
##$SUBNAM7= <"">
##$SUBNAM8= <"">
##$SUBNAM9= <"">
##$SW= 20.6930455092707
##$SWIBOX= (0..15)
0 0 3 0 0 0 0 0 0 0 0 0 0 0 0 0 
##$SW_h= 5175.983436853
##$TD= 65536
##$TD0= 1
##$TE= 294.16
##$TE2= 300
##$TE3= 300
##$TEG= 300
##$TL= (0..7)
0 120 120 120 120 120 120 120 
##$TP= (0..7)
150 150 150 150 150 150 150 150 
##$TP07= 0
##$TPNAME0= <>
##$TPNAME1= <>
##$TPNAME2= <>
##$TPNAME3= <>
##$TPNAME4= <>
##$TPNAME5= <>
##$TPNAME6= <>
##$TPNAME7= <>
##$TPOAL= (0..7)
0.5 0.5 0.5 0.5 0.5 0.5 0.5 0.5 
##$TPOFFS= (0..7)
0 0 0 0 0 0 0 0 
##$TUNHIN= 0
##$TUNHOUT= 0
##$TUNXOUT= 0
##$USERA1= <user>
##$USERA2= <user>
##$USERA3= <user>
##$USERA4= <user>
##$USERA5= <user>
##$V9= 5
##$VALIST= <valist>
##$VCLIST= <CCCCCCCCCCCCCCC>
##$VD= 0
##$VDLIST= <DDDDDDDDDDDDDDD>
##$VPLIST= <PPPPPPPPPPPPPPP>
##$VTLIST= <TTTTTTTTTTTTTTT>
##$WBST= 1024
##$WBSW= 4
##$XGAIN= (0..3)
0 0 0 0 
##$XL= 0
##$YL= 0
##$YMAX_a= 409810
##$YMIN_a= -399922
##$ZGOPTNS= <>
##$ZL1= 120
##$ZL2= 120
##$ZL3= 120
##$ZL4= 120
##$ABSF1= 16.53229
##$ABSF2= -4.160885
##$ABSG= 5
##$ABSL= 3
##$ALPHA= 0
##$AQORDER= 0
##$ASSFAC= 0
##$ASSFACI= 0
##$ASSFACX= 0
##$ASSWID= 0
##$AUNMP= <proc_1d>
##$AZFE= 0.1
##$AZFW= 0.1
##$BCFW= 0
##$BC_mod= 0
##$BYTORDP= 0
##$COROFFS= 0
##$CY= 12.5
##$DATMOD= 1
##$DC= 0
##$DFILT= <>
##$DTYPP= 0
##$F1P= 14.0000005364418
##$F2P= -0.99999901652339
##$FCOR= 0.5
##$FTSIZE= 32768
##$FT_mod= 6
##$GAMMA= 0
##$GB= 0
##$INTBC= 1
##$INTSCL= 1
##$ISEN= 128
##$LB= 0.3
##$LEV0= 0
##$LPBIN= 0
##$MAXI= 10000
##$MC2= 0
##$MEAN= 0
##$ME_mod= 0
##$MI= 0
##$NCOEF= 0
##$NC_proc= -3
##$NLEV= 6
##$NOISF1= 0
##$NOISF2= 0
##$NSP= 0
##$NTH_PI= 0
##$NZP= 0
##$OFFSET= 16.53229
##$PC= 1
##$PHC0= 226.953
##$PHC1= 6.571918
##$PH_mod= 1
##$PKNL= yes
##$PPARMOD= 0
##$PSCAL= 4
##$PSIGN= 0
##$REVERSE= no
##$SF= 250.129997425503
##$SI= 32768
##$SIGF1= 0
##$SIGF2= 0
##$SINO= 400
##$SIOLD= 32768
##$SREGLST= <1H.CDCl3>
##$SSB= 0
##$STSI= 32768
##$STSR= 0
##$SW_p= 5175.98343685301
##$SYMM= 0
##$S_DEV= 0
##$TDeff= 65536
##$TDoff= 0
##$TI= <Analysis number 999999
Compound Code 99
Book Reference 9
Project Code 9>
##$TILT= no
##$TM1= 0
##$TM2= 0
##$TOPLEV= 0
##$USERP1= <user>
##$USERP2= <user>
##$USERP3= <user>
##$USERP4= <user>
##$USERP5= <user>
##$WDW= 1
##$XDIM= 32768
##$YMAX_p= 575719861
##$YMIN_p= -73097
$$ End of Bruker specific parameters
$$ ---------------------------------
##NTUPLES= NMR SPECTRUM
##VAR_NAME=  FREQUENCY,     SPECTRUM/REAL,   SPECTRUM/IMAG
##SYMBOL=    X,             R,               I
##VAR_TYPE=  INDEPENDENT,   DEPENDENT,       DEPENDENT
##VAR_FORM=  AFFN,          ASDF,            ASDF
##VAR_DIM=   32768,         32768,           32768
##UNITS=     HZ,            ARBITRARY UNITS, ARBITRARY UNITS
##FACTOR=    0.157963299565203, 1,           1
##FIRST=     4135.22153132454, 0,            0
##LAST=      -1040.76190552847, 0,           0
##MIN=       -1040.76190552847, -73097,      0
##MAX=       4135.22153132454, 575719861,    0
$$ Real data points
##PAGE= N=1
##DATA TABLE= (X++(R..R)), XYDATA
$$ [...]
22522 20690 19374 4749 -14789 -11324 -3646 -3395 -14724 -27318 -26592 -32880 -26856 -7976 2129
22509 2129 -6200 -17335 -8512 -17702 -33556 -28704 -5535 1695 6906 6730 -9681 -14519 -13137 -18364
22495 -18364 -22597 -21842 -22486 -30045 -25000 -3461 -3861 -7638 -10491 -16645 -17962 -19456 -8172 -4859 -6299
22480 -6299 -16640 -30697 -30546 -24521 -16128 -3549 -7217 1457 10819 9606 -1426 908 6583 4978
22466 4978 4530 -966 -8126 -402 15111 5349 9104 5634 -4047 -18921 -23644 -9297 5268 7824
22452 7824 3547 9611 -2971 -9196 -10811 -9354 -17378 -14652 -17275 -10822 -11451 -11462 4692 15244 23293
22437 23293 -320 -5057 4017 12263 13878 20954 14540 705 -13875 -11344 -8310 -11289 -20640 -16093
22423 -16093 -8249 -5102 -367 104 -6517 2989 6798 4264 -11797 -21458 -20187 -18487 -3179 3204
22409 3204 -8343 -9520 -8514 -5130 3556 1017 -8083 -14462 -16788 3044 1978 -7487 -2750 -7974
22395 -7974 -5499 6739 10131 6200 2631 8145 14580 5360 8346 2849 3774 4301 -2243 -10039 -11963
22380 -11963 -11794 -7051 4421 9514 3375 13462 14187 11882 3593 1809 -7368 -23661 -19883 -8651
22366 -8651 -3485 -8288 -23970 -32792 -34591 -18637 -10093 -10393 -16578 -24661 -25237 -22133 -26228 -26650 -20293
22351 -20293 -11066 7849 13953 7450 933 1596 4983 599 -5065 -17619 -18210 -30320 -24361 -16143
22337 -16143 -13817 -11032 -13494 -18991 -21053 -24180 -14431 12843 19486 4694 -7574 -11347 -14830 -20451
22323 -20451 -23725 -9279 -13186 -13042 7825 19252 17421 1898 -8620 -9375 -3422 -116 6127 6910
22309 6910 -2224 -1122 -1295 -4758 -15061 -14505 -14574 -5388 -6186 -742 3763 7130 4249 3642 10448 17000
22293 17000 15958 10097 -9281 -18480 -20598 -16760 -16738 -2808 -3809 -777 8002 5740 -4596 -8993
22279 -8993 -10724 -10802 -4215 4097 -8165 -16885 -9139 -584 15256 22157 18058 -2478 -14070 1967
22265 1967 -1767 -2312 -7724 -3716 1495 6012 11306 3315 -4995 -5644 -15451 -9680 -21281 -16399 -9191
22250 -9191 -18351 -15761 -14166 -25972 -27900 -28130 -15471 -11665 -16744 -9006 -7125 2008 10799 8132
22236 8132 -6114 -3939 3528 13065 5462 11651 16414 13945 2508 2001 4749 -2312 1448 -3371
22222 -3371 8711 16527 23173 23873 8913 -8467 -14464 -17834 -19594 -5195 -2038 -2357 -5211 -765
22208 -765 -22865 -30235 -12642 -5477 -12029 -19527 -17676 80 3924 6555 1966 -2259 5315 11610
22194 11610 8184 15636 23269 6805 -5695 -8917 -6534 -2157 980 4124 6913 4995 4215 -2245
22180 -2245 -1080 -2855 -878 -1987 -20442 -31815 -36100 -36143 -19725 -17201 -11825 -29830 -38824 -28459
22166 -28459 -9489 -12078 -14985 -9446 -9760 -910 -7715 -14721 -12113 -4235 5522 2990 -10043 -140
22152 -140 -2525 -26118 -29746 -18083 -3164 1905 9203 -1006 -2992 14265 18910 11593 12997 15326
22138 15326 11113 15185 13852 16904 14378 -3534 -1210 6556 9151 13218 11507 -1573 -15841 -29097
22124 -29097 -23153 -33117 -38851 -31557 -29752 -20602 -14271 -9067 -2425 -5930 -12388 -15272 3322 4795
22110 4795 2023 11352 24369 23122 4684 -1110 -6609 -16567 2179 -3762 821 -3292 -7292 6442
22096 6442 1447 3948 1951 -7464 -9009 -9206 -10208 -9211 1749 -1266 -11865 831 -2319 -1073
22082 -1073 8614 -2052 -15552 -15303 -18486 -11173 -8518 -10361 -2233 -5996 -15290 -12307 -20910 -22479
22068 -22479 -21553 -18703 -25269 -17187 -14150 -16561 -7689 8260 4405 1264 7213 6205 -7367 -8968
22054 -8968 -8180 -2425 -1447 -2508 -5753 -7071 -15978 -11689 -14312 -24141 -17261 1040 9710 964 -2650
22039 -2650 -3753 -8319 -7899 -5133 3922 -938 1158 14421 6046 1206 6748 1759 1578 1392 -8358
22024 -8358 -5600 -13516 -21071 -19586 -11141 -20590 -23571 -18730 -15308 -24024 -16681 -1094 -3342 -5124
22010 -5124 -24673 -19578 -3137 7458 -7631 -13635 -13436 -21185 -8798 11971 8096 3893 -2625
21997 -2625 3181 6150 2811 39 6855 4801 7646 10361 9625 11328 2891 -2032 -5039 -11589 -13808
21982 -13808 1728 74 -8742 7458 15277 14756 3179 -9773 -10137 -6207 -10639 -10904 78 7037
21968 7037 594 -2041 -11515 -9054 -13064 -9690 -8466 -12811 -15804 -16846 -22619 -21095 -1067 -3975
21954 -3975 -8207 -6172 5412 20637 31669 653 -7164 5090 1247 3533 -125 -948 -8615 -9945
21940 -9945 3346 8279 2794 -5417 -10046 -10085 -9665 -15604 -16793 -11606 -3602 -13099 -22512 -26426 -33303
21925 -33303 -35850 -27918 -10690 2453 3679 -6137 -6274 -7349 -6047 -13825 -19682 -15019 -6504 2557
21911 2557 4009 654 331 -1244 -5918 -2967 1091 9516 7895 -1217 -4328 -14588 -9045 578 4665
21896 4665 -1877 -1661 -4736 -12827 -10878 -9301 172 14050 10913 -4253 -5718 42 -2533 -11479
21882 -11479 -10478 2220 15727 18216 5488 -10297 -11392 -11327 -8976 -3861 -3411 -19440 -16637 5130
21868 5130 13715 2693 -1090 -4731 -5773 -6971 -2082 2749 -15013 -24584 -20669 -37667 -40195 -27605
21854 -27605 -19422 -17469 -16664 -10711 -12249 -5414 4539 10943 19196 27630 32740 22903 13512 14728 -157
21839 -157 -7078 7870 14620 14958 -1415 -5332 -5031 -15149 -17933 -6529 366 -2364 4578 11162
21825 11162 19577 23425 11830 6965 -2362 2092 11141 19878 16486 9425 2052 -9229 -2869 1372
21811 1372 -2973 -9948 -6374 -301 585 -10647 -33239 -29565 -15847 -7702 6366 11034 -4760 -10435
21797 -10435 -22587 -19013 -7797 -10555 -6113 -407 -8815 -11840 -12670 -8934 -1870 -2506 5636 19186
21783 19186 10078 9812 6223 1910 -7448 -17256 -16715 -10461 -5726 -482 -4505 -9053 -7190 -7733 -11106
21768 -11106 -10249 -25487 -14664 -9751 6321 9635 3195 1864 8556 -5927 -16964 -17828 -13224 -1910
21754 -1910 2582 4466 11086 10083 -6602 -19411 -23384 -31846 -23957 -28612 -27110 -10011 3371 -6697
21740 -6697 -19946 -17678 1619 -8817 -5267 -19466 -29562 -27288 -13400 -10324 -18815 -14123 -18547
21727 -18547 -18350 -22531 -15972 -11178 -4350 445 2596 22719 19450 17207 9887 2258 2904 -5038 -1626
21712 -1626 4319 2545 -5726 -11687 568 7373 10285 1718 -651 8555 4888 -8603 -17074 -8808
21698 -8808 -12311 -16713 -14514 -12641 1117 23758 28690 28314 25903 14409 9956 -1450 -12272 -13247
21684 -13247 -14865 -17998 1329 12673 18169 14117 -6656 -11676 -8589 -5832 3480 2927 -11348 -16347
21670 -16347 -16977 -16332 -8818 -14624 -5640 856 841 1749 6886 2549 225 3011 -1457 5515 18379
21655 18379 5528 -5944 5049 22294 -4169 -18419 -15303 -10671 -398 9868 15007 10729
21643 10729 8055 -14867 -20733 -8322 -8954 -10020 -9645 -13420 -8321 -13298 -19789 -27395 -28997 -22862
21629 -22862 -10403 -7217 -14319 -11691 -23971 -8674 4366 -6866 -5998 9925 15523 10227 -2747
21616 -2747 -1016 -12098 -18420 -8022 -3801 -6282 -1017 5234 -3864 -16461 -4205 7138 23480
21603 23480 20628 12956 17506 14517 4058 -4925 -6472 -16464 -15980 -13136 2894 6076 -1969 1361
21589 1361 934 -3959 8867 8220 9441 13458 7439 -8562 -13427 -7502 5387 8428 644 -9540
21575 -9540 -11945 -14979 -18137 -9560 -14844 -29290 -26434 -18581 -5785 -8159 -4754 10667 7388 817
21561 817 2172 2489 -6609 -241 -253 6352 15598 19162 9033 -10652 -7953 2317 15482 18107 8772
21546 8772 -2499 -496 1511 3232 1283 1625 13464 28334 22836 843 -685 6811 18552 18018
21532 18018 10815 8432 7668 5325 5313 4434 -599 -8833 -10044 -9612 -9954 -2563 12521 10881 8967 7736
21516 7736 18017 3785 -11581 -408 -9164 -11076 -7065 -14245 -20000 -25568 -23690 -21138 -20586 -5346
21502 -5346 5165 -2602 -5642 2001 4140 1111 5290 4092 17186 10105 4608 -41 5960 155
21488 155 -18554 -21753 -3787 -6996 -20274 -22956 -19023 -19789 -21060 -30121 -27660 -8922 4315 4830
21474 4830 1941 -10369 -8158 -6723 -13445 -12572 -21164 -20228 1114 5816 7285 11552 4202 -8913
21460 -8913 -879 10722 12087 6710 -18335 -19365 -27185 -16363 -9130 -17067 -7647 7550 6371 2046
21446 2046 -998 -6378 2093 7996 4336 1132 8168 8457 5192 -9043 -3773 -5875 -23058 -19700
21432 -19700 -10410 -12313 -7466 -6994 -11912 -13048 -20631 -28954 -11019 5300 -5057 -15049 -6797 7005
21418 7005 9146 3328 -16078 -31954 -24780 -14314 -12972 -2452 -8673 -4565 -4955 -2388 -6441 2549
21404 2549 15726 16155 22251 2839 -12061 -2864 7148 7793 725 -15704 -14900 -23085 -9474 5023
21390 5023 20560 27414 23172 22601 21286 1561 -17090 -2656 10397 11037 7359 36 -1420 -9820
21376 -9820 -12792 4826 10490 6406 1043 6659 11357 15738 22435 18877 1527 -13227 -20063 -19305
21362 -19305 -16236 -6308 10736 20521 9985 -7962 -9146 -11945 -16791 -3820 19775 14189 4966
21349 4966 -7758 -3754 -7532 -216 14562 12032 1908 10722 3764 -9629 -13740 -14625 -11961 -7160
21335 -7160 -12081 -11390 -1857 -16254 -19949 -6159 3318 -15278 -10736 -8860 -19367 -13818 2391 1429
21321 1429 1742 6078 6847 16264 20006 8978 2240 -9596 -1202 6538 15833 13640 4891 -2413 -11218
21306 -11218 640 9563 2306 -10916 -15538 -11154 -13030 -8624 -12970 -6400 -7176 -16232 -22813 -18139
21292 -18139 -18981 -21544 -12933 -1325 -4290 -13719 -8257 -16057 -10426 27 -5988 -1215 10524 20061
21278 20061 14058 1969 -6383 -18920 -23606 -10593 -4039 776 -6899 -12606 -14863 -20294 -13399 -12701
21264 -12701 -26082 -26687 -4697 4564 10595 6572 2799 -3900 -16953 -23297 -25539 -25672 -20551 -14109
21250 -14109 -6096 -1129 -6682 -9434 -5008 -4846 4007 -408 -10394 -5542 -17187 -17668 -12680 -22027 -25746
21235 -25746 -20657 -8656 5804 7246 3764 -1332 5327 5945 923 -10118 -16807 -10229 -10296 -26742
21221 -26742 -33429 -25056 -9765 -2999 6546 1838 937 578 -15004 -18452 -18748 -23054 -23045 -14489 -14300 -22245
21205 -22245 -13107 -5002 1348 -1502 -2726 2098 8967 6778 -2533 -8627 -14925 -23255 -28617 -14577
21191 -14577 -3011 8738 22042 4310 -7230 -10643 -6242 -10194 -2830 5023 10424 10870 9028
21178 9028 12515 19375 16549 19717 17523 10416 21821 26680 13223 17857 16681 11657 3856 214
21164 214 -3942 1415 1892 -466 -8845 -15600 -1624 -25533 -39015 -22875 -8790 -7818 814 -5844
21150 -5844 3840 852 -4620 -18727 -10890 9326 15489 18072 10335 -783 6849 -12912 -19943 -17153
21136 -17153 -8328 1770 2547 2508 -5279 -15082 -19424 -14861 -16954 -15906 -6111 -3728 6837 -1588 -2217
21121 -2217 4778 7675 12369 23298 24570 16881 21096 11876 -4189 2991 -3662 -13287 -9860 -2768
21107 -2768 1965 7244 589 -20477 -19817 -5566 -4805 -12795 -5642 10910 16167 3475 -12511 -11344
21093 -11344 -8563 -8119 -6231 9216 26141 28869 19340 15153 10802 744 4150 9489 7777 9277
21079 9277 -3581 592 11723 11113 5810 6887 4687 11107 22852 15437 6591 1633 -3961 -9804
21065 -9804 -2880 5007 8401 -621 -13772 -28270 -23131 -7823 -9101 -5739 9888 5419 328 -12758
21051 -12758 -9615 -3601 -13612 -12048 -154 616 -11843 -13916 -10925 -2175 14396 17841 21403 13257
21037 13257 -3783 -15955 -5623 -14353 -11623 -6892 1042 -450 -11843 -4541 -17142 -16657 -13263
21024 -13263 -11438 -5438 81 17294 3020 16 4887 -2928 6811 18578 22228 16778 11974 -3558
21010 -3558 -4293 -6134 -10898 1168 19296 18510 20308 16556 -1431 -12487 -3364 6655 -535 -2561
20996 -2561 1118 -2946 -3945 976 -5733 -4345 8023 11835 3986 -9853 -6579 -7702 -11446 -21462
20982 -21462 -21046 -10994 -8770 -3149 -3931 -7016 5272 14672 10006 20099 16758 3457 -5779 -16626
20968 -16626 -16303 -11754 -13904 -22470 -16823 -9327 -5338 -12211 -13549 -4084 10238 21498 14648 16003
20954 16003 15849 9227 5538 -6923 -9271 1546 928 13317 20950 15768 3609 8486 8221 750
20940 750 -2354 -9665 -9198 -19891 -24493 -8715 10201 10724 -3572 -7048 -7405 -2124 -102 -1130 -6664
20925 -6664 -5216 -6303 2278 22953 21638 10697 1379 -5675 -8647 -3136 -264 4874 4437 8694
20911 8694 8791 4646 2549 -11473 -4997 -9464 -11421 -2833 -4068 277 -8225 -690 4196 8072 16123
20896 16123 19862 11845 6047 -3761 -6115 -12529 -10119 -3936 -12368 -14582 -21121 -12924 -6157 -16137
20882 -16137 -11341 -3692 3685 4190 7299 12780 1706 -15966 -21089 -25133 -21967 -25049 -23484 -12415
20868 -12415 -5456 -5977 -9279 -12018 -5865 -3677 3397 2850 4239 -13284 -25066 -20768 -21970 -20017
20854 -20017 -10216 -10605 -10036 -11463 -10742 -355 3618 4978 4233 8587 6406 -324 -623 3560 6370
20839 6370 1768 820 4241 15069 14090 16385 20202 20218 8774 87 -3288 -360 -10326 -27487 -34854
20824 -34854 -23649 -3892 -15283 -28289 -28010 -17896 -5882 -6020 -11280 -11266 2375 119 11786
20811 11786 21236 23155 1600 -28798 -25927 -16142 -29644 -29749 -24527 -21509 -15139 -9066 -16117 -6347
20797 -6347 -8581 7138 13237 16086 8961 -4421 7899 -6261 -18972 -22162 -12491 -1340 -5222
20784 -5222 -12624 -9807 -2636 11610 3250 -14 -2512 -10618 -11696 -9192 -11521 -9868 6297 -889
20770 -889 1567 11387 -2822 -277 11757 -1871 -22044 -18347 -15301 -14143 6465 11573 6946 6220
20756 6220 -7243 2502 1135 -7511 -11974 6709 17022 20931 17150 12690 11489 12042 6155 -13395
20742 -13395 -16659 -2325 6668 2579 -3662 -17323 -14329 -18802 -3400 845 -12294 -8714 -689
20729 -689 3600 -4464 -31 10350 6291 11720 16663 14175 4126 -5830 -15221 -16079 -12028 -10578 -8565
20714 -8565 -11463 -1904 -5716 3924 14229 15704 1364 12726 8707 -1959 4196 12080 19669 23588
20700 23588 18152 15141 2807 618 -3067 -7598 -14001 -14738 -1624 13537 12252 3318 -975 -264
20686 -264 2711 53 -9522 -15258 -18046 -22072 -17339 -13764 -6899 2290 1536 159 1924 2522 -801
20671 -801 4413 5947 18519 16214 10009 11638 16712 13834 13797 9264 -3086 -12387 -14486 -16311 -3475
20656 -3475 6273 4243 4291 6100 -3790 -3935 -2037 -13713 -10115 6042 -6069 -14801 -17379 -17473 -17398 -2975
20640 -2975 -10865 -19152 -2602 2358 -5949 -12991 -16991 -8858 -11620 727 4759 11753 -6642 -7918
20626 -7918 404 -9813 -148 2366 3751 -5737 -8648 -8610 -9666 -4780 1725 -7752 -9112 -12390 -6891
20611 -6891 -9080 -5411 1639 657 -7803 -15261 -22685 -16714 -3651 66 7217 -1134 -10559 -4031 -4598
20596 -4598 4240 3747 -2059 -7755 -5643 -11498 -13136 -19275 -10234 -2610 884 7682 20382 17036 -6005
20581 -6005 -12649 -12329 -9785 -6265 -6464 -5474 -11965 -9636 -21599 -28541 -14104 -14468 -13733 -33922 -34565
20566 -34565 -31110 -31077 -23157 -12098 -12099 -23779 -31492 -22787 -9370 -8273 -16440 -22716 -11184 -20521 -36652
20551 -36652 -35469 -25759 -31671 -22020 -23490 -29250 -11043 3924 -8781 -12547 -18063 -18149 -13711 -384
20537 -384 -3720 -9571 -12579 -15870 -17466 -20056 -23055 -17061 -19417 -16441 -22771 -18242 -16646 -5484 -8563
20522 -8563 -10151 -13701 -7234 -8922 -11395 620 -7213 -10290 -1287 -2437 4044 12956 14283 -436
20508 -436 -8071 -2977 1096 752 -6111 -13473 -30506 -27824 -11975 -10803 1388 -10208 -17184 -1451
20494 -1451 19495 11952 5155 6668 10514 2903 15912 9322 17136 35071 23387 7999 8550 1219
20480 1219 -5750 -3112 10895 5004 118 -280 -5699 -7842 -7382 2547 12873 8158 4383 -4011 -8574
20465 -8574 752 -5407 -10310 -20060 -14036 -3204 8962 9024 9914 2073 -19691 -27502 -25652 -13493
20451 -13493 17239 18016 -8646 -19100 -15786 -5372 -7085 -4679 -13146 -17187 -6950 2626 -181
20438 -181 -8182 -12872 -5376 7084 -4431 -14335 -11026 -6586 -6977 3500 -683 7729 15953 2895
20424 2895 -13012 -16975 -2345 -7987 -7335 -3587 -3844 10141 15134 13837 11927 9456 5718 -4964
20410 -4964 -19591 -2824 8875 95 -2798 -8369 -14551 2026 1386 1002 -2051 -8106 -10057 -2669
20396 -2669 -8691 -15753 -28673 -27540 -20933 -6773 9242 18057 4804 3171 8110 13493 9270 4532
20382 4532 13841 19972 16857 16299 10239 2524 13030 22538 5594 -11047 -9987 -8504 -8905 -11537
20368 -11537 -7901 -5144 -890 2907 -383 -1804 -1273 -22806 -21927 -17530 -4680 193 -435 1009 -6735
20353 -6735 -11716 -6865 -401 -16765 -12480 1489 11012 8229 15641 11704 5789 9528 -1667 -7867
20339 -7867 8816 7022 -2401 -521 -3471 -8548 -8434 -8362 -12021 -5964 -135 5025 9948 20393 19629
20324 19629 17083 9463 10942 3326 -8224 -1071 8579 16775 33872 32548 12184 11053 2227 -16955
20310 -16955 -11266 -3351 -795 5104 -9764 -19471 -10935 -2486 -733 -4508 -17815 -12183 -4748 -3313
20296 -3313 1732 5555 5662 3512 -2204 -9811 -11194 -11546 -25028 -19890 -9739 -2876 -3150 -25526 -24565
20281 -24565 -8118 8554 6482 -5912 -16593 -18482 -4379 -16707 -21127 -9874 -19674 -18614 -18877
20268 -18877 -10796 -7090 -6977 3898 15506 15820 11263 2554 7532 -1137 -9112 -23692 -31696 -21134
20254 -21134 -4297 5287 -5364 -14414 -20259 -18019 -10286 -6652 -5630 -1007 -6980 -3371 -6205 1969
20240 1969 13684 13809 2793 3494 -7514 -13151 -10173 -12964 -9764 -6840 -12395 -20253 -9569 -315
20226 -315 2390 2822 17081 9028 6504 16667 18894 9688 6805 -11447 -11293 -11016 -5127 -13354 -18015
20211 -18015 -17384 -20029 -3199 25157 13395 8482 16015 19873 10929 3706 -9530 -16186 -17153 -5542
20197 -5542 1686 7123 1671 -2246 -5850 -17826 -5822 5846 10653 13100 22469 11610 11315 22055
20183 22055 12073 13130 7012 -7682 -1053 5661 4203 16063 28329 20875 6536 4353 805
20170 805 4186 5941 9862 20636 33243 21315 7272 3720 -1885 1252 -3276 7309 13797 5275
20156 5275 -7782 -618 -5187 -7296 -6451 -18290 -20775 847 20630 11561 3715 -1410 -2024 -6015
20142 -6015 -12142 -439 12050 8654 4085 -13993 -11904 3111 8931 12938 4200 -4104 -7376 -11234
20128 -11234 -5771 -9765 -13994 2079 6386 -3948 -2979 -8575 -16068 -13791 -8641 8858 3875 1544
20114 1544 -952 -1498 -383 -4791 -7379 -22081 -19614 -6503 -6547 -6505 -8994 -8651 -16246 -16588 -26368 -26277
20098 -26277 -18476 -20830 -6378 8410 -3457 -6560 9611 3881 -402 -17147 -18916 -25761 -29162
20085 -29162 -25837 -13339 -3649 -8394 -13481 -5977 -22704 -20601 -9597 -8467 279 5796 -5553
20072 -5553 -18224 -12197 -10065 -17389 -13455 4556 10334 5111 17944 16137 -1983 -4180 960 7247
20058 7247 7478 -10981 -28347 -11495 4250 -635 8096 19537 14877 -2230 2148 4890 2722
20045 2722 -12871 -23325 -36743 -45717 -27481 -3315 1399 16295 3988 14079 12315 24753
20033 24753 19239 3020 -13090 -14991 -6344 -9472 -12373 -11644 2282 12926 6872 8333 2373 -6196
20019 -6196 -5577 -2875 -12747 -12648 266 16266 13968 16297 14467 12176 3756 5190 -2986 -16904 -7855
20004 -7855 1825 5065 3340 1552 -5027 -433 -4875 -260 -433 -8280 -17222 -16710 -15314 -25203 -29708
19989 -29708 -23080 -26611 -35240 -26465 -20670 -18752 -4133 -276 4205 -12775 -20160 -12082 4420 8109
19975 8109 9643 6391 -1217 -7896 -16060 -20311 -16314 -5863 9954 18290 7974 -1855 728 3047
19961 3047 7404 -6694 -19248 -12994 -17885 -19322 -10957 -8780 -1170 3778 7564 -1141 -3688 14692
19947 14692 31051 32807 19199 22708 19404 8795 -9732 -14224 -7584 -3325 -2974 -14216 -12796
19934 -12796 -5109 -5918 -18065 -24728 -13169 -2967 -608 -2492 2906 -731 10794 7429 8983 3140
19920 3140 6890 3897 -1150 -4375 -8612 -21023 -31055 -26121 -37065 -32877 -17788 -12337 -9205 -3837
19906 -3837 -23 -10269 -11519 -314 -6509 -8866 -15174 -22867 -14821 -6225 -95 -3055 636 3238
19892 3238 -3218 4127 9482 14736 10572 10247 16229 29548 24055 15355 15523 13991 11258 5691 -5663
19877 -5663 -5962 -7044 -18975 -14640 -1388 -5314 -2296 -6227 -16208 -22892 -14364 2763 16114 12532
19863 12532 3837 -6072 -9560 -8560 -9163 -10741 -2318 1373 -4284 8912 18528 2186 -2459 584
19849 584 9931 5389 -12799 -25239 -19910 -7277 -6642 -10865 -4497 -9678 -6990 3013 2806 -5646
19835 -5646 -17346 -17201 -23589 -27700 -19930 -13700 1688 11112 20405 18908 5596 -3419 2652 8538
19821 8538 10930 8317 1409 -8700 -9893 -11688 -8138 -4234 11916 13382 19432 18464 21596 15869
19807 15869 10867 13780 7672 -174 522 3530 3488 1382 -3997 -13556 -9899 -7792 -6773 -5592 1580
19792 1580 8808 15444 1872 -9347 -4734 -7250 -5665 1529 -2268 -1156 -10417 -11852 -2934 4909
19778 4909 2990 -14909 -23021 -18274 -13690 -5431 -6904 -13561 -15213 -10064 8198 21165 18958 18476
19764 18476 17524 8889 -3864 -7042 10049 8135 6048 -7635 -9702 -6740 -2990 -10519 -11161 -3438
19750 -3438 2456 5029 -4250 -2797 -7644 -11273 -7229 -2241 5295 22235 12286 12395 9361 -4351
19736 -4351 6377 27529 25587 10816 8055 759 -2338 -7508 -17220 -7790 1105 10575 9545 -869
19722 -869 -6200 -28607 -25087 -20745 -5964 1015 2640 -9926 -6696 -9173 -4586 12399 11133 5626
19708 5626 -235 -8634 -7377 6190 -6932 -9359 2687 4278 -3405 -12436 -10553 1956 -13122
19695 -13122 -17364 -2992 -2971 -6305 5526 9049 5473 11903 13125 9374 12189 12610 -1806 6303
19681 6303 312 -4212 1870 5216 -3288 -8714 -15910 -14052 -12496 -12875 -22049 -16536 -5068 -1921 -2272
19666 -2272 -624 -2716 4676 3237 -983 -3156 6552 13179 9612 7194 471 1555 4517 5311 3103
19651 3103 10207 17555 24174 16966 11877 16583 5222 -258 10295 21757 13691 -3787 -12203 -7111
19637 -7111 8886 15638 12081 2473 -3214 -5554 -2929 -4224 -604 -3536 -11453 -6467 -8443 -6585
19623 -6585 -5966 -5142 537 -12353 -7756 -6238 -1809 14095 22735 6506 -6429 -2951 1865 20694
19609 20694 23095 27681 23361 30164 34975 20215 2516 -9929 -5979 2057 2260 3724 -11897 -9292
19595 -9292 -12104 -16469 -8468 1846 4895 1532 10378 11683 28341 31004 29311 20730 13485 27
19581 27 -6301 -3733 1176 -1863 -4008 -9709 -1092 11108 5922 -8453 2651 -134 1592 820 -988
19566 -988 6362 1370 -8076 -17434 -25206 -20223 -9957 1820 15257 11128 6711 10702 29782 32064
19552 32064 24211 17125 1345 -10235 -10807 -1656 7941 10599 -1393 -10676 7874 5299 4198 4780
19538 4780 -2991 5028 1071 -58 8091 5857 6160 8685 2389 -11572 -12662 8802 16363 9297
19524 9297 -1643 -9160 -9656 3167 25135 21792 25414 22786 15960 12202 5809 54 -9793 -3963
19510 -3963 5109 6909 6264 1902 -1468 -2892 11645 34037 41927 32791 14768 5328 -2941 -2297
19496 -2297 -6877 3042 15544 28472 35236 36744 26262 28386 24378 9569 2444 -767 -10860
19483 -10860 -17854 -13713 -5918 4921 7027 2080 -2667 2099 -2677 -12948 -10902 -15993 -19379 -14063
19469 -14063 5737 17559 15020 1686 -7888 -7038 -13386 -496 3097 -1431 3200 12517 13226 6853
19455 6853 -5480 -10155 -14209 -19222 -4893 6856 15573 10674 13758 13485 8305 -203 -9110 -10437
19441 -10437 4369 -8914 -3541 3601 -5851 749 16483 11593 5838 -574 -1195 5036 986 8097
19427 8097 1654 -6507 -8002 -6786 -20481 -5711 892 -3902 -5901 5135 689 3741 15482 600
19413 600 -3976 -6862 -17952 -14514 -10341 -363 14053 8647 2379 4005 1153 -2172 2516 -8801
19399 -8801 -8909 -5144 2575 -9490 -3641 19369 16948 8269 7560 13743 10474 2159 -6084 347 3427
19384 3427 -15661 -16865 -9896 -10807 -5125 -6623 -30478 -36508 -32789 -27643 -8284 -2618 306 -2327
19370 -2327 -2025 -7424 -5945 7941 9175 5538 9548 4408 775 4024 5955 7896 9061 13248 11594
19355 11594 -168 4912 -977 -5331 -2362 7950 17910 27048 13655 8030 -2934 -11030 -13938
19342 -13938 -21300 -21135 -5019 11348 20103 7257 67 341 715 -8337 -10018 -12179 -8485 4048
19328 4048 -12286 -8799 7620 6759 -2556 4944 9782 15076 21778 33376 32999 14679 2053 898
19314 898 -2949 -5451 -8633 -8750 -19222 -7995 11245 4742 -7851 -1207 740 -1569 3741 18917
19300 18917 13715 4529 15877 18042 6365 12803 14009 432 -7506 -7844 -12437 -17654 -19146 -11153
19286 -11153 -8296 -9809 -17026 -21321 -9835 -4058 452 -1323 -2424 -3390 -4297 -7071 4774 9912
19272 9912 19522 18282 22083 24797 9665 -7875 -9588 1184 16246 13745 8987 12319 21739 11066
19258 11066 3773 10315 4291 -1253 2393 -4691 -1214 5888 15833 14999 15182 6450 2999 5576 4808
19243 4808 -6874 -1870 -5664 -10703 -11703 4165 12823 14926 18557 23496 30267 26733 12372 272
19229 272 1556 -3346 3011 -5165 -15154 -21091 -18593 -472 4891 -7031 -19172 -14687 -1433 7292
19215 7292 12940 13590 11244 -4612 -5838 -985 -3058 -10895 2758 18316 16286 12926 20088 26097
19201 26097 28494 27040 23906 16475 13794 15618 22932 19370 17457 20331 15129 13003 8042 11626
19187 11626 24301 26121 20489 20667 25192 12707 8043 2469 -3807 -7753 -13761 -12883 -10525 -5089
19173 -5089 12265 40109 49747 41190 21661 7891 8128 8209 10655 15491 3176 -12081 -16351 2563
19159 2563 3367 6698 3585 2890 -3212 -11272 -10799 -5078 8743 8274 -2117 -4718 -7593 -6692 1136
19144 1136 2841 -5784 2023 8901 7845 10317 -2980 2768 3886 -1464 2733 4099 -656 82 5301
19129 5301 18813 20392 9825 3444 8047 -2643 746 8308 6266 16386 22441 -964 -3686
19116 -3686 9843 23135 25303 18890 -5458 -15314 -6867 -2916 1780 9375 -2790 8904 18755
19103 18755 16461 17449 19399 24641 35179 26819 21264 17806 22941 28324 23073 19665 16756 20948
19089 20948 20809 16240 13436 13712 17068 19607 19428 13862 3733 -2274 -5442 -1916 -9916 -12659 -9988
19074 -9988 10163 14014 -121 -13574 -15941 -10186 -14952 -10686 -8568 -15805 -14356 -4137 7757
19061 7757 8111 10358 -2701 -2857 18035 22472 9247 8824 23921 36673 39318 31382 2440 396
19047 396 12998 27963 45905 42298 30719 27191 23315 18411 10844 9077 15329 13428 10413 20862
19033 20862 26597 25398 16372 14096 5320 3442 16633 7698 17041 18874 21675 16635 13284 16415
19019 16415 7931 13754 12243 11925 24580 40624 27085 12128 21506 30745 27193 25706 19255 20121
19005 20121 27240 20000 10725 33352 27394 20610 9805 12015 15333 18679 21587 6310 5362 3256
18991 3256 10252 18542 26000 23310 18222 17482 25417 30433 28098 24159 25088 21831 12972 14472 5851
18976 5851 -4316 -5607 -432 554 -3277 -3549 1436 10728 12898 19033 18758 12901 17205 23153 34772
18961 34772 42892 45079 38746 23031 18405 22409 24871 15719 11636 11096 14853 18842 11261 16729
18947 16729 19834 16467 19150 9598 5261 13369 19971 32225 37091 34208 22329 14595 19725 24830
18933 24830 31839 35852 15716 7401 13024 3686 5880 10472 5935 15360 27309 34427 36086 24667
18919 24667 10154 6802 12927 18173 22022 16648 14759 14228 13294 25370 22519 7562 -7231 4937
18905 4937 20015 35128 42190 43627 36379 35126 33455 38833 39169 42436 39124 45198 48336 48723 38085
18890 38085 40061 35734 44307 53058 60592 68251 70390 69336 64170 80160 104750 120834 138530
18877 138530 150947 151797 155276 169595 194916 203726 201412 187266 166694 150305 171265 186634
18865 186634 198272 207346 205745 194052 173482 186871 212125 215353 194215 170861 160757 144725
18853 144725 117506 99424 90644 83124 80258 73496 55919 49406 45659 33719 30109 33749 30294
18840 30294 33822 20021 15667 21526 27892 38963 49138 53720 39360 30084 41987 56356 66410
18827 66410 89379 115441 129220 131362 137828 164805 187409 209579 213561 199082 191590 194357 199146
18814 199146 207787 207104 200051 198189 194533 201279 226890 236996 215910 191201 184473 168473 146073
18801 146073 135010 130307 122582 93785 72663 64813 56352 51978 60811 69270 82297 86842 81905
18788 81905 87700 88183 82559 91032 110534 127404 145029 167101 194094 220921 225793 229727 245624
18775 245624 292896 342134 368387 382242 384400 383144 398431 437378 493933 505828 494363 458670
18763 458670 420535 418430 409750 386762 362417 324000 277667 234623 220021 221877 221270 207813
18751 207813 176730 151488 121929 102710 82413 83729 79419 72667 53337 51741 49304 38182
18739 38182 29613 38222 49015 38656 28910 35040 38356 27089 45078 57664 53127 47491 43517
18726 43517 45261 38245 37363 24775 27805 20767 27914 29455 39554 27327 9925 836 -1913 4795
18712 4795 8179 8928 8607 15771 18242 16131 16810 18285 20015 19862 20042 20972 34583 47350 40534 35906
18696 35906 40988 29865 19529 16547 19788 29890 34758 34138 44259 47283 42093 37144 30617 30355
18682 30355 40098 43891 50278 68407 55282 28890 12657 13580 18813 21868 28461 26634 25260 25739
18668 25739 35204 29393 21777 28122 32875 19887 9271 9584 7706 13286 23663 26032 5674 8113
18654 8113 23111 23747 28325 25529 20276 30160 35195 26355 21736 35949 41758 40649 35737 16501
18640 16501 -2124 1054 23993 30055 29662 26809 33915 44115 41213 38963 51609 62123 58608
18627 58608 50915 45063 37291 27926 42534 47723 52951 39091 42460 47822 41613 44509 42895 50244
18613 50244 40694 29283 32700 38343 34611 36914 50124 60238 66977 65443 59999 64964 61721 70897
18599 70897 81292 79802 88768 96058 95731 93609 100316 89275 91655 85356 80397 71970 79939 87547
18585 87547 103139 90695 86535 84120 76499 79359 82738 86433 88288 93546 91303 76836 49354
18572 49354 45489 50849 51227 39532 32200 31003 43486 63621 66628 61966 72853 90665 76907
18559 76907 61647 61796 74954 77602 78126 77222 59069 44940 44910 47137 47359 63992 88940 97053
18545 97053 94454 92280 101137 105005 109305 119305 114696 106942 102514 112834 104808 98399 98635 112635
18531 112635 123463 131359 141047 136251 125070 123372 116886 118392 124883 112016 118516 143052 138499
18518 138499 145586 163345 185166 202880 236596 261188 304115 388336 489662 583351 654085
18507 654085 723598 751341 755264 769034 780330 786664 810463 818478 816695 836568 899983 954548
18495 954548 976948 983976 987522 972712 982254 959942 908657 837482 733300 596207 475419
18484 475419 393235 329873 290492 271250 256280 253445 252569 246579 243236 232128 223022 247051 243915
18471 243915 226039 226408 227542 218091 232079 235852 229203 226899 231381 225348 234114 236328 224432 205904
18457 205904 203294 210825 229954 238155 237177 258854 298952 363525 475039 573212 619911 613314
18445 613314 612277 622425 629586 596680 541715 468974 409221 401782 442437 502973 539552 557273
18433 557273 560205 554847 578095 576440 530272 492250 432693 384004 356357 347790 347043 347862 346162
18420 346162 334691 337657 331904 342336 345483 350968 355049 360704 351034 328056 341709 359599 373723
18407 373723 385610 375112 378653 387304 399092 427428 450257 468732 502956 569676 656556 769469
18395 769469 857019 890120 888142 905243 943177 948383 915292 855360 822627 829681 879425 975393
18383 975393 1084271 1173662 1223528 1251575 1312309 1379705 1373183 1339988 1317585 1323618 1376670 1450467
18371 1450467 1520726 1591507 1694814 1824633 1970347 2130823 2304142 2510195 2749714 3074949
18361 3074949 3519884 4108652 4946026 6171844 7948421 10457648 13563172 16332258 17992998
18352 17992998 19125101 21047723 24632741 28614940 29952589 28319404 25916344 25169556
18344 25169556 26722224 29244360 31075506 31114488 29778212 28907468 30206783 33895970
18336 33895970 37080698 36146063 31834959 27079364 24272148 23020856 21236804 18015878
18328 18015878 14146962 10772915 8393939 6833326 5808102 5114464 4609235 4247818
18320 4247818 3998562 3815049 3700757 3616800 3580374 3602697 3643360 3712273 3827296 3995770
18310 3995770 4239686 4596067 5133000 5921466 7038122 8643079 10954985 13848228 16445713
18301 16445713 18011132 19086441 20907253 24310625 28204167 29715206 28454754 26499968
18293 26499968 26201751 28337862 31729048 34605720 35450122 34526283 33937828 35772425 40455213
18284 40455213 44634307 43841784 38813715 33046539 29587045 28140789 26187420 22522657
18276 22522657 17984836 13969935 11143151 9351968 8227992 7524411 7107549 6913241
18268 6913241 6922153 7104014 7413336 7890820 8609389 9689302 11333176 13825227 17449884
18259 17449884 22293228 27568360 32002182 35557435 38545663 40766022 43083636 47343855
18251 47343855 54091902 60403669 64675852 67807831 68765841 66836312 63558170 61005505
18243 61005505 60087788 59539554 58860346 58226919 57864018 57357904 54949784 51407390 47662537
18234 47662537 43086560 37837817 33285501 30554910 28819083 26898086 24580168 21707349
18226 21707349 18198547 14504705 11304796 8970883 7370693 6240243 5404553 4753995
18218 4753995 4213671 3770316 3407156 3098321 2844581 2621275 2411407 2217501 2040239
18209 2040239 1875060 1730143 1601843 1487262 1376817 1282241 1189235 1119592 1045287 986474
18199 986474 925668 862989 802008 763371 737972 711369 680542 651112 621281 584053 558539
18188 558539 537485 523502 515270 504046 478080 461454 461313 457327 428152 412816 406485 398064 386721
18175 386721 372488 351926 330905 318310 305024 311937 302376 276602 269967 269083 259529 228154 212602
18162 212602 211624 207357 204176 214633 209635 212365 216181 212125 216487 207802 202327 205715 206558 212554
18148 212554 221694 236462 240274 245821 258547 259176 257931 262559 267770 268236 266862 277864 294044 294294
18134 294294 309968 315506 320869 322535 319001 348618 375867 418237 453288 492118 536417 582800
18122 582800 649688 722011 820380 949519 1116103 1352841 1643369 2057969 2674676 3638382
18112 3638382 5210831 7813511 12015468 18138531 23338227 22720177 17670897 11487380
18104 11487380 7195785 4821749 3469737 2604661 2035613 1648888 1368052 1143655 979984
18095 979984 855472 751179 673558 594303 526227 477728 446455 406133 369198 343095 320815
18084 320815 300531 295089 289220 273651 249494 236082 216230 213377 199800 182732 173727 161931
18072 161931 145881 128685 116965 107511 116220 132412 129837 122787 128891 127600 112699 100189 91385
18059 91385 81265 83678 97832 100111 83008 75485 89918 98158 100092 105092 113832 105896 108389
18046 108389 109806 99982 81985 68453 73314 68247 77613 81109 81804 95466 101266 81964 61513
18033 61513 53804 60524 81225 93442 98004 90568 73490 61546 77422 92603 85767 79725 82250
18020 82250 79103 66666 62352 58525 61260 55111 57713 62023 74257 80448 74373 59510 43931
18007 43931 38938 31350 28754 32718 41913 44465 53211 64475 58052 59174 53143 43019 50014 48645
17993 48645 47016 41333 37388 37803 31718 33768 34397 14867 8103 -1375 14805 25320 26546 27013
17979 27013 36618 19503 1633 5299 34323 39715 34540 39063 45253 45035 33563 20574 20812 16843
17965 16843 14409 14227 9456 6424 -2443 12120 15295 -1436 -1825 4307 19739 33154 35524 36965
17951 36965 45901 31618 9270 6151 11449 10423 -7043 -4757 12057 11781 10613 -8915 -19357
17938 -19357 -14938 -9326 -3407 3716 -9071 -10628 -4791 1212 12883 16385 16604 9124 12934 20569
17924 20569 12909 13996 29545 31978 24709 25012 33730 28786 33634 33823 32623 27834 17873 5501
17910 5501 6640 18959 22296 26496 22904 28768 27165 23887 25061 22459 22614 29105 23934 32256 38695
17895 38695 31124 25186 18813 24858 25038 7811 9276 24173 26684 14773 19438 26931 25871 36533
17881 36533 37850 43876 37981 36625 35427 17259 -2232 -8957 -11650 -4111 -1470 3086 2324 9556
17867 9556 19475 20491 18926 12401 5402 3089 12690 11391 12828 24281 28047 15566 11177 8368
17853 8368 14687 11866 9975 15084 21511 9239 6799 10562 4153 3538 -11456 -9192 -12331 -7959
17839 -7959 -4150 15422 20481 24791 16557 16076 17488 20504 42969 57753 70765 80300 89322 98628
17825 98628 102496 99139 111383 125188 144235 165630 188657 190780 187592 182962 181465 176890 167599
17812 167599 158423 149011 142661 140170 142462 153377 164065 155272 122396 93369 82480 93012 90948
17799 90948 72334 62156 42905 23932 24951 31410 36919 19316 10628 24707 40022 32567 23985
17786 23985 23249 23290 22498 19158 12103 16784 18381 21906 39961 40555 48061 58555 89603 126141 142996
17771 142996 142932 154330 192116 213011 227216 237347 216262 193360 176174 174365 179614 194893
17759 194893 202093 189918 195771 190498 188424 190890 188263 177930 165922 148161 130194 124241 124393
17746 124393 115644 90737 69828 66514 68754 59624 58199 67849 75938 91372 104592 119833 135416
17733 135416 157733 203020 253141 323208 395470 473498 559064 596615 605095 614865 618038 605649
17721 605649 582097 548352 518338 502589 464764 432983 418045 405370 394374 375208 375044 372903
17709 372903 387851 378953 351618 341939 324783 280033 243419 216129 192653 191474 190401 160447
17697 160447 128489 108638 90928 80411 72296 58203 53505 52249 54540 60674 64267 72098 80585
17684 80585 75375 61950 76977 99345 123919 143368 178521 201182 242083 283646 320291 337893
17672 337893 327241 299806 268633 222725 196923 173341 137077 107721 78880 54846 46546 37992
17660 37992 27075 35897 25572 27638 21510 10755 9152 20148 21251 20323 35204 41384 28624
17647 28624 16858 12752 7726 11383 8299 14553 14618 10338 8177 10080 15888 18574 9217 280 496
17632 496 -2018 3395 7896 4430 19992 25578 19389 18409 16004 24761 14342 5428 768 1943 8658
17617 8658 10178 7509 -1500 -19149 -13068 -724 4725 542 -9111 -4839 5879 4234 -2688 2273
17603 2273 4782 12962 16032 -3682 -4959 4731 12677 15857 14252 10 21099 26987 27776 26162
17589 26162 26219 26377 11700 -6693 -12804 -3208 4579 12322 26396 14017 -2431 -633 1103 4244
17575 4244 15343 11015 10373 14734 -2539 -3661 6796 10381 15272 25600 16319 7208 16208 19058
17561 19058 17367 12004 17573 18583 22045 6822 -12453 -8832 7887 5922 1262 12739 16335
17548 16335 23621 23866 26291 27768 34237 29724 28272 22322 23053 1589 5871 13406 6037 7390 5948
17533 5948 4532 11296 10986 15127 16025 27603 40995 27830 9846 6923 14462 21706 11878 14331
17519 14331 30506 13757 2063 4674 18315 5986 7395 21268 23070 640 -7057 2441 9958
17506 9958 15121 10810 27620 31590 18594 15166 12848 18964 27001 29140 29407 50614 71140 62582
17492 62582 45604 26605 20188 27610 15685 8363 -4627 -14377 -15832 -4978 9285 20411 21821
17479 21821 14431 19979 33270 37825 30914 29880 42249 45898 50003 58133 70872 78017 61210
17466 61210 53742 59437 75884 91891 97999 106802 108738 96234 78332 68739 69140 58952 37635
17453 37635 36586 29521 17183 16435 22603 28338 31886 39643 40332 52189 87950 118494 147293 139540
17439 139540 124060 100962 88118 82056 65923 53305 56314 43803 18283 10852 29919 33171
17427 33171 26080 19846 19621 29033 34118 43511 51823 50370 48378 40801 34212 37647 41949 41703 51743
17412 51743 60192 67421 72328 53797 42208 44355 34428 39076 47069 58965 59643 44566 26583
17399 26583 25566 35382 34165 31335 25432 18377 12593 19255 30812 39771 38001 36696 36054 35517 42135
17384 42135 70721 72072 64753 54669 49585 50176 45999 47217 41027 32472 26795 24919 25848 23390
17370 23390 11093 11353 15957 23248 23621 35451 36032 32655 35866 50180 55073 78302 94796 99832
17356 99832 100850 102962 85424 66028 62500 60863 70150 70116 86841 112219 126102 124574 140847
17343 140847 156763 161735 167662 196799 206515 197695 208168 208856 192708 189089 170629 142334 131946
17330 131946 127566 112857 112696 109666 113463 112287 111356 109769 99699 96024 81030 71923 71015 83924
17316 83924 90614 84377 85201 88235 100559 103800 104438 87138 96491 119433 132183 144531 142016 152289
17302 152289 165310 160294 155376 153865 151726 154935 162261 176369 191231 212178 224453 221106 226623
17289 226623 247640 280148 290998 293861 296077 304693 311503 312501 303760 291843 279258 271649 266437
17276 266437 259567 254837 267606 285635 289288 289194 297724 318563 328402 343437 369950 398347 417468
17263 417468 440240 484227 532034 565052 591754 618344 641802 694946 774958 866171 982021
17252 982021 1143869 1323255 1507976 1681021 1819431 1898048 1895493 1834184 1758801 1660573 1556536
17241 1556536 1480191 1443712 1449136 1489211 1574587 1693715 1831380 1989101 2155510 2356048
17231 2356048 2566578 2797021 3066410 3391733 3818355 4373851 5107419 6109971 7498896
17222 7498896 9474838 12296606 16353230 21965324 29162749 37609290 46960495 56507538
17214 56507538 64613336 69737889 71420847 69640758 64341740 56240644 46913488 37734150
17206 37734150 29458603 22474583 16996607 13014659 10275762 8425442 7184167 6338991
17198 6338991 5754211 5351591 5052163 4808820 4571398 4318160 4040112 3766181 3501049
17189 3501049 3253548 3046750 2908976 2834855 2798801 2830322 2914793 3012067 3136828 3245393
17179 3245393 3363877 3500648 3650665 3861658 4156998 4576166 5152693 6001593 7210234
17170 7210234 8928697 11404417 14956746 19929336 26359803 33975778 42430899 51148724
17162 51148724 58733671 63660072 65384935 63957800 59297792 51928308 43286985 34730961
17154 34730961 27016956 20481201 15314786 11543331 8920904 7112522 5820457 4887050
17146 4887050 4178183 3635999 3233446 2924292 2679936 2480584 2303563 2129033 1967775
17137 1967775 1811886 1667985 1541378 1436674 1354379 1311839 1279611 1238804 1197017 1141883
17127 1141883 1096161 1020270 937019 853842 780039 712031 647119 609735 581317 544544 519496
17116 519496 522126 535115 550895 546152 529725 518081 465867 414793 374559 347375 324485 305337
17104 305337 289772 268478 268843 259341 245981 236877 230074 206747 193777 177093 170677 163557 169576
17091 169576 152031 129095 111005 99726 105164 110483 116646 124347 110298 97641 104028 120445
17079 120445 112633 103063 98034 99736 102885 92645 70169 81282 99083 91408 88034 95367 94571
17066 94571 81412 81146 74284 78353 98143 103954 108616 100376 102365 113544 118278 114549 101270 95687
17052 95687 96765 80939 75883 54608 40468 42210 48875 60895 58545 56327 52809 41193 27727
17039 27727 15405 5694 7784 -4545 -8670 -795 -10991 -14233 -10251 -4333 -9762 -8070 -3823 3859
17025 3859 2147 4934 3965 12637 19367 26961 38000 35174 39270 35269 35066 29807 35125 39910 34527
17010 34527 26279 42345 49716 52071 63808 70536 69102 58096 53518 51676 55016 54764 52523 42133
16996 42133 26442 14694 20958 19192 10892 24145 28443 25008 27500 25436 26765 25701 16949 11900
16982 11900 9480 -2480 -1404 8632 14186 1118 -175 12222 23435 4673 -4182 52 2938
16969 2938 18587 38502 45536 41104 42520 42496 35929 32689 38247 47043 34078 39157 27271 28912
16955 28912 37541 28504 13266 12418 18303 18223 22884 28712 38634 44487 34879 20675 9178 2016
16941 2016 4733 16089 14305 9874 4582 3547 13904 27016 15967 5337 10403 21073 18163
16928 18163 19784 16283 -1059 3426 12838 21000 19713 11176 3660 3684 -1545 -11329 -12584 -5227 988
16913 988 7595 22120 10323 -1847 3531 -5774 2404 10282 6787 -1035 -1244 1027 -5147 -478
16899 -478 -990 3011 8268 13838 10742 5920 10424 23189 32136 28704 30165 15302 -2897 -3118 -4283
16884 -4283 -1357 -10033 -868 5691 5682 22099 20437 15857 18537 13628 8994 740 3096 -4435 2946
16869 2946 -4859 -11180 -6422 -9120 -6948 -5656 -6005 -2194 -1967 -1006 4639 -522 -18119 -2793 928
16854 928 -265 916 8151 12160 21697 20140 16452 24596 29132 25835 25923 17072 -1537 -8362 -2038
16839 -2038 -2321 -5709 -15241 -19923 -13405 -24034 -36201 -31103 -22035 -18407 -28492 -23415 -27159 -18746
16825 -18746 -12353 -6430 -5467 -12586 -17520 -11027 -1149 6844 -2667 -7725 -2816 -8004 -5140 7353
16811 7353 5177 57 -4010 -2582 -10187 -7818 -1252 -1841 -15064 -14321 -9310 -9155 -12075 -19335 -28486
16796 -28486 -46020 -43995 -18128 -4296 -5022 -8765 3819 -2508 -16517 -6852 -11738 -18472 -16781
16783 -16781 -13731 -10401 -732 7995 -1109 -391 3619 207 879 18218 15741 -5488 -12593 -1946
16769 -1946 -13726 -16736 -20517 -17174 -13538 -19589 -29802 -29757 -16308 -2448 10148 13092 26046 20625
16755 20625 6903 -5214 -6957 1281 -1837 -7816 -12071 -7122 -1949 1333 -935 7981 18288 22493
16741 22493 22570 18473 22120 27284 14745 14962 23977 20710 8278 10926 5438 -6374 -2526 -5528
16727 -5528 871 7239 -8377 -3461 8450 4616 7539 10234 11040 14547 12127 8442 8291 10609 10269
16712 10269 12611 15705 25579 27548 12796 10045 28738 31586 22779 45131 59259 83244 120724
16699 120724 152647 190029 236404 278701 322747 351621 361294 357494 315086 260797 209575 168039
16687 168039 143808 113482 87340 72078 57680 49401 46684 38126 39283 30862 14974 8324 24016
16674 24016 6014 -13213 3287 7773 -5548 -8951 -10172 -23912 -13057 -4647 -3600 -2776 16808
16661 16808 35781 30316 18836 7615 -3642 4523 14606 32770 35601 32498 42059 52505 73069
16648 73069 101318 137078 178417 220821 270243 324117 347643 345532 333430 301072 255201 208097
16636 208097 171486 146000 112218 85396 56260 28915 19049 6484 -1135 13206 26019 19578
16624 19578 -1052 -5991 -1695 -4320 -8685 -12057 -22994 -23906 -9342 3366 8266 3876 -5662 -9208
16610 -9208 -14227 -14526 -21449 -27178 -20829 -4930 721 -633 576 16771 11415 1445 -13588 -12863
16596 -12863 -11284 -11013 2431 716 -17939 -21492 -22845 -30415 -179 11615 11889 -5164 -12528 -16197
16582 -16197 -19787 -4339 -7154 -9127 -9529 -7423 -6310 -488 -1453 -20542 -25712 -21243 -12695 -11998 -9560
16567 -9560 9387 18550 10114 19921 16004 8737 4986 -385 -9695 -24560 -28515 -34664 -25614 -20313
16553 -20313 -5447 2730 3388 -9897 -5857 -21752 -20517 -5817 5800 15016 13997 4355 -7414
16540 -7414 -11315 -12274 -19955 -24206 -23692 -28842 -24824 -13027 6750 27079 27057 17088 -286 -24968
16526 -24968 -26385 -19619 -23820 -26740 -22387 -16691 -2466 4627 -3740 -294 -3656 -2296 -2700 -3955
16512 -3955 5876 -176 3557 12926 3881 -389 -12735 -17779 -1219 -5600 -5537 -7816 -11682 -8808 -1455
16497 -1455 3831 4677 -7309 -7420 7872 6866 -5924 -10479 -19403 -13701 -16979 -31010 -17077 -16441
16483 -16441 -12967 4114 8965 -72 -7111 3272 -3748 -12249 -28356 -22651 -25277 -18944 -15428 -13850
16469 -13850 -19440 -4550 -2618 -5223 277 1245 5707 11526 7823 -6807 -19301 -15695 -5098 3110
16455 3110 -2560 -7506 -3429 -4405 -8892 -12619 -10766 -11753 -5959 -8816 -17101 -22866 -23631 -29643 -27371
16440 -27371 -24023 -26049 -21118 -28010 -17794 -13464 -41156 -38277 -26464 -24895 -26301 -29388 -22040 -1464
16426 -1464 -10072 -4998 2624 -2757 2134 -15400 -16273 -18724 -21423 -11185 8111 9457 8495 5215
16412 5215 57 -5486 -7864 -3248 8882 5963 -1896 -14141 -2493 254 -13132 -19532 -34121
16399 -34121 -34728 -18225 -17502 -27537 -7917 -238 1956 9732 14248 4434 -1629 -3133 8777 -2716
16385 -2716 -5632 -8921 -15934 -16071 -10796 -11175 -21170 -9241 8478 7479 3644 1569 9478 3626 -6480
16370 -6480 -22670 -28938 -21207 -16616 -12660 -1527 6422 -4742 -12526 -6793 1216 -6717 -14583 -885
16356 -885 651 -18803 -27316 -23851 -5432 -6439 -6408 2140 -3663 -18062 -9153 3746 -990 8759
16342 8759 -4174 -14868 -24312 -20265 -15466 -12952 -21489 -14526 -1801 11498 17690 23473 20472 13925
16328 13925 18140 -5296 -20200 -21233 -16708 -15903 -25017 -38941 -37834 -30890 -22909 -23553 -31204 -16214
16314 -16214 -15885 -27288 -22910 -11937 -20391 -19785 -20903 -18221 -16616 -19308 -16407 -14104 -18193 -28674
16300 -28674 -31714 -32632 -34857 -30864 -16049 920 17882 10668 -1324 -8762 -8740 -5849 -3192 -5383
16286 -5383 -7735 -10161 998 19436 9054 608 -4716 3139 2188 1794 -8940 -5905 -9636 -928
16272 -928 10540 6938 3409 3375 -8741 -15732 -10017 -17123 -18265 -9825 -18815 -31993 -15414 -11584
16258 -11584 -9859 -9723 -6567 10203 18186 17985 8451 3227 3624 -2046 -4833 -12323 -13698 -22221 -32591
16243 -32591 -17199 6466 7253 5280 -7777 -20299 -21046 -8557 7209 13849 7402 -3253 -4056
16230 -4056 163 5147 11863 11206 2906 6211 -3736 -4283 2841 12195 9882 -2417 -12834 -18935 -24158
16215 -24158 -29539 -21196 -14127 -6958 8084 -3360 -11414 -17673 -20667 -5585 -8341 -7884 1278 3677
16201 3677 -2232 -7361 -14602 -21971 -7892 -303 3310 181 4593 -6966 -15284 -10547 -7274 1629
16187 1629 -6526 -17017 -18010 -8059 -1127 -16620 -23252 -23475 -22887 -21318 -4767 -15580 -21031 -13786
16173 -13786 -19024 -30173 -13028 -3744 -25424 -28045 -12239 -13591 -20887 -18284 -28539 -27565 -14299
16160 -14299 84 12967 25691 4325 -26974 -33341 -33500 -26373 -10708 15815 9903 -2906 -1146
16147 -1146 8709 14862 4966 2859 11110 7450 4254 1234 -7900 -11539 -6731 -5324 -16558 -24842
16133 -24842 -30837 -18796 -13992 -15489 -29229 -25830 -30202 -34687 -27317 -10581 -10103 1082 6640 -3968
16119 -3968 -9619 -14463 -23241 -24564 -19963 -14006 -4750 -6578 -1663 -6742 -9576 -3831 -3897 -10066 -1137
16104 -1137 -15207 -21703 -26734 -26833 -23874 -26652 -28034 -23702 -16091 -12037 -19998 -31692 -18212 -6301
16090 -6301 3140 4167 6388 -5694 -10318 -11404 -16561 -15243 -15984 -21365 -19579 -7023 5658 10784
16076 10784 3248 -218 -12486 -7625 6290 3746 11264 12341 7803 -17305 -28250 -20373 -12956
16063 -12956 -7911 -18900 -13860 -1366 -1608 -2319 272 1785 -9418 -18391 -29078 -19283 -69 1177
16049 1177 -875 -6931 -2549 5429 -2882 3934 11204 3440 -5390 -14319 -3905 1736 3655 -3576
16035 -3576 -7920 -6381 -11417 -3956 9419 17132 20992 8248 845 -6531 -30564 -38794 -31284 -28570
16021 -28570 -26820 -15393 -5202 -1269 -2919 -8943 -19455 -25239 -12249 -3337 5749 9656 11467
16008 11467 5887 -4579 -6602 3597 1013 -20104 -23825 -7932 -2851 -4986 -10724 -774 6985
15995 6985 9822 -2777 -4123 -2670 -7161 -13537 -19933 -17049 -11662 2762 2961 -9162 -12826 -11210
15981 -11210 -9252 -2253 -5530 202 -1193 -14170 -4279 -813 -4810 -3198 4611 22342 19183 5109
15967 5109 6698 9925 2799 -10570 -12615 77 11948 22486 10093 3010 -7964 -10828 -17662
15954 -17662 -19066 5998 11334 24964 20614 15026 25610 21269 8555 6028 12747 13292 9894 -8189
15940 -8189 -13938 -20915 -12909 -4300 -7798 2946 5921 3238 -6470 -7920 -1991 -975 -9210 -5850
15926 -5850 -11793 -24875 -21608 -12916 -11027 -8897 -16020 -17832 -20276 -19611 -11625 -3770 -11171 1831
15912 1831 2999 5271 -6471 -17433 -13044 788 5949 -11082 -11381 -20162 -39327 -42028 -20496
15899 -20496 -1694 -774 -3650 2018 -3985 4185 17088 21455 9965 -5486 -2507 304 -1003 -8478
15885 -8478 3082 -4588 -10338 -204 3859 -1049 -5891 -6183 -13333 -15542 -12175 -6551 -7668 -11047
15871 -11047 -1008 -1741 -10587 -15149 -3119 1931 -120 -9259 -3018 -1685 -17338 -24852 -19494 -22203
15857 -22203 -2561 12856 6033 -210 6078 107 -5051 -7049 -15244 -21151 -21292 -25037 -18031 -6631
15843 -6631 739 -548 -1585 9981 10048 17738 11666 2249 7677 11162 12317 -2067 -5159 -2128 -954
15828 -954 -154 -2548 3933 -10745 -12782 -3578 13779 21214 6790 1679 -5181 -1461 19814 24396
15814 24396 9302 2532 -9936 -5746 -1852 4172 6927 -46 -13171 -25005 -33450 -32425 -21998
15801 -21998 -19257 -15202 -2732 -2802 -4485 9318 20783 25759 19389 13931 11472 10851 6696 -3426
15787 -3426 7776 13371 7340 -9270 -3040 -9820 -19036 -5861 1112 -535 -970 -3564 -8911 -1816
15773 -1816 -16955 -13126 -9643 -8989 -10291 -17370 -23769 -13636 -4320 -16794 -21905 -29283 -34316 -31161
15759 -31161 -28937 -16900 -18038 -8975 -6317 6938 204 1795 4220 10608 1605 -18407 -9405 4275
15745 4275 4799 -10046 -24695 -19347 -13499 -9057 -9463 -14707 -20791 -11818 -7324 -9527 -4234 9806
15731 9806 8700 -9573 -14057 -19769 -33784 -28222 -15718 3763 8069 3340 4642 6367 1637 2623
15717 2623 1910 14611 22448 13416 6956 10236 12160 -3874 -17184 -4057 -12119 -15476 -5171 -10560
15703 -10560 -10797 -13181 -22301 -13068 -3828 2010 -1392 -2643 -8812 -13380 -20640 -7601 -5600 2496
15689 2496 -773 -5205 -2269 7972 7568 -4992 -12674 -1617 1455 -1639 -1079 -614 -9852 -9635 -16352
15674 -16352 -12877 4635 10595 11325 4240 8075 20084 21400 10138 -10781 -9938 -5080 -7976 -17653
15660 -17653 -24859 -7263 5980 -4395 -13570 -2199 2020 -4118 -2506 2656 140 2100 2530 -3356
15646 -3356 4541 11662 16416 11425 8268 -3906 -11697 -11809 -9824 -4339 -8389 -2678 6535 -4701
15632 -4701 4819 -3160 -7358 -6487 -960 2293 6514 -2526 -3452 8848 10395 7447 13991 15075 15296
15617 15296 12891 571 -1836 -7225 -2081 -183 1911 12093 12369 6064 3910 8756 23748 19215
15603 19215 17517 17263 7622 -8763 -8186 -5975 -17672 -20156 -20123 -24230 -25269 -14785 -11083 -9957 -8411
15588 -8411 -29373 -24003 2286 9209 13355 8505 6563 4472 -1701 -5460 -7879 4541 4726 3998
15574 3998 4603 10102 294 -701 8680 16586 -5022 -13007 -7405 -11614 -10836 -7080 5089 9761 10779
15559 10779 6851 -7806 -6105 -2865 -13782 -8293 -4928 -8435 -11928 -3901 -13560 -8458 2632 4313
15545 4313 3685 6436 13116 -2931 -6528 -9898 -5444 5716 8980 9030 -3511 -5621 -138 -13911
15531 -13911 -15046 -1694 -1589 1093 7379 19018 28467 28808 31437 30746 7350 -8350 -17034 -15066
15517 -15066 -4486 -5115 -2887 2299 13180 9790 9032 -2442 -11331 -9829 -8243 -11373 -11638 -12145 -11198
15502 -11198 205 -689 8690 9266 -4821 3408 21040 20113 5356 2422 22700 34317 29979 8220
15488 8220 -3242 -4269 10134 9373 12718 8470 5847 290 5086 201 -5903 -6768 -5532 385 6858
15473 6858 2636 5725 930 -8636 -7604 -15206 -24086 -26143 -21740 -15892 -18444 -12597 -2408 -6627
15459 -6627 -10333 -3125 -13725 -23098 -26872 -29651 -13339 -8867 -10638 3894 13101 8609 7661 2034
15445 2034 147 -7094 -14219 -17650 -25958 -13686 -3563 -2814 -3553 3472 12119 2388 -8075 -11509
15431 -11509 -14945 -14205 -4652 1920 -1166 9723 14608 15108 2376 5216 14906 9523 -2387 5972
15417 5972 11391 5280 -5440 -10884 -12627 -26057 -28800 -18869 -4989 17096 7816 11873 28470
15404 28470 25049 23301 17467 1709 -7337 -1180 9025 5927 7377 11410 11102 10901 6591 -7130
15390 -7130 -9872 -27512 -10691 519 -17001 -14367 -3757 -2107 -10277 -17545 -23040 -4768 3708
15377 3708 5236 8024 9003 4272 6203 16370 20123 5557 4544 1716 -8045 -5873 -1289 -8154
15363 -8154 -6895 -8764 -10694 -12756 -11737 -4888 -7614 -9483 -10309 -19882 -24828 -29686 -23001 -20478 -25958
15348 -25958 -10113 5066 -3492 -22476 -20852 -7037 -1293 -9504 -12488 -6672 -1721 3635 10201
15335 10201 4566 -358 6014 -4640 -15374 -11221 1675 -3610 -402 -13324 -30878 -21977 -17820
15322 -17820 -9907 -11990 -14529 -13805 2522 778 4067 -3066 -3176 -1780 -25783 -41195 -38314 -19230
15308 -19230 -1982 12501 15987 5751 3176 728 -2094 10801 3665 -5650 -7705 -7134 -9842 -25516
15294 -25516 -29399 -31263 -38690 -39448 -23871 -23348 -29194 -27882 -8140 -2027 3904 4553 5595 8996 15477
15279 15477 13567 4214 3915 9989 16622 13858 6953 -1496 1646 -9000 -29463 -18247 -19103 -14273
15265 -14273 -825 3481 5236 -5923 -6081 -13873 -14830 -24361 -35972 -40980 -36717 -37238 -25930 -10032
15251 -10032 -8077 -4743 -2725 -2741 -10513 -16893 -18573 -8801 -12054 -17501 -23925 -37323 -38050 -32050 -8122
15236 -8122 9377 11182 18563 15073 6924 10328 11625 3084 -12576 -26605 -39767 -30785 -28788 -29998
15222 -29998 -15633 -4179 7392 16778 4197 -7003 -23655 -21526 -12343 2852 10631 2546 -22032
15209 -22032 -23682 -16354 -17760 -15842 -25037 -32395 -31877 -28110 -33681 -16005 -8372 -15850 -13139 -13858 -3854
15194 -3854 240 1617 -3387 -3481 2609 4228 -9915 -21681 -17761 -11250 -3584 12679 36169 26109
15180 26109 3494 -16150 -24990 -23780 -16970 -5320 5276 5582 19814 38311 30024 19026 2602
15167 2602 -1055 -8632 -10470 -9694 -15291 1407 7737 -2493 -11339 -14797 -16140 -8065 -848 -5465
15153 -5465 -7889 -9660 -2838 -11335 -14583 -19077 -20798 -18479 -9258 2479 -904 -6568 -2602 -2150 -1028
15138 -1028 -2037 -3411 -6603 -4542 -7134 -845 1122 -8091 -20668 -14987 283 643 -14558 -16250
15124 -16250 -11089 -9837 -14222 -6247 13101 29474 19399 -888 -8380 3098 2421 7179 15402
15111 15402 5914 4197 21073 996 -5772 9854 22866 18492 21905 13682 10741 12866 5794
15098 5794 1609 -1400 -11102 -5720 -563 840 2858 757 -395 -712 -3347 248 -289 -8860 -11983
15083 -11983 -2308 63 288 -12745 -20139 -1526 -498 -3852 -5485 1242 6202 -2743 -17746 2685
15069 2685 12867 7796 10479 11424 20657 12863 10381 5107 1849 6776 12360 20557 14842 15144 30842
15054 30842 29718 18502 5516 10941 22121 15946 17541 16697 14989 8961 10190 7711 5525 -14408
15040 -14408 -23552 -7316 1464 -2533 -726 7839 -1767 -18380 -15330 -7590 -12311 -21972 -22959 -14491
15026 -14491 -4274 -10116 -3310 2459 -2775 2136 -5080 -8992 9489 19992 18341 10555 9889 9969
15012 9969 13477 19856 23783 17738 10519 7640 11201 3397 3472 11521 12801 6100 -10757 -13889 -3243
14997 -3243 6554 11209 17725 21402 10409 15141 30702 29586 25504 15412 -2166 -8762 -7357 -3431
14983 -3431 -6982 -19291 -19669 -9810 -15805 -13710 -7945 -10969 -4702 -6462 -14843 -26965 -24874 -12902
14969 -12902 -23461 -47422 -43233 -26042 -18269 -7365 6645 -1016 -4750 -4555 -1502 4249 5942
14956 5942 17776 11521 12698 8191 -8568 -2326 3663 4112 8259 12302 33756 26193 10166 4647
14942 4647 7564 17978 12453 11911 7350 5074 9760 25906 25087 9070 -1981 -5187 828 2717
14928 2717 9669 16245 11300 11437 9475 3606 -4686 -4817 9246 20892 27375 22579 25656 27481 20349
14913 20349 17945 22471 28598 32123 41801 36015 26853 26789 30708 26858 27625 27431 27865 24752 21274 31542
14897 31542 48692 56472 53671 59992 65157 75563 83160 99872 135848 168424 194512 235051 318744
14884 318744 431127 562191 692077 810265 934154 1070241 1180766 1246197 1269599 1266683
14874 1266683 1242551 1195515 1113901 981644 853755 744191 637766 517144 386250 270755
14864 270755 197186 151331 129474 121875 104564 78582 70628 71303 58412 55397 50348 28081 25202
14851 25202 34069 28034 25006 20129 11677 18496 16182 12115 8255 12691 2878 18657 23136 8629
14837 8629 14503 19080 28513 18453 3433 387 13622 13874 7754 4130 6644 3767 -6680 1966
14823 1966 4526 14603 4912 -4086 2047 4176 7996 2643 -11842 -6632 12197 21117 14924 6415
14809 6415 3429 10759 -2852 4900 13356 9331 4059 377 -6572 9834 22989 25230 18637 8835
14795 8835 17077 22160 9584 -1514 1399 12679 20622 26155 20783 7175 5959 4830 16342
14782 16342 16254 11024 15263 14158 10456 6679 9958 -548 -2691 -10130 -17364 -24888 -16617 -22733 -24117
14767 -24117 -20809 -7676 4629 -3596 -8164 -1343 -3258 -15028 -16963 -7817 -13334 -12504 -5635 -7622
14753 -7622 -3629 16526 12941 480 -9018 -13432 -14168 -18412 -12439 3690 -4579 -13420 -14669 -7885
14739 -7885 693 3866 -255 -8870 -14367 -10402 370 -5210 -11996 -14759 -14684 -5693 -16217 -7138 -4301
14724 -4301 -9504 -11756 -18924 -14715 -13192 843 4851 3505 7535 -9844 -16647 -4935 -6309 -9102
14710 -9102 -14348 -31105 -25802 -22317 -13701 7546 8178 1528 -21017 -9661 -2693 -11423 -16091 -12346
14696 -12346 -12854 -16940 -9455 3887 9683 13733 12886 1125 -3000 3618 -5664 -8947 -26230 -12653
14682 -12653 3917 3790 5961 -383 -19533 -10905 -13363 -3710 7071 5298 13810 34216 32680 19683
14668 19683 15596 3780 -5494 -10098 -17100 -21149 -24105 -15565 2528 15041 10325 7505 4470 9316
14654 9316 5085 1580 -5598 -6184 -6340 -1693 86 -3748 -16302 -23130 -19848 -17209 -1074 8408 3040
14639 3040 -1378 1750 398 -262 72 1906 -145 2230 -7012 -13850 -8664 -4746 -4481 -12914 -21001
14624 -21001 -12164 -15710 -14238 -668 218 2011 3454 4485 -2863 -1367 3132 -5388 -4989 -4828 -5412
14609 -5412 -9126 -11962 -4927 460 14488 9506 -8993 -13679 -2906 -9569 -35397 -24275 -23054
14596 -23054 -29047 -8785 6661 -4947 -460 9997 15968 2000 -4553 196 1750 5349 -4872
14583 -4872 -9593 -6363 -13974 -22040 -22802 -5462 9867 20578 25673 9710 4432 -490 -9721 -2991
14569 -2991 6829 6795 15981 13568 6926 5555 524 -10407 -956 -2978 -3670 -19213 -32492 -31259 -4991
14554 -4991 13171 27747 18445 15548 12458 -5858 -5615 9995 12229 -1671 -3372 13207 31598
14541 31598 32605 33334 19234 8467 8406 4283 -530 -1645 9142 10930 18322 11096 10390 790 5265
14526 5265 14398 12904 8261 14065 3872 2584 -3448 -8788 1148 10673 3091 6549 8374 2890
14512 2890 -3985 105 -11523 -2837 6877 2022 2691 4098 -211 854 -3392 1094 -958 -7188 -31722
14497 -31722 -18397 -12100 -16914 -10198 -15083 -17913 -21896 -16478 -6214 -3400 -4151 -9527 -248 2016
14483 2016 1154 19950 7084 143 -12140 -14896 -582 -7179 -13636 -2947 2582 -2384 -7952 -1085
14469 -1085 3286 -4960 -17374 -16190 -6507 -7555 -4826 -13852 -20950 -21007 -21229 -18823 -8064 -5613 -1774
14454 -1774 -2800 -8426 -9881 -12561 -6719 5689 157 -539 5611 -3790 -19888 -23733 -7054 10158
14440 10158 10351 14044 8309 5629 14393 14434 10373 7487 4043 13218 19795 13941 -4331 -22493 -31398
14425 -31398 -25646 -1696 38 3834 18314 30809 38252 33896 23865 17724 14297 10644 14917
14412 14917 7397 -2549 -4493 4338 10188 14679 16240 18124 24587 15956 3098 2586 -5094 -311
14398 -311 6385 -2371 -9223 10964 10433 21337 32784 20625 6926 3846 6662 19819 13929 -5426
14384 -5426 603 -2171 631 -6679 -16420 -17409 -10608 8060 10494 15395 31585 45595 48139 32956
14370 32956 15571 -6304 -9204 -4021 -3676 -1606 1998 7417 10298 10760 7395 7727 3072 983 -16036
14355 -16036 -23704 -13413 961 512 2245 2759 4085 771 2177 5548 1355 8643 9330 13464 18132
14340 18132 18030 6815 6121 5909 766 -2139 -17704 -24808 -15395 -7928 4853 5452 -409 1835 -6453
14325 -6453 -8836 -5556 3917 13856 16979 22961 22748 9169 -2936 -16866 -19686 -23263 -27834 -18519
14311 -18519 -10252 -10463 -16815 -9046 -3962 -1887 -4475 9926 7274 3281 14202 21920 26439 28468
14297 28468 22396 10889 6232 5213 14054 12241 12175 20517 14983 11724 7454 6635 8132 564 -1904
14282 -1904 8640 8739 -6149 -2188 -2733 3173 -2473 4085 8299 2812 2086 -11514 -14234 -1923 -2581
14267 -2581 -8581 -3981 -3210 -4298 -10822 -5943 -20502 -7447 4927 6635 1231 7021 12113 9018
14253 9018 18109 6344 -2987 1420 6846 4303 8821 2303 -7379 -11445 2509 4302 -9276 -7540
14239 -7540 5278 6666 72 6986 10111 5037 13006 13547 8320 11032 10733 13961 16024 1389 -8050
14224 -8050 -8708 -6318 -4557 -9356 -10284 1314 11032 20468 11073 3852 -2676 -9404 -17953 -23692 -11258
14209 -11258 1527 3667 1862 12472 12156 4477 19728 13574 4130 8209 8155 22010 22361 23368
14195 23368 21108 18811 8885 8822 7291 5831 78 -2466 -8906 -12127 -10145 -2237 2382 12573 1813
14180 1813 -16560 -31389 -30819 -24212 -15000 7013 6390 -5737 -6552 -14129 -5410 -1902 10783 4503
14166 4503 -800 -9741 -10849 -3377 -2536 -340 1616 -2817 4976 -1865 -20650 -28361 -17137 -12549
14152 -12549 -9834 2624 -5429 -7438 4585 -5754 -14077 -11259 -11999 -17962 -10797 -14719 -3214 3181
14138 3181 3605 644 -8945 -22637 -30869 -13412 2555 7001 9162 6003 9763 14175 8211 -10474
14124 -10474 -9459 2279 -8906 -8146 6464 14685 7544 -12126 -11834 -6971 -5457 817 -5557 -11963
14110 -11963 -6816 6609 2969 601 -5379 -19875 -15969 -13664 -2607 2318 -1037 2986 11094 -6808
14096 -6808 -5197 -4894 -8542 -7649 1015 8681 -1979 -18250 -11807 -6285 -5907 -15737 -17562 -5492 5231
14081 5231 3230 21381 21137 4521 4150 -2446 -6923 -844 -1469 -11866 -16822 2478 16629 11798
14067 11798 4249 505 11035 8086 5115 1508 -4311 1782 8350 7257 11160 8055 -6584 -27696
14053 -27696 -24630 -10339 -6864 215 37 -6444 -5261 -7963 -8277 -7667 -15122 -4521 7936 2850
14039 2850 3926 1042 2745 -4652 -9306 -825 8083 8249 16055 11050 22846 25516 16719 5922
14025 5922 6411 5761 8535 3721 5558 16311 16820 8278 -4287 -3085 -353 -3408 13093 13454 16709
14010 16709 10213 -1956 -803 1638 6873 4228 -3342 -8163 -5282 -1667 1383 -9723 -12583 -1340
13996 -1340 -4346 -6091 -1082 -6568 -19226 -21877 166 10832 -791 -3938 -2777 1299 4140 -3668
13982 -3668 -3567 6213 7922 -8884 -8911 -7140 688 -2950 -14192 -7992 -3772 -14949 -11826 -13150 -18735
13967 -18735 -11194 -15408 -15619 -4486 189 2970 -3802 -4302 -7673 5012 15197 8971 1746 -3762
13953 -3762 -7713 -765 7639 9908 1185 -11649 -10033 -3596 1255 2767 9125 10560 13389 4625
13939 4625 3393 -3991 -8356 4633 2469 8445 1253 8537 13746 11367 14932 17224 18741 5691
13925 5691 -4842 -7402 -8513 263 6693 4445 -2985 -101 14075 -2440 -18958 -14796 -11904 -26941
13911 -26941 -36487 -27817 -7677 -525 -8547 -21321 -24010 -8687 2247 11423 6905 7035 3836 -4921
13897 -4921 -2410 4199 -2254 -13197 -9699 -8792 -2742 -4190 -8698 -10231 -12096 -11891 -13849 -19639 -13092
13882 -13092 -2917 -7927 -15613 -21830 -14049 -10900 -21303 -21134 -18537 -7214 14388 21904 21694 23620
13868 23620 12777 18889 13995 4714 3271 -5332 -3579 10118 17795 1655 -1242 5021 2148 2513
13854 2513 -5429 -13292 -7986 -949 3147 3251 -9659 -20312 -11617 -11813 -26256 -31804 -19493 -15908
13840 -15908 -9578 -7732 -13687 -1179 7736 -6630 -8725 -18636 -14308 -4989 583 4523 -9465 -16658
13826 -16658 -9457 4438 10582 16512 15425 16978 14604 4294 1531 3669 962 10683 16450 8565
13812 8565 9558 19533 9359 22897 24754 20621 13634 17053 22990 17554 10530 11084 2712 4143 5386
13797 5386 5263 18964 15109 9746 -6373 -13405 -13643 -22744 -34800 -42680 -31369 -25633 -33897 -24299
13783 -24299 2631 16814 12122 7472 -1115 -13793 -10190 -7585 -16182 -9210 -5002 7214 11144
13770 11144 6920 1478 -5747 -4979 3533 7401 -5884 -1989 8742 2950 -3811 -11433 -5568 8548
13756 8548 3505 -19853 -25162 -15275 -6080 -1407 -2632 356 9111 13945 11367 12608 9797 9133 3189
13741 3189 3619 1375 -4093 -13311 -25997 -32512 -26080 -23351 -18531 -661 2374 4470 12853 23309
13727 23309 14883 11306 11649 -7273 -2679 7968 7406 12470 11916 12411 15698 17459 5918 992 2402
13712 2402 -7750 -24722 -11277 -7721 3279 16814 22339 26719 26591 21946 15360 -13893 -13186 -20679
13698 -20679 -30696 -11033 7608 14576 22337 36878 24692 9111 5746 16788 1833 -9333
13686 -9333 -6707 -14144 -15422 -7075 -5536 -5147 -7457 3582 11863 23702 24772 28323 24144 8689
13672 8689 -1512 -2905 -1030 -1364 4292 2657 -10913 -8562 6374 23394 21003 5166 -5624
13659 -5624 -20666 -21615 -21515 -22944 -10890 -134 12718 7999 -2527 3441 14481 24948 37963
13646 37963 34485 28354 30510 20669 28716 21249 19543 14429 20751 26305 20598 23137 19599 21631
13632 21631 13319 6410 -3628 4115 8919 15877 4897 2030 6230 -3995 -8645 -2517 23286
13619 23286 20930 11808 10762 9302 12975 7268 14154 35544 38318 26441 24759 24875 20718 16925
13605 16925 11334 5851 12262 12545 24320 25467 23342 31336 36831 36941 22872 807 -4270 1513
13591 1513 15171 1989 4162 21971 22765 36540 38371 32880 21279 4096 3695 4478 4012 3858
13577 3858 -8847 -27756 -28157 -26137 -15717 -15314 -4495 4823 15075 12771 15172 2826 -8959
13564 -8959 -15777 -11005 -3227 -8898 -7768 -10709 -16839 -20078 1575 26475 35584 28408 22209 15390
13550 15390 7395 5751 11614 -38 -6906 -18539 -21587 -26668 -2340 29868 21064 6264 -3243
13537 -3243 4407 3992 -6460 -7702 -1417 -5232 99 14414 15629 -357 -12477 -8936 -5467 8423
13523 8423 3170 -10929 -20855 -2695 15256 23815 22725 22008 3278 2450 -9695 -22166 -20898 -19483
13509 -19483 -4207 -3314 -17325 -10874 3384 -316 439 -1381 -6103 1067 2179 14038 23594 8919
13495 8919 10172 20399 24115 18359 12186 5999 2703 8314 18855 23101 25133 14617 12170 9423
13481 9423 3290 -8655 -13954 -7544 6850 15961 -915 -6093 11056 15299 17282 10664 -1603
13468 -1603 4303 4503 4598 -36 -11438 -17255 -8957 1706 3011 -3989 -13608 -8597 -7137 -4389 6904
13453 6904 14223 15104 15581 11081 18164 5491 -4745 -7881 -5768 15572 16850 8688 760 12703
13439 12703 15336 -96 4938 -5075 3640 13904 8733 531 8182 7850 7892 16011 21737 18636
13425 18636 11835 9447 1535 280 10241 9336 -1524 -13511 -6098 -6028 2591 -8200 -18183 -9200
13411 -9200 10233 2215 -23079 -19493 -9267 -6432 3738 19185 13627 7647 9175 2039 -3681
13398 -3681 -1995 -1493 -13460 -3880 -1386 -15789 -15183 1483 8894 15759 28748 26934 12352 1664
13384 1664 -4249 -17670 -11950 -1609 4355 3535 -7122 -3481 -7547 -6755 -2190 -27617 -29503 -9136
13370 -9136 -11081 -9032 2316 16488 12643 18273 17977 10969 7801 10351 3565 -5378 6678 49
13356 49 -10840 -1078 16059 24957 24366 26373 36558 36685 18535 15338 17077 20909 20043 23251 20206
13341 20206 18254 12705 23430 19577 6853 9414 10353 -676 -4326 -3686 -2986 3911 -14718 -6444
13327 -6444 5584 460 9572 -2691 -448 2555 15182 10177 2155 -16878 -23730 -5900 791
13314 791 -7613 -1601 -18905 -20630 -5207 12885 12113 7917 7165 3895 -6085 -10281 2722 5967
13300 5967 17196 16303 4432 -302 2737 2872 -6184 -13833 -11693 -8003 4863 23725 24690 19365
13286 19365 23336 17364 19717 27487 15495 4253 6145 10062 2515 3918 7521 3458 4248 12641
13272 12641 14721 3333 -2427 2161 -627 321 8986 10665 9818 6690 -582 -1725 -5703 -4056 -10041
13257 -10041 -6552 18893 31298 31121 25839 26432 27424 21620 6812 10404 17284 19862 22953 3309
13243 3309 -2460 2246 -8429 -19631 -16158 -8177 -9264 -3747 2792 11045 10575 20088 19575 10260 12683
13228 12683 21528 28699 28623 18144 7007 18327 18919 10124 9904 4475 -4966 -6702 5628 8988
13214 8988 5422 -3957 -3280 -6348 -16155 -15232 5110 26613 29291 31076 25032 13785 -1084 -8957
13200 -8957 -8074 -716 21387 17416 5859 10473 27138 27362 16839 10527 4228 67 -3076 27
13186 27 18398 28861 30428 34594 45456 48159 40077 42042 28300 8314 210 5055 1376 -3862
13172 -3862 10514 41270 35338 21693 15619 17581 18221 39385 34840 27888 22976 13546 6971 10384
13158 10384 29172 30059 24226 25102 33020 36494 36605 34912 17950 7090 4551 13489 23149 33673
13144 33673 36659 31833 49346 64849 80365 89147 107789 142899 148242 140992 113275 74642 32281
13131 32281 12610 29829 35061 34202 23955 16658 16162 19746 5579 1296 6313 -3358 9924 26986
13117 26986 25264 27956 21260 20342 10755 -4726 -11721 -5159 5514 14636 11702 -7939 -7616 -7404
13103 -7404 -1185 11378 24069 27973 29690 20559 13462 39375 58376 64598 78968 111587 139107
13090 139107 130870 103225 83812 54632 22594 21464 29019 14802 5411 6683 3318 -1342 11112
13077 11112 34149 28667 15647 26389 26418 28256 25198 30758 30457 19254 10916 12552 22469 21374
13063 21374 16006 -1675 -6686 -6866 1712 15366 14905 11491 23263 30493 38523 30712 29324 31219
13049 31219 21986 35773 48312 46712 37428 30510 16510 16015 24795 16509 14592 28314 38315
13036 38315 45680 53242 38948 34578 23988 5896 -1231 3417 5972 10648 8377 -3431 -16321
13023 -16321 -13114 -3318 -11136 -7203 475 -2372 2040 1036 4321 7677 24079 30184 13759 8663
13009 8663 5099 3129 5357 19726 23353 15200 968 -1356 14405 28970 31307 31108 25111 4401
12995 4401 -3662 1827 2499 11448 16829 28314 20195 11594 19877 34255 29012 27873 27996 22687 10458
12980 10458 12207 17186 16708 11055 16926 22182 29150 28053 27648 30387 30309 14017 3277 4556 219
12965 219 -4951 -3010 5447 8497 24955 24995 17901 14739 3202 15944 25947 20660 22500 7614
12951 7614 -7396 -3189 16454 27560 14190 12070 8675 13531 17051 22159 18959 15434 12477 18956
12937 18956 18295 20124 21452 26156 33949 27872 10776 4745 -5506 -3 9254 19102 19933 14062
12923 14062 9507 31626 32067 29544 23629 20527 24024 17240 21108 24173 15152 5711 405 6729
12909 6729 9557 6715 6186 13953 8241 1950 16736 20962 16017 4686 6216 19419 26636 15473
12895 15473 6226 -2962 -1083 -1156 -7276 -5272 3426 6218 10890 3563 6490 3987 1251 -2047 -10726
12880 -10726 -9263 -5069 -17302 -21163 -17165 -17911 -11287 -8655 -19540 -17625 -11820 -13233 -5979 4219
12866 4219 1429 -3048 -13572 -20805 -17070 -7329 -6635 -5421 -10214 -152 9024 5173 6513 1660
12852 1660 -1566 9570 26396 22809 22093 30214 27871 29607 35527 23763 21912 24141 28686 26160
12838 26160 25070 20887 17301 28408 31872 24225 28758 25976 25576 25866 29913 27995 34940 35196 31682
12823 31682 28136 25894 37697 48546 29714 6445 20406 28176 22877 24024 28898 31775 25351
12810 25351 20378 25834 22886 12802 21737 29106 23248 12844 9098 5885 7581 7408 10458 11409
12796 11409 6328 7649 15388 7070 956 1125 20153 21533 13981 12919 11363 20938 21732 17657 14386
12781 14386 10388 10898 6167 14014 21551 15457 9619 18355 3042 1351 2954 5412 4648 18825
12767 18825 24109 14200 21297 20630 33688 47570 29292 17915 27454 28014 20977 29535 19927 7287
12753 7287 14106 27389 27384 35759 23906 17994 19848 30901 34627 18964 7267 4426 -6747 -9267
12739 -9267 4100 10288 26745 21771 21889 22125 20018 19898 29475 36073 38316 24124 28209 42024
12725 42024 38981 37386 30715 28003 40149 41821 34964 39291 30648 33274 35995 29387 28934 25892
12711 25892 24550 20015 23664 32923 30439 23204 26983 27369 26438 24827 15657 9731 18750 24526 38585
12696 38585 44110 37741 39029 24501 19529 5806 11293 17331 15784 25540 38016 42682 45048 61322
12682 61322 52158 47993 47084 53200 41351 27289 35450 39396 37321 26814 22101 12165 23205 48566
12668 48566 68319 45043 46093 55980 59209 46120 27011 30357 29611 24288 42849 49195 40522
12655 40522 25417 39096 46913 51235 53909 41463 42926 31711 22159 29350 38377 43231 52984
12642 52984 52474 48602 42190 43876 38558 28710 32732 29522 27461 24068 30676 39801 42756 36054 25059
12627 25059 17865 16169 21659 37941 45404 40212 33524 21423 13863 22967 36971 44400 51891 44117
12613 44117 39118 22400 19777 24154 33880 42864 54505 58454 67471 89380 108614 112918 108455
12600 108455 111824 119504 117763 130994 151563 191447 218560 248595 307578 387383 473806 543198
12588 543198 619001 700633 772233 833330 895262 941370 970306 989464 993964 971428 921765 869015
12576 869015 792491 711783 637194 560304 480125 403750 330590 268657 234775 199638 167848
12565 167848 150117 130419 113931 95499 92809 97562 87361 79685 73731 72922 71295 69227 67021
12552 67021 58286 65733 60271 50962 46655 57704 55517 49027 57725 54552 43088 25054 29724 46800
12538 46800 49877 51308 50944 50373 56276 59205 57921 63649 57655 49857 51825 58548 52702 38868 38503
12523 38503 34268 35067 45145 61392 71525 66646 66017 64995 49631 38076 29086 33744 46633
12510 46633 46380 42607 52864 58841 63054 65876 70960 63372 62829 60707 63974 77160 91140 95147
12496 95147 99361 92676 82417 71424 47171 44628 53426 61814 62477 77099 75053 63794 59717
12483 59717 56684 53218 56969 52960 35646 36147 69469 76074 77922 71930 76236 81301 84076 70729
12469 70729 70707 75411 72539 73597 68678 71208 84490 74361 64218 84693 88553 84828 83364 66541
12455 66541 64578 66030 63289 61196 61003 59216 61584 64426 66698 71650 57506 38248 33315 43357
12441 43357 50276 42237 35808 34892 42122 46047 47793 51862 51665 49232 48091 65726 80271 75527
12427 75527 67523 72615 68792 69944 87142 106543 126098 136805 145938 160345 182491 191304 191191
12414 191191 189812 192703 201699 215065 235800 231973 218041 199403 192985 180835 173500 171806 165008
12401 165008 159309 146428 132955 115879 102676 107363 99595 80328 69194 67883 72286 80738 85153
12388 85153 77005 78870 83870 85509 85891 101790 90643 89378 97557 106137 120710 122496 111217 94528
12374 94528 81681 74794 73628 66367 55397 62733 80014 87694 81915 75934 65858 59806 68726
12361 68726 71706 54753 60942 72002 79987 82614 77240 70601 69194 86398 94884 95966 99961 103763
12347 103763 112724 112315 116258 124899 142104 150393 144823 146453 147661 149978 156871 160911 159214 155695
12333 155695 154982 148110 127657 130971 148030 155304 154198 143782 115999 100554 108145 112772 108114
12320 108114 103525 101563 101573 94325 105112 110556 118389 119953 129945 155385 167683 187289 199266
12307 199266 209919 209747 212179 234625 256604 263549 261001 257045 267017 290181 318331 320520 338332
12294 338332 361431 377563 400381 418327 429103 455755 483552 520846 545470 554881 560809 543225
12282 543225 523452 534250 528593 499008 474149 441699 408462 380843 364460 348368 325300 311254
12270 311254 302691 300257 287437 271548 277513 278905 303188 310804 306089 309342 329892 331649 321111
12257 321111 314379 323502 336350 342003 353808 381112 385403 381709 374071 374641 384556 390563 400651
12244 400651 393852 399827 416517 420744 433274 439229 443002 464597 482016 490749 502019 518228 553621
12231 553621 576261 595149 609112 614553 629648 663722 686980 680954 695588 721666 745375 763685
12219 763685 770852 793546 826375 847404 873268 896842 926301 962174 1012069 1068788 1101881 1143258
12207 1143258 1199614 1263376 1345660 1425063 1486401 1548952 1621233 1715172 1798557 1903108 2025395
12196 2025395 2144127 2278632 2421414 2582146 2771301 2996687 3248726 3524679 3854012
12187 3854012 4254227 4744307 5303807 5928085 6611388 7388200 8247073 9268922 10437610
12178 10437610 11794649 13398486 15315288 17678224 20681717 24610403 29950797 37386218
12170 37386218 47623357 60990713 76768208 93177123 108674264 122944172 136531902
12163 136531902 149718962 162121839 173012745 181382038 186168554 186540374 182424960 174471291
12155 174471291 163833271 151454268 138226874 124626737 110521618 95354237 79199526
12148 79199526 63408997 49711085 39083076 31396858 25911462 21901207 18855382 16479929
12140 16479929 14568633 12974781 11617340 10445450 9415223 8514435 7716602 7008959
12132 7008959 6362758 5763908 5209940 4723172 4307135 3968344 3660434 3400299 3183829
12123 3183829 2996607 2810830 2636643 2474072 2333710 2198397 2066801 1945676 1846284 1758384
12113 1758384 1685909 1615616 1538417 1484505 1432336 1375459 1329588 1280298 1224445 1183756 1144597
12102 1144597 1104824 1059499 1027307 992479 953891 929827 909545 907453 921008 932918 958633
12091 958633 985847 1011382 1067325 1169702 1344857 1592087 1951698 2480071 3085713 3564488
12081 3564488 3705341 3371525 2749615 2127138 1631553 1299410 1071566 913836 808331
12072 808331 728003 655771 598449 564404 537034 509283 491081 480199 456796 421115 412421 415125
12060 415125 421668 412554 389681 381167 376357 372673 357154 329567 313149 322291 322976 312896 301333
12047 301333 279093 262044 250368 229724 224721 219760 212264 227259 214471 199992 169002 138745
12035 138745 130642 124599 127545 100260 83191 95077 95433 90119 99775 111217 120223 125306 122350
12022 122350 108374 97565 88381 105919 114661 128860 135305 139535 139847 143385 146942 169014 171810
12009 171810 170364 183074 207879 214059 208722 207392 208718 206495 210782 231440 230274 220337 219578 216556
11995 216556 213505 195866 176214 149613 134595 137973 148790 140340 148830 136823 115385 102986
11983 102986 108339 119767 123727 115279 109391 110266 116850 123463 115119 114646 124277 129631 126072 120973
11969 120973 138283 156763 170876 170542 174784 182627 177004 184614 194207 200674 216590 224422 212430
11956 212430 197147 203211 220820 236323 228666 219611 212691 180116 163837 174691 161237 152894
11944 152894 159697 166038 173392 182474 175283 170321 173301 188226 186006 182742 177754 159415 161711 147857
11930 147857 134393 141085 131286 123176 121639 124631 137698 148448 150212 148532 155776 142802 136714
11917 136714 139974 146112 138887 137677 149208 150322 148449 152910 153865 154647 149370 156518 186271 227774
11903 227774 278636 335830 371019 386401 355164 311251 292711 315554 362208 406417 421564
11892 421564 398406 382015 372654 378875 368614 313623 262204 220050 181679 156227 142875 120066
11880 120066 110146 110089 109743 115410 103916 90765 88516 91460 89884 112036 127662 130847 134515 126902
11866 126902 127769 126562 126114 118897 126612 140562 132895 133128 124388 111559 90296 73786 58754 49684
11852 49684 57405 56659 59941 73155 87949 96775 78498 76034 77322 69061 82945 83418 77390 95282
11838 95282 109831 132149 139040 119920 123258 123322 138503 161891 185034 207205 218305 230953 245343
11825 245343 250598 247769 240399 236453 220613 220790 226756 229535 213231 209420 209807 210106 212051 217772
11811 217772 216468 216752 210705 190382 151605 137527 148702 153401 124167 85313 61448 53026 48017
11798 48017 70271 104851 152627 208216 252625 291180 340268 388320 387090 372661 361280 344938
11786 344938 336508 338115 325158 315325 309987 322166 354571 391008 433764 491123 560852 630357
11774 630357 713150 799167 858403 919469 1022022 1138367 1202780 1175975 1058650 902077 752607
11763 752607 629590 549323 510815 499616 481537 467038 479810 486416 476192 454695 443546
11752 443546 451307 460864 481361 502722 506940 505559 507493 529568 573621 629112 698194 798190
11740 798190 910769 1018298 1120851 1219100 1303996 1375697 1438987 1485970 1527627 1558470 1577130
11729 1577130 1565686 1523684 1463406 1412162 1341430 1255595 1178504 1106147 1013805 951986 921282
11718 921282 916179 909593 917418 920706 941302 974299 991648 1012897 1037652 1077345 1099919 1105910
11706 1105910 1115372 1125432 1140462 1161289 1200252 1238869 1295183 1366706 1447358 1541723 1659675
11695 1659675 1786894 1922998 2064189 2238072 2441988 2685563 3030409 3543234 4295786
11686 4295786 5410733 6988144 8803222 10055226 9969840 8717117 7102660 5828177
11678 5828177 5080157 4748325 4648675 4663254 4754289 4898992 5103921 5362238 5693817 6078760
11668 6078760 6520532 7029285 7656877 8419265 9336858 10445667 11767417 13295150 15075342
11659 15075342 17150911 19626693 22727917 26709093 31930114 38721627 47279634 57813662
11651 57813662 71155255 89654308 117615838 161337734 228482855 323954207 438272820
11644 438272820 537290008 575719861 533862161 433470960 318145964 222649095 157225882
11637 157225882 115864201 89569796 71953246 59155827 49049004 40729748 33957455
11630 33957455 28567081 24333641 21000926 18351984 16244415 14554276 13174009 11996256
11622 11996256 10968926 10065887 9260382 8520956 7838295 7219856 6700264 6229933 5807164
11613 5807164 5429252 5067172 4717574 4403551 4159872 3937562 3721103 3488481 3268741
11604 3268741 3079072 2931738 2793838 2672202 2565341 2460865 2361893 2257771 2158232 2060793
11594 2060793 1962787 1875829 1785910 1712191 1664080 1630575 1594614 1551310 1491187 1430884 1383842
11583 1383842 1335548 1278387 1217313 1162032 1093123 1034150 990357 956165 947165 933120 918545
11572 918545 891972 862326 847415 849817 861960 850643 832329 801797 768102 748432 732496 714605
11560 714605 670157 637160 621721 612282 604201 590397 575782 545703 542430 509561 483171 482241
11548 482241 483926 489895 508751 516897 520675 523763 518439 507746 488942 463688 444333 426582 433984
11535 433984 447341 440556 415107 396218 372326 349181 337938 351657 378214 389018 397452 380036
11523 380036 313947 211237 92508 -19295 -73097 -56072 2137 60465 93271 86929 78330
11512 78330 75223 62688 79545 111662 136735 151782 166406 172399 150135 128684 116728 122391
11500 122391 118141 98079 81910 69130 87502 122198 143276 157919 185701 231407 296319 330578
11488 330578 344861 343455 347107 326452 299587 285752 265472 247690 237652 220666 214678 192253
11476 192253 173843 159609 157556 154909 145049 129027 136893 132566 124408 111028 111565 105368 90179
11463 90179 102166 110862 102494 104199 105366 108881 123318 145757 153443 158727 170479 177436 167161
11450 167161 177217 185132 189605 196134 192206 203211 194267 188439 192091 181759 176762 166530 171250
11437 171250 187861 199080 200654 192431 165638 161324 151634 157472 148474 116852 100156 101766 96865
11424 96865 104409 115295 118747 105771 99342 111401 116050 105731 119677 117142 129081 152323 162916
11411 162916 152419 146323 134213 129712 140217 135770 128740 122632 129380 134553 134657 128516 137338 146339
11397 146339 144085 137961 127184 120121 115893 119884 134609 139250 134443 122304 127077 136410 138552
11384 138552 119555 107400 102718 90246 71824 70810 91066 93406 88239 82789 79758 68238 83728
11371 83728 99325 102305 110353 116051 93354 83630 87023 84615 85997 97032 103166 92627 91335
11358 91335 82116 74741 85085 86669 80413 81478 68699 59236 46803 54793 57401 64093 54655 34403
11344 34403 37249 42390 53227 52068 57839 63724 53613 31645 11693 -8085 -10148 -6102 10042
11331 10042 15466 14985 30533 35512 27085 16337 29916 57373 68283 60175 57044 53900 55763
11318 55763 60763 68756 75967 73251 64670 58247 66315 60884 62026 65062 54745 40855 36690 48711
11304 48711 40486 23779 15104 35915 44074 35601 34192 35523 30248 28495 26356 22295 22373 31253
11290 31253 35382 41453 48943 53372 47198 33595 40566 28231 38591 40942 44940 57147 39669
11277 39669 34232 42400 33009 30067 29366 38759 31211 21479 26905 36805 43607 31862 25649 25954 23241
11262 23241 28337 29261 17781 21668 31271 32993 29871 22490 31134 35084 32590 30458 24767 26653
11248 26653 34466 38300 47392 58428 64183 60473 69186 82605 80441 68451 65692 50831 57536
11235 57536 67126 83550 95074 89581 71713 55980 51922 60987 67582 69459 76152 75675 86851
11222 86851 86961 96106 96460 105953 110129 117403 133770 151868 157175 149524 147767 153215 190991 216047
11208 216047 241394 283442 370435 469825 601151 819376 1158823 1669529 2310892 2880924
11198 2880924 3140115 2939429 2405822 1777108 1259403 888347 657331 535288 451507 387829
11188 387829 343819 302808 251584 238181 196317 154361 124572 114386 86172 71816 59138
11177 59138 69839 64498 49290 48696 55309 45920 43673 35457 39566 35034 17254 26652 28477 22964
11163 22964 27840 13604 5207 9771 3512 9574 11223 -6685 -5764 6750 19546 12374 7586 19486
11149 19486 15523 4165 6438 -1602 -2828 -13293 -5481 -325 4463 8635 7854 12729 9526 10046
11135 10046 26577 44172 31065 39145 53241 49475 67253 79079 63680 45423 36802 37098 37375
11122 37375 46329 42886 31628 20473 26223 21578 8723 -691 3167 5897 15703 13276 5387 7370
11108 7370 13552 17310 16545 6573 6799 5135 8553 20155 9134 4162 27979 19850 8371 7547
11094 7547 10525 25030 13004 -6264 -6204 3923 1332 -1537 4918 24327 22128 5938 -5467
11081 -5467 6670 13645 2766 -6208 -12424 -17263 -16404 -18338 -18625 -12899 -1793 4788 8863 13504
11067 13504 7376 2557 -12568 -8413 4161 8839 4790 8002 6574 -502 -6016 -3038 8362 21700
11053 21700 26718 3630 -17275 -16577 -5810 -15642 -16682 -10956 2747 18715 32026 21422 25686
11040 25686 22975 12895 20202 20061 12373 19696 17261 7488 9370 2895 2594 16303 22102 20974
11026 20974 19080 18608 11690 12885 10833 16113 13120 9867 2097 8234 6270 5110 -1297 -7352 90
11011 90 9589 16610 18523 20312 15164 27830 32930 23158 15306 16821 21547 21363 25462 28597 27090
10996 27090 20751 17527 18916 20671 19986 18112 22769 23707 20728 21546 32308 28087 27773 21339 33948
10981 33948 26673 17891 6246 -6554 -12221 -13140 -21454 -8638 12393 24739 31922 15012 10939
10968 10939 18425 26471 38771 43880 39086 28728 21621 2819 -19034 -15466 -3702 -1640 -2324
10955 -2324 5 6445 7564 12256 29577 29135 22602 24531 30666 26358 17992 25094 21641 9204
10941 9204 1474 -6090 -5071 1905 4563 10016 22058 17937 14639 20206 16686 2645 -339 7978
10927 7978 14646 14361 26352 35893 37775 30353 26411 19768 8892 15715 21379 5652 14068 18370
10913 18370 24484 10545 5406 18641 18536 7764 -1963 6391 5263 12863 14606 8229 9621 19666
10899 19666 9871 3905 12583 16054 9102 13946 14639 11588 3531 -7598 -20537 -24160 -22026 -26797
10885 -26797 -23786 -15416 -5166 -17702 -22551 -19307 -11251 -6452 5945 -411 5629 19827 28085
10872 28085 18495 8819 6050 -5695 -3529 -3094 -16517 -20460 -4792 -2061 -5483 -575 2184 4938
10858 4938 8957 -7889 -8252 -12201 -3046 10996 2570 7973 14137 23508 35545 22040 13960 3369
10844 3369 9748 -3500 9555 22686 13355 -1488 -874 -5652 -9541 -6254 11427 10397 -579
10831 -579 7133 18651 18293 15985 14800 18720 16661 22374 17300 5714 3728 -4471 -149 -8658 -17802
10816 -17802 -13017 -14511 -11878 2284 12529 3284 1534 -1588 -8555 -4830 -5877 -7301 -16894 -19824
10802 -19824 -15927 -9092 3332 12423 13820 -5274 -8460 -5477 -12365 -6422 7146 18004 22456
10789 22456 25305 16663 22097 14879 12291 7758 -21824 -28429 -13570 3396 -271 3122 4072 9316
10775 9316 12671 9786 6823 10169 5462 8382 -3710 5619 15887 7055 1256 3334 -9020 -13455
10761 -13455 -10387 415 5751 1529 16014 24814 8353 -2835 -4293 -3754 4962 12074 20960 10738
10747 10738 -13641 -30258 -25907 -13823 -11795 -19963 -23494 -35083 -29278 -13339 10761 14796 21325
10734 21325 14010 3297 3197 5318 8157 15172 18515 6771 12335 19532 38396 36879 19922 13167
10720 13167 3947 7317 -7747 -13052 -1156 5906 16584 22470 22606 12426 10892 26358 34471
10707 34471 28951 18002 6175 8472 18491 15221 12823 -1840 -7306 -8590 -3139 -2703 3060 9517
10693 9517 28700 41748 27366 2210 5131 7181 2096 -997 -5490 222 3954 2986 8203 16114
10679 16114 15953 -1873 -10981 -3252 15903 15684 22741 28749 31880 37181 37281 30832 31495 28767 25450
10664 25450 19226 12840 2947 -3935 1528 -747 6032 21947 21424 14547 13540 6546 5110 3023
10650 3023 8787 10733 2289 77 1973 7009 3798 1518 7849 16404 16109 7535 4681 12743 21488
10635 21488 4935 339 -5038 -23875 -11864 -4144 -6558 -13145 -13416 -16554 -23933 -29157 -8315 4556
10621 4556 7862 17412 18474 4614 -8967 -7970 6157 -150 -3178 -13592 -8325 -10522 -7433 -3431
10607 -3431 -5746 -14111 -11678 -638 4518 7666 13770 24426 28844 23168 -1816 -12740 -10486 -14552
10593 -14552 -6492 6405 2297 -12659 -10103 -7209 -7094 -6796 -2108 1999 -10663 -11211 -13697 -13106 -7544
10578 -7544 275 -5006 -14807 -3360 2487 1575 -257 -5009 916 3117 -6187 -10995 -6675 -8812 -6531
10563 -6531 -8571 -32459 -23903 -18601 -5165 5218 14978 9836 11360 16599 12715 10045 -2936 1737
10549 1737 -3862 -16999 -11097 -9031 -16664 -20745 -30050 -31099 -11308 6293 11328 8095 -748 -3708
10535 -3708 -4837 1053 2924 13199 9957 7603 11349 2717 -4636 -15281 -2180 7939 3879 -7210
10521 -7210 -20525 -23494 -10180 -1520 2539 -4395 -13901 -12933 -11107 -1844 6218 -5895 -9327 -14219
10507 -14219 -5386 5126 9756 13374 2947 -5328 -10163 -1401 -1810 -4897 -7986 -15810 -19151 -16241
10493 -16241 -6295 10546 7517 3715 -4976 -4651 5096 7259 -1241 -6594 -12207 -5396 5433 8026
10479 8026 -2730 -1713 -791 -6899 -20266 -11734 -10207 -13191 1745 5062 15675 21751 30380 14447
10465 14447 -6251 -16095 483 -551 -2645 1033 454 -17609 -17237 1483 14203 -3249 -14656
10452 -14656 -7897 -5144 -15160 -15620 -4312 10471 17992 4514 -5030 -13925 -21786 -21745 -9453 -4588
10438 -4588 -14924 -17554 4288 19726 14032 539 7590 7090 14126 9041 -10801 -2820 4269 -2645
10424 -2645 -1204 4624 11036 13876 12603 9843 10921 11078 5605 -9617 -6533 15981 22004 30058
10410 30058 23659 13924 5803 17232 28272 19960 3475 3368 -7811 -2188 12006 16274 18863
10397 18863 -1289 -2446 864 -1977 -17503 -15231 -17829 -14624 -12468 -11347 -18046 -8462 -10612 -11987
10383 -11987 -4708 -3672 -7761 -4405 -8849 -5591 -5240 -6588 -4726 17506 22384 23342 16039 -723
10369 -723 -807 2451 -9116 -7529 -8261 -2393 5583 1923 5523 12658 3768 2950 -3878 3178 -672 -8777
10353 -8777 -6552 1985 6762 884 8196 19284 11913 2213 -1002 537 8555 8423 -5319 -1845
10339 -1845 814 11203 15941 3719 -2165 -7519 -2307 11830 4633 -10964 -7827 2941 -2810
10326 -2810 -13236 8178 4233 -21028 -24800 -5740 -6861 -13978 -21612 -26129 -21223 -27183 -22943 -28369
10312 -28369 -23888 -7852 8008 4006 -7792 -5998 968 -5461 -3386 -5336 1233 2716 6419 6336
10298 6336 -3187 -16339 -15409 -2169 5695 4001 5447 21321 19288 4978 -13645 -10372 -8355 -1912
10284 -1912 -8840 -21223 -20255 -20136 -766 5698 4840 -83 4597 8418 13794 2313 -7682 4533
10270 4533 12584 22412 25761 21672 6992 -12020 -10501 -20763 -23702 -28366 -36228 -38590 -33413 -27817
10256 -27817 -27692 -24698 -16719 -3269 -2657 -9644 -14528 -9681 -12419 -10331 -3462 -2906 -12269 -20479 155
10241 155 8065 4784 716 10790 1095 3341 8591 10222 -1539 -15717 -13439 -9206 -11986 -2646
10227 -2646 3485 -1123 4501 5394 -1582 946 7077 -295 -5794 1700 18890 16075 11452 9525 5266
10212 5266 1161 6398 3645 3299 1844 -1305 7135 11801 6362 2447 -10925 -28891 -27980 -7439
10198 -7439 -11951 -18340 -24292 -19968 -8408 -4148 -5139 -7670 -4639 4621 -186 -8534 -20121 -12070
10184 -12070 2008 1124 5156 7796 3627 -1674 -3073 4350 13847 22608 20222 24001 13729 8115
10170 8115 3477 -1036 4863 2872 -8459 -12694 3 -2248 -6243 -3156 -15039 -18063 -9153 1694
10156 1694 10874 -4731 -8922 -8708 -1401 18893 18370 11375 12484 13637 14838 13050 -3836 -17897
10142 -17897 -12442 -1107 -4362 4772 -6386 -15805 -23826 -20693 -14117 -15872 -6866 -4576 -6904 -5866
10128 -5866 -12770 -18827 -10648 8302 25214 10218 5407 8401 4880 7143 -7247 -27349 -24908
10115 -24908 -11354 199 -2678 -13050 -7924 -21502 -29232 -15166 6912 8869 -5515 -8356 -9976
10102 -9976 -5399 4685 11456 7850 9468 571 -8073 -16296 -15825 -27491 -20043 -20782 -15605 -5804 -1665
10087 -1665 -1553 3313 7923 -5885 -12597 -16789 -3685 1969 141 2821 -12427 -20109 -21070 -6355
10073 -6355 3910 -1284 6773 6529 36 -5559 42 2221 11136 1776 4100 4105 21517 25210 22838
10058 22838 12298 19930 23217 4076 -13695 -9883 6505 -7105 -18047 -17438 803 13572 15512
10045 15512 9762 15706 11969 -157 -2292 10617 5989 12828 5707 -15328 -5070 956 -1767
10032 -1767 -5084 -318 7349 12679 10503 2790 -296 6118 17103 16619 -5174 -17656 -20292 -28429
10018 -28429 -18001 -11401 -1327 1582 -5064 -4011 -7512 -11869 -13670 -4457 -3231 -3071 -1027 -1461
10004 -1461 -14946 -24094 -20614 -11992 8769 14247 2430 -15111 -19739 -14993 -7845 -12853 -28122
9991 -28122 -18710 -10132 -18959 -15599 -19610 -21519 -21672 -11076 -12772 -4433 -5148 -10608 -1865 662 -4829
9976 -4829 -7649 -6797 -6378 -2422 -1159 -3615 -15874 -31227 -26741 -14453 601 4095 -723 -3582
9962 -3582 3418 -2147 -7324 -11464 -9502 -5665 -4895 2222 14194 14663 6089 -9847 -3933 505 -1274
9947 -1274 -11842 -11836 -1390 12039 7075 4917 -1766 -4413 -14040 -18029 -9302 -7685 -7002 5652 3183
9932 3183 -355 7307 12801 23089 6267 10119 19111 11044 -354 9359 16112 4516 -4398 -3954
9918 -3954 2649 1031 -9385 675 3891 411 19210 22342 18869 3887 7133 14238 5925 -221
9904 -221 -18106 -21681 -17901 -11096 -4767 -132 3801 -3333 -7828 5716 10307 13869 10255 10501 3863
9889 3863 -8256 -10839 -10384 -13668 -10360 -6217 -7302 -19487 -39274 -35562 -26140 -20635 -8145 -7999
9875 -7999 -5736 2186 2710 5258 10420 11130 12176 17147 25706 17853 9597 3562 2302 -4411 -13755
9860 -13755 -23592 -16604 -12318 -506 -159 7318 20825 16775 20702 20501 16359 16224 27163 23806 24552
9845 24552 35189 30095 32040 25294 27371 44831 45717 57849 74949 88842 117028 175559 262937
9832 262937 389006 522190 608093 585203 468220 318062 192081 119738 78166 64916 59705
9821 59705 44859 23042 10801 11349 7066 10459 28320 37235 23039 20299 30167 24736 25624 30197
9807 30197 27760 25400 19431 10240 1629 1689 -2316 -8286 -6462 -9780 -16522 -13930 -11515 -4852 -15
9792 -15 -14287 -13205 -8807 -26344 -33467 -29245 -20085 -9824 -12600 -17812 -15297 -15391 -18821 -12513 -20530
9777 -20530 -20490 -10074 4944 7779 -7782 -23980 -18257 -10677 -10822 -6879 -10922 -7410 11247 11134
9763 11134 5924 3506 4836 23472 19977 -54 -14341 -17861 -18643 -12397 -13820 -12276 -14393 -10516
9749 -10516 4600 11891 15027 18844 14188 16566 15469 13246 16206 20137 3823 -16506 -14574 -8630
9735 -8630 -6672 -4356 1024 -152 -3609 5740 12866 19526 9954 -4405 -9923 3048 2929 6549 6816
9720 6816 -2862 -4980 -1544 1071 2655 -10496 -5636 -4517 9671 15979 3567 -12180 -14202 -2849
9706 -2849 6102 7269 6088 6867 -5078 -7450 6873 22279 22247 12874 5092 779 -2029 5113 9560
9691 9560 12379 5910 -4102 -16775 -22243 -21749 -22698 -23464 -6922 428 -8062 -8427 12580 -6049 -27303
9676 -27303 -28333 -19355 -15138 -14430 -6138 -10483 -14471 -22979 -18844 -13418 -5164 -1765 -3784 -10802 -9519
9661 -9519 -8489 -5254 2139 13380 16201 16591 10589 17667 12030 14116 14056 34230 31176 12552 11927
9646 11927 12114 1846 2809 8047 12834 14834 95 -3863 7831 8466 -1114 -6979 -7302 -14932 -12117
9631 -12117 -21960 -21403 -14902 -189 -3716 -3791 -11388 -9933 -21085 -29592 -37152 -21429 -3928 10714
9617 10714 6131 -13968 -19519 -9803 -11840 -4770 -894 -5742 -10722 -17377 -11810 7954 4837 1884
9603 1884 -2058 -13158 -15496 -18545 -25462 -28723 -14259 -2857 -8061 -14378 -17614 -7045 -5550 -14212
9589 -14212 -7304 -8239 -5222 -2629 7744 12803 412 -1926 -6647 1315 12937 8324 -2486 512
9575 512 183 7092 14008 16252 12016 12280 6063 6155 4201 6320 14785 13455 -4516 -11709 -14208 -5122
9559 -5122 -2539 3903 12944 8660 2899 -614 2889 14280 11217 2770 -4569 -18474 -24867 -8048
9545 -8048 17347 23415 13198 23526 25333 9480 -5433 -5585 -6126 -4141 14809 26947 20293 -879
9531 -879 -4792 159 10989 16045 5276 11935 9046 5641 4606 4589 5371 18375 23100 28847 36139
9516 36139 22306 7221 -1852 -7576 -7700 -2416 -210 -7379 -2774 16881 26376 35661 23639 23136
9502 23136 17836 7023 -842 7468 8523 2841 -6162 -4549 -8930 -21455 -28773 -34579 -23547 -1818
9488 -1818 -255 -9530 -5112 -512 -388 2870 3174 -7112 -8416 3060 1065 -8439 -637 4255 20691
9473 20691 14635 4268 16196 1464 -3499 13886 32955 24815 12672 3355 2839 12736 28657
9460 28657 19139 20139 16170 8232 -626 -8830 -14363 -4683 -6446 -392 4397 -937 8714 14497 11011
9445 11011 16628 9322 -4053 -18682 -18067 -8569 -1371 1267 1575 891 13089 34540 36887 36003 36126
9430 36126 33283 52784 50376 49714 50455 54258 45194 48550 59699 53982 63301 89691 105823 115554
9416 115554 110415 107859 123624 140695 167047 193236 212106 235419 252241 289117 337684 389959
9404 389959 450844 539112 657099 809036 1019445 1326508 1768729 2389675 3229796 4293293
9394 4293293 5391358 6061244 5897351 5024356 3900178 2910824 2167672 1644561 1284794
9385 1284794 1014228 823581 672791 573114 494616 424949 369929 314386 264857 229969 207297
9374 207297 196371 177038 160603 141961 139617 140678 137501 134740 133886 120469 103729 94009 95668
9361 95668 83129 82073 79203 69872 57460 35159 22359 30696 26060 24880 29671 39549 45331 36841
9347 36841 35042 20031 18877 23680 28321 18266 15074 18221 33850 30760 21976 10350 -4214
9334 -4214 1697 19256 25884 21776 13812 6044 -1020 4003 3885 1772 5001 5232 5551 9049 10891
9319 10891 16646 15769 7475 9167 6462 -6335 5319 11341 -3262 -1816 14631 29868 19690
9306 19690 9403 10765 15268 25498 5512 -14314 5338 14866 14389 13676 -11596 -23109 -23066 -10481
9292 -10481 -365 -16896 -20454 -5288 -869 -6670 4251 17902 28203 31057 21341 11754 -45
9279 -45 -2377 11469 23303 17279 8517 -8383 -24865 -31929 -16859 -5717 4759 6393 4141 13258
9265 13258 9970 -396 5529 9101 3032 -5287 8741 16376 5368 -9385 -35327 -28847 -6816
9252 -6816 -4708 -2421 -8934 -31532 -39296 -19480 -7623 766 -983 -8893 -5634 4773 4628 3087
9238 3087 -2625 10288 25501 35336 31188 16964 2470 6058 11926 6309 12830 11597 -12768 -13518
9224 -13518 -5380 3802 8309 7185 12687 12936 -953 -13955 -17733 -6581 3183 -1475 -3218 421
9210 421 -3351 -3905 -7191 -9886 -17079 -14333 -2389 7196 -3782 -7246 5596 17007 18977 10985
9196 10985 13087 29445 19690 16202 18927 1156 -15711 -16196 -7158 5513 4602 5655 5116 -1422
9182 -1422 -3384 -4930 -1910 -9532 -16360 596 -2341 -25005 -35691 -30705 -29910 -32083 -17527 -13951
9168 -13951 -20395 -11204 -435 -6135 -3614 14833 14435 980 4666 1804 -9044 -3727 9451 6285
9154 6285 -9906 -10550 -2582 7667 3902 1041 8433 5154 9380 3988 -13287 -11747 146 3370
9140 3370 -352 -3544 -1190 8867 -7171 -21592 -12179 -11719 -188 2312 1736 4774 10470 19165
9126 19165 11829 -100 14080 12249 1607 2891 12367 11554 11819 12004 17284 8995 -2350 7626
9112 7626 8444 -8107 -5445 5315 -15339 -33307 -38538 -30408 -16842 -4924 11037 12852 2488
9099 2488 7445 4013 -2923 -2664 8046 5796 6347 10993 10178 8233 7674 2298 9466 9494 15247 11568
9083 11568 -1324 -9874 10316 18363 2658 924 -16323 -36339 -35726 -32109 -31199 -33639 -23898 -8446
9069 -8446 4579 2220 2655 -15265 -22906 -9193 -8328 -3425 -5647 -5549 -4028 -4063 -10521 -18582 -5094
9054 -5094 -24930 -18178 -742 9358 -1719 -20652 -21565 -18212 -15533 -19675 -6109 1234 -12345
9041 -12345 -9576 767 3149 5649 17129 21618 13634 4971 8645 8059 -5243 11991 11905 9558
9027 9558 8476 2588 5906 -3778 -4400 -9404 -8404 -7925 -7426 4494 24703 30894 22821 12141 1836
9012 1836 -2582 -2312 1681 8347 1177 9891 5767 -1600 4786 5733 5754 9489 2583 -2457 -378 -7001
8996 -7001 -15585 -22797 -12370 -9436 -18714 -25705 -14863 -5356 -7928 -2969 5255 13406 16278 17618
8982 17618 12228 10418 13103 24502 13315 3442 -7960 -17093 -17089 -9043 -12 -5095 -4151 -3775 -5963
8967 -5963 3203 2824 -1412 -5335 -5557 -929 5039 9447 15651 6113 -15270 -18362 -5457 10621 4184
8952 4184 -3369 -12763 -21233 -25607 -16242 -3206 -8837 -12898 -9901 7362 15574 24847 49360 72464
8938 72464 81881 83074 74910 66477 49020 30261 24650 31026 36402 39973 43153 41185 22406 16201
8924 16201 10963 9957 17601 31022 32880 7613 -3017 3844 -1281 -8070 -10767 -9882 410 7443
8910 7443 5339 4925 -1720 -367 4995 2390 229 2343 -3123 -2046 10402 24279 17063 6259
8896 6259 34 4732 8195 27416 47106 66151 81297 96320 93856 74008 69050 57447 40448
8883 40448 33443 19333 18608 23311 18498 5648 13507 23630 18671 13879 5114 14852 12586 7203
8869 7203 4126 7717 15366 16271 38334 52773 45357 27372 45271 54721 67594 78436 83914 101305
8855 101305 121975 132575 166890 204822 247780 311873 401191 542961 738936 1015361 1356411
8844 1356411 1683756 1791360 1609465 1257512 900155 644000 462959 344439 273947 242629
8834 242629 204740 165745 141439 119434 108576 88520 57614 49180 58642 58563 47668 40291 47183
8821 47183 59034 37364 17187 6250 20192 18899 7305 12458 15133 20818 13248 9430 11923
8808 11923 3893 -3750 -670 6371 8318 7416 221 -17166 -16916 -4391 15641 17133 2113 -12085
8794 -12085 -11289 -6395 51 7832 -4593 -5340 15304 27187 35393 26940 27969 17434 7302 -170
8780 -170 1323 3754 -3259 -1461 7755 12502 22065 26033 17166 289 7145 2037 10549 11326 11248 5820
8764 5820 -3751 -7338 -4663 -1057 -2794 -5811 -7143 -6377 -5787 2275 -6605 -6926 3058 8080 4419 -3333
8748 -3333 2015 5639 6120 -7278 -4055 2235 2368 4299 11393 32502 22955 12642 10850 11080 18318
8733 18318 28928 11368 -12769 -583 6963 5994 1994 4277 6280 6708 3061 2603 13412 4468
8719 4468 -3988 6906 11802 -1108 -12318 -20580 -17151 -8416 -3958 -10692 -9217 -9097 -15010 -7089
8705 -7089 -10307 -18665 -21933 -26099 -17988 -12057 -11839 -16362 -7983 -4286 -619 145 -20886 -20457 -20248 -18168
8689 -18168 -7291 2674 -5166 -14387 -21811 -23113 -4175 1308 -5709 -11578 -5406 -10919 -23435 -33434
8675 -33434 -21726 -5442 -10243 -16195 -34597 -23862 -8738 5494 -8177 -14746 -7663 -9174 -11114
8662 -11114 -3964 4171 4027 -5243 -8125 -5954 960 13488 16720 13143 -727 -3487 -1547 -2205 7841
8647 7841 20341 5605 -10426 -14657 -19377 -11925 -11543 -17771 -19670 -24525 -20138 -18480 4054 20775
8633 20775 49352 83845 119025 160331 160622 139713 101535 68700 29159 26439 33077 26795 20516
8620 20516 15902 3270 10524 4802 -9131 -17484 -12900 -5854 -817 12442 3198 -10488 -4985 -8617
8606 -8617 -4 7025 13081 9834 15784 20116 29264 48929 56045 52259 46081 34405 29880 24807
8592 24807 24099 19018 38899 73952 111750 164500 216218 285812 318085 285245 221177 150073
8580 150073 110790 97704 76979 59668 43716 41337 36156 34883 31677 34730 22085 20772 20402
8567 20402 20093 9889 4496 5397 7517 1041 5355 13779 23774 16871 8474 -4404 -8054 -13524 -7987
8552 -7987 1200 6340 20183 15084 12712 13198 11000 28878 42718 53456 68550 106552 133773
8539 133773 145287 138920 104504 60663 41286 40005 42132 37663 36835 30439 28226 17595 4192
8526 4192 10001 17147 1434 2399 2720 3127 -3874 -3683 8914 -558 -7569 -4223 -7818 -16389 -4910
8511 -4910 -7475 -17107 -27630 -50016 -45972 -26265 -26006 -24352 -18688 -16127 -1800 3748 -871 -9856
8497 -9856 3221 15127 22745 20930 24233 18032 14261 9356 5918 18077 15331 17313 18051 20633
8483 20633 12726 -7562 -4245 -8356 -2412 6314 3392 -9732 -25317 -24506 -17080 -19163 -19560 -19457 -12597
8468 -12597 -4778 3421 11286 5732 6477 3370 6142 14458 10067 945 14817 21519 14294 8406 14624
8453 14624 36455 31129 18557 1823 -14029 -2466 5813 2623 -5038 2222 13359 397 -18415
8440 -18415 -8403 -3329 2883 -13316 -17681 -9760 -4674 -6992 -4298 -8885 -4220 -8470 -5534 -2539
8426 -2539 9834 10338 6621 -3186 1974 11113 4215 -12477 -17295 -2764 172 -434 -6917 -8903 -8266
8411 -8266 -13486 -15171 3289 1279 -11196 -5551 -7868 -23003 -20787 -16847 -28658 -21762 1068 14302
8397 14302 3370 4752 10532 11395 11421 2555 324 5210 -727 -3339 2414 -9505 -17236 -13449 -7024
8382 -7024 -12328 -4132 4843 -11433 -17711 -18938 -19027 -9896 -32 1747 -999 -705 6825 5366 1117
8367 1117 -12183 -18881 -12678 3813 3252 -8496 -13714 -33164 -36998 -25807 -29275 -18447 -19496 -22282
8353 -22282 -14108 -21134 -27623 -25597 -21407 -22831 -4326 24446 22054 -576 -4934 2173 10103 13413
8339 13413 12458 2163 -13256 -21046 -29396 -31683 -20820 -11405 -17660 -23522 -23780 -35950 -35332 -38605
8325 -38605 -33758 -11249 -3992 -4084 -15979 -8382 -11388 -25741 -22564 -16523 -4265 485 8456 13826
8311 13826 8401 8772 18506 21010 4116 2183 -3632 -1642 -3983 -6963 716 9277 6948 -4043
8297 -4043 3427 8058 9347 4326 -15095 -22564 -17342 -17876 -3688 -2692 -3640 -5179 -9987 -12073 -5411
8282 -5411 4820 19374 20683 2532 -8345 -8370 5962 18824 13119 13249 14918 12575 7659 -6556
8268 -6556 -14397 -8368 -19144 -11363 -2803 -12995 -16662 -12854 1942 4965 -1536 -22 3620 13780
8254 13780 10199 -6247 -19008 -14773 -6868 2516 -1519 5487 1831 -4762 -14029 -21912 -17400 -8096
8240 -8096 -15797 -24182 -26795 -22002 -12071 622 2937 673 -11735 -11213 -21189 -15552 -15652 -2493 6223
8225 6223 13419 5747 -16472 -21636 -5309 -333 -6837 -17207 -17795 -15779 390 11018 18465 8408
8211 8408 1379 2223 616 -11340 -24135 -8974 -4576 -17517 -8406 2726 12762 19062 16165 16598
8197 16598 16243 11416 2148 -6389 -12106 -8824 -4591 2212 -7138 -8440 -6033 -8540 7431 13744 19351
8182 19351 23875 14927 11107 10911 3092 -2571 -6849 -6509 -2476 8481 1578 -10771 12143 32169
8168 32169 25682 14720 13419 23130 25246 12791 4995 10130 11081 6484 4145 4530 -1047 4629 3899
8153 3899 2124 3312 4123 -7095 -11485 -8707 395 6929 4498 6776 10656 895 -7727 -10362 -12838
8138 -12838 -21646 -8369 -2512 -13645 -15978 -21472 -27452 -16707 9446 8874 7069 8214 8999 631
8124 631 -1776 -2461 6582 -6325 -18085 -3356 -4893 -8375 4347 21438 32765 21865 7158
8111 7158 10871 5750 -3309 -14296 -3975 -3431 2457 7475 -3772 -9467 -5386 -6611 6327 6229 10345
8096 10345 2253 -1713 -2353 -9646 -2443 2914 -6870 -5759 1116 -949 -1666 -14566 -18053 -4385 8731
8081 8731 6791 -8297 -5147 -2098 2494 -1800 -90 4894 11748 6832 -4649 -10337 -7643 -9785
8067 -9785 -4337 9246 8285 -3085 -1008 1647 -11502 -16747 -16576 -30518 -27793 -15759 6662 17766
8053 17766 19460 -2146 -23186 -20912 -5770 -10606 -19269 -8848 -4247 -976 6204 4527 14389 15058
8039 15058 10663 -2117 -8154 1802 10869 9536 5314 -3197 -10654 3748 13055 4834 -3814 2484
8025 2484 -4742 -13333 -25743 -26305 -19004 -7982 -6872 -12125 -7476 13040 10839 3824 76 -2689
8011 -2689 -7777 -1274 3768 1688 3817 5012 11903 11573 10363 11150 7504 12470 7143 13545 15639
7996 15639 14811 12107 12564 8425 7521 17589 25165 20313 16728 16584 22045 11506 4168 883 11406
7981 11406 25266 19111 12189 8180 -4908 -4667 2578 -10586 -8184 -19571 -20461 -4740 892 -9570
7967 -9570 -7324 5006 18787 28897 47354 43549 23888 19622 10321 -9063 -14167 -7622 5088
7954 5088 19917 7557 -5861 -6789 2910 -9366 -26500 -35676 -35133 -18153 -4696 -11136 -11860 -12885
7940 -12885 -18625 -6971 -7854 -16253 -13069 5150 9513 1890 -14187 -23104 -6453 -7483 5050 14370
7926 14370 11817 19790 18012 18705 9159 11469 9493 4277 4590 7402 3720 -16320 -25602 -17812 111
7911 111 6302 -10105 -13254 -13110 -24049 -35039 -26686 -26959 -14006 1475 5120 10850 -1837 -10229
7897 -10229 -10210 -24249 -23542 -21361 -19224 -4230 7859 9060 2696 7327 413 -4758 -7454 -1181 8527
7882 8527 -976 4718 5326 8091 6627 11223 1835 -3644 2173 -4823 2771 20784 23256 23602 18145
7867 18145 14629 20170 14954 5761 12545 28674 20363 8971 -2603 10142 12457 18763 17200 17040
7853 17040 3455 -7878 -5724 1832 -4811 271 1512 5211 7235 -355 2039 9016 -6678 -10630
7839 -10630 4746 2180 12633 2463 7123 6214 10576 6625 -9166 -2815 2111 2145 -2980 -5115
7825 -5115 -9957 -7992 -17227 -13281 -7889 -1458 -204 -12694 -22261 -17614 -7648 -5122 1182 558 -163
7810 -163 4729 5443 8956 -2928 -6935 -11010 -4900 23314 23612 632 -8496 -19194 -19981 -9287 -2994
7795 -2994 -4525 6420 16489 9673 -4688 -8383 -6507 -20986 -25424 -21755 -10542 2297 845
7782 845 5978 12540 5334 -1234 -1033 -10162 -13801 -6541 3208 14253 29142 29654 21614 19160 11809
7767 11809 9107 16421 18425 15511 5698 6624 -1343 -4753 -10932 -7927 336 731 -13256 -23262 -4711
7752 -4711 4523 -417 -3144 1409 -1090 -8284 -7250 -3524 -12907 -13623 -3752 1493 -3174 -3851 -1647
7737 -1647 -5657 -6309 -16001 -13972 -13971 -6906 -5263 -3427 1027 -3879 -65 6797 10955 -10025 -11661 -4142
7721 -4142 1185 5518 7510 -5324 -11504 -11506 3949 9655 8004 -9539 -1515 1184 4274 1736 3905
7706 3905 -12595 -7193 5781 10299 11547 11788 16578 12483 2377 -10766 -23178 -13976 -14207 -16064
7692 -16064 -5388 -13899 -21649 -19677 -16633 -17044 -22625 -17312 -19690 -16542 -1452 188 3056 -4471
7678 -4471 -332 8788 7369 8336 16261 6298 -7947 -15837 -2356 5872 5896 -3192 2767 13453 9839
7663 9839 -5091 -11679 -19928 -20203 -11472 -5290 12712 25112 11596 2865 1751 -2244 -7379 -11371
7649 -11371 -21991 -24694 -31515 -35794 -34375 -12135 688 -7605 -8862 237 6446 2615 3417 8586
7635 8586 7054 5193 2715 7732 14619 4553 -8313 -4997 7114 48 -3387 6795 16349 11515
7621 11515 794 -438 -6258 -15299 -17928 -12788 -4939 -5741 -9727 -10708 -15526 -10772 -3271 -7960 -114
7606 -114 5456 10319 5270 6108 11977 12628 9675 12010 10892 -13880 -23911 -29942 -15235 7143 18587
7591 18587 18861 11041 21543 18851 8353 2392 11400 13819 2519 2268 1596 501 -1329 -3979 -18454
7576 -18454 -739 10669 2820 -6529 -4599 6215 -3091 -13962 -2767 -20585 -13866 -1023 657
7563 657 -8041 -22477 -26668 -22829 -22559 -25336 -15873 -11960 -634 14619 25041 15784 3763 2896
7549 2896 179 666 -3522 -5001 4556 -199 -5879 -16384 -14735 -19467 -17490 -2030 9846 11369
7535 11369 -8835 -22288 -15518 7491 20237 15154 14184 12068 2790 -9159 6819 20665 2606
7522 2606 4959 2783 4839 9621 12926 9226 -2770 -538 2824 -1607 -1778 -5805 -19979 -29091 -26301
7507 -26301 -9313 8489 13682 6270 7787 9650 9566 17510 16783 13912 20583 12623 5072 10804 2573
7492 2573 602 -7027 -20924 -30297 -34602 -26899 -27797 -19943 -9609 -10584 -18090 -25379 -5436 640 -10737
7477 -10737 -7238 -4887 -4589 -1073 1004 -648 8101 10165 1403 214 10717 11349 -11026 -17090 2091
7462 2091 -1064 897 9931 809 -11184 -12154 -11037 -1060 12900 713 -7794 -10026 -11716 -9536
7448 -9536 1499 1022 10385 24637 35829 32185 14685 12653 15183 11726 -5171 -17481 -13239 -4220
7434 -4220 -7898 -19722 -8280 -1869 -5404 -4880 5598 -3200 -14206 -6254 9158 19970 -829
7421 -829 -9811 5034 20576 5990 -3691 -12973 -20755 -16159 3399 10009 -39 -6319 -19401 -19793
7407 -19793 -17603 -5908 6536 3174 -5147 -2219 3776 -4815 -677 12790 9459 9678 2677 -3266
7393 -3266 4403 2316 -3423 7594 11080 8052 7534 6633 618 -7116 -14552 -17339 -21409 -22742 -14650
7378 -14650 -8361 -14948 -27307 -31201 -23187 -28308 -13606 -8525 -4331 -8253 -7004 -2199 13630 16831
7364 16831 2852 4564 3480 -582 16045 8578 3389 3737 1276 12736 18670 6428 -3012 -2409
7350 -2409 2327 7713 -5556 -23405 -11829 10834 5546 -262 -4911 -8585 -13772 -2391 4314 185
7336 185 -5651 1198 -1794 3086 -300 -4953 -2386 -4080 -11823 -2342 -8343 -8140 -6485 -3006 58
7321 58 18302 30607 25001 16493 2930 -2773 -10698 -4604 4929 24343 20673 10241 729 11158
7307 11158 2835 -7787 -8740 -22284 -1193 11480 20545 -22 -6767 -9516 -10982 -16452 -21098 -12102
7293 -12102 -21105 -13968 117 3808 3996 10163 11340 13513 16019 16458 14249 11039 1411 11327 34038
7278 34038 38782 32152 28705 25809 6803 -20104 -18166 -874 11350 9299 478 -8112 -16596 -21924
7264 -21924 -20455 -26605 -10859 11537 17155 27434 30158 29493 18315 10854 7591 6044 8493 8292
7250 8292 15136 17754 8806 11179 28148 34323 28857 24060 30069 41004 29373 14071 11610 15934
7236 15934 21864 12731 -6023 -5302 7225 14516 5774 -1271 -6166 -159 -767 2732 9439 -9393
7222 -9393 -11537 -15348 -3407 5717 20672 23130 17381 14564 2508 -2278 6243 5257 -12534 -22569
7208 -22569 -22613 -31872 -31363 -12837 6238 8698 4950 -9257 -12774 -126 -1892 -10445 -4837 3158
7194 3158 -6760 -3267 12446 22528 28226 28769 22747 21060 19655 14006 7418 -5110 -18925 -16151
7180 -16151 1569 15739 14165 -4629 -16423 -21434 -26496 -29381 -30526 -28892 -32784 -24700 -18498 -20618
7166 -20618 -16620 -1768 2102 6439 -5181 -7165 -14133 -27285 -21542 -18305 -17364 -12101 -12715 -27120
7152 -27120 -25052 -9319 -9705 -18722 -24997 -13426 -12383 -7909 -3186 -299 1404 -3536 -11284 -11299 -14088
7137 -14088 -11627 11094 28399 17682 12723 9578 2897 3173 12235 11391 -13062 -22156 -15278 -5917
7123 -5917 1555 13183 -6407 4359 7333 -3026 -8573 -6315 -16926 -15707 -11612 -293 2103
7110 2103 -10221 -17476 -17472 -9728 -8609 -11097 -2237 4570 -707 3046 -3860 -21201 -22527 -18507 -32437
7095 -32437 -31919 -28360 -18195 -14258 -23021 -20230 3643 8066 3159 15304 22393 24108 32897 31672
7081 31672 15503 -1295 956 11165 10481 4933 3181 1643 17283 21304 19308 22582 21916 11178
7067 11178 -13702 -24728 -15477 -11146 -19743 -16371 -14369 -9559 -7018 1624 150 2498 1581 -3944
7053 -3944 -1938 3427 4788 760 -3125 -383 -4881 -3730 17387 14030 19799 8408 -4645 -5994
7039 -5994 -9542 -11244 -3191 -5709 -3012 -5305 290 11778 5129 -1634 9997 20871 26422 15538
7025 15538 -5702 -19644 -14229 -9083 -1807 -12855 -20413 -33215 -23919 -12304 -22887 -21233 766
7012 766 9156 1887 -4685 -18675 -20835 -9005 -11929 -16216 -5658 4772 -7663 -317 -2695 -27332
6998 -27332 -21064 -8113 7141 16587 24798 13643 -5957 -25789 -35162 -29851 -20032 -13427 -15976
6985 -15976 -8065 -14239 -13609 -9233 -7557 -3426 -3816 1037 -6855 3168 2769 -7696 -8206 1513 14655
6970 14655 13260 10096 6353 14846 18014 13438 12894 12089 11471 13426 35851 52263 34269 8227
6956 8227 -7865 -2949 14880 20253 11736 10538 7281 7430 13456 17580 12170 7711 17425 6953
6942 6953 5558 4912 10170 12108 5393 -8540 -19684 -20990 -14071 -10739 -11178 -19103 -1585 19482
6928 19482 13882 -1623 -5212 -7090 -13695 -33559 -37982 -34272 -25713 -26122 -15560 1727 10050 11775
6914 11775 10831 27312 23338 13900 18762 19759 8613 12920 15423 3158 -4071 -18911 -30298 -40454
6900 -40454 -36123 -23040 -12509 5471 13072 6296 1145 -2795 -11081 -21173 -16335 -3524 14626
6887 14626 25291 29613 22913 16670 5898 1552 11433 6249 11370 -1315 -13637 -17569 -21752 -22809
6873 -22809 -25320 -25647 -22674 -11550 -11847 -14208 -10871 -16864 -15623 -8814 -5707 8229 6717 -3274 4688
6858 4688 4740 -10536 -3207 -22 779 702 18470 28591 11340 7560 7489 5491 4692 -3894 -6799 -13970
6842 -13970 -20986 -15212 -8739 -9964 -1639 -2094 14081 16804 12542 -8572 -25435 -26898 -28482 -30723
6828 -30723 -20740 595 -6006 -1579 1668 -5797 -8965 -197 1244 -5811 -11403 -19304 -14914 -3952
6814 -3952 -3126 5235 -2617 -14167 -7069 -3676 -11517 -8813 -889 -744 -14302 -9011 6063 -1963 2072
6799 2072 -11466 -20739 -5715 -5222 -12158 8185 19195 10548 657 -3804 -21870 -19889 -966 7549
6785 7549 7558 12089 4364 -16511 -14957 -7015 -7374 -6059 10377 7738 -5268 -6333 -12305 -9207 2182
6770 2182 11468 8096 10238 23155 14834 9023 2913 383 1927 -5028 -7818 -4197 -1740 7204 25853
6755 25853 33162 15733 6947 3416 6616 4679 -14634 -22289 -30123 -17394 -4581 3609 -980 -1463
6741 -1463 2968 -7444 -12114 -7671 1208 19782 19049 17916 27053 23608 21175 13577 18853 15382 8904
6726 8904 21619 30978 5429 -1474 488 -3445 -1524 -85 17149 22194 33257 31987 23402 25025
6712 25025 27762 22599 11509 16617 29399 23901 3453 4545 8597 -3972 -8797 -8851 -12780 -12273
6698 -12273 -10975 -17205 -11282 -13573 -33050 -27189 -16195 -3285 34 -8426 -17048 -9202 2181 6506
6684 6506 3350 -6150 -14817 -2987 11496 14242 17373 16749 3064 4304 1066 21612 20673 20187 22604
6669 22604 5360 -1977 -5582 -10392 -4200 -6155 -9608 1258 2246 4230 -5423 -5240 -5193 761 -17174
6654 -17174 -14559 4088 9969 12113 13265 13904 16123 14310 26761 32137 13916 6027 6667 11603
6640 11603 10139 12209 14853 13964 17066 18517 17300 23216 34749 37290 35051 46965 46931 42447 33224
6625 33224 27350 17280 16884 30908 44851 52596 48522 51438 46934 49413 53331 66204 89691 141476
6611 141476 202002 250580 253941 223001 186745 161153 165780 183075 199810 203675 221649 270915
6599 270915 342012 443847 556722 703919 902938 1185927 1675632 2500417 3844235 5710327
6589 5710327 6898823 6303907 4674855 2988153 1922007 1350533 1016597 788350 632532
6580 632532 513754 423568 356408 293632 250302 198970 164328 167435 179272 180724 206688 242981
6568 242981 255325 234446 193517 144767 109859 111630 107966 108468 89616 57239 51682 39813 31956
6555 31956 29281 37761 39553 35837 41026 31911 32644 34734 31991 20243 35947 38549 36378 31059
6541 31059 29144 38499 34876 29293 32600 27783 18931 10093 8492 8356 15914 9321 8142 18060 17354
6526 17354 15230 16945 13932 8719 19194 16718 8582 2974 -8683 -2082 5452 6048 12311 3628
6512 3628 -4107 7673 9965 -235 -4026 -8221 -19674 -7871 -4115 -8464 1397 -6801 1510 10875
6498 10875 19802 16337 1323 -20164 -17732 -16060 -11856 3512 10534 11998 21302 32384 24471 -1805
6484 -1805 -21126 -20456 -13007 5866 21215 19349 3156 6846 12971 7726 6838 2081 -9781 -4503
6470 -4503 9060 7485 13110 20427 18909 18112 15703 22323 11272 6242 5695 -10615 -15065 -4884
6456 -4884 -1073 -959 897 5979 -2543 -11002 -9471 -14980 -14234 -12096 -2390 7425 -5919 -18295 -18468
6441 -18468 8228 18014 10594 10833 13916 9441 17877 23862 5678 -13755 -17643 -12685 -12453 -10917
6427 -10917 -8144 -4662 7033 7313 22519 29336 7552 10409 1142 2465 10021 12242 9135 21386
6413 21386 29554 39007 29300 16936 18777 17842 11861 11450 12571 9556 5895 570 120 2483 2233
6398 2233 -10278 -1577 -1837 4069 6183 12902 30097 31585 6649 -19368 -24294 -21505 -12464 937
6384 937 9862 10006 7950 11469 13023 16999 23052 11871 5672 -3081 -11989 -17255 -7861 11515 13395
6369 13395 10323 2380 7949 -5572 -3493 -1247 -1125 -5343 -3798 1311 -14234 -30518 -33488 -22335
6355 -22335 -8127 3156 11334 -617 -8352 -14012 -18785 -1973 2665 -1644 -676 2921 6088 3659
6341 3659 5397 4829 -718 -6254 -5948 -9445 -57 6029 -2963 1898 -6546 -25111 -25274 -24794 -25093 -35683
6325 -35683 -24166 -23203 -28445 -27163 -17379 -12777 -19845 -33280 -26580 -19870 -9648 2838 11731 898
6311 898 -476 1897 -1717 -18678 -27199 -4182 19818 19642 18827 1403 -7094 3025 5212 2679
6297 2679 8644 11790 8575 4419 -3471 -3961 -2188 6970 5456 14262 14344 13796 13879 17158 19000 6433
6281 6433 5991 13877 9565 6472 14394 4029 -6479 -16033 -9375 -2298 -5802 -7202 -297 4565 10017
6266 10017 -2037 -5122 -745 3941 9688 12796 23307 17662 8503 5905 4542 6934 12874 -3241
6252 -3241 -23162 -26438 -23805 -25068 -34673 -30648 -17869 -17945 -20332 -21016 -17488 -18439 -2500 -9209 -11308
6237 -11308 -10810 -7829 -12312 -8335 -10269 -7356 -4681 733 9710 7510 5550 4799 12280 10877 -1005
6222 -1005 -6279 -8269 8819 19540 28099 35514 37735 31214 31149 32870 34254 44887 40843 21509
6208 21509 5333 8071 4546 4733 7323 18108 37226 28396 18315 9058 5938 14482 -4383 -10009
6194 -10009 7723 20567 28736 20503 23056 13281 6159 -3981 -15057 -18414 -17068 -8850 -6808 -424
6180 -424 6081 4337 -9569 -8973 -1979 -7895 -13470 -9985 -14658 -3386 -2131 9249 10025 10515 22199
6165 22199 26607 20271 18985 8965 5839 13993 9532 -4692 6446 9194 -1584 -2851 -5943 -4249
6151 -4249 4419 9147 5000 -1809 10791 29422 17747 15558 7742 5859 7275 21128 5108 -1194
6137 -1194 -819 -4975 -2168 4663 15680 25986 19744 10542 4969 17078 30065 12902 -5458 -15967
6123 -15967 -21275 -18817 -8619 14186 3891 -4600 -669 5488 -3772 -10635 -12783 -7927 8231 17863
6109 17863 6274 -3595 -9072 -3311 -1925 817 -2895 149 10447 15345 7681 -4087 -9763 -11563
6095 -11563 -10476 867 -549 6533 12397 10886 2859 -862 3909 3894 3725 -3680 -15830 -9555 -480
6080 -480 10071 9058 26483 32105 17284 -6560 -10651 -10701 -11673 2087 15297 14571 -7523 -20576
6066 -20576 -28541 -21585 -17936 -24026 -21314 -13610 -17323 -19039 -17664 -7643 4134 9682 9063 12993
6052 12993 10358 4785 -531 -1054 8009 6699 -659 -12293 -17314 -20354 -19029 -18087 -862 -1218 -7536
6037 -7536 -15565 -18298 -15923 -18030 -18383 -9102 2542 -1577 -4331 816 -9064 -16262 -15620 -10977 -9395
6022 -9395 -18601 -22226 -8213 -9846 -15325 -23137 -23740 -10648 -4771 -3 -3944 -18513 -213 17363
6008 17363 13594 15650 24745 21867 15160 15606 6230 3702 -6039 -239 -7449 413 9511 11105 20337
5993 20337 13171 8717 16682 11250 -1509 -7181 -8361 6910 24768 25777 22897 15005 3703 575
5979 575 6073 5580 15586 15823 11901 2785 1100 -9122 -12226 -15027 -22385 -23570 -10590 4377 -8267
5964 -8267 -18980 -5690 -6136 -15092 -8824 -19409 -24749 -9725 -3510 -18290 -15082 -3280 -5031 2646
5950 2646 12092 7164 1396 -4592 -10882 -5088 11039 8334 -5570 -8061 9540 7105 -2156 -2427
5936 -2427 -5335 -6218 -929 12257 20759 15067 517 3380 6428 18698 26372 23236 -3381 -13359
5922 -13359 -12033 -4811 5247 2529 -3304 -15712 -27484 -26493 -12814 -2448 -479 -5814 -15718 -1674
5908 -1674 14615 7795 3796 13477 6721 2151 9399 7511 -4370 -4419 11962 9883 -9381 -14056
5894 -14056 -7510 -12117 -20805 -17137 -3152 9218 -5059 -6473 10918 16569 4230 -4776 5950
5881 5950 9186 14732 16630 10842 7338 8454 2348 -971 -2762 -8746 -8193 -4341 -12672 -6611 3101
5866 3101 1525 -11170 -14347 -10218 -10765 -12140 -15415 -18216 -9052 4492 5999 -4829 -8482 -11798
5852 -11798 -21797 -14601 -6169 -8764 -5218 2613 1294 -11589 -16278 -20334 -8340 -6891 643 980
5838 980 -109 2501 8899 13348 11591 14629 1583 -3390 309 10213 12987 17221 14854 13554 9929
5823 9929 296 3084 3745 6004 5249 -1800 -2704 15823 7524 7047 -205 -8007 -12868 -24382 -23736 -11001
5807 -11001 -4253 1450 -2946 -1731 9144 3357 2938 10981 8721 -18347 -19453 -14102 -6025 6218
5793 6218 4477 9036 18000 12364 -2434 -6142 -6998 -9347 -15522 -23808 -26517 -12317 4807 9144
5779 9144 -2562 -3659 -41 -276 9455 563 -9167 -14472 -10156 -9154 -16256 -20331 -19079 -23584 -22812
5764 -22812 -10278 -12339 -13996 -16571 -21632 -15313 -13911 -21550 -15863 -15892 -13191 206 -1866 6783 -2718
5749 -2718 -7569 -967 104 -10157 -13659 -17837 -12959 -4379 -11525 -16616 -10747 -11957 -16364 -9758 -14781
5734 -14781 -21208 -24446 -32283 -10461 5602 7301 417 -9806 -5989 -4316 -7972 -2617 -5891 1648
5720 1648 15327 24012 20761 13228 10300 2809 11408 27161 26584 13257 4629 2022 4196 8967
5706 8967 6031 5009 -5129 -22337 -17442 -15437 -17653 -20548 -17989 -22735 -14037 -11376 -18860 -23087
5692 -23087 -23633 -25845 -16905 -12835 -18474 -18664 -19843 -9379 -12917 -25776 -24025 -6141 1890 -6712
5678 -6712 -10275 -15428 -23025 -26891 -17496 -17256 -27548 -29308 -19138 -5319 798 830 10033 23111 26285
5663 26285 14143 4650 -10111 -4726 7549 21691 3028 -4521 8914 17868 21402 23395 22514
5650 22514 12617 10378 16935 11832 8808 17595 24304 9050 16598 13526 10229 5835 1630 -7031
5636 -7031 -16750 -21495 -25816 -13528 -11677 -3773 6385 4025 -653 -13170 -13119 -54 8044 13958
5622 13958 23154 29621 31037 23737 14148 23249 26670 13417 12671 12694 -1802 -17945 -13713 -2546
5608 -2546 -4941 3048 10882 6121 -8620 -11838 1808 7177 -1843 -14266 -22028 -1772 21208 13676
5594 13676 8008 1335 10735 25727 27953 23973 19082 8703 14910 3942 -3968 -17194 -1896
5581 -1896 2943 3188 5496 6940 9040 20323 16466 8314 10173 1115 4932 22987 31750 29912 925
5566 925 -14744 -10865 -14407 -5226 -3356 -10665 2983 -4238 -2078 10957 3472 -4965 3763 21147
5552 21147 11092 16355 25077 23089 10643 11282 16273 8552 -3735 -8283 -15712 -20275 -13189 -5384
5538 -5384 13713 -1932 -13473 -21519 -15358 -19992 -32595 -29779 -24181 -9664 -104 9179 5559 -8436
5524 -8436 -21097 -17025 -10736 -11460 -11706 -9878 -13337 -1161 492 12692 20824 7436 7281 9041 2026
5509 2026 5295 4480 -8967 -10546 8189 15155 19180 8339 -1359 160 -6848 -18539 -4746 -3699
5495 -3699 -21108 -36424 -37526 -35172 -33043 -23975 -14518 -8363 -12080 -13695 -7539 4983 -867 -11702
5481 -11702 -20621 -16131 -4022 -876 7424 9730 -957 -3444 81 2063 3615 1056 -430 4661
5467 4661 10003 4141 -11755 -24305 -27126 -29374 -21475 -11557 -10460 -29089 -30286 -25223 -24152 -24525
5453 -24525 -11355 -8898 -1621 13046 14375 18158 14388 3667 -15464 -5590 8309 15268 6581
5440 6581 19404 16700 3108 -5574 -10588 -9359 -6550 4699 229 -9766 -18398 -13137 -11934 -15038
5426 -15038 -1620 -4505 -6461 4798 2265 -3809 -774 -3459 -20578 -27522 -12032 -19486 -8707
5413 -8707 16247 26633 22146 6724 7671 14770 10944 6680 18564 19984 7446 -951 -2171 -8525
5399 -8525 -14811 -8405 -731 5060 -7082 -16703 -19273 -18470 -4875 -2628 -4086 -1990 5221 7227 28325
5384 28325 33480 22153 7088 7880 6660 12924 9467 3998 5310 1618 -4073 181 -2065 -3253
5370 -3253 3064 2095 -11902 -11454 -11270 -9466 -9246 -4243 -10393 -5000 -1004 -1191 17154 16292 -3459 1340
5354 1340 6023 -5744 -7926 4872 12298 6667 11661 10135 8433 -1836 -6532 -11093 -12675 -15511
5340 -15511 -15012 8019 21517 -258 -10779 -17013 -22270 -26390 -14609 -33166 -41099 -30715 -24082
5327 -24082 -10704 -13948 -12920 -13302 -8347 -11165 -14206 -19001 -30669 -17884 -7320 -15695 -15691 -14177 -12010
5312 -12010 -12426 -5643 -8206 -19667 -8512 -8658 -13767 -11726 -3385 1637 4090 709 -16274 -14028
5298 -14028 -834 9627 18583 8911 -6084 -3739 2258 76 -489 -15601 -13754 -6726 -6975 605
5284 605 -413 15313 21466 18380 17566 15098 7136 5722 2496 -3613 -18727 -22364 -34565 -32149 -19687
5269 -19687 -16046 -21094 -20937 -27515 -29234 -21452 -1459 12707 8041 4966 -1499 -11173 -2340 11028
5255 11028 12720 10081 7782 -10159 -17237 -8693 5610 20739 2205 -221 -491 -11038 -16619 -16321
5241 -16321 -16923 -3807 7648 6673 3600 3145 4113 14744 9308 12794 24312 29563 28090 13946
5227 13946 -2079 -4526 -2870 -4151 -15961 -7358 -6125 -251 22247 18119 9414 10433 11017 3266
5213 3266 -9751 3970 -1385 -10430 -8922 -15570 -27447 -22415 -15828 -2394 -565 -15062 -13897 526
5199 526 -1334 -2964 3792 7799 -3826 -9195 -15554 -18341 -20240 -31810 -29370 -8048 7779 5729
5185 5729 -7490 -14231 -7557 5099 24435 24975 21696 10965 4605 -802 -7228 -6133 -19816 -12916
5171 -12916 4393 -2454 -8286 -13777 -8415 -21157 -20456 -8228 -10320 -4243 3955 -4494 2388 6475
5157 6475 14998 23589 11166 -8035 -7797 8134 -3810 -9797 -6952 7474 16067 9398 -4806 -18994
5143 -18994 -13070 -19778 -29650 -32781 -21218 -17358 -21178 -12281 -12449 -17453 -23129 -14502 -13929 -17627 -17519
5128 -17519 -6227 -6749 -9544 -15306 -5602 -7167 4569 14376 9475 -3217 -3688 -8959 -13170 -1710
5114 -1710 5882 -8932 -7859 -13042 -15180 -9762 2840 11458 855 676 7100 5429 -6075 1759
5100 1759 11441 17183 15364 -5478 -14051 -19904 -21958 -19531 -14998 -19891 -14328 -665 -4646 -14482
5086 -14482 -23236 -33472 -35127 -18179 -8092 -205 1578 -9465 -8094 1037 11269 11599 6078 -7648
5072 -7648 -14778 -120 11325 9354 25868 14218 7795 -405 -8144 -30350 -27196 -18688 -6125
5059 -6125 -7700 2854 -588 -10242 -10707 -18150 -26352 -35421 -15359 7820 16080 19499 16703 8306
5045 8306 -19 2479 -8641 -2182 8267 15884 4490 -135 1697 12133 8079 -10559 -15748 -9260
5031 -9260 -8516 -2019 -4536 -5001 6059 -1883 -12753 -1963 -6819 -28567 -13546 -16157 -25060 -16239
5017 -16239 3776 9928 7282 -9357 -17951 -8224 -4817 -6996 -6170 -6388 4709 19301 16681 5712
5003 5712 4883 1199 316 1789 6904 -7525 -17795 -11698 -6725 -19415 -25127 -20415 -12889 -8309 7002
4988 7002 2003 -6178 -5876 8291 20225 12557 -7777 -25546 -22312 -9396 5361 30474 33490
4975 33490 11063 -2893 15125 18611 10769 13410 17523 19415 25480 27442 35161 32446 13372 -4971
4961 -4971 1295 5372 3768 12797 7945 5754 7608 13938 11575 7600 4877 -837 -6091 -2270 3177
4946 3177 29726 43142 43862 28859 11908 3663 3876 7900 8757 12837 14883 6723 -3380 193
4932 193 -10806 -14827 -16330 -24469 -27497 -3399 12855 7528 262 -1459 9180 6769 5051 3318
4918 3318 -9085 -18931 -22357 -26025 -10213 4775 6181 -11471 -22554 -15075 -1282 -486 5935 4076
4904 4076 3749 6458 -2375 3369 7052 -3960 -16306 -29198 -25177 -6769 -12247 134 20365 24666
4890 24666 32376 21841 22586 24450 24721 20420 13665 9020 9159 5577 239 -15761 -21928 -14213 1500
4875 1500 203 -3616 -4910 -12575 -20456 -24894 -11117 3261 -675 -20835 -32109 -9766 -6223 -4339
4861 -4339 -3131 -15900 -23131 -17632 -15785 -16710 -12233 -9735 -13869 -10069 -7991 -19568 -29007 -26866 -26195
4846 -26195 -16963 -5129 6989 8849 8093 11273 16469 5739 4568 5673 10807 8126 15062 11743
4832 11743 6421 1963 7996 7608 3411 2977 5949 6267 2989 2126 -8103 607 2392 -1169 -12888
4817 -12888 -19332 -3940 682 5290 4486 -406 12449 4817 -15494 -14749 -5041 -1958 -4767 -10884
4803 -10884 -5882 2721 10895 15897 19797 13075 -2671 -16263 -17899 -20932 -11110 2055 -6850 -5501
4789 -5501 -3197 -3218 3423 12993 23349 19944 15926 5938 -1818 -2584 4125 2333 2295 -11673 -22400
4774 -22400 -15244 -15645 -24555 -35768 -35878 -20559 -7587 -11567 -15694 -27704 -31709 -27442 -25439 -18485
4760 -18485 -8102 2760 10610 2753 2652 4198 4150 8162 20971 18788 20602 27814 23383 28671 20631
4745 20631 10808 7352 -6024 -4476 6114 -1739 4503 6540 -3333 -10742 -12764 -11603 -3543 8704
4731 8704 12741 360 -9345 -28963 -24435 -17127 -9867 3963 4783 -5384 -6344 -3304 -9320 -19298
4717 -19298 -33005 -38749 -23282 -7766 -7997 -19369 -11095 -3369 -3383 -12189 2052 13569 11321 8711
4703 8711 7895 14372 21391 34396 43052 43415 32680 15751 9794 10469 12671 8127 7456 5115 5055 357
4687 357 6420 -2984 -671 9163 12953 25598 18359 17869 14669 10114 6774 10344 25896 35300 22937
4672 22937 855 1108 -1827 -12367 -10677 -12514 -16413 -9068 -18922 -21839 -17465 -12460 2256 11104
4658 11104 -13127 -25121 -7615 10600 8534 -488 4793 804 1272 12565 9827 14328 24599
4645 24599 18023 26933 18484 14161 9235 20938 7149 2373 -2092 3295 12078 8694 5633 -4226
4631 -4226 -7845 -1175 -7065 -14371 -13985 -19288 -29593 -20277 -11465 -6016 -3062 -529 -779 13421 8057
4616 8057 4784 2755 4498 -102 -12042 -16349 -16636 -18659 -2278 -10987 -15310 -9003 -11275 -9092 -5955
4601 -5955 -4906 -4132 -159 2665 -3320 3758 -4704 -7122 -9590 -13660 -16287 -16018 -9553 4999 -7021
4586 -7021 -7056 12260 11850 3750 -3147 -1268 377 2524 2917 3237 3064 5931 423 2097 -5215 -524
4570 -524 10519 -1571 -14579 -19590 -17540 1537 11324 5428 -8360 -9821 -13896 -8870 -4890 11557
4556 11557 2326 283 7272 17547 7078 -56 3074 -10753 -15543 -22460 -20194 -14371 -11501 -13791
4542 -13791 -607 -15534 -33093 -26466 -12988 6333 16646 18829 14579 11806 7168 4281 12045
4529 12045 14250 2651 155 4973 11318 3091 14709 13718 19187 8496 2392 -10899 -2974 -464
4515 -464 -2922 -6592 -8630 -3265 11512 17621 21251 21506 29960 21760 -8200 -27428 -24671 -15602 3900
4500 3900 9908 1306 1771 -5950 3274 9055 10903 9611 9935 3733 2301 9790 6251 5828 10187 9704
4484 9704 15134 14664 18427 22636 25556 31683 15281 -4761 -8053 -2572 6238 6660 12344 12274 674
4469 674 -8689 -20552 -11778 324 -6767 -2041 15355 3643 -7363 -13308 -1137 -2908 -577 14861
4455 14861 11035 2497 -8969 -1746 9186 10027 9306 -7483 -18678 -12154 -9978 -12159 -14849 -19177
4441 -19177 -10790 -10982 -21589 -29239 -23046 -20531 -22060 -27166 -12392 -8203 -7718 -5216 -6117 5522 5709
4426 5709 -1001 2516 -4232 -14334 -13568 -3688 -6144 -10020 3583 5051 7822 14878 11272 16235 20603
4411 20603 20039 20568 16787 19194 20261 14709 4227 9399 6519 17156 14561 17419 18153 11494 19089
4396 19089 14589 23154 13034 12203 4130 -7990 -21598 -22625 -17347 -14221 5999 16943 12599 3838
4382 3838 -15253 -13074 -2075 12936 -6058 -16514 -14839 -7173 -7802 -2484 407 -15296 -4603
4369 -4603 -4976 1332 16850 9790 18581 10610 714 2620 7397 10934 9064 6461 9585 13197 17743
4354 17743 11579 7442 -3935 -14912 -15295 -9893 -11325 -10577 -584 7328 4434 -2698 -14562 -8233
4340 -8233 3661 12890 15267 6939 8463 -12482 -26072 -12950 -1602 3239 2871 -2973 -5865 -6512
4326 -6512 -14176 -17090 -22095 -20491 -10858 -2212 -12564 -22537 -25429 -26457 -24494 -22274 -12978 901
4312 901 7607 9245 1189 -20864 -21927 -13568 1392 17337 16737 6788 7125 12862 3755 -3520 -16249
4297 -16249 -14650 -14950 -13004 97 4970 -2310 -12808 -6333 4607 -4571 -24748 -17749 6320 15031
4283 15031 15369 14705 6911 -3183 -19023 -13640 -12824 6750 15340 12840 5839 3799 19084 16189
4269 16189 11974 6218 -10877 -15697 -6950 -8714 -9264 11347 20967 6352 -3946 -998 5592 -5973
4255 -5973 -8666 -13435 -19024 -17864 -4333 9518 19723 17629 21002 10804 386 -17439 -31556
4242 -31556 -23802 -16147 -3210 -12171 -19707 -24248 -16248 -14406 -12755 -8017 -8742 -8748 -10200 -47 1336
4227 1336 -4106 -6989 -5912 12034 18253 2246 -8766 -8863 14540 23237 41705 34323 13632 16109
4213 16109 7736 2918 4878 4742 16670 11477 3706 2088 -6122 -11977 -16093 1918 8245 -7695
4199 -7695 -12390 -8522 8519 6796 7204 5826 -3761 -6954 -6512 -4886 -1402 3804 -4505 -6101 4743
4184 4743 10550 9113 -2581 -12680 -16510 -20518 -10450 -2699 -3751 -2279 -726 -3122 -7071 -3707
4170 -3707 312 -11581 -15127 7346 16971 6379 19427 19493 12356 13562 9129 18014 19376 13171
4156 13171 2796 -1783 -7153 -1178 -7383 -4617 14672 22409 18959 12618 6143 5024 17175 19395
4142 19395 16929 14982 15179 11932 20194 16178 -5113 3836 27077 12195 -1334 9346 22085
4129 22085 34903 24314 9488 7584 11187 2135 -7036 944 10361 12557 7738 5970 -9287 -13465
4115 -13465 -24789 -21433 -9566 -5990 -6554 1235 2673 -3231 6712 8215 -987 1116 -6136 -12933
4101 -12933 -11795 -6904 -3308 -18239 -26766 -33682 -31818 -21742 -11225 -6681 -2162 -1984 6713 9698
4087 9698 -8967 -21124 -25981 -8904 5317 13705 20267 13930 37 -13588 -9544 -6817 -11245
4074 -11245 -23769 -23820 -13703 -4021 -6130 2658 -2039 -5729 -124 8634 11191 16706 21251 38076
4060 38076 29022 11888 5557 14143 23794 18290 8941 9032 -274 -18188 -8626 6179 -8154 -15609
4046 -15609 -28543 -14648 -7549 -1339 -7460 3746 5563 5189 8771 17150 18212 11671 11173 15124
4032 15124 11417 -4867 -18129 -8302 -4077 -9194 -11015 -14985 -2970 -3630 -6876 -5015 -9598 1324
4018 1324 4581 3677 6946 9648 2997 -2843 -19073 -24428 -22130 -19783 -13333 -12968 -3440 -15243 -31331
4003 -31331 -25310 -12500 -11222 -19665 -24860 -29571 -22008 -17974 -18205 -18284 -17288 -14860 -3949 8368 -729
3988 -729 -13661 -14817 -19887 -19091 -20755 -17533 -4985 10115 2338 -6743 1902 15835 20033 -40
3974 -40 -16200 -32189 -36579 -23550 -11795 -12676 -1873 6411 2076 1516 3663 -6976 -227 4332
3960 4332 -13868 -4623 -1351 -9336 -10686 -14528 -3131 4131 14489 5498 1739 16754 24594 11876
3946 11876 954 -6591 1713 -2728 -3071 -1427 4111 11855 8559 6078 6825 -4911 1815 -12388
3932 -12388 -21701 -9301 -365 -7946 -6584 -8328 -5411 2424 12839 19487 20169 14126 4799 4681 9068
3917 9068 7589 10277 -547 -5057 965 7296 7173 7809 -1122 -5014 -10410 -11954 -5102 2517 5905
3902 5905 11799 13888 8375 4342 941 4948 1659 -300 3128 -9847 -22879 -14792 5119 9801
3888 9801 2639 -12697 -10670 -9098 -5952 -1255 -4685 -4953 5296 12910 15067 9350 -5786 -5277 -11705
3873 -11705 -17837 -11949 4725 7603 11267 6017 5336 8837 2314 -9184 -13708 -17985 -19720 -24581
3859 -24581 -5302 17094 15860 -16067 -10911 8256 10014 1361 4761 5046 561 -4639 -3788 5643
3845 5643 10273 11544 -2609 -13944 1051 12048 -2159 -9782 -1903 10578 14248 2791 -3507
3832 -3507 -3989 -12668 -10044 3927 8020 8310 3518 -7232 -16411 -19396 -8884 -183 5754 5206 7576
3817 7576 12049 7489 68 -1690 -13955 -22559 -18299 -21568 -25348 -23222 -17809 -1487 3176 -6773
3803 -6773 -8356 -8951 -4953 238 -3792 -14913 -12480 -16000 -2989 12066 19306 9004 5590 10120
3789 10120 8288 -2892 -14239 -6450 -8561 -1943 1569 8016 16690 20180 7087 -6746 7879
3776 7879 11844 16136 17655 10504 -1610 10678 20558 17826 16922 20892 10516 -12413 -17140 -15635
3762 -15635 -18435 -18065 -6644 -3447 -7569 -11790 -11121 -13985 -4794 -11962 -29445 -46111 -38699 -25563
3748 -25563 -25181 -23478 -12332 -4076 -4451 13050 12961 5388 2757 4289 255 -6066 -5269 851 1588 2492
3732 2492 -7 -574 -5136 -12656 -7714 -1960 -5080 -1578 -7657 -3647 6887 10281 -6292 -18075
3718 -18075 -15939 -12540 3892 23222 27835 24194 6791 2348 13616 13851 13504 22791 22188 17222
3704 17222 -5680 -7862 -7683 -14863 -20399 -15170 -1788 2597 7338 5121 -5984 -8243 -2983 1672
3690 1672 5351 13817 18210 18301 184 -16457 -10648 6951 9919 5857 10240 6693 -487 -11751
3676 -11751 -5218 10244 14480 15120 10404 9325 7641 -4079 4151 3427 -2321 8881 12988 -1320
3662 -1320 -12445 -4248 -3784 3510 -1260 -338 3388 6457 -2932 -777 8995 6831 14173 6830 2096
3647 2096 11912 6153 9709 2798 1972 -7953 -12772 -13213 -11073 -9511 -14257 -7908 -10069 -14066 -5415
3632 -5415 1325 8499 17151 25166 19945 4881 6239 8241 6584 -2289 -4491 -304 -10130 -15320 -18325
3617 -18325 -23967 -9269 -2156 -7821 -11444 -11934 -10706 -7622 -5183 243 5284 -9589 -14806 -20617
3603 -20617 -10119 566 4487 7013 -1928 1405 -1673 -6039 -9112 -20004 -11649 -10367 -12399 -9876
3589 -9876 -14439 -24388 -28457 -27435 -15904 -10516 -15428 -9384 -7090 -17632 -27720 -16202 -716 -2284
3575 -2284 -6327 -13921 -7875 5400 9565 19113 12231 4332 8500 12028 17545 11709 9579 21063
3561 21063 23371 29622 15035 4818 10482 5143 -352 2721 4041 -11461 -6063 11129 25564
3548 25564 32822 35917 18228 9410 2192 -2949 -6354 -5458 -12621 -21137 -24086 -25171 -11409 -4670
3534 -4670 -3286 -3847 -6309 6874 16378 9290 4134 17626 23439 14735 2297 -1001 -5266 -8954
3520 -8954 -9069 1064 -5164 -5602 -5541 -1565 -767 -9795 -22188 -17410 -9099 -7413 -5493 -4092 -4838 -13771
3504 -13771 -19076 -18329 -11101 348 -1244 -3712 -12961 -9790 -8048 -12218 -12394 6786 8852 1017 12507
3489 12507 26123 11767 -13033 -16900 -6889 8442 10197 12145 21283 8248 15876 5970 -16551
3476 -16551 -12551 -3009 -223 -7441 -12775 -10703 -10142 6656 7631 10564 5249 -9715 -16087 -10029 -1457
3461 -1457 -889 -6676 -6685 7271 12052 5711 -2724 -2842 1274 -4696 -18130 -29467 -29087 -22334 -8841
3446 -8841 404 16 -4200 4370 10837 -3960 -6339 1539 22346 31378 28114 21160 10605 21223
3432 21223 20737 8358 1310 -6758 6543 15198 7494 -3319 -5546 -4731 -3037 -3782 -2440 2010 10097
3417 10097 7342 -1896 -3732 3820 3243 4688 2413 6569 6370 10159 4622 -5084 -10691 -14709 -533
3402 -533 4425 -8045 -12949 -35093 -35190 -38295 -43493 -27024 -18721 -12422 -4364 7106 8801 13880 5600
3387 5600 14097 8489 4377 832 -897 -437 -7944 -3348 1638 -7869 -27613 -25925 -20800 -25077 -29058
3372 -29058 -26261 -12381 -5145 6174 9134 4251 14752 12473 -3287 -10353 -530 1297 -13905
3359 -13905 -16787 -7213 -147 -7465 -12287 -9340 -11762 -7596 -17002 -27740 -23530 -24547 -23069 -15031
3345 -15031 -9957 2844 -10157 -18744 -13588 -9607 -19124 -17946 -17462 -3551 -10461 -9814 -5963 -11460
3331 -11460 -3385 -7144 -6470 219 21529 18380 -980 5632 12548 16968 10167 111 9406 9066
3317 9066 6630 4884 7684 -969 -685 -1116 -13007 -16486 -11351 15004 20508 10696 14544 8940 3641
3302 3641 12177 8707 11329 29737 37640 30228 27518 23102 9368 11542 8746 -9661 -11986 -3501
3288 -3501 -179 -17354 -39927 -34788 -18982 -5169 8932 2751 -10496 -4313 -526 811 -1421
3275 -1421 4717 19974 31587 15006 8008 14168 12219 8487 369 -10036 -3322 5611 8727 9404
3261 9404 7037 14760 14654 3969 -5067 -4575 13772 29137 19264 10240 3177 -2774 -14858 -6794
3247 -6794 7651 12171 16625 20252 12772 6057 -2999 -6275 3670 58 2689 -1295 -8833 -22511
3233 -22511 -11677 -7314 2321 10070 16257 14074 5845 951 10113 9445 -626 -14116 -4404 8189
3219 8189 1428 600 -5670 -18268 -27696 -22868 -10227 -4633 -4083 -3064 -1466 -2548 1353 -878 602
3204 602 12140 4591 3092 90 -16924 -20285 -11973 1017 9903 3723 -5989 -4160 128 2628
3190 2628 6518 20878 25507 12520 1610 -2997 2212 13855 11602 -1411 3747 10587 9273 -1295
3176 -1295 -4153 8660 11021 -429 -10495 -18781 -10472 -2676 -559 -642 -1979 12576 17333 2579
3162 2579 2502 2097 -4074 5784 10827 10421 7902 8189 15141 6958 5301 4091 14223 975 5972 -4632
3146 -4632 -2802 5313 -8393 -10808 -12415 -10285 -9673 -5323 5672 3127 -6497 1897 -217 5421 -2413
3131 -2413 -15047 -10154 6723 439 -3281 5230 -3783 -14545 -9039 -3091 -8347 -13528 -4713 8310
3117 8310 14393 18547 17080 6991 3381 6902 13612 15954 22385 12020 10246 19814 25330 22510
3103 22510 16529 6801 5693 1529 2077 15803 21060 16791 8926 5922 4043 15328 15948 8498 -9717
3088 -9717 -13377 -12967 -12539 -7653 -7786 -19535 -20454 -17132 -19386 -19041 -18689 -11524 -17788 -19598 -16801 -7861
3072 -7861 -2473 -11744 -3953 -758 13401 15279 19658 20014 25983 27260 14596 14524 23924 12785 7523
3057 7523 15765 15770 -5723 -10789 3181 5513 14495 24068 17141 -6284 -9650 17030 30075 25213
3043 25213 23141 32200 23045 16098 20907 28833 22422 16961 18624 7489 -7475 -9391 -10592 -15410
3029 -15410 -18375 -27143 -28023 -21027 -19579 -12533 5846 18655 13243 -5764 -13621 -10806 -3125 -7906
3015 -7906 -8354 -2126 -2024 -3273 5437 13726 9337 73 -17908 -12935 -4251 -9723 -8771 -4401 11555
3000 11555 6047 -5474 4486 14584 4240 -1431 -5566 -4686 3736 14243 7477 -450 -7138 4115
2986 4115 10129 9960 10392 21629 33150 23575 10415 -834 -1859 -6457 -4588 11229 11084 -5448
2972 -5448 -19620 -9358 -8018 -9276 -2096 12980 11789 -2069 -1527 -2819 -13783 -5672 -978 -8039
2958 -8039 3892 8182 9032 8844 -1504 -9898 -8352 -2994 -6632 -8939 -7212 -4823 -1305 -13489 -26795
2943 -26795 -31426 -34328 -23062 -10528 21 -9525 -18818 -23069 -23284 -24330 -41044 -37270 -21001 -20493
2929 -20493 -12436 4307 9952 374 -11984 -19437 -8981 3792 17004 23912 14628 -464 928
2916 928 -10154 -13031 950 4095 2551 4174 -7016 563 3279 793 9289 19523 24708 17744
2902 17744 -311 -24096 -15173 -4866 4354 8159 725 1584 -9849 -5000 -7550 -1069 2628 12674
2888 12674 3859 -267 -4246 -9535 -21583 -12434 1144 2182 4980 4915 -1842 3357 4018 10162 24767
2873 24767 17698 21291 13681 8238 636 -20371 -22761 -12342 5603 2086 -6698 3321 25182
2860 25182 22767 5762 4560 5463 928 12987 13853 3113 -4798 -4789 -12627 -16739 -8347 -9677 -26401
2845 -26401 -23464 -24843 -30941 -27617 -4622 2794 4577 1310 -9084 -22110 -14420 -2027 -1026 -12220
2831 -12220 -8301 2308 5390 4901 6020 3352 -8192 -10107 -4352 9293 19749 15534 4886 6757
2817 6757 2269 -2613 6465 3230 13229 23507 32402 25938 21578 21213 15219 4657 113 5954 14791
2802 14791 22809 13397 6861 5732 2019 2049 -1385 8607 5002 5810 7515 5201 19607 37196 50306
2787 50306 43598 29242 14341 10282 17488 26501 2687 -21711 -10818 -4303 10390 31882 45008
2774 45008 43013 19881 10205 16207 14110 6328 -2908 -13059 -23131 -14922 5934 1434 -1918 13601
2760 13601 23563 6580 15 1182 -7308 -16154 -10437 6081 1995 -5095 12206 13910 8188 9635
2746 9635 18912 25076 11501 3803 -6296 3103 553 -6544 -1845 17005 15772 13359 17035 2002
2732 2002 -6359 -6091 -4955 -12869 -780 -2510 -5882 2406 5059 8483 -136 6841 3536 -10376 -5067
2717 -5067 626 -1620 4368 15135 9825 5237 -2727 -11464 -8229 -10587 -5671 -11971 -5351 -2201 -19351
2702 -19351 -7522 -3828 -13246 -10218 -9926 3932 676 -7475 -3191 6823 -23327 -34425 -17168
2689 -17168 2070 11629 7589 -3115 -29933 -34322 -31596 -37410 -31491 -9570 -112 -6996 -18824
2676 -18824 46 -20 -3232 1086 -7649 -11307 -6375 -4383 -16100 -9522 -10197 -10433 -11934 -4797 -4696
2661 -4696 -13443 -15806 -14554 -9502 -21079 -24610 -17592 -16074 -21101 -7339 11972 18115 20960 12974
2647 12974 5830 16526 20187 9966 9597 6604 4830 -3293 -4020 8029 14318 10386 3650 -4938
2633 -4938 -6530 -7735 -4311 -22711 -23609 -24937 -28384 -30998 -21742 -11151 -17707 -22625 -23604 -25313 -12742
2618 -12742 -3652 -11462 -13619 -12229 -13817 -6660 9048 16937 7640 -2819 -16409 -12345 -9281 -13914
2604 -13914 -17850 -16518 -14632 -20185 -27627 -30052 -10945 1187 2596 -8254 -8009 -7795 -7709 -8093 -12484
2589 -12484 -23665 -21303 -11157 -8039 1308 -605 -1741 225 -9024 -20087 -19580 1439 14060 10508
2575 10508 7077 1575 -5906 9557 17309 14015 15245 17414 11766 4714 555 -8869 -22641 -19105
2561 -19105 -13231 -644 3116 3342 6253 -4327 -17852 -28664 -28450 -10201 1642 -757 -451 1675
2547 1675 990 -4209 -6457 -11360 -12982 -9845 -2339 -5078 6394 10150 -6722 -7339 1702 -3328 -9000
2532 -9000 -7498 -3605 -753 8439 25389 18201 12525 9809 3105 -1119 -7457 -5280 -2766 5221 5445
2517 5445 2999 -16027 -12515 -10499 -13108 -19612 -14182 -6949 -4439 -7488 -8887 846 12016 16691
2503 16691 12722 9197 8166 14981 19855 9011 -7187 -17258 -11898 2334 -8159 -4793 4352
2490 4352 5734 20254 -4184 -19782 -24778 -24215 -13947 10387 25878 28254 19243 25797 41255
2477 41255 30693 16094 8469 13530 30974 37689 23009 9904 11030 5213 -7929 382 -11886
2464 -11886 -33100 -36200 -30689 -27068 -16530 -21839 -18530 -12494 -7651 -3237 -1862 792 7351 6636
2450 6636 -667 2059 3238 5953 4233 11551 9715 3646 -2348 -3071 -7339 -7986 344 9689 6772
2435 6772 10079 1374 -3805 -9802 -2212 249 -3720 8622 7054 7659 5555 3508 -6092 -20107 -16903
2420 -16903 -3343 7777 8439 19200 9368 5680 11986 5646 -11952 -7250 -4262 1526 816 -2118
2406 -2118 10510 13655 3899 -12040 -9299 -5808 -1130 -13865 -24459 -29048 -23631 -6299 6624
2393 6624 8893 5536 7165 -1596 -15184 -3355 -2072 2298 -4431 -15261 -8164 11228 5841 -6715
2379 -6715 -14720 -24762 -30050 -18347 -18155 -16653 -25848 -24078 -11918 8328 19629 20302 10157 4339
2365 4339 1058 -7585 -14742 -23015 -13623 -5266 -10314 -12857 -16235 -11548 -7774 -5303 -23220 -15701 -2458
2350 -2458 -9515 -11384 -8468 14065 31155 25767 5305 2300 15374 33050 22757 20176 17198
2337 17198 12937 12959 12251 10214 24622 33037 27625 16939 2071 3777 -8660 2950 15739 14388
2323 14388 -1724 -3603 19916 22135 13452 23775 33388 17115 -5048 -11687 -7289 -5478 -5060 -8904
2309 -8904 -10747 -8400 -10318 -27367 -16032 -10885 -16771 -17589 -19069 -18101 -18608 -12712 -618 11343 7059
2294 7059 -11946 -23267 -17723 -7455 -9700 -14016 5494 5644 -6099 -6208 -1818 -1217 -4085 -11090
2280 -11090 -9898 1505 11070 19195 14046 4004 -8902 -745 12692 9039 8999 6839 -5324 -19159
2266 -19159 -23084 -11657 5700 17553 19312 9645 -10252 -20786 -15399 1520 12297 3208 3157
2253 3157 -6652 4875 7373 -3791 -6186 290 -5417 -8786 -4372 13524 10662 4043 -5535 -15471
2239 -15471 -22381 -24011 -16635 -2233 -2664 -805 -12326 -14192 -1042 9569 8413 18897 37176
2226 37176 27383 26378 25358 18042 13980 5308 -6082 -8158 3551 8284 4622 528 -6152 -1451
2212 -1451 13241 16067 17197 13318 10344 11108 15327 18155 18675 5627 9910 21385 27882 21722 -1658
2197 -1658 -11701 -10896 -13576 1267 14019 10164 2400 6675 11959 16446 17021 4041 4166 4979 5122
2182 5122 5683 8856 8712 11496 -5577 -9108 -6933 -14970 -24253 -28640 -17169 -8651 -5392 -6048 7124
2167 7124 22854 28337 13467 13625 18447 12627 5550 12320 -2591 -15877 -25283 -14263 -150 9467
2153 9467 9249 4631 -11313 -1446 13639 23921 29381 32078 33672 36294 34265 27495 13473 7526
2139 7526 -4002 -11912 -3619 2917 -2788 5579 18413 13074 12607 12942 2168 3324 12973 9779 4130
2124 4130 -8355 -13305 2916 17222 4299 -2688 -7253 -4914 -1424 2595 -4434 -19461 -7948
2111 -7948 -4652 -15170 -23219 -11528 -3871 -2093 -2481 -8862 -1502 8587 -4016 -3451 395 -11650
2097 -11650 -2386 4032 4969 16642 17384 18536 25799 25620 5283 -11604 -23974 -15185 -3631 9532
2083 9532 21570 13527 4980 -4861 -1651 7294 11206 -2805 8469 10112 -2577 -1189 -6720 -683
2069 -683 580 3653 3520 651 -5784 -16095 -13561 -14998 -18699 -14279 -1870 4821 13045 13894 12273
2054 12273 6107 -15211 -26151 -4382 6168 6410 4227 7596 13305 16352 9842 18186 18827 15563
2040 15563 8766 -1536 -1111 -829 127 5800 4647 5596 14947 13988 1614 -5538 918 2042 2955 10935
2024 10935 9262 11029 14273 2293 -9555 -13617 -11023 517 15926 19539 14620 19213 20481 2030
2010 2030 -17555 -20660 -16441 -3998 3512 4961 -6470 2959 20236 17671 18362 11328 -1805 -12996
1996 -12996 -4866 1775 12185 16571 18303 19766 24912 16639 8505 -635 -2360 -14034 -18499 -18700
1982 -18700 -10091 -4938 6645 9853 1598 -10370 -9248 -6351 -1447 4465 8761 541 -4093 -12056
1968 -12056 -11105 -19000 -16692 1237 -10160 -20744 -16991 -27034 -13017 8098 9380 -13399 -16445
1955 -16445 -5674 5105 -11874 -10407 -13707 -13845 -14165 -27503 -19839 -7489 708 -1978 -14298 -20913
1941 -20913 -15298 -13443 -17765 -9945 4376 20904 8662 -1618 -3816 -4964 -1674 3842 11150 9984
1927 9984 15499 14262 5220 1017 7234 9040 -5569 -14145 -10813 -3187 -2500 -3904 1530 -4823 -5275
1912 -5275 -7716 2312 12374 18849 20511 11109 -10578 -8496 1012 -368 7027 -3419 5794 3129
1898 3129 -6372 -3229 -7761 -27773 -29374 -22639 -12296 -2122 -1162 -8368 -9357 -3287 -903 -4658 -12025
1883 -12025 4177 5291 3051 11114 9952 -1513 11321 14562 -4464 -2363 13154 9411 2855
1870 2855 1612 -12023 -14862 -22600 -19153 -9200 -1592 -2615 -4796 2312 -4395 -6490 367 2237 -2595
1855 -2595 4960 11264 -2605 7165 12807 702 11701 19043 5520 4677 13154 16087 12219 -2855
1841 -2855 -11734 -5492 -710 3260 6692 -359 -12884 -16918 -16038 -12868 -9748 -6198 -4030 2745 11190
1826 11190 28826 21937 28267 34821 24148 19025 4361 -4150 9416 12619 21500 10330 8566
1813 8566 2025 3246 19171 32030 35265 22725 13171 13226 -5014 -2865 1346 17430 25847 17912
1799 17912 5536 3208 1608 4310 12307 -4014 -7208 -3735 34 123 826 7059 11534 19023 16570
1784 16570 14776 2747 -3029 2136 7692 4260 619 -3145 -10020 -8822 1835 -3275 -208 8865
1770 8865 10476 4777 -1612 -2731 8101 4718 -10713 -7067 -6789 -4788 -12096 -7417 5129 4492 -2111
1755 -2111 517 -1844 -10053 -392 8084 7529 6948 1985 1456 17228 18043 9286 8406 9680 2023 9739
1739 9739 20289 18807 30730 24438 17482 19832 25911 11631 -1959 -6552 -8135 -12296 -13745 -10839
1725 -10839 -14339 -9369 7647 -1356 -10094 -19926 -27733 -17177 -7709 -4437 1847 -10105 -13656 869
1711 869 7238 -5555 -13145 -14170 -16010 -15848 -7303 -8684 -14080 -9544 -3961 -4974 5059 9971 82
1696 82 3445 -1285 -8491 -4392 6560 8787 5765 1863 9612 18098 28709 50424 59988 49167
1682 49167 23409 11756 13374 18313 17692 14289 10371 4211 -10931 -11322 -12464 -10100 -18019 -25566
1668 -25566 -22256 -22656 -10343 4145 13751 11720 4751 -6501 -8131 -17404 -16473 -15980 -13067 -6382 5710
1653 5710 10311 15451 12527 12163 313 -18255 -15983 -12645 -9521 -10279 -7152 13149 14591 16549 -530
1638 -530 -8071 -10354 -14585 -14488 320 -2378 -8575 3650 26712 34932 29480 6258 -11534 -20333
1624 -20333 -10403 -2546 -2496 -5423 1805 985 8701 19369 11478 5916 2397 13205 35410 29040 17036
1609 17036 9066 -553 5058 20263 14731 12774 9654 -1548 475 2129 -6358 -8820 -10903 -27043
1595 -27043 -25273 -8647 -4803 -10852 -5662 -1648 7700 14638 818 -6621 4353 2950 -6358 -4659
1581 -4659 -8376 -8190 16218 25484 18168 -1638 -5916 -3285 9507 13835 12161 9309 12938 12850 12367
1566 12367 10935 -9143 -7383 6758 5164 8071 13946 16227 13062 -1497 -7853 -4219 -3625 -4700
1552 -4700 -7741 -12510 -17325 -22709 -17337 -18526 -10830 2235 4678 8990 4369 -11719 -7920 6725
1538 6725 3141 1112 -460 12894 18861 4247 -5405 -1394 8596 7081 444 5483 19415 7670
1524 7670 4312 -4159 766 2287 4545 10015 16239 6641 1402 -1112 -10196 -8078 -4701 -9566 -673
1509 -673 -6589 2042 3232 -816 3898 9375 4982 9235 13831 8124 7588 1541 -8951 4924 16078
1494 16078 11142 8502 4725 -3012 9629 13396 1318 -16880 -13310 5722 15441 15267 8106 3750
1480 3750 8967 21985 22209 8503 -8277 -11440 -10970 -4064 16707 10519 11731 15097 27999 36691
1466 36691 39655 22002 6831 -6306 -10456 2037 5522 -7234 -1319 1445 2733 -5590 -4567
1453 -4567 9812 12285 7608 8188 7838 5697 10013 15537 33646 43415 36866 24529 12345 9199
1439 9199 6806 15316 17017 10812 -2424 -2688 4625 16163 16094 12799 806 4072 -4627 -13114 -9046
1424 -9046 -2471 -9475 -14750 -3791 -2833 -4909 -15828 -15438 -16644 -15059 82 466 -5703 3301 -1133
1409 -1133 -22229 -17153 4234 9269 -14790 -14158 -9141 -1526 3826 3320 10580 5312 -3219 -2046 4976
1394 4976 -4572 -4715 -16378 -14884 828 7879 9036 1685 -446 -5767 3418 12192 5527 -10504
1380 -10504 -33532 -48866 -36310 -12226 -9794 -9580 -3404 9282 10232 5413 3967 16352 11840 1069
1366 1069 4357 -11780 -15262 -5016 -10696 -18993 -9239 9392 16915 8123 11999 27017 26959 23731
1352 23731 23603 14326 26304 24934 19473 23561 10372 7245 -3448 -1396 13841 11056 13605 8170
1338 8170 5227 13416 17085 13759 11616 -67 -12912 -2131 1070 6161 -1963 -1585 -2618 9853
1324 9853 -1334 -1385 12823 12556 10649 24 2503 6500 -2060 -13593 -9145 -7034 -13261 -15585 -13882
1309 -13882 -4686 -841 -6786 1214 4874 -3734 -4731 14476 7344 -5886 -14339 -16992 -13779 -21124
1295 -21124 -7446 2418 15957 3806 -11318 -4890 -5008 -11683 -16730 -18787 -9155 -9955 -7750 -8493
1281 -8493 337 -2907 -1144 4380 12083 17112 8179 14619 13799 5955 7492 11459 4678 7978 9149
1266 9149 8378 2557 -2712 -7856 3209 -403 -2253 2416 -1907 2262 9225 1310 -13209 -11389 -6825
1251 -6825 3810 6806 5396 2633 7425 -6621 1025 17187 21158 14099 13782 13383 11426 6049 -472
1236 -472 -9019 -4610 2782 8903 5524 -7021 -22119 -25247 -19435 -7879 3106 5594 16383 12030
1222 12030 -878 259 -11274 5313 3982 -1661 4994 12470 26659 21390 9183 11354 14536
1209 14536 9988 -802 -5923 -6517 -6971 -4568 8359 15937 -429 -2366 5766 6663 13863 378
1195 378 -9834 -6905 -6309 -11219 -7843 -6524 -10610 -15139 -9849 1352 7789 4645 4692 13252 13909 -463
1179 -463 -10316 -12033 -17213 -17646 -4421 -12583 -19370 -26422 -21376 -11278 -14981 -2076 5877 8497 20811
1164 20811 20406 7588 8319 17027 17014 -1511 -13126 -9739 -2363 3060 3432 3515 -4071 -7876 -18464
1149 -18464 -13956 -7733 -7038 -5409 -12520 -29799 -13644 13696 21837 10364 9824 17532 15628 5270
1135 5270 -12252 -5198 -3486 -7171 -8876 -3821 3205 15332 20690 29008 25724 10920 -12525 -18959
1121 -18959 -21249 -24619 -21372 -23353 -16252 -10227 -4137 6489 8007 3637 -3102 10403 14414 12787
1107 12787 17165 14354 1480 4342 1832 -16191 -12109 -3682 -1578 -9371 -19587 -14307 -14309 -7748 -13819
1092 -13819 -19037 -2584 6481 1241 -981 1397 2491 -4499 -15969 -13725 -3403 1414 -12666 -17733
1078 -17733 -14927 -18959 -7117 5510 -4079 -3060 -5204 -3493 6225 11176 1166 -13741 -5738 11871
1064 11871 21501 18839 15537 11341 10048 15361 12509 11361 10975 9942 12255 11969 16199 22991 14979
1049 14979 -3410 -9199 -3644 -4340 -3238 11176 18305 8848 9307 12783 5604 -788 6307 15718 23475
1034 23475 7813 7763 14268 4495 -3505 -15489 -10486 -11771 -2953 -3430 -12009 -10957 -8232 9945 18432
1019 18432 9981 6919 12890 9895 -665 -1769 -188 -3495 -6607 441 10847 8482 3249 -8655
1005 -8655 -18222 -2489 6273 -3312 -11557 -4431 798 5678 17013 14574 4937 -4369 -7442 -15381
991 -15381 -10653 -15928 -469 -50 4346 -7907 -18593 -1963 19526 32201 35472 33761 31355 25765
977 25765 16664 8947 4751 745 4923 12796 23090 14952 1246 -4607 -3280 -7612 -13578 -6222
963 -6222 11059 7146 10273 24862 33031 21144 4921 -4308 -21011 -16320 -14087 -963 8495 17054
949 17054 25532 19453 18692 21019 18194 4391 13273 17817 23273 27061 20783 1100 -9208 -2378
935 -2378 5214 4757 8091 5982 9923 6672 16675 18311 11485 -8875 -24855 -17800 7531 14576
921 14576 11404 7474 4346 -11503 -12426 -18352 3639 32177 21443 6952 -7416 -15408 -14287 -13742
907 -13742 -19483 -23277 -6083 12927 2964 -4024 -7517 -1380 16034 30084 25391 13174 16010 6370
893 6370 564 -13924 -15049 -12589 -1895 4836 11724 5613 15345 21491 14841 4030 -1176 -8082
879 -8082 -18693 -28767 -34339 -23525 -16365 -9249 15462 10931 9441 20492 30483 31928 22464 11047
865 11047 7474 -493 -14393 -8105 -4452 -2081 3830 2883 9007 8773 15501 22891 12345 13327 17224
850 17224 17975 14574 22799 20786 15700 24125 37899 31979 4983 -7287 6441 3245 764 -8340
836 -8340 -14922 -20579 -12230 -3972 -11276 -9542 -16809 -25857 -29473 -20940 -12179 -9509 -3812 3937 12448
821 12448 10493 13186 7277 -747 -14777 -18210 -14709 -7232 -2895 10525 13723 6938 10934 1676
807 1676 -3332 7895 9433 9277 8484 16784 22834 18559 7959 -17188 -19200 -8292 -24241 -24539 -6418
792 -6418 2092 6025 -4082 9493 8139 -313 -12126 -20358 -15548 -16842 -11546 -9034 -21965 -18313
778 -18313 -4012 -496 11981 26543 35657 29520 19107 18364 7680 10398 10376 -6782 -4373 2036
764 2036 -1529 -18938 -20465 -9838 8795 12696 7694 -370 -12510 -13596 7200 17064 15615 -3542
750 -3542 -4856 -5263 -5476 3409 9752 13396 3780 1753 8696 1962 594 16059 8745 -6492 -6836
735 -6836 -21410 -28929 -31624 -21471 -4789 1869 -11652 -18819 -8228 10070 -5166 -10721 -1940
722 -1940 11650 10038 2121 -3102 6150 15597 20461 12331 9815 10909 17352 11839 2460 -10199 -17738
707 -17738 -23377 -15416 -29 -872 5445 9950 10481 8098 3306 5380 6109 7833 17165 12656 18984
692 18984 22792 13699 8155 1142 8 9242 2558 -820 -235 -2764 224 -5678 -11416 -12013 302
677 302 2798 -1940 3378 -5084 -7558 -5743 -403 740 -10485 -9156 -6126 -2703 1731 4305 -2626
662 -2626 -9861 7174 12418 10657 3613 -13663 -19322 -12920 -10550 -8207 5792 13394 4619 -873
648 -873 -1991 -8483 -13112 -9363 -4309 -10887 -12193 -1360 -387 -1701 3434 419 -11246 -9101 -12509
633 -12509 1077 -438 2632 -3519 6727 9890 12206 9927 19068 17283 2193 4512 9799 17447
619 17447 11076 3324 11091 12850 9236 14921 13605 648 -2458 -3553 -7427 -6152 -14477 -16251 -12981
604 -12981 -4624 -2542 -14673 -2781 -4968 -11207 -4820 -13416 -29299 -37405 -13591 -2757 -4660 6070
590 6070 7091 9265 13953 6890 4186 -8295 -6663 -6085 -7825 -4591 -2520 -7253 -2610 1442 2083
575 2083 10185 9186 16344 9827 6862 -8861 -1206 14981 15527 14287 -5685 -19382 -15473 -19325 -26339
560 -26339 -26470 -13830 -13777 -19772 -4820 -2819 -1640 -4516 -688 2960 18450 29559 14854 -5053
546 -5053 -17025 -479 -3084 703 16829 23542 14901 5048 4279 2426 -803 -2250 2233 -890 2981
531 2981 -1798 -14402 -1979 10215 16039 31563 31613 17941 15606 3384 -20265 -22573 -12647 -20068
517 -20068 -20481 -16837 -10103 -1814 -376 2146 10166 6559 -10452 -16089 -16374 -9886 -9996 -20771 -34765
502 -34765 -40231 -37638 -28081 -10880 694 1583 3405 6663 6699 6963 7828 -230 -3938 3252 -6348 -10058
486 -10058 3850 -611 -1146 11567 5146 -3105 -7448 -6960 6532 2930 -597 10323 12993 15006
472 15006 14416 21453 28533 20554 20697 20581 18886 6264 8793 14281 17296 24076 16432 9867 12975
457 12975 6294 -2448 2481 13331 740 -11352 -15749 -15754 -14458 -10785 -9340 6447 18998 9475
443 9475 11744 9791 5784 -4266 -18240 -17928 -10179 -5007 605 8871 26860 21072 10624 630
429 630 -11033 -15776 -13402 -5361 -3289 -12336 -6470 5491 3779 3485 7770 -327 -2464 -97 -3703
414 -3703 827 -10510 -7880 -10125 -17735 -7398 15661 34106 31865 19896 8945 4839 -1642 -3833
400 -3833 -639 -6795 -7958 -6718 -3651 -1747 616 1689 3299 12294 14281 -1482 -7634 -14181 -434
385 -434 9310 15281 17100 8019 4205 3526 -3728 -213 -4478 1667 12687 27528 21216 6018 615
370 615 -2916 3667 2382 7482 -7075 -6769 -3753 -231 -6380 -2388 -382 -639 -9058 -9869 1175 2451
354 2451 -10121 -15688 -17090 -14260 -18657 -10880 -10436 -9137 -12868 -14118 -13975 -7965 -1177 -1322 -16546
339 -16546 -26010 -23940 -24488 -1234 7720 -6911 -4149 -1117 -10831 -10192 4114 4449 1364 13340 13611
324 13611 10052 6993 3762 -3743 -9027 -14771 -18454 -15261 -12696 -10121 -9217 -2876 7014 -22 -11927
309 -11927 -16435 -12705 -6401 -1522 -5031 -12929 -10523 -5947 7018 10686 10844 1784 -657 -9599 -11438
294 -11438 -2916 7531 11905 13742 9918 8630 5432 1638 4581 447 -7312 -4236 999 8583 15666
279 15666 8867 -12631 -22593 -18635 -14495 1331 13026 9795 -1621 -2596 9443 6709 -8297 -314
265 -314 243 -12931 -16488 -13668 -5578 -8584 -14447 -4084 13581 11786 3240 -5062 -1230 -5693 -13293
250 -13293 -8538 -8933 -10929 1110 2763 7038 2009 3854 8633 687 7358 13130 993 -899 -1150
$$ [...]
##END NTUPLES=NMR SPECTRUM
##END=
