##TITLE=Analysis number 326245
Compound Code dshs 00862
Project Code adrs
Chemist Name mariap
##JCAMPDX= 6.0         $$ Bruker NMR JCAMP-DX V2.0
##DATA TYPE= NMR SPECTRUM
##DATA CLASS= NTUPLES
##ORIGIN= Bruker BioSpin GmbH
##OWNER= nmr
$$ XWIN-NMR		Version 3.5
$$ Tue Jan 30 09:11:49 2007 GMT Standard Time (UT+0h)  MAYBRIDGE\nmr@NMR_250MHZ
##.OBSERVE FREQUENCY= 250.131544655141
##.OBSERVE NUCLEUS= ^1H
##.ACQUISITION MODE= SIMULTANEOUS (DQD)
##.ACQUISITION SCHEME= undefined
##.AVERAGES= 16
##.DIGITISER RES= 18
##SPECTROMETER/DATA SYSTEM= dpx250
##.PULSE SEQUENCE= zg30
##.SOLVENT NAME= DMSO
##.SHIFT REFERENCE= (INTERNAL, DMSO, 0, 16.522)
##AUDIT TRAIL= $$ (NUMBER, WHEN, WHO, WHERE, WHAT)
$$ ##TITLE= Audit trail, XWIN-NMR		Version 3.5
$$ ##JCAMPDX= 5.01
$$ ##ORIGIN= Bruker BioSpin GmbH
$$ ##OWNER= nmr
$$ C:\u/data/dgb/nmr/ADRS/2240/pdata/1/auditp.txt
$$ ##AUDIT TRAIL=  $$ (NUMBER, WHEN, WHO, WHERE, WHAT)
(   1,<2007-01-30 09:11:28.80 +000>,<MAYBRIDGE\nmr>,<NMR_250MHZ>,
      <created by zg, POWCHK disabled, PULCHK disabled
       configuration hash MD5:
       49 4B E0 1D 92 C2 6B 37 9F E6 65 BC 52 41 86 1D
       data hash MD5: 64K
       D9 08 92 E3 0D 9C 6F 8C 0F F6 96 10 FF BE E1 F0>)
(   2,<2007-01-30 09:11:40.72 +000>,<MAYBRIDGE\nmr>,<NMR_250MHZ>,
      <Start of raw data processing
       ef LB = 0.3 FT_mod = 6 PKNL = 1 SI = 32K 
       data hash MD5: 32K
       85 13 10 90 AA D2 2C 17 FA 7B 16 A2 C7 21 51 50>)
(   3,<2007-01-30 09:11:42.37 +000>,<MAYBRIDGE\nmr>,<NMR_250MHZ>,
      <apk 
       data hash MD5: 32K
       09 53 EA 4F 88 04 4C B5 14 C6 85 77 72 FB 12 36>)
(   4,<2007-01-30 09:11:43.08 +000>,<MAYBRIDGE\nmr>,<NMR_250MHZ>,
      <abs ABSG = 5 
       data hash MD5: 32K
       59 33 B9 3B AA 86 F0 8F C1 75 88 16 4F 63 B1 4D>)
$$ ##END=
$$ 
$$ hash MD5
$$ 1D 0E 8C B0 79 CF 7A A2 FE 1C C7 3A C7 26 0F 6D
##$RELAX= 
##$RELAX= 
##$RELAX= 
##$RELAX= 
##$RELAX= 
##$RELAX= 
##$RELAX= 
$$ Bruker specific parameters
$$ --------------------------
##$DU= <C:\u>
##$EXPNO= 2240
##$NAME= <ADRS>
##$PROCNO= 1
##$TYPE= <nmr>
##$USER= <dgb>
##$AMP= (0..31)
100 100 100 100 100 100 100 100 100 100 100 100 100 100 100 100 100 100 
100 100 100 100 100 100 100 100 100 100 100 100 100 100 
##$AQSEQ= 0
##$AQ_mod= 3
##$AUNM= <au_zg>
##$AUTOPOS= <35 >
##$BF1= 250.13
##$BF2= 250.13
##$BF3= 250.13
##$BF4= 250.13
##$BF5= 500.13
##$BF6= 500.13
##$BF7= 500.13
##$BF8= 500.13
##$BYTORDA= 1
##$CFDGTYP= 0
##$CFRGTYP= 5
##$CHEMSTR= <none>
##$CNST= (0..31)
1 1 145 1 1 1 1 1 1 1 1 1 1 1 1 1 1 1 1 1 1 1 1 1 1 1 1 1 1 1 1 1 
##$CPDPRG= <>
##$CPDPRG1= <>
##$CPDPRG2= <>
##$CPDPRG3= <>
##$CPDPRG4= <mlev>
##$CPDPRG5= <mlev>
##$CPDPRG6= <mlev>
##$CPDPRG7= <mlev>
##$CPDPRG8= <mlev>
##$CPDPRGB= <>
##$CPDPRGT= <>
##$D= (0..31)
0 1 0 0 0 0 0 0 0 0.06 0 0 0 0 0 0 0.0002 0 0 0 0 0 0 0 0 0 0 0 0 0 0 
0 
##$DATE= 1170148287
##$DBL= (0..7)
120 120 120 120 120 120 120 120 
##$DBP= (0..7)
150 150 150 150 150 150 150 150 
##$DBP07= 0
##$DBPNAM0= <>
##$DBPNAM1= <>
##$DBPNAM2= <>
$$ [...]
##$SUBNAM7= <"">
##$SUBNAM8= <"">
##$SUBNAM9= <"">
##$SW= 20.6930455092707
##$SWIBOX= (0..15)
0 0 3 0 0 0 0 0 0 0 0 0 0 0 0 0 
##$SW_h= 5175.983436853
##$TD= 65536
##$TD0= 1
##$TE= 294.16
##$TE2= 300
##$TE3= 300
##$TEG= 300
##$TL= (0..7)
0 120 120 120 120 120 120 120 
##$TP= (0..7)
150 150 150 150 150 150 150 150 
##$TP07= 0
##$TPNAME0= <>
##$TPNAME1= <>
##$TPNAME2= <>
##$TPNAME3= <>
##$TPNAME4= <>
##$TPNAME5= <>
##$TPNAME6= <>
##$TPNAME7= <>
##$TPOAL= (0..7)
0.5 0.5 0.5 0.5 0.5 0.5 0.5 0.5 
##$TPOFFS= (0..7)
0 0 0 0 0 0 0 0 
##$TUNHIN= 0
##$TUNHOUT= 0
##$TUNXOUT= 0
##$USERA1= <user>
##$USERA2= <user>
##$USERA3= <user>
##$USERA4= <user>
##$USERA5= <user>
##$V9= 5
##$VALIST= <valist>
##$VCLIST= <CCCCCCCCCCCCCCC>
##$VD= 0
##$VDLIST= <DDDDDDDDDDDDDDD>
##$VPLIST= <PPPPPPPPPPPPPPP>
##$VTLIST= <TTTTTTTTTTTTTTT>
##$WBST= 1024
##$WBSW= 4
##$XGAIN= (0..3)
0 0 0 0 
##$XL= 0
##$YL= 0
##$YMAX_a= 295659
##$YMIN_a= -288057
##$ZGOPTNS= <>
##$ZL1= 120
##$ZL2= 120
##$ZL3= 120
##$ZL4= 120
##$ABSF1= 16.522
##$ABSF2= -4.171173
##$ABSG= 5
##$ABSL= 3
##$ALPHA= 0
##$AQORDER= 0
##$ASSFAC= 0
##$ASSFACI= 0
##$ASSFACX= 0
##$ASSWID= 0
##$AUNMP= <proc_1d>
##$AZFE= 0.1
##$AZFW= 0.1
##$BCFW= 0
##$BC_mod= 0
##$BYTORDP= 0
##$COROFFS= 0
##$CY= 12.5
##$DATMOD= 1
##$DC= 0
##$DFILT= <>
##$DTYPP= 0
##$F1P= 14.0000005364418
##$F2P= -0.99999901652339
##$FCOR= 0.5
##$FTSIZE= 32768
##$FT_mod= 6
##$GAMMA= 0
##$GB= 0
##$INTBC= 1
##$INTSCL= 1
##$ISEN= 128
##$LB= 0.3
##$LEV0= 0
##$LPBIN= 0
##$MAXI= 10000
##$MC2= 0
##$MEAN= 0
##$ME_mod= 0
##$MI= 0
##$NCOEF= 0
##$NC_proc= -3
##$NLEV= 6
##$NOISF1= 0
##$NOISF2= 0
##$NSP= 0
##$NTH_PI= 0
##$NZP= 0
##$OFFSET= 16.522
##$PC= 1
##$PHC0= 217.2505
##$PHC1= 8.222914
##$PH_mod= 1
##$PKNL= yes
##$PPARMOD= 0
##$PSCAL= 4
##$PSIGN= 0
##$REVERSE= no
##$SF= 250.13
##$SI= 32768
##$SIGF1= 0
##$SIGF2= 0
##$SINO= 400
##$SIOLD= 32768
##$SREGLST= <1H.DMSO>
##$SSB= 0
##$STSI= 32768
##$STSR= 0
##$SW_p= 5175.98343685301
##$SYMM= 0
##$S_DEV= 0
##$TDeff= 65536
##$TDoff= 0
##$TI= <Analysis number 999999
Compound Code 99
Book Reference 9
Project Code 9>
##$TILT= no
##$TM1= 0
##$TM2= 0
##$TOPLEV= 0
##$USERP1= <user>
##$USERP2= <user>
##$USERP3= <user>
##$USERP4= <user>
##$USERP5= <user>
##$WDW= 1
##$XDIM= 32768
##$YMAX_p= 599435145
##$YMIN_p= -119074
$$ End of Bruker specific parameters
$$ ---------------------------------
##NTUPLES= NMR SPECTRUM
##VAR_NAME=  FREQUENCY,     SPECTRUM/REAL,   SPECTRUM/IMAG
##SYMBOL=    X,             R,               I
##VAR_TYPE=  INDEPENDENT,   DEPENDENT,       DEPENDENT
##VAR_FORM=  AFFN,          ASDF,            ASDF
##VAR_DIM=   32768,         32768,           32768
##UNITS=     HZ,            ARBITRARY UNITS, ARBITRARY UNITS
##FACTOR=    0.157963299565203, 1,           1
##FIRST=     4132.6476996994, 0,             0
##LAST=      -1043.33573715361, 0,           0
##MIN=       -1043.33573715361, -119074,     0
##MAX=       4132.6476996994, 599435145,     0
$$ Real data points
##PAGE= N=1
##DATA TABLE= (X++(R..R)), XYDATA
$$ [...]
17906A0842J5638l3735J4882M627k3510n299L913L350j3403Q226J070q3J0633
17893b849K3135n454J26q004j4259m3368j1837K255L8789o984Q768J0758P969
17880i55k2205k0433K7499K4253j0095Q868J2778K084J6969j658j1961j273N772
17867B9643k891K205o285L549J4698k1681p800J9691k145l5404r241o624J6226
17854f059k5349K1943P498P115j2921p161O210K1246R740j4320P722K2832k440
17841C6056L875j4144j6128K0951J1570k0584j0986J7351j7927j1475J0731K5080
17829C4370M8668M84n7783l6554J1538L712o61O152K4491j6538n3662o016K3250
17816a8549O398R742J6671l0103k7820q151P245M4143L548j6295K5932j3667J871
$$ plain form
17906 10842 26480 -7255 7627 12254 -11256 -16555 -12642 -9292 -22695 -14469 -13399 -13482 -2849
17893 -2849 20286 14832 14958 6954 -7305 -50673 -62510 -60255 -21466 -28450 -19682 -8924 -955
17880 -955 -23160 -43593 -16094 8159 -1936 6932 19710 21794 38763 37105 25144 23871 29643
17867 29643 26752 28957 22672 26221 40919 19238 11438 31129 28984 -6420 -15661 -22285 -6059
17854 -6059 -31408 -9465 -1967 5148 -7773 -14934 -8724 12522 22262 7942 15664 38496 36056
17841 36056 39931 25787 9659 30610 42180 21596 10610 27961 10034 -1441 9290 34370
17829 34370 83038 83522 25739 -10815 723 4435 3774 9926 34417 17879 -35783 -41799 -18549
17816 -18549 -12151 -2409 14262 -15841 -43661 -51812 -44567 -424 3124 -13171 12761 -906 965
17803I65j1653j3030P105N880m297J9889J0637m675m339J3840J0138L916j9222
17790A5154k4548M17K9437k1653j755p155k7771j1876k3754J0543J8690K1393
17778b2878L3448K809J6579L121l0831J9199P097n842N731L5437k4006k1653p234
17765A0977p2j3951k3691j1879j5584M736K211L6934J4741k6151p752L6992M878
17752A2389l0808L427j6498l28Q238K003p872J9806J5042J2862q148J498J2411
17739B4022R278j4525j4625q799r615K447L5332o164l7162j3508O019M4020P223
17726B3943l7653j5517K0122l3456o177J350k0532K861K7140J3118l896P878m120
17713b4939J6662O675p14J3089l430l484n64J6170n722l8690j2841J7365K155
$$ plain form
17803 965 -10688 -23718 -16613 -10733 -15030 4859 15496 10821 6482 20322 30460 34376 15154
17790 15154 -9394 -8977 20460 -1193 -2948 -10103 -37874 -49750 -73504 -62961 -44271 -22878
17778 -22878 10570 13379 29958 33079 2248 21447 28544 22702 28433 63870 39864 18211 10977
17765 10977 10905 -3046 -26737 -38616 -54200 -49464 -47253 -10319 4422 -21729 -29481 7511 12389
17752 12389 -18419 -14992 -31490 -31818 -23580 -21577 -29449 -9643 5399 18261 10113 11611 24022
17739 24022 33300 18775 4150 -4649 -14264 -11817 23515 17351 -19811 -33319 -27300 16720 23943
17726 23943 -13710 -29227 -9105 -42561 -48738 -47388 -67920 -65059 -37919 -24801 -28697 -20819 -24939
17713 -24939 -8277 -1602 -2316 10773 7343 3859 3295 19465 13743 -24947 -37788 -20423 -18268
17700a8268n718j0781N014M865k892k4156l0184J085K4635J2158j8957j8480K1031
17687f0648K6725K9269K4716k6683k4507r621Q537j0253m229L813p731K8995J3424
17674h193o319l143O132j0438j0894K23j2403R019J3962l802J969L385r025l656
17660c3183n429k627L289J7920K5255J2347m83m626k8578P372k7405J7590J3076
17647e482J8204J1123M88o898j1629l4984J3471J0053q462o585J9976K2518R55
17634B2748j3387k0453j3446J5287K7412l373q812m600l5028M3669L7114q989
17622C8142j7364j1681J3974j8121j4028L5138k0765k7848j6646M260J1662k5544
17610d8821p787J7753P867K693K469q726k2408j369j8020K0715O5155J5660l5254
$$ plain form
17700 -18268 -23986 -34767 -29753 -24888 -27780 -51936 -82120 -81035 -56400 -44242 -63199 -81679 -60648
17687 -60648 -33923 -4654 20062 -6621 -31128 -40749 -32212 -42465 -46694 -42881 -50612 -21617 -8193
17674 -8193 -14512 -17655 -11523 -21961 -32855 -32632 -45035 -36016 -22054 -25856 -23887 -20502 -29527 -33183
17660 -33183 -38612 -41239 -37950 -20030 5225 17572 17089 12463 -16115 -8743 -36148 -18558 -5482
17647 -5482 12722 23845 24333 17435 5806 -29178 -15707 -5654 -14116 -20701 -725 21793 22748
17634 22748 9361 -11092 -24538 -9251 18161 14788 5976 1376 -33652 10017 47131 38142
17622 38142 20778 9097 23071 4950 -9078 26060 5295 -22553 -39199 -34939 -23277 -48821
17610 -48821 -56608 -38855 -30988 -28295 -25826 -34552 -56960 -58329 -76349 -55634 9521 25181 -10073
17597a0073k421J5441K2312j5649l5972j6328R630L5419K8770O099Q647k4029
17585B1846l3779o68q594j169J8990j3495P024J5053p678L8584K0474l0934q058
17572A7596j2983j0114j803J476R508K7226j8804k9376q014k0031j4615K2311
17560c7623M2116K3482k2315j672P849k1999p337J8769J8067J0254L751l869k3824
17547E649k419J9838K232p317k3944k3063R489J5424k8458j6896K0471J8667J9197
17534H870P861j9238j7039J8869n880J8055J2570J5127J3447m8800l0450j0196
17522c6804R975K0087K2217r042m3077l0627K2866n031k3773K5329K0576J3856
17510a3448J6700j200N201J1077j0403L3242R987k1035k7152P04k5968l5805p906
$$ plain form
17597 -10073 -12494 2947 25259 9610 -26362 -42690 -33060 2359 31129 37228 45875 21846
17585 21846 -11933 -12601 -21195 -22364 -3374 -16869 -9845 5208 -2470 36114 56588 25654 17596
17572 17596 4613 -5501 -7304 -5828 3680 30906 12102 -17274 -25288 -45319 -59934 -37623
17560 -37623 4493 27975 5660 3988 11837 -10162 -17499 1270 19337 29591 33342 29473 5649
17547 5649 3230 23068 25300 17983 -5961 -29024 -19535 -4111 -32569 -49465 -28994 -10327 8870
17534 8870 16731 -2507 -19546 -677 -6557 11498 24068 39195 52642 3842 -26608 -36804
17522 -36804 -26829 -6742 15475 6433 -36644 -67271 -44405 -49436 -73209 -47880 -27304 -13448
17510 -13448 3252 2052 7253 18330 7927 41169 51156 30121 2969 3673 -22295 -58100 -66006
17497f6006K4178j7715j8183J1584J1502K6512q40l342J1261J0718N793n915j4991
17484b5444k2711K044M839J7093Q174k1285p808J7076k6665K4677J4952P882J5836
17471H660L2626j7917m0335K1266O509L537k0801J9078K921J058J5938j5147k3811
17458f418K719j2899j5615N246j492j8955M711j804K4080M0584j6195j7445M730
17445h753n71J4539N027j6479j7701k2431J0279J3544J7768j628j898j7914j9997
17432d6215j9561j8986J2877q41J1315J7661N3694o2j0142k05O031L4881K753
17419D3200k0828J8118j287k8407O197K977k7515k1764J0349L415K3820M564k8440
17406a5601r574J2813j2910Q382L0k963j0109K6423J3276J2495j3017k4444k8521
$$ plain form
17497 -66006 -41828 -59543 -77726 -66142 -54640 -28128 -28968 -32310 -21049 -10331 -4538 -10453 -25444
17484 -25444 -48155 -46111 -41272 -24179 -16005 -37290 -45098 -28022 -54687 -30010 -15058 -7176 8660
17471 8660 41286 23369 -16966 4300 10809 14346 -6455 12623 15544 16602 32540 17393 -6418
17458 -6418 -3699 -16598 -32213 -26967 -28459 -47414 -42703 -44507 -20427 20157 3962 -13483 -8753
17445 -8753 -9324 5215 10242 -6237 -23938 -46369 -36090 -22546 -4778 -6406 -8304 -26218 -46215
17432 -46215 -65776 -84762 -71885 -72726 -61411 -43750 9944 9882 -260 -465 5566 40447 43200
17419 43200 22372 40490 39203 10796 16993 19970 -7545 -29309 -18960 -15545 8275 12839 -15601
17406 -15601 -25175 -12362 -25272 -16890 -16860 -19823 -29932 -3509 9767 22262 9245 -15199 -43720
17393d3720P352P078o08q319J3458K4139O128k5187k3145K3912J9613q533l1068
17380c8900J3101Q880n546K0138L9158j3657l5283K6344L0873Q188l3053l08k798
17367A7137p765R282j6318J4731R848O536j0976l6410J9660p70j4725j9743r625
17354c9138j8985k600K3406j046J8194L207o708j674K7741K5889O609k0005N507
17341B0397L509j5769k4870J800l7638k7314J4006K1555K4631K0802j8278k3615
17329d0784K8629J6661K872M850J9928Q208M469j9152J671k4511O486J0705k5617
17316e585l3462j9407o327q59J6225J7940m165j0146P569J453J1574K040k0755
17303d3905J658r284L1900K2669o944o411K1991J1473J2433j6901q139j7796j3587
$$ plain form
17393 -43720 -36368 -29290 -29898 -38217 -24759 -620 5508 -19679 -42824 -18912 701 -7832 -38900
17380 -38900 -25799 -16919 -22465 -2327 36831 23174 -12109 14235 45108 53296 20243 19935 17137
17367 17137 9372 18654 2336 17067 26915 33451 22475 -13935 5725 4955 -9770 -29513 -39138
17354 -39138 -58123 -60723 -37317 -38363 -20169 -16962 -23670 -25344 2397 28286 34895 14890 20397
17341 20397 23906 8137 -16733 -14933 -52571 -79885 -65879 -44324 -19693 1109 -17169 -40784
17329 -40784 -12155 4506 7378 12228 32156 40364 44833 25681 27352 2841 9327 20032 -5585
17316 -5585 -39047 -58454 -64781 -65640 -49415 -31475 -35640 -45786 -38217 -36764 -25190 -23150 -43905
17303 -43905 -42247 -51531 -19631 3038 -3906 -10317 11674 23147 35580 18679 10540 -7256 -20843
17290b0843q97k366j5277J3522K5948l836j5084K0709n967J8303J805k6549O555
17277c977K0325K995k4653j3197M828J6987J4044r237k0685k6612J1734L880n931
17264b9499p024o552J1853k955l580r939P315k2228J6305K4695O200o147l624
17251b5180N142Q258J6361L464q049j3845r551J1901K1026N728k81j3475j3504
17238a2005j9567J843j1381J570K0372j0883l4899J3334K5283J3492j410m209
17226a8460k1602J1642O553q558k808J6490J5240n030m972J5469K2550J6790Q04
17213D4108j3655p806m1250r147L6046J0511m0752O543J3598K651n985q273J2942
17200d69q43J4054K4052K1858k1505k6691K1055J1202j7735J391l7213k9690p492
$$ plain form
17290 -20843 -21740 -24106 -39383 -25861 87 -3749 -18833 1876 -4091 14212 16017 -10532 -3977
17277 -3977 16348 19343 -5310 -18507 -13679 3308 17352 8115 -12570 -39182 -27448 -23568 -29499
17264 -29499 -36523 -43075 -31222 -34177 -37757 -47696 -40381 -62609 -46304 -21609 -15409 -21556 -25180
17251 -25180 -20038 -11780 4581 8045 -4 -13849 -23400 -11499 9527 15255 14974 1499 -12005
17238 -12005 -31572 -29729 -41110 -39540 -19168 -30051 -64950 -51616 -26333 -12841 -14251 -18460
17226 -18460 -40062 -28420 -21867 -30425 -33233 -16743 -1503 -6533 -11505 3964 26514 43304 44108
17213 44108 30453 22647 -18603 -27750 8296 18807 -21945 -15402 -1804 847 -5138 -13411 -469
17200 -469 -1312 12742 36794 58652 37147 10456 31511 42713 24978 26369 -10844 -40534 -48026
17187d8026O6311L3584n2082j3276P937j2831k2696O236J4221j269n039Q202K1219
17174B491j1344k2749l509J2356L3664J357j8762k7594k9789J6432N0874j7334
17162a3907j3807N745J868K7006j0330j0800J2630p200J3124K4947J2899n6750
17150a4575m5804o271J5938M2073l257p258J1467j5177J3179j5986j0261N145
17138c0787l1789l4304K3043K5750L6143n334J1292J2122Q488m1485k4627L4794
17126a6694L0572k6429j0766p952k3307q747K3981J9307M721o881k1481j7953
17114f1629L1751J6141k6176J3584R612O864L3918L9131q261k5620k1495k3668
17102a5848J6672K1873k5852L844K574j1766j8666J181J5087J21n840q662K09
$$ plain form
17187 -48026 18285 51869 -213 -13489 -5552 -18383 -41079 -34843 -20622 -21891 -26930 -18728 2491
17174 2491 -8853 -31602 -35111 -22755 10909 12266 -6496 -34090 -63879 -47447 3427 -13907
17162 -13907 -27714 -21969 -20101 6905 -3425 -14225 -1595 -8795 4329 29276 42175 -14575
17150 -14575 -60379 -66650 -50712 -8639 -11896 -19154 -7687 -22864 -9685 -25671 -35932 -30787
17138 -30787 -62576 -96880 -73837 -48087 -11944 -17278 -5986 6136 14624 -26861 -51488 -16694
17126 -16694 13878 -12551 -23317 -31269 -54576 -63323 -39342 -20035 -15314 -22195 -43676 -61629
17114 -61629 -29878 -13737 -39913 -26329 -16717 -9853 24065 63196 54935 29315 7820 -15848
17102 -15848 824 22697 -3155 689 3263 -8503 -27169 -25988 -10901 -10780 -16620 -25282 -25073
17089b5073K7832P804l4128j4212K5468K0099J97j8273j7461J7500L6502k0566
17077E689l9155k2749N805M235K6594J5013k3438J0384K0928K2645R076k0478
17065A4549n4713j0429L3603p4j0896j434j1066j5229Q890J8470K3012J71k8643
17052c3789m410j769q523K0918M665M9620J7989J514k6330m3751k4092J1585J5656
17039b0717l151J2336J2916J3113k674j5462j5852J7466K6935m399n462p636j8195
17026a0782j9119J529K2015j5281m3673p886K1400K2891K8094J0005K20q83N811
17013A4341R166O325j0080k1394j1712m790J4700k1803l8355q469K5920J2180
17001c3971j739K2854l918k1065Q068K3048P544j4994n978j0527N544R111J1123
$$ plain form
17089 -25073 2759 10563 -23565 -37777 -12309 7790 7987 -10286 -27747 -10247 26255 5689
17077 5689 -33466 -56215 -50410 -46175 -19581 -4568 -28006 -17622 3306 25951 35027 14549
17065 14549 -40164 -50593 -16990 -17064 -27960 -29394 -40460 -55689 -46799 -28329 -5317 -5146 -33789
17052 -33789 -38199 -39968 -48491 -27573 -22908 26712 44701 46215 19885 -23866 -47958 -36373 -20717
17039 -20717 -23868 -11532 1384 14497 11823 -3639 -19491 -2025 24910 20511 15049 7413 -10782
17026 -10782 -29901 -28372 -6357 -21638 -65311 -73197 -51797 -28906 -812 9193 9413 8530 14341
17013 14341 23507 29832 19752 -1642 -13354 -18144 -3444 -25247 -63602 -72071 -46151 -33971
17001 -33971 -35710 -12856 -16774 -37839 -29771 -6723 821 -14173 -20151 -30678 -25134 -16023 -4900
16988d900k3773m5884J9600M5984K7233J4704J3947q788k0709p723j3747m634
16976h690J8690j9803k1514J5790L282O779J6742J3686j2021j3711J0399M248
16964A3877M074j1362J6954r0l6086j25q239J0725J2351J4355j1485K321o3k599
16950D608l4690L409P393p9r038J0051J0088j4330p863j8020M329R354M86K2089
16936a2213q926P343J0999j6102l2744J4252M665K796M365L05N183n812k403p709
16922c6001O252j8782j5776J2326Q416J1842J3428J4058n166J4883K4523j1433
16910A8570j8043KJ9186K3066q047j4795m091r172j1040j3709K1972O588o821
16897C666J6851k169o31k7755l4952n6974r965L4003M7413J7905j6092R890J9608
$$ plain form
16988 -4900 -28673 -74557 -54957 -8973 18260 32964 46911 38123 17414 9691 -4056 -8690
16976 -8690 10000 -9803 -31317 -15527 -12245 -5466 11276 24962 12941 -770 9629 13877
16964 13877 17951 6589 23543 23453 -12633 -12758 -20997 -10272 2079 16434 4949 7270 7207 4608
16950 4608 -30082 -26673 -19280 -19359 -28397 -18346 -8258 -22588 -30451 -48471 -44142 -34788 -34302 -12213
16936 -12213 -21139 -13796 -2797 -18899 -51643 -37391 -32726 -29930 -25565 -25260 -20077 -25889 -28292 -36001
16922 -36001 -29749 -48531 -64307 -51981 -43565 -31723 -18295 -4237 -9403 5480 30003 18570
16910 18570 527 529 19715 42781 34734 19939 15848 6676 -4364 -18073 3899 10487 3666
16897 3666 20517 18348 17717 -10038 -44990 -101964 -111929 -77926 -30513 -12608 -28700 -18810 798
16884G98J7815P093k4837o476Q061j1567j2436J5147K0172j2614j702k3161k7607
16871e1314K0940J6837l016K4984J4551q10k634l8820m2950O465M2514K2607K1927
16858C1281m6842l0784Q950J9033k3843m953m872m817m5201M50L8235K5009M1366
16845C012J1045k2722J141j303n009J1288j3241j4477N940j1920j2567Q649L2505
16832g659p191O850j2133J829J3588k2199J2881p042J549o39J1747j0237j0970
16819b9626j2202P706J9689K4053J9413n589j7633L62R398L834j3051l4993O850
16806b1789N26j8402J1275K0201J2711j1967l2276j7335K6676j552O66M809J647
16793b4810M59l332k7443L5910K2985J2581q352j7618j6578J256J3500j7219j8921
$$ plain form
16884 798 18613 25706 869 -5607 2454 -9113 -21549 -6402 13770 1156 -546 -23707 -51314
16871 -51314 -30374 -13537 -16553 8431 22982 22172 19538 -19282 -62232 -55767 -13253 9354 31281
16858 31281 -15561 -46345 -37395 -18362 -42205 -47158 -52030 -56847 -102048 -101598 -63363 -38354 3012
16845 3012 14057 -8665 -7524 -8827 -13836 -2548 -15789 -30266 -24326 -36246 -48813 -40164 -7659
16832 -7659 -14850 -8000 -20133 -18304 -4716 -26915 -14034 -21076 -19527 -20166 -8419 -18656 -29626
16819 -29626 -41828 -34122 -14433 9620 29033 23444 5811 6173 15571 19405 6354 -28639 -21789
16806 -21789 -21263 -39665 -28390 -8189 4522 -7445 -39721 -57056 -30380 -31932 -31266 -26457 -24810
16793 -24810 -24351 -27683 -55126 -19216 3769 16350 7998 -9620 -26198 -24942 -11442 -28661 -47582
16780d7582R43j0597J9197L6678J1275j527n891k4376m5161k577J3622L7068J7601
16767a327J1461k3010K033j4505P331K7908j6077j9997J8701k8954K284L693k1612
16754e2071r359l359J3895J0182j8180J5492J1260m461o435k4449P105L2952J1077
16741a6351M487J920L286J2891k952l2228J54K8926L224J4025r285j2607O042
16728A532j5827k9329o392L1166L269l5079j7512L2878K7153J6365r077O516j751
16715C912l0090k7427j743j2918m003j5567J7660K5337K0130J3341j2592j5480
16703c9440j5019M557k692m785k643j498l981n161K1100K6865p280J4485j0117
16690b5609O404k5640k0357K3955K7707J2785j1588j7481k6696O052J0553K0496
$$ plain form
16780 -47582 -46639 -57236 -38039 -1361 9914 8387 2496 -21880 -67041 -69618 -55996 -18928 -1327
16767 -1327 10134 -12876 -10843 -25348 -18017 9891 -6186 -26183 -7482 -36436 -34152 -30459 -52071
16754 -52071 -61430 -64789 -50894 -40712 -58892 -43400 -32140 -36601 -43036 -67485 -60380 -27428 -16351
16741 -16351 -11864 -9944 -6658 6233 3281 -28947 -28793 133 3357 17382 8097 -4510 1532
16728 1532 -14295 -43624 -50016 -18850 -15581 -50660 -68172 -35294 -8141 8224 -853 5663 3912
16715 3912 -26178 -53605 -55348 -68266 -72269 -87836 -70176 -44839 -24709 -11368 -23960 -39440
16703 -39440 -54459 -49902 -52594 -57379 -60022 -61520 -65501 -70662 -49562 -22697 -29977 -15492 -25609
16690 -25609 -19205 -44845 -65202 -41247 -13540 -755 -12343 -29824 -56520 -50468 -39915 -19419
16678a9419K123K6627P212k6536k7704m649O632K6766j586j6100L288l266J5932
16665a0680n137J9585K8319j7417j7555K8973O036j0983l5939j5715J8701K1994
16653A0182j0547j5976j1418Q504j0376J1710j5109k6015n411j0694K2420L4270
16641a8460L788j040k8504l4230o92J3845L8346R025o966K0446J0334n390j9557
16628a9055M185J2467l443j1258N399L0723r30P557k8668k6168l0342M188Q09
16615e4536n679k650K8689J611M405l720J2315R566o920Q23J7946Q328l3865j3796
16601c7483J109j3372J2413J7585J7273o257Q157m1224k8609j5376N59L8150M0280
16588f795k0451L201J6939Q809N947L833k9318p289J06k3768K795M682Q989K719
$$ plain form
16678 -19419 -17296 9331 16543 -9993 -37697 -42346 -35714 -8948 -10534 -26634 -23346 -26612 -10680
16665 -10680 -15817 3768 32087 14670 -2885 26088 32124 21141 -14798 -30513 -11812 10182
16653 10182 -365 -16341 -27759 -19255 -29631 -17921 -33030 -59045 -64456 -75150 -52730 -18460
16641 -18460 -14672 -15712 -44216 -78446 -79138 -65293 -26947 -17922 -24888 -4442 5892 502 -19055
16628 -19055 -14870 -2403 -5846 -17104 -11705 19018 18088 25645 -3023 -29191 -59533 -55345 -54536
16615 -54536 -60215 -62865 -34176 -32565 -28160 -31880 -19565 -9999 -16919 -16096 1850 10178 -23687 -37483
16601 -37483 -36374 -49746 -37333 -19748 -2475 -8732 -575 -41799 -70408 -85784 -85225 -47075 -6795
16588 -6795 -27246 -24045 -7106 1703 7650 11483 -17835 -25124 -25018 -48786 -45991 -41309 -32320 -29601
16574b9601M920M199j3308K4017J0368l2363l447K4299J3532K9843j8167j4733
16562d41q152P42o321K0365l4770l6965k5378L075K2679J3626j2746N371M0443
16549a8472P214j553K225m598O371o19O693L820Q052N174k0562k5139j2247J1635
16535c2006j0785J552J0142j5737q701L5666j1728m216M467k6524q481J8758K9676
16522a7917r311N301p687j166J8675Q957J1148K5857j0154j8239p521m346N904
16509d99J0355l3638L5384l481k9623j463l7984L208K507K605N169j2784p603
16496f7847j62j1178M094R816J4139n796K1489K7820J3159l1366o80O199k1995
16483d2308q540j3026N049R353K9974L872J1649j6295j9627M615M500L1647r579
$$ plain form
16574 -29601 -24681 -20482 -33790 -9773 595 -31768 -35215 -10916 2616 32459 14292 -441
16562 -441 -8593 -7851 -14172 6193 -28577 -65542 -90920 -87845 -65166 -51540 -64286 -58915 -18472
16549 -18472 -11258 -12811 -10586 -15184 -8813 -9432 -2739 1081 9133 14307 -6255 -31394 -43641 -32006
16535 -32006 -42791 -41239 -31097 -46834 -55535 -19869 -31597 -35813 -31346 -57870 -66351 -47593 -17917
16522 -17917 -27228 -21927 -29614 -30780 -12105 -3148 8000 33857 23703 5464 -2057 -6403 -499
16509 -499 9856 -23782 11602 8121 -21502 -22965 -60949 -57741 -55234 -52629 -47460 -60244 -67847
16496 -67847 -68009 -79187 -75093 -65277 -51138 -56934 -35445 -7625 5534 -25832 -26512 -20313 -42308
16483 -42308 -50848 -63874 -58825 -49472 -19498 -15626 -3977 -20272 -39899 -35284 -30784 863 -8716
16470h716j9663K92J191j0474P376J4924K5539L6235R545p047l8350L033q805
16457E080m1030Q757N926R31J2523L677j152P919n823k0730j6411J6280N0752
16444B6699M6549Q251n1054p0812r080L9004m678j0899J9263k8100m4428J4777
16432f4508p29K2596J1183R755K410j3483R067L1568P778Q808J0181l3074n871
16419d319J5258j7963j1821n561j5198j7442k6893m340N2287R450l8624o724J9214
16406e2676M7872J152r730k236j8493j7923O761n828M2615P470m326j9053j7216
16393d1611P615M6074J5314J9366J143m0395r561J8224R807P437O15r133j2235
16380A2660m597k4174j4608J8448K0445L508n34j273K424o733K253N642N478J0821
$$ plain form
16470 -8716 -28379 -28087 -26896 -37370 -29994 -15070 10469 46704 56249 49202 10852 13885 5080
16457 5080 -35950 -27193 -21267 -20336 -7813 -4136 -5288 2631 -3192 -23922 -40333 -24053 26699
16444 26699 73248 81499 30445 -40367 -49447 -10443 -15121 -26020 -6757 -34857 -79285 -64508
16432 -64508 -65237 -42641 -31458 -21703 -19293 -32776 -23709 7859 15637 24445 34626 1552 -4319
16419 -4319 10939 -7024 -18845 -24406 -39604 -57046 -83939 -88279 -35992 -26542 -65166 -71890 -52676
16406 -52676 -4804 -3652 -13382 -15618 -34111 -52034 -45273 -51101 -8486 -1016 -5342 -24395 -41611
16393 -41611 -33996 12078 27392 46758 47901 7506 -2055 16169 25976 33413 34028 24895 12660
16380 12660 8063 -16111 -30719 -12271 8174 11682 11148 9875 12299 5566 7819 13461 18939 29760
16366B9760J0023j0894k4861p733k7740L496K3402J8689k852M370K31m2723k8276
16353e5108j6055K3185L807l430R87K4539k7836k0062N0915J6043P925J7879L84
16340B3173j1459L607j2415q237Q513J7414J1226k9285j4121J3076j1659k4308
16328c4475J4504J4829J589J2470K822r497m6600m7798J4824M7555N990N894J2448
16315e445Q663R9N180j9181J4660n739j8676n031J1346k242n66N632M2933J6161
16301D7794k4043J0618K160j6039M737J9442o520l3973k9070M434O301K0328K5243
16288C1412j4788k2580l0378O273N36j2697L228K1535J5371J1823K604o030m1746
16275c5437k7978J8669K6757K8757M48m9279N294J6250L2085J6710k1584m0735
$$ plain form
16366 29760 39783 28889 4028 -3705 -31445 -27949 -4547 14142 11290 15660 15891 -26832 -55108
16353 -55108 -71163 -47978 -44171 -47601 -46614 -22075 -49911 -69973 -19058 -3015 4910 22789 23173
16340 23173 11714 15321 2906 -5331 3182 20596 31822 2537 -11584 1492 -10167 -34475
16328 -34475 -19971 -5142 -3553 8917 11739 2242 -44358 -92156 -77332 -29777 -23787 -17893 -5445
16315 -5445 3218 3317 8497 -10684 3976 -1763 -20439 -25470 -14124 -16366 -16932 -11300 31633 47794
16301 47794 23751 34369 36529 20490 25227 44669 38149 4176 -24894 -20460 -14159 6169 31412
16288 31412 16624 -5956 -36334 -30061 -29525 -42222 -38994 -17459 -2088 9735 12339 6309 -35437
16275 -35437 -63415 -44746 -17989 10768 11216 -38063 -32769 -16519 15566 32276 10692 -30043
16263c0043Q385J9135j0540N882K0666l7700o161K0431m792L0376M890K2798j958
16250D1369o5207j3462O386K5600K0074n760l3593m1524k415K209o986M8968M2733
16237A8392j2142p400J4280n952l2008m196j4027j280J3949K1341j53j4094M225
16224a9065r927J1414K5098J9240j5732l6500p433K91J9068q822j6116J6266R7
16211b2121k41J3490J377O117j811n970k4130l569K9087k1474k1352j2598k0110
16198h3305l025J1222L2568J5605J783J777n469L623K1823L1487J802j8970O274
16185A7195j2540m1767r475L575J2648O712L668R027N920j847l023l652R317J3572
16171I330K3348j5746j0549m271R599J6946k4687j2950m596J0839j4147L808K611
$$ plain form
16263 -30043 -21658 -2523 -13063 -7181 13485 -24215 -30376 -9945 -14737 15639 20529 43327 41369
16250 41369 -23838 -37300 -30914 -5314 14760 9000 -24593 -66117 -68532 -66323 -73309 -24341 18392
16237 18392 6250 -1150 13130 7178 -24830 -29026 -43053 -44333 -30384 -9043 -9196 -23290 -19065
16224 -19065 -28992 -17578 7520 26760 11028 -25472 -32905 -32614 -13546 -22368 -38484 -22218 -22121
16211 -22121 -22362 -8872 -7495 -1378 -3189 -9159 -33289 -36858 -7771 -29245 -50597 -63195 -83305
16198 -83305 -86330 -75108 -42540 -26935 -25152 -23375 -28844 -25221 -3398 28089 29891 10921 17195
16185 17195 4655 -37112 -46587 -43012 -30364 -23652 -19984 -10957 -5037 -6884 -9907 -13559 -4242 9330
16171 9330 32678 16932 6383 2112 11711 28657 3970 -8980 -13576 -2737 -16884 -13076 -10465
16158a0465K1197J1817k5690l3122j2985K2501k0185N126J3447J591j0030J2223
16146b4575K5389J2559M156p653J7723r691k7803p200J07j0839K279j2186Q001
16133b9733J9135J7895K676P645j9985j1581j6904Q768K1918l153O155j7054J2722
16120a496J5034l961j8006j0920J1705j2189L647k5182l1285J0116K9722J2978
16108a9837J4081R884m0136l430J6468j0891K3582p87j8725k4171l1581O346J7006
16095f2191r013K2679J1702l7696o078K7604l368o679L9394r617R216O371j244
16082a8920N930L55K663o082o340j8392J8450q248j2357k193K540j3802l5963
16069i2359j272J6152K7515J4961k881r724m88K0647K0844L0215j2381k5315n143
$$ plain form
16158 -10465 10732 22549 -3141 -36263 -49248 -26747 -46932 -41806 -28359 -26768 -36798 -24575
16146 -24575 814 13373 17529 9876 27599 17908 -9895 -17095 -16988 -27827 -25548 -37734 -29733
16133 -29733 -10598 7297 9973 17618 -2367 -13948 -30852 -22084 -166 -3319 2836 -14218 -1496
16120 -1496 13538 9577 -8429 -19349 -7644 -19833 -16186 -41368 -72653 -62537 -32815 -19837
16108 -19837 -5756 4128 -36008 -39438 -22970 -33861 -10279 -11066 -29791 -53962 -85543 -79197 -62191
16095 -62191 -71204 -48525 -36823 -74519 -80597 -52993 -56361 -63040 -23646 -33263 -24047 -17676 -18920
16082 -18920 -12990 -12635 -9972 -16054 -22394 -40786 -22336 -30584 -42941 -45134 -42594 -56396 -92359
16069 -92359 -93631 -77479 -49964 -35003 -37884 -47608 -48096 -27449 -6605 23610 11229 -14086 -19229
16056a9229j625O694P688j0476O964K1092m0980n422K8346K0465k3270l0158j9154
16043e9065K587N901K2480q66l2152j3013l1984j2962K9084L5230J8641j5515
16031e1634k9500O119K9066J2641K2804J5042k4603J7611Q164j3148j9396p747
16019c4581j1967p434K1158K0587n952R48j0791J6095R469j907r874p314j6694
16006c8257O463k6821l4689j3088M9214L6548J4459L4O550k130R714K3552j8902
15993A2647k7232n105j393j1311p959J4420O777J0014J7731P222O601j3344l117
15980E951j7200J8207L893k7044j0554J3599J769L1044j3205m6685k8134L0507
15968c7852J9861n923j4791n176J4741M1795K1273j5534k5765K6199M8464q040
$$ plain form
16056 -19229 -20854 -14160 -6472 -16948 -9984 11108 -29872 -35294 -6948 13517 -9753 -39911 -59065
16043 -59065 -56478 -50577 -28097 -28963 -61115 -74128 -106112 -119074 -89990 -54760 -36119 -51634
16031 -51634 -81134 -75015 -45949 -33308 -10504 4538 -20065 -2454 5710 -7438 -26834 -34581
16019 -34581 -46548 -53982 -32824 -12237 -18189 -17241 -28032 -11937 -2468 -4375 -14249 -21563 -38257
16006 -38257 -31794 -58615 -93304 -106392 -57178 -20630 -6171 -6137 413 -1717 7997 31549 12647
15993 12647 -14585 -19690 -21083 -32394 -40353 -25933 -19156 -9142 8589 15811 22412 9068 5951
15980 5951 -11249 6958 10851 -16193 -26747 -13148 -11379 19665 6460 -40225 -68359 -37852
15968 -37852 -17991 -23914 -38705 -43881 -29140 12655 33928 18394 -7371 18828 67292 59252
15956E9252j5393l3474j2749J6744R932p522n23J1995l3628l5078L053K4683K2591
15943I883l1796m242J8977o017M591l864J3085L062q92K412l5927l745J8912J1636
15929c925J0642j7039m024j4260K4120Q201p386j271M369Q099J4801n578K0358
15916C7107l0736k4573J9548O10J2959p566j0195j6897k4567N755J8876l1505
15904e1184N412n337K0268l0872j5173K9867K2222Q095J7210q640j4793l6500
15892e9425o264J3668K4596K5222m162l7660k9088J9612J4343R653J653k6166
15880e4018J7177J7496M48M731O735J7093K3911K2017m2866j9026N585J726j1520
15867a0511j7280Q918j144p675k2083j1771L6215L5564k0945M645J1850j3177
$$ plain form
15956 59252 43859 10385 -2364 14380 24312 16790 16267 28262 -5366 -40444 -37391 -12708 9883
15943 9883 -21913 -26155 -7178 -13195 -8604 -12468 617 3679 2787 5199 -30728 -34473 -15561 -3925
15929 -3925 6717 -10322 -14346 -28606 -4486 3715 -3671 -4942 -573 7526 22327 16749 37107
15916 37107 6371 -18202 1346 1956 14915 7349 -2846 -19743 -44310 -38555 -19679 -51184
15904 -51184 -45772 -51109 -30841 -61713 -76886 -47019 -24797 -16702 508 -8132 -22925 -59425
15892 -59425 -65689 -52021 -27425 -2203 -6365 -44025 -73113 -53501 -39158 -29505 -27852 -54018
15880 -54018 -36841 -19345 -18897 -14166 -7431 9662 33573 55590 12724 -6302 -717 1009 -10511
15867 -10511 -27791 -18873 -20017 -27692 -49775 -61546 -25331 10233 -10712 -6067 5783 -7394
15855g394O00o945j3918n398j6784k0856J897K2963M4612K3962j8847o907q394
15842a1409j8166R010J0180j6259j1609m570l078k0559J0034J7966K0688J8514
15830G42K2217P21k8937O057j3350l6953p407K6933J3665k702j2186J9641j4146
15817b5705k3368J3339N942J8592L2302k917j046l437j1358k9643j5842j7549
15805f0690P357K2361L3922K8558j3203j877k9609k1091J2607R703K3612K6493
15793C8143N185j6606q052m1J2279J835M853M981m8867m9319M1496m559O339j3332
15779b5665j4253r92j7909l9932J4377J5109M3217L0713j3693k1892L130n88J5382
15766a2996j3216j126J883K0860J8223k4469j8028k9484M2711K5115l6545j4743
$$ plain form
15855 -7394 -6794 -13739 -27657 -33055 -49839 -70695 -68798 -45835 -1223 22739 3892 -3015 -11409
15842 -11409 -29575 -20565 -10385 -26644 -38253 -42823 -45901 -66460 -56426 -38460 -17772 742
15830 742 22959 23680 -5257 800 -12550 -49503 -56910 -29977 -16312 -19014 -31200 -11559 -25705
15817 -25705 -49073 -35734 -29792 -11200 21102 18185 17139 13702 2344 -27299 -43141 -60690
15805 -60690 -53333 -30972 2950 31508 18305 16428 -13181 -34272 -21665 -11962 11650 38143
15793 38143 43328 26722 18670 18629 30908 32743 37596 42577 -6290 -55609 -14113 -18672 -12333 -25665
15779 -25665 -39918 -40910 -58819 -98751 -84374 -69265 -26048 4665 -9028 -30920 -27790 -28378 -12996
15766 -12996 -26212 -27338 -25455 -4595 13628 -10841 -28869 -58353 -15642 9473 -27072 -41815
15754d1815J4201M160K3347K7988j1029p060J875J8026M816k3447m404j9092r864
15741b2298Q825k7705j457r967N3025K1138o277P31J309J2393j5928J1504J7837
15728D3130p458k2133j4728J2762o527l1698j6601J4822J6529J3356J2485j3978
15716c9k5302K0948L1839K1104n084J1705n785k0391j3265m665J4100k9489k4250
15703b8574j5219O271J4694J5447p268L277K4873L3536J1936L540n1914o5763
15691e5164p385L4659L2114K2888J6814j5855O695L090k4715k0011k1933l1092
15679e9895L6897L3633k4230l0209Q941R629q65j413n738R438K2353K9943N196
15666C3680p482j2553o308O422j9313k2112l4287k791K3528K8575m726o323j8058
$$ plain form
15754 -41815 -27614 -23454 -107 27881 16852 9792 11667 29693 34509 11062 6658 -12434 -22298
15741 -22298 -13473 -41178 -42635 -52602 423 21561 15284 16015 17324 29717 13789 25293 43130
15728 43130 35672 13539 -1189 11573 5046 -26652 -43253 -28431 -11902 1454 13939 -39
15716 -39 -25341 -4393 27446 48550 43466 55171 49386 28995 15730 11065 25165 -4324 -28574
15703 -28574 -43793 -37522 -22828 -7381 -14649 -11372 13501 47037 58973 62513 10599 -55164
15691 -55164 -62549 -27890 4224 27112 43926 28071 34766 37856 13141 -6870 -28803 -59895
15679 -59895 -22998 10635 -13595 -43804 -34863 -25234 -26099 -27512 -33250 -23812 -1459 28484 33680
15666 33680 26198 13645 7337 13759 -5554 -27666 -61953 -64744 -41216 -12641 -17367 -23690 -41748
15653d1748j3258J3828M0112r168j6779K1918K6269J7263n239J4293k3224j6206
15641H061j0074l4409j9289J149J2064K2933J7353q340k2042L4070K4926p99j7906
15628G697l5961Q764J6800J0059J4647j3886l2940j0177j0511j6869O621J8099
15616c7657J4859P546J3411J8159m795k8148j3340J8100J0262p084j982j6011
15604b6680J3638p064j4098K8583M227j5350J4042j2300J0025J5459j7182l080
15592i780q795p215Q878P899K3392j0136J4651k1520j2274Q599K566J0911K5693
15579C2869l794l2160k9578k409L3386k6736j3790J6923J7008L2618o811k1486
15567c960k0333K590P661J4511K914k388P619K108p715J132M476j7122m755m196
$$ plain form
15653 -41748 -55006 -41178 -1066 -10234 -27013 -5095 21174 38437 33198 47491 24267 8061
15641 8061 -2013 -36422 -55711 -54562 -42498 -19565 -2212 -10552 -32594 1476 26402 25603 7697
15628 7697 -28264 -19500 -2700 7359 22006 8120 -24820 -34997 -45508 -62377 -55756 -37657
15616 -37657 -22798 -15252 -1841 16318 11523 -16625 -29965 -11865 -1603 -8687 -10669 -26680
15604 -26680 -13042 -20106 -34204 -5621 -1394 -16744 -2702 -15002 -4977 10482 -6700 -9780
15592 -9780 -18575 -25790 -16912 -9013 14379 4243 18894 -2626 -14900 -6301 -3735 7176 32869
15579 32869 29075 -3085 -32663 -35072 -1686 -28422 -42212 -25289 -8281 24337 17526 -3960
15567 -3960 -24293 -21703 -14042 469 3383 995 8614 10722 3007 4139 8615 -8507 -13262 -17458
15553a7458K7632j2849J535n24J1732K6164J4255N365k0684m484j6029j9623j6123
15540b1091L251K7438L2351n516j3449j3320l9532j1158K296J8251L4201j0496
15528C226q768k9380m0878K5332M500j3753K9850J2906r772K6183J8050k3846
15516f350j2818J2041M0332K0634j7543k7770J0008l991n765j4316j5712J3807
15504g443L464k1210J802J0353l0205k765J6463M7641k0732k1150K3858j630l1416
15491c2970m39N039j6876K2928P340J976K8397J198O229J3766K2263j9868o2259
15478b3276r066L216L704r629j0621J4324k8345J1196M6628q815l4682N820L339
15465c6207L2916K4794l1614r807K2283j3709O094q878R561j117q425j9636K419
$$ plain form
15553 -17458 10174 -2675 -1140 -1664 10068 36232 50487 55852 35168 30684 14655 -4968 -21091
15540 -21091 -17840 9598 41949 36433 22984 9664 -29868 -41026 -38730 -20479 13722 3226
15528 3226 -5542 -34922 -75800 -50468 -45968 -59721 -29871 -16965 -26737 -554 17496 -6350
15516 -6350 -19168 -7127 33205 53839 36296 8526 18534 14543 8778 -5538 -21250 -7443
15504 -7443 -3979 -25189 -23387 -13034 -43239 -46004 -29541 18100 -2632 -23782 76 -1554 -32970
15491 -32970 -33409 -28370 -45246 -22318 -14978 -13002 15395 16593 22822 36588 58851 38983 -23276
15478 -23276 -32342 -29126 -25422 -35051 -45672 -31348 -59693 -48497 -1869 -10684 -45366 -39546 -36207
15465 -36207 -3291 21503 -10111 -19918 2365 -11344 -5250 -14128 -4567 -5684 -14109 -33745 -31326
15452c1326j3305J052L7154K0845j0922q430J4493p312j1811K4554l316j3058
15440a382r236K6707j875j0017R35M489L029K800j2469m199j0382K570l0398o482
15426d5910l499L1881K9005k740q510k7782k5254P071l926N234j3503P338M3206
15413g389m179k1922k1586K5572M0119Q01j5708n237K1096p928l5669m86O748
15400b5768k954q432J0539J7875O283O927n318J694p275n282J7164J5609j5957
15387E105j1678j1289j339R983K8213J5051k9231p104J4059p902J398j4910n478
15374a5122r67J5261J5036p896j6819k0675P976j3734o796L0031K1127o227j3106
15361a1911R516n193n5508q345P781J8737k8254k392J0540l28K4876K6927K0129
$$ plain form
15452 -31326 -44631 -43579 -6425 14420 3498 -4932 9561 2249 -9562 14992 11676 -1382
15440 -1382 -10618 16089 14214 4197 5132 9621 12650 15450 2981 -1218 -11600 -9030 -39428 -45910
15426 -45910 -49409 -17528 11477 8737 227 -27555 -52809 -45738 -49664 -44430 -57933 -50595 -7389
15413 -7389 -11568 -33490 -55076 -29504 10615 11416 -4292 -9529 11567 3639 -32030 -32516 -25768
15400 -25768 -28722 -37154 -26615 -8740 -2457 4470 -848 846 -6429 -11711 5453 21062 5105
15387 5105 -6573 -17862 -19201 -9218 18995 34046 4815 -2289 11770 3868 5266 -9644 -15122
15374 -15122 -16089 -828 14208 6312 -10507 -31182 -23206 -36940 -43736 -13705 7422 1195 -11911
15361 -11911 -2395 -7588 -63096 -71441 -63660 -44923 -73177 -75569 -65029 -65357 -40481 -13554 6575
15348F575k2590o505L6451p797j6721n69J7245J6783J8777k8738k4840j4271J6352
15335i848j8244m404K0547k2054n0405J6307J6527K5350K5378J4539j3515o891
15323f713K1052L7446L084j663m876K409J7216p137m1387l3840m0386j6434J2457
15310e8772P288j8856r868N5404O382J3139l198m8419R755K4063l413o942M0177
15297F740R032l0097J1888J3120J4687Q278q248l200J5493o435l0956l6758J757
15284c4699J1131L368L2840L565j8840o86L552k0638M213J6561K8102p346J2076
15271C3199j3395j4833j3268P879J4277J8447l0836l9522m034J1118l269J7173
15259a7064J5913k141l9250n716j3890J1249P705l0400J0026O7J0498J7019M0033
$$ plain form
15348 6575 -16015 -22520 13931 6134 -10587 -11156 6089 22872 41649 12911 -11929 -26200 -9848
15335 -9848 -28092 -32496 -11949 -34003 -84408 -68101 -51574 -26224 -846 13693 178 -6713
15323 -6713 14339 51785 54869 53206 48330 50739 67955 60818 19431 -14409 -54795 -71229 -58772
15310 -58772 -51484 -70340 -80208 -24804 -18422 -5283 -8481 -56900 -47145 -23082 -26495 -33437 6740
15297 6740 15772 -14325 -2437 10683 25370 33648 25400 22200 37693 31258 302 -36456 -34699
15284 -34699 -23568 -20200 12640 16205 -2635 -3321 231 -20407 -16194 367 28469 21123 33199
15271 33199 19804 4971 -8297 -418 13859 32306 1470 -38052 -42086 -30968 -34237 -17064
15259 -17064 -1151 -3292 -42542 -48258 -62148 -50899 -43194 -73594 -63568 -63501 -53003 -35984 4049
15246D049J704l6090k4246j3449L6139N558k5661m476L6703L0580J0718p783j4631
15233h85N148J9921N261M582j4156k7167k5334J0891j9177j5897L1252R554R932
15220f075J5773l64j1825l3047M501K5271K9169k8591j3595J1366K983L0087l70
15207B5283j7597l0476k7684J8355M2896K6215l4724k1936k636R311J559j2625
15195b4059k2590J1610J0549O191j0011j8740L1525N7964m222l5143j0456j6648
15183b4030k6958k320J8870K6505L3063M472q217m1748j072J8423k5003M500n
15170b3520L1222J7841l2071p416r231j117K1506R719k5665q37K7869J8669k0383
15157F586j4022J4090Q099J5071j1735j1793j2349k013j810J0289k9066k4063
$$ plain form
15246 4049 5753 -30337 -54583 -68032 -31893 -26335 -51996 -56472 -19769 10811 21529 13746 -885
15233 -885 4263 24184 29445 34027 19871 -7296 -32630 -21739 -40916 -56813 -25561 -16007 -6075
15220 -6075 9698 9334 -2491 -35538 -31037 -5766 23403 -5188 -18783 -7417 -4434 25653 25283
15207 25283 7686 -22790 -50474 -32119 10777 36992 2268 -19668 -22304 -12993 -11434 -24059
15195 -24059 -46649 -35039 -24490 -18299 -28310 -47050 -15525 42439 38217 3074 -7382 -24030
15183 -24030 -50988 -53308 -34438 -7933 25130 29602 21385 -20363 -21435 -3012 -28015 -23515 -23520
15170 -23520 7702 25543 -6528 -13944 -23175 -24292 -2786 6933 -18732 -19569 8300 26969 6586
15157 6586 -7436 6654 14753 29824 18089 6296 -6053 -8066 -9876 413 -28653 -52716
15145e2716J7233L5478k690l233n433p917K7479K7040q639J5801j5604j2250k400
15132A2149o866m9263Q210J6612j9028O055R221K79L971j4674J6132j9416j3213
15119d9831J8672K1521j0695J2542n604q108K8830J3535r761l3127k3020J0563
15107c4483N70J1746k0932Q838J134N79L0445j8739k7945L505J1177J2746j1372
15094c2731q43J6988M3242L976Q63m50L564R279j158k5747j3667k0869j2613J5452
15080a4714k59j7002J0875M818r34k9521Q833j065j8988q361o780J8630K6568
15067b7900K2640P619j581J9586n109l2490j4700L0519L290p552j5544k0275k4361
15054f5858P135Q884Q646J1709L792r915J1830O78J852J4824L1763K3766l4119
$$ plain form
15145 -52716 -35483 -5 -2695 -5928 -11361 -19278 8201 35241 26602 42403 26799 14549 12149
15132 12149 5283 -43980 -35770 -19158 -38186 -32131 -22910 -22631 -18660 -33334 -17202 -36618 -49831
15119 -49831 -31159 -9638 -20333 -7791 -13395 -21503 7327 20862 11101 -22026 -45046 -34483
15107 -34483 -33913 -22167 -43099 -34261 -33127 -32548 -2103 -20842 -48787 -45282 -34105 -21359 -32731
15094 -32731 -33574 -16586 26656 30632 31495 31045 34609 43888 42730 16983 3316 -17553 -30166 -14714
15080 -14714 -14973 -31975 -21100 -16282 -17216 -46737 -37904 -38969 -57957 -66318 -73098 -54468 -27900
15067 -27900 -5260 2359 778 20364 15255 -17235 -31935 -1416 1874 -5678 -21222 -41497 -65858
15054 -65858 -58723 -49839 -41193 -29484 -25692 -35607 -23777 -23099 -21247 -6423 25340 49106 14987
15041A4987j3421k776O613J7606K9488J490j4031O114K069k8217k215l573r432
15028D702j0870k1092j5930J0634R857L8002J1315J053p025m455n953n67r668
15015Cq942O591P324R520j8883k6239J0479r757k3204O746M6628L7324J7404k6714
15001B8280n5812j388K7510j5398K5551J5586j476m522j3634m0216j8676J8306
14989c5889l690M000N544j1998R202K5978J1396j567J5199j7446m8506j4626K3765
14976c8638Q276n028O765l371J1229j5083j7572J1759j8910r145K350J4616l9271
14963i2023K1695K9833K6862j1804J2187J3338J6537m570J1143O891Q323K5109
14951F3521r281p616j9107j0736j3405k4450R501N250K0450k7984j5240l228q848
$$ plain form
15041 14987 1566 -1210 5403 23009 52497 53987 39956 46070 48139 19922 17707 14134 4702
15028 4702 -6168 -27260 -43190 -32556 -22699 15303 26618 27671 20646 16191 10238 9671 3
15015 3 -8939 -2348 4976 14496 -4387 -30626 -20147 -29904 -53108 -46362 266 37590 54994 28280
15001 28280 -27532 -28920 -1410 -16808 8743 24329 22853 18331 4697 -35519 -54195 -35889
14989 -35889 -39579 -35579 -30035 -42033 -32831 -6853 4543 2976 18175 729 -47777 -62403 -38638
14976 -38638 -30362 -35390 -28625 -31996 -20767 -35850 -53422 -41663 -60573 -69718 -67368 -52752 -92023
14963 -92023 -70328 -40495 -13633 -25437 -13250 88 16625 12055 23198 30089 38412 63521
14951 63521 54240 46624 27517 16781 3376 -21074 -11573 -6323 14127 -13857 -29097 -32325 -41173
14938d1173l635K6474L5902q313Q250l0063j0306K8389j6233Q214J9279J194N800
14925B3779n677j7767l1126J307R322K5754j2036j8685K0047K2628J02k7417j2656
14912b2425K304j084K9864L1136J1213M70j3005j7802q451Q59j812m152j0240
14899c125J2865J3311q019j068l2161p573J5670P880Q009R832p109n834l5488
14886c2810R366l738R4j2765J3023L877L846K0218J5287R448l3651l743L528j1915
14872a9935K635j0637q649J1640l795j0115k6448k445J654J8450K1253r080O76
14859c4796J5382o019P319q092k4058R657M342L488k370M807J9387r715j2979
14846c3647J933J6790J4410l5350j0220l5032N7Q990L6645K1291j7020m4517O374
$$ plain form
14938 -41173 -44808 -18334 17568 9255 17505 -12558 -22864 5525 -10708 -2494 16785 17979 23779
14925 23779 18102 335 -30791 -29484 -20162 5592 -6444 -25129 -5082 17546 17648 -9769 -22425
14912 -22425 -20121 -21205 8659 39795 51008 51478 38473 20671 12220 13079 11267 7115 -3125
14899 -3125 9740 23051 15032 13964 -18197 -25770 -10100 -2220 5789 15621 8512 2678 -32810
14886 -32810 -23444 -27182 -27088 -39853 -26830 -22953 -19107 1111 16398 25846 -7805 -11548 -8020 -19935
14872 -19935 -17300 -27937 -36586 -24946 -28741 -38856 -65304 -67749 -66095 -47645 -26392 -35472 -34796
14859 -34796 -19414 -25433 -18114 -26206 -50264 -40607 -36265 -32777 -35147 -30340 -10953 -20668 -33647
14846 -33647 -31714 -14924 -514 -35864 -46084 -81116 -81059 -72069 -35424 -14133 -31153 -75670 -69296
14833f9296M4774j161p718J3638m270N978J2057L942j5128k3462J4827p40J8072
14820h487r085j408n136j8180r953L5499K7331k7095l7134J0515J3959J7697k1427
14807c2904P779l550J8068k2976k2295P183L3579j5050J2767M05k8764k833O744
14794d1847l8847K8194L7056r784r512J1204k4681k155J852N02O34J470J4081
14781c1833l224P840M571m0607N749K7255J8964l2940J2183K9468P752Q777K7568
14768D1523K6852k6838m918l2714m5927r815J6101L119o376M2675K8136l9716
14756g898m554K0817j170p628o794n702K3212K2181r307j6318j7328K2915M013
14743A6439J774J5484K601k2053J4181Q311j4808o3021j3248m436M70L0540K612
$$ plain form
14833 -69296 -24522 -25683 -33401 -19763 -24033 -18055 -5998 -2056 -17184 -40646 -25819 -26559 -8487
14820 -8487 -17572 -18980 -24116 -42296 -52249 -16750 10581 -16514 -53648 -43133 -29174 -11477 -32904
14807 -32904 -25125 -28675 -10607 -33583 -55878 -48695 -15116 -30166 -17399 -16994 -45758 -48591 -41847
14794 -41847 -80694 -52500 -15444 -25228 -34740 -23536 -48217 -50372 -48520 -48018 -47384 -45914 -31833
14781 -31833 -35057 -27217 -22646 -63253 -57504 -30249 -11285 -44225 -32042 -2574 5178 13955 41523
14768 41523 68375 41537 36619 3905 -42022 -51837 -35736 -32617 -38993 3682 31818 -7898
14756 -7898 -12452 8365 7195 -433 -7227 -12929 10283 32464 23157 6839 -10489 12426 16439
14743 16439 18213 33697 36298 14245 28426 36737 21929 -41092 -54340 -58776 -58306 -27766 -25154
14730b5154m706J9048j1845k0399j065N160K5420Q100j5351l0435l9864R317K6528
14717e5246O049R858K9789K6460M375m00k1732l2358K9086J7093J8006o767K0071
14704D4284l1827n884J3862o596J7272M562j279j244J35j8548l1691L828k0685
14691c3811j847K0197K1780J612R588j6662j4352o391M3601J4767j7093k4757
14679c368k5990k2365L5546J7861q986j0335Q868p828m1011r732J7420K0255J0117
14666a9548m689l779K2617j271r561k7774J0855J8258l849m984J8049P915j2010
14653i771j9073r248K1437n359L161J3222J6306J7048P635j3863j2322j2451K5718
14640B2440J5372M317p718M16j7931j0452r687j0476M067o704j2444R782J4698
$$ plain form
14730 -25154 -29860 -10812 -22657 -43056 -44121 -38961 -13541 -5441 -20792 -51227 -91091 -81774 -55246
14717 -55246 -49197 -39339 -9550 16910 21285 20885 -847 -33205 -4119 12974 30980 24213 44284
14704 44284 12457 6573 20435 13839 31111 35673 34394 33150 33285 14737 -16954 -13126 -33811
14691 -33811 -35658 -15461 6319 7931 17519 857 -13495 -19886 23715 38482 21389 -3368
14679 -3368 -29358 -51723 -16177 1684 -7302 -17637 -8769 -16597 -57608 -67340 -49920 -29665 -19548
14666 -19548 -24237 -28016 -5399 -6670 -16231 -44005 -33150 -14892 -18741 -23725 -5676 2239 -9771
14653 -9771 -28844 -38092 -16655 -22014 -18853 -5631 10675 27723 35358 21495 9173 -3278 22440
14640 22440 37812 42129 34411 34827 16896 6444 -3243 -13719 -9652 -16356 -28800 -19018 -4320
14627d320K7907nk6361L0853O183l0903o024J0870o041j8444j4905M861J6451
14614i878M867j8201j1252J2663K178l935n994M750J5808L3093J1110j1033l582
14601B0594k7678j0115j15q179l2746l6127l947M0645m663j7621M5437L5025j5698
14588a5188p126N0161M840r795j6316k0440j5189j3190l1341R232K5013K1172
14576a8167j1022Q442p580j0611M4168L3274K5325j2528l4144r85p372j6561m690
14563a2451M2638P147l1582l6565O259J0922K9383J0151K6449k1392m2064n216
14551a6321J0285n180q148J3851L1031L0254o504k9802o799j0397k3815k2466
14539d4011j6448M5873K0501j1805j6749Q847K726J8510L7427m453k4934j2717
$$ plain form
14627 -4320 23587 23582 -2779 28074 34257 3354 -2670 8200 2159 -16285 -31190 -26329 -9878
14614 -9878 -5011 -23212 -34464 -21801 -19623 -23558 -29552 -24802 -8994 24099 35209 24176 20594
14601 20594 -7084 -17199 -17314 -25493 -58239 -94366 -98313 -57668 -62331 -79952 -34515 510 -15188
14588 -15188 -22314 27847 32687 22892 6576 -13864 -29053 -42243 -73584 -64352 -39339 -18167
14576 -18167 -29189 -20747 -28327 -38938 5230 38504 63829 51301 17157 16172 8800 -7761 -12451
14563 -12451 30187 37334 5752 -30813 -24554 -13632 15751 25902 52351 30959 -11105 -16321
14551 -16321 -6036 -11216 -19364 -5513 25518 55772 49268 19466 12667 2270 -21545 -44011
14539 -44011 -60459 -14586 5915 -5890 -22639 -13792 -11066 7444 44871 40418 15484 2767
14527B767R290j3394J042J1056J1951L5327M66n1250j4226j3947k2606J5848K1469
14514f207J2371j1964j2598k4351k1603k040L383J9208L2075O284n156J3392L6468
14501C9262k2527m5903j4537L3355N425K5284R591k6426q262j4605m8203J4983
14489e2563o723J8681K1107J464J0405J8289p662j9107r991r497L842J8314P106
14476f335j558l352r505J542J0656L861L133R590m273j7976P144K5308j8126j8847
14462a8738k3301j6734L0716L0012L595k5288j8286N517j2121m363K3478L7057
14450A1544L4697N101j643l0382l095J4253K7172k5285m0982k6057K465K4288
14438g924J2964j7743j1816l617L3996N228l2192P904M3117J7701j0092P792m3102
$$ plain form
14527 2767 12057 -1337 -295 10761 22712 58039 58505 7255 -6971 -20918 -43524 -27676 -6207
14514 -6207 6164 -5800 -18398 -42749 -64352 -66392 -63009 -43801 -11726 -5442 -10598 2794 39262
14501 39262 16735 -29168 -43705 -10350 -4925 20359 29950 3524 -4738 -19343 -67546 -52563
14489 -52563 -59286 -40605 -19498 -18034 -7629 10660 2998 -16109 -26100 -35597 -31755 -13441 -6335
14476 -6335 -7893 -11245 -20750 -19208 -8552 -4691 -1558 8032 3759 -14217 -7073 18235 109 -18738
14462 -18738 -42039 -58773 -28057 1955 5550 -19738 -38024 -32507 -44628 -48991 -25513 11544
14450 11544 46241 51342 49699 19317 16222 30475 57647 32362 -8620 -34677 -32212 -7924
14438 -7924 5040 -12703 -24519 -28136 5860 11088 -21104 -13200 29917 47618 37526 45318 2216
14425B216L360Q586J169K6024J9856m3663l6862m887J1620N731k180J1584k181
14412C73n189j4938K63N587r04K539q290N751k370J3206J9292p183j666j8603
14398a2132j9059k6538Q171J4302L0973p554k984O386o3l3946j672J9201J4808
14385a0107J9470j0224l5048j1954K648j4991N602J230L3943L5109J8661k4345
14373I994k2265O354J4430K4583j4205m928l681J9798p681p897N943k3269M963
14360B139o250k8825J6073o120J0850m531j1967m148K8809L1730J4540k251N22
14347D0571j4596o469m465P27O829p389m6624k6279J089J3446K4665L717j4100
14334b8878Q725K3247j5125j7702N136J2812L621j4872l847L5651L5967l423P973
$$ plain form
14425 2216 5576 14162 15331 41355 61211 17548 -19314 -24201 -12581 -6850 -9030 2554 373
14412 373 -4816 -19754 -19491 -13904 -14808 -12269 -20559 -14808 -17178 -3972 15320 8137 6471 -12132
14398 -12132 -31191 -57729 -49558 -35256 -4283 -11837 -14821 -8435 -8498 -42444 -44116 -24915 -10107
14385 -10107 9363 -861 -35909 -47863 -45215 -60206 -54604 -53374 -19431 15678 34339 9994
14373 9994 -12271 -5917 8513 33096 18891 13963 10282 30080 22399 14502 20445 -2824 2139
14360 2139 -4111 -32936 -16863 -22983 -12133 -16664 -28631 -32779 -3970 27760 42300 40049 40571
14347 40571 25975 19506 15041 15768 22597 15208 -31416 -57695 -56606 -43160 -18495 -14778 -28878
14334 -28878 -20153 3094 -12031 -29733 -24597 -11785 -8164 -23036 -26883 8768 44735 41312 49285
14321D9285O61j5217k6672j5468J5157K0498l052j5909P00o515J4307k5724P031
14308i18r418n28n939l667K3585K8453k3737n331m545k186j3827l046k1030O082
14294c6052K2236k0144l910j1593L1317L8595J2876K702k8225j6701J935M353
14282b611l5516j6046N112j9919K4088P5890J3184M00j3783q167m5808P877J6622
14269A323j1376l1654m821J0305j0002K4183k62k4666J1776K5786J5332k254N355
14256I025N500j4068M5051J3502p348k6046k2877j797J397j7009J7880K2673L919
14243B9802j1134K854J3003m863j8701L96k7982j4346K2939M9754K9145j3975
14231E6892o773k2954j8323k088k0185p727j2646j9534j3778J4431L0273K5917
$$ plain form
14321 49285 49946 34729 8057 -7411 7746 28244 25192 9283 9983 3468 17775 -7949 -918
14308 -918 -10336 -10864 -16803 -20470 3115 31568 7831 2500 -2045 -4231 -18058 -21104 -42134 -36052
14294 -36052 -13816 -33960 -37870 -49463 -18146 20449 33325 36027 7802 -8899 -6964 -2611
14282 -2611 -38127 -54173 -49061 -68980 -44892 30998 44182 44582 30799 22632 -23176 -15299 1323
14269 1323 -10053 -41707 -46528 -36223 -46225 -22042 -22304 -46970 -35194 -9408 5924 3670 9025
14256 9025 14525 457 45508 59010 51662 25616 2739 942 2339 -14670 3210 25883 29802
14243 29802 18668 21522 34525 29662 10961 11357 -16625 -30971 -8032 41722 70867 56892
14231 56892 50119 27165 8842 6754 -13431 -21158 -33804 -53338 -67116 -52685 -22412 3505
14219C505J6097j0168M686K138K719j2448p95O604j3357k2698M541L6533M909
14206B2266o825j9698r052n26M987N8606K5462m1147k3502j0889J6961n0558p351
14193d1266J8832J2822o579K715r271n696J8541q822R925N097Q927J6136j5927
14180E434k978J358M0435l923j0942J424j6253k2484l3322l895K5017m766M5941
14167B1046o070k9620n393J1151L2236J500p82p495J4498L0798o959m6463l3770
14154b5323K3525J0004N601L0211J4492N721k7496m1799j8626K2159K439N327
14142F235J687l963j4257j3896K1202J2510R021q337j7041L4019k191j4717l351
14129F921L158k924K0375K1746l5819j2787j4851P716K1553j4795j3720J4009
$$ plain form
14219 3505 19602 9434 14120 16258 18977 6529 5734 12338 -1019 -23717 -19176 17357 22266
14206 22266 15441 -4257 -13309 -13835 -8848 49758 75220 34073 10571 -318 16643 -33915 -41266
14193 -41266 -22434 -9612 -16191 -13476 -22747 -28443 -9902 -18724 -8799 -3702 5225 21361 5434
14180 5434 2456 3814 44249 40326 29384 30808 14555 -7929 -41251 -45146 -20129 -24895 21046
14167 21046 14976 -14644 -20037 -8886 23350 24850 24068 16573 31071 61869 54910 8447 -25323
14154 -25323 -1798 8206 13807 44018 58510 64231 36735 -5064 -23690 -1531 908 6235
14142 6235 7922 3959 -10298 -24194 -2992 9518 18539 10202 -6839 27180 24989 10272 6921
14129 6921 10079 7155 27530 49276 13457 670 -14181 -6465 15088 293 -13427 582
14117E82j8138k1184K0923J7892n999k491j980J1031j686l2075r84L3417l416
14104d108J7413K6480j6128k7283k5096j2104M3851o337O99J0438K1555K1603
14092E0983m0979j9582k61j4429K904M5846J5985J6559l1950l8098P937J5513
14080A0428J1305J3604L753J6252j7319n6374j7065j959R612r013j172J8979J567
14067a7402l129R66r276J8126L9749p805j6569j3586j2612R045P66J2760j474
14054d41j2191L1895K2879j4105r007L76J3793K5199M002j3861j1560o661j2557
14041A7761j3144P508R377p354J2176J3447j4047j5805K1050J5852J0105k5179
14029C1747l0240P549M745j4665m615j98k1480K0782K6231K7413O848k6401k4559
$$ plain form
14117 582 -17556 -38740 -17817 75 -5924 -8415 -10395 636 -1050 -33125 -34109 -692 -4108
14104 -4108 13305 39785 23657 -3626 -28722 -40826 3025 -3312 -2613 7825 29380 50983
14092 50983 10004 -9578 -9839 -24268 -21364 24482 40467 57026 25076 -13022 -5085 10428
14080 10428 21733 35337 39090 55342 38023 -18351 -35416 -37375 -27763 -36776 -37948 -18969 -17402
14067 -17402 -20531 -19565 -28841 -10715 29034 21229 4660 -8926 -21538 -12493 -11727 1033 -441
14054 -441 -12632 19263 42142 28037 19030 19406 33199 58398 62400 48539 36979 30318 17761
14041 17761 4617 12125 21502 14148 26324 39771 25724 9919 30969 46821 56926 31747
14029 31747 1507 9056 13801 -864 -5479 -5677 -27157 -6375 19856 47269 54117 27716 3157
14016C157K1328J3924j8885J844k8257J6837J2895r514M809n423k338q150L7334
14003C9561K5122n781j0138l3841k150o70j493l144j0614j3075Q253P88J8666
13990A1484j6653J0316J6050m655K0100k965L2860J8541j73n647q76Q390N045
13977I1817l0677n1565M509K8764K6326j6805p603J31J1964K1633m888J2604P415
13964I3625j809L388k039J6008J7903L6498K0996K9918J119J0109M9946K0636
13952B96298M7181O1900N8801M1978P9129R8707J17870J17260J18783J37743J49329
13941A324979J33877J10220N3798L120K6814k3153j8190j8845p9332q4703q2500
13930A346085q7846r8993j42826j40588j26354j02016r3091r7289o1653m3188
$$ plain form
14016 3157 24485 38409 19524 21368 -6889 9948 22843 13329 18138 12715 10377 2227 39561
14003 39561 64683 58902 48764 14923 12773 12103 10610 7466 -3148 -16223 -7970 -7182 11484
13990 11484 -5169 5147 21197 16542 36642 33677 66537 85078 84905 79258 78382 86772 91817
13977 91817 61140 9575 14084 42848 69174 52369 44766 44897 56861 78494 73606 86210 93625
13964 93625 91816 95204 93165 109173 127076 163574 184570 214488 215607 225716 275662 296298
13952 296298 343479 405379 464180 506158 585287 683994 801864 919124 1037907 1175650 1324979
13941 1324979 1458856 1569076 1622874 1625994 1652808 1629655 1611465 1592620 1513288 1428585 1346085
13930 1346085 1258239 1159246 1016420 875832 749478 647462 554371 457082 395429 352241
13920C52241l6178k6253l7466m2129J0137J4552l3490k5401j8544q69J0197j478
13908A65319J8144J6453k5396l9165m4770k9526j845J2424k4619o06J5385O400
13896F8198R112k8845j4744m040K1009Q885L572q54K7224j1589J1874l936k5041
13883F0825r605q630Q700j582j1729J1801J1984r102j8939K0880J979k7644k5576
13870C362j6984j4473K0389K0327R840J8695p278j5661j0112j3264o924P081L7425
13857C2423j7955l0914K5797j7897j0919n787k68M0383R244j3110k4546j0306
13845b3855k0127J345K0886J8793J0394j2949R412J7076J3244R628j358k0751
13833B1738j1961K5419K0096j049K4312j2836j9209q575l3326j3187k7451k1827
$$ plain form
13920 352241 316063 289810 252344 210215 220352 234904 201414 176013 157469 156600 166797 165319
13908 165319 183463 199916 174520 135355 90585 61059 59214 71638 47019 46413 61798 68198
13896 68198 77310 48465 33721 29681 50690 59575 63147 62293 89517 77928 89802 85866 60825
13883 60825 51220 42590 51290 49708 37979 49780 61764 52662 33723 54603 56582 28938 3362
13870 3362 -13622 -28095 -7706 12621 22461 41156 33878 18217 8105 -5159 -12083 -5002 32423
13857 32423 14468 -16446 9351 -8546 -19465 -25252 -25520 14863 24107 10997 -13549 -23855
13845 -23855 -43982 -42637 -21751 -2958 7436 -5513 3899 20975 34219 43847 42489 21738
13833 21738 9777 35196 55292 54243 78555 65719 46510 37935 4609 -8578 -36029 -57856
13821e7856J4908o613m116K2174J1567Q698l028j4686N72n889j818J9053Q467
13808h567L1284k092Q365k1269k2010j7128j0974J1550L06Q135M0480J9552K0894
13795E8526j2869j15N021j0061k798k6777k0019J5304L2633p484J0000j885j9484
13782A9992k5942p24J7448K7690j4700j2694K7768K7016M931P466l4876m361J1097
13769E0111O387j2648k2591j0766J689m091K8549J1360p12j8551l679K2117j9345
13756B7830K6717L1483k7129l5536o465L709n273O964M213L251J169l414l203
13743B4316N1220M483j8183l074j1181j1898k822J9110k613j3307j7828j0487
13731G736r15P714P156k1205l863K6291Q600J6886N345J002K2493J7235j3870
$$ plain form
13821 -57856 -42948 -49561 -53677 -31503 -19936 -11238 -14266 -28952 -28380 -34269 -36087 -17034 -8567
13808 -8567 22717 20625 28990 7721 -14289 -31417 -42391 -30841 -30535 -22400 18080 37632 58526
13795 58526 45657 45542 50563 40502 37704 10927 -9092 6212 38845 31361 41361 39476 19992
13782 19992 -5950 -6674 10774 38464 23764 11070 38838 65854 70785 78251 43375 39014 50111
13769 50111 56498 43850 21259 10493 12182 8091 36640 48000 47288 28737 25058 47175 27830
13756 27830 54547 86030 58901 23365 16900 20609 15336 22300 26513 29764 30933 27519 24316
13743 24316 75536 80019 61836 58762 47581 35683 32861 51971 49358 36051 18223 7736
13731 7736 6821 14535 21691 486 -3377 22914 31514 48400 53745 54747 77240 94475 80605
13718H0605Q888J7374p175k0084k2515k99O364l5835L589L4846K7467p322j0333
13705G5570n738r130j155K655J0724J874L809k5080l4474J0145K7188j6668J6290
13692E6010P447o640J3828J227K5371L0248j4556j9779J5790j4878l808l0847
13680E9413l8577J9000J9182k3445J0023q60J4666Q574j539k8932K5M921p880
13667C4571j251M2337J2806j2558J0234J3233J4378J571J1443m0086j2530o504
13655F7644J3663J2838k5264J4657l7225j0351K6033Q791M291L915K8306M595
13643A11893j2171j061l5245j2521J0922K093o267l356N940K9322J0432M728J3575
13630A18284K657n642k510J6198k6700j875M2390J8889J518p498n2301j8857K4913
$$ plain form
13718 80605 89493 106867 99692 79608 57093 56794 63158 27323 30912 65758 93225 85903 75570
13705 75570 69832 60702 59547 62202 72926 74800 78609 53529 19055 29200 56388 39720 56010
13692 56010 63457 56817 70645 71872 97243 127491 112935 93156 108946 94068 90260 59413
13680 59413 20836 39836 59018 35573 45596 44736 59402 67976 66437 37505 37530 42451 34571
13667 34571 33320 75657 88463 75905 86139 99372 113750 115321 126764 86678 74148 67644
13655 67644 81307 94145 68881 83538 46313 35962 61995 70786 75077 78992 107298 111893
13643 111893 99722 98661 63416 50895 61817 63910 57643 54287 60227 89549 99981 104709 118284
13630 118284 120941 115299 112789 128987 102287 100412 142802 161691 163209 155711 103410 84553 109466
13617A09466K0342J1467j5182J4537P477j0989p76K1876o999p215J5811n335K4809
13604A79289j3204j9161n883J4046K1204k5005k3717k2543R294K3822K5317K0627
13592A84086J5726Q999M978M806P056K685R439j377l844k2732m292K8112J2113
13579B45755r254j8773p601N850L7740J4284j784N394K9982J4009j2262J2819
13567C16159o809k4362L5616L6948r180N618Q684K5561m821k3278M1883M2589
13555D44608K3345L421L3253K9916J425L3318J5899J4755O847J3888N7464M1204
13543G19343M9080K8238L7562J1445M5002K8980M0940K1447N3840R2249Q2405
13532A210531N5619P3095P5656O4433J07258J37159J13260J39980J56087J48240
$$ plain form
13617 109466 129808 141275 126093 140630 148107 137118 136342 158218 151219 144004 159815 154480 179289
13604 179289 166085 146924 141041 155087 176291 151286 127569 105026 114320 138142 163459 184086
13592 184086 199812 208811 213789 218595 225651 228336 237775 236398 232554 209822 205530 233642 245755
13579 245755 236501 217728 210127 215977 253717 268001 266217 271611 301593 315602 303340 316159
13567 316159 309350 284988 320604 357552 348372 353990 362674 388235 383414 360136 402019 444608
13555 444608 467953 471374 504627 534543 535968 569286 585185 599940 606787 620675 678139 719343
13543 719343 768423 796661 834223 845668 890670 919650 960590 982037 1035877 1128126 1210531
13532 1210531 1266150 1339245 1414901 1479334 1586592 1723751 1837011 1976991 2133078 2281318
13522B281318J76230K26359K57844K35894K81760L49762M03413M23389N11329
13513E147298N30786O18433P00510Q06385Q58738R10954R58881J015007R75213
13504A2522205Q94381P48334N57110L40449J05389j64287l71955m96252n95467
13495A3539907o54195o40439o13780n54367m40782l43845k23212j45152m3197
13486I880938O1217J38422K58602L18492L93093M55253N39017N28749M68547M13265
13476A3455595K92847R4317j12152l03069m37501o17401p47121q46634q91845
13467I887036q44540p84499p44154o85059o42829n52876m84750m49096m11367
13458D287866l70544k92021k44685k38998k29940k08992j52318j69634j56157
$$ plain form
13522 2281318 2457548 2683907 2941751 3177645 3459405 3809167 4212580 4635969 5147298
13513 5147298 5678084 6296517 6997027 7803412 8662150 9573104 10531985 11546992 12522205
13504 12522205 13416586 14164920 14722030 15062479 15167868 15003581 14631626 14135374 13539907
13495 13539907 12885712 12245273 11631493 11077126 10636344 10292499 10069287 9924135 9880938
13486 9880938 9942155 10080577 10339179 10657671 11050764 11506017 12045034 12573783 13042330 13455595
13476 13455595 13748442 13842759 13730607 13427538 12990037 12372636 11625515 10778881 9887036
13467 9887036 9042496 8257997 7513843 6828784 6185955 5633079 5148329 4699233 4287866
13458 4287866 3917322 3625301 3380616 3141618 2911678 2702686 2550368 2380734 2224577
13449B224577j20768j32491j09454j36818j03687o9701o8769p3546q3418n9594
13439A266331o5422o0471j2825k3392m7174l2171n4792m5951j9860l5596l1891
13428H36786l8683j4636m0931o0705m0644J9815k2570n8194l4983p008j581N818
13416E42484J1611N903k9992k4845J616o172m5422l1833j3j3666J772P211P494
13403D26148j6492m2101o2612p97Q92J9257J4877N09j0432p453l258o890k5325
13390B86323r817K4217j7312n1364p86q950q23j0336k4737N497n33p917J4734
13377A98196r429J4145p156p0294N899K4329L0035K7938l649k8031l5214k071
13365A44698R229q927j3137J5530J9010j979j4248j3542j1183Q38R451J1753j2768
$$ plain form
13449 2224577 2103809 1971318 1861864 1725046 1621359 1551658 1482889 1409343 1325925 1266331
13439 1266331 1200909 1140438 1127613 1104221 1057047 1024876 970084 924133 904273 868677 836786
13428 836786 798103 783467 742536 681831 641187 661002 638432 580238 545255 538247 536666 542484
13416 542484 554095 559998 530006 505161 506777 500605 455183 423350 423337 409671 411443 418654 426148
13403 426148 409656 367555 304943 304146 305038 324295 339172 339681 329249 321796 318538 311648 286323
13390 286323 276506 300723 283411 232047 231261 222311 221488 211152 186415 191912 191379 183462 198196
13377 198196 188767 202912 195756 125462 131361 155690 185725 213663 210014 181983 146769 144698
13365 144698 153927 145000 131863 147393 166403 164424 150176 136634 125451 126289 135740 147493 134725
13352A34725n43j7101o272L960k4415L961K5814K2212j330K5917R139q86j4329
13339A60852k266p274k5067Q618O405p952N618j1618j8120J4793J2745L17j8082
13326A18969j2780k7767o964n680J1954K2941q958K381k1318k613J0285l391j3487
13313F3572n269O643k058J0178J4218j2429J0953L640j1503m045k75j294M739
13300G7070L8511K5750m2376j1520P242P667J3064k8048k8077M274K6587K6269
13288A16413l446L3722j5533l3716m5796L761K1437K083r149j3283p364j4407
13276C4722m787K494j3584L5863j0823L0327J1167O238l313k0599k6879M702J762
13263D7290N966k090P136p305l120J4015J9233K1427K0856k8249m4590o033K0183
$$ plain form
13352 134725 134182 117081 110809 114769 90354 94315 120129 142341 141011 166928 176067 175181 160852
13339 160852 158586 151312 126245 134863 141268 133316 138934 127316 109196 123989 136734 137051 118969
13326 118969 106189 78422 71458 65778 77732 100673 91715 94096 72778 70165 80450 77059 63572
13313 63572 58303 64946 62888 73066 87284 74855 85808 89448 77945 73900 73625 72331 77070
13300 77070 115581 141331 98955 87435 94677 102344 115408 87360 59283 63557 90144 116413
13288 116413 112967 146689 131156 97440 51644 55405 76842 78925 69776 56493 49129 34722
13276 34722 29935 32429 18845 54708 43885 74212 85379 91617 88304 67705 40826 45528 47290
13263 47290 53256 51166 58302 50997 47877 61892 81125 102552 123408 95159 50569 44536 64719
13250F4719M558N837K113m0387j5476J801p504j0953Q991N4092K2499j6017j7069
13237E7204N167j722l732n331l866K0037J1834p197n894j7401m2017l127r519
13224e564L4402K6824J949j1158J5585j9506j8859O877J052k54K7702P147j7884
13211D8313R944J078j887j0123l4685m73J6211j2331j0864N99L6941K6214j7407
13198E1530k7819k3074k924RM96P098J9993K0403k6748k5393J9662J4283L1306
13185E8822j242J824q12k1848j0531L4928J3841k9956k5743M179J1502j3402o825
13172A4737J7444R427q160q248L048J3773j4323J3815J4421k142j9556n129j6295
13159A2812j421k5262M548K4466l549J3630M0780L3531j9909l2957j5374K5874
$$ plain form
13250 64719 69277 75114 77227 36840 21364 23165 15661 4708 13699 67791 90290 74273 57204
13237 57204 62371 60649 56917 51586 47720 67757 79591 72394 66500 49099 7082 3955 -5564
13224 -5564 28838 55662 57611 46453 62038 42532 23673 30550 31602 31348 59050 66197 48313
13211 48313 58257 59335 57448 47325 12640 12167 28378 16047 5183 5782 42723 68937 51530
13198 51530 23711 637 -2287 -2278 -1782 5316 25309 45712 18964 -6429 13233 27516 58822
13185 58822 57580 59404 58592 36744 26213 61141 74982 45026 19283 23462 34964 21562 14737
13172 14737 32181 41608 33448 25200 28248 42021 27698 41513 55934 53792 34236 29107 12812
13159 12812 11391 -13871 -9323 15143 11594 25224 66004 99535 79626 46669 31295 57169
13147E7169N789p807m5945j346J2655N21m0897k8260K3130L8541N826Q636L7788
13134F5800K1048k1045p332J6085k0682J1818K0638J0789Q728O084K0478K4962
13122A57371L3308l396Q160L9396K4564K7318M8315K0913N8652Q8718P2926J01202
13110F77447J74856K32325K86551L43246L62648L54691K73638J62531k747j91698
13100B673488l22984l85810l23304l33536k44911k03146j32775r1364j00936r0477
13090D44245m9631n9021j3413j2558n3616l0665p039j0189n5134m7431m424K3285
13078A24409M005r688K1397Q57l4753k8872q032J8396j620q813o917K2717J7547
13065A10633K1677r938l5112j6096k147p81j5181J9013j832Q988l886j1981p866
$$ plain form
13147 57169 62958 55151 9206 7860 20515 21036 -19861 -48121 -24991 13550 19376 28012 65800
13134 65800 86848 65803 58471 74556 53874 65692 86330 97119 105847 111931 132409 157371
13122 157371 190679 187283 195443 234839 259403 286721 335036 355949 414601 503319 576245 677447
13110 677447 852303 1084628 1371179 1714425 2077073 2431764 2705402 2867933 2865186 2673488
13100 2673488 2350504 1964694 1641390 1307854 1062943 859797 727022 635658 534722 444245
13090 444245 394614 335593 322180 309622 256006 225341 218302 208113 152979 105548 101124 124409
13078 124409 128414 118726 140123 140980 106227 77355 69323 87719 86099 77286 70369 93086 110633
13065 110633 132310 122372 87260 71164 69017 68236 53055 72068 70236 79224 75338 63357 55491
13052E5491j2591Q543n396o467k8985J4727P954j538K8264J7701l0697j8369p545
13039B1092k196J0070R234K3999J3049j4899J9099L3516K9687k152J4029L0135
13027A84663L5566J9502M996N534k3794m6455m6334j3538l384P550l0133k7653
13015F6520k590r910k6592q049M7419j0425l3183M243q363j9149L4110K0772j3664
13002D1139j2626q060O967K3484m936m443l204k2446k3809K9384J6870j2769j7126
12989H425k023J6125j1937j2419q469j1919j7553L2308N297Q641J1465j578p360
12976I003K1210j3874j6227l5124n706O0765L8068N906l4121j0996j7128q229
12964f453k196J87j6871j207K7807J4898J3397o730j8485n362j2766j9709K4043
$$ plain form
13052 55491 42900 51443 46047 39580 10595 25322 33276 31738 60002 77703 47006 28637 21092
13039 21092 18896 28966 38200 62199 75248 60349 79448 112964 142651 140499 154528 184663
13027 184663 220229 239731 244727 250261 226467 180012 133678 120140 116756 124306 94173 66520
13015 66520 63930 54020 27428 19379 66798 56373 23190 27433 19070 -79 34031 54803 41139
13002 41139 28513 20453 27420 50904 45968 41525 38321 15875 -7934 21450 38320 25551 8425
12989 8425 6402 22527 10590 -1829 -10298 -22217 -39770 -7462 -2165 6476 17941 16363 9003
12976 9003 30213 16339 112 -35012 -40718 20047 58115 64021 29900 18904 1776 -6453
12964 -6453 -8649 -8462 -25333 -26540 1267 16165 29562 22832 4347 -1015 -13781 -33490 -9447
12951i447J0233j7453J8261J7444j26P696j5466k1041Q88J7582P771n901m453
12938E988n105P92j3135n06J2303O171r788k761J8731J4863j8222k8337j783k9766
12924e0555L0095R734j1826k1909k0191o845K1548L0475K8177K79K1768k9736
12912A014l5819k9615L1851L4396Q615j1279j9011L407P061K9163r412j3918r98
12899d545l642k872K2882J2743j4201J7971J7831O019j536j1026j3446P47j5595
12886A1330m2611R407N7784R903p761k5916K195J5764j8781k1159J443K8844J6325
12873C6767k2848J2605K4534q075J1475K2252L546k2648m4629j2521p148k4335
12861c1025k6056J1794M3170J3969P674J1118L017l1528J8207J7729k00j5753
$$ plain form
12951 -9447 786 -16667 1594 19038 18912 26608 11142 -9899 -9011 8571 16342 10441 5988
12938 5988 883 1675 -11460 -11966 337 6508 -3280 -6041 12690 27553 9331 -19006 -20789 -50555
12924 -50555 -20460 -10726 -22552 -44461 -64652 -71497 -49949 -19474 8703 8982 30750 1014
12912 1014 -34805 -64420 -32569 1827 10442 -837 -19848 -16441 -9380 19783 10371 -3547 -4545
12899 -4545 -8187 -11059 11823 24566 10365 28336 46167 52186 50650 39624 26178 26925 11330
12886 11330 -31281 -21874 35910 45813 38052 12136 14331 30095 11314 -9845 -8402 20442 36767
12873 36767 13919 26524 51058 42983 54458 76710 80256 57608 12979 458 -6690 -31025
12861 -31025 -57081 -45287 -2117 11852 19526 30644 33661 2133 20340 38069 37869 22116
12849B2116l6291L7928M995k2838k8158k766R92k5J0131R219L5458L9896r896
12836F0761L652J5138j2622r094k4538k3975o832J3837Q96J3153j2293j4072N453
12823I464J6305l902j1753j3681K3938O640j8592n804k305j812Q601k5000n745
12810b3646K769q989r095J7335J0072P561L950k3209j8097K940K4605K698j2172
12797b3278O953Q840M707j3415q783j0347n051K8400K3872k4887j3286J2870j7654
12784c1059L1914o099K6132K5926K993j7070j7813P399K7026q419j8394J4768
12772C7304J1510J5902J2761o081l1971q749j6615k9173k9026K9495K5064k7529
12760a7108J194L7445K2749N4561L981o1559j1092n195j2406P010N695r939K8085
$$ plain form
12849 22116 -14175 23753 28748 5910 -22248 -25014 -24022 -24047 -13916 -4697 30761 70657 60761
12836 60761 64413 79551 66929 57835 33297 9322 2490 16327 17223 30376 18083 4011 9464
12823 9464 25769 21867 10114 -3567 20371 27011 8419 2615 310 -1502 7099 -17901 -23646
12810 -23646 -20877 -29866 -38961 -21626 -11554 -3993 -43 -23252 -41349 -38409 -13804 -11106 -23278
12797 -23278 -16325 -7485 -2778 -16193 -24976 -35323 -40374 -11974 11898 -12989 -26275 -13405 -31059
12784 -31059 855 -5244 20888 46814 49807 32737 14924 22323 49349 40930 22536 37304
12772 37304 48814 64716 77477 71396 39425 30676 14061 -15112 -44138 -14643 10421 -17108
12760 -17108 -15914 21531 44280 98841 102822 41263 30171 24976 12570 19580 25275 15336 43421
12747D3421j3521q491R436K0735L4683J5578k4438j8240K2115O358m7227l1707
12735H702r662r248K3076J4138j0982l3509j4268K3641K0346k746J7213r564N293
12722B2430R62J246L921J3498k103r04L3599J4552J3351m06J4905n108l4208k388
12708G3347o166k1773L5372J0043m0305l1526L025J2736O907p651j4828l438K4937
12695D0680j131j712K2282L821j9317L9146r486K2155M226k7591Q036j9975K9645
12682I0779M3655M634j3457k6356R041k0425k0187p455K1559J4001L3724L80l8529
12669I1364N471J9375J8655J4533j8648r565O208J8827j563j6761k270p805P681
12656A25502Q734P511R263M4622L3584K1626o53r851j547j009k0559j1757m001
$$ plain form
12747 43421 29900 21409 30845 51580 86263 101841 77403 59163 81278 87636 40409 8702
12735 8702 -960 -10208 12868 27006 16024 -17485 -31753 -8112 12234 9488 26701 17137 22430
12722 22430 23392 24638 28559 42057 39954 39050 72649 87201 100552 100146 115051 109943 75735 73347
12708 73347 67181 45408 80780 90823 50518 18992 22017 34753 41660 34009 19181 15743 40680
12695 40680 39549 37837 60119 63940 44623 83769 74283 96438 100664 73073 81109 61134 90779
12682 90779 134434 139068 125611 99255 108296 87871 67684 60229 81788 95789 129513 129893 91364
12669 91364 96835 116210 134865 149398 130750 121185 127393 146220 144657 127896 125626 117821 125502
12656 125502 134236 141747 151010 195632 229216 250842 250189 240338 238791 237782 217223 205466 201465
12643B01465q30n601K352K1601M3458N769J6872N048J1199L4422J8247K8543J4119
12630C96664K686M42k583R878O629N029M8636K9469L973K7414L9541L2831P2790
12617F73399M9286N0877N7702M5313O6228L6893N7630J13380J28769J20382J34999
12606A534858J51759J59299K07609K87406L26193L79277M47823M62161N63811
12597D520196O24250P38380R16921J181872J569203K086269K783723L733213M816356
12588B2970383O034478O941341P078754O001460L594581K26421l318317o012697
12580D3516404p238937p039532n975884m702071l538477k666366k021183j521564
12572H812390j163034r05313p00184o17516n68308m97108m18595l64184l43013
$$ plain form
12643 201465 200635 195034 197386 218987 262445 268214 285086 290134 301333 335755 354002 382545 396664
12630 396664 399350 399792 397209 407087 413716 418745 467381 496850 500823 528237 567778 600609 673399
12617 673399 722685 773562 831264 876577 942805 979698 1037328 1150708 1279477 1399859 1534858
12606 1534858 1686617 1845916 2053525 2340931 2667124 3046401 3494224 3956385 4520196
12597 4520196 5144446 5882826 6799747 7981619 9550822 11637091 14420814 18154027 22970383
12588 22970383 29004861 35946202 43024956 49026416 52620997 52847418 49529101 43516404
12580 43516404 36277467 29237935 23262051 18559980 15021503 12355137 10333954 8812390
12572 8812390 7649356 6744043 6043859 5426343 4858035 4360927 3942332 3578148 3235135
12563C235135k89309k80846k50330k27495j71939j29450j21395r0730j20866j28558
12553A424217r5086p9427m6983o6832o4144p9369o7565n6154n8748l5791k6464
12542G47654L2172K3188l6889m8413p0287m5997j4519k5675k7622k0540k8574
12531D84498l137l0052l2476q559j7238j8668j6119p026j872J0662l925j2349
12519C43739k4937p699o161q348k7539Q633K212m7079j2680r101m0714Q768K7211
12506B06305J7553J9603p470N355J1572o275k484m593l7037J070J2592j2755M10
12493B03846j3386k3041l1513k5788J7771K6217K0438J6778K407j6593M692j5037
12481A66791R095m680j4435N135J7526k3443J3701K3231n595l888o953m8648m2090
$$ plain form
12563 3235135 2945826 2664980 2414650 2187155 2015216 1885766 1764371 1673641 1552775 1424217
12553 1424217 1329131 1249704 1202721 1135889 1071745 992376 924811 868657 809909 774118 747654
12542 747654 779826 803014 766125 717712 647425 601428 586909 561234 533612 513072 484498
12531 484498 481361 451309 418833 410274 393036 374368 358249 351223 349351 360013 356088 343739
12519 343739 318802 311103 304942 296594 269055 277688 279900 232821 220141 211040 170326 179094 206305
12506 206305 223858 243461 235991 241346 252918 246643 244159 239566 202529 203599 216191 203436 203846
12493 203846 190460 167419 135906 110118 127889 154106 174544 191322 193729 177136 181828 166791
12481 166791 175886 171206 156771 161906 179432 155989 169690 192921 187326 183438 176485 127837 85747
12468H5747K2074J4854K069J8599q658l7454J2457l031L965o99j5368m4286L622
12455E3891M701j8861n944R518N927K7734L4993K4786R573q819o532j7652J3502
12442A26817J9575l021j3570j4077q632R576R654j4581Q620K035K424p861l627
12429A13332j0599j2676p122l252j5980J6712J2894n689J4316o611P07p42J2668
12416A07958q424K4098j9309k6837O311J1702j6014k4619M954L1356j3326j7695
12404F0155o570l7290k3506J0334L1530j4395j9582M680J3838J3082o172m502
12392B1602Q866K147J1660l8477l3408J0716Q490l2450L0136K9548j4501N307
12380I636L2336L733n178j0397R588J6642N185k729q252k6399j0074j711L466
$$ plain form
12468 85747 107821 122675 124744 143343 134685 97231 109688 106657 110622 109923 94555 50269 53891
12455 53891 58592 39731 33787 43305 49232 76966 111959 136745 146318 137499 130967 113315 126817
12442 126817 146392 143371 129801 115724 107092 116668 126322 111741 120361 122396 124820 116959 113332
12429 113332 102733 90057 82935 79683 63703 80415 93309 87620 101936 95325 96032 95290 107958
12416 107958 99534 123632 104323 77486 83797 95499 79485 54866 59820 91176 77850 60155
12404 60155 53585 16295 -7211 3123 34653 20258 676 5356 19194 32276 26104 21602
12392 21602 30468 32615 44275 5798 -27610 -16894 -8404 -40854 -10718 18830 4329 9636
12380 9636 41972 45705 40527 30130 39718 56360 61545 58816 50564 24165 14091 12380 15846
12367A5846r8K4007J2473K2361m98l0970j9941j019K4033q692m5155k8057r353
12354d5063O194L3782J8201K5993K9876J6231j7931m1484j5676j4875n749J831
12342h670J1663J9603P731j5669M8J7145M063K693K4726m493j2032o700J2796
12329E2904K1731J195k4088j5698j9659j6882j4678L731J6874J5117R380K4295
12317E4222J9541j6971O761J765m080L37j4873J32r086j3824k600k49J6942o827
12303C1190l947K6425r138l0893q407r07j9120j0681N652o814K7264K4534N762
12290C0920k3909M973J0107K970l045j6215j887l9213n569L0539O850L2425L9434
12277F8380M0699r033k5225n611J3845l1232k0626j7901j1889n067k4357K4923
$$ plain form
12367 15846 15748 39755 52228 74589 74091 43121 23180 22161 46194 37502 -7653 -35710 -45063
12354 -45063 -38869 -5087 13114 39107 68983 85214 67283 25799 10123 -4752 -10501 -8670
12342 -8670 2993 22596 30327 14658 14706 31851 35914 38607 63333 58840 46808 40108 52904
12329 52904 74635 75830 51742 36044 16385 -497 -15175 -11444 5430 20547 29927 54222
12317 54222 73763 56792 63553 65318 61238 61575 46702 46834 37748 23924 21324 21075 38017 31190
12303 31190 27243 53668 44530 13637 5230 4323 -14797 -25478 -19826 -26640 624 25158 30920
12290 30920 7011 11984 22091 25061 22016 5801 3914 -35299 -40868 -10329 -3479 28946 68380
12277 68380 109079 100046 74821 69210 83055 51823 31197 13296 1407 -3660 -28017 -3094
12265c094K5130j2812l559J581j9215q227j1224J2385L1166j7659j3055K629j0957
12252b6911j0734J9364j4236k1676j6749M5189N1371L0819L1049K418p551K2467
12240A04820L3693j0846K2464K1448j0936k3312j0438q464M880K1210l163j4133
12228A27223p232n494K258k0452j7442R63L710J8606L2967L1074k5868r127j9995
12215A11191k4641l262r972M160L107O707q346n152K8037K5195j5818O38j3431
12202I8413k4534K7211M1297L1476L5224Q826L1771L8152L3618K0432K7452O1566
12190D30904K1808j07643j03407n4622j0115j0930j4505j331m15L2293K4675j6423
12178A90289M776J650m1408l8032k4846J8557o344M39L2548K2453Q820J1597k0974
$$ plain form
12265 -3094 22036 9224 5665 7246 -11969 -20196 -31420 -19035 12131 -5528 -18583 -15954 -26911
12252 -26911 -37645 -18281 -32517 -54193 -70942 -25753 25618 56437 87486 89904 82353 104820
12240 104820 138513 127667 150131 171579 160643 137331 126893 118429 123309 144519 141356 127223
12228 127223 119991 114497 116755 96303 78861 79824 83534 102140 135107 166181 140313 131186 111191
12215 111191 86550 83288 73316 77476 80583 87290 78944 73792 101829 127024 111206 111844 98413
12202 98413 73879 101090 142387 173863 209087 217913 249684 287836 321454 341886 369338 430904
12190 430904 452712 345069 241662 187040 176925 165995 151490 150159 149744 182037 206712 190289
12178 190289 195065 196715 155307 117275 92429 110986 104642 105081 137629 160082 168902 180499 159525
12165A59525J019R983R540J0100l4500n7055l5297q221k2023p811M853L166j952
12152C1327J4021J2990M6285L4994J6667J7424k3456k2826J676N2048M0024M6460
12140B67634M5776J8968R593K2787K4029J6979j7452J1918j1071l0951r1512n5725
12128B10973l4579m8624j498J4960J8276R32J5617J3050j6492k7452j2508l0271
12116A02384l6793J5204m104J4435J9761J199M9612L4904q662r213J1149k1859
12104A68017r793l0060j0186k7991m050J2736m1824j613L973q668k3934n26k9946
12091c865k8992J2721k2170k1078L469K7797O5843N3284L1081L7752J5743j2399
12079A59186J4424L9927N3819R062M2754K9523K6518L4366N1759N1267M1597M9785
$$ plain form
12165 159525 160544 170527 180067 190167 155667 98612 63315 55094 33071 25260 30113 33279 31327
12152 31327 45348 58338 104623 139617 156284 173708 150252 127426 129102 181150 221174 267634
12140 267634 313410 332378 341971 364758 388787 405766 388314 400232 389161 358210 266698 210973
12128 210973 176394 127770 126272 141232 159508 160440 176057 189107 172615 145163 132655 102384
12116 102384 65591 80795 76691 91126 110887 112086 161698 196602 187940 178727 189876 168017
12104 168017 158224 128164 117978 89987 85937 98673 56849 55236 59209 50541 26607 26081 -3865
12091 -3865 -32857 -20136 -42306 -63384 -59915 -32118 33725 87009 118090 155842 171585 159186
12079 159186 173610 213537 267356 276418 319172 348695 375213 409579 461338 512605 554202 603987
12067F03987L1002L8200P829k8150l7700q1065q5574o7431j6894k4121m509k0402
12055C15172j7855l4785q826K1949K2744K4618J1072N013L2282J524J22j6822
12043C56208j4062r131j637J5547J1354P916j0859k5673m89O0569K9710n223k8748
12030C85482m420K8374M1450j4763j8392J1430L4577K8908l093N193J4033Q351
12018E17130o3K4316K7519L1377K5149J0361M646O756N61J5628J3536J9638M6685
12005G43239K8438L4115L2849N3135N2492L6701O1332K1680N1972Q8414O3864
11994A268231O5079O5998L8348L7134N0074L3396M8344N3124L7423P8439R7528
11983A873118M3741R1570J00165Q0548J22534J33528J60377J43558K00799K17712
$$ plain form
12067 603987 634989 673189 681018 652868 615168 534103 448529 381098 364204 340083 335574 315172
12055 315172 297317 262532 253706 275655 298399 323017 334089 339102 371384 372908 373030 356208
12043 356208 342146 333015 331378 346925 358279 366195 355336 329663 329174 389743 419453 414230 385482
12030 385482 381062 409436 450886 436123 417731 429161 463738 492646 489553 494746 508779 517130
12018 517130 517067 541383 568902 600279 625428 635789 640435 647191 647752 663380 676916 696554 743239
12005 743239 771677 805792 838641 891776 944268 980969 1042301 1063981 1115953 1204367 1268231
11994 1268231 1333310 1399308 1437656 1474790 1524864 1558260 1606604 1659728 1697151 1775590 1873118
11983 1873118 1916859 2008429 2108594 2189142 2311676 2445204 2605581 2749139 2949938 3167650
11973C167650K74461K83206K68183K37790K26139K79577L21953L54366L92458
11964E805783M44392N02432N76323O56523P55654R20754J127538J334942J544192
11955A3668533J793246K114385K536213L124955L889460M931438O388806Q352869
11947D6799905J1225142J5638653K2672672L3723849N0670610P4074785R9946282
11940C54751898J12917466R1915972L9849809k4690818r7072493j29775101j04224412
11933B43672321o8571783m4030219k9179791k0191744j4513332j0743377q138566
11926D8303509o340037n129119m256354l603913l058483k636504k240228j894863
11918A9144008j614388j394701j239157j122356j042958r11327p91461o80408
$$ plain form
11973 3167650 3442111 3725317 3993500 4231290 4457429 4737006 5058959 5413325 5805783
11964 5805783 6250175 6752607 7328930 7985453 8741107 9661861 10789399 12124341 13668533
11955 13668533 15461779 17576164 20112377 23237332 27126792 32058230 38447036 46799905
11947 46799905 58025047 73663700 96336372 130060221 180730831 254805616 354751898
11940 354751898 467669364 559585336 599435145 574744327 477671834 347896733 243672321
11933 243672321 175100538 131070319 101890528 81698784 67185452 56442075 48303509
11926 48303509 41963472 36834353 32577999 28974086 25915603 23279099 21038871 19144008
11918 19144008 17529620 16134919 14895762 13773406 12730448 11819121 11027660 10347252
11910A0347252o20689n96905n93146n07707m22739l64437l12371k26372k39836
11901F463050k73095k79908k45289k49882k76149k36208k54075k05199j77100
11892D266145k09940k08252j72105j82232j70617j62987j41501q0224j16697j13930
11882B707660p3853r2285o7891m2386l3169n5847n7789p8495n5651j5412l5451
11871B099431m5980p8460o7586q9733r0596j9576m6204m1443n1665m1359n7651
11860A469178m3209k8334l0635n9813k6664k4486l4768j1567k191k1115j4126
11849A172270k3956l6618k7331l7551n020r808j8080o83k2679K2044n900l7154
11837I69534k3174O73J5025r734O294l3248l3613j9300k9355m143L2763j5170
$$ plain form
11910 10347252 9726563 9129658 8536512 8028805 7606066 7241629 6929258 6702886 6463050
11901 6463050 6189955 5910047 5664758 5414876 5138727 4902519 4648444 4443245 4266145
11892 4266145 4056205 3847953 3675848 3493616 3322999 3160012 3018511 2938287 2821590 2707660
11882 2707660 2633807 2541522 2473631 2431245 2398076 2342229 2284440 2205945 2150294 2134882 2099431
11871 2099431 2053451 1974991 1907405 1817672 1727076 1707500 1661296 1619853 1568188 1526829 1469178
11860 1469178 1425969 1397635 1367000 1307187 1280523 1256037 1221269 1209702 1207511 1186396 1172270
11849 1172270 1148314 1111696 1084365 1046814 1041794 1031986 1013906 1013223 990544 1012588 1006688 969534
11837 969534 946360 947033 962058 952324 958618 925370 891757 872457 843102 838959 871722 856552
11825H56552k8973n3680k9193k799q272k3646j5793k8863P045R470o931n4403
11813F20514p9181m3741n6896k7706k9727J1689M8359K9616j3075k6241K8349
11802D61960J9007q780K1889L3690l323K0380K5715K8204M8267L5897N2887J5615
11790G51408j955P707K6465p45m5810q6190o0642j6656m9586m8177j7025Q176
11778D66970P046l1149l3704J09K381o4193j9132p990k1071O835J8359r362j0206
11765C04893J140L6837K1353o244k1706N490J2374k3164j7568k3020N542k6386
11753B69541K010m818K7565r47l2564l3582p7855n3508o5175k7892J7160O1445
11741H1380N6758M1360K8914j6453j6177j9486K5350K4623K3483l818m1737j6320
$$ plain form
11825 856552 827579 773899 744706 741907 733635 709989 694196 665333 672378 681848 674917 620514
11813 620514 541333 497592 440696 412990 383263 394952 443311 472927 459852 433611 461960
11802 461960 480967 472187 494076 527766 524443 544823 570538 598742 647009 682906 735793 751408
11790 751408 749453 757160 783625 782880 737070 650880 590238 573582 523996 475819 458794 466970
11778 466970 474016 442867 409163 409272 411653 347460 328328 320338 299267 306102 324461 315099 304893
11765 304893 306033 342870 364223 357979 336273 341763 354137 330973 313405 290385 295927 269541
11753 269541 271551 266733 294298 293351 260787 227205 149350 95842 30667 2775 19935 81380
11741 81380 138138 179498 208412 191959 175782 156296 181646 206269 229752 225934 184197 167877
11729A67877j190p62L3395P480N106L643M2374L7164J9695k864k5681k0696j6433
11716B49108l3404m4429p620m162l9786K691p571j6082r753J7431L0601K0511
11704A57535j3054l791o562m887p919l3621p355J4356K011j6146l1984K5577K4849
11691I9009J7407K3533J4292K1538J9401J2860k7781l4750j3992l0229j6102J4446
11679I9632k465L4795J1007l689K6498n593k9391r062K0210J3355j0524k7798
11667A16975j5724J9632P211K4556L442l0451j8276N008J2905J1983j4621q658
11655A13982P187M699j130k4066l851K722k1631j9960K492j5877j0298o085J9890
11642D8074j8394q925K9102l797k0229j6546K825M3989L4577K2682k5092l375
$$ plain form
11729 167877 166687 165925 199320 206800 211906 215549 257923 295087 314782 311918 286237 265541 249108
11716 249108 215704 171275 163655 159493 119707 122398 114827 98745 88992 106423 137024 157535
11704 157535 144481 140690 134128 129241 121322 87701 80346 94702 96713 80567 48583 74160 99009
11691 99009 116416 139949 154241 175779 195180 208040 180259 145509 131517 101288 85186 99632
11679 99632 97167 131962 142969 139280 165778 160185 130794 121732 141942 155297 144773 116975
11667 116975 101251 120883 128094 152650 156092 125641 107365 112373 125278 137261 122640 113982
11655 113982 121169 125868 124738 100672 96821 99543 77912 57952 60444 44567 34269 28184 48074
11642 48074 29680 20755 49857 46060 25831 9285 12110 56099 90676 113358 88266 84891
11630H4891K9547J0992J0568m193J5353J3732k6738j9936m1629l0036L0800M0909
11618A14260o953K696j896K783L7545K4945j1772j3397K010j1580l0134l6056
11606G2451O842K9676K3524k5632p866J8325m589j5991m9332L32J0731O685O0
11593F5216K3422R72o493P34k025j0046j9842J1136L2932m048n590J7460J7028
11580A20856j6723k7541j9892n691J3067k8562m2487P002L7331M5209L6208J4966
11568A33743K1310q487k0267l3726N798J3524l9066l8050M118L7145K0566L080
11556I9688K218J817j792j8001j4376K9308L5491o752j2594k5677l9995J076N2527
11543A02938P727n4430j8241J5814L273k0975J0863K4334K4672J5958k5250k1974
$$ plain form
11630 84891 114438 125430 135998 131805 147158 160890 134152 114216 72587 42551 73351 114260
11618 114260 107307 110003 108107 110890 148435 173380 161608 148211 150221 138641 108507 72451
11606 72451 79293 108969 132493 106861 98995 117320 112731 96740 47408 47740 58471 65156 65216
11593 65216 88638 89610 83117 83851 81826 71780 51938 63074 96006 91958 86368 103828 120856
11580 120856 104133 76592 56700 51009 64076 35514 -6973 29 37360 82569 118777 133743
11568 133743 155053 146566 126299 92573 98371 111895 72829 34779 38897 76042 96608 99688
11556 99688 101906 103723 101931 83930 69554 98862 134353 127601 115007 89330 49335 50411 102938
11543 102938 110665 56235 37994 53808 57081 36106 46969 71303 95975 111933 86683 64709
11531F4709k3952J4630L3165r173j4808J3660k1086q125J3730J5651J7206N483
11519A01090J0863j8156l0096p094P415O913k4709K9151M1370J2905j6558k6792
11507H6302k4297j2901M581K2130J86l236k2725O928k2164k5344j1435k2604m782
11494b9361L4979L7114N035j01R575J033J3763J7595j6717j8226J6487k534p048
11481F1594j954L3251o982j3834p673j7123k469j4291N044M915J6183Q489k5523
11468C9627m912J221K7996j0255L7223J4620l9428m6091k6614K1222K6671J3268
11456E4548L6620n625k2497k9919n723k3052r400L1225j1962j6267L651J7822
11444A9421k8507j3621J3716j2490L4688K7532J7815j2419K240j7513J5128l3272
$$ plain form
11531 64709 40757 55387 88552 79379 64571 78231 57145 49020 62750 78401 95607 101090
11519 101090 111953 93797 63701 56607 64022 70935 46226 75377 116747 129652 113094 86302
11507 86302 62005 49104 53685 75815 76001 72765 50040 56968 34804 9460 -1975 -24579 -29361
11494 -29361 5618 42732 47767 47666 57241 58274 72037 89632 72915 54689 71176 68642 61594
11481 61594 59640 92891 85909 72075 64402 47279 44810 30519 35563 40478 56661 65150 39627
11468 39627 34715 35936 63932 53677 90900 105520 66092 20001 -6613 14609 41280 54548
11456 54548 91168 85543 63046 33127 27404 4352 -5048 26177 14215 -2052 1599 19421
11444 19421 -9086 -22707 -8991 -21481 13207 40739 58554 46135 48375 30862 45990 12718
11432A2718Q844P262j5998k0180L4498M1385j6720l5168k2752L0038L9627L350
11420F6904N062J2348k3044j2607R535o424N849l5084q271P869p793J2377R033
11407C5754k0537l895L9579Q376K880M061o575k9416j5707m588J2473q56q262
11394A3287P236J8112J7612j5030k7550k5755o426N840K3962J7661J3615Q374
11382E0938q761P955l489n752J0112j3306m4850k7089J3614K2487P575K8258m5928
11369h236j465K6130M38K2954L928j441j7710K5281J1789j9067J4420j4798k4064
11356A8159p033J238K4348n723k831K3617P035J0963j4306M557j2306j5227r689
11343B2802n342R5k1775j8335K9064K8138j450o959l6774j3522L0627M163j9157
$$ plain form
11432 12718 21562 28824 12826 -7354 27144 68529 51809 16641 -6111 23927 63554 66904
11420 66904 71966 84314 61270 48663 58198 51774 57623 22539 14268 22137 14344 26721 35754
11407 35754 15217 11322 50901 59277 62157 66218 59643 30227 14520 9932 22405 21549 13287
11394 13287 20523 38635 56247 41217 13667 -12088 -18514 -12674 11288 28949 42564 50938
11382 50938 42177 50132 46643 40891 51003 37697 -7153 -34242 -20628 1859 9434 37692 -8236
11369 -8236 -9701 16429 16867 39821 43749 42308 24598 49879 61668 42601 57021 42223 18159
11356 18159 11126 12364 36712 30989 28158 51775 58810 69773 55467 60024 47718 32491 22802
11343 22802 17460 17555 -4220 -22555 6509 34647 33197 26238 -10536 -24058 6569 10732 -8425
11330h425l3738L4505M1397J757L0338k764j5359K951J9148O725o394l3238m920
11317C1983j1984L909k903j3027p653K4838O771q857K3850o980j0397j8868n468
11304E214K2575J5304N729j103l2012j8835L4338M1788O12k7485J3262j0839k101
11291D6447j1977m9469R555J3053M04K5400J1925J438q182p698k2823o493Q126
11278I706K8055j5430j5872p264L030J8494K1765l0402J0440J3978O102j2087
11266C0515l0443j320J52k0063P145K8477p284m325K0491N24r370M744j2934j2592
11252f283r325K0645L8813K9119J9618l9680o139J468r136j174O877k63m028k4720
11238A5792k0454R281N738j1405O890J0654J7355J2835J3933P000k0089j3233
$$ plain form
11330 -8425 -42163 -7658 33739 35496 65834 63070 47711 50662 69810 76535 70141 36903 31983
11317 31983 19999 23908 21005 7978 325 25163 31934 23077 46927 39947 29550 10682 5214
11304 5214 27789 43093 48822 47719 15707 -3128 31210 72998 73610 46125 59387 48548 46447
11291 46447 34470 -14999 -5444 7609 8013 33413 45338 46776 38594 30896 8073 1580 9706
11278 9706 37761 22331 6459 -805 2225 20719 42484 12082 22522 36500 42602 30515
11266 30515 72 -1248 -1096 -21159 -14014 14463 7179 2854 23345 23869 14499 19243 6309 -6283
11252 -6283 -15608 5037 43850 72969 92587 52907 46768 48236 39100 37926 44803 44540 40512 15792
11238 15792 -4662 4619 10357 -1048 5842 16496 33851 46686 60619 67619 47530 34297
11226C4297J9073R537q421j4535j1898L096J4298j6086l0438j8705r653M3036
11214A3601K8813J1182n264n949j0719l419K2107L6660J9513l970O636j4988k9875
11201F4328l2867j7695m754k863L2088P892J2706j0785m583k3977k3424j973L7452
11188C1545J4016j8628k680K0587k5516k9575K1751L4826j2345l423o780k3316
11176D62p2j7242l0577J7575M9137K7032P921q878K478J0300j9533o80J2640N378
11162E5941J5619k1853J2429o727r432J6060l200k5152j6436K984j0605j3775
11150d147J404L7036K1604j1371n008j7858r781L906J1522j0081j7353N733J1228
11137A6834L321N981Q146j4194j0058L0203J8334P840j8870j5898k442K622Q318
$$ plain form
11226 34297 53370 62907 54486 39951 28053 31149 45447 29361 -1077 -19782 -29435 13601
11214 13601 42414 53596 48332 42383 31664 28245 50352 87012 106525 102555 109191 94203 64328
11201 64328 31461 13766 9012 6149 38237 46129 58835 48050 43467 19490 -3934 -5907 31545
11188 31545 45561 26933 24253 44840 19324 -10251 11500 46326 33981 30558 23778 462
11176 462 390 -16852 -47429 -29854 19283 46315 54236 45358 47836 58136 38603 37923 50563 55941
11162 55941 71560 49707 62136 55409 45977 62037 58837 33685 17249 20233 9628 -4147
11150 -4147 -2743 34293 55897 44526 39518 21660 11879 15785 27307 17226 -127 5606 16834
11137 16834 20155 26136 34282 20088 10030 40233 58567 66407 47537 31639 29197 31819 40137
11124D0137J1347j8159l872j9613r982J2200J4072j5965J2901K910j8572m166
11112C238j2311M061R283j5646R597L3740K1659K202l837K788k1271l813j6000
11099A3690j8742M002K345J9401K2603Q118j326j4656k2391P755K7110r126o232
11086C2551q814k2043J3222K3077q590p920K5987J2562l1443j0265L8280m072
11074E2532l8391q368j4026L046L0500L3531k1072j4330k244l941M656j3387R306
11061A7812J228k2657O749K7043K1634J9233q864j2859O697K7989J817M922L1642
11048A22386l051K328K1063j5548M138K6243j6726J3996J6013j7215J6205K0768
11036A90600Q400M763L0113M5244J5158J8058j3433l5035j0329J745M929K8297
$$ plain form
11124 40137 51484 33325 29453 9840 -142 12058 26130 10165 23066 25976 7404 3238
11112 3238 -9073 -5012 4271 -11375 -1778 31962 53621 55823 51986 54774 33503 29690 13690
11099 13690 -5052 -1050 1295 20696 43299 51417 50091 35435 13044 20799 47909 38783 32551
11086 32551 23737 1694 14916 37993 29403 21483 47470 60032 28589 18324 56604 52532
11074 52532 14141 5773 -8253 -5207 25293 58824 37752 23422 21178 17237 21893 8506 17812
11061 17812 19040 -3617 3132 30175 51809 71042 62178 49319 56016 84005 85822 90744 122386
11048 122386 119335 121663 142726 127178 131316 157559 140833 154829 170842 153627 169832 190600
11036 190600 199000 203763 233876 279120 294278 312336 298903 263868 253539 255284 260213 288510
11024B88510L8125N5736J0220J5139N07m7349j1636J6625o6242j4495j7915O152
11012B73377m360K1538q110J0349l0406k5365j936j5919l5657j1192K5118J0998
11000B08435k80k2452m675M855l6445j1615q321K089j4327m9897l398m795k2658
10987C6516P677J4990k1319J0183k5464j0548K2545L0683J4364K3832J0624l1314
10975H2769r669l1322j1878R608J6065j9006m19K0379J0930j6864K87k789O478
10962E4569K2371N749P31J1117k0839k4408j2620J4373J7264k6025k3710k7912
10950i340Q119J1351J1556R356p406O339O55l475k2523k677J3940k2472J7452
10937A0875P557M116Q781j1934J5191J1258O107o722l9812l170J8575O669K132
$$ plain form
11024 288510 326635 382371 392591 407730 408237 360888 349252 365877 299635 285140 267225 273377
11012 273377 269017 290555 282445 292794 262388 237023 235087 219168 183511 172319 197437 208435
11000 208435 208155 185703 181028 185883 149438 137823 129502 131591 117264 67367 63969 59174 36516
10987 36516 44193 59183 37864 48047 22583 12035 34580 65263 79627 103459 114083 82769
10975 82769 73100 41778 29900 39508 55573 36567 36148 56527 67457 50593 50880 48091 54569
10962 54569 76940 82689 83420 94537 73698 49290 36670 51043 68307 42282 18572 -9340
10950 -9340 -1221 10130 21686 31042 23636 29975 30630 27155 4632 1955 15895 -6577 10875
10937 10875 18432 22548 31329 19395 34586 45844 51951 45229 5417 2247 20822 27491 29623
10924B9623O965o857j3870o229j5299J8324Q848j2159k8053J6272O3672J9556
10912H0793j4088j4625r576q477j1739L481j0736l3824J7605J8358L6798O80l3757
10899B0893M418M744r80j1632j1265J2942O057j0225J4087j0257J0631J9298j1873
10886C6838j0861m670j2669l2137L825K3319J2805o807k435O197L571l1395m727
10873a9146L6261N1182L739k4142J0588p22j3190J6598J255K174j1813j2116j3730
10860B6938k4339M724j639K9695Q852J4769L3182J1535l8542q214j0506j0852
10848C5603l672K5994m326o191j5275J3563p77K8014L0907q427m3915k2135j5209
10835A4154R713J5136m965J2577k48j8562q21J3673j101m5075j114K4737K6439
$$ plain form
10924 29623 36588 29731 15861 9632 -5667 12657 21505 9346 -18707 -2435 61237 80793
10912 80793 66705 52080 42504 34027 22288 25769 15033 -18791 -1186 17172 53970 54650 20893
10899 20893 25311 30055 29075 17443 6178 19120 25177 14952 29039 18782 29413 48711 36838
10886 36838 25977 21307 8638 -23499 -19674 3645 16450 9643 7208 13405 16976 -14419 -19146
10873 -19146 17115 68297 72036 47894 58482 57760 44570 61168 62423 64597 52784 40668 26938
10860 26938 2599 7323 5684 35379 44231 59000 92182 103717 65175 56961 46455 35603
10848 35603 31931 57925 53599 47408 32133 45696 44919 72933 103840 95413 51498 29363 14154
10835 14154 23867 39003 34038 46615 46367 27805 26984 40657 39556 -5519 -6633 18104 44543
10822D4543K0984M806q153p88J8232j3317J6383q951l064k828m0072l3102k2511
10809b7838J2551J2553P414J3600j4053J4037k4931p664K4456j9477L444M3700
10797C7792K8785m98n2385j7952k4996J7803K4072J0727j0076K643J8441j2053
10785B2303j6842J0058K146K333M3555K2713k4406k2453j7707J6917L3193J2310
10773H4120j0907l2984j2129M3243J0533l2447l1923j1677j3123K325J9244O916
10761B1191J1696M7109J3329k1647j889j9988J8018j3166m4187K5626J3717J818
10749E1627K5558K4141k2318n448k6800l4006K43k4360J0468L3606O019J3177
10737E1907M567k9464k340J4748q603K6063J8340p086k2287k5985p018L6877J6979
$$ plain form
10822 44543 65527 70333 62180 61392 79624 66307 82690 73739 70675 67847 27775 -5327 -27838
10809 -27838 -15287 -2734 4680 18280 4227 18264 -6667 -14331 10125 -9352 -5908 37792
10797 37792 66577 66079 13694 -4258 -29254 -11451 12621 23348 13272 15915 34356 22303
10785 22303 5461 15519 17665 19998 63553 86266 61860 39407 21700 38617 71810 84120
10773 84120 73213 40229 28100 71343 81876 49429 17506 5829 -7294 -4969 14275 21191
10761 21191 32887 79996 93325 71678 69789 49801 67819 54653 10466 36092 49809 51627
10749 51627 77185 101326 79008 73560 46760 12754 12997 -11363 -895 32711 38730 51907
10737 51907 56474 27010 24670 39418 30815 56878 75218 68132 45845 19860 12842 49719 66698
10724F6698n552J2707J2934M618q508L0106J5048k028k4866m8749J6162L6497
10712A05067P647L440j4305k0371J0468k071J9039l3281m3998K9374M4197L1987
10700A37193j5672m4166j5766J6506L2168J1296j0048k5603k4871j6129k99K8948
10688G3557K9818M572j894k1421j18K5395L027K0940J6850p720k1008r451M845
10675A17392J7382L2108J3805r31k4478n556q40j3707J0518J7793R418R322M261
10662A86487m3599j0239j377L2831M1291J4273M445M5569J6748M562K4730K8117
10650C43838K9841J2825j1610m707r839K7090K4042M3702N6566L2057J5727M7512
10638F07044O2720R9138P8414J13901J36094J46431J42063J49428J39581J40993
$$ plain form
10724 66698 61146 73853 86787 91405 82897 113003 128051 126023 101157 52408 68570 105067
10712 105067 112714 116154 101849 81478 91946 89875 108914 75633 31635 61009 105206 137193
10700 137193 121521 77355 61589 78095 110263 121559 111511 85908 61037 44908 44609 73557
10688 73557 103375 107947 106053 84632 84514 109909 112936 133876 150726 143006 121998 112547 117392
10675 117392 134774 166882 180687 179756 155278 149722 148882 135175 145693 163486 172904 182226 186487
10662 186487 142888 132649 131272 164103 205394 219667 224112 269681 286429 290991 315721 343838
10650 343838 373679 386504 374894 370187 360348 387438 411480 455182 511748 543805 559532 607044
10638 607044 669764 768902 847316 961217 1097311 1243742 1385805 1535233 1674814 1815807
10628A815807J29331J66985K79613L73714M51180N91559Q10884J066574J459110
10619G144757J872629K277957K612857K682927K342901J635349P38573o2012m37698
10610B0808240j76505N17570J548508K793522M031627M913002M996929M059643
10602D3492536K147841j99133k178806k935551k300158p65204J150485L148548
10594D1560558M928454O030313N816537L999605R18177k573058n439100o370548
10586D8870938n437363l566635j526043L49545J902501K707535K496513J139768
10578D6936759r80337l240030m934854n310626m474070l113551j800943p32903
10570B2349445P522L48502K36764l87656j261574k095508k712650k830499k500861
$$ plain form
10628 1815807 1945138 2112123 2391736 2765450 3216630 3808189 4619073 5685647 7144757
10619 7144757 9017386 11295343 13908200 16591127 18934028 20569377 21307950 21245938 20808240
10610 20808240 20631735 21149305 22697813 25491335 29522962 34435964 39432893 43492536
10602 43492536 45640377 45441244 43262438 40326887 38026729 37261525 38412010 41560558
10594 41560558 46489012 52519325 58335862 62335467 63253644 60680586 55241486 48870938
10586 48870938 43433575 39866940 38340897 38690442 40592943 43300478 45796991 46936759
10578 46936759 45956422 42716392 37781538 32470912 27996842 24883291 23082348 22349445
10570 22349445 22356967 22705469 22942233 22554577 21293003 19197495 16484845 13654346 11153485
10561A1153485k017882j547764j149101q91578o94517n29613m38046l58412k90527
10552C236045k51114k30987j94512j66652j55863j51547j64597j27489j04211
10543A689073o0303o8507q3987n8108o3881r1840o3185o5612m0572j8137m7087
10532A027854o5552m0775O776j7168n0911n6582o3438k5485P980j377l3799j7187
10520F70336q8q863m8313m4015k109j1780k6822j3534J8927Q608l8386m4780j2812
10507D46369O120r614k3661q904K405k8551n0836J4059P850J6997K6503J6888
10495D15625j0839j1917j750k568R680j1065k5077k6270l4835j2134l5776j5767
10483B37307L2737L5510O685k626k947j6587n492m745j1367j1573p858Q284j6231
$$ plain form
10561 11153485 9135603 7587839 6438738 5547160 4852643 4323030 3884984 3526572 3236045
10552 3236045 2984931 2753944 2559432 2392780 2236917 2085370 1920773 1793284 1689073
10543 1689073 1628770 1560263 1476276 1418168 1354287 1262447 1199262 1133650 1093078 1074941 1027854
10532 1027854 962302 921527 928303 911135 860224 803642 740204 714719 722699 721322 687523 670336
10520 670336 670248 661385 613072 569057 566948 555168 528346 514812 533739 542347 503961 459181 446369
10507 446369 452489 442875 419214 410310 412715 384164 333328 347387 355237 372234 398737 415625
10495 415625 404786 392869 391119 388551 398231 387166 362089 335819 300984 288850 253074 237307
10483 237307 270044 305554 312239 309613 306666 290079 284587 279842 268475 256902 249044 257328 241097
10470B41097k0458k3568r254K0031K6420o30k569k6237L960J7909j872m9428j7660
10457A57741L6992K1956o957k4086k3567q649L0542O536M788N178j0815j3330
10445A76329j532P996J5061N729n711j2099k2091j9167j5889j9251J7164K0882
10433A47421j7166n146J5829L1429k925r462N928j0580k3635r999P096j4164J6890
10420A31516J2487q942l2191M092J1599k0955j189j0239K5094P135k1883j4433
10408H2091n8816j6263L2357J8996N514J4587L076k5340J3916q002n120k4166
10396C2830o784J0484K8190K8982j4645n690j4224J609o561j1798k5385K5862
10384D2870J4719K804L389k685K5494k081q709K3739K0501j3210j8300q955J1290
$$ plain form
10470 241097 220639 197071 187817 207848 234268 233638 231069 204832 208792 226701 224829 175401 157741
10457 157741 194733 216689 209732 185646 162079 153430 183972 190508 195296 200474 189659 176329
10445 176329 174797 182793 197854 203583 197872 185773 163682 144515 128626 109375 126539 147421
10433 147421 130255 125109 140938 172367 169442 159980 165908 155328 131693 121694 128790 114626 131516
10420 131516 144003 135061 102870 106962 118561 97606 96417 86178 111272 118407 96524 82091
10408 82091 23275 7012 39369 58365 63879 78466 81542 56202 70118 62116 56996 32830
10396 32830 26046 36530 64720 93702 79057 73367 59143 60752 54191 42393 17008 42870
10384 42870 57589 60393 63782 61097 86591 84510 75801 99540 120041 106831 88531 79576 90866
10371I0866Q844k8999k4378q145J1506L1336J0929j0739k3858j4523j9230M2427
10359F6036L0093L1130Q872k4730j0816j5221k8718k0478J7669L5125O827j8575
10347G7214k0661k4362K5073K6493k4550j3987J5361q333n120J5229o218j421
10335E4718j976j2140j1544K5598k001R615j9736J189j7290j2031N113L1877M732
10322E6124q379j0069J6295p313l915J3708L8455l086n534p019K025k5839k6895
10309B8558l8598P861J4671J0747J6901j39j1756k4541J0662P736R169j0675J2714
10296C3310J5482J8861k3099m4202k114J1653j3740j0998J9068K2149k0575K1268
10284B7063J3936K99k3671j4310j0397q251K0745L0710J0344N330J3488j7764
$$ plain form
10371 90866 99710 70711 46333 38188 49694 81030 91959 81220 57362 42839 23609 66036
10359 66036 96129 127259 136131 111401 100585 85364 56646 36168 53837 88962 95789 77214
10347 77214 56553 32191 57264 83757 59207 45220 60581 52248 47128 62357 56139 54718
10335 54718 52742 40602 29058 54656 52655 62270 42534 43723 26433 14402 19515 51392 56124
10322 56124 47745 37676 53971 46658 42743 56451 94906 91820 86286 79267 81292 55453 28558
10309 28558 -10040 -2179 12492 23239 40140 40001 28245 3704 14366 22102 31271 20596 33310
10296 33310 48792 67653 44554 352 -1762 9891 -3849 -14847 4221 26370 5795 27063
10284 27063 40999 41298 17627 3317 -7080 -15331 5414 36124 46468 51798 65286 47522
10272D7522j4463Q149J1870J4286j0984K952M995L658n880n228r987j8075j906
10259B6909J4344R016O39L6278m351j6228J928k0742k1921l23J0155j0104J6443
10246D2043N649o789l7479k2827K5837K9323K7180p04O168k4631j3124Q933R871
10233D9450k607j923M232M0447j107p118N074l0845k6328r651j0710K952l022
10220H844R1J9309J2746P135j511R515K0955m1050q753m76j824r138J5431L2676
10206F3950K0881m367j507j4772n50k4279j0742O949J2880O23j1482k3476L390
10193A7498J0788O735l2099J1237L6251L8223K0186j8536p038M609K2138N198
10181A15190J9003k2169j3699O325J5763L5216J8578J7743j4219r843p022r424
$$ plain form
10272 47522 33059 41208 53078 67364 56380 59332 64327 67985 62105 56877 46890 28815 26909
10259 26909 41253 50269 50908 87186 82835 66607 68535 47793 25872 25549 35704 25600 42043
10246 42043 47692 40903 3424 -19403 6434 35757 62937 62233 68401 43770 30646 39579 49450
10233 49450 46843 44920 49152 89599 88492 81374 86448 55603 29275 19624 8914 11866 8844
10220 8844 8935 28244 40990 48125 46614 56129 77084 36034 27281 26805 24981 15843 31274 63950
10206 63950 84831 80464 78957 64185 63635 39356 28614 35563 48443 49066 37584 14108 17498
10193 17498 28286 35021 2922 14159 50410 88633 108819 90283 83245 87854 109992 115190
10181 115190 134193 112024 98325 104650 120413 155629 174207 191950 177731 167888 160866 151442
10169A51442L4643L7599K5171O967J2692J2637J9424l3552l9686j6677k2187J2266
10157B00739L7085O3093M0862M6082N216j2983m4472n5590l3562r790J5426J5980
10145B68086k7376j5365N6152J6025j8495j1357j1420l1234l4828l4972J2941
10134A68157P567k1748M737J5852J2024j0150r936m7425l6734k3736K8936n567
10122H1977j0498k204k7942k5197k3148K2185J3072q299L051K596j2492n21m65
10109A2115P548J9828j576J5050j7997j5745o015l812J0486K4096j794J2402j313
10096E3273k5376j3870j5290k539j5720m538L826M220J5422K1314N893j8223J0381
10083A8773l577k6107N320J7669R363N654j8894k2452K2715L8716N488o928J0615
$$ plain form
10169 151442 186085 223684 248855 255822 268514 281151 300575 267023 227337 210660 188473 200739
10157 200739 237824 300917 341779 387861 393077 380094 335622 280032 246470 236680 252106 268086
10145 268086 240710 225345 281497 297522 279027 267670 256250 225016 190188 155216 168157
10134 168157 175724 153976 158713 174565 186589 176439 166503 119078 82344 58608 87544 81977
10122 81977 71479 69275 41333 16136 -7012 15173 28245 19946 22997 25593 13101 12580 12115
10109 12115 19663 39491 37915 52965 34968 19223 13208 9396 19882 43978 42184 54586 53273
10096 53273 27897 14027 -1263 -3802 -19522 -24060 -20234 -16014 -592 20722 26615 8392 18773
10083 18773 15196 -10911 -5591 12078 21441 27095 8201 -14251 8464 47180 52668 45740 56355
10070E6355K0672N821k0117r875k2354k3214J2657K5330J5920M025k8261j3401
10058B3558q623k0335j6630Q552K1599o928Q027J5634k1706k7103O703l64K9280
10045A1664O3781K5132n7191k8266m228L9960R990k9065k0486j5899L145K9900
10033B8437j2036k5975m180M5693J2472J3019k2053j2908j1344j3537J5801j236
10021A2153j1582J9199J905j06m889K138l2316j1564K6984M4848K0497l2917j5013
10008A9337j4053Q029j4246N44K556K5784K1429j6979k3788l6454J7720J6474
9996F353R827q070j3059k0641l998J0817J6110K5805o824L952L846J3855L4786
9983G2759k1612l4047l125j5180N64O529N565J7858J9083o642q787O931J2506
$$ plain form
10070 56355 77027 82848 62731 52856 30502 7288 19945 45275 61195 65220 36959 23558
10058 23558 14935 -5400 -22030 -13478 8121 1193 9220 24854 3148 -23955 -17252 -17616 11664
10045 11664 75445 100577 43386 15120 10892 50852 60842 31777 11291 -4608 -1463 28437
10033 28437 16401 -9574 -13754 31939 44411 57430 35377 22469 11125 -2412 13389 12153
10021 12153 571 19770 21675 21569 16680 18818 -13498 -25062 1922 46770 67267 34350 19337
10008 19337 5284 13313 -933 -389 2167 27951 49380 32401 8613 -27841 -10121 6353
9996 6353 16180 8110 -4949 -25590 -29588 -18771 -2661 23144 16320 20272 24118 37973 72759
9983 72759 51147 17100 13975 -1205 -641 5888 11453 29311 48394 41752 32965 39896 52402
9970E2402m504m1920k0302L1534K8764j456m5315l427K7214L4494J97j2791l4930
9957I960o347L695k9171j3398K2156J6291K8551R942J9519k0800m759K5604J1391
9944G2634P613r831l2128k0845L511k34j5362l5191r324L760K5899L1793q938
9931A3357k2646j9238J4123J9367L3600K276J162k0576p311r468q125K2305J3423
9918C2249j9687J8858K6169j3691K57j8031q417j7449N283P193L329n615j3046
9905b598J3341o298n875j5500j8085M975l790J659J3340L425J0030R462K3476
9892B7562J0027j7893n651J509n656K302j4672O269j780J3920k3415m240k1427
9879c3145k2698J6934K7656K0396K84L5001Q085k6215j0057K4003j8720k2545
$$ plain form
9970 52402 47898 5978 -14324 17210 45974 44518 -797 -4224 22990 57484 57681 44890 9960
9957 9960 3613 7308 -21863 -35261 -13105 3186 31737 41679 61198 40398 35639 61243 72634
9944 72634 80247 70416 38288 17443 20954 20720 5358 -29833 -39157 -35397 -9498 22295 13357
9931 13357 -9289 -28527 -14404 4963 38563 40839 42001 21425 14114 4646 -3479 18826 32249
9918 32249 12562 31420 57589 43898 44155 26124 17707 258 5541 12734 16063 10448 -2598
9905 -2598 10743 4445 -1430 -16930 -35015 -30040 -33830 -32171 -18831 -15406 -5376 4086 27562
9892 27562 37589 19696 14045 15554 9898 12200 -2472 3797 2017 15937 -7478 -11718 -33145
9879 -33145 -55843 -38909 -11253 9143 9427 44428 52513 26298 16241 40244 21524 -1021
9867a021j8842J5248K1332R771k1138j3262K9575J6746m898J7454Q292n0748m357
9854D152k3912k4103Q317K8525J166l182n575j0506J3426L2690j2953k1621j4794
9841b8370N800J3582R40j6027q577L227K0824J6806J6588K713j6848j1458j4880
9828a5680M777m551j1174K5751J9354k4642M246P321P85R47j5570l0648j9901
9815e8985J5848K9119p608J5459K1073l3963j9835l651L561J5211L1878J9854
9803B7961L1088l459J2304p222m5441r798J880j7265J1215K1345n463P734N094
9790B9973r40P785l6079r126K8131J5617j3176k4316K2880R252Q036l1577j6320
9777i860L267j076M824L5393j2184k1153J159l196N437q349J018L2602K3585L056
$$ plain form
9867 -1021 -19863 -4615 16717 26488 5350 -7912 21663 38409 33511 50965 59257 8509 4152
9854 4152 -19760 -43863 -35546 -7021 -5855 -9037 -14612 -25118 -11692 20998 8045 -13576 -28370
9841 -28370 -22570 -8988 -8048 -24075 -32652 -29425 -8601 8205 24793 27506 10658 -800 -15680
9828 -15680 -10903 -15454 -26628 -877 18477 -6165 -1919 5402 6187 7134 -8436 -39084 -58985
9815 -58985 -43137 -14018 -21626 -6167 14906 -19057 -38892 -42543 -38982 -23771 8107 27961
9803 27961 59049 55590 67894 60672 15231 5433 7313 -9952 1263 22608 17145 24879 29973
9790 29973 29033 36818 739 -8387 19744 35361 22185 -2131 20749 30001 38037 6460 -9860
9777 -9860 -6593 -7669 -2845 32548 20364 -789 370 -2826 2611 -5738 -4720 27882 51467 54523
9763E4523n0751j5711Q857k209k1870K5683J0743l193j9988L0921j683m650N915
9750A6587j1685q706j5858L74M914K691K7771M181k7904K384N1937N430j9636
9737C2480J5179N65m5727j6348K080j381J7133L9026J3667j1747j4173J1862j001
9724D1615l1758k3955L4083N928l3161k3171L5619Q556P178r509j5129K4816L6398
9711E7510j3757r897n498K523J0660N657K9829J0409l1029J0862j4692l1725l096
9698A7756j1970j6753q959L2342J5917K795r773p944P026J4232O099k2920j0736
9685G112J957K0629k99N69O426J7937K245j3129l7030p894J8161K7295M411k3124
9671B5266J6997n537k1650j7809J1384M8385l4237k1248O705r669J198O21J5973
$$ plain form
9763 54523 3772 -11939 -3082 -5291 -27161 -1478 9265 6072 -13916 17005 15322 10672 16587
9750 16587 4902 -3804 -19662 -19288 -14374 -11683 16088 20269 -7635 -5251 46686 52116 32480
9737 32480 47659 48224 2497 -13851 -11771 -13152 3981 43007 56674 44927 30754 42616 41615
9724 41615 9857 -14098 19985 25913 -7248 -30419 5200 13756 20934 11425 -3704 21112 57510
9711 57510 43753 33856 28358 30881 41541 47198 77027 87436 56407 67269 52577 20852 17756
9698 17756 5786 -10967 -19926 12416 28333 31128 21355 13411 20437 34669 40768 17848 7112
9685 7112 9069 29698 29399 29968 36394 54331 56576 43447 6417 -1477 16684 43979 48390 25266
9671 25266 42263 36726 15076 -2733 8651 57036 22799 1551 8256 -1413 -215 406 16379
9658A6379j7389Q45k8790R657J7212L769p704j0083k650K2064K5004p43k3386
9645D185j537r887J3933L0103m953l804J7134j0576j5606J2101M369n268R214
9632C9408Q135p713m091J2429L0459J6009l1557k7055M2782J6267k3841k4520
9620D6712k5423o572l642j1929l1382J0267K7613l9575j0159J5578k9346K317
9608e5541M5648j1056O915o58L3065j4717j2940J3696L4766k251k8352m598N417
9595I394m794j4625j4264O840J0882K3543L2976k1115k0233j6828j714O420M440
9582I22j7654k358n068N1743J4436j1687K1585K6850k2287J902K1817N79j0792
9569F9988k1839l3460l1680k5157J8711N289n558j2985M368p480j0365M6844L0012
$$ plain form
9658 16379 -1010 -165 -28955 -19298 -2086 1683 -6021 -16104 -18754 3310 28314 27571 4185
9645 4185 2648 -7239 6694 36797 31844 28040 45174 34598 18992 31093 35462 30194 39408
9632 39408 47543 39830 35739 48168 78627 94636 63079 36024 78806 95073 71232 46712
9620 46712 21289 14717 11075 -854 -32236 -21969 5644 -33931 -44090 -28512 -57858 -55541
9608 -55541 -9893 -20949 -14034 -14692 18373 3656 -9284 4412 39178 36927 8575 3977 9394
9595 9394 4600 -10025 -24289 -17449 -6567 16976 49952 28837 8604 -8224 -9938 -3518 922
9582 922 -16732 -19090 -24158 27585 42021 30334 51919 78769 56482 58384 80201 80780 69988
9569 69988 48149 14689 -16991 -42148 -23437 -18148 -23706 -36691 -32323 -39803 -50168 -3324 26688
9556B6688j3757k1919n277M2007r394k9915J5377j2073J3509m83K0751M81j9574
9543F421J1718K3589k2052k5261j1373l2Q18p463m664m543j1950J5017R561K9302
9529I088J2705j6067k4359k2420K6482k3j0777N64K9690K0550m046J2795k2626
9516A1556j5259K6446J7823L0254j3428k8823k4450l4580j4385r509J3721K5330
9504a5304M1794M051J0751j1538l9608j1844J3182p619q39m480L156R120J9682
9491A0504l1773J9005K7789k207K3769N165k7799j0834O778K177k9298J5085M149
9478A2510N793J729J5282j8052l5492J043L4678J2642K692o022j6799k4208o877
9465b1081k504N21j6164J1276K2873R288k1748J5109j667Q250r526k9210P793
$$ plain form
9556 26688 12931 -8988 -14265 27742 18348 -11567 3810 -8263 5246 4763 25514 25995 6421
9543 6421 18139 41728 19676 -5585 -16958 -16990 -16172 -23635 -28299 -32842 -44792 -29775 -20214 9088
9529 9088 21793 5726 -18633 -41053 -14571 -14594 -25371 -24807 4883 25433 21387 34182 11556
9516 11556 -3703 22743 40566 70820 57392 28569 4119 -30461 -44846 -54355 -40634 -15304
9504 -15304 26490 30541 41292 29754 -9854 -21698 -8516 -16135 -16974 -21454 -18298 -9178 10504
9491 10504 -21269 -2264 25525 23318 47087 52252 24453 13619 20397 22574 -6724 8361 12510
9478 12510 18303 20032 35314 17262 -18230 -17187 17491 30133 32825 26803 10004 -14204 -21081
9465 -21081 -23585 -23064 -39228 -27952 -5079 4209 -17539 -2430 -4097 4153 -5373 -34583 -26790
9452b6790r726R026k1005K1405J6253J5280m909M198k5680J6671J0321j2256r530
9439a6742K4109j3691O831J8135J0189q00l600k1617m59J652j7244l305J3240
9426c302K1282j5234m6100k2118K9023L1460J0191l0092j5513j1493J4604K5266
9414a2026l89P488K1268J0167j7169k7818O254J0145L695m033K4469K8374j8495
9401C1930j9207k9660J5984K2844j5004l2721Q618L7259j0972j875j1006j6818
9389b0628J4210K784O598K2745j6182m891j5483K434K1229j2027j6713j5924J0360
9376b1488L2697k622l7088N183J5135k0881l1931J7703K4891J4619J9677Q057
9364B3952J754k1951j7187o238k579K489j2305K2754R295m238j3654n224L4486
$$ plain form
9452 -26790 -36516 -27490 -48495 -27090 -10837 4443 -466 3732 -21948 -5277 5044 -7212 -16742
9439 -16742 7367 -6324 507 18642 28831 28031 24431 2814 2355 4007 -13237 -16542 -3302
9426 -3302 17980 2746 -43354 -65472 -36449 -4989 5202 -24890 -40403 -51896 -37292 -12026
9414 -12026 -12415 -4927 16341 26508 9339 -18479 -12225 -2080 1615 -2418 22051 50425 31930
9401 31930 12723 -16937 -953 21891 6887 -25834 -17216 20043 9071 7196 -3810 -20628
9389 -20628 -6418 -3634 2964 25709 9527 4636 -10847 -8413 12816 789 -15924 -31848 -21488
9376 -21488 11209 8587 -28501 -23318 -8183 -29064 -60995 -43292 -18401 -3782 15895 23952
9364 23952 25706 3755 -13432 -19670 -22249 -19760 -32065 -9311 -16 -4254 -17908 -23132 11354
9351A1354K1523J6183k0055l2421j7810J3438K43k175O611K6152J525J1746k9362
9338F952j9448L26o897M999K0286p592k3380K6424L4031r901j1656J5946k9357
9325G33p242L0917J2029J6874k7838l5427k9315J0098K6510M1390j6434m025j6450
9312A820J1827j2314P734J6240K6940q948j6338j589l851Q076r928Q297m839k4249
9298a122N915k3380K1824J2265l5210R289L3476j3878k031P773k9069l8274J916
9285e0506J6733K5669k0021r952J7765J877K4341J4416l500P329K0075q384K165
9272C8007Q363K2028m443k2555n1882m453j227J5252Q708o853r0j9520j7161K6706
9258i120o65L058K3607J996n097r311J989J145J4469O487r795l3927q704j9123
$$ plain form
9351 11354 32877 49060 29005 -3416 -21226 -7788 -7545 -9720 -3109 23043 24568 36314 6952
9338 6952 -12496 -12170 -19067 -14068 6218 -1374 -24754 1670 35701 25800 14144 30090 733
9325 733 -6509 24408 36437 53311 25473 -9954 -39269 -29171 -2661 38729 22295 18270 1820
9312 1820 13647 1333 9067 25307 52247 43299 26961 25372 21521 29597 19669 27966 23127 -1122
9298 -1122 4793 -18587 3237 15502 -19708 -10419 23057 9179 7148 14921 -14148 -52422 -50506
9285 -50506 -33773 -8104 -28125 -38077 -20312 -18435 5906 20322 16822 24151 44226 35842 38007
9272 38007 46370 68398 63955 41400 -10482 -14935 -16162 -910 7798 945 855 -18665 -35826 -9120
9258 -9120 -9785 -6727 16880 18876 13779 4468 6457 7602 22071 28558 18763 -15164 -23868 -42991
9244d2991J6025K1371N3136M2860j446k9355l1953l6151p293q295p562K0754j2775
9231b3675Q410o210K9656L5087J3429k0067j5446k9139O445J2538q608j7109k7403
9218d2092L404J7138J5334m095J1758J6055K7152J0116J3333M04j6710m4605L90
9205G582k0837J2625k6927L4941Q381J2446m858j7773o92j1924j599q660n609
9192b2904O732K1066j7298n100k3950J3439O149K6555J4698l680n153j4330J1528
9179G752J7965P89j2688l4824o022o665P199k979P07J6044K9879J5755K7r272
9165B3667j066j456L383q467J632m694l83J6093l5944j5545J5116M22L484K7483
9151B3725N062o768L494M559M40o612q900j2192K8522L5371j6781j3363k7220
$$ plain form
9244 -42991 -26966 -5595 47541 90401 88955 59600 27647 -8504 -15797 -24092 -31654 -10900 -23675
9231 -23675 -15265 -21475 8181 43268 56697 36630 21184 -7955 -1510 11028 2420 -14689 -42092
9218 -42092 -38688 -21550 -6216 -10311 1447 17502 44654 54770 68103 68507 51797 7192 7582
9205 7582 -13255 -630 -27557 7384 15765 28211 23353 5580 4888 -7036 -8635 -17295 -22904
9192 -22904 -16172 4894 -12404 -17504 -41454 -28015 -21866 4689 19387 15707 10554 -3776 7752
9179 7752 25717 26506 13818 -21006 -27028 -33693 -26494 -29473 -28766 -12722 17157 32912 32939 23667
9165 23667 22601 21145 24528 16061 17693 12999 12616 28709 -7235 -22780 -7664 -7242 -3758 23725
9151 23725 28787 22019 25513 30072 30512 23900 15000 2808 31330 66701 49920 36557 9337
9138I337j2720j0252R693k5261l195J5422J8958Q703J5193q138k0803K0453J9051
9125C6441m878k3262j7903k2595N354p966P88k818r134K9023J4207j5063J0907
9112f899K815L0041J9884N071j3707k1688N231j57j6103m086j6193k576p443K043
9098b3767M1706P637l0859K4438P254j0452k4312J1456R646k0072m3578J3694
9086c7209M6629K8904J2277r977l8955o520N782J9298J3737j0058r104j3603k994
9073a793k032l8293Q234K7988Q727k7111P723L4236K4163k6719m68K3102K301
9060D0058j4706Q471N428r526J1055N061q899J413M51m688j2226P054j860j8186
9046H900j6878J047J2560K8136M254k5645j520M81L835O198n354J6090L870r031
$$ plain form
9138 9337 -3383 -13635 -3942 -29203 -32398 -16976 1982 10685 25878 17740 -3063 17390 36441
9125 36441 31563 8301 -9602 -32197 -26843 -34809 -34021 -36839 -45973 -16950 -2743 -17806 -6899
9112 -6899 -4084 25957 45841 50912 37205 15517 20748 20591 4488 402 -15791 -18367 -25810 -23767
9098 -23767 17939 25576 -5283 19155 26409 15957 -8355 3101 12747 -7325 -50903 -37209
9086 -37209 9420 38324 50601 40624 1669 -4851 931 20229 33966 23908 14804 1201 -1793
9073 -1793 -3825 -42118 -33884 -5896 2831 -24280 -16557 17679 41842 15123 14655 37757 40058
9060 40058 25352 33823 39251 29725 40780 45841 36942 38355 38806 34118 21892 28946 27086 8900
9046 8900 -7978 -6931 5629 33765 38019 12374 10854 11335 15170 21368 16014 32104 35974 26943
9032B6943k4167j3211l6518K332L3536J2233k2980J6313q198p655K1049P631J5237
9019B2545k253j5479K278m152J3575K032j2320n89J5038j0505j1330L4498K5904
9006E9242m3357r114j3112k682K0274K3728J0031M387m24M873p233k7404J4457
8993C3666K917o334m7950l2738J5018M9112J6058l2732r740J2655J3254J338j663
8980A2861n522R766Q145k7150l0869J9880L2006j5011L4598j1498m3964j1307
8968b8065J3332m113K1279K6431K9789n320p596L993j5301Q564k3390m6475J4140
8955a2732M245N836J9322J9854J0356J4839j3131L809J224l5839m792j9770R850
8942C071k4234P011J837k0325J0583j2677l0550k8218L7409K1286L4493r190j7684
$$ plain form
9032 26943 2776 -10435 -46953 -44621 -11085 1148 -21832 -5519 -13717 -21372 -323 7308 22545
9019 22545 20292 4813 7091 2939 16514 18546 6226 5637 20675 10170 -1160 33338 59242
9006 59242 15885 6771 -6341 -9023 11251 34979 45010 49397 48973 53846 46613 19209 33666
8993 33666 36583 30249 -17701 -50439 -35421 13691 29749 -2983 -12723 -68 13186 14524 12861
8980 12861 7339 17105 25250 -1900 -32769 -12889 19117 4106 38704 27206 -16758 -28065
8968 -28065 -14733 -18846 2433 28864 58653 53333 45737 49730 34429 42993 19603 -26872 -12732
8955 -12732 -8487 -2651 16671 36525 46881 61720 48589 52398 53622 17783 12991 -6779 3071
8942 3071 -21163 -14152 -12315 -32640 -22057 -34734 -65284 -93502 -56093 -34807 -314 -9504 -27188
8929b7188J7300Q520L0566j281j4280j5498k1811J2544J9888q803j7282J610j0227
8916b5942M2026K3121l731k1907l6621J9818L2845K5738J65k0289K3355o822L907
8903E5663k0747j1100j1070j9717j6178K3861J3723j5125P882k4279M93K1779
8891E185J0443R583j6825k1036m2903K6662R271N188J1152K6468J4629N980j6613
8878B7184l16J1472J5524j0764j5902k3512j990L833k9155M748j6640K0112L0040
8865A4634R541j4407l552J2390J7301Q380J3394j6835k7375P347k3666J0259K324
8852I735K381j9380Q332K2207m568j2314n991j8379Q377k0007K3445J3997J0005
8839A7840Q390J191K4157j0744k1178p135k2876J2886K880k3605m8718l1906K0967
$$ plain form
8929 -27188 -9888 -1368 29198 27917 13637 -1861 -23672 -11128 8760 -43 -17325 -15715 -25942
8916 -25942 16084 39205 35474 13567 -23054 -3236 29609 55347 55512 35223 58578 51756 55663
8903 55663 34916 23816 12746 -6971 -23149 712 14435 -690 7192 -17087 -16594 5185
8891 5185 15628 25211 8386 -12650 -55553 -28891 -19620 -14432 -3280 23188 37817 43797 27184
8878 27184 26868 38340 53864 43100 27198 3686 1696 5529 -23626 -18878 -35518 -15406 14634
8865 14634 24175 9768 6216 18606 35907 44287 57681 40846 13471 20818 -2848 7411 9735
8852 9735 12116 -7264 1068 23275 18707 6393 402 -17977 -9600 -29607 -6162 7835 17840
8839 17840 26230 27421 51578 40834 19656 12521 -10355 2531 5411 -18194 -66912 -98818 -77851
8826g7851L1323r27o123j9228N804N264K4208M3744M863k8071R145r536K0243
8813B858J0661j51R328k1894l5275o26K0098j469j7632K0330L1316K4342j1140
8800C0746K409j4028l8024j5271K3049Q937j327k5118j305J0412j1987L4097J4624
8787A7214K1995K0496j8758p993j0283j5034l207K998K7587l2037j1598R715o43
8774D52k8679N467J7138R78J6672p227o427o679J3945J0075L24j5707j3589k1557
8760c4814n571J6696J7768M9470K1273k2769k6956l7175k0411O587J4612Q13K3772
8747C295O173J0350n334P070K018n90P56k884k5355j939j1450l1966q788J340
8733e7304K0146n536j9181L1198L558o52M5956k738j5492j337j4443j9209K482
$$ plain form
8826 -77851 -46528 -47455 -53578 -72806 -67002 -61738 -37530 6214 11077 -16994 -7849 -17385 2858
8813 2858 13519 13368 22696 802 -34473 -35099 -15001 -16470 -34102 -13772 17544 41886 30746
8800 30746 33155 19127 -18897 -34168 -11119 -2182 -3509 -28627 -29932 -19520 -31507 2590 17214
8787 17214 39209 59705 40947 32954 22671 7637 4430 7428 35015 2978 -8620 1095 452
8774 452 -28227 -22760 -5622 -4644 12028 4801 -1626 -8305 5640 15715 16039 332 -13257 -34814
8760 -34814 -40385 -23689 -5921 43549 64822 42053 15097 -22078 -42489 -35902 -21290 -20477 3295
8747 3295 9468 19818 14484 21554 23572 22982 23738 20854 -4501 -6440 -17890 -49856 -58644 -57304
8733 -57304 -37158 -42694 -61875 -30677 -27119 -27771 18185 15447 -45 -1382 -15825 -35034 -32552
8720c2552m109J9708L1988j4163n728m965m832p253J1260j0173q158j4528M932
8707c8573J1475Q143J3029L665J6361J2263J0937q653k2157l6781m190Q293J0020
8694a6168P519L517J2549j0850j2216L1366k38p005q273q814Q736J6734k3574
8681f717j8417l0548K7506L1215K4460j817j5525k6095m577J1419L79J6759M0219
8668D8261J3289k4723j6851N610k3834K1168p016o543j0041p585L4175L562J2782
8655D2254j2094k7070j562Q490j2060k5533L5128m530q127K8159J186n561M001
8642B2681k666j9416n014J6770j2321p470K5694l835l365k6685q26R510M625n835
8628h153L502Q74m2197N97N729N249J7814K5447J4310Q644j1045N109l2236j4830
$$ plain form
8720 -32552 -36661 -16953 15035 872 -4856 -9821 -14653 -21906 -10646 -20819 -28977 -43505 -38573
8707 -38573 -27098 -18955 -5926 -2261 14100 26363 37300 28647 6490 -30291 -34481 -26188 -16168
8694 -16168 -8649 -5132 7417 -3433 -15649 15717 15479 8474 201 -8613 123 16857 -6717
8681 -6717 -25134 -55682 -28176 3039 27499 25682 10157 -15938 -20515 -9096 -8717 8042 48261
8668 48261 61550 36827 19976 25586 1752 22920 15904 9361 -680 -8265 25910 29472 42254
8655 42254 30160 3090 1528 10018 -2042 -27575 7553 3023 -5104 23055 24241 18680 22681
8642 22681 20015 599 -4415 12355 34 -7436 18258 14423 11058 -15627 -16453 -6943 -2318 -8153
8628 -8153 -4651 -3777 -45974 -45377 -39648 -34399 -16585 8862 23172 31816 20771 25880 -6356 -21186
8614b1186k6959n350J86K4530J9959N12L936J7113L9515p759l5982j5141l401
8601a0027R248j3578J53R002M361L274J2080J3513k490j8940j0125k0006j010
8588b4545N3458L6020M804j4821j5220O986L6604j4779l5426j8961J842J7557
8576C3519M314k2111m1072K7871K2096J4393j9151k5284j5538j1325R514K5789
8564C015O691k2240j7121J0183J85L186k0911Q047L1905k562J0133O26p766K64
8550C635k5977k9803j953K9127K1860N261J1997M584j6973j9391J8079J8011n216
8537A3241Q82j6659j5427m216K079N226J143j0188K7918J1744j6394O5n843P400
8523I71j3194R953J805j2672J7029l438O07j7316Q212J8080K034r351o457J2021
$$ plain form
8614 -21186 -48145 -53495 -53309 -28779 -8820 -8308 -4372 12741 52256 44497 8515 -6626 -10027
8601 -10027 -779 -14357 -14204 -5202 -841 2433 14513 28026 25536 6596 -3529 -23535 -24545
8588 -24545 28913 64933 69737 54916 39696 46682 83286 68507 33081 14120 15962 33519
8576 33519 37833 15722 -25350 2521 24617 39010 19859 -5425 -20963 -32288 -22774 3015
8564 3015 9706 -12534 -29655 -19472 -19287 -16101 -37012 -28965 2940 378 10511 11137 3371 3635
8550 3635 -22342 -52145 -54098 -24971 -3111 2150 14147 18731 1758 -17633 446 18457 13241
8537 13241 14123 -2536 -17963 -22179 -20100 -14874 -13731 -23919 3999 15743 -651 -586 -6429 971
8523 971 -12223 -2270 -465 -13137 3892 454 1061 -16255 -8043 10037 12071 2720 -3737 8284
8509H284O63m2497R774J8628j9706j6650p298L049K5815J3960n153m828P229J182
8495g548J9244J9076k5532k0369O487J5610r121J335J6208Q070L072k7641l2718
8482c3827Q917Q494L2603K0461m4174l1035K015k223l367R781J5325Q002K696
8469f332j5500l4389Q670M5805J4481j9667j1621J2375K4682K1019l2235l422
8457C866j7263l0268O534J7983J6548j4178j6599m181J9117J8867K7391q030o908
8444A2879l912Q562p785r080Q905j4292Q047J1872K3533K8599j6412j5763k2861
8431A2292l1126Q21n34R058J0901l57J4490J0760K5274j4020J391J0095L839J0528
8417F3412k7896K735J1471l1153q158j1404N321L717N74L533j6812p983M87J6042
$$ plain form
8509 8284 8947 -33550 -23776 -5148 -24854 -41504 -48802 -45753 -19938 -5978 -11131 -15959 -8730 -7548
8495 -7548 11696 30772 5240 -15129 -8642 6968 -2153 -818 15390 23460 26532 -1109 -33827
8482 -33827 -24910 -16416 16187 36648 -7526 -38561 -36546 -38769 -42136 -32355 -17030 -9028 -6332
8469 -6332 -21832 -56221 -47551 -1746 12735 -6932 -18553 -6178 18504 39523 7288 3866
8457 3866 -13397 -43665 -37131 -19148 -2600 -16778 -33377 -37558 -18441 426 27817 19787 12879
8444 12879 8967 17529 9744 664 9569 -4723 3324 15196 38729 67328 50916 35153 12292
8431 12292 -18834 -18013 -18547 -9489 1412 1055 15545 26305 51579 37559 38950 49045 52884 63412
8417 63412 35516 38251 49722 18569 10411 -993 4328 8045 8619 12152 -4660 -12643 -12156 3886
8403C886J8676j6070k8160K575J3466M092K3016j1751j1974k729r898q044l1873
8390e4788j3951K8991L1469O844r660J8973N3669Q009p130k0899o462j7990q098
8377H977r777J4638q813q852j568j2109J4348J2301m916j1052l0601l9363J6906
8364e9881K3432J7040j2721j8712M061R934M8715m311J0005L4699Q398l8522j9227
8351B910J1920j1526j9148r770L521J0771j3122k5753K2031K2018P754J6501J8001
8338C6108r810l8723k9750K9109M0782K1088K844k6878Q328R054r671j4349j4082
8325D050J5084o061N787j4569j7327j0939m608K931L5255J8919r631j4660J4736
8312A8967j1689m418k1044K6810L6274K171j1354j9946l6125j7969j2889K052
$$ plain form
8403 3886 22562 6492 -21668 -19093 -5627 -1535 21481 9730 -2244 -4973 -14871 -22915 -54788
8390 -54788 -68739 -39748 -8279 -1435 -11095 7878 61547 69556 62426 41527 35065 17075 8977
8377 8977 -800 13838 5025 -3827 -5395 -17504 -3156 9145 4229 -6823 -37424 -76787 -59881
8364 -59881 -36449 -19409 -32130 -50842 -46781 -36847 11868 7557 17562 52261 60659 22137 2910
8351 2910 14830 3304 -15844 -25614 -22093 -11322 -24444 -50197 -28166 -6148 1606 18107 36108
8338 36108 26298 -12425 -42175 -13066 27716 48804 51648 24770 33098 42152 32481 18132 4050
8325 4050 19134 13073 18860 4291 -13036 -23975 -28583 -25652 9603 28522 18891 4231 18967
8312 18967 7278 2860 -18184 8626 44900 47071 35717 15771 -20354 -38323 -51212 -49160
8300d9160k795J155K2876K9017N551K5041L4529P926j3579k5802k1768J6735P19
8287C0445N352P907l655Q6j6215l6549j7463K1698K4481L355p618j692k066j4561
8273f495j4298l47J5328Q881K9903Q278R943o263r68P896j7860l8984Q307J6021
8259A9342j2698k9409n552K2320K5791k851l5997K6411M1620j6982m5027p54K3604
8246I818J7213r624k8813J4357J3025N419l7656j7450J5583M0920J1425j7988
8234A6229q608K0999n3549j9815K8700L0928j6736j0434M031J484K7672j3019
8222G882j5168J6665J4386J1081j2869K3867p74l031j1700j8197l987j0019n2815
8209e4679K2180K1238J0140L5088O693o496L0346L0449j4942m6825M098O799l5122
$$ plain form
8300 -49160 -51955 -50800 -27924 1093 6644 31685 66214 74140 60561 34759 12991 29726 30445
8287 30445 35797 43704 40049 40135 23920 -12629 -30092 -8394 16087 19442 11824 10132 8066 -6495
8273 -6495 -20793 -21140 -5812 3069 32972 41250 51193 44930 43962 51858 33998 -4986 3321 19342
8259 19342 6644 -22765 -28317 -5997 19794 16943 -19054 7357 48977 31995 -13032 -13786 9818
8246 9818 27031 17407 -11406 2951 15976 21395 -16261 -33711 -18128 22792 34217 16229
8234 16229 7621 28620 -24929 -44744 -16044 14884 -1852 -12286 -8255 -6771 20901 7882
8222 7882 -7286 9379 23765 34846 21977 45844 45070 42039 30339 12142 8155 -1864 -54679
8209 -54679 -32499 -11261 -1121 33967 40660 34164 64510 94959 80017 33192 37290 44089 8967
8196H967l531m797k185K530K5454J0016k630l2301k0554j1966p078L1784P044
8183G53p190J8734j6771j091k8933p653J8951j5361J4874j5992j6842K0735N349
8170c0437J4500J5259j2376J4866n726J2218j413J1257K8536n730j6761L3532
8158E7725o345m1232J7464m137l81k4802k0772L280n88p866j2806J9469N1157
8145C0166L227l1841l2348k3474P709L459k987J7962K8257J019N056L2157j830
8132C6532r810k1031J2446m939j6392n669K7404J9709k1200L170j0698n1706l2661
8119g4845J3096K6344L904p41L907J3472j5054l7362M748P631J2341p392j1025
8106f0976J875Q574J1128J9403K6589J4962n533N2N122n061J9338k097R248l863
$$ plain form
8196 8967 5436 639 -1546 984 26438 36454 33824 1523 -19031 -30997 -38075 -6291 753
8183 753 -6437 12297 -4474 -5565 -34498 -42151 -23200 -38561 -23687 -39679 -56521 -35786 -30437
8170 -30437 -15937 -678 -13054 1812 -3914 8304 6891 18148 46684 40954 24193 57725
8158 57725 51380 10148 27612 23475 23094 -1708 -22480 -19200 -19788 -27654 -40460 -20991 30166
8145 30166 33393 1552 -30796 -54270 -46561 -43102 -46089 -28127 130 1149 6205 38362 36532
8132 36532 26722 5691 18137 13198 -3194 -8863 18541 38250 17050 20220 9522 -42184 -74845
8119 -74845 -61749 -35405 -31501 -32242 -28335 -14863 -29917 -67279 -62531 -54900 -42559 -49951 -60976
8106 -60976 -59101 -50527 -39399 -19996 6593 21555 16022 16074 21196 16135 35473 33376 42624 38761
8092C8761l3557k9380k8635J7864L6630L9384K983l4819J3254J9330J8676q075
8080E2416P577j819j1613j6353R662m975m0311r506L796j4536r698J3926J5056
8067f378P911M8635j3424k6220o676k0591j7017J795R397q914P126L4924k1150
8054a0582j7092J4330o976j4210k461J269l773j4078J2447j8009Q872L1034k103
8041b1332J0737J1984J3472M538k1159k2025L083M354R212J502o662K378J3250
8028C332K9633J1274k2694j8619L711J0316j9846j3106j6276J4344J3720m513
8016h724l4800k9812k0297L5581M908J5951J8622q411j2982J9116K8009K0090
8004B7251J7988l388k6368k0264R507j3409J147J4289N336k7606J5315R967j4849
$$ plain form
8092 38761 5204 -24176 -52811 -34947 1683 41067 44050 9231 22485 41815 60491 52416
8080 52416 59993 58174 46561 30208 39870 34895 -5416 -14922 -11126 -25662 -35360 -21434 -6378
8067 -6378 1533 50168 36744 10524 3848 -16743 -33760 -31965 -22568 -31482 -24356 10568 -10582
8054 -10582 -27674 -13344 -20320 -34530 -36991 -35722 -39495 -53573 -41126 -59135 -50263 -19229 -21332
8041 -21332 -10595 1389 14861 19399 -1760 -23785 -20702 -16348 -7136 -5634 -12296 -9918 3332
8028 3332 32965 44239 21545 2926 6637 16953 -2893 -15999 -32275 -17931 -4211 -8724
8016 -8724 -43524 -73336 -93633 -58052 -53144 -37193 -18571 -26982 -39964 -20848 7161 27251
8004 27251 45239 41851 15483 -4781 4726 -8683 -7536 6753 12089 -15517 -202 9765 -5084
7991e084K912M106J6738M184r916k1083n1119P581J3168J4790M88j7650O125R786
7977b4974k6934J2656K1960j655K694M2122m0410l4732O004J0864L43J911n804
7964c5955K2811L4585J7310J440l2396j2009r777J0190j392n273j0423j2500p943
7951d1332K3691L3227j333k6635K730O713j0669J8911J2940j5595k2182K2327
7939B793R089k5336J1564M441n852j4648j748N910J5689J010j3390o480m236M5708
7925B4514P485j2839K0805k970k5682J207k2115J6985K198J604j4658j5244n474
7912b4184j3652K8252J4491J407J088l2751k6054J0174L0330K583j1190J4289
7900e217J2101l4120K5343J7853k7161k1650o578M400r395R050l967O706j7909
$$ plain form
7991 -5084 -2172 1934 18672 22856 12940 -8143 -59262 -51681 -38513 -23723 -23235 -40885 -34760 -24974
7977 -24974 -51908 -39252 -17292 -18947 -16253 25869 -14541 -49273 -43269 -32405 -32062 -30151 -35955
7964 -35955 -13144 21441 38751 40191 7795 -4214 -13991 -3801 -5193 -10466 -20889 -33389 -41332
7951 -41332 -17641 15586 14253 -12382 -9652 -2939 -13608 5303 18243 2648 -19534 2793
7939 2793 11882 -13454 -1890 2551 -3301 -17949 -19697 -13787 1902 2912 -10478 -16958 -21194 24514
7925 24514 31999 19160 39965 36995 11313 12520 -9595 7390 9588 11192 -3466 -18710 -24184
7912 -24184 -37836 -9584 4907 6314 7402 -25349 -51403 -41229 -10899 -8316 -19506 -5217
7900 -5217 6884 -27236 -1893 15960 -11201 -32851 -39429 -35029 -44424 -35374 -39341 -32635 -50544
7887e0544q46l510K6873J8836M154o89K0756j6841K055j256L946J4170K181J843
7873B1128R481j6171m7331J547L0929j4067l3640J0164K6113J1241j0581J5908
7861D721Q421j5566N865j1027K0508N440q822l2094k2469O242j3040J670J1111
7848c9040Q361J1209J6337p693l640l031L829L4777j2151k6454K6215Q065m1881
7835b5097P372K743L041k0879K4798N2547o923l437k8918J0202J1788M170l7792
7822f385J9652j2364k7144k915J3649K498L891Q644j3778k1412p651K2338L533
7809a7444j8690J2672P726J1798j007N55m801J2385j9497q37l564j6537j787j1615
7795e0643N344J5463j1484R55j2998o604J7091J0828K1827L848M469K8779j3011
$$ plain form
7887 -50544 -51390 -54900 -28027 -9191 -5037 -5726 15030 -1811 244 -1012 2934 17104 19285 21128
7873 21128 30609 14438 -32893 -31346 -417 -14484 -48124 -37960 -11847 -606 -11187 4721
7861 4721 13142 -2424 3441 -7586 12922 18362 9540 -22554 -45023 -38781 -51821 -50151 -39040
7848 -39040 -30679 -19470 -3133 -10826 -14466 -17497 -13668 21109 8958 -17496 8719 16784 -25097
7835 -25097 -17725 -14982 -11941 -32820 -8022 44525 37602 34165 5247 15449 27237 31407 -6385
7822 -6385 13267 903 -26241 -29156 -15507 -13009 -9118 -474 -14252 -35664 -43315 -20977 -17444
7809 -17444 -36134 -23462 -15736 -3938 -4945 -4390 -9191 3194 -16303 -17140 -20704 -37241 -39028 -50643
7795 -50643 -45299 -29836 -41320 -40365 -53363 -59967 -42876 -32048 -10221 -6373 -1904 26875 13864
7782A3864l1782P910J5403J2036l7651q307K1205O60o383J7243L520l057J8327
7769B2988J5044p814l3929m0778J7886K2769M096J1099L282J3058m554m200k867
7756A6080m7931k4187O124L7415K23m408j916J3199K0635l643j3573j6744L713
7743a5013l0016q650J6943J7080J3835K2955j7215J0128L10l2112k4689K2548
7731b3896L0031J1527p866k4816l4346n775L6974J5565k1893j4306R336K4370
7719e095m28J0086j4819m569P3J0092J5138k3082j1984P924j3849k0457j4488
7706f5458j4886O865j2350M1230L1102J268k5071j0528J9467J7955n560k0195
7694c6161K2375L2974k0401k3594q56J1024J8635Q290k4223j0185J3821j2793
$$ plain form
7782 13864 -17918 -10008 5395 17431 -20220 -28527 -7322 -6662 -13045 4198 7718 4661 22988
7769 22988 38032 30218 -3711 -44489 -26603 -3834 262 11361 14643 27701 23147 18947 16080
7756 16080 -31851 -56038 -49914 -12499 -12276 -16684 -18600 -5401 15234 11591 -1982 -18726 -15013
7743 -15013 -45029 -53679 -36736 -19656 -5821 17134 -81 10047 10357 -21755 -46444 -23896
7731 -23896 6135 17662 9796 -15020 -49366 -55141 -18167 -2602 -24495 -38801 -29465 -5095
7719 -5095 -5523 4563 -10256 -14825 -14752 -4660 10478 -12604 -24588 -16664 -30513 -50970 -65458
7706 -65458 -80344 -73479 -85829 -44599 -13497 -12229 -37300 -47828 -28361 -10406 -15966 -36161
7694 -36161 -13786 19188 -1213 -24807 -25663 -14639 3996 12286 -11937 -22122 -8301 -21094
7682b1094q753J4885M654K8220J4072J1345m1971l9491J3886J1835j097L004Q934
7669a571J1231n138K0944k628j2110J3498K3687k5163n1698o758K3847j8083K4479
7656e463M159l410K4381K8538k5583l1694k1402j7328J747N464k1079K4531K2163
7643a4976q809j9245J8305o725K92L035L786Q942j5148J4823K7426j198J6865
7630B7373j5786k5593k8461j4752l051J7081O425m18r720p020O356J7086j8439
7617d8919j596J8023J593J0930J949L5689K86J8787Q565j981L7085K0826o8631
7604C2606m6575k3595m0560n190K929p295J7656J9699L7899Q396n333l1263N012
7591c5614Q250J7920n647q485l564K309r772M529K862j1846K0997r676k7888j865
$$ plain form
7682 -21094 -29847 -14962 -10308 17912 31984 43329 1358 -38133 -24247 -12412 -13509 -10505 -1571
7669 -1571 9660 4522 25466 22838 10728 24226 47913 22750 -28948 -35706 -11859 -29942 -5463
7656 -5463 -1304 -4714 19667 48205 22622 -9072 -30474 -47802 -46055 -40591 -61670 -37139 -14976
7643 -14976 -23785 -43030 -24725 -31450 -31158 -28123 -24337 -15395 -30543 -15720 11706 10508 27373
7630 27373 11587 -14006 -42467 -57219 -60270 -43189 -36764 -37182 -46902 -53922 -47566 -30480 -48919
7617 -48919 -50515 -32492 -30899 -19969 -18020 17669 17955 36742 45307 43326 80411 101237 32606
7604 32606 -13969 -37564 -78124 -83314 -80385 -87680 -70024 -50325 -12426 -4030 -9363 -40626 -35614
7591 -35614 -27364 -9444 -15091 -23576 -27140 -24831 -34603 -30074 -27212 -39058 -18061 -27737 -55625 -57490
7577e7490j1023M968P051K0458K3968j0635j3073K9926K0436r115k3524o558J8798
7564e813o91P510j6115J1695m311k5364J4276K2512K3791l597j9780j341J4853
7551A7625L4172K4972M476j9066l8567l4162l1090K2567K4691n98R815J8424r325
7538B3934q487r001l498Q578o803p52N132J1652J8075J285m0648k6908j1711P594
7524c1558K3007j101J1703J507p508l4620J5443K2840j0327k2365O096L9217J0252
7511B2586P160j3033j2879j8037k2691k4174n351L7204K0560j3366k326M2753
7499A8406J0706j7424k7879r793J8592Q527J1549k3299o271Q153Q032K8125J4108
7486D1532K028l8358k2843K4887J1710j6000m907O89m622j768J3736r764k2934
$$ plain form
7577 -57490 -68513 -63545 -56494 -36036 -12068 -22703 -35776 -5850 14586 5471 -18053 -24611 -5813
7564 -5813 -6504 1006 -15109 -3414 -7725 -33089 -18813 3699 27490 23893 4113 2772 17625
7551 17625 51797 76769 81245 62179 23612 -10550 -41640 -19073 5618 5020 14835 33259 23934
7538 23934 15447 6446 2948 11526 4723 3971 9103 20755 38830 40115 -533 -27441 -39152 -31558
7524 -31558 -8551 -9652 2051 3558 -3950 -38570 -23127 -287 -10614 -32979 -26883 12334 22586
7511 22586 29746 16713 3834 -14203 -36894 -61068 -66419 -29215 -8655 -22021 -24347 18406
7499 18406 29112 11688 -16191 -25984 -7392 1135 12684 -10615 -16886 -8733 -701 27424 41532
7486 41532 43560 5202 -17641 7246 18956 2956 -1951 -1262 -5884 -7652 6084 -3680 -26614
7473b6614J228K3923J2312m736k7152Q746J5519J1262j5223o806K5843J5505p07
7460C3100J7817j5363J5810r28k6201j4882j2978l742j1040K1034k1595j3942
7448c2910j6946N580j4698K4430J5574K4766k8686j1475J4875j257M168p211n560
7435b9350k860j2510j6592j0073k612M771O437K2056k017O303j5760K8694k416
7422b5929L823J1066M193Q936q049j1968m765j3788O335q304j6160J002M4540
7409i068J9344k5792l7135O572J8413K0754l970l39L474r360n012p10j6621J7234
7395b2216J6368j1491J888J647j0486k0496J0545J2291J3266Q040l107j330M247
7382h34J8807k3792l774K2612R480K3081k367j3727r862K3586J3130k3517j9096
$$ plain form
7473 -26614 -25386 -1463 10849 6113 -21039 -12293 3226 14488 -735 -7541 18302 33807 33100
7460 33100 50917 35554 51364 50436 24235 9353 -3625 -7367 -18407 2627 -18968 -32910
7448 -32910 -49856 -44276 -58974 -34544 -18970 5796 -22890 -34365 -19490 -20747 -16579 -23790 -29350
7435 -29350 -32210 -44720 -61312 -71385 -73997 -69226 -62789 -40733 -42750 -36447 -52207 -23513 -25929
7422 -25929 -22106 -11040 -6847 2089 -5960 -17928 -22693 -36481 -30146 -38450 -54610 -53608 -9068
7409 -9068 10276 -15516 -52651 -46079 -27666 -6912 -10882 -11221 -7747 -17107 -22119 -22829 -39450 -22216
7395 -22216 -5848 -17339 -15451 -13804 -24290 -44786 -34241 -21950 -8684 -644 -3751 -5081 -834
7382 -834 17973 -5819 -9593 13019 22499 45580 43213 29486 19624 43210 56340 32823 13727
7369A3727R828J915O328M870j936l448k6850k1516R746l561K106l004k401k336
7355a6532J0182J4506n639n552r336J1269j1436K566k3194p187n71L3052o579
7342a4451j64J7327P194n85j7551N379q160l0877j4925r63K5798M3512k565k3833
7328a4864J0016j7884J8558L5629j6040P872j745j3118k5512l717J9072p496k2583
7315c1812l181K4166L1009J7763j8013k1680J6536j5014l8420K1112P433j577
7303a1678L8502m86K7801K4514k2956j5847K0460J1743k0445j3663j6869k0575
7291E01L611p550N595l0814l6966p036M4675M0773p119L276m400k2845K0141K1853
7277B3695Q41L3062r399J0382J8113N648r930j3082n2470l0018P296P312J3788
$$ plain form
7369 13727 23555 25470 31798 36668 34732 31284 4434 -17082 -7336 -10897 -8791 -11795 -14196 -16532
7355 -16532 -6350 8156 2517 -3035 -12371 -1102 -12538 -9972 -33166 -40353 -40924 -7872 -14451
7342 -14451 -14615 2712 9906 9321 -8230 -2851 -11011 -41888 -56813 -57776 -31978 11534 8969 -14864
7328 -14864 -4848 -22732 -4174 31455 15415 23287 21542 8424 -17088 -20805 -1733 -9229 -31812
7315 -31812 -34993 -10827 20182 37945 19932 -1748 14788 -226 -38646 -17534 -10101 -11678
7303 -11678 26824 26338 54139 78653 55697 39850 60310 72053 51608 37945 21076 501
7291 501 4112 -3438 2157 -28657 -65623 -72659 -27984 12789 5670 8946 4546 -18299 1842 23695
7277 23695 24536 57598 48199 58581 76694 82342 72412 59330 6860 -23158 -15862 -8550 5238
7264E238l853l138N444n258k5066j4319L5685L8707k3075j7023J435j5436k1281
7251d1940J968O709Q036Q572J3140J4679J7122k2066o043o176n028O228l5282
7238d0081m15M528o486R679J1311p122j6234R863J7348K0853k17j5894k6221J0241
7224b8847q172m927J0053m930J3200K0676k0938k1585j815n370j8K2388o277k315
7210c8877J1413J1579J4185K3498j1057N513K035j4679N416J3916l3668j2069
7198b2795M663r327R861r217j1470J9356L2491J8705m391P845p47m3725m306j1042
7184b4099J0007K5150K1407J0498k4851r044J1790L561k0138k4034R91P276j5324
7171b6810N89L5510J7415l6154p430K383J6476J1918k0886k5360j2718r241K4380
$$ plain form
7264 5238 1385 -1753 3691 -1567 -26633 -40952 -5267 33440 10365 -6658 -5223 -20659 -41940
7251 -41940 -39972 -33263 -25227 -16655 -3515 11164 28286 6220 177 -5999 -11027 -4799 -40081
7238 -40081 -40496 -35968 -42454 -32775 -21464 -28586 -44820 -34957 -17609 3244 3027 -12867 -39088 -28847
7224 -28847 -37019 -41946 -31893 -36823 -23623 -2947 -23885 -45470 -47285 -52655 -52673 -30285 -36562 -38877
7210 -38877 -27464 -15885 -1700 21798 10741 16254 18289 3610 9026 22942 -10726 -22795
7198 -22795 -18132 -27459 -17598 -26815 -38285 -18929 13562 32267 27876 35721 34974 -8751 -13057 -24099
7184 -24099 -14092 11058 32465 42963 18112 9068 20858 24419 4281 -19753 -18762 -11486 -26810
7171 -26810 -26221 9289 26704 -9450 -16880 -14497 1979 13897 -6989 -32349 -45067 -54308 -29928
7158b9928l049Q798J8929L050k237j377L562J8807L5242k22k2002K248j125J0288
7144D0984m0790k0781k03R351J9390P900o999J9851j1708k9488q730J349K2343
7131B469r074L182Q562L362l300J0228J5204k5944m705r257j4130j9554p697l781
7117e4435j2939j257L2752L9903j65K1763k821l1495k0814J6825L7644j4212l5195
7104b4446l5874m565L2430J559q08l979K4480L1573n410m9512j7522L1586K9649
7091I161l360n49o890k4336J4072o708J0458M905p598J0883J0592P291Q079l9244
7077a3244k6946K7101M1991K2964n896q924K5361j7179m132M878p131j1710j3705
7064A3428j3211k6538q578l413Q045J9258R754J1632j6489J5870J7154r497r085
$$ plain form
7158 -29928 -32977 -24179 -5250 -2200 -4437 -5814 -2252 16555 51797 51575 29573 31821 30696 40984
7144 40984 194 -20587 -20790 -11439 7951 15851 8852 28703 16995 -12493 -21223 -19874 2469
7131 2469 -6605 -3423 5139 8501 5201 15429 30633 4689 -16 -9273 -23403 -42957 -50654 -54435
7117 -54435 -67374 -68631 -35879 4024 3859 25622 22801 -8694 -29508 -12683 24961 10749 -24446
7104 -24446 -60320 -64885 -32455 -30896 -31704 -35683 -11203 20370 14960 -34552 -52074 -20488 9161
7091 9161 5801 5252 -1638 -25974 -11902 -18610 -8152 -3247 -10845 38 10630 17921 26000 -13244
7077 -13244 -40190 -13089 28902 51866 45970 37046 62407 45228 41096 45974 38843 27133 13428
7064 13428 217 -26321 -34899 -38312 -30267 -11009 -1255 10377 -6112 9758 26912 17415 8330
7051H330j7438j183J1438j7261m666J5525Q816K3963L2492j1039l2598l1040r965
7038b4626j2950O5464J8041l1826m6470k7816J409P8J5918J0762k6077l7984j07
7025i6184L1382M1111J729J7665L506l7623K0889K4337j8148K5515L720k6895
7013h996k6789M531K0026k7814R078p751k2608O717K5531J8446j0341j4748M63
7000c4255r550J3816K724R421R219O882J2569J5608j3770l9583J5971M666q153
6987a4435l0439K4991K5314j9268m6471j610L7360J9929O450P577q594r775P530
6974a441j2367k0298J9359J7795r959J1538J8340m320n990j071j3038L292K4770
6961B6610k7687l0602j5899j572K9036K1689j3553j2597K1869K4078k1679j333
$$ plain form
7051 8330 -9108 -10291 1147 -16114 -20780 -5255 3561 27524 60016 48977 16379 -14661 -24626
7038 -24626 -37576 27888 45929 14103 -32367 -60183 -58774 -58696 -42778 -32016 -58093 -96077 -96184
7025 -96184 -64802 -23691 -21962 -4297 -791 -38414 -17525 6812 -11336 14179 17899 -8996
7013 -8996 -35785 -31254 -11228 -39042 -29964 -37715 -60323 -53606 -28075 -9629 -19970 -34718 -34255
7000 -34255 -43805 -29989 -27265 -17844 -8625 -1743 10826 26434 12664 -26919 -10948 -6282 -14435
6987 -14435 -44874 -19883 5431 -13837 -60308 -61918 -24558 -4629 1821 9398 804 -8971 -1441
6974 -1441 -13808 -34106 -14747 3048 -6911 4627 22967 18647 12657 11586 -1452 1840 26610
6961 26610 -1077 -31679 -47578 -49150 -20114 1575 -11978 -24575 -2706 21372 -307 -1640
6949a640J1313l0241j8752J425R51J1950k7567j2819P236J7802K2273n787J9972
6936c884J7912L0996l2553l231J4505L24o165j1913o481k1224N612O239l7808
6923d7671L35K4848J0254n795j1488M663o529j6532r256J6308K803Q34J5302Q935
6909a2989n398J6948o75N843j7350k5161r597J9569q680nK7770K0206l1714m9645
6895g0878k1558J1944L3518K1530K1449j2326l6271O472N0156J3263l468Q056
6883B1887j1966J7310Q050r459j2810j4232k0430p306N038L3875K4955k1883J1432
6870B4461j8527l9060o574L3219J8109k0228r316K6047n725k5132K406J6338N912
6857A930P236L9107J9605l2059k1936j7050J124N298K109j6725l1417j3946K53
$$ plain form
6949 -1640 9673 -20568 -39320 -37895 -36944 -24994 -52561 -65380 -58144 -40342 -18069 -23856 -3884
6936 -3884 14028 45024 12471 9240 23745 24069 17904 5991 -490 -21714 -16102 -9863 -47671
6923 -47671 -47336 -22488 -12234 -18029 -29517 -24854 -31383 -47915 -57171 -40863 -38060 -37226 -21924 -12989
6909 -12989 -18387 -1439 -2114 3729 -13621 -38782 -48379 -28810 -37490 -37495 -9725 10481 -21233 -70878
6895 -70878 -92436 -80492 -46974 -25444 -3995 -16321 -52592 -46120 4036 17299 13831 21887
6883 21887 9921 27231 35281 25822 13012 -1220 -21650 -28956 -23918 9957 34912 13029 24461
6870 24461 5934 -33126 -39700 -6481 11628 -8600 -17916 8131 2406 -22726 -20320 -3982 1930
6857 1930 9166 48273 67878 35819 13883 -3167 -2043 3255 5364 -11361 -42778 -56724 -56471
6844e6471P312J2001M117L664p504Q79R220j3266j0314J7367P523k2851K0093
6831b8230j5836M288P322K2826J2270J1784o148j4085o924N037o535q436N974
6818a6693L578N907r929p816M177K2584N767j5382j1646j2978k6837M49N315L2634
6804b0870J1333J6973K7307j1570N755J2226J982q076k3322J0173q593p100p351
6791a133j2925M555J5590j1586j072p365K1433J9611K3607j0858K1508J7593l0379
6778D8579k6976m202L318j6313k4276m3146l1061j3784L1719L0439J4732r743
6766d0714P643K6925o900k7749j926N697Q708n27J7168K0047J1032j3577j4155
6753h328J3350Q650j0140N83j4771l3921l2272R159M1472o23o919K2552L0088
$$ plain form
6844 -56471 -49159 -37158 -33041 -29377 -36881 -36002 -26782 -40048 -50362 -32995 -25472 -48323 -28230
6831 -28230 -44066 -39778 -32456 -9630 2640 14424 8276 -5809 -12733 -7696 -14231 -22667 -16693
6818 -16693 -13115 -7208 -17137 -24953 -20776 1808 7575 -7807 -19453 -32431 -59268 -58819 -53504 -20870
6804 -20870 -9537 7436 34743 23173 28928 41154 43136 35060 11738 21911 13318 6218 -1133
6791 -1133 -14058 -9503 6087 -5499 -6571 -13936 7497 27108 50715 39857 61365 78958 48579
6778 48579 21603 17401 20719 4406 -19870 -63016 -94077 -107861 -76142 -45703 -30971 -40714
6766 -40714 -33071 -6146 -13046 -40795 -42721 -37024 -28316 -28843 -11675 8372 19404 5827 -8328
6753 -8328 5022 13672 3532 4115 -10656 -44577 -76849 -67690 -26218 -26841 -33760 -11208 18880
6740A8880j3512j7461R009P137J5914j2157n851j3928Q75j784K2116n757J0251
6727A3732J4849o201m062o264j3496k1705o277K6911j3675J134R447q28l1611
6714c8046M1880L1091N650l985j585k7379L209m732L291l1211K102J0509j561
6701a0767M800K4610J6460j0064N587J4988k3650k578k2171k2131j0273M766L0577
6688A54k848j1879m431J7858J0565k497r018J3710J5112N956q743L574k5011R07
6674C409J4548k591n644j8129Q754r49l7635K5235Q023m168R138k4982j0652j4855
6660e0498J9105N409o380q186p705K0422J8857J379o530L0433o995k2849p34J5896
6646A624K1532L240O630J5558r727j8186l2796l6214r381l3550K1256K3962K1682
$$ plain form
6740 18880 5368 -12093 -3084 4053 19967 7810 1959 -11969 -11094 -12878 9238 3481 13732
6727 13732 28581 22380 18318 12054 -1442 -23147 -29424 -2513 -16188 -15054 -5607 -6435 -38046
6714 -38046 3834 34925 40575 36590 35005 7626 10835 6103 9394 -21817 -19715 -9206 -10767
6701 -10767 -5967 18643 35103 25039 30626 45614 21964 19386 -2785 -24916 -35189 -30423 154
6688 154 -2694 -14573 -19004 -1146 9419 6922 -2096 11614 26726 32682 23939 27513 2502 3409
6674 3409 17957 15366 9722 -8407 347 -602 -38237 -13002 -4979 -9147 -9 -24991 -35643 -50498
6660 -50498 -31393 -25984 -32364 -40550 -48255 -27833 -8976 -7597 -14127 16306 9311 -13538 -14272 1624
6646 1624 23156 26396 33026 48584 38857 20671 -12125 -48339 -57720 -91270 -70014 -46052 -24370
6633b4370l2548m543L2272M1866J0555j9983j4970n740N446K3298o352m40n843
6620a352J8370m414J5759j8311q205K9385j3407j0705N985k4771m1636K8975L6556
6607A2229J8608N927j474p935k6355n161J4488j7797J0595k6092n242M133o292
6594c0368O976J9577j0112n069J4714j8212K4430L4404j5276k0980J5246m134
6582A1196o771o818o20n343K4543j1160j7238J733p476n399K9812R599N857j4870
6568G045j3340R234L426J2569Q193J5581l975k6511k739j5601J9602r123N554
6555I915J0320j3859j4244J1600l862J2365J1258j1632P541o445l828j0150L722
6542B701j3738j2266j028J5515J7034j9967k5565R98J6238K7629J2067m128J1959
$$ plain form
6633 -24370 -56918 -61461 -29189 12677 23232 3249 -11721 -17461 -12015 11283 4931 4491 -1352
6620 -1352 17018 12604 28363 10052 1847 31232 17825 7120 13105 -11666 -53302 -24327 12229
6607 12229 30837 36764 35290 27355 1000 -4161 10327 -7470 3125 -22967 -28209 -24076 -30368
6594 -30368 -23392 -3815 -13927 -18996 -4282 -22494 1936 36340 21064 84 15330 11196
6582 11196 4425 -2393 -3013 -8356 16187 5027 -12211 -10478 -17954 -23353 6459 16058 21915 7045
6568 7045 -6295 2939 6365 18934 27127 42708 38733 12222 9483 -6118 13484 4361 9915
6555 9915 20235 6376 -7868 3732 -130 12235 23493 11861 19402 12957 9129 -1021 2701
6542 2701 -11037 -23303 -24331 -8816 8218 -11749 -37314 -36316 -20078 7551 19618 15490 27449
6529B7449m022M839j5697l2988Q219J948O718K7894J1675k0794p856Q35k75k162
6515E783k3933P801J4381M2197R184m6348k467J6045j856l0882j1883k7064j74
6502d9216M50P274L1410O532j1513l8339j8612M0129L8413k8045l4959O625K719
6489d7132K6005L0317j153k589k9908k219L9845J7063p063l0945l2393l744J970
6476d1946q757k1537M352M9964N7830K3880j6031k5363p751K5502q256k8268l2859
6463b9240k0421J269J1251K2386K3607Q407j9774q218n050j8556K0140K3035j8345
6450i509k0940K5373L0840j434P425J9969N736l393l1369l63J2224k7689j5948
6437i078K7074K4245m3156j7389J1561K6780J2110j2847p73m687l998j5816k282
$$ plain form
6529 27449 23427 28266 12569 -20419 -12200 -10252 -3534 24360 36035 15241 7385 8220 7945 5783
6515 5783 -18150 -10349 4032 46229 55413 9065 6598 22643 20787 -10095 -21978 -49042 -49216
6502 -49216 -48766 -41492 -10082 -3550 -15063 -53402 -72014 -31885 6528 -21517 -56476 -49851 -47132
6489 -47132 -21127 9190 8037 5448 -24460 -26679 13166 30229 23166 -7779 -40172 -43916 -41946
6476 -41946 -50703 -72240 -67888 -17924 39906 63786 47755 22392 14641 40143 31887 3619 -29240
6463 -29240 -49661 -48392 -37141 -14755 8852 17259 -2515 -10733 -15783 -34339 -14199 8836 -9509
6450 -9509 -30449 -5076 25764 24330 31755 51724 57460 54067 22698 22335 34559 6870 -9078
6437 -9078 17996 42241 -915 -18304 -6743 20037 32147 19300 18527 13840 9842 -5974 -8256
6424h256m1917j8799J3925j4572j4635J8781R099N038N756O316j6339J0351k3242
6411f8494j735M6377L4961k764K02k8731M020L1885J3271j1559N676j6655k5835
6398a9381o403K3964L6731J4070J0148q48l6098k2680k0898K7223M7850m178q102
6385D1398n724j2319n739k3922j0720n94k7330K5652K6935l303m0103J8819L7255
6372B0305O066j6000o632J475o052J5895J6748k2166j3052J6552j1358j6794k633
6359a7646J1804o185q355J0057K9634J5329M864r448j2445k4027k4527k075K5374
6346g646J2082j3372l611J063M010K634R891j4361k1885j692P269j4827K212P840
6332c0393J5984M34J0672K053Q946K702m885l6594q556M159J5932J6974j3228
$$ plain form
6424 -8256 -50173 -68972 -55047 -69619 -84254 -65473 -56374 -51336 -45580 -39264 -55603 -45252 -68494
6411 -68494 -70229 -23852 11109 8345 8547 -20184 -16164 15721 28992 17433 23109 6454 -19381
6398 -19381 -25784 -1820 34911 48981 59129 58281 22183 -497 -21395 5828 53678 49500 41398
6385 41398 35674 23355 17616 -6306 -17026 -17620 -44950 -19298 7637 4334 -35769 -16950 20305
6372 20305 26371 10371 3739 5214 -838 15057 31805 9639 -3413 13139 1781 -15013 -17646
6359 -17646 -5842 -12027 -20382 -10325 19309 34638 39502 30054 17609 -6418 -30945 -33020 -7646
6346 -7646 4436 -8936 -12547 -11484 -7474 -4840 5051 -9310 -31195 -32887 -25618 -40445 -38233 -30393
6332 -30393 -14409 -13975 -3303 -1250 7696 10398 5513 -31081 -39637 -35478 -19546 -2572 -15800
6319a5800q668j5124r688K1752K9281J2219p849j7433j4414n613J9954o947j6317
6306c4647K3138j3908J2189K458k916k2349o039j4098N505J2317l094j7597Q21
6293e8220K3973J0979q889k7767J8178N3447L0275J400Q465R033l9538l1073q991
6280a8728J756J6452J5012J8134q303j1926J302J0329K26N887k953k5097k3780
6267b1689k7291J5830N115j7954o445J0227N471q027L295O158k4754k7839Q594
6254g9309R737K0894R636l241J9866M751r368r767J1666J7256K3954J4992m323
6241B6744j9428j1168k6813p541m67J5629J6917K1079J317L287N466q377o372
6228A0273K9772m185j060n848m747k38j0650m469j2674j1498R102J1833j0166
$$ plain form
6319 -15800 -24468 -39592 -49280 -27528 1753 13972 6123 -11310 -25724 -31337 -11383 -18330 -34647
6306 -34647 -11509 -25417 -13228 -10770 -13686 -36035 -42074 -56172 -50667 -38350 -41444 -59041 -58220
6293 -58220 -34247 -23268 -32157 -59924 -41746 11701 41976 43376 51841 60874 21336 -9737 -18728
6280 -18728 -16972 -520 14492 32626 24323 12397 13699 24028 24254 30141 27188 2091 -21689
6267 -21689 -48980 -33150 -28035 -45989 -52434 -42207 -36736 -44763 -41468 -35310 -60064 -87903 -79309
6254 -79309 -69572 -48678 -39042 -42283 -22417 -17666 -27034 -36801 -25135 -7879 16075 31067 26744
6241 26744 7316 -3852 -30665 -38206 -38673 -23044 -6127 14952 16269 19556 25022 16645 10273
6228 10273 40045 35860 34800 28952 24205 23967 13317 8848 -3826 -15324 -6222 5611 -4555
6215d555j9998k649K0613n554j3214m16N216J1286k376K8737L0173l197j4994
6202B9072K5402K6847k8758m430kj3948l1424j0574N309M56o196N031l4100l629
6188d0944L4667K4305J3618q46K0589l6739k822Q635J9737J337k7979N242j1468
6175G332J1364Q962j7735l3649k0732J896K2665K1344K572K9207N607n33K0085
6162E8385j362r752N766K542K612l4663r314J3564j7030j3319L3J6545Q34j727
6148A3114j3915k9826J0143R998J3033N275j0740Q35r980q810J5276l335K7381
6135A8449O574m165k9097J0054J0297j8251k0198j2462K0673J7885j0026q936
6123a9203q842k818q174O170P252K089j0653k459J4657j7461Q004J691M2851M643
$$ plain form
6215 -4555 -24553 -27202 -6589 -12143 -25357 -25773 -20557 -9271 -11647 17090 47263 44066 29072
6202 29072 54474 81321 52563 48133 48131 34183 2759 -7815 -2506 -2050 -8246 -3215 -37315 -40944
6188 -40944 -6277 18028 31646 30800 51389 14650 11828 20463 40200 41537 13558 18800 7332
6175 7332 18696 27658 9923 -23726 -44458 -42562 -19897 1447 4019 33226 38833 38300 58385
6162 58385 57023 47271 53037 55579 58191 23528 14214 27778 10748 -2571 -2538 14007 14841 13114
6148 13114 -801 -30627 -20484 -10486 2547 7822 -2918 -2083 -12063 -20873 -5597 -8932 18449
6135 18449 25023 20858 -8239 1815 12112 -6139 -26337 -38799 -18126 -241 -10267 -19203
6123 -19203 -28045 -30863 -39037 -32867 -25615 -23526 -34179 -36638 -21981 -39442 -31438 -29747 13104 17747
6109A7747K3092K755l1189J0561Q027k0290J5088J5381J1754k7748o3502j0012
6097d8336O591Q879K2264J0437r769j509O141M067L0291J3720k9353p816K655
6084H262J1030K1538j9221k0125r098R937q311j832J5895J8039q462n356J048
6071A3344k1367k5481j2009L307K8284L0855j878m162j010L1691O476k1398p528
6058A9124r118j6983j4187J4459K6223J5799j8947o212q19j4542l198k0168j8088
6045d6657N249j007m146L1625J1135J853m4866j2629M1174L0525m059o990j1950
6032a0743k052J3119k6964j132J4045j6318k6585J6498Q137l1892K7910M9293
6020A3316q540k1267K3386J1136j7603Q014q000r937J1149J681l0439P097K0119
$$ plain form
6109 17747 40839 43594 12405 22966 30993 10703 25791 41172 52926 25178 -38324 -48336
6097 -48336 -41745 -32866 -10602 -165 -9934 -11443 -5302 -1235 29056 42776 13423 5607 8262
6084 8262 19292 40830 21609 1484 -7614 2323 -5988 -7820 8075 26114 17652 12296 13344
6071 13344 -8023 -33504 -45513 -42206 -13922 16933 15055 10893 9883 41574 48050 26652 19124
6058 19124 10006 -6977 -21164 -6705 19518 35317 16370 10158 9339 -5203 -8401 -28569 -46657
6045 -46657 -41408 -42415 -46561 -14936 -3801 -1948 -46814 -59443 -18269 12256 8197 1207 -10743
6032 -10743 -12795 324 -26640 -27772 -13727 -30045 -56630 -40132 -31995 -63887 -35977 13316
6020 13316 4776 -16491 6895 18031 428 8442 442 -9495 1654 3335 -27104 -20007 112
6007A12L304J2642P657r219j073J1920m373j794j5324K0373j6826m84L2141R263
5993D8319j0834k7565j4008k67Q634k094K4653L1475N214n453l0573l1055j5473
5980a9027k6232k327j6020K1159L6089J0975l7115j6823Q349K3830J11J1346Q31
5967d854M894N58k4369K1060M1464L115o564m1K946q84j9490J111k906q847m375
5952B818J7395l982l836K2009J6143k3876j4099K110m889O57j7444q282j1472
5939b6748J5051k0447m329L0781L7326K4926l3453M658J3912k487l4919l663J2162
5926A2770J9267J406K253r944L563J6879j5024O693K2098o407J2945j0704l4106
5913B1689k8451J306k6197k0879L2356L4935Q244j4027k1008r448J2431o235k4395
$$ plain form
6007 112 3416 16058 23715 14496 13423 25343 20970 19176 3852 24225 7399 6915 39056 48319
5993 48319 37485 9920 -4088 -4355 4279 2185 26838 58313 63527 58074 27501 -3554 -19027
5980 -19027 -45259 -47586 -63606 -42447 -6358 4617 -32498 -49321 -40972 -17142 -17031 -5685 -4854
5967 -4854 40 598 -23771 -2711 38753 41868 35304 35263 38209 37325 17835 18946 16040 7193 2818
5952 2818 20213 16231 12395 34404 50547 26671 12572 14682 9793 10450 -6994 -15276 -26748
5939 -26748 -11697 -32144 -36473 -5692 31634 56560 23107 27765 41677 39190 4271 608 12770
5926 12770 32037 33443 35696 25752 29315 46194 31170 37863 59961 53554 66499 55795 21689
5913 21689 -6762 -5456 -31653 -52532 -20176 14759 23003 8976 -12032 -21480 -9049 -15284 -39679
5900c9679j1607j2337J2732J2915J9799L3704l158k0234k5510l654k8903n590
5888g1522O0680M8984j7562m6374M013l436J3550K231J3922J746p924n085K785
$$ plain form
5900 -39679 -51286 -63623 -50891 -37976 -18177 15527 12369 -7865 -33375 -37029 -65932 -71522
5888 -71522 -10842 38142 20580 -25794 -21781 -25217 -11667 -9436 4486 6232 -1692 -6777 -3992
$$ [...]
##END NTUPLES=NMR SPECTRUM
##END=
