##TITLE=Analysis number 325621
Compound Code km 06801
Book Reference 130549
Project Code adrs fraglib
Chemist Name jom
##JCAMPDX= 6.0         $$ Bruker NMR JCAMP-DX V2.0
##DATA TYPE= NMR SPECTRUM
##DATA CLASS= NTUPLES
##ORIGIN= Bruker BioSpin GmbH
##OWNER= nmr
$$ XWIN-NMR		Version 3.5
$$ Fri Jan  5 09:45:52 2007 GMT Standard Time (UT+0h)  MAYBRIDGE\nmr@NMR_250MHZ
##.OBSERVE FREQUENCY= 250.131544655141
##.OBSERVE NUCLEUS= ^1H
##.ACQUISITION MODE= SIMULTANEOUS (DQD)
##.ACQUISITION SCHEME= undefined
##.AVERAGES= 16
##.DIGITISER RES= 18
##SPECTROMETER/DATA SYSTEM= dpx250
##.PULSE SEQUENCE= zg30
##.SOLVENT NAME= DMSO
##.SHIFT REFERENCE= (INTERNAL, DMSO, 0, 16.522)
##AUDIT TRAIL= $$ (NUMBER, WHEN, WHO, WHERE, WHAT)
$$ ##TITLE= Audit trail, XWIN-NMR		Version 3.5
$$ ##JCAMPDX= 5.01
$$ ##ORIGIN= Bruker BioSpin GmbH
$$ ##OWNER= nmr
$$ C:\u/data/dgb/nmr/ADRS/370/pdata/1/auditp.txt
$$ ##AUDIT TRAIL=  $$ (NUMBER, WHEN, WHO, WHERE, WHAT)
(   1,<2007-01-05 09:45:30.34 +000>,<MAYBRIDGE\nmr>,<NMR_250MHZ>,
      <created by zg, POWCHK disabled, PULCHK disabled
       configuration hash MD5:
       49 4B E0 1D 92 C2 6B 37 9F E6 65 BC 52 41 86 1D
       data hash MD5: 64K
       31 63 30 63 3E 3D 65 5E 7A EA 78 16 62 31 FB B7>)
(   2,<2007-01-05 09:45:42.40 +000>,<MAYBRIDGE\nmr>,<NMR_250MHZ>,
      <Start of raw data processing
       ef LB = 0.3 FT_mod = 6 PKNL = 1 SI = 32K 
       data hash MD5: 32K
       B2 05 D7 40 71 B1 FE 1B 03 A2 4B 89 1C 68 F3 D5>)
(   3,<2007-01-05 09:45:44.01 +000>,<MAYBRIDGE\nmr>,<NMR_250MHZ>,
      <apk 
       data hash MD5: 32K
       E1 21 B1 D6 BC F2 20 00 77 23 A1 36 15 CA AD FA>)
(   4,<2007-01-05 09:45:44.71 +000>,<MAYBRIDGE\nmr>,<NMR_250MHZ>,
      <abs ABSG = 5 
       data hash MD5: 32K
       2D 96 72 BD C1 3A B4 6A E5 D9 18 85 93 AA C8 97>)
$$ ##END=
$$ 
$$ hash MD5
$$ 59 BB 2E 48 69 3A 0B A7 40 FF 4F A9 4E 75 92 38
##$RELAX= 
##$RELAX= 
##$RELAX= 
##$RELAX= 
##$RELAX= 
##$RELAX= 
##$RELAX= 
$$ Bruker specific parameters
$$ --------------------------
##$DU= <C:\u>
##$EXPNO= 370
##$NAME= <ADRS>
##$PROCNO= 1
##$TYPE= <nmr>
##$USER= <dgb>
##$AMP= (0..31)
100 100 100 100 100 100 100 100 100 100 100 100 100 100 100 100 100 100 
100 100 100 100 100 100 100 100 100 100 100 100 100 100 
##$AQSEQ= 0
##$AQ_mod= 3
##$AUNM= <au_zg>
##$AUTOPOS= <26 >
##$BF1= 250.13
##$BF2= 250.13
##$BF3= 250.13
##$BF4= 250.13
##$BF5= 500.13
##$BF6= 500.13
##$BF7= 500.13
##$BF8= 500.13
##$BYTORDA= 1
##$CFDGTYP= 0
##$CFRGTYP= 5
##$CHEMSTR= <none>
##$CNST= (0..31)
1 1 145 1 1 1 1 1 1 1 1 1 1 1 1 1 1 1 1 1 1 1 1 1 1 1 1 1 1 1 1 1 
##$CPDPRG= <>
##$CPDPRG1= <>
##$CPDPRG2= <>
##$CPDPRG3= <>
##$CPDPRG4= <mlev>
##$CPDPRG5= <mlev>
##$CPDPRG6= <mlev>
##$CPDPRG7= <mlev>
##$CPDPRG8= <mlev>
##$CPDPRGB= <>
##$CPDPRGT= <>
##$D= (0..31)
0 1 0 0 0 0 0 0 0 0.06 0 0 0 0 0 0 0.0002 0 0 0 0 0 0 0 0 0 0 0 0 0 0 
0 
##$DATE= 1167990329
##$DBL= (0..7)
120 120 120 120 120 120 120 120 
##$DBP= (0..7)
150 150 150 150 150 150 150 150 
##$DBP07= 0
##$DBPNAM0= <>
##$DBPNAM1= <>
$$ [...]
##$SUBNAM7= <"">
##$SUBNAM8= <"">
##$SUBNAM9= <"">
##$SW= 20.6930455092707
##$SWIBOX= (0..15)
0 0 3 0 0 0 0 0 0 0 0 0 0 0 0 0 
##$SW_h= 5175.983436853
##$TD= 65536
##$TD0= 1
##$TE= 294.16
##$TE2= 300
##$TE3= 300
##$TEG= 300
##$TL= (0..7)
0 120 120 120 120 120 120 120 
##$TP= (0..7)
150 150 150 150 150 150 150 150 
##$TP07= 0
##$TPNAME0= <>
##$TPNAME1= <>
##$TPNAME2= <>
##$TPNAME3= <>
##$TPNAME4= <>
##$TPNAME5= <>
##$TPNAME6= <>
##$TPNAME7= <>
##$TPOAL= (0..7)
0.5 0.5 0.5 0.5 0.5 0.5 0.5 0.5 
##$TPOFFS= (0..7)
0 0 0 0 0 0 0 0 
##$TUNHIN= 0
##$TUNHOUT= 0
##$TUNXOUT= 0
##$USERA1= <user>
##$USERA2= <user>
##$USERA3= <user>
##$USERA4= <user>
##$USERA5= <user>
##$V9= 5
##$VALIST= <valist>
##$VCLIST= <CCCCCCCCCCCCCCC>
##$VD= 0
##$VDLIST= <DDDDDDDDDDDDDDD>
##$VPLIST= <PPPPPPPPPPPPPPP>
##$VTLIST= <TTTTTTTTTTTTTTT>
##$WBST= 1024
##$WBSW= 4
##$XGAIN= (0..3)
0 0 0 0 
##$XL= 0
##$YL= 0
##$YMAX_a= 188935
##$YMIN_a= -244208
##$ZGOPTNS= <>
##$ZL1= 120
##$ZL2= 120
##$ZL3= 120
##$ZL4= 120
##$ABSF1= 16.522
##$ABSF2= -4.171173
##$ABSG= 5
##$ABSL= 3
##$ALPHA= 0
##$AQORDER= 0
##$ASSFAC= 0
##$ASSFACI= 0
##$ASSFACX= 0
##$ASSWID= 0
##$AUNMP= <proc_1d>
##$AZFE= 0.1
##$AZFW= 0.1
##$BCFW= 0
##$BC_mod= 0
##$BYTORDP= 0
##$COROFFS= 0
##$CY= 12.5
##$DATMOD= 1
##$DC= 0
##$DFILT= <>
##$DTYPP= 0
##$F1P= 14.0000005364418
##$F2P= -0.99999901652339
##$FCOR= 0.5
##$FTSIZE= 32768
##$FT_mod= 6
##$GAMMA= 0
##$GB= 0
##$INTBC= 1
##$INTSCL= 1
##$ISEN= 128
##$LB= 0.3
##$LEV0= 0
##$LPBIN= 0
##$MAXI= 10000
##$MC2= 0
##$MEAN= 0
##$ME_mod= 0
##$MI= 0
##$NCOEF= 0
##$NC_proc= -5
##$NLEV= 6
##$NOISF1= 0
##$NOISF2= 0
##$NSP= 0
##$NTH_PI= 0
##$NZP= 0
##$OFFSET= 16.522
##$PC= 1
##$PHC0= 212.5068
##$PHC1= 8.271078
##$PH_mod= 1
##$PKNL= yes
##$PPARMOD= 0
##$PSCAL= 4
##$PSIGN= 0
##$REVERSE= no
##$SF= 250.13
##$SI= 32768
##$SIGF1= 0
##$SIGF2= 0
##$SINO= 400
##$SIOLD= 32768
##$SREGLST= <1H.DMSO>
##$SSB= 0
##$STSI= 32768
##$STSR= 0
##$SW_p= 5175.98343685301
##$SYMM= 0
##$S_DEV= 0
##$TDeff= 65536
##$TDoff= 0
##$TI= <Analysis number 999999
Compound Code 99
Book Reference 9
Project Code 9>
##$TILT= no
##$TM1= 0
##$TM2= 0
##$TOPLEV= 0
##$USERP1= <user>
##$USERP2= <user>
##$USERP3= <user>
##$USERP4= <user>
##$USERP5= <user>
##$WDW= 1
##$XDIM= 32768
##$YMAX_p= 408295533
##$YMIN_p= -491177
$$ End of Bruker specific parameters
$$ ---------------------------------
##NTUPLES= NMR SPECTRUM
##VAR_NAME=  FREQUENCY,     SPECTRUM/REAL,   SPECTRUM/IMAG
##SYMBOL=    X,             R,               I
##VAR_TYPE=  INDEPENDENT,   DEPENDENT,       DEPENDENT
##VAR_FORM=  AFFN,          ASDF,            ASDF
##VAR_DIM=   32768,         32768,           32768
##UNITS=     HZ,            ARBITRARY UNITS, ARBITRARY UNITS
##FACTOR=    0.157963299565203, 1,           1
##FIRST=     4132.6476996994, 0,             0
##LAST=      -1043.33573715361, 0,           0
##MIN=       -1043.33573715361, -491177,     0
##MAX=       4132.6476996994, 408295533,     0
$$ Real data points
##PAGE= N=1
##DATA TABLE= (X++(R..R)), XYDATA
$$ [...]
13622A11312Q1291K782r1474M5634n3638m9581M7731K1068O447j6312p586L208
$$ 111312 192603 195385 103911 149545 95907 46326 94057 115125 121572 105260 97674 100882
13610A00882j18891r226L2295L4658Q2014K9675r9921j84516J5336J0392L9876
$$ 100882 -18009 -27235 5060 39718 121732 151407 51486 -133030 -117694 -107302 -67426
13599f7426J24175N7270r1476n5975L0102J6991j4993O067L3226Q6811P323r9829
$$ -67426 56749 114019 22543 -33432 -3330 13661 -1332 4735 37961 124772 132095 32266
13587C2266k0112L5414J00619J67132P1446j4008J2213R3952M8913J0714K38513
$$ 32266 12154 47568 148187 315319 386765 372757 384970 478922 527835 538549 777062
13576G77062P4818j93198k14467k38699j01925O8377j5386P0499O0227j17195
$$ 777062 851880 658682 444215 205516 103591 171968 156582 227081 287308 170113
13566A70113q9501N2457P0394O3899M9849n8368M5832q3313j03345r29o7932j14411
$$ 170113 80612 133069 203463 267362 317211 258843 304675 221362 118017 117088 49156 -65255
13554f5255L7177N4315O356p388K5756N6237N426L0753j04166l161L547J8441
$$ -65255 -28078 26237 32593 25205 50961 107198 112624 143377 39211 36050 39597 58038
13542E8038j573L1708P1429N3866J1336J13836N526J77588J28421J18376J17722
$$ 58038 56465 88173 159602 213468 224804 338640 344166 521754 650175 768551 886273
13531H86273o8198j23171k27176j33678J66272j00600j17726l1712j44684l7247
$$ 886273 818075 694904 467728 334050 500322 399722 281996 250284 105600 68353
13521F8353N6033O8625o4080q0730R5290P2247j32640j10299J48046k3480M6899
$$ 68353 124386 193011 128931 48201 143491 215738 83098 -27201 120845 97365 144264
13510A44264N5110j1482q0455j41438N6753J06048P9054o6715M7037J01611j28559
$$ 144264 199374 187892 107437 -34001 22752 128800 207854 141139 188176 289787 161228
13499A61228n9654K1944k4010L9992k6768J5600J95547n098o8350j34923l558
$$ 161228 101574 123518 99508 139500 112732 128332 323879 318781 250431 115508 111950
13488A11950l5014M1792Q6593n0706r3271n5563O4505l0263l075m6693n5935K8274
$$ 111950 76936 118728 205321 154615 61344 5781 70286 40023 36948 -9745 -65680 -37406
13476c7406l9154N1027l1755o3390J40393m6263l4216j40450L7875J01750R7895
$$ -37406 -76560 -25533 -57288 -120678 19715 -26548 -60764 -201214 -163339 -61589 36306
13465C6306n1210Q1296j300m6507M2716r6113p0214l9376O7128l7934N059M8526
$$ 36306 -14904 66392 65092 18585 61301 -34812 -105026 -144402 -77274 -115208 -110149 -61623
13453f1623Q5802R1224L5566M0355r0719o7898m802O5222Q3160P855j43783n2698
$$ -61623 24179 115403 150969 191324 100605 32707 27905 93127 176287 184142 40359 -12339
13441a2339n554Qj06496L4544P6214l661O3187L7483o6546L945o6825J8228J08885
$$ -12339 -17893 -17885 -124381 -89837 -13623 -17284 45903 83386 16840 20785 -46040 -27812 81073
13428H1073J00463J7213j5344q32r6784p0056n3700J48055J41548j7548l1547
$$ 81073 181536 198749 183405 182573 85789 15733 -37967 110088 251636 234088 202541
13417B02541P1741R2438P1839r5442m6069J35557R2762R180m3083P6681o809M7660
$$ 202541 274282 366720 438559 343117 297048 432605 525367 534547 491464 568145 561336 608996
13405F08996K21435L93627K08900K74292K98217K30879L66790L35400K15335K18611
$$ 608996 830431 1224058 1432958 1707250 2005467 2236346 2603136 2938536 3153871 3372482
13395C372482K69437O14445P18169R68919J392766J780716K483347L506013N028585
$$ 3372482 3641919 4256364 4974533 5943452 7336218 9116934 11600281 15106294 20134879
13386B0134879O599263P321509O662440L651213q10372m780069o737793o730250
$$ 20134879 26734142 34055651 40718091 44369304 43558932 38778863 32041070 25310820
13378B5310820n414910m038625k990263k156240j500588r83594p69853o71160
$$ 25310820 19895910 15857285 12867022 10710782 9210194 8226600 7456747 6785587
13370F785587m66173k46673m2453K196j0047n0504j43792N279J73053J85381M23373
$$ 6785587 6319414 6072741 6030288 6032484 6022437 5971933 5828141 5833420 6006473 6191854 6615227
13359F615227P21872Q46211J429577K056242L176478M861865O867183Q929054
$$ 6615227 7337099 8183310 9612887 11669129 14845607 19707472 26574655 35503709
13351C5503709R899403P729493J734064n138873r287951r673032p824908n399090
$$ 35503709 45403112 53132605 54866669 49727796 40439845 30766813 22941905 17542815
13343A7542815l408192k275344j409609r18048p54312o97345m68367r2807J8249
$$ 17542815 14134623 11859279 10449670 9531622 8777310 8079965 7611598 7518791 7537040
13334G537040L06564N55991P62655J011052J668174K753623M171209O220662Q768269
$$ 7537040 7843604 8399595 9162250 10173302 11841476 14595099 18766308 24986970 33755239
13325C3755239J0699437R830780M554512l553444r796840j1115147r213487o371603
$$ 33755239 44454676 54285456 58839968 55286524 45489684 34374537 25161050 18789447
13317A8789447m195039k809832j793917j135982r21323p23898n74600l33989j92306
$$ 18789447 14594408 11784576 9990659 8854677 7933354 7209456 6634856 6300867 6108561
13308F108561J56196J97573O8363p609O2133Q1237J91798M65743O13105P10948
$$ 6108561 6264757 6462330 6530693 6523084 6585217 6666454 6858252 7323995 7937100 8648048
13298H648048J356375J971378K414767L474734M792194O386876P401975O977620
$$ 8648048 10004423 11975801 14390568 17865302 22657496 29044372 36446347 43423967
13290D3423967M536560q5632m823324p446214p674927o473252m855473l548530
$$ 43423967 47960527 47874895 43051571 35605357 27930430 21457178 16601705 13053175
13282A3053175k499464j839586j402848j042295p53760o59270n32821n28633k53482
$$ 13053175 10553711 8714125 7311277 6268982 5515222 4855952 4323131 3794498 3541016
13273C541016j91004k99026l32776k18531j72444j89827j34998k09732j75499
$$ 3541016 3350012 3050986 2718210 2499679 2327235 2137408 2002410 1792678 1617179
13264A617179r5008j30120J5228l07j75589j29707j2742R623q7987q908p3163
$$ 1617179 1522171 1392051 1407279 1406972 1231383 1101676 1088934 1098557 1010570 1001662 928499
13253I28499j06748o7380R7613Q6571r879j60594j47799j04663L1289K29725J22750
$$ 928499 821751 754371 851984 938555 928676 768082 620283 515620 546909 776634 899384
13242H99384p2265m8724J7873k6376k9448q751M2699j01519r9916j00449r1189
$$ 899384 827119 778395 796268 769892 740444 731693 774392 672873 572957 472508 381319
13231C81319n414L1447O0785N4988L8474j7453K5770J6206R3068m4475k05467
$$ 381319 375905 407352 468137 523125 561599 544146 569916 586122 679190 634715 429248
13220D29248j31290j71289q4967J22258J84011N4655R812r1180J55632J1208K5737
$$ 429248 297958 126669 41702 163960 347971 402626 412438 321258 476890 488098 513835
13209E13835k9031j2134J1440J01140o6699j33828j7189J11545J07626O401J04586
$$ 513835 484804 472670 484110 585250 518551 384723 367534 479079 586705 593106 697692
13198F97692J8308j06658j9017R9168O2115Q8662J63645j370O8789O164j27299
$$ 697692 716000 609342 590325 689493 751608 840270 1003915 1002545 1071334 1077498 950199
13187I50199j07879J58328J96090M913j28112M5342R3383J16332O0411M4920J91603
$$ 950199 842320 1000648 1196738 1201651 1073539 1118881 1212264 1328596 1389007 1433927 1625530
13176A625530P5565L22549K56288J82869K93215M24363M94073O29391Q23197R52960
$$ 1625530 1701095 2023644 2279932 2462801 2756016 3180379 3674452 4303843 5127040 6080000
13166F080000J334916J973017K611442L496728M969822O727650Q230007Q258534
$$ 6080000 7414916 9387933 11999375 15496103 20465925 27193575 35423582 43682116
13158D3682116N741627K43546n661835q693421q158536o373040m438895l169537
$$ 43682116 49423743 49667289 44005454 35312033 27153497 20780457 16341562 13172025
13150A3172025k214545j527285j168318j032194q21184p02094m88878l85092j82996
$$ 13172025 10957480 9430195 8261877 7229683 6408499 5706405 5217527 4832435 4649439
13141D649439j14649j14885R4489L8545n408r6621J2553K09701K48847K47071
$$ 4649439 4534790 4419905 4514394 4552939 4547531 4450910 4463463 4673164 4922011 5169082
13131E169082L26687M31382O34504O70056R46561J125963J341983J933098K445552
$$ 5169082 5495769 5927151 6561655 7231711 8178272 9304235 10646218 12579316 15024868
13122A5024868L233757L786528N186391P412061J0448296J5236403K1548189K8077227
$$ 15024868 18258625 22045153 27231544 34643605 45091901 60328304 81876493 109953720
13114A09953720L0628021K3050065J746614k2752686l3163950k9171120k1034198
$$ 109953720 140581741 163631806 165378420 142625734 109461784 80290664 59256466
13107E9256466j4162315r517864o465812m557530l415968k847222k330907j980219
$$ 59256466 45094151 35576287 29110475 24552945 21136977 18289755 15958848 13978629
13099A3978629j604392j260988j020938p63637o55656n51349l81177k57157k87624
$$ 13978629 12374237 11113249 10092311 9328674 8673018 8121669 7740492 7483335 7195711
13090G195711l4276J04491J18428J42896K31929M20274M03952O95604R93572J008574
$$ 7195711 7161435 7265926 7384354 7527250 7759179 8179453 8583405 9279009 10272581 11281155
13080A1281155J287996J875877K381232K893791L863339N263222P247268J0519388
$$ 11281155 12569151 14445028 16826260 19720051 23583390 28846612 36093880 46613268
13072D6613268J5311081K1666512K8283478L1657860K4463714K263768k3722700
$$ 46613268 61924349 83590861 111874339 143532199 167995913 170259681 146536981
13065A46536981l4485400l0118577k1580591j4530703r674525o612168m687602
$$ 146536981 112051581 81933004 60352413 45821710 36147185 29535017 24847415
13058B4847415l531419k964038k544726k152559j751087j420319j159900r63130
$$ 24847415 21315996 18351958 15807232 13654673 11903586 10483267 9323367 8360237
13050H360237o31649n44224n30311l57419k10696j78318j62528j64543q3532j56444
$$ 8360237 7728588 7184364 6654053 6296634 6085938 5907620 5745092 5580549 5497017 5340573
13040E340573p0015K40508M6713l0933K98713M78625O14284P87601J091270J342518
$$ 5340573 5270558 5511066 5557779 5526846 5825559 6304184 6918468 7706069 8797339 10139857
13030A0139857J715909K549106L554647M961426O763216Q576304R125561O605354
$$ 10139857 11855766 14404872 17959519 22920945 29684161 38260465 47386026 53991380
13022E3991380M07948o586604r879538r177876o898270m944606l431250k477329
$$ 53991380 54399328 47812724 37933186 28755310 21857040 16912434 13481184 11003855
13014A1003855j720443j348999r72931q25015q02989o49642n07167m19387l12346
$$ 11003855 9283412 7934413 6961482 6136467 5333478 4683836 4176669 3757282 3444936
13005C444936k94959j11860j60126k64758k11635k7777l8072j07277p4039p1815
$$ 3444936 3149977 3038117 2877991 2613233 2401598 2373821 2335749 2228472 2154433 2082618
12995B082618j26305j44981j29108o9295q2715m9543j79152k24730l4157R3730
$$ 2082618 1956313 1811332 1682224 1612929 1530214 1480671 1301519 1076789 1042632 1136362
12985A136362K182n0569l9551o7941J57214j5059q6575M6923N7405j25595r9125
$$ 1136362 1138544 1087975 1048424 980483 1137697 1122638 1036063 1082986 1140391 1014796 915671
12974I15671J0261m2062m1833K5026N9018n8260l4443j19601j62414M1275R7280
$$ 915671 925932 883870 842037 867063 926081 867821 833378 713777 551363 592638 689918
12963F89918J28129M6938o9764J48162R654j32311l6033p887m9976q7292L1153
$$ 689918 818047 864985 795221 943383 953037 820726 784693 776806 726830 639538 670691
12952F70691J68263N5451r3682j26532L1686o8877K7450L147j11454p7807m6882
$$ 670691 838954 894405 800723 674191 705877 637000 664450 667597 556143 478336 431454
12941D31454J37J3859N1195j02451j24520m6475O7702J93327J26610j28657q0956
$$ 431454 431591 445450 496645 394194 269674 223199 290901 484228 610838 482181 401225
12930D01225Q2702P7426K956R6848n3016j96450j79746L2784M9375K3724N2746
$$ 401225 483927 561353 564309 661157 608141 411691 231945 264729 314104 337828 390574
12919C90574N0759j9699k7719j02119J4648O5882k4655O4776R2325o917j1798
$$ 390574 441333 421634 393915 291796 306444 372326 347671 412447 504772 497855 486057
12908D86057j6422N0254l781p552l3212K0811l1708o3911k4476P7378l2951J3498
$$ 486057 469635 519889 516108 508556 475344 496155 464447 400536 376060 453438 420487 433985
12896D33985M7780k4245m4696q5521N8775j12352n2967O7468L0735N6844J6405
$$ 433985 481765 457520 412824 327303 386078 273726 220759 288227 318962 375806 392211
12885C92211J06693J04192k6790l5234j68966J0866J6921m6245k4897L7184O0791
$$ 392211 498904 603096 576306 541072 372106 382972 399893 353648 328751 365935 426726
12874D26726l0008j40327R31M7577j4873J25749K9604l203L8126j02844j47281
$$ 426726 396718 256391 257322 304899 290026 415775 445379 442176 480302 377458 230177
12863B30177J14439J26909N0092J27918l5675j81030j00358R4787R7247p3585
$$ 230177 344616 471525 521617 649535 613860 432830 332472 427259 524506 450921
12853D50921j60449l4829K3817J00272N8168q10R1411M2455O1120N1051q8398
$$ 450921 290472 255643 279460 379732 437900 437090 528501 570956 632076 683127 594729
12842E94729j82020j4145J07850l0513p2988l00R3427m0673M9093m4392j15602
$$ 594729 412709 398564 506414 475901 402913 402613 496040 455367 504460 460068 344466
12831C44466n013L3610n4826M2574K9163M8101L2573o3856N175r04p7344q628
$$ 344466 339453 373063 318237 360811 389974 438075 470648 406792 411967 411063 333719 325091
12819C25091n0026o4399Q2698J23651Q8566q9274j12317r9039M1488M8477L2464
$$ 325091 275065 210666 293364 417015 505581 416307 303990 204951 246439 294916 327380
12808C27380M7943O7728Q8139K5453p0495k7930K7633P4447L0074o4907J2227
$$ 327380 375323 443051 531190 556643 486148 458218 485851 560298 590372 525465 537692
12797E37692k2830P1498R9210j9891k1545j58075j8867J62295R055N3573J87765
$$ 537692 514862 586360 685570 665679 644134 486059 467192 629487 638542 692115 879880
12786H79880N0874n4949O5668k604j2394K0497J5289l0723r5893j19611k26831
$$ 879880 930754 875805 941473 938869 926475 946972 962261 931538 835645 716034 489203
12775D89203j62956L8815J3210J15143J00172j50596r7323q4892j44997j754J57282
$$ 489203 326247 365062 378272 493415 593587 442991 345668 260776 115779 114025 271307
12764B71307R3836L0400j00855o3221M0619J43942j45994l5751P2640J94115K6905
$$ 271307 365143 395543 294688 231467 272086 416028 270034 234283 306923 501038 527943
12753E27943k3014p7565O2609L3403p8167M8185N7352k9654j1676J68311J33186
$$ 527943 504929 427364 489973 523376 445209 493394 550746 521092 509416 677727 810913
12742H10913J39004M8714J32651J61785p472N9409j23846j87463j57601r3080
$$ 810913 949917 998631 1131282 1293067 1285595 1345004 1221158 1033695 876094 783014
12732G83014m7903O3872J61969L9044j32264k17849k73058j64513n8179M7668
$$ 783014 735111 798983 960952 999996 867732 649883 376825 212312 154133 201801
12722B01801L9977J8226l0493m8163O409k6351j03495M1455M0331J80502K7403
$$ 201801 241778 260004 229511 181348 187757 161406 57911 99366 139697 320199 347602
12711C47602q5207m7687l8509L8516k3884m8830m4753N7322J2470J95687J08111
$$ 347602 262395 214708 176199 214715 190831 142001 97248 154570 167040 362727 470838
12700D70838K2601o6133L1392Q4765J30738J15345J26479R6503M8471j5103K6783
$$ 470838 493439 427306 458698 543463 674201 789546 916025 1012528 1060999 1045896 1072679
12689A072679N550Q5358j21588j22040o6085m2761J7911m7334J4805K0297l2272
$$ 1072679 1078229 1163587 1041999 919959 853874 811113 829024 781690 796495 816792 784520
12678G84520K4864J08808J83602L6908o9108k16238j33341j7819j31274l2667
$$ 784520 809384 918192 1101794 1138702 1069594 853356 720015 702196 570922 538255
12668E38255p8498j14906r3206L809j32932p7474J32863N6270M3350Q4029O4485
$$ 538255 459757 344851 251645 255454 122522 45048 177911 234181 277531 361560 426045
12657D26045j080K1160k6539L5631r5422O1023K7514L0410N1530M748R1751O7461
$$ 426045 424965 446125 419586 455217 359795 420818 448332 478742 530272 535020 626771 694232
12645F94232l906K4531O5910R4133K09189K58114L42031J53569J31294l690l88916
$$ 694232 690326 714857 780767 874900 1084089 1342203 1684234 1837803 1969097 1965407 1576491
12634A576491l80680k44062j25263p6698n1298P5768J34702J72255K00745P9762
$$ 1576491 1195811 951749 826486 749788 698490 774258 908960 1081215 1281960 1361722
12624A361722j71731k74144j59741j39448l4686R5j6784o6063k3582k7189j24104
$$ 1361722 1189991 915847 756106 616658 581972 582067 565283 499220 475638 448449 324345
12613C24345j10725Q9989O9099n9571m5988n4627K367O8430K4316P5301P8434
$$ 324345 213620 303609 372708 313137 267149 212522 214889 283319 307635 382936 461370
12602D61370m2516n6361o6346K18726J65876J72850J57143M0820k4501l5892q7817
$$ 461370 418854 362493 296147 514873 680749 853599 1010742 1051562 1027061 991169 903352
12591I03352j10627n5720P1439P6907K53577R5786q3476k55384k14681o8153L701
$$ 903352 792725 737005 808444 885351 1138928 1234714 1151238 895854 681173 613020 616721
12580F16721l5586k08340j72251J9322P0089O0260Q7711o8791r7778J09591M207
$$ 616721 581135 372795 200544 219866 289955 350215 437926 369135 271357 380948 385155
12569C85155M0170m1673n5367N8166n200r1238l5214J838n5917k1890Q1881m1303
$$ 385155 425325 383652 328285 386451 381251 290013 254799 256637 200720 178830 260711 219408
12557B19408P932Q5192Q9619J960q5649R841N4578q2293q3722L8517J19041K704
$$ 219408 227340 312532 402151 404111 318462 328303 382881 300588 216866 255383 374424 377128
12545C77128N1093q7937k3248K2822J4245j58470j28771Q1473P1562J06572p1779
$$ 377128 428221 340284 317036 339858 354103 195633 66862 148335 219897 326469 254690
12534B54690q6588n8742k0426J07951k3744k06644p2365P8017J1749L1373k865
$$ 254690 168102 109360 88934 196885 173141 -33503 -105868 -27851 -16102 15271 12406
12523A2406j9758K5225J45739J18284j7813o4591j34971J8846J7354j237k4252
$$ 12406 -7352 17873 163612 281896 264083 199492 64521 83367 100721 99484 75232
12512G5232J11257N663L8656R0257l1601n6648j28931o2821j4244K2454q776K4763
$$ 75232 186489 192152 230808 321065 289464 232816 103885 41064 26820 49274 40498 65261
12500F5261J44116p4268O225J3814j37317n4398M4911J12875J85191K8615j20615
$$ 65261 209377 135109 141334 155148 17831 -36567 8344 121219 306410 335025 214410
12489B14410p8882m196K509P7515n9887j0214J1258m792k6617k7633k5003J17060
$$ 214410 135528 131332 133841 211356 151469 141255 152513 147721 121104 93471 68468 185528
12477A85528M8722N3293n0944o0404m4838m3872j9378J21381m7558Q3661P5970
$$ 185528 234250 287543 236599 176195 131357 87485 68107 189488 141930 225591 301561
12466C01561o8055J01157J1540j1445l7548r9024j65108O5951J39601o2142q4399
$$ 301561 233506 334663 346203 334758 297210 198186 33078 99029 238630 176488 92089
12455I2089k0333k4344n821J02220L5039r1526p7716M8045P9675L2618j4178l2371
$$ 92089 71756 47412 41591 143811 178850 87324 9608 57653 137328 169946 155768 123397
12443A23397K5215R402r739j02567n7808Q790J73495l3739K0158k386p0427q8662
$$ 123397 148612 158014 148275 45708 -12100 -3310 170185 136446 156604 154218 83791 -4871
12431d871J3252R6410J85121j86443j65141J34216K08338J18242L5981j77936
$$ -4871 8381 104791 289912 103469 -61672 72544 280882 399124 435105 257169
12421B57169j59413r0412R1608J56242Q0943j02057n5797n3727l332J25413n1314
$$ 257169 97756 7344 98952 255194 336137 234080 178283 124556 121224 246637 195323
12410A95323l8878l0527k1067O0928n3344m5277N6441l0158L3255M1909p8136
$$ 195323 156445 125918 104851 165779 112435 67158 123599 93441 126696 168605 90469
12399I0469L4246O792n0296K4467N9347l5794m1513K0118R353P890K1924l4748
$$ 90469 124715 131507 81211 105678 165025 129231 87718 107836 117189 125079 147003 112255
12387A12255K3774j01661R411K3773J5429K5444K555k3326m5702M1417J25927
$$ 112255 136029 34368 43779 67552 82981 108425 110980 87654 41952 83369 209296
12376B09296k9320n3218O8542P893M4876Q3398P56j9073o2148J2243O0188O8183
$$ 209296 179976 126758 195300 203193 248069 331467 332223 313150 251002 263245 323433 391616
12364C91616Q8166l3541j17422o302P2083j77j75862o5138Q7231o6768k8592J4394
$$ 391616 479782 446241 328819 322517 394600 394423 218561 153423 240654 173886 145294 159688
12352A59688J01459l9128m4805J596N6277p1008m855n6549N793J2383j968P627
$$ 159688 261147 222019 177214 178810 235087 164079 159224 102675 108468 120851 118883 126510
12340A26510J36620K2509K1064J5362l9469p0746j5519L1337k8862N3411J4686
$$ 126510 263130 285639 306703 322065 282596 211850 196331 227668 198806 252217 266903
12329B66903k4796p4437J6894J41247K7438n3291q8017r18J8202Q3491j6980n5888
$$ 266903 242107 167670 184564 325811 353249 299958 211941 211023 229225 312716 295736 239848
12317B39848r9921j1516M5087p0445k7319J62108J05835P8044M4206p8982J040
$$ 239848 139927 128411 173498 103053 75734 237842 343677 421721 465927 386945 387985
12306C87985K0403L8127k8043j06798L424l6128K0067J2082q3118j12687Q9198
$$ 387985 408388 446515 418472 311674 315098 278970 299037 311119 228001 115314 204512
12295B04512J44969L1637m4131m6532m5647n2543o6869J6048O1283N5660N886
$$ 204512 349481 381118 336987 290455 244808 192265 125396 141444 202727 258387 264273
12284B64273j0225q5724k451k8429J2829o9698j7947Q693K2408R6166M5674K6015
$$ 264273 254048 168324 165873 137444 150273 80575 62628 71321 93729 189895 235569 261584
12272B61584Q6026j6436L4342K0218r5396j86314O819K9567L8543K2757P3552
$$ 261584 347610 331174 365516 385734 290338 104024 110843 140410 178953 201710 275262
12261B75262n758o8240o152J3831J38207k2843M9848J15020K0592j9471l3216
$$ 275262 269504 201264 195112 208943 347150 324307 374155 489175 509767 490296 457080
12250D57080l2519L9408k5591J6725L8814q4178r6959k2792L3333J00108J20020
$$ 457080 424561 463969 438378 455103 493917 409739 312780 289988 323321 423429 543449
12239E43449o8029j14023o1716J27838L7726J2613K0504P2282k0957p3536m3200
$$ 543449 475420 361397 299681 427519 465245 477858 498362 570644 549687 476151 432951
12228D32951m1972K3961M5801j63694l7424J00285P0255O267r6251K0801O0012
$$ 432951 390979 414940 460741 297047 259623 359908 430163 436430 340179 360980 420992
12217D20992J27133M4629r8197M5954J07675r2099k0671m0002l5444M1052P5677
$$ 420992 548125 592754 494557 540511 648186 556087 535416 495414 459970 501022 576699
12206E76699N4575M1258k397p8662j38280o1691J09897J48058P5398k5305p0486
$$ 576699 631274 672532 670135 591473 453193 391502 501399 649457 724855 699550 629064
12195F29064N3837L2468M5284k4960L895L6675l4780q3327K4262M0906N7793J0609
$$ 629064 682901 715369 760653 735693 739588 776263 741483 658156 682418 723324 781117 791726
12183G91726N2798j36233l6677j2344L0622N5431K907k2830R488K3976M1639j01903
$$ 791726 844524 708291 671614 659270 689892 745323 748230 725400 734888 758864 800503 698600
12171F98600R663K9035J8145k1102J08051J02263k7565K456k5670q5083m7697
$$ 698600 708263 737298 755443 734341 842392 944655 917090 919546 893876 808793 761096
12160G61096J7444R9601O693l9793L9371k4090j45615L7649N5940l7044N438J33813
$$ 761096 778540 878141 884834 845041 884412 860322 714707 752356 808296 771252 776690 910503
12148I10503Q641q6600j465M1808M7306L4129J8802o9058j211L4480P3431n5589
$$ 910503 919144 832544 831079 872887 920193 954322 973124 904066 902855 937335 1010766 955177
12136I55177j8779K8049L5492P0584l5869n615N5213k203p7726k6099o2162k4824
$$ 955177 936398 964447 999939 1070523 1034654 1029039 1084252 1082049 1004323 978224 916062 891238
12124H91238o085J01619P7650N0939Q9739l0250o5436q820j49387q1486J29455
$$ 891238 885153 986772 1064422 1115361 1205100 1174850 1109414 1100594 951207 869721 999176
12113I99176R2103K0549O196l6495n688k0018J0117N8716J72817K3337O5875M549
$$ 999176 1091279 1111828 1118024 1081529 1075841 1055823 1065940 1124656 1297473 1320810 1386685 1391234
12101A391234m2248j02502m0436M9905R162m4705l7662J7404J08062R596K1895
$$ 1391234 1348986 1246484 1206048 1255953 1265115 1220410 1182748 1200152 1308214 1317810 1339705
12090A339705j0550J6968J29679Q199l6255L8931O943R5923J43226L5204L1886
$$ 1339705 1329155 1346123 1475802 1484001 1447746 1486677 1493620 1589543 1732769 1767973 1799859
12079A799859q176o5720m5286M716J3908J23777O8815O1754j2708k0796J6933
$$ 1799859 1791683 1725963 1680677 1685393 1699301 1823078 1891893 1953647 1940939 1920143 1937076
12068A937076k7776P5056j2841m7845Q6603J29605J7646L02K1276J16915R1496
$$ 1937076 1909300 1984356 1971515 1923670 2010273 2139878 2157524 2157826 2179102 2296017 2387513
12057B387513p6985L8871K4846J4145K6398N1291J79083K02455J95576j1749r875
$$ 2387513 2310528 2349399 2374245 2388390 2414788 2466079 2645162 2847617 3043193 3031444 3021569
12046C021569l8080q5435j10548q1637J03654Q9435J11190N3094l2512p0003J27817
$$ 3021569 2983489 2898054 2787506 2705869 2809523 2898958 3010148 3063242 3030730 2960727 3088544
12035C088544J34518J6559J33011J55963N3112j51552k7590J31679J53149Q2431
$$ 3088544 3223062 3239621 3372632 3528595 3581707 3430155 3402565 3534244 3687393 3769824
12025C769824j71J39953J70468j1818p1747R5125P7799J14019Q3035R5507J01033
$$ 3769824 3769653 3909606 4080074 4068256 3996509 4091634 4169433 4283452 4366487 4461994 4563027
12014D563027O6500J52650J65653m7251M4436R6672L06154K32088L46004L55167
$$ 4563027 4629527 4782177 4947830 4900579 4945015 5041687 5347841 5579929 5925933 6281100
12004F281100J75898J41915p8584n6546J42014K02356J19350N5423J04592K87598
$$ 6281100 6456998 6598913 6520329 6463783 6605797 6808153 6927503 6982926 7087518 7375116
11994G375116K87271K84635J84424K01649J42723M6349J39655L44661L58409L86274
$$ 7375116 7662387 7947022 8131446 8333095 8475818 8522167 8661822 9006483 9364892 9751166
11984I751166L73878K29145K19674L09939L70509M40423M23953L74691L16857
$$ 9751166 10125044 10354189 10573863 10883802 11254311 11694734 12118687 12493378 12810235
11975A2810235L85978M12850M80272M97976M55974N41883O72199O24885P24831
$$ 12810235 13196213 13609063 14089335 14587311 15043285 15585168 16257367 16882252 17607083
11966A7607083P49692O51032O45061Q46713R76877R64257Q52831Q85336J026569
$$ 17607083 18356775 19007807 19652868 20499581 21476458 22440715 23293546 24178882 25205451
11957B5205451J041666J108929J133299J160382J306141J452472J563327J559361
$$ 25205451 26247117 27356046 28489345 29649727 30955868 32408340 33971667 35531028
11949C5531028J693916J737473J876089J995803K219670K338685K289969K392635
$$ 35531028 37224944 38962417 40838506 42834309 45053979 47392664 49682633 52075268
11941E2075268K634885K783823K786430K848375L019447L046118L173938L248644
$$ 52075268 54710153 57493976 60280406 63128781 66148228 69194346 72368284 75616928
11933G5616928L253618L195238L263078L144037K956400K712298K516363K069816
$$ 75616928 78870546 82065784 85328862 88472899 91429299 94141597 96657960 98727776
11925I8727776J868828J416534J081547P15534K25320l04190r17941j191071j515420
$$ 98727776 100596604 102013138 103094685 103810219 104035539 103731349 102813408 101622337 100106917
11916A00106917k081872k391390k629383k714831k937783l067680l168548l216440
$$ 100106917 98025045 95633655 93004272 90289441 87351658 84283978 81115430 77898990
11908G7898990l101523l111839l071523k951391k936646k911453k614512k655399
$$ 77898990 74797467 71685628 68614105 65662714 62726068 59814615 57200103 54544704
11900E4544704k537217k420373k291410k028234k040767j909127j695739j843672
$$ 54544704 52007487 49587114 47295704 45267470 43226703 41317576 39621837 37778165
11892C7778165j664675j466797j484433j499853j256795j132342j071374j087309
$$ 37778165 36113490 34646693 33162260 31662407 30405612 29273270 28201896 27114587
11884B7114587j007860j074634j142859r35626p65963q00842p90916p51841o65182
$$ 27114587 26106727 25032093 23889234 22953608 22187645 21386803 20595887 19844046 19178864
11875A9178864o35105o71165n55082p03082p30198m02679l67001m50217n47782
$$ 19178864 18543759 17872594 17317512 16614430 15884232 15481553 15114552 14664335 14116553
11866A4116553l64711m54193m37763l29413l64991l06099m67466k63939k12830
$$ 14116553 13751842 13297649 12859886 12530473 12165482 11859383 11391917 11127978 10915148
11857A0915148l24810l20066l32378k73456k25889k73910r6531j46702j71707
$$ 10915148 10590338 10270272 9937894 9664438 9438549 9164639 9068108 8921406 8749699
11848H749699j04267k36857j57985j89912k86754j58857k45503l52370k33785
$$ 8749699 8645432 8408575 8250590 8060678 7773924 7615067 7369564 7017194 6783409
11839F783409L9039R3785q6509k58969k19514j39707j94881p6719P259r3283j04397
$$ 6783409 6822448 6916233 6829724 6570755 6351241 6211534 6016653 5939934 5947193 5853910 5749513
11828E749513j53655j15961j31647p4710p3812r0271p5429j08151j78873N1845
$$ 5749513 5595858 5479897 5348250 5273540 5199728 5109457 5034028 4925877 4747004 4798849
11818D798849j28937j50459j04769J7188j42279q5819l6061j1774J4825p9952
$$ 4798849 4669912 4519453 4414684 4431872 4289593 4203774 4167713 4155939 4170764 4090812
11808D090812m2301m2049k11183j40467n9639n7797q0524j22536J5562j23454
$$ 4090812 4048511 4006462 3795279 3654812 3595173 3537376 3456852 3334316 3349878 3226424
11798C226424q9970j1100N9588J0510l2413J8836q8213j39847m7705N1272n2412
$$ 3226424 3136454 3125354 3184942 3195452 3163039 3181875 3093662 2953815 2906110 2957382 2904970
11787B904970j18851L1459K7750o1533j60455k6714M3182l4235M7909j8731k03376
$$ 2904970 2786119 2817578 2845328 2783795 2623340 2596626 2639808 2605573 2653482 2634751 2431375
11776B431375j40856o85L3462N1970L5539N3120o0547j52806j08606L4248p3571
$$ 2431375 2290519 2289834 2323296 2375266 2410805 2463925 2403378 2250572 2141966 2176214 2102643
11765B102643k8329l0142p2164L266N9241J25256O0633o9375m555j37607n0034
$$ 2102643 2074314 2044172 1972008 1975274 2034515 2159771 2220404 2151029 2146474 2008867 1958833
11754A958833m4600N0750L0126J6353J43532J05023N1669L1708P6608m1699k02150
$$ 1958833 1914233 1964983 1995109 2011462 2154994 2260017 2311686 2343394 2420002 2378303 2176153
11743B176153k49204o8189l4074m5778o4048O1080M723o8550j80562p0556j3825
$$ 2176153 1926949 1858760 1824686 1778908 1714860 1775940 1780663 1712113 1531551 1460995 1447170
11732A447170K33p508K9606Q422r1959p228M3552P9638M6450m6743m1393q1904
$$ 1447170 1447403 1439895 1469501 1477923 1385964 1378736 1422288 1501926 1548376 1501633 1460240 1378336
11720A378336R5265J07326m65J13891M9700J1474J12649o0433K2552k2251j45872
$$ 1378336 1473601 1580927 1580462 1694353 1744053 1755527 1868176 1807743 1830295 1808044 1662172
11709A662172j6337j27237n4066m8177j65129K9848K7315K1602m948j03325r6288
$$ 1662172 1645835 1518598 1464532 1416355 1251226 1281074 1308389 1329991 1325043 1221718 1125430
11698A125430R122m0217r0026p4241J0324K9575l9218R0886j2336k7832N8104
$$ 1125430 1134552 1094335 1004309 930068 940392 969967 930749 1021635 1009299 981467 1039571
11687A039571R7447j0796j38327j01891j7782R6813k902m8862r9133j1497Q6290
$$ 1039571 1137018 1126222 987895 886004 868222 965035 962133 913271 814138 802641 888931
11676H88931M8988m4948j55292k5134o841O7262O0131k3431R678J405o71J09790
$$ 888931 937919 892971 737679 712545 705704 772966 833097 809666 819344 820749 820078 929868
11664I29868q4166j01982Q6313R5100J54886N3855J16324P1679O3066l1273n5914
$$ 929868 845702 743720 830033 925133 1080019 1133874 1250198 1321877 1384943 1353670 1297756
11653A297756K9059m0173J976J0632j20782j87289j106Q6675J0377j72009j45392
$$ 1297756 1326815 1286642 1288618 1299250 1178468 991179 990073 1076748 1087125 915116 769724
11642G69724m3883O5567L987k6469Q6388m499j46839k441J32697Q0931j1509q2022
$$ 769724 725841 791408 795395 768926 855314 850815 703976 701535 834232 915163 903654 821632
11630H21632r0842l6967M762l6265n320J26J22504J40613R9403J01313N2216O0034
$$ 821632 730790 693823 698585 662320 657000 657126 779630 920243 1019646 1120959 1173175 1233209
11618A233209J04273M0312p8146j85621o6823r2528P1397k02252k13120q0280
$$ 1233209 1337482 1377794 1299648 1114027 1047204 954676 1026073 823821 610701 530421
11608E30421j4596J12883K9962q2492N5968R1455k9332j15016o1571R5633P5933
$$ 530421 515825 628708 658670 576178 632146 723601 694269 579253 517682 613315 689248
11597F89248p0690m2099q0666P7478N693q048n3587K8099P5542p8851o9401N5516
$$ 689248 618558 576459 495793 573271 578964 570916 517329 545428 620970 542119 472718 528234
11585E28234j1361J26359P1993m6169N5893r374j3799j03836j09472j33037j16200
$$ 528234 516873 643232 715225 669056 724949 715575 701776 597940 488468 355431 239231
11574B39231J467J7942J34682R2537L9205p1072n4429j34467n9739J9386N7733
$$ 239231 240698 258640 393322 485859 525064 453992 399563 265096 205357 224743 282476
11563B82476L7665P1990Q4487L2469k7112k5987L2455K1342j23375J9688J69537
$$ 282476 320141 392131 476618 509087 481975 455988 488443 509785 386410 406098 575635
11552E75635K4628n4162J0050n8769j45473j34483N7430N0045P9380o7037N5655
$$ 575635 600263 546101 556151 497382 351909 217426 274856 324901 404281 337244 392899
11541C92899O0464L6199o0549m0270K3124j05606j8316n3632r162N2158J10243
$$ 392899 453363 489562 429013 388743 411867 306261 287945 234313 225151 277309 387552
11530C87552J14775o9538r0744J9750M084n2411p3095m4870j4953j0497K7870
$$ 387552 502327 432789 342045 361795 365879 313468 240373 195503 180550 170053 197923
11519A97923Q989Q0849Q8904P7144p9837j32570j52456j3401R1123M3871R5014
$$ 197923 206912 287761 376665 453809 373972 241402 88946 75545 166668 210539 305553
11508C05553l732N7604J89947J6003j44226j5001n9259p3019N8420r8602m171
$$ 305553 301821 359425 549372 565375 421149 406148 346889 273870 332290 233688 229517
11497B29517N9721R2665l799o0271J0814j5740j5974R1144l5034j6844P8916p303
$$ 229517 289238 381903 378104 317833 328647 312907 296933 388077 353043 336199 415115 407812
11485D07812p0837r5823L4517n9648m4726J24777R0861Q693n8417j21649J28l5157
$$ 407812 336975 241152 275669 216021 171295 296072 386933 395626 337209 215560 215688 180531
11473A80531L2123M849Q107q7692Q9501J12149n8962k2982j6895L1281O1998J28812
$$ 180531 212654 217503 225610 137918 227419 339568 280606 257624 240729 272010 334008 462820
11461D62820n1165j20713n2326k8401M5979K44704j5531r0801j84053q2031J27008
$$ 462820 411655 290942 238616 210215 256194 500898 485367 394566 210513 128482 255490
11450B55490J01083j5632L2022N617n7064l6246R349M9092N7091o3106j07916
$$ 255490 356573 340941 372963 378580 321516 285270 294619 343711 400802 337696 229780
11439B29780J5172k6482j15784n3406J13823n8222L3496J05303J42744m369m1446
$$ 229780 244952 218470 102686 49280 163103 104881 138377 243680 386424 382055 340609
11428C40609n981M0576P6176P278j47589J886k6185M4514J04263L1895j26390
$$ 340609 334628 375204 451380 458658 311069 312955 286770 331284 435547 467442 341052
11417C41052o4005Q724M9759R1128q1715L0048q3636O3404m9663j2580l3472J4427
$$ 341052 277047 285771 335530 426658 344943 374991 291355 354759 305096 292516 259044 273471
11405B73471o5499m1919m468O7523o8780M4967j41712L7038O4762J08545l1297
$$ 273471 207972 166053 161585 229108 160328 205295 63583 100621 165383 273928 242631
11394B42631k2116o1579j2952J6029R063P1659J47263k2463o6785L6883Q1312
$$ 242631 220515 158936 145984 162013 171076 242735 389998 367535 300750 337633 418945
11383D18945P271L935L7613R6138q8688o0008j293m302O385o4268Q5334O829j54153
$$ 418945 426216 430151 467764 563902 475214 415206 413913 409611 415996 351728 437062 443891 289738
11370B89738J60118J28337K5350j30595J6704J32435Q2440J63283J48668K5913
$$ 289738 449856 578193 603543 472948 489652 622087 704527 867810 1016478 1042391
11360A042391J5723J85728J28499J940M5144J3048N2876j6062J39237J58187J74622
$$ 1042391 1058114 1243842 1372341 1374281 1419425 1432473 1485349 1469287 1608524 1766711 1941333
11349A941333J29669L54305M56100O10216O39381O72151P91094J040856J576906
$$ 1941333 2071002 2425307 2881407 3491623 4131004 4803155 5594249 6635105 8212011
11340H212011K292789L296103M445689N805302P097218O952194M428967o0849
$$ 8212011 10504800 13800903 18246592 24051894 31149112 38101306 42530273 42469424
11332D2469424m579066p140112o993034n510620m082120k927569j947924j292483
$$ 42469424 37890358 30750246 23757212 18246592 14164472 11236903 9288979 7996496
11324G996496r97677p91638o35145m83334l76359l05040j81984j21312j17673
$$ 7996496 6998819 6207181 5572036 5088702 4712343 4407303 4225319 4104007 3986334
11315C986334J2930J57304K87336L85129M93983Q27227J027247J225190J737572
$$ 3986334 3999264 4156568 4443904 4829033 5323016 6150243 7177490 8402680 10140252
11306A0140252K331217L461718M980893O502437P252335O231226K591242k544090
$$ 10140252 12471469 15933187 20914080 27416517 34668852 40900078 43491320 40947230
11298D0947230o424480p584988o607693m859081l441839k338852j663185j334284
$$ 40947230 34522750 26937762 20330069 15470988 12029149 9690297 8027112 6692828
11290F692828q39483o93060o17523n26309l39693j57510k97059l50631l38848
$$ 6692828 5853345 5160285 4542762 4016453 3676760 3519250 3222191 2871560 2532712
11281B532712j58856q8440j29803q8123r9180r3249j50144j17940O9690M3192
$$ 2532712 2373856 2285416 2155613 2067490 1968310 1875061 1724917 1606977 1676667 1719859
11271A719859j8371o0480l6655j23794q6144R3739p2324R302J99083P5315O2913
$$ 1719859 1701488 1641008 1604353 1480559 1394415 1488154 1415830 1425132 1624215 1699530 1762443
11260A762443J44789J48095J57329P9183j9148j0000J35274J30858K24121L15975
$$ 1762443 1907232 2055327 2212656 2291839 2272691 2262691 2397965 2528823 2752944 3068919
11250C068919L86897M17193N18938O17417P01076R31250J262329J465250K013282
$$ 3068919 3455816 3873009 4391947 5009364 5710440 6641690 7904019 9369269 11382551
11241A1382551K581693L680197N195666O998737Q818146R354628P246609J934526
$$ 11382551 13964244 17644441 22840107 29838844 38656990 48011618 55258227 57192753
11233E7192753m283277q422731r216306p971312o065086m331819l119897k209297
$$ 57192753 52909476 44486745 35270439 27299127 21234041 16902222 13782325 11573028
11225A1573028j528197j120874r72292q13929n27708l45299k21389l833p7405
$$ 11573028 10044831 8923957 7951665 7137736 6610028 6264729 6043340 6039507 5962102
11216E962102p230J78529M60342M47680N56556Q67384J096727J510560K134392
$$ 5962102 5954872 6133401 6593743 7041423 7597979 8465363 9562090 11072650 13207042
11207A3207042L026670M049825N498015P263873Q468921P901103M513745r16562
$$ 13207042 16233712 20283537 25781552 33045425 41514346 49415449 53929194 53012632
11199E3012632o024244q590757q392351o892286n050139l465832k615230j945409
$$ 53012632 46988388 38397631 30005280 23112994 18062855 14597023 11981793 10036384
11191A0036384j366038j115796q78771p47263o76438n05967l24118l09813k02542
$$ 10036384 8670346 7554550 6675779 5928516 5252078 4746111 4421993 4112180 3909638
11182C909638l8327k04531k42254j08146J56095M7375l64158l64132k60713k91979
$$ 3909638 3871311 3666780 3424526 3316380 3472475 3519850 3155692 2791560 2530847 2238868
11172B238868k52567n9111K3448K2906N398q9363k1473j36204j16807j35378j00584
$$ 2238868 1986301 1927190 1950638 1973544 1978942 1889579 1868106 1731902 1615095 1479717 1379133
11161A379133j27356j27505l1192j01164p6060o1488M7837N4241o3589k6992k593
$$ 1379133 1251777 1124272 1093080 991916 915856 854368 902205 956446 892857 865865 863272
11150H63272P6168J40624P792L9168J21695K10586J3936J7824p435o6258l8935
$$ 863272 939440 1080064 1087856 1127024 1248719 1459305 1473241 1491065 1483630 1417372 1378437
11139A378437j09472k02880j36894j61313j03066l4250j20944p5433j7467k8116
$$ 1378437 1268965 1066085 929191 767878 664812 630562 509618 434185 416718 388602
11129C88602N2109L2225l480k2673m3145j31911L4385J02703J39504l0047L2820
$$ 388602 440711 472936 469456 446783 403638 271727 306112 408815 548319 518272 551092
11118E51092j7793n514P7055o7713l1672Q1113L0719k2854k6830J06304K18004
$$ 551092 533299 527785 604840 537127 505455 586568 617287 594433 567603 673907 891911
11107H91911J77822J38362N5931K00665j44358j85350j20200k09631r9625j2112
$$ 891911 1069733 1208095 1264026 1464691 1320333 1134983 1014783 805152 705527 693415
11097F93415o1889k18812r0267k1242J25924J29123l6706L2737N3369O6876n479
$$ 693415 631526 412714 322447 301205 427129 556252 519546 552283 605652 672528 667049
11086F67049K7371M8352Q842O0014N0552K2984n3251j44524l7666q4122j17520
$$ 667049 694420 742772 751614 811628 862180 885164 831913 687389 649723 565601 448081
11075D48081l4574Q1741N8029N907L4275j35339n5834K32259J80979J31331K38002
$$ 448081 413507 495248 553277 559184 593459 458120 402286 634545 815524 946855 1184857
11064A184857J95035q5873k51291k04257r2115m0708j3711J5578K432j3151p0055
$$ 1184857 1379892 1294019 1042728 838471 746356 705648 691937 707515 709947 696796 626741
11053F26741P4421n2905k30792j12946M0053M6960J74059K6727P9061M1177j35359
$$ 626741 701162 648257 417465 304519 344572 391532 565591 592318 671379 712556 577197
11042E77197j79118M484P7755p332J0917J04305J89017J1588J25216J71130R0020
$$ 577197 398079 402563 480318 472986 483903 588208 777225 788813 914029 1085159 1175179
11031A175179l8319q0632k12999j07102N6171J03122J16052K34737R0561J95004
$$ 1175179 1136860 1056228 843229 736127 792298 895420 1011472 1246209 1336770 1531774
11021A531774m3788j39984j33624j93175j93916j70682r4420j4015R7103R5063
$$ 1531774 1487986 1348002 1214378 1021203 827287 656605 562185 548170 645273 740336
11011G40336J57534R2571K9382o4555j03752j81348k42877k4213J8631K5867R8517
$$ 740336 897870 990441 1019823 955268 851516 670168 427291 403078 421709 447576 546093
11000E46093J25755O9766j9042J2824k1549j3725j23602j03744p9920j7167J14960
$$ 546093 671848 741614 722572 735396 713847 700122 576520 472776 392856 375689 490649
10989D90649q3011j07971q8794M1885q3410l0194N5674l6612n2886Q3853R4935
$$ 490649 407638 299667 210873 252758 169348 139154 194828 158216 105330 189183 284118
10978B84118o1546L0542r2593k4500R3653R183K3243J6661p6460p1238l6249J2506
$$ 284118 222572 253114 160521 136021 229674 238857 262100 278761 202301 131063 94814 107320
10966A07320J19995K1600q1952J17345K9615m5381o0620J6406r4771K8748k9524
$$ 107320 227315 248915 166963 284308 313923 268542 207922 224328 129557 158305 128781
10955A28781Q6934J14687l4580Q556k04143j35536K4032R3193O4001O9305j3210
$$ 128781 215715 330402 295822 304378 100235 -35301 -11269 81924 145925 215230 202020
10944B02020o6679L3227r4192o8841P8893P9412L0954q6965q228l4954l9192p0677
$$ 202020 135341 168568 74376 5535 84428 163840 194794 107829 99601 64647 25455 -45222
10932d5222j35957j0475O6845J08233L9969L7494N9158j00545O013R8183K3035
$$ -45222 -181179 -191654 -124809 -16576 23393 60887 120045 19500 25513 123696 146731
10921A46731J33948j15886j10184m8438j972R1639K2906O6757k5844j0404j18348
$$ 146731 280679 164793 54609 6171 4199 95838 118744 185501 159657 149253 30905
10910C0905j14149m6147M2361R7955k4417O6493P2329M0852M5793q2299m4255
$$ 30905 -83244 -129391 -87030 10925 -13492 53001 125330 166182 211975 129676 85421
10899H5421P9102J70965P3781o9719r2756M7807n0742P4220M1201J08794n0816
$$ 85421 164523 335488 409269 339550 246794 294601 243859 318079 359280 468074 417258
10888D17258j54813n6382M8957N3950l3314r5192k9243p5450j11753k448J42711
$$ 417258 262445 206063 255020 308970 275656 180464 151221 75771 -35982 -38430 104281
10877A04281j5266o3797J19199R0858Q5785o729j4554K8879r469k88498j36188
$$ 104281 89015 25218 144417 235275 321060 314331 299777 328656 319187 30689 -105499
10866a05499L884Q9760J65691j4680l1802j59751K2836N9408m406L1815k6582
$$ -105499 -101615 -11855 153836 139156 107354 -52397 -29561 29847 25441 57256 30674
10855C0674J9104r046l2757Q8154K31879O2365j70977j27572J8535R6596J3670
$$ 30674 49778 40732 7975 96129 328008 390373 219396 91824 110359 206955 220625
10844B20625K1932j1943o068J6989Q3564q9897l0966Q6001q5535p8050J095p8371
$$ 220625 242557 230614 224546 241535 325099 235202 204236 290237 204702 126652 127747 49376
10832D9376j20084J0602J21545M1845L3888m7781L351K7064J20230O3918q7067
$$ 49376 -70708 -60106 61439 103284 137172 89391 92742 119806 240036 303954 216887
10821B16887J1355L0098l0903n9308M0591M6884N234k0243j09842l1032N549Q4996
$$ 216887 228242 258340 227437 168129 208720 255604 260838 240595 130753 99721 105270 190266
10809A90266O7048O4259K881o7980n2459r3396l2183R9700J5283n3859q796l847
$$ 190266 257314 321573 324454 256474 204015 110619 78436 178136 193419 139560 130764 126917
10797A26917N2520J99679K964j31944r2229j3145m1240O5984L0347R235K7920
$$ 126917 179437 379116 382080 250136 157907 144762 103522 169506 199853 209088 237008
10786B37008J2792k6969m7592o2460n8929Q3326J0091r5167Q2772R9807k1266
$$ 237008 249800 222831 175239 112779 53850 137176 147267 52100 134872 234679 213413
10775B13413n7765m1116K4610K9739K9880r388j07759m9697N8475L4584N8734
$$ 213413 155648 114532 139142 168881 198761 189373 81614 31917 90392 124976 183710
10764A83710K5947l751l7724r584K6220j6903q1419J1031M0242k2057j41256j24771
$$ 183710 209657 205906 168182 158598 184818 167915 86496 97527 137769 115712 -25544 -150315
10752a50315L8478J65133J6387m4112o2196n1122O1954J63364Q2918k6463j3929
$$ -150315 -111837 53296 69683 25571 -36625 -87747 -25793 137571 220489 194026 180097
10741A80097K1929q3790o8311l3138m61O0025P5418J11727O0891J1497O2466R6858
$$ 180097 202026 118236 49925 16787 16326 76351 151769 263496 324387 335884 398350 495208
10729D95208J59209p9728r1285m9726j4k3966p9841j45762o4817j3970R4472N2451
$$ 495208 654417 574689 483404 433678 433664 409698 329857 184095 119278 105308 199780 252231
10717B52231M5502j08638r8854q5535k8951m9226m3001O8645J50073n520j8083
$$ 252231 297733 189095 90241 4706 -24245 -73471 -116472 -47827 102246 96726 78643
10706G8643Q8208Q0603m0388l2377l1186K6860j52185o8477J1759O3743J06713
$$ 78643 166851 247454 207066 174689 143503 170363 18178 -50299 -38540 25203 131916
10695A31916j2473P868l7582k4196N6703l1196J3667J7326j8763O189R6053J59040
$$ 131916 119443 127311 89729 65533 122236 91040 104707 122033 103270 109459 205512 364552
10683C64552J17246K9950M5741O2485j6468n1267m3996k6738K3754K3133J43863
$$ 364552 481798 511748 557489 619974 603506 552239 508243 481505 505259 528392 672255
10672F72255L2962j03295k6169Q9454K6921L2238J27630J93567J16949J33912
$$ 672255 705217 601922 575753 665207 692128 724366 851996 1045563 1162512 1296424
10662A296424J50122P7479R6949J57176J84066J62281J46882J17326M18163M39071
$$ 1296424 1446546 1524025 1620974 1778150 1962216 2124497 2271379 2388705 2806868 3245939
10652C245939L34839K50884N73098O44251M52655L39686K65513O25037J163623
$$ 3245939 3580778 3831662 4404760 5049011 5501666 5841352 6106865 6731902 7895525
10643G895525J371395J854793K701407L688286N189928P179887R295960J0376148
$$ 7895525 9266920 11121713 13823120 17511406 22701334 29881221 39177181 49553329
10635D9553329Q605156K608313m828279r140475r509857p628675n404035l657573
$$ 49553329 58158485 60766798 55938519 46798044 37288187 29659512 24255477 20597904
10627B0597904k421967j338566o14395l3134P05962J515658K454620L759263N494508
$$ 20597904 18175937 16837371 16222976 16189842 16895804 18411462 20866082 24625345 30119853
10618C0119853P535066R436364J0668475R630544N458174K63832l391308m034099
$$ 30119853 37654919 47091283 57759758 67390302 72848476 73112308 69721000 65686901
10610F5686901k290463P18110M448614Q895391J4058936J9361764K2318441J9005243
$$ 65686901 63396438 64114548 68563162 77458553 91517489 110879253 133197694 152202937
10602A52202937P535586o632392j4682700j4548970r417978k844711L940377J1166948
$$ 152202937 159738523 153106131 138423431 123874461 114456483 111611772 115552149 126719097
10594A26719097J8942917K5624021K8030391K1008635K638527j7953650k7939287
$$ 126719097 145662014 171286035 199316426 220325061 222963588 205009938 177070651
10587A77070651k5845321j8567283j0259424k689943M225517J0693331J6204044
$$ 177070651 151225330 132658047 122398623 119708680 123934197 134627528 150831572
10580A50831572J8187280J3521849K407543q847716j3321480j3074752j3693348
$$ 150831572 169018852 182540701 184948244 176100528 162779048 149704296 136010948
10573A36010948j5146900j4341213j0390480n515595j756020m56407k445155o784240
$$ 136010948 120864048 106522835 96132355 90616760 88860740 88404333 85959178 79174938
10565G9174938j0853578j2239172j1052943q748039o379733m518972l388673k579939
$$ 79174938 68321360 56082188 45029245 36281206 29901473 25382501 21993828 19413889
10557A9413889j842080j376942j346372j158831j057924r87188o90844n69184
$$ 19413889 17571809 16194867 14848495 13689664 12631740 11644552 10953708 10384524
10549A0384524n86158k83043J14189J97862K83664M78950P98884J350084K107015
$$ 10384524 9798366 9515323 9629512 9827374 10111038 10589988 11388872 12738956 14845971
10540A4845971L313696M701507O555380Q167220P813637L938975k570625p462303
$$ 14845971 18159667 22861174 29416554 37583774 45397411 49336386 46765761 39303458
10532C9303458q465731p115452n182365l691197k638706j859220j356202r82582
$$ 39303458 30837727 23722275 18539910 14848713 12210007 10350787 8994585 8012003
10524H012003o97150o07655n53206m95033n00082k89104k44737k76688k80926
$$ 8012003 7314853 6707198 6153992 5658959 5158877 4869773 4625036 4348348 4067422
10515D067422k33696k1447n3966j17248m8131j1117M0843q2435l5903o797J01941
$$ 4067422 3833726 3812279 3758313 3641065 3592934 3581817 3622660 3540225 3504322 3497525 3599466
10504C599466N4624j62964j07990k79855j20070J5539o9124J45777J06865n7189
$$ 3599466 3654090 3491126 3383136 3103281 2983211 2998750 2929626 3075403 3182268 3125079
10494C125079j1781J50942J32388J64504J75316J71383K83246N09237O33908P23211
$$ 3125079 3113298 3264240 3396628 3561132 3736448 3907831 4191077 4700314 5334222 6057433
10484F057433Q96870J027935J622687K362815L485658M993511O906656Q246386
$$ 6057433 6954303 7982238 9604925 11967740 15453398 20446909 27353565 35599951
10476C5599951P425073L143647l378479p666166q221087o605977m561188l271398
$$ 35599951 43025024 46168671 42790192 35124026 26902939 20296962 15735774 12464376
10468A2464376k321480j634266j255631r09174o91600n84819n38326l69615l63592
$$ 12464376 10142896 8508630 7252999 6343825 5652225 5067406 4529080 4159465 3795873
10459C795873k58245k20404j36551p618r3411k05531q932J15240Q885k16956k54187
$$ 3795873 3537628 3317224 3180673 3173055 3079644 2874113 2865181 2980421 2989306 2772350 2518163
10448B518163k46417j93014k50687l2648j25161j45405p9647j6132l5238Q5630
$$ 2518163 2271746 2078732 1828045 1795397 1670236 1524831 1445184 1429052 1393814 1479444
10438A479444m6954j00772j84994r0098J05055J25844J16835L3398r4203n1453
$$ 1479444 1432490 1331718 1146724 1056626 1161681 1287525 1404360 1437758 1343555 1292102
10428A292102p3854j60688j49172K3586o231q4011p2095K3049Q4329M9698k7584
$$ 1292102 1218248 1057560 908388 931974 925743 841732 769637 792686 877015 926713 899129
10417H99129j1480j11518L1960L1095j28785n5419J03114K51733J06662k7676
$$ 899129 887649 776131 808091 839186 710401 654982 758096 1009829 1116491 1088815
10407A088815j07752N0776J34869J15790J26261J28125P8468m8881j47326j07120
$$ 1088815 981063 1031839 1166708 1282498 1408759 1536884 1615352 1566471 1419145 1312025
10397A312025j58540j10589p6710n9736m8611p0076p1709n1940O830n8280p7230
$$ 1312025 1153485 1042896 966186 906450 857839 787763 716054 664114 670944 612664 535434
10386E35434l4613n621m7727q5184J27067J80085o2410o1462l5633o8221K6463
$$ 535434 500821 495200 447473 362289 489356 669441 607031 545569 509936 441715 468178
10375D68178J4851o0825j29813p35P2164P7519P8559L6155l6386j05137o3682
$$ 468178 483029 422204 292391 291656 363820 441339 519898 556053 519667 414530 350848
10364C50848j2740m8866R9598J13571p516Q4184N2107k4378J474o9737m5433J02826
$$ 350848 338108 289242 388840 502411 494895 579079 631186 606808 608282 538545 493112 595938
10352E95938j15192l2047J0601M654j51255L2580J12360O8519r7298O220p957
$$ 595938 480746 448699 459300 463954 312699 345279 457639 526158 428860 435080 427123
10341D27123Q4933p1230m1292J421P355N4681L4321K396Q9912p1930l939N258
$$ 427123 512056 440826 399534 400955 408310 462991 497312 499708 589620 517690 513751 519009
10329E19009k5323r9392L5264j38769k7774K6821P700p2797J17134m3555k0743
$$ 519009 493686 394294 429558 290789 263015 289836 297536 224739 341873 298318 277575
10318B77575M5613l9817k234j5573J0705k2137R5663Q6775j1283K1874n399r6857
$$ 277575 323188 283371 281137 265564 276269 254132 349795 436570 425287 447161 441762 344905
10306C44905q2540m5921j8838n0746L9788J80142R4066k6099J6042L8543M6068
$$ 344905 262365 216444 197606 146860 186648 366790 460856 434757 450799 489342 535410
10295E35410q3242j42222j39463N6550J29624J1351j301K8597l9645N7424O6857
$$ 535410 452168 309946 170483 227033 356657 368008 366707 395304 355659 413083 479940
10284D79940L5171n2388j44076M6401J13414L9065o3710m9519r5475N8254R8382
$$ 479940 515111 462723 318647 365048 478462 517527 453817 404298 308823 367077 465459
10273D65459K8222n8437l6858N2857M2342j15983o4303l9454O3880l0051j6848
$$ 465459 493681 435244 398386 451243 493585 377602 313299 273845 337725 307674 290826
10262B90826O7299M9413M8824j52622J6131q2022j1611M6677N2342l8471P6615
$$ 290826 358125 407538 456362 303740 319871 237849 226238 272915 325257 286786 363401
10251C63401j1361m3955n7281L6186l9801o998Q4527M6570n6936K2941L7755r0087
$$ 363401 352040 308085 250804 286990 247189 240191 324718 371288 314352 337293 375048 284961
10239B84961p4338n8415O0760N9856j14502n6051j0154O1708M8832Q2299J7345
$$ 284961 210623 152208 212968 272824 158322 102271 92117 153825 202657 284956 302301
10228C02301p0040M6967J35717N430O6987n9043j28784r5293o6987M7056k0971
$$ 302301 232261 279228 414945 420375 487362 428319 299535 204242 137255 184311 163340
10217A63340n1347K7093J5236J26861K16316P887n9030K007P5040j09677j14666
$$ 163340 111993 139086 154322 281183 497499 505386 446356 448363 523403 413726 299060
10206B99060n1172J5122k4l0707L1367k1687p096k3694j24933q6307J43631P1717
$$ 299060 247888 263010 262986 232279 263646 241959 234863 211169 86236 -71 143560 215277
10194B15277l3438R868J2183K1954N1245m7634r4397N5955N5945j2826p098k4244
$$ 215277 181839 191707 203890 225844 277089 229455 135058 191013 246958 234132 227034 202790
10182B02790P4762J12285J39389R5150J12831O603o8555j3980J54218L5585p7396
$$ 202790 277552 389837 529226 624376 737207 743810 675255 661275 815493 851078 773682
10171G73682L7188R4057J1434K13975N5158p0094n0335k0065j10052j59801P987
$$ 773682 810870 904927 916361 1130336 1185494 1115400 1065065 1045000 934948 775147 783134
10160G83134l0982N2360J37191K00531N5464J58244K35329P0279r5722k08929
$$ 783134 752152 804512 941703 1142234 1197698 1355942 1591271 1661550 1565828 1356899
10150A356899j46994j1227M7154o5486j49470K130m9294J14368P9874p8705k9988
$$ 1356899 1209905 1198678 1245832 1180346 1030876 1033006 983712 1098080 1177954 1099249 1069261
10139A069261k14587j76807n3438o1501M9967N4934k2321O2412J14697j14450
$$ 1069261 854674 677867 624429 562928 612895 667829 645508 707920 822617 708167
10129G08167j73136p6684L8174J1935o519p7449l3187k712j01111j55507m8616
$$ 708167 535031 458347 496521 508456 501937 424488 391301 388589 287478 131971 83355
10118H3355L2691N7177n6056J22905Q5045M1144j5099K8089o2416p8831l3243
$$ 83355 116046 173223 117167 240072 325117 366261 351162 379251 316835 238004 204761
10107B04761N578l3373j31427o61R8816J7188k8170K069O6354J5610j7170k0165
$$ 204761 210339 176966 45539 44878 143694 160882 132712 134781 201135 216745 199575 179410
10095A79410J25769L4596j73364p1585J12459J13383O2270j66484k047O5289k1228
$$ 179410 305179 339775 166411 94826 207285 320668 382938 216454 214407 279696 258468
10084B58468L2736l6989j01006n0213L6159j8370q5020N9798L2845K8464K4199
$$ 258468 291204 254215 153209 102996 139155 120785 35765 95563 128408 156872 181071
10073A81071P9280N579L8285l156q4915J21671J2327j92508q4985n4787O455r7221
$$ 181071 260351 265930 304215 301059 216144 337815 350142 157634 72649 17862 24317 -72904
10061g2904J0269J36672R2229J67119n1951J405l4752j37897j01239J64539J58359
$$ -72904 -62635 74037 166266 333385 281434 282839 248087 110190 8951 173490 331849
10050C31849P1364l4595j06800K549l4753j93046Q8164J2966Q4479M43k37355
$$ 331849 403213 368618 261818 264367 229614 36568 124732 137698 222177 222620 -14735
10039a4735J2336Q5217l6485O875N943n1305r5580K0386J14860j8321K3026N1468
$$ -14735 -2399 82818 46333 53208 59151 7846 -87734 -67348 47512 29191 52217 103685
10027A03685Q5031m5003m7383l6286l5460l8457r4203l5321N8654J08608J01426
$$ 103685 188716 143713 96330 60044 24584 -13873 -108076 -143397 -84743 23865 125291
10016A25291N2661n8154o2160k1936m170O6024J13088K325q0549p7802l6513J33147
$$ 125291 177952 119798 57638 35702 31532 97556 210644 212969 132420 54618 18105 151252
10004A51252q609O8929M0363q3528M767M7246j10774q8219m8416o7514N1657J24784
$$ 151252 142643 211572 251935 168407 173174 220420 109646 21427 -26989 -94503 -42846 81938
9992H1938M1871q8766J3221J5567n7058o1802j2368J924L8757Q4169r3024O817
$$ 81938 123809 35043 48264 63831 6773 -55029 -67397 -65473 -26716 57453 -35571 -28754
9980b8754K1699o6608j00547R2641J14263L8217J4948J09676n5736N3208p6382
$$ -28754 -7055 -73663 -174210 -81569 32694 70911 85859 195535 139799 193007 116625
9969A16625j05270M6426J25663K4691R355o4727q3367J06789O0899N0315J0940
$$ 116625 11355 57781 183444 208135 217490 152763 69396 176185 237084 287399 298339
9958B98339q3973k85963j61386J18480Q7450N9664M7603L3282r655J9935j24752
$$ 298339 214366 -71597 -232983 -114503 -27053 32611 80214 113496 103841 123776 -976
9947i76Q2543N9749j12999p7115N667k2640J0100j8158M6727M1190k0051r983
$$ -976 81567 141316 28317 -48798 -43131 -65771 -55671 -73829 -27102 14088 -5963 -15946
9935a5946l0445L4055J19836J27978N50l5504j63747p2615k2739n1632M2132L5158
$$ -15946 -46391 -12336 107500 235478 236028 200524 36777 -35838 -58577 -110209 -68077 -32919
9923c2919O0339Q329J41999n840N5867j2183J742N3912k1419p130l2299j20474
$$ -32919 27420 35749 177748 171908 227775 215592 217334 271246 249827 242697 210398 89924
9911H9924o1112M5565N3441R7302o9117m2876j5852M3634n8979L2307R496l8973
$$ 89924 28812 74377 127818 225120 156003 113127 97275 140909 81930 114237 123733 84760
9899H4760l5206m2562n4175R230o531N235J4192L2176J0212m1501R687J15324
$$ 84760 49554 6992 -47183 -37953 -44484 -39249 -25057 7119 17331 -24170 -14483 100841
9887A00841Q3002M3996L6634j4949l138j16185J7309j707k9145P345L9059N0565
$$ 100841 183843 227839 264473 249524 246386 130201 147510 145803 116658 124003 163062 213627
9875B13627j01822p4682J37695k22n2778o7712p7409K222k843p459p653J82573
$$ 213627 111805 37123 174818 174596 121818 54106 -23303 -21081 -23924 -31383 -39036 143537
9863A43537P3013o3039L1643o245q8399j72175k7646P4892J96083J13600o6161
$$ 143537 216550 153511 185154 178909 90510 -81665 -109311 -34419 161664 275264 209103
9852B09103l9156j46360j04661J0165O2607j9864n8024N8308J56174Q1597n6562
$$ 209103 169947 23587 -81074 -70909 -8302 -28166 -86190 -27882 128292 209889 153327
9841A53327m5041l6321K4539J9225N8406n563n4902Q286r856k8679M8765J9984
$$ 153327 108286 71965 96504 115729 174135 168572 113670 121956 112100 83421 132186 152170
9829A52170j15197O4043R0210J0397m0356j23481l9299o2284K410n1302k8870
$$ 152170 36973 101016 191226 201623 161267 37786 -1513 -63797 -61387 -112689 -141559
9818a41559L4131O1770J2079J15897L0763m3119m7624O9410j5089j02491K2593
$$ -141559 -107428 -45658 -33579 82318 113081 69962 22338 91748 76659 -25832 -3239
9807c239p311l8408L7651j602j00200k7623M352K642K2216k2667P1425L0096L5311
$$ -3239 -10550 -48958 -11307 -12909 -113109 -140732 -136380 -133738 -111522 -134189 -62764 -32668 2643
9794B643K1733P3637m8667L8304N7989M9449K6359q5194l197l0694n2601N410
$$ 2643 24376 98013 49346 87650 145639 195088 221447 136253 133056 102362 49761 55171
9782E5171j11245j1688J16130M0694K46p6186N0516J12893j06762L6260l2120
$$ 55171 -56074 -67762 48368 89062 89308 13122 63638 176531 69769 106029 73909
9771G3909K1703J01375K0276O0063J4417n1257O1776o164j29881n2005j23519
$$ 73909 95612 196987 217263 277326 291743 240486 302262 296098 166217 114212 -9307
9760i307p543j3947J2100J29308k8000q2599m9996J215k5851J39334N5937O3420
$$ -9307 -16850 -30797 -18697 110611 82611 12 -49984 -48769 -74620 64714 120651 184071
9748A84071m5901O7400q0695j46309k5110Q7000N445J7291k0872l1332o4351L1122
$$ 184071 138170 205570 124875 -21434 -46544 40456 45901 63192 42320 10988 -53363 -22241
9736b2241N2339j7402p3274n5102R7603k0607Q699k0383o2166p5926J42568Q6512
$$ -22241 30098 12696 -60578 -115680 -18077 -38684 -29985 -50368 -112534 -188460 -45892 40620
9724D0620m1218m2336R7874J565j03067n3651N307j22913R1804J62721J04724
$$ 40620 -598 -42934 54940 56505 -46562 -100213 -94906 -217819 -126015 36706 141430
9713A41430L3105l0029M211j05778M1808J56520j10702j40835j196J47024j6038
$$ 141430 174535 144506 148717 42939 84747 241267 130565 -10270 -11466 135558 119520
9702A19520O4092O1753p2591k17742m675N5692K5405N5710j09415o0548J18185
$$ 119520 183612 245365 172774 -44968 -49643 6049 31454 87164 -22251 -82799 35386
9691C5386J25970j2931n6992p9205P750L0721L8094J5388N9840P5189m1332m8542
$$ 35386 161356 148425 91433 12228 19978 50699 88793 104181 164021 239210 197878 149336
9679A49336j22515j33149j04406P5007J39897k0703J528Q8020P3180K5492j08454
$$ 149336 26821 -106328 -210734 -135727 4170 -16533 -15005 73015 146195 171687 63233
9668F3233o5447J2260n6077n178N6314J33074J02083n4155o4428k0961J08647
$$ 63233 -2214 10046 -46031 -51209 5105 138179 240262 186107 121679 100718 209365
9657B09365P2988k927m5256n4840R8503J32755J91987J2817j16076j48443j56331
$$ 209365 282353 279426 234170 179330 277833 410588 602575 615392 499316 350873 194542
9646A94542j80511j13730N1751R1679j9450r7336P1626N340K3621O701n1071M2203
$$ 194542 14031 -99699 -47948 43731 24281 -73055 -1429 3911 27532 34233 -16838 25365
9634B5365P5719Q588M5211r9449j26535Q0145P5634N4305O3285k0363j1255j59956
$$ 25365 101084 109672 154883 55434 -71101 9044 84678 138983 202268 181905 170650 10694
9622A0694P3252l9992q1595o6827J31156L8478k4566j38209j33966L1920J67689
$$ 10694 83946 43954 -37641 -104468 26688 65166 40600 -97609 -231575 -199655 -31966
9611c1966m094j06860r0295O8240J05555n921J6571J09417n3697r4910l5053N6138
$$ -31966 -36060 -142920 -233215 -164975 -59420 -65341 -48770 60647 6950 -87960 -123013 -66875
9599f6875j8608r235J4006L9890k616J5342m577P5304k1949K4264l0546r688L3179
$$ -66875 -85483 -94718 -80712 -40822 -43438 -28096 -32673 42631 20682 44946 14400 4712 37891
9586C7891L5157r282l8996L3482p3111j0743P5263M6640Q379n9218k0501J52384
$$ 37891 73048 63766 24770 58252 -14859 -25602 49661 96301 104680 45462 24961 177345
9574A77345O2092K5885n661n7853j37247K7067N1512j15529k5949J61173o885
$$ 177345 239437 265322 259661 201808 64561 91628 143140 27611 1662 162835 155950
9563A55950m5862n8672M8956Q3074m7269o738l2676j63594r8430R5203N5012J11249
$$ 155950 110088 51416 100372 183446 136177 129439 96763 -66831 -165261 -70058 -15046 96203
9551I6203J00743r039J0585J2023j33012j31924J61549L9462n8791q6415q3058
$$ 96203 196946 187907 198492 210515 77503 -54421 107128 146590 87799 1384 -81674
9540h1674j0127R0255l7521O2804m8603j00343o5473N4791M8948Q7813j0461j9718
$$ -81674 -91801 -1546 -39067 23737 -24866 -125209 -190682 -135891 -86943 870 -9591 -29309
9528b9309P1386l3808R909O4216J36901n6999k0278q9127o8957L5090l9796r5005
$$ -29309 42077 8269 18178 82394 219295 162296 142018 52891 -16066 19024 -20772 -115777
9516a15777J36979P8732q9119m022k5717r8985p6164k4939L2997J42562J3502
$$ -115777 21202 99934 10815 6793 -18924 -117909 -194073 -219012 -186015 -43453 -29951
9505b9951j02838O6523J38547J1774q4117j13350l1486j32473m6361N4623R6468
$$ -29951 -132789 -66266 72281 84055 -62 -113412 -144898 -277371 -323732 -269109 -172641
9494a72641P1270l7894O5561r30L2095J7928Q8388Q5305P5322p8448j01201q6184
$$ -172641 -101371 -139265 -73704 -74634 -42539 -24611 63777 149082 224404 145956 44755 -41429
9482d1429j0658m370j7801J8818O0049j6223J1380o2881J21106O2912m530j3298
$$ -41429 -52087 -56457 -74258 -55440 4609 -11614 -234 -63115 57991 120903 116373 103075
9470A03075l6352p6106r7601O0445R9539K6642k418k2618P417r4802k1931O9277
$$ 103075 66723 -9383 -106984 -46539 53000 79642 77224 54606 62023 -32779 -54710 14567
9458A4567q0441n2406P6454L2717q850P9922L2363p6173q5720N1123J11000k0385
$$ 14567 -65874 -118280 -41826 -9109 -17959 61963 94326 18153 -67567 -16444 94556 74171
9446G4171n0615M8362p2489l6193q541K9967O418o1539j0733n0935L1486O8236
$$ 74171 23556 71918 -571 -36764 -45305 -15338 -8920 -70459 -81192 -132127 -100641 -32405
9434c2405P2370l4704j09187J5167O7108N6129J5191m5169J7410R8470Q2181j9948
$$ -32405 39965 5261 -103926 -88759 -21651 34478 49669 4500 21910 120380 202561 182613
9422A82613l1889j18399N9350j12086m3324K8242L0796m7585N349o1895L4759
$$ 182613 150724 32325 91675 -20411 -63735 -35493 -4697 -52282 -46933 -108828 -74069
9411g4069K5255K1845J17219L9361j00744J36817R0413r0747l6527j2131m6169
$$ -74069 -48814 -26969 90250 129611 28867 165684 256097 165350 128823 116692 70523
9400G0523j97030O9847R3048J1259O5670K0681j6602J5728J1809k3504o5925m9506
$$ 70523 -126507 -56660 36388 47647 113317 133998 117396 133124 144933 121429 55504 5998
9388E998j79288q3961J59859J21385N7875M1860q4759j18288K5570n6699k6034
$$ 5998 -173290 -257251 -97392 23993 81868 123728 38969 -79319 -53749 -110448 -136482
9377a36482J07061M9721n4324n367P1612J5193m718m3798r6124J04115n512m1496
$$ -136482 -29421 20300 -34024 -39391 32221 47414 42696 -1102 -97226 6889 1377 -40119
9365d0119J6514j0796O3190K9739n0056P047K3575O8670m9929Q8535k4638R3129
$$ -40119 -23605 -34401 28789 58528 8472 15519 39094 107764 57835 146370 121732 214861
9353B14861M8168n6502j10803k6370m5615j2636Q5510q9225o2552L8572N8615
$$ 214861 263029 206527 95724 69354 23739 11103 96613 7388 -55164 -16592 42023
9342D2023Q3981n7179l5679P0101R0988l1859j49214j21312J8733j28797m8956
$$ 42023 126004 68825 33146 103247 194235 162376 13162 -108150 -89417 -218214 -267170
9331b67170K4418J4294j0370l6879J27158J51546M8066l4945J3679P673l0228
$$ -267170 -242752 -228458 -238828 -275707 -148549 2997 51063 16118 29797 37470 7242
9320G242o0112k4701n9045N3866O9422j1121N8225Q4521O2687K917q3465r1630
$$ 7242 -52870 -77571 -136616 -82750 -13328 -24449 33776 118297 180984 183901 100436 8806
9308H806P4954J0759K1288m8188q5253r387L4198k9469p9701L3107J14660j9179
$$ 8806 83760 94519 115807 67619 -17634 -27021 7177 -22292 -101993 -68886 45774 26595
9296B6595P0937m2198M6052l5913o137K3563o8421q8482O2365q7586r4841N4688
$$ 26595 97532 55334 101386 65473 59336 82899 14478 -74004 -11639 -99225 -194066 -139378
9284a39378k73l6223M8614J34983J06269j14216M088m1558o6588N0436N1776J4911
$$ -139378 -139651 -175874 -127260 7723 113992 -224 3864 -37694 -104282 -53846 -2070 12841
9272A2841p411K4994j2964m4671j8156N0865O2627o914l2703R1259k2587m1072
$$ 12841 5430 30424 17460 -27211 -45367 5498 68125 61211 28508 119767 97180 56108
9260E6108N6505n3139p8158P67k8012L2099j64382j19507K33357l151P5161K8199
$$ 56108 112613 59474 -18684 -17917 -45929 -13830 -178212 -297719 -64362 -67513 7648 35847
9248C5847q672o630o1538L3059M8636J66583J5796o4368J0520R1007P3741p843
$$ 35847 27175 20545 -40993 -7934 40702 207285 223081 158713 169233 260240 333981 326138
9236C26138k40958p7543j57534j2575J54053J20483q3612o2105P5419J18386L9270
$$ 326138 85180 7637 -149897 -162472 -8419 112064 28452 -33653 41766 160152 199422
9225A99422n3227n2603J6766J0996m4799j2328r1637r4155r4701R5213N5367o9652
$$ 199422 146195 93592 110358 121354 76555 64227 -27410 -121565 -216266 -121053 -65686 -135338
9213a35338J63723O3152p2350q2744O7760P481n2039Q53J17474r6713N4774l3492
$$ -135338 28385 91537 19187 -63557 4203 11684 -40355 -39502 77972 -18741 36033 2541
9201B541J3666J06766n9725p0593K5702n0227m0557K8637P706l3887n2768Q6025
$$ 2541 16207 122973 63248 -7345 18357 -31870 -72427 -43790 -36084 -69971 -122739 -36714
9189c6714K18458o3824j28907R0797K9726P637N1236j06621j06318j65433J5352
$$ -36714 181744 117920 -10987 79810 109536 117173 168409 61788 -44530 -209963 -194611
9178a94611J86200L5215M573n78L7608L5045o925M053m5665m1295j11510n7172
$$ -194611 -8411 26804 31377 30799 68407 103452 96527 100580 54915 13620 -97890 -155062
9166a55062p905J6628O6363O486J4568q5703O8951R7707J04670r8348p7279J9538
$$ -155062 -162967 -146339 -79976 -73490 -58922 -144625 -75674 22033 126703 28355 -48924 -29386
9154b9386J07218j2689k0754m1536L1632j9682k0704m2570m3425J8303k5680j98010
$$ -29386 77832 65143 44389 2853 34485 14803 -5901 -48471 -91896 -73593 -99273 -297283
9142b97283L4553P6895J17993J5208j35058p2079J17712J0241k6477m149O2820
$$ -297283 -262730 -185835 -67842 -52634 -187692 -259771 -142059 -131818 -158295 -162444 -99624
9131i9624j0491n626J03178P4524k5646k2525m4493J9487K7631N1148L8878p8445
$$ -99624 -110115 -115741 -12563 61961 36315 13790 -30703 -11216 16415 67563 106441 27996
9119B7996P2692P243m5750l3061j31867l7658N8001p3510l7898n9824P8254J23638
$$ 27996 100688 107931 62181 29120 -102747 -140405 -82404 -155914 -193812 -253636 -175382 -51744
9107e1744R7947l2322m0000p505n296k297n9169j3866n7646m459j7404J74901
$$ -51744 46203 13881 -26119 -33624 -38920 -41217 -100386 -114252 -171898 -176357 -193761 -18860
9095a8860O071l8449q5072L2558K3198L4351q094l101K7250k3775K903q916K630
$$ -18860 -12789 -51238 -136310 -103752 -80554 -46203 -54297 -57398 -30148 -53923 -51020 -59936 -57306
9082e7306n422J1531J29485P1593m0027o2639l0067p9020k6247l4599K9080P7079
$$ -57306 -62728 -51197 78288 149881 109854 47215 17148 -61872 -88119 -122718 -93638 -16559
9070a6559N845j27656o2046R8674J37935L3597m6997m9059P6142N2397j8760m3849
$$ -16559 -10714 -138370 -200416 -101742 36193 69790 22793 -26266 49876 102273 83513 39664
9058C9664m9635p1959n370L7300n923o945J355j38077m0695K14264m1642l8855
$$ 39664 -9971 -81930 -87300 -50000 -55923 -62868 -61513 -199590 -240285 -26021 -67663 -106518
9046a06518r826L6022J4041k966J33875m7433p1864j8445j1622O3251J10657L595
$$ -106518 -116344 -80322 -66281 -69247 64628 17195 -54669 -73114 -84736 -21485 89172 92767
9034I2767r2331L5075l3062q1509Q1666l6894L0882M2526n8880N1269M2102o0051
$$ 92767 436 35511 2449 -79060 2606 -34288 -3406 39120 -19760 31509 73611 13560
9022A3560o4727q4623M6036J9889M7721P0920q2496o119O6090k0387j00878q597
$$ 13560 -51167 -135790 -89754 -69865 -22144 48776 -33720 -39839 26251 5864 -95014 -103611
9010a03611J5430P9536p2642m7579O1350o1214R500P6013L3247J1548O6860J34951
$$ -103611 -88181 -8645 -81287 -128866 -67516 -128730 -119230 -43217 -9970 1578 68438 203389
8998B03389j38411l0532P325o6598l7461L0189K9196m9107q1532j1288J27581
$$ 203389 64978 34446 41771 -24827 -62288 -32099 -2903 -52010 -133542 -144830 -17249
8987a7249M7030l2105q903k5053q7260l6924j28220o1426J4069J65974N196q3995
$$ -17249 29781 -2324 -11227 -36280 -123540 -160464 -288684 -350110 -336041 -170067 -164871 -248866
8975b48866R0648J30365j0060J7700p581m3607n670l3379J5844J06367j08002
$$ -248866 -158218 -27853 -37913 -20213 -27794 -71401 -77071 -110450 -94606 11761 -96241
8964i6241J039Q5039M9103j34772k6091P3879R0671n0688r326p6124K5819L5006
$$ -96241 -95202 -10163 38940 -95832 -121923 -48044 42627 -8061 -17387 -93511 -67692 -32686
8952c2686L324R9537P3273L680p0702j0950J25595K99648K47122J04645L5909
$$ -32686 -29362 70175 143448 147128 76426 65476 191071 490719 737841 842486 878395
8941H78395j15815k53034j71105j95743o9368r1233j10825k051Q0673j0496p4552
$$ 878395 762580 509546 338441 142698 73330 -17903 -128728 -130779 -50106 -60602 -135154
8930a35154m1760N3928J08359O6088n3748p2105j405j2247p2354O3274P1032Q9180
$$ -135154 -176914 -122986 -14627 51461 -2287 -74392 -75797 -88044 -160398 -97124 -26092 63088
8918F3088o9121m249R2191L4005j16287r7667P8729O8029K0788P6481K4544N1964
$$ 63088 -6033 -10282 81909 115914 -373 -98040 -19311 48718 69506 145987 170531 222495
8906B22495m9735K4723K20073J81156J02479J21249K84199M37212L92112J98490
$$ 222495 172760 197483 417556 598712 701191 822440 1106639 1543851 1935963 2134453
8896B134453m17344m17520m16117k99569j92710k15131n8605K4501n492p8850
$$ 2134453 1717109 1299589 883472 583903 391193 176062 117457 141958 136466 57616
8886E7616q8054l2560k0513Q5546k0798q8908q0836p2888M1968P0299j26414J1469
$$ 57616 -30438 -62998 -83511 2035 -18763 -107671 -188507 -261395 -219427 -149128 -275542 -264073
8874b64073J01845N4605J02831R3393l435n9588m4850n3015L8866K6831r3439
$$ -264073 -162228 -107623 -4792 88601 85166 25578 -19272 -72287 -33421 -6590 -100029
8863a00029m5172L3605J14370J16624l2898R8989J81551J84282J69799J21910
$$ -100029 -145201 -111596 2774 119398 86500 185489 367040 551322 721121 843031
8853H43031M5301j46615j16415j87476j27547j33894p3679j8384j85602j38935
$$ 843031 888332 741717 625302 437826 310279 176385 102706 84322 -101280 -240215
8843b40215m572N7791M0205J14144O0085J23083P4833L8249p6278j25666j16189
$$ -240215 -244787 -186996 -146791 -32647 27438 150521 225354 263603 187325 61659 -54530
8832e4530J66390L2951j44645j11361J0122J32016k1249j61735p6138P6406Q7806
$$ -54530 111860 144811 166 -111195 -101073 30943 9694 -152041 -228179 -151773 -63967
8821f3967L1691j10845N3992m2371n1162N115K4050R8761Q3006k8900K2329K4289
$$ -63967 -32276 -143121 -89129 -131500 -182662 -177547 -153497 -54736 28270 -630 21699 45988
8809D5988j4716k46K5902O1612m5011q9749l7981K6354N3022k1029j2213O7168
$$ 45988 31272 31026 56928 118540 73529 -16220 -54201 -27847 25175 4146 -8067 59101
8797E9101M1145J05388Q6456J3693q0863j7076k344M656J15134J02080N8558M0915
$$ 59101 100246 205634 292090 305783 224920 207844 205500 210156 325290 427370 485928 526843
8785E26843R3030K18854K24728L57225M23740O7926l43677m97052l28991k90542
$$ 526843 619873 838727 1063455 1420680 1844420 1912346 1568669 1071617 742626 452084
8775D52084k63257n8723m7351n5606j6297L1218N6083J00552O8824n1398j16584
$$ 452084 188827 130104 82753 27147 10850 42068 98151 198703 267527 216129 99545
8764I9545r6250N5606J5634O3304O9644O9226J8214j1021p2567P4526P5991O5480
$$ 99545 3295 58901 74535 137839 207483 276709 294923 283902 211335 285861 361852 427332
8752D27332j2162J3036M3224p5214J37732J38873k6899L929J21394N4325J95508
$$ 427332 415170 428206 471430 396216 533948 672821 645922 649851 771245 825570 1021078
8741A021078K46891J80028L75951P00638R14171Q90393K18934p87555j083815
$$ 1021078 1267969 1447997 1823948 2524586 3438757 4329150 4548084 3760529 2676714
8732B676714p72188m99676k64705l06549k37986r5107j70543j80794J33613J47911
$$ 2676714 1904526 1404850 1140145 833596 595610 500503 329960 149166 282779 430690
8722D30690n5683j19011J3875r9525l4123q3612k2049Q2704j2316k8008k0414
$$ 430690 375007 255996 269871 170346 136223 52611 30562 113266 100950 72942 52528
8711E2528N169J64378J34857k5137J974M8175R7094m1778p4040o874p4120n9885
$$ 52528 57697 222075 356932 331795 333769 381944 479038 437260 363220 356346 282226 222341
8699B22341J87600J87102J48709L454O6091J30473K42622L80098L20112J2289
$$ 222341 409941 597043 745752 749206 815297 945770 1188392 1568490 1888602 1900891
8689A900891k99659k13601l29493k50904l64124j76044j9898n1684j39296j06881
$$ 1900891 1601232 1387631 1058138 807234 443110 267066 247168 195484 56188 -50693
8679e0693j54181L3285J70140J04822k9619p6565L5395J28590k3151m6959M4935
$$ -50693 -204874 -171589 -1449 103373 73754 -2811 32584 161174 138023 91064 135999
8668A35999M1676m4361l1490P2452K6308O8329q1048j26260n1300l7773K4096
$$ 135999 177675 133314 101824 174276 200584 268913 187865 61605 10305 -27468 -3372
8657c372K8853K5001P6468N3412N2471L8687r6433m8984o2412j10638J5618K7606
$$ -3372 25481 50482 126950 180362 232833 271520 175087 126103 63691 -46947 -31329 -3723
8645c723Q5618l3135j36874j589M4530M6258p9728J9938L1227R3050L549k3659
$$ -3723 81895 48760 -88114 -89703 -45173 1085 -78643 -58705 -27478 65572 69121 45462
8633D5462q2674Q4813j525o9943J17283J1251J37616Q2197M3059Q1618K6031m8020
$$ 45462 -37212 47601 46076 -23867 93416 104667 242283 324480 367539 449157 475188 427168
8621D27168j43661j13036k21505j66397K18920J57972n0398n8017j1380J49004
$$ 427168 283507 170471 -51034 -217431 1489 159461 109063 51046 39666 188670
8611A88670p657j32651m8490j0964J1264J02731N4820l0431Q4523J6209p5290
$$ 188670 181013 48362 -128 -11092 172 102903 157723 127292 211815 228024 152734
8600A52734K7844j1458m6772N777j8713j2556j7861J04814O0940J8618l4882O4384
$$ 152734 180578 169120 122348 128125 109412 96856 78995 183809 244749 263367 228485 292869
8588B92869J28307J97608n1625p345P9114J8491M122n0190J20083J41531O0833
$$ 292869 421176 618784 567159 559814 638928 657419 661541 611351 731434 872965 933798
8577I33798M1359N9296L2937N3887N6958J6426K01971J77761J77465Q1136J71413
$$ 933798 975157 1034453 1067390 1121277 1178235 1194661 1396632 1574393 1751858 1832994 2004407
8566B004407L40641K10297L47755M29021M91811O90928R43469R84511R74296J123809
$$ 2004407 2345048 2555345 2903100 3332121 3823932 4514860 5458329 6442840 7417136 8540945
8556H540945J130456J493448J792072K575721L523634M885804P083226J0311199
$$ 8540945 9671401 11164849 12956921 15532642 19056276 23942080 31025306 41336505
8548D1336505J5289085K3035040L2660954L9334288L2505763K454088l1795679
$$ 41336505 56625590 79660630 112321584 151655872 184161635 186615723 154820044
8541A54820044m1119713l2353847k1717102j4027978r492198o683081m764471
$$ 154820044 113700331 81346484 59629382 45601404 36109206 29426125 24661654
8534B4661654l549894k739598k249070j539578j265741j021094o90168o11131
$$ 24661654 21111760 18372162 16123092 14583514 13317773 12296679 11606511 10995380
8526A0995380n32972m76212l25295l95705k13190Q8992J97819K71365M56503P36062
$$ 10995380 10462408 9986196 9660901 9265196 9052006 9140998 9338817 9610182 10066685 10802747
8516A0802747J244577J494028J638890J766123J983850K099498K416804L054208
$$ 10802747 12047324 13541352 15180242 16946365 18930215 21029713 23446517 26500725
8508B6500725M061985O020649Q801300J3041793J9122963K8878583M6117146P1080054
$$ 26500725 30562710 36583359 45384659 58426452 77549415 106427998 152545144 223625198
8500B23625198R3734727Q6588359M347249q7205749r8403443o9448978m3766226
$$ 223625198 317359925 403948284 408295533 321089784 222686341 153237363 109471137
8493A09471137k7572780j8065269j2363944q853339o594535n065975l920471k991734
$$ 109471137 81898357 63833088 51469144 42615805 36021270 30955295 27034824 24043090
8485B4043090k311436j869085j579925j484062j300498j238156j081062p89208
$$ 24043090 21731654 19862569 18282644 16798582 15498084 14259928 13178866 12389658
8477A2389658p20222n75317k92810k21716j43988J58352K37772N28396P18325
$$ 12389658 11669436 11094119 10801309 10579593 10435605 10593957 10831729 11360125 12078450
8468A2078450P63003R07990J104945J404988J664797K171529L132539M747061
$$ 12078450 12841453 13749443 14854388 16259376 17924173 20095702 23228241 27975302
8460B7975302O861649R912680J4288497K1199717L0303118L6755966L0722942
$$ 27975302 34836951 44749631 59038128 80237845 110540963 147296929 178019871
8453A78019871L049173l0075164m0424114l2136768k1591721j4044929r239082
$$ 178019871 181069044 150993880 110569766 78432998 56841277 42796348 33557266
8446C3557266o421726m652629l392491k671980k092502j615233j341302r81674
$$ 33557266 27135540 22482911 19090420 16418440 14325938 12710705 11369403 10387729
8438A0387729r24261r73375q93341p40954m25551o27236n79888l98310k14124
$$ 10387729 9463468 8490093 7596752 6855798 6430247 5803011 5223123 4824813 4610689
8429D610689k37882k95212k63910j78211j15742j11846j52118k28625j42025j31673
$$ 4610689 4372807 4077595 3813685 3635474 3519732 3407886 3255768 3027143 2885118 2753445
8419B753445j35974j36921j43720j84269k5164m3932p297k6369J4097j23698m2099
$$ 2753445 2617471 2480550 2336830 2152561 2127397 2083465 2076168 2049799 2063896 1940198 1898099
8408A898099n9306J0434l4655J8244q8844q2889R0610j08294k6474R9057J72585
$$ 1898099 1838793 1849227 1814572 1832816 1743972 1661083 1751693 1643399 1616925 1715982 1888567
8397A888567K81059m513k62874j67058j6472m4514m6219j53304p5880m0528j12536
$$ 1888567 2169626 2165113 1902239 1735181 1718709 1674195 1627976 1474672 1398792 1358264 1245728
8386A245728J03241P9084j00478q6905j16975n5414M1505J56291M4689j41872
$$ 1245728 1348969 1428053 1327575 1240670 1123695 1068281 1109786 1266077 1310766 1168894
8376A168894n0552r5114j05601Q1216K05304l5193j81755j49158O3879n4013L4311
$$ 1168894 1118342 1023228 917627 998843 1204147 1168954 987199 838041 901920 847907 882218
8365H82218P5110Q7007n1869O339L5799m3528p2163l0078J25292J52653K23142
$$ 882218 957328 1044335 992466 998805 1034604 991076 918913 888835 1014127 1166780 1389922
8354A389922M21502J96691q6913k77046k47733k58583j25510q0990p2773l6070
$$ 1389922 1811424 2008115 1921202 1644156 1396423 1137840 1012330 931340 858567 822497
8344H22497K8260n0465J7315N927q4846j69472o5601J88822J22902Q1129J4851
$$ 822497 850757 800292 817607 823534 738688 569216 503615 692437 815339 896468 911319
8333I11319j6620j99375p6140j1252n4978K1490J25090P063j62888P3015J24455
$$ 911319 894699 695324 619184 607932 552954 574444 699534 706597 543709 616724 741179
8322G41179R1118j09214j38868j9440n116N4518K4692O120o1424m4091J83755
$$ 741179 832297 723083 584215 564775 559659 614177 638869 644989 583565 539474 723229
8311G23229n0072R1762J29660N3135j04385p5436j35732l9019M4353j07051j076
$$ 723229 673157 764919 894579 947714 843329 767893 632161 593142 637495 530444 529368
8300E29368l0896M8546Q5080J7639l8217j22757l7597q8778j21296J03477J63241
$$ 529368 498472 547018 632098 649737 611520 488763 451166 362388 241092 344569 507810
8289E07810k8565n2280m161J0256L3203n4534o4951p8557j6036N2552K8575Q637
$$ 507810 479245 426965 422804 433060 466263 411729 346778 268221 252185 304737 333312 341949
8277C41949k5853L5257R4233k7464q5518J648J28109j2580r000j0299K9125O3788
$$ 341949 316096 351353 445586 418122 332604 334252 462361 449781 440781 430482 459607 523395
8265E23395J6007q9617j17998L796N2348J18327K4253r1581n3241l8418j5671
$$ 523395 539402 449785 331787 335583 387931 506258 530511 438930 385689 347271 331600
8254C31600o3629N289M6494Q2176p8459j09833M6455N7294j8416j06710r727J11137
$$ 331600 267971 273260 319754 401930 323471 213638 260093 317387 298971 192261 182534 293671
8242B93671K7112k1696J0466p2746k924m4359j0401J36075k262J3802k9728q6467
$$ 293671 320783 299087 309553 236807 233883 189524 179123 315198 312936 326738 297010 210543
8230B10543M61J685l2639J28038N4956O2000k9626N1953l6835j01057o1387L8482
$$ 210543 211004 212689 180050 308088 363044 425044 395418 447371 410536 309479 248092 286574
8218B86574q7935q0140j6557J22134o3957j8125o5266Q4473L6721K6975n5426
$$ 286574 198639 118499 101942 224076 160119 141994 76728 161201 197922 224897 169471
8207A69471k0312p3183J0675J23343P1727J9921j3367m9228J0422m9421J32276
$$ 169471 149159 75976 86651 209994 281721 301642 288275 239047 249469 200048 332324
8196C32324K7249n9546j5924o3786l6953K7398M8384N9012O7368J14128r3401
$$ 332324 359573 300027 284103 220317 183364 210762 259146 318158 385526 499654 406253
8185D06253q7798k1n0298n7258l3047o6654q63j744R1256Q2370Q3556k6772N091
$$ 406253 318455 318434 268136 210878 177831 111177 110314 108570 199826 282196 365752 338980 344071
8172C44071M4397p1571l3334n4272l0867O1Q303O034K1345j6265K9338P049L8217
$$ 344071 388468 316897 283563 229291 198424 198485 206788 212822 234167 217902 247240 254289 292506
8159B92506J11780p3018k5560n6544m7748N545N0462j8560o3797p764O0735k5800
$$ 292506 404286 331268 305708 249164 201416 206961 257423 238863 175066 167302 228037 202237
8147B02237O4228M8527P8767M5013J57637K12556J97649J56083J02336j13693
$$ 202237 266465 314992 393759 438772 596409 808965 1006614 1162697 1265033 1151340
8137A151340j05536k10483k30606r8535m0853o1528j49955l1215J49096l7826
$$ 1151340 1045804 835321 604715 506180 465327 403799 253844 222629 371725 333899
8127C33899k3875P018q5075R2464K2917m2799N9800m0124j44887j0077O1216j20982
$$ 333899 310024 317042 231967 324431 347348 304549 364349 324225 179338 169261 230477 109495
8115A09495L08O2637J39793j2033K6073j2007j2286k596k8553o98J7670j0421
$$ 109495 109803 172440 312233 300200 326273 314266 301980 299384 270831 270133 287803 277382
8103B77382n2498J3315K21633J93159R8254J94158J55559M31533M63685K56444
$$ 277382 224884 238199 459832 652991 751245 945403 1100962 1532495 1996180 2252624
8093B252624k52413l79143m20203l10718j34134j37835p0069q2223k3059J5800
$$ 2252624 2000211 1621068 1200865 890147 756013 618178 548109 465886 442827 458627
8083D58627j4890p8488r4699N6442K7535k8065n6979R738Q1175n6036q4256Q1613
$$ 458627 443737 365249 270550 326992 354527 326462 269483 279221 360396 304360 220104 301717
8071C01717J66830K9027k29543k32102J7286N4196M0561j1708l6490L3404m4311
$$ 301717 468547 497574 268031 35929 53215 107411 147972 136264 99774 133178 88867
8060H8867J16494J33761j05983j6383k6099R669J18255J06066J28277R4148J70559
$$ 88867 205361 339122 233139 216756 190657 200326 318581 424647 552924 647072 817631
8049H17631R0256L8754O5569p5702j61310j45472j33430q5874o6464j202o2774
$$ 817631 907887 946641 1012210 936508 775198 629726 496296 410422 343958 342756 279982
8038B79982j12295j8684R2164k0768m8730j0401N6955o2468J03720o117p0286
$$ 279982 167687 149003 241167 220399 171669 161268 218223 155755 259475 253358 183072
8027A83072M3925j9636L109K9024o1917j07566m7049Q9723N8478N3485m8996R8427
$$ 183072 226997 207361 210470 239494 177577 70011 22962 112685 171163 224648 175652 274079
8015B74079j9173j48327m1913P3255O1179N7663p4755J7974L8302J8148L1696
$$ 274079 254906 106579 64666 137921 199100 256763 182008 199982 238284 256432 288128
8004B88128r2036j6688j07433m8325j02116P2152J44917J9875k9143o2544O300
$$ 288128 196092 179404 71971 23646 -78470 -6318 138599 158474 129331 66787 73087
7993G3087J22662R4694O0012o5445r5714K5308K6080l5253p1674j57450P8266
$$ 73087 195749 290443 350455 285010 189296 214604 240684 205431 133757 -23693 54573
7982E4573P7256j11018p1749M8582L0701K0665r5094N4421n1708n1655L9803Q5253
$$ 54573 131829 20811 -50938 -2356 28345 49010 -46084 8337 -43371 -95026 -55223 30030
7970C0030K3405J7909O6348m3259m9695k9379J34682J29646L4564p5205j46642
$$ 30030 53435 71344 137692 94433 44738 15359 150041 279687 314251 239046 92404
7959I2404j2606l3262n7440L7798J20865L7413Q7969j2107l5041j90250o8108
$$ 92404 79798 46536 -10904 26894 147759 185172 273141 261034 225993 35743 -32365
7948c2365L3083L5094J5902Q5875J6663m0009j3083m9444m0411N0674L5030O472
$$ -32365 718 35812 51714 137589 154252 114243 101160 51716 11305 61979 97009 103481
7936A03481l9606o6461l225l4848J08454j7448j136j21861m8623l0358l2236P3055
$$ 103481 63875 -2586 -5811 -40659 67795 50347 49211 -72650 -121273 -151631 -183867 -110812
7924a10812N7372o168j13465J20133J04010k9600r4188l199K764j10277m5105
$$ -110812 -53440 -59608 -173073 -52940 51070 21470 -72718 -75917 -73153 -183430 -228535
7913b28535L7311N9867K704J4357J6331Q5265O2897l8115L0147L4538K7323m3888
$$ -228535 -191224 -131357 -128653 -114296 -97965 -12700 50197 12082 42229 76767 104090 60202
7901F0202n0639J40468J00207l7826q2159q2001k3816R4117J03091J2524n8714
$$ 60202 9563 150031 250238 212412 130253 48252 24436 118553 221644 234168 175454
7890A75454j61159o1739J42955j8639n625O0444P9404J3648j9009p2557p6515
$$ 175454 14295 -47444 95511 76872 71247 131691 211095 224743 205734 133177 56662
7879E6662N3895p7146j68934P05J35008p4708L3436J73024N8235O8207k8794m9977
$$ 56662 110557 33411 -135523 -134818 190 -74518 -41082 131942 190177 258384 229590 179613
7867A79613j41945M293m0668k295O3397L0734l3230J03191j33248j46427R4849
$$ 179613 37668 41961 1293 -1002 62395 93129 59899 163090 29842 -116585 -21736
7856b1736J00182j51646L0630K25398M1007o8108j36392R6291N4362K8462j57449
$$ -21736 78446 -73200 -42570 182828 223835 155727 19335 115626 169988 198450 41001
7845D1001n0001J17186P3625m5396o4794m0892m492j6492l4007Q6539k032K7697
$$ 41001 -9000 108186 181811 136415 71621 30729 26237 9745 -24262 62277 60245 87942
7833H7942K0114k37K1389r2331p1740j396L8998j8460n4715L9613K8177O3008
$$ 87942 108056 107819 129208 36877 -34863 -36259 2739 -15721 -70436 -30823 -2646 60362
7821F0362M4642K1214n8091P7719m0549o9821m2804p5191L2343M8626n9785O5705
$$ 60362 105004 126218 68127 145846 105297 35476 -7328 -82519 -50176 -1550 -61335 4370
7809D370n0685l470K0887K3849M7485q3134j3894K30282Q1709j18642N3506j14089
$$ 4370 -46315 -49785 -28898 -5049 42436 -40698 -54592 175690 257399 138757 192263 78174
7797G8174m3634J33896P6060N4213j05504n6324j00568o4497O584J06305J09557
$$ 78174 34540 168436 244496 298709 193205 136881 36313 -28184 -21600 84705 194262
7786A94262O7705k4419k7616j78429l5047k8396J7744J40879M5919l9869l4926
$$ 194262 261967 237548 209932 31503 -3544 -31940 -14196 126683 172602 132733 97807
7775I7807l6824J3579m5049K17331j3703j63797o1277R1883l9795p7598j14737
$$ 97807 60983 74562 29513 246844 233141 69344 8067 99950 60155 -17443 -132180
7764a32180q4621n0230N0036j9114Q4051J76442P8630l1132j19182k1278L7169
$$ -132180 -216801 -267031 -216995 -236109 -152058 24384 103014 71882 -47300 -68578 -31409
7753c1409n5334Q061J19394o0627M1545J48052L4011K2071r4664p6863j23547
$$ -31409 -86743 -78682 40712 -19915 21630 169682 203693 225764 131100 54237 -69310
7742f9310k580j4681p5102M6838j9077J1307j0585K1808O3511l5519J07470M9857
$$ -69310 -71890 -86571 -161673 -114835 -133912 -122605 -133190 -111382 -47871 -83390 24080 73937
7730G3937l4395P1740K3847N108l711j8460n4047j48619L858R3317K5256Q150
$$ 73937 39542 111282 135129 140237 136526 118066 64019 -84600 -80742 12575 37831 45981
7718D5981K0815J4440j2700k6507l6705P0290l0847N3412R4293j5160j15874n4491
$$ 45981 66796 81236 68536 42029 5324 75614 44767 98179 192472 177312 61438 6947
7706F947l8750J57929J20754j71240j14006Q0132J22352m1281k8209m784Q708
$$ 6947 -31803 126126 246880 75640 -38366 41766 164118 122837 94628 89844 98552
7695I8552n2985l3574M5016N9798n3922j84528R925R5727K9268J32103P9322p0699
$$ 98552 45567 11993 57009 116807 62885 -121643 -111718 -15991 13277 145380 224702 154003
7683A54003p8033N6958J0167n8088o2138p3460Q4702J06750J0912j15118p9253
$$ 154003 75970 132928 143095 85007 22869 -50591 34111 140861 151773 36655 -42598
7672d2598q5652N2805k9856k4253N7626K087k7201Q0520k3439q3050p747J20531
$$ -42598 -128250 -75445 -105301 -129554 -71928 -69841 -97042 -16522 -39961 -123011 -130758 -10227
7660a0227J68047J7112m9147j6960q2255o3237Q82k5744j6824j11021o418K243
$$ -10227 157820 174932 125785 108825 26570 -36667 -35785 -61529 -78353 -189374 -195792 -193549
7648a93549M9194j3077J23863N5840k9884J1634J04485O7813o3136k8195R439
$$ -193549 -144355 -157432 -33569 22271 -7613 4021 108506 176319 113183 84988 94427
7637I4427j06379m7934N72O7281K3470l5782M40M5805J22667P6303N1565m6254
$$ 94427 -11952 -59886 -59314 7967 31437 -4345 -3905 41900 164567 240870 292435 246181
7625B46181j27993r1496l2284o1833l9214P3426J35381j34964J6714L4630R6025
$$ 246181 118188 26692 -5592 -67425 -106639 -33213 102168 -32796 -16082 18548 114573
7614A14573Q616o8062Q9602j6408k36273r7669J06688J30631m6369j16183n9749
$$ 114573 123189 55127 144729 128321 -107952 -205621 -98933 31698 -14671 -130854 -190603
7603a90603Q9949Q8055m45M2886R5205n8167j54491P6889J26190K2431j94603
$$ -190603 -100654 -12599 -13044 29842 125047 66880 -87611 -10722 115468 137899 -56704
7592e6704k4155O8110M9071M400L945Q4011Q4791j13384j48371K0788K5846J11689
$$ -56704 -80859 -12749 36322 40722 44667 128678 213469 100085 -48286 -27498 -1652 110037
7580A10037m9754N2931N0940l5868P8031j29926o1785m9876q6754l6995R5215
$$ 110037 60283 113214 164154 128286 206317 76391 14606 -35270 -122024 -159019 -63804
7569f3804j5088J03860N8778k8836K6386j7334K0651J0123m1866M0499k1904o8176
$$ -63804 -78892 24968 83746 54910 81296 63962 84613 94736 52870 93369 71465 3289
7557C289R1279Q8892J42985o352p8637o1621k6506k2592J09161L4941l0441M8107
$$ 3289 94568 183460 326445 320093 241456 179835 153329 130737 239898 274839 244398 292505
7545B92505O1513j16613r7330j56299q2001R4756L7660j60688L7684J03998l2980
$$ 292505 354018 237405 140075 -16224 -98225 -3469 34191 -126497 -88813 15185 -17795
7534a7795j2913K1081Q3878M8118j4238j14215K0570K6587k0320M6455q4868j25516
$$ -17795 -30708 -9627 74251 122369 108131 -6084 14486 41073 20753 67208 -17660 -143176
7522a43176J45788k7888m8443M9809Q553N8689j7712n767L8280M3747j0957j2910
$$ -143176 2612 -25276 -73719 -23910 -15357 43332 25620 19853 58133 101880 90923 78013
7510G8013q192j05961p0484K4896P7047K4567M9282L0608R7642M5332j30811j31655
$$ 78013 69821 -36140 -106624 -81728 -4681 19886 69168 99776 197418 242750 111939 -19716
7498a9716m8949l4572o1729n7348L6276J16536P9062O399m8568r0057n7789J434
$$ -19716 -68665 -103237 -164966 -222314 -186038 -69502 9560 15959 -32609 -122666 -180455 -179021
7486a79021O5216N8549l2346K2229K1899J7121L4207k2511o8509q9788p4565N0202
$$ -179021 -113805 -55256 -87602 -65373 -43474 -26353 7854 -14657 -83166 -172954 -247519 -197317
7474a97317J09826Q101Q4517L5674k1840m8248N4334N9819k922O7124n1574m6850
$$ -197317 -87491 -79390 5127 40801 18961 -29287 25047 84866 81944 149068 97494 50644
7462E0644o2799K3163n0424n090J00462J47448J0117j25954k0968J6350k2047
$$ 50644 -12155 11008 -39416 -44506 55956 203404 213521 87567 66599 82949 60902
7451F0902l2115m6650L3329o1798J58951M7876q1849m2745O5719k1659k9943j54771
$$ 60902 28787 -17863 15466 -46332 112619 160495 78646 35901 101620 79961 50018 -104753
7439a04753k25Q3753l7715p4752Q421Q2132N2988j2651O8033k9339j01872j29018
$$ -104753 -104978 -21225 -58940 -133692 -125271 -43139 9849 -2802 65231 35892 -65980 -194998
7427a94998J96Q6186l2946L5772J25421J7761j30836j0922m9110P8763N0966j0079
$$ -194998 -194802 -108616 -141562 -105790 19631 37392 -93444 -104366 -153476 -74713 -23747 -33826
7415c3826J56623R3186n7080o7386L25M2227j6135m1626j53939M1956P0536j2583
$$ -33826 122797 215983 158903 91517 91842 134069 117934 76308 -77631 -35675 34861 22278
7403B2278j8748k1074o9959P0055N6729p1327J43088P2393j22021n3805p2866
$$ 22278 3530 -17544 -87503 -17448 39281 -32046 111042 183435 61414 7609 -65257
7392f5257j9779Q6701Q3329p3570n585P9784m8806L2281J6473K4539k0913Q2434
$$ -65257 -85036 1665 84994 11424 5839 85623 36817 69098 85571 110110 89197 171631
7380A71631o0635J1131L059J0599q3396L1297J4116Q8370M6265j59866l7535N1690
$$ 171631 110996 122127 125186 135785 52389 83686 97802 186172 232437 72571 35036 86726
7368H6726j38646j84593N3838q4081J9758P6606N863L0689K5971R9757N6845q6083
$$ 86726 -51920 -236513 -182675 -266756 -246998 -170392 -164529 -133840 -107869 -8112 48733 -37350
7356c7350j17029Q7932J26168K608j35523j43453n209q648N3597K6072k4552L0364
$$ -37350 -154379 -66447 59721 62329 -73194 -216647 -221856 -230504 -176907 -150835 -175387 -145023
7344a45023M5381J05120K9441Q0245l8976j69746j07259R0230K8018N0911r5402
$$ -145023 -99642 5478 34919 115164 76188 -93558 -200817 -110587 -82569 -31658 -127060
7333a27060M0912Q7166N4900j06702m7362n4104J4735m242n5869P7070N3270O220
$$ -127060 -86148 1018 55918 -50784 -98146 -152250 -137515 -141757 -197626 -120556 -67286 -61066
7321f1066N2278J41556M8914k2578p543p7221p9733j27826j6978N0227M8955J37468
$$ -61066 -8788 132768 181682 159104 151561 74340 -5393 -133219 -150197 -99970 -51015 86453
7309H6453L8166m6061j52391k381O2106j3173n7211P7729l3988Q3208M4037j31217
$$ 86453 124619 78558 -73833 -76214 -14108 -27281 -84492 -6763 -40751 42457 86494 -44723
7297d4723J814P6235j2245p1950K1268l8428l4415M302R243p8804m0617J31670
$$ -44723 -42909 33326 21081 -50869 -29601 -68029 -102444 -98142 -88899 -167703 -208320 -76650
7285g6650J43028l828N2496J2233q9522j39620r2740K6819O3939k1271J5065R3351
$$ -76650 66378 62550 115046 127279 37757 -101863 -194603 -167784 -103845 -125116 -110051 -16700
7273a6700O9785P285o858q05o3545p1071R5272J06239J2717L9815r762m4485k9213
$$ -16700 53085 60370 53512 52707 -10838 -81909 13363 119602 132319 172134 162372 117887 88674
7260H8674J3859p5517O7869P5706N3794n8876p5499j09666j1390l3535O363N0553
$$ 88674 102533 27016 94885 170591 224385 165509 90010 -19656 -31046 -64581 -58218 -7665
7248g665q6018K5771K440J41328J45685r5075p9514p7472l4429l7326M3572l510
$$ -7665 -93683 -67912 -65472 75856 221541 126466 46952 -30520 -64949 -102275 -58703 -62213
7236f2213q8116L9524J96624Q7256q2381m3401l5774K017M3538q246q9853L7754
$$ -62213 -150329 -110805 85819 173075 90694 47293 11519 13536 57074 48828 -41025 -3271
7224c271Q2573j41328m6836O9556K05589l7877n1459n216J42131r639j74027p3333
$$ -3271 79302 -62026 -108862 -39306 166283 128406 76947 71731 213862 204223 30196 -43137
7212d3137o4245K8375J60614K083r7247r9410j08805J16995O3132j7905O0168
$$ -43137 -107382 -79007 81607 83690 -13557 -112967 -221772 -104777 -41645 -59550 618
7201F18K8268J2847q5234L2251Q5398m0306L650Q7834l3900L9985m4497n4652
$$ 618 28886 41733 -43501 -11250 74148 33842 37492 125326 91426 131411 86914 32262
7189C2262L2821j10739r7253Q3524J02185P2969M7426j1071n5225N357o0667n835
$$ 32262 65083 -45656 -142909 -59385 42800 115769 163195 152124 96899 102256 41589 35754
7177C5754k2716o9125K6403o5493j01655M5470J19241P3825n9115j16507R0875
$$ 35754 13038 -56087 -29684 -95177 -196832 -151362 -32121 41704 -17411 -133918 -43043
7166d3043K3057j17919n5932J7383M9994J07818R1598K2380j20373K3890J5868
$$ -43043 -19986 -137905 -193837 -176454 -126460 -18642 72956 95336 -25037 -1147 14721
7155A4721m3875O3912K7218J06678K0127K0951j9573o0453m2420k6629r4784j10625
$$ 14721 -29154 34758 61976 168654 188781 209732 190159 129706 87286 60657 -34127 -144752
7143a44752O7095m7378L7173L5635j9803J2490R119k6083N7418K7028K5568J95299
$$ -144752 -77657 -125035 -87862 -52227 -72030 -59540 -50421 -76504 -19086 7942 33510 228809
7131B28809j7124j29021j8344q117m9533n2293M7385k6580K4568N0487p2905n4092
$$ 228809 211685 82664 64320 56203 6670 -45623 1762 -24818 -250 50237 -22668 -76760
7119g6760q7712K9872m4128N8575Q6974n208J2454J10322k6921M8871J9332j08423
$$ -76760 -164472 -134600 -178728 -120153 -33179 -38387 -25933 84389 57468 106339 125671 17248
7107A7248L6559q567O571k5865Q7300L3820K1550j725m7998p3762q4351N5546
$$ 17248 53807 45240 51811 25946 113246 147066 168616 166891 118893 45131 -39220 16326
7095A6326O3694j1185J1050j4119l3227m1347O4688L6782j823l425N7737P559
$$ 16326 80020 68835 79885 65766 32539 -8808 55880 92662 90839 87414 145151 152710
7083A52710p0980P9236j88004k4525K2302l434L466J4582P9957p9648j56650R0929
$$ 152710 81730 160966 -27038 -51563 -29261 -32695 -29229 -14647 65310 -14338 -170988 -80059
7071h0059K46862j8566k7712L6543p8506r1717O3269K1591L484J45921r6918j53645
$$ -80059 166803 148237 120525 157068 78562 -13155 50114 71705 75189 221110 124192 -29453
7059b9453o6830M5717J1159k8955J9017P0875j9563j9371O0351p771L035k4331
$$ -29453 -96283 -50566 -39407 -68362 -49345 21530 1967 -17404 42947 35176 38211 13880
7047A3880N7824K6760P2455m5099j8615O2163R2409k3672q5249n9381j4551j203
$$ 13880 71704 98464 170919 125820 107205 169368 261777 238105 152856 93475 78924 77721
7035G7721l4216L3229J0307q6138q1617P9283J19197O8473l5335j3069P2876j5819
$$ 77721 43505 76734 87041 903 -80714 -1431 117766 186239 150904 137835 210711 194892
7023A94892l0082p6617p7751m6030l7549L0906Q1410p756p5958j2839J28624J33009
$$ 194892 164810 88193 10442 -35588 -73137 -42231 39179 31423 -44535 -57374 71250 204259
7011B04259M8879k65527q4375K3069J8500o8567n3861O4363N7552j40229L6658
$$ 204259 253138 -12389 -96764 -73695 -55195 -123762 -177623 -113260 -55708 -195937 -159279
7000a59279J46139J15838k8559j134K1621K0138n6333j42343L0908J28454l4197
$$ -159279 -13140 102698 74139 73005 94626 114764 58431 -83912 -53004 75450 41253
6989D1253j2671j12913O0347L3823j70N7075M4840m7609O6566m4640o6602j126
$$ 41253 28582 -84331 -23984 9839 9669 66744 111584 63975 130541 85901 19299 18173
6977A8173J3359r6192j69679k4815J42559j0017l0091N9247L7052j8432K5758
$$ 18173 31532 -64660 -234339 -259154 -116595 -126612 -156703 -97456 -60404 -78836 -53078
6966e3078Q9146j2424l6594p549l4539j26175k4940N6246Q1705R6699o0432j15614
$$ -53078 36068 23644 -12950 -20499 -55038 -181213 -206153 -149907 -68202 28497 -31935 -147549
6954a47549L6651l663N5573m6905K0600n0468l6325J4974j50880P0892J18122
$$ -147549 -110898 -114561 -58988 -105893 -85293 -135761 -172086 -157112 -307992 -237100 -118978
6943a18978L4289M0324k4677J9193p889j09394N4411k944n9583J8519J74348Q0365
$$ -118978 -84689 -44365 -69042 -49849 -57738 -167132 -112721 -115665 -175248 -156729 17619 97984
6931I7984j41642j01236J6690j4704O4040N2994J5411N3007L4931l4644p7778
$$ 97984 -43658 -144894 -128204 -142908 -78868 -25874 -10463 42544 77475 42831 -34947
6920c4947q7841L1881P6223L3590J650P6558n743l351j17330M915K4072o8907
$$ -34947 -122788 -90907 -14684 18906 20556 97114 91371 88020 -29310 -24395 -323 -69230
6908f9230k4118m5674Q2335O3979J49408j22971J2373m775P2457L9806l7652j5628
$$ -69230 -93348 -139022 -56687 7292 156700 33729 46102 41327 113784 153590 115938 100310
6896A00310M4559j9765j25833o7832P0521J6023K2652r9237K9131J2829L7696
$$ 100310 144869 125104 -729 -68561 1960 17983 40635 -58602 -29471 -16642 21054
6885B1054j8559J1208J57554M0751k08757j07732J6402O2447K74255J26176j08664
$$ 21054 2495 13703 171257 212008 3251 -104481 -88079 -25632 248623 374799 266135
6874B66135k26533j33714Q1663J06155k9906q0125K1658j02518m7591O7676J1200
$$ 266135 39602 -94112 -12449 93706 63800 -16325 5333 -97185 -144776 -77100 -65900
6863f5900J49746j3146k8361O1787K8211n6863m8875k5550p0580P7699N2109k2757
$$ -65900 83846 70700 42339 104126 132337 75474 26599 1049 -69531 8168 60277 37520
6851C7520j08352M1091m0184j0110J03719J6016J9660l8723j09271n8085j8033
$$ 37520 -70832 -29741 -69925 -80035 23684 39700 59360 20637 -88634 -146719 -164752
6840a64752N9083n99P2717K4350O6369K4205M8183l5328k6595p2014P9873L8953
$$ -164752 -105669 -106268 -33551 -9201 57168 81373 129556 94228 67633 -4381 75492 114445
6828A14445r0128q4940L8775l5554j49632k4586n4712J6440R2754P8579Q8162
$$ 114445 24317 -60623 -21848 -57402 -207034 -231620 -286332 -269892 -177138 -98559 -10397
6817a0397J8762N7835M4514q7088n5624K4110J41858m4459n6136j0162O5504o9276
$$ -10397 8365 66200 110714 23626 -31998 -7888 133970 89511 33375 23213 88717 19441
6805A9441J16596m8408l2458j7273j7759O412Q869Q2565J14234j60623j36001
$$ 19441 136037 87629 55171 37898 20139 26551 35420 117985 232219 71596 -64405
6794f4405P7145K6057k608j2828K6271l0588j3193l2491n4309P8033n4764P1806
$$ -64405 12740 38797 36189 23361 49632 19044 5851 -26640 -80949 -2916 -57680 14126
6782A4126O6873Q0758L7190J6198k3590k8335p9223o5652L3508q2655K6031P7826
$$ 14126 80999 161757 198947 215145 191555 163220 83997 18345 51853 -30802 -4771 73055
6770G3055k4282O7676l055l3005k9712k6306o1268P5686M6956L2768m7857j01101
$$ 73055 48773 116449 113394 80389 50677 24371 -36897 38789 85745 118513 70656 -30445
6758c0445N0821J4696n0029m3115J06753J14334J6782j15580p4549q18l1470o4441
$$ -30445 20376 35072 -14957 -58072 48681 163015 179797 64217 -10332 -11150 -42620 -107061
6746a07061Q5051N3712l5313N1160J39861J2047O037J8477p7832o1906Q226K2087
$$ -107061 -22010 31702 -3611 47549 187410 199457 205494 223971 146139 84233 92459 114546
6734A14546j01269j8494r4588k4295j3399N7935R5186J91672J10070p3986j53847
$$ 114546 13277 -5217 -99805 -124100 -137499 -79564 15622 207294 317364 243378 89531
6723H9531j25581q348R0638J9132o8344N387j16296o7595k252Q6219J2974R2722
$$ 89531 -36050 -44398 46240 65372 -2972 2415 -113881 -181476 -183728 -97509 -84535 8187
6711H187J04111j6593j17363j6355k4683L8186j5343O9381O8380j01556P181P121
$$ 8187 112298 95705 -21658 -38013 -62696 -24510 -39853 29528 97908 -3648 3533 10654
6699A0654L0950N3315j25623r8472l1178J25502p7156r7855l941k2381j13939
$$ 10654 41604 94919 -30704 -129176 -160354 -34852 -112008 -209863 -213804 -236185 -350124
6688c50124J09793N1330Q285J36830L891k4903L1684J59575M1834j422j3o2810
$$ -350124 -240331 -189001 -180716 -43886 -39995 -64898 -33214 126361 168195 166773 166760 103950
6676A03950L3694J5434m7587Q3766k4777n4577j11255n4036K9665J33032k1953
$$ 103950 137644 153078 105491 189257 164480 109903 -1352 -55388 -25723 107309 85356
6665H5356m8704Q77p1809O6268r6713m6794R9563Q4645o1514r0648k6887o7994
$$ 85356 36652 37529 -34280 31988 -64725 -111519 -11956 72689 11175 -79473 -106360 -174354
6653a74354O0382J54205k5895l9997N145l5289p7660R9314M1665L8121j04164
$$ -174354 -113972 40233 14338 -25659 -20514 -55803 -133463 -34149 7516 45637 -58527
6642e8527q011L1439J057L8406n2642r659Q3840R8480k5872m4250K8035M8233
$$ -58527 -66538 -35099 -34042 4364 -48278 -57937 25903 124383 98511 54261 82296 130529
6630A30529O9951j8418j87929j9237N2037N7877l9699K461p9188p4397N0250l9197
$$ 130529 200480 182062 -5867 -25104 26933 84810 45111 47572 -31616 -106013 -55763 -94960
6618i4960O376P1911K9957N2680J1663K0435j495p1829m6194j33557M3985J45315
$$ -94960 -88584 -16673 13284 65964 77627 98062 96567 24738 -21456 -155013 -111028 34287
6606C4287N4682M7009J3914L753p7439n1197l567l468o6739n1644K726J55137
$$ 34287 88969 135978 149892 153645 76206 25009 21442 17974 -48765 -100409 -97683 57454
6594E7454Q4107M9733p491r8279j99349j917L25n3760J6729J4645J23832J35690
$$ 57454 141561 191294 183803 85524 -113825 -115742 -115417 -169177 -152448 -137803 -13971 121719
6582A21719P8569r9016j39356m298J11031J50338p351n0638k6394o0296o7018
$$ 121719 200288 101272 -38084 -42382 68649 218987 211636 160998 134604 74308 7290
6571G290M2955n7724r6517q4732J74114j53522p9703j1780J4652K10189Q7405
$$ 7290 50245 -7479 -103996 -188728 -14614 -168136 -247839 -259619 -244967 -34778 52627
6560E2627j03524L1148J1645J09298J05764o7887j31848p2592j0288K7929M9884
$$ 52627 -50897 -19749 -8104 101194 206958 139071 7223 -65369 -75657 -47728 2156
6549B156P590j28279L0173l2807p8002j1045p5103Q4887J00417J10054K11391
$$ 2156 9746 -118533 -88360 -121167 -199169 -210214 -285317 -200430 -100013 10041 221432
6538B21432L2285j74697j59262n1566N7660O4226k7937J0741R8098m057q1931
$$ 221432 253717 79020 -80242 -131808 -74148 -9922 -37859 -27118 70980 66923 -15008
6527a5008l0700n6997Q4623Q2208O8997m3958m130o8925r1678m1613p8607K5204
$$ -15008 -45708 -102705 -18082 64126 133123 89165 85035 16110 -75568 -117181 -195788 -170584
6515a70584M1094J03550l3746M2968L0607p6089L0855q6630p0734l8063J55409
$$ -170584 -129490 -25940 -59686 -16718 13889 -62200 -31345 -117975 -188709 -226772 -71363
6504g1363j4094M5154q6891k3212J14018N3352J2679n9452j2413l8766p6725P423
$$ -71363 -85457 -40303 -127194 -150406 -36388 16964 29643 -29809 -42222 -80988 -157713 -150290
6492a50290J07647J38093n8850k4696L2080q5978l5686M7673n5189m2886o7903
$$ -150290 -42643 95450 36600 11904 43984 -41994 -77680 -30007 -85196 -128082 -195985
6481a95985J05768J24208K7188j8692o4452j04260p8902L4680K3302J14885j00329
$$ -195985 -90217 33991 61179 42487 -21965 -126225 -205127 -170447 -147145 -32260 -132589
6470a32589J10653k9999n4785J23471q3827j4439L6058J08977l1892o2516o7542
$$ -132589 -21936 -51935 -106720 16751 -67076 -81515 -45457 63520 31628 -30888 -98430
6459i8430j6032j1084N9612M2199j7039M7731O2998j07492m1495J94847M9589
$$ -98430 -114462 -125546 -65934 -23735 -40774 6957 69955 -37537 -79032 115815 165404
6448A65404N049l1812J5241o199J2016j01877k9449J7574M0159n03l8793j1572
$$ 165404 170453 138641 153882 147683 159699 57822 28373 45947 86106 85603 46810 35238
6436C5238o0293j09924j01620K1133N5275J09821J23891k2504o6482p5596k954
$$ 35238 -25055 -134979 -236599 -215466 -160191 -50370 73521 51017 -15465 -91061 -94015
6425i4015j38133J5851Q6441J49669R3034M5710P7367j06873M0187K2735j41423
$$ -94015 -232148 -216297 -129856 19813 112847 158557 235924 129051 169238 191973 50550
6414E0550o7703P5672J21736N2007p6105j22828o6708k4995J06692J2456R646
$$ 50550 -17153 58519 180255 232262 156157 33329 -33379 -58374 48318 60774 70420
6403G0420k09807k1152J56768K36100J1542q3595q6908q7586m3881m6651M9105
$$ 70420 -139387 -160539 -3771 232329 243871 160276 73368 -14218 -58099 -104750 -55645
6392e5645n1388l2928P7076J25568r2286j25814N6048J26102N3746r1876j7301
$$ -55645 -107033 -139961 -62885 62683 -29603 -155417 -99369 26733 80479 -11397 -28698
6381b8698M5239K9604l1259P9857P2915o9488l7380R0276m3269j02719N3656O0763
$$ -28698 16541 46145 14886 94743 167658 98170 60790 151066 107797 5078 58734 119497
6369A19497J53422K0253j15743m6483j205r0208M5150k6706O3597j00229j31688
$$ 119497 272919 293172 177429 130946 129741 39533 84683 57977 121574 21345 -110343
6358a10343k7168K15548J36666j6249o5498J8045p121n1878L6030j0917j09696
$$ -110343 -137511 78037 214703 198454 132956 151001 143880 92002 128032 117115 7419
6347G419q3273L4571k1277o3396n1764K9794j6059O4507n0144K1435J30038J3966
$$ 7419 -75854 -41283 -62560 -125956 -177720 -147926 -163985 -99478 -149622 -128187 1851 15817
6335A5817p8708j46584j9536P726k3655L5272K0413p739l4939J3454n226R8142
$$ 15817 -62891 -209475 -229011 -221285 -244940 -209668 -189255 -196994 -231933 -218479 -223705 -125563
6323a25563J02423R4523O7664l4644r3305j4530k4418Q5831Q422q4196L6124o7331
$$ -125563 -23140 71383 139047 104403 11098 -3432 -27850 57981 66403 -17793 18331 -49000
6311d9000p6777O2214j16358o3489Q0940R9550k8771o3380J16002q495m0003L2337
$$ -49000 -125777 -63563 -179921 -243410 -162470 -62920 -91691 -155071 -39069 -47564 -87567 -55230
6299e5230m5622l6085P1683J3652R843Q8654L1894q8070j06560O5128Q5470N6899
$$ -55230 -100852 -136937 -65254 -51602 -41759 46895 78789 -9281 -115841 -50713 34757 91656
6287I1656O7397M7068j19629K42r2597n7655L9048K0889j249j6747r416k3334
$$ 91656 159053 206121 86492 86734 -5863 -63518 -24470 -3581 -4830 -21577 -30993 -54327
6275e4327k2115M1363J4380j33839q8854R698l260N4610k4526m4359Q7128P5498
$$ -54327 -76442 -35079 -20699 -154538 -243392 -233694 -236954 -182344 -206870 -251229 -164101 -88603
6263h8603k140K1550P4105j0961J14693m5435K0082r45L0359L5377o052k9559
$$ -88603 -90743 -69193 4912 -6049 108644 63209 83291 82346 112705 148082 142030 112471
6251A12471j6965j61441p5575n1743J7522Q5029l541J00053Ml2748k3370j3789
$$ 112471 95506 -65935 -141510 -193253 -175731 -90702 -94243 5810 5814 -26934 -50304 -64093
6239f4093N9579M9209r3739O7115J09058N4577p9449q8770r3532R075k5879P9712
$$ -64093 -4514 44695 -49044 18071 127129 181706 102257 13487 -80045 -70970 -96849 -17137
6227a7137K0576o9p8961r6976m6600P449Q4651J07923k4305N0636l2976l8893
$$ -17137 3439 3370 -75591 -172567 -219167 -211718 -127067 -19144 -43449 7187 -25789 -64682
6215f4682J3183J02417k4135n0204j0157O9447P4219j02269q0135j38396j30707
$$ -64682 -51499 50918 26783 -23421 -33578 35869 110088 7819 -72316 -210712 -341419
6204c41419L9890J05947J39530Q9428m6482m6239M124M529J9713l8418j4013p5917
$$ -341419 -301529 -195582 -56052 33376 -13106 -59345 -55221 -50692 -30979 -69397 -83410 -159327
6192a59327J0592O5930Q7279N1331l0908p2161J22351K0776K6433K3357p7945
$$ -159327 -148735 -82805 4474 55805 24897 -47264 75087 95863 122296 145653 67708
6181F7708K0005O4377q8254Q398o3480m5119l2228q8287J713L0841J1600J0034
$$ 67708 87713 152090 63836 72234 8754 -36365 -68593 -156880 -155167 -124326 -112726 -102692
6169a02692p1530p220J12543N5264P230l862m607p9619l0158m7136J23507m1155
$$ -102692 -174222 -181442 -68899 -13635 -6405 -10267 -14874 -94493 -124651 -171787 -48280 -89435
6157h9435k6884j5375r5392O1595M2502N3325N1703k2792P1694L946P67K0194
$$ -89435 -116319 -131694 -227086 -165491 -122989 -69664 -17961 -40753 30941 34887 35654 55848
6145E5848N1504N4192r5408j242P4567l9126P5424j29095j09811j2094m8354N2456
$$ 55848 107352 161544 66136 64894 139461 100335 175759 46664 -63147 -75241 -123595 -71139
6133g1139k7200J0853M2776p9079k2160P1639K8249J11805j63p1164L7377Q6361
$$ -71139 -98339 -87486 -44710 -123789 -145949 -74310 -46061 65744 65581 -5583 31794 118155
6121A18155l217k8711Q0807J30591k9756p8788q1890k0247J0998r5817p5564l1134
$$ 118155 114938 86227 167034 297625 267869 189081 107191 86944 97942 2125 -73439 -104573
6109a04573P8537m773k32117o2054J57492R0349J0929J088j2668O1772J34706
$$ -104573 -26036 -30809 -262926 -324980 -167488 -77139 -66210 -65122 -77790 -16018 118688
6098A18688M0107j34660n2643J10822O6451L48n4674o3233k05798k0294M2534
$$ 118688 158795 24135 -28508 82314 148765 149113 94439 31206 -174592 -194886 -152352
6087a52352O4032P92j8586K9506Q3851j16293K354K3870n1768p9880j3673N0080
$$ -152352 -88320 -87528 -106114 -76608 7243 -109050 -106696 -82826 -134594 -214474 -228147 -178067
6075a78067q7640r481P3454J1961j5761J22247q840l4175k356Q9851P4591r4689
$$ -178067 -265707 -275188 -201734 -189773 -205534 -83287 -92127 -126302 -128658 -38807 35784 -58905
6063e8905n9258M5715Q1157k0300J1953r0580o2662O9139O9614L9422J04726n1266
$$ -58905 -118163 -72448 8709 -11591 362 -90218 -152880 -83741 -14127 25295 130021 78755
6051G8755j14284n4110j12783m6597K02941K9079j48654M6647N1739J11967M5439
$$ 78755 -35529 -89639 -202422 -249019 -46078 -16999 -165653 -119006 -67267 44700 90139
6040I0139O923p7567J12758l395o4595q7194Q7617m1547K5324k5999l8778K0375
$$ 90139 97062 19495 132253 128858 64263 -22931 64686 23139 48463 22464 -16314 4061
6028D061j8102J6974m1850q2450L1215J24873R6930j0219q2582k8294P0212R2574
$$ 4061 -14041 2933 -38917 -121367 -90152 34721 131651 121432 38850 10556 80768 173342
6016A73342Q8545o4119k76175k8401L2326o3065P4778J7579p0486L6857R5612
$$ 173342 261887 197768 -78407 -106808 -74482 -137547 -62769 -45190 -115676 -78819 16793
6005A6793p5276j27997N0555J09127L3808k4922r8638p1149J7861J2571j5059
$$ 16793 -58483 -186480 -135925 -26798 7010 -17912 -116550 -187699 -169838 -157267 -172326
5994a72326L2920J13769q8135r9242Q085P5501P5853N4913m1766l9173j52907
$$ -172326 -139406 -25637 -113772 -213014 -204929 -129428 -53575 1338 -40428 -79601 -232508
5983b32508K4850k4638M0795P4353M7581J17675P7488Q76n8346n2734q787L9430
$$ -232508 -207658 -232296 -191501 -117148 -69567 48108 125596 126472 68126 15392 6605 46035
5971D6035L8240l0553r0135j1282K9899l9364J21462m1309r0696j1155l322k7181
$$ 46035 84275 53722 -36413 -47695 -17796 -57160 64302 22993 -67703 -78858 -82180 -109361
5959a09361j36385p0778j4170L2207K5178q6938K71373J58036J2265K8599m1735
$$ -109361 -245746 -316524 -330694 -298487 -273309 -360247 -88874 69162 81427 110026 68291
5948F8291K6139J34612p2724r0683m398r2346j76560m4543P5128Q1332M6931o7750
$$ 68291 94430 229042 156318 65635 61237 -31109 -207669 -252212 -177084 -95752 -48821 -116571
5936a16571J09445J12565r3121r2563J2652L3112N5087l0315J7823m0602L4734
$$ -116571 -7126 105439 12318 -80245 -67593 -34481 20606 -9709 8114 -32488 2246
5925B246n594j3186L1036m59r1910l3285n5175l7781O1420N1988N2051J1818n5579
$$ 2246 -3348 -16534 14502 14043 -77867 -111152 -166327 -204108 -142688 -90700 -38649 -26831 -82410
5912h2410L3446J04074j5179N3744N8276l7124j20825k8981P9916p0849J0429
$$ -82410 -48964 55110 39931 93675 151951 114827 -5998 -34979 44937 -25912 -15483
5901a5483N2321J14008J4107j55848k23447j04658J19702J09792k3687j07965
$$ -15483 36838 150846 164953 9105 -214342 -319000 -199298 -89506 -113193 -221158
5891b21158P2799M513L7803P5407J22140J11138L0283j48121R4596k0295q3875
$$ -221158 -148359 -143846 -106043 -30636 91504 202642 232925 84804 179400 159105 75230
5880G5230l9417j88047j09911O7683l4238o98l4793k4942J10857Q0292R1630R965
$$ 75230 35813 -152234 -262145 -194462 -228700 -229398 -264191 -289133 -178276 -97984 -6354 3611
5868C611r3656o1359O3848O6507j13110J0770J17004J55211q258o6581p9553l27
$$ 3611 -90045 -151404 -87556 -21049 -134159 -123389 -6385 148826 140568 73987 -5566 -5893
5856e893R591n0011L7418o2237M7470L6995r7021r0763n8051k1262Q7548J22229
$$ -5893 3698 -46313 -8895 -71132 -23662 13333 -83688 -174451 -232502 -253764 -166216 -43987
5844d3987M7318p7103n9477j07319K0997J1925L2532O5462L4824j33721l2728
$$ -43987 3331 -73772 -133249 -240568 -219571 -207646 -175114 -109652 -74828 -208549 -241277
5833b41277O9754L2194L3992k1388J5285O1055Q7594m547j3125O4267n9344K8457
$$ -241277 -171523 -139329 -105337 -126725 -111440 -50385 37209 32662 19537 83804 24460 52917
5821E2917r2293o4817q660N017M0836p7369q3533M7238J30192k0371J05972P910
$$ 52917 -39376 -104193 -112853 -107836 -67000 -144369 -227902 -180664 -50472 -70843 35129 43039
5809D3039Q7174j05322j13961P1286Q2607Q7251o8631Q553l2012R108k9777J7633
$$ 43039 130213 24891 -89070 -17784 64823 152074 83443 91996 59984 69092 39315 56948
5797E6948m8371P8093O6295P2445o3969J5922Q531p1587j32961J2079K8000j17145
$$ 56948 8577 86670 152965 225410 161441 177363 185894 114307 -18654 -6575 21425 -95720
5785i5720J5016J64871L6949o8775n4380k2318j45649o9742J18200J02020O2776
$$ -95720 -80704 84167 121116 52341 -2039 -24357 -170006 -239748 -121548 -19528 43248
5774D3248L0153K0870o9397n3142O3701J01048O9225n3971j46665j70328J17452
$$ 43248 73401 94271 24874 -28268 35433 136481 205706 151735 5070 -165258 -47806
5763d7806J2478j3010l1603m0676j3034m1356j1689K6021J4505J10728R707m3738
$$ -47806 -35328 -48338 -79941 -120617 -133651 -175007 -186696 -160675 -146170 -35442 -25735 -69473
5751f9473n0756n2948J22307o822O0468M9395P5633R5218K720r2493j13241L5114
$$ -69473 -120229 -173177 -50870 -57692 2776 52171 127804 223022 225742 133249 20008 55122
5739E5122o3225j31418L2116Q2959j39743o1619L1433J10154J12481o6276o4372
$$ 55122 -8103 -139521 -107405 -24446 -164189 -225808 -194375 -84221 28260 -38016 -102388
5728a02388O6377K7528j61662j13277N7658L4274R3188R2354P7423N148n8649
$$ -102388 -36011 -8483 -170145 -283422 -225764 -191490 -98302 -5948 71475 76623 17974
5717A7974q1570o815J4419m8696M34K6049L695m8100j68963p2353K26613M986
$$ 17974 -63596 -70411 -55992 -104688 -104254 -78205 -74510 -122610 -291573 -363926 -137313 -132327
5705a32327n8771m2237M3821J41093L5215K4146K1583l2594p6227l8531j3379
$$ -132327 -191098 -233335 -189514 -48421 -13206 10940 32523 -71 -76298 -114829 -128208
5694a28208O6365q5707k4775J5843L3737K2205k1596J01631J50071N3496l4590
$$ -128208 -61843 -147550 -172325 -156482 -122745 -100540 -122136 -20505 129566 183062 148472
5683A48472r985n9636j7782J3136J1774n0750O3006N1456o6744o9224J7586O9945
$$ 148472 138487 78851 61069 74205 85979 35229 98235 149691 82947 13723 31309 101254
5671A01254m5013m8891q239n1430J5736m186L1533j04610m7705K2262J45285J43401
$$ 101254 56241 7350 -889 -52319 -36583 -40769 -9236 -113846 -161551 -139289 5996 149397
5659A49397k5110r6308m7578N5399k681p6174J5067j09534j9937L0216k1482J13840
$$ 149397 124287 27979 -19599 35800 33119 -43055 -27988 -137522 -157459 -127243 -148725 -34885
5647c4885K0062p2110p6925l4244J14964m0031q4313J10831m2960L8354J0353
$$ -34885 -14823 -86933 -163858 -198102 -83138 -123169 -207482 -96651 -139611 -101257 -90904
5636i0904M103O6432o8368j1257K5227R2435J5757L6198K10934Q2988m6934j38611
$$ -90904 -86801 -20369 -88737 -99994 -74767 17668 33425 69623 280557 363545 316611 178000
5624A78000j43655o8669L7850n8953M9172j11R854k1398l3236N39n7892M7746
$$ 178000 34345 -34324 3526 -55427 -6255 -6366 3488 -17910 -51146 -50607 -108499 -60753
5612f0753J42244k8074r7806J392J8520J3086k1773o878L8233J05980J6071J04003
$$ -60753 81491 53417 -44389 -42997 -24477 -11391 -33164 -40042 -1809 104171 120242 224245
5600B24245J6166j19118l9174P371N3420q9360J3168J4174p6106j10935K6328
$$ 224245 240411 121293 82119 89490 142910 53550 66718 80892 4786 -106149 -79821
5589g9821k2051l8632m2643k8610R4453R8156o0034r7892P2792N0846p3813Q9204
$$ -79821 -101872 -140504 -183147 -211757 -117304 -19148 -79182 -177074 -104282 -53436 -127249 -38045
5577c8045l6698l6229O655k5617J20149Q3662k45455j29846O4339J46644K3552
$$ -38045 -74743 -110972 -104317 -129934 -9785 73877 -171578 -301424 -237085 -90441 -66889
5566f6889M3851O4829k0784k139q0337L9428l7969j1627J7210P9586L6938k989
$$ -66889 -23038 41791 21007 18868 -61469 -22041 -60010 -71637 -54427 25159 62097 59108
5554E9108K0021n3275K6673J07609R8859k3276j01372l6865j9952k8892m9795
$$ 59108 79129 25854 52527 160136 258995 235719 134347 97482 77530 48638 -1157
5543a157n6598j8286J5978j3362K1637l5538J85606J30207j00057j72765m8896
$$ -1157 -57755 -76041 -60063 -73425 -51788 -87326 98280 228487 128430 -44335 -93231
5532i3231O8789j6962J1088L9730J0875r1142j00215J24255M5772j0974K1891
$$ -93231 -24442 -41404 -30316 9414 20289 -70853 -171068 -46813 -1041 -12015 9876
5521I876p4093J2843J8458k2903n5370m6416m7050l3593J80328O7969J4926N5732
$$ 9876 -64217 -51374 -32916 -55819 -111189 -157605 -204655 -238248 -57920 10049 24975 80707
5509H0707l2835J00890K1396O367k5651Q7624j8764j00925j00066M4057n2931
$$ 80707 47872 148762 170158 176525 150874 238498 219734 118809 18743 62800 9869
5498I869j18426q2984q8670R5209K17855j5372m1292M7757j64043q5734M8710
$$ 9869 -108557 -191541 -280211 -185002 32853 17481 -23811 23946 -140097 -225831 -177121
5487a77121L9189O0670n5014Q262O7053K4102J6981k4531p5312N8886Q3827M6460
$$ -177121 -137932 -77262 -132276 -124014 -56961 -32859 -15878 -40409 -115721 -56835 26992 73452
5475G3452n8775r4765R6243J2503k02044j00162N9773m7485K6441J5262r043R9294
$$ 73452 14677 -80088 16155 28658 -173386 -273548 -213775 -261260 -234819 -219557 -228600 -129306
5463a29306J03214m391N6047P0456N687q4894r4324l7952O4342p571r2670p582
$$ -129306 -26092 -30483 25564 96020 101707 16813 -77511 -115463 -51121 -58692 -151362 -158944
5451a58944N1805J29486P237K041o8189p5991J715k0463j5494q137O7991O117
$$ -158944 -107139 22347 29584 31625 -36564 -112555 -110840 -131303 -146797 -154934 -86943 -80826
5439h0826l2849j1399k1163k2278q802M6127j2601N898k197J4314M6851J07959
$$ -80826 -113675 -125074 -146237 -168515 -177317 -131190 -143791 -137893 -140090 -125776 -78925 29034
5427B9034K8909k3696O1518j55717q1757j5230N8692j4347O273J08307m8608N7134
$$ 29034 57943 34247 95765 -59952 -141709 -156939 -98247 -112594 -106321 1986 -46622 10512
5415A0512j00311J937L6544k6963O5594L4343l7195j11003l5943J17161Q173L9326
$$ 10512 -89799 -87862 -51318 -78281 -12687 21656 -15539 -126542 -162485 -45324 -37151 2175
5403B175j5328N9259J5825j09304n1011l7948R7417J00876m0631j27131N948R1162
$$ 2175 -13153 46106 61931 -47373 -98384 -136332 -38915 61961 21330 -105801 -99853 -8691
5391h691O5398j62100j37211N1784P5833L6522K6977M2776J65661P3237r9867
$$ -8691 56707 -105393 -242604 -190820 -114987 -78465 -51488 -8712 156949 230186 130319
5380A30319j98694m8788k0889j12784j19977M7851L7305M7889R1785K686N6352
$$ 130319 -68375 -117163 -138052 -250836 -370813 -322962 -285657 -237768 -145983 -143297 -86945
5369h6945O6904j08108m6504m2272k464N313j4506M1589L2463L310R5402K2893
$$ -86945 -20041 -128149 -174653 -216925 -219389 -214076 -228582 -186993 -154530 -151220 -55818 -32925
5357c2925R3275N1593j17591j22107O1998K04889J6272r7427p6790l5230q0036
$$ -32925 60350 111943 -5648 -127755 -65757 139132 155404 57977 -18813 -54043 -134079
5346a34079m9258J05149J07021j371j2451L6889J4806j26905K9719m4712J23877
$$ -134079 -183337 -78188 28833 27462 15011 51900 66706 -60199 -30480 -75192 48685
5335D8685k4376M257O8935K2628j14593n9288p1201l462L7205O2872J2434p8461
$$ 48685 24309 28566 97501 120129 5536 -53752 -124953 -128415 -91210 -28338 -15904 -94365
5323i4365K2560J03774o9409l4044m6324q8634j9767J27917k7380l4086L02Q6935
$$ -94365 -71805 31969 -37440 -71484 -117808 -206442 -226209 -98292 -125672 -159758 -159456 -72521
5311g2521m007K6287l2097m5818m3178l8838J04909J7100l5561o9578L3286Q2490
$$ -72521 -76528 -50241 -82338 -128156 -171334 -210172 -105263 -88163 -123724 -193302 -160016 -77526
5299g7526m0549K6519Q0912n5184L3867J05043j39403j95847K3659R1705R6061
$$ -77526 -118075 -91556 -10644 -65828 -31961 73082 -66321 -262168 -238509 -146804 -50743
5288e0743k9516k7819j0210R3155N4875n3494p5408k2133K5863K8112n8091p25
$$ -50743 -80259 -108078 -118288 -25133 29742 -23752 -99160 -121293 -95430 -67318 -125409 -126134
5276a26134p8426O8026J9057L6706Q765J79560O2344j06135m165j9558l5823j2020
$$ -126134 -204560 -136534 -117477 -80771 -72006 107554 169898 63763 59598 40040 4217 -7803
5264g803J7945P836m0420j8111N5144J1943r827l0897L4480O3247K1075j54963
$$ -7803 10142 17978 -22442 -40553 14591 26534 16707 -14190 20290 83537 104612 -50351
5252e0351j28665j0718J2222J27958Q1728j09952l5830K2921P7999L5681L6850
$$ -50351 -179016 -189734 -177512 -49554 32174 -77778 -113608 -90687 -12688 22993 59843
5241E9843k3195K9851M5491k2686n7033p8969j4369q4353q203J65808K0784L4895
$$ 59843 36648 66499 111990 89304 32271 -46698 -61067 -145420 -153623 12185 32969 67864
5229F7864j5359j56328q684J3624j63614o18K4490k9216O4689J33420P1966p9877
$$ 67864 52505 -103823 -112507 -98883 -262497 -263115 -238625 -267841 -203152 -69732 2234 -77643
5217g7643o6328P9093q3123n6325L9161O6231m6753p4821K3392l553j6357J34429
$$ -77643 -143971 -64878 -148001 -204326 -165165 -98934 -145687 -220508 -197116 -200669 -217026 -82597
5205h2597J18528N8613k9782O3663J08937J133J142k5998m3927r2184j60528n4877
$$ -82597 35931 94544 64762 128425 237362 238495 239637 213639 169712 77528 -83000 -137877
5193a37877M4942M6627J8435M4383Q2571P1917j17421p5993n1807l1508R94p2298
$$ -137877 -92935 -46308 -27873 16510 99081 170998 53577 -22416 -74223 -105731 -104737 -177035
5181a77035q3035R7829L5450J7498p2659J5805J33300J17725l6800q6608M1118
$$ -177035 -260070 -162241 -126791 -109293 -181952 -166147 -32847 84878 48078 -38530 2588
5170B588J43823p8848j67491N4918J49652q212q9308J1244O7620j0506l8575L0523
$$ 2588 146411 67563 -99928 -45010 104642 96430 7122 18366 85986 75480 36905 67428
5158F7428J0917j20911l5153O0027M9722j35359r771K6856m406N1639J17795j6971
$$ 67428 78345 -42566 -77719 -17692 32030 -103329 -113100 -86244 -90650 -39011 78784 61813
5146F1813j46650j1087J07905O2849J8690l8066j29838n4402r043l3999O0149
$$ 61813 -84837 -95924 11981 74830 93520 55454 -74384 -128786 -137829 -171828 -111679
5135a11679J14904L9956N2270j5093r6478p2570p1479m3630Q5808O0928q3329
$$ -111679 3225 43181 95451 80358 -16120 -88690 -160169 -203799 -117991 -57063 -140392
5124a40392J1783J29858J56687q1216j59922n5488J18010J17610j11536j05223
$$ -140392 -128609 1249 157936 76720 -83202 -138690 -20680 96930 -14606 -119829
5114a19829r799P931M9249J33138N4796j11699j21826O4964N7764o1945K1607
$$ -119829 -129628 -121697 -72448 60690 115486 3787 -118039 -53075 4689 -57256 -35649
5103c5649L7452K5015p5780o8289q8958N8029N5443N4911J72145L1702J4546p8949
$$ -35649 1803 26818 -48962 -117251 -206209 -148180 -92737 -37826 134319 166021 180567 101618
5091A01618p558m158O5635M3295j70486q4789L2493L843M4622M8912N2197L0699
$$ 101618 94060 89902 155537 198832 28346 -56443 -23950 -20107 24515 73427 125624 156323
5079A56323m7513n1854j78235n8438K2133N0874Q6753j9258q1383P0958P503k7037
$$ 156323 108810 56956 -121279 -179717 -157584 -106710 -19957 -39215 -120598 -49640 -42137 -69174
5067f9174N9298R7158k6130q6694k2824J7904K9657q0660K6677L0619k389o443
$$ -69174 -9876 87282 61152 -25542 -48366 -30462 -805 -81465 -54788 -24169 -26558 -33001
5055c3001l0438K4579l8524L6611K9612J0529J9305r1985j21767j18078M452R9518
$$ -33001 -63439 -38860 -77384 -40773 -11161 -632 18673 -73312 -195079 -313157 -308705 -209187
5043b09187J03195R0728L1067o850L8093N181l0925j8764j23944N9701O2559j7129
$$ -209187 -105992 -15264 15803 8953 47046 52227 21302 2538 -121406 -61705 854 -16275
5031a6275J5809j18072K9754o8072l192l656J22614j3914J042k8152q571j18624
$$ -16275 -466 -118538 -88784 -156856 -160048 -163704 -41090 -55004 -53962 -82114 -90685 -209309
5019b09309k9882J37101j4454j6190N2661N2828k3671j061k5329l2278R0519O2486
$$ -209309 -239191 -102090 -116544 -132734 -80073 -27245 -50916 -51977 -77306 -109584 -19065 43421
5007D3421j3101M7349M8265j05007j34240p90K9341P8252L6049K1529l8353l9360
$$ 43421 30320 77669 125934 20927 -113313 -114103 -84762 -6510 29539 51068 12715 -26645
4995b6645j08792o995J6548j9733L422r7185k5933J30286N3312m1576P8150K7653
$$ -26645 -135437 -142432 -125884 -145617 -142195 -239380 -265313 -135027 -81715 -123291 -45141 -17488
4983a7488N4038p6829j5471j5493R3188q0126q3337J16726J24503P4726P1560
$$ -17488 36550 -40279 -55750 -71243 21945 -58181 -141518 -24792 99711 174437 245997
4972B45997o6461k6094j03906J2185j2802m4598j50507R9910J46582J80491j03509
$$ 245997 179536 153442 49536 61721 48919 4321 -146186 -46276 100306 280797 177288
4961A77288j25929m4371M5857P4416l3831j26003l1646k8278N3546n5823K4869
$$ 177288 51359 6988 52845 127261 93430 -32573 -64219 -92497 -38951 -94774 -69905
4950f9905j0916k257M8033q4343j3723K6479J01957J40434j11598j43568n3330
$$ -69905 -80821 -83078 -35045 -119388 -133111 -106632 -4675 135759 24161 -119407 -172737
4939a72737j3569p9497J9910J28858R2740k5444P5497n1004l0075R862l181J0126
$$ -172737 -186306 -265803 -245893 -117035 -24295 -49739 25758 -25246 -55321 -45459 -48640 -38514
4927c8514K502J2416r7232m4315J02326o949J5452m7821J7355k043p407n8877
$$ -38514 -36012 -23596 -120828 -165143 -62817 -69766 -54314 -102135 -84780 -86823 -94230 -153107
4915a53107R360M2779R8934J31438n0144p515L1636j13327j033J962J6181j15935
$$ -153107 -143747 -100968 -2034 129404 79260 71745 103381 -9946 -10979 -9017 7164 -108771
4903a08771R6738R2604l783R0183m2375N4353q0578k1606K2266n0534o352M1517
$$ -108771 -12033 80571 76788 166971 124596 178949 98371 76765 99031 48497 42145 83662
4891H3662j49351k7481j4570o1482J10014Q3000P4399P4329j62920l5411O8359
$$ 83662 -65689 -93170 -107740 -169222 -59208 23792 98191 172520 9600 -25811 42548
4880D2548m0904O0570j5427n0029J0728n5987J6648N5699N7668j22402n5852J26845
$$ 42548 1644 62214 46787 -3242 7486 -48501 -31853 23846 81514 -40888 -96740 30105
4868C0105O006M2647m9924Q836j22175M5352N0009l4233p5618j11351o1341L9333
$$ 30105 36111 78758 28834 37670 -84505 -39153 10856 -23377 -98995 -210346 -271687 -232354
4856b32354O346K6724J12095K0576o0352p6405j0494N7463J01853M1092j182J9453
$$ -232354 -226008 -199284 -87189 -66613 -126965 -203370 -213864 -156401 -54548 -13456 -14638 4815
4844D815L9554P6870l1522j20521o2451K4003J10924J7087k85j05221j24814p0879
$$ 4815 44369 121239 89717 -30804 -93255 -69252 41672 58759 58474 -46747 -171561 -242440
4832b42440J43481J30630J9705K7770m0718j5989N814j30522r3861L3401O2285
$$ -242440 -98959 31671 51376 79146 38428 22439 28253 -102269 -196130 -162729 -100444
4821a00444M40K7826M6489j6457j3664L35O0526M1841o9080l0002m585N7425p2572
$$ -100444 -100004 -72178 -25689 -42146 -55810 -55475 5051 46892 -22188 -52190 -56775 650 -71922
4808g1922k33117n3675J00437J17201R2238O9637J2542j40042J44361J24920j07144
$$ -71922 -305039 -358714 -258277 -141076 -48838 20799 33341 -106701 37660 162580 55436
4797E5436J0559M1848j31703l8842K5510O1985R1342Q8666j56995j59001j973
$$ 55436 65995 107843 -23860 -62702 -37192 24793 116135 204801 47806 -111195 -113168
4786a13168K7149k9185J2768p9515K1029m2184R1912J33581R4735K0469o5417
$$ -113168 -86019 -115204 -102436 -181951 -160922 -203106 -111194 22387 117122 137591 72174
4775G2174o64M773r111k1474k7128K5089J2478M6514q1240l6154K1788L508M2268
$$ 72174 71510 76283 67172 45698 18570 43659 56137 102651 21411 -14743 7045 10553 52821
4762E2821p9234n8840R0963N0768j7906m1724m0643J3055P2991m2969P5026k4181
$$ 52821 -26413 -85253 5710 56478 38572 -3152 -43795 -30740 42251 -718 74308 50127
4750E0127l7159K7676R569P4762O7504o5161j80677L5557l1047J5933j7720J14408
$$ 50127 12968 40644 50213 124975 192479 127318 -53359 -17802 -48849 -32916 -50636 63772
4738F3772J70469n8296o5389J7158O4599O8835j40078j21604j44182m504k7011
$$ 63772 234241 175945 110556 127714 192313 261148 121070 -534 -144716 -149220 -176231
4727a76231K7786M9472J25105j4552j22838L5909O1135l6862j6030M0776J04608
$$ -176231 -148445 -98973 26132 11580 -111258 -75349 -14214 -51076 -67106 -26330 78278
4716G8278O9825m3835q9840q7684n654L2874L7908K9679m4082k2216J1812M516
$$ 78278 148103 104268 14428 -73256 -78910 -46036 -8128 21551 -22531 -44747 -32935 -28419
4704b8419n6662Q1477P9678n8178k676P2138m2786p3694j9121m3234J7270l489
$$ -28419 -85081 -3604 76074 17896 15220 87358 44572 -29122 -48243 -91477 -74207 -77696
4692g7696M14Q2503J1542Q7311J2940j61431K0123J58604p6642q6708O9008q0647
$$ -77696 -77282 5221 16763 104074 117014 -44417 -24294 134310 57668 -29040 39968 -40679
4680d0679j01608L4120l7671j14115n177J39789J06284Q0259P8708M8765m2122
$$ -40679 -142287 -108167 -145838 -259953 -265130 -125341 -19057 61202 139910 188675 146553
4669A46553M0064l911n3004j63827j8281J029p3069j59532J649L6986R7091J18005
$$ 146553 186617 182706 129702 -34125 -52406 -51377 -124446 -283978 -282329 -245343 -148252 -30247
4657c0247n5340K5928O5480K9159j07637O632J5239L8523j9173k9325n6149R9701
$$ -30247 -85587 -59659 5821 34980 -72657 -66025 -50786 -12263 -31436 -60761 -116910 -17209
4645a7209K31006j39859j60142M3063Q5389M1229P8059J9981p4354L7582k5804
$$ -17209 213797 73938 -86204 -43141 42248 83477 161536 181517 107163 144745 118941
4634A18941o5541N4036J00260m3352l0575L1925P156R2635k668j39757o4365l899
$$ 118941 53400 107436 207696 164344 133769 165694 172850 265485 262817 123060 58695 54796
4622E4796l1270L6134l7002N4643N0743P5265j01078K3700J27264r9237n6204
$$ 54796 23526 59660 22658 77301 128044 203309 102231 125931 253195 153958 97754
4611I7754m3787q5045q5202l2679N2296J12130J7825N5006K6200l4198l3007l8833
$$ 97754 53967 -31078 -116280 -148959 -96663 15467 33292 88298 114498 80300 47293 8460
4599H460j11777o877J01161K7823q277j04827n5690o7385J12248J58015P8204
$$ 8460 -103317 -110194 -9033 18790 10513 -94314 -150004 -217389 -105141 52874 131078
4588A31078j11133K7777L666n1935k0412j57111O0850Q450n3369j08588O2289
$$ 131078 19945 47722 51388 -547 -20959 -178070 -117220 -108770 -162139 -270727 -208438
4577b08438R4157M1106J2574k0634J35316N1340j36325K1349n827k2436N6221
$$ -208438 -114281 -73175 -60601 -81235 54081 105421 -30904 -9555 -15382 -37818 18403
4566A8403J67269Q4104j26731M7933m5458M781j16656l8803K4564k9229K7909
$$ 18403 185672 269776 143045 190978 145520 150301 33645 -5158 19406 -9823 18086
4555A8086Q7357m120r4847j52249P4880q6954r3985J0703P8588R657o658j7893
$$ 18086 105443 101323 6476 -145773 -70893 -157847 -251832 -241129 -162541 -152884 -159542 -177435
4543a77435M8513J52700O1745j04446q9395L7234J02209n6856J23126O1554n5008
$$ -177435 -128922 23778 85523 -18923 -108318 -71084 31125 -25731 97395 158949 103941
4532A03941p0932J9353N8787J41669k8917j57710k7413J28025o0614j78471N205
$$ 103941 33009 52362 111149 252818 223901 66191 38778 166803 106189 -72282 -67077
4521f7077N5767J5937k8919J13122M9382n5752K1115K5673m1697l013k5320k9366
$$ -67077 -11310 4627 -24292 88830 138212 82460 103575 129248 87551 84538 59218 29852
4509B9852N4435K3054j2535j365r64n5606N7589j0838O240O497l2050l2512m3814
$$ 29852 84287 107341 94806 93441 92477 36871 94460 83622 89862 96359 64309 31797 -12017
4496a2017q2687k0287j436q562K5809j998j3998M7290N4401K848P0223P853j600
$$ -12017 -94704 -114991 -116427 -124989 -99180 -101178 -115176 -67886 -13485 -10637 59586 67439 65839
4483F5839J985M3207L4615p0758k36773m0710J20161J3499m051K0778p0996P3880
$$ 65839 67824 111031 145646 74888 -161885 -202595 -82434 -68935 -72986 -52208 -123204 -49324
4471d9324P271N4863o050k311j5245R0961l8036p4102M4104k5338N1072k8813
$$ -49324 -42053 12810 6760 4449 -10796 80165 42129 -31973 12131 -13207 37865 9052
4459I052J0249l0253n9037L9115p3010J4696J24004J63555M3516j46541n7941
$$ 9052 19301 -10952 -69989 -30874 -103884 -89188 34816 198371 241887 95346 37405
4448C7405m0641N6876J4177l5433o0833j08835P2306L8743l0369M367j23853N654
$$ 37405 -3236 53640 67817 32384 -28449 -137284 -64978 -26235 -56604 -52237 -176090 -170436
4436a70436J13854J02248Q5182k7125j94411J63414J67244j1479l1303l4047k3476
$$ -170436 -56582 45666 130848 103723 -90688 72726 239970 228491 197188 163141 139665
4425A39665N9592j1328m9433N616j18061J33117O5230j56759r6490J6890L0913
$$ 139665 199257 187929 138496 144112 26051 159168 224398 67639 -28851 -11961 18952
4414A8952J015J8599j07173r0641N9856J85800L7264p8821L4633k6798o9627j76528
$$ 18952 19967 38566 -68607 -159248 -99392 86408 123672 44851 79484 52686 -16941 -193469
4402a93469m3238J25503L6906Q7437N6015n1154o4147J1405n3747l6155j02543
$$ -193469 -236707 -111204 -74298 13139 69154 18000 -46147 -34742 -88489 -124644 -227187
4391b27187K551Q8326p483j147J05983O9548n2241P964m0128m828N4658Q5217
$$ -227187 -224636 -136310 -143793 -144940 -38957 30591 -21650 -13686 -53814 -58642 -3984 81233
4379H1233O4344l8893k6442n0051j6873J18875k9753j12672j20714J1740K9555
$$ 81233 145577 106684 80242 30191 13318 132193 102440 -10232 -130946 -119206 -89651
4368h9651J32609L5789k1495M4710J11417n1719n7844j20385k0272L8832p2233
$$ -89651 42958 78747 57252 101962 213379 161660 103816 -16569 -36841 1991 -70242
4357g0242j18170O1455J10608J12578K2704k1800m3299j1663j25455r2514M7335
$$ -70242 -188412 -126957 -16349 96229 118933 97133 53834 42171 -83284 -175798 -128463
4346a28463P7096K25844N8161j08454Q7389j9013j27424m9357q0032j7481N4585
$$ -128463 -51367 174477 232638 124184 211573 192560 65136 15779 -64253 -81734 -27149
4335b7149k4174n8672o197r6039P8452J75592Q2156n5441L1588L0264l9232o9170
$$ -27149 -51323 -109995 -116192 -212231 -133779 41813 123969 68528 100116 130380 91148 21978
4323B1978r8870m5331Q2178N7554O4641M9366o8324p5288Q0957R9171J4173J9506
$$ 21978 -76892 -122223 -40045 17509 82150 131516 63192 -12096 68861 168032 182205 201711
4311B01711M8321m2606j65519k97O5720k19108R461J26419Q1210m7299j63820
$$ 201711 250032 207426 41907 41610 107330 -111778 -102317 24102 105312 58013 -105807
4300a05807l9164K8228K8996J09253j6923K6420M6791J8403J740o352o2680r006
$$ -105807 -144971 -116743 -87747 21506 4583 31003 77794 96197 97937 91585 28905 19899
4288A9899l3590q615o0042n0739P5367J16755n8575o677N7035O6595o9100k2098
$$ 19899 -13691 -22306 -82348 -133087 -57720 59035 460 -6217 50818 117413 48313 26215
4276B6215p8901o3179l6811n1472p587N0437J14146P0302M2886j06380q044J39274
$$ 26215 -52686 -115865 -152676 -204148 -211735 -161298 -47152 23150 66036 -40344 -48388 90886
4264I0886N5947p0464R692Q7988q1422j42959o7409j37567n7336M8794j0421N7396
$$ 90886 146833 76369 86061 174049 92627 -50332 -117741 -255308 -312644 -263850 -274271 -216875
4252b16875Q3538P3152J2949j02780l1999L2035N6015Q3545L0730N9490m2564
$$ -216875 -133337 -60185 -47236 -150016 -182015 -149980 -93965 -10420 20310 79800 37236
4241C7236k596k4372o7182p436p5598M2585R9219j0317j2643J05766q888j9260
$$ 37236 34640 10268 -56914 -64350 -139948 -97363 1856 -8461 -21104 84662 75774 56514
4229E6514L2511r572p7331r1087o3523K5304l724Q0989Q0686P3478p2684K3054
$$ 56514 89025 79453 2122 -88965 -152488 -127184 -130908 -49919 30767 104245 31561 54615
4217E4615k090k4259k7027L1454P9169K339q4027l5188o6624L9881Q8093m3612
$$ 54615 52525 28266 1239 32693 111862 114201 30174 -5014 -71638 -31757 56336 12724
4205A2724J0310k7973r4727M3905L3112o7746O13q1541o6545J85918J29997Q3816
$$ 12724 23034 -4939 -99666 -55761 -22649 -90395 -89782 -171323 -237868 -51950 78047 161863
4193A61863J08112j78288o6645J01856j0669j37483J18351o280p674j24034j715
$$ 161863 269975 91687 25042 126898 116229 -21254 97097 90817 83143 -40891 -42606
4182d2606l2296K3459j6728q0334R6680M3621j4661J3613L5480j3829J07386j0743
$$ -42606 -74902 -51443 -68171 -148505 -51825 -8204 -22865 -9252 26228 12399 119785 109042
4170A09042q7995J2414m7873l4232L9984J8357j8340j4611J4995K5779p583m2886
$$ 109042 21047 33461 -14412 -48644 -8660 9697 -8643 -23254 -8259 17520 9937 -32949
4158c2949L6638k7772l2036J4926K4810n4900j07836r6236j23281Q9700Q8806
$$ -32949 3689 -24083 -56119 -41193 -16383 -71283 -179119 -275355 -398636 -308936 -220130
4147b20130j3430J15927J18509K0860L0932j9507n6620L5150J28378p4645o5686
$$ -220130 -233560 -117633 876 21736 52668 33161 -23459 11691 140069 65424 -262
4136b62Q2212L1829L469K4972Q362j35243j33417L8323P9508J4861n2896l2039
$$ -262 81950 113779 117248 142220 150582 15339 -118078 -79755 -247 14614 -38282 -70321
4124g0321j02952o0124j1822q5849o8718M0037J50096J155Q4305M1366j7651J1419
$$ -70321 -173273 -233397 -245219 -331068 -399786 -359749 -209653 -208498 -124193 -82827 -100478 -89059
4112h9059J806M2368m7057j06493J1137k7010L4393N2305J44227P9634K7735M3630
$$ -89059 -87253 -44885 -91942 -198435 -187298 -214308 -179915 -127610 16617 96251 123986 167616
4100A67616j2950k6696n7143j17129j9237o2320K4220J28725J16063n5605n8819
$$ 167616 154666 127970 70827 -46302 -65539 -127859 -103639 25086 141149 85544 26725
4089B6725q5700r0353r0919k1969J33434J04535J59361L855l9912j31545k7203
$$ 26725 -58975 -149328 -240247 -262216 -128782 -24247 135114 138969 99057 -32488 -59691
4078e9691o9731L3060J4437p4150o12q8392o2276k0684K0704p308O4697P8590
$$ -59691 -129422 -96362 -81925 -156075 -156687 -245079 -307355 -328039 -307335 -314643 -249946 -171356
4066a71356l8189m878Q3714M4897n5392n4553J19174P7740K602n7750l0143L7651
$$ -171356 -209545 -214423 -130709 -85812 -141204 -195757 -76583 1157 3759 -53991 -84134 -46483
4054d6483J33089j12770n1788Q628j7955O3595j18344N5719R7078O2514l2876
$$ -46483 86606 -26164 -77952 -69324 -87279 -23684 -142028 -86309 10769 73283 40407
4043D0407j37315k3983j8476n9193O4506M3597J0616j3463r8194N1236M2557k6119
$$ 40407 -96908 -120891 -139367 -198560 -134054 -90457 -79841 -93304 -191498 -140262 -97705 -123824
4031a23824l3296R2491J33368M7123j19954r5143m3510k7848J09080J14627L3924
$$ -123824 -157120 -64629 68739 115862 -4092 -99235 -142745 -170593 -61513 53114 87038
4020H7038P9794o9140j14462O1049Q2296q1793J3709r242K8926p9900k2558n4891
$$ 87038 166832 97692 -16770 44279 126575 44782 58491 49249 78175 -1725 -24283 -79174
4008g9174m3381P3034N2087N39j05840N7974R4055P9634K7509p2362o3775q1945
$$ -79174 -122555 -49521 2566 3105 -102735 -44761 49294 128928 156437 84075 20300 -61645
3996f1645j0802J48456J3264n031j03284M385l468j29287r3740l2222J51959J10956
$$ -61645 -72447 76009 89273 84242 -19042 -14657 -18125 -147412 -241152 -273374 -121415 -10459
3984a0459K3387m8957M2586l3949k0726K4972J5815J6983O5980o7820Q8446P4076
$$ -10459 12928 -36029 6557 -27392 -48118 -23146 -7331 9652 75632 7812 96258 170334
3972A70334j1003O0498j32265q6674n0190o4777n9502M8807Q6688j1395o2176
$$ 170334 159331 219829 87564 890 -49300 -114077 -173579 -124772 -38084 -49479 -111655
3961a11655l712K9797m017j4049K8986J17794J44809j58853j21238k1332n9054
$$ -111655 -115367 -85570 -89587 -103636 -74650 43144 187953 29100 -92138 -113470 -172524
3950a72524n4476J54506J20419j37840O0073Q2465q7467m5971P205R3459K7008
$$ -172524 -227000 -72494 47925 -89915 -29842 52623 -34844 -80815 -73610 19849 46857
3939D6857p7458p7604N319J18585J09253j5415r0135m4605n4249j10853p129Q2016
$$ 46857 -30601 -108205 -102886 15699 124952 109537 19402 -25203 -79452 -190305 -197434 -115418
3927a15418K037m4255K5550P9680J7257j49887o2957K860P0728N9543J9615m928
$$ -115418 -113381 -157636 -132086 -52406 -35149 -185036 -247993 -245133 -174405 -114862 -95247 -100175
3915a00175J5875J16434J07184j22920L6070R2676j05925j8614n3913M5916m0502
$$ -100175 -84300 32134 139318 16398 52468 145144 39219 20605 -33308 12608 -27894
3904b7894k6996Q6287j2527p5495O2123J28418r947j13415R4210O1741M3454j22422
$$ -27894 -54890 31397 18870 -56625 5498 133916 123969 10554 104764 166505 209959 87537
3892H7537p0068L3174j3426j00168O987O938Q295l0392O488J2265j6782L9407
$$ 87537 17469 50643 37217 -62951 -55964 -49026 -40731 -71123 -64635 -52370 -69152 -29745
3880b9745q5479l1053l5956j9778J14142O3110J7866P8110K3104l226j06448l5962
$$ -29745 -115224 -146277 -182233 -202011 -87869 -24759 -6893 71217 94321 91095 -15353 -51315
3868e1315r783m8666J41641Q4225N1415N1955j5434q2867j07517q4948N1658N2516
$$ -51315 -61098 -109764 31877 116102 167517 219472 204038 121171 13654 -71294 -19636 32880
3856C2880O109J45709m1837m9920J845P1068M1313M6588o8498l945j45233p8259
$$ 32880 38989 184698 142861 92941 94786 165854 207167 253755 185257 181312 36079 -42180
3844d2180k2667l0309j49378K5454K20347j6679R331M0950Q7441j66004n6185
$$ -42180 -64847 -95156 -244534 -219080 1267 -15412 -6081 34869 122310 -43694 -99879
3833i9879q7376q1123L6580J45824j6508k3546N6971J3767K1445N6226r3709r1048
$$ -99879 -187255 -268378 -231798 -85974 -102482 -126028 -69057 -55290 -33845 22381 -71328 -162376
3821a62376Q7296J6151q274l3885L5183k2821R619K8736P601K0527P9338o624
$$ -162376 -75080 -58929 -67203 -101088 -65905 -88726 -79107 -50371 -42770 -22243 57095 50471
3809E0471j19726L4563P2317K9658l160J8546p2624r8666M5623l573N0430R600
$$ 50471 -69255 -34692 37625 67283 64123 82669 10045 -88621 -42998 -46571 3859 13459
3797A3459N1592m2151o388l6347l8366r9927K3101o2587L1462J2046P0007N6354
$$ 13459 65051 22900 16512 -19835 -58201 -158128 -135027 -197614 -166152 -154106 -84099 -27745
3785b7745K1145O5417J19610O3806j25098j16216m1427j1892N2433k6403l2322
$$ -27745 -6600 58817 178427 242233 117135 919 -40508 -52400 33 -26370 -58692
3774e8692j06809M9254J56802K0808n1015k0963N4401K7908J4169J06920m5156
$$ -58692 -165501 -116247 40555 61363 10348 -10615 43786 71694 85863 192783 147627
3763A47627j27104M231J4331N4733N3379m9729K502o7123o314L0949n2888j9235
$$ 147627 20523 24754 39085 93818 147197 97468 99970 32847 26533 57482 4594 -14641
3751a4641M2373L5182j01002j92704m948J14425P0210O4973m8706R457K8515M4540
$$ -14641 27732 62914 -38088 -230792 -235740 -121315 -51105 13868 -34838 -25381 3134 47674
3739D7674j5547O847j49369k5131l4522K2961R3467M8197R8916j8137m6706k3920
$$ 47674 32127 38974 -110395 -135526 -170048 -147087 -53620 -5423 93493 75356 28650 4730
3727D730J0009P6348L381O9844q7752l1151L6906n8308l5609q279O9696L7J8598
$$ 4730 14739 91087 94468 164312 76560 45409 82315 24007 -11602 -19881 49815 49852 68450
3714F8450J08594K6143o4139N2325j06069p1710k8562l9857O6907L0129j5337
$$ 68450 177044 203187 139048 191373 85304 13594 -14968 -54825 12082 42211 26874
3703B6874m9983N0537K5818l080j3348K2005p3290n1679K7118K3523J5089O1566
$$ 26874 -23109 27428 53246 50166 36818 58823 -14467 -66146 -39028 -15505 -416 61150
3691F1150K0865j60959r0682J1780J02743J24651L4793j26105j01539j16449j5319
$$ 61150 82015 -78944 -169626 -157846 -55103 69548 104341 -21764 -123303 -239752 -255071
3680b55071N0644J20242J53025l618k2041O3347o0065j04008K9155Q5946J8664
$$ -255071 -204427 -84185 68840 65222 43181 106528 46463 -57545 -28390 57556 76220
3669G6220o4910m6197L7369J02403J584p0202P0027j4163p1894K6660K672j29603
$$ 76220 11310 -34887 2482 104885 106469 36267 106294 92131 20237 46897 49569 -80034
3657h0034j24876j3839J20003N5885O8691q42n3806q7032m5323p383N0826N073
$$ -80034 -204910 -218749 -98746 -42861 25830 24988 -28818 -115850 -161173 -168556 -117730 -112657
3645a12657L8735Q5018R8764l2511k8681m5761L9919R0206q0881p1930j02676
$$ -112657 -73922 11096 109860 77349 48668 2907 42826 133032 52151 -19779 -122455
3634a22455J4585J43873M6688J459o411p7918q3561j52234L421J07071J16265
$$ -122455 -107870 36003 82691 84150 77739 -179 -83740 -235974 -232553 -125482 -9217
3623i217R0056n4523J0505r0356j0885r4426m0046J65732J30790q161j11934K5361
$$ -9217 80839 26316 36821 -53535 -64420 -158846 -198892 -33160 97630 89469 -22465 2896
3611B896L0884j53189p4227O0546P1834m6068k9335j31332O2978R5021K888J11107
$$ 2896 33780 -119409 -193636 -133090 -61256 -107324 -136659 -267991 -205013 -109992 -107104 4003
3599D003O1774l7695j64117k578j5497m9509L5408k86j058L7708Q2620R1559n4268
$$ 4003 65777 28082 -136035 -138613 -154110 -203619 -168211 -168497 -169555 -131847 -49227 42332 -11936
3586a1936l3281K8042o0901o3181M4141M5360J2197j0569J7806j5101N1303K2277
$$ -11936 -45217 -17175 -78076 -141257 -97116 -51756 -39559 -50128 -32322 -47423 3880 26157
3574B6157n6779O6120k5948j25033J22583Q6315o5786j0553L740r6718j4856Q6008
$$ 26157 -30622 35498 9550 -115483 7100 93415 27629 17076 20816 -75902 -90758 -4750
3562d750J05231k3474j26812l6221j32829r9642J28457R3630J03427L6791O2808
$$ -4750 100481 77007 -49805 -86026 -218855 -318497 -190040 -96410 7017 43808 106616
3551A06616N0189k4049j08591j18021j40261P0161O9434N7443L3260j4441j15190
$$ 106616 156805 132756 24165 -93856 -234117 -163956 -94522 -37079 -3819 -18260 -133450
3540a33450k3655P4049J17950m4635m9557l259K2675R7773k7233R3028n9273q0660
$$ -133450 -157105 -83056 34894 -9741 -59298 -62557 -39882 57891 30658 123686 64413 -16247
3528a6247L529r8543j17862p857J20907j6515K1026P9607k8536j68214l6222O0099
$$ -16247 -12718 -111261 -229123 -236980 -116073 -132588 -111562 -31955 -60491 -228705 -264927 -204828
3516b04828K18109J04620k8069l1720r7925l8213M9665l0259p9415m4191O0607
$$ -204828 13281 117901 89832 58112 -39813 -78026 -28361 -58620 -138035 -182226 -121619
3505a21619n0169r5038Q6963O4557j02507O7731J23249L8382Q5734N700l4942
$$ -121619 -171788 -266826 -179863 -115306 -217813 -150082 -26833 11549 97283 102983 68041
3494F8041M9541m1811j0070o2370j9573r9081q7734j4541n6371O6178K9177l8683
$$ 68041 117582 75771 65701 3331 -16242 -115323 -203057 -217598 -273969 -207791 -178614 -217297
3482b17297J670j12189l7220J38926J08685M5880N0360p3438j13329m0316L7207
$$ -217297 -215627 -327816 -365036 -226110 -117425 -71545 -21185 -94623 -207952 -248268 -211061
3471b11061Q1341R198R6394L6331R862M4796n6701L9888r89N0180J03384q1759
$$ -211061 -129720 -120522 -24128 12203 22065 66861 10160 50048 49059 99239 202623 120864
3459A20864j17113j6026L5276r137p1062Q549k0797j3881J6669J24277m841q7488
$$ 120864 3751 -12275 23001 13864 -57198 -48649 -69446 -83327 -66658 57619 52778 -34710
3447c4710k133n7447j02703k1988K02532R753J17369J03032j30339q6471n3114
$$ -34710 -36843 -94290 -196993 -218981 -16449 -6696 110673 213705 83366 -3105 -56219
3436e6219M9287J06374p2587j22793N2794P0236N917J16937K2501j46543k34156
$$ -56219 -6932 99442 26855 -95938 -43144 27092 33009 149946 172447 25904 -208252
3425b08252m5314J52389Q0663m2463q9101n7877J62068q980L909N4744o3007p7475
$$ -208252 -253566 -101177 -20514 -62977 -152078 -209955 -47887 -56867 -52958 1786 -61221 -138696
3413a38696o5541J4415J8063K6040N212o894N1992m6352J637l1040J99087n0565
$$ -138696 -204237 -189822 -171759 -145719 -140507 -147401 -95409 -141761 -140124 -171164 27923 -22642
3401b2642j06489n824q7891j0196R3058J07058O6227O2782r4914l1300K21L4259
$$ -22642 -129131 -134955 -222846 -233042 -139984 -32926 33301 96083 1169 -30131 -29910 4349
3389D349l9130p6624n8053R0056J15948q666L5887J4767l7240l0013j033n8711
$$ 4349 -34781 -111405 -169458 -79402 36546 27880 63767 78534 41294 11281 10248 -48463
3377d8463Q2091R6476j8163r8942p310j19714j41576P2493J71491j4833q8623
$$ -48463 33628 130104 111941 12999 5689 -114025 -255601 -183108 -11617 -26450 -115073
3366a15073J05387O0068j1246j4817k7519l1300R5722j1270l9905L6344L2269
$$ -115073 -9686 50382 39136 24319 -3200 -34500 61222 49952 10047 46391 78660
3355G8660j15723n6608J11712j8518m5048m4855M4950n8712j41937L4079N18J12995
$$ 78660 -37063 -93671 18041 -477 -45525 -90380 -45430 -104142 -246079 -212000 -211482 -98487
3343i8487K7566q3814J34998k621k1345j11673j1426k6993K3515N1852N0520j34310
$$ -98487 -70921 -154735 -19737 -22358 -43703 -155376 -166802 -193795 -170280 -118428 -67908 -202218
3331b02218J10889P7876K266m6336j20453j6330K0279J5977R4247J07k4195l7323
$$ -202218 -91329 -13453 -11187 -57523 -177976 -194306 -174027 -158050 -63803 -63696 -87891 -125214
3319a25214O9177N8032k4504K1108J11564j37278m3843P4266L0669k0634j45594
$$ -125214 -56037 1995 -22509 -1401 110163 -27115 -70958 3308 33977 13343 -132251
3308a32251K2958J34835l314O749j106N4906O8354j21317k28856K5747J15114
$$ -132251 -109293 25542 22228 28977 27871 82777 151131 29814 -199042 -173295 -58181
3297e8181R0538p032j5157p2156K5249K3579P1318O6606o0426j7922J124J06426
$$ -58181 32357 25325 10168 -61988 -36739 -13160 58158 124764 64338 46416 47540 153966
3285A53966k2799J4488Q9914m904n6857n8791n720J5470L1267K4998N1885k5902
$$ 153966 131167 145655 235569 230665 173808 115017 109297 124767 156034 181032 232917 207015
3273B07015j25051M3654L0369O2976n6098j9997r6455M9022N9460j673q3591p2712
$$ 207015 81964 125618 155987 218963 162865 142868 46413 95435 154895 153222 69631 -3081
3261c081N0968o5125o4594L6843J36263K2098k7714m5413j00540p6054K6485P9175
$$ -3081 47887 -17238 -81832 -44989 91274 113372 85658 40245 -60295 -136349 -109864 -30689
3249c0689j01217l5345M0444J05144J3425M7072J80966K7785J0790r7894K2368
$$ -30689 -131906 -167251 -126807 -21663 -8238 38834 219800 247585 258375 160481 182849
3238A82849l2364q0300j36045j84180J58316L1940q5245k0533K4604K0634P6034
$$ 182849 150485 70185 -65860 -250040 -91724 -59784 -145029 -165562 -140958 -120324 -44290
3227d4290J0354k644p6515l855l4200P594J16984p4370J01419J33250l2575l3797
$$ -44290 -33936 -36580 -113095 -116950 -151150 -143556 -26572 -100942 477 133727 101152 67355
3215F7355J0129O7472l8638j12894l6647J386N1360J03586p1603p9682L2735M0022
$$ 67355 77484 144956 106318 -6576 -43223 -41837 9523 113109 41506 -38176 -5441 34581
3203C4581k4832M9502l4670O141Q9437q2079j20435p8091Q879M9782M4486L9625
$$ 34581 9749 59251 24581 30722 120159 38080 -82355 -160446 -151567 -101785 -57299 -17674
3191a7674J34325J58558L1050m8416l6938j08310p8882l3654Q7354L9361M8725
$$ -17674 116651 275209 306259 257843 220905 112595 33713 59 87413 126774 175499
3180A75499K4024K0524j96470j30638L0543j357n0651p462J78373k5579O3133
$$ 175499 199523 220047 23577 -107061 -76518 -77875 -128526 -135988 42385 16806 79939
3169G9939R709r3101j37605p3882L9038P1529O9421P5326j24536r7713J12537
$$ 79939 89648 -3453 -141058 -214940 -175902 -104373 -34952 40374 -84162 -181875 -69338
3158f9338J27366K937l52n705l3045r0903l6908M1853j1426l7254R7287R3912
$$ -69338 58028 60965 60613 54908 21863 -69040 -105948 -64095 -75521 -112775 -15488 78424
3146G8424l366j03538Q615o8914K3844P7116k564k6018j7026M9378M3848L3695
$$ 78424 75058 -28480 -19865 -88779 -64935 12181 9617 -16401 -33427 15951 59799 93494
3134I3494k9643j13343j2579K6388J5251O6221L9443p9730o8369O25o6927O710
$$ 93494 63851 -49492 -62071 -35683 -20432 45789 85232 5502 -62867 -62242 -129169 -122459
3122a22459Q2849N6831K0504n3983L710p3158K8937k9653L5453n2457j06619Q2979
$$ -122459 -39610 17221 37725 -16258 -12548 -85706 -56769 -86422 -50969 -103426 -210045 -127066
3110a27066O8559m0077n1905J17426J56701n7976M2751O3424l4551n7169n4616
$$ -127066 -58507 -98584 -150489 -33063 123638 65662 108413 171837 137286 80117 25501
3099B5501n3568J08512K6724p4640O4239p7123J00244N6206j9851j08298O1447
$$ 25501 -28067 80445 107169 32529 96768 19645 119889 176095 156244 47946 109393
3088A09393J30525K7102j8250r4988j37237n1525J3503p8537j2043J17724K1399
$$ 109393 239918 267020 248770 153782 16545 -34980 -21477 -100014 -112057 5667 27066
3077B7066O5000L7293j30668r2787q1560R1459J00676P2877n9895q8519q9616
$$ 27066 92066 129359 -1309 -94096 -175656 -84197 16479 89356 29461 -59058 -148674
3066a48674m024J76169P3221p5751m2744j20210N1369J47848j4339n230r0595
$$ -148674 -152698 23471 96692 20941 -21803 -142013 -90644 57204 42865 37635 -52960
3055e2960m5336m0869l0228Q565L9496Q3913L3765P5926j6600j12144J1695J14859
$$ -52960 -98296 -139165 -169393 -160828 -121332 -37419 -3654 72272 55672 -56472 -44777 70082
3043G0082k0875r8708j7592k8999j5238K8278N5370k6656j9493J2317q9381P5062
$$ 70082 49207 -49501 -67093 -96092 -111330 -83052 -27682 -54338 -73831 -61514 -150895 -75833
3031g5833J19588O1214m3128j0741m6946m6787O3473N9607o791N6409K7738l7053
$$ -75833 43755 104969 61841 51100 4154 -42633 20840 80447 73656 130065 157803 120750
3019A20750J4519M3332K6884j4532j35080k01503N7924L2514j12249K6281J13450
$$ 120750 135269 178601 205485 190953 55873 -145630 -87706 -55192 -167441 -141160 -27710
3008b7710K8775J8597J18959P5696j56822k17210j6413P2995J15589M7797j07581
$$ -27710 1065 19662 138621 214317 57495 -159715 -176128 -103133 12456 60253 -47328
2997d7328k6824J04468L5912K9624m0320j9579j3109o8578q2909J1986J06345
$$ -47328 -74152 30316 66228 95852 55532 35953 22844 -45734 -128643 -116657 -10312
2986a0312n1974o1177Q962m9872p147q986k5128N3663P9069j5510j3694n7185
$$ -10312 -62286 -123463 -114501 -164373 -171520 -180506 -205634 -151971 -72902 -88412 -102106 -159291
2974a59291L9696O278j16181l8656J11434K00564K3023o7593l5443j2013q1338
$$ -159291 -119595 -113317 -229498 -268154 -156720 43844 66867 -726 -36169 -48182 -129520
$$ [...]
##END NTUPLES=NMR SPECTRUM
##END=
