##TITLE=Analysis number 325815
Compound Code mo 01288
Project Code adrs
Chemist Name aci
##JCAMPDX= 6.0         $$ Bruker NMR JCAMP-DX V2.0
##DATA TYPE= NMR SPECTRUM
##DATA CLASS= NTUPLES
##ORIGIN= Bruker BioSpin GmbH
##OWNER= nmr
$$ XWIN-NMR		Version 3.5
$$ Mon Jan 15 15:12:09 2007 GMT Standard Time (UT+0h)  MAYBRIDGE\nmr@NMR_250MHZ
##.OBSERVE FREQUENCY= 250.131544655141
##.OBSERVE NUCLEUS= ^1H
##.ACQUISITION MODE= SIMULTANEOUS (DQD)
##.ACQUISITION SCHEME= undefined
##.AVERAGES= 16
##.DIGITISER RES= 18
##SPECTROMETER/DATA SYSTEM= dpx250
##.PULSE SEQUENCE= zg30
##.SOLVENT NAME= DMSO
##.SHIFT REFERENCE= (INTERNAL, DMSO, 0, 16.522)
##AUDIT TRAIL= $$ (NUMBER, WHEN, WHO, WHERE, WHAT)
$$ ##TITLE= Audit trail, XWIN-NMR		Version 3.5
$$ ##JCAMPDX= 5.01
$$ ##ORIGIN= Bruker BioSpin GmbH
$$ ##OWNER= nmr
$$ C:\u/data/dgb/nmr/ADRS/1090/pdata/1/auditp.txt
$$ ##AUDIT TRAIL=  $$ (NUMBER, WHEN, WHO, WHERE, WHAT)
(   1,<2007-01-15 15:11:50.11 +000>,<MAYBRIDGE\nmr>,<NMR_250MHZ>,
      <created by zg, POWCHK disabled, PULCHK disabled
       configuration hash MD5:
       49 4B E0 1D 92 C2 6B 37 9F E6 65 BC 52 41 86 1D
       data hash MD5: 64K
       69 AF F4 2B 6B 04 C1 B5 FA 14 77 FF C8 19 3E B5>)
(   2,<2007-01-15 15:12:01.25 +000>,<MAYBRIDGE\nmr>,<NMR_250MHZ>,
      <Start of raw data processing
       ef LB = 0.3 FT_mod = 6 PKNL = 1 SI = 32K 
       data hash MD5: 32K
       CA 4A 55 6C 9D E4 34 A4 AB 4B 5E 72 B2 73 81 72>)
(   3,<2007-01-15 15:12:02.81 +000>,<MAYBRIDGE\nmr>,<NMR_250MHZ>,
      <apk 
       data hash MD5: 32K
       86 A4 98 B9 33 61 1B 72 E3 56 2B F1 25 9E 8E 50>)
(   4,<2007-01-15 15:12:03.58 +000>,<MAYBRIDGE\nmr>,<NMR_250MHZ>,
      <abs ABSG = 5 
       data hash MD5: 32K
       2F B7 29 90 AF 41 56 5E EC C7 09 72 2B D2 5E C5>)
$$ ##END=
$$ 
$$ hash MD5
$$ 2C 70 AE 94 A9 1F FB 7F 2D 66 19 87 AB 76 4B D1
##$RELAX= 
##$RELAX= 
##$RELAX= 
##$RELAX= 
##$RELAX= 
##$RELAX= 
##$RELAX= 
$$ Bruker specific parameters
$$ --------------------------
##$DU= <C:\u>
##$EXPNO= 1090
##$NAME= <ADRS>
##$PROCNO= 1
##$TYPE= <nmr>
##$USER= <dgb>
##$AMP= (0..31)
100 100 100 100 100 100 100 100 100 100 100 100 100 100 100 100 100 100 
100 100 100 100 100 100 100 100 100 100 100 100 100 100 
##$AQSEQ= 0
##$AQ_mod= 3
##$AUNM= <au_zg>
##$AUTOPOS= <39 >
##$BF1= 250.13
##$BF2= 250.13
##$BF3= 250.13
##$BF4= 250.13
##$BF5= 500.13
##$BF6= 500.13
##$BF7= 500.13
##$BF8= 500.13
##$BYTORDA= 1
##$CFDGTYP= 0
##$CFRGTYP= 5
##$CHEMSTR= <none>
##$CNST= (0..31)
1 1 145 1 1 1 1 1 1 1 1 1 1 1 1 1 1 1 1 1 1 1 1 1 1 1 1 1 1 1 1 1 
##$CPDPRG= <>
##$CPDPRG1= <>
##$CPDPRG2= <>
##$CPDPRG3= <>
##$CPDPRG4= <mlev>
##$CPDPRG5= <mlev>
##$CPDPRG6= <mlev>
##$CPDPRG7= <mlev>
##$CPDPRG8= <mlev>
##$CPDPRGB= <>
##$CPDPRGT= <>
##$D= (0..31)
0 1 0 0 0 0 0 0 0 0.06 0 0 0 0 0 0 0.0002 0 0 0 0 0 0 0 0 0 0 0 0 0 0 
0 
##$DATE= 1168873909
##$DBL= (0..7)
120 120 120 120 120 120 120 120 
##$DBP= (0..7)
150 150 150 150 150 150 150 150 
##$DBP07= 0
##$DBPNAM0= <>
##$DBPNAM1= <>
##$DBPNAM2= <>
##$DBPNAM3= <>
$$ [...]
##$SUBNAM7= <"">
##$SUBNAM8= <"">
##$SUBNAM9= <"">
##$SW= 20.6930455092707
##$SWIBOX= (0..15)
0 0 3 0 0 0 0 0 0 0 0 0 0 0 0 0 
##$SW_h= 5175.983436853
##$TD= 65536
##$TD0= 1
##$TE= 294.16
##$TE2= 300
##$TE3= 300
##$TEG= 300
##$TL= (0..7)
0 120 120 120 120 120 120 120 
##$TP= (0..7)
150 150 150 150 150 150 150 150 
##$TP07= 0
##$TPNAME0= <>
##$TPNAME1= <>
##$TPNAME2= <>
##$TPNAME3= <>
##$TPNAME4= <>
##$TPNAME5= <>
##$TPNAME6= <>
##$TPNAME7= <>
##$TPOAL= (0..7)
0.5 0.5 0.5 0.5 0.5 0.5 0.5 0.5 
##$TPOFFS= (0..7)
0 0 0 0 0 0 0 0 
##$TUNHIN= 0
##$TUNHOUT= 0
##$TUNXOUT= 0
##$USERA1= <user>
##$USERA2= <user>
##$USERA3= <user>
##$USERA4= <user>
##$USERA5= <user>
##$V9= 5
##$VALIST= <valist>
##$VCLIST= <CCCCCCCCCCCCCCC>
##$VD= 0
##$VDLIST= <DDDDDDDDDDDDDDD>
##$VPLIST= <PPPPPPPPPPPPPPP>
##$VTLIST= <TTTTTTTTTTTTTTT>
##$WBST= 1024
##$WBSW= 4
##$XGAIN= (0..3)
0 0 0 0 
##$XL= 0
##$YL= 0
##$YMAX_a= 346150
##$YMIN_a= -434925
##$ZGOPTNS= <>
##$ZL1= 120
##$ZL2= 120
##$ZL3= 120
##$ZL4= 120
##$ABSF1= 16.522
##$ABSF2= -4.171173
##$ABSG= 5
##$ABSL= 3
##$ALPHA= 0
##$AQORDER= 0
##$ASSFAC= 0
##$ASSFACI= 0
##$ASSFACX= 0
##$ASSWID= 0
##$AUNMP= <proc_1d>
##$AZFE= 0.1
##$AZFW= 0.1
##$BCFW= 0
##$BC_mod= 0
##$BYTORDP= 0
##$COROFFS= 0
##$CY= 12.5
##$DATMOD= 1
##$DC= 0
##$DFILT= <>
##$DTYPP= 0
##$F1P= 14.0000005364418
##$F2P= -0.99999901652339
##$FCOR= 0.5
##$FTSIZE= 32768
##$FT_mod= 6
##$GAMMA= 0
##$GB= 0
##$INTBC= 1
##$INTSCL= 1
##$ISEN= 128
##$LB= 0.3
##$LEV0= 0
##$LPBIN= 0
##$MAXI= 10000
##$MC2= 0
##$MEAN= 0
##$ME_mod= 0
##$MI= 0
##$NCOEF= 0
##$NC_proc= -4
##$NLEV= 6
##$NOISF1= 0
##$NOISF2= 0
##$NSP= 0
##$NTH_PI= 0
##$NZP= 0
##$OFFSET= 16.522
##$PC= 1
##$PHC0= 216.6439
##$PHC1= 6.878106
##$PH_mod= 1
##$PKNL= yes
##$PPARMOD= 0
##$PSCAL= 4
##$PSIGN= 0
##$REVERSE= no
##$SF= 250.13
##$SI= 32768
##$SIGF1= 0
##$SIGF2= 0
##$SINO= 400
##$SIOLD= 32768
##$SREGLST= <1H.DMSO>
##$SSB= 0
##$STSI= 32768
##$STSR= 0
##$SW_p= 5175.98343685301
##$SYMM= 0
##$S_DEV= 0
##$TDeff= 65536
##$TDoff= 0
##$TI= <Analysis number 999999
Compound Code 99
Book Reference 9
Project Code 9>
##$TILT= no
##$TM1= 0
##$TM2= 0
##$TOPLEV= 0
##$USERP1= <user>
##$USERP2= <user>
##$USERP3= <user>
##$USERP4= <user>
##$USERP5= <user>
##$WDW= 1
##$XDIM= 32768
##$YMAX_p= 336287435
##$YMIN_p= -354071
$$ End of Bruker specific parameters
$$ ---------------------------------
##NTUPLES= NMR SPECTRUM
##VAR_NAME=  FREQUENCY,     SPECTRUM/REAL,   SPECTRUM/IMAG
##SYMBOL=    X,             R,               I
##VAR_TYPE=  INDEPENDENT,   DEPENDENT,       DEPENDENT
##VAR_FORM=  AFFN,          ASDF,            ASDF
##VAR_DIM=   32768,         32768,           32768
##UNITS=     HZ,            ARBITRARY UNITS, ARBITRARY UNITS
##FACTOR=    0.157963299565203, 1,           1
##FIRST=     4132.6476996994, 0,             0
##LAST=      -1043.33573715361, 0,           0
##MIN=       -1043.33573715361, -354071,     0
##MAX=       4132.6476996994, 336287435,     0
$$ Real data points
##PAGE= N=1
##DATA TABLE= (X++(R..R)), XYDATA
$$ [...]
24968C4649l7241k7078j2678J516J8043J998M6273r875m895L9J2472J8648j350
$$ 34649 -2592 -29670 -42348 -40832 -22789 -20791 25482 15607 10712 10751 23223 41871 40521
24955D0521j4822l422j7510j5761J5137j2284k69K454R151K0038J2336l182m3488
$$ 40521 25699 22277 4767 -10994 4143 -8141 -8410 -5956 3195 23233 35569 32387 -11101
24942a1101n742M1221M937k6862j3948J9753K6302j2809k7886k2946K0106L9927
$$ -11101 -16843 24378 29315 2453 -11495 8258 34560 21751 -6135 -29081 -8975 30952
24930C0952P397m447j8065k3024k6783k333J6160P102K8228J2695M600J413j6512
$$ 30952 38349 33902 15837 -7187 -33970 -36303 -20143 -13041 15187 27882 32482 33895 17383
24917A7383m0789K106l2138O159L9304K9734m504j5956J7149Q36k4543l0826J9216
$$ 17383 -23406 -21300 -53438 -47279 -7975 21759 17255 1299 18448 19284 -5259 -36085 -16869
24904a6869P277O201M490j551l305N979K0414J436l1566j7005m878J5530J4597
$$ -16869 -9592 -3391 1099 -452 -3757 2222 22636 24072 -7494 -24499 -29377 -13847 750
24891G50j0211k0630n218J4703J9906q418R393J9755O478l6416M434K748j5377
$$ 750 -9461 -30091 -35309 -20606 -700 -9118 275 20030 26508 -9908 -5474 -2726 -18103
24878a8103k441j306j3407J5799K4470j8470K8212L296j1311l1245j6699P296
$$ -18103 -20544 -21850 -35257 -19458 5012 -13458 14754 18050 6739 -24506 -41205 -33909
24866c3909L7211K329j3331k3418P756J1630q576J9221R600J5322j130j7113k2252
$$ -33909 3302 5631 -7700 -31118 -23362 -11732 -20308 -1087 8513 23835 22705 5592 -16660
24853a6660p963K0568j6927R44K9519J9777n159j5219m1761j8985j0239R580J3246
$$ -16660 -24623 -4055 -20982 -20038 9481 29258 24099 8880 -32881 -51866 -62105 -52525 -39279
24840c9279J3521J0210K168l322L802J4275l814J3727l9066k3064k98Q012L3639
$$ -39279 -25758 -15548 -13380 -16702 -12900 1375 -2439 11288 -27778 -50842 -51140 -43128 -9489
24827i489L2180L3271k3955j7572K8316N999n9227n6741K1962J4657j6545R806
$$ -9489 22691 55962 32007 14435 42751 48750 -10477 -67218 -45256 -30599 -47144 -37338
24815c7338J7000P198J535n437j5651J535N926L764J0786L9135J5871q564j6882
$$ -37338 -20338 -13140 -11605 -17042 -32693 -31158 -25232 -21468 -10682 28453 44324 35760 18878
24802A8878j8266k0289L948k1093r002k550J7761R904k0749o66J3340N623L0181
$$ 18878 612 -19677 -15729 -36822 -45824 -48374 -30613 -20709 -41458 -42124 -28784 -23161 7020
24789G020j2612k7311K106p788K6894K36R790K2901O666l266j7668k235J7685
$$ 7020 -5592 -32903 -30797 -38585 -11691 -11455 -1665 21236 27902 24636 6968 4733 22418
24776B2418k2979q444k0814j2464K8438K8298K369j7856j5610m456J3583k7327
$$ 22418 -561 -9005 -29819 -42283 -13845 14453 16822 -1034 -16644 -21100 -7517 -34844
24764c4844k4642k8885j940M6385L1509m510j5115J8800J8373R977m659j4692
$$ -34844 -59486 -88371 -90311 -43926 -12417 -16927 -32042 -13242 5131 15108 10449 -4243
24752d243K0292j3682k1720k7155J0373J8839r6o210K1314j575R910Q855K2286
$$ -4243 16049 2367 -19353 -46508 -36135 -17296 -17392 -23602 -2288 -3863 6047 14902 37188
24739C7188j1442j0725J4484j6660j6808r038k7229K29L7102J8882j0509j6153
$$ 37188 25746 15021 29505 12845 -3963 -13001 -40230 -40001 -2899 15983 5474 -10679
24727a0679m450Q846K562P697K0841K4256m654m5735k5481R156j8767K5025o845
$$ -10679 -15129 -6283 -3721 3976 24817 49073 44419 -1316 -26797 -17641 -36408 -11383 -18228
24714a8228k2686k1556J107J5824K5639J6735k3924N480J0290J866J6689R388
$$ -18228 -40914 -62470 -61363 -45539 -19900 -3165 -27089 -21609 -11319 -9453 7236 16624
24702A6624J1072j0445l2569P195R154k6262K509R801M364p689l8863L34J2150
$$ 16624 27696 17251 -15318 -8123 1031 -25231 -22722 -12921 -8557 -16246 -55109 -54775 -42625
24689d2625J9397j748J8122L6598J3162j0995o572j0524J4475j187J453K916J356
$$ -42625 -23228 -24976 -6854 29744 42906 31911 25339 14815 29290 28103 29556 32472 33828
24676C3828m156n998J9767k4650k7789M235P776L2850K1465r122q462o610j2133
$$ 33828 29672 23674 43441 18791 -8998 -4763 3013 35863 57328 48206 39744 33134 21001
24663B1001j9962O807j1227k1056J4219K6133J2287k5343k867Q194J697j0602
$$ 21001 1039 7846 -3381 -24437 -10218 15915 28202 2859 -8 8186 9883 -719
24651g19o214r177J6869J3758R616J8108k8579l658k1947k0965J2924K2403O71
$$ -719 -6933 -16110 759 14517 24133 42241 13662 10004 -11943 -32908 -19984 2419 3090
24638C090p036J4689J1860Q909m896l3727j4180R462M31j984J033k9552k97K7849
$$ 3090 -3946 10743 22603 31512 26616 -7111 -21291 -11829 -11398 -13382 -12349 -41901 -42198 -14349
24624a4349O499o317J1226L977n879Q365k3771j4590O332m014J4363J9256l136
$$ -14349 -7850 -14167 -2941 1036 -4843 3522 -20249 -34839 -28507 -32521 -18158 1098 -2038
24611b038m191J4663K1674M062j0871r624j3595k1101k5034J6370J6176p914q409
$$ -2038 -6229 8434 30108 34170 23299 13675 80 -21021 -46055 -29685 -13509 -21423 -29832
24598b9832J0927J566k28K1142o248j7631P664o217m572K4849J531J703K2183
$$ -29832 -18905 -17339 -17567 3575 -2673 -20304 -12640 -18857 -23429 1420 2951 4654 26837
24585B6837M861l1298j3753k658P673R233n298k0621l7073J6153K6393K767j084
$$ 26837 31698 400 -13353 -16011 -8338 895 -4403 -25024 -62097 -45944 -19551 -16784 -17868
24572a7868l4974j5162K3572K4372J1972j9266l330Q795K8950j3738j0971p082
$$ -17868 -52842 -68004 -44432 -20060 -8088 -27354 -30684 -21889 7061 -6677 -17648 -24730
24560b4730L070L0897k3222O306J9490r974N013r007j5035n537J6151J9690K654
$$ -24730 -21660 9237 -13985 -7679 11811 1837 6850 -2157 -17192 -22729 -6578 13112 15766
24547A5766J7525M563Q293j8154j0603k7600j3816L048J3222R689p298Q040j258
$$ 15766 33291 37854 46147 27993 17390 -10210 -24026 -20978 -7756 1933 -5365 2675 1417
24534A417k7647j9051R095L8009M3158J8828l0212l1173j3977r133J108J1323
$$ 1417 -26230 -45281 -36186 1823 44981 63809 33597 2424 -11553 -20686 -19578 -8255
24522h255P876K4273J7294l7343l7966k6452j7730J4853J5455Q00J4357K1807
$$ -8255 -379 23894 41188 3845 -34121 -60573 -78303 -63450 -47995 -47195 -32838 -11031
24510a1031k0516j8054O379m953J642J7315J5085j5425j0233J4028J6148J0881
$$ -11031 -31547 -49601 -43222 -48175 -46533 -29218 -14133 -29558 -39791 -25763 -9615 1266
24498A266l265j4288l858J9529P120J2147j910k0463j040n233M375R472j8006
$$ 1266 -1999 -16287 -20145 -616 6504 18651 16741 -3722 -4762 -9995 -5620 3852 -14154
24485a4154l633o915j9775N573o499L5072j8014K695J4112P321Q516N581O09L2203
$$ -14154 -17787 -24702 -44477 -38904 -45403 -10331 -28345 -25650 -11538 -4217 4299 9880 10489 42692
24471D2692j1189J6233p819j3046j637n253j4350j4050k4888j712k401K0172J0911
$$ 42692 31503 47736 39917 26871 25234 19981 5631 -8419 -33307 -35019 -37420 -17248 -6337
24458f337P714K4738k808J0749j5457j7662J5110j5142k9378n019K0501J9851
$$ -6337 1377 26115 23307 34056 18599 937 16047 905 -28473 -33492 -12991 6860
24446F860J6237l181o111j0323j0089l679k2643K5432K8071n505J0790M907l2907
$$ 6860 23097 19916 13805 3482 -6607 -10286 -32929 -7497 20574 15069 25859 30766 -2141
24433b141m505j0250M299J4336o845n229k5507J4501j3517j1602K5110J2884m606
$$ -2141 -6646 -16896 -12597 1739 -5106 -10335 -35842 -21341 -34858 -46460 -21350 -8466 -13072
24420a3072n76O53j1140J1402J1366K871n669K7206r936j7562m017K2001J2253
$$ -13072 -13648 -12995 -24135 -12733 -1367 1504 -4165 23041 13105 -4457 -8474 13527 25780
24407B5780l1739j6490J2692K144j071J3771K2894j149k2942k8723l5809P645
$$ 25780 -5959 -22449 -9757 -7613 -8684 5087 27981 26832 3890 -24833 -60642 -52997
24395e2997M5584J5264l597k302Q736J2976l721j3512M607Q60k1935j0264R62
$$ -52997 -7413 7851 4254 1952 10688 23664 19943 6431 11038 11898 -10037 -20301 -19339
24382a9339L0678J59m490j7495j8943n505O13K9431K3913m250q867L6400j0913
$$ -19339 11339 11498 7008 -10487 -29430 -34935 -34322 -4891 19022 14772 5905 42305 31392
24369C1392l9348r297O331j3305R28J5752j9784Q030M8026Q542j7281j7066N991
$$ 31392 -7956 -17253 -10922 -24227 -23299 -7547 -27331 -19301 28725 37267 19986 2920 8911
24356H911k1741k2412J6437Q47K0278o430j6667J0465J5546k873l6010j4699n97
$$ 8911 -12830 -35242 -18805 -17958 2320 -4110 -20777 -10312 5234 2361 -33649 -48348 -48945
24343d8945M1973j3130q486K4627L3904o298j0013k0759m2113l858L680J1490
$$ -48945 -6972 -20102 -28588 -3961 29943 23645 13632 -7127 -49240 -53098 -49418 -37928
24331c7928J3194J8432K6051q299J7376m8181k7389J5005J5376k4784j1543o42
$$ -37928 -24734 -6302 19749 11450 28826 -19355 -46744 -31739 -16363 -41147 -52690 -53332
24319e3332J0827L238O834r028P03K4742j172j2009P701P456n856j3557J8751
$$ -53332 -42505 -39267 -32433 -41461 -40758 -16016 -17188 -29197 -21496 -14040 -19896 -33453 -14702
24306a4702J897J2317j9733P684J7175r226l5056o032R335J6218O646l9131k9711
$$ -14702 -12805 -488 -20221 -12537 4638 -4588 -39644 -45676 -36341 -20123 -13477 -52608 -82319
24293h2319J615K3509Q501J0633J2163J0610j5832j8188J57L9570K1813J658j8665
$$ -82319 -80704 -57195 -48694 -38061 -25898 -15288 -31120 -49308 -49151 -9581 12232 13890 -4775
24280d775j9214J8009J8817L036l63R333M703J5475k4789k6870Q668Q816R765
$$ -4775 -23989 -5980 12837 15873 15510 24843 29546 45021 20232 -6638 2030 10846 20611
24267B0611o130j3805j5291n694J1384J2456j451l1441k7318K1946J6616j9721
$$ 20611 14481 676 -14615 -20309 -8925 3531 2080 -29361 -56679 -34733 -18117 -37838
24255c7838J1213Q107J6667R309n996k694K0192J0039j0164j5197j0751m38J6873
$$ -37838 -26625 -18518 -1851 7458 1462 -1232 18960 28999 18835 3638 -7113 -7551 9322
24242I322j2874q892J5833J2205J8776J3813j7609l740j3991j2108L214n993r223
$$ 9322 -3552 -12444 3389 15594 34370 48183 30574 26834 12843 735 3949 -2044 -11267
24229a1267n036k4652Q796L0201J599n370J3185q99k5897N34J5050M625K5635
$$ -11267 -16303 -40955 -32159 -1958 -359 -5729 7456 6557 -19340 -18806 -3756 869 26504
24216B6504J2894k4804k8725n24k803M908m477l4627j7389K1277K9601K8308L1680
$$ 26504 39398 14594 -14131 -14655 -17458 -12550 -17027 -51654 -69043 -47766 -18165 10143 41823
24203D1823j0086j3717J1334M137j9186M693J3272n144j8877J5375K0772j0849
$$ 41823 31737 18020 29354 33491 14305 18998 32270 27126 8249 23624 44396 33547
24191C3547m0822m986K3187n806j6394q853k041l698J4984L2323p574j2860R048
$$ 33547 -7275 -12261 10926 5120 -11274 -20127 -22168 -25866 -10882 21441 13867 1007 10055
24178A0055n648k6900J6923K2479j5569j9563J9640J7351j339q896j0106K39l417
$$ 10055 4407 -22493 -5570 16909 1340 -18223 1417 18768 17429 8533 -1573 -1334 -4751
24165d751m739j1669O248N959q646J0274K3591n914l3596P712j0326r853M7151
$$ -4751 -9490 -21159 -14911 -8952 -17598 -7324 16267 10353 -23243 -15531 -25857 -35710 11441
24152A1441L6440j1208j3080J6652J3384J1779j8884j8850j3466k333R029k270
$$ 11441 47881 36673 23593 40245 53629 65408 46524 27674 14208 11875 20904 18634
24140A8634M364q976K308j5013q68M847n629j9311j1600K3068J1916K290L396
$$ 18634 22998 14022 16330 1317 449 5296 -333 -19644 -31244 -8176 3740 6030 9426
24127I426N219K027m21j6133j7805J8519K7634K9847l3057m9370J5475K0260p922
$$ 9426 14645 16672 16251 118 -17687 832 28466 58313 25256 -24114 -8639 11621 3699
24114C699k0924k9019J691m028M0719J340j9850k0024j5638M372J0434j5810J2305
$$ 3699 -17225 -46244 -44553 -48581 -7862 -6522 -26372 -46396 -62034 -57662 -47228 -63038 -50733
24101e0733j024k0301n265K1238j2644k345J2866m190L3155J5583m07J4399J2604
$$ -50733 -51757 -72058 -77323 -56085 -68729 -71074 -58208 -62398 -29243 -13660 -14067 332 12936
24088A2936l858p700j8260M258L2295p262Q656j79k375N538M725Q908k8395J46
$$ 12936 9078 1378 -16882 -12624 19671 12409 21065 20886 18511 24049 28774 37682 9287 9433
24074I433J0917j899k0770p626J3749J531j5800j0274J6951N569m598l529j3260
$$ 9433 20350 18451 -2319 -9945 3804 5335 -10465 -20739 -3788 1781 -2817 -6346 -19606
24061a9606m3137j6602M6692K1222P011J3993j4536L335J9185j029m491P863j5941
$$ -19606 -62743 -79345 -32653 -11431 -4420 9573 -4963 -1628 17557 16528 12037 19900 3959
24048C959j6227j3032J6161o803L2197L740m3325j33K0619K21o861n543r947j931
$$ 3959 -12268 -25300 -9139 -15942 16255 19995 -23330 -23463 -2844 -2623 -9484 -15027 -24974 -26905
24034b6905J4337k798K993j2093l270Q30J8484J6004j46r535j8855Q313l726K491
$$ -26905 -12568 -15366 -12373 -24466 -27736 -26906 -8422 7582 7436 -2099 -20954 -12641 -16367 -13876
24020a3876J3093J7254L417J8002o714r239k354l155L0941j8342j9865l2663j2510
$$ -13876 -783 16471 19888 37890 31176 21937 19583 16428 47369 29027 9162 -23501 -36011
24007c6011k050L6504K1654J6088p900k2773L016j1369k3949m160k598j724p83
$$ -36011 -38061 -1557 20097 36185 28285 5512 8528 -2841 -26790 -30950 -33548 -35272 -36055
23994c6055J8427J7693m16j09J8222o334N891J8693m471j7731l830J7394M827
$$ -36055 -17628 65 -351 -460 17762 11428 17319 36012 31541 13810 9980 27374 32201
23981C2201K095p804o078k1009P14J8481m834K587l123K226k0969l4542Q826J8641
$$ 32201 34296 26492 20414 -595 119 18600 13766 16353 13230 15456 -5513 -40055 -31229 -12588
23967a2588o286M414K9512p060O293j334l0996j2060P90J9770p40n940p472O278
$$ -12588 -18874 -14460 15052 7992 14285 12951 -18045 -30105 -29315 -9545 -10285 -16225 -23697 -17419
23953a7419J5238K1715J9k4055l560m4371K876M2995J7302J0451p965l2083K816
$$ -17419 -2181 19534 19553 -4502 -8062 -52433 -49557 -6562 10740 21191 13226 -18857 -16041
23940a6041J3087L4666M284O035O141l2643q620N478k0247j3055n350J7410J2793
$$ -16041 -2954 31712 35996 42031 48172 15529 6909 12387 -7860 -20915 -26265 -8855 3938
23927C938L993J2758M551J9584j5208j7731J8133L789k5308j2605J5562N258J1885
$$ 3938 7931 20689 25240 44824 29616 11885 30018 33807 8499 -4106 11456 16714 28599
23914B8599p333k0637o183m881M379j4948j0933L100J3491m312p35k2031k0494
$$ 28599 21266 629 -5554 -10435 -6056 -21004 -31937 -28837 -15346 -19658 -20393 -42424 -62918
23901f2918J9817J4873K1234j6293j4269J5828o965K063o158O229K2383K2661
$$ -62918 -43101 -28228 -6994 -23287 -37556 -21728 -28693 -26630 -32788 -26559 -4176 18485
23889A8485J0320o175j6983l737j2356O67J1615K449j0242j8382m28J0516j2908
$$ 18485 28805 22630 5647 1910 -10446 -9779 1836 4285 -5957 -24339 -24767 -14251 -27159
23876b7159m746K0383J664J4609k552l831j7013O462o956j1568L226K3362p396
$$ -27159 -31905 -11522 -9858 4751 2199 -1632 -18645 -12183 -19139 -30707 -27481 -4119 -11515
23863a1515q039P052J084J4611p200N59J84J24P455l4366O849P501Q068K2736
$$ -11515 -19554 -12502 -11418 3193 -4007 -3448 -3264 -3140 4315 -30051 -23202 -15701 -7633 15103
23849A5103k0997j7315J9319K0120k0477p189r709K7428J3626O269j6138j7991
$$ 15103 -5894 -23209 -3890 16230 -4247 -11436 -21145 6283 19909 26178 10040 -7951
23837g951O279j5476j0813J5362q65k0609L972K1023J3360J8678N404j3433J0065
$$ -7951 -1672 -17148 -27961 -12599 -13464 -34073 -30101 -9078 4282 22960 28364 14931 24996
23824B4996Q610k6074j7317K0851R343j0221l6270l5299J7212P722P01K008J8688
$$ 24996 33606 7532 -9785 11066 20409 10188 -26082 -61381 -44169 -36447 -35746 -33738 -15050
23811a5050L7159p798r021N219k0117j5016j3043k6433q357J6456J2291K4505
$$ -15050 22109 14311 5290 10509 -9608 -24624 -37667 -64100 -72457 -56001 -43710 -19205
23799a9205J6608K4115l722o920J93l9816m669k052R528j6282p38M186j4984o896
$$ -19205 -2597 21518 17796 10876 11069 -28747 -33416 -35468 -25940 -42222 -42960 -38774 -53758 -60654
23785f0654J9330K6114k060Q264K4426P136K0616N527l114k3053P883j4224j4305
$$ -60654 -41324 -15210 -17270 -9006 15420 22556 43172 48699 45585 22532 30415 16191 1886
23772A886K840J1119k9714j5622M220J9318O880m20K806q431j9989K0945P066
$$ 1886 4726 15845 -13869 -29491 -25271 -5953 927 507 3313 -5118 -25107 -4162 2904
23759B904K184j0350J6236J8694m70L874k3447n0806p815K3327J2336L8730K3508
$$ 2904 5088 -5262 10974 29668 29198 33072 9625 -41181 -48996 -25669 -13333 25397 48905
23746D8905j5198k8719q399M2310M8859l0544j4339k1783j2115m172k895J763
$$ 48905 33707 4988 -3411 38899 87758 57214 42875 21092 8977 4805 1910 3673
23734C673J1648j0171r214J4642m738k3398l647J6766q324q775O231L9309K0573
$$ 3673 15321 5150 -4064 10578 5840 -17558 -21205 -4439 -12763 -21538 -15307 24002 44575
23721D4575l857j5219k0577k0147k306j0963J0468K0593o61k5360j6167j8674
$$ 44575 40718 25499 4922 -15225 -17531 -28494 -18026 2567 1906 -23454 -39621 -58295
23709e8295R790j0593J3371J9756J9873j1441j4754j8428J8133J8900O329K0824
$$ -58295 -48505 -59098 -45727 -25971 -6098 -17539 -32293 -50721 -32588 -13688 -7359 13465
23697A3465J8843k6231k7560p98k072P29j3875l768Q673M362K99N494J555M685
$$ 13465 32308 6077 -21483 -22281 -24353 -23624 -37499 -41267 -32594 -28232 -27933 -22439 -20884 -16199
23683a6199j534L4963J0274k1121q76k7877j5347Q619J3190K1876J3504k1790
$$ -16199 -17733 17230 27504 6383 5507 -22370 -37717 -29098 -15908 5968 19472 -2318
23671b318K105J7582J8302L026L0391K099r139j2710n715L498j5070n775o408
$$ -2318 -213 17369 35671 38697 69088 71187 62048 49338 43623 47121 32051 26276 19868
23658A9868O177P367p835p670R667r517l1497l343k931l929p668L2855J7551L925
$$ 19868 26045 33412 25577 17907 27574 18057 -13440 -16783 -19714 -23643 -31311 1544 19095 23020
23644B3020j0640k4081L073J6805q344j6784L3379K3920j9878j1519j5920M298
$$ 23020 12380 -11701 -8628 8177 -167 -16951 16428 40348 20470 8951 -6969 -2671
23632b671r673n408R916m28J1283J9025l509j5746o544j5850j254r756J8943K3420
$$ -2671 -12344 -17752 -7836 -8264 3019 22044 18535 2789 -3755 -19605 -20859 -30615 -11672 11748
23618A1748r534l2888n80K8758P709k89l003K172j4592N684L5083k7791k0469
$$ 11748 2214 -30674 -31254 -2496 5213 4924 1921 4093 -10499 -4815 30268 2477 -17992
23605a7992J530l99K72K0717J6562M001L175r820k5304j1500K9462J825j3313
$$ -17992 -16462 -16861 -16589 4128 20690 24691 27866 18046 -7258 -18758 10704 12529 -784
23592g84J8994J3324J6875M82k514j8254j7781l2684J85j6415K7883P787m729
$$ -784 18210 31534 48409 48891 46377 28123 10342 -22342 -22157 -38572 -10689 -2902 -7631
23579g631l26L119j6849m765J580j2095J5370J7106J1568k0303k6554r713J4750
$$ -7631 -7957 -4838 -21687 -26452 -24872 -36967 -21597 -4491 7077 -13226 -39780 -49493 -34743
23566c4743m158N886K7440j3470J657K2120p694N632J7515r499j53K1566K2614
$$ -34743 -38901 -33015 -5575 -19045 -17388 4732 -2962 2670 20185 10686 10533 32099 54713
23553E4713j0581M38l4827J825r624l4185J812j418m231j41J4102L1573l225j5611
$$ 54713 44132 44570 9743 11568 1944 -32241 -30429 -31847 -36078 -36219 -22117 9456 6231 -9380
23539i380k170J5063P889k560N093k2393k429k997l063k659Q348Q385L6964J2038
$$ -9380 -11550 3513 11402 8842 13935 -8458 -10887 -13884 -16947 -19606 -11258 -2873 34091 46129
23525D6129k3941j1454M582O435J8661j4695k2149J6026p166j1148K5003P392
$$ 46129 22188 10734 15316 21751 40412 25717 3568 19594 12428 1280 26283 33675
23513C3675j9914l7552r100K0900N966N246K3559O831j8902j8911M184K6841l691
$$ 33675 13761 -23791 -32891 -11991 -6025 -779 22780 29611 10709 -8202 -4018 22823 19132
23500A9132l8603o618J0420j0211J7907K8991j624j539r006j96r291r256O58P999
$$ 19132 -19471 -26089 -15669 -25880 -7973 21018 19394 17855 8849 8653 -638 -9894 -9236 -1237
23486a237k022l7774l5459L286J8527L5201J3563m351n186Q619K4921l759k0748
$$ -1237 -3259 -41033 -76492 -73206 -54679 -19478 -5915 -10266 -15452 -6833 18088 14329 -6419
23473f419O321K0170o075n923q793J7392J9972r044p511j5258N922K899n57j2091
$$ -6419 -98 20072 13997 8074 -719 16673 36645 27601 20090 4832 10754 13653 13096 1005
23459A005j6243M487k018J6900J1690Q013n897J1919Q519p996k81R354n003m0154
$$ 1005 -15238 -10751 -12769 4131 15821 23834 17937 29856 38375 30379 30098 39452 34449 -5705
23445e705k4689P739k821M124q80l694q171j4188K545M309p273Q079J5616k325
$$ -5705 -30394 -22655 -25476 -21352 -22232 -25926 -34097 -48285 -45740 -41431 -48704 -40625 -25009 -27334
23431b7334J8200J0449J7783O716j3534l708j0817r518M10J8595K7966k054K3749
$$ -27334 -9134 1315 19098 25814 12280 8572 -2245 -11763 -11353 7242 35208 33154 56903
23418E6903j0658n2319k3054K2613k869L7753J8779j0689N285k1784m0550p782
$$ 56903 46245 -6074 -29128 -6515 -9384 28369 47148 36459 41744 19960 -20590 -28372
23406b8372l910J6096J0263l4162J3008L1376J223n215L6915j0318j3696J0987
$$ -28372 -32282 -16186 -5923 -40085 -27077 4299 5522 307 37222 26904 13208 24195
23394B4195J3332j2999N759j7823m3911o048L401K7345L806j3982j2986J0893
$$ 24195 37527 24528 30287 12464 -31447 -37495 -34094 -6749 -2943 -16925 -29911 -19018
23382a9018R487J1507J489n938j3715L308L2662J477k1122P547l5983j2336J5453
$$ -19018 -9531 1976 3465 -2473 -16188 -12880 19782 21259 137 7684 -28299 -40635 -25182
23369b5182j226j2135j5090P500K942J3407k1576M250N9322p13j606k832J6776
$$ -25182 -26408 -38543 -53633 -46133 -43191 -29784 -51360 -47110 12212 11499 9893 7061 23837
23356B3837j1062k8400J2772K3968r641L877k1188r104j9693k07K7494K4909M863
$$ 23837 12775 -15625 -2853 21115 11474 15351 -5837 -14941 -34634 -34841 -7347 17562 22425
23343B2425R091j1498j2306j0067j1016j5489j7K0251K7237K5759L529j8577j2803
$$ 22425 31516 20018 7712 -2355 -13371 -28860 -28877 -8626 18611 44370 47899 29322 16519
23330A6519J0484k0682j636j3251j5672O274L332j7450N304p739K0751Q137J4777
$$ 16519 27003 6321 4685 -8566 -24238 -17964 -14632 -32082 -26778 -34517 -13766 -5629 9148
23317I148J2950k348J8411k0233k4133J9775J6742j3355j305k7125k6273k85J235
$$ 9148 22098 19750 38161 17928 -6205 13570 30312 16957 15652 -11473 -37746 -38031 -36796
23304c6796j0932R948J9614J1021J3988M182P147L485j436N120j2669q886l662
$$ -36796 -47728 -37780 -18166 -7145 6843 11025 18172 21657 20221 25341 12672 3786 124
23291A24r132j6540K3514m421l4568K2923M1330J8612r207k7865K0192R495k6173
$$ 124 -9008 -25548 -2034 -6455 -41023 -18100 23230 41842 32635 4770 24962 34457 8284
23278H284m5625J7538j2743J2076J0997K4218j6938K3723L5349J3435l8982q663
$$ 8284 -37341 -19803 -32546 -20470 -9473 14745 -2193 21530 56879 70314 31332 22669
23266B2669r058k3466r474J7071K0319m797J1194P882j8271m4489J0729J3912
$$ 22669 13611 -9855 -19329 -2258 18061 13264 24458 32340 14069 -30420 -19691 -5779
23254e779p869k9259J7734J7441k7067j6059Q623K5420j779L3723J2625k8610
$$ -5779 -13648 -42907 -25173 -7732 -34799 -50858 -42235 -16815 -18594 15129 27754 -856
23242h56j6776j0142o526r751j9751L3887L5091K941r267l834J0734J1504L573
$$ -856 -17632 -27774 -34300 -44051 -63802 -29915 5176 8117 -1150 -4984 5750 17254 20827
23229B0827P417k4788J938p496o314l9k916J5502J1636M83j0162l606P69j3379
$$ 20827 28244 3456 5394 -2102 -8416 -8455 -11371 4131 15767 16250 6088 2482 3251 -10128
23215a0128q629J006J10K0506K2156j0780j9326N274J0972l1507l532L3164k0213
$$ -10128 -18757 -17751 -17641 2865 25021 14241 -5085 189 11161 -20346 -23878 9286 -10927
23202a0927m089K0991L629J2467N336j0160k079j5402o438j6608N294M386J769
$$ -10927 -15016 5975 9604 22071 27407 17247 15168 -234 -6672 -23280 -17986 -13600 -11831
23189a1831k356J0514J7357j6526j9653n037L98J3487K5550N465k9089l463J9566
$$ -11831 -14187 -3673 13684 -2842 -22495 -27532 -27134 -13647 11903 17368 -11721 -15184 4382
23176D382k3660j7811J0935n451l75N609L556n831J5726K5514m0092o016J5131
$$ 4382 -19278 -37089 -26154 -31605 -31980 -26371 -22815 -28646 -12920 12594 -27498 -33514 -18383
23163a8383K7250K6634J3106N541N222K906j1612J3136l0238l2208j3069Q952
$$ -18383 8867 35501 48607 54148 59370 62276 50664 63800 33562 1354 -11715 -2763
23151b763k613J0891m312j9172K463J175o219k2357K8783Q752P240l214J3305
$$ -2763 -5376 5515 1203 -17969 -15506 -14331 -20550 -42907 -14124 -5372 1868 -1346 11959
23138A1959K5257r382o272j0638P460N536j8629J1529J0494j1221k678K2378P059
$$ 11959 37216 27834 21562 10924 18384 23920 5291 16820 27314 16093 13415 35793 42852
23125D2852k3178J5893k1735J60n018J2241R761j1606L04J06m051j9501P409J0151
$$ 42852 19674 35567 13832 13992 8974 21215 30976 19370 19674 19780 15729 -3772 3637 13788
23111A3788J4257j820j3255q690J0713J8916M714k2237k0615N004N758j4657L818
$$ 13788 28045 26225 12970 4280 14993 33909 38623 16386 -4229 775 6533 -8124 -4306
23098d306L3741r73K144j9827l4745L596L330Q607J3662j732p39j5627k8824j2387
$$ -4306 29435 28462 30606 10779 -23966 -20370 -17040 -8433 5229 3497 2758 -12869 -41693 -54080
23084e4080L4222L006k7028R073Q664J8127J6954J1485J1060N250k4900p631k084
$$ -54080 -19858 -16852 -43880 -34807 -26143 -8016 8938 20423 31483 36733 11833 4202 2118
23071B118l5491K1795K4857J0353j3152o407q207j9693j1180p353O375N042k1021
$$ 2118 -33373 -11578 13279 23632 10480 4073 -4134 -23827 -35007 -42360 -35985 -30943 -51964
23058e1964O679K5324N228J6662J949k558J3621K1946J9840j406j5618n3392p236
$$ -51964 -45285 -19961 -14733 1929 3878 1320 14941 36887 56727 55321 39703 -13689 -20925
23045b0925N5001J0399p724q049k4909j9836o538K4113J0091j6373m2513K1182
$$ -20925 34076 44475 36751 28702 3793 -16043 -22581 1532 11623 -4750 -47263 -26081
23033b6081K2212K0794J7466o986j7020J6131L755l3733J1596j431j109j2217
$$ -26081 -3869 16925 34391 27405 10385 26516 30271 -3462 8134 6703 5594 -6623
23021f623j440J4291k184Q546j4757P41O437J1435o612j662J9161j6211k7414
$$ -6623 -8063 6228 4044 12590 -2167 -1426 5011 16446 9834 8172 27333 11122 -16292
23008a6292Q225K543K0303o551l601K8230J718j7696j4233j6044l6759j0598P631
$$ -16292 -8067 -5524 14779 8228 4627 32857 34575 16879 2646 -13398 -50157 -60755 -53124
22995e3124K1634M591J9504J923K4837K9882k6537j691n347k9574K20J8643K205
$$ -53124 -31490 -26899 -7395 -5472 19365 49247 22710 21019 15672 -13902 -13682 4961 7166
22982G166K477k1205K911l3986R053K0395K3262O124K432l381n8720q483K3930
$$ 7166 9643 -11562 -8651 -42637 -33584 -13189 10073 16197 18629 15248 -43472 -51955 -28025
22969b8025j2560k420K9632L0524J215Q316J3339N475J4193J1303L417l6920j0621
$$ -28025 -40585 -43005 -13373 17151 18366 26682 40021 45496 59689 70992 74409 37489 26868
22956B6868j3621j3937R847J5504j1242m078K4983p212K2251j2822j0882j442
$$ 26868 13247 -690 9157 24661 13419 9341 34324 27112 49363 36541 25659 24217
22944B4217J0981K5567o681j9967j8699L293J3329K6803l6916k0533M043J1262
$$ 24217 35198 60765 54084 34117 15418 18711 32040 58843 21927 1394 5437 16699
22932A6699P997j8210J9539l504r91r960k7968k4676K6924j7305r358j4506R038
$$ 16699 24696 6486 26025 22521 21530 11570 -16398 -41074 -14150 -31455 -40813 -55319 -46281
22919d6281R595O555K5888K0070j082K3291J312j3441k1050k044Q68j6309J9370
$$ -46281 -36686 -30131 -4243 15827 14745 38036 39348 25907 4857 2813 3681 -12628 6742
22906F742j5713j6676K1371K2268J34M133k0801k6710K5179j1889o091M0181R024
$$ 6742 -8971 -25647 -4276 17992 18126 22259 1458 -25252 -73 -11962 -18053 22128 31152
22893C1152r882m008j2565J222j4542N554r551j1269J5719K1172j8683l2587k141
$$ 31152 21270 17262 4697 5919 -8623 -3069 -12620 -23889 -8170 13002 -5681 -38268 -40409
22880d0409P422L5008J0230K6459m864k0310j0295J3236J2986j6029j6071j7285
$$ -40409 -32987 2021 12251 38710 33846 13536 3241 16477 29463 13434 -2637 -19922
22868a9922P609L006k5596j4686J8011K0452L183q264J664L430J1393K3995J1927
$$ -19922 -12313 -9307 -34903 -49589 -31578 -11126 -7943 -16207 -14543 -11113 280 24275 36202
22855C6202j2332m757P085m166l2302k6087j318J0828p644K0821K4975J1389K8981
$$ 36202 23870 19113 26198 22032 -10270 -36357 -37675 -26847 -34491 -13670 11305 22694 51675
22842E1675J7570m447k7270j5853j661j0677J5194J9602R023k6247j2983M382
$$ 51675 69245 64798 37528 21675 20014 9337 24531 44133 53156 26909 13926 18308
22830A8308J4419J4674J271j1777l0499m666L261l0734q193J9361K643O707J4628
$$ 18308 32727 47401 48672 36895 6396 1730 4991 -25743 -33936 -14575 -11932 -5225 9403
22817I403k2214K914J9027L589O237r539L547r671J3734K1489k4262j3569J3460
$$ 9403 -12811 -9897 9130 12719 18956 9417 12964 3293 17027 38516 14254 685 14145
22804A4145J8403o457p583j9086N562K1569l385j0188q177r948R419j189J7193
$$ 14145 32548 26091 18508 -578 4984 26553 23168 12980 4803 -5145 4274 3085 20278
22791B0278j655J3721J2286n414J4802M0590p402n3687j2944J2427L765j0457
$$ 20278 18623 32344 44630 39216 54018 94608 87206 33519 20575 33002 36767 26310
22779B6310m388j8031j558q656J1680J9896J4713J23J2288l431k9293k1913j225
$$ 26310 21922 3891 2333 -6323 5357 25253 39966 40089 52377 48946 19653 -2260 -3485
22766c485j2258j0230n435k2894K3496M6504L9363L76k1938l0383M814j7778J3142
$$ -3485 -15743 -25973 -31408 -54302 -30806 15698 55061 55437 33499 3116 7930 -9848 3294
22753C294J7477J1591K288r167j267l1944p516J1792j424k0560q82M962m607M925
$$ 3294 20771 32362 34650 25483 24216 -7728 -15244 -3452 -4876 -25436 -26318 -21356 -25963 -21038
22739b1038J090J137Q146J3470K8373J3706Q155j988P899M247j3070k7187K2211
$$ -21038 -19948 -18811 -10665 2805 31178 44884 53039 51051 58950 63197 50127 22940 45151
22726D5151L2904P537L110k4835k7203k7301p140m851N82L196j3021m216J057
$$ 45151 78055 85592 88702 63867 36664 9363 2223 -2628 -2046 1150 -11871 -16087 -15030
22713a5030K7395N6r986K4211J6129m7521k8958J5271K8451K1933j3144K283N855
$$ -15030 12365 12421 2435 26646 42775 -4746 -33704 -18433 10018 31951 18807 21090 26945
22700B6945j1129K646L175J1826l410j770j1647k1017P406k4718J192K8072J9403
$$ 26945 15816 18462 21637 33463 30053 28283 16636 -4381 3025 -21693 -20501 7571 26974
22687B6974k5500j6802l573j0447J1122K9629N606j9807k8366J5741J6080N781
$$ 26974 1474 -15328 -18901 -29348 -18226 11403 17009 -2798 -31164 -15423 657 6438
22675F438Q042J7051K583J8079J7870j2035j6693k982M535p254L607j7691K978
$$ 6438 14480 31531 34114 52193 70063 58028 41335 38353 42888 35634 39241 21550 24528
22662B4528m312n0869J7029L2372j1996k1529l210K0508J590j7426j083R417K948
$$ 24528 20216 -30653 -13624 18748 6752 -14777 -17987 2521 4111 -13315 -14398 -4981 -2033
22649b033Q694L182J0806q861p249l831Q15K0001j1401J2326j4584m675K8660
$$ -2033 6661 9843 20649 11788 4539 708 1523 21524 10123 22449 7865 3190 31850
22636C1850K0447j4141l3919J5448L729l565K7893N095J0134j7650l7867K014
$$ 31850 52297 38156 4237 19685 23414 19849 47742 52837 62971 45321 7454 9468
22624I468K7665P463n007j1491J592K0060K0565k1578k3241R613M043q067k547
$$ 9468 37133 44596 39589 28098 29690 49750 70315 48737 25496 35109 39152 31085 28538
22611B8538j0976K9447J8659r993o439k0320L923J932L672k5554k5947N213P320
$$ 28538 17562 47009 65668 55675 49236 28916 32839 34771 38443 12889 -13058 -7845 -525
22598e25J773J3336M91m277J4144J916j1888q497l0870K808J3085O429Q890j7076
$$ -525 1248 14584 15075 10798 24942 26858 14970 6473 -24397 -21589 -8504 -2075 6815 -10261
22584a0261R872j3924M637Q456j12q61J823j799L4427P10K1846J2529j5946k3967
$$ -10261 -389 -14313 -9676 -1220 -1332 -2193 -370 -2169 32258 32968 54814 67343 51397 27430
22570B7430k8173O777O583N545J5733O820m160j8258j9746J7318K1773M4296L71
$$ 27430 -743 6034 12617 18162 33895 40715 36555 18297 -1449 15869 37642 81938 82309
22557H2309j9758k0031j3156p173J1728j4895j1302R53P323R515o573j4036J6003
$$ 82309 62551 42520 29364 22191 33919 19024 7722 8675 15998 25513 18940 4904 20907
22544B0907J2633R935k7706k159K1151k8210m983j4519l668J055J00L2458J5716
$$ 20907 33540 43475 15769 13610 34761 6551 1568 -12951 -16619 -15564 -15464 16994 32710
22531C2710l336n898o278k391J5349l1067l3410j9383N063Q584K8513J8755N836
$$ 32710 29374 23476 17198 14807 30156 -911 -34321 -53704 -48641 -40057 -11544 7211 13047
22518A3047k089K9901J6551p32j652k4902n065J3178k903o162j9531M07J2636
$$ 13047 10958 40859 57410 56678 55026 30124 25059 38237 35334 29172 9641 10048 22684
22505B2684l851K996J1491k1364J421L1854M134l3307j7995m053J8594J550M58
$$ 22684 18833 21829 33320 11956 13377 45231 49365 16058 -1937 -5990 12604 14154 14612
22492A4612L7571K0508j0105k914j7627j8900k7557N709K1830J1933k465o405
$$ 14612 52183 72691 62586 59672 42045 23145 -4412 1297 23127 35060 32595 26190
22480B6190k686L417q380k1674J337J0069k2682j5843l248K347K4538L9012L4086
$$ 26190 23504 26921 18541 -3133 -1796 8273 -14409 -30252 -33500 -31153 -6615 32397 66483
22467F6483J6542j1143l5683m2754j6242N927l504m212K5580L3888k0569k1616
$$ 66483 83025 71882 36199 -6555 -22797 -16870 -20374 -24586 994 34882 14313 -7303
22455g303p925j2183o120J3729j0082m014J1697K6862J7583K9182L6472l7650
$$ -7303 -15228 -27411 -33531 -19802 -29884 -33898 -22201 4661 22244 51426 87898 50248
22443E0248k2616o780L963J8164k709r692j1923j3657r326L0824M8009m178k6860
$$ 50248 27632 20852 24815 42979 40270 30578 18655 4998 -4328 26496 74505 70327 43467
22430D3467J5255J7051j1791L811m508l61j8589k1713K2232L2539J0581K147j1254
$$ 43467 58722 75773 63982 67793 63285 62924 44335 22622 44854 77393 87974 90121 78867
22417G8867j2418k5485j0198M2825M4238P2835O7694K3162l5589o0661m9007k9041
$$ 78867 66449 40964 30766 73591 117829 190664 258358 281520 245931 185270 136263 107222
22405A07222k6185p429k4427N447M1367j499l923j8208m4964l6162O5305M4601
$$ 107222 81037 73608 49181 54628 95995 94496 90573 72365 27401 -8761 56544 101145
22393A01145j044M761l0624L662J4440K4933J1803m795k3141k7927p332l634M818
$$ 101145 100101 104862 74238 77900 92340 117273 129076 124281 101140 73213 65881 62247 67065
22380F7065j9468j3069k9843K758Q686n176Q469K3233L0611J3010k896j4525k8746
$$ 67065 47597 34528 4685 7443 16129 10953 19422 42655 73266 86276 83380 68855 40109
22367D0109J1439M537o005R080p407K1343N488k3692K6823K3377J3663k1392N36
$$ 40109 51548 56085 50080 59160 51753 73096 78584 54892 81715 105092 118755 97363 97899
22354I7899j7621k4774m374J3490J6838J5316l6438n510K1424K4956k73k6800
$$ 97899 80278 55504 51130 64620 81458 96774 60336 54826 76250 101206 100933 74133
22342G4133l0274J0313J0800K889j7972j0462M172N437K5134K7174M3535J8966
$$ 74133 43859 54172 64972 67861 49889 39427 43599 49036 74170 101344 144879 163845
22330A63845l0980l7533M565l2073j3429N626l913j3315p359O853K3834J2555
$$ 163845 132865 95332 99897 67824 54395 60021 56108 42793 35434 42287 66121 78676
22318G8676j9415o400J7848K5821M1035L2879N0667N4735l46k6335l7966l8257
$$ 78676 59261 52861 70709 96530 137565 170444 221111 275846 275500 249165 211199 172942
22306A72942n577N313j6882j7149J0309k8193r333L9073K3970j2288j8005k100
$$ 172942 167365 172678 155796 138647 148956 120763 111430 150503 174473 162185 144180 142080
22294A42080J950k1973j3441j0542j0628l6944r5036r5974j20040r3523L0894
$$ 142080 144030 122057 108616 98074 87446 50502 -44534 -140508 -260548 -354071 -323177
22283c23177J51836J63798P1290N6434L5288J4560p512o109K0073J9437n155J5927
$$ -323177 -171341 -7543 63747 120181 155469 170029 162517 156408 176481 195918 190763 206690
22271B06690M782R404k1926J780K7930K3953k298J919k191j0062j1070o778J9484
$$ 206690 211472 220876 198950 200730 228660 252613 250315 252234 250043 239981 228911 222133 241617
22258B41617m110k1008r343Q956J6196n058p6L5527K8972K6278l9130m666j839
$$ 241617 237507 216499 207156 216112 232308 227250 227174 262701 291673 317951 278821 274155 272316
22245B72316O133N097P838M599O777K1447J5406M721k0647K6760J5490Q144R316
$$ 272316 278449 283546 291384 295983 302760 324207 339613 344334 323687 350447 365937 374081 383397
22232C83397K1964O792n379J174k359K2467k4368j0567j4460L0250K8922L283
$$ 383397 405361 412153 406774 407948 405589 428056 403688 393121 378661 408911 437833 441116
22220D41116K3013K2220J1985J4238L3725N6009K1347j4999J8508Q628L503L6202
$$ 441116 464129 486349 498334 512572 546297 602306 623653 608654 627162 635790 639293 675495
22208F75495L1783L0605K0018M4872J4051q755N920L5293M3676P4504R0053Q3963
$$ 675495 707278 737883 757901 802773 816824 808069 813989 849282 892958 967462 1057515 1141478
22196A141478Q3052Q4538N1433N3458R3450Q2655P5148P0981R0375J37876J44460
$$ 1141478 1224530 1309068 1360501 1413959 1507409 1590064 1665212 1736193 1826568 1964444 2108904
22185B108904J47661K15559K53358K57782K58013K60770K79202L48269M17192
$$ 2108904 2256565 2472124 2725482 2983264 3241277 3502047 3781249 4129518 4546710
22176D546710N34163O14517P86630R61667J184771J463594J799112K184545K763928
$$ 4546710 5080873 5695390 6482020 7443687 8628458 10092052 11891164 14075709 16839637
22167A6839637L728685N232960P692714J1838563J8810797L0343827M7872904
$$ 16839637 20568322 25801282 33493996 45332559 64143356 94487183 142360087
22160A42360087P0655182Q3510175L9761991m5477821q6539812p2631266m4603907
$$ 142360087 213015269 296525444 336287435 290809614 204269802 131638536 87034629
22153H7034629k6112324j6032284j0547259p298021n192121l798504k828447k144685
$$ 87034629 60922305 44890021 34342762 27044741 21852620 18054116 15225669 13080984
22145A3080984j640470j346815j104086q93896q10615p07852n83919n32914n15966
$$ 13080984 11440514 10093699 8989613 8095717 7285102 6577250 5993331 5460417 4944451
22136D944451m66617m22122l07722k32895k55942k63324k39647k27071k22527
$$ 4944451 4477834 4055712 3747990 3515095 3259153 2995829 2756182 2529111 2306584
22127B306584j98723k22720j67992j44437j33568j24794r4071q0753n9373l2539
$$ 2306584 2107861 1885141 1717149 1572712 1439144 1314350 1220279 1139526 1080153 1047614
22117A047614m7981j7905j7091o7600p1676m8887n3961n8955k9720m9228o7566
$$ 1047614 999633 981728 964637 897037 825361 776474 722513 663558 633838 584610 517044
22106E17044l9750j9788k1976j8064p996J3144L0805J1239j4464l5595M062j9895
$$ 517044 477294 457506 435530 417466 409470 422614 453419 464658 450194 414599 418661 398766
22094C98766j2553j6841l4747n2736k6921j3053k6404m0399j6538k864O995K1432
$$ 398766 386213 369372 334625 281889 254968 241915 215511 175112 158574 155710 162705 184137
22082A84137j3101N085m643J65m2607p42p744n009p714k1719k9968J5890m050
$$ 184137 171036 176121 171478 171643 129036 128294 120550 115541 107827 86108 56140 72030 67980
22069F7980l720j8453J3880J5846o371K6702K0442J4799j5732l6101k2624k8332
$$ 67980 64260 45807 59687 75533 69162 95864 116306 131105 115373 79272 56648 28316
22057B8316K640J8806k249o95l264m267J3023k5418j9377R203O618j3321M008
$$ 28316 30956 49762 47513 46818 43554 39287 52310 26892 7515 16718 23336 10015 14023
22044A4023k5867n858M135O332j1803J1888L6291O487J3291O1083J07452K10431
$$ 14023 -11844 -17702 -13567 -7235 -19038 -7150 29141 35628 48919 110002 217454 427885
22032D27885K04713P6705p1836j02640j18811r9538m0250m9328o2706j8689K561
$$ 427885 632598 709303 637467 534827 416016 316478 276228 226900 164194 145505 148066
22021A48066j6954q912j12k5036R691J9931j5309j7890m2922j0000J3451j2528
$$ 148066 131112 122200 122088 97052 106743 126674 111365 93475 50553 40553 54004 41476
22009D1476j7784l1370m8659k5763j020K1936K1287K1490L3280M7204L1428M296
$$ 41476 23692 -7678 -56337 -82100 -83120 -61184 -39897 -18407 14873 62077 93505 97801
21997I7801k288j9835J3812J4155m0781n4765J2747J5081K6139L264n706j3215
$$ 97801 95513 75678 89490 103645 62864 8099 20846 35927 62066 65330 59624 46409
21985D6409j0715j1645K6274J0593K16j3434j7962J1134J3593M8258P053k0338
$$ 46409 35694 24049 50323 60916 61132 47698 29736 40870 54463 102721 109774 89436
21973H9436j5003m1883j8311K0192J8069m08j6315k394m2821j8938K6853R104
$$ 89436 74433 32550 14239 34431 52500 52092 35777 33383 -9438 -28376 -1523 7581
21961G581j5102n724J2221J3916K384K6358K1656l035j5186k0941m381O202l024
$$ 7581 -7521 -13245 -1024 12892 15276 41634 63290 60255 45069 24128 19747 25949 22925
21948B2925j4893J1291J1740m172J0235J0043J0570N808k6530J515k506m857j1989
$$ 22925 8032 19323 31063 26891 37126 47169 57739 63547 37017 38532 36026 31169 19180
21935A9180j7654l9j5631J2272q645p834o200k6791K9026K6607R26J6986o900
$$ 19180 1526 1487 -14144 -1872 -10517 -18351 -24551 -51342 -22316 4291 5217 22203 15303
21922A5303P211K7353J1077k4152m6324m001J0084J0395j2212J6961R741n596
$$ 15303 22514 49867 60944 36792 -9532 -13533 -3449 6946 -5266 11695 21436 15840
21910A5840q012P234m596j8333j1407J0609J6758J6981K2991j241K4176J1090
$$ 15840 7828 15062 10466 -7867 -19274 -8665 8093 25074 48065 46824 71000 82090
21898H2090r74k0873Q829J1357l4975k6953K8744L0993k9969j0758O476J1141
$$ 82090 81116 60243 69072 80429 45454 18501 47245 78238 48269 37511 43987 55128
21886E5128p701J067J350j2271k0622j9619l1788M242R468k3055j0864L587K1108
$$ 55128 47427 48494 49844 37573 16951 -2668 -34456 -30214 -20746 -43801 -54665 -51078 -29970
21873b9970N377L933L0169J9218K1622J900l7162k7049L947k668L2056L539j979
$$ -29970 -24593 -20660 9509 28727 50349 52249 15087 -11962 -8015 -10683 21373 24912 22933
21860B2933j8977q64J8883M2672L6831J1086j6855k2788n289q851k4001l4182
$$ 22933 3956 3092 21975 64647 101478 112564 95709 72921 67632 58781 34780 598
21848E98O929L0487M1828p450l4628k2440o08j5490J3580j4044l357O653k0996
$$ 598 7527 38014 79842 72392 37764 15324 14716 -774 12806 -1238 -4595 2058 -18938
21835a8938k008N54J8178Q297j7466J9295j5119l6990l136J3863L4544O584l0
$$ -18938 -20946 -20392 -2214 6083 -11383 7912 -7207 -44197 -47333 -33470 1074 7658 7628
21822G628J0316m666Q07J3618Q319l0349k8375k273J3677J4642J2431j5494J551
$$ 7628 17944 13278 14085 27703 36022 5673 -22702 -24975 -11298 3344 15775 281 1832
21809A832j0904j1948J145j8603j3060P390n499O900j4406K0147o079j9913K783
$$ 1832 -9072 -21020 -19875 -38478 -51538 -44148 -49647 -42747 -57153 -37006 -43085 -62998 -60215
21796f0215N0810L5358J2895r394j4225l366j9486j458q527j653K3875q583k8433
$$ -60215 -9405 25953 38848 29454 15229 11863 -7623 -9081 -17608 -19261 4614 -3969 -32402
21783c2402l183P125K835R955L562k3877L101M806K6375j6984K1434L6067r878
$$ -32402 -35585 -28460 -25625 -15670 -12108 -35985 -32884 -28078 -1703 -18687 2747 38814 28936
21770B8936j7737r613O613j7612j6931K3711p417N518O196m06j2508k411R974
$$ 28936 11199 1586 8199 -9413 -26344 -2633 -10050 -4532 1664 1258 -11250 -13661 -3687
21757c687r000K7895j0059j1024p554j263k923n719m554K076j1267L5047K7624
$$ -3687 -12687 15208 5149 -5875 -13429 -14692 -17615 -23334 -27888 -25812 -37079 -2032 25592
21744B5592n981j9908q122m269J6632K9077k0831l0763l317J3750L4051o682k7812
$$ 25592 19611 -297 -8419 -12688 3944 33021 12190 -18573 -21890 -8140 25911 19229 -8583
21731h583m254o825o969j1045P663R326j3060j0822j0495K4148L3126k598O712
$$ -8583 -12837 -19662 -26631 -37676 -30013 -20687 -33747 -44569 -55064 -30916 2210 -388 6324
21718F324j5546j1571K453R830j0543l0006k343R418J4235K5298k546J149k196
$$ 6324 -9222 -20793 -18340 -8510 -19053 -49059 -51402 -41984 -27749 -2451 -4997 -3848 -6044
21705f044R483l820k2575q108j0039O35J2122J3739L1299K4320P8k075j2547k6837
$$ -6044 3439 -381 -22956 -31064 -41103 -40468 -28346 -14607 16692 41012 41090 39015 26468 -369
21691c69J3942J4585l47l2603j1143J1138J1521Q993j8404J0203L002q673m1320
$$ -369 13573 28158 27811 -4792 -15935 -4797 6724 15717 -2687 7516 10518 1845 -39475
21678c9475j3347Q237L6155K2430M631K912P48k0921j1537p173m5481j9277K1985
$$ -39475 -52822 -44585 -8430 14000 18631 21543 22291 1370 -10167 -17340 -62821 -82098 -60113
21665f0113k658N860K8586K8413K1636m646j1228o121q707K732K1515j9068l2479
$$ -60113 -62771 -56911 -28325 88 21724 17078 5850 -271 -8978 -6246 15269 -3799 -36278
21652c6278O901M1902J740k7806M549J6935o566j0321j2464j0420j4221o897J1122
$$ -36278 -29377 12525 14265 -13541 -8992 7943 1377 -8944 -21408 -31828 -46049 -52946 -41824
21639d1824K7711J7076N869j448r940Q989L830J9771L1784j5899k4001m1113K2296
$$ -41824 -14113 2963 8832 7384 -2556 6433 10263 30034 61818 45919 21918 -19195 3101
21626C101o846l9818k7439J0176K8489N0693J2063m147J8847J7095J774m5755
$$ 3101 -3745 -43563 -71002 -60826 -32337 18356 30419 26272 45119 62214 63988 18233
21614A8233m839r206j962l522k1309M0303K1842j7588M251n672M829m493j5296
$$ 18233 13394 4188 2226 -1296 -22605 17698 39540 21952 26203 20531 25360 20867 5571
21601E571q7k1291L361L2823L000r735k2144J0499L2398J335J2582j4086l6814
$$ 5571 5484 -15807 -12446 20377 23377 13642 -8502 1997 34395 35730 48312 34226 -2588
21588b588R522L182K6248K9232j2935l9964k0813p847l6364O688J0979j6668j0556
$$ -2588 6934 10116 36364 65596 52661 12697 -8116 -15963 -52327 -45639 -34660 -51328 -61884
21575f1884K6573J1757k1978j337r611l236p369K5721J1023l818J948K9184K5353
$$ -61884 -35311 -23554 -45532 -46869 -56480 -59716 -67085 -41364 -30341 -34159 -32211 -3027 22326
21562B2326O428j6936k3149l839J0957J7728r251k6333J0914l653l9810j3135
$$ 22326 28754 11818 -11331 -15170 -4213 13515 4264 -22069 -11155 -14808 -54618 -67753
21550f7753J25J9122J8770L936K9647K3622k4949K0503Q971j946k6711k989j1060
$$ -67753 -67628 -48506 -29736 -25800 3847 27469 2520 23023 31994 30048 3337 348 -10712
21537a0712j5817J0814P413k3083O863K4530j2463l6426J1099L0892P866L940
$$ -10712 -26529 -15715 -8302 -31385 -24522 8 -12455 -48881 -37782 -6890 976 4916
21525D916J5150k727q574l5474k4805k385K8147N660K0922n436l005m617K420
$$ 4916 20066 17339 8765 -26709 -51514 -53899 -25752 -20092 830 -4606 -7611 -12228 -9808
21512i808K0203r371k7502J7384q520N915K9538k7370n109J661j09j1990q604
$$ -9808 10395 1024 -26478 -9094 -17614 -11699 17839 -9531 -14640 -12979 -13088 -25078 -33682
21499c3682K145n244P001K820n820O966J2096j8445j374L7976J2367o417k0429
$$ -33682 -31537 -36781 -29780 -26960 -32780 -25814 -13718 -32163 -33537 4439 16806 10389 -10040
21486a0040q76J5033O069M021j7120j5550J7571j1850j3546j4578q282R567J9968
$$ -10040 -10916 4117 10186 14207 -2913 -18463 -892 -12742 -26288 -40866 -49148 -39581 -19613
21473a9613K1490j7604n2013J51K0059J7762J3213k514p244J5848K2080j8091
$$ -19613 1877 -15727 -67740 -67589 -47530 -29768 -16555 -19069 -26313 -10465 11615 -6476
21461f476j6190L245J5598P219m656L091M1648R165k3560M061r126j2652K53J4297
$$ -6476 -22666 -19421 -3823 3396 -1260 1831 43479 52644 29084 33145 24019 11367 11620 25917
21447B5917o465j7484K407o74J5466J4266m848Q08O58k6945k3284L160k853l892
$$ 25917 19452 1968 4375 3701 19167 33433 28585 29393 30051 3106 -20178 -17018 -19871 -23763
21433b3763L3842J6914m875l5623L994k4589J1618K1105j1787J1848J2254q148
$$ -23763 10079 26993 22118 -13505 -9511 -34100 -22482 -1377 -13164 -1316 10938 2790
21421B790r972j1157j6382j801K304J0122Q146J9858L920K127n174r616J070j1136
$$ 2790 -7182 -18339 -34721 -36522 -34218 -24096 -15950 3908 7828 9955 4781 -4835 -3765 -14901
21407a4901J4315J0701j563k36k0486p404j521K158K066k3967o152J2498J2167
$$ -14901 -586 10115 8552 8316 -12170 -19574 -21095 -18937 -16871 -40838 -46990 -34492 -22325
21394b2325p769j5574J6888l279k643n42L5800R459k3752M005o057J9886l25j9416
$$ -22325 -30094 -45668 -28780 -32059 -34702 -35244 556 10015 -13737 -9732 -15789 4097 3772 -15644
21380a5644j6619j9352J617M0595R472k7609j2648J3303J8715L5102K6588j91
$$ -15644 -32263 -51615 -49998 -9403 69 -27540 -40188 -26885 -8170 26932 53520 53329
21368E3329k9847k9061j7221m272J4057K579k982j1383n538L694j706J8435K0203
$$ 53329 23482 -5579 -22800 -27072 -13015 -10436 -13418 -24801 -30339 -26645 -28351 -9916 10287
21355A0287j0114M462R246m956R926K3593j5899r716r812j119K9201K2324L2453
$$ 10287 173 4635 13881 8925 18851 42444 26545 16829 7017 5898 35099 57423 89876
21342H9876k479k1796j5967p642q849k8046P71k3314k2939R666K4910K5354N83
$$ 89876 87397 65601 49634 41992 33143 5097 5868 -17446 -40385 -30719 -5809 19545 20128
21329B0128K1748J903k227L796q508k8690k26j5635P89L6948K0104j1962p144
$$ 20128 41876 43779 41552 45348 36840 8150 7924 -7711 -6922 30026 50130 38168 31024
21316C1024k2091j8188L8k221J0997L7547J1265k641j1312j0138N667K97p106
$$ 31024 8933 -9255 -9217 -11438 -441 37106 48371 45730 34418 24280 29947 30244 23138
21303B3138j6528n924O807Q219L4151J1424m3923k2571K8568p325j5674N344j1297
$$ 23138 6610 686 7493 15712 49863 61287 17364 -5207 23361 16036 362 5706 -5591
21290e591K1660K6533L391k5098j5377j2856n710k829M141J8596j4530L259m652
$$ -5591 16069 42602 45993 20895 5518 -7338 -13048 -15877 -11736 6860 -7670 -4411 -9063
21277i063j5200J6935J1027q82j5739l0451o118K0845K1343J5279j4167l980m094
$$ -9063 -24263 -7328 3699 2817 -12922 -43373 -49491 -28646 -7303 7976 -6191 -10171 -14265
21264a4265l2217l9452M2678K7602m84J3968J3537P478l6371j1332J7454K6514
$$ -14265 -46482 -85934 -43256 -15654 -16138 -2170 11367 18845 -17526 -28858 -11404 15110
21252A5110K2318J2114m2181l1105m648p556J8535J3936p916j800p558J4292O961
$$ 15110 37428 49542 7361 -23744 -28392 -35948 -17413 -3477 -11393 -13193 -20751 -6459 502
21239E02P094k9853j3725J4558J0627L907J4132j4942M895o422j8806j16k9898
$$ 502 7596 -22257 -35982 -21424 -10797 -6890 7242 -7700 -2805 -9227 -28033 -28149 -58047
21226e8047J7186J9330L9137J1590j0280j4529R67j5526J6331j091p018N150N593
$$ -58047 -40861 -21531 17606 29196 18916 4387 5354 -10172 6159 5068 -1950 3200 8793
21213H793Q481j8130J117K7049J8308j9542m597Q282j3605K508J9796k9823l8765
$$ 8793 17274 -856 261 27310 45618 26076 21479 29761 16156 18664 38460 8637 -30128
21200c0128m985K0704K8956J8015k4991R125O428j9403R428K4369j5928j0330
$$ -30128 -35113 -14409 14547 32562 7571 16696 23124 3721 13149 37518 21590 11260
21188A1260k3504j4339J9332K1347Q879J596l0175j0096K9218N998j4363r739
$$ 11260 -12244 -26583 -7251 14096 22975 24571 -5604 -15700 13518 19516 5153 -4586
21176d586O28J6978j3356k58K3776l2822l2278j986k29K1928O033j6299L062N600
$$ -4586 -3958 13020 -336 -594 23182 -9640 -41918 -43904 -44133 -22205 -16172 -32471 -29409 -23809
21162b3809L1287r451j724J9934Q856j3772k1368r494J5689L765J4208J2662L807
$$ -23809 7478 -1973 -3697 16237 25093 11321 -10047 -19541 -3852 -87 14121 26783 30590
21149C0590j2880O217j4029J6413j1555j9602R806J7073j1115k0674O47q606o793
$$ 30590 17710 23927 9898 26311 14756 -4846 4960 22033 10918 -9756 -9109 -17715 -24508
21136b4508K05K9736r579l735M375j1509P469K5433p394k2565r824J1763K1927
$$ -24508 -24303 5433 -4146 -7881 -3506 -15015 -7546 17887 10493 -12072 -21896 -10133 11794
21123A1794P035l554l3414o727K1467k5865j1935M538K101Q509o899P520J7582
$$ 11794 18829 15275 -18139 -24866 -3399 -29264 -41199 -36661 -34560 -26051 -32950 -25430 -7848
21110g848K1549q302k3868j1950j2254J928J8909J7006M342O224L5932J7512P032
$$ -7848 13701 5399 -18469 -30419 -42673 -40745 -21836 -4830 -488 5736 41668 59180 66212
21097F6212k4481m793k01m654k7312J217J1836K469j8860j2236r580J3287q671
$$ 66212 41731 36938 36737 32083 4771 5988 17824 20293 1433 -10803 -20383 -7096 -15767
21084a5767O910M2059n355k308k5232j124K4471p862m640j601j648n419K4787
$$ -15767 -8857 33202 27847 25539 307 -817 23654 15792 11152 9551 7903 2484 27271
21071B7271k827j5515n490L623j528o126j6408J6185L635K802j9496L584M28M720
$$ 27271 24444 8929 3439 7062 5534 -592 -17000 -815 2820 5622 -13874 -10290 -9862 -5142
21057e142j5092K0673L190j8337p627j5527J343K2963K11j3118m500K1813K3102
$$ -5142 -20234 439 3629 -14708 -22335 -37862 -36519 -13556 -13345 -26463 -30963 -9150 13952
21044A3952J1713l200j651r902J418M844p155J267l681n08J0186R292n665k398
$$ 13952 25665 22465 20814 10912 12330 17174 10019 11286 7605 7097 17283 26575 20910 18512
21030A8512Q707j1939m729K2798o436p258m339j3363k1425M202L5947m579l7786
$$ 18512 27219 15280 10551 33349 26913 19655 15316 1953 -19472 -15270 20677 16098 -21688
21017b1688j3714N0791L5540j7840j2850J2879j1873j8601q94o353L601M165r775
$$ -21688 -35402 15389 50929 33089 20239 33118 21245 2644 1750 -4603 -1002 3163 -6612
21004f612J703L556N361K967n585Q304J4895J8041P52k3799j3769l393r993j7442
$$ -6612 -4909 -1353 4008 6975 1390 9694 24589 42630 43382 19583 5814 2421 -7572 -25014
20990b5014j1060J907k832P998P183j9346j751J0713J8614j6614k131j0244L1579
$$ -25014 -36074 -34167 -36999 -29001 -21818 -41164 -42915 -32202 -13588 -30202 -32333 -42577 -10998
20977a0998K4662k1972j4676j0663l6982J7952P261o320K2259L6249j449k436
$$ -10998 13664 -8308 -22984 -33647 -70629 -52677 -45416 -51736 -29477 6772 5323 2887
20965B887J6970M026L463l9958m2063O92K1972L2031N831j9853o123M564k354
$$ 2887 19857 23883 27346 -12612 -54675 -53983 -32011 20 5851 -14002 -20125 -15561 -17915
20952a7915m100J334K3326n059j9582j3278P194O3J0396J9075P522L355J7915
$$ -17915 -22015 -20681 2645 -2414 -21996 -35274 -28080 -28017 -17621 1454 8976 12331 30246
20939C0246m319K2306N911L925K1677n198l5780j0404j1834Q099J2074j8086j0240
$$ 30246 25927 48233 54144 58069 79746 74548 38768 28364 16530 24629 36703 18617 8377
20926H377o639k8200O097L4174J4143J5834K4673j174k2850k9792k1778j4584
$$ 8377 1738 -26462 -20365 13809 27952 43786 68459 67285 44435 14643 -7135 -21719
20914b1719J2807O500J4893J1281k1472j4021j6434J0064K7838K9417j7986J5427
$$ -21719 -8912 -2412 12481 23762 2290 -11731 -28165 -18101 9737 39154 21168 36595
20902C6595j678j4812P90J893k4967m644j05j1321k6574J2250K2928k846L1337
$$ 36595 34917 20105 20895 22788 -2179 -6823 -6928 -18249 -44823 -32573 -9645 -12491 18846
20889A8846n029l9681j1059j2021K3262K136j5331o065j811J0516N238N768Q977
$$ 18846 13817 -25864 -36923 -48944 -25682 -23546 -38877 -44942 -46753 -36237 -30999 -25231 -16254
20876a6254N720J129J3939R907K4435L107k6905j7039K1712j2463l094j9931j5188
$$ -16254 -10534 -9405 4534 14441 38876 41983 15078 -1961 19751 7288 4194 -15737 -30925
20863c0925L4346L29j1945K9918K015j8587j8768J643R189J8618j2946j795K1699
$$ -30925 3421 3750 -8195 21723 23738 5151 -13617 -11974 -2785 15833 2887 1092 22791
20850B2791j4515j6270L797L12J3143K9501J150r702j0065K0475K118j5177k1232
$$ 22791 8276 -7994 -4197 -3885 9258 38759 39909 30207 20142 40617 42735 27558 6326
20837F326n655J0015J4647l902P792K8417l4109j6897k945Q501R102k7183K461
$$ 6326 671 10686 25333 21431 29223 57640 23531 6634 3689 12190 21292 -5891 -3430
20824c430o580L965L5110O746J8642q501j5738q579o026r34J3835K041l7450Q879
$$ -3430 -10010 -6045 29065 35811 54453 45952 30214 21635 15609 14675 28510 30551 -6899 1980
20810A980K5362j8359l4802L082J8290K7707P02m159l0994r594M664l788o062
$$ 1980 27342 8983 -25819 -22737 -4447 23260 23962 19803 -11191 -20785 -16121 -19909 -25971
20797b5971R169n3o658J7227J4987P468j5095r968K4134J8970k0185j2324L8J7896
$$ -25971 -16802 -16855 -23513 -6286 8701 16169 1074 -8894 15240 34210 14025 1701 1739 19635
20783A9635K1124k8259O900K3126J1474q290j6737k0390l1589j3289M142K984
$$ 19635 40759 12500 19400 42526 54000 45710 28973 8583 -23006 -36295 -32153 -29169
20771b9169j2037K75J24K8376J0676j0340Q400j9709R466J0251K9555J908K1220
$$ -29169 -41206 -40931 -40807 -12431 -1755 -12095 -3695 -23404 -13938 -3687 25868 27776 48996
20758D8996L2325l966l5376j2986k738j2434k83K7104k9947k8938j0102k8275
$$ 48996 81321 77355 41979 28993 26255 13821 13538 40642 10695 -18243 -28345 -56620
20746e6620J1181J5953O673K5013P493k0825P097k2083j1258j4354L1529K8773
$$ -56620 -45439 -29486 -22813 2200 9693 -11132 -4035 -26118 -37376 -51730 -20201 8572
20734H572p435j131N522p991j0017l825j6267l566K6157r70J7074Q439n787j5499
$$ 8572 1137 6 5528 -2463 -12480 -16305 -32572 -36138 -9981 -10951 6123 14562 8775 -6724
20720f724m200J2515J5527j861k9851j6991K0409K4737J155J912j2544j1625k1023
$$ -6724 -10924 1591 17118 15257 -14594 -31585 -11176 13561 14716 16628 4084 -7541 -28564
20707b8564o205J0032K7093J6760Q955J2267Q41j5784j9106j2004o686J1223J082
$$ -28564 -34769 -24737 2356 19116 28071 40338 41179 25395 6289 -5715 -12401 -1178 -96
20694i6P279k988j450J2494j119n090J7759L1121q402m145j4374l3744m870J9535
$$ -96 7183 4195 2745 15239 14120 9030 26789 57910 49508 45363 30989 -2755 -7625 11910
20680A1910J5105j4581k6665l192l603j0348J1893K7041J6340m634K212p592J3859
$$ 11910 27015 12434 -14231 -17423 -21026 -31374 -19481 7560 23900 19266 21478 13886 27745
20667B7745k114j7498n78k3586q227J9672J1435j5024r314K7237O148r109J9198
$$ 27745 25631 8133 7555 -16031 -24258 -4586 6849 -8175 -17489 9748 15896 6787 25985
20654B5985L642q151J3803K3330L2476m0497l0751o231j5606M871J6717j1868
$$ 25985 29627 21476 35279 58609 91085 50588 19837 13606 -2000 2871 19588 7720
20642G720k8705P98Q475J0233K8848J0561k2932k596J4182k4953k8761J5930L1637
$$ 7720 -20985 -20187 -11712 -1479 27369 37930 14998 12402 26584 1631 -27130 -11200 20437
20629B0437K1342j3017R721M261k214J3435k6686l8902j4281k540K3736K1153
$$ 20437 41779 28762 38483 42744 40530 53965 27279 -11623 -25904 -28444 -4708 16445
20617A6445l219R527J8327J3123o028l9314j7865J2016m807P388N674k2359O476
$$ 16445 13226 22753 41080 54203 48175 8861 -9004 3012 -1795 5593 11267 -11092 -4616
20604d616J653M403J4272K0808o097O83J0587L571J6674J2671m1513l9487K5400
$$ -4616 -2963 1440 15712 36520 30423 31106 41693 45264 61938 74609 33096 -6391 19009
20591A9009L1780l295l4870M781K0338r824j1807K1002O49j1209O418K9003Q592
$$ 19009 50789 47494 12624 17405 37743 27919 16112 37114 37763 26554 32972 61975 70567
20578G0567k5139l9377L829O709k2325k5046j4492K6583L6277j5252k1448j0487
$$ 70567 45428 6051 9880 16589 -5736 -30782 -45274 -18691 17586 2334 -19114 -29601
20566b9601J1339j1355N1201L8089r011k6729l2100l206o077P109L1101J0649
$$ -29601 -18262 -29617 21584 59673 50662 23933 -8167 -11373 -17450 -10341 20760 31409
20554C1409j508N833J8679j5822N045N428j1227J0115P106r606p219J0500k2417
$$ 31409 29901 35734 54413 38591 43636 49064 37837 47952 55058 45452 38233 48733 26316
20541B6316j6722j2792q683J5452M171k53j2175k177J0746J2332l796k517l1781
$$ 26316 9594 -3198 -11881 3571 7742 7489 -4686 -6863 3883 16215 12419 9902 -21879
20528b1879j1856J7488J4743K5251l157j3915M598L3028k469m772l3205L048J4489
$$ -21879 -33735 -16247 -1504 23747 20590 6675 11273 44301 41832 37060 3855 6903 21392
20515B1392l5881k3362n894K8815O0165L3158r317j3065k0983j1941j7105j3012
$$ 21392 -14489 -37851 -43745 -14930 45235 78393 69076 56011 35028 23087 5982 -7030
20503g030k863J2970J3501J9707K7727K785l0006l0335M2K3965J9023j6169q235
$$ -7030 -9893 3077 16578 36285 64012 66797 36791 6456 6498 30463 49486 33317 25082
20490B5082m2609q142L967O73K3131m562n620j2721n082J6426J4991J3589n466
$$ 25082 -17527 -25669 -21702 -21029 2102 -2460 -8080 -20801 -25883 -9457 5534 19123 13657
20477A3657k2223J6960J9902K4944p26Q79J8352j1834l4748k5268q464P157K694
$$ 13657 -8566 8394 28296 53240 52514 53393 71745 59911 25163 -105 -8569 -1412 1282
20464A282k72j0302j5439J810J3820J1515p947N678J9028L7305K659k5278q173
$$ 1282 1010 -9292 -24731 -22921 -9101 2414 -5533 145 19173 56478 59137 33859 25686
20451B5686K016q857k0708P812K149n12j7823o629K1348K7649l514q05K0176k7521
$$ 25686 27702 18845 -1863 5949 8098 7586 -10237 -16866 4482 32131 28617 27812 47988 20467
20437B0467Q436j8227m1583j6323L8942J7609L348n023J5967P175N758J1693q593
$$ 20467 28903 10676 -30907 -47230 -8288 9321 12669 7646 23613 30788 36546 48239 39646
20424C9646l6982k2816J8770N4337n467p679k666M844Q991k643j4462j5593J1169
$$ 39646 2664 -20152 -1382 52955 47488 39809 37143 41987 50978 48335 33873 18280 29449
20411B9449k6603k5705L599J6354K4076p136R891l687O465J2683J8212L364j7063
$$ 29449 2846 -22859 -19260 -2906 21170 14034 23925 20238 26703 39386 57598 60962 43899
20398D3899p155O442N596m715J1538J2012k2820k6397j2169K239o519J0893K7046
$$ 43899 36744 43186 48782 44067 55605 67617 44797 18400 6231 8470 1951 12844 39890
20385C9890K4062L465j3274j2788l348k02j1022J6777j101J459J0723J0798J7338
$$ 39890 63952 67417 54143 41355 38007 37805 26783 43560 42459 43918 54641 65439 82777
20372H2777P054j7076J1630q137k8633M053k005j5078j2111n899J8482K8171K187
$$ 82777 89831 72755 84385 76248 47615 51668 49663 34585 22474 16575 35057 63228 65415
20359F5415j9625k1437l812J527J0551P234k8164J1898l6205M421L2946j1271
$$ 65415 45790 24353 20541 22068 32619 39853 11689 23587 -12618 -8197 24749 13478
20347A3478P666j8875p631K5391K3083K0656n54j8823j4756k1534O785L0736O967
$$ 13478 21144 2269 -5362 20029 43112 63768 63214 44391 29635 8101 14886 45622 52589
20334E2589j1548j418o793l136j6213j7756k377k0280K0601J8663Q947k6169p931
$$ 52589 41041 39623 32830 29694 13481 -4275 -6652 -26932 -6331 12332 21279 -4890 -12821
20321a2821j6171j0946K9702L4445J4232O734o265K4479J898j1742j1422k0956
$$ -12821 -28992 -39938 -10236 24209 38441 45175 38910 63389 65287 53545 42123 21167
20309B1167k7863k165L0683k4737J3286J7123n75P847p712J2995o951l2264q147
$$ 21167 -6696 -8861 21822 -2915 10371 27494 26919 34766 27054 40049 33098 834 -7313
20296g313P095q0j3736P112L3445L4775j1917j0419j4576J7253K234q13m181J190
$$ -7313 -218 -298 -14034 -6922 26523 61298 49381 38962 24386 41639 43873 43060 38879 40069
20282D0069o231k2236J2039j1652J0381K1232J320j4414M953j7894M407J0563
$$ 40069 33838 11602 23641 11989 22370 43602 44922 30508 35461 17567 21974 32537
20270C2537k7305P182K7220M314J2599J4021K6769p098j6132l4611j1615k4842
$$ 32537 5232 12414 39634 43948 56547 70568 97337 90239 74107 39496 27881 3039
20258C039k3858J7819J2530K8217M6751J9097j5606k1890j7524J9168J5795j3033
$$ 3039 -20819 -3000 9530 37747 84498 103595 87989 66099 48575 67743 83538 70505
20246G0505k0030N09o503k9828O511K7210K525k6782j554p435J0651j511J0121
$$ 70505 50475 50984 44481 14653 21164 48374 50899 24117 22563 15128 25779 24268 34389
20233C4389n166J1724j1375R596J0506J3861j6488l0008R985P136p687J6544j3864
$$ 34389 29223 40947 29572 39168 49674 63535 47047 17039 27024 34160 26473 43017 29153
20220B9153J3983Q381k2964j0577K8931P187J4310J6177O985j1721P651j8946
$$ 29153 43136 51517 28553 17976 46907 54094 68404 84581 91566 79845 87496 68550
20208F8550l2654J6090J0535K2942j917j9024j767J0337J4297J1424m1085n679
$$ 68550 35896 51986 62521 85463 83546 64522 62755 73092 87389 98813 57728 52049
20196E2049J3961j3001p965k1631K214K8741L33o712K4173R394J6081q299N799
$$ 52049 66010 53009 45044 23413 25627 54368 54701 47989 72162 81556 97637 89338 95137
20183I5137J7042q736j5665N318L8801K0171m5716p680J9922K5362M2713M033
$$ 95137 112179 103443 87778 93096 131897 152068 106352 98672 118594 143956 186669 190702
20171A90702l1861L4107L9227L7014K5500K7986M2182M7820L2175K3774K9733
$$ 190702 158841 192948 232175 269189 294689 322675 364857 412677 444852 468626 498359
20160D98359J9546J0751M926J6682J7048M163N512P74l7336q322m0185m3864k3352
$$ 498359 517905 528656 533582 550264 567312 571475 576987 577761 540425 532103 491918 448054 424702
20147D24702n25m4495n5466l1592n3142m7987j722J0909k5159k6908l2440L0286
$$ 424702 424177 379682 324216 292624 239482 191495 189773 200682 175523 148615 116175 146461
20135A46461J3905j0102p49k6820l3913j6508R202R309J2525m854l176J1834K716
$$ 146461 160366 150264 149515 122695 88782 72274 81476 90785 103310 98456 95280 107114 109830
20122A09830j6220K9894l896j9281J3244k9884J901K0779J294n701J7715q813
$$ 109830 93610 123504 119608 100327 113571 83687 85588 106367 107661 101960 119675 110862
20110A10862O589l461J2541L4247L1214M000O12K8749L8209L9442L1049M5408
$$ 110862 117451 113990 126531 160778 191992 195992 196604 225353 263562 303004 334053 379461
20098C79461N2567N5420L6869O1272O4824O0828O8113J1577l7326l338K1953K3347
$$ 379461 432028 487448 524317 585589 650413 711241 779354 790931 753605 750267 772220 795567
20086G95567j5652k3265o7434o4653o2882n3346m8470l7804k3843l9778l9254
$$ 795567 779915 756650 689216 624563 561681 508335 459865 422061 398218 358440 319186
20075C19186q8407m0448m829l5477K420J7981l9780k6436l776j3998J0166q089
$$ 319186 230779 190331 185502 150025 152445 170426 130646 104210 100434 86436 96602 88513
20063H8513n8l744j6025j3851k1026P169K4041K6992j2973k7896R800L0359M230
$$ 88513 88455 84711 68686 54835 33809 40978 65019 92011 79038 51142 60942 91301 95531
20050I5531K498l9258k7438j6186K4881K6392O349P016j2284L102K9162l7294
$$ 95531 98029 58771 31333 15147 40028 66420 72769 79785 67501 70603 99765 62471
20038F2471l710J3344L574l274J3965J9839j092k8272k3871j86L6342m944j5474
$$ 62471 58761 72105 75679 72405 86370 106209 105117 76845 52974 52788 89130 84186 68712
20025F8712j804p055J9470L817R615K5636R978Q358q702l1571l0629j3366K5639
$$ 68712 66908 59853 79323 83140 92755 118391 128369 136727 128025 96454 65825 52459 78098
20012G8098J9001o959K4083M724n951k2279o931L072j643j2189N273J3925j0284
$$ 78098 97099 90140 114223 118947 112996 90717 83786 86858 85215 73026 78299 92224 81940
19999H1940j4046m053q462K3203M523k2063q216n226O100m22j5958J5139J4404
$$ 81940 67894 63841 55379 78582 83105 61042 52826 47600 53700 53278 37320 52459 66863
19986F6863O661m745M416O923m069K3363k0520k4635l50q466J8743J616j2835
$$ 66863 73524 68779 73195 80118 76049 99412 78892 54257 53907 45441 64184 65800 52965
19973E2965k1142N49l16M0093p062j7870k597L266p258J5496K1200r666j1219
$$ 52965 31823 32372 32056 72149 65087 47217 44620 47886 40628 56124 77324 67658 56439
19960E6439r385K3165k0122j2592J7476J4612J068l514j2846l172q42J1510R006
$$ 56439 47054 70219 50097 37505 54981 69593 70661 67147 54301 51129 50287 61797 70803
19947G0803L3863Q846k8983J481Q147J999j4554J417j3128m1793j8982L0598K6858
$$ 70803 104666 113512 84529 86010 94157 96156 81602 83019 69891 28098 9116 39714 66572
19934F6572J8978K5962J1246n789l2077J1465n273K800J7371l213o458k1640J2164
$$ 66572 85550 111512 122758 116969 84892 96357 91084 93884 111255 108042 101584 79944 92108
19921I2108K1116J9740j1590k942L5497K736l812k1484l946j2646J8738L134p349
$$ 92108 113224 132964 121374 118432 153929 156665 152853 131369 127423 114777 133515 136649 129300
19908A29300Q385Q991Q700q131J1260J0939j2058p846r784P162l372J2428j3796
$$ 129300 137685 146676 155376 147245 158505 169444 157386 149540 139756 146918 143546 155974 142178
19895A42178m1713J7490j413k3653k3648n61J4017K5467m857j7780J1551L5709
$$ 142178 100465 117955 116542 92889 69241 68680 82697 108164 103307 85527 97078 132787
19883A32787J9357J6997k784k5474l4725K567K7236n031P042k1467j3562M765
$$ 132787 152144 169141 166357 140883 106158 108725 135961 130930 137972 116505 102943 107708
19871A07708J0884M1840K2879p509j6770j6271j7872j2101k734N339j0658J1378
$$ 107708 118592 160432 183311 175802 159032 142761 124889 112788 110054 115393 104735 116113
19859A16113o283K9441R239n456k7300J1529J4005J6809M759j9552M113j4797
$$ 116113 109830 139271 148510 143054 115754 127283 141288 158097 162856 143304 147417 132620
19847A32620n315j5018q741J0323J3284p04l980L398L3589j0787j4420K52j1917
$$ 132620 127305 112287 103546 113869 127153 126449 122469 125867 159456 148669 134249 134501 122584
19834A22584n583Q384J7502J8245O307l0520l7291K8266L4458K3688k8126J690
$$ 122584 117001 125385 142887 161132 167439 136919 99628 127894 162352 186040 157914 159604
19822A59604J1839L3256J6764j8414r778k4545j4966j7866P187J3956Q462Q903
$$ 159604 171443 204699 221463 203049 193271 168726 153760 135894 143081 157037 165499 174402
19810A74402J1890K4173K661L722O163J7166j8390p599q027Q496L276j871O498
$$ 174402 186292 210465 213126 216848 223011 240177 221787 214188 206161 214657 217933 216062 222560
19797B22560N010j3425q376j4662r437M589k999j9409n2407l6803J6037L5731
$$ 222560 227570 214145 205769 191107 181670 186259 183260 163851 111444 74641 90678 126409
19785A26409k273k0727l085k5126k7403J2692R957J7233J9558N1253J3150k3851
$$ 126409 124136 103409 100324 75198 47795 60487 70444 87677 107235 158488 171638 147787
19773A47787K6081K6952K2170K0199q929j394J7129N563M5896N2945q565q79k0369
$$ 147787 173868 200820 222990 243189 234260 232866 249995 255558 301454 354399 345834 344955 324586
19760C24586N004j3856r101K564j2993o227k7577L42M9914K5813k143p227K6677
$$ 324586 329590 315734 306633 309197 296204 289977 262400 262742 312656 338469 336326 329099 355776
19747C55776K0813N033M5162J7605j13k0620j330k044K7417J746P926k704J4918
$$ 355776 376589 381622 426784 444389 444276 423656 422326 420282 447699 449445 457371 454667 469585
19734D69585r077K2071K9444M0547K5009O715O522L1331K3258J5319J0920p994
$$ 469585 460508 482579 512023 552570 577579 584294 590816 622147 645405 660724 671644 663650
19722F63650j5535J638Q82j1064K1144J0249K4836M9749O1665N6803N2239K3982
$$ 663650 648115 649753 650635 639571 660715 670964 695800 745549 807214 864017 916256 940238
19710I40238K8844L4579J2631K0434M7815K4532K7360L8852L8218N4180N6338
$$ 940238 969082 1003661 1016292 1036726 1084541 1109073 1136433 1175285 1213503 1267683 1324021
19699A324021L6648L8864N7443L3675N4957Q6359P3948P9841R1216R8902J47403
$$ 1324021 1360669 1399533 1456976 1490651 1545608 1631967 1705915 1785756 1876972 1975874 2123277
19688B123277J66550J87550K02446K41829K55645K81065L24756L29927L73464
$$ 2123277 2289827 2477377 2679823 2921652 3177297 3458362 3783118 4113045 4486509
19679D486509M17572M42615M77368N88216O73484P71670R34328J183048J429602
$$ 4486509 4904081 5346696 5824064 6412280 7085764 7857434 8791762 9974810 11404412
19670A1404412J796284K296158K955651L895678M975553O065528O881578P221197
$$ 11404412 13200696 15496854 18452505 22348183 27323736 33389264 40270842 47492039
19662D7492039P316372P431548P924144Q779177R422841Q808256O311820L031174
$$ 47492039 54808411 62239959 70164103 78943280 88366121 97174377 103486197 106517371
19654A06517371J032614P64328M62590j019873l052094m503638n116242n520118
$$ 106517371 107549985 108314313 108776903 107757030 104704936 100201298 95085056 89564938
19646H9564938o167066o861350p202611p312614p569782p823708p548241o685947
$$ 89564938 83397872 76536522 69333911 62021297 54451515 46627807 39079566 32393619
19638C2393619n566948m506833l566431k784376k161822j676047j358211j093449
$$ 32393619 26826671 22319838 18753407 15969031 13807209 12131162 10772951 9679502
19630I679502r18947q01793p14703n87427n09814n22346n04757m40874m00690
$$ 9679502 8760555 7958762 7244059 6656632 6146818 5624472 5119715 4678841 4278151
19621D278151l73724l32954l08558k56689k20104j92397j58000j77059j68289
$$ 4278151 3904427 3571473 3262915 3006226 2786122 2593725 2435725 2258666 2090377
19612B090377j40604j24127j19585j05040r4453r4858p0623o8239m9572m4575
$$ 2090377 1949773 1825646 1706061 1601021 1506568 1411710 1341087 1272848 1223276 1178701
19602A178701J3558j833k4354k0086l2291l9451k2054m4140l1770l119l4966m4806
$$ 1178701 1192259 1190426 1166072 1145986 1113695 1074244 1052190 1008050 976280 973161 938195 893389
19590H93389l254P980Q056K2018m829K71q42L7916L7870K5530K0761P231j8849
$$ 893389 890135 898115 906171 928189 923360 923631 922789 960705 998575 1024105 1044866 1052097 1033248
19577A033248J3740j5293k9051M452L6415j0273k2148o6611n8516k9139l9365
$$ 1033248 1046988 1031695 1002644 1007096 1043511 1033238 1011090 944479 885963 856824 817459
19566H17459n0815q226m008Q524M019M4202k8753k2228j4416o6543m1021J2129
$$ 817459 766644 758418 754410 762934 766953 811155 782402 760174 745758 679215 638194 650323
19554F50323j3690m0626k1904k7812l1885m173r695P97J1983J1289l9486j4111
$$ 650323 636633 596007 574103 546291 514406 510233 500538 501335 513318 524607 485121 471010
19542D71010q195k8842j4849P160J5527P116Q106J5751Q001J2207O690Q084N414
$$ 471010 462815 433973 419124 426284 441811 448927 457033 472784 480785 492992 499682 507766 513180
19529E13180J0488J7378j7613j3620J1673J6970Q019j0985k8548j0660J4278k8529
$$ 513180 523668 541046 523433 509813 521486 538456 546475 535490 506942 496282 510560 482031
19517D82031k9588l241j2205m0153l5394N038l4655l5365J2745j5021j0476m643
$$ 482031 452443 449202 436997 396844 361450 366488 331833 296468 309213 294192 283716 279073
19505B79073Q067j8739P194q477p931j6395j4703N98l1173k2057L1409J0245q384
$$ 279073 287140 268401 275595 267118 259187 242792 228089 228687 197514 175457 206866 217111 208727
19492B08727j3228p067M9313j401k9257j0372p676o670O549J2556J841p926J8464
$$ 208727 195499 188432 237745 236344 207087 196715 189039 182369 188918 201474 203315 195389 213853
19479B13853J3665L869j5483N768O061p430k3875j1669L622j2527J6656M702J8515
$$ 213853 227518 231387 215904 221672 227733 220303 196428 184759 188381 175854 192510 197212 215727
19466B15727j1727l7598L925K1169K0860P987m443J1477m611j9750k3557k2465
$$ 215727 204000 166402 170327 191496 212356 220343 215900 227377 222766 203016 179459 156994
19454A56994k284L1401M3374j4795k457K4496J9641q907l1057j9492K6462j9620
$$ 156994 154710 186111 229485 214690 212233 236729 256370 247463 216406 196914 223376 203756
19442B03756j1337L571m616Q35K742J4115L467K9783L587j6504k0564j1544r419
$$ 203756 192419 195990 191374 192209 194951 209066 212533 242316 245903 229399 208835 197291 187872
19429A87872R077L217n468j847k684j4775P547J1499j979J243J498q035j0897
$$ 187872 196949 200166 194698 192851 190167 175392 182939 194438 192459 193702 195200 187165 176268
19416A76268J7686P703N281J5636k102j3752N544j4543l5588K1732L0801Q946
$$ 176268 193954 201657 206938 222574 220472 206720 212264 197721 162133 183865 214666 223612
19404B23612P728j2698J0834n235k081k5531k5907o385K7652L8604K9336r87k8249
$$ 223612 231340 218642 229476 224241 222160 196629 170722 164337 191989 230593 259929 258942 230693
19391B30693k7421j3788J3460J3515K8942K5106K1606j2857j3307q629J5076m0138
$$ 230693 203272 189484 202944 216459 245401 270507 292113 279256 265949 257320 272396 232258
19379B32258k5631j2877m567K5594L9032J1968R846K4914J640r236R803R328J9614
$$ 232258 206627 193750 189183 214777 253809 265777 275623 300537 302177 292941 302744 312072 331686
19366C31686M948l276R795J0762J0992k1268l6001M0835K3509Q858m193j547K0986
$$ 331686 336634 333358 343153 353915 364907 343639 307638 348473 371982 380840 376647 375100 396086
19353C96086M3612J8180J7445L8657O3773R2263M4085L1895L0557J2916J526p211
$$ 396086 439698 457878 475323 513980 577753 670016 714101 745996 776553 789469 790995 783784
19341G83784K0414j6938m0155l1272k4023J124o709j0508r775j7819l9049j3445
$$ 783784 804198 787260 747105 715833 691810 692934 686225 675717 665942 648123 609074 595629
19329E95629m5021n4127k2305q360j0378j0930O666P900J8941N3639J5420Q672
$$ 595629 550608 496481 474176 465816 455438 444508 451174 459074 478015 531654 547074 555746
19317E55746K3543Q571o306j8622j8154l1983j3106k936j0158J100K4296J6372
$$ 555746 579289 587860 581554 562932 544778 512795 499689 496753 486595 487695 511991 528363
19305E28363M3716M7778M4090O137j9216r71J569J1307Q305M4616Q601j6038k9444
$$ 528363 572079 619857 663947 670084 650868 649897 651466 662773 671078 715694 724295 708257 678813
19292F78813n360K878L8857N7604R5355P6287P5373N5940M8332L6174K2108m9821
$$ 678813 673453 676331 715188 772792 868147 944434 1019807 1075747 1124079 1160253 1182361 1132540
19280A132540n7896o4694p8754p2830j4977m689K5655K6865K9415M9156N4620
$$ 1132540 1074644 1009950 931196 858366 843389 838700 864355 891220 920635 969791 1024411
19269A024411L9938M4071O3290R5888J38113J58625K52912L08114L38054K32202
$$ 1024411 1064349 1108420 1171710 1267598 1405711 1564336 1817248 2125362 2463416 2695618
19259B695618J01873o6052j45223j08912p06P4500J36621O7212n9709j66325k22966
$$ 2695618 2797491 2731439 2586216 2477304 2476598 2551098 2687719 2754931 2695222 2528897 2305931
19248B305931k46372j95284j07642m1789l4280l0027p390K3876K7072M8107M9778
$$ 2305931 2059559 1864275 1756633 1714844 1680564 1650537 1643147 1667023 1694095 1742202 1791980
19237A791980O3293N3907P3318R9203R5039J48379J80387K43299L21053M04384
$$ 1791980 1855273 1909180 1982498 2081701 2176740 2325119 2505506 2748805 3069858 3474242
19227C474242M77940O22019O59643O95498P08467O72045N60585L42500N7088k03542
$$ 3474242 3952182 4574201 5233844 5929342 6637809 7309854 7870439 8212939 8270027 8066485
19217H066485m09628n12940m60402l04879j40437K2461K01959L89913O01898Q22995
$$ 8066485 7656857 7143917 6683515 6378636 6238199 6260660 6462619 6852532 7454430 8277425
19207H277425J076948J441552K047314K803499L617183M318143M904903N268724
$$ 8277425 9354373 10795925 12843239 15646738 19263921 23582064 28486967 33755691
19199C3755691N130467M244458K808936J324129J62896j101541k610327l795624
$$ 33755691 38886158 43130616 45939552 47263681 47426577 46325036 43714709 39919085
19191C9919085m101752l450374k146768m03202J496151L296301M732772N442023
$$ 39919085 35817333 32366959 30220191 29816989 31313140 34609441 39342213 44784236
19183D4784236N471793N469577N783005N515071L526571O8452k837844m057759
$$ 44784236 50256029 55725606 61508611 67023682 70550253 70618705 67780861 63723102
19175F3723102m064664l902368l642917k659920p93146J369748L313820M430098
$$ 63723102 59658438 55756070 52113153 49453233 48660087 50029835 53343655 57773753
19167E7773753L670336Q19470k449181m028862m121607m159307m697622m766687
$$ 57773753 61444089 62263559 59814378 55785516 51663909 47504602 42806980 38040293
19159C8040293l654223j817139J42830J973112L881166N975803P635323Q265929
$$ 38040293 34386070 32568931 32711761 34684873 38566039 44541842 52177165 60443094
19151F0443094P636025N620310J700416l235774o065417n461026l038831k43511
$$ 60443094 68079119 73699429 75399845 72164071 66098654 60637628 57598797 57355286
19143E7355286K271013M217882N284313N094658L824322K401079J404741K82143
$$ 57355286 59626299 63844181 69128494 74223152 78047474 80448553 81853294 82135437
19135H2135437j759398m420488o629597p681556p745082o906906m996589k550058
$$ 82135437 80376039 75955551 69325954 61644398 53899316 46992410 41995821 39445763
19127C9445763p8597K280826M164372M915873L992066K318656J627258K106819
$$ 39445763 39367166 41647992 45812364 50728237 54720303 57038959 58666217 60773036
19119F0773036K043980j1053l288041n450788n672269n073711m570307l957984
$$ 60773036 62817016 62805963 59517922 54067134 48394865 43321154 38750847 34792863
19111C4792863k926556j747792o68233K69626J162467K238787L478257M928585
$$ 34792863 31866307 30118515 29450282 29719908 30882375 33121162 36599419 41528004
19103D1528004O856584R550357J3135002J7927455K3948956L0823277L6825315
$$ 41528004 48384588 57934945 71069947 88997402 112946358 143769635 180594950
19096A80594950L8974202L4835801K3279039N876316r996269j6927635j5603768
$$ 180594950 219569152 254404953 277683992 283560308 273564039 256636404 241032636
19089B41032636j1509867p788817n569566o334845j1770109k1579163k9900777
$$ 241032636 229522769 221733952 216164386 209829541 198059432 176480269 146579492
19082A46579492l0662724k5220467j8669752j3662779j0220327p771173n921552
$$ 146579492 115916768 90696301 72026549 58363770 48143443 40372270 34450718
19075C4450718m533274l551355k883089k489045k240891k028481j744499j472110
$$ 34450718 29917444 26366089 23483000 20993955 18753064 16724583 14980084 13507974
19067A3507974j181630r60816q74114p45098o75814o36437n90605n40170m40343
$$ 13507974 12326344 11365528 10491414 9746316 9070502 8434065 7843460 7303290 6862947
19058F862947m07092l81485l44432l35428k95018k19362k19533j38631r6164j25646
$$ 6862947 6455855 6074370 5729938 5394510 5099492 4880130 4660597 4521966 4425802 4300156
19048D300156j11649o5612n1703p9091m6514m663J01397K26053L71934L75850
$$ 4300156 4188507 4122895 4071192 3992101 3945587 3940924 4042321 4268374 4640308 5016158
19038E016158J58851r5803k37501k07604k9431K49447M70660N51671K99197k42728
$$ 5016158 5175009 5079206 4841705 4634101 4604670 4854117 5324777 5876448 6175645 5932917
19028E932917o90905r04252q55911o29970m17463l02140k07459j41564j50087
$$ 5932917 5242012 4337760 3481849 2851879 2434416 2132276 1924817 1783253 1633166
19019A633166j13290q7944r1513n5149l0925p2051n9221k8438l391J4260J9546
$$ 1633166 1519876 1431932 1340419 1285270 1254345 1182294 1123073 1094635 1091244 1105504 1125050
19008A125050j2729m6326k5546r941o5656q7449m9920j3524J4970K7877m032k2446
$$ 1125050 1112321 1065995 1040449 1030508 964852 877403 827483 813959 828929 856806 852774 830328
18996H30328l1052j2598N467J43j7018l4827l2546l3605r70l7738l9651m5444
$$ 830328 799276 786678 792145 792288 775270 740443 707897 674292 673322 635584 595933 550489
18984E50489m4460k4196Q474L331k2253k8461k9245l3108K0452J5212K098k104
$$ 550489 506029 481833 490307 493638 471385 442924 413679 380571 401023 416235 418333 416229
18972D16229O731O2493Q1875J05561J17127P3050K6562k1499k5271j1695J1734
$$ 416229 422960 485453 567328 672889 790016 863066 889628 868129 842858 831163 842897
18961H42897J7036P894j8988k6312m2514m1801m4298m0224n5915p7994o2333k5469
$$ 842897 859933 867827 848839 822527 780013 738212 693914 653690 597775 519781 457448 431979
18949D31979K27l991l6581m3948k2438l6922l3337l3767k0795N15o78O853K1279
$$ 431979 432206 428215 391634 347686 325248 288326 254989 221222 200427 200942 200264 207117 228396
18936B28396Q457R52k675J3066J1662j9012M4512K9971k2451r100N821N463k1121
$$ 228396 236853 237805 235130 248196 259858 240846 285358 315329 292878 283778 289599 295062 273941
18923B73941k3874j7771p304m961J8377j025k217M489J2810l946J2993K7397o802
$$ 273941 250067 232296 224992 220031 238408 237383 235166 239655 252465 248519 261512 288909 282107
18910B82107l654r588J6814q588k4603Q67J7984j966k2006l7658J6106n54q379
$$ 282107 278453 268865 285679 277091 252488 253355 271339 269373 247367 209709 225815 225261 216882
18897B16882j5589j5743j8432k432J7013j3535k2207J1405k194K4106K0010j0983
$$ 216882 201293 185550 167118 164686 181699 168164 145957 157362 155168 179274 199284 188301
18885A88301j8066m728J8770j3671J5930J5957J5302M946k8560r407q44n252m733
$$ 188301 170235 165507 184277 170606 186536 202493 217795 222741 194181 184774 183930 178678 173945
18872A73945j925L487j0705k7247J693K8979o591Q205p001j4422j5942N752L2759
$$ 173945 172020 175507 164802 137555 139248 168227 161636 169841 162840 148418 132476 138228 170987
18859A70987P822M578J9413j8368l9327J1807k5218k0427O490L5411K128J3054
$$ 170987 178809 183387 202800 184432 145105 156912 131694 111267 117757 153168 155296 168350
18847A68350R809o906l235K0526J8783k4994j8789R414J1399Q310O059K2536K7582
$$ 168350 178159 171253 168018 188544 207327 182333 163544 172958 184357 192667 198726 221262 248844
18834B48844Q376N024L219p970l921q858l1591m0925O828k9298j183J0809l855
$$ 248844 257220 262244 265463 257493 253572 244714 213123 172198 179026 149728 148545 159354 155499
18821A55499M4719L7733K642j2864j5951k8103K1056J5875Q894J2894k9543J3663
$$ 155499 200218 237951 240593 227729 211778 183675 204731 220606 229500 242394 212851 226514
18809B26514q4k2693j9396j4490j6279m471m136O198L2856k2894K6500K5498J5977
$$ 226514 226430 203737 184341 169851 153572 149101 144965 151163 184019 161125 187625 213123 229100
18796B29100j1817j268J289l435K5750J9993J9748j2237k6579J5463j943l3141
$$ 229100 217283 216015 217304 213869 239619 259612 279360 267123 240544 256007 254064 220923
18784B20923j0859k689J6488J1643l0130j3785k0089L3839K2324L9997j3286n415
$$ 220923 210064 207375 223863 235506 205376 191591 171502 205341 227665 267662 254376 248961
18772B48961j0260j8877l3322k7405l4917J6154L3965L311j1741k842K886J4985
$$ 248961 238701 219824 186502 159097 124180 140334 174299 177610 165869 163027 165913 180898
18760A80898J6175j0067j1251J0214n509j1560k8272o035L3902K5144j078j8692
$$ 180898 197073 187006 175755 185969 180460 168900 140628 134593 168495 193639 192561 173869
18748A73869L0866J4679l7151j1148q119M784M717j2864k7428L5452N9936J1800
$$ 173869 204735 219414 182263 171115 162996 167780 172497 159633 132205 167657 227593 239393
18736B39393O278K2108K9133k0807p489K3163j0503k1649l153L0018M2006j1101
$$ 239393 245671 267779 296912 276105 268616 291779 281276 259627 256474 286492 328498 317397
18724C17397n0608q870O315l238j1043j0014Q795R171j0887N814J1841l1241l3659
$$ 317397 266789 257919 264234 260996 249953 239939 248734 257905 247018 252832 264673 233432 199773
18711A99773k4967k0527k5199j2685K6707o431J6579K4955N1453O0630M2281M6745
$$ 199773 174806 154279 129080 116395 143102 136671 153250 178205 229658 290288 332569 379314
18699C79314Q1497O9105R3616Q1361R1287R174p2312o6769o0443l9756J1160J2581
$$ 379314 460811 529916 623532 704893 796180 805354 733042 666273 605830 566074 577234 589815
18687E89815J4668N0111Q4934R2953J48671J18594O1195j1741q0995j18891o9915
$$ 589815 604483 654594 739528 832481 981152 1099746 1160941 1149200 1068205 949314 879399
18676H79399m7844n4582m1899j1666j2031J0742J2450n321j5428k0885M106K3832
$$ 879399 831555 776973 735074 723408 711377 722119 734569 729248 713820 692935 697041 720873
18664G20873O6708N2825N9822J36585J65493J55469J39224M8064o0273j42636
$$ 720873 787581 840406 900228 1036813 1202306 1357775 1496999 1545063 1484790 1342154
18654A342154j18386j06855p5902m6157n6236k0003l490K0583M9971Q1827P8649
$$ 1342154 1223768 1116913 1041011 994854 938618 918615 915125 935708 985679 1067506 1146155
18643A146155Q4434O7730P8247R5940J10163J36510J72013J89713J98785J78286
$$ 1146155 1230589 1298319 1376566 1472506 1582669 1719179 1891192 2080905 2279690 2457976
18633B457976R2080L1411M8455R3740K04197L41682M85657M71170J71239j28835
$$ 2457976 2550056 2581467 2629922 2723662 2927859 3269541 3755198 4226368 4397607 4268772
18623D268772k04803q5963P5801J99589K60562L41875M43563O33727Q86443J151722
$$ 4268772 4063969 3978006 4053807 4253396 4513958 4855833 5299396 5933123 6819566 7971288
18613G971288J429467J674626J987745K041296J300554l52269j929528k342692
$$ 7971288 9400755 11075381 13063126 15104422 16404976 16052707 14123179 11780487
18605A1780487j807936j007465l20726K08205P19024J089467J214920R96321N37812
$$ 11780487 9972551 8965086 8644360 8852565 9571589 10661056 11875976 12872297 13410109
18596A3410109J43879J1997J08293L39693P44691J297883K035452L035067M411544
$$ 13410109 13553988 13565985 13674278 14013971 14758662 16056545 18091997 21127064 25538608
18587B5538608O378279R198376J2526219J5434486J6062510J2950423P480151
$$ 25538608 31916887 41115263 53641482 69075968 85138478 98088901 105569052
18580A05569052L088633p60873p779239j5287335j7276909j3924976r245096n313798
$$ 105569052 108657685 107896812 100117573 84830238 67553329 53628353 44383257 39069459
18572C9069459k314576J72097K499773M831445O934472P797608N837446O68984
$$ 39069459 36754883 36926980 39426753 44258198 51192670 58990278 64827724 65496708
18564F5496708n043396p787261o806619l994162r35342J893855M559060O911043
$$ 65496708 60453312 52666051 45859432 41865270 40929928 42823783 47382843 54293886
18556E4293886P865549N578298k55474n833691p209887m814082j086229K613937
$$ 54293886 62159435 67737733 67482259 61648568 54438681 49624599 48538370 51152307
18548E1152307N786530P265898M873127j734799q035723r626632p428740m175284
$$ 51152307 56938837 64204735 69077862 67343063 59307340 49680708 42251968 38076684
18540C8076684j073643J821207M665912P042256P624215M293117k367581p523334
$$ 38076684 37003041 38824248 43490160 50532416 58156631 62449748 60082167 52558833
18532E2558833q432456o633104m198659k016601j5614K025551M427997P366742
$$ 52558833 44126377 37493273 33294614 31278013 31262399 33287950 37715947 45082689
18524D5082689J1024174J5135904J7644807J4539790M274647q121460j6967758
$$ 45082689 56106863 71242767 88887574 103427364 107702011 99580551 82612793
18517H2612793j9360441j6328168j1733515p892240n289104l609334k491792j741766
$$ 82612793 63252352 46924184 35190669 27298429 22009325 18399991 15908199 14166433
18509A4166433j236180q62504o06579l95087k74511l15143m04345n98801p90835
$$ 14166433 12930253 12067749 11461170 11066083 10791572 10476429 10072084 9473283 8682448
18500H682448p89652o50708l82491L4798M33126R25270J359301J567858J077646
$$ 8682448 7892796 7242088 6859597 6894395 7327521 8252791 9612092 11179950 12257596
18491A2257596j33139j188668j559943j403812j216848j068041q97534o68829
$$ 12257596 12124457 10935789 9375846 7972034 6755186 5687145 4789611 4120782
18483D120782m46505l17189k31192j47940r738R7665J48141J27455j42988m17219
$$ 4120782 3674277 3357088 3125896 2977956 2968218 3065883 3214024 3341479 3198491 2781272
18473B781272m89841l66522k54631j84735j22016j29257j24381q9081r3460q3556
$$ 2781272 2291431 1924909 1670278 1485543 1363527 1234270 1109889 1020808 927348 843792
18463H43792n1413k6869q857j2638j5981Q81P3K4638J9609j4326k4791n2071m4434
$$ 843792 792379 765510 756653 744015 728034 728915 728988 753626 773235 758909 734118 682047 637613
18450F37613k6140o1425l2912l3371m7949m3057o032n696r504J2803l191j0557
$$ 637613 611473 550048 517136 483765 435816 392759 386727 381031 371527 384330 381139 370582
18438C70582o286k7743r461K217j8525l4749l053j6368R160J651j1612J4957k0404
$$ 370582 364296 336553 327092 329309 310784 276035 272982 256614 265774 267425 255813 270770 250366
18425B50366o184J5907K4047q223O48J7939K0289K1312l5756n0393l9069m0105
$$ 250366 244182 260089 284136 275913 276561 294500 314789 336101 300345 249952 210883 170778
18413A70778j4500j7605J5883L3602L7118M9739P759k5125j4027o806p526k0068
$$ 170778 156278 138673 154556 188158 225276 275015 282774 257649 243622 236816 229290 209222
18401B09222j2158n739J3302L2179J9251J3543K1994K5028K3194L856k623l5592
$$ 209222 197064 191325 204627 236806 256057 269600 291594 316622 339816 343672 341049 305457
18389C05457m9950l4292j3585m0090j1033j0316j4945j8700k1033k3815J9517
$$ 305457 255507 221215 207630 167540 156507 146191 131246 112546 91513 67698 87215
18378H7215K7458J8521r35j5866r557j5022q053p865K244R200j2331k7429N224
$$ 87215 114673 133194 132259 116393 106836 91814 83761 75896 78140 87340 75009 47580 52804
18365E2804m044j4716n42M7725L6458k182n613l050p424m348J9446j0473j5088
$$ 52804 48760 34044 33502 81227 117685 115503 109890 106840 99416 95068 114514 104041 88953
18352H8953K911K8428p019o363n770j3976k3047j4696k445j6663J55k456r381
$$ 88953 91864 120292 113273 106910 101140 87164 64117 49421 46976 30313 30468 28012 18631
18339A8631m223J0951J0683R481o305p137m910J5141J5075j0370M733J9505J2050
$$ 18631 14408 25359 36042 45523 39218 32081 27171 42312 57387 47017 51750 71255 83305
18326H3305l517j3269K937O474r75o118K1227l4271j8403l487L051K9011J6237
$$ 83305 79788 66519 69456 75930 74955 68837 90064 55793 37390 33903 36954 65965 82202
18313H2202k4796l1335J5271O500M4263J4415j8121J4721m4L411n845J151Q281
$$ 82202 57406 26071 41342 47842 92105 106520 88399 103120 103076 106487 100642 101793 110074
18300A10074J6709M805q063l3939r550m212q885n85L851P363K0347Q822L429l8002
$$ 110074 126783 131588 123525 89586 80036 75824 66939 66354 70205 77568 97915 106737 110166 72164
18286G2164k7316J0261M0671N664j0101M12j571J3052J5613k6840q40K8806j8586
$$ 72164 44848 55109 95780 101444 91343 91755 90184 103236 118849 92009 91169 119975 101389
18273A01389q412m6554j3525L2357J8015J8007K867J1256j4880K143l2L666M1887
$$ 101389 92977 46423 32898 65255 83270 101277 104144 115400 100520 102663 102631 106297 148184
18260A48184k8446n9555l0202k260O176K3132J1110j6724j5178L091J8602n940
$$ 148184 119738 60183 29981 27721 33897 57029 68139 51415 36237 39328 57930 51990
18248E1990k2223R530K600j1328J294M6308L0680J9121q356o045n3624o3381k5552
$$ 51990 29767 39297 41897 30569 31863 78171 108851 127972 119616 113571 59947 -3434 -28986
18235b8986J6021M6627K1187R853r511l2940m290j6385j9179k3164J0128K4794
$$ -28986 -12965 33662 54849 64702 55191 22251 17961 1576 -17603 -40767 -30639 -5845
18223e845l816j1867J3212J8858m839J9155L5042k974m1659j4887j1858L0225
$$ -5845 -9661 -21528 -8316 10542 5703 24858 59900 56926 15267 380 -11478 18747
18211A8747o487k34J1703j2663m816O130j9030j3026j3586L1112J6950q067j1026
$$ 18747 12260 12026 23729 11066 6250 12380 -6650 -19676 -33262 -2150 14800 6733 -4293
18198d293K014j1373P780J2473j3591K107o718j0277k1866P855M4086J5796n6766
$$ -4293 -2279 -13652 -5872 6601 -6990 -4883 -11601 -21878 -43744 -35889 8197 23993 -32773
18185c2773m4045m198J1623J3949K4138R064R288n5562r09J7290P880q054J1247
$$ -32773 -76818 -81016 -69393 -55444 -31306 -22242 -12954 -68516 -69425 -52135 -44255 -52309 -41062
18172d1062J9627J3763l6471p059K9348K1076j5717j751Q456J1309J3814P088
$$ -41062 -21435 -7672 -44143 -51202 -21854 -778 -16495 -18246 -9790 1519 15333 22421
18160B2421k1646j6742J083Q691k1321n484M05J5782P922P321r868m009k860K565
$$ 22421 775 -15967 -14884 -6193 -27514 -32998 -32593 -16811 -8889 -1568 -11436 -15445 -18305 -15740
18146a5740j0696j9317j184R288K9813R597o545J623N7n672n794J4380o468L881
$$ -15740 -26436 -45753 -46937 -37649 -7836 1761 -4784 -3161 -3104 -8776 -14570 -190 -6658 -2777
18132b777k993L6084n33J505N004m150l8147l7293J308P400K1580J5704K6008
$$ -2777 -5770 30314 29781 31286 36290 32140 -6007 -43300 -41992 -34592 -13012 2692 28700
18119B8700j1365J3067K9526m924j4108r424r88k8803Q364J2470K094J59j9236
$$ 28700 17335 30402 59928 55004 40896 31472 30484 1681 10045 22515 24609 24768 5532
18106E532k0997J3941L0584M5084J9161K0947N034P483L6846L9382J3396k2139
$$ 5532 -15465 -1524 29060 74144 93305 114252 119286 126769 163615 202997 216393 194254
18094A94254k357p944O108k0595k6717K511k119J4529K1882N811J3223N4N581
$$ 194254 191897 183953 190061 169466 142749 145260 143141 157670 179552 185363 198586 198640 204221
18081B04221k67k125q354M418j8238l0493L348P150j2108l9173l3409K7148J2898
$$ 204221 203954 201829 193475 197893 179655 149162 152510 159660 147552 108379 74970 102118 115016
18068A15016j6834k1053l191k1009J691J6880P157K2719L5280J8347K2256L1788
$$ 115016 98182 77129 73938 52929 54620 71500 78657 101376 136656 155003 177259 209047
18056B09047J0330q739J4670L1340J3520L3784j8841J2748K9310n322j0703k8438
$$ 209047 219377 210638 225308 256648 270168 303952 285111 297859 327169 321847 311144 282706
18044B82706j2179J3809N670K3144K5686m614l7745k197P425k4434r116j9018
$$ 282706 270527 284336 290006 313150 338836 334222 296477 294280 301705 277271 268155 249137
18032B49137q723J2947q703j1569L484J3349q023j3350P098M058l9360m8161k0733
$$ 249137 240414 253361 244658 233089 236573 249922 241899 228549 235647 239705 200345 152184 131451
18019A31451l4054k835J6158j6414M970L691j7334P658J533K8034J556r730q93
$$ 131451 97397 94562 110720 94306 99276 102967 85633 93291 94824 122858 124414 114684 113791
18006A13791P366N433k978l057m998N725J3895L8871J2548j3412j4276j0335j4147
$$ 113791 121157 126590 123612 120555 115557 121282 135177 174048 186596 173184 158908 148573 134426
17993A34426k8726L620L5692M7273K8909k2670m2735J9408J3440k9567k2191k0874
$$ 134426 105700 109320 145012 192285 221194 198524 155789 175197 188637 159070 136879 116005
17981A16005j3994J3635k0080k4314J000j7933m005N845m0463n536K4284n574
$$ 116005 102011 115646 95566 71252 72252 54319 50314 56159 15696 10160 34444 28870
17969B8870k680p491l1763J1821p96m969l047J502J174q74P324R985q344j1540
$$ 28870 26190 18699 -13064 -1243 -2039 -7008 -10055 -8553 -7379 -8253 -929 9056 712 -10828
17955a0828j2859J3327K550j4738K0320L043o960j4657p971j0920j5028j8529
$$ -10828 -23687 -10360 -7810 -22548 -2228 815 -6145 -20802 -28773 -39693 -54721 -73250
17943g3250J0789K7058q738K036J6153J1607Q916Q485m044l525J5193j3006j6144
$$ -73250 -62461 -35403 -44141 -42105 -25952 -14345 -5429 3056 -988 -4513 10680 -2326 -18470
17930a8470o079L5635q345k933j8060m396O724j2534l850J1459R293o614j2555
$$ -18470 -24549 11086 2741 -192 -18252 -22648 -15924 -28458 -32308 -20849 -11556 -18170 -30725
17917c0725n387j793K5442o084k5845O71k677K1964K6810J1465j0848k3593j4958
$$ -30725 -36112 -37905 -12463 -18547 -44392 -43721 -46398 -24434 2376 13841 2993 -20600 -35558
17904c5558k396j3786J5805J0818m987j222k456K9860L3104k3140n38p444j3767
$$ -35558 -37954 -51740 -35935 -25117 -30104 -31326 -33782 -3922 29182 6042 5504 -1940 -15707
17891a5707m0964l798Q087R560J4770n36k3978o010J8496J4457k9311j1394N906
$$ -15707 -56671 -60469 -52382 -42822 -28052 -28588 -52566 -58576 -40080 -25623 -54934 -66328 -60422
17878f0422J8022L7666Q925q630j0093l55N00m764J5493p482p046J5755L7966
$$ -60422 -42400 -4734 4191 -4439 -14532 -14887 -14387 -19151 -3658 -11140 -18186 -2431 35535
17865C5535P443p167l0649j2088j0291O975l551q558q211K153O313o396R159Q182
$$ 35535 42978 35811 5162 -6926 -17217 -10242 -13793 -22351 -30562 -28409 -22096 -28492 -19333 -11151
17851a1151L1607R351j5847l1278l1165j174j2570J4798J473o469K1002n097R533
$$ -11151 20456 29807 13960 -17318 -48483 -49657 -62227 -47429 -45956 -52425 -31423 -36520 -26987
17838b6987m360k45o442L5555J1684l1595j2071j180l412K1786J1974k080j0382
$$ -26987 -31347 -31592 -38034 -2479 9205 -22390 -34461 -35641 -39053 -17267 -5293 -7373 -17755
17825a7755k2201J3609L78k5652j8934j916K2303J1757J8707J4089j1655k757
$$ -17755 -39956 -26347 -25969 -51621 -70555 -72471 -50168 -38411 -19704 -5615 -17270 -20027
17813b0027K3615J3577j7859R682p5j1290j9928k9j1835J8832Q818J0123q141
$$ -20027 3588 17165 -694 8988 8913 -2377 -22305 -22334 -34169 -15337 -6519 3604 -4537
17800d537N779J0678j3107l5378M775K4864J5870j5363o331k520N917K7986K067
$$ -4537 1242 11920 -1187 -36565 -31790 -6926 8944 -6419 -12750 -15270 -9353 18633 20700
17787B0700j1641j4651j5633j3652O060q118p874k811j2363J5102K9939L0304
$$ 20700 9059 -5592 -21225 -34877 -28817 -36935 -44809 -47620 -59983 -44881 -14942 15362
17775A5362K956k2953j406m0783q67K0441K049n138Q573J3308P173J6277j9448
$$ 15362 18318 -4635 -6041 -46824 -47691 -27250 -25201 -30339 -21766 -8458 -1285 14992 -4456
17762d456j4088j4743J2984L7486k0016j8137r836j8543m982J6838K7084K6716
$$ -4456 -18544 -33287 -20303 17183 -2833 -20970 -30806 -49349 -54331 -37493 -10409 16307
17750A6307q90j0816j1055O874j5389l5992J6792k311k3242J3824K9788J5930
$$ 16307 15417 4601 -6454 420 -14969 -50961 -34169 -36480 -59722 -45898 -16110 -180
17738a80j0035K6207m992l218j7189j5344J2259M531k7467j9555J8077j2533L9918
$$ -180 -10215 15992 11000 7782 -9407 -24751 -12492 -7961 -35428 -54983 -36906 -49439 -9521
17725i521K7597j8046k7303K2033l067p76n847K7144R570j5237k8248k6480K1867
$$ -9521 18076 30 -27273 -5240 -8307 -9083 -14930 12214 21784 6547 -21701 -48181 -26314
17712b6314l946j4003m815r504K3444K2728J1826k220l912k687j9142k1986j3795
$$ -26314 -30260 -44263 -49078 -58582 -35138 -12410 -584 -2804 -6716 -9403 -28545 -50531 -64326
17699f4326L131K7941k027J933J349K941k358P333k0430m690K7363r712r781L994
$$ -64326 -61195 -33254 -35281 -33348 -31999 -29058 -31416 -24083 -44513 -49203 -21840 -31552 -41333 -37339
17685c7339j9054J6446K2815k04l0040k1074j0815o012R018p298J0516J8981J0508
$$ -37339 -56393 -39947 -17132 -17336 -47376 -68450 -79265 -85277 -76259 -83557 -73041 -54060 -43552
17672d3552L0086J3034L835l946J558j6158q447m746O834J1908J8278j1648k0874
$$ -43552 -13466 -432 3403 -543 1015 -15143 -23590 -28336 -21502 -9594 8684 -2964 -23838
17659b3838J1336L412P520o472l742j0928j649k0914k7969J190K5668J6433P557
$$ -23838 -12502 -9090 -1570 -8042 -11784 -22712 -24361 -45275 -73244 -72054 -46386 -29953 -22396
17646b2396j4472J252J8591J2409r371K2736N925l4000k5564j5770j3073K2023
$$ -22396 -36868 -35616 -17025 -4616 -13987 8749 14674 -19326 -44890 -60660 -73733 -51710
17634e1710L6002K3485j8388j3824L4896K4714j6397l2291r322l0965j9108J8233
$$ -51710 -15708 7777 -10611 -24435 10461 35175 18778 -13513 -22835 -53800 -72908 -54675
17622e4675N014j506K0316J1289j284R78L155k3768J3933K6771L1023K7302k5248
$$ -54675 -49661 -51167 -30851 -19562 -20846 -19868 -16713 -40481 -26548 223 31246 58548 33300
17609C3300m3609p67M093L456r38l248K0838q66j1613j9520l4688J8860L4533
$$ 33300 -10309 -11076 -6983 -3527 -4465 -7713 13125 12259 646 -18874 -53562 -34702 -169
17596a69m41m8840K219L0822K4438Q85k0231k0241L007J984J4775l809m716o105
$$ -169 -610 -49450 -47231 -16409 8029 8914 -11317 -31558 -28551 -26567 -11792 -15601 -20317 -26422
17582b6422p826J0974J0529o958k4512l4597j3729J042J9410J5070O453Q161N635
$$ -26422 -34248 -23274 -12745 -19703 -44215 -78812 -92541 -91499 -72089 -57019 -50566 -42405 -36770
17569c6770r166l9k0078J1802R576J3700J7042j8338m881J6946K6275m0841k9093
$$ -36770 -45936 -45975 -66053 -54251 -44675 -30975 -13933 -32271 -37152 -20206 6069 -34772 -63865
17556f3865K4268M2762L7547n451j6736n990K003k7522J370n618J8569P269r331
$$ -63865 -39597 3165 40712 35261 18525 12535 14538 -12984 -11614 -17232 1337 8606 -725
17543g25l8511j5278J836K7511K6940K6918l9725l4449O693j4621K4185K4383
$$ -725 -39236 -54514 -52678 -25167 1773 28691 -11034 -45483 -38790 -53411 -29226 -4843
17531d843j6637J2989L128j9255M194o600j1055R205k235p002N214N121L1457
$$ -4843 -21480 -8491 -5363 -24618 -20424 -27024 -38079 -28874 -31109 -38111 -32897 -27776 3681
17518C681o228N229l2417k9615l2358K3159L4859K880j1666q728j2818K1834J0315
$$ 3681 -2547 2682 -29735 -59350 -91708 -68549 -33690 -30810 -42476 -51204 -64022 -42188 -31873
17505c1873l821L92J7324k1016J1711k285l423K7233N659l666R433m17k9981m312
$$ -31873 -35694 -35302 -17978 -38994 -27283 -29568 -32991 -5758 -99 -3765 5668 5251 -24730 -29042
17491b9042j9246K519J4828n492K6826%J0324O898j3425l029k8514j7103j1785
$$ -29042 -48288 -45769 -30941 -36433 -9607 -9607 717 7615 -5810 -8839 -37353 -54456 -66241
17478f6241J5217J3290K4496L6354J4989j5082k0013j9985j18j0626k430K3145
$$ -66241 -51024 -37734 -13238 23116 38105 23023 3010 -16975 -17093 -27719 -30149 -7004
17466g004L7506j14j97k6549r757l536k3137n786Q251J6179k5013j7915O297K0574
$$ -7004 30502 30388 30191 3642 -6115 -9651 -32788 -38574 -30323 -14144 -39157 -57072 -50775 -30201
17452c0201K6258J2875J6985j2491j0920l4731J2361J7878k4086J1467J4695m3347
$$ -30201 -3943 8932 25917 13426 2506 -32225 -19864 -1986 -26072 -14605 90 -43257
17440d3257k8297L3710J4095Q019J1343k3369N701N196j3769n924P710q29Q396
$$ -43257 -71554 -37844 -23749 -15730 -4387 -27756 -22055 -16859 -30628 -36552 -28842 -29671 -21275
17427b1275K5222K722l0188j2484M808K478L824N463k7926J1356J4652J3623M308
$$ -21275 3947 6669 -23519 -36003 -31195 -28717 -24893 -19430 -47356 -36000 -21348 -7725 -3417
17414c417J2594j3790j9937r53l932k6k938J2244J1864P07k983r454p419r978
$$ -3417 9177 -4613 -24550 -25503 -29435 -29461 -32399 -20155 -8291 -7584 -10567 -20021 -27440 -37418
17400c7418k798J3790K3346J6541K406k3538j4237n582R780j0158j7380J6427
$$ -37418 -40216 -26426 -3080 13461 15867 -7671 -21908 -27490 -17710 -27868 -45248 -28821
17388b8821L5154M670L0119O381j0381k8487K337M235m7917l290J1244K787K1426
$$ -28821 6333 11003 41122 47503 37122 8635 10972 15207 -32710 -36000 -24756 -21969 -543
17375e43k3132j1765J349j7462n400L9522J4036o311N913j4620k352K3577q061
$$ -543 -23675 -35440 -34091 -51553 -56953 -17431 -3395 -9706 -3793 -18413 -20765 2812 -5249
17362e249j0413n682l173n269o806J6815j4839r992L0048p464J164J0425m55q728
$$ -5249 -15662 -21344 -24517 -29786 -36592 -19777 -34616 -44608 -14560 -22024 -20860 -10435 -10890 -19618
17348a9618p639L069P024J0562P076j7171l833J9049o776p898L793j8180j5896
$$ -19618 -27257 -24188 -17164 -6602 474 -16697 -20530 -1481 -8257 -16155 -12362 -30542 -46438
17335d6438J3777K1522q546j1681O827l161j5814n597J452j4192j2865J3670K4707
$$ -46438 -32661 -11139 -19685 -31366 -24539 -27700 -43514 -49111 -47659 -61851 -74716 -61046 -36339
17322c6339L783r620R358K0169J0260J1926J3349L145j1856j4345J0518Q403k8513
$$ -36339 -32556 -42176 -32818 -12649 -2389 9537 22886 26031 14175 -170 10348 18751 -9762
17309i762j8083l920J1307K0589k814P82Q937j5380m078r984l973n156J7345j6337
$$ -9762 -27845 -31765 -20458 131 -2683 -1901 7036 -8344 -12422 -22406 -26379 -31535 -14190 -30527
17295c0527q60L3636J089J6161O948N05L388m4064N444P161o953J5382k635j8237
$$ -30527 -31387 2249 3338 19499 26447 26952 30340 -13724 -8280 -1119 -8072 7310 4675 -13562
17281a3562j4616L0723K73j3533q188K4125O400J3447o466k8950O960R159o607
$$ -13562 -28178 2545 2818 -10715 -18903 5222 11622 25069 18603 -10347 -3387 5772 -835
17268h35k6471j1464N745K4610K8915j9252k435n786M902l862J1107j733J0794
$$ -835 -27306 -38770 -33025 -8415 20500 1248 -1187 -6973 -2071 -5933 5174 3441 14235
17255A4235q10m72j4466k3153j6544j8693m674K8479L605L900Q698j8258k1947
$$ 14235 13425 12953 -1513 -24666 -41210 -59903 -64577 -36098 -32493 -28593 -19895 -38153 -60100
17242f0100J8709M797j377r246p728J0860K4436q944J1962K1837J3511n719J0624
$$ -60100 -41391 -36594 -37971 -47217 -54945 -44085 -19649 -28593 -16631 5206 18717 12998 23622
17229B3622J0250j7012L395L1153k6495k9773J2679J1577K5569j0309J0252J8270
$$ 23622 33872 16860 20255 51408 24913 -4860 7819 19396 44965 34656 44908 63178
17217F3178L947j4676j218p461k168J3675l7251k8362K895Q194O677l602o826
$$ 63178 67125 52449 51231 43770 41602 55277 18026 -10336 -7441 753 7430 3828 -2998
17204b998k248j574J8738j0259Q145l613L918m955k8800j0177M1154L0235O317
$$ -2998 -5246 -6820 11918 1659 9804 6191 10109 5154 -23646 -33823 7331 37566 43883
17191D3883j0949n0120k4362J2434K6226K4897J0859P350J3567j8710k2371n469
$$ 43883 32934 -17186 -41548 -29114 -2888 22009 32868 40218 53785 35075 12704 7235
17179G235q946m873m830J9867l75k720J1624K3309J1619p043j542j3231l0055
$$ 7235 -1711 -6584 -11414 8453 8078 5358 16982 40291 51910 44867 43325 30094 39
17166C9j5464k2207k7395K991J9856J6448o188R389N299O831k4163L014O313J4552
$$ 39 -15425 -37632 -65027 -62036 -42180 -25732 -31920 -22531 -17232 -10401 -34564 -31550 -25237 -10685
17152a0685J1142R816L1889J4790r750k016k1691q341p438l5755K766J2058J8965
$$ -10685 457 10273 42162 56952 47202 45186 23495 15154 7716 -28039 -25273 -13215 5750
17139E750K0920l5766K563L054n109J7046J2487k6461J319k2219j986K038K901
$$ 5750 26670 -9096 -6533 -3479 -8588 8458 20945 -5516 -4197 -26416 -28402 -26364 -23463
17126b3463K2876L4330J1280j9553l8398K2559J7930j0387O685k0292k6604J1759
$$ -23463 -587 33743 45023 25470 -12928 9631 27561 17174 23859 3567 -23037 -11278
17114a1278J0166j2858P484L037P702J8310M56L672p261j1086m81N128J9302n348
$$ -11278 -1112 -13970 -6486 -3449 4253 22563 23019 26691 19430 8344 7863 12991 32293 26945
17100B6945k2688M013J7158j1594J4802L1908k4046m1411j7028J0028n571L675
$$ 26945 4257 8270 25428 13834 28636 60544 36498 -4913 -21941 -11913 -17484 -13809
17088a3809J488J0690l664O510n640m037j8203N652K4704m145R147P071j9751
$$ -13809 -12321 -1631 -5295 1215 -4425 -8462 -26665 -21013 3691 -454 8693 15764 -3987
17075c987j4054M95K1793L1803R372r108k2279j2749O691J2897r987J2857K1289
$$ -3987 -18041 -17546 4247 36050 45422 36314 14035 1286 7977 20874 10887 23744 45033
17062D5033l0126k402K8446J1644k0526l8523k0552J0835Q669P70n494K2152J5457
$$ 45033 14907 12505 40951 52595 32069 -6454 -27006 -16171 -7502 -6732 -12226 9926 25383
17049B5383j0731N687J0762J2428J339p675k6168o69K649l727N609K3114j46j5380
$$ 25383 14652 20339 31101 43529 44868 37193 11025 10356 13005 9278 14887 38001 37855 22475
17035B2475Q821J3365J972Q959j0517k2583j3143J2205M386N121k5783K8007l181
$$ 22475 31296 44661 46633 55592 45075 22492 9349 21554 25940 31061 5278 33285 30104
17022C0104j6539L3841M210l3043j4133k229r266m274m660j2470K6727J117j1518
$$ 30104 13565 47406 51616 18573 4440 2211 -7055 -11329 -15989 -28459 -1732 -615 -12133
17009a2133L3993j371k5450l353O136j15j3332o178N473M239J3140O297P931k2641
$$ -12133 21860 20489 -4961 -8314 -2178 -2293 -15625 -21803 -16330 -12091 1049 7346 15277 -7364
16995g364K38K897L149J5265J4135k188J641l990n10L970q911K2364J0388k4626
$$ -7364 -7126 -4229 -1080 14185 28320 26132 27773 23783 23273 27243 18332 40696 51084 26458
16981B6458O822J2188K380j4561J2044l2829o849M7089l152m9387j4864J9985
$$ 26458 33280 45468 47848 33287 45331 12502 5653 52742 49590 203 -14661 5324
16969E324n59J0625R383P757J758J887j5669J9898J8086k3593j4380L7069J5914
$$ 5324 4765 15390 24773 32530 34288 36175 20506 40404 58490 34897 20517 57586 73500
16956G3500l3375l3998Q125j0099J53R263j6338K257J4315K7714J5025q342k4596
$$ 73500 40125 6127 14252 4153 4306 13569 -2769 -512 13803 41517 56542 48200 23604
16943B3604l228j0740k6295j7338Q303O708N493j090J9651j8508j6580O222J6125
$$ 23604 20376 9636 -16659 -33997 -25694 -18986 -13493 -14583 5068 -13440 -30020 -23798 -7673
16930g673M923k260k3288j6227J366J0873P995N980o97Q564k048R541J0398O439
$$ -7673 -2750 -5010 -28298 -44525 -43159 -32286 -24291 -18311 -19008 -10444 -12492 -2951 7447 13886
16916A3886j996k04l138o288k92K5965M3j0205k0762k434o414J1965J741n076
$$ 13886 11890 11686 8548 2260 1968 27933 27976 17771 -2991 -5425 -11839 126 1867 -3209
16902c209k282J3096J0003j0182r500R967j357L303J607K071J5047M29k20P136
$$ -3209 -5491 7605 17608 7426 -2074 7893 6536 9839 11446 13517 28564 28993 28773 35909
16888C5909L352J5609j622l5450l2668k4863J8175k89K8208K4022r060k3269l732
$$ 35909 39261 54870 53248 17798 -14870 -39733 -21558 -21847 6361 30383 21323 -1946 -5678
16875e678K6630J5405N219j9877j3410N794m021j652N307Q763J7513L113j1251
$$ -5678 20952 36357 41576 21699 8289 14083 10062 8410 13717 22480 39993 43106 31855
16862C1855k4868M015K4652K9818K2471o112j0174N970j011l3275l9041J1509
$$ 31855 6987 11002 35654 65472 87943 81831 71657 77627 76616 43341 4300 15809
16850A5809J1442m434N196J0193M642j0343j3892l6709K668J2852L5274m368j7474
$$ 15809 27251 22817 28013 38206 42848 32505 18613 -18096 -15428 -2576 32698 28330 10856
16837A0856j580j909k2957r526J7829J7597J0460j3529q938J9354L316J025J8593
$$ 10856 9276 7367 -15590 -25116 -7287 10310 20770 7241 -1697 17657 20973 21998 40591
16824D0591L2062o290j0035K637j288k8918j0221j7319j2382K6575J0131j4340
$$ 40591 72653 66363 56328 58965 57677 28759 18538 1219 -11163 15412 25543 11203
16812A1203m2344K9768M5879k5280k4492J8181k9365k2083Q318j2293K5892M6634
$$ 11203 -31141 -1373 44506 19226 -5266 12915 -16450 -38533 -30215 -42508 -16616 30018
16800C0018P358J7563j2726n266K2321P961j5437O285l3496J0013J3316q410j0868
$$ 30018 37376 54939 42213 36947 59268 67229 51792 58077 24581 34594 47910 39500 28632
16787B8632j9745j3323k9136o845L4171J2254J0420j0398J4578J1166M288L0686
$$ 28632 8887 -4436 -33572 -40417 -6246 6008 16428 6030 20608 31774 36062 66748
16775F6748j0182n877k935o213j2312N529j8597N264r403N328L7210K059k3202
$$ 66748 56566 50689 47754 41541 29229 34758 16161 21425 12022 17350 54560 56619 33417
16762C3417J834J2572p643N191j1103J8748l312k7939n703j4740N228K9754O888
$$ 33417 35251 47823 40180 45371 34268 53016 49704 21765 16062 1322 6550 36304 43192
16749D3192n487m594M275j5228k3034R977L3602K946j70j0595j1892n634J1945
$$ 43192 37705 33111 37386 22158 -876 9101 42703 45649 45479 34884 22992 17358 29303
16736B9303j1530k914J5401j3562k0488K0620K3193j1722Q475L3273J1699r158
$$ 29303 17773 14859 30260 16698 -3790 16830 40023 28301 36776 70049 81748 72590
16724G2590j1582j141N365j433m433j3459k7790j7665o76O502Q341j715n863J536
$$ 72590 61008 59867 65232 63799 59366 45907 18117 452 -224 6278 14619 12904 7041 8577
16710H577L318L0607r638m478j4764K754L3234L7734j8979j5399m086j5889M352
$$ 8577 11895 42502 32864 28386 13622 16376 49610 87344 68365 52966 48880 32991 37343
16697C7343J5289K7298L541k9965J2537K4609L103p214N437P058L27k0655k4825
$$ 37343 52632 79930 83471 53506 66043 90652 93755 86541 91978 99036 99363 78708 53883
16684E3883J287j7489n617Q842J8341l4369N120J0495M221K838L583j7249J0867
$$ 53883 55170 37681 32064 40906 59247 24878 29998 40493 44714 47552 51135 33886 44753
16671D4753Q500p023j9197j183J8354K585R55K4448K6752O074n625k6394L0690
$$ 44753 53253 46230 27033 25850 44204 46789 47744 72192 98944 105018 99393 72999 103689
16658A03689J4915j3208k3753k2775J7878q889l987J7734q39l3717k079M158m09
$$ 103689 118604 105396 81643 58868 76746 67857 63870 81604 80765 47048 44969 49127 48718
16645D8718J722o996n252J1258J3409J0820k955j7128J092L2771J3575k0273o940
$$ 48718 50440 43444 38192 49450 62859 73679 70724 53596 54688 87459 101034 80761 73821
16632G3821k414J005n672o160L0865M841J0249K3444p233l677k8024m763K3904
$$ 73821 71407 72412 66740 60580 91445 96286 106535 129979 122746 119069 91045 86282 110186
16619A10186P788j9318r21m035j0963k4774J971r962M257J3052J722j7910j8743
$$ 110186 117974 98656 97735 93700 82737 57963 59934 49972 54229 67281 69003 51093 32350
16606C2350K807Q242K4655r849p507R695j273M548M098P281j7506K2995K7124
$$ 32350 35157 43399 68054 58205 50698 60393 59120 63668 67766 75047 57541 80536 107660
16593A07660j2562J8770J749k9078j8837j1142K3297J4535o247o575K8624J1219
$$ 107660 95098 113868 115617 86539 67702 56560 79857 94392 88145 81570 110194 121413
16581A21413p229J2328Q68j8954K112l3007j4413o336J4747Q821j3860j5208K989
$$ 121413 114184 126512 127380 108426 110538 77531 63118 56782 71529 80350 66490 51282 54271
16568E4271k0586k31J0626J6140O366k866K226k822l480J5733J3600j7839m573
$$ 54271 33685 33454 44080 60220 66586 63720 65946 63124 59644 75377 88977 71138 66565
16555F6565J8755J2408r574J0593k105j0225J2229j0351Q627O414L428K4155K2765
$$ 66565 85320 97728 88154 98747 96642 86417 98646 88295 96922 103336 106764 130919 153684
16542A53684N885j8421m9466j1812K4030L92M447J3734q237j2531N490O39K896
$$ 153684 159569 141148 91682 79870 103900 104292 108739 122473 114236 101705 107195 107834 110730
16529A10730p525j3811q55j0330P372q843J1933K7248R249j0927l440K3464K341
$$ 110730 103205 89394 88539 78209 85581 76738 88671 115919 125168 114241 110801 134265 136606
16516A36606K796m754p539m594N444o373j3165N8k692q672L809J1302j416J2565
$$ 136606 139402 134648 127109 122515 127959 121586 108421 108479 105787 97115 100924 112226 110810 123375
16502A23375J0178J9417l0188k2817N579J2121J8962K4419j8980l6556r365K3668
$$ 123375 133553 152970 122782 99965 105544 117665 136627 161046 142066 105510 96145 119813
16490A19813Q813P389q307q967O974J9963N62j7008l1368K216J9937N233M257
$$ 119813 128626 136015 127708 118741 125715 145678 146240 129232 97864 100080 120017 125250 129507
16477A29507j4875M134l636L5207P11L3640J1762m604P205m285l1649j2811J5840
$$ 129507 114632 118766 115130 150337 151048 184688 196450 191846 199051 194766 163117 150306 166146
16464A66146n383k1888R171J5999j2484Q754J844j3454r471j4049j5701O519K5052
$$ 166146 160763 138875 148046 164045 151561 160315 162159 148705 139234 125185 109484 116003 141055
16451A41055n079j1090Q047J3010K2425K0040J453k1653j1960j7725M788l828
$$ 141055 135976 124886 132933 145943 168368 188408 189861 168208 156248 138523 143311 139483
16439A39483k0922K1330L3690L7296J815Q337L278j9107l2100j4420L421K3798
$$ 139483 118561 139891 173581 210877 212692 221029 224307 205200 173100 158680 162101 185899
16427A85899l814R773J278k600K2188o120p13K1507R901j5648k6633J1104J2858
$$ 185899 182085 191858 193136 190536 212724 206604 205891 227398 237299 221651 195018 206122 218980
16414B18980J1739j7592p585r716O395r921j1565n513J4448K8297J66r163K9623
$$ 218980 230719 213127 205542 195826 202221 192300 180735 175222 189670 217967 218133 208970 238593
16401B38593J0050j2267M628j7771J5140K983j2034k5377m745O341K5094O346
$$ 238593 248643 236376 241004 223233 238373 241356 229322 203945 199200 205541 230635 236981
16389B36981J8604J1473Q421k2534n207M631j0058o192j0037M15j236K607J9011
$$ 236981 255585 267058 275479 252945 247738 252369 242311 236119 226082 226497 225261 227868 246879
16376B46879J4621j0110r966j5425k5235N899R065J5275J1028J062J9188q434
$$ 246879 261500 251390 241424 225999 200764 206663 215728 231003 242031 243093 262281 253847
16364B53847j4902j279l28l429K1839K9774J0604j5994J2282K6435L3150K5027
$$ 253847 238945 237666 237338 233909 255748 285522 296126 280132 292414 318849 351999 377026
16352C77026M3254j943J6389O120k3627L8977L0020n380M1828M6909M3157N0855
$$ 377026 420280 418337 434726 440846 417219 456196 486216 480836 522664 569573 612730 663585
16340F63585K0641J3946K7001K8003k9224j3049l5340n8402k0420l754m0075n542
$$ 663585 684226 698172 725173 753176 723952 710903 675563 617161 596741 592987 552912 547370
16328E47370j2013l2920k3699K1011L2434j6624j6822k746k5608j6607M945J5485
$$ 547370 535357 502437 478738 499749 532183 515559 498737 495991 470383 453776 458721 474206
16316D74206M6121L1984j1611k6092k3648K3143K074o767R031r503o023K0094
$$ 474206 520327 552311 540700 514608 490960 514103 516177 509410 518441 508938 502915 523009
16304E23009L8494o95o215J4826p383j5381r452K775J6833K979j0384N853l214
$$ 523009 561503 560808 554593 569419 562036 546655 537203 539978 556811 559790 549406 555259 552045
16291E52045k1138j5037q525O388K3749N648j1819J7067J7779P434l660k9750
$$ 552045 530907 515870 507345 513733 537482 543130 531311 548378 566157 573591 569931 540181
16279E40181l1380j3112K5672K6647k252K4003K1616j266p886L725J5540O819
$$ 540181 508801 495689 521361 548008 545756 569759 591375 590109 582223 585948 601488 608307
16267F08307j3089P30R438j731K1130J3981k2570J2446K6794j4590J6750J6286
$$ 608307 595218 595948 605386 603655 624785 638766 616196 628642 655436 640846 657596 673882
16255F73882O043m623j3152k3590J9818J9708k74K2627K2702J6325o52r770K2563
$$ 673882 679925 675302 662150 638560 658378 678086 677812 700439 723141 739466 738814 729044 751607
16242G51607M9991J6942J0048J0044k0874l6362m122K5728K2300L5823p818K4767
$$ 751607 801598 818540 828588 838632 817758 781396 777274 803002 825302 861125 853307 878074
16230H78074K4398j0822L03j2876K0363K0075K8021L7220J6257P150J5029J7778
$$ 878074 902472 891650 891953 879077 899440 919515 947536 984756 1001013 1008163 1023192 1040970
16218A040970O030L108Q737O948K865L8121L320j2579J4578K006L806J7010J9445
$$ 1040970 1047000 1050108 1058845 1065793 1068658 1106779 1110099 1097520 1112098 1114104 1117910 1134920 1154365
16205A154365N3580L3464p037O902K3320k4881p852L8246R527l0272j4633J5765
$$ 1154365 1207945 1241409 1234372 1241274 1264594 1239713 1231861 1270107 1279634 1249362 1234729 1250494
16193A250494J216l592M2726M4050M8024L7978L0911L4468O3641L128k0700N1046
$$ 1250494 1251710 1248118 1290844 1334894 1382918 1420896 1451807 1486275 1549916 1553044 1532344 1583390
16181A583390Q6724M3390L6982L7722L0295J7509M4050K4793L8022L4887K6002
$$ 1583390 1670114 1713504 1750486 1788208 1818503 1836012 1880062 1904855 1942877 1977764 2003766
16170B003766L0798M605L2217P0524P2512M0371M8341O5848N6433L3692L8314
$$ 2003766 2034564 2039169 2071386 2141910 2214422 2254793 2303134 2368982 2425415 2459107 2497421
16159B497421K2045O7748N3868N8702P1105N6516O2465P2527R0068N2413M7167
$$ 2497421 2519466 2587214 2641082 2699784 2770889 2827405 2889870 2962397 3052465 3104878 3152045
16148C152045N8090P5269J07620J05669Q4556J00569N5832Q3166R8326J03788
$$ 3152045 3210135 3285404 3393024 3498693 3583249 3683818 3739650 3822816 3921142 4024930
16138D024930J06396P2073P7607J06115J35130J25296J21056J47752J45940J65256
$$ 4024930 4131326 4203399 4281006 4387121 4522251 4647547 4768603 4916355 5062295 5227551
16128E227551J60539J53042J65445J61489J89190J91071J89398K09958K09839
$$ 5227551 5388090 5541132 5706577 5868066 6057256 6248327 6437725 6647683 6857522
16119F857522K15350K51027K40888K62882K87829K90031K92031L59475L43713
$$ 6857522 7072872 7323899 7564787 7827669 8115498 8405529 8697560 9057035 9400748
16110I400748L37715L95148L90038M24077M62879M69604N20898N67025N88497
$$ 9400748 9738463 10133611 10523649 10947726 11410605 11880209 12401107 12968132 13556629
16101A3556629O28010O86637P10684P50101Q02729Q67128R53915J004480J096588
$$ 13556629 14184639 14871276 15581960 16332061 17134790 18001918 18955833 19960313 21056901
16092B1056901J190384J257202J357487J480445J639484J730030J843978J998235
$$ 21056901 22247285 23504487 24861974 26342419 27981903 29711933 31555911 33554146
16084C3554146K180328K383829K592585K797162L010072L231948L456905L697297
$$ 33554146 35734474 38118303 40710888 43508050 46518122 49750070 53206975 56904272
16076E6904272L953722M184132M393106M576457M705053M777904M740014M576771
$$ 56904272 60857994 65042126 69435232 74011689 78716742 83494646 88234660 92811431
16068I2811431M268569L873982L311646K580048J717488P84079j58507j109615
$$ 92811431 97080000 100953982 104265628 106845676 108563164 109347243 109188736 108079121
16060A08079121j989617k783110l471647l964528m346662m565358m673685m675735
$$ 108079121 106089504 103306394 99834747 95870219 91523557 86958199 82284514 77608779
16052G7608779m575169m434272m236772m027463l818882l598249l349762l119815
$$ 77608779 73033610 68599338 64362566 60335103 56516221 52917972 49568210 46448395
16044D6448395k893402k717330k524042k307924k155120j994272j836174j705565
$$ 46448395 43554993 40837663 38313621 36005697 33850577 31856305 30020131 28314566
16036B8314566j602112j461562j337357j269670j142085j062948j013232r82391
$$ 28314566 26712454 25250892 23913535 22643865 21501780 20438832 19425600 18443209
16028A8443209r22736q33758p73527p23939o70639o22271n95491n68130n34953
$$ 18443209 17520473 16686715 15913188 15189249 14518610 13896339 13300848 12732718 12197765
16019A2197765n05680m88858m84984m41876l81274l76226l41444l47236l42986
$$ 12197765 11692085 11203227 10718243 10276367 9895093 9518867 9177423 8830187 8487201
16010H487201l39874k98298k60774k51634k32688k03661k43100k45323j91003
$$ 8487201 8147327 7849029 7588255 7336621 7103933 6900272 6657172 6411849 6220846
16001F220846j93910j76416j67649j70581j80333j63083j60836j41448j14812
$$ 6220846 6026936 5850520 5682871 5512290 5331957 5168874 5008038 4866590 4751778
15992D751778j52489j39151j37677j04634r3515r8454j23227j23102j03775r5556
$$ 4751778 4599289 4460138 4322461 4217827 4124312 4025858 3902631 3779529 3675754 3580198
15982C580198n7080n4248r2165r4869r2254n6638n0603o2228o0200n8887r3878
$$ 3580198 3523118 3468870 3376705 3281836 3189582 3132944 3082341 3020113 2959913 2901026 2807148
15971B807148o0136l3492m1988n1483o0830p2380p6917n6500o7774m0899m6979
$$ 2807148 2747012 2713520 2671532 2620049 2559219 2486839 2409922 2353422 2285648 2244749 2197770
15960B197770m3941l1120k7177M562k814l6010m0571l8296o206O025m6449m8509
$$ 2197770 2153829 2122709 2095532 2100094 2097280 2061270 2020699 1982403 1976197 1982222 1935773 1887264
15948A887264l5395l3747j2293o55j5235q619l3672m7092q862J2411j2316k2931
$$ 1887264 1851869 1818122 1805829 1805174 1789939 1781320 1747648 1700556 1691694 1704105 1691789 1668858
15936A668858l0509j6212j2474k1987r317k8400l9041k9100j7777k6595k4929
$$ 1668858 1638349 1622137 1609663 1587676 1578359 1549959 1510918 1481818 1464041 1437446 1412517
15925A412517k6653m6401m8103l9175K2028M215l0530l9659l9601p886k9007k5223
$$ 1412517 1385864 1339463 1291360 1252185 1274213 1278428 1247898 1208239 1168638 1160752 1131745 1106522
15913A106522l2832k3982m761r71k9757J4426q439m3564k0032p749j7121J962
$$ 1106522 1073690 1049708 1044947 1043976 1014219 1028645 1020206 976642 956610 948861 931740 933702
15901I33702j0885r774M9664j0639l6372k2422J104j5903j9684n791j1017J2670
$$ 933702 922817 913043 962707 952068 915696 893274 894378 878475 858791 853000 841983 854653
15889H54653k1577l300J345l3032k5039l857m084j090J843j1612j2021j2635j2766
$$ 854653 833076 829776 831121 798089 773050 769193 765109 764019 765862 754250 742229 729594 716828
15876G16828L0473P337k8742n406k4919l0159q831l1547O772R482j9334j3304
$$ 716828 747301 754638 725896 720490 695571 665412 656581 625034 631806 641288 621954 608650
15864F08650j8347j1602p400j3275q172k2070r803M638l130k02j188J3346k394
$$ 608650 590303 578701 571301 558026 549854 527784 517981 522619 519489 519287 518099 531445 529051
15851E29051r655m285k339J425P277K8260o485j4874J125l4465l3275j3080N13
$$ 529051 519396 515111 512772 514197 521474 549734 543249 528375 529500 495035 461760 448680 449193
15838D49193R43p224J8634R413k3433r281m394R033L107n587k353j7461k265J7030
$$ 449193 450136 442912 461546 470959 447526 438245 433851 442884 445991 440404 438051 420590 418325 435355
15824D35355k2408k9675L896P603k99K6297K5265K64k2212K754o053j7054O647
$$ 435355 412947 383272 387168 394771 394472 420769 446034 446298 424086 426840 420787 403733 410380
15811D10380Q251Q342j026L644o316K4865O221k1890k6054R075L3685K0053l1191
$$ 410380 418631 426973 425947 429591 423275 448140 454361 432471 406417 415492 449177 469230 438039
15798D38039K6045L2669r429j4624K5623L9556N2313L1008M3537L0739o327K0004
$$ 438039 464084 496753 487324 472700 498323 537879 590192 621200 664737 695476 689149 709153
15786G09153K2354o691m1763o0150l3280k6079l8256k1050l7531k0804j9901O200
$$ 709153 731507 724816 683053 622903 589623 563544 525288 504238 466707 445903 426002 432202
15774D32202j0349l2413L596o900m5264m2033r213M0936J8971N109k2105j3209
$$ 432202 421853 389440 393036 386136 340872 298839 289626 330562 349533 354642 332537 319328
15762C19328r947q019J3447L7913n004j7380j6954L077n4423j7933K1586n021
$$ 319328 309381 301362 314809 352722 347718 330338 313384 316461 262038 244105 265691 260670
15750B60670k125k308o221J1078j6764k5505j2999m531N447L4108Q484j9192R02
$$ 260670 258545 256237 250016 261094 244330 218825 205826 201295 206742 240850 249334 230142 231044
15737B31044J6604J5288O3l0986k8K4328o148J16p164j7663l765J4790o225j4404
$$ 231044 247648 262936 262999 232013 231985 256313 250165 250281 243117 225454 221689 236479 230254 215850
15723B15850m450m9916j3693j852J4405J2746o172J963K0246l775k1454k942J7191
$$ 215850 211400 161484 147791 145939 160344 173090 166918 168881 189127 185352 163898 160956 178147
15710A78147K314k7546j2852K4772p800j0912K283P71r219k8387R122L4165J2681
$$ 178147 180461 152915 140063 164835 157035 146123 148406 149177 139958 111571 120693 154858 167539
15697A67539J2294J8095K6379j6540l9394j8176K630m7313o167J3180l711n485
$$ 167539 179833 197928 224307 207767 168373 150197 152827 105514 99347 112527 108816 103331
15685A03331L8439j1658O165m201j6504K2743L205j6228J6997K4691j669k3479
$$ 103331 141770 130112 136277 132076 115572 138315 141520 125292 142289 166980 165311 141832
15673A41832j7829J82j5671J597J1879k0567k1778k3231O910L1764K6100K2198
$$ 141832 124003 124185 108514 110111 121990 101423 79645 56414 63324 95088 121188 143386
15661A43386J4144r848J791j2144n618q391j5709L2228J0332r153l6449l3348
$$ 143386 157530 147682 149473 137329 131711 123320 107611 139839 150171 141018 104569 71221
15649G1221j0410J7629L5942p832o892j979j2129O483j5796n352J6365J0691J0605
$$ 71221 60811 78440 114382 106550 99658 97679 85550 92033 76237 70885 87250 97941 108546
15636A08546P996J686r128j1138J5354K6116P693q906M096j6237p265Q767J9748
$$ 108546 116542 118228 109100 97962 113316 139432 147125 138219 142315 126078 118813 127580 147328
15623A47328j1985J984k8155J4766K5795j4914Q842J0913j5151k3908l2448n770
$$ 147328 135343 137327 109172 123938 149733 134819 143661 154574 139423 115515 83067 77297
15611G7297K5716j2029l3654j0546r084r335K0274K7195q147l20J5333o27Q362
$$ 77297 103013 90984 57330 46784 37700 28365 48639 75834 67687 67367 82700 82073 90435
15598I0435l648j5132J1682k591P497M46J516P437K417j6631o202J5029K3887
$$ 90435 86787 71655 83337 80746 88243 88689 90205 97642 100059 83428 77226 92255 116142
15585A16142P050P199J4211o021m3499m0070J1429o690n259J1332M3318N958k394
$$ 116142 123192 130391 144602 138581 95082 55012 66441 59751 54492 65824 109142 115100 112706
15572A12706J5085l3042n5136r168K1313L483K9201J9510q298j4716l14R002K3217
$$ 112706 127791 94749 39613 30445 51758 55241 84442 103952 95654 80938 80624 89626 112843
15559A12843l5963j0756R849J3944o94j2685n027O535O984J1025O62k0811n054
$$ 112843 76880 66124 75973 89917 89223 76538 71511 78046 85030 96055 96717 75906 70852
15546G0852j9034j3544J6311J1803R532K9830K2527n528m171m757j3240R339N719
$$ 70852 51818 38274 54585 66388 75920 105750 128277 122749 118578 113821 100581 109920 115639
15533A15639N715l3942q353L177L180j113j7283m4746l49j0283o132P363L1803
$$ 115639 121354 87412 79059 82236 85416 84303 67020 22274 21925 11642 5510 12873 44676
15520D4676K0660J9910K6823P479k16r172N613k6434k847K1669l6376o532O118
$$ 44676 65336 85246 112069 119548 119332 110160 115773 89339 86492 108161 71785 65253 71371
15507G1371j6581R849Q245n677K5925j846l0588j4700J0461m893p798J8923K5425
$$ 71371 54790 64639 72884 67207 93132 91286 60698 45998 56459 51566 43768 62691 88116
15494H8116m973k6517k6525j064j868n479o57N189J5281M239R931O781k9321J3913
$$ 88116 83143 56626 30101 29037 27169 21690 21033 26222 41503 45742 55673 62454 33133 47046
15480D7046K3846K0385j2807j4941j6337o75k5508Q629L8268J1452k0559k1308
$$ 47046 70892 91277 78470 63529 47192 46517 21009 29638 67906 79358 58799 37491
15468C7491n2119j4528J0928K8817Q599k5267L769J6675L614L0816N230j6416
$$ 37491 -14628 -29156 -18228 10589 19188 -6079 -2310 14365 17979 48795 54025 37609
15456C7609J5447J7229J7899l2210j3185j271j7175p722K516J9232K1554k3662
$$ 37609 53056 70285 88184 55974 42789 41518 24343 16621 19137 38369 59923 36261
15444C6261k4961P695J7244P732J5830J115j6663l715m463j079k1148Q66J7714
$$ 36261 11300 18995 36239 43971 59801 60916 44253 40538 36075 34996 13848 14714 32428
15431C2428J3646j7588O24N191o143R118j7622J0137k1558J0496J0960r425L4734
$$ 32428 46074 28486 29110 34301 28158 37276 19654 29791 8233 18729 29689 20264 54998
15418E4998K0840j2281m272k661j9281j328j5027j8530L2392J859j4053K051n891
$$ 54998 75838 63557 59285 56624 37343 36015 20988 2458 34850 36709 22656 24707 18816
15405A8816j383J6419R654j2723l3572L534J4980j622J1816M026j1725k934k046
$$ 18816 17433 33852 43506 30783 -2789 745 15725 14103 25919 29945 18220 15286 13240
15392A3240J3805q188o574J4367J4142J1883k6592l935m309j5619j430K1310L3781
$$ 13240 27045 18857 12283 26650 40792 52675 26083 22148 17839 2220 790 22100 55881
15379E5881M963k8780r384N368j5159n265J8781N919K178q874K7720J4179j0224
$$ 55881 60844 32064 22680 28048 12889 7624 26405 32324 34502 25628 53348 67527 57303
15366E7303n022M411k4877m2414l89J1882r802j8830p146Q475P356J7904K1105
$$ 57303 52281 56692 31815 -10599 -10988 894 -8908 -27738 -34884 -26409 -19053 -1149 19956
15353A9956K1386k52k1444p06J2113N971J0697l2282j9633L4279J7776j5755k2252
$$ 19956 41342 41090 19646 18940 31053 37024 47721 15439 -4194 30085 47861 32106 9854
15340I854K567O09k177j0026p793K5385O733r100K6741j739j8542O117J2723M573
$$ 9854 12421 13030 10853 827 -6966 18419 25152 16052 42793 41054 22512 28629 41352 45925
15326D5925J56J3033M202k2553k2755k3179K6640J4791K591j3033j2654m656P266
$$ 45925 46081 59114 63316 40763 18008 -5171 21469 36260 38851 25818 13164 8508 15774
15313A5774J8029K7565k4022k0243J2854j3999l0168L4038J6249L401k846k5011
$$ 15774 33803 61368 37346 17103 29957 15958 -14210 19828 36077 39478 36632 11621
15301A1621l391j3704L25K3578K2478J0554o052N526j433K093M99K261K6777q170
$$ 11621 8230 -5474 -5149 18429 40907 51461 45409 50935 49502 51595 52094 54355 81132 72962
15287G2962l1399l7207j3043J7347k0610K5919R489k2290P138O414J1955k2061
$$ 72962 41563 4356 -8687 8660 -11950 13969 23458 1168 8306 14720 26675 4614
15275D614q856J3042L6073K6419O029l934j7138k6415j9646l5696O352M1383J6548
$$ 4614 -4242 8800 44873 71292 77321 73387 56249 29834 10188 -25508 -19156 22227 38775
15262C8775k8389K4880J8849j4046l5393l025K2488K0165j4535J1258L209q945
$$ 38775 10386 35266 54115 40069 4676 1651 24139 44304 29769 41027 44236 35291
15250C5291k4740j2453j1364q888L3676J5157k1339K3925P497l7660O122q062
$$ 35291 10551 -1902 -13266 -22154 11522 26679 5340 29265 36762 -898 5224 -2838
15238b838q196J3130J0682N670m837O122L0859N872k2153q819K164L915Q750m331
$$ -2838 -11034 2096 12778 18448 13611 19733 50592 56464 34311 25492 27656 31571 40321 35990
15224C5990m2223K99K5148K3801k3021j6564Q628J3577p415j8498q210J6163j885
$$ 35990 -6233 -5934 19214 43015 19994 3430 12058 25635 18220 -278 -8488 7675 5790
15211E790j8923m968N403J2518r749k7013l383J8438N558q296j7450J1529K5860
$$ 5790 -13133 -18101 -12698 -180 -9929 -36942 -40325 -21887 -16329 -24625 -42075 -30546 -4686
15198d686P949j8379J5335J8546k5656M075K836j0019O917R971O564q667k0154
$$ -4686 3263 -15116 219 18765 -6891 -2816 20 -9999 -3082 6889 13453 4786 -15368
15185a5368k0101q714K8869K3668r505K0368j4947l9056K8991L1348j425J062
$$ -15368 -35469 -44183 -15314 8354 -1151 19217 4270 -34786 -5795 25553 24128 25190
15173B5190L788m310k2669m3286l934L2928O522j5209J3714j778o664L246J4887
$$ 25190 28978 24668 1999 -41287 -45221 -12293 -5771 -20980 -7266 -9044 -15708 -12462 2425
15160B425j2835m439j278q681j4090L800L865j8217j2271L3229M4604N428j0536
$$ 2425 -10410 -14849 -16127 -24808 -38898 -35098 -31233 -49450 -61721 -28492 16112 21540 11004
15147A1004m79L0338l750l0952j5584J8113P068M052J6077n096Q381J1330j3227
$$ 11004 10525 40863 37113 6161 -9423 8690 15758 19810 35887 30791 39172 50502 37275
15134C7275m722l2527P489J4693k3689j7360O165L9227J5909P957k3946k7886
$$ 37275 32553 26 7515 22208 -1481 -18841 -12676 26551 42460 50417 26471 -1415
15122a415n823J2568k2438K2583P276O72k234k2216K1980j8210n11N090J9860
$$ -1415 -7238 5330 -17108 5475 12751 13423 11189 -11027 10953 -7257 -7768 -2678 17182
15109A7182J63K8479J0045j5167J1898k5055k5926L283j1652J6639O955j4522
$$ 17182 17345 45824 55869 40702 52600 27545 1619 4902 -6750 9889 16844 2322
15097B322k0387P02K9000J9486j4362L907l077j4262L2156J9887l2761j1967J202
$$ 2322 -18065 -17363 11637 31123 16761 20668 17591 3329 35485 55372 22611 10644 11846
15084A1846l1628j9935K3495O541P450N921k789N871K8292J7576j5921j3626J9038
$$ 11846 -19782 -39717 -16222 -9681 -2231 3690 901 6772 35064 52640 36719 23093 42131
15071D2131l1457k7614J2411J5086K5646q275q385m708K3458L894k5252j9826
$$ 42131 10674 -16940 -4529 10557 36203 27928 19543 14835 38293 42187 16935 -2891
15059b891j3534N282j9094j7784J8124P39M149P695J3803R927k8463J918m077
$$ -2891 -16425 -11143 -30237 -48021 -29897 -29158 -25009 -17314 -3511 6416 -22047 -20129 -24206
15046b4206J1049j3618K255r258q755P541k68K1506L8457J2381j282k0866k7078
$$ -24206 -13157 -26775 -24520 -33778 -42533 -34992 -35260 -13754 24703 37084 35802 14936 -12142
15033a2142k7111q310m0764n81K9101J4299J119J0426L7694J1188k0353r764P524
$$ -12142 -39253 -47563 -88327 -88908 -59807 -45508 -44389 -33963 3731 14919 -5434 -15198 -7674
15020g674J0767J1753L5212j5637N56Q33J3646J8299m7092j4246J2202j957J2338
$$ -7674 3093 14846 50058 34421 34977 35810 49456 67755 20663 6417 18619 16662 29000
15007B9000j3188j1842r335K2917J9330k0718j8094k1164L521R450J701L067Q613
$$ 29000 15812 3970 -5365 17552 36882 16164 -1930 -23094 -19573 -10123 -8422 -5355 3258
14994C258J3195r748l623m831J9506p049R83L456J902j05Q62n072l4007K76K0891
$$ 3258 16453 6705 3082 -1749 17757 10708 11691 15147 17049 16944 17806 12734 -21273 -20997 -106
14979a06l51M708p554k4412k4134j95L7718L6437J7081q527j3548k0571k5947
$$ -106 -457 4251 -3303 -27715 -51849 -52044 -14326 22111 39192 30665 17117 -3454 -29401
14966b9401O451M5491K9807P734M031j2381L49j4550k4791J0735j3271K947p056
$$ -29401 -22950 22541 52348 60082 64113 51732 52081 37531 12740 23475 10204 13151 6095
14953F095j0428J2085k1494j0549k7227o165J1439K427J2814R045K1559O600m386
$$ 6095 -4333 7752 -13742 -24291 -51518 -57683 -46244 -43817 -31003 -21958 -399 6201 1815
14940A815J0685o141L449K0135O136m7934m8466M1985L3301N1N347k4859L406
$$ 1815 12500 6359 9808 29943 36079 -11855 -60321 -18336 14965 15016 20363 -4496 -1090
14927a090P730j1175j9361j1527L2025l645k6852J8493j1636k1666n874P877J6905
$$ -1090 6640 -4535 -23896 -35423 -3398 -7043 -33895 -15402 -27038 -48704 -54578 -46701 -29796
14914b9796K5776J5906k5197j3938O292K75R498J9375R54j1441j1275q268L8679
$$ -29796 -4020 11886 -13311 -27249 -20957 -20682 -11184 8191 9145 -2296 -13571 -21839 16840
14901A6840P991k968j3688j8389o158O095K4217j922j4176P324m215j7509j8958
$$ 16840 24831 21863 8175 -10214 -16372 -10277 13940 12018 -2158 5166 951 -16558 -35516
14888c5516K8943K8788q69N767J4997N368j1024k1314k1355J4467N171j2109K771
$$ -35516 -6573 22215 21346 27113 42110 47478 36454 15140 -6215 8252 13423 1314 4085
14875D085j585j2387K792J9430j9144J5000J0112k5734j2296L9245J2806j9478
$$ 4085 2500 -9887 -7095 12335 -6809 8191 18303 -7431 -19727 19518 32324 12846
14863A2846m8432K997K1402o430J4901J4645j8867l1317j4999j6903k2524K8769
$$ 12846 -35586 -32589 -11187 -17617 -2716 11929 -6938 -38255 -53254 -70157 -92681 -63912
14851f3912M0288j3318k186L7904o661j8984m26J1356P113j630j4273L933k0223
$$ -63912 -23624 -36942 -39128 -1224 -7885 -26869 -27295 -15939 -8826 -10456 -24729 -20796 -41019
14838d1019k7836K5324L2280O069L922q98K3942L512j1849j4527J465m116k728
$$ -41019 -68855 -43531 -11251 -5182 -1260 -2158 21784 25296 13447 -1080 385 -3731 -6459
14825f459M416K8219R83L617k7357k2874J0647j301j533J1905N472j1278J9110
$$ -6459 -2043 26176 27159 30776 3419 -19455 -8808 -10109 -11642 263 5735 -5543 13567
14812A3567j6999k4283j667P934J955L1425M380j9433p61k033j0656J779J0016
$$ 13567 -3432 -27715 -29382 -21448 -19493 11932 16312 -3121 -3882 -5915 -16571 -14792 -4776
14799d776j825J6546n872J203q372k1287N23O314J4071L166k4092j848J1219J1284
$$ -4776 -6601 9945 4073 5276 -3096 -24383 -23860 -17546 -3475 -309 -24401 -26249 -15030 -3746
14785c746j0343j7026J4593J410p986O618Q153N55q295P219r346R120R245K378
$$ -3746 -14089 -31115 -16522 -15112 -23098 -16480 -8327 -7772 -16067 -8848 -18194 -9074 171 2549
14771B549L1251q604o269q537j5662M538o012j545N218L002l344j0007L256N980
$$ 2549 33800 25196 18927 10390 -5272 -734 -6746 -8291 -3073 -71 -3415 -13422 -10166 -4186
14757d186j1640q705L992K0245K405o59N12J2366J2k4567o071l005j3434K4198
$$ -4186 -15826 -24531 -20539 -294 2111 1452 1964 14330 14342 -10225 -16296 -19301 -32735 -8537
14743h537J2817j159q714j3263M0509J2515l5787M233K571l6778k9760K0217J7768
$$ -8537 4280 3121 -5593 -18856 21653 34168 -1619 2614 5185 -31593 -61353 -41136 -23368
14730b3368j8653r322J8762J7347l246J7769j7050n712m362J0293k741L288K3840
$$ -23368 -42021 -51343 -32581 -15234 -18480 -711 -17761 -23473 -27835 -17542 -20283 -16995 6845
14717F845K4482M26l657j086p363k2835k0594P15j5485j384Q107J263M3381R936
$$ 6845 31327 31753 28096 27010 19647 -3188 -23782 -23067 -38552 -39936 -31829 -30566 12815 22751
14703B2751j1687k9541k0649J2007L394Q998J9403J3726Q617K625k080J729m790
$$ 22751 11064 -18477 -39126 -27119 -23725 -14727 4676 18402 27019 29644 27564 29293 24503
14690B4503Q914m168l6901K0793K2223j4304j4639p896Q2j7646j1840K8078R762
$$ 24503 33417 29249 -7652 13141 35364 21060 6421 -1475 -1393 -19039 -30879 -2801 6961
14677F961J1059k6200k2018L0L2566J1569J9772R148l271j6901L983k815k303
$$ 6961 18020 -8180 -30198 -30168 2398 13967 33739 42887 39616 22715 26698 23883 21580
14664B1580j9030j1600J8360k150q401m671j345N658O031J405J3119K716r851
$$ 21580 2550 -9050 9310 7160 -1241 -5912 -7257 -1599 4432 5837 18956 21672 11821
14651A1821J871j9817j7495p872K4900J8226J8031J4700k4166j6039L7117k9927
$$ 11821 13692 -6125 -23620 -31492 -6592 11634 29665 44365 20199 4160 41277 11350
14639A1350j3855j2305j6433J7513O768L5310J9411L0494l7598l1919o539J0157
$$ 11350 -2505 -14810 -31243 -13730 -6962 28348 47759 78253 40655 8736 2197 12354
14627A2354j2265o433J8519j8671K519m171k5352K9886J1179n338J504k1531P287
$$ 12354 89 -6344 12175 -6496 -3977 -8148 -33500 -3614 7565 2227 3731 -17800 -10513
14614a0513L126J1554N215j6641j6142j137k9081n895L6208L4652L160k3258n562
$$ -10513 -7387 4167 9382 -7259 -23401 -24538 -53619 -59514 -23306 11346 14506 -8752 -14314
14601a4314j3322m803J5969K8712R358k6697k15p922l55K4316m408k9338j2011
$$ -14314 -27636 -32439 -16470 12242 21600 -5097 -5312 -13234 -13589 10727 6319 -23019 -35030
14588c5030J9027M1253J7856j9086L761l3555j4348P83K6473J505Q393J268J087
$$ -35030 -16003 25250 43106 24020 27781 -5774 -20122 -19339 7134 8639 17032 18300 19387
14575A9387j7720j2399P612k121K685J8278j6742k6031j8321L5816q234k855m743
$$ 19387 1667 -10732 -3120 -5241 -2556 15722 -1020 -27051 -45372 -9556 -17790 -20645 -25388
14562b5388J2392M729Q484K3141J3509l118P535N723j3175j9281l0878k5761R402
$$ -25388 -12996 -8267 217 23358 36867 33749 41284 47007 33832 14551 -16327 -42088 -32686
14549c2686L7126p723j9956K600J9140K385R246K1413j2648k6803J966k2978l456
$$ -32686 4440 -3283 -23239 -20639 -1499 886 10132 31545 18897 -7906 -5940 -28918 -32374
14536c2374K6454L2137q570p689P114l8075m6509K5704J3717J8252J1683J4369
$$ -32374 -5920 26217 17647 9958 17072 -21003 -67512 -41808 -28091 -9839 1844 16213
14524A6213j7k5028k4463O545l523K016j0781l899J0559K4996J8982k534j0036
$$ 16213 16196 -8832 -33295 -26750 -30273 -28257 -39038 -42937 -32378 -7382 11600 9066 -970
14511i70j4343j9988o020k513K0776J7283P683J5859o654j2900j3887p849l216
$$ -970 -15313 -35301 -41321 -43834 -23058 -5775 1908 17767 11113 -1787 -15674 -23523 -26739
14498b6739o09R236j2752J800j64K1042L3708J3768n769k8224k9906k731L7669
$$ -26739 -27348 -18112 -30864 -29064 -29228 -8186 25522 39290 33521 5297 -24609 -27340 10329
14485A0329j5381O031J2535J6584p852j7267r0J186k9157j4469J695J0839j7030
$$ 10329 -5052 979 13514 30098 22246 4979 4889 6075 -23082 -37551 -35856 -25017 -42047
14472d2047J5990O650n467k0694K2869O570J2178q581n223k0594j7430L2892L0509
$$ -42047 -26057 -19407 -24874 -45568 -22699 -16129 -3951 -12532 -17755 -38349 -55779 -22887 7622
14459G622L599O354r208l4230M648N108j1267O614j3094R214j2883m542k1392
$$ 7622 11221 17575 8367 -25863 -21215 -16107 -27374 -20760 -33854 -24640 -37523 -42065 -63457
14446f3457K3278L7965J4327J1557r25L564M435l3600k3308J681Q642L270p363
$$ -63457 -40179 -2214 12113 23670 22745 26309 30744 -2856 -26164 -24483 -15841 -12571 -19934
14433a9934J1844J46q508J6841O450j8830l469P809k1309n646L0074L2904p510
$$ -19934 -8090 -7944 -16452 389 6839 -11991 -15460 -7651 -28960 -34606 -4532 28372 20862
14420B0862q746j1775p341J1164k0093n082P737J150j8921q82M984n643j0860
$$ 20862 12116 341 -7000 4164 -15929 -21011 -13274 -12124 -31045 -31927 -26943 -32586 -43446
14407d3446j710J6141J2610K0078J4183k069j533m188J4707O25l0086k450L5089
$$ -43446 -45156 -29015 -16405 3673 17856 15787 14254 10066 24773 25398 -4688 -7138 27951
14394B7951J5296O59o988j5683q50M041k643j0520j6059k2406K1701K4606j1719
$$ 27951 43247 43906 36918 21235 20385 24426 21783 11263 -4796 -27202 -5501 19105 7386
14381G386j3442J0094p121p866o838N337k7097R675L7084P579J075l9131k4490
$$ 7386 -6056 4038 -3083 -10949 -17787 -12450 -39547 -29872 7212 14791 15866 -23265 -47755
14368d7755K4199Q24j1871J2291J826J7146j5862k8017j5816J2766J2181K7419
$$ -47755 -23556 -22732 -34603 -22312 -20486 -3340 -19202 -47219 -63035 -50269 -38088 -10669
14356a0669R211n329m534k4390k5348N830j4883J9857O724n479l014J8904J7651
$$ -10669 -1458 -6787 -11321 -35711 -61059 -55229 -70112 -50255 -43531 -49010 -52024 -33120 -15469
14343a5469k4852j6611J1406L1422O909M976j2182N345O160m997k220k4936R465
$$ -15469 -40321 -56932 -45526 -14104 -7195 -2219 -14401 -9056 -2896 -7893 -10113 -35049 -25584
14330b5584J6665Q504K9829R739K7920K09m0961m3753k4345K514J2185P770O475
$$ -25584 -8919 -415 29414 39153 67073 67282 26321 -17432 -41777 -39263 -27078 -19308 -12833
14317a2833l512J3657j1307N333j8111r450K5925J3816l472j3439J5537j0808
$$ -12833 -16345 -2688 -13995 -8662 -26773 -36223 -10298 3518 46 -13393 2144 -8664
14305h664j7017j5385r205J1000K9564L240k4022k030L314o664O367R353n644
$$ -8664 -25681 -41066 -50271 -39271 -9707 -6467 -30489 -32519 -29205 -35869 -29502 -20149 -25793
14292b5793k8319J8255L0799L3910j0370L438j5462O013L0733k7889k9223J4716
$$ -25793 -54112 -35857 -5058 28852 18482 21920 6458 12471 43204 15315 -13908 808
14280H08J7387N086j3672j4169J975r691j1065J001J5034j6970k7065k363K7201
$$ 808 18195 23281 9609 -4560 -2585 -12276 -23341 -22340 -7306 -24276 -51341 -53704 -26503
14267b6503k364J2775K4862j7535J5493m582l382J9246P267k08l2695r774J069
$$ -26503 -28867 -16092 8770 -8765 6728 2146 -1236 18010 25277 25069 -7626 -17400 -16331
14254a6331J1012J9665o519j9570J347O35j552K2892j2740q752j5967j5836R766
$$ -16331 -5319 14346 7827 -11743 -10396 -9761 -11313 11579 -1161 -9913 -25880 -41716 -31950
14241c1950J1443J368o430j1527j933K0575k133l1492K2870M4329J9817Q221q796
$$ -31950 -20507 -19139 -25569 -37096 -39029 -18454 -20587 -52079 -29209 15120 34937 43158 34362
14228C4362J2608J441o083k797l5352j7796J0516M149O096q658j7049J9928J9315
$$ 34362 46970 48411 42328 39531 4179 -13617 -3101 1048 7144 -1514 -18563 1365 20680
14215B0680l0694o409j213j395o25m662L0486J5465k8800Q07Q64k9324l425R617
$$ 20680 -10014 -16423 -17636 -19031 -19656 -24318 6168 21633 -7167 -6360 -5496 -34820 -38245 -28628
14201b8628R110K215J9281P702r099k1700Q346p887O323M300q993n804K777J9620
$$ -28628 -19518 -17303 1978 9680 581 -21119 -12773 -20660 -14337 -10037 -19030 -24834 -22057 -2437
14187b437o332j6860J938J2409J0415j1320p438M809K1240Q003p945k1172j0240
$$ -2437 -8769 -25629 -23691 -11282 -867 -12187 -19625 -14816 6424 14427 6482 -14690 -24930
14174b4930Q351K9400J641j4505N860K973j1774K02N846n513j7854k1109J0365
$$ -24930 -16579 12821 14462 -43 5817 8790 -2984 -2782 3064 -2449 -20303 -41412 -31047
14161c1047Q746J4090p617j146L047q688j7437m470J4328j172Q994q74j252K7071
$$ -31047 -22301 -8211 -15828 -16974 -13927 -22615 -40052 -44522 -30194 -31366 -22372 -23246 -24498 2573
14147B573J5223n902k2670k1287L469K9220p229j083j0683J2604L4172j2640M95
$$ 2573 17796 11894 -10776 -32063 -28594 626 -6603 -7686 -18369 -5765 28407 15767 16262
14134A6262j7766l2605p610R038q862j459j8596L294K2426j2417K3191J1501k911
$$ 16262 -1504 -34109 -41719 -32681 -41543 -43002 -61598 -58304 -35878 -48295 -25104 -13603 -16514
14121a6514j3863K209l97K3768m422K09J8883o039l848k5830j1597J23L2848r909
$$ -16514 -30377 -28168 -28565 -4797 -9219 -9010 9873 3834 -14 -25844 -37441 -37318 -4470 -14379
14107a4379k814Q318k5769k7277K2190M5622K5595j5967J607l6055K507J1637
$$ -14379 -17193 -8875 -34644 -61921 -39731 5891 31486 15519 17126 -18929 -16422 -4785
14095d785j2129Q079J6203J335J0466L503K0818j4862J5012J0511j1693m272q114
$$ -4785 -16914 -8835 7368 8703 19169 22672 43490 28628 43640 54151 42458 38186 30072
14082C0072j2933q212M147o793N579P881K480K80j5287r596j4103o804k685J3230
$$ 30072 17139 8927 13074 6281 11860 19741 22221 22501 7214 -2382 -16485 -23289 -25974 -12744
14068a2744R654J0093j4711L301j694j87k1522O796J3698p553J640j6114o182
$$ -12744 -3090 7003 -7708 -4407 -6101 -6288 -27810 -21014 -7316 -14869 -13229 -29343 -35525
14055c5525K2906l260P372J0433k3297J2740K2655j1439K4165m275l4332q027
$$ -35525 -12619 -15879 -8507 1926 -21371 -8631 14024 2585 26750 22475 -11857 -19884
14043a9884q463p912L837J1935K0055K361K1517Q15j6188k2834k72J4713L1013
$$ -19884 -28347 -36259 -32422 -20487 -432 1929 23446 24261 8073 -14761 -15033 -320 30693
14030C0693p603k8618j5544O358J8309J9943l684j6905k8965j5431J568J7102
$$ 30693 23090 -5528 -21072 -14714 3595 23538 19854 2949 -26016 -41447 -39879 -22777
14018b2777K2152P371j2149K51n500M021O02k6504k2667k1428K1896L1544J0130
$$ -22777 -625 6746 -5403 -5152 -10652 -6631 -6029 -32533 -55200 -76628 -54732 -23188 -13058
14005a3058j462N308M967J1738L596K441j4439l0176j5370j839K9504L2260N060
$$ -13058 -14520 -9212 -4245 7493 11089 13530 -909 -31085 -46455 -48294 -18790 13470 18530
13992A8530o41p821J8435q898l8432k2580L126N051R258Q212L559L592L2443J4166
$$ 18530 17889 10068 28503 19605 -18827 -41407 -38281 -33230 -23972 -15760 -12201 -8609 23834 38000
13978C8000q556r73J9338N318l6673l260m286j7363J5549K0495p537N706P94K1469
$$ 38000 29444 28471 47809 53127 16454 13194 8908 -8455 7094 27589 20052 25758 26552 48021
13964D8021l0024k8157p305K4106J8828o085j6049J2298k8779Q54L699m189K4283
$$ 48021 17997 -10160 -17465 6641 25469 19384 3335 15633 -13146 -12292 -8593 -12782 11501
13951A1501K0987k4440k6978K2026K629j9079j3374p551k821J1659L6321j0582
$$ 11501 32488 8048 -18930 3096 5725 -13354 -26728 -34279 -37100 -25441 10880 298
13939B98k8214l4868J1075j0347j6727K4123L1120J3497M849k9949j2099p499
$$ 298 -27916 -62784 -51709 -62056 -78783 -54660 -23540 -10043 -5194 -35143 -47242 -54741
13927e4741p80O731l432K9645K2209J1269J8554K3296o977l6120q185m40j4556
$$ -54741 -55521 -48790 -52222 -22577 -368 10901 29455 52751 45774 9654 1469 1029 -13527
13914a3527J3952K7918O800j948j4032K418j4243r816O696k301q543j4133J0176
$$ -13527 425 28343 35143 33195 19163 21581 7338 -2478 4218 1917 -6626 -20759 -10583
13901a0583K8763J9385J286p991j1595N482L248j9874j9536j0581J8163j1030
$$ -10583 18180 37565 38851 30860 19265 24747 27995 8121 -11415 -21996 -3833 -14863
13889a4863J9682J2265N29j2163l9988R834R948k576K735k1285m115O461m096
$$ -14863 4819 17084 17613 5450 -34538 -24704 -14756 -17332 -14597 -35882 -39997 -33536 -37632
13876c7632Q997J7059k930l537p974k2672J2191M651J5870j2715m07Q733R086
$$ -37632 -28635 -11576 -14506 -18043 -26017 -48689 -36498 -31847 -15977 -28692 -29099 -20366 -11280
13863a1280j9326j9937l4860K448K0920O6269J0889l4657J538K9369o827m925
$$ -11280 -30606 -50543 -85403 -82955 -62035 4234 15123 -19534 -17996 11373 4546 -379
13851c79P659R250j8223o36L153P796k1489O805k0135l7900M808L6970J6671k4511
$$ -379 7280 16530 -1693 -2329 824 8620 -12869 -6064 -26199 -64099 -59291 -22321 -5650 -30161
13837c0161l0037L838J8636J7148J0175J486J1053K3552N00k1699n180r408m537
$$ -30161 -60198 -56360 -37724 -20576 -10401 -8915 2138 25690 26190 4491 -689 -10097 -14634
13824a4634O072J3330Q723l6104K3060L9304j5948j0491j3002J0259M94l655L754
$$ -14634 -8562 4768 13491 -22613 447 39751 23803 13312 310 10569 11063 7408 11162
13811A1162l751M743R149m565J2214j6741j044k2660J4402K7848J9143j8238j0470
$$ 11162 7411 12154 21303 16738 28952 12211 11167 -11493 2909 30757 49900 31662 21192
13798B1192P529J5604O118m0679l6014j1728J0804j961r93N821M13j5023p558
$$ 21192 28721 44325 50443 9764 -26250 -37978 -27174 -29135 -30128 -24307 -23894 -38917 -46475
13785d6475Q748l426K5247J8156j9868j1392K8365M0861M639k5722j6087o836
$$ -46475 -37727 -41153 -15906 2250 -17618 -29010 -645 40216 44855 19133 3046 -3790
13773c790Q24J3402M692O607P781j6118o751J8653K0334q30m1734k3387M427N318
$$ -3790 -2966 10436 15128 21735 29516 13398 6647 25300 45634 44804 3070 -20317 -15890 -10572
13759a0572K1977J3112J9936k2977k2878l8273l902P574J4709J0455J90Q633j4814
$$ -10572 11405 24517 44453 21476 -1402 -39675 -43577 -36003 -21294 -10839 -10649 -2016 -16830
13746a6830k4327k783J4273Q200K8886j656N898R766J5966M372k5153k9456M592
$$ -16830 -41157 -43940 -29667 -21467 7419 5763 11661 21427 37393 41765 16612 -12844 -8252
13733h252J1737n792j3078J7007J2903k0295k1514J5422J5897K18Q919j8271L588
$$ -8252 3485 -2307 -15385 1622 14525 -5770 -27284 -11862 4035 4253 13172 -5099 -1511
13720a511l4600n985J4177K5907J3131l1064k0200n623Q134j2397J8313j706K759
$$ -1511 -36111 -42096 -27919 -2012 11119 -19945 -40145 -45768 -37634 -50031 -31718 -33424 -30665
13707c0665J9553j2834J5535K4297Q544j944k2351j9154K073j0992J1668j295
$$ -30665 -11112 -23946 -8411 15886 24430 22486 135 -19019 -16946 -27938 -16270 -17565
13695a7565j3737K5240k6693l0136L1716L4330j025j3306j9086r946p731J778
$$ -17565 -31302 -6062 -32755 -62891 -31175 3155 2130 -11176 -30262 -40208 -47939 -46161
13683d6161K1762J2599K397J0732p17O878K328K1013k3394k1859p202M630N297
$$ -46161 -24399 -11800 -9403 1329 612 7490 9818 30831 7437 -14422 -21624 -16994 -11697
13670a1697j641n671O02L4468K0052J0999k7747l8904N571O415P532k994l4167
$$ -11697 -13338 -19009 -18407 16061 36113 47112 19365 -19539 -13968 -7553 -21 -3015 -37182
13657c7182K984Q590M2562O529j5777l723k0113K4677m92r170k8211j521R575
$$ -37182 -34198 -25608 16954 23483 7706 3983 -16130 8547 8055 -1115 -29326 -30847 -21272
13644b1272j620r102J2301L4178J8010k9632j2840K2327j446r591j4349J9234
$$ -21272 -22892 -31994 -19693 14485 32495 2863 -9977 12350 10904 1313 -13036 6198
13632F198M821L585K830m735k9286J8624P639O547K2253o422j7923k0633m764
$$ 6198 11019 14604 17434 12699 -16587 2037 9676 16223 38476 32054 14131 -6502 -11266
13619a1266p613q267k4988o869P383J6949L2108L6853j3014j3634L249K84k406
$$ -11266 -18879 -27146 -52134 -59003 -51620 -34671 -2563 34290 21276 7642 10891 11175 8769
13606H769J9505k796j0631j5966p030n772J3489J6131j3438j0007L728K2673P181
$$ 8769 28274 25478 14847 -1119 -8149 -13921 -432 15699 2261 -7746 -4018 18655 25836
13593B5836J7295m876j0992j8494p262J3494k941k5510r361K0688j0328l578p046
$$ 25836 43131 38255 27263 8769 1507 15001 12060 -13450 -22811 -2123 -12451 -16029 -23075
13580b3075j5915P984J6056j251j8095Q979j0080j6475n213L7790M1261q201J533
$$ -23075 -38990 -31006 -14950 -16201 -34296 -25317 -35397 -51872 -57085 -19295 21966 13765 15298
13567A5298M377J0768Q41r577k934r62q4k594O432K7304o199q813o303L016K817
$$ 15298 19675 30443 31284 21707 18773 17811 17727 15133 21565 48869 42670 33857 27554 30570 33387
13552C3387j0627k6194J4763J7841m442r704J616R364N274Q923k7771j7422q524
$$ 33387 22760 -3434 11329 29170 24728 15024 16640 26004 31278 40201 12430 -4992 -13516
13539a3516J0583L9741m3671k4212K1222K6657k5416p701q728o800J9997j0201
$$ -13516 -2933 36808 -6863 -31075 -9853 16804 -8612 -16313 -25041 -31841 -11844 -22045
13527b2045p358J5183J3233j0254J6348J1572n390k5753J5241p70Q365J9922P441
$$ -22045 -29403 -14220 -987 -11241 5107 16679 11289 -14464 777 7 8372 28294 35735
13514C5735j6280r702n424L606K0182P963N50k8999j5620l324o080j1863J221
$$ 35735 19455 9753 4329 7935 28117 36080 36630 7631 -7989 -11313 -17393 -29256 -28035
13501b8035K733L5127J7391J2420J663j1556r452J318P100j2196L944k8977n323
$$ -28035 -25302 9825 27216 39636 41299 29743 20291 21609 28709 16513 20457 -8520 -13843
13488a3843M014J1931k6407l964K3416J226o819q124K4231o636K500k0969J4333
$$ -13843 -9829 2102 -24305 -28269 -4853 -3627 -10446 -18570 5661 -975 1525 -19444 -5111
13475e111L4879o010j7330l0443k4831j9797K5102J9283l0451l6357K5076L5693
$$ -5111 29768 23758 6428 -24015 -48846 -68643 -43541 -24258 -54709 -91066 -65990 -30297
13463c0297K6101M1559K3557j2685o487o302l0016l3501P091L341j8242N219K8036
$$ -30297 -4196 37363 60920 48235 41748 35446 5430 -28071 -20980 -17639 -35881 -30662 -2626
13450b626N070J5291J9498l688l1552j7440K331l1065J43K4477J7233k6398N734
$$ -2626 2444 17735 37233 33545 1993 -15447 -13116 -44181 -44038 -19561 -2328 -28726 -22992
13437b2992J2660N653k71p45J1810K6523J1964O386k465j0214k7981J1021l383
$$ -22992 -10332 -4679 -4950 -5695 6115 32638 44602 50988 48523 38309 10328 21349 17966
13424A7966J4775j6339j5452K704l396j3726K443N697Q6M173Q836J0022r965m561
$$ 17966 32741 16402 950 3654 258 -13468 -11025 -5328 -5242 -1069 7767 17789 7824 3263
13410C263j7491n397J7552k3265l994L2811J4115J630k147o931l4494K4038K4802
$$ 3263 -14228 -19625 -2073 -25338 -29332 3479 17594 19224 17077 10146 -24348 -310 24492
13397B4492P580j3545l6857J1206M309j050J1820P829j3751j761J7780J06k873
$$ 24492 32072 18527 -18330 -7124 -2815 -3865 7955 15784 2033 272 18052 18158 15285
13384A5285j9319M094K6987l410j874q061m316p267o424M71m639P671j2882m404
$$ 15285 -4034 60 27047 23637 21763 13702 9386 2119 -4305 -3834 -8473 -802 -13684 -18088
13370a8088k9004j6645K0656K7628n791n256m106o339J1115M6438J4793k7594
$$ -18088 -47092 -63737 -43081 -15453 -21244 -26500 -30606 -36945 -25830 20608 35401 7807
13358G807k0749n514K1502J3463J2145J7163k0744j4376q6P272k1290q772l984
$$ 7807 -12942 -18456 3046 16509 28654 45817 25073 10697 10611 17883 -3407 -12179 -16163
13345a6163k1795r882L005M687O315Q206j2793j1674o970K5407J3333M751J5159
$$ -16163 -37958 -47840 -44835 -40148 -33833 -25627 -38420 -50094 -57064 -31657 -18324 -13573 1586
13332A586K992K092n997J8016J7864m190l2825K262J5539K869k0444l797k0380
$$ 1586 4578 6670 673 18689 36553 32363 -462 1800 17339 20208 -236 -4033 -24413
13319b4413J6079J7388r791J452l2504m547P598o088K0546J8296o277P756J0092
$$ -24413 -8334 9054 -737 715 -31789 -36336 -28738 -34826 -14280 4016 -2261 5495 15587
13306A5587r054l6159J3549J6906j1331m366L0341j1820j4512o065J466L923R96
$$ 15587 6533 -29626 -16077 829 -10502 -14868 15473 3653 -10859 -16924 -15458 -11535 -10539
13293a0539J5155J2097J8648j0866L648k0183q493R142J1794p979K819j7750O732
$$ -10539 4616 16713 35361 24495 28143 7960 -533 8609 20403 12424 15243 -2507 4225
13280D225J788J0948N81j0576K4630J288l377L220O14r229j7027J1242R210j2345
$$ 4225 6013 16961 17542 6966 31596 32884 29507 32727 33341 24112 7085 18327 27537 15192
13266A5192k4954l5634Q61J2856L0479K3444J7021J1984j9436o13l569q742j7624
$$ 15192 -9762 -45396 -44535 -31679 -1200 22244 39265 51249 31813 31200 27631 18889 1265
13253A265R757K5159j8715j5849r834J3350k668j4902J681J4808L909p568M772
$$ 1265 11022 36181 17466 1617 -8217 5133 2465 -12437 -10756 4052 7961 393 5165
13240E165J7679P899j8097j1754o199K2165j4534j7126J1362J2698J0896P988
$$ 5165 22844 30743 12646 892 -5307 16858 2324 -14802 -3440 9258 20154 28142
13228B8142K3531Q730M343r294j4630k2789L960k1556j0200M073J8334J5513j6865
$$ 28142 51673 60403 64746 55452 40822 18033 21993 437 -9763 -5690 12644 28157 11292
13215A1292l6444K651l20q094L053n868p141J0802K0536j9760p425K5704J0759
$$ 11292 -25152 -22501 -22821 -30915 -27862 -33730 -40871 -30069 -9533 -29293 -36718 -11014 -255
$$ [...]
##END NTUPLES=NMR SPECTRUM
##END=
