##TITLE=Analysis number 316242
Compound Code mo 07388
Book Reference 358/193
Project Code adrs
Chemist Name mikem
##JCAMPDX= 6.0         $$ Bruker NMR JCAMP-DX V2.0
##DATA TYPE= NMR SPECTRUM
##DATA CLASS= NTUPLES
##ORIGIN= Bruker BioSpin GmbH
##OWNER= nmr
$$ XWIN-NMR		Version 3.5
$$ Fri Jan  6 09:54:22 2006 GMT Standard Time (UT+0h)  MAYBRIDGE\nmr@NMR_250MHZ
##.OBSERVE FREQUENCY= 250.131544655141
##.OBSERVE NUCLEUS= ^1H
##.ACQUISITION MODE= SIMULTANEOUS (DQD)
##.ACQUISITION SCHEME= undefined
##.AVERAGES= 16
##.DIGITISER RES= 18
##SPECTROMETER/DATA SYSTEM= dpx250
##.PULSE SEQUENCE= zg30
##.SOLVENT NAME= CDCl3
##.SHIFT REFERENCE= (INTERNAL, CDCl3, 0, 16.4505)
##AUDIT TRAIL= $$ (NUMBER, WHEN, WHO, WHERE, WHAT)
$$ ##TITLE= Audit trail, XWIN-NMR		Version 3.5
$$ ##JCAMPDX= 5.01
$$ ##ORIGIN= Bruker BioSpin GmbH
$$ ##OWNER= nmr
$$ C:\u/data/dgb/nmr/ADRS/14340/pdata/1/auditp.txt
$$ ##AUDIT TRAIL=  $$ (NUMBER, WHEN, WHO, WHERE, WHAT)
(   1,<2006-01-06 09:53:24.23 +000>,<MAYBRIDGE\nmr>,<NMR_250MHZ>,
      <created by zg, POWCHK disabled, PULCHK disabled
       configuration hash MD5:
       62 19 C7 07 E1 42 D1 B7 37 6C 3D D0 77 39 F9 E6
       data hash MD5: 64K
       EF A6 16 B7 0B 85 DA AF E7 AA FA B8 74 67 51 B2>)
(   2,<2006-01-06 09:53:48.73 +000>,<MAYBRIDGE\nmr>,<NMR_250MHZ>,
      <Start of raw data processing
       ef LB = 0.3 FT_mod = 6 PKNL = 1 SI = 32K 
       data hash MD5: 32K
       F7 2D 41 28 71 46 11 14 CD F0 C9 4C 88 32 14 7D>)
(   3,<2006-01-06 09:53:57.63 +000>,<MAYBRIDGE\nmr>,<NMR_250MHZ>,
      <apk 
       data hash MD5: 32K
       C6 61 01 C5 00 BB BE F0 32 37 AB 7A C3 52 C9 35>)
(   4,<2006-01-06 09:54:01.60 +000>,<MAYBRIDGE\nmr>,<NMR_250MHZ>,
      <abs ABSG = 5 
       data hash MD5: 32K
       5C 67 71 1E C5 B3 90 5A A5 CA 02 36 10 63 B7 FE>)
$$ ##END=
$$ 
$$ hash MD5
$$ EA 21 8E 8B 7C 68 54 AA 81 54 8E FA FE 65 DC AF
##$RELAX= 
##$RELAX= 
##$RELAX= 
##$RELAX= 
##$RELAX= 
##$RELAX= 
##$RELAX= 
$$ Bruker specific parameters
$$ --------------------------
##$DU= <C:\u>
##$EXPNO= 14340
##$NAME= <ADRS>
##$PROCNO= 1
##$TYPE= <nmr>
##$USER= <dgb>
##$AMP= (0..31)
100 100 100 100 100 100 100 100 100 100 100 100 100 100 100 100 100 100 
100 100 100 100 100 100 100 100 100 100 100 100 100 100 
##$AQSEQ= 0
##$AQ_mod= 3
##$AUNM= <au_zg>
##$AUTOPOS= <18 >
##$BF1= 250.13
##$BF2= 250.13
##$BF3= 250.13
##$BF4= 250.13
##$BF5= 500.13
##$BF6= 500.13
##$BF7= 500.13
##$BF8= 500.13
##$BYTORDA= 1
##$CFDGTYP= 0
##$CFRGTYP= 5
##$CHEMSTR= <none>
##$CNST= (0..31)
1 1 145 1 1 1 1 1 1 1 1 1 1 1 1 1 1 1 1 1 1 1 1 1 1 1 1 1 1 1 1 1 
##$CPDPRG= <>
##$CPDPRG1= <>
##$CPDPRG2= <>
##$CPDPRG3= <>
##$CPDPRG4= <mlev>
##$CPDPRG5= <mlev>
##$CPDPRG6= <mlev>
##$CPDPRG7= <mlev>
##$CPDPRG8= <mlev>
##$CPDPRGB= <>
##$CPDPRGT= <>
##$D= (0..31)
0 1 0 0 0 0 0 0 0 0.06 0 0 0 0 0 0 0.0002 0 0 0 0 0 0 0 0 0 0 0 0 0 0 
0 
##$DATE= 1136541202
##$DBL= (0..7)
120 120 120 120 120 120 120 120 
##$DBP= (0..7)
150 150 150 150 150 150 150 150 
##$DBP07= 0
##$DBPNAM0= <>
##$DBPNAM1= <>
$$ [...]
##$SUBNAM7= <"">
##$SUBNAM8= <"">
##$SUBNAM9= <"">
##$SW= 20.6930455092707
##$SWIBOX= (0..15)
0 0 3 0 0 0 0 0 0 0 0 0 0 0 0 0 
##$SW_h= 5175.983436853
##$TD= 65536
##$TD0= 1
##$TE= 294.16
##$TE2= 300
##$TE3= 300
##$TEG= 300
##$TL= (0..7)
0 120 120 120 120 120 120 120 
##$TP= (0..7)
150 150 150 150 150 150 150 150 
##$TP07= 0
##$TPNAME0= <>
##$TPNAME1= <>
##$TPNAME2= <>
##$TPNAME3= <>
##$TPNAME4= <>
##$TPNAME5= <>
##$TPNAME6= <>
##$TPNAME7= <>
##$TPOAL= (0..7)
0.5 0.5 0.5 0.5 0.5 0.5 0.5 0.5 
##$TPOFFS= (0..7)
0 0 0 0 0 0 0 0 
##$TUNHIN= 0
##$TUNHOUT= 0
##$TUNXOUT= 0
##$USERA1= <user>
##$USERA2= <user>
##$USERA3= <user>
##$USERA4= <user>
##$USERA5= <user>
##$V9= 5
##$VALIST= <valist>
##$VCLIST= <CCCCCCCCCCCCCCC>
##$VD= 0
##$VDLIST= <DDDDDDDDDDDDDDD>
##$VPLIST= <PPPPPPPPPPPPPPP>
##$VTLIST= <TTTTTTTTTTTTTTT>
##$WBST= 1024
##$WBSW= 4
##$XGAIN= (0..3)
0 0 0 0 
##$XL= 0
##$YL= 0
##$YMAX_a= 340160
##$YMIN_a= -350371
##$ZGOPTNS= <>
##$ZL1= 120
##$ZL2= 120
##$ZL3= 120
##$ZL4= 120
##$ABSF1= 16.45049
##$ABSF2= -4.242682
##$ABSG= 5
##$ABSL= 3
##$ALPHA= 0
##$AQORDER= 0
##$ASSFAC= 0
##$ASSFACI= 0
##$ASSFACX= 0
##$ASSWID= 0
##$AUNMP= <proc_1d>
##$AZFE= 0.1
##$AZFW= 0.1
##$BCFW= 0
##$BC_mod= 0
##$BYTORDP= 0
##$COROFFS= 0
##$CY= 12.5
##$DATMOD= 1
##$DC= 0
##$DFILT= <>
##$DTYPP= 0
##$F1P= 14.0000005364418
##$F2P= -0.99999901652339
##$FCOR= 0.5
##$FTSIZE= 32768
##$FT_mod= 6
##$GAMMA= 0
##$GB= 0
##$INTBC= 1
##$INTSCL= 1
##$ISEN= 128
##$LB= 0.3
##$LEV0= 0
##$LPBIN= 0
##$MAXI= 10000
##$MC2= 0
##$MEAN= 0
##$ME_mod= 0
##$MI= 0
##$NCOEF= 0
##$NC_proc= -3
##$NLEV= 6
##$NOISF1= 0
##$NOISF2= 0
##$NSP= 0
##$NTH_PI= 0
##$NZP= 0
##$OFFSET= 16.45049
##$PC= 1
##$PHC0= 86.72825
##$PHC1= 5.123731
##$PH_mod= 1
##$PKNL= yes
##$PPARMOD= 0
##$PSCAL= 4
##$PSIGN= 0
##$REVERSE= no
##$SF= 250.130017886679
##$SI= 32768
##$SIGF1= 0
##$SIGF2= 0
##$SINO= 400
##$SIOLD= 32768
##$SREGLST= <1H.CDCl3>
##$SSB= 0
##$STSI= 32768
##$STSR= 0
##$SW_p= 5175.98343685301
##$SYMM= 0
##$S_DEV= 0
##$TDeff= 65536
##$TDoff= 0
##$TI= <Analysis number 999999
Compound Code 99
Book Reference 9
Project Code 9>
##$TILT= no
##$TM1= 0
##$TM2= 0
##$TOPLEV= 0
##$USERP1= <user>
##$USERP2= <user>
##$USERP3= <user>
##$USERP4= <user>
##$USERP5= <user>
##$WDW= 1
##$XDIM= 32768
##$YMAX_p= 367576031
##$YMIN_p= -134242
$$ End of Bruker specific parameters
$$ ---------------------------------
##NTUPLES= NMR SPECTRUM
##VAR_NAME=  FREQUENCY,     SPECTRUM/REAL,   SPECTRUM/IMAG
##SYMBOL=    X,             R,               I
##VAR_TYPE=  INDEPENDENT,   DEPENDENT,       DEPENDENT
##VAR_FORM=  AFFN,          ASDF,            ASDF
##VAR_DIM=   32768,         32768,           32768
##UNITS=     HZ,            ARBITRARY UNITS, ARBITRARY UNITS
##FACTOR=    0.157963299565203, 1,           1
##FIRST=     4114.76159595287, 0,            0
##LAST=      -1061.22184090014, 0,           0
##MIN=       -1061.22184090014, -134242,     0
##MAX=       4114.76159595287, 367576031,    0
$$ Real data points
##PAGE= N=1
##DATA TABLE= (X++(R..R)), XYDATA
$$ [...]
19559E2765j7071K398K9665J1483J4510n633p964k3852l2176j8305K0108J3205
19547C9133k1790L7124N1871K3237L4903K3596Q260k648j6970N45Q496J5877N9594
19534B61228K4550J1478N641q905m3904m5398m9825N352K4132L2846j5420j8139
19522A83636k0214l7505j2287j9357m4036j5345k507j371J5607Q275l8786O924
19510B3034K6394J9332K541r676L8375q50m885k427K254J0254J4307J2722l9340
19497I2035o841L3602L9834J7634j1684m0722j3379J9443L8507K2079J8090J7064
19485B25662M3162N2563o689l5227m1193l8096o362k2950J1318R732r78j7116
19473A73826m5138j8589k6259k4723K0856j59R197L960N263l6518j2370L261j6147
$$ plain form
19559 52765 35694 38092 67757 79240 93750 88117 80153 56301 24125 5820 25928 39133
19547 39133 17343 54467 106338 129575 164478 188074 196334 193686 176716 177261 185757 201634 261228
19534 261228 285778 297256 302897 293992 250088 204690 154865 160217 184349 217195 201775 183636
19522 183636 163422 125917 113630 94273 50237 34892 32385 31014 46621 54896 16110 23034
19510 23034 49428 68760 71301 61625 100000 99150 94265 91838 94092 104346 118653 131375 92035
19497 92035 85194 118796 158630 176264 164580 123858 110479 129922 168429 190508 208598 225662
19485 225662 268824 321387 314698 279471 238278 200182 193820 170870 182188 191920 190942 173826
19473 173826 128688 110099 83840 59117 79973 79814 89011 92971 98234 61716 49346 52607 36460
19460C6460k2192L1495J5575J0143J7151j3528m76j9210j2307J6073M8256L481
19448A10921j7810K1580P57o695K5552r911j1385M857j6324j6163P367R702j7756
19435H4692R253J1780q108l389k4212m130K9900J1199p984J279K1514j496k3801
19422I6497r12p883m916j8735k6416p422K1918p798J6274N592p689k8474j8843
19409A1193q242j5547K4062N374j0574j8650n502M0328N2238J0576j9369k4058
19397D1829k4029M1947K2231k2414P880J6253j2894j4662K8904L219j6884P984
19385G9364J8681K4856k6180l4981L0951K4753L7340J555m4138M844K6096K7186
19373A70327j7424j4154p989q306K3573q222l4218j5060k6227j2812m2237L6035
$$ plain form
19460 36460 14268 45763 61338 71481 88632 75104 74628 55418 43111 59184 107440 110921
19448 110921 93111 114691 115448 108753 134305 124394 113009 117866 101542 85379 92746 102448 84692
19435 84692 93945 105725 97617 94228 70016 65886 95786 106985 99001 100280 121794 120298 96497
19422 96497 95585 87702 82786 64051 37635 30213 52131 44333 60607 66199 58510 30036 11193
19409 11193 2951 -12596 11466 16840 6266 -12384 -17886 22442 74680 85256 65887 41829
19397 41829 17800 59747 81978 59564 67444 83697 70803 56141 85045 88264 71380 79364
19385 79364 98045 122901 96721 61740 92691 117444 154784 156339 112201 117045 143141 170327
19373 170327 152903 138749 130760 122454 146027 137805 103587 88527 62300 49488 7251 43286
19361D3286L0480K2135k2117K3774J379P254N515l5877j9387N823j3857k3104
19349B5304Q078K0016j0639J5463L4548K6093J1790l0792l3366j6701L4334n159
19337G8969J002m926m307K7929j3029j4856K3668L2114o043p990l0316l2666n788
19324D3761j8049k607K8734M3389J19K3448K7264O753k4622j6270O409j9363M756
19311A03722J4880L688J4304j2639j5040M0329K260q425J6182l8950j8579L0159
19299A31891J0135m692K5330L8762L7515K8562Q740l5057j9409K4888L0933N9207
19287C36805J4777p378R221K4298J5489K6269j5299m9112k3399l396q546J8210
19275C37939J0386k8348k530j778l5280o7250l2692N048L193m810n0778K584k1149
$$ plain form
19361 43286 73766 95901 73784 97558 98937 106191 111706 75829 56442 62265 48408 25304
19349 25304 33382 53398 42759 58222 92770 118863 130653 99861 66495 49794 84128 78969
19337 78969 79971 75045 70738 98667 85638 70782 94450 126564 120521 112531 82215 49549 43761
19324 43761 25712 23105 51839 95228 95347 118795 146059 152812 128190 111920 118329 98966 103722
19311 103722 118602 122290 136594 123955 108915 149244 151504 143079 159261 120311 101732 131891
19299 131891 142026 137334 162664 201426 238941 267503 276243 241186 221777 246665 277598 336805
19287 336805 351582 344204 353425 377723 393212 419481 404182 355070 331671 328275 319729 337939
19275 337939 348325 319977 317447 315669 280389 213139 180447 185495 188688 183878 133100 135684 114535
19262A14535J7404O180M3728L5092l6399j4110O132N273r531k0908N427j2010
19250A40813k3805J6084M2184O7901M9033K9842M557k5039k1344m541L9097M9045
19238C63827K1690n535k4984J4923K4028l914j298l376L86K3823L613P192J7626
19225D38001j323k3750m1060k3430j9123k7880l2931l9528J717J553K4188J2382
19213B68816K0756k3088K1986O520N471O494p166l918J8867J1890p515J5278K3192
19200C57583J0169j1028Q79J181K1518K9681k232K4635M2114K0889m121J8128
19188E09396m6165j2856L9262k68K4012L3525L9698J1281J1870J959J5041N8384
19176F85139O6707L9682J4471O545N4051N6352O1482R6890R8492J46222J89353
$$ plain form
19262 114535 131939 138119 181847 216939 180540 166430 172562 177835 168304 147396 152823 140813
19250 140813 117008 133092 175276 243177 292210 322052 326609 301570 280226 275685 314782 363827
19238 363827 385517 379982 354998 369921 393949 390035 388737 385361 385747 409570 413183 420375 438001
19225 438001 436678 412928 371868 348438 329315 301435 268504 228976 230693 232246 256434 268816
19213 268816 289572 266484 288470 294990 300461 306955 299789 295871 314738 326628 319113 334391 357583
19200 357583 367752 356724 357603 358784 380302 409983 407751 432386 474500 495389 491268 509396
19188 509396 463231 450375 489637 489369 513381 546906 586604 597885 609755 611714 626755 685139
19176 685139 751846 791528 805999 812544 866595 922947 984429 1081319 1179811 1326033 1515386
19165A515386K28055J53489J51076J87014K13335K09612K41087K55372L11281
19156C465707M30257N36247P09473R55670J251043J729524K591286L870074M616279
19147B0155560N081867O169044N605800L563131K537850J713486k06418q50012
19139D3770308P08420K455103M548515P371101Q435046P761327N950732K600168
19131H3600720j341979m609662p240063q456944o842975m754455k798291M74004
19123D8030355K293784P97009m04824j246193l800844o323420o765692o797861
19115B5782314o273222n138417l822503k568635j665877j087549p34871n00353
19107C990887m06148l07460k68522k45019k12909k00601k42315j88141j91651
$$ plain form
19165 1515386 1743441 1896930 2048006 2235020 2448355 2657967 2899054 3154426 3465707
19156 3465707 3895964 4432211 5141684 6097354 7348397 9077921 11669207 15539281 20155560
19147 20155560 25237427 31406471 37012271 40575402 43113252 44826738 44620320 43770308
19139 43770308 44478728 46933831 51482346 58853447 67288493 75049820 81000552 83600720
19131 83600720 82258741 77649079 70409016 61952072 55109097 50354642 47556351 48030355
19123 48030355 50324139 51121148 50716324 49470131 45669287 39345867 32580175 25782314
19115 25782314 19509092 14370675 10548172 7979537 6313660 5226111 4491240 3990887
19107 3990887 3584739 3277279 3008757 2763738 2550829 2350228 2107913 1919772 1728121
19098A728121j52380j31131j17222j13488j41760j07825p5908o7408j8671j409
19088H00919J768l9425m5322j7376M811j3916k4485l0784N9562L6343l507m580
19076G24008j1285M8627P1260L8008M9426J4325K5547j4351l8410L4378J01697
19065A043230J00752J23333J19954M4128k1780o1534j9170l0571n4492j3635N0574
19054A280789N8366N9430P6217P3287M2611O9435J20506J00870J27510J40906
19044B149927J75534K44978L17037L95807N26647O89065R99372J571067K580019
19035I649453M203897N619690N918398M152085P07535k021021l096189j728301
19027B3405547J434862M970391P508468P674355M436740o1063m984735p525187
$$ plain form
19098 1728121 1575741 1444610 1327388 1213900 1072140 964315 888407 820999 802328 800919
19088 800919 802687 763262 717940 700564 705375 691459 666974 636190 695752 732095 728588 724008
19076 724008 712723 761350 832610 870618 920044 934369 959916 945565 907155 941533 1043230
19065 1043230 1143982 1267315 1387269 1431397 1409617 1348083 1328913 1298342 1243850 1230215 1280789
19054 1280789 1339155 1398585 1474802 1548089 1590700 1660135 1780641 1881511 2009021 2149927
19044 2149927 2325461 2570439 2887476 3283283 3809930 4498995 5498367 7069434 9649453
19035 9649453 13853350 19473040 25391438 29543523 30251058 28230037 25133848 23405547
19027 23405547 24840409 29810800 37319268 44993623 49430363 49369300 44384565 36859378
19019C6859378p582613n416581k171788Q75141K604163K454560j02033k877204
19011B4643023m764148n044853m026973k729513j663539j026024o27858l44414
19003D415701k51762j44628j15128o4385j5936K510L4017J11018J86560K47181
18993D405148L66570N71337Q30815J253560J982899L306445N256718O743964O771020
18984C1488476M192138J56231k800423l542807j360512K525956O567727R268411
18976D6495197Q718231M544247j171932o865872r379021q906741n933506j881542
18968B5619061J694700L487588K564271r53243m297884o341196o183099m728919
18960A0861279l145776j958666j274139q40786n61813l81863k73184k40743j83330
$$ plain form
19019 36859378 29276765 23860184 21688396 22563537 25167700 27622260 27520227 24643023
19011 24643023 19878875 14834022 10807049 8077536 6413997 5387973 4760115 4415701
19003 4415701 4163939 4019311 3904183 3839798 3823862 3826372 3860389 3971407 4157967 4405148
18993 4405148 4771718 5343055 6173870 7427430 9410329 12716774 17973492 24717456 31488476
18984 31488476 35680614 35836845 33036422 29493615 28133103 30659059 37226786 46495197
18976 46495197 55213428 59757675 58585743 51719871 42340850 33434109 27500603 25619061
18968 25619061 27313761 30801349 33365620 32412377 28114493 21773297 15590198 10861279
18960 10861279 7715503 5756837 4482698 3641912 3080099 2698236 2425052 2184309 2000979
18951B000979j47618j10166r5492j59567j41715j18268j11562p5331o5176o8565
18941I07519m8018n6417n8066j25892o1098m4448l672j3759l6711j7719l5691
18930D06028j5996p999j4451n792j5998J3559k6407n5043l2638K5714K2075l9916
18918B53136k4293K9530K6045J414j2779l4145r149O18k0055L83L575J5696M0830
18905B70806J2584p587k5836j6240K5469k6338j0704R08j118J1352o346L3879
18893B60829k1954K120K3412n000k5779L93r501j6075P375o928N121k9263j5428
18880A69322J3357L7011r432r815j9057M428n270m449j9189l0001J3227J0221
18868A50353j0970R048j035l397L1538L5712j1646K0548J1492J1669k352L8088
$$ plain form
18951 2000979 1853361 1743195 1647703 1488136 1346421 1228153 1116591 1041260 976084 907519
18941 907519 859501 803084 745018 619126 558028 513580 509908 496149 459438 441719 406028
18930 406028 390032 382033 367582 361790 345792 359351 332944 277901 245263 270977 293052 253136
18918 253136 228843 258373 284418 285832 273053 238908 229759 230377 210322 210705 214280 229976 270806
18905 270806 283390 275803 249967 233727 259196 232858 222154 223062 221944 233296 226950 260829
18893 260829 238875 240995 264407 259407 233628 234021 224520 208445 215820 208892 214013 184750 169322
18880 169322 182679 219690 210258 200443 181386 185814 180544 176095 156906 126905 140132 150353
18868 150353 139383 148431 147396 143999 175537 211249 199603 220151 231643 243312 240960 279048
18856B79048J7531j4877l9210k2105J3054O4133N2338K2435K4042N556K0568k3992
18844C98521m5787l611J7598J4350o288p716L83L460K4423k9767j4633M8091L5081
18831D34105L2493o734O099M9537N2243K8360K0392J152k625J1769J7661M3224
18819F87676Q0228R0937N8287P4402R6795J07422M8965J13948J08225Q7686R6737
18808A651308P7827J09286J09822J22867J93305K73752L39668M84639O79368R91926
18798E033768J578714K632758L608833L511102L815988K957168L04810o30577
18790B2812564j307570p92521Q22932J738630L098877M069430K311209R47259
18782C3700810M5943j239057l249449l471420l300622k312455n10409M00686J195378
$$ plain form
18856 279048 296579 281702 242492 220387 233441 297574 349912 372347 396389 401945 422513 398521
18844 398521 352734 349123 366721 381071 374783 367067 367450 370910 395333 365566 350933 399024 434105
18831 434105 466598 459864 465963 515500 567743 596103 616495 617647 615022 626791 644452 687676
18819 687676 767904 858841 917128 991530 1088325 1195747 1244712 1358660 1466885 1554571 1651308
18808 1651308 1729135 1838421 1948243 2071110 2264415 2538167 2877835 3362474 4041842 5033768
18798 5033768 6612482 9245240 12854073 16365175 20181163 23138331 23443141 22812564
18790 22812564 21504994 20712473 21535405 23274035 26372912 30442342 32753551 33700810
18782 33700810 33746753 32507696 29258247 25786827 22486205 20173750 19663341 20064027 21259405
18773B1259405J595261o94861k075559k954246l593950l149864k435975j716734
18765F233477j101564p63716m46943k15368j13743n3165M7628J22634J86403K32545
18755D128188L18153M30103N60982Q71372J225219J936540L216618N000344N905345
18746B3592864N842230O208773K830303m98281j854201k666455r78942J165107
18738C3641398K839882N510917N411920L113705J600866M26681k713721n320172
18730D4511476n436925n363315l303285r69265K51059J920476Q39059k354158
18722C0095122l650394n125116n339172m513636l297453k104701j333942q30616
18714C900092n81195m00751l12796k82410k44275k21606j94183j35650j17638
$$ plain form
18773 21259405 22854666 22159805 20084246 17130000 13536050 10386186 7950211 6233477
18765 6233477 5131913 4368197 3921254 3705886 3592143 3538978 3586606 3709240 3895643 4128188
18755 4128188 4446341 4876444 5437426 6308798 7534017 9470557 12687175 17687519 23592864
18746 23592864 29435094 35643867 38474170 37975889 36121688 33455233 32476291 33641398
18738 33641398 36481280 41992197 47404117 50517822 52118688 52545369 49831648 44511476
18730 44511476 39074551 33711236 30407951 29438686 29689745 31610221 32449280 30095122
18722 30095122 26444728 21319612 15980440 11466804 8169351 6064650 4730708 3900092
18714 3900092 3318897 2918146 2605350 2322940 2078665 1857059 1662876 1527226 1409588
18705A409588q8028p2277q2605r1632p7744q5354r1486n9006m7667k9985q4828
18694E98976m7442j1679k0226l1185m1110l8799j3890l386j4416J0389k4745k901
18682C59586k031j3708n086j2052j5406o664k627k0366k9310Q197p767p252n166
18669B40348l5079K057J0551K0867N818j0256l7303q128L4803J4827J6751K841
18657B58097P350L9456M310j7842J0784j7671Q296J7680k562M872N255K5116L3094
18644C76235o675L59J2244k975Q044M8820K5967K2687K8667M9891M1100N6800
18632F61164l752q728J0769M4944K0620k3685k946N5786N9878L4967M9891L0489
18620I29397N4491J18377J10273J27479Q8555R9303Q4168O6016N8540O9485K6682
$$ plain form
18705 1409588 1321560 1249283 1166678 1075046 997302 911948 820462 761456 713789 683804 598976
18694 598976 551534 539855 519629 488444 447334 408535 394645 391259 376843 387232 362487 359586
18682 359586 357555 343847 338761 326709 311303 304639 302012 281646 252336 260533 252766 245514 240348
18669 240348 205269 207326 217877 238744 244562 234306 197003 188875 223678 238505 255256 258097
18657 258097 265447 304903 309213 291371 302155 284484 292780 310460 307898 312770 318025 343141 376235
18644 376235 369560 369919 382163 379188 387232 436052 462019 484706 513373 563264 604364 661164
18632 661164 657412 648684 659453 704397 725017 701332 698386 754172 814050 849017 898908 929397
18620 929397 983888 1102265 1212538 1340017 1428572 1527875 1612043 1678059 1736599 1806084 1832766
18609A832766M1427j7780k8270m0934j5616l3195l9222L0637J29851J52612K26141
18598B238417L03635M55093N49034P34831J031306J434574K151924L384328N199938
18589A7483080P103877Q640411Q606553P547523N262367K100468j535138m728825
18581E0480316p310668q860396q848790p621485n603647l703544k316820j414264
18573D800702q53827n44614l37521j76985p5772Q41P6726J00827J21757P8216
18563C190350O8477N7668k0807m6629q4340q1769j33018j22947q9157k3574Q8583
18552B802837J84247K82009M34553N60681P50873J007336J373047K002246L010322
18543A2408151M610658P013538R681881J1895416J2250227J0847046P846336L445194
$$ plain form
18609 1832766 1874193 1856413 1828143 1787209 1771593 1738398 1699176 1729813 1859664 2012276 2238417
18598 2238417 2542052 2997145 3546179 4281010 5312316 6746890 8898814 12283142 17483080
18589 17483080 24586957 33227368 41833921 49381444 54643811 56744279 55209141 50480316
18581 50480316 43169648 34309252 25460462 17838977 12235330 8531786 6214966 4800702
18573 4800702 3946875 3402261 3064740 2887755 2811983 2812824 2889550 2990377 3112134 3190350
18563 3190350 3258827 3316495 3295688 3249059 3164719 3082950 2949932 2826985 2737828 2714254 2802837
18552 2802837 2987084 3269093 3703646 4264327 5015200 6022536 7395583 9397829 12408151
18543 12408151 17018809 24032347 33714228 45609644 57859871 68706917 76553253 79998447
18535G9998447j633068o338630j0019718j2322183j2547562j1022949q300048
18528A7814289n673790l580729k211047j373233q92384n84946m16851k83002j64026
18519B634281q7727n9889M486K6411N6334M262l9150l3130n8503q0154j13787
18508B253434r1607j09879q8458n3821q126K0589J35881J83703K91237M01549
18498B934502N45545P35292R92295J484263K389242L384772M235162M606115M148291
18489B5455479L252522J625886k26348k122446l454931m601867m844946m434236
18481A0649113l389138k359300j469376q81891n81118m10520k60791j31545r7274
18472A068160j17692r7882l4564l647J4616J4492j1588p392j0136l9580o0577
$$ plain form
18535 79998447 78365379 72026749 62007031 49684848 37137286 26114337 17814289
18528 17814289 12140499 8559770 6348723 4975490 4083106 3498160 3081309 2798307 2634281
18519 2634281 2546554 2486665 2491151 2517562 2573896 2578158 2539008 2505878 2447375 2367221 2253434
18508 2253434 2161827 2051948 1963490 1909669 1901543 1922132 2058013 2241716 2532953 2934502
18498 2934502 3480047 4215339 5207634 6691897 9081139 12465911 16701073 21307188 25455479
18489 25455479 28708001 30333887 30107539 27985093 24530162 19928295 15083349 10649113
18481 10649113 7259975 4900675 3431299 2549408 1968290 1557770 1296979 1165434 1068160
18472 1068160 950468 852586 818022 814375 828991 843483 831895 824503 814367 774787 714210
18461G14210k6680j6668l5817o6652o7036r8435o3791m882j6298J7928K3466j0277
18449C49068l5902l7860m1593q199m608M596J0302l7094k3119P908q08L7808k4275
18436A96224J2760j1914J898N418j66l1947k7773P179L7130Q0589M1453L1232
18424C42083P5680O124r343k4112l9444l7320n6347l0987r631J808M9405N6191
18412C24107N0578L9403J0825p501j3183k2767m8257j9893k4733l3373p500R840
18400B57546p346J102j3939k5644K0832K1128J1429O473K6754k9640k9543L8621
18388B77773K6959N494o3190m5557p107K4750n835k5405k93J4643r485l7781J3332
18375A68298K799k5653n2753J3468j0566J2003M8254J6897M1186J546J6421k1102
$$ plain form
18461 714210 687530 670862 635045 568393 501357 402922 339131 334249 317951 335879 359345 349068
18449 349068 313166 275306 233713 225514 220906 225502 235804 198710 175591 183499 182691 220499 196224
18436 196224 208984 197070 198968 204386 204220 172273 144500 151679 188809 269398 310851 342083
18424 342083 417763 423887 414544 390432 350988 313668 257321 226334 216703 218511 267916 324107
18412 324107 374685 414088 424913 417412 404229 381462 333205 313312 288579 255206 247706 257546
18400 257546 250200 251302 237363 211719 232551 253679 265108 271581 298335 268695 239152 277773
18388 277773 304732 310226 247036 201479 194372 219122 213287 187882 187589 202232 192747 154966 168298
18375 168298 171097 145444 92691 106159 95593 107596 155850 172747 213933 215479 231900 210798
18363B10798J210M7436N416L5230J8958j695n558k8676n860L1393J5995j6857
18351C07790K8594J2841M6190J9428M4614L004n0656k6890k3157o939l6996N973
18339C23796P99l3516j5573M417l298l387K0456k4863K5987o595j7243p2037k2555
18326A76388L859m0808j0201j5678k209K4245R446K1188M6515k4749k4490m2866
18314A20640J9797K1400l4016j7090J2563j723l5319r231M602J1339Q664j0686
18302I0940J0367L0983K4707l4698l8743o194N922K4326M1978Q93q848k2149K2594
18289A42078J7187J529J1711j3549j0611K8944N1967K8922j0725M8108K7064m7262
18277B75363l3008K0955M5162P979K9562K8782R205K8176J5899M613l5583j1531
$$ plain form
18363 210798 212008 259444 264860 300090 319048 317353 311795 283119 277259 308652 324647 307790
18351 307790 336384 349225 395415 414843 459457 462461 411805 384915 361758 354819 317823 323796
18339 323796 324595 291079 275506 279923 276625 273238 293694 268831 294818 288223 270980 198943 176388
18326 176388 180247 139439 129238 113560 111351 135596 145042 166230 212745 187996 163506 120640
18314 120640 140437 161837 127821 110731 123294 121571 86252 77021 81623 92962 101626 90940
18302 90940 101307 132290 156997 122299 83556 77362 83284 107610 149588 150481 141633 119484 142078
18289 142078 159265 160794 172505 158956 148345 177289 229256 258178 247453 295561 322625 275363
18277 275363 242355 263310 308472 316451 346013 374795 384000 412176 428075 432688 397105 385574
18265C85574r582m0094n9310k7440J1893N4584j373l6257n6685l3249o266j6174
18253A65621j9538Q273J942j4029k0861k0937J354j297J8161J6706O397j452l145
18240A37195L6883K5718K1657M5562M6034K470m5256j288O2596O8902N7459o104
18228D51828k73j8740K5040L410K1257Q5056M2311N4556P8820M5942j1454j4082
18216G63671O147j7144J9128J2777l7704o2736m5673j7163m754k516k547o3283
18204E48203l1978j4483k8131j1602m4308j0976J9504p526q766l2655k0511k5250
18192C31521j8209J2468O323J4709L149l9712n7998n7414k1226k3392j3174P651
18180A44696J5028O590K1571K4564n657P715j442K997k8714k2514K6045p575j2595
$$ plain form
18265 385574 375992 335898 276588 249148 261041 315625 314252 277995 221310 188061 181795 165621
18253 165621 146083 154356 156298 142269 121408 100471 101825 100528 118689 135395 141792 140340 137195
18240 137195 174078 199796 221453 267015 313049 315519 270263 268975 331571 400473 457932 451828
18228 451828 451555 432815 457855 461265 482522 567578 609889 664445 743265 789207 777753 763671
18216 763671 769818 752674 771802 784579 746875 684139 638466 621303 616549 614033 611486 548203
18204 548203 516225 501742 473611 462009 417701 406725 426229 418703 409937 377282 356771 331521
18192 331521 313312 325780 332103 346812 349961 310249 252251 194837 173611 150219 137045 144696
18180 144696 159724 166314 187885 212449 206792 214507 213065 216062 187348 164834 190879 183304 170709
18167A70709l7947r68J9622K1045K8955m3568p181K5652p066l278K4333P171M424
18154B01903L636r07m594J6175K063J0501M3391j8891l8848j609L3850n991q092
18141B32587q628J6375J4349j755K8744L8818N6419L2733J9276L5908P1457Q2263
18129F18546N8622M7532N4151N0695O5773J21092J69266K03805K19212K79436
18119A888130L85935M75510O32214Q31969J145932J715411K812795N101006J0089298
18110B5078200K1302429K8208710q1652j6131843k1234884j6002004q840376m621482
18102G677098k500258j424493q89034o30785m36448l24004k48721j71400q5408
18093I66547r9421r1750p8781j07612j11636p3508j2321k5460k3917l774N25l9648
$$ plain form
18167 170709 132762 131794 151416 172461 201416 157848 150667 176319 169253 165975 190308 197479 201903
18154 201903 205539 204632 200038 216213 218276 228777 272168 253277 214429 212820 246670 240679 232587
18141 232587 223959 240334 254683 252928 281672 320490 376909 409642 428918 464826 536283 618546
18129 618546 677168 724700 778851 829546 895319 1016411 1185677 1389482 1608694 1888130
18119 1888130 2274065 2749575 3381789 4213758 5359690 7075101 9887896 14988902 25078200
18110 25078200 46380629 74589339 74507687 58375844 37140960 21138956 12298580 7677098
18102 7677098 5176840 3752347 2863313 2232528 1796080 1472076 1223355 1051955 966547
18093 966547 867126 775376 696595 588983 477347 403839 391518 366058 342141 338367 338892 299244
18081B99244m8821P763n380l8942k273m5064J7879K9376O2585K7526L4393O4412
18069D02698J5163m3493m8074m2964k0812l0698m7100j8238l924j2224j4540N06
18057A36300l960M1274J982l6751j5805R511k4765r641n709j9134m229J1467J4503
18044I5043J7618j4433J1882j1307j6448j7825j1134r608l5963o401m64K5817
18032B6777K4485J3855j6758J1661K7301L2596P931J9307R9231J24276L7966R329
18020D17957J3322J4574j1170n8683p5108o2166m7706l2506m3875l2714q719P66
18008G3972J3830j4826k1672K3364K2993J9889O618k6066n796K842j6765r969
17996F8414R926K0468j2140N4413O3050O8051N1705O807J315J7615l0752q6902
$$ plain form
18081 299244 250423 258186 252806 213864 211591 166527 184406 213782 276367 303893 338286 402698
18069 402698 417861 374368 326294 283330 262518 231820 184720 166482 162558 150334 135794 136300
18057 136300 132340 173614 175596 138845 123040 132551 107786 98145 92436 73302 69073 80540 95043
18044 95043 112661 98228 110110 98803 82355 64530 53396 43788 7825 1424 960 26777
18032 26777 51262 65117 48359 60020 87321 119917 127848 147155 246386 370662 408628 417957
18020 417957 431279 445853 434683 376000 300892 238726 191020 158514 114639 81925 73206 73972
18008 73972 87802 72976 51304 74668 97661 117550 124168 98102 92306 95148 78383 68414
17996 68414 78340 98808 86668 141081 204131 272182 323887 330694 332009 349624 318872 231970
17984B31970m0494k6679k4259l1081j3537J2770m952L2753O1782Q4633Q2943L4059
17972C99908J3231O146j7796m2095n5074o8331p3777j8387M90J2280M851J6789
17960A78235Q892j5410l4970m3718j4663J304K9542j2388k3203P355K5810L8489
17948A45275J2704o4217k6392p231m3359m2635j2557K0871r972J1969N3590O216
17936D4262J5784J7012K6574K3740j4125k6833m6032r946M8959K6479j6266O599
17924I6207j994k5387l0674J4394j6056J2034J1145j9865k2564J0227N1202L9419
17912A18088k2771j1212J4268j533J4195R860l881j1102L430Q990k8889j4432
17900G5011j7047j1759K1248K8261J2986j0874j2897K2801l243k7351k7567J0186
$$ plain form
17984 231970 191476 164797 140538 109457 95920 108690 103738 136491 198273 282906 365849 399908
17972 399908 413139 419285 401489 359394 304320 235989 162212 143825 144315 156595 161446 178235
17960 178235 187127 171717 136747 93029 78366 79670 109212 96824 73621 80976 106786 145275
17948 145275 157979 93762 67370 60139 16780 -25855 -38412 -17541 -27513 -15544 38046 44262
17936 44262 60046 77058 103632 127372 113247 86414 40382 30436 79395 105874 89608 96207
17924 96207 94213 68826 38152 52546 36490 48524 59669 39804 17240 27467 78669 118088
17912 118088 95317 84105 98373 96840 111035 120895 117014 105912 109342 118332 89443 75011
17900 75011 57964 46205 67453 95714 108700 97826 84929 107730 104487 77136 49569 59755
17888E9755K6779M594p227O171k3817j8507K127J9984J3442l3487k1091K1525
17876E0248K2886J5051R222J296j2819j733j4667K8720L2263J1186p670j2591
17864A21392R205K2437N7355L1522O322L1727Q4640M6294K1856K1897J2540j1754
17852D55433R03j4395j0209m5390q2480l2648j1067k4263J5355J898P301k026
17840B58412N4211J00182N9369P1009K2890j5432l5169o1068r3961p2372n5793
17829B32278o5061m4341j8286k6005k2344j5994N68J9586j0750O450j6429r397
17817C0275p375j3550O90J6309J8577M027o896j3959L5768M7265k7263k3110l8595
17804B2163k7212l7874j0081J4434L0540K2894M5187J8956Q726j0824j7210j4432
$$ plain form
17888 59755 86534 91128 83901 90072 66255 47748 49875 69859 83301 49814 28723 50248
17876 50248 73134 88185 97407 98703 85884 84151 69484 98204 130467 141653 133983 121392
17864 121392 130597 153034 210389 241911 248233 279960 364600 410894 432750 454647 467187 455433
17852 455433 456336 441941 431732 386342 303862 271214 260147 235884 251239 253137 260438 258412
17840 258412 312623 412805 472174 543183 566073 550641 515472 454404 360443 288071 232278
17829 232278 167217 122876 104590 78585 56241 40247 40815 60401 49651 56101 39672 30275
17817 30275 22900 9350 10040 26349 44926 48953 42057 28098 63866 111131 83868 60758 22163
17804 22163 -5049 -42923 -53004 -38570 -8030 14864 60051 79007 87733 76909 59699 45267
17792D5267O367K2227J3577k7403J8282M2830J0504K517M902k3137n018K4895
17780A35810k6682r946o41n8185m4920K6271M5254O53l8674k0316J2033j7376
17768C281l7822J4320K6169K205k330j9603q121j978K1114J1884n926j8630L2027
17755A6590J1259l083J6782K7272l714k157r056m427j4459M887r645k1542J5141
17742B3848J3153M3131K52m6728j4193n375j8841Q746J4247r157M076K357M059
17729A9575O385q644K983J4813m942m2171K00Q500k4718M0179L6456l3532k1816
17716f732m702j3278K0137J4369K239l756r899j251J0466J8235L7659J5327J9884
17703I8698K645L554j2355l5963j2084O955L5147K928j5058j2868j6642l9876
$$ plain form
17792 45267 51634 73861 87438 60035 78317 121147 131651 134168 139070 115933 110915 135810
17780 135810 109128 99182 98541 40356 -4564 21707 66961 67614 28940 8624 20657 3281
17768 3281 -34541 -20221 5948 8153 5823 -13780 -21901 -23879 -2765 9119 3193 -15437 16590
17755 16590 27849 24766 41548 68820 65106 62949 53893 49466 35007 39894 30249 8707 23848
17742 23848 37001 80132 80384 33656 19463 14088 -4753 3993 18240 9083 13159 15516 19575
17729 19575 25960 17316 20299 35112 30170 -12001 -11801 -3301 -28019 12160 48616 15084 -6732
17716 -6732 -11434 -24712 -4575 9794 12033 8277 -1622 -2873 7593 25828 63487 78814 98698
17703 98698 101343 104897 92542 56579 44495 51450 86597 89525 74467 61599 44957 5081
17691E081k6725o050L3062J3877n056k021m7197L279L8486J8148j6063j0335j6087
17678a7601K0751K3757k4611j4598J1396m7057l5889L5591J7750J3824J0347o352
17666a2692j9369o640L3402j9901Q412K7304q233P744J3384l4251j4257J2206
17654a2891j5194k2734j3086j8353P007J2889K5605L7948K317k2561l5545K5600
17642b8998K1685J2480k5873J614K6393j7582P279J0396m94M475j9666J6253M3108
17629E1070M240j0127R331r079K124K5803r766q109j9916l4308j2955J1070j2843
17616a3465j1615j6284k8714J5676J9798K5072J1840k992p691K4278l915j7630
17604e642J0814l02J3453l600r898J9885n270l2641J390K2235k1504m5037l0004
$$ plain form
17691 5081 -21644 -27694 5368 19245 14189 12168 -35029 -31750 6736 24884 8821 -1514 -17601
17678 -17601 3150 26907 2296 -12302 -906 -47963 -83852 -48261 -30511 -16687 -6340 -12692
17666 -12692 -32061 -38701 -5299 -25200 -16788 10516 2283 10027 23411 -10840 -25097 -12891
17654 -12891 -28085 -50819 -63905 -82258 -75251 -62362 -36757 1191 3508 -19053 -54598 -28998
17642 -28998 -7313 5167 -20706 -19092 7301 -10281 -3002 7394 6900 11375 -8291 7962 51070
17629 51070 55310 45183 54514 45435 47559 73362 63596 55487 35571 1263 -11692 -622 -13465
17616 -13465 -25080 -41364 -70078 -54402 -34604 -9532 2308 -684 -8375 15903 11988 -5642
17604 -5642 5172 4870 18323 14723 4825 24710 19440 -13201 -11811 10424 -11080 -56117 -86121
17591h6121K3846J6820k973k0615L6588m347l4204K3123K738N16R593K0136m8378
17578f3278n962K2150L2531J8481o198K1670M1178k2402k7396J1915J5261l040
17566C4910l077l8O79l599j0339j2866j238m956j7137J8669j047K32K2132j3279
17552I046k753q371j6557l6716k7897j6239J9494L7527M5601J4696j5792j3636
17540a1597k1762o481l4799k0324n268J9353J0867K06L0038L9836J4957K7650
17528D2676M130p588k5257n5487j9575J2053K8454L73r988M213r076j5367L315
17515d7124P876Q284K7009l624l0862j8036j5754J7098J4523Q133K8478j9672
17503b3671j1277m747k4066J4452J6122M812q311Q456K0925j2256l7911j0027
$$ plain form
17591 -86121 -62275 -45455 -48428 -69043 -32455 -36802 -71006 -47883 -45145 -44629 -35036 -14900 -63278
17578 -63278 -69240 -47090 -14559 3922 -2276 19394 60572 38170 10774 22689 37950 34910
17566 34910 31833 31795 32474 28875 18536 5670 4432 -524 -17661 1008 -39 193 22325 9046
17552 9046 6293 -2078 -18635 -55351 -83248 -99487 -79993 -42466 3135 17831 2039 -11597
17540 -11597 -33359 -39840 -74639 -94963 -100231 -80878 -70011 -69805 -39767 69 15026 42676
17528 42676 46806 39218 13961 -41526 -61101 -49048 -20594 -20221 -30209 -25996 -35072 -50439 -47124
17515 -47124 -39248 -30964 -3955 -7579 -38441 -56477 -72231 -55133 -40610 -32477 -3999 -23671
17503 -23671 -34948 -39695 -63761 -49309 -33187 -28375 -36686 -28230 -7305 -19561 -57472 -67499
17491f7499K5602K0622K0420k6927J861N9252K2614m0150k9695K1500K1492P26
17479B9818k2081J8378k2107Q98j1297p463j1749q932J7066L6535N635k0822k598
17466A281l2167j8711K3636M7733k1609j3340N383j621o741j8402l8054K8754
17454d3858L9308O907Q179L201k4748k1329m802K0529K1211M3652J27369J59102
17442C34721M5337n4496j13901q0122n8707l9155k1413k9226k2576R853J3840
17431a5845J7273P09k015p530P312j8236l3345J4534J8887q773J1233R537J8476
17418A2217J4690j458j1745J6518j6885r019r206j2421K9032J6100k8818M89l019
17405c525R590j3244J7327l8715L864k4389k5305L6870L2794M888l642j4891l4857
$$ plain form
17491 -67499 -41897 -21275 -855 -27782 -25921 33331 55945 15795 -13900 7600 29092 29818
17479 29818 7737 26115 4008 4906 -6391 -13854 -25603 -34535 -17469 19066 24701 3879 1281
17466 1281 -30886 -49597 -25961 21772 163 -13177 -7794 -9415 -16156 -34558 -72612 -43858
17454 -43858 -4550 2357 10536 13737 -11011 -32340 -37142 -16613 4598 48250 175619 334721
17442 334721 380058 325562 211661 131539 72832 33677 12264 -16962 -39538 -29685 -15845
17431 -15845 1428 2137 122 -7408 -96 -18332 -51677 -37143 -18256 -27029 -15796 -6259 12217
17418 12217 26907 25449 13704 30222 13337 4318 -4888 -17309 11723 27823 -995 -506 -3525
17405 -3525 6065 -7179 10148 -28567 -24703 -49092 -74397 -37527 -4733 155 -3487 -18378 -53235
17392e3235j7349J4575M1335M101P164n197m949j1165k1776J3275j145Q515K6280
17379D29j3828r092q60o845J0966q990P270K2702K0359J3978J3812j2965K002
17366C8938n429k0504O384j4187j0514j557k4986J3853Q006o501j5534L257J6176
17353a2598N737N700j4718k2878L669K9134q596j3581N930J7590J6364m1917j2980
17340d3144L4436L1553j9620q488P308Q023n403N577K4575j3835k6945O358K820
17327C215j0935j4784m772J8955J905l504j7347j1713J0436O22K895k9802J2285
17314d2544J2505m969l2694N588J2859L6563p022k4832l6155J0020J7605L5063
17302a8013M2955O727l8512l5732j9249m316L5289j23j1460J3326K2547j5023
$$ plain form
17392 -53235 -70584 -56009 -14674 -10573 -3409 -8606 -13555 -24720 -46496 -33221 -34366 -25851 429
17379 429 -13399 -22491 -23351 -30196 -19230 -28220 -20950 1752 22111 36089 49901 36936 38938
17366 38938 33509 13005 19389 5202 -5312 -6869 -31855 -18002 -9996 -16497 -32031 -28774 -12598
17353 -12598 -6861 -1161 -15879 -38757 -35088 -5954 -14550 -28131 -22201 -4611 11753 -30164 -43144
17340 -43144 -8708 22845 3225 -5263 2045 10068 4665 10242 34817 20982 -5963 395 3215
17327 3215 -7720 -22504 -27276 -8321 -6416 -9920 -27267 -38980 -28544 -27922 -25027 -54829 -42544
17314 -42544 -30039 -35008 -67702 -62114 -49255 -12692 -19714 -44546 -80701 -70681 -53076 -18013
17302 -18013 24942 31669 -6843 -42575 -61824 -66140 -30851 -30974 -42434 -29108 -6561 -21584
17290b1584k1960j5780K532K9812L2398j5672j4489N1189L7614R334l9507m288
17278B9599J2565O790l91m1444j9238q133P86j7089k3842L439L5380L1083l1243
17265b1738j0182J2118K5326N3011j4403k0655k4910K508K1039q3j5051K1275
17253B8255l0416k1419J4828r106K0976N7504L4748m2386k0554o49J8278J6654
17241F6713Q617r049l2995q997m754J8731k7401J737K195k4307J2603K5461k2698
17228E856K042Q883j8613l6281j6415O806M4905j7110q537J3406n52j1046q53
17215b7509j1120J394J441J1694K3211K7857o819O120J6293N748l829k2884n2362
17202c0765j1188J9642j4442K3012R420j3859L85P624k7757O658J2499J827j7316
$$ plain form
17290 -21584 -43544 -59324 -56792 -26980 5418 -10254 -24743 26446 64060 73394 33887 29599
17278 29599 42164 48954 48563 7119 -12119 -20252 -19466 -36555 -60397 -56958 -21578 9505 -21738
17265 -21738 -31920 -19802 5524 58535 44132 23477 -1433 1075 22114 22031 6980 28255
17253 28255 -2161 -23580 -8752 -17858 3118 60622 95370 52984 32430 31781 50059 66713
17241 66713 75330 66281 33286 24289 19535 38266 10865 12602 14797 -9510 3093 28554 5856
17228 5856 7898 16781 -1832 -38113 -54528 -47722 -2817 -19927 -28464 -15058 -15610 -26656 -27509
17215 -27509 -38629 -37235 -35794 -24100 -889 26968 20149 26269 42562 48310 44481 21597 -30765
17202 -30765 -41953 -22311 -36753 -13741 -4321 -18180 -17795 -10171 -37928 -31270 -18771 -16944 -34260
17189c4260L351j4533j094m882J3758j6321M3563J9044r858M786l8241j913J3872
17176b2728J5507n75J994j7689K3130n661j0851j2751k1527P84L769k634K7611
17163b1621N1661j8940k5558n567k3462P758K8189J740K9403J3022J1609n015
17151D3219q284m246q806o821k4285K9709N934k2368l3009K1414J5153o161K585
17138D034j8201j7967k9609k415J1536o247L8028k180j475M527o378O939j600
17125b1008J8544K0939M170r541O166r622k9044k2538K0348K0800j4471N492r277
17112a9042k2621j639J1215J4578j2964Q5P346L8816R442R930O719k7870m728
17099I267J5612N665k8451r72K563J292m0025k3295J3936q25L4741K1463O597
$$ plain form
17189 -34260 -30909 -45442 -46536 -51418 -37660 -53981 -10418 8626 -1232 3554 -34687 -36600 -22728
17176 -22728 -7221 -7796 -5802 -23491 -361 -6022 -16873 -29624 -51151 -50367 -46598 -49232 -21621
17163 -21621 30040 11100 -14458 -20025 -43487 -35729 -7540 -5800 23603 36625 48234 43219
17151 43219 34935 30689 21883 15062 -9223 20486 26420 4052 -28957 -7543 7610 1449 4034
17138 4034 -14167 -32134 -61743 -64158 -52622 -58869 -20841 -23021 -24496 -19969 -26347 -19408 -21008
17125 -21008 -2464 18475 22645 13104 19270 9648 -19396 -41934 -21586 -786 -15257 -9765 -19042
17112 -19042 -41663 -43302 -32087 -17509 -30473 -30388 -23042 15774 25216 35146 41865 13995 9267
17099 9267 24879 30544 2093 1121 3684 4976 -35049 -58344 -44408 -45233 -10492 10971 17568
17086A7568l867P828K6554P313l1917j228j3838p653j0306J388P074r102k466
17073a2652j0182p446J7377J1078j3265j0379K5362N0509r267j7148k2119j8714
17061a6846N87j294r392K892K0909m069j8040j9149Q217J6781K0330J3170J284
17048A5380J6486l197q735n732m6578l0474L0849J0700J4505K3833N290r928j84
17035A2215J889l2774j6485m045J0230P544K5191K5154k1560o2861r198K4797
17023c9903N78J0606N072k0088n117K5709K2107P070J3779J2030m5843j6072M204
17010b5868J3960J1820J6281K846n514k9575L5405L9710J3710j972l6437k9847
16998D519m418k9056O730k1433p277J3631L9751j2496o380k6907K731J2109J203
$$ plain form
17086 17568 13701 21529 48083 55396 23479 22251 8413 760 -9546 -8158 -1084 -10186 -12652
17073 -12652 -22834 -30280 -12903 -1825 -15090 -25469 -107 50402 41135 23987 1868 -16846
17061 -16846 -16259 -17553 -26945 -24053 -3144 -7213 -25253 -44402 -36185 -19404 926 14096 15380
17048 15380 31866 28669 19934 14202 -32376 -62850 -32001 -21301 -6796 17037 22327 12399 12215
17035 12215 14104 -18670 -35155 -39200 -28970 -21426 3765 28919 7359 -55502 -64700 -39903
17023 -39903 -39325 -28719 -23647 -43735 -48852 -23143 -1036 6034 19813 31843 -14000 -30072 -25868
17010 -25868 -11908 -88 16193 19039 13525 -16050 19355 59065 72775 70803 34366 4519
16998 4519 101 -28955 -22225 -43658 -50935 -37304 2447 -10049 -16429 -43336 -40605 -28496 -27293
16985b7293M17j9874j68M825k9422j1213L818R287j2144K1172P80L743L1696L8269
16971A3893K6311j5619l736n6950l556J8341J0313J8004l498k3861j0327k8744
16959e9429j2395J7546K370K9673N120j9104J0753Q31L005L2158N614o4616m2604
16946i1078J3311L2081j823J1608l3171k5734J2813J1718K724N713J1157J3264
16934c7417P925N38J0610k9692N877P147J1773l321j1806K0608J3598j77r176
16921a3513J4362L9595k9829l3391j7813J2110M526j5389J1668k5723j9953K8785
16909d4565L7878M3412J3556l8618l1947K0756K6379j4337k2747m5225l3047M3182
16897d5323M3309J0697j6718r552j246M661R661m9380o80K1045j3794n947L4514
$$ plain form
16985 -27293 -26876 -46750 -46918 -42093 -71515 -82728 -78910 -69623 -81767 -60595 -59815 -56072 -24376 13893
16971 13893 40204 24585 20849 -36101 -39657 -21316 -11003 7001 3503 -20358 -30685 -59429
16959 -59429 -71824 -54278 -51908 -22235 -17115 -36219 -25466 -24635 -21630 10528 16142 -48474 -91078
16946 -91078 -77767 -45686 -47509 -35901 -69072 -94806 -81993 -70275 -67551 -61838 -50681 -37417
16934 -37417 -29492 -28954 -18344 -48036 -42159 -35012 -23239 -26560 -38366 -17758 -4160 -4337 -13513
16921 -13513 849 40444 10615 -22776 -40589 -28479 -23953 -39342 -27674 -53397 -73350 -44565
16909 -44565 -6687 36725 50281 11663 -20284 472 26851 12514 -10233 -55458 -88505 -45323
16897 -45323 -2014 8683 -8035 -17587 -18833 -14172 -4511 -53891 -54571 -33526 -47320 -53267 -18753
16884a8753J7682J0295K3065k5651l6188K3909J2805r216M500q142J8171K7372
16872C9849J2608l7669n5297K4187N8748N349k0k5683K8797j1911k6155j8068
16860e265K2066L9223Q210m2106J876J2830j9719l862j5366J4491J6532l639j7361
16847G910l8490l486J7502M779M2366m941j9727l4858j2615J4783J83N4116L3133
16834F0655K5726m46l0963m3251Q947M1191k2375q778r730j7326j949J8948j075
16821A9574l7458r358J0166P059O147j5139l2836J7190K4230j81j9526K946K5816
16808a370j2661J3254P980k5856M488O349J5006J8206J1895k9446k0400j2031
16796b4586J1028K4835l2464O837L4817p083j1184k4629l3854O635L3424K9454
$$ plain form
16884 -18753 -1071 9224 32289 6638 -29550 -5641 7164 -2052 2448 -5694 12477 39849
16872 39849 52457 14788 -40509 -16322 42426 47775 47755 22072 50869 38958 12803 -5265
16860 -5265 16801 56024 64234 22128 24004 36834 17115 13253 -2113 12378 28910 25271 7910
16847 7910 -30580 -34066 -16564 -11785 30581 25640 5913 -28945 -41560 -26777 -26594 27522 60655
16834 60655 86381 85935 54972 11721 20668 61859 39484 30706 20976 3650 1701 20649 19574
16821 19574 -17884 -27242 -17076 -10017 -3870 -19009 -51845 -34655 -10425 -10606 -30132 -27186 -1370
16808 -1370 -14031 -777 7203 -18653 -14165 -7816 7190 25396 37291 7845 -12555 -24586
16796 -24586 -13558 11277 -21187 -14350 20467 13384 2200 -22429 -56283 -49648 -16224 13230
16784A3230J5421p927j6773l225R078j8470m7821k4673J6380L2290N0560J7894
16772C5964J9691o583j6063n1378m198r386J3025L1660J3909O650j1400j05j0541
16759A1245k5020m994j4507J0140L1797R198n726k9051k8341K6261M3809m70m2164
16746a7823j8620l065o422M115r087L4451Q797L1278j1637J520K0717K218J5333
16733E1775K302p884m3073j0765J1250k9785k3605j2688j0266K9775J8910j8202
16721d2256j2614K3576L2606J7863L2829l4149j7497k2899P622R083j2079k954
16709b0869j7414L0881N4078j668j3948L28J5682K748J1827n1783n0770j5468
16697e6376K4799j5441j4615K0350Q992l1677J108K8655n211J3572K0079J266
$$ plain form
16784 13230 28651 20724 3951 726 9804 -8666 -56487 -81160 -64780 -32490 18070 35964
16772 35964 55655 49072 33009 -18369 -22567 -31953 -18928 12732 26641 33291 21891 21786 11245
16759 11245 -13775 -18769 -33276 -23136 8661 17859 12133 -16918 -45259 -18998 24811 24341 -17823
16746 -17823 -36443 -39508 -45930 -41815 -50902 -16451 -7654 23624 11987 13507 34224 36442 51775
16733 51775 54077 46193 3120 -7645 3605 -26180 -49785 -62473 -72739 -42964 -24054 -42256
16721 -42256 -54870 -31294 1312 19175 52004 17855 358 -22541 -14919 -5836 -17915 -20869
16709 -20869 -38283 -7402 46676 45008 31060 31388 47070 49818 61645 9862 -40908 -56376
16697 -56376 -31577 -47018 -61633 -41283 -32291 -63968 -62860 -34205 -39416 -25844 -5765 -4499
16685d499J1202K8323k2792l5953k7556M981P497K4580J6255m648P262l9664L391
16672c1621J9965K9224l0900k4597J984n907K665R899J8365K4462P154j4883j0584
16659d774P172k4418P465Q704p261j5517m0064P86m521N199K2564K9463M09J5216
16645D23J7904n674j1601p891r20M3371P591l7315l488j1552j2489O919K5722
16632A1000Q330j6503J5337P762K4373J7841m7269l8538J2147K3313l6638k073
16620b0918R051j8161r33k476J3964k1043K6355m025o937J2400R661K9693K019
16607B8650j6973j524j3875J0533k0571J8478J9385N920N390o553m0921L42J4734
16594C015m515q412n709k5437K3279K4821K0603k380j5460M562q591l5596j0170
$$ plain form
16685 -4499 6703 35026 12234 -23719 -51275 -46294 -38797 -14217 2038 -2610 4652 -35012 -31621
16672 -31621 -11656 17568 -13332 -37929 -35945 -41852 -39187 -29288 -10923 13539 20693 5810 -4774
16659 -4774 2398 -22020 -14555 -5851 -13112 -28629 -68693 -67907 -72428 -67229 -44665 -15202 -14793 423
16645 423 18327 12653 1052 -6839 -7759 35612 43203 5888 2400 -9152 -21641 -14722 11000
16632 11000 19330 2827 18164 25926 50299 68140 20871 -17667 -5520 17793 -18845 -20918
16620 -20918 -11867 -30028 -30961 -33437 -19473 -40516 -14161 -18186 -25123 -12723 -3062 26631 28650
16607 28650 11677 10153 -3722 6811 -13760 4718 24103 30023 35413 28860 -12061 -11719 3015
16594 3015 -1500 -9912 -15621 -41058 -17779 7042 27645 25265 9805 14367 5776 -29820 -39990
16581c9990K769J3168j0107L1677q079m3113O659K9348J4069M269L5784Q428k9983
16568A4899k8164j7712J6906j2525J977K2955j8018j6209N601K7409K7323p886
16556A6556K521q652L861M6414o734Q391r607j1414J4426k1586m5902k3054N48
16543c4232k1312j2269M75K868K4994K3280J3485K7525O56r855j2798m0937j8848
16530e6968R042p056J1146L924L4058r2J3259M1170j9373k9201J4212m543j5515
16517e937j1945j0138j256j3118j794Q357J1832j9898j760j3827K0381L998j1081
16504d6186j2724j526m857K4923L9072K3855k5784J6014j3378R487j6046J5035
16492G885J5134j2725M679r288p18j5171r697K2456J6360k0126k2214j3225L1941
$$ plain form
16581 -39990 -37221 -24053 -34160 -2483 -10562 -53675 -47016 -17668 -3599 670 36454 44882 14899
16568 14899 -13265 -30977 -14071 -26596 -24619 -1664 -19682 -35891 -30290 -2881 24442 16556
16556 16556 19077 10425 14286 60700 53966 62357 52750 41336 55762 34176 -11726 -34780 -34232
16543 -34232 -55544 -67813 -67338 -64470 -39476 -16196 -2711 24814 25470 15615 2817 -38120 -56968
16530 -56968 -47926 -54982 -43836 -39912 -5854 -5946 7313 48483 29110 -91 14121 9578 -5937
16517 -5937 -17882 -28020 -29276 -42394 -44188 -35831 -23999 -43897 -45657 -59484 -39103 -35105 -46186
16504 -46186 -58910 -60436 -65293 -40370 -1298 22557 -3227 12787 -591 8896 -7150 7885
16492 7885 23019 10294 14973 5685 4967 -10204 -19901 2555 18915 -1211 -23425 -36650 -4709
16479d709O667J2889m606j1789j368O440k1178j9507j0919j5180J5118l485J4515
16466c7112K2234o420o471n213M4823L5711j2723k6499J5868P694K4994k7141
16454B9745M509O316J0668J217k4528l1232j4070l2957J1600K0816j3846j771
16442c3533K3517J5969R300Q248k124n639L931j804r564n5679k2140L9811L6181
16429F474L736K379K6587l3362l5266J4442N0368K7048l437j5143m5610k9521
16417c1305K0421L9058o286q018K1986k4764j5117k5082J4422L1171K7862k3401
16405B0947k6524m1503l937n263J8935p524l4379N973K0875J2251k6192M227L2872
16392b9242k2128j0087L0747k167L5932L1699l916j1594P81j8926q688k4482l704
$$ plain form
16479 -4709 1958 14847 10241 -1548 -2916 3524 -17654 -37161 -48080 -63260 -48142 -51627 -37112
16466 -37112 -14878 -21298 -27769 -32982 11841 47552 34829 8330 24198 31892 56886 29745
16454 29745 34254 40570 51238 52455 27927 -3305 -17375 -50332 -38732 -17916 -31762 -33533
16442 -33533 -10016 5953 15253 23501 21377 15738 19669 17865 8301 -47378 -69518 -29707 6474
16429 6474 10210 12589 39176 5814 -29452 -15010 35358 62406 58969 43826 -1784 -31305
16417 -31305 -10884 28174 21888 13870 35856 11092 -4025 -29107 -14685 16486 44348 20947
16405 20947 -5577 -47080 -51017 -56280 -37345 -44869 -79248 -73275 -52400 -40149 -66341 -62114 -29242
16392 -29242 -51370 -61457 -30710 -32877 3055 34754 30838 19244 20025 1099 -7589 -32071 -35775
16379c5775K0977l904L5209J4150k0620k0386k3251l617J2216n192M763K0640
16367d790K9387Q943k6035k5400j967O73l387j2891J87j8423k5930M665L7345
16354c7623K4688L2949O321l0153o643n0954l4058L9348L2308K2575Q509j0508
16342c241m354K2742J2058l4163o890j6011j6975J2690K259K1872j1577l224K9199
16329D385J9385K6224K7050K2590P734l2018m8675j759P09N492m8796n0886O751
16316f1814m253L9654L3116r321r294o204O06K4447J5596l1300j7718L7435R910
16303B0860j8755l8728j6548Q570j1597J5336J4822L8617K0365k4344M600O115
16291A9313Q321J516l217P323q841l7837O831J316j0382K0597J3950J1782j8169
$$ plain form
16379 -35775 -14798 -18702 16507 30657 10037 -10349 -33600 -37217 -25001 -30193 -25430 -4790
16367 -4790 24597 33540 7505 -17895 -19862 -19189 -22576 -35467 -35280 -53703 -79633 -74968 -37623
16354 -37623 -12935 20014 26335 -3818 -10461 -61415 -95473 -56125 -23817 -1242 7267 -3241
16342 -3241 -7595 15147 27205 -6958 -13848 -29859 -46834 -34144 -31885 -10013 -21590 -24814 4385
16329 4385 23770 49994 77044 99634 107368 75350 26675 24916 25625 31117 -17679 -68565 -61814
16316 -61814 -66067 -26413 6703 -2618 -11912 -18116 -17510 6937 22533 -8767 -26485 10950 20860
16303 20860 2105 -36623 -53171 -44601 -56198 -40862 -26040 12577 32942 8598 13198 19313
16291 19313 27634 29150 25933 33256 24415 -13422 -6591 -5275 -15657 4940 18890 30672 12503
16278A2503j4860J5996j114q748k0412J4386M564J6929J4805K1082J7210q912
16266F3429n522l3527q7r915l2637k9189j4169O414K1874p406Q155K8352P582
16253C354o489R818k9320k5449K9212k4348j7412K7532K3109J8947l5803k4416
16241e1265L0213J8441o085k1810j0758K0639L5485r60j9931J3781L8651l1722
16229A4679l2036J3737N110r386R91Q639P997k9915j0806j4442j4147Q523L1863
16216a9193J6036r297l349j670l2288k0700K0702M0528j7740k1962K4531k4263
16204d8665j0150J3642K6208K7666k2735j0728k3212j0180K3928K2085j3380Q72
16192b4649j1179j81J0833J5199j1146l854l639J7137J8850l7685j0292j3696
$$ plain form
16278 12503 -2357 13639 12525 3777 -16635 -2249 2315 19244 34049 55131 72341 63429
16266 63429 57907 24380 24293 14378 -18259 -47448 -61617 -55203 -33329 -40735 -32580 -4228 3354
16253 3354 -3135 6683 -22637 -48086 -18874 -43222 -60634 -33102 -9993 8954 -26849 -51265
16241 -51265 -21052 -2611 -8696 -30506 -41264 -20625 14860 13900 -6031 7750 46401 14679
16229 14679 -17357 -3620 1490 -7896 -6905 1734 9731 -20184 -30990 -45432 -59579 -51056 -19193
16216 -19193 -3157 -12454 -15803 -17473 -49761 -70461 -49759 -9231 -26971 -48933 -24402 -48665
16204 -48665 -58815 -45173 -18965 8701 -14034 -24762 -47974 -58154 -34226 -12141 -25521 -24649
16192 -24649 -35828 -36009 -25176 -9977 -21123 -24977 -28616 -11479 7371 -30314 -40606 -54302
16180e4302J1215q189k0840M0586L6026j4907j9277L4837j0924j4772J2448r31
16168i030k3804r714K172l805K0395o227J3667R704J7579j56j2150M0411j1600
16155B7442j5479k2720Q568J7314O605P681J1569r532k4264j8711R586l9630n8
16142d1629m554J0039P828r562j4917k2099j2701J3273N486L1805M1027L15l5321
16129c1010k3280L658J6491p149k100L5192K0193k7027j5376j0604j1722L7973
16117a4761O679r711L1910L486J0791j8976q926J5262o956j314l764j9211N904
16104i587L0448K2561M254l0898k0993j3620L3766J7823J2975j4878L777K6715
16092F2343l4206n0656o222l2177j7406n625N5604M5839r791j2778J2816J0596
$$ plain form
16180 -54302 -43087 -51276 -72116 -31530 4496 -10411 -29688 5149 -5775 -20547 -8099 -9030
16168 -9030 -32834 -42548 -40376 -44181 -23786 -30013 -16346 -6642 10937 10781 -1369 39042 27442
16155 27442 11963 -10757 -2189 15125 21730 29411 40980 31448 7184 -11527 -1941 -41571 -41629
16142 -41629 -46183 -36144 -28316 -37878 -52795 -74894 -87595 -74322 -68836 -37031 3996 4311 -31010
16129 -31010 -54290 -50632 -34141 -41290 -43390 -8198 11995 -15032 -30408 -41012 -52734 -14761
16117 -14761 -8082 -17793 14117 17603 28394 9418 492 15754 8798 7484 3720 -15491 -9587
16104 -9587 20861 43422 47676 16778 -4215 -17835 15931 33754 46729 31851 35628 62343
16092 62343 28137 -22519 -28741 -60918 -78324 -83949 -28345 17494 7703 -5075 7741 18337
16080A8337k0524k0071k0204K9703l812K5653L1102j5826j8615j9934m143n1328
16068f9662n519L6254M4143Q310k3005k7450J3895J1709Q773N908J1113l913k1597
16055a1041J2782p38J461l6414J1714O071L520j7564k101q63L7336K8849J6592
16042D9604n0251l5375K9320M3418J3455k3196j3415K6677j4025j4261j4728l3649
16030c6426K5021O2644J5531O740k2279J4858j2218j2652J1332L957K1059J056
16018G8623j1572l1799k3070k1928l3988M075J1372J8391J2510J3141j1959p418
16006c622K4639O27k0030m5192L112K6667K7195K4927J8838k3951k9830k5739
15994b2359o113K5626R323k8618j1921J545L7344j6860m9956P075o208N357K4535
$$ plain form
16080 18337 -2187 -22258 -42462 -12759 -16571 9082 40184 24358 5743 -14191 -18334 -69662
16068 -69662 -75181 -38927 5216 13526 -9479 -36929 -23034 -11325 -2552 3356 14469 10556 -11041
16055 -11041 1741 1003 2464 -33950 -22236 -16165 -12645 -30209 -32310 -33173 4163 33012 49604
16042 49604 -647 -36022 -6702 36716 50171 26975 13560 40237 26212 11951 -2777 -36426
16030 -36426 -11405 51239 66770 73510 51231 66089 53871 41219 52551 56508 77567 78623
16018 78623 67051 35252 12182 -9746 -43734 -39659 -28287 -9896 2614 15755 3796 -3622
16006 -3622 21017 21644 1614 -43578 -40466 -13799 13396 38323 57161 33210 3380 -22359
15994 -22359 -28472 -2846 6477 -22141 -34062 -32517 4827 -12033 -61989 -54914 -61122 -55765 -31230
15981c1230J1471o525O982J1118n280j2864l5784J9826K1593R168J2682L4414
15969C5571j9876m9694k8066L547L2552j6889k4097L9733J4369J2469L228J0522
15957A3369k8793K9319K9988j5907j1995j2595J3494J064r080l336O653l1380
15945a9199K0231K9929K897p005o910K4929k923M707k7805m470r382k780j6656
15932a4437k0347O735L6589j3504O710K2008L1489j4784k5708k4510J4998j4122
15920h883M0328j0880P815l762L600M239l511k1687j4569o0302j913M1092K9326
15907H93j0522p077j9671k097N2072L2082p407O835k1574n174k7133L3905J1848
15894C6980k990Q256m748j7480K474O473j8434J7244j2891l702J1599J4027r178
$$ plain form
15981 -31230 -19759 -26284 -19302 -8184 -13464 -26328 -62112 -42286 -20693 -11525 1157 35571
15969 35571 15695 -33999 -62065 -58518 -25966 -42855 -66952 -27219 -12850 -381 2847 13369
15957 13369 -15424 13895 43883 27976 15981 3386 16880 17944 8864 5528 12181 -19199
15945 -19199 1032 30961 33858 26853 19943 44872 41949 46656 18851 14381 4999 2219 -14437
15932 -14437 -34784 -28049 8540 -4964 1746 23754 55243 40459 14751 -9759 5239 -8883
15920 -8883 31445 20565 28380 24618 28218 32457 28946 7259 -7310 -67612 -69525 -28433 893
15907 893 -9629 -16706 -36377 -38474 13598 45680 38273 45108 23534 18360 -8773 25132 36980
15894 36980 33990 42246 37498 20018 22492 28965 10531 27775 14884 11182 22781 36808 27630
15881B7630j3341J240J2518m0446j811n469p137K2738K5986J0791K1273K3696
15869G7668j0928k9191o130j0506N181m142L8002J080R46j7036k8641J0880K8857
15856E6040q738j5254l4554m4828L343M0017K5770J927r082k2379K2791K3533
15844C8586L711j5181q526j0471J2416j6694j9462L2783J2372K349J1794k9359
15832A4318n808L7292P225J105k1859l2897m9355k0837M228O866K8308M0438K7634
15819C6658j661q630j2597l4326J520n757J148N5942J7340k0378l3179j0986Q877
15806f029J4354j2058K6544R784j4536j4434J951J438j3918n983k8673j5549K6448
15793c0661J9566Q357j1897M7035M2154j6357l2568j5192o860j105o426k923O90
$$ plain form
15881 27630 14289 15529 28047 -12399 -14210 -19679 -26816 -4078 21908 32699 53972 77668
15869 77668 66740 37549 31419 20913 26094 21952 59954 61034 61980 44944 16303 27183 56040
15856 56040 47302 32048 -2506 -47334 -43991 -3974 21796 23723 14641 -7738 15053 38586
15844 38586 42297 27116 18590 8119 20535 3841 -15621 17162 29534 31883 43677 14318
15832 14318 8510 45802 53027 54132 32273 -624 -49979 -70816 -66588 -59722 -31414 9024 36658
15819 36658 34997 26367 13770 -20556 -19036 -24793 -23645 32297 49637 29259 -3920 -14906 -6029
15806 -6029 8325 -3733 22811 32595 18059 3625 5576 7014 -6904 -12887 -41560 -57109 -30661
15793 -30661 -11095 -2738 -14635 32400 74554 58197 25629 10437 3577 2472 -3954 -6877 -6187
15780f187J4176K4359j2836l7059P717P035R939k5241J2351k1476J6372K8402
15768A7552k3979l1706K0031J7639J4446K7646j6032k6827Q671l293j0074l8785
15756d4711p99L6858J8782P934m6509l8087J3147m540j335L5871K4981O263k4101
15743a6246m8637J9937k848J5029M1975K799K0804l440j9635q86J4389J832j4210
15730A0863r597j8863j4812o289l744K2264J2852K9206N8142p810K3150q138n2902
15717C4322j5783L3381N1267k2873l7340j3536J4634P281k0978k7041l1124j2097
15705c9887k580J3044L1829J5235k0787O612j374J0264o916l982Q780l628n696
15692I14J9043P208J2150j5871j6155K3532j6542l0278J6369L981J9771k985q044
$$ plain form
15780 -6187 7989 32348 19512 -17547 -9830 -2795 7144 -18097 -5746 -27222 -10850 17552
15768 17552 -6427 -38133 -18102 -463 13983 41629 25597 -1230 7441 4148 -5926 -44711
15756 -44711 -45510 -8652 10130 18064 -28445 -66532 -53385 -57925 -59260 -23389 1592 7855 -16246
15743 -16246 -64883 -44946 -47794 -32765 9210 12009 32813 29373 9738 8852 23241 25073 10863
15730 10863 1266 -17597 -32409 -38698 -42442 -20178 -7326 21880 80022 72212 95362 87224 34322
15717 34322 18539 51920 103187 80314 42974 29438 44072 51353 30375 3334 -27790 -39887
15705 -39887 -42467 -29423 2406 17641 -3146 3466 2092 12356 5440 1458 10238 6610 914
15692 914 19957 27165 39315 23444 7289 30821 14279 -15999 370 4351 24122 21137 13093
15679A3093j0971m5932J2378J6484j217J9609R766N121l174k0089M5386R139m449
15666D5144l1160n373M3436P41m3474j4679l410R514P618k924J3202J1334r304
15653B0665J130j2687r504K4567J4038k2566l2841J9686L290R5J8029k0888J6631
15640A9645p784j083K7324J108k8555q032K5456M185k0693L364N977j5521l8456
15627c3065k8781k793Q896Q072L6358M57k6279k4784K847j3948J6513m060L0529
15614c0038N750l1083Q858n724K0067k2819M758K1787J5802K316j297j5853j5646
15601d3122K0778J0081K6788J8889l7579l8337J2975k4660J3838q260K042K2438
15589b4129l725q76K695L5448M002Q83o372k5597K462J2245k906j8151j3056K4231
$$ plain form
15679 13093 2122 -43810 -31432 -14948 -16165 3444 13210 18331 15157 -4932 40454 49593 45144
15666 45144 13984 8611 52047 52788 9314 -5365 -8775 739 8357 5433 18635 29969 20665
15653 20665 21795 9108 -396 24171 38209 15643 -17198 2488 5778 5873 23902 3014 19645
15640 19645 11861 10778 38102 39210 10655 2623 28079 32264 11571 14935 20912 5391 -33065
15627 -33065 -61846 -64639 -55743 -47671 -11313 -10856 -37135 -61919 -59072 -73020 -56507 -60567 -30038
15614 -30038 -24288 -55371 -46513 -52237 -32170 -54989 -50231 -28444 -12642 -10326 -11623 -27476 -43122
15601 -43122 -22344 -12263 14525 33414 -4165 -42502 -29527 -54187 -40349 -48609 -46567 -24129
15589 -24129 -27854 -28730 -26035 9413 13415 14298 7926 -17671 -15209 -2964 -5870 -24021 -37077 -12846
15575a2846M2861J7686j3844l0380k1952R195N2997L1110l5291j5054l2449O118
15563a849n276L702R246J1054P170j3532k0333j9975K0638L7913J0800l3807j4460
15550h709K156M490P811r380R887R160k518j7538m273P475O296r433r027J9690
15536F087J7042o137K211q287L469n226r136p930l651K9712q945l2605L3638P462
15522A7704l2618j6511p914K1443M4912J3242l058k94l0402N913J8793K5943k0995
15509C6158l6239J6342j0651j5126J3268J5737J0411L677j0444L938o066l4031
15497a3026j7535L2143J5378J9699J744j8791k2415j8112j5240K0249K163k6928
15485d0671R98K7118M121J5729o917J8029K1132q409j4464k1099j0936l1772l7502
$$ plain form
15575 -12846 30015 47701 33857 3477 -18475 -9280 43717 74827 39536 24482 -7967 -1849
15563 -1849 -7125 -3423 5823 16877 24047 10515 -9818 -29793 -9155 28758 39558 5751 -8709
15550 -8709 -6553 -2063 5748 -3632 6255 15415 12897 -4641 -8914 -1439 4857 -4576 -13603 6087
15536 6087 23129 16992 19203 10916 14385 9159 23 -7907 -11558 18154 9209 -23396 10242 17704
15522 17704 -14914 -31425 -39339 -17896 27016 40258 37200 36906 6504 12417 31210 57153 36158
15509 36158 -81 16261 5610 -9516 3752 19489 29900 33577 23133 27071 21005 -13026
15497 -13026 -30561 1582 16960 36659 38403 19612 -2803 -20915 -36155 -15906 -13743 -40671
15485 -40671 -39673 -12555 -8434 7295 378 18407 39539 31130 16666 -4433 -15369 -47141 -84643
15472h4643K8264R488k7367N4843L0318J5925J233J7453j578N182l5757k8436
15460a5075J1885K0021k5927j6085P631O3054K7173j6703q668j3784k0417k3033
15448i928m0096j3575K5313K5741J9477N801J3981k3614J0747j1411k4882k4524
15436d6970L990J072m510K3006K0358J1966J2611L2923m93k2721j0352j6230R822
15423A4472N6025K436j6107m893O804J6732q136J5428m365l1860N599K1029k9253
15410D3911l9395j0542K8703M2j3410n794k5070J7386J0174K946J3604J3715o544
15397B9726m3497k9680J3752L5012k3641O429J5025n87q532j2757J9995J8840
15385B0085j6051J4198J2727L870r0J7789j3993j2157l8395j4593J4003K6285
$$ plain form
15472 -84643 -56379 -46891 -74258 -19415 10903 26828 28061 45514 43936 49118 13361 -15075
15460 -15075 -3190 16831 -9096 -25181 -17550 45504 72677 55974 47306 33522 13105 -9928
15448 -9928 -50024 -63599 -38286 -12545 6932 12733 26714 3100 13847 2436 -22446 -46970
15436 -46970 -42980 -41908 -46418 -23412 -3054 8912 21523 54446 53953 31232 20880 4650 14472
15423 14472 70497 72933 56826 51933 58737 75469 67333 82761 78396 46536 52135 73164 43911
15410 43911 4516 -6026 22677 22719 9309 3515 -21555 -4169 6005 8951 22555 36270 29726
15397 29726 -13771 -43451 -29699 5313 -18328 -11899 3126 2539 -5993 -18750 1245 20085
15385 20085 4034 18232 30959 34829 34739 52528 38535 26378 -12017 -26610 -12607 13678
15373A3678O675m2758j4394N09K3133J738k1723n06J6353J9034k8915M4738L3302
15360E0864j4549J7496j5553k4868K189l766l4381j5851l713K2617R685L1147
15348B1317j648P317K1013J625n198J7809N535k4816j2842L427P115o101l1423
15335C130m3761j2945J9990K1112K8337j5692n0238j445o206L5224K5264k7704
15323b4934j913K4930L4500j7408o2737N009M2503M9444M5911k1251k8746j537
15311D3771O255r143j2060o520k2685p033K7246J8027K254L677K2740j856M095
15298F8768j0561L457j4997p377j1721j2599J3145p030n465j4074J1189n606k8566
15285b1437m28L544k1446p374M4144k370k241K263L196K639j2867j7185J6296
$$ plain form
15373 13678 20353 -22405 -36799 -36290 -13157 -11419 -33142 -33648 -17295 1739 -27176 17562 50864
15360 50864 36315 53811 38258 13390 15579 11813 -22568 -38419 -42132 -19515 -9830 21317
15348 21317 19669 26986 47999 49624 44426 62235 67770 42954 30112 33539 40654 34553 3130
15335 3130 -40631 -53576 -33586 -12474 15863 171 -50067 -51512 -57718 -22494 2770 -24934
15323 -24934 -26847 -1917 32583 15175 -47562 -42553 -50 49394 95305 74054 45308 43771
15311 43771 50026 40883 28823 22303 -382 -7415 19831 37858 40112 43789 66529 64673 68768
15298 68768 58207 61664 46667 39290 27569 14970 28115 21085 15620 1546 12735 7129 -21437
15285 -21437 -21865 -18321 -39767 -47141 -2997 -5367 -7608 -5345 -2149 490 -12377 -29562 -13266
15272a3266J3157l4210K7826L7983j2427Q604J7240j90k0912j6451J8480J7764
15260D3598r014o859J2855o195k4070r547J5645J6792n202k2051j132K846j6524
15247h858k5033l075K8875q302r599J6646J5470q043j7186j1907J7032J7048J9484
15234B2552K4459l3077r360q367j9291m307j4883j5817J8546j9271q600J2166
15222e5250K8583n749J5384J4271j6449K9327J8698j4430m6477k2481K2256J7406
15210a4911J1266J90k8125l7014J2490m568m628p344p737K0789j0434k4286L0
15197i4282K2996L1453N2689l674l489M060r885J3473N148j6751l2241l603K3555
15184a0551J6413j117j0918R940n86L6411P296q036j7381j0126k791m903j1828
$$ plain form
15272 -13266 -109 -34319 -6493 31490 19063 27667 44907 44717 23805 7354 25834 43598
15260 43598 34584 27725 40580 34385 10315 768 16413 33205 28003 5952 4820 7666 -8858
15247 -8858 -33891 -36966 -8091 -16393 -25992 -9346 6124 -1919 -19105 -31012 -13980 3068 22552
15234 22552 47011 13934 4574 -3793 -23084 -27391 -42274 -58091 -39545 -58816 -67416 -55250
15222 -55250 -26667 -32416 -17032 -2761 -19210 10117 28815 14385 -32092 -54573 -32317 -14911
15210 -14911 -3645 -3455 -31580 -68594 -56104 -60672 -65300 -72644 -80381 -59592 -70026 -94312 -94282
15197 -94282 -71286 -39833 12856 9182 5693 9753 -132 13341 18489 1738 -30503 -34106 -10551
15184 -10551 5862 4745 -6173 3767 3181 39592 46888 38852 21471 11345 8554 3651 -8177
15171h177n352L0550O3192L178l3531o9494j4145J5736J3908P428J5837R594O550
15158C5274L782l6251j3924j3917q346L477J3151J2151j6309K1092n33l553Q472
15145D566J4650R625J0820K6581k0269k7403N678O727J245n360k6232n0257n94
15132e0223O431O6019K9525j5686j3672J4750j3467J679J3325R53j0109n9756
15120c0231j3964M5721M9659j2499j1176L0003L350j9314J0163P621l9405o1933
15108d2005N495J3102K1702j7783l2109p253j6701K6870L8972J786k2183k5477
15096e5584l73N462p643J9373Q779P63L3867J4598L785n592j1077j0048l5730
15083c9420l1307K1801J4178k0077l243k1016J999L4255K8956L5J9139K3628Q303
$$ plain form
15171 -8177 -13529 17021 80213 83391 49860 -19634 -33779 -18043 -4135 3293 19130 28724 35274
15158 35274 39056 2805 -11119 -25036 -33382 -29905 -16754 -4603 -20912 180 -353 -3906 4566
15145 4566 19216 28841 39661 66242 45973 18570 24248 30975 32220 26860 628 -49629 -50223
15132 -50223 -43792 22227 51752 36066 22394 37144 23677 25356 38681 39634 29525 -30231
15120 -30231 -44195 1526 51185 38686 27510 57513 60863 41549 51712 59333 19928 -42005
15108 -42005 -36510 -23408 -1706 -19489 -51598 -58851 -75552 -48682 -9710 -7924 -30107 -55584
15096 -55584 -55957 -50495 -58138 -38765 -29986 -29223 4644 19242 23027 17435 6358 -3690 -39420
15083 -39420 -70727 -48926 -34748 -54825 -58068 -79084 -77085 -42830 -13874 -13839 5300 28928 37231
15070C7231J0453j687k685k5093k3949j2534J2685J5185j0117k101M845Q843O863
15057A7939M17k6047j3175J3858P954L3106J3284M299O41j4965k5869k803l216
15044E423J6309O490o454L6011J1221j5409K0652n793j3930j614k7318k4155k7428
15031b5995j4383J558J2559K4943n675j0659k6696k2008M9811L0169l2007l5282
15019e3665K4135M1626N629k6727j499K0676j1149L484j3904L0517J9445k580
15007C5988M759M636j1723O165k297j1554k2438j1550J3390J4532J87o685j4318
14994i08L8412J3290J2537p451m1591k6554J2596o452j6392P100J4835J8459l648
14981A4233j0471k1090m27M2184P196j468l0693j9594q865K0589P761j8012R480
$$ plain form
15070 37231 47684 45997 43312 18219 -5730 -18264 -5579 9606 -511 -2612 2233 11076 17939
15057 17939 18356 -7691 -20866 -7008 946 34052 47336 51635 52276 37311 11442 8639 5423
15044 5423 21732 28222 21768 57779 69000 53591 74243 68450 54520 52906 25588 1433 -25995
15031 -25995 -40378 -38820 -26261 -1318 -6993 -17652 -44348 -66356 -16545 13624 -18383 -53665
15019 -53665 -29530 12096 17725 -9002 -10501 10175 -974 2510 -11394 19123 38568 35988
15007 35988 40747 45383 33660 39825 37528 25974 3536 -8014 5376 19908 20095 13410 -908
14994 -908 37504 50794 63331 55880 14289 -12265 331 -6121 -22513 -15413 -578 17881 14233
14981 14233 3762 -17328 -17755 24429 31625 30157 -536 -20130 -28995 -8406 -645 -18657 -9177
14968i177l907K4566j7911j3414O361J6371q254l8955J2653L6271J5597R595j095
14955B8701M380k5285o43J1773Q658O296r633l8025N426O29N814J8978K3255m1042
14941g18k5629j1474J5563K19k9496K442L8999J1392K47j4070j1064r785K0363
14928a3011J5941Q509K8814M177j7405k333O425N047j3800P31J702k1154r812
14915f169m591K5366j8259l9966O837J7602K0450k287r834q597P41O833J2297
14902D23J3511R551l932Q293n799j9858O201j2409l5457j1175J5460K6556J2149
14889C514j8496J574k7274J1837R872n594K5079K3603n277p48o256K3765J3322
14876D8921q002L312J0029k5476k8534j7744j1106j039k603l664L311K5661J4529
$$ plain form
14968 -9177 -13084 11482 -6429 -19843 -13482 2889 -5365 -44320 -31667 4604 20201 29796 28701
14955 28701 33081 7796 7153 18926 27584 33880 24247 -13778 -8352 -7723 -1909 17069 40324 -718
14941 -718 -26347 -37821 -22258 -22039 -51535 -49093 -10094 1298 1545 -12525 -23589 -33374 -13011
14928 -13011 2930 11439 40253 44430 27025 24692 31117 36164 22364 23095 24797 3643 -6169
14915 -6169 -10760 14606 -3653 -43619 -36782 -19180 1270 -1017 -10851 -19448 -18707 -11874 423
14902 423 13934 23485 19553 27846 22047 2189 8390 -4019 -39476 -50651 -35191 -8635 3514
14889 3514 -14982 -13408 -40682 -28845 -18973 -24567 512 24115 18838 18090 11834 35599 48921
14876 48921 40919 44231 54260 28784 250 -17494 -28600 -29639 -32242 -35906 -32595 -6934 7595
14863G595J1315K0368j431K7020J7863j1861j2236J617K7327j3820l8791j0531
14851B4435M6051J232j2137l4299k6705N619L8967N349l2613k6428K265K7744
14839A9480J4323q366J2375R003J579n124j8833k602j4652R30j0255L266M959
14826F083K609J5659k348p251l1561l968K5861j75k9151J5868N374Q096K5011
14813C0107l2183j0906n157j3946j5908j23j2204r017K1854L1511L0281J7944
14801C2253L77Po303J0854l0113k2062J0971k36q937R603k115j4645m956M4062
14787A8760K9940k6392R823J3320j1257k8379o708K116l2665j5355K1617K3010
14775b170L8967K2424K2843J2187r579m4355l4827j8050q619J4379l8060k8980
$$ plain form
14863 7595 18910 39278 37847 64867 82730 70869 58633 60250 87577 73757 34966 24435
14851 24435 70486 71718 59581 25282 -1423 4196 43163 48512 15899 -10529 -8264 19480
14839 19480 33803 25437 37812 46815 48394 43270 24437 21835 7183 8113 -2142 1124 6083
14826 6083 8692 24351 22003 14752 -16809 -20777 5084 4909 -24242 -8374 -3000 5096 30107
14813 30107 -2076 -12982 -18139 -32085 -47993 -48116 -60320 -69337 -47483 -15972 14309 32253
14801 32253 32630 32637 26334 37188 7075 -14987 -4016 -4252 -13189 -3586 -5701 -20346 -25302 18760
14787 18760 48700 22308 32131 45451 34194 5815 -893 1223 -31442 -46797 -25180 -2170
14775 -2170 36797 59221 82064 94251 84672 40317 5490 -12560 -21179 -6800 -44860 -73840
14763g3840J2750K4964l248J2004J8031R790j7045j4592O007l0845J2921P183
14751c5920j7980K0129K8926Q624j5124j390K3333o389l1631J4494j2982K6136
14739B26J4665j027k1399R85N029K139j2247K3669j1709j6777p1o545M0788O684
14725B4410j4351N461J8855l2146m3914l617O628N913K1029j4846n680J3131K2317
14712C190N536K7989J7168P289j5507K288o0727l3775k6380Q855R652R514J8839
14699b6069j1631L226K5982K0262M4271j645l0191K6998K9117j5428l7304K358
14687B9946M3786K653K481l1856N610k6565n5474j5646J4315J6741J3930L7115
14675C7036R604j7265J2568K3607j5231Q54R458l1401K2511M455k9563k6036n624
$$ plain form
14763 -73840 -61090 -36126 -39374 -27370 -9339 451 -16594 -31186 -25179 -56024 -43103 -35920
14751 -35920 -53900 -33771 -4845 3779 -11345 -12735 10598 4209 -27422 -12928 -25910 226
14739 226 14891 13864 -7535 -6550 -1521 618 -11629 12040 331 -16446 -16517 -23062 17726 24410
14725 24410 10059 15520 34375 2229 -41685 -45302 -38674 -32761 -11732 -26578 -32258 -19127 3190
14712 3190 8726 36715 53883 61172 45665 47953 -12774 -46549 -72929 -64074 -54422 -44908 -26069
14699 -26069 -37700 -34474 -8492 11770 56041 54396 24205 51203 80320 64892 27588 29946
14687 29946 73732 76385 78866 47010 52620 26055 -29419 -45065 -30750 -14009 -79 37036
14675 37036 46640 29375 41943 65550 50319 51173 60631 29230 51741 56196 26633 597 -5027
14662e027Q491J3445j1159k7085J8961O147k7234K1J9321K0264N290K184l1279
14649g660k7354M4593J7554p155j3587J2612K1367k5184q529K1547j1831j3967
14637B406m911j3179k9042J8212M2846J9804j0731k1514N071N3913O559L0362
14625I9796j1178k4601l904l0777j14K1309j3891K5236J4189n2280p318o924L9441
14612D8984j9208j8532j4805j1991O540j0552N903L4650J9318k5551k2544n168
14600a2956J905J1172L723p825M8177L3691k4098k3203m077J2285K2923o190n9474
14587c947l7136P051J6928J1803K1097L0945J9147K1423q267l4496k9356Q392
14575B3584N473p601j0635L0674N449J0622m5118m0196M0813L0302k9738j8984
$$ plain form
14662 -5027 3464 16909 5750 -21335 -2374 3773 -23461 -23440 -4119 16145 21435 23619 -7660
14649 -7660 -35014 9579 27133 19978 6391 19003 40370 15186 6657 28204 16373 2406
14637 2406 -2505 -15684 -44726 -26514 16332 36136 25405 3891 8962 62875 69434 99796
14625 99796 88618 64017 60113 29336 29222 50531 36640 61876 76065 23785 16467 9543 48984
14612 48984 29776 11244 -3561 -15552 -9012 -19564 -13661 20989 40307 14756 -7788 -12956
14600 -12956 -11051 121 3844 -3981 44196 77887 53789 30586 26509 38794 61717 55527 -3947
14587 -3947 -41083 -34032 -17104 -5301 15796 46741 65888 87311 79044 44548 15192 23584
14575 23584 29057 21456 10821 41495 46944 57566 12448 -27748 13065 43367 13629 -5355
14563e355o413m769M82M376l5359K0985O5441J0537j8719J0859k1894J38N837
14550B6146j6187j3863k4304K8094J6436J8942K1742r741j0427q297J0751o014
14538C3278j8135j257K1448L3949R800j0923j7634J4933r617k2988j0862k739
14526A9253L9913J1529m3682N002l1369j2470M4986K257N899Q354l5639J9035
14514C3068M591M752J1112q4j2068l5400j9601M253r015J694M4598n143l1869
14501i112o268K3052l9025j2812J1242l917K5323M0509j1833m5190l313R986J9380
14488a978l3250J2687L250K6468L1396o0J5862K3952j6960j3124N288P30M6215
14475A00476j6726n308l0012k017o213l465j9022l814K783K774J0098k200k9423
$$ plain form
14563 -5355 -11768 -16537 -16055 -11679 -47038 -26053 39388 49925 31206 42065 20171 20309 26146
14550 26146 9959 -3904 -28208 -114 16322 35264 57006 47265 36838 28541 39292 33278
14538 33278 15143 13886 35334 69283 79083 68160 50526 65459 55842 32854 21992 19253
14526 19253 59166 70695 27013 32015 646 -11824 33162 35419 41318 49672 14033 33068
14514 33068 37659 42411 53523 53439 41371 5971 -13630 -9377 -18392 -16698 27900 22757 -9112
14501 -9112 -15380 7672 -31353 -44165 -32923 -36840 -11517 28992 17159 -28031 -31344 -21358 -1978
14488 -1978 -35228 -22541 -19291 7177 38573 38513 54375 78327 61367 48243 53531 54261 100476
14475 100476 83750 78442 48430 46413 40200 36735 17713 13899 16682 19456 29554 27354 -2069
14462b069k9018J3053n61r821N6282L4444j3679j6714O224r567n945k8283P194
14449A540j4426K473K9280K8013R545M889j3487K682k2095k542J4447k1516l1354
14436a2551p418K901r50M3972J7994J6225J474k2162j434J3681j2444j8177j9701
14423A410M639R713k4077K9881K6373J5980J0700K5204l204m2823j815k8205m8491
14410b4715O607j0761K0365Q740M559L2999K380j0012Q822M642k4233j5120j4442
14397a0169K6618L1973l9042j6080n966q70R345L1862K1514m1178k6273L565M7966
14384C3265K2876n489r434j3575P849j477L8315j1587j118m0060Q56K3605J4532
14371E8558j5010L7355j4193l6322k6617L607L5416j0628r050p473L462M829j0097
$$ plain form
14462 -2069 -31087 -18034 -18595 -28416 27866 62310 48631 31917 38141 28574 22629 -5654 1540
14449 1540 -12886 -10413 18867 46880 56425 61314 47827 50509 28414 25872 40319 18803 -12551
14436 -12551 -19969 -17068 -18018 25954 43948 60173 61647 39485 38051 51732 39288 21111 1410
14423 1410 6049 15762 -8315 21566 47939 63919 74619 99823 96619 53796 51981 23776 -24715
14410 -24715 -18108 -28869 -8504 236 4795 37794 40174 30162 38984 43626 19393 4273 -10169
14397 -10169 16449 48422 9380 -6700 -12666 -13536 -4191 27671 49185 8007 -18266 -14701 33265
14384 33265 56141 50652 41218 27643 35492 34015 72330 60743 59625 19565 20421 44026 58558
14371 58558 43548 80903 66710 30388 3771 7378 42794 32166 23116 15643 19105 23934 13837
14358A3837p2424j0164K4509L2540M3821j2023j6105j4584K4872J369j6135K4772
14346B4285J3735J3824Q792j4528Q118K135k9711m019J9315j0866L19L8713L6523
14333A06635l2699j8263k1860k1267n23J4728j7324J3237j2976J85M7931K2210
14321H0014k340k7414j110J226j0306r397J5524J3014J4077l187l7362N73J5032
14308D8344L705q491j6479j2726N7989N2278j2116N927Q31K7706M9873J2465n546
14295B03760R612K6372J114R9295K13845K65700K84902L34906L01629J99016P3243
14284B013394r6274k51454l29650l28242l03351j97679j48126j13849p2683l0390
14274A41696O425k3158O533M8656P337l417J6037K199l6392m2954k1263J7756
$$ plain form
14358 13837 -58587 -68751 -44242 -11702 32119 20096 3991 -10593 14279 15648 -487 24285
14346 24285 38020 51844 60636 46108 54226 56361 26650 22631 41946 31080 31399 70112 106635
14333 106635 73936 55673 33813 12546 12023 26751 9427 22664 9688 9873 57804 80014
14321 80014 77674 50260 49150 50376 40070 30673 46197 59211 73288 70101 32739 33312 48344
14308 48344 52049 43558 27079 14353 72342 124620 112504 118431 119262 146968 196841 209306 203760
14295 203760 213372 239744 240858 340153 553998 819698 1104600 1439506 1741135 1940151 2013394
14284 2013394 1917120 1665666 1336016 1007774 704423 506744 358618 244769 172086 141696
14274 141696 148121 124963 131496 180152 187489 184072 200109 202308 165916 122962 101699 119455
14262A19455K5862n109k012p405k4804q266K13l6142J6111R512j2438k4564K1893
14249G2306K2195k5705J3268j3091j1691J728r1j4331j6700j5392K894K3113K3262
14236F1765j3350K1087k684J2435j1941j0877K2681L336K905k0067o64q502l013
14223E3111L0325K6591q106L932r135J360k2235l5318j2188K4060L7728K4667
14211A14792J2424K2959j2673j3198l7027k429J4980J0143J7898k984l1095k5523
14199F8267k1979J6208K4454l156R62j5293p305k4529j8019J178j235n961r932
14186C660m739K964k2071J1995K3513m122p76K5494j4171j4927R285J5571J5288
14173D6964R976j6077k1329J9825K3278m2812o101J2111J5836j0579j0423j7408
$$ plain form
14262 119455 145317 140208 138196 130791 105987 97721 97934 61792 77903 87415 74977 50413 72306
14249 72306 94501 68796 82064 68973 57282 59010 58919 44588 27888 12496 15390 38503 61765
14236 61765 48415 69502 66818 79253 67312 56435 79116 82452 85357 65290 64626 56124 53111
14223 53111 83436 110027 101921 105853 96718 98078 75843 40525 28337 52397 90125 114792
14211 114792 127216 150175 137502 124304 87277 84848 99828 109971 127869 124885 93790 68267
14199 68267 46288 62496 86950 83794 84756 69463 62158 37629 19610 20788 19553 13592 3660
14186 3660 -1079 1885 -20186 -8191 15322 11200 10424 35918 21747 6820 16105 31676 46964
14173 46964 56940 40863 19534 39359 62637 19825 13724 25835 41671 31092 20669 3261
14161C261L101J1411p43R669J5998L308J053l1263n302m340M0981K856q076r474
14147C2440j1068k5077P911K1912P829K866o155Q516L5284L5019o683J8340l3408
14134H7726k6218m851l6758J583K6909K0301Q81l3316j929l6919J3796K7123M999
14121D3327Q908P57o8664k9014J8947L2400M3868N4325L7819J519J020J0464L4196
14108A89872k8936m6111M90l9713J3589M2716k036j9532M1740M3509L4154k8411
14096B01331m247M3030l876K2610O7833J8299j7486J0716j6239k7688j283L1916
14084C24916K7450L0019j6734J3608L222k067J0639j2233q626O151Q308j0875
14072C73778o79j5737N990J5843l3126l2389m1404l35R006k4698L0219K4238K233
$$ plain form
14161 3261 6362 17773 17030 26699 42697 46005 47058 15795 10493 6153 47134 49990 41914 32440
14147 32440 21372 -3705 4206 26118 33947 36813 30658 39174 74458 109477 102794 121134 87726
14134 87726 61508 56657 19899 21482 48391 68692 69573 36257 34328 -2591 11205 38328 43327
14121 43327 52235 52992 -15672 -44686 -25739 6661 50529 104854 142673 144192 145212 155676 189872
14108 189872 160936 114825 115315 75602 89191 131907 129871 110339 152079 195588 229742 201331
14096 201331 197084 240114 236238 258848 326681 344980 327494 338210 321971 294283 293000 324916
14084 324916 352366 382385 365651 379259 382481 380414 391053 378820 370194 376345 384653 373778
14072 373778 373099 357362 363352 379195 346069 313680 272276 271941 280947 256249 286468 310706 312939
14059C12939L7321N5817L9390j7183l4628l4450K6371Q788o3149j4614L463K146
14047C22211q629K6701j7377n62k4227j9659Q334P390k0948j3610k5160k4251
14035B10213j875l3253k1515J3790R968k8854j1945K6812K2868p435k783L4449
14023B10440j7513n2146n9342j0320K1836j3411K2587N0849L9954k5098k2073
14012A45763k2652k3167M4035K5732K3601j6198k9879l8288K1812M4546N610N725
14000A86640l792J7299M4793N0787M408K5505L5723L4352P4611M5519J00164K06277
13988H22286L01597L80280N02694N51690M98395L56343K56804L9631j88428m25101
13978C096191n25328n31546n23790l87356l01190k08924j54582n7841p585k8034
$$ plain form
14059 312939 350260 406077 445467 428284 393656 359206 385577 394365 331216 316602 320065 322211
14047 322211 313582 340283 322906 322344 298117 278458 286792 294182 273234 259624 234464 210213
14035 210213 208338 175085 153570 167360 177328 148474 136529 163341 186209 178774 175991 210440
14023 210440 192927 140781 81439 71119 92955 79544 102131 152980 192934 167836 145763
14012 145763 123111 99944 143979 169711 193312 177114 147235 108947 130759 175305 180915 186640
14000 186640 182848 200147 244940 295727 300135 325640 361363 395715 470326 515845 616009 822286
13988 822286 1123883 1504163 2006857 2558547 3056942 3413285 3670089 3709720 3521292 3096191
13978 3096191 2570863 2039317 1515527 1128171 826981 618057 463475 405634 398049 370015
13968C70015k0490n1546k9566O0844j2435k8078J191k630l264l2131n8077l0633
13956A63200r638k4212q414P67N0268M7368K5066k470O628m01J7529J4394l3422
13943B46663j8106m3931j1790k7329l910k7297k0804l2174m0633m2836o7425k0911
13931a10483N125K0148L4010O508M2104M9595O8945N7947K4266n088K2132J7892
13919B33101L1370K8534L3431J1598k0424n111P343K650k9720r778m1987j0475
13907B30532L5953J3938P939j165l148m5761J5249K197K5833K7342L3882M8294
13895C91085J9697o43P279P526K6275M7167K7453j859l1810J2834R329k2328j7548
13882D74457J6613R115J0051J5032K3583J9634K2973k1L2314L0285M5114N7749
$$ plain form
13968 370015 349525 297979 268413 329257 316822 288744 289935 287305 284041 251910 193833 163200
13956 163200 153562 129350 120936 121703 171971 219339 244405 241935 248563 248162 265691 280085 246663
13943 246663 228557 184626 172836 145507 141597 114300 93496 61322 20689 -22147 -89572 -110483
13931 -110483 -105358 -85210 -51200 -44692 -2588 47007 115952 173899 198165 193077 215209 233101
13919 233101 264471 293005 326436 338034 317610 312499 319842 322492 292772 282994 241007 230532
13907 230532 266485 280423 288362 287197 284049 238288 253537 255734 281567 308909 342791 391085
13895 391085 410782 410139 417418 424944 451219 498386 525839 523980 492170 505004 514333 492005 474457
13882 474457 491070 500185 510236 525268 548851 568485 591458 591437 623751 654036 699150 756899
13870G56899L9518L4304M4982L91q420k654j6343j0746m4086q827l473J3515M1411
13857H36471K3387N1175M7901N2221O9443L4093M5327N2527Q2014M3990K7599
13846A366148M1355L8957M7282O0289L9245P7480O4293Q1011J26508J13454J25409
13835B181431J99721K19912K41951K39373K83408L28788L82176M83302O35872
13826E195934Q85082J105377J312428J386370J433056J425657J432695J527016
13818A5703615J708122K109444K705744L624591N093565P466998J1807124J9714392
13810F9933595L2438681M5257656N8258881O3043963N4261069L7926664O455522
13803C67576031k2368924m7285823o1576005o2063705n4508777m0164169k6566192
$$ plain form
13870 756899 796417 830721 875703 876094 867674 865020 848677 837931 793845 785018 781545 795060 836471
13857 836471 859858 911033 958934 1011155 1080598 1114691 1160018 1212545 1294559 1338549 1366148
13846 1366148 1407503 1446460 1493742 1554031 1593276 1670756 1735049 1816060 1942568 2056022 2181431
13835 2181431 2381152 2601064 2843015 3082388 3365796 3694584 4076760 4560062 5195934
13826 5195934 6081016 7186393 8498821 9885191 11318247 12743904 14176599 15703615
13818 15703615 17411737 19521181 22226925 25851516 30945081 38412079 50219203 69933595
13810 69933595 102372276 147629932 205888813 268932776 323193845 361120509 367576031
13803 367576031 345207107 297921284 236345279 174281574 119772797 79608628 53042436
13796E3042436j6064015r384040n609460l437580k217967j504405j181778j010801
13788A2632390j018677j140885j216539j241480j171641j050546q28089o42124
13780D322409n21615l89982l29881l09006k58750j48845j25818j54492r2457p9735
13770A911828p2140p3253r3149r8340r9708j23675j31695j02346r0018r5657q3290
13759H48557l9898j3887l2311o556N636O342K161n898l7416k1820j0678K9817
13747G24049K0894J167J16612J69031K15345K34734J54973J7293j52846k00906
13737A300346k32132k16535j46201n8244m6283l6509j6133l1307j5120k4356o889
13726D70637o14k0909n923L3875M6081n337J2605k9427o78m2002n0555l2581k7074
$$ plain form
13796 53042436 36978421 27594381 21984921 18547341 16329374 14824969 13643191 12632390
13788 12632390 11613713 10472828 9256289 8014809 6843168 5792622 4964533 4322409
13780 4322409 3800794 3410812 3080931 2771925 2513175 2364330 2238512 2084020 1991563 1911828
13770 1911828 1839688 1766435 1673286 1574946 1475238 1351563 1219868 1117522 1027504 931847 848557
13759 848557 808659 794772 762461 755905 761541 767883 770044 764146 726730 704910 694232 724049
13747 724049 744943 746110 862722 1031753 1247098 1481832 1636805 1654098 1501252 1300346
13737 1300346 1068214 851679 705478 647234 600951 564442 548309 517002 501882 477526 470637
13726 470637 470023 449114 443191 477066 523147 517810 530415 500988 500310 458308 407753 375172 348098
13713C48098l4788j9924k8595l1381O198k3652m6886R040K6661p033n5656o335
13701A35747j203K2716J5913q765Q375K1895l8428n1527L3235O908k7104K3926
13689A41688J7184L3599J9086k5024P533o561N906P7972L9878m685K0863J4983
13677C42422o423K401p075n1225m3114p747J0273l2402j8183K4833k7425l6596
13665A49739m5284m3109K9733J6727J2484J2031J0698R580K5346J6564k9638q025
13653A56846k8256n3145k0009J8814K7194k3542j9023k6750k0279j3742L6325
13642C4433K5609r544k6645k813K529l3346j0989L4782j8884k886j1645j4566
13630c3965M449M190L7175J6454K3956q149k0989k0260k3158o952K322P51l2571
$$ plain form
13713 348098 313310 293386 264791 233410 239608 215956 169070 178110 204771 197738 142082 135747
13701 135747 134544 157260 173173 164408 172783 194678 156250 104723 137958 144866 117762 141688
13689 141688 158872 192471 211557 186533 194066 187505 193411 271383 311261 306576 327439 342422
13677 342422 335999 338400 331325 280100 236986 229239 239512 207110 188927 213760 186335 149739
13665 149739 104455 61346 91079 107806 120290 132321 143019 152599 177945 194509 164871 156846
13653 156846 128590 75445 55436 74250 101444 77902 58879 32129 11850 -1892 34433
13642 34433 60042 50498 23853 21040 23569 -9777 -20766 14016 -4868 -7754 -19399 -33965
13630 -33965 -29516 -25326 11849 28303 52259 44110 23121 2861 -20297 -27249 -24927 -24176 -56747
13617e6747K0121J4399J455k5491M2905M5405J7404j14Q44L484J5122J5957K4612
13604A19356L0746j9510j0938P738r11l361J3890j8116l2373j5029Q393j4698
13592F5187j039k0019k4941n811O323M7606K8591j9626m0171j0485Q328l137K9014
13579E9820J5461k5634m0856j9293J7227L4440k235j2362j1059M1154j0139j2517
13567C4007j30k220l516J6365K3939l0537k398Q146r549l0196O872m914j0954
13554e085L3740M7333R880k2019m9487m8814Q45J3858J3585k578l9498k444L8643
13541a2041N2211J4237k3680q160J9815K1590k0126m8619k6905K3487o235k2000
13529c6426Q238J5156J4005J0416p701j6717n5449j3194R257Q745P001N519L5030
$$ plain form
13617 -56747 -36626 -22227 -20772 -46263 -3358 42047 59451 59337 60181 63665 78787 94744 119356
13604 119356 150102 130592 119654 127392 126481 123120 137010 118894 86521 71492 79885 65187
13592 65187 64148 44129 19188 13377 19700 67306 95897 76271 36100 25615 33943 30806 59820
13579 59820 75281 49647 8791 -10502 6725 41165 38930 26568 15509 56663 46524 34007
13567 34007 33877 31657 28141 44506 68445 37908 35510 43656 34107 3911 10783 5869 -5085
13554 -5085 28655 75988 85868 63849 14362 -34452 -33607 -19749 -6164 -8742 -48240 -50684 -12041
13541 -12041 40170 54407 30727 22567 42382 63972 43846 -4773 -31678 -8191 -14426 -36426
13529 -36426 -28188 -13032 973 11389 3688 -13029 -68478 -81672 -72415 -63670 -56669 -51150 -16120
13516a6120j5352Lm224j981j835l1752R87m705R88K0494M0318L4237O210k0879
13502F389Q730R411K792J1788l3552j8372j0974J7414O9396L4684L8493o26p744
13489A27829J705k8047l7957j4602n3493j2031K4689M945K4119J1130k2623J3194
13477C8858J9689j5625j5601J5764N397j0550P510j8663N260k2676l6762k6409
13465e3808m882L2464k7022l7361j3814J9899R668J5929j1150j1210j3629L5206
13453e9710L6427O246J5948M367J3170j420m8895j263Q123r014l2530r830N509
13440g2872J0661J069J5032J7194j3576K2270L1731L7108m99p714J7264j641l9838
13427A6189k6933J894q41K1584m802l2161k91L6047P66k0547l0748J5971M1613
$$ plain form
13516 -16120 -31472 -31469 -35693 -37674 -39509 -71261 -70274 -74979 -73991 -53497 -13179 21058 27268 6389
13502 6389 15119 24530 27322 39110 5558 -12814 -23788 -6374 63022 97706 136199 135573 127829
13489 127829 129534 101487 63530 48928 -4565 -16596 8093 13038 37157 48287 25664 38858
13477 38858 58547 42922 27321 43085 48482 37932 45442 26779 32039 9363 -27399 -53808
13465 -53808 -58690 -26226 -53248 -90609 -104423 -84524 -74856 -58927 -70077 -81287 -94916 -59710
13453 -59710 -23283 -17037 -1089 3278 16448 15028 -33867 -35130 -27007 -36021 -68551 -78381 -72872
13440 -72872 -62211 -61142 -46110 -28916 -42492 -20222 11509 48617 48118 40404 57668 56027 16189
13427 16189 -10744 -8850 -9691 11893 7091 -25070 -25361 10686 11452 -9095 -39843 -23872 17741
13414A7741R541K2087j8251o916j1092r728J1886K5512p522l9054k0948K4610
13402b134K041M7933L5573k0061l1394k3135q123J488q064j7017L1901L2031K2928
13389F3967K266l0454j3677J7152N162K2140K2899n1211j6357J8636K4692n135
13377F0080N311j9444J677M6911J9964l2129l0769k4349n0825j8209K2218K5553
13365E989J0183q904m375L0492O299m8406k8817L2274J2130J1127k1729k0292
13353b4029l6824J7455L3327O943N736N877P840k7133j5478P619L744L6028J2848
13340C3953l2032j3229j4316k015K0432L5246K7748L2662K782N138K2938o417
13328A12890N903L1974J7415O7737Q9565J29609J42482K22573L12744K99472K79999
$$ plain form
13414 17741 27282 49369 31118 24202 13110 3382 15268 40780 33258 -5796 -26744 -2134
13402 -2134 -93 47840 83413 63352 31958 8823 700 2188 -5876 -22893 9008 41039 63967
13389 63967 66233 35779 22102 39254 44416 66556 89455 38244 21887 40523 65215 60080
13377 60080 65391 45947 47624 94535 114499 82370 51601 27252 -23573 -41782 -19564 5989
13365 5989 16172 7268 2893 33385 39684 -8722 -37539 -5265 6865 17992 -3737 -24029
13353 -24029 -60853 -43398 -10071 -3128 2608 8485 16325 -10808 -26286 -18667 -14923 21105 33953
13340 33953 1921 -11308 -25624 -27639 -7207 28039 55787 88449 91231 96369 119307 112890
13328 112890 118793 150767 168182 235919 325484 455093 597575 820148 1132892 1432364 1712363
13317A712363J76464Q961r8476k08752k96549k96554k76546k19016j64826j06561
13307B30508p9186j7470m9423j9468N827K684k0462L0953K2328k7974n392M592
13295G7517J6058j0537n693j0711n0294l3235N561R931K9721K7978k6820k0963
13283H513M5743j6423k4524k7163J5178L8167q389j1106O09P685l5924j5994K5671
13270B043K0585j9711k9536K4899M830M050K4263J9033m482j3906j1267K4713
13258D5514J6759j627j1368j6067l3114k3443q947o291o04R999J4590L663L6434
13245B5498K5739j710j6244q708O814l3492l256Q306q626k2455L150k106J58l210
13231c0142m599K9683j2611l2156o065M1769M2156O775j0389j4178j9258q188
$$ plain form
13317 1712363 1888827 1897788 1799312 1590560 1294011 997457 720911 501895 337069 230508
13307 230508 151322 133852 84429 64961 70788 73472 53010 83963 106291 78317 72925 77517
13295 77517 93575 83038 77345 66634 16340 -16895 -11334 -1403 28318 56296 29476 8513
13283 8513 54256 37833 13309 -13854 1324 39491 31102 19996 20605 28290 -7634 -23628 2043
13270 2043 22628 2917 -26619 -1720 3110 7160 31423 50456 45974 32068 20801 45514
13258 45514 62273 60646 49278 33211 97 -23346 -32293 -38584 -39188 -29189 -14599 -10936 25498
13245 25498 51237 49527 33283 24575 31389 -2103 -5359 2947 -5679 -28134 -24984 -27090 -26932 -30142
13231 -30142 -34741 -5058 -17669 -49825 -55890 -14121 28035 34810 24421 10243 -9015 -17203
13219a7203K3849R660J959j9612L213Q433p779K699K4428N741j9302J51J9810
13206C6047J1312j8486j9610l1478j1515p889N655m898l21j5429q711N6420J7256
13193H353M463J9187R094k047m6984m837L7932J2034j3330J0535j9264j5498J4264
13180A3902K8073m921j2968J0660j1719N907k3984l095n971p605N820J0661l5115
13167c0355K0655J6866J635j963j6809k1529J5108K8683l844o616j7114J0190
13155e093n032j033m558L5686J5754o889l3287j0150K003K8465J2202o242R459
13142C1285J178j1717m97k502m050j1681l5464k0034L8147L9708J3930k843j1819
13129B3641p975k4086M288o115M6167m731k6957k2498j6889M268J8852o740k2978
$$ plain form
13219 -17203 6646 16306 18265 -1347 1866 10299 2520 5219 29647 35388 16086 16237 36047
13206 36047 47359 28873 9263 -22215 -33730 -41619 -35964 -40862 -41183 -56612 -65323 -8903 8353
13193 8353 12816 32003 41097 39050 -7934 -12771 25161 37195 23865 34400 15136 -362 13902
13180 13902 41975 37054 24086 34746 23027 28934 4950 1855 -4116 -11721 -5901 4760 -30355
13167 -30355 -9700 7166 8801 6838 -9971 -31500 -16392 12291 8447 1831 -15283 -5093
13155 -5093 -10125 -11158 -15716 19970 35724 28835 -4452 -14602 -12599 15866 28068 21826 31285
13142 31285 32463 20746 20249 17747 13697 2016 -33448 -53482 -15335 24373 38303 35460 23641
13129 23641 15666 -8420 -4132 -10247 35920 31189 4232 -18266 -35155 -30887 -12035 -18775 -41753
13116d1753K1844O368k5001R870K5618K3134j512l9852q588J1667J1257j8003
13104b4951k2297J4645K6001n224K7035O660J440j2956l2981p574j1140K332J5909
13091b3101k3755M236L0780L5378J2031L473J3630n885L163N819j1474j7631o818
13078A9846O589o929J3575k3240r972K225k8175J44j2243O384M348M855p849N577
13064b4865L3738P672j8952K7213J1099p641j9733j8673K274J289O190K0373r752
13051A0232k9364k7208M8217O9078L8892J4018L1761l286j4721K5652K3265J7399
13039B03935L2709L256j6850n0999m4782l2824L641q435r739m3127k8610Q813
13027A6988K5494K3869K985r599P933n413L664q377l4505l4347N641K2329Q356
$$ plain form
13116 -41753 -19909 -13541 -38542 -28672 -3054 20080 18568 -21284 -29872 -18205 -6948 -24951
13104 -24951 -47248 -32603 -6602 -11826 15209 21869 23309 10353 -22628 -30202 -41342 -39010 -23101
13091 -23101 -46856 -42620 -11840 23538 35569 39042 52672 46787 49950 55769 44295 26664 19846
13078 19846 26435 19506 33081 9841 -131 2094 -26081 -25937 -38180 -31796 -27448 -22593 -30442 -24865
13064 -24865 8873 16545 -2407 24806 35905 28264 8531 -10142 -7868 -6579 -389 19984 10232
13051 10232 -19132 -46340 1877 70955 109847 123865 155626 152340 137619 163271 186536 203935
13039 203935 236644 239900 223050 172051 127269 94445 98086 89651 79912 36785 8175 16988
13027 16988 42482 66351 69336 59737 67670 62257 65921 57544 23039 -11308 -5667 16662 25018
13014B5018j9294R373J375j0721Q632Q409j017r207j6696J2192M8471j0901j7031
13001B8603K8827l8782k9409J6850k4850j3012K2022K5012J3162j492j7409k9347
12989a9825O336L9060K414j5616r479M0494L4333k161l4960J6339L1796j0832
12977G7899M809M7660Q8501P8361O1698N6277K1185L6032K9545K0484K9819l753
12965E48517m5781j0497j5402p4283o5856m8025n9185k9888l2648k2472m2167
12954A02313m4125j4461K02k4004j5960K746L7895J8247L284k9111j3102m1990
12942a8066k7194O759R775J1589K3458K7942j2206q031p477K6157L5050j5406
12930E2350j8910k0642K865K0361q584Q983O608j5978J517J098p978K94L7667
$$ plain form
13014 25018 5724 15097 16472 5751 14383 22792 21775 12568 -4128 8064 56535 45634 28603
13001 28603 57430 18648 -10761 6089 -18761 -31773 -9751 15261 28423 26931 9522 -19825
12989 -19825 -13489 25571 27985 12369 2890 43384 77717 75556 40596 56935 88731 77899
12977 77899 82708 130368 218869 297230 358928 415205 436390 472422 501967 522451 552270 548517
12965 548517 502736 492239 476837 402554 336698 288673 229488 199600 166952 144480 102313
12954 102313 58188 43727 43929 19925 3965 6711 44606 62853 66137 37026 23924 -18066
12942 -18066 -45260 -38501 -28726 -17137 6321 34263 22057 14026 6549 32706 67756 52350
12930 52350 33440 12798 15663 36024 27440 36423 43031 27053 28570 29668 21690 21984 59651
12917E9651L1324k705M569j7696j5666m4741r284j9369J882M631L8671j1542k0401
12904f76j995J85K2639j2875p779O130K6203q10j0108J1657J3425K4906k3572
12891D7330m6467m4924m33J443N890L1646Q532j4955p817k9764P772J66L0899
12878a0682N7316J1517N932K859j1682J8976j0373k8496M3060l1828j2518j4463
12866A9618k2774J7145K173M117n282l041J7018m22j4089L3191j687l4057j3431
12853a521l3045L5341K2855L987m5655k5243L746M7537J080n053K176j0980l1408
12840c6183j2651j3975K2662J9635j2822k4800K1172J6389J1173J4156q767k6452
12828c0463J9892K2348K4774j8667l3878J7763J4235K8889k8807j2815J4967j4797
$$ plain form
12917 59651 90975 88270 92839 75143 59477 14736 5452 -13917 -12035 -7404 31267 19725 -676
12904 -676 -2671 -2486 20153 7278 -501 5629 31832 31022 20914 32571 45996 70902 47330
12891 47330 863 -44061 -44494 -43051 -37161 -5515 3017 -11938 -19755 -49519 -41747 -41581 -10682
12878 -10682 46634 58151 64083 66942 55260 74236 63863 35367 78427 46599 34081 19618
12866 19618 -3156 13989 16162 20279 14997 11956 28974 28552 14463 47654 45967 11910 -1521
12853 -1521 -34566 775 23630 27617 -18038 -43281 -39535 8002 9082 4029 6205 -4775 -36183
12840 -36183 -48834 -62809 -40147 -20512 -33334 -58134 -36962 -20573 -9400 4756 -4011 -30463
12828 -30463 -10571 11777 36551 17884 -15994 1769 16004 44893 16086 3271 18238 3441
12816C441J810r488J6365j112J7537J2052K2759k762j5289j5942l5730l7641J1422
12803c2578J6190j7163J8180Q614m7239Q306K3793O797K9638Q757j9354M930R264
12790A8135m026j8292Q855R966J8935j5616l1520k0185P13K4582j4542j0563j2658
12777d6216K09j6444n603J6538K1387m2349k3350J9054J9004K2627J2320K0469
12765b354O560l1436k1164j1962K3937n225k505J5613k8980J1937j4564J9033
12753d1110j1910K1263J9411q257k3619k1385J9777M2848O864r101o141J4877
12741C517j4961q215K8543L6404k534j4206k0820l09K0557J603j3599K240l604
12728A4616k323k3464r004m6009L141J9491K3384J9312J3764K4183Q274k664J1819
$$ plain form
12816 3441 5251 -4237 12128 11016 28553 40605 63364 60602 45313 29371 -6359 -44000 -32578
12803 -32578 -16388 -33551 -15371 -6757 -53996 -45690 -21897 -15100 14538 23295 3941 8871 18135
12790 18135 14109 -4183 4672 14638 33573 17957 -13563 -33748 -33035 -8453 -22995 -33558 -46216
12777 -46216 -46007 -62451 -68054 -51516 -30129 -72478 -95828 -76774 -57770 -35143 -22823 -2354
12765 -2354 4206 -27230 -48394 -60356 -36419 -41644 -44149 -28536 -57516 -45579 -60143 -41110
12753 -41110 -53020 -31757 -12346 -20603 -44222 -65607 -45830 -2982 3882 -5219 -11360 3517
12741 3517 -11444 -19659 8884 45288 42754 28548 7728 7419 27976 29579 15980 18220 14616
12728 14616 12293 -11171 -20175 -66184 -63043 -43552 -20168 -856 12908 37091 45365 42701 54520
12715E4520l1870j2118j3739k5425L1988J0621k6855N259j4459N699P078L8518
12703B9217K3701j2637l2298l1157J6973K3699j5030O909O081k3858k2530L6085
12691E155P582L5983J4629k6114P139j1622l4856o936j3047o51J3032K0050l973
12678F371j5319J2946O181m5401l215K1891K191K4378K5299k3636L160J311j0821
12665E336m0395j5961N684q190l2297J3077N52J5916M388J0802L2566K2110R06
12652A4494N433K5793k1081k9004q749K6272K7170N958q789j9951j7655j7939
12640a8048j2643J8811Q54p137l0146J442j4641j2960o108M7059K4777j0912Q379
12627a1273r900j0793l016N577K1649Q865J4174m104m5945n737J0648j1561r266
$$ plain form
12715 54520 22650 10532 -3207 -28632 3356 13977 -12878 -7619 -22078 -16379 -9301 29217
12703 29217 52918 40281 7983 -23174 -6201 17498 2468 9377 15458 -8400 -30930 5155
12691 5155 12737 48720 63349 37235 44374 32752 -2104 -9040 -22087 -22738 -9706 10344 6371
12678 6371 -8948 3998 10179 -35222 -38437 -16546 -14355 10023 35322 11686 14846 16157 5336
12665 5336 -35059 -51020 -45336 -53526 -85823 -72746 -72194 -56278 -51890 -41088 -8522 13588 14494
12652 14494 19927 45720 24639 -4365 -13114 13158 40328 46286 37497 17546 -109 -18048
12640 -18048 -30691 -11880 -11026 -18163 -48309 -46867 -61508 -74468 -80576 -33517 -8740 -19652 -11273
12627 -11273 -21173 -31966 -34982 -29405 -7756 1109 15283 11179 -34766 -40503 -29855 -41416 -50682
12614e0682J7599j8166k3578J5983N7266J8407j5393j0819j1677N47j535K807
12602a9241M8814J2047l040K420J1710j2243m3323k7408j3976J5152K4359k4046
12590b8775l0845n160K1422K824M313R811J1142l281K8014K5174K2351J935j5896
12577D3029J9118j2152K510l1755P428Q904M49o037J7896L1482m3970o8687k0991
12564e2776j2532K9186K3729J140k150J55o786n592l8356K38J9014J5095o528
12551c6163j7768k6697L3427O822K5441L4478P58o067j3742m6780j5650L7808
12539b4133j7788o096L0156p07n628k2131K4472L395O576j9282o495O864L5659
12526D862J4778k716l6602M112J8887O01j764r944l8985J8686K9467J000j3752
$$ plain form
12614 -50682 -33083 -51249 -74827 -58844 -1578 16829 1436 -9383 -21060 -20513 -22048 -19241
12602 -19241 29573 41620 38580 41000 52710 40467 -2856 -30264 -44240 -29088 -4729 -28775
12590 -28775 -59620 -64780 -43358 -40534 -36221 -26410 -15268 -18549 9465 34639 56990 58925 43029
12577 43029 62147 49995 52505 20750 28178 37082 37531 31494 49390 80872 36902 -31785 -52776
12564 -52776 -65308 -36122 -12393 -11253 -13403 -13248 -20034 -25626 -63982 -63744 -44730 -29635 -36163
12551 -36163 -53931 -80628 -47201 -40379 -14938 19540 20298 14231 489 -46291 -61941 -24133
12539 -24133 -41921 -48017 -17861 -18568 -24196 -46327 -21855 -18460 -11884 -31166 -37661 -30797 4862
12526 4862 19640 16924 -19678 -15566 3321 3922 2158 -7786 -46771 -28085 1382 2382 -11370
12513a1370j2614J8519J2935p389K1415k3860j1910k1954k5460j2317Q806N046
12501f0153K894K3311J4546lL76J331k2387K593L9178n330k1707k624R028L4880
12487A5933K1984j367l4548p382o509r29N389K5695j2426n401r98l1896K945J2651
12473a6859j3336k0141R032L4807K4434J1867j1851r213J3795J2181O535l0618
12461A0633J0419J6705l1200J297N6725K1839l971m5065K548K3676j5616l726
12449D4264m2529j4041J9645j2026l816k3417P813q74L0227K1084J8033l50n3431
12436i418l852M76P796L1571m0758l5347J7106J6569J4588j6489l15k2304j5413
12423e5790K4768J0697q074J9263o166J8058k753m254J2722l9662m2785m331K6300
$$ plain form
12513 -11370 -23984 -5465 7470 81 21496 -2364 -14274 -36228 -61688 -74005 -65199 -60153
12501 -60153 -57259 -33948 -19402 -19405 -19029 -17698 -40085 -37492 1686 -3644 -25351 -27975 -18947 15933
12487 15933 37917 36550 2002 -5380 -11889 -12818 -7429 18266 5840 439 -559 -32455 -29510 -16859
12473 -16859 -30195 -50336 -41304 -6497 17937 29804 17953 8740 22535 34716 41251 10633
12461 10633 21052 37757 6557 7854 64579 86418 82447 37382 39930 63606 47990 44264
12449 44264 1735 -12306 7339 -4687 -8503 -31920 -24107 -24981 5246 26330 44363 44013 -9418
12436 -9418 -13270 -12794 -4998 26573 -14185 -49532 -32426 -15857 -1269 -17758 -18073 -40377 -55790
12423 -55790 -31022 -20325 -28399 -9136 -15302 2756 3 -4251 8471 -31191 -73976 -78307 -52007
12410e2007P004k708n200q354N694K7786P126k4432R034j118m020l306L2149L6053
12396B3701k7228k2422j6010R774j2393J5119j8898m0178P9012K0295m6855l4974
12384g1057Q099L4994J9999k6865j1509J479L7893J2290N174k156j0518k2127
12372b4304R622P158J157l2490Q218K8772j486k0420j3317J8405L4817r441J8184
12359B4875o765n090K385M841K660o153J4088j6484K0113k3214j8128J787L9283
12346C4198J2019k5429j920j6880J7630j1006P323K2825N933n1032k2530k0279
12334d9148K0815M5891j880j4041o626N613l734l9796k8560L1836J201j7685k8104
12321h4218J014K6718K5920K5157K1358k345l460j2726j9978k2045J8195N772
$$ plain form
12410 -52007 -45003 -47711 -52911 -61265 -55571 -27785 -20659 -45091 -36057 -37175 -41195 -44501 -12352 23701
12396 23701 -3527 -25949 -41959 -32185 -44578 -29459 -48357 -88535 -9523 10772 -36083 -71057
12384 -71057 -62958 -27964 -7965 -34830 -46339 -44860 -6967 5323 10497 8341 -2177 -24304
12372 -24304 -14682 -7524 -6367 -38857 -30639 -1867 -3353 -23773 -37090 -18685 16132 6691 24875
12359 24875 18110 13020 15405 20246 22906 16753 30841 14357 34470 11256 -6872 -5085 34198
12346 34198 46217 20788 18868 1988 19618 8612 15935 38760 44693 -6339 -28869 -49148
12334 -49148 -28333 17558 15678 1637 -4989 624 -3110 -42906 -71466 -39630 -38429 -56114 -84218
12321 -84218 -83204 -56486 -30566 -5409 15949 13604 10144 -2582 -22560 -44605 -26410 -20638
12309b0638K7113l539j2065R297K5633j1329k5710l0191L5408J4477O305J7464
12297C2225j8037n8283K5988J1493r207j378K1106K3719l0894j3369R017j3633
12285b1253j39l528k2889l2074m419L3175J0735J5974J850K4400j7857K2346J4416
12272B0737k3863K5382k3967k2012j6670L7012K5839p652l7975K1925M102j8860
12260a6002L265K1977L337k9389P192J9321K6367J1319j6430j1930m84J7332j7166
12247A8709j6878j4632Q002M6649L0513k9833m3126r617K6648M5141L3318k2042
12235G2852L1574m962m1305j8687l0750R907L4955n972M184k6705N563J0297k8154
12222A2797l6754o59L3458p990n912J5989K3710j1748j448J4339O776k0548j1154
$$ plain form
12309 -20638 6475 2936 -9129 168 25801 14472 -11238 -41429 -6021 8456 14761 32225
12297 32225 14188 -44095 -18107 -6614 -15821 -17199 3907 27626 -3268 -16637 -7620 -21253
12285 -21253 -21392 -24920 -47809 -79883 -84302 -51127 -40392 -24418 -22568 1832 -16025 6321 20737
12272 20737 -3126 22256 -1711 -23723 -40393 -3381 22458 14806 -23169 -1244 2858 -16002
12260 -16002 -12737 9240 12577 -16812 -9620 9701 36068 47387 30957 19027 18543 35875 18709
12247 18709 1831 -12801 -4799 41850 72363 42530 -596 -10213 16435 61576 94894 72852
12235 72852 104426 99464 58159 39472 8722 18629 53584 47612 51796 25091 30654 40951 12797
12222 12797 -23957 -24616 8842 852 -5060 10929 34639 22891 21443 35782 42558 22010 10856
12209A0856j45k5985O786K6979N70k3034j4966J330r990k2722O37J7008L7829
12196E153L7099l1446K0485p837l8194P217J7066j7527k6250j02L5557l6171l1473
12183f6423P360j8529k4126L6173M4229L317J9437J5959J1463j5830l0431j6035
12171c3436R135L0940j0860k8093K3922L8353O258l0953n2984j7551K7363K7350
12159a0556M099k5302l253K9182N998L1160J6983k9926j1245j9576O859J5174
12147I597J0888k5507r2j1501M703j4572J3896j2819Q4L479J7439l400k4795k207
12133c4807K0953K3807J0445j1569j0738j2396l0177o404P343M6036J7942J2598
12121C3033p086k2582J3819K1276q623j3582j3801j6351J3105q595R239j9818
$$ plain form
12209 10856 10711 -15274 -8488 18491 19061 -3973 -18939 -17609 -27599 -50321 -49684 -32676 5153
12196 5153 42252 10806 31291 23454 -14740 -7523 9543 -7984 -34234 -34336 1221 -34950 -66423
12183 -66423 -59063 -77592 -101718 -65545 -21316 -17999 1438 17397 28860 13030 -17401 -33436
12171 -33436 -24301 6639 -4221 -32314 -8392 29961 36219 5266 -47718 -65269 -37906 -10556
12159 -10556 -6457 -31759 -35012 -5830 168 31328 48311 18385 7140 -12436 -5577 9597
12147 9597 20485 -5022 -5114 -16615 -11912 -26484 -12588 -25407 -25323 -21844 -4405 -7805 -32600 -34807
12133 -34807 -13854 9953 20398 8829 -1909 -14305 -44482 -50886 -43543 2493 20435 33033
12121 33033 25947 3365 17184 38460 29837 16255 2454 -13897 -792 -9387 -148 -19966
12109a9966j3555k0572Q39L4963j043O625J0220J6581n758j209L630k6185l3881
12096d9311N330K445J6342j9241J5556K9519M1312n41j3088k6144j8736j9512
12084c6069O153J0556j7789J4954O387j7789K724J3978p843K599J7004K3527j7147
12071A245j0883K6011m976L114M9158K0639j2440o9131j6300j7668k2657m857
12059e8745K9595k782J3597J7143n4107m1666j8967L8241L88j1867K8109K4455
12047c6606o126k1256J3647M8782J7513k3657l6351j3774K2768P0233J0840k6191
12035A9822J3169j3878j8812J4968K1756J3095j6904q630J5877l097j4644p442
12023A5280J2124j1988l5929k9946l000L6504L8594J1350l694J0292J1757k6964
$$ plain form
12109 -19966 -33521 -54093 -53254 -18291 -19334 -12709 -2489 14092 8334 7125 10755 -15430 -49311
12096 -49311 -43981 -41536 -25194 -44435 -28879 640 41952 41411 28323 2179 -16557 -36069
12084 -36069 -29916 -19360 -37149 -22195 -15808 -33597 -30873 -16895 -24738 -22139 -5135 18392 1245
12071 1245 -9638 16373 11397 14511 63669 84308 71868 2737 -13563 -31231 -53888 -58745
12059 -58745 -29150 -31932 -18335 -1192 -55299 -96965 -115932 -77691 -77303 -89170 -61061 -36606
12047 -36606 -42732 -63988 -50341 -1559 15954 -7703 -44054 -57828 -35060 35173 46013 19822
12035 19822 32991 19113 301 15269 37025 50120 33216 24586 40463 37366 22722 15280
12023 15280 27404 15416 -20513 -50459 -53459 -16955 21639 32989 29295 39587 51344 24380
12011B4380k2039n4072L1224K6849l660j101L823j84p939p517J0195k427j8072
11998b0540p373J6165o72J8687R473k183j5974R400j0059J605Q86o660P530o257
11984e972j0690J3391K4786L0578l9058j6852q576O161j114J3249L0934Q978k680
11971D3135k2448k9951l0240l0897m74L6093r00J7260M6890q243l8710l1613k2977
11958g3075r271M8558M1750k653K603j1114j5214P10K202K4888R293j3003k4281
11945a8607J430j9224n597K8046l6972N693K20Q522j9937J3492J0360L0312r472
11932a1734j6744k982L9417n280l008K8533n786k7968p017l1497q68L5522r808
11919a9220J9234L6536J0448j7598j4699L7185N744l2472N923J1758O717j7696
$$ plain form
12011 24380 2341 -51731 -20507 6342 2682 1581 5404 5220 -2719 -10236 -41 -2468 -20540
11998 -20540 -27913 -11748 -12420 6267 15740 13557 -2417 6983 -3076 -1471 -585 -7245 285 -5972
11984 -5972 -16662 -3271 21515 52093 13035 -3817 -12393 -6232 -7346 5903 36837 45815 43135
11971 43135 20687 -9264 -39504 -70401 -70875 -34782 -35682 -18422 28468 20225 -18485 -50098 -73075
11958 -73075 -82346 -33788 7962 5309 7912 -3202 -18416 -17706 -15504 9384 18677 5674 -18607
11945 -18607 -17177 -36401 -41998 -13952 -50924 -45231 -45011 -36489 -56426 -42934 -32574 -2262 -11734
11932 -11734 -28478 -31460 7957 2677 -331 28202 22416 -5552 -12569 -44066 -44934 -9412 -19220
11919 -19220 14 36550 46998 29400 14701 51886 57630 25158 31081 42839 49556 31860
11907C1860p774J4303k762l9555k3279L8925J6984l68J0074l3791o551q738n727
11894a6399k043j8250J9346J4973l6674P870J0430o653k887J0847M1109q610m2443
11881b9384n030R814J5709J2249j3681n131K5051J8873j1194k7991K5502K5671
11869D0458q79j3823l9735k2344K805M259K0749j7512J1012P257P355J2905L567
11856A6074j7642j5109m174L469o940l11R811j2912j0905m529P17J4202L6007
11843G758m340k7712j9004q087j0504J4922K3759J5146O489M7106O506J022M0775
11830I3836j5445n2796k4014P211r053O830K2199K5235M145n056N160j2856n4235
11817h839m8708N3367J4357n762k2566j3621J7290K0685J2248j9588m2252j0071
$$ plain form
11907 31860 24086 38389 35627 -3928 -27207 11718 28702 28334 38408 4617 -1934 -10672 -16399
11894 -16399 -18442 -36692 -17346 -2373 -39047 -31177 -20747 -27400 -30287 -19440 21669 13059 -29384
11881 -29384 -34414 -24600 -8891 3358 -10323 -15454 9597 28470 17276 -10715 14787 40458
11869 40458 39579 25756 -13979 -36323 -33518 -29259 -8510 -26022 -15010 -7753 -398 12507 16074
11856 16074 -1568 -16677 -20851 -17382 -24322 -24633 -14822 -27734 -38639 -43168 -42451 -28249 7758
11843 7758 3418 -24294 -43298 -51385 -61889 -46967 -23208 -8062 -1573 45533 52039 53061 93836
11830 93836 78391 25595 1581 8792 -261 6569 28768 54003 58148 53092 58252 45396 -8839
11817 -8839 -57547 -4180 10177 4415 -18151 -31772 -14482 6203 18451 -1137 -43389 -53460
11805e3460K3524J0929K4886l4891j6003J2697K5343n74K1359r740o009k040j8277
11792b2256N885K5659K9335K9760n2309j6845J1993J4212q216k1999k0273L33
11780b4721N423j0931j7046J7087J8546J8192k8922j5229L083j7996J5576J2498
11768b4440J1345L265j1936m5086m3710J7217K5481N8169M9559J2519k6779k133
11756B3471k7217p299M3524k4684J09J8199j413K932r092Q611k5437J2602J0811
11743B5117j6360j2317J5667k0744R84M3528k1478l2318K4022K0760k680O273
11731C0454l6644j9067J1079L3032J3394j0305n406K0830J1784j6715l2592J2300
11719A2144M120o003q098O768p948J5574N840K3278J7673j6427j7270j7986J05
$$ plain form
11805 -53460 -29936 -19007 5879 -29012 -45015 -32318 -6975 -7549 13810 4070 -1939 -3979 -22256
11792 -22256 -16371 9288 38623 68383 16074 -771 11222 25434 17218 -4781 -25054 -24721
11780 -24721 -19298 -30229 -47275 -30188 -11642 6550 -22372 -37601 -34518 -52514 -36938 -24440
11768 -24440 -13095 -9830 -21766 -66852 -110562 -93345 -67864 -9695 39864 52383 25604 23471
11756 23471 -3746 -11045 32479 7795 7904 26103 24690 27622 18530 27141 1704 14306 25117
11743 25117 8757 -3560 12107 -8637 -7653 35875 14397 -17921 6101 26861 24181 30454
11731 30454 -6190 -25257 -14178 18854 32248 21943 16537 37367 49151 32436 -156 12144
11719 12144 16264 10261 2163 8931 983 16557 22397 45675 63348 46921 29651 11665 11770
11706A1770K0264j5792K5466K2505L38j293k6268k7830l2076L908J4521R81J4007
11693A0501P48j2012k0796K3773L7291J5911k0839p166m141j8608p460M1273j1216
11680B7259j6737j1131K7203j1006o125j5097K0091J3201l958O976J6140K265
11668D9081k3815l930j3148L030j3316j3637k8315J7456q363K729J0285O545m3288
11655e8686N788j3096K5248L9200K639J1782N139J4194k9906k3652J3517J2596
11643D763m7N637Q219K1272N12k3369j6008J391m907Q90k7175l860K7382J7000
11629A1700N797j3528l0240r045k1695J5663k205O703L8087j6482j3998J5942
11617a3301L143l4158l245J1003l6074Q825L6147J5862L11l306P870j3553j7096
$$ plain form
11706 11770 32034 16242 41708 64213 64551 63258 36990 9160 -22916 -19008 -4487 -3506 10501
11693 10501 11249 -763 -21559 2214 39505 55416 34577 27411 23270 4662 -2798 38475 27259
11680 27259 10522 -609 26594 15588 9463 -5634 14457 27658 23700 30676 46816 49081
11668 49081 25266 21336 8188 11218 -2098 -15735 -44050 -26594 -34957 -32228 -21943 -15398 -58686
11655 -58686 -52898 -65994 -40746 -1546 1093 12875 18014 32208 2302 -21350 -7833 4763
11643 4763 4716 10353 18572 39844 40356 16987 979 2370 -2537 -1647 -28822 -32682 -5300 11700
11629 11700 17497 3969 -26271 -35316 -57011 -41348 -43553 -36850 1237 -15245 -29243 -13301
11617 -13301 -10158 -44316 -47561 -36558 -72632 -63807 -27660 -11798 -11487 -14793 -6923 -20476 -37572
11604c7572M232J4785K5512M3119m573m822K00j4412q185k9379l1175l434K9351
11591a6353J0706j3211R482J6136J600R527L3027j0552k255k7002k713j2784N298
11578I06j9091k7526K9725J9429N61n586k8741k1584J2830J2996J4629J125m549
11565a4876P170M042L9506L642k3616L073j3065l7751j3475K9601Q089j6528N488
11552a8700L014k0671j056J6367L3884k497O747n288L7143J2635l2486l4382j636
11539f926j7536K1253L2407K2398L4060j4791j5240j094j6142j6610m0480q049
11527b6750K7547K6252J9576j585N365J0253k5781n8254P019N2564P452r281j7752
11514A6625l9338J6498J8640l447l508J0750j1172r983J638P666R117k5478N298
$$ plain form
11604 -37572 -33340 -18555 6957 50076 45503 40681 40881 26469 18284 -11095 -42270 -45704 -16353
11591 -16353 -5647 -18858 -9376 6760 8360 17887 50914 40362 38107 11105 8392 -4392 906
11578 906 -18185 -45711 -15986 3443 4004 -1582 -30323 -51907 -39077 -26081 -11452 -10327 -14876
11565 -14876 -7706 -3664 35842 39484 15868 18941 5876 -31875 -45350 -15749 -7660 -24188 -18700
11552 -18700 -15686 -36357 -37413 -21046 12838 10341 17088 11800 48943 61578 29092 -5290 -6926
11539 -6926 -24462 -3209 29198 51596 85656 70865 55625 54531 38389 21779 -18701 -26750
11527 -26750 797 27049 46625 45040 50405 60658 34877 -23377 -16358 36206 43658 34377 16625
11514 16625 -22713 -6215 12425 8978 5470 16220 5048 -4935 -3297 4369 13486 -11992 -6694
11501f694M669M937K5394o614l1741Q499j9071k3400j9561j3569K1268M1518m477
11488a8842j6911j1399J3827k85K168n745K356K0590j8459K0408K3336J716m5639
11475c2879m2925p967Q712J7767J6895K5987j5758k717l3466J0530L5381J9429
11463a011K5231J3298k183j2237m0278K3505K3433j8215N636j2114L2434O386
11451D3885j0361m1324j9099K8410K1683l3807n5578P373K6600K7098R959n713
11439h74j3865m0729J1544L1766L9372l6698k172J5190K3053m513p086J9741Q629
11426D3358n098j7076O659l797l0015J477K1867p093l49K1224L912m635J765P892
11412D0091o51k9606q541k290l019k044O185J4479l9536L638L1319m205l884r723
$$ plain form
11501 -6694 -2025 2912 28306 21692 -10049 -1550 -20621 -44021 -63582 -77151 -55883 -14365 -18842
11488 -18842 -35753 -47152 -33325 -33610 -31442 -37187 -34831 -14241 -32700 -12292 11044 12760 -32879
11475 -32879 -75804 -83771 -75059 -57292 -40397 -14410 -30168 -32885 -66351 -55821 -20440 -1011
11463 -1011 24220 37518 35335 23098 -17180 6325 29758 11543 17179 5065 37499 43885
11451 43885 33524 -7800 -26899 1511 23194 -10613 -66191 -58818 -32218 -5120 4839 -874
11439 -874 -14739 -55468 -43924 -12158 27214 -9484 -11656 3534 26587 22074 14988 34729 43358
11426 43358 38260 21184 27843 24046 -5969 -4492 17375 10282 9933 31157 35069 30434 32199 40091
11412 40091 39440 9834 1293 -997 -4016 -6060 125 14604 -24932 -21294 10025 5820 1936 -7787
11398g787j4918J7301k065l1747M606J1299j026m489J3595L747Q60K1194Q789
11385A9359J740j2564N9278J1529k9435j2724m6266J198K4608J9455R41l338k0819
11372A2962k9952k9537R682P574k949M304Q835M793J7302J0374k5404j0226q427
11359c0669k0937j8042L4016K9623l6527k0591K9538L4156J4199J3686J19j8735
11347I836j3698m91L2214K0592N040p307j4480o1872M382L1306O051J0211K516
11334B4300l8465j5442J5109J2419J6890K9611j4620l3515j2791j5949j7430m086
11322e3969L3535J3227K7147J1992l4399j5615J7367Q200J6741J3136J4166J8282
11310F9810j038j7439j2685o514k0075j8651J3074K234J2995k0172p566L5174
$$ plain form
11398 -7787 -22705 -5404 -7469 -39216 -34610 -23311 -24337 -28826 -15231 -11484 -10624 10570 19359
11385 19359 21099 8535 67813 79342 49907 37183 -9083 -7885 16723 36178 37119 33781 12962
11372 12962 -16990 -46527 -36845 -29271 -32220 -27916 -19081 -14288 3014 13388 -12016 -22242 -30669
11359 -30669 -51606 -69648 -35632 -6009 -42536 -63127 -33589 567 14766 28452 28571 9836
11347 9836 -3862 -4353 27861 48453 53493 46186 31706 -30166 -25784 5522 11573 21784 24300
11334 24300 -14165 -29607 -14498 -2079 14811 44422 29802 -3713 -16504 -32453 -49883 -53969
11322 -53969 -20434 -7207 19940 31932 -2467 -18082 -715 7485 24226 37362 51528 69810
11310 69810 68772 51333 38648 32134 12059 -6592 6482 8716 21711 1539 -6027 29147
11298B9147l2280j6030J1784L4236J2829l4526J2168K1271q615n450q883P701
11286B3352l6778K778J7361l1922j2992J5354O664J5356L5047L3975j3401J0497
11274F5291m360j3191j6651M877j0281j1829L480m5782m923L961o040J6526o054
11261b4976K1062O31o16j240J0240q512j4049j1925L0302J4890j381K0653K8134
11248F3213l0912p380r031m2505l3402J5422Q788n042l4197p107L645K623K420
11235g3465K4356K6824l3346M1398J2680l8546p695J6601N33j0571J2796L1736
11223C301j0533p131l9369r317J8847J3352J2251J3072K0162l0991J8592J6159
11211A8395l2099r419m544j7552k2764K5210K1122j999j2575R4o608j3624n005
$$ plain form
11298 29147 -3133 -19163 -7379 26857 39686 5160 17328 38599 29984 24534 15651 23352
11286 23352 -13426 -10648 6713 -25209 -38201 -22847 -16183 -827 34220 68195 54794 65291
11274 65291 60931 47740 31089 35966 25685 13856 17336 -28446 -33369 -29408 -35448 -18922 -24976
11261 -24976 -3914 -3283 -3899 -5139 5101 -3411 -17460 -29385 917 15807 14426 35079 63213
11248 63213 32301 24921 15890 -26615 -60017 -44595 -35807 -40849 -75046 -82153 -78508 -75885 -73465
11235 -73465 -49109 -22285 -55631 -14233 -1553 -40099 -47794 -31193 -30660 -41231 -28435 3301
11223 3301 -7232 -14363 -53732 -63049 -44202 -30850 -18599 -5527 14635 -16356 2236 18395
11211 18395 -13704 -23123 -27667 -45219 -67983 -42773 -21651 -23650 -36225 -36131 -42739 -56363 -61368
11198f1368P390J4596P345K3906j8800N796K8691j2756k4769j3734R582P148k4997
11185e1970L2897m572k1138n192J7861m1507k1945N8223K2606j5461k5400k731
11173e8329J2894l467K7253L8367Q728L375M034m1945m4587p016J1763M6905L6350
11160C4325l0964r729K4169m109J4267J967m0997k477l2328p043K9021M4719M0364
11147F1185k6433j9192J352L561l4492j9175K3526R971p356q776J7486Q563Q434
11134A8654j65J146p163j3860K1595o815k1230k0354m674j4305k841K3568N834
11121b0610j3218J7495J9037l0501k2985Q165K7260L9996m042m8032R817n109
11109b2727M590P793j4949J2395J390L7032l5134q672P801o214P372K361j797
$$ plain form
11198 -61368 -53978 -39382 -32037 -8131 -26931 -21135 7556 -5200 -29969 -43703 -34121 -26973 -51970
11185 -51970 -19073 -23645 -44783 -49975 -32114 -73621 -95566 -37343 -14737 -30198 -55598 -58329
11173 -58329 -45435 -48902 -21649 16718 25446 28821 32855 -9090 -53677 -60693 -48930 -2025 34325
11160 34325 3361 -6368 17801 13692 27959 29926 -11071 -13548 -45876 -52919 -23898 20821 61185
11147 61185 34752 15560 16912 20473 -14019 -33194 -9668 303 -7053 -15829 1657 10220 18654
11134 18654 18489 19635 12472 -1388 20207 13392 -7838 -28192 -32866 -47171 -50012 -26444 -20610
11121 -20610 -33828 -16333 2704 -27797 -50782 -42617 -15357 24639 20597 -27435 -17618 -22727
11109 -22727 -18137 -10344 -25293 -12898 -11508 25524 -9610 -18282 -10481 -16695 -9323 -6962 -8759
11096h759q111p650j0194l0519l0075q57N3953M2412J5480j3810q059K1967j4286
11083A492q526L434M873o790k6015K479J5334n018k4278Q419M1348j3812K593
11070d467m006k9313L4055K4264j0521k5724k7526K6907Q971j7807J7228J2625
11058D686l3732l1784L2359L7752J5783r425j9880J5903K2492J274J3207r360
11046C9275m5243k4712j2618L7638O964j8164J3034J1624K3971K351j7097L1268
11034D8291k8133p0431M210J7983k5197p976K4523N0306l4997k7729q471J6950
11022d0671J1607M1564L5582j4628J163m9304k188j4713l3063K8620K6272M6531
11010C6772K2938p165j148l5161J7571R482K735J8894j4253j2573k623o3758o047
$$ plain form
11096 -8759 -16870 -24520 -34714 -65233 -95308 -96165 -42212 200 15680 1870 -6189 15778 1492
11083 1492 -7034 -3600 1273 -5517 -31532 -29053 -13719 -18737 -43015 -34596 6752 -7060 -4467
11070 -4467 -8473 -37786 -3731 20533 10012 -15712 -43238 -16331 -7360 -25167 -7939 4686
11058 4686 -29046 -60830 -28471 9281 25064 15639 -4241 11662 34154 35428 48635 39275
11046 39275 -5968 -30680 -43298 -5660 1304 -16860 -3826 7798 31769 34120 17023 48291
11034 48291 20158 -50273 -46063 -28080 -53277 -61253 -36730 13576 -21421 -49150 -57621 -40671
11022 -40671 -29064 12500 48082 33454 34617 -14687 -16875 -31588 -64651 -36031 -9759 36772
11010 36772 59710 52545 51397 16236 33807 43289 46024 64918 50665 38092 35469 -28289 -34336
10997c4336N1788M595j8912j7241k3256J6847J1778r482J959R683p960p143j1450
10984c3130K8044K9649l801J6816k2548K2339ql2672J2983n706n1299K707J1609
10971b5017J9550O236L924k2795K4235O558M62J452n863p97J9164m792l517k6839
10957h039O226K3929R97j0943l942k3463j7276m0531J8419J8264Q487J9715J1148
10944B991l9711n20m714J4012J2161j9679n859L1711J5737j7122l507k2866q064
10931d5430O788K0339l084L6835K9220n5992J7690M140R100J5878n793O305J5936
10918E1932J6506L09j7048k7438k1145J6796J4826j0461j9573j0340O42l7956
10906d2950l250k790J8232R492p465J4584K7593O00l2892k7027o587K0437p9N466
$$ plain form
10997 -34336 17452 22047 3135 -14106 -37362 -20515 -8737 -18219 -16260 -6577 -14537 -21680 -33130
10984 -33130 -5086 24563 20762 37578 15030 37369 37361 4689 17672 11966 -39333 -36626 -25017
10971 -25017 -5467 769 4693 -18102 6133 12691 13153 14605 8742 7945 27109 22317 18800 -8039
10957 -8039 -1813 22116 23113 12170 8228 -15235 -32511 -73042 -54623 -36359 -27872 -8157 2991
10944 2991 -36720 -37240 -41954 -27942 -15781 -35460 -41319 -9608 6129 -10993 -14500 -37366 -45430
10931 -45430 -38642 -18303 -21387 15448 44668 -11324 6366 10506 19606 35484 29691 35996 51932
10918 51932 68438 68747 51699 24261 3116 19912 34738 24277 4704 -5636 -4994 -42950
10906 -42950 -46200 -48990 -30758 -21266 -28731 -14147 13446 14046 -18846 -45873 -52460 -32023 -32102 -26636
10892b6636q12K5233q837j8397O503K4864J2339j0449Q031J3717l0667J521K1785
10879A8195j8912j8859m232r156L5915L3426j3122r2323Q991L9634Q476k1791
10867c3758k492N609N368J7481j0897m0608P748K7212J9434q959j0503n113K493
10854b6985J1862L6001N8352P650k1261l9459k6995M461P641J4274k9320j0028
10842a3807k4122J001kK272J7307j8519J0172J2604k4502K3786J7657k3588k5419
10829d5160m668J295o353J8801J2937j0562m7350K9063J2330r143p82L155j2485
10816e8922N16N2145J9920O282j56K907n543k676K0289j1166j3736Q023k9083
10803a1200k0264k0503o955K1532M368k437J4434J3479J8606Q57n7546j52R721
$$ plain form
10892 -26636 -27448 -2215 -11052 -29449 -22946 1918 14257 3808 11839 25556 -5111 -3590 18195
10879 18195 -717 -19576 -23808 -32964 2951 36377 23255 -69068 -60077 -20443 -11967 -33758
10867 -33758 -36250 -30641 -25273 -7792 -18689 -59297 -51549 -24337 -4903 -13862 -24365 -29478 -26985
10854 -26985 -15123 20878 79230 86880 65619 26160 -835 3626 11267 25541 -3779 -13807
10842 -13807 -37929 -36928 -36930 -34658 -17351 -35870 -25698 -13094 -37596 -13810 3847 -19741 -45160
10829 -45160 -49828 -48533 -54886 -36085 -23148 -33710 -81060 -51997 -39667 -48810 -49592 -46437 -58922
10816 -58922 -58406 -6261 13659 19941 19785 22692 17149 14473 34762 23596 9860 17883 -11200
10803 -11200 -31464 -51967 -58922 -37390 -33022 -35459 -21025 -7546 11060 11917 -45629 -45781 -36060
10790c6060L3098k0670m5691O321M1288J5746k6233J783m915j8131M4178M0902
10778C1616O781m8919l3248K89m217n840K8495j0477J5329M1263O982m0011k6628
10765c8585O729J6359j8635J3312K2169Q474K6879l1137J124r016m1738l3K8894
10752a5204J519k7351k8697P736K5853L3584P746k5845l1743L901M4162j4291
10740a8630m1106o133J6687q988K7183L0535J2525j5216o513o860o594l281n066
10727c1457O368j4282J4264J149K6485l6126J0779j5779j8520N576K0889k6143
10715e6797L492K6147M7056k39j6596q209j6499j1953K0749J2406k9970j6722
10703d7135M9372q261k4578j925J5467m739n834j4608K614K4561R358L142J2710
$$ plain form
10790 -36060 -2962 -23632 -69323 -63002 -21714 -5968 -32201 -30418 -35333 -53464 -9286 31616
10778 31616 38397 -10522 -43770 -43481 -47698 -53538 -25043 -35520 -20191 21072 28054 -11957 -38585
10765 -38585 -31856 -15497 -34132 -20820 1349 9823 36702 5565 6689 -2327 -44065 -44098 -15204
10752 -15204 -13685 -41036 -69733 -61997 -36144 -2560 5186 -20659 -52402 -48501 -4339 -18630
10740 -18630 -59736 -65869 -49182 -58170 -30987 -452 12073 -3143 -9656 -16516 -23110 -26391 -31457
10727 -31457 -25089 -39371 -25107 -23958 2527 -33599 -22820 -38599 -57119 -51543 -30654 -56797
10715 -56797 -53305 -27158 19898 19659 3063 -5146 -21645 -33598 -12849 -443 -30413 -47135
10703 -47135 2237 -6024 -30602 -32527 -17060 -21799 -27633 -42241 -39627 -15066 -5708 -2566 10144
10690A0144j3052j7821k9127J1852J2072J4083O7012K1126l2501j0972j0878o646
10678A5292M894J8233j3488q916k0259n0p876J3452j9105J5175K0416j066k2612
10665e910k7929k5722O170L3185j0580p308k222o000K3453O587m7505J8136N6855
10652A1210L6438j1321l103j1164n699r6N239k4916m715k2771m5360J4680O202
10639e5376J3680O158l2075K1660L6574J5452j216j5889R518K7441L445k5186
10627D186j2704k6819K9470J2271l7053J5667q685l879L6698K4126k2311p048
10615C919K0099l4207J3480J194j000Q674k5464j5761j9524M1499J1203k8394
10603b4282N929P198p536J5987l376j2429J7754n475j3037j9573K6526Q100j8278
$$ plain form
10690 10144 -2908 -20729 -49856 -38004 -25932 -11849 55163 76289 43788 32816 21938 15292
10678 15292 20186 38419 24931 16015 -4244 -4294 -12170 1282 -17823 -2648 17768 16702 -5910
10665 -5910 -33839 -59561 -53391 -20206 -30786 -38094 -40316 -46316 -22863 -16276 -63781 -45645 11210
10652 11210 47648 36327 33224 22060 16361 16265 21504 -3412 -8127 -30898 -76258 -61578 -55376
10639 -55376 -41696 -35538 -67613 -45953 -9379 6073 4857 -11032 -1514 25927 29372 4186
10627 4186 -8518 -35337 -5867 6404 -30649 -14982 -23667 -27546 9152 33278 10967 3919
10615 3919 24018 -10189 3291 4485 3485 12159 -13305 -29066 -48590 -7091 4112 -24282
10603 -24282 -18353 -11155 -18691 -2704 -6080 -18509 -755 -6230 -19267 -38840 -12314 -4214 -22492
10590b2492l437Q773K6589J4555m9625j8571O382J1160j5801j5289J6777L0249
10578a0730O499J4404j6724k4993P622J5413j0186k1387Q180J5043j6953J0172
10566b3640L031r723J7456K6468j3451l6854k9635J1833K2335K0954O513k1022
10554b5735M2106J8057p665J1531P780K008j4149m7272l4877q168m02L6100P242
10541a3444j4923j5052L2844J2065J4759n233k3919k52O124j2453k6852k3625
10529f9961J9991K3381k3392k7755L2618K3459j9485L720n303M1978N2409J1460
10517F3120m6922k3795o97N696k4639P197K3113J6978K2836n523j1229m3733k0460
10504c8058m558L3182L170P773j3364J7922J5220k8455l9212J2096N576j7023
$$ plain form
10590 -22492 -25929 -17156 9433 23988 -25637 -44208 -37826 -26666 -42467 -57756 -40979 -10730
10578 -10730 -4231 10173 -6551 -31544 -23922 -8509 -18695 -40082 -31902 -16859 -33812 -23640
10566 -23640 -20609 -30332 -12876 13592 141 -36713 -66348 -54515 -32180 -11226 -4713 -25735
10554 -25735 16371 34428 26763 38294 46074 48082 33933 -13339 -48216 -56384 -56786 -20686 -13444
10541 -13444 -28367 -43419 -10575 1490 16249 11016 -12903 -13155 -7031 -19484 -46336 -69961
10529 -69961 -49970 -26589 -49981 -77736 -45118 -21659 -41144 -37424 -42727 -749 51660 63120
10517 63120 16198 -7597 -8294 -2598 -27237 -20040 3073 20051 42887 37364 26135 -17598 -38058
10504 -38058 -42616 -9434 -6264 1509 -11855 6067 21287 -7168 -46380 -34284 -28708 -45731
10492d5731k3169K4604N821o881J0540M110O03L3271K1979J8168K5974J1565J738
10479H2592k9902k5663k7346J7765K1769J875L0372J8310M2345K7260O382j6095
10467A49664o438n2194j809l2397l6925J6288k8576p299j9616m877M2219L4399
10455E2439n444k9725J846L630J3296J550j258r702k8052L2337M3782k9128n9943
10442a4372m0175k2222j0452K7986K5313P869L0317K0939j7971k2893p317L738
10430a9240k0127j4807L6663L9834o444q065L352l730k7406k136L969K6609J4686
10417B3158J2495l1664L442Q923j1162N38O159m9336k5856L3372M4142j3012J7426
10404A8625L146k0979l2900r017N651Q157P642l455P319l0107j3598Q662K468
$$ plain form
10492 -45731 -68900 -44296 -38475 -45356 -34816 -30706 -30103 3168 25147 43315 69289 80854 82592
10479 82592 52690 27027 -319 17446 39215 41090 71462 89772 132117 159377 165759 149664
10467 149664 143226 91032 89223 56826 19901 36189 7613 314 -19302 -24179 18040 52439
10455 52439 46995 17270 19116 22746 36042 37592 36334 26632 -1420 30917 74699 45571 -14372
10442 -14372 -54547 -76769 -87221 -59235 -33922 -26053 4264 25203 7232 -15661 -22978 -19240
10430 -19240 -39367 -54174 -17511 22323 15879 7814 11166 7436 -19970 -22106 -18137 8472 23158
10417 23158 35653 3989 7431 16354 5192 5730 11889 -37447 -63303 -29931 14211 1199 18625
10404 18625 21771 792 -32108 -41125 -35474 -27317 -19675 -23130 -15811 -45918 -59516 -50854 -48386
10391d8386R262L5881P73J5730p237M53k7953J326j0126l7848o71K6707L6808
10378e281j688O905p025r163J9414m918L9387k097n07k9856l4854O146L7123M156
10364A7742j5409j7524k810M3652J708j7103J4548q476l0387K303J5699J1099
10352A5042j5913O466j2714o055K8841K5037J8892J2514R537k9142n512K6652
10340G3645M5499k467L098L8939M7956k272m5980j9515k0075k359l1626l3008
10328E1835j8517K795K1764k2857j1161N466Q336j6285j8237k4803k1372l569
10316d6605j9925K7210J172J0456j5352K0127L1966K6223m21J877R628o676j2412
10303B7268N462m705J8620L2583K0337l6051j3344J7493N741J6597L5813L8400
$$ plain form
10391 -48386 -39124 -3243 -2470 13260 6023 6476 -21477 -20151 -30277 -68125 -68796 -42089 -5281
10378 -5281 -6969 -64 -7089 -16252 3162 -1756 37631 35534 35027 5171 -29683 -23537 13586 17742
10364 17742 2333 -15191 -18001 25651 27359 10256 24804 16328 -14059 -11756 3943 15042
10352 15042 -871 5595 -7119 -13174 15667 40704 59596 72110 81647 52505 46993 73645
10340 73645 119144 116677 119775 158714 206670 204398 158418 138903 118828 116469 84843 51835
10328 51835 33318 36113 57877 35020 23859 29325 37661 21376 3139 -21664 -43036 -46605
10316 -46605 -66530 -39320 -38148 -27692 -43044 -22917 9049 35272 34851 36728 46356 39680 27268
10303 27268 32730 28025 46645 79228 99565 63514 50170 67663 73404 90001 125814 164214
10291A64214L7248O4253L6630N6298J08026J22239J17921J21013Q9147O1620J2361
10280I90970k2245n0005r5652j16016r4017j10531r2407r6850n3169n0314n3992
10269A55772j9669m5977k6088p115l7446r338q966M681J5936L0724k87q943J5785
10256E9069K6831L023m0311l3382J6745q919k74j2652j7216O929K3743K740L535
10243B9861l8122j3347N0525K2498K272Q725j1517l2923k2302K218p196K011p255
10230a4552L3067k456k1614R82j4090K94K9183J360m5266j0127o009K0819M9817
10217B1408L783l8086J4045N6264m437l4234p854K7610l38j3932m3534l130j530
10204b3965k3301J8821K3101L4241K5409j359j7326j6452K5226J6015j8159j3256
$$ plain form
10291 164214 201462 265715 302345 358643 466669 588908 706829 827842 916989 978609 990970
10280 990970 968725 918720 823068 707052 613035 502504 410097 313247 260078 209764 155772
10269 155772 136103 90126 64038 56923 19477 10139 1173 5854 21790 52514 52227 43284 59069
10256 59069 85900 88923 48612 15230 31975 23056 22782 10130 -7086 -157 23586 26326 29861
10243 29861 -8261 -21608 28917 51415 53687 62412 50895 17972 -4330 -2112 -9308 -7297 -14552
10230 -14552 18515 16059 -5555 -4573 -18663 -18369 10814 12174 -33092 -43219 -49228 -28409 21408
10217 21408 25191 -12895 1150 57414 52977 18743 10889 38499 38161 24229 -19305 -22435 -23965
10204 -23965 -47266 -28445 -5344 28897 54306 52947 35621 19169 44395 60410 42251 28995
10192B8995K689J1374n397K1290j2192k5879k1653q866j202j3979Q709j5403K4866
10179f648J4904L737l2709m4468J2500N7778J4103l648K319l482J3932n200k05
10166B2913K627L4788R643n456K5353q332n2681l1159j2003l56q922L5090L0752
10153D2257N558J7984J3004J4321L007p586P307K621O4975Q1912J16462Q7169
10141D48991P6163J9844Q781m3992q0268q3749o9877p2613o8811o2676k1598k5343
10129B4852l859l5623k95j0791K3055L3280j0924k5375j0882L494l962p731K8473
10116C712J9497K4560j998k6068l4172j6880R533L2272J2570j6815l239M907K1881
10103B9760J7855j6572k6566r633J3056j568j286m0237j9372J9471L9634n513
$$ plain form
10192 28995 31684 43058 37661 58951 46759 20880 -773 -9639 -10841 -24820 -16111 -31514 -6648
10179 -6648 8256 11993 -20716 -65184 -52684 5094 19197 15549 17868 14386 28318 23118 22913
10166 22913 25540 60328 69971 64515 89868 81536 28855 -2304 -14307 -14663 -23585 11505 42257
10153 42257 47815 65799 78803 93124 96131 88545 95852 98473 163448 245360 361822 448991
10141 448991 525154 544998 553779 509787 429519 345770 275893 203280 134469 71793 50195 24852
10129 24852 20993 -14630 -14925 -25716 -2661 30619 19695 -5680 -16562 -13068 -17030 -24761 3712
10116 3712 23209 47769 45771 19703 -14469 -31349 -21816 10456 23026 6211 2972 7879 29760
10103 29760 47615 31043 4477 -5156 7900 6332 5046 -35191 -54563 -35092 4542 -971
10091i71m0660M129N359j5044K3136M2328k8938m8979L422R788P249J4450J0451
10078a4280r667L257k0318k0091M9804L932n4601j5271K3678K4924l656K8145
10066d144K5711j3612J8889m389k6815L15L8011m0058l2551L6079J787J8233j0462
10053F994L990n877o014j2222J8641R091Q379J6998J8194k3417k3564j7719L497
10040c029L0273M808j3657K0632K5992m001l3765j7991o3193k860l601M8595J204
10027a0593J22q317j0213K1735J4037P283J2661r129p774k6868j3430l816N5895
10014B1593O0068p066n4821m1873J651o235J9033K1287K0188n041j4135k8011
10002a3362J9759K5443j7685q95j0298K9270Q134l8166K744J2618M972n197J1761
$$ plain form
10091 -971 -41631 -37502 -32143 -47187 -24051 18277 -10661 -59640 -56218 -46430 -39181 -24731 -14280
10078 -14280 -23947 -20690 -41008 -61099 -11295 -7363 -61964 -77235 -53557 -28633 -32289 -4144
10066 -4144 21567 7955 26844 22455 -4360 -4045 33966 -6092 -38643 -2564 -777 17456 6994
10053 6994 10984 5107 -907 -13129 5512 14603 22982 39980 58174 34757 11193 -6526 -3029
10040 -3029 27244 32052 18395 39027 65019 61018 27253 9262 -53931 -56791 -60392 -11797 -10593
10027 -10593 -10471 -18788 -29001 -7266 6771 14054 26715 17586 9812 -17056 -30486 -34302 21593
10014 21593 81661 74595 19774 -22099 -20448 -26683 -7650 13637 33825 28784 14649 -13362
10002 -13362 6397 31840 14155 13260 2962 32232 40366 2200 4944 17562 22534 17337 29098
9989B9098q916p45K2476L377j5955L836k7080k6844M335K1995J3128k9949j4954
9976b6198L081m384J3201M9210r925K6089j1639k2156m1150k1153l169L724N478
9963c8991r598O083K3525L7766k0516L8242J4769k7008l2877r045J918J9546j25
9950C689j6842J880J8625n196K8358M0912k321J0798l891k3473m0216l5987O509
9937a7155J9294J818n026N824j0021Q907K5345q702j5654k9383k0959J311M1167
9924c234Q396k1547n974J16j582M241K6004j9339l370k127J1593Q176j6964P069
9910h542L063K2544j9990J9888P3595n658o9877m7518j8605L3776m792j1744Q34
9897c3026k0642o597J8441L0704J6313K730R314R413k6450l418L1036p039j1767
$$ plain form
9989 29098 20182 19437 41913 45290 29335 33171 6091 -20753 -16418 5577 18705 -11244 -26198
9976 -26198 -23117 -27501 -14300 34910 24985 51074 39435 17279 -23871 -45024 -48193 -44469 -38991
9963 -38991 -48589 -42506 -18981 18785 -1731 36511 51280 24272 -8605 -17650 -15732 3814 3689
9950 3689 -13153 -11273 7352 2156 30514 71426 69105 79903 76012 52539 12323 -23664 -17155
9937 -17155 2139 3957 -1069 4755 -5266 3641 28986 20284 4630 -24753 -45712 -44401 -3234
9924 -3234 5162 -16385 -22359 -22243 -23825 -19584 6420 -12919 -16289 -18416 -6823 1353 -15611 -8542
9910 -8542 -5479 17065 -2925 16963 90558 84900 15023 -32495 -51100 -17324 -22116 -33860 -33026
9897 -33026 -53668 -60265 -41824 -11120 5193 7923 17237 26650 200 -3218 27818 20779 9012
9884I012k6663L2705L4434L6113Q524n5707o5702Q841r36k571K5892J5726J8873
9871C8541l6985l6987J220M5506j2978k8574j2203j3910N438J5065L90K1190M4665
9858C0378M000l0504l0302K2173M0748J3755n128m1719j4835o618K6048K7318
9846C5314k0859k0004j2377j7470j6555J9849L1454j1334l6682K3851M3k5897
9834e0667l502M782J8671J7156J828K8802J120k0824j3450J2018L053o4183j5049
9821h0245K3968M1837K3029J4524Q463M0759j5639o275J1953k3731j4546o495
9809A7602O69P608j1115j9754N059j6832J9113R723l509j484L432q384j759o691
9795f322J313n492N716K4015J1779Q658j4043l3546k2434q272L0208J7662j093
$$ plain form
9884 9012 -17651 15054 49488 85601 94125 38418 -27284 -18443 -19379 -21950 3942 19668 38541
9871 38541 1556 -35431 -34211 11295 -1683 -30257 -42460 -56370 -50932 -35867 -35477 -14287 30378
9858 30378 34378 3874 -26428 -4255 36493 50248 45120 3401 -11434 -18052 7996 35314
9846 35314 14455 -5549 -17926 -35396 -51951 -32102 -648 -11982 -48664 -24813 -24770 -50667
9834 -50667 -54169 -49387 -30716 -13560 -11732 17070 18190 -2634 -16084 -4066 -1013 -65196 -80245
9821 -80245 -56277 -14440 8589 23113 31576 72335 56696 50421 62374 38643 24097 17602
9809 17602 18271 25879 14764 -4990 69 -16763 2350 12073 8564 7080 10512 2128 369 -6322
9795 -6322 -5009 -10501 -4785 19230 31009 39667 25624 -7922 -30356 -38628 -8420 9242 8149
9782H149n001k7498J6633r825n713R860K4420k650j4651j1341l1114L1022K8577
9769A0868k6101P46J4493j7660j7971R420J2881J2028k956n359j5306k87J7285
9756g919K3136R279j2469j9724J0501K5139J5382l3665j4762q647m221l714J1124
9743a0560j6094K5820J8480M742J6243q516M2191m09j9580p002N705l1169j7063
9730B788L0701J4668j8949o636J6418K0453k9150k2934k1358j4029O0580M675
9718C7227j7241j1342n02k5464L3818K3214p178l1038J973M18j2137m4680j2330
9705f5262M7392J2205k1140j2630J0061J3973P417J2213Q436M3273l861k4504
9693B7573p392k6759L309R84l949n933M531j1374J1531K1523j0428L054k2247
$$ plain form
9782 8149 3148 -24350 -7717 -17542 -23255 -13395 11025 8375 -6276 -17617 -48731 -17709 10868
9769 10868 -15233 -14487 6 -17654 -35625 -26205 -13324 -1296 -4252 -9611 -24917 -25204 -7919
9756 -7919 15217 24496 12027 -7697 2804 27943 43325 9660 -5102 -13749 -17970 -21684 -10560
9743 -10560 -26654 -834 17646 22388 38631 30115 72306 71897 52317 45315 51020 19851 2788
9730 2788 33489 48157 29208 22572 38990 59443 30293 7359 -13999 -28028 32552 37227
9718 37227 19986 8644 8142 -17322 16496 39710 32532 1494 3467 3885 -8252 -52932 -65262
9705 -65262 -17870 -5665 -26805 -39435 -29374 -15401 -7984 4229 12665 55938 52077 27573
9693 27573 20181 -6578 -3269 -2285 -6234 -12167 -7636 -19010 -7479 14044 3616 6670 -15577
9680a5577q089K5586N1284l1932k9083k1137l3315J2048l873j1700O61K4450q405
9667d9082O051N5089J7389J7754K639j5669r219k4304j923L2637j7712n0546P893
9654b9003K7169M9584K8093j8757l9326j3435J6594K7472J6949j3139j122l5426
9642A5653n0866P052M2178R486j2327k8205J140J4722M8720K2724l9966m7692
9630a7381J2454L3323J6805j3256k5799j5679l024M901K3695R08k6062L0701P683
9617B9269k3534J6239J6756k3063j7379k414r589n056J2120j733k1457J4144N893
9604i804K1185O16j2076J0080N456J0566J0510J1681J2162k6039k8587m592M874
9591F032N858o351j1768J2512K5517k681k1866l8284K499L9261q00j063K3584
$$ plain form
9680 -15577 -23666 1920 53204 21272 -7811 -28948 -62263 -50215 -54088 -65788 -65127 -40677 -49082
9667 -49082 -43031 12058 29447 47201 49840 34171 24952 648 -1275 31362 13650 -36896 -29003
9654 -29003 -1834 47750 75843 57086 17760 4325 20919 48391 65340 52201 51079 15653
9642 15653 -35213 -28161 14017 23503 11176 -17029 -15889 -1167 47553 70277 30311 -17381
9630 -17381 -4927 28396 45201 31945 6146 -9533 -12557 -7656 16039 16947 -9115 21586 29269
9617 29269 5735 21974 38730 15667 -1712 -4126 -13715 -18771 -6651 -8384 -29841 -15697 -9804
9604 -9804 11381 11997 -79 10001 15457 26023 36533 48214 60376 34337 5750 1158 6032
9591 6032 11890 5539 -6229 6283 31800 29119 7253 -31031 -28532 10729 9929 8866 32450
9578C2450J8812j2771l3475k2904K7315J1511o567P994k2365k1594L5379M7525
9566F1310j1973k802k723k8039o967j6422k431K150K3826k8902k2485M0328O6234
9553G1104p017l7261R1j5819k0362l760N013j3811J9424J3043j0467J1831k2202
9540a0193P270J4110j4735l5156j4642L949M2801l97k931Q968J9408J1650J9117
9527D9219K1447k9955l9917j3000l8299j5472L8781J5341o233l3989j3513L850
9515f1740K2461M321K5520k5720r925K2845l84p509j0866j593J8115R238J8696
9502C459M0825q735m0531l8017P027J8985j6469m458K3118n157l7204J1811L6356
9489h990q812n205K0463P049j4139k2544k921J358L7979M6043j4173k650J302
$$ plain form
9578 32450 51262 38491 5016 -17888 9427 20938 14371 22365 0 -21594 13785 61310
9566 61310 49337 46535 43812 15773 8806 -7616 -10047 -7897 15929 -12973 -35458 4870 71104
9553 71104 64087 26826 26917 11098 -9264 -13024 -8011 -21822 -2398 10645 178 12009 -10193
9540 -10193 -2923 11187 -3548 -38704 -53346 -49397 -6596 -6993 -9924 -956 18452 30102 49219
9527 49219 70666 40711 794 -12206 -50505 -65977 -27196 -11855 -18088 -52077 -65590 -61740
9515 -61740 -39279 -34958 -9438 -35158 -45083 -22238 -22622 -30131 -40997 -42590 -24475 -15237 3459
9502 3459 44284 35549 -4982 -42999 -35972 -16987 -33456 -37914 -14796 -19953 -57157 -45346 -8990
9489 -8990 -17802 -23007 -2544 4505 -9634 -32178 -35099 -33741 4238 50281 36108 33458 34760
9476C4760k8008m3507k9284J3869L564N647L6763J6720k1441j5963J5064l512
9464a5328M573J0795j9753R243k4990M265K3258k5493K2554M477o1286J4707K3149
9451b9829K2747L0330J7573P413l4027k3036k0977L61j353R304L1692m721j8931
9438a3454k7320n858L8501L9180L4634l075k2997m056k8666j2328r706P193L5952
9425B8000J9852j9169l0907j7926K4437J2431k6703j067n620J9145M4271J8893
9413F5637l635k674J4402p00r702l0605r669J6619Q297K6775k3755j3934j6553
9400B0503j3270J1209J7826K0526r511k0770L201J9141J3127k3000p120j4828
9388A7034l551J0333J0197J2668K9501J4752M68k9867l7469J9824K5080R475M163
$$ plain form
9476 34760 6752 -36755 -66039 -52170 -48606 -42959 -6196 10524 -10917 -26880 -11816 -15328
9464 -15328 -10755 40 -19713 -10470 -35460 -31195 -7937 -33430 -10876 -6399 -67685 -52978 -29829
9451 -29829 -7082 23248 40821 48234 14207 -8829 -29806 -29445 -30798 -21494 10198 5477 -13454
9438 -13454 -40774 -46632 -8131 31049 65683 62608 39611 35555 6889 -5439 -15145 -7952 28000
9425 28000 47852 28683 -2224 -20150 4287 16718 -9985 -11052 -16672 2473 46744 65637
9413 65637 62002 59328 73730 73030 63328 32723 23054 39673 47970 74745 50990 37056 20503
9400 20503 7233 18442 36268 56794 47283 26513 29714 48855 61982 38982 31862 17034
9388 17034 13483 23816 34013 46681 76182 90934 91402 61535 24066 43890 68970 78445 82608
9375H2608l3899o617p481r094K5140J6661o463N793J7235k6950j7357p064J8550
9362E1062r146J709L439N14K255j4342J1663K4899Q754q911j2340l4014l6619
9349a1077K3359O716K6618p82j9495q471K5881L4577J9172j1805k7690j1908l85
9336D4710m1708k956L0669K1624l2318q776J0481K1243r302K5055J6932j6811
9324E8843j4937L952L0360j9765m767P957j7315j0205n1401J0493M1483k7984
9312F714J5202K6012o084j8188j292K4603K9104r975n3890N475l587L772J766
9299A9632M072m157k8867o604K6874J7049L0868J4742k1822p479K3017j2241j5267
9286C9817k1561j5032j0487N587L1178K8574j0910l0095j405R749k1286j2840
$$ plain form
9375 82608 48709 42092 34611 25517 50657 67318 60855 66648 83883 56933 39576 32512 51062
9362 51062 41916 43625 47064 47578 49833 35491 47154 72053 80807 71896 59556 25542 -11077
9349 -11077 12282 18998 45616 44834 25339 16868 42749 77326 96498 84693 57003 45095 44710
9336 44710 3002 46 30715 52339 20021 11245 21726 42969 33667 58722 75654 58843
9324 58843 43906 47858 78218 58453 53686 61643 44328 34123 -17278 -6785 34698 6714
9312 6714 21916 47928 41844 23656 22364 46967 76071 66096 12206 17681 14094 17866 19632
9299 19632 23704 19547 -9320 -15924 10950 27999 58867 73609 51787 44308 67325 55084 39817
9286 39817 18256 3224 -7263 -1676 29502 58076 47166 17071 15666 25415 4129 -8711
9274h711k391J0416J6284J2681J7445k3704l2848K1433j3430j674J4465J2462
9262B2428K6783m1794k037M0136K5357N810l144l2332j9197J9652k0962l8406
9250a7706n478L5682M627j7572n61j2l139k3390O054K7687J3240R456k5350n349
9236a811M854L2900L2430p647K5853j7269m0247j9518K2700M4606l180k8809j0633
9223C4229m3703l9254K537N2879K1469l6070P503k41J1786r307p386K8752J2097
9210C5291j7134O524M4700K0493j8967n7630O434N673j5473L5j9144K4733L2407
9197D7942J1529j1794r836l0487M324J3327Q003j429Q16j0928m305J1910K5967
9184E5039J2523n4500k1026J0603L0714L0879j4749R205o917J956K7431K7316
$$ plain form
9274 -8711 -11102 -686 15598 28279 45724 22020 -10828 10605 -2825 -4499 9966 22428
9262 22428 49211 7417 5380 45516 70873 76683 73539 41207 22010 41662 20700 -17706
9250 -17706 -23184 12498 17125 -447 -1008 -1020 -4159 -27549 -21495 6192 19432 28888 3538 -1811
9236 -1811 3043 35943 68373 60726 86579 69310 29063 9545 32245 76851 73671 44862 34229
9223 34229 -9474 -48728 -46191 6688 28157 -7913 -410 -651 11135 1828 -5558 23194 35291
9210 35291 18157 24681 69381 89874 70907 13277 19711 25384 9911 9946 -9198 15535 47942
9197 47942 59471 47677 37841 7354 11678 25005 33008 31579 32395 21467 17162 29072 55039
9184 55039 67562 13062 -7964 2639 33353 64232 49483 58688 51771 53727 81158 108474
9172A08474l286m2307R70j6187n797n700o916R255K9365M3511l029N243K938R553
9158A26087L0154L0753J6357l5644l082L2050K5920J8561k0643Q742L270J2157
9146B44682M4712J7588N0381K9321L5894N8769O9053M5315M2182M3353N2077R0045
9134H23372J36130J74324J85364K35549K99689L48372M06228N12777O39679P35271
9124D496755P84674P04483M30336M3558l51175o51138p67585q02472p02521n43849
9114B641066m36955l85446k94088k32710j72651j66682j67074j11009k9842n1347
9104E93262p2262q0144o7224l6179j2448l0254q549o2369l3285J5423J7648o7566
9092A56053l4426K207J2678O210j2143R482j5753l4811r149Q72l5632m713L958
$$ plain form
9172 108474 105188 62881 63851 47664 41867 36167 29251 38506 67871 111382 108353 113596 116534 126087
9158 126087 156241 186994 203351 167707 164625 196675 222595 241156 220513 229255 232525 244682
9146 244682 289394 306982 357363 386684 422578 481347 550400 595715 637897 681250 733327 823372
9134 823372 959502 1133826 1319190 1554739 1854428 2202800 2609028 3121805 3761484 4496755
9124 4496755 5281429 5985912 6416248 6459806 6108631 5457493 4689908 3887436 3184915 2641066
9114 2641066 2204111 1818665 1524577 1291867 1119216 952534 785460 674451 644609 593262
9104 593262 521000 440856 373632 337453 325005 294751 286202 223833 190548 205971 223619 156053
9092 156053 121627 123834 136512 142722 130579 140061 124308 89497 80348 81220 45588 40875 44833
9079D4833r80J2605M32J3151q194j487J4710Q141R877J8605j046j1752j2099k2667
9065F4129J1836k807N349l4430K3714O121N162j1344l4813r296l062j0509L3445
9052D3495M1985o088m9610m5416K4160M0640Q46n2460k9907J7915K2889k867J1163
9039A6745L2930l2511j7973O896p930M757N548J2980p034J375J6616k1977l2762
9026b2340o228M2784K0067J0083K342m5838o2706k5076M0836K033O385L7370J1310
9013A1022L002J3174j5438P821k0463j2187J4489J5490J2389L477o2813j9773
9001d9810K9475J0197P509K5833k359k3313j8875j9836J2375O56n707P898J1640
8988a4317J8887J7521Q536j0362J1469k0762l4543K4773M4899r258k1900j3830
$$ plain form
9079 44833 43853 56458 56890 70041 61847 60360 75070 83211 93088 111693 110647 98895 86796 64129
9065 64129 75965 73158 78507 44077 67791 73912 79074 67730 32917 23621 20559 10050 43495
9052 43495 85480 79392 29782 -15634 8526 49166 50012 -2448 -32355 -14440 8449 5582 16745
9039 16745 49675 17164 -809 6087 -1843 2914 8462 21442 14408 15783 32399 10422 -22340
9026 -22340 -28568 14216 34283 44366 46708 870 -61836 -86912 -46076 -44043 -37658 -288 11022
9013 11022 14024 27198 11760 19581 -882 -13069 1420 16910 29299 32776 -30037 -49810
9001 -49810 -20335 -10138 -2629 23204 20845 -2468 -21343 -41179 -28804 -28148 -33855 -25957 -14317
8988 -14317 4570 22091 30627 20265 31734 10972 -23571 1202 46101 36843 14943 1113
8976A113j9344l1752P047K9288K4642J041k030j1563m960j3942j7285L2588j0328
8963a5485J2623J2117n9231m557L9441L385l45j5696k672j0306k6309r680K7854
8950d8861M8248K128K5505M0790j6907l8811L416J4895m37M0492j124k6902K0711
8937F3143L5255k9178m3499j1512q628j8852L477M373p045k300l494j2921K0690
8924a0491K058l913l352K9532K5953r300l6190P422j3398N025K9904Q030k932
8911B8348l1366k4668k7768N281J3937q384J135M689j7559j8266N5067O6159j7940
8898B8665J2991J3998j1406n771P744n561j3984k7973o048O800K826L0473K1475
8885E4229K5701j638o9716p777K7933K1349K0777k5699J8110O832j4032P402k1386
$$ plain form
8976 1113 -18231 -49983 -42936 -13648 10994 12035 10005 -1558 -6518 -20460 -37745 -5157 -15485
8963 -15485 -2862 9255 -49976 -54533 -15092 -11707 -12052 -27748 -30420 -40726 -67035 -76715 -48861
8950 -48861 -613 1515 27020 67810 50903 12092 15508 30403 29966 70458 69334 42432 63143
8937 63143 98398 69220 25721 14209 5581 -13271 -9794 -5421 -12466 -14766 -18260 -31181 -10491
8924 -10491 -8433 -12346 -15698 13834 39787 30487 -5703 1719 -11679 -6654 23250 31280 28348
8911 28348 -3018 -27686 -55454 -50173 -36236 -44620 -43485 -38796 -56355 -74621 -19554 46605 28665
8898 28665 41656 55654 44248 38477 46221 40660 26676 -1297 -7345 -545 2281 32754 54229
8885 54229 79930 78292 8576 799 28732 50081 70858 45159 63269 70101 56069 63471 42085
8872D2085k3760l8326j5742K1051R632R549L1574L0539J1304K5270k0050l9699
8860D3427k8498K38j535P611K8098k5720k9311k2036M0406r839R85J648l3784
8847b8310J1291N9177k1131o2864k4054P063N2766N318k2988j7413L474j4396
8835e2067L675J5571J7240K9705J596l147j3386J3288J5667j2252n119K5593J4372
8822E0736l5180k4572j5570J0636J2365L7527P037j7057j5274K568P583q680K5
8809A2144k4438k4711j1924j2682J337J3725L7253J3053r653k4832J0222M943
8797a5563r111J2500j2944K1151K0429j4694l484J0896j2573j7098P210J737J698
8784i846J730j7271J8280J9254K322K499L0436j3732J8361L142j7986j223k2857
$$ plain form
8872 42085 18325 -20001 -35743 -14692 -5060 4489 36063 66602 77906 103176 83126 43427
8860 43427 14929 15167 13632 21243 49341 23621 -5690 -27726 12680 2841 3826 5474 -28310
8847 -28310 -17019 42158 21027 -41837 -65891 -58828 -6062 -744 -23732 -41145 -37671 -52067
8835 -52067 -48392 -32821 -15581 14124 15720 12573 -813 12475 28142 15890 10771 36364 50736
8822 50736 15556 -9016 -24586 -13950 -1585 35942 42979 25922 10648 13216 20799 12119 12144
8809 12144 -12294 -37005 -48929 -61611 -60274 -46549 -9296 3757 -5896 -30728 -20506 -15563
8797 -15563 -24674 -12174 -25118 -3967 16462 1768 -1716 9180 -3393 -20491 -13281 -11544 -9846
8784 -9846 -8116 -25387 -7107 12147 14469 16968 47404 33672 52033 55175 37189 35966 13109
8771A3109k2462k2440j8485L7581L0218j0462k5406j5488K1855J5280j8246m348
8759a9294K4062r239J0169l029P037j8440j5362K066L4296K9884l2519j7245o032
8746a3646J2696J0507j4741k7046p467K5972M105L915J4704L0695J4818j1088
8734D3424k0964l6061j7295L2047K0510J1502l4515L325J5397J2215O05K661L731
8721C6582l0837l439k0364K3983J8546m814m5195N806l236n713J3563n387J9229
8708a276j196j4890n404J481N6830N4271k3236n0333k2092m849J2051K5040p339
8695A9058j2875J4324j0959j5040l0418J7935M5148J9407k1325m7224J2316J7447
8683G794l779K7289k4306j9614L4500M174l3223n3709r663L2252K8400K2060J4068
$$ plain form
8771 13109 -9353 -31793 -50278 -12697 17521 7059 -18347 -33835 -11980 3300 -14946 -19294
8759 -19294 4768 -4471 5698 2669 9706 -8734 -24096 -22030 12266 42150 9631 -7614 -13646
8746 -13646 -950 9557 -5184 -32230 -39697 -13725 -9620 -5705 8999 39694 54512 43424
8734 43424 22460 -13601 -30896 1151 21661 33163 -1352 1973 17370 29585 30190 32851 36582
8721 36582 5745 2306 -18058 5925 24471 19657 -25538 -19732 -22968 -28681 -15118 -20505 -1276
8708 -1276 -2472 -17362 -22766 -21285 35545 89816 66580 16247 -5845 -10694 1357 26397 19058
8695 19058 6183 20507 9548 -5492 -35910 -17975 27173 46580 25255 -21969 -9653 7794
8683 7794 4015 31304 6998 -12616 21884 26058 -7165 -60874 -70537 -38285 -9885 12175 26243
8670B6243j0876k8712m328M3440P705l6031m7417J7441L6458K7666J6990m5454
8658C125J264K2337N77j7212J4751J0526o206K5764k3797k0093M395M663m477
8645A5617r907M492j6998j0843N9498O1730l3778j8798j0731J7402k3624l6506
8633b446K2527R129j2196K828n730n011n453J9571r68k5950k2986L2920L4030
8620D0265j1058l8152J925O148K5092j3407l171L1660o301k4748l802j438L6254
8607C9267M956j7277Q561l119K243L063q748k87N140K3396K5423M2887K0778l1526
8593A14757o327k923j8821j9598l086K292j365k2445j8776K0934J7766K435j5671
8580D9172l5121j98R716j5231J9181J2142l4890p475L4889J8724K531m943l5264
$$ plain form
8670 26243 15367 -13345 -17673 25767 33472 -2559 -49976 -32535 3923 31589 48579 3125
8658 3125 4389 26726 27303 10091 24842 35368 29162 54926 31129 11036 15431 20094 15617
8645 15617 5710 10202 -6796 -17639 41859 103589 69811 51013 40282 57684 34060 -2446
8633 -2446 20081 29210 17014 19842 14112 9101 3648 23219 22251 -3699 -26685 6235 40265
8620 40265 29207 -8945 -7020 -872 24220 10813 7642 39302 33001 8253 4451 3013 39267
8607 39267 44223 26946 35507 32388 34631 37694 28946 28659 33799 57195 82618 125505 146283 114757
8593 114757 108430 105507 86686 67088 64002 66294 64929 42484 23708 44642 62408 64843 49172
8580 49172 14051 13853 23569 8338 27519 39661 4771 -2704 32185 50909 53440 48497 13233
8567A3233J0436K81J0462M0360j9078l4308n1051j3064K932J5877J7100l8460
8555d5280J6981J8184m5619r198r348J8513M6690J9947L354k7772n230K9415j2501
8542a864L095K3470J6263N591N161K3952K1962p362j2147j4872q549r97o679k3527
8528B3497J0363k400K6682K3426k2095m6279J7389K1183J1538j6550k5882J634
8516B2506P370j8892o937q426k847J7255L5361K816k3328k0856j7915k5763K1159
8503a8497K3431O595K4429m487m5052j0714K8466j447P136J6858k103l8288J8358
8490D685R651j0094k737k230N88L5908L4730j3272l7890l1906K6004K6462O234
8477D6133Q951j6598j8382r466L183J5624p797k2536j2203k5496J2774k0573O990
$$ plain form
8567 13233 23669 23950 34412 74772 55694 21386 -29665 -42729 -39797 -23920 -6820 -45280
8555 -45280 -28299 -10115 -55734 -64932 -74280 -55767 -9077 10870 14224 -13548 -18778 10637 -1864
8542 -1864 1231 24701 40964 46555 51716 75668 97630 90268 78121 63249 54700 53703 47024 23497
8528 23497 33860 31460 58142 81568 59473 13194 30583 51766 63304 46754 20872 22506
8516 22506 29876 10984 4047 -4379 -7226 10029 45390 48206 24878 4022 -13893 -39656 -18497
8503 -18497 4934 11529 35958 31471 -13581 -24295 4171 2724 9860 26718 24615 -13673 4685
8490 4685 14336 4242 1505 -725 -137 35771 70501 57229 19339 -12567 13437 39899 46133
8477 46133 55084 38486 20104 10638 13821 29445 21648 -888 -13091 -38587 -25813 -46386 -39396
8464c9396K2205K4303M596q450l5261j8944J5961q874K4780k477K845j8509l523
8451d0744K2200j2012Q343j4901L4130L6849Q576J1849j3797m4517l3329J6083
8439b1270K0027p447j3065N48L2361K8032k0219r886l5085l0768k835q71L180
8426e7298m7791j2372O1153L3377o943j7349R803L4801n91k5038Q577K7578O802
8413A4709l0773j2998M3572j0064j4764K9228l757J3128j9419o297k6982M235
8401b0182K0551k0627J3991r150N530j8695L16j2684m5392P414M5494j94J001
8388c2627k4524j0656L0323M7175J1148p443j7312j2250L741J6480l415k5369
8376b4729k2113N005J2443O530L308L9109L7545j7636l2096j3464L3729l662k2124
$$ plain form
8464 -39396 -17191 7112 11708 3258 -32003 -50947 -34986 -43860 -19080 -21557 -18712 -37221 -40744
8451 -40744 -18544 -30556 -22213 -37114 -2984 33865 42441 54290 40493 -4024 -37353 -21270
8439 -21270 -1243 -8690 -21755 -21207 11154 39186 18967 9081 -26004 -56772 -59607 -60478 -57298
8426 -57298 -105089 -117461 -56308 -22931 -29874 -47223 -37420 -2619 -3210 -28248 -19671 7907 14709
8413 14709 -16064 -29062 14510 4446 -10318 18910 15153 28281 8862 2565 -24417 -20182
8401 -20182 369 -20258 -6267 -15417 -9887 -28582 -28266 -40950 -86342 -78928 -33434 -33628 -32627
8388 -32627 -57151 -67807 -37484 9691 20839 13396 -3916 -16166 -12425 4055 640 -24729
8376 -24729 -46842 -41837 -29394 -22864 -19556 19553 57098 39462 7366 -6098 27631 23969 1845
8363A845n673j4099k8718J6658M982K5890m4458J2740K7999M937j0639j4381J531
8350b1386J6454j7647N41J5286k7712j1807J2053K660L9110J3837j5110j8889
8338a2610J3782o261r103p30J2799M342k993j5179p392K4606J2965j6804J1625
8325I047K4924j3868k0391q785m1652m403K4971Q546K9720r935K9982J1204P217
8312D6577j1321R970k2319k7580j225L092j1043J4173O470j5198k0654j471K7127
8299c402K7780P965Q01k6454j5682n847n835o608J6019L1148j4633m2441N669
8286c1520L1890k0641k9093j6334k355O6856J1447j4678k7705k8823k7942L1600
8274e7298O5343J935j5983N235K1363l232k3230l044l482j6138l6568p068l4226
$$ plain form
8363 1845 -3828 -17927 -46645 -29987 -25005 885 -43573 -30833 -2834 2103 -8536 -22917 -21386
8350 -21386 -4932 -22579 -22038 -6752 -34464 -46271 -34218 -31558 7552 21389 6279 -12610
8338 -12610 1172 -5089 -14192 -14922 -2123 2219 -774 -15953 -23345 1261 14226 -2578 9047
8325 9047 33971 20103 -288 -9073 -50725 -55128 -30157 -21611 8109 -1826 28156 39360 46577
8312 46577 35256 45226 22907 -4673 -5898 -2806 -13849 324 6794 -8404 -29058 -30529 -3402
8299 -3402 24378 32343 33144 6690 -8992 -14839 -20674 -27282 -11263 19885 5252 -37189 -31520
8286 -31520 370 -20271 -49364 -65698 -68053 -1197 10250 -4428 -32133 -60956 -88898 -57298
8274 -57298 8045 9980 -6003 -768 20595 17363 -5867 -8911 -12393 -28531 -65099 -72167 -106393
8261a06393q772M5345M2512J9469J0342j6480q274j849K4472j0220j7921k258
8249c0027J9004L017j904J7734K8065l50L243J90k9022k970q568R221p895l5975
8235c6237j9549M446K3302p546J852o416J4799p15k8080J7464J39P500q433J8298
8221a9176J715q364J1576j979r100k4498J2865J7716k0029K0880R040N744j322
8208d932r464j7222N908k478q412O119J4420j2296J7831J5917l928J3037J0380
8195B4880j377o936k4417m733P887j2283L3762M5263J9420l7995j2017K6382L2076
8182H9912j0253j3321q017l159L7087j8059K3146J7358j7146o069k2888j1052
8170E7539m3254j4273J7243k4977l4611K6095N7749J5611l6373r056N264M533
$$ plain form
8261 -106393 -115165 -69820 -27308 -7839 2503 -13977 -22251 -24100 372 -9848 -27769 -30027
8249 -30027 -11023 -8006 -9910 7824 35889 35539 38782 38972 9950 6980 -1588 7633 -262 -36237
8235 -36237 -55786 -51340 -28038 -35584 -33732 -40148 -25349 -26064 -54144 -36680 -36541 -29041 -37474 -19176
8221 -19176 -17461 -25825 -14249 -16228 -25328 -49826 -36961 -19245 -39274 -18394 -9354 -3610 -4932
8208 -4932 -14396 -31618 -25710 -28188 -36600 -30481 -16061 -28357 -10526 5391 1463 14500 24880
8195 24880 23503 16567 -7850 -12583 -4696 -16979 16783 62046 81466 43471 31454 57836 89912
8182 89912 79659 66338 58321 55162 92249 74190 97336 114694 97548 91479 68591 57539
8170 57539 14285 12 17255 -7722 -42333 -16238 41511 57122 20749 11693 16957 21490
8158B1490j5318J8454O779j0326J11M724j4418k189j0310l1680M480K3845r16
8145e274k6060J4295J3601N083K7648j8944q939k9196j6889L2463M87O6K8303
8132A6644k3092k6137J7764j2804M089L2366K9203k8288l1223k3103L4442L6153
8120B6014k1265l9479j3010L4230J5356m0550J7883L9015K6133k3259j3190J006
8108H884p539l9027l9731R307J5410K8494N1065L904o112R105j4402j0686R060
8095A7732j4338j2966j9390j3650J1802R546k17o783q527o128L046R302O238P321
8081a7012J4157O568J2865J8777j3463j7280j3683j1160j402j0772J8270p397
8069b1532J314J6882l023K3414K360J6549J5018l5252m3910L4439l218q634p68
$$ plain form
8158 21490 6172 24626 31405 21079 21190 25914 11496 9307 -1003 -32683 -28203 -4358 -5274
8145 -5274 -31334 -17039 -3438 1645 29293 10349 1410 -27786 -44675 -12212 -11725 -11659 16644
8132 16644 -6448 -32585 -14821 -27625 -23536 8830 38033 9745 -21478 -44581 -10139 26014
8120 26014 4749 -34730 -47740 -13510 1846 -38704 -20821 18194 44327 21068 7878 8884
8108 8884 1345 -37682 -77413 -68106 -52696 -24202 26863 30767 24655 33760 19358 8672 17732
8095 17732 3394 -9572 -28962 -42612 -30810 -21264 -21481 -28264 -36791 -42919 -39873 -30571 -24333 -17012
8081 -17012 -2855 3713 16578 35355 21892 4612 -9071 -20231 -21633 -32405 -14135 -21532
8069 -21532 -20218 -3336 -6359 17055 19415 35964 50982 15730 -28180 6259 3041 -5593 -6361
8056f361q48k0553K4623j7700O877J8545J6683k4831j0862M6399k969o926j5498
8043F579j6373o378J2214K2493J8326M037j9738P154j4140j7914j1606k099J0243
8030g202O021R392k0568K577R04J0817J5617m6832k0712M19M8843L7611k4436
8017A2451n600m238J5267K431n50O376M2711l368q262j1226J3190J8090r431L5409
8003A03250J5632l759j5357J3289j9347k8943J0300k1661j1342r97j7483J8589
7991D2171K2775L2041L0621l5585j7943J3535K8892j3525q563m5542m5377q751
7979e251J7843K4406R504j256l8248j0274K9214K6435O64r492k7280j6507j1183
7966a1425P063J0599K8385J4612p060n296j576M0748l72k3353m611J6493J2146
$$ plain form
8056 -6361 -7209 -27762 -3139 -20839 -13962 4583 21266 -3565 -14427 31972 29003 22077 6579
8043 6579 -9794 -16172 -3958 18535 36861 40898 21160 28314 14174 -3740 -15346 -17445 -7202
8030 -7202 -1181 8211 -12357 -9780 -8876 1941 17558 -29274 -49986 -49567 -724 36887 12451
8017 12451 6851 2613 17880 20311 19761 26137 68848 65480 57218 45992 59182 77272 67841 103250
8003 103250 118882 115123 99766 113055 93708 64765 75065 53404 42062 41065 23582 42171
7991 42171 64946 96987 127608 92023 74080 87615 116507 102982 94419 48877 3500 -5251
7979 -5251 12592 36998 46502 45246 6998 -3276 25938 52373 53037 43545 16265 -242 -11425
7966 -11425 -4362 6237 34622 49234 42174 36878 35302 76050 75678 52325 47714 64207 76353
7953G6353R385R474l0616j2205j1360N091L1447p092k5978l7978k4762L2551K6577
7940D0887J1426j0722k8427r427p686M3302L7499j0230l8602k8914p709J0532
7928A929N953J4339j7276J0833j2837K9955n020K0368J9615k029J7036j4739j7777
7915E0350K5335k9556m1745J323K5844L5936M614m0791M353K7157k108j8021n664
7902C7027J2394k6821M250J2216N039K9805K7945k0014n1714j2977p069K1075
7890C1156p585j9487J7643l8867l3010K4227J0056p462K1878P927j2065J5420
7878I831l4180j2130j6981K8668J4624j7600O390k0533L711L4867n904j3991r314
7865c2542N961J786J8145K5631k2488M3934L4397k709j7819j5088L485k6928l7134
$$ plain form
7953 76353 85738 95212 64596 52391 41031 46122 77569 70477 44499 6521 -18241 14310 40887
7940 40887 52313 41591 13164 3737 -3949 39353 76852 66622 28020 -894 -8603 1929
7928 1929 7882 22221 4945 15778 2941 32896 27876 48244 67859 65830 82866 68127 50350
7915 50350 75685 46129 4384 5707 31551 67487 72101 31310 35663 62820 60712 42691 37027
7902 37027 49421 22600 26850 39066 44105 73910 101855 81841 30127 17150 10081 31156
7890 31156 23571 4084 21727 -17140 -50150 -25923 -15867 -23329 -1451 6476 -5589 9831
7878 9831 -24349 -36479 -53460 -24792 -10168 -27768 -21378 -41911 -38200 -3333 -9237 -23228 -32542
7865 -32542 -26581 -24795 -6650 18981 -3507 40427 74824 72115 54296 39208 42693 15765 -21369
7852b1369k233J91Q179K9293L3254l7506n6476L073N2552J2118k3786j1290P155
7839f845J7679Q931o95J141Q916Q29M2603k9543k1219K1420J0695j0526o333j1954
7825B5099J5205l044n5217r159M9916M217j9898M97P463j1995k4729l2986j3245
7812f7876K1095K8592O337J1126J4101l8504J6559j6067j8927J1727L8083J846
7800H092r366k6183l2522m4086J2399L5584K8230K0007L5191L6352l263l1356
7788B9079j1633p437Q000j5255l3166k2789P058K9408J3664j3995L0132J3654
7776B6720k3227m739q703q007n010l303l815Q890O849K6535J8948p313m425P245
$$ plain form
7852 -21369 -23602 -23411 -15232 14061 47315 9809 -46667 -43594 8958 21076 -2710 -14000 -6845
7839 -6845 10834 19765 19070 20211 29127 29956 72559 43016 21797 43217 53912 43386 37053 25099
7825 25099 40304 37260 -17957 -27116 22800 27017 7119 7616 15079 3084 -21645 -54631 -67876
7812 -67876 -46781 -18189 -11852 -726 13375 -25129 -8570 -24637 -43564 -31837 6246 8092
7800 8092 -1274 -27457 -59979 -104065 -91666 -56082 -27852 -7845 27346 63698 60435 29079
7788 29079 17446 10009 18009 2754 -30412 -53201 -46143 -16735 -3071 -17066 13066 26720
7776 26720 3493 -1246 -9949 -17956 -22966 -26269 -30084 -21194 -14345 12190 31138 23825 19400 26645
$$ [...]
##END NTUPLES=NMR SPECTRUM
##END=
