##TITLE=Analysis number 324052
Compound Code mo 07896
Book Reference 423/114
Project Code adrs
Chemist Name bruced
##JCAMPDX= 6.0         $$ Bruker NMR JCAMP-DX V2.0
##DATA TYPE= NMR SPECTRUM
##DATA CLASS= NTUPLES
##ORIGIN= Bruker BioSpin GmbH
##OWNER= nmr
$$ XWIN-NMR		Version 3.5
$$ Tue Nov 14 11:30:51 2006 GMT Standard Time (UT+0h)  MAYBRIDGE\nmr@NMR_250MHZ
##.OBSERVE FREQUENCY= 250.131544655141
##.OBSERVE NUCLEUS= ^1H
##.ACQUISITION MODE= SIMULTANEOUS (DQD)
##.ACQUISITION SCHEME= undefined
##.AVERAGES= 16
##.DIGITISER RES= 18
##SPECTROMETER/DATA SYSTEM= dpx250
##.PULSE SEQUENCE= zg30
##.SOLVENT NAME= CDCl3
##.SHIFT REFERENCE= (INTERNAL, CDCl3, 0, 16.522)
##AUDIT TRAIL= $$ (NUMBER, WHEN, WHO, WHERE, WHAT)
$$ ##TITLE= Audit trail, XWIN-NMR		Version 3.5
$$ ##JCAMPDX= 5.01
$$ ##ORIGIN= Bruker BioSpin GmbH
$$ ##OWNER= nmr
$$ C:\u/data/dgb/nmr/ADRS/230/pdata/1/auditp.txt
$$ ##AUDIT TRAIL=  $$ (NUMBER, WHEN, WHO, WHERE, WHAT)
(   1,<2006-11-14 11:30:27.15 +000>,<MAYBRIDGE\nmr>,<NMR_250MHZ>,
      <created by zg, POWCHK disabled, PULCHK disabled
       configuration hash MD5:
       49 4B E0 1D 92 C2 6B 37 9F E6 65 BC 52 41 86 1D
       data hash MD5: 64K
       C3 56 4A F5 62 ED BE EF AA C5 27 9F 5D 46 6E B6>)
(   2,<2006-11-14 11:30:42.03 +000>,<MAYBRIDGE\nmr>,<NMR_250MHZ>,
      <Start of raw data processing
       ef LB = 0.3 FT_mod = 6 PKNL = 1 SI = 32K 
       data hash MD5: 32K
       69 27 EF F4 C1 59 DE 81 00 5A B3 23 FA F5 59 12>)
(   3,<2006-11-14 11:30:43.73 +000>,<MAYBRIDGE\nmr>,<NMR_250MHZ>,
      <apk 
       data hash MD5: 32K
       56 4D 6B 76 C5 DA DD 37 FB D7 87 82 63 BC 21 EF>)
(   4,<2006-11-14 11:30:44.55 +000>,<MAYBRIDGE\nmr>,<NMR_250MHZ>,
      <abs ABSG = 5 
       data hash MD5: 32K
       AD 3A 8F A6 AE 11 22 B9 28 0F BF 38 D4 43 B5 9E>)
$$ ##END=
$$ 
$$ hash MD5
$$ DC CD 8C 03 D1 E9 DC 1A 71 10 AD D4 E8 02 28 67
##$RELAX= 
##$RELAX= 
##$RELAX= 
##$RELAX= 
##$RELAX= 
##$RELAX= 
##$RELAX= 
$$ Bruker specific parameters
$$ --------------------------
##$DU= <C:\u>
##$EXPNO= 230
##$NAME= <ADRS>
##$PROCNO= 1
##$TYPE= <nmr>
##$USER= <dgb>
##$AMP= (0..31)
100 100 100 100 100 100 100 100 100 100 100 100 100 100 100 100 100 100 
100 100 100 100 100 100 100 100 100 100 100 100 100 100 
##$AQSEQ= 0
##$AQ_mod= 3
##$AUNM= <au_zg>
##$AUTOPOS= <26 >
##$BF1= 250.13
##$BF2= 250.13
##$BF3= 250.13
##$BF4= 250.13
##$BF5= 500.13
##$BF6= 500.13
##$BF7= 500.13
##$BF8= 500.13
##$BYTORDA= 1
##$CFDGTYP= 0
##$CFRGTYP= 5
##$CHEMSTR= <none>
##$CNST= (0..31)
1 1 145 1 1 1 1 1 1 1 1 1 1 1 1 1 1 1 1 1 1 1 1 1 1 1 1 1 1 1 1 1 
##$CPDPRG= <>
##$CPDPRG1= <>
##$CPDPRG2= <>
##$CPDPRG3= <>
##$CPDPRG4= <mlev>
##$CPDPRG5= <mlev>
##$CPDPRG6= <mlev>
##$CPDPRG7= <mlev>
##$CPDPRG8= <mlev>
##$CPDPRGB= <>
##$CPDPRGT= <>
##$D= (0..31)
0 1 0 0 0 0 0 0 0 0.06 0 0 0 0 0 0 0.0002 0 0 0 0 0 0 0 0 0 0 0 0 0 0 
0 
##$DATE= 1163503825
##$DBL= (0..7)
120 120 120 120 120 120 120 120 
##$DBP= (0..7)
150 150 150 150 150 150 150 150 
##$DBP07= 0
##$DBPNAM0= <>
##$DBPNAM1= <>
$$ [...]
##$SUBNAM7= <"">
##$SUBNAM8= <"">
##$SUBNAM9= <"">
##$SW= 20.6930455092707
##$SWIBOX= (0..15)
0 0 3 0 0 0 0 0 0 0 0 0 0 0 0 0 
##$SW_h= 5175.983436853
##$TD= 65536
##$TD0= 1
##$TE= 683.16
##$TE2= 300
##$TE3= 300
##$TEG= 300
##$TL= (0..7)
0 120 120 120 120 120 120 120 
##$TP= (0..7)
150 150 150 150 150 150 150 150 
##$TP07= 0
##$TPNAME0= <>
##$TPNAME1= <>
##$TPNAME2= <>
##$TPNAME3= <>
##$TPNAME4= <>
##$TPNAME5= <>
##$TPNAME6= <>
##$TPNAME7= <>
##$TPOAL= (0..7)
0.5 0.5 0.5 0.5 0.5 0.5 0.5 0.5 
##$TPOFFS= (0..7)
0 0 0 0 0 0 0 0 
##$TUNHIN= 0
##$TUNHOUT= 0
##$TUNXOUT= 0
##$USERA1= <user>
##$USERA2= <user>
##$USERA3= <user>
##$USERA4= <user>
##$USERA5= <user>
##$V9= 5
##$VALIST= <valist>
##$VCLIST= <CCCCCCCCCCCCCCC>
##$VD= 0
##$VDLIST= <DDDDDDDDDDDDDDD>
##$VPLIST= <PPPPPPPPPPPPPPP>
##$VTLIST= <TTTTTTTTTTTTTTT>
##$WBST= 1024
##$WBSW= 4
##$XGAIN= (0..3)
0 0 0 0 
##$XL= 0
##$YL= 0
##$YMAX_a= 489437
##$YMIN_a= -524687
##$ZGOPTNS= <>
##$ZL1= 120
##$ZL2= 120
##$ZL3= 120
##$ZL4= 120
##$ABSF1= 16.522
##$ABSF2= -4.171173
##$ABSG= 5
##$ABSL= 3
##$ALPHA= 0
##$AQORDER= 0
##$ASSFAC= 0
##$ASSFACI= 0
##$ASSFACX= 0
##$ASSWID= 0
##$AUNMP= <proc_1d>
##$AZFE= 0.1
##$AZFW= 0.1
##$BCFW= 0
##$BC_mod= 0
##$BYTORDP= 0
##$COROFFS= 0
##$CY= 12.5
##$DATMOD= 1
##$DC= 0
##$DFILT= <>
##$DTYPP= 0
##$F1P= 14.0000005364418
##$F2P= -0.99999901652339
##$FCOR= 0.5
##$FTSIZE= 32768
##$FT_mod= 6
##$GAMMA= 0
##$GB= 0
##$INTBC= 1
##$INTSCL= 1
##$ISEN= 128
##$LB= 0.3
##$LEV0= 0
##$LPBIN= 0
##$MAXI= 10000
##$MC2= 0
##$MEAN= 0
##$ME_mod= 0
##$MI= 0
##$NCOEF= 0
##$NC_proc= -2
##$NLEV= 6
##$NOISF1= 0
##$NOISF2= 0
##$NSP= 0
##$NTH_PI= 0
##$NZP= 0
##$OFFSET= 16.522
##$PC= 1
##$PHC0= -49.1879
##$PHC1= 3.476562
##$PH_mod= 1
##$PKNL= yes
##$PPARMOD= 0
##$PSCAL= 4
##$PSIGN= 0
##$REVERSE= no
##$SF= 250.13
##$SI= 32768
##$SIGF1= 0
##$SIGF2= 0
##$SINO= 400
##$SIOLD= 32768
##$SREGLST= <1H.CDCl3>
##$SSB= 0
##$STSI= 32768
##$STSR= 0
##$SW_p= 5175.98343685301
##$SYMM= 0
##$S_DEV= 0
##$TDeff= 65536
##$TDoff= 0
##$TI= <Analysis number 999999
Compound Code 99
Book Reference 9
Project Code 9>
##$TILT= no
##$TM1= 0
##$TM2= 0
##$TOPLEV= 0
##$USERP1= <user>
##$USERP2= <user>
##$USERP3= <user>
##$USERP4= <user>
##$USERP5= <user>
##$WDW= 1
##$XDIM= 32768
##$YMAX_p= 345081537
##$YMIN_p= -311691
$$ End of Bruker specific parameters
$$ ---------------------------------
##NTUPLES= NMR SPECTRUM
##VAR_NAME=  FREQUENCY,     SPECTRUM/REAL,   SPECTRUM/IMAG
##SYMBOL=    X,             R,               I
##VAR_TYPE=  INDEPENDENT,   DEPENDENT,       DEPENDENT
##VAR_FORM=  AFFN,          ASDF,            ASDF
##VAR_DIM=   32768,         32768,           32768
##UNITS=     HZ,            ARBITRARY UNITS, ARBITRARY UNITS
##FACTOR=    0.157963299565203, 1,           1
##FIRST=     4132.6476996994, 0,             0
##LAST=      -1043.33573715361, 0,           0
##MIN=       -1043.33573715361, -311691,     0
##MAX=       4132.6476996994, 345081537,     0
$$ Real data points
##PAGE= N=1
##DATA TABLE= (X++(R..R)), XYDATA
$$ [...]
17101a0583r52l992K288K115L286k200k001L85N019k323N661J071p585n916m751
$$ -10583 -11535 -15527 -13239 -11124 -7838 -10038 -12039 -11654 -6635 -8958 -3297 -2226 -9811 -15727 -20478
17086b0478O205J496J0216J95o152k824n771p646j62R152N811Q130L843r481m183
$$ -20478 -14273 -12777 -2561 -2366 -8518 -11342 -17113 -24759 -24921 -15769 -9958 -1828 2015 -7466 -11649
17071a1649J819J749m725J008M509J0935J204j807q924K162O098l463J452j233
$$ -11649 -9830 -8081 -12806 -11798 -7289 3646 4850 3043 -5881 -3719 2379 -1084 368 -865
17057h65l388o750O67K620n39Q83Q53J994Q65l529K342J079J785m007O462J110
$$ -865 -4253 -11003 -10336 -7716 -8255 -7372 -6519 -4525 -3660 -7189 -4847 -3768 -1983 -5990 472 1582
17041A582m846p420J27K552K14l566nk125M619P409o25o320o853K207K966o208
$$ 1582 -3264 -10684 -10557 -8005 -7791 -11357 -11362 -13487 -8868 -1459 -2084 -8404 -15257 -13050 -10084 -16292
17025a6292o761K687Q854K608J23m132k801j667L186j663n246M533Q87J085K145
$$ -16292 -23053 -20366 -11512 -8904 -8781 -12913 -15714 -17381 -14195 -15858 -21104 -16571 -15684 -14599 -12454
17010a2454m32j491M47p4k184K429L788K891K69J345L153q405L103o824o995M424
$$ -12454 -12886 -14377 -13930 -14004 -16188 -13759 -9971 -7080 -6811 -5466 -2313 -10718 -7615 -14439 -21434 -17010
16994a7010L569O648M051k196P283J589J644p453m405L699J406N99k439l570M928
$$ -17010 -13441 -6793 -2742 -4938 2345 3934 5578 -1875 -6280 -2581 -1175 -576 -3015 -6585 -1657
16979a657j904R36m53N829K251l019n139n172j755K895L001k473J383k198m001
$$ -1657 -3561 -2625 -3078 2751 5002 1983 -3156 -8328 -10083 -7188 -4187 -6660 -5277 -7475 -11476
16964a1476j0256L260Q038N323k472n2o0K19J076n191j719P099M833O641P80n97
$$ -11476 -21732 -18472 -10434 -5111 -7583 -7635 -7695 -7476 -6400 -11591 -13310 -6211 -1378 5263 6043 5446
16948E446p759l192L749J137j482j997n764o961J07L001N67K050O526L805k72
$$ 5446 -2313 -5505 -1756 -619 -2101 -4098 -9862 -16823 -16716 -13715 -13148 -11098 -4572 -767 -1039
16933a039n62k005J933M53N532r79k665r196O6M448k075M632P784k698n59J755
$$ -1039 -1601 -3606 -1673 -1220 4312 3333 668 -8528 -8462 -4014 -6089 -1457 6327 3629 3070 4825
16917D825j0301j0969o735M497M250N72M88K312m280m569J370M175M679P938K876
$$ 4825 -5476 -16445 -23180 -18683 -14433 -13861 -13373 -11061 -15341 -19910 -18540 -14365 -9686 -1748 1128
16902A128J843o417p620n239M754O265k326K15n240N035O693J434n127m608j603
$$ 1128 2971 -3446 -11066 -16305 -11551 -5286 -7612 -7397 -12637 -7602 -909 525 -4602 -9210 -10813
16887a0813M982N348K188m519m928l660J346M105j188m33o37m006J126N213q36
$$ -10813 -5831 -483 1705 -2814 -7742 -11402 -10056 -5951 -7139 -7572 -8209 -12215 -11089 -5876 -6712
16872f712J47M855m798K228N469m060m087q87o868m31P059l151M120P708m255
$$ -6712 -6565 -1710 -6508 -4280 1189 -2871 -6958 -7845 -14713 -15144 -8085 -11236 -7116 592 -3663
16857c663j741O59k526p886k681O001j132M304N155N60K45K968K458n393k133
$$ -3663 -5404 -4745 -7271 -15157 -17838 -11837 -12969 -8665 -3510 -2950 -2705 263 2721 -2672 -4805
16842d805l214n465L750L895K4j554O449J945m102p862M762k155m798l10O385
$$ -4805 -8019 -13484 -9734 -5839 -5815 -7369 -920 1025 -3077 -10939 -6177 -8332 -13130 -13440 -7055
16827g055K277l331m738j258N533J803M094k547n059K991P490K896m603p828q16
$$ -7055 -4778 -8109 -12847 -14105 -8572 -6769 -2675 -5222 -10281 -7290 200 3096 -1507 -9335 -10151
16812a0151n48R13R057l920k316m35n654n495q24L996J613k97M408M123l607L555
$$ -10151 -10699 -9786 -729 -4649 -6965 -7400 -13054 -18549 -19373 -15377 -13764 -14061 -9653 -5530 -9137 -5582
16796e582J505l427L80m67l974o862K563P542Q494O98J824O4j638n683n050J158
$$ -5582 -4077 -7504 -7124 -7591 -11565 -18427 -15864 -8322 172 870 2694 2758 1120 -4563 -9613 -8455
16780h455J269r032q902Q464J4726J0557J897j723k786n227O9m83R1N29l70n470
$$ -8455 -7186 -16218 -25120 -16656 -1930 8627 10524 8801 6015 788 857 374 465 994 624 -4846
16764d846j208q24Q07O920M9n369O89k649k059P361j849k50k445l315l493j724
$$ -4846 -6054 -6878 -6071 849 898 -4471 -3782 -6431 -8490 -1129 -2978 -3228 -5673 -8988 -12481 -14205
16748a4205O075L325m365K830L58k310l116J668r01M601j21m540k609K358M276
$$ -14205 -8130 -4805 -9170 -6340 -5982 -8292 -11408 -9740 -10641 -6040 -6161 -10701 -13310 -10952 -6676
16733f676K600K317n484K641K52L233O60m429p746m337O642M875n188K890J2556
$$ -6676 -4076 -1759 -7243 -4602 -4350 -1117 -457 -4886 -12632 -16969 -10327 -5452 -10640 -7750 4806
16718D806j733n212K915O328L947n005j0954m182L740Q307j152m167l725j366
$$ 4806 3073 -2139 776 7104 11051 6046 -4908 -9090 -5350 2957 1805 -2362 -6087 -7453
16704g453K236K651L781p412o497n60L072m549R06P265j0477l764J02O480k097
$$ -7453 -5217 -2566 1215 -6197 -12694 -13254 -10182 -14731 -13825 -6560 -17037 -20801 -20699 -14219 -16316
16689a6316p29k414K595N224O169p336J965j023O571K860J699j608m588M442n58
$$ -16316 -17045 -19459 -16864 -11640 -5471 -12807 -10842 -11865 -5294 -2434 -735 -2343 -6931 -2489 -3047
16674c047j128J661r93j219j676M115K742r909n785j039K068r48p793L344P929
$$ -3047 -4175 -2514 -3507 -4726 -6402 -2287 455 -9454 -15239 -16278 -14210 -15158 -22951 -19607 -11678
16659a1678M958J311m314l768K356P107O275o232j1640J081J479N296P923Q32
$$ -11678 -6720 -5409 -9723 -13491 -11135 -4028 2247 -3985 -15625 -14544 -13065 -7769 154 986
16645I86m593l227l623j940n330r706L176P376l369P142N432o96K142Q72o81L426
$$ 986 -3607 -6834 -10457 -12397 -17727 -27433 -24257 -16881 -20250 -13108 -7676 -8372 -6230 -5358 -6039 -2613
16629b613J229o100n397J684Q053N145N970p009N24K009p082q111K245Q329J940
$$ -2613 -1384 -7484 -12881 -11197 -3144 2001 7971 962 1486 3495 -3587 -11698 -9453 -1124 816
16614H16N165l367l883q794m665L744L445Q350K483m882j12m056m780j798k075
$$ 816 5981 2614 -1269 -10063 -14728 -10984 -7539 811 3294 -1588 -1700 -5756 -10536 -12334 -14409
16599a4409n830j489N118O339L867q287P34L877K664p78M242Q010j273K775j169
$$ -14409 -20239 -21728 -16610 -10271 -6404 -14691 -13957 -10080 -7416 -8194 -3952 4058 2785 5560 4391
16584D391j1077J098m544j340O566J372qJ530k288n561j403P660R78n559K703
$$ 4391 -6686 -5588 -10132 -11472 -4906 -3534 -3542 -2012 -4300 -9861 -11264 -3604 -2626 -8185 -5482
16569e482K473Q828k346k501m751j2134k54l35K752J699p19o72M9Q257O15L612
$$ -5482 -3009 5819 3473 972 -3779 -15913 -16167 -16502 -13750 -12051 -12770 -13442 -13393 -5136 -4521 -909
16553i09L086l629n315L058R80o777m474N517O127q56l302K032l058L508O83r10
$$ -909 2177 -1452 -6767 -3709 -2729 -9506 -13980 -8463 -2336 -3192 -6494 -4462 -7520 -4012 -3329 -4239
16537d239o409o78O801n10n779j678M176O23l406k921J578J52m2P426j095m247
$$ -4239 -10648 -11326 -4525 -5035 -10814 -12492 -8316 -7693 -11099 -14020 -12442 -12290 -12332 -4906 -6001 -10248
16521a0248o18Q1J964O935q16j021n70n568L22N8P39j439K156J0O169j746l481
$$ -10248 -10866 -10785 -8821 -1886 -2702 -3723 -4293 -9861 -9539 -9481 -8742 -10181 -8025 -8015 -1846 -3592 -7073
16504g073K974K036l381m444J909r42J146P312n23k084q94K991l155p560k774
$$ -7073 -4099 -2063 -5444 -9888 -7979 -8921 -7775 -463 -986 -3070 -3964 -973 -4128 -11688 -14462
16489a4462j707K210L608L564O243N666k161m067j419M415o52j159o707K3m32
$$ -14462 -16169 -13959 -10351 -6787 -544 5122 2961 -1106 -2525 1890 1238 79 -6628 -6605 -7037
16474g037L397k48J805n523m470O665j77K685j667k224K658k875L599m104j459
$$ -7037 -3640 -3888 -2083 -7606 -12076 -5411 -5588 -2903 -4570 -6794 -4136 -7011 -3412 -7516 -8975
16459h975K610n45m406l159L200Q515L237n076M646R03L219n912L39m007q40k38
$$ -8975 -6365 -6910 -11316 -14475 -11275 -2760 477 -4599 47 950 4169 -1743 -1404 -5411 -6251 -6489
16443f489n663N866P118j076k223k32j278P200j069n543m984J088K73J01K661
$$ -6489 -12152 -6286 832 -244 -2467 -2699 -3977 3223 2154 -3389 -8373 -7285 -7012 -6911 -4250
16428d250P728p174j2426p634J622R665n76J497N98p883K314N735o73K091P716
$$ -4250 3478 -3696 -16122 -23756 -22134 -12469 -13045 -11548 -10950 -18833 -16519 -10784 -11457 -9366 -1650
16413a650Q52l215q99l925N00J274k618K633l67q46P94O586J567n612n07j278
$$ -1650 -798 -4013 -4912 -8837 -8337 -7063 -9681 -7048 -7415 -8261 -7467 -881 686 -4926 -5433 -6711
16397f711k487l696J699Q60q03J836M110m529p700l414K883K005j358K034M513
$$ -6711 -9198 -12894 -11195 -10335 -11138 -9302 -5192 -9721 -17421 -20835 -17952 -15947 -17305 -15271 -10758
16382a0758j851L26j60L88j984K519L881k18K363K388l416K193m580l321O041
$$ -10758 -12609 -12283 -12443 -12055 -14039 -11520 -7639 -7857 -5494 -3106 -6522 -4329 -8909 -12230 -6189
16367f189L037n435K251J021m814k300k162J016O33RL508J2895N284j1270J301
$$ -6189 -3152 -8587 -6336 -5315 -10129 -12429 -14591 -13575 -12942 -12933 -9425 3470 8754 -2516 -1215
16352a215K244M283k483q148j301N272l12m005q529j880M474J027l463J884P046
$$ -1215 1029 5312 2829 -5319 -6620 -1348 -1660 -5665 -14194 -16074 -11600 -10573 -14036 -12152 -5106
16337e106j442o21k982l476k986N816N678P094k902m045o63k197L255J165l248
$$ -5106 -6548 -7169 -10151 -13627 -16613 -10797 -5119 1975 -927 -4972 -5635 -7832 -4577 -3412 -6660
16322f660l165M08K163j507l781k842L117O886M836m459j583p04L991m841n560
$$ -6660 -9825 -9417 -7254 -8761 -12542 -15384 -12267 -5381 -545 -5004 -6587 -7291 -3300 -8141 -13701
16307a3701L843N410M903J488n441n574M224K923j170J636j920k687Q48o364L226
$$ -13701 -9858 -4448 455 1943 -3498 -9072 -4848 -1925 -3095 -1459 -3379 -6066 -5218 -11582 -8356
16292h356j079M33L527Q00J79j0744r79J1136j429J132n222K045j614m869k698
$$ -8356 -9435 -9002 -5475 -4675 -4496 -15240 -16219 -5083 -6512 -5380 -10602 -8557 -10171 -15040 -17738
16277a7738L163N777l379o596K727L761J882j466r48J979o992M792J2140M02q050
$$ -17738 -14575 -8798 -12177 -18773 -16046 -12285 -10403 -11869 -12817 -10838 -17830 -13038 -898 -496 -8546
16262h546o574q881r25O321l454l169O581N101L488l078o3J829K547k55J196j358
$$ -8546 -15120 -24001 -24926 -18605 -22059 -25228 -18647 -13546 -10058 -13136 -13199 -11370 -8823 -9078 -7882 -9240
16246i240j845p69J696k308N219K141r82n119m769J848O357L843R1q226k243O571
$$ -9240 -11085 -11854 -10158 -12466 -7247 -5106 -6088 -11207 -15976 -14128 -7771 -3928 -3837 -12063 -14306 -7735
16230g735L4j097Q8L744m552M590L094J304K530L586o243n976j900l043K113m31
$$ -7735 -7701 -8798 -8710 -4966 -9518 -4928 -1834 -530 2000 5586 -657 -6633 -8533 -11576 -9463 -9894
16214i894M17J78N224J0266J168n783k870j824m818L698J438M038M874k792l803
$$ -9894 -9477 -9299 -4075 6191 7359 1576 -1294 -3118 -7936 -4238 -2800 1238 6112 3320 -483
16199d83Q1P88p95O130P686J780k144o834l146O875m85n629M530q24M3j299n177
$$ -483 -402 386 -409 5721 13407 15187 13043 6209 3063 9938 9453 3824 8354 7530 7573 6274 1097
16182A097K686P233o81l934J02N139j803L750q27m390j288j1441q69K767L960
$$ 1097 3783 11016 10335 6401 6503 11642 9839 13589 12762 8372 7084 -4357 -5226 -2459 1501
16167A501L021Q92m603k83R93P803k770m789J29k790M465N263r2j963K85p400
$$ 1501 4522 5414 811 528 1521 9324 6554 1765 1894 -896 3569 8832 8740 6777 7062 -338
16151c38n429Q02K362L823K030j309k413n142R4J884K254R48L495K883m735o792
$$ -338 -5767 -4965 -2603 1220 3250 1941 -472 -5614 -5520 -3636 -1382 -434 3061 5944 1209 -5583
16135e583k559L782M459K687j837M150m01l608k493l316l154k350M043J169j142
$$ -5583 -8142 -4360 99 2786 949 5099 4698 1090 -1403 -4719 -7873 -10223 -6180 -5011 -6153
16120f153M931N886N342m233q759l052K613N594n49L411j761o88m842m469k131
$$ -6153 -1222 4664 10006 5773 -2986 -6038 -3425 2169 1620 5031 3270 2582 -2260 -6729 -8860
16105h860j120k770k840p07j852M845m242k284N713J916j523l13J108q69J776
$$ -8860 -9980 -12750 -15590 -16297 -18149 -13304 -17546 -19830 -14117 -12201 -13724 -14037 -12929 -13798 -12022
16090a2022J618m501p797J481Q350K242k636K786J327m27O126J572k336j244q82
$$ -12022 -10404 -14905 -22702 -21221 -12871 -10629 -13265 -10479 -9152 -9579 -3453 -1881 -4217 -5461 -6343
16075f343R27m22p464l176L452K474l697j669Q43M867J207l740j11P370N050r45
$$ -6343 -5416 -5838 -13302 -16478 -13026 -10552 -14249 -15918 -15075 -10208 -9001 -12741 -12852 -5482 -432 -1377
16059a377m803L071p98k79J903n637l806J952N395P75J296n080K030N155P67k880
$$ -1377 -6180 -3109 -3907 -4186 -2283 -7920 -11726 -9774 -4379 -3604 -2308 -7388 -5358 -203 564 -2316
16043b316n68J033k604l965q04q44J346j497j704J443l87P051P15k562J458m278
$$ -2316 -2884 -1851 -4455 -8420 -9224 -10068 -8722 -10219 -11923 -10480 -10867 -3816 -3101 -5663 -4205 -8483
16027h483L143O997l229j2752Q90J190j61K459K683J992L841m77n970k912J34
$$ -8483 -5340 1657 -1572 -14324 -13434 -12244 -12405 -9946 -7263 -5271 -1430 -1907 -7877 -10789 -10655
16012a0655P115l333k750l184j786O398j00J560J3715q09p103m077m069J413M105
$$ -10655 -3540 -6873 -9623 -12807 -14593 -8195 -8295 -6735 6980 6171 -932 -5009 -9078 -7665 -3560
15997c560m008m072P49K030k27j662J260O508J173K184k563J343L205m855k379
$$ -3560 -7568 -11640 -10891 -8861 -9088 -10750 -9490 -2982 -1809 375 -2188 -845 2360 -2495 -4874
15982d874N681J444k253j709n094m885O248J398J614L955k956k986k787r59M141
$$ -4874 807 2251 -2 -1711 -6805 -11690 -5442 -4044 -2430 1525 -1431 -4417 -7204 -8163 -4022
15967d022Q67k878l152ml35n34K965M384q29j969k161N294l134n200J920n043
$$ -4022 -3155 -6033 -9185 -9189 -9524 -10058 -7093 -2709 -3538 -5507 -7668 -2374 -5508 -10708 -8788 -13831
15951a3831o621J97P731O144Kn210n448O868M220k548j710r46N133J000J082K196
$$ -13831 -20452 -20255 -12524 -6380 -6378 -11588 -17036 -10168 -5948 -8496 -10206 -11152 -6019 -5019 -3937 -1741
15935a741q286K036K177o17l897N482L002m538o021n0K9j869J966Q62O078j720
$$ -1741 -10027 -7991 -5814 -6431 -10328 -4846 -1844 -6382 -12403 -12453 -12424 -14293 -12327 -11465 -5387 -7107
15919g107m176L831m918l795M564N203L394l364p06j36M322N864n40q469l254
$$ -7107 -11283 -7452 -12370 -16165 -11601 -6398 -3004 -6368 -7074 -7210 -2888 2976 2436 -6033 -9287
15904i287j39l437N328L133l187M3O238j754l840O519j407k699l691L57L988l916
$$ -9287 -9426 -12863 -7535 -4402 -7589 -7546 -1308 -3062 -6902 -383 -1790 -4489 -8180 -7823 -3835 -7751
15888g751j2614L009Q813L68J200J481k423M48j205M346R31m382l998k820P35
$$ -7751 -20365 -17356 -8543 -8175 -6975 -5494 -7917 -7469 -8674 -4328 -3397 -7779 -11777 -14597 -13862
15873a3862J429K863k235K154n99O628J1925k832p236n363j540J303m863l613
$$ -13862 -12433 -9570 -11805 -9651 -10250 -3622 8303 5471 -1765 -7128 -8668 -7365 -12228 -15841
15859a5841M155Q526J03m888q79J999Q145N979p116l780M961L551K111L906o050
$$ -15841 -11686 -3160 -3057 -7945 -8824 -6825 1320 7299 183 -3597 1364 4915 7026 10932 4882
15844D882j0277m623N356j9K01J774R91m01o247o217J549M290L873M2j198l659
$$ 4882 -5395 -10018 -4662 -4681 -4480 -2706 -1715 -2116 -8363 -14580 -13031 -8741 -4868 -4826 -6024 -9683
15828i683N469O801L053K490p706l724m403j5283N734R366r98J582K105j688L366
$$ -9683 -4214 2587 5640 8130 424 -3300 -7703 -22986 -17252 -7886 -8884 -7302 -5197 -6885 -3519
15813c519j564k637l955O52J171O140J977k084O81k725n831l474N894r80m978
$$ -3519 -5083 -7720 -11675 -11023 -9852 -3712 -1735 -3819 -3138 -5863 -11694 -15168 -9274 -10254 -15232
15798a5232J150j520N367J340P59M992K451J245j0489m926R1j020N119O387K66
$$ -15232 -14082 -15602 -10235 -8895 -8136 -3144 -693 552 -9937 -14863 -14772 -15792 -10673 -4286 -4020
15783d020k627q418K972N347L714k540m210J330P058p040Q66K296p27j852l913
$$ -4020 -6647 -15065 -12093 -6746 -3032 -5572 -9782 -8452 -1394 -8434 -7568 -5272 -5999 -7851 -11764
15768a1764N84m96n148N23O62O832j795k66N853k324l334J154J275O800R67K417
$$ -11764 -11180 -11676 -16824 -16301 -15639 -8807 -10602 -10868 -5015 -7339 -10673 -9519 -8244 -1444 -477 1940
15752A940p94j705k055n266k264K279J960K045J3271J690J995k664p724o665p07
$$ 1940 1146 -559 -2614 -7880 -10144 -7865 -5905 -3860 9411 11101 13096 10432 2708 -3957 -4664
15737d664L21l991j872K775M676k662j624l555J598R912J249q162k007l377o581
$$ -4664 -4343 -8334 -10206 -7431 -2755 -5417 -7041 -10596 -8998 914 2163 -5999 -8006 -11383 -17964
15722a7964j356O786L095K119M734l001m296j925k263N349m386q87n04L874J995
$$ -17964 -19320 -12534 -9439 -7320 -2586 -5587 -9883 -11808 -14071 -8722 -13108 -13995 -14499 -10625 -8630
15707h630L04n70O086J919R51l60q370N205P327m483k403q36N749n441n234k268
$$ -8630 -8326 -8896 -2810 -891 60 -300 -8670 -3465 3862 -621 -3024 -3860 1889 -3552 -8786 -11054
15691a1054J267L497k884j408N996N674l999L414J825J16r503l224N3P560J557
$$ -11054 -9787 -6290 -9174 -10582 -4586 1088 -2911 503 2328 2444 -7059 -10283 -10230 -2670 -1113
15676a113j139m104M455k775m341J415M90j100O679j001j529m761p71j000Q952
$$ -1113 -2252 -6356 -1901 -4676 -9017 -7602 -7112 -8212 -1533 -2534 -4063 -8824 -9595 -10595 -1643
15661a643N77p352K135n40j922k910J921o520m922K805L014N954R574M871n778
$$ -1643 -1066 -8418 -6283 -6823 -8745 -11655 -9734 -16254 -21176 -18371 -15357 -9403 171 5042 -736
15646g36O209R801o476l174M944J760j695m905J928K595o69n831J683J461m834
$$ -736 5473 15274 8798 5624 10568 12328 10633 5728 7656 10251 9582 3751 5434 6895 2061
15631B061K996N45o308m550K101m833l498O766L741q7L108M430j15k454m895k879
$$ 2061 5057 5602 -706 -5256 -3155 -7988 -11486 -4720 -979 -1066 2042 6472 6357 3903 -992 -3871
15615c871J226J890k899J774J184j657k611K74P52k664K1Q803M718k190k701j804
$$ -3871 -2645 -755 -3654 -1880 -696 -2353 -4964 -4690 -3938 -6602 -6581 2222 6940 4750 2049 245
15599B45k124l611L784j72k870n977K777j726K38m97n65O946O783j323k727O433
$$ 245 -1879 -5490 -1706 -1878 -4748 -10725 -7948 -9674 -9436 -9933 -10498 -3552 3231 1908 -819 5614
15583E614r42m068j345m985o060N926O088K635l674q32L726p187j3746n763K828
$$ 5614 4672 604 -741 -5726 -11786 -5860 228 2863 -811 -1643 2083 -5104 -18850 -24613 -21785
15568b1785L762L854P608r21m411l460M095l516k142M517J22r13m053N357R086
$$ -21785 -18023 -14169 -6561 -7482 -11893 -15353 -11258 -14774 -16916 -12399 -12277 -13190 -17243 -11886 -2800
15553b800j308K655q746Q71M111k915o227M183R80O64N791J41J788o387m376Q63
$$ -2800 -4108 -1453 -10199 -9328 -5217 -8132 -14359 -10176 -9196 -8532 -2741 -2600 -812 -7199 -11575 -10712
15537a0712N479N759L700m572j0044L64O934L05l881j680m667l112M526R279n189
$$ -10712 -5233 526 4226 -346 -10390 -10026 -3092 -2787 -6668 -8348 -13015 -16127 -11601 -2322 -7511
15522g511j694j070q330M50O546K472n66k342K008O06J074q45j448p88O027q85
$$ -7511 -9205 -10275 -18605 -18155 -11609 -9137 -9703 -12045 -10037 -9431 -8357 -9202 -10650 -11438 -5411 -6296
15506f296l968m337J032R078J51o256J470K488M194M035m650q983O281L150L332
$$ -6296 -10264 -14601 -13569 -4491 -4340 -10596 -9126 -6638 -2444 1591 -3059 -12042 -5761 -2611 721
15491G21k4p713l634l829R840Q867k658K321l673N833L517q127p788m806K99K479
$$ 721 697 -7016 -10650 -14479 -4639 4228 1570 3891 218 6051 9568 1441 -6347 -11153 -10854 -8375
15475h375m741l10N923M746M72p565M643R95n730J752P605M55J246J263P734L493
$$ -8375 -13116 -13426 -7503 -2757 -2285 -9850 -5207 -4212 -9942 -8190 -585 -130 1116 2379 10113 13606
15459A3606j1871q175n84l428n001O046O803O568m024m904p104J636N257O917
$$ 13606 1735 -6440 -7024 -10452 -15453 -9407 -2604 3964 -60 -4964 -12068 -10432 -5175 1742
15445A742J145J270m265n952n140k641l578J792J406O800L698k200o117q698J595
$$ 1742 2887 4157 -108 -6060 -11200 -13841 -17419 -15627 -14221 -7421 -3723 -5923 -12040 -20738 -19143
15430a9143J0102j114q92L851m61M986J522p020J748n813n682J674L486K19M411
$$ -19143 -9041 -10155 -11047 -7196 -7657 -2671 -1149 -8169 -6421 -12234 -17916 -16242 -12756 -12537 -8126
15415h126M463L178m174n355M397K456j561k192l201M163J091l523q098P83J394
$$ -8126 -3663 -485 -4659 -10014 -5617 -3161 -4722 -6914 -10115 -5952 -4861 -8384 -16482 -15699 -14305
15400a4305j487j762o80J498O183N964L031k679l933O695Q775l747j1736k088
$$ -14305 -15792 -17554 -18234 -16736 -10553 -4589 -1558 -4237 -8170 -1475 7300 3553 -8183 -10271
15386a0271J0083J981n748M211m771Q66M018J530R97j054l841k524K851j517j067
$$ -10271 -188 1793 -3955 256 -4515 -3649 369 1899 2896 1842 -1999 -4523 -1672 -3189 -4256
15371d256m298l208O558K646j629n12r288l025N205j633L358O556J740o18P24
$$ -4256 -8554 -11762 -5204 -2558 -4187 -4699 -13987 -17012 -11807 -13440 -10082 -3526 -1786 -2404 -1680
15356a680L925l583K412K13K754j702n372p930N58j114k70l422N600M128k213
$$ -1680 2245 -1338 1074 1287 4041 2339 -3033 -10963 -10405 -11519 -11789 -15211 -9611 -5483 -7696
15341g696J404O839J166J131R65m023n681K009m44k800L75l448j990o8N259J0302
$$ -7696 -6292 547 1713 2844 3809 -214 -5895 -3886 -4330 -7130 -6755 -10203 -12193 -12261 -7002 3300
15325C300q02n855k698o122o432N840J0893N951j392M414m419q878R03q56q995
$$ 3300 2498 -3357 -6055 -12177 -18609 -12769 -1876 4075 2683 7097 2678 -6200 -5297 -6153 -15148
15310a5148J890O360o393J873l268j223k04j494k3K602P8j044k337J086L124K569
$$ -15148 -13258 -6898 -13291 -11418 -14686 -15909 -16113 -17607 -17630 -15028 -14950 -15994 -18331 -17245 -14121 -11552
15294a1552L86L476K148j970N607M088j684m052m315j404K453N039L553n379m251
$$ -11552 -11166 -7690 -5542 -7512 -1905 2183 499 -3553 -7868 -9272 -6819 -1780 1773 -3606 -7857
15279g857K920r34p330K998P395O682k837p018q751QL21l320N533p70p54P586
$$ -7857 -4937 -5871 -13201 -10203 -2808 3874 1037 -5981 -14732 -14724 -14403 -17723 -12190 -12960 -13714 -6128
15263f128M83Q30J999j0355k554N438p00L652L034k184m095p56P022P754L20q24
$$ -6128 -5645 -4815 -2816 -13171 -15725 -10287 -10987 -7335 -4301 -6485 -10580 -11336 -4314 3440 3760 2936
15247B936j918J119n20K964j1K80j87j199k835K892n132j414m017n089P838K510
$$ 2936 1018 2137 1617 4581 4570 4850 4663 3464 629 3521 -1611 -3025 -7042 -12131 -4293 -1783
15231a783R3n685k827m715m168N565M970L805j009K086N225n105m200J323L569
$$ -1783 -1690 -7375 -10202 -14917 -19085 -13520 -8550 -4745 -5754 -3668 1557 -3548 -7748 -6425 -2856
15216b856K095k063J965P066K840o253j0348m910Q03k260J328L563P65O11k202
$$ -2856 -761 -2824 -859 6207 9047 2794 -7554 -12464 -11661 -13921 -12593 -9030 -8265 -7654 -9856
15201i856J404Q295K659N17l241r776p427j872L08M022Q17N735Q571N21j657n993
$$ -9856 -8452 -157 2502 3019 -222 -9998 -17425 -19297 -18989 -14967 -14150 -8415 156 677 -980 -6973
15185f973n11k009j1278J131J935J2017Q409j565q49K092K046m258n405m743k614
$$ -6973 -7484 -9493 -20771 -19640 -17705 -5688 2721 1156 307 2399 4445 187 -5218 -9961 -12575
15170a2575J36J726k792O444R21l97J64M592M537k514k327L690m21o367M64k438
$$ -12575 -12439 -10713 -13505 -7061 -6140 -6537 -6373 -1781 2756 242 -2085 1605 1184 -5183 -4719 -7157
15154g157o007j544N805J354N954N358L714l721o540N292k544K120n329m320j105
$$ -7157 -13164 -14708 -8903 -7549 -1595 3763 7477 3756 -2784 2508 -36 2084 -3245 -7565 -8670
15139h670p81q45k732N184J868j012p00n449j875N171J1776L253L370k33J180
$$ -8670 -9451 -10296 -13028 -7844 -5976 -6988 -7688 -13137 -15012 -9841 1935 5188 8558 8325 9505
15124I505L193l743m156n15m838m009k489L92J354p524k602K760N892O825O83
$$ 9505 12698 8955 4799 4284 -554 -4563 -7052 -6660 -5306 -12830 -15432 -12672 -6780 45 728
15109G28M602L964o485K459k226q700j0425j056R030M662k826j581O172L101o218
$$ 728 5330 9294 2809 5268 3042 -5658 -16083 -17139 -8109 -3447 -6273 -7854 -1682 1419 -4799
15094d799k681k771k702N333K005O277M74m440l913m529P86p58N308N226n072
$$ -4799 -7480 -10251 -12953 -7620 -5615 662 1136 -3304 -7217 -11746 -10960 -11718 -6410 -1184 -6256
15079f256m344P844L062j172r491k716L50J955J0207J4441p304o626o420J503
$$ -6256 -10600 -2756 306 -866 -10357 -13073 -12723 -10768 -561 13880 6576 -50 -6470 -4967
15065d967M307j450L368o91J501M35j657m040k599J897l482k056j188J931R628
$$ -4967 -660 -2110 1258 567 2068 2503 846 -3194 -5793 -3896 -7378 -9434 -10622 -8691 937
15050I37K724N969l834q048K508M172M908K82m256p922o403N581K427n644K305
$$ 937 3661 9630 5796 -2252 256 4428 9336 9618 5362 -2560 -8963 -3382 -955 -6599 -4294
15035d294k66J194J184L878l843L668k808q058o450L557Q892j087m799L238O135
$$ -4294 -4560 -3366 -2182 1696 -2147 1521 -1287 -9345 -15795 -12238 -3346 -4433 -9232 -5994 141
15020A41q727l802j431P013o158l697K26O464L302N0N852K444n910p687J326k161
$$ 141 -8586 -12388 -13819 -6806 -12964 -16661 -16435 -9971 -6669 -6619 -767 1677 -4233 -11920 -10594 -12755
15004a2755K622O14J821K123r69K03J347J934k440l287J779J149n055L382K369
$$ -12755 -10133 -9519 -7698 -5575 -6544 -6341 -4994 -3060 -5500 -8787 -7008 -5859 -10914 -7532 -5163
14989e163Q390J828k987J443Q76L958n15j4330n914J552j138n386m395Q812O633
$$ -5163 3227 5055 2068 3511 4387 8345 7830 -6500 -12414 -10862 -12000 -17386 -21781 -12969 -6336
14974f336n92L474L189k409k343K712L082L163j428m880n638o654m173n1O477
$$ -6336 -6928 -3454 -265 -2674 -5017 -2305 777 3940 2512 -2368 -8006 -14660 -18833 -18884 -12407
14959a2407K790L795L373j724k611j646N870k426l055J214L769J466r43j882k106
$$ -12407 -9617 -5822 -2449 -4173 -6784 -8430 -2560 -4986 -8041 -6827 -3058 -1592 -2535 -4417 -6523
14944f523N13R914k865o809m996j163L213k254k841j66M038l087r79Q350M330
$$ -6523 -6010 3904 1039 -5770 -10766 -11929 -8716 -10970 -13811 -13977 -9939 -13026 -14005 -5655 -1325
14929a325q366n364k272M380R263J57j897K650K628J981r5j257l424K17o835K980
$$ -1325 -9691 -15055 -17327 -12947 -3684 -3527 -5424 -2774 -146 1835 1740 483 -2941 -2724 -9559 -6579
14913f579J0803P026q000n999K496l193J613K133k758k552k279J111K113n574
$$ -6579 4224 11250 3250 -2749 -253 -3446 -1833 300 -2458 -5010 -7289 -6178 -4065 -9639
14899i639O293Q459J079l246m582n864j858j155N014L764J064o70K79k651p19
$$ -9639 -3346 5113 6192 2946 -1636 -7500 -9358 -10513 -5499 -1735 -671 -1341 -1062 -3713 -4432
14884d432N04M191k505m74K535l33N60l33k03L146m719l147k560N19R043j929
$$ -4432 -3928 263 -2242 -2716 -181 -514 46 -287 -490 2656 -2063 -5210 -7770 -7251 1792 -137
14868a37k679l746p176L741O470N059j416m183k822N545N425k264l406n616N298
$$ -137 -2816 -6562 -13738 -9997 -3527 1532 116 -4067 -6889 -1344 4081 1817 -1589 -7205 -1907
14853a907l662m141K510O264M916N25K282l539K406J618k2M407k171m908L339
$$ -1907 -5569 -9710 -7200 -936 3980 4505 6787 3248 5654 7272 7250 11657 9486 4578 7917
14838G917O283j10l206P19M40p861o523J409l145p533N186M239j501L342k953
$$ 7917 14200 14090 10884 11603 12043 4182 -2341 -932 -4077 -11610 -6424 -2185 -3686 -344 -3297
14823c297j584j923j258q31j16j398P732o241K79M079j659k25M898j762L35j347
$$ -3297 -4881 -6804 -8062 -8893 -9009 -10407 -2675 -8916 -8637 -4558 -6217 -6442 -1544 -3306 -2971 -4318
14807d318L725l056M145J269j299k807J754j966k623j428k585l693k601j356L017
$$ -4318 -593 -3649 496 1765 466 -2341 -587 -2553 -5176 -6604 -9189 -12882 -15483 -16839 -13822
14792a3822O188L414p037o870J819N069J211j317p71J071Q565n79q185p36M090
$$ -13822 -7634 -4220 -11257 -18127 -16308 -11239 -10028 -11345 -12116 -11045 -2480 -3059 -11244 -11980 -7890
14777g890m204j519K641o20P11J513N681M886m666j161P714K486q082k818q742
$$ -7890 -12094 -13613 -10972 -11592 -10881 -9368 -3687 1199 -3467 -4628 3086 5572 -2510 -5328 -14070
14762a4070k383M434P151j223n209m737j023P037L326p125o759K960J1514K800
$$ -14070 -16453 -12019 -4868 -6091 -11300 -16037 -17060 -10023 -6697 -13822 -20581 -17621 -6107 -3307
14748c307j938j160N275L722k897n038J226J634J491l754j1333m598M352J0643
$$ -3307 -5245 -6405 -1130 2592 -305 -5343 -4117 -2483 -992 -4746 -16079 -20677 -16325 -5682
14734e682Q043o485r119M894Q47N371M988k032J146J648p315l885q4k070O15j068
$$ -5682 2361 -4124 -13243 -8349 -7502 -2131 2857 825 1971 3619 -3696 -7581 -7665 -9735 -9120 -10188
14718a0188J929L18p457k358L583K524j116l049K869M352L264K503J096k348l453
$$ -10188 -8259 -7941 -15398 -17756 -14173 -11649 -12765 -15814 -12945 -8593 -5329 -2826 -1730 -4078 -7531
14703g531Q421L274l185l441o514K829M918k148J39L77o430k915O664M06N276
$$ -7531 890 4164 979 -2462 -8976 -6147 -1229 -3377 -3238 -2861 -9291 -12206 -5542 -5136 140
14688A40L396J044j863m9j979k544J311N766L13R54l194m96O636k754k844m380
$$ 140 3536 4580 2717 2668 689 -1855 -544 5222 5535 6489 3295 2799 9435 6681 3837 -543
14672e43L869o32M284N931K732n072l460k888l53j232J310l395j06L026q46k308
$$ -543 3326 2694 6978 12909 15641 10569 7109 4221 3868 2636 3946 551 445 3471 2625 317
14656C17n050L416n469k038M880N262k787J411J845m493O473M78r611j4044K846
$$ 317 -4733 -1317 -6786 -8824 -3944 1318 -1469 -58 1787 -2706 3767 4245 -5366 -19410 -16564
14641a6564O036L386J871M173l236J335K004l514Q38Q078l07l406q873n722K107
$$ -16564 -10528 -7142 -5271 -1098 -4334 -2999 -995 -4509 -3671 4407 4100 694 -8179 -13901 -11794
14626a1794n51K894M811j377K058k649J036j49L51Q52j232k090j325n98L629N922
$$ -11794 -12345 -9451 -4640 -6017 -3959 -6608 -5572 -5721 -5370 -4518 -5750 -7840 -9165 -9763 -6134 -212
14610b12o66J794N762k487J432j499j698O684l090l780N86J456J1813J066l788
$$ -212 -878 916 6678 4191 5623 4124 2426 9110 6020 2240 2826 4282 16095 17161 13373
14595A3373l525o272r412q50j854M22P373k924k410P14k116L074L918l915p271
$$ 13373 9848 3576 -5836 -6686 -8540 -8118 -745 -3669 -6079 -5365 -7481 -4407 -489 -4404 -11675
14580a1675L081l00J6J428k534M461J234j660m754j2075j526O574L904K44J2274
$$ -11675 -8594 -8894 -8878 -7450 -9984 -5523 -4289 -5949 -10703 -22778 -24304 -17730 -13826 -13582 -1308
14565a308j433m356m455K858K03l834m783o653O381P263O467J857j657j303O239
$$ -1308 -2741 -7097 -11552 -8694 -8491 -12325 -17108 -23761 -17380 -10117 -3650 -1793 -3450 -4753 1486
14550A486l459l64K399l259K05J41Q71j961k261p548N279N868n510P52K861j502
$$ 1486 -1973 -2337 62 -3197 -2992 -2851 -1980 -3941 -6202 -13750 -8471 -2603 -8113 -7361 -4500 -6002
14534f002J696j540o104K298R080N516l006J393J583n38r564n574M223J279J102
$$ -6002 -4306 -5846 -11950 -9652 -572 4944 1938 3331 4914 4376 -5188 -10762 -6539 -5260 -4158
14519d158N619j058n906M898N080K190o665p582q418k909n168L501J0289P489
$$ -4158 1461 403 -5503 -605 4475 6665 0 -7582 -16000 -18909 -24077 -20576 -10287 -2798
14505b798O96m402j998j517J357M847j083N215M244J99j0066m250K471L054N620
$$ -2798 -2102 -6504 -8502 -10019 -8662 -3815 -4898 317 4561 4760 -5306 -9556 -7085 -4031 1589
14490A589l555o564L023L976j675n687Q333M134p269J496J503K691k601n02p60
$$ 1589 -1966 -8530 -5507 -1531 -3206 -8893 -560 3574 -3695 -2199 -696 1995 -606 -1108 -1868
14475a868K678M123l982q86M50j214m579l081N238q76J859J138l422m65Q962L84
$$ -1868 810 4933 951 65 515 -699 -5278 -8359 -3121 -3997 -2138 -1000 -4422 -4887 4075 4459
14459D459j779o233R9J817j226k48P12L791m09k948N097m21n81J41J15K827l342
$$ 4459 2680 -3553 -3454 -1637 -2863 -3111 -2399 1392 983 -1965 3132 2711 2130 2271 2386 5213 1871
14442A871n836p18J913M890l571L615j53k563j269m081N135P903l170m959J314
$$ 1871 -3965 -4683 -2770 2120 -1451 2164 2011 -552 -1821 -5902 -767 7136 3966 -993 321
14427C21j025J88j240j722p55J0265k207O34O95J168L630J924r154n058j319L797
$$ 321 -704 -516 -1756 -3478 -4233 6032 3825 4459 5154 6322 9952 11876 2722 -2336 -3655 142
14411A42L662L593j183o546P00k74o338n29J821N263k747J675J254M793K954k900
$$ 142 3804 7397 6214 -332 368 94 -6244 -6773 -4952 311 -2436 -761 493 5286 8240 5340
14395E340l197k329j928O038P348K317m218J924j749n566l904l49P3o243O651
$$ 5340 2143 -186 -2114 3924 11272 13589 9371 11295 9546 3980 76 -273 -200 -6443 208
14380B08M514m282n80L006j148n907k508L182n65J456j302J026n206P240M000
$$ 208 4722 440 -140 2866 1718 -4189 -6697 -3515 -4080 -2624 -3926 -2900 -8106 -866 3134
14365C134j578l535N270O827k441o876N827K58m560n839n25l040r30L054M261
$$ 3134 1556 -1979 3291 10118 7677 801 6628 6886 2326 -3513 -4038 -7078 -8008 -4954 -693
14350f93L132l466j902J802q52N748M656J041o024l053p672j808J0084M433j341
$$ -693 2439 -1027 -2929 -1127 -1979 3769 8425 9466 3442 389 -7283 -9091 993 5426 4085
14335D085k189J153m447J102M180m95P095J638r254j169k24j875n681p137Q802
$$ 4085 1896 3049 -1398 -296 3884 3389 10484 12122 2868 1699 1475 -400 -6081 -13218 -4416
14320d416M355O487k702j272j671l591j393J037J865j295j707j11M077N782K80
$$ -4416 -61 6426 3724 2452 781 -2810 -4203 -3166 -1301 -2596 -4303 -4414 -337 5445 5725
14305E725l760k467l855n001J323J163m229M409P963R96j260j413J236k093J859
$$ 5725 1965 -502 -4357 -9358 -8035 -6872 -11101 -6692 1271 2267 1007 -406 830 -1263 596
14290E96M296o119j423o207J790M356L267j647k383J349P948R423l492p223P63
$$ 596 4892 -1227 -2650 -8857 -7067 -2711 556 -1091 -3474 -2125 5823 15246 11754 4531 5294
14275E294k996K778j298l970N74J349O53J848m94M286p64j0867l058k376k87P367
$$ 5294 2298 5076 3778 -192 382 1731 2384 4232 3738 8024 7260 -3607 -6665 -9041 -9328 -1961
14259a961M167N431J973k461j0262K136M612R7n839J611J954l381M73l000m721
$$ -1961 2206 7637 9610 7149 -3113 -977 3635 3732 -2107 -496 1458 -1923 -1450 -4450 -9171
14244i171k620k675K118k012k700J538k769k455M597N152N129k472L38J23m052
$$ -9171 -11791 -14466 -12348 -14360 -17060 -15522 -18291 -20746 -16149 -10997 -5868 -8340 -8002 -7879 -11931
14229a1931m138J672O028K889n032n543K095R457L963K40j332l71P132Q329k430
$$ -11931 -16069 -14397 -8369 -5480 -10512 -16055 -13960 -4503 -540 -300 -1632 -2003 5129 13458 11028
14214A1028J488K929K318q189n193J927p697o38j482j332L049M572k114l549l245
$$ 11028 12516 15445 17763 9574 4381 6308 -1389 -2027 -3509 -4841 -1792 2780 666 -2883 -6128
14199f128p737k039N803N515M197N146P446N19l531J675m736j325m043j478M185
$$ -6128 -13865 -15904 -10101 -4586 -389 4757 12203 12722 9191 10866 6130 4805 762 -716 3469
14184C469o64K709m077N57K658m037l720l283l278o34L528l77K051J747m8K169
$$ 3469 2805 5514 1437 1994 4652 615 -3105 -6388 -9666 -10300 -6772 -7149 -5098 -3351 -3399 -1230
14168a230M71j445K996M035P95P15r338m358L787o140m566J401M176J723N41p38
$$ -1230 -759 -2204 792 4827 5622 6337 -3001 -7359 -3572 -9712 -14278 -12877 -8701 -6978 -6437 -7175
14152g175K921J979l172M640L056o026j865M410l1k899K738j921K86P830l376
$$ -7175 -4254 -2275 -5447 -807 2249 -3777 -5642 -1232 -1263 -4162 -1424 -3345 -3059 4771 1395
14137A395J348J272k259l433m00M276L735P26q055m002j393K722l81k476k18Q750
$$ 1395 2743 4015 1756 -1677 -2077 2199 5934 6660 -1395 -5397 -6790 -4068 -4449 -6925 -7143 1607
14121A607R061n873j268N5k275n926j0211k672L744N918j704J763j155r29Q272
$$ 1607 10668 4795 3527 3582 1307 -4619 -14830 -17502 -13758 -7840 -9544 -7781 -8936 -9865 -1593
14106a593K729l180m328K915n14j556J13l23l8L475O373L824j133k164q5k583
$$ -1593 1136 -2044 -6372 -3457 -3971 -5527 -5414 -5737 -5775 -2300 4073 7897 6764 4600 4515 1932
14090A932L042R352M486l506O42p007m001L188J110j879O5o967o704o775O883
$$ 1932 4974 14326 18812 15306 15948 8941 4940 8128 9238 7359 7424 457 -6247 -13022 -6139
14075f139k135l71R10Q26J071N97K282J625k761N261J926K80p396p674P70L860
$$ -6139 -8274 -8645 -7735 -6909 -5838 -5241 -2959 -1334 -4095 1166 3092 3372 -4024 -11698 -10928 -7068
14059g068m26k371l684P700Q019k754m315k007R769O010o607K376Q8j423J267
$$ -7068 -7494 -9865 -13549 -5849 2170 -584 -4899 -6906 2863 8873 2266 4642 4730 3307 4574
14044D574n802k58n944j737L581P505J028n381j985L150l111L503l170N349M728
$$ 4574 -1228 -1486 -7430 -9167 -5586 1919 2947 -2434 -4419 -1269 -4380 -877 -4047 1302 6030
14029F030M06L463j380o26M223r65l757m390k308n129N44k220N450L379m299j226
$$ 6030 6436 9899 8519 7893 12116 11151 7394 3004 696 -4433 -3889 -6109 -659 2720 -1579 -2805
14013b805O761r2n061p221M27N608O130L073l284m89J159K901L781l977k825l116
$$ -2805 3956 3864 -1197 -8418 -7991 -2383 3747 6820 3536 3047 4206 7107 10888 6911 4086 970
13997I70l772m649J370K824M30K320J191K259k634M961L903P80Q193Q284O40m511
$$ 970 -2802 -7451 -6081 -3257 -2827 -507 684 2943 309 5270 9173 9953 18146 26430 27070 22559
13981B2559J293O245m864m024Q100R375Q821L300M950m255n110k045m889q110
$$ 22559 23852 30097 25233 21209 29309 38684 47505 50805 55755 51500 46390 44345 39456 31346
13967C1346j1747j0791r14m22r130j656L927M56l306L723J675R07N506L366l727
$$ 31346 19599 8808 7894 7472 -1658 -3314 613 1069 -2237 1486 3161 4068 9574 12940 9213
13952I213m59o753l676L68L19J100K736o651k00L256Q03l262j593L405J310O496
$$ 9213 8754 2001 -1675 -1307 -988 112 2848 -3803 -4003 -747 56 -3206 -4799 -1394 -84 6412
13936F412k592l508K599Q36o214m760k362L231L807O595N088l29j426m361o947
$$ 6412 3820 312 2911 3747 -2467 -7227 -9589 -6358 -2551 4044 9132 8803 7377 3016 -3931
13921c931K120M97J826J826k841j313J874M87j147J408k551n790m329j971L150
$$ -3931 -1811 -1314 512 2338 -503 -1816 58 545 -602 806 -1745 -7535 -11864 -13835 -10685
13906a0685M788M445M935K044n997J879M505j401n579q81r01m214j810Q451J965
$$ -10685 -5897 -1452 3483 5527 -470 1409 5914 4513 -1066 -1947 -2848 -7062 -8872 -421 1544
13891A544l187n94p27M209O440K722p706j210R11j869O319P123p49m573l338j0280
$$ 1544 -1643 -2237 -2964 1245 7685 10407 2701 1491 2402 533 6852 13975 13226 8653 5315 -4965
13875d965r459M883Q285mj49l94L715p136l130j113m115J506M785K563L285J958
$$ -4965 -14424 -9541 -1256 -1260 -1409 -1803 1912 -5224 -8354 -9467 -13582 -12076 -7291 -4728 -1443 515
13859E15l826K011J865L036M177l545j009L278j61k226M663K005n81k862R83k263
$$ 515 -3311 -1300 565 3601 7778 4233 3224 6502 6341 4115 8778 10783 10202 7340 8323 6060
13843F060q692p366o526J605j517O286M309p17l934J490N200O851N469q227l548
$$ 6060 -2632 -9998 -16524 -14919 -16436 -10150 -5841 -6558 -10492 -9002 -3802 3049 8518 291 -3257
13828c257L135L953l105k695R63Q5L023M15m521j356Q396L483j851K173N738K11
$$ -3257 -122 3831 726 -1969 -1006 -921 2102 2517 -2004 -3360 5036 8519 6668 8841 14579 14790
13812A4790m350j4129r176M885J4506K896k931k236O50m257j900J89K534L504
$$ 14790 10440 -3689 -12865 -7980 6526 9422 6491 4255 4905 648 -1252 -1063 1471 4975
13798D975k557p96K074j665k534M54J283M26K321k676J432P58L541l89J821m31
$$ 4975 2418 1622 3696 2031 -503 -49 1234 1660 3981 1305 2737 3495 7036 6647 8468 8037
13782H037m18j552K183K216N78L11k697k051k393P44N144K619N55j9l215o1K630
$$ 8037 7619 6067 8250 10466 11044 11355 8658 6607 4214 4958 10102 12721 13276 13257 10042 9981 12611
13765A2611m404m082j022l749P532Q968J02j0019k177L005Q82N90k023o600L056
$$ 12611 8207 4125 3103 -646 6886 15854 15956 5937 3760 6765 7647 8237 6214 -386 2670
13750B670K383n82j409P367M51L65M33m274R2l200L866L298j13k675l817N178
$$ 2670 5053 4471 3062 10429 10880 11245 11678 7404 7496 4296 8162 11460 11347 8672 4855 10033
13734A0033l577K697l974r61L482n491k767R13N227O621j917k731q60P24J8n856
$$ 10033 6456 9153 5179 4218 7700 2209 -558 355 5582 12203 10286 7555 6695 7419 7437 1581
13718A581K707M966J611L260l821j196M124K465n265n347J512J575j696p434O12
$$ 1581 4288 9254 10865 14125 10304 9108 13232 15697 10432 5085 6597 8172 6476 -958 -346
13703c46n23m854j075L74N838o229k265N688J3667k739m564P793J407l063o430
$$ -346 -869 -5723 -6798 -6424 -586 -6815 -9080 -3392 10275 7536 2972 10765 12172 9109 2679
13688B679n022l017L971K174N889n476j893j444J06L162J807J914J937L063l677
$$ 2679 -2343 -5360 -1389 785 6674 1198 -695 -2139 -2033 1129 2936 4850 6787 9850 6173
13673F173M0l164o163n58Q1J115R851j007l939o464q742m026k56K000Q929J614
$$ 6173 6213 3049 -3114 -3672 -3591 -2476 7375 6368 2429 -4035 -12777 -16803 -17059 -15059 -6130 -4516
13657d516M771Q57L153N049M348k401o676l861O40M193L910N91J749M488J845
$$ -4516 255 1112 4265 9314 13662 11261 4585 724 1364 5557 9467 10058 11807 16295 18140
13642A8140k613m910m996O314N574q455j583M903M098l012J208K330n019j410
$$ 18140 15527 10617 5621 11935 17509 9054 7471 12374 16472 13460 14668 16998 11979 10569
13628A0569l937O450q80m112j946k138k841l21j714K244l855L660O108j314M351
$$ 10569 6632 13082 12202 8090 6144 4006 1165 844 -870 1374 -2481 1179 7287 5973 10324
13613A0324n11J114O03n329k18M407L913p396L76P930m688j950n254l494J623
$$ 10324 9813 10927 11530 6201 5983 10390 14303 6907 7283 15213 10525 8575 3321 -173 1450
13598A450O331O559r96q412m839K698J550L891K735o512l169m70Q13K804l640
$$ 1450 7781 14340 13344 4932 93 2791 4341 8232 10967 4455 1286 816 1629 4433 793
13583G93L441n482p835N047O437r63J9Q496M714o030O076o34q95j33J072q656
$$ 793 4234 -1248 -9083 -4036 2401 1438 1457 9953 14667 8637 14713 14079 13184 13051 14123 5467
13567E467o481l026k63Q266P853K56r03k837m34J995M831L675m627o474Q34O233
$$ 5467 -1014 -4040 -4303 3963 11816 12072 11169 8332 7898 9893 14724 18399 13772 7298 8132 14365
13551A4365k253j0134R43P470Q72q326L679N10K877p426k663P80Q86j683M616
$$ 14365 12112 1978 2921 10391 11263 2937 6616 7126 10003 2577 -86 694 1580 -103 4513
13536D513l002j627M953j156N392j466O163K056L829q073m472K698J0534N007
$$ 4513 1511 -116 4837 3681 9073 7607 13770 15826 19655 11582 7110 9808 20342 25349
13522B5349n570q101j0145K724P619j326l802o317K884R485J446n881M263K367
$$ 25349 19779 11678 1533 4257 11876 10550 6748 431 3315 12800 14246 8365 12628 14995
13508A4995j315m308n920J686J2600j585n232l78K969N6k537m005q334N905M343
$$ 14995 13680 9372 3452 5138 17738 16153 10921 10543 13512 13568 11031 7026 -1308 4597 8940
13493H940j636Q49J361J825J342K710n232j621k843N243N840j0344p424L129J869
$$ 8940 7304 8153 9514 11339 12681 15391 10159 8538 5695 10938 16778 6434 -990 2139 4008
13478D008J874K92m796M27K656k94l108O57Q01M648M64m20N06J977M758k041m713
$$ 4008 5882 6174 1378 1805 4461 4167 1059 1716 2517 7165 7629 7209 7715 9692 14450 12409 7696
13461G696m176J007K537j007K760j699l940l666J060p095N457P325p62M405R411
$$ 7696 3520 4527 7064 6057 8817 7118 3178 -488 572 -6523 -1066 6259 5497 9902 19313
13446A9313K523m873n348K540L141l134J191M552J061J512k418j749l574o518
$$ 19313 21836 16963 11615 14155 17296 14162 15353 19905 20966 22478 20060 18311 14737 8219
13432H219O544L362j235l082k716n210r93m736J34M659j538j289j494L404m259
$$ 8219 14763 18125 16890 13808 11092 5882 4889 153 287 4946 3408 2119 625 4029 -230
13417b30J476m86M506L966j612k363q80K993L530j20P071p85j803J713K756K261
$$ -230 1246 760 5266 9232 7620 5257 4377 7370 10900 10780 17851 17066 15263 16976 19732 21993
13401B1993n17o734q36k836l884k188J693N534j721r18n496L52L562N297J753
$$ 21993 21476 14742 13906 11070 7186 4998 6691 12225 10504 9586 4090 4442 8004 13301 15054
13386A5054j597R37m163p803J163M548L785J0961j199m233O216r92m621m537j306
$$ 15054 13457 14394 10231 2428 3591 8139 11924 22885 21686 17453 23669 22677 18056 13519 12213
13371A2213j435M23M410P594o68o66p964j0349o095j684Q799L660J539l394k657
$$ 12213 10778 11201 15611 23205 22537 21871 13907 3558 -2537 -4221 4578 8238 9777 6383 3726
13356C726L571K196J526J619q022O49j921L659P598j861J518R181j53j1509q59
$$ 3726 7297 9493 11019 12638 4616 5265 3344 7003 14601 12740 14258 23439 23286 11777 10918
13341A0918j314K559J283j815P28J438l421K412Q538j946m557K245k181j111j299
$$ 10918 9604 12163 13446 11631 12359 13797 10376 12788 21326 19380 14823 17068 14887 13776 12477
13326A2477m852Q47J571L17O67j820J244N02k492j258k381K891O874m176j128
$$ 12477 7625 8472 10043 10360 11027 9207 10451 10953 8461 7203 4822 7713 14587 10411 9283
13311I283M0L12k837k555K724O835j359j776J905k634O964K916k635j061m866
$$ 9283 9323 9635 6798 4243 6967 13802 12443 10667 12572 9938 16902 19818 17183 16122 11256
13296A1256o642R7P660L460M486M872k542l625J367q633o95L856o97P00j88O742
$$ 11256 4614 4711 12371 15831 20317 25189 22647 19022 20389 11756 11061 14917 14220 14920 14732 21474
13280B1474j383m442k104P54j250j908l891k559L303q31k197k057P4l257o92L958
$$ 21474 20091 15649 13545 14299 13049 11141 7250 4691 7994 7163 4966 2909 2983 -274 -966 2992
13264B992J136j747N435L223k743J481l902p861N724L593m625n4J0484L797J333
$$ 2992 4128 2381 7816 11039 8296 9777 5875 -1986 3738 7331 2706 2652 13136 16933 18266
13249A8266m30L682j104p092n66M433M359J706j150p984l06J548K476j492p90
$$ 18266 17836 21518 20414 13322 12756 17189 21548 23254 22104 14120 13814 15362 17838 16346 15556
13234A5556J756l527l276N774j027J924M883K941k46m598M02n388r027J854R311
$$ 15556 17312 13785 10509 16283 15256 17180 22063 25004 24758 20160 20562 15174 6147 8001 17312
13219A7312K206j792L380J475l118R49R45J82m954j691K304J342p13M607j437
$$ 17312 19518 17726 21106 22581 19463 20412 21357 21539 16585 14894 17198 18540 17827 22434 20997
13204B0997N29j160P562L175j571m377n978j01k567k267K589p53Q567L074l787
$$ 20997 21526 20366 27928 31103 29532 25155 19177 19076 16509 14242 16831 16078 24645 27719 23932
13189B3932o838j546L04K921m534N785L765m266K807l242L24L379L748k053O121
$$ 23932 17094 15548 15852 18773 14239 20024 23789 19523 22330 19088 19412 22791 26539 24486 30607
13174C0607N186m172m242n257R33j283n2Q97N834l40L182N88M855P91p021m454
$$ 30607 35793 31621 27379 22122 23055 21772 21720 22617 28451 28111 31293 31881 36736 37527 30506 26052
13158B6052N517m560K411O290J125M535l864p140l728n199Q12j054P645r70N23
$$ 26052 31569 27009 29420 35710 36835 41370 37506 30366 26638 21439 22251 21197 28842 27872 28395
13143B8395J025p06k301k598j987L064m608M31O153j694m612L303J695k341J225
$$ 28395 29420 28714 26413 23815 21828 24892 20284 20715 26868 25174 20562 23865 25560 23219 24444
13128B4444L207M996o32j100O321N756k779o527J445L380j452n1j279K138L761
$$ 24444 27651 32647 32015 30915 37236 42992 40213 33686 35131 38511 37059 37008 35729 37867 41628
13113D1628n512o352l414n457j886k999L189P726O865M835j943J105j151K161
$$ 41628 36116 29764 26350 20893 19007 16008 19197 26923 33788 38623 36680 37785 36634 38795
13099C8795P784m440n365k209p160N144O013J561l320K855l366l66R548o41R439
$$ 38795 46579 42139 36774 34565 27405 32549 38562 40123 36803 39658 36292 35926 45474 44833 54272
13084E4272K681n528l416k099j646K295m122n535k538k600o011k842J611M711
$$ 54272 56953 51425 48009 45910 44264 46559 42437 36902 34364 31764 25753 22911 24522 29233
13070B9233K426K632j41J725Q39l365K872L215k553p185n304M429R097p37j630
$$ 29233 31659 34291 34150 35875 36714 33349 36221 39436 36883 29698 24394 28823 37920 37183 35553
13055C5553J336P082J4489J0436J1841J5536J2944J5098L6119L6438N2840Q6353
$$ 35553 36889 43971 58460 68896 80737 96273 109217 124315 160434 196872 249712 336065
13043C36065J09199J32317J39989J27644R7856M9099j1856p0794j15130j44415
$$ 336065 445264 577581 717570 845214 943070 992169 980313 909519 794389 649974
13033F49974j40648j17810r1960o2823l8335l1892k2667j5329p970n489o714q160
$$ 649974 509326 391516 299556 236733 198398 166506 143839 128510 120540 115051 108337 100177
13021A00177q103l673j0626m247j369L66o098n043j848n475k076L24k270p661
$$ 100177 92074 88401 77775 73528 72159 72525 66427 61384 59536 54061 51985 52309 50039 42378
13007D2378m78K520%j737l778O65N155n044L501J228j977N301J277L346m162J974
$$ 42378 41900 44420 44420 42683 38905 39570 44725 39681 43182 44410 42433 47734 49011 52357 48195 50169
12991E0169N196R4r923r069K403O51N872l261l027j844n585k122p64M348O34J920
$$ 50169 55365 55459 45536 36467 38870 39521 45393 42132 39105 37261 31676 29554 28790 33138 33772 35692
12975C5692o03K068m852N07M369j534M34o00k317Q669M395M589o811r905o949
$$ 35692 35089 37157 32305 32812 37181 35647 36081 35481 33164 41833 46228 50817 44006 34101 27152
12960B7152P178M376R38J0588j047k28m06j360o129j0102J680P836k306j922j933
$$ 27152 34330 38706 39644 50232 49185 48957 48551 47191 41062 30960 32640 40476 38170 36248 34315
12945C4315m96J358N070M352M88Q013J0713K49o080l48N228M945j450o358k06
$$ 34315 33819 35177 40247 44599 45087 53100 63813 64062 57982 57634 62862 67807 66357 59999 59793
12930E9793J66M367N340k471k803j2734q560k536q14m537q800O58K726J618J223
$$ 59793 59959 64326 69666 67195 64392 51658 43098 40562 39748 35211 26411 27069 29795 31413 32636
12915C2636O83L843L767m722n57P212j161o09J658O750k939N500P11n694N69K66
$$ 32636 33319 37162 40929 36207 35650 42862 41701 41092 42750 49500 46561 52061 52772 47078 47647 47913
12899D7913N26K260M744J420j212M36J048k891q81q99j478k513O012J097K178
$$ 47913 48439 50699 55443 56863 55651 56087 57135 54244 53363 52464 50986 48473 54485 55582 57760
12884E7760Q716J2017P238J0010J5890R612P801J6336J7199P484Q558K2069J7676
$$ 57760 66476 78493 85731 95741 111631 121243 129044 145380 162579 170063 178621 200690 218366
12871B18366J5586J1854Q735N652r497j8696k9075k8410j5618r759n201j4423
$$ 218366 233952 245806 254541 260193 250696 232000 202925 174515 158897 149138 143937 129514
12859A29514j1741n334j3990L050M434l347r516r139K511K306r674o525M458K867
$$ 129514 117773 112439 98449 101499 105933 102586 93070 83931 86442 88748 79074 72549 77007 79874
12845G9874L95J299J264M525l005o334l059n117o358Q57m786o01K207K614Q08
$$ 79874 80269 81568 82832 87357 84352 78018 74959 69842 63484 64341 59555 58954 61161 63775 64583
12830F4583m506L335O101K003J853k488n360m59K277P796j471K441R63M199Q700
$$ 64583 60077 63412 69513 71516 73369 70881 65521 65062 67339 75135 73664 76105 77068 81267 89967
12815H9967K901K066l607r527r006j4539j9023k3290k7149l5609l0618k2276k3036
$$ 89967 92868 94934 91327 81800 72794 58255 39232 15942 -11207 -46816 -77434 -99710 -122746
12802a22746j0165K971J7792L1436L1598L3352L5241K7924K0862J3729J1735J5647
$$ -122746 -132911 -129940 -112148 -80712 -49114 -15762 19479 47403 68265 81994 93729 109376
12790A09376J1530P489l799j745l717l737k762J095R220L013O21K898R043Q548
$$ 109376 120906 128395 124596 122851 119134 115397 112635 113730 122950 125963 126584 129482 138525 147073
12776A47073N911R658J1785J3199P653N665m898j6583j3630l254L752J0492J2107
$$ 147073 152984 162642 174427 187626 195279 200944 196046 179463 165833 162579 166331 176823 188930
12763A88930N058K195n121l887L05N706M319J700j77J204m23J999N9J0398J3940
$$ 188930 193988 196183 191062 187175 187480 193186 197505 199205 199028 200232 199809 201808 201867 212265 226205
12748B26205J6027K7289L0183L3262K4842J1321M545q196k1625l0308l0080k1940
$$ 226205 242232 269521 299704 332966 357808 369129 373674 365478 343853 313545 283465 261525
12736B61525k0769j0495m654n999p717M750J625Q232J1721R458N226M375K587
$$ 261525 240756 230261 225607 219608 211891 216641 218266 226498 238219 247677 252903 257278 259865
12723B59865P68O805R195l480j3095j435P058M991O749P419J0729Q532N397P880
$$ 259865 260633 267438 276633 273153 260058 258623 265681 270672 277421 284840 295569 304101 309498 317378
12709C17378N427J2630J7568P670Q911R925O819P846P128J4429J1246N353N275
$$ 317378 322805 335435 353003 360673 369584 379509 386328 394174 401302 415731 426977 432330 437605
12696D37605J4760J2339K0625Q342J0801K8401L3855N6132P6651J00802J28005
$$ 437605 452365 464704 485329 493671 504472 532873 566728 622860 699511 800313 928318
12685I28318J64995J88944J97756J71677J29418N9347n410p4287j31119j55880
$$ 928318 1093313 1282257 1480013 1651690 1781108 1840455 1835045 1760758 1629639 1473759
12675A473759j56973j38783j10423q6078n4484l3994n909N359J9785L0620L5106
$$ 1473759 1316786 1178003 1067580 981502 927018 893024 887115 892474 912259 942879 977985
12664I77985L9429M3533M3429M8805N2697M9250M6757N9479N8376O1577P6800
$$ 977985 1017414 1060947 1104376 1153181 1205878 1255128 1301885 1361364 1419740 1481317 1558117
12653A558117P3738P8648Q8367R1035J05671J21439J30024J43382J53385J65515
$$ 1558117 1631855 1710503 1798870 1889905 1995576 2117015 2247039 2390421 2543806 2709321
12643B709321J89304K13222K36175K68475L13300L71158M46154N39541O46493
$$ 2709321 2898625 3111847 3348022 3616497 3929797 4300955 4747109 5286650 5933143
12634E933143P47784Q49855R40972J039191J168782J362594J668552K158762K933253
$$ 5933143 6680927 7530782 8471754 9510945 10679727 12042321 13710873 15869635 18802888
12625A8802888M164325O122230R073598J3095145J7748320K2150118K5124637
$$ 18802888 22967213 29089443 38163041 51258186 69006506 91156624 116281261
12618A16281261K5166119K1074830J3271979K868631p971038j7101466k3571872
$$ 116281261 141447380 162522210 175794189 178662820 170691782 153590316 130018444
12611A30018444k6424760k5207586k1022915j5329898j0119475o527903m345851
$$ 130018444 103593684 78386098 57363183 42033285 31913810 25385907 21040056
12604B1040056l021332k190558j670329j324404j119273j008100r35802r08001
$$ 21040056 18018724 15828166 14157837 12833433 11714160 10706060 9770258 8862257
12596H862257q62198q06405p26296o21824n11334m16840l48092k96573k51949
$$ 8862257 8000059 7193654 6467358 5845534 5334200 4917360 4569268 4272695 4020746
12587D020746k07937j95390j84703j71155j55378j38174j39987j32113j22253
$$ 4020746 3812809 3617419 3432716 3261561 3106183 2968009 2828022 2695909 2573656
12578B573656j18529j03345r3118q8454q1454q0519p5826o9635p1219o7495n2779
$$ 2573656 2455127 2351782 2258664 2170210 2088756 2008237 1932411 1862776 1791557 1724062 1671283
12567A671283n2013n6521n4008m4827m0466m6328m9737n2421n7110n0119m9414
$$ 1671283 1619270 1562749 1508741 1463914 1423448 1377120 1327383 1274962 1217852 1167733 1118319
12556A118319l7490l6920l2721k3299k3017k1972k3006k1922k8968l0976j8054
$$ 1118319 1080829 1043909 1011188 987889 964872 942900 919894 897972 869004 838028 819974
12545H19974k2654j9467k9447k6040k0410k0786k2766k4318l2404l0680j4124
$$ 819974 797320 777853 748406 722366 701956 681170 658404 634086 601682 571002 556878
12534E56878j4869j6047k1737j9841j4459j3260p522j0354j3125r031p414p582
$$ 556878 542009 525962 504225 484384 469925 456665 449143 438789 425664 416633 409219 401637
12522D01637j5790o422K605j0601j0727n222j1073j0170p561j0304j5088p731
$$ 401637 385847 379425 382030 371429 360702 355480 344407 334237 326676 316372 301284 293553
12510B93553j4892o956q611r087r680k395O646M235N720M065P41J630L502P934
$$ 293553 278661 271705 263094 254007 244327 241932 248578 252813 258533 262598 263339 264969 268471 276405
12496B76405J3397O099J2383J0333Q736J1388P447m474l478j5076k1285k7195
$$ 276405 289802 295901 308284 318617 327353 338741 346188 341714 338236 323160 301875 274680
12484B74680l3212k7064k3997j1536j2164m969K314r702j1453r426q638n177q419
$$ 274680 241468 214404 190407 178871 166707 161738 164052 154350 142897 133471 124833 119656 111237
12471A11237p574k229N123l82q826l043K919l475K708J762o108O81K214m013M776
$$ 111237 103663 101434 106557 106175 97349 94306 97225 93750 96458 98220 92112 92793 95007 90994 95770
12456I5770o867p902l0m650N80p26J267n907l742m252m158R833Q315P52M83J851
$$ 95770 88903 81001 80971 76321 76901 76175 77442 71535 67793 63541 59383 69216 77531 78283 78766 80617
12440H0617p37R452Q221J4517J6613K0317K3244K6305L2346K9436K2920J0026
$$ 80617 79880 89332 97553 112070 128683 149000 172244 198549 230895 260331 283251 293277
12428B93277J33j9770l3509l9169m2865l3203k3083k2643o721n833m690k742p613
$$ 293277 293410 273640 240131 200962 158097 124894 101811 79168 72447 66614 61924 59182 51569
12415E1569n766J0475L399j653o168M061N186P067k610l326p306m446l42N278
$$ 51569 45803 56278 59677 58024 51856 55917 61103 68170 65560 62234 54928 50482 50140 55418
12401E5418J586k620r019Q92Q667M27K691m368j1226l179p872o115j0855m814
$$ 55418 57004 54384 45365 46257 54924 55351 58042 53674 42448 39269 31397 25282 14427 9613
12387I613p57L1J441J548O524j558q32n558n009N91R82M874k871p112J899L940
$$ 9613 8856 8887 10328 11876 18400 16842 16010 10452 5443 6034 7016 11890 9019 1907 3806 7746
12371G746N075R560L334L879Q940R105O079L748L605M285L68L94J3641K3642J5045
$$ 7746 12821 22381 25715 29594 38534 47639 53718 57466 61071 65356 65724 66118 79759 103401 118446
12356A18446P165Q75j1428j9102k4815p978m974l280k652j6953r349k825n189
$$ 118446 125611 126486 115058 95956 71141 63163 58189 54909 52257 35304 25955 23130 17941
12343A7941k040K234j244k945R31N175N745k325K16j0951k263k527J843N197l296
$$ 17941 15901 18135 16891 13946 14877 20052 25797 23472 23688 12737 10474 7947 9790 14987 11691
12328A1691L851O468J622J540K762L376J038k712l213k578n853O674O295P227
$$ 11691 15542 22010 23632 25172 27934 31310 32348 29636 26423 23845 17992 24666 30961 38188
12314C8188P255K262j495L574K512n389r316K041M91j0802j921M376j020J460
$$ 38188 45443 47705 46210 49784 52296 46907 37591 39632 40123 29321 27400 31776 30756 32216
12300C2216L895R344Q804J2158K1287K2383L3403M3396N0719M7799M7367M3695
$$ 32216 36111 45455 54259 66417 87704 110087 143490 186886 237605 285404 332771 376466
12288C76466L8244K7753N397k1601k7345l6540m3283m9855n0872m3810l3948k8257
$$ 376466 414710 442463 447860 426259 398914 362374 319091 269236 218364 174554 140606 112349
12276A12349j6288j4973j6612k433p968l465j913j388m729k480o309l455J228
$$ 112349 96061 81088 64476 62043 54075 50610 48697 47309 42580 40100 33791 30336 31564
12263C1564J342j773p559J103R56J485K15K047k121M623K89n912n91J243O72j839
$$ 31564 32906 31133 23574 24677 25633 27118 27333 29380 27259 31882 32171 26259 25668 26911 27583 25744
12247B5744o673J262O314k154K720O051q48j508j202j168J74M541J714J0338J768
$$ 25744 19071 20333 26647 24493 27213 33264 32416 30908 29706 28538 28712 33253 34967 45305 47073
12232D7073l733L957J1275O983L7r012m878n197n889q6l175m671P16K486j116
$$ 47073 43340 47297 58572 65555 65592 56580 51702 46505 40616 40530 37355 32684 33400 35886 34770
12217C4770L560L100O469N040k41m08L240K750j442J4712Q834Q720O331R374N580
$$ 34770 38330 41430 47899 52939 52698 52290 55530 58280 56838 71550 80384 89104 95435 104809 110389
12202A10389j57R357J1844J0772J8438K8725L5595M4395O9266Q9533J04435J27489
$$ 110389 110232 119589 131433 142205 160643 189368 224963 269358 338624 428157 532592 660081
12190F60081J37758J28769J05682M6274j4004o0764j08067j39443j36770j21962
$$ 660081 797839 926608 1032290 1078564 1064560 1003796 895729 756286 619516 497554
12180D97554r4694n7237l4793j7425j233N351J3256J8784K7521L3076K7423K8651
$$ 497554 402860 345623 310830 293405 292172 297523 310779 329563 357084 390160 417583 446234
12168D46234L8717M8091O1517P7375J01451J60755K41764L41458M53879O07770
$$ 446234 484951 533042 594559 671934 773385 934140 1175904 1517362 1971241 2579011
12158B579011P35754Q03598Q09444P00503M71028J69945j72132m79176p13728
$$ 2579011 3314765 4118363 4927807 5628310 6099338 6269283 6097151 5617975 4904247
12149D904247q36650q25374p47026o13064m54556l16917k16510j46155j01432
$$ 4904247 4067597 3242223 2495197 1882133 1427577 1110660 894150 747995 646563
12140F46563p1496o0878m8694m9190l9932l2764k9853k8516l2130k1032j7064
$$ 646563 575067 514189 465495 416305 376373 343609 313756 285240 253110 232078 215014
12129B15014j8712j5766j7126j6196m786q485q262j4185l429J19l705p291q945
$$ 215014 196302 180536 163410 147214 142428 133943 125681 111496 108067 108186 104481 97190 88245
12116H8245N148K64j0999l925M192L269k196j0009p929k340j445L124o353L86
$$ 88245 93393 93657 82658 78733 82925 86194 83998 73989 66060 63720 62275 65399 59046 59432
12102E9432K054j947l036l696L698K139k679m28m766j2904o915N94P079P028l873
$$ 59432 61486 59539 56503 52807 56505 58644 55965 55537 50771 37867 30952 31546 38625 45653 41780
12087D1780p291j396j131k401N68l504k882m476l763k888K934P598o79l982k468
$$ 41780 34489 33093 31962 29561 30129 26625 23743 19267 15504 12616 15550 23148 22469 18487 16019
12072A6019K165k945m711K110k609k887n88L576L03k839O752j878k454J089L700
$$ 16019 18184 15239 10528 12638 10029 7142 6554 10130 10433 7594 14346 12468 10014 11103 14803
12057A4803L612l67m120m530O89m90M442J464k522O976K915q085m665m791p895
$$ 14803 18415 18048 13928 9398 10087 9597 14039 15503 12981 19957 22872 14787 10122 5331 -2564
12042b564o055N879J1047K569j959j469n623l430k04L274N478L321J136l088J0
$$ -2564 -8619 -2740 8307 10876 8917 7448 1825 -1605 -1809 1465 6943 10264 11400 8312 8322
12027H322L965J240l044j516N583J0138L012J48k405n539l721k017n436l604o938
$$ 8322 12287 13527 10483 8967 14550 24688 27700 27848 25443 19904 16183 14166 8730 5126 -1812
12012a812o260j107L217J0677J1805L042j0386j1336k809N56L994M043j735j358
$$ -1812 -8072 -9179 -5962 4715 16520 19562 9176 -2160 -4969 -4413 -419 3624 1889 531
11998E31m01J460R397K449k129J816r6n172k156J970M133j64n726m22K456L694
$$ 531 130 1590 10987 13436 11307 13123 13027 7855 5699 7669 11802 11638 5912 5490 7946 11640
11982A1640l885q373n076J064K060J104R751N770J897O911J293o748q600M8N536
$$ 11640 7755 -618 -5694 -4630 -2570 -1466 8285 14055 15952 22863 24156 17408 8808 8856 14392
11967A4392P9m235Q1m768M102Q611k864m366l998k620L614J935L236r90q53K068
$$ 14392 14471 10236 10317 5549 9651 18262 15398 11032 7034 4414 8028 9963 13199 12209 11356 13424
11951A3424L879J786O600L298n200l728p516k649l593l43J934P30J0797O505p998
$$ 13424 17303 19089 25689 28987 23787 20059 12543 9894 6301 5958 7892 8622 19419 25924 17926
11936A7926M27k89L356L124L015m82m446l455j985l400L99q5p963q10K461q15
$$ 17926 18353 18064 21420 24544 27559 27077 22631 19176 17191 13791 14190 14105 6142 5332 7793 6978
11920F978J816j309K080r08L555l276J279L146J943K482J192M28N689K693P131
$$ 6978 8794 7485 9565 8657 12212 8936 10215 13361 15304 17786 18978 19406 25095 27788 34919
11905C4919l921j003M2J268o738j1936j667L579m007K46J700K036p60q004P908
$$ 34919 30998 29995 30037 31305 24567 12631 10964 14543 10536 10782 12482 14518 13758 5754 13662
11890A3662J323j139K511K675K25k003n341m07J398M813N326q054p942p60M688
$$ 13662 14985 13846 16357 19032 19257 17254 11913 11506 12904 17717 23043 14989 7047 6287 10975
11875A0975p56o26p99P69J128M06K902K526Q33K8L23m163o566m200N514J342O392
$$ 10975 10219 9593 8794 9563 10691 11097 13999 16525 17358 17386 17709 13546 6980 2780 8294 9636 16028
11858A6028J627n446k479k684K013M769n81L218P216r099k014K893n510m648n2
$$ 16028 17655 12209 9730 7046 9059 13828 13247 16465 23681 14582 12568 15461 9951 5303 5251
11843E251n05l997q099m364N553J847K007o9k671O654K541k730m840M269L854
$$ 5251 4746 749 -7350 -11714 -6161 -4314 -2307 -2376 -5047 1607 4148 1418 -3422 847 4701
11828D701J103m430m765k441R213K992k430l65R95j88L84m311O20M737N045K678
$$ 4701 5804 1374 -3391 -5832 3381 6373 3943 3578 4573 4385 4769 458 1078 5815 10860 13538
11812A3538k207n035n948J01M296M745j428J418K408j650n029q465l5L109K491
$$ 13538 11331 6296 348 449 4745 9490 8062 9480 11888 10238 5209 -3256 -3291 -182 2309
11797B309J0096l945J183O828J36l686j0591p340M55L256M052N24K852K278j138
$$ 2309 12405 8460 9643 16471 16607 12921 2330 -5010 -4555 -1299 2753 3277 6129 8407 7269
11782G269n145M872l131J982J181K514J138j289Q78l52l67n569j0285n278J088
$$ 7269 2124 6996 3865 5847 7028 9542 10680 9391 10269 9917 9550 3981 -6304 -11582 -10494
11767a0494K551M011O20J980J1748O086k078J311n374r129K762L147k885k671
$$ -10494 -7943 -3932 -3312 -1332 10416 16502 14424 15735 10361 1232 3994 7141 4256 1585
11753A585M163R414J027m298q05l412o830J716J130J98L685m578m1K534L994P875
$$ 1585 5748 15162 16189 11891 11086 7674 844 2560 3690 3888 7573 2995 2954 5488 9482 17357
11737A7357K319Q52l768j569O860Q535M627R82N14K18J111j878p231j481n933
$$ 17357 19676 20528 16760 15191 22051 30586 35213 36195 36709 36927 38038 36160 28929 27448 21515
11722B1515N89n029p690q412o902l736K635Q279N947K794K133l903N70J455m378
$$ 21515 22104 17075 9385 973 -5929 -9665 -7030 1249 7196 9990 12123 8220 8790 10245 5867
11707E867K802J549K111o58q288P118j030m531m431k970O19J0735m421k944L531
$$ 5867 8669 10218 12329 11671 3383 10501 9471 4940 509 -2461 -1842 8893 4472 1528 5059
11692E059M838n045p038k478O08L349M51k38j962l229J1281J0722p331k607J976
$$ 5059 9897 4852 -2186 -4664 -4056 -707 -256 -494 -2456 -5685 5596 16318 8987 6380 8356
11677H356m602j430k115J404Q924J253L88k215q475o667k665P158Q875K052k292
$$ 8356 3754 2324 209 1613 10537 11790 12178 9963 1488 -5179 -7844 -686 8189 10241 7949
11662G949J457n144k519m59m38j155N188P122J756m37l468j387l757k464J724
$$ 7949 9406 4262 1743 1284 846 -309 4879 12001 13757 13320 9852 8465 4708 2244 3968
11647C968m966O48K745Q38K727o454J546j542l899N911P186J842p04L246J408
$$ 3968 -998 -350 2395 3233 5960 -494 1052 -490 -4389 1522 8708 10550 9846 13092 14500
11632A4500n82q59n108K745j611l728j301k919M627R787q67j0123J721L29p07
$$ 14500 13918 13059 7951 10696 9085 5357 4056 1137 5764 15551 14684 4561 6282 6611 5904
11617E904k122l966P397N828j266O238N568o962r031o668l427o137k57R526M197
$$ 5904 3782 -184 7213 13041 11775 18013 23581 16619 7588 920 -2507 -8644 -8901 625 4822
11602D822j830Q602R62K418n718n275M363M739O217N562j604L474J739o161m038
$$ 4822 2992 11594 12556 14974 9256 3981 8344 13083 19300 24862 23258 26732 28471 22310 18272
11587A8272k465o347k341K355L65j331j365j011O959M58r59P33p66l083j192j263
$$ 18272 15807 9460 7119 9474 9839 8508 7143 6132 13091 13549 12590 13323 12557 9474 8282 7019
11571G019j888L543m518M650M754m560J444M250j403K298q052l711O850M763j270
$$ 7019 5131 8674 4156 8806 13560 9000 10444 14694 13291 15589 7537 3826 10676 15439 14169
11556A4169k419R16N655L534j430k666l722o459L064N098M910m614M826N83l770
$$ 14169 11750 12666 18321 21855 20425 17759 14037 7578 10642 15740 20650 16036 20862 21445 17675
11541A7675m268N084L806L413M473n515l750j373n576m401p596m331L101N592
$$ 17675 13407 18491 22297 25710 30183 24668 20918 19545 13969 9568 1972 -2359 742 6334
11527F334Q276N91n710K735M726N719L77n550k615O11n709l123L148K447n87n59
$$ 6334 14610 15201 9491 12226 16952 22671 23048 17498 14883 15494 9785 6662 9810 12257 11670 11111
11511A1111K671k426K889L50L208O91m916q300j729K304J367j074l037J522J003
$$ 11111 13782 11356 14245 14595 17803 18494 13578 5278 3549 5853 7220 6146 3109 4631 5634
11496E634o47j901m604j019K941J1761J841m171N868J751l300n0K554J368J448
$$ 5634 4987 3086 -1518 -2537 404 12165 14006 9835 15703 17454 14154 14104 16658 18026 19474
11481A9474J78l798j703L373Q417M194k321j0113j3365j0223P879N740o60L195
$$ 19474 19652 15854 14151 17524 25941 30135 27814 17701 4336 -5887 1992 7732 7072 10267
11467A0267k15o505k051k558L672Q622L42J704L363M860L14m954m938O236M963
$$ 10267 10052 3547 1496 -1062 2610 11232 11574 13278 16641 21501 21815 16861 11923 18159 23122
11452B3122n597j603L111L24k213J673j801j0879n422M715k8K235P187M635K618
$$ 23122 17525 15922 19033 19357 17144 18817 17016 6137 715 5430 5402 7637 14824 19459 22077
11437B2077K547o971j526L03L233L717N26q79m43j705N78L22o084Q89Q171r89
$$ 22077 24624 17653 16127 16430 19663 23380 23906 23027 22584 20879 21457 21779 15695 16584 24755 23766
11421B3766j627n58o086l140M241K516p80l249j743j924N577J00K012m261j18
$$ 23766 22139 21581 15495 12355 16596 19112 18332 15083 13340 11416 16993 17093 19105 14844 14726
11406A4726K446J444k883o236j808ko018N174N639k881M554P143K118L128P428
$$ 14726 17172 18616 15733 9497 7689 7687 1669 6843 12482 9601 14155 21298 23416 26544 33972
11391C3972K48m044k175j344J343N030N760J1297K796j218n968q469o020q59O176
$$ 33972 34220 30176 28001 26657 28000 33030 38790 50087 52883 51665 45697 37228 31208 30349 36525
11376C6525j5M35o683k98o223l112O023J2226N295N736M819K1657L0292K9905
$$ 36525 36510 36945 30262 29964 23741 20629 26652 38878 44173 49909 54728 76385 106677 136582
11362A36582L5819J9881q107l5837l6833k6827j9687p718j732j936j286o06M657
$$ 136582 172401 192282 184175 148338 111505 84678 64991 57273 55541 53605 52319 51713 56370
11349E6370M247l660o773k581j299o618m492k317m652J1637Q970m059o766R246
$$ 56370 60617 56957 50184 47603 46304 39686 35194 32877 28225 39862 48832 44773 38007 47253
11335D7253R610R091J7465J8860J6641K3785J6783Q392j5519l1620k8437j9533
$$ 47253 56863 65954 83419 102279 118920 142705 159488 167880 152361 120741 92304 72771
11323G2771j4468n193O718o710j4348j319l246O230M625o420q712l248j950J913
$$ 72771 58303 53110 59828 53118 38770 37451 34205 40435 45060 38640 29928 26680 24730 26643
11309B6643M587q14K541K954L989j898j922l512q559J82M769r658p204M824J562
$$ 26643 31230 30416 32957 35911 39900 38002 36080 32568 24009 24191 28960 19302 12098 16922 18484
11294A8484K829M256N295r029M658K083j163K097M824J977J748k447l37o703o628
$$ 18484 21313 25569 30864 21835 26493 28576 27413 29510 34334 36311 38059 35612 35275 28572 21944
11279B1944K620Q202N896J157l447n439m303J453l28J145q894K515K907j893J899
$$ 21944 24564 32766 38662 39819 36372 30933 26630 28083 27755 28900 20006 22521 25428 23535 25434
11264B5434M451P90P960L749j910P88k317l80L375p057m828J246J673N279l942
$$ 25434 29885 30675 38635 42384 40474 41262 38945 38565 41940 34883 30055 31301 32974 38253 34311
11249C4311o980J020N856J626k049l471o187l540l102J819J079P053R493M276
$$ 34311 27331 28351 34207 35833 33784 30313 24126 20586 17484 19303 20382 27435 36928 41204
11235D1204k508n712l346n424p31O36L244J687j353J346P497O885N700M718M610
$$ 41204 38696 32984 29638 24214 23483 24119 27363 29050 27697 29043 36540 43425 49125 53843 58453
11220E8453p50q990j828j645j55j472l380J23p748j902J231L622N836k029l809
$$ 58453 57703 48713 46885 45240 45085 43613 40233 40356 32608 30706 31937 35559 41395 39366 35557
11205C5557o498L864O847L281N496N137l607o730r495l629j34K560L217n68l946
$$ 35557 29059 32923 39770 43051 48547 53684 50077 43347 33852 30223 30089 32649 35866 35298 31352
11190C1352R271K730J849K456O63L989N425R365P607L399K404k453m696o068m248
$$ 31352 40623 43353 45202 47658 48321 52310 57735 67100 74707 78106 80510 78057 73361 67293 63045
11175F3045j0853l222k92k091J214j801J170l171k095k191K474N66P767J133n561
$$ 63045 52192 48970 48678 46587 47801 46000 47170 43999 41904 39713 42187 42753 50520 51653 46092
11160D6092p406k44k657q2k566O15L663O69L225J707J1561j865m664k851o074
$$ 46092 38686 38442 35785 35703 33137 33752 37415 38084 41309 43016 54577 52712 48048 45197 39123
11145C9123J3394J6781J0320J8421K2310Q346M349o503p576j1513k0506j5753
$$ 39123 52517 69298 79618 98039 120349 128695 133044 126541 118965 107452 86946 71193
11133G1193j3363n414O05K164o310r37n05N408n033j998O469R01p632n678j215
$$ 71193 57830 52416 53021 55185 48875 47938 47433 52841 47808 45810 52279 53180 45548 39870 38655
11118C8655p90l011J308m084Q403M885N36M291P860n12k050J0099R45j1733J171
$$ 38655 37865 34854 36162 32078 40481 45366 45902 50193 58053 57541 55491 65590 66535 54802 55973
11103E5973L042P723N183J356J3311J0105N779M77j837p237j6630j2208m122M62
$$ 55973 59015 66738 71921 73277 86588 96693 102472 102949 101112 93875 77245 65037 60915 61377
11089F1377j402l190j0122l420m547r71P616L301M701l334Q272o18r277l328L292
$$ 61377 59975 56785 46663 43243 38696 37725 45341 48642 53343 50009 58281 57663 48386 45058 48350
11074D8350l277M19l21m116m719J057R053J41J299L363j381J374j79N478R634
$$ 48350 45073 45492 45171 41055 36336 37393 46446 46587 47886 51249 49868 51242 51063 56541 66175
11059F6175P464O64N458m09J548j853n502o931m528k549p037k057j042l793j99
$$ 66175 73639 74303 79761 79352 80900 79047 73545 66614 62086 59537 52500 50443 49401 45608 45409
11044D5409K044n33N399Q03m990m124N607O661j598M040J970L205Q263L849o969
$$ 45409 47453 46920 52319 53122 48132 44008 49615 56276 54678 58718 60688 63893 72156 76005 69036
11029F9036m658k259R0l025j5099j584N17j158P330N83m87J502j0066L028J882
$$ 69036 64378 62119 62209 59184 44085 42501 43018 41860 49190 49773 49286 50788 40722 43750 45632
11014D5632J769j018K961J514M170l695J252L197p1J140L22j630j793J11K214
$$ 45632 47401 46383 49344 50858 55028 51333 52585 55782 55711 56851 57173 55543 53750 53861 56075
10999E6075j209n728l818m088Q321N43P79J0262M597j44J991j41j631M492P226
$$ 56075 54866 49138 45320 41232 49553 50096 50875 61137 65734 65590 67581 67440 65809 70301 77527
10984G7527M821P049P716k552p911o270j1368o308qK723K58J026M506l310J601
$$ 77527 82348 89397 97113 94561 86650 80380 69012 62704 62696 65419 65677 66703 71209 67899 69500
10969F9500L307L224J151K252p341j987n14k953m997L651L592P782j331L12N114
$$ 69500 72807 76031 77182 79434 72093 70106 69592 66639 61642 65293 68885 76667 75336 75648 80762
10954H0762p36j648J435o584O83j040j116M944l064o933K015L701K159K355o74
$$ 80762 80026 78378 79813 73229 73912 72872 71756 76700 73636 66703 68718 72419 74578 76933 76259
10939G6259K291P612J3039J5096R436J1988N314J645J59L549K997j0919j1049
$$ 76259 78550 86162 99201 114297 123733 135721 141035 142680 142839 146388 149385 138466 127417
10926A27417q413m414o528j9079j8192j3722n509l12K619J052O969N141M750k499
$$ 127417 119004 114590 108062 88983 70791 57069 51560 51248 53867 54919 61888 67029 71779 69280
10912F9280L721m05m924j3655j2592K172P737N930j489n784J941P547Q541J163
$$ 69280 73001 72596 67672 54017 41425 43597 51334 57264 55775 49991 51932 59479 68020 69183
10898F9183N206J2027Q349J1693O929K571J4322K2204K6900M0929N4017P7950
$$ 69183 74389 86416 94765 106458 113387 115958 130280 152484 179384 220313 274330 352280
10886C52280J10707J63420K41820L20392L34331K55992J42611n7483l34029m48254
$$ 352280 462987 626407 868227 1188619 1522950 1778942 1921553 1864070 1530041 1081787
10876A081787l47417k08062j30716q4061m8923k6199k2914k4491k0019q842q296
$$ 1081787 734370 526308 395592 311531 262608 236409 213495 189004 168985 160143 151847
10865A51847m684p290j0218k377r840j2930p714n472o958l135M157N316J636l309
$$ 151847 147163 139873 129655 127278 117438 104508 96794 91322 84364 81229 85386 90702 92338 89029
10851H9029k372P17n78N143L2n39J062k548k819q431q782j948K11O705P840O710
$$ 89029 86657 87374 86796 91939 91971 91432 92494 89946 87127 78696 69914 67966 68177 74882 82722 89432
10835H9432j640l996K211m78l802N265J799o954j90O629J355m957k196N076l892
$$ 89432 87792 83796 86007 85529 81727 86992 88791 81837 81647 88276 89631 84674 82478 87554 83662
10820H3662m459l65n35l251n938J590J206l661k906j753L883N589N320O330J0941
$$ 83662 79203 78838 78303 75052 69114 70704 71910 68249 65343 63590 67473 73062 78382 84712 95653
10805I5653Q373l684O607j361j0949j5711p917L748P082k278n4J922M038Q71K162
$$ 95653 104026 100342 106949 105588 94639 78928 71011 74759 81841 79563 79509 81431 85469 86340 88502
10790H8502r49O551O525k720k005k395M86j92N391J1031N686L419M669O26n633
$$ 88502 87553 94104 100629 97909 95904 93509 93995 93803 99194 110225 115911 119330 123999 124625 118992
10775A18992o009k623n795J132q532j1839n287m805q221o3L458o609o163k625
$$ 118992 112983 110360 104565 105697 97165 85326 80039 75234 67013 66950 70408 63799 57636 55011
10761E5011J0065J7439J2959J0204K809P35j312k582L56L983o26R31l091O105
$$ 55011 65076 82515 95474 105678 108487 109222 107910 105328 105684 109667 109041 109972 106881 112986
10747A12986R325L608n415q350l99K813k993N58K198R16P119Q83N192M118j1703
$$ 112986 122311 125919 120504 112154 111755 114568 111575 112133 114331 115247 122366 123249 128441 132559 120856
10732A20856p413p291m391k44M133R595J1087O198N945Q839J5434K9333L6062
$$ 120856 113443 106152 101761 101517 105650 115245 126332 132530 138475 147314 162748 192081 228143
10719B28143M1598N9580O3489N1414K4061J3344j9894m9689o6632n5512l6432
$$ 228143 269741 329321 392810 444224 468285 481629 461735 412046 345414 289902 253470
10708B53470k8236j4301m238j6523j0544n28Q340p21m941M124L433j569l056N888
$$ 253470 225234 210933 206695 190172 179628 179100 187440 186719 181778 185902 189335 187766 184710 190598
10694A90598j532k596Q37k78n980n195o650k666j5082k1267j3438n401n096l070
$$ 190598 189066 186470 187307 187029 181049 175854 169204 166538 151456 130189 116751 111350 106254 103184
10680A03184M282R192O584N151M557O46p358N010P843J1074N199N470N393J710
$$ 103184 107466 116658 123242 128393 132950 133596 126238 131248 139091 150165 155364 160834 166227 167937
10666A67937j0698j3332r553L863J5052J5268Q110n722l40l218j5458j3695j7349
$$ 167937 157239 143907 134354 138217 153269 168537 176647 170925 170585 167367 151909 138214 120865
10653A20865l8210n5336q4925r9023p2689o1942k0431M9925J26310J21959P4334
$$ 120865 82655 27319 -57606 -156629 -229318 -291260 -311691 -261766 -135456 -13497 60837
10642F0837L0929K7539J5341J5684K1523K0738J9121J6509L851r540l015J66j527
$$ 60837 91766 119305 134646 150330 171853 192591 211712 228221 232072 222532 219517 219683 218156
10629B18156n399p60L980L012M762m73L338M858P950M384L067M432O930m17l206
$$ 218156 212757 211997 215977 218989 223751 223278 226616 231474 239424 243808 246875 251307 258237 257820 254614
10614B54614l47O8R247R637J6793J5612R123l25J074K925K95m388P24L236M005
$$ 254614 254267 254335 263582 273219 290012 305624 314747 314422 315496 318421 318716 314328 315052 318288 322293
10599C22293Q654J4019J5749J1006J8507J9688L4341M4886O3389Q2795R5217M4332
$$ 322293 330947 344966 360715 371721 390228 409916 444257 489143 552532 635327 730544 774876
10587G74876j5855n2800o8077o5827n4644l4998k5588k4033r058k158K910M767
$$ 774876 759021 706221 638144 572317 517673 482675 457087 433054 423996 421838 424748 429515
10575D29515N243J120Q034J0946J3054N053m00M025J017R47K095j491p56P88K650
$$ 429515 434758 435878 443912 454858 467912 472965 472565 476590 477607 478554 480649 479158 478402 479190 481840
10560D81840L309j350N631J9615J8540J7062J6671K0842J9621J5574M159J5084
$$ 481840 485149 483799 489430 509045 527585 544647 561318 582160 601781 617355 621514 636598
10548F36598J9550J7009J8050J2038J7692J2059J6293J8624K3792K8685L5002
$$ 636598 656148 673157 691207 703245 720937 732996 749289 767913 791705 820390 855392
10537H55392O1102Q4350J31352J87297K37282K82235K88268K37116J47752M0905
$$ 855392 916494 1000844 1132196 1319493 1556775 1839010 2127278 2364394 2512146 2553051
10527B553051r3935j78322k24936k42264j96807j42302p3995l6168l0302k6333
$$ 2553051 2459116 2280794 2055858 1813594 1616787 1474485 1400490 1364322 1334020 1307687
10517A307687k1329j3602J8801L8638N8604O7776P3245P7529P1806P5313Q6836
$$ 1307687 1286358 1272756 1291557 1330195 1388799 1456575 1529820 1607349 1679155 1754468 1841304
10506A841304R0672Q8226Q9308R5185J06106J05989J05744J20800J39060J44672
$$ 1841304 1931976 2020202 2109510 2204695 2310801 2416790 2522534 2643334 2782394 2927066
10496B927066J59904K03812K68683L52899M69643O12571P37140P66942O81245
$$ 2927066 3086970 3290782 3559465 3912364 4382007 4994578 5731718 6498660 7179905
10487G179905N41783K88877r5102j53608J34335M68442P10765Q27996Q78181R15818
$$ 7179905 7721688 8010565 7915463 7761855 7896190 8364632 9075397 9903393 10781574 11697392
10477A1697392Q78793Q59810J180724J792317K499881L325117M453864O139249
$$ 11697392 12576185 13435995 14616719 16409036 18908917 22234034 26687898 32827147
10469C2827147Q798695J3140763K0231684L1236533M5980626N9126123O0047841
$$ 32827147 41625842 54766605 74998289 106234822 152215448 211341571 271389412
10462B71389412M6452399K7239726m682585n7376822q4010159o7271722m1807621
$$ 271389412 317841811 345081537 340398952 283022130 199011971 131740249 89932628
10455H9932628k4977563j5580829j0289604p137534n105700l710302k754032k091327
$$ 89932628 64955065 49374236 39084632 31947098 26841398 23131096 20377064 18285737
10447A8285737j626967j260583r83072q68548q60284r27124j101096j135924r71669
$$ 18285737 16658770 15398187 14415115 13546567 12686283 11759159 10658063 9522139 8550470
10438H550470p56229n81994m68957l80443l25437l07920l09737k81881k48658
$$ 8550470 7794241 7212247 6743290 6362847 6037410 5729490 5419753 5137872 4889214
10429D889214k26705k00223j89748j95716j86208j70700j56255j37641j21913
$$ 4889214 4662509 4462286 4272538 4076822 3890614 3719914 3563659 3426018 3304105
10420C304105j14145j29558j33788j25206j00869p7940n7228m1146m5777m5737
$$ 3304105 3189960 3060402 2926614 2801408 2700539 2622599 2565371 2524225 2478448 2432711
10410B432711n2056q2794j07946j13251j03335j00931r1738r5145q0266n7498
$$ 2432711 2380655 2297861 2189915 2076664 1973329 1872398 1780660 1685515 1605249 1547751
10400A547751m3481l3245k3820l3253m3158m0485m6202m3987l2882l0536k1273
$$ 1547751 1504270 1471025 1447205 1413952 1370794 1330309 1284107 1240120 1207238 1176702 1155429
10389A155429j7030j6878j8321k2111k7702m3017n3003n9639m5196l6551k8147
$$ 1155429 1138399 1121521 1103200 1081089 1053387 1010370 957367 897728 852532 815981 787834
10378G87834k5974k6991k0830k8388l0452j9498j6264j4372j6021j4051j0369
$$ 787834 761860 734869 714039 685651 655199 635701 619437 605065 589044 574993 564624
10367E64624l810k807J412p487j4391j9824j7015j7370k3559k1055j8751k1311
$$ 564624 560814 558007 559419 551932 537541 517717 500702 483332 459773 438718 419967 398656
10355C98656j9352j1690r835O94O056L400j11J177P607J3979J5180J3002K3441
$$ 398656 379304 367614 357779 358473 364529 367929 367818 368995 376602 390581 405761 418763 442204
10342D42204K7416Q662m01M82J4624L4641M8504L6044m955n9178q5585p0957m9255
$$ 442204 469620 478282 477881 478363 492987 527628 576132 612176 607221 548043 462458 391501 342246
10329C42246l3349k0364k1220j8699j5299j4222j2755q447o817j0128j1775r66
$$ 342246 308897 288533 267313 248614 233315 219093 206338 197891 191074 180946 169171 168205
10317A68205q201j1414m933o505m825R38Q786Q999M936M942J506n265n286J605
$$ 168205 160004 148590 143657 137152 132327 133265 142051 151050 155986 160928 162434 157169 151883 153488
10303A53488o33K359L851L689Q607J490m067j0982q700j833q822q284p037n75
$$ 153488 152855 155214 159065 162754 171361 172851 168784 157802 149102 147269 138447 130163 123126 122551
10289A22551J220P257N098K631J5283R853J2771K2866K5540L2749M2740M9033
$$ 122551 123771 131028 136126 138757 154040 163893 176664 199530 225070 257819 300559 349592
10277C49592O9759P4357N9441L7885k7387j14395j26092q5613n4390l9318k2925
$$ 349592 419351 493708 553149 591034 563647 449252 323160 237547 183157 143839 120914
10266A20914n616m966o376p011l35L318Q174J3565P215o33j668p325p34k309L
$$ 120914 115298 110332 103956 96945 96610 99928 108102 121667 128882 128249 126581 119256 118522 116213 116216
10251A16216j809R22R610J543k784J563N61l823p07O53P191N480m756r442j4685
$$ 116216 114407 115329 124939 126482 123698 125261 125822 121999 121292 121945 129136 134616 129860 120418 105733
10236A05733p945r651q815o8J11N14J113j956l467K69J1535N450j883k712k839
$$ 105733 97788 88137 79322 79254 79365 79879 80992 79036 75569 75838 87373 92823 90940 88228 85389
10221H5389N260O547J2037J8022J4275J5735J6145P630J8534K1617K4934K2166
$$ 85389 90649 97196 109233 127255 141530 157265 173410 181040 199574 221191 246125 268291
10209B68291O279o559p771O743J1090J0549K3451L8918M1178M0371L3869J9955
$$ 268291 274570 268011 260240 266983 278073 288622 312073 350991 392169 432540 466409 486364
10197D86364j64j3675k703Q683L1338M3912N0492M7937N1841N6292N2274N9497
$$ 486364 486200 472525 469822 478505 509843 553755 604247 652184 704025 760317 812591 872088
10185H72088O7622Q0605Q6075Q5698R8129J15916J57996K29934L29148M74094
$$ 872088 939710 1020315 1106390 1192088 1290217 1406133 1564129 1794063 2123211 2597305
10175B597305P04005J061822J608881K397653L304245M000294M066446L268598
$$ 2597305 3301310 4363132 5972013 8369666 11673911 15674205 19740651 23009249
10167B3009249J492196r73112l708302m951124m500941l219291k030154j258163
$$ 23009249 24501445 23528333 19820031 14868907 10367966 7148675 5118521 3860358
10159C860358q13959n55499l93772k81096j95830j43643j07442r0828q1875p9513
$$ 3860358 3046399 2490900 2097128 1816032 1620202 1476559 1369117 1278289 1196414 1116901
10149A116901q4971r7123j03483r3496p9458n9991m3302l5532l0407j5122j4900
$$ 1116901 1031930 934807 831324 737828 658370 598379 555077 519545 489138 474016 459116
10138D59116j4518j9681k4522k1225j8399j7546o127j4660k0620j2580j0911r255
$$ 459116 444598 424917 400395 379170 360771 343225 337098 322438 301818 289238 278327 269072
10126B69072j1820p034j6081j0214r911o913j2947r074o200k249K111J721l620
$$ 269072 257252 250218 234137 223923 214012 207099 194152 185078 178878 176629 178740 180461 176841
10113A76841l434n875j3667k296k019p91L919k296O683J4074N84j2885j6366r268
$$ 176841 173407 167532 153865 151569 149550 148759 152678 150382 157065 171139 171723 158838 142472 133204
10099A33204q528o794K76l253k549j588J130n097j814l084k041m54J412J1612
$$ 133204 124676 117882 118158 114905 112356 110768 111898 106801 104987 101903 99862 99408 100820 112432
10085A12432J5949J3155M366K22Q004m827j3423j3656q545n192k556l408q100
$$ 112432 128381 141536 145902 146124 154128 149301 135878 122222 113677 108485 105929 102521 94421
10072I4421k426r608l770M184k99N993K126K848N040o774p541J649J976K902O938
$$ 94421 91995 82387 78617 82801 82502 88495 90621 93469 98509 91735 84194 85843 87819 90721 97659
10057I7659P991J53L498M473Q834R876J1509R455J5498J9890L5105M2164N8568
$$ 97659 105650 105803 109301 113774 122608 132484 143993 153448 168946 188836 223941 266105 324673
10044C24673P9397J07570J36757J73127K26227K74482K89275K41869J57597K5879
$$ 324673 404070 511640 648397 821524 1047751 1322233 1611508 1853377 2010974 2036853
10034B036853k29182m36812m02452k70837j66093r4959n4938l8823j9281J611
$$ 2036853 1807671 1370859 968407 697570 531477 436518 381580 342757 323476 325087
10024C25087K3630N0632P5968R1426J09279J25043J00045M7137r603o5870j16025
$$ 325087 348717 399349 475317 566743 676022 801065 901110 948247 938644 872774 756749
10013G56749j37201j30021j20729q6853m3739k8283j7965j4723L51J307j864o25
$$ 756749 619548 489527 368798 281945 238206 209923 191958 177235 177586 178893 177029 176404
10001A76404J791m473j6398l901R760N0135R5909J62464K22294J95389J06635
$$ 176404 178195 173722 157324 153423 163183 213318 309227 471691 693985 889374 996009
9990I96009Q4810j07676l37248k15999j10195n1513l3032k2393j1564j3625j6661
$$ 996009 1080819 973143 635895 419896 309701 258188 225156 202763 191199 177574 160913
9979A60913j6623j5770j9724j3887q856m792r586q41j946o078n724o342l079J411
$$ 160913 144290 128520 108796 94909 86053 81261 71675 70834 68888 62810 57086 50744 47665 49076
9965D9076O924o458n483K537R62k695K490O589mo229n998P116j658j144K936r238
$$ 49076 56000 49542 44059 46596 47558 44863 47353 53942 53938 47709 41711 48827 47169 46025 48961 39723
9949C9723l804j56K319Q34L565P0p154o216K366l947L47p04l110j619k577m3N628
$$ 39723 35919 35763 38082 38916 42481 42551 35397 29181 31547 27600 27947 27243 24133 22514 19937 19894 25522
9932B5522k056l110N205o141o088n70R100j348j710J80N382p46J741K959J917
$$ 25522 23466 20356 25561 19420 13332 12762 21862 20514 18804 18984 24366 23620 25361 28320 30237
9917C0237Q580j920n788K646K222o737j052K519L103k822r424p19n228j800J261
$$ 30237 38817 36897 31109 33755 35977 29240 28188 30707 33810 30988 21564 20845 15617 13817 15078
9902A5078N054K783M445R25n306O94N12k120n9J544p132q889q437N989P786R630
$$ 15078 20132 22915 27360 28285 22979 23673 24185 22065 22006 23550 16418 7529 -908 5081 12867 22497
9886B2497j583J244q93K290o210L487M741O547m99p37o518k035j747q97j691o
$$ 22497 20914 22158 21265 23555 17345 20832 25573 32120 31621 30884 24366 22331 20584 19687 17996 17990
9870A7990R301r52K970N67k787l040o145L378J960P42J978P067K397L482J541
$$ 17990 27291 26339 29309 29876 27089 24049 17904 21282 23242 23984 25962 33029 35426 38908 40449
9855D0449k313J913Q65l183n764J396J345M318k25k815l734N614M883r59j1080
$$ 40449 38136 40049 40914 37731 31967 33363 34708 39026 38801 35986 32252 37866 42749 41790 30710
9840C0710k298o990j238K610l22L090N223K847J034M296J398o131r674q68k10
$$ 30710 28412 21422 20184 22794 22472 25562 30785 33632 34666 38962 40360 34229 24555 23687 23477
9825B3477P81R36j644J257Q908P338O508J205j0790l207L222l716j107M460N886
$$ 23477 24258 25194 23550 24807 33715 41053 47561 48766 37976 34769 37991 34275 33168 37628 43514
9810D3514O182q109m575N276L170J041K761q90o495p110l75R262j303p83j478
$$ 43514 49696 41587 37012 42288 45458 46499 49260 48370 41875 34765 34390 43652 42349 41566 40088
9795D0088k334n875j304O081Q041J638m137k051n56k341l907r20n016L586N099
$$ 40088 37754 31879 30575 36656 44697 46335 42198 40147 39591 37250 33343 32423 27407 30993 36092
9780C6092L692j867l674n884p304N228J0167L471J404P371K552P07p85l13l08
$$ 36092 39784 37917 34243 28359 21055 26283 36450 39921 41325 48696 51248 51955 51170 50857 50549
9765E0549j319M103l895o278K310n53M632m7Q450R900M343P584J2669P503Q287
$$ 50549 49230 53333 49438 43160 45470 44917 49549 49502 57952 67852 72195 79779 92448 99951 108238
9750A08238J3926J7539J0382k327J749N370L136q87P90q645j4625j7846j3798
$$ 108238 122164 139703 150085 147758 149507 154877 158013 157126 157916 149271 134646 116800 103002
9737A03002j0203j2378j7830j1365m623j648j00Q45M624N046J834m186K067n804
$$ 103002 92799 80421 62591 51226 46603 44955 44855 45700 50324 55370 57204 53018 55085 49281
9723D9281K071L470L363M446l989l29M468n490j0208l972K436M895M330l933k163
$$ 49281 51352 54822 58185 62631 58642 58313 62781 57291 47083 43111 45547 50442 54772 50839 48676
9708D8676j416L283R07o114n500L099m0M33N88L321J359m486M06k032R429N840
$$ 48676 47260 50543 51450 45336 39836 42935 42895 43328 43916 47237 48596 44110 44516 42484 51913 57753
9692E7753L742Q207K746l817l080p724j138J021N829k9m464L76O98J70p06K247
$$ 57753 61495 69702 72448 68631 65551 57827 56689 57710 63539 63510 59046 59422 60120 60290 59584 61831
9676F1831J983l677k374M419K180Q508L433L118j493o620M848K026n275r38L501
$$ 61831 63814 60137 57763 62182 64362 72870 76303 79421 77928 71308 76156 78182 72907 71969 75470
9661G5470J26l652k638Q699K379n159m314Q147K830l208k77n515k136O372L914
$$ 75470 75596 71944 69306 78005 80384 75225 70911 79058 81888 78680 78403 72888 70752 77124 81038
9646H1038P995J039m484n823k596Q55K898K606N283l156n590o742m73R397j730
$$ 81038 89033 90072 85588 79765 77169 78024 80922 83528 88811 85655 80065 73323 72850 82247 80517
9631H0517n388L838M196n075K609O544R63L65N814M749J407o828l238M243j13
$$ 80517 75129 78967 83163 78088 80697 87241 88204 88569 94383 99132 100539 93711 90473 94716 94603
9616I4603L0l107p32j302J238M406j13n43q10K435O870j16N38J850O3J821K948
$$ 94603 94633 91526 90794 89492 90730 95136 95023 94480 93670 96105 102975 102859 103397 105247 105310 107131 110079
9599A10079o95O810N573L520k952j160k077n814M944K516k474l025l210M790J070
$$ 110079 109384 116194 121767 125287 122335 121175 119098 113284 118228 120744 118270 115245 112035 116825 117895
9584A17895J329J747N249m343k062M151M877k930o814K167N367P475k430o370
$$ 117895 119224 120971 126220 121877 119815 123966 128843 125913 119099 121266 126633 134108 131678 125308
9570A25308o385l49P090R394N512J606l76q1j197J536j752J0992P596N888M551
$$ 125308 118923 118574 125664 135058 140570 142176 141800 141719 140522 142058 140306 151298 158894 164782 169333
9555A69333j824M129L635n45l453m941m099R102k34j1625j246P555N367k366N745
$$ 169333 167509 171638 175273 174728 171275 166334 162235 171337 171103 159478 158232 165787 171154 168788 174533
9540A74533R56j493j0099J948P904L905L30k414j315Q272J1174P326O530K413
$$ 174533 175489 173996 163897 165845 173749 177654 177984 175570 174255 182527 193701 201027 207557 209970
9526B09970q720j0362j950j332L840N024J948L29m064m32j225P367K806m11k674
$$ 209970 201250 190888 188938 187606 191446 196470 198418 198747 194683 194251 193026 200393 203199 202788 200114
9511B00114L9O175N190L624L601r1j326M857k241o265M204J779J138j060j257
$$ 200114 200153 206328 211518 215142 218743 218652 217326 222183 219942 213677 217881 219660 220798 219738 218481
9496B18481k837j068O17n281L738L025J340P634P351R533J093l021l400Q48P845
$$ 218481 215644 214576 215193 209912 213650 216675 218015 225649 233000 242533 243626 240605 237205 238053 245898
9481B45898l081n111L257M221j875O327N898L126j495Q395J0857Q639N364N762
$$ 245898 242817 237706 240963 245184 243309 249636 255534 258660 257165 265560 276417 285056 290420 296182
9467B96182K601N457L010O144N73P192P541J1027M539m115N110M048P002N364
$$ 296182 298783 304240 307250 313394 313967 321159 328700 339727 344266 340151 345261 349309 356311 361675
9453C61675M528L077L711J372L560J2575L616J0660J3967N438k273K181M942O801
$$ 361675 366203 369280 372991 374363 377923 390498 394114 404774 418741 424179 421906 424087 429029 435830
9439D35830O682J2572L272N526N792N171J0746R530R278M125j925M407J4912L782
$$ 435830 442512 455084 458356 463882 469674 474845 485591 495121 504399 508524 506599 511006 525918 529700
9425E29700O896J0117J2441P953L271J1560J6158P660Q511O536Q74J1078P366
$$ 529700 536596 546713 559154 567107 570378 581938 598096 605756 614267 620803 621677 632755 640121
9412F40121P712J2551J4320O852R437J1553J5343J3920J0431M368K938J5275J8403
$$ 640121 647833 660384 674704 681556 690993 702546 717889 731809 742240 746608 749546 764821 783224
9399G83224J3219K0849K8922J5946J3642J6018J7226J8011J7160K1222J3316J5970
$$ 783224 796443 817292 846214 862160 875802 891820 909046 927057 944217 965439 978755 994725
9387I94725J9402K7939J7906K3313K4904K4165K5747K5017K5470K5821K6706L1245
$$ 994725 1014127 1042066 1059972 1083285 1108189 1132354 1158101 1183118 1208588 1234409 1261115 1292360
9375A292360K7556K8198L7695M1468L8968L3684L4260L6508L4408M6169M7739
$$ 1292360 1319916 1348114 1385809 1427277 1466245 1499929 1534189 1570697 1605105 1651274 1699013
9364A699013M6365N1631N0115M9136M6699N9753P0533P1629P0510P1430O8122
$$ 1699013 1745378 1797009 1847124 1896260 1942959 2002712 2073245 2144874 2215384 2286814 2354936
9353B354936P6165Q3634Q5784Q7539R3784R6297R7270J13822J21225J15915J24475
$$ 2354936 2431101 2514735 2600519 2688058 2781842 2878139 2975409 3089231 3210456 3326371 3450846
9342C450846J33305J38231J42519J62020J71788J74314J87621J93306K09779K22062
$$ 3450846 3584151 3722382 3864901 4026921 4198709 4373023 4560644 4753950 4963729 5185791
9332E185791K42229K51608K67168K83639L01883L17734L42685L69512L82849M07113
$$ 5185791 5428020 5679628 5946796 6230435 6532318 6850052 7192737 7562249 7945098 8352211
9322H352211M43319M71151M92826N22775N55695N92556O27002O48725O80351P06362
$$ 8352211 8795530 9266681 9759507 10282282 10837977 11430533 12057535 12706260 13386611 14092973
9312A4092973P25537P46316P43552P42941P42992P27008O84673O36078N74261
$$ 14092973 14818510 15564826 16308378 17051319 17794311 18521319 19205992 19842070 20416331
9303B0416331M88485L91342K88838J79772O1805o7973j83670k96176m08741m99651
$$ 20416331 20904816 21296158 21584996 21764768 21826573 21758600 21574930 21278754 20870013 20370362
9293B0370362n79748o30782o72690p14412p45121p46739p32844p19724p06262
$$ 20370362 19790614 19159832 18487142 17772730 17027609 16280870 15548026 14828302 14122040
9284A4122040o83090o61070o40324o11249n77789n41487n14820m89326m60223
$$ 14122040 13438950 12777880 12137556 11526307 10948518 10407031 9892211 9402885 8942662
9275H942662m32689m02679l81597l60991l34803l16870l01835k77062k63243k47309
$$ 8942662 8509973 8107294 7725697 7364706 7029903 6713033 6411198 6134136 5870893 5623584
9265E623584k33101k21883k14684k02668j84014j74890j66955j53915j47525j49982
$$ 5623584 5390483 5168600 4953916 4751248 4567234 4392344 4225389 4071474 3923949 3773967
9255C773967j39474j32134j26872j12819j07457j08759r8886r4338r0945q0910
$$ 3773967 3634493 3502359 3375487 3262668 3155211 3046452 2947566 2853228 2762283 2681373
9245B681373q3568q2920p6853p4710p5171o9361o1553n5014n4068o5341n6922
$$ 2681373 2597805 2514885 2438032 2363322 2288151 2218790 2157237 2102223 2048155 1982814 1925892
9234A925892n4915n5490m9971m4090n2319m5088l8221l4617l6348m1362l6858
$$ 1925892 1870977 1815487 1765516 1721426 1669107 1624019 1585798 1551181 1514833 1473471 1436613
9223A436613l7044k4781l5050l6280k8990l1374l0133k4221k5977l5306k1927
$$ 1436613 1399569 1374788 1339738 1303458 1274468 1243094 1212961 1188740 1162763 1127457 1105530
9212A105530k0099k0350l1116k5825k2754k8249j2565j2707k3299k3589j1594
$$ 1105530 1085431 1065081 1033965 1008140 985386 957137 944572 931865 908566 884977 873383
9201H73383j6069j8682j6343k2533j6233j5273j0948j3262j0445r134j4166o658
$$ 873383 857314 838632 822289 799756 783523 768250 757302 744040 733595 724461 710295 703637
9189G03637j4326j5890r827j1314r029l481j1694j6977j5031j4091j1553p966
$$ 703637 689311 673421 663594 652280 643251 639770 628076 611099 596068 581977 570424 562458
9177E62458q559q629m796j3074r848n752L35r452j2280m639r054j1834m710l496
$$ 562458 553899 545270 540474 527400 517552 511800 512135 502683 490403 485764 476710 464876 460166 456670
9163D56670j3808j3227j480l826j0174o847p89j933o824q150r961k721k974p525
$$ 456670 442862 429635 428155 424329 414155 407308 406519 404586 397762 389612 379651 376930 373956 366431
9149C66431q538m960q610j6631l846J0258j256m944p714o894q363k946n495O36
$$ 366431 357893 352933 344323 327692 323846 334104 332848 327904 320190 313296 304933 301987 296492 297128
9135B97128J561L24m836q11l301n985n069j316L251k120r32j150m218j594j925
$$ 297128 298689 299013 294177 293366 290065 284080 279011 277695 280946 278826 277894 276744 272526 270932 269007
9120B69007m505n075p808o825P25J21K206n118m843j659K518K2k61J440l525n90
$$ 269007 264502 259427 251619 244794 245519 245640 247846 242728 237885 236226 238744 238766 238505 239945 236420 235830
9104B35830m011j3599k658K838j70l78m844n688k158n287m203k973j043j115K0
$$ 235830 231819 218220 215562 218400 218230 217852 213008 207320 205162 199875 195672 192699 191656 190541 190561
9089A90561k970K34Q0m64r457q439q656j720l848J966r30j589K418O02j769l666
$$ 190561 187591 187825 187905 187441 177984 169545 160889 159169 155321 157287 156357 154768 157186 157788 156019 152353
9073A52353k944n953M265P243n686p290n08j048j945J090q74q94q12K957L461
$$ 152353 149409 143456 147721 154964 149278 141988 141480 140432 138487 139577 138703 137809 136997 139954 143415
9058A43415j269k422L820n65p890k40m254m414P935K778j846l405k610j780J808
$$ 143415 142146 139724 143544 142979 135089 134849 130595 126181 134116 136894 135048 131643 129033 127253 129061
9043A29061k071r695r557n197J216p98p35L576K165K450l62o229k026k500j724
$$ 129061 126990 117295 107738 102541 103757 102959 102224 105800 107965 110415 110053 103824 101798 99298 97574
9028I7574k003j339K472K386J61L314j512o578l107j980m138N4N060K464p246
$$ 97574 95571 94232 96704 99090 99251 102565 101053 94475 91368 89388 85250 85304 90364 92828 85582
9013H5582n862L302L689p261m995P15L473K311k331j274p79r33k154L785L649
$$ 85582 79720 83022 86711 79450 74455 75170 78643 80954 78623 77349 76570 75637 73483 77268 80917
8998H0917r241o264K717N175M189R54j081n179J461j13m884N81l147K948j509
$$ 80917 71676 65412 68129 73304 77493 78447 77366 72187 73648 73535 68651 69232 66085 69033 67524
8983F7524q42l033M568K854j19o186j0873P97J014j983m76J940J781N642j635
$$ 67524 66682 63649 68217 71071 70952 64766 53893 54690 55704 53721 53245 55185 56966 62608 60973
8968F0973J441k382o441N24L868N470K626p851n539R13O95l27m020p304p73O586
$$ 60973 62414 60032 53591 54115 57983 63453 66079 58228 52689 53602 54297 53970 49950 42646 41873 48459
8952D8459O298K045k536k812L89R66J700j097n076k672k593k780o903Q313Q79
$$ 48459 54757 56802 54266 51454 51843 52809 54509 53412 48336 45664 43071 40291 33388 41701 42580
8937D2580l067K926M640l115k95P415k706m170j621K450N211K593L104M477l67
$$ 42580 39513 42439 47079 43964 43669 51084 48378 44208 42587 45037 50248 52841 55945 60422 60055
8922F0055n268j2132j198N968J566n660j813J97L815J260n140j0007J596N654
$$ 60055 54787 42655 41457 47425 48991 43331 41518 41715 45530 46790 41650 31643 33239 38893
8908C8893J0252K315m62J590m85j0492o471J0046q57l925j785J297M19k049j284
$$ 38893 49145 51460 50998 52588 52103 41611 35140 45186 44329 40404 38619 39916 40335 38286 37002
8893C7002k397j062L262j334j34l830j798L034k405R43M396R49L009j611o018
$$ 37002 34605 33543 36805 35471 35337 31507 29709 32743 30338 31281 35677 36626 39635 38024 32006
8878C2006n489L479K797k922N050N796K936K0m284k127l622M908O37m250l489
$$ 32006 26517 29996 32793 29871 34921 40717 43653 43673 39389 37262 33640 38548 39185 34935 31446
8863C1446n365N19K427M018J7q016K069j998q45L897k23L8K694R47j285j131k735
$$ 31446 26081 26600 29027 33045 33062 25046 27115 25117 24272 28169 27946 27984 30678 31625 30340 29209 26474
8846B6474L142k851o942N735L392l085P05l800L076P751k19P42L441j783q663
$$ 26474 29616 26765 19823 25558 28950 25865 26570 22770 25846 33597 33378 34120 37561 35778 27115
8831B7115l658J529N476L883j408k352j2234j031P403O002k470q739o732l83l948
$$ 27115 23457 24986 30462 34345 32937 30585 18351 17320 24723 30725 28255 19516 12784 12401 8453
8816H453P993O67j684M817M418J70k702l375k005m212M916K227l992n994n03Q857
$$ 8453 16446 17113 15429 20246 24664 24834 22132 18757 16752 12540 17456 19683 15691 9697 9194 18051
8800A8051O390j149N96P200j107m364O58k702o935K174J341J185k358j1074M81
$$ 18051 24441 23292 23888 31088 29981 25617 26275 23573 16638 18812 20153 21338 18980 7906 8387
8785H387N933J0997N078J601P395o191p468l954L006n34R83J823n594l127O548
$$ 8387 14320 25317 30395 31996 39391 33200 25732 21778 24784 24250 25233 27056 21462 18335 24883
8770B4883J553J251J978Q27j102q224p624J848L725J0682m000j0541k843Q65M907
$$ 24883 26436 27687 29665 30492 29390 21166 13542 15390 19115 29797 25797 15256 12413 13278 18185
8755A8185J529m018N839p42k930m967K613M935k746M158K175m2L59k085k401j127
$$ 18185 19714 15696 21535 20793 17863 12896 15509 20444 17698 21856 24031 23989 24348 22263 19862 18735
8739A8735J131K278O485l221p778m33L559O769O381n143o190r45L47P298K170
$$ 18735 19866 22144 28629 25408 17630 17197 20756 27525 33906 28763 22573 21628 21975 29273 31443
8724C1443N113Q013J1022J1623Q387J0249Q75q095q232j6319j6750k363o202j2
$$ 31443 36556 44569 55591 67214 75601 85850 86725 78630 70398 54079 37329 34966 28764 28752
8710B8752N828l378j653O96j500J595k364L922O782m10l440k181J617p524j629
$$ 28752 34580 31202 29549 30245 28745 30340 27976 31898 38680 38270 34830 32649 34266 26742 25113
8695B5113O95J784L468L933R80K250M32k978J411M584n624m611k115Q998J5793
$$ 25113 25808 27592 31060 34993 35973 38223 38655 35677 37088 41672 36048 31437 29322 38320 54113
8680E4113J2608P806Q482J1152j08j0772p486n579o937p674j944k704k499o413
$$ 54113 66721 74527 83009 94161 94053 83281 75795 70216 63279 55605 53661 50957 48458 42045
8666D2045l614K769j022K26M906j680L967p11j237j232l396l528j101K368K45
$$ 42045 38431 41200 40178 40404 45310 43630 47597 46886 45649 44417 41021 37493 36392 38760 39005
8651C9005K461J498P90L189p29O849R999J0506P751J1784J591q38j6699j5818
$$ 39005 41466 42964 43754 46943 46214 53063 63062 73568 81319 93103 94694 93856 77157 61339
8637F1339o518J540p21k242n497l292k204j23l330O116J271K142M732N778m34
$$ 61339 54821 56361 55640 53398 47901 44609 42405 42282 38952 45068 46339 48481 53213 58991 58557
8622E8557k791J255O882N802N188O027j2219j401o139q416j190K179K563M399
$$ 58557 55766 57021 63903 69705 74893 80920 68701 67300 61161 52745 51555 53734 56297 60696
8608F0696L885p66j693k632K240J828L324N457Q036Q324J4458K1115J9213K0752
$$ 60696 64581 63815 62122 59490 61730 63558 66882 72339 80375 88699 103157 124272 143485 164237
8594A64237J6553J7453r135l1865j7557m716o071o543k431m724M539k72j087K603
$$ 164237 180790 198243 189108 157243 139686 134970 128899 122356 119925 115201 119740 119468 118381 120984
8580A20984k936M863n760m866L627K537j85J593L967M493R150Q003j659R80N769
$$ 120984 118048 122911 117151 112285 115912 118449 118264 119857 123824 128317 137467 145470 143811 144791 150560
8565A50560O396L770R845J975J921P630J8413J9016J2591J8586J2153J0789K0679
$$ 150560 156956 160726 170571 172546 174467 182097 200510 219526 232117 250703 262856 273645 294324
8552B94324K1403K9960L3669L4055M2391M7058O2589N7011M9460M1679M7617N2061
$$ 294324 315727 345687 379356 413411 455802 502860 565449 622460 671920 713599 761216 813277
8540H13277M7455L6484J7474j2847l6361o0746q3205q5948p6856p1702o4243o0706
$$ 813277 860732 897216 914690 901843 865482 804736 721531 635583 558727 487025 422782 362076
8528C62076m3102m2092l1033k9852k3825j5489j3614q459q119p046m284j4183
$$ 362076 318974 276882 245849 215997 192172 176683 163069 154610 146491 139445 135161 120978
8516A20978j4016l693o047r420m448k841p128K46q25n747m978J43j860K825o534
$$ 120978 106962 103269 97222 87802 83354 80513 73385 73631 72806 67059 62081 62224 60364 63189 56655
8501E6655n689K264J593N229j572n158k900k639j204o007r02k32K745j329k765
$$ 56655 50966 53230 54823 60052 58480 53322 50422 47783 46579 40572 39670 39438 42183 40854 38089
8486C8089J759n207n232P398K425K965K749k778m516j507l52o079K32J707N07
$$ 38089 39848 34641 29409 36807 39232 42197 44946 42168 37652 36145 35793 29714 29946 31653 32160
8471C2160k607R60J8m552M634L388l547J074j955k519K042R934m739r035j315
$$ 32160 29553 30513 30531 25979 30613 34001 30454 31528 29573 27054 29096 39030 34291 25256 23941
8456B3941q122n939Q28l106r36m017o31k843M899P891P7j93j596q62j056L440
$$ 23941 15819 9880 10708 7602 6666 2649 2018 -825 4074 11965 12042 11849 10253 9391 8335 11775
8440A1775L522j034q975K4L483K017r66l250J092O580L945J713j337p365q55M455
$$ 11775 15297 14263 5288 5312 8795 10812 9846 6596 7688 14268 18213 19926 18589 11224 10369 14824
8424A4824K100L786m324l407n390m826P63N383k404o020k058M223P045L905j291
$$ 14824 16924 20710 16386 12979 7589 2763 3526 8909 6505 485 -1573 2650 9695 13600 12309
8409A2309j896P544r67q373J419P738J805o469n415k135m627k108K402J306K594
$$ 12309 10413 17957 16990 8617 10036 17774 19579 13110 7695 5560 933 -1175 1227 2533 5127
8394E127M743k109k784K878N270j359k862J154M053k149K493M051L942n268n071
$$ 5127 9870 7761 4977 7855 13125 11766 8904 10058 14111 11962 14455 18506 22448 17180 12109
8379A2109O96J211K121M668k696o723K911K547j168j195O150j10l167L45N31Q639
$$ 12109 12805 14016 16137 20805 18109 11386 14297 16844 15676 14481 20631 20521 17354 17699 18230 26869
8363B6869L102o169m919q446o177P99O558k791j697K354l66M430J0090N82o945
$$ 26869 29971 23802 18883 10437 4260 5059 11617 8826 7129 9483 9117 13547 23637 24219 17274
8348A7274n548R97q74m257m161j21K703K749M287O363Q176K842Q34l012m50o164
$$ 17274 11726 12723 11849 7592 3431 3310 6013 8762 13049 19412 27588 30430 31264 28252 27802 21638
8332B1638J06O674K348K674M980k365N57J634l667l090n134o408J896N343K284
$$ 21638 21744 28418 30766 33440 38420 36055 36612 38246 34579 31489 26355 19947 21843 27186 29470
8317B9470J128L190k310j114J386P62P947P874O014k48L8l065j630o906o218n934
$$ 29470 30598 33788 31478 30364 31750 32512 40459 48333 54347 54099 54137 51072 49442 42536 36318 30384
8301C0384p787n096L787L962R477P107j586J306K763O430O134L241K799M989n81
$$ 30384 22597 17501 21288 25250 34727 41834 40248 41554 44317 50747 56881 60122 62921 67910 67329
8286F7329o819m996P529M197j290k958N850J1933J0118J6473J5982J1949K1530
$$ 67329 60510 55514 63043 67240 65950 62992 68842 80775 90893 107366 123348 135297 156827
8273A56827M3398O5681R2297J27267J64403J73972J25960O3290m7060k02320k30646
$$ 156827 200225 265906 358203 485470 649873 823845 949805 1013095 966035 763715 533069
8262E33069j63322j00841o6707l1668k1025j8793k3440j7283k710L406K689m884
$$ 533069 369747 268906 202199 170531 149506 130713 107273 89990 87280 90686 93375 88491
8250H8491j4296o911N769l51N812M145k327J154M741l844k814N232L087P31P550
$$ 88491 74195 67284 73053 72702 78514 82659 80332 81486 86227 82383 79569 84801 87888 88619 96169
8235I6169J1058R540K3270K8025M4371O8754J01226J42646J69153J47843R5498
$$ 96169 107227 116767 140037 168062 212433 281187 382413 525059 694212 842055 937553
8224I37553L0183j08408k22575k05424j37641p8693m7399k9249k8675k4335j4976
$$ 937553 967736 859328 636753 431329 293688 214995 167596 138347 109672 85337 70361
8213G0361p856j635l530j0598J562O436L4L162M274j90k746j2212r368k724m268
$$ 70361 62505 60870 57340 46742 48304 54740 54774 57936 62210 62020 59274 47062 37694 34970 30702
8198C0702l975K735K169p006M077k744l600l658k664J579L125j032o460L213M42
$$ 30702 26727 29462 31631 24625 28702 25958 22358 18700 16036 17615 20740 19708 13248 16461 16903
8183A6903m198K182Q341m592m205L104q57k220K21k492j571K94K085k516q944
$$ 16903 12705 14887 23228 18636 14431 17535 16678 14458 14679 12187 10616 10910 12995 10479 1535
8168A535n35M568O394j6j2j614l039j0990k939J557L317k32P613L266n272l301
$$ 1535 1000 5568 11962 11946 11934 10320 7281 -3709 -6648 -5091 -1774 -2006 5607 8873 3601 300
8152C00p895L773j057l663J732L462N144J507R20n881n714o578P050Q415M974
$$ 300 -7595 -3822 -4879 -8542 -6810 -3348 1796 3303 4223 -1658 -7372 -13950 -6900 1515 6489
8137F489Q0j697M423J971k12o058n166J212n502N293J1882k299n762n18M710m592
$$ 6489 6569 4872 9295 11266 11054 4996 -170 1042 -4460 833 12715 10416 4654 4136 8846 4254
8121D254O786J290k230O895j242N05L389j753J560n397j073j265l51L761P25m695
$$ 4254 11040 12330 10100 16995 15753 16258 19647 17894 19454 14057 12984 11719 11368 15129 15854 11159
8105A1159n986M01k43m262o741J0075M324J349k434L561M624j576o884k909R337
$$ 11159 5173 5574 5331 1069 -5672 4403 8727 10076 7642 11203 15827 14251 7367 4458 13795
8090A3795k908q616k519L419j822o323J175Q154J7208j986m698k616N0l026L839
$$ 13795 10887 2271 -248 3171 1349 -4974 -3799 4355 21563 19577 14879 12263 12313 9287 13126
8075A3126L799Q40k911j847o28N990Q095M683n946q451o20j401J395R41J300k671
$$ 13126 16925 17765 14854 13007 12379 18369 26464 31147 25201 16750 16130 14729 16124 17065 18365 15694
8059A5694j787J182N506N15j3442k339M811k37J551m470k022l303L815O294n260
$$ 15694 13907 15089 20595 21110 7668 5329 10140 9903 11454 6984 4962 1659 5474 11768 6508
8044F508m031l243k661N303Q162P50k819k163l052n31L408J745j536m578n963
$$ 6508 2477 -766 -3427 1876 10038 10788 7969 5806 2754 2223 5631 7376 5840 1262 -4701
8029d701K749L280O581k783k529J780L336n115k934J518M659N440Q88L621J564
$$ -4701 -1952 1328 7909 5126 2597 4377 7713 2598 -336 1182 5841 11281 12169 15790 17354
8014A7354R883J863q480n554o841o92J291N650K337k739l395O7J556M049o768
$$ 17354 27237 29100 20620 15066 8225 7533 8824 14474 16811 14072 10677 10744 12300 16349 9581
7999I581K360L573l296N999R06j517n08O512P392P53q62L379N503r08k240J538
$$ 9581 11941 15514 12218 18217 19123 17606 17098 23610 31002 31755 30893 34272 39775 38867 36627 38165
7983C8165K120M401k957M197j828m549k404r966j505J1293M520N924p85k869L242
$$ 38165 40285 44686 41729 45926 44098 39549 37145 27179 25674 36967 41487 47411 46626 43757 46999
7968D6999l024n415Q1O171K118k348M79r78M339L15K009p09P726K134M939m207
$$ 46999 43975 38560 38641 44812 46930 44582 45061 44083 48422 48737 50746 50037 57763 59897 64836 60629
7952F0629j0050K767K523N775J5005M244O568J0573J5652J7363J576n896j2107
$$ 60629 50579 53346 55869 61644 76649 80893 87461 98034 113686 131049 132625 126729 114622
7939A14622j5519j4371j4524j0279l922N67r545J914P88p635j3033K791Q272p94
$$ 114622 99103 84732 70208 59929 56007 56574 47029 48943 49731 42096 29063 31854 40126 39332
7925C9332k146p847r832J1043O580P318m135m777J143O6o345j364J336j762M063
$$ 39332 37186 29339 19507 30550 37130 44448 40313 35536 36679 36745 30400 29036 30372 28610 32673
7910C2673P155q5J004M431O978N755o451J865R059Q796j458r94l246K097p290
$$ 32673 39828 39743 40747 45178 52156 57911 51460 53325 62384 71180 69722 68728 65482 67579 60289
7895F0289q322q2n41o162r216j0194k01O449q168o175J703R39K289k743q663k636
$$ 60289 51967 51885 51344 45182 35966 25772 25571 32020 23852 17677 19380 20319 22608 19865 11202 8566
7879H566J753j858M952k057j18L61o98L502k813O655P943J19L82j906m502L887
$$ 8566 10319 8461 13413 11356 11238 11599 10901 14403 11590 18245 26188 26307 26689 24783 20281 24168
7863B4168K47l216O09J859M56L234O617k277m843m790m84J026k218q142r2L304
$$ 24168 24415 21199 21808 23667 24123 27357 33974 31697 26854 22064 21580 22606 20388 12246 12154 15458
7847A5458m654j015M042N239o025q117J418Q478O247K984j478p834q248N45R913
$$ 15458 10804 9789 13831 19070 13045 4928 6346 14824 21071 24055 22577 14743 6495 7040 16953
7832A6953J697k162L151l453p132Q62J545p90r578J134J364L528j64L018K244
$$ 16953 18650 16488 19639 16186 9054 9916 11461 10671 1093 2227 3591 7119 6955 9973 12217
7817A2217M6l705l704Q8O77J233l602k120k178n293j0256O34M427P081J773L597
$$ 12217 12263 8558 4854 4942 5619 6852 3250 1130 -1048 -6341 -16597 -15963 -11536 -4455 -2682 915
7801I15k835q05L415l146P85o129L888j526r920n92J149P46j822K976J0851L388
$$ 915 -1920 -2725 690 -2456 -1671 -7800 -3912 -5438 -15358 -15950 -14801 -14055 -15877 -12901 -2050 1338
7785A338j239Q13k034k805m970J171j800J682j624o684J16O88K917l031N903P042
$$ 1338 99 912 -1122 -3927 -8897 -7726 -9526 -7844 -9468 -16152 -16036 -15348 -12431 -15462 -9559 -2517
7769b517M928K761m086n02j576j134K366R61j0832q48L134k004O816J1315n180
$$ -2517 2411 5172 1086 584 -992 -2126 240 1201 -9631 -10479 -7345 -9349 -2533 8782 3602
7754C602q050j869Q592L33K272N069k843l652j116k696j615J038L291k996J869
$$ 3602 -4448 -6317 2275 2608 4880 9949 7106 3454 2338 -358 -1973 -935 2356 -640 1229
7739A229J395L831K851n103m499j846L479m544l71M930L281J02K711K208r328
$$ 1229 2624 6455 9306 4203 -296 -2142 1337 -3207 -3578 1352 4633 4735 7446 9654 326
7724C26j403J343L081j440m743M256m632j044j246r58J468p55j087K894m338o56
$$ 326 -1077 266 3347 1907 -2836 1420 -3212 -4256 -5502 -6460 -4992 -5747 -6834 -3940 -8278 -8934
7708h934Q854k245o498j222l624n06J92M896J742Q1J406k986L893L31l022l451
$$ -8934 -80 -2325 -8823 -10045 -13669 -14175 -13983 -9087 -7345 -7264 -5858 -8844 -4951 -4620 -7642 -11093
7692a1093O991L159r481J255O53k574l704j0823P892J2940L74l817K416j317N848
$$ -11093 -4102 -943 -10424 -9169 -8516 -11090 -14794 -25617 -17725 -4785 -4411 -8228 -5812 -7129 -1281
7677a281P196l181n310l518J644p72m72N42K742N542p0L410J871q136m619J114
$$ -1281 5915 2734 -2576 -6094 -4450 -5222 -5694 -5152 -2410 3132 3062 6472 8343 207 -4412 -3298
7661c298K959l57j911m608J725L504O276J285m864j0018q78K059L174j250J319
$$ -3298 -339 -696 -2607 -7215 -5490 -1986 4290 5575 711 -9307 -10185 -8126 -4952 -6202 -4883
7646d883j572q387m499N53R92N089r90l962q2J965K663J541P57J203L579K978
$$ -4883 -6455 -14842 -19341 -18788 -17796 -12707 -13697 -17659 -17741 -15776 -13113 -11572 -10815 -9612 -6033 -3055
7630c055o026l368l69J838M183n33m208O429n85j317k905j850J733j163L127N026
$$ -3055 -9081 -12449 -12818 -10980 -6797 -7330 -11538 -5109 -5694 -7011 -9916 -11766 -10033 -11196 -8069 -3043
7614c043O47M224O516J275p849p677p17K695q32n752j232k485L253J676m238k671
$$ -3043 -2396 1828 8344 9619 1770 -5907 -6624 -3929 -4761 -10513 -11745 -14230 -10977 -9301 -13539 -16210
7598a6210M873M904R538m09o662J644m723k013j020J394K158o302j432P658k362
$$ -16210 -11337 -6433 3105 2696 -3966 -2322 -7045 -9058 -10078 -8684 -6526 -12828 -14260 -6602 -8964
7583h964Q264P270n952j417r45o709K584L598L078j391m638n954j42N823K165
$$ -8964 -700 6570 618 -799 -1744 -8453 -5869 -2271 807 -584 -5222 -11176 -11318 -5495 -3330
7568c330N335O128n001o063K162L839q999j0364n8N749j586j17q01j518J085J0522
$$ -3330 2005 8133 3132 -2931 -769 3070 -5929 -16293 -16351 -10602 -12188 -12305 -13106 -14624 -13539 -3017
7552c017M572o221m552L864O707J229q361l705L815L046j242k582N659N315j251
$$ -3017 1555 -4666 -9218 -5354 1353 2582 -5779 -9484 -5669 -2623 -3865 -6447 -788 4527 3276
7537C276j191j712q967J444L99k160k849l425M56N683L528m905o923K388N274
$$ 3276 2085 373 -8594 -7150 -6751 -8911 -11760 -15185 -14729 -9046 -5518 -10423 -17346 -14958 -9684
7522i684J642J792n35j798k633J881K450R22m389k743j668J55j66o147J588M656
$$ -9684 -8042 -6250 -6785 -8583 -11216 -9335 -6885 -5963 -10352 -13095 -14763 -14608 -14774 -20921 -19333 -14677
7506a4677M143J909L008P32p59m348L862L416J695K322m005j20l560n001q87K643
$$ -14677 -10534 -8625 -5617 -4885 -5644 -9992 -6130 -2714 -1019 1303 -2702 -2822 -6382 -11383 -12270 -9627
7490i627M831j785j50j262l211R21M630O593M577k966p453J36Q76K885O31m785
$$ -9627 -4796 -6581 -6731 -7993 -11204 -10283 -5653 940 5517 2551 -4902 -4766 -3890 -1005 -374 -5159
7474e159m593M18j142L612q740j954J012M401M50J708Q394M403j492p332r304
$$ -5159 -9752 -9334 -10476 -6864 -15604 -17558 -16546 -12145 -11695 -9987 -1593 2810 1318 -6014 -15318
7459a5318K890M093M082N305p67l970o105j604K190m300K150j936J661J107j336
$$ -15318 -12428 -8335 -4253 1052 285 -3685 -9790 -11394 -9204 -13504 -11354 -13290 -11629 -10522 -11858
7444a1858j586J77l129J544K707m054K990J430m091k128L084J00O002N030k821
$$ -11858 -13444 -13267 -16396 -14852 -12145 -16199 -13209 -11779 -15870 -17998 -14914 -14814 -8812 -3782 -6603
7429f603j81j444n586O3j8J30j343J726P242o056J410K999l505k097K356K861
$$ -6603 -6784 -8228 -13814 -13751 -13769 -13639 -14982 -13256 -6014 -12070 -10660 -7661 -11166 -13263 -10907 -8046
7413h046O330O659j417l829m107J2p102m276L266L918k162K805P94n172k762l440
$$ -8046 -1716 4943 3526 -303 -4410 -4398 -11500 -15776 -12510 -8592 -10754 -7949 -7155 -12327 -15089 -18529
7397a8529k137K473M704L589n271n537M120M363L569N346j802m803J009o42N56
$$ -18529 -20666 -18193 -13489 -9900 -15171 -20708 -16588 -12225 -8656 -3310 -5112 -9915 -8906 -9548 -8992
7382h992l088N126O040n084k823J470L473L227q20p28R98j462M388l154l122l19
$$ -8992 -12080 -6954 -914 -5998 -8821 -7351 -3878 -651 -1471 -2199 -1201 -2663 1725 -1429 -4551 -4870
7366d870n59k642j845K306P954r72k118N763P00l184j0774m585N119N607P221
$$ -4870 -5429 -8071 -9916 -7610 344 -628 -2746 3017 3717 533 -10241 -14826 -9707 -4100 3121
7351C121k57m298j696r48k111k348J681M586K644q923p021p517r82K968P217K585
$$ 3121 2864 -1434 -3130 -4078 -6189 -8537 -6856 -2270 374 -8549 -15570 -23087 -24069 -21101 -13884 -11299
7335a1299j42L132J274N334j533k140j814M076M17n931l547J169K390l18L371
$$ -11299 -11441 -8309 -7035 -1701 -3234 -5374 -7188 -3112 -2695 -8626 -12173 -11004 -8614 -8932 -5561
7320e561K204j488k697L2q00o9O29L893O879p753p115O665N859k269r856J461
$$ -5561 -3357 -4845 -7542 -7510 -8310 -8379 -7750 -3857 3022 -4731 -11846 -5181 678 -1591 -11447 -9986
7304i986J549l613k933J95K742k608M647P179L465k735r120J220K167L406O50
$$ -9986 -8437 -12050 -14983 -14788 -12046 -14654 -10007 -2828 637 -2098 -11218 -9998 -7831 -4425 -3775
7289c775p277j292j323M501Q646j098n440j583l400j691M949q91N695r93j2295
$$ -3775 -11052 -12344 -13667 -9166 -520 -1618 -7058 -8641 -12041 -13732 -8783 -9674 -3979 -4972 -17267
7274a7267L135O211M428L59j386k746O329k500j30l678n987n008K235L832Q71
$$ -17267 -14132 -7921 -3493 -3134 -4520 -7266 -937 -3437 -3567 -7245 -13232 -18240 -16005 -12173 -11302
7259a1302L856k256M910k415j1922l809N010K24R92M139J448q50j597O39N030
$$ -11302 -7446 -9702 -4792 -7207 -19129 -22938 -17928 -17704 -16712 -12573 -11125 -11975 -13572 -12933 -7903
7244g903Q943L068J408l482m347o788n254l719M474L373M614L261l906l570L223
$$ -7903 1040 4108 5516 2034 -2313 -9101 -14355 -18074 -13600 -10227 -5613 -2352 -6258 -9828 -6605
7229f605m481L831O396k269k563N323j456m159J833M937n360j296K243m529j2333
$$ -6605 -11086 -7255 -859 -3128 -5691 -368 -1824 -5983 -4150 787 -4573 -5869 -3626 -8155 -20488
7214b0488k525Q036N455P818k540N75O78n723l25K584K673l632M763L899l534
$$ -20488 -23013 -14977 -9522 -1704 -4244 -3669 -2991 -8714 -9039 -6455 -3782 -7414 -2651 1248 -2286
7199b286j967j659K787j91p50m648K01J465K29m132K342N502l333j25l194J617
$$ -2286 -4253 -5912 -3125 -3316 -4066 -8714 -8513 -7048 -6819 -10951 -8609 -3107 -6440 -6565 -9759 -8142
7183h142O140K521j428J988m877J1n790m142J248N771L424J347K135p915q054
$$ -8142 -2002 519 -909 1079 -3798 -3787 -9577 -13719 -12471 -6700 -3276 -1929 206 -7709 -15763
7168a5763M052O140K445j154k347l292M137J796j126J592K764M409N132k290m775
$$ -15763 -11711 -5571 -3126 -4280 -6627 -9919 -5782 -3986 -5112 -3520 -756 3653 8785 6495 1720
7153A720m596m881J652J53k518K060J1696K829k727j0187j783K034L414j668n058
$$ 1720 -2876 -7757 -6105 -5952 -8470 -6410 5286 8115 5388 -4799 -6582 -4548 -1134 -2802 -7860
7138g860m843k250L990J4720K459o76m462P15k23L49m210M727k283o805J25R299
$$ -7860 -12703 -14953 -10963 3757 6216 5540 1078 1793 1570 1919 -2291 2436 153 -6652 -6527 2772
7122B772k275m250J0384m971p099J647q64L065J412m53J340q0M241L963k881m092
$$ 2772 497 -3753 6631 1660 -5439 -3792 -4656 -1591 -179 -632 708 628 4869 8832 5951 1859
7106A859k462p633j0386o055L407Q221M897J940K372p014l555Q950l689p153J071
$$ 1859 -603 -8236 -18622 -24677 -21270 -13049 -8152 -6212 -3840 -10854 -14409 -5459 -9148 -16301 -15230
7091a5230P832Q617m5l593K31p15q31J584p819o785L18O264O127q840o443j267
$$ -15230 -7398 1219 1174 -2419 -2188 -2903 -3734 -2150 -9969 -16754 -16436 -10172 -4045 -12885 -19328 -20595
7075b0595M612L37L561M153P587K276L63q4j467J280k724m822M239o911k776K478
$$ -20595 -15983 -15646 -12085 -7932 -345 1931 2294 2210 743 2023 -701 -5523 -1284 -8195 -10971 -8493
7059h493J081j548k439O723K099N510J084j611q054K307N061J020l108p237L642
$$ -8493 -7412 -8960 -11399 -4676 -2577 2933 4017 2406 -5648 -3341 1720 2740 -368 -7605 -3963
7044c963k048j754L779p35p951M416L009j352q7l29m332q808J228M951L915m395
$$ -3963 -6011 -7765 -3986 -4721 -12672 -8256 -5247 -6599 -6686 -7015 -11347 -20155 -18927 -13976 -10061 -14456
7028a4456j702O080J29J474L039l538J932P974L439k585P45k846L552o55o678
$$ -14456 -16158 -10078 -9949 -8475 -5436 -8974 -7042 932 4371 1786 2531 -315 3237 2582 -4096
7013d096j905m669J562L483K918K662r43n233o079M43L801j084K779j360j572
$$ -4096 -6001 -10670 -9108 -5625 -2707 -45 -988 -6221 -12300 -11857 -8056 -9140 -6361 -7721 -9293
6998i293N62J0400k336L64q361l207j21p41M589P496j326J063m205m325j149M072
$$ -9293 -8731 1669 -667 -303 -8664 -11871 -11992 -12733 -8144 -648 -1974 -911 -5116 -9441 -10590 -6518
6982f518J989J940K919k247J717o952L726r09k428r61l969M16K84l536K893O047
$$ -6518 -4529 -2589 330 -1917 -200 -7152 -3426 -4335 -6763 -7724 -11693 -11277 -10993 -14529 -11636 -5589
6966e589j01m99M8J933J752J831n608p580n890K164L524q73M841N686l044q547
$$ -5589 -5690 -6189 -6141 -4208 -2456 -625 -6233 -13813 -19703 -17539 -14015 -14888 -10047 -4361 -7405 -15952
6950a5952J826l66J429l13L543K42J887m858j30L134O08P16j300n19m042j821
$$ -15952 -14126 -14492 -13063 -13376 -9833 -9591 -7704 -12562 -12692 -9558 -8950 -8234 -9534 -10053 -14095 -15916
6934a5916N861O255l718k504K422k17j029q014R31L845Q247M363j100k729L066
$$ -15916 -10055 -3800 -7518 -10022 -7600 -7817 -8846 -16860 -15929 -12084 -3837 526 -574 -3303 -237
6919b37L862k135n251L834J28q457j779L605M90k753j751J778M282j081j0674
$$ -237 3625 1490 -3761 73 201 -8256 -10035 -6430 -5940 -8693 -10444 -8666 -4384 -5465 -16139
6904a6139k54M345J125K349J322r316J938K677K38q22k234R117Q03k539K051K653
$$ -16139 -16393 -12048 -10923 -8574 -7252 -16568 -14630 -11953 -11715 -12537 -14771 -5654 -4851 -7390 -5339 -2686
6888b686K23m583q205K260J072J351j50N89J986L449J380K322K150q981J707l15
$$ -2686 -2463 -7046 -15251 -12991 -11919 -10568 -10718 -10129 -8143 -4694 -3314 -992 1158 -7823 -6116 -6431
6872f431N057J154m696r30j772j430M600J475p616j3328P970Q613J776k589N023
$$ -6431 -1374 -220 -4916 -5846 -7618 -9048 -4448 -2973 -10589 -23917 -15947 -7334 -5558 -8147 -3124
6857c124l379j17k967K267M727k95k274k201O063L859m602p186m992O00K709p170
$$ -3124 -6503 -6620 -9587 -7320 -2593 -2888 -5162 -7363 -1300 2559 -2043 -9229 -14221 -13621 -10912 -18082
6841a8082j560L616N308J37L094K686k915r00J350Q814j755p424r44j349k439
$$ -18082 -19642 -16026 -10718 -10581 -7487 -4801 -7716 -8616 -7266 1548 -207 -7631 -8575 -9924 -12363
6826a2363k391O252k378o68M902J124n977J569L988R133L771Q79n508o925L864
$$ -12363 -14754 -8502 -10880 -11548 -6646 -5522 -11499 -9930 -5942 3191 6962 7841 2333 -4592 -728
6811g28K425j995M185K635p850m448m807q55p25O413L240m505N077P285k286r517
$$ -728 1697 -298 3887 6522 -1328 -5776 -10583 -11438 -12163 -5750 -2510 -7015 -1938 5347 3061 -6456
6795f456J446L575J174j699K484o347J377m307O04m919k295L010o63J190P287
$$ -6456 -5010 -1435 -261 -1960 524 -5823 -4446 -8753 -8149 -13068 -15363 -12353 -13016 -11826 -4539
6780d539J882o923p243O319Q93Q135J678p900l02j546m004O15J915P150o630l003
$$ -4539 -2657 -9580 -16823 -10504 -9611 -1476 202 -7698 -8000 -9546 -13550 -12935 -11020 -3870 -10500 -13503
6764a3503N403k28j393J145O014k413j192J279Q158k003j261O43j087k251N092
$$ -13503 -8100 -8328 -9721 -8576 -2562 -4975 -6167 -4888 3270 1267 6 649 -438 -2689 2403
6749B403m476l716N104m778l130O525L590L01l808j1524m712M252O642Q70m62
$$ 2403 -2073 -5789 -685 -5463 -8593 -2068 1522 1823 -1985 -13509 -18221 -13969 -7327 -6457 -6919
6734f919O609P677J031q816l727r73k209L693j272l153K966J2749n406k605L916
$$ -6919 -310 7367 8398 -418 -4145 -5118 -7327 -3634 -4906 -8059 -5093 7656 2250 -355 3561
6719C561l582M6J505q81q468m728R96j07J565L85K594l891J309J123P713J1600
$$ 3561 -21 25 1530 649 -7819 -12547 -11551 -11658 -10093 -9708 -7114 -11005 -9696 -8573 -860 10740
6703A0740p164r412J365P232N838q375o82P072m086n779M511K20l882J642L631
$$ 10740 3576 -5836 -4471 2761 8599 224 -458 6614 2528 -3251 1260 1480 -2402 -760 2871
6688B871J678K514m036j461J993J211L172j852j570R576j070l696p536n615j985
$$ 2871 4549 7063 3027 1566 3559 4770 7942 6090 4520 14096 13026 9330 1794 -3821 -5806
6673e806N933J639K305P86r62j0177l580J132K303j330L628N332o161K436M168
$$ -5806 127 1766 4071 4857 3895 -6282 -9862 -8730 -6427 -7757 -4129 1203 -4958 -2522 1646
6658A646n8J476l384J740L03l710o598k270m352L417l41k759m643P804L911J141
$$ 1646 1588 3064 -320 1420 1723 -1987 -8585 -10855 -15207 -11790 -12131 -14890 -19533 -11729 -7818 -6677
6642f677l629k128o773L813J1261p44J459J853j977K037j316j095k724L790L168
$$ -6677 -10306 -12434 -19207 -15394 -4133 -4877 -3418 -1565 -3542 -1505 -2821 -3916 -6640 -2850 318
6627C18J19N60K49j976l835k696n025k594n22p989M043Q019J714J403l305r745
$$ 318 437 997 1246 -730 -4565 -7261 -12286 -14880 -15402 -23391 -19348 -11329 -9615 -8212 -11517 -21262
6611b1262j295l52q16O376N534K281j782N706K284r55m508K701J478m456J351
$$ -21262 -22557 -22909 -23725 -17349 -11815 -9534 -11316 -5610 -3326 -4281 -8789 -6088 -4610 -9066 -7715
6596g715P57P33J067j71p77K67Q336N32j1420m598l998K160J269O50K942Q415
$$ -7715 -6958 -6225 -5158 -5329 -6106 -5839 2497 3029 -8391 -12989 -16987 -14827 -13558 -12908 -9966 -1551
6580a551p2p46p884j163l215l140J788M149M978K664l626L440J850m023R97M228
$$ -1551 -1623 -2369 -10253 -11416 -14631 -17771 -15983 -11834 -6856 -4192 -7818 -4378 -2528 -6551 -5554 -1326
6564a326K430r425j557j68j338O09J444P333J047n915m739J593J1038M43l260
$$ -1326 1104 -8321 -9878 -10046 -11384 -10775 -9331 -1998 -951 -6866 -11605 -10012 1026 1469 -1791
6549a791K067O442j667o793k294O094l421p40J976N91m894M066j0503n679O081
$$ -1791 276 6718 5051 -1742 -4036 2058 -1363 -2103 -127 464 -4430 -364 -10867 -16546 -10465
6534a0465K890J555n400j802K519Q01J1549J227O89l710l201J166N462j664R7
$$ -10465 -7575 -6020 -11420 -13222 -10703 -9902 1647 2874 3563 -147 -3348 -2182 3280 1616 1713
6519A713k635o399L541L571k551j042L543J794l385n71N76N287k297q582j983
$$ 1713 -922 -7321 -3780 -209 -2760 -3802 -259 1535 -1850 -2421 -1845 3442 1145 -7437 -9420
6504i420K48l841p489J327Q673R62J106R766L831p371o216m67j791J621M191j204
$$ -9420 -9172 -13013 -20502 -19175 -10502 -9540 -8434 1332 5163 -2208 -8424 -8891 -10682 -9061 -4870 -6074
6488f074L213O741m526J591o038r544L179N993J828M704k044q642p91l081k626
$$ -6074 -2861 3880 -646 945 -5093 -14637 -11458 -5465 -3637 1067 -977 -9619 -10410 -13491 -16117
6473a6117K078M219q67k402O214O89M952M698k391m753j635k90J157J424l608
$$ -16117 -14039 -9820 -10687 -13089 -6875 -6186 -1234 3464 1073 -3680 -5315 -5605 -4448 -3024 -6632
6458f632j033m91k019l41Q723O037n934m860L63L896M070j340k94L037j870m782
$$ -6632 -7665 -8156 -10175 -10516 -1793 4244 -1690 -6550 -6187 -2291 1779 439 145 3182 1312 -3470
6442c470k173n932J808N22j420j749j440P075P740l564K971L4m600j615l764j428
$$ -3470 -5643 -11575 -9767 -9245 -10665 -12414 -13854 -6779 961 -2603 368 402 -4198 -5813 -9577 -11005
6426a1005j170K570R311J033j086K940L154o116o112k160J348M356M446M66k939
$$ -11005 -12175 -9605 -294 739 -347 2593 5747 -369 -6481 -8641 -7293 -2937 1509 1975 -964
6411i64P26K115o72l520M175J007l14L484k372o457L252N447l06n440p800l244
$$ -964 -238 1877 1205 -2315 1860 2867 2553 6037 3665 -2792 460 5907 5601 161 -7639 -10883
6395a0883n47K997L89K259k034j16L502K977q80n474l103R14P526O953Q33n477
$$ -10883 -11430 -8433 -8044 -5785 -7819 -7935 -4433 -1456 -2336 -7810 -10913 -9999 -2473 4480 5313 -164
6379a64j302j175m885M239M951k819J588L098l464m99K647M61p180k681j241k012
$$ -164 -1466 -2641 -7526 -3287 1664 -1155 433 3531 67 -432 2215 2676 -4504 -7185 -8426 -10438
6363a0438O126M392l007o601k546P030l196k821L226Q06M976l966k848L442O427
$$ -10438 -4312 80 -2927 -9528 -12074 -5044 -8240 -11061 -7835 -7029 -2053 -6019 -8867 -5425 1002
6348A002j191q29p661m476J454J0116M366j43p131r84p70N40K693o686l231J080
$$ 1002 -189 -1018 -8679 -13155 -11701 -1585 2781 2638 -4493 -5477 -6247 -5707 -3014 -9700 -12931 -11851
6332a1851J2236l888r930m565O241N619k089L285k663K671J889k218Q85N622M139
$$ -11851 385 -3503 -13433 -17998 -11757 -6138 -8227 -4942 -7605 -4934 -3045 -5263 -4378 1244 5383
6317E383j765L733l161R80m508k295L87j918m837m139J99K931L368J661R66K80
$$ 5383 3618 7351 4190 5170 662 -1633 -1246 -3164 -8001 -12140 -11941 -9010 -5642 -3981 -3015 -2735
6301b735R69L763p303q958K353P37R241M120L299m407p525k367L405K470L534
$$ -2735 -1766 1997 -5306 -14264 -11911 -11174 -1933 2187 5486 1079 -6446 -8813 -5408 -2938 596
6286E96k547N180k067o485o0o39l037j765L336M127M286k144K107L128q311j447
$$ 596 -1951 3229 1162 -5323 -5383 -6022 -9059 -10824 -7488 -3361 925 -1219 888 4016 -4295 -5742
6270e742N711J043m849q079M569n168j467J121J026M800M138M657n86k598K262
$$ -5742 -31 1012 -3837 -11916 -7347 -12515 -13982 -12861 -11835 -7035 -2897 1760 1174 -1424 838
6255H38O48M06k513J071J621K67j956l486L155j323M993K359n903j676K932j5
$$ 838 1486 1892 -621 450 2071 2338 382 -3104 51 -1272 3721 6080 177 -1499 1433 1418
6239A418o25L094j279r680p977P12M962k640Q026N627o244l313J277j979L67L637
$$ 1418 793 3887 2608 -7072 -15049 -14337 -9375 -12015 -3989 1638 -4606 -7919 -6642 -8621 -8254 -4617
6223d617L561k568o740m36J388O996M814l620j757K641j858M099k091j90Q2N47
$$ -4617 -1056 -3624 -10364 -10800 -9412 -2416 2398 -1222 -2979 -338 -2196 1903 -188 -378 -296 251
6207B51jp37K916L021l651k121R276m082k176k765l049l176j825k89N606R987
$$ 251 250 -487 2429 5450 1799 -322 8954 4872 2696 -69 -3118 -6294 -8119 -8408 -2802 7185
6191G185k676m252p649R83l016l799j271J709L201m299j496J397Q382N61j848
$$ 7185 4509 257 -7392 -6409 -9425 -13224 -14495 -12786 -9585 -13884 -15380 -13983 -5601 -5040 -6888
6176f888k829l17j862j837M516J2008Q5p932j389o16N048l652k653k528P39M822
$$ -6888 -9717 -10034 -11896 -13733 -9217 2791 2876 -5056 -6445 -7061 -2013 -5665 -8318 -10846 -10107 -5285
6160e285M74K572j956p278l069M465n81n296J213R528k266o148J067p2K739k053
$$ -5285 -4811 -2239 -4195 -11473 -14542 -10077 -10658 -15954 -14741 -5213 -7479 -13627 -12560 -12632 -9893 -11946
6144a1946L012Q768N48m051J742M978q931j810K754L305J857K250P965k738j2607
$$ -11946 -8934 -166 382 -3669 -1927 3051 -5880 -7690 -4936 -1631 226 2476 10441 7703 -4904
6129d904J099K336J88k538P71m393K413j352l05M725M334q064k315N19J326j225
$$ -4904 -3805 -1469 -1281 -3819 -3048 -7441 -5028 -6380 -6685 -1960 2374 -5690 -8005 -7486 -6160 -7385
6113g385o539n37L539n107j829K291M026N702R54J6R91K809K412K200M76l215
$$ -7385 -13924 -14461 -10922 -16029 -17858 -15567 -11541 -5839 -4885 -4869 -3878 -1069 1343 3543 4019 804
6097H04N4k1L257n037n769j270J000M544l178l36j503j133j126M997J724n120
$$ 804 858 837 4094 -943 -6712 -7982 -6982 -2438 -5616 -5952 -7455 -8588 -9714 -4717 -2993 -8113
6081h113n660n434P9O880j973M616N894j702k727o284J10M582Q552l86m932M256
$$ -8113 -13773 -19207 -19128 -12248 -14221 -9605 -3711 -5413 -8140 -14424 -14314 -9732 -1180 -1566 -6498 -2242
6065b242n015J342M479n932k261J68l03j950l745L969L883M020L64O3n06M463
$$ -2242 -7257 -5915 -1436 -7368 -9629 -9461 -9764 -11714 -15459 -11490 -7607 -3587 -3223 -3160 -3666 797
6049G97k356m689o72N442O51J660L476n989J444l44J104j643K652M29p38m870
$$ 797 -1559 -6248 -6920 -1478 -827 833 4309 -1680 -236 -580 524 -1119 1533 1962 1224 -3646
6033c646j001K799O264N757J461J072M29k570m970p001j812O035l168P80q25K862
$$ -3646 -4647 -1848 4416 10173 11634 12706 13135 10565 5595 -1406 -3218 2817 -351 429 -396 2466
6017B466l070p97J188M047k048l087k528P722r07k444K798o473J673m463p329
$$ 2466 -604 -1401 -213 3834 1786 -1301 -3829 3893 2986 542 3340 -3133 -1460 -5923 -13252
6002a3252K072O515M617j302J12N514L591n907q524p192L078L609O386K653N25
$$ -13252 -11180 -4665 -48 -1350 -1238 4276 7867 1960 -6564 -13756 -10678 -7069 -683 1970 2495
5987B495L272j803m098j124k698m810o98o09l638L603O593J0875J577p947j0185
$$ 2495 5767 3964 -134 -1258 -3956 -8766 -9464 -10073 -13711 -10108 -3515 7360 8937 990 -9195
5972i195l452l028k133O842K48m324L706K192k575l740k659N511O878N543M325
$$ -9195 -12647 -15675 -17808 -10966 -10718 -15042 -11336 -9144 -11719 -15459 -18118 -12607 -5729 -186 4139
5957D139k815j0032j411j859k850N134M609P669M191n815r359R54O165L610L4
$$ 4139 1324 -8708 -10119 -11978 -14828 -9694 -5085 2584 6775 960 -8399 -7445 -1280 2330 2364
5942B364l586j257n075j513l587L164P134j351J804J033k678L25L668k833k049
$$ 2364 -1222 -2479 -7554 -9067 -12654 -9490 -2356 -3707 -1903 -870 -3548 -3223 445 -2388 -4437
5927d437L771k039R40j574J740j181p563J68M287K279N053L871l880m109n364
$$ -4437 -666 -2705 -1765 -3339 -1599 -2780 -10343 -10175 -5888 -3609 1444 5315 1435 -2674 -8038
5912h038Q137M838k738q322J334N000q02j073J332J685J04n180l645M646L449
$$ -8038 99 4937 2199 -6123 -4789 211 -591 -1664 -332 1353 1457 -3723 -7368 -2722 727
5897G27j118k922k180N624L926N059J146K022m841o947j63K152m706P014L020
$$ 727 -391 -3313 -5493 131 4057 9116 10262 12284 7443 496 333 2485 -2221 4793 7813
5882G813n848l955o75r77p654l074R09K347L608K78p44K908J723K750n024m873
$$ 7813 1965 -1990 -2665 -3642 -11296 -14370 -13461 -11114 -7506 -7228 -7972 -5064 -3341 -591 -5615 -10488
5866a0488k090K388P879M765M041m102n276P051M413L69m041l084K91J988l544
$$ -10488 -12578 -10190 -2311 2454 6495 2393 -2883 4168 8581 8950 4909 1825 2116 4104 560
5851E60k199j158J915l316L298R089j486k278n070M55R63M595k500j283M873o2
$$ 560 -1639 -2797 -882 -4198 -900 8189 6703 4425 -645 -190 773 5368 2868 1585 6458 6396
5835F396r829J515M614j966L009J107K662p219l774N485L773q426j876O115k864
$$ 6396 -3433 -1918 2696 730 3739 4846 7508 289 -3485 2000 5773 -2653 -4529 1586 -1278
5820a278p15J177J106K643N174q64n420l981n379k509L19M021J655O31O617N536
$$ -1278 -1993 -816 290 2933 8107 7243 1823 -2158 -7537 -10046 -9727 -5706 -4051 -3420 3197 8733
5804H733o176m94k241j413l961k80j86K64J945P678M766N48p042k794k941o062
$$ 8733 2557 2063 -178 -1591 -5552 -5832 -6018 -5754 -3809 3869 8635 9183 2141 -653 -3594 -9656
5788i656j590N967K744O959m65k907O81j515m430n326M228L663K480J608l086
$$ -9656 -11246 -5279 -2535 4424 3959 1052 1733 218 -4212 -9538 -5310 -1647 833 2441 -645
5773f45p845q221l328K375J327L743R868K683o503O291J78j046m525k143k314
$$ -645 -8490 -16711 -20039 -17664 -16337 -12594 -2726 -43 -6546 -255 -77 -1123 -5648 -7791 -10105
5758a0105J54r206J592R524P371K213Q91L145k099o483K543Q557N65q307n244
$$ -10105 -9951 -19157 -17565 -8041 -670 1543 2434 5579 3480 -3003 -460 8097 8662 355 -4889
5743d889L21j586j301p05k763q09P393L268k967k412J539o405p070N714Q247L779
$$ -4889 -4568 -6154 -7455 -8160 -10923 -11732 -4339 -1071 -4038 -6450 -4911 -11316 -18386 -12672 -4425 -646
5727f46p325O30J822p91j631Q02P722Q26m673q008J547N350K919r16j839L154
$$ -646 -7971 -7341 -5519 -6310 -7941 -7139 583 1409 -3264 -11272 -9725 -4375 -1456 -2372 -4211 -1057
5711a057l931p517L113J381j067J017j801M045L793M96J643L551K592j648n163
$$ -1057 -4988 -12505 -9392 -8011 -9078 -8061 -9862 -5817 -2024 -1528 115 3666 6258 4610 -553
5696e53l033p893J021R215J206j607P078l989p081j929l345l001M861m27K126
$$ -553 -3586 -11479 -10458 -1243 -37 -1644 5434 1445 -5636 -7565 -10910 -13911 -9050 -9477 -7351
5681g351j819L8L96Q336Q479L207l462J541L862K81J174n730j2071K446m198n910
$$ -7351 -9170 -9132 -8736 -400 8079 11286 7824 9365 13227 13508 14682 8952 -3119 -673 -4871 -10781
5665a0781J225l933O412J140K03K035l465N406J645n031N037M996m574K946q05
$$ -10781 -9556 -13489 -7077 -5937 -5734 -3699 -7164 -1758 -113 -5144 -107 4889 315 3261 2456
5650B456n676l534O332j873l981P213L525Q85j822N17p771P57K041O334K577m367
$$ 2456 -3220 -6754 -422 -2295 -6276 937 4462 5347 3525 4042 -3729 -2972 -931 5403 7980 3613
5634C613L334K560l746l664j0174N182L595K384l914m360n230o026K705K302K94
$$ 3613 6947 9507 5761 2097 -8077 -2895 700 3084 -830 -5190 -10420 -16446 -13741 -11439 -11145
5619a1145j492K944j02J113M658M664j059m438Q77j813J476K816n094k247L199
$$ -11145 -12637 -9693 -9795 -8682 -4024 640 -419 -4857 -3980 -5793 -4317 -1501 -6595 -8842 -5643
5604e643O36j239m039j21M344L607r36J755J003J548J074j031l525q46q908l784
$$ -5643 -5007 -6246 -10285 -10406 -6062 -2455 -3391 -1636 -633 915 1989 958 -2567 -3413 -12321 -16105
5588a6105L412Q309Q200K049L676j196k539k252j236J862L482k04j28K465J184
$$ -16105 -12693 -4384 3816 5865 9541 8345 5806 3554 2318 4180 7662 7458 7330 9795 10979
5573A0979K002r885o44L817Q301K501l295o936n763l415M167P057n292M864l41
$$ 10979 12981 3096 2452 6269 14570 17071 13776 6840 1077 -2338 1829 8886 3594 8458 8117
5558H117N182Q83%k732J73K034m223m614n733m869n52Q380N465k363r077k265
$$ 8117 13299 14182 14182 11450 11623 13657 9434 4820 -913 -5782 -6334 2046 7511 5148 -3929 -6194
5542f194J296N532j81l811J452M239m453l966Q6L5j386m942J269L356P886j358
$$ -6194 -4898 634 453 -3358 -1906 2333 -2120 -6086 -6000 -5965 -7351 -12293 -11024 -7668 218 -1140
5526a140n774j16O326k14n58k106J450R935p646q981k065j362K248r69M733m437
$$ -1140 -6914 -7030 -704 -918 -1476 -3582 -2132 7803 157 -8824 -10889 -12251 -10003 -10972 -6239 -10676
5510a0676l053K455k235L609J724N34p23j369n21L21J357M608M37j052k102P934
$$ -10676 -13729 -11274 -13509 -9900 -8176 -7642 -8365 -9734 -10255 -9934 -8577 -3969 -3532 -4584 -6686 1248
5494A248O051n897j873q535O223K480j176J541Q185q16p629l359k676l099K27
$$ 1248 7299 1402 -471 -9006 -2783 -303 -1479 62 8247 7431 -198 -3557 -6233 -9332 -9105
5479i105j48O086K335m711L403o02o215M875Q0J094j084K856L056L437m77N8J731
$$ -9105 -9253 -3167 -832 -5543 -2140 -2742 -8957 -4082 -4002 -2908 -3992 -1136 1920 5357 4880 4938 6669
5462F669l99l21k904n26L435r459K24j715K148P925K385r907j734O602m095o702
$$ 6669 6270 5949 3045 2519 5954 -3505 -3281 -4996 -2848 5077 7462 -2445 -4179 2423 -1672 -8374
5446h374k64L471J626P741J442n464m523m505J329r82m131m898j952K236P671
$$ -8374 -8638 -5167 -3541 4200 5642 178 -4345 -8850 -7521 -8503 -12634 -17532 -19484 -17248 -9577
5431i577N073l901r539N069O948L173l67o471k118R036R334k476o585j109P52
$$ -9577 -4504 -8405 -17944 -12875 -5927 -2754 -3121 -9592 -11710 -2674 6660 4184 -2401 -3510 -2758
5416b758L844k559n850L266L029L653M352M72l334K811o346j167L320n11j230
$$ -2758 1086 -1473 -7323 -4057 -1028 2625 6977 7449 4115 6926 580 -587 2733 2222 992
5401I92n023J153m76J739K347J141p631o349M578M683l94j53N499m651M90q146
$$ 992 -4031 -2878 -3354 -1615 732 1873 -5758 -12107 -7529 -2846 -3240 -3393 2106 -2545 -2055 -10201
5385a0201n15M252j470k334j780K814K973K699m31k27k669J063j177l452j864
$$ -10201 -10716 -6464 -7934 -10268 -12048 -9234 -6261 -3562 -3993 -4220 -6889 -5826 -7003 -10455 -12319
5370a2319P860L26l150j411R995L928K236J508m735r83m234L532j77N547L213
$$ -12319 -4459 -4133 -7283 -8694 1301 5229 7465 8973 4238 3255 -979 2553 2376 7923 11136
5355A1136o526k139k026k447P296N563p779p795j019o209k929M38R88K479N512
$$ 11136 4610 2471 445 -2002 5294 10857 3078 -4717 -5736 -11945 -14874 -14436 -13448 -10969 -5457
5340e457k725m101N614M052j248j462p9K833l106p86Q362J021N316J623q930p294
$$ -5457 -8182 -12283 -6669 -2617 -3865 -5327 -5406 -2573 -5679 -6465 1897 2918 8234 9857 927 -6367
5324f367N151n41J767m283o05J465m507l634O396k378m022K847N600K664P55m36
$$ -6367 -1216 -1757 10 -4273 -4878 -3413 -7920 -11554 -5158 -7536 -11558 -8711 -3111 -447 308 -128
5308a28k178j308j0754O52M223O303o145R60L674J087L556l176K722K902k146
$$ -128 -2306 -3614 -14368 -13716 -9493 -3190 -9335 -8375 -4701 -3614 -58 -3234 -512 2390 244
5293B44j609n264J831K368j671K429j623j564j74k431R2J082K123R023M304j040
$$ 244 -1365 -6629 -4798 -2430 -4101 -1672 -3295 -4859 -5033 -7464 -7372 -6290 -4167 4856 9160 8120
5277H120j169l989l165K140M930l249k374o896k746N511M979J069p050m863l597
$$ 8120 6951 2962 -203 1937 6867 3618 1244 -5652 -8398 -2887 2092 3161 -3889 -8752 -12349
5262a2349m50K654m943n142K964M072K479J950n200k280J921M099o47k612K364
$$ -12349 -12799 -10145 -15088 -20230 -17266 -13194 -10715 -8765 -13965 -16245 -14324 -10225 -10872 -13484 -11120
5247a1120j925Q663O871p899K937L430l266m34K251n26N582P00K31J714Q46K235
$$ -11120 -13045 -4382 2489 -5410 -2473 957 -2309 -2743 -492 -1018 4564 5264 5495 7209 8055 10290
5231A0290L493m688l178o792p697K768M281L30o21k635n491J427j308K877Q204
$$ 10290 13783 9095 5917 -875 -8572 -5804 -1523 -1193 -1814 -4449 -9940 -8513 -9821 -6944 1260
5216A260K847o30k198J086J831k243M134p778n497l619k581P046L239J250j413
$$ 1260 4107 3477 1279 2365 4196 1953 6087 -1691 -7188 -10807 -13388 -6342 -3103 -1853 -3266
5201c266m121l05k585n323j970N351M485n48M351M660M128q98N838L595o118l245
$$ -3266 -7387 -7692 -10277 -15600 -17570 -12219 -7734 -8282 -3931 729 4857 3959 9797 13392 7274 4029
5185D029J331K01o08L302j512j023k640m817m190N248j004N589R984j629o604
$$ 4029 5360 5561 4953 8255 6743 5720 3080 -1737 -5927 -679 -1683 3906 13890 12261 5657
5170E657K948J347k911k581k167J627m003K583L05j3033K416K467O278m56k731
$$ 5657 8605 9952 7041 4460 2293 3920 -83 2500 2805 -10228 -7812 -5345 933 477 -2254
5155b254J205M802n52J616m022k664L296n185j494K762M037k591j3265j943K179
$$ -2254 -1049 3753 3201 4817 795 -1869 1427 -3758 -5252 -2490 1547 -1044 -14309 -16252 -14073
5140a4073o81Q081j269j238M868P619J324k308k686l82m842j46j872p517N723
$$ -14073 -14754 -6673 -7942 -9180 -4312 3307 4631 2323 -363 -745 -5587 -5733 -7605 -15122 -9399
5125i399N411J543M39j866K572J346K73p98L66R19L2L528J144l272J867L736q027
$$ -9399 -3988 -2445 -2006 -3872 -1300 46 319 -479 -113 806 838 4366 5510 2238 4105 7841 -186
5108a86k596N818J695n386k120l196L468J643M153L182o405o412K704L761J214
$$ -186 -2782 3036 4731 -655 -2775 -5971 -2503 -860 3293 6475 70 -6342 -3638 123 1337
5093A337K525k157L194p242n590M73J084L308l816o835n278L462K157j372Q926
$$ 1337 3862 1705 4899 -2343 -7933 -7460 -6376 -3068 -6884 -13719 -18997 -15535 -13378 -14750 -5824
5078e824j46j698K598N72k299j57N807l711P20K24J712N004m982M071K162p341
$$ -5824 -5970 -7668 -5070 -4498 -6797 -6954 -1147 -4858 -4138 -3914 -2202 2802 -2180 1891 4053 -3288
5062c288K246R323K634n306j745l526l580J980M263n51J371l517l230O37O106
$$ -3288 -1042 8281 10915 5609 3864 338 -3242 -1262 3001 2450 3821 304 -2926 -2289 3817
5047C817j981k064N087J302J843k324p00N25j469o072j05L60l418J376l79n858
$$ 3817 1836 -228 4859 6161 8004 5680 4980 5505 4036 -2036 -2141 -1781 -5199 -3823 -4202 -10060
5031a0060n184K070N963m871J1350J0652q39O601n723m856m669K439m483L907
$$ -10060 -15244 -13174 -7211 -12082 -732 9920 9081 15682 9959 5103 434 2873 -1610 2297
5017B297J1286M118n711n827m987j3454o122j012N186O623j610m15k677N734O466
$$ 2297 13583 17701 11990 6163 1176 -12278 -18400 -19412 -14226 -7603 -9213 -9628 -12305 -6571 -105
5002a05N344p690m049j668l395k021M850L441K312l538P28M664L3k756O081M908
$$ -105 5239 -2451 -6500 -8168 -11563 -13584 -8734 -5293 -2981 -6519 -5791 -1127 -1094 -3850 2231 7139
4986G139M332k673o55j657Q74j59n299K670k029q040O666m08j07j459L868r38
$$ 7139 11471 8798 8143 6486 7360 7201 1902 4572 2543 -5497 1169 761 654 -805 3063 2125
4970B125o711l591J307L755J0026k980j631n637l431L469N356L086O065P28m271
$$ 2125 -4586 -8177 -6870 -3115 6911 3931 2300 -3337 -6768 -3299 2057 5143 11208 11936 7665
4955G665p026l943j892M81J202K420L485K770K514K31n217l938K360J763N0M924
$$ 7665 639 -3304 -5196 -4715 -3513 -1093 2392 5162 7676 7907 2690 -1248 1112 2875 2925 7849
4939G849p16m279J79k696L834k100k561o059N374K299l426n697j394J682N72N504
$$ 7849 7133 2854 3033 337 4171 2071 -490 -6549 -1175 1124 -2302 -7999 -9393 -7711 -7139 -1635
4923a635J00m482k898O533L152j542m348m320l601J276nK215J538L238J314k816
$$ -1635 -1535 -6017 -8915 -2382 770 -772 -5120 -9440 -13041 -11765 -11770 -9555 -8017 -4779 -3465 -6281
4907f281M130M001R11p975k683j44K524Q739l740o121j637J179N089n08m937o42
$$ -6281 -2151 1850 2761 -5214 -7897 -8041 -5517 3222 -518 -6639 -8276 -7097 -2008 -2516 -7453 -8095
4891h095j451L338K583L774l363k307J397J842Q066O653M229q450r555m723J1572
$$ -8095 -9546 -6208 -3625 149 -3214 -5521 -4124 -2282 5784 12437 16666 8216 -1339 -6062 5510
4876E510O980k563p039k919m988m23l161r086J197O049L204L354k894J05k138
$$ 5510 12490 9927 2888 -31 -5019 -5442 -8603 -17689 -16492 -10443 -7239 -3885 -6779 -6674 -8812
4861h812k018N487L865l417O86L014n564l488K07j947M235N411N157J666m47k52
$$ -8812 -10830 -5343 -1478 -4895 -4209 -1195 -6759 -10247 -10040 -11987 -7752 -2341 2816 4482 4035 3783
4845C783k577J471j147q13Q45m28l730o14m173P282M659K742o112P92K641p67
$$ 3783 1206 2677 1530 717 1562 1134 -2596 -3210 -7383 -101 4558 7300 1188 1980 4621 3854
4829C854l138K229J03m904k925n82J50M038J70p054l825J840N526M177j196K640
$$ 3854 716 2945 3048 -1856 -4781 -5363 -5213 -1175 -1005 -8059 -11884 -10044 -4518 -341 -1537 1103
4813A103J39o577o913J946M714l355j96L65L948J960J032N502K424n454m467P17
$$ 1103 1242 -5335 -12248 -10302 -5588 -8943 -9139 -8774 -4826 -2866 -1834 3668 6092 638 -3829 -3112
4797c112r25K498O199M18o844O28K226J632p79l007l955J131J018L880N22o201
$$ -3112 -4037 -1539 4660 5078 -1766 -1138 1088 2720 1941 -1066 -5021 -3890 -2872 1008 1530 -4671
4781d671l910j777O576J727j51K036M18M060M047m48q708p543O562K797k56M268
$$ -4671 -8581 -10358 -3782 -2055 -2206 -170 248 4308 8355 7907 -801 -8344 -1782 1015 759 5027
4765E027Q143L322m73o673R08r774j889J272J78L350M622J524o019j210L664m337
$$ 5027 13170 16492 16019 9346 10254 480 -1409 -137 41 3391 8013 9537 3518 2308 5972 1635
4749A635j509N70K055R98m862J491J586M112O346n83j62k899m245m622l113r14
$$ 1635 126 696 2751 3749 -1113 378 1964 6076 12422 11839 11677 8778 4533 -89 -3202 -4116
4733d116j677O114K098M474M674l444j272K465J479k684J58m207q815j547K911
$$ -4116 -5793 321 2419 6893 11567 8123 6851 9316 10795 8111 8269 4062 -4753 -6300 -3389
4718c389N855K67j435J67m679m286N152L723o1j164k538n076K865m417k451M823
$$ -3389 2466 2733 1298 1465 -3214 -7500 -2348 1375 1314 150 -2388 -7464 -4599 -9016 -11467 -6644
4702f644O366R62o887K773m979K549N349l046n365R15j339M424N907K455j762
$$ -6644 -278 684 -6203 -3430 -8409 -5860 -511 -3557 -8922 -8007 -9346 -4922 985 3440 1678
4687A678O319j02p553n38l45j340o327K440J0959Q447l873k127l416N519J575
$$ 1678 7997 7895 342 -196 -541 -1881 -8208 -5768 5191 13638 9765 7638 4222 9741 11316
4672A1316L352J447r430j974N614l322n638m730l472l418k87L733M713l890N834
$$ 11316 14668 16115 6685 4711 10325 7003 1365 -3365 -6837 -10255 -10542 -6809 -2096 -5986 -152
4657a52j123k856L528K514o356N54N571k417R426Q551l129k191q2m587o30M206
$$ -152 -1275 -4131 -603 1911 -4445 -3891 1680 -737 8689 17240 14111 11920 11838 7251 6621 10827
4641A0827l399p650p862N181L413N826K525K486O21m96l949m754p80J267l700
$$ 10827 7428 -222 -8084 -2903 510 6336 8861 11347 11968 11472 7523 2769 1989 3256 -444
4626d44o215k332k537J640N994J3461O374k684n198l828O73L044K975o561l338
$$ -444 -6659 -8991 -11528 -9888 -3894 9567 15941 13257 8059 4231 4904 7948 10923 4362 1024
4611A024Q859J604n706n638J680J028j07l12L294l206m391J09L012l639l961J886
$$ 1024 9883 11487 5781 143 1823 2851 2744 2432 5726 2520 -1871 -1762 1250 -2389 -6350 -4464
4595d464L306L704M185M053o072l747n4N762J744o267o819L435K224o013K402
$$ -4464 -1158 2546 6731 10784 4712 965 911 6673 8417 2150 -4669 -1234 990 -5023 -2621
4580b621N266j332q299k557J2927L354m347L017J334J326j1554n624k270P271
$$ -2621 2645 1313 -6986 -9543 3384 6738 2391 5408 6742 8068 -3486 -9110 -11380 -4109
4566d109N894j036m032p87L516N972P84k376Q58L106o07K761m945o18K078k113
$$ -4109 1785 749 -3283 -4070 -554 5418 6202 3826 4684 7790 7183 9944 4999 4381 6459 4346
4550D346n226K311O74j414J466k251o056k269L303K687P294O134l637j828j169
$$ 4346 -880 1431 2105 691 2157 -94 -6150 -8419 -5116 -2429 4865 10999 7362 5534 4365
4535D365J875k45m839M145m209r395r134N030L017p003J463P118N336O648l932
$$ 4365 6240 5995 1156 5301 1092 -8303 -17437 -12407 -9390 -16393 -14930 -7812 -2476 4172 240
4520B40J612J499n613o733K078Q687M19o663m436K417L60n931Q030O713M569j584
$$ 240 1852 3351 -2262 -8995 -6917 1770 2189 -4474 -8910 -6493 -6133 -12064 -4034 2679 7248 5664
4504E664m687j000O957k729n100J054J421L71j511L773N850k678q124o503kJ712
$$ 5664 977 -23 6934 4205 -895 159 1580 1951 440 4213 10063 7385 -739 -7242 -7244 -5532
4488e532k056K624K046m08N4n96j148L93p082L960m274J026M001J1625J6k697
$$ -5532 -7588 -4964 -2918 -3326 -3272 -3868 -5016 -4623 -11705 -7745 -12019 -10993 -6992 4633 4649 1952
4472A952k077J54N46P19O41n069o24k322n383j232M166J043J791O782N658k232
$$ 1952 -125 29 575 1294 1935 -3134 -3758 -6080 -11463 -12695 -8529 -7486 -5695 1087 6745 4513
4456D513p123J400k406n77K19L118j56J517J27J871N433N15m551j231L446k711
$$ 4513 -2610 -1210 -3616 -4193 -3974 -856 -1012 505 632 2503 7936 8451 3900 2669 6115 3404
4440C404J88M939n037m728M24M796L575J786N005j0243K763K9K149k000k266n411
$$ 3404 3592 8531 3494 -1234 -810 3986 7561 9347 14352 4109 6872 6901 9050 7050 4784 -627
4424f27o613n573J673O268L490O50L066Q54J016n757j871M581j40k391n0K267
$$ -627 -7240 -12813 -11140 -4872 -1382 -732 2334 3188 4204 -1553 -3424 1157 1017 -1374 -1424 843
4408H43L834n880k059M445M040J5n002J58M836K850L648l302J88J912p371O48
$$ 843 4677 -1203 -3262 1183 5223 5238 236 394 5230 8080 11728 8426 8614 10526 3155 3803
4392C803n29k605M213K60n215k355r32J485m34P866L055j002j383p828q32K685
$$ 3803 3274 669 4882 5142 -73 -2428 -3360 -1875 -2309 5557 8612 7610 6227 -1601 -2433 252
4376B52n58m945l298l707o345P765L064p52M82p69l842K438N96P695J444m662
$$ 252 -306 -5251 -8549 -12256 -18601 -10836 -7772 -8524 -8042 -8811 -12653 -10215 -9619 -1924 -480 -5142
4360e142J211o594r398O285Q521M058O306N212k113q545j0898O571M399P264l263
$$ -5142 -3931 -10525 -19923 -13638 -5117 -1059 5247 10459 8346 -199 -11097 -4526 -127 7137 3874
4345C874o108O041J832L268r59j187p000k446J275K509M734r20j067k309l692
$$ 3874 -2234 3807 5639 8907 7948 6761 -239 -2685 -1410 1099 5833 4913 3846 1537 -2155
4330b155K594K403m094l191l452N272L12J719K67l196r2K185n07q13M915O694
$$ -2155 439 2842 -1252 -4443 -7895 -2623 -2311 -592 -325 -3521 -3613 -1428 -1935 -2748 2167 8861
4314H861k862p152k639K205R20j270l571N895m4L717O866M028l824n356N096o36
$$ 8861 5999 -1153 -3792 -1587 -667 -1937 -5508 387 343 4060 10926 14954 11130 5774 10870 10234
4298A0234m455n293j263j007l236K341j851l72O802K195N270J208k615n504l064
$$ 10234 5779 486 -777 -1784 -5020 -2679 -4530 -4902 1900 4095 9365 10573 7958 2454 -610
4283f10N34j720J612K633J171R92J946K361k426n841j538O12J00p09k209L132
$$ -610 -76 -1796 -184 2449 3620 4612 6558 8919 6493 652 -886 -274 -174 -883 -3092 40
4267D0P761K390l467o95m4j418R31K179o112N59J830K416l806j804M147K927J621
$$ 40 7801 10191 6724 6029 5985 4567 5498 7677 1565 2124 3954 6370 2564 760 4907 7834 9455
4250I455k720n427r407k892K859P578O659J1371L606n225q679k881j975q39j2485
$$ 9455 6735 1308 -8099 -10991 -8132 -554 6105 17476 21082 15857 7178 4297 2322 1483 -11002
4235a1002n88O40M013K098K158K047l543k006J986M718o00m018N538R13m324l293
$$ -11002 -11590 -10950 -6937 -4839 -2681 -634 -4177 -6183 -4197 521 -79 -4097 1441 2354 -1970 -5263
4219e263P244L507m215M729K734r620m528L008O670M666j366k690n539n114j966
$$ -5263 1981 5488 1273 6002 8736 -884 -5412 -2404 4266 8932 7566 4876 -663 -5777 -7743
4204g743J311M103l87o096M483L541M385j985K575k274l021K146l474N945P841
$$ -7743 -6432 -2329 -2716 -8812 -4329 -788 3597 1612 4187 1913 -1108 1038 -2436 3509 11350
4189A1350L487k609l966l150n545r60l92Q56k139K378j309J08k948O423j788Q50
$$ 11350 14837 12228 8262 5112 -433 -1393 -1785 -929 -3068 -690 -1999 -1891 -4839 1584 -204 646
4173F46L026N3r94L59p432l972M944M495j878j0345L368J2682O496J259Q02j811
$$ 646 3672 3725 2731 3090 -4342 -8314 -3370 1125 -753 -11098 -7730 4952 11448 12707 13509 11698
4157A1698l8q49n461o275P108j373m905K425Q75j290L568l02o307m72j111J665
$$ 11698 11660 10811 5350 -925 6183 4810 -95 2330 3205 1915 5483 5181 -1126 -1598 -2709 -1044
4141a044J854R76k681K004J825K909o411l208J160O53P232K655M468j85p421n029
$$ -1044 810 1786 -895 1109 2934 5843 -568 -3776 -2616 -1963 5269 7924 12392 12207 4786 -243
4125b43K136l680L49K515j989q273j342N023N917M364L909m613M031k668n749
$$ -243 1893 -1787 -1438 1077 -912 -9185 -10527 -5504 413 4777 8686 4073 8104 5436 -313
4110c13M662P18l352K691j189K140j206n057m78m849q926r7J0835K358j203k099
$$ -313 4349 5067 1715 4406 3217 5357 4151 -906 -1384 -6233 -15159 -15256 -4421 -2063 -3266 -5365
4094e365p052J281J0601j8K376K372m049O182j274R30n90n082J858l115j408l740
$$ -5365 -12417 -11136 -535 -553 1823 4195 146 6328 5054 5984 5394 312 2170 -945 -2353 -6093
4078f093J406P167K277n009m789J835J748J387m866K700n90o168J306Q104R691
$$ -6093 -4687 2480 4757 -252 -5041 -3206 -1458 -71 -4937 -2237 -2827 -8995 -7689 415 10106
4063A0106K462q623p355J534L299M104o79L57J361l544n155j78m87k293J991l113
$$ 10106 12568 3945 -3410 -1876 1423 5527 4848 5205 6566 3022 -2133 -2311 -2798 -5091 -3100 -6213
4047f213r571L585J1480J0600m70n956P2L77l040j002l872n73N153m371m728P343
$$ -6213 -15784 -12199 -719 9881 9411 3455 3527 3904 864 -138 -4010 -4583 570 -3801 -8529 -1186
4031a186J260j832L478N628K534n127J202k741m720J712N538l382l322L831m4
$$ -1186 74 -1758 1720 7348 9882 4755 5957 3216 -1504 208 5746 2364 -958 2873 2829
4016B829n20q362l667J540L668O608N715J974K823J567m575k88K473M845m725
$$ 2829 2309 -6053 -9720 -8180 -4512 2096 7811 9785 12608 14175 9600 9312 11785 16630 11905
4001A1905p809n247K648K533k851M605N933l527j665Q297p76m904k470p659J185
$$ 11905 4096 -1151 1497 4030 1179 5784 11717 8190 6525 14822 14046 9142 6672 -987 198
3986A98O931j54m791m043l705k276M558K823n682J159j462k369L179m440O417
$$ 198 7129 6975 2184 -1859 -5564 -7840 -3282 -459 -6141 -4982 -6444 -8813 -5634 -10074 -3657
3971c657O715n75j281n308j454l227R33L61K146P513O507n042m994o21o711r9
$$ -3657 3058 2483 1202 -4106 -5560 -8787 -7854 -7493 -5347 2166 8673 3631 -1363 -1984 -8695 -8794
3955h794K485m46J579J135J296k549n096N628L106l266q63l796L89O801J2183
$$ -8794 -6309 -6755 -5176 -4041 -2745 -5294 -10390 -4762 -1656 -4922 -5785 -9581 -9192 -2391 9792
3940I792O112m820r472l646l560j154O673K181j964k853K649L482k32M047n748
$$ 9792 15904 11084 1612 -2034 -5594 -6748 -75 2106 142 -2711 -62 3420 3188 7235 1487
3925A487k898J453l11N752K650Q26r28J359m777k727K775o02n443j285J049N434
$$ 1487 -1411 42 -269 5483 8133 8959 8031 9390 4613 1886 4661 4059 -1384 -2669 -1620 3814
3909C814L336N30m981m046M143K700k693R199N910K354q158r081O810k806o763
$$ 3814 7150 7680 2699 -1347 2796 5496 2803 12002 17912 20266 12108 3027 9837 7031 268
3894B68j184J299K179J281j558P48j120k816o319l668j000O61N004L211Q30O630
$$ 268 -916 383 2562 3843 2285 3033 1913 -903 -7222 -10890 -11890 -11229 -6225 -3014 -2184 4446
3878D446j739k581l370L491M878K418l613q9J903K409l009n276m505M615K544
$$ 4446 2707 126 -3244 247 5125 7543 3930 3841 5744 8153 5144 -132 -4637 -22 2522
3863B522J212n073j966J239l622K417P400P312o180j4359L98J0706K7l507J653
$$ 2522 3734 -1339 -3305 -2066 -5688 -3271 4129 11441 5261 -9098 -8700 2006 2033 -1474 179
3848A79M06N043L278K234j2146Q25M532M441J194M739o29n550q157m186N59M382
$$ 179 585 5628 8906 11140 -1006 -181 4351 8792 9986 14725 14096 8546 389 -3797 -3238 1144
3832A144P45k021j439k088l152j820J12L684K90l059M147L797L49l066L268L415
$$ 1144 1889 -132 -1571 -3659 -6811 -8631 -8519 -4835 -4545 -7604 -3457 340 689 -2377 891 4306
3816D306M1j508j1812m277l69P455J5064O468J809l335j969j148p836n026k705
$$ 4306 4347 2839 -8973 -13250 -13619 -6164 8900 15368 17177 13842 11873 10725 2889 -2137 -4842
3801d842L84o24L314K801M379O91m14k59k576o013J826M425K544j403O786j592
$$ -4842 -4458 -5082 -1768 1033 5412 6103 5689 5430 2854 -3159 -1333 3092 5636 4233 11019 9427
3785I427j134K730j293o532L40R93k441l918o72R56J356O93p4K417l8m302k661
$$ 9427 8293 11023 9730 3198 3538 4531 2090 -1828 -2500 -1544 -188 505 431 2848 2810 -1492 -4153
3768d153o37k203N584L759K135L867M793l008n905l274n826J766j396L957M705
$$ -4153 -4790 -6993 -1409 2350 4485 8352 13145 10137 4232 958 -4868 -3102 -4498 -541 4164
3753D164Q699R270p421l677j646m280q471J396K789J913N429Q71o250k189K399
$$ 4164 12863 22133 14712 11035 9389 5109 -3362 -1966 823 2736 8165 9036 2786 597 2996
3738B996M151o364r766l316O579N748m240J264L205o473J036m44O66J1045L362
$$ 2996 7147 783 -8983 -12299 -5720 28 -4212 -2948 257 -6216 -5180 -5624 -4958 6087 9449
$$ [...]
##END NTUPLES=NMR SPECTRUM
##END=
