##TITLE=Analysis number 324916
Compound Code mo 07946
Book Reference 451/193
Project Code adrs
Chemist Name evam
##JCAMPDX= 6.0         $$ Bruker NMR JCAMP-DX V2.0
##DATA TYPE= NMR SPECTRUM
##DATA CLASS= NTUPLES
##ORIGIN= Bruker BioSpin GmbH
##OWNER= nmr
$$ XWIN-NMR		Version 3.5
$$ Tue Dec  5 10:22:54 2006 GMT Standard Time (UT+0h)  MAYBRIDGE\nmr@NMR_250MHZ
##.OBSERVE FREQUENCY= 250.131544655141
##.OBSERVE NUCLEUS= ^1H
##.ACQUISITION MODE= SIMULTANEOUS (DQD)
##.ACQUISITION SCHEME= undefined
##.AVERAGES= 16
##.DIGITISER RES= 18
##SPECTROMETER/DATA SYSTEM= dpx250
##.PULSE SEQUENCE= zg30
##.SOLVENT NAME= CDCl3
##.SHIFT REFERENCE= (INTERNAL, CDCl3, 0, 16.4475)
##AUDIT TRAIL= $$ (NUMBER, WHEN, WHO, WHERE, WHAT)
$$ ##TITLE= Audit trail, XWIN-NMR		Version 3.5
$$ ##JCAMPDX= 5.01
$$ ##ORIGIN= Bruker BioSpin GmbH
$$ ##OWNER= nmr
$$ C:\u/data/dgb/nmr/ADRS/310/pdata/1/auditp.txt
$$ ##AUDIT TRAIL=  $$ (NUMBER, WHEN, WHO, WHERE, WHAT)
(   1,<2006-12-05 10:22:31.24 +000>,<MAYBRIDGE\nmr>,<NMR_250MHZ>,
      <created by zg, POWCHK disabled, PULCHK disabled
       configuration hash MD5:
       49 4B E0 1D 92 C2 6B 37 9F E6 65 BC 52 41 86 1D
       data hash MD5: 64K
       6A E8 D2 34 89 B9 89 70 EB 93 B0 73 5F 26 95 B6>)
(   2,<2006-12-05 10:22:44.39 +000>,<MAYBRIDGE\nmr>,<NMR_250MHZ>,
      <Start of raw data processing
       ef LB = 0.3 FT_mod = 6 PKNL = 1 SI = 32K 
       data hash MD5: 32K
       CC FA 0B 14 F5 EE 7D 6F 5D FD D6 FA DA F4 C9 76>)
(   3,<2006-12-05 10:22:46.13 +000>,<MAYBRIDGE\nmr>,<NMR_250MHZ>,
      <apk 
       data hash MD5: 32K
       21 F6 26 83 34 58 64 55 85 E4 B1 4C 7D C6 EE 2D>)
(   4,<2006-12-05 10:22:46.83 +000>,<MAYBRIDGE\nmr>,<NMR_250MHZ>,
      <abs ABSG = 5 
       data hash MD5: 32K
       EE 43 F7 66 4A 5F 08 0D F5 E4 E8 6F 28 94 BE 3C>)
$$ ##END=
$$ 
$$ hash MD5
$$ EC 3E DD 56 74 26 FD 98 44 66 09 8E 74 01 32 A7
##$RELAX= 
##$RELAX= 
##$RELAX= 
##$RELAX= 
##$RELAX= 
##$RELAX= 
##$RELAX= 
$$ Bruker specific parameters
$$ --------------------------
##$DU= <C:\u>
##$EXPNO= 310
##$NAME= <ADRS>
##$PROCNO= 1
##$TYPE= <nmr>
##$USER= <dgb>
##$AMP= (0..31)
100 100 100 100 100 100 100 100 100 100 100 100 100 100 100 100 100 100 
100 100 100 100 100 100 100 100 100 100 100 100 100 100 
##$AQSEQ= 0
##$AQ_mod= 3
##$AUNM= <au_zg>
##$AUTOPOS= <34 >
##$BF1= 250.13
##$BF2= 250.13
##$BF3= 250.13
##$BF4= 250.13
##$BF5= 500.13
##$BF6= 500.13
##$BF7= 500.13
##$BF8= 500.13
##$BYTORDA= 1
##$CFDGTYP= 0
##$CFRGTYP= 5
##$CHEMSTR= <none>
##$CNST= (0..31)
1 1 145 1 1 1 1 1 1 1 1 1 1 1 1 1 1 1 1 1 1 1 1 1 1 1 1 1 1 1 1 1 
##$CPDPRG= <>
##$CPDPRG1= <>
##$CPDPRG2= <>
##$CPDPRG3= <>
##$CPDPRG4= <mlev>
##$CPDPRG5= <mlev>
##$CPDPRG6= <mlev>
##$CPDPRG7= <mlev>
##$CPDPRG8= <mlev>
##$CPDPRGB= <>
##$CPDPRGT= <>
##$D= (0..31)
0 1 0 0 0 0 0 0 0 0.06 0 0 0 0 0 0 0.0002 0 0 0 0 0 0 0 0 0 0 0 0 0 0 
0 
##$DATE= 1165314150
##$DBL= (0..7)
120 120 120 120 120 120 120 120 
##$DBP= (0..7)
150 150 150 150 150 150 150 150 
##$DBP07= 0
##$DBPNAM0= <>
##$DBPNAM1= <>
$$ [...]
##$SUBNAM7= <"">
##$SUBNAM8= <"">
##$SUBNAM9= <"">
##$SW= 20.6930455092707
##$SWIBOX= (0..15)
0 0 3 0 0 0 0 0 0 0 0 0 0 0 0 0 
##$SW_h= 5175.983436853
##$TD= 65536
##$TD0= 1
##$TE= 294.16
##$TE2= 300
##$TE3= 300
##$TEG= 300
##$TL= (0..7)
0 120 120 120 120 120 120 120 
##$TP= (0..7)
150 150 150 150 150 150 150 150 
##$TP07= 0
##$TPNAME0= <>
##$TPNAME1= <>
##$TPNAME2= <>
##$TPNAME3= <>
##$TPNAME4= <>
##$TPNAME5= <>
##$TPNAME6= <>
##$TPNAME7= <>
##$TPOAL= (0..7)
0.5 0.5 0.5 0.5 0.5 0.5 0.5 0.5 
##$TPOFFS= (0..7)
0 0 0 0 0 0 0 0 
##$TUNHIN= 0
##$TUNHOUT= 0
##$TUNXOUT= 0
##$USERA1= <user>
##$USERA2= <user>
##$USERA3= <user>
##$USERA4= <user>
##$USERA5= <user>
##$V9= 5
##$VALIST= <valist>
##$VCLIST= <CCCCCCCCCCCCCCC>
##$VD= 0
##$VDLIST= <DDDDDDDDDDDDDDD>
##$VPLIST= <PPPPPPPPPPPPPPP>
##$VTLIST= <TTTTTTTTTTTTTTT>
##$WBST= 1024
##$WBSW= 4
##$XGAIN= (0..3)
0 0 0 0 
##$XL= 0
##$YL= 0
##$YMAX_a= 454345
##$YMIN_a= -505713
##$ZGOPTNS= <>
##$ZL1= 120
##$ZL2= 120
##$ZL3= 120
##$ZL4= 120
##$ABSF1= 16.44755
##$ABSF2= -4.245623
##$ABSG= 5
##$ABSL= 3
##$ALPHA= 0
##$AQORDER= 0
##$ASSFAC= 0
##$ASSFACI= 0
##$ASSFACX= 0
##$ASSWID= 0
##$AUNMP= <proc_1d>
##$AZFE= 0.1
##$AZFW= 0.1
##$BCFW= 0
##$BC_mod= 0
##$BYTORDP= 0
##$COROFFS= 0
##$CY= 12.5
##$DATMOD= 1
##$DC= 0
##$DFILT= <>
##$DTYPP= 0
##$F1P= 14.0000005364418
##$F2P= -0.99999901652339
##$FCOR= 0.5
##$FTSIZE= 32768
##$FT_mod= 6
##$GAMMA= 0
##$GB= 0
##$INTBC= 1
##$INTSCL= 1
##$ISEN= 128
##$LB= 0.3
##$LEV0= 0
##$LPBIN= 0
##$MAXI= 10000
##$MC2= 0
##$MEAN= 0
##$ME_mod= 0
##$MI= 0
##$NCOEF= 0
##$NC_proc= -3
##$NLEV= 6
##$NOISF1= 0
##$NOISF2= 0
##$NSP= 0
##$NTH_PI= 0
##$NZP= 0
##$OFFSET= 16.44755
##$PC= 1
##$PHC0= 224.2984
##$PHC1= 8.196983
##$PH_mod= 1
##$PKNL= yes
##$PPARMOD= 0
##$PSCAL= 4
##$PSIGN= 0
##$REVERSE= no
##$SF= 250.130018620939
##$SI= 32768
##$SIGF1= 0
##$SIGF2= 0
##$SINO= 400
##$SIOLD= 32768
##$SREGLST= <1H.CDCl3>
##$SSB= 0
##$STSI= 32768
##$STSR= 0
##$SW_p= 5175.98343685301
##$SYMM= 0
##$S_DEV= 0
##$TDeff= 65536
##$TDoff= 0
##$TI= <Analysis number 999999
Compound Code 99
Book Reference 9
Project Code 9>
##$TILT= no
##$TM1= 0
##$TM2= 0
##$TOPLEV= 0
##$USERP1= <user>
##$USERP2= <user>
##$USERP3= <user>
##$USERP4= <user>
##$USERP5= <user>
##$WDW= 1
##$XDIM= 32768
##$YMAX_p= 310125534
##$YMIN_p= -116723
$$ End of Bruker specific parameters
$$ ---------------------------------
##NTUPLES= NMR SPECTRUM
##VAR_NAME=  FREQUENCY,     SPECTRUM/REAL,   SPECTRUM/IMAG
##SYMBOL=    X,             R,               I
##VAR_TYPE=  INDEPENDENT,   DEPENDENT,       DEPENDENT
##VAR_FORM=  AFFN,          ASDF,            ASDF
##VAR_DIM=   32768,         32768,           32768
##UNITS=     HZ,            ARBITRARY UNITS, ARBITRARY UNITS
##FACTOR=    0.157963299565203, 1,           1
##FIRST=     4114.02594273199, 0,            0
##LAST=      -1061.95749412102, 0,           0
##MIN=       -1061.95749412102, -116723,     0
##MAX=       4114.02594273199, 310125534,    0
$$ Real data points
##PAGE= N=1
##DATA TABLE= (X++(R..R)), XYDATA
$$ [...]
20036b2047J1795J5100q096k8404L156n743K4389K8748P083j092k2562p681J0096
20023D742N68j0734R129P503N070j1480J6021R773l7291n791P784M7602J1421
20010E4317k6193k3812J4976j119o149m883j3957J2304J1159r637J0216j2946
19998D276j1901L3414J5994j2168l1261j8127j3350Q831m118K5634K3997j0656
19986A0565j3540O546J9019J7842r470j4823p724k6374l6297O704K2853K060k1459
19973d4098j8954K5710R021J8235m611Q650K9899Q929p915j2299j1129j4849m662
19960a8073J8124m431k9749P618J9681k0281N553K617k0729m893j2316r984P698
19947e9165L1612Q984J5313N602P066J8949J5316J0491k690l8343J734P343j7731
$$ y = [-22047, -10252, 4848, -3248, -31652, -28496, -34239, -9850, 18898, 25981, 24889, 2327, -5354, 4742, 5310, -5424, 3705, 11208, 16278, 4798, 20819, 30592, -6699, -12490, -4706, 42896, 54317, 28124, 4312, 19288, 18169, 12020, 7137, -6820, 5484, 16643, 7006, 17222, 4276, -7625, 25789, 41783, 29615, -1646, -19773, -33123, -24292, -28410, -2776, 21221, 10565, -2975, 3571, 22590, 40432, 30962, 16139, 8415, -17959, -54256, -47552, -24699, -22639, -44098, -63052, -37342, -28321, -10086, -14697, -6047, 23852, 32781, 24866, 12567, 1438, -13411, -18073, 51, -4380, -34129, -26511, -6830, -27111, -21558, -18941, -39670, -44563, -56879, -66863, -59165, -27553, -18569, -3256, 2346, 9412, 28361, 43677, 54168, 51478, 13135, 14869, 22212, 4481]
19934D481R0Q760j3374j4271K9369l775J3218R231k729R937j9090K641J0772r240
19920B6020k8386l4765K0492K5830K5568k7356J474j8295m4036j1611K7978L1768
19908e319K0619j1290K2122p463R891K056j8908j3827J5937K0875J5257m3220
19896F730l7016L3567M0821j726k2175J668j2367j1311j9604J3268M2277l776
19884C0356j1814J708K0008n690n5097j4129K7776J1618L0771M792j9677Q456
19872B9078M192j8789O010N702J4579Q840l9550j695K5346k8818m1919k757J0615
19859b9166J9324L9308k2010j9000j50n544L618p163p642M60J1081J7618K9765
19846C0499j2131p214k0133J9455L0815K911j8693j5571N857M729n852j2272j4781
$$ y = [4481, 4571, 13331, -43, -14314, 15055, 11280, 24498, 33729, 31000, 40937, 21847, 24488, 35260, 26020, -2366, -37131, -16639, 9191, 34759, 7403, 8877, -9418, -53454, -65065, -37087, -5319, 15300, 4010, 26132, 18669, 28560, 30616, 11708, -2119, 13818, 34693, 49950, 6730, -30286, 3281, 44102, 42376, 20201, 21869, 9502, -1809, -21413, -8145, 34132, 30356, 18542, 20250, 40258, 34568, -20529, -34658, -6882, 4736, 35507, 40299, 20622, 29078, 33270, 14481, 20491, 26193, 40772, 49612, 10062, 8367, 33713, 4895, -37024, -39781, -29166, -9842, 29466, 7456, -11544, -11694, -17238, -13620, -20783, -28425, -27965, -16884, 734, 30499, 18368, 11154, -8979, 10476, 41291, 44202, 25509, 9938, 15795, 20524, 14672, 2400, -12381]
19833a2381o205K5786N782j5812O476L876m8579J683K9835J4548l590R359K3593
19820C4371Q308k2641o754R438K0650k9062p65j750k7508J6990j1919J2165m624
19807c101r974q30L0758n036l328P031q507j3108j0883J8297O533j5758j1678
19794a9584J7532L6375L553M695j4115j6599K203j0991j2491l761J8481r277m253
19781h232o538R234J6579J2043k5389j0620M7898n280j5497j8879J1699J3101
19769B0119J3112j5827J4190k0358J3607L714l423R263k2849l346R560j6500l7402
19756c6140M363N830l428l507j6059p619J5904K3011L0546N850K2188N032J042
19743D7013r397j4085j6449p98J073l184J0042L4532j6024J0269K2447j3510k1971
$$ y = [-12381, -18586, 7200, 12982, -2830, 3646, 7522, -41057, -39374, -9539, 5009, 1419, 10778, 34371, 42679, 20038, 13284, 22722, 43372, 14310, 13545, 11795, -15713, 1277, -10642, 1523, -3101, -13075, -13905, 16853, 11817, 8489, 15520, 7013, -6095, -16978, 1319, 7852, -7906, -19584, -2052, 34323, 37876, 42571, 28456, 11857, 14060, 3069, -9422, -13183, 5298, -3979, -8232, -14770, -5536, 11043, 23086, -2303, -12923, 34975, 29695, 14198, -4681, 7018, 20119, 33231, 17404, 31594, 11236, 24843, 28557, 25134, 34397, 11548, 8202, 17762, 1262, -36140, -31777, -25947, -29375, -32882, -48941, -56560, -40656, -17645, 12901, 18751, 40939, 45971, 47013, 37616, 23531, 7082, 6284, 7357, 4173, 14215, 48747, 32723, 42992, 65439, 51929, 29958]
19730B9958o604o771R333j9212k5017j051K6059K2287K1194o851o120O583k7581
19717A6207k471J4582P466L153j2029p474j2837k5576J8975J690L516Q942N038
19704A9182J0473j5057l1720k5970Q792J7268R991q691j9672J1002Q133j7443
19692c3712j148L421m877o947K4154M9163j4575j6107K991J1570L5787j6283j6697
19679A6740N887l4861j2892J8701L0280L851q564j8019j9723J532L2930L059j7866
19666A055j1795r571p99K6358K232j4151j0621J9719J3356K860k062j0993k6335
19653b0747P535M487L100q674N884k0308k7376K9015L4527M3839n010j2610L801
19640C7463q902m8379j47O891J5280j3913p469K1557J1824R734j2714Q882l870
$$ y = [29958, 23354, 16583, 25916, 6704, -18313, -19364, 6695, 28982, 50176, 43325, 37205, 43788, 16207, 13736, 28318, 35784, 38937, 26908, 19434, 6597, -18979, -4, 1686, 5202, 14144, 19182, 29655, 14598, -17122, -43092, -34300, -17032, -7041, -15732, -35404, -24402, -16269, -33712, -34860, -31439, -36316, -43263, -19109, 30054, 15479, -628, 2363, 13933, 49720, 33437, 16740, 22627, -12234, -25126, -6425, 23855, 27706, 19142, 1123, -18600, -17068, 15862, 18921, 1055, -10740, -20311, -21110, 5248, 7480, -6671, -17292, 2427, 15783, 18643, 16581, 5588, -20747, -13212, -8725, -5625, -14299, -8415, -28723, -56099, -27084, 7443, 51282, 46272, 33662, 37463, 28561, -19818, -19965, -13074, 2206, -11707, -19176, 2381, 14205, 23939, 11225, 20107, 16237]
19627A6237j5175rJ8618j1830M046R373L001K0405P848j7255K2943K2754k2245
19614E8711k7467l9983j9251M0257L3810N654k2222l4481j4603j445M6581L8485
19602F4046k157k8283l593R846j1679m6802q178K7533j16J5528j784l3093j7314
19589c6046j145J3078M0161J7564l7171j2933L9624k4262k0366k0205L5520L6387
19577C0206k8126k3376k258P583J0661P766M495j1569N290p617l5459R801K1759
19564a0844J4410q184L917J9055n549k4275o669K606J1178Q36J3660j7872j7063
19551b4794K6005Q897L3960j3055k6735o938P563q914R899J6204K302l999j3408
19538F987Q149L4896j6860Q752k6344J2271J5752l2153J2088M013k1874n746O548
$$ y = [16237, 1062, 1053, 19671, 7841, 11887, 21260, 24261, 44666, 52514, 35259, 58202, 80956, 58711, 31244, -8739, -27990, 12267, 46077, 51731, 29509, -4972, -19575, -21020, 25561, 64046, 61889, 33606, 30013, 39859, 28180, -18622, -26800, 733, 617, 16145, 14361, -18732, -36046, -37191, -24113, 16048, 33612, -3559, -16492, 23132, -1130, -21496, -41701, -6181, 30206, 2080, -21296, -23554, -15971, -5310, 2456, 6951, -4618, 672, -6945, -42404, -32603, -10844, 3566, -4618, -701, 18354, 12805, -11470, -18139, -15533, -4355, -3519, 10141, -7731, -24794, 1211, 10108, 44068, 31013, 4278, -2660, 4903, -4011, 5888, 22092, 24394, 20395, 6987, 15136, 50032, 33172, 41924, 15580, 27851, 43603, 11450, 23538, 27551, 5677, -69, 6479]
19525F479L324L555O477j1471k4586J8332J9321m786p981j7954r336K2339K2400
19512B6113L464k0807k3812J4388j346J1711L3585j503j1156K8216Q936k8087
19500C9702m6005o626L1819J2517o117p653l546J1593r440N236J0798N576k3409
19487A4445k6432J8456Q495j3234l137J0398J90j6978L530m35K897j4706j5512
19474c2023J7490O536k006J8058N112J2277J4627R44l907l3962o250Q523r55J1897
19460A6361R076j7986j209J6887J6898j017m065k47k2258n5612K1747K2556q632
19447g501Q25J8979J0746j2717K1973k843L757j9396l1271k573N764j0413L1870
19434G200m018k439Q218J0442J1539j6891n576j100r443j0655O396O486J8227
$$ y = [6479, 9803, 13358, 19835, 8364, -16222, 2110, 21431, 16645, 8664, -9290, -18626, 3713, 26113, 29577, 8770, -15042, -654, -2000, 9711, 43296, 41793, 30637, 58853, 67789, 39702, -6303, -12929, 18890, 31407, 25290, 17637, 14091, 25684, 16244, 21480, 32278, 37854, 14445, -11987, 6469, 14964, 1730, -1407, 8991, 9181, -7797, -4267, -4702, -1805, -16511, -32023, -14533, -7997, -10003, 8055, 13167, 25444, 40071, 41015, 37108, 3146, -3104, 5419, 4464, 16361, 25437, 7451, 6242, 23129, 40027, 39010, 34945, 34698, 12440, -43172, -21425, 1131, -7501, -6676, 12303, 23049, 10332, 32305, 29462, 33219, 13823, -17448, -20021, -14257, -24670, 7200, 3182, 743, 8961, 19403, 30942, 14051, 8475, 7375, -2068, -12723, -6327, 159, 18386]
19421A8386j601j8638N251K8674J5617j7002k1898J4765q951N334J1523k939j1045
19408A7476K529j327N538J5252l0032n615o651j943K846J0547J295m519n392k5222
19394b5218n013J5168P51l6498J5455P549J2833J0402J1206k6474k4360Q435K4120
19381a1644L2172J2085L5972J8443l8417m1061k2705j6725L817K259J1931K1231
19369G358Q970J4270l0248l2259J8608J0818J7637l804K2427k1948J36q606j3268
19356i909M8692J9288r236j2876p607J5556k2675l3401K006N378j707J7198J0110
19343B0817K141o847j1742M0059j3642L867L1664l857n109j3166j1635q250M115
19330B8415K1142K3227j8540j4844J7606J0353j7792K155K9392P631o278k3268
$$ y = [18386, 16785, -1853, 3398, 32072, 47689, 30687, 8789, 23554, 14603, 19937, 31460, 28521, 17476, 20005, 18678, 24216, 39468, 9436, 3821, -2830, -4773, -1927, 8620, 9915, 5396, 4, -25218, -30231, -15063, -14312, -50810, -35355, -27806, -14973, -4571, 6635, -19839, -44199, -35764, -11644, 20528, 32613, 68585, 87028, 48611, 7550, -15155, -31880, -28063, -25804, -13873, 7358, 16328, 30598, 350, -31909, -13301, -2483, 15154, 11350, 33777, 11829, 11965, 3359, -9909, 38783, 58071, 48835, 35959, 28352, 43908, 21233, -12168, -10162, -4784, -6491, 10707, 20817, 22958, 16111, 4369, 44428, 30786, 34653, 66317, 62460, 57351, 44185, 32550, 24300, 28415, 49557, 72784, 54244, 39400, 57006, 67359, 49567, 51722, 81114, 88745, 82467, 59199]
19318E9199N265m705q662r129K3797K9027j7718j6947k630q60N6k0448k1798O003
19304B0450m394O585K9925K4319P018j1832q3j0142l1433k7458L170J1350j9551
19291b076j280p617N3254K6005L472k5868q779r222Q857K7050k2697j3487j7456
19278A0156J5595J1588N3250L1891m617k3315j3388K000M0168m229p351j4318
19266I7430J0411L481M711J9531J584Q812q977K0147N405k562K2171J8379j776
19253A98747J8665J9737L8688K8964L5730M4668M9532K5307N5308O0923P15l4797
19241E42187q845J7312K1582M2589K3275K4881K2498N884o412j0778m2772m9421
19229E81980p7223n0000K052j3715j9851q040l9142k2920m875m3660n7128j7600
$$ y = [59199, 64464, 59759, 51097, 41968, 65765, 94792, 77074, 60127, 57497, 56637, 56693, 36245, 14447, 20450, 16056, 22641, 52566, 76885, 83903, 72071, 71988, 61846, 30413, 2955, 6125, 17475, -2076, -3356, -10973, 42281, 68286, 71758, 45890, 37111, 27889, 36746, 63796, 41099, 27612, 10156, 25751, 37339, 90589, 122480, 117863, 94548, 81160, 83160, 123328, 119099, 111748, 97430, 107841, 111322, 116033, 135564, 137148, 145960, 136983, 157130, 162535, 159973, 182144, 200523, 198747, 217412, 237149, 275837, 304801, 340531, 385199, 434731, 460038, 515346, 576269, 576984, 542187, 533342, 550654, 572236, 614825, 638100, 662981, 685479, 691363, 684951, 674173, 631401, 581980, 504757, 454757, 456809, 443094, 423243, 415203, 376061, 353141, 348266, 304606, 247478, 229878]
19217B29878q763l3471k9011j5756j9861l8821l2046J8850J7170j9148N002K640
19205G6663J3676K4164Q770K7299p348k7237L50L6534N6113K0538q853j6745j9765
19192A84159l476K2166J2290J7514L2132j9205n380j0668L428o361j8626k4694
19180A83279o299j4721k6754J512K8707l986k9141m3512m887l049k6353j9245
19168C5551j1593j1455p98K435J3004j2772q927J4490O176k2990K2360J250o80
19155B6051N567K6909m2461L259O722J4626J9215o831R404l2165r727L853l6180
19142a1758M476K5378k9548j0880K9728J2621J5380L115L009l0869o995j3880
19130a0223K6046K6403L005K5343J2911j5373j0727J6102J3930q294l1888J0015
$$ y = [229878, 221115, 187644, 158633, 142877, 123016, 84195, 52149, 70999, 88169, 69021, 74023, 76663, 90339, 114503, 123273, 150572, 143224, 115987, 116337, 152871, 208984, 229522, 220669, 203924, 184159, 180683, 202849, 215139, 232653, 264785, 245580, 240200, 229532, 232960, 226599, 207973, 183279, 176980, 162259, 135505, 137017, 165724, 161738, 132597, 89085, 84198, 81149, 54796, 35551, 23958, 12503, 11705, 14140, 27144, 14372, 5445, 19935, 26111, 3121, 25481, 26731, 26051, 31618, 58527, 16066, 19325, 26047, 40673, 59888, 53057, 62461, 30296, 20569, 24422, -11758, -7282, 18096, -11452, -22332, 7396, 20017, 35397, 38512, 41521, 10652, 3657, -10223, 15823, 42226, 45231, 70574, 83485, 68112, 57385, 73487, 87417, 79123, 47235, 57250]
19118E7250m593Q482R558k1856k0610J4249J6321m994k6992k008p286J8795J0306
19105D6622N360L125M38r539j8014j2579j124j0670J0297L1139J6842P909L4371
19092A04177k1300m2995J9513J8262l770j4821j6269n186Q460J7060p788K0465
19080G5808j0647P498j956J9952k074k3728r238j1407k3063k674M0114j426j0447
19067D6712K0714P078l3604j3888J6116j3156j6797J2748K0758j2659O192J5158
19055E5372q884j6607m3591k5151J5909M1091K6800m458O341J0405r096J994j6244
19042C3881J4033Q207J5833p246k5675J305J8197j066j6584j7902K6005R904M37
19029E9329o426J1786J204j7826N086J8801L3244l3639l2422M2589P090n327J6690
$$ y = [57250, 52657, 61139, 70697, 48841, 28231, 42480, 58801, 53807, 26815, 24807, 17521, 36316, 46622, 51982, 55107, 55545, 46006, 27992, 15413, 14289, 3619, 13916, 45055, 61897, 69806, 104177, 82877, 39882, 59395, 77657, 73887, 59066, 42797, 37611, 46071, 63131, 55343, 75808, 65161, 72659, 70703, 90655, 88581, 64853, 55615, 44208, 21145, 18471, 58585, 57159, 46712, 67426, 74504, 40900, 27012, 43128, 29972, 13175, 25923, 46681, 34022, 40214, 55372, 46488, 29881, -13710, -38861, -22952, 18139, 44939, 40481, 46822, 57227, 48131, 50125, 33881, 47914, 56121, 71954, 64708, 39033, 40338, 58535, 57469, 40885, 22983, 48988, 58892, 59329, 52903, 64689, 65893, 48067, 53153, 71954, 105198, 71559, 39137, 81726, 88816, 83489, 100179]
19016A00179K199j572l2010j2935k1999P88K5016k5431l857j349P578J4281K2399
19003G3287R354j0418j4394j1746M219M0215J6926k4608o969Q576n372P578K926
18990H9574O136r954R980J0832J5033J814j5600j9795l7838j5010L1980M4534
18978A11686K9216p52k2450J6815M113q852K1524L557o414M23J6254K2476Q864
18965A96460p419j6946k4836j5319L362j6364L1242L2614k9948n530P587Q076
18953A62979j6776L361j7886m9830q203J2751K3671j0568q159n051k7130R963
18941F9122L6594N331J3711M897k241P972K2312K7334J8237L957j2739l744m728
18928A86015J3232N1716M1324K7513K803r771K1151N505J929L6069J0655n592
$$ y = [100179, 102378, 100806, 68796, 55861, 33862, 34650, 59666, 34235, 30378, 29029, 36607, 50888, 73287, 82641, 72223, 57829, 46083, 50302, 90517, 107443, 82835, 75866, 84442, 79070, 86648, 89574, 95710, 85756, 95736, 106568, 121601, 123415, 107815, 88020, 50182, 35172, 67152, 111686, 140902, 140150, 117700, 134515, 138628, 129776, 151300, 154857, 148443, 148866, 165120, 187596, 196460, 189041, 172095, 147259, 131940, 135302, 118938, 150180, 182794, 152846, 147316, 154903, 162979, 146203, 149564, 131678, 81848, 73645, 86396, 110067, 99499, 91340, 86289, 59159, 69122, 105716, 111047, 124758, 129655, 127414, 135386, 157698, 185032, 203269, 207226, 194487, 190743, 186015, 199247, 250963, 292287, 319800, 322603, 312832, 333983, 339488, 341417, 377486, 388141, 382549]
18916C82549k1222j5187K7953k567J766n448m1118m7106j5330J7103n660K304
18904B78037q540j7001k0701j1797K38O179k8567j11Q055K0211m517j5217j7293
18891A88976k2578p562j545J6248L1236K5124Q293J2041K310K7917M6720M3224
18879C70404N4466L834J5882K612J881O301L3212Q053j7843J3235j6993k0065
18867D54979K4324J7734K221n001j6705j3974o532J8873K6951j3496m5066k4066
18855D20242m9233K48O901k0249j3787K229p300j2250J1084o230k6255N562K999
18842C13961j4616j1908n656k325j2273l211o594k3543N378J1558K526k6422k6166
18829B00709k51O127J7463p27O916k10l032J0594K6897O0287J5918J4359q203
$$ y = [382549, 361327, 346140, 374093, 371526, 373292, 367844, 326726, 279620, 264290, 281393, 275733, 278037, 269497, 252496, 231795, 219998, 220236, 226415, 197848, 197737, 205792, 226003, 221486, 206269, 188976, 166398, 158836, 157291, 173539, 204775, 229899, 238192, 250233, 252543, 280460, 327180, 370404, 424870, 428704, 444586, 447198, 449079, 455380, 488592, 496645, 478802, 492037, 475044, 454979, 479303, 497037, 499258, 494257, 477552, 463578, 457046, 475919, 502870, 489374, 444308, 420242, 371009, 371257, 378158, 357909, 344122, 346351, 339051, 326801, 337885, 331655, 305400, 310962, 313961, 299345, 287437, 281781, 279456, 267183, 263972, 257378, 233835, 239213, 250771, 253297, 226875, 200709, 200458, 206585, 224048, 223321, 230237, 230027, 226995, 237589, 264486, 324773, 340691, 355050, 346847]
18816C46847n428Q735q628N71k0020J0155L3160K6433K9375k7837l2261l857j1780
18803C45465l796o52L450Q729M9129o433J799o345p458K3989Q604O556J4920k643
18789D35314J6865M2535K5633J8993J1683K3713L4774M965L8189M1480L1528M7091
18777G72763L0671N2835M9629M0701P1652J05239P8680J02011J26671J36062J48528
18766A715442J41158J49067J58039Q4500J22615J44684J74324J85108K68661K96012
18756C439610K88463K65799L35293L86710M27894M71372N01389N17032N94340
18747G227902O12155O23424O57981P51462P87522Q04768Q62629Q84409R06798
18738A4119050R95793J024606J082135J183808J224106J297175J453235J634653
$$ y = [346847, 341419, 350154, 341526, 342097, 322077, 332232, 365392, 391825, 421200, 393363, 361102, 357245, 345465, 341669, 341017, 344467, 353196, 402325, 395892, 397691, 391346, 383888, 407877, 416481, 423037, 437957, 435314, 452179, 494714, 520347, 539340, 551023, 574736, 609510, 614475, 652664, 694144, 725672, 772763, 803434, 856269, 905898, 946599, 1018251, 1123490, 1202170, 1304181, 1430852, 1566914, 1715442, 1856600, 2005667, 2163706, 2248206, 2370821, 2515505, 2689829, 2874937, 3143598, 3439610, 3728073, 3993872, 4329165, 4715875, 5143769, 5615141, 6116530, 6633562, 7227902, 7840057, 8463481, 9121462, 9872924, 10660446, 11465214, 12327843, 13212252, 14119050, 15114843, 16139449, 17221584, 18405392, 19629498, 20926673, 22379908, 24014561]
18730B4014561J900861K216111K553354K917030L432189M116850M986632O298510
18722E2436098P757301Q793059Q673119Q516974Q378911P630142R531015R726542
18714A21443161P680352O589057l208009m152305l028980l226747K79241L457394
18706A25833164L157330k567769m046478j2138773j9817727j5927863j4627458
18699E9864426r390925m477079l090653k002451j699425m866500n200830l906351
18691B5230212m230884l471627k129131j257424p50840l79790j28349P8315J93392
18682A3153874L01845L94686N69909Q50309J255231J782439K375479K824301K900198
18673B6408271K647315K573143L131281M293095N019294M056910J243388k368662
$$ y = [24014561, 25915422, 28131533, 30684887, 33601917, 37034106, 41150956, 46137588, 52436098, 60193399, 68986458, 77659577, 86176551, 94555462, 102185604, 111716619, 121443161, 129123513, 135712570, 132504561, 128352256, 125323276, 122096529, 122375770, 125833164, 128990494, 126422725, 122376247, 110237474, 90419747, 74491884, 59864426, 50473501, 45996422, 42905769, 40903318, 39203893, 34337393, 29136563, 25230212, 20999328, 17527701, 15398570, 14141146, 13390306, 13010516, 12882167, 12960482, 13153874, 13455719, 13850405, 14420314, 15270623, 16525854, 18308293, 20683772, 23508073, 26408271, 29055586, 31628729, 34760010, 39053105, 44072399, 48129309, 49372697, 47004035]
18665D7004035k928371j730763O93793K722186L004333J524098j648076m434155
18657D4207080l962775l231715k682133l813426l862102l104541j593236j66776
18649B1790376N82951J56931j284370l862026m370696l856481k620386j501944
18641E034355r36660o32282m23270k97826k77025j99306j49609j48665j45013
18632A824699j24935p7837q3368p2186o0074q8837n6573o4622o4194o0527n1390
18621A020156q2180l2672N49j0726l4751p5870m6715J4583o29j0808P728n418
18609G43247o550n0661j4238p373l4716J06K2735L7066j1192m819R233n81l3154
18596F49103m9389j4806M714K9323K1821J8265j3311k2956k5871m3017K5771O5405
$$ y = [47004035, 44075664, 42344901, 43038694, 45760880, 48765213, 50289311, 48641235, 44207080, 40244305, 37012590, 34330457, 30517031, 26654929, 23550388, 21957152, 21790376, 22373327, 22530258, 21245888, 17383862, 13013166, 9156685, 6536299, 5034355, 4097695, 3465413, 3042143, 2744317, 2467292, 2267986, 2118377, 1969712, 1824699, 1699764, 1621927, 1538559, 1466373, 1406299, 1317462, 1260889, 1196267, 1132073, 1071546, 1020156, 937976, 905304, 905853, 895127, 860376, 784506, 737791, 752374, 751745, 740937, 748665, 743247, 736697, 686036, 671798, 664425, 629709, 629815, 652550, 689616, 678424, 673605, 682838, 682257, 649103, 599714, 584908, 589622, 618945, 640766, 659031, 645720, 622764, 596893, 553876, 579647, 645052]
18584F45052L8339K6478J1876J7399K1311K4593L1072J7216n334P493j4004k5898
18572G95593L5329M5667L2142N8535K5573K2017q811m114k2697k3225m0481m4105
18560H71423n8468n1149k4246n900J570K9778m0572m4893L0703k0194r6442o0532
18548E31078m5735l0213l2106j3777j9033r431L375K6215R266q659K7217Q857
18536D47054J5783K5696q289n4078l0458m2432j1097j3368k4983j4743j1731K0757
18524B98111K0137j3275q067K0443K5593K6068Q284j3812m0383o830L6706L5291
18512C88266J5250K9120J976l331L1809j0763j4548K380K5039K5094J8271J1374
18500E19937q364j5589k6399M8930J8031j4469R151j1096j3235p259J9585P643
$$ y = [645052, 683391, 709869, 721745, 739144, 760455, 785048, 816120, 833336, 828002, 835495, 821491, 795593, 830922, 876589, 908731, 967266, 992839, 1014856, 1006045, 1001931, 979234, 956009, 915528, 871423, 812955, 761806, 737560, 731660, 733230, 763008, 722436, 677543, 708246, 688052, 591610, 531078, 485343, 455130, 423024, 409247, 390214, 380783, 384158, 410373, 419639, 410980, 438197, 447054, 462837, 488533, 480244, 426166, 395708, 353276, 342179, 328811, 303828, 289085, 277354, 298111, 318248, 304973, 296906, 317349, 342942, 369010, 377294, 363482, 323099, 316269, 352975, 388266, 403516, 432636, 434612, 431281, 463090, 452327, 437779, 440159, 465198, 490292, 508563, 519937, 511573, 495984, 469585, 518515, 536546, 522077, 531228, 520132, 506897, 499638, 519223, 526866]
18488E26866L6315R634l510K3399M5899L7609L7780L8410L6892L6465K4170Q2447
18476I32376Q8221Q3701L4022j0735n0653o4391l2630K0885L7027K4704O4687
18465A127214P7103R0421O0572O0484N4162N0965O6033L0629L616M2235J8194
18454A681628L7475O4345J01207Q9664J38173J02621J06799J27653J76569J72268
18444B798402J88337J76795J80796K03281J92044J63081J63190J67006J96467
18435D429399K40673K63245L36112L75209L81594L62358M41939M94891O47460
18426G972880Q59861J050949J232997J444854J550927J530722J594552J845298
18418A9083040K042972J596873J723143J812416J62620J85599O48387M37045J183765
$$ y = [526866, 563181, 572815, 569305, 592704, 638603, 676212, 713992, 752402, 789294, 825759, 849929, 932376, 1020597, 1104298, 1138320, 1127585, 1076932, 1012541, 979911, 1000796, 1037823, 1062527, 1127214, 1204317, 1294738, 1355310, 1415794, 1469956, 1520921, 1586954, 1617583, 1621199, 1663434, 1681628, 1719103, 1783448, 1884655, 1974319, 2112492, 2215113, 2321912, 2449565, 2626134, 2798402, 2986739, 3163534, 3344330, 3547611, 3739655, 3902736, 4065926, 4232932, 4429399, 4670072, 4933317, 5269429, 5644638, 6026232, 6388590, 6830529, 7325420, 7972880, 8832741, 9883690, 11116687, 12561541, 14112468, 15643190, 17237742, 19083040, 21126012, 22722885, 24446028, 26258444, 26421064, 26606663, 27255050, 27692095, 28875860]
18409B8875860K046222J503061Q26061J176208j835302l777973k455260k642127
18401B3716750k178812o57278L7558k83871m4118n50067k473029k148809j734008
18392A3684316j851283j169361n25985j86705k2066J32077K79206L40938M33157
18383A1114294M95714N55154O70355P77672R28317J205622J658547K131342K517432
18374B2054449K950604L225264L252358L487955M100870M322142L382647L524310
18366E0300599L110379m91384m53543N82512O21577J369267J581208K676366J659264
18357F0956245k537821k043115l303978o911009n267016l954787l042070j772725
18349C2123724j719156r40865k150785m953342m131020l645201l771173k698720
$$ y = [28875860, 30922082, 32425143, 33251204, 34427412, 32592110, 28814137, 26358877, 23716750, 21537938, 20880660, 20918218, 20634347, 20590229, 20040162, 17567133, 15418324, 13684316, 11833033, 10663672, 10137687, 9950982, 9928916, 10060993, 10340199, 10681137, 11114294, 11610008, 12165162, 12835517, 13613189, 14541506, 15747128, 17405675, 19537017, 22054449, 25005053, 28230317, 31482675, 34970630, 39071500, 43393642, 46776289, 50300599, 53410978, 52919594, 52466051, 53048563, 53670140, 55039407, 56620615, 59296981, 60956245, 58418424, 56375309, 53071331, 46160322, 40893306, 36938519, 33896449, 32123724, 30404568, 29463703, 27312918, 22359576, 18228556, 14583355, 10812182, 8113462]
18341H113462j664631j077408o63738m31258l07028k91037k66150k40246j96757
18332B975209j53634r9159k8865l3429J1641O0557M6218M9242O2477R0859N8392
18321C039508K6524N0916Q9118J22979J42177J95869K68579K39094J85576J72329
18311D532669K50946K27489K78721K42728K34909J82931K04852K08444K81036
18302F644725L40776L61861M04632M55575N55191P33173Q62031J035328J384937
18293A2778229J824467K065579K176004K690599L593540M502383M903105M138237
18285C8672143J406274l16831J677555M229221L867960j245120o986572p559325
18277C3745305m681504j566108R19040K146470q72312o623341p320106m524727
$$ y = [8113462, 6448831, 5371423, 4707685, 4276427, 3969399, 3678362, 3412212, 3171966, 2975209, 2821575, 2722416, 2693551, 2660122, 2671763, 2732320, 2778538, 2827780, 2890257, 2981116, 3039508, 3066032, 3116948, 3206066, 3329045, 3471222, 3667091, 3935670, 4174764, 4360340, 4532669, 4783615, 5011104, 5289825, 5532553, 5767462, 5950393, 6155245, 6363689, 6644725, 6985501, 7347362, 7751994, 8207569, 8762760, 9495933, 10357964, 11393292, 12778229, 14602696, 16668275, 18844279, 21534878, 25128418, 29630801, 34533906, 38672143, 40078417, 39761586, 41439141, 45668362, 49536322, 48291202, 41304630, 33745305, 29063801, 27497693, 28416733, 30563203, 29690891, 23067550, 15747444, 11222717]
18269A1222717k343752j272276p17312l63662j84850l3509M2507Q6102Q2356J31379
18259F649700J58805K29074K80008K70042K59573L76988M81247M83573M56197
18250I645207N03331O21994P38184R54117J267923J738145K286364K865164L310219
18241B3930648L535428L700856M063188M697226N487219N628066L984324K91791
18233E5318746j200312j462148k263792k264786j014221j507133m873280o846391
18225C3886683n203382k501698j889224m358449n495565m026407k555350j583866
18217F272742r46690n86285l47721k48968j79851j49471n4747J8511N6618O5335
18207C899473P8143J16919J15664J13299J38289J72137K07446K74026L58850M56243
$$ y = [11222717, 8878965, 7606689, 6889377, 6525715, 6340865, 6307356, 6349863, 6435965, 6518321, 6649700, 6808505, 7037579, 7317587, 7587629, 7847202, 8224190, 8705437, 9189010, 9645207, 10148538, 10770532, 11508716, 12462833, 13730756, 15468901, 17755265, 20620429, 23930648, 27466076, 31166932, 35230120, 39927346, 45414565, 51042631, 55026955, 55318746, 54118434, 52656286, 50392494, 48127708, 47113487, 45606354, 40733074, 33886683, 28683301, 26181603, 24292379, 19933930, 14438365, 10411958, 7856608, 6272742, 5326052, 4739767, 4392046, 4143078, 3963227, 3813756, 3759009, 3777520, 3834138, 3899473, 3977616, 4094535, 4210199, 4323498, 4461787, 4633924, 4841370, 5115396, 5474246, 5930489]
18197E930489N87115P56406R24299R64948R25748Q79440J003137J299707J555582
18188A4826871J475392R17810N6956k92899l36513J41615Q01923J508251J673175
18179B0772581M60546k039587l428476l139095k400974k302331j964026j486514
18171D472124r59556n83675l87666k47659j95176j70402j27669j14813j51676
18162A533832j44031r4351m6792l1531j0534l0231m2495J8903N0059N6755J0512
18151A270096K9571L3485M2789N6829M2019M3863O0962O8840O6646N7879O7172
18140A840151N9643Q8656R9593O4587J28847J13461J19364J42777J19959J16938
18130B893976J66495J71718K09804K31925K43137K85570K75358K92028L29712
$$ y = [5930489, 6517604, 7274010, 8198309, 9163257, 10089005, 10968445, 11971582, 13271289, 14826871, 16302263, 17220073, 17277029, 16984130, 16647617, 16789232, 17591155, 19099406, 20772581, 21233127, 19193540, 15765064, 12625969, 10224995, 7922664, 5958638, 4472124, 3512568, 2928893, 2541227, 2293568, 2098392, 1927990, 1800321, 1685508, 1533832, 1389801, 1295450, 1248658, 1217127, 1206593, 1176362, 1133867, 1152770, 1202829, 1259584, 1270096, 1299667, 1333152, 1375941, 1432770, 1474789, 1518652, 1579614, 1648454, 1715100, 1772979, 1840151, 1899794, 1988450, 2088043, 2152630, 2281477, 2394938, 2514302, 2657079, 2777038, 2893976, 3060471, 3232189, 3441993, 3673918, 3917055, 4202625, 4477983, 4770011, 5099723]
18121E099723L49001L98780M74463O87651J048142J602580K595061L973566M544276
18112B0773243L062177J371555J134849K287376M514614Q234734N869246j4424801
18104C2822993j5594049p366435l483182j811793j126626p77955m93990l48271
18096A820692k38399j93893j50798j43447j09950q1524o1811o5284o7539n1315
18086F56732r708j548O379r207j3213l8314j4343q319L1293K8393m3010j2537
18074E72598K4002j1770J8213O207K1078J5773M8153P4925Q2679R3179N8913J21
18062A004071l9624q4649j20035j34861j46982q6932o5645n0745j8501r966j415
18051B44716m3661j1432k0431k284J9347q629k3317M582J2985K8068j6664m7471
$$ y = [5099723, 5448724, 5847504, 6321967, 7009618, 8057760, 9660340, 12255401, 16228967, 20773243, 23835420, 25206975, 26341824, 28629200, 33143814, 41378548, 47247794, 32822993, 17228944, 9862509, 6379327, 4567534, 3440908, 2662953, 2168963, 1820692, 1582293, 1388400, 1237602, 1094155, 984205, 902681, 840870, 775586, 708047, 656732, 647024, 645476, 651855, 642648, 629435, 591121, 576778, 568459, 599752, 628145, 585135, 572598, 596600, 584830, 603043, 609250, 630328, 646101, 694254, 769179, 851858, 945037, 1003950, 1004071, 964447, 879798, 759763, 624902, 477920, 390988, 325343, 274598, 256097, 246131, 244716, 201055, 189623, 169192, 166908, 186255, 177626, 154309, 158891, 171876, 199944, 183280, 135809]
18039A35809l0656l993K2314J6375J2397M506M5795J8876p301P494k4008j6693
18027A80915L593k4339K409L3813l495K3744R25p801o683K2964M3609M6657L5006
18014C51317n730l8428m2516k8331l4361k1099j1063j5971n2054k3548n6k5709
18002E2451Q082k626J7279L8853j4880M368J7869Q328j9421k6892J455m1719k4534
17989A8613K2493L604q762K610L6562J4840J5113j046m689k9796j3667k1599P312
17976D1588j0556k2722K6670J7876K7821k2274n180J3626J7961K5955p291l6855
17964F6619q488L192j423j6255J0946j018L8288Q735j5049l1367k1167r089K3662
17951D7586L4778r742J5677J5978j1369p585k5962l103L706J1180m0774L317M1761
$$ y = [135809, 105153, 101160, 123474, 139849, 152246, 156752, 202547, 221423, 214122, 221616, 197608, 180915, 184508, 160169, 162578, 196391, 192896, 216640, 217565, 209764, 203081, 226045, 269654, 316311, 351317, 345587, 307159, 264643, 236312, 201951, 180852, 169789, 153818, 101764, 78216, 78160, 52451, 60533, 57907, 75186, 114039, 99159, 103527, 121396, 129724, 110303, 83411, 84866, 43147, 18613, 41106, 44710, 35948, 38558, 75120, 89960, 105073, 104027, 99338, 69542, 55875, 34276, 41588, 31032, 8310, 34980, 52856, 80677, 58403, 53223, 66849, 84810, 110765, 103474, 66619, 58131, 61323, 59900, 43645, 54591, 53573, 91861, 100596, 85547, 54180, 33013, 23924, 47586, 82364, 72622, 88299, 104277, 92908, 85323, 59361, 56258, 59964, 71144, 30370, 33687, 75448]
17938G5448o021n711r540n12K5726R036k6674M1943P625k4180j6014j6994J6490
17925G0622P972J8440j4870Q331k1997P6j9775k446J0537l0540P840L188n555
17912C1823J1793J5709O456J2292M982l207J1346J5970J8214o921K5203k02j913
17899A41545J7681o601L7160L7923R099J1429R023K5184J3956m049O602p687N505
17886B96770J9329j2093r59K360k4743k6837l6081l5447L269j1598j4006J7739
17874A77703K3648j5961l1100l6671j4343M8m788k5479j1797J8634J3785o678
17862H7001j5979j3231k0664p576J5862J8049k958P147J6346N062k1722L1765
17850I9102M9401L484K9199J341J6651p055J0218rj2470J9675j4303q870P411
$$ y = [75448, 69427, 63716, 54176, 53664, 79390, 88426, 61752, 103695, 111320, 87140, 71126, 54132, 70622, 78594, 97034, 82164, 90495, 68498, 68574, 48799, 46353, 56890, 26350, 34190, 37378, 31823, 43616, 59325, 65781, 78073, 83055, 79848, 91194, 107164, 125378, 118457, 143660, 143458, 141545, 159226, 152625, 189785, 227708, 236807, 248236, 257259, 282443, 296399, 292350, 298952, 291265, 296770, 316099, 304006, 303047, 305407, 280664, 253827, 217746, 182299, 185568, 173970, 159964, 177703, 201351, 185390, 154290, 117619, 103276, 103324, 98536, 73057, 61260, 79894, 93679, 87001, 71022, 57791, 37127, 29551, 45413, 63462, 60504, 67651, 83997, 89059, 67337, 99102, 148503, 151987, 181186, 182527, 199178, 192123, 202341, 202332, 189862, 209537, 195234, 186364, 193775]
17837A93775L5598J8000j7095J1711p531k8516j7466k4786k6834J4303N848l013
17825A53994k1818k5847l5986p283J9685j6231k6144L183J6802Q307Q991j4043
17813F3610j2785l1154Q793K2569J6708j8875P802Q883j8142j5017P737l1539
17801H590K2974J8780q84J0789q841k6323j7441L620K8547k6801r749j0534K7693
17788B0420N4663J0466l6714j5635r339p098k8884J8741K8190M5358K9417K387
17776A11972q695j504k1624J1643K6578j875r482j5258l909M0695K3990L4980
17764A87511M6236K0358j7246k0253l6580O418j4603m8370k0124j8186l6095Q086
17752E7152k848j6086k1255r1J4445J2321M834j3459m433Q448M073J2527m181
$$ y = [193775, 229373, 247373, 230278, 241989, 234458, 205942, 188476, 163690, 136856, 151159, 157007, 153994, 132176, 106329, 70343, 63060, 82745, 66514, 40370, 43553, 60355, 68662, 77653, 63610, 50825, 19671, 28464, 51033, 67741, 48866, 56668, 65551, 47409, 32392, 40129, 8590, 31564, 50344, 49460, 60249, 51408, 25085, 7644, 11264, 39811, 13010, 3261, -7273, 20420, 75083, 85549, 48835, 33200, 23861, 16763, -12121, 6620, 34810, 80168, 109585, 111972, 103277, 101773, 80149, 91792, 118370, 116495, 107013, 91755, 87846, 128541, 152531, 187511, 233747, 254105, 236859, 216606, 180026, 186444, 171841, 123471, 103347, 85161, 49066, 57152, 54304, 38218, 16963, 16872, 31317, 43638, 48472, 35013, 30580, 39028, 43101, 55628, 51447]
17739E1447m2016m360K6570J3707K8424J9933r271j4373j7163j78J0924J8439
17727H2083K6197P309n745K1250J408Q317J9333J3817K3049J9152O6396L6311
17715C18877L5171k0175k4746m4781k2238q659k138J1643l0140o0689l4744l8752
17703G8629j7292J1018j6446l1724q659K3506j7701p20k1149J0237L5985M933
17691E0617K908j2444j2727J7635K5595M449m880k0349k7021k8092J6018J3447
17679B5156k329J9321K927j79J9153k151K5421K1376O234R928J889R337o757J1182
17665A40508m171j0697j0454j5866K3391j769k1217k2411m3478n165Q04J8643
17653D8118m32o575m5987l1422k0611J9940L8152K7981j9144k4583q621J5364
$$ y = [51447, 9431, 5071, 31641, 45348, 73772, 93705, 84434, 70061, 52898, 52720, 63644, 82083, 108280, 115589, 109844, 131094, 132502, 140819, 160152, 173969, 197018, 216170, 282566, 318877, 354048, 333873, 309127, 264346, 242108, 233449, 231311, 242954, 212814, 152125, 117381, 78629, 61337, 72355, 55909, 24185, 15526, 39032, 21331, 20611, -538, 9699, 45684, 50617, 53525, 41081, 28354, 45989, 71584, 76033, 71153, 50804, 23783, -4309, 11709, 25156, 22827, 42148, 45075, 44896, 64049, 61898, 87319, 108695, 114929, 124857, 126746, 136083, 129326, 140508, 136337, 125640, 115186, 99320, 122711, 120942, 99725, 77314, 33836, 28671, 29475, 48118, 47686, 41111, -4876, -36298, -56909, -36969, 1183, 29164, 10020, -14563, -23184, -7820]
17641g820j461K3508M697j3298O795J1194k0203k0920l6311J5509N01r326Q204
17628c8931J8103K338L488j57J0063o21l167j8372o287M251J5048k1461l3327
17615f9032J6079J2660Q95j0710m004N2306J443K499O053P044o519J3701n313
17602A7102p132J0178q779l1102j2869n869L636j1609K654K0377J7271P472p953
17589f623k317M151J0066L615j7252j186r795o631k0564j4445K1617J1605M088
17576b3671K2340n034o305J2920l508K1353j1710j7314K8109K7979l8758q245
17564a844J3344p761J617M625r172J2296K0631J3526l6042j3220r582J0504l780
17551d858j6032k3675K4819R224M7348j6297l2260k8110J3926K4024O197J5040
$$ y = [-7820, -9281, 14227, 18924, 5626, 12421, 23615, 3412, -17508, -53819, -38310, -37809, -47135, -38931, -20828, -18490, -15002, -15159, -5096, -5717, -8884, -27256, -33543, -29292, -14244, -35705, -69032, -52953, -40293, -39398, -50108, -54112, -1806, -363, 2136, 8189, 15233, 8714, 22415, 17102, 9970, 20148, 11369, -19733, -32602, -38471, -34835, -46444, -43790, -23413, -6142, 1330, -6623, -8940, -4789, 5277, 8892, -8360, -9546, -19341, -25972, -46536, -60981, -39364, -27759, -23671, -1331, -6365, -12670, 250, -3258, 18095, 6385, -10929, 17180, 45159, 6401, -1844, 11500, 3739, 5356, 9981, 809, 13105, 33736, 47262, 11220, -2000, -11582, -1078, -4858, -20890, -44565, -19746, -10522, 36826, 20529, -11731, -39841, -25915, -1891, 4306, 19346]
17539A9346j9613j2435K9375L5119p37l3028l3908j0177J1874K9559r571o208
17527d04k2646o763R628L1455M893Q546j6999j2395j3173k916N410L1406J0802
17514B6844m9346j5249j182Q32N098L9487L6763L980p402l4120l1312O007J2172
17501g428r485j3364k2211Q469r698r244O6372K8765j22k0077q233k5669k1278
17488d3203L198J4102K5049L6883q55n6679J780k071p099M0400Q023K295k255
17475A9568R507j2532J6922M8519j5037k7245k4129J2854L136j2815J415q63M3118
17462F2418K5403m3274l6248j1672q351q669m592J1501J993R550N323K3164R954
17449C6500k1350O1J0652K5067M0871J3512j991M2175K5564L2417m8854j03307
$$ y = [19346, -267, -12702, 16673, 51792, 51055, 18027, -15881, -26058, -14184, 15375, 5804, -404, -23050, -29813, -20185, 11270, 16163, 24709, 7710, -4685, -17858, -20774, -15364, 16042, 26844, -22502, -37751, -38933, -38101, -33003, 6484, 43247, 47227, 39825, 5705, -25607, -19600, -7428, -16913, -30277, -52488, -44019, -53717, -62961, 3411, 32176, 32054, 11977, 3744, -21925, -43203, -40005, -25903, -854, 36029, 35174, -21505, -19725, -21796, -28895, 11505, 19528, 21823, 19568, 29075, 16543, 33465, 81984, 66947, 39702, 15573, 28427, 31563, 18748, 20163, 19300, 62418, 87821, 44547, 8299, -3373, -11724, -20393, -24985, -13484, -11491, -1941, 3382, 26546, 36500, 15150, 15211, 25863, 50930, 91801, 105313, 103322, 145497, 171061, 203478, 154624, 51317]
17437E1317k9482j5972N426k6221P893Q894j3934q452k1698k778p313k211o632
17424f1163J7109M380M999J8963J1418j3496J2917R295j3676k1379o516O260J0485
17411b0404j4736L2107M5067J6050l0354k6089J704o490k0292N735J8002K9979
17399C0279j6311l258N429j6464K597K2260K2133k1730l1186k2105K4572k4468
17387b8252k7807O145K8280k632O266N635K1835k2392k1830k0328o732J5333J8125
17374b8354J8829j0781l5982P559K2256j2172n649p953J8337L4467o48k7641O087
17361b1645J4013M337k2577M739J0007j1638O208k9314M03L5363L2874k6268j1672
17348a5170j4256j276j7736k278K2656o849r505M205K0718M3585L1529j5414l3517
$$ y = [51317, 21835, 5863, 11289, -14932, -7039, 1855, -12079, -20531, -42229, -45007, -52320, -54531, -61163, -44054, -39674, -34675, -15712, -4294, -17790, -4873, 4422, -9254, -30633, -37149, -30889, -20404, -35140, -3033, 42034, 58084, 27730, 1641, 3345, -3145, -23437, -17702, 300, 30279, 13968, 10710, 16139, -325, 2272, 24532, 46665, 24935, -6251, -28356, -3784, -28252, -56059, -49914, -21634, -24266, -18000, -12365, 9470, -12922, -34752, -55080, -61812, -46479, -28354, -9525, -20306, -56288, -48729, -26473, -38645, -44294, -52247, -33910, 557, -91, -27732, -21645, -7632, -3295, -25872, -21133, -11126, -22764, -16556, -45870, -45467, -10104, 22770, -3498, -15170, -29426, -30702, -48438, -50716, -28060, -34909, -44414, -40209, -19491, 24094, 55623, 40209, 6692]
17335F692k7110R569o303k1853l89k1113q932L5109N5334k6273k4740O726K3387
17322A04j9655l280q903j8805k0113k0755n094N2353N2689J8081k1255j5129n355
17309a5117K448L1332J1066m750n981k5924j2823L681k058J2034K3291l082j8503
17296d386K890k8397j0679K192k994J4593M827j62J0031L1339M84j2704P388R780
17282B4202j1786j5582l3536K1115R020L3108q426J6249m555o752M930k0793l9770
17269c2576O179L6284K0910L1958k5298l8911l7613n292K4875K0210L502L1095
17257C5323j1541j4037m656l6774k0780n135K9418K8167o91j3m2417l1464K5050
17244d9550J7318l2771j0840L9569l613P043q446K1442J4233j4916o582J5105
$$ y = [6692, -20418, -10849, -17152, -39005, -39394, -60507, -69439, -34330, 21004, -5269, -30009, -23283, 104, -19551, -22831, -31734, -50539, -70652, -91407, -96501, -44148, 8541, 26622, 5367, -9762, -15117, -12669, 18663, 29729, 24979, 18998, -6926, -19749, -16068, -18126, -6092, 17199, 14117, -4386, -1496, -29893, -40572, -38380, -41374, -26781, -21954, -22116, -12085, 19254, 19738, 7034, 14422, 24202, 12416, -3166, -36702, -15587, -6567, 26541, 18115, 34364, 29809, 23057, 27987, 7194, -32576, -26397, 9887, 30797, 62755, 37457, -1454, -39067, -44359, -19484, 726, 4228, 35323, 23782, 9745, 5089, -31685, -52465, -57600, -28182, -15, -706, -719, -43136, -74600, -49550, -32232, -65003, -75843, -36274, -39887, -32844, -41290, -19848, -5615, -20531, -27113, -12008]
17232a2008K9971k6802k2484k114L3736q144m9705j31p030J4967J6650J1484L9180
17219A7570J1034M472R158j9041j3627O213n894l3097j775j1389j4403l9443j7394
17206a07616K2929J4918R38K3998K7655K3145n333j8473J1382j0646m1990J3412
17194d5681j6345L1772L840j0601K4464J7660k3087J90O263k6919j0274O369J2583
17181b9766j5865Q514L0346K1468J1394N958Q199m6171l8876K902O2163l3k3309
17168c076j0134R390j1919r054L9007J7910j4515k3623j4467L0409K7811k2156
17156A5583m6290K3937J5060j5870p176R358m999n166l920p386O750j3598k242
17143c5959J2097K4966L0404r94o42M225K3395N052l9531k196K7352P54l1078
$$ y = [-12008, 17963, -8839, -31323, -33437, 299, -7845, -57550, -57681, -64711, -49744, -33094, -21610, 17570, 28604, 33076, 42234, 23193, 9566, 15779, 9885, -23212, -24987, -36376, -50779, -90222, -107616, -84687, -69769, -68831, -44833, -17178, 5967, 634, -17839, -6457, -17103, -59093, -45681, -62026, -30254, -26414, -37015, -12551, 5109, -17978, -17788, -11525, -38444, -48718, -42349, -29766, -45631, -37117, -6771, 14697, 26091, 32049, 40248, -5923, -44799, -41897, 20266, 20233, -3076, -13210, -3820, -15739, -24793, 14214, 32124, 17609, -6014, -20481, 9928, 37739, 15583, -30707, -6770, 8290, -7580, -14756, -5398, -10397, -15563, -19483, -26869, -20119, -33717, -35959, -23862, 1104, 31508, 30514, 29872, 34097, 57492, 62544, 23013, 20817, 48169, 48923, 17845]
17130A7845l3398J0339K2375j1639l4172m075J9067j3412j6083j7598J5992R948
17118c4811m140K048m332K0272K7406m35k6801q165K2762j6581K2665J0272j4031
17105c871o527K8952J3269m294j6400k2851K172k0101P234M5518j4414k8823k6016
17092d6152q780K8448K2997M635M458k0202o981o994K0799Q208j2384j0975K1037
17079a886K2113j2285j5757P539K676p061J880J7540M687j7567m7723q84K2142
17066b4586q63l955K1886n76r43L543k3099k2550Q369L7025J3796K4733j2057
17053B0723j2939p86l5682k0882M225M654K0058L5596K357p698l0954o300K4357
17040c271K2223J2178j9664l0490n499J6452k4087l625k1144k2100Q416L7801
$$ y = [17845, -15553, -5214, 17161, 5522, -28650, -32725, -13658, -27070, -43153, -60751, -44759, -34811, -38951, -36903, -41235, -20963, 6443, 6008, -20793, -28958, -6196, -22777, -112, 10160, -3871, -10398, 18554, 31823, 27529, 11129, -11722, -9550, -29651, -22417, 23101, 8687, -20136, -46152, -54932, -26484, -3487, 1148, 5606, -14596, -21577, -28571, -7772, 436, -11948, -22923, -1886, 20227, 7942, -7815, -276, 2400, -4661, -2781, 14759, 19446, 1879, -45844, -46728, -24586, -25449, -29404, -7518, -8094, -9037, -5494, -28593, -51143, -42774, -5749, 8047, 32780, 20723, 7784, 6998, -28684, -49566, -45341, -40687, -20629, 14967, 17324, 9626, -21328, -27628, -3271, 18952, 31130, 11466, -19024, -24523, -8071, -32158, -35783, -56927, -79027, -70611, -32810]
17028c2810L7035J5077j4280L197P668m675o87N748j5395p835J1379j022R08L3134
17014C7442P033j7682p887l2228n8603k3325M3698M6487J8762j353R638J1521
17002C3503K986k7763k5734n162J9649M516k3391k326q597M304K0925K287k877
16989g680k9463l3386J5930L0990k5685J8605M4948K0046j8538j431R554j7837
16977F053k5696l211K2079O590j055N158n558K7655K3024j5730O475k2631k5128
16964a975k4022r442J6138J3177j2695J9952K8708J8031J042p084o753l8815o697
16951a0435l1663l345j1400L686l582k0390J5620J5777J1184J621l059j4897J3980
16938c6903K1358K6773J1888k5111m2626k4855J8052O9703J9429q136k6084o116
$$ y = [-32810, 4225, 19302, 5022, 8219, 15887, 11212, 10525, 16273, 878, -6957, 4422, 3400, 4308, 37442, 44475, 26793, 18906, -13322, -71925, -95250, -51552, -5065, 13697, 12344, 21982, 33503, 36489, 8726, -17008, -22170, -2521, 1995, -21396, -23722, -32319, -28015, -7090, -4803, -7680, -37143, -70529, -54599, -23609, -49294, -30689, 14259, 34305, 15767, 14336, 23890, 6053, -19643, -22854, -775, 5815, 4760, 9918, 4360, 32015, 55039, 39309, 45784, 23153, -1975, -25997, -35439, -19301, -6124, -18819, 1133, 29841, 47872, 48914, 41830, 35077, -3738, -10435, -42098, -45443, -56843, -53157, -56739, -77129, -61509, -45732, -34548, -32927, -35986, -50883, -36903, -15545, 11228, 23116, -1995, -44621, -69476, -51424, 18279, 37708, 29572, 3488, -2628]
16926b628K1988j6567k114J0311L041J7585l969J0260k1578m4197L373Q244k5043
16913d1294R09J4385k1202J4237Q263P565K3717p569p049k1989j667j2468M583
16900c9579m571K4620J7008J105k5042j8545j177R467L2048M855Q197J9325M12
16887B8123l7889J195L2813k97q500N907j8126l5592J7882M9157L536k1581N791
16874B2419R309j4394j8304j5455l9973k6831L7384K2999M868K388K0024l201
16862A233j6234l947J2411N266K0482r95l1610p361j5002m895l6506Q675J0643
16849e7840J3168L1314L7969Q316j6307l8522j9516M255M6072L0942o453j9685
16837A3713j3449l759l791j5992M110K3926j7041j0410O426j4134J6297L9695
$$ y = [-2628, 19360, 2793, 679, 10990, 14031, 31616, 27647, 37907, 16329, -27868, -24495, -16251, -41294, -40385, -26000, -47202, -32965, -24702, -17137, 6580, -989, -8038, -30027, -31694, -44162, -39579, -44150, -19530, -2522, -1417, -26459, -45004, -46181, -36714, -4666, 189, 8386, 27711, 28123, -9766, -8571, 24242, 23945, 15445, 21352, 3226, -32366, -14484, 34673, 38209, 16628, 22419, 31728, 17334, -970, -16425, -56398, -83229, -45845, -22846, -17978, -15590, 4434, 1233, -15001, -18948, -6537, -1271, 19211, 18216, -13394, -20755, -35757, -40652, -77158, -68483, -57840, -44672, -13358, 24611, 32927, 16620, -21902, -41418, -37163, 8909, 39851, 33398, 13713, 264, -3495, -7286, -23278, -19168, 4758, -12283, -22693, -16267, -30401, -14104, 25591]
16825B5591J3889k1783l1177k3330Q559n568k332J426K4445n169o087q031o593
16812c6160n683n90J517Q934j3399m7595k3747L117J3956K4393M197J212r17L3556
16798c7209K5986k551n514J667q25J2453J2419k0826j1381r518K2723n098n4679
16785g2353j309O6067M866J7853j7812L208L2880r699j7444K0240L5291j0907
16773E0881k6249k3165j8414j0419Q46l428R494M4193K0948k9623j319N918o279
16760A3384J0976J643k302k518P413k4042j1205l7380l0360J4411L0230K6253
16748c497m773q795R474L4104j3330j6131p13J1720p355R315j4635l045o378j8821
16734c2860k5960J720K5103L6620K8784j0657k1599j3948l8985j8038J3183J9475
$$ y = [25591, 39480, 17697, -13480, -36810, -28251, -33819, -36151, -34725, -10280, -15449, -21536, -29567, -36160, -41843, -42433, -40916, -31982, -45381, -92976, -116723, -113606, -99650, -75257, -71060, -69848, -70765, -37209, -11223, -13774, -19288, -17621, -18446, -5993, 6426, -14400, -25781, -35299, -12576, -17674, -72353, -73662, -7595, -2729, 15124, -2688, 520, 33400, 23701, 6257, 26497, 61788, 50881, 24632, 1467, -16947, -27366, -26520, -29948, -20454, 23739, 44687, 15064, 13745, 19663, 13384, 24360, 26003, 23701, 21183, 28596, 4554, -6651, -44031, -74391, -59980, -29750, -3497, -8270, -17065, -7591, 26513, 13183, -2948, -3661, 8059, 704, 10019, -4616, -7661, -14039, -32860, -58820, -57100, -31997, 4623, 33407, 22750, 1151, -12797, -51782, -69820, -56637, -37162]
16722c7162l848j5593L478L6277M0044M858M480n410n0978M7798J7063j6074l8068
16709a3135k176J1192J5464P604j2892p66J2166j6012j24J1816J0406j8179j4015
16696h651N539n493j7422m172j2096K5089J8626J0235l314j853o23j0592j6296
16683b1023L5557J3617k7612k501K2549L0690K039L658l5097l2087K4377K0151
16671C4318m352j828j9547k5535K2641k3583l2179o43J1672L125J9523K3202J4243
16658B1057J9262J0079K4788j0044l0360k2038k7839k1160J5013L1635j1136j1572
16646a2315J9247O030L841m327r110m3617k4122L2000N357p370k191K6645J8388
16633H456n2124j7628J6701L7635j3885j8437J5128M81j0490J6519J3813M1371
$$ y = [-37162, -41010, -56603, -53125, -16848, 23196, 28054, 32534, 27124, -23854, 23944, 41007, 24933, -13135, -15311, -4119, 11345, 18949, 6057, 5291, 17457, 1445, 1321, 13137, 23543, 5364, -8651, -3112, -8605, -26027, -30199, -42295, -17206, 1420, 11655, 8341, 6488, 5865, -4727, -21023, 14534, 28151, 539, -1962, 20587, 51277, 53316, 56974, 21877, -10210, 14167, 34318, 29966, 28138, 8591, -16944, 5697, -17886, -50065, -50708, -39036, -35911, -16388, 6814, 21057, 40319, 50398, 75186, 65142, 34782, 12744, -15095, -36255, -21242, 10393, -743, -12315, 6932, 12962, 16803, 12476, 3366, -40251, -64373, -32373, -27016, -34386, -36577, -9932, 8456, -43668, -61296, -44595, -6960, -20845, -39282, -24154, -23673, -34163, -17644, -3831, 37540]
16621C7540N515j5829j4918l4053J8719J0933l3759r408k4549L2040J2084j3227
16609b8912k1745J1371L1909k224q506m119m271p124k0537J253J8885j0608j8727
16596f3355J0940k0142j5665K6562L6842J3593O831K0556j2584o066k307J177
16584c618k5147n744K487n019j5034K0419K7219M517j2436p365j2246j494j1069
16571d4530l5095K4327K1998L9077M8002J5094k3911m0544j4385r95p168j0467
16559b8597Q198J1951j2406J3082J0595k0399j6187q70J0409r167j8411J2837
16547c8965K5276L7782q861j9575J2378p47p403j4465R712K4070J4032R777j4568
16534B8443j8197o42J8247K892m0492j3640K2316R056k5483k0101J3401K7303
$$ y = [37540, 43055, 27226, 12308, -21745, -3026, 7907, -25852, -35260, -59809, -27769, -15685, -28912, -50657, -39286, -7377, -9601, -18107, -22226, -26497, -33621, -54158, -52905, -34020, -44628, -63355, -52415, -72557, -88222, -61660, -24818, -11225, -4394, 16162, 3578, -2488, -4795, -3618, -28765, -34509, -32022, -37041, -52075, -31656, -4437, 80, -12356, -19721, -31967, -33461, -44530, -79625, -55298, -33300, 5777, 53779, 68873, 44962, 4418, -9967, -10962, -18130, -28597, -20399, -8448, -20854, -7772, 2823, -17576, -33763, -34633, -24224, -33391, -51802, -38965, -13689, 24093, 15232, -4343, 8035, 7288, -115, -14580, -4868, 19202, 33234, 43011, 28443, 10246, 9604, 27851, 30743, -9749, -23389, -1073, 7983, -17500, -37601, -24200, 3103]
16522C103R15j3150J3797R960n365j5550K113J699P236j4814J7526R881j6837
16509E14P401n417k5370k7891J082M871J8802J8029J3914l214J2225K514l444
16496A4016k2154k7705j0923p495J8493M2090l1709l3515Q844K0167L5763n237
16484F35N706o706j6562Q487L015j1671J4777J2826l068R327K3784k301j6149
16471B2100p982J6881K61m6705l6923O649K2434k00L844L649l0701j31K7037k272
16457b2059m417j0605l608J8270J2142r057j9890p424J0590J6506M825K274L135
16444i318P059N101o207j5803J1966q510k046n744j6480j6621Q055Q998n261o517
16430e1328J8162Q492J9417j563m1384j1662K1523K2256J3752P140j3237P204
$$ y = [3103, 4018, -9132, 4665, 14625, 9260, -6290, -4177, -2478, 4758, -10056, 7470, 17351, 514, 7915, 2498, -22872, -50763, -49681, -44810, -26008, -7979, 5935, 2721, 14946, 17460, 14016, -8138, -35843, -46766, -54261, -35768, 6322, -25387, -58902, -50058, -29891, 5872, 635, 6341, -365, -16927, -8440, -5425, -17096, -2319, 10507, 7439, 16766, 40550, 38249, 22100, 14118, 30999, 31260, -15445, -52368, -45719, -23285, -23485, -19641, -15992, -46693, -46824, -19787, -22059, -26476, -37081, -40689, -22419, -10277, -19334, -39224, -46648, -36058, -19552, -14727, -12453, -9318, -2259, 2842, -3365, -19168, -7202, -15712, -17758, -23502, -39982, -56603, -48548, -39550, -44811, -51328, -33166, -24674, -5257, -6820, -48204, -59866, -38343, -16087, -2335, 4805, -8432, -1228]
16418a228r479n970j3470O257K4874L4236n962k5990M345o473l6328j8665K4324
16405b9529K6691l370k6698J3403j1737O071j463l213N570k8267N620j2478k2803
16392h2203R376l837J1822J9039L0035j2310k8063j8764k021M947J0462K3410
16380c8107J1831k4369j6797j660J6148N0638L5631m782m5654j3270j674l6K9154
16367b947J8923J2744J237J4905l569J1570n796l0520j0753J097L475j8216j5458
16354b3308N001K8962k621q720j1595r812K9048J9937L799M373k2549r907J3038
16341A5646M736L604O638J8672k8687q236J4931k8268L165K2996j481j4084J173
16328A0805M458k633J8719j9213j7656L3334j6394n4194Q10M3906K037j2964j4593
$$ y = [-1228, -10707, -16677, -30147, -23890, 984, 35220, 29258, 3268, 7613, 1140, -35188, -53853, -29529, -2838, -6208, -32906, -19503, -31240, -25169, -26632, -29845, -24275, -52542, -46922, -59400, -82203, -72827, -76664, -64842, -45803, -15768, -28078, -56141, -74905, -76926, -71979, -61517, -38107, -26276, -50645, -67442, -69102, -52954, -2316, 33315, 28533, -17121, -30391, -32065, -32101, -2947, 15976, 28720, 29957, 44862, 41293, 52863, 47067, 16547, 5794, 6891, 10366, -7850, -23308, -18307, 10655, 8034, -686, -12281, -22093, 6955, 26892, 30691, 35064, 12515, 2608, 15646, 20382, 23986, 30624, 49296, 20609, 12373, 27304, -964, 2201, 25197, 23716, 9632, 10805, 15263, 12630, 31349, 12136, -5520, 27814, 11420, -42774, -41964, 1942, 3979, -8985, -23578]
16315b3578k276J661M646k438j413J4607l118m545j38K6549j8295O809J5470k367
16301A1574l3698j3682J5311N492K536K3150j5033j681k1632M763J6895K997J0817
16288G809m116j1335j183L3606l896l020K0967k9340k778M030k741l5427L518
16275b3906k72n615k34pq772J3383J3496J2791J1864K3532J1296J2632O337M801
16261G1326J5k8167m3496O732j672m951m891l0839k5837L1234j2321j9087P259
16248e4695J3388M0777j1365n355J3417J3023p162R831J0679j1905k2781p173
16236a9321k0460M140M232J1953K3415J854J4296N864k69j5247p002K9644J2389
16223D5488l1103M9k136K755j5863j9138l0675K186K7609r72R3J4921J1712J3262
$$ y = [-23578, -25854, -24193, -19547, -21985, -23398, -8791, -11909, -16454, -16592, 9957, -8338, -1529, 13941, 11574, -22124, -35806, -20495, -15003, -12467, 10683, -4350, -6031, -27663, -22900, -6005, -3008, 7809, 3693, -7642, -8825, 24781, 20885, 17865, 38832, 9492, 6714, 10744, 8003, -27424, -23906, -24178, -29793, -30027, -30034, -38806, -25423, -11927, 864, 12728, 36260, 47556, 60188, 66525, 71326, 71341, 43174, -322, 6410, 4738, -213, -5104, -35943, -61780, -30546, -42867, -61954, -54695, -41307, -530, -11895, -17250, -3833, 9190, 2028, 11859, 22538, 10633, -12148, -19321, -39781, -35641, -31409, -19456, 3959, 5813, 20109, 25973, 25704, 10457, 3455, 33099, 45488, 14385, 14434, 12298, 15053, -810, -19948, -50623, -48437, -20828, -21800, -21707, -6786, 4926, 18188]
16209A8188j0159k6004l2801K9735K2468R707o677k5603k163r642R090J8714P875
16196B728l2482k1881M071J9902J1651J0570O77J571L75r134j8019j1146J5802
16183b5315J5986P653p602j9215j759Q51J7312K3971j3008K1783o861k8008k1742
16170c5954L1792K3927j9905M302n678k3115K9606J5837l5092n904J4961o495
16158a1718n14p483n032O836J0427J8928O284k4109Q962R902k5402k0633j4175
16145d7727O968P607Q808L2016n805M994m479J5450o51k0345J9172L1308l48k9058
16131A7910k630K1021j3212j5986Q135P03O038j3365j6130p318J5173J7545k1257
16118c373Q821J5876O806k3845k4182j3307n903K0072q926N88J9108J1142K1458
$$ y = [18188, 8029, -17975, -50776, -21041, 1427, 11134, 4457, -21146, -23309, -32951, -23861, -5147, 2728, -29754, -51635, -47564, -27662, -16011, -5441, -4764, -3193, -2818, -11952, -29971, -41117, -25315, -9329, -1676, -9278, -28493, -30252, -29401, -12089, 11882, -1126, 20657, 13796, -14212, -35954, -4162, 19765, -140, 4162, -1516, -24631, 4975, 20812, -14280, -20184, -5223, -11718, -12232, -19715, -24747, -17911, -7484, 11444, 17728, -6381, 2581, 12483, -12919, -33552, -47727, -40759, -33152, -24344, 7672, 1867, 6861, 2382, 17832, 17181, -3164, 16008, 47316, 46968, 17910, 15280, 36301, 23089, 7103, 15238, 15941, 21979, 8614, -7516, -14834, 339, 17884, -3373, 5448, 21324, 28130, 4285, -19897, -33204, -39107, -19035, -27961, -27373, -8265, 2877, 24335]
16105B4335N93m2507k4026M310J3514J3235k1037J4755k1286L2833K8684M102
16093B7505l2504q411l1232n872J4644K615q924L2605J7314K458k3703P829N960
16080B84J0800q721m736k4244l354l9515k1558J3733K5128L572k3319K3159K3024
16067b5747J42L4263J645K279m552k3036j5050J5471J907P409k3348l2194L1008
16054b9803K3432J5825Q072j0815j430K0049k0881r503n510j2950J3521o009j972
16041a7974K1651k742j4177j0406j3023M858M0724J0855J2998K2093N774k2278
16029C8353j244q424R177j7439k377o331j7753K1567k448J5815J6310j018j9731
16016B4457J258K101L287j5840N388k1343j6051k7650K1323J1783J4929k336k7998
$$ y = [24335, 24928, -17579, -41605, -37295, -23781, -10546, -31583, -16828, -38114, -5281, 23403, 27505, -4999, -13410, -44642, -50514, -35870, -33255, -42179, -9574, 7740, 10198, -13505, -5676, 284, 11084, 2363, -2373, -26617, -29971, -69486, -91044, -77311, -52183, -48611, -71930, -48771, -25747, -25605, 8658, 10303, 12582, 8030, -15006, -30056, -14585, -12678, -5269, -28617, -60811, -29803, -6371, 9454, 17526, 6711, 5281, 25330, 4449, -5054, -10564, -23514, -9993, -16002, -17974, 3677, 935, -13242, -23648, -36671, -31813, 8911, 19766, 32764, 54857, 60631, 38353, 37109, 28685, 37862, 20423, 18046, 11715, -6038, 15529, 13081, 28896, 45206, 44188, 24457, 25715, 27816, 31103, 15263, 20651, -692, -16743, -44393, -23070, -11287, 3642, 1306, -26692]
16003b6692R712K0684R285n765k338k1478j1311N179J81J212K3017K516j0162
15990e960J5771k7019L207j5886j7397j5430J0943K5629p76K074M673J9724J1428
15977A0981k995Q675r236j8470k680J9525j2371k731j8810J6114K4908J4376j1774
15964A5512j5147O472N800k726k542O179J1710j7149l4991m854J1617r636j1493
15951d1248N16L2289j114K5322M134j738O03k3676j6987J2628j1870k8J6532j0820
15937a5457n884L3988J3641j133J3774R058j7564l3928K2791L5576j8090k946
15925C3826l9714L747N023K8224M6906m3945p737L904j3640k50J9382O380k8276
15912A3830j554K7629j7080m703J3396r253M451j9552q318J6695K2253k183j3321
$$ y = [-26692, -16980, 3704, 12989, 7224, 4886, -16592, -27903, -22724, -22543, -21331, 1686, 4202, -5960, 9811, -17208, -14001, -29887, -47284, -62714, -51771, -26142, -26918, -24844, -20171, -447, 10981, 7986, 16661, 7425, -11045, -13725, 5800, -6571, -9302, -28112, -11998, 12910, 27286, 15512, 365, 6837, 12637, 9911, 7369, 13548, 25258, 8109, -26882, -31736, -20119, -29755, -41248, -40732, -8443, -9557, 15765, 19899, 18161, 18764, -4912, -21899, -9271, -21141, -21169, -4637, -15457, -21341, 12647, 26288, 25155, 38929, 47987, 30423, -3505, 19286, 54862, 36772, 33826, -5888, -2141, 2882, 31106, 78012, 34067, 26330, 30234, 16594, 16344, 35726, 42106, 13830, 12276, 39905, 22825, 18122, 31518, 22265, 26716, 7164, -1154, 15541, 37794, 35611, 22290]
15899B2290k2051l6150k3909R462O244J798J8612K7390r971P586l2546l5012J6778
15886d9479P570K2442k4750p813R849J1909N300J7929J1024k7130Q511j4325m317
15873c3280m834l030M6885K6827l657k7566N837M612m300r327p488j083L840K8523
15859B1959M23k7952j479k702J1526M788l895m0271l8822J0099J6197P973J7619
15846b4537m93K437o70r391o789K5265K115O114m372p455k2324J9162K220M178
15832a4540K6668J5462o961j3789l1759o2608N344L9674L3828o622k4056K1926
15820a7433R261l4073R952J7135K8992J2104J2033j8586l5184J5371K3600l6350
15808a3178j9144L7658L0845k0767j9751j1885K5052K0422o766q988j4003l605
$$ y = [22290, 239, -35911, -59820, -50358, -44114, -42316, -23704, 3686, -6285, 1301, -31245, -66257, -49479, -41909, -19467, -44217, -52030, -42181, -30272, -24972, -7043, 3981, -23149, -14638, -28963, -33280, -38114, -41144, 5741, 32568, 28911, 1345, 7182, 11794, 7494, -1833, -9321, -10404, -6564, 21959, 22382, -5570, -7049, -9751, 1775, 6563, 2668, -37603, -76425, -66326, -50129, -42156, -24537, -25030, -22593, -23263, -32654, -39443, -14178, -12063, -5949, -10321, -17776, -40100, -20938, -18718, -14540, 12128, 27590, 20629, 6840, -24919, -87527, -82183, -42509, -8681, -15303, -39359, -17433, -8172, -42245, -32293, -15158, 13834, 25938, 37971, 19385, -15799, -428, 23172, -13178, -32322, 5336, 36181, 15414, -4337, -16222, 8830, 29252, 22486, 13498, -505, -4110]
15796d110J2682K6386J567R89k1450P904j0511k4220l6674j9943K55J4896O635
15783d5594Q575J6936J6621L548k878j6011N404N723M184m2228N943N875j4925
15770d8827K9372J6573M102O434J1828j2005j0848M254j1735J5537O833L1970
15758D3488K829k6217k8436Q675J2105K750J6037J2478l038k1133j7523J1909
15746A3924J6615j8715j9587O86J2972K3253k3039l5849J4879p060j1184j522
15734c4627k0081M615K2221L2383k689K7067j8572N080J6502j0131k5708j9071
15722b3011O097j9077M8226R988j7609P241j712j9499M324J6411Q653m288J7758
15709C3502J2695J6466J67k5613j9849k8173l2642M981K2478Q429j4187L178J6780
$$ y = [-4110, 8572, 34958, 36525, 37514, 16064, 23968, 13457, -10763, -47437, -67380, -67125, -52229, -45594, -37019, -20083, -3462, 86, -2792, -18803, -13399, -7676, -3492, -45720, -39777, -33902, -48827, -19455, -2882, 1220, 7654, 19482, 7477, -3371, 883, -10852, 4685, 11518, 43488, 46317, 20100, -8336, 339, 12444, 15194, 31231, 43709, 40671, 19538, 2015, 13924, 30539, 11824, -7763, -7077, 5895, 29148, 6109, -29740, -14861, -21921, -33105, -34627, -54708, -50093, -27872, 4511, 1822, 28889, 10317, 15397, 31899, 21768, -3940, -23011, -16914, -35991, 12235, 22223, 4614, 11855, 10143, -9356, -5032, 11379, 20032, 15744, 33502, 46197, 62663, 62830, 37217, 17368, -10805, -43447, -38466, -15988, -7559, -21746, -18568, -1788]
15696a788k0906j3781j904K3641R569J5960M132M787j3575k8395J287K131r527
15683b8369J0993P566J5766q178o615K5266K1446j2873j7601N169o187L758Q28
15670A0969m208k1602r588p702J4477Q13p117j8041N0164k0527o312J644J6964
15657f6J5375J5804j6336n031L073o469k2827R514L8391j4557j5628p597k3818
15644c0172J1630K2959K823O013O241K2322k7930k0639J8802O736k621j6029j1221
15631a1086K9482K5688k8738j7795j9769L6297K9675n685j081N445N815p520k3025
15618A7703m4728k84J780K972L353K2254J7206J568J6737j1787J7238J9311l5943
15605B7380K4340J1695k4035j4856m0077j4076K0366J1239J5410j0914j9436j6202
$$ y = [-1788, -22694, -36475, -38379, -14738, -5169, 10791, 14923, 19710, 6135, -22260, -20973, -18842, -28369, -17376, -9810, 5956, -2222, -8837, 16429, 37875, 25002, 7401, 12570, 6383, 10141, 10969, 6761, -14841, -24429, -32131, -17654, -16841, -23958, -41999, 8165, -12362, -18674, -17030, -66, 15309, 31113, 14777, 9746, 12819, 6350, -16477, -6963, 31428, 16871, 1243, -6354, -30172, -18542, 4417, 7240, 13253, 19494, 41816, 13886, -6753, 12049, 18785, 16164, 135, -11086, 18396, 44084, 15346, -2449, -22218, 14079, 43754, 38069, 36988, 42433, 48248, 40728, 17703, -27025, -27309, -25529, -22557, -19204, 3050, 20256, 21824, 38561, 26774, 44012, 63323, 27380, 51720, 63415, 39380, 24524, -15553, -29629, -9263, 1976, 17386, 6472, -12964, -29166]
15593b9166j8388M066L3229K0896q955l4858k9240J1238N927J7277R300j1474
15581c0148n406K114J0213k8866j1659L2644Q705j2553k3974n621J9550L2475
15569a2526J9684j85Q343j9715J7206R912l5476J300J5600l848J8870j1922m123
15556C120m950j5907k1853n752q915K890L0469L5723k425P370j1086j321l3273
15543b5910k0904J6773J5326o673j0259M525M595J824L0633N029Q987o799m311
15530A2836J9102N935L953O264j7292J776K708p921l9686Q87Q959K6729l9015
15517a4765L947K8791l4256p623J1808J7325J0018J0417p489j8423r327P557L1042
15504B9022q028j1323q643K2963J9891r624k373k7789P888j3575P466K197P865
$$ y = [-29166, -47554, -43488, -10259, 10637, 1682, -33176, -62416, -51178, -45251, -27974, -18674, -30148, -35554, -33440, -23227, -52093, -63752, -31108, -22403, -34956, -58930, -64551, -45001, -12526, 7158, 6973, 15316, -4399, 12807, 22719, -12757, -11457, 4143, 295, 19165, 7243, 3120, -1830, -17737, -39590, -45342, -54257, -51367, -20898, 14825, 12400, 19770, 8684, 7363, -25910, -46814, -30041, -14715, -21388, -31647, -27122, -22527, -20703, 9930, 14959, 23946, 17147, 12836, 31938, 37873, 41826, 48090, 30798, 32574, 35282, 27361, -12325, -11438, -2479, 24250, -14765, -10818, 17973, -16283, -23906, -12098, 5227, 15245, 25662, 18173, -250, -9577, -2020, 29022, 20994, 9671, 1028, 23991, 43882, 34258, 31885, 4096, 11984, -1591, 5875, 8072, 15937]
15491A5937J776o005p006J8307n342J1365o763j4808j4830j5806K073J492M774
15478a4836K4360k0159N068O530m78l507K5163J2968j3630R410j2287k8100o679
15465a6177j6015j0539j0309M8375K6599m581j0752p507j3864q587J7884j355
15453f828m454K2889N888J7137J0224j5390l2473J028K3302k6470m4322l6962
15441h6431Q270N9064J5595K80K154j4150k2522K0044J8275n488Q332j7808q823
15428b3208M0549p714k1917K5621J6055j8353j0138O725J7841J8002j1638O774
15416C8599l25j4157j9611k2280j5400L7627K4196k6119j2257m500j4038m799
15404c3064J9882K5718K1670k3556m491j5130j5199j3723M1619K1269j1928k5151
$$ y = [15937, 17713, 11708, 4702, 23009, 17667, 29032, 22269, 7461, -7369, -23175, -21102, -19610, -14836, 9524, -10635, -5567, 963, 485, -3022, 22141, 35109, 21479, 30889, 18602, -9498, -16177, -32192, -42731, -53040, -4665, 21934, 17353, 6601, -906, -14770, -23357, -5473, -6828, -11282, 11607, 17495, 34632, 44856, 29466, -3007, -1979, 21323, -5147, -49469, -86431, -78161, -19097, -3502, -3222, -1068, -15218, -37740, -17696, 579, -4909, 3423, -14385, -23208, 17341, 9627, -12290, 13331, 29386, 11033, 895, 7620, 25461, 43463, 31825, 38599, 38274, 24117, 4506, -17774, -33174, 4453, 28649, 2530, -9727, -14227, -28265, -33064, -13182, 12536, 34206, 10650, 6159, -8971, -24170, -37893, 3726, 24995, 13067, -12084]
15392a2084L743j3696N199N2753L741j1416r635j1910q412j6230J1420J6121m393
15379E201j9417j5766l3J5321j6915o795r446k484L708J1335j7216k4957J2172
15366f5292K8423L1450q271J5923L2815Q566J1800k051o181J5164k0481m1722
15354A43r438l740k2765K669L7899J2922j8634j6864j2079L3454K5433O969r573
15341B6396k0834j6535L6676J1657L693j0351k7640l737K194n491K179k6546m2005
15328g0344M2542J4513j1737N306M072r993j0021L292J2169J6833r722Q14J0299
15315a977L0424J5526P679M511j733k6874l5151K142O318L913Q067j2223Q767
15302I389J482r059R956j2235n003J1173Q286o572j7609J1745R865j5589J970
$$ y = [-12084, -8341, -22037, -16838, 35915, 39656, 28240, 18605, 6695, -1717, -17947, -6527, 9594, 5201, -14216, -29982, -30015, -14694, -31609, -38404, -47850, -50334, -46626, -35291, -52507, -77464, -65292, -36869, -5419, -13690, 2233, 35048, 43614, 55414, 53363, 47182, 62346, 41865, 143, -9295, -13035, -35800, -33131, 4768, 17690, -944, -17808, -29887, 3567, 29000, 35969, 26396, 5562, -10973, 25703, 37360, 41053, 30702, 3062, -675, 1519, -3972, -1793, -28339, -70344, -27802, -13289, -25026, -19720, -15648, -25641, -35662, -32370, -20201, -3368, -13090, -12276, -1977, 28447, 43973, 51652, 56163, 54430, 27556, -7595, -5453, 865, 4778, 12845, 622, 9389, 10871, 1812, 11768, -467, -5470, 5703, 13989, 7417, -10192, 1553, 11418, -4171, -2201]
15289b201L1992J3322k693j9797J2285J6305j040j8842P040Q876j768j5644k0174
15276G661j9014P093J035k3563J6815L7474k688k5070k0280p07j2870P921J6329
15263i864n381J34q823N16q990L014L1053k2688k760J0293m7478J0552K3356q713
15249c5779j3563K3826K0681n861k111j2783o094m46p209J8939l341n634J124
15236b8251o235o196L40J8414O531J251J8099l762J8523j1045j8831l589L0261
15223A5510M1743r668j0520k2894Q478M289J2075j0623Q790K185m6237l2075K6184
15210a2763K3792J991o443J4074p763J5579q997q19L8502O871k9204j2000J2822
15197C5642j7009m5224j5216j3106J9076L6574L0627O082R636j8061r275r934
$$ y = [-2201, 29791, 43113, 40420, 20623, 32908, 49213, 48173, 29331, 36371, 45247, 43479, 27835, 7661, -11353, -4260, -3225, -26788, -9973, 27501, 24813, -257, -20537, -21244, -34114, -26193, -9864, -15245, -15111, -23934, -23418, -32408, -29394, 1659, -21029, -23789, -13496, -60974, -50422, -27066, -35779, -49342, -25516, -4835, -10696, -12807, -25590, -31684, -32130, -39339, -20400, -23741, -29375, -28251, -34486, -40682, -40342, -21928, -15397, -14146, 3953, 191, 18714, 7669, -11162, -14751, 15510, 57253, 47585, 37065, 14171, 22649, 26938, 39013, 28390, 37180, 39365, -6872, -38947, -12763, 11029, 13020, 6577, 20651, 12888, 28467, 19470, 18651, 57153, 64024, 34820, 22820, 35642, 18633, -26591, -41807, -54913, -35837, 737, 31364, 37446, 47082, 29021, 19746, 9812]
15185I812k1495R233L213k0461k2566j276J0728L2785O527l1501k4873m100J2633
15172d1341P36n885K942J4472N215k4692J7318K4587j991J4868j4235j031K6891
15159A7854K8876n318K595j2963j7774j4985L107J6861Q285j7921j2796M201r240
15146i218K0353n428p360K7072m855l7539k6099M42K90L817j0353J3253K3671
15133a1954K1015K9622k4977l6190J996J0977r640l5257j0897J3646N5234L0625
15121C4200n410j0957k8799j0394j035L644j606k285J799J1526M281K5518l073
15108A7409K4001L744j0731L876J8376R859R912m846j4449n714q181R661j1559
15095D1358p043j185k7518k8419L0854P454k2648k305j5915j3155J8906J5086
$$ y = [9812, -11683, -2450, 763, -19698, -42264, -43540, -32812, -27, 6500, -25001, -49874, -53974, -41341, -40605, -46490, -43548, -29076, -23861, -48553, -31235, -6648, -8639, 6229, -8006, -9037, 17854, 46730, 41412, 44007, 31044, 13270, -1715, 1392, 18253, 26538, 8617, -4179, 22, -9218, 11135, 5707, -1653, 25419, 20564, -16975, -43074, -42632, -42342, -38525, -48878, -35625, -11954, 9061, 38683, 13706, -22484, -20488, -9511, -19151, -54408, -65305, -51659, 3575, 34200, 28790, 17833, -10966, -21360, -22395, -18751, -20357, -22642, -20843, -9317, -5036, 20482, 17409, 41410, 45154, 34423, 38299, 56675, 66534, 76446, 71600, 57151, 51437, 43256, 52917, 41358, 34315, 33130, 5612, -22807, 8047, 15501, -7147, -9452, -25367, -38522, -19616, -4530]
15083d530L3457J6409j8083j5722P805k4134j3464J7559L8031r843K098M379m068
15070B9894J308k5923k0739j3952l8316J5926K6540M0165L808K4387n546m7208
15058i656l164J9834L5718p161k2594j0638J4133J1037p04k101n625l234R061
15045B4906m507l6046K3530K5008j0700n359P942m79j2327P67K1018n84K0037
15032E3206K516K6173K6292k0754j4645j2734m650J1054l198Q572n607m902K2064
15019H3387J2764Q628K7260M06k8758K3329K5228J4883N2432N7527J15635J30740
15007E23461P1500P316L5796Q4267J22323J76080o8024m19397k14598j33818p1000
14996A13906l2146m4934j1007L310j7623R49L0500J583j3661k584J4360n354K931
$$ y = [-4530, 28927, 45336, 27253, 11531, 19336, -4798, -18262, -703, 37328, 27485, 29583, 33962, 29894, 31202, 5279, -15460, -29412, -67728, -51802, -25262, 14903, 18711, 43098, 37552, -9656, -12820, 7014, 42732, 35571, 12977, 2339, 16472, 27509, 26805, 24704, 19079, 15845, 24906, 20399, -15647, 7883, 32891, 22191, 16832, 24774, 24295, 11968, 12735, 33753, 33169, 53206, 55722, 81895, 108187, 87433, 72788, 60054, 55404, 66458, 63260, 71832, 66225, 61323, 83387, 96151, 104779, 132039, 132445, 103687, 127016, 152244, 167127, 219559, 277086, 392721, 523461, 594961, 602277, 638073, 722340, 844663, 1020743, 952719, 533322, 318724, 184906, 113906, 81760, 36826, 25819, 29129, 11506, 12455, 42955, 44538, 30877, 28293, 42653, 37299, 40230]
14983D0230J4103K2940p317k2791J1592r461k3559N242k6160n402J0355L78k8465
14970a8315k385J5056K16K6883J610n971O202N677P917m3973p168M716q16k1129
14956c1480J1767M6108J0984j1226m1915o985M283J8343J1629K657L786J3400
14944C1351k760o689k0044p286J5117J4113j2860k1469K6846J6715l5927k0045
14932b2938O540Q789k0522q303K0206n29J4261J683J1009K0614J176j7391j756
14919A2839m104j7775L0364K2547R162k017k7855l4882n652r937K5221K2354P542
14906B7807N374l1723k1207R916L770P977R064m7322m1209L990L6123K9100j4534
14893b2874j1213Q974L5497k1839m0620K1587K8570L3268K7994k3550o5557j9364
$$ y = [40230, 54333, 77273, 69956, 47165, 58757, 49296, 25737, 30979, 4819, -583, 9772, 10150, -18315, -20700, -5644, -5428, 21455, 23065, 17094, 23296, 28973, 36890, -7083, -14251, -9535, -10351, -31480, -19713, 26395, 37379, 26153, -15762, -22747, -18464, -121, 11508, 14165, 17951, 31351, 28591, 21902, 1858, -5428, 9689, 23802, 10942, -10527, 16319, 33034, -2893, -22938, -16398, -7609, -28131, -36434, -16228, -16757, -2496, -813, 10196, 30810, 31986, 14595, 12839, 8735, -9040, 21324, 43871, 53033, 51016, 23161, -11721, -17373, -27310, -2089, 20265, 27807, 33181, 1458, -19749, -9833, -6063, 1914, 10978, -36344, -77553, -73563, -37440, -8340, -22874, -34087, -25113, 10384, -11455, -52075, -30488, -1918, 31350, 59344, 35794, -29763, -49127]
14881d9127J3810M853k801J3980k03J5165R540n836L0839l825m244j8715M0660
14868D4096M8325l7186k9570J3130K4086k4052L438K3828K8799o531k3335k8106
14856C6922k0139j5247o462J8442L5833m5106j4987p273N092J800l249k0380k1216
14843e5970K2580K2365P258K2006l836k4939k94J2338j196J6702K5111J0209k4072
14830B8262m55j1043j5521J8777j3322j6160P231K618J6249J5061m47m640K191
14817B8801k6992J1542l0872r593l80N405K1229p154J4991N268k5183M334P004
14804a600J6111o226j0522J3841K927K3445L7961r495p154J6813j0850k0593k4003
14791B0655R77N7102K609k0592l1502p185L8899p875l0434N456K8614K1595m369
$$ y = [-49127, -35317, -30464, -33265, -19285, -19488, -4323, 5217, -619, 30220, 26395, 22151, 3436, 44096, 92421, 55235, 25665, 38795, 62881, 38829, 42267, 66095, 94894, 88363, 65028, 36922, 16783, 1536, -4926, 13516, 49349, 4243, -10744, -18017, -12925, -11125, -14374, -34754, -55970, -33390, -11025, -3767, 18239, 14403, -10536, -10830, 1508, 312, 17014, 42125, 52334, 28262, 27807, 16764, 1243, 20020, 6698, -9462, -2231, 387, 16636, 31697, 31250, 26610, 28801, 1809, 13351, -17521, -27114, -27494, -22089, -860, -8014, 6977, 12245, -12938, -8604, -1600, 14511, 8285, -2237, 11604, 14531, 37976, 75937, 66442, 59288, 76101, 65251, 44658, 20655, 21632, 78734, 81343, 60751, 29249, 22064, 60963, 53088, 22654, 28110, 56724, 78319, 73950]
14778G3950l8299n337K8832M5647J0369r460j337j615k6888l7440Q153K7703k3386
14765E0892k6599K5913rl4674q63o438J5506J5124j794j5783r940r919q104n394
14751a2082J5774J879o590R459p08o795o18J9774j0617Q551j014J413q627J8393
14737B8192j1742r487k4023j8607L5702L6057k7915O827M1164M2476K681r406
14725I1919N00L8329L1635p987O790K3260J7069Q721j5133k490K5167R193j1947
14712B15026q723K723J0941K1823L364Q826N3848O5986K6061M9605R7924J17901
14700F65305J11844J15248J35530J31121J44100J33886J06157O7410k6705j21969
14690A461927j89084k32626k34755j79738j62837j52185o6154m6915j9011J430
$$ y = [73950, 35651, 30314, 59146, 104793, 115162, 105702, 104365, 102750, 75862, 38422, 46575, 74278, 50892, 24293, 50206, 50197, 15523, 14660, 8222, 23728, 38852, 37058, 21275, 11335, 1416, -6688, -12082, 3692, 5571, -1019, 8440, 7732, 937, 319, 20093, 9476, 18027, 17013, 18426, 9799, 28192, 16450, 6963, -17060, -35667, 35, 36092, 8177, 15004, 56168, 98644, 101325, 91919, 92419, 130748, 162383, 154396, 161186, 184446, 201515, 210236, 195103, 192613, 217780, 226973, 215026, 206303, 209026, 219967, 241790, 245154, 253980, 307828, 373814, 399875, 449480, 547404, 665305, 777149, 892397, 1027927, 1159048, 1303148, 1437034, 1543191, 1610601, 1583896, 1461927, 1272843, 1040217, 805462, 625724, 462887, 310702, 244548, 197633, 178622, 180052]
14680A80052r494j6615k6827l855j2461j3831L858j5292Q31n453j9643j6769r075
14667C5426Q601k911L0670K336k368J4552K0027J0553P198j8494m4668q791K3572
14654G5703j4785n914J5304K3373L3193K6276k9391j3191N3124M3158L6117N2463
14642B95430K8663L5986K9730L8538L9362K0684J2763l3044o7090n0686o1519
14631B88817p0156o0069k2482l7070j8973P564n4961j8983J5750k4166j2964J8294
14619A0601j1749j2154J6817M5911q523K805r896K0686K051k1792j9839q214K7038
14606C3742N056q304j1263K945k5888j8339K2001K7451J8876J213k1347r735k8358
14593a1950K6780K7005q25l1831j1494J2546K087K785r50J2416Q969j4298k4569
$$ y = [180052, 170558, 153943, 127116, 123261, 110800, 96969, 100827, 85535, 86366, 80913, 61270, 44501, 35426, 44027, 41116, 71786, 74122, 71754, 86306, 106333, 116886, 124084, 105590, 60922, 52131, 75703, 60918, 55004, 70308, 93681, 126874, 153150, 123759, 110568, 163692, 206850, 242967, 295430, 324093, 360079, 389809, 428347, 467709, 488393, 501156, 468112, 401022, 350336, 288817, 218661, 158592, 136110, 99040, 80067, 87631, 32670, 13687, 29437, 5271, -7693, 10601, -1148, -13302, 3515, 49426, 40903, 43708, 33812, 54498, 56549, 34757, 14918, 6704, 33742, 38798, 30494, 19231, 22176, -3712, -22051, -50, 27401, 46277, 47490, 26143, 16408, -11950, 14830, 41835, 41010, 9179, -2315, 10231, 12318, 15103, 14153, 26569, 35538, 21240, -3329]
14580c329o89J1268R53j3773M008L9941J2140L79L692o819l5153j6214L1215K002
14566B9621J0121J9387L641J3793M8707K0712n819p817K730j2026r169j3587j5137
14553H5157j9484n2926m8109l6893k263J9152N669j4229Q770K9710l365J7958
14541a0853K7500J2099k2167J7831J9977K298j0669j7801N845J2903j7591l3875
14529a4503K1146J8951k9502J5932j821J8649k677j0642n411K7923K3652j15l778
14516E7804r926j1605J1659l777R611K5926L25k9990K6230M1073j6649k600J0330
14503A08411J5088K6463M467n094K9217L3602k1733K1527j5595j6004q804l5151
14491A36394l079M0358q089k7498m5936l3734K966l430j9082o712k3339K1338
$$ y = [-3329, -4018, 7250, 8203, -5570, -1562, 38379, 50519, 50898, 54590, 47771, 12618, -3596, 27619, 29621, 39742, 59129, 62770, 76563, 125270, 145982, 140163, 132346, 135076, 123050, 113881, 100294, 85157, 65673, 12747, -35362, -72255, -74518, -55366, -49697, -63926, -55156, -25446, -28811, -10853, 16647, 28746, 6579, 24410, 44387, 46685, 36016, 18215, 24060, 36963, 19372, -14503, 6643, 25594, -3908, 12024, 10203, 28852, 26175, 15533, 10122, 38045, 61697, 61582, 57804, 47878, 36273, 47932, 44155, 53766, 79692, 80017, 50027, 76257, 117330, 100681, 98081, 108411, 123499, 149962, 154429, 149335, 178552, 212154, 190421, 211948, 196353, 180349, 171545, 136394, 133315, 173673, 165584, 138086, 92150, 58416, 61382, 57952, 38870, 32158, 8819, 30157]
14479C0157j8594o079P873J1944O928N906K8296K9292N0151M3340R167L4840Q305
14466B41526J3625J3598P957q283l3690k7434j4115L128J4682m2430k9547O887
14454A45904p592k8418m2729k8137l0757J7776K1304j7666J9209K1404J2157j904
14442H0551J9942K3261J4763j6760P674M378j1475K7835K5995j2067k4829k7580
14430A11688J004J6435j6502j6835j9643k6024k618K9830J6125q966K347K05j7039
14417G0007J3713J0894p548J5586K1235K8929K9559K0295K4728J3041m408j6217
14405B19814O259k6505K924j0260j3223r44j4242o297J0683J9750p956J6804N1518
14392B48325N729j3222j2793r06J3406K5008M0376K0057Q644j620K5394L9347
$$ y = [30157, 11563, 5484, 13357, 25301, 32229, 38135, 66431, 95723, 145874, 189214, 198381, 233221, 241526, 255151, 268749, 276706, 268423, 234733, 207299, 193184, 196312, 210994, 168564, 139017, 145904, 138312, 109894, 67165, 39028, 8271, 26047, 47351, 29685, 48894, 70298, 82455, 80551, 100493, 123754, 138517, 121757, 129431, 133809, 122334, 150169, 176164, 164097, 139268, 111688, 112692, 129127, 112625, 95790, 76147, 50123, 47505, 77335, 93460, 84494, 86841, 87046, 70007, 83720, 94614, 87066, 102652, 123887, 152816, 182375, 202670, 227398, 240439, 236031, 219814, 226073, 199568, 202492, 192232, 179009, 178065, 163823, 157526, 168209, 187959, 180003, 196807, 248325, 254054, 240832, 228039, 227133, 240539, 265547, 305923, 325980, 334624, 333004, 358398, 397745]
14380C97745J9377l850N4351M9250K9601O9026P2424K6461Q439N7357N3743J0996
14368H44920j2058n2028o9804j08526j10374r9457j07213q7327n0675P718M021
14357A59197k0851L363Q654k3980M90K5072K9983J6984r793j5118q158j2058L0212
14344A83997M7527L4895j8765k0927M940j673k0245k0649R030J8112L494P884
14332B27620J2684K1765J5673L3104M7983L9514K4347q525k4433K4548O7822K9267
14320E11369J6844L2105L0996L4231L9761P1077K7833m342K0008K9018L8431R2266
14308I39597Q2110K2793N2066Q2797R9784R9227R9518J48070J49254J47852J62808
14297B085876K01066K03990K16239K39162K86039L29824L61962M18984M74819
$$ y = [397745, 417122, 413272, 467623, 516873, 546474, 615500, 687924, 714385, 722824, 780181, 833924, 844920, 832862, 780834, 711030, 602504, 492130, 392673, 285460, 198133, 147458, 155176, 159197, 138346, 141709, 150363, 126383, 126873, 151945, 181928, 198912, 189119, 174001, 165843, 153785, 183997, 231524, 266419, 247654, 226727, 231667, 229994, 209749, 189100, 198130, 216242, 219736, 227620, 240304, 262069, 277742, 310846, 358829, 398343, 422690, 414165, 389732, 414280, 482102, 511369, 528213, 560318, 591314, 625545, 665306, 736383, 764216, 759874, 779882, 808900, 847331, 939597, 1021707, 1044500, 1096566, 1179363, 1279147, 1378374, 1477892, 1625962, 1775216, 1923068, 2085876, 2286942, 2490932, 2707171, 2946333, 3232372, 3562196, 3924158, 4343142, 4817961]
14288D817961N46108O26353O41059O91121P44618P97292Q20500Q53389R01140
14279A1439541R49173J021719J099692J133058J205486J268246J299482J370898
14271B0787295J434654J517419J616848J798829K033851K240396K522663K786891
14263C6738846K991538L176510L341081L481621L637229L830193M273208N348909
14255F6819135P335203J0413223J4411131J8754541K2548631K5076594K6769670
14248A92128128K8091485K8809690K6060822K1981153J3054256m643825j8051808
14241B87429901l4013671m7329704m7720753m2998614l5544986k5087248j5068694
14234C9666231q928423n598557l679320k507993j786346j403335j185882j164398
$$ y = [4817961, 5364069, 5990422, 6631481, 7322602, 8067220, 8864512, 9685012, 10538401, 11439541, 12388714, 13410433, 14510125, 15643183, 16848669, 18116915, 19416397, 20787295, 22221949, 23739368, 25356216, 27155045, 29188896, 31429292, 33951955, 36738846, 39730384, 42906894, 46247975, 49729596, 53366825, 57197018, 61470226, 66819135, 74154338, 84567561, 98978692, 117733233, 140281864, 165358458, 192128128, 220219613, 249029303, 275090125, 297071278, 310125534, 305481709, 287429901, 253416230, 206086526, 158365773, 115367159, 79822173, 54734925, 39666231, 30737808, 25139251, 21459931, 18951938, 17165592, 15762257, 14576375, 13411977]
14226A3411977j194795j281881j379873j300129j167288j019566p50181n41870
14218D776394m65927l60490k62338j99928j91379j60951j26009j36875j72199
14209B700298j78581j49308j07179j18060j01960p3224r6215j20595o7599n9259
14199A628318m9406n6820n8401l8306l5951l2335l4425k8629n9146l5991m0463
14188A158445k0740k5722m7054m1896k6743j1074J0024j0358o4047l9728k2068
14177H59039l5029j5789k2894n5426r793N76j2967k5235q154J9654p762k357j0361
14164F73502j9686l783J0811j9898J3054l8450j8317K571j3650m6997k6786m706
14152E07665p83k973j7189n053j4784M041K0486l0682j7764l6047Q607P963N942
$$ y = [13411977, 12217182, 10935301, 9555428, 8255299, 7088011, 6068445, 5318264, 4776394, 4310467, 3949977, 3687639, 3487711, 3296332, 3135381, 3009372, 2872497, 2700298, 2521717, 2372409, 2265230, 2147170, 2045210, 1971986, 1875771, 1755176, 1687577, 1628318, 1578912, 1522092, 1463691, 1425385, 1389434, 1357099, 1322674, 1294045, 1234899, 1198908, 1158445, 1137705, 1111983, 1064929, 1023033, 996290, 985216, 995240, 984882, 920835, 881107, 859039, 824010, 808221, 785327, 729901, 720108, 720684, 707717, 682482, 674328, 693982, 686220, 683863, 673502, 653816, 650033, 660844, 640946, 654000, 615550, 597233, 599804, 586154, 539157, 512371, 507665, 506882, 503909, 486720, 481667, 466883, 470924, 491410, 460728, 442964, 406917, 415524, 423487, 429429]
14139D29429K9145k1916r453J5018N660j0297M186n385k4200j4846l2083O441
14127C71699J2688j7465j2981j368l9524j6868j2299n169Q373j149k3459l2126
14115B30352l2376k4983k3604q658J6045J3553J6860k2164l4014j0134J5265J9161
14103A55303K2313j5362k0007J5233l119J5867J0576j2337O754L5091O069N931
14091B22312J2481j9056m7558k197J1557O135j2870o120p374J5764J1493n4054
14079A30513m6197K816k808J9532N2829K3553J5608j9416k6765p454Q055J5021
14067A65287m26m2144k0623j0582k089K1076O270j5342j5050Q533j9818k7255
14055D7837k1071j2242Q772L7135K1418O276K8205K2103J4327p11K7263R301N610
$$ y = [429429, 458574, 436658, 427205, 442223, 447883, 437586, 441772, 436387, 412187, 397341, 365258, 371699, 384387, 366922, 353941, 352573, 313049, 296181, 283882, 278713, 287086, 285937, 262478, 230352, 197976, 172993, 149389, 140731, 156776, 170329, 187189, 165025, 131011, 120877, 136142, 155303, 177616, 162254, 142247, 157480, 154361, 170228, 180804, 168467, 175221, 210312, 216381, 222312, 234793, 215737, 168179, 165982, 177539, 183674, 170804, 164684, 157310, 173074, 184567, 130513, 84316, 87132, 84324, 103856, 156685, 180238, 195846, 176430, 149665, 142211, 150266, 165287, 164861, 122717, 102094, 91512, 89423, 110499, 116769, 101427, 86377, 94910, 75092, 47837, 26766, 14524, 23296, 60431, 81849, 88125, 116330, 138433, 152760, 152049, 179312, 188613, 194223]
14042A94223J4278P288k7345m8892j458J660k3395J0764l372K7886O237j9358
14030A38516k9224P969j2656k3368J6438M9218Q360L07k1177j9113j9261P231
14018A03240N331L3522K8165L7203n309j7128j8660k6770J9047L1284K7101J0228
14006B27254j2889l80l2561l0144J866J1747J005J7227j3941k0545O003J8954
13994A73596j0367M568p18K5602q628k0829k9831k6379p44j67K0302J5020j2893
13981A28532k0885N280R349k438k842J6790K1678o210l6388K2113J2403J2934
13969A60316j2140K8535O29m7188l399j393o195M361P953K1234J3110M421j5543
13956A54701K50q491k4784j1349l789k0213n732K0055L9239L837j550k3822L187
$$ y = [194223, 208501, 215789, 188444, 139552, 138094, 139754, 116359, 127123, 123751, 151637, 157874, 138516, 109292, 117261, 104605, 81237, 97675, 146893, 155253, 155560, 134383, 115270, 96009, 103240, 108571, 142093, 170258, 207461, 202152, 185024, 166364, 139594, 158641, 189925, 217026, 227254, 214365, 213985, 181424, 151280, 153146, 164893, 165898, 183125, 169184, 148639, 154642, 173596, 163229, 167797, 167079, 192681, 184053, 163224, 133393, 107014, 106270, 106103, 126405, 141425, 128532, 107647, 112927, 122276, 119838, 116996, 133786, 155464, 149254, 112866, 134979, 147382, 160316, 148176, 176711, 177340, 130152, 126753, 125360, 119165, 123526, 131479, 152713, 165823, 170244, 154701, 154951, 146460, 121676, 110327, 106538, 86325, 80593, 100648, 139887, 143724, 142174, 118352, 121539]
13943A21539R121L311r092k6547l1851q568j5427r745k9543n2521J8866J6300
13931a4157k9223k49J8239K5718l9755J3737L7334K8677k6454J3309M6222r02
13919G2496l6922O903J0576l6666J7941N0733J5033o424q051j1008m2720l2291
13907d00P806O407R081J2525J2351j9389j4966O400q760K8693J7240J6458k239
13894G1207K5134j080k1077J3114j0537l9611m5722K174J8350J2001L5013j4396
13882D4570o012K863K3955q111P650J7106L756l624k488k0893k4844q697r186
13869A6045J9737J0856J973k4141J0921J7118L2475j984j0698j1808J6034J585
13857G8113J6415j0696j0843M997J933n642k640Q656R835K8670J85j1533n769
$$ y = [121539, 130660, 133971, 124879, 98332, 66481, 57913, 42486, 32741, 3198, -49323, -30457, -14157, -43380, -43629, -25390, 328, -39427, -25690, 11644, 40321, 13867, 27176, 73398, 72496, 35574, 42477, 53053, 16387, 34328, 85061, 100094, 93670, 85619, 74611, 31891, -400, 7406, 13813, 22894, 35419, 47770, 28381, 13415, 19815, 11055, 39748, 56988, 73446, 71207, 96341, 95261, 74184, 87298, 76761, 37150, -8572, -6398, 11952, 23953, 58966, 44570, 38558, 41421, 65376, 57265, 64915, 82021, 85777, 82153, 79665, 58772, 33928, 25231, 16045, 35782, 46638, 48611, 24470, 35391, 52509, 84984, 83000, 72302, 60494, 76528, 78113, 94528, 83832, 72989, 77986, 79919, 74277, 71637, 80293, 90128, 118798, 118983, 107450, 101681]
13844A01681j0434M022K3522m884j857L4347L947L0599j2984l1574m898N630M7038
13831A84155L2675p077k3380O894J0514K3662K0036o770M2045L7482L7469P943
13819C65648j2166K6468K4034M4875O3617M5637L4460K5644M4976N7300Q0829
13808H01322J17374J27497J66979J76038J86153K45311K47211K68257L19340K83270
13798B938752K88915K15071N2345j5874j15424k34038k91988k58418k30928j70820
13788B177593j31887j69743k12467k69424k67408k16734k04852j93500j24104
13779C87474o3913k4031j4672Q757j6675l0872k5274k3136n510k4181P131k8170
13767A46928k935m4120k2045M579K0352j3633O405m907m691L7811J5026l2831
$$ y = [101681, 91247, 95269, 118791, 113907, 112050, 146397, 150344, 180943, 167959, 136385, 131487, 137117, 184155, 216830, 209753, 186373, 193267, 203781, 227443, 247479, 240709, 282754, 320236, 357705, 365648, 353482, 379950, 403984, 448859, 512476, 558113, 592573, 618217, 663193, 720493, 801322, 918696, 1046193, 1213172, 1389210, 1575363, 1820674, 2067885, 2336142, 2655482, 2938752, 3227667, 3442738, 3495083, 3479209, 3363785, 3129747, 2837759, 2579341, 2348413, 2177593, 2045706, 1875963, 1663496, 1394072, 1126664, 909930, 705078, 511578, 387474, 323561, 299530, 284858, 293615, 276940, 246068, 220794, 197658, 192148, 167967, 175098, 146928, 143993, 99873, 77828, 82407, 102759, 89126, 95531, 90624, 85933, 123744, 138770, 105939]
13755A05939n57K2464J4892r591k8809O093k796j8194j6442K820n149K796m9474
13742B3992j6031J1399K3150J9177L784j6311J0032K1932k4353l0071J3002K0791
13730F0493P918Q773K2409J4727r394j5184K4870j6142J2501j1667p286J0596
13718A02614l5199l5319P114N201k2830J712K5235o014K915K4540k6589j2138
13706C1242J1609O092j7996j1113j1057L8731K199l0024k0330J4552K9012Q145
13694E1062j9976M797J0073k1865n380j2892j2609R455K8103J3351R836n5997
13682b042k236M3672k450O759K4500j9425j8487K886J5876L838q073j0019P675
13669D2474K4430j1617r253M656j0812k5979j1510k1284K159M8033R552j1680
$$ y = [105939, 105382, 127846, 142738, 133147, 104338, 110431, 107635, 89441, 72999, 75819, 70670, 73466, 23992, 7961, 19360, 42510, 61687, 65471, 49160, 59192, 81124, 56771, 26700, 39702, 60493, 68411, 77184, 99593, 114320, 104926, 89742, 114612, 98470, 110971, 99304, 92018, 102614, 67415, 32096, 39210, 44411, 21581, 23293, 48528, 42514, 45429, 69969, 43380, 31242, 42851, 48943, 30947, 19834, 8777, 47508, 49707, 19683, -647, 13905, 42917, 51062, 31086, 35883, 45956, 24091, 18711, 5819, -6790, 2665, 30768, 44119, 53955, -2042, -4278, 39394, 36944, 43703, 68203, 48778, 30291, 33177, 49053, 52891, 44818, 34799, 42474, 66904, 55287, 46034, 50690, 39878, 13899, 2389, -18895, -16736, 31297, 40849, 29169]
13657B9169j2117L98O704M630r674J2043K3979j6986R089L6009k976Jj7603j7600
13643D5066o49m112k0992M487M773L0063J2073j1405J2707N406J5139J557k516
13630I1597O357N353K2154K0147N1098K5206K7144O1719J0823l1015j5119n632
13618B69832k1966o417k9126n9631m0137j7695j6890k2743k5098R414l1691m7568
13606c9716K1244O0244M6711j6989j7802o868p155L114K5427j3168j6489O059
13594D4612Q72j288N245J1869Q272l821k2227j0924L464j8963N557j3774j3022
13581d128J7845K7132J3657q35J4241k1084l5989k049m379R36J4532J743k2960
13568a338j7881L3892o928j1015J2605j2449J0917L4887Q870l107j7324k3528
$$ y = [29169, 17052, 17450, 24154, 28784, 19110, 31153, 55132, 38146, 47235, 83244, 80268, 80269, 62666, 45066, 44417, 40305, 19313, 23800, 28573, 58636, 70709, 59304, 72011, 77417, 92556, 94113, 91597, 97954, 103307, 125461, 145608, 196706, 221912, 249056, 310775, 321598, 290583, 275464, 269832, 247866, 241449, 212323, 152692, 112555, 94860, 77970, 55227, 30129, 39543, 7852, -39716, -18472, 41772, 88483, 71494, 53692, 46824, 39669, 42783, 68210, 55042, 38553, 44612, 45484, 44196, 49441, 61310, 69582, 65761, 43534, 32610, 36074, 17111, 22668, 8894, -4128, 13717, 40849, 54506, 53671, 67912, 46828, 10839, 8790, 4411, 5347, 19879, 21622, -1338, -19219, 14673, 7745, -3270, 9335, -3114, 7803, 42690, 51560, 48453, 31129, 7601]
13556G601l4901l4864O091P0482L0355n4478m132k314p194m551k569K752L1515
13543C793L7718k5925j8581k9866k4553J1062J1678r388j7820N830q996M3987
13531b1061L1071n658o744J4676q743j1421J1751k060J609J2068j122K0335J5238
13518D9939j1624k8070l2988q021L2777K8547o573k038K8835j1230j22j4140M435
13505B9727N979J8808l1395l3042R545J8725K3694k8895q831L379o843J6258K2424
13492C9533o368l3319k1948K8868R27r364k509J6303J2661L371k4059k6076J3180
13479h800L5953k3734n579L4659L7551l1127n746K7827P303j7441J0004K9097
13467H9967R358j5352j2474P043j339j1363k4617j0058L2552J5041J2214j1639
$$ y = [7601, -27300, -62164, -56073, 14409, 44764, -9714, -13846, -16160, -23354, -27905, -30474, -27722, 3793, 41511, 15586, -2995, -32861, -57414, -46352, -34674, -44062, -61882, -56052, -65048, -21061, 10010, 4352, -2392, 12284, 3541, -7880, 3871, 1811, 3420, 15488, 14366, 34701, 49939, 38315, 10245, -22743, -30764, 2013, 30560, 23987, 21949, 50784, 39554, 39432, 25292, 29727, 35706, 54514, 23119, -9923, -378, 18347, 42041, 13146, 4315, 7694, 851, 17109, 39533, 33165, -154, -22102, 6766, 7693, -1671, -4180, 12123, 24784, 28155, 4096, -21980, -8800, 27153, 3419, -2160, 32499, 70050, 38923, 33177, 61004, 68307, 50866, 60870, 89967, 99325, 83973, 71499, 78542, 77203, 65840, 41223, 31165, 63717, 78758, 90972, 79333]
13455G9333Q086J4984j2887K224j1160J6551J8119K1321l957K6106K5548J7679
13443B01947J6382N0141M0330J0529J3344m6144o7870k9559k0342o7142n1153
13432E0463j5810Q466l839k2435J7063J6249j961Q342q954j2303n339j7506m28
13419A2008J5354j260k3768l0201m828L2292K1491l956L3229Q761L1393K5866
13407A16381l3128m2734L798k9410k5082J427j4103J6406K7826K081k193j038
13395B0231L3j4944j0572J0262J5171k98k2426O042l486j9761K2794J8340k3221
13382a835K1453K8082O261k1125k1618k4021L6903j456J6170m294j9155r916p663
13369b214L534j0572O653M318p862j7477K2246K6289j8187k9282J1999K3108r202
$$ y = [79333, 87419, 102403, 89516, 91740, 80580, 97131, 115250, 136571, 132614, 158720, 184268, 201947, 218329, 268470, 308800, 319329, 332673, 286529, 218659, 189100, 168758, 101616, 50463, 34653, 43119, 39280, 16845, 33908, 50157, 48196, 56538, 47584, 35281, 29942, 12436, 12008, 27362, 26102, 2334, -27867, -32695, -403, 21088, 17132, 50361, 59122, 90515, 116381, 83253, 40519, 44317, 14907, -10175, -8748, -22851, -6445, 21381, 23462, 21269, 20231, 20264, 5320, -5252, 5010, 20181, 19883, -2543, 3499, 13, -19748, 3046, 21386, -1835, 19618, 47700, 53961, 32836, 11218, -12803, 24100, 22644, 38814, 34520, 15365, 5449, -2214, 1320, -9252, -2599, 1719, -6143, -23620, -1374, 24915, 6728, -22554, -10555, 12553, 3351]
13356C351j7311K8319J4726R204K602k2598q183l660n350J3729L2688L4392k5944
13343E5965j1723j7980j1253J5180J4353n359k8505j2671j582j2029L2927J5540
13331C2863j9733l0095j7932K4234L0789n054q013L5536L3906j9050p219J7617
13319F7849j6580j2267O116P377l94k0069J4438j0778j6257j2128l540k334K4836
13306B6269J1610K3753M172N827k5699k1808r548O603L4538Q192k0401k0014k8398
13293d904m537J849l757N130K797M9772k955k4164k3703R694J4657j2551j5203
13280g875J7169L2698j9436m3866l9153p012L5286N4686K0716M749l2118n6053
13268d0209j6982K5759J5090j9224O598J0101P237M309K9243J0075k7656k1879
$$ y = [3351, -13960, 14359, 29085, 38289, 40891, 18293, 10110, 6450, 1100, 14829, 47517, 81909, 55965, 44242, 26262, 15009, 30189, 44542, 39183, 10678, -1993, -3575, -15604, 17323, 32863, 13130, -16965, -34897, -10663, 20126, 15072, 7059, 42595, 76501, 57451, 50232, 67849, 51269, 39002, 45118, 52495, 52101, 32032, 46470, 35692, 19435, 7307, 3767, 1433, 26269, 37879, 61632, 65804, 71631, 45932, 24124, 14576, 21179, 55717, 63909, 43508, 23494, -4904, -9441, -7592, -11349, -6219, -3422, 46350, 43395, 19231, -4472, 5222, 19879, 7328, -7875, 9294, 41992, 22556, -21310, -60463, -67475, -32189, 22497, 43213, 47962, 15844, -40209, -57191, -31432, -16342, -35566, -28968, -18867, -11630, -7321, 21922, 31997, 4341, -17538]
13256a7538J6774j2102J4694L2738J3985j6522j3483l051k4070K0388J5734k1071
13244F476K5561L0235J7284j1237O446m3112n04j6173j4890j66J5079J0100L693
13231B8792j3996J0530N368j1756N50K649l7570J7982J5482j1173j2407K1812
13219A6263r398J3007j6233j7686j9669K2204L3749j1157k6172k2682K8588L0211
13207B1025r295l7098J374m259J6956j0593k0272J9934j836P499k558j6450J415
13194c4158n856j237p360O973K1524K9106P209o534p357j1912l934J5764J7308
13181A9536J2112j0572l4770p619J8301J1494O470K0228l305j6474o771j3668
13169e038P130P175K1884J3016p105j4899Q116j5122k7410J091k467N772K0463
$$ y = [-17538, -764, -12866, 1828, 34566, 48551, 32029, 18546, 15495, -8575, 11813, 27547, 6476, 32037, 62272, 79556, 68319, 74765, 31653, 31149, 14976, 86, -80, 14999, 25099, 28792, 14796, 25326, 30694, 18938, 19488, 22137, -15433, 2549, 18031, 6858, -5549, 16263, 6865, 19872, 3639, -14047, -33716, -11512, 22237, 11080, -15092, -37774, -9186, 21025, 11730, -25368, -23994, -28253, -11297, -21890, -42162, -22228, -24064, -16565, -19123, -35573, -34158, -40014, -41251, -48611, -41638, -20114, 8992, 16201, 9667, 2310, -9602, -13536, 2228, 19536, 31648, 21076, -13694, -21313, -3012, 8482, 14952, 35180, 31875, 15401, 8630, -5038, 2092, 9267, 31151, 44167, 37062, 22163, 30279, 15157, -12253, -11162, -13629, -7857, 12606]
13156A2606j3276M493J0105R942N513J6757L2532j9727j8540o134p655j5984l5116
13143b4484l4493K0478J5011j1048P324L8429J117m705k7360J7636K1532p799
13131A1638k4677R222k101J8049K0132o314j2799m696J1305J5652J967l5533l1331
13118b9486J5601M204k1432k997M140J7686J7891J028J9165Q902j8440m7692J581
13105b9849n543J5397K7804k412j3232J3406N103P661j623O322p496k3718j9684
13092b7864k0023N584K4966K6478j8648j4997l7220J9709M6039J5671l171P665
13080B4189j125k3551k4419k7657o329O574J9762O294j5798K7921K0939l069j623
13067B108r14K3930K8763k5366k1012N715K5453Q286o248m824k1029J4655r42
$$ y = [12606, -670, 3823, 13928, 23870, 29383, 46140, 78672, 58945, 40405, 34271, 26616, 10632, -24484, -58977, -38499, -23488, -34536, -27212, 11217, 12334, 7629, -19731, -2095, 19437, 11638, -13039, -3817, -5918, 12131, 32263, 25949, 13150, 8454, 19759, 35411, 37378, 1845, -29486, -13885, -9681, -31113, -34110, -29970, -12284, 5607, 6635, 25800, 34702, 16262, -31430, -29849, -35392, -19995, 7809, 5397, -7835, 5571, 10674, 18335, 16712, 23034, 15538, -8180, -27864, -47887, -42303, -17337, 9141, -9507, -24504, -61724, -42015, 4024, 19695, 16524, 24189, 23064, -487, -24906, -52563, -58892, -52318, -32556, -26262, -42060, -14139, 6800, 3731, 2108, 1194, 25124, 53887, 28521, 7509, 13224, 38677, 46963, 40715, 35891, 14862, 29517, 28575]
13054B8575J358R168j701j0606k1336k7489M331J8657j3748K0829j2075r066R982
13041c121L0345M488J7891O755j8543m2409l0239Q963J605k5652j903K9306K1613
13028i01L2137M55P184l0475J528K1301j1324j1228K8478j5025m626K606l0050
13015i940j6863N07K061k281J7638J0436j0846m0433M901K5743j9426j1693K6230
13002b3966J3103J8750o906K6622m443j27k9150p365L3199K5731j5347j5245k4064
12989i208O305J3344p29J6759j9689k3208L2115J5931j4225l193k58l501j9137
12976h694Q821p628k3625j8206k1399Q197J7512J0134K7198J4210M026P818J0249
12963B8613p333o498J7740q359m7351J3423J9713j4285j9975j8M885L5225j4433
$$ y = [28575, 29933, 39101, 37400, 26794, 5458, -22031, -17700, 957, -12791, 8038, -4037, -13103, -3121, 27224, 31712, 49603, 56358, 37815, -4594, -34833, -25870, -24265, -49917, -51820, -22514, -901, 31236, 31691, 38875, 8400, 9928, 31229, 19905, 8677, 37155, 22130, 17504, 20110, -9940, -26803, -26296, -24235, -26516, -8878, 1558, -9288, -49721, -44820, -19077, -38503, -50196, -23966, -10863, 7887, 981, 27603, 23160, 23033, -6117, -13482, 19717, 45448, 30101, 14856, -9208, -2903, 10441, 9712, 26471, 6782, -16426, 15689, 31620, 17395, 14202, 13944, 10443, -8694, 127, -7501, -31126, -49332, -70731, -62534, -45022, -34888, -7690, 6520, 10546, 18364, 28613, 21280, 14782, 32522, 24163, -23188, -9765, 9948, -4337, -24312, -24330, -19445, 15780, 1347]
12950A347j3670K313j27l2502k2849J6426R203O726K3981J0022j9615q790l7750
12937f5285Q196M2249J7317J6949l628J1548K5491k4612p737K8016K099n080m4391
12924A132n838K0411J0179N485j1406k9548R344J392q010K0908m457l3753K0401
12911c760J3863P478M680J9886l3555q793k0920N771L5090r355p026j307j9534
12898a7482K0017p435K0731J5809l7146j7832O491K4357J9251l962l2672p628
12886a7501q262K3009M57J3948J9864l13k2687k0787M031Q286n797j7603j3722
12873c7077K3694K3793n987j2291K7102L8227j542j0704J987R006j2129k8258
12861A5821j3645J1151L0548J1693k2379j3927J157k2145M213j557K302M7470
$$ y = [1347, -12323, -10010, -10137, -42639, -65488, -49062, -39859, -33133, -9152, 870, -18745, -27535, -65285, -57089, -14840, 2477, 19426, 15798, 27346, 52837, 28225, 20488, 48504, 50603, 45523, 1132, -4706, 15705, 25884, 31369, 19963, -9585, -241, 1151, -6859, 14049, 9592, -24161, -3760, 10103, 17581, 22261, 42147, 8592, -201, -21121, -15350, 19740, 10385, 3359, 2052, -17482, 2535, -4900, 15831, 31640, -5506, -23338, -16847, 7510, 26761, 22799, -9873, -17501, -25763, -2754, -2297, 11651, 31515, 31202, 8515, -12272, -8241, 45, -5752, -23355, -37077, -13383, 10410, 4423, -7868, 19234, 57461, 55919, 45215, 47202, 56208, 44079, 15821, 2176, 13327, 43875, 55568, 33189, 19262, 20419, -1726, 2487, 930, 3232, 50702]
12849E0702J7277l4627n872P234j1988q60k9796J5277M0089K0866l7253j6664
12837A4385K5706J371j0139Q541J432k2359K1327k0555j1923J9333K3108k9069
12825B1158j1083j6576J9792J9151m480j5481j6389p749J2686j2975p101J1767
12813g280l987j2562N871Q821K7242R983k3045K055q18J6943K7886J9983j5056
12800E6036m780k4842k2273R39J0924j4724j7691k9885J8960N4955J1230o270
12788C2579P269m432m3136j2274L441M322M444p183J3037L3035j675l2114O285
12775C598R732J4202l3318q813K085j7061m347m647J372Q409m869K3273K784K7314
12761A9714J1691R737j580m2089J7190L8733p283l5368m0144l4312J8385J5555
$$ y = [50702, 67979, 33352, 27480, 34714, 22726, 21866, -7930, 7347, 47436, 68302, 31049, 14385, 40091, 41462, 31323, 39864, 41296, 18937, 40264, 19709, 7786, 27119, 50227, 21158, 10075, -6501, 13291, 32442, 27962, 12481, -3908, -11657, 1029, -11946, -19047, -7280, -11267, -23829, -17958, -9137, 18105, 28088, 5043, 7098, 6280, 23223, 51109, 71092, 56036, 51256, 26414, 4141, 5080, 16004, 1280, -16411, -46296, -27336, 27619, 38849, 32579, 39848, 35416, -7720, -19994, -16553, -12231, -7787, -14970, -1933, 31102, 29427, -2687, 3598, 13330, 27532, -5786, -14599, -12514, -29575, -33922, -38569, -37197, -28788, -33657, -10384, -7600, 19714, 31405, 41142, 39562, -2527, 14663, 53396, 46113, 10745, -29399, -63711, -45326, -29771]
12749b9771M234J8926R658M549j6713Q35m953j4212m236K8177J3595J6222Q483
12736C4794k8164j0802J6263M716j3726J4196K045p582J759o483K102J3436l940
12723A8614l6850J4066j991R533J0367p500l8830J1686J0386M4139K0236l7385
12711A6471k1645j886N019J0439M987j3629j0551j0174J3108K165k0720K5678
12699g38K528j9882m25J4226J1092o034j8300J0487n716j6399n815j747o308k851
12685d5882j6849L5593J9452M4108J5785P527N541n960l884L008J6701j5956k0987
12672C8197j0582K3748K1958j8446k3980L0896J6573k0340n862J3216n688P983
12660F7673K3826N1565K9770K1776M6979O6957M8599N1233R275k8262O6781J08543
$$ y = [-29771, -25537, -6611, 3047, 7596, -9117, -8282, -13235, -27447, -31683, -3506, 10089, 26311, 34794, 6630, -4172, 12091, 16807, 3081, 17277, 19322, 11740, 13499, 7016, 9118, 22554, 18614, -18236, -4170, -6161, 3372, 13739, 6239, -32591, -20905, -10519, 33620, 53856, 16471, -5174, -7060, -2041, 8398, 13385, -244, -10795, -20969, -7861, -5696, -26416, -738, 1790, -18092, -18517, -4291, 6801, 767, -17533, -7046, -12762, -29161, -34976, -36723, -43031, -45882, -62731, -27138, -7686, 36422, 52207, 59734, 65275, 59315, 55431, 58439, 75140, 59184, 38197, 27615, 51363, 73321, 54875, 30895, 61791, 78364, 58024, 52162, 65378, 59690, 67673, 91499, 143064, 172834, 194610, 241589, 308546, 357145, 408378, 417653, 389391, 456172, 564715]
12648E64715J27313j25154k58095j30477o4325k8868o27j5447j6600j3073K609
12637D1971K5118m2598k2915M09J0257o143M753K4323r109m566k1818R209N5828
12624F4719p233l0199l7114k2934n139L9290M1450j5172k4225L046j1994l3524
12612c9029K4933J2983k899P821J842K370N826m955N816m245N200N892r144J775
12598A4186o459K684R053o954P457M674j7701j4218k4419J4063j925K1576N045
12585G062n282L5300q934o496Q717M69p133j070j8562K6479L998P391j3355l1174
12571b590m78P003L5057L3523l367l0286l3680k1234L4775K4260P040l7298J2284
12558B5009l5102Q859K2183m213l2808K609J0498O780l178R960R563J0747l3688
$$ y = [564715, 692028, 566874, 308779, 178302, 113977, 85109, 84482, 69035, 52435, 39362, 41971, 67089, 24491, 1576, 1985, 12242, 6099, 10852, 35175, 26066, 21500, -318, 8891, 64719, 57486, 27287, -9827, -32761, -37900, 1390, 42840, 27668, 3443, 6489, -5505, -39029, -14096, -1113, -4012, 3809, 5651, 8021, 13847, 8892, 14708, 10463, 15663, 21555, 12411, 14186, 7727, 10411, 19464, 12510, 19967, 24641, 6940, -7278, -31697, -17634, -19559, 2017, 7062, 1780, 37080, 28146, 21650, 30367, 30836, 23703, 22633, 4071, 30550, 34548, 41939, 28584, -2590, -3068, 3935, 38992, 72515, 69148, 38862, 5182, -16052, 18723, 42983, 50023, 12725, 25009, -10093, -1234, 20949, 16736, -16072, -13463, -2965, 3815, 637, 10597, 20160, 30907, -2781]
12545b781J7785K8556l972K1868N547l2534j976j0925j4581j3937M355K1177j0659
12532G923l4352j8800k445L741N479L8092N233l2575q223j2923l325J4583K4392
12519a3200K9796j6593M050Q604J3391M6416K2637k6452m9267n3233M035K1130
12507h686M4462J8440l943k9898j7155O764J3222o363j4816K0609K1122k5119
12495A8639j9622K9649J1681l7361j0213j0566j8561Q513J8454J834P864j0096
12483i785M750J7670O658j385o3N642R902o215K2307K394l1709k1827J0005j5098
12469f754k6863l250J3979j124n240m098K6827R460J6838K938n356R405p342P487
12455B6907o271j9926j0942l01Q931k2550J1152J4380M405r136k4L9867O968m0362
$$ y = [-2781, 15004, 43560, 39588, 61456, 67003, 34469, 32493, 21568, 6987, -6950, -2595, 18582, 7923, -26429, -45229, -47674, -43933, -38454, -362, 4871, -27704, -35927, -48850, -52175, -37592, -13200, 16596, 3, 4053, 12657, 26048, 72464, 95101, 68649, 19382, -33851, -29816, -8686, 35776, 54216, 50273, 20375, 3220, 9984, 23206, 16843, 2027, 22636, 43758, 18639, -983, 28666, 40347, 2986, -7227, -17793, -36354, -27841, -9387, -7553, 311, -9785, -5035, 12635, 19293, 17908, 17845, 23487, 33389, 27174, 49481, 51875, 20166, -1661, 8344, -6754, -33617, -36867, -22888, -24012, -29252, -33350, -6523, 2937, 19775, 22713, 17357, 26762, 19420, 26907, 20636, 710, -10232, -10533, -1602, -24152, -13000, 1380, 5785, -3351, -3375, 36492, 43460, 3098]
12441C098o759M4228j1058l6826J7583k2412m1609P964J804J9043O398K5727N371
12428A2552K1947K5752r581j1138j6424p67K4854m717m891J4459K1564k039l2657
12415C8914n549k1774j7373j697l955L816j9148j169L1015J1746j5085k1247o918
12402b8424K853m292n150k856K4492K2116k5655l3242j0634P681K8241J3523k6478
12389c7825j603L4766J0979L764J5867j1282j0273J1129L3564J2805l4718k0910
12377F263Q083J8618K9745l0688l0927m67q848R108K0271j5206j9109j7874p046
12364c8077K731K3531J9158l493J5625J5931k9612J9033n014k4050J161K8499
12352B5423Q810J0531j1813j083M962Q397L795j0327j1745j7165l628O370Q623
$$ y = [3098, -3661, 40567, 29509, -7317, 10266, -12146, -53755, -45791, -43987, -24944, -18546, 7181, 12552, 34499, 60251, 50670, 39532, 23108, 22341, 47195, 42478, 37587, 52046, 73610, 71571, 38914, 33365, 11591, -5782, -7479, -11434, -7618, -26766, -27935, 3080, 14826, -259, -21506, -28424, -25571, -29863, -35013, -37869, -13377, 8739, -16916, -50158, -60792, -53111, -24870, -11347, -37825, -39428, -4662, 6317, 10081, 25948, 14666, 4393, 15522, 49086, 61891, 27173, 6263, 14346, 32964, 62709, 32021, 1094, 627, -8221, 887, 21158, 5952, -13157, -31031, -38077, -35346, -11815, 7343, 3850, 19475, 35406, 5794, 24827, 19813, -4237, -3076, 25423, 34233, 44764, 32951, 31868, 36830, 45227, 49022, 38695, 26950, 9785, 6157, 12527, 21150]
12339B1150j5841j3375Q996K2023j6936l0786K4889q844M855j1451j3732J9421
12327i631K9815n084K900l795j3340J2397L8026j1546q491k3913j9495n27J612
12314a1072R820k0278J4878J7508K0660Q808Q468k3884j705K0461j1192k4292
12302H180l1588j364m835J1543J6536K6726k1242l3933j756J344J702L5967L23
12289G603p681k068l5594p289K6460j516j4437j522K3713o699J5025K544j3678
12276a5139k864j4288J178K5398P882j3082J9898n702Q242J1659k814k2800q948
12263a1380J2680K0114l002J3813R193j2615j1089k4821j112R551m671l1982j8036
12250e3357j5012M0909K5757J1092J5089L2569j8783l9511j0652k6089l905L9881
$$ y = [21150, 5309, -8066, 930, 22953, 6017, -24769, 120, -8724, -3869, -15320, -29052, -9631, 20184, 15100, 18000, 14205, 865, 13262, 51288, 39742, 31251, 7338, -12157, -12684, -11072, -1252, -21530, -6652, 10856, 31516, 40324, 48792, 24908, 23203, 43664, 32472, 8180, -23408, -24772, -29607, -18064, -1528, 25198, 3956, -29977, -31733, -30389, -28687, 7280, 7603, -78, -2146, -37740, -45029, -18569, -20085, -34522, -36044, -12331, -19030, -4005, -1461, -15139, -18003, -32291, -31113, -5715, 2167, -10915, 8983, 3281, 11523, 23182, 20368, -2432, -11380, 1300, 21414, 18412, 32225, 41418, 28803, 17714, -7107, -8219, 1332, -3339, -35321, -53357, -68369, -27460, -1703, 9389, 24478, 57047, 38264, -1247, -11899, -37988, -41893, -2012]
12238b012L8471j6776j7052j595K8054K271k9013J1555L6549Q570l2818k525J7195
12225D0874j8581m530m049m707N189o249q943m055O260J0444j1914K1196O862
12212B7797j9782j0557k3320j3888m459R988k748J4660q122j792R641J4903j8364
12199b6043j4287N810L5727J7049J1029O953j9633j5789K80K704l2717r637K0090
12186a8464M283k079K26M245J3802r208J12j7727M159M322P914J051l4738J1891
12172c0211K1915j7867j9290P674N023M669j1060j8537J5232N0653J1352K1843
12160D1396O863r140J0964l7978k7186J1220l012L5248p060j184k1042k5018L796
12147b2133K4595J2621K0429M878l7963j3465L9395K4556j4379j6864j9269p554
$$ y = [-2012, 36459, 19683, 2631, 1036, 29090, 31361, 2348, 13903, 50452, 59022, 26204, 23679, 40874, 22293, 17763, 13714, 9007, 14196, 7947, -996, -5051, 1209, 11653, -261, 20935, 27797, 8015, -2542, -25862, -39750, -44209, -34221, -36969, -22309, -30431, -32223, -22582, -7679, -26043, -40330, -34520, 1207, 18256, 29285, 36238, 16605, 816, 1096, 3800, -28917, -38554, -18464, -14181, -16260, -16034, -11789, 2013, -7195, -7083, -24810, -20651, -16329, -8415, -7364, -42102, -30211, -8296, -26163, -45453, -37779, -32756, -28087, -39147, -57684, -42452, 8201, 19553, 41396, 48259, 39119, 50083, 12105, -15081, -3861, -6873, 28375, 21315, 20131, -911, -25929, -22133, 2462, 15083, 35512, 40390, 2427, -11038, 28357, 52913, 38534, 21670, 2401, -5153]
12135e153k3348L7959P485k4731k0941K7243J3501k504L0115J982j6425R840K2605
12122E7628J6729J4439P651O033J7365J924j9792J0563M2968k4181q6833m0124
12110D370L5293O541k1911m5117k4505k5525k160K065Q461J2198O4726J5006l8637
12097i195k9814j0255K839K3524j0799o212J7812j330N101L1205J8604j4560k3483
12084f563l3538r39j2878J1508J2962Q92o222L3243L3098J3548j9017k9324k1176
12071b4406J2745J4835j0944j8133J602K9376J9881J3723k3138o416K2022k306
12059B8841n306K341k814j695o309J2258j7563K8282K3992j668k1054l529J7773
12046E3549Q231j0527j8927K133q962j9324k5607J3645N781M143l1136J5956J850
$$ y = [-5153, -28501, 9458, 16943, -7788, -28729, -1486, 12015, 9511, 39626, 41608, 25183, 35023, 57628, 74357, 88796, 96447, 102480, 119845, 121769, 101977, 112540, 155508, 131327, 44494, 4370, 39663, 46204, 24293, -20824, -45329, -70854, -73014, -70949, -62488, -50290, 14436, 29442, -9195, -39009, -49264, -46425, -22901, -33700, -39912, -22100, -23430, -18329, 12876, 31480, 16920, -6563, -40101, -41040, -53918, -42410, -29448, -28556, -34778, -1535, 31563, 45111, 26094, -3230, -24406, -11661, 3174, -7770, -25903, -24301, 5075, 24956, 38679, 15541, 9125, 31147, 28841, 23535, 25876, 23062, 21367, 15058, 27316, 9753, 38035, 62027, 60359, 39305, 35776, 53549, 61780, 51253, 32326, 34459, 25497, 6173, -19434, -5789, -8, 4135, -27001, -11045, -9195]
12033i195j1491m353j968j2466J6513K4208k3324j0582K7908L829J834J4130r228
12020E815l7792J709L1635O168J8020k0j0006M679R130J97L5406j1208j2056N1629
12006I3306M972k3871k9872K5924q894j049K7281J7420j0839J7716M9563J3245
11994A74902j3728M625O1702P4146L7636L2485n213M669N7044J13625J30311m3156
11982F29048k32861j42229o6492l9998l7877o3534n0162l4158j8812k6991J0942
11971g3124J6317L1496K7899K2177J1303k9669k0938L68l052j3908L2241l156
11959b046R460J1272M428k3936p536R26L2507J9503k4708q563J5725J2007k275
11946C6764k8861m0269N730P95J1665P485J9311J0675J7336q674j5179m6k8122
$$ y = [-9195, -20686, -25039, -27007, -39473, -22960, 1248, -22076, -32658, -4750, -921, 913, 15043, 5815, -31977, -30268, 1367, 7535, 25555, 25535, 15529, 20208, 29338, 29535, 64941, 53733, 41677, 93306, 98278, 74407, 44535, 70459, 61565, 60516, 87797, 105217, 94378, 112094, 161657, 174902, 161174, 165799, 227501, 301647, 339283, 371768, 366555, 371224, 428268, 541893, 672204, 629048, 396187, 253958, 187466, 147468, 109591, 46057, -4105, -38263, -57075, -84066, -73124, -56807, -25311, 2588, 24765, 36068, 6399, -14539, -14171, -17223, -31131, 1110, -2046, 7414, 18686, 23114, -822, -8358, -7432, 25075, 44578, 19870, 11307, 27032, 39039, 36764, 7903, -32366, -26636, -25841, -14176, -6691, 12620, 23295, 40631, 31957, 16778, 16732, -11390]
11933a1390k3693K0214L5308k758j2804k1696p520r285j385J5907M5006J9257
11921D5161J1829l509k5615p504j6862j5568O608k8255K1459N2579J7299L426
11909F1048l5849o404j163j641j2162o472P477p54J1697Q900J884k7078J7537
11896A7020L426J5227L0549r28n563j7070k0612k5242p855L4814r158l3068J0318
11883h142J7839J6399J7512l5730l0704J790k543K6668M0099j1378j2766j2925
11871F119j7250P528J8274M730Q982P185P178R906J2270j0797j5002k8200k6126
11858a5203j3527K6541k4010q331J0976N64R304k928j2113M776J3767j661k8983
11845d0828m457n760j3817q645N186L6959J8251j1945j0535K2575O879m636P359
$$ y = [-11390, -35083, -14869, 20439, 17681, 4877, -16819, -24339, -33624, -35009, -19102, 25904, 45161, 56990, 53481, 27866, 20362, 3500, -12068, -5460, -33715, -12256, 40323, 57622, 61048, 25199, 18795, 17632, 15991, 3829, -2643, 4834, 4080, 15777, 24677, 26561, -517, 17020, 20446, 35673, 66222, 65294, 59731, 42661, 22049, -3193, -11048, 23766, 14608, -18460, -8142, 9697, 26096, 43608, 7878, -22826, -21036, -23579, 3089, 43188, 31810, 19044, 6119, -11131, -3603, 14671, 19401, 28383, 35568, 42746, 52652, 64922, 54125, 39123, 10923, -15203, -28730, -2189, -26199, -34530, -23554, -22990, -13686, -16614, -28727, -23951, -10184, -11845, -40828, -45285, -51045, -64862, -73507, -68321, -31362, -13111, -25056, -35591, -13016, -6137, -10773, -3414]
11832c414K1726k5499k093l0205j5944K6399J1697j7240o113L6433L6434K3296
11820E5477q797l9427l7689k5727r290L9009J3790j0780j5769J3474P765J4913
11808c051J0684k577k1524j2975r061m2L3993K6259o167l5921q538P776r464K9764
11794h44J1586l4172n59R731J8923j0712k2984n137k2133k7518m150M8452J7976
11781b1541p98j1398J5224K9036r035M840n975l2985j0316k892J4255N24l850
11768c4911O906R749J1329l2674n613J3744K2309r728j3848n446K8351J2217J4492
11755A6877j893j6027k5470j420K992J1224j6442k4224k5791P865O47l126j371
11742g6159K2530K9654L4266k9l443J3414J4353K0712m462o838K387l793o127
$$ y = [-3414, 18312, -7187, -9280, -39485, -55429, -29030, -17333, -34573, -40686, -4253, 32181, 55477, 46680, 7253, -30436, -56163, -65453, -26444, -12654, -23434, -39203, -25729, -17964, -3051, 7633, 5056, -16468, -29443, -38504, -38546, -4553, 21706, 15539, -20382, -28920, -21144, -30608, -844, 10742, -23430, -23989, -14258, 4665, -6047, -29031, -34168, -56301, -83819, -87969, -39517, -21541, -22339, -33737, -18513, 10523, 1488, 6328, 353, -32632, -42948, -45840, -31585, -31061, -34911, -28005, -18256, -6927, -39601, -45214, -31470, -9161, -18889, -32737, -38183, -9832, 2385, 16877, 14984, -1043, -26513, -27933, -24941, -13717, -30159, -54383, -80174, -72309, -71662, -74788, -76159, -53629, -23975, 10291, 10262, 6819, 20233, 34586, 55298, 50836, 43998, 46385, 42592, 36465]
11729C6465k9883k9581O739R241J0417k812m2861J4728J4629m497K1734J5978
11717B0297n249l5918o560K8280J4131p708k2278N785j1421j431P387Q564K880
11704c241J936k0291q817L6829k857j5706l188J8736J0617p424O123J5258j3079
11691A4896k0299m096J3823P648m58j1261k598K1760n018k6335l1637L0021P779
11678e775m03J5600Q85L44j2212k7460L1553K7376k9273j0921Q249J3211J0947
11665B2121m169q690K1749J2579m4251l8659K6896P815q613K010L5384N05Q299
11652C2976O080l1073j2158j2289q030P408J4630J2575p194n585k3138L5987J1024
11639B1213k1085n40J0167R083m363j5189J0713r077L783J3900J3563j405n2120
$$ y = [36465, 6582, -22999, -16260, -7019, 3398, 586, -42275, -27547, -12918, -17415, 4319, 20297, 15048, -20870, -27430, 850, 14981, 7273, -15005, -9220, -20641, -22072, -14685, -6121, -3241, -1305, -21596, -30413, 6416, 3559, -12147, -15335, 3401, 14018, 6594, 12717, 27975, 14896, -5403, -9499, 4324, 11972, 11514, 253, -2345, 19415, 14397, -11938, -43575, -13554, -5775, -6178, 9422, 10307, 10651, -1561, -29021, 2532, 29908, 635, -10286, -2037, 11174, 22121, 17952, 9262, 31011, 43590, -661, -39320, -12424, -4609, -13222, -11212, 24172, 24677, 32976, 39056, 7983, -4175, -16464, -24494, -17086, -2456, 10119, 2925, -2660, -25798, 10189, 21213, 128, -412, 9755, 18838, 14475, -714, 9999, 922, 4705, 18605, 32168, 30763, -21357]
11626b1357l020J9438j2444N498K7976j2447j1372k1020M395L6863k7297k9803
11614d4590L3794J2266j600k3104r62o936P368m419k749O003J8171k133M551k3458
11600b7798J4163J1584l97J3427k3987j4592j0616j9296l204M6634J1253j4827
11588a7656l9871J6361J5181J7564N095L915n048l9102J6943J928K1131j6996
11576b0555q542K6261L695j3172k1840j2976j2383R552J5689J2956N0877j1934
11564A7628j4371j3215q383Q985r79l49K0260K5672p10j5799k2533J0447N90k5542
11550a8299m0489j5434L4166L4082J9381l33m1069l0848M2346K9189J3384j1640
11538A4436N211j6968j0622M9J1465Q543l6081k1182j8933R019R160K3395M0485
$$ y = [-21357, -24377, -4939, -17383, -11885, 16091, 3644, -7728, -28748, -24353, 12510, -14787, -44590, -10796, 1470, -130, -23234, -24196, -31132, -23764, -28183, -30932, -24929, -6758, -8891, -4340, -27798, -13635, -2051, -2448, 10979, -13008, -27600, -38216, -57512, -60716, -14082, -2829, -17656, -57527, -41166, -25985, -8421, -3326, 589, -4459, -43561, -26618, -24690, -3559, -20555, -29097, -2836, 859, -12313, -34153, -47129, -59512, -49960, -34271, -21315, 29562, 17628, 3257, -9958, -18341, -9356, -10335, -10684, 9576, 35248, 34538, 18739, -3794, 6653, 7243, -18299, -58788, -74222, -40056, -5974, 13407, 13074, -27995, -58843, -16497, 12692, 26076, 14436, 19647, 2679, -7943, -7894, 3571, 12114, -23967, -45149, -64082, -55063, -45903, -22508, 17977]
11525A7977L7856l2422n7628L0585J5428j0299r039J1919j9476K1844M1974K7169
11513G5888j5795l3179p545k8556j6284K5567K3361j2878m200J3264J7088j1977
11501B4754k8482N834J3309J9998J1264k1192k3432J7995n569l4243r938L2140
11489B438J5066j3035j9414j8838N1028N633m058J4432K9406p327k1336l080k2678
11476H237K830O150k8703j9591o444J493K0791j7426j4671r862p218K8293L0827
11463e294r122O976J5552k4700o104J5930J2827J172m169P356l3173J4483L1028
11450B2762J3788p904k3369m3819k1245J9899k9531k0586K7819K8777O872J2900
11438a3637K8199J2324K2961J1513m4450l4277j6609o745j2563L7644K4884k3243
$$ y = [17977, 55833, 23411, -34217, -3632, 11796, 1497, -7542, 4377, -15099, 6745, 48719, 75888, 60093, 26914, 19369, -9187, -25471, 96, 23457, 10579, 6379, 19643, 36731, 24754, -3728, 2106, 15415, 35413, 46677, 25485, 2053, 20048, 14479, -19764, -29702, 2438, 17504, 4469, -14945, -33783, 17245, 22878, 18820, 33252, 62658, 55331, 33995, 30915, 8237, 11067, 17217, -11486, -31077, -37521, -36028, -15237, -32663, -47334, -57196, -64414, -36121, -5294, -14416, -7440, 8112, -16588, -22692, -6762, 6065, 7237, 3068, 10424, -22749, -8266, 22762, 36550, 28646, 5277, -38542, -59787, -39888, -69419, -90005, -62186, -33409, -26537, -13637, 14562, 26886, 49847, 61360, 16910, -17367, -33976, -40721, -53284, -15640, 9244, -13999]
11426a3999N506r557o808P944L9596K9825k4484j7691p597Q765J5582J8138J5362
11413F0582j8305m286p236J0082n826r286n519K0995r994k0463k2471j6814J0619
11400a7922R237J6109J3218K3520K3241L2127k5355l3464l1208K4235P802k9224
11388A2316k815J8127l975q015j1850j3331o03K0150M045l7340k2615P580M9590
11375A1264Q370k4929o203J365k682k654L234J0380J5788J3587j1739j7906J612
11362e13J9414J9962M195j3871j5892p903Q406J807J2734J5972k3423p237l9619
11349b5968l29Q752r828k368q061J8665K225J7630M1271K9197K5262k3885l8740
11336C3823j1906O555o22j1449m5154P296J5561L06L724k3874O217J6295O267
$$ y = [-13999, -8493, -18050, -24858, -16914, 22682, 52507, 28023, 10332, 2735, 11500, 27082, 45220, 60582, 42277, 37991, 30755, 40837, 35011, 25725, 20206, 41201, 31207, 10744, -11727, -28541, -17922, -8685, 7424, 20642, 44162, 67403, 99530, 74175, 40711, 9503, 33738, 41540, 12316, 9501, 27628, 23653, 15638, 3788, -9543, -10146, 10004, 14049, -23291, -45906, -38326, 11264, 19634, -5295, -11498, -10133, -12815, -15469, -12235, -1855, 13933, 27520, 15781, -2125, -513, 18901, 38863, 43058, 29187, 13295, 5392, 13798, 15605, 28339, 44311, 20888, 13651, -25968, -26297, -17545, -27373, -29741, -37802, -19137, -16912, 718, 41989, 71186, 96448, 72563, 33823, 21917, 28472, 27850, 16401, -28753, -21457, -5896, -5590, -1866, -25740, -19523, -3228, 3039]
11323C039j4228K006L0277J6908Q089j6893j4766j7615O329O39o462o783k1432
11310c0892J0705O060p75Q397M0460L4976k1046k3470J0716M219k1054k3189j7699
11297b2592L0238L1495L229k5264k2745r807J4530j1050l8503L2518m330M785
11285a7496J5791l2746j9848J2541J8388O60n867L984K4188o188K1711m540j1160
11272e82n903K634k1227J3252K6195j2150j3065Q07k0216j701Q273K3361M586
11259D264k0539j7379J8918M794p046N944l579j9445q565P923R823K2139K0565
11246A7817n435j0071k6592k2393J3852K3769N016r906o005M2651K8032p555j9148
11233B4032N10j308k4507k3619K1005j2212K801J7870q369M521m319J0385L0440
$$ y = [3039, -11189, -9183, 21094, 38002, 46091, 29198, 14432, -3183, 3146, 3785, -2677, -9460, -30892, -20187, -14127, -14902, -6505, 33955, 68931, 47885, 24415, 35131, 39350, 18296, -4893, -22592, 7646, 39141, 42370, 17106, -5639, -15446, -916, -11966, -50469, -17951, -22281, -17496, -1705, -34451, -54299, -41758, -23370, -22710, -28577, -24593, -405, -6593, 15118, 10578, -582, -6485, -3851, -25078, -11826, 14369, 2219, -10846, -10039, -30255, -31956, -23683, -322, 4264, -16275, -33654, -14736, -9942, -16988, -11044, -14623, -34068, -42633, -34710, -24887, -2748, 17817, 12382, 2311, -24281, -46674, -32822, -9053, -4037, -13943, -19948, 22703, 50735, 43180, 24032, 24542, 23234, -1273, -24892, -3887, -16099, -13298, 4572, -3797, 724, -3595, 6790, 37230]
11220C7230J6745K4730j4327j7859j4012j5569j8091M932P532j1234j5787o25
11208a6335j1899L900K715m82K9030J5396j2951m4137k964M539K8311J2092n666
11195A549M48p044m719M2054K6063j9246j2252j0195m911n047J5982j4647j3469
11182e434l1544J1842K7103K7084o81q643M625Q6J4557N133l6822m3187J8179
11169a7702K6433J1258j1241M384O304j6984j865N054l856k5048J762K1486M012
11156C997L283k6449P50J4207P673K30o722L797M4146J4218k7639j7932m726k1476
11142a2643r81j3181R647o292J7328P760p728K4214k5980n4849j4177M4948K3259
11129h675K818K4706Q879o995r644M163j4482l0655q220J0514O866J5709P197
$$ y = [37230, 53975, 78705, 64378, 46519, 32507, 16938, -1153, 3779, 11311, 77, -15710, -16335, -28234, -24334, -21619, -22101, 6929, 22325, 9374, -34763, -37727, -33188, -4877, 7215, 1549, 1997, -5047, -9766, 32288, 58351, 39105, 26853, 16658, 11747, 6700, 22682, 8035, -5434, -36978, -25136, 1967, 29051, 28370, 19727, 24352, 24438, 38995, 44128, 7306, -35881, -17702, 8731, 19989, 8748, 13132, 19436, 2452, 587, 5641, 1785, -23263, -21501, -15, 3997, 7280, -19169, -18419, -4212, 3461, 3691, -3031, 766, 44912, 59130, 31491, 13559, 8833, -12643, -13624, -26805, -17158, -23450, -6122, 1638, -6090, 18124, -7856, -62705, -76882, -31934, -8675, -5857, 18849, 27728, 20733, 11089, 15252, 770, -29885, -38105, -27591, -20725, -5016, 2181]
11116B181m968K8658k0066r828J4651n055k5328J5827k672j7552J7220K308p457
11103a2081j090K883r746k388J4344J2334J9138k5691n355M5J2427K1038J1173
11090C7031J3221l3745j9900J4388j3683l523L2959J943l4895j3059J4992K0444
11078A6173K0594J2326J7117j3889m2210q738L17k4300O505M90m6999m0591J4161
11065h9044M4146M4434L3679K1829M359k8957m6050r876k013K1694J4982p332
11053A851P526k0187o339n301J2552K7831k4029k5690m726L5257J6216K2358O016
11040D3335r320k8656m4228k4676K2669J992J9861k2177m915L2721K3683K9668
11028C9957J1621k6164j0948l1438N651J6690J158q328r162p397J592O791O746
$$ y = [2181, -2787, 25871, 5805, -4023, 10628, 5573, -19755, -3928, -6600, -24152, -6932, -4624, -12081, -13171, -10288, -20034, -22422, -8078, 4256, 23394, -2297, -7652, -7607, 4820, 25858, 37031, 50252, 16507, -3393, 10995, -2688, -6211, 26748, 28691, -6204, -19263, -4271, 16173, 36767, 49093, 66210, 52321, 10111, 1373, 1690, -22610, -16105, -15615, -62614, -103205, -89044, -44898, -464, 33215, 55044, 59403, 30446, -15604, -25480, -27493, -5799, 9183, 1851, 9377, -10810, -17149, -22450, -9898, 17933, -6096, -31786, -36512, -1255, 14961, 37319, 43335, 34015, 5359, -38869, -63545, -40876, -38884, -19023, -41200, -46115, -13394, 10289, 39957, 51578, 25414, 14466, -16972, -11321, 5369, 6527, -1801, -10963, -18360, -16768, -9977, -3231]
11015c231R041k0068j2680M0509j9326k5432q307O08j5875R780j015J1846J5370
11002a8780K3048m049M139K1808j0431k2591o569K2091Q550P839q579k298Q120
10989B2298j7764k1390j2752m800l745N339P730j692K216K3708K0535P682P27
10976B8092j8751l0409o998P927q82r405k830j8293K9813N7868K156j3081k2499
10963B708j874l92m719j2975K6603K6024j1579J124J1271j5263j6607j7938Q261
10950e356L316J9197k1364r07j2528P844n14j5815J8572K7215k807l9083j042
10937b3272R496j4906o538N23j4648J5504r04M323J7829J6478k1614K474K9471
10924A4216m6115o275K9147J6505J1549j109k9731k6383J9380l766o166K5772
$$ y = [-3231, 5810, -14258, -26938, 13571, -5755, -31187, -39494, -38886, -54761, -44981, -45996, -34150, -18780, 4268, 219, 4358, 26166, 15735, -6856, -13425, 8666, 17216, 25055, 16476, 14178, 22298, 4534, -16856, -29608, -34408, -38153, -32814, -25084, -26776, -24560, -852, 19683, 27365, 28092, 9341, -21068, -28066, -20139, -21021, -30426, -33256, -51549, -21736, 36132, 38288, 25207, 2708, 834, 442, -4277, -17252, 9351, 35375, 23796, 24920, 36191, 20928, 4321, -13617, -5356, -2040, 17157, -4207, -5114, -17642, -9798, -10312, -26127, -7555, 19660, 16853, -22230, -23272, -13776, -28682, -35220, -34697, -49345, -33841, -34745, -30422, -12593, 3885, -17729, -15255, 14216, -31899, -38174, -9027, 7478, 19027, 17918, -11813, -38196, -18816, -22582, -28748, -2976]
10912b976m0841l453K4264Q499l4870J7930J3191q656j8759R817Q633o359N826
10899b7754K0119J9826j1841j7551k8721O605M264J6832R825j4754R847K5698
10887A2395P060L7173J3573o3309o1659q984L2739L522P111L408k6339j7941J7048
10874d4203J8939j0429j499K3474K2306J7853j3787j2963J6309l0294k3724O941
10862c1077K875K1835K3914k1290k0279n747k1288L07J4350L2926L654k5277k4825
10849d9922K9651K0364k4887j2643j2504L7030L1974O516J0947j958l3359k3610
10837b2401K6214J8669j6695k4680j2063J1277K4803j0147j2737K05J6150J2865
10825A1460J185j9824n397J781J3944j1422j1149j8277K2105L8455K2884J0245
$$ y = [-2976, -43817, -47270, -23006, -14507, -49377, -31447, -18256, -26912, -45671, -35854, -27221, -33580, -27754, -7635, 12191, 350, -17201, -45922, -39317, -35053, -18221, -8396, -23150, -13303, 12395, 19455, 56628, 70201, 6892, -54767, -63751, -31012, -27490, -20379, -16971, -43310, -61251, -44203, -25264, -35693, -37192, -13718, 8588, 26441, 12654, -309, 16000, -14294, -38018, -31077, -28202, -6367, 17547, -3743, -24022, -29769, -51057, -50750, -36400, -3474, 180, -25097, -49922, -20271, 93, -24794, -37437, -49941, -12911, 19063, 25579, 36526, 34568, 1209, -22401, 3813, 22482, 5787, -18893, -30956, -19679, 5124, -5023, -17760, -17555, -1405, 11460, 12645, -7179, -12576, -10795, 3149, -8273, -19422, -37699, -15594, 22861, 45745, 55990]
10813E5990j6930n9033k2835m220J8592K5501J5286O452j0226j2497j0634p025
10801b1579j4094k2997j1256K9918j865J6686K1610k3489K0625k3684N10q784
10789c8399k0265K6908M8293J1690q843J7826l395j864k1920O633J3936l8878
10777h278o088J99O450L4193k9346j7840M3652J7861J7555j0950l5999k5940j0747
10764b5278J7707L6516l581q222j8575j5133j1635l21K9291L0305k4440l3483
10752b6849n762j9188q047K6086L3818m001j1787J323J1423k1692m7053J5197
10740e6532M0138l053j1516k319L678J3964L5793L4043M643o084k3893j2272Q698
10727B5288J6673R864l0330k5239j556R103J8665m111k8604j5351j732q178J45
$$ y = [55990, 39060, -19973, -42808, -47028, -28436, -2935, 12351, 18803, 8577, -3920, -14554, -21579, -35673, -58670, -69926, -40008, -41873, -25187, -3577, -27066, -6441, -30125, -29615, -38399, -58664, -31756, 16537, 28227, 19384, 37210, 33815, 31951, 10031, 16664, 30600, -8278, -14366, -14167, -7717, 26476, -2870, -20710, 22942, 40803, 58358, 47408, 11409, -14531, -25278, -7571, 28945, 25364, 17142, -1433, -16566, -28201, -28522, 769, 31074, 6634, -26849, -32611, -51799, -59846, -33760, 58, -3943, -15730, -14407, -2984, -24676, -71729, -56532, -16394, -19447, -30963, -33282, -29604, -15640, 20153, 54196, 58839, 52755, 28862, 16590, 25288, 41961, 51825, 21495, -3744, -5300, 3803, 22468, 18357, -10247, -25598, -27330, -35508, -35363]
10714c5363j0887q213L0048O396L7297j492k2755j280L5732J7788k2253j4633
10702A0385j7962j7523K1674L4076k2451L199K379J914q825j707L1539P754k9464
10689A4988j8973J8371P732k2071k4938k9333K9J9520L3698L7774m829k8533J1272
10676A4707k6739K16k961j8061J355N653j866L511J1285J5369j8508K1827J3078
10663A8866o869j4205l2474k7315J7927K0984n994k7374k938l970l369M940J7463
10650d4328K3087O209n065M795j4701j6044q995P402J3039K4977K7570N542q615
10637A4873k8343l1983M1328K8555J2847k5815O320R525j1949j7417L17j4957
10625a6699K177R476j5738j0159j3875m512K1645K1845m326r626M24J0266j4964
$$ y = [-35363, -46250, -54463, -24415, -18019, 19278, 17786, -4969, -6249, 29483, 47271, 25018, 10385, -7577, -25100, -3426, 30650, 8199, 11398, 13777, 15691, 6866, 5159, 36698, 44452, 14988, -3985, 14386, 22118, 47, -24891, -54224, -54195, -34675, -977, 36797, 31968, 3435, 14707, -12032, -11816, -14777, -32838, -31483, -25830, -27696, -24185, -12900, 2469, -16039, 5788, 18866, 11997, -2208, -34682, -61997, -44070, -23086, -29080, -56454, -59392, -63362, -66731, -61791, -44328, -21241, -15032, -20097, -15302, -30003, -46047, -55042, -47640, -34601, -9624, 17946, 23488, 14873, -13470, -45453, -4125, 24430, 37277, 11462, 17782, 27307, 15358, -2059, -1742, -16699, -14522, -5046, -20784, -30943, -44818, -49330, -27685, -5840, -10166, -19792, -19368, -9102, -24066]
10612b4066m674k000l589J5779K6920K8145K5245n623l292k1208M746j7959j1469
10599F955J2422K1828j8060j6727P847j0878r214j2228j3332K414J5432p635n393
10586b6569K208r24r933J0434P668k1459K1215Q624j3540J4801J2910n050p470
10573g085l922k290j7297k405O783L9219L7166L0062j1289n0061l0400P800k4815
10560b8534p351N781J1254P710k6301L6541J1796L586l479p333j8105K5567J1882
10547B3014j8111n450N620j7063K5777p771J8110j4786j4135j9872Q484K5699
10535I516k037j475j726j2508J5232p708m0226j6648L3600K9167L8864n289m094
10522C4668k5141o708j9686P319p639Q33R751p764n200N803L0098k1178k0943
$$ y = [-24066, -28740, -30740, -34329, -18550, 8370, 36515, 61760, 56137, 52845, 31637, 36383, 18424, 6955, 19377, 41205, 23145, 6418, 14265, 3387, -5827, -18055, -31387, -28973, -13541, -21176, -26569, -24361, -25285, -35218, -24784, -17116, -38575, -17360, -8736, -22276, -7475, 5435, 385, -7085, -11007, -13297, -30594, -32999, -26216, 13003, 50169, 80231, 68942, 18881, -11519, -3719, -28534, -35885, -30104, -18850, -11140, -37441, -900, 10896, 14482, 11003, 3670, -14435, 11132, 23014, 4903, -547, 5073, -11990, 13787, 6016, 24126, 9340, -4795, -24667, -16183, 9516, 7479, 6004, 4278, -8230, 7002, -706, -40932, -57580, -23980, 5187, 44051, 38762, 34668, 9527, 2819, -16867, -9548, -17187, -16354, -6603, -14367, -19567, -13764, 16334, -4844, -25787]
10509b5787j6573K8267P721j6804j1868j0890o989J2437L9278L1951M354R468
10497D4565j3133k0006q837j2233K709J2848J986K0258J9596j0893l0872J806
10485G794m888p158j3471Q347J9149J6774j204r120Q962j2008j7941m887j8580
10472b8231R053K4872L6368J1706l2618j9439K4409K5645j8625k3554m3449j5701
10460d9564j518L7896M0768j717J3928O845O117p631J217k9439j1773o497l0842
10447c2210J7459J1144J7527q006k3814j665J1514J3832J9673Q333j0294J6275
10435C9768k6896l9000o710K8514L884o957k6823R14K6374O552k1302j4410L6477
10422C85j905M769j3560k1244J078P451J1911P773l255j4861j3577j319M712k8219
$$ y = [-25787, -42360, -14093, -6372, -23176, -35044, -45934, -52923, -40486, -1208, 30743, 35097, 44565, 31432, 11426, 2589, -9644, -6935, 5913, 7899, 28157, 47753, 36860, 5988, 7794, 2906, -4252, -17723, -9376, 9773, 26547, 25343, 16223, 25185, 13177, -4764, -9651, -28231, -19178, 5694, 42062, 53768, 21150, 1711, 26120, 51765, 33140, 9586, -33863, -49564, -51082, -13186, 27582, 25865, 39793, 46638, 52755, 45124, 46341, 16902, 5129, -1368, -32210, -14751, -3607, 13920, 5914, -17900, -19565, -8051, 5781, 25454, 33787, 23493, 39768, 12872, -26128, -32838, -4324, -440, -7397, -34220, -33306, -6932, -380, -21682, -36092, 385, -1520, 3249, -10311, -31555, -30477, -23026, -11115, -3342, -6597, -21458, -35035, -36354, -31642, -59861]
10408e9861J0102K0423j770M034lK6675o193p719J2223l4441k8390K8168L312
10395c3440m715O292j5008p706L583J4537q34r034k812R256K3273O709m626J9572
10381E047J2879J423K3948j7703j5917j691J776k3581J3536j0626n914J3874k494
10368e443Q176K450r284j5099M356j2552j0193J2599K2478m25j4318O861R804
10355e90k526l1216j754l411J7747M5804k584k4702k1099J2711J8203N256J5497
10342B7336J098k4577k8032k408k98K0120K2280k7227j7710K9350K2766P363q22
10329B9239j4709K3720k8373r753j279K9911L904M072n3869k0695j0164J3874
10317c4122J6305Q322J1137r045K3929q720l5575J392M8492P868j6551J1996J4245
$$ y = [-59861, -49759, -29336, -31106, -27072, -27075, -400, -6593, -14312, -2089, -36530, -64920, -36752, -33440, -38155, -31863, -46871, -54577, -50994, -36457, -37291, -46325, -49137, -39881, -16608, -9899, -14525, 5047, 17926, 19349, 43297, 25594, 9677, 7986, 9762, -13819, -283, -10909, -16823, -2949, -5443, 2733, 5183, -4101, -19200, -14844, -27396, -37589, -24990, -2512, -2937, -17255, -10394, -590, -3116, -34332, -36086, -39497, -21750, 24054, 21470, -3232, -24331, -11620, 6583, 11839, 27336, 28434, 3857, -24175, -26583, -26881, -6761, 15519, -11708, -29418, -68, 22698, 30061, 29239, 14530, 38250, 9877, 124, -1155, 28756, 32660, 36732, -17137, -37832, -47996, -34122, -17817, -9495, 1642, -7403, 16526, 7806, -27769, -26377, 22115, 29983, 13432, 25428, 39673]
10304C9673J9309j625q449r384j9939m2953k7167J5223L2936J0996k179J5527
10292B1968m996P047K280j0413k0066Q470M862m323o968K079K4474N354l2533
10279b765j8837j5898j71N6809K493K052J1539p012P732K552p645k2475l1575
10266b3201K4342L1844j9079j6576o941j8561J4922K3404n461j0826j9064P834
10254a7363j495j7459j4149l96L193J4152O208o707P63k706M111J12K4467K4416
10240A7147n44m7488r11K3310p828L2428J6659J4167j7337l4535k55L851j0574
10227a1910j6677p366K1860K6724j8619k5635Q373k7523J641K6309k223K691K2059
10214b96J4974l70J6088m636l2752o369R835L765j2722O705J7858N014k0018l430
$$ y = [39673, 58982, 57357, 48908, 39524, 19585, -23368, -50535, -35312, -2376, 8620, 6441, 21968, 16972, 24019, 26299, 15886, -4180, 4290, 9152, 4829, -2139, -60, 24414, 29768, -2765, -21602, -37500, -37671, 19138, 21631, 23683, 35222, 28210, 35942, 38494, 30849, 8374, -23201, 1141, 32985, 13906, -2670, -9611, -28172, -13250, 10154, 4693, -6133, -25197, -17363, -18858, -36317, -50466, -50862, -47669, -33517, -27309, -34016, -33253, -35959, -31848, -31736, -7269, 17147, 16603, -30885, -31796, -8486, -16314, 16114, 32773, 46940, 29603, -4932, -5187, -1336, -11910, -28587, -35953, -14093, 12631, -5988, -31623, -23250, -50773, -49132, -22823, -25046, -22355, -296, 14678, 14308, 30396, 25760, -6992, -13361, -3526, 239, -12483, -5778, 12080, 17094, -2924, -6354]
10200f354l4251k5251J3545J2679K908j4771K1675K6280K274J055j016k2153k4659
10187d8039Q889J0002J3288j543k585o961K2083J0896j83j6415L658j3282n427
10174b5619Q041j6281j521j4828J0061K0282j4076o283K6673K99k3130j0030K4257
10161b2155R393j1206k3821K0954Q946j8790J215R261N574K0361l1112l5244K3921
10148d2703M3248J9022K6141M0956L235o24k6834m7680k4181j0249K19K291k7784
10135d4943p295K7981P094L4146L3190j4033k8210j6462P039j6430k9010N416
10123d1517L4748J0231j2157l953M303j2482j1000L8220L4447m1638j2802k646
10111a6246j2870K297j7104L1717J6657j1121j2786R908j1247J5866R404j0371
$$ y = [-6354, -40605, -65856, -52311, -39632, -36724, -51495, -29820, -3540, -1266, -211, -1227, -23380, -48039, -39150, -29148, -15860, -17403, -19988, -26949, -4866, 6030, 5847, -10568, -6910, -20192, -25619, -17578, -33859, -35380, -50208, -40147, -19865, -33941, -40224, -13551, -13252, -36382, -46412, -22155, -12762, -23968, -47789, -26835, -17889, -36679, -35464, -26203, -20629, -268, -31380, -66624, -42703, 545, 19567, 45708, 86664, 89899, 89275, 62441, 14761, -9420, -19669, -19450, -17159, -44943, -52238, -24257, -17163, 16983, 50173, 36140, 7930, -8532, -1493, -17923, -46933, -41517, -6769, 3462, -8695, -12648, -8345, -20827, -31827, 6393, 40840, -798, -13600, -16246, -29116, -26819, -43923, -12206, 4451, -6670, -19456, -9548, -20795, -4929, 4475, -5896]
10099e896j7903r31j6313r281N624L891J1486J4957Q735M595o230J6268R669j7511
10085A160K2292K6677n677L142J4508k2890k1323J9662K5014k9336j3226P526
10073B7529j3463J4943J6184l1472M787k3263j0904K2056J3779J3593J6491K4883
10061G5143m026P778L0547P4168R1986P6474m941k4888j1203K8931J06123R1644
10049E37736j43646j63921q9968m5043k5395J59j0858k5678r165J6144J4202r537
10037D5030k884M900P784O788K9736J3625J1445k2958n7490l8912J8207n327o990
10024B954o954J3210K8437l2725n193j4238J7428L0473K9506l0411j0336K1232
10012D3383m231j0290O064k4053k7911J3833J3893J6978j701J5074j0232o851
$$ y = [-5896, -23799, -24730, -41043, -50324, -44700, -40809, -29323, -14366, -5631, -1036, -7266, 9002, 18671, 1160, 23452, 50129, 44452, 47594, 62102, 39212, 17889, 37551, 62565, 33229, 20003, 27529, 14066, 29009, 45193, 13721, 18508, -4755, -15659, 6397, 20176, 33769, 50260, 75143, 71117, 78895, 109442, 183610, 275596, 352070, 347129, 322241, 311038, 339969, 446092, 537736, 394090, 230169, 140201, 95158, 69763, 69922, 59064, 33386, 24221, 40365, 54567, 45030, 42146, 47046, 54830, 61618, 91354, 104979, 116424, 93466, 35976, -2936, 15271, 9944, 2954, -4000, 9210, 37647, 4922, -271, -14509, 2919, 33392, 62898, 32487, 22151, 43383, 39152, 28862, 34926, 10873, -17038, -3205, 10688, 27666, 25965, 41039, 30807, 23956]
10000B3956N682M356O680R824j3582k0914K1427K8727J6082N42N221m337j193
9987H2471K7971j970M691L0465J3963k6919l3037R205M2732M7955P701M6480P1292
9974C23000Q9341R4255N5350M6682O8134R3245Q9843M1485j57781k73290k02183
9963B68081j02559o9545j4486O86j1081j9950J651m0036R045J8608L537o368j6190
9950B1393K2803L988j7385l0155K1566K5166M640K353L1159l2236l1866M224N433
9937C1083j6932O476J5183j5793n335J3458j0133L761K8863q501m078l875L992
9924C8169k4394k3889j5288j5932n804J2288J4701L1494j6399m0066J9784K2266
9912c070L557J630K770m107M409k11K3203P84m4115m535q915L8710l799N687L461
$$ y = [23956, 29638, 33994, 40674, 50498, 36916, 16002, 37429, 66156, 82238, 82780, 88001, 83664, 82471, 110442, 108472, 113163, 143628, 157591, 130672, 97635, 106840, 149572, 197527, 205228, 251708, 323000, 412341, 506596, 561946, 608628, 676762, 770007, 859850, 901335, 743554, 470264, 268081, 165522, 95977, 81491, 82177, 71096, 51146, 52797, 12761, 21806, 40414, 43951, 37583, 21393, 44196, 48184, 30799, 644, 22210, 47376, 52016, 54369, 85528, 53292, 21426, 25650, 31083, 14151, 20627, 35810, 20017, 14682, 28140, 18007, 21768, 50631, 42130, 38052, 34177, 38169, 13775, -10114, -25402, -41334, -47138, -34850, -20149, 11345, -5054, -45120, -25336, -3070, 487, 2117, 4887, 780, 5189, 4978, 28181, 28965, -15150, -19685, -28600, 10110, 6311, 11998, 15459]
9897A5459j4409n83K75J5828p031q20j2088j4561Q628K5000Q901j3940p880K7066
9883B9845k012J506k0484L172K1553J7470N780J2254j2594j7613r35R387N543
9870E2872l126j930j7824j7114l7510L11k413J1873J2039n593J461M834J383l958
9856d695O265L4541M741j8223k7423O282n527J90J876L1325K4979j8306l2004
9843D021J433J4731m520m448O32J2579J6152m290j313o245j4596m3274j978o13
9829c1729J586k3794m769M4841K9245O301l2943j8712J411K1913j11j7373j5132
9816c9266L0247J2970m465j2586l874N405J4323R009l495O714j1097p158k169
9803e442J9311K2924R392l4891k8510l500o111J3374R796l6092m525K4873K7372
$$ y = [15459, 1050, 467, 742, 16570, 9539, 8719, -3369, -17930, -9302, 15698, 24599, 10659, 2779, 29845, 27833, 29339, 8855, 12027, 33580, 51050, 56830, 69084, 56490, 38877, 37942, 47329, 52872, 49746, 47816, 29992, 12878, -24632, -24321, -26734, -14861, -2822, -8415, -6954, -2120, -737, -4695, 1570, 36111, 40852, 22629, -4794, 1488, -4039, -3849, -1973, 29352, 54331, 36025, 4021, 5454, 20185, 15665, 11217, 11849, 24428, 40580, 36290, 34977, 28732, 14136, -29138, -31116, -31729, -30143, -53937, -58706, -13865, 15380, 21681, -11262, -29974, -28563, -6650, -6761, -24134, -39266, -9019, 3951, -514, -13100, -16974, -11569, 2754, 11763, 8268, 14982, 3885, -3273, -5442, 13869, 36793, 46185, 11294, -17216, -20716, -26827, -13453, -3657, -39749, -44274, -19401, 7971]
9790G971k0841j6220q045K1830N3034K3382J3552j6547l0520k4609l756K15K7191
9777B6637P606K119O321l7035k2329J0073L0618j3179j8762j6621o030R035K3331
9764A784K0491k048p864k0963J3504l880k3058L1778K398J894o778j4667K2666
9751A5257J5798J0037q642m0206q675l112j6492o648K6701J9314j5559j6077K5076
9738c228j6505j1306J6482Q391q243m702K4930J0391J7921M939j9019j8414R973
9725A1610n930j7320j7582p637p410K1854L460J4846J9716L723K37M896j6390
9712H073q896k7105l0863K8712J9940m910k5485k1188o001J0473J4363J5187R75
9699b6725j3043q091K1791N006l22M485J0897j0378k547m168J868r066K6309J681
$$ y = [7971, -12870, -29090, -37135, -15305, 37729, 61111, 74663, 58116, 27596, 2987, -769, -554, 26637, 34243, 36362, 42683, 5648, -16681, -6608, 24010, 10831, -7931, -24552, -30582, -21547, 1784, 22275, 20227, 12363, -8600, 4904, 1024, -22034, 9744, 12142, 14036, 7258, -7409, 15257, 31055, 41092, 32450, -7756, -16431, -19543, -36035, -42683, -15982, 3332, -12227, -28304, -3228, -19733, -31039, -14557, -6166, -14409, -19111, 5819, 16210, 34131, 39070, 20051, 1637, 11610, 5680, -11640, -29222, -36859, -44269, -22415, -18955, -4109, 15607, 19330, 19567, 24463, 8073, -823, -27928, -58791, -30079, -10139, -15049, -40534, -61722, -67723, -57250, -42887, -27700, -26725, -39768, -47859, -26068, -21062, -21384, -16899, -6002, -16380, -18927, -23095, -21227, -30293, -3984, -2303]
9685b303K7002m01j3123k6051j9306k5895R405L9340j954p553K1705M7847J5489
9672F4202j6576j2502l3018k6008J6805M228j645J3145K0582R607j0564p517k7995
9659g256j920O554j6260J5804J0934j9804j0116J220j7614k1990l150l362J3944
9646e3016J4082R595k854J810r19J0208J2484r147k5994q345L6162m354j7481
9633c7769M422O000L1701k323k3269j4617n685L8418R70p93J5246J5038k6972
9620C67j1272j4902j4898J1268Q226j6928N173O452J3408k1022J3951N2047J0139
9607D2009k0100j1518k5011k5155k4348J0940K0700p886j6646p318J3868K2475
9595b7990L3151J2515r748M060j5208K6766J419J3089j0247j8169J7999P304k100
$$ y = [-2303, 24699, 24298, 11175, -14876, -34182, -60077, -50672, -11332, -13286, -20839, 866, 48713, 64202, 47626, 35124, 2106, -23902, -7097, -2869, -4514, 8631, 29213, 38820, 28256, 20739, -7256, -9176, -2622, -18882, -3078, 7856, -11948, -22064, -20844, -38458, -60448, -63598, -66960, -53016, -38934, -29339, -32193, -30383, -31302, -21094, -8610, -17757, -43751, -52096, -15934, -20288, -37769, -33347, -27347, 4354, 2031, -21238, -35855, -41540, -3122, -2152, -2945, 12301, 27339, 367, -10905, -25807, -40705, -29437, -21211, -38139, -32966, -26514, -13106, -34128, -20177, 31870, 42009, 21909, 10391, -14620, -39775, -64123, -53183, -32483, -40369, -57015, -64333, -50465, -27990, 5161, 17676, 7928, 11988, -3220, 23546, 24965, 38054, 27807, 9638, 27637, 34941, 32841]
9582C2841l770L234l0403j2043O885N442k6248n469J4559J6066L0817J9872k7515
9569B4268k1572o157j116j6041j4228r985J0724L1303N119J4242K3666p483k3206
9556I534L180J4610K6376L57m313l0107M341L74Q108P63L877m0000j4524q910
9542b6334J5945M996n689L0960L1303q160k6378j4009j6182P667p935J819J1179
9529h18q015J0184r381l5239K0870L1070j7576l7052m583J8376o100m902O111
9516c7055K1239J719J9357K5365m923j1721j4824j7894m3789J1464J2138p904
9504d6828o307O095M0337L095j2727l055K4205L3611o648l6887m7393p677J4724
9491d5455J2622j9572M1418J5952L354K7120j3580j1959K3676J2778j6717j3241
$$ y = [32841, 29071, 32305, 1902, -10141, -3256, 2186, -24062, -29531, -14972, 1094, 31911, 51783, 24268, 2696, -3461, -4577, -20618, -34846, -44831, -34107, -2804, 2315, 16557, 40223, 32740, 9534, 12714, 27324, 53700, 54057, 49744, 19637, 23978, 24352, 32460, 33223, 37100, -2900, -17424, -26334, -10389, -5393, -11082, 19878, 51181, 43021, 16643, 2634, -13548, -5881, -13816, -11997, -818, -8833, 1351, -8030, -43269, -22399, 8671, -8905, -45957, -50540, -32164, -38264, -43166, -37055, -15816, -14097, 5260, 30625, 25702, 13981, -843, -18737, -62526, -51062, -38924, -46828, -53135, -47040, -6703, -3608, -16335, -19390, 4815, 38426, 31778, -5109, -52502, -60179, -45455, -32833, -52405, -10987, 4965, 8319, 35439, 21859, 9900, 33576, 46354, 29637, 16396]
9479A6396J736J3087K736j2165j6860l606L8868J006k4074j8376M183l1971j2349
9466d1389m946M829j9926J7802J1675J5909J3091J8716J1323K9425R080p743l0214
9453B7632J3304O904k1701j8347K03j6359K2966J8460k0316j7680j1677K9338
9441A2727Q670n315K4171j6761k5687K2474k1520j6737J4748J580J940o391K3389
9428A7288J0283k0423p134l719K0371Q939Q375l212N800l539j7213n109j7927
9415g220J240k2471K9674M1592R09L611K2439o181r909j3917j492j9226k0901
9402a852J2674j98l8036k3785n831J4025M3789J1406k2975q053J7728l475j368
9389e951N927R197j5838j1987J1708J5319K7062J24k7816k3930k641j0424l9801
$$ y = [16396, 18132, 31219, 33955, 21790, 4930, 1324, 40192, 41198, 17124, -1252, 2931, -29040, -41389, -46335, -41506, -61432, -43630, -31955, -16046, -2955, 15761, 27084, 56509, 65589, 57846, 27632, 40936, 47840, 26139, 7792, 7995, -8364, 14602, 33062, 12746, -4934, -16611, 12727, 21397, 16082, 40253, 23492, -2195, 20279, -1241, -17978, -3230, -1650, 290, -6101, 17288, 27571, 7148, 14, -3705, 16666, 25605, 33980, 30768, 36568, 33029, 15816, 10707, -7220, -5980, -28451, 1223, 42815, 43724, 47335, 69774, 63593, 53684, 39767, 38275, 19049, -1852, 10822, 10624, -27412, -51197, -57028, -43003, 786, 12192, -10783, -18836, -1108, -4583, -5951, -24, 9173, -6665, -18652, -6944, 8375, 35437, 35561, 7745, -16185, -18826, -29250, -69051]
9376f9051J4583M0691J1632O952j7968o923K9892J7559q124O867J3784l8829j1117
9363a0052K897j633k976J5479J2591O600K6312k4550j3179L204K889j2302K854
9350H134N118r376O274l332l541N812N851k068J936r437L3877J3492O721k2570
9336C6891l6290l0999j9848J9525L7164R269R636K6919n957o452k3666j2074J6911
9323B1029N476j7245K3099M2736N614j7814L117J7649J6846n458k0027l4954j223
9310C8845J6424p501j4643J4396L3707L64n7612R484K167J951K2031P890K09j0797
9296E6915k184q332q883L3466M497j1572j1095j6175K68j072L6825j2482j2821
9283D7355m520j961k3303p092R036K6561P125J3721L063p002n891n88J4742J9225
$$ y = [-69051, -54468, -13777, -2145, 4807, -13161, -20084, 9808, 27367, 19243, 26110, 39894, 1065, -10052, -7155, -8788, -11764, 3715, 16306, 22906, 49218, 24668, 11489, 14693, 17582, 5280, 8134, 13252, 3876, 10150, 6818, 3277, 9089, 14940, 12872, 14808, 5371, 39248, 52740, 59461, 36891, 601, -30398, -50246, -30721, 6443, 15712, 25348, 52267, 46310, 39858, 16192, 4118, 21029, 26505, 9260, 32359, 75095, 80709, 62895, 66012, 83661, 100507, 95049, 75022, 40068, 38845, 55269, 47768, 33125, 47521, 81228, 81592, 23980, 33464, 35631, 37582, 59613, 67503, 67712, 56915, 54731, 46399, 37516, 70982, 75479, 63907, 52812, 36637, 36905, 35833, 72658, 60176, 47355, 42835, 40874, 17571, 10479, 19515, 46076, 53201, 66922, 69985, 62983, 57092, 56504, 71246, 90471]
9269I0471M690P734j788m870r902j5283p711O254l9850j4649k3649j907J5128
9256D668K3418J3530J4736o823r627j7869k5084J990J3347J2948N945R626P87
9243D1592J580J0433K4691K4741K2545q87l4371m8287J6786K431N039J3286J1359
9230I0938J4503j2837j767j9679J6061j784Q296J7972n175j4990P249J777k0944
9217G9620k4752j0593K6507J6169j897j9726N525l36L5677J3252k3392k1680n580
9204F8794L9334L0549k6449J0903p614l2337J9206K0522K7755l335j4508M230
9192A37050k3205r545J1013k143m456J1467J2046J1606p700R531K0612o561q660
9179A51055J0872K3095l1864J6417K1413J1727j6359k9893J112J7232m935K024
$$ y = [90471, 95161, 102895, 101107, 96237, 86335, 71052, 63341, 69595, 29745, 15096, -8553, -10460, 4668, 28086, 41616, 56352, 49529, 39902, 22033, -3051, -1061, 12286, 25234, 31179, 40805, 41592, 43172, 53605, 78296, 103037, 125582, 124695, 90324, 42037, 58823, 61254, 66293, 79579, 90938, 105441, 92604, 90837, 71158, 87219, 85435, 93731, 111703, 106528, 91538, 98787, 100564, 79620, 54868, 44275, 70782, 86951, 85054, 65328, 70853, 70517, 106194, 119446, 96054, 74374, 68794, 108128, 138677, 112228, 123131, 115517, 83180, 102386, 122908, 150663, 147328, 132820, 137050, 113845, 104300, 115313, 113170, 108714, 120181, 132227, 143833, 136133, 145664, 166276, 159715, 151055, 161927, 185022, 153158, 169575, 190988, 202715, 186356, 156463, 157575, 174807, 169872, 171896]
9167A71896J7720L2528j5467M82L3764P516k4102j9636m097J2046L6243J5492
9155B64385r569K2315K4559K9582j0219K4701K405k8211J291M0552K9724K802
9143C94317k780K3187K5950k634j2141K1692L9248N3424J914j051J1979M607L2644
9130E90356O8443J4969Q29K6274q817J9298K7793L6741O512j068M6511M6865L1602
9117I06308j5169K1636N4847M0466K2340J7028L0788L3397K6914M4982K0349J3749
9105A217635o263J0665J9827o870R457J1164J739J1846L196m70Q18K302k5090
9092A249956k1494k0715O50j9985k4103j0914k3151l3087j0744l1886k9645j6899
9080A007983l7568j9396m2646l0266j9331k9018l7742k2116j5037k9183l6255
$$ y = [171896, 189616, 222144, 206677, 207159, 240923, 248439, 224337, 204701, 200604, 212650, 248893, 264385, 254816, 277131, 301690, 331272, 321053, 345754, 348159, 319948, 321239, 361791, 391515, 394317, 391537, 414724, 440674, 438040, 425899, 447591, 486839, 540263, 542177, 541126, 553105, 557712, 590356, 658799, 673768, 674597, 700871, 692054, 711352, 739145, 775886, 782398, 781330, 827841, 874706, 906308, 891139, 912775, 967622, 1008088, 1030428, 1047456, 1078244, 1111641, 1138555, 1183537, 1203886, 1217635, 1211372, 1222037, 1241864, 1234994, 1244451, 1255615, 1257354, 1269200, 1272396, 1271926, 1272744, 1275046, 1249956, 1228462, 1207747, 1208397, 1188412, 1164309, 1153395, 1130244, 1097157, 1086413, 1054527, 1024882, 1007983, 970415, 951019, 908373, 878107, 858776, 829758, 792016, 769900, 754863, 725680, 689425]
9069F89425k2655j1604m5604m8055j233q105j8556k4952j5522M279J736k6412
9057D72742k3102j3056L401l0232j2940K1519J616m893j9056l3702l1396l1950
9045B98951m860K7451j5183K332r8j289l5843l4352O067j7766J0077M106R583
9032B49176J2459K238m4173l5918k3087l1564K7364K1887k010p707J7428j0751
9020A75342l9347J3544K3199P164N112k318l9636j3278J3084l925j5195L056K0841
9007A47643j0991j0842l4327q763J1471J369q432j1524J2024p028J148K4967K8087
8994A34802j8660k6700O400K937k8072j3196q171N4033K0941j660n127R88J9314
8981A37829P113k7256k5612k0352J8133j3753n4053j862K9047M4059K5539o8850
$$ y = [689425, 666770, 655166, 609562, 561507, 560274, 552169, 533613, 508661, 493139, 497418, 499154, 472742, 449640, 436584, 439985, 409753, 396813, 418332, 419948, 415055, 395999, 362297, 330901, 298951, 294091, 321542, 306359, 308691, 308593, 307304, 271461, 237109, 243176, 225410, 235487, 239593, 249176, 261635, 263873, 219700, 183782, 160695, 129131, 156495, 178382, 176372, 168665, 186093, 175342, 135995, 149539, 172738, 179902, 185014, 182696, 143060, 129782, 142866, 138941, 123746, 126802, 147643, 136652, 125810, 91483, 82720, 94191, 95560, 87128, 75604, 87628, 80600, 81748, 106715, 134802, 116142, 89442, 95842, 98779, 70707, 57511, 49340, 103373, 124314, 122654, 117527, 118515, 137829, 144942, 117686, 92074, 71722, 89855, 76102, 22049, 20187, 49234, 93293, 118832, 49982]
8969D9982O711L0834j3225l1676j3151r150K9095M477r606L451K0226J8847j6728
8956G0087k0540n308k0076j165J2383K8028l37m0580j887M324j6835L6002J8114
8943F2210j6262J2084L0921J3480k405K408j0384j6513Q527j780j2027j4746L96
8930E5909j6913K018j202j495m776p792p036K8791J1334N946Q399j4509m0072
8917A8602n350N340J626j9642J825j423j2695N9543K4755l7270k9554o779J6841
8904A5819K795m988K3462L5158k655r532k0835p528j8342m204j80j0070m7429
8891d8529j7543K6037K3855L0252k776m166K1074k482k1290j057L3819J6187n084
8878D8297n205n480J4003m355j3375j2621l6665j7268l532K5570R36q13K8023
$$ y = [49982, 56693, 87527, 74302, 42626, 29475, 20325, 49420, 53897, 44291, 47742, 67968, 86815, 70087, 49547, 44239, 24163, 22998, 35381, 63409, 63072, 22492, 20605, 24929, 8094, 44096, 62210, 45948, 58032, 88953, 102433, 100028, 102436, 92052, 75539, 84066, 82286, 70259, 55513, 55909, 38996, 41014, 39812, 38317, 33541, 25749, 18713, 47504, 58838, 64784, 73183, 58674, 18602, 13252, 18592, 20218, 576, 2401, 978, -11717, 47826, 72581, 35311, 5757, -1022, 15819, 18614, 13626, 37088, 72246, 69591, 60059, 39224, 31696, 13354, 9150, 8970, -1100, -48529, -66072, -40035, -16180, 14072, 11296, 7130, 28204, 25722, 4432, 3375, 37194, 53381, 48297, 43092, 37612, 51615, 47260, 33885, 21264, -15401, -32669, -36201, -10631, -9695, -10508, 17515]
8865A7515P564k5583J328K901M876k652j0519q012J8698J8812Q069Q532p970o960
8851B6599n604J0045Q473j8374j8572n640k3545K2170J850j571L215j7991P546
8838a1399K0697M9112k9160j1441m375J3035mk1472l9300J3593K4964J4104j261
8825A7093K581l371p884j8336L588J8779L4769K1678l5439j5396L060m5p902k4182
8811a1007j6531K8359M089l8644q249L7802K7536M237r001l0906K361j5402j5976
8798d1332J7444L5845O019j507j0670L997k0j0960K636J2579k7935p675K0143
8785a436j2703k5512M804J4936K7686J5940l336J0061j3140j8779l523m121J1195
8772B072j1562k2475K5609Q56q425j0524Q002J0043j291J9997j0419J4355J4582
$$ y = [17515, 25079, -504, 824, 3725, 8601, 5949, -4570, -12582, 6116, 24928, 32997, 41529, 33559, 26599, 20995, 31040, 39513, 21139, 2567, -3073, -26618, -4448, -2598, -4169, -954, -18945, -11399, 9298, 58410, 29250, 17809, 13434, 26469, 26465, 4993, -34307, -20714, 4250, 18354, 17093, 19674, 16303, 8419, -9917, -6329, 12450, 47219, 68897, 33458, 18062, 21122, 21077, 13175, -11007, -27538, 821, 4910, -33734, -41983, -4181, 23355, 27592, 18591, -12315, -9954, -25356, -41332, -23888, 11957, 17976, 16469, 5799, 9796, 9776, -1184, 1452, 14031, -13904, -21579, -1436, -14139, -39651, -34847, -19911, 7775, 23715, 20379, 30440, 17300, -1479, -5002, -9123, 2072, -9490, -31965, -6356, -5500, -13925, -24449, -16447, -6404, -7695, 12302, 1883, 16238, 30820]
8759C0820R620L1652O87P088j2453j2781r954Q285k0770j9078j1464P291J4166
8746B3109M432J3338K6270j7550q940R266j402j1637j1351j5417J559L5029j1526
8733C5180l9550k8973r372k915J2547J3081J9021k9183J5537K6339j4298k1098
8721b3684j3863K7936J7894n898Q825J9903j9045n795L8430L6831J2838M987r757
8708H9602l8283n0379p579J0750L3445J4035j0939K1855n537Q496J9013J0463
8696I4942l2434k2847J9141J8493J9217Q542p476L9589J4694l6250q579J1015
8684A18047L3932J3539K1840N9598M5003N2392L6762K9243Q132k6969q263O701
8672C89957k5916o3715n4749o0429l2126j6342k3167r35J854l0410m0546l841
$$ y = [30820, 40440, 72092, 72779, 79867, 67414, 54633, 44679, 52964, 32194, 13116, 1652, 8943, 23109, 27541, 40879, 67149, 49599, 40659, 49925, 48523, 36886, 25535, 10118, 11677, 46706, 35180, -4370, -33343, -42715, -45630, -33083, -20002, -981, -30164, -14627, 11712, -2586, -23684, -37547, -9611, 8283, 2385, 11210, 31113, 12068, 6273, 44703, 81534, 94372, 99359, 89602, 51319, 940, -6639, 4111, 37556, 51591, 40652, 62507, 56970, 65466, 84479, 94942, 62508, 39661, 58802, 77295, 96512, 105054, 97578, 137167, 151861, 115611, 107032, 118047, 151979, 165518, 187358, 246956, 291959, 344351, 381113, 410356, 418488, 391519, 383256, 389957, 364041, 300326, 245577, 185148, 153022, 136680, 113513, 112578, 114432, 84022, 43476, 39635]
8660C9635L0068J3672j930r67O144K4670k0650k884J853j2198p78r332K531R120
8646G8954J0136O800k7724J4834J3150k8933j3891J6955J1975k246n725L2006
8634A06291J1222l204J752o30J4115J2686k1799n154k2614j355J2875j2882k8141
8621F3162M8056J0051j0430M966J6967J4825K0255O038K9223m236j7139j2065
8609A69673O705J4870P725J487K7563J2114M198K2896L1600J8388K6103M545m7349
8596C00518k0324N601j7626m3684o8100k6310M467k6177m145j4781r247k1030
8584E9162j6737O075O438k7083K0346j1181Q816K152r011J6637q476R375j0305
8571D6208j3125J2602O944M153J062Q528m157m8140J1876K1013j3264N12L4096
$$ y = [39635, 69703, 83375, 81445, 80478, 86622, 111292, 90642, 87758, 89611, 77413, 76635, 67303, 69834, 78954, 89090, 95890, 68166, 83000, 96150, 67217, 53326, 70281, 82256, 80010, 74285, 106291, 117513, 114309, 116061, 115431, 129546, 142232, 120433, 115279, 92665, 91310, 104185, 91303, 63162, 111218, 121269, 110839, 115805, 132772, 147597, 167852, 173890, 203113, 198877, 181738, 169673, 176378, 191248, 198973, 200460, 228023, 240137, 244335, 267231, 298831, 317219, 343322, 347867, 300518, 280194, 285795, 268169, 224485, 156385, 130075, 134542, 108365, 104220, 89439, 80192, 59162, 42425, 48500, 54938, 27855, 48201, 37020, 45836, 47988, 38977, 55614, 47138, 56513, 46208, 33083, 45685, 52629, 56782, 57844, 66372, 62215, 14075, 25951, 46964, 33700, 34212, 68308]
8558F8308k7262J8597K2830o227L151k1506k4712Q187L39n012j3648M172K3476
8545E0693k2147P32K6010J7856j5601k2282n599R220j5351j6757j4166M062L7076
8532C3746J9620J5413m316k621q325J8772k1179q937P254j4895k4358j6758K9593
8519B3009R847J926k7838j7767L1892j0334r05O539J1610n445L669K061P033k1588
8505A3709k8311j1936K6880K8605m095l336j4022l0008k813K556J425J4848L351
8492c147J424J3536J5342J2694K1030k600N300j7706k970N349k115J0740k431
8479E4446k0287k9387J1533K2651j6608Q794L6291k3270m2254N418K3143J2061
8467D2531j9204R60j5599j7628J5543k989k1948k2871J4545K1449k2172l4007
$$ y = [68308, 41046, 59643, 82473, 76246, 79397, 57891, 33179, 41366, 41705, 36693, 23045, 27217, 50693, 28546, 29278, 55288, 73144, 57543, 35261, 29662, 38882, 23531, 6774, -7392, -3330, 33746, 53366, 68779, 64463, 61842, 53517, 72289, 51110, 42173, 49427, 34532, 10174, -6584, 23009, 32856, 34782, 6944, -10823, 21069, 10735, 9830, 16369, 27979, 22534, 26203, 28264, 35297, 13709, -14602, -26538, 342, 28947, 24852, 21516, 7494, -22514, -25327, -22771, -21346, -6498, -3147, -1723, 11813, 27155, 39849, 60879, 58279, 63579, 45873, 42903, 48252, 46137, 56877, 54446, 34159, 4772, 16305, 38956, 22348, 31142, 67433, 44163, 1909, 7327, 30470, 42531, 23327, 24287, 8688, -8940, 6603, 3614, -18334, -41205, -26660, -5211, -27383, -61390]
8455f1390J6604J9926J3826J938L4109Q582k579j8992j6475M242J2080k171M2934
8442E2634N229m0151k783j5191O609N1280l297j7033k1259j981j6675k871K1087
8429A5598R456l2320J4535j0362j2491j0509K813K3252j0818J0160K1672J7671
8417C8657l138j0938j4312j8537M782q078l318J404k593n033r572O163K739J9836
8403a938J9962k1939q413L2249O175k0860L542M010n453K0083Q318k475j0961
8390B2300l5326J556J5270k696j2075P027K8540K6004j7764j1721N255j5821j5884
8377e335k45P645L4258q152q922J477m688r272j6472J778K2542K9504K6134J4032
8363H4284p713j0861n5398J185J1293Q840q873l0904J3758R264k378n915r153
$$ y = [-61390, -44786, -24860, -11034, -9096, 25013, 33595, 31016, 12024, -4451, -209, 11871, 9700, 52634, 57863, 17712, 14929, -262, 6347, 57627, 54330, 37297, 16038, 14057, -2618, -5489, 15598, 25054, -7266, 7269, -3093, -15584, -26093, -23280, -28, -10846, -686, 20986, 38657, 35519, 24581, 10269, -8268, -3486, -11564, -14882, -13478, -16071, -21104, -30676, -24513, -21774, -1938, 18024, -3915, -12328, 19921, 26096, 5236, 8778, 12788, 7335, 27418, 35736, 33261, 22300, -13026, -11470, 3800, 1104, -10971, -3944, 24596, 50600, 32836, 21115, 26370, 10549, -5335, -5580, 2065, 36323, 28171, 19249, 20726, 16038, 6766, -9706, -7928, 14614, 44118, 70252, 84284, 76571, 65710, 10312, 11497, 22790, 31630, 22757, -8147, 5611, 14875, 12497, 6582, -2571]
8350b571k5351k3910k865L2630R121k042J4577J1963R510J7379K1361J3459K476
8337G5737j9517k0011j1078M228O287m491K837k0549l0306J0918p038k9531J3052
8324b9462k166j6733K367P829J8593o314p513J365R954J0414P759L587j0394J1704
8310I90K1188K2939K1312J69j8413k4100J1897N226q629j9428J47K2981k1122
8297A5157q658j1272M651j6997K1615M0991J2638p431O767J3368L79k4367j5898
8284C0943j7711J9746J8955l646J1249j3573k9487k1589m084K5114M45R471K0756
8271D6589r83j9625l2206q930L108L10M075J6388K2751J9303J6732k9509j5462
8258B2541k389Q964j0112k1458j3832j4555J3184K1374o275l0677j115Q3J5210
$$ y = [-2571, -27922, -51832, -54697, -22067, -12946, -14988, -411, 11552, 21062, 38441, 59802, 73261, 75737, 56220, 36209, 25131, 29359, 35646, 31155, 33992, 13443, -16863, -5945, -12983, -42514, -29462, -31628, -48361, -45994, -38165, -19572, -25886, -33399, -32034, -22080, -11666, -3907, -320, -10714, 990, 22178, 45117, 66429, 66598, 48185, 24085, 35982, 41208, 32579, 13151, 13298, 36279, 15157, 6499, -4773, -122, -17119, 4496, 45487, 58125, 50694, 57461, 70829, 71208, 46841, 30943, 13232, 32978, 51933, 48287, 59536, 45963, 16476, -5113, -9197, 15917, 16362, 25833, 46589, 45606, 25981, -6225, -15155, -12047, -11737, -7662, 8726, 31477, 50780, 67512, 38003, 22541, 20152, 29116, 19004, -2454, -16286, -30841, -17657, 3717, -2558, -33235, -34350, -34267, -19057]
8245a9057K4626j8544N969J5949L960k9290k6171L147L1101J3873k7254m104J7397
8232h398K1144o914j6796K4802o6j3208k31N625J3137o050R572j4363k4253K145
8218a3854R789k5604j8503K0622K5409R59L775j3085J4616L3600k3079q387M219
8205A0477j1893r540J2040l924J797J4665M1q868K268j1232K7447J1769Q324l5236
8191H135j4895j5687k1201K7468K2308J3352K4052j4498j8132k7232j8017j9059
8179e3406L0633L0772k3889m2440J332M3293K4912J7164R285K4198k3554l6324
$$ y = [-19057, 5569, -12975, -7006, 8943, 12903, -16387, -42558, -39411, -8310, 5563, -21691, -25795, -8398, 12746, 5832, -10964, 13838, 13772, 564, 333, 5958, 19095, 13045, 22617, 8254, -15999, -13854, -4065, -29669, -48172, -27550, -2141, -1182, 2593, -10492, 4124, 37724, 14645, 6258, 10477, -1416, -10956, 1084, -2840, -1043, 13622, 13663, 4795, 7063, -4169, 23278, 35047, 43371, 8135, -6760, -22447, -43648, -16180, 6128, 19480, 43532, 29034, 10902, -16330, -34347, -53406, -22773, 7999, -15890, -58330, -56998, -13705, 11207, 28371, 37656, 61854, 38300, 1976]
$$ [...]
##END NTUPLES=NMR SPECTRUM
##END=
