##TITLE=Analysis number 325537
Compound Code mo 08070
Project Code adrs
Chemist Name gavinr
##JCAMPDX= 6.0         $$ Bruker NMR JCAMP-DX V2.0
##DATA TYPE= NMR SPECTRUM
##DATA CLASS= NTUPLES
##ORIGIN= Bruker BioSpin GmbH
##OWNER= nmr
$$ XWIN-NMR		Version 3.5
$$ Thu Jan  4 08:12:34 2007 GMT Standard Time (UT+0h)  MAYBRIDGE\nmr@NMR_250MHZ
##.OBSERVE FREQUENCY= 250.131544655141
##.OBSERVE NUCLEUS= ^1H
##.ACQUISITION MODE= SIMULTANEOUS (DQD)
##.ACQUISITION SCHEME= undefined
##.AVERAGES= 16
##.DIGITISER RES= 18
##SPECTROMETER/DATA SYSTEM= dpx250
##.PULSE SEQUENCE= zg30
##.SOLVENT NAME= CDCl3
##.SHIFT REFERENCE= (INTERNAL, CDCl3, 0, 16.5207)
##AUDIT TRAIL= $$ (NUMBER, WHEN, WHO, WHERE, WHAT)
$$ ##TITLE= Audit trail, XWIN-NMR		Version 3.5
$$ ##JCAMPDX= 5.01
$$ ##ORIGIN= Bruker BioSpin GmbH
$$ ##OWNER= nmr
$$ C:\u/data/dgb/nmr/ADRS/200/pdata/1/auditp.txt
$$ ##AUDIT TRAIL=  $$ (NUMBER, WHEN, WHO, WHERE, WHAT)
(   1,<2007-01-04 08:12:10.20 +000>,<MAYBRIDGE\nmr>,<NMR_250MHZ>,
      <created by zg, POWCHK disabled, PULCHK disabled
       configuration hash MD5:
       49 4B E0 1D 92 C2 6B 37 9F E6 65 BC 52 41 86 1D
       data hash MD5: 64K
       3A D3 C9 CC 3C 51 86 36 85 0C 92 7F 9C EA 87 02>)
(   2,<2007-01-04 08:12:26.24 +000>,<MAYBRIDGE\nmr>,<NMR_250MHZ>,
      <Start of raw data processing
       ef LB = 0.3 FT_mod = 6 PKNL = 1 SI = 32K 
       data hash MD5: 32K
       A9 B4 62 48 B7 A9 F9 2A 04 F1 DF AB A8 74 BB 6D>)
(   3,<2007-01-04 08:12:27.92 +000>,<MAYBRIDGE\nmr>,<NMR_250MHZ>,
      <apk 
       data hash MD5: 32K
       E2 4E 2E D9 53 5F F0 47 1C 37 BB 4E 36 3D 20 10>)
(   4,<2007-01-04 08:12:28.63 +000>,<MAYBRIDGE\nmr>,<NMR_250MHZ>,
      <abs ABSG = 5 
       data hash MD5: 32K
       27 7B 57 A4 95 F0 2D 98 A3 8A BC 66 A0 6C DD 99>)
$$ ##END=
$$ 
$$ hash MD5
$$ 48 89 6D E5 80 FC 3C EB BD 19 D3 09 5D 10 AA B5
##$RELAX= 
##$RELAX= 
##$RELAX= 
##$RELAX= 
##$RELAX= 
##$RELAX= 
##$RELAX= 
$$ Bruker specific parameters
$$ --------------------------
##$DU= <C:\u>
##$EXPNO= 200
##$NAME= <ADRS>
##$PROCNO= 1
##$TYPE= <nmr>
##$USER= <dgb>
##$AMP= (0..31)
100 100 100 100 100 100 100 100 100 100 100 100 100 100 100 100 100 100 
100 100 100 100 100 100 100 100 100 100 100 100 100 100 
##$AQSEQ= 0
##$AQ_mod= 3
##$AUNM= <au_zg>
##$AUTOPOS= <2 >
##$BF1= 250.13
##$BF2= 250.13
##$BF3= 250.13
##$BF4= 250.13
##$BF5= 500.13
##$BF6= 500.13
##$BF7= 500.13
##$BF8= 500.13
##$BYTORDA= 1
##$CFDGTYP= 0
##$CFRGTYP= 5
##$CHEMSTR= <none>
##$CNST= (0..31)
1 1 145 1 1 1 1 1 1 1 1 1 1 1 1 1 1 1 1 1 1 1 1 1 1 1 1 1 1 1 1 1 
##$CPDPRG= <>
##$CPDPRG1= <>
##$CPDPRG2= <>
##$CPDPRG3= <>
##$CPDPRG4= <mlev>
##$CPDPRG5= <mlev>
##$CPDPRG6= <mlev>
##$CPDPRG7= <mlev>
##$CPDPRG8= <mlev>
##$CPDPRGB= <>
##$CPDPRGT= <>
##$D= (0..31)
0 1 0 0 0 0 0 0 0 0.06 0 0 0 0 0 0 0.0002 0 0 0 0 0 0 0 0 0 0 0 0 0 0 
0 
##$DATE= 1167898328
##$DBL= (0..7)
120 120 120 120 120 120 120 120 
##$DBP= (0..7)
150 150 150 150 150 150 150 150 
##$DBP07= 0
##$DBPNAM0= <>
##$DBPNAM1= <>
##$DBPNAM2= <>
##$DBPNAM3= <>
$$ [...]
##$SUBNAM7= <"">
##$SUBNAM8= <"">
##$SUBNAM9= <"">
##$SW= 20.6930455092707
##$SWIBOX= (0..15)
0 0 3 0 0 0 0 0 0 0 0 0 0 0 0 0 
##$SW_h= 5175.983436853
##$TD= 65536
##$TD0= 1
##$TE= 294.16
##$TE2= 300
##$TE3= 300
##$TEG= 300
##$TL= (0..7)
0 120 120 120 120 120 120 120 
##$TP= (0..7)
150 150 150 150 150 150 150 150 
##$TP07= 0
##$TPNAME0= <>
##$TPNAME1= <>
##$TPNAME2= <>
##$TPNAME3= <>
##$TPNAME4= <>
##$TPNAME5= <>
##$TPNAME6= <>
##$TPNAME7= <>
##$TPOAL= (0..7)
0.5 0.5 0.5 0.5 0.5 0.5 0.5 0.5 
##$TPOFFS= (0..7)
0 0 0 0 0 0 0 0 
##$TUNHIN= 0
##$TUNHOUT= 0
##$TUNXOUT= 0
##$USERA1= <user>
##$USERA2= <user>
##$USERA3= <user>
##$USERA4= <user>
##$USERA5= <user>
##$V9= 5
##$VALIST= <valist>
##$VCLIST= <CCCCCCCCCCCCCCC>
##$VD= 0
##$VDLIST= <DDDDDDDDDDDDDDD>
##$VPLIST= <PPPPPPPPPPPPPPP>
##$VTLIST= <TTTTTTTTTTTTTTT>
##$WBST= 1024
##$WBSW= 4
##$XGAIN= (0..3)
0 0 0 0 
##$XL= 0
##$YL= 0
##$YMAX_a= 352920
##$YMIN_a= -400894
##$ZGOPTNS= <>
##$ZL1= 120
##$ZL2= 120
##$ZL3= 120
##$ZL4= 120
##$ABSF1= 16.52069
##$ABSF2= -4.172482
##$ABSG= 5
##$ABSL= 3
##$ALPHA= 0
##$AQORDER= 0
##$ASSFAC= 0
##$ASSFACI= 0
##$ASSFACX= 0
##$ASSWID= 0
##$AUNMP= <proc_1d>
##$AZFE= 0.1
##$AZFW= 0.1
##$BCFW= 0
##$BC_mod= 0
##$BYTORDP= 0
##$COROFFS= 0
##$CY= 12.5
##$DATMOD= 1
##$DC= 0
##$DFILT= <>
##$DTYPP= 0
##$F1P= 14.0000005364418
##$F2P= -0.99999901652339
##$FCOR= 0.5
##$FTSIZE= 32768
##$FT_mod= 6
##$GAMMA= 0
##$GB= 0
##$INTBC= 1
##$INTSCL= 1
##$ISEN= 128
##$LB= 0.3
##$LEV0= 0
##$LPBIN= 0
##$MAXI= 10000
##$MC2= 0
##$MEAN= 0
##$ME_mod= 0
##$MI= 0
##$NCOEF= 0
##$NC_proc= -3
##$NLEV= 6
##$NOISF1= 0
##$NOISF2= 0
##$NSP= 0
##$NTH_PI= 0
##$NZP= 0
##$OFFSET= 16.52069
##$PC= 1
##$PHC0= 231.93
##$PHC1= 2.216857
##$PH_mod= 1
##$PKNL= yes
##$PPARMOD= 0
##$PSCAL= 4
##$PSIGN= 0
##$REVERSE= no
##$SF= 250.130000325522
##$SI= 32768
##$SIGF1= 0
##$SIGF2= 0
##$SINO= 400
##$SIOLD= 32768
##$SREGLST= <1H.CDCl3>
##$SSB= 0
##$STSI= 32768
##$STSR= 0
##$SW_p= 5175.98343685301
##$SYMM= 0
##$S_DEV= 0
##$TDeff= 65536
##$TDoff= 0
##$TI= <Analysis number 999999
Compound Code 99
Book Reference 9
Project Code 9>
##$TILT= no
##$TM1= 0
##$TM2= 0
##$TOPLEV= 0
##$USERP1= <user>
##$USERP2= <user>
##$USERP3= <user>
##$USERP4= <user>
##$USERP5= <user>
##$WDW= 1
##$XDIM= 32768
##$YMAX_p= 520952619
##$YMIN_p= -161950
$$ End of Bruker specific parameters
$$ ---------------------------------
##NTUPLES= NMR SPECTRUM
##VAR_NAME=  FREQUENCY,     SPECTRUM/REAL,   SPECTRUM/IMAG
##SYMBOL=    X,             R,               I
##VAR_TYPE=  INDEPENDENT,   DEPENDENT,       DEPENDENT
##VAR_FORM=  AFFN,          ASDF,            ASDF
##VAR_DIM=   32768,         32768,           32768
##UNITS=     HZ,            ARBITRARY UNITS, ARBITRARY UNITS
##FACTOR=    0.157963299565203, 1,           1
##FIRST=     4132.32042468937, 0,            0
##LAST=      -1043.66301216364, 0,           0
##MIN=       -1043.66301216364, -161950,     0
##MAX=       4132.32042468937, 520952619,    0
$$ Real data points
##PAGE= N=1
##DATA TABLE= (X++(R..R)), XYDATA
$$ [...]
$$ plain form
25846 -5103 36015 27553 19017 10652 11008 20610 11642 21501 15313 22037 5811 -8299 -7318 7814
25832 7814 17566 -7281 -30521 -13361 5232 20415 22716 -761 -7414 -32660 -13277 33631
25820 33631 23406 69 -12330 34129 29472 29404 15030 -29029 -36640 -30099 -39279 -34860 -48283
25807 -48283 -42872 -22137 -31992 -57015 -38484 5481 29976 -8784 -9414 -22263 -4312 -14587
25795 -14587 -42440 12428 35638 23279 -22769 -43603 -79722 -31418 -19087 -38089 15160 74605
25783 74605 42714 -18627 12079 53265 30758 43409 55135 41452 23974 -19926 -18407 24928
25771 24928 10261 -39298 -25374 -21846 -31923 -32655 -52541 -64502 -35746 -24699 -42511 -45067
25759 -45067 -24728 -5603 -4761 14613 30008 29219 -8061 -4654 3424 40564 16554 11129 62124
$$ packed form
25846e103M1118q462q536q365L56R602q968R859o188O724j6226j4110R81J5132
25832G814R752k4847k3240J7160J8593J5183K301k3477o653k5246J9383M6908
25820C3631j0225k3337j2399M6459m657o8j4374m4059p611O541r180M419j3423
25807d8283N411K0735r855k5023J8531M3965K4495l8760o30j2849J7951j0275
25795a4587k7853N4868K3210j2359m6048k0834l6119M8304J2331j9002N3249N9445
25783G4605l1891o1341L0706M1186k2507J2651J1726j3683j7478m3900J519M3335
25771B4928j4667m9559J3924L528j0077p32j9886j1961K8756J1047j7812k556
25759d5067K0339J9125Q42J9374J5395p89l7280L407Q078L7140k4010n425N0995
$$ plain form
25746 62124 95684 100258 94059 58836 14002 -5297 -26197 -36019 -30387 -56500 -46147 -16547
25734 -16547 -54292 -56850 -57479 -42036 -35131 -67415 -79359 -110759 -123821 -74310 -70709 -92051 -67921
25721 -67921 -35712 -20007 -41338 -13103 12197 -18091 8335 4250 9278 4870 -33201 -4833
25709 -4833 26956 19948 20978 14882 25360 11758 2591 1791 43927 41740 46095 19414 -26153
25696 -26153 -38300 7338 32188 4698 -37279 -43656 -20619 -20771 -30434 -11293 44474 34377
25684 34377 -7024 -22416 -27539 -12214 34461 40156 61122 65631 46900 30294 9254 10746
25672 10746 4673 15120 27034 64248 62990 40285 34029 32032 53773 84087 55936 20731
25660 20731 22226 -717 -24956 -38030 -35532 -20596 -17001 -19184 -16699 -820 -4027 -14334 18487
$$ packed form
25746F2124L3560M574o199l5223m4834j9299k0900r822N632k6113J0353K9600
25734a6547l7745k558o29J5443O905l2284j1944l1400j3062M9511L601k1342K4130
25721f7921L2209J5705k1331K8235K5300l0288K6426m085N028m408l8071K8368
25709d833L1789p008J030o096J0478j3602r167q00M2136k187M355k6681m5567
25696b6153j2147M5638K4850k7490m1977o377K3037j52r663J9141N5767j0097
25684C4377m1401j5392n123J5325M6675N695K0966M509j8731j6606k1040J492
25672A0746o073J0447J1914L7214j258k2705o256j997K1741L0314k8151l5205
25660B0731J495k2943k4239j3074K498J4936L595k183K485J5879l207j0307L2821
$$ plain form
25647 18487 16698 6728 22446 63046 19670 -8666 -6746 7544 21435 41724 51577 44839 68501
25634 68501 47158 21702 8321 19981 -4590 2869 10536 5167 7916 15236 35586 -808 -10600
25621 -10600 -2071 -16442 -29814 -26719 14625 25457 63574 74413 73419 51856 68996 28924
25609 28924 -2489 31507 27943 44531 63840 25673 4450 -30657 -13356 5745 -15836 -35752
25597 -35752 -54939 -32632 -3409 -16661 -14760 10578 20340 -5149 -29685 -13800 -14397 -29811
25585 -29811 -6068 -22557 -54876 -11195 22049 20260 29125 18473 15341 15326 3004 -5787 46208
25572 46208 88805 112931 91418 49787 -13912 -45183 -26535 -2938 -50677 -17440 44477 41826
25560 41826 -4763 -21489 -54017 -70687 -79464 -61425 11729 28069 32742 61187 29691 19603
$$ packed form
25647A8487j789r970J5718M0600m3376k8336J920J4290J3891K0289R853o738K3662
25634F8501k1343k5456j3381J1660k4571P459P667n369K749P320K0350l6394r792
25621a0600Q529j4371j3372L095M1344J0832L8117J0839r94k1563J7140m0072
25609B8924l1413L3996l564J6588J9309l8167k1223l5107J7301J9101k1581j9916
25597c5752j9187K2307K9223j3252J901K5338R762k5489k4536J5885n97j5414
25585b9811K3743j6489l2319M3681L3244j789Q865j0652l132j5j2322q791N1995
25572D6208M2597K4126k1513m1631o3699l1271J8648K3597m7739L3237O1917k651
25560D1826m6589j6726l2528j6670q777J8039P3154J6340M673K8445l1496j0088
$$ plain form
25548 19603 70532 42060 28444 5292 -69674 -66902 -50655 -36384 -31751 -20946 -13530 4953
25536 4953 -4120 -43313 -47814 -48023 -31475 -56611 -78309 -90504 -118992 -106862 -66232 -65248 -51381
25523 -51381 -25829 -5738 -8428 -14031 437 5260 15222 -2932 -30595 -25670 -14714 9297 10561
25510 10561 -1355 -25063 -12307 11505 -10664 -46244 -36255 -26861 -29120 -27406 -47595 -18502
25498 -18502 16285 2245 -40790 -39536 -25924 -52592 -17072 -1523 -19646 -46251 7454 44018
25486 44018 24426 -1939 -18541 -2867 -22044 -40816 -19146 -5029 9510 59924 29086 11125
25474 11125 -10478 -28933 13935 17581 -19246 -69353 -67842 -37442 -37620 -2984 -27752 -38519
25462 -38519 -52430 -34120 8184 88995 65090 4034 -25675 -14766 4518 9264 -15703 -25568
$$ packed form
25548A9603N0929k8472j3616k3152p4966K772J6247J4271M633J0805P416J8483
25536D953r073l9193m501k09J6548k5136k1698j2195k8488J2130M0630R84J3867
25523e1381K5552K0091k690n603J4468M823R962j8154k7663M925J0956K4011J264
25510A0561j1916k3708J2756K3812k2169l5580R989R394k259J714k0189K9093
25498a8502L4787j4040m3035J254J3612k6668L5520J5549j8123k6605N3705L6564
25486D4018j9592k6365j6602J5674j9177j8772K1670J4117J4539N0414l0838j7961
25474A1125k1603j8455M2868L646l6827n0107J511L0400j78L4636k4768j0767
25462c8519j3911J8310M2304Q0811k3905o1056k9709J0909J9284M746k4967r865
$$ plain form
25450 -25568 -30315 12189 -12726 -45840 -43064 -24558 11051 -25980 -35897 14352 -23655 -29912
25438 -29912 5216 44108 24226 33136 38427 8193 -29789 -21541 8108 45729 33794 25226
25426 25226 15036 -731 -17333 34535 39405 40483 14113 -11009 26083 28082 -658 -37837
25414 -37837 -59666 -58518 -60942 -58360 -53055 -7351 31507 41086 -12017 -29732 -43540 -24914 -29423
25401 -29423 4937 25633 36245 -2159 -21161 -61453 -37831 -20241 24202 62572 47363 35181
25389 35181 25317 15541 -11989 -39182 -60181 -50033 -20645 42519 64013 86192 88539 38887
25377 38887 -2290 1879 1231 7566 39390 71238 25719 22084 21915 12027 25230 16683 753
25364 753 -38081 -5889 6892 36545 15747 -8824 14614 45658 17986 -42836 -46711 -14277
$$ packed form
25450b5568m747M2504k4915l3114K776J8506L5609l7031r917N0249l8007o257
25438b9912L5128L8892j9882Q910N291l0234l7982Q248K9649L7621j1935q568
25426B5226j0190j5767j6602N1868M870J078k6370k5122L7092J999k8740l7179
25414c7837k1829J148k424K582N305M5704L8858R579n3103j7715j3808J8626m509
25401b9423L4360K0696J0612l8404j9002m0292K3622J7590M4443L8370j5209j2182
25389C5181r864r776k7530k7193k0999J0148K9388O3164K1494K2179K347m9652
25377C8887m1177M169o48O335L1824L1848m5519l635j69r888J3203q547j5930
25364G53l8834L2192J2781K9653k0798k4571K3438L1044k7672o0822l875L2434
$$ plain form
25352 -14277 -35630 -22316 37226 22566 48766 89037 59037 51351 43069 21269 -5820 -22427
25340 -22427 -8166 -49201 -77892 -94125 -96440 -109220 -93709 -79311 -52331 -14334 -8753 6470
25328 6470 -1270 19767 -9231 -25186 7536 -21899 -12491 -78185 -95183 -61441 -35748 -36568 -36922
25315 -36922 -23216 -10231 18535 75097 79872 69913 44891 -14385 2346 20221 -6728 35321
25303 35321 40054 15661 -15446 -60447 -45549 -34728 -41185 -22709 16085 29053 -30227 -26184
25291 -26184 -37576 -43505 994 -21831 -61699 -80495 -78590 -68934 -73734 -51698 -5786 24429
25279 24429 24518 -10816 -43614 -94873 -81174 -36127 -60813 -82089 -63066 -28153 -17599 -15767
25267 -15767 -29058 -9508 -2661 -12271 -3340 -18972 3575 4110 -7928 -22502 -52800 -85393 -92296
$$ packed form
25352a4277k1353J3314N9542j4660K6200M0271l0000p686q282k1800k7089j6607
25340b2427J4261m1035k8691j6233k315j2780J5511J4398K6980L7997N581J5223
25328F470p740K1037k8998j5955L2722k9435R408o5694j6998L3742K5693q20l54
25315c6922J3706J2985K8766N6562M775r959k5022n9276J6731J7875k6949M2049
25303C5321M733k4393l1107m5001J4898J0821o457J8476L8794J2968n9280M043
25291b6184j1392n929M4499k2825l9868j8796J905R656m800K2036M5912L0215
25279B4429Q9l5334l2798n1259J3699M5047k4686k1276J9023L4913J0554J832
25267a5767j3291J9550O847r610Q931j5632K2547N35j2038j4574l0298l2593o903
$$ plain form
25254 -92296 -69023 -29606 -21484 -24286 -16718 -10228 37028 78863 55040 62320 61348 -15330 -44999
25241 -44999 -33106 -11939 18308 30017 28530 29260 18873 -8706 -27868 -40382 -19816 -21666
25229 -21666 -26647 17474 37716 61975 63865 47371 28973 -749 -56270 -34063 14302 36923
25217 36923 40602 44976 43316 25354 27958 15079 22702 27345 42013 39298 48662 -1504 -31402
25204 -31402 -60026 -63838 -56368 -56066 -36316 8068 16130 -17676 -25928 -34114 -21889 -41289 -32198
25191 -32198 -47014 -16270 -17706 -67731 -55617 -55124 -49860 -14945 25654 29352 6380 -5901 -14197
25178 -14197 13477 14785 7271 -32694 -53456 -58694 -37477 -52044 -32471 -25441 -55097 -28736
25166 -28736 -21273 48938 61868 -6673 -30140 -26860 -64382 -44168 14845 -14315 -63592 -29290
$$ packed form
25254i2296K3273L9417Q122k802P568O490M7256M1835k3823P280r72p6678k9669
25241d4999J1893K1167L0247J1709j487P30j0387k7579j9162j2514K0566j850
25229b1666m981M4121K0242K4259J890j6494j8398k9722n5521K2207M8365K2621
25217C6923L679M374j660j7962K604j2879P623M643J4668k715R364n0166k9898
25204c1402k8624l812P470L02J9750M4384Q062l3806q252q186J2225j9400R091
25191c2198j4816L0744j436n0025J2114M93N264L4915M0599L698k2972j2281q296
25178a4197K7674J308p514l9965k0762n238K1217j4567J9573P030k9656K6361
25166b8736P463P0211J2930o8541k3467L280l7522K0214N9013k9160m9277L4302
$$ plain form
25154 -29290 -22292 -11359 -38533 -39104 -40810 -20008 -31465 -52092 -12838 21979 7119 -19855
25142 -19855 -8731 -17425 -8281 13297 46537 22476 -32951 -41504 9247 4028 9258 7286 7766
25129 7766 4056 -31956 -59497 -2742 31766 62543 77109 92412 78507 52236 62753 27697
25117 27697 -11017 -18190 -25473 9566 36435 27204 26767 -9910 -3254 7162 25127 14819 -14799
25104 -14799 -3174 13008 16814 -2211 -5203 19491 -3225 -10197 -14751 -8158 481 -10028 -25185
25091 -25185 -27289 -2099 17850 8625 -12801 -4910 -18627 -72370 -34976 -15934 -5201 -5386 -32225
25078 -32225 -45430 -27365 -28533 -12177 -8492 -49528 -72637 -22973 -6147 -18541 -24983 -38603
25066 -38603 -59253 -44263 -23365 14671 -3892 -29556 -83036 -59600 -38077 -41989 -54126 -35018
$$ packed form
25154b9290O998J0933k7174n71j706K0802j1457k0627L9254L4817j4860k6974
25142a9855J1124q694R144K1578L3240k4061n5427q553N0751n219N230j972M80
25129G766l710l6012k7541N6755L4508L0777J4566J5303j3905k6271J0517l5056
25117B7697l8714p173p283L5039K6869r231m37l6677O656J0416J7965j0308k9618
25104a4799J1625J6182L806j9025k992K4694k2716o972m554O593Q639j0509j5157
25091b5185k104K5190J9949r225k1426P891j3717n3743L7394J9042J0733j85k6839
25078c2225j3205J8065j168J6356L685m1036k3109M9664J6826j2394o442j3620
25066c8603k0650J4990K0898L8036j8563k5664n3480K3436K1523l912j2137J9108
$$ plain form
25054 -35018 -21215 -17147 7270 -9649 19222 27999 32766 53506 45119 47876 27588 6582 10440
25041 10440 -5083 -24574 -3181 2830 6090 48793 46863 47784 96514 79673 86302 93074 92585
25028 92585 40074 35807 24701 38259 -21171 -53840 -67768 -50198 -15874 -9909 -17950 -13752
25016 -13752 29884 51349 804 15477 12366 203 -25229 -66510 -79098 -62425 -22758 11287
25004 11287 9203 24903 25900 -6268 6981 7814 26258 34077 26009 11959 -45808 -14720 -2471
24991 -2471 -45859 -65670 -61030 -53073 -55257 -18170 11948 37209 37162 34205 27503 39937 32791 -1353
24977 -1353 -2058 2024 -46342 -49714 -14385 16608 31276 27672 33618 57568 44661 21698 3149
24964 3149 -3701 -43662 -43352 -1797 30680 59989 63910 45748 -16876 -34058 -16035 -4900 -7852
$$ packed form
25054c5018J3803M068K4417j6919K8871Q777M767K0740q387K757k0288k1006L858
25041A0440j5523j9491K1393O011L260M2703j930R21M8730j6841O629O772m89
25028I2585n2511m267j1106J3558n9430l2669j3928J7570L4324N965q041M198
25016a3752M3636K1465n0545J4673l111j2163k5432m1281j2588J6673L9667L4045
25004A1287k084J5700R97l2168J3249Q33J8444P819q068j4050n7767L1088J2249
24991b471m3388j9811M640P957k184L7087L0118K5261m7k957o702J2434p146l4144
24977a353p05M082m8366l372L5329L0993J4668l604N946K3950j2907k2963j8549
24964C149o850l9961L10M1555L2477K9309L921j8162o2624j7182J8023J1135k952
$$ plain form
24951 -7852 28306 87538 86953 32498 51130 56080 43302 45295 32234 39576 47936 16934 14075
24938 14075 33805 38335 29118 3451 33222 36223 11841 1634 39989 27202 52153 57781
24926 57781 41732 48026 49273 46383 36101 53795 91971 86284 85779 93930 63998 26351 40725
24913 40725 23989 7299 2757 41681 96184 105898 24882 -33669 -26426 -37280 -43270 -29880
24901 -29880 -24741 -5015 -4253 -42810 -33068 -22696 -21095 -12987 38267 45282 11890 20876 10794
24888 10794 -11355 5417 24798 -9360 34847 74274 62997 25276 15771 28615 50712 61908
24876 61908 72887 61117 16855 1458 -39525 -49232 7255 8982 47026 49298 35939 51539
24864 51539 33352 8055 -45216 -64137 -48285 -58316 -76158 -102335 -91317 -92102 -71966 -33852
$$ packed form
24951g852L6158N9232n85n4455J8632M950j2778J993j3061P342Q360l1002k859
24938A4075J9730M530r217k5667K9771L001k4382j0207L8355j2787K4951N628
24926E7781j6049O294J247k890j0282J7694L8176n687n05Q151k9932l7647J4374
24913D0725j6736j6690m542L8924N4503R714q1016n8551P243j0854n990J3390
24901b9880N139J9726P62l8557R742J0372J601Q108N1254P015l3392Q986j0082
24888A0794k2149J6772J9381l4158M4207L9427j1277l7721r505J2844K2097J1196
24876F1908J0979j1770m4262j5397m0983r707N6487J727L8044K272j3359J5600
24864E1539j8187k5297n3271j8921J5852j0031j7842k6177J1018p85K0136L8114
$$ plain form
24852 -33852 -46106 -61849 -70518 -62347 -32989 -10088 -36151 -5411 20772 7415 -5830 4383
24840 4383 -8782 -56158 -27500 5042 -5561 -1316 7214 -16069 -23083 -36650 -16370 49313
24828 49313 58126 21401 -12026 -5710 33868 35147 -20630 -77664 -98547 -74938 -21557 -37854
24816 -37854 -35249 -397 -9525 -37230 -75563 -54415 -18187 -16212 -6167 -3262 -40836 -36135 13271
24803 13271 34914 -8223 -26168 20249 46471 58614 23065 27660 52508 62633 29805 1776
24791 1776 -8733 22472 58073 74787 83664 63919 60828 39057 32626 -22812 -31953 2088 18506
24778 18506 1524 -5035 -24595 -61008 -68183 -33331 -22077 -16177 -9320 4969 -12678 -60057
24766 -60057 -68280 -38098 -13083 14230 43870 43551 38112 24179 24504 11660 -19665 -34430 -7995
$$ packed form
24852c3852j2254j5743q669Q171K9358K2901k6063L0740K6183j3357j3245J0213
24840D383j3165m7376K8658L2542j0603M245Q530k3283p014j3567K0280O5683
24828D9313Q813l6725l3427O316L9578J279n5777n7034k0883K3609N3381j6297
24816c7854K605L4852r128k7705l8333K1148L6228J975J0045K905l7574M701M9406
24803A3271K1643m3137j7945M6417K6222J2143l5549M595K4848J0125l2828k8029
24791A776j0509L1205L5601J6714Q877j9745l091k1771o431n5438r141L4041J6418
24778A8506j6982o559j9560l6413p175L4852J1254N900O857J4289j7647m7379
24766f0057q223L0182K5015K7313K9640l19n439j3933L25j2844l1325j4765K6435
$$ plain form
24753 -7995 34131 40989 -24666 -512 9225 5497 13985 5685 -724 6772 20086 27892 15393
24740 15393 13866 10319 -557 23702 -6730 -4192 27291 12741 -23690 -39493 -80640 -96305
24728 -96305 -62668 -40092 2354 -20649 -73143 -111638 -47324 -17125 36395 49297 61456 46156
24716 46156 45844 76812 75843 18549 39089 33919 -6607 -36174 -63598 -76562 -68165 -80188 -58046
24703 -58046 -67318 -69779 -17364 1895 -2220 -25921 -10460 -8379 8655 24238 -29810 -61098
24691 -61098 -77405 -118498 -111900 -115687 -88054 -81131 -75235 -32013 29969 23821 -49908 -53518 -7098
24678 -7098 -20964 -72497 -23526 8257 4047 -20784 -70548 -57032 -21707 -12638 -60364 -66540
24666 -66540 -96757 -74748 -71685 -107289 -91791 -78443 -88759 -64261 -17149 -16903 -29138 -42515
$$ packed form
24753g995M2126O858o5655K4154R737l728Q488q300o409P496J3314P806j2499
24740A5393j527l547j0876K4259l0432K538L1483j4550l6431j5803m1147j5665
24728i6305L3637K2576M2446k3003n2494l8495O4314L0199N3520J2902J2159j5300
24716D6156l12L0968r69n7294K0540n170m0526k9567k7424j2964Q397j2023K2142
24703e8046r272k461N2415J9259m115k3701J5461K081J7034J5583n4048l1288
24691f1098j6307m1093O598l787K7633O923N896M3222O1982o148p3729l610M6420
24678g098j3866n1533M8971L1783m210k4831m9764J3516L5325R069m7726o176
24666f6540l0217K2009L063l5604J5498J3348j0316K4498M7112K46j2235j3377
$$ plain form
24654 -42515 -39781 -22002 12100 24142 28547 24563 21715 23780 70539 74448 49687 -2730 10469
24641 10469 40169 49718 56966 40649 15117 6789 -6242 -15430 -20874 -66923 -63014 -49733 -71374
24628 -71374 -91985 -68960 -39111 -40107 -10828 12738 16034 -91 22602 33435 -3434 -39063
24616 -39063 1677 23030 46717 52903 56431 67482 31146 22305 53409 59538 31934 -2870
24604 -2870 -307 21123 42367 54433 74589 86996 63848 41890 12704 896 38511 9886
24592 9886 -32190 -35943 11918 20101 32766 20052 -16264 -28489 -31341 -33882 -4056 10126 -9584
24579 -9584 -71726 -80130 -75091 -75751 -66633 -28624 12158 29392 22794 24232 42981 45527 23989
24566 23989 -18153 -24967 -12764 -6617 -7593 11904 15224 -31441 -23324 -705 -28019 -27757 13441
$$ packed form
24654d2515K734J7779L4102J2042M405l984k848K065M6759L909k4761n2417J3199
24641A0469K9700R549P248j6317k5532q328j3031r188n444m6049L909J3281k1641
24628g1374k0611K3025K9849r96K9279K3566L296j6125K2693J0833l6869l5629
24616c9063M0740K1353K3687O186L528J1051l6336q841L1104O129k7604l4804
24604b870K563K1430K1244J2066K0156J2407k3148k1958k9186j1808L7615k8625
24592I886m2076l753M7861Q183J2665j2714l6316j2225k852k541K9826J4182j9710
24579i584o2142q404N039o60R118L8009M0782J7234o598J438J8749K546k1538
24566B3989m2142o814J2203O147r76J9497L320m6665Q117K2619k7314K62M1198
$$ plain form
24553 13441 32853 -9802 36587 32455 27996 79193 75787 46010 22125 -5670 -1839 27158
24541 27158 3309 -3131 -3140 6387 33755 81058 82394 58153 -12039 -19242 -28441 -52159 -34090
24528 -34090 -46712 -55452 -10896 2893 -17849 32379 43175 57106 65838 25831 21892 25942
24516 25942 13901 4861 42870 49801 42310 76985 70969 46734 24960 5451 1163 29344 43075
24503 43075 55666 60833 43049 17570 -3338 -18577 -20762 -8087 -16578 16816 49184 36528
24491 36528 20672 -22524 -145 13969 54153 52461 50969 7882 -6830 -40076 -23635 8695
24479 8695 49022 47590 36935 10985 -7866 -15930 -36051 -46413 -62876 -95467 -67844 6295
24467 6295 30814 3635 -38348 -74988 -60093 -25666 12922 -1534 -16716 -16495 -21072 -29081 -22240
$$ packed form
24553A3441J9412m2655M6389m132m459N1197l406k9777k3885k7795L831K8997
24541B7158k3849o440rR527K7368M7303J336k4241p0192p203r199k3718J8069
24528c4090j2622q740M4556J3789k0742N0228J0796J3931Q732m0007l939M050
24516B5942j2041r040L8009O931p491L4675o016k4235k1774j9509m288K8181J3731
24503D3075J2591N167j7784k5479k0908j5239k185J2675q491L3394L2368j2656
24491C6528j5856m3196K2379J4114M0184j692j492m3087j4712l3246J6441L2330
24479H695M0327j432j0655k5950j8851q064k0121j0362j6463l2591K7623P4139
24467F295K4519k7179m1983l6640J4895L4427L8588j4456j5182K21m577q009O841
$$ plain form
24454 -22240 -46976 -56076 -60159 -62830 -57002 -69256 -63698 -50999 -60031 -53537 -51350 -27524 -21875
24441 -21875 1642 13038 12770 -1379 -32103 -37681 -55988 -52773 -82793 -58376 -37387 -54860
24429 -54860 -26667 15485 32340 49336 50525 39149 43909 43278 35168 4582 -62718 -60585 -26013
24416 -26013 -12681 -6911 -25875 -5932 11452 -13049 -57387 -51087 -17580 5585 5497 -17458 17841
24403 17841 24521 47209 25767 21958 34823 24972 4210 19001 51437 51485 40161 9850 -1571
24390 -1571 26879 39557 73470 44712 -3850 -33012 -42330 -40712 -50436 -96337 -67320 -85711
24378 -85711 -65387 -29397 -35186 28562 41423 -10878 -36406 -34289 -41049 -7053 27455 4017
24366 4017 -16852 -12156 -47034 -43398 -1061 -2361 5910 -17676 -16020 -25554 -48283 -37195 -28176
$$ packed form
24454b2240k4736r100m083k671N828j2254N558J2699r032O494K187K3826N649
24441b1875K3517J1396k68j4149l0724n578j8307L215l0020K4417K0989j7473
24429e4860K8193M2152J6855J6996J189j1376M760o31q110l0586o7300K133L4572
24416b6013J3332N770j8964J9943J7384k4501m4338O300L3507K3165q8k2955L5299
24403A7841O680K2688k1442l809J2865r851k0762J4791L2436M8j1324l0311j1421
24390a571K8450J2678L3913k8758m8562k9162r318J618r724m5901K9017j8391
24378h5711K0324L5990n789O3748J2861n2301k5528K117o760L3996L4508k3438
24366D017k0869M696l4878L636M2337j300Q271k3586J656r534k2729J1088R019
$$ plain form
24353 -28176 -3936 17652 6415 -35861 -20238 2648 36377 57947 44750 39505 -3439 7182
24341 7182 6586 -18620 14852 22432 12086 3910 8353 49004 25832 12992 -36467 -59561 -32190
24328 -32190 121 -2055 -11175 -1735 34206 25942 36880 38483 62244 32077 24393 90167 60919
24315 60919 32478 -16843 -59310 -35238 -43186 -52113 -43112 4756 64411 87555 61608 27287
24303 27287 19917 4659 32612 12824 -12663 -48275 -33783 -13526 -27792 -16956 30765 10154
24291 10154 25024 16960 -21754 -25140 -22167 -7341 -6879 -30116 -30263 12129 26188 38294 59249
24278 59249 -11219 -21653 -58029 -32896 -18696 -63780 -65291 -62184 -43469 -31658 -33969 -27665
24266 -27665 4503 34747 36923 37351 27879 -10327 -20751 16428 18418 44120 55549 56889 40604
$$ packed form
24353b8176K4240K1588j1237m2276J5623K2886L3729K1570j3197n245m2944J0621
24341G182n96k5206L3472P580j0346q176M443M0651k3172j2840m9459k3094K7371
24328c2190L2311k176r120R440L5941q264J0938J603K3761l0167p684O5774k9248
24315F0919k8441m9321m2467K4072p948q927R001M7868N9655K3144k5947l4321
24303B7287p370j5258K7953j9788k5487l5612J4492K0257j4266J0836M7721k0611
24291A0154J4870q064l8714l386K973J4826M62k3237j47M2392J4059J2106K0955
24278E9249p0468j0434l6376K5133J4200m5084j511L107J8715J1811k311O304
24266b7665L2168L0244K176M28r472l8206j0424L7179J990K5702J1429J340j6285
$$ plain form
24253 40604 10434 9486 -4058 632 40903 49312 52045 18098 28304 3534 12585 37329 53894
24240 53894 54516 40153 7463 -24844 -63098 -67958 -54562 -4808 18600 30192 35412 10486
24228 10486 11335 37957 -20205 -20401 -5970 -2097 37812 34390 12552 18889 74590 114890 72116
24215 72116 5192 -18134 -32602 -38360 7124 44440 71830 29327 -12257 -5540 -33531 -58914
24203 -58914 -27336 -148 7719 -35263 -36073 -23535 -22154 -32660 -31206 -12612 7082 -39665 -49138
24190 -49138 -16096 5244 26334 41792 20417 -6393 -4147 -3471 25527 17374 17082 29772 51477
24177 51477 72987 33519 3261 5522 9171 -1367 15248 25716 42394 84972 69195 22607
24165 22607 8165 22727 12064 33158 47771 44660 73193 26716 -15643 -1117 35846 38306
$$ packed form
24253D0604l0170r48j3544M690M0271Q409K733l3947J0206k4770R051K4744J6565
24240E3894O22j4363l2690l2307l8254m860J3396M9754K3408J1592N220k4926
24228A0486Q49K6622n8162j96J4431L873L9909l422k1838O337N5701M0300m2774
24215G2116o6924k3326j4468n758M5484L7316K7390m2503m1584O717k7991k5383
24203e8914L1578K7188P867m2982q10J2538J381j0506J454J8594J9694m6747r473
24190d9138L3042K1340K1090J5458k1375k6810K246O76K8998q153k92J2690K1705
24177E1477K1510l9468l0258K261L649j0538J6615J0468J6678M2578j5777m6588
24165B2607j4442J4562j0663K1094J4613l111K8533m6477m2359J4526L6963K460
$$ plain form
24153 38306 13307 -5359 -13370 -14128 -45585 -38889 -8853 -28224 -43914 -21903 -5341 -18844
24141 -18844 -95469 -117782 -82866 -74246 -89576 -68307 -48295 -26635 -39341 -17072 -21818 -18988
24129 -18988 -3755 15581 -18625 -39401 -27477 -24006 -19121 -18898 -63772 -113544 -82164 -29925
24117 -29925 -34488 -69638 -66225 -77977 -72272 -61089 -54639 -26632 -27609 -26593 -57273 -31379 -17135
24104 -17135 -9623 -20672 -55173 -32546 15643 23142 27792 43445 68006 61108 49742 22197
24092 22197 16720 22315 13635 29681 12736 -35640 -52220 -89326 -74155 -26892 23782 26411
24080 26411 -6373 -39548 -50001 -39635 -18306 -49890 -36822 815 4919 4115 12592 -29272
24068 -29272 -38142 -26272 10794 48796 13944 -20262 -20149 -45144 -75725 -73135 -76565 -68550 -24668
$$ packed form
24153C8306k4999j8666q011p58l1457O696L0036j9371j5690K2011J6562j3503
24141a8844p6625k2313L4916Q620j5330K1269K0012K1660j2706K2269m746K830
24129a8988J5233J9336l4206k0776J1924L471M885K23m4874m9772L1380N2239
24117b9925m563l5150L413j1752N705J1183O450K8007r77J016l0680K5894J4244
24104a7135P512j1049l4501K2627M8189P499M650J5653K4561o898j1366k7545
24092B2197n477N595q680J6046j6945m8376j6580l7106J5171M7263N0674K629
24080B6411l2784l3175j0453J0366K1329l1584J3068L7637M104q04Q477m1864
24068b9272q870J1870L7066L8002l4852l4206J13k4995l0581K590l430Q015M3882
$$ plain form
24055 -24668 -7674 -17968 -25464 -64363 -94053 -99128 -48254 -25268 7983 -2520 -2951 -11787 -47669
24042 -47669 -29279 34747 27921 -6249 -9907 -10980 5772 29807 -18502 -81057 -92967 -86545
24030 -86545 -74126 -79107 -48700 3059 18163 51218 86138 51387 29089 -1680 -5584 -10958
24018 -10958 -50799 -12973 42487 55793 39547 24475 -3184 -38509 -37839 -28678 -2773 -3755 -44791
24005 -44791 -47587 -11034 13948 -15286 1307 35271 19858 3414 39134 44042 19610 28433
23993 28433 34029 5121 32024 22411 1929 56 16793 -15268 -38665 -31409 -40077 -2623 37430
23980 37430 35668 727 -14530 17643 -7223 -15873 10261 10275 -44974 -41436 -7419 35059 54926
23967 54926 40476 31004 13306 -3740 28245 54339 5274 -56665 -39428 -36349 -61989 -112005
$$ packed form
24055b4668J6994j0294p496l8899k9690n075N0874K2986L3251j0503m31q836l5882
24042d7669J8390O4026o826l4170l658j073J6752K4035m8309o2555j1910O422
24030h6545J2419m981L0407N1759J5104L3055L4920l4751k2298l0769l904n374
24018a0958l9841L7826N5460J3306j6246j5072k7659l5325O70R161K5905r82m1036
24005d4791k796L6553K4982k9234J6593L3964j5413j6444L5720M908k4432Q823
23993B8433N596k8908K6903r613k0482j873J6737l2061k3397P256q668L7454M0053
23980C7430j762l4941j5257L2173k4866q650K6134J4n5249L538L4017M2478J9867
23967E4926j4450r472j7698j7046L1985K6094m9065o1939J7237L079k5640n0016
$$ plain form
23955 -112005 -103111 -55396 -50486 -56512 -724 33889 39336 55229 31764 31116 -15465 -53267 -90120
23942 -90120 -91292 -89079 -80404 -56299 -46706 -66778 -43077 -33899 -39804 -20164 -30592 -75049 -62064
23929 -62064 -44205 -11290 17770 38977 46481 23423 59267 45740 4937 -14837 2331 -13438
23917 -13438 -40842 -53143 -35155 -6543 3837 -36216 -18763 17001 36897 8289 -12797 -1467
23905 -1467 28827 18702 38416 22583 -20473 -4850 -3836 -17592 13188 16030 -4844 -20543
23893 -20543 -27109 -38659 -1406 75170 45786 -355 31964 35444 22675 29927 58577 21508
23881 21508 -16442 -13673 27101 24589 -17341 -35548 -17564 12390 27842 7365 24689 26385
23869 26385 -56121 -90096 -41576 -43339 -21347 13321 41725 62679 52622 7721 -753 -7593
$$ packed form
23955a12005Q894M7715M910o026N5788L4613N447J5893k3465o48m6581l7802l6853
23942i0120j172K213Q675K4105R593k0072K3701R178n905J9640j0428m4457J2985
23929f2064J7859L2915K9060K1207P504k3058L5844j3527m0803j9774J7168j5769
23917a3438k7404j2301J7988K8612J0380m0053J7453L5764J9896k8608k1086J1330
23905a467L0294j0125J9714j5833m3056J5623J014j3756L0780K842k0874j5699
23893b0543o566j1550L7253P6576k9384m6141L2319L480j2769P252K8650l7069
23881B1508l7950K769M0774k512m1930j8207J7984K9954J5452k0477J7324J696
23869B6385q2506l3975M8520j763K1992L4668K8404K0954j0057m4901q474o840
$$ plain form
23857 -7593 -9262 19131 48394 31213 -4677 -17490 36371 63469 28543 29620 12917 535
23845 535 23808 80980 65613 70476 88251 87310 29820 -2515 -1985 -16384 18978 29242 15168
23832 15168 36985 40713 13130 1471 21133 7671 5492 -29994 -58030 -18077 -25509 -47657
23820 -47657 -61960 -70139 -78972 -49579 -37033 -12652 38186 16920 -7462 -16934 -17802 -1773 15440
23807 15440 22789 -29847 -55639 2040 5752 -4133 -24269 -39568 -61244 -84739 -65440 -65892 -37462
23794 -37462 -52670 -66668 -5802 35197 21567 14083 -30770 -84820 -55267 -10441 -11237 -2816
23782 -2816 21594 47409 34975 -4249 -56343 -58715 -55092 -73659 -54593 -9205 32038 69352
23770 69352 11776 -698 -2793 -3628 9806 42436 39015 25486 10544 20134 34884 9399 3626
$$ packed form
23857g593j669K8393K9263j7181l5890j2813N3861K7098l4926J077j6703j2382
23845E35K3273N7172j5367M863J7775r41n7490l2335N30j4399L5362J0264j4074
23832A5168K1817L728k7583j1659J9662j3462k179l5486k8036L9953p432k2148
23820d7657j4303q179q833K9393J2546K4381N0838k1266k4382r472q68J6029J7213
23807A5440P349n2636k5792N7679L712r885k0136j5299k1676k3495J9299m52K8430
23794c7462j5208j3998O0866M0999j3630p484m4853n4050K9553M4826p96Q421
23782b816K4410K5815j2434l9224n2094k372L623j8567J9066M5388M1243L7314
23770F9352n7576j2474k095q35J3434L2630l421j3529j4942R590J4750k5485n773
$$ plain form
23757 3626 9474 -5033 15530 16448 -29054 -54749 -11408 41543 -13029 -78844 -76264 -77590 -103667
23744 -103667 -41413 27237 14048 13907 26170 19115 25516 27080 15279 42496 41005 13143 -8433
23731 -8433 17899 31915 53058 29856 -12406 -30683 -50246 -30551 -41750 -62372 -46116 -771
23719 -771 17198 22842 27507 32425 43629 46757 51987 27848 24668 -17001 -29251 -26728 -14622
23706 -14622 -18843 14809 5330 -12433 -22712 -12570 -3265 -10626 -5404 -37176 -50857 -18679 -14433
23693 -14433 -53879 -30925 -22179 -39029 -5041 -25116 14645 50234 48199 50048 46834 48800 15437
23680 15437 -21063 6417 18799 -22923 -20938 -34294 -72913 -117036 -104440 -89179 -61371 -45453
23668 -45453 -28413 -5271 21221 41408 32740 23312 -16583 -39377 -24327 -29691 -35765 -26398 3483
$$ packed form
23757C626N848j4507K0563R18m5502k5695M3341N2951n4572o5815K580j326k6077
23744a03667O2254O8650j3189j41J2263p055O401J564j1801K7217j491k7862k1576
23731h433K6332J4016K1143k3202m2262j8277j9563J9695j1199k0622J6256M5345
23719g71J7969N644M665M918J1204L128N230k4139l180m1669j2250K523J2106
23706a4622m221L3652r479j7763j0279J0142R305p361N222l1772j3681L2178M246
23693a4433l9446K2954Q746j6850L3988k0075L9761L5589k035J849l214J966l3363
23680A5437l6500K7480J2382m1722J985j3356l8619m4123J2596J5261K7808J5918
23668d5453J7040K3142K6492K0187q668r428l9895k2794J5050n364o074R367K9881
$$ plain form
23655 3483 55839 11579 -29289 -51967 -72163 -51261 1654 34356 -11546 -34307 19062 48261
23643 48261 22384 5002 -8693 -6043 4565 6544 11661 31229 41085 -23393 -70049 -52305
23631 -52305 -32755 -43998 -38764 3866 -9295 -2821 -12647 -18335 -7356 41609 58211 18613
23619 18613 -7400 22133 23742 -3213 -13999 1298 -1956 39119 55158 61212 47076 57494
23607 57494 27398 13412 36603 56250 32790 -29912 -35080 -40720 -37982 -13239 -23214 -1063
23595 -1063 20020 16999 11152 -34279 -24523 -59400 -91494 -51618 -29271 -7512 4175 -22171
23583 -22171 -35999 -21805 -14221 47 20423 6322 7704 -31346 -53686 517 8209 -31304
23571 -31304 -32957 -42679 -37249 -42703 -37271 -15803 -28604 -59288 -37462 -14633 -48866 -53156 -10689
$$ packed form
23655C483N2356m4260m0868k2678k0196K0902N2915L2702m5902k2761N3369K9199
23643D8261k5877j7382j3695K650J0608J979N117J9568R856o4478m6656J7744
23631e2305J9550j1243N234M2630j3161O474r826n688J0979M8965J6602l9598
23619A8613k6013K9533J609k6955j0786J5297l254M1075J6039O054j4136J0418
23607E7494l0096j3986K3191J9647k3460o2702n168n640K738K4743r975K2151
23595a063K1083l021n847m5431R756l4877l2094L9876K2347K1759J1687k6346
23583b2171j3828J4194P584J4268K0376j4101J382l9050k2340N4203P692l9513
23571c1304j653r722N430n454N432K1468j2801l0684K1826K2829l4233m290M2467
$$ plain form
23558 -10689 -8141 -34508 -22608 -22026 -33581 -56394 -32866 -13357 -12584 -8878 -4611 -54669 -51068
23545 -51068 -64204 -90639 -93441 -82376 -65060 -52988 -42484 -15546 -14348 -23397 -44881 -45120 -68351
23532 -68351 -61713 -43248 -11768 4235 -10932 -29175 -33962 -27535 14198 45963 35606 50805
23520 50805 39193 65559 67441 20569 24774 44207 -1078 -41929 -28831 -65903 -76601 -92623
23508 -92623 -82484 -64732 -63182 -51122 -60728 -29333 -4872 -39004 -65218 -2795 50932 -4612
23496 -4612 -22463 -25588 1457 12345 -10207 -18747 -36599 -5608 -44636 -23445 14293 -2059
23484 -2059 -26822 -52044 -71391 -10754 40394 -18530 -36505 -1416 31702 11814 -22618 -62259
23472 -62259 -71822 -88424 -75871 -43415 -10348 11950 -2090 -33215 1748 17745 37094 28521
$$ packed form
23558a0689K548k6367J1900N82j1555k2813K3528J9509P73L706M267n0058L601
23545e1068j3136k6435k802J1065J7316J2072J0504K6938J198r049k1484k39k3231
23532f8351O638J8465L1480J6003j5167j8243m787O427M1733L1765j0357J5199
23520E0805j1612K6366J882m6872M205J9433m5285m0851J3098l7072j0698j6022
23508i2623J0139J7752J550J2060r606L1395K4461l4132k6214O2423N3727n5544
23496d612j7851l125K7045J0888k2552q540j7852L0991l9028K1191L7738j6352
23484b059k4763k5222j9347O0637N1148n8924j7975L5089L3118j9888l4432l9641
23472f2259r563j6602J2553L2456L3067K2298j4040l1125L4963J5997J9349q573
$$ plain form
23460 28521 10673 7235 -2173 8116 16313 30922 3649 17695 33261 47353 82925 68257
23448 68257 87868 76854 45156 -13239 -38313 -21708 31374 45868 34927 81007 110315 116246
23436 116246 122688 95781 79690 -3571 -39409 -19248 -7964 -2140 13942 15287 17714 -9485
23424 -9485 -35924 -30841 29087 43936 24923 4703 56906 70442 53696 5081 -36621 -50308
23412 -50308 -35753 -60718 -55446 -18181 31601 46256 -488 10648 -1558 -7455 5912 12487
23400 12487 -17380 -48220 -27556 4851 11135 66683 104424 63182 52431 65216 73426 90382
23388 90382 65914 30316 27476 7876 -7988 -9693 7494 -25845 -55963 -31471 -3515 15773
23376 15773 59805 45208 16600 -18495 -17113 -6344 9352 -18870 -17616 -47214 -52223 -10533
$$ packed form
23460B8521j7848l438r408J0289Q197J4609k7273J4046J5566J4092L5572j4668
23448F8257J9611j1014l1698n8395k5074J6605N3082J4494j0941M6080K9308N931
23436A16246O442k6907j6091q3261l5838K0161J1284N824J6082J345K427k7199
23424i485k6439N083N9928J4849j9013k0220N2203J3536j6746m8615m1702j3687
23412e0308J4555k4965N272L7265M9782J4655m6744J1136j2206n897J3367O575
23400A2487k9867l0840K0664L2407O284N5548L7741m1242j0751J2785Q210J6956
23388I0382k4468l5598k840j9600j5864j705J7187l3339l0118K4492K7956J9288
23376A5773M4032j4597k8608l5095J382J0769J5696k8222J254k9598n009M1690
$$ plain form
23364 -10533 33747 39839 71343 133008 98247 36471 -7245 11385 44244 48912 -6912 -37712
23352 -37712 -33328 -7394 -10413 -40218 -81149 -76891 -57209 -15970 -7783 -12009 11482 3634 -2046
23339 -2046 -34029 18881 49972 24817 -6533 -14704 937 32942 -9840 -1639 38296 52371
23327 52371 69512 72541 42728 22446 15337 -13139 -1521 2647 18157 -449 26816 41003
23315 41003 64549 58762 82714 87370 45116 -7478 -87815 -99501 -65269 -30875 -59797 -61812
23303 -61812 -27247 -20237 9633 43339 47415 80591 90150 71413 37838 -21276 -42523 -34120
23291 -34120 -54221 -85329 -80240 -41658 -18039 -8715 -33939 -53492 -38521 -26927 -46903 -65166
23279 -65166 -72895 -75584 -64391 -40132 -40212 -16721 34642 29414 62154 71388 25099 -10805 -61905
$$ packed form
23364a0533M4280O092L1504O1665l4761o1776m3716J8630L2859M668n5824l0800
23352c7712M384K5934l019k9805m0931M258J9682M1239Q187m226K3491p848n680
23339b046l1983N2910L1091k5155l1350q171J5641L2005m2782Q201L9935J4075
23327E2371J7141L029k9813k0282p109k8476J1618M168J5510j8606K7265J4187
23315D1003K3546n787K3952M656m2254n2594q0337j1686L4232L4394k8922k015
23303f1812L4565P010K9870L3706M076L3176R559j8737l3575n9114k1247Q403
23291c4120k0101l1108N089L8582K3619R324k5224j9553J4971J1594j9976j8263
23279f5166p729k689J1193K4259q0K3491N1363n228L2740R234m6289l5904n1100
$$ plain form
23266 -61905 -72460 -37272 -12216 -20823 -63448 -78319 -47094 -24787 -41534 -63526 -59309 -58555
23254 -58555 -13843 -8252 22873 61295 22037 -26380 -16619 -30983 -25199 1483 21106 3895
23242 3895 -41455 -16594 24058 12158 -5379 -16375 -23035 -21704 -16192 -1577 873 -3810 -8346
23229 -8346 -27527 -70784 -55560 -38854 -51133 -51744 -20343 -9267 20656 -21189 -29696 -92
23217 -92 -24084 -43726 -51896 -67291 -35484 15442 -13389 -41177 -68088 -62086 -25803 2340 9669
23204 9669 7575 5766 -8018 471 -7768 -41895 -55441 -69004 -68855 -29892 -47724 -50335 -29085
23191 -29085 20529 -4564 -66599 -79397 -28726 20064 -3644 12884 24446 28643 51344 89009
23179 89009 102265 89364 69413 48152 -10288 -79495 -64070 -83447 -93881 -71883 -21617 25531
$$ packed form
23266f1905j0555L5188K5056q607m2625j4871L1225K2307j6747k1992M217P54
23254e8555M4712N591L1125L8422l9258m8417R761j4364N784K6682J9623j7211
23242C895m5350K4861M0652j1900j7537j0996o660J331N512J4615K450m683m536
23229h346j9181m3257J5224J6706j2279o11L1401J1076K9923m1845q507K9604
23217i2k3992j9642q170j5395L1807N0926k8831k7788k6911O002L6283K8143P329
23204I669k094j809j3784Q489q239l4127j3546j3563J49L8963j7832k611K1250
23191b9085M9614k5093o2035j2798N0671M8790k3708J6528J1562M197K2701L7665
23179H9009J3256j2901j9951k1261n8440o9207J5425j9377j0434K1998N0266M7148
$$ plain form
23167 25531 6003 27804 19034 31038 127 25585 17666 -9383 -26690 30223 53552 4721
23155 4721 21771 8313 -117 -7362 -46706 -46845 -40205 -14648 -38564 8333 18508 25045 6029
23142 6029 -28774 -15625 -12412 -9762 1919 8655 -14946 -25400 -24769 -40838 -35718 -48990 -77345
23129 -77345 -60902 -55961 -60013 -39540 -6957 7797 39389 -1062 -70246 -69921 -49792 5703
23117 5703 -19881 -30493 -31541 -17564 1882 -815 2450 -9896 18193 30245 2863 13397
23105 13397 14295 -36329 -22472 1176 -14268 -54974 -58476 -39612 -31800 -15342 34294 32111 -34517
23092 -34517 -55587 -26016 -28138 -30229 -31245 -27307 -27247 -15406 -4143 30640 34402 29299 14184
23079 14184 -17214 1011 3526 3923 -5652 -23161 -20538 -15295 -51125 -43402 6228 27049 37416
$$ packed form
23167B5531j9528K1801q770J2004l0911K5458p919k7049j7307N6913K3329m8831
23155D721J7050j3458q430p245l9344j39O640K5557k3916M6897J0175O537j9016
23142F029l4803J3149L213K650J1681O736k3601j0454O31j6069N120j3272k8355
23129g7345J6443M941m052K0473L2583J4754L1592m0451o9184L25K0129N5495
23117E703k5584j0612j048J3977J9446k697L265j2346K8089J2052k7382J0534
23105A3397Q98n0624J3857K3648j5444m0706l502J8864P812J6458M9636k183o6628
23092c4517k1070K9571k122k091j016L938O0J1841J1263L4783L762n103j5115
23079A4184l1398J8225K515L97r575j7509K623N243l5830P723M9630K0821J0367
$$ plain form
23066 37416 27982 7056 -10538 1229 4695 43146 59998 29059 32191 46858 36587 46250
23054 46250 58338 30807 16376 17793 -13348 -3958 -15458 -14839 -16022 -720 -7608 -31507 -46552
23041 -46552 9713 26686 7988 40580 55645 -17124 -29458 -65322 -56752 -2903 23079 11407
23029 11407 -20669 -53867 -27322 -12424 70118 98605 66284 24403 771 28281 798 -45451
23017 -45451 -34784 -32572 -33569 -2824 -18135 -25390 -6730 -75059 -108511 -57198 -10933 -26625
23005 -26625 -17748 -5206 11784 -36509 -44288 -12798 23854 28466 5933 -13666 -33093 -55351
22993 -55351 -44474 -28045 -33488 -26080 -8362 39619 45478 8401 -6120 15972 10590 10323 -1251
22980 -1251 -21066 -62462 -40169 4053 25631 7234 2625 -2860 13385 21841 70390 75270 13264
$$ packed form
23066C7416r434k0926j7594J1767L466L8451J6852l0939L132J4667j0271R663
23054D6250J2088k7531j4431J417l1141R390j1500O19j183J5302o888k3899j5045
23041d6552N6265J6973j8698L2592J5065p2769j2334l5864Q570N3849K5982j1672
23029A1407l2076l3198K6545J4898Q2542K8487l2321m1881k3632K7510k7483m6249
23017d5451J0667K212r97L0745j5311p255J8660o8329l3452N1313M6265j5692
23005b6625Q877J2542J6990m8293p779L1490L6652M612k2533j9599j9427k2258
22993e5351J0877J6429n443P408J7718M7981N859l7077j4521K2092n382k67j1574
22980a251j9815m1396K2293M4222K1578j8397m609n485J6245Q456M8549M880o2006
$$ plain form
22967 13264 -10425 -2531 -33145 -85977 -80824 -53240 -47479 -56993 -40968 -34131 -5243 -7168 -34030
22954 -34030 -60344 -25647 28482 20307 5425 -15441 7314 27155 48900 86128 72610 48550
22942 48550 9219 -8661 -44597 -35444 -3193 53132 53683 12698 -16429 -10576 -39410 -35197 33195
22929 33195 36511 -12482 -37061 -17491 20016 23903 1117 -18824 -24662 -60954 -79768 -65826
22917 -65826 -56623 -82584 -76427 -16063 26159 4141 -26512 -33228 -30440 8756 36785 72017
22905 72017 87298 56303 6589 -28077 -23167 -29250 -26915 -35968 -5209 28764 14046 17435 46334
22892 46334 -7675 -39243 -35798 3621 -15391 -30464 -41478 -52559 -21880 -11624 -19658 -59018
22880 -59018 -56799 -25116 28297 38233 51909 53831 31789 8466 -18150 -20985 -21013 -22393 -6278
$$ packed form
22967A3264k3689P894l0614n2832N153K7584N761r514J6025O837K8888j925k6862
22954c4030k6314L4697N4129q175j4882k0866K2755J9841K1745L7228j3518k4060
22942D8550l9331j7880l5936R153L2251N6325N51m0985k9127N853k8834M213O8392
22929C3195L316m8993k4579J9570L7507L887k2786j9941n838l6292j8814J3942
22917f5826R203k5961O157O0364M2222k2018l0653o716K788L9196K8029L5232
22905G2017J5281l0995m9714l4666M910o083K335r053L0759L3973j4718L389K8899
22892D6334n4009l1568L445L9419j9012j5073j1014j1081L0679J0256q034l9360
22880e9018K219L1683N3413R936J3676J922k2042k3323k6616k835k8j380J6115
$$ plain form
22867 -6278 -15190 -64725 -28134 -3973 -2175 22993 12873 -6866 -35807 -59745 -40374 -47287
22855 -47287 -23149 16271 -2539 -17806 -28337 -36806 -12839 -7568 -14449 -17500 -39467 4873
22843 4873 34896 4711 7968 -21067 -26826 9245 35102 9135 -22646 -56330 -95637 -65096
22831 -65096 -25288 -28847 -64185 -93248 -99956 -90373 -52626 -58369 -84626 -53377 -24615 9481
22819 9481 2693 -7247 -15651 -68300 -62169 -39440 -36429 -25941 -5007 -9774 -36734 -16847 -33278
22806 -33278 -9378 -1105 -42080 -28162 -9436 -4871 -16717 -20023 -1368 -13003 12445 -24652
22794 -24652 -34097 -34834 20467 31564 35193 -3275 5028 5378 20511 68667 82454 31476 11144
22781 11144 54810 83420 41666 12492 -1269 1328 -16315 -13419 -373 23567 70752 65803
$$ packed form
22867f278q912m9535L6591K4161J798K5168j0120j9739k8941k3938J9371o913
22855d7287K4138L9420j8810j5267j0531q469K3967N271o881l051k1967M4340
22843D873L0023l0185L257k9035n759L6071K5857k5967l1781l3684l9307L0541
22831f5096L9808l559l5338k9063o708R583L7747n743k6257L1249K8762L4096
22819I481o788r940q404n2649O131K2729L011J0488K0934m767k6960J9887j6431
22806c3278K3900Q273m0975J3918J8726M565j1846l306J8655j1635K5448l7097
22794b4652r445p37N5301J1097L629l8468Q303L50J5133M8156J3787n0978k0332
22781A1144M3666K8610m1754k9174j3761K597j7643K896J3046K3940M7185m949
$$ plain form
22769 65803 54513 47094 65996 69968 18287 8173 -1501 -12602 9552 -34017 -60778 -28408
22757 -28408 15439 -10539 -30680 -44063 -46217 -35713 -44979 -67727 -52923 -27497 11909 29052
22745 29052 -11545 -3741 11469 24685 26587 21342 36977 51219 40261 38417 15485 -6631
22733 -6631 -11118 -13560 -32591 -40885 -68659 -88494 -53758 -38294 -30531 -766 20290 4904 8426
22720 8426 19449 19366 29122 -6094 2293 1935 17968 -5391 -7055 -23048 24313 58373 58740 51302
22706 51302 28477 5165 -2003 -6959 -40130 -44281 -7720 3555 21946 8980 -26217 -38875
22694 -38875 -26091 -14737 -19945 -41166 4396 -4484 -14918 -10324 26254 18009 -14360 -12379 15396
22681 15396 7103 -18980 -29697 -19065 -37778 -47037 -7674 45900 4160 -36758 -63514 -96252
$$ packed form
22769F5803j1290p419J8902L972n1681j0114r674j1101K2154m3569k6761L2370
22757b8408M3847k5978k0141j3383k154J0504r266k2748J4804K5426L9406J7143
22745B9052m0597P804J5210J3216J902n245J5635J4242j0958j844k2932k2116
22733f631m487k442j9031q294k7774j9835L4736J5464P763K9765K1056j5386L522
22720H426J1023q3R756l5216Q387l58J6033k3359j664j5993M7361L4060L67p438
22706E1302k2825k3312p168m956l3171m151L6561J1275J8391j2966l5197j2658
22694c8875J2784J1354n208k1221M5562q880j0434M594L6578q245l2369J981K7775
22681A5396q293k6083j0717J0632j8713r259L9363N3574m1740m0918k6756l2738
$$ plain form
22669 -96252 -107629 -109616 -59567 22044 19563 -7251 32260 14536 -5862 -21222 -35617 -24242
22657 -24242 -43258 -35250 21155 74041 30840 19342 10475 -17232 -28709 -6077 8090 24791
22645 24791 28333 -3529 -31500 -38067 -49140 -39171 -47934 -38519 -22209 -45587 -78748 -58622 -10331
22632 -10331 20552 13421 12093 -2437 -3974 -15074 1456 20296 28319 -14615 -31107 -17314
22620 -17314 14248 30804 -10485 -50136 -18435 -1775 49031 58133 49119 52485 32009 1221
22608 1221 -20535 19031 56255 67522 35789 -37477 -106047 -55355 -14532 8158 35714 32138
22596 32138 21599 -9563 -7080 10163 -26747 -63232 -85608 -81856 -71604 -54305 -16818 9093
22584 9093 5778 -17616 -16979 -7570 -23746 -38647 19580 -540 -16710 -10349 -16111 -26578 -12888
$$ packed form
22669i6252j1377j987N0049Q1611k481k6814L9511j7724k0398j5360j4395J1375
22657b4242j9016Q008N6405N2886m3201j1498q867k7707j1477K2632J4167J6701
22645B4791L542l1862k7971o567j1073R969q763R415J6310k3378l3161K0126M8291
22632a0331L0883p131j328j4530j537j1100J6530J8840Q023m2934j6492J3793
22620a7314L1562J6556m1289l9651L1701J6660N0806R102r014L366k0476l0788
22608A221k1756L9566L7224J1267l1733p3266o8570N0692M0823K2690K7556l576
22596C2138j0539l1162K483J7243l6910l6485k2376L752J0252J7299L7487K5911
22584I093l315k3394O37R409j6176j4901N8227k0120j6170O361n762j0467J3690
$$ plain form
22571 -12888 -13687 -8742 -25318 -69863 -70307 -51970 -41312 -6225 -18780 31595 78809 58708 82279
22558 82279 71273 65611 59942 44289 59698 69932 59820 22656 -12739 -52005 -19580 9323
22546 9323 3932 16350 -7059 -13400 -30343 -41862 -58301 -45806 -54781 -54627 -31804 -22431 -13107
22533 -13107 -6138 15035 11093 -1498 8226 -24860 -24005 -22535 -28752 -13717 8903 85984 165443
22520 165443 142946 54407 24149 48734 29617 30346 12684 22141 -2219 -16836 -40470 -21808
22508 -21808 23285 21211 31414 -7967 -44686 -26655 5937 16486 6972 17092 32043 -3903
22496 -3903 -45931 -30316 -17854 3324 12063 -5429 -10937 -8619 -7125 -12029 -26325 -24584 -60602
22483 -60602 -54826 -17821 21013 1346 -26667 -57728 -44728 -33606 -33111 -18994 -38554 -65109
$$ packed form
22571a2888p99M945j6576m4545m44J8337J0658L5087j2555N0375M7214k0101K3571
22558H2279j1006n662n669j5653J5409J0234j0112l7164l5395l9266L2425K8903
22546I323n391J2418k3409o341j6943j1519j6439J2495q975J54K2823R373R324
22533a3107O969K1173l942j2591R724l3086Q55J470o217J5035K2620P7081P9459
22520A65443k2497q8539l0258K4585j9117P29j7662R457k4360j4617k3634J8662
22508b1808M5093k074J0203l9381l6719J8031L2592J0549r514J0120J4951l5946
22496c903m2028J5615J2462K1178Q739j7492n508K318J494m904j4296J741l6018
22483f0602N776L7005L8834j9667k8013l1061J3000J1122M95J4117j9560k6555
$$ plain form
22471 -65109 -24700 21474 -17787 -38107 -30016 -34886 -38887 -12362 -21307 11752 24672 16498 -4272
22458 -4272 -8640 3805 -16937 -32148 -35963 -2701 27228 29686 54249 18288 40747 27409
22446 27409 -26604 -32791 -13078 -10036 37207 45488 14009 14974 -7732 -25866 -28685 -21933 4856
22433 4856 29466 19026 -26152 -66172 -86830 -90943 -27699 -367 -9421 -16105 1580 42887
22421 42887 90431 93058 52832 31213 4529 -14451 -11780 -31201 -29403 2716 16652 8338
22409 8338 3224 34301 62469 67245 7170 -2084 826 -14078 28524 46183 40547 -23273 -17264
22396 -17264 3264 -35743 -102823 -63179 3108 -5540 3321 -4720 -13435 24442 38747 31064 29218
22383 29218 51627 46121 -1261 15351 23318 3923 -41558 -30803 -34863 -37446 -25504 -20768 -1866
$$ packed form
22471f5109M0409M6174l9261k0320Q091m870m001K6525q945L3059J2920q174k0770
22458d272m368J2445k0742j5211l815L3262K9929K458K4563l5961K2459j3338
22446B7409n4013o187J9713L042M7243Q281l1479R65k2706j8134k819O752K6789
22433D856K4610j0440m5178m0020k0658m113O3244K7332r054o684J7685M1307
22421D2887M7544K627m0226k1619k6684j8980K671j9421J798L2119J3936q314
22409H338n114L1077K8168M776o0075r254K910j4904M2602J7659n636o3820O009
22396a7264K0528l9007o7080L9644O6287q648Q861q041q715L7877J4305p683j846
22383B9218K2409n506m7382J6612P967j9395m5481J0755m060k583J1942M736J8902
$$ plain form
22370 -1866 -11746 -21356 -17229 -29600 -23460 -21539 -12817 -4208 -2677 31990 47608 56009 56688 33591
22356 33591 21987 21557 57425 49949 25129 -19229 12089 44958 63715 65945 59796 59110 64364
22343 64364 37513 24366 29742 33944 21769 -16410 -18181 -18422 -24403 -55172 -66264 -46881 -41670
22330 -41670 -16141 4739 29767 51917 55525 70206 72972 47715 70152 76104 59554 6815
22318 6815 -34842 -54291 -34603 -7225 -31103 -43055 -30064 -47578 -66305 -33673 13898 26570
22306 26570 7487 -21429 -53451 -25503 25696 45168 28877 9492 -8654 -23009 -41996 -44516
22294 -44516 -38541 -63840 -73414 -95606 -72113 -43669 -27422 13844 36402 30554 15965 -25882
22282 -25882 -12851 17693 12008 15947 -9619 -23592 -28050 -40194 -75497 -44887 -41928 -43164 -53007
$$ packed form
22370a866r880r610M127j2371O140J921Q722Q609J531L4667J5618Q401O79k3097
22356C3591j1604m30L5868p476k4820m4358L1318L2869J8757K230o149o86N254
22343F4364k6851j3147N376M202j2175l8179j771k41n981l0769j1092J9383N211
22330d1670K5529K0880K5028K2150L608J4681K766k5257K2437N952j6550n2739
22318F815m1657j9449J9688K7378k3878j1952J2991j7514j8727L2632M7571J2672
22306B6570j9083k8916l2022K7948N1199J9472j6291j9385j8146j4355j8987k520
22294d4516N975k5299r574k2192K3493K8444J6247M1266K2558n848j4589m1847
22282b5882J3031L0544n685L939k5566j3973m458j2144l5303L0610K959j236r843
$$ plain form
22269 -53007 -44273 -13809 -37222 -57509 -32960 -15300 -6451 3370 15325 29563 9227 -6870
22257 -6870 -39651 9116 4894 -16663 20291 50403 57462 49953 27638 21118 5228 -1310 10301
22244 10301 10969 22134 12419 38059 45529 2787 -31542 -43678 -7317 -980 -32519 -12682 960
22231 960 -17472 -48311 -49993 -17735 -2059 -31214 -25524 -37940 -84493 -110665 -65915 -59558 -106694
22218 -106694 -88607 -42409 -5581 25825 39634 14500 1607 -16398 -22125 21111 62340 63826
22206 63826 35076 7362 4802 2639 -28194 -14686 -20471 -54817 -42144 19021 66367 17135
22194 17135 44560 26990 5084 -3716 35906 7098 -4428 24912 17497 2334 -13378 -23593
22182 -23593 -17041 -10513 -43002 -74492 -46692 -24082 -7180 42219 39500 4541 -14966 8936
$$ packed form
22269e3007Q734L0464k3413k0287K4549J7660Q849R821J1955J4238k0336j6097
22257f870l2781M8767m222k1557L6954L0112P059p509k2315o520j5890o538J1611
22244A0301O68J1165r715K5640P470m2742l4329j2136L6361O337l1539J9837J3642
22231I60j8432l0839j682L2258J5676k9155N690j2416m6553k6172M4750O357m7136
22218a06694J8087M6198L6828L1406J3809k5134j2893j8005n727M3236M1229J486
22206F3826k8750k7714k560k163l0833J3508n785l4346J2673O1165M7346m9232
22194A7135K7425j7570k1906q800L9622k8808j1526K9340p415j5163j5712j0215
22182b3593O552O528l2489l1490K7800K2610J6902M9399k719l4959j9507K3902
$$ plain form
22170 8936 -9884 -5511 17286 28814 49360 22453 -36817 -45905 -25430 -35005 1068 16777
22158 16777 -1465 7828 17436 31716 -3776 -11528 33104 6382 1645 1340 9202 44802 12937
22145 12937 -30779 -26498 -37596 -51878 -63078 -63839 -45363 -34816 -25900 2452 -24604 -31154 139
22132 139 37935 -14872 -47793 -47631 -59819 -74171 -62509 -61230 -81550 -80048 -74627 -59051 -57613
22119 -57613 -73370 -62638 -11765 302 26177 28841 7068 834 5778 -52325 -52347 -37939 -23952
22106 -23952 -14466 -9356 -10776 -32922 -16433 -2521 -1359 -10653 1598 -22615 -44430 -27332 -16233
22093 -16233 31187 29115 53701 23944 -6929 -18418 30144 33440 -7135 -33355 -36176 -25183
22081 -25183 -9331 -16347 -22507 -14 22695 4844 1160 -20294 -24050 -5547 9978 -1917
$$ packed form
22170H936j8820M373K2797J1528K0546k6907n9270r088K0475r575L6073J5709
22158A6777j8242R293R608J4280l5492p752M4632k6722m737l05P862L5600l1865
22145A2937m3716M281j1098j4282j1200p61J8476J0547Q916K8352k7056o550L1293
22132A39L7796n2807l2921J62j2188j4352J1662J279k0320J502N421J5576J438
22119e7613j5757J0732N0873J2067K5875K664k1773o234M944n8103k2J4408J3987
22106b3952R486N110j420k2146J6489J3912J162r294J2251k4213k1815J7098J1099
22093a6233M7420k072K4586k9757l0873j1489M8562L296m0575k6220k821J0993
22081b5183J5852p016o160K2493K2709j7851l684k1454l756J8503J5525j1895
$$ plain form
22069 -1917 -11228 -25500 -22768 -45165 -23567 -9456 -40253 -71146 -36073 3095 968 17576
22057 17576 9589 -2132 13533 18822 -17376 -599 -14116 -42816 -66654 -91816 -44918 -17407
22045 -17407 13345 -949 18250 -4647 44336 72994 47876 4832 -22445 -23217 -60925 -51080
22033 -51080 -53348 -19192 19400 44581 47261 38659 -9490 -30548 -35686 15135 38903 4325
22021 4325 -24153 -68590 -25412 1267 -17869 -30109 -11844 -21089 -21156 -60702 -46501 -52366 -59148
22008 -59148 -2072 -5712 -25534 -20389 -39762 -72585 -66000 -69341 -20924 -27727 -48123 -26640 -21452
21995 -21452 -15322 -18001 -37438 -30378 -14347 -15511 -12685 20987 57861 48501 37647 32593 12040
21982 12040 -1638 -4220 4442 6331 3284 -13428 10701 6331 -17026 -3515 -11424 -32423 -5294
$$ packed form
22069a917r311j4272K732k2397K1598J4111l0797l0893L5073L9168k127J6608
22057A7576p987j1721J5665N289l6198J6777j3517k8700k3838k5162M6898K7511
22045a7407L0752j4294J9199k2897M8983K8658k5118m3044k7277p72l7708R845
22033e1080k268L4156L8592K5181K680q602m8149k1058n138N0821K3768l4578
22021D325k8478m4437M3178K6679j9136j2240J8265r245o7l9546J4201n865o782
22008e9148N7076l640j9822N145j9373l2823O585l341M8417o803k0396K1483N188
21995b1452O130k679j9437P060J6031j164K826L3672L6874r360j0854n054k0553
21982A2040j3678k582Q662J889l047j6712K4129m370k3357J3511p909k0999K7129
$$ plain form
21969 -5294 -17439 -31770 -46809 -60196 -74895 -67350 -69530 -20563 57436 47272 19171 9040
21957 9040 8841 30399 37820 78212 76869 55901 84468 82896 42657 7440 -22854 1945 -7258
21944 -7258 315 -11816 -14243 4094 -18966 -28003 -69974 -59786 -26715 6921 -10203 -22450
21932 -22450 1773 170 -24655 -40427 -8416 -8855 -17615 7572 36015 24385 14576 -15640 -39947
21919 -39947 -25668 -51014 -40708 6268 -38633 -49081 -44337 -69581 -90221 -45992 11235 63983
21907 63983 83482 74694 52769 56533 47246 -19289 1827 -4703 -33326 11930 25434 8765
21895 8765 -30207 -70326 -87789 -53989 -36793 -28006 -16084 3185 29340 -11774 -31200 15210
21883 15210 49577 2361 -16179 -36037 -46259 -45069 -21422 -17334 -26248 -12003 -607 -8782
$$ packed form
21969e294j2145j4331j5039j3387j4699P545k180M8967P7999j0164k8101j0131
21957I040j99K1558P421M0392j343k0968K8567j572m0239l5217l0294K4799r203
21944g258P573j2131k427J8337k3060r037m1971J0188L3071L3636j7124j2247
21932b2450K4223j603k4825j5772L2011m39q760K5187K8443j1630r809l0216k4307
21919c9947J4279k5346J0306M6976m4901j0448M744k5244k0640M4229N7227N2748
21907F3983J9499q788k1925L764r287o6535K1116o530k8623M5256J3504j6669
21895H765l8972m0119j7463L3800J7196Q787J1922J9269K6155m1114j9426M6410
21883A5210L4367m7216j8540j9858j0222J190K3647M088q914J4245J1396q175
$$ plain form
21871 -8782 -8011 97 -9979 -25155 -42596 -44844 -45897 -66057 -52366 -58769 -111139 -106793 -68749
21858 -68749 -28277 18717 15261 13994 17021 -29334 -45930 -14352 -8481 -7015 5464 38223 76246
21845 76246 77380 7410 -26360 -20020 -8367 1859 39217 29262 5993 14080 32779 27925 9178
21832 9178 1230 6441 -4236 36187 30700 25715 28653 10937 -2916 -47890 -61809 -67432 -54392
21819 -54392 -77407 -80436 -41502 -41683 -50668 -57896 -52482 -57171 -96029 -94442 -44794 -65966 -86692
21806 -86692 -78917 -12390 17015 73951 64426 7127 -41477 -29031 3911 24212 31366 -7222
21794 -7222 -21733 -2546 11840 23046 23883 32169 33028 24015 29891 22660 71897 24995 34868 104665
21780 104665 100676 34880 -5966 -23397 -8201 -41012 -7378 12878 29136 25878 8633 -22839
$$ packed form
21871h782P71Q108j0076j5176j7441k248j053k0160J3691o403n2370M346L8044
21858f8749M0472M6994l456j267L027m6355j6596L1578N871J466J2479L2759L8023
21845G6246J134o9970l3770O340J1653J0226L7358r955k3269Q087J8699m854j8747
21832I178p948N211j0677M0423n487m985K938j7716j3853m4974j3919n623J3040
21819e4392k3015l029L8934j81q985p228N414m689l8858J587M9648k1172k0726
21806h6692P775O6527K9405N6936r525n7299m8604J2446L2942K0301P154l8588
21794g222j4511J9187J4386J1206Q37Q286Q59r013N876p231M9237m6902R873O9797
21780A04665l989o5796m0846j7431J5196l2811L3634K0256J6258l258j7245l1472
$$ plain form
21768 -22839 -14584 25483 49956 39101 30916 24961 19800 13605 -3281 7284 -5900 -38915 -81195
21755 -81195 -60954 -38480 -27799 -31016 -36007 -53892 -43447 -26386 -4522 30859 31582 60695
21743 60695 61542 35521 -22281 -75895 -90159 -71992 -60635 8897 47407 24271 -13459 -86260
21731 -86260 -121092 -76215 -27817 -28376 -24566 -16176 -33682 -32545 -33150 -17677 43358 -4424 -27015
21718 -27015 -57011 -64575 -50011 -15671 12195 -18475 -14132 -11624 -5924 6833 54395 30282
21706 30282 29739 73315 64161 38239 17007 21751 -24967 -44416 -29626 17998 4114 13713 20890
21693 20890 2385 -46632 -23843 20339 42582 20253 -2738 -32675 -58767 -62018 7009 -6238
21681 -6238 -21863 -24107 5572 37508 35222 10704 33658 42201 24474 55203 26811 -34591
$$ packed form
21768b2839Q255M0067K4473j0855q185n955n161o195j6886J0565j3184l3015m2280
21755h1195K0241K2474J0681l217m991j7885J0445J7061K1864L5381P23K9113
21743F0695Q47k6021n7802n3614j4264J8167J1357O9532L8510k3136l7730p2801
21731h6260l4832M4877M8398n59L810Q390j7506J137o05J5473O1035m7782k2591
21718b7015k9996p564J4564L4340K7866l0670M343K508N700J2757M7562k4113
21706C0282n43M3576r154k5922k1232M744m6718j9449J4790M7624j3884R599P177
21693B0890j8505m9017K2789M4182K2243k2329k2991k9937k6092l251O9027j3247
21681f238j5625k244K9679L1936k286k4518K2954Q543j7727L0729k8392o1402
$$ plain form
21669 -34591 -70924 -85309 -45046 -21613 2853 -24428 -991 35373 59340 93518 143580 83368
21657 83368 19326 -30656 -32388 -35277 -49095 -90994 -113309 -84199 -71665 -5958 18365 -2317
21645 -2317 -32722 -83043 -86468 -51810 -44021 -40174 -58215 -17236 -26815 -31180 -26604 -13496 12377
21632 12377 4629 -10701 20775 -22382 -31974 -22868 -14491 -22602 -22670 -36939 -20157 24790 78394
21619 78394 50465 -2935 19813 74629 101395 97368 91877 100137 135358 102047 65224 53795
21607 53795 55750 35073 52182 72448 38259 14158 45446 34554 33037 62687 58074 -2127
21595 -2127 -44328 -45222 -16807 30629 46290 34556 15621 19531 16792 -5895 -26918 -5811 21528
21582 21528 -13543 -48813 -49911 -65661 -51668 -42254 -16344 6549 -5322 -21309 -32420 -34872
$$ packed form
21669c4591l6333j4385M0263K3433K4466k7281K3437L6364K3967L4178N0062o0212
21657H3368o4042m9982j732k889j3818m1899k2315K9110J2534O5707K4323k0682
21645b317l0405n0321l425L4658P789L847j8041M0979r579m365M576J3108K5873
21632A2377p748j5330L1476m3157r592R106Q377q111o8j4269J6782M4947N3604
21619G8394k7929n3400K2748N4816K6766m027n491Q260L5221l3311l6823j1429
21607E3795J955k0677J7109K0266l4189k4101L1288j0892j517K9650m613o0201
21595b127m2201q94K8415M7436J5661j1734j8935L910k739k2687k1023K1107K7339
21582B1528l5071l5270j098j5750J3993R414K5910K2893j1871j5987j1111k452
$$ plain form
21570 -34872 -8479 -8271 -15450 -51610 -40565 -51879 -55221 -19534 2416 -5078 3848 -4165 -13582
21557 -13582 -33116 -37746 -42604 -34105 -35241 -1895 -14557 5727 20212 11645 14513 40492 2004
21544 2004 -44630 -79325 -92648 -72062 -72929 -68387 -87417 -110557 -87681 -55050 -56521 -76270 -110866
21531 -110866 -86643 -51144 -44291 -17973 -16952 -35913 -57189 -57026 -49948 1791 14687 -2437
21519 -2437 -6658 -18536 20062 9601 -14356 -32310 12443 27712 -873 -14725 6774 -9803
21507 -9803 -7401 59238 51306 7430 -62848 -69630 -27578 -2194 7285 -45975 -69731 -21386 19879
21494 19879 38611 36662 27392 38799 31906 34128 10979 2977 24964 36421 44952 43992 23749
21481 23749 -15617 -39272 10042 -20232 -62286 -40054 -43706 -22526 -27136 -9830 -15973 -11169
$$ packed form
21570c4872K6393K08p179l6160J1045j1314l342L5687K1950p494Q926q013r417
21557a3582j9534m630m858Q499j136L3346j2662K0284J4485q567K868K5979l8488
21544B004m6634l4695j3323K0586q67M542j9030k3140K2876L2631j471j9749l4596
21531a10866K4223L5499O853K6318J021j8961k1276J63P078N1739J2896j7124
21519b437m221j1878L8598j0461k3957j7954M4753J5269k8585j3852K1499j6577
21507i803K402O6639p932m3876p0278o782M2052K5384R479n3260k3756M8345M1265
21494A9879J8732j949r270J1407o893K222k3149q002K1987J1457Q531r60k0243
21481B3749l9366k3655M9314l0274m2054K2232l652K1180m610J7306o143M804
$$ plain form
21469 -11169 27183 24141 4547 -9366 -14561 -11700 -18623 -7261 17417 25946 13474 21479 11018
21456 11018 4880 28190 -3077 12525 1865 34418 54782 23840 -18456 -24058 -13620 -6073
21444 -6073 -52682 -45365 -6763 21999 -957 3306 19383 13610 -32698 18176 58489 67855 38682
21431 38682 34633 45692 21405 -47608 -104911 -99122 -84962 -50462 -36147 -36647 -61576 -66175 -49975
21418 -49975 -6900 5631 -7588 -15055 -14676 -25298 9930 37052 35793 67362 81439 48747
21406 48747 52893 29430 -4734 4726 16136 34080 26567 16650 20528 11348 5544 8269 3220
21393 3220 -21970 -38741 -71215 -71802 -50694 -2116 -15075 -58688 -98564 -47064 -6617 -13686
21381 -13686 -6313 -50879 -65353 -7211 6150 -22096 -17104 -47774 -43658 -26360 -29151 -46895
$$ packed form
21469a1169L8352l042j9594j3913n195K861o923J1362K4678Q529j2472Q005j0461
21456A1018o138K3310l1267J5602j0660L2553K0364l0942m2296n602J0438P547
21444f073m6609P317L8602K8762k2956M263J6077n773m6308N0874M0313R366k9173
21431C8682m049J1059k4287o9013n7303N789J4160L4500J4315n00k4929m599J6200
21418d9975M3075J2531j3219p467L79j0622L5228K7122j259L1569J4077l2692
21406D8747M146k3463l4164R460J1410J7944p513r917L878r180n804K725n049
21393C220k5190j6771l2474n87K1108M8578j2959m3613l9876N1500M0447p069
21381a3686P373m4566j4474N8142J3361k8246M992l0670M116J7298k791j7744
$$ plain form
21369 -46895 -35052 16580 26674 36123 4040 -12366 -25585 -44024 -23710 8709 26029 26884
21357 26884 2872 -10140 15415 9871 -15448 -32810 11833 48916 58976 28370 30131 36699
21345 36699 37905 9795 18142 17799 17351 27958 14268 16290 60169 71946 61686 40830 14784
21332 14784 9509 53008 16895 -5510 -7463 -27557 -28703 -59440 -25456 12247 -18392 11012
21320 11012 27056 3556 -4250 19503 47899 40004 28765 -4986 1566 3097 11997 29305 21458
21307 21458 52508 85567 42331 -16877 14043 15491 6018 -16538 -59294 -59796 -52480 -75371 -51654
21294 -51654 -16882 -31740 -66368 -35497 13630 13352 -19880 -16783 -11150 -4702 -27710 -31015 -34950
21281 -34950 -28904 -44586 -54509 -43174 -38069 -41789 -29626 -46180 -55122 -34363 -31667 -23012 -29228
$$ packed form
21369d6895J1843N1632J0094R449l2083j6406j3219j8439K0314L2419J7320Q55
21357B6884k4012j3012K5555n544k5319j7362M4643L7083J0060l0606J761O568
21345C6699J206k8110Q347l43m48J0607j3690K022M3879J1777j0260k0856k6046
21332A4784n275M3499l6113k2405j953k0094j146l0737L3984L7703l0639K9404
21320A1012J6044k3500p806K3753K8396p895j1239l3751O552J531Q900J7308p847
21307B1458L1050L3059m3236n9208L0920J448r473k2556m2756n02P316k2891K3717
21294e1654L4772j4858l4628L0871M9127k78l3232L097N633O448k3008l305l935
21281c4950O046j5682r923J1335N105l720J2163j6554q942K0759K696Q655o216
$$ plain form
21268 -29228 -13274 -19192 -25227 -26942 -72411 -97953 -56695 10986 31688 5223 -63275 -38056
21256 -38056 11665 -8190 -25894 -6974 -25862 -26663 5542 -30466 -53664 6571 29202 19366
21244 19366 5463 5466 -17682 4656 12839 -35756 -62002 -38847 -27526 -11205 30431 54910 100604
21231 100604 117225 79727 46092 15482 -50724 -43202 -27599 -43358 -12823 3739 36773 30506
21219 30506 7633 -238 13813 3786 6904 7715 -12350 -19699 -8844 42517 50968 49762 40776
21206 40776 3149 -33735 -16276 -9819 -37677 -2377 35666 52802 31693 -4065 -1996 -16223
21194 -16223 -22692 -12227 -41919 -55024 -14739 23387 56252 56781 33533 21711 -20012 -26540
21182 -26540 -2586 26026 63838 67998 60057 59673 53650 1604 -3934 38006 17458 5522 -14241
$$ packed form
21268b9228J5954n918o035j715m5469k5542M1258O7681K0702k6465o8498K5219
21256c8056M9721j9855j7704J8920j8888q01L2205l6008k3198O0235K2631r836
21244A9366j3903Lk3148K2338Q183m8595k6246K3155J1321J6321M1636K4479M5694
21231A00604J6621l7498l3635l0610o6206P522J5603j5759L0535J6562L3034o267
21219C0506k2873p871J4051j0027L118Q11k0065p349J0855N1361Q451j206q986
21206D0776l7627l6884J7459O457k7858L5300L8043J7136k1109l5758K069j4227
21194a6223o469J0465k9692j3105M0285L8126L2865N29k3248j1822m1723o528
21182b6540K3954K8612L7812M160p941l84o023n2046n538M1940k0548j1936j9763
$$ plain form
21169 -14241 -7992 -12685 11834 58955 20808 -486 -5980 18910 37376 56952 39586 11450
21157 11450 -16139 -3527 27299 36223 19671 9316 48847 38803 33048 88586 100780 69021
21145 69021 67055 108148 151489 206652 206256 223446 293206 368785 444834 497164 557853 623364
21133 623364 677204 683383 665451 700589 743018 763194 725070 714014 669154 634371 688750 734135
21121 734135 709191 686252 692962 666410 682525 668406 566271 471270 403324 321726 316296 280908
21109 280908 233405 199969 188189 166204 114663 90145 66587 20039 3589 -7887 -9499 -34195
21097 -34195 -50623 -39008 -25869 -23516 4645 44575 19179 1379 -3467 8837 -7326 36098
21085 36098 92155 101749 89331 48043 41161 5917 -23820 -47865 -75562 -83510 -121049 -160654
$$ packed form
21169a4241O249m693K4519M7121l8147k1294n494K4890J8466J9576j7366k8136
21157A1450k7589J2612L0826Q924j6552j0355L9531j0044n755N5538J2194l1759
21145F9021j966M1093M3341N5163l96J7190O9760P5579P6049N2330O0689O5511
21133F23364N3840O179j7932L5138M2429K0176l8124j1056m4860l4783N4379M5385
21121G34135k4944k2939O710k6552J6115j4119j02135r5001o7946q1598n430l5388
21109B80908m7503l3436j1780k1985n1541k4518k3558m6548j6450j1476j612k4696
21097c4195j6428J1615J3139K353K8161L9930k5396j7800m846J2304j6163M3424
21085C6098N6057R594j2418m1288o882l5244k9737k4045k7697p948l7539l9605
$$ plain form
21073 -160654 -161950 -92838 -23841 25077 -771 -40968 -8393 17052 17356 7176 29059 10081
21061 10081 14468 3880 9947 24191 20816 39408 38573 48411 43242 8674 -24478 953 39834
21048 39834 32867 -22371 -42292 4474 30264 42304 82645 69846 53608 37607 29448 41448
21036 41448 25708 42143 38837 2773 -21134 -37568 -36254 -36213 -20001 6978 -2665 -2368 -24479
21023 -24479 -51352 -38667 -30290 -18453 -3457 15181 16675 6103 -11523 -2779 -33 -17739
21011 -17739 -9476 46868 60049 35783 2657 -13435 -40444 -15486 12863 33917 19277 -12098
20999 -12098 -44827 -54617 -45099 -25527 -44252 -63420 -41638 -14397 -38683 -32543 -44576 -15500
20987 -15500 -600 -1597 -10676 -1715 -3470 -6488 -5144 -9949 -16493 -12084 -25977 -3740 -11056 1465
$$ packed form
21073a60654j296O9112O8997M8918k5848m0197L2575K5445L04j0180K1883j8978
21061A0081M387j0588O067J4244l375J8592q35R838n169l4568l3152K5431L8881
21048C9834o967n5238j9921M6766K5790J2040M0341j2799j6238j6001q159J2000
21036D1448j5740J6435l306l6064k3907j6434J314M1J6212K6979r643K97k2111
21023b4479k6873J2685Q377J1837J4996J8638J494j0572j7626Q744K746j7706
21011a7739Q263N6344J3181k4266l3126j6092k7009K4958K8349K1054j4640l1375
20999a2098l2729r790R518J9572j8725j9168K1782K7241k4286O140j2033K9076
20987a5500J4900r97r079Q961j755l018J344m805o544M409j3893K2237p316J2521
$$ plain form
20973 1465 56368 55520 41303 24583 62162 49086 76306 60263 13823 -7324 20433 18780
20961 18780 16144 2593 -40640 -56917 -28022 -5575 -20031 6321 52825 43993 49165 114
20949 114 -28106 -43584 -52111 -11306 2181 -63564 -94620 -69934 -11743 8218 31975 28708
20937 28708 -18972 12216 77981 58391 36155 29146 -2892 -11650 -25873 -14891 6507 -14490
20925 -14490 7495 24895 38879 47573 35861 21271 3002 19167 52915 70633 64019 78745
20913 78745 59486 33092 17206 -4129 -35870 -28314 13748 35017 -5838 -42503 -56198 -17927
20901 -17927 3646 2828 20249 9309 12301 -18190 -49452 -28333 38631 74721 57220 63357
20889 63357 69818 22204 -7562 -27712 -22720 5373 10745 12082 1071 -7561 32186 27118 44645
$$ packed form
20973A465N4903q48j4217j6720L7579j3076K7220j6043m6440k1147K7757j653
20961A8780k636j3551m3233j6277K8895K2447j4456K6352M6504q832N172m9051
20949A14k8220j5478q527M0805J3487o5745l1056K4686N8191J9961K3757l267
20937B8708m7680L1188O5765j9590k2236p009l2038q758j4223J0982K1398k0997
20925a4490K1985J7400J3984Q694j1712j4590j8269J6165L3748J7718o614J4726
20913G8745j9259k6394j5886k1335l1741P556M2062K1269m0855l6665j3695L8271
20901a7927K1573q18J7421j0940K992l0491l1262K1119O6964L6090j7501O137
20889F3357O461m7614k9766k0150M992K8093N372J337j1011q632L9747n068J7527
$$ plain form
20876 44645 68539 61942 56586 43097 49326 73628 73793 31036 -10094 -5080 -4812 -65642 -13094
20863 -13094 18851 10229 21305 51245 55196 60238 42145 12498 43159 31383 -2467 -23518
20851 -23518 2630 25102 19290 9054 -15296 -20626 -21005 8433 30938 19060 76085 39822
20839 39822 36048 34407 7936 -12458 -15151 23281 22898 21316 60724 98935 103325 70802 63755
20826 63755 22407 -13922 15507 45580 30414 35960 68780 122618 86186 31024 46163 65071
20814 65071 30133 39530 65626 47791 65482 95680 110986 109425 151365 147549 180336 222559
20802 222559 197580 158770 118822 111926 123060 111909 83445 116757 110640 105162 145108 175111
20790 175111 193635 233705 186863 172226 131679 129778 116751 101529 100264 132410 115813 86473
$$ packed form
20876D4645K3894o597n356j3489O229K4302J65m2757m1130N014K68o0830N2548
20863a3094L1945q622J1076K9940L951N042j8093k9647L0661j1776l3850k1051
20851b3518K6148K2472n812j0236k4350n330l79K9438K2505j1878N7025l6263
20839C9822l774j641k6471k0394k693L8432l83j582L9408L8211M390l2523p047
20826F3755m1348l6329K9429L0073j5166N546L2820N3838l6432n5162J5139J8908
20814F5071l4938R397K6096j7835J7691L0198J5306j561M1940l816L2787M2223
20802B22559k4979l8810l9948o896J1134j1151k8464L3312o117n478L9946L0003
20790A75111J8524M0070m6842j4637m0547j901j3027j5222j265L2146j6597k9340
$$ plain form
20778 86473 60801 78630 77036 64977 70056 128965 141300 178528 181305 145489 137549 105926
20766 105926 127867 93413 71501 69205 52215 64035 92554 97600 43057 32143 22657 41984
20754 41984 60208 69797 57280 48668 47206 69063 93797 123119 88196 63090 88268 123699
20742 123699 132005 125009 124875 119719 95212 118142 125135 118669 101595 97845 78500 50380 112406
20729 112406 115051 107747 145143 135767 137762 161421 159674 128055 107892 62402 54834 89299 113323
20716 113323 86453 78790 60569 53706 50889 51201 103781 92958 78794 108211 94231 62669
20704 62669 92678 109916 139170 123640 137620 159897 143608 138063 141687 127570 95987 73357
20692 73357 86796 99114 105450 131489 169452 166351 131441 116679 86750 123341 151635 150732
$$ packed form
20778H6473k5672J7829j594j2059N079N8909J2335L7228K777l5816p940l1623
20766A05926K1941l4454k1912k296j6990J1820K8519N046n4543j0914r486J9327
20754D1984J8224R589j2517q612j462K1857K4734K9322l4923k5106K5178L5431
20742A23699Q306o996j34n156k4507K2930O993o466j7074l750j9345k8120O2026
20729A12406K645p304L7396r376J995K3659j747l1619k0163m5490p568L4465K4024
20716A13323k6870p663j8221o863k817L12N2580j0823j4164K9417j3980l1562
20704F2669L0009J7238K9254j5530J3980K2277j6289n545L624j4117l1583k2630
20692G3357J3439J2318O336K6039L7963l101l4910j4762k9929L6591K8294r03
$$ plain form
20680 150732 147446 153799 144168 168974 176485 221865 232190 217725 209432 179969 115813 133433
20668 133433 128797 149745 190078 169753 126035 109786 102551 128139 92416 115969 124143 141573
20656 141573 143396 104356 110884 124738 106190 121981 94830 105175 152605 154963 153811 126148
20644 126148 147172 177601 160511 116064 66654 74381 101103 162290 182393 222411 270965 303073
20632 303073 284743 244230 204356 218468 235117 311474 338463 319066 300988 255015 244256
20621 244256 266401 306724 327579 343611 344290 351979 352091 362004 378263 396146 418361 407308 384773
20608 384773 402743 462769 498478 501684 529484 522551 516852 503584 551715 596354 678812 761775
20596 761775 838629 884573 1019924 1121260 1181131 1249021 1413079 1612831 1759749 1884341
$$ packed form
20680A50732l286O353r631K4806P511M5380J0325j4465q293k9463o4156J7620
20668A33433m636K0948M0333k0325m3718j6249p235K5588l5723K3553Q174J7430
20656A41573J823l9040O528J3854j8548J5791k7151J0345M7430K358j152k7663
20644A26148K1024L0429j7090m4447m9410P727K6722O1187K0103M0018M8554L2108
20632C03073j8330m0513l9874J4112J6649P6357K6989j9397j8078m5973j0759
20621B44256K2145M0323K0855J6032O79P689J12R913J6259J7883K2215j1053k2535
20608C84773J7970O0026L5709L206K7800o933n699j3268M8131M4639Q2458Q2963
20596G61775P6854M5944J35351J01336N9871O7890J64058J99752J46918J24592
$$ plain form
20586 1884341 1950141 2047354 2187789 2351116 2468192 2558075 2629027 2764057 2974736 3240239
20576 3240239 3554304 3873399 4129602 4408893 4697966 5046619 5443412 5820067 6202928
20567 6202928 6694017 7377361 8285330 9542717 11252151 13651351 17139048 22228162 29266333
20558 29266333 38015673 47207264 55860349 64992257 77183973 93065890 108336579 116957814
20550 116957814 118357733 118721491 123584525 131309890 135797958 133917344 128517700 123914602
20542 123914602 122421294 124914493 131007084 136940458 137477933 131939710 125747368 123883581
20534 123883581 124243420 120189773 108415924 92648822 78305484 66974359 57052831
20527 57052831 47251562 37885717 29920142 23967516 19807409 16771960 14526068 12787005
$$ packed form
20586A884341O5800R7213J40435J63327J17076Q9883P0952J35030K10679K65503
20576C240239L14065L19095K56203K79291K89073L48653L96793L76655L82861
20567F202928M91089O83344R07969J257387J709434K399200L487697N089114P038171
20558B9266333Q749340R191591Q653085R131908J2191716J5881917J5270689Q621235
20550A16957814J399919L63758M863034P725365M488068j880614n399644m603098
20542A23914602j493308K493199O092591N933374N37475n538223o192342j863787
20534A23883581L59839m053647j1773849j5767102j4343338j1331125r921528
20527E7052831r801269r365845p965575n952626m160107l035449k245892j739063
$$ plain form
20519 12787005 11384080 10273909 9396584 8679940 8004333 7346428 6700293 6171394 5735099
20510 5735099 5375911 5077862 4688978 4280636 3961133 3705972 3482333 3298830 3146458
20501 3146458 2992886 2838520 2682578 2539119 2463115 2366643 2174108 1962409 1800385 1704830
20491 1704830 1566066 1431525 1339818 1257131 1204831 1118212 1028257 1020885 995605 940015 876467
20480 876467 852368 820424 791258 725422 680675 660875 610580 605396 574162 544230 566293 642836
20468 642836 626744 588859 553062 534544 488093 436224 413134 425418 458113 479406 475278 428214
20456 428214 394568 416932 398358 378159 379465 434165 429746 419143 446040 457618 443871 447268
20444 447268 395124 383643 393858 410144 418261 451355 447754 417458 443746 468343 494088 476062
$$ packed form
20519A2787005j402925j110171q77325p16644o75607o57905o46135n28899m36295
20510E735099l59188k98049l88884m08342l19503k55161k23639j83503j52372
20501C146458j53572j54366j55942j43459p6004r6472j92535k11699j62024r5555
20491A704830j38764j34541r1707q2687n2300q6619q9955p372k5280n5590o3548
20480H76467k4099l1944k9166o5836m4747j9800n0295n184l1234k9932K2063P6543
20468F42836j6092l7885l5797j8518m6451n1869k3090J2284L2695K1293m128m7064
20456D28214l3646K2364j8574k0199J306N4700m419j0603K6897J1578j3747L397
20444D47268n2144j1481J0215J6286Q117L3094l601l0296K6288K4597K5745j8026
$$ plain form
20432 476062 460532 525272 597116 671999 767283 887061 1029773 1149444 1266502 1330238 1281038
20421 1281038 1196864 1088430 918595 748530 648142 552641 484788 373105 331286 323483
20411 323483 314216 295438 243822 248202 222629 193626 210348 222457 210357 156761 153503 189127
20399 189127 223816 169986 216530 243706 200751 187200 192481 162143 162448 174937 170276 142944
20387 142944 157465 224407 212634 164181 162707 89209 61628 119165 117490 109648 105875 85398
20375 85398 89531 73530 83848 78279 55269 96817 109549 92900 89831 59719 53405 39889
20363 39889 29805 27963 31691 52093 110022 131556 101508 76187 66454 74306 49139 80936
20351 80936 100637 134049 137488 80283 42913 11740 31177 41333 73883 94010 117565 126694
$$ packed form
20432D76062j5530O4740P1844P4883R5284J19778J42712J19671J17058O3736m9200
20421A281038q4174j08434j69835j70065j00388r5501o7853j11683m1819p803
20411C23483r267j8778n1616M380k5573k9003J6722J2109j2100n3596l258L5624
20399A89127L4689n3830M6544K7176m2955j3551N281l0338L05J2489m661k7332
20387A42944J4521O6942j1773m8453j474p3498k7581N7537j675p842l773k0477
20375H5398M133j6001J0318n569k3010M1548J2732j6649l069l0112o314j3516
20363C9889j0084j842L728K0402N7929K1534l0048k5321r733P852k5167L1797
20351H0936J9701L3412L439n7205l7370l1173J9437J0156L2550K0127K3555R129
$$ plain form
20339 126694 99391 119732 136701 129429 74254 48878 72569 88613 74116 111514 105955 82229
20327 82229 82747 127512 122053 108431 61704 65573 88354 69943 24311 2123 8158 22890 48319
20314 48319 77206 66026 24929 -27355 -16075 15464 56063 79214 76590 91841 57892 35692
20302 35692 44817 53367 66108 92102 109267 100535 56844 63914 95085 105032 79430 98568 103204
20289 103204 84726 88350 106057 80737 98462 109605 66121 45171 50771 61021 93666 117520
20277 117520 115203 113782 106226 74478 54073 87281 119140 136666 152181 157198 114524 81892
20265 81892 28799 -963 -40381 -46180 -9945 9338 58696 109188 148478 149335 109329 40762
20253 40762 25406 53740 137569 153622 136360 158287 151678 142990 119439 138165 126774 52926
$$ packed form
20339A26694k7303K0341J6969p272n5175k5376K3691J6044j4497L7398n559k3726
20327H2229N18M4765n459j3622m6727L869K2781j8411m5632k2188O035J4732K5429
20314D8319K8887j1180m1097n2284J1280L1539M0599K3151k624J5251l3949k2200
20302C5692R125Q550J2741K5994J7165q732m3691P070L1171R947k5602J9138M636
20289A03204j8478L624J7707k5320J7725J1143m3484k0950N600J0250L2645K3854
20277A17520k317j421p556l1748k0405L3208L1859J7526J5515N017m2674l2632
20265H1892n3093k9762l9418n799L6235J9283M9358N0492L9290Q57m0006o8567
20253D0762j5356K8334Q3829J6053j7262K1927o609q688k3551J8726j1391p3848
$$ plain form
20241 52926 -2369 16061 66778 60259 98013 69140 41070 43271 -10121 -2475 55825 86213
20229 86213 120037 117077 116325 74722 99198 100063 109765 79668 80698 74566 141334 120061 77291
20216 77291 73413 109718 97280 75355 118378 141521 171027 237304 315425 337745 314937 270462
20204 270462 237197 225556 206846 219066 188460 153055 143639 145424 178992 167103 176227 182117
20192 182117 138484 135803 160365 113727 112116 159324 157347 152329 128936 55203 39960 100277
20180 100277 90935 78866 96272 101083 98114 53808 87862 121595 117981 79841 64156 98832
20168 98832 113477 104708 95378 80772 72654 57622 34819 14297 -6256 -33745 -24193 66671
20156 66671 87025 46788 44372 23363 -1067 -52649 -90724 -27080 57733 148324 199665 185133
$$ packed form
20241E2926n5295J8430N0717o519L7754k8873k8070K201n3392P646N8300L0388
20229H6213L3824k960p52m1603K4476Q65R702l0097J030o132O6768k1273m2770
20216G7291l878L6305j2438k1925M3023K3143K9506O6277P8121K2320k2808m4475
20204B70462l3265j1641j8710J2220l0606l5405r416J785L3568j1889R124N890
20192A82117m3633k681K4562m6638j611M7208j977n018k3393p3733j5243O0317
20180A00277r342j2069J7406M811k969m4306L4054L3733l614l8140j5685L4676
20168I8832J4645q769r330j4606q118j5032k2803k0522k0553k7489R552R0864
20156F6671K0354m0237k416k1009k4430n1582l8075O3644Q4813R0591N1341j4532
$$ plain form
20144 185133 199261 215237 232251 237864 213575 202561 152482 101344 90468 93899 30516 11589
20132 11589 13308 -18801 -21154 32607 102252 140206 146733 126909 82126 106568 118616 104685
20120 104685 92947 156400 143426 112921 80202 20829 29629 32425 45401 60837 70738 79067
20108 79067 77553 69273 105322 103478 108171 112420 127622 164103 177626 218586 239572 196206 167051
20095 167051 133107 133202 134422 145696 142276 176909 235102 238308 226068 198783 224174 229667 253784
20082 253784 226839 161178 164693 214568 236168 277313 302602 289746 255013 181778 161737 108650
20070 108650 136954 162855 164016 127303 90359 112005 138341 102005 73870 84074 93014 112903
20058 112903 88682 62429 7741 3364 46885 83852 145875 227622 286356 357319 342105 334443
$$ packed form
20144A85133J4128J5976J7014N613k4289j1014n0079n1138j0876L431o3383j8927
20132A1589J719l2109k353N3761O9645L7954O527j9824m4783K4442J2048j3931
20120A04685j1738O3453j2974l0505l2719n9373Q800K796J2976J5436R901Q329
20108G9067j514q280L6049j844M693M249J5202L6481J3523M0960K0986m3366k9155
20095A67051l3944R5J220J1274l420L4633N8193L206j2240k7285K5391N493K4117
20082B53784k6945o5661L515M9875K1600M1145K5289j2856l4733p3235k0041n3087
20070A08650K8304K5901J161l6713l6944K1646K6336l6336k8135J0204Q940J9889
20058A12903k4221k6253n4688m377M3521L6967O2023Q1747N8734P0963j5214p662
$$ plain form
20046 334443 325249 255232 226953 212806 161609 70241 71732 102150 117891 143308 202658 252515
20034 252515 302666 327577 322334 329376 363855 368478 397743 395729 395540 429800 423271 442744 484056
20021 484056 531371 591490 699271 806102 952190 1075817 1145694 1139319 1122493 1032054 924551
20010 924551 790036 695911 630676 586385 566114 582417 640872 708836 789320 790222 769250 822715
19998 822715 861135 917695 952411 969745 1014899 1070853 1145417 1275225 1424420 1583099 1772107
19987 1772107 1936887 2152297 2366994 2500017 2644998 2772876 2870453 2938131 2992664 3090641
19977 3090641 3219460 3456231 3858749 4431631 5217643 6225606 7649456 9489770 11179119
19968 11179119 12006727 12021420 12068782 12855791 14542505 17175790 20878624 25954697 33288443
$$ packed form
20046C34443r194p0017k8279j4147n1197r1368J491L0418J5741K5417N9350M9857
20034B52515N0151K4911n243P042L4479M623K9265k014j89L4260o529J9473M1312
20021D84056M7315O0119J07781J06831J46088J23627O9877o375j6826r0439j07503
20010I24551j34515r4125o5235m4291k0271J6303N8455O7964Q0484R02k0972N3465
19998H22715L8420N6560L4716J7334M5154N5954P4564J29808J49195J58679J89008
19987A772107J64780K15410K14697J33023J44981J27878R7577O7678N4533R7977
19977C090641J28819K36771M02518N72882P86012J007963J423850J840314J689349
19968A1179119Q27608J4693M7362P87009J686714K633285L702834N076073P333746
$$ plain form
19959 33288443 44620135 62969044 93926169 148358267 243372468 380278177 500511626
19952 500511626 520952619 425385594 287723664 181259502 118795138 82901227 60943962
19945 60943962 46498214 36556659 29641087 24776621 21314920 18884830 17355662 16773147
19937 16773147 16731052 16208414 14493802 11986903 9665207 8020718 6913960 6150970 5576016
19928 5576016 5117835 4705366 4326020 3984743 3767619 3590662 3487686 3429122 3318727 3153053
19918 3153053 2950479 2732633 2484501 2265553 2092673 1979960 1824312 1630101 1448276
19909 1448276 1302465 1240572 1206279 1152391 1078759 1065732 1048096 1036349 1066144 1112223 1125292
19898 1125292 1091709 1113932 1183207 1235338 1287396 1312532 1278526 1293187 1265437 1257646 1255080 1246234
$$ packed form
19959C3288443J1331692J8348909L0957125N4432098R5014201J36905709J20233449
19952E00511626K0440993r5567025j37661930j06464162o2464364l5893911k1957265
19945F0943962j4445748r941555o915572m864466l461701k430090j529168n82515
19937A6773147m2095n22638j714612k506899k321696j644489j106758p62990n74954
19928E576016m58181m12469l79346l41277k17124j76957j02976n8564j10395j65674
19918C153053k02574k17846k48132k18948j72880j12713j55648j94211j81825
19909A448276j45811o1893l4293n3888p3632j3027j7636j1747K9795M6079J3069
19898A125292l3583K2223O9275N2131N2058K5136l4006J4661k7750p791k566q846
$$ plain form
19886 1246234 1227138 1137592 1016089 903670 797972 695552 626299 566092 505209 468960
19876 468960 450508 450271 450732 377174 349829 345499 409928 426011 412205 400921 402379 435316 467409
19863 467409 412956 410921 411896 411620 420169 421987 417857 362282 342207 316788 265753 280184 311511
19850 311511 374910 369575 356358 327062 312834 329311 344810 300832 266623 258261 273891 286602
19838 286602 287727 258969 240267 250032 280629 292321 306670 282646 310505 367303 402698 386056
19826 386056 368443 348197 321409 283763 261818 253333 221809 190222 186395 163763 157540 116474
19814 116474 91711 99843 116939 123270 102098 120545 131605 151369 153582 142715 90020 95130
19802 95130 93016 115317 155556 195086 185153 160087 138049 136261 146694 141746 101249 101378 135844
$$ packed form
19886A246234j9096q9546j21503j12419j05698j02420o9253o0207o0883l6249
19876D68960j8452k37M61p3558k7345m330O4429J6083j3806j1284J458L2937L2093
19863D67409n4453k035R75k76Q549J818m130n5575k0075k5419n1035J4431L1327
19850C11511O3399n335j3217k9296j4228J6477J5499m3978l4209q362J5630J2711
19838B86602J125k8758j8702R765L0597J1692J4349k4024K7859N6798L5395j6642
19826C86056j7613k0246k6788l7646k1945q485l1524l1587l827k2632o223m1066
19814A16474k4763Q132J7096O331k1172J8447J1060J9764K213j0867n2695N110
19802I5130k114K2301M0239L9530r933k5066k2038j788J0433m948m0497J29L4466
$$ plain form
19789 135844 142532 119058 102635 28313 47519 82523 92900 79632 57587 71582 77618 52465
19777 52465 43405 33120 53649 49946 57422 65345 86189 98002 151842 171130 222675 277424
19765 277424 312191 398417 521120 643012 685914 701208 728974 763539 772376 802957 778453
19754 778453 772671 800911 857374 810634 779265 785411 818881 849016 802486 786238 776877 715624
19742 715624 639654 576212 485880 422710 357823 278704 225084 180451 153024 149893 181233 164390
19730 164390 132950 80995 43610 44833 79622 113002 90382 62916 25637 41993 42955 47043
19718 47043 60858 81563 87602 34459 51679 78666 86487 72385 66692 47038 36337 3721
19706 3721 3838 37123 43898 30720 57852 113819 132133 123034 97786 77608 50932 46168 56884
$$ packed form
19789A35844O688k3474j6423p4322J9206L5004J0377j3268k2045J3995O036k5153
19777E2465r060j0285K0529l703P476P923K0844J1813N3840J9288N1545N4749
19765B77424L4767Q6226J22703J21892M2902J5294K7766L4565Q837L0581k4504
19754G78453n782K8240N6463m6740l1369O146L3470L0135m6530j6248r361o1253
19742G15624p5970o3442r0332o3170o4887p9119n3620m4633k7427l131L1340j6843
19730A64390l1440n1955l7385J223L4789L3380k2620k7466l7279J6356R62M088
19718D7043J3815K0705O039n3143J7220K6987P821j4102n693j9654j0701l2616
19706C721J17L3285O775j3178K7132N5967J8314r099k5248k0178k6676m764J0716
$$ plain form
19693 56884 59078 71044 46274 15729 34443 29556 13097 28523 32689 52000 45450 16496
19681 16496 30580 35224 24584 13265 15504 5064 15976 4817 18867 24116 40057 60544
19669 60544 58681 70054 92499 74463 34857 39251 74662 78608 69688 57015 47147 27782 19019
19656 19019 25663 27195 30234 66230 61127 63338 49619 63395 95359 95393 94678 129471 178815 130431
19642 130431 111561 153704 144403 81890 48838 9310 12763 3530 88148 148941 127648 90753
19630 90753 61508 31643 27828 16491 28018 43268 56191 57412 18610 8370 24004 21394
19618 21394 46617 31247 -14976 -44068 3240 41689 42860 66144 112736 69903 37210 44600
19606 44600 50014 1184 -44009 -32205 -19236 24241 53597 69702 75914 76287 61216 60671 35027
$$ packed form
19693E6884K194J1966k4770l0545J8714m887j6459J5426M166J9311o550k8954
19681A6496J4084M644j0640j1319K239j0440J0912j1159J4050N249J5941K0487
19669F0544j863J1373K2445j8036l9606M394L5411L946q920j2673r868j9365q763
19656A9019O644J532L039L5996n103K211j3719J3776L1964L4p15L4793M9344m8384
19642A30431j8870M2143r301o2513l3052l9528L453r233Q4618O0793k1293l6895
19630I0753k9245k9865l815j1337J1527J5250J2923J221l8802j0240J5634k610
19618B1394K5223j5370m6223k9092M7308L8449J171K3284M6592m2833l2693P390
19606D4600N414m8830m5193J1804J2969M3477K9356J6105O212L73j5071n45k5644
$$ plain form
19593 35027 28209 47858 44569 46572 62194 89384 71446 16910 -6362 35694 69388 66734
19581 66734 52459 39752 35961 46127 87446 80572 77811 84786 67453 64155 81202 96195 101248
19568 101248 120780 114034 95805 49219 59905 99208 81862 63100 44938 40227 38699 47994
19556 47994 76162 129821 112184 96806 69237 50841 33349 13152 21370 74073 91531 81593
19544 81593 78631 52571 56483 54396 59804 56108 49027 63141 75568 60606 75311 83042 58091
19531 58091 32283 29339 37605 55230 23884 19745 14477 -10550 -10811 21016 49805 70252 2275
19518 2275 1857 14452 21005 24588 10833 46195 113829 143884 109449 131039 104592 56970 94382
19505 94382 111213 121787 103393 55975 44085 40078 23526 -2543 40106 80021 116913 145698
$$ packed form
19593C5027o818J9649l289K003J5622K7190j7938n4536k3272M2056L3694k654
19581F6734j4275j2707l791J0166M1319o874k761O975j7333l298J7047J4993N053
19568A01248J9532o746j8229m6586J0686L9303j7346j8762j8162m711j528R295
19556D7994K8168N3659j7637j5378k7569j8396j7492k0197Q218N2703J7458r938
19544H1593k962k6060L912k087N408l696p081J4114J2427j4962J4705P731k4951
19531E8091k5808k944Q266J7625l1346m139n268k5027k61L1827K8789K0447o7977
19518B275m18J2595O553L583j3755L5362O7634L0055l4435K1590k6447m7622L7412
19505I4382J6831J0574j8394m7418j1890m007j6552k6069M2649L9915L6892K8785
$$ plain form
19493 145698 127611 111905 111426 118772 124931 108020 100211 132066 217678 263599 330822 405250
19481 405250 511521 637948 788010 939686 1046977 1106537 1066953 944608 850396 770967
19471 770967 622423 517452 419365 385461 382778 352377 316095 287247 267148 230144 224970
19460 224970 242583 216032 187363 163012 167836 144443 104147 73532 87333 133655 174561 157936
19448 157936 139589 143536 138916 115029 98974 86374 102106 111739 130036 110837 107635 135388
19436 135388 122454 144353 125660 131765 98915 92482 133280 143562 144911 137427 80253 37606
19424 37606 -34270 -39506 619 23593 61782 98680 79376 96767 141073 146899 128978 139672
19412 139672 146437 121621 105825 102410 117247 103292 124886 122620 156525 176715 159415 182998
$$ packed form
19493A45698j8087j5706m79P346O159j6911p809L1855Q5612M5921O7223P4428
19481D05250J06271J26427J50062J51676J07291N9560l9584j22345r4212p9429
19471G70967j48544j04971r8087l3904k683l0401l6282k8848k0099l7004n174
19460B24970J7613k6551k8669k4351M824k3393m0296l0615J3801M6322M0906j6625
19448A57936j8347L947m620k3887j6055j2600J5732R633J8297j9199l202K7753
19436A35388j2934K1899j8693O105l2850o433M0798J0282J349p484n7174m2647
19424C7606p1876n236M0125K2974L8189L6898j9304J7391M4306N826j7921J0694
19412A39672O765k4816j5796l415J4837j3955K1594k266L3905K0190j7300K3583
$$ plain form
19400 182998 191128 184761 194861 144690 92674 98932 138321 130047 123224 147704 168417 219371
19388 219371 278408 300122 370006 493871 612520 670458 711851 715122 726727 702195 639564
19377 639564 546818 432538 365248 322674 276503 239561 219034 170087 202922 250371 275180
19366 275180 253705 239468 212007 192041 215784 217564 234188 223392 188341 189138 174065 191079
19354 191079 239411 231787 210062 242911 269399 263586 252132 187507 169506 189291 159383 119427
19342 119427 117952 129804 152765 200567 216732 193152 156415 135753 102461 102926 59750 28448
19330 28448 68130 126238 187696 219869 176110 120826 105944 100249 111457 117144 98977 66615
19318 66615 77977 73198 81496 125602 142296 133274 142171 130422 120937 125334 161561 201246 207737
$$ packed form
19400A82998Q130o367J0100n0171n2016O258L9389q274o823K4480K0713N0954
19388B19371N9037K1714O9884J23865J18649N7938M1393L271J1605k4532o2631
19377F39564r2746j14280o7290m2574m6171l6942k0527m8947L2835M7449K4809
19366B75180k1475j4237k7461j9966K3743J780J6624j0796l5051P97j5073J7014
19354A91079M8332p624k1725L2849K6488n813j1454o4625j8001J9785k9908l9956
19342A19427j475J1852K2961M7802J6165k3580l6737k0662l3292M65m3176l1302
19330B8448L9682N8108O1458L2173m3759n5284j4882n695J1208N687j8167l2362
19318F6615J1362m779Q298M4106J6694r022Q897j1749r485M397L6227L9685O491
$$ plain form
19305 207737 224738 237575 248896 244573 232599 263790 246504 239831 288617 329341 366224 359085
19293 359085 326802 321062 312187 341471 394108 408118 408794 410327 391338 378439 384166 404369 377502
19280 377502 392686 455828 511492 506724 500888 499273 528423 576389 597013 576068 648210 731651
19268 731651 763374 795095 846897 908509 933621 969779 1002554 1068403 1157279 1229848 1321037
19257 1321037 1445762 1514306 1588955 1682387 1834887 2033973 2250759 2490089 2791563 3126768
19247 3126768 3572226 4072314 4567274 5071634 5732232 6553241 7377114 8192945 9272511
19238 9272511 10750523 12675296 15417464 19483677 25698740 35132029 47725372 60430477
19230 60430477 71002573 83984357 105337001 129853317 138784206 132752628 132468724 142864748
$$ packed form
19305B07737J7001J2837J1321m323j1974L1191j7286o673M8786M0724L6883p139
19293C59085l2283n740q875K9284N2637J4010O76J533j8989j2899N727K0203k6867
19280C77502J5184O3142N5664m768n836j615K9150M7966K0624k0945P2142Q3441
19268G31651L1723L1721N1802O1612K5112L6158L2775O5849Q8876P2569R1189
19257A321037J24725O8544P4649R3432J52500J99086K16786K39330L01474L35205
19247C126768M45458N00088M94960N04360O60598Q21009Q23873Q15831J079566
19238I272511J478012J924773K742168M066213O215063R433289J2593343J2705105
19230F0430477J0572096J2981784K1352644K4516316Q930889o031578k83904J0396024
$$ plain form
19222 142864748 148910271 137783347 124375487 120712424 121327110 119119022 118205842 127313933
19214 127313933 143255175 147872809 138379505 133147051 137876193 138781122 121864777 99094889
19206 99094889 82311506 69596883 56777987 44011432 33578290 26229861 21397517
19199 21397517 18009271 15368856 13334167 11893007 10771919 9597877 8430961 7429944
19191 7429944 6644001 5975503 5257884 4637278 4132009 3693203 3336775 3031047 2722492
19182 2722492 2494921 2309026 2114877 1930918 1788403 1680661 1627327 1565035 1445471 1381065
19172 1381065 1328205 1230636 1157216 1121351 1056153 1000579 957669 880526 820604 766495 726989
19161 726989 725295 679285 635498 644666 645432 671391 689400 648707 605270 556830 500527 467175
$$ packed form
19222A42864748O045523j1126924j3407860l663063O14686k208088r13180R108091
19214A27313933J5941242M617634r493304n232454M729142R04929j6916345k2769888
19206I9094889j6783383j2714623j2818896j2766555j0433142p348429m832344
19199B1397517l388246k640415k034689j441160j121088j174042j166916j001017
19191G429944p85943o68498p17619o20606n05269m38806l56428l05728l08555
19182B722492k27571j85895j94149j83959j42515j07742n3334o2292j19564o4406
19172A381065n2860r7569p3420l5865o5198n5574m2910p7143n9922n4109l9506
19161G26989j694m6010m3787R168P66K5959J8009m0693m3437m8440n6303l3352
$$ plain form
19149 467175 422429 405409 425743 430144 424678 456273 437071 413360 425487 413533 420387 374178
19137 374178 305646 279631 317730 300482 306678 346443 358845 383630 368327 374894 404198 405748
19125 405748 409833 372347 398331 398081 345741 315959 335338 335315 306074 310686 322162 335385 287621
19112 287621 277033 250592 211651 179061 250140 268837 297541 302417 295846 276707 280460 288739
19100 288739 313184 310938 282332 263673 291489 248278 204056 214243 216332 177137 153959 182776
19088 182776 220070 187780 172638 214381 233310 222813 213083 177656 164561 151286 131996 144846
19076 144846 160429 164881 152230 132714 125611 135860 133743 138835 99765 90682 100568 107516 81562
19063 81562 58188 66329 58095 26090 56249 100932 63328 51745 84531 136247 145833 96378
$$ packed form
19149D67175m4746j7020K0334M401n466L1595j9202k3711J2127j1954O854m6209
19137C74178o8532k6015L8099j7248O196L9765J2402K4785j5303O567K9304J550
19125D05748M085l7486K5984k50n2340k9782J9379k3k9241M612J1476J3223m7764
19112B87621j0588k6441l8941l2590P1079J8697K8704M876o571j9139L753Q279
19100B88739K4445k246k8606j8659K7816m3211m4222J0187K089l9195k3178K8817
19088A82776L7294l2290j5142M1743J8929j0497r730l5427j3095j3275j9290J2850
19076A44846J5583M452j2651j9516p103J0249k117N092l9070r083R886O948k5954
19063H1562k3374Q141q234l2005L0159M4683l7604j1583L2786N1716R586m9455
$$ plain form
19051 96378 97002 89083 90964 73653 86847 96864 51823 58291 52088 44305 37126 24480 -29028
19038 -29028 -8385 27790 45840 24591 33883 58580 59683 20250 -19552 -31286 -35205 -26452
19026 -26452 -2344 46785 13700 2176 -20138 -52764 -55349 -32924 -8457 15835 40884 22737
19014 22737 53899 28283 2436 46095 41132 90594 117872 100896 52119 -7790 -39096 3187
19002 3187 -7995 -5947 48316 46691 40663 47216 -937 -64601 -57990 -12830 -22214 -90635 -78893
18989 -78893 -22893 -22020 -50141 -75133 -60593 -14655 22679 38878 28742 21219 23767 22452 22356
18976 22356 35558 38951 10438 37878 46394 -413 31938 119240 123689 92687 75901 76542 62422
18963 62422 29685 54412 42799 37410 19039 9078 7951 41526 61585 54141 48212 70114 39297
$$ packed form
19051I6378O24p919J881j7311J3194J0017m5041O468o203p783p179j2646n3508
19038b9028K0643L6175J8050k1249R292K4697J103l9433l9802j1734l919Q753
19026b6452K4108M9129l3085j1524k2314l2626k585K2425K4467K4292K5049j8147
19014B2737L1162k5616k5847M3659m963M9462K7278j6976m8777n9909l1306M2283
19002C187j1182K048N4263j625o028O553m8153o3664O611M5160r384o8421J1742
18989g8893N6000Q73k8121k4992J4540M5938L7334J6199j0136p523K548j315r6
18976B2356J3202L393k8513K7440Q516m6807L2351Q7302M449l1002j6786O41j4120
18963F2422l2737K4727j1613n389j8371r961j127L3575K0059p444n929K1902l0817
$$ plain form
18950 39297 9452 -1917 9882 50254 88378 89637 70024 23624 12260 -1325 -33306 -4345
18938 -4345 44768 55518 26186 -17474 -36279 -5661 19446 30772 49157 28990 11704 1126
18926 1126 -4213 22698 -7374 -7783 -2343 2720 -32709 -29893 -15117 22048 50665 49647 18111
18913 18111 -3114 24933 70407 90961 60249 70127 88396 41032 -20394 -32676 42315 59144
18901 59144 63569 50669 63163 64996 55477 31377 15841 -37577 -53560 -39029 -3992 -40864
18889 -40864 -55554 23005 70850 36912 5067 -37526 -15640 -32014 -53174 -70547 -21724 30436
18877 30436 18081 -29763 -33092 -7691 6642 -23191 -53142 -38316 8740 404 -25196 -5553
18865 -5553 14576 -23958 -37065 -17335 8403 27821 -16331 -58171 -39876 -31391 -16458 6599
$$ packed form
18950C9297k9845j1369J1799M0372L8124J259j9613m6400j1364j3585l1981K8961
18938d345M9113J0750k9332m3660j8805L0618K5107J1326J8385k0167j7286j0578
18926A126n339K6911l0072m09N440N063l5429K816J4776L7165K8617j018l1536
18913A8111k1225K8047M5474K0554l0712R878J8269m7364o1426j2282P4991J6829
18901E9144M425j2900J2494J833r519k4100j5536n3418j5983J4531L5037l6872
18889d0864j4690P8559M7845l3938l1845m2593K1886j6374k1160j7373M8823N2160
18877C0436j2355m7844l329K5401J4333k9833k9951J4826M7056q336k5600J9643
18865e553K0129l8534j3107J9730K5738J9418m4152m1840J8295Q485J4933K3057
$$ plain form
18853 6599 2785 21215 44184 43401 71470 107305 97750 79055 41743 -9734 886 52050 53544
18840 53544 -3037 4109 6386 4738 1769 -16475 -37266 -41613 -35264 -690 -3831 3415 31933
18827 31933 17200 175 26908 43711 40514 -695 -8948 42694 40441 -4904 -44343 -65023
18815 -65023 -53058 7204 35689 2408 -5101 7779 3495 2446 -23160 -15002 -20756 -31505 -13024
18802 -13024 -11506 -13866 -14554 1771 -7744 -18679 -23618 -5032 17888 12496 32758 7343 -28819
18789 -28819 -51104 -36396 -4572 5677 6746 35845 20084 -15985 -31187 -16366 -16044 46484
18777 46484 68086 49200 52774 52687 62911 80866 99812 154590 229667 354454 531571 598227
18765 598227 416958 221408 119452 75180 92907 74300 70576 88752 94201 113367 66783
$$ packed form
18853F599l814J8430K2969p83K8069L5835r555j8695l7312n1477J0620N1164J494
18840E3544n6581P146K277j648k969j8244k0791m347O349L4574l141P246K8518
18827C1933j4733j7025K6733J6803l197m1209q253N1642k253m5345l9439k0680
18815f5023J1965O0262K8485l3281p509J2880m284j049k5606Q158n754j0749J8481
18802a3024J518k360o88J6325r515j0935m939J8586K2920n392K0262k5415l6162
18789b8819k2285J4708L1824J0249J069K9099j5761l6069j5202J4821L22O2528
18777D6484K1602j8886L574q7J0224J7955J8946N4778P5077J24787J77117O6656
18765E98227j81269j95550j01956m4272J7727j8607l724J8176N449J9166m6584
$$ plain form
18754 66783 27806 -32931 -62541 -36608 -3337 -26565 -27397 -526 -43409 -25362 -1946 -45218
18742 -45218 -62917 -86477 -126182 -89782 -37337 -19658 -37575 1188 19663 8312 9420 21298
18730 21298 37735 48842 25495 37554 40261 18885 28544 -9896 -40213 -30678 8692 38323
18718 38323 102567 115649 57627 11105 9533 -8133 -15259 -39330 1440 36627 92851 127024
18706 127024 122869 99935 38173 14215 26817 13296 12606 16849 39787 72623 113810 124911
18694 124911 171738 193300 242753 278906 321226 472952 589771 654842 683096 680621 711758
18683 711758 731075 754183 797489 708545 639389 624364 633698 613300 648077 745804 811418 796246
18671 796246 791503 801855 808981 760833 655911 552951 492033 397724 283269 229269 163653
$$ packed form
18754F6783l8977o0737k9610K5933L3271k3228q32K6871m2883J8047K3416m3272
18742d5218j7699k3560l9705L6400N2445J7679j7917L8763J8475j1351J108J1878
18730B1298J6437J1107k3347J2059K707k1376R659l8440l0317R535L9370K9631
18718C8323O4244J3082n8022m6522j572j7666p126k4071M0770L5187N6224L4173
18706A27024m155k2934o1762k3958J2602j3521o90M243K2938L2836M1187J1101
18694A24911M6827K1562M9453L6153M2320J51726J16819O5071K8254k475L1137
18683G11758J9317K3108M3306q8944o9156j5025R334k0398L4777R7727O5614j5172
18671G96246m743J0352P126m8148j04922j02960o0918r4309j14455n4000o5616
$$ plain form
18660 163653 82578 77148 66525 66095 113372 114239 97842 64909 2251 -8586 28238 36621 32003
18647 32003 37124 59722 85665 52889 27367 9491 42969 98349 89647 76957 54118 53579
18635 53579 72475 75572 86068 85108 65569 27134 19055 50243 53967 15593 29133 48682 51325
18622 51325 17387 33622 18848 2436 -24555 -50068 -64122 -59902 -25289 -32806 -6933 18930
18610 18930 38085 19843 9239 -11836 10528 -11157 -9543 23512 3243 -49587 -51591 5970
18598 5970 25554 -31090 -8028 23225 7547 -24414 -33766 -32490 -85185 -65479 29645 78417
18586 78417 72779 19793 -28584 -33331 -60675 -17232 -1436 -18483 -10246 -42948 -65494 -14078
18574 -14078 5758 -74927 -84862 -1992 69024 47818 5316 -53930 -81463 -75963 -43917 10734
$$ packed form
18660A63653q1075n430j0623m30M7277Q67j6397l2933o2658j0837L6824Q383m618
18647C2003N121K2598K5943l2776k5522j7876L3478N5380q702j2690k2839n39
18635E3579J8896L097J0496r60j9539l8435q079L1188L724l8374J3540J9549K643
18622E1325l3938J6235j4774j6412k6991k5513j4054M220L4613p517K5873K5863
18610A8930J9155j8242j0604k1075K2364k1685J614L3055k0269n2830k004N7561
18598E970J9584n6644K3062L1253j5678l1961r352J276n2695J9706R5124M8772
18586G8417n638n2986m8377m747k7344M3443J5796j7047Q237l2702k2546N1416
18574a4078J9836q0685r935Q2870P1016k1206m2502n9246k7533N500L2046N4651
$$ plain form
18562 10734 56255 30227 -34406 -65353 -85241 -96544 -37968 11911 24161 42113 52982 12071
18550 12071 -28079 -46401 -49097 -30976 -57847 -26568 -24024 -13769 -9933 8573 18212 24914 46020
18537 46020 51986 9252 23155 25520 9897 30782 19172 8097 4111 717 -4935 15245 -8900
18524 -8900 -20066 11348 51787 64550 51712 31993 -1387 -22434 -22931 -753 -1220 22592 57558
18511 57558 100853 92528 55669 -4843 -24618 -12140 23802 33956 10201 155 -40883 -46585
18499 -46585 -10795 11387 65461 85039 60171 18672 895 -8446 -17760 5239 24353 18266
18487 18266 -3259 -6248 -40549 -14730 -25089 -39688 -48147 -75696 -103174 -81210 -96652 -127513
18475 -127513 -104780 -77588 -64716 -62436 -10889 18009 60860 34986 -17954 -62757 -64061 -79029
$$ packed form
18562A0734M5521k6028o4633l0947j9888j1303N8576M9879J2250J7952J0869m0911
18550A2071m0150j8322k696J8121k6871L1279K544J0255L836J8506R639O702K1106
18537D6020N966m2734J3903K365j5623K0885j1610j1075l986l394n652K0180k4145
18524h900j1166L1414M0439J2763j2838j9719l3380k1047m97K2178m67K3812L4966
18511E7558M3295q325l6859o0512j9775J2478L5942J0154k3755j0046m1038n702
18499d6585L5790K2182N4074J9578k4868m1499j7777r341r314K2999J9114o087
18487A8266k1525k989l4301K5819j0359j4599q459k7549k7478K1964j5442l0861
18475a27513K2733K7192J2872K280N1547K8898M2851k5874n2940m4803j304j4968
$$ plain form
18463 -79029 -62932 -40842 128 -20609 -40953 -30367 -31288 -62510 -67863 -35664 -25545 -18824
18451 -18824 11200 -6545 -23704 -40803 -13146 35132 53380 2013 -20462 -24045 -11709 -31900
18439 -31900 -94138 -107144 -59924 7534 28140 29739 31010 46963 58036 21790 -9011 -28026
18427 -28026 -13729 -15362 -6377 7304 -8123 -13310 -21750 10623 68402 -19707 -83083 -76644 -33964
18414 -33964 4941 20124 3880 28293 49385 39845 49984 42911 -7386 -24388 8062 23317
18402 23317 45262 32401 -3202 -10607 -36258 -73341 -22499 39147 -150 -75627 -63741 -75558
18390 -75558 -89777 -71582 -36807 -51183 -40682 -14113 -12549 17616 -42 -41057 -69245 -64621
18378 -64621 -14667 4126 22790 21171 53840 36367 47770 30632 -20047 -50263 12008 49136
$$ packed form
18463g9029J6097K2090M0970k0737k0344J0586r21l1222n353L2199J0119O721
18451a8824L0024j7745j7159j7099K7657M8278J8248n1367k2475l583J2336k0191
18439c1900o2238j3006M7220O7458K0606J599J271J5953J1073l6246l0801j9015
18427b8026J4297j633Q985J3681j5427n187q440L2373N7779q8109o3376O439M2680
18414c3964L8905J5183j6244K4413K1092r540J0139p073n0297j7002L2450J5255
18402B3317K1945j2861l5603p405k5651l7083N0842O1646l9297p5477J1886j1817
18390g5558j4219J8195L4775j4376J0501K6569J564L0165j7658m1015k8188M624
18378f4621M9954J8793J8664j619L2669j7473J1403j7138n0679l0216O2271L7128
$$ plain form
18366 49136 89405 80375 57596 34676 7870 1917 24771 -5430 -8481 15720 -7421 14282
18354 14282 22898 37339 14955 30389 59219 69332 97175 69194 -33444 -50479 -55893 -40891
18342 -40891 -49652 -31337 13230 44903 26008 2503 6902 3360 -24196 -48682 -52994 -36870
18330 -36870 32740 74963 76411 -16322 -11371 24306 58324 40564 1516 26982 79808 93736
18318 93736 48658 56977 96511 107999 113719 73398 56726 52655 51709 48843 24048 -52909 -84275
18305 -84275 -30592 -21940 159 26024 -5461 -72414 -89971 -73210 -29493 -16559 -43221 -49731
18293 -49731 -87913 -71344 -33629 1092 22787 48986 82971 49907 53928 51844 49979 37162
18281 37162 20821 13285 24982 23466 17616 -16816 -13299 9910 54639 48804 74135 62428 46622
$$ packed form
18366D9136M0269r030k2779k2920k6806n953K2854l0201l051K4201k3141K1703
18354A4282Q616J4441k2384J5434K8830J0113K7843k7981j02638j7035n414J5002
18342d0891q761J8315M4567L1673j8895k3505M399l542k7556k4486m312J6124
18330c6870O9610M2223J448r2733M951L5677L4018j7760l9048K5466N2826J3928
18318I3736m5078Q319L9534J1488N720m0321j6672m071r46k866k4795p6957l1366
18305h4275N3683Q652K2099K5865l1485o6953j7557J6761M3717J2934k6662o510
18293d9731l8182J6569L7715L4721K1695K6199L3985l3064M021k084j865j2817
18281C7162j6341p536J1697j516n850l4432L517K3209M4729n835K5331j1707j5806
$$ plain form
18268 46622 47470 59865 55266 38309 72711 91216 91872 79691 58728 58634 82741 93476 94800
18255 94800 75564 34329 13726 9502 -9141 -20439 -26102 -49549 -47852 -26493 -16234 -18596
18243 -18596 -20792 -53556 -55891 5972 -5414 -29301 -12191 38586 17480 23595 48066 49984
18231 49984 87014 103249 101221 79361 29429 20238 49341 50711 48242 26440 25059 7111 -31099
18218 -31099 -102933 -129606 -79739 -80175 -15024 18705 35039 23636 -22841 -26281 -17906 -21569 3642
18205 3642 26770 24012 -22159 -15297 -5488 19797 -4830 -12670 2808 27503 44296 57429 25713
18192 25713 -2341 37444 31124 3481 -3041 4072 1857 -4506 17043 20064 52434 62702 26738
18179 26738 45408 48928 67076 82035 99061 123163 112222 76429 40027 -8251 -10614 17031
$$ packed form
18268D6622Q48J2395m599j6957L4402J8505O56j2181k0963r4K4107J0735J324
18255I4800j9236m1235k0603m224j8643j1298n663k3447J697K1359J0259k362
18243a8596k196l2764k335O1863j1386k3887J7110N0777k1106O115K4471J918
18231D9984L7030J6235k028k1860m9932r191K9103J370k469k1802j381j7948l8210
18218c1099p1834k6673M9867m36O5151L3729J6334j1403m6477l440Q375l663K5211
18205C642K3128k758m6171O862R809K5285k4627p840J5478K4695J6793J3133l1716
18192B5713k8054L9785o320k7643o522P113k215o363K1549L021L2370J0268l5964
18179B6738J8670L520J8148J4959J7026K4102j0941l5793l6402m8278k363K7645
$$ plain form
18167 17031 -22996 -32651 -25680 -15177 -3948 15798 40405 69907 105559 106039 51458 8607
18155 8607 20059 48999 91109 93363 105440 135450 143959 146073 119150 91620 137077 222232
18143 222232 233693 227277 221313 209471 259363 293592 286307 304444 328804 356814 331059 370715
18131 370715 468677 525383 549950 610448 667705 708086 777168 921909 1182184 1404369 1668865
18120 1668865 2021375 2480748 3049027 3786793 4717010 6033040 8294682 12075471 18623878
18111 18623878 31066733 55300552 92138288 109837269 80190532 46381098 27774775
18104 27774775 18197009 12798526 9539133 7325089 5737197 4603494 3825371 3250607
18096 3250607 2796826 2377576 2077235 1900657 1779122 1586541 1358535 1143062 984281
$$ packed form
18167A7031m0027r655O971J0503J1229J9746K4607K9502L5652M80n4581m2851
18155H607J1452K8940M2110K254J2077L0010Q509K114k6923k7530M5457Q5155
18143B22232J1461o416n964j1842M9892L4229p285J8137K4360K8010k5755L9656
18131C70715R7962N6706K4567O0498N7257M0381O9082J44741K60275K22185K64496
18120A668865L52510M59373N68279P37766R30217J316030K261642L780789O548407
18111A8623878J2442855K4233819L6837736J7698981k9646737l3809434j8606323
18104B7774775r577766n398483l259393k214044j587892j133703p78123n74764
18096C250607m53781m19250l00341j76578j21535j92581k28006k15473j58781
$$ plain form
18087 984281 856447 762868 706667 663374 590004 559207 528195 523071 493230 442000 391806
18076 391806 379753 349731 294569 282350 262993 241739 206297 241639 236995 195669 185397 174031
18064 174031 158669 182396 225188 183606 131051 85555 105389 140738 124167 114536 79015 38390
18052 38390 44756 27186 47399 31931 28183 6039 58356 91768 71265 52632 56561 65713
18040 65713 50300 32217 48234 68887 41786 41208 65802 86888 95280 77165 32194 37609
18028 37609 57693 69348 94891 116440 131576 109707 79156 45212 47804 30701 12021 28469
18016 28469 69054 68668 37050 50466 44256 30917 28342 11404 -22456 3178 70204 74711 14365
18003 14365 -2933 -21100 5073 61290 66571 68546 102061 90838 65503 28949 39332 86345
$$ packed form
18087I84281j27834r3579n6201m3293p3370l0797l1012n124k9841n1230n0194
18076C91806j2053l0022n5162j2219j9357k1254l5442L5342m644m1326j0272j1366
18064A74031j5362K3727M2792m1582n2555m5496J9834L5349j6571r631l5521m0625
18052C8390O366j7570K0213j5468l748k2144N2317L3412k0503j8633L929R152
18040F5713j5413j8083J6017K0653k7101n78K4594K1086Q392j8115m4971N415
18028C7609K0084J1655K5543K1549J5136k1869l0551l3944K592j7103j8680J6448
18016B8469M0585l86l1618J3416o210j3339k575j6938l3860K5634O7026M507o0346
18003A4365j7298j8167K6173N6217N281J975L3515j1223k5335l6554J0383M7013
$$ plain form
17991 86345 71541 45690 19352 -14276 17308 45525 525 -1581 6400 -28969 -5032 39108
17979 39108 72924 48143 1929 2064 -24416 -42325 -25676 -30713 -20686 12058 24782 -4925
17967 -4925 -22584 -42010 27327 9211 -33578 -14764 -56611 -36683 10298 45150 54587 24265
17955 24265 -15354 -8753 -18031 -43392 -62353 -62912 -30630 -3337 -16188 28024 31837 15555 1909
17942 1909 -16716 -32178 -54015 -32205 -10241 -41574 -76566 -53306 19484 58748 72997 31102
17930 31102 36534 77273 52127 6874 -22298 -35890 -38791 -39110 -36650 -22872 -30647 -6230 8012
17917 8012 -8721 -8674 14441 14126 23846 2464 -28242 -14178 -25500 -9511 5080 34538 9968
17904 9968 -13365 12439 23644 16415 27152 42341 21992 -9107 -7936 4250 -5493 4250 -26888
$$ packed form
17991H6345j4804k5851k6338l3628L1584K8217m5000k106P981l5369K3937M4140
17979C9108L3816k4781m6214J35k6480j7909J6649n037J0027L2744J2724k9707
17967d925j7659j9426O9337j8116m2789J8814m1847J9928M6981L4852R437l0322
17955B4265l9619O601r278k5361j8961n59L2282K7293j2851M4212L813j6282j3646
17942A909j8625j5462k1837K1810K1964l1333l4992K3260P2790L9264J4249m1895
17930C1102N432M0739k5146m5253k9172j3592k901l19K460J3778p775K4417J4242
17917H012j6733M7K3115l15R720k1382l0706J4064j1322J5989J4591K9458k4570
17904I968k3333K5804J1205p229J0737J5189k0349l1099J171J2186r743R743l1138
$$ plain form
17891 -26888 -74261 -80959 -69072 -76962 -53894 -25995 4415 -10477 -3198 28990 1120 1836 -22174
17878 -22174 -9566 7956 1951 -8779 -29918 -58398 -54943 -24540 -8754 -10273 -55168 -64668
17866 -64668 -21684 -15242 -64515 -25930 -3414 14775 5826 27075 44375 62285 48850 9987
17854 9987 11328 28228 65809 58235 -7987 -43040 -34580 -5435 533 -6858 -11854 16039 45372
17841 45372 33653 18907 24452 34595 -13145 -17554 -30394 -21624 -7755 -39014 -77080 -86551
17829 -86551 -63164 -30825 -22236 -24086 -35070 -41700 -33492 -61353 -83114 -64476 -26302 -17597 -28569
17816 -28569 -80638 -70966 24680 52183 39506 7681 4593 -6306 -25979 -43111 -1141 35366
17804 35366 46973 52267 45705 9379 2299 36792 32211 -7068 -13019 -15141 -14063 31267 30033
$$ packed form
17891b6888m7373o698J1887p890K3068K7899L0410j4892P279L2188k7870P16k4010
17878b2174J2608J7522o005j0730k1139k8480L455L0403J5786j519m4895r500
17866f4668M2984O442m9273L8585K2516J8189q949K1249J7300J7910j3435l8863
17854I987J341J6900L7581p574o6222l5053Q460K9145N968p391m996K7893K9333
17841D5372j1719j4746N545J0143m7740m409j2840Q770J3869l1259l8066r471
17829h6551K3387L2339Q589j850j0984o630Q208k7861k1761J8638L8174Q705j0972
17816b8569n2069R672R5646K7503j2677l1825l088j0899j9673j7132M1970L6507
17804C5366J1607N294o562l6326p080L4493m581l9279n951k122J078M5330j234
$$ plain form
17791 30033 -7246 -52575 -18662 51074 51060 47214 13221 8841 38302 33575 -8863 -70297 -59893
17778 -59893 -76082 -95967 -106829 -98972 -52907 -26938 -22255 -9598 1249 -16156 -47902 -1133
17766 -1133 8054 -26797 -7856 328 -2699 -9130 -9682 4115 -7739 -10563 23862 -22397 -43486
17753 -43486 -33734 -23044 2895 39338 57625 17800 -2375 -3251 -12985 -28900 -38922 -15299
17741 -15299 28404 32441 501 -49794 -40846 -38071 14690 -14195 -32622 -18697 6149 11440
17729 11440 -9810 -33882 -11644 5700 22160 79259 124163 153268 147127 123954 65572 44385
17717 44385 -1497 -11637 7143 26253 15426 21694 28016 33607 15774 16526 14541 27366 14055
17704 14055 -14063 -41785 -60086 -33817 -288 6513 24155 49566 51319 38521 4120 6917
$$ packed form
17791C0033l7279m5329L3913O9736j4l846l3993m380K9461m727m2438o1434J0404
17778e9893j6189j9885j0862P857M6065K5969M683J2657J0847j7405l1746M6769
17766a133R187l4851J8941Q184l027o431n52J3797j1854k824L4425m6259k1089
17753d3486R752J0690K5939L6443J8287l9825k0175q76r734j5915j0022K3623
17741a5299M3703M037l1940n0295Q948K775N2761k8885j8427J3925K4846N291
17729A1440k1250k4072K2238J7344J6460N7099M4904K9105o141k3173n8382k1187
17717D4385m5882j0140J8780J9110j0827O268O322N591j7833P52j985J2825j3311
17704A4055k8118k7722j8301K6269L3529O801J7642K5411J753j2798l4401K797
$$ plain form
17692 6917 13490 -24736 -26346 -23551 -38035 -40460 -44851 -27429 -16862 1520 32110 26719 -16604
17679 -16604 4936 7187 6176 39816 77683 141857 124349 104463 61307 15083 -24641 -11737
17667 -11737 28944 33681 5644 -14973 -28774 -14054 -36586 -32871 -37133 11702 27090 40606
17655 40606 10436 -18981 -28090 3961 51629 16978 -15671 -18101 3752 32486 19844 15087
17643 15087 25009 -4123 -42948 -36997 -28500 -6048 -17548 -26100 15976 14517 2983 46311 80076
17630 80076 88736 62060 35777 50642 55516 27725 4227 -5783 -13352 5291 14602 24319 38463
17617 38463 39073 22724 -164 -19012 5149 13389 -6163 -35263 -34344 -26488 44201 52182 41380
17604 41380 14672 -17377 -28158 -71243 -87004 -34113 5402 28661 37208 17649 8905 16834
$$ packed form
17692F917O573l8226j610K795j4484k425m391J7422J0567J8382L0590n391m3323
17679a6604K1540K251j011L3640L7867O4174j7508j9886m3156m6224l9724J2904
17667a1737M0681M737k8037k0617j3801J4720k2532L715m262M8835J5388J3516
17655D0606l0170k9417r109L2051M7668l4651l2649k430K1853K8734j2642m757
17643A5087R922k9132l8825N951Q497K2452j1500q552M2076j459j1534M3328L3765
17630H0076Q660k6676k6283J4865M874k7791k3498j0010p569J8643R311R717J4144
17617C8463O10j6349k2888j8848K4161Q240j9552k9100R19P856P0689P981j0802
17604D1380k6708l2049j0781m3085j5761N2891L9515K3259Q547j9559q744P929
$$ plain form
17592 16834 16271 18434 23421 45515 32184 -11979 -51627 -47663 3752 -2458 19936 32108 40165
17579 40165 7997 5476 -27880 -47232 -32565 -42225 -20001 -35085 -650 -10874 30491 16869
17567 16869 -9180 -10871 32506 28800 4656 2639 415 -8150 25141 37304 42264 -18362 -25366
17554 -25366 21838 21812 30699 8702 -28249 -70208 -57744 -40112 -24799 -53539 -22746 -21336 -35921
17541 -35921 -35565 -104048 -89773 -53094 -29963 -18047 -21157 8425 24403 57202 10746 -34709
17529 -34709 -40376 -18412 3704 6447 -18612 -26095 -21770 -31844 -15884 -5988 7550 66689 65540
17516 65540 31684 22174 30843 33446 5972 6274 7948 49215 46058 60414 18330 26353 28889
17503 28889 36561 8681 -11650 -14392 -28391 -48977 -15817 -30603 -7292 -5664 -11389 -3843 -2573
$$ packed form
17592A6834n63K163M987K2094j3331m4163l9648L964N1415o210K2394J2172Q057
17579D0165l2168k521l3356j9352J4667r660K2224j5084L4435j0224M1365j3622
17567A6869k6049j691M3377l706k4144k017k224q565L3291J2163M960o0626p004
17554b5366M7204k6Q887k1997l6951m1959J2464J7632J5313k8740L0793J410j4585
17541c5921L56o8483J4275L6679K3131J1916l110K9582J5978L2799m6456m5455
17529c4709n667K1964K2116K743k5059p483M325j0074J5960R896J3538N9139j149
17516F5540l3856r510Q669K603k7474L02J674M1267l157J4356m2084Q023K536
17503B8889P672k7880k0331k742j3999k0586L3160j4786K3311J628n725P546J270
$$ plain form
17490 -2573 20464 8953 7908 -3504 -17484 -34531 -29725 -10458 -2149 4052 -6318 17007 6756
17477 6756 -18419 -23379 -20576 21 -38171 -40899 -33535 -337 20133 34557 56040 69978 65551
17464 65551 61237 8974 -8175 14047 -2988 -13591 39141 123443 118596 87459 63676 84601
17452 84601 71944 54108 60934 102827 107668 96720 100870 146491 244469 450226 613457 489494
17440 489494 309964 182046 116465 89711 55979 58771 8793 -15625 24491 31470 1896
17429 1896 -47987 -59815 -86814 -92293 -45538 -14845 -2424 -23890 -42804 -33361 -12663 10933
17417 10933 10195 -3255 -31131 -24330 21968 24876 22133 6980 3246 11760 17323 10178 20871
17404 20871 8518 29010 15262 253 -3105 -4509 -26162 -7567 17625 53412 59326 52825
$$ packed form
17490b573K3037j1511j045j1412j3980j7047M806J9267Q309O201j0370K3325j0251
17477F756k5175m960K803K0597l8192k728P364L3198K0470J4424K1483J3938m427
17464F5551m314n2263j7149K2222j7035j0603N2732Q4302m847l1137k3783K0925
17452H4601j2657j7836O826M1893M841j0948M150M5621R7978K05757J63231j23963
17440D89494j79530j27918o5581k6754l3732K792m9978k4418M0116O979k9574
17429A896m9883j1828k6999n479M6755L0693J2421k1466j8914R443K0698K3596
17417A0933p38j3450k7876O801M6298K908k743j5153l734Q514N563p145J0693
17404B0871j2353K0492j3748j5009l358j404k1653J8595K5192L5787N914o501
$$ plain form
17392 52825 18223 16285 47621 -1733 1379 32904 15630 20274 18409 32169 43312 36968 3006
17379 3006 -17187 -14907 9126 -24747 -70614 -71811 -76775 -21640 4869 -17036 -37892 -9643
17367 -9643 4748 -17060 4583 -43131 -77438 -60452 -86836 -53196 -36784 -54216 -51357 -43783
17355 -43783 -59956 -52882 -29394 -29411 -37338 -42669 -17176 -38934 -21736 -8428 17270 41244 -8316
17342 -8316 -33789 -49714 -62530 -57707 -49242 -69576 -47007 -46911 -4245 16305 16520 -17213 -28789
17329 -28789 -31616 -24263 19933 68817 35596 6835 -15242 -18659 -4612 -8832 -37565 -41530 -50941
17316 -50941 -39498 -55769 -61196 -43492 -41834 -37647 -49133 -48222 -85082 -74378 -59877 -43931 -31779
17303 -31779 16795 -27792 -37716 -43558 -25357 16197 30870 34812 34196 -301 -40321 -26952 31362
$$ packed form
17392E2825l4602j938L1336m9354L112L1525j7274M644j865J3760J1143o344l3962
17379C006k0193K280K4033l3873m5867j197m964N5135K6509k1905k0856K8249
17367i643J4391k1808K1643m7714l4307J6986k6384L3640J6412j7432K859P574
17355d3783j6173P074K3488j7p927n331K5493k1758J7198J3308K5698K3974m9560
17342h316k5473j5925j2816M823Q465k0334K2569R6M2666K0550K15l3733j1576
17329b8789k827P353M4196M8884l3221k8761k2077l417J4047m220k8733l965r411
17316e0941J1443j6271n427J7704J658M187j1486R11l6860J0704J4501J5946J2152
17303c1779M8574m4587r924n842J8201M1554J4673L942o16l4497m0020J3369N8314
$$ plain form
17290 31362 60675 33686 78239 75876 40661 -5463 -35999 -63219 -60606 -53180 -44520 -49178 -54866
17277 -54866 -5311 -7076 -17593 -28804 -27325 -21197 303 -7037 -6050 1656 -15656 -34912 -16650
17264 -16650 11356 -16476 -15459 7007 13374 17659 2975 40252 82836 60343 -3725 -19233
17252 -19233 34239 27497 -2883 -22959 -60310 -77788 -21859 4170 -19372 -75970 -82840 -53301
17240 -53301 -28995 -30003 -9884 20939 3749 20466 54585 43615 26579 6709 16866 4425
17228 4425 -4085 -12974 -8176 -31309 -4428 40950 44071 5481 24495 75665 64613 65241 96572
17215 96572 128827 96099 60564 12220 5791 9250 26133 -21477 -40380 -61705 -32374 -20128
17203 -20128 -39807 -17340 -11103 -22520 -44436 -35038 -6910 -28452 -76238 -93535 -94867 -80400
$$ packed form
17290C1362K9313k6989M4553k363l5215m6124l0536k7220K613P426Q660m658n688
17277e4866M9555j765j0517j1211J479O128K1500p340R87P706j7312j9256J8262
17264a6650K8006k7832J017K2466O367M285j4684L7277M2584k2493o4068j5508
17252a9233N3472o742l0380k0076l7351j7478N5929K6029k3542n6598o870K9539
17240e3301K4306j008K0119L0823j7190J6717L4119j0970j7036j9870J0157j2441
17228D425q510q889M798k3133K6881M5378L121l8590J9014N1170j1052O28L1331
17215I6572L2255l2728l5535m8344o429L459J6883m7610j8903k1325K9331J2246
17203b0128j9679K2467O237j1417k1916R398K8128k1542m7786j7297j332J4467
$$ plain form
17191 -80400 -78752 -66677 -64676 -53770 -55176 -27998 1138 17763 23651 28636 46337 2437 -38284
17178 -38284 -50717 -22642 20629 17321 11130 38507 48363 8342 -5188 -17958 -68388 -81675
17166 -81675 -28262 1026 18170 -13349 -20899 -38965 -63163 -51196 -20439 -14629 -49716 -76072
17154 -76072 -48593 -3883 3121 20841 -10129 -21735 -11432 -9180 36241 47296 54859 31563
17142 31563 -36068 -57554 -38950 -19224 -13135 28607 30876 1796 5001 4072 -18616 -45815 -58191
17129 -58191 -56065 -16154 -1779 20049 17331 35364 40884 27185 20311 14653 10828 25899 23784
17116 23784 -3849 9949 -27637 -91587 -120122 -106831 -48797 -8834 35405 79987 47245 -23740
17104 -23740 -65040 -40579 -35083 -60642 -15923 26932 61419 19792 5295 2481 -2408 -9826
$$ packed form
17191h0400J648J2075K001J0906j406K7178K9136J6625N888M985J7701m3900m0721
17178c8284j2433K8075M3271l308o191K7377R856m0021j3530j2770n0430j3287
17166h1675N3413K9288J7144l1519p550j8066k4198J1967L0757N810l5087k6356
17154g6072K7479M4710P004J7720l0970j1606J0303K252M5421J1055P563k3296
17142C1563o7631k1486J8604J9726O089M1742K269k9080L205r29k2688k7199j2376
17129e8191K126L9911J4375K1828k718J8033N520j3699o874n658l825J5071k115
17116B3784k7633J3798l7586o3950k8535J3291N8034L9963M4239M4582l2742p0985
17104b3740m1300K4461N496k5559M4719M2855L4487m1627j4497k814m889p418
$$ plain form
17092 -9826 25142 47390 14079 -31257 -34524 1240 2660 -14061 -10296 -31119 -9061 22718
17080 22718 43839 36127 43479 50073 18549 -21824 -1935 1933 -39486 -29159 -26256 3623 24027
17067 24027 57281 39497 12340 1420 -15525 -25212 -24893 -11898 -16931 -28667 14714 41321
17055 41321 12637 16437 18100 26367 -19 -22028 -37928 -62611 -80880 -98593 -63908 -46433
17043 -46433 -31420 -1360 -14043 -22093 -1058 -11971 -27588 -77372 -50953 2276 -584 -7358
17031 -7358 -10967 -37556 -64833 -75763 -67388 -47773 -13530 2455 2106 -21394 -28338 -22000 -1389
17018 -1389 -1525 -37071 -79857 -27409 -15804 -14668 -17787 12408 19512 51075 66912 32846 10073
17005 10073 -7282 -6082 -41114 -44526 -23425 -23669 -43763 -51503 -43661 3621 53996 55734 40311
$$ packed form
17092i826L4968K2248l3311m5336l267L5764J420j6721L765k0823K2058L1779
17080B2718K1121p712P352O594l1524m0373J9889L868m1419J0327K903K9879K0404
17067B4027L3254j7784k7157j0920j6945r687L19J2995n033j1736M3381K6607
17055D1321k8684L800J663Q267k6386k2009j5900k4683j8269j7713L4685J7475
17043d6433J5013L0060j2683q050K1035j0913j5617m9784K6419N3229k860o774
17031g358l609k6589k7277j0930Q375J9615L4243J5985l49k3500o944O338K0611
17018a389j36l5546m2786N2448J1605J136l119L0195P104L1563J5837l4066k2773
17005A0073j7355J200l5032l412K1101k44k0094p740P842M7282N0375J738j5423
$$ plain form
16992 40311 44691 15580 -45007 -48437 -46456 -10028 4812 19951 28751 -2690 -2670 -42100 -11877
16979 -11877 -12705 -21496 -40875 -95585 -56045 -40830 -20017 -2650 -19837 -37266 -58320 -39098
16967 -39098 -59794 -70441 -70199 -107081 -87734 -10321 49483 27835 17033 12700 31127 62667
16955 62667 45989 17066 67356 99295 60063 45659 71995 75968 65661 42386 31011 17055
16943 17055 33314 77758 74037 18483 -50794 -61890 -45917 -68904 -69012 -58736 -21474 -9803
16931 -9803 -21536 -19082 15135 3485 16015 21227 22768 -246 -11715 13288 45984 64283
16919 64283 50537 30171 55867 66891 47467 -18464 -22438 -13443 16143 -128 -47862 -60157
16907 -60157 -54609 -30115 -9829 -44132 -50839 -41498 882 -4075 -70584 -80534 -86690 -69465 -33062
$$ packed form
16992D0311M380k9111o0587l430J981L6428J4840J5139Q800l1441K0l9430L0223
16979a1877q28q791j9379n4710L9540J5215K0813J7367j7187j7429k1054J9222
16967c9098k0696j0647K42l6882J9347P7413N9804k1648j0802m333J8427L1540
16955F2667j6678k8923N0290L1939l9232j4404K6336L973j0307k3275j1375j3956
16943A7055J6259M4444l721n5554o9277j1096J5973k2987j08J0276L7262J1671
16931i803j1733K454L4217j1650J2530N212J541k3014j1469K5003L2696J8299
16919F4283j3746k0366K5696J1024j9424o5931l974Q995K9586j6271m7734j2295
16907f0157N548K4494K0286l4303o707R341M2380m957o6509r950o156J7225L6403
$$ plain form
16894 -33062 -31967 -61693 -33312 -25740 -37561 -55428 -60879 -40482 -23616 -34173 13298 38459
16882 38459 62149 65243 47406 23074 31512 1341 -40558 -34744 -24531 -40364 -44873 -27024
16870 -27024 -33930 -16702 -12143 18025 28913 9927 -1107 -11527 -49916 -99737 -107214 -120224
16858 -120224 -89519 -64845 -57274 -24385 28858 43548 10914 -36843 -24282 -1242 -40039 -26819
16846 -26819 -24771 26419 18991 -18765 -16516 24516 85987 39105 20058 31146 13371 -13685
16834 -13685 -61905 -33986 -4961 -41598 -37598 276 11542 -9263 20740 28880 2188 11302
16822 11302 -1190 -5519 -6763 -22084 1505 57118 63550 84077 63676 29616 -27945 -41180
16810 -41180 -11055 -13366 17481 15989 -3678 -33157 -10639 7519 -8695 5062 32066 18563
$$ packed form
16894c3062J095k9726K8381P572j1821j7867n451K0397J6866j0557M7471K5161
16882C8459K3690L094j7837k4332Q438l0171m1899N814J0213j5833m509J7849
16870b7024o906J7228M559L0168J0888j8986j1034j0420l8389m9821p477j3010
16858a20224L0705K4674P571L2889N3243J4690l2634m7757J2561K3040l8797J3220
16846b6819K048N1190p428l7756K249M1032O1471m6882j9047J1088j7775k7056
16834a3685m8220K7919K9025l6637M000L7874J1266k0805L0003Q140k6692R114
16822A1302j2492m329j244j5321K3589N5613O432K0527k0401l4060n7561j3235
16810d1180L0125k311L0847j492j9667k9479K2518J8158j6214J3757K7004j3503
$$ plain form
16798 18563 21872 -5214 -8288 13396 44209 20420 29604 58543 38789 -25452 -74678 -71615
16786 -71615 -22355 16652 41999 74456 61685 65261 11788 -33519 -39129 8530 18004 -18845
16774 -18845 -47477 -52986 -42582 -62638 -35554 650 17430 11743 -13044 -5095 14128 39516
16762 39516 7417 2719 -4502 -6108 -29268 -50080 -29358 -7798 1840 17915 10817 19400 21907
16749 21907 -11247 -46778 -62380 -33569 25085 34462 -7021 -10890 50811 68454 34168 -10173
16737 -10173 -56184 -79197 -60180 -34269 -25022 -23697 3808 32375 60522 36571 8085 13114
16725 13114 -7130 -19743 -14491 -7818 14768 4478 15872 31884 11487 -1631 65858 65329
16713 65329 24160 3679 5650 20381 -30986 -12768 4428 4275 37726 47365 50024 31459 21856
$$ packed form
16798A8563L309k7086l074K1684L0813k3789R184K8939j9754o4241m9226L063
16786g1615M9260L9007K5347L2457j2771L576n3473m5307n610M7659R474l6849
16774a8845k8632n509J0404k0056K7084L6204J6780n687k4787P949J9223K5388
16762C9516l2099m698p221j606k3160k0812K0722K1560R638J6075p098Q583K507
16749B1907l3154l5531j5602K8811N8654R377m1483l869O1701J7643l4286m4341
16737a0173m6011k3013J9017K5911R247J325K7505K8567K8147k3951k8486N029
16725A3114k0244j2613N252O673K2586j0290J1394J6012k0397j3118O7489n29
16713F5329m1169k0481J971J4731n1367J8218J7196j53L3451R639K659j8565r603
$$ plain form
16700 21856 962 3053 4690 -19004 -8388 8854 28297 23189 -10620 -17447 25637 25094 9416
16687 9416 4996 -17762 -33872 9120 31124 4756 -5269 -57550 -82792 -47981 10999 -8320
16675 -8320 -29699 -40517 -74292 -85235 -40928 -37203 -41539 -19466 36245 61488 45212 48626
16663 48626 32885 4927 -17885 -26029 14002 26953 -3103 -2671 34363 31505 -3530 4982 15806
16650 15806 23667 30783 11764 -3421 9688 28198 -2650 3047 13802 30555 20634 26547 7287
16637 7287 25274 26353 1241 -13347 -7556 -27421 -21027 -39855 -86690 -83667 -79463 -92020 -64763
16624 -64763 -37144 -12863 -1965 1535 -2317 33428 16382 34058 12745 -5160 -12524 -17589
16612 -17589 -9027 -42199 -27586 366 18971 832 9167 9255 -33240 -27705 32717 26479 -27434
$$ packed form
16700B1856k0894K091J637k3694J0616J7242J9443n108l3809o827M3084n43j5678
16687I416m420k2758j6110M2992K2004k6368j0025n2281k5242L4811N8980j9319
16675h320k1379j0818l3775j0943M4307L725m336K2073N5711K5243j6276L414
16663D8626j5741k7958k2812q144M0031J2951l0056M32L7034k858l5035Q512J0824
16650A5806P861P116j9019j5185J3109J8510l0848N697J0755J6753r921N913j9260
16637G287J7987J079k5112j4588N791j9865O394j8828m6835L023M204j2557K7257
16624f4763K7619K4281J0898L500l852L5745j7046J7676k1313j7905p364n065
16612a7589Q562l3172J4613K7952J8605j8139Q335Q8m2495N535O0422o238n3913
$$ plain form
16599 -27434 -57968 -51078 -59825 -38155 8043 -19963 -3931 21091 12778 28176 2380 -9851
16587 -9851 6170 13144 33681 22940 61756 54166 11207 7266 5190 -20472 -12444 43957 34285
16574 34285 12502 16408 -3310 -8668 29463 8027 -10482 -42890 -32116 -13869 -24765 -26183
16562 -26183 -50723 -39000 -2039 28661 16558 21876 -6937 -41149 -64977 -80315 -56070 -44562
16550 -44562 -74530 -27763 7836 -9425 -39857 -51327 -48815 -61978 -60599 -26773 -44724 -43563
16538 -43563 -19008 -16340 -51681 -58821 -54130 -45146 1826 -17675 -33276 -50664 -60811 -44564
16526 -44564 -55862 -28686 17730 38155 60624 584 -22029 -7712 -3627 19075 244 -15563
16514 -15563 3601 23545 21921 47999 52192 58181 11407 -32765 -85212 -50376 23008 27134
$$ packed form
16599b7434l0534O890q747K1670M6198k8006J6032K5022q313J5398k5796j2231
16587i851J6021O974K0537j0741L8816p590m2959l941k076k5662Q028N6401r672
16574C4285k1783L906j9718n358L8131k1436j8509l2408J0774J8247j0896j418
16562b6183k4540J1723L6961L0700j2103N318k8813l4212k3828j5338K4245J1508
16550d4562k9968M6767L5599j7261l0432j1470K512j3163J379L3826j7951J161
16538d3563K4555K668l5341p140M691Q984M6972j9501j5601j7388j0147J6247
16526d4564j1298K7176M6416K0425K2469o0040k2613J4317M085K2702j8831j5807
16514a5563J9164J9944j624K6078M193N989m6774m4172n2447L4836P3384M126
$$ plain form
16502 27134 29114 34115 31527 20531 -857 -61448 -75105 -31607 -39124 -29698 -47207 -62733 -53872
16489 -53872 -37939 6729 -14543 -37793 -8270 1782 -7210 6828 -9116 -29589 -38767 -55926
16477 -55926 -58209 -54924 -17799 -17258 3908 2849 19069 1204 -28837 -68047 -79346 -80800 -83792
16464 -83792 -71654 -27843 -36826 -84109 -102381 -86624 -69886 -49698 -38685 15510 56895 68946
16452 68946 78696 62177 7614 -20546 -30421 -27266 -45122 12179 39885 12909 58853 47955
16440 47955 17901 3618 -4998 20856 5895 -2843 -11710 -1598 1067 -9193 -24593 -29860 -30461
16427 -30461 -26216 -48483 11768 64500 -1508 -66278 -57761 -51209 -43200 -38231 8103 8078 -38157
16414 -38157 -25499 -10501 -31671 -49797 -57080 -63367 -92444 -82467 -46708 -49110 23378 58344
$$ packed form
16502B7134J980N001k588j0996k1388o0591j3657M3498p517R426j7509j5526Q861
16489e3872J5933M4668k1272k3250K9523J0052q992J4038j5944k0473r178j7159
16477e5926k283L285L7125N41K1166j059J6220j7865l0041l9210j1299j454k992
16464h3792J2138M3811q983m7283j8272J5757J6738K0188J1013N4195M1385J2051
16452F8946R750j6519n4563k8160r875L155j7856N7301K7706k6976M5944j0898
16440D7955l0054j4283q616K5854j4961q738q867J0112K665j0260j5400n267o01
16427c0461M245k2267O0251N2732o6008o4770Q517O552Q009M969M6334k5m6235
16414c8157J2658J4998k1170j8126p283o287k9077R977L5759k402P2488L4966
$$ plain form
16402 58344 65247 27046 14774 3424 -14087 15788 15510 8481 9356 29996 -1925 -14743 -14242
16389 -14242 -30713 -34455 -30341 14503 -15814 -43650 -44696 -26626 -12258 -18263 -23940 34036 26238
16376 26238 -6553 -24016 20454 23416 -14925 29066 21634 -12746 -17207 -9249 -6928 6072 28291
16363 28291 25469 20189 2351 -20499 -45351 -92320 -98808 -54184 -61346 -54745 -55962 -33414 -13984
16350 -13984 -31262 -40394 12842 5429 -15288 -24992 -31135 -10584 -50833 -48200 -28726 -46181 -12298
16337 -12298 1688 11056 -7100 -23803 -17025 -20510 -32320 -20870 12606 -7365 -29435 -45562
16325 -45562 -61479 -32526 397 22386 16597 10348 37272 6260 3270 -14169 -55510 -45870
16313 -45870 -2267 8951 5991 53106 121570 90547 4149 -8251 -35002 -67417 -73120 -88106
$$ packed form
16402E8344O903l8201j2272j1350j7511K9875k78p029Q75K0640l1921j2818N01
16389a4242j6471l742M114M4844l0317k7836j046J8070J4368o005n677N7976p798
16376B6238l2791j7463M4470K962l8341M3991p432l4380m461P958K321J3000K2219
16363B8291k822n280j7838k2850k4852m6969o488M4624p162O601j217K2548J9430
16350a3984j7278r132N3236p413k0717r704o143K0551m0249K633J9474j7455L3883
16337a2298J3986R368j8156j6703O778l485j1810J1450L3476j9971k2070j6127
16325d5562j5917K8953L2923K1989n789o249K6924l1012k990j7439m1341R640
16313d5870M3603J1218k960M7115O8464l1023q6398j2400k6751l2415n703j4986
$$ plain form
16301 -88106 -89143 -74676 -21271 -5436 7134 25725 -8598 -38306 -92140 -125369 -101838 -59914
16289 -59914 -37780 -9808 4256 1408 -7291 14334 30203 4015 -14877 5781 -12440 -31695
16277 -31695 -48048 5970 7829 -20655 -11277 -13406 -1359 28911 52559 34644 36617 24709
16265 24709 11542 -29643 -51689 -90117 -59055 -21212 -18786 -31428 -2271 9637 -32494 -55987
16253 -55987 -78056 -74851 -61750 -25975 -24439 -28227 -1027 -5474 8695 6818 12395 40445 22759
16240 22759 -2351 -25144 20813 13052 -3454 8825 -9792 20893 34765 12681 6903 -5893
16228 -5893 -1666 10400 -1425 11961 22755 32049 29195 14267 -11706 -22670 13481 25057
16216 25057 60378 60207 25442 -6647 -24467 -36661 -41974 -8823 28112 -21823 -25458 5245
$$ packed form
16301h8106j037J4467N3405J5835J2570J8591l4323k9708n3834l3229K3531M1924
16289e9914K2134K7972J4064k848q699K1625J5869k6188j8892K0658j8221j9255
16277c1695j6353N4018J859k8484R378k129J2047L0270K3648j7915J973j1908
16265B4709j3167m1185k2046l8428L1062L7843K426j2642K9157J1908m2131k3493
16253e5987k2069L205J3101L5775J536l788K7200m447J4169j877N577K8050j7686
16240B2759k5110k2793M5957p761j6506J2279j8617L0685J3872k2084n778j2796
16228e893M227J2066j1825J3386J0794R294k854j4928k5973j0964L6151J1576
16216B5057L5321j71l4765l2089j7820j2194n313L3151L6935m9935l635L0703
$$ plain form
16204 5245 50296 55957 13426 -24246 9538 47736 29418 133 -27157 -36206 1348 32632
16192 32632 18158 44133 63049 85093 56929 33923 47887 9706 -13068 5089 32284 56542
16180 56542 41372 44345 61834 69596 51687 34548 35508 34863 52854 57779 42028 14971 -26479
16167 -26479 -32454 -7616 -28202 -14296 27124 55554 47061 45722 52527 61581 49170 26332 28693
16154 28693 24591 24624 -9527 -12439 1087 31950 26533 5475 18662 28326 70619 23333 16568
16141 16568 50522 52852 57994 53695 32819 20448 -5095 -43061 -66453 -80068 -63293 -47591
16129 -47591 -75530 -33840 -29036 -45749 -8799 7646 -29686 24063 81283 69919 10363 -7952
16117 -7952 21546 46164 3092 2608 -2220 -19377 -18682 31062 66260 27496 31393 -7777 -24790
$$ packed form
16204E245M5051N661m2531l7672L3784L8198j8318k9285k7290r049L7554L1284
16192C2632j4474K5975J8916K2044k8164k3006J3964l8181k2774J8157K7195K4258
16180E6542j5170K973J7489P762j7909j7139R60o45J7991M925j5751k7057m1450
16167b6479n975K4838k0586J3906M1420K8430q493j339O805R054j2411k2838K361
16154B8693m102L3l4151k912J3526L0863n417k1058J3187R664M2293m7286o765
16141A6568L3954K330N142m299k0876j2371k5543l7966k3392j3615J6775J5702
16129d7591k7939M1690M804j6713L6950J6445l7332N3749N7220j1364n9556j8315
16117g952K9498K4618m3072m84m828j7157O95M9744L5198l8764L897l9170j7013
$$ plain form
16104 -24790 -31091 -18416 -29018 2486 31960 31998 10249 1173 14040 -10239 -57690 -66137 -24097
16091 -24097 1262 15937 29937 8642 18664 18524 23427 9407 -20317 -9551 -29296 1845
16079 1845 -18644 -38035 -40133 -41861 -62007 -83975 -64609 -72574 -84230 -89453 -65818 -45086 -27066
16066 -27066 37911 31010 22376 52393 30432 -11965 15615 5383 34013 77383 60822 41819
16054 41819 -3334 -25723 -35155 12809 28530 30809 21139 -857 26973 45298 33668 -26092
16042 -26092 -44659 -12186 -12159 -436 11485 8359 -12695 -29635 -43852 -26826 12822 -16011
16030 -16011 -31622 -15089 -10646 1948 -26015 -25008 -8286 -20605 -25236 -36318 -45855 -26217
16018 -26217 21002 -29850 -19342 -12426 -53221 -31364 -46863 -59571 -46215 -56646 -63276 -39725
$$ packed form
16104b4790o301J2675j0602L1504K9474L8k1749r076J2867k4279m7451q447M2040
16091b4097K5359J4675J4000k1295J0022j40M903j4020k9724J0766j9745L1141
16079A845k0489j9391k098j728k0146k1968J9366p965j1656n223K3635K0732J8020
16066b7066O4977o901q634L0017k1961m2397K7580j0232K8630M3370j6561j9003
16054D1819m5153k2389r432M7964J5721K279r670k1996K7830J8325j1630n9760
16042b6092j8567L2473K7J1723J1921l126k1054j6940j4217J7026L9648k8833
16030a6011j5611J6533M443J2594k7963J007J6722j2319m631j1082r537J9638
16018b6217M7219n0852J0508O916m0795K1857j5499j2708J3356j0431o630K3551
$$ plain form
16006 -39725 -10921 -956 -36417 -53425 -54057 -40910 -54896 -39817 -57715 -54812 -51750 -50597 -34515
15993 -34515 -54827 -80573 -75347 -58140 -43342 -26614 -24123 -25736 -46237 -14924 4717 -7921
15981 -7921 -26801 -66833 -94290 -52856 -33592 -49262 -48722 -8729 1432 9009 -34117 -40180 -7373
15968 -7373 -1450 14392 48317 43345 19442 -16735 6038 25132 4786 7778 10458 6617 -12592
15955 -12592 15571 -4187 -60829 -107387 -97798 -53566 -24616 -65365 -33921 33758 54940 67182
15943 67182 8226 -85851 -76865 -39515 -24119 31603 38341 34460 7583 4728 -53351 -65061
15931 -65061 -66236 -51900 -62611 -40775 -53870 -107668 -112043 -50761 2488 -23362 -40472 -39765
15919 -39765 -64587 -60449 -42499 -29306 -31268 -33193 -77020 -84061 -34373 23499 21836 -932 27245
$$ packed form
16006c9725K8804R965l5461j7008o32J3147j3986J5079j7898K903L062J153J6082
15993c4515k0312k5746N226J7207J4798J6728K491j613k0501L1313J9641j2638
15981g921j8880m0032k7457M1434J9264j5670N40L9993J0161P577m3126o063L2807
15968g373N923J5842L3925m972k3903l6177K2773J9094k0346K992K680l841j9209
15955a2592K8163j9758n6642m6558R589M4232K8950m0749L1444O7679K1182J2242
15943F7182n8956r4077Q986L7350J5396N5722O738l881k6877k855n8079j1710
15931f5061j175J4336j0711K1836j3095n3798m375O1282N3249k5850j7110P07
15919c9765k4822M138J7950J3193j962j925m3827p041M9688N7872j663k2768K8177
$$ plain form
15906 27245 34227 54661 53263 10570 18240 13579 -5859 -20897 3723 8747 -15131 -20590 -17840
15893 -17840 -28087 -3190 -9713 -17663 -8312 19898 17714 26114 26927 26388 32048 18701 24662 26104
15879 26104 9212 34060 69441 41073 31797 57490 85106 63701 21425 -14450 -12779 75810
15867 75810 61672 38910 21052 -8134 -9900 12477 -22123 -7612 -1842 -12272 -3261 -10998
15855 -10998 25815 68500 32735 20722 20729 -27632 -48549 -37334 -5073 -3482 -5651 7658 16530
15842 16530 -22629 3823 37337 22484 -28302 -41596 -66822 -41470 12506 -29490 -32409 -5496
15830 -5496 7392 -52761 -99239 -102118 -88740 -60236 -52076 -39336 -51410 -26644 -5454 9165
15818 9165 -3637 -37180 -19646 -14734 -38613 -73990 -41560 2560 28675 24395 24761 36652 25134
$$ packed form
15906B7245O982K0434j398m2693P670m661j9438j5038K4620N024k3878n459K750
15893a7840j0247K4897o523p950R351K8210k184Q400Q13n39N660j3347N961J442
15879B6104j6892K4848L5381k8368r276K5693K7616k1405m2276l5875J671Q8589
15867G5810j4138k2762j7858k9186j766K2377l4600J4511N770j0430R011p737
15855a0998L6813M2685l5765j2013Pm8361k0917J1215L2261J591k169J3309Q872
15842A6530l9159K6452L3514j4853n0786j3294k5226K5352N3976m1996k919K6913
15830e496J2888o0153m6478k879J3378K8504Q160J2740j2074K4766K1190J4619
15818I165j2802l3543J7534M912k3879l5377L2430M4120K6115m280L66J1891j1518
$$ plain form
15805 25134 -6190 8033 39640 50243 29059 51195 41852 48364 74202 60093 8085 25972
15793 25972 37372 32784 1795 -30777 -14191 24400 16726 11705 7606 -9227 -14044 -40070 -33462
15780 -33462 -4073 -21258 -7261 6846 -19601 -26348 -54023 -69021 -54360 -66416 -61927 -62164
15768 -62164 -33679 5419 -13840 -19524 -14213 17022 -11223 -13618 -5178 13419 -17777 -65404
15756 -65404 -31819 1151 30249 19110 22593 11816 31087 48094 23801 255 21203 31746
15744 31746 -13501 -37139 -14913 46962 68252 4272 -13858 43248 59898 14432 -33166 -36220
15732 -36220 -1015 12539 32996 55736 26796 31252 29801 -20966 3539 14245 18206 16791
15720 16791 9914 26634 34333 19288 -3879 -2223 45420 24958 21193 22595 33262 33440 41413
$$ packed form
15805B5134l1324J4223L1607J0603k1184K2136r343O512K5838j4109n2008J7887
15793B5972J1400m588l0989l2572J6586L8591p674n021m099j6833m817k6026O608
15780c3462K9389j7185J3997J4107k6447o747k7675j4998J4661j2056M489k37
15768f2164K8485L9098j9259n684N311L1235k8245k395Q440J8597l1196m7627
15756f5404L3585L2970K9098j1139L483j0777J9271J7007k4293k3546K0948J0543
15744C1746m5247k3638K2226O1875K1290o3980j8130N7106J6650m5466m7598l054
15732c6220L5205J3554K0457K2740k8940M456j451n0767K4505J0706L961j415
15720A6791o877J6720P699j5045k3167J656M7643k0462l765J402J0667J78P973
$$ plain form
15707 41413 23225 -10333 9903 44818 58772 94993 127761 106862 73175 7164 -9006 8145
15695 8145 -12708 -8106 25919 74823 59744 69178 47608 -904 -10951 31563 10742 23728
15683 23728 26643 -3090 -15090 15216 26347 22261 37624 19675 27358 24476 45999 40480 48918
15670 48918 15113 26590 -7423 -13981 -2141 -30595 -24555 1476 34264 14375 -11058 41164
15658 41164 21203 -13512 -25556 -40205 -74197 -109725 -65997 -6412 5674 -3858 -12765 -30770
15646 -30770 -51591 -4525 -3532 -17570 -7381 17915 18252 40387 48846 -2470 -44980 -41668 -2821
15633 -2821 45085 28325 -6570 -33713 -23109 -40436 -40654 -48543 -62935 -57163 -77949 -47992 -10938
15620 -10938 -6489 -28096 -63443 -63265 -46930 -75626 -50228 9819 -15243 -32788 -29782 -23472 -40160
$$ packed form
15707D1413j8188l3558K0236L4915J3954L6221L2768k0899l3687o6011j6170J7151
15695H145k0853M602L4025M8904j5079R434k1570m8512j0047M2514k0821J2986
15683B3728K915k9733j2000L0306J1131m086J5363j7949P683k882K1523n519Q438
15670D8918l3805J1477l4013o558J1840k8454O040K6031L2788j9889k5433N2222
15658D1164j9961l4715j2044j4649l3992l5528M3728N9585J2086r532q907j8005
15646c0770k0821M7066R93j4038J0189K5296L37K2135Q459n1316m2510L312L8847
15633b821M7906j6760l4895k7143J0604j7327k18p889j4392N772k0786K9957L7054
15620a0938M449k1607l5347J78J6335k8696K5398O0047k5062j7545L006O310j6688
$$ plain form
15607 -40160 -25825 -39947 -37640 -10659 4644 -13739 -61337 -62106 -22065 19221 61899 81373
15595 81373 68412 36964 29497 47964 60478 25568 448 18024 -8243 -26183 -16225 -11585
15583 -11585 -15115 -34579 -23101 19518 -2434 30234 35437 17141 29389 -22811 -27562 38338
15571 38338 98558 132200 112256 42770 6868 3426 20699 30381 -1482 -30998 -64302 -49636
15559 -49636 -41066 -36400 -28681 -29849 -45203 6346 5535 741 27441 37003 4229 -21182 -10765
15546 -10765 3403 12933 -8970 -15675 -660 -9111 -21302 -4312 -38247 -66882 -63927 -20037
15534 -20037 6788 -11653 -23200 -59747 -23236 -2192 -36083 -59679 -16687 -54397 -62394 -60371
15522 -60371 -73718 -17036 -19481 -18199 -33868 -23120 -71456 -96871 -64614 -12286 7275 -22804
$$ packed form
15607d0160J4335j4122K307K6981J5303j8383m7598p69M0041M1286M2678J9474
15595H1373j2961l1448p467J8467J2514l4910k5120J7576k6267j7940R958M640
15583a1585l530j9464J1478M2619k1952L2668N203j8296J2248n2200m751O5900
15571C8338O0220L3642j9944o9486l5902l442J7273R682l1863k9516l3304J4666
15559d9636Q570M666P719j168j5354N1549q11m794K6700R562l2774k5411J0417
15546a0765J4168R530k1903o705J5015q451j2191J6990l3935k8635K955M3890
15534b0037K6825j8441j1547l6547L6511K1044l3891k3596M2992l7710p997K023
15522f0371j3347N6682k445J282j5669J0748m8336k5415L2257N2328J9561l0079
$$ plain form
15510 -22804 -73937 -43659 -27688 -38728 -58982 -37647 -50317 -53639 -77949 -34886 -43700 -35745
15498 -35745 -885 38101 60356 40450 -27947 -32807 -21014 9485 3842 -8092 -49569 -50481
15486 -50481 -20303 21498 13225 -15289 15777 29564 34312 59245 56727 38807 38204 43276 40564
15473 40564 -20853 -4795 31062 -3680 1625 28240 35524 31955 31078 -7268 -5188 13593 24349
15460 24349 15538 6740 4002 9275 19431 -35127 -38263 -14259 6337 -3799 -25274 -50125 -53512
15447 -53512 -20223 -20572 -48062 -13647 3737 16423 3299 -35648 3419 -2040 -29496 -40499
15435 -40499 9824 -3255 -16908 -16061 -4295 19552 19171 13651 25764 34344 4984 21500 19038
15422 19038 -7837 -2342 17609 37537 53070 53474 44708 -2911 -37752 -9060 15154 18231 18866
$$ packed form
15510b2804n1133L0278J5971j1040k0254K1335j2670l322k4310M3063q814P955
15498c5745L4860L8986K2255j9906o8397m860J1793L0499n643j1934m1477r12
15486e0481L0178M1801q273k8514L1066J3787M748K4933k518j7920o03N072k712
15473D0564o1417J6058L5857l4742N305K6615P284l569q77l8346K080J8781J0756
15460B4349q811q798k738N273J0156n4558l136K4004K0596j0136k1475k4851l387
15447e3512L3289l49k7490L4415J7384J2686j3124l8947L9067n459k7456j1003
15435d0499N0323j3079j3653Q47J1766K3847l81n520J2113Q580k9360J6516k462
15422A9038k6875N495J9951J9928J5533M04q766m7619l4841K8692K4214L077O35
$$ plain form
15409 18866 3657 -5409 12920 12668 -8202 -4109 -2148 5049 10545 16791 21842 35202 25299 7248
15395 7248 28435 40271 53319 45923 49427 65145 83598 69912 63652 74636 35161 6426
15383 6426 -52289 -75115 -47662 -49866 -68467 -54356 -2073 11201 9118 -16773 -52170 -24696
15371 -24696 38397 76498 108618 83687 69714 85430 69500 34472 19234 29596 17210 1499
15359 1499 774 -12997 -41420 -60285 -14250 3020 -28291 20140 24403 -4528 -13069 -16638 -10246
15346 -10246 -5602 31254 3380 -23210 -45893 -41749 -847 -10719 220 10844 34073 31125
15334 31125 19747 31111 59326 68703 66209 34527 22124 13649 -38104 -58838 -83136 -74751
15322 -74751 -47232 -36017 -25873 -26602 -37141 -14920 11388 22788 13581 13420 25359 46100 37207
$$ packed form
15409A8866j5209r066J8329k52k0870M093J961P197N496O246N051J3360r903j8051
15395G248K1187J1836J3048p396L504J5718J8453j3686o260J0984l9475k8735
15383F426n8715k2826K7453k204j8601J4111N2283J3274k083k5891l5397K7474
15371b4696O3093L8101L2120k4931j3973J5716j5930l5028j5238J0362j2386j5711
15359A499p25j3771k8423j8865M6035J7270l1311M8431M263k8931q541l569O392
15346a0246M644L6856k7874k6590k2683M144M0902r872J0939J0624K3229k948
15334C1125j1378J1364K8215R377k494l1682j2403q475n1753k0734k4298Q385
15322g4751K7519J1215J0144p29j0539K2221K6308J1400r207j61J1939K0741q893
$$ plain form
15309 37207 16645 -18975 -7785 6617 7013 9564 30749 48361 36584 19649 -6594 16912
15297 16912 28417 46852 50106 10481 -34884 -37631 -31273 -12627 -28095 -14306 24001 11539
15285 11539 3372 4850 -41732 -53236 -26147 -14404 8470 15674 19233 -1146 -31098 -39231 -31922
15272 -31922 -35508 -23562 -7494 -54561 -32272 -2679 23306 20892 29100 26855 18895 54301 78191
15259 78191 71530 54741 8213 6568 -3367 6835 5734 23102 24374 22331 30173 24626 31979
15246 31979 21362 -9378 2293 18138 -1524 14806 29726 66755 91010 107258 80102 44806
15234 44806 19639 -22225 -62419 -54412 -4423 -17553 -14564 39583 36442 36787 20948 -32967 -78104
15221 -78104 -84893 -53910 -19594 -24529 -8890 -23954 -1752 38106 67997 38927 38974 23208 -5713
$$ packed form
15309C7207k0562l5620J1190J4402L96K551K1185J7612j1777j6935k6243K3506
15297A6912J1505J8435L254l9625m5365k747O358J8646j5468J3789L8307j2462
15285A1539q167J478m6582j1504K7089J1743K2874P204L559k0379k9952q133P309
15272c1922l586J1946J6068m7067K2289K9593K5985k414Q208k245p960L5406K3890
15259G8191o661j6789m6528j645r935J0202j101J7368J272k043P842n547P353
15246C1979j0617l0740J1671J5845j9662J6330J4920L7029K4255J6248k7156l5296
15234D4806k5167m1864m0194Q007M9989j3130K989N4147l141L45j5839n3915m5137
15221g8104o789L0983L4316m935J5639j5064K2202L9858K9891k9070M7j5766k8921
$$ plain form
15208 -5713 -20105 18326 19942 33639 46233 -566 7584 19274 12675 36824 64417 135034
15196 135034 113032 74784 22732 62329 98275 75452 37305 13138 80201 130589 137096 105786
15184 105786 44100 79172 102681 71210 42340 45564 38583 28172 11011 -11214 -11646 21221
15172 21221 60887 47717 46499 -8816 -29581 2789 -5678 -49711 -12002 47111 70891 72569
15160 72569 60862 57846 43355 39233 559 6454 1310 -14476 -27972 -67129 -72692 -21857 36597
15147 36597 22620 11514 7238 10520 -8632 -26495 -27171 -21865 1844 -5845 -5814 5560 4402 -50920
15133 -50920 -50332 -45864 -34011 -44698 -56054 -48368 -36574 -34150 -21297 -22631 -20451 31232 33831
15120 33831 28053 28473 26858 11796 -21423 -21470 2808 -5318 -34908 -1054 8863 -13492 -81399
$$ packed form
15208e713j4392L8431J616J3697J2594m6799Q150J1690o599K4149K7593P0617
15196A35034k2002l8248n2052L9597L5946k2823l8147k4167O7063N0388O507l1310
15184A05786o1686L5072K3509l1471k8870L224o981j0411j7161k2225m32L2867
15172B1221L9666j3170j218n5315k0765L2370q467m4033L7709N9113K3780J678
15160G2569j1707l016j4491m122l8674N895n144j5786j3496l9157n563N0835N8454
15147C6597j3977j1106m276L282j9152j7863o76N306K3709p689L1J1374j158n5322
15133e0920N88M468J1853j0687j1356P686J1794K424J2853j334K180N1683K599
15120C3831n778M20j615j5062l3219m7K4278q126k9590L3854R917k2355o7907
$$ plain form
15107 -81399 -79408 -54703 -28301 -16928 -18919 -16496 1274 26779 13321 -4376 -5573 -31058
15095 -31058 6466 36262 18779 24652 42281 26495 38222 45481 4418 19142 13251 23325
15083 23325 42588 71609 44427 -5997 -18682 8686 45954 54886 49676 13981 -17867 -45627
15071 -45627 19194 34147 34282 -3193 4260 28957 3245 37165 41050 7782 40501 2702
15059 2702 -40038 -37970 -32359 -29681 -26383 3123 6199 -31166 -16428 -15431 4333 17898 13635
15046 13635 -8180 3521 -3194 21051 26945 67410 70807 32634 59832 94778 92758 36275
15034 36275 -816 -33451 -35003 6794 16486 28746 29747 57548 77379 64972 20390 -15199
15022 -15199 8445 5354 10589 17019 -5317 -15600 -5451 24071 37022 27093 34748 52682 75843
$$ packed form
15107h1399J991K4705K6402J1373j991K423J7770K5505j3458j7697j197k5485
15095c1058L7524K9796j7483N873J7629j5786J1727P259m1063J4724n891J0074
15083B3325J9263K9021k7182n0424j2685K7368L7268Q932n210l5695l1848k7760
15071d5627O4821J4953J35l7475P453K4697k5712L3920L885l3268L2719l7799
15059B702m2740K068N611K678L298K9506L076l7365J4738R97J9764J3565m263
15046A3635k1815J1701o715K4245N894M0465L397l8173K7198L4946k020n6483
15034C6275l7091l2635j552M1797R692J2260J001K7801J9831j2407m4582l5589
15022a5199K3644l091N235O430k2336j0283J0149K9522J2951r929P655J7934K3161
$$ plain form
15009 75843 122028 138613 89928 74471 55297 30419 -1090 -15744 -16140 11873 47177 59829
14997 59829 73510 35478 11725 38435 37885 18284 -33639 -2807 23052 32734 32623 15380 19243
14984 19243 -9645 -11539 -21240 -44480 -67287 -45493 5341 -4739 -1859 34587 -988 -15303
14972 -15303 -16176 -31410 -46367 -42834 -69848 -64789 -68858 -70599 -37534 -35317 -52523 -83081 -44576
14959 -44576 -31936 -10210 27379 39367 8794 -5972 -25265 -43858 -20345 -7283 -19280 -39995
14947 -39995 -31980 -49887 -49061 -50262 -3072 30285 21818 41054 42681 -8653 -8699 -1762 -14125 6296
14933 6296 42372 71107 55620 16522 6566 7449 -15083 13488 22133 25430 32751 1612 2136
14920 2136 31318 37648 22160 3252 -33013 -65435 -25155 27947 43904 7514 -13112 -5983
$$ packed form
15009G5843M6185J6585m8685j5457j9174k4878l1509j4654l96K8013L5304J2652
14997E9829J3681l8032k3753K6710n50j9601n1923L0832K5859R682j11j7243L863
14984A9243k8888j894r701k3240k2807K1794N0834j0080K880L6446l5575j4315
14972a5303q73j5234j4957L533k7014N059m069j741L3065K217j7206l0558L8505
14959d4576J2640K1726L7589J1988l0573j4766j9293j8593K3513J3062j1997k0715
14947c9995Q015j7907Q26j201M7190L3357q467J9236J627n1334m6O937j2363K0421
14933F296L6076K8735j5487l9098r956Q83k2532K8571Q645L297P321l1139N24
14920B136K9182O330j5488j8908l6265l2422M0280N3102J5957l6390k0626P129
$$ plain form
14908 -5983 24178 -5940 -37820 -31761 -18256 -8976 -33272 -43426 -1755 -29568 -48230 -8260
14896 -8260 20180 -10097 -14125 17865 32759 11831 31190 58394 74064 49704 -19262 -41728
14884 -41728 -21540 -2995 6618 11963 31228 54464 61418 26735 -8294 -45211 -76341 -85475
14872 -85475 -67975 -73582 -86024 -35119 -27047 -33849 -12672 16167 35026 25023 5150 20801
14860 20801 23520 -28819 -25284 -10965 8837 76384 58778 -9154 -5372 -34151 -27944 -1375
14848 -1375 49796 38722 23883 33117 -873 -56094 -86284 -67478 -26815 -24931 -36956 -51335
14836 -51335 -23927 16900 8265 -6389 2119 51618 43904 26381 21476 44260 4759 -35058
14824 -35058 -44213 -21369 -31035 450 19787 11796 7725 35298 25971 13671 17093 10547 -15140
$$ packed form
14908e983L0161l0118l1880O059J3505R280k4296j0154M1671k7813j8662L9970
14896h260K8440l0277m028L1990J4894k0928J9359K7204J5670k4360o8966k2466
14884d1728K0188J8545R613N345J9265K3236O954l4683l5029l6917l1130r134
14872h5475J7500n607j2442N0905Q072o802K1177K8839J8859j0003j9873J5651
14860B0801K719n2339L535J4319J9802O7547j7606o7932L782k8779O207K6569
14848a375N1171j1074j4839R234l3990n5221l0190J8806M0663J884j2025j4379
14836e1335K7408M0827q635j4654Q508M9499p714j7523m905K2784l9501l9817
14824c5058r155K2844r666L1485J9337p991m071K7573r327j2300L422o546k5687
$$ plain form
14811 -15140 -12945 774 -23263 -21111 9036 18837 81468 75037 78845 82117 95900 49828 -11995
14798 -11995 -48569 -36213 -33439 15648 55177 19225 -17801 -2572 16031 40284 36177 8215
14786 8215 -16718 -1429 -16845 -487 33178 9437 -9268 -12483 7144 5427 -15119 15981
14774 15981 49974 3135 3948 10272 -34372 -38958 16735 25826 22943 40440 32597 -19222 -16755
14761 -16755 -11591 867 -12968 -34172 -32535 -55078 -65479 -49377 967 7046 43823 12090
14749 12090 -14087 -49359 -56500 -43956 -12707 17688 3185 -7380 -14277 22112 40850 49410
14737 49410 30755 -15954 -27548 -41681 -51220 -11069 3894 29864 60012 54365 21614 -23957
14725 -23957 -71045 -58626 -20445 -7556 22691 62371 74108 85980 85170 62532 52349 25260
$$ packed form
14811a5140K195J3719k4037K152L0147R801O2631o431L808L272J3783m6072o1823
14798a1995l6574J2356K774M9087L9529l5952l7026J5229J8603K4253m107k7962
14786H215k4933J5289j5416J6358L3665k3741j8705l215J9627j717k0546L1100
14774A5981L3993m6839Q13O324m4644m586N5693R091k883J7497p843n1819K467
14761a6755N164J2458j3835k1204J637k2543j0401J6102N0344O079L6777l1733
14749A2090k6177l5272p141J2544L1249L0395j4503j0565o897L6389J8738Q560
14737D9410j8655m6709j1594j4133r539M0151J4963K5970L0148n647l2751m5571
14725b3957m7088J2419L8181J2889L0247L9680J1737J1872q10k2638j0183k7089
$$ plain form
14713 25260 36500 34161 17185 -15890 -25251 -14661 -2259 -5245 11071 30273 10535 5337
14701 5337 -10253 12035 43352 41201 41838 7499 -3295 16125 -58 32443 24782 -26219 -21470
14688 -21470 -22295 25659 28355 -22505 -59831 -32955 -13648 -4344 -30263 -9510 39515 73012
14676 73012 70970 14563 10421 12993 -12274 -21940 15031 35443 54168 74247 92867 57080
14664 57080 7075 -18240 -963 23462 22458 -28863 -55729 -66628 -54073 -11688 43160 50621
14652 50621 8221 -21703 -23349 36804 106763 105460 70839 48960 46433 31208 -24426 -26027
14640 -26027 2135 11231 8200 8218 -17907 -46526 -47958 -53147 -40993 -52210 -48837 -38481 -44270
14627 -44270 -71813 -65398 -9192 -6377 -44299 -16843 -14344 6143 -68280 -88075 -52486 -53561
$$ packed form
14713B5260J1240k339j6976l3075r361J0590J2402k986J6316J9202j9738n198
14701E337j5590K2288L1317k151O37l4339j0794J9420j6183L2501p661n1001M749
14688b1470q25M7954K696n0860l7326K6876J9307R304k5919K0753M9025L3497
14676G3012k042n6407m142K572k5267r666L6971K0412J8725K0079J8620l5787
14664E7080n0005k5315J7277K4425j004n1321k6866j0899J2555M2385N4848P461
14652E0621m2400k9924j646O0153O9959j303l4621k1879k527j5225n5634j601
14640b6027K8162R096l031J8k6125k8619j432n189J2154j1217L373J0356n789
14627d4270k7543O415N6206K815l7922K7456K499K0487p4423j9795L5589j075
$$ plain form
14615 -53561 -86165 -111600 -70596 -36268 -19595 -45309 -58494 -53904 -27548 -4787 -32281 -27175
14603 -27175 -16136 -21684 -25512 -57085 -72635 -44201 -10268 -4223 4294 -5254 221 -13860 39437
14590 39437 53119 35521 9458 -38625 -31441 -43228 -2440 3105 -8769 6884 -8597 -10998
14578 -10998 12397 -4134 -7438 23744 51183 21499 14441 -12125 4729 35230 18445 -842
14566 -842 -16915 -58794 -56730 -56025 -31160 -26871 -32055 -69550 -57579 -39771 -36222 2349 31064
14553 31064 50080 22669 -9297 -29161 -7007 -19462 -27240 12241 -8748 -12299 -25923 -2536
14541 -2536 -2787 -58291 -133028 -142125 -101305 -78156 -69272 -58968 -24688 -74667 -82978 -72171 -67275
14528 -67275 -62616 -67866 -55393 -42552 -66135 -66932 -1438 32691 6606 -13211 22358 63669
$$ packed form
14615e3561l2604k5435M1004L4328J6673k5714j3185M590K6356K2761k7494N106
14603b7175J1039n548l828l1573j5550K8434L3933O045Q517r548N475j4081N3297
14590C9437J3682j7598k6063m8083P184j1787M0788N545j1874J5653j5481k401
14578a0998K3395j6531l304L1182K7439k9684p058k6566J6854L0501j6785j9287
14566h42j6073m1879K064P05K4865M289n184l7495J1971J7808L549L8571K8715
14553C1064J9016k7411l1966j9864K2154j2455p778L9481k0989l551j3624K3387
14541b536k51n5504p4737r097M0820K3149Q884J0304L4280m9979q311J0807M896
14528f7275M659n250J2473J2841k3583p97O5494L4129k6085j9817L5569M1311
$$ plain form
14516 63669 61770 21234 13997 20224 26660 42501 33175 26898 41238 55566 46827 55075 15789
14503 15789 -26657 -42557 -37314 -54671 -1537 63013 59933 47135 -16353 -67517 -63852 -34826
14491 -34826 -18569 7401 35559 34593 -16982 -33403 -19133 13021 10693 -1238 -34153 -18855
14479 -18855 19579 9234 -9579 -2382 -38771 -56358 -59992 -18580 -987 -14010 -36212 -59609
14467 -59609 -62398 -33126 -34513 -35278 -9644 -8793 9514 12808 9666 -18447 -46360 -25898 -6641
14454 -6641 -26198 -9098 -44203 -28314 16959 40134 29494 16439 -20546 -53544 -26309 42166
14442 42166 44914 50195 17542 -2725 -51570 -51280 -26416 -50144 -66488 -105488 -122889 -97122
14430 -97122 -66065 -52786 -56413 -36385 -24157 -20462 -11483 30189 37634 40359 67240 91035 68269
$$ packed form
14516F3669j899m0536p237O227O436J5841r326o277J4340J4328q739Q248l9286
14503A5789m2446j5900N243j7357N3134O4550l080j2798o3488n1164L665K9026
14491c4826J6257K5970K8158r66n1575j6421J4270L2154k328j1931l2915J5298
14479a8855L8434j0345j8813P197l6389j7587l634M1412J7593j3023k2202k3397
14467e9609k789K9272j387p65K5634Q51J8307L294l142k8113k7913K0462J9257
14454f641j9557J7100l5105J5889M5273K3175j0640j3055l6985l2998K7235O8475
14442D2166K748N281l2653k0267m8845K90K4864k3728j6344l9000j7401K5767
14430i7122L1057J3279l627K0028J2228L695Q979M1672P445K725K6881K3795k2766
$$ plain form
14417 68269 16164 -24768 13068 3929 2621 19163 48425 31454 47424 48867 44255 12605
14405 12605 -9463 2108 -27099 -51393 -39991 -22129 -26440 -47198 -6847 30985 6098 3944
14393 3944 57231 25543 -8052 -20069 -9305 -23760 -46232 -28216 -26044 1041 -20877 -32324
14381 -32324 -34849 -3591 -1047 22735 3134 -6861 7038 583 -8799 14968 29525 6439 -6395
14368 -6395 -15004 6520 12952 8441 -2364 -16340 -19692 20286 25246 -7706 -24842 -38156 -34311
14355 -34311 -4026 23290 -44329 -62294 -35628 2988 13823 45059 46536 -12913 -34663 -32747
14343 -32747 -39445 -29712 -36790 -36964 -32780 -19463 -33191 -48656 -57496 -38127 -12760 38952 59393
14330 59393 76744 46657 22938 22209 60552 50285 42751 2607 11092 51435 96573 75955
$$ packed form
14417F8269n2105m0932L7836r139j308J6542K9262j6971J5970J443m612l1650
14405A2605k2068J1571k9207k4294J1402J7862m311k0758M0351L7832k4887k154
14393C944N3287l1688l3595j2017J0764j4455k2472J8016K172K7085k1918j1447
14381c2324k525L1258K544K3782j9601r995J3899o455r382K3767J4557k3086j2834
14368f395q609K1524O432m511j0805j3976l352L9978M960l2952j7136j3314L845
14355c4311L0285K7316o7619j7965K6666L8616J0835L1236J477n9449k1750J916
14343c2747o698R733p078j74M184J3317j3728j5465q840J9369K5367N1712K0441
14330E9393J7351l0087k3719p29L8343j0267p534m0144Q485M0343M5138k0618
$$ plain form
14318 75955 47530 30957 24769 -9297 9097 10389 -15068 -5850 3299 -4205 35586 68048 112409
14305 112409 97481 83517 34927 7285 24147 -1653 20590 -134 -1291 -9695 10759 7098
14293 7098 -45577 -40015 -4479 -28794 -31783 -20482 -12732 14654 38589 26594 -2970 -18727
14281 -18727 -6135 -28468 -40426 -48918 -90169 -94564 -45770 15347 77045 92138 76420 45001
14269 45001 10200 13255 1920 4666 23836 24314 9234 15312 44030 5228 -46462 -30429 -4913
14256 -4913 -43362 -82542 -51899 -10380 10151 -26389 -31995 -72541 -29506 12101 67807 49970
14244 49970 19754 20724 41985 41588 72137 61838 9474 -47925 -19856 5045 21379 22631 43486
14231 43486 32209 34845 33121 -12419 -18258 -33553 -14817 30787 57092 77798 26067 35145
$$ packed form
14318G5955k8425j6573o188l4066J8394J292k5457R218R149p504L9791L2462M4361
14305A12409j4928j3964m8590k7642J6862k5800K2243k0724j157q404K0454l661
14293G098n2675N562L5536k4315k989J1301P750K7386K3935j1995k9564j5757
14281a8727J2592k2333j1958q492m1251m395M8794O1117O1698J5093j5718l1419
14269D5001l4801L055j1335K746J9170M78j5080O078K8718l8802n1690J6033K5516
14256d913l8449l9180L0643M1519K0531l6540n606m0546M3035M1607N5706j7837
14244D9970l0216R70K1261l97L0549j0299n2364n7399K8069K4901J6334J252K0855
14231D3486j1277K636j724m5540n839j5295J8736M5604K6305K0706n1731R078
$$ plain form
14219 35145 50717 12641 18756 50643 61669 30263 47297 42349 73184 57296 30444 22457
14207 22457 7002 20610 45036 12444 3151 11862 5547 -21001 -19859 -10530 -10184 -12169 -6526
14194 -6526 -58125 -81186 -41375 -15101 -22943 -39704 -19331 -8563 -27451 -18686 -1386 -16580
14182 -16580 -58357 -12516 4303 210 5868 24272 36122 69482 55667 -2185 -66651 -61421
14170 -61421 -32563 -40782 -60103 -67079 -66185 -57005 -10924 -21237 -38542 -24195 -1969 24734 32090
14157 32090 13055 -27395 -18492 -7454 21212 49742 45943 19230 -2534 -699 12074 31466
14145 31466 48279 59320 25994 19092 25739 15199 44472 28288 47803 56212 18662 20295
14133 20295 28883 2885 -20489 -22342 -22894 -7990 25817 56957 47132 90238 93591 27172 8647
$$ packed form
14219C5145J5572l8076O115L1887J1026l1406J7034m948L0835j5888k6852p987
14207B2457j5455J3608K4426l2592r293Q711o315k6548J142R329L46j985N643
14194f526n1599k3061L9811K6274p842j6761K0373J0768j8888Q765J7300j5194
14182a6580m1777M5841J6819m093N658J8404J1850L3360j3815n7852o4466N230
14170f1421K8858q219j9321o976Q94R180M6081j0313j7305J4347K2226K6703P356
14157C2090j9035m0450Q903J1038K8666K8530l799k6713k1764J835J2773J9392
14145C1466J6813J1041l3326o902O647j0540K9273j6184J9515Q409l7550J633
14133B0295Q588k5998k3374j853n52J4904L3807L1140r825M3106L353o6419j8525
$$ plain form
14120 8647 22417 8690 -47872 -72802 -67284 -40158 -31912 -36352 -6021 -4309 9793 17332 50004
14107 50004 42098 -14527 -17783 39560 91542 83740 55069 78722 54135 -20643 -7076 54266
14095 54266 28928 10719 8349 -46414 -33232 -41139 -5067 27982 61631 59250 17704 -10539
$$ packed form
14120H647J3770j3727n6562k4930N518K7126Q246m440L0331J712J4102P539L2672
14107E0004p906n6625l256N7343N1982p802k8671K3653k4587p4778J3567O1342
14095E4266k5338j8209k370n4763J3182p907L6072L3049L3649k381m1546k8243
$$ [...]
##END NTUPLES=NMR SPECTRUM
##END=
