##TITLE=Analysis number 314887
Compound Code ac 17386
Project Code adrs
Chemist Name molekula
##JCAMPDX= 6.0         $$ Bruker NMR JCAMP-DX V2.0
##DATA TYPE= NMR SPECTRUM
##DATA CLASS= NTUPLES
##ORIGIN= Bruker BioSpin GmbH
##OWNER= NMR
$$ XWIN-NMR		Version 3.5
$$ Fri Oct 28 14:30:04 2005 GMT Daylight Time (UT+1h)  MAYBRIDGE\NMR@NMR_250MHZ
##.OBSERVE FREQUENCY= 250.131544655141
##.OBSERVE NUCLEUS= ^1H
##.ACQUISITION MODE= SIMULTANEOUS (DQD)
##.ACQUISITION SCHEME= undefined
##.AVERAGES= 16
##.DIGITISER RES= 18
##SPECTROMETER/DATA SYSTEM= dpx250
##.PULSE SEQUENCE= zg30
##.SOLVENT NAME= CDCl3
##.SHIFT REFERENCE= (INTERNAL, CDCl3, 0, 16.522)
##AUDIT TRAIL= $$ (NUMBER, WHEN, WHO, WHERE, WHAT)
$$ ##TITLE= Audit trail, XWIN-NMR		Version 3.5
$$ ##JCAMPDX= 5.01
$$ ##ORIGIN= Bruker BioSpin GmbH
$$ ##OWNER= NMR
$$ C:\u/data/dgb/nmr/ADRS/11590/pdata/1/auditp.txt
$$ ##AUDIT TRAIL=  $$ (NUMBER, WHEN, WHO, WHERE, WHAT)
(   1,<2005-10-28 14:29:44.60 +100>,<MAYBRIDGE\NMR>,<NMR_250MHZ>,
      <created by zg, POWCHK disabled, PULCHK disabled
       configuration hash MD5:
       62 19 C7 07 E1 42 D1 B7 37 6C 3D D0 77 39 F9 E6
       data hash MD5: 64K
       9B 83 3C 53 D4 87 53 55 52 42 19 65 28 C7 14 F8>)
(   2,<2005-10-28 14:29:56.52 +100>,<MAYBRIDGE\NMR>,<NMR_250MHZ>,
      <Start of raw data processing
       ef LB = 0.3 FT_mod = 6 PKNL = 1 SI = 32K 
       data hash MD5: 32K
       A7 2A F1 C7 32 85 A3 93 21 99 5F 60 BB DE 63 8D>)
(   3,<2005-10-28 14:29:58.57 +100>,<MAYBRIDGE\NMR>,<NMR_250MHZ>,
      <apk 
       data hash MD5: 32K
       A2 A0 FF F2 EB 37 31 EE 02 D0 E9 27 04 AA 05 69>)
(   4,<2005-10-28 14:29:59.30 +100>,<MAYBRIDGE\NMR>,<NMR_250MHZ>,
      <abs ABSG = 5 
       data hash MD5: 32K
       AC 0C EA C1 F2 5B FD 45 43 AA A2 B3 BA E5 88 24>)
$$ ##END=
$$ 
$$ hash MD5
$$ 45 3F 82 86 F7 43 2D 5E 2C 3B B2 12 9D 01 04 9C
##$RELAX= 
##$RELAX= 
##$RELAX= 
##$RELAX= 
##$RELAX= 
##$RELAX= 
##$RELAX= 
$$ Bruker specific parameters
$$ --------------------------
##$DU= <C:\u>
##$EXPNO= 11590
##$NAME= <ADRS>
##$PROCNO= 1
##$TYPE= <nmr>
##$USER= <dgb>
##$AMP= (0..31)
100 100 100 100 100 100 100 100 100 100 100 100 100 100 100 100 100 100 
100 100 100 100 100 100 100 100 100 100 100 100 100 100 
##$AQSEQ= 0
##$AQ_mod= 3
##$AUNM= <au_zg>
##$AUTOPOS= <2 >
##$BF1= 250.13
##$BF2= 250.13
##$BF3= 250.13
##$BF4= 250.13
##$BF5= 500.13
##$BF6= 500.13
##$BF7= 500.13
##$BF8= 500.13
##$BYTORDA= 1
##$CFDGTYP= 0
##$CFRGTYP= 5
##$CHEMSTR= <none>
##$CNST= (0..31)
1 1 145 1 1 1 1 1 1 1 1 1 1 1 1 1 1 1 1 1 1 1 1 1 1 1 1 1 1 1 1 1 
##$CPDPRG= <>
##$CPDPRG1= <>
##$CPDPRG2= <>
##$CPDPRG3= <>
##$CPDPRG4= <mlev>
##$CPDPRG5= <mlev>
##$CPDPRG6= <mlev>
##$CPDPRG7= <mlev>
##$CPDPRG8= <mlev>
##$CPDPRGB= <>
##$CPDPRGT= <>
##$D= (0..31)
0 1 0 0 0 0 0 0 0 0.06 0 0 0 0 0 0 0.0002 0 0 0 0 0 0 0 0 0 0 0 0 0 0 
0 
##$DATE= 1130506183
##$DBL= (0..7)
120 120 120 120 120 120 120 120 
##$DBP= (0..7)
150 150 150 150 150 150 150 150 
##$DBP07= 0
##$DBPNAM0= <>
##$DBPNAM1= <>
##$DBPNAM2= <>
$$ [...]
##$SUBNAM7= <"">
##$SUBNAM8= <"">
##$SUBNAM9= <"">
##$SW= 20.6930455092707
##$SWIBOX= (0..15)
0 0 3 0 0 0 0 0 0 0 0 0 0 0 0 0 
##$SW_h= 5175.983436853
##$TD= 65536
##$TD0= 1
##$TE= 296.16
##$TE2= 300
##$TE3= 300
##$TEG= 300
##$TL= (0..7)
0 120 120 120 120 120 120 120 
##$TP= (0..7)
150 150 150 150 150 150 150 150 
##$TP07= 0
##$TPNAME0= <>
##$TPNAME1= <>
##$TPNAME2= <>
##$TPNAME3= <>
##$TPNAME4= <>
##$TPNAME5= <>
##$TPNAME6= <>
##$TPNAME7= <>
##$TPOAL= (0..7)
0.5 0.5 0.5 0.5 0.5 0.5 0.5 0.5 
##$TPOFFS= (0..7)
0 0 0 0 0 0 0 0 
##$TUNHIN= 0
##$TUNHOUT= 0
##$TUNXOUT= 0
##$USERA1= <user>
##$USERA2= <user>
##$USERA3= <user>
##$USERA4= <user>
##$USERA5= <user>
##$V9= 5
##$VALIST= <valist>
##$VCLIST= <CCCCCCCCCCCCCCC>
##$VD= 0
##$VDLIST= <DDDDDDDDDDDDDDD>
##$VPLIST= <PPPPPPPPPPPPPPP>
##$VTLIST= <TTTTTTTTTTTTTTT>
##$WBST= 1024
##$WBSW= 4
##$XGAIN= (0..3)
0 0 0 0 
##$XL= 0
##$YL= 0
##$YMAX_a= 756884
##$YMIN_a= -738483
##$ZGOPTNS= <>
##$ZL1= 120
##$ZL2= 120
##$ZL3= 120
##$ZL4= 120
##$ABSF1= 16.522
##$ABSF2= -4.171173
##$ABSG= 5
##$ABSL= 3
##$ALPHA= 0
##$AQORDER= 0
##$ASSFAC= 0
##$ASSFACI= 0
##$ASSFACX= 0
##$ASSWID= 0
##$AUNMP= <proc_1d>
##$AZFE= 0.1
##$AZFW= 0.1
##$BCFW= 0
##$BC_mod= 0
##$BYTORDP= 0
##$COROFFS= 0
##$CY= 12.5
##$DATMOD= 1
##$DC= 0
##$DFILT= <>
##$DTYPP= 0
##$F1P= 14.0000005364418
##$F2P= -0.99999901652339
##$FCOR= 0.5
##$FTSIZE= 32768
##$FT_mod= 6
##$GAMMA= 0
##$GB= 0
##$INTBC= 1
##$INTSCL= 1
##$ISEN= 128
##$LB= 0.3
##$LEV0= 0
##$LPBIN= 0
##$MAXI= 10000
##$MC2= 0
##$MEAN= 0
##$ME_mod= 0
##$MI= 0
##$NCOEF= 0
##$NC_proc= -2
##$NLEV= 6
##$NOISF1= 0
##$NOISF2= 0
##$NSP= 0
##$NTH_PI= 0
##$NZP= 0
##$OFFSET= 16.522
##$PC= 1
##$PHC0= 71.0108
##$PHC1= 4.502661
##$PH_mod= 1
##$PKNL= yes
##$PPARMOD= 0
##$PSCAL= 4
##$PSIGN= 0
##$REVERSE= no
##$SF= 250.13
##$SI= 32768
##$SIGF1= 0
##$SIGF2= 0
##$SINO= 400
##$SIOLD= 32768
##$SREGLST= <1H.CDCl3>
##$SSB= 0
##$STSI= 32768
##$STSR= 0
##$SW_p= 5175.98343685301
##$SYMM= 0
##$S_DEV= 0
##$TDeff= 65536
##$TDoff= 0
##$TI= <Analysis number 999999
Compound Code 99
Book Reference 9
Project Code 9>
##$TILT= no
##$TM1= 0
##$TM2= 0
##$TOPLEV= 0
##$USERP1= <user>
##$USERP2= <user>
##$USERP3= <user>
##$USERP4= <user>
##$USERP5= <user>
##$WDW= 1
##$XDIM= 32768
##$YMAX_p= 394864714
##$YMIN_p= -109639
$$ End of Bruker specific parameters
$$ ---------------------------------
##NTUPLES= NMR SPECTRUM
##VAR_NAME=  FREQUENCY,     SPECTRUM/REAL,   SPECTRUM/IMAG
##SYMBOL=    X,             R,               I
##VAR_TYPE=  INDEPENDENT,   DEPENDENT,       DEPENDENT
##VAR_FORM=  AFFN,          ASDF,            ASDF
##VAR_DIM=   32768,         32768,           32768
##UNITS=     HZ,            ARBITRARY UNITS, ARBITRARY UNITS
##FACTOR=    0.157963299565203, 1,           1
##FIRST=     4132.6476996994, 0,             0
##LAST=      -1043.33573715361, 0,           0
##MIN=       -1043.33573715361, -109639,     0
##MAX=       4132.6476996994, 394864714,     0
$$ Real data points
##PAGE= N=1
##DATA TABLE= (X++(R..R)), XYDATA
$$ [...]
$$ plain form
29046 1739 4075 3937 1191 -2566 -1685 -2532 -4083 -1921 -3437 -931 -645 1471 -401 4897 7788 3085
29030 3085 1999 -844 122 1284 -936 1717 6980 14360 20096 12923 12678 8579 4597 4725 -1865
29015 -1865 459 280 637 -37 5963 3886 5261 2776 -2511 284 10468 12766 7984 2648 7403
29000 7403 11768 10283 10165 9797 3383 -1508 2359 4665 3512 6129 16048 14792 8609 5691 5997
28985 5997 6526 13243 14438 15566 14919 8986 1767 1180 6416 9775 6837 2658 -928 -894 -2070 -6004
28969 -6004 -9113 -10080 -3995 5766 8123 13213 8753 6704 1095 -1036 2906 9993 5462 -1992 -2311
28954 -2311 -1876 -3846 -5483 -6941 -1128 8137 2578 -2953 -2538 -2671 -1542 -2875 -4776 -879 2534
28939 2534 8357 11810 11750 15446 18872 7820 473 -1780 -7912 -10229 -8553 -7958 -4537 -3322 -4083
$$ packed form
29046A739K336j38k746l757Q81q47j551K162j516K506K86K116j872N298K891m703
29030C085j086k843R66J162k220K653N263P380N736p173k45m099l982J28o590
29015a865K324j79L57o74O000k077J375k485n287K795J0184K298m782n336M755
29000G403M365j485j18l68o414m891L867K306j153K617R919j256o183k918L06
28985E997N29O717J195J128o47n933p219n87N236L359k938m179l586L4j176l934
28969f004l109r67O085R761K357N090m460k049n609k131L942P087m531p454l19
28954b311M35j970j637j458N813R265n559n531M15j33J129j333j901L897L413
28939B534N823L453o0L696L426j1052p347k253o132k317J676N95L421J215p61
$$ plain form
28924 -4083 -1970 4971 10918 12459 12992 10608 7416 4289 -1957 -8048 -5039 -2071 -875 -980 -4314
28909 -4314 -8009 -14789 -12092 -9261 -2635 3637 3893 8546 14307 14295 14803 6409 -221 6915 8589 5965
28893 5965 8088 5724 7075 6633 6646 3888 5879 3819 -2546 -10717 -10369 -3486 2617 6180 8494 8827
28877 8827 7285 2518 4418 5433 4593 694 -1698 -5349 -8476 -79 2589 2899 -281 -6250 -11303
28862 -11303 -2554 2658 4697 -852 -3183 -2237 2010 -1376 -5985 -8214 1521 9623 8456 5990 6880
28847 6880 8684 8538 6181 2631 -2856 -3598 5871 10343 12578 7345 5616 -3248 -6460 3575 921
28832 921 133 -3980 -2125 -3860 -1584 3486 5542 3995 7197 373 -5993 -4497 -5930 -2859 -2456
28817 -2456 -4866 -3009 2588 2112 -5982 -4706 -2644 443 1561 4976 139 -2281 -6697 124 6081
$$ packed form
28924d083K113O941N947J541N33k384l192l127o246o091L009K968J196j05l334
28909d314l695o780K697K831O626O272K56M653N761j2N08q394o630P136J674k624
28893E965K123k364J351m42J3k758J991k060o365q171L48O883O103L563K314L33
28877H827j542m767J900J015q40l899k392l651l127Q397K668L10l180n969n053
28862a1303Q749N212K039n549k331R46M247l386m609k229R735Q102j167k466Q90
28847F880J804j46k357l550n487p42R469M472K235n233j729q864l212J0035k654
28832I21p88m113J855j735K276N070K056j547L202o824o366J496j433L071M03
28817b456k410J857N597m76q094J276K062L087J118L415m837k420m416O821N957
$$ plain form
28802 6081 4788 -1318 4440 5136 1954 -5214 -2637 -3393 -5743 -3409 -3980 36 -855 -4808 -7500 -6936
28786 -6936 -5566 -672 7703 9760 8066 3718 -516 -852 3773 3655 -5582 -9691 -5301 357 -3994
28771 -3994 -12271 -10574 -6118 3162 3098 -2476 -449 46 -3132 -9631 -368 292 2081 5284 4414 8693
28755 8693 16051 2818 -4636 2010 1451 3328 -1200 -5806 -1334 1722 2677 2212 4205 5294 4638
28740 4638 2959 4629 3116 7470 8607 6126 7941 5829 770 4442 7299 9559 6959 2664 798
28725 798 -4893 -5973 -6462 -6801 -4869 -169 2971 -1686 -1235 -7766 -5866 -4309 -10551 -7303 -12829 -15847
28709 -15847 -4322 2830 8948 13277 17220 10200 3247 3016 952 3785 5700 5580 5594 8779 6352
28694 6352 1083 -2643 -6138 -7539 -5312 -4764 5730 8199 1201 -1444 -6476 1993 7799 2199 -103
$$ packed form
28802F081j293o106N758O96l182p168K577p56k350K334n71M016q91l953k692N64
28786f936J370M894Q375K057j694m348m234l36M625j18r237m109M390N658m351
28771c994q277J697M456R280o4n574K027M95l178o499R263O60J789L203q70M279
28755H693P358j3233p454O646n59J877m528m606M472L056R55m65J993J089o56
28740D638j679J670j513M354J137k481J815k112n059L672K857K260k600m295j866
28725G98n691j080m89l39J932M700L140m657M51o531J900J557o242L248n526l018
28709a5847J1525P152O118M329L943p020o953k31k064K833J915j20J4L185k427
28694F352n269l726l495j401K227N48J0494K469o998k645n032Q469N806n600k302
$$ plain form
28679 -103 210 3279 6226 5849 -1515 -3823 -1507 -4038 -3874 3579 9058 11447 4342 -3011 2209 9901
28663 9901 13175 16922 15172 12155 1788 349 -2175 -6419 -5128 -1563 6480 11407 4696 -659
28649 -659 1398 4611 6438 6346 7229 5562 3297 4047 -238 -4083 -10846 -7558 -5843 956 12958 18779
28633 18779 8432 -2184 -7914 -8405 -1274 4827 2398 -2815 2925 7074 14332 17642 14324 15788
28619 15788 11511 10409 13809 13140 10331 4884 771 436 -3089 -6960 -6021 -4929 -4594 1415 12505
28604 12505 12262 7371 4367 12278 7126 10914 11074 10960 11374 9100 10473 14704 10622 10256 15465 16048
28588 16048 13365 6712 5229 3837 2901 2278 3178 5944 6178 4687 -1347 -325 4217 9597 10566 3415
28572 3415 4848 741 -1544 -942 2571 3164 1615 6872 9483 6406 5155 -1408 -5048 1046 586
$$ packed form
28679a03L13L069K947l77p364k308K316k531J64P453N479K389p105p353N220P692
28663I901L274L747j750l017j0367j439k524m244J291L565Q043M927o711n355
28649f59K057L213J827r2Q83j667k265P50m285l845o763L288J715O799J2002N821
28633A8779j0347j0616n730m91P131O101k429n213N740M149P258L310l318J464
28619A5788m277j102L400o69k809n447m113l35l525l871R39J092L35O009J1090
28604A2505k43m891l004P911n152L788J60j14M14k274J373M231m082l66N209N83
28588A6048k683o653j483j392r36o23R00K766K34j491o034J022M542N380R69p151
28572C415J433m107k285O02L513N93j549N257K611l077j251o563l640O094m60
$$ plain form
28557 586 392 -2170 -1525 -2598 -3409 171 437 1997 14557 16189 17296 10010 3406 -897 -1970 -1245
28541 -1245 4318 1454 1447 6422 10921 13036 195 -6711 -10902 -13238 -15050 -9234 -3783 10413 11598
28526 11598 6261 2564 -1540 -1577 -6688 -8455 -4258 -6176 -10231 -4278 4115 4861 2349 -2019 -4871
28511 -4871 2233 -170 -3823 -9881 -7856 -1919 2792 -2957 -3575 6344 9968 8532 1751 2139 1355
28496 1355 -841 -4189 -3812 1498 6198 -1371 133 607 2580 -3931 -7517 -5702 -3669 83 4771
28481 4771 6067 7325 -5611 -8242 -8903 -3537 -3087 -4374 -4448 -12160 -11525 -7674 -10151 -9501 -7359 -3537
28465 -3537 2889 4598 9434 9235 7219 3777 -3788 41 2152 1640 5114 5224 6809 3497 3798 453
28449 453 1984 4881 9040 10990 10923 15206 14675 9804 7615 6264 11132 7911 -7228 -12782 -3066
$$ packed form
28557E86j94k562O45j073q11L580K66J560J2560J632J107p286o604m303j073P25
28541a245N563k864pM975M499K115j2841o906m191k336j812N816N451J4196J185
28526A1598n337l697m104l7n111j767M197j918m055N953Q393P46k512m368k852
28511d871P104k403l653o058K025N937M711n749o18R919L624j436o781L88p84
28496A355k196l348L77N310M700p569J504M74J973o511l586J815K033L752M688
28481D771J296J258j2936k631o61N366M50j287p4p712O35L851k477O50K142L822
28465c537O426J709M836j99k016l442p565L829K111n12L474J10J585l312L01l345
28449D53J531K897M159J950o7M283n31m871k189j351M868l221j5139n554R716
$$ plain form
28434 -3066 4280 4099 -2221 -5386 -6364 -5395 -4625 1879 -127 -1787 -1357 -7478 -8509 -12557 -8316 885
28418 885 7148 5645 1507 2755 3967 720 551 2048 3105 6443 9017 10775 9774 11368 7019
28403 7019 -2702 -4853 2865 3794 3860 7502 8329 1330 -431 -5255 -2009 1231 -738 132 2239 -3471
28387 -3471 -3674 -622 -4036 -7896 -13738 -10601 -5955 -4921 -7645 -11456 -9693 -7872 -5913 -2254 818
28372 818 994 -1820 -3742 -6657 -7041 -13351 -10733 -10214 -10168 -2458 -1171 -3355 -5346 -11547 -10640 -5596
28356 -5596 -563 -2420 -3409 -2748 853 8891 8740 2876 7005 12452 10200 6479 11788 11979 6337 3754
28340 3754 1249 3451 8774 14603 13351 2674 257 6811 12393 13003 6884 5761 4959 8247 3060
28325 3060 4606 4939 5236 9259 11113 11404 7153 8335 4384 6557 9874 10183 6562 1902 2833 6119
$$ packed form
28434c066P346j81o320l165r78R69P70O504k006j660M30o121j031m048M241R201
28418H85O263j503m138J248J212l247j69J497J057L338K574J758j001J594m349
28403G019r721k151P718R29O6L642Q27o999j761m824L246L240j969Q70K107n710
28387c471k03L052l414l860n842L137M646J034k724l811J763J821J959L659L072
28372H18J76k814j922k915l84o310K618N19M6P710J287k184j991o201R07N044
28356e596N033j857r89O61L601Q038j51n864M129N447k252l721N309J91n642k583
28340C754k505K202N323N829j252j0677k417O554N582O10o119j123q02L288n187
28325C060J546L33K97M023J854K91m251J182l951K173L317L09l621m660R31L286
$$ plain form
28309 6119 11123 10157 9467 6494 2796 6829 6705 -73 1000 1192 -2297 -2406 -4013 -3506 -178 360
28293 360 1083 1176 4542 5534 5806 9273 4737 857 -1155 2492 10116 4032 -904 4523 5510 1220
28277 1220 1017 2803 4789 2723 2940 6887 5735 10711 10452 12914 6932 -674 -307 -1530 -1614 6738
28261 6738 3888 -2929 -8201 -5650 1182 4303 4361 8149 8283 5947 3831 45 1940 6640 10615
28246 10615 12996 8651 3990 6938 4601 6433 5941 3616 5071 3285 2308 -3553 -2269 4264 9594
28231 9594 4283 731 2284 9078 9331 8706 14683 9544 7816 7929 4486 3245 22 -2920 -6414
28216 -6414 -3753 2410 10077 10468 4461 -126 -1008 -1657 -4389 -1148 -324 5309 13064 14971 12375 6760
28200 6760 -1101 -4475 -8003 -5604 -134 6122 11808 13628 10111 8070 3787 -2562 -1457 8264 5295
$$ packed form
28309F119N004r66o90k973l698M033j24o778J073J92l489j09j607N07L328N38
28293C60P23R3L366R92K72L467m536l880k012L647P624o084m936N427R87m290
28277A220k03J786J986k066K17L947j152M976k59K462n982p606L67j223q4Q352
28261F738k850o817n272K551O832L121N8L788J34k336k116l786J895M700L975
28246A0615K381m345m661K948k337J832m92k325J455j786r77n861J284O533N330
28231I594n311l552J553O794K53o25N977n139j728J13l443j241l223k942l494
28216f414K661O163P667L91o007m587q82o49k732L241Q24N633P755J907k596n615
28200F760p861l374l528K399N470O256N686J820l517k041m283o349J105R721k969
$$ plain form
28185 5295 -1717 1969 2743 -2823 -757 5627 9391 13575 10067 4916 -1743 -4189 -5203 -12270 -6449
28170 -6449 -3069 2824 -351 -6591 -7429 -3862 -1262 508 -6159 -8009 -5189 6822 11147 10044 10983
28155 10983 10024 10793 11322 11833 13484 10024 300 -6057 -13756 -16636 -8778 -9588 -12852 -6512 -770 -7039
28139 -7039 -11088 -9038 -1463 11673 15559 15722 11286 11954 11096 -2538 -5660 -1408 3001 225 -1717
28124 -1717 6147 15953 12129 8125 4801 6018 3818 3253 5503 8795 10707 6182 722 -1465 -323
28109 -323 3882 6902 8144 8791 8408 7140 7430 10789 15798 15209 14898 17387 14973 10727 2202 634
28093 634 -1543 -3766 -503 3650 2003 -4226 2277 7985 8423 7675 6510 7891 11132 7364 -360
28078 -360 -4263 -1789 -4378 -10509 -1104 2181 -1526 -6359 -3547 5499 2624 -965 1096 -3485 -5899
$$ packed form
28185E295p012L686P74n566K066O384L764M184l508n151o659k446j014p067N821
28170f449L380N893l175o240q38L567K600J770o667j850K820J2011M325j103R39
28155A0983r59P69N29N11J651l460r724o357p699k880P858q10l264O340N742o269
28139g039m049K050P575J3136L886J63m436O68q58j3634l122M252M409k776j942
28124a717P864R806l824m004l324J217k200n65K250L292J912m525n460k187J142
28109c23M205L020J242O47l83j268K90L359N009n89l11K489k414m246q525j568
28093F34k177k223L263M153j647o229O503N708M38p48j165J381L241l768p724
28078c60l903K474k589o131R405L285l707m833K812R046k875l589K061m581k414
$$ plain form
28063 -5899 -2727 343 -338 -4918 -7626 -10679 -6555 -3399 4164 14813 13941 13900 12548 8506 1130
28048 1130 2335 3218 -282 -2774 -6773 426 65 3410 7299 10061 10387 8340 11338 4222 -3947
28033 -3947 -3784 148 10549 11581 8062 2011 -4646 -6902 241 9523 10901 10233 8655 3053 2858
28018 2858 4505 4327 5587 7521 -3943 -3211 4441 7971 14060 12206 16736 13935 8432 1933 4701
28003 4701 13811 12112 3965 4953 1237 -231 309 -5524 -6833 -1155 6859 9919 8278 3511 721
27988 721 -865 3912 7957 4744 3929 2214 3234 4498 3119 3052 -70 652 2251 9699 5487 -1322
27972 -1322 -4262 -1885 1013 7131 7738 10098 10884 6864 3096 -505 -2540 -1684 -2111 -6767 -8965 -6572
27956 -6572 -3918 -6831 -6924 -8013 -5309 2922 6515 4559 6535 10420 8756 4553 -435 -3990 -7452
$$ packed form
28063e899L172L070o81m580k708l053M124L156P563J0649q72m1j352m042p376
28048A130J205Q83l500k492l999P199l61L345L889K762L26k047K998p116q169
28033c947J63L932J0401J032l519o051o657k256P143R282J378o68j578n602j95
28018B858J647j78J260J934j1464P32P652L530O089j854M530k801n503o499K768
28003D701R110j699q147R88l716j468N40n833j309N678Q014L060j641m767k790
27988G21j586M777M045l213q15j715J020J264j379o7l122P22J599P448m212o809
27972a322k940K377K898O118O07K360P86m020l768l601k035Q56m27m656k198K393
27956f572K654k913r3j089K704Q231L593j956J976L885j664m203m988l555l462
$$ plain form
27941 -7452 -4679 3468 4484 -3408 -1280 4257 971 -3223 -4083 4003 12670 9834 13217 4535 -1189
27926 -1189 3613 9616 7612 2023 1914 12180 15703 6756 7628 18392 13697 7129 -3710 -3221 3531
27911 3531 10051 12294 4209 1415 8696 15871 9982 4730 2638 3311 6359 11823 9113 3797 1284
27896 1284 -362 1802 591 -4686 -7527 -1840 6449 12966 8708 2799 4851 683 4954 6083 -405
27881 -405 -3699 -2287 -7626 -7362 -8542 -10002 -9047 -8428 -4668 2537 2356 5393 3650 4264 10298 9507
27865 9507 5379 9941 14661 10770 3453 5241 4888 2534 -1025 -1596 -2493 -1847 -6499 -4484 -1378 625
27849 625 -6000 -3661 -193 -1293 -3282 -1830 -4494 -8079 -7311 -4466 -3031 -353 2662 289 -7123
27834 -7123 -3671 1311 1408 597 -3887 -3885 83 4346 3798 -1436 -3087 4099 4382 -1871 -11481 -14456 -7405
$$ packed form
27941g452K773Q147J016p892K128N537l286m194q60Q086Q667k836L383q682n724
27926a189M802O003k004n589j09J0266L523q947Q72J0764m695o568j0839M89O752
27911C531O520K243q085k794P281P175n889n252k092O73L048N464k710n316k513
27896A284j646K164j211n277k841N687Q289O517m258n909K052m168M271J129o488
27881d05l294J412n339K64j180j460R55O19L760P205j81L037j743O14O034p91
27865I507m128M562M720l891p317J788l53k354l559n71q97O46m652K015L106K003
27849F25o625K339L468j100j989J452k664l585P68K845J435K678L015k373p412
27834g123L452M982R7q11m484KL968M263n48n234j651P186K83o253r610k975P051
$$ plain form
27817 -7405 254 6385 3476 -3528 -374 7626 3601 -3889 -8011 -5013 203 3301 -896 -4814 -5880
27802 -5880 -6554 -2223 2983 -412 -5228 -10938 -4371 -2054 -4737 -1151 6995 11451 11007 6791 6165
27787 6165 6108 7276 4824 543 -1110 1198 1063 -331 -1329 1577 3626 4286 -1277 -7162 -13647 -7509
27771 -7509 -1248 -2627 -9260 -10299 -4901 -176 -3232 -4519 1560 -2596 -5540 -6852 -1277 4310 12136
27756 12136 11515 8258 5909 2088 4673 9870 9253 -858 -6375 -7384 -4037 2947 6476 8750 5899
27741 5899 6695 12007 -716 -3358 101 -2231 5096 13283 11383 1337 -1151 -1741 -1293 -2598 -2938
27726 -2938 -13 598 -2857 1678 -4353 -5914 -1686 964 3412 5119 7199 7569 5144 2340 870
27711 870 -2785 -6499 -15398 -8879 3136 3611 5566 12841 17629 17419 17685 10860 5111 5255 8295 5839
$$ packed form
27817g405P659O131k909p004L154Q000m025p490m122K998N216L098m197l918j066
27802e880o74M331N206l395m816n710O567K317k683L586Q146M456m44m216o26
27787F165n7J168k452m281j653K308j35j394r98K906K049O60n563n885o485O138
27771g509O261j379o633j039N398M725l056j287O079m156k944j312N575N587P826
27756A2136o21l257k349l821K585N197o17j0111n517j009L347O984L529K274k851
27741E899P96N312j2723k642L459k332P327Q187j900j0046k488n90M48j305l40
27726b938K925O11l455M535o031j561M228K650K448J707K080L70k425k804j470
27711H70l655l714q899O519J2015M75J955P275M788k10K66o825n749J44L040k456
$$ plain form
27695 5839 593 -3692 -2687 618 6595 15648 17986 12722 4550 -1465 -2158 2008 7040 4371 6603
27680 6603 7052 3549 -1181 -5491 -4497 -2721 3777 8101 4087 2563 9000 10888 15724 14019 3923
27665 3923 1086 -2179 1438 2879 1192 196 996 1201 9203 11608 6736 2756 556 2744 7209
27650 7209 8435 11937 8771 5642 -348 4081 7519 13036 9473 11832 14598 13107 15268 11440 9517
27635 9517 11448 6313 165 1200 2890 -478 1753 4365 -2899 -1259 2564 -661 -4329 1745 439
27620 439 -4251 -8106 -6646 -1678 9358 14155 4029 2261 -653 -5131 -3345 -2276 738 1981
27606 1981 -2510 -3670 673 -1652 1248 461 -3724 -2185 2676 7359 5128 5652 14085 14889 8670
27591 8670 1207 -6621 -10223 -6362 -5068 -1205 -2254 85 -133 275 2721 492 8565 15357 10032
$$ packed form
27695E839n246m285J005L305N977R053K338n264q172o015o93M166N032k669K232
27680F603M49l503m730m310R94J776O498M324m014j524O437J888M836j705j0096
27665C923k837l265L617J441j687r96Q00K05Q002K405m872l980k200K188M465
27650G209J226L502l166l129n990M429L438N517l563K359K766j491K161l828j923
27635I517J931n135o148J035J690l368K231K612p264J640L823l225l668O074j306
27620D39m690l855J460M968J1036M797j0126j768k914m478J786J069L014J243
27606A981m491j160M343k325K900p87m185J539M861M683k231N24Q433Q04o219
27591H670p463p828l602L861J294L863j049K339k18M08K446k229Q073O792n325
$$ plain form
27576 10032 9955 12158 4116 -896 204 -317 6475 8019 9194 8860 12655 13812 6477 4599 10047
27561 10047 12919 8910 6476 10350 13478 12251 6013 1509 5274 7792 7073 4139 53 1897 3067
27546 3067 2539 3170 -1641 -8133 -11475 -9219 -4442 -872 -1550 -5525 -2342 -526 3061 12485 17148
27531 17148 7129 5815 11467 15497 12247 10536 5668 7607 2533 4459 2657 1762 1729 -1240 2182
27516 2182 11089 16681 8918 -1531 -1031 2850 3381 8372 3462 1609 -566 -2493 -6708 -4990 -2840
27501 -2840 -3271 -1130 5716 13536 21662 22046 14944 8583 5851 636 -3454 4173 7880 5137 6934
27486 6934 7953 13823 17784 14063 7842 1383 1999 5661 6380 1090 5651 15135 7120 1059 9652
27471 9652 12688 10901 7921 1212 -1698 -3152 -1894 2327 6968 -43 -1011 -2149 -696 -605 -3647
$$ packed form
27576A0032p7K203q042n012J100n21O792J544J175l34L795J157p335j878N448
27561A0047K872m009k434L874L128j227o238m504L765K518p19k934m086J844J170
27546C067n28O31m811o492l342K256M777L570o78l975L183J816L587R424M663
27531A7148j0019j314N652M030l250j711m868J939n074J926j802q95l3k969L422
27516B182Q907N592p763j0449N00L881N31M991m910j853k175j927m215J718K150
27501b840m31K141O846P820Q126L84p102o361k732n215m090P627L707k743J797
27486F934J019N870L961l721o221o459O16L662P19n290M561R484q015o061Q593
27471I652L036j787k980o709k910j454J258M221M641p011r68j138J453R1l042
$$ plain form
27456 -3647 -1879 144 -2218 -7004 -4952 3747 12121 9881 2645 -418 -3023 1626 5291 8236 4404
27441 4404 486 472 2828 1048 -1646 -2509 -4177 -2223 -866 -2514 -1938 4706 6720 1257 3126 6604
27425 6604 4444 -4074 -4905 -5467 -10024 -8409 -7060 -1252 2736 323 -1449 3728 7935 3196 113
27410 113 -5094 -873 -2644 99 -4437 -10076 -7673 -4517 -8034 -6056 -1340 -533 6033 3506 2165
27395 2165 -3180 -3220 -9020 -9137 -10324 -9959 -9136 -12577 -6625 7434 12283 10562 15726 15907 9642 1292
27379 1292 -216 8530 11029 9506 9478 -451 -1387 6279 10884 11460 9904 8344 5014 4241 7373 6392
27363 6392 3519 40 1292 2257 3481 2823 3393 2554 4200 8936 10220 9433 9515 3132 -1053 -5400
27347 -5400 -7295 -8934 -8955 -3299 -862 -301 1631 -50 822 1175 2940 2302 -5821 -8639 -1521 1151
$$ packed form
27456c647J768K023k362m786K052Q699Q374k240p236l063k605M649L665K945l832
27441D404l918j4K356j780k694q63j668J954J357j648N76O644K014n463J869L478
27425F604k160q518q31n62m557J615J349N808L988k413j772N177M207m739l083
27410A13n207M221j771K743m536n639K403L156l517J978M716Q07O566k527j341
27395B165n345m0n800j17j187L65Q23l441N952J4059M849j721N164J81o265q350
27379A292j508Q746K499j523k8r929r36P666M605N76j556j560l330p73L132r81
27363F392k873l479J252R65J224o58N70q39J646M736J284p87Q2o383m185m347
27347e400j895j639k1N656K437N61J932j681Q72L53J765o38q123k818P118K672
$$ plain form
27331 1151 -1392 -784 4929 9052 4657 -2044 -1372 -1818 -4454 -11348 -4664 2566 5114 -241 -1423
27316 -1423 -930 -2549 -6958 -7539 -10364 -5982 246 2427 1709 3002 6488 8166 8543 5760 -135 4878
27300 4878 9015 9352 6475 6617 13769 7203 -156 -819 -2950 -5813 -6101 -11693 -10394 -7533 -7659 -5030
27284 -5030 -222 -3657 -11024 -13301 -11370 -8181 1541 8441 10631 13243 3642 2589 -1452 -172 11709
27269 11709 14740 14353 12649 7923 -3699 -2372 -8441 -19274 -15905 -15300 -18345 -14046 -8652 -8126 -1882
27254 -1882 -2003 -3297 -8408 -379 5252 -3909 -7416 -10188 -4107 -3658 -4599 -6049 -2931 3445 10881
27239 10881 15222 17321 8544 6708 10495 7678 2891 8498 10619 5656 3973 3491 921 589 -3480
27224 -3480 7387 16113 14763 13203 8220 5905 45 4647 3555 3430 3605 7352 7323 9054 4444
$$ packed form
27331A151k543O08N713M123m395o701O72m46k636o894O684P230K548n355j182
27316a423M93j619m409n81k825M382O228K181p18J293L486J678L77k783n895N013
27300D878M137L37k877J42P152o566p359o63k131k863k88n592J299K861j26K629
27284e030M808l435p367k277J931L189R722O900K190K612r601j053m041J280J1881
27269A1709L031l87j704m726j1622J327o069j0833L369O05l045M299N394N26O244
27254a882j21j294n111Q029N631r161l507k772O081M49r41j450L118O376P436
27239A0881M341K099q777j836L787k817m787N607K121m963j683m82k570l32m069
27224c480J0867Q726j350j560m983k315n860M602j092j25J75L747k9J731m610
$$ plain form
27209 4444 -2667 4726 9857 5145 3719 -1078 -8642 -6596 6187 5487 -423 516 7051 7161 8611
27194 8611 8828 3706 2333 -2725 -1591 -6228 -4468 4839 10050 9982 5298 -3556 -8316 -2878 7175
27179 7175 6946 -1464 -8040 -7038 1693 2634 -3538 -3601 -1593 3567 8165 7813 153 4904 4365 1362
27163 1362 2544 5181 3471 4301 3944 -4719 -10971 -8017 2222 12137 8533 9476 638 -6617 -8734
27148 -8734 -11554 -5843 -2624 -7363 -6823 -2023 1494 2504 3962 4794 4296 4345 235 -2664 -1456 -5382
27132 -5382 -1605 6121 10846 9923 7801 5447 1811 845 2567 -5678 -9485 -9229 -4501 1752 -2116
27117 -2116 936 2605 -5364 -2474 4769 7600 5443 -1433 -1263 -9321 -10196 -6326 -6040 -5838 -2396 -6502
27101 -6502 -8392 -4064 -6173 -7630 -4607 -6675 -10580 -7656 -6683 -9359 -10090 -6943 -7384 -2042 2492
$$ packed form
27209D444p111P393N131m712j426m797p564K046J2783p00n910R39O535J10J450
27194H611K17n122j373n058J134m637J760R307N211o8m684q854m760N438J0053
27179G175k29q410o576J002Q731R41o172o3K008N160M598l52p660M751n39l003
27163A362J182K637j710Q30l57q663o252K954J0239R915l604R43q838p255k117
27148h734k820N711L219m739N40M800L517J010J458Q32m98M9m110k899J208l926
27132e382L777P726M725r23k122k354l636r66J722q245l807K56M728O253l868
27117b116L052J669p969K890P243K831k157o876J70q058q75L870K86K02L442m106
27101f502j890M328k109j457L023k068l905K924R73k676p31L147m41N342M534
$$ plain form
27086 2492 -926 -2735 -9385 -11757 -6023 1415 773 -4979 -8152 -6574 -7197 -3491 2304 -672 -5525
27071 -5525 -7411 -8939 -9094 -10078 -12293 -5842 -2917 -2777 887 1180 109 -3784 -2085 3216 8425 10574
27055 10574 5742 4885 2172 -1053 1030 -1380 -8180 -15222 -12354 -9690 -2656 1817 5118 9289 5601
27040 5601 5347 9212 288 -2826 -4309 -1270 1348 4795 -1093 -247 -3304 -10711 -1487 1088 -160
27025 -160 111 2450 3003 4097 3157 -3669 -7026 -8185 -8958 3685 11751 6159 -2813 -295 -1306 -4672
27009 -4672 -341 -697 3202 -50 -4408 538 7974 9095 758 -3712 -5939 -6116 -2572 -778 4824
26994 4824 6097 6033 1518 3076 9134 10235 8673 -3943 -8596 -1786 733 2092 2670 7826 10067
26979 10067 7518 166 -2221 -3653 -6054 -477 579 -4842 -5130 -2358 -251 -4271 -1269 4170 4044
$$ packed form
27086B492l418j809o650k372N734P438o42n752l173J578o23L706N795k976m853
27071e525j886j528j55r84k215O451K925J40L664K93j071l893J699N301N209K149
27055A0574m832q57k713l225K083k410o800p042K868K664P034M473L301M171l688
27040E601k54L865q924l114j483L039K618L447n888Q46l057p407R224K575j248
27025a60K71K339N53J094r40o826l357j159p73J2643Q066n592q972K518j011l366
27009d672M331l56L899l252m358M946P436J121q337m470k227j77L544J794N602
26994D824J273o4m515J558O058J101j562j2616m653O810K519J359N78N156K241
26979A0067k549p352k387j432k401N577J056n421k88K772K107m020L002N439j26
$$ plain form
26964 4044 6312 12594 7054 -1784 -8403 -12410 -12095 -5482 -3778 -3298 6 998 1240 1500 -1795 -3953
26948 -3953 -5349 -10171 -8386 -4676 1782 5351 2825 -2079 -1717 -894 4414 9272 4094 586 1694
26933 1694 3170 -414 -6510 -7441 -7411 -2817 989 6958 -930 -4013 -4165 6591 7821 6385 11261
26918 11261 16708 11712 2789 -2645 2824 5400 2966 -2180 -3167 -7001 -7096 -664 -4359 -1644 2127
26903 2127 -3781 -7410 -7270 -1854 -305 2252 4784 7179 5789 3771 -202 1148 647 1245 4578
26888 4578 8651 8954 1739 1144 7344 2063 -4730 -4024 2602 8375 10367 7937 8477 7003 4291 -1052
26872 -1052 3946 5854 9838 11591 13472 15916 15386 6529 4602 4985 3357 5485 3606 1203 -1378
26857 -1378 -1695 2477 2728 -457 -5325 -4833 2393 8896 12463 14896 14711 14075 12042 841 -4014 -4692
$$ packed form
26964D044K268O282n540q838o619m007L15O613J704M80L304R92K42K60l295k158
26948c953j396m822J785L710O458L569k526m904L62Q23N308M858n178l508J108
26933A694J476l584o096r31L0M594L806N969p888l083j52J0756J230j436M876
26918A1261N447m996q923n434N469K576k434n146r87l834r5O432l695K715L771
26903B127n908l629J40N416J549K557K532K395j390k018l973J350n01N98L333
26888D578M073L03p215n95O200n281o793P06O626N773J992k430N40j474k712n343
26872a052M998J908L984J753J881K444n30q857j927L83j628K128j879k403k581
26857a378l17M172K51l185m868M92P226O503L567K433j85o36k033j1201m855o78
$$ plain form
26841 -4692 -5244 -2348 1646 -2662 -9462 -11109 -13879 -4546 1767 1266 -99 -105 5499 2375 1130 2883
26825 2883 -1406 -5669 -8616 -7587 -1928 7606 4282 -3058 -1863 -1592 3797 3080 9071 14881 8521
26810 8521 -4440 -5244 -6903 -5747 -6366 -168 5135 4702 7712 8602 4316 -1630 -6808 -1263 3567
26795 3567 3702 1157 4639 4916 2752 -21 -1406 -6430 -3970 -3519 -5681 -5269 -1045 -1153 2335 6405
26779 6405 -1042 -4838 -4119 -403 -2252 -8927 -7295 -3912 -5676 -9893 -5537 3978 6970 2118 -4526
26764 -4526 -3601 -2908 1842 600 -3462 -228 4296 7376 3418 3178 -3361 -9800 -9088 -4875 -3809 -5485
26748 -5485 -5349 -4507 -1525 -9879 -15372 -12217 -9895 -7977 -1373 6598 8706 5260 -5101 -10792 -9774
26733 -9774 -1030 4506 11355 12043 11374 10256 4411 17 3627 2898 -1499 8461 7394 11904 8545
$$ packed form
26841d692n52K896L994m308o800j647k770R333O313n01j365oN604l124j245J753
26825B883m289m263k947J029N659R534l324p340J195K71N389p17N991N810o360
26810H521j2961q04j659J156o19O198N303m33L010Q90m286n946n178N545M830
26795C567J35k545L482K77k164k773j385n024K460M51k162M12M224j08L488M070
26779F405p447l796P19L716j849o675J632L383j764m217M356R515K992m852o644
26764d526R25O93M750j242m062L234M524L080l958k40o539o439P12M213J066j676
26748e485J36Q42K982q354n493L155K322J918O604P971K108l446j0361n691J018
26733i774Q744N536O849O88o69j118n845m394L610p29m397R960j067M510l359
$$ plain form
26718 8545 3387 493 -6352 -4316 -1148 2367 6444 5152 3135 -335 -755 -3555 -3702 4827 9472
26703 9472 12484 9724 10642 8423 -2535 -7073 -12402 -11644 -8244 -6565 -92 -626 -7773 -3537 2266
26688 2266 13417 11570 8342 3347 3222 1955 1002 2261 3019 -1006 808 4564 4985 -2731 -2858 -5648
26672 -5648 -5353 -5514 -9326 -11152 -6422 -690 -1705 1390 852 -3022 -3993 -3285 -2849 -3488 1913 4071
26656 4071 6029 5542 5130 4559 -4578 -9223 -11050 -6108 4455 5881 5881 8856 9897 3445 -5083 -7640
26640 -7640 -5332 -1809 2964 6419 -409 3899 6093 3771 3785 2951 -3862 1776 1697 -1346 -4587 -1563
26624 -1563 2608 -299 -11661 -11166 197 1654 -2995 -4018 -3206 2610 4115 -28 -4183 -2954 883
26609 883 -2968 -4136 -5136 -8060 -4994 -4541 1123 3873 -3514 -5619 -4154 -8204 -6593 -1617 1511
$$ packed form
26718H545n158k894o845K036L168L515M077j292k017l470m20k800j47Q529M645
26703I472L012k760R18k219j0958m538n329P58L400J679O473n34p147M236N803
26688B266J1151j847l228m995j25j267r53J259P58m025J814L756M21p716j27k790
26672e648K95j61l812j826M730N732j015L095n38l874r71P08M36o39N401K158
26656D071J958m87m12n71r137m645j827M942J0563J426%K975J041o452q528k557
26640g640K308L523M773L455o828M308K194k322J4q34o813N638p9l043l241L024
26624a563M171k907j1362M95J1363J457m649j023Q12N816J505m143m155J229L837
26609H83l851j168j000k924L066M53N664K750p387k105J465m050J611M976L128
$$ plain form
26594 1511 1450 3208 2825 -4198 -3781 4687 8576 6263 9959 13895 18593 15397 3639 4054 8853 2375
26578 2375 -3899 -4943 -4928 -5441 -1924 -2462 -6087 -10396 -15696 -5983 8832 12756 10171 9017 12715
26563 12715 15900 11161 10322 4698 -1597 -1803 2880 8239 7852 9208 5170 4472 5669 7447 4506
26548 4506 -1282 7353 11904 10241 1752 -5443 -8300 -5010 -5592 -2079 -3065 69 -2494 -6986 -6323
26533 -6323 -9482 -6389 -4088 -2223 1817 9590 3775 4469 3238 4272 472 -2421 -2514 -7250 -10108
26518 -10108 -5485 -10 3127 5600 7753 10692 8210 280 -745 -2701 -537 1229 895 -4209 -4873
26503 -4873 -8763 -3657 -3426 -4620 -2176 -82 -6560 -8799 -10878 -6392 -2741 1982 7900 11508 8632
26488 8632 9498 7494 6450 4496 -617 7242 6113 1915 -272 -2017 1982 3155 1158 6417 8010
$$ packed form
26594A511o1J758l83p023M17Q468L889k313L696L936M698l196j1758M15M799o478
26578B375o274j044J5n13L517n38l625m309n300R713J4815L924k585j154L698
26563A2715L185m739q39n624o295k06M683N359l87J356m038o98J197J778k941
26548D506n788Q635M551j663q489p195k857L290n82L513r86L134k563m492O63
26533f323l159L093K301J865M040P773n815O94j231J034l800k893r3m736k858
26518a0108M623N475L137K473K153K939k482p930j025j956K164J766l34n104o64
26503d873l890N106K31j194K444K094o478k239k079M486L651M723N918L608k876
26488H632Q66k004j044j954n113P859j129m198k187j745L999J173j997N259J593
$$ plain form
26473 8010 11731 8436 6866 1738 597 -1813 3062 4626 -4868 -9022 -8479 -2385 141 -1768 1985
26458 1985 1175 3422 5533 6424 4589 5158 7581 3396 -357 1213 3076 1729 -2485 -4652 -1359
26443 -1359 8803 6991 8081 3829 3986 2301 4460 5859 2701 3786 9400 10019 4358 5239 7617
26428 7617 6557 6156 9307 4397 -5632 -12574 -7180 1495 -1201 -5766 -2859 1988 -1485 -5952 -1194
26413 -1194 -909 -354 -1759 -8510 -8661 -5356 -1904 -5709 -6425 -5652 -5399 -2725 -542 4235 8161 6728
26397 6728 4572 6754 7098 755 -1893 -3039 -7796 -19659 -13768 629 10520 4017 3182 5385 8126
26382 8126 5113 5131 2718 -1625 -3327 -8635 -6553 -5783 -5274 -9390 -10077 -9418 -8252 -3523 -1618 -5443
26366 -5443 -5490 -3264 -1849 -910 -770 975 9447 6074 3017 1587 2878 5954 1044 -4118 -6253 -8100
$$ packed form
26473H010L721l295j570n128j141k410M875J564r494m154N43O094K526j909L753
26458A985q10K247K111Q91j835N69K423m185l753J570J863j347m214k167L293
26443a359J0162j812J090m252J57j685K159J399l158J085N614O19n661Q81K378
26428G617j060m01L151m910j0029o942N394Q675k696m565K907M847l473m467M758
26413a194K85N55j405o751j51L305L452l805p16P73K53K674K183M777L926j433
26397F728k156K182L44o343k648j146m757j1863N891J4397R891o503q35K203K741
26382H126l013J8k413m343j702n308K082P70N09m116o87O59J166M729J905l825
26366e443m7K226J415R39J40J745Q472l373l057j430J291L076m910n162k135j847
$$ plain form
26350 -8100 -6651 -1632 -3700 184 7415 13361 17265 12595 5470 7370 6679 4323 7383 10472 10012
26335 10012 1569 175 2168 2715 -3137 -6815 -8377 -7510 -8612 -4669 6778 6926 5885 2604 2389
26320 2389 -4699 -6480 -1340 -3235 -4206 -1137 1733 -360 -1077 -378 3339 -6156 -4198 -684 5534
26305 5534 4490 -747 -10407 -9809 -330 -2953 -9380 -7447 -4470 -3191 -730 -276 3423 3732 4615 5409
26289 5409 2966 -2725 -3533 -2426 -1851 -4308 -661 6280 1789 -2389 -7251 -3954 89 245 -1931
26274 -1931 1294 -1381 3236 12829 5791 1733 1237 -1063 5195 8073 8534 10047 8631 7415 2905
26259 2905 1262 8983 7082 8765 10924 8953 8263 4085 1122 6412 5833 -3358 -3931 -619 2744
26244 2744 2256 -1006 2835 2593 -2329 -3734 1557 -937 -2027 2633 2933 3590 4575 2971 2797 5180
$$ packed form
26350h100J449N019k068L884P231N946L904m670p125J900o91k356L060L089m60
26335A0012q443j394J993N47n852l678j562Q67j102L943J1447J48j041l281k15
26320B389p088j781N140j895r71L069K870k093p17O99L717r495J958L514O218
26305E534j044n237r660N98R479k623o427J933K977J279K461M54L699L09Q83P94
26289E409k443n691q08J107N75k457L647O941m491m178m862L297M043J56k176
26274a931L225k675M617R593p038m058m96k300O258K878M61J513j416j216m510
26259B905j643P721j901J683K159j971o90m178k963N290n79r191n73L312L363
26244B744m88l262L841k42m922j405N291k494j090M660L00O57R85j604j74K383
$$ plain form
26228 5180 3557 -2083 1017 -3840 -2428 7649 2640 -10168 -9519 -5688 -7021 -7760 -5766 -403 2896
26213 2896 6216 5028 6138 6534 1651 1986 3031 -6169 -10823 -4557 -9458 -13277 -9021 -4260 274
26198 274 555 1612 5345 3235 -491 -11746 -17049 -18332 -18881 -6179 -2350 8936 9184 5153 1266
26183 1266 8403 10070 13994 14848 7756 1341 6683 11571 14301 13591 6167 4549 8448 2267 1183
26168 1183 8081 11306 5919 1351 -3667 -4439 -4468 -6256 -8218 -2616 237 -3187 -7306 -3070 -423
26153 -423 2040 -1260 -1975 -2547 -5742 -11103 -7848 -10049 -9963 -6508 -7599 -9141 -6598 -3590 -5649 -2101
26137 -2101 1370 -8467 -10355 -14444 -5046 2583 -7035 -10113 -6664 -1693 1364 935 976 -1110 -3977
26122 -3977 -8551 -8758 -10226 -2680 3565 9891 6383 -1777 -6618 -7042 -3984 2886 -1258 -936 2740
$$ packed form
26228E180j623n640L100m857J412J0077n009j2808O49L831j333p39J994N363L299
26213B896L320j188J110L96m883L35J045r200m654O266m901l819M256M761M534
26198B74K81J057L733k110l726j1255n303j283n49J2702L829J1286K48m031l887
26183A266P137J667L924Q54p092o415N342M888K730p10p424j618L899o181j084
26168A183O898L225n387m568n018p72k9j788j962N602K853l424m119M236K647
26153d23K463l300p15n72l195n361L255k201Q6L455j091j542K543L008k059L548
26137b101L471r837j888m089R398P629r618l078L449M971L057m29M1k086k867
26122c977m574k07j468P546O245O326l508q160m841m24L058O870m144L22L676
$$ plain form
26107 2740 5790 5881 3322 -821 -627 879 -5285 -6408 -7941 3022 3770 1931 -1772 -7005 238
26092 238 5029 5789 6046 4115 3114 5248 10381 6726 459 -3514 -5171 1536 1732 -2346 -3785 -4341
26076 -4341 -1936 2125 1466 1276 3601 3037 4675 -44 -13098 -14944 -10513 -6802 -6907 -352 -3152
26061 -3152 -7774 -8277 -8199 -9712 -9429 -6315 2261 6895 1499 -9807 -16538 -13881 -7798 -6605 -12848
26046 -12848 -15438 -14523 -16909 -13577 -8081 -6492 -2813 5179 2455 -7654 -6533 -5580 -8141 -12271 -9601
26031 -9601 -614 3872 2257 11572 9931 -299 -915 1447 442 -4475 -8504 -13667 -13575 -10747 -11043
26016 -11043 -9801 -10409 -4127 -2638 -3633 -2501 1966 5495 4137 5659 7463 11998 14978 14716 8165
26001 8165 2475 -5104 -10261 -8341 -6565 -8921 -13674 -12632 -10404 -4607 -3418 -2128 -7065 -7655 -9480
$$ packed form
26107B740L050R1k559m143J94J506o164j123j533J0963P48j839l703n233P243
26092B38M791P60K57j931j001K134N133l655o267l973j657O707J96m078j439n56
26076d341K405M061o59j90K325n64J638m719j3054j846M431L711j05O555k800
26061c152m622n03P8j513K83L114Q576M634n396j1306o731K657O083J193o243
26046a2848k590R15k386L332N496J589L679P992k724j0109J121R53k561m130K670
26031i601Q987M486j615R315j641j0230o16K362j005m917m029n163R2K828k96
26016a1043J242o08O282J489r95J132M467L529j358J522J804M535K980k62o551
26001H165n690p579n157J920J776k356m753J042K228N797J189J290m937n90j825
$$ plain form
25986 -9480 -6850 -3138 -5353 -13185 -10961 -6317 -6878 -6543 -3340 2853 4020 -4143 -5104 2736 5029
25971 5029 8013 6712 2127 3119 -174 2420 -478 -5572 -6129 -4032 -3076 -5794 -5256 -7127 -1267 -10474
25955 -10474 -13024 -5810 -3323 -2826 530 7595 3033 -1312 -1190 -2923 -8175 -7846 -1613 4769 5912
25940 5912 2639 2265 568 7268 6569 834 -242 9709 6923 6481 6537 2667 6512 5524 1544 3596
25924 3596 -1257 -352 2349 146 1543 2586 -5246 -6540 1996 7132 6022 1873 511 -6011 -5491
25909 -5491 -3725 -5075 -4085 -5431 -3605 -440 3805 -1424 -4869 -5741 -3453 -8971 -1854 7938 12414
25894 12414 16141 7717 816 -4571 -4271 -1736 -9917 -12302 -13784 -9338 -5167 -3226 28 1447 -2870
25879 -2870 -6829 -5844 -5637 -4777 1546 2938 -2807 -11952 -16533 -12080 -1202 7343 1009 1322 2877
$$ packed form
25986i480K630L712k215p832K224M644n61L35L203O193J167q163r61P840K293
25971E029K984j301m585R92l293K594k898n094n57K097R56k718N38j871N860r207
25955a0474k550P214K487M97L356P065m562m345J22j733n252L29O233O382J143
25940E912l273l74j697O700o99n735j076R951k786m42N6l870L845r88l980K052
25924C596m853R05K701k203J397J043p832j294Q536N136j110m149j362o522N20
25909e491J766j350R90j346J826L165M245n229l445q72K288n518P117R792M476
25894A2414L727q424o901n387L00K535q181k385j482M446M171J941L254J419m317
25879b870l959R85K07Q60O323J392n745r145m581M453J0878Q545o334L13J555
$$ plain form
25864 2877 4144 -1729 -6799 -6587 -6504 -6189 505 4418 5560 15464 10087 8185 11028 14998 11070 6507
25848 6507 12887 17058 8644 3560 2259 1626 -270 -1957 1794 7351 8569 5810 2123 4899 4241
25833 4241 7322 8562 6538 2582 1068 -804 3079 571 6976 4737 2578 -5762 -8085 -4720 -5220
25818 -5220 -3737 -4314 -815 1555 -1279 -1892 574 5027 -4716 -7481 -3649 -1256 -2589 -8981 -4613
25803 -4613 4549 12408 15468 9221 6419 4466 5718 2023 4515 6007 6712 -350 368 -2849 -7895
25788 -7895 -3411 -4747 -9764 -14312 -16186 -12579 -1169 2649 3112 2740 5221 615 -2333 -1649 -4904
25773 -4904 -8175 -5643 -1928 615 -4206 -14501 -10555 -9488 -8260 -7398 -3563 2426 -319 1374 3867
25758 3867 3166 -2607 -12429 -17372 -14332 -5342 -290 -3109 -2162 -402 -538 -1545 -4289 -1093 -5460
$$ packed form
25864B877J267n873n070K12Q3L15O694L913J142R904n377j902K843L970l928m563
25848F507O380M171q414n084j301o33j896j687L751N557J218k759l687K776o58
25833D241L081J240k024l956j514j872L883k508O405k239k159q340k323L365n00
25818e220J483n77L499K370k834o13K466M453r743k765L832K393j333o392M368
25803d613R162P859L060o247k802j953J252l695K492J492P05p062P18l217n046
25788g895M484j336n017m548j874L607J1410L818M63l72K481m606k948O84l255
25773d904l271K532L715K543m821j0295L946J067J228Q62L835N989k745J693K493
25758C867p01n773r822m943L040Q990N052k819R47J760j36j007k744L196m367
$$ plain form
25743 -5460 -5670 2920 8352 7481 1486 -3294 -6410 -780 3113 -1246 -4815 -7138 -8280 -7281 -3572
25728 -3572 -5966 -3912 -7281 -5752 -6977 -6322 -4037 -2092 -2937 1078 6815 6433 -709 -335 -1392 -1610
25712 -1610 -3759 -2991 2756 6387 8341 5842 -147 -5877 -3938 1252 616 -1899 -1529 -4813 -7538
25697 -7538 -8280 -6057 2411 8281 9358 5132 5214 5775 7806 7845 12484 10143 432 59 -366 -4909 -4959
25680 -4959 -2282 -1945 -5131 838 -2347 -1992 -7187 -10746 -8619 -9060 -12127 -7774 1171 -692 -4357
25665 -4357 219 31 3573 8300 12603 3697 0 -591 7420 5288 -2589 -1822 3339 2553 773 -4547
25649 -4547 -10339 -9300 -4359 -4078 1731 3196 -1675 4898 13542 12538 10037 10100 12157 5058 -3118
25634 -3118 -756 7319 16186 13574 268 -4034 1872 724 -6759 -5114 -5712 -6865 -1012 9169
$$ packed form
25743e460k10Q590N432q71n995m780l116N630L893m359l569k323j142R99L709
25728c572k394K054l369J529j225O55K285J945q45M015N737l82p142L74j057k18
25712a610k149P68N747L631J954k499n989n730J939N190o36k515L70l284k725
25697g538p42K223Q468N870J077m226Q2N61K031L9M639k341r711l73m25m543n0
25680d959K677L37l186N969l185L55n195l559K127m41l067M353Q945j863l665
25665d357M576j88L542M727M303q906l697n91Q011k132p877P67N161p86j780n320
25649d547n792J039M941K81N809J465m871O573Q644j004k501O3K057p099q176
25634c118K362Q075Q867k612j3306m302N906j148p483J645n98j153N853J0181
$$ plain form
25620 9169 12758 15077 15384 13205 7359 9461 3462 5105 2218 -1636 -6907 -11550 -8177 -4676 -2416
25605 -2416 1273 8882 12545 5451 7284 10777 9535 6024 2898 -858 -1870 -1191 -1058 -4261 -7612
25590 -7612 -13981 -8639 -3637 485 63 946 5501 -1802 -8945 -12260 -8410 -2679 -369 1378 -13
25575 -13 -2575 -4771 -9127 -4692 -1233 -723 -6940 -13668 -12566 -13073 -11869 -9625 313 2108 -8708
25560 -8708 -12900 -9341 -8731 -10246 -3670 -5027 -4259 2528 -2875 -12196 -10480 -7592 -9438 -7359 -3194
25545 -3194 2348 -5371 -11687 -7225 -817 -964 -278 -2729 -1164 1452 -2644 -6309 -14981 -18369 -14176
25530 -14176 -9026 -9973 -9104 -5920 -4598 -8626 -15319 -15478 -16357 -11605 -9136 -5148 1222 4848 8779
25515 8779 8523 4018 6479 9183 9672 10234 5994 2200 -235 -3307 -6781 -9995 -13238 -13736 -10665 -4419
$$ packed form
25620I169L589K319L07k179n846K102n999J643k887l854n271m643L373L501K260
25605b416L689P609L663p094J833L493j242l511l126l756j012O79J33l203l351
25590g612o369N342N002M122m22Q83M555p303p143l315L850N731K310J747j391
25575a3k562k196m356M435L459N10o217o728J102n07J204K244R938J795j0816
25560h708m192L559O10j515O576j357P68O787n403r321J716K888j846K079M165
25545c194N542p719o316M462O408j47O86k451J565K616m096l665q672l388M193
25530a4176N150r47Q69L184J322m028o693j59q79M752K469L988O370L626L931
25515H779k56m505K461K704M89N62m240l794k435l072l474l214l243m98L071O246
$$ plain form
25499 -4419 -5143 -9995 -13184 -12249 -8011 -4033 -4047 -38 -2573 -5036 -5473 -8320 -2703 2524 3931 5443
25483 5443 4626 2720 -431 -2309 -1168 1940 6251 842 152 -4810 -5377 -1255 7087 12408 6661
25468 6661 2138 4678 11714 10482 9930 14706 13780 11810 13093 6938 875 -732 -7327 -13611 -17086
25453 -17086 -12669 -9135 -7104 -4361 -1890 -4710 -14302 -14563 -7151 -6218 -3904 -4964 -8621 -10038 -8657
25438 -8657 -8488 -3458 -1633 -9966 -18639 -16133 -10774 -9353 -11556 -6281 1694 8985 8799 8806 9129 8488
25422 8488 6635 5238 9953 9618 3825 8580 6539 8860 10553 4451 -155 -295 4785 1163 -4408
25407 -4408 -6768 -10931 -5717 2173 9668 8132 6559 1396 4867 4760 3732 5899 7568 1135 -7355
25392 -7355 -5778 -1607 4195 10185 4445 -2108 -2793 -1754 8906 18080 17414 13038 11999 11595 11109
$$ packed form
25499d419p24m852l189R35M238L978j4M009k535k463m37k847N617N227J407J512
25483E443q17j906l151j878J141L108M311n409o90m962n67M122Q342N321n747
25468F661m523K540P036j232n52M776r26j970J283o155o063j607o595o284l475
25453a7086M417L534K031K743K471k820r592k61P412R33K314j060l657j417J381
25438h657J69N030J825q333q673K506N359J421k203N275P975P291j86PL23o41
25422H488j853j397M715l35n793M755k041K321J693o102m606j40N080l622n571
25407d408k360m163N214P890P495j536j573n163L471j07j028K167J669o433q490
25392g355J577M171N802N990n740o553o85J039J0660R174o66m376j039m04m86
$$ plain form
25377 11109 4086 -264 563 -5247 -8810 -10621 -10029 -5429 -10044 -14107 -4737 6834 3456 -1964 1144
25362 1144 -2578 -4633 -6819 -11617 -12475 -7587 -10634 -5104 -3088 3886 12038 20965 12921 9360 6983
25347 6983 3695 -1624 -7518 -59 3587 5773 7662 4870 585 -3174 -6582 -6766 -1193 4626 9270
25332 9270 5585 -6948 -5300 -2474 -2386 186 -467 -2683 -4533 614 50 -2428 -237 862 2323
25317 2323 250 4193 -2146 -9881 -5036 1857 4713 -1194 -11186 -17765 -21518 -14966 -2196 4023
25303 4023 4735 -2329 -693 1127 -248 586 5071 2826 404 2564 -2061 -7957 -4696 -338 -1038
25288 -1038 2009 3935 52 -5206 -9384 -6507 -8073 -8286 -5754 -7032 -8296 -10036 -15674 -19639 -18798
25273 -18798 -13081 -9378 -5926 -11012 -13500 -8604 -3026 -3907 -5200 -6383 -374 3466 3002 -3115 -988
$$ packed form
25377A1109p023m350Q27n810l563j811N92M600m615m063R370J1571l378n420L108
25362A144l722k055k186m798q58M888l047N530K016O974Q152Q927q044l561k377
25347F983l288n319n894P459L646K186J889k792m285l759l408j84N573N819M644
25332I270l685j2533J648K826Q8K572o53k216j850N147n64k478K191J099J461
25317B323k073L943o339p735M845O893K856n907r992o579l753O552J2770O219
25303D023P12p064J636J820j375Q34M485k245k422K160m625n896L261M358p00
25288a038L047J926l883n258m178K877j566k13K532j278j264j740n638l965Q41
25273a8798N717L703L452n086k488M896N578q81j293j183O009L840m64o117K127
$$ plain form
25258 -988 7072 1570 -329 -5199 -8964 -4552 -7653 -11235 -5339 -617 3000 7230 3313 -5148 -6002
25243 -6002 -7197 -4343 -5183 4801 8465 4842 6901 6139 -2754 -5577 -1076 -1828 -3725 749 3587
25228 3587 314 -893 -4183 -7429 -11263 -10247 -3686 580 -1339 1411 2560 -6321 -13052 -9466 -4482
25213 -4482 -1737 7414 2641 -5043 -7313 -6907 -5164 -4786 -3294 -4759 -9729 -10141 -11843 -6353 1451
25198 1451 1950 -6509 -7030 -6452 -7546 -8153 -5726 -9967 -12885 -9811 -9331 -3556 -1690 2518 7881 5680
25182 5680 5012 1683 -2738 7058 8882 2993 -2190 1637 6829 5093 2935 2740 1637 1776 -5813
25167 -5813 -116 3642 63 -4326 -5240 -1414 4038 -2863 -2872 687 -4151 -4783 -2531 -3168 2256 6888
25151 6888 6862 705 -371 -11050 -11485 -3918 -4967 -3771 784 5426 2857 -3804 -10433 -10901 -6464
$$ packed form
25258i88Q060n502j899m870l765M412l101l582N896M722L617M230l917q461q54
25243f002j195K854q40R984L664l623K059p62q893k823M501p52j897M474K838
25228C587l273j207l290l246l834J016O561M266j919K750J149q881o731L586M984
25213d482K745R151m773p684k270M06J743L78J492j465m970m12j702N490P804
25198A451M99q459n21N78j094o07K427m241k918L074M80N775J866M208N363k201
25182E680o68l329m421R796J824n889n183L827N192j736k158j95j103J39p589
25167e813N697L758l579m389r14L826N452o901rL559m838o32K252o37N424M632
25151F888k6o157j076j0679m35P567j049J196M555M642k569o661o629m68M437
$$ plain form
25136 -6464 -6271 -8998 -6000 56 -266 -1879 -8164 -5528 -1881 -3904 -3710 -2786 -6083 -8283 -5310 7228
25120 7228 12634 7004 168 -3779 -9025 -5055 -7386 -10586 -10509 -8544 -7125 -3998 -1192 -2499 -3792
25105 -3792 1558 1835 -4065 -6592 -4541 -4599 -5391 606 4446 -9001 -13363 -7328 -5988 -5719 110 -5114
25089 -5114 -6869 -7955 -8810 -11539 -8549 -9220 -7615 -3736 -62 -6059 -3068 1275 5979 -1597 -2950
25074 -2950 -3003 -4394 -2233 766 4905 7376 9298 5151 -1574 -5041 -6929 -4687 -470 -1692 264
25059 264 -1616 -2672 -453 -5194 -7412 -7719 -8358 -8861 -9159 -8210 -8608 -2009 -5150 -12986 -17077 -16400 -15328
25042 -15328 -9504 -8205 -6957 -446 5451 7622 860 -3644 1339 4203 1181 -3051 -9273 -11520
25028 -11520 -10241 -8748 -2522 5599 7319 7140 7865 6733 4517 3211 4301 -2808 1234 2972 -1870
$$ packed form
25136f464J93k727K998O056l22j613o285K636L647k023J94R24l297k200K973J2538
25120G228N406n630o836l947n246L970k331l200P7J965J419L127K806j307j293
25105c792N350K77n900k527K051n8p92N997L840j3447m362O035J340K69N829n224
25089e114j755j086q55k729K990o71J605L879L674n997K991M343M704p576j353
25074b950n3j391K161K999M139K471J922m147o725l467j888K242M217j222J956
25059B64j880j056K219m741k218l07o39n03k98R49l98O599l141p836m091O77J072
25042a5328N824J299J248O511N897K171o762m504M983K864l022m232o222k247
25028a1520J279J493O226Q121J720j79P25j132k216j306J090p109M042J738m842
$$ plain form
25013 -1870 -98 2874 -2929 -7180 -9457 -5542 -11056 -7245 -4045 -5520 -3333 -9247 -9990 -9683 -4976
24998 -4976 6124 4379 1126 -4746 -5457 -3466 -5775 -6413 -5077 -2111 -2888 -5575 -4731 -674 -384 -1737
24982 -1737 -3159 -2791 -4453 -3876 -1815 -812 1287 -640 -647 3220 7795 5886 1177 -5593 -4265 -8121
24966 -8121 -4480 -5255 2884 12911 3821 -3365 -5468 -45 6126 3062 1091 3215 -149 -5975 -7832
24951 -7832 -3823 -3021 -573 6589 7925 7044 8004 7260 1674 1167 2699 4933 2264 -635 -3795 -10667
24935 -10667 -10169 -8318 -4985 -7808 -14832 -13902 -10256 -6911 -1645 4959 1420 4038 6385 8313 8774
24920 8774 2152 -758 -2327 -3370 -1579 -519 -6859 -9438 -4076 -2025 -1489 -5658 -4989 -6409 -5688
24905 -5688 -2548 -3471 -3804 747 1402 -2541 4546 10125 3325 -3204 2987 2200 36 236 -6798 -10278
$$ packed form
25013a870J772K972n803m251k277L915n514L811L200j475K187n914p43L07M707
24998d976J1100j745l253n872p11J991k309o38J336K966p77k687Q44M057K90j353
24982a737j422L68j662N77K061J003K099j927pL867M575j909m709o770J328l856
24966h121L641p75Q139J0027r090p186k103N423O171l064j971K124l364n826j857
24951g832M009Q02K448P162J336q81R60p44n586n07J532K234k669k899l160o872
24935a0667M98J851L333k823p024R30L646L345N266O604l539K618K347J928M61
24920H774o622k910j569j043J791J060o340k579N362K051N36m169O69j420P21
24905e688L140r23l33M551O55l943P087N579o800o529O191p87k164K00p034l480
$$ plain form
24889 -10278 -6866 -742 1615 -2936 -11106 -11996 -14276 -13210 -9651 -5738 -2551 509 5463 11877 14571
24874 14571 15390 12411 8362 1117 -2805 -3310 -4448 -326 -2245 -4427 -2908 -7137 -8751 -3760 1087
24859 1087 6181 6505 -121 -3612 -8541 -9853 -8473 -7962 -7818 -6954 -4471 -439 2429 -73 7284 9166
24843 9166 1850 -4227 -4411 1810 4487 1880 -3538 -6943 370 10058 8759 4656 -214 -4184 -798
24828 -798 1557 -3061 -1129 1854 2501 4115 -187 -2588 -7972 -10429 -4317 -207 6040 5783 -2459
24813 -2459 -4466 -582 -1541 -2253 3001 6293 3924 -4697 -13162 -11142 -4624 2474 -298 782 1791
24798 1791 1866 1918 1380 2576 5302 8011 6427 4208 975 -335 -4766 -2949 -351 -1173 -3370 -5125
24782 -5125 -5124 289 -189 -4128 -7000 -5677 -2075 -6073 -8697 -8570 -7828 -9357 -11152 -7322 -12599 -12367
$$ packed form
24889a0278L412O124K357m551q170q90k280J066L559L913L187L060M954O414K694
24874A4571Q19k979m049p245l922n05j138M122j919k182J519m229j614M991M847
24859A087N094L24o626l491m929j312J380N11J44Q64K483M032K868k502P357J882
24843I166p316o077j84O221K677k607n418l405P313R688j299m103m870l970L386
24828g98K355m618J932K983O47J614m302k401n384k457O112M110O247k57q242
24813b459k007L884r59p12N254L292k369q621q465K020O518P098k772J080J009
24798A791P5N2n38J196K726K709j584k219l233j310m431J817K598q22k197j755
24782e125JN413m78l939k872J323L602l998k624J27P42j529j795L830n277K32
$$ plain form
24766 -12367 -8343 -3046 -3931 -5820 -5178 -3616 -3873 -5098 -6831 4036 4641 6894 3333 2208 639
24751 639 620 4370 1067 -637 1504 6148 4881 -1371 201 -951 -4577 -2603 -3302 -5571 -5671 -5396
24735 -5396 -4788 -4890 -6932 -5909 -6211 -8291 -12392 -12724 -8429 -1433 -3714 -8670 -7656 -3417 -1229 -3044
24719 -3044 -5035 -1937 -3889 -2757 1352 355 -333 -7520 -2234 2525 -6414 -10358 -10417 -5539 601 2752
24703 2752 2910 -1217 -1016 2303 6685 4798 -1591 -6987 -5200 -2304 -11704 -10517 -3861 -4620 -4073 3560
24687 3560 7653 8789 5318 2618 -4083 -1717 -6383 -8166 -9942 -9835 -10956 -13045 -2767 -918 -1553
24672 -1553 -1542 -4048 -7221 -7786 -9730 -5534 -2727 -4998 -3272 -7373 -9088 -8796 -9022 -7410 -2120 -1947
24656 -1947 -7789 -8093 -5873 -10694 -12234 -7349 -6421 -1981 940 108 -2088 -3986 -3879 -2802 -7603 -9420
$$ packed form
24766a2367M024N297q85j889O42J562k57j225j733J0867O05K253l561j125j569
24751F39j9L750l303j704K141M644j267o252J572j152l626J974o99k269j00K75
24735e396O08j02k042J023l02k080m101l32M295O996k281m956J014M239K188j815
24719c044j991L098j952J132M109r97o88p187N286M759q939l944n9M878O140K151
24703B752J58m127K01L319M382j887o389n396J787K896r400J187O656p59N47P633
24687C560M093J136l471k700o701K366m666j783j776J07j121k089J0278J849o35
24672a553J1k506l173n65j944M196K807k271J726m101j715K92k26J612N290J73
24656a947n842l04K220m821j540M885R28M440K921q32k196j898J07J077m801j817
$$ plain form
24640 -9420 -3585 -2635 -5039 -2299 -396 -596 -2524 -8701 -8135 -5052 -137 2466 1429 -887 -6971
24625 -6971 -9098 -4617 -10213 -13881 -4642 2215 5254 4093 -2774 -11914 -14592 -14764 -18285 -17115 -7462
24610 -7462 -9910 -8506 420 -673 -4749 -1027 1803 9286 12170 15456 14482 19131 18451 10140 9151
24595 9151 12827 6370 518 -2308 2600 9726 6804 -336 6045 3680 -801 -4343 305 6554 3857
24580 3857 -290 1917 11886 11196 4313 3425 3112 621 -743 -4206 -5095 4509 4382 823 -1592 2733
24564 2733 7821 5778 3914 4092 -2702 -6133 -7283 -5953 -1801 -608 -1601 -1748 -4122 -6173 -8439
24549 -8439 -6745 -8101 -8169 -330 1100 -199 389 4650 4617 3874 -5030 -9708 -5554 -1993 -3234 -3752
24533 -3752 -3819 -4357 -6446 -12266 -6680 -1403 -2603 -8242 -11308 -15670 -11547 -8856 -4637 -2002 -163
$$ packed form
24640i420N835R50k404K740J903k00j928o177N66L083M915K603j037k316o084
24625f971k127M481n596l668R239O857L039j161o867r140k678j72l521J170R653
24610g462k448J404Q926j093m076L722K830P483K884L286r74M649o80q311r89
24595I151L676o457n852k826M908P126k922p140O381k365m481l542M648O249k697
24580C857m147K207R969o90o883q88l13k491j364l463q89R604j27l559k415M325
24564B733N088k043j864J78o794l431j150J330M152J193r93j47k374k051k266
24549h439J694j356o8P839J430j299N88M261l3p43q904m678M154L561j241n18
24533c752o7n38k089n820N586N277j200n639l066m362M123K691M219K635J839
$$ plain form
24518 -163 2339 565 1162 5408 8262 -632 -4138 -489 -2313 -1056 -2396 -1057 -4752 -5920 -1052
24503 -1052 2010 -2423 -3845 -587 5809 7537 1239 -1891 200 -2675 771 2076 6541 8370 5118
24488 5118 6111 3333 566 2656 10236 7609 4596 3948 2457 -511 1644 5245 1905 -4299 -3074
24473 -3074 -3498 -6355 1261 3032 4077 2767 -219 -9393 -11523 -10089 -6667 -1404 -1887 -5346 -7232
24458 -7232 -4238 -4546 -3956 -326 -587 -7360 -3041 -852 2239 1837 -3889 -2140 3719 2680 -2459 -9059
24442 -9059 -16273 -15778 -14367 -14949 -13173 -8664 -7322 -12473 -9642 -9356 -13180 -14688 -7127 -1877 1481
24427 1481 7891 16844 14358 3887 -2290 -3086 -9703 -8359 -923 1022 -5300 -6979 -6197 -3090 -1958
24412 -1958 -910 7036 7432 -3305 -6706 -4067 -6863 -331 -3971 -4108 -4313 -2640 -494 370 -2184
$$ packed form
24518a63K502j774N97M246K854q894l506L649j824J257j340J339l695j168M868
24503a052L062m433j422L258O396J728o298l130K091k875L446J305M465J829l252
24488E118R93k778k767K090P580k627l013o48j491k968K155L601l340o204J225
24473c074m24k857P616J771J045j310k986r174k130J434L422N263m83l459j886
24458g232K994l08N90L630k61o773M319K189L091m02n726J749N859j039n139o600
24442i059p214M95J411n82J776M509J342n151K831K86l824j508P561N250L358
24427A481O410Q953k486j0471o177p96o617J344P436J945o322j679P82L107J132
24412a958J048P946L96j0737l401K639k796O532l640j37k05J673K146Q64k554
$$ plain form
24397 -2184 -9380 -6862 -1365 -673 1815 1949 -6702 -8859 -12373 -7960 -3025 2373 6419 5253 8643
24382 8643 10264 5454 5152 7750 1009 -1767 -2093 -4307 -2517 -4043 -6178 -6140 885 3997 2294 -865
24366 -865 -3482 -8871 -8277 -8688 -4561 2300 6493 5340 5637 2261 -2814 -5996 -6489 -757 4494 4121
24350 4121 -422 -1544 -3261 410 1083 -8712 -15404 -13414 -7797 -8325 -13341 -10264 -9908 -17896 -13705
24335 -13705 -11566 -17173 -22245 -16157 -12838 -10758 -4716 -2844 2597 5036 1911 663 667 3543 6162
24320 6162 4170 2741 1759 5894 440 -52 2703 92 -6 -1323 -8172 -12337 -7674 -6212 -7996 -7513
24304 -7513 4307 7722 -88 2593 3728 -5155 -8995 -3439 2428 1476 -4809 -6541 -10246 -10979 -13509
24289 -13509 -15394 -15616 -13521 -15468 -16095 -6355 -2080 -4413 -8274 -5816 -687 712 -6478 -14108 -13879
$$ packed form
24397b184p196K518N497O92K488J34q651k157l514M413M935N398M046j166L390
24382H643J621m810l02K598o741k776l26k214J790j526k135L8P025L112j703l159
24366h65k617n389N94m11M127O861M193j153K97l376n075l182m93N732N251l73
24350D121m543j122j717L671O73r795o692J990N617n28n016L077L56p988M191
24335a3705K139n607n072O088L319K080O042J872N441K439l125j248MK876K619
24320F162j992j429r82M135n454m92K755k611r8j317o849m165M663J462j784M83
24304g513J1820L415p810K681J135q883l840N556N867r52o285j732l705p33k530
24289a3509j885k22K095j947o27R740M275k333l861K458N129J399p190p630K29
$$ plain form
24274 -13879 -9428 -6882 -4623 -2564 831 4334 6473 1660 269 1234 4255 3945 1805 -1275 -209
24259 -209 -742 -1994 -8732 -7643 -3093 -4005 -6132 -7739 -15524 -15010 -12509 -14236 -13475 -10296 -6374 -2161
24243 -2161 -155 -1550 677 1788 -1430 -997 -856 -2279 -2122 -3365 -7933 -7392 -6375 -3749 2017 5057
24227 5057 6598 5839 7275 5570 1236 -646 -3175 -315 4402 -3711 -8449 -415 414 -1547 -2808
24212 -2808 -7732 -5091 -1849 -6392 -7361 -8218 -8795 -10285 -7663 -5063 -9887 -7599 -6643 -3649 -1662 2255
24196 2255 11137 8740 12 -5062 -2982 -1848 -4838 -8496 -7752 -8000 -6399 -859 -45 -2579 -2490 -21
24180 -21 -1450 -3187 -769 -1682 -6669 -7372 -9380 -12112 -7851 -594 -4083 -4736 -3946 1836 -328 -5682
24164 -5682 -8733 -8880 -6054 -763 21 6079 4449 -4167 -12390 -11931 -5425 -1881 -1404 -4801 -11695 -6833
$$ packed form
24274a3879M451K546K259K059L395L503K139m813j391R65L021l10k140l080J066
24259b09n33j252o738J089M550r12k127j607p785N14K501j727P61L179L922M213
24243b161K006j395K227J111l218M33J41j423J57j243m568N41J017K626N766L040
24227E057J541p59J436j705m334j882k529K860M717q113m738Q034Q29j961j261
24212b808m924K641L242m543r69q57n77j490K622K600m824K288R56K994J987L917
24196B255Q882k397q728n074K080J134k990l658P44k48J601N540Q14k534Q9K469
24180b1j429j737K418r13m987p03k008k732M261P257l489o53P90N782k164n354
24164e682l051j47K826N291P84O058j630q616q223M59O506L544M77l397o894M862
$$ plain form
24148 -6833 -11553 -8988 -3198 587 828 -972 -3506 592 3400 1500 -2863 -1741 -729 -4515 -4138
24133 -4138 -4457 -5630 -9577 -5881 -2144 1701 -2230 -2000 5735 10072 19695 21581 15399 11478 2162
24118 2162 634 4276 936 230 1484 -1638 -6178 -5788 -3535 -5051 -4670 -1174 7952 4890 4050 -2846
24102 -2846 2000 3686 1407 -4368 -11668 -9663 -8546 -10671 -14567 -7017 -2095 -7828 -7938 271 6240
24087 6240 2563 3327 6226 3611 -3517 -10312 -11651 -8247 -2927 -5624 -8382 -16055 -21673 -12184 -6641
24072 -6641 -3610 -6437 -8113 -4352 4580 8700 5714 -1669 -6179 -5762 -7117 -7635 -4399 -8346 -7462
24057 -7462 -5238 -4714 -7015 -11300 -14145 -14612 -14502 -6926 -3700 405 186 -4427 -5241 1676 4821 -2576
24041 -2576 -2236 -6740 -1687 0 -4121 -6437 -7272 -4474 1613 2168 -184 654 -3344 -10098 -8028 -7517
$$ packed form
24148f833m720K565N790L785K41j800k534M098K808j900m363J122J012l786L77
24133d138l19j173l947L696L737L845l931K30P735M337R623J886o182l921r316
24118B162j528L642l340p06J254l122m540L90K253j516L81L496R126l062q40o896
24102b846M846J686k279n775p300K005J117k125l896P550M922n733j10Q209N969
24087F240l677P64K899k615p128o795j339L404N320k697k758p673n618R489N543
24072f641L031k827j676L761Q932M120k986p383m510M17j355n18L236l947Q84
24057g462K224N24k301m285k845m67J10P576L226M105k19m613q14O917L145p397
24041b576L40m504N053J687m121k316q35K798O087N55k352Q38l998o754K070N11
$$ plain form
24025 -7517 -4510 -2444 -4939 -4831 -6491 -2357 -237 -1246 -5341 -1907 872 1722 4113 4048 5248 -3738
24009 -3738 -3632 -6462 -8265 -8553 -8013 -8290 -5150 -1877 -3430 -2272 1412 4832 806 -6482 -6906 -1502
23993 -1502 71 -441 -1273 -4768 -9203 -12796 -15145 -10118 -634 -1198 -801 6069 5337 952 -1794 1032
23977 1032 -2377 -9455 -7761 -4113 -2672 2461 3653 8089 10994 8623 6524 3325 3387 2733 -1137
23962 -1137 -7614 -7885 -10485 -11433 -11355 -5372 -1431 -5779 -15216 -20605 -18123 -15955 -18923 -13518 -6467 -1522
23946 -1522 3384 -1119 -2669 -8766 -7821 1456 5890 3842 -1467 -3995 -2652 -5237 -12323 -13465 -9775
23931 -9775 -4626 -7601 -10857 -13645 -8555 -1595 13 -4758 -8540 -10570 -14581 -9629 -5318 -4080 -8801
23916 -8801 -12296 -9360 -3336 2156 -174 -6967 -15875 -11734 -17023 -18441 -8123 -2797 -5817 -5540 -3910
$$ packed form
24025g517L007K066k495J08j660M134K120j009m095L434K779Q50K391o5J200q986
24009c738J06k830j803k88N40k77L140L273j553J158L684L420m026p288m24N404
23993a502J573n12q32l495m435l593k349N027R484n64L97O870p32m385k746K826
23977A032l409p078J694L648J441N133J192M436K905k371k099l199O2o54l870
23962a137o477k71k600r48P8N983L941m348r437n389K482K168k968N405P051M945
23946a522M906m503j550o097R45R277M434k048n309k528J343k585p086j142L690
23931i775N149k975l256k788N090O960J608m771l782k030m011M952M311J238m721
23916h801l495K936O024N492k330o793q908M141n289j418J0318N326l020K77J630
$$ plain form
23901 -3910 549 -2060 -4573 -6489 -5139 -4931 -5722 -7637 -10183 -10201 -2000 4012 4941 40 -3700 -3962
23885 -3962 -7981 -7810 -6719 -5859 -7746 -9079 -13263 -18228 -14892 -7627 -4521 -1266 346 -5520 -3040
23870 -3040 1236 -2928 -7023 -7165 -7270 -2310 1174 -3781 -6090 -6758 -5656 -5826 -5574 -3341 -976 -266
23854 -266 1315 684 -2542 -5757 -9668 -4099 -525 1428 -3530 -5172 -2937 -8116 -10476 -5228 -2203
23839 -2203 -2320 -8681 -9221 -11458 -15707 -17344 -19271 -13931 -11145 -9044 -4031 -48 -9621 -13713 -7625
23824 -7625 -4663 -2776 -1344 -2029 6786 9151 7081 5099 2691 -2407 1365 -750 -1566 -3448 -3301
23809 -3301 894 -2792 -1738 -265 -3612 -4994 -846 3385 8191 7078 3683 4817 9048 7023 2279
23794 2279 536 -2043 2592 8502 2242 -2239 -5409 -406 -1805 -1743 -5050 -9033 -5719 -540 524
$$ packed form
23901c910M459k609k513j916J350K08p91j915k546j8Q201O012R29m901l740k62
23885c962m019J71J091Q60j887j333m184m965L336P265L106L255J612n866K480
23870c040M276m164m095j42j05M960L484m955k309o68J102j70K52K233K365P10
23854b66J581o31l226l215l911N569L574J953m958j642K235n179k360N248L025
23839b203j17o361n40k237m249j637j927N340K786K101N013L983r573m092O088
23824g625K962J887J432o85Q815K365k070j982k408n098L772k115q16j882J47
23809c301M195l686J054J473l347j382M148M231M806j113l395J134M231k025m744
23794B279j743k579M635N910o260m481l170N003j399O2l307l983L314N179J064
$$ plain form
23779 524 426 -7701 -11568 -14290 -6648 -2310 489 -2061 793 711 -1806 -1117 -2604 -6174 -2054 1200
23763 1200 -1571 -1881 -1254 2906 344 -8347 -10035 -2417 -447 -6739 -9320 -6607 -765 2093 2795
23748 2795 -5544 -12475 -15050 -12608 -7824 -579 -2713 -5632 -9279 -4623 -213 -2096 -2145 780 -3026
23733 -3026 -4184 -4588 -2771 -1265 159 -3139 -975 12 3659 -1381 -5627 -2476 4079 6746 6261
23718 6261 -1597 -6447 -9119 -8697 -5686 -7740 -2405 -275 -11414 -10224 -7980 -5912 -6829 -11206 -8408
23703 -8408 -10331 -8868 -3758 5820 12354 8476 4828 7156 4883 1867 3935 7191 10284 6940 -1336
23688 -1336 -9620 -10748 -8171 -4298 -820 -2565 -199 -3016 -1946 -2291 -8602 -13418 -9581 -4998 667
23673 667 5873 6866 4623 7042 10203 6503 3809 411 -3984 -642 -2324 -5542 -3023 -11414 -12071
$$ packed form
23779E24r8q127l867k722P642M338K799k550K854q2k517O89j487l570M120L254
23763A200k771l10O27M160k562q691j688P618J970o292k581K713N842K858P02
23748B795q339o931k575K442M784P245k134k919l647M656M410j883m9K925l806
23733c026j158m04J817J506J424l298K164R87L647n040m246L151O555K667m85
23718F261p858m850k672M22L011k054N335K130j1139J190K244K068r17m377K798
23703h408j923J463N110R578O534l878l648K328k273l016K068L256L093l344q276
23688a336q284j128K577L873L478j745K366k817J070l45o311m816L837M583N665
23673F67N206R93k243K419L161l700k694l398m395L342j682l218K519q391o57
$$ plain form
23658 -12071 -2632 -304 -489 413 1707 1682 3714 7971 13008 7085 1660 1006 3888 2902 -574 312
23642 312 1201 1174 3854 5248 663 738 -483 -5642 -2100 -1331 -1221 133 1874 2356 2085 -5256 -6975
23625 -6975 -2014 289 3815 6199 8064 2652 5039 6356 2192 -1658 -1636 -4188 2454 -169 -2103
23610 -2103 188 -4917 -3802 2444 -4177 -6338 -2027 -7978 -10131 -6392 -6199 -5567 423 2134 2918
23595 2918 4709 2793 -7009 -5354 -118 729 5465 4941 -2907 -1036 -497 -6864 -5935 -8960 -11297 -2983
23579 -2983 -2188 1093 -2541 -3620 -5616 -5191 -3661 -3292 -8708 -1917 3506 6266 7106 6158 10228 4673
23563 4673 -4040 -4526 -5626 -5524 -2121 5802 3283 -193 -68 5091 3654 1306 -748 -3369 -5268
23548 -5268 -6959 -237 7751 6895 5623 4202 -1985 1584 -2572 -4266 -3120 -2687 -3920 1433 5929
$$ packed form
23658a2071R439K328j85R02J294k5K032M257N037n923n425o54K882r86l476Q86
23642C12Q89k7K680J394m585P5j221n159L542P69J10J354J741M82k71p341j719
23625f975M961K303L526K384J865n412K387J317m164l850K2k552O642k623j934
23610b103K291n105J115O246o621k161M311n951k153L739J93O32N990J711P84
23595B918J791j916r802J655N236Q47M736n24p848J871N39o367R29l025k337Q314
23579b983P95L281l634j079j996M25J530L69n416O791N423K760Q40r48M070n555
23563D673q713m86j100J02L403P923k519l476J25N159j437k348k054k621j899
23548e268j691O722P988q56j272j421o187L569m156j694J146M33j233N353M496
$$ plain form
23533 5929 4138 2510 -1849 -3879 1640 -248 -8871 -11186 -11341 -14644 -12747 -10913 -14872 -19257 -16606
23518 -16606 -9532 -9374 -11349 -11071 -10102 -7682 -2788 -4606 -8815 -13556 -14860 -8381 -6836 -8548 -7600
23503 -7600 -6082 -7539 -4951 -4433 2970 7566 5331 1079 -1876 -3453 -4800 -2273 -1310 -7828 -8192
23488 -8192 -9099 -6704 -7778 -7416 -4676 1585 1727 -2227 888 2440 5159 6726 9898 11414 -161
23473 -161 -6688 -2559 -144 -1443 -4388 -2287 1044 2175 -3626 -7804 -8933 90 6992 3182 -2794
23458 -2794 -7467 1497 7250 1930 389 -6856 -3904 213 2804 4307 7465 11693 12952 7355 6003
23443 6003 5131 -1416 -2042 -3188 -1656 1877 -680 -2058 -2532 0 1735 2384 1820 1334 -3823 -2012
23427 -2012 535 686 3595 2416 594 -1627 1537 1232 -2429 -7015 -8178 -8208 -10490 -14878 -9930 -6456
$$ packed form
23533E929j791j628m359k030N519j888q623k315j55l303J897J834l959m385K651
23518a6606P074J58j975K78R69K420M894j818m209m741j304O479J545j712R48
23503g600J518j457K588N18P403M596k235m252k955j577j347K527R63o518l64
23488h192r07K395j074L62K740O261J42l954L115J552K719J567L172J516j1575
23473a61o527M129K415j299k945K101L331J131n801m178j129R023O902l810n976
23458b794m673Q964N753n320j541p245K952M117K591J503L158M228J259n597j352
23443F003q72o547o26j146J532L533k557j378m74K532J735O49n64m86n157J811
23427b012K547J51K909j179j822k221L164l05l661m586j163l0k282m388M948L474
$$ plain form
23411 -6456 -831 2753 2202 1864 945 3575 384 -5535 -8103 442 1417 -9681 -7885 -6054 137
23396 137 -887 -5258 -7487 -9494 -8132 -3750 127 3704 -320 -1144 -329 3157 2130 994 -6341
23381 -6341 -2269 5776 9646 6834 8653 -1832 -9741 -7348 1624 -4979 -10140 -8032 -13668 -12601
23367 -12601 -5549 -5064 -6410 -2081 -926 -7913 -10214 -10978 -10591 -8033 -5117 -10766 -11499 -8435 -2176
23352 -2176 3121 9692 5286 -2399 -5854 -5228 -4526 -7905 -4298 -1673 -1316 260 4033 2668 -4060
23337 -4060 -5305 -4863 -272 1812 1827 1058 4907 4080 7470 7316 -3817 -8113 -4798 -2599 -3258 -3323 5110
23320 5110 10410 3828 6816 2192 -711 7086 9178 5074 -724 -9115 -13430 -17359 -11435 -1598 -39
23305 -39 930 792 -1925 -6667 -839 1768 3058 8026 13269 15168 2362 -3055 536 2651 5892
$$ packed form
23411f456N625L584n51l38r19K630l191n919k568Q545R75j1098J796J831O191
23396A37j024m371k229k007J362M382L877L577m024q24Q15L486j027j136p335
23381f341M072Q045L870k812J819j0485p909K393Q972o603n161K108n636J067
23367a2601P052M85j346M329J155o987k301p64L87K558K916n649p33L064O259
23352b176N297O571m406p685l455O26P02l379L607K625L57J576L773j365o728
23337d060j245M42M591K084J5p69L849q27L390j54j1133m296L315K199o59o5Q433
23320E110N300o582K988m624k903P797K092m104n798q391m315l929N924R837J559
23305c9R69j38k717m742N828K607J290M968N243J899j2806n417L591K115L241
$$ plain form
23290 5892 7773 4874 -1101 -9785 -15686 -9585 1317 6023 2801 2854 2801 -1211 1317 601 -4200 -3479
23274 -3479 -1271 -523 2267 3320 2787 738 1866 11812 10110 8583 8968 7016 2541 5770 7010
23259 7010 4795 1852 -1986 5914 2993 2330 6329 8319 5100 3916 3119 913 -1306 -7663 -8433
23244 -8433 -7006 -6583 -11162 -10410 914 2447 -3063 -7296 -10345 -6669 -9787 -10343 -5127 3494 2223
23229 2223 1560 448 -699 -4163 -7852 -8090 1014 4334 222 5029 12007 13247 11297 9006 5532
23214 5532 4227 38 -1847 2996 -279 3987 6103 6206 7143 12065 10119 10780 5843 4767 3449
23199 3449 6923 12736 13016 14070 13118 9980 11748 10058 9442 6001 7057 2206 -199 6187 9892
23184 9892 10278 5890 3081 2579 -612 1000 2465 6927 6144 2803 1668 5502 -240 -5461 -10570
$$ packed form
23290E892J881k899n975q684n901O101J0902M706l222N3n3m012K528p16m801P21
23274c479K208P48K790J053n33k049J128R946j702j527L85j952m475L229J240
23259G010k215k943l838P900k921o63L999J990l219j184p97k206k219o357p70
23244h433J427M23m579P52J1324J533n510m233l049L676l118n56N216Q621j271
23229B223o63j112j147l464l689k38R104L320m112M807O978J240j950k291l474
23214E532j305m189j885M843l275M266K116J03R37M922j946O61m937j076j318
23199C449L474N813K80J054r52l138J768j690o16l441J056m851k405O386L705
23184I892L86m388k809n02l191J612J465M462p83l341j135L834n742n221n109
$$ plain form
23169 -10570 -9228 -10767 -9079 -7458 -4133 3250 2248 -4255 -11007 -9719 -4525 -5261 -5785 -3373 -347
23154 -347 -2832 -5846 -1303 594 2988 1583 343 -2253 6975 13214 6482 808 265 1078 1002 4526
23138 4526 7250 2560 580 447 2160 3546 -1231 568 255 1229 5265 5687 3547 4388 6206 2274
23122 2274 -2054 -3127 -3830 3181 10223 9938 3780 -1443 -4 2419 1614 5061 1068 14 -1727
23107 -1727 -3259 -1074 -91 -2015 -5431 -7397 -4161 6580 14893 15490 18967 14294 655 -3830 -2260
23092 -2260 -4261 -7969 -7009 -3650 -4331 -7321 -8678 -10405 -10169 -15368 -6783 -1707 1331 2603 4284
23077 4284 9706 14180 19766 12859 8871 11325 10816 11585 10222 10707 11210 12779 14009 20880 25092 16653
23061 16653 15759 16775 18616 14291 7107 12797 18818 18237 10217 6054 8004 5326 1638 2676 9998
$$ packed form
23169a0570J342j539J688J621L325P383j002o503o752J288N194p36n24K412L026
23154c47k485l014M543J897K394j405j240k596R228O239o732n674n43Q13p6L524
23138D526K724m690j980j33J713J386m777J799l13R74M036M22k140Q41J818l932
23122B274m328j073p03P011P042k85o158n223J439K423q05L447l993j054j741
23107a727j532K185R83j924l416j966L236J0741Q313N97L477m673j3639m485J570
23092b260k001l708R60L359o81k990j357j727K36n199Q585N076L038J272J681
23077D284N422M474N586o907l988K454n09P69j363M85N03J569J230O871M212q439
23061A6653q94J016J841m325p184N690O021n81q020m163J950k678l688J038P322
$$ plain form
23046 9998 9992 2451 -882 6178 7460 4577 3410 7664 7414 -473 -996 -2100 -751 -205 -860 -2765
23030 -2765 -968 2932 4388 8124 5531 2045 -5442 -3652 4694 7304 4573 606 3111 6351 -2557
23015 -2557 -6579 -7520 -6308 1193 3981 8824 12321 3227 360 2226 -4521 -9938 -1370 -3360 -6191
23000 -6191 1214 4371 4500 373 3792 10780 12638 9606 6105 2418 1777 8294 6515 7438 1049
22985 1049 -2987 -6802 -895 3100 -629 -781 -5677 -6107 -5281 -4384 -4417 -5451 -6781 -4310 2801 4090
22969 4090 1976 -640 742 3122 4828 4334 -2958 -9649 -9208 -735 2352 1026 -4427 -8088 -1862
22954 -1862 -3949 -8723 -2950 -1490 -3705 -3760 -4022 -2768 -3721 -8454 -4242 -1412 1023 4131 2858 11184
22938 11184 14661 10736 7475 7609 7982 16151 17718 11434 7590 6158 7112 7398 5150 8869 11757
$$ packed form
23046I998op541l333P060J282k883j167M254k50p887n23j104J349N46o55j905
23030b765J797L900J456L736k593l486p487J790Q346K610k731l967K505L240q908
23015b557m022r41J212P501K788M843L497r094k867J866o747n417Q568j990k831
23000f191P405L157J29m127L419O988J858l032l501l687o41O517j779R23o389
22985A049m036l815N907L995l729j52m896m30Q26Q97l3j034j330K471P111J289
22969D090k114k616J382K380J706m94p292o691M41Q473L087j326n453l661O226
22954a862k087m774N773J460k215n5k62J254r53m733M212K830K435L108j273Q326
22938A1184L477l925l261J34L73Q169J567o284l844j432R54K86k248L719K888
$$ plain form
22923 11757 11148 3441 1172 2124 643 -2303 1011 7063 13784 9599 7333 12213 15049 15366 14296
22908 14296 10312 9272 7900 1602 2184 7896 3197 2749 4939 11596 14120 21995 26852 21575 20329
22893 20329 18757 15624 8787 4764 -195 770 3264 -3506 -7855 -4861 2247 1553 1195 -586 -884
22878 -884 4484 229 -2375 4404 8653 13617 10814 1033 -2014 -10320 -18063 -9891 -4893 -260 -162
22863 -162 -8331 -4391 -990 -364 5540 3669 4068 10238 12110 6029 3203 2406 1872 -1989 -2863 4874
22847 4874 6518 3414 -771 1324 1731 2709 5151 4587 8016 11368 9318 11526 12046 7319 10904 16654
22831 16654 12837 3783 -278 3791 -4280 -9599 -8964 4707 9111 4600 -114 -983 1518 6444 4586
22816 4586 5293 7171 10794 7844 4481 5844 -1745 -6320 -5676 -3533 -890 1363 3820 43 727
$$ packed form
22923A1757o09p707k269R52j481k946L314O052O721m185k266M880K836L17j070
22908A4296l984j040j372o298N82N712m699m48K190O657K524P875M857n277j246
22893B0329j572l133o837m023m959R65K494o770m349K994P108o94l58j781k98
22878h84N368m255k604O779M249M964k803r781l047q306p743Q172M998M633R8
22863a62q169L940L401O26N904j871L99O170J872o081k826p97n34l861q74P737
22847D874J644l104m185K095M07R78K442n64L429L352k050K208N20m727L585N750
22831A6654l817r054m061M069q071n319O35J3671M404m511m714q69K501M926j858
22816D586P07J878L623k950l363J363p589m575O44K143K643K253K457l777O84
$$ plain form
22801 727 1454 6060 10672 6507 1754 3897 10218 10575 14910 19749 23360 28363 26006 24675 27353
22786 27353 28089 24581 24488 24820 17503 5318 3409 9239 11285 9729 12922 11734 6032 15943 14205
22771 14205 6093 -283 3430 11356 16715 22352 19435 15328 10527 8753 8769 9867 6826 4762 1668
22756 1668 6028 7117 7370 1958 4785 9610 7307 9324 4420 211 4914 14290 14617 18863 16350
22741 16350 8445 8539 9447 7145 9073 14115 15649 11945 8854 6246 1900 6072 14564 20187 21309
22726 21309 14891 16800 16033 15422 16437 21893 22415 25852 32576 30518 31356 38454 34046 37850 42819
22711 42819 46165 47745 48724 47934 42667 47565 51315 74133 93822 102392 113021 126382 148799 188201
22697 188201 248055 337616 481635 751836 1202010 1683569 2020084 2261342 2340774 2198892
$$ packed form
22801G27P27M606M612m165m753K143O321L57M335M839L611N003k357j331K678
22786B7353P36l508r3L32p317j2185j909N830K046j556L193j188n702R911j738
22771A4205q112o376L713P926N359N637k917m107m801j774J6J098l041k064l094
22756A668M360J089K53n412K827M825k303K017m904m209M703R376L27M246k513
22741A6350p905R4R08k302J928N042J534l704l091k608m346M172Q492N623J122
22726B1309o418J909p67o11J015N456N22L437O724k058Q38P098m408L804M969
22711D2819L346J580R79p90n267M898L750K2818J9689Q570J0629J3361K2417L9402
22697A88201N9854Q9561J44019K70201M50174M81559L36515K41258P9432j41882
$$ plain form
22687 2198892 1883613 1540094 1242867 947704 669190 457177 322571 244905 194812 156854
22677 156854 121547 97470 83420 73376 61819 58297 56471 45877 36483 35244 34491 29587 24519
22664 24519 21073 15856 15829 17428 19080 14025 10871 6201 2454 7761 17711 24916 26967 26484 20384
22649 20384 16484 15033 15639 16934 15422 10663 12810 16651 17565 16710 12517 10285 9383 6818 1757
22634 1757 2727 8022 11002 18906 20272 25105 30972 29662 24309 15888 20220 23272 19172 17580 15022
22619 15022 4289 8817 17303 21058 19925 14425 13466 12873 12800 17708 23607 30292 22430 29333 35524
22604 35524 28665 20017 19234 22230 15975 16415 18276 13737 10320 12761 22615 24380 19139 22084 20730
22589 20730 18261 17139 15230 18535 20435 15962 12879 7712 -1424 9990 21908 22058 24561 28916
$$ packed form
22687B198892l15279l43519k97227k95163k78514k12013j34606p7666n0093l7958
22677A56854l5307k4077j4050j0044j1557l522j826j0594r394j239p53m904n068
22664B4519l446n217k7J599J652n055l154m670l747N307R950P205K051m83o100
22649B0384l900j451O06J295j512m759K147L841R14q55m193k232r02k565n061
22634A757R70N295K980P904J366M833N867j310n353q421M332L052m100j592k558
22619A5022j0733M528Q486L755j133n500r59n93p3M908N899O685p862O903O191
22604C5524o859q648p83K996o255M40J861m539l417K441R854J765n241K945j354
22589B0730k469j122j909L305J900m473l083n167r136J1414J1918J50K503M355
$$ plain form
22575 28916 31148 29413 27851 27364 27681 33554 37812 27428 20802 19052 11734 4316 -2139 -5907 -13323
22560 -13323 -17618 -12348 -9395 -2753 -1736 2549 7508 11432 8955 3473 470 1148 -2271 -6644 -5131
22545 -5131 -3565 4059 5296 1931 -3262 -4610 -1419 1696 14943 20202 15309 12796 13514 14432 12950
22530 12950 5501 4843 1961 1121 3246 5886 6876 4104 -403 -3126 -3188 2268 4233 2208 -5239 -2065
22514 -2065 7329 8457 4516 12344 19758 20239 15621 18622 21372 20041 19734 20282 20046 7757 4283
22499 4283 5347 9568 13502 24242 30443 26528 24369 30909 40102 36174 31864 39869 42764 38751
22485 38751 37528 38178 41348 41409 43598 41684 31462 23043 16868 12985 11447 7443 9443 11212 8280
22470 8280 3037 9695 19669 18504 20276 24741 22008 18368 18523 18782 17776 17807 17851 17902 11610 5276 3894
$$ packed form
22575B8916K232j735j562m87L17N873M258j0384o626j750p318p418o455l768p416
22560a3323m295N270K953O642J017M285M959L924k477n482l003O78l419m373J513
22545e131J566P624J237l365n193j348L191L115J3247N259m893k513P18R18j482
22530A2950p449o58k882q40K125K640R90k772m507k723o2N456J965k025p447L174
22514b065R394J128l941P828P414M81m618L001K750j331l07N48k36j2289l474
22499D283J064M221L934J0740O201l915k159O540R193l928m310Q005K895m013
22485C8751j223O50L170O1K189j914j0222q419o175l883j538m004K000J769k932
22470H280n243O658R974j165J772M465k733l640J55K59j006L1M4N1o292o334j382
$$ plain form
22453 3894 6147 15677 12207 8043 12226 11826 12706 8277 6595 5329 6376 12681 15110 17163 21864
22438 21864 28565 27700 22547 24648 32022 27141 21650 9602 5723 10907 11382 5071 -3081 -6703 -12301
22423 -12301 -14648 -14636 -18339 -22264 -25002 -34325 -48483 -53272 -39996 -24297 -6711 28140 64356
22410 64356 86775 102684 115071 127616 127692 122019 109166 101527 92037 89084 91273 93489 95194 98130
22396 98130 101691 101546 95917 89864 88722 76151 68148 60057 53252 45894 36495 32719 24389 24225 26380
22381 26380 25213 26265 25409 34828 36154 39772 43993 45985 47626 49661 49161 48807 60245 63140 50621
22366 50621 36763 38993 43754 46173 54512 71995 98997 135012 175026 218831 256804 269985
22354 269985 278153 269707 247462 233116 200259 167183 149198 120516 91048 81315 80294 69282
$$ packed form
22453C894K253R530l470m164M183m00Q80m429j682j266J047O305K429K053M701
22438B1864O701q65n153K101P374m881n491j2048l879N184M75o311q152l622n598
22423a2301k347J2l703l925k738r323j4158m789J3276J5699J7586L4851L6216
22410F4356K2419J5909J2387J2545P6n673j2853p639r490k953K189K216J705K936
22396I8130L561j45n629o053j142j2571q003q091o805p358r399l776q330j64K155
22381B6380j167J052q56R419J326L618M221J992J641K035n00l54J1438K895j2519
22366E0621j3858K230M761K419Q339J7483K7002L6015M0014M3805L7973J3181
22354B69985Q168q446k2245j4346l2857l3076j7985k8682k9468r733j021j1012
$$ plain form
22342 69282 66750 70913 68538 58664 59209 69032 73410 74978 73433 72869 75181 78829 79590 85286 93607
22327 93607 95084 93333 96264 95791 98462 96236 88228 73007 60112 52874 40758 32486 30524 33147
22313 33147 35958 32882 35544 33186 25063 15851 -1878 -14112 -13137 -14816 -13716 -11269 32 11928
22299 11928 19627 25686 42735 63537 95773 116959 141899 169534 192119 205657 223303 227918
22287 227918 234033 235449 233458 233239 235978 229911 210824 196748 182490 166068 141085 122444 107367
22274 107367 95402 78698 64735 60233 57926 53679 54284 64205 64560 67137 69259 49801 8858
22261 8858 -39726 -80588 -105424 -109639 -103614 -85212 -50936 -16804 9139 43558 80906 111187
22249 111187 137109 157878 176874 195729 214358 227979 232170 233611 235005 227284 211678 202114
$$ packed form
22342F9282k532M163k375r874N45R823M378J568j545n64K312L648P61N696Q321
22327I3607J477j751K931m73K671k226q008j5221j2895p238j2116q272j962K623
22313C3147K811l076K662k358q123r212j7729j2234R75j679J100K447J1301J1896
22299A1928P699O059J7049K0802L2236K1186K4940K7635K2585J3538J7646M615
22287B27918O115J416j991k19K739o067j9087j4076j4258j6422k4983j8641j5077
22274A07367j1965j6704j3963m502k307m247O05R921L55K577K122j9458m0943
22261H858m8584m0862k4836m215O025J8402L4276L4132K5943L4419L7348L0281
22249A11187K5922K0769J8996J8855J8629J3621M191J441J394p721j5606r564
$$ plain form
22237 202114 196626 195959 200001 196273 200666 217998 218228 196417 206604 217305 214595 243535 286465
22224 286465 302963 291767 281789 264057 242535 230312 222158 218600 212467 205795 205161 200737 208442
22211 208442 214918 227927 252585 279203 320887 385396 475746 606397 816481 1211662 1713410
22200 1713410 2074370 2322650 2444237 2343377 2037395 1668645 1375221 1117738 861928
22191 861928 664687 549311 489913 460456 443830 441929 446848 454743 467455 469159 457720 444829
22179 444829 438679 442410 441128 438382 440407 450650 454257 453521 459267 469656 477362 469463 465232 466411
22165 466411 480665 505140 545792 592145 639219 686873 735289 781288 823841 869926 904689
22154 904689 924896 932225 928325 919178 915556 936078 964886 993699 1044794 1109316 1155638 1186792
$$ packed form
22237B02114n488o67M042l728M393J7332K30k1811J0187J0701k710K8940M2930
22224B86465J6498j1196r978j7732k1522j2223q154l558o133o672o34m424P705
22211B08442O476J3009K4658K6618M1684O4509R0350J30651K10084L95181N01748
22200A713410L60960K48280J21587j00860l05982l68750k93424k57483k55810
22191H61928j97241j15376n9398k9457j6626j901M919P895J2712J704j1439j2891
22179D44829o150L731j282k746K025J0243L607p36N746J0389P706p899m231J179
22165D66411J4254K4475M0652M6353M7074M7654M8416M5999M2553M6085L4763
22154I04689K0207P329l900r147l622K0522K8808K8813N1095O4522M6322L1154
$$ plain form
22142 1186792 1210334 1218758 1222351 1241245 1284055 1337877 1419191 1513270 1629048 1767941 1927057
22131 1927057 2127062 2372987 2650574 2927576 3184670 3482870 3827492 4183372 4601344
22122 4601344 5090576 5634395 6243660 6979255 7879143 8957713 10289793 11917257 13971147
22113 13971147 16645070 20140268 24912052 31672700 41251439 55508342 79017398 121482386
22105 121482386 195911186 281819737 338524446 377015594 394864714 377660106 329437170
22098 329437170 271386523 222367684 175235938 126476955 86846466 60709218 44355988
22091 44355988 33679046 26272582 20992936 17133009 14259089 12077046 10349611 8939435
22083 8939435 7792435 6880433 6147681 5523798 4986879 4517965 4101501 3739207 3445546
$$ packed form
22142A186792K3542Q424L593J8894M2810N3822Q1314R4079J15778J38893J59116
22131A927057K00005K45925K77587K77002K57094K98200L44622L55880M17972
22122D601344M89232N43819O09265P35595Q99888J078570J332080J627464K053890
22113A3971147K673923L495198M771784O760648R578739J4256903K3509056M2464988
22105A21482386P4428800Q5908551N6704709L8491148J7849120j7204608m8222936
22098C29437170n8050647m9018839m7131746m8758983l9630489k6137248j6353230
22091D4355988j0676942p406464n279646l859927k873920k182043j727435j410176
22083H939435j147000r12002p32752o23883n36919m68914m16464l62294k93661
$$ plain form
22074 3445546 3213594 3008580 2823583 2673989 2555325 2448526 2346473 2237442 2115217
22065 2115217 1980991 1838645 1696269 1570570 1466753 1371590 1289358 1225697 1175151 1117883
22055 1117883 1053187 992113 925713 864573 812628 754552 695065 657052 621172 574118 542750
22044 542750 539195 539515 547217 562164 579589 585573 580382 582433 592854 590655 568395 539920 505060
22031 505060 467931 439981 428500 423034 407418 391800 379874 362607 342672 324419 305571 297561
22019 297561 293811 301063 310450 316815 337496 366381 407821 451066 509066 587480 695377 875918
22007 875918 1207062 1702600 2102712 2365827 2525094 2487432 2238936 1872569 1555685 1278997
21997 1278997 997950 753006 590786 493635 424878 379880 343605 321695 304008 281780 263850
$$ packed form
22074C445546k31952k05014j84997j49594j18664j06799j02053j09031j22225
22065B115217j34226j42346j42376j25699j03817r5163q2232o3661n0546n7268
22055A117883o4696o1074o6400o1140n1945n8076n9487l8013l5880m7054l1368
22044E42750l555L20P702J4947J7425N984n191K051J0421k199k2260k8475l4860
22031E05060l7129k7950j1481n466j5616j5618j1926j7267j9935j8253j8848q010
22019B97561l750P252R387O365K0681K8885M1440M3245N8000P8414J07897J80541
22007H75918L31144M95538M00112K63115J59267l7662k48496l66367l16884k76688
21997A278997k81047k44944j62220r7151o8757m4998l6275k1910j7687k2228j7930
$$ plain form
21986 263850 252502 236104 209549 179260 156371 131849 124677 143102 195870 236894 225501 259809
21974 259809 303509 261682 214942 202510 187693 141650 111752 105399 96102 82097 64285 48375
21962 48375 38947 31091 23389 9879 5919 9807 10323 18106 34161 42680 51173 64555 88385 136577
21948 136577 199315 241472 280183 307952 299217 273540 242801 216419 197399 160379 121541 100011
21936 100011 92193 91371 88214 91956 94169 91575 80913 74232 64232 44034 28188 10849 -8012
21923 -8012 -27420 -55066 -69189 -80745 -90422 -97774 -104674 -102349 -94382 -93857 -73633 -51823 -29782
21910 -29782 -12916 1313 14637 22470 34785 52243 80492 98103 102532 105965 117267 120784
21898 120784 128257 129182 128155 121292 104285 92744 85896 85383 87015 88671 87554 84174 80012 75307
$$ packed form
21986B63850j1348j6398k6555l0289k2889k4522p172J8425N2768M1024j1393L4308
21974B59809M3700m1827m6740j2432j4817m6043k9898o353r297j4005j7812j5910
21962D8375r428p856p702j3510l960L888N16P783J6055Q519Q493J3382K3830M8192
21948A36577O2738M2157L8711K7769q735k5677l0739k6382j9020l7020l8838k1530
21936A00011p818q22l157L742K213k594j0662o681j0000k0198j5846j7339j8861
21923h012j9408k7646j4123j1556r677p352o900K325P967N25K0224K1810K2041
21910b9782J6866J4229J3324P833J2315J7458K8249J7611M429L433J1302L517
21898A20784P473R25j027o863j7007j1541o848n13J632J656j117l380m162m705
$$ plain form
21884 75307 70469 55196 40867 20368 8546 5463 6234 6322 -844 -7343 -1787 927 12544 15417
21870 15417 9687 921 214 5850 6887 5726 16371 21575 14008 9381 9415 14872 15111 12523 13612
21855 13612 15484 19099 22870 25796 32662 33418 41443 53004 62919 66996 64945 57612 59489 59967 61741
21840 61741 53795 50388 45348 44674 45728 41000 46432 41830 27067 21390 15900 14263 14528 17382 23630
21825 23630 24429 28532 33110 27081 33467 40578 34768 27124 25087 22966 15929 5076 1536 -3809
21811 -3809 -14998 -17184 -18059 -25209 -31410 -30310 -29676 -32659 -39040 -44535 -44997 -48423 -51461 -51330 -63328
21796 -63328 -75039 -85605 -87383 -73216 -45747 -16830 22015 55697 82632 98650 106062 93926
21784 93926 90662 92503 83795 73890 70415 69407 62885 53294 49674 43832 35976 20443 7269 5311
$$ packed form
21884G5307m838j5273j4329k0499j1822l083P71Q8p166o499N556K714J1617K873
21870A5417n730q766p07N636J037j161J0645N204p567m627L4N457K39k588J089
21855A3612J872L615L771K926O866P56Q025J1561R915M077k051p333J877M78J774
21840F1741p946l407n040o74J054m728N432m602j4763n677n490j637K65K854O248
21825B3630P99M103M578o029O386P111n810p644k037k121p037j0853l540n345
21811c809j1189k186q75p150o201J100O34k983o381n495m62l426l038J31j1998
21796f3328j1711j0566j778J4167K7469K8917L8845L3682K6935J6018P412j2136
21784I3926l264J841q708r905l475j008o522r591l620n842p856j5533j3174j958
$$ plain form
21770 5311 7121 6053 3695 5506 7231 9911 3242 9759 18011 20263 19230 15350 20994 32496
21756 32496 35051 32998 33123 29517 23272 19498 17831 17660 20885 18725 17418 13858 16312 13574 18619
21741 18619 16701 9256 7746 3599 5092 4911 4379 7173 10989 8637 8565 11390 11674 3001 -757 -4284
21725 -4284 -15491 -14434 -8959 -7050 -1753 2632 -26 -4707 -1575 -3246 -10604 -12561 -12541 -11652 -8231
21710 -8231 -10077 -7881 -3737 -2155 444 4171 4781 9006 13252 19933 24474 17048 4671 6522 13411
21695 13411 13994 13650 17520 16270 11248 7009 9809 7285 -3440 6120 15884 24225 28598 29440 24567
21680 24567 24467 27121 28417 22323 18046 21480 25182 21615 16813 10597 11787 12596 10776 12329 10787
21665 10787 11041 12887 12589 14595 14172 13918 10728 14377 16448 17493 16036 13744 11158 10483 6330 5548
$$ packed form
21770E311J810j068k358J811J725K680o669O517Q252K252j033l880N644J1502
21756C2496K555k053J25l606o245l774j667j71L225k160j307l560K454k738N045
21741A8619j918p445j510m147J493j81n32K794L816k352p2K825K84q673l758l527
21725d284j1207J057N475J909N297M385k658m681L132j671p358j957K0Q89L421
21710h231j846K196M144J582K599L727O10M225M246O681M541p426j2377J851O889
21695A3411N83l44L870j250n022m239K800k524j0725R560R764Q341M373Q42m873
21680B4567j00K654J296o094m277L434L702l567m802o216J190Q09j820J553j542
21665A0787K54J846k98K006m23k54l190L649K071J045j457k292k586o75m153p82
$$ plain form
21649 5548 12324 12224 11113 18387 28139 37914 40833 40605 38851 34573 32140 31457 22297 17506 13265
21634 13265 10703 5307 584 -12967 -17988 -18562 -13760 -8032 -5816 23 6328 7226 4691 3365 5329
21619 5329 7552 14100 14713 6627 8109 17151 13669 15667 15783 16745 17491 20651 14664 14727 21065 30160
21603 30160 26497 31456 34913 33902 43742 48671 49989 60901 83904 117291 190372 305808 420558
21590 420558 476788 454173 400313 344112 292563 233569 171972 110047 65037 45590 36051 26226
21578 26226 12130 6096 7803 3943 -836 -3055 -10811 -10772 -81 2666 10310 14180 11193 5875
21564 5875 3458 5781 3015 6195 2417 1339 -1932 -3821 856 5249 -1725 -6719 -3642 -2753 3636
21549 3636 8321 5840 12693 13945 16095 19984 18788 12366 7381 5144 8232 8751 9085 9748 7333
$$ packed form
21649E548O776j00j111P274R752R775K919k28j754m278k433o83r160m791m241
21634A3265k562n396m723j3551n021n74M802N728K216N839O305Q98k535j326J964
21619E329K223O548O13q086J482R042l482J998J16R62P46L160n987O3O338R095
21603C0160l663M959L457j011R840M929J318J0912K3003L3387P3081J15436J14750
21590D20558N6230k2615n3860n6201n1549n8994o1597o1925m5010j9447r539r825
21578B6226j4096o034J707l860m779k219p756L9J0691K747P644L870k987n318
21564E875k417K323k766L180l778j078l271j889M677M393o974m994L077Q89O389
21549C636M685k481O853J252K150L889j196o422m985k237L088N19L34O63k415
$$ plain form
21534 7333 9015 15401 14347 11567 8031 11169 15166 17731 16407 15343 21247 30423 30450 29394 30748
21519 30748 43584 57135 69165 74718 92575 113608 148072 205599 271998 369785 546505 867724
21507 867724 1343885 1783689 2087021 2293410 2304156 2097851 1754148 1422014 1135709 850159
21497 850159 588935 407053 292846 224566 169789 129029 101645 74023 59462 50604 42823
21486 42823 34816 18946 15809 17066 17139 14159 6093 3401 2322 1098 -5536 -8886 -7276 -2622 1459
21471 1459 -2141 1321 2234 5988 7869 4482 3048 -128 -7334 -15763 -12569 -13917 -15956 -22086 -15663
21456 -15663 -7410 -9791 -11461 -13258 -16010 -10249 -10656 -8042 -4677 -1039 -1848 -5827 -1908 1546 -206
21441 -206 -2495 -7354 -3782 -3700 -1100 -2910 -3628 -6300 -12254 -7788 -3784 5691 6382 6584 3773 -1314
$$ packed form
21534G333J682O386j054k780l536L138L997K565j324j064N904R176K7j056J354
21519C0748J2836J3551J2030N553J7857K1033L4464N7527O6399R7787J76720L21219
21507H67724M76161M39804L03332K06389J0746k06305l43703l32134k86305k85550
21497H50159k61224j81882j14207o8280n4777m0760k7384k7622j4561q858p781
21486D2823q007j5870l137J257P3k980q066k692j079j224o634l350J610M654M081
21471A459l600L462R13L754J881l387j434l176p206q429L194j348k039o130O423
21456a5663Q253k381j670j797k752N761m07K614L365L638q09l979L919L454j752
21441b06k289m859L572Q2K600j810p18k672n954M466M004R475O91K02k811n087
$$ plain form
21425 -1314 676 4933 -402 -8230 -12518 -14306 -14939 -11465 -9213 -4463 -2908 -439 -1737 -2971 -4241
21410 -4241 -4357 -2038 -570 7541 13867 5444 -1067 -3549 -3249 -3448 -1253 -1345 -1223 -1115 -1245 -489 -1383
21393 -1383 -3690 -5264 -3130 757 3807 1130 -6232 -11047 -11833 -16253 -16466 -16089 -14620 -14444 -13164 -12345
21377 -12345 -15668 -9603 3475 650 -6170 -10953 -17624 -21149 -22798 -24544 -19890 -10647 -5142 -2122
21363 -2122 66 5092 -2176 -8176 -5408 -5632 -5858 -7393 -13680 -15319 -17925 -15776 -13830 -17493 -13214
21348 -13214 -11616 -13810 -11044 -8169 -5804 -4209 -3898 -657 4894 2998 1942 2366 -3187 -5656 -12454
21333 -12454 -8523 -7188 -12306 -22346 -21317 -14685 -9056 -3318 -4271 -8765 -5220 -2995 -2414 -7804 -10444
21318 -10444 -4360 2110 548 1423 -3736 -6710 -9543 -6034 -2772 312 3858 3434 -9796 -16271 -12410
$$ packed form
21425a314J990M257n335p828m288j788o33L474K252M750J555K469j298j234j270
21410d241j16K319J468Q111O326q423o511k482L00j99K195r2J22J08j30P56q94
21393a383k307j574K134L887L050k677p362m815p86m420k13L77J469J76J280Q19
21377a2345l323O065J3078k825o820m783o671l525j649j746M654R243N505L020
21363b122K188N026p268o000K768k24k26j535o287j639k606K149J946l663M279
21348a3214J598k194K766K875K365J595L11L241N551j896j056M24n553k469o798
21333a2454L931J335n118j0040J029O632N629N738r53m494L545K225N81n390k640
21318a0444O084O470j562Q75n159k974k833L509L262L084L546m24j3230o475L861
$$ plain form
21303 -12410 -8106 -11057 -15022 -19207 -18598 -5391 -3990 -7234 -8032 -11137 -10377 -6137 -3415 -4553 -7914
21288 -7914 -6515 -9067 -9956 -11986 -13813 -7696 -6065 -6649 -14389 -13186 -11449 -12624 -13531 -7335 -5145
21273 -5145 -7932 -7342 -1804 1493 220 -1472 -1790 -5267 -10461 -14676 -22166 -18566 -11439 -3575 -2210
21258 -2210 -7820 -7019 -244 -1096 -3819 -4799 -3542 -1079 -669 -4979 -5172 -9076 -9855 -7833 -2722 -4347
21242 -4347 -6133 -10695 -11831 -11545 -12047 -10082 -8516 -4859 -4877 -7196 -6635 -4131 -3857 -5989 -3023 -2718
21226 -2718 285 4141 2150 1288 -1324 -7183 -8890 -12562 -14710 -6663 3637 3688 -483 -1251 -2161 1111
21210 1111 -6348 -13163 -18197 -11868 -9998 -8870 -9192 -7943 -5024 -1249 -2088 -3346 -8929 -8019 -4845
21195 -4845 -6396 -5310 -4350 -4148 113 2568 3450 6534 4956 -4865 -11854 -10852 -8182 -13637 -11779
$$ packed form
21303a2410M304k951l965m185O09J3207J401l244p98l105P60M240K722j138l361
21288g914J399k552q89k030j827O117J631n84p740J203J737j175r07O196K190
21273e145k787N90N538L297j273j692l18l477n194m215p490L600P127P864J365
21258b210n610Q01O775q52k723r80J257K463M10m310j93l904p79K022N111j625
21242d347j786m562j136K86n02J965J566L657j8k319N61K504K74k132K966L05
21226b718L003L856j991q62k612n859j707l672k148Q047J0300N1m171p68r10L272
21210A111p459o815n034O329J870J128l22J249K919L775q39j258n583R10L174
21195d845j551J086R60K02M261K455Q82L084j578r821o989J002K670n455J858
$$ plain form
21180 -11779 -10503 -14023 -15567 -10970 -4998 -4669 -11009 -14902 -14271 -13608 -12556 -20324 -21014 -11220 -1678
21165 -1678 -3418 -1872 -4384 -9396 -12037 -13365 -4251 -9920 -12783 -15754 -15066 -7806 -7727 -8887 -17727
21150 -17727 -18546 -11524 -11008 -15548 -22925 -22554 -12446 -7928 -12376 -17550 -14489 -11589 -7566 -7336 -8535
21135 -8535 -7501 -5572 -8785 -10113 -11567 -13287 -6929 -5763 -8821 -14033 -16650 -9761 -9875 -8086 -9394
21120 -9394 -8818 -12320 -16179 -14467 -13808 -12839 -15300 -17975 -15663 -13532 -12608 -8977 -7111 -8758 -18219 -21055
21104 -21055 -20188 -23734 -29442 -24970 -17503 -15082 -9810 -7385 -11656 -9499 -11846 -16711 -17320 -16976 -10669
21089 -10669 -5007 -2651 -10473 -15759 -14375 -10934 -11623 -10943 -5353 -6712 -2470 40 318 -6424 -13414
21074 -13414 -5458 -3527 -1105 -613 -7750 -6170 -6840 -10058 -8219 -5834 -6359 -14318 -11150 -3759 130
$$ packed form
21180a1779J276l520j544M597N972L29o340l893O31O63J052p768o90R794R542
21165a678j740J546k512n012k641j328R114n669k863k971O88P260P9j160q840
21150a7727q19P022N16m540p377L71J0108M518m448n174L061K900M023K30j199
21135h535J034J929l213j328j454j720O358J166l058n212k617O889j14J789j308
21120i394N76l502l859J712O59R69k461k675K312K131R24L631J866j647r461k836
21104b1055Q67l546n708M472P467K421N272K425m271K157k347m865o09L44O307
21089a0669N662K356p822n286J384L441o89O80N590j359M242K510K78o742o990
21074a3414P956J931K422M92p137J580o70l218J839K385n25p959L168P391L889
$$ plain form
21059 130 435 841 1173 3188 4402 -1786 -282 -1069 -3703 -6061 -12530 -17010 -19198 -15484 -17180 -21418
21043 -21418 -23852 -17040 -9191 -6901 -9977 -10500 -1467 -196 -4465 781 667 -3646 887 177 -6115
21028 -6115 -10035 -7237 -8441 -10015 -4823 329 -490 -7337 -4266 -1641 -5582 -11468 -15376 -17333 -17372
21013 -17372 -9958 -4203 1762 647 -1510 -751 1574 -6427 -12204 -8131 -7330 -11030 -19901 -21623 -19499
20998 -19499 -12887 -7138 -5571 992 474 -8869 -9241 -10001 -8083 -4456 -7487 -8752 -9647 -11824 -13558
20983 -13558 -16344 -11139 -6151 -1755 1511 -3478 -5281 -6007 -1391 -5687 -12201 -8882 -17072 -13804 74
20968 74 6600 -66 -2763 -659 1575 -6073 -9286 -11056 -13765 -10656 722 3144 2801 591 -492
20953 -492 2345 4299 3515 -2230 -5712 -6184 -3376 -1875 -1445 -6939 -6988 -8319 -10598 -7663 -2219 -1173
$$ packed form
21059A30L05M06L32K015J214o188J504p87k634k358o469m480k188L714j696m238
21043b1418k434O812P849K290l076n23R033J271m269N246j14m313M533p10o292
21028f115l920K798j204j574N192N152q19o847L071K625l941n886l908j957l9
21013a7372P414N755N965j115k157P59K325q001n777M073Q01l700q871j722K124
20998a9499O612N749J567O563n18r343l72p60J918L627l031j265q95k177j734
20983a3558k786N205M988M396L266m989j803p26M616m296o514L319q190L268J3878
20968G4O526o666k697K104K234p648l213j770k709L109J1378K422l43k210j083
20953d92K837J954p84n745l482m72K808J501M30n494m9j331k279K935N444J046
$$ plain form
20937 -1173 -5302 -11260 -14750 -12772 -11600 -8752 -6944 -15369 -18429 -17128 -8275 -6241 -9499 -6993 -5891
20922 -5891 -8057 -9587 -8831 -6711 -14732 -18948 -11704 -1652 -1061 -3570 -7485 -3356 -7229 -4544 -2680
20907 -2680 -1359 -11186 -11742 -12994 -15430 -15089 -16533 -16804 -18752 -18861 -15930 -9673 -7944 -5577 -6442 -7483
20891 -7483 -3839 4607 8915 4269 -3623 -11910 -9859 -10160 -5658 -7583 -16074 -14008 -11441 -10717 -12860
20876 -12860 -13337 -17693 -15357 -13704 -7378 -2584 -12009 -14890 -10686 -11037 -15756 -16924 -14239 -10793 -11464
20861 -11464 -16724 -15982 -12518 -16062 -8986 -1601 1289 3004 -5636 -10496 -15962 -16139 -22083 -19633 -11337
20846 -11337 -11970 -9197 -4566 -6508 -7527 -7539 -9932 -5918 -6919 -12352 -13630 -15547 -8341 -7500 -3796
20831 -3796 -3494 -9262 -14115 -9773 -9851 -12712 -12495 -9398 -2921 -387 -2164 -10023 -12167 -16983 -11533 -9862
$$ packed form
20937a173m129n958l490J978J172K848J808q425l060J301Q853K034l258K506J102
20922e891k166j530P56K120q021m216P244J0052N91k509l915M129l873K685J864
20907b680J321r827n56j252k436L41j444k71j948j09K931O257J729K367q65j041
20891g483L644Q446M308m646p892q287K051l01M502j925q491K066K567P24k143
20876a2860m77m356K336J653O326M794r425k881M204l51m719j168K685L446o71
20861a1464n260P42L464l544P076P385K890J715q640m860n466j77n944K450Q296
20846a1337o33K773M631j942j019j2k393M014j001n433j278j917P206Q41L704
20831c796L02n768m853M342p8k861K17L097O477K534j777p859k144m816N450J671
$$ plain form
20815 -9862 -9576 -6794 -7056 -17913 -17558 -11766 -14445 -12476 -7725 -8550 -13698 -13917 -14111 -10443 -8635 -13696
20799 -13696 -21721 -19797 -14697 -14640 -10602 -13283 -15141 -22148 -14914 -3162 -2025 3967 932 -5877 -6157
20784 -6157 -6944 -3107 -6269 -21031 -22905 -14205 -5157 -1241 -3289 -3169 -6057 -12435 -10683 -9098 -9414
20769 -9414 -2945 -2611 -7027 -8609 -6541 -8369 -8309 -9463 -10657 -5502 -915 -2049 2628 -5898 -11969
20754 -11969 -11421 -15471 -10045 -9280 -9749 -739 -6744 -14226 -12913 -10534 -9406 -10697 -12473 -15585 -11566
20739 -11566 -6619 -6609 -6532 -5037 -3183 -8076 -6020 -46 1375 -4348 -11889 -13850 -13942 -12836 -5355 -3592
20723 -3592 -5454 -9734 -9903 -13958 -10996 -6583 -11931 -8441 -7420 -10718 -6598 -8218 -11269 -6702 -2014
20708 -2014 -2797 -11240 -10115 -10081 -6661 -6011 -12782 -15605 -11045 -7150 -3608 -7220 -7554 -7200 -16640 -14068
$$ packed form
20815i862K86K782k62j0857L55N792k679J969M751q25n148k19j94L668J808n061
20799a3696q025J924N100N7M038k681j858p007P234J1752J137N992l035o809k80
20784f157p87L837l162j4762j874Q700R048L916k048J20k888o378J752J585l16
20769i414O469L34m416j582K068j828O0j154j194N155M587j134M677q526o071
20754a1969N48m050N426P65m69R010o005p482J313K379J128j291j776l112M019
20739a1566M947J0P7J495J854m893K056N974J421n723p541j961r2J106P481J763
20723c592j862m280j69m055K962M413n348L490J021l298M120j620l051M567M688
20708b014p83q443J125L4L420O50o771k823M560L895L542l612l34L54r440K572
$$ plain form
20692 -14068 -10652 -5425 -8069 -11762 -14523 -17379 -11401 -5624 -10505 -12727 -10401 -7157 -6237 -2805 837
20677 837 -834 -4522 -8793 -4698 -6926 -11782 -16710 -9797 -1436 -1466 -9226 -13907 -11094 -7143 -14034
20662 -14034 -17475 -15816 -11643 -10714 -13628 -15450 -15366 -10834 -1454 2076 -331 5837 3327 -2542 -344
20647 -344 -2552 -7750 -6630 1543 607 -1141 -5128 -8413 -9777 -2963 -1556 -6649 -5638 -11677 -12429
20632 -12429 -14310 -17167 -11203 -8629 -10805 -10427 -12409 -10617 -1539 -4253 -6575 -11676 -11287 -10220 -9807
20617 -9807 -5279 -2714 -3157 -8223 -9319 -6135 -2752 -7771 -6673 -7470 -9753 -8555 -4697 571 1386
20602 1386 -5630 -6179 -9745 -11121 -9677 -11204 -10828 -11677 -11767 -6662 -4705 -9332 -7784 -3607 -184 1152
20586 1152 4840 5535 4513 7757 11367 8152 4151 -3940 -7712 -11141 -7146 -4322 2188 -6142 -10950
$$ packed form
20692a4068L416N227k644l693k761k856N978N777m881k222K326L244R20L432L642
20677H37j671l688m271M095k228m856m928O913Q361l0p760m681K813L951o891
20662a4034l441J659M173R29k914j822Q4M532R380L530k407O168k510n869K198
20647c44k208n198J120Q173r36j748l987l285j364O814J407n093J011o039p52
20632a2429j881k857N964K574k176L78j982J792R078k714k322n101L89J067M13
20617i807M528K565m43n066j096L184L383n019J098p97k283J198L858N268Q15
20602A386p016n49l566j376J444j527L76q49r0N105J957m627J548M177L423J336
20586A152L688O95j022L244L610l215m001q091l772l429L995K824O510q330m808
$$ plain form
20571 -10950 -7788 -8012 -10263 -16267 -13452 -7550 -9281 -8910 -13648 -10605 -6226 -8193 -2493 5278 192
20556 192 -2957 -1927 1531 27 -8627 -11084 -8367 -6522 -3359 -4157 -10305 -8223 -5708 5704 7628
20541 7628 2116 -673 -1288 -2820 -8744 -8177 -5127 -4647 -7656 -12138 -13750 -838 5444 -443 -2873
20526 -2873 415 -8538 -9226 -4064 -3961 -2681 -592 2003 1161 -4791 -8645 -12283 -12815 -14290 -5809 249
20510 249 -88 840 -2392 -2564 4788 -2810 -10893 -12399 -14972 -12354 -10294 -10034 -3618 2363 -1818 -4338
20494 -4338 2025 -4249 -9507 -12779 -15749 -16373 -10689 -6177 -6280 -8634 -19849 -21578 -16987 -11653 -6857
20479 -6857 -1909 1551 -4654 -1604 -6832 -3607 23 4226 -1710 -10490 -12928 -9736 -4752 -2048 -5888
20464 -5888 -6709 -6117 -9166 -6651 -1573 -8221 -13002 -16433 -19889 -19876 -19878 -14504 -10615 -7554 -4297 -6546
$$ packed form
20571a0950L162k24k251o004K815N902j731L71m738L043M379j967N700P771n086
20556A92l149J030L458j504q654k457K717J845L163p98o148K082K515J1412J924
20541G628n512k789o15j532n924N67L050M80l009m482j612J2912O282n887k430
20526b873L288q953o88N162J03J280K089K595q42n952l854l638n32j475Q481O058
20510B49l37R28l232j72P352p598q083j506k573K618K060K60O416N981m181k520
20494d338O363o274n258l272k970o24N684M512j03k354j1215j729M591N334M796
20479f857M948L460o205L050n228L225L630M203n936q780k438L192M984K704l840
20464e888q21N92l049K515N078o648m781l431l456J3kN374L889L061L257k249
$$ plain form
20448 -6546 -8798 -11773 -13471 -9280 -4560 -6478 -4493 -4032 -2791 -3620 -6163 -11320 -19489 -17442 -6833
20433 -6833 -7262 -10248 -11119 -6259 -978 1003 805 812 -1763 -2554 -3925 -6296 -2108 -7960 -14319 -15631
20417 -15631 -14274 -12679 -11640 -9604 -5288 -3706 -5815 -8164 -12919 -12180 -8391 -2907 -109 4950 2284
20402 2284 -4055 -9293 -8342 -5251 -4585 -5178 -6590 -10381 -7550 -2735 -3361 -5004 -4377 -14207 -15760 -7567
20386 -7567 -1996 -6638 -12025 -16590 -23864 -25256 -21161 -18073 -5289 2711 3340 1379 -5063 -8158 -12433
20371 -12433 -14464 -15766 -14096 -4152 -5432 -6805 -3409 -109 -4847 -7920 -5774 -259 -2499 -2929 -452
20356 -452 2461 2403 -4258 -1128 5008 -2021 -2848 -4569 -13549 -12350 -9240 -5379 -5333 -5650 -3800 -4803
20340 -4803 -9698 -12616 -4143 -9567 -14454 -8241 -1648 4387 3728 952 3363 2905 -3184 -8602 -10539
$$ packed form
20448f546k252k975j698M191M720j918J985M61J241q29k543n157q169K047J0609
20433f833m29k986q71M860N281J981j98Pk575p91j371k371M188n852o359j312
20417a5631J357J595J039K036M316J582k109k349m755P39L789N484K798N059k666
20402B284o339n238R51L091O66n93j412l791K831M815o26j643O27r830j553Q193
20386g567N571m642n387m565p274j392M095L088J2784Q000O29j961o442l095m275
20371a2433k031j302J670R944j280j373L396L300m738l073K146N515k240m30K477
20356d52K913n8o661L130O136p029q27j721q980J199L110L861M6l17J850j003
20340d803m895k918Q473n424m887O213O593O035o59k776K411m58o089n418j937
$$ plain form
20325 -10539 -4746 -2285 1013 456 -3169 -8073 -9845 -9469 -6845 -3540 -6319 -5421 -5681 2705 1029
20310 1029 -3083 -4697 -10028 -15574 -16637 -12355 -875 5636 2566 -1267 6027 6865 3414 2579 2900
20295 2900 -1614 -9702 -13051 -13187 -5261 -6984 -10539 -8366 -8911 -11604 -8131 1492 1623 1287 -5640 -6078
20279 -6078 -6676 -2916 -3127 -8479 -13221 -14874 -14038 -11165 -11442 -11285 -9225 -5800 -4765 339 743 -5368
20263 -5368 -14108 -11440 -12772 -13892 -11094 -5714 -2014 -1204 200 -2276 -5449 -4665 2244 5629 -6586
20248 -6586 -17105 -20612 -10910 -3682 -5819 -10073 -8140 -9542 -13521 -16675 -20732 -15744 -7258 -5637
20234 -5637 -2281 1366 1161 -2584 -3244 -5469 -9076 -6232 1862 8123 -227 -3043 2398 4285 -3200
20219 -3200 -5043 -6298 -10090 -7321 -9906 -7079 -3726 -6099 -9911 -5652 -5873 -6436 -8558 -13175 -15165
$$ packed form
20325a0539N793K461L298n57l625m904j772L76K624L305k779Q98k60Q386j676
20310A029m112j614n331n546j063M282J1480O511l070l833P294Q38l451q35L21
20295B900m514q088l349j36P926j723l555K173n45k693L473R623J31l36o927m38
20279f078n98L760k11n352m742j653Q36K873k77J57K060L425J035N104M04o111
20263e368q740K668j332j120K798N380L700Q10J404k476l173P84O909L385j2215
20248f586j0519l507R702P228k137m254J933j402l979l154m057M988Q486J621
20234e637L356L647k05l745o60k225l607K844Q094O261q350k816N441J887p485
20219c200j843j255l792K769k585K827L353k373l812M259k21n63k122m617j990
$$ plain form
20204 -15165 -17179 -14969 -9312 -7392 -4436 2896 3696 9763 15004 15621 12920 8001 5346 2820 4147
20189 4147 -2011 -9371 -10197 -6033 531 862 4125 3555 -3008 -5973 -3269 58 -3710 -10120 -11580
20174 -11580 -14384 -14329 -9381 -7923 -5532 -10438 -10498 1241 6969 -1590 -8102 -2804 4676 7938 6217
20159 6217 -899 -3243 -3135 -8380 -13458 -17022 -12469 -6956 -2767 -2843 -2545 -885 -5555 -11803 -10789 -11083
20143 -11083 -14151 -11145 -5973 -4299 -1222 1806 -1665 -9228 -11461 -6463 -8098 -8988 -4055 -2226 -4080
20128 -4080 3982 -230 1371 1743 4539 3663 7530 7697 2089 909 1758 2126 1101 4388 6307 4621
20112 4621 -1617 -10208 -13650 -11118 -6080 -4974 -9614 -9574 -783 9837 3543 -1078 -5067 -3058 -6351
20097 -6351 -13069 -11744 -11682 -1501 830 -3401 -5537 -8223 260 6922 1916 -4303 -4226 -3370 -1919 -2995
$$ packed form
20204a5165k014K210N657J920K956P332Q00O067N241O17k701m919k655k526J327
20189D147o158p360q26M164O564L31L263n70o563k965K704L327l768o410j460
20174a1580k804N5M948J458K391m906o0J1739N728q559o512N298P480L262j721
20159F217p116k344J08n245n078l564M553N513M189p6K98J660m670o248J014k94
20143a1083l068L006N172J674L077L028l471p563k233M998j635q90M933J829j854
20128d080Q062m212J601L72K796q76L867J67n608j180Q49L68j025L287J919j686
20112D621o238q591l442K532N038J106m640M0Q791J0620o294m621l989K009l293
20097f351o718J325O2J0181K331m231k136k686Q483O662n006o219P7Q56J451j076
$$ plain form
20081 -2995 -1982 3638 -3021 -5704 -2703 -4833 -6108 -1965 103 -2600 -3243 1963 608 -2110 -2112 5057
20065 5057 4400 -2123 -5865 -7414 -8792 -7601 -5665 -3622 -7473 -10240 -13610 -14565 -7540 -3182 -1112
20050 -1112 -4950 -5971 -8363 -2315 -1065 -3595 1155 -1891 -4796 -4692 -3383 -6077 -10172 -3844 2040
20035 2040 4496 -363 711 7564 7150 1333 -1509 4924 5844 4817 3543 4221 6836 9025 13538
20020 13538 9778 5292 3133 -1655 -5856 -4589 -5549 -5545 450 -874 -4952 -1769 -6102 -11932 -7980
20005 -7980 -4638 -2181 -701 -3256 -8600 -10093 -16671 -19127 -17212 -11422 -407 1368 4079 2506
19991 2506 5931 7066 1754 242 4007 2366 -7095 -11053 -7266 -6948 -5136 -9542 -11101 -9577 -11759
19976 -11759 -7117 -5355 -7532 -7215 -6313 -7085 -11980 -16150 -13750 -12531 -15294 -11448 -2574 -1333 -5083
$$ packed form
20081b995J013N620o659k683L001k130j275M143K068k703o43N206j355k718kP169
20065E057o57o523l742j549j378J191J936K043l851k767l370r55P025M358K070
20050a112l838j021k392O048J250k530M750l046k905J04J309k694m095O328N884
20035B040K456m859J074O853m14n817k842O433R20j027j274O78K615K189M513
20020A3538l760m486k159m788m201J267r60MN995j324m078L183m333n830L952
20005g980L342K457J480k555n344j493o578k456J915N790J1015J775K711j573
19991B506L425J135n312j512L765j641r461l958L787L18J812m406j559J524k182
19976a1759M642J762k177L17R02p72m895m170K400J219k763L846Q874J241l750
$$ plain form
19961 -5083 -2906 3497 5082 7710 797 189 770 7698 11374 5759 -2804 -4715 -4734 -6342 -5122 -144
19945 -144 948 1173 -3211 -1852 -590 -2736 -3109 -1679 -6099 -12556 -8706 -9302 -10824 -8345 -5199 -3061
19929 -3061 1117 5236 10523 6769 -1385 1489 666 3583 8270 12861 16121 15547 14228 12754 10220
19914 10220 3660 4573 6594 5584 9982 3611 2070 2107 1660 -6593 -629 7741 9871 7110 5076
19899 5076 3539 -6339 -11502 -4502 4538 4058 -331 -7901 -2859 -7163 -2967 1612 2257 758 1452
19884 1452 -325 -1667 3282 7157 3798 -2615 -4356 591 -1948 -2208 3312 3147 2557 5459 4728 2648
19868 2648 4946 1830 -2095 -1688 -1733 532 3127 11840 12808 10031 4722 3442 5115 8327 8393 7097
19852 7097 13498 10822 1629 -1723 -1588 652 2655 62 -741 -4149 -4400 7998 15776 15713 11256 16891
$$ packed form
19961e083K177O403J585K628o913o08N81O928L676n615q563j911j9j608J220M978
19945a44J092K25m384J359J262k146l73J430m420o457L850n96j522K479L146K138
19929c061M178M119N287l754q154K874q23K917M687M591L260n74j319j474k534
19914A0220o560R13K021j010M398o371j541L7m47q253N964Q370K130k761k034
19899E076j537r878n163P000R040m80m389p570N042m304M196M579O45j499O94
19884A452j777j342M949L875l359o413j741M947k539k60N520j65n90K902p31k080
19868B648K298l116l925M07m5K265K595Q713R68k777n309j280J673L212O6j296
19852G097O401k676r193l352J35K240K003k593q03l408k51J2398P778o3m457N635
$$ plain form
19836 16891 15512 9661 5718 5154 2649 -7542 -12096 -11058 -8542 -9961 -1367 3121 -5945 -1093
19822 -1093 6411 4742 702 3011 8443 -2144 -6139 -904 -2717 -835 -3133 -4225 -4180 -1466 -1639
19807 -1639 -1053 740 -4341 -3217 -5957 -5416 -2682 4537 2727 40 2363 6418 6417 5745 646 618 5472
19790 5472 4557 -708 -3111 3231 1627 4804 11600 12563 7783 9572 10079 5653 3081 -1431 579
19775 579 4000 7265 5611 -165 -1945 -1659 -1892 4274 11462 8020 2748 4386 8724 9441 4431 -283
19759 -283 1132 4748 6035 4642 1377 -3348 -3961 4022 6235 2613 -2317 1455 2818 -497 3631
19744 3631 4101 3933 6995 -2400 496 5397 -2558 440 7001 1759 -3238 -1005 6939 9746 4123
19729 4123 208 655 7365 6902 7019 8861 4342 8704 9382 7055 4484 8968 10029 7202 7444 8988
$$ packed form
19836A6891j379n851l943n64k505j0191m554J038K516j419Q594M488r066M852
19822a093P504j669m040K309N432j0587l995N235j813J882k298j092M5K714j73
19807a639N86J793n081J124k740N41K734P219j810k687K323M055jo72n099k8M854
19790E472r15n265k403O342j604L177O796R63m780J789N07m426k572m512K010
19775E79L421L265j654n776j780K86k33O166P188l442n272J638M338P17n010m714
19759b83J415L616J287j393l265m725o13P983K213l622m930L772J363l315M128
19744C631M70j68L062r395K896M901p955K998O561n242m997K233P944K807n623
19729D123l915M47O710m63J17J842m519M362O78k327k571M484J061k827K42J544
$$ plain form
19713 8988 8267 7824 5639 2283 1804 5084 3264 6832 6968 2475 -465 1032 -2394 721 5578 3269
19697 3269 -207 -252 7062 9478 7871 4188 -1434 -5832 -7924 -9994 -5222 -4966 -2114 5810 3256
19682 3256 1575 2676 -1145 -381 4986 6814 6357 5146 8505 3109 -1501 -938 998 1391 -3062 -10969
19666 -10969 -12255 -6705 -4303 1568 3923 845 1270 3353 5638 8000 -5115 -13721 -12503 -8254
19652 -8254 1887 -366 -1289 -1248 -975 -2122 -2326 -5811 -4856 -4567 -5297 -3183 -2269 -4125 -7755 -5809 4751
19635 4751 10153 11938 17083 14971 7869 3820 5410 4385 9410 11854 13276 11068 300 -3510
19621 -3510 -4943 -5524 -3483 -4469 -4556 -3748 1024 8154 4249 3765 5172 3683 3678 2252 -2208 -1005 2220
19604 2220 6614 1110 2719 12590 11376 4990 3024 5243 10282 12542 7397 4212 -682 2602 8901
$$ packed form
19713H988p21m43k185l356m79L280j820L568J36m493k940J497l426L115M857k309
19697C269l476m5P314K416j607l683n622m398k092k070M772K56K852P924k554
19682C256j681J101l821P64N367J828m57j211L359n396m610N63J936L93m453p907
19666a0969j286N550K402N871K355l078M25K083K285K362j3115q606J218M249
19652h254J0141k253r23M1K73j147k04l485R55K89p30K114R14j856l630J946J0560
19635D751N402J785N145k112p102m049J590j025N025K444J422k208j0768l810
19621c510j433n81K041r86q7Q08M772P130l905m84J407j489nj426m460J203L225
19604B220M394n504J609R871j214o386j966K219N039K260n145l185m894L284O299
$$ plain form
19589 8901 5622 6164 6712 6252 1756 3634 5822 4963 6645 12940 12859 9877 8523 7185 9439 11168
19573 11168 11883 8175 7959 8374 18676 16883 11082 6079 10389 12182 9385 9534 12308 13745 20293
19558 20293 27949 22538 12587 4356 6786 6215 4077 9558 15564 18480 17588 16869 15661 20370 22323
19543 22323 23044 15185 14466 11890 9878 8842 10552 9618 3440 -3807 -5615 406 5223 7885 10962
19528 10962 12826 7656 3251 8101 9180 7208 6788 2186 2681 7058 14771 13533 18060 18760 14503
19513 14503 15109 12586 12200 11234 14543 10923 14852 18416 22986 17528 7680 13465 18013 9132 6980
19498 6980 8620 9871 11328 11708 5199 5844 6953 9000 7598 7059 6299 7732 4147 7750 10071 10349
19482 10349 3599 -1603 -2962 6699 13448 6636 7100 10577 10391 6535 5227 11170 12544 7845 6107
$$ packed form
19589H901l279N42N48m60m496J878K188q59J682O295q1k982j354j338K254J729
19573A1168P15l708k16M15J0302j793n801n003M310J793k797J49K774J437O548
19558B0293P656n411r951q231K430n71k138N481O006K916q92p19j208M709J953
19543B2323P21p859p19k576k012j036J710r34o178p247j808O021M817K662L077
19528A0962J864n170m405M850J079j972m20m602M95M377P713j238M527P00m257
19513A4503O06k523l86r66L309l620L929L564M570n458r848N785M548q881k152
19498F980J640J251J457L80o509O45J109K047j402n39p60J433l585L603K321K78
19482A0349o750n202j359R661O749o812M64L477j86l856j308N943J374m699j738
$$ plain form
19467 6107 12427 14007 11520 9191 11972 9502 6993 8139 11491 9716 8923 2718 10793 16462 17795
19452 17795 13013 6052 11022 13910 8129 10089 11818 14679 16871 13318 6485 7285 9675 4337 1540
19437 1540 7795 14871 18071 17111 13234 8271 12741 7639 7231 11065 8982 3505 3348 2344 6342
19422 6342 12990 17221 13897 10813 11017 11162 9174 11041 14937 10657 11034 16025 17238 13589 11517
19407 11517 14931 15983 14491 18240 21977 20858 10221 33 3462 10292 12500 10237 12551 18023
19393 18023 28312 20520 13483 6769 6297 6619 -2119 -828 6887 9242 1953 5457 18688 26754
19379 26754 23703 19952 10806 9922 17719 17164 12876 6405 10057 15477 13067 14995 21822 25490 22851
19364 22851 19815 20708 27693 21671 17478 13891 9080 3382 6034 4896 5399 5193 5639 12722 15889
$$ packed form
19467F107O320J580k487k329K781k470k509J146L352j775p93o205Q075N669J333
19452A7795m782o961M970K888n781J960J729K861K192l553o833Q00K390n338k797
19437A540O255P076L200r60l877m963M470n102m08L834k083n477j57j004L998
19422F342O648M231l324l084K04J45j988J867L896m280L77M991J213l649k072
19407A1517L414J052j492L749L737j119j0637j0188L429O830K208k263K314N472
19393A8023J0289p792p037o714m72L22q738J291P715K355p289L504J3231Q066
19379B6754l051l751r146q84P797n55m288o471L652N420k410J928O827L668k639
19364B2851l036Q93O985o022m193l587m811n698K652j138N03k06M46P083L167
$$ plain form
19349 15889 15012 11996 9097 1618 5843 12757 9075 5162 6010 9648 17209 16496 7269 15158 22254
19334 22254 15972 7270 5411 10580 10582 10950 9504 11254 15801 18335 19225 21024 15263 5183 6670
19319 6670 9184 8976 9479 14937 15618 15512 12988 9798 18707 27216 33561 36038 39551 47170 66898
19304 66898 79656 83451 84096 81646 82880 96212 107637 97429 83757 70740 70944 67022 55312
19291 55312 44483 39008 38328 36857 27654 22814 15734 16951 18771 19715 27028 27762 21363 23557 22780
19276 22780 19195 21584 27676 32106 36755 36536 25952 22382 32391 36805 31404 25713 24560 28778
19262 28778 38493 37069 31344 31519 38881 46599 58993 76661 99312 107932 98882 84907 78773 73177
19248 73177 67415 53763 41922 33513 28880 27786 29039 29571 25340 21633 22958 17506 21603 20920
$$ packed form
19349A5889q77l016k899p479M225O914l682l913Q48L638P561p13r227P889P096
19334B2254o282q702j859N169KL68j446J750M547K534Q90J799n761j0080J487
19319F670K514k08N03N458O81j06k524l190Q909Q509O345K477L513P619J9728
19304F6898J2758L795O45k450J234J3332J1425j0208j3672j3017K04l922j1710
19291E5312j0829n475o80j471r203m840p080J217J820R44P313P34o399K194p77
19276B2780l585K389O092M430M649k19j0584l570J0009M414n401n691j153M218
19262B8778R715j424n725J75P362P718J2394J7668K2651Q620r050j3975o134n596
19248G3177n762j3652j1841q409m633j094J253N32m231l707J325n452M097o83
$$ plain form
19234 20920 13091 2749 5267 12765 18094 23639 24623 20662 18119 21075 17359 18969 26123 29061
19220 29061 39249 38820 35963 38384 34519 31635 25858 21635 25562 26173 23699 24585 20965 18660 19553
19205 19553 18787 24735 25772 23782 23314 24590 31607 24655 19171 11044 10277 7622 10233 13546 16483
19190 16483 9766 7067 12528 12066 12092 12701 11064 7099 11215 18232 16608 14346 8721 13145 19800
19175 19800 20771 23341 32823 36320 31578 22231 14632 18752 19486 17420 28255 27678 27117 25443 25750
19160 25750 30491 32650 33697 29390 27137 32338 29781 22516 26547 22699 22161 23857 22560 23770 24155
19145 24155 25633 19062 25526 29398 27298 22142 22863 24527 22505 22527 20878 18737 21067 16751 18348
19130 18348 25402 24347 15579 8272 4237 10911 13528 15711 16682 18975 24126 26861 25631 25244 21555
$$ packed form
19234B0920p829j0342K518P498N329N545R84l961k543K956l716J610P154K938
19220B9061J0188m29k857K421l865k884n777m223L927O11k474Q86l620k305Q93
19205A9553p66N948J037j990m68J276P017o952n484q127p67k655K611L313K937
19190A6483o717k699N461m62K6O09j637l965M116P017j624k262n625M424O655
19175A9800R71K570R482L497m742r347p599M120P34k066J0835n77n61j674L07
19160B5750M741K159J047m307k253N201k557p265M031l848n38J696j297J210L85
19145B4155J478o571O464L872k100n156P21J664k022K2j649k141K330m316J597
19130A8348P054j055q768p307m035O674K617K183R71K293N151K735j230l87l689
$$ plain form
19115 21555 24025 30066 30125 29611 29923 35554 36093 25142 19186 20584 18203 22147 27476 30255 34526
19100 34526 32805 31027 30700 25029 21031 15633 18285 21231 21937 18258 14388 19956 25442 24447 23747
19085 23747 20613 21019 20274 17410 19220 12534 12605 19351 20498 21091 13077 12123 17750 18648 12570 10464
19069 10464 11040 12687 12582 11795 17688 21555 21333 23166 17881 14965 17790 20158 17510 21464 32792
19054 32792 28296 24403 23535 24402 23475 19587 19016 23053 22516 21179 20389 20394 22633 25988 29886 33173 34057
19037 34057 36505 38193 40228 37377 32926 35937 29031 30206 28475 24353 30887 35916 35788 34914 36495
19022 36495 32371 29266 28970 27498 22796 17593 18958 17153 20724 33202 43246 40439 34300 34735
19008 34735 37217 39438 36350 34369 35431 44065 47716 51566 51877 49268 49142 50100 57596 63092 62285
$$ packed form
19115B1555K470O041N9n14L12N631N39j0951n956J398k381L944N329K779M271
19100C4526j721j778l27n671l998n398K652K946P06l679l870N568N486r95p00
19085B3747l134M06p45k864J810o686P1O746J147N93q014r54N627Q98o078k106
19069A0464N76J647j05p87N893L867k22J833n285k916K825K368k648L954J1328
19054C2792m496l893q68Q67r27l888n71M037n37j337p90NK239L355L898L287Q84
19037C4057K448J688K035k851m451L011o906J175j731m122O534N029j28q74J581
19022C6495m124l105k96j472m702n203J365j805L571J2478J0044k807o139M35
19008C4735K482K221l088j981J062Q634L651L850L11k609j26R58P496N496q07
$$ plain form
18993 62285 63254 60542 59860 59629 64681 68818 65971 56227 57187 68415 74118 81162 86687 96182 111998
18978 111998 132620 155966 191514 254124 360909 552403 779614 938178 1045814 1115439
18968 1115439 1088282 956566 788995 652784 532273 414133 318852 254117 209055 177554
18958 177554 161909 165835 171865 177937 175533 188973 216274 266453 351184 505518 742805 950085
18946 950085 1086028 1187010 1208557 1112881 927032 756083 616387 474887 347547 253793
18936 253793 200203 161058 133864 113739 98620 91776 80168 72872 76573 72214 71467 72340 69481
18923 69481 74750 78970 82080 76456 69831 62535 64337 69671 65983 65038 58184 52198 53283 54901 55139
18908 55139 59375 64402 69838 72236 78866 87635 97477 109482 125140 146490 170941 201500 243228
$$ packed form
18993F2285R69k712o82k31N052M137k847r744R60J1228N703P044N525R495J5816
18978A11998K0622K3346L5548O2610J06785J91494K27211J58564J07636O9625
18968A115439k7157j31716j67571j36211j20511j18140r5281o4735m5062l1501
18958A77554j5645L926O030O072k404J3440K7301N0179Q4731J54334K37287K07280
18946I50085J35943J00982K1547r5676j85849j70949j39696j41500j27340r3754
18936B53793n3590l9145k7194k0125j5119o844j1608p296L701m359p47Q73k859
18923F9481N269M220L110n624o625p296J802N334l688r45o854n986J085J618K38
18908E5139M236N027N436K398O630Q769R842J2005J5658K1350K4451L0559M1728
$$ plain form
18895 243228 321931 466812 731194 1065326 1250250 1205106 1055521 931544 820750 662891
18885 662891 487910 353990 264395 211536 178407 159478 150899 154630 154489 157261 165266 188094
18873 188094 221500 257206 315496 436804 657497 997955 1297775 1357844 1223942 1064297
18863 1064297 941756 797753 605022 433031 316503 249834 202706 173938 141367 112620
18853 112620 97364 88566 80936 82616 84906 80527 79411 72184 60993 57563 52512 44149 45195 50197
18839 50197 51877 49614 47808 45784 45182 45872 52996 51080 43300 42323 44690 43995 47930 50150 43818
18824 43818 33858 39274 47682 48373 51891 49361 45512 42086 37250 27800 25420 26238 26466 27710 29256
18809 29256 30120 31900 33570 36531 47201 51647 45780 43713 34011 28573 28454 29758 22916 18249 23204
$$ packed form
18895B43228P8703J44881K64382L34132J84924m5144j49585j23977j10794j57859
18885F62891j74981j33920q9595n2859l3129j8929q579L731j41K772Q005K2828
18873A88094L3406L5706N8290J21308K20693L40458K99820O0069j33902j59645
18863A064297j22541j44003j92731j71991j16528o6669m7128k8768l2571k8747
18853A12620j5256q798p630J680K290m379j116p227j1191l430n051q363J046N002
18839E0197J680k263j806k024o02O90P124j916p780r77K367o95L935K220o332
18824D3818r960N416Q408O91L518k530l849l426m836r450k380Q18K28J244J546
18809B9256Q64J780J670K961J0670M446n867k067r702n438j19J304o842m667M955
$$ plain form
18794 23204 27730 30347 37074 36265 35576 36861 40849 39424 35824 42642 46816 45689 45638 48755 52752
18779 52752 49064 46052 47964 46597 47308 38987 35119 37076 46116 47194 33889 26741 34603 50283
18765 50283 66570 84128 88318 91701 97309 97554 87286 85278 75498 63587 55448 53751 52027 47469
18751 47469 42786 32682 29866 39243 44839 49899 43488 45031 49647 55430 52651 54534 61755 68816
18737 68816 66560 64281 62029 67175 69348 59832 57521 55681 48923 47092 56276 52674 49094 48690 47422
18722 47422 45537 55076 64952 71320 72038 64933 61243 64524 64374 64782 64985 61249 56341 51197 44621
18707 44621 40109 41741 46371 52032 45700 43459 41179 40842 47337 46678 52890 52613 47770 57159 62400
18692 62400 56557 61930 71099 78266 76217 77998 79447 79195 85519 90313 90592 93635 93535 85767 82394
$$ packed form
18794B3204M526K617O727q09o89J285L988j425l600O818M174j127n1L117L997
18779E2752l688l012J912j367P11q321l868J957R040J078j3305p148P862J5680
18765E0283J6287J7558M190L383N608K45j0268k008r780j1911q139j697j724m558
18751D7469m683j0104k816R377N596N060o411J543M616N783k779J883P221P061
18737F8816k256k279k252N146K173r516k311j840o758j831R184l602l580m04j268
18722D7422j885R539R876O368P18p105l690L281j50M08K03l736m908n144o576
18707D4621m512J632M630N661o332k241k280l37O495o59O212k77m843R389N241
18692F2400n843N373R169P167k049J781J449k52O324M794K79L043j00p768l373
$$ plain form
18677 82394 80492 76287 75187 73138 71471 74889 71112 62250 58455 47125 39975 34598 47188 59049
18663 59049 67394 86690 100666 119754 126871 125603 129121 126730 124345 123756 120415 116773 114850 109814
18649 109814 121178 134517 140779 138376 133493 130049 126087 118845 112981 104744 101414 99068 95790 87925
18635 87925 82573 89056 92891 104111 115647 120645 121473 119643 115604 118637 107166 90665 78061
18622 78061 73525 92900 117557 137378 150485 158536 173574 180400 176916 176031 176184 182120 206141
18609 206141 231572 254653 286048 301886 303542 311417 295741 286550 262918 228462 205795 185636
18597 185636 164946 157287 163537 161754 154285 151043 153226 155422 159022 149895 146066 138825 143219 152965
18583 152965 159156 156348 156292 154155 154799 162369 165585 163944 169780 180657 181321 172167 173976 176736 176797
$$ packed form
18677H2394j902m205j100k049j667L418l777q862l795j1330p150n377J2590J1861
18663E9049Q345J9296J3976J9088P117j268L518k391k385n89l341l642j923n036
18649A09814J1364J3339O262k403m883l444l962p242n864q237l330k346l278p865
18635H7925n352O483L835J1220J1536M998Q28j830m039L033j1471j6501j2604
18622G8061m536J9375K4657J9821J3107Q051J5038O826l484q85J53N936K4021
18609B06141K5431K3081L1395J5838J656P875j5676r191k3632l4456k2667k0159
18597A85636k0690p659O250j783p469l242K183K196L600r127l829p241M394R746
18583A52965O191k808n6k137O44P570L216j641N836J0877O64r154J809K760O1
$$ plain form
18568 176797 186475 211339 254498 299009 328293 346734 339707 329907 318584 286717 274719 254069
18556 254069 221107 191110 188637 178481 161116 157132 165164 170754 171265 176503 185029 202521 219865
18543 219865 243021 279298 314280 340486 366072 376017 364151 350085 325074 308351 295048 282601
18531 282601 268796 260980 261820 253351 243213 231974 227078 218559 209230 213606 222468 225298 221246 222740
18517 222740 226795 217098 205312 189055 168091 135636 104743 92471 92465 95156 115006 142762 174253
18504 174253 194788 221833 261321 325192 385292 415556 415593 426630 444756 446542 442070 437667 430178
18491 430178 423005 415522 404619 391547 377343 369526 371071 371685 359552 351187 338140 330121 346985
18478 346985 356373 367209 398975 435842 455377 448258 432480 401256 371271 347440 309523 262688
$$ packed form
18568A76797R678K4864M3159M4511K9284J8441p027r800j1323l1867j1998k0650
18556B54069l2962k9997k473j0156j7365l984Q032N590N11N238Q526J7492J7344
18543B19865K3156L6277L4982K6206K5586R945j1866j4066k5011j6723j3303j2447
18531B82601j3805p816Q40q469j0138j1239m896q519r329M376Q862K830m052J494
18517B22740M055r697j1786j6257k0964l2455l0893j2272oK691J9850K7756L1491
18504A74253K0535K7045L9488O3871O0100L0264L7J1037J8126J786m472m403p489
18491D30178p173p483j0903j3072j4204p817J545O14j2133q365j3047q019J6864
18478C46985R388J0836L1766L6867J9535p119j5778l1224k9985k3831l7917m6835
$$ plain form
18466 262688 245883 271275 301353 322288 336933 358055 387962 428391 453792 470224 493571
18455 493571 513551 531256 535643 553343 565352 566472 563798 547218 529238 507279 489398 474330
18443 474330 458356 469049 493817 529267 577611 633081 668760 685444 740819 822103 889423
18432 889423 941485 970859 961370 933202 933384 937788 945668 947521 944249 942128 950208 973696 996308
18419 996308 1024279 1047222 1066209 1078519 1101167 1147466 1212114 1268308 1335557 1427249 1527854
18408 1527854 1640473 1765146 1921552 2120687 2368037 2572188 2722997 2852376 2956410
18399 2956410 3034636 3128625 3291941 3537066 3857716 4191539 4554504 4968016 5407110 5882342
18389 5882342 6435177 7203427 8258909 9719930 11770321 14593437 18632054 24989618
$$ packed form
18466B62688j6805K5392L0078K0935J4645K1122K9907M0429K5401J6432K3347
18455D93571J9980J7705M387J7700J2009J120k674j6580j7980k1959j7881j5068
18443D74330j5974J0693K4768L5450M8344N5470L5679J6684N5375Q1284O7320
18432H89423N2062K9374r489k8168J82M404P880J853l272k121Q080K3488K2612
18419I96308K7971K2943J8987J2310K2648M6299O4648N6194O7249R1692J00605
18408A527854J12619J24673J56406J99135K47350K04151J50809J29379J04034
18399B956410P8226R3989J63316K45125L20650L33823L62965M13512M39094M75232
18389E882342N52835P68250J055482J461021K050391K823116M038617O357564
$$ plain form
18381 24989618 36091871 56820049 87023996 109468774 123983009 133678749 131313054
18374 131313054 116875141 96326814 79194214 64369737 48792995 35800908 27687382
18367 27687382 23260040 20922998 19726736 19522527 20273887 21898560 24663943 28924195
18359 28924195 35314715 45454206 62757818 94709783 149732276 205517073 239846448
18352 239846448 265467514 273093693 255147498 216487057 176661906 144237079 111073474
18345 111073474 78433038 54291467 39299227 30274765 24700997 21226656 18871047
18338 18871047 17153035 15974908 14972775 13842504 12655448 11610613 10766623 10128002
18330 10128002 9812903 9775008 9753686 9817377 10071687 10543224 11249485 12223860 13365719 14542887
$$ packed form
18381B4989618J1102253K0728178L0203947K2444778J4514235R695740k365695
18374A31313054j4437913k0548327j7132600j4824477j5576742j2992087q113526
18367B7687382m427342k337042j196262k04209P51360J624673K765383M260252
18359B8924195O390520J0139491J7303612L1951965N5022493N5784797L4329375
18352B39846448K5621066P626179j7946195l8660441l9825151l2424827l3163605
18345A11073474l2640436k4141571j4992240r024462n573768l474341k355609
18338A8871047j718012j178127j002133j130271j187056j044835q43990o38621
18330A0128002l15099l7895k1322O3691K54310M71537P06261R74375J141859J177168
$$ plain form
18320 14542887 16085454 18393690 21692557 26357547 33316007 43981769 60877493 90178671
18312 90178671 145516552 233682423 302411802 305916180 267338886 230523513 207300544
18305 207300544 174713863 128652760 87757414 61026899 45133863 35321679 28825531
18298 28825531 24342804 21158201 19018178 17831445 17420665 17693322 18923021 21720305
18290 21720305 26941131 36333505 54539830 89706757 133604826 152166708 140702892
18283 140702892 119822190 106957092 95507738 75686010 53434188 37096537 27277207
18276 27277207 21253516 16896023 13462437 10886229 9034773 7663014 6553172 5636889
18268 5636889 4887029 4299627 3870515 3557079 3321502 3127701 2948092 2803151 2726084 2744107
$$ packed form
18320A4542887J542567K308236L298867M664990O958460J0665762J6895724K9301178
18312I0178671N5337881Q8165871O8729379L504378l8577294l6815373k3222969
18305B07300544l2586681m6061103m0895346k6730515j5893036r812184o496148
18298B8825531m482727l184603k140023j186733m10780K72657J229699K797284
18290B1720305N220826R392374J8206325L5166927M3898069J8561882j1463816
18283A40702892k0880702j2865098j1449354j9821728k2251822j6337651r819330
18276B7277207o023691m357493l433586k576208j851456j371759j109842r16283
18268E636889p49860n87402m29112l13436k35577j93801j79609j44941p7067J8023
$$ plain form
18258 2744107 2960029 3404269 3746594 3676245 3335549 3034993 2823878 2546083 2216346 1942913
18248 1942913 1720355 1557036 1451424 1368637 1281631 1215107 1179316 1128803 1062195 998087 941192
18237 941192 893982 864386 858482 885144 913530 910211 854052 786147 743729 741124 722981 684771
18225 684771 698274 699594 667464 653132 668802 684788 668070 660674 644905 605243 565829 532339
18213 532339 487836 438853 398711 372778 346781 330287 311766 295759 295969 299633 307417 314373
18201 314373 315574 333655 368802 391920 401469 434869 450626 443730 416850 371093 339361 318525
18189 318525 284956 252197 227494 222703 262674 352667 374130 302417 287775 332944 332848 271250
18177 271250 224636 221919 210072 187559 169082 156678 129975 101270 72311 43762 28418 23254
$$ packed form
18258B744107K15922M44240L42325p0349l40696l00556k11115k77795l29737k73433
18248A942913k22558j63319j05612q2787q7006o6524l5791n0513o6608o4108n6895
18237I41192m7210k9596n904K6662K8386l319n6159o7905m2418k605j8143l8210
18225F84771J3503J320l2130j4332J5670J5986j6718p396j5769l9662l9414l3490
18213E32339m4503m8983m0142k5933k5997j6494j8521j6007K10L664P784O956
18201C14373J201J8081L5147K3118R549L3400J5757o896k6880m5757l1732k0836
18189C18525l3569l2759k4703m791L9971Q9993K1463p1713j4642M5169r6o1598
18177B71250m6614k717j1847k2513j8477j2404k6703k8705k8959k8549j5344n164
$$ plain form
18165 23254 18831 22670 36460 46139 77557 141700 194424 190236 185575 244808 341760 399756 396268
18152 396268 385570 363181 341033 328573 304138 273116 246933 220303 196741 170812 155635
18141 155635 141479 147603 150745 143861 136490 140749 148577 139558 117889 97349 104492 156945 189212
18128 189212 184726 164707 150906 153546 149830 145395 141292 151667 170569 202637 239314 276605
18116 276605 304728 350399 432914 515445 602135 712746 885908 1148404 1568857 2289829
18106 2289829 3735094 6568426 9662609 10329836 9027764 7539068 6776653 5840595 4291408
18097 4291408 2837148 1891997 1351123 1026930 809625 646604 509966 416681 370407 332226
18087 332226 288404 247768 217583 208833 205125 195446 186438 178945 171699 162998 167640 170828 190733
$$ packed form
18165B3254m423L839J3790R679L1418O4143N2724m188m661N9233R6952N7996l488
18152C96268j0698k2389k2148j2460k4435l1022k6183k6630k3562k5929j5177
18141A55635j4156O124L142o884p371M259P828r019k1669k0540P143N2453L2267
18128A89212m486k0019j3801K640l716m435m103J0375J8902L2068L6677L7291
18116B76605K8123M5671Q2515Q2531Q6690J10611J73162K62496M20453P20972
18106B289829J445265K833332L094183O67227j302072j488696p62415r36058j549187
18097D291408j454260r45151n40874l24193k17305j63021j36638r3285m6274l8181
18087C32226m3822m0636l0185q750l708r679r008p493p246q701M642L188J9905
$$ plain form
18074 190733 246496 319071 340914 311618 281061 262315 233551 188010 140208 111320 103741 99825
18062 99825 90323 87060 80333 71146 68563 76741 81958 86996 92317 105650 148698 212846 285520
18049 285520 296953 256004 204510 171686 145289 103587 74792 64979 67698 82749 101727 105708
18037 105708 100924 107842 111889 110093 106176 112934 110106 99682 104524 96859 94562 91245 82596 71872
18023 71872 57869 43964 38592 35849 30887 19123 20602 20520 5765 9497 3735 -7256 -3140 -8582
18009 -8582 -7108 1642 5154 7515 3255 -6287 -17459 -29893 -37471 -33923 -11005 26632 50210
17996 50210 50709 46360 50042 51168 51142 43281 32383 29876 34599 25233 19427 20866 21938 19695 22285
17981 22285 21153 7022 -127 -1989 -3582 -8439 -3891 15551 29197 28962 27764 32833 30578 23494
$$ packed form
18074A90733N5763P2575K1843k9296l0557j8746k8764m5541m7802k8888p579l916
18062I9825r502l263o727r187k583Q178N217N038N321J3333M3048O4148P2674
18049B85520J1433m0949n1494l2824k6397m1702k8795r813K719J5051J8978L981
18037A05708m784O918M047j796l917O758k828j0424M842p665k297l317q649j0724
18023G1872j4003j3905n372k743m962j1764J479q2j4755L732n762j0991M116n442
18009h582J474Q750L512K361m260r542j1172j2434p578L548K2918L7637K3578
17996E0210M99m349L682J126k6p861j0898k507M723r366n806J439J072k243K590
17981B2285j132j4131p149j862j593m857M548J9442J3646k35j198N069k255p084
$$ plain form
17967 23494 25281 30933 35038 33906 28701 27428 25137 24020 26794 31830 38536 38003 32635 29174 26389
17952 26389 25873 29729 25325 21682 15803 17957 20894 17825 14947 7119 -954 -1619 9148 16289 13851
17937 13851 13885 22419 23285 23621 31067 37315 26598 10924 6766 5015 3836 8323 2041 -4646 -2023
17922 -2023 4478 9066 10462 7868 6620 11105 25155 24261 18810 28283 38185 38577 36030 32408 32531
17907 32531 28173 21073 12174 7504 7033 8394 13793 17195 11533 4150 5623 14059 21988 19755 25982
17892 25982 33752 33084 34118 35304 32020 27951 19110 12546 9569 173 -1531 -2730 -369 -325 -2370
17877 -2370 -4315 -3304 9160 10629 3827 -312 -1662 3656 7224 16229 17970 22587 21327 14160
17863 14160 10359 9433 11687 11482 15101 11964 1919 872 13812 20072 19661 24508 30889 25075 26213
$$ packed form
17967B3494J787N652M105j132n205j273k291j117K774N036O706n33n368l461k785
17952B6389n16L856m404l643n879K154K937l069k878p828q073o65J0767P141k438
17937A3851L4Q534Q66L36P446O248j0717j5674m158j751j179M487o282o687K623
17922b023O501M588J396k594j248M485J4050q94n451R473R902L92k547l622J23
17907C2531m358p100q899m670m71J361N399L402n662p383J473Q436P929k233O227
17892B5982P770o68J034J186l284m069q841o564k977r396j704j199K361M4k045
17877b370j945J011J2464J469o802m139j350N318L568R005J741M617j260p167
17863A4160l801r26K254k05L619l137j0045j047J2940O260m11M847O381n814J138
$$ plain form
17848 26213 33960 34114 28338 23757 24098 27485 20293 14627 7831 3306 -3959 -2176 7939 10429 11725
17833 11725 7596 8584 10620 11369 10942 11765 10648 10403 13286 15880 11575 10790 9410 14064 12242 14833
17817 14833 13051 12985 12059 10804 9147 9924 17730 24530 46238 83026 104122 102793 89840 84446
17803 84446 77420 64559 58630 54123 49608 42180 40711 37607 30749 28478 27154 22068 23353 24791
17789 24791 29070 29130 32369 35524 40194 57972 70247 82781 107586 124543 158298 216114 329209
17776 329209 526248 774773 953395 1077991 1174521 1163265 1027106 849325 699768 562227
17766 562227 424327 310253 232389 185308 160193 140454 126971 116190 111545 120233 141239
17755 141239 172525 217551 293728 431228 642777 841782 965677 1066567 1097129 1028479
$$ packed form
17848B6213P747J54n776m581L41L387p192n666o796m525p265J783J0115K490J296
17833A1725m129R88K036P49m27Q23j117k45K883K594m305p85j380M654j822K591
17817A4833j782o6r26j255j657P77P806O800K1708L6788K1096j329j2953n394
17803H4446p026j2861n929m507m515p428j469l104o858k271j324n086J285J438
17789B4791M279O0L239L155M670J7778J2275J2534K4805J6957L3755N7816J13095
17776C29209J97039K48525J78622J24596R6530j1256j36159j77781j49557j37541
17766E62227j37900j14074p7864m7081k5115j9739j3483j0781m645Q688K1006
17755A41239L1286M5026P6177J37500K11549J99005J23895J00890L0562o8650
$$ plain form
17745 1028479 883050 725897 588443 458644 333841 243972 185931 156293 139700 130885
17735 130885 135655 139644 162805 199670 253761 349452 524809 833045 1183496 1332839 1239564
17724 1239564 1072608 948669 818862 642825 461489 317641 236953 188582 159257 139794
17714 139794 127662 110240 111385 114335 119483 137425 168323 204588 262933 382562 611424 939663
17702 939663 1181249 1186087 1046117 911757 804560 664031 488656 332792 231352 167599
17692 167599 125554 87105 62225 42026 27537 22485 22119 19617 13450 8815 18243 19288 15346
17679 15346 9980 7303 -3192 1233 9079 9346 8989 806 -1688 3485 -3825 -5260 -316 -2034 -6501
17664 -6501 -12519 -14980 -16677 -14754 -9903 -14891 -16501 -16769 -19950 -18154 -9045 -5975 -3641 -4114 -7271
$$ packed form
17745A028479j45429j57153j37454j29799j24803q9869n8041k9638j6593q815
17735A30885M770L989K3161L6865N4091R5691J75357L08236L50451J49343r3275
17724A239564j66956j23939j29807j76037j81336j43848q0688m8371k9325j9463
17714A39794j2132j7422J145K950N148J7942L0898L6265N8345J19629K28862L28239
17702I39663K41586M838j39970j34360j07197j40529j75375j55864j01440o3753
17692A67599m2045l8449k4880k0199j4489n052l66k502o167m635R428J045l942
17679A5346n366k677j0495M425P846K67l57q183k494N173p310j435M944j718m467
17664f501o018k461j697J923M851m988j610k68l181J796R109L070K334m73l157
$$ plain form
17649 -7271 -8415 -3225 -4873 -14077 -22804 -26145 -22957 -19848 -12642 -14651 -17260 -10033 -10948 -11331 -8566
17634 -8566 -3745 -9006 -15529 -19869 -20223 -25196 -21226 -15309 -14465 -16620 -17918 -15405 -14131 -7145 -11705
17619 -11705 -21962 -18672 -10289 -8467 -8202 -15031 -11928 -7672 2577 1514 -5377 -4588 3229 -87
17605 -87 2557 -5310 -15006 -13875 -16926 -14264 -19521 -16235 -13616 -14993 -9674 -17612 -23698 -19000 -12389
17590 -12389 -8374 -4864 -3855 -3505 -1839 -5458 -3071 -5030 -7324 -10226 -8211 -14995 -20932 -13910 -12908
17575 -12908 -15247 -19141 -17172 -14656 -18343 -21520 -18621 -16839 -7958 -16 -5323 -14856 -12406 -13950
17561 -13950 -19756 -19274 -24825 -18992 -15948 -21467 -17606 -11546 -13130 -16259 -17677 -17765 -19599 -20469 -20360 -12138
17545 -12138 -6998 2814 6328 1712 -8198 -10108 -16275 -14951 -13069 -13008 -14128 -8062 -4073 -7362 -7371 -5934
$$ packed form
17649g271j144N190j648r204q727l341L188L109P206k009k609P227r15l83K765
17634h566M821n261o523m340l54m973L970N917Q44k155j298K513J274O986m560
17619a1705j0257L290Q383J822K65o829L103M256J0249j063o891P89P817l316
17605h7K644p867r696J131l051K662n257L286K619j377N319p938o086M698O611
17590a2389M015L510J009L50J666l619K387j959k294k902K015o784n937P022J002
17575a2908k339l894J969K516l687l177K899J782Q881P942n307r533K450j544
17561a3950n806M82n551N833L044n519L861O060j584l129j418q8j834q70J09Q222
17545a2138N140R812L514m616r910j910o167J324J882O1j120O066L989l289rJ437
$$ plain form
17529 -5934 -6333 -13957 -15512 -12803 -9862 -5310 -8029 -12175 -13015 -13162 -11927 -10537 -12662 -22978 -26909
17514 -26909 -30504 -25865 -16483 -16342 -13382 -8963 -11978 -13958 -12598 -10796 -14525 -17897 -17681 -19740 -12840
17499 -12840 736 -2496 -11713 -15716 -17043 -12506 -7452 -4426 -1815 3100 3801 124 -5924 -14903
17485 -14903 -17238 -19921 -16232 -20659 -16310 -13282 -13973 -9163 -4855 -7107 -10657 -10255 -14135 -19312 -15855
17470 -15855 -13866 -9341 -9207 -7477 -6617 -2497 2112 -742 -1716 -3002 -3856 1904 1694 -3045 -5019 -11255
17454 -11255 -11032 1061 2778 1161 -1389 -2098 314 -3837 -4689 -3173 -4834 -8644 -8722 -7800 -1402 7107
17438 7107 9527 18772 31544 42557 49030 46963 42735 30619 19125 9675 -3177 -7068 -5106
17425 -5106 -5430 -9640 -13907 -16986 -16702 -10605 -7621 -12630 -8156 -4570 -805 3759 2582 -2154 1031
$$ packed form
17529e934l99p624j555K709K941M552k719m146q40j47J235J390k125j0316l931
17514b6909l595M639R382J41K960M419l015j980J360J802l729l372K16k059O900
17499a2840J3576l232r217m003j327M537N054L026K611M915P01l677o048q979
17485a4903k335k683L689m427M349L028o91M810M308k252l550M02l880n177L457
17470a5855J989M525J34J730Q60M120M609k854r74j286q54N760k10m739j974o236
17454a1255K23J2093J717j617k550p09K412m151q52J516j661l810p8R22O398Q509
17438G107K420R245J2772J1013O473k067m228j2116j1494r450j2852l891J962
17425e106l24m210m267l079K84O097K984n009M474L586L765M564j177m736L185
$$ plain form
17410 1031 1842 -1529 -5890 -7050 -6235 -12953 -17183 -20783 -19164 -17796 -17179 -16752 -18635 -13090 -7091 -12039
17394 -12039 -22772 -19583 -12700 -7991 -8265 -4362 -3909 -7130 -6568 -2321 1230 14202 26349 30258
17380 30258 22355 20342 14963 5840 -1079 4376 7033 7973 2711 -2672 6899 18886 26830 27572 26436
17365 26436 17618 11519 14318 12479 4214 -2614 -4888 -6077 -13556 -18327 -10884 -5711 -11586 -8493
17351 -8493 -7424 -8002 232 5092 851 -7628 -7338 -3814 -3262 1967 10298 9090 13425 26197 61299
17336 61299 86938 79036 62340 50504 47678 34742 26699 19376 9647 5468 3085 -229 -3264
17323 -3264 -6205 -2890 -3267 -6227 -9071 -10490 -9603 -15371 -16292 -14292 -15297 -17887 -16165 -11620 -7927
17308 -7927 -6064 -4395 -5460 -7867 -4264 621 -6304 -11528 -12100 -11579 -11561 -6384 -6726 -12351 -14862 -13018
$$ packed form
17410A031Q11l371m361j160Q15o718m230l600J619J368O17M27j883N545N999m948
17394a2039j0733L189O883M709k74L903M53l221N62M247L551J2972J2147L909
17380C0258p903k013n379r123o919N455K657R40n262n383R571J1987P944P42j136
17365B6436q818o099K799j839q265o828k274j189p479m771P443N173n875L093
17351h493J069n78Q234M860m241q479K90L524N52N229Q331j208M335J2772L5102
17336F1299K5639p902j6696j1836k826j2936q043p323r729m179k383l314l035
17323c264k941L315l77k960k844j419Q87n768r21K000j005k590J722M545L693
17308g927J863J669j065k407L603M885o925n224n72N21J8N177l42n625k511J844
$$ plain form
17292 -13018 -10208 -13708 -11418 -8512 -9006 -11047 -8941 1205 2799 5497 658 -6578 -14743 -18267
17278 -18267 -10719 -3931 -6723 -8117 -6947 -3922 -4745 -1520 130 3535 -2788 -4901 -3975 -4356 -5396
17263 -5396 -11413 -11862 -12621 -14785 -5797 -5553 -10096 -11269 -10416 -13874 -18918 -15753 -15576 -12542 -8136 -6172
17247 -6172 -5336 -2989 -3320 -8158 -8172 -6885 -7598 -5856 -5481 -7543 -8549 -10156 -2289 -5419 -9470 -5981
17231 -5981 -1757 -5144 -5530 -9541 -9301 -2412 -6557 -13854 -14428 -14161 -15647 -16236 -14750 -11095 -4767 -3705
17215 -3705 -386 -7372 -13338 -15976 -18205 -21305 -16049 -9610 -611 -1496 -8211 -13627 -12458 -9968 -6159
17200 -6159 -1171 -4233 -8636 -10107 -11495 -9188 -16827 -18208 -16226 -9209 -6467 -7242 -3627 30 -1833
17185 -1833 -6850 -10226 -10294 -10577 -13869 -11661 -15486 -13874 -4019 2475 2127 -1469 -5114 -4790 1647 1608
$$ packed form
17292a3018K810l500K290K906m94k041K106J0146J594K698m839p236q165l524
17278a8267P548O788k792j394J170L025q23L225J650L405o323k113R26l81j040
17263e396o017m49p59k164Q988K44m543j173Q53l458n044L165J77L034M406J964
17247f172Q36K347l31m838j4J287p13J742L75k062j006j607P867l130m051L489
17231e981M224l387l86m011K40O889m145p297n74K67j486n89J486L655O328J062
17215c705L319o986n966k638k229l100N256O439Q999q85o715n416J169K490L809
17200f159M988l062m403j471j388K307p639j381J982P017K742p75L615L657j863
17185a833n017l376o8k83l292K208l825J612R855O494l48l596l645L24O437l9
$$ plain form
17169 1608 -1864 -3685 -367 -7324 -9316 -4302 -1564 -1645 -4721 -7385 -10049 -7875 -7628 -1689 486
17154 486 2776 2595 1455 -3143 -9144 -11368 -6999 -4290 2030 -2387 -947 -2623 -5626 -5745 -9504
17139 -9504 3555 8966 14441 13490 8651 8488 12877 21580 21352 18404 15879 17605 17360 11586 11460 6924
17123 6924 -1515 -369 -2116 -2502 -1390 -2666 -12053 -16475 -12161 -5507 -9390 -16353 -9435 1611 -511
17108 -511 5284 9625 4950 5263 15421 14638 8171 5327 4817 3164 3621 -2678 -7791 -9503 -3787 -3159
17092 -3159 -10697 -12717 -6396 -1988 -7396 -6773 -3413 -4746 -7476 -2411 -1849 -6983 -6944 -5461 -7959 -11271
17076 -11271 -8015 -5685 -10034 -6842 -2382 -6671 -9377 -6561 -6420 -6877 -5959 -12358 -11171 -6513 -4914
17061 -4914 -5886 -6339 -3454 -5242 -7322 -4475 -11458 -21468 -14449 -10517 -10220 -13177 -12840 -7297 -9518
$$ packed form
17169A608l472j821L318o957j992N014K738q1l076k664k664K174K47N939K175
17154D86K290j81j140m598o001k224M369K709O320m417J440j676l003j19l759
17139i504J3059N411N475r51m839j63M389Q703k28k948k525J726k45n774j26m536
17123F924q439J146j747l86J112j276r387m422M314O654l883o963O918J1046k122
17108e11N795M341m675L13J0158p83o467k844n10j653M57o299n113j712N716O28
17092c159p538k020O321M408n408O23L360j333k730N065N62n134L9J483k498l312
17076a1271L256K330m349L192M460m289k706K816J41m57R18o399J187M658J599
17061d914r72m53K885j788k080K847o983j0010P019L932K97k957L37N543k221
$$ plain form
17046 -9518 -14539 -16667 -12169 -11934 -13795 -12186 -7084 -10134 -12096 -11871 -13962 -16693 -18698 -17352 -15448
17031 -15448 -11323 -10623 -12838 -8886 -13968 -17888 -20898 -21310 -16184 -13893 -16060 -14444 -14932 -13328 -17945
17016 -17945 -17029 -12430 -16616 -14540 -10477 -5592 -4185 -5547 -2903 -2013 -4060 -6254 -7653 2662 -2029
17001 -2029 -4869 1292 10087 9165 5955 -783 261 -3620 -2990 -10602 -10844 -6875 -8222 -15194 -12449
16986 -12449 -12326 -15642 -15511 -15811 -25844 -37277 -37935 -30101 -29356 -27734 -21306 -27052 -25454 -21645 -18025
16971 -18025 -15816 -10581 -9508 -2688 -1550 -4007 -6604 -4310 -3363 -5088 -3899 -2283 -5182 -18569
16957 -18569 -20994 -11710 -3819 -4539 -11904 -12900 -13346 -13879 -14723 -7343 -15539 -23452 -22017 -14621 -15385 -18256
16941 -18256 -11563 -9854 -9177 -7310 -10282 -11559 -13917 -20778 -25484 -18860 -9938 -5638 -15751 -13252
$$ packed form
17046i518n021k128M498K35j861J609N102l050j962K25k091k731k005J346J904
17031a5448M125P00k215L952n082l920l010m12N126K291k167J616m88J604m617
17016a7945R16M599m186K076M063M885J407j362K644Q90k047k194j399J0315m691
17001b029k840O161Q795r22l210o738J044l881O30p612k42L969j347o972K745
16986a2449J23l316J31l00j0033j1433o58P834P45J622O428n746J598L809L620
16971a8025K209N235J073O820J138k457k597K294R47j725J189J616k899j3387
16957a8569k425R284P891p20p365r96m46n33q44P380q196p913J435P396p64k871
16941a8256O693J709O77J867k972j277k358o861m706O624Q922M300j0113K499
$$ plain form
16927 -13252 -8623 -7931 -9934 -10784 -13376 -9669 64 358 -2632 -4090 -3662 -7644 -11385 -13198 -5005
16912 -5005 2006 6825 -298 -1547 2823 7078 1099 -3154 -7563 -6246 -4565 -4591 -7373 969 7516
16897 7516 7247 5598 2670 13420 21158 22602 27309 25004 20269 20690 20295 24699 37538 41708 38889
16882 38889 39151 43439 60779 71721 77741 94274 112517 131242 158287 200058 261406 351404
16870 351404 498559 769669 1259821 1925747 2295308 2202275 1891627 1649319 1449419 1146438
16860 1146438 809688 547790 377193 272289 206556 162334 130157 104766 85818 72849
16850 72849 76049 91283 95657 94614 82767 71997 62314 47422 39414 29831 25182 20802 19570
16837 19570 18370 17426 22870 21195 18028 14668 9061 9783 10073 8767 8837 9585 1722 -2261 -1563 4566
$$ packed form
16927a3252M629O92k003q50k592L707R733K94k990j458M28l982l741j813Q193
16912e005P011M819p123j249M370M255n979m253m409J317J681k6k782Q342O547
16897G516k69j649k928J0750P738J444M707k305m735M21l95M404J2839M170k819
16882C8889K62M288J7340J0942O020J6533J8243J8725K7045M1771O1348Q9998
16870C51404J47155K71110M90152O65926L69561r3033l10648k42308j99900l02981
16860A146438l36750k61898j70597j04904o5733m4222l2177k5391j8948j2969
16850G2849L200J5234M374j043j1847j0770r683j4892q008r583m649m380j232
16837A9570j200r44N444j675l167l360n607P22K90j306P0P48p863l983O98O129
$$ plain form
16821 4566 7607 -5087 -9156 -1838 1764 19 -1198 1055 6785 6417 6215 -4858 -9361 -4994 -4029
16806 -4029 5917 9774 2563 325 -3487 -1120 904 -396 -2767 -8137 -5367 2128 7397 16450 12429
16791 12429 4566 6634 12147 11089 11878 13283 16254 24198 33470 28480 36775 75838 137728 206718
16777 206718 255754 256200 225761 196863 177169 166659 153216 148598 187901 283351 380100 388618
16765 388618 342459 287247 256421 230128 182789 132296 109821 107867 124072 161228 218347 261947
16753 261947 266332 234900 201757 179211 155082 128935 112377 123617 151919 215592 311249 381648
16741 381648 374051 323607 271809 241137 189793 133418 93337 68202 45371 30897 24626 21762
16729 21762 12429 11344 11631 12300 13497 13914 5618 -3183 -11215 -11728 -12779 -9274 -5838 -3152 587
$$ packed form
16821D566L041j2694m069P318L602j745j217K253N730l68k02j1073m503M367R65
16806d029R946L857p211k238l812K367K024j300k371n370K770P495N269R053m021
16791A2429p863K068N513j058P89J405K971P944R272m990Q295L9063O1890O8990
16777B06718M9036M46l0439k8898j9694j0510j3443m618L9303R5450R6749Q518
16765C88618m6159n5212l0826k6293m7339n0493k2475j954J6205L7156N7119M3600
16753B61947M385l1432l3143k2546k4129k6147j6558J1240K8302O3673R5657P0399
16741C81648p597n0444n1798l0672n1344n6375m0081k5135k2831j4474o271k864
16729B1762r333j085K87O69J197M17q296q801q032n13j051L505L436K686L739
$$ plain form
16714 587 81 -502 -92 -7148 -9145 -8431 -4847 -3418 -4915 -5737 -5196 -6223 -13770 -23624 -19248 -16925
16698 -16925 -13815 -11285 -8461 -13921 -12378 -14847 -14101 -13546 -10645 -4580 -9253 -7444 -4966 -2798 -3050
16683 -3050 -5212 -4793 -4135 -3019 -3231 -2862 -12939 -14011 -9477 -15579 -12532 -11056 -6185 -6892 -11131 -5430
16667 -5430 -968 3624 8460 7477 14294 31333 44249 45626 28849 21411 15048 7189 10229 9365
16653 9365 -1230 -3043 -2953 -4923 -4984 -5288 -9255 -13279 -11551 -12331 -10821 -8785 -12040 -17186 -13862 -14441
16637 -14441 -11527 -8214 -4933 1534 2623 -1123 -9202 -12332 -7754 -10907 -11433 -11810 -5175 -4824 -1106
16622 -1106 -951 -2205 1699 2102 4371 1033 -7023 -14023 -13879 -16203 -5753 -6918 -15924 -18540 -16491
16607 -16491 -6845 -3705 -5834 -2495 -3378 -5459 -10999 -8607 -2921 -1279 -11251 -18097 -17960 -18382 -12556
$$ packed form
16714E87n06n83M10p056j997P14L584J429j497q22N41j027p547r854M376K323
16698a6925L110K530K824n460J543k469P46N55K901O065m673J809K478K168k52
16683c050k162M19O58J116k12L69j0077j072M534o102L047J476M871p07m239N701
16667e430M462M592M836r83O817J7039J2916J377j6777p438o363p859L040q64
16653I365j0595j813R0j970o1l04l967m024J728p80J510K036l255n146L324n79
16637a4441K914L313L281O467J089l746q079l130M578l153n26l77O635L51L718
16622a106J55j254L904M03K269l338q056p000J44k324J0450j165r006k616K049
16607a6491R646L140k129L339q83k081n540K392N686J642r972o846J37m22N826
$$ plain form
16592 -12556 -8923 -11459 -12489 -17853 -15263 -14642 -12494 -4547 -9101 -7501 -3428 -4017 -5631 -12445 -16882
16577 -16882 -16712 -14445 -8277 -7181 -8966 -17539 -17945 -8150 -5168 -7151 -5965 -14620 -19701 -11633 -7984
16562 -7984 -13909 -9588 -2136 2730 -5629 -9502 -7629 -301 -1567 -6988 -903 3087 3965 2203 -2171
16547 -2171 -2235 -5328 -1818 -6295 -6523 -3176 -1668 -5540 -4860 -2076 -12626 -18631 -20722 -22822 -18220
16532 -18220 -12820 -8637 -9132 -8127 -8765 -13951 -12651 -13681 -14258 -11250 -9084 -11802 -11515 -14286 -18872
16517 -18872 -14864 -7433 -6824 -7925 -6007 -3290 -9743 -13826 -14906 -18998 -11423 -7797 -5900 -8925 -7440
16502 -7440 -2817 -7010 -5312 -5140 -4973 -7351 -10423 -11987 -12104 -13791 -11101 -9039 -13269 -10120 -6758
16487 -6758 -9287 -11441 -6698 -6016 -191 -3331 -9174 -16287 -17169 -12171 -4274 -193 984 -648 -7923
$$ packed form
16592a2556L633k536j030n364K590O21K148P947m554J600M073n89j614o814m437
16577a6882J70K267O168J096j785q573m06R795K982j983J186q655n081Q068L649
16562g984n925M321P452M866q359l873J873P328j266n421O085L990Q78j762m374
16547b171o4l093L510m477k28L347J508l872O80K784j0550o005k091k100M602
16532a8220N400M183m95J005o38n186J300j030n77L008K166k718K87k771m586
16517a8872M008P431O09j101J918K717o453m083j080m092P575L626J897l025J485
16502g440M623m193J698J72J67k378l072j564j17j687K690K062m230L149L362
16487f758k529k154M743O82N825l140n843p113q82M998P897M081J177j632p275
$$ plain form
16472 -7923 -3983 4998 7149 7551 16547 39548 80670 142044 201170 208679 185646 160356 140742
16459 140742 113798 83213 50513 28647 16205 13461 3768 -149 -4823 -4166 -8972 -15336 -15444
16446 -15444 -9584 -2441 -5444 -4285 -3738 -6419 -10371 -7609 -2246 -258 -164 -2417 -2234 -11900 -8785
16431 -8785 -3503 -5872 -7607 -5875 1593 1550 1487 5459 2616 -3621 -9280 -13884 -3281 2349 -1907
16416 -1907 -14050 -16315 -21283 -19559 -13879 -10950 -9148 -18367 -21414 -15963 -15132 -16921 -12984 -8975 -6806
16401 -6806 -5218 -1025 -7891 -13566 -11383 -12294 -11697 -7720 -4274 -7035 -10740 -12814 -10289 -7273 -6574
16386 -6574 -2186 -2469 -4253 234 5972 1340 -2777 -1522 932 1504 4991 728 3104 5427 2977
16371 2977 716 3279 -111 -4257 39 -1042 -5933 -8618 -13492 -11342 -8087 -2253 -1447 6970 8572
$$ packed form
16472g923L940Q981K151M02Q996K3001M1122O1374N9126P509k3033k5290j9614
16459A40742k6944l0585l2700k1866j2442k744r693l917m674O57m806o364j08
16446a5444N860P143l003J159N47k681l952K762N363J988R4k253J83r666L115
16431h785N282k369j735J732P468m3o3L972k843o237n659m604J0603N630m256
16416a907j2143k265m968J724N680K929J802r219l047N451Q31j789L937M009K169
16401f806J588M193o866n675K183r11N97L977L446k761l705k074K525L016O99
16386f574M388k83j784M487N738m632m117J255K454N72L487m263K376K323k450
16371B977k261K563l390m146M296j081m891k685m874K150L255N834Q06Q417J602
$$ plain form
16356 8572 4174 -5455 -7248 -6485 -11162 -7465 -922 4143 1744 -11332 -8219 -4124 -4616 -261 -6252
16341 -6252 -7370 -3989 -8605 -8404 -7788 -6990 -8889 -8463 -6223 -6017 -13425 -18418 -22381 -16325 -14564 -9969
16325 -9969 -7917 -8165 -2890 763 1633 -541 906 4063 713 -354 -4910 -5501 -657 6618 -17
16310 -17 -7218 -5520 -1381 1799 -2248 -5817 -9631 -13283 -15506 -11677 -4303 -4925 -2917 -835 432
16295 432 -1199 -1745 -2981 -2459 -4025 -11210 -7232 3050 -1220 -5079 3914 6030 -2163 -11242 -14461
16280 -14461 -13403 -7558 -8911 -8387 -3793 -6678 -13143 -13648 -7113 -3516 -4707 1106 1164 -6651 -9775
16265 -9775 -13217 -10639 -12652 -14336 -9612 -4811 -8129 -10510 -14350 -14155 -16438 -18499 -18167 -13046 -18541
16250 -18541 -14332 -2854 634 327 2282 5704 1864 -7596 -14760 -15740 -12505 -2276 -375 -2363
$$ packed form
16356H572m398r629j793P63m677L697O543N065k399j3076L113M095m92M355n991
16341f252j118L381m616K01O16P98j899M26K240K06p408m993l963O056J761M595
16325i969K052k48N275L653Q70k174J447L157l350j067m556n91M844P275o635
16310a7p201J698M139L180m047l569l814l652k223L829P374o22K008K082J267
16295D32j631n46j236N22j566p185L978J0282m270l859Q993K116q193r079l219
16280a4461J058N845j353N24M594k885o465n05O535L597j191N813N8p815l124
16265i775l442K578k013j684M724M801l318k381l840J95k283k061L32N121n495
16250a8541M209J1478L488l07J955L422l840r460p164r80L235J0229J901j988
$$ plain form
16236 -2363 -1997 521 -219 3339 -2386 -3500 -5684 -9983 -5271 -4282 -5073 -9670 -7505 -9723 -9106 -3478
16220 -3478 -4490 -9765 -18010 -22163 -18698 -12768 -8585 -4576 -9684 -18167 -19729 -18666 -18760 -17313 -10348
16205 -10348 -4797 -9332 -6422 6994 1398 3535 2546 -5205 -3055 -858 -8293 -13321 -15477 -17586
16191 -17586 -14569 -8224 -6835 -1948 2955 85 -3692 -4700 -11224 -10189 -6624 -10759 -7182 -4074
16177 -4074 -9635 -13574 -19286 -15224 -10478 -6250 -3052 -1053 -1960 -4661 -8632 -13119 -9167 -1979 -4949
16162 -4949 -6549 -2879 784 708 -1047 1033 -6471 -8998 -7919 -11876 -12433 -9831 -7248 -9441 -12027
16147 -12027 -12107 -11034 -14597 -16653 -14189 -11112 -7213 -4713 -2636 1159 5358 732 -3666 -4465 4454
16132 4454 2865 -46 -13038 -17353 -17362 -20988 -19018 -9961 -8738 -3651 -7555 -11996 -7336 -562 -2157
$$ packed form
16236b363L66K518p40L558n725j114k184m299M712R89p91m597K165k218O17N628
16220c478j012n275q245m153L465N930M183M009n108q483j562J063r4J447O965
16205a0348N551m535K910J3416n596K137r89p751K150K197p435n028k156k109
16191a7586L017O345J389M887M903k870l777j008o524J035L565m135L577L108
16177d074n561l939n712M062M746M228L198J999r07k701l971m487L952P188k970
16162d949j600L670L663p6j755K080p504k527J079l957n57K602K583k193k586
16147a2027q0J073l563k056K464L077L899K500K077L795M199m626m398p99Q919
16132D454j589k911j2992m315rl626J970R057J223N087l904m441M660O774j595
$$ plain form
16117 -2157 -10052 -13445 -13720 -8005 -5484 -8532 -7373 -7573 -3725 -54 3322 5676 -2237 -2898 -2881 -6314
16101 -6314 -10885 -6585 -12961 -19295 -13802 -10080 -9721 -7531 -1454 -2929 -6271 -10260 -14456 -12616 -8256
16086 -8256 -10165 -13933 -10412 -9061 -17351 -18353 -9435 -2723 -10092 -20389 -25044 -27392 -23630 -19349
16072 -19349 -12440 -6955 -5501 -4277 -1798 6527 7917 3714 -4132 -8143 -11084 -13912 -11329 -6174
16058 -6174 -2013 -2456 -7479 -10121 -11001 -9380 -12823 -9936 -1925 -1586 -2633 -1202 -2894 -4967 -9445
16043 -9445 -8427 -11235 -7328 -580 -5983 -11095 -10040 -8418 -9416 -10336 -7316 1319 2572 3652 1638
16028 1638 5377 5496 -349 -8010 -16403 -22681 -18906 -16268 -15317 -14069 -4763 -4256 -13566 -14456 -11753 -5351
16012 -5351 -3131 -9166 -7478 -4556 -9235 -8164 -10148 -10845 -11727 -14377 -10872 -9204 -9871 -8094 -8890 -3536
$$ packed form
16117b157p895l393k75N715K521l048J159k00L848L671L376K354p913o61J7l433
16101f314m571M300o376o334N493L722L59K190O077j475l342l989m196J840M360
16086h256j909l768L521J351q290j002Q918O712p369j0297m655k348L762M281
16072a9349O909N485J454J224K479Q325J390m203p846m011k941k828K583N155
16058f174M161m43n023k642q80J621l443K887Q011L39j047J431j692k073m478
16043i445J018k808L907O748n403n112J055J622r98r20L020Q635J253J080k014
16028A638L739J19n845p661q393o278L775K638R51J248R306N07r310q90K703O402
16012e351K220o035J688K922m679J071j984o97q82k650L505J668o67J777p96N354
$$ plain form
15996 -3536 -4648 -6452 -7265 -9290 -10359 -10312 -12001 -17274 -13727 -17866 -22704 -17435 -16972 -14782 -14088 -7559
15980 -7559 1502 -493 -5071 -5011 3054 3794 -1225 -11670 -15156 -6020 -1645 1087 -2904 -8104 -10565
15965 -10565 -16317 -24391 -21757 -16908 -11403 -6132 -6362 -8810 -11236 -7099 -4371 -4816 -4748 -6230 -8580
15950 -8580 -9760 -12774 -16314 -13416 -7650 -3336 -3063 -8886 -17358 -20319 -17755 -12659 -15131 -17592 -18794
15935 -18794 -16661 -13367 -10978 -12937 -12286 -16715 -15103 -16377 -14565 -7877 -6011 -8443 -11125 -12494 -7103
15920 -7103 -8854 -7357 -1554 2817 -2926 -7833 -5592 -6414 -8242 -4523 -4280 -5763 -8526 -7909 -7117 -7526
15904 -7526 -8350 -12507 -8781 -12517 -16256 -20515 -21920 -10444 -1444 -2438 -6695 -4456 -1400 -1669 -7148
15889 -7148 -8711 -4612 -8329 -15441 -16247 -12970 -13600 -8709 -4639 947 2107 2345 4526 -775 -5059
$$ packed form
15996c536j112j804q13k025j069M7j689n273L547m139m838N269M63K190O94O529
15980g559R061j995m578O0Q065P40n019j0445l486R136M375K732l991n200k461
15965a0565n752q074K634M849N505N271k30k448k426M137K728m45O8j482k350
15950h580j180l014l540K898N766M314K73n823q472k961K564N096k472k461j202
15935a8794K133L294K389j959O51m429J612j274J812O688J866k432k682j369N391
15920g103j751J497N803M371n743m907K241q22j828L719K43j483k763O17P92m09
15904g526q24m157L726l736l739m259j405J1476R000r94m257K239L056k69n479
15889g148j563M099l717p112q06L277o30M891M070N586J160K38K181n301m284
$$ plain form
15874 -5059 -5563 -7768 -10699 -12449 -11814 -8644 -10764 -4086 -4770 -6507 -3031 1100 -12334 -11905 -10000
15859 -10000 -12054 -13763 -9890 -8870 -9096 -13004 -13745 -10313 -14867 -17224 -12480 -10467 -10082 -10466 -15781
15844 -15781 -14679 -10353 -13115 -10089 -1294 -296 -3820 -3301 -3112 -9589 -10207 2800 4549 -1196 3137
15829 3137 4708 -2635 -6320 -2259 -1295 -5411 -5051 -2068 -2059 -6811 -9204 -11111 -13121 -12793 -13700 -11109
15813 -11109 -9059 -7034 -3837 -1326 -4321 -13867 -17040 -8447 -11881 -12402 -10179 -8841 -9728 -8416 -9290
15798 -9290 -8545 -8641 -8983 -6969 -9235 -4892 3131 4543 1269 -2893 -2574 -2798 -8438 -13026 -16024 -13248
15782 -13248 -7970 -7087 -14350 -14399 -10011 -12998 -9064 -5378 -5250 -19379 -15870 -6413 -6742 -6035 -8126 -12756
15766 -12756 -14508 -8209 -12036 -10222 -7883 -6939 -6335 -2998 1342 -403 -5202 -7003 -6297 -4361 -3813
$$ packed form
15874e059n04k205k931j750O35L170k120O678o84j737L476M131j3434M29J905
15859a0000k054j709L873J020k26l908p41L432m554k357M744K013L85l84n315
15844a5781J102M326k762L026Q795R98l524N19J89o477o18J3007J749n745M333
15829C137J571p343l685M061R64m116L60K983Rm752k393j907k010L28r07K591
15813a1109K050K025L197K511k995r546l173Q593l434n21K223J338q87J312q74
15798i290P45r6l42K014k266M343Q023J412l274m162L19k24n640m588k998K776
15782a3248N278Q83p263m9M388k987L934L686J28j4129L509R457l29P07k091m630
15766a2756j752O299l827J814K339R44O04L337M340j745m799j801P06J936N48
$$ plain form
15751 -3813 -6910 -10889 -13679 -16672 -15918 -10010 -7101 -8017 -8375 -6449 -6804 -7219 -8420 -1143 -1998 -11925
15735 -11925 -13557 -16949 -23321 -25148 -21212 -16121 -12863 -17512 -18305 -13159 -13347 -15114 -17824 -16689 -16688 -8049
15719 -8049 -6175 -12122 -15846 -17108 -14103 -15100 -17748 -14645 -14370 -9653 -5719 -4545 -10280 -12265 -5153
15704 -5153 -3006 -5555 -8539 -8202 -6965 -8914 -5598 -4495 -8817 -11864 -11842 -11296 -10573 -3993 -4414 -7386
15688 -7386 -8987 -7201 -15413 -16437 -19719 -20702 -17935 -18739 -15168 -19949 -15192 -10515 -10208 -9657 -3598 2076
15672 2076 3828 18 4793 3245 -844 3419 482 -689 -4448 -8660 -7224 -7321 -11085 -7520 -4428
15657 -4428 -4123 -6113 -7684 -5289 -4654 -8684 -14225 -7755 -3326 -5809 -17789 -23041 -17468 -11058 -10924
15642 -10924 -11504 -5315 -4600 -9570 -17789 -20220 -16582 -16822 -16842 -8230 -5221 -3635 -4655 -4428 -6370 -11523
$$ packed form
15751c813l097l979k790k993P54N908K909r16l58J926l55m15j201P277q55r927
15735a1925j632l392o372j827L936N091L258m649p93N146j88j767k710J135JQ639
15719h049J874n947l724j262L005r97k648L103K75M717L934J174n735j985P112
15704e153K147k549k984L37J237j949L316J103m322l047K2N46P23O580m21k972
15688g386j601J786q212j024l282r83K767q04L571m781M757M677L07N51O059N674
15672B076J752l810M775j548m089M263k937j171l759m212J436r7l764L565L092
15657d428L05j990j571K395O35m030n541O470M429k483j1980n252N573O410J34
15642a0924n80O189P15m970q219k431L638k40k0Q612L009J586j020K27j942n153
$$ plain form
15626 -11523 -6534 315 4109 -7430 -12849 -14054 -9026 -2187 2462 3911 -405 -4020 -8901 -14175
15612 -14175 -11936 -12686 -15002 -12209 -9986 -12327 -8378 -2830 -7510 -10820 -10249 -9909 -13401 -16666 -11641
15597 -11641 -9070 -9530 -7700 -9582 -13290 -18315 -15384 -7968 -7399 -7602 -4234 -4645 -2565 -3813 -5728
15582 -5728 -8252 -9292 -5660 1245 5497 8531 9254 7189 4194 2542 562 -1636 -3038 -4262 -5655
$$ packed form
15626a1523M989O849L794j1539n419j205N028O839M649J449m316l615m881n274
15612a4175K239p50k316K793K223k341L949N548m680l310N71L40l492l265N025
15597a1641K571m60J830j882l708n025K931P416N69k03L368m11K080j248j915
15582e728k524j040L632O905M252L034P23k065k995j652j980k198j402j224j393
$$ [...]
##END NTUPLES=NMR SPECTRUM
##END=
