##TITLE=Analysis number 319473
Compound Code ac 20996
Project Code adrs
Chemist Name flurochem
##JCAMPDX= 6.0         $$ Bruker NMR JCAMP-DX V2.0
##DATA TYPE= NMR SPECTRUM
##DATA CLASS= NTUPLES
##ORIGIN= Bruker BioSpin GmbH
##OWNER= nmr
$$ XWIN-NMR		Version 3.5
$$ Tue May 16 13:41:17 2006 GMT Daylight Time (UT+1h)  MAYBRIDGE\nmr@NMR_250MHZ
##.OBSERVE FREQUENCY= 250.131544655141
##.OBSERVE NUCLEUS= ^1H
##.ACQUISITION MODE= SIMULTANEOUS (DQD)
##.ACQUISITION SCHEME= undefined
##.AVERAGES= 16
##.DIGITISER RES= 18
##SPECTROMETER/DATA SYSTEM= dpx250
##.PULSE SEQUENCE= zg30
##.SOLVENT NAME= CDCl3
##.SHIFT REFERENCE= (INTERNAL, CDCl3, 0, 16.522)
##AUDIT TRAIL= $$ (NUMBER, WHEN, WHO, WHERE, WHAT)
$$ ##TITLE= Audit trail, XWIN-NMR		Version 3.5
$$ ##JCAMPDX= 5.01
$$ ##ORIGIN= Bruker BioSpin GmbH
$$ ##OWNER= nmr
$$ C:\u/data/dgb/nmr/ADRS/4490/pdata/1/auditp.txt
$$ ##AUDIT TRAIL=  $$ (NUMBER, WHEN, WHO, WHERE, WHAT)
(   1,<2006-05-16 13:40:41.72 +100>,<MAYBRIDGE\nmr>,<NMR_250MHZ>,
      <created by zg, POWCHK disabled, PULCHK disabled
       configuration hash MD5:
       84 BC 41 DB A1 6E 1D 46 DA 25 12 A5 C1 ED C5 3A
       data hash MD5: 64K
       98 66 0C 10 49 E2 B0 86 9E CE 1D 8B EF 46 CB 48>)
(   2,<2006-05-16 13:40:58.97 +100>,<MAYBRIDGE\nmr>,<NMR_250MHZ>,
      <Start of raw data processing
       ef LB = 0.3 FT_mod = 6 PKNL = 1 SI = 32K 
       data hash MD5: 32K
       E8 EE A5 5F BF B9 C0 BA 80 42 CF 4A 5D F3 73 84>)
(   3,<2006-05-16 13:41:03.58 +100>,<MAYBRIDGE\nmr>,<NMR_250MHZ>,
      <apk 
       data hash MD5: 32K
       F9 3B 89 A3 D3 88 60 00 D4 5C A2 BC 60 84 5E 1B>)
(   4,<2006-05-16 13:41:05.14 +100>,<MAYBRIDGE\nmr>,<NMR_250MHZ>,
      <abs ABSG = 5 
       data hash MD5: 32K
       8B 20 AA A8 1A D9 65 FC 88 C1 39 49 41 7A 27 81>)
$$ ##END=
$$ 
$$ hash MD5
$$ 99 30 A4 FA 35 3B 49 9D 72 8E 3A 1D F0 3F 46 AA
##$RELAX= 
##$RELAX= 
##$RELAX= 
##$RELAX= 
##$RELAX= 
##$RELAX= 
##$RELAX= 
$$ Bruker specific parameters
$$ --------------------------
##$DU= <C:\u>
##$EXPNO= 4490
##$NAME= <ADRS>
##$PROCNO= 1
##$TYPE= <nmr>
##$USER= <dgb>
##$AMP= (0..31)
100 100 100 100 100 100 100 100 100 100 100 100 100 100 100 100 100 100 
100 100 100 100 100 100 100 100 100 100 100 100 100 100 
##$AQSEQ= 0
##$AQ_mod= 3
##$AUNM= <au_zg>
##$AUTOPOS= <38 >
##$BF1= 250.13
##$BF2= 250.13
##$BF3= 250.13
##$BF4= 250.13
##$BF5= 500.13
##$BF6= 500.13
##$BF7= 500.13
##$BF8= 500.13
##$BYTORDA= 1
##$CFDGTYP= 0
##$CFRGTYP= 5
##$CHEMSTR= <none>
##$CNST= (0..31)
1 1 145 1 1 1 1 1 1 1 1 1 1 1 1 1 1 1 1 1 1 1 1 1 1 1 1 1 1 1 1 1 
##$CPDPRG= <>
##$CPDPRG1= <>
##$CPDPRG2= <>
##$CPDPRG3= <>
##$CPDPRG4= <mlev>
##$CPDPRG5= <mlev>
##$CPDPRG6= <mlev>
##$CPDPRG7= <mlev>
##$CPDPRG8= <mlev>
##$CPDPRGB= <>
##$CPDPRGT= <>
##$D= (0..31)
0 1 0 0 0 0 0 0 0 0.06 0 0 0 0 0 0 0.0002 0 0 0 0 0 0 0 0 0 0 0 0 0 0 
0 
##$DATE= 1147783240
##$DBL= (0..7)
120 120 120 120 120 120 120 120 
##$DBP= (0..7)
150 150 150 150 150 150 150 150 
##$DBP07= 0
##$DBPNAM0= <>
##$DBPNAM1= <>
##$DBPNAM2= <>
$$ [...]
##$SUBNAM7= <"">
##$SUBNAM8= <"">
##$SUBNAM9= <"">
##$SW= 20.6930455092707
##$SWIBOX= (0..15)
0 0 3 0 0 0 0 0 0 0 0 0 0 0 0 0 
##$SW_h= 5175.983436853
##$TD= 65536
##$TD0= 1
##$TE= 295.16
##$TE2= 300
##$TE3= 300
##$TEG= 300
##$TL= (0..7)
0 120 120 120 120 120 120 120 
##$TP= (0..7)
150 150 150 150 150 150 150 150 
##$TP07= 0
##$TPNAME0= <>
##$TPNAME1= <>
##$TPNAME2= <>
##$TPNAME3= <>
##$TPNAME4= <>
##$TPNAME5= <>
##$TPNAME6= <>
##$TPNAME7= <>
##$TPOAL= (0..7)
0.5 0.5 0.5 0.5 0.5 0.5 0.5 0.5 
##$TPOFFS= (0..7)
0 0 0 0 0 0 0 0 
##$TUNHIN= 0
##$TUNHOUT= 0
##$TUNXOUT= 0
##$USERA1= <user>
##$USERA2= <user>
##$USERA3= <user>
##$USERA4= <user>
##$USERA5= <user>
##$V9= 5
##$VALIST= <valist>
##$VCLIST= <CCCCCCCCCCCCCCC>
##$VD= 0
##$VDLIST= <DDDDDDDDDDDDDDD>
##$VPLIST= <PPPPPPPPPPPPPPP>
##$VTLIST= <TTTTTTTTTTTTTTT>
##$WBST= 1024
##$WBSW= 4
##$XGAIN= (0..3)
0 0 0 0 
##$XL= 0
##$YL= 0
##$YMAX_a= 336232
##$YMIN_a= -471023
##$ZGOPTNS= <>
##$ZL1= 120
##$ZL2= 120
##$ZL3= 120
##$ZL4= 120
##$ABSF1= 16.522
##$ABSF2= -4.171173
##$ABSG= 5
##$ABSL= 3
##$ALPHA= 0
##$AQORDER= 0
##$ASSFAC= 0
##$ASSFACI= 0
##$ASSFACX= 0
##$ASSWID= 0
##$AUNMP= <proc_1d>
##$AZFE= 0.1
##$AZFW= 0.1
##$BCFW= 0
##$BC_mod= 0
##$BYTORDP= 0
##$COROFFS= 0
##$CY= 12.5
##$DATMOD= 1
##$DC= 0
##$DFILT= <>
##$DTYPP= 0
##$F1P= 14.0000005364418
##$F2P= -0.99999901652339
##$FCOR= 0.5
##$FTSIZE= 32768
##$FT_mod= 6
##$GAMMA= 0
##$GB= 0
##$INTBC= 1
##$INTSCL= 1
##$ISEN= 128
##$LB= 0.3
##$LEV0= 0
##$LPBIN= 0
##$MAXI= 10000
##$MC2= 0
##$MEAN= 0
##$ME_mod= 0
##$MI= 0
##$NCOEF= 0
##$NC_proc= -2
##$NLEV= 6
##$NOISF1= 0
##$NOISF2= 0
##$NSP= 0
##$NTH_PI= 0
##$NZP= 0
##$OFFSET= 16.522
##$PC= 1
##$PHC0= 165.5335
##$PHC1= 6.435604
##$PH_mod= 1
##$PKNL= yes
##$PPARMOD= 0
##$PSCAL= 4
##$PSIGN= 0
##$REVERSE= no
##$SF= 250.13
##$SI= 32768
##$SIGF1= 0
##$SIGF2= 0
##$SINO= 400
##$SIOLD= 32768
##$SREGLST= <1H.CDCl3>
##$SSB= 0
##$STSI= 32768
##$STSR= 0
##$SW_p= 5175.98343685301
##$SYMM= 0
##$S_DEV= 0
##$TDeff= 65536
##$TDoff= 0
##$TI= <Analysis number 999999
Compound Code 99
Book Reference 9
Project Code 9>
##$TILT= no
##$TM1= 0
##$TM2= 0
##$TOPLEV= 0
##$USERP1= <user>
##$USERP2= <user>
##$USERP3= <user>
##$USERP4= <user>
##$USERP5= <user>
##$WDW= 1
##$XDIM= 32768
##$YMAX_p= 295431848
##$YMIN_p= -58221
$$ End of Bruker specific parameters
$$ ---------------------------------
##NTUPLES= NMR SPECTRUM
##VAR_NAME=  FREQUENCY,     SPECTRUM/REAL,   SPECTRUM/IMAG
##SYMBOL=    X,             R,               I
##VAR_TYPE=  INDEPENDENT,   DEPENDENT,       DEPENDENT
##VAR_FORM=  AFFN,          ASDF,            ASDF
##VAR_DIM=   32768,         32768,           32768
##UNITS=     HZ,            ARBITRARY UNITS, ARBITRARY UNITS
##FACTOR=    0.157963299565203, 1,           1
##FIRST=     4132.6476996994, 0,             0
##LAST=      -1043.33573715361, 0,           0
##MIN=       -1043.33573715361, -58221,      0
##MAX=       4132.6476996994, 295431848,     0
$$ Real data points
##PAGE= N=1
##DATA TABLE= (X++(R..R)), XYDATA
$$ [...]
17623B906268j16522q9745q7857m1031l2375m6900o5970p2969o4938q7241n5143
$$ 2906268 2789746 2700001 2612144 2571113 2538738 2491838 2425868 2352899 2287961 2200720 2145577
17612B145577k1576R489L385n904l0424m0981l2684l4849M70J1368J8392P0289
$$ 2145577 2124001 2133490 2136875 2130971 2100547 2059566 2026882 1992033 1992503 2003871 2022263 2092552
17600B092552J28367J75111K46562L65832N16485P57104J152267J744696K569322
$$ 2092552 2220919 2396030 2642592 3008424 3524909 4282013 5434280 7178976 9748298
17591I748298L429610L857799L305852J513902q50623k721539l495996l252839
$$ 9748298 13177908 17035707 20341559 21855461 21004838 18283299 14787303 11534464
17583A1534464k529903j777003j206879q33563n76574m24656l29691k62224k16640
$$ 11534464 9004561 7227558 6020679 5187116 4610542 4185886 3856195 3593971 3377331
17574C377331j78581j60829j54149j23775r6299q4446p1976o2824p1786p9520
$$ 3377331 3198750 3037921 2883772 2759997 2663698 2579252 2507276 2444452 2372666 2293146
17564B293146p9510p4821n7750l1966l6309m9247p5294m9422l9771m4387m5574
$$ 2293146 2213636 2138815 2081065 2049099 2012790 1963543 1888249 1838827 1799056 1754669 1709095
17553A709095o7614p4714n5563l3116l1726m6983l8505m7551l0522q061k6231
$$ 1709095 1641481 1566767 1511204 1478088 1446362 1399379 1360874 1313323 1282801 1274740 1248509
17542A248509l4254l2513l9576l2160l1255k7088j6914j7999k2075k5352j3683
$$ 1248509 1214255 1181742 1142166 1110006 1078751 1051663 1034749 1016750 994675 969323 955640
17531I55640k5662k9582j6179l3426k2673P36r723l2640k5699j9494j6189k3038
$$ 955640 929978 900396 884217 850791 828118 828854 819131 786491 760792 741298 725109 702071
17519G02071k1048m304N31K104j3871j9698p866q487j1260m865j7629j6210j6713
$$ 702071 681023 676719 677250 679354 665483 645785 637919 629432 618172 613307 595678 579468 562755
17506E62755j9360k0624j8567o530k890j1672j8773j6184j0113j0275o471n671
$$ 562755 543395 522771 504204 497674 494784 483112 464339 448155 438042 427767 421296 415625
17494D15625j93p915l466p991j0615q543j4564k1184J800O267l621q529q044p307
$$ 415625 415432 407517 404051 396060 385445 376902 362338 341154 342954 349221 345600 337071 329027 321720
17480C21720j736j2598O726j8151j2583j706k2175l870J6442m757k0694o319l190
$$ 321720 319984 307386 314112 295961 283378 281672 259497 255627 272069 267312 246618 240299 237109
17467B37109R15J2250k260L250k481j2277j198M458k0432k4053l725M202L420
$$ 237109 238024 250274 248014 251264 248783 236506 235308 239766 219334 195281 191556 195758 199178
17454A99178j298K72o745q320k102J6959j109j2242n658j18j2997j0989J339K3452
$$ 199178 197880 198152 191407 183087 180985 197944 196835 184593 178935 178817 165820 154831 156170 179622
17440A79622L4597K9415k975l6667j7417j2377J211J0828k0560k1013r248J477
$$ 179622 214219 243634 240659 203992 186575 174198 175409 186237 165677 144664 135416 136893
17428A36893n442j7668j3200j3372O100Q499q288k962K538L590J0294j4019m094
$$ 136893 131451 113783 100583 87211 93311 101810 93522 90560 93098 96688 106982 92963 88869
17415H8869L211o200J783p030j855j884N119J8384K633j0570q978O014J0571m560
$$ 88869 92080 85880 87663 80633 78778 76894 82013 100397 103030 92460 83482 89496 100067 95507
17401I5507j1922P135N548J0498k196j9992k1218q654M661j364P126r321q450
$$ 95507 83585 90720 96268 106766 104570 84578 63360 54706 59367 58003 65129 55808 47358
17388D7358k178Q931K220j0237P271m489R321O490k2438j0230O363N579K45q909
$$ 47358 45180 54111 56331 46094 53365 48876 58197 64687 42249 32019 38382 43961 44206 35297
17374C5297j6685l630J7934K2124j5121n753L412R47K514M388k0151q537j384
$$ 35297 18612 14982 32916 55040 39919 34166 37578 38525 41039 45427 25276 16739 15355
17361A5355Q58Q699O809k643Q816n085K795k1047p228K891J2531n725J4034K999
$$ 15355 16213 24912 31721 29078 37894 32809 35604 14557 7329 10220 22751 17026 31060 34059
17347C4059l3l608j3456j9115o958m293O033Q171J1978J0408o940j1888p015R690
$$ 34059 34026 30418 16962 -2153 -9111 -13404 -7371 800 12778 23186 16246 4358 -2657 7033
17333G033J587J3265N190j9302k0975j0676k715J0438K3628N275M210O551J482
$$ 7033 8620 21885 27075 7773 -13202 -23878 -26593 -16155 7473 12748 16958 23509 24991
17320B4991j5652M348P652j5301j8404J1020J8552L573j828r265j4982j8113k909
$$ 24991 9339 13687 21339 6038 -12366 -1346 17206 20779 18951 9686 -5296 -23409 -26318
17307b6318J0928r65p385j4452l265J9351K0348J1510J109p407n188j617J0909
$$ -26318 -15390 -16355 -23740 -38192 -41457 -22106 -1758 9752 10861 3454 -1734 -3351 7558
17294G558K881o968N309R662L882j3668K290m62n194l205q905M313N874O091r222
$$ 7558 10439 3471 8780 18442 22324 8656 10946 10484 5290 2085 -6820 -2507 3367 9458 236
17279B36L028l6r303n836M486K1014J7213m934k3974j2663o479P310j165p864
$$ 236 3264 3228 -6075 -11911 -7425 13589 30802 25868 1894 -10769 -17248 -9938 -11103 -18967
17265a8967N756O034q480l53O655N163M267j8564R406L032j0412L634J6994M593
$$ -18967 -13211 -7177 -15657 -16010 -9355 -4192 75 -18489 -9083 -6051 -16463 -12829 4165 8758
17251H758n668j2905j0895j3703Q627L891M842J6262K3184M353j8563j4500J8875
$$ 8758 3090 -9815 -20710 -34413 -25786 -21895 -17053 -791 22393 26746 8183 -6317 12558
17238A2558m9r684p940k56J3278m830m097j4754j3296K305K0313J5444j1630r664
$$ 12558 12509 2825 -5115 -5371 7907 3077 -1020 -15774 -29070 -26765 -6452 8992 -2638 -12302
17224a2302n871P704J5312J7403k881l710j7799j3974m34L262J0864N910Q214
$$ -12302 -18173 -10469 4843 22246 19365 15655 -2144 -16118 -16552 -13290 -2426 3484 11698
17211A1698m231k4718j0508O358J2493J5264m778j2885o439l254M515n778P7J7167
$$ 11698 7467 -17251 -27759 -21401 -8908 6356 1578 -11307 -17746 -21000 -16485 -22263 -22186 -5019
17197e019J4187R752r273k1129N588l512M928r216R49j4518j9283J1500K0498
$$ -5019 9168 18920 9647 -11482 -5894 -9406 -4478 -13694 -12745 -27263 -46546 -35046 -14548
17184a4548P576j1547l846n519J0113r032j0825J2994K686J6953M44p442J0227
$$ -14548 -6972 -18519 -22365 -27884 -17771 -26803 -37628 -24634 -21948 -4995 -4551 -11993 -1766
17171a766J0927R546J1307p569n838j636j410q998p554j3159j3436J3099K3942
$$ -1766 9161 18707 30014 22445 16607 14971 13561 4563 -2991 -16150 -29586 -16487 7455
17158G455J1151K082j0848j9463m716J7459P219O226j4660j0711J9640Q628q694
$$ 7455 18606 20688 9840 -9623 -14339 3120 10339 16565 1905 -8806 10834 19462 10768
17145A0768p786q432K014p037j466O533K561J5815J1123L064J5591K9322J3701
$$ 10768 2982 -5450 -3436 -10473 -11939 -5406 -2845 12970 24093 27157 42748 72070 85771
17132H5771j428J4584k08k0043q783k0838j6801j1483p035L576Q239K448j746
$$ 85771 84343 98927 98719 78676 69893 49055 32254 20771 13736 17312 25551 27999 26253
17119B6253r040p037K703R979J519j2170j8732r30J2250J0016R118O8j1862m864
$$ 26253 17213 10176 12879 22858 24377 12207 -6525 -7455 4795 14811 23929 23997 12135 7271
17105G271p017j1213p20K881J1260J9823N078l550j1147o096j8145j4671j430
$$ 7271 254 -10959 -11679 -8798 2462 22285 27363 23813 12666 6570 -11575 -26246 -27676
17092b7676r00O548J5364J1868J0574J557k64J5956L5490K2736k946L967k76k3871
$$ -27676 -28576 -22028 -6664 5204 15778 17335 17071 33027 68517 91253 88307 92274 91998 68127
17078F8127q268l900k2734r067n304N798J4917o661j4429m031k241O101N59O922
$$ 68127 59859 55959 33225 24158 18854 24652 39569 32908 18479 14448 12207 18308 18867 25789
17064B5789n382q328p257q943r998r856N076K083p232J8156R122k781k285N150
$$ 25789 20407 12079 4822 -4121 -14119 -23975 -18899 -16816 -24048 -5892 3230 449 -1836 3314
17050C314O289j5539n197j347O423K5181J2784n365j3200j7396j9999j7827j496
$$ 3314 9603 -5936 -11133 -12480 -6057 19124 31908 26543 13343 -4053 -24052 -41879 -43375
17037d3375M319J2759J0522l021m228J9304N514p202j0214l867L318M345J080
$$ -43375 -39056 -26297 -15775 -18796 -23024 -3720 1794 -5408 -15622 -19489 -16171 -11826 -10746
17024a0746J2309K2604l783r85O05p796o573j9652Q455m04J317K319o696L058
$$ -10746 1563 24167 20384 19399 20004 12208 5635 -14017 -5562 -5966 -4649 -2330 -9026 -5968
17010e968J0382q588m70J5024p613l756J5790o11R84j396j6896k5588k168L136
$$ -5968 4414 -4174 -4644 10380 2767 -989 14801 14190 15174 13778 -3118 -28706 -30874 -27738
16996b7738L85J1736K654J026l288M017K1983k821J130n150m346l661k356l027
$$ -27738 -27353 -15617 -12963 -11937 -15225 -11208 10775 7954 9084 3934 -412 -4073 -6429 -9456
16982i456J038M373J4808j1973j5916q31Q76q889q870M722n66J5854L69q715l754
$$ -9456 -8418 -4045 10763 -1210 -17126 -17957 -17081 -25970 -34840 -30118 -30684 -14830 -14461 -23176 -26930
16967b6930O91R830N562J0257m307k0555K434O674L496m312K178J2175q574O76
$$ -26930 -26239 -16409 -10847 -590 -4897 -25452 -23018 -16344 -12848 -17160 -14982 -2807 -11381 -10705
16953a0705J9556l960j9290J7288o296m787k462p554o667O72l348K799j196o179
$$ -10705 8851 4891 -14399 2889 -3407 -8194 -10656 -18210 -24877 -24205 -27553 -24754 -25950 -32129
16939c2129q095k635R571r16Q512J7961m237r899j3923l125J5864J604R837o987
$$ -32129 -40224 -42859 -33288 -34204 -25692 -7731 -11968 -21867 -35790 -38915 -23051 -21447 -11610 -18597
16925a8597N224K008J2977P505p763Q016J1172k1863j7104J0984o004M64k142
$$ -18597 -13373 -11365 1612 9117 1354 9370 20542 -1321 -18425 -7441 -13445 -12981 -15123
16912a5123p594K876p391J255J7162K6422J541M40o991j1737R436L204j219j2955
$$ -15123 -22717 -19841 -27232 -25977 -8815 17607 19148 19588 12597 860 10296 13500 12281 -674
16898f74P362J1716l852K124p144j9641M175j0405j189r026q782j185R631J1724
$$ -674 6688 18404 14552 16676 9532 -10109 -5934 -16339 -17528 -26554 -35336 -36521 -26890 -15166
16884a5166Q475m109l210M456j737J1717p353j690L847p031p933O5L511J59O506
$$ -15166 -6691 -10800 -14010 -9554 -11291 426 -6927 -8617 -4770 -11801 -19734 -19669 -16158 -15999 -9493
16869i493j315j746k333P834J3044N28q058m015Q405p385j6646R126K5652l042
$$ -9493 -10808 -12554 -14887 -7053 5991 6519 -1539 -5554 2851 -4534 -21180 -12054 13598 10556
16855A0556k7779r272M878J9084O106q698k279K0340P315n586Q571N841j5677
$$ 10556 -17223 -26495 -21617 -2533 3573 -5125 -7404 12936 20251 14665 23236 29077 13400
16842A3400m560m069J739q057o316l169O892l285N72R53n670r70M84K327J1857
$$ 13400 8840 4771 6510 -1547 -7863 -11032 -4140 -7425 -6853 -5900 -11570 -12540 -12056 -9729 2128
16827B128j001l618L302P018k971r064n254R686R274p73j3938J0813L194k6346
$$ 2128 1127 -2491 811 7829 4858 -4206 -9460 226 9500 8727 -5211 5602 8796 -17550
16813a7550m543J3459P547M273J484j6887r163j5296J7059J6863J175M284K892
$$ -17550 -22093 -8634 -1087 3186 4670 -12217 -21380 -36676 -19617 -2754 -1579 2705 5597
16800E597j0402l108R279N245j5248o196o677M546N322J0380o759n293q903j703
$$ 5597 -4805 -7913 1366 6611 -8637 -14833 -21510 -16964 -11642 -1262 -8021 -13314 -22217 -23920
16786b3920M837J2389J7985J1943r344m790j2510r631J8366J8165n222j2389j4593
$$ -23920 -19083 -6694 11291 23234 13890 9100 -3410 -13041 5325 23490 18268 5879 -8714
16773h714q161k36n142J636m029j2828M36K8900n56n724o038L234k804j6974L335
$$ -8714 -16875 -17111 -22253 -20617 -24646 -37474 -37038 -8138 -8694 -14418 -20456 -17222 -20026 -37000 -33665
16758c3665O320J368j293J2619J2747l321r295j0475L790N616j4746M272j945
$$ -33665 -27345 -25977 -27270 -14651 -1904 -5225 -14520 -24995 -21205 -15589 -30335 -26063 -28008
16745b8008M862J6671J5163J2603n254j7415p187Q025J2043k212k0634k693l472
$$ -28008 -23146 -6475 8688 21291 16037 -1378 -8565 -540 11503 9291 -11343 -14036 -17508
16732a7508m738j7079N943J4322J0874L42L863J5517j123p228q137j3231n214
$$ -17508 -22246 -39325 -33382 -19060 -8186 -7844 -3981 11536 10413 3185 -4952 -18183 -23397
16719b3397J0172j689K1002R638r502q460j547J166N675M577J859n338p071j2717
$$ -23397 -13225 -14914 6088 15726 6224 -2236 -3783 -2617 3058 7635 9494 4156 -2915 -15632
16705a5632J351R482M225K706N049j4492j6461P605q237k503J7644O912J874n750
$$ -15632 -14281 -4799 -574 2132 7181 -7311 -23772 -16167 -24404 -26907 -9263 -2351 -477 -6227
16691f227j6358j8312L971Q392P180Q660J0461n67k2200k480J4417K718O972j311
$$ -6227 -22585 -40897 -36926 -28534 -21354 -12694 -2233 -2800 -25000 -27480 -13063 -10345 -3373 -4684
16677d684m28k467q07j742m400J3094M677j6304O777L37p598J0975p179m019j716
$$ -4684 -5112 -7579 -8386 -10128 -14528 -1434 3243 -13061 -6284 -5947 -13545 -2570 -9749 -13768 -15484
16662a5484k161r879J8091J0631K030j902O682j4037j4735j1193M529J0970J2361
$$ -15484 -17645 -27524 -9433 1198 3228 1326 8008 -6029 -20764 -31957 -27428 -16458 -4097
16649d097J0633P058L840k804r097j6713N675J8219o029K762p761k1232P372N788
$$ -4097 6536 13594 17434 14630 5533 -11180 -5505 12714 6685 9447 1686 -19546 -12174 -6386
16635f386N46O139p412j0155k5271J8726J7420M0l548m035l864Q410J6728j877
$$ -6386 -5840 299 -7113 -17268 -42539 -23813 -6393 -6353 -9901 -13936 -17800 -9390 7338 5461
16621E461N585L975j2021R62j4110j0727L45J040N159j791J0738L220N139l062
$$ 5461 11046 15021 3000 3962 -10148 -20875 -20530 -19490 -14331 -16122 -5384 -2164 2975 -87
16607h7N654n485K104K679k417q242J1346M987R74J150o878j2259o835k271M833
$$ -87 5567 82 2186 4865 2448 -5794 5552 10539 11513 12663 5785 -6474 -13309 -15580 -10747
16592a0747M591O112O779j8770r783K492q550J7040J5326R792J7520o111j3401
$$ -10747 -6156 -44 6735 -12035 -21818 -19326 -27876 -10836 4490 14282 31802 25691 12290
16579A2290J5794o555j4838O595j119j3253j389L232P627j27j1760J5475q354
$$ 12290 28084 21529 6691 13286 12167 -1086 -2475 757 8384 8257 -3503 11972 3618
16566C618K900J1536k921j0651J267M300k0521k704j70n709l860n984Q422P931
$$ 3618 6518 18054 15133 4482 5749 10049 -10472 -13176 -13346 -19055 -22915 -28899 -20477 -12546
16552a2546o888P509J0195O380j311j5051j2445n229J42R596J738r970r341J1524
$$ -12546 -19434 -11925 -1730 4650 3339 -11712 -24157 -29386 -29244 -19648 -17910 -27880 -37221 -25697
16538b5697J6594J969L329J0049j1735j3529L917J4584J967J0088j2078j0668
$$ -25697 -9103 -7134 -3805 6244 -5491 -19020 -15103 -519 1448 11536 -542 -11210
16526a1210J832n90O869p659K42p563J2813J2963n031j8833r453J4944l956n807
$$ -11210 -9378 -9968 -3099 -10758 -10516 -18079 -5266 7697 2666 -16167 -25620 -10676 -14632 -20439
16512b0439m143O928P66R02j3516r758k67J4118K748l807J2549J1961K728q111
$$ -20439 -24582 -17654 -16888 -15986 -29502 -39260 -39527 -25409 -22661 -26468 -13919 -1958 770 -7341
16498g341o21J3634N859k1365j48K635p011J1491l149M206P714J399j8164l525
$$ -7341 -7962 5672 11531 -9834 -9982 -7347 -14358 -2867 -6016 -1810 5904 7303 -10861 -14386
16484a4386J7175q425j5886L262J5303m350J097K626k959j2849l935J4137J313
$$ -14386 2789 -5636 -21522 -18260 -2957 -7307 -6210 -3584 -6543 -19392 -23327 -9190 -7877
16471g877j549J0884L111P93P223Q21j9527j1627j793O878J8976j930j911j3213
$$ -7877 -9426 1458 4569 5362 12585 13406 -6121 -17748 -19541 -12663 6313 4383 2472 -10741
16457a0741j2110R663j0029k786k833j2747R42J0805J0617J1898M197Q492m982
$$ -10741 -22851 -13188 -23217 -26003 -28836 -41583 -40641 -29836 -19219 -7321 -3124 5368 386
16444C86M282J5120n334k3284j2870k799J4092O141n602J706L609N432j544M068
$$ 386 4668 19788 14454 -8830 -21700 -24499 -10407 -4266 -9868 -8162 -4553 879 -665 3403
16430C403J9071L981p647l732p232J838j0541k0027j4685R535j1283p918L10Q594
$$ 3403 22474 26455 18808 15076 7844 9682 -859 -20886 -35571 -26036 -37319 -45237 -44927 -36333
16416c6333K2871J3719p157N674O380L353o787N533l62j163k3032r621R940K5542
$$ -36333 -13462 257 -6900 -1226 5154 8507 1720 7253 6891 5728 -17304 -26925 -16985 8557
16402H557Q730j350l70j2718k809n800r84J5021J071n227J118l23o193J584k70
$$ 8557 17287 15937 15567 2849 40 -5760 -6744 8277 9348 4121 5239 4916 -1277 307 37
16387C7j9291L503J0145K575m082N645k785j98Q817j0678k2801N437K424J0516
$$ 37 -19254 -15751 -5606 -3031 -7113 -1468 -4253 -4451 4366 -6312 -29113 -23676 -21252 -10736
16373a0736o498k390J8911R797j104j1502q015n333J5302J2263j324m324N327
$$ -10736 -17234 -19624 -713 9084 7980 -3522 -11537 -16870 -1568 10695 9371 5047 10374
16360A0374O424l020m681L838J4077L823j7081j0008L866J3096k16j3861m706
$$ 10374 16798 13778 9097 12935 27012 30835 13754 3746 7612 20708 20492 6631 1925
16347A925M176o86j1725o235K126R589N704j9315r782K2470J7421q187o096J077
$$ 1925 6101 5415 -6310 -12545 -10419 -830 4874 -14441 -24223 -1753 15668 7481 1385 2462
16333B462K027P779j2023j675m654J6518j145K793K637j5647k883M038o855O590
$$ 2462 4489 12268 245 -1430 -6084 10434 9289 12082 14719 -928 -3811 227 -6628 -38
16319c8k28J791L894O20j3667n861l294J0012o792r420N960M874r90l489J1721
$$ -38 -266 1525 5419 6039 -7628 -13489 -16783 -6771 -13563 -22983 -17023 -12149 -13139 -16628 -4907
16304d907N647m844K004Q881o465l864o925P947q433j3571j69Q696N136O573O264
$$ -4907 740 -4104 -2100 6781 316 -3548 -10473 -2526 -10959 -24530 -24699 -16003 -10867 -4294 1970
16289A970p653n459r697L548L162N179R975O248Q867J215j0559J1401r78j0482
$$ 1970 -5683 -11142 -20839 -17291 -14129 -8950 1025 7273 16140 17355 6796 18197 17219 6737
16275F737J4178j2389j6690L221m23n247o655m478R258N595k0249m089n878J6401
$$ 6737 20915 8526 -8164 -4943 -5366 -10613 -17268 -21746 -12488 -6893 -27142 -31231 -37109 -20708
16261b0708O930n174o5L567P649p080j2207n153J3759J0140R956l040J948j253
$$ -20708 -13778 -18952 -19017 -15450 -7801 -14881 -27088 -32241 -18482 -8342 1614 -1426 522 -731
16247g31O02K834p285r479M247p772n42P200n970j681R022J069J6870r787p549
$$ -731 -129 2705 -4580 -14059 -9812 -17584 -18126 -10926 -16896 -18577 -9555 -8486 8384 -1403 -8952
16232h952r902j3981q770P327J5093L046O270K051j126R916j0220j1004q624J3802
$$ -8952 -18854 -32835 -41605 -34278 -19185 -16139 -9869 -7818 -8944 972 -9248 -20252 -28876 -15074
16218a5074J2084J1125j3678K035J0234o174k573r605n588l111J8643n070J132
$$ -15074 -2990 8135 -5543 -3508 6726 552 -2021 -11626 -17214 -20325 -1682 -6752 -5620
16205e620j2449Q285Q007m903k2651J0262K2632m706o147N356J215J0887L34l353
$$ -5620 -18069 -9784 -1777 -6680 -29331 -19069 3563 -1143 -7290 -1934 -719 10168 10502 7149
16191G149j8931o436P97j0355J862P148L677Q62P314J7072P846j5568k676l758
$$ 7149 -11782 -18218 -17421 -27776 -25914 -18766 -15089 -14227 -6913 10159 18005 2437 -239 -3997
16177c997O147K1234q09n250N67K42q120j0333j2909r248J4684j243m219o370
$$ -3997 2150 23384 22575 17325 17892 18134 10014 -319 -13228 -22476 -7792 -9035 -13254 -19624
16163a9624K1886J4378r873Q952M673j9444j9058p380m438LQ338P4j2371O704
$$ -19624 2262 16640 6767 15719 20392 948 -18110 -25490 -29928 -29925 -21587 -21513 -33884 -27180
16149b7180k63J2392J1695P585l019j2531L59o07Q838J2889L869n956j3617K897
$$ -27180 -27443 -15051 -3356 4229 1210 -11321 -10962 -11569 -2731 10158 14027 8071 -5546 -2649
16135b649m535O042r77J416p315m076J3340N19n478J438j8743r066K0833J7856
$$ -2649 -7184 -1142 -2119 -703 -8018 -12094 1246 1765 -3713 -2275 -21018 -30084 -9251 8605
16121H605q140k4541j1351J0656P881J1463k253j6632J983J3642O238N457n290
$$ 8605 465 -24076 -35427 -24771 -16890 -5427 -7680 -24312 -22329 -8687 -2449 3008 -2282
16108b282m405k610J303J1876j1183K450J4939j870m030j124j5372l999K516N907
$$ -2282 -6687 -9297 -7994 3882 -7301 -4851 10088 8218 4188 3064 -12308 -16307 -13791 -7884
16094g884R06N687Q224k285j2446L987m14J3069j230j2946M687R51j3678o164
$$ -7884 -6978 -1291 6933 4648 -7798 -3811 -4225 8844 7614 -5332 -645 306 -13372 -19536
16080a9536p516M095Q871J2308P440M047k55j2430r320m457l342O376J8217K3366
$$ -19536 -27052 -22957 -14086 -1778 5662 9709 9454 -2976 -12296 -16753 -20095 -13719 4498 27864
16066B7864O172j4175j7327j3292n605Q209J752j8873l84p283K382J0565L334
$$ 27864 34036 19861 2534 -10758 -16363 -8154 -6402 -25275 -25659 -32942 -30560 -19995 -16661
16053a6661q347k198O465M293r846J21j182J5311J9782J7146O799j8871j6046
$$ -16661 -25008 -27206 -20741 -16448 -26294 -26173 -27355 -12044 7738 24884 31683 12812 -3234
16040c234n383k514k146J3727P090R639J018K588o38k867o713N170r114j1736
$$ -3234 -8617 -11131 -13277 450 7540 17179 18197 20785 20147 17280 10567 15737 6623 -5113
16026e113j0036m473j9193Q132J8367J653L440J1926r178j233J2518O098j3002
$$ -5113 -15149 -19622 -38815 -30683 -12316 -10663 -7223 4703 -4475 -5708 6810 12908 -94
16013i4K361O88p836j87P564M727p706O21M556j0786O913K3315P608p408j224
$$ -94 2267 2955 -4881 -5068 2496 7223 -483 138 4694 -6092 821 24136 31744 24336 23112
15998B3112n827r462J2989q67j0145j08M954j2428j418J3091J171k0340K50O921
$$ 23112 17285 7823 20812 19945 9800 9692 14646 2218 800 13891 15062 -5278 -5028 1893
15984A893l220q059J296J4107j6668j3692J8438J4279j1327q229Q559L391l22
$$ 1893 -1327 -9386 -8090 6017 -10651 -24343 -5905 8374 -2953 -11182 -2623 768 446
15971D46J492q351J911m918l017j343n594k628l638L790J7726m971k0013j7453
$$ 446 1938 -6413 -4502 -9420 -12437 -13780 -19374 -22002 -25640 -21850 -4124 -9095 -29108 -46561
15957d6561J5314J1197k669K964R070l049L06j1002Q350j3874j2039J8383J3177
$$ -46561 -31247 -20050 -22719 -19755 -10685 -13734 -13428 -24430 -16080 -29954 -41993 -23610 -10433
15944a0433J2785O06j2870q801J1606J1687J8281l765r236j5807J093r791k927
$$ -10433 2352 2958 -9912 -18713 -7107 4580 22861 19096 9860 -5947 -4854 -14645 -17572
15931a7572L987n290N893K854n263L031M577j1103J2356O734q705R34j2377O288
$$ -17572 -13585 -18875 -12982 -10128 -15391 -12360 -7783 -18886 -6530 204 -8501 -7567 -19944 -13656
15917a3656J0179M285j4084m963J0908K4350j0264l092l721P581J3748O027j1689
$$ -13656 -3477 808 -13276 -18239 -7331 17019 6755 3663 -58 7523 21271 27298 15609
15904A5609j4505j4366J8429J9833j2268r515k821m461k803N441Q350k99k68j5683
$$ 15609 1104 -13262 5167 25000 12732 3217 396 -4065 -6868 -1427 6923 6624 6356 -9327
15890i327n474J1478R519o413j0900J4073O933q130l503n40K0053L384r523M472
$$ -9327 -14801 -3323 6196 -217 -11117 2956 9889 1759 -1744 -2284 17769 21153 11630 16102
15876A6102J1307l552m311q060m005j3593j5695K381J4125j2379j9144Q824J8021
$$ 16102 27409 23857 19546 11486 7481 -6112 -21807 -19426 -5301 -17680 -36824 -28000 -9979
15863i979Q80p252K945m818r6J5716Q524j543j1079q726J7747L008j416k556n047
$$ -9979 -9099 -16351 -13406 -18224 -18320 -2604 5920 4377 -6702 -15428 2319 5327 3911 1355 -3692
15848c692p665j1210p783l714J8345J8254P566J5985J3141q323j0165p772j5101
$$ -3692 -11357 -22567 -30350 -34064 -15719 2535 10101 26086 39227 30904 20739 12967 -2134
15835b134l342P309K897m801j2893j99M722l843J0745L358q689j182j0590O697
$$ -2134 -5476 1833 4730 -71 -12964 -13163 -8441 -12284 -1539 1819 -6870 -8052 -18642 -11945
15821a1945J3370j61l406O194m457M553M617o989p141N278j1428J7577O736j0119
$$ -11945 1425 1264 -2142 4052 -405 4148 8765 1776 -5365 -87 -11515 6062 12798 2679
15807B679J0562P732l174m263j3133j0327M676O973q643Q721J922n485N356O426
$$ 2679 13241 20973 17799 13536 403 -9924 -5248 1725 -6918 1803 3725 -1760 3596 10022
15793A0022o077p505Q323P626L893q398P83j7857p22J5924j67q14J4260P932m093
$$ 10022 3945 -3560 4763 12389 16282 7884 8667 -9190 -9912 6012 5845 5031 19291 27223 23130
15778B3130l604j1475n122p291j7965J4892J2293L266r14o674J349q467k137J1962
$$ 23130 19526 8051 2929 -4362 -22327 -7435 4858 8124 7210 536 1885 -6582 -8719 3243
15764C243J3766k195k9418k0762K602Q457R453R70n680k975P076L050o827J3414
$$ 3243 17009 14814 -14604 -35366 -32764 -24307 -14854 -13884 -19564 -22539 -15463 -12413 -19240 -5826
15750e826J6217j5916l4190r494J8292J1822Q6K819k422j1968L990N619J3126
$$ -5826 10391 -5525 -39715 -49209 -30917 -19095 -19009 -16190 -18612 -30580 -26590 -20971 -7845
15737g845J2639M905j3378j0630N814J5120N529J3225L484r696l686n676m706
$$ -7845 4794 9699 -3679 -14309 -8495 6625 12154 25379 28863 19167 15481 9805 5099
15724E099K103K131n345j948M426J2283m28O05j1266j3221q868N337n740j3199
$$ 5099 7202 9333 3988 2040 6466 18749 18321 18926 7660 -5561 -14429 -9092 -14832 -28031
15710b8031N40o86m846q281R837k528j0330J0987K7861J8010J1082l040j664L353
$$ -28031 -27491 -28177 -33023 -41304 -31467 -33995 -44325 -33338 -5477 12533 23615 20575 18911 22264
15696B2264n845k2840r955l027J2020M037j2893J5135N044j0633j773J5335K2478
$$ 22264 16419 -6421 -16376 -19403 -7383 -3346 -16239 -1104 3940 -6693 -8466 6869 29347
15683B9347j4055n038R976j472j5517r020L078J363j2811l348M501Q620j9078
$$ 29347 15292 10254 20230 18758 3241 -5779 -2701 -1338 -14149 -17497 -12996 -4376 -23454
15670b3454q762J2837J9571k786j1775L018J7133K3760O864o984k2755j2745j846
$$ -23454 -32216 -19379 192 -2594 -14369 -11351 5782 29542 36406 29422 6667 -6078 -7924
15657g924R868j4817o370J4144J2834j371o610r920k801J1526K625j4394j7135
$$ -7924 1944 -12873 -19243 -5099 7735 6364 -246 -10166 -12967 -1441 1184 -13210 -30345
15644c0345P055K454L366n933j2872J6160M703Q953J1462p408k6018L962P234
$$ -30345 -23290 -20836 -17470 -23403 -36275 -20115 -15412 -6459 5003 -2405 -28423 -24461 -17227
15631a7227l43j0957j7207P170J5715N228J6067N169k3045k693J1002j3137k9920
$$ -17227 -17570 -28527 -45734 -38564 -22849 -17621 -1554 3615 -19430 -22123 -11121 -24258 -54178
15618e4178J1297L6971K669k016J003Q582o292j80l055k666M313j0201j603o71
$$ -54178 -42881 -5910 -3241 -5257 -4254 4328 -1964 -2144 -5199 -7865 -3552 -13753 -15356 -16027
15604a6027j0570l613M452K621r75Q48P112N249L311j067m621k587J4387K1931
$$ -16027 -26597 -30210 -25758 -23137 -24112 -23264 -16152 -10903 -7592 -8659 -13280 -15867 -1480 20451
15590B0451K71j1085j7336n158N954l562R686J1263M790q158P142J122m830P271
$$ 20451 20722 9637 -7699 -12857 -6903 -10465 -779 10484 15274 7116 14258 15380 10550 17821
15576A7821J020j5579K604q828J942N203n156p30M012J6426p435p295j0998k533
$$ 17821 18841 3262 5866 -2962 -1020 4183 -973 -1703 2309 18735 11300 4005 -6993 -9526
15562i526L276J5474j838p070q239J8399J0983j3164m605r369Q08M458J1536M115
$$ -9526 -6250 9224 7386 316 -7923 10476 21459 8295 3690 -5679 -4871 -413 11123 15238
15548A5238j1460j3270J2550J9913Q817q239j415j0165j7425J1993J3504r836
$$ 15238 3778 -9492 3058 22971 31788 23549 22134 11969 -5456 6537 20041 10205
15536A0205J125n82n026j5406k4285k83P925P120J3565j826K362m62P939J2606
$$ 10205 11330 10748 5722 -9684 -33969 -34252 -26327 -19207 -5642 -7468 -5106 -5568 2371 14977
15522A4977j361O808o609O726J9034j2344j4128p407J76J533j3374j786J1371
$$ 14977 13616 20424 13815 20541 39575 27231 13103 5696 5872 7405 -5969 -7755 3616
15509C616J5546l239o285j3497m323P279j0086m143L467L526n99m910K146J1559
$$ 3616 19162 15923 9638 -3859 -8182 -903 -10989 -15132 -11665 -8139 -8738 -13648 -11502 57
15495E7J2473K957j5774j4515K5235J8640j3069j0654p943j9095j0671J259J0372
$$ 57 12530 15487 -287 -14802 10433 29073 16004 5350 -2593 -21688 -32359 -31100 -20728
15482b0728R939J1998J4182q129m920m184r144j069l44J2055l708L046J477R9
$$ -20728 -10789 1209 15391 7262 2342 -1842 -10986 -12055 -12399 -344 -4052 -1006 471 570
15468E70R632m600r328q91k22n78n766J360j851J0401R793k82p198L484p705j0138
$$ 570 10202 5602 -3726 -4617 -4839 -5417 -11183 -9823 -11674 -1273 8520 8238 1040 4524 -3181 -13319
15452a3319m572K409j920O983J6324J5726k213J950O018k1628l790o914j2580
$$ -13319 -17891 -15482 -17402 -10419 5905 21631 19418 21368 27386 5758 1968 -4946 -17526
15439a7526p675K1581N409j4291p451J6676J3766p087O96J4002l324O785J5424
$$ -17526 -25201 -3620 1789 -12502 -19953 -3277 10489 3402 4098 18100 14776 21561 36985
15426C6985P100l334j9130j0932N87O499j4575j3083j1618K2517J9088j056n43
$$ 36985 44085 40751 21621 10689 11276 17775 3200 -9883 -21501 1016 20104 19048 18505
15413A8505q760q769o424N430N118Q701P648j1399p433j260j287L115O329N335
$$ 18505 9745 976 -5448 -18 5100 13801 21449 10050 2617 1357 70 3185 9514 14849
15399A4849L027l089k151o280N875l499j028j2624j5510l94J9684P453r862L261
$$ 14849 17876 14787 12636 6356 12231 8732 7704 -4920 -20430 -20824 -1140 6313 -3549 -288
15385b88K244j0253j0089n65j0434n453K2934O562k962m256r7l873M249P818O780
$$ -288 1956 -8297 -18386 -18951 -29385 -34838 -11904 -5342 -8304 -12560 -12657 -16530 -12281 -4463 2317
15370B317J4129N53p131m87j435j924k604L396N116m944j2933P006n540M894J289
$$ 2317 16446 16999 9868 9381 7946 6022 3418 6814 11930 6986 -5947 1059 -4481 413 1702
15355A702L92K601j8372J1183R511j15n984m30P85k910j7508L068l413M170K4682
$$ 1702 2094 4695 -13677 -2494 7017 6902 918 488 1273 -1637 -19145 -16077 -19490 -15320 9362
15340I362p389j070p684j4110P578n64l092q565Q638n11K30L730k338q383J5606
$$ 9362 1973 903 -6781 -20891 -13313 -13877 -16969 -25534 -16896 -17407 -17177 -13447 -15785 -24168 -8562
15325h562Q443J2178Q423p688j0700o406m512L57K985O703r201K818M914p316
$$ -8562 -119 12059 20482 12794 2094 -4312 -8824 -8467 -5482 1221 -7980 -5162 -248 -7564
15311g564m287K369r632r54J4662O854K194M146m09P11m656l487r538K414k517
$$ -7564 -11851 -9482 -19114 -20068 -5406 1448 3642 7788 7379 8090 3434 -53 -9591 -7177 -9694
15296i694O807Q162j0566J766J5113O268J84j9679j0648j7895n046O717J9402
$$ -9694 -2887 5275 -5291 -3525 11588 17856 18040 -1639 -12287 -30182 -35228 -28511 -9109
15283i109K726k37n851J2212J2949o929p438j2624N883q215j0109O220N043o703
$$ -9109 -6383 -6620 -12471 -259 12690 5761 -1677 -14301 -8418 -16633 -26742 -20522 -15479 -22182
15269b2182q399J4175J0501m968O149j987j0564j549O513J2133m438J0887M025
$$ -22182 -30581 -16406 -5905 -10873 -4724 -6711 -17275 -18824 -12311 -178 -4616 6271 10296
15256A0296k110J8178j9082r175M321L503M053J397k340p819j4223o544Q922o0
$$ 10296 8186 26364 7282 -1893 2428 5931 9984 11381 9041 1222 -13001 -19545 -10623 -10683
15242a0683N109k1711o271R675J846K200K2215N144j240j0142j5214M528O545
$$ -10683 -5574 -27285 -33556 -23881 -22035 -19835 2380 7524 6284 -3858 -19072 -14544 -7999
15229g999Q054l594j7579N989K0294o833K045Q506j866j4470j0401J760o386J7637
$$ -7999 55 -3539 -21118 -15129 5165 -1668 377 8883 7017 -7453 -17854 -16094 -22480 -4843
15215d843J8364n384n655N396n70Q46P756O062J954q70k32j2819j1961j0790J496
$$ -4843 13521 8137 2482 7878 7308 8154 15910 21972 23926 23056 22824 10005 -1956 -12746 -11250
15200a1250J8160P671n215j767L934m991J936l919q362p192K3311K4760j7957
$$ -11250 6910 14581 9366 7599 11533 6542 8478 4559 -3803 -10995 12316 37076 19119
15187A9119j0946n122m966j530J690Q916j3593r104O268J2895o213O547j397N822
$$ 19119 8173 3051 -1915 -3445 -1755 7161 -6432 -15536 -9268 3627 -2586 3961 2564 8386
15173H386j883l446j5879o460J6679O459n649j3355Q562K519L652J8198j05j7235
$$ 8386 6503 3057 -12822 -19282 -2603 3856 -1793 -15148 -6586 -4067 -415 17783 17678 443
15159D43j2538P940l346m080K588J153J2279r228j2712r09J3094J0990j414j4059
$$ 443 -12095 -4155 -7501 -11581 -8993 -7840 4439 -4789 -17501 -18410 -5316 5674 4260 -9799
15145i799o897P919J3183O092j66P497J1751r055n901J1598K039k4087j2509O706
$$ -9799 -16696 -8777 4406 10498 10332 17829 29580 20525 14624 26222 28261 4174 -8335 -1629
15131a629J6350J270Q283q585k3931l505k963P759N555j0697m910K070J0995K0794
$$ -1629 14721 15991 24274 15689 -8242 -11747 -14710 -6951 -1396 -12093 -17003 -14933 -3938 16856
15117A6856J720R968l88j1711q857M442Q867j4958j0312l245j0448n958K0747
$$ 16856 18576 28544 28156 16445 7588 12030 20897 5939 -4373 -7618 -18066 -24024 -3277
15104c277L327n474l115N145J6629Q87o564o518L889n415J841J1087r220L623
$$ -3277 50 -5424 -8539 -3394 13235 14122 7558 1040 4929 -486 1355 12442 3222 6845
15090F845m862m491k927N900Q003l580K404r154n407P79L171m046p288L015J4664
$$ 6845 1983 -2508 -5435 465 8468 4888 7292 -1862 -7269 -6490 -3319 -7365 -14653 -11638 3026
15075C026l529j1946K862J2062O433k2486o852m200J3025J081O233M508j1107
$$ 3026 -503 -12449 -9587 2475 8908 -13578 -20430 -24630 -11605 -10524 -4291 217 -10890
15062a0890Q9J3102K172P909O481j1480k1876o393J2609n79m788j2037j2431Q613
$$ -10890 -10801 2301 4473 12382 18863 7383 -14493 -20886 -8277 -8856 -13644 -25681 -38112 -29499
15048b9499J8737l87J8896o156j3978M523N957l307M425J597M109l199R96j826
$$ -29499 -10762 -11149 7747 1591 -12387 -7864 -1907 -5214 -789 808 4917 1718 2714 888
15034H88R466N352P315L449L465j3610J2899p656j8873j1080R238R407N531P235
$$ 888 10354 15706 23021 26470 29935 16325 29224 21568 2695 -8385 853 10260 15791 23026
15020B3026q052k0626j176p485j519k343J5970l267o093R74Q994k321N298J1703
$$ 23026 14974 -5652 -6828 -14313 -15832 -18175 -2205 -5472 -11565 -10591 -1597 -3918 1380 13083
15006A3083l672o643j2549N850M060M461R377P98l28l728l293j168n243j5315
$$ 13083 9411 2768 -9781 -3931 129 4590 13967 14765 14437 10709 7416 6248 1005 -14310
14992a4310m349J2284J0284O242O944j1040k7923K287M86j866M853Q034L604O832
$$ -14310 -18659 -6375 3909 10151 17095 6055 -21868 -19581 -19095 -20961 -16108 -8074 -4470 2362
14978B362j0242P344k200p071m981J731K0915L344P313P045q100k7250o778J2153
$$ 2362 -7880 -536 -2736 -9807 -14788 -13057 7858 11202 18515 25560 17460 -9790 -16568 -4415
14964d415Q118L910k962n379n963J2700q289N324J580Q132k694j0545m828j1197
$$ -4415 3703 7613 4651 -728 -6691 6009 -2280 3044 4624 12756 10062 -483 -5311 -16508
14950a6508n53J4362N20N087p030r060N494K0765Q862K277o545p26Q696j0642
$$ -16508 -17061 -2699 -2179 2908 -4122 -13182 -7688 13077 21939 24216 17671 16945 25641 14999
14936A4999k5539j0209P939L348q072O223J5829J103l123K061m137j5987j5319
$$ 14999 -10540 -20749 -12810 -9462 -17534 -11311 4518 5621 2498 4559 422 -15565 -30884
14923c0884J12J3533R584n791J822J814P021J4187J207m859j7143L450K516L312
$$ -30884 -30772 -17239 -7655 -13446 -11624 -9810 -2789 11398 12605 7746 -9397 -5947 -3431 -119
14909a19J75o885j0121m934Q512J701J6012N329q104m641j0080m969P510J0048
$$ -119 56 -6829 -16950 -21884 -13372 -11671 4341 9670 1566 -3075 -13155 -18124 -10614 -566
14895e66J9049K885P587k4j4726K283N657j5256m213m835r328n909l522M437K2750
$$ -566 18483 21368 28955 28931 14205 16488 22145 6889 2676 -2159 -11487 -17396 -20918 -16481 6269
14880F269J1206K948n56k8109J1489J4289j5702l984M937N667q951j2544j667
$$ 6269 17475 20423 19867 -8242 3247 17536 1834 -2150 2787 8454 -497 -13041 -14708
14867a4708J6550P474M809j0313r722L989j071o343M725P008R50j5108n70K116
$$ -14708 1842 9316 14125 3812 -5910 -1921 -2992 -9335 -4610 2398 3348 -11760 -12330 -10214
14853a0214m882J016j3472l555p975J0181J337j1867R764k197J811P845k649J3302
$$ -10214 -15096 -14080 -27552 -31107 -39082 -28901 -27564 -39431 -29667 -31864 -30053 -22208 -24857 -11555
14839a1555l198k657J1403Q699p98l514J5491p382m25J52m047m931L563K252R290
$$ -11555 -14753 -17410 -6007 2692 1894 -1620 13871 6489 6064 6216 2169 -2762 801 3053 12343
14824A2343O023o529r151O893n025m990L137J768l157j632o260K698q003J626
$$ 12343 18366 11837 2686 9579 4554 -436 2701 4469 1312 -320 -6580 -3882 -11885 -10259
14810a0259K323p356R669L046j0285j2007r8M338J8701J2701l046n778L273J0833
$$ -10259 -7936 -15292 -5623 -2577 -12862 -24869 -24967 -20629 -1928 10773 7727 1949 5222 16055
14796A6055K392n049p320N83l246p531n01r473j188O613J0822J7070o502n082
$$ 16055 18447 13398 6078 6661 3415 -4116 -4617 -14090 -15278 -8665 2157 19227 12725 7643
14782G643L943L761m593n719k821M566O059n430R11l654q391K617p037K98M462
$$ 7643 11586 15347 10754 5035 2214 6780 12839 7409 8320 4666 -3725 -1108 -8145 -7847 -3385
14767c385k351J617N713N132j7679J622K76j720N402J4157J8648P362j9r111n669
$$ -3385 -5736 -4119 1594 6726 -10953 -9331 -9055 -10775 -5373 8784 27432 34794 34775 25664 19995
14752A9995r943m643O706j7215K960l676k306j341Q941R348M132J5j192j0347
$$ 19995 10052 5409 12115 -5100 -2140 -5816 -8122 -9463 -522 8826 12958 12973 11781 1434
14738A434j6383q117j225J2680Q971j474O979j728N714m215l959m700n843k089
$$ 1434 -14949 -23066 -24291 -11611 -2640 -4114 2865 1137 6851 2636 -1323 -6023 -11866 -13955
14724a3955P678O654P814R457o260r689R004J6600j2611j6785k766j2756K180
$$ -13955 -6277 377 8191 17648 11388 1699 10703 27303 14692 -2093 -4859 -17615 -15435
14711a5435J6159J9232L434j021J4007j4417j5618q602j3163j697J4566N78j663
$$ -15435 724 19956 23390 22369 36376 21959 6341 -2261 -15424 -17121 -2555 -1977 -3640
14698c640j3780J274Q031r61l35K989M489o96o468J0265j0877j688Q498R525j0716
$$ -3640 -17420 -16146 -8115 -9076 -9411 -6422 -1933 -2629 -9097 1168 -9709 -11397 -2899 6626 -4090
14683d090n01r821o80O709L203p233M002J6562n193n426J150M574j90o533k25
$$ -4090 -4591 -14412 -15092 -8383 -5180 -12413 -8411 8151 2958 -2468 -1318 3256 3066 -3467 -3692
14668c692N86l080J6079q44q200J857l171l369K212K688K218L3500R235j3327
$$ -3692 -3106 -6186 9893 9049 849 2706 -465 -3834 -1622 1066 3284 36784 46019 32692
14654C2692j9513R34j0837j677m496p06o856j286Q858P169J4525j1487n724R466
$$ 32692 13179 14113 3276 1599 -2897 -3603 -10459 -11745 -2887 4282 18807 7320 1596 11062
14640A1062J3871N494m676j4325j2328j1428P210K350L662L045q206m13N161q618
$$ 11062 24933 30427 25751 11426 -902 -12330 -5120 -2770 892 3937 -4269 -4682 479 -8139
14626h139q812o698K1426J6598o272j302R019J4665N005k2592l0923k000L454
$$ -8139 -16951 -23649 -2223 14375 8103 6801 15820 30485 35490 12898 -18025 -20025 -16571
14613a6571Q407J4845Q853r433j7510l444j322K896K0413J963j5048k993o165
$$ -16571 -8164 6681 15534 6101 -11409 -14853 -16175 -13279 7134 9097 -5951 -8944 -15109
14600a5109R192J8459O068j3815n939l154r577j1672q901M689K966O47O985N383
$$ -15109 -5917 12542 18610 4795 -1144 -4298 -13875 -25547 -34448 -29759 -26793 -26146 -19161 -13778
14586a3778N997R371J2988j2112k1819K431J5703P068N827O111r863O277k446
$$ -13778 -7781 1590 14578 2466 -19353 -16922 -1219 5849 11676 17787 7924 14201 11755
14573A1755J1529J0595j0655r024n776p825j244J5025N241J043k535j964k408
$$ 11755 23284 33879 23224 14200 8424 599 -645 14380 19621 20664 18129 16165 13757
14560A3757j7413j1755J171K787J2671P813J105O342Q603j7091N115J269R955
$$ 13757 -3656 -15411 -14240 -11453 1218 9031 10136 16478 25081 7990 13105 14374 24329
14547B4329p019j0646p25J1736j0439L894K1999J0945j7911j1891J6236L692j9445
$$ 24329 17310 6664 5939 17675 7236 11130 33129 44074 26163 14272 30508 34200 14755
14534A4755L617P276p094L265M607m525j7693j8657R049j818j647L932o763r226
$$ 14755 18372 25648 18554 21819 26426 21901 4208 -14449 -5400 -7218 -8865 -4933 -11696 -20922
14520b0922q152P314J8369J2959n351r182m306p146L176l438L367k269J758m882
$$ -20922 -29074 -21760 -3391 9568 4217 -4965 -9271 -16417 -13241 -16679 -13312 -15581 -13823 -18705
14506a8705J2699J9690K345j6526l200Q409L009m869M085L756l240m309L828J641
$$ -18705 -6006 13684 16029 -497 -3697 4712 7721 2852 6937 10693 7453 3144 6972 8613
14492H613k298j945J3921N473m840j3185j6732l457J666k475J0503P143J815q060
$$ 8613 6315 4370 18291 23764 18924 5739 -10993 -14450 -12784 -15259 -4756 2387 4202 -3858
14478c858j2370M701J2465j169j3730L839L331L014R83l703J0799n138j0967p318
$$ -3858 -16228 -11527 938 -231 -13961 -10122 -6791 -3777 -2794 -6497 4302 -836 -11803 -19121
14464a9121L337Q343l639n068J4241P992M11N817m995j1651l96N250j798o548
$$ -19121 -15784 -7441 -11080 -16148 -1907 6085 6496 12313 7318 -4333 -4729 521 -1277 -7825
14450g825P159J473j2211o642J3602L063J2611K727N146j301J315o4M152M747
$$ -7825 -666 807 -11404 -18046 -4444 -1381 11230 13957 19103 17802 19117 19053 23205 27952
14436B7952j4510j4979n147o515j2176L442J1730R226o149j5412m430J1432J9331
$$ 27952 13442 -1537 -6684 -13199 -25375 -21933 -10203 -977 -7126 -22538 -26968 -15536 3795
14423C795r835N530J3015K719j4111l3767j2408K0013L1955q076k5071r756J6708
$$ 3795 -6040 -510 12505 15224 1113 -32654 -45062 -25049 6906 -1170 -26241 -35997 -19289
14410a9289J5963p14m681J1915L173o931p474J2435o446l626L434j581K526J439
$$ -19289 -3326 -4040 -8721 3194 6367 -564 -8038 4397 -2049 -5675 -2241 -3822 -1296 143
14396A43n642O980N002k0951N475l76J920k13M879k244o771L30O97P743J0118
$$ 143 -5499 1481 6483 -14468 -8993 -9369 -7449 -7662 -2783 -5027 -11798 -11468 -10771 -3028 7090
14381G090m325k987k451J5002p600j6971Q360J236J676Q953K242m894Q111J0511
$$ 7090 2765 -222 -2673 12329 4729 -12242 -3882 -2646 -970 7983 10225 5331 13442 23953
14367B3953k4138o977q814J6474Q726m731m207k858j2126K0252K0895o022j7911
$$ 23953 -185 -7162 -15976 498 9224 4493 286 -2572 -14698 5554 26449 20427 2516
14354B516j0183p232j7681J1905J4231J0565J1105N323p774K090k983r881n19
$$ 2516 -7667 -14899 -32580 -20675 -6444 4121 15226 20549 12775 14865 11882 2001 1482
14341A482r169J4850P600j0729l360Q611L29l897n040m950p622n077J7699P840
$$ 1482 -7687 7163 14763 4034 674 9285 9614 5717 677 -4273 -11895 -16972 727 8567
14327H567l201j0050R00K0088j2448k7627r081N704O639j736N094L533P822j300
$$ 8567 5366 -4684 -3784 16304 3856 -23771 -32852 -27148 -20509 -22245 -17151 -13618 -5796 -7096
14313g096j1731J7326J4634J122j4739P856J1349P399j856p295j5531N09Q171
$$ -7096 -18827 -1501 13133 14255 -484 7372 18721 26120 24264 16969 1438 1947 10118
14300A0118M952j701k1755J028J4262N306q278J0343N610j0220M495p436p807
$$ 10118 15070 13369 -8386 -7358 6904 12210 3932 14275 19885 9665 14160 6724 -1083
14287a083n354m12j3067j043J5553K5163j0869j6792o334J9103K570j361j312
$$ -1083 -6437 -6849 -19916 -20959 -5406 19757 8888 -7904 -14238 4865 7435 6074 4762
14274D762r463n315j711N71J2362J0511l048k898L169K1308o107l905J0758j675
$$ 4762 -4701 -10016 -11727 -11156 1206 11717 8669 5771 8940 30248 24141 20236 30994 29319
14260B9319k3169j5172O53j1098j17N514l353P628J2130O185l785r585p289J56
$$ 29319 6150 -9022 -8369 -19467 -19584 -14070 -17423 -9795 2335 8520 4735 -4850 -12139 -11983
14246a1983J2850J2431K359j6714p679J8893j2744j381L434P707J8556l044O926
$$ -11983 867 13298 15657 -1057 -8736 10157 -2587 -3968 -534 7173 25729 22685 29611
14233B9611j0697j6649k264l242n766N415J4402j1491o303Q995j3275q542L656
$$ 29611 18914 2265 1 -3241 -9007 -3592 10810 -681 -6984 2011 -11264 -19806 -16150
14220a6150j6963k223K018J2010O156N031P89J0845o411m791L367J3406l04j3970
$$ -16150 -33113 -35336 -33318 -21308 -15152 -10121 -9332 1513 -4898 -9689 -6322 7084 6780 -7190
14206g190P625J1086q93j7763n633n933J1433J215p014L002n406n089O194R41
$$ -7190 435 11521 10628 -7135 -12768 -18701 -7268 -6053 -13067 -10065 -15471 -20560 -14366 -13425
14192a3425O933j1724j348K04o659q380j103O621J2197Q762K814j3468O249N698
$$ -13425 -6492 -18216 -19564 -19360 -26019 -34399 -35502 -28881 -16684 -7922 -5108 -18576 -12327 -6629
14178f629j6719j1489P152J9460k73O147K895O545r864o691J86o27M716P140r064
$$ -6629 -23348 -34837 -27685 -8225 -8498 -2351 544 7089 -2775 -9466 -9280 -9907 -5191 1949 -7115
14163g115J17J5919j208K254r879J0324K189l244R40J5477J9341j9421k7043J126
$$ -7115 -6998 8921 7713 9967 88 10412 12601 9357 10297 25774 45115 25694 -1349 -223
14149b23J6545Q274K062J785j0168r158j4219J363j0943l803M326L938J830P681
$$ -223 16322 24596 26658 28443 18275 9117 -5102 -3739 -14682 -18485 -14159 -10221 -8391 -710
14135g10o480j0581l565M053J51j1867n009J9288P26j2036K488K9970P391j8616
$$ -710 -7190 -17771 -21336 -17283 -17132 -28999 -34008 -14720 -13994 -26030 -23542 6428 13819 -4797
14121d797j5710n218J3M316J374N269J470p651M315p753J3029L717l737j3991
$$ -4797 -20507 -25725 -25712 -21396 -20022 -14753 -13283 -20934 -16619 -24372 -11343 -7626 -11363 -25354
14107b5354J373J2272L334j878K208o195j4784J524J135r59m34J649J1320J9136
$$ -25354 -23981 -11709 -8375 -10253 -8045 -14240 -29024 -27500 -26365 -27324 -27758 -26109 -14789 4347
14093D347n7p986n040J018K998q648L883N519O610J3301O990o517N824p110j8756
$$ 4347 4290 -3696 -8736 -7718 -4720 -13368 -9485 -3966 2644 15945 22935 16418 22242 15132 -3624
14078c624l868j2904L8O072N006J806R70O640r005k847J6855l005j7009j566J323
$$ -3624 -7492 -20396 -20358 -14286 -9280 -7474 -6504 136 -8869 -11716 5139 2134 -14875 -16441 -15118
14063a5118R884J623O800j701q470J063J5675N040q538j2950J4443L918k0319
$$ -15118 -5234 -3611 3189 1488 -6982 -5919 9756 14796 6258 -6692 7751 11669 -8650
14050h650j9392N689N513l222L373r651j5903l419Q178R547M55o733J0976L942
$$ -8650 -28042 -22353 -16840 -20062 -16689 -26340 -42243 -45662 -37484 -27937 -27482 -34215 -23239 -19297
14036a9297k073J122Q315O575P507q41M526k488N305K17j543l640N957q921n920
$$ -19297 -21370 -20248 -11933 -5358 2149 1308 5834 3346 8651 8868 7325 3685 9642 721 -5199
14021e199J1060M22l928j0095L975O719n726j3319J0210K880n361O13J5673N544
$$ -5199 5861 6283 2355 -7740 -3765 2954 -2772 -16091 -5881 -3001 -8362 -7749 7924 13468
14007A3468j5756o100Q591m817l86K987J2723j472j2601q90R06j1998k703M883
$$ 13468 -2288 -8388 203 -4614 -5000 -2013 10710 9238 -3363 -4253 -3347 -15345 -18048 -13165
13993a3165Q124J490q164o838r403K88J6677M964K050L66J1332R675r382p805
$$ -13165 -5041 -3551 -11715 -18553 -27956 -27668 -10991 -6027 -3977 -3611 7721 17396 8014 209
13979B09J132j2507k613l33j1001J48j39J5429j803J2619K184r461o323N571R947
$$ 209 1341 -11166 -13779 -14112 -25113 -24965 -25104 -9675 -11478 1141 3325 -6136 -12459 -6888 3059
13964C059P162J912J0689J108k0258o199j72j1425Q303l639L519O821Q070J0969
$$ 3059 10221 12133 22822 23930 3672 -2527 -2699 -14124 -5821 -9460 -5941 880 8950 19919
13950A9919N849k0047j0889L813J1285q021K443q597L547R641p956J486Q465j577
$$ 19919 25768 5721 -5168 -1355 9930 1909 4352 -4245 -698 8943 987 2473 10938 9361
13936I361j9771P35N841k762k847R632r171n248j914j7881J1845J5195n234J036
$$ 9361 -10410 -9675 -3834 -6596 -9443 189 -8982 -14230 -16144 -34025 -22180 -6985 -12219 -11183
13922a1183m128j2550l828m52J0037M631j629k09Q153R301k140R44J9875K530
$$ -11183 -15311 -27861 -31689 -32141 -22104 -17473 -19102 -19311 -11158 -1857 -3997 -3053 16822 19352
13908A9352j2885J2112k238j350j1823M522J3223o651r287p519j4227l804Q270
$$ 19352 6467 18579 16341 14991 3168 7690 20913 14262 4975 -2544 -16771 -20575 -12305
13895a2305R441J1433M067m654r289k010k136r657P098L166L938P693r006o629
$$ -12305 -2864 8569 12636 7982 -1307 -3317 -5453 -15110 -8012 -4846 -908 6785 -2221 -8850
13881h850M567q064n315M459J0843J73M449P549J2299k1405k130O44K500J2551
$$ -8850 -4283 -12347 -17662 -13203 -2360 -2187 2262 9811 22110 705 -1425 -781 1719 14270
13867A4270M149J00p552p227Q657o226j6397l348k044L28q270M800J2161N676
$$ 14270 18419 18519 10967 3740 12397 6171 -10226 -13574 -15618 -15290 -23560 -18760 -6599 -923
13853i23Q051j1690k6354L558J9758q25Q752J3461N70p602K961J171m62R818n573
$$ -923 7128 -4562 -30916 -27358 -7600 -8425 327 13788 14358 6756 9717 10888 10426 20244 14671
13838A4671j8439m391J481J523M268O38N574R041l934j5407K91J1919M260j1208
$$ 14671 -3768 -8159 -6678 -5155 -887 -249 5325 14366 10432 -4975 -4684 7235 11495 287
13824B87r477J5503O199k474q677p588J0677J026r521L872J7172j0366j0855Q142
$$ 287 -9190 6313 12512 10038 1361 -6227 4450 5476 -4045 -173 16999 6633 -4222 3920
13810C920q930q691J0731M782j91k2941j1386P495j149L995m9J895M877J268K632
$$ 3920 -5010 -13701 -2970 1812 1621 -21320 -32706 -25211 -26360 -22365 -22414 -20519 -15642 -14374 -11742
13795a1742L3O410M966J3624K420j8620j5746P706L19j0257l629P069l815Q578
$$ -11742 -11709 -5299 -333 13291 15711 -2909 -18655 -10949 -10630 -20887 -24516 -17447 -21262 -12684
13781a2684J0799j1474l731r27J2599K4285j123r066k791K3251K255p024j2555
$$ -12684 -1885 -13359 -17090 -18017 -5418 18867 17744 8678 5887 29138 31393 24369 11814
13768A1814p286j352n321k407L349O752J2015J0317N74l977o237j7902j1375j070
$$ 11814 4528 3176 -2145 -4552 -1203 5549 17564 27881 28455 24478 18241 339 -11036 -12106
13754a2106R126J741O070j4128j3975J2192J2780j1803m910M878m665K114K857
$$ -12106 -2980 -1239 4831 -9297 -23272 -11080 1700 -10103 -15013 -10135 -14800 -12686 -9829
13741i829r81L973l184o203r868k872Q301J4812J6890L381n422r658K381J1868
$$ -9829 -10810 -6837 -10021 -16224 -26092 -28964 -20663 -5851 11039 14420 8998 -660 1721 13589
13727A3589j409l089k505n816l72K373M339r126j2290r082J4801k291j5034q278
$$ 13589 12180 9091 6586 770 398 2771 7110 -2016 -14306 -23388 -8587 -10878 -25912 -34190
13713c4190J4435K752o7l243J4354J0340J3838O028p572K754r22J2533q9J045
$$ -34190 -19755 -17003 -17070 -20313 -5959 4381 18219 24247 16675 19429 18507 31040 30951 31996
13699C1996q591j7893o42r40P141j977K788J147J466o651m261L411J3924n333
$$ 31996 23405 5512 4870 3930 11071 9094 11882 13029 14495 7844 3583 6994 20918 15585
13685A5585O431J1468j1859k1702q60O240r027j1274j2338K715J6004m193q773
$$ 15585 22016 33484 21625 -77 -937 5303 -3724 -14998 -27336 -24621 -8617 -12810 -21583
13672b1583n521R410J0990J5901J517K045j075o263R130j3742Q862j2062K344
$$ -21583 -27104 -17694 -6704 9197 10714 12759 11684 5421 14551 809 9671 -2391 -47
13659d7O544n293R702P25o968j0979P408k059O93O250j2682q235O735P433K831
$$ -47 6497 1204 10906 11631 4663 -6316 1092 -967 -274 5976 -6706 -14941 -8206 -773 2058
13644B058m113J1501m070q025m082k625l130j530q602k049L242m256J3972q17
$$ 2058 -2055 9446 5376 -2649 -6731 -9356 -12486 -14016 -22618 -24667 -21425 -25681 -11709 -12526
13630a2526p522n38J0338M444j533k350M467J053N588l799N117J304L687Q875
$$ -12526 -20048 -20586 -10248 -5804 -7337 -9687 -5220 -4167 1421 -2378 2739 4043 7730 16605
13616A6605k537q703j8486m663R650J2421L663k3739M103J3805K0554N928j2398
$$ 16605 14068 5365 -13121 -17784 -8134 4287 7950 -15789 -11686 2119 22673 28601 16203
13603A6203j4905L094O669N309o557j0590n643J2450J2215m292j533p518j4293
$$ 16203 1298 4392 11061 16370 9813 -777 -6420 6030 18245 13953 12420 4902 -9391
13590i391m26R773M053j494k324r30K0098J7054j625l870M095j7537j5091p049
$$ -9391 -9817 -44 4009 2515 191 -739 19359 36413 34788 30918 35013 17476 2385 -4664
13576d664P359N429J5574P215N236j4209J129m898N466Q42n623p232j725k667
$$ -4664 2695 8124 23698 30913 36149 21940 23069 18171 23637 24479 18856 11624 9899 7232
13562G232j5615R254j276o06k790j1944J0011j1235M415P244q1o90J5142K0441
$$ 7232 -8383 871 -405 -1011 -3801 -15745 -5734 -16969 -12554 -5310 -5391 -6081 9061 29502
13548B9502o887l4906q925J5472K613J558l303K072M328j0276Q040R884j848q526
$$ 29502 22615 -12291 -21216 -5744 -3131 -1573 -4876 -2804 1524 -8752 -712 9172 7324 -1202
13534a202R606J7724O519j7421p048r872k10J1599J088p966q881l057j143N359
$$ -1202 8404 26128 32647 15226 8178 -1694 -1904 9695 10783 2817 -6064 -9121 -10264 -4905
13520d905j427j049p945Q451N977M299o994j367j4434M62J5109J56K648J3075
$$ -4905 -6332 -7381 -15326 -6875 -898 3401 -3593 -4960 -19394 -18932 -3823 -3667 -1019 12056
13506A2056J0439J743p282r246j5521j7323R864J608p787M409Q189k414j2J036
$$ 12056 22495 24238 16956 7710 -7811 -25134 -15270 -13662 -21449 -17040 -8851 -11265 -11277 -10241
13492a0241N263J3321M57j3848j8224J603K4645N281j4671j767Q780M679o878
$$ -10241 -4978 8343 8800 -5048 -23272 -21669 2976 8257 -6414 -8181 599 5278 -1600
13479a600k117P289m94j0443k474N604L345N5L567M584L292O191p785o485n032
$$ -1600 -3717 3572 3078 -7365 -9839 -4235 -890 -835 2732 7316 10608 16799 9014 2529 -2503
13464b503Q036J904j5409q532J5703P913M389N760j600M050k805K973o402j6514
$$ -2503 5533 7437 -7972 -16504 -801 7112 11501 17261 15661 19711 16906 19879 13477 -3037
13450c037j4960j845L850J432J4953Q043l765J966N351j562l131k555J2801J4943
$$ -3037 -17997 -19842 -15992 -14560 393 8436 4671 6637 11988 10426 7295 4740 17541 32484
13436C2484l05n707m924j0530N221k781N057k781j8500j0393M647o6j3475L559
$$ 32484 32179 26472 21548 11018 16239 13458 18515 15734 -2766 -13159 -8512 -8578 -22053 -18494
13422a8494P805l236m85K375j0116M864O407K932r147M478J829J464J1734k716
$$ -18494 -10689 -13925 -14410 -12035 -22151 -17287 -10880 -7948 -17095 -12617 -10788 -9324 2410 -306
13408c06k835R95n882J648l870M800l959k2525k882p05P162L0243J7747j265o585
$$ -306 -3141 -2146 -8028 -6380 -10250 -5450 -9409 -31934 -34816 -35521 -28359 1884 19631 18366 11781
13393A1781r651j0968J550K546K299n950J9576J4409j1862j2004o407O973J2324
$$ 11781 2130 -8838 -7288 -4742 -2443 -8393 11183 25592 13730 1726 -4681 2292 14616
13380A4616q010r284J2029j0289p543J981K864J948Q518j1885j0331j2558K464
$$ 14616 6606 -2678 9351 -938 -8481 -6500 -3636 -1688 6830 -5055 -15386 -27944 -25480
13367b5480L942o354J6780m550k635J4489J9421M072j7917j1498J873k744l65
$$ -25480 -21538 -27892 -11112 -15662 -18297 -3808 15613 19685 1768 -9730 -7857 -10601 -10966
13354a0966m436K325N110P954N829M569J8541L695m234q291O75J625k6683J3021
$$ -10966 -15402 -13077 -7967 -13 5816 10385 28926 32621 28387 20096 20771 22396 -4287 8734
13340H734J2566j219j7619m950Q375J0395M115k515j739P95J0502j657j2161q019
$$ 8734 21300 20081 2462 -2488 5887 16282 20397 17882 16143 16938 27440 25783 13622 5603
13326E603J2704J3888K238N826L852j9492j0796J915n602j3455Q752O867j1369
$$ 5603 18307 32195 34433 40259 44111 24619 13823 15738 10136 -3319 5433 12300 931
13313I31j3400q358n598j777J4404K0076j99l349M377n513Nj146p644R90N066
$$ 931 -12469 -20827 -26425 -28202 -13798 6278 6079 2730 7107 1594 1599 453 -7191 -6201 -1135
13298a135k663k303l081Q010n278j3083p174J4314J6745J7339q538n303Q25o022
$$ -1135 -3798 -6101 -9182 -1172 -6450 -19533 -26707 -12393 4352 21691 13153 7850 8675 2653
13284B653o841N920O734k0216n545J544R615r007j1114k359K5416J5060P091n312
$$ 2653 -4188 1732 8466 -11750 -17295 -15751 -6136 -15143 -26257 -28616 -3200 11860 18951 13639
13270A3639j3895n920O310m430o901J61J0740Q671m322p429r782j440j5018J04
$$ 13639 -256 -6176 134 -4296 -11197 -11036 -296 8375 4053 -3376 -13158 -14598 -29616 -29512
13256b9512J5605J1527m510J7634o809k997M574M520j0969p766J286j004N971
$$ -29512 -13907 -2380 -6890 10744 3935 938 5512 10032 -937 -8703 -7417 -8421 -2450
13243b450N439N200O812P246j0984l102J404r064q860p738R901N301r966j56n813
$$ -2450 2989 8189 15001 22247 11263 8161 9565 501 -8359 -16097 -6196 -895 -10861 -11017 -16830
13228a6830O744J3140J0057Q074r53j619K294j1828k0819K24J4650M080J028K62
$$ -16830 -10086 3054 13111 21185 20232 18613 20907 9079 -11740 -11516 3134 7214 8242 8504
13214H504j1355o168J0205n0j4443K525J983M929j232J607o692N210J613L655
$$ 8504 -2851 -9019 1186 1136 -13307 -10782 -8799 -3870 -5102 -3495 -10187 -4977 -3364 291
13200B91m964J0440k806R419R285j085k3394k864P620l893m56O360O657j0250
$$ 291 -4673 5767 2961 12380 21665 20580 -2814 -5678 1942 -1951 -2407 3953 10610 360
13186C60k745l571R924M582k575N204k53r606n10l492j791L474L433J1793o37
$$ 360 -2385 -5956 3968 8550 5975 11179 10926 1320 810 -2682 -4473 -999 2434 14227 13590
13171A3590J6639Q586j63j9244p743O504n538q962J2029M038j2755J414o850p637
$$ 13590 30229 38815 38652 19408 11665 18169 12631 3669 15698 19736 6981 8395 1545 -6092
13157f092J4553j3740l894P812k577l557J2410k69j953n813N6R537J2337K121
$$ -6092 8461 -5279 -9173 -1361 -3938 -7495 4915 4646 2693 -3120 -3064 6473 18810 20931
13143B0931j3109K108K21k108r563N208J069n879j3736j274P742J0745Q202o350
$$ 20931 7822 9930 10151 8043 -1520 3688 4757 -1122 -14858 -16132 -8390 2355 10557 4207
13129D207p286n261R616R389L754M257n49o8j189J749m454O065r703m915k93J168
$$ 4207 -3079 -8340 1276 10665 14419 18676 18127 18059 16870 18619 14165 20230 10527 5612 5319 6487
13113F487n531K864j1980J4751R489j1195J002R16K807M384l272N665n682o01
$$ 6487 956 3820 -8160 6591 16080 4885 5887 6803 9610 13994 10722 16387 10705 10104
13099A0104o13M670K2950J1467j2434J623j5828o730o978q799J0804L29l210N221
$$ 10104 9491 14161 37111 48578 36144 37767 21939 15209 8231 -568 10236 10565 7355 12576
13085A2576P59p91L209K703q875j1240L840l123J2436j388j6129n903q177p814
$$ 12576 13335 12544 15753 18456 9581 -1659 2181 -942 11494 10106 -6023 -11926 -20103 -27917
13071b7917K527K694J1507P997k2332K727J7065J0862R408J6467m802j277Q087
$$ -27917 -25390 -22696 -11189 -3192 -25524 -22797 -5732 5130 14538 31005 26203 24926 33013
13058C3013j5487k393K599L538l457j0580J4406L416j3106J963o090o723L822
$$ 33013 17526 15133 17732 21270 17813 7233 21639 25055 11949 13912 7822 1099 4921
13045D921J2711l920j0076Q62n123j3940K59J6775R261K244M713j2474j3350J6305
$$ 4921 17632 13712 3636 4498 -625 -14565 -14306 2469 11730 13974 18687 6213 -7137 9168
13031I168J883j0696l931K608j0227j312o65M161j5010P165N787R978m13k33j653
$$ 9168 11051 355 -3576 -968 -11195 -12507 -13172 -9011 -24021 -16856 -11069 -1091 -1504 -1737 -3390
13016c390l818N867O816M844q030k019K879j1859j8645N210N888O396R943j1334
$$ -3390 -7208 -1341 5475 10319 2289 270 3149 -8710 -27355 -22145 -16257 -9861 82 -11252
13002a1252j1214R690L271M832J6876j875P210K578O999r551j1038n780J3799
$$ -11252 -22466 -12776 -9505 -4673 12203 10328 17538 20116 27115 17564 6526 746 14545
12989A4545R797J443J37K190j2244j2885j39J1138o733j1872l453K321Q713J6943
$$ 14545 24342 25785 25922 28112 15868 2983 2844 13982 7249 -4623 -8076 -5755 2958 19901
12975A9901M610j4400M266l274P696J2222m239m606P125q647m621N591k568j9427
$$ 19901 24511 10111 14377 11103 18799 31021 26782 22176 29301 20654 16033 21624 19056 -371
12961c71N050J2341Q127j855Q469o000r133j5679p369J5686J4369N706m845n888
$$ -371 4679 17020 25147 23292 31761 25761 16628 949 -6420 9266 23635 29341 24496 18608
12947A8608M172p69n270o222O401r06j753j1302k919r5j4517p266J3254J0325
$$ 18608 22780 22011 16741 10519 16920 16014 14261 2959 40 -55 -14572 -21838 -8584 1741
12933A741n411L501k997j4927N24j0029N220R992J5652J1418r876k8763P574J6434
$$ 1741 -3670 -169 -3166 -18093 -17569 -27598 -22378 -12386 3266 14684 4808 -23955 -16381 53
12919E3L045r501m305R124L781q276J3j2091P825R427m750q406J821J4042n83
$$ 53 3098 -6403 -10708 -1584 2197 -6079 -6066 -18157 -10332 -905 -5655 -14061 -12240 1802 1219
12904A219J779o377q178m496J4337K4238q479j0134p946Q922l767j5392L402J6182
$$ 1219 2998 -3379 -11557 -16053 -1716 22522 14043 3909 -4037 4885 1118 -14274 -10872 5310
12890E310R588R240J660j2305p315P070J475j3812l541K001J527j0296P19J5350
$$ 5310 14898 24138 25798 13493 6178 13248 14723 911 -2630 -629 898 -9398 -8679 6671
12876F671K2495J2639l05k73P67m678q8k0045j2523J795n54J4236m525l538R622
$$ 6671 29166 41805 41500 41227 41994 37316 37228 17183 4660 6455 5901 20137 15612 12074 21696
12861B1696k013n761P542o795j5232l388J9715j300k7699n640N593n245j995J847
$$ 21696 19683 13922 21464 14669 -563 -3951 15764 14464 -13235 -18875 -13282 -18527 -20522 -18675
12847a8675M558q33K806R626j455Q821M322j1905J3674M90O847n230k504L328
$$ -18675 -14117 -14950 -12144 -2518 -3973 4848 9170 -2735 10939 11429 18276 13046 10542 13870
12833A3870j2177J5766J1574j311j037K517L577P729k883j3475m550j1758q312
$$ 13870 1693 17459 29033 27722 26685 29202 32779 40508 37625 24150 19600 7842 -470
12820d70l912K124J6744m399n882n048j1808q623p927J5312K433r189K856Q291
$$ -470 -4382 -2258 14486 10087 4205 -843 -12651 -21274 -29201 -13889 -11456 -20645 -17789 -9498
12806i498J4665k505L548M929J783o352o669q538J5203J3522N362r860k1056j3080
$$ -9498 5167 2662 6210 11139 12922 6570 -99 -8637 6566 20088 25450 15590 -5466 -18546
12792a8546M194K492R299n429q00M5K781J2986Q796j350j3255K670M431N198N852
$$ -18546 -14352 -11860 -2561 -7990 -8790 -8745 -5964 7022 15818 14468 1213 3883 8314 13512 19364
12777A9364j312j4697l125P849J3499J4573p631j4945N586j880N113l085n679
$$ 19364 18052 3355 230 8079 21578 36151 28520 13575 19161 17281 22394 19309 13630
12764A3630J4585j4228j1523Q605J0260j3757Q894J3228j1375k2325j9717K0852
$$ 13630 28215 13987 2464 11069 21329 7572 16466 29694 18319 -4006 -23723 -2871
12752b871J4655o720q332r95p108R994K5227J7707r453j1951j1027m370j0675
$$ -2871 11784 5064 -3268 -4263 -11371 -1377 23850 41557 32104 20153 9126 4756 -5919
12739e919J0444M447q385j4219N128K6262M002m4K86K05q886q487j1819m001Q30
$$ -5919 4525 8972 587 -13632 -8504 17758 21760 21716 22002 22207 13321 4834 -6985 -10986 -10156
12724a0156Q41k75k957J3115O386r4K591j373q795K348J8596l974j7708Q731L827
$$ -10156 -9315 -9590 -12547 568 6954 6860 9451 8078 -717 1631 20227 16253 -1455 7276 11103
12709A1103M409m016k1040k3368N822Q097N38p180m238o38K700k964N694K6098
$$ 11103 15512 11496 -9544 -32912 -27090 -18993 -18455 -25635 -29873 -30511 -27811 -30775 -25081 1017
12695A017n785j990P052P627r952J0575J7300r330J878m409j1785j642J345K551
$$ 1017 -4768 -6758 294 7921 -2031 8544 25844 16514 18392 13983 2198 556 1901 4452
12681D452o046k727J4520R819n831L685k148O243o807k0219l563k113L667J2510
$$ 4452 -1594 -4321 10199 20018 14187 17872 15724 21967 15160 -5059 -8622 -10735 -7068 5442
12667E442j074P34l598J3040J1332k208k6695r712k480Q920N342m457j2532J3560
$$ 5442 4368 5102 1504 14544 25876 23668 -3027 -12739 -15219 -6299 -957 -5414 -17946 -4386
12653d386J78l362p572M790P982l801Q350R267p574n241m017q40N417J6800J779
$$ -4386 -4208 -7570 -15142 -10352 -2370 -6171 2179 11446 3872 -1369 -5386 -6226 -809 15991 17770
12638A7770n239j1871n157p065M953K5632J183q140n613q40P656k534l253n392
$$ 17770 12531 660 -4497 -11562 -6609 19023 20206 12066 6453 5613 13269 10735 7482 2090
12624B090j4070J0684R904M977Q21p847j1447Q312P403L910J6526K757m207L774
$$ 2090 -11980 -1296 8608 13585 14406 6559 -4888 3424 10827 14737 31263 34020 29813 33587
12610C3587r53j2505j6848r129m083J6502N933j4735j2585N697J3266k298j1107
$$ 33587 32634 20129 3281 -5848 -9931 6571 12504 -2231 -14816 -9119 4147 1849 -9258
12597i258M975R385O267L402k1228m914J2064P987j351k1129j0286K1263k941
$$ -9258 -4283 5102 11369 14771 -6457 -11371 693 8680 7329 -13800 -24086 -2823 -5764
12584e764j4440Q210K655k283m934q236q64J0574k194j0661J6464K6994K524j0294
$$ -5764 -20204 -11994 -9339 -11622 -16556 -24792 -25656 -15082 -17276 -27937 -11473 15521 18045 7751
12570G751n538k857r67o77N342p946J1481l199j747l516Nj0654j0015j8556J0703
$$ 7751 2213 -644 -1611 -2288 3054 -4892 6589 3390 1643 -1873 -1868 -12522 -22537 -41093 -30390
12555c0390J4816R150J6402N870q527L131o703J3556m472M239q65l139j851N886
$$ -30390 -15574 -6424 9978 15848 7321 10452 3749 17305 12833 17072 16207 13068 11217 17103
12541A7103O107n975k55K359k212j2907j4279N161n224j1909j731J8332K3120
$$ 17103 23210 17235 16980 19339 17127 4220 -10059 -4898 -10122 -22031 -23762 -5430 17690
12528A7690P931q221J592r480r39k0045j3126O197P694k789N940O218k197k492
$$ 17690 25621 17400 18992 9512 8573 -11472 -24598 -18401 -10707 -13496 -7556 -1338 -3535 -6027
12514f027J3702N788j8412p303J3333r32m675N51p07o521l593k705P333K2480
$$ -6027 7675 13463 -4949 -12252 1081 149 -4526 -3975 -4682 -11203 -14796 -17501 -10168 12312
12500A2312J3858k556q731p195j781P478q023L21J2754k441j3316K084m91N441
$$ 12312 26170 23614 14883 7688 5907 13385 5362 5683 18437 15996 2680 4764 4273 9714
12486I714j3901j5938J4284O951k150k620J1861N129r52R150K7m167k762N577
$$ 9714 -4187 -20125 -5841 1110 -1040 -3660 8201 13330 12378 21528 21555 17388 14626 20203
12472B0203P588N918j3592L835J2351n274k927Q951P703l938J214k5098j7280
$$ 20203 27791 33709 20117 23952 36303 31029 28102 37053 44756 40818 42032 16934 -346
12459c46L551N694m15o613J627J323P842R01L577o273r528Q151N161N622n555
$$ -346 3205 8899 8484 1871 3498 4821 12663 13564 17141 10868 1340 9491 14652 20274 14719
12444A4719o205j8653J598K1631L802k4566P232K736j3110m412J3651o021J1037
$$ 14719 8514 -10139 -8541 13090 16892 -7674 -442 2294 -10816 -15228 -1577 -7598 3439
12431C439Q599K086J6234j34K480L496p257r313l910O626m194j6435r028M261
$$ 3439 12038 14124 30358 30224 32704 36200 28943 19630 15720 22346 18152 1717 -7311 -3050
12417c050n048Q351J5548p008j1126M510o186L634J3016P833J0568K262n759k85
$$ -3050 -8098 253 15801 8793 -2333 2177 -4009 -375 12641 20474 31042 33304 27545 27260
12403B7260J4946j367j0096m017M117j0838l387j077m569K67j1738m374J192k0901
$$ 27260 42206 40839 30743 26726 30843 20005 16618 15541 10972 11239 -499 -4873 -3681 -24582
12389b4582j8198J0746J5076J3490M241O995m49J462P884J7248K779k0056j6192
$$ -24582 -42780 -32034 -16958 -3468 773 7768 7319 8781 16665 33913 36692 16636 444
12376D44K957J1262n213o252j1046jq3N910J4133k0325J403J4521J7435l50k4346
$$ 444 3401 14663 9450 3198 -7848 -7849 -7932 -2022 12111 -8214 -6811 7710 25145 24795 449
12361D49j0197P744k955p25J1437O680j3254O80K306r221K104O5J3558J0178J939
$$ 449 -9748 -2004 -4959 -5684 5753 12433 -821 -141 2165 -7056 -4952 -4887 8671 18849 20788
12346B0788m857L64p39J782K159r197o032k20Q765K1175J4037j2001j3818K298
$$ 20788 15931 16295 15556 17338 19497 10300 4268 4048 12813 33988 48025 36024 22206 24504
12332B4504j1588o080M646l218P191Q315p175q214j2429j2672P720L190L458O137
$$ 24504 12916 6836 11482 8264 15455 23770 16595 8381 -4048 -16720 -9000 -5810 -2352 3785
12318C785m38J0258J2655m208l76l428K533m557K483Q424R97R68m101n490j3717
$$ 3785 3347 13605 26260 22052 21676 18248 20781 16224 18707 27131 28128 29096 24995 19505 5788
12303E788L413J082L510M112k1621j0302Q647J2719Q227n739L683R831L710q346
$$ 5788 9201 10283 13793 17905 -3716 -14018 -5371 7348 15575 9836 13519 23350 27060 18714
12289A8714k161j1396j4940M075J7927J1085L611L208J063Q706M229p798j4837
$$ 18714 16553 5157 -9783 -5708 12219 23304 26915 30123 31186 39892 44121 36323 21486
12276B1486j4798l596J82N121l886J7314L632L030J2934m463j4995p222J5358
$$ 21486 6688 3092 3274 8395 4509 21823 25455 28485 41419 36956 21961 14739 30097
12263C0097J866o243j0013j1468P75M941k328J2578l757L258N473j3750o317k11
$$ 30097 31963 25720 15707 4239 5014 9955 7627 20205 16448 19706 25179 11429 5112 4901
12249D901R473J4718n843p711j3488K433j785r397n57N549Q483j5211Q000L544
$$ 4901 14374 29092 23249 15538 2050 4483 2698 -6699 -7256 -1707 6776 -8435 -435 3109
12235C109m896K416K652m377M042K593j8284j590K434n750k75N973J025N92K91
$$ 3109 -1787 629 3281 -1096 2946 5539 -12745 -14335 -11901 -17651 -17926 -11953 -10928 -10336 -10045
12220a0045J2191J0884k407o683N148J9417L515p198k325p239k474Q776n872o907
$$ -10045 2146 13030 10623 3940 9088 28505 32020 24822 22497 15258 12784 21560 15688 8781
12206H781j4962p211J4212J2646Q051O605L708j6665l431K0274J316j0269L081
$$ 8781 -6181 -13392 820 13466 21517 28122 31830 15165 11734 32008 33324 23055 26136
12193B6136q181o965q199M508J2273K242k8959j2757K023O240O788j288P304J1823
$$ 26136 17955 10990 2791 7299 19572 21814 -7145 -19902 -17879 -11639 -4851 -6139 1165 12988
12179A2988M024q231K615j609j0512L015L529P231m179L237q777n182P405K0712
$$ 12988 17012 8781 11396 9787 -725 2290 5819 13050 8871 12108 3331 -1851 5554 26266
12165B6266J4897O960K737m049n878O253N808K0330J7181k7782k0303r777j7986
$$ 26266 41163 48123 50860 46811 40933 47186 52994 73324 90505 62723 42420 32643 14657
12152A4657L326J9347j5051q545J764J376p506P951M269k110J3142J2791j5290
$$ 14657 17983 37330 22279 13734 15498 16874 9368 17319 21588 19478 32620 45411 30121
12139C0121R220J3578j4859j9940p22j537J3829n144l2084O814K3000J0894J0956
$$ 30121 39341 52919 38060 18120 17398 15861 29690 24546 -7538 -724 22276 33170 44126
12126D4126l203n657O069L2138J9815k9350k4937o695N845r271j6204p329m090
$$ 44126 40923 35266 41335 73473 93288 63938 39001 32306 38151 28880 12676 5347 1257
12113A257K3939M784j5786j4495o19J536J4963J7008J964j2916j8995n730J2203
$$ 1257 25196 29980 14194 -301 -920 616 15579 32587 34551 21635 2640 -3090 9113
12100I113J1834N576R285q697L092k152N686n682k1833p652j356Q995K3962J0176
$$ 9113 20947 26523 35808 27111 30203 28051 33737 28055 6222 -1430 -2786 6209 30171 40347
12086D0347j071j9069p400M395k198O005J2887m544K233L482J044n142L54m351
$$ 40347 39276 20207 12807 17202 15004 21009 33896 29352 31585 35067 36111 30969 31323 26972
12072B6972j0915J090R326J2422J0790q015k458m847M481j222k6727R742N751
$$ 26972 16057 17147 26473 38895 49685 41670 39212 34365 38846 37624 10897 20639 26390
12059B6390n904m648j0493j1605J3957m309j0596P099L952O323J4997P142l643
$$ 26390 20486 15838 5345 -6260 7697 3388 -7208 -109 3843 10166 25163 32305 28662
12046B8662L777N896j5018n122K076j955n443o142j0944r484P633R666j818p822
$$ 28662 32439 38335 23317 18195 20271 18316 12873 6731 -4213 -13697 -6064 3602 1784 -6038
12032f038L252J6759m5j4459J0214P471R574j4883L38j131P312Q591O671p740
$$ -6038 -2786 13973 13928 -531 9683 17154 26728 11845 12183 11052 18364 26955 33626 25886
12018B5886M250J3353N458n470p213j9434j2473R25r953p76J4374J7261K615j1127
$$ 25886 30136 43489 48947 43477 36264 16830 4357 5282 -4671 -5447 8927 26188 28803 17676
12004A7676k494J3051l200k5085q026N321m845J9409R244M423J6883j0017l916
$$ 17676 15182 28233 25033 -52 -8078 -2757 -7602 11807 21051 25474 42357 32340 28424
11991B8424j3472o02k719l858L789J1667J490N533J6572o477k8263k130M578K7491
$$ 28424 14952 14350 11631 7773 11562 23229 24719 30252 46824 40347 12084 9954 14532 42023
11977D2023O85j1290k881L183n068P500j068j4020j124J0887j5141j3362Q26R975
$$ 42023 42708 31418 28537 31720 26652 34152 33084 19064 17940 28827 13686 324 1150 11125
11963A1125o193m22K1645R724n174k1847k752O106Q089R168K940j1619m698l437
$$ 11125 4932 4510 26155 35879 30705 8858 6106 12212 20301 29469 32409 20790 16092 12655
11949A2655j641M871l612N976J0660J4573M257q876j1723j5980M384n99k909J7578
$$ 12655 11014 15885 12273 18249 28909 43482 47739 38863 27140 11160 15544 14945 12036 29614
11935B9614R63k888O08P655J959j7990m854N901L872r64l342j2941J330P716r288
$$ 29614 30577 27689 28297 35952 37911 19921 15067 20968 24840 23876 20534 7593 8923 16639 7351
11920G351j0183J4685M533r71L58K289n727l6698o411K9347J6164o054L652l486
$$ 7351 -2832 11853 16386 15415 15773 18062 12335 -24363 -30774 -1427 14737 8683 12335 8849
11906H849J0669Q095Q07j1359j3743N204J3973Q924n258O244J1385K909o46k1212
$$ 8849 19518 27613 28420 17061 3318 8522 22495 31419 26161 32405 43790 46699 46053 24841
11892B4841o378m936o356r765J9014K0935N074j5387j6677J0167M150j2316M797
$$ 24841 18463 13527 7171 -2594 16420 37355 42429 27042 10365 20532 24682 12366 17163
11879A7163K3212k907Q024q728k2044P47M421k114J1117J460j6649j0469N793
$$ 17163 40375 37468 45492 36764 14720 15467 19888 17774 28891 30351 13702 3233 9026
11866I026J3168K327l719L428J685K587K481P413L600M463L55J0191q297j1883
$$ 9026 22194 24521 20802 24230 25915 28502 30983 38396 41996 46459 46814 57005 48708 36825
11852C6825q231L606j757M356k322j52l454j992J3314r449j9900L247J4290O142
$$ 36825 28594 32200 30443 34799 32477 32325 28871 26879 40193 30744 10844 14091 28381 34523
11838C4523j580k492J2315O767j2553k203j3690o06J0200o422q371J5591m293
$$ 34523 32943 30451 42766 49533 36980 34777 21087 20481 30681 24259 15888 31479 27186
11825B7186R88m856j653j426P793l544l939O217k570p952J0371J0722K650N641
$$ 27186 28174 23318 21665 20239 28032 24488 20549 26766 24196 16244 26615 37337 39987 45628
11811D5628K440k4555j094K1213j804r446m064M606m581k259k1514m577J0180
$$ 45628 48068 23513 22419 43632 41828 32382 28318 32924 28343 26084 4570 -7 10173
11798A0173O521K7641J2893Q72j5076j2254%L932N391J802j8873O470j1146p392
$$ 10173 16694 44335 57228 58100 43024 30770 30770 34702 40093 41895 23022 29492 18346 10954
11784A0954M65N848O293J5949L291q511r185L046J40l930r247P321J1317k889
$$ 10954 11419 17267 23560 39509 42800 34289 25104 28150 28290 24360 15113 22434 33751 30862
11770C0862m549m291m996J5915n203P88N654m15M764q621q225Q461P420M97m106
$$ 30862 26313 22022 17026 32941 27738 28526 34180 33765 38529 29908 21683 30144 37564 38061 33955
11755C3955j6787n309N429j2165J546M664k881K641N606O159j8768j203O843n251
$$ 33955 17168 11859 17288 5123 6669 11333 8452 11093 16699 22858 4090 2887 9730 4479
11741D479l296P680J1919P694K746J1073j0267l50j0874j646J433q497O71R057
$$ 4479 1183 8863 20782 28476 31222 42295 32028 31678 20804 19158 20591 12094 12765 21822
11727B1822m483n158l912r68P218P308j187L319R324o647r85j5872K7322M164
$$ 21822 17339 12181 8269 7301 14519 21827 20640 23959 33283 26636 25651 9779 37101 41265
11713D1265j2496p205m95j153j4146J2479O987r792R573M921Q219K071j2436l317
$$ 41265 28769 21564 21069 19916 5770 18249 25236 15444 25017 29938 38157 40228 27792 24475
11699B4475J7361O447k125n851j0017r0Q408l099l753K6553O864k9271k1088k455
$$ 24475 41836 48283 46158 40307 30290 30200 38608 35509 31756 58309 65173 35902 14814 12359
11685A2359K608O173l053M311j0912j1160j659K5285M914M532K624K8652N457
$$ 12359 14967 21140 18087 22398 11486 326 -1333 23952 28866 33398 36022 64674 70131
11672G0131J615P833J0989J5770j2454p9Q19l225k775O430l902k577j1724p109
$$ 70131 71746 79579 90568 106338 93884 93805 94624 91399 88624 95054 91152 88575 76851 69742
11658F9742R60M226m945p619p353O76j502J1969O688P651m4J0464J1735K6891
$$ 69742 70702 74928 69983 62364 55011 55687 54185 66154 72842 80493 80449 90913 102648 129539
11644A29539L4332M2789K8758K8904L0419N0588R3982J19186J30236J31214J22831
$$ 129539 163871 206660 235418 264322 294741 345329 439311 558497 688733 819947 942778
11633I42778Q8224K5451k7478m8099r0557j08120j00386j00349j07727q6933n1809
$$ 942778 1031002 1056453 1028975 980876 890319 782199 681813 581464 473737 386804 334995
11622C34995k3828j8841l1058j5012j6136j5799j3623J1958r323j5039J711P00
$$ 334995 311167 292326 261268 246256 230120 214321 200698 212656 203333 188294 190005 190705
11610A90705j4508j6956p4K793O819j2165j2357j7993K11J3002J4222n026j2968
$$ 190705 176197 159241 159167 161960 168779 156614 144257 126264 126475 139477 153699 148673 135705
11597A35705q303J1283N458r486O057J2427k273j4940j8293P604n389J0810o6
$$ 135705 127402 138685 144143 134657 140714 153141 150868 135928 117635 125239 119850 130660 130594
11584A30594o44r329P61K170P359j3728j3251j2530j0805n97J3834P707O254Q477
$$ 130594 129950 120621 121382 123552 130911 117183 103932 91402 80597 80000 93834 101541 107795 116272
11570A16272q70j8431j1503m441L084J7165j3644j2540N249L892P589N888j7331
$$ 116272 115402 96971 85468 81027 84111 101276 87632 75092 80341 84233 91822 97710 80379
11557H0379r879o193p851J3035J493J301q72O611J0702L333K1703r412j5511J575
$$ 80379 70500 64307 56456 69491 70984 72285 71413 78024 88726 92059 113762 104350 88839 90414
11543I0414k995N872k956m248m962k3358K716O015K124l398q432m039o130l437
$$ 90414 87419 93291 90335 86087 81125 57767 60483 66498 68622 65224 56792 52753 46623 43186
11529D3186J3573O335k499o771p339q167J0554J4026J647j048j847p875l525o042
$$ 43186 56759 63094 60595 53824 46485 38318 48872 62898 64545 63497 61650 53775 50250 44208
11515D4208r559l933O057J0258P941J7254J1994N506o340N052K069Q684o629o417
$$ 44208 34649 30716 36773 47031 54972 72226 84220 89726 83386 88438 90507 99191 92562 86145
11501H6145j6503j5379P165J95Q962p443m045J3203m477p031J950P904l460j5707
$$ 86145 69642 54263 61428 61623 70585 63142 59097 72300 67823 60792 62742 70646 67186 51479
11487E1479M040K14l784J3010J5287j5197j3572N043O871J3832R255Q275J7203
$$ 51479 55519 55733 51949 64959 80246 65049 51477 56520 63391 77223 86478 94753 111956
11474A11956J764J2324J5659P626o726o773k0447J1759l15K640K1268K6955K8572
$$ 111956 113720 126044 141703 149329 142603 135830 115383 127142 126827 129467 150735 177690 206262
11461B06262L1684J1090J3808J6477N867l6929k9900k4594l1009J797j0090j9931
$$ 206262 237946 249036 262844 279321 285188 248259 218359 193765 162756 164553 154463 134532
11449A34532k2932j1031R898m830j396l228J324N382m474R391L785k8003m199
$$ 134532 111600 100569 110467 105637 104241 101013 102337 107719 103245 112636 116421 88418 84219
11436H4219M132J7454J4817O691j9161p144j4953J786J0009j207j5843l984O063
$$ 84219 88351 105805 120622 127313 108152 101008 86055 87841 97850 96643 80800 76816 82879
11423H2879L602J4359J8988J3650J2762j2134k5216k4899j368P885l881j910N573
$$ 82879 86481 100840 119828 133478 146240 134106 108890 83991 82623 90508 86627 84717 90290
11410I0290K7299J9527J8749J2945J7544p722j1022q561r184k027M023j2751j7870
$$ 90290 117589 137116 155865 168810 186354 178632 167610 159049 149865 147838 151861 139110 121240
11397A21240k91K437p400j1509l887O37Q221O84j336r795n208r669q066J0001
$$ 121240 120949 123386 115986 104477 100590 101227 109448 110132 108796 99001 93793 84124 76058 86059
11383H6059R170j777K1780J6521M465J571p28J3630J4999J4921J4708O095q28
$$ 86059 95229 93452 115232 131753 136218 137789 137061 150691 165690 180611 195319 201414 200586
11370B00586o405k2943p210P173M99o618j1576K03O297o464m579o686P142J352
$$ 200586 194181 171238 164028 171201 171700 165082 153506 153709 160006 153542 148963 142277 149419 150771
11356A50771q480J6163L5176K434l180J1318J4941O961j1089j148o382N87K272
$$ 150771 142291 158454 193630 196064 192884 204202 219143 226104 215015 213867 207485 208072 210344
11343B10344k816J3282J2520O545M1566M9339K5025N15l918k490j7271n552K4617
$$ 210344 207528 220810 233330 239875 281441 330780 355805 356320 352402 349912 332641 327089 351706
11330C51706J8312J327J738n79q380k8451k1925l539j4974K676M84j4904l457
$$ 351706 370018 371345 373083 372504 364124 335673 313748 310209 295235 297911 298395 283491 280034
11317B80034K1877K3540J5869M793J1629R995K0709J0060M807J659k0738j9086
$$ 280034 301911 325451 341320 346113 357742 367737 388446 398506 403313 404972 384234 365148
11305C65148k4142o072J1178M0167K6187L1479K1772J3633J1143k679j0600k226
$$ 365148 341006 334934 346112 386279 412466 443945 465717 479350 490493 487814 477214 474988
11293D74988M389k148k626j419M711K3761L7911J3565K203k1230j1738J7179J9549
$$ 474988 479377 477229 474603 473184 477895 501656 539567 553132 555335 534105 522367 539546 559095
11280E59095Q069J6939K6751K6624J2970j891K368M120J9918L2302M5642K9938
$$ 559095 567164 584103 610854 637478 650448 648557 650925 655045 674963 707265 752907 782845
11268G82845L1918L3107K0176J091j4110k2574O685J9979L0620K4576N3674O4943
$$ 782845 814763 847870 868046 869137 855027 832453 839138 859117 889737 914313 967987 1032930
11256A032930P2135P5468N9388M7074L1927K0895M4787M8704L2177J2931K1776
$$ 1032930 1105065 1180533 1239921 1286995 1318922 1339817 1384604 1433308 1465485 1478416 1500192
11245A500192R950J9192M7845Q6853J20009J65101K00589J95892J56525J13331
$$ 1500192 1510142 1529334 1577179 1664032 1784041 1949142 2149731 2345623 2502148 2615479
11235B615479R6270J20718J45189K07580L00428M28935N47269O38519O96589P17557
$$ 2615479 2711749 2832467 2977656 3185236 3485664 3914599 4461868 5100387 5796976 6514533
11225F514533Q15290R28308J120968J427725J845997K299790K681401K994336
$$ 6514533 7329823 8258131 9379099 10806824 12652821 14952611 17634012 20628348
11217B0628348L607614M836000O807312R897589J4846625K2959354L5843738N2806439
$$ 20628348 24235962 29071962 35879274 45776863 60623488 83582842 119426580 172233019
11209A72233019O4749791N1936096O512942m0557787n7592543m9751259l5719466
$$ 172233019 236982810 288918906 295431848 254874061 197281518 147530259 111810793
11202A11810793k4057844j5836081j0482118p126801n049844l755018k997017
$$ 111810793 87752949 71916868 61434750 54307949 49258105 45503087 42506070
11195D2506070k660154k498818k375444k175491j978011j801815j567761j312539
$$ 42506070 39845916 37347098 34971654 32796163 30818152 29016337 27448576 26136037
11187B6136037j089180q73538p48105o92836p02930p67866p93898p83372p34763
$$ 26136037 25046857 24173319 23425214 22732378 22029448 21261582 20467684 19684312 18949549
11178A8949549o67152n68246n00418m42531m35595m34015m02088m16592m34769
$$ 18949549 18282397 17714151 17213733 16771202 16335607 15901592 15499504 15082912 14648143
11169A4648143m43974m17356l93089l44093l00676l11957l17517l35731l07044
$$ 14648143 14204169 13786813 13393724 13049631 12748955 12436998 12119481 11783750 11476706
11160A1476706k72621k56478k58599k39065k33674k34192k42540k49763k43790
$$ 11476706 11204085 10947607 10689008 10449943 10216269 9982077 9739537 9489774 9245984
11151I245984k24825k10677k17841j98043j88521j92362k05858j90768j72009
$$ 9245984 9021159 8810482 8592641 8394598 8206077 8013715 7807857 7617089 7445080
11142G445080j49000j66070j80698j74229j58897j37074j27066j34049r1835r0804
$$ 7445080 7296080 7130010 6949312 6775083 6616186 6479112 6352046 6217997 6126162 6035358
11132F035358j36020j31893j28823j13369j01058r2180j12281j25872j22214j24755
$$ 6035358 5899338 5767445 5638622 5525253 5424195 5332015 5219734 5093862 4971648 4846893
11122D846893j32640j15893r1359p9762r5920r8733j06542p5141o7864p9145p8210
$$ 4846893 4714253 4598360 4507001 4427239 4331319 4232586 4126044 4050903 3983039 3903894 3825684
11111C825684p3478p1872q1733r5774r9224p4104m9445n0171m3522n4572m4742
$$ 3825684 3752206 3680334 3598601 3502827 3403603 3329499 3280054 3229883 3186361 3131789 3087047
11100C087047n0685n8649m6716n7073n9717o7646o0255n7324n9361k9896m8577
$$ 3087047 3036362 2977713 2930997 2873924 2814207 2746561 2686306 2628982 2569621 2539725 2491148
11089B491148p0788n3388m2521k4857j6234k5226n3147l8117j7004J8178l1909
$$ 2491148 2420360 2366972 2324451 2299594 2283360 2258134 2204987 2166870 2149866 2168044 2136135
11078B136135o7065o1045n2006l5662k7042m5494l0019k6568l2037l1862k0832
$$ 2136135 2069070 2008025 1956019 1920357 1893315 1847821 1817802 1791234 1759197 1727335 1706503
11067A706503l1242j2660j6780j1798j8000l3312k6183k7944k7198j9008k2569
$$ 1706503 1675261 1662601 1645821 1634023 1616023 1582711 1556528 1528584 1501386 1482378 1459809
11056A459809n4390m6318l7925k9212l3245n1720l0601j9270k0049k4194l9089
$$ 1459809 1405419 1359101 1321176 1291964 1258719 1206999 1176398 1157128 1137079 1112885 1073796
11045A073796m0003k4695j6358j8637k9542j0938o708p66j3518q611k323j2038
$$ 1073796 1033793 1009098 992740 974103 944561 933623 926915 926149 912631 904020 901697 889659
11033H89659j8645j4521m0024j2676p989j3588q785l438p487j6767o329j4429
$$ 889659 871014 856493 816469 803793 795804 782216 773431 769993 762506 745739 739410 724981
11021G24981k0480j1021q490l705j2507k3299k0742k3252k8785k6998l1372j7885
$$ 724981 704501 693480 684990 681285 668778 645479 624737 601485 572700 545702 514330 496445
11009D96445k063m329O885Q335J3334n01J1132j5550j6688j7199q425j3461j9057
$$ 496445 494382 490053 496938 505273 518607 518106 529238 513688 497000 479801 471376 457915 438858
10996D38858j5973j244j0115k284J9319O481J3297N956M071j8601j7651j8723
$$ 438858 422885 421641 411526 409242 428561 435042 448339 454295 458366 439765 422114 403391
10984D03391q776r662j3319L707O93l326l741L88p995m444p364j1687k5194r938
$$ 403391 394615 384953 371634 375341 376034 372708 368967 369355 361360 356916 349552 337865 312671 302733
10970C02733N551J3056q825j8876j6418N878o539m889K034l295q679p851K733
$$ 302733 308284 321340 312515 293639 277221 283099 276560 271671 273705 270410 261731 253880 256613
10957B56613j9896j2357k7415k024M453K936n965J565M639j3696j7569j9728k4894
$$ 256613 236717 224360 196945 194921 199374 202310 196345 197910 202549 188853 171284 151556 126662
10944A26662k241J4076m454L319J4117O561N429j5699q200l173N253m791j4240
$$ 126662 124421 138497 134043 137362 151479 158040 163469 147770 139570 136397 141650 136859 122619
10931A22619j2362n17J0591L0796R166k7486j9378N262L515m642m423k3612q937
$$ 122619 110257 109740 120331 151127 160293 132807 113429 118691 122206 117564 113141 89529 80592
10918H0592O201l205j2309j670J1589j4213q199M810m784p600p26j2315O518J6456
$$ 80592 86793 83588 71279 69609 81198 66985 58786 63596 58812 51212 50486 38171 44689 61145
10904F1145R511q943j12J1596m940p255j7310j0605j588J3610K1518o623J3957
$$ 61145 70656 61713 61601 73197 68257 61002 43692 33087 31499 45109 66627 60004 73961
10891G3961K128J121Q989M349j2423k5280m138n769p178m64J4619K5331J0708
$$ 73961 76089 77210 86199 90548 78125 52845 48707 42938 35760 35296 49915 75246 85954
10878H5954o816j1474m510j3084k3760j855j444j2471O200o88Q446J7232O427
$$ 85954 79138 67664 63154 50070 26310 24455 23011 10540 16740 16052 24498 41730 48157
10865D8157R898K741P374k720k1706N023J9304M45j6389r11o017k066j0577k7494
$$ 48157 58055 60796 68170 65450 43744 48767 68071 68516 52127 51216 45199 43133 32556 5062
10851E062q704Q221J8701K1874M643q955j0350P421j0180j9105K059K1463O830
$$ 5062 -3642 4579 23280 45154 49797 40842 30492 37913 27733 8628 10687 32150 38980
10838C8980J7094K337p253j2530R92n153j4825n325O168J6051k043m859J0796
$$ 38980 56074 58411 51158 38628 39620 34467 19642 14317 20485 36536 34493 29634 40430
10825D0430l551j4746P312J2895n765N772j264k025L487J821j0078j244R444K716
$$ 40430 36879 22133 29445 42340 36575 42347 41083 39058 42545 44366 34288 33044 42488 45204
10811D5204j3574j2263j3190R224M828j631J1515J8909p303j2289R018J6337J4315
$$ 45204 31630 19367 6177 15401 20229 18598 30113 49022 41719 29430 38448 54785 69100
10798F9100j1484j1407n571j733j996J812O421K3623K3541K0020K4530O241L0188
$$ 69100 57616 46209 40638 38905 36909 38721 45142 68765 92306 112326 136856 143097 173285
10785A73285M6207O1593P0406R4693J33946J33990J14248Q8480N8974L5217j3415
$$ 173285 219492 281085 351491 446184 580130 714120 828368 916848 975822 1011039 997624
10774I97624p4705j06116j16502j04789r4326q0147n3647k2715l0861l0205l4619
$$ 997624 922919 816803 700301 595512 501186 421039 367392 344677 313816 283611 248992
10763B48992k0885k4311l2677j5583r103l909j4479l3031r840j4619j4929j98
$$ 248992 228107 203796 171119 155536 146433 142524 128045 95014 85174 70555 55626 55428
10751E5428J119L955J1950n032j8469j2031j4043J3411R445J5664K8538J9655
$$ 55428 56547 60502 72452 67420 48951 36920 22877 36288 45733 61397 89935 109590
10739A09590j2417q697J279J1377P566J0214o906p615l074l586o275j1505m927
$$ 109590 97173 88476 89755 101132 108698 118912 112006 104391 101317 97731 91456 79951 75024
10726G5024O424q37K984n959k803J1846k779j8861l760k5270k5293j200k275R524
$$ 75024 81448 80611 83595 77636 74833 86679 83900 65039 61279 36009 10716 9516 7241 16765
10712A6765M644J4128R696P255N441K4908Q294q219j4639o000n073k3621j4863
$$ 16765 21409 35537 45233 52488 57929 82837 91131 82912 68273 62273 57200 33579 18716
10699A8716k248M346J0098N544J3972p482k8300O81O233J4965J3834r233R74q184
$$ 18716 16468 20814 30912 36456 50428 42946 14646 15327 21560 36525 50359 41126 42100 33916
10685C3916j7673o967M494L415o567K520J6915r36k4488m904K7257K7882m164
$$ 33916 16243 9276 13770 17185 10618 13138 30053 29117 4629 -275 26982 54864 50700
10672E0700r850m149j1641j4830J0234R302k44K378J298Q64N633p438j2777J468
$$ 50700 40850 36701 25060 10230 20464 29766 29522 31900 33198 34062 39695 32257 19480 20948
10658B0948n776m80L482l703K022K617J5638q844k9465O864N970J5844J657R385
$$ 20948 15172 14692 18174 14471 16493 19110 34748 25904 -3561 3303 9273 25117 26774 36159
10644C6159m250k4109k615P169L025M470m528P550o259j9050j3416m247P185K2274
$$ 36159 31909 7800 5185 12354 15379 19849 15321 22871 16612 -2438 -15854 -20101 -12916 9358
10630I358J2068j4836k2439o174L533Q399J7739O762K517Q707L553R117j1331
$$ 9358 21426 6590 -15849 -22023 -18490 -10091 7648 14410 16927 25634 29187 38304 26973
10617B6973k2002q664L861J0401k532r653k4549j6772n723J8253K616L596J4352
$$ 26973 4971 -3693 168 10569 8037 -1616 -26165 -42937 -48660 -30407 -27791 -24195 -9843
10604i843J40J752J5204J494j1561j265L174P531J0851L556J031j605j4761n502
$$ -9843 -9703 -7951 7253 8747 -2814 -4079 -905 6626 17477 21033 22064 20459 5698 196
10590A96K4913J8570m220j2649j6612j2355J891L868Q201o89p204J6427J5048
$$ 196 25109 43679 39459 26810 10198 -2157 -266 3602 11803 11114 3910 20337 35385
10577C5385j1599j5810O273m352j807o223q932N340l639j869M879l008p30j2986
$$ 35385 23786 7976 14249 9897 8090 1867 -7065 -1725 -5364 -7233 -2354 -5362 -6092 -19078
10563a9078l375r173J0184M565m395K677M390P218J3586J48L716J561p790j2238
$$ -19078 -22453 -31626 -21442 -16877 -21272 -18595 -14205 -6987 6599 6747 10463 12024 4234 -8004
10549h004Q717q3k108p340J952M823M61J0754j6132p749q369Q586m410R478J1018
$$ -8004 713 630 -1478 -8818 -6866 -2043 -1582 9172 -6960 -14709 -23078 -14492 -18902 -9424 1594
10534A594l129k962P85J3858K056j7993n945J064j7637K566J6471l116j2441O122
$$ 1594 -1535 -4497 -3712 10146 12202 -5791 -11736 -10672 -28309 -25743 -9272 -12388 -24829 -18707
10520a8707N069M828J9158j5370k0759M162J2162P119J2104J1426j446q187o783
$$ -18707 -13638 -8810 10348 -5022 -25781 -21619 -9457 -2338 9766 21192 19746 11559 4776
10507D776j596L771N980j1028j4334L302n203K53J2955P042o530l769O03J2403
$$ 4776 3180 6951 12931 1903 -12431 -9129 -14332 -14079 -1124 5918 -612 -4381 -3778 8625
10493H625J0495o157K485N116k173J0096J5522M482j0643J0022J362o606j6317
$$ 8625 19120 12963 15448 20564 18391 28487 44009 48491 37848 47870 49232 42626 26309
10480B6309p247j9082j815p123j241p628J029M451Q522L565M598m505l535M606
$$ 26309 19062 -20 -1835 -8958 -10199 -17827 -16798 -12347 -3825 -260 4338 -167 -3702 904
10466I04M209k303l609j6118l725J2871J4393p535j4016n106N65J1557O779P267
$$ 904 5113 2810 -799 -16917 -20642 -7771 6622 -913 -14929 -20035 -19470 -7913 -1134 6133
10452F133n948j2518m062Q586p835l922J1535Q40o73Q032J8448Q07j4781n502
$$ 6133 185 -12333 -16395 -7809 -15644 -19566 -8031 -7191 -7864 168 18616 19423 4642 -860
10438h60k850k218j070k75Q816k441L013o676j4477k343N452K815K89k745L829
$$ -860 -3710 -5928 -6998 -7273 1543 -898 2115 -4561 -19038 -21381 -15929 -13114 -12825 -15570 -11741
10423a1741N207J5272O804j5142l927J496R064J3206j0483j2855J207j3745l036
$$ -11741 -6534 8738 15542 400 -3527 -2031 7033 20239 9756 -3099 -1892 -15637 -18673
10410a8673K0928J5134j2132j1109n018m142j1473Q014R1l639J4476P968o125
$$ -18673 2255 17389 5257 -5852 -10870 -15012 -26485 -18471 -18380 -22019 -7543 425 -5700
10397e700j2763m927O773K2621O918j2745j2881P647R012j2391k670L073k710
$$ -5700 -18463 -23390 -16617 6004 12922 177 -12704 -5057 3955 -8436 -11106 -8033 -10743
10384a0743j6111j1683L054N967J722L056Q205O461O431J778k81p895M607M244
$$ -10743 -26854 -38537 -35483 -29516 -27794 -24738 -16533 -10072 -3641 -1863 -2144 -10039 -5432 -1188
10370a188l90p407j388J3123K100o0O550M640l877m50m150j358k709r820J818
$$ -1188 -1578 -8985 -10373 2750 4850 4790 11340 15980 12103 11653 7503 6145 3436 -6384 -4566
10355d566K1446J5318q28k0867M188r424p703q78P870k831j7016Q353J3205L221
$$ -4566 16880 32198 31370 10503 14691 5267 -2436 -3314 4556 1725 -15291 -6938 6267 9488
10341I488M233n301R376p991j6180o884L039J963K0899J6941p026o886j063j1277
$$ 9488 13721 8420 17796 9805 -6375 -13259 -10220 -8257 12642 29583 22557 15671 14608 3331
10327C331l725q512M503J9033K599j6813k0250P216K0593q791j1404o458R406
$$ 3331 -394 -8906 -4403 14630 17229 416 -19834 -12618 7975 -816 -12220 -18678 -9272
10314i272N609J0942o368j4254L276J1097J3090J9222q339k2009j5505j0245j914
$$ -9272 -3663 7279 911 -13343 -10067 1030 14120 33342 25003 2994 -12511 -22756 -24670
10301b4670J6987J7704q03j2430P23j589O331j0444j6450r810K4418L737m184
$$ -24670 -7683 10021 9218 -3212 -2489 -4078 2253 -8191 -24641 -34451 -10033 -6296 -10480
10288a0480k887R858K640N072j1323P258K0217l25k0188k2438J0688P581j5284
$$ -10480 -13367 -3509 -869 4203 -7120 138 20355 20030 -158 -22596 -11908 -4327 -19611
10275a9611j870P462m613j290J2356O76n453J2706L434M106k4158m78Q179J7649
$$ -19611 -21481 -14019 -18632 -19922 -7566 -6890 -12343 363 3797 7903 -16255 -16733 -8554 9095
10261I095K6738R67k8215L837K438j3433J2368J3695p81M19P606o25j3793j812
$$ 9095 35833 36800 8585 12422 14860 1427 13795 27490 26709 27128 34734 34109 20316 18504
10247A8504k975j5831j0183J983K485j870L693k983k1551r182K1701J7368p666
$$ 18504 15529 -302 -10485 -8502 -6017 -7887 -4194 -7177 -28728 -37910 -16209 1159 -6507
10234f507l170m344R814R940n648j0099j080K789Q087J3919p342q442j547l624
$$ -6507 -9677 -14021 -4207 5733 85 -10014 -11094 -8305 -218 13701 6359 -2083 -3630 -7254
10220g254J3507j6884M668J1887j3340n047O770R9J3224l232j8239j1078J6077
$$ -7254 6253 -10631 -5963 5924 -7416 -12463 -5693 -5594 7630 4398 -13841 -24919 -8842
10207h842L648J5307l996r328J9500o06K563P158o310O979J728j4916j5614Q322
$$ -8842 -5194 10113 6117 -3211 16289 15683 18246 25404 19094 26073 27801 12885 -2729 5593
10193E593K535j5191K0572N526j4013j2076k667J4563L490O01m056j4393j5979
$$ 5593 8128 -7063 13509 19035 5022 -7054 -9721 4842 8332 8933 4877 -9516 -25495
10180b5495J4518n035P30P124Q988j506Q049q452o436k725J4722O417J202j4722
$$ -25495 -10977 -16012 -15282 -8158 830 -676 7373 -1079 -7515 -10240 4482 10899 12101 -2621
10166b621j9445k932P964J4045J2495q3r410n690r537M988J4490J096j6892j5166
$$ -2621 -22066 -24998 -17034 -2989 9506 9423 13 -5677 -15214 -10226 4264 5360 -11532 -26698
10152b6698K0319l817l56J3827M831k709R39R542J0597n829r950j2048o203J590
$$ -26698 -6379 -10196 -10552 3275 8106 5397 6336 15878 26475 20646 10696 -1352 -7555 -5965
10138e965j0156Q972K5468p806k0117j1324j260N918k452k684J3081J6332j515
$$ -5965 -16121 -7149 18319 10513 -9604 -20928 -22188 -16270 -18722 -21406 -8325 8007 6492
10125F492j0708q401l87l323j749K383l110M899j946j4737J1114J2699p600O568
$$ 6492 -4216 -12617 -13004 -16327 -18076 -15693 -18803 -13904 -15850 -30587 -19473 -6774 -14374 -7806
10111g806l398m240L223l733O89j035n840J9888K0247j1885r977J5137M372R09
$$ -7806 -11204 -15444 -12221 -15954 -15265 -16300 -22140 -2252 17995 6110 -3867 11270 15642 16551
10097A6551j3793j0126K19L721J1499j2034o479J0156l672o980K103J1432R692
$$ 16551 2758 -7368 -7149 -3428 8071 -3963 -10442 -286 -3958 -10938 -8835 2597 12289
10084A2289j1471r333p717l987K1953Q735j3559n574M0N496J4224J5760R160n270
$$ 12289 818 -8515 -16232 -20219 1734 10469 -3090 -8664 -8624 -3128 11096 26856 36016 30746
10070C0746J0726J0410j4092k590J0246J6601K6187P073J5743L4244K8717N0335
$$ 30746 41472 51882 37790 35200 45446 62047 88234 95307 111050 145294 174011 224346
10058B24346Q8889J45836K64609M58964O49893M63610k73921n98712m60683k67985
$$ 224346 313235 459071 723680 1182644 1832537 2296147 2022226 1423514 962831 694846
10048F94846j57710j05627p7100k9356l6047l8160l5391k0596j9873q340j3878
$$ 694846 537136 431509 354409 325053 289006 250846 215455 194859 174986 166646 152768
10037A52768q488N058R99M107N648j7080j0610m637r670m511m093j8933p725P263
$$ 152768 144280 149338 150337 154444 160092 143012 132402 127765 118095 113584 109491 90558 82833 90096
10023I0096J2925m716j2063j442j71j62n315K803P929j5102j1826r435R216P602
$$ 90096 103021 98305 86242 84800 84629 84467 79152 81955 89884 74782 62956 53521 62737 70339
10009G0339k496j32m665l460p737k517m600J4215L77k946m484R57m422Q036M508
$$ 70339 67843 67711 63046 59586 51849 49332 44732 58947 59324 56378 51894 52851 48429 56465 60973
9994F0973r558l610M569P957j2367m260k101r221L171L451K383j8100j3015m142
$$ 60973 51415 47805 52374 60331 47964 43704 41603 32382 35553 39004 41387 23287 10272 6130
9980F130L693N622J923K007J6496j0355P557J7168N24j5251j3219K451l570J352
$$ 6130 9823 15445 17368 19375 35871 25516 33073 50241 50765 35514 22295 24746 21176 22528
9966B2528l165p201K707L986m428K351M180j5910J8960J4842m750r129j5621M07
$$ 22528 19363 12162 14869 18855 14427 16778 20958 5048 24008 38850 34100 24971 9350 9757
9952I757M420j7277j207J833L33J26M263J1806M707n378l968O796l319j5419J4317
$$ 9757 14177 -3100 -4307 -2474 -2141 -2015 2248 14054 18761 13383 9415 16211 12892 -2527 11790
9937A1790P972J7529J0658p556j492J1989R052j7937q298p049m359L381J4504
$$ 11790 19762 37291 47949 40393 38901 50890 59942 42005 33707 26658 22299 25680 40184
9924D0184q439j4761j3506j2630P639N184J4234j0260k670j0233q662k357J863
$$ 40184 31745 16984 3478 -9152 -1513 3671 17905 7645 4975 -5258 -13920 -16277 -14414
9911a4414k796l982r05M020K101N886M504J5496l607L94k50j1231j636J1466J7457
$$ -14414 -17210 -21192 -22097 -18077 -15976 -10090 -5586 9910 6303 6697 6447 -4784 -6420 5046 22503
9896B2503l718j0152k135j102l907q293K325J6177l087p478q094k315l844J0751
$$ 22503 18785 8633 6498 5396 1489 -6804 -4479 11698 8611 1133 -6961 -9276 -13120 -2369
9882b369m719K377n620P434O244J1882J0130r782j0913P678q456j0477k655O526
$$ -2369 -7088 -4711 -10331 -2897 3347 15229 25359 15577 4664 12342 3886 -6591 -9246 -2720
9868b720M827m877o493L217K687m542Q541J4220J3904J797j6228k7580o494J0313
$$ -2720 2107 -2770 -9263 -6046 -3359 -7901 640 14860 28764 30561 14333 -13247 -19741 -9428
9854i428R646o884M662J212P609q886k4620r483J3004J0706L38q368M948N237
$$ -9428 218 -6666 -2004 -792 6817 -2069 -26689 -36172 -23168 -12462 -12124 -20492 -15544 -10307
9840a0307O533l970q87K886J195J3307m702q360j4714L699n129K0164l832j3514
$$ -10307 -3774 -7744 -8631 -5745 -4550 8757 4055 -4305 -19019 -15320 -20449 -285 -4117 -17631
9826a7631p887J542j036J0034J0221J2425N434j3358j3430k3564o559N680j008
$$ -17631 -25518 -23976 -25012 -14978 -4757 7668 13102 -256 -13686 -37250 -43809 -38129 -39137
9813c9137J2759R283j954P464L521j122p524O796J1326j1026o6J8159J734j3727
$$ -39137 -26378 -17095 -19049 -11585 -8064 -9186 -16710 -9914 1412 -9614 -9680 8479 10213 -3514
9799c514q802l006P934m954l442r043m907P800N461O209P342L870m448J254r66
$$ -3514 -12316 -15322 -7388 -12342 -15784 -24827 -29734 -21934 -16473 -10264 -2922 948 -3500 -2246 -3212
9784c212K021P279o194n448O184L857n303j4709L994j1976r045P608q766p41J3051
$$ -3212 -1191 6088 -106 -5554 630 4487 -816 -15525 -11531 -23507 -32552 -24944 -33710 -34451 -21400
9769b1400J61J6723Q551J569p639r440j027o73J14l776M699P711J1218J2239l252
$$ -21400 -21239 -4516 4035 5604 -2035 -11475 -12502 -13175 -13061 -16837 -12138 -4427 6791 19030 15778
9754A5778O938R71j2630k0027Q082Q356j1637O753j2020q764L685K1743J2815
$$ 15778 22716 23687 11057 -8970 -888 7468 -4169 2584 -9436 -18200 -14515 7228 20043
9741B0043l220M488p611j1297J173L745J0421j973j5061m294L844J412l202M515
$$ 20043 16823 21311 13700 2403 3576 7321 17742 15769 708 -3586 258 1670 -1532 2983
9727B983j1546j355J173R423L483J1802Q725M548j6937k2194j532L025L105J835
$$ 2983 -8563 -9918 -8745 678 4161 15963 24688 29236 12299 -9895 -11427 -8402 -5297 -3462
9713c462J1227J9426r304j0276j2015J72p89K960r501r787O763J0738m474l383
$$ -3462 7765 27191 17887 7611 -4404 -4232 -5021 -2061 -11562 -21349 -14586 -3848 -8322 -11705
9699a1705M748J4646J184k104J4050o614j1732K663J0115r29j6913o323N808j389
$$ -11705 -6957 7689 8873 6769 20819 14205 2473 5136 15251 14322 -2591 -8914 -3106 -4495
9685d495r012r861o180J0879J1330O535n940n518n64J200Q251P806R986j3599
$$ -4495 -13507 -23368 -29548 -18669 -7339 -804 -6744 -12262 -12826 -11626 -3375 4431 14417 818
9671H18q729K260J7128j888n983j893Q115J2286q84j9729j652J2215Q833J1392
$$ 818 -7911 -5651 11477 9589 3606 1713 9828 22114 21230 1501 -151 12064 20897 32289
9657C2289J21k0712j8528N278j801l910O482q496j1626k37n869n283R115J4804
$$ 32289 32410 11698 -6830 -1552 -3353 -7263 -781 -9277 -20903 -21140 -27009 -32292 -23177 -8373
9643h373N908l426j130O721m39r103J749R313L539p684p79l167q404J2070K2105
$$ -8373 -2465 -5891 -7021 -300 -739 -9842 -8093 1220 4759 -2925 -3704 -6871 -15275 -3205 18900
9628A8900o35m275l790n509M013k3118p08J2099q364l280M645K806J545N459P364
$$ 18900 18265 13990 10200 4691 8704 -14414 -15122 -3023 -11387 -14667 -10022 -7216 -5671 -212 7152
9613G152l674m514n787k518M071L323K450n724j788P6J2127j776p337P979n274
$$ 7152 3478 -1036 -6823 -9341 -5270 -1947 503 -5221 -7009 -6933 5194 3418 -3919 4060 -1214
9598a214Q995m711M781L661j5016p820K1763J981m332l474M552l607p886j6306
$$ -1214 7781 3070 7851 11512 -3504 -11324 10439 12420 8088 4614 9166 5559 -2327 -18633
9584a8633l656N39N568J0534l378J952K79l58j8319P85K7176J6162r966j3290
$$ -18633 -22289 -21750 -16182 -5648 -9026 -7074 -6795 -7153 -25472 -24687 2489 18651 8685 -4605
9570d605N01O471K181j0088M904j87N692J349q494m738J0405J1771K2k749j216
$$ -4605 -4104 2367 4548 -5540 -636 -823 4869 6218 -2276 -7014 3391 15162 15184 12435 11219
9555A1219j654o215l330p046l985r666r58M685L007J8249P705n794n54j1197j6779
$$ 11219 9565 3350 20 -7026 -11011 -20677 -21635 -16950 -13943 4306 12011 6217 5663 -5534 -22313
9540b2313j2069J2152J7169P17M590j443j3576Q621M103p776M30l876L123l391
$$ -22313 -34382 -22230 -5061 -4344 246 -1197 -14773 -6152 -2049 -9825 -9395 -13271 -10148 -13539
9526a3539j408M524J5864K481j8555Q491j193l102m727j0428J750J7211J2933
$$ -13539 -14947 -10423 5441 7922 -10633 -2142 -3335 -6437 -11164 -21592 -19842 -2631 10302
9513A0302j5706j4358m67J5041P877Q813K8641j0308k6755O050M999Q625R69k767
$$ 10302 -5404 -19762 -20229 -5188 2689 11502 40143 29835 3080 9130 14129 22754 23723 20956
9499B0956j4576o287m292l582O684K135l111M045p507r968n22J0007O511L146
$$ 20956 6380 93 -4199 -7781 -1097 1038 -2073 1972 -5535 -15503 -16025 -6018 493 3639
9485C639o437j756J4139J4798j8743j4020P381J343j0550L139O845M01j2646k188
$$ 3639 -2798 -4554 9585 24383 5640 -8380 -999 344 -10206 -7067 -222 179 -12467 -14655
9471a4655J4573K988p753O739J4387j7733j2676O87P284K824M259K649k579J0381
$$ -14655 -82 2906 -4847 1892 16279 -1454 -14130 -13443 -6159 -3335 924 3573 994 11375
9457A1375P789O816Q347P288o579n429j9062j6548R034p82m26o169N052L43l270
$$ 11375 19164 25980 34327 41615 35036 29607 10545 -6003 3031 2249 1823 -4346 706 1049 -2221
9442b221Q596K366r270m64J4142J0395n08q982k257L003M906o593l164o2M644
$$ -2221 6375 8741 -529 -993 13149 23544 23036 14054 11797 14800 19706 13113 9949 9887 14531
9427A4531R823n514j1092M555j365j4074j652n227M7J395r070k108j1064J7875
$$ 14531 24354 18840 7748 12303 10938 -3136 -4788 -10015 -9968 -8573 -17643 -19751 -30815 -12940
9413a2940J7571j4097j3605L21J3833J4818l139j4373O238K1582R260j4496k1029
$$ -12940 4631 -9466 -23071 -22750 -8917 5901 2762 -11611 -5373 16209 25469 10973 -10056
9400a0056p526o260R59k43l686q116J1429K274L262J5554M334l674j4369j1109
$$ -10056 -17582 -23842 -22883 -23126 -26812 -34928 -23499 -21225 -17963 -2409 1925 -1749 -16118 -27227
9386b7227N531P538Q26j3715j399L579J2176J6635K956o969o17Q438l036p81q168
$$ -27227 -21696 -14158 -13332 -27047 -28446 -24867 -12691 3944 6900 -69 -686 7752 4716 3935 -4233
9371d233n460o701M500K997R405K17q232k477l084K60P601j9941P219J0456j917
$$ -4233 -9693 -16394 -11894 -8897 508 725 -7507 -9984 -13068 -12808 -5207 -25148 -17929 -7473 -9390
9356i390J2757k035m425J0152j6004p319PJ1602J025J8558M240j3820j3617r198
$$ -9390 3367 1332 -3093 7059 -8945 -16264 -16257 -4655 -3630 14928 19168 5348 -8269 -17467
9342a7467R71N968J4466J5619R275q319j6304n054J0489M174j0153n601o28r446
$$ -17467 -16496 -10528 3938 19557 28832 20513 4209 -845 9644 13818 3665 -1936 -2564 -12010
9328a2010r747M771J1325K0355j054k1837p704n042K011Q393J4305M543m738j4734
$$ -12010 -21757 -16986 -5661 14694 13640 -8197 -15901 -20943 -18932 -10539 3766 8309 3571 -11163
9314a1163N078R028p4j7368q092O577o174M100J1633l574L78J5636J1055j2799
$$ -11163 -6085 2943 2869 -14499 -22591 -16014 -22188 -18088 -6455 -10029 -9651 5985 17040 4241
9300D241J153J1211L109p343l89N828n996j5943l467N642r948o228M251P280R024
$$ 4241 5394 16605 19714 12371 11982 17810 11814 -4129 -7596 -1954 -11902 -18130 -13879 -6599 2425
9285B425L408M806j7993r02J7207J914r668m306J1008j823J7306J907j9161j8169
$$ 2425 5833 10639 -7354 -8256 8951 10865 1197 -3109 7899 6076 23382 25289 6128 -12041
9271a2041J284J9252L06J001J1880j1431j1364l305m012J1666Q544n628j1604
$$ -12041 -10757 8495 8801 9802 21682 10251 -1113 -4418 -8430 3236 11780 6152 -5452
9258e452r760L150J7378R576j7235J1476j7755l3448J845J6952j866J782R369
$$ -5452 -15212 -12062 5316 14892 -2343 9133 -8622 -42070 -40225 -23273 -25139 -23357 -13988
9245a3988J1806R987P301n949k3356J3580L217j024J0422J872j6976j0142N605
$$ -13988 -2182 7805 15106 9157 -14199 -619 2598 1574 11996 13868 -3108 -13250 -7645
9232g645J2819P353j9370q60M285M198R322K516k755K307j7044J4934O906m646
$$ -7645 5174 12527 -6843 -7703 -3418 780 10102 12618 9863 12170 -4874 10060 16966 12320
9218A2320p777N86J3386o618o136J454j6662k646O103L191r289l79L581Q135N114
$$ 12320 4543 5129 18515 11897 5761 7215 -9447 -12093 -5990 -2799 -12088 -12467 -8886 -751 4363
9203D363m135p058q910k050l659J089R807J4530l992n285N889J1011L72n65m669
$$ 4363 228 -6830 -15740 -17790 -21449 -20360 -10553 3977 -15 -5300 589 11600 11972 11407 6738
9188F738p298q346m114J6747O109p430K290M338p352r535O154M898l485L279K8342
$$ 6738 -560 -8906 -13020 3727 9836 2406 4696 9034 1682 -7853 -1699 3199 -286 2993 31335
9173C1335P866R478j2840k0338j7632j6225m584p16L1633J8835j2451k2944j5105
$$ 31335 39201 48679 35839 15501 -2131 -18356 -22940 -23656 7977 26812 14361 -8583 -23688
9160b3688J651K055m551J1995m267J0052P761o048j577m450j1699q736o817O276
$$ -23688 -22037 -19982 -24533 -12538 -16805 -6753 1008 -5040 -6617 -11067 -22766 -31502 -38319 -32043
9146c2043m374J2914M922N758J4526J1068N651k145q578j035J7372k962o059K384
$$ -32043 -36417 -23503 -18581 -12823 1703 12771 18422 16277 7699 6664 24036 21074 15015 17399
9132A7399j379r020M542N11J0263J4639j2823k0600J9155J0927J2076Q38Q206
$$ 17399 16020 7000 11542 12053 22316 36955 24132 3532 22687 33614 45690 46528 54734
9119E4734j1746k5801m665L887R397L039J5747l39j6336R809J9095K460q292K416
$$ 54734 42988 17187 12522 16409 25806 28845 44592 44253 27917 37726 56821 59281 50989 53405
9105E3405J1937j0806Q708O88P018Q64L838J7489J9266L340J0383J1443J2313
$$ 53405 65342 54536 63244 63932 70950 71814 75652 93141 112407 115747 126130 137573 149886
9092A49886L7818K0092Q362K7377O1002Q0145Q3112R8077J26479J87677K62850
$$ 149886 187704 207796 216158 243535 304537 384682 467794 565871 692350 880027 1142877
9081A142877L83337O38967J187598K069731L000242K533758p26732k714223k396757
$$ 1142877 1526214 2165181 3352779 5422510 8422752 10956510 10229778 7515555 5118798
9072E118798j529696r39947n52622l33093k30903j69554j21682j02005q2707n6537
$$ 5118798 3589102 2649155 2096533 1763440 1532537 1362983 1241301 1139296 1056589 1000052
9062A000052l8824m4252n8828n3958m7810k7595l2166l2461o715j5056k6820k6949
$$ 1000052 961228 916976 858148 804190 756380 728785 696619 664158 657443 642387 615567 588618
9050E88618k3491j5590j0032j9289j8225k6281k7044r030p990j3544m161N39k984
$$ 588618 565127 549537 539505 520216 501991 475710 448666 439636 431646 418102 413941 414480 411496
9037D11496q544k3690j6933R59j3121R70j6662j3561k5486j3919J73l596n82k4
$$ 411496 402952 379262 362329 363288 350167 351137 334475 320914 295428 281509 281682 278086 277504 277480
9023B77480j1814M318M931k3245j7789o826j0712R030L364K815o234j5515k390
$$ 277480 265666 269984 274915 251670 233881 227055 216343 225373 228737 231552 225318 209803 207413
9010B07413J5478j1278j2295R498j3566M324o097o106k0946o325Q75j0821r835
$$ 207413 222891 211613 199318 208816 195250 199574 193477 187371 166425 160100 160975 150154 140319
8997A40319j2380p295j609N785M023r416K264N588M409j6858n984J4178r963p233
$$ 140319 127939 120644 119035 124820 128843 119427 121691 127279 131688 114830 108846 123024 113061 105828
8983A05828m901L404q211K311n697O938J0707K498n248p903p931o317P350O108
$$ 105828 100927 104331 96120 98431 92734 99672 110379 112877 107629 99726 91795 85478 92828 98936
8969I8936L471J964j6803o034J1317l243o391m792j0953j3509m161k409p986J1159
$$ 98936 102407 104371 87568 81534 92851 89608 83217 78425 67472 53963 49802 47393 39407 50566
8955E0566J8759n809M920J1872M396o717j0952p809k454l892l924r291j3869J3868
$$ 50566 69325 63516 68436 80308 84704 77987 67035 59226 56772 52880 48956 39665 25796 39664
8941C9664J0362N322R29J2823M031l7744k0700P115J5615J8563j1085j0925J1682
$$ 39664 50026 55348 56277 69100 73131 35387 14687 21802 37417 55980 44895 33970 45652
8928D5652m860N503O496n86j2464J082J5065Q764r372r715R137J0018p205k7080
$$ 45652 40792 46295 52791 52205 39741 40823 55888 64652 55280 45565 54702 64720 57515 30435
8914C0435j1639k03J2033J0908j643j4641n761J5397L186N484n34J0642j0716
$$ 30435 18796 18593 30626 41534 39891 25250 19489 34886 38072 43556 43022 53664 42948
8901D2948k2153L90R235K548P871K037j1617p096j2034j3327J6508J7603L66O239
$$ 42948 20795 21185 30420 32968 40839 42876 31259 24163 12129 -1198 15310 32913 33279 39518
8887C9518n294k5232q170J1655J5168j382m177o317k933Q279n081P360J5747p543
$$ 39518 34224 8992 822 12477 27645 26263 22086 15769 12836 21115 16034 23394 39141 31598
8873C1598m358P396l649J545m678j0489o698O338Q024J573r422j164q645n726
$$ 31598 27240 34636 30987 32532 27854 17365 10667 17005 25029 26602 17180 16016 7371 1645
8859A645j2167j117J0606m572q777J2179K3862J0334r140j5476J847N408k882
$$ 1645 -10522 -11639 -1033 -5605 -14382 -2203 21659 31993 22853 7377 9224 14632 11750
8846A1750L351k281M406M936j4932j2938M723r206l949N782J2336J1351l526J0843
$$ 11750 15101 12820 17226 22162 7230 -5708 -985 -10191 -14140 -8358 3978 15329 11803 22646
8832B2646m352k3270n281R327N526K847O120J0682q388l293o534q944N511J0471
$$ 22646 18294 -4976 -10257 -930 4596 7443 13563 24245 15857 12564 6030 -2914 2597 13068
8818A3068j4817o7P491j7217j6114m06J0214q38N971J2216k030O469l309J7470
$$ 13068 -1749 -1816 5675 -11542 -27656 -28062 -17848 -18686 -12715 -499 -2529 3940 631 18101
8804A8101M799k4767j4635R456R344J1603j0387R180R433j1353n300K0873M030
$$ 18101 22900 -1867 -16502 -7046 2298 13901 3514 12694 22127 10774 5474 26347 30377
8791C0377l713q462j48l444L282j1788L092k199l201o357L002l585N008J8634
$$ 30377 26664 18202 18054 14610 17892 6104 9196 6997 3796 -2561 441 -3144 1864 20498
8777B0498q900l3810j6783J7788J9310J2409J245r442L339q023q115O452J8597
$$ 20498 11598 -22212 -38995 -21207 -1897 10512 11757 2315 5654 -2369 -10484 -4032 14565
8764A4565k495j5449K386J8167L212q103j1847j0490j1764o045R249N282J2637
$$ 14565 12070 -3379 -993 17174 20386 12283 436 -10054 -21818 -27863 -18614 -13332 -695
8751f95P552J183J1406o867q130M668R25j954q142j9671j0345R178o976k429M660
$$ -695 6857 8040 19446 12579 4449 9117 10042 8088 -54 -19725 -30070 -20892 -27868 -30297 -25637
8736b5637J7155N368o242j442K722N49Q615L261Q754J857k0480j2399L52N423
$$ -25637 -8482 -3114 -9356 -10798 -8076 -7527 1088 4349 13103 14960 -5520 -17919 -17567 -12144
8722a2144P556K629l703q341j6395l077R070n939M509q321J505K7633J2490j3741
$$ -12144 -4588 -1959 -5662 -14003 -30398 -33475 -24405 -30344 -25835 -34156 -32651 -5018 7472 -6269
8708f269M652L593Q304j1845m677J0506R869K614n675j2895k25k048M380J0151
$$ -6269 -1617 1976 10280 -1565 -6242 4264 14133 16747 11072 -1823 -2048 -4096 284 10435
8694A0435L476j5864n678m584j371J2477J451m756j1015K072Q760Q768o243n485
$$ 10435 13911 -1953 -7631 -12215 -13586 -1109 342 -4414 -15429 -13357 -4597 4171 -2072 -7557
8680g557K077L627j4811j5892q543k973O578K3970N08L190L775Q294J212o077
$$ -7557 -5480 -1853 -16664 -32556 -41099 -44072 -37494 -13524 -13016 -9826 -6051 2243 3455 -2622
8666b622j121J6536J4843j2214p078L699k326q023j2712J1383J6084R77r191j757
$$ -2622 -3743 12793 27636 15422 8344 12043 9717 1694 -11018 365 16449 17426 8235 6478
8652F478Q008J1039r60j0244o541P985K904q916k673j6577N51j3333j944O674
$$ 6478 14486 25525 24565 14321 7780 15765 18669 9753 7080 -9497 -8946 -22279 -24223 -17549
8638a7549K236N137j832M942J5702J573j8296M076K3092L613j0897k8348j3627
$$ -17549 -15313 -10176 -12008 -7066 8636 10209 -8087 -4011 19081 22694 11797 -16551 -30178
8625c0178N471J6727p61Q260J976k0196j8363N593J3523J2015j771o839Q927M338
$$ -30178 -24707 -7980 -8741 -481 1495 -18701 -37064 -31471 -17948 -5933 -7704 -14543 -5616 -1278
8611a278n125J2755P892J0111M203j3508j3843K759P59J1999m334j1674p397J1138
$$ -1278 -6403 6352 14244 24355 28558 15050 1207 3966 4725 16724 12390 716 -6681 4457
8597D457R897j359O333o937j4956j0503J837J167r995j392J4276J0386L31M878
$$ 4457 14354 12995 19328 12391 -2565 -13068 -11231 -10064 -20059 -21451 -7175 3211 3542 8420
8583H420K650j7839K501J5957j2387j4763L123M902p988n910J4150j787p513p733
$$ 8420 11070 -6769 -4268 11689 -698 -15461 -12338 -7436 -15424 -21334 -7184 -8971 -16484 -24217
8569b4217K493R128J3789J4745j0998j8550o939K975J1268K0802N036j2152j4228
$$ -24217 -21724 -12596 1193 15938 4940 -13610 -20549 -17574 -6306 14496 19532 7380 -6848
8556f848K276J495k05k626n579J0529N706n169o004j0819q979q879J421j151L731
$$ -6848 -4572 -3077 -3282 -5908 -11487 -958 4748 -421 -6425 -17244 -26223 -35102 -33681 -34832 -31101
8541c1101M403J1138K7025R481j6749l691N099J0044p529m401o551l258j788k2776
$$ -31101 -26698 -15560 11465 20946 4197 506 5605 15649 8120 3719 -2832 -6090 -7878 -30654
8527c0654j1535K7842Q604l771j710M398J0555o347R130o334k820R273K827j3400
$$ -30654 -42189 -14347 -5743 -9514 -11224 -6826 3729 -2618 6512 178 -2642 6631 9458 -3942
8513c942j6532L23Q131j2998R35J3696K0408K217j2839L312R467j2611n820o84
$$ -3942 -20474 -20151 -12020 -25018 -24083 -10387 10021 12238 -601 2711 12178 -433 -6253 -6937
8499f937k985j3131l648N097M569J189J423J5101J3320M410r449k103m363m418
$$ -6937 -9922 -23053 -26701 -21604 -17035 -15846 -14423 678 13998 18408 8959 6856 2493 -1925
8485a925J183J756J1262k182o608n720j3320M565J2884K1596m693j6226k700r42
$$ -1925 -742 1014 12276 10094 3486 -2234 -15554 -10989 1895 23491 18798 2572 -128 -1070
8471a070K469O445K591j4094o752J2840p07l046n531q249J6656J1779r252j5311
$$ -1070 1399 7844 10435 -3659 -10411 2429 1722 -1324 -6855 -15104 1552 13331 4079 -11232
8457a1232J1017Q110j6254n483K499o45o058m335J3429J043J1155J2126k161M968
$$ -11232 -215 7895 -8359 -13842 -11343 -11988 -18046 -22381 -8952 -7909 3246 15372 13211 18179
8443A8179O460o322n267j0106k614L923J0156j2641o396O794K856J60r33Q368
$$ 18179 24639 18317 13050 2944 330 4253 14409 1768 -4628 2166 5022 5182 4249 12617
8429A2617q265j6687P920N283O398k0447N595J1299J460n166M491R880m929q604
$$ 12617 4352 -12335 -4415 868 7266 -13181 -7586 3713 5173 7 4498 14378 9449 845
8415H45j7063n706J0613J196N074L519k2797J0349j06l537Q966l202J230R56l132
$$ 845 -16218 -21924 -11311 -10115 -5041 -1522 -24319 -13970 -14076 -17613 -8647 -11849 -10619 -9663 -12795
8400a2795R773L53l706J2456m438q768j835j024R369o33q720q915M687P147K152
$$ -12795 -3022 -2669 -6375 6081 1643 -7125 -8960 -9984 -615 -1248 -9968 -18883 -14196 -7049 -4897
8385d897j227l220o876n597q014J096M753N462J3611J2345K0222o427j1273k856
$$ -4897 -6124 -9344 -16220 -21817 -29831 -28735 -23982 -18520 -4909 7436 27658 21231 9958 7102
8371G102M165P370n820p799p800j3071j4217l560J3936J7265n75N05J246N317
$$ 7102 11267 18637 12817 5018 -2782 -15853 -30070 -33630 -19694 -2429 -3004 -2499 -1253 4064
8357D064n943j8449m116m548M299j120J4391Q265o487J762M503p827M267J0869
$$ 4064 -1879 -20328 -24444 -28992 -24693 -25813 -11422 -3157 -9644 -7882 -3379 -11206 -6939 3930
8343C930r549m629N499Q152j11P186p92l662j4251l679Q435J0087q423j5216j3116
$$ 3930 -5619 -10248 -4749 3403 3292 10478 9686 6024 -8227 -11906 -3471 6616 -1807 -17023 -30139
8328c0139L156J9364J327r903j0772n810Q239J784O256q286n320J5453J435M270
$$ -30139 -26983 -7619 -6292 -16195 -26967 -32777 -24538 -22754 -16498 -24784 -30104 -14651 -13216 -8946
8314h946P898K091N131P716j0987l684K69Q293p342k158r209m452J4989O273r526
$$ -8946 -1048 1043 6174 13890 2903 -781 -512 7781 439 -1719 -10928 -15380 -391 5882 -3644
8299c644R189l719n441K64J4241N344R697j0025J436n393p158p264k949O206p446
$$ -3644 5545 1826 -3615 -3351 10890 16234 25931 15906 17342 11949 4791 -2473 -5422 784 -6662
8284f662l24o413J208J1276M468r706R652K907j034M469m941r635j060m130J5151
$$ -6662 -6986 -13399 -12191 -915 3553 -6153 3499 6406 5372 9841 4900 -4735 -5795 -9925 5226
8269E226J4442q835j3131n194K10O96K02j3366p947J1960j594J1787J417P570
$$ 5226 19668 10833 -2298 -7492 -7282 -6586 -6384 -19750 -27697 -15737 -17331 -5544 -4127 3443
8255C443J4564n083j6429k2505j2207O960J2571J9007K014l973n649P033K1093
$$ 3443 18007 12924 -3505 -26010 -38217 -31257 -18686 321 2335 -1638 -7287 -254 20839
8242B0839P148O921p961q778j2797l081J0135l23n303j6828k795J8130P361n319
$$ 20839 27987 34908 26947 18169 5372 2291 12426 12103 6800 -10028 -12823 5307 12668 7349
8228G349N99n103j795K450m083k392J0210O240J779M038p447j4762r147l460j263
$$ 7349 7948 2845 1050 3500 -583 -2975 7235 13475 15254 19292 11845 -2917 -12064 -15524 -16787
8213a6787R716k323n097q289P083R360J1332J5353P21p867R710M937k1604k0129
$$ -16787 -7071 -9394 -14491 -22780 -15697 -6337 4995 20348 21069 13202 22912 27849 6245 -13884
8199a3884k212J4829o115n740l885J8985j982J1876J4380j440j0858q615j263
$$ -13884 -16096 -1267 -7382 -13122 -17007 1978 -4 11872 26252 24812 13954 5339 4076
8186D076L861m468K405l012L112P529q172j2196j6628P38J8180M463N556m806
$$ 4076 7937 3469 5874 2862 5974 13503 5331 -6865 -23493 -22755 -4575 -112 5444 638
8172F38j0606k273P052N942k479M716P64M638o490j2525J0221J2080L719j274
$$ 638 -9968 -12241 -5189 753 -1726 2990 3754 8392 1902 -10623 -402 11678 15397 14123
8158A4123r832n100j103M527j0036j1935P266J4809L435n742Q705n078q020J904
$$ 14123 4291 -809 -1912 2615 -7421 -19356 -12090 2719 6154 412 9117 4039 -3981 -2077
8144b077j019k712j2662k085L765O455q402m656o079R893J9957M097j3067l423
$$ -2077 -3096 -5808 -18470 -20555 -16790 -10335 -18737 -23393 -29472 -19579 378 4475 -8592 -12015
8130a2015r269J2815J0629Q595m820n006r77M386n916p098j72k882R83K523n789
$$ -12015 -21284 -8469 2160 10755 5935 929 -48 4338 -1578 -8676 -8848 -11730 -10747 -8224 -14013
8115a4013M249N395n069j5523L578O48J2786J8775R783L313r333r397K697M273
$$ -14013 -9764 -4369 -9438 -24961 -21383 -20735 -7949 10826 20609 23922 14589 5192 7889 12162
8101A2162J335l454l582k336k525J7792Q28O744O457K756n132j1606j9234j2806
$$ 12162 13497 10043 6461 4125 1600 19392 20220 26964 33421 36177 31045 19439 205 -12601
8087a2601o741P794Q2O294P113r921P365R549j310k281j710m792R787J0271J2456
$$ -12601 -19342 -11548 -11466 -5172 1941 -7980 -615 8934 7624 5343 3633 -1159 8628 18899 31355
8072C1355n107j9583k1046j865J792L549J2344j241o449k390J2901J2841J745
$$ 31355 26248 6665 -14381 -16246 -14454 -10905 1439 198 -6251 -8641 4260 17101 18846
8059A8846J0352j4947j1801J132m333m738j0330j103j128J0712K2080J4489j1774
$$ 18846 29198 14251 2450 3582 -751 -5489 -15819 -16922 -18050 -7338 14742 29231 17457
8046A7457j3742J500k312O87J1216J7484n635k1981o351R911J6258O503j213Q374
$$ 17457 3715 5215 2903 3590 14806 32290 26655 4674 -1677 8234 24492 30995 29782 38156
8032C8156j7966k532q375j6462q997J0469J0640J4544k620o580p723j7503J6486
$$ 38156 20190 17658 9283 -7179 -16176 -5707 4933 19477 16857 10277 2554 -14949 1537
8019A537M835L376N702J031M13o325l208Q49J9790k552k2561n009P934Q159J1400
$$ 1537 6372 9748 15450 16481 16894 10569 7361 8210 28000 25448 2887 -2122 5812 13971 25371
8004B5371J1233j8633q370l060M005L694j1820l0751p137O403o401q108j184N418
$$ 25371 36604 17971 9601 6541 10546 14240 2420 -28331 -35468 -29065 -35466 -43574 -44758 -39340
7990c9340J1008K0802M088m014J5614N764q247L699O902j2260r778j0088L872
$$ -39340 -28332 -7530 -3442 -7456 8158 13922 5675 9374 16276 4016 -5762 -15850 -11978
7977a1978n164R315o364o830Q973J9149Q046j2448p376j5445o086K543M910j4619
$$ -11978 -17142 -7827 -14191 -21021 -12048 7101 15147 2699 -4677 -20122 -26208 -23665 -18755 -33374
7963c3374L999J0202K0346P815o640M883O531N211j3721r721p063J1002J632j5986
$$ -33374 -29375 -19173 1173 8988 2348 7231 13762 18973 5252 -4469 -11532 -530 1102 -14884
7949a4884P738Q333J216J070J111l165J3364R462O212j3004j5595r735p320J8970
$$ -14884 -7146 1187 2403 3473 4584 1419 14783 24245 30457 17453 1858 -7877 -15197 3773
7935C773K388K297n485p23J7024J748o581l800p367N723k312q82l326j0793m121
$$ 3773 6161 8458 2973 2250 19274 21022 14441 10641 3274 8997 6685 5803 2477 -8316 -12437
7920a2437n883j3850l085R756K4129J974P777Q369J1197l921j6747j799P393k988
$$ -12437 -18320 -32170 -35255 -25499 -1370 604 8381 16750 27947 24026 7279 5480 12873 9885
7906I885O679r976j9241j2291k332m531L4275J3423L711m782j807r99L666n121
$$ 9885 16564 6588 -12653 -24944 -27276 -31807 2468 15891 19602 14820 13013 12014 15680 10559
7892A0559l828p811l880J5763J131q184j3423k275P746k922K416k016K420Q63
$$ 10559 6731 -1080 -4960 10803 11934 3750 -9673 -11948 -4202 -7124 -4708 -6724 -4304 -3441
7878c441p74J1611K615o430m160N30j0551K246J2492Q441n849j0792j0118k007
$$ -3441 -4215 7396 10011 3581 -579 -49 -10600 -8354 4138 12579 6730 -4062 -14180 -16187
7864a6187l321M800J5321J569k177M638J057o153m226m715nJ629P755l695r618
$$ -16187 -19508 -14708 613 2182 5 4643 5700 -453 -4679 -9394 -9399 -7770 -15 -3710 -13328
7849a3328n01J3306l166n338N216Q553J024j2744j3075p120Q759o416j3351L748
$$ -13328 -13829 -523 -3689 -9027 -3811 4742 5766 -6978 -20053 -27173 -18414 -24830 -38181 -34433
7835c4433J524J4676K3552J5123j4861j3886r974O61K1984K2289q394j0567r692
$$ -34433 -32909 -18233 5319 20442 5581 -8305 -18279 -17618 4366 26655 18261 7694 -1998
7822a998j957L896p052j7132J419J5076n177r490O144J3467j0906P956n420j0816
$$ -1998 -3955 -59 -7111 -24243 -22824 -7748 -12925 -22415 -16271 -2804 -13710 -5754 -11174 -21990
7808b1990J4526L823L157O172R13j618N435R080J0937k76j9337j2898j5843J2338
$$ -21990 -7464 -3641 -484 5688 6601 4983 10418 19498 30435 30159 10822 -2076 -17919 -5581
7794e581J7598M038n678j3286m878L381Q545k564K266o397K113J435o286Q123
$$ -5581 12017 16055 10377 -2909 -7787 -4406 4139 1575 3841 -2556 -443 992 -5294 2829
7780B829J828r766j0050j0434J3100O845L750p368P421J0048O709P411j1304j9202
$$ 2829 4657 -5109 -15159 -25593 -12493 -5648 -1898 -9266 -1845 8203 14912 22323 11019 -8183
7766h183L80L40o918n06J5539L468n412j3658j4757J3241K5670J4084J2467j0166
$$ -8183 -7803 -7463 -14381 -14887 652 4120 -1292 -14950 -29707 -16466 9204 23288 35755 25589
7752B5589J318K022j8500l176R087L016o427K10n349p366K81R977L533j1919j987
$$ 25589 26907 28929 10429 7253 16340 19356 12929 13139 7790 424 705 10682 14215 2296 309
7737C09k640K082K2051L063J768j1473p790r9k703J1756J0881O136n773p904j1211
$$ 309 -2331 -249 21802 24865 26633 15160 7370 7271 4568 16324 27205 33341 27568 19664 8453
7722H453q156n215o53J538O337q744j5389o940K3841J3864j329j0811n108n196
$$ 8453 297 -4918 -5571 -4033 2304 -6440 -21829 -28769 -4928 8936 7607 -3204 -8312 -13508
7708a3508j2583M814N690M034R568J0757R97J0513k310q825j1478j738J6549K085
$$ -13508 -26091 -21277 -15587 -11553 -1985 8772 9769 20282 17972 9147 -2331 -4069 12480 14565
7694A4565j1332q904o499l50J6951M034m321j0498J122R705M993j7636j9975o889
$$ 14565 3233 -5671 -12170 -12520 4431 8465 4144 -6354 -5232 4473 9466 -8170 -28145 -35034
7680c5034r642O20J6910J2068p438m581K0205N047j0749L413J1279m586J189J7277
$$ -35034 -44676 -44056 -27146 -15078 -22516 -27097 -6892 -1845 -12594 -9181 2098 -2488 -1299 15978
7666A5978O856l143o142N477j5684k249J0403j039J324P61j510j5244n808L2J6904
$$ 15978 22834 19691 13549 19026 3342 1093 11496 10457 11781 12542 11032 -4212 -10020 -9988 6916
7651F916P152J0p80N836P112j0108j8399j0510j0361N704R928N845j040L619J462
$$ 6916 14068 14078 13298 19134 26246 16138 -2261 -12771 -23132 -17428 -7500 -1655 -2695 924 2386
7636B386o933P76M326k055K690J884n506K079J1170Q994J0347J0139k0253k1646
$$ 2386 -4547 -3771 555 -1500 1190 3074 -2432 -353 10817 19811 30158 40297 20044 -1602
7622a602j7781r340J900Q255N11m804j0725k138K8845N621P324O721j4887N704
$$ -1602 -19383 -28723 -26823 -18568 -18057 -22861 -33586 -35724 -6879 -1258 6066 12787 -2100 3604
7608C604P314Q869l169q014k231k342K375J0662j0890p762p209q268j5135n022
$$ 3604 10918 19787 16618 8604 6373 4031 6406 17068 6178 -1584 -8793 -17061 -32196 -37218
7594c7218J2600O876j008J5546K0424J975p474R829j637m706j222j1206K0873
$$ -37218 -24618 -17742 -18750 -3204 17220 19195 11721 21550 19913 15207 13985 2779 23652
7581B3652n341j9895p121j4650j030J9279J0662J436l812O757J746j028P871M912
$$ 23652 18311 -1584 -8705 -23355 -24385 -5106 5556 6992 3180 9937 11683 10655 18526 23438
7567B3438O054N730j3857k2258n819J451L535Q925j96p581R599L700j1618j1518
$$ 23438 29492 35222 21365 -893 -6712 -5261 -1726 7199 7003 -578 9021 12721 1103 -10415
7553a0415q074l835p373N923K2448J4785j1833M459l746j1704M451Q686N952m195
$$ -10415 -18489 -22324 -29697 -23774 -1326 13459 1626 6085 2339 -9365 -4914 3772 9724 5529
7539E529j047m531o21o589n626O44N961J2277j951n751L528j7563N406Q201m69
$$ 5529 4482 -49 -670 -7259 -12885 -12241 -6280 5997 4046 -1705 1823 -15740 -10334 -2133 -2602
7524b602q31l125R877j462k1433l364k461O105O465K0486j841j1709j4457K616
$$ -2602 -3433 -6558 3319 1857 -19576 -22940 -25401 -19296 -12831 7655 5814 -5895 -20352 -17736
7510a7736J207Q757N403K131o186o971L076l193N465M546q891N650K7469J4105
$$ -17736 -16529 -7772 -2369 -238 -6424 -13395 -10319 -13512 -8047 -3501 -12392 -6742 20727 34832
7496C4832j2299k5915r447P994L0J234P753J3644J6356j9381j6695Q472K926j7259
$$ 34832 22533 -3382 -12829 -4835 -4805 -3571 4182 17826 34182 14801 -1894 6578 9504 -7755
7482g755L220k792j387J40Q285J954j014N383q570j580m438k622j823J4818n077
$$ -7755 -4535 -7327 -8714 -8574 -289 1665 651 6034 -2536 -4116 -8554 -11176 -12999 1819 -3258
7467c258j5220J170j96N742o487j375P791K0452M051l926j7171K273J7553J192
$$ -3258 -18478 -17308 -17504 -11762 -18249 -19624 -11833 8619 12670 8744 -8427 -6154 11399 12591
7453A2591L49j3741j2353j1074j1313j4542J4488J7467O515R813J954M993o215
$$ 12591 12940 -801 -13154 -24228 -35541 -50083 -35595 -18128 -11613 -1800 154 5147 -1068
7440a068J655M893m937K173J610J015J801n30o85p569O943m052l844l749j8577
$$ -1068 587 5480 543 2716 4326 5341 7142 6612 5927 -1642 5301 1249 -2595 -6344 -24921
7425b4921l485J022J923J8556J3724n424j9563k6941j877L042J2035P683j051
$$ -24921 -28406 -27384 -25461 -6905 6819 1395 -18168 -45109 -46986 -43944 -31909 -24226 -25277
7412b5277J5145J3502O750N962R90r387j3689r33J0520j4660r155J1403J4805
$$ -25277 -10132 3370 10120 16082 17072 7685 -6004 -6937 3583 -11077 -20232 -8829 5976
7399E976k791j7525Q313l062m122K314L671m88q53q84p35j604J1127q994p48J8445
$$ 5976 3185 -14340 -6027 -9089 -13211 -10897 -7226 -7714 -8567 -9451 -10186 -11790 -663 -9657 -10405 8040
7383H040L199L42l87n765m128o549n831J2778Q60p004r062j386O558J3332k626
$$ 8040 11239 11581 11194 5429 1301 -5248 -11079 1699 2559 -4445 -13507 -14893 -8335 4997 2371
7368B371j1587R844J2421J551J578J80j7741j6230N892J585K895k358O582J1692
$$ 2371 -9216 628 13049 14600 16178 16358 -1383 -17613 -11721 -10136 -7241 -9599 -3017 8675
7354H675k247P668J899Nm865K918P76j9159k621j1422P509J0414P329k989O183
$$ 8675 6428 14096 15995 16000 11135 14053 14829 -4330 -6951 -18373 -10864 -450 6879 3890 10073
7339A0073o714Q037r934P782J2133Q84q640m800M863M24l579k942j2025L491J0743
$$ 10073 3359 11396 1462 9244 21377 22261 13621 8821 13684 14108 10529 7587 -4438 -947 9796
7324I796o075K56j869p408K25q477J2791M313j462j226r743Q084J0172K598l946
$$ 9796 3721 3977 2108 -5300 -5075 -13552 -761 3552 2090 864 -8879 -795 9377 11975 8029
7309H029j1474l675R035J398n719n074j0444N958M060k562J544M552R883P044
$$ 8029 -3445 -7120 1915 3313 -2406 -7480 -17924 -11966 -7906 -10468 -8924 -4372 5511 12555
7295A2555l98j6392j6872J3496J5907K810j4719k358l465q44J2860j5257N757
$$ 12555 12157 -4235 -21107 -7611 8296 11106 -3613 -5971 -9436 -10280 2580 -12677 -6920
7282f920K037N748k329O397r02j4801k347P179J1601Q140q542j1750J041J1858
$$ -6920 -4883 865 -1464 4933 4031 -10770 -13117 -5938 5663 13803 5261 -6489 -5448 6410
7268F410R791L777n039k17L972j594m80m246j5946j1204q418j579J2641K075J6924
$$ 6410 16201 19978 14939 14722 18694 17100 16620 12374 -3572 -14776 -23194 -24773 -12132 -10057 6867
7253F867J1063k850j9504M31n390j317J5618M660J579K797N47o804J0987J387
$$ 6867 17930 15080 -4424 -3993 -9383 -10700 4918 9578 11157 13954 14501 7697 18684 20071
7239B0071j0910j0900l93L134P273j0192J0839q952j1977J0023j846P466n706
$$ 20071 9161 -1739 -2132 1002 8275 -1917 8922 -30 -12007 -1984 -3830 3636 -2070
7226b070L274j0118q604n095o2R6q17L043Q137P579J3936K45j8360p412J833P016
$$ -2070 1204 -8914 -17518 -22613 -22675 -22579 -23396 -20353 -12216 -4637 9299 9544 -8816 -16228 -14395 -7379
7210g379R043O043J992j4721k280r76k869J5355J1107j1137l384K958l877K696
$$ -7379 1664 7707 9699 -5022 -7302 -8278 -11147 4208 15315 4178 794 3752 -125 2571
7196B571O686O483j1720j2693p090N12M885O296P526J2562m788M032j171p996
$$ 2571 9257 15740 4020 -8673 -15763 -15251 -10366 -4070 3456 16018 11230 15262 14091 6095
7182F095Q475P910j1954j5908n512p67L977J4328K587P010N579M128o584J700
$$ 6095 14570 22480 10526 -5382 -10894 -11661 -7684 6644 9231 16241 21820 25948 19364 21064
7168B1064q65j0243j5274K589n207L009N938L124n066j975J2375J4498l020j3338
$$ 21064 20199 9956 -5318 -2729 -7936 -4927 1011 4135 -931 -2906 9469 23967 20947 7609
7154G609k120j1567j249j1791N574P309J6710j5345J491O365P620J3861k304q786
$$ 7609 5489 -6078 -7327 -19118 -13544 -6235 10475 -4870 -3379 2986 10606 24467 22163 13377
7140A3377j0865j5183M655M177L206j051J471o413J4003n427r873O710K840L427
$$ 13377 2512 -12671 -8016 -3839 -633 -1684 -213 -6626 7377 1950 -7923 -1213 1627 5054
7126E054L736J038j426j1298k031l495K523P098J1521J620K497p390k286j5095
$$ 5054 8790 9828 8402 -2896 -4927 -8422 -5899 1199 12720 14340 16837 9447 7161 -7934
7112g934r344J4268J1954k486R183n683N762j5789k0535J623J2916M91j2825N284
$$ -7934 -17278 -3010 8944 6458 15641 9958 15720 -69 -20604 -18981 -6065 -5574 -18399 -13115
7098a3115J1895K1380J5127R144J911q507j1087M846p059j0411q221j2057l340
$$ -13115 -1220 20160 35287 44431 46342 37835 26748 31594 24535 14124 5903 -6154 -9494
7085i494O500o698p481j500j457k5J4822J1283j0593k538j2682j285J7140R580
$$ -9494 -2994 -9692 -17173 -18673 -20130 -20155 -5333 5950 -4643 -7181 -19863 -21148 -4008 5572
7071E572J3008K125J282n052j5857j269R215l35r816l037N043j4196P540L778
$$ 5572 18580 20705 21987 16935 1078 -191 9024 8689 -1127 -4164 879 -13317 -5777 -1999
7057a999o736j4159K249R552j029L191M789m095n412J238O730Q376K552K062l032
$$ -1999 -8735 -22894 -20645 -11093 -12122 -8931 -4142 -8237 -13649 -12411 -5681 2695 5247 7309 4277
7042D277p149L03n627j0270p576R886L501Q006J5902j2635n545n115j0253L095
$$ 4277 -2872 -2569 -8196 -18466 -26042 -16156 -12655 -4649 11253 -1382 -6927 -12042 -22295 -19200
7028a9200K777J477n528l90p835j977J3260N473P440j2595o617J186J0248P844
$$ -19200 -16423 -14946 -20474 -20864 -28699 -30676 -17416 -11943 -4503 -17098 -23715 -22529 -12281 -4437
7014d437K3074M684j9588M343j0588m510P301j1088N94J7221M26n859m508r223
$$ -4437 18637 23321 3733 8076 -2512 -7022 279 -10809 -10215 7006 7432 1573 -2935 -12158
7000a2158Q083m808o683R072L780J951L45m292j019Q125K980q068K478Q540P930
$$ -12158 -4075 -8883 -15566 -6494 -2714 -763 -418 -4710 -5729 2396 5376 -2692 -214 8326 16256
6985A6256l567P34p804j7941M547Q240P00J1153J0120m893j6829p045j0645r472
$$ 16256 12689 13423 5619 -12322 -7775 465 1165 12318 22438 17545 716 -6329 -16974 -26446
6971b6446J1732O301j0016j2456P248O758Q507k946K979J3802m213j2794q716
$$ -26446 -14714 -8413 -18429 -30885 -23637 -16879 -8372 -11318 -8339 5463 1250 -11544 -20260
6958b0260J1477O083N892r137J445N657p7j9564m988O785M242k393K922n459o447
$$ -20260 -8783 -2700 3192 -5945 -4500 1157 1080 -18484 -23472 -16687 -12445 -14838 -11916 -17375 -23822
6943b3822J098O128Q810R953j471K939P035q59J112l829p459J883J2060L018j0947
$$ -23822 -22724 -16596 -7786 2167 696 3635 10670 9811 10923 7094 -365 1518 13578 16596 5649
6928E649j3716J841L8j1905l634K1043O476p235Q913Q528l076M124J1555j6677
$$ 5649 -8067 -6226 -6188 -18093 -21727 -684 5792 -1443 7470 15998 12922 17046 28601 11924
6914A1924o551k840j0830o731n444R414J0440J4733N802p855j1839p184K076P474
$$ 11924 5373 2533 -8297 -15028 -20472 -11058 -618 14115 19917 12062 223 -6961 -4885 2589
6900B589r186R066j832k354J6495K133k853r935j5457L87O415m379l184l876r495
$$ 2589 -6597 2469 637 -1717 14778 16911 14058 4123 -11334 -10947 -4532 -8911 -12095 -15971 -25466
6885b5466P44O700j87m730p584M123J7865o05P965j1402p179L075k440K2124q613
$$ -25466 -24722 -18022 -18209 -22939 -30523 -26400 -8535 -9140 -1175 -12577 -19756 -16681 -19121 3003 -5610
6870e610j7147l928l983J3208J6870O266N854l230k349N049O789l920j6488j664
$$ -5610 -22757 -26685 -30668 -17460 -590 5676 11530 8300 5951 11000 17789 13869 -2619 -4283
6856d283J6133j3775j5054J5491L861l037j1150Q734p104L370O259J8016O223
$$ -4283 11850 -1925 -16979 -1488 2373 -664 -11814 -3080 -10184 -6814 -555 17461 23684
6843B3684j5089r542N24Q172j9911j9576K0343N804J0365r206k2921k664P588
$$ 23684 8595 -947 -423 7749 -12162 -31738 -11395 -5591 4774 -4432 -27353 -30017 -22429
6830b2429R313O351J9792K4612k947q069l829N276j2049j0264L257k088l106q014
$$ -22429 -13116 -6765 13027 37639 34692 26623 22794 28070 16021 5757 9014 6926 3820 -4194
6816d194q62M198j1838n069K2257N470R524P501j8994r083O764p003l853p077
$$ -4194 -5056 -858 -12696 -17765 4492 9962 19486 26987 7993 -1090 5674 -1329 -5182 -12259
6802a2259P142Q771O111L63L415j6400o093N812l858j682k331m841J254P238k729
$$ -12259 -5117 3654 9765 10128 13543 -2857 -8950 -3138 -6996 -8678 -11009 -15850 -14596 -7358 -10087
6787a0087K250m055j0067N311J3522P382p126J5497J2808j926r00j612n237M273
$$ -10087 -7837 -11892 -21959 -16648 -3126 4256 -2870 12627 25435 23509 22609 20997 15760 20033
6773B0033p900j3635L785N752m035j0931m163J6077o85j0252m602J104L50m79
$$ 20033 12133 -1502 2283 8035 4000 -6931 -11094 4983 4298 -5954 -10556 -9452 -9102 -9581
6759i581M613J5793K23P657O074j3150q591l619P06J5259j1898r491m520N150
$$ -9581 -4968 10825 11048 18705 24779 11629 3038 -581 125 15384 3486 -6005 -10525 -5375
6745e375K449j2938Q56o858o73L013J3592k845J1667K588q861O484Q061q563l177
$$ -5375 -2926 -15864 -15008 -21866 -22539 -19526 -5934 -8779 2888 5476 -3385 3099 11160 2597 -580
6730e80K625J2740q226l218J789N088m833m606M267J3741l278j2366r705l65k675
$$ -580 2045 14785 6559 3341 5130 10218 5385 779 5046 18787 15509 3143 -6562 -6927 -9602
6715i602p089N296J0784p290O93O914K547l019o549j1509K085O942K203m100J62
$$ -9602 -16691 -11395 -611 -7901 -7208 -294 2253 -766 -7315 -18824 -16739 -9797 -7594 -11694 -11532
6700a1532O460m772o038J0919J4559M648j3898R107O651r916j517Q164j853l464
$$ -11532 -5072 -9844 -15882 -4963 9596 14244 346 9453 16104 6188 4671 12835 10982 7518
6686G518q517l96O764L485Q30J123R863M585r670n666k093J7570m359k5636q830
$$ 7518 -999 -1395 5369 8854 9684 10807 20670 25255 15585 9919 7826 25396 21037 -4599 -13429
6671a3429J171J4446R554p66L388q063k797m65k517j4814q180L325R496J0698
$$ -13429 -12258 2188 11742 10976 14364 6301 3504 3039 522 -14292 -22472 -19147 -9651 1047
6657A047m22j1256M272J9299R549l874p208k115j678R754p320N707n485o208k468
$$ 1047 625 -10631 -6359 12940 22489 18615 11407 9292 7614 17368 10048 15755 10270 4062 1594
6642A594J058J2584J8981m133q337j2135n698j249m665K357M818K332J7766p863
$$ 1594 2652 15236 34217 30084 21747 9612 3914 2665 -2000 357 5175 7507 25273 17410
6628A7410K574q081k320p601j4820p941O961J9372q842o970P977N985n982j0398
$$ 17410 19984 11903 9583 1982 -12838 -20779 -13818 5554 -3288 -10258 -2281 3704 -2278 -12676
6614a2676j522K481M204j421J4021L798j5683p086q296j1525M143P658J1958J1621
$$ -12676 -14198 -11717 -7513 -8934 5087 8885 -6798 -13884 -22180 -33705 -29562 -21904 -9946 1675
6600A675j1141j0373j2521N485J552Q260P772P836n291j4150M087K2748r53k0835
$$ 1675 -9466 -19839 -32360 -26875 -25323 -17063 -9291 -1455 -6746 -20896 -16809 5939 4986 -15849
6586a5849n603R777Q607n517j0568J1475Q437m496M422L227J1850Q656k494r671
$$ -15849 -21452 -11675 -3068 -8585 -19153 -7678 759 -3737 685 3912 15762 24418 21924 12253
6572A2253j3523j1194L105L114j0072K391n622O556J7847J054R658p188j1412
$$ 12253 -1270 -12464 -9359 -6245 -16317 -13926 -19548 -12992 4855 5909 15567 8379 -3033
6559c033p440j0719l790J3918p716k621N368Q353L863l009j6362n669J2782N284
$$ -3033 -10473 -21192 -24982 -11064 -18780 -21401 -16033 -7680 -3817 -6826 -23188 -28857 -16075 -10791
6545a0791M456M11J2668J0484o002M004q091k7296o159J1710P030J3248J074M434
$$ -10791 -6335 -5924 6744 17228 11226 15230 7139 -20157 -26316 -14606 -7576 5672 6746 11180
6531A1180J0936o372q197o384q166J5759p877l956R304R564n643q23K755j4274
$$ 11180 22116 15744 7547 1163 -7003 8756 879 -3077 6227 15791 10148 9325 12080 -2194
6517b194j2283O774K62n399l059J3367J6911J526l470n736k450m740J397Q145
$$ -2194 -14477 -7703 -7441 -12840 -15899 -2532 14379 15905 12435 6699 4249 -491 906 9051
6503I051n611j0089p818J2571K5424J9814l059l148j3954j3168j1287n310R234
$$ 9051 3440 -6649 -14467 -1896 23528 43342 40283 37135 23181 10013 -1274 -6584 2650
6490B650P571j497k520L315K588j3508j6000p341p190n5P566O280K956J3006Q988
$$ 2650 10221 8724 6204 9519 12107 -1401 -17401 -24742 -31932 -31987 -24421 -18141 -15185 -2179 6809
6475F809P305Q528r622r004L31r779j5751j860j911L271K2686n645K743P237k759
$$ 6809 14114 22642 13020 4016 4347 -5432 -21183 -23043 -24954 -21683 1003 -4642 -1899 5338 2579
6460B579k572Q761p749k8636k186L0574o16k6508o191J6412L946K2078k971j1611
$$ 2579 7 8768 1019 -27617 -29803 771 155 -26353 -32544 -16132 -12186 9892 6921 -4690
6446d690J1128J927p163L831k603L403Q138o730j1394l591J7641P30k1268O40
$$ -4690 6438 8365 1202 5033 2430 5833 13971 7241 -4153 -7744 9897 10627 -10641 -10001
6432a0001Q961p234m731q019P06j140J9815J2278L745P057k318k1749j5755q114
$$ -10001 -1040 -8274 -13005 -21024 -20318 -21458 -1643 10635 14380 21437 19119 -2630 -18385 -26499
6418b6499k42R594Q001l064m295J22J1038L433o187M666l67P613L390p7j413l09
$$ -26499 -26741 -17147 -9146 -12210 -16505 -16383 -5345 -1912 -8099 -3433 -3800 3813 7203 7126 5713 5404
6402E404m201N419o315M461M725o030j4736N837J4966l378j2634L641k294n460
$$ 5404 1203 6622 307 4768 9493 3463 -11273 -5436 9530 6152 -6482 -2841 -5135 -10595
6388a0595J0223j944p538Q997P799o879j7358J844n934k24J1430L753K159Q735
$$ -10595 -372 -2316 -9854 -857 6942 63 -17295 -15451 -21385 -21609 -10179 -6426 -4267 4468
6374D468k79l447Q306q956j5202N931J0970J453l761m270m334N569j3040p357
$$ 4468 4189 742 9048 92 -15110 -9179 1791 3244 -517 -4787 -9121 -3552 -16592 -23949
6360b3949l927N479L477J732O057J1440J9989J182j6634N98M767J1559l070j1389
$$ -23949 -27876 -22397 -18920 -17188 -11131 309 20298 21480 4846 5444 10211 21770 18700 7311
6346G311j5369O08m496Q085n418j5615J7157K6715k048M975P513N673j2653l497
$$ 7311 -8058 -7450 -11946 -3861 -9279 -24894 -7737 18978 16930 21905 29418 35091 22438 18941
6332A8941m233q113P114j1216J974n848M780n789m636j923K150R029n747R155
$$ 18941 14708 6595 13709 2493 4467 -1381 3399 -2390 -7026 -8949 -6799 2230 -3517 5638
6318E638N683r462n311m337N722M79J153l364o27n087P629m69k0707j04M568M18
$$ 5638 11321 1859 -3452 -7789 -2067 -1588 -435 -3799 -4426 -9513 -1884 -2353 -23060 -23164 -18596 -18178
6302a8178j023l549P662p548Q242P768k798J8171N222n007l760r563P718Q626
$$ -18178 -19201 -22750 -15088 -22636 -14394 -6626 -9424 8747 13969 8962 5202 -4361 3357 11983
6288A1983k480j9480K48K562N474J4947J5o893O435o608n112n335J173q225j2806
$$ 11983 9503 -9977 -9729 -7167 -1693 13254 13269 6376 12811 6203 1091 -4244 -3071 -11296 -24102
6273b4102l900J0863P245L592K3137R367p247N265P863q609j1214j820J0473N375
$$ -24102 -28002 -17139 -9894 -6302 16835 26202 18955 24220 32083 23474 12260 10440 20913 26288
6259B6288j583p609p434J001k782j1803n482J636J4130J7629k312j5667j0474
$$ 26288 24705 17096 9662 10663 7881 -3922 -9404 -7768 6362 23991 21679 6012 -4462
6246d462j3674k020K8991J3901L053j8543j7939j5442O141K5889N959q496o085
$$ -4462 -18136 -20156 8835 22736 25789 7246 -10693 -26135 -19994 5895 11854 3358 -2727
6233b727m496p026P875N251p42M09N26o733K049J1148k727n224j0537j2265L776
$$ -2727 -7223 -14249 -6374 -1123 -1865 -1456 -930 -7663 -5614 5534 2807 -2417 -12954 -25219 -21443
6218b1443J1843Q991R963Q584l853n211j0142j9982J347J081J1643P161j991o893
$$ -21443 -9600 -609 9354 17938 14085 8874 -1268 -21250 -19903 -18822 -7179 -18 -2009 -8902
6204h902n721j6246J363J6549k08j0659k099K0499P068p814r466P895L787M832
$$ -8902 -14623 -30869 -29506 -12957 -13165 -23824 -25923 -5424 1644 -6170 -15636 -7741 -3954 878
6190H78o446l975l929N638J3636q18j1156n823L259K775j3256n579k700q511j676
$$ 878 -5568 -9543 -13472 -7834 5802 4984 -6172 -11995 -8736 -5961 -19217 -24796 -27496 -36007 -37683
6175c7683N391J0968l573m558J2445J1013J7496L003o003o82l482k719N356O209
$$ -37683 -32292 -21324 -24897 -29455 -17010 -5997 11499 14502 8499 7817 4335 1616 6972 13181
6161A3181n232k5172J6206O58N135J9322P68q999j5537r612l483q916j955J9247
$$ 13181 7949 -17223 -1017 -359 4776 24098 24866 15867 330 -9282 -12765 -21681 -23636 -4389
6147d389P530k864p504m949Q296R720M843J100j1193p513N458K11M650m124L897
$$ -4389 3141 277 -7227 -12176 -3880 5840 10683 11783 590 -6923 -1465 -1254 3396 -728 3169
6132C169R71j5032k176O571k535P77J5290n14k262J348Q45O30j4639j5862m911
$$ 3169 4140 -10892 -13068 -6497 -9032 -8255 7035 6521 4259 5607 6452 7082 -7557 -23419 -28330
6117b8330J9833J5980n917L627N669j3679j2180J6445Q243L369r338n265M331
$$ -28330 -8497 7483 1566 5193 10862 -2817 -14997 1448 9691 13060 3722 -1543 2788
6104B788K859o349q149j5398J2283J0001n165k555n999m902j6586m066J2748J5661
$$ 2788 5647 -702 -8851 -24249 -11966 -1965 -7130 -9685 -15684 -20586 -37172 -41238 -28490 -12829
6090a2829J2491j780k351K995k844l269l536J1239o543L805N652q609P215q161
$$ -12829 -338 -2118 -4469 -1474 -4318 -7587 -11123 116 -6427 -2622 3030 -5579 1636 -6525
6076f525l369K363L976p894j5170o614j528L324J5250J1885J3561j583j8311k1562
$$ -6525 -9894 -7531 -3555 -11449 -26619 -33233 -34761 -31437 -16187 -4302 9259 7676 -10635 -32197
6062c2197K460L093J2572J5305m280j0274J0918Q30j5345l395J2440J0224j5783
$$ -32197 -29737 -26644 -14072 1233 -3047 -13321 -2403 -1573 -16918 -20313 -7873 2351 -13432
6049a3432j3759J6500K0448J0367r057o58R358l067N018R94q923j5686k1052L244
$$ -13432 -27191 -10691 9757 20124 11067 10409 19767 16700 21718 22712 13789 -1897 -22949 -19705
6035a9705J2200j457l402n932K1086Q877j0846J665M827O28J813o274M759l867
$$ -19705 -7505 -8962 -12364 -18296 2790 11667 821 2486 7313 7941 9754 3480 8239 4372
6021D372K596J4367o039m894L523j4208j3079j0235J5773J0480l778m691j761
$$ 4372 6968 21335 15296 10402 13925 -283 -13362 -23597 -7824 2656 -1122 -5813 -7574
6008g574Q75Q075k492j5662r14J8041P630Q941p050m063j7583Q172J0834m9l887
$$ -7574 -6699 1376 -1116 -16778 -17692 349 7979 16920 9870 5807 -11776 -3604 7230 7181 3294
5993C294o119M892L786P482J5118q308j1305L819P663l860k895Q538j4106j1319
$$ 3294 -2825 2067 5853 13335 28453 20145 8840 12659 20322 16462 13567 22105 7999 -3320
5979c320o08j2787J380J2802M755j5286l338Q522K123o822J389m790P829J2633
$$ -3320 -3928 -16715 -15335 -2533 2222 -13064 -16402 -7880 -5757 -12579 -11190 -15980 -8151 4482
5965D482j0335j3111K0240R657j321j4185j1180K434O76M368m665l283M898J1892
$$ 4482 -5853 -18964 1276 10933 9612 -4573 -15753 -13319 -12643 -8275 -12940 -16223 -11325 567
5951E67N229O413J377r691m48j3016j3206M552j1258m96J6961J858L901Q557j567
$$ 567 5796 12209 13586 3895 3447 -9569 -22775 -18223 -29481 -29977 -13016 -11158 -7257 1300 -267
5936b67m903l913m454K064O689r006J930P282j457n35O166O6k166O060J0917R637
$$ -267 -5170 -9083 -13537 -11473 -4784 -13790 -11860 -4578 -6035 -6570 -404 -338 -2504 3556 14473 24110
5920B4110j230j1604r156J5074k905p006k49J0982L298r156k825O497k297n424
$$ 24110 22880 11276 2120 17194 14289 7283 7034 18016 21314 12158 9333 15830 13533 8109
5906H109k233L702O025O801m836n510J561o488j107J0602r967r001q172J230m194
$$ 8109 5876 9578 15603 22404 17568 12058 13619 7131 6024 16626 6659 -2342 -10514 -9284 -13478
5891a3478q68q566o634P408J5298K1222R790Q48m402J698j1582q327J264l487
$$ -13478 -14346 -22912 -29546 -22138 -6840 14382 24172 25020 20618 22316 10734 2407 3671 184
5877A84r229j728p10L570j3776L843J0545L255j1942q747k603R133r147K305j5552
$$ 184 -9045 -10773 -11483 -7913 -21689 -17846 -7301 -4046 -15988 -24735 -27338 -18205 -27352 -25047 -40599
5862d0599n18K962j1245K2046L1216J0038k885n407l409r367N209l028m464J308
$$ -40599 -41117 -38155 -49400 -27354 3862 13900 11015 5608 2199 -7168 -1959 -4987 -9451 -8143
5848h143k682p334j320P327O285p918N006k270N301J3229j862q421J0840o240
$$ -8143 -10825 -18159 -19479 -12152 -5867 -13785 -8779 -11049 -5748 7481 5619 -2802 8038 1798
5834A798m261k969p145M950J1603J34p508J0198J46p629r52J7834O986m744o43
$$ 1798 -2463 -5432 -12577 -7627 3976 4110 -3398 6800 6946 -683 -1635 16199 23185 18441 17798
5819A7798P35j7330j365M319O752p795l808O62j1827o012K519n389P236o82J6373
$$ 17798 18533 1203 -162 4157 10909 3114 -694 -32 -11859 -17871 -15352 -20741 -13505 -14187 2186
5804B186O051J3781k839M555J910k051k0412m488p496M691L90Q038N135N886M194
$$ 2186 8237 22018 19179 23734 25644 23593 3181 -1307 -8803 -4112 -3722 4316 9451 15337 19531
5789A9531k326O464m637m967N933p141K726J141K202n706j2017K865L943j0093
$$ 19531 17205 23669 19032 14065 19998 12857 15583 16724 18926 13220 1203 4068 8011 -2082
5775b082M037Q140p519o270M408p596q964m23o566Q964M66m042j903J1443P460
$$ -2082 1955 10095 2576 -3694 714 -6882 -15846 -16269 -22835 -13871 -13405 -17447 -19350 -7907 -447
5760d47J436L65m264r545o282N337J8943j08j5940n407j164R149r73Q939j022
$$ -447 989 1354 -2910 -12455 -18737 -13400 5543 5435 -10505 -15912 -17076 -7927 -8900 39 -983
5745i83Q664J1159m884M152k695p55j2458j7164l611O618L852Q441J9587J1305
$$ -983 7681 18840 13956 18108 15413 14658 2200 -14964 -18575 -11957 -8105 336 19923 31228
5731C1228N754j0480j4645m698l512j123j467m949K379j0766j2777J0951J0653
$$ 31228 36982 26502 11857 7159 3647 2524 1057 -3892 -1513 -12279 -25056 -14105 -3452
5718c452P970q538O542J1193L931n876L30l353k3704j4034K2753J9334J0993N089
$$ -3452 4518 -4020 2522 13715 17646 11770 12100 8747 -14957 -28991 -6238 13096 24089 29178
5704B9178j3990q666p649m550j0852M88j4364N791J5614K0438q868k1793l66P903
$$ 29178 15188 6522 -1127 -5677 -16529 -16041 -30405 -24614 -9000 11438 2570 -19223 -19589 -11686
5690a1686J0487L490k874K993M761J762k0635L570J2539P699j6324q143Q43P634
$$ -11686 -1199 2291 -583 2410 7171 8933 -11702 -8132 4407 12106 -4218 -12361 -11518 -3884
5676c884O295Q030l913o429O445n720P676o238O212j9980n608K3557J0285k338
$$ -3884 2411 10441 6528 99 6544 824 8500 2262 8474 -11506 -17114 6443 16728 14390
5662A4390q520L642l988l96O405J984J216J1588J1920P640j2389j8064m795j2465
$$ 14390 5870 9512 5524 5128 11533 13517 14733 26321 38241 45881 33492 15428 10633 -1832
5648a832J2017J8962m636r193j2033J2770J3485j4967n23j6048j1625o739o769
$$ -1832 10185 29147 24511 15318 3285 16055 29540 14573 14050 -1998 -13623 -20362 -27131
5635b7131J4692R115J6953p543n972J3083j5967j2901j4294J0298J0916N110j4191
$$ -27131 -12439 -3324 13629 6086 114 13197 -2770 -15671 -29965 -19667 -8751 -3641 -17832
5622a7832q062K0451K7869k551j4316k451j7695R29J1890L643K830m600j2998
$$ -17832 -25894 -5443 22426 19875 5559 3108 -14587 -13658 -1768 1875 4705 105 -12893
5609a2893R445J3292K133j0735o271q76K519R369o399k474n569o549L619J0311
$$ -12893 -3448 9844 11977 1242 -5029 -5905 -3386 5983 -416 -2890 -8459 -15008 -11389 -1078
5595a078J370k459O890M770j0615j5463j7777m057P13J1039K007r511J2538K3614
$$ -1078 292 -2167 4723 9493 -1122 -16585 -34362 -38419 -37706 -26667 -24660 -34171 -21633 1981
5581A981O142j0827j6279K346J6235J430j3920K272J3611J77L347J1211j495j3992
$$ 1981 8123 -2704 -18983 -16637 -402 1028 -12892 -10620 2991 3168 6515 17726 16231 2239
5567B239q516O388P703o941Q611j023j9968O90M10K659L660l800J941K353N161
$$ 2239 -6277 111 7814 873 9484 8461 -11507 -10817 -10407 -7748 -4088 -7888 -5947 -3594 1567
5552A567M207R768Q483j0472O856Q195o172o360N537k83j6574j8285k211Q105
$$ 1567 5774 15542 24025 13553 20409 28604 22432 16072 21609 21326 4752 -13533 -15744 -7639
5538g639R101J4370j2681j831J137K481n366l87K670m718j1129j6385m646L726
$$ -7639 1462 15832 3151 1320 2457 4938 -428 -815 1855 -2863 -13992 -30377 -35023 -31297
5524c1297N717O00J9830K4565J1364r942j4040o494M133o697M000j923m125k2603
$$ -31297 -25580 -24980 -5150 19415 30779 20837 6797 303 4436 -2261 1739 -184 -4309 -26912
5510b6912N067Q152l132n211M378J5244L577n929q186R732j356K667J5749J3998
$$ -26912 -21845 -13693 -16825 -22036 -17658 -2414 1163 -4766 -12952 -3220 -4576 -1909 13840 27838
5496B7838r37j1176K230n526J46j0777j4459Q659K2383j9144j6651L369L73P440
$$ 27838 26901 15725 17955 12429 12575 1798 -12661 -4002 18381 -763 -17414 -14045 -13672 -6232
5482f232R342r463p121M561P001M760j886k548q004R345K845m021j3340l495J879
$$ -6232 3110 -6353 -13474 -8913 -1912 2848 962 -1586 -9590 -245 2600 -1421 -14761 -18256 -16377
5467a6377n714l7P21j195Q405J059m823n779k41J0397N072l68J722R260P806m528
$$ -16377 -22091 -22128 -21407 -22602 -14197 -13138 -17961 -23740 -23981 -13584 -8512 -8880 -7158 2102 9908 5380
5451E380p619L510p997k5576p819r811J6718L0840J4558J5543o106M205j6043
$$ 5380 -2239 1271 -6726 -32302 -40121 -49932 -33214 -2374 12184 27727 21621 25826 9783
5438I783k2332l145m417O081K137J332J0427K96l523O518J389j3648o958L446
$$ 9783 -12549 -15694 -20111 -14030 -11893 -10561 -134 162 -3361 3157 4546 -9102 -16060 -12614
5424a2614l416N466N990m662m55J054J0586N874J040J4555p741M44M605R91j3159
$$ -12614 -16030 -10564 -4574 -9236 -9691 -8637 1949 7823 8863 23418 15677 16121 20726 21717 8558
5409H558j4040K188k749J212N322Q605j6167k372J7819O022J84J8q483j0971j8852
$$ 8558 -5482 -3294 -6043 -4831 491 9096 -7071 -9443 8376 14398 14582 14600 6117 -4854 -23706
5394b3706m529K0142Q623L831J315l105J3228K202K927N522o104p709j2785N016
$$ -23706 -28235 -8093 530 4361 5676 2571 15799 18001 20928 26450 20346 12637 -148 4868
5380D868R177n174O339J5546J67p526j8218j5897m760L970J3070J1497q91j0331
$$ 4868 14045 8871 15210 30756 30923 23397 5179 -10718 -15478 -11508 1562 13059 12168 1837
5366A837r516j1308L215Q920N311P750j14n179l128k172N291O31r056q771J1234
$$ 1837 -7679 -18987 -15772 -6852 -1541 6209 6095 916 -2212 -4384 907 1538 -7518 -16289 -5055
5351e055k307k0856O815P511J1668L229j0505j9302P872J6083N700j1116J5581
$$ -5055 -7362 -28218 -21403 -13892 -2224 1005 -9500 -28802 -20930 -4847 853 -10263 5318
5338E318J3954p167j0712r408M692R158R719o254M438L262R868j2370q75j5006
$$ 5318 19272 12105 1393 -8015 -3323 5835 15554 9300 13738 17000 26868 14498 13623 -1383
5324a383j5758M948M720O497L672m282o07L724J494l228J444L354P617j319j8877
$$ -1383 -17141 -12193 -7473 -976 2696 -1586 -2193 1531 3025 -203 1241 4595 12212 10893 -7984
5309g984J654L689M774j1294n727k334p316J3905J1603k425N846o412p330L789
$$ -7984 -6330 -2641 2133 -9161 -14888 -17222 -24538 -10633 970 -1455 4391 -2021 -9351 -5562
5295e562K0794J7236o367j0935K850m986j5532l281J9379J1796j4286j0025o515
$$ -5562 15232 32468 26101 15166 18016 13030 -2502 -5783 13596 25392 11106 1081 -5434
5282e434Q624L176k0227R73J1332l23N731l13m981r513j0496j4070K236J3246
$$ -5434 3190 6366 -13861 -12888 -1556 -1879 3852 3539 -1442 -10955 -21451 -35521 -33285 -20039
5268b0039M386K230K7422L057n877j1670N832n217J3391R032n586q127j1043J818
$$ -20039 -15653 -13423 13999 17056 11179 -491 5341 124 13515 22547 16961 8834 -2209 -391
5254c91O052Q087l52p356k034m657r024Q105K857j5230J2177J3661P613J0060
$$ -391 5661 13748 13396 6040 4006 -651 -9675 -1570 1287 -13943 -1766 11895 19508 29568
5240B9568J2914r220k9098j1709J3776N218m960M202q20k59m786R669j798l021
$$ 29568 42482 33262 4164 -7545 6231 11449 6489 10691 9871 9612 4826 14495 12697 9676
5226I676Q630L330p219q590Q530l502P11j3263n091J1086J2716j849m685M492
$$ 9676 18306 21636 14417 5827 14357 10855 11566 -1697 -6788 4298 17014 15165 10480 14972
5212A4972n962j394K147m150Q454J3410Q426n585j6878r913K992R059J1529j6349
$$ 14972 9010 7616 9763 5613 14067 27477 35903 30318 13440 3527 6519 15578 27107 10758
5198A0758k3504l584J3972J7609J6546n798j4447j1170O560O811K869j4190q941
$$ 10758 -12746 -16330 -2358 15251 31797 25999 11552 382 6942 13753 16622 2432 -6509
5185f509P682m703j3679J4100P417j1641R607j2160J879O119P126O62p224m467
$$ -6509 1173 -3530 -17209 -3109 4308 -7333 2274 -9886 -8007 -1888 5238 5900 -1324 -5791
5171e791J168l695L133J865R842J6886k603j3116n624j5155L511M812m552m689
$$ -5791 -4623 -8318 -5185 -3320 6522 23408 20805 7689 2065 -13090 -9579 -4767 -9319 -14008
5157a4008j303O113J2616L655r329j2861p32J6891J7131m973L765j4048q910p909
$$ -14008 -15311 -9198 3418 7073 -2256 -15117 -15849 1042 18173 13200 16965 2917 -5993 -13902
5143a3902j1008J2657N946j3305r73k321l616O073L983L298k614J114L891m227
$$ -13902 -24910 -12253 -6307 -19612 -20585 -22906 -26522 -20449 -16466 -13168 -15782 -14668 -10777 -15004
5129a5004J1438J8497j589r21j7554r503p221J0648K886P604L240k315j9682k878
$$ -15004 -3566 14931 13342 12421 -5133 -14636 -21857 -11209 -8323 -719 2521 206 -19476 -22354
5115b2354J0542L587J6760O654k3687j8280j466J6745M482p550k785N115K807
$$ -22354 -11812 -8225 8535 15189 -8498 -26778 -28244 -11499 -7017 -14567 -17352 -12237 -9430
5102i430m33K281j1819m528o438j104J6206R365j493L767L898L169L104j072k365
$$ -9430 -9863 -7582 -19401 -23929 -30367 -31471 -15265 -5900 -7393 -3626 272 3441 6545 5473 3108
5087C108r748p258K076J317J7245K47m122O810M427n001r511n077M440n034N692
$$ 3108 -6640 -13898 -11822 -10505 6740 6987 2865 9675 14102 9101 -410 -5487 -1047 -6081 -389
5072c89J1400k785o666P58L87k943J302o24K038R843J0049M490O04O113j8994
$$ -389 11011 8226 1560 2318 2705 -238 1064 440 2478 12321 22370 26860 27464 33577 14583
5057A4583j4742P50k3Q551L558r519r915q615R97j0420J079J6403J7701N099R12
$$ 14583 -159 591 568 9119 12677 3158 -6757 -15372 -14375 -24795 -23716 -7313 10388 15487 16399
5042A6399j3973l900l154J318k561m418K767j718o975K452N935M229R977J4392
$$ 16399 2426 -1474 -4628 -3310 -5871 -10289 -7522 -9240 -16215 -13763 -7828 -3599 6378 20770
5028B0770j150j8233k856N978R242J1036P12q812k5578m835l486J1761R350q081
$$ 20770 19620 1387 -1469 4509 13751 24787 25499 16687 -8891 -13726 -17212 -5451 3899 -4182
5014d182j2883j4522O643J9467N088L011l101r895R741p702j7428j4950J5189
$$ -4182 -17065 -31587 -24944 -5477 -389 2622 -479 -10374 -633 -8335 -25763 -40713 -25524
5001b5524K4026N681M118P45l150o636J1105m518k1186m109K458O559Q081r504
$$ -25524 -1498 4183 8301 9046 5896 -740 10365 5847 -15339 -19448 -16990 -10431 -2350 -11854
4987a1854l144N193K770N824j1301q244J5894o58O718O594q364l494l244O052
$$ -11854 -14998 -9805 -7035 -1211 -12512 -20756 -4862 -5520 1198 7792 -572 -4066 -7310 -1258
4973a258K636P061Q606j1218l258p868j3120r706Q497J1964J0124J4311R014k046
$$ -1258 1378 8439 17045 5827 2569 -5299 -18419 -28125 -19628 -7664 2460 16771 25785 23739
4959B3739J503j5180l663L48J0138r87o055r925K816J7515n49l711j0348k446
$$ 23739 25242 10062 6399 6747 16885 15898 9843 -82 2734 20249 19700 15989 5641 3195
4945C195q927P69M631k452O9k981L261J3819K195j1798j0507j87r82l443Q698
$$ 3195 -5732 -4963 -332 -2784 -2715 -5696 -2435 11384 13579 1781 -8726 -8913 -9895 -13338 -4640
4930d640K596j748P009j0600L143k703k979L531N312J3279J0718j5904k1088j047
$$ -4640 -2044 -3792 3217 -7383 -4240 -6943 -9922 -6391 -1079 12200 22918 7014 -14074 -15121
4916a5121J0876J8451K452k00K074o610j2446k6385R554P158Q846m951l926P995
$$ -15121 -4245 14206 16658 16458 18532 11922 -524 -26909 -17355 -10197 -1351 -6302 -10228 -2233
4902b233j827L416N391L727r038j7627l872L735j5396n012J5598K6886O499j6708
$$ -2233 -4060 -644 4747 8474 -564 -18191 -22063 -18328 -33724 -38736 -23138 3748 10247 -6461
4888f461k64l427L966J1849j1143l087K960O54P862M432m57M502l003O555j1314
$$ -6461 -6725 -10152 -6186 5663 -5480 -8567 -5607 -4953 2909 7341 6884 11386 8383 14938 3624
4873C624j2074M286M581Q457R772j1810k3718o272O692J7615J0716l212M524j0608
$$ 3624 -8450 -4164 417 8874 18646 6836 -16882 -23154 -16462 1153 11869 8657 13181 2573
4859B573j3296R33J1173J2068k854j4278O193J3107J8723n169j9747r571K146
$$ 2573 -10723 -9790 1383 13451 10597 -3681 2512 15619 34342 29173 9426 -145 2001
4846B001n846m50J6044J0117n174j8242l494L938R308N012p095j769L97J1384
$$ 2001 -3845 -4295 11749 21866 16692 -1550 -5044 -1106 8202 13214 6119 4350 4747 16131
4832A6131l061j723J396j1526j450Q644m686j4228j5304k116K0835Q665l151j619
$$ 16131 13070 11347 12743 1217 -233 8411 3725 -10503 -25807 -27923 -7088 1577 -1574 -3193
4818c193J318O731m454q670q917k120M170J06m45L519j22K991L721L838J0391
$$ -3193 -1875 4856 402 -8268 -17185 -19305 -15135 -15029 -15474 -11955 -12077 -9086 -5365 -1527 8864
4803H864o952o193l763k988R981j2949P4N976J2978J2863j3246j246P957K014
$$ 8864 1912 -4281 -8044 -11032 -1051 -14000 -13926 -7950 5028 17891 4645 3399 11356 13370
4789A3370l542j1792j2384J6706P482K127J2334O236j2808m277o550q423j0163
$$ 13370 9828 -1964 -14348 2358 9840 11967 24301 30537 17729 13452 6902 -1521 -11684
4776a1684k2J659j616l07o59k818k958p233j0105J0701L852L685M583j225M218
$$ -11684 -11706 -10047 -11663 -11970 -12629 -15447 -18405 -25638 -35743 -25042 -21190 -17505 -12922 -14147 -9929
4761i929J5402k992M127o291j1326P444Q80K759J5272O152J744J1381j667m067
$$ -9929 5473 2481 6608 317 -11009 -3565 -2685 74 15346 21498 23242 34623 32956 28889
4747B8889j2534j2407j0223L628J0966R991P252l636n583n497j9387j5373q776
$$ 28889 16355 3948 -6275 -2647 8319 18310 25562 21926 16343 10846 -8541 -23914 -32690
4734c2690K673Q272P913J71J050L066N250L756J1196j2330n685J8924j16n208
$$ -32690 -30017 -21745 -13832 -13661 -12611 -9545 -4295 -539 10657 -1673 -7358 11566 11450 6242
$$ [...]
##END NTUPLES=NMR SPECTRUM
##END=
