##TITLE=Analysis number 315155
Compound Code ac 25875
Project Code adrs
Chemist Name acros
##JCAMPDX= 6.0         $$ Bruker NMR JCAMP-DX V2.0
##DATA TYPE= NMR SPECTRUM
##DATA CLASS= NTUPLES
##ORIGIN= Bruker BioSpin GmbH
##OWNER= NMR
$$ XWIN-NMR		Version 3.5
$$ Wed Nov  9 12:50:18 2005 GMT Standard Time (UT+0h)  MAYBRIDGE\NMR@NMR_250MHZ
##.OBSERVE FREQUENCY= 250.131544655141
##.OBSERVE NUCLEUS= ^1H
##.ACQUISITION MODE= SIMULTANEOUS (DQD)
##.ACQUISITION SCHEME= undefined
##.AVERAGES= 16
##.DIGITISER RES= 18
##SPECTROMETER/DATA SYSTEM= dpx250
##.PULSE SEQUENCE= zg30
##.SOLVENT NAME= CDCl3
##.SHIFT REFERENCE= (INTERNAL, CDCl3, 0, 16.522)
##AUDIT TRAIL= $$ (NUMBER, WHEN, WHO, WHERE, WHAT)
$$ ##TITLE= Audit trail, XWIN-NMR		Version 3.5
$$ ##JCAMPDX= 5.01
$$ ##ORIGIN= Bruker BioSpin GmbH
$$ ##OWNER= NMR
$$ C:\u/data/dgb/nmr/ADRS/12080/pdata/1/auditp.txt
$$ ##AUDIT TRAIL=  $$ (NUMBER, WHEN, WHO, WHERE, WHAT)
(   1,<2005-11-09 12:49:31.00 +000>,<MAYBRIDGE\NMR>,<NMR_250MHZ>,
      <created by zg, POWCHK disabled, PULCHK disabled
       configuration hash MD5:
       62 19 C7 07 E1 42 D1 B7 37 6C 3D D0 77 39 F9 E6
       data hash MD5: 64K
       13 7A D2 BF 93 04 82 AF B2 7F 2F 8A 4C 2D 93 CD>)
(   2,<2005-11-09 12:49:49.94 +000>,<MAYBRIDGE\NMR>,<NMR_250MHZ>,
      <Start of raw data processing
       ef LB = 0.3 FT_mod = 6 PKNL = 1 SI = 32K 
       data hash MD5: 32K
       C2 DA 83 42 05 B9 EF 0C 10 B6 ED 58 FF 9E B3 7E>)
(   3,<2005-11-09 12:49:54.96 +000>,<MAYBRIDGE\NMR>,<NMR_250MHZ>,
      <apk 
       data hash MD5: 32K
       FD D6 19 13 EA 76 4C CC C7 AD 25 27 35 4A 6C EC>)
(   4,<2005-11-09 12:49:59.03 +000>,<MAYBRIDGE\NMR>,<NMR_250MHZ>,
      <abs ABSG = 5 
       data hash MD5: 32K
       3A 74 F0 B8 36 80 57 6A EB B0 22 00 20 1F 3B 0B>)
$$ ##END=
$$ 
$$ hash MD5
$$ BC 2C 31 EC A0 DF F0 4C 30 AB D6 03 6A 09 A5 8E
##$RELAX= 
##$RELAX= 
##$RELAX= 
##$RELAX= 
##$RELAX= 
##$RELAX= 
##$RELAX= 
$$ Bruker specific parameters
$$ --------------------------
##$DU= <C:\u>
##$EXPNO= 12080
##$NAME= <ADRS>
##$PROCNO= 1
##$TYPE= <nmr>
##$USER= <dgb>
##$AMP= (0..31)
100 100 100 100 100 100 100 100 100 100 100 100 100 100 100 100 100 100 
100 100 100 100 100 100 100 100 100 100 100 100 100 100 
##$AQSEQ= 0
##$AQ_mod= 3
##$AUNM= <au_zg>
##$AUTOPOS= <31 >
##$BF1= 250.13
##$BF2= 250.13
##$BF3= 250.13
##$BF4= 250.13
##$BF5= 500.13
##$BF6= 500.13
##$BF7= 500.13
##$BF8= 500.13
##$BYTORDA= 1
##$CFDGTYP= 0
##$CFRGTYP= 5
##$CHEMSTR= <none>
##$CNST= (0..31)
1 1 145 1 1 1 1 1 1 1 1 1 1 1 1 1 1 1 1 1 1 1 1 1 1 1 1 1 1 1 1 1 
##$CPDPRG= <>
##$CPDPRG1= <>
##$CPDPRG2= <>
##$CPDPRG3= <>
##$CPDPRG4= <mlev>
##$CPDPRG5= <mlev>
##$CPDPRG6= <mlev>
##$CPDPRG7= <mlev>
##$CPDPRG8= <mlev>
##$CPDPRGB= <>
##$CPDPRGT= <>
##$D= (0..31)
0 1 0 0 0 0 0 0 0 0.06 0 0 0 0 0 0 0.0002 0 0 0 0 0 0 0 0 0 0 0 0 0 0 
0 
##$DATE= 1131540569
##$DBL= (0..7)
120 120 120 120 120 120 120 120 
##$DBP= (0..7)
150 150 150 150 150 150 150 150 
##$DBP07= 0
##$DBPNAM0= <>
##$DBPNAM1= <>
##$DBPNAM2= <>
$$ [...]
##$SUBNAM7= <"">
##$SUBNAM8= <"">
##$SUBNAM9= <"">
##$SW= 20.6930455092707
##$SWIBOX= (0..15)
0 0 3 0 0 0 0 0 0 0 0 0 0 0 0 0 
##$SW_h= 5175.983436853
##$TD= 65536
##$TD0= 1
##$TE= 295.16
##$TE2= 300
##$TE3= 300
##$TEG= 300
##$TL= (0..7)
0 120 120 120 120 120 120 120 
##$TP= (0..7)
150 150 150 150 150 150 150 150 
##$TP07= 0
##$TPNAME0= <>
##$TPNAME1= <>
##$TPNAME2= <>
##$TPNAME3= <>
##$TPNAME4= <>
##$TPNAME5= <>
##$TPNAME6= <>
##$TPNAME7= <>
##$TPOAL= (0..7)
0.5 0.5 0.5 0.5 0.5 0.5 0.5 0.5 
##$TPOFFS= (0..7)
0 0 0 0 0 0 0 0 
##$TUNHIN= 0
##$TUNHOUT= 0
##$TUNXOUT= 0
##$USERA1= <user>
##$USERA2= <user>
##$USERA3= <user>
##$USERA4= <user>
##$USERA5= <user>
##$V9= 5
##$VALIST= <valist>
##$VCLIST= <CCCCCCCCCCCCCCC>
##$VD= 0
##$VDLIST= <DDDDDDDDDDDDDDD>
##$VPLIST= <PPPPPPPPPPPPPPP>
##$VTLIST= <TTTTTTTTTTTTTTT>
##$WBST= 1024
##$WBSW= 4
##$XGAIN= (0..3)
0 0 0 0 
##$XL= 0
##$YL= 0
##$YMAX_a= 478362
##$YMIN_a= -498309
##$ZGOPTNS= <>
##$ZL1= 120
##$ZL2= 120
##$ZL3= 120
##$ZL4= 120
##$ABSF1= 16.522
##$ABSF2= -4.171173
##$ABSG= 5
##$ABSL= 3
##$ALPHA= 0
##$AQORDER= 0
##$ASSFAC= 0
##$ASSFACI= 0
##$ASSFACX= 0
##$ASSWID= 0
##$AUNMP= <proc_1d>
##$AZFE= 0.1
##$AZFW= 0.1
##$BCFW= 0
##$BC_mod= 0
##$BYTORDP= 0
##$COROFFS= 0
##$CY= 12.5
##$DATMOD= 1
##$DC= 0
##$DFILT= <>
##$DTYPP= 0
##$F1P= 14.0000005364418
##$F2P= -0.99999901652339
##$FCOR= 0.5
##$FTSIZE= 32768
##$FT_mod= 6
##$GAMMA= 0
##$GB= 0
##$INTBC= 1
##$INTSCL= 1
##$ISEN= 128
##$LB= 0.3
##$LEV0= 0
##$LPBIN= 0
##$MAXI= 10000
##$MC2= 0
##$MEAN= 0
##$ME_mod= 0
##$MI= 0
##$NCOEF= 0
##$NC_proc= -2
##$NLEV= 6
##$NOISF1= 0
##$NOISF2= 0
##$NSP= 0
##$NTH_PI= 0
##$NZP= 0
##$OFFSET= 16.522
##$PC= 1
##$PHC0= 82.49484
##$PHC1= -3.370825
##$PH_mod= 1
##$PKNL= yes
##$PPARMOD= 0
##$PSCAL= 4
##$PSIGN= 0
##$REVERSE= no
##$SF= 250.13
##$SI= 32768
##$SIGF1= 0
##$SIGF2= 0
##$SINO= 400
##$SIOLD= 32768
##$SREGLST= <1H.CDCl3>
##$SSB= 0
##$STSI= 32768
##$STSR= 0
##$SW_p= 5175.98343685301
##$SYMM= 0
##$S_DEV= 0
##$TDeff= 65536
##$TDoff= 0
##$TI= <Analysis number 999999
Compound Code 99
Book Reference 9
Project Code 9>
##$TILT= no
##$TM1= 0
##$TM2= 0
##$TOPLEV= 0
##$USERP1= <user>
##$USERP2= <user>
##$USERP3= <user>
##$USERP4= <user>
##$USERP5= <user>
##$WDW= 1
##$XDIM= 32768
##$YMAX_p= 282161334
##$YMIN_p= -102975
$$ End of Bruker specific parameters
$$ ---------------------------------
##NTUPLES= NMR SPECTRUM
##VAR_NAME=  FREQUENCY,     SPECTRUM/REAL,   SPECTRUM/IMAG
##SYMBOL=    X,             R,               I
##VAR_TYPE=  INDEPENDENT,   DEPENDENT,       DEPENDENT
##VAR_FORM=  AFFN,          ASDF,            ASDF
##VAR_DIM=   32768,         32768,           32768
##UNITS=     HZ,            ARBITRARY UNITS, ARBITRARY UNITS
##FACTOR=    0.157963299565203, 1,           1
##FIRST=     4132.6476996994, 0,             0
##LAST=      -1043.33573715361, 0,           0
##MIN=       -1043.33573715361, -102975,     0
##MAX=       4132.6476996994, 282161334,     0
$$ Real data points
##PAGE= N=1
##DATA TABLE= (X++(R..R)), XYDATA
$$ [...]
24294A0990j638J3947q301j9590P550P843o787q158O878M394r668J215k524K032
24280a817R310m862j4143p305N240r410K279O255L0228n646j6825J431r961M926
24266a0300M139J6887J3976j6371k6045k004J6476M370j4857j117l388k173m973
24253b5380P518N427N487K319O234k870q071J3768K1563p904o704k942R65J377
24239A0787j0786r60q360j6817k066J118J3596P166j9977J6046J0645J205q582
24226f985L354K0034N705n7M616n168j5245m687o008N481R702p184j6930r739
24212b3111k259J9794O497L616n310J156J2006r458l671m208l599m40L992J5371
24198A0376j5322j2541J2100K1957K640j3028k6567J160j1703J5707Q145Q73J465
$$ y = [10990, 9352, 23299, 14998, -4592, 2958, 10801, 4014, -4144, 2734, 7128, -2540, -1325, -3849, -1817, 7493, 2631, -11512, -18817, -13577, -22987, -20708, -14453, 15775, 10129, -6696, -5265, -15226, -10300, -6161, 10726, 24702, 8331, -17714, -19718, -3242, 1128, -13729, -14846, -18234, -20407, -25380, -17862, -12435, -6948, -4629, 1605, -1265, -9336, 4432, 25995, 18091, 11387, 8445, 9410, 10787, 1, -959, -9319, -26136, -28202, -27084, -13488, -6322, -26299, -10253, 392, 1597, -6985, -3631, 16403, 22108, 22051, 26667, 21499, 6254, 1567, -4441, 1040, 10742, 3558, -13372, -23111, -25370, -5576, 921, 4537, -773, 383, 12389, 2931, -740, -4948, -8547, -8987, -4995, 10376, -4946, -17487, -5387, 16570, 19210, 6182, -20385, -19225, -30928, -15221, -7076, -6203, -4738]
24185d738L270j091q93j408R339O922j5528l419J176M185j3739j0228k70J1867
24171a4555P109j0887J256L201R518P308n123j0234M166O54Q932O771M536J0110
24157B2762j19j1125q314j7322j8410M564J0621J4294L126q622J4521l274q356
24144e654o682N637Q041P083n01N6j2764K794J388j1819J050K8562O14j4655j0071
24129f921l212P169j840j5590J2215N206j063o179l095P223l93m016q54K2333
24115A0983L118M739K454j0953r16P671j5714K876J3682K710n911o776M37k620
24101E780r150O542j540k208P394l17Q494J167K904p035j3852M812n517K085J4890
24086A4449j6948j4056J071O251J7086j0743j7109P509N992n594J9R252L586M373
$$ y = [-4738, -1468, -2559, -3452, -4860, 4479, 11401, -4127, -7546, -6370, -2185, -15924, -26152, -26422, -14555, -7446, -18333, -17077, -13876, -4358, 2950, -2173, -12407, -8241, -7587, 1345, 8116, 12652, 22762, 22643, 11518, 3204, -14118, -32528, -27964, -17343, -3049, 77, -8545, 5976, 2702, -5654, -12336, -6699, 1342, 8425, 7924, 7980, -4784, -1990, -602, -12421, -11371, 17191, 17805, 3150, -6921, -10133, -2964, -4804, -20394, -8179, -2973, -4036, -10215, -13310, -6087, -6480, -10496, -11350, 10983, 14101, 18840, 21294, 10341, 9425, 17096, 1382, 4258, 17940, 20650, 14739, 7963, 8400, 5780, -3370, 3172, 1632, -576, 6818, 6501, 14995, 16162, 19066, 12031, -1821, 2991, -2526, -441, 14449, -2499, -16555, -15484, -9233, 7853, -2890, -19999, -12490, -6498, -12092, -12073, -2821, 765, 5138]
24072E138M195k493O591r159k068j874J530K1490Q244m081n817j9934j795m201
24058d234N98k449o111o205P584L57m185O83M301L056p72p921n770O899j178q621
24042b3968k714J366Q840J2278o587Q300O153j0505L542J528j0755j2295l007
24029b7824L088K7095J1583j3293l576R634m128L393L65N713j1452p964J5218
24016G852o322j4919J0726J5359j1863l833N623M856K815p150K680m208k077J2574
24002A2113K461J816j2146O895M288q460R708M397k068p079o436J1076j270l990
23988A1305j5558K422k978k038j1041J774O50K6301J9634j7368p851J2533Q848
23975B6633K023l160j2094j8429q753Q341R110P815K842j3911m904n77J4226L039
$$ y = [5138, 9333, 6840, 13431, 4272, 2204, 330, 1860, 23350, 31594, 27513, 21696, 1762, -33, -4234, -3636, -6085, -12196, -18401, -10817, -10460, -14645, -13962, -9661, -6605, -7377, -15298, -21068, -14169, -15347, -23968, -26682, -25316, -16476, -4198, -10785, -2485, 3668, -6837, -3295, -1767, -12522, -24817, -27824, -24736, 2359, 13942, 649, -2927, 6707, 2579, 5972, 6337, 12050, 598, -7366, 7852, 1530, -13389, -2663, 12696, 833, -3000, 2623, 7479, 10294, 3144, 5824, 1616, -461, 12113, 14574, 16390, 4244, 11139, 15427, 6967, 16675, 21072, 19004, 11925, 5489, 16565, 15295, 11305, -4253, -1831, -4809, -6847, -17888, -16114, -15464, 10837, 30471, 13103, 5252, 17785, 26633, 28656, 25496, 13402, -5027, -13780, -5439, 3671, 11486, 14328, 417, -4487, -5064, 9162, 12201]
23961A2201m350k318J816j1927l445r572R736N387j213j3552M67M542J1194J1242
23947A0208k629j0792j2099r137J1910K7721K081m696P477k941j5098M725k342
23934D388j2364N02O116K3415L210l997o499m299K151M993n56j1225m199L698
23920E334k921n419P783J88J1378r020j1161j2905l839k500K0774J8739P36p099
23906A0068j043q355p481J650m997R065J4026O57N233j1133l263J721M025j474
23892H699j5995k465N58J0805O638l714N295J5373n422k0369k0862L640J0525
23879g294J3601n84q860r785K481Q815p303o55m105R220N11p378q546p844J9524
23864h202J2295l543oj6462K556J1017j1297j1079Q239K0937J2844j2734j4754
$$ y = [12201, 7851, 5533, 7349, -4578, -8023, -17595, -7859, -2472, -3685, -17237, -16770, -12228, -1034, 10208, 7579, -3213, -15312, -24449, -12539, 15182, 17263, 12567, 20044, 17103, 2005, 6730, 4388, -7976, -7474, -1358, 22057, 25267, 21270, 14771, 10472, 12623, 17616, 17060, 5835, 1636, 5334, 2413, -3006, 4777, 4965, 16343, 7323, -3838, -16743, -20582, -23082, -2308, 16431, 17167, 10068, 9025, 670, -6811, -5161, -10158, -1093, 12933, 13590, 18823, 7690, 4427, 6148, 10173, 8699, -7296, -9761, -9203, 1602, 8240, 4526, 9821, 25194, 19772, -597, -21459, -17819, -7294, 6307, 5723, -3137, -12922, -10441, -1626, -8929, -9584, -13689, -4469, -3958, -11336, -19882, -27726, -8202, 4093, 550, 544, -15918, -13362, -2345, -13642, -24721, -16482, 4455, 17299, 4565, -10189]
23851a0189P126N133r618N78J7304O570K528q249q011Q577q89l038n747j801O405
23836F679j1199j1187M499J189J111J4418m041K376J6156J838l077J338j6144
23823C956j804R859P068r362j1887j956k013k877K1110k2099p074J0750M121J1699
23809I491R381m947o199k38j3179o866J2953n227K927J2938R03j4626j4356K404
23795a4641J2416J2650J1280j3611j374J794j018k05M989m410R036J2220n626
23782B3500j1610k3660j405K3902J4400j240k20j3496j5233L408J575O125M211
23769A0257k525J149N869j8548j9749j6419M470J4771J1302J26P183q3K025L697
23755C525P08o90K828j6909j6325J6844J5143J0619m000j3872J925J047L749K242
$$ y = [-10189, -3063, 2070, -7548, -6970, 10334, 16904, 19432, 11183, 3172, 11749, 10860, 7822, 2075, 274, 6679, -4520, -15707, -11208, -10019, -8908, 5510, 1469, 3845, 20001, 21839, 18762, 20100, 3956, 2152, 12011, 19079, 9717, -2170, -4126, -6139, -9016, 12094, -10005, -17079, -6329, -2208, 9491, 18872, 13925, 7726, 7488, -5691, -12557, 396, -4831, -1904, 11034, 11937, -2689, -17045, -14641, -2225, 10425, 21705, 8094, 6720, 8514, 7496, 7291, 12280, 7870, 16906, 29126, 23500, 11890, -11770, -13175, 10727, 25127, 23887, 23667, 10171, -5062, -1654, -79, 6046, 10257, 7732, 8881, 14750, -3798, -23547, -39966, -35496, -20725, -9423, -9297, -2114, -2197, -172, 3525, 4233, 3543, 6371, -10538, -26863, -10019, 5124, 15743, 11743, -2129, -204, 843, 4592, 6834]
23741F834n714M043J3529k1481n294Q294n499o678r475J0839L154r840j6739j185
23727c5212J9417R063J8586p883o509J4643p807O023j2969k527j4026j2683J2993
23714a8891J4412M208Q616O324M776J129k0937o640j3146k3371J2310R765m801
23701b6246K517O867J5686J806Q850j308k229J0034O55j1515R168N335j1100j4045
23687e525J753J766j903m585m473O724R508j0935K264J3945O513j5963J3974N62
23673A3625j0258q265L465L781M955O059j5085j6486l461J5861J5384j331p575
23660F69j1589J668J3878n599n431n270J280Q500J3791Q49J2146n368n110J910
23646A6324j3032l541m925o421Q963J9516k749J1318r961k4990o189J4803r43
$$ y = [6834, 1120, 5163, 18692, -2789, -8083, 211, -5288, -11966, -21441, -10602, -7448, -17288, -34027, -35212, -15795, -6732, 11854, 3971, -2538, 12105, 4298, 10321, -2648, -5175, -19201, -31884, -18891, -4479, -271, 8345, 14669, 19445, 20574, -363, -7003, -20149, -43520, -31210, -21445, -26246, -23729, -16862, -1176, 630, 9480, 8172, 5943, 15977, 16632, 5117, 14285, 19620, 8520, -5525, -3772, -2006, -3909, -8494, -12967, -6243, 3265, -7670, -5406, 8539, 15052, -911, 13063, 13625, 3367, -4898, -1433, 2348, 7303, 13362, -1723, -18209, -21670, -5809, 9575, 8244, 669, -10920, -9252, 4626, -973, -6404, -11674, -10394, -1894, 11897, 12746, 24892, 19524, 14414, 16324, 3292, -249, -5174, -11595, -2632, 16884, 14135, 25453, 15492, -9498, -15687, -884, -1827]
23633a827m378K131m432k316J329K688J5291J3037r773j6824p580O64L982K215
23619e793j062k3225l957P490L721j274O486J5017O64R241Q305o784j7213q976
23605a7360k821j70l971Q938Q925M910M610R372R028n103k409j192j0368k956
23591e67n49j515K822q04k997j71J061Q397Q51n381l73j278L170P800L166j1017
23575B615j7958p433O171K054M349J6505q954l675n757Q359k729q921R707k267
23561g934R039N763r993p083Q378j3014r125J3549p351N101J3643o984L374R455
23547F818o554l519N043j1071j4938J349L619J0430L941l630l944j2581Q303J2606
23533d128p849N832P69o635K479K76N676N515P773k58O709L617q646L165J526
$$ y = [-1827, -6205, -4074, -8506, -10822, -9493, -6805, 8486, 21523, 11750, -5074, -12654, -11990, -8008, -5793, -6855, -30080, -34037, -26547, -22826, -24100, -17614, -2597, -1933, 7308, 15613, 8829, -8384, -17360, -20181, -20351, -24322, -15384, -6459, -1549, 3061, 12433, 21461, 16358, 13949, 12757, 2389, -567, -1116, -2631, 191, -613, -3610, -3781, -2720, 5677, 6528, 1147, 774, -504, 2666, 10466, 13632, 2615, -15343, -22776, -16605, -14551, -10202, 6303, -2651, -6326, -12083, -3724, -6453, -15374, -5667, -7934, 1105, 6868, -3125, -10208, -1830, -14844, -23969, -10420, -17771, -12670, 973, -6011, -2637, 6818, 264, -3255, 1788, -9283, -24221, -22872, -19253, -8823, -4882, -8512, -12456, -25037, -16734, -4128, -11977, -6145, -5376, -12011, -9532, -9256, -3580, 1935, 9708, 9450, 16159, 19776, 11130, 14295, 15821]
23518A5821r751r606N768r559J925L953j3140k858R694p335j7363K579L919M421
23504b1532J2605L0474L733j2993q738n762k426K405r220R458O627n681m892J1207
23490E265J244o491o780n861M591J2763N445Q640j2478j2234m56Q743J6786p811
23476A1366j2963j0019j3871K389J8503J8144k909j5497j7270j528J6869J2780
23464E994J334J1206j1749l679k249n414n557j1432l052J486J4043J2383Q436
23451A1750R76m524q037n696k0662M194K5896R225M990p394J267K273r575j117
23437C566P660L981j514j1301Q296R509q57o941o72p4j1761J4412k64j1237j598
23422A205q798l989p89l346r988j0371M458J8205L311j7516m685J4876J1458j4170
$$ y = [15821, 6070, -3536, 2232, -7327, -5402, -1449, -14589, -17447, -7753, -15088, -32451, -29872, -25953, -21532, -8927, 21547, 25280, 12287, 3549, -2213, -4639, -2234, -11454, -1996, 4631, -1050, -5942, 5265, 6509, 18, -6762, -12623, -8032, 4731, 10176, 18816, 6338, -5896, -6352, 2391, 19177, 11366, -1597, -11616, -25487, -23098, -4595, 13549, 10640, -4857, -22127, -23655, -6786, 5994, 7328, 18534, 6785, 3106, 857, -4557, -10114, -21546, -24598, -23112, -9069, 3314, 11750, 12726, 8202, 165, -5531, -26193, -21999, 3897, 13122, 18112, 10718, 11985, 14258, 4683, 3566, 11226, 15207, 13693, 2392, 10688, 20197, 19340, 12399, 11727, 11653, -108, 14304, 14040, 2803, 1205, -7593, -11582, -12371, -15717, -25705, -36076, -31618, -13413, -10102, -27618, -32303, -17427, -5969, -20139]
23408b0139k96J868J9989K087K836k0311j580j025j2849o900N353K1804L901j2501
23394a7763J3275M120n955n900L339J2417P973p185j2632J726L692r988Q898N073
23380A090j2015n936q260N754J554p266j3705l565K2742L343J972M764N778j3135
23366a6885L211J8604K892o967o89P583J898p770j5702n480J0802Q490R545J9240
23352B8772l353j6784M282p782j2630j147q277Q399R206j0507J931P809R337j1
23338I245O25k295r221j209j182k992J2954K019l204j2562r840Q63J1002P599
23324A802n479j4158j0804l577J5382M85j435l447J020O047J1443j990K977J315
23310d19j1761Q918R459L452P308R363j4904r654p223j1494j3153K482m718J446
$$ y = [-20139, -20435, -18567, 1422, 3509, 6345, -13966, -15546, -16571, -29420, -36320, -30967, -9163, -5262, -17763, -4488, -368, -6323, -12223, -8884, 3533, 11506, 4321, -8311, -6585, -2893, -12881, -3983, 1090, -10925, -16861, -25121, -19367, -17813, -25079, -38784, -42349, -19607, -16264, -14292, -9528, -3750, -16885, -13674, 4930, 7822, 855, 166, 7749, 9647, 1877, -13825, -19305, -8503, -13, 9532, 28772, 25419, 8635, 12917, 5135, -7495, -8642, -16919, -8520, 686, -9821, -7890, -81, 9256, 9245, 9870, 7575, -1646, -2855, -4037, -7029, 5925, 7944, 4740, -7822, -17662, -16799, -5797, 1802, -3677, -17835, -28639, -32216, -16834, -16349, -17784, -21231, -20211, -14164, -2721, -4711, -1734, -419, -12180, -3262, 6197, 9649, 16957, 26320, 11416, 1762, -5461, -16955, -30108, -27626, -32344, -30898]
23296c0898L308J2801J9524O643j519J7926J41j7462j0026j9125N897J3277J6936
23283A7423Q741j283m808p690m523O731L265p778q346N338K962l549p795r597
23269a0909M118L93j0982l882J4446R481N718L543j235K118L505M16M992J1374
23255C3096n508r574j4366q7K724K340k084q16j7584j4360p128j232K1421J0400
23241b758o718J1422Q617R110M73R0q986N794o448j1922N241L325o594P693k53
23226H086R692p262j0270N808J4512R955j7456k3178j5991n99Q611j727n47K632
23212a7734R209N031J1427Q267L440q710r672J8611k901n528Q122r117j8583J0358
23198B220L668M468o73m274M158j107l249m217p630j3516J2496N980l459q298
$$ y = [-30898, -27590, -14789, 4735, 11378, 9859, 27785, 27926, 10464, 438, -18687, -12790, 487, 17423, 26164, 24881, 20073, 12383, 7860, 14591, 17856, 10078, 1732, 7070, 10032, 6483, -1312, -10909, -6791, -6398, -17380, -21262, -6816, 2665, 8383, 11926, 10691, 12809, 16314, 16730, 21722, 33096, 27588, 18014, 3648, 3561, 6285, 8625, 6541, 5725, -11859, -26219, -33347, -34579, -13158, -2758, -9476, 1946, 10563, 19673, 20146, 20236, 11250, 17044, 10596, -1326, 3915, 7240, 646, 8339, 8086, 17778, 10516, 246, 6054, 20566, 30521, 13065, -10113, -26104, -26703, -18092, -19819, -20366, -17734, -8525, -3494, 7933, 16200, 19640, 10930, 1258, 19869, 16968, 11440, 19562, 10445, -8138, 2220, 5888, 10356, 9683, 5409, 9567, 8460, 5211, 994, -6636, -20152, -7656, -1676, -5135, -13433]
23184a3433Q315J5036J2075j1322n221J3341k3254j5260j781J8464q4j2248j0912
23171b6284K709J3305l547n746J4774J605q003M342q648l937J3999K2039o252
23158A0356k446m477q673n122O204l442n862l123J1361P912J3050M164j3832j1421
23144e351p036L386J0690o035j0832O880m203N70n542p34O723O331N574J681N52
23129B654q204l749O326m890j2043O534K2499J1611J144j0501j9425j0074m948
23116b3066K789O870J4075Q753p824o448K998J4035r286r25j2635l203J3749M249
23102D131j0854p660M5J6880j214L900J38j3666J401L474N907o955R704m461k891
23087b121P584q173l388r515J4166j695o257q727j5490n629J1684N131j262j305
$$ y = [-13433, -5118, 9918, 21993, 10671, 5450, 18791, -4463, -19723, -21504, -3040, -3124, -15372, -26284, -23575, -10270, -13817, -19563, -4789, -3184, -11187, -6845, -15493, -19430, -5431, 16608, 10356, 7910, 3433, -5240, -10362, -4158, -7600, -13462, -16585, -5224, 2688, 15738, 19902, 6070, -5351, -12387, -9001, 1689, -4346, -15178, -8298, -12501, -11931, -17473, -18207, -11484, -5153, 421, 2102, 2654, -5550, -9299, -2973, -7863, -19906, -13372, 9127, 20738, 21882, 11381, -8044, -18118, -23066, -20277, -13407, 668, 9421, 1597, -4851, -1853, 12182, 2896, 1971, -10664, -13867, -118, 4131, -6723, -14383, -14338, 2542, 1328, 5228, 5366, -8300, -6899, -3425, 2482, -4473, 5231, 770, -2121, 5463, -2710, -6098, -15613, -1447, -3142, -9399, -18126, -33616, -39245, -27561, -22430, -23692, -24997]
23073b4997P059L985M24N857j3264J1339n217o096K2351l514j1875Q076J2346
23060F474N682q601j7185j420Q843J2287R597j511L73r637q947k650j435Q489
23046C59N113L486p145r905m468J4399J2218j613j4932j194J68j2440j0244M234
23032b1964N924p531M871J2080J4767J4862O586k971j6716p724q223K44J6702
23019A0907J4451L615j2752o132Q70P422m434l111j686o16j393r139q823R874
23005i47P777q164o899M704J109Q411q500p155N114j417j91m626k823n640J2871
22990f376l850J04J7184J403j5410o349J2754K1201Q917j6085k2181P629P380
22977F321q303p713L64J2249m595Q43J7485P735O143p747j4962r648J2983Q715
$$ y = [-24997, -17938, -13953, -13529, -7672, -20936, -9597, -14814, -20910, 1441, -2073, -13948, -5872, 6474, 12156, 3555, -13630, -15050, -6207, 6080, 15677, 14166, 14539, 4902, -4045, -6695, -8130, 359, 5472, 8958, 1813, -8092, -12560, 1839, 14057, 12444, -2488, -3682, -3514, -15954, -26198, -21964, -16040, -23571, -18700, -6620, 8147, 23009, 29595, 26624, 9908, 2184, -6039, -5795, 10907, 25358, 28973, 16221, 10089, 10959, 18381, 13947, 10836, 9150, 8534, 7141, -1998, -10821, -947, 6830, -1334, -8233, -3529, -2420, 5991, -2509, -9664, -4550, -5967, -6158, -10784, -13607, -19247, -6376, -10226, -10122, 7062, 8465, -6945, -13294, -540, 20661, 29578, 13493, -8688, -1059, 6321, -1982, -9695, -9331, 2918, -1677, -834, 16651, 24386, 30529, 22782, 7820, -1828, 11155, 19870]
22963A9870M308k3661j1642K610K776k1536M89R828k182j321K906J2544J6165
22950A1154j8113k0156J1898Q583j2306k3448l359L058R952J2100P019k279J931
22937a3966J1413j1955K706n019J3410J6835o769n317r351j0163J9103P146r682
22924a609p904j078l121k038r445j2758Q00J0180j614P77J0819j819o58K0995
22910A527j748q441J332J0621J1255q725j8491l169P841Q728O043m71m957j3041
22896a1696j3055O673m979n371q105J419J3567J1200k829J3733L734l663j0256
22883i628P35J389O284J5205n247j4741q542M196o014j0330M405m056j550k989
22869c0883K919J6203j484m750l875m104P519J165j895o765R310K143L049M806
$$ y = [19870, 24178, 517, -11125, -8515, -5739, -27275, -26786, -16958, -19140, -20461, -17555, -5011, 11154, -6959, -27115, -15217, -6634, -18940, -42388, -45747, -42689, -32737, -20637, -13618, -15897, -13966, -2553, -14508, -11802, -16821, -3411, 13424, 6655, 1338, -8013, -18176, 927, 8073, -1609, -9513, -10591, -13712, -15750, -25195, -37953, -37153, -26973, -28587, -27810, -16991, -18810, -19468, 1527, -221, -8662, -7330, 3291, 14546, 5821, -12670, -15839, -7998, 730, 6773, 6302, 1345, -11696, -24751, -18078, -23057, -28428, -36533, -35114, -21547, -10347, -13176, 557, 4291, 628, -9628, -8893, -7504, -1220, 13985, 8738, -6003, -14545, -10349, -16363, -26693, -22288, -26344, -27894, -30883, -27964, -11761, -13245, -17995, -21870, -25974, -18455, -17290, -19185, -25950, -16640, -14497, -11448, -6642]
22855f642O493l194j1376k259j715M668L926L291M737o749k851o382n602K014
22841b1641J1718Q79J2940j69l1165J1255J0754N153n241Q264Q337l6j3147J0888
22827H789j2319j2438L125M438L059k87m704l237L522Q000j123j0865p109O620
22813a4529K7536N535j6136j8074j878L039J901K041J2130M905q97n604P90j4228
22799a3469p142N136J28N66O242J0511J0834Q801J818k272M427R420M29j5642
22785A9787k3888l307o246K026Q019K514J3534P007j2480k1837Q39K0263M494
22772A0725n938k206J0435j2490n868J4038J0922N740q32j3367j2508o705j808
22759i862j0818M599N341J1469J4569P160l907m524K89L591j0966o173k448M626
$$ y = [-6642, -149, -3343, -14719, -16978, -18693, -14025, -10099, -6808, -2071, -8820, -11671, -18053, -23655, -21641, -9923, -9044, 3896, 3727, -27438, -16183, -5429, -276, -5517, 2747, 11084, 11048, -2099, 8789, -3530, -15968, -12843, -8405, -5346, -5633, -10337, -13574, -10052, -2052, -3175, -14040, -21149, -14529, 13007, 18542, 2406, -15668, -17546, -14507, -12606, -10565, 1565, 6470, 5573, -31, 759, -13469, -20611, -15475, -15347, -14781, -8539, 1972, 12806, 21607, 23425, 21153, 25580, 35000, 35429, 19787, -4101, -7408, -13654, -11628, -3609, -1095, 12439, 19446, 6966, -14871, -14032, 6231, 10725, 4787, 2581, 13016, 526, -5342, 8696, 19618, 25358, 24526, 11159, -1349, -8054, -9862, -20680, -16081, -10740, 729, 15298, 22458, 18551, 14027, 14316, 17907, 6941, 768, -1680, 2946]
22745B946Q898m029J1022J6264j0282k3389k1068N567M174n91O957r771K478k585
22731a3409k017O577R33O508R493m716p639k895N569Q025O41o002O2r566n47J1631
22715B648o946m305P844J7928j187j7956p961j1869J1522J7845k893r129L986
22702d73l378N133l307J3814L489j3562M218j0638n547o66O042m449l898k30P634
22687e818Q814n796k050J7014J3706j7688j5273l853K242J641p534J0407J4991
22674A0803j8205p467q222m383L499J9227L495p908P352o610q078N325R220L162
22660A210p911J474L475j0929m699j1799J3316J7600N628j505l95n752l108O727
22646C332J5908j7920j6028O745P534n841Q92M500J4099O437k2506j198R082M658
$$ y = [2946, 11844, 7815, 18837, 35101, 24819, 1430, -19638, -14071, -9897, -10488, -3531, -13302, -10824, -13409, -15426, -8849, -7916, -1408, 8085, 3369, -4270, -7165, -1596, 6429, 7070, 1068, 1130, -8436, -8983, 2648, -4298, -8603, -759, 17169, 15982, -1974, -9935, -21804, -10282, 7563, 4670, -4459, -473, -3851, 1282, -2025, 11789, 15278, 1716, 5934, -4704, -10251, -10917, -4875, -9324, -13222, -13452, -5818, 2996, -2800, -4850, 12164, 25870, 8182, -7091, -10944, -8702, -7061, -14595, -4188, 10803, -7402, -14869, -23091, -27474, -23975, -4748, -1253, -9161, -1809, -8419, -16497, -11172, -1952, 1210, -6701, -5227, -1752, -12681, -17380, -29179, -15863, 1737, 7365, 5860, 5465, -287, -3395, 3332, 19240, 1320, -14708, -7963, -429, -6270, -5378, -878, 13221, 19658, -2848, -4046, 5036, 9694]
22632I694j1203k272P210j347P786J1173n061j3171J567l668j8110k112j0083
22619b9597J366J3866J2934K857R165j452p792k753L556p899P311K0686q94j279
22605B0075k2346n797p123q296n676J8770K8466J0247j4212j7632j1290R693L816
22592a305Q598Q493O306M016j3147j7844q46p865j0832J7450N900K838j988K504
22578B278o147o114k694R47n63Q009Q198l230n018m045K928k981p29Q551J2350
22563A1740j2896k834q493l928P292j0471K199J704q89L804q777k126J8871J7686
22549A2882N39p897n77j676n563p517K128R543O217R908j9534j767R319q053j096
22534c144J2468q531M706p367j51j7846p931J2642o94J1013J4236P226p831j0343
$$ y = [9694, -1509, -3781, 3429, 2082, 9868, 21041, 15980, 2809, 4376, 708, -17402, -19514, -29597, -28231, -14365, -1431, 1426, 10591, 9139, 1347, -1406, 2150, -5749, 1562, 22248, 21354, 20075, -2271, -8068, -15191, -23487, -29163, -10393, 18073, 28320, 14108, -3524, -14814, -5121, -1305, 7293, 15786, 22092, 26108, 12961, -4883, -5729, -13594, -24426, -6976, -1076, 1762, -226, 2278, -3869, -9983, -12677, -11730, -12293, -4284, 3914, 684, -4334, -8379, -5451, -8432, -9161, -610, 11740, -1156, -3990, -12483, -16411, -9119, -19590, -17391, -15687, -16576, -12772, -21549, -23675, -4804, 12882, 13421, 5524, 4947, 3271, -2292, -9809, -7681, 1862, 8079, 17987, -1547, -3314, 6005, -2048, -3144, 9324, 793, 5499, -1868, -2019, -19865, -27796, -15154, -15848, -4835, 9401, 16627, 8796, -1547]
22520a547J4969M777j1328k590m870j1839j2899P603J5934N829P288O019o976
22507A0370m341n684l973M596m957M422J1640O792r568J918k697j2949J2207K015
22493I791L04O16J0778J03m129k052m535K769J957j3283J0262m117J2163J599
22479B2226j2752o178M19Q605j168j0361O1o103o634m902J8907J0697k348o191
22465D278L198n728r702J0642J0624r28P614P271m569j6310j3196P496P996K748
22451A1434r343k127J5K273R630k768o813M535K266J1789k1289n590N526M273
22437C811j3462j1929Q083K1388M421j6830n264l84J1095m777l567P33P620J1115
22423A2053K528j5j5909l973m250j753Q31j0086L951M812o611N293O589j2742
$$ y = [-1547, 13422, 18199, 6871, 4281, -589, -12428, -25327, -17724, -1790, 4039, 11327, 17346, 10370, 6029, 345, -3628, 968, -3989, 433, 12073, 18865, 9297, 11215, 8518, -4431, 7776, 9791, 10095, 10711, 21489, 21592, 17463, 15411, 10876, 13645, 15602, 2319, 12581, 8464, 20627, 22226, 9474, 3296, 3715, 12320, 11152, 791, 852, -5251, -11885, -16787, 2120, 12817, 10469, 4278, 7476, 1748, -7954, 2688, 13312, 12384, 19998, 27269, 22700, 6390, -6806, 690, 8686, 11434, 2091, -36, -21, 2252, 11882, 9114, 2301, 6836, 9102, 20891, -398, -5988, -462, 3811, -9651, -21580, -13497, 7891, 12312, -4518, -9782, -10166, 929, -3848, -7415, -6682, 938, 12053, 14581, 14566, -1343, -5316, -9566, -11319, -10488, -20574, -16623, -11811, -18422, -13129, -6540, -19282]
22409a9282j4697J343R825Q033J2395P483n508p963m928j2607l046R62J6834P914
22395c242n20J952l612j9344k174O678p013p860P754J325K443J749J2773J3526
22381D435Q409Mj1723r549k895J6554K1286N744o063k7141j4541q284J3354R003
22367a407j7437j740L562m206l499M790M919q80q288k91L040Q71Q73L459J1234
22352e000K861r515N497J4567p211l566Q22j630J0076M568Q597j541j2481j5062
22338i018k865R030L674p46J5861m85q044Q152N845k2912k1122m868N437J369
22324b0692o982N911N809N53P622l93p857Q892l941k722J7519L449k119k90O639
22309A1398J0393l876j2293r135K621l062L335n476j8045j0517J0875L0444M684
$$ y = [-19282, -33979, -32636, -22811, -14778, -2383, 5100, -408, -8371, -13299, -25906, -28952, -27990, -11156, -3242, -3762, -1810, -5422, -24766, -26940, -20262, -27275, -35135, -27381, -26056, -23613, -21864, -9091, 4435, 12844, 12848, 1125, -8424, -11319, 5235, 26521, 32265, 26202, -939, -15480, -23764, -10410, -1407, -18844, -20584, -17022, -21228, -24727, -19937, -15018, -15898, -24186, -24477, -21437, -20566, -19693, -16234, -5000, -2139, -11654, -6157, 8410, 1199, -2367, -1545, -3175, 6901, 11469, 20066, 18525, 6044, -9018, -11883, -2853, 821, 75, 15936, 15451, 7407, 15559, 21404, -1508, -22630, -27498, -22061, -20692, -27674, -21763, -15954, -15401, -7779, -8172, -16029, -7137, -11078, -13800, 3719, 7168, 5049, 4759, 11398, 21791, 17915, 5622, -3513, -892, -3954, -619, -6095, -24140, -34657, -23782, 6662, 11346]
22296A1346r551k582L899q273N376O372J75m300M569o388J4145O657k3766O601
22282D280P173j1542j2957L62l732J3929R484m267n366q590q516j5012Q404J2094
22268a4256l357k293r751M965N624J2161J5254k341O923n163j2808j722j667n186
22254a3617o286o623J3501N893K775j809j761J1514p617q127K0251k578k939l000
22240d23k506n714j6728R13k238j0514N964R596K4757k582l388P733r022J810
22226b342P71r844j2830O435k598k647m575J0292M020P635k018j6227m226J8349
22212i805J287N820P187j358N020j772p873k317L367O077n317m958j2295k221
22198a9158n127J1246J4397l76n997j9533m316J176J7581O234o807j3041k407
$$ y = [11346, 1795, -787, 3112, -5161, 215, 6587, 6762, 2462, 7031, 643, 14788, 21445, -2321, 4280, 11453, -89, -13046, -12684, -16416, -2487, 6997, 2730, -2636, -11226, -19742, -34754, -26350, -14256, -17613, -19906, -29657, -24692, -19068, -6907, 8347, 6006, 12929, 7766, -5042, -6764, -8431, -13617, -19903, -26526, -13025, -7132, -4357, -6166, -7927, 3587, -4030, -12157, 8094, 5516, 2577, -423, -2929, -8643, -25371, -24458, -26696, -37210, -31246, -21650, 3107, 525, -2863, 4870, -4152, -2342, -1571, -11415, -24245, -17810, -20408, -23055, -27630, -17338, -13318, -5683, -7701, -23928, -28154, -9805, -8518, -2698, 4489, 3131, 8151, 6379, -1494, -3811, -444, 5633, 316, -4642, -16937, -19158, -24285, -13039, 1358, 982, -5015, -24548, -28864, -27688, -10107, -3873, -10680, -23721, -26128]
22185b6128K784Q162N771r270P209k999j4161N362q49q845q664J1520P578J5964
22171f566L055K997r820m884p20J5342O403M96k0787l24K636J2044N847j3600
22157g881n787J94N856L977K769k929N104j1833L973J8510j0586l170n14O353
22143D036O188o646N061N592n902m924O129l01k722p848r892k067N338M244K342
22128a372j3714J2896P938K875j4818l186M703Q542n299k121J7741J2417q151
22115A8451l112Q657j1826k60K687O915j1122r784j0892M172O601o2j979p866
22101i420r979J0241l193q900J3597Q184J0659J9267l779j0251j1716j1474P311
22088E47p136m919o04q078R839K1683O759j2945M140J3019P50j1893r365Q337
$$ y = [-26128, -23344, -15182, -9411, -18681, -11472, -14471, -28632, -23270, -24119, -32964, -41628, -30108, -22530, -6566, -3511, -514, -10334, -15218, -15938, -596, 5807, 6303, -14484, -14808, -12172, -128, 5719, -7881, -13668, -13474, -7618, -3641, -872, -3801, 1303, -10530, -6557, 11953, 1367, -1803, -2317, 4036, 10224, 3578, 8639, 14231, 8329, 3405, 9534, 9233, 6511, -1337, -11229, -13296, -7958, -3714, -1372, -15086, -2190, 5748, 8623, -6195, -9381, -4678, 3864, -1435, -3556, 14185, 26602, 18451, 15339, 23996, 12170, 11910, 14597, 21512, 10390, 606, -10286, -6114, 487, 425, -1554, -9420, -19399, -9158, -12351, -21251, -7654, 530, 11189, 30456, 26677, 16426, 4710, -6764, 547, -6589, -11508, -12112, -20190, -10351, 11332, 18091, 5146, 9286, 22305, 23055, 11162, 1797, 10134]
22074A0134L015k1232m142J0264l600K489J2470J817P150o311L133n333n948O248
22060A0154q49j713J2134l754j7812J3041J3803k958n738j0247l648Q035R704
22047B0152o142o259r046j502n572J4782P851R60n40o896K589p570p660J064O087
22032B298N101k567P952M980M99q620k4223m946O467N968l020n271j036J6102
22018c16J3015M583j8201m097q298N075L644J0025J2351M202q089M501j429r161
22004G805J086k0341j2937l346J111L927m67j871M160N628J1078L883o816j4003
21990b1103P409p662q85o204J488N626K4690R133j0154j0725l115R85n523J2685
21976c355o793q086N209k583m187J87J2532O372N494J6994j2535j7539n275J7301
$$ y = [10134, 13149, -8083, -12225, -1961, -5561, -3072, 9398, 11215, 18365, 12054, 15187, 9854, 3906, 10154, 9305, 7592, 19726, 15972, -1840, 11201, 25004, 22046, 16308, 6061, 2413, 10448, 20152, 14010, 7751, -1295, -2797, -8369, 6413, 14264, 15224, 14684, 7788, 10377, 2807, -4853, -3789, 2298, 7399, 4832, 12784, 17764, 18263, 9643, -14580, -19526, -13059, -7091, -10111, -15382, -16418, -316, 12699, 17282, -919, -5016, -13314, -8239, -4595, 5430, 17781, 21983, 13894, 18395, 16966, 7805, 8891, -11450, -24387, -27733, -26622, -22695, -23162, -25033, -20873, -15245, -4167, -284, -7100, -21103, -13694, -21356, -22241, -28445, -26957, -21331, 3359, 12492, 2338, -8387, -11502, -10517, -16040, -3355, -10148, -18234, -13025, -15608, -19795, -19608, -7076, -704, 4790, 21784, 9249, -8290, -13565, 3736]
21962C736n980J1305l784m036l988p213m72q272J1718J8145l820r596j0262J063
21948a1456R008j097j1330j1824j621R460m598N449J6925j920L7K312M107N559
21934I011M128M881P837K587j0488k3135q523L751j689p201J178J3644q15J532
21920c302j0172j1224J3316N861o185lM029O167J6460O53k15r510K74n128K636
21905C657J931r955l213M167p982K569n795j998J4750J3324P993r877l162j812
21891D597L009l603j0677k958N096M182j3292q488R927N612O97O282L220p715
21877d111J433j0579j871J1508J3193r488o540j0426J2471J5837J0315k755p070
21864A1917j6381L09n854M479N988p089r67K330l174p269j3994O627J7458Q970
$$ y = [3736, -2244, 9061, 5277, 1241, -2747, -9960, -10432, -18704, -6986, 11159, 7339, -2257, -12519, -11456, -2448, -3545, -14875, -26699, -28320, -18860, -23458, -18009, -1084, -3004, -2967, -655, 3452, 9011, 13139, 18020, 25857, 28444, 17956, -5179, -13702, -9951, -11640, -18841, -17663, -4019, -4834, -3302, -13474, -24698, -11382, -5521, -11706, -11709, -7680, -1513, 14947, 15600, 15385, 5875, 6149, 1021, 3657, 5588, -4367, -7580, -3413, -11395, -8826, -14621, -16619, -1869, 11455, 19448, 9571, 6409, 4597, 7606, 4003, -6674, -9632, -4536, -354, -13646, -22134, -12207, -6595, -5898, 384, 3604, -4111, -2678, -13257, -15128, -3620, 9573, 85, -6455, -16881, -4410, 11427, 21742, 18987, 11917, -4464, -4155, -10009, -5530, 458, -6631, -7598, -5268, -8442, -15711, -29705, -23078, -5620, 3350]
21850C350O309j1512j3638j0117L399O39Q723O961L27n921j1707P25J6610m33
21836f285R9N773n164k950n83k93O979N098K353n845J0020J470L766p378n434
21821A626n324J1124R811r640j0709J2336L764p351j8082L017R114O624m145j7146
21807a4981j8220L285N91l313J9234K2538J4488j8787r447n607p617M481K842
21794a0513K810p930j7661r224J7209R342N87J1276O135j658r614p797n43O372
21780a1209J0977L877P678m86J6004M950j3300o151k198n761M433r248j0240O80
21766i994J271M486J767L844M135M133l976p984P474J1797o085r842j2283j3226
21752b4483N384J5981o445j0694P05L414J7319J5519J506k324o750r302l613R242
$$ y = [3350, 9659, -1853, -15491, -25608, -22209, -21570, -12847, -5886, -5559, -11480, -23187, -22462, -5852, -6285, -6186, -413, -5577, -8527, -9110, -9403, -2424, 2674, 5027, -818, 9202, 10672, 14438, 7060, 1626, -3698, 7426, 17237, 7597, -3112, 9224, 12988, 5637, -12445, -9428, -314, 6310, 2165, -14981, -33201, -29916, -29325, -32638, -13404, 9134, 23622, 4835, -4612, -10219, -17836, -13355, -10513, -7703, -15633, -33294, -42518, -25309, -15967, -15380, -4104, 2031, 373, -9241, -17038, -17581, -11209, -232, 3645, 11323, 10837, 26841, 31791, 18491, 12340, 10142, 4381, 8814, -434, -10674, -9994, -8723, -4237, -2470, 1374, 5509, 9642, 5666, -2318, 5156, 16953, 10868, 1026, -11257, -24483, -19099, -3118, -9563, -20257, -19552, -16138, 1181, 16700, 18206, 15882, 9132, -170, -3783, 5459]
21738E459K443j0742j4960l800K29M989Q228p2r942l684J6436K6626N813n156
21724B1867O778q605j27n289j1245m053q585j5519Q69J0979k492k538N322p131
21710a9769P912K257J6216P190j1176k1612L62P404J0881J3971n540o3J957L445
21696A3435O338L633m648j2330j6900k520n152R970M594k602l293k93j1742L16
21682b1194q003K178K1258m270p887j827J0163Q157J8N924O974p723q205R20J7584
21667A4067M407k18L847q559q363o189n869L880L912j072J4953l344j2640p89
21653a977p68q909l503K138J0658J2062P816q808o361J0064J5986k649q477k952
21639A4320O05j447l616q193n078m711l706n023Q410j313O910J0338L985k234
$$ y = [5459, 7902, -2840, -17800, -21600, -21371, -16382, -8154, -8226, -18168, -21852, -5416, 21210, 27023, 21867, 28645, 20040, 19913, 14624, 3379, -674, -9259, -24778, -23909, -12930, -15422, -17960, -12638, -19769, -11857, -9600, 6616, 13806, 2630, -18982, -18620, -11216, -335, 13636, 8096, 8033, 9990, 13435, 19773, 23406, 18758, 6428, -10472, -12992, -18144, -8174, -3580, -6182, -9475, -9768, -21510, -21194, -29197, -27019, -5761, -10031, -17918, -19745, -9582, -1425, -1407, 4517, 11491, 3768, -4437, -3517, 14067, 18474, 18256, 22103, 13544, 5181, -1008, -6877, -2997, 915, -157, 14796, 11452, -1188, -1977, -2745, -11654, -15157, -13019, -2361, 9701, 17517, 8709, 2348, 12412, 28398, 25749, 17272, 14320, 14925, 13478, 9862, 1669, -3409, -8120, -11826, -16849, -8439, -9752, -2842, 7496, 11481, 9247]
21625I247j5579j1470J1141j0757n618J1739J0365M123R477j0121J7487J612l904
21612A7742n896p506o428O894O940n092n313N312J3882K20o030m360O847j4301
21598B911j3953j2911J4335O737K576j232j166O709o631K60O893J4294L826q034
21584A4614j1517j1087O634J2193J0680p782q808n59M292p993j716j2433j1549
21571b5031J9485J7321p424o635L684L702O602o264m458k810n312k335j1230l261
21557b3966k277m581L687J6721K3562q591n963Q544o842r96L889j820p583J881
21543d335N893M206J65k331k17j166O344q508j4836j3351K683J35K1863J7504
21529A4049N971j7332j5830k550p049J2840P326l108q155q470O069J3696J0771
$$ y = [9247, -6332, -17802, -6661, -17418, -23036, -11297, -932, 3191, 12668, 2547, 20034, 21646, 17742, 11846, 4340, -2088, 4806, 11746, 6654, 1341, 6653, 20535, 20755, 14725, 10365, 17212, 2911, -11042, -23953, -9618, -2881, -305, -1537, -2703, 4006, -2625, -2365, 4528, 18822, 22648, 14614, 3097, -7990, -1356, 10837, 21517, 13735, 4927, 4368, 8660, 667, -1049, -13482, -25031, -5546, 11775, 4351, -2284, 1400, 5102, 11704, 5440, 982, -1828, -7140, -9475, -20705, -23966, -26243, -30824, -27137, -10416, 13146, 4555, -1408, 7136, 294, -702, 3187, 1367, -6216, -4335, 1558, 5764, 5929, 3598, 3381, 2215, 8559, 51, -14785, -28136, -25453, -25318, -3455, 14049, 20020, 2688, -13142, -15692, -22741, -9901, -2575, -5683, -13838, -22308, -16239, -2543, 8228]
21516H228p82j5018J8803J5638J596o270o19r001R880j71m113q037j6409j2648
21502a8923K5871K076l306l577n236k228l144M567J0506k042k2046J3173P314
21489C005j0702m012j232q626M441K0836J2736p757m356o500M624r268j1286k951
21475b1048K131k676P774P899M342J670j825n551j5752J852O102q460r940l469
21461c6951J0223K7424n593L608k978p427j1933j3345J3889K91l782m482K0256
21448a0800M559j3465R51M827P096R364L259j012r757r166J4125L494j776k768
21434a069l670P41m81j418P261J362J6662m702m114j0614j0189j935N456r860
21420a6570m088J185K25J3443n812Q197P079J313j1324p906j900O027J0374O48
$$ y = [8228, 7446, -7572, 11231, 26869, 28465, 22195, 21576, 12575, 22455, 22284, 18171, 10134, -6275, -18923, 6948, 9024, 5718, 2141, -3095, -5323, -8467, -3900, 6606, 4564, -17482, -4309, 3005, -7697, -11709, -12941, -21567, -17126, 3710, 16446, 8689, 4333, -2167, 2457, -6811, -18097, -21048, -18917, -21593, -13819, -5920, -1578, 92, -1733, -7284, -23036, -21184, -15082, -23542, -33482, -36951, -26728, 696, -4897, -1289, -4267, -11694, -23627, -36972, -23083, -22792, -26574, -31056, -10800, -6241, -19706, -18755, -13928, -6832, 2532, 5791, 4779, -4978, -14144, -19, 3475, 1699, -1069, -4739, -3998, -4479, -5897, 1364, 2726, 19388, 14686, 10572, -42, -10231, -12166, -6710, -16570, -20658, -19473, -19248, -5805, -11617, -3420, 3659, 4972, -6352, -14258, -16158, -10131, 243, 891]
21406H91j140J791q816j4400N148N156P098O403q041l526O820j74l691p434J7669
21391C754L784q016j8139l082r82M98K584P689R301O494K652j3603k0085r096
21377c6247O953L585j675J0048J0370k410k173j5873N389J2614J3730P195n907
21364E599j4470q175M237P858O207o662j5075L776J2745K805M137j1443k320l919
21350a4700k837J2859J107N853k680J572m698k0689M6K266Q514R199m606j0691
21336a9485O529J5811j516p138m151J559o530q477j508J0723R201J4200l811p218
21322a811R139j163j908n933J255j3739j423J7393K468j5010j1752J7241L321
21309a922M553M16q465l419J507N035k090k228O214K611K082j627j2685O280O632
$$ y = [891, -249, 1542, -7274, -21674, -16526, -11370, -4272, 2131, -5910, -9436, -2616, -2790, -6481, -13915, 3754, 7538, -478, -18617, -21699, -22681, -22183, -19599, -11910, -2609, 3885, 6537, -7066, -27151, -36247, -29294, -25709, -27384, -17336, -6966, -9376, -11549, -27422, -22033, -9419, 4311, 11506, 5599, -8871, -17046, -12809, -4951, 1256, -5406, -20481, -16705, -3960, -1155, 2982, -8461, -10781, -14700, -17537, -4678, -3571, 2282, -398, 1174, -3524, -24213, -24167, -21901, -13387, -4188, -8794, -19485, -12956, 2855, 1339, -5799, -9950, -8391, -14921, -23398, -24906, -14183, -4982, 9218, 5407, -1811, 7328, 6165, 4257, -1676, -421, -14160, -15583, 1810, 4278, -10732, -22484, -5243, -1922, 2631, 3047, -5418, -8837, -7330, -2295, -4385, -6613, -399, 2212, 4294, 2667, -10018, -3738, 2894]
21294B894j3098j1748j06M463J0344l84j6718j2001R371J7595J5951J7710j0748
21281A3525l393l820j1498j7082M230M568M992n150J3506N612j0939n219J3544
21268B876k209N732L355o206L868L076N79o80p910l712o106O382j0961j0342M672
21253a7586J7380K232l468N397p493j4995q936j3142R829K9270Q638o50N669r254
21239B891l312r871P442P899j3869q726j0395m77M993P299m934N051K995J7012
21225C998K1737o683o275L980J858R844R404K266j5944j8128M29L514l48l240
21211F412L764p957k0898m350j4159q212J9407K7440P700n158l694j1490R860
21198a335J7379L307j7885K611M154o473l178P763l759o181j6120n243M60J0634
$$ y = [2894, -10204, -21952, -22058, -17595, -7251, -7635, -24353, -36354, -26983, -9388, 6563, 24273, 13525, 10132, 6312, -5186, -22268, -18038, -13470, -8478, -13628, -122, 5490, -5449, -10668, 2876, 667, 6399, 9754, 3548, 7416, 10492, 11071, 10391, 2481, -1231, -7337, -955, -11916, -22258, -17586, -206, 2026, -1442, 3955, -3538, -18533, -27469, -40611, -30782, -1512, 7126, 6476, 12145, 2891, -421, -10292, -2850, 5049, -8820, -17546, -27941, -28418, -23425, -16126, -21060, -16009, -13014, 3998, 25735, 19052, 12777, 16757, 18615, 28459, 37863, 40129, 24185, 6057, 6486, 10000, 9652, 6412, 10176, 2219, -18679, -23029, -37188, -45400, -25993, 1447, 9147, 3989, 295, -11195, -1335, 16044, 19351, 1466, 4077, 8231, 1758, -1420, 6343, 2584, -3597, -19717, -24960, -24500, -13866]
21184a3866J5255J6603J4876J863R55j642J968j6310k9055n927L298j207R846
21171c343j637p157k759P3J674k580p059O465P593r970J536L681J5915O160j2498
21156c906n284J4869m17p863j357N59o386J877l122J8m975R886R381N152J2167
21141B0599m443j2805k484p327J548l846n993J1904M702l341J847R203N14P201
21127A7279M184r288j3186m221j3752Q890J5643J6058N401o447j0778o227j2943
21114i387o872q24j587o64O200J676M294J2408J7005j937q785J241l130q430J744
21099B952K808j5915M920M2L482J5052Q078L25j0451J582n548P641J805j7043
21085b70q741q027m074L718R017P540j3405J438q53j2625R771Q508N681m836j392
$$ y = [-13866, 1389, 17992, 32868, 34731, 35686, 34044, 36012, 19702, -9353, -15280, -11982, -13189, -3343, -4980, -12137, -14896, -14823, -13149, -15729, -22788, -16323, -8730, -18700, -17164, -13483, 2432, 8592, -3906, -9190, 5679, 5262, -2601, -3958, -3399, -9785, -7908, -11030, -11012, -15987, -6101, 3280, 8432, 20599, 16156, 3351, 867, -6460, -4912, -8758, -14751, -2847, 1855, -1486, 361, 9564, 10078, 17279, 21463, 12175, -1011, -5232, -18984, -10094, 5549, 21607, 27008, 20561, 9783, 3556, -9387, -16259, -17083, -18670, -19334, -13134, -11458, -7164, 5244, 22249, 20312, 11527, 12768, 9638, 1208, 2952, 5760, -10155, -5235, -5193, -1711, 13341, 21419, 21744, 11293, 12875, 7327, 14968, 16773, -270, -9011, -17038, -21112, -17394, -8377, -837, -14242, -12804, -13657, -26282, -16511, -8003, -2322, -7158, -8550]
21070h550M07j1837o062J2966K0061K911m102o415J861j521l091J0151l073q570
21056d864Q457J836j0193l412k081k812k914O490M414p062q687p039J3485J6462
21042B080K713k168J512L96J15j2036j7495Q756R196L592j46J407O641M870Q835
21027A8268l932k3419J4726J6047J6922O72j4039p006R702M155r091j7946j7034
21014a1975o096L514M148k432J059k622O569J6918o40k1442O665Q259p664P031
21000A292J1670j1790j2603j1044j859m34P343P113O935L70n009j1655J1171J4395
20986E895p689j5471K127k473M873L4864j5990o616o599j5768j6603K2706J4240
20973b504K109L023R67j9163P005N356q074J2287r005j3078r008j431L7460O083
$$ y = [-8550, -8143, -19980, -26042, -13076, 6985, 9896, 5794, -621, 1240, -281, -3372, 6779, 3706, -4864, 3593, 5429, -4764, -8176, -10257, -13069, -15983, -9493, -5079, -12141, -20828, -27867, -14382, 2080, 4793, 2625, 4137, 4533, 4648, -7388, -24883, -16127, -6931, -3339, -3485, -2078, 4563, 9433, 18268, 14336, -9083, 5643, 21690, 38612, 39284, 25245, 18239, 27941, 32096, 23005, 5059, -11975, -18071, -14557, -10409, -12841, -11782, -14404, -7835, 9083, 8443, -12999, -6334, 1925, -5739, 1292, 12962, 1172, -11431, -22475, -24334, -24768, -17425, -10312, -3377, -3007, -8016, -19671, -8500, 5895, -1794, -17265, -15138, -17611, -12738, 22126, 6136, -480, -7079, -22847, -39450, -16744, -2504, -395, 2628, 3595, -15568, -8563, -3207, -11281, 1006, -7999, -21077, -30085, -31516, 5944, 12027]
20959A2027j3889j2924p792O040j3627J6411q96K769J1898l721j1170q65M39J5317
20945A7l891k0171r975J6805P610r085J37J1138R559K119n797M924n626k551J1350
20930F563q56n766K859J160J1733l644p342r71M266m846n313J914o217k99J306
20915e453R6q695k54n69J584O738O271n127k814J1820m890N479r512Q439j438
20900A675l90J020n776j417n415Q996P208r686j3281q293N768P49J827O202l910
20885a4723n962M240O214N538o483k946j657L018r853R570R272O026n676r305
20871a2727J339J4452P327o159j1889n558j9184k2311J1917J6319J5405M946l577
20858i700K0745J7260q241j4804j6582K401N148J211N947k236o077k316J483M701
$$ y = [12027, -1862, -14786, -22578, -16538, -30165, -13754, -14650, -11881, 17, -3704, -14874, -15739, -15300, 17, -3874, -24045, -34020, -17215, -9605, -18690, -18553, -7415, 2144, 4263, -1534, 3390, -2236, -4787, 6563, 5707, -59, 2800, 3960, 15693, 12049, 4707, 3736, 8002, 3156, -2157, -243, -6460, -6759, -5453, -5357, -14052, -14306, -14875, -13291, -6553, -282, -5409, -8223, 3597, -1293, 4186, -5326, 3113, 1675, 1285, 2305, -3471, -4888, -10303, -1307, 5901, -3785, -17066, -25359, -19591, -18842, -17015, -10813, -14723, -20685, -16445, -10231, -4693, -11176, -14122, -15779, -12761, -22614, -13044, -3772, 2254, -3422, -12727, -11388, 3064, 10391, 4232, -7657, -13215, -32399, -54710, -42793, -26474, -11069, -6123, -9700, 11045, 28305, 20064, 5260, -11322, -8921, -3773, -2562, 3385, 1149, -4928, -7244, -5761, -1060]
20844a060Q253N16q443k92N515l951L729k215k2811o369K369K2752J0895J3337
20830B2225j071J151J0818k445q837k3506j5480l731P671K5105J149K913j740
20817A4222R644j218j2638j8429j855O860j3093k050J2513J96L297m437Q767j1368
20803i589k0002R681O892o807M430L014m541q631j2382J6776R320P16R735j4645
20789a6033l751M769J1165m232j1988J935K79k682M798K0193Q288n712j1249j1896
20775a6116N121k23Q934K906N008K769P14k549j156K658q676m771N289N532O892
20760A2332j1608N472p961k0389k17R214l551M86K5822N936j0710j7203j743J6586
20746B466P448j7228k4635P273J1496m082P250J7323P961j0951l902J2726j0750
$$ y = [-1060, 7193, 7709, -734, -1026, 4489, 538, 4267, 2052, -20759, -27128, -24759, -2007, 8888, 22225, 21154, 22305, 33123, 30678, 21841, -1665, -17145, -20876, -13205, 11900, 13049, 15962, 14222, 23866, 22648, 10010, -8419, -10274, -3414, -16507, -18557, -6044, -5848, -2551, -6988, 1779, -9589, -29591, -19910, -13018, -19825, -15395, -12381, -16922, -25553, -37935, -21159, -11839, -11123, -1388, -16033, -19784, -15015, -3850, -8082, -20070, -18135, -17856, -20538, -15740, 4453, 12741, 7029, -4220, -16116, -10995, -11218, -2284, 622, 5630, 8399, 9113, 6564, 5408, 8066, -610, -5381, -92, 5440, 12332, 724, 6196, -1765, -22154, -22371, -13157, -16708, -16222, 9600, 15536, 4826, -12377, -14120, 2466, 9914, -7314, -31949, -24676, -13180, -17262, -10012, 7311, 15272, 4321, 419, 13145, 2395]
20733B395q662p880K663Q509J3841k2645n151K790Q576L78l309N059N407j2190
20719a0219r027L201K2168Q071L614n729p782r630R60J7213q106o700K744P358
20705H136j0437j0123M272p469j2883N326J0737Q699M979j4502J242R911n517
20692g629N156P237O006P231o581K259o453l688o34K741J4237j898n140j1398
20678A446j0223N94P464q124l34l62P281P525m76j5504j997L679P091M325m875
20663b490O265j3999j0112Q863R785r52L447J0980l55m005K221J119j4933M463
20649B97N747o607M354L935M108l960q650J4248J568k2338j6425j1063R862J6505
20635h419P321o475q731M811K878J7660k906o631j7026J759M455j453k759K113
$$ y = [2395, -6267, -14147, -11484, -2975, 10866, -11779, -16930, -14140, -5564, -5186, -8495, -3436, 1971, -10219, -19246, -16045, 6123, 14194, 17808, 12079, 4297, -5333, -4373, 12840, 4734, -1966, 778, 8136, -2301, -12424, -8152, -15621, -28504, -23178, -12441, -3742, 1237, -13265, -12023, -2112, -7629, -2473, 4764, 10770, 18001, 11420, 13679, 7226, 3538, 2904, 5645, 19882, 17984, 12844, 1446, -8777, -8183, -719, -8843, -9177, -9539, -2258, 5267, 4791, -10713, -12710, -9031, -1940, 2385, -2490, 3775, -10224, -20336, -11473, -1688, -2640, 807, 11787, 11432, 7427, 9648, 10767, -4166, 297, 6044, -563, 3791, 7726, 11834, 7874, -776, 13472, 15040, -7298, -23723, -34786, -24924, -8419, -1098, -7573, -16304, -11493, -8615, 9045, 6139, -492, -17518, -15759, -11304, -12757, -15516, -13403]
20621a3403K338P18R923q196m004L689J0022l423P660m050L529J0405O00N945
20607B1753j1502j243K730p264q045n694n066J922M42k143j0163J27J7453J1488
20593D795L063R920R939j2818K139k600J2115k3l498r125l745l696O033q443o607
20578b551J5784K763r224j6281N610K9480M508k0576j8818N423J5200J0745j6441
20565E622j5449Q642K404j3559j9582n73N11o83M38m726j387L897O128K189J5274
20550a0854K483P760J7014J430k1126m631J0709M406r620p978j29P447K5826O040
20536B8777n707M744q297o326j2117k687j0687L404K4420L870p059J5331j1090
20523A6576j67L007p577k420p069Q346l66l446q030K370J0623P46J40Q576n538
$$ y = [-13403, -11065, -10347, -424, -8620, -12624, -8935, 1087, -2336, 5324, 1274, 4803, 15208, 15808, 21753, 10251, 9008, 11738, 4474, -3571, -9265, -14331, -12409, -11967, -14110, -24273, -24146, -6693, 4795, 7858, 17778, 27717, 14899, 17038, 14438, 26553, 26530, 23032, 13907, 10162, 6466, 12499, 4056, -2551, 13233, 15996, 6772, -9509, -3899, 25581, 30089, 9513, -9305, -3882, 11318, 22063, 5622, -9827, -1185, 1219, -12340, -31922, -32495, -31984, -32667, -32229, -36955, -38342, -34445, -28317, -26128, -10854, -8371, -611, 16403, 17833, -3293, -7924, 2785, 7191, -2429, -10407, -10536, -3089, 22737, 28777, 23070, 27814, 19517, 13191, 1074, -1613, -12300, -8896, 15524, 19394, 12335, 27666, 16576, 16409, 19416, 11839, 9419, 2350, 10696, 10330, 6884, -1146, 1224, 11847, 12593, 12733, 21309, 15771]
20508A5771k603k094L568n567j7438j7603J2584O803J7791M128j288L685l058
20495A4679k884o578k410j4075l958J3405K347R55q021n208L021l903Q592J034
20481c004o107N262K754o719j725N068l069r129J5655L51p95o597K492J359Q889
20466D685N788o983j6578j112R813J5637j4002l397j490L997j471p919L021J2986
20452B975R987J555L059r314K37j149K75j167j211p493o536o89J4745n41p130
20437b397M606l843k3321j462R208P711J4286M119j0067r376J977l953j534K009
20423a2037j0261k722J1262J7158P129m640O918j224p371m984N027J3440j638
20410A6057j3120j5123l749l206o58R722J6005o036j2960K401J8268P984m933
$$ y = [15771, 13168, 11074, 14642, 9075, -8363, -25966, -13382, -6579, 11212, 15340, 14052, 17737, 14679, 11795, 5217, 2807, -11268, -15226, -1821, 526, 1481, -6540, -11748, -8727, -12630, -4038, -3004, -9111, -3849, -1095, -7814, -9539, -4471, -7540, -16669, -1014, -663, -1458, -8055, -5563, -4204, 4685, 10473, 3490, -13088, -14200, -4387, 11250, -2752, -6149, -7639, -3642, -5113, -13032, -10011, 2975, 12962, 14517, 17576, 8262, 8499, 7350, 7625, 6458, 5247, -2246, -8782, -9471, 5274, 4733, -2397, 2209, -1634, -24955, -26417, -17209, -9498, 4788, 8907, -1160, -10536, -8559, -12512, -14046, -12037, -22298, -25020, -13758, 3400, 10529, 5889, 12807, 11583, 4212, -772, 4255, 17695, 16057, 2937, -12186, -15935, -19141, -19799, -10077, 5928, -108, -13068, -10667, 7601, 15585, 10652]
20397A0652j474J1076j3473k9462n31K1397j601N559j187J630P027q942l207J511
20383a025O444K644R077J2158J270j4455J144K6L416Q761j5026j0584P229N56
20369A1635o178m861O403J4637k136M622r895r650j37l703k166q940j565K1Q698
20354c215J2214j2636p966J0378q823m818L604l188J5886n199L420J5338q788
20341F207p048O295q162N61P182R82N595o948N593O265l237Q245K799o434j6663
20326A232j2403J0741J6862P038j4154k1426J0415k515j2298J1849L476M344K979
20313F140l14J2767Q821j5197j881n091L837k903m894J227N137J0175l123m99
20299A4202o41J429m360k3258m679k01J359k32J7235o966P125N347o186j0518
$$ y = [10652, 9178, 20254, 6781, -22681, -23212, -1815, -3416, 2143, 956, 2586, 9613, 671, -2536, -1025, 5419, 8063, 17140, 29298, 30568, 16113, 17257, 17283, 20699, 29460, 14434, 3850, 11079, 11635, 5457, 596, 6999, 21636, 19500, 24122, 14227, 4577, 4440, 737, -1429, -10369, -11934, -11913, -3215, 8999, -3637, -11603, -1225, -10048, -14866, -11262, -14450, 1436, -3763, -343, 14995, 6207, -841, 5454, -2708, -2147, 5035, 6017, 11612, 4664, 10257, 16522, 13285, 21530, 24329, 17895, 1232, -11171, -430, 16432, 23470, 9316, -12110, -1695, -4210, -16508, -4659, -1183, 3161, 6140, 5826, 18593, 27414, 12217, 10336, 5245, 9082, 6179, 1285, 2512, 7649, 17824, 14701, 14202, 13561, 14990, 10630, -12628, -17307, -17508, -16149, -16381, 854, -6112, 1013, 6360, 174, -10344]
20285a0344o315J0399J0944M379j752l717j371j501N80o869m585J399L391R71
20271d391n330P682k202Q374J4960N665k150J278j0765r030J828k480p166p942
20257a1669J884J1893P042l075J678j443r346q044l27M982L620R9R345j2060m458
20242i879p186j533O943r065p873j554K6756P412P646k804o375K813K975p360
20228I16r984j568J7598L0725j0206j2241n662J3475Q406k785j5628r983m349
20215a286P946J1684K49q481m19K488j0420j8620p999M023k965J129L612K316
20201a6743M166J623J1080l752j7534p906P362L873O84R737Q37R123J534j3083
20187h999M453K2835J5437K067o644j7999k0097q71O576p936j927N07O818J3625
$$ y = [-10344, -16659, -6260, 4684, 9063, 7311, 3594, 2223, 722, 1302, -5567, -10152, -8753, -5362, -4391, -9721, -2039, -4241, 4133, 19093, 24758, 22608, 23886, 13121, 4091, 5919, 3439, -3727, -11669, -9785, 2108, 9150, 6075, 7753, 6310, -3036, -11080, -11407, -6425, -2805, -2706, 6639, -5421, -9879, -17065, -18598, -11655, -20720, -28593, -30147, -3391, 4021, 11667, 8863, 2488, 5301, 8276, 916, -9068, -10636, 6962, 37687, 27481, 15240, 9578, 23053, 31459, 28674, 13046, 3063, -1286, 6660, 18344, 18593, 10112, 9693, 12181, 1761, -16859, -24858, -20835, -23800, -22671, -19059, -16743, -12577, -10954, 126, -3626, -21160, -29066, -21704, -17831, -17147, -7410, -6573, 2550, 4084, -8999, -4546, 18289, 33726, 35793, 29149, 11150, -8947, -9818, -3242, -11178, -13105, -12598, -5780, 7845]
20173G845J057n864j2556r936j056J792N852j732q375M804M320L824J9975J3031
20159B2981n781l051q541j2086M995R911J798N55J351j5148j9368Q880O948j1293
20145a7849J5394K8766m771k4890j4001K3255R595j5513m367n763j1850M397k571
20132b0168o514M719j2635K0758K5442q353q475J1024j8677j7518o159J1237J8438
20119f881N389Q007J109M033p483j4160Q755M808k728L16j1023p136M195J0470
20105b329J6576K675j3169n017o448p412K839n711j410Q097M425r251R012k311
20091i434k2k691o101j0078r913O576l824J0794Q024K554J7541l863L289N52p395
20076c991Q56R868N432n655j0231L950J2521j0028K523J0020l884q617M081k0645
$$ y = [7845, 8902, 3038, -9518, -19454, -20510, -18718, -12866, -14598, -22973, -18169, -13849, -10025, 9950, 22981, 17200, 14149, 5608, -6478, -1483, 8428, 10226, 10781, 12132, -3016, -22384, -13504, -6556, -17849, -2455, 26311, 21540, -3350, -17351, 5904, 15499, -14, -4381, -10144, -21994, -17597, -20168, -26682, -21963, -34598, -13840, 11602, 3249, -5226, 5798, -12879, -30397, -36556, -25319, -6881, -1492, 6515, 7624, 11657, 4174, -9986, -1231, 3577, 849, 1165, -9858, -16994, -12799, -2329, 14247, 16922, 3753, -1264, -7712, -15124, -12285, -17996, -19406, -11309, -6884, -16135, -7123, -9434, -9456, -12147, -18248, -28326, -38239, -31663, -35487, -24693, -16669, -14115, 3426, -437, 2852, 3404, -3991, -3135, 6733, 12165, 6510, -3721, 229, 12750, 2722, 5245, 15265, 11381, 2764, 6845, -13800]
20062a3800M276J1265M774p094P343Q04j4309j0262J677L549N600N096N84q466
20048h963m156L806J6088M121o935J8423l093j6665l584m919l64J7204R766p456
20034A3273n628K740j292q668j5679j5867J2905J0572M942n011J0924J1432R938
20021B4581K191O121j174p814r179o826j0086j157K160J5691l361j727p263m379
20007b222o127r13O111p374R946J4239J625j2292P885N000l973R47L234n045k124
19992H917j1511j6592n752J4081J7332l953J5563J1957j0578N440P05p998O597
19979B4208m054j1661k474m643j0608J4172j0179N080j151n157n828o177k787
19966b1259J5778J8856j6775j2281J0133M978j972J534J85o640j187N815n057
$$ y = [-13800, -9524, 1741, 6515, -579, 6764, 7568, -6741, -17003, -15326, -11777, -6177, -1081, -497, -8963, -13119, -9313, 6775, 10896, 3961, 22384, 19291, 2626, -958, -5877, -6241, 10963, 20729, 13273, 7645, 10385, 9093, 425, -15254, -31121, -18216, -7644, -2702, -7713, 3211, 14643, 24581, 26772, 32893, 31719, 23905, 14726, 7900, -2186, -3343, -1183, 14508, 11147, 9420, 2157, -2222, -8349, -9262, -3151, -10525, -579, 13660, 15285, 2993, 10878, 15878, 11905, 12852, 16086, 11041, 8917, -2594, -19186, -24938, -10857, 6475, 2522, 18085, 30042, 19464, 24904, 25609, 17611, 24208, 20154, 8493, 6019, 1376, -9232, 4940, -5239, -159, -1310, -6467, -12295, -18472, -21259, -5481, 13375, -3400, -15681, -5548, -570, -2542, -1008, -823, -7463, -8650, -2835, -7892]
19953g892J0748R870j1524j8679N799O225R672M556j2348N042l015j1169P868
19940d847J926J7536n693m476j4759J059J2522r892J512n720k483J1891J8315
19927A6891j030Q809l030j4791k2109m162J3603M554M414Q333m263Q544j1762
19914D001k0162K916J1613K82o68K2240n71m974j2316L854M656J274J233P65L049
19899A7192r613j0951R036j946j0606M780n93J0250j0427p264M07m519J0826n722
19885i150r332k177R557J7712J870O314J927Q63J231k2459n669K158j3631k353
19871b3139K986J2476M289R968O36k216p563J591k00j272K374J0140K56j3656
19857c330J005k77r42L618L871J0014k047q761q035N082Q452O62o460k181N025
$$ y = [-7892, 2856, 12726, 1202, -17477, -11678, -5453, 4219, 8775, -3573, 1469, -1546, -12715, -4847, -2921, 14615, 8922, 4446, -10313, -9254, 3268, -6624, -5112, -10832, -13315, -1424, 16891, 15861, 24670, 21640, 6849, -15260, -19422, -5819, -1265, 3149, 11482, 7219, 15763, 4001, -16161, -13245, -1632, -1350, -2018, 20222, 19651, 14677, 2361, 6215, 10871, 12145, 13378, 14143, 17192, 7579, -3372, 5664, 3718, -6888, -2108, -2701, 7549, -2878, -10142, -9735, -14254, -3428, -9150, -18482, -20659, -11102, 6610, 8480, 14794, 16721, 17584, 18815, -3644, -9313, -7155, -20786, -23139, -20153, -7677, -3388, 6580, 7216, 5000, -2563, -972, -1172, -2444, -70, 10070, 10326, -3330, -2325, -2602, -3544, 74, 3945, 13959, 11912, 3151, -4884, 198, 8650, 9312, 2852, 671, 5696]
19842E696J128j0117j6948M110K031J2624J0492Q239K353r989p495o238J9568
19829A5454r628j134L454R358l096q937j3904L448J4065l653n058L924P442M22
19815A2157r210j0720N421K3480P338j8298j0610R617l632j9787o352M708J3951
19802a937m484o655j0080j2991p217J1313J2349K031J886j592j2326J1317J3711
19789d675j6367p99J6996O386p676J4157K505l276m856n122l773R421O51L655
19775G227o032j0444P847M542J0152N125j3646P382k553m00N42o847O060R630
19761A8585O890J70j6694r891R416R53j372P327O024L064p28j0658J717P709j2676
19746I836P752l227j3872o489o794K5976P926j0148j6345q281l778k866n13N683
$$ y = [5696, 6824, -3293, -20241, -16131, -14100, -1476, 9016, 17255, 19608, 9619, 2124, -4114, 15454, 5826, 4692, 8146, 17504, 14408, 5471, -8433, -4985, 9080, 5427, 369, 4293, 11735, 12157, 2947, -7773, -2352, 21128, 28466, 10168, -442, 9175, 5543, -14244, -20596, -15888, -1937, -6421, -13076, -23156, -36147, -43364, -32051, -19702, -17671, -15785, -17377, -29703, -18386, -4675, -21042, -21841, -4845, 1541, -6135, 8022, 10527, 7251, 2395, -2727, -6500, 2921, 3572, 7227, 1195, -9249, -1402, 3140, 13292, 18417, 4771, 12153, 9600, 9200, 9742, 2895, 8955, 18585, 25475, 25645, 8951, -940, 8476, 9429, 8057, 15384, 21408, 24472, 23744, 13086, 14803, 22512, 9836, 17588, 14361, 489, -6000, -12794, 13182, 21108, 10960, -5385, -13666, -17444, -20310, -20823, -15140]
19732a5140O824J571R449J1352P523K362M394j3710m691l75j1241R698Q11j1280
19718b453k318R552K1455n056q879l31J920j0558k653J8703L341k2716O845J2864
19704A9716k709n148o127N132K2415m757m879o231j4737n873m274j0332K0624
19691B820J1718j0403j599J015N900j295N030Q663Q006j1288n453j981M677j2494
19677C316o554o910R915J3238N43j3767m929K494r179M537J9131L080j1232N220
19663H903o792l979o631j1105J1602K0732J2014k901p489q554M957m810J56K561
19649H664j0657m379J297P849k391p693n322p32J1500L875P388n03l628j3751
19635h483J332J526j861P765O782Q719m460M882K4j3140l366J4186Q446j77k0200
$$ y = [-15140, -8316, -6745, 2704, 14056, 21579, 23941, 28335, 14625, 9934, 9559, -1682, 8016, 8827, -2453, -4771, 4781, 26236, 21180, 12301, 11970, 13890, 3332, 679, 19382, 22723, 7, 6852, 19716, 17007, 11859, 5732, 10864, 33279, 28522, 23643, 17412, 2675, -3198, -7472, -17804, 2820, 14538, 4135, 2536, 3551, 9451, 8156, 13186, 21849, 29855, 18567, 13114, 11133, 15810, 3316, -3238, -10148, -233, 13005, 13548, -219, -5148, -2654, -11833, -7296, 11835, 14915, 3683, 8903, 2111, -1868, -8499, -19604, -8002, 12730, 24744, 21843, 14354, 5800, 10757, 5947, 6103, 8664, -1993, -6372, -5075, 2774, 383, -7310, -12632, -13364, -1864, 2011, 9399, 8896, 5268, -8483, -7151, -5625, -7486, 279, 7061, 15780, 11320, 16202, 16226, 3086, -280, 13906, 22352, 22175, 1975]
19620A975j1974J3021O19R204q318l606m658K620L72J901k48j1352K542M093p609
19605a1418Q981K562J0385J4408j4016q759J1164K1122j2347q061o396J2914J5136
19592C5675j1395j6118L708J577J719K588o430o98K750J3194q33j7374o496J1709
19578A3576j830l961n697J346l112k0455j1312J4882J484K202n202N272k397N620
19564i584K1781k169j9578n20J0190J1993k963j9116J567M088J3000J343q879
19551A153o482R019Q087N373R30k3493j2475n927J1320J6113o534m534J9461P210
19537A9221kN893m59j0702o128J2209P843L158j1101j796J490l848j2190J7787
19523B1375n697p519j1534n822R96J2712K607r034l037k046J1354J718R805J0911
$$ y = [1975, -9999, 3022, 3641, 12845, 4527, 921, -3737, -1117, -745, 1156, 908, -10444, -7902, -3809, -11418, -2437, 125, 10510, 24918, 10902, 2143, 13307, 34429, 22082, 14021, 7625, 20539, 35675, 24280, 8162, 11870, 13447, 15166, 17754, 11324, 10626, 13376, 26570, 25737, 8363, 1867, 13576, 11746, 7785, 2088, 3434, 322, -20133, -31445, -16563, -15079, -12877, -18079, -12807, -15204, -9584, 12197, 10028, -9550, -10070, 120, 12113, 9150, -9966, -8399, -4311, 8689, 10032, 1153, -5329, 3690, 11777, 17150, 18080, -5413, -17888, -23815, -12495, 3618, -2916, -7450, 12011, 19221, 19219, 25112, 24653, 13951, 7823, 20032, 27875, 31033, 19932, 18136, 19626, 15778, 3588, 21375, 15678, 8159, -3375, -9197, -8201, 4511, 7118, -1916, -4953, -6999, 4355, 6073, 15878, 26789]
19509B6789J3850p589L18p832p518j8580k1961O617L944O110Q767k856K495O293
19495H847Q121k131q658L159l450r191r82P43K761L510J746n956j1335R879j0397
19480a3334m634O974L964j5796O481J4230j889P146J4283n343k1564L991J5944
19467A0453J0051L547j3624L475J505r982Q603L248k0043r235O294J344L839R313
19453H788M434o424j2492J0312L389K384j7204R693P646o647j3592Q467K0595
19440A9349m490j6497j935J5425O03J1482M982j5867j654j61m09m109N041m332
19426G428L871Q762l204o454J1072M633m789J551o39m064N422l887P83k832p833
19411I820Q225j503j0946l512L723o172N027N136K608j6268p283K2346K802q255
$$ y = [26789, 40639, 33050, 33368, 25536, 18018, -562, -22523, -15906, -11962, -5852, 2915, 59, 2554, 8847, 16968, 14837, 6179, 9338, 5888, -3303, -4285, -3542, -781, 2729, 4475, -1481, -12816, -2937, -13334, -17968, -10994, -7030, -22826, -16345, -2115, -4004, 3142, 17425, 12082, -9482, -5491, 10453, 20504, 24051, 10427, 13902, 15407, 5425, 14028, 17276, -2767, -12002, -5708, -4364, -525, 8788, 13222, 6798, -5694, 4618, 8007, 10391, -6813, 2880, 10526, 3879, -9713, -1246, 19349, 14859, -1638, -3573, 11852, 12455, 23937, 28919, 13052, 11398, 11237, 10828, 6719, 11760, 7428, 11299, 20061, 16857, 10403, 21475, 26108, 21319, 22870, 22231, 18167, 23589, 19702, 20485, 17653, 9820, 18045, 16542, 5596, 2084, 5807, -365, 4662, 9798, 12406, -3862, -11145, 11201, 14003, 5748]
19397E748p258O910J2414j1275j5770J2924K2580K384p105p867o235k209q58Q226
19383A2609m128l352N217m477P956J0756J1204K337j1737j0332q000q464J885
19370A474J2554J0316j0732j1380N0M845m246J0509O527K429o376q46J1129j977
19356B4276r292p699j586K057o90P383J8147k3213j323J5r535q5N034k8946n285
19341c0742K2620J5119q98n987n092q675J0143J7920L305J228r56j00J834K977
19327B2696j5110j1207J1878R306l25j5356j046P863N973n789R086J6906J819
19314C6694l715o171k745K810q81j8512j2704L591J0217K496l077l455j5799L338
19300g913J8926M103N106K021L788J1684J440j4285r179k406j2105J127N912n237
$$ y = [5748, -1510, 5400, 17814, 6539, -9231, 3693, 26273, 28657, 21552, 13685, 7450, 5241, 4383, 12609, 8481, 5129, 10346, 5869, 13825, 24581, 35785, 38122, 26385, 16053, 8053, -411, 1474, 14028, 24344, 13612, 2232, 2282, 7127, 2881, 13390, 19917, 22346, 15970, 15124, 26253, 24276, 14984, 7285, 5699, 7756, 7066, 14449, 32596, 9383, 8060, 8075, -1460, -1545, 3489, -25457, -30742, -8122, 6997, 6099, 112, -4980, -13655, -3512, 14408, 17713, 18941, 17985, 17885, 19719, 22696, 7586, -3621, 8257, 17563, 17238, 1882, 836, 8699, 14672, 8883, 17969, 34875, 36694, 32979, 26808, 24063, 26873, 25992, 7480, -5224, -1633, 8584, 11080, 8003, 4548, -11251, -7913, 11013, 15116, 20222, 22243, 26031, 37715, 39155, 24870, 15691, 13285, 1180, 2307, 8219, 2982]
19286B982m378J3651J209Q501J4169o124j2163j7700M476J2498P825J3338j3391
19273B4893r027r490q679J0643k47K193O99j798N988m247j2129r467P327J6926
19259A3585j0508l15r658N374N880M378q63J4806l471M426q762j5925j778K949
19245A18m5l492O127J0839J0425k593m57l981k858p568r430n83m602N622L777
19230A299p049K914l849P709N559O985k356m006J8199O070q776j4300o712n025
19216c338J128J3669j500r601j1437J0634R827O772r292q704m451M292P067J0372
19202A5438K604k0225n901J0282l860J11O116N127K136L400j8596J810J6312k968
19188A1786m940J2804O199k422r913r601J4234J018j1688n545N113L599q287j0556
$$ y = [2982, -1396, 12255, 13464, 21965, 36134, 30010, 17847, 147, 4623, 17121, 24946, 38284, 24893, 15866, 6376, -2303, 8340, 8093, 10286, 10985, 9187, 15175, 10928, -1201, -10668, -3341, 13585, 3077, 2762, -6896, -1522, 4358, 8736, 7873, 22679, 19208, 23634, 14872, -1053, -2831, 118, 73, -3419, 2708, 13547, 23972, 21379, 20922, 16941, 14083, 6515, -2915, -3498, -8100, -2478, 1299, -5750, -2836, -6685, 1024, 6583, 13568, 11212, 7206, 25405, 31475, 22699, 8399, 1687, -3338, -2210, 11459, 9959, 358, -11079, -445, 9382, 16154, 6862, -1842, -6293, -2001, 5066, 15438, 18042, -2183, -8084, 2198, -1662, -1551, 4565, 9692, 11828, 15228, -3368, -1558, 14754, 11786, 6846, 19650, 25849, 23427, 13514, 3913, 18147, 19165, 7477, 1932, 7045, 10644, 2357, -8199]
19174h199J7262NJ108L537k247j2272P089J0887j781q201K92L712J3903M416q808
19159B0703M342L956L584o884k5038o985r299M640K5206O937q308n111l863m299
19145d19Q826p652j7393J621R614J3372q934M899q2n622Q186K704J8752m862j6824
19130F186P10J965k010R667M59r552p697O939J663p381j2011j3r510r548n625
19115c5758J8095J9549P328q167o183p952l578k919J6050K4991O882j724l874
19102B2740r750p54J1472N924q032j0469k682O057J946m757p956J756r253j4278
19088a8036P081O187M206J95J579J667K297j4055k228J6117j795q722J994J344
19074b169P034N746n261M486k633p61Q366l410p721M714o94l404j4977O365J1471
$$ y = [-8199, 9063, 9068, 10176, 13713, 11466, -806, 6283, 17170, 15389, 7188, 7480, 11192, 25095, 29511, 20703, 25045, 29001, 32585, 25701, 663, -6322, -15621, -10981, 14225, 21162, 12854, 7743, 3880, -419, 8407, 755, -16638, -15017, -5403, 7969, -965, 3934, 3852, -1770, 6416, 9120, 27872, 23010, 6186, 6896, 8861, 6851, 16518, 16977, 7425, -272, 6667, 8330, 949, -11062, -11075, -20585, -30133, -35758, -17663, 1886, 9214, 1047, -5136, -13088, -16666, -19585, -3535, 21456, 28338, 26614, 22740, 12990, 12236, 23708, 29632, 21600, 11131, 8449, 14506, 16452, 11695, 3739, 5495, -3758, -18036, -10955, -4768, -562, -367, 1212, 2879, 5176, -8879, -11107, 5010, 3215, -5507, -3513, -2169, 4865, 10611, 5350, 9836, 7203, 6442, 14808, 11398, 3677, 8391, 7697, 4293, -10684, -4319, 7152]
19059G152M235o655L381M13K26j912N530J2062J1760q389o004m827j0674L643
19045I941O792M418l161j9719j450P820J4570J7127O33j0631j5570L602j04n681
19031H587J480R770k649o397k648M656j0154J768K012r400j3379k879J5132J9503
19017A5402R063N352j3407j5016j4100M749J2622P484O930L1l087M518Q063M233
19003C2837J521q393o325r511o649L057P035M603j5493j734q2l060J2658M577
18989A5041J3136l821k4034N996J791q15l307m65M015j638K268J0298J5843N7
18975C4365j6740j593q11m355r042K186m09J4981J2006n17j0855O948J3367j6121
18961B3410L292q697r303l944l37j208Q050J7575J7885N349k7933j8476o790o79
$$ y = [7152, 11387, 4732, 8113, 8526, 8752, 6840, 12370, 24432, 36192, 27803, 21799, 16972, 6298, 9941, 16733, 21151, 17990, -1729, -3179, 4641, 19211, 36338, 36971, 26340, 10770, 14372, 14268, 8587, 10067, 19837, 17188, 10791, 8143, 12799, 2645, 4413, 6425, -2975, -16354, -19233, -4101, 15402, 24465, 29817, 16410, 1394, -12706, -7957, 4665, 12149, 19079, 19110, 16023, 20541, 28604, 32837, 34358, 25965, 19640, 10129, 3480, 6537, 13572, 18175, 2682, 948, 866, -2194, 10464, 15041, 28177, 24356, 322, 6318, 8109, 7294, 3987, 3522, 7537, 5899, 8167, 18465, 34308, 34365, 17625, 16032, 15221, 10866, 1824, 4010, 3601, 18582, 30588, 30071, 19216, 26164, 39531, 23410, 26702, 18005, 8702, 4758, 4421, 3213, 11263, 28838, 46723, 52072, 24139, 5663, -1127, -1806]
18947a806K647J1045J65n129k909N297J132r376j121M679L186N927Q228k13j018
18932B0734k446N121P28j6024l1059n232J1706J0653Q47n562p7l951Q409J5790
18918I637N568m981k932j2919m217j587J679K138J807P35j286r098R180J4552
18904H276O510M166r253R758R116q934k419p691K255K4630P660q872j0657p198
18890A7347k321R544O235m579Q018R055j5791j4496n507J451O752j6161R243K4155
18876C2945N992k0421k5118o359R298J0391J2800P216n811j7235N917N819N590
18863B1024J540j9527j1535P779N873J3526k23k347q005k329j664J416R392r932
18849D988P623O631o336J4729J0300n659l916K807j7898n685O009Q905j7583j0626
$$ y = [-1806, 841, 11886, 12051, 6922, 4013, 9310, 10442, 1066, -55, 4624, 7810, 13737, 21965, 21752, 20734, 18288, 23409, 24137, 8113, -22946, -28178, -16472, -5819, -4972, -10534, -10611, -14562, -6153, 9637, 15205, 10224, 7292, -5627, -9844, -11431, -9752, -7614, -5807, -5072, -6358, -15456, -6276, 8276, 14786, 18952, 9699, 19457, 28573, 19639, 17220, 9529, 11784, 36414, 44074, 35202, 24545, 17347, 15026, 24570, 30805, 26226, 34244, 43299, 27508, 13012, 7505, 8956, 15708, -453, 8790, 32945, 38937, 18516, -6602, -12961, -3663, 6728, 19528, 26744, 20933, 3698, 9615, 15434, 21024, 22564, 3037, -8498, -719, 5154, 18680, 18457, 16110, 8105, 5776, 4112, 5528, 14920, 4988, 12611, 19242, 12906, 27635, 37935, 32276, 28360, 31167, 13269, 7584, 13593, 22498, 4915, -5711]
18835e711K3456J981j779J3279M604q997j1011J2178J3427j0134J26M23j5670
18822A6172J629k616j5754K242P149M310K25J0665M59J294q062q934o945k539
18808g05N421P184Q973J9402n397j2406j5256m95R455P293j8377j3888j2601J3288
18794h109J7973L510J350j103j170M52Q264q210q964J3583R558o882p364J0278
18780B3166N360r587J5640R66j4589p924J2348R215J3469k144j1506j0332J9240
18767D3322J8014L632K3026N9787K5676l2566m8048m500N336k1404j2855j6590
18755D2830j4380p145p604R065N015r467r037p445o31J69R30L105p80J6330K04
18740B1159j6547R658K374L995M592j4302J657J6497O50l712k412L199K105K030
$$ y = [-5711, 17745, 19726, 17947, 31226, 35830, 26833, 15822, 28000, 41427, 31293, 31419, 31842, 16172, 17801, 15185, -569, 1673, 8822, 13132, 13357, 24022, 24481, 25775, 17713, 8779, 1834, -705, 4716, 11900, 20873, 40275, 34878, 22472, 7216, 6721, 16176, 23469, 5092, -8796, -21397, -8109, 9864, 13374, 14724, 13621, 12451, 12903, 21167, 12957, 3993, 17576, 27134, 20252, 12888, 23166, 28526, 18939, 34579, 35545, 20956, 13032, 25380, 34595, 48064, 45920, 34414, 24082, 43322, 61336, 64968, 87994, 147781, 173457, 140891, 92843, 88343, 93679, 72275, 59420, 42830, 28450, 21305, 13701, 22766, 27781, 18314, 9277, 1832, 1201, 1370, 2300, 5405, 4625, 20955, 21159, 4612, 14270, 16644, 20639, 25231, 10929, 12586, 29083, 29733, 26021, 23609, 26808, 28913, 30943]
18726C0943J394r826L496O494J884L120K013l098K984Q982O267j1265j1267m29
18712C1692M788l478j2307k060J9224J3816j7957o701P678l564j0582r418r681
18699A450J0414J0784l785k014J541j2428J2539O253o691Q386l711j5910k352
18686D476P597L077j703J80k53Q971P126q93J2737J1362j7812j6092p817o801
18672D155J700J1699j0351j9044Q720K776J703J1636J1672M764j716j936Q320
18659C4098K094j8839N67J2875j5320j922L624L423j595J2359N87o78r305j3076
18645H892m328q674N579J6519o520O550n673k235J0158M288k6J52K324J664j3036
18630A5634j0811L46Q520J6881J1490r944j0431m114P506J485j8898k691M109
$$ y = [30943, 32337, 22511, 26007, 32501, 34385, 37505, 39518, 36420, 39404, 48386, 54653, 43388, 32121, 31692, 36480, 33002, 20695, 18635, 37859, 51675, 33718, 27017, 34695, 31131, 20549, 11131, 1450, 11864, 22648, 18863, 16849, 18390, 5962, 18501, 24754, 18063, 26449, 22738, 6828, 4476, 12073, 15150, 13447, 13627, 13374, 22345, 29471, 28578, 41315, 52677, 34865, 18773, 10956, 4155, 5855, 17554, 7203, -11841, -3121, -345, 1358, 12994, 24666, 29430, 27714, 25778, 34098, 36192, 17353, 17920, 30795, 15475, 13553, 17177, 20600, 19005, 31364, 31951, 31273, 21968, 8892, 4564, -4110, 1469, 17988, 11468, 18018, 12345, 10110, 20268, 24556, 24530, 24682, 27006, 28670, 15634, 4823, 5169, 13689, 30570, 42060, 32116, 21685, 17571, 25077, 26562, 7664, 4973, 9082]
18617I082m056l602o620J2564J8729P0j660Q756o877j3741K4P998J6750j007j7438
18602A8972k592Q49Q781k449N964O538q225j1644j138O278P495j0179k7800j0187
18588a9337L791O433J3654J1197Q794J3151J2453R663k705j8829j2128k2907j1521
18575h291Q739P098J9229q129o550K211N398J0284J0745N404m928P73m263n859
18561C1861j3642p798l274P710J4635r800j3102J292J5576P689n500m029J08r217
18547A2509n260O340K1917O536K642j0417k4534k2449J0186L0274J3427k379k6168
18534A2624K782J4139K0486J0500p90j2494L403o87j0677o405M085j2384o2L186
18520B7706r072K7878K2186P882P953J3723n063q762J9988J9012K4077M2353O1745
$$ y = [9082, 5026, 1424, -5196, 7368, 26097, 26167, 24507, 33263, 26386, 12645, 12669, 20667, 37417, 36410, 18972, 16380, 17229, 26010, 23561, 29525, 36063, 27838, 16194, 15056, 21334, 28829, 18650, -9150, -19337, -15546, -9113, 4541, 15738, 24532, 37683, 50136, 59799, 57094, 38265, 26137, 3230, -8291, 448, 7546, 26775, 18646, 12096, 14307, 19705, 29989, 40734, 46138, 41210, 41983, 37720, 31861, 18219, 10421, 7147, 14857, 29492, 19692, 6590, 7882, 23458, 31147, 25647, 21618, 21726, 12509, 7249, 13589, 35506, 42042, 44684, 34267, 9733, -12716, -2530, 27744, 41171, 38792, 12624, 15406, 29545, 50031, 60531, 59741, 47247, 50650, 49963, 39286, 32881, 36966, 24582, 24520, 27706, 18634, 46512, 68698, 76580, 84533, 98256, 93193, 84431, 104419, 123431, 147508, 189861, 251606]
18507B51606J19022K43993M22781L41497r2768k36775j88252j37031j60442j72254
18497C91377j20517p6355m3913j9860M466j0463k1623j2125L931J0216n409j3768
18485H5957j8266p231q76j8925O722K6988J8609m615L043q3J1806K1608L9998
18472A64735O1828P2959J21683K53054M42999L61717j07618k66402j79522j27260
18462G98173j75938j89933j33102p2360o0482l9424o559J0554k0251j8204P309
18451I9783p579K589m833j0313q298o166o199m451N371M59j3058M288o115o649
18437C8829Q589m7M674J0929p585n997k759k202Q1j2456P763j1219J950J01l092
18422B7559N004J4489J68J2394m102j6512r603J5534J4563J4560q678p183q924
$$ y = [251606, 370628, 614621, 1037402, 1378899, 1286131, 1049356, 861104, 724073, 563631, 391377, 270860, 194505, 150592, 130732, 135198, 124735, 103112, 90987, 94918, 105134, 99725, 85957, 67691, 60460, 59584, 40659, 47381, 74369, 92978, 88363, 91406, 91323, 103129, 124737, 164735, 226563, 299522, 421205, 674259, 1117258, 1478975, 1371357, 1104955, 925433, 798173, 622235, 432302, 299200, 226840, 166358, 126934, 120375, 130929, 110678, 92474, 99783, 92204, 94793, 89960, 79647, 71349, 65183, 58984, 54533, 59904, 60363, 47305, 51593, 45478, 38829, 47418, 47371, 52045, 62974, 55389, 49392, 46633, 44431, 44512, 32056, 39819, 28600, 30550, 30651, 27559, 32563, 47052, 47220, 59614, 55512, 39000, 29397, 44931, 59494, 74054, 65376, 58193, 49269]
18409D9269j3553Q93P73n453K302n581R458J2701J0207p862N398K383K627K333
18395F5895j0233l4947j5175r669M074J7160N801N57J1946J0968j551M328R30
18382E0084Q689m619L286J6924j5055k6057o257P795K140L394L333N116l343K967
18368D8397J1667M373l534J680m106p228K704k10j441R823j3747r802R341J5034
18354F2951Q266q333k875Q528j2811j7454k215J852p345O927R350O016K048M92
18340E5397p653J568l089j1062O510K037k3865Q321Q131rj4730r284M393m46J7378
18325C3597Q300J0817R204M652L53n647j2410J743p608j1385J268J831R606Q560
18311E2881N659j7979j4689p944L022K2868J2001K959J2956k7076k6466M677O715
$$ y = [49269, 35716, 36609, 37382, 31929, 34231, 28650, 38108, 50809, 61016, 53154, 58552, 60935, 63562, 65895, 55662, 20715, 5540, -4129, -55, 17105, 22906, 23463, 35409, 46377, 44826, 49154, 50084, 58773, 54154, 57440, 74364, 59309, 33252, 26995, 34790, 36930, 40324, 43657, 48773, 45430, 48397, 60064, 64437, 60903, 62583, 58477, 51249, 53953, 53743, 52302, 62125, 48378, 38576, 47917, 62951, 71217, 62884, 60009, 68537, 55726, 38272, 36057, 37909, 30564, 37491, 46841, 52857, 54905, 55397, 47744, 49312, 46223, 35161, 41671, 43708, 19843, 28164, 36295, 36286, 21556, 12272, 16665, 16219, 33597, 41897, 52714, 61918, 66570, 66923, 61276, 48866, 50609, 43001, 31616, 32884, 34715, 44321, 52881, 58540, 40561, 25872, 17928, 20950, 43818, 55819, 58778, 71734, 44658, 18192, 22869, 29584]
18298B9584J794K841R454J8714K627k0540r23J1613j574r653j3977Q02J2386Q493
18284E1641k546J1213R240j8794j0805j237J2183Q189K305j0071K130J3229j3668
18271E3009J270P358p95j7011O435J9375R003P689q799p827j1795j092K493Q502
18257F7815Q669O524n362j2862j2511R132J1155N812Q6K4337K634j4074j3607
18244G7748j3278N615Q585K5881J2644k3260j6317M814J2562p444j6040j6166
18232E5344P117J1914M871q533k025r542l794J9910J6836l771j2723j0393J4738
18219G9949J9088J22m518K507K6278L9383M7813L1847n3600p8294l5433k3679
18207E1463k7900k275L2646M3974J1275k3270r512J249N55J1514J5343R445P724
$$ y = [29584, 31378, 34219, 43673, 62387, 65014, 44474, 43551, 55164, 53590, 43937, 29960, 30762, 43148, 51641, 49095, 60308, 69548, 50754, 39949, 38712, 50895, 59084, 61389, 51318, 53448, 66677, 53009, 54279, 61637, 60842, 43831, 50266, 69641, 78644, 86333, 77534, 69707, 57912, 56820, 59313, 67815, 76484, 83008, 77646, 64784, 52273, 61405, 72560, 78372, 78458, 102795, 105429, 91355, 77748, 64470, 70085, 78670, 104551, 117195, 93935, 77618, 82432, 94994, 87550, 71510, 55344, 62461, 74375, 79246, 70713, 68688, 59146, 55352, 75262, 92098, 88327, 75604, 65211, 79949, 99037, 99159, 94641, 97148, 123426, 162809, 210622, 242469, 188869, 110575, 75142, 51463, 23563, 21288, 53934, 97908, 109183, 85913, 76401, 77650, 78205, 89719, 105062, 114507, 122231]
18194A22231J050j829l052j5362j9065q340k684R14K222J8742M341n560J7336
18181A10944J1965m715P181K4435N1613N4586L1777l1965p4971l6739k9558j0725
18169A03828k5444k1032J164P890K0423J4132J6784L8301L1547L1852L7375l216
18157B53604j7971j5870p201k0623k2242j5878M80K885k100l338l448J0973j69
18144A59102j3082M13J7583K7756K9012K1866M415N203J8941K2195J2648J4390
18132C20442L1031M6911P4665J34085K75991M21290K21210j29212j54389p2781
18122A169243p7680j20665j09604n5774J0397N3673J08316J42187J96158L12534
18112A628785M25840O06200R49439J577329K940073N973796R749239M420321m454563
$$ y = [122231, 123281, 121452, 118400, 103038, 83973, 75633, 72949, 73863, 76085, 94827, 99168, 93608, 110944, 122909, 118194, 125375, 149810, 201423, 256009, 287786, 255821, 180850, 144111, 114553, 103828, 78384, 57352, 58516, 66406, 86829, 100961, 117745, 156046, 187593, 219445, 256820, 253604, 235633, 219763, 212562, 191939, 169697, 153819, 154299, 157184, 155084, 151746, 148298, 159271, 159102, 146020, 146433, 164016, 191772, 220784, 242650, 247065, 252268, 271209, 293404, 306052, 320442, 351473, 398384, 473049, 607134, 883125, 1304415, 1525625, 1396413, 1242024, 1169243, 1091563, 970898, 861294, 805520, 815917, 869590, 977906, 1120093, 1316251, 1628785, 2054625, 2660825, 3610264, 5187593, 8127666, 14101462, 23850701, 28271022, 23816459]
18103B3816459n128730k863006k532099l570770l447614k234122j267512p20139
18095B052467l85526j48308l2707K8147J88693M33006K11431k84375l52094k22278
18085A488456j76176k30292k33169j69981j18199o1555m2117k5335j8649k2662
18075C90321k5442j8302k3033l3016m8461k1495n138k3718j5001l786J975j6669
18063A58235k4164n3484k7589p222j458K2511J08738J06823K2922k8520j0150
18052B66642L004l851j5759j069J558P486K1761J000l972o917j3790k3571J7171
18039B49693J7502k821j111k714r504k5955n8946q4722l7772J7336M4856N1732
18027A57574N7759L4960P738K791K4830K3175M496o014M730R014j0542j319O75
$$ y = [23816459, 18687729, 15824723, 13292624, 9721854, 6274240, 4040118, 2772606, 2052467, 1666941, 1518633, 1485926, 1514073, 1702766, 2135772, 2347203, 2062828, 1710734, 1488456, 1312280, 1081988, 848819, 678838, 560639, 499084, 456967, 431632, 412983, 390321, 364879, 346577, 323544, 290528, 242067, 220572, 215434, 191716, 176715, 172929, 174904, 158235, 134071, 80587, 52998, 45776, 44318, 66829, 175567, 282390, 305312, 276792, 266642, 269646, 265795, 250036, 248967, 250525, 258011, 279772, 280772, 276800, 269883, 256093, 232522, 249693, 267195, 264374, 263263, 260549, 251045, 225090, 166144, 81422, 43650, 60986, 105842, 157574, 215333, 250293, 258031, 260822, 285652, 308827, 313323, 307309, 312039, 321053, 310511, 309192, 309867]
18014C09867k1377l4169q564j0347n367Q653k0615j2464K7268K9735J8239K5750
18002C06609J7247Q864K476l458J051j2682l8046p6955o0561n592M2991M2276
17990B24220L3088L1125K0578Q200o649m181J7718l193j1099J8274K0287L4618
17978C82986J5123N892q493J1196K2379K1778J6879j4544j0624K2503M2349Q723
17966E16147k150J4L3628J8322J7166K7998L0130K9310L7582J5359l355k0426
17954F99725k4102j6931p455K5470L1221L4613P0504O9419N9586P6712J18645
17943A137407K43664M32473L13250o7776j67955p7329l5283p9082p8793r964J8819
17932A629431M5368Q1687J22065J72917L37230O06692N05791N2813m641J34484
$$ y = [309867, 288490, 254321, 245757, 235410, 230043, 238696, 218081, 205617, 232885, 262620, 280859, 306609, 323856, 332720, 335196, 331738, 332789, 320107, 282061, 205106, 144545, 138953, 181944, 224220, 257308, 288433, 309011, 317211, 310562, 306381, 324099, 320906, 309807, 328081, 348368, 382986, 398109, 404001, 395508, 406704, 429083, 450861, 467740, 453196, 442572, 465075, 507424, 516147, 513997, 514011, 547639, 565961, 583127, 611125, 641255, 670565, 708147, 723506, 720151, 699725, 675623, 658692, 651237, 676707, 707928, 742541, 813045, 882464, 942050, 1018762, 1137407, 1381071, 1813544, 2126794, 2059018, 1891063, 1813734, 1778451, 1699369, 1620576, 1610612, 1629431, 1674799, 1756486, 1878551, 2051468, 2388698, 2995390, 3501181, 3553994, 3549353, 3683837]
17922C683837J70436R7368R9592K06238L41519N65737R22488J325276J741623
17913I154114K357371L202578L916671N253472Q266480J4186772K7063889N5010047
17905A28411394P8731504J8963215m1763754l7756936k0589483k1244516k9720783
17898G5030641k6605857j6536973r041246n050681l052250j824019r56123o24248
17890A1339244n29723m98264q10224p68239m40017k19775j66603J14692K54877
17881H275968J11816L20709Q26732J314594J761102K409988L395685M498041O354304
17872B9268939J0028442J7133854L2299975O5234708R6813415K9972124m9149540
17865B31601917m8248942k6556461k5825074l6427037l3771547k1472978j1838651
$$ y = [3683837, 3854273, 3951641, 4051233, 4257471, 4598990, 5164727, 6087215, 7412491, 9154114, 11511485, 14714063, 18630734, 23884206, 32150686, 46337458, 73401347, 128411394, 207142898, 226106113, 184342359, 146585423, 125995940, 104751424, 75030641, 48424784, 31887811, 22846565, 17795884, 14743634, 12919615, 11963492, 11339244, 10809521, 10311257, 9501033, 8732794, 8292777, 8073002, 7906399, 8021091, 8275968, 8387784, 8708493, 9535225, 10849819, 12610921, 15020909, 18416594, 22914635, 29268939, 39297381, 56431235, 88731210, 153965918, 250779333, 280751457, 231601917, 183352975, 156796514, 130971440, 94544403, 60772856, 39299878, 27461227]
17858B7461227o646917m085715k596143j644139j377678j542397j432704j154277
17850F981257r32274o88399m30077k70305j58J0030m17814n31660l91785l05521
17840C023294l39639l35583k90143k28637j49581o8977K0180J43646L80092M41754
17830B596406p7495l46770k36784j59583k04922k34963j94011j10275n2132m9069
17820I30402l4644l5101o5577n9146p2833r5625j02162m3298k0998r420j1802
17809C79796l711K0911q467k4152k5960k785R820K599j4676k6061K619M216j7885
17796B96264O66q912j1169J1670K2948J6719L2247J7617R530Q949Q3j8247j8613
17783C59752r340J6001l6068l0299J2546M7552O9450J6380m2975k5575k4426m6933
$$ y = [27461227, 20814310, 16728595, 14132452, 12488313, 11110635, 9568238, 8135534, 6981257, 6048983, 5360584, 4930507, 4660202, 4660044, 4670074, 4252260, 3720600, 3328815, 3023294, 2683655, 2348072, 2057929, 1829292, 1679711, 1610734, 1630914, 1774560, 2154652, 2596406, 2518911, 2172141, 1935357, 1775774, 1570852, 1335889, 1141878, 1031603, 979471, 930402, 895758, 860657, 795080, 735934, 663101, 567476, 465314, 422016, 401018, 391598, 379796, 376085, 396996, 388529, 364377, 338417, 335632, 345452, 348051, 333375, 307314, 309933, 314149, 296264, 296930, 288018, 276849, 288519, 311467, 328186, 360433, 378050, 387580, 396529, 396612, 378365, 359752, 350412, 366413, 330345, 300046, 312592, 360144, 429594, 445974, 402999, 377424, 352998, 306065]
17771C06065l7523k9692k2967l7215j2393J0165P058l6144m8900k8084l6219m2156
17759h005J599J05119J16083N8996J1704j2963j4651J403m553o639J7936L2030
17747B98059M2696M9778O8260Q0652K40626M12091J85602q2916j24538j10938
17737A059372j41139j74342j44693l9405P4889K61256L30669q501k33379j82763
17727H01964j02382j25256j63567j19051p0838l2628N6414J05502K0001n9765
17717C10394o9434m9667K1375R1149N0693K4493L1516K2554l419k3853l4111j8783
17705C52907j6428J8136J5829O726j6541l4696j1837k5961o0004r7404o8126j2222
17693E0379M4351L5819K6372M2101K0883J3050J4349j254j648K6560M1804J2574
$$ y = [306065, 268542, 238850, 215883, 178668, 166275, 176440, 183498, 147354, 98454, 70370, 34151, -8005, -6406, 98713, 214796, 273792, 285496, 272533, 257882, 259285, 254732, 248093, 266029, 298059, 340755, 390533, 458793, 539445, 780071, 1192162, 1377764, 1294848, 1170310, 1059372, 918233, 743891, 599198, 559793, 634682, 895938, 1226607, 1218106, 984727, 801964, 699582, 574326, 410759, 291708, 220870, 188242, 244656, 350158, 370159, 310394, 240960, 191293, 212668, 303817, 354510, 379003, 410519, 433073, 429654, 405801, 371690, 352907, 336479, 354615, 370444, 377170, 360629, 325933, 314096, 288135, 228131, 130727, 62601, 50379, 94730, 130549, 156921, 199022, 219905, 232955, 247304, 246050, 244402, 270962, 312766, 325340]
17681C25340j6856m1493k7921L6137J14192R0915K512r620K0693r174m7441l7931
17669C99353j2237j5059p854J3446J9270N692k928m375q477l2919p1267n5203
17657B27442k4167L0129M6495K4050K9677J5749R384J1106L398k648K065O997
17645C79677k918j4698j8786J1810M4518M9149K6000J7459K1199K1911J266l966
17633E32621J6439J8172K2504J0616L426K4626K4006N972N003M2900N7805K5687
17621G89777J2835o468o747j7723k8792J0000K3503M7895N3083M3554N7156M8156
17609A026229M1636Q6926J53901K93545M89773N63826N0429k25115j50075p6821
17599B254254j01191j51969j27195n0153L8090Q8833Q6146J70512K85574L01589
$$ y = [325340, 308484, 266991, 239070, 275207, 389399, 480314, 482826, 473206, 493899, 484725, 437284, 399353, 387116, 372057, 364203, 377649, 396919, 402611, 399683, 395308, 386831, 353912, 282645, 227442, 203275, 233404, 279899, 303949, 333626, 349375, 358759, 369865, 373263, 370615, 372680, 379677, 376759, 362061, 343275, 355085, 399603, 448752, 474752, 492211, 513410, 535321, 536587, 532621, 549060, 567232, 589736, 600352, 603778, 628404, 652410, 658382, 663385, 706285, 764090, 789777, 802612, 796144, 789397, 771674, 742882, 752882, 776385, 824280, 877363, 920917, 978073, 1026229, 1067865, 1154791, 1308692, 1602237, 2092010, 2655836, 2706265, 2481150, 2331075, 2254254, 2153063, 2001094, 1873899, 1823746, 1861836, 1950669, 2036815, 2207327, 2492901, 2794490]
17589B794490K93501L82136N29371P17612P35514K97369J17537L06571O29981
17580F804082R81680J362291J879445K597709L672136M842956O487384R892960
17572C8520643J6735633L1353695O3369817R7259727L4921819m7290523m8939033
17565A85931778k7019768k5173449l5985570l4019630k1666438j1998509p072388
17558B2996026m544307l002013k114500j640243j236238p55116m39711n99089
17550H664809n45101j54342Q1080k22944l65030j10962K46511N68594Q60963J246367
17540A0269945J838689K720801L699049M993427P616707J2971748K4279652M8899653
17532A17289671P8531073L4101373l7091044m1504957k2798535j9975359k8809225
$$ y = [2794490, 3087991, 3470127, 3999498, 4717110, 5452624, 5749993, 5867530, 6174101, 6804082, 7785762, 9148053, 11027498, 13625207, 17297343, 22140299, 28627683, 38520643, 55256276, 86609971, 149979788, 247239515, 282161334, 234870811, 185931778, 158912010, 133738561, 97752991, 63733361, 42066923, 30068414, 22996026, 18451719, 15449706, 13335206, 11694963, 10458725, 9703609, 9263898, 8664809, 8119708, 7965366, 8046446, 7823502, 7458472, 7347510, 7594021, 8162615, 9023578, 10269945, 12108634, 14829435, 18528484, 23521911, 31138618, 44110366, 68390018, 117289671, 195820744, 229922117, 192831073, 151326116, 128527581, 108552222, 79742997]
17525G9742997k8021544j7994107r873288n767427l710459k468780j734367j372796
17517H800229j026984n73225l21107p36202r95300p85358n55541m94058m49869
17508B862585l32928k59212k20324k07169j68118j02796j10731q0318k5493L4488
17498A389984J28214L43185L40878q4272k60181k01086j16166j65035j97512j49354
17488A028655p9061j2666L6215j3921n3572o0770l3149j1026J5464Q7609J86650
17477A090428K20585K99745P1184k23802k39453j50394j10314j48129j23602m5792
17467F40456Q9562K46411L23305L0274j81653j00735L590o3634j87557j80402
17457F19617j07857o3554m9511n0146m5438j8496j9465r369j6574r849o035j660
$$ y = [79742997, 51721453, 33727346, 23854058, 18086631, 14376172, 11907392, 10173025, 8800229, 7773245, 7200020, 6878913, 6142711, 5147411, 4362053, 3806512, 3312454, 2862585, 2529657, 2270445, 2050121, 1842952, 1674834, 1572038, 1461307, 1380989, 1355496, 1389984, 1518198, 1861383, 2202261, 2117989, 1857808, 1656722, 1540556, 1375521, 1178009, 1028655, 949594, 936928, 973143, 959222, 905650, 844880, 811731, 800705, 816169, 903778, 1090428, 1311013, 1610758, 1681942, 1458140, 1218687, 1068293, 957979, 809850, 686248, 640456, 730018, 976429, 1299734, 1330008, 1148355, 1047620, 1051210, 987576, 800019, 619617, 511760, 448206, 398695, 348549, 303111, 284615, 265150, 255781, 239207, 229358, 223323, 221663]
17445B21663k9014j4714N5103R5653J12370P6494J196o2406o5069n3197n5304
17434B82775o4540k6563j6062q896n60n963j308j0131k160j40j8509k7054j3970
17421H6919k842j4247j045k569j8085k0975j7505J115K0640M0490n673j3359L992
17408E6856k926K794N5632P6605P7223K5366q184l1195m4604m8072m3741k2618
17396I3136j0869j3253j0677q65O59j959j2231p927k3192j9543j8558J7937K5822
17383A8480j1651l9149m0837k9818L0567J16276Q2161N6095M9310J4038j7476
17372B27996j4482k6210k7447j3548q794P264j796J1102j7054m0325k1150q472
17360F7084j4856o971O081N578j2548j2301N058k8178o389J2861m175J2148J1838
$$ y = [221663, 192649, 177935, 233038, 328691, 441061, 517555, 518751, 456345, 391276, 338079, 282775, 218235, 191672, 175610, 166714, 166154, 160191, 158883, 148752, 146592, 146452, 127943, 100889, 86919, 84077, 69830, 68785, 66216, 48131, 27156, 9651, 10766, 31406, 71896, 66223, 52864, 56856, 53930, 56724, 112356, 188961, 266184, 291550, 283366, 252171, 207567, 159495, 115754, 93136, 82267, 69014, 58337, 57472, 58131, 56172, 43941, 36014, 12822, -6721, -25279, -7342, 18480, 6829, -32320, -73157, -102975, -72408, 43868, 126029, 182124, 231434, 245472, 227996, 213514, 187304, 159857, 146309, 137515, 144779, 142983, 154085, 137031, 96706, 75556, 67084, 52228, 45257, 51338, 56916, 44368, 32067, 37125, 8947, 2558, 15419, 11244, 23392, 35230]
17347C5230K7985J1136j7503k7054k3289J7922R4996P2049J0728J3006J4391p733
17335B21864k7432l3617j600R040L459r326r074Q700o296j7003k2971j1116j6218
17322H8410O52Q035q121k3610j0595K161J2195J5751K7029r834k5355o889L877
17309G3706N53k690r373O361M5636L2194Q333J9972L3361N1640N1793P8967J67782
17296E58235L48303O05862O26451J99518k66621l77372k71868k80382k90312k57758
17286E94056j75402j02425n9046n9304m2667j3077j0157j3184J163p591j1256
17275A01110k3894M334K2392J1764r576j5395j0458J1667J4445J5183K1201Q162
17263A50935o00k4800j0253Q1405J89510L74807L59908k5042k02530j43455j04050
$$ y = [35230, 63215, 74351, 56848, 29794, 6505, 24427, 119423, 191472, 202200, 215206, 229597, 221864, 194432, 160815, 159215, 168255, 171714, 162388, 153314, 162014, 155718, 138715, 115744, 104628, 88410, 89062, 97097, 88976, 65366, 54771, 56932, 69127, 84878, 111907, 102073, 76718, 69829, 73706, 74259, 71569, 62196, 68557, 114193, 146387, 154720, 174692, 208053, 259693, 311486, 390453, 558235, 906538, 1512400, 2138851, 2338369, 2071748, 1694376, 1422508, 1142126, 851814, 594056, 418654, 316229, 257183, 197879, 155212, 142135, 131978, 118794, 119957, 112366, 101110, 77216, 81550, 103942, 115706, 106130, 90735, 80277, 91944, 106389, 121572, 142773, 150935, 150335, 125535, 115282, 196687, 386197, 761004, 1120912, 1095870, 893340, 749885, 645835]
17252F45835j45692j77888j35514o4050k5063j1108J561j3504k4119k3118k944
17241B4396q06J8071P960k495k157L971O354K2737M7267K2471r795K0576P7815
17228B36365Q3760p471p7217q9639p5064l8731k4455k4043j0113o306J3622Q046
17216a1246J0678K252M837R563P664o82N833L69r69l331J5936K4081M4440P7489
17202A86914P818l6692j2511j0961l5899m1504j679O168j2969p002n214o069o178
17189B4222L983j5964j2167K478J7510m143m206P192j2272q178p449n70K519R214
17175B169l427J0291J0684m553m570l149J97l109j1270k30r641j3158P829o693
17161b8630L275O986M422O207j1445p893Q985J5752J0113Q553n718j7006P242
$$ y = [645835, 500143, 322255, 186741, 122691, 97628, 86520, 88081, 74577, 50458, 27340, 24396, 23590, 41661, 49621, 47126, 44969, 48940, 55294, 78031, 125298, 147769, 137974, 158550, 236365, 320125, 312654, 235437, 145798, 70734, 32003, 7548, -16495, -26608, -32914, -19292, -11246, -568, 1684, 6521, 16084, 23748, 23066, 28899, 29268, 28299, 24968, 40904, 64985, 109425, 186914, 194732, 158040, 145529, 134568, 98669, 57165, 55486, 61654, 48685, 41683, 36469, 30400, 24222, 28205, 12241, 74, 2552, 20062, 15919, 11713, 18905, 6633, -1545, -8994, -9564, -7045, 2169, -1258, 9033, 19717, 15164, 10594, 7445, 7642, 4533, -6737, -6967, -16608, -29766, -21937, -28630, -25355, -18369, -13947, -7740, -19185, -27078, -18093, -2341, 7772, 16325, 10607, -6399, 843]
17148H43Q014o856k3411j3358M801J5263J8037L43J0799q386j0845J51N929L61
17134A685J256m95k1138k479J473Q838J0037J226J550m51m862Q41R730N12Q020
17119A5743n500j7224n260r69j6943m534J0703M6p73J6678L02l124n755l219J7322
17104b507N899j2649k262p61L251j219M099p108m701q919l03R939P413N783J893
17089b152M772q111j9285n801J4549N328L424J4828j0299q744o655L388K403M427
17075g928M738n368o443J032J5627o060j2657j0469j622J8789P131q853n796j716
17061a9595N588L282l775P376L276J0471k464n697k0772j1047N684K162R224R029
17047g258Q870Q503M317R596L395j0256J1345k215r834N558p981j6432j705K182
$$ y = [843, 8857, 2001, -21410, -34768, -29967, -14704, 3333, 3676, 14475, 6089, -4756, -4605, 1324, 1685, 2941, 2446, -18692, -21171, -19698, -10860, -823, 403, 1953, 1502, -3360, -2519, 7211, 7723, 15743, 10243, -6981, -12241, -13210, -30153, -34687, -23984, -23938, -24711, -8033, -7731, -10855, -16610, -19829, -2507, 3392, -9257, -11519, -12280, -9029, -10248, -6149, -13257, -17958, -26877, -27180, -17241, -9828, -4045, -2152, 2620, -5491, -24776, -30577, -16028, -10700, -7276, 7552, -2747, -11491, -18146, -14758, -12355, -7928, -3190, -8558, -15001, -13969, 1658, -4402, -17059, -27528, -29150, -10361, -3230, -12083, -17879, -19595, -14007, -10725, -14500, -7124, -3848, 6623, 4159, -1538, -22310, -33357, -27673, -25511, -16287, -7258, 1612, 10115, 14432, 24028, 27423, 17167, 28512, 26297, 16463, 22021, 14040, -2392, -4097, -1915]
17033a915J418J3273j302J243o961l814m06p051K235R917q52o062Q232J6059J5399
17018C9413R957K155R025L462J8561L3905L3730Q1363J40176K50907M50892L65898
17006A439444j22454k77632j75779j16946j64359j93810j30395p6780l4009l0273
16996A17007k7188j9331q629j2688j9451o940O327L715N000J2963R978j5497k7737
16983A7529O732N507P476p948J6217L2542K5013L3308L3661N7054J15954K34079
16971E77124M06724L52322q7449k58377j70509j24615j58144j84261j34089o4316
16961A54410m2696j7571J01q015j0586j1359q747J144j6863j0209j212j4539k195
16948A1663Q368n483j1947J1997K407l647K723q774j0836j370K543j5573J5763
$$ y = [-1915, -497, 12776, 11474, 12717, 5756, 1942, 1536, -5515, -3280, 6637, 5785, -277, 7955, 24014, 39413, 49370, 51525, 60550, 64012, 82573, 116478, 150208, 231571, 371747, 622654, 1073546, 1439444, 1316990, 1039358, 863579, 746633, 582274, 388464, 258069, 181289, 147280, 117007, 89819, 70488, 61859, 49171, 29720, 22780, 29107, 32822, 37822, 50785, 60763, 45266, 17529, 24261, 29768, 37244, 29296, 45513, 78055, 103068, 136376, 170037, 227091, 343045, 577124, 983848, 1336170, 1248721, 990344, 819835, 695220, 537076, 352815, 218726, 154410, 111714, 94143, 94244, 86229, 75643, 64284, 55537, 56681, 39818, 29609, 28397, 13858, 11663, 20031, 14548, 2601, 14598, 17005, 13358, 16081, 7307, -3529, -4899, -2356, -17929, -2166]
16935b166j528r570o16P382N535N407j811p059j3994l049R725k172j5448J4687
16921a4677J1721j9888p390J0920P438P834J726J54J945m625K016o709P124l064
16907e475K301J0481j1306K139M820l384O48M262J3349M842k9163j5580m716q407
16893c5189R062r194K0027J8169n172M572J0917l719r272J525J2428k026r928
16880B200q475j877m445n06J4822p19p574o526n839Q984J4316J942J2945o305
16866A2943m85P560K885q763m023j1947j4625m732J8231R350p70j669J536J398
16852F889K19n931q964P629o88J4261O728k345o633j4440p092n041R691O516R104
16837I903j1314k188O657o349p69j1006n171J9853j1881j2824J2523L082J367
$$ y = [-2166, -3694, -13264, -13880, -6498, -963, 4444, 2633, -4426, -18420, -21469, -11744, -13916, -29364, -14677, -2956, -22844, -30234, -19314, -11876, -4042, -2316, -2162, -217, -4842, -2826, -9535, -2411, -5475, -3174, 7307, -3999, -1860, 2960, -424, 224, 4486, 17835, 22677, -6486, -22066, -26782, -35189, -26127, -35321, -15294, 2875, -2297, 2275, 13192, 9473, 201, 1726, 14154, 12128, 2200, -6275, -8152, -12597, -13103, 1719, 1000, -6574, -13100, -18939, -9955, 4361, 6303, 19248, 12943, 12458, 20018, 22903, 14140, 10117, -1830, -16455, -21187, -2956, 6394, 5624, 3955, 5491, 6889, 7108, 1177, -7787, -158, -846, 13415, 20143, 17798, 11165, -3275, -10367, -15408, -5717, 799, 9903, -1411, -3599, 3058, -3291, -4060, -15066, -20237, -384, -12265, -25089, -12566, -9484, -8117]
16824h117q643m3q323J9178P425K2018L01n633j5388q10R248j0911m440M857j0215
16809i496r613K74J1808J8740j2644j5735j361J155J088J2945p036q130P955L931
16795f119o526J965m695k608J1728m776J5743n884R851P42j4853Q06K947J0764
16781I085J4741L108M214o470j4881J20j3799j227J2281P012k035J54p304l904
16767A095p630J778l999m680N283J4549J103n949Q098j1305j3631Q417p800o3
16753a4734p874n272J0874J1660j7497K293l216k087j199r705R287Q954L001R081
16739f434J2678P102J890j066p455L84R249P533l586m941r483o810l048J192m718
16724g513L493O346p409r857O457J7842l07j604j2969o382p103R915M581P324
$$ y = [-8117, -16760, -16803, -25126, -5948, 1477, 23495, 23796, 18163, 2775, 1965, 11213, 302, -4138, 719, -9496, -19109, -18835, -7027, 11713, -931, -16666, -18027, -16872, -15784, -2839, -9875, -18005, -10050, -6119, -12645, -10680, -15375, -17983, -6255, -11031, 4712, -1172, 8679, 9421, -5432, -4626, -1679, 9085, 23826, 26934, 31148, 24678, 9797, 9917, -3882, -5109, 7172, 14184, 12149, 12303, 4999, 1095, -6535, -4757, -8756, -13436, -8153, 6396, 7499, 1550, 9648, -1657, -15288, -6871, -14671, -14734, -22608, -27880, -17006, -5346, -22843, -20550, -23766, -25853, -27052, -36757, -27470, -18516, -15515, -6434, 6244, 13346, 15236, 14170, 6715, 7099, 16348, 23881, 20295, 15354, 5871, -939, -3987, -2795, -7513, -4020, 2326, -5083, -14940, -8483, 9359, 9052, 7448, -5521, -11903, -19006, -9091, -4510, 2814]
16710B814M212n469J73J2656K934n979n539l550K498J9417L576m765j2644o946
16696C388j0402q965N385K3051K798o175R609k912N402J3616j2738k1651l886
16683c480K567j3166j3736J218o499J428K4376Q863m98J922M913J877k288m569
16669B928m458N961J731k0428m018P171P595k670j168k191K537j073K124P081
16655A122l074N087l615j3566L007o376o721L000J6778J743l098M475K806J0418
16641A1986J037N893j5141k2615j404o73m3Q139J0292K845L874J231j8357m134
16627a7070J6010r023q312J4069m81j8627Q795L804p693O621P940J739J032M417
16613C221m851l806q26N173m414n080m428J0598j638J576P536k926J230P430K677
$$ y = [2814, 7026, 1557, 1730, 14386, 17320, 11341, 5802, 2252, 4750, 24167, 27743, 22978, 10334, 3388, -7014, -15979, -10594, 12457, 15255, 9080, 18689, 15777, 21179, 34795, 22057, 406, -3480, -913, -14079, -27815, -26597, -33096, -31668, -7292, 1571, 1073, 2995, 7908, 9785, 7497, 2928, -1530, 4431, 6162, -14266, -18284, -11113, -3518, -6188, -7356, -9547, -7010, -8083, -5959, 1122, -1952, 3135, -480, -14046, -11039, -17415, -24136, -21136, -4358, -2615, -5713, -1238, 1568, 11986, 13023, 18916, 3775, -18840, -20244, -20917, -20960, -12821, -2529, 316, 4190, 5421, -12936, -17070, -1060, -10083, -18395, -4326, -4807, -23434, -14639, -10835, -18528, -11907, -3967, -2228, -1196, 3221, -1630, -5436, -6262, -1089, -5503, -10583, -15011, -4413, -6051, -4475, 3061, 135, 1365, 8795, 11472]
16598A1472J0062q787k0818k194L573j5768j1954J88j7735K598K2720J4683r724
16585b1684N927O027N813o934k1532k16K3181m839m299K552J2377L479j2174L954
16571h368J3783q633j1557o569L118L040K496J9903L6j6662r837N859J0048J024
16557b319P728J4835j3477j8918J1169K687j703p298m360M175M230l075p974Q126
16543f174J9184p68j4356p810j91K343j704n229J818J1145M162o037m528o491
16529a4636O886L757P132n872p306M928K07k564j2491O373O988p39R43p097o330
16514a9821p96J4122J167M867Mn869q666j0833J0855J2849n955j7817O993J8551
16500c49L679J3214J2406j325k2219j7479p149K784l931m39J0381K0092k689o230
$$ y = [11472, 21534, 12747, -8071, -10265, -6692, -22460, -34414, -34226, -51961, -49363, -26643, -11960, -21684, -15757, -9730, -3917, -10851, -32383, -32599, -9418, -14257, -18556, -16004, -3627, -148, -12322, -8368, 5415, -3218, -14775, -21344, -18226, -15186, -12690, 7213, 7249, -9413, -19250, -13391, -3343, -2319, 5409, 20244, 6767, -12151, -982, 1705, 2, -7296, -11656, -7481, -3251, -6326, -14300, -6174, 13010, 12242, -2114, -9924, -10115, -7772, -9476, -14705, -12887, -1742, 2420, -3617, -8145, -14636, -7750, -3993, 3139, -2733, -10039, -5111, -4904, -7468, -19959, -13586, -6598, -7337, -6394, -13491, -19821, -20617, -6495, -5328, -461, -457, -6326, -14992, -25825, -14970, -2121, -8076, -25893, -18900, -349, 3330, 16544, 28950, 27625, 5406, -12073, -19222, -16438, -20369, -20808, -10427, 9665, 6976, 746]
16486G46L730Q711j2278M614K2132L582m716j1918M375O171j216j0881r643q315
16472d906p782k296J1628q712m075J0646j806j1767o99k177R224p870J446L204
16458a5942n92J1033M969q778O052k459O812Q836j5497o448l730j0442J0233K3321
16444G368k289n013j1077p812J7679J2532j494j0509k384j1779N05m519j4903
16431c3695J3804J3198o5R166n474k86J271o50o712L944k954R168J5726q648l478
16416D315P808M884j5815p911N812j0345Q20J8453J3403j042n200r097O251R432
16402B1768o069q197j6939m297j949N673J2449L534n017J11K115j1721j7310Q560
16388a7289Q668o24l696J0505L395j8m613O390J126j0537n758N883j333N307Q005
$$ y = [746, 4476, 13187, 909, 5523, 27655, 31237, 26521, 14603, 18978, 25149, 23933, 13052, 3409, -4906, -12688, -14984, -3356, -12068, -16143, -5497, -7303, -19070, -19769, -21946, -12722, -20592, -19146, -15942, -16534, -5501, -532, -9310, -3258, -5717, 1095, 9931, -5566, -12014, -15744, -26186, -15953, 7368, 5079, 66, -11011, -18823, -1144, 11388, 9894, -615, -2999, -14778, -14273, -18792, -33695, -19891, -6693, -6758, 2408, -3066, -3352, -2081, -2731, -9443, -5499, -8453, 715, 16441, 7793, 4315, 12123, 17007, 1192, -6719, -907, -11252, -10432, 8021, 21424, 20382, 15182, 6085, 12336, 21768, 15699, 7502, -9437, -13734, -15683, -10010, 2439, 5973, 956, 1067, 3182, -8539, -25849, -17289, -8621, -9245, -12941, -2436, 959, 941, -3672, 2718, 3844, -6693, -12451, -6568, -7901, -2594, 5411]
16373E411J350j598m43j4974j2596k566L334K997m119J2271J3674M73j4709j1559
16359b3054K1179J1721l839k3436j4045J4431J6849m850k485j298L709O212P50
16346A844n045n444J824R185J1128n747k761P604J39j7878q941j505j5970n704
16332c7271K6441j79l916R133R767k916j1073j1066P380M864O091K465L393o723
16318c610Q66J9458Q542o503k634K974N292k360j7949p328N228O310q235m17o071
16303f437Q536J6395M462m938l328l619p454M673J0790l755k1004n244R026R347
16289G450K679P98m199o09N284N695n404P57j561l816j450n022j0881m183O882
16274g580J246o159l617n334J1320J9717J2889R127j1426j3819o429l36J356j2687
$$ y = [5411, 6761, 5163, 4720, -10254, -22850, -25416, -22082, -19085, -23204, -10933, 2741, 3214, -11495, -23054, -1875, 9846, 6007, -17429, -31474, -17043, -194, -5044, -7529, -8827, -5118, 1094, 1844, -3201, -8645, -6821, 2364, 13492, 7745, 4984, 12588, 12727, -5151, -14092, -15597, -31567, -37271, -10830, -11009, -14925, -5792, 3975, 1059, -10014, -21080, -13700, -8836, -2745, -280, 3113, -3610, -2744, 16714, 25256, 18753, 16119, 19093, 24385, 22025, 4076, -3252, 1976, 8286, 51, -366, -6437, 2099, 18494, 22956, 18018, 14690, 11071, 3617, 8290, 19080, 15325, -5679, -10923, -1897, 7450, 10129, 10927, 6728, 6119, 11403, 17098, 11694, 12451, 10890, 7074, 5624, 602, -10279, -14462, -7580, -6334, -12493, -16110, -21444, -10124, 9593, 22482, 31609, 20183, 6364, -65, -401, 955, -11732]
16260a1732J078L496j975J2184o369r288L954K771J012o65m479P481l326j0673
16246a6531j2657O989K2186J4301P213j1297o491J0740M953l522j5817o679L346
16233c266J0748M034k451j1202k065q489l805O129l482P844J8246k797n637K704
16219F511q208m011R389l911j7459n585P650O475n697j6652J9656J2408K10J0797
16205A1573o490r389p93K107K867j235O859P546K483q000j5477q370J2185N545
16191A411P032J856j520n558j758L375j886P968j2264j2856j686L419K647K903
16177f917k094J2256J4432j1889j1242k050k783R014N268j5063K658m553m789
16164a7752J1779K243j7917j5650N994J5304J5277K807o510o478K638J0411M735
$$ y = [-11732, -10654, -7158, -9133, 3051, -3318, -12606, -8652, -5881, -4869, -5534, -10013, -2532, -5858, -16531, -29188, -22199, -13, 14288, 21501, 10204, 3713, 14453, 19406, 15884, 67, -6612, -3266, 7482, 11516, 9065, -2137, -4202, -12691, -16496, -10367, -13849, -6005, 12241, 9444, 3807, 6511, -1697, -5708, 3681, -230, -17689, -23274, -15624, -9149, -14846, -31498, -11842, 566, 776, 11573, 5083, -4306, -5099, -2992, -125, -1360, 5499, 13045, 15528, 7528, -7949, -16319, -4134, 1411, 8443, 10299, 8779, 3221, 1463, 4838, 2952, 10920, -1344, -14200, -15886, -12467, -9820, -6917, -9011, 3245, 17677, 5788, -5454, -7504, -10287, -1273, 3995, -11068, -8410, -12963, -17752, -5973, -3730, -21647, -37297, -31303, -15999, -722, 2085, -4425, -10903, -8265, 2146, 6881]
16151F881O398K827r152n031J2568J3565m041q634l240Q269J7792J30k2268k2621
16137f557j0724q039N019L008m572p131R74Q667r477m933R30J3256J971r070J2891
16122a3787J2939j739m662j38O481Q501M457j5343K6J7242M281p385j9361k15
16108h703l760M689K791O156M69P22P34j750m260j449J33K496j5894j4279r543
16093d1448J9317M671J611m044l488M18o778L00J6330K544k847m779J3474J3527
16079H808J0141j0165k324L31k700j5672k840J6023P378K340M91K415j231m945
16065H050O251K633Q091J0412o02j1547r174j1386l029J3061L5o42r683j6238
16051a3768Q126J8033L865q042j8784q555P844J4115o271n324J5564J827j1820
$$ y = [6881, 13279, 16106, 6954, 1923, 14491, 28056, 24015, 15381, 12141, 20410, 38202, 38332, 16064, -6557, -17281, -25320, -20301, -17293, -21865, -28996, -28022, -19355, -28832, -33765, -32835, -19579, -17608, -26678, -13787, -848, -2587, -7249, -7387, -906, 7595, 12052, -3291, -3265, 13977, 18258, 10873, -8488, -8703, -12463, -7774, -4983, 1173, 1642, 2364, 3098, 1348, -2912, -4361, -4228, -1732, -17626, -31905, -41448, -22131, -17460, -15849, -19893, -23381, -22963, -29741, -29441, -13111, -10567, -13414, -18193, -4719, 8808, 18949, 8784, 6460, 6791, 4091, -11581, -14421, 1602, 8980, 11320, 11811, 14226, 12995, 8050, 14301, 16934, 25025, 35437, 34835, 23288, 14114, 2728, -301, 12760, 12795, 12153, 2470, -13768, -5642, 12391, 16256, 8214, -10570, -19125, -11281, 2834, -3437, -8761, 6803, 8630, -3190]
16038c190j1597j597J9949J732q061L92j1711K159J484J0630P73n389L694P905
16024G173K870K262j362j9399j110L491o846j6114k768J2867J9774q858j6204
16011b4224L716J3471J2993J0272K956K879O546M851l359j8150K288l02n201J623
15997A0359l139j049L905k524r533k0652q08K889n271P917O814m100Q199J3734
15983F741j0074R514J0237j4292j4030R173L145j5562J3163Q462m561m176j300
15970c560J810q819n400J660j0463k989J2162N345J4844J677K291j3811j976J709
15956e520n053J916L289p30j0400p315m06p97M403n100O629P196L64j6924m025
15941c2473J1752K1602J2241l154n764K440m499K720l515q33R158l035r38P648
$$ y = [-3190, -14787, -16384, 3565, 5297, -2764, -2372, -14083, -11924, -10440, 190, 963, -4426, -732, 7173, 10043, 12305, 10943, -8456, -9566, -6075, -12921, -29035, -31803, -18936, 838, -8020, -24224, -20508, -7037, 5956, 16228, 19184, 22063, 28609, 33460, 30101, 11951, 14239, 13937, 8736, 10359, 7220, 6171, 10076, 7552, -1981, -22633, -23441, -20552, -25823, -17906, -11092, -15192, -6993, 6741, -3333, 6181, 16418, 2126, -11904, -2731, 414, -15148, -1985, 6477, 1916, -2260, -3560, -1750, -10569, -15969, -14309, -24772, -27761, -15599, -10254, 4590, 6267, 8558, -5253, -7229, -5520, -10573, -8657, -5368, -6098, -16498, -23813, -24219, -25016, -20613, -25713, -19084, -11888, -11524, -28448, -32473, -20721, 881, 13122, 9968, 4204, 6644, 2145, 4865, 1350, 517, 9675, 6640, 5702, 13350]
15927A3350k599j0333K395J0875M355j6012j6003O130j383q676n69K247Q744J4070
15913F591j3790L654N729j1338j1889q133O485J7767K504j595k953m681j0833
15900b2482M894J3032n261j4095m734o961N508P526M388R063N967m907J687K041
15886d334J439l826r338j3773J214Q981O315J0715Q189J112j0783n485N125j659
15872f108l182o219o636R69j693O340J9556K4774j864j9897j8271j1074J817K2207
15858G19P788r02q437q477r394J2569K110P579j872j239j1447q103J69M420Q055
15843f462j3056o77J398j3411L0656K1663P640J0748n608j3791k8383j6342O17
15830b5008J2874L368J337M917j9585J943J1817L188J0675J3194L674j7998m989
$$ y = [13350, 10751, 418, 2813, 13688, 18043, 2031, -13972, -7842, -9225, -17901, -18470, -16223, -7479, 6591, -7199, -3545, 2184, -9154, -21043, -29176, -22691, -4924, -2420, -4015, -6968, -11649, -22482, -17588, -4556, -9817, -23912, -28646, -35607, -30099, -22573, -18185, -9122, -3155, -8062, -6375, -4334, -2895, -6721, -16059, -29832, -28618, -19637, -13322, -2607, 5582, 6694, -4089, -9574, -4449, -6108, -9290, -15509, -22145, -21176, -22869, -16529, 3027, 27801, 25937, 6040, -12231, -23305, -21488, 719, 8507, 7605, -832, -9309, -18703, -6134, -4024, 3555, 1683, 444, -11003, -19106, -18937, -14517, -6462, -19518, -20195, -18797, -32208, -1552, 20111, 27751, 38499, 32891, 19100, -9283, -25625, -25008, -12134, -8766, -7429, -2512, -22097, -20154, -8337, -5149, 5526, 18720, 22394, 4396, -593]
15817e93m680j1684j7705j332pn207J9979J9543Q168n504q931N366K699l437J0919
15802G594K178K294J2703J7974j6094j7609O95o223j815r105m923R607O089K274
15788E639l854o436j369M105L576m130q973j5838j178P972J2520J2792K861Q691
15774A6378o450k0049j0819J820J8400O949n933J757j5445J079J649N2J239J2446
15760C073Q13K191j4503o743q88q89J2351J147j9964q383k926N553J2324j039
15746a7883N090O159j30n57o29J2810Q058j1345j1564k184k470o51Q741O781L59
15731E85k846o555O179L926o684j5302O359n729q547R834J7933m205k062k286
15717i400j949J106N327J2391K057j1768N19P52J2061J664k156N999n689K872
$$ y = [-593, -5273, -16957, -34662, -35994, -36001, -41208, -21229, -1686, 6482, 978, -7953, -2587, 112, -3325, 7594, 9772, 12066, 24769, 42743, 26649, 9040, 9735, 3512, 1697, -7408, -12331, -2724, 3365, 5639, 1785, -4651, -6020, -1915, 1661, -2469, -11442, -27280, -28458, -20486, -7966, 4826, 7687, 16378, 9928, -10121, -20940, -19120, -720, 6229, 296, 2053, -13392, -12313, -10664, -10612, -9373, 3073, 3886, 6077, -8426, -15169, -16057, -16946, -4595, -3448, -23412, -31795, -34721, -29168, -16844, -17883, -12793, -6634, -6764, -7321, -7950, 4860, 12918, 1573, -9991, -12175, -14645, -15296, -6555, 226, 585, -2261, -8816, -2637, 1289, -5395, -20697, -14338, -20067, -28614, -18780, -847, -5052, -7114, -9400, -11349, -10243, -4916, 7475, 9532, -2236, -1717, -965, 11096, 12760, 10604, 16603, 10914, 13786]
15703A3786q557j500P508L562j0209j6606n635J952K2894Q543L365j2243o545
15690C15j5172k0229R524J4938J1598j588o541O145M606L586j6486k1884O564
15677b4624M073K708O310J1021J2657n70m558N292k053j0647L519J2462o895j8121
15663i426j222P914k469K839j670k825l249m155o409q275m177O672O419j1622
15649c1655l887J4804O953m08R734K777q905m714J4590O18p376l997n359j172
15635a7997L220l383p868j1320K078J1952J2753j2872j0489J3816R682R310l462
15622d580J3198J1476j4702k839o065j9238k178N061J116K4570n807j2915j4608
15609b7511P931R470k113q498M080N885N334n433N006m538l433J395J2809J2313
$$ y = [13786, 5229, 3729, 11237, 14799, 4590, -12016, -17651, -15699, 7195, 15738, 19103, 6860, 315, -14857, -35086, -25562, -10624, 974, -614, -7155, -1010, 3596, 7182, -9304, -31188, -24624, -20551, -17843, -11533, -512, 12145, 11575, 7017, 12309, 10256, -391, 3128, 15590, 8695, -9426, -10648, -2734, -5203, -2364, -4034, -6859, -10108, -14263, -20672, -28947, -33124, -26452, -20033, -31655, -35542, -20738, -13785, -14193, -4459, -1682, -10587, -15301, -711, -93, -7469, -11466, -16825, -17997, -14777, -18160, -26028, -37348, -35270, -23318, -10565, -23437, -33926, -20110, -10428, -1118, -4580, 8618, 20094, 5392, 2553, -3512, -22750, -24928, -19867, -18751, 5819, 12, -12903, -27511, -19580, -10110, -12223, -20721, -16641, -10756, -5422, -10855, -5849, -10387, -13820, -12425, 384, 12697]
15595A2697j0502j0269k772j196o770j1651P677J0784j1186o591J7832n748j3584
15582c1279j6365L097J3070J0968J2667M229q284j5314j1294N875J4866J1705
15570f059J3500j1478r036o023J2221P401n522l351P340L750n084p762p055P630
15556i528J3728q112k3564o213M405O641Q202M448R047P472j2127n382m352o150
15542b1485p914P32J1262L506N798K649N273L633k686N745J517M01L883J3072
15528B5386j0806p360K511j986J188J35N780k323r355o24m440K971j4280n399
15514a8602L478K711k101j1606m819k653K410K1648J2169J6911m443k4167j9140
15501b8204J2797J7617j4261j9946l21r04n122O635M075R591R299M455n640o51
$$ y = [12697, 2195, -8074, -10846, -12042, -18812, -30463, -22786, -12002, -23188, -29779, -11947, -17695, -31279, -47644, -44547, -31477, -20509, -7842, -3613, -11897, -27211, -38505, -32630, -17764, -6059, 7441, -4037, -13073, -19096, -6875, 526, -4996, -8347, -1007, 2743, -2341, -10103, -17158, -9528, 4200, -3912, -27476, -33689, -29284, -22643, -14441, -9993, -946, 6526, -5601, -10983, -15335, -21485, -29399, -28667, -17405, -13899, -8101, -5452, -179, 3454, 768, 6513, 8030, 8431, 12314, 25386, 14580, 7220, 9731, 7745, 8933, 9068, 14848, 12525, 3170, 2546, -1894, 1077, -13203, -18602, -15124, -12413, -14514, -26120, -30939, -33592, -31182, -9534, 2635, 19546, 15103, -9064, -28204, -15407, 2210, -12051, -31997, -32318, -33222, -38344, -31709, -27634, -18043, -8744, -4289, -9929, -10580]
15487a0580N062R724j1285p696P404N748L456o065q178J8985J5166K660K706L978
15473C1085N672q264j8371k2349p978J0205Q077Q43O652L691O111j213K075j2998
15459C238N40j728l114K204P783O848j0800j3097J752J4228J3151r066p393m443
15445A03k688J605J2868O959m738p107J036J575m949p506p258j871J1930J211
15431A170l073l895n626L392o375k0214q307K0330K2536L404j182J696j943q932
15417g019L9O600n963l151N148j307l885J0368l222r197k1285O92K6841j3211
15403a8552j1581J631J1745N930J296R632L590P433J0615l935o838J688o909M606
15389A0351L746j4509j8616m562K1478m973r138p548J0967J5362P143j563k1878
$$ y = [-10580, -5518, 4206, -7079, -14775, -7371, -1623, 1833, -4232, -12410, 6575, 21741, 24401, 27107, 31085, 36757, 28493, 10122, -12227, -20205, -10000, -1923, -1080, 5572, 9263, 15374, 14161, 16236, 3238, 3778, 2050, -1064, 1140, 8923, 15771, 4971, -8126, -6374, 7854, 21005, 11939, 4546, 103, -2585, -980, 11888, 18847, 14109, 7002, 8038, 9613, 4664, -2842, -10100, -11971, -41, 1170, -1903, -5798, -11424, -8032, -14407, -34621, -42928, -22598, -62, 3342, 2160, 3856, 1913, -7019, -6980, -380, -6343, -9494, -4346, -5653, -9538, 830, -2392, -11589, -32874, -32182, -5341, -18552, -30133, -28502, -16757, -10827, -9531, 101, 3691, 11124, 21739, 17804, 10966, 12654, 5745, 10351, 14097, -412, -19028, -23590, -2112, -7085, -16223, -23771, -12804, 2558, 9701, 8138, -13740]
15376a3740r082N43j895O745j477Q335L468j8920J470K1279K0134J0400o074O493
15362B7679j168k8021k4913J504J7225M622o638O795p611K183k55n505j3504k14
15348b7821L581O134J9294O680O420j2899k839N102k399j1966l026J1898J3333
15335A1492J3466j0244j7994R122M711l413O457Q725o549o037Q54J477m760j8940
15321a1633l980p531O31j381J0046J967O908n384J0722K022r714j2200j082l413
15307b4022m158J3574M524J6886j661k5970j8907J5892J1955J473J1682J3529
15295A4797j7200j2413o715n552K1349J6412l306p261R016J0725p459l001q455
15282I37p629p385J1349J9834K783q823n884k2286J393K538l028N927q64Q966
$$ y = [-13740, -22822, -22279, -24174, -17429, -18906, -10571, -7103, -26023, -24553, -3274, 16860, 27260, 21186, 27679, 26511, -1510, -26423, -24919, -7694, -3072, -9710, -2915, -10526, -8343, -8598, -14103, -27607, -27821, -24240, -18106, 1188, 7868, 14288, 1389, -1450, 3652, 1253, -10713, -13739, -1841, 11492, 24958, 14714, -3280, 5842, 10553, 7140, 13597, 22322, 15773, 9736, 10590, 12067, 7307, -11633, -15613, -23144, -22513, -23894, -13848, -11881, -4973, -10357, 365, 2387, -7327, -19527, -20609, -24022, -28180, -14606, -10082, 6804, 5143, -20827, -39734, -23842, -11887, -10414, 1268, 14797, -2403, -14816, -21531, -27083, -5734, 10678, 7372, 111, 9127, 19852, 12393, 9392, 937, -6692, -14077, -2728, 17106, 19889, 11066, 5182, -17104, -15711, -13173, -16201, -10274, -11138, -2172]
15268b172J1827O882L191M804j2586l356l629q752n856M975M72p045Q821M527
15254B103k018K795P873k270o403j3737N574L354j1761p726J680j0131M35J7751
15240a2481J2861J4029J7027M408n53K141q81N051O522l705j554j468j2664r197
15226A9536j2272N809N935j103L566k310k1261j2038J323J4401J7896r010j6443
15213e971j5398L800L110O309J1696J1310k236j5890k248k850q130l495N948K550
15199a1495l308R927p26q317k86N867O907J3227r427n293J8474k361L675J6023
15185C2887l663j4575j8155j148k991P71J5792q980j2739l247l40L676L771J688
15171g253L623M504Q810P927j3501j7068o513R39J0322J7886O354R088j4488j2487
$$ y = [-2172, 9655, 16537, 19728, 24532, 11946, 8590, 4961, -3791, -9647, -4672, -4200, -11245, -2424, 2103, 85, 2880, 10753, 8483, 2080, -11657, -6083, -2729, -14490, -22216, -20536, -30667, -30232, -12481, 380, 14409, 31436, 35844, 35291, 37432, 36551, 41602, 48124, 44419, 42865, 41397, 28733, 19536, 7264, 13073, 19008, 17905, 21471, 19161, -2100, -14138, -12815, 1586, 19482, 10472, -5971, -21369, -17569, -14459, -8150, 3546, 14856, 12620, -3270, -5518, -8368, -16498, -19993, -14045, -11495, -14803, -4876, -5602, -13919, -14205, -8338, -1431, 11796, 2369, -2924, 15550, 13189, 16864, 32887, 29224, 14649, -3506, -4654, -7645, -6874, 8918, -62, -12801, -16048, -16388, -12712, -8941, -7253, -3630, 874, 9684, 17611, 4110, -12958, -19471, -18532, -8210, 9676, 16030, 25118, 10630, -1857]
15157a857m894J6779q41p655q869J1035J381j414K794n726O179J0949p085k8949
15143a8173p917J2827N698k990J4578L442J500m791L120n964Q416m31o698p240
15129d623K020n925q719m859J97N855O673M634K868J458J728J2711l736m922l144
15114B216l470l384N075K2827L948m712j6356j3413L478q18P920N719L256M010
15100A6296J806P34o325Q031R300r300j0965N266J0146j8112N569M054k280k0860
15086f640o158L392N751Q257P760Q191p017n968j395J668N573R460n858j1280
15072E736o907q440q45l269K059l783R040M259o593n264Q87r684J348R918K3694
15057A2156M310r85m068M982o635K759j3237j2554m378j3438j27N652J847j760
$$ y = [-1857, -6751, 10028, 9187, 1532, -7337, 3698, 5079, 3665, 6459, 733, 6912, 17861, 10776, -18173, -26090, -13263, -7565, -10555, 4023, 7465, 8965, 4174, 7294, 1330, 9746, 9315, 2617, -4623, -2603, -8528, -17247, -22106, -21909, -16054, -9381, -4747, -1879, -421, 1307, 14018, 10282, 5360, 2216, -1254, -4638, 437, 23264, 27212, 22500, 6144, -7269, -3791, -4609, 3311, 9030, 12286, 16296, 18102, 18836, 12511, 20542, 29842, 20542, 9577, 14843, 24989, 6877, 12446, 16500, 14220, -6640, -12798, -9406, -3655, 4602, 12362, 20553, 13536, 7568, 6173, 7841, 13414, 22874, 17016, 5736, -1171, -9611, -10456, -13725, -11666, -15449, -6409, -2150, -8743, -14007, -13120, -22804, -21456, -11538, 12156, 16466, 15481, 11413, 16395, 9760, 12519, -718, -13272, -17650, -31088, -31215, -25563, -23716, -25476]
15043b5476R857l769Q773M069p899j1653j0071q349L814J6964o717p295K727R766
15029b5259J060J7135O353k286l164k718j0474j302M717j962N912P360P153J45
15015B670j2771O854M773N825n183q894K300n32j708j0989J246P697J1097Q543
15001A0928l315m703j7590j2013M42K514P000P853J445j13N139N754M988q123
14987B06r888Q619r217l328J0917M466p725R601L985j8243r207J1Q317J335Q190
14972a961J5709j6855K950K255P469q214m281l104O482J3504L264m412n945J313
14958H174K971p959j9260p480K545J2468O950K1925m641n699J603m220j4899n184
14944a2706J2118K4169O601j6624j2794j0628j1019P581J3588n400K491q082J8418
$$ y = [-25476, -15619, -19388, -10615, -6546, -14445, -26098, -36169, -44518, -40704, -23740, -30457, -37752, -35025, -25259, -24199, -7064, -711, -2997, -6161, -8879, -19353, -20655, -15938, -17900, -11988, -4628, 2525, 2670, -10101, -3247, 1526, 7351, 2168, -6726, -4426, -4958, -6666, -17655, -16409, -8712, 2385, 10928, 7613, 2910, -14680, -26693, -26251, -23737, -16737, -8884, -7439, -7552, -2413, 3341, 8329, 206, -9682, -1063, -10280, -13608, -2691, 1775, -5950, 3651, 7636, -10607, -19814, -19803, -11486, -10151, -1961, 13748, -3107, -157, 2098, 9567, 1353, -2928, -6032, 450, 13954, 17218, 12806, 6861, 8174, 11145, 3186, -16074, -23554, -21009, -8541, -1591, 20334, 15693, 9994, 11597, 7377, -7522, -12706, -588, 23581, 30182, 13558, 764, -9864, -20883, -13302, 286, -5114, -2623, -10705, 7713]
14931G713R275r475j1566p251N177J2229P669L443p068L08r413p864o972P15j4923
14916b8003P60J970q855Q992R684P592J192M215P665J2757Q002j2540n67n852
14902G012j0289M131R958N394j721r977m500n153J608K0001P425k1291K40J0439
14888A3277J701j5274k1661q455P536J0891n05J169k799l300J3497J6935m144
14875H868J4778J270r335J635j3433m695J1765R281j3286j4277n949j0058j519
14862b4955Q435N342O406N656k523m244q691k1437O486P290L849J0835L882l705
14848g374L972n30j013l789K106L673M387n35L15k678o608n286j130Q5o980R88
14832b0397L245j076M422J288q656J667P122Q902J1891q484j9984N762J6771R01
$$ y = [7713, 16988, 7513, -4053, -11304, -6127, 6102, 13771, 17214, 10146, 10454, 1041, -6823, -13795, -13080, -28003, -27243, -25273, -34128, -25136, -15452, -7860, -6668, -2453, 5212, 17969, 25971, 13431, 12864, 7012, -3277, 854, 10812, 16206, 14485, 4508, 8, -5145, -3537, 16464, 23889, 2598, 2838, 13277, 14978, -296, -21957, -30412, -22876, -11985, -12490, -11321, -14120, -17420, -3923, 13012, 8868, 23646, 24916, 15581, 17216, 3783, -912, 10853, 20134, 6848, -7429, -13378, -23436, -24955, -16520, -11178, -4772, 884, -1639, -5883, -14574, -36011, -29525, -22235, -18386, -7551, -3669, -7374, -3402, -3932, -4945, -8734, -6628, -2955, 1432, 897, 1212, -1466, -8074, -13360, -14490, -14405, -21385, -20397, -17152, -18228, -13806, -12518, -21174, -19507, -12385, -3483, 8408, -76, -20060, -14298, 2473, 3374]
14818C374k579m832Q083L977k593n713q174J438J7185j681q965r927P2L891P503
14803A059j468r252k743N836J0656N721j267M507P084J3522j1524r454j0838p553
14789e714k479K654j009M360n345j937n855J6288R109J115k127o787Q868j042
14775A0099j0541j1132J1928P740q605l197q77J820O418R119N828L036p189L53
14761A4800q905k528j422k236j74n940j4721J4010p61p277P891J3137p941j6443
14747a8510j1151J4572N846J027J0502M492M888M04J3049M675k0172k5070o72
14734a6120M666R323J3918k881M793N034P941r256j3228j278q851O266N430k1822
14720a6065K253K455j5470j088L586K8522P064j7594r032J1092r192j0690N918
$$ y = [3374, 795, -4037, 4046, 8023, 5430, -283, -8457, -7019, 10166, 8485, -480, -10407, -10335, -6444, 1059, -409, -9661, -12404, -6568, 4088, 9809, 8542, 13049, 20133, 33655, 22131, 12677, 1839, -5714, -8193, -5539, -6548, -2188, -7533, -9470, -15325, 963, 10072, 11187, 9060, 2273, 11141, 10099, -442, -11574, 354, 8094, -511, -3708, -4585, -2765, 3653, 12772, 18600, 21636, 14447, 14800, 5895, 3367, 1945, -291, -465, -6405, -21126, -7116, -7877, -15154, -7263, 5874, -2067, -18510, -29661, -15089, -9243, -8216, 2286, 6778, 11666, 12070, 25119, 29794, 9622, -15448, -16120, -11454, -2131, 11787, 8906, 13699, 18733, 26674, 17418, 4190, 2912, -5939, 327, 5757, -16065, -13812, -11357, -26827, -27915, -24329, 4193, 11257, -6337, -15369, -4277, -13469, -24159, -18241]
14707a8241J0981J0653J2021j0235j4700M45M638K971l498p703l541L42J2429
14694c438M890q339l369Q852N16J064Q82Q098p81p483J2427n07m051K379m146
14679F994l068m54M489O77p48M82o244p29O245J0118m032j4486m145k602j2709
14664b0212J0834K0697n8r821m31j1062L82J2217R849J016j9349Q426J7J624J1446
14649A5575m611n509p232p625J3595J3466k063m927O621j2456m549Q105k171N023
14635A1242K343j4310L632N922j6468o548K3085J4675K558l25j8891k5013p11
14622a8809J1070J0741J3308R74j3685k4657k279J2669N165M675j667q61J59j172
14608d369K100J6605j224j602r453j1727Q41k565o873J0133k515r443m351n694
$$ y = [-18241, -7260, 3393, 15414, 5179, -9521, -9076, -4438, -1467, -4965, -12668, -16209, -15867, -3438, 1452, -6887, -10256, -1404, -888, 176, 1058, 9156, 8375, 892, 13319, 12812, 8761, 11140, 6994, 3926, 3472, 7961, 8638, 7890, 8372, 2128, 1399, 7644, 17762, 13730, -756, -4901, -7503, -20212, -9378, 11319, 11261, 1440, 1009, -10053, -9671, 2546, 12395, 13411, -5938, 2488, 2505, 4129, 15575, 10964, 5455, -1777, -9402, 4193, 17659, 15596, 10669, 17290, 4834, 285, 8390, 6219, 11242, 13585, -725, 2907, 8829, -7639, -14187, 8898, 23573, 26131, 25806, 6915, -18098, -18809, -7739, 3002, 16310, 17284, 3599, -21058, -23337, -10668, -5503, -828, -2495, -3356, -3197, -4369, -2269, 14336, 13112, 11510, 2057, -9670, -8829, -11394, -18267, -8134, -10649, -20092, -24443, -30137]
14594c0137P835J0080j962o693J6061O661N310J0411k272j1386J6814J797j1425
14581A1094n417l798l283j1627k996R542j0291j2009m421M804J4722O180O452
14568a048O863J111R686p640j9955P064O740p072L439m875M099m07J7054J5683
14554C0742p960m780K614m668j273Q174K166K973j6101j7074L016R213J0651k245
14540A5448j3937M89J8848J0371m778k1853p054l4J34k867j17p298m351J232L76
14525a5391m829K331l566J433J2365K827P416J2083l700O347l149j006l324k003
14511G834N91K146R951j1588p585J3025K844N643j092r359L087q616k3165p496
14497b3780J3480J8886M335k948J113J7720K837j4923J193r929j635r162O035
$$ y = [-30137, -22302, -12222, -14184, -20877, -4816, 1845, 7155, 17566, 15294, 3908, 20722, 22519, 11094, 5677, 1879, -1404, -13031, -16027, -6485, -16776, -28785, -33206, -28402, -13680, -7500, -1048, 5815, 6926, 16612, 8972, -10983, -3919, 2821, -4251, -812, -5687, -1588, -1995, 15059, 30742, 22782, 18002, 20616, 15948, 14675, 22849, 25015, 27988, 11887, -5187, -2171, 7042, 17693, 15448, 1511, 2000, 20848, 31219, 26441, 4588, -2466, -2500, -2366, -5233, -5350, -12648, -16999, -15767, -15391, -20220, -17889, -21455, -20022, -7657, -4830, 2586, 14669, 10969, 17316, 14167, 13161, 9837, 7834, 8425, 10571, 20522, 8934, 1349, 14374, 17218, 22861, 21769, 12410, 15497, 6881, -16284, -23780, -10300, 8586, 12921, 9973, 11086, 28806, 31643, 16720, 17913, 7984, 6349, -2813, 3222]
14484C222M812Q119o303o420J625j0936j0108k457J9920m57j873k361l049l810
14470a0076J8492J4814j6110r763J251o490P422P905K973l166l265J992M263L246
14456A3488m615j0155p718o828m744L30R920Q169L109L765M488J063J4242Q996
14442C3510k1499n961M903M886O769r569j156o036r865J2808J3222j741m687j8502
14428b918j5654J263O706J0976N40L123j4485o618N957J883J429O159q987k1662
14414c2288j17J7877R816J2104P679l556O17k901J3990q631j6285J335k510p452
14400a0322p470N59O221M88k166M33k878l606j0437J13L073m366J0848J4250P035
14385A775Q596J696l708M084j179N38j3727m24P897J8740J5028j3261j2412k160
$$ y = [3222, 8034, 16153, 9850, 3430, 5055, -5881, -15989, -18446, 1474, 1017, -856, -3217, -6266, -10076, 8416, 23230, 7120, -2643, -1392, -7882, -460, 7445, 10418, 7252, 3987, 5979, 10242, 13488, 8873, -1282, -9000, -15828, -20572, -20242, -10322, -2153, 956, 4721, 9209, 10272, 24514, 33510, 12011, 6050, 10953, 15839, 22608, 13039, 11883, 5847, -4018, 8790, 22012, 20271, 15584, -2918, -18572, -17309, -10603, 373, 913, 4036, -10449, -17067, -11110, -9227, -7798, -1639, -10626, -32288, -32405, -14528, -4712, 7392, 15071, 11515, 12132, 9231, 23221, 14590, -1695, -360, -2870, -10322, -17792, -17233, -11012, -10524, -12690, -12257, -15135, -18741, -29178, -29065, -25992, -30358, -19510, -5260, 1775, 10371, 12067, 8359, 12443, 11264, 11802, -1925, -2349, 5548, 24288, 39316, 26055, 13643, 11483]
14371A1483m060R154p264m159j0225P057j1404q036R409K3097j3638j3839N637
14358f788j914R043J4901j513n336j113l625n539M050J2526p147j547P190j3249
14344f1k188P030J267K677m390O629L530j5243m377L59q643J4798J6855m560J031
14329A4714l248j3665k0160M946Q513J526R502J4500J0370k0655n488M577j0562
14316e130j5815n791J3975Q322N966L390j548j296J242o181j5854k832M934O900
14302i718n374Q546J3020k20j0107m984k23r529j3106K715J6492K6637K688j2120
14288D717l194J5113J1438p164J2712J1034l42m462l1833k5842J3841J4746J2209
14275B2973P031l540j8184p499O404j0584P881R863P309p548N91n655k2895l705
$$ y = [11483, 7423, 16577, 9313, 5154, -5071, 1986, -9418, -17454, -8045, 15052, 1414, -12425, -6788, -8702, 341, 15242, 13729, 8393, 7280, 3655, -1884, 2166, 14692, 7545, 5998, 13188, -61, -2249, 4781, 6048, 8725, 4335, 10964, 14494, -749, -5126, -4767, -13410, 1388, 18243, 13683, 14714, 11466, -2199, -22359, -17413, -8900, -7374, 2128, 16628, 26998, 6343, 855, 5432, -5130, -20945, -26736, -12761, -4439, 1527, 4917, 3369, 2073, 3315, -2866, -18720, -21552, -16618, -9718, -15092, -6546, 6474, 6254, -3853, -8837, -9060, -18589, -31695, -28980, -12488, 14149, 16837, 4717, 1523, 16636, 28074, 20910, 33622, 44656, 44314, 39852, 8019, -17823, -3982, 10764, 22973, 30004, 26464, 8280, 781, 7185, -3399, 4482, 14345, 21654, 14106, 14697, 9042, -13853, -17558]
14261a7558O544J1314L336P056p294l70J7721n624j2148N054l021m647J3546k884
14247A1025p641N78L843P028q886q660M412Q229n912q232k106J6025j911q237
14233d45j0864j2471K665N469p124o234M076J292m171L258O259P30L164J6287
14219A891J4911J987j1031o150N705M866J4575m934p085k046o471j503M499n31
14205H683K110j2628J1145N493M156Q017J0957P55k857n328j4100n776J5888J3160
14191C9675K855n004k2635j2487R88J962O630p698J714J7137k889q822l411kL90
14176H403k116p86j403j507Q908p520M362P832J417j1836p386m229J5237Q100
14162A7476j4170J11J0939j3934j4237q150Q229J0523N390l798r96Q676j3820
$$ y = [-17558, -11014, 300, 3636, 10692, 3398, 3028, 20749, 15125, 2977, 8031, 5010, 363, 13909, 11025, 3384, 3962, 7805, 14833, 5947, -2713, 1699, 9928, 4016, -4216, -6322, 9703, 7792, -445, -11309, -23780, -21115, -15646, -22770, -29004, -24928, -23636, -27807, -24549, -18290, -17560, -14396, 1891, 16802, 18789, 7758, 1608, 7313, 12179, 26754, 21820, 14735, 12689, 6218, 4715, 9214, 8683, 10793, -1835, 9310, 14803, 18959, 26976, 37933, 38688, 35831, 30503, 16403, 10627, 26515, 39675, 42530, 37526, 14891, 2404, 3392, 5354, 11984, 4286, 6000, 23137, 20248, 11426, 8015, 8013, 8403, 6287, 5501, 4098, 2591, 11499, 3979, 8341, 16173, 17590, 5754, -1632, -5861, 9376, 17476, 3306, 3417, 14356, 422, -13815, -21965, -13736, -3213, 2177, -1621, -2617, 6059, -7761]
14149g761j0555K168m862P85O991M381l165O715K56j047K1449N232k7488j2204
14135a9105r896j1222N144K2311K0623K2960q704p47r546j7105L833J4354O017
14122A8917k2591J1552J1327j3190k669J207O77l026j6939J238K099M982n506
14109a1922m484J1679L532J845o207k995K884n541R396J5476Q751r40o497q847
14095F130M687p041j7606l083R689j915Q778O809J4951q085R97J3822n526k899
14081A9708o384j5960m075k380o240N840q934m415R702O055j6104O466M482J4554
14067B315l75J716K509r523j4259O05N660J9213M562L029j8312p173l608P894
14053e747N008R728K156j3284j629M852J0677J2766l736p817k053o000n080J907
$$ y = [-7761, -18316, -16148, -21010, -20225, -13234, -8853, -12018, -5303, -5047, -6094, 15355, 20587, -6901, -19105, -29001, -40223, -35079, -12768, 7855, 30815, 22111, 21364, 11818, -5287, -1454, 12900, 18917, -3674, 7878, 19205, 6015, 3346, 4553, 5230, 2204, -14735, -13497, -11398, -6416, -11922, -16406, -4727, -1195, 650, -5557, -8552, -5668, -11209, -1813, 13663, 22414, 21474, 14977, 6130, 10817, 3776, -13830, -16913, -7224, -9139, -361, 6448, 21399, 13314, 14311, 28133, 22607, 19708, 13324, -2636, -6711, -9091, -15331, -9491, -18425, -22840, -13138, -7083, -23187, -16721, -12239, 2315, 1940, 3656, 6165, -3358, -17617, -17012, -11352, 7861, 12423, 15452, -2860, -10033, -13641, -5747, -739, 8989, 11145, -2139, -3768, 1084, 11761, 24527, 20791, 12974, 10921, 4921, -159, 1748]
14039A748k952j0439q71J1964R717n186k897j3706N974J3316J4026J0039j4815
14026A5918k4253m556J4928R721j3090j4853J879j46n537N217K4782J4706n133
14013A9583n920J884j2963o083n730k058R537k499R056J8023m291j5694m49m507
13999b111j92O15J4037J6757p650J858k0969l134k067j1483r118J0328O205O474
13985d50J6325l971L968j684o425L782P465n613l534m484k847j2861j3627o900
13971c0856p337Q910J3066p54O066j160R804n039O674r359m544M872n817j2738
13957b8212J6328K1886k886m585O93j3714M028j272P227J0828k219p463k205j455
13943c021J2225M209l51o766k126q414j2376o769O451m359J3630K3670M578R29
$$ y = [1748, -1204, -11643, -12514, -550, 9167, 3981, 1084, -12622, -6648, 6668, 20694, 30733, 15918, -8335, -12891, 2037, 11758, -1332, -16185, -14306, -14452, -19989, -14772, 10010, 24716, 19583, 13663, 15547, 2584, -3499, -9229, -11287, -1750, -4249, 4807, 22830, 18539, 2845, 2396, -2111, -2303, -1688, 12349, 29106, 21456, 23314, 2345, -789, -2856, -14339, -23457, -13129, -6924, -450, 15875, 11904, 15872, 14188, 7763, 11545, 19010, 13397, 9863, 5379, 2532, -10329, -23956, -30856, -38193, -29283, -16217, -16971, -10905, -12065, -2261, -7300, -626, -9985, -14529, -9657, -15474, -28212, -11884, 10002, 7116, 2531, 3224, -10490, -6462, -7734, -507, 10321, 8102, 639, -1566, -3021, 9204, 13413, 13062, 6296, 4170, -4244, -16620, -23389, -16938, -21297, -7667, 16003, 20581, 21510]
13929B1510r401j4431p428J2985L113n789m917q043l113K142J2162o551J4288
13916F527O701j1313M848J4188J8841R315j8524k1329l511n83l019q865p378J550
13902a2552J3750K231r321j902o65N035q157q282m142M904J7712P92k0450N339
13888a5708M841j526R139j549n905l743N801J9049J098j5739o133O699L776P573
13874G673M322r27R788j3545j942R434m674r51J4190J1580k937J1963l524j7455
13860B2995l2090j4581j787k877J8067J6301R023j3062J49m51N72J5998K483j5925
13846D815j463J2128N329o238p642j6619l340J5598J452J714L5m646J0213n986
13832E350m187p227k7625n607K3020J4163J4466K633j248q088j677k328O219N775
$$ y = [21510, 12109, -2322, -9750, 3235, 6348, 559, -4358, -12401, -15514, -13372, -1210, -7761, 6527, 13228, 1915, 6763, 20951, 39792, 49107, 30583, 9254, 5743, 5160, 2141, -6724, -14102, -12552, 1198, 3429, -5892, -7794, -8459, -3424, -11581, -19863, -24005, -19101, -1389, -597, -21047, -15708, -10867, -12393, -3254, -4803, -10708, -14451, -8650, 10399, 11497, -4242, -10375, -3676, 100, 7673, 11995, 11068, 20856, 7311, 5369, 14803, 10129, 9178, 23368, 34948, 32011, 43974, 40450, 22995, -9095, -23676, -25463, -28340, -10273, 6028, 15051, 1989, 2138, 1687, 2259, 18257, 20740, 4815, 3352, 15480, 20809, 14571, 6929, -9690, -13030, 2568, 4020, 5734, 5769, 1123, 11336, 5350, 1163, -6064, -33689, -39296, -16276, -2113, 12353, 14986, 13738, 5650, 3973, 1645, 7864, 13639]
13818A3639N510J1844K667J608m134j0339q727o809j0814L399L095J76R827K447
13804A3389q901q030J139j6291J300J5751r767O723Q769N302J029k2359j425R392
13790c979l968L80L944j3499m729q06J1246Q004m429J4875n011j6464q935J1647
13776a1724O278Q050M221L727j0722k335J3770J0111j873j5045j1823Q018K627
13763C280n515l158n540N603K09q209O705L529J90p106L763J9065l112J394Q750
13748A9848j024j0861m906K1549M568J825k6949j2324N558P884O327J3960j5962
13735I493j3198P659M091n917q122J931k112r99K717K0672o316l478l805J5029
13721A7645J0519j262o67L441j3p148j0103m316M16r19k199N837L819q546j0194
$$ y = [13639, 19149, 30993, 33660, 35268, 31134, 20795, 12068, 5259, -5555, -2156, 939, 1115, 10942, 13389, 4488, -3542, -2403, -18694, -17394, -1643, -11410, -4687, 4082, 9384, 10413, -11946, -13371, -3979, -7947, -7567, -3623, -17122, -21851, -22657, -11411, -3407, -7836, 7039, 2028, -14436, -23371, -11724, -5446, 2604, 6825, 10552, -170, -2505, 11265, 21376, 19503, 4458, -7365, 653, 3280, -2235, -5393, -10933, -5330, -5121, -13330, -6625, -3096, -2906, -10012, -6249, 12816, 9704, 11098, 19848, 18824, 7963, 3057, 24606, 29174, 30999, 4050, -8274, -2716, 5168, 11495, 25455, 9493, -3705, 3954, 8045, 2128, -5994, -4063, -6175, -7174, -4457, 16215, 9899, 6421, 2616, 17645, 28164, 26902, 26235, 29676, 29663, 22515, 12412, 8096, 8512, 7593, 5394, 11231, 15050, 6504, -3690]
13706c690J0460R102j494O093j742j0411m833N418Q522l473j3046j329m297n901
13692a0621L897J827l777P92q744j2921n419o064Q710L696J417K618j454j0872
13678c6915J1597R327N357O510N151O98q239j70M021q196J773J804j843r607Q244
13663a0488p477n18j962L26k835L707J630J1694k600O077j1215k958K2777J0353
13649A6511j481L473K991R528r586n147r24n651L598n311l020q85L907K115M517
13634A4635j5453r884J491j1435k2773r806L1078J6284k32K208P015J1234J0206
13621B4568k5451p760J3181O927R267K310k95P146M666k2577k3745q243q632O100
13607b2538R235k661M051J4478J2928N068r78n696L378j1923j2561J4819O08j4053
$$ y = [-3690, 6770, 15872, 14378, 20471, 18729, 8318, 3485, 8903, 17425, 13952, 906, -423, -4720, -10621, -6724, -4897, -8674, -7882, -16626, -29547, -34966, -41030, -32320, -28624, -27207, -24589, -26043, -36915, -25318, -15991, -10634, -4124, 1027, 1725, -6514, -6684, -2663, -10859, -9086, -7282, -9125, -18732, -10488, -17965, -18483, -20445, -20119, -22954, -19247, -17617, -5923, -8523, -2446, -13661, -16619, 6158, 16511, 15030, 18503, 21494, 31022, 21436, 16289, 15365, 9714, 13312, 8001, 4981, 4096, 8003, 10118, 14635, -818, -10702, -9211, -20646, -43419, -53225, -22147, -5863, -6095, -3887, 3128, 14362, 24568, -883, -8643, 4538, 11465, 20732, 23042, 22747, 29893, 34559, 11982, -11763, -20006, -28638, -22538, -13303, -15964, -11913, 2565, 15493, 20561, 19583, 13887, 17265, 5342, -7219, 7600, 8208, -5845]
13593e845J8166O485j258N105k787j1406l742L605p158k682O297k575K562Q076
13579A2843K684j2387l034l216j0036j0380N848n804q002J4308J4459M887L6Q575
13565A0781k584j725k154n52j2403j9668N192N135J0551M984N131L877O962r793
13551C734p767K388K410n666k132J055L793j991J224J4325K957k481M397N814
13537B2060j4113j5125O085O51j0168j1091l079j0151J3068O527O553N63J6449
13524H229N673p109p716j6553M026J2894P802l284j0749k109K628j821K517J109
13510d463R936k381J884O272q994j2851j7473r587J1324K9935J5863j2659M647
13497A1453R372l228j8034l931N712N625l121j85k916K286L082N659K475l666
$$ y = [-5845, 12321, 18806, 17548, 22653, 19866, 8460, 4718, 8323, 1165, -1517, 4780, 2205, 4767, 12843, 15527, 3140, 106, -3110, -13146, -23526, -17678, -23482, -31484, -17176, -2717, 2170, 2206, 10781, 8197, 6472, 4318, 3766, -8637, -28305, -23113, -17978, -7427, -2443, 2688, 6565, 13527, 3734, -4033, -1645, 765, -4901, -7033, -5978, -2185, -4176, -2952, 11373, 14330, 11849, 16246, 22060, 7947, -7178, -1093, -442, -10610, -21701, -24780, -34931, -21863, -15336, -8783, -8220, 8229, 13902, 6793, -923, -17476, -13450, -556, 7246, 3962, -6787, -8896, -6268, -8089, -5572, -4463, 5473, 3092, 4976, 11248, 2254, -10597, -28070, -37657, -26333, 3602, 19465, 6806, 11453, 20825, 17597, -437, -4368, 1344, 6969, 3848, 3663, 747, 3033, 6115, 11774, 14249, 10583]
13483A0583j041K652q203j2598k958o545k991M431Q516R960j8955j2064M845R939
13469a4429P189K091P123N598j8091k0923j1753J3335N528L315N841J6289M84
13456A597L076l006q745l838q76j403J0666l913j3935O382J0850P360J2452J523
13442A8190p422r781Q862J010K021R944n071j2735O585r504p362N228N003o12
13428D356k916O91R83l207o313p406O335l695O700o72j867J7774J8870J7222j0418
13413C6437j9613p198O661r508k777j806n934k213Q725J1240j131N25l565j1430
13399a587j3598K357L000p75j759j0680Q153M175k425N863J2577J3830J1624r355
13385B1400k3044j6402l973N223K949J5949n626q377J4096M24j1223R799Q703
$$ y = [10583, 9542, 12194, 3991, -8607, -11565, -18110, -21101, -16670, -8154, 1806, -17149, -29213, -24368, -14429, -7240, -5149, 1974, 7572, -10519, -31442, -43195, -29860, -24332, -21017, -15176, 1113, 1597, 4673, 1667, -7078, -10916, -11792, -13195, -2529, -6442, -20377, -13995, -3145, 4215, 16667, 18190, 10768, 987, 9849, 10859, 12880, 22824, 17753, 5018, 11603, 2099, -5263, -35, 4968, 4356, 1440, 2131, 3114, -93, -6406, -13812, -7477, -11172, -4472, -5144, -7011, 10763, 29633, 46855, 36437, 16824, 9626, 16287, 6779, 4002, 2196, -3738, -5951, 2774, 14014, 12883, 13408, 9843, -1587, -15185, -12828, -9828, -10603, -12362, -23042, -14889, -10714, -13139, -7276, 5301, 19131, 30755, 21400, -1644, -18046, -22019, -16796, -13847, 2102, -3524, -11901, 2195, 2619, -8604, 1195, 9898]
13372I898N358J2976k034j6460p831J412P391J096j0467j0511m275p83k416J8747
13358B101N988n291K873K652l49j095M388P579q51q673O635m000J857o477j386
13343E951q267j0390M064J6276m585j5418j711r343J3000K1329J481N059j1452
13330E994j7702P95J209J1275J3511Q852k4736p407O278r510J82Q017p59j0023
13316a4024Q764J2002l592O426j250L661J4105J6262n705k2630L474L325j3781
13303G037n430k213P955P968r068l318J432n602N596O20n776j729J3223M450j0832
13288D313j9838n920J2330K021J1940p046q907k104J6026J2616L32M662l822N190
13274B1793K46o372j7816j0027L00L887R100q126P785Q19K076M420P07J4384j6307
$$ y = [9898, 15256, 28232, 26198, 9738, 1907, 3319, 10710, 11806, 1339, -9172, -13447, -14230, -16646, 2101, 8089, 2798, 5671, 8323, 7974, 6879, 11267, 18846, 17995, 9322, 15957, 11957, 13814, 7337, 5951, -2316, -12706, -8642, 7634, 3049, -12369, -14080, -23423, -10423, 10906, 12387, 17446, 5994, -11708, -10913, -9704, 1571, 15082, 23934, -802, -8209, -1931, -11441, -11259, -3242, -4001, -14024, -5260, 6742, 3150, 9576, 8326, 11987, 26092, 42354, 36649, 14019, 17493, 20818, 7037, 1607, -606, 7349, 15317, 6249, 2931, 4363, -1239, 4357, 4977, -799, -2528, 10695, 15145, 4313, -15525, -21445, -9115, -7094, 4846, -2200, -11107, -13211, 2815, 15431, 15763, 20425, 16603, 21793, 22039, 15667, -2149, -12176, -11876, -7989, 1111, -7015, 770, 1589, 3665, 8085, 8792, 23176, 6869]
13259F869j0813R931j428R37l19j885n546j5571J0366J2186J3204O555r676p130
13245G680q770N313m876M11o27J3590K490j2519q278J4530J1924j2116p754q155
13231g157J409J1589J523r757L617P080J4098j0884j8360j0181J7667J671j2227
13218i912o339J1612k066j3802J6637J4164j0256j362N768K664J4054O437j9442
13205H157l874m41o643m446J4929j0326p184l886M84P992j644N362M210M889k171
13190E408O456p78r110p559O476M873J3032Q269K242j6966J180P116J851J410
13176B3900r021r190k099q961k370o57j4946J0516Q016J510O410J2814l390n917
13162F615o806p660L044P73M371Q07K6214N572j0834n729l824M41L904r780k838
$$ y = [6869, -3944, 5987, 4559, 5496, 5177, 3292, -2254, -17825, -7459, 4727, 17931, 24486, 14810, 7680, -1090, 4223, -653, -242, -869, 12721, 15211, 2692, -5586, 8944, 20868, 8752, 998, -7157, -5748, 5841, 7364, -2393, 1224, 8304, 22402, 11518, -6842, -17023, 644, 2315, -9912, -16251, -4639, -6705, -20507, -3870, 10294, 38, -1324, 4444, 7108, 21162, 27599, 8157, 4283, 3842, -2801, -7247, 7682, -2644, -9828, -13714, -13230, -5238, -6882, -1520, 2690, 7579, 5408, 11864, 11086, 1976, -5583, 893, 5766, 18798, 27067, 29309, 12343, 13523, 20639, 22490, 23900, 14879, 5689, 3590, -5371, -7741, -8398, -23344, -12828, -4812, -3302, 3108, 15922, 12532, 6615, -191, -7851, -4807, -4034, 337, 1144, 27358, 32930, 22096, 16367, 12543, 12984, 16888, 7108, 4270]
13147D270R553j88J3306J1535m989k9518j2461J4084l843j630k201j0983p157
13134b0222q316m405O584J6246J5337P932o31p954j5907L449J1295j4645Q410
13121b827o443o919P889M205K497k129J511m403Q00K7304j35j6229M901J065J246
13106A2333o281k1112j923J8081J1380q068M816m82p697K896o419n613k853p536
13092a8478l906L947J845L804K413K346Q918J8799o316n028j4765Q881O786j926
13078G320m22J135k021j0566j0986p810K1160K6321Q615M608l1074p818N256Q300
13064A2018J353l75j3094j820J0138j602n19L098l370J4344k0732J884K572l643
13050B52j211J790M302j0772j0886l175K541N475k111M925R858K53R922J3510
$$ y = [4270, 13823, 13635, 26941, 38476, 33487, 3969, -8492, 5592, 1749, 119, -2082, -13065, -20222, -28538, -32943, -26359, -10113, 5224, 13156, 12525, 4571, -11336, -7887, 3408, -11237, -2827, -9270, -16189, -8300, -4095, -1598, -3727, -2216, -6619, -5819, 21485, 21350, 5121, 10022, 11087, 12333, 6052, -15060, -16983, 1098, 12478, 4410, 9226, 8744, 1047, 3943, -2476, -8089, -10942, -18478, -22384, -18437, -16592, -12788, -10375, -8029, 889, 19688, 13372, 8344, -6421, 2460, 9246, 7320, 6898, 8033, 6012, -4554, -15540, -23350, -2190, 24131, 32746, 37354, 6280, -1538, 3718, 12018, 13371, 12996, -98, -1918, 8220, 6618, 6099, 9197, 5827, 20171, -561, 1323, 3895, 252, -959, 831, 5133, -5639, -16525, -19700, -17159, -11684, -13795, -8870, 988, 1241, 11163, 24673]
13036B4673K269j366j998r656r072m169M354R286m089j8559N47J2496o671j662
13022c617J7517L42j3071n838R380Q88j1487l548N493L140J7734P517j7825j1249
13008d624J2177O611J1756k739l76k093o662Q055q672J204O262j8665k0719l167
12994b1652R855l304L900J4837j1522m217N409K5904O973k0150l242Q318O981
12981A8090P60j037N975r271J539K43j0725j726r36J0271Q71J0474j1279j0916
12967B333j3103K0821J5656j227J637J351k2344j6158J5159l848j5373J016R093
12954d987N900J0940r514l668m418o144R100J738J182n374K186J182K613n533
12940d797J0357m704R45M766j999j943Q31P009j2103k2391N933N417k687L040
$$ y = [24673, 26942, 25576, 23578, 13922, 4850, 681, 5035, 14321, 10232, -8327, -7780, 4716, -1955, -3617, 13900, 14242, 1171, -4667, 4713, 5601, -5886, -9434, -3941, -801, 16933, 24450, 6625, -4624, 7553, 14164, 25920, 23181, 22805, 20712, 14050, 22105, 13433, 14637, 20899, 2234, -18485, -21652, -11797, -15101, -11201, 3636, -7886, -12103, -6694, 19210, 26183, 6033, 2791, 11109, 18090, 18850, 17813, 23788, 14517, 16056, 16299, 5574, 3848, 2912, 13183, 14054, 24528, 13249, 2333, -10770, 10051, 25707, 24480, 26117, 27468, 5124, -11034, 4125, 277, -15096, -14080, -4987, 913, 11853, 2339, -1329, -5747, -11891, -2791, -1053, 129, -5245, -3059, -1877, 736, -4797, 5560, 856, 1801, 6567, 4568, 2625, 3456, 10465, -1638, -24029, -18096, -12679, -15366, -12326]
12926a2326K0541M349k1600M873R871J471p881o747R973p62J670o664m148K331
12912e049O887O518j528L290o253N42M733k336J1712n763k539j3835r317j0306
12898b3244L381N200O742J960J3619J8873J182J0777j5394j9227J909Q305K334
12885A6417p455j9892O401J5183j0491q402L903J6009N056k588p38j9632q908
12872a5137k646l066L577J7465J6306P418j1610j6585r613L390L002J8874J288
12859A2663N30o397n465R788q403j3827n409O667m947j0830N005Q375M509r905
12845a7646Q328P372k064P571R53Q860J50o180O180l152j4078J1453n275p231
12831d759q06K676L88O164K656Q28k235j1306k522R154J6734n68n681m410o102
$$ y = [-12326, 8215, 12564, -9036, -4163, 5708, 7179, -702, -7449, 2524, 1762, 3432, -3232, -7380, -5049, 1838, 8356, 6828, 10118, 3865, 4407, 9140, 6804, 18516, 12753, 10214, -3621, -12938, -23244, -19863, -14663, -7921, -5961, 7658, 26531, 27713, 38490, 23096, 3869, 5778, 14083, 16417, 8962, -10930, -4529, 10654, 163, -8239, -4336, 11673, 16729, 14141, 13403, -6229, -15137, -17783, -20849, -17272, 193, 16499, 23917, 12307, -4278, -13891, -10501, -7499, 11375, 12663, 13193, 6796, 1331, 11119, 2716, -11111, -16520, -9853, -14800, -25630, -20625, -12250, -7741, -17646, -9318, -1946, -4010, 3561, 4514, 13374, 13524, 7344, 13524, 10372, -3706, 7747, 2472, -4759, -5565, -2889, -2501, 3663, 6319, 7147, 4912, -6394, -8916, 238, 16972, 16404, 10723, 6313, 211]
12816B11j3705O474O061j139j6732M428m303O219O917j0832O458K0096k645j5490
12802g982J1414j3024K778R804j8587k1945m275J956K1677R232j0180J6473O610
12789C951J149N702J2997j8120K857R16K771j5165r634l812R180L606P648m44
12775C602k086k08k368q345l483J4482P707o734p801O927J0285M884j5180O423
12761H105o9j5371J7193R572j2556j9363o619J2963R876r505j6538O848M005K446
12747i013M948j771R762p23j993l330J0341o156N631M9N431R16m525J103J948
12732A2618j402q488q950N245J8023j808n261J450j415R839j1413m044j9800J236
12718a4170K0045j730o402l037M519n616J6015K0025M260j1587o61R330l282k7257
$$ y = [211, -13494, -7020, -959, -2098, -18830, -14402, -18705, -12486, -5569, -16401, -9943, 10153, 7508, -7982, 3432, -9592, -6814, 2990, -15597, -37542, -41817, -39861, -18184, -8952, -19132, -2659, 3951, 5100, 10802, 23799, 5679, 8536, 9452, 12223, -2942, -12576, -16388, -7208, -3602, 4046, 3602, 1516, 1308, -1060, -9405, -12888, 1594, 9301, 2567, -5234, 1693, 11978, 16862, 1682, 8105, 8036, -7335, 9858, 19430, 6874, -12489, -19108, -6145, 3731, -5774, -22312, -15464, -11459, -9013, -4065, -5836, 3926, 3203, 1210, -2120, 8221, 2065, 7696, 7745, 13176, 14092, 9567, 10670, 12618, 11216, 2728, -6222, -977, 17046, 15238, 9977, 11427, 10012, 19851, 8438, 4394, -15406, -14170, 5875, 4145, -2257, -5294, -775, -6391, 9624, 29649, 33909, 22322, 21661, 30991, 27709, 452]
12704D52m696J1818J0277o087q411l479J6053J854P60j463N381N131m136j8884
12690D570o563n619K058O219j497j754J6136P98r784q041o80K1726J6654j1599
12676B2624k4725r922R025Q685J3223M360k40K551O051n011n353L688j1965j0301
12662B690j915J2618L915O653J2953m173l477p466L194q833J69L1j2679l014M440
12647E106N528R199J36o943O07l621o579n52o459j7714j6028P966M584K3557l38
12632a551j544J569k860j283J0481N122l942K127k120L268J103k202m129K008
12618F047L401m74r05j5597j925n752k216J6978O536q660p558L909R594M089o146
12603A321r516K586p281K757m708M044q008k475Q775m20M616Q710J2200m28k790
$$ y = [452, -4244, 7574, 17851, 11764, 3353, -126, 15927, 17781, 18541, 17078, 22459, 27590, 23454, 4570, -1993, -7612, -5554, 665, -832, -2586, 13550, 14348, 4564, -3477, -4157, 17569, 34223, 22624, -2101, -12023, -2998, 5687, 18910, 23270, 23030, 25581, 31632, 26621, 21268, 24956, 12991, 2690, 775, 13393, 17308, 23961, 36914, 32741, 29264, 21798, 24992, 16159, 16328, 16359, 3680, 666, 5106, 10634, 19833, 19969, 13026, 13633, 10012, 3433, 2881, -3578, -21292, -37320, -29354, -24770, -1213, -1551, -3095, -1526, -4386, -5669, 4812, 9934, 5992, 8119, 5999, 9267, 10370, 8168, 4039, 6047, 9448, 8974, 8069, -7528, -9453, -15205, -17421, -443, 6093, -2567, -10125, -6216, 3378, 7467, 1321, -8195, -5609, -12890, -10133, -14841, -10797, -18805, -21280, -12505, -12925, -8309, 401, 12601, 12173, 9383]
12588I383O649O015j6297O334P280l433j8256j5494P76l211J654Q428J3988M024
12574G840J2568J284k0909l702k611J111q75J890O635O524p346K342l275J289
12560B765j789P218N907N504j1963j6190k259J4721Q519r249n982O523J0518N219
12546A9462j2308r091j032l883q621j412J0948J0231J1L94J8640L962N927j777
12532C1451L219p521j9532o88K963j7744j4091O990l38L32m102J2627M564J1059
12518I189J1857P55j3605j0322k418k04K3668J6905m124j9342j9712j3125Q576
12505a1902Q743J2443O308o314r561O021K642n540j288p997R499L707r350R6J685
12490h08J2077J1697o037j9167q209O107r676O78O765P322p784q957J1482J5448
$$ y = [9383, 16032, 22047, 5750, 12084, 19364, 15931, -2325, -17819, -17043, -20254, -18600, -10172, 3816, 7840, 20408, 21692, 783, -2919, -5530, -4419, -5294, -3404, 3231, 9755, 2409, 4751, 1476, 2765, 976, 8194, 14101, 19605, 7642, -8548, -10807, 3914, 12433, 3184, -2798, 3725, 14243, 19462, 7154, -1937, -2969, -6852, -15473, -16885, -5937, 4294, 4305, 4699, 23339, 27301, 33228, 31451, 34670, 27149, 7617, 6929, 9892, -7852, -21943, -14953, -15291, -14959, -19061, -6434, -1870, 9189, 21046, 21801, 8196, -2126, -4544, -4748, 18920, 35825, 31701, 12359, -7353, -20478, -11902, -3159, 9284, 15592, 9278, -283, 5738, 8380, 2840, 1552, -6445, 3054, 6761, -2589, -2493, -808, 11269, 22966, 16929, -2238, -10447, -4340, -14016, -13338, -6573, 749, -7035, -15992, -4510, 10938]
12476A0938n133L380j837j2612L048O092O986O996M331L07j3382j1198j142q978
12462a2204J4744m549K261k703j4044K600Q669n128j1891J4110Q484k2330r711
12449c1692K1582K2388Q277r377j2695K485P50k939j726l159n20L701O434N750
12435I259K603r026r316m916L172J2759M359j8087j6364l159M978J7915J0852
12422E029R22m971N88P50Q692M164j3134m973m29k460J1540N766p344q025N183
12407A298K698r357k36l652q213l366J9466N21J7467J5926j7576k3897l688N072
12393g537Q785J0053J0058j4297J625N559p336r621J2900M787q307j245m378M596
12379E642k517q961o037N811r699j3935j63M922Q76q82j0062Q887J1735K1468
$$ y = [10938, 5805, 9185, 7348, -5264, -2216, 3876, 10862, 17858, 22189, 22496, 9114, -2084, -3226, -12204, 2540, -2009, 252, -2451, -16495, -13895, -5226, -10354, -22245, -8135, 349, -21981, -31692, -10110, 12278, 20555, 11178, -1517, 968, 1718, -1221, -2947, -6106, -6626, -2925, 3509, 9259, 11862, 2836, -6480, -11396, -8224, 4535, 8894, -9193, -25557, -28716, -23738, -5823, 5029, 5951, 980, 1568, 2318, 11010, 15174, 2040, -2933, -3362, -5822, 5718, 11484, 4140, -3885, 1298, 3996, -5361, -5597, -9249, -17462, -20828, -1362, -841, 16626, 32552, 14976, -8921, -12609, -7537, 1248, 11301, 21359, 7062, 8687, 14246, 6910, -2711, 10189, 14976, 6669, 5424, 1046, 5642, 3125, -5836, -11873, -6062, -15761, -29696, -29859, -24937, -24061, -24943, -35005, -26118, -14383, 7085]
12365G085j648n882L725q664q566J0640J326l145P766L712r284n482l788R473
12351b732J395r983M260J3278J4216J0754r170k0605P06K560m859r60J446m802
12337d496N164J00r169j501Q54M839Q448k229j4109p982R970K76K446R07j0392
12322a6874o322j0547O565M786O127M910P304P437q758n583k52j952k067J0296
12308d930j689r124q095l176R030O217m383j3256J2388J6000R372m443N15Q738
12294A3164j935p910k449o900j4521N887J0321m043K140k611R586O008j121n590
12280B6j908j0388p330k12O798J3315M120j0205j6171M807N078J0729J3347p344
12266D662k2728L146O320R140j417j1314M625J151q962p514N433J3823J5378j2168
$$ y = [7085, 5437, -445, 3280, -5384, -13950, -3310, -1984, -5129, 2637, 6349, -2935, -8417, -12205, -2732, -1337, -11320, -7060, 6218, 20434, 31188, 22018, 1413, 2119, 4679, -180, -1140, 306, -4496, 668, 768, -8401, -9902, -9048, -4209, 4239, 2010, -12099, -20081, -10111, -9835, -7389, -6482, -16874, -23196, -33743, -27178, -22392, -16265, -11355, -4051, 3386, -5372, -10955, -11207, -13159, -15226, -4930, -6619, -15743, -23838, -27014, -17984, -11767, -16150, -29406, -17018, -1018, 8354, 3911, 4426, 13164, 11229, 3319, 870, -6030, -20551, -14664, -4343, -8386, -6246, -8857, 729, 6737, 5616, 26, -1882, -12270, -19600, -19812, -13014, 301, 4421, -5784, -21955, -17148, -12070, -1341, 12006, 4662, -18066, -14920, -8600, 540, -877, -12191, -7566, -6415, -15377, -22891, -17458, -3635, 11743, -425]
12252d25o196M140k743N048M589J787P326j5586j0591R546J2644K955k6708o385
12238b0599Q137Q572n789M910n974K414Q712P536L711j2843M13K1541M249l98
12224B4592j5576K60j0827L46m171p279K283J7773J1098n930j552O905L324l625
12210A7621p023j6805j3651Q629K4997Q189J0483j4698L173N403j6138j8418j3056
12197b1294l928J4115P429o221q849J4547J0846M892j367j946o813o257J11O658
12183A923K744r233m03L696o907Q278L789n385j6090N554J7947N353j2437j5159
12169a6330j4386NO084l264M731L338J6836J4630O39k661j2816o027P839k940
12155d322M742R180J1702j9709j8339J656P767j658j1277O282K429k527J4768
$$ y = [-425, -6621, -2481, -5224, -176, 4413, 6200, 13526, -2060, -12651, -3105, 9539, 12494, -14214, -20599, -12462, -3890, -9679, -4769, -10743, -8329, 383, 7919, 11630, -1213, -800, 20741, 24990, 24592, 9016, 9276, -1551, -1205, -5376, -12655, -10372, 7401, 18499, 12569, 11017, 17922, 21246, 17621, 10598, -6207, -19858, -11229, 13768, 21957, 32440, 17742, 20915, 26318, 10180, -8238, -21294, -25222, -11107, -3678, -9899, -18748, -4201, 6645, 11537, 10170, 8224, 1411, -4846, -4735, 1923, 4667, -4566, -4969, -1273, -8180, 98, 3887, -1498, -17588, -12034, 5913, 11266, -1171, -16330, -30716, -30711, -24627, -27891, -23160, -19822, -2986, 11644, 12283, 9622, -3194, -9221, -1382, -4322, 420, 9600, 21302, 1593, -16746, -15090, -7323, -8981, -20258, -13976, -11547, -14074, 694]
12142F94J94K266R030j0593k2315O285R277o385M413J808J614L03l191r929r484
12127b6013k363P283Q237L197M197J0045N446j8605P86K864M54M04Q827O247j1645
12112f39r712j0047M694M382l247O478P001k603q69j675O84L976k144k917l502
12097a0140P250o719J027M247o407O575O43j3697N270J6160q892j6486l437j497
12083b6103J4223J4505O360J661r002k46Q400L787q671j6309q029N267N566M921
12069c670j646J0482m970o622o293j46K1508N166p956m17R152J926j6811j2987
12055a3284K653M927J165J423j1418j0051k212K541j1074K023J5923K0193L600
12042F409p760N543P121M21r472j3268O130L182l525r76m549J933J6745J3074
$$ y = [694, 888, 3154, 12184, 1591, -20724, -14439, -5162, -11547, -7134, -5326, -3712, -3409, -6600, -16529, -26013, -28376, -21093, -12856, -9659, -5462, 4583, 10029, -8576, -7790, -4926, -4472, -4068, 4759, 11006, -639, -10351, -20398, -15704, -11322, -14569, -8091, -1090, -3693, -4562, -6237, -5553, -1577, -3721, -6638, -10140, -2890, -9609, -8582, -4335, -10742, -4167, -3524, -17221, -11951, 4209, -4683, -21169, -24606, -26103, -11880, 2625, 8985, 10646, 1644, 1398, 9798, 13585, 4914, -11395, -19424, -14157, -8591, -3670, -5316, 5166, 196, -6426, -12719, -12865, 8643, 13809, 5853, 5436, 14588, 16514, -297, -13284, -10631, -5704, -4539, -3116, -14534, -24585, -26797, -24256, -35330, -33307, -17384, 2809, 6409, -1351, 4192, 11313, 11734, 2262, -11006, -4876, -1694, -5219, -6195, -10744, -8811, 7934, 21008]
12028B1008L298o143O626L506m446j2819K749J6180j90k3917K199j2904q434P509
12014e778J766m918R53O637Q757K152l854k2503J670R375K240M166N966J157J765
11999I551L345p234l525j1468o461L44r03J1068k093n976J5387O520J249R06l118
11984G592M19l91M759j201r620j4719O022p04l105O044L050p421j416J2969j4209
11969a1931k821P169l255M022l149m578k6J6652L379J0132K106p833q697J569
11955B739j1267J3342M180M615Q842o445n266J157p752k802j759j1411n774Q568
11941i033R472o021j1938k077O289N074n693j2644l961L811P765O610J1660L671
11927B985j4472J172N106j57Q589L797m302O026p73l325q087Q865p099j0477k386
$$ y = [21008, 24306, 18163, 24789, 28295, 23849, 11030, 13779, 29959, 29769, 5852, 8051, -4853, -13287, -5778, -4012, -8930, -7977, -1340, 7417, 9569, 5715, -16788, -15118, -5743, -3503, 663, 6629, 7786, 9551, 12896, 5662, 2137, -9331, -15792, -15448, -16351, -5283, -7376, -13352, 2035, 8555, 9804, 10710, 7592, 8011, 7620, 12379, 11178, 1558, -13161, -7139, -7843, -10948, -4904, -1854, -9275, -10691, 2278, -11931, -14752, -7583, -10838, -6816, -9965, -14543, -14569, 2083, 5462, 15594, 17700, 9867, 1170, 2739, -8528, 4814, 8994, 13609, 22451, 16006, 10740, 11897, 4145, 1343, -416, -11827, -17601, -9033, 439, -5582, -17520, -19597, -13308, -8234, -13927, -26571, -30532, -26721, -18956, -12346, -686, 2985, -11487, -10315, -5209, -5366, 3223, 7020, 2718, 8744, 7971, 4646, -3441, 5424, -1675, -12152, -14538]
11912a4538m924m422N476O630n673J5582J2335j3713r465j991J477K669p089n786
11898b3432l070N322L053M722J1939l892J877J837m934o492O779P288J0790q068
11884C719j2960k238p61M014J3546J0025k121K211L806o407k370J763K805J830
11870A6862Q689K162M063j3720j179P838j4425j3526j0140M581Q116j3948p080
11857b1707N490O733l864N573K985O527K621q290k708J0814M041K776k382q008
11843F01o547k054o259J1346j719l049p021j634J8075J2224o692o358P707J0701
11829A9321q17n332k5038n523M755J1079Q867k862K590q047j2897j2871k493N453
11815b3815l828N828L401Q491Q315l60L832o244r182o158J6661J7861M781j7412
$$ y = [-14538, -19462, -23884, -18408, -11778, -17451, -1869, 10466, -3247, -12712, -14703, -13226, -10557, -17646, -23432, -26502, -21180, -18127, -13405, -1466, -5358, -3481, -1644, -6578, -13070, -6291, 997, 11787, 3719, -9241, -11479, -12240, -8226, 5320, 15345, 13224, 15435, 19241, 12834, 10464, 12227, 15032, 16862, 25551, 27713, 31776, 18056, 16877, 24715, 10290, -3236, -13376, -8795, -679, -14627, -21707, -16217, -9484, -13348, -7775, -4790, 1737, 4358, -3932, -6640, 4174, 8215, 10991, 8609, 601, -5946, -8000, -14259, -2913, -4632, -7681, -14702, -16336, 1739, 13963, 7271, 913, 8620, 19321, 18504, 13172, -11866, -17389, -12634, -1555, 7312, 4450, 7040, -1007, -13904, -26775, -29268, -23815, -27643, -21815, -18414, -9923, -1608, -1968, 1864, -4380, -13562, -19720, -3059, 14802, 19583, 2171]
11801B171j5846O950L370q274O79Q036N513N699J1528P22j1907l216j385k3921
11787a9881N180J1379r86J1959J9233j1299J6703j4765j75K4121l731k3906o670
11774G162l42k715j8318o281K1851J4758M109j0428p7M882m62j4306L862K589
11760F284J5980O185q787o458j5026j0865J3549J1036J30p242O068r601K856J0811
11746A4920j906k1816n393r634m276R498R342P152n33n245N473J9000L802k7762
11732g378q707J420p136R236J0217N957n102N668J5380q013j3227K1040J2111
11719C1466N913j9024n515J110m011n940N648J064r010m744N228K234k637j5587
11705a3805J3563K0585n589j5313N170M487k2848o035J5627J752j3276J6208O801
$$ y = [2171, -13675, -6725, -3355, -11629, -10950, -2914, 2599, 8298, 19826, 20548, 8641, 5425, 4040, -19881, -14701, -3322, -4308, 7651, 26884, 15585, 32288, 17523, 17348, 41469, 37738, 13832, 7162, 6820, 4105, -14213, -20494, 1357, 16115, 20224, 9796, 9719, 14601, 14139, -167, 3695, 6284, 22264, 28449, 19662, 13204, -1822, -12687, 862, 11898, 12028, 4786, 10854, 1253, 4109, 14920, 13014, -8802, -14195, -23829, -28105, -18607, -9265, -2113, -2646, -7891, -2418, 16582, 20384, -7378, -16085, -14665, -21801, -12565, -2348, 3609, -1493, 4175, 19555, 11542, -1685, 19355, 31466, 37379, 18355, 12840, 13950, 9939, 3999, 9647, 10711, 1701, -3043, 2185, 4419, 1782, -13805, -242, 20343, 14754, -559, 4611, 9098, -13750, -19785, -4158, -2406, -15682, 526, 7327]
11692G327J566N345j7934k79N139k383m395n098j424o045K2034J1853j174j8187
11678c655q726J425J3411J5147J6566L258j1869j0839L311O458r564P38j0269
11665E392q86J4553j5313j1192J3676l589p77j5472K2965J5745j1654j6169j0252
11652a2973R690J4959j5779p075J6077l555j8173J5899P009j701k1889O120J0805
11639e86p753j1000J0379Q145R756J1035K690p778k2354J332L966m898P985J2719
11625A3638J494r126r380J1699Q07n052o196k0653j0312n692M035Q567Q909Q571
11611h691K370L668n215k247j3236O12N078l915j3626n805M401J8748r875R643
11597a8090P322k39n341J5525L093k002Q875K650j0743k0288r654K2119J4477
$$ y = [7327, 8893, 14238, -3696, -3975, 1164, -1219, -5614, -10712, -12136, -18181, 3853, 15706, 14532, -3655, -12381, -10956, 2455, 17602, 34168, 37426, 25557, 14718, 18029, 24487, 14923, 15661, 5392, 4506, 19059, 3746, -7446, 6230, 2641, 1864, -13608, 9357, 25102, 13448, -2721, -12973, -3283, 11676, -4103, -11178, 4899, 1344, -16829, -930, 6079, 4378, -17511, -11391, -586, -8339, -19339, -8960, -815, 8941, 19976, 22666, 14888, -7466, -6134, -2168, -7066, 919, 13638, 15132, 6006, -3374, 8325, 9132, 4080, -2116, -22769, -33081, -38773, -34738, -26171, -17262, -8691, -6321, -2653, -7868, -10115, -23351, -22739, -17661, -21576, -35202, -41007, -36606, -17858, -27733, -18090, -10768, -11007, -16348, -823, 2270, 268, 9143, 11793, 1050, -19238, -28892, -6773, 7704]
11584G704L768j2046M72K017M529J2406k587K678o439j3632J0079L567K1878p849
11570B6545q838o460k429M899N78m779J061n221J860L587j3146R79J90j2325j1535
11555b5034J2358Q700K387n990N4J638K211J6634N00q116L894O151o010n44L894
11540A2727L898q543j0447j5924O98J6556j075p989J110l234N452K841M695K075
11526B840J421j5941j4869J3746J4617j1427o903J1402M184M496K921j0292j208
11513e013P060l369p837r196j703m861J374m275J6624J0227J100o189j1384Q59
11499a6583J080L832J4928P317L132O967M3j1321m021q476N489P683K952L132
11485A6154n04J3458k581j2492j9759n334l91M462J256m848J0601N443j7774o373
$$ y = [7704, 11472, -574, -102, 1915, 6444, 18850, 16263, 18941, 12502, -1130, 8949, 12516, 34394, 26545, 17707, 11247, 8818, 13717, 14295, 9516, 10577, 5356, 7216, 10803, -2343, -1364, -1174, -13499, -25034, -12676, -3976, -1589, -7579, -7525, -5887, -3676, 12958, 13458, 5342, 9236, 15387, 9377, 8833, 12727, 16625, 8082, -2365, -18289, -17591, -1035, -2110, -10099, -8989, -12223, -6771, -3930, 765, 2840, 4261, -11680, -26549, -12803, 1814, -9613, -16516, -5114, -930, 3566, 6487, -3805, -5013, 2047, -1322, -9159, -18355, -20058, -24919, -23545, -27820, -11196, -969, 131, -6058, -17442, -16583, -15503, -11671, 3257, 10574, 13706, 20673, 20716, 9395, 5374, -3102, 2387, 10070, 13022, 16154, 15650, 29108, 26527, 14035, -5724, -11058, -11449, -6987, -5731, -10579, 22, 5465, -12309, -18682]
$$ [...]
##END NTUPLES=NMR SPECTRUM
##END=
