##TITLE=Analysis number 317575
Compound Code ac 29790
Project Code qc-cat
Chemist Name acros
##JCAMPDX= 6.0         $$ Bruker NMR JCAMP-DX V2.0
##DATA TYPE= NMR SPECTRUM
##DATA CLASS= NTUPLES
##ORIGIN= Bruker BioSpin GmbH
##OWNER= nmr
$$ XWIN-NMR		Version 3.5
$$ Fri Feb 24 09:08:16 2006 GMT Standard Time (UT+0h)  MAYBRIDGE\nmr@NMR_250MHZ
##.OBSERVE FREQUENCY= 250.131544655141
##.OBSERVE NUCLEUS= ^1H
##.ACQUISITION MODE= SIMULTANEOUS (DQD)
##.ACQUISITION SCHEME= undefined
##.AVERAGES= 16
##.DIGITISER RES= 18
##SPECTROMETER/DATA SYSTEM= dpx250
##.PULSE SEQUENCE= zg30
##.SOLVENT NAME= DMSO
##.SHIFT REFERENCE= (INTERNAL, DMSO, 0, 16.522)
##AUDIT TRAIL= $$ (NUMBER, WHEN, WHO, WHERE, WHAT)
$$ ##TITLE= Audit trail, XWIN-NMR		Version 3.5
$$ ##JCAMPDX= 5.01
$$ ##ORIGIN= Bruker BioSpin GmbH
$$ ##OWNER= nmr
$$ C:\u/data/dgb/nmr/ADRS/16820/pdata/1/auditp.txt
$$ ##AUDIT TRAIL=  $$ (NUMBER, WHEN, WHO, WHERE, WHAT)
(   1,<2006-02-24 09:07:53.40 +000>,<MAYBRIDGE\nmr>,<NMR_250MHZ>,
      <created by zg, POWCHK disabled, PULCHK disabled
       configuration hash MD5:
       84 BC 41 DB A1 6E 1D 46 DA 25 12 A5 C1 ED C5 3A
       data hash MD5: 64K
       9B BA 80 16 9A 3D E4 57 4F 1B CC 3C 13 60 76 F1>)
(   2,<2006-02-24 09:08:07.21 +000>,<MAYBRIDGE\nmr>,<NMR_250MHZ>,
      <Start of raw data processing
       ef LB = 0.3 FT_mod = 6 PKNL = 1 SI = 32K 
       data hash MD5: 32K
       0F 26 25 71 3D 3E 18 6A A6 BF DF 18 94 4D CA 11>)
(   3,<2006-02-24 09:08:08.88 +000>,<MAYBRIDGE\nmr>,<NMR_250MHZ>,
      <apk 
       data hash MD5: 32K
       C0 A1 D4 AB 39 46 5F 78 B0 0B C0 BF 8E EE 26 F6>)
(   4,<2006-02-24 09:08:09.65 +000>,<MAYBRIDGE\nmr>,<NMR_250MHZ>,
      <abs ABSG = 5 
       data hash MD5: 32K
       B3 88 A6 C2 93 3D BE 30 ED 29 3B 59 06 5A C1 85>)
$$ ##END=
$$ 
$$ hash MD5
$$ 08 F2 57 03 15 2C 6A 93 A9 3E 46 BF A6 D4 5A DF
##$RELAX= 
##$RELAX= 
##$RELAX= 
##$RELAX= 
##$RELAX= 
##$RELAX= 
##$RELAX= 
$$ Bruker specific parameters
$$ --------------------------
##$DU= <C:\u>
##$EXPNO= 16820
##$NAME= <ADRS>
##$PROCNO= 1
##$TYPE= <nmr>
##$USER= <dgb>
##$AMP= (0..31)
100 100 100 100 100 100 100 100 100 100 100 100 100 100 100 100 100 100 
100 100 100 100 100 100 100 100 100 100 100 100 100 100 
##$AQSEQ= 0
##$AQ_mod= 3
##$AUNM= <au_zg>
##$AUTOPOS= <5 >
##$BF1= 250.13
##$BF2= 250.13
##$BF3= 250.13
##$BF4= 250.13
##$BF5= 500.13
##$BF6= 500.13
##$BF7= 500.13
##$BF8= 500.13
##$BYTORDA= 1
##$CFDGTYP= 0
##$CFRGTYP= 5
##$CHEMSTR= <none>
##$CNST= (0..31)
1 1 145 1 1 1 1 1 1 1 1 1 1 1 1 1 1 1 1 1 1 1 1 1 1 1 1 1 1 1 1 1 
##$CPDPRG= <>
##$CPDPRG1= <>
##$CPDPRG2= <>
##$CPDPRG3= <>
##$CPDPRG4= <mlev>
##$CPDPRG5= <mlev>
##$CPDPRG6= <mlev>
##$CPDPRG7= <mlev>
##$CPDPRG8= <mlev>
##$CPDPRGB= <>
##$CPDPRGT= <>
##$D= (0..31)
0 1 0 0 0 0 0 0 0 0.06 0 0 0 0 0 0 0.0002 0 0 0 0 0 0 0 0 0 0 0 0 0 0 
0 
##$DATE= 1140772071
##$DBL= (0..7)
120 120 120 120 120 120 120 120 
##$DBP= (0..7)
150 150 150 150 150 150 150 150 
##$DBP07= 0
##$DBPNAM0= <>
##$DBPNAM1= <>
##$DBPNAM2= <>
$$ [...]
##$SUBNAM7= <"">
##$SUBNAM8= <"">
##$SUBNAM9= <"">
##$SW= 20.6930455092707
##$SWIBOX= (0..15)
0 0 3 0 0 0 0 0 0 0 0 0 0 0 0 0 
##$SW_h= 5175.983436853
##$TD= 65536
##$TD0= 1
##$TE= 293.16
##$TE2= 300
##$TE3= 300
##$TEG= 300
##$TL= (0..7)
0 120 120 120 120 120 120 120 
##$TP= (0..7)
150 150 150 150 150 150 150 150 
##$TP07= 0
##$TPNAME0= <>
##$TPNAME1= <>
##$TPNAME2= <>
##$TPNAME3= <>
##$TPNAME4= <>
##$TPNAME5= <>
##$TPNAME6= <>
##$TPNAME7= <>
##$TPOAL= (0..7)
0.5 0.5 0.5 0.5 0.5 0.5 0.5 0.5 
##$TPOFFS= (0..7)
0 0 0 0 0 0 0 0 
##$TUNHIN= 0
##$TUNHOUT= 0
##$TUNXOUT= 0
##$USERA1= <user>
##$USERA2= <user>
##$USERA3= <user>
##$USERA4= <user>
##$USERA5= <user>
##$V9= 5
##$VALIST= <valist>
##$VCLIST= <CCCCCCCCCCCCCCC>
##$VD= 0
##$VDLIST= <DDDDDDDDDDDDDDD>
##$VPLIST= <PPPPPPPPPPPPPPP>
##$VTLIST= <TTTTTTTTTTTTTTT>
##$WBST= 1024
##$WBSW= 4
##$XGAIN= (0..3)
0 0 0 0 
##$XL= 0
##$YL= 0
##$YMAX_a= 443052
##$YMIN_a= -487673
##$ZGOPTNS= <>
##$ZL1= 120
##$ZL2= 120
##$ZL3= 120
##$ZL4= 120
##$ABSF1= 16.522
##$ABSF2= -4.171173
##$ABSG= 5
##$ABSL= 3
##$ALPHA= 0
##$AQORDER= 0
##$ASSFAC= 0
##$ASSFACI= 0
##$ASSFACX= 0
##$ASSWID= 0
##$AUNMP= <proc_1d>
##$AZFE= 0.1
##$AZFW= 0.1
##$BCFW= 0
##$BC_mod= 0
##$BYTORDP= 0
##$COROFFS= 0
##$CY= 12.5
##$DATMOD= 1
##$DC= 0
##$DFILT= <>
##$DTYPP= 0
##$F1P= 14.0000005364418
##$F2P= -0.99999901652339
##$FCOR= 0.5
##$FTSIZE= 32768
##$FT_mod= 6
##$GAMMA= 0
##$GB= 0
##$INTBC= 1
##$INTSCL= 1
##$ISEN= 128
##$LB= 0.3
##$LEV0= 0
##$LPBIN= 0
##$MAXI= 10000
##$MC2= 0
##$MEAN= 0
##$ME_mod= 0
##$MI= 0
##$NCOEF= 0
##$NC_proc= -3
##$NLEV= 6
##$NOISF1= 0
##$NOISF2= 0
##$NSP= 0
##$NTH_PI= 0
##$NZP= 0
##$OFFSET= 16.522
##$PC= 1
##$PHC0= 239.9584
##$PHC1= 6.740932
##$PH_mod= 1
##$PKNL= yes
##$PPARMOD= 0
##$PSCAL= 4
##$PSIGN= 0
##$REVERSE= no
##$SF= 250.13
##$SI= 32768
##$SIGF1= 0
##$SIGF2= 0
##$SINO= 400
##$SIOLD= 32768
##$SREGLST= <1H.DMSO>
##$SSB= 0
##$STSI= 32768
##$STSR= 0
##$SW_p= 5175.98343685301
##$SYMM= 0
##$S_DEV= 0
##$TDeff= 65536
##$TDoff= 0
##$TI= <Analysis number 999999
Compound Code 99
Book Reference 9
Project Code 9>
##$TILT= no
##$TM1= 0
##$TM2= 0
##$TOPLEV= 0
##$USERP1= <user>
##$USERP2= <user>
##$USERP3= <user>
##$USERP4= <user>
##$USERP5= <user>
##$WDW= 1
##$XDIM= 32768
##$YMAX_p= 424525540
##$YMIN_p= -232520
$$ End of Bruker specific parameters
$$ ---------------------------------
##NTUPLES= NMR SPECTRUM
##VAR_NAME=  FREQUENCY,     SPECTRUM/REAL,   SPECTRUM/IMAG
##SYMBOL=    X,             R,               I
##VAR_TYPE=  INDEPENDENT,   DEPENDENT,       DEPENDENT
##VAR_FORM=  AFFN,          ASDF,            ASDF
##VAR_DIM=   32768,         32768,           32768
##UNITS=     HZ,            ARBITRARY UNITS, ARBITRARY UNITS
##FACTOR=    0.157963299565203, 1,           1
##FIRST=     4132.6476996994, 0,             0
##LAST=      -1043.33573715361, 0,           0
##MIN=       -1043.33573715361, -232520,     0
##MAX=       4132.6476996994, 424525540,     0
$$ Real data points
##PAGE= N=1
##DATA TABLE= (X++(R..R)), XYDATA
$$ [...]
20499 25980 -37938 -63643 -79467 -72808 -4951 77281 90161 94862 95557 12675 -5629 27760
20487 27760 52561 95349 123839 59242 23703 -32283 -36334 -4120 17251 16088 25755 79734
20475 79734 117180 105185 67579 8741 -50512 39167 26764 -17767 -3468 -26547 -86970 -108690
20463 -108690 -67041 -1701 73786 23342 -695 8453 26327 85192 78701 108831 52183 19394
20451 19394 35643 20830 31511 18926 -6601 14815 63990 70070 52431 36862 46899 9312
20439 9312 20995 46751 37503 38500 56694 33847 35450 42818 52806 23949 -87456 -124319 -46110
20426 -46110 -5694 -25569 -63922 -2022 25516 8849 3752 25312 7680 -27529 179 1966
20414 1966 -24574 -36875 -31004 -594 50658 49172 32111 63853 68971 28624 60423 45757
20402 45757 36117 42676 11523 -50301 -72741 -27862 -12223 12356 -18661 23960 -26479 -50034
20390 -50034 -37883 -25219 -1968 31081 82449 34129 -4809 -36901 -28932 -12987 6028 -640
20378 -640 15321 1185 15395 29673 58360 16055 28465 10382 -22468 -86851 -102455 -35691
20366 -35691 27784 43503 40388 64627 31844 -34876 -5524 33502 52925 42821 -45011 -63514
20354 -63514 -15584 27672 60545 61070 33385 23578 34155 84663 59912 74590 68109 26741
20342 26741 20200 19391 65312 130528 162725 90667 48297 3831 34207 38511 30653 46544 -13500
20329 -13500 -25709 37330 69236 70295 49244 -49179 -83953 -55532 -61166 -49796 12817 -25167
20317 -25167 -5566 22654 4356 -34124 -81629 -55951 -17040 32847 32920 44770 -37886 23401
20305 23401 81719 56498 -9639 -82045 -75672 -26538 -7398 69158 61091 79399 44764 20348
20293 20348 -37027 -100372 -52580 -43933 -61758 -27238 -2737 -27240 -66783 -89950 -53538 -50524
20281 -50524 -22401 -17261 -2894 2660 -7747 -31566 -32244 28524 51470 21314 -1587 -27131
20269 -27131 -54371 -15043 -21205 -20324 84723 62711 -14791 31024 55010 49405 48993 53938 50483
20256 50483 -312 -58901 -61 50694 47659 -38115 -70624 -85336 -75846 -18277 -12397 9804
20244 9804 13679 -26064 -12746 13942 37648 1576 -49979 15808 72458 51754 3401 -9757
20232 -9757 -10554 65393 63428 11356 -15293 10981 30134 43204 26539 -30601 -62482 -39824
20220 -39824 -67785 -33042 -14853 -24209 -6714 -29500 -80215 -51594 13615 64136 35236 32305
20208 32305 81022 95574 44148 -45115 -43851 -39017 -37119 -25135 -13087 -12311 -20771 -29547 -58799
20195 -58799 -68514 -86876 -80580 -2290 33679 105117 79735 17506 9609 34593 67379 53554
20183 53554 40681 47525 84156 59984 -39240 -59827 5061 25972 57501 51757 74809 67631
20171 67631 84169 64960 19132 72749 107613 35838 17672 -31051 -68003 -56806 -85450 -129059
20159 -129059 -56241 34445 68349 80200 77954 75396 113644 100495 119596 116606 49726 15744
20147 15744 72563 26158 -104325 -104016 -45440 -34245 -49428 -65567 -51515 3931 75059 19535
20135 19535 19876 3202 -22575 -41090 -52087 -46539 -75111 -44977 -39957 -18259 26684 -3923
20123 -3923 -57151 -79092 -122591 -116540 -97519 -50996 4683 58727 59222 50682 67401 1404 24600
20110 24600 42896 11907 -28943 -51359 -13625 27081 3630 11752 39909 19607 4053 85028
20098 85028 79213 102168 92145 35637 32041 16389 -19291 -57319 -13296 79939 92553 96117
20086 96117 104693 12514 -40472 -62871 -51750 -54093 -33677 15818 38978 41537 96107 131599
20074 131599 97299 59567 74553 78748 25432 -10547 -31499 -54209 -50453 -19487 16668 40093
20062 40093 -9516 -47288 -41043 9417 73847 104874 105496 82177 83746 71942 48658 106031
20050 106031 150502 121915 128695 89556 37660 118192 127300 93898 106264 198001 251884 212601
20038 212601 204227 210959 199698 184665 165941 160455 198179 217650 262573 258521 242448 208400
20026 208400 195527 250631 235749 192300 212681 186269 97963 94883 76380 66460 95402 113309
20014 113309 112018 105982 85975 65581 61736 48340 28120 5199 -28935 -49168 -6848 56217
20002 56217 106600 119110 76465 56924 50836 32713 33008 36297 62163 24174 34771 49914
19990 49914 35838 162123 274609 252277 193639 78868 28782 -50413 -27241 8400 13450
19979 13450 22172 114181 236346 286769 246864 208864 206618 188247 187672 207775 227834 188248
19967 188248 158567 131082 145741 173337 121707 89937 107616 150331 140679 110636 141883 138987
19955 138987 128086 161176 111078 79596 103386 136524 137035 147652 163290 111692 51815 75810
19943 75810 74954 73279 50330 -26296 -57007 -42742 30766 62678 31266 33637 60354 119510
19931 119510 106851 46315 19384 -23748 23679 104637 117655 117197 145036 113118 89614 139280
19919 139280 151632 167890 193239 101697 -300 47830 53825 38614 51877 56157 48507 71624
19907 71624 113643 156007 143131 107082 81692 18923 10589 43904 38932 31663 33918 63167
19895 63167 154737 158831 87929 55853 59441 63102 23821 26656 -19029 -6102 2857 6789 4997
19882 4997 -12131 11320 56401 99435 87438 99762 95825 56811 19785 42479 56304 36797
19870 36797 57168 9439 14819 70316 42264 -13329 -36927 -37442 -12541 18088 -4630 -39447
19858 -39447 -49908 -14095 1875 87523 114339 102970 72898 64168 98433 101843 73979 99938
19846 99938 70516 -21456 848 42657 63424 55558 8978 73658 85376 127445 140959 77116
19834 77116 47940 55735 53081 -12792 -24660 17245 57785 72049 79977 68721 -17645 6758
19822 6758 50941 44798 83426 98282 123993 108846 34735 58260 113580 67833 54478 86728
19810 86728 57868 50580 100836 100896 76044 74993 64909 124478 99811 79853 47798 49647 46349
19797 46349 30742 6045 41656 12704 35518 93434 46879 33208 47928 48477 82530 50337
19785 50337 -10739 -10933 -6368 -26194 5835 91304 117150 86202 64988 118801 172467 172290 192353
19772 192353 174831 215528 222236 214995 117602 26351 56099 20544 78784 127496 98401 94264
19760 94264 127023 171510 153462 164264 129783 94517 63162 78380 98420 147758 104125 52944
19748 52944 59340 54406 37496 25247 49980 6827 -12350 32412 36034 79039 148750 154583
19736 154583 55234 10384 56254 90279 43263 63485 41995 62551 167192 195235 160067
19725 160067 116726 91451 91979 107068 111678 91858 99433 114186 111184 92806 89759 84092 174620
19712 174620 245372 224675 173301 185497 224253 212877 208935 212272 196986 133848 108539 91342
19700 91342 120670 115432 145448 172803 222314 209696 144385 88389 57741 61656 130018 168952
19688 168952 166929 202217 212122 172128 116664 147599 196189 245403 224475 236522 237840 184463
19676 184463 148808 218886 194015 200138 197885 140829 99914 78728 25949 32587 45222 124217
19664 124217 122157 161878 180377 160289 128103 109883 167852 189994 153784 128698 112571 146425
19652 146425 177910 195169 184390 219605 257723 275077 282756 228322 175319 115873 131709 195924
19640 195924 242642 212753 243661 228694 214052 187569 170433 184485 259179 273200 271838 179275
19628 179275 116166 121474 140815 149068 159601 193017 208748 229590 249602 230367 170762 98468
19616 98468 122556 169751 148326 133129 167097 164745 161166 169807 123687 127749 155490 141552
19604 141552 142971 141183 121533 147921 199732 237639 244767 296276 299553 242913 257655 293800
19592 293800 314238 337311 359781 348729 313933 312331 237117 249940 285368 283927 297786 345924
19580 345924 312351 325142 315606 312023 360501 398855 394118 327166 306627 364672 429960 425328
19568 425328 448271 474784 486266 519958 508418 469732 487021 517174 540208 532216 526162 546860
19556 546860 531969 486832 486184 581770 671539 757337 792550 818907 865077 943440 998773 1120851
19544 1120851 1209140 1256365 1297778 1356872 1452108 1593320 1740400 1905754 2129193 2388103
19534 2388103 2669779 3090925 3604897 4213199 5072811 6338293 8061553 10511382 13710657
19525 13710657 17410433 20892593 23745180 26064039 27806592 28454830 28223302 27837474
19517 27837474 28106488 29097096 30070045 30494605 30488388 30036266 28596600 25886079 22434817
19508 22434817 18705446 15110454 12019028 9667152 7986460 6755872 5880781 5184700
19500 5184700 4591655 4168526 3843394 3621065 3509516 3388019 3252413 3142536 3142696 3106354
19490 3106354 3069231 3089095 3148488 3197148 3245922 3322092 3407767 3596293 3870324 4218634 4708326
19479 4708326 5377897 6292075 7528876 9395550 12090296 15758552 19957922 23847372
19471 23847372 26993878 29540037 31524905 32349022 31967726 31195289 30980538 31466641 32097531
19462 32097531 32380960 32270494 31713295 30280523 27512223 23906938 20010598 16167394
19454 16167394 12792701 10236623 8335889 6936635 5893879 5014545 4349132 3898557
19446 3898557 3527491 3176947 2907894 2687779 2446844 2291276 2156312 2018430 1909090
19437 1909090 1808265 1717763 1627137 1556826 1482848 1432234 1315776 1228862 1208511 1152020 1114235
19426 1114235 1054433 981569 904378 856423 825189 721533 719909 707776 662592 667454 668765 716815
19414 716815 700862 697676 647941 570773 531141 498474 468732 515509 562718 586066 535297 533293
19402 533293 598146 619318 548622 504725 490931 520778 524777 476359 439088 495940 516142 483068
19390 483068 455974 454845 403564 398671 382981 448569 428213 383085 412593 466702 493174 493708
19378 493708 473891 515143 526163 513091 487191 467335 460002 464062 458680 478906 524334 634354
19366 634354 610579 636426 647993 655979 626163 577471 535507 527766 553388 620242 648700 592260
19354 592260 515087 520981 537215 554589 586398 597446 589342 583525 554721 499974 515627 533721
19342 533721 553857 538416 542179 537450 562608 576452 543207 550772 542532 550871 531323 537899 567008
19329 567008 619177 665123 690459 694863 653455 662557 739044 744321 681915 674953 679052 709349
19317 709349 693040 695640 677650 743408 776619 837021 889921 890865 904422 909137 852783 813626
19305 813626 795641 788987 749077 714120 668599 700723 732774 708272 720100 782682 764807 759512
19293 759512 830869 847730 770959 707352 736600 770643 811864 878220 847881 815288 790059
19282 790059 775090 873073 902183 862467 801424 730891 716208 700813 759428 802721 838329
19271 838329 830423 886159 887998 908663 899155 901138 899585 887106 894595 967764 1027963 1032333 1032926
19258 1032926 1020290 1044526 1044785 1095959 1061074 1042816 1035838 1097998 1095338 1020312 1037506 1051432
19246 1051432 1048920 1052220 1123566 1156908 1134462 1145760 1125725 1133840 1157226 1118005 1115581 1137356
19234 1137356 1172319 1285724 1280280 1240132 1229526 1330109 1322109 1259054 1257738 1362484 1406141
19223 1406141 1392670 1387398 1399239 1489471 1602569 1661075 1687511 1682983 1722721 1784215 1827309
19212 1827309 1850064 1893786 1904497 1867779 1837464 1853110 1913546 1946997 1944476 1965267 1934910
19201 1934910 1874485 1844357 1839336 1813255 1814939 1845592 1838461 1822545 1903772 1948384 1884779 1897945
19189 1897945 1940928 1903980 1862388 1852399 1855926 1949702 1972709 1943778 2009117 2041227 2082836 2139638
19177 2139638 2212306 2298567 2297497 2356796 2402152 2439111 2470509 2518768 2524406 2493270 2526230 2573116
19165 2573116 2604258 2619457 2683010 2731941 2823882 2879492 2900175 2909349 2969431 2949499 2984788
19154 2984788 3039634 3081897 3095553 3155244 3256426 3347961 3394619 3405306 3417103 3495832 3578930
19143 3578930 3654955 3700734 3783603 3912798 3925034 3884449 3884597 3916266 3983466 4076365 4163859
19132 4163859 4228474 4263901 4322708 4462271 4538966 4592768 4680411 4732267 4801891 4962790 5094495
19121 5094495 5176495 5297558 5411470 5436646 5485970 5554461 5654412 5751083 5817124 5952867 6086137
19110 6086137 6193071 6292026 6400687 6532220 6674670 6814781 6957371 7039642 7163465 7265083
19100 7265083 7339485 7530158 7676243 7765980 7918689 8144484 8299579 8450968 8577484 8709977
19090 8709977 8815671 8972879 9221987 9478316 9643650 9812339 10024458 10098533 10243255 10431094
19080 10431094 10664511 10899217 11153621 11426090 11667995 11926031 12158057 12303886 12461132
19071 12461132 12661070 12957450 13226953 13400978 13543252 13740290 13943780 14103677 14288309
19062 14288309 14482811 14680609 14898895 15118506 15354388 15587260 15829239 16016559 16243376
19053 16243376 16406598 16535535 16702019 16874727 16998335 17147087 17277575 17396245 17501725
19044 17501725 17630411 17797086 17866253 17886071 17891639 17907888 17921482 17979018 18027301 18018914 18016390
19033 18016390 18034807 18035133 17967207 17861311 17784758 17734655 17684239 17544806 17477057 17382198 17263103
19022 17263103 17187764 17079146 16938601 16838844 16695189 16416291 16210468 15978734 15837278 15648130
19012 15648130 15396557 15162972 14991916 14743408 14511734 14280264 14055044 13853687 13662593
19003 13662593 13465006 13282433 13104993 12895660 12662919 12418462 12107865 11859901 11699951
18994 11699951 11518635 11344728 11094176 10870695 10677648 10475634 10351269 10156898 9953433
18985 9953433 9763349 9541669 9341876 9164800 9018786 8903381 8790490 8626912 8486640
18976 8486640 8295214 8134829 7977423 7868827 7698820 7523993 7365694 7227758 7095511
18967 7095511 6973620 6867245 6807568 6732204 6617575 6499563 6409299 6317181 6220358 6153041
18957 6153041 6045769 5895534 5777649 5744669 5660289 5549368 5388790 5283474 5227523 5171378
18947 5171378 5053299 4965208 4876295 4774688 4727983 4623245 4484121 4418929 4368886 4320626
18937 4320626 4258849 4198654 4120674 4066754 4016417 3928655 3798163 3726183 3696964 3733518 3716379
18926 3716379 3630632 3527956 3486249 3403993 3386381 3382562 3337894 3235993 3172045 3206302 3144082
18915 3144082 3090480 3091692 3120610 3043466 3026323 2990281 2980174 2947527 2902465 2901992 2847493 2770516
18903 2770516 2722296 2652725 2521861 2488441 2467122 2472546 2442047 2500106 2534611 2522983 2494727
18892 2494727 2460278 2386221 2361082 2400978 2369256 2343625 2356558 2383919 2431019 2467123 2496047
18881 2496047 2475019 2421380 2395178 2461387 2491251 2513766 2573629 2704323 2872000 3015929 3191227
18870 3191227 3493195 3940641 4554983 5472192 7060481 9486595 12465573 14863642 15695483
18861 15695483 15148860 13958639 12636852 11771198 11829535 12983337 14987198 16602167 16440143
18852 16440143 14858052 12675580 10237379 7975144 6404238 5357558 4641328 4182601
18844 4182601 3789682 3523807 3365989 3258648 3191049 3100882 3025848 2976047 2968879 3046194 3122930
18833 3122930 3206530 3266920 3353744 3413644 3540073 3696646 3976230 4366830 4966112 5842017
18823 5842017 7209039 9321405 12436167 16143451 19052265 20061827 19675534 18770587
18815 18770587 18046281 18437777 20697128 25149758 30934801 35387375 36221997 33920802
18807 33920802 30018810 25683471 22215295 20741194 21341514 23393307 25158720 24777606
18799 24777606 22289349 18858233 15129238 11784955 9364420 7680033 6519994 5695818
18791 5695818 5072536 4670075 4336858 4036299 3806434 3711040 3579016 3476092 3388702 3305909
18781 3305909 3211632 3202490 3248144 3307977 3414760 3587885 3782898 4162086 4708861 5483831
18771 5483831 6704929 8570942 11510423 15855374 21037397 25038967 26061449 24774400
18763 24774400 22406371 19865819 18260071 18371835 20290208 23375734 25600210 25233968
18755 25233968 22653711 18954105 14857020 11256352 8526565 6674814 5499992 4656540
18747 4656540 4039120 3569327 3193211 2828708 2612976 2391276 2161495 2023210 1902132
18738 1902132 1855427 1814757 1751555 1587838 1515616 1490228 1469895 1438115 1459160 1445063 1294411
18727 1294411 1209570 1181714 1121030 1059841 1056028 1009081 1014225 986720 959039 958986 933839 836865
18715 836865 815604 774283 732337 701926 737811 755266 759407 752604 715631 651314 552845 506343
18703 506343 496206 486305 516720 550907 586644 622227 656137 597159 562347 489096 462057 473864
18691 473864 438467 403996 420697 468159 505244 516755 475998 396420 436883 457238 501201
18680 501201 478136 441852 429859 450828 382077 366642 370437 417434 501381 508170 448137 430555
18668 430555 448982 479427 508231 487079 485639 453162 404527 359101 339279 378669 439768 480645
18656 480645 456646 399506 386042 343575 306448 293579 332255 354941 404812 400146 380151 339697
18644 339697 266633 263050 254802 233762 190371 217180 290790 331655 364208 363649 388192 429857
18632 429857 385721 336014 392575 474252 489805 451590 485876 444122 437386 476649 426205 440469
18620 440469 514570 517072 442598 393603 389551 405917 406210 377178 449386 449150 419924 464904 505155
18607 505155 468365 448839 511759 506517 500188 515237 549793 520798 444628 452100 431590 493862
18595 493862 546377 573379 670743 667885 704379 760757 792368 837134 874326 945295 963067 981898
18583 981898 1088744 1218706 1310715 1420359 1520766 1557638 1659439 1763826 1951101 2212740
18573 2212740 2433291 2737859 3229986 3972227 4921659 6224413 8114519 11026974 15331416
18564 15331416 20950833 26766557 31701021 35770905 38880535 40140487 39983281 40203351
18556 40203351 41776207 43769206 44835411 44944114 44311675 41620727 36333737 30015235
18548 30015235 23880545 18282919 13799369 10617913 8480393 7049078 6048057 5254508
18540 5254508 4680263 4192666 3840954 3588663 3414957 3237341 3030691 2880192 2752595
18531 2752595 2615121 2484287 2358181 2391389 2426518 2379560 2400950 2452398 2447709 2509828 2546002
18520 2546002 2616313 2717008 2951862 3365576 3942689 4758115 6026445 8107007 11306026
18511 11306026 15559953 20004253 23705921 26810313 29301343 30208317 29419615 28575501
18503 28575501 28597800 28945759 29076670 29003241 28605455 26959437 23654365 19626614 15655866
18494 15655866 12072234 9147950 7035486 5626666 4653385 3992765 3471789 3065717 2719996
18485 2719996 2432581 2184297 2018633 1921709 1774820 1699739 1584072 1497143 1382514 1248485
18475 1248485 1082335 1021695 947636 898112 808537 760997 735552 714335 749113 723335 669710
18464 669710 627861 576701 566519 600176 554382 481615 453627 424735 427520 436308 398025 351190
18452 351190 355697 383573 402243 357358 314227 304977 294793 315571 309998 274458 296541 295439
18440 295439 266054 275064 290431 261011 283419 331983 262830 216684 220566 240268 234440 204968
18428 204968 174720 142037 137830 199220 202924 197313 311478 294472 223828 233106 224196 195956
18416 195956 174733 116434 146052 186543 200658 199816 230212 272207 263823 251375 173022 195229
18404 195229 228625 274233 278824 291710 280802 288478 249131 213405 209930 208627 228023 303356
18392 303356 323976 279448 212414 157193 189716 282743 294901 272149 226590 237998 250209
18381 250209 239724 230179 234308 277407 247622 233897 233858 222388 269578 333379 307358 280796
18369 280796 281938 334035 378911 407153 416210 374022 354171 316718 419964 460391 403012 433000
18357 433000 483580 589797 651760 675309 725603 717922 686031 646115 681153 711922 751409
18346 751409 830568 862736 915130 1006433 1067525 1117175 1242172 1357711 1502977 1724971 1987401
18335 1987401 2314803 2739470 3379096 4343820 5861040 8038851 11206935 15298531 19240353
18326 19240353 21361848 21226255 19787239 17948707 16608673 16707907 18543824 20991703
18318 20991703 22090402 20987526 18352873 15018047 11698261 9082113 7210627 5881401
18310 5881401 4940886 4302106 3830228 3470458 3232936 3080556 2982915 2909944 2855531 2794446
18300 2794446 2722830 2696579 2799118 2873719 2901529 2908124 2994247 3115895 3327725 3675990 4117055
18289 4117055 4621094 5473398 6820003 8888862 12009914 16024064 19849619 21813742
18281 21813742 21941993 21407622 20992536 21809038 24809127 29826644 34749094 36813483 35377907
18272 35377907 31915373 27670889 24081792 22344527 22647491 23731970 23598239 21707950
18264 21707950 18805454 15394006 12035379 9368184 7534203 6317738 5458400 4874088
18256 4874088 4396588 3953501 3619888 3370693 3157494 3029244 2962235 2843165 2789816 2673284
18246 2673284 2614163 2510763 2461044 2401975 2409556 2484147 2711494 2946960 3265936 3777941
18236 3777941 4515515 5743632 7543668 10272937 13852696 16874082 17921963 17159003
18228 17159003 15606737 13847917 12806493 13260363 14948035 16804077 17155754 15840695
18220 15840695 13543526 10896657 8274317 6227136 4763117 3706973 2991124 2478173
18212 2478173 2088331 1841581 1617961 1444662 1328145 1202636 1084536 1018110 1006276 980868
18202 980868 906572 802056 767899 720791 655592 645518 602302 547493 544379 534505 555939 510293
18190 510293 476852 478280 451129 407818 399454 471602 472306 444956 366417 311379 227155 188084
18178 188084 180904 173097 140463 167527 229791 220907 168979 231028 275187 256476 259770 232827
18166 232827 234543 228398 211119 162207 132073 153969 129618 123314 95564 52985 32101 66128
18154 66128 57063 26378 29585 42152 46068 75100 148298 144678 99462 78127 68928 79586 48485
18141 48485 25926 75124 45765 32956 88528 134427 116254 86323 101874 157999 189086 161172
18129 161172 138127 132632 117730 126260 118803 105462 76292 117263 140447 109911 86239 83206
18117 83206 88116 47793 16070 5236 -1045 -496 14636 32216 71874 88883 74034 72388 79194
18104 79194 10705 -8722 36546 46735 -2823 -54153 -15002 -2881 28891 42379 69410 45089
18092 45089 51079 114185 143163 96278 47072 29111 33290 80284 101845 66526 35319 64880
18080 64880 83547 90381 65613 38158 -1518 101041 211438 145448 102635 38872 68873
18069 68873 95719 32357 4378 35935 82175 92305 51672 67815 98600 85817 76285 66905
18057 66905 34566 66909 -10382 38509 119585 152351 157681 138768 56516 11238 69593 107510
18045 107510 163984 175098 154435 141984 202382 194338 187781 142792 121675 114437 91633 75406
18033 75406 55453 108023 81413 56472 111963 124560 102722 26487 3030 11799 59645 106828
18021 106828 128029 146891 154635 84245 -881 -20209 -14649 7490 20647 45625 108354 170564
18009 170564 104094 121228 115864 143749 167143 149968 153157 89783 59578 60079 80708 90192
17997 90192 60183 78835 64987 42767 82862 127628 160015 148274 188142 159154 111075 129378
17985 129378 137943 123596 160840 132042 110975 95012 124757 92029 70025 49277 36937 59387
17973 59387 91325 46818 3945 20522 54744 62386 81216 65659 7431 27289 80856 109442
17961 109442 92397 57304 -68046 -126398 -100539 -95325 -19744 -35083 -9080 65363 78214
17950 78214 88589 102425 92684 44824 53540 -2667 -88809 -75223 -68173 -33441 35349 70032
17938 70032 59865 35797 -8071 -47585 -84504 -69770 -51727 -47408 -30956 12636 68443 65891
17926 65891 -7145 24495 15881 -48983 -24310 15294 18070 28700 46944 55886 61779 85872
17914 85872 104954 116107 95210 54454 -20245 -26897 20211 40580 23903 37645 37474 72115
17902 72115 23304 -692 -16912 13598 7004 -13715 -1439 34589 88064 112310 98898 17762
17890 17762 -42781 -29364 -38390 38246 73268 25987 7986 42210 -3820 -47716 -21256 33732
17878 33732 38242 15616 60821 92030 35301 26704 23896 4356 54854 4490 -27202 -28112 -31890
17865 -31890 -27827 -32010 19854 50071 50850 40566 38582 60255 59448 41551 11269 -9659 37719
17852 37719 131053 177083 113685 107134 95636 118350 98945 59325 106165 83609 34727 59470
17840 59470 100211 78275 48321 35572 148198 191909 150149 143143 132814 93170 70689 80801
17828 80801 42255 -2086 -17268 -52426 51294 172523 142287 86440 99251 91993 45704
17817 45704 -51954 -80297 -7557 63925 104318 75018 65584 104386 151900 234985 198018 160117
17805 160117 117211 101185 69982 45531 49721 82422 130137 152603 128885 41183 54699 155535
17793 155535 137683 92230 95256 64721 24507 40997 30598 32757 44057 -6717 -33099 23239
17781 23239 5935 -9565 340 -28025 -21457 8400 67158 53198 100601 96723 48217 7729
17769 7729 34776 61896 120907 111320 132630 159081 204303 160048 141307 135518 167707 196146
17757 196146 91960 64279 118764 142467 107022 137757 114447 111848 99381 70274 -131
17746 -131 -11577 -21995 -66929 -33467 -27899 -46990 -426 61447 39581 51349 34037 71525
17734 71525 89226 54341 -8413 -44604 6056 -24215 -27464 -44100 -62813 -22354 23996 90786
17722 90786 121745 132784 69266 -3112 12687 70700 56246 68366 59655 -10819 1404 31259
17710 31259 51667 49071 89247 123811 73383 65095 45016 14512 24921 -18381 -64803 -102401
17698 -102401 -142373 -116436 -102064 -33221 -63642 -50075 11056 -20102 -47511 -56813 -42959 16775
17686 16775 35464 7837 -69995 -98291 -64674 -101665 -89033 -71639 -27397 -7259 21469 3609
17674 3609 35194 3678 25569 -21658 -28638 -4010 3918 -22785 24677 27931 26298 1955 -34996
17661 -34996 -40834 -88820 -107856 -60271 -12643 -69678 -31898 8527 55624 -849 -46489 -46808
17649 -46808 -46669 -4027 53472 68653 25904 -9252 11047 31405 31748 80084 52457 29102
17637 29102 38643 1283 8655 5869 -7825 -10881 2137 -4827 13513 -428 5795 14359 -46119
17624 -46119 24252 87438 34827 46402 105593 124343 75100 62702 91862 76596 37369 -1079
17612 -1079 37133 3746 -71821 -72852 -21422 88723 45617 -46084 -139535 -166461 -119861 -100309
17600 -100309 -116970 -88072 -108140 -126030 -111973 -57658 -54530 -24480 -66108 -68826 16780 37319
17588 37319 17614 -76 -41237 -32121 -61555 -77404 -35936 29414 3735 -37998 -7550 95768
17576 95768 105072 -19230 -61567 -61569 11245 63512 18973 76250 94085 106563 105648 21893 -70820
17563 -70820 -59950 -1301 -38431 -19307 3069 -29128 -25462 -21235 -10168 -5718 -53048 -41333
17551 -41333 -56472 -28951 3933 78580 110497 57855 24364 66445 55096 46413 46326 39525 25225
17538 25225 104642 104193 42734 18842 -8350 21992 -29128 -77578 -56819 -37763 -90199 -86740
17526 -86740 -76487 -54971 -14044 15929 7356 -1723 -87494 -124064 -103048 -66284 10302 12578
17514 12578 -45475 -76135 -81647 -80642 -77088 -40956 -23393 41899 4576 -26460 -40627 -13525
17502 -13525 -15017 34824 31599 -42572 9638 41985 139771 126418 48496 7525 -7189 33835
17490 33835 30563 33866 71085 72354 106898 57648 -18027 -38104 -77885 -62320 6104 52901
17478 52901 39672 112492 105656 62573 86784 116976 106479 25654 -22093 -7683 -2831 19956
17466 19956 108191 114467 106023 76540 36543 -17452 -33646 7838 106244 109971 78397 45184
17454 45184 15977 28652 -175 -46271 -57728 -62245 -80575 -100916 -71710 -37021 -43417 -85420
17442 -85420 -61997 -127358 -199356 -154786 -122674 -87032 -45927 -24008 -76232 -91725 -116608 -47388
17430 -47388 268 25208 19793 34120 42270 39536 39445 33271 45154 85491 84070 65073 37105
17417 37105 -8713 -87189 -113229 -64761 -20226 -24285 10921 39466 12118 27569 19956 32294
17405 32294 8441 -23041 38779 66330 32364 8036 10120 -2294 2070 -33900 -59152 -79061
17393 -79061 -56189 -503 -32203 -61342 41115 79069 48355 31276 40646 79309 63074 20726
17381 20726 -46063 -103885 -80997 -129597 -146452 -149761 -132713 -57772 29730 56638 16461 -4353
17369 -4353 31693 19768 -19850 -85095 -7315 11755 -40051 -5240 37354 11564 -23615 -24380
17357 -24380 -97554 -107441 -56080 -3484 -1549 2588 -19933 -20068 -43605 -33536 1895 -15026 -79486
17344 -79486 -90324 -62795 -42880 2391 67766 48875 21774 -21384 -13709 11733 86796 97426
17332 97426 27225 1764 1063 -28741 -72468 -16384 60864 36536 -14892 -17273 -23194 7791
17320 7791 50901 33778 1090 -40580 -29749 18997 31494 3148 -6435 34772 66326 48362
17308 48362 50603 84902 97064 120438 108126 128567 117022 86756 58517 75807 42734 16796
17296 16796 1252 29728 53058 40840 -27342 -55273 3348 60062 79129 83367 109681 104211
17284 104211 37008 -26740 -47921 -102654 -120685 -32806 21446 36431 48236 29079 -3708
17273 -3708 8000 46262 47129 56797 69384 42822 36223 34033 -15060 -40058 25545 53527 13624
17260 13624 -76693 -56220 -24643 4673 -3351 -77356 -68140 -54864 -59848 2842 61458 91379
17248 91379 121748 41163 -20493 -1387 80009 97085 44060 -10754 -68090 -64528 -35327 -45987
17236 -45987 -41212 -6761 -10600 32659 38964 50996 38680 28147 14308 -15680 -19516 10723
17224 10723 -49004 -68476 5534 14349 -5996 13745 -708 -11755 5771 7656 6156 33798
17212 33798 11324 -43007 48664 51677 -6573 7018 26221 -4302 -53630 -17221 -41906 -57177
17200 -57177 -93710 -87245 -52959 -60303 -74640 -81157 -93821 -74899 -32531 7238 12321 25921
17188 25921 39151 10682 -45317 -57194 -44904 -29214 -63245 -40602 -57032 -54922 -58693 -11879
17176 -11879 10008 -26264 -50541 17004 22151 -15140 -65744 -77870 -35347 314 4102 9621
17164 9621 2022 23409 24827 -9272 -39728 -41606 -10649 28470 46238 10931 585 -8896 -47094
17151 -47094 -153960 -113706 -39339 -59269 -88459 -68830 -56553 -31563 -25666 -72345 -68582 -84269
17139 -84269 -133827 -153272 -117053 -40250 63553 101596 53755 4925 -58690 -107170 -23388
17128 -23388 29201 14454 -11777 -3586 -70510 -73956 -62859 -26234 -2967 -58852 -65577 -44992
17116 -44992 -37466 15002 51257 91340 115726 73073 19428 -18343 -45510 -99258 -131724 -94484
17104 -94484 -29774 17625 -7630 -18457 -32021 -62759 -4420 -7079 -27202 20338 4652 41936
17092 41936 22559 38719 88513 95096 53207 28077 -2465 65202 92102 82932 65081 50423
17080 50423 38878 39667 38428 47798 4304 14690 -26262 -79745 -114095 -80848 -8191 26415
17068 26415 44368 68100 68696 56275 92554 67064 64879 107096 94402 19669 31840 47071
17056 47071 12865 -11845 -43728 -63874 -93866 -123557 -98067 -40485 -27929 29367 54801 44836
17044 44836 -11911 -19764 -35915 -63221 -81716 -76657 -27772 -6798 7461 28127 72503 84842
17032 84842 70327 67835 91345 134987 103165 -6035 -65490 -63470 -8808 102801 85521 54875
17020 54875 20146 -18436 -15086 -20693 37149 69459 24518 -16943 -12738 -15404 -57312 -38850
17008 -38850 29138 55361 50653 5061 -9479 -37928 -48839 -50292 -24228 -15763 -3175 -24777
16996 -24777 -81974 -113676 -92439 -64588 -61531 -92008 -85688 -105262 -66467 -55337 -32317 1450
16984 1450 1515 24084 18842 -1028 65159 93835 82433 107500 32814 -43296 -4584 -9332 -44894
16971 -44894 -80653 -65224 -83098 -88720 -116698 -71034 -43297 -67687 -105575 -62868 -33884 -29253
16959 -29253 -10446 -5100 -24266 -45246 -71199 11722 36056 14837 8505 -25190 -64447 -79525
16947 -79525 -15867 -36122 -26957 -52828 -83428 -60809 -28446 -48705 -39394 4393 24278 72476
16935 72476 61380 121 -2406 14281 39915 -41970 -89248 -73018 -49785 -17426 1859 -8344
16923 -8344 -37689 -57376 -71888 -57616 -67551 -88138 -71400 -54662 -21821 40294 65944 61849
16911 61849 68700 28143 26997 53458 30671 1207 -42365 -48355 -33853 -38686 -45077 13360 44495
16898 44495 -35075 -97575 -78237 13092 49714 75333 44646 -31721 -21388 13405 21797 -1799
16886 -1799 -3118 -20364 -41786 -21325 31121 42019 -24215 -24078 -18562 -6667 9965 73334 68571
16873 68571 8821 -23708 -252 12857 27662 21614 -25053 -82026 -19396 -24490 -4868 57424
16861 57424 76377 23885 -29946 -47979 -29503 3491 23320 -42237 -90927 -69634 -77306 -35898
16849 -35898 -458 -21536 30949 75670 60956 86860 134803 66292 6722 1773 -43735 -63778
16837 -63778 -77946 -18137 -49049 -58528 -42471 -12526 -39327 -57241 -82299 -97232 -136594 -122274
16825 -122274 -100298 -67079 -59985 -68784 -76664 -55041 -25066 -26432 10678 36841 55391 19345
16813 19345 31637 576 -26129 2585 -18789 -43618 -8695 53493 71863 63761 71412 67646
16801 67646 73099 28008 18136 -26114 -12542 -73032 -137633 -97267 -49473 -23237 20040 12475
16789 12475 11464 3155 47367 55574 54407 43724 49007 18744 -1157 20109 77494 69219 67580
16776 67580 -442 19507 93469 93376 51829 48596 35376 6593 -23992 -55319 -90917 -100780 -99435
16763 -99435 -83668 -70329 -49922 -9223 -8049 -18685 6552 -571 11533 -3770 5077 15419
16751 15419 3830 8241 -55461 -38934 14247 37853 -19470 -79200 -80911 -22028 -57383 -68283
16739 -68283 -62493 7433 47780 -1380 1989 -29103 20261 -12175 -5086 92017 122563 44563
16727 44563 -48456 -70896 -58639 -3797 41566 5156 -12059 14076 9928 32190 25062 9192
16715 9192 32661 -29648 -87053 -113528 -79004 -24390 -26626 -17011 15923 22571 4193 38247
16703 38247 46168 5771 41601 -15745 -39307 -62178 -35277 -87843 -90441 -8283 17264 16705
16691 16705 26906 107811 142070 99633 37487 22334 47954 99723 31535 -57381 -122033 -90454
16679 -90454 -57037 -58937 -78326 -91780 -13333 6539 5162 30301 52852 8694 7861 36230
16667 36230 25618 25068 53585 57772 27986 18386 -32007 -53318 10507 76700 79671 68940 42371
16654 42371 57794 88341 23113 -70112 -97886 -106215 -114452 -107867 -81447 -17336 30495 -20256
16642 -20256 3433 22652 -24623 -10864 -992 14002 33639 16841 -103792 -100710 -121013 -155765
16630 -155765 -143543 -92755 -57061 -20491 -20777 -22501 36380 -11454 -98838 -107091 -71104 -112585
16618 -112585 -163239 -89027 -2390 -31432 -73155 -107954 -42917 35630 30884 -50723 -66376 -16065
16606 -16065 1171 -42350 -31101 26320 29123 -30256 -48940 -51531 -82332 -82759 -11203 -33634
16594 -33634 -54858 -58744 14359 80319 59183 92676 79815 23170 6327 -26827 -25791 -4737
16582 -4737 17669 -31827 -53958 -82412 -81146 -28955 10731 38557 7760 51782 55486 -22784
16570 -22784 -71204 -57644 24983 99733 79534 52093 52598 87198 64145 16675 13538 29311
16558 29311 5963 -7027 68685 139024 125180 59147 13290 -18202 -16741 -28580 -24852 -11798
16546 -11798 -4792 18701 7831 7818 -24747 -26659 -14387 -28181 -47284 -128940 -92143 -30203 -23349
16533 -23349 11400 52660 60194 -10747 -78312 -127473 -42313 50166 55746 10656 -32660 -70354
16521 -70354 -52286 -25617 -9205 -18038 -4870 9737 -33767 -108949 -140900 -39826 98408
16510 98408 101299 115537 115688 52495 -22713 -103399 -48826 -58607 -36758 -4381 -53474 -70836
16498 -70836 -83858 -66956 -40397 -16533 3386 13763 53929 116326 53347 -43780 -71017 -71277
16486 -71277 -71080 -56288 -60407 -17004 -16140 28497 82798 69031 11358 13345 -20306 -67068 -20420
16473 -20420 26602 70359 -1247 -30765 -54868 -7331 64145 74158 65909 37894 29306 45419
16461 45419 23279 45405 82074 65967 32542 -18682 -5416 3974 -8581 22708 89561 96198
16449 96198 66646 29721 5682 8065 46347 86324 94320 84306 76698 31521 -7983 -55191
16437 -55191 -30422 31473 21831 -54385 -69476 -50043 -78398 -33063 -53796 -57773 -114166 -96740
16425 -96740 -52172 -59454 -42787 -61151 -58100 -62395 -67480 -48517 -29259 12832 68103 3203
16413 3203 -45132 -60586 -30718 7794 13950 -42046 -31225 -53398 -29392 16834 52777 34171
16401 34171 -6298 -12482 982 13849 9575 30350 116448 94321 43319 -20971 -76086 -86530
16389 -86530 -71950 -66008 -34690 8830 28627 -54523 -46122 -76885 -77544 2011 12474 8357 26672
16376 26672 50580 36495 -3701 21653 4680 20872 6500 -78679 -74107 -48920 7805 -2130
16364 -2130 18686 -10207 24646 24847 -36324 -4358 -20557 -28687 -11060 -11193 -12129 -26929 -102772
16351 -102772 -96700 -67335 -13821 58549 113401 19337 -46342 -49261 60938 117847 88296 47946
16339 47946 41175 90505 128437 74192 40344 73950 28093 -10171 23689 53595 8762 -20770
16327 -20770 -16232 -6303 -2696 21957 -3300 2820 -27463 -108308 -88538 1091 54255 101724
16315 101724 175798 187269 73127 23628 -22267 -68041 -82614 -71237 -30277 34248 32969
16304 32969 40358 26246 -7052 -9975 4176 24332 35608 74206 106899 64145 42002 15463
16292 15463 -18051 576 64914 73467 68017 24621 643 -30233 -50095 9457 45377 80864
16280 80864 68056 23375 17724 -3132 -6713 2348 6743 -8655 -4328 -10759 -32792 -73981 -59073
16267 -59073 19093 39325 -60283 -49555 -45866 -94828 -95234 -57806 -26661 -43294 -34578 -46750
16255 -46750 -913 20138 -52132 -113374 -62010 -20138 -51194 -53733 -30617 2969 14147 -13059
16243 -13059 -14058 1339 4806 12996 20051 -6215 -39720 12755 40797 16684 -91826 -63878
16231 -63878 -1804 2675 -23467 -10062 -21165 -43556 -17867 -10393 -16284 -10067 -18454 -3429 -64236
16218 -64236 -129906 -138161 -107491 -34454 16399 11399 51110 71783 89409 50667 -817 -546
16206 -546 -55940 -52798 5489 29857 49123 34186 26561 -19626 -39591 -49518 -32486 35287 11100
16193 11100 -24299 -5536 16033 7559 36562 29691 -40161 -47669 -5414 -1617 -24427 92
16181 92 -22156 -9939 -63297 -93781 3876 67360 36816 35403 18549 56559 17073 -7036
16169 -7036 10277 20057 16579 -59413 -86912 -140771 -133883 -95876 -126719 -133920 -113324 -76225 -61991
16156 -61991 -41946 -35415 -17560 50988 39896 -40097 -71530 -69151 -78552 -48766 -74492 -54175
16144 -54175 -7569 21290 26976 44911 -10994 22117 33831 19813 15107 11698 6778 -31649
16132 -31649 -104528 -71985 -62438 -46352 -73992 -92940 -97608 -75015 -9855 -22683 -50143 187
16120 187 -16986 -14640 -10657 -58733 -98433 -53034 -23380 -45857 -101596 -40192 -417 5132 26639
16107 26639 34381 53663 25328 -7333 -1836 31027 58179 62491 12565 -47608 -9258 -31008
16095 -31008 -38312 -65771 -54368 -27082 -83850 -60807 -19072 -33671 8335 52810 30147 -40818
16083 -40818 -14307 60332 43636 9481 18951 34018 30264 51074 58444 58943 38299 -3440 -31344
16070 -31344 5919 -15831 -61652 -68208 -100442 -39488 36943 -5108 -77494 -95996 -108405 -125275
16058 -125275 -88194 -62474 18026 -1651 -123178 -119298 -78853 -42510 -41884 -30568 -75352 -68669
16046 -68669 -21574 -52339 -52149 -7544 -11643 -60488 -17092 -5446 -46107 -132171 -126252 -83452
16034 -83452 -60741 -61394 -37669 -32123 -16693 -39861 -56976 -75510 -82696 -54257 14619 49205
16022 49205 55475 64200 14454 -48238 -69025 -72513 -17617 -39565 -97774 -43850 17153 39847
16010 39847 59141 70856 27116 10279 -32713 -46700 12646 49553 42288 96679 66210 70988
15998 70988 46113 4901 -41033 -26831 -37166 -39956 -25603 -35572 -103404 -92955 -102483 -97999
15986 -97999 -63439 -92046 -130656 -80377 -71597 -53491 -1629 5610 7198 -25187 -12811 -17083
15974 -17083 -64951 -116445 -127976 -134731 -90034 -96345 -48208 -1044 40658 16940 -33484 -4215
15962 -4215 22195 38415 35784 7221 -25799 -38862 -27648 -27852 -48826 -32060 21553 45709
15950 45709 23822 10908 36218 -7943 -62231 -51792 -75773 -35748 -19213 -38801 -47218 -42948
15938 -42948 -80455 -57067 20106 59895 13197 -14232 -15053 27746 -10112 -30840 -61017 -3664
15926 -3664 38536 20329 -9337 -58895 -81319 -110326 -94769 -31549 21263 62459 47388 11416
15914 11416 -6290 2985 -5720 -55700 -106098 -84943 -31548 2341 10245 35780 22690 -28100
15902 -28100 -55413 -93204 -61455 -17518 15773 45827 37976 34289 48858 61340 50392 -12119
15890 -12119 -41142 -30685 -6104 8154 66366 86487 1948 -19122 19160 -21296 -60066 -89123
15878 -89123 -104361 -52615 17134 41281 60116 87473 8936 7536 77382 20781 -60397 -69679
15866 -69679 -121384 -106894 -56679 -56223 -30999 4936 -6657 24536 36670 47761 61743 53683
15854 53683 99475 116544 47490 -8036 -10225 -88800 -77779 -31277 -21089 9358 -11995 -3040
15842 -3040 -5932 -20177 10487 75366 76410 104742 144020 61691 -6601 41751 28304 23985
15830 23985 16065 -39635 -24256 23219 14592 -28846 -8200 15616 81562 130466 121321 87208
15818 87208 65710 89021 107941 99957 85056 68934 22257 -4008 19477 -9920 -21304 3715
15806 3715 19969 -3820 -31681 -31746 -56388 -28981 -33944 -22444 -11971 -50362 -67789 -57502 -46506
15793 -46506 -11570 -8987 34132 19498 32459 12014 2582 -107451 -185728 -173421 -109009 -48579
15781 -48579 -25497 28965 38989 73131 26333 -23257 -101419 -104045 -33999 6168 -8169 -2543
15769 -2543 -31819 -30312 -43082 -69295 -52536 -59831 14104 90293 127108 141686 64514 22990
15757 22990 32028 52666 80698 57286 -10278 8094 -33014 -103076 -100623 -98138 -25094 20742
15745 20742 5608 -76746 -112214 -83602 -68744 -76578 -111801 -79663 -31208 -42652 -74972 -104705
15733 -104705 -70984 -23124 -48379 -53375 -1904 5040 10797 31127 18515 -44215 -58635 -7111
15721 -7111 45517 1066 -33428 -52936 -30539 23415 42085 13018 -54085 -95226 -115649 -43615
15709 -43615 25524 -33601 -90050 -100993 -77900 -95427 -123877 -120589 -85935 -37998 2351 13110
15697 13110 53977 65286 83735 54631 39240 63550 50129 -3816 25075 101874 104805 87945
15685 87945 116032 101871 94362 65785 15923 -47798 -59551 -15453 13045 63510 67668 60109
15673 60109 10770 -30224 10105 14919 53761 13624 11965 18585 8633 -10336 -110043 -162992
15661 -162992 -117822 -66822 -51233 -6161 40918 106499 98765 117958 140798 134088 68294 101523
15649 101523 103010 72322 43124 -20507 3263 -16282 -22007 36632 29100 -2894 8427 -48593
15637 -48593 -32560 -56349 -31412 -5193 -47515 12305 19908 46785 91262 47669 2587 13884
15625 13884 34906 55007 -5445 -30866 827 22764 -1808 -8748 21043 3052 -19076 -36328
15613 -36328 -75106 -88023 -95021 -52081 -17249 19918 -10874 -66325 13188 -2306 -52769 -13809
15601 -13809 -16793 -4641 25473 -2700 -38489 -74558 -83463 -79586 -35413 -27363 -4793 -11185 -43692
15588 -43692 -29442 -28819 -5542 15074 18358 3942 49663 76952 35255 63772 72927 74521 5344
15575 5344 -28418 -5903 -47893 -60956 17827 62800 21935 -33428 -53671 -53918 30946 87233
15563 87233 88641 62763 34900 -10574 -3856 -57084 -63451 -106117 -124264 -86989 -21794 -51961
15551 -51961 -53725 -63173 6248 66167 -2005 -49226 -105434 -58799 -43007 20433 -14317 -61839
15539 -61839 -32209 9492 41657 16536 -880 1294 -57051 -74518 -45689 23589 44622 12613
15527 12613 14459 70298 43149 -41941 -35643 -48459 -45137 -14889 31697 34273 35149 65351 67760
15514 67760 22347 25985 10637 -37372 -56675 -38232 19297 70587 25520 19452 70796 106007
15502 106007 82204 108583 95963 29775 1219 5139 7239 -26264 -53480 -37817 16833 93874
15490 93874 79670 112634 80246 -18857 -22171 -15673 -5415 21352 52472 157205 146112 80286
15478 80286 23073 -12986 15995 22409 66970 20394 -53853 -114655 -144308 -173510 -110217 -20006
15466 -20006 36885 65633 61142 22148 -25666 -41642 5218 -1310 -42676 3009 34129 41465
15454 41465 55461 16996 -45603 599 38386 49848 31046 -39827 -18169 -6944 -8165 22214
15442 22214 49713 -10227 -15220 -2918 -4728 -63051 -92862 -40160 -47492 -37150 -18526 -32029
15430 -32029 -16378 18472 41558 17326 -50502 -91882 -23811 -7881 -46155 -37111 7448 -32619
15418 -32619 -56807 -65533 -49089 -33680 -53381 -17125 -24680 -71601 -19685 60947 39971 5371
15406 5371 -5287 44298 56431 98586 83543 67660 66158 57635 70592 69681 25759 8501 -10109
15393 -10109 24949 25248 8359 3936 39114 28706 19373 -1840 -6173 93425 106413 26157 1007
15380 1007 -11943 -30365 -37078 -22347 21230 31194 -15440 1660 35089 9516 85483 102571
15368 102571 96856 62122 25676 -19202 -93299 -139555 -120205 -61642 -25233 16376 18235 -24253
15356 -24253 -80682 -37444 -12189 -51693 -7119 29438 14347 14998 12356 5999 -26755 -6782
15344 -6782 29514 -7171 -69370 -60075 -30697 1609 -8563 10590 34336 -29163 -72654 -70253
15332 -70253 -18824 35211 -12919 -814 -23565 -53418 -76146 -71977 -80229 -54564 3504 20909
15320 20909 -10863 -13118 -68126 -97991 -35428 -42621 -84513 -61399 -31137 -7634 24580 5945
15308 5945 1101 10438 -31391 -32320 45788 12100 -27506 -71342 -111524 -64630 9900 5415 6503
15295 6503 2670 6018 -20111 4039 -16099 -11171 -28674 -20690 -7141 -7862 -15695 37228 63812
15282 63812 46326 13950 -65248 -92483 -4736 -33038 -67741 -36207 -25191 -28488 45236 21192
15270 21192 -9988 -31009 -25156 -54952 -20872 37191 23841 -5171 -37776 29715 99731 131339
15258 131339 139997 146980 128923 -4696 -60235 -230 -6561 -53601 -45096 -12575 -85971 -107080
15246 -107080 -62156 -39874 -48729 -51257 -13079 54292 66976 42060 2816 13033 19770 20475
15234 20475 8263 -32675 -35597 -27447 -13427 -9075 -28436 -31589 52637 86540 64765 70966 66052
15221 66052 36000 22079 -17664 -74893 -64222 -13246 42942 66366 30293 13573 -17472 69347
15209 69347 49435 -11192 -94703 -190714 -205097 -94239 -12912 7232 10570 197 18769 22261
15197 22261 -51625 -15054 45109 73100 92537 134548 104883 127155 118859 118139 80619 71544
15185 71544 79122 20810 -1857 -9602 52258 59960 4405 -19673 -81557 -127635 -58410 -59096 -35782
15172 -35782 37136 55446 12251 -26475 -64582 -54792 -44074 -13313 35123 35497 -35948 -44650
15160 -44650 -13886 6002 -27052 -17347 -24455 -1055 -9425 -15610 -30356 -46276 -58667 -69799
15148 -69799 -38889 28934 70434 103284 69168 -19113 -49353 -90836 -83243 -71062 -54119 -90
15136 -90 9987 66629 61775 -18698 -56838 -67555 -78060 13021 -908 -78457 -131785 -119024
15124 -119024 -73409 -39493 -10152 29662 71066 75730 46289 -30697 -9485 17697 41289 67001
15112 67001 98243 91072 15779 16549 45405 3946 882 19869 -13733 -33405 -41920 -30169 -52060
15099 -52060 -65126 -102348 -95790 -80908 -69296 -122677 -65630 14314 89805 76527 40087 44340
15087 44340 107630 102420 84321 56108 48896 22054 8852 32585 -15350 -9984 25411 45854
15075 45854 70055 55375 14354 -22323 -58946 -15605 -20688 -38235 -60179 -37093 4512 23957
15063 23957 23962 -11382 -84135 -76799 -27216 -37305 -42036 -38503 -35355 -10433 -61291 -75582 -17552
15050 -17552 64054 97625 23383 -36692 -34315 -33765 -47449 -37166 -21109 -28440 -79528 -53674
15038 -53674 -1076 -25378 -40584 -19485 -11306 -19943 -13104 -9335 -41458 -11282 24241 45361
15026 45361 2775 -50885 -79449 -76798 -85636 -132482 -76831 -18108 -2428 46983 1893 836
15014 836 20616 -4677 -33902 2734 10611 11006 11239 16677 -2849 -28746 -18362 5617 18275
15001 18275 28503 29445 -30182 -66767 -20473 6428 -9286 -66596 -84163 12789 19792 -45041
14989 -45041 -44988 -17219 -5616 -19632 -47048 -49270 -17069 -31565 -56920 -36535 -67885 -119842
14977 -119842 -123265 -168728 -189069 -107737 -69930 -155707 -208470 -103468 -26887 -27812 -47085 -32533
14965 -32533 -64647 -92421 -80124 -76928 -102375 -41876 -56588 -131277 -83073 -43942 -82456 -146777
14953 -146777 -124492 -110414 -139597 -109009 -56919 3710 43609 67073 58272 19767 -52172 -45183
14941 -45183 -12202 -42631 -2391 9851 -19430 26781 6774 -13464 -48834 -70383 -76252 -82510
14929 -82510 -71607 -53892 -891 -21994 -26365 12449 -6939 -72848 -113070 -144854 -170673 -143483
14917 -143483 -116971 -135206 -111752 -28138 23451 38024 36301 10013 -13669 -32977 -21865 -24009
14905 -24009 58221 63147 72348 59910 34607 32016 -3608 -16233 5290 -1807 -5366 16848 39713
14892 39713 54343 81821 59921 65327 54900 14516 10260 -34013 -70019 -28278 9821 -10146
14880 -10146 -57799 -19996 57520 84382 -7586 -55523 -76077 -30993 4007 -6471 -28268 15961
14868 15961 56032 2348 -33255 -45560 -31665 -20854 2017 76627 107371 84208 83606 79070
14856 79070 60044 58583 81839 70862 88837 155637 152122 128403 115366 43607 -5901 33632
14844 33632 16043 -25756 -72325 -40514 -8715 -11250 -34151 -9742 -11541 -37925 7772 -26555
14832 -26555 -49233 -42715 -54021 -70423 -39566 48874 17847 23064 34211 39585 28628 -5187
14820 -5187 -31447 29361 12119 -17153 -10522 15922 39880 45759 40005 23129 20921 -37678 -80003
14807 -80003 -70529 -64840 -58329 -56579 -64030 -102566 -57275 -27646 19965 39615 3498 54687 47916
14794 47916 -30023 -30736 -53924 -67005 -57716 -34909 21784 96348 82304 -17931 -35878 -17559
14782 -17559 -27387 -13887 14148 15487 34702 97622 42817 -40266 -66159 -65901 -54221 -15164
14770 -15164 43985 46883 11424 11741 -11482 -62658 -65027 -65538 -26655 15541 18862 19520 39897
14757 39897 15962 -16976 -65790 -35476 -634 35171 60913 78291 68443 94256 104293 79118
14745 79118 56714 39576 26546 33124 -32773 -70348 -20713 -2785 4679 -19011 205 35293
14733 35293 48354 31555 -2643 -80662 -54806 -89882 -75330 -35485 -11970 7690 24235 18767
14721 18767 -11323 49512 58328 32583 1966 -26596 -45906 -14129 36207 30315 37760 35031
14709 35031 69622 98037 62871 9160 -10043 -29579 27988 72079 75067 -1446 12789 24983
14697 24983 41331 21993 30134 38764 29370 24626 19281 -28669 -91731 -118580 -139401 -122850 -133197
14684 -133197 -84394 -94428 -89536 -12811 7308 -27257 -70629 -46138 -38488 -56551 -15631 32351
14672 32351 -25131 -37129 -31807 16034 -86 -8601 -56313 -21193 18949 487 -17449 7299
14660 7299 -31536 -37974 -12800 18962 46697 15524 16836 2690 -10156 -9905 -32549 -13802 -3430
14647 -3430 -11140 -13455 20495 -2507 18383 4291 -47878 -140127 -150787 -106783 -53227 -80162
14635 -80162 -93939 -163666 -114241 27270 45825 -27835 -56672 -15887 14216 -10491 -35737
14624 -35737 -121067 -138235 -34909 461 -5048 33586 89715 120147 60929 -10506 -21259 -36978
14612 -36978 11815 -1127 7400 42736 32520 -20745 -34804 -58666 -30333 -37825 -42113 -29762
14600 -29762 44564 72635 59423 36732 33525 46883 2013 -49862 -46384 -47912 -35356 8348
14588 8348 -2690 -6273 72099 74302 2072 20978 -7397 9244 -27944 -103175 -114034 -52816
14576 -52816 12625 13488 -20349 -2848 19534 20368 61656 33133 -4205 -44201 -38801 21347 8822
14563 8822 -30142 4169 4774 -49954 -19556 -3269 -23517 -12357 48738 107556 72028 9958
14551 9958 -77766 -114161 -86469 -78083 -48679 -1281 40340 127580 144817 96925 83301 37093
14539 37093 -17415 -57106 -43673 51107 7565 20853 47406 97714 82892 10587 -60577 -80874
14527 -80874 -70810 -14770 -20712 -65517 -29856 30773 40576 118664 123455 147677 126820 139248
14515 139248 93037 76567 85572 19697 -17747 -41226 -9813 23268 21977 -32408 5123 58984
14503 58984 66578 -8777 -47498 -10633 3109 32920 130051 105595 84088 35014 -62047 -67999
14491 -67999 32926 -4357 -66363 14 75579 38472 -29836 -39470 4140 -3137 -3582 -19185
14479 -19185 -51240 -100474 -80862 -64413 -53366 -32361 -33203 -76484 -47697 -85164 -100593 -112042
14467 -112042 -31376 8929 -25533 -33768 -4063 16276 -44795 -91656 -32922 -41674 -57686 -63712
14455 -63712 -101415 -105713 -54888 11126 26865 -6405 -44484 -74148 5400 85475 164275 131183
14443 131183 73935 61877 89786 54472 -27904 -77972 -93728 -38421 -10971 -51867 -86309
14432 -86309 -25411 -72847 -74980 -91459 -83376 -40023 296 -11911 -89941 -100674 -65637 -30261
14420 -30261 15664 18669 37747 53392 32904 35441 58355 91607 137930 126766 76467 46138
14408 46138 26556 -8631 -73693 -86522 -34624 -31788 -29996 -71581 -66384 -38094 -73957 -95442
14396 -95442 -74198 -61015 -65502 -95100 -44006 86799 63424 -13985 -24476 -44818 -42584 -19427
14384 -19427 4610 16370 39902 11697 -17184 -21633 -38013 -109873 -131230 -122036 -55486 -34210
14372 -34210 -34359 -33807 -69855 -58392 32004 83274 28197 -8543 18911 50334 32854 -30568
14360 -30568 -14270 -16876 1652 86125 75609 -42378 -78671 -73379 -32690 21034 21099 3273
14348 3273 -17222 27284 11543 -63864 -33123 1566 34422 -29286 -36293 74008 121794 114542
14336 114542 58705 2899 35655 67599 -17640 -69217 -93083 -67264 -68674 -19062 19228 61417
14324 61417 85998 67995 88837 55817 10323 -41486 -70241 -58462 -69427 -55323 -4322 -6780
14312 -6780 -17710 69 10797 -6103 12355 -38441 -50755 -18644 31875 31046 -1936 -17660
14300 -17660 -37481 12917 26369 -4479 -10466 7252 27022 118652 129172 60053 -13888 -54560
14288 -54560 -74719 -17905 39972 29752 18363 13142 -102180 -74230 31641 26383 -8436 3590
14276 3590 20535 5022 -54257 -118789 -87082 -115813 -114002 -74835 -45109 -22463 14344 508
14264 508 -38351 -67040 -33504 -4567 22142 10948 28434 -1954 -3439 -17759 16458 14874
14252 14874 -45649 -53867 -31395 -1154 21040 65360 105047 81480 25927 -52112 -72946 -33649
14240 -33649 -4200 -6039 -42906 -42127 -60510 23770 75404 14008 5094 28046 18480 -2724 -93376
14227 -93376 -135286 -184038 -181708 -122532 -105241 -117118 -64284 10875 -28250 -46579 -55114 -64249
14215 -64249 -8467 -16984 -73784 -89791 -103952 -84520 -69803 -44172 -56237 6647 -3716 -9834
14203 -9834 23525 14748 46164 133923 134809 53620 -13573 -103488 -100272 -18563 -12575 -28734 -962
14190 -962 15470 78576 60064 53125 779 -43256 -83243 -70213 17536 3541 -35381 -23335
14178 -23335 25670 72157 94105 84630 47293 41953 -20055 -7838 48059 -3380 -108650 -150438
14166 -150438 -117624 -84032 -80886 -90334 -14716 13554 -8848 25118 4899 11196 -15162 -50806
14154 -50806 -64769 18690 -8972 -44571 -56572 -92168 -70737 -40685 -54602 -66220 -36144 -7418
14142 -7418 2651 10366 -7138 25293 29697 15386 -83387 -52301 -4872 -11074 -19616 -32661 -43214
14129 -43214 -83500 -140584 -150505 -19974 98901 61584 -46637 -52729 -19728 -27698 -43930 -53963
14117 -53963 -60434 -50543 -56812 -71782 -42501 57088 39259 -1346 -74811 -97078 -55523 -62163
14105 -62163 -26973 47593 52558 -842 -99026 -143114 -129311 -77095 -43415 -23987 26014 110258
14093 110258 115595 135707 126133 35499 -73441 -79066 -16599 4058 -24694 623 39316 82882
14081 82882 153997 165554 138988 97959 88929 45751 22330 6103 23187 44437 -9618 -88172
14069 -88172 -47842 -36579 -729 64250 65967 47270 -41014 -97666 -75555 -99814 -68437 -43799
14057 -43799 -33839 20145 21108 15700 36952 17430 -1750 8987 42680 7134 6820 -23869 -31242
14044 -31242 -21308 -80343 -177297 -185296 -152798 -147362 -109234 -88915 -34503 20932 -13955 -25131
14032 -25131 30217 50356 56839 33880 -50417 -66221 -57906 23134 81727 51009 20085 41300
14020 41300 19807 46866 64998 73205 74709 60508 41235 13751 -43255 -52688 -31982 -2626
14008 -2626 -16923 -43996 -107618 -36877 47216 63057 73567 25765 -74316 -73746 13507 21771
13996 21771 39816 77524 9363 8299 46472 -65 24575 23727 1308 647 -18327 -31894 -26806
13983 -26806 47619 57485 75056 66129 90993 103728 119931 70948 -59356 -112674 -98017 -63013
13971 -63013 -19836 -32837 14944 25053 -26685 -24401 7033 10832 49612 -24077 -36844 -6903
13959 -6903 25955 -1574 11023 72931 33747 -19245 -15414 8788 -4897 -7534 3316 34138
13947 34138 -27883 -110837 -82598 3318 2743 -20547 -32997 -10601 -3487 -8251 -28013 -49641
13935 -49641 -10117 11386 24165 82478 45127 56036 -32744 -92901 -52185 -6650 65495 39587
13923 39587 43986 26025 -19133 -28335 -28502 15947 32220 52712 38878 1951 -44702 -48418 -21472
13910 -21472 -1776 1525 34069 11733 -1777 7675 -11766 -53078 -48566 -61790 -47319 -13004
13898 -13004 7158 17845 35715 -2779 6555 -8442 -9184 71939 117851 138351 65843 -15208
13886 -15208 -7810 -16199 -61435 -70921 -94383 -88702 -89128 -87526 -97109 -69777 -24473 -20061 -64019
13873 -64019 -52279 -10400 -5284 10188 16969 -34321 -72747 -11012 40009 53326 20754 -33995
13861 -33995 -5829 36007 27889 34018 -20554 10411 3368 3293 31792 87 -10491 -19461 18034
13848 18034 1037 -19912 -40665 -86805 -126688 -87986 -30388 23028 79267 60200 2737 -66777
13836 -66777 -111696 -100302 -15674 -7956 56827 52853 71791 62775 40135 32699 85543 105187
13824 105187 45452 13399 11780 24936 45526 56156 43681 -25744 -38515 -41597 -6276 14
13812 14 8148 51213 31270 -5912 -30038 -16299 -1117 -13913 -79972 -93890 -31589 -28313 3655
13799 3655 -5993 50102 91312 57298 -10863 -97597 -43012 32547 78464 137712 87657 3224
13787 3224 -37834 -96429 -89437 -66744 -56341 -57734 -121295 -165681 -118367 -62529 -19352 -37513
13775 -37513 -99472 -131304 -113129 -15225 21755 42719 -28296 -73409 -55380 -88222 -86992 -60286
13763 -60286 -59458 -59415 -89140 -83151 -75006 -66486 -20698 -13792 -18632 -48354 -127413 -153137 -67749 -8216
13749 -8216 9042 4587 15974 15102 421 -32413 -3370 -30295 -62605 -86363 -40050 -26577
13737 -26577 -50096 -65789 -71494 -62736 -67125 -46147 24191 78365 33811 15887 14826 27523
13725 27523 37806 -8571 10927 4331 14648 40586 96575 53290 -6077 -14570 -19923 -6758
13713 -6758 9512 -44456 -97174 -97655 -103938 -53501 -43650 -38833 -49366 -26769 -12874 -45556 -38315
13700 -38315 -5733 -31993 -28713 26823 67392 100647 20588 8354 31408 31347 57259 48193 29802
13687 29802 17139 8010 -57467 -53825 -45272 -30747 52916 78051 60942 25247 18001 8338 -7935
13674 -7935 -97410 -109355 -39015 54066 67369 -4594 -88198 -78439 -22037 13287 16273 -243
13662 -243 -7652 26871 4003 -2985 14700 3567 39596 23194 -11293 -37088 -114288 -94462
13650 -94462 -32550 -38932 -31526 27345 40830 72243 33281 -25657 1425 63829 22577 1780
13638 1780 -11053 -75728 -79281 -52308 -41611 11208 41575 42491 15396 -5383 -44689 484
13626 484 25219 71768 48183 -13678 81498 136424 108554 100891 81322 -4538 -32251 -35276
13614 -35276 -89683 -144408 -133844 -74894 -58249 -95269 -32249 8104 58126 41002 19127 27641
13602 27641 6898 1600 2818 -12271 49730 9859 -59532 -17699 27322 -37648 -11712 -13473
13590 -13473 -27838 -37887 -7816 23257 -14693 -35646 -81653 -22932 -13086 -38660 -41082 -40317
13578 -40317 18465 28850 74126 22731 3419 11443 -20445 -38887 -4882 4196 -23793 -55972
13566 -55972 -38744 -54148 -70230 -70928 -13934 34284 2006 -12783 -21168 6323 -5090 -43646
13554 -43646 21066 122593 149729 85084 -8024 -13691 -21436 6660 -9395 -25929 -53633 -16107
13542 -16107 66670 5667 -83510 -110977 -107508 -20528 -49741 -111511 -92314 -13748 83742 50395
13530 50395 -17171 -25805 -13830 -24136 33891 59319 8628 -30004 -5526 35374 75602 -2548
13518 -2548 5107 42413 72247 37514 59222 87432 61666 3932 24914 90341 54209 36262
13506 36262 -5984 6768 -32894 -85526 -119704 -129823 -129043 -55345 -19386 -23980 -50015 -16262
13494 -16262 32693 10595 2058 -11505 -8448 -1056 -28140 -10549 82555 70794 775 44841
13482 44841 29519 -58005 -73941 -62600 -52559 -10023 42821 25873 -38856 -85413 -74952 -89798
13470 -89798 -124491 -58374 -30866 1792 11745 44945 44441 14270 14329 4532 24495 51769 11322
13457 11322 -23145 -55617 -32285 -36865 -28771 -3245 321 8610 7974 17242 52743 77251 90650
13444 90650 24589 19563 1246 -29990 -88456 -70159 -76271 -43096 -24397 -58448 -104671 -130333
13432 -130333 -134936 -147493 -119305 -108864 -60098 -18584 -23508 27679 55907 83145 54097 -1723
13420 -1723 -23369 -66222 -116638 -106861 -62333 12777 64290 71560 94442 113460 106750 31822
13408 31822 5006 827 52760 12971 -29215 -29038 -11638 -28150 27164 39446 -19636 -2262
13396 -2262 32242 45850 2870 2608 34062 25987 15904 871 9431 -4165 -32835 -13281 -61250
13383 -61250 -102804 -79157 -36295 1234 1593 6828 12867 3925 -19970 -70701 -17665 65275 77045
13370 77045 38235 -17016 -121547 -123153 -93968 -75673 -37110 47603 73322 14277 47096 77559
13358 77559 37354 43352 -961 -11533 17082 18551 32596 2792 11127 -12219 -3878 6322
13346 6322 5263 -47 1303 31391 22775 -35675 -60077 -67808 -93345 -83695 -15838 12117 44219
13333 44219 48842 6967 64163 57721 87000 38818 27577 49317 65100 46614 17545 3709
13321 3709 13300 -21735 -26752 -54673 -5696 21350 -2281 -39535 -33538 13297 7049 -15976 -40060
13308 -40060 29646 -14701 -31764 -70324 -84224 -28577 25307 62650 42869 9193 15828 -9782
13296 -9782 -89311 -71564 -20628 12037 27865 4148 19732 43405 27731 -3297 -42246 -80614
13284 -80614 -51798 45507 38363 31971 -13802 -60065 -72358 25022 46636 40165 45131 25866
13272 25866 32270 14120 5296 37927 37610 -9429 -3222 5748 32008 77350 122074 122570 115565
13259 115565 137131 121459 71589 43239 29004 36656 56172 85876 49234 33971 8200 -27232
13247 -27232 -5261 13843 -20265 9191 -31899 -76364 -72489 -62966 -69194 -66313 13944 52770
13235 52770 9557 2811 -12224 -41368 -70070 -9414 -35137 -6126 8792 58223 40065 54948
13223 54948 41921 5922 -40017 30824 23168 6921 6658 -12540 3212 20807 13761 2232
13211 2232 39652 61938 16219 12471 62086 46329 48888 37837 69920 82223 82331 45694 39166
13198 39166 41344 36894 6118 -18593 -33142 -57124 -75448 -54842 -67201 -87057 -73896 -31377
13186 -31377 -30586 -31808 -30422 -29014 -12077 89 42169 5079 -23318 -21746 18340 -31836 -52287
13173 -52287 -59107 -110604 -135351 -96005 -45376 -28095 -19978 1067 13203 22857 3013 -15305
13161 -15305 -55751 -26828 -19958 -64406 -45989 -48994 -95685 -52628 -75852 -88306 -48166 -86974
13149 -86974 -108051 -60484 -81431 -112529 -74727 -29611 5732 -25881 -7544 36551 -2396 -29619
13137 -29619 -67908 -49584 -4535 -27778 -57958 -90190 -113956 -108973 -73352 -66130 1987 47189
13125 47189 23421 -4459 23683 59902 63107 7819 -25123 -27639 -48161 986 -1601 60712
13113 60712 79590 26281 7244 43800 79194 32837 923 -28838 -54505 -1511 42952 46796
13101 46796 30171 3357 -5058 -38786 -37252 -17023 -67939 -35224 2005 29216 19506 -6429
13089 -6429 -45752 -49665 -22026 -3222 1225 44205 48996 36896 33941 11801 -25306 -16767 40483
13076 40483 79432 100593 71212 44619 -7840 -41744 10273 -33978 -47475 -9908 20519 25745
13064 25745 -43817 -50820 13888 38539 22946 -51522 -61883 -412 -4205 18168 -39263 -70579
13052 -70579 -30394 -47494 -23203 42186 8870 -10765 -83746 -103316 -73283 -33093 -11233 -9600
13040 -9600 19915 46569 58133 33342 53436 60992 -31676 -45271 -1596 -15879 34285 -1522
13028 -1522 -284 3273 -11262 3343 11605 42264 30717 35940 30956 37713 32802 24293 -49501
13015 -49501 -104007 -46187 2335 20730 1728 36234 50423 31387 49650 1493 -34927 -68494
13003 -68494 -43410 2078 10379 -32005 -1396 -24592 -66943 -86034 -87272 2326 32593 18542
12991 18542 34288 37735 -47641 -76485 -96744 -53918 -28250 7423 6179 -15406 -12039 8444
12979 8444 5407 -46892 -46492 22264 1935 -419 48933 92456 117915 51642 -31880 -24745 21592
12966 21592 33804 79379 54547 -53403 -71721 -21883 20273 77460 59449 93302 98585 -8504
12954 -8504 -63752 24790 33115 22081 1717 53019 69128 92084 80018 12078 -53604 -68279
12942 -68279 -41166 29748 42370 80603 38241 -39080 -74778 -25444 -7227 -29478 -25077 -53555
12930 -53555 -39656 -64591 -83010 -70060 -93213 -65812 192 52600 27203 20570 -6185 -22315
12918 -22315 -23618 -8842 14152 65350 80324 113533 78524 68616 105004 56016 11696 20833
12906 20833 37533 52170 33513 51356 -5493 12893 26538 19742 38146 42986 67525 80511
12894 80511 34174 21208 9178 2420 28012 60007 103335 78926 41931 37573 11967 -32725
12882 -32725 -42885 -55075 -18529 -56940 -12849 -53802 -66761 -20151 -25609 -58293 -13662 9256
12870 9256 39987 18160 -46436 -42349 -4490 23589 -18209 -54391 -10943 82787 85882 4184
12858 4184 -58000 -35957 87340 115681 91836 89880 96210 55143 15230 97495 96583 76390
12846 76390 69241 45085 67151 61130 19541 -32545 -47077 3044 -4994 -1944 -12777 -35553
12834 -35553 -47751 -35434 19951 2164 -27705 -67116 -60849 -280 33143 30201 55094 6661
12822 6661 -22981 20128 127476 118458 85370 69624 8120 -82038 -84977 -96587 -124670 -65733
12810 -65733 -1430 -12939 -17888 -68424 -63486 -37555 -39834 -43918 -77780 -68299 -36235 -78707 -79229
12797 -79229 -83818 -82262 -82490 -30144 9544 -15982 -38225 -24935 -54681 -61622 -62492 -46678 28155
12784 28155 81091 18907 -96883 -139264 -105800 -76195 -46434 -66812 1867 21014 32955
12773 32955 36524 16333 22033 17905 -8030 41371 55317 53945 83511 79651 90660 103670 64312
12760 64312 -4371 -8708 270 33350 24580 -4771 -40612 -1833 17784 28934 27304 14878
12748 14878 -22833 -22546 -22357 -44491 -14343 2152 -15348 -8020 3413 -19258 8137 53338 19122
12735 19122 452 12876 58363 59280 51681 111352 82925 58709 16244 -589 7236 38540
12723 38540 39509 53790 30921 8077 50424 68877 34917 -12241 -106585 -157812 -157864 -177541 -90579
12710 -90579 -46317 -38490 -20515 -39726 17939 36098 -10840 -90997 -59292 -20343 -24685 -69411
12698 -69411 -94923 -26989 19455 -9166 -49760 -40816 -40643 -16187 24613 6051 6125 45809 82478
12685 82478 40222 6323 45065 54891 26025 -36938 -13017 5019 -1592 -4630 -10424 -56775
12673 -56775 -62121 -9725 -14980 -55846 -41743 16782 48768 21318 -25611 -27913 48725 100990
12661 100990 35583 -36857 -10981 38902 36728 20909 9161 -22974 -5959 4498 48266 67972
12649 67972 11268 -25286 -66988 -29458 -536 -31105 -36270 -62414 -67721 -94880 -113761 -20522
12637 -20522 -10020 -46622 -5183 -13461 28839 53567 37921 -20461 -51536 -17004 -27081 -65783
12625 -65783 -85508 -99390 -77812 -72355 -27604 24134 -5441 -39913 -27447 32642 72961 61872
12613 61872 -6645 -65486 -113950 -77053 -59003 -28625 3798 15431 -42616 -75838 -67156 -70437
12601 -70437 -43128 -25982 7924 -20856 -57673 -73547 -60154 9234 44045 69995 47933 -39176
12589 -39176 -77865 -62176 -6154 -22484 -95031 -121472 -87982 -34884 22847 23616 26936 34734
12577 34734 21341 25261 18322 -16793 -1964 34049 27108 -23290 -96518 -131923 -146180 -86844
12565 -86844 -645 48520 46874 -15865 -59612 -39205 -7402 24343 14736 -37697 -61632 -83266
12553 -83266 -38506 15692 9671 -48663 -39860 -29206 -18509 -13372 -6962 -21492 -39841 25207
12541 25207 103706 106068 74486 19771 -20923 -14331 39246 76818 75501 20513 -1152 15154
12529 15154 8926 -15455 -41408 -68170 -50665 -43061 15814 60309 39208 18974 12700 -9905
12517 -9905 25864 113802 93329 55699 38581 -11012 -21149 -45724 -70158 -28540 -26804 -105875
12505 -105875 -139007 -118427 -128904 -123264 -41774 -17066 -13741 57792 70367 138151 170264 136506
12493 136506 117411 89158 69594 65775 53116 9144 15043 26411 26667 -18446 14596 13692 76345
12480 76345 78770 -22559 -41660 -66424 -44806 30599 32573 -36513 -5840 10910 -11251 -11240
12468 -11240 -13520 -42725 -92836 -69985 36042 91345 67821 41918 17563 38246 30597 14962
12456 14962 -25715 -2132 -29990 -84785 -57391 -20882 -20653 -34712 -90862 -82644 -58384 -41374
12444 -41374 -29123 -28609 -37686 -53540 -31408 -34966 13705 45384 85561 72000 105724 122021
12432 122021 77950 70856 83178 60706 72368 17546 4361 -16227 -61422 -61007 -53417 -2963
12420 -2963 5506 -6351 -3528 -51526 -64610 -32187 -2853 -25494 -29447 37145 14788 -7375
12408 -7375 31634 -12625 -15627 -23934 -34812 -49817 -18591 -62455 -94391 -25375 51299 40944
12396 40944 75835 17631 -46568 -64811 -47059 2428 -59215 -121245 -96029 -100119 -22441 7396
12384 7396 33345 56166 38804 56074 52873 22742 53751 44448 33425 -8651 -59525 -82245
12372 -82245 -69666 6208 30720 38454 58353 90845 75695 47999 11674 -5195 19770 76478
12360 76478 61784 45688 26817 12025 37861 68679 31649 -28897 -33555 -55286 -7889 5301
12348 5301 -26819 14645 27593 67800 117717 96408 67800 10376 53406 62485 82481 68202
12336 68202 72964 82262 44827 -30081 -63978 -80237 -97403 -66035 -37297 7390 -64085 -137990
12324 -137990 -148431 -147963 -44100 38265 55066 10982 -21269 -29192 -9871 -11805 27950 23815
12312 23815 11442 26309 36262 37321 74298 32543 -19581 21382 36578 32432 71352 75467
12300 75467 31321 9415 3067 54 -54432 -50112 -2626 3600 31462 5489 -31029 -33005 -24624
12287 -24624 -5683 -9064 -43122 -51515 9210 54085 98059 106052 73136 17788 -32905 -101438
12275 -101438 -103657 -95143 -94544 -85826 -130402 -147853 -82602 -115400 -99895 -44253 28896 9275
12263 9275 -17097 4932 48868 72645 36367 -7788 -13946 -11912 -682 31347 382 -8953
12251 -8953 -10102 18090 21370 47083 41482 -7420 -15403 11086 27984 30387 23669 -40791 -37641
12238 -37641 5305 44903 25018 63662 54468 65995 89306 69581 -30654 17987 71272 85207
12226 85207 64672 -42459 -48966 -37119 -30835 -39404 -82319 -57372 -2411 2256 8070 72495
12214 72495 96918 149654 142913 61288 79043 73437 63932 64080 42521 71411 78159 59662 810
12201 810 -26014 30799 12002 -1748 50551 -2216 -56074 27526 65763 86076 111851 67154
12189 67154 -16833 -17061 108865 116029 58660 -12019 -41085 -22055 11766 12949 47848 82724
12177 82724 95196 71390 100105 116427 144714 106331 79725 66917 55863 80943 98900 119695
12165 119695 126209 104640 59434 55207 87481 123196 59319 116531 133277 96535 94060 62338
12153 62338 20464 37615 28258 30292 -1648 37943 52813 60396 32258 20360 -14042 -21300
12141 -21300 6990 16932 43045 67947 34543 -10665 -9827 -34375 -47581 28992 11722 2511
12129 2511 29469 -6236 -42355 -12380 -15126 -279 -28650 -39293 17386 58833 79401 30805
12117 30805 -4476 -23775 -17098 27068 52006 93239 58648 -19988 -59875 -34031 -23039 -13345
12105 -13345 9285 13794 -16373 13302 40847 -32508 -79098 -5397 50934 -14293 -36284 1712
12093 1712 108843 144397 73428 -8943 -45844 -53273 -14674 -38632 -58925 -41198 -7096 33268
12081 33268 2368 14925 50831 60014 48650 3623 2155 -22058 -29855 15806 32767 10341
12069 10341 -34652 -47318 -8091 19082 31823 56219 44070 12368 68210 90277 96814 93723
12057 93723 109970 133352 87020 78834 75355 502 -86123 -37832 54104 101954 193842 229252
12045 229252 255146 202131 170763 164060 144288 185974 129639 102224 86093 44335 60452 100258
12033 100258 165349 147017 122679 87611 64559 111331 109756 45207 -542 31639 39250 58640
12021 58640 118908 156299 138524 91695 61574 85632 122243 78151 57998 93173 77135 100338
12009 100338 148406 183528 242062 282819 266765 224388 156932 159799 164224 174774 147489 79220
11997 79220 79437 94278 88052 108147 123111 77872 65037 95932 145627 173008 142591 107071
11985 107071 52007 60951 97966 113596 120396 95085 73432 119002 152457 182191 157485 205229
11973 205229 272430 291168 209705 224470 256624 301034 339171 322978 292718 264390 269330 305639
11961 305639 313644 330076 367484 414445 469945 511887 594153 612670 650820 685555 736025 736147
11949 736147 792852 796099 811081 961862 1101332 1221257 1351747 1500246 1671470 1832522
11939 1832522 2014469 2182597 2425392 2791277 3284622 3859210 4450405 5327300 6535609
11930 6535609 8159736 10376834 13467018 18242704 26052079 39220973 61242062 92323361
11922 92323361 121216365 132352001 126092689 110605809 88166779 62842954 42604916
11915 42604916 29672623 21756636 16822474 13407687 10903471 9115879 7821962 6792439
11907 6792439 5867001 5115562 4517449 4041655 3639448 3313454 3024043 2761692 2554925
11898 2554925 2392891 2232504 2056676 1874374 1758152 1681132 1594375 1509078 1447042 1417262
11888 1417262 1307547 1223112 1228007 1229469 1293677 1274275 1187551 1173522 1059955 986616 893628
11877 893628 806966 785217 688935 639812 574963 464155 455169 496518 498907 501184 468837 457248
11865 457248 459094 428059 394346 375331 363012 372036 314784 279238 302037 328917 318488 286705
11853 286705 258310 173511 167574 196863 212779 161337 129638 131485 184308 204089 121363 147052
11841 147052 183404 206088 228998 203959 168466 116906 116941 137149 111200 126831 152616 192319
11829 192319 171897 165395 143625 150362 118670 81319 43020 91315 100003 34209 -36878 27807
11817 27807 56681 93347 142206 58484 27164 75507 132466 117368 138311 114033 115721 112892
11805 112892 59790 61687 69328 69322 124124 147696 86725 77657 51662 -71906 -98562 -31182 87258
11792 87258 91110 47834 38115 16713 49394 56822 50386 64440 33931 50085 116717 119888 118835
11779 118835 126831 160586 181431 198083 172821 142727 151561 145600 146016 99385 115794 117843 128427
11766 128427 131181 75324 94362 102424 109849 75241 116967 149043 98220 42088 20187 32140
11754 32140 31926 79003 130048 123040 72538 69515 93814 71679 143456 151792 130700 65606 79558
11741 79558 87380 97650 89836 24984 210 -21943 -17479 22332 3168 -23002 -104432 -135150
11729 -135150 -146732 -114297 -43679 -10393 -21751 -25702 -27053 -26342 -5906 23670 59192 1143
11717 1143 -21385 -45386 -109331 -103533 -111864 -98788 -77822 -25317 -38639 -36788 -4675 -11252 -47799
11704 -47799 -109466 -97010 -82183 -67344 -15607 9521 4670 12994 38045 104082 144226 110693
11692 110693 66959 84373 44081 11147 15064 22931 39680 58262 5905 20244 39078 2928
11680 2928 -62431 -38673 13739 15904 -20162 -12544 -29027 -39789 55286 144224 107151 54509
11668 54509 19826 45220 68464 43188 41815 92411 124340 91023 78371 58605 27274 32096
11656 32096 22796 4347 -15807 -39325 -51714 -84996 -40251 -29413 -41270 -26441 10733 47936
11644 47936 80621 44199 48673 50661 44774 -7049 -19563 39665 48194 22448 -1392 -602 -21372
11631 -21372 -37077 34803 30630 -1110 3552 62972 102589 95200 128903 89417 18168 -26215
11619 -26215 -61737 -34100 19887 -27613 -36954 -63138 -100812 15928 89678 45808 49761 67514
11607 67514 44699 22018 32388 85482 137187 165657 164991 106279 -11655 -4336 27514 31404
11595 31404 57596 64503 75367 69609 61745 55922 42472 100412 106097 82107 25241 15355 -5992
11582 -5992 -36786 -22015 -18756 -28950 -10512 9020 8925 -29191 -51057 -42648 47620 77150 78694
11569 78694 59874 14943 -19928 9251 119273 80491 58119 14230 -17552 -16501 -40443 -30803
11557 -30803 -66481 -56409 -27941 11815 -29677 -66885 -39007 18677 -8298 -8811 -17104 20219
11545 20219 62223 43632 2696 -11642 -32555 -16555 -6843 -6568 40022 55636 1274 24433
11533 24433 31270 11343 38994 55143 57722 13365 -11299 12899 2734 33789 54152 33827
11521 33827 61733 40105 50704 11779 -42812 -53197 -43424 -37775 32725 56295 13451 -27209
11509 -27209 -29079 -44149 -49712 -38363 -40061 -59653 -58715 -5498 5650 14971 -47987 -95725 -95010
11496 -95010 -71380 -46354 -16536 1060 55830 107525 92863 53316 11913 24509 23021 109233
11484 109233 190984 132794 132762 146807 103972 77758 96964 40379 72314 71859 6316 -28824
11472 -28824 14815 59646 46825 -18791 -34469 -54526 -49926 -14439 -44016 -54617 -31227 -86953
11460 -86953 -98610 -101546 -85841 -43307 14863 38927 36850 38331 26138 -12940 -41433 -58914
11448 -58914 -22817 88971 64538 -1532 7116 25626 -34172 -54647 -46317 -38760 10100 -24700
11436 -24700 -16572 1389 18963 31156 86784 39966 11716 32743 65494 74503 34598 30433
11424 30433 36787 31164 9849 -24699 -57154 -66232 -91100 -46099 -19742 -37464 -57959 -52502
11412 -52502 -3830 9340 28880 44628 41367 41864 47851 39709 51740 51792 51156 55788 62594 50563
11398 50563 70241 58997 34875 15720 -40292 41871 55179 47790 27868 33845 34338 16861
11386 16861 5250 19093 -1443 22979 22885 47412 41597 34407 -6379 -17723 458 -33789 -35791
11373 -35791 41347 71781 -14745 10420 8167 21123 -26708 -93208 -92289 -88919 -104887 -97911 -85042
11360 -85042 -72174 -50850 -78120 -49765 51421 61329 -4605 -77392 -83052 -65829 -119229 -82798
11348 -82798 -4531 -2736 -929 619 -17715 -54552 -13620 -18077 -39269 -112285 -160713 -146684
11336 -146684 -20349 17932 -17958 -71184 -60875 -55428 -96818 -119193 -104249 -39331 -21843
11325 -21843 -38020 -14531 28782 33617 -45414 -46535 2767 38060 68701 67614 88349 98173
11313 98173 95957 76825 92130 81632 62174 22127 9563 -6074 17695 70129 102763 94288
11301 94288 36932 -2182 -59441 -36325 -25733 -72620 -33950 24205 3213 12305 19683 5895
11289 5895 -56312 -65175 -33004 14059 21734 45995 39422 91737 75600 38139 -40640 -72140
11277 -72140 -108112 -150883 -87825 -59526 -48218 -4542 -25781 -42874 58858 61366 25371 -25062
11265 -25062 -51940 8629 55869 61768 71149 79601 34257 -35800 -52059 -69111 -65325 -20255
11253 -20255 -36633 -108647 -144729 -66897 9422 1421 34343 49897 74644 46116 6571 -43107
11241 -43107 -26079 47229 99232 74192 81592 94227 66626 17705 -15104 44490 30277 -21782
11229 -21782 -18068 -11705 3826 66292 100864 143016 192599 156249 60656 76449 110761 119845
11217 119845 113049 89976 46306 -42691 -57082 18875 1132 -30506 33785 81420 99850 134532
11205 134532 156000 119586 174664 180110 179347 203291 229678 359117 689957 1160779 1651759
11194 1651759 2116674 2461514 2685172 2571390 2165346 1652432 1209248 876645 532197
11185 532197 367072 227463 132219 73276 107868 154183 134875 134389 161042 176841 201622
11174 201622 196778 175216 104827 79716 102997 106855 59004 72705 68561 100815 89960 66752
11162 66752 -10972 -61319 -47619 -21048 -13197 -8093 19785 94842 111724 24144 -13877 6738
11150 6738 62022 110682 114551 100070 41097 24917 8577 35440 14227 -90952 -109386 -47210
11138 -47210 -86123 -196575 -173170 -57917 7802 62532 23701 22388 12084 3018 -41426 -103986
11126 -103986 -78164 -37524 -11450 -29945 18879 6897 8573 1894 -40211 6931 44614 96400
11114 96400 117086 79980 -83647 -113528 -105890 -94236 -113074 -83781 -65974 -20026 8710 28141
11102 28141 18432 35658 -13833 -75424 -68784 35730 113858 124151 81308 14556 -7712 8550
11090 8550 -570 63897 64467 51746 56020 62515 6604 -34025 -25624 -72759 -88473 -55567 -59014
11077 -59014 7804 19875 -18993 -29043 16895 21861 15315 22225 -13091 -40637 -72512 -37462
11065 -37462 -1195 -12319 27588 59470 63180 48254 -21465 -36432 44235 37074 -9182 -36536
11053 -36536 -45412 -18176 26507 -21945 27421 75023 26685 -26186 -81649 -56482 10940 23234
11041 23234 34865 74331 87027 134839 219108 323010 315459 276628 248427 236028 197696 180482
11029 180482 255529 265142 278800 355629 442083 469876 466517 480631 485277 461538 434816 494263
11017 494263 534851 514559 514773 651169 693264 695899 669865 609143 562980 537660 522708 546458
11005 546458 650418 759399 892903 1067365 1238222 1390890 1637793 1892959 2024024 2004052
10995 2004052 1824730 1524512 1205656 999387 825608 727962 646528 536795 460633 380293
10985 380293 302470 246562 223930 194001 186777 230035 222127 234007 209572 222732 172517 139394
10973 139394 101570 60924 70439 62969 85314 87190 122575 99397 13588 -9104 45840 59877
10961 59877 101497 146562 135563 110475 87189 91487 117572 180804 155722 159396 228141 267057
10949 267057 311889 344762 501005 772424 1223527 1674297 1997978 2121518 2248087 2324525
10939 2324525 2304560 2036029 1640390 1286311 931861 681678 520632 426602 349449 313351
10929 313351 267531 195201 178435 189921 163343 189593 200137 210442 220518 222141 221493 221142
10917 221142 171343 104571 110298 142226 124323 94243 112088 95476 98227 73868 59247 50315
10905 50315 75918 12107 13149 54995 76718 47165 -37701 -86672 -74990 -1646 -31974 -57928
10893 -57928 -4702 18677 -6860 48338 53744 61387 112556 146501 97419 98557 60395 14735
10881 14735 7633 7702 -43793 -29806 18955 16757 -23923 -63759 -42214 -42467 -27905 29170 80747
10868 80747 65955 49181 46923 61058 78500 88877 131096 147777 96135 68424 81815 73363
10856 73363 94395 128873 187771 238025 268116 251981 202957 170530 166014 197014 221380 202617
10844 202617 178171 227064 292263 288605 301717 334458 333962 334078 340150 289721 274733 279039 274406
10831 274406 308882 234812 193059 217703 247510 246606 206203 148408 187269 210066 177068 206158
10819 206158 217473 214386 182422 199448 210732 314554 378508 360841 313722 276613 311075
10808 311075 352006 352352 344919 398511 338429 297717 251111 170682 154716 221241 229490 195656
10796 195656 181832 172339 163966 204456 261338 250973 234157 241718 226559 182877 177907 168351
10784 168351 159649 128811 135562 203996 201562 144734 127509 133048 202374 268925 238960 198334
10772 198334 209896 166748 118620 75692 78306 138121 100749 94707 139299 109665 47713 41169
10760 41169 65748 133139 153932 136832 174781 163065 156891 116793 142426 254841 339286 371294
10748 371294 330387 297403 228938 170533 155494 113998 140087 105891 14451 23836 103323 57390
10736 57390 -23808 3011 76907 148519 169283 142004 72886 39565 8183 -21117 18816 67502
10724 67502 78646 31243 44377 115151 145416 115064 118861 110801 134345 151494 173035 138864
10712 138864 129304 139120 111890 77360 59668 106200 186508 188405 166509 110326 65279 10856
10700 10856 31574 114780 119063 89835 112430 144576 162565 139510 126358 150110 141479 125994
10688 125994 133725 105558 97320 119762 263339 408221 536780 752669 780940 783038 764804
10677 764804 755736 745934 698183 666708 590232 576409 520045 468796 489207 514868 536881 505148
10665 505148 511702 513484 522135 520507 469754 442213 479988 465431 421371 428118 441422 502792
10653 502792 502677 559728 619497 617409 623074 658241 723979 812469 884997 939603 1003046 1125533
10641 1125533 1252737 1325502 1292109 1204489 1148096 1100799 1044738 1047275 1075594 1206099 1365627
10630 1365627 1426811 1500058 1612589 1745592 1924981 2107100 2306230 2493382 2672530 2891988
10620 2891988 3085158 3324346 3623317 3997993 4505424 5263659 6282559 7620955 9500205
10611 9500205 12044060 15406045 19705473 24730546 29538468 33015330 34701874 34648538
10603 34648538 33672822 32702893 32575083 33914883 37226861 42967516 51352573 61453170
10595 61453170 70704938 76114866 76676221 73458784 68340069 63279933 60137549 59891106
10587 59891106 63241251 70558286 81578099 94457706 105099604 109470462 106686790 98718547
10579 98718547 88345905 78228788 70611361 66663305 66449914 69816092 76289004 84086561
10571 84086561 90229416 92165539 89565523 83999632 77627558 72671909 70883186 73301703
10563 73301703 80577472 93493171 113717337 144117185 189174364 254367619 337337558
10556 337337558 408551421 424525540 390368396 333488922 262838033 194145327 142868328
10549 142868328 108214767 84833954 68566904 56893122 48193023 41592628 36568125
10542 36568125 32574694 29192300 26129657 23322199 20837381 18677002 16870340 15335093
10534 15335093 14034239 12863051 11863383 10962361 10227258 9561480 8937819 8353149 7745233
10525 7745233 7225312 6782393 6378301 5991077 5695476 5446426 5271887 5069934 4839874
10516 4839874 4630363 4421888 4205012 3935779 3711969 3541833 3359647 3234207 3108388
10507 3108388 2948919 2804728 2730579 2643113 2510106 2370647 2270168 2206782 2186820 2149731
10497 2149731 2030649 1885109 1824947 1774686 1723906 1685136 1570439 1490770 1430096 1380991 1258727
10486 1258727 1132392 1100345 1099608 1063942 1051626 911926 853481 814686 849965 858158 741929
10475 741929 684670 651902 663591 680397 665415 629947 623582 620263 705784 743723 739645 771135
10463 771135 753340 736896 651711 612155 652549 669823 625216 552187 567533 595728 625695
10452 625695 550028 506715 528788 536494 526914 531074 532215 467283 397388 439642 504313 477915
10440 477915 416783 406382 403856 432327 376068 320823 283648 263095 168341 104228 73023 153850
10428 153850 275814 375198 432754 502225 588946 607988 542788 507728 562725 613159 564725
10417 564725 521976 463199 446386 390069 399169 414981 450161 448026 448784 466939 485397 523259
10405 523259 536197 516762 462591 388523 386449 323310 237476 268722 282985 228573 193048 201080
10393 201080 224815 258362 278265 254494 228986 244909 281100 267163 305382 353265 280214
10382 280214 279982 232920 210324 232381 278395 303575 271024 263799 274121 287089 258113 247648
10370 247648 266367 246118 136070 18417 -86276 -142164 -166066 -218793 -191412 -151158 -45082
10359 -45082 65085 159830 180227 148396 157195 113100 55555 5422 7890 45353 36695 77282
10347 77282 86831 106351 90556 36511 83237 82577 86946 65722 78389 139401 182214 201617
10335 201617 162458 130758 110490 119393 145494 155384 161241 131355 58136 63085 74594 56010
10323 56010 98940 50306 34538 90854 103160 27209 -45380 -42978 34968 62753 13072 41189
10311 41189 52582 -23350 -3971 57452 22054 80058 99929 91719 104976 59764 33667 55078
10299 55078 74273 137450 168463 153131 188948 188082 189714 195357 193402 162655 107923 66738 38435
10286 38435 6875 -26959 -42341 -61100 8905 74239 133826 147682 157991 145383 54332 -120
10274 -120 -9487 -28041 -32547 -31983 38693 38802 10448 51179 62379 7589 -43826 -33165 -29901
10261 -29901 39166 151547 95405 -1812 25209 61874 48161 59137 118717 149619 141618 65594
10249 65594 49457 87223 159350 222649 237756 172346 108149 164210 191225 159102 167236 184988
10237 184988 203894 191181 131913 138265 136890 116199 80029 24036 207 -27052 -5973 -8814
10225 -8814 -14866 -10676 43925 121162 185337 178657 166988 75984 48082 62570 30670 78512
10213 78512 109232 49385 21084 45006 75609 -26317 -85280 -34691 68112 64868 33776
10202 33776 -45132 -28702 102992 143264 49991 13949 27032 45313 112490 58049 47407
10191 47407 46580 59126 91699 129396 96923 37239 40843 65823 72993 29564 15618 95792
10179 95792 102878 61039 56225 -7793 -75640 -92940 -58404 -8260 88265 142709 188930 191513
10167 191513 124882 132026 103117 153001 216131 305891 304022 325266 402781 441080 460798 502187
10155 502187 484260 414087 421314 433391 414837 405741 426267 525472 578425 582725 596493 565781
10143 565781 530042 484672 502480 472121 422764 406174 388299 453243 554257 619435 581138
10132 581138 551842 501730 410920 391112 409360 349972 334656 314015 295973 243873 265392
10121 265392 294386 294430 235845 242402 287554 257781 294838 311260 463353 622333 850382 1105619
10109 1105619 1497219 1829072 1916265 1742788 1492616 1307093 1059032 835562 666105 558024
10099 558024 480139 389966 255109 237535 246580 226981 179708 129016 110129 132250 153791
10088 153791 149600 124357 175169 173630 145608 91082 33987 40240 76546 100504 158660 195906
10076 195906 171554 165968 156221 177544 175411 87620 27845 30043 15553 19829 106622 123031
10064 123031 80117 81744 81452 19178 2375 -34865 -60216 -38640 -38436 -46482 -41664 -37102 -20710
10051 -20710 15789 32728 63269 85189 60691 17333 25669 69296 32252 52677 53776 31674
10039 31674 66998 53293 86987 116262 54726 53415 50485 59916 47942 48299 72690 65637 32734
10026 32734 43147 93415 143042 63141 -22551 4762 22589 3348 -123 -28139 -10550 -58075
10014 -58075 -89562 -107835 -56041 -10333 44212 58221 61853 139541 179801 148479 113726 27054
10002 27054 -13581 -10056 19309 40226 43060 67733 52031 -16041 8414 64938 84803 119118
9990 119118 90777 87002 106360 47992 32080 3046 55906 22387 -67306 -15128 -19786 -15978
9978 -15978 -3080 8415 53886 -4222 -35715 -26038 496 7230 -40029 -8450 -21820 -35175
9966 -35175 -8010 41666 50705 4066 -29761 31317 38794 22687 6277 13437 50393 39120
9954 39120 -49709 -88413 -61553 -25008 -1634 -13931 -5985 19364 -12909 -83300 -124800 -155921
9942 -155921 -68147 -35226 -15018 20644 35395 41638 30813 51786 58239 77935 55123 39319
9930 39319 2058 37647 43798 5679 -22398 16047 75268 65590 75310 87797 67908 43459
9918 43459 57412 81643 65767 52534 46201 71182 100291 106449 114324 92500 51457 50307 56415
9905 56415 73587 103356 59616 33830 18814 71044 149691 124365 106987 112560 80045 112430
9893 112430 82848 51902 79748 92232 60946 30412 65631 51904 -17097 -27715 -693 -21557
9881 -21557 -31164 4969 24682 1904 -10363 -6934 7780 -23659 10051 -1073 -9829 -55605
9869 -55605 -48830 -26131 802 -13459 -43045 -46660 -40615 -76118 -47016 29165 -30268 -61867
9857 -61867 -36561 -19920 -40656 -39612 -94166 -100120 -96788 -63585 14328 15580 63388 72594 120345
9844 120345 79703 76258 122089 110171 86485 -16819 -64715 -18167 -11314 22404 -3015 46272
9832 46272 74070 48185 91452 112949 50287 19264 5613 -9437 38028 38569 58634 -847
9820 -847 -56101 -45332 -40276 -36459 7271 -14087 -32353 -89445 -121168 -91708 -69137 -101467 -77638
9807 -77638 -71716 -121030 -43028 48794 112793 104991 78074 51030 39968 23919 -17151 -24303
9795 -24303 -19757 -90152 -51908 -8990 -4823 -37905 -72199 -32928 -66255 -71890 -83036 -26518
9783 -26518 -20845 -39166 2933 -17636 -61550 -55508 -32257 25574 42766 12346 40348 91066
9771 91066 97493 158706 189112 114002 -8516 -22750 -14280 7420 4062 16668 53572 100108
9759 100108 147869 131121 106490 140083 99661 56796 104576 147005 142735 80643 17921 34254
9747 34254 -15003 -30549 1263 15016 49405 25194 43122 4265 -25578 -36446 -39796 11519
9735 11519 30111 -14813 -50900 -38180 5903 26080 14582 16316 11337 2211 7243 33766 62250
9722 62250 66902 54661 35044 74596 102622 62154 40777 56254 119789 101849 55563 25012
9710 25012 -26808 40306 72634 87019 96257 97823 178704 150871 83075 58643 47548 -12940
9698 -12940 -14422 -63651 -104719 -67101 -52313 -60256 -50236 -60743 -84827 -34530 -27092 -73628
9686 -73628 -5332 33575 6779 -39180 -82650 -81419 -18579 24316 19993 -29743 -23349 19822
9674 19822 -58794 -57577 -31838 -39230 -74350 -5274 -24797 -7752 11520 9392 60617 45530
9662 45530 5082 74054 114806 53513 40283 29966 -60125 4773 33326 36705 55431 94137
9650 94137 61820 63011 53165 131218 183730 180861 171252 144999 135487 115253 162375 144727 31991
9637 31991 3505 -17603 -40169 -64099 -44359 -31754 -29593 -28856 -74608 -56187 53629 93268
9625 93268 62565 55900 36125 34066 61494 114490 142301 168105 151924 108076 74460 50280
9613 50280 81250 82864 63632 45285 7801 -61847 -93348 -31857 51703 29948 35165 32115
9601 32115 -5230 -48976 -53227 -49803 -40541 9938 15502 -10213 9815 39409 29862 36173 43389
9588 43389 46801 9709 -21550 9014 11873 -8447 7176 78384 59234 52030 8937 -24914
9576 -24914 -15743 31292 76956 96956 80502 60045 74194 100224 103444 -9770 -61891 120
9564 120 12312 4130 9767 8603 3943 -3461 -9918 17733 49316 44497 28957 34639 68055 106607
9550 106607 35487 -8188 46973 104308 76429 64723 111292 70058 76482 73838 50781 9327
9538 9327 -19958 -64226 -87973 -38385 27838 31945 28548 89 -73490 -135007 -108599 -63803
9526 -63803 -44114 -20838 -32694 16647 67183 58962 31074 24219 20134 -3036 1399 12977 31558
9513 31558 94979 93076 96772 71199 -60987 -108033 -80193 -52150 -29414 -76805 -20891 108104
9501 108104 115634 82696 48302 64190 108860 75693 51063 50251 34227 31897 15413 -8128
9489 -8128 -97775 -100068 -62174 -10707 58014 34093 -7174 15225 -21801 -19422 28994 42022
9477 42022 -2310 -48365 -55242 -59322 -97620 -21012 16676 7686 29458 40796 81121 20285
9465 20285 10441 47374 53131 41953 17637 -21060 -2185 37765 1583 -19940 31648 91107
9453 91107 118195 117181 100630 110183 76382 13924 -32068 -56632 -75397 -109180 -87208 -64993
9441 -64993 5273 24881 -2618 3586 24127 22166 -31660 21547 33012 3307 -21365 -13734
9429 -13734 27725 13998 23688 40559 58053 97631 76316 59057 51838 40774 10749 -6485
9417 -6485 -21024 -21860 -21158 -23570 -1064 -29036 -62392 -93593 -89830 -53023 12234 8614 17119 -295
9403 -295 -18389 39891 97640 101262 33077 -24124 -51959 -39869 7968 66127 58387 14703 32317
9390 32317 29776 -28580 -12247 19473 93946 132410 111260 75019 73269 33998 -12545 -39047
9378 -39047 -93492 -75541 -61277 -94952 -134135 -129328 -105575 -45008 -3373 -17918 -42047 -69241
9366 -69241 -83376 -98187 -94213 -24862 -4537 -66783 -94133 -91708 -85446 -108005 -147501 -73388
9354 -73388 -54128 -32753 -28035 -17246 -68126 -52559 -14366 -2580 24057 52362 59304 48707
9342 48707 63177 45383 116662 88460 54283 83962 112494 90822 35769 -41697 -48570 -4157
9330 -4157 77320 90266 88946 61410 12716 9890 72322 41310 -8653 -38492 -57234 -47541 -96371
9317 -96371 -58155 21252 -21964 -62283 -27452 -39644 -25748 -21616 23790 50865 47674 13758
9305 13758 17100 83330 53348 -12614 -38839 -26680 -51098 -18870 55694 81502 11054 -58635
9293 -58635 -47868 28208 34211 1440 -34904 13792 42251 24577 11656 54225 88704 68728
9281 68728 -3111 -4991 36053 40616 -24663 -14870 -19442 11121 38470 99662 80607 58118 20143
9268 20143 2231 -5279 -25601 15267 23760 22658 38573 46010 34011 56959 72051 78002 52921
9255 52921 207 -51271 -53228 -37183 34513 74637 58553 -62556 -93384 -91141 -40415 27831
9243 27831 16382 -83240 -66967 16802 55440 71723 66165 34680 32227 9053 53854 61666
9231 61666 -3748 -76091 -107960 -113303 -118024 -104054 -103162 -65893 -12188 -73114 -78516 -46636 -202
9218 -202 21208 43154 -2466 -38733 -27561 -8405 -12988 -7706 8971 10026 4042 -6262 12518
9205 12518 51301 48791 38860 37227 12813 4704 24725 73776 90176 60578 -3762 -58772 -68393
9192 -68393 -26770 1345 8105 44280 20277 5362 5921 2651 -28007 45540 107194 36981 -17798
9179 -17798 23477 -14654 -63885 -123685 -93659 -90330 -77906 -73921 -35015 -15091 -30433 -1544
9167 -1544 20805 29915 78676 115293 75302 60545 58987 19620 4476 36896 25175 7958
9155 7958 73962 82777 19280 38623 41412 28912 29039 13472 -1942 -29876 23059 29365 83597
9142 83597 96545 28548 4224 15026 -32751 -104730 -120684 -67350 -54029 -53448 -26207 40136
9130 40136 70881 18453 -41207 -46244 -1816 23423 14578 -8753 -51567 -23558 39100 96437
9118 96437 88737 107406 62795 85083 72574 49051 30349 52392 20950 -6754 7318 11995
9106 11995 35544 -248 -617 -1878 26906 57328 27008 27000 18336 -51793 -69652 -82944 -54463
9093 -54463 -76352 -30239 -34512 -46401 -75442 -70050 -93081 -38508 50681 32392 -79438 -114323
9081 -114323 -86105 -45857 -11559 4313 40176 62073 59114 103440 66687 10720 4999 30067
9069 30067 13568 5697 12537 47557 12323 11821 1833 -44284 -55877 -66829 -40878 19307 47802
9056 47802 52816 -7751 -27348 -32072 -30831 26737 53358 13049 86262 166249 123149 61725
9044 61725 31999 -17369 -33255 -40129 43090 93436 57149 43449 -6945 -68437 -88307 -90203
9032 -90203 -75852 -1057 7923 17247 -86929 -89554 -86058 -34702 22591 32885 22543 34847
9020 34847 19664 -5172 -34738 -49281 -36938 -35620 -6454 24873 -12930 -37388 -59371 -109821
9008 -109821 -94565 -140979 -147027 -124417 -123849 -73012 -2169 6400 19954 43191 23788 -34275
8996 -34275 -21720 15682 47450 53406 46763 39302 75502 51025 56487 89123 111608 148281 53579
8983 53579 7723 37978 10123 18635 39436 29827 -7709 -50490 -13626 11340 4312 44294
8971 44294 63156 37497 44405 19245 -27600 -19672 -36938 -41988 -22855 -15121 18933 33507 78589
8958 78589 30889 -40533 -71472 -47339 -22833 -19771 19021 1427 32744 30582 18768 -2373
8946 -2373 -373 -4286 16187 91627 86911 12511 -8383 19879 -3907 1088 30771 22806 57659
8933 57659 47654 39320 95392 115127 45169 31275 -22037 -7430 -36136 -50790 -27090 -2092
8921 -2092 -1418 -41050 31827 97836 36565 -3437 -11093 -23955 -45450 -59546 -87925 -38250 26404
8908 26404 40711 57428 1685 -91107 -73931 -12202 21390 50514 57269 23137 -28826 -24255
8896 -24255 -6015 11177 60501 60666 35284 34422 76834 41605 17211 32815 48965 12237 14446
8883 14446 -7519 5382 -7758 5869 11684 -14607 -87507 -154691 -95741 -59843 -9803 14266
8871 14266 -9988 -7408 10484 795 -21351 -6469 -56079 3695 24132 -10820 -18613 -32918
8859 -32918 -29653 -20120 20024 95138 69371 7760 -24811 -21357 47944 75041 10628 -34620
8847 -34620 24765 24557 -18974 9180 -12824 8831 82190 112146 66603 5431 2052 17367
8835 17367 55622 55968 14826 53212 88588 -426 -45232 -23285 -39145 -6157 55546 40415
8823 40415 -75164 -93703 2081 21469 104842 90732 87462 45710 -18749 8365 -5556 -58872
8811 -58872 -100874 -21853 29575 33835 9056 -31173 -105159 -139371 -144212 -126471 -68574 -40084
8799 -40084 -42112 14718 50231 69708 29223 -24603 -16397 -786 -12802 28444 116405 146305
8787 146305 133020 29569 3540 -13503 -55350 -66526 -59103 -51913 -17013 -8968 -33847 -20362
8775 -20362 16202 27341 34600 37455 1095 20155 40656 83854 38400 61 -10298 -35343
8763 -35343 -62417 -88376 -98078 -67340 -19692 27584 -6264 -26159 10774 41480 23266 70016
8751 70016 120332 144593 109915 54938 109082 134472 101980 72852 41872 91908 119478 68241
8739 68241 35719 3111 22321 56413 28654 15945 6664 -17954 -49465 -25452 37875 74556
8727 74556 91192 -10518 -93045 -90029 -60418 -36587 -32240 -26474 -32128 -47478 -12717 60361
8715 60361 102613 62088 29412 39538 78965 80063 21768 -4972 6302 14051 24389 31676
8703 31676 34116 37606 37682 79124 70106 41204 -13782 -4183 17172 43224 49134 9586 -20620
8690 -20620 -35822 -57905 -76025 -64962 -3379 43130 41322 65908 67582 20759 87001 104359
8678 104359 23520 -3470 -38797 -48740 -64072 -54958 -28340 13534 44370 44505 8010 -10020
8666 -10020 -11851 -21079 -13368 2377 -4039 1466 -8070 14560 54508 18772 -1227 -57900 -8064
8653 -8064 9066 -48268 -39870 10977 9474 3653 -7230 19767 38145 16866 -15513 -8673 -9904
8640 -9904 51945 84435 21982 -1919 4261 21677 21195 43713 21454 -38428 -60561 -14453 1883
8627 1883 -39933 -70165 -58954 -87987 -68004 -29340 -33553 -4408 13725 27645 2771 3806
8615 3806 46771 17778 -11481 57773 42395 -53791 -76173 6470 -31492 -31288 1750 20226
8603 20226 27367 30459 77417 43338 -12211 -84858 -67073 -69547 -135339 -186409 -126192 -110998
8591 -110998 -91303 -65921 -97397 -112886 -41499 19861 -5127 -14146 -66687 -49775 596 27036
8579 27036 25266 35828 57217 108213 89312 30824 31329 -26045 -4543 32906 4565 -14615
8567 -14615 -1924 38551 61023 71605 64811 38989 11036 63200 70352 18392 -27073 -4300
8555 -4300 19533 16437 93377 101646 56065 -2958 -1401 -7112 -98978 -78576 -65195 -85159 -141458
8542 -141458 -123969 -50784 48896 85122 60736 24672 4294 1047 49362 69822 79048 67061
8530 67061 8284 -52387 -69848 -24059 -62161 -106803 -91504 -23605 -16629 -93722 -114804 -28609
8518 -28609 -4396 -38346 -48021 -65171 -109766 -94816 -23928 -28446 -27285 25400 95639 70272
8506 70272 52235 52229 1581 -36124 -59279 4845 94970 106296 2042 3719 25710 4824 -17936
8493 -17936 -30062 -5571 -3520 -22828 -49292 24770 93858 86875 37155 -28810 1074 10465
8481 10465 -4391 2955 29618 58724 58531 93547 36369 -1737 20803 -40294 -45078 -11407 50756
8468 50756 41591 -21262 -19751 17449 10620 27817 -8264 -37919 -22010 -14088 -31776 7958 389
8455 389 11002 34755 49830 25945 6027 -41189 6862 25271 -15357 -39147 47946 83877
8443 83877 135841 133160 91210 17375 -34173 -6388 16398 3940 -1373 11712 47297 53974
8431 53974 38214 -33069 -43436 -24293 -41582 -21984 -1902 4543 27687 44712 25658 46581
8419 46581 42920 40511 5264 -41519 -935 21402 -12934 -26147 -43344 -113172 -115594 -73268
8407 -73268 -24067 54062 136725 114818 52554 -2355 -18922 -9019 -4674 41593 94134 93758 86323
8394 86323 20274 14188 41444 28640 -18357 -33474 -19990 -22725 -17917 31970 69651 53890
8382 53890 -17195 -20810 -44669 -17802 18458 26357 31184 -6592 31698 132837 130173 57738
8370 57738 48618 66960 37972 -39809 -85552 -67790 -16973 30717 24671 1883 -42745 -71986
8358 -71986 -86035 -39801 -9360 -833 115150 125543 119890 94553 38875 47494 45299 55116 70340
8345 70340 80198 75969 47079 15558 -35336 -75393 -55560 -51540 -66453 -35706 -41501 -17362 -9326
8332 -9326 802 -5747 -26175 -57237 -41589 -842 -6383 -38693 -19342 -52370 -86310 -46923
8320 -46923 -9182 37606 -14194 -29000 -45686 -11377 23871 -39 -68763 -90006 -100183 -66738
8308 -66738 -19870 -398 12433 40162 10745 -17617 21525 8188 34676 47231 35670 -3006
8296 -3006 -14065 24069 -21496 -31004 -73180 -96347 -64748 -7432 85034 41366 -20029 -11174
8284 -11174 -5615 -41417 -67350 -35517 -50980 -63538 -35330 32260 41275 12694 20182 58146
8272 58146 36873 739 -38147 -30028 26487 -28026 -51967 -65906 -63197 -24977 64662 79462
8260 79462 75474 49145 18466 -11414 -49802 -33169 -502 27249 16883 34178 104976 188438
8248 188438 171689 115275 43638 13094 -32678 -54646 -21877 8455 28746 38638 7527 -13029
8236 -13029 33582 73280 66832 53877 20621 -11929 4794 85476 83780 77725 154700 150791 82313
8223 82313 80132 47240 19960 -27690 -54022 -47527 -49147 -20769 -17910 -36630 -6757 -18355 939
8210 939 -20762 -47818 -18506 19606 53741 -19484 -60529 -8795 12241 -16114 -31063 17285
8198 17285 71576 60884 57196 4931 -54524 -80100 -55511 -55467 -53577 -57623 -26957 -29645 -3292
8185 -3292 -29847 -76371 -54183 8448 44775 50860 45784 35 -49884 -16604 -28138 -55924
8173 -55924 -89780 -65662 -34980 -27392 -49385 -72533 -69860 -57939 -49682 16923 -1918 -31182
8161 -31182 -42238 -39689 -68978 -102697 -46084 21091 19790 -2700 7729 -2628 -32779 -38012
8149 -38012 7021 50308 78155 61592 123551 107801 22696 -19498 -6951 -41347 -102580 -78267
8137 -78267 17360 60575 26684 -21812 -43490 -73445 -31656 8853 -14842 -72360 -115753 -133766
8125 -133766 -102729 -2112 -2070 -6661 -8876 -37916 -101613 -99727 -92795 -79108 -6544 20527 -16889
8112 -16889 -20499 -71898 -107207 -114417 -76549 -72783 -82284 -86540 -94263 -50135 16319 65917 48356
8099 48356 14271 9071 5384 -51205 -33202 -4249 17016 8570 -26297 -12481 -9533 3675 61263
8086 61263 62818 67586 24832 58234 -1965 -109238 -114156 -67006 -65373 -75030 18237 53521 90765
8073 90765 55384 66856 70605 37891 35969 63976 13247 11371 6676 1656 -14866 55 35880
8060 35880 -41207 -88226 -50956 -83404 -89875 -66816 -20540 8417 29630 24723 2156 -63674
8048 -63674 -6496 20139 51144 55557 -1764 -29702 -45456 -26946 11490 18896 -29672 -15249
8036 -15249 600 -11768 -41112 -69688 -51569 5083 14967 -74624 -89145 -109096 -78601 17792
8024 17792 64151 31112 27035 42781 25478 -48291 -45771 -27062 -2270 38782 36731 -134
8012 -134 -26286 -36608 -6738 47561 121924 49870 -28783 -29036 -7486 6314 -24134 -61571 -75725
7999 -75725 -37309 -84751 -115435 -86999 -24584 -43299 -40968 -16340 -91038 -115325 -38090 -354
7987 -354 -24014 12815 550 2434 -10465 -12569 36872 -4398 16450 8938 -19442 29295 96797
7974 96797 72982 20861 91184 102235 55322 71061 106818 136632 138012 120863 50015 60340
7962 60340 44836 26429 12043 9362 25452 68996 70017 17206 46303 48738 22205 20095 36292
7949 36292 -13838 -903 50666 65158 92809 79883 12116 3756 27092 44547 30916 -72009
7937 -72009 -122297 -68741 10673 65001 43239 -12442 -13402 36093 36345 23852 7561 -1536 49426
7924 49426 64416 41387 -24097 -49887 -67650 -69862 -72708 -110894 -121445 -169527 -98956 8519
7912 8519 27622 49621 18216 -55242 -66212 -83168 -77269 -104042 -138013 -26264 75991 87474
7900 87474 63825 28578 68202 95940 23703 4849 -67165 -59441 -21756 -5666 -36049 -61812
7888 -61812 -70104 -64767 -95637 -110385 -85238 -77026 3165 -14216 -49663 -52536 -15371 20923 39506
7875 39506 -12334 -83332 -61473 -27434 19447 32953 -524 -30195 -28312 1842 28216 -16452
7863 -16452 -11767 -28874 20783 19188 43594 61919 86575 48886 -20093 -5240 -22347 -53609
7851 -53609 -30757 37946 64046 46815 8695 -16367 -43350 -3997 -8605 -4447 28466 48047
7839 48047 60571 8089 -20563 -29637 6536 10152 12085 54936 11802 -12085 -30733 63420
7827 63420 87522 81718 27231 8213 19941 -7719 27181 61833 -3161 -37975 -42628 -8386
7815 -8386 -27087 -38795 1572 -37251 -85325 -74747 -54648 -59978 -43683 -25597 -87328 -107721
7803 -107721 -61263 -46319 -29399 9212 56703 69909 -13965 -10597 13497 -39099 -76444 -91204
7791 -91204 -54531 -90361 -107485 -111628 -65887 28385 38503 27038 -21392 -52388 -54797 -59288
7779 -59288 -32950 -37944 -43729 -71102 -72544 -52899 -9612 -21886 -20500 17953 32980 46445 94089
7766 94089 290 -82687 -103767 -38832 76659 48240 -20722 26997 39798 26796 -11360 -3283
7754 -3283 -18904 -61387 -46721 -24610 15539 35042 7618 -8916 -40311 -49201 -71612 -147638
7742 -147638 -142640 -157257 -151185 -90435 -54542 -55041 -62303 -9771 43108 -16578 -6915 -14601 -1613
7729 -1613 5911 21507 103181 93344 85441 104833 87736 76721 48241 30528 18162 -81 -23597
7716 -23597 -46236 -47355 -37707 -3543 35605 -26596 -10915 -15586 22273 31714 -32774 -94321 -114440
7703 -114440 -122282 -90903 -28333 21891 54046 85511 32114 43854 40487 34988 -11610 -58965
7691 -58965 -70002 -66711 -77038 -81667 -24774 25888 40271 11162 76723 90657 66288 -206
7679 -206 -60116 -35391 13635 59764 86910 118919 81539 30497 53621 74633 92323 85626
7667 85626 54654 83939 122980 127138 83285 58198 43280 -33884 -35975 -52708 -22444 -19143
7655 -19143 -39395 19073 24215 -93529 -101496 -106510 -65593 -57740 -45598 24598 68140 33554
7643 33554 27433 38074 -7666 -56143 -54653 5680 74815 65588 -8281 -20927 -47212 -94116
7631 -94116 -106966 -92177 -66332 -8180 17492 -10940 -1217 -71837 -49145 22898 -45430 -64675
7619 -64675 -31993 42939 68506 65062 34331 113409 144492 88543 75997 47769 59714 57541
7607 57541 68610 64399 1146 -68226 -72423 -54419 -9232 77556 86740 61222 26356 -14000
7595 -14000 -38606 -65727 -83437 -49260 -24416 -19398 4329 -13916 -48417 -100186 -114952 -110723
7583 -110723 -72652 -88697 -82953 -8203 -19362 -33034 -3627 44227 36480 -18641 -39431 -55454
7571 -55454 -81791 -45211 5492 -5709 27601 54686 -4506 -44047 -51008 -48115 -60373 -34463
7559 -34463 -26215 -55929 -85372 -83369 5390 42396 40739 4640 -22693 -9969 9734 19992
7547 19992 11262 77958 61138 7746 -16819 19250 -7989 -11210 -31067 -37564 495 -16148
7535 -16148 -76043 -31378 54150 21064 8235 32183 76502 107481 72496 22430 -39571 5078
7523 5078 36945 -2500 -47355 -34676 10202 2868 14531 13199 -11064 44521 16971 22555 46532
7510 46532 66230 74633 32185 29612 69084 77214 92735 75569 39187 25327 40780 50707 70538
7497 70538 96694 81826 54020 47728 41284 80266 29273 -28 -12403 41260 59717 63516
7485 63516 58589 2318 -42651 -19969 -26765 -109714 -108327 -40422 -40467 -105643 -148042 -135577 -82631
7472 -82631 -77695 -24656 -10774 -31923 -17303 -6759 45255 43391 23350 7898 29209 48786
7460 48786 25786 -2804 -28393 -31201 -3178 60651 29612 11322 31644 -3578 -22069 -13986
7448 -13986 -17166 52980 -3190 -7613 4729 -594 -40139 -72588 -54510 12465 -13760 32651
7436 32651 86666 82712 72330 108837 101404 81906 69253 11626 -44505 26999 100764 125356
7424 125356 104005 39190 15279 40260 29322 61318 72194 30649 33631 36930 -34221 -105567
7412 -105567 -144311 -137517 -62078 -8606 56723 45757 -36855 -38625 -23588 -53169 -34089 -3103
7400 -3103 -4879 -886 4979 13866 -1146 27548 40834 20662 -9516 -52336 -28477 -26140 -63892
7387 -63892 -14083 30129 6301 -57620 -71285 -96481 -83463 -71151 -67601 -53400 -51938 -28890
7375 -28890 -41805 -74475 -99798 -72723 19613 56001 -27185 -57862 -49938 -8931 67323 106271
7363 106271 19526 -78317 -65594 -81430 -64325 -19989 -21401 -21786 64614 69699 69497 15795 -98797
7350 -98797 -52917 -39146 -34701 -35648 -14766 -22397 -23085 -186 62513 63733 63760 49233 53221 87978
7336 87978 143659 176764 69143 -48753 -5792 6389 17385 11617 -9075 22157 90979 126994
7324 126994 106438 1983 -63312 -71826 -103560 -123419 -155104 -92219 -4918 32751 33370 23645
7312 23645 16267 4342 -48933 -52426 7879 -1804 7397 9629 -76693 -90200 -130142 -121956 -52393
7299 -52393 5915 -20048 -57936 -66138 -4811 16483 -7909 60482 22198 -1115 -25811 20008
7287 20008 96314 87203 -1255 -38647 -57961 -63255 -41892 -27234 37500 13187 -18949 -5317
7275 -5317 13523 -41820 -40613 22605 13010 -11493 -26405 -55926 -32043 29911 53275 36805
7263 36805 29518 52377 86197 90517 103517 109995 99875 123802 33241 -38997 -52438 -42027
7251 -42027 -69801 -50834 31134 -5126 -21106 25280 38153 -48655 13743 19037 46779 23065
7239 23065 -30106 -73720 -34136 45567 15962 -15895 349 -15305 -61294 -59914 -54577 -31779
7227 -31779 -21769 -33524 -64546 -73403 -63162 -53105 -48654 -35360 -14005 35547 30186 24473 15609
7214 15609 31119 18972 -5778 -61035 -52846 -19531 -23727 -30656 46001 58405 56981 54977 66451
7201 66451 91703 98755 57414 66847 72443 98127 101357 120947 91569 33881 -32207 -46301 -38406
7188 -38406 -33602 -41462 -21271 -16160 -10879 -4350 2115 -13791 -17793 -2406 -39487 -124553 -109352
7175 -109352 -53140 49083 43944 24348 16320 -10508 -89649 -143506 -32378 17957 54434 62640
7163 62640 35527 -6488 53367 82204 52751 46219 22429 -14444 24643 107585 136899 108336
7151 108336 133354 60545 -33399 -48215 -39666 -60790 -17841 -111241 -120919 -85299 -66592 -89893
7139 -89893 -93499 -66123 -60564 -52330 15526 33586 50478 43809 -23174 -90846 -108305 -80371 -64993
7126 -64993 -82339 -60813 -81592 -35784 -11308 -3065 87340 111819 28027 -41148 -32305 -2292
7114 -2292 -19798 -41582 -55644 -36479 -24558 -17055 29219 -30002 -25512 11224 14156 -15468 10721
7101 10721 36067 13260 -7245 11407 48309 -25318 -53707 -40840 -23610 -13451 -56967 -56756
7089 -56756 -84132 -50992 17879 41723 -6658 -54028 -1855 15510 -15449 -27695 -6135 -5604
7077 -5604 37542 46679 -19052 -59998 -30816 26709 36803 -4020 -46123 -46666 -33793 17721 8763
7064 8763 21488 63140 140678 92314 -5619 -20929 -44837 -4812 21543 11539 26203 50491
7052 50491 19058 -23836 18343 24155 43834 29717 58173 24871 -15138 -11735 16977 60951
7040 60951 70536 111859 49640 -58044 -76053 -10877 8928 1814 15800 5806 -1251 8744 32057
7027 32057 59836 67241 15784 -17560 -50215 -69732 -27561 5851 45160 -2106 2993 26072
7015 26072 176 5984 23333 22184 34244 72630 137217 178850 171152 121086 63466 -52145
7003 -52145 -66615 -60649 -93923 -117337 -22181 -11373 -35934 -45550 -82875 -40746 -31060 -19836
6991 -19836 -36929 -11238 40723 73440 114884 119391 95948 391 -48711 -116175 -143992 -163888
6979 -163888 -147426 -60855 -38320 -29145 -44073 -9661 -2983 19501 19809 46320 16926 -8794
6967 -8794 2721 -44988 -96039 -14552 61155 41782 6990 30457 26506 24370 3656 24386
6955 24386 42446 28070 -36328 -77980 -63809 -12912 -20295 -24331 31760 77123 72562 35116
6943 35116 22292 55250 59473 38247 68929 37119 -11281 -48173 -13638 -8605 -54738 -38567
6931 -38567 -30432 -22210 26167 59577 53340 77326 97744 65660 57069 37175 21024 27005 -41492
6918 -41492 -44709 2423 22297 -57399 -65237 -64897 -59447 -77163 -133592 -124472 -54796 -47177 -28757
6905 -28757 -35879 17412 24353 -16642 -20500 9078 19767 51425 88203 102256 83533 19354
6893 19354 14532 -9180 5509 13875 -1341 -16965 -6551 9823 2208 5226 45724 81499 67207
6880 67207 41276 17360 29686 54687 82987 72311 72074 60638 52885 33856 25935 30313 -45259
6867 -45259 -70135 -18243 18867 13402 76147 5838 -72568 -62921 8257 29653 65486 66159 35584
6854 35584 5704 3174 56806 35160 24021 55310 -5430 -18203 2220 11419 -39044 -52344
6842 -52344 -92971 -112564 -147644 -118831 -46769 -76622 -112563 -56978 -47496 -39393 -20115 -19407 2125
6829 2125 8186 -13658 -60370 -41282 -39108 -67188 31708 114766 89901 7245 46836 81406
6817 81406 103282 68771 69387 99758 81494 43098 -34869 -73318 -47016 11829 5341 -19784
6805 -19784 5853 -1571 12727 -21330 -23504 -25876 -13122 146 62120 98556 97133 89447 115727
6792 115727 103707 73462 6301 -6493 20666 -3900 -89326 -74464 -36321 -25720 -47844 -45859
6780 -45859 14314 -169 -14286 60496 90966 54014 11923 44392 1164 -67491 -46739 7700
6768 7700 48296 24566 20614 32847 -10042 -65408 -3190 41520 -21167 -38477 -27504 27108
6756 27108 -5619 11379 44884 66801 54747 74107 52389 62661 80760 89919 100252 49220
6744 49220 53213 -72614 -96067 -62023 19181 68808 50617 34353 21122 40303 38895 20685
6732 20685 -36166 -24485 1174 14166 -4299 -2542 12045 -28554 -61605 -46893 -17187 38509
6720 38509 50776 67623 72098 97365 109619 62373 8543 90629 142303 123734 83585 39852
6708 39852 -3403 -26867 -36007 -28871 491 58451 20231 -20484 -23503 -36518 -1786 26082
6696 26082 102086 155510 122986 91727 48407 10764 16741 78166 39918 -78428 -77552 -114060
6684 -114060 -102080 -56999 -52725 7522 -15790 -22570 6961 54691 102684 76886 2890 -79956
6672 -79956 -85196 -73412 -124220 -96134 -15276 13690 -5862 -41858 -49886 -33134 -24938 -15341 29250
6659 29250 8255 -7602 -58006 -99027 -114406 -168629 -108744 -15709 23573 33973 29476 -1866
6647 -1866 15488 55431 70841 54738 87211 93337 41890 -40473 -65966 10451 8044 -41990
6635 -41990 -61481 -35631 -31128 -46115 -22997 -38527 -26683 -53987 -21498 43146 63340 119969
6623 119969 54289 -31203 262 30749 59631 37886 -12438 -58322 -63304 -28932 -74284 -72059
6611 -72059 -36675 1999 -5309 -21379 -63600 -36596 -15764 -68551 -106121 -61826 -42436 8720
6599 8720 -10267 -9668 -42143 -30651 -19207 5944 21470 52458 18712 33042 -240 35266
6587 35266 -20193 -88694 -74519 -103505 -127244 -87796 -65088 -49896 53661 33101 -15175 -13262
6575 -13262 1913 9787 75942 72004 64910 40829 51092 100125 88849 39759 8401 19663
6563 19663 1827 -7508 -22217 25555 28998 52507 15779 1695 6925 8642 13685 -39254 -47037
6550 -47037 -55306 -12520 29320 63791 45659 30646 42364 28293 13319 41484 43899 64619
6538 64619 95614 121111 93890 103635 59410 82997 5135 39337 39520 -4662 -73781 -58154
6526 -58154 10830 118597 122346 37641 -32332 -55758 -46506 -50576 -144437 -130721 -133006 -144267
6514 -144267 -100438 -117558 -161646 -132820 -83194 -121659 -112731 -70730 -29008 -51372 -45376 -61476
6502 -61476 -40042 -50236 -69380 -29012 10607 26666 11393 -21632 -37486 -68832 -99810 -115831
6490 -115831 -137762 -134071 -74679 -32074 -38575 -57185 -72548 1440 23155 45775 13907 -7392
6478 -7392 17767 24334 43825 33678 18023 -18446 26766 1865 -5025 21975 68957 49515
6466 49515 -23764 -111601 -96460 -51027 -50016 -33607 4015 -16365 50807 32384 41343 15647
6454 15647 -59310 -78030 -56562 23381 55431 58744 52665 64012 67706 82711 62717 38721
6442 38721 -20255 -85121 -74087 -63235 -63982 -90669 -99737 -97499 -85641 -59334 -36088 -41636 -33848
6429 -33848 -92172 -116382 -35591 -42902 -24195 -20122 651 9164 35537 62968 52897 20590
6417 20590 59617 13940 -57071 -44723 15269 22001 -25828 -57859 -43820 6 16777 10383
6405 10383 -40467 -37224 11279 54436 50668 20598 7313 32826 51511 10706 20314 36531
6393 36531 22581 -11074 -47035 -80727 -65319 -30155 -49239 -8749 -13333 -6656 -50291 -7884
6381 -7884 -5435 -9940 31220 21482 14633 -5904 13905 10496 -7924 -19670 -2741 -10686 -40512
6368 -40512 -50739 -45254 7314 32297 11112 -34618 -75641 -157108 -166252 -160963 -28838 47248
6356 47248 26407 -27815 -38166 -27473 -8211 28610 44593 43568 25547 8886 43250 29157
6344 29157 -2731 -4846 52935 64645 16093 -15652 -63646 -59378 -25640 -83720 -81739 -36525
6332 -36525 -46260 -43996 -83278 -39261 32209 81932 57590 72117 92836 21340 -40524 -43927
6320 -43927 -20584 -19701 -34330 -70736 -56455 -103 50563 106374 107347 6449 -17344 13127
6308 13127 39852 44417 32545 -5406 -47722 -34140 1123 48712 61165 76168 85832 28919
6296 28919 1187 18407 -31966 -3139 12684 -69852 -21083 -13086 -48063 -87337 -46570 -14472
6284 -14472 -28729 -26821 -16657 -7147 29340 26194 -18326 -65283 -46921 1316 -1781 -8071 -70367
6271 -70367 -61767 -39874 -50177 -80500 -128154 -151471 -58405 45876 67792 -11614 22863 40123
6259 40123 60933 67105 97703 65935 19216 -48095 -51313 32980 71277 58296 12392 -7150
6247 -7150 -8665 6055 14571 9937 10666 58507 46937 27569 -2464 67 -6989 73085 111340
6234 111340 103924 61603 16193 -50394 -41431 -20457 10860 -6414 -33101 -48783 -20073 -91066
6222 -91066 -79923 -59913 -52421 -27037 -19289 -28360 -643 -22779 7012 65560 70142 75513 73565
6209 73565 17743 -38346 -22746 6256 -37452 -89472 -56831 14705 20579 -33371 -12726 24789
6197 24789 113956 68528 29782 14465 95865 87535 28829 -6123 -36902 -77392 -114626 -119320
6185 -119320 -133703 -76448 -57546 -10739 48863 36705 -24699 -69896 -17075 11241 40596 2972
6173 2972 -4726 -53180 -34424 -29913 -14962 22694 46475 79888 99562 100265 55111 -580 9410
6160 9410 -9788 -3900 -27000 -50327 -38759 -63672 -69967 -30658 -24219 -73630 -81741 -51770 -46713
6147 -46713 -57119 -6216 -9007 -102130 -50466 8075 3675 -1438 -42654 -28257 -16155 30969
6135 30969 44348 95584 56678 4797 3385 24511 3113 1212 -12599 -21269 -57975 -127901
6123 -127901 -55234 -21451 47850 58544 -54640 -76638 17340 17161 -9313 -38426 -9611 -49064
6111 -49064 -57759 -22652 1949 -56414 -66503 -90944 -105218 -88783 -37227 -2356 -47827 -40947
6099 -40947 -73926 -91405 -69120 -38031 -24576 -5641 36165 79975 79352 81122 108590 105734 69026
6086 69026 83819 38167 -61164 -97663 -72217 -30395 -20695 -48675 -79882 -33167 -4286 -32711
6074 -32711 -75192 -71333 -59196 -17193 -52669 -20422 47610 51202 53015 -2643 35001 42038 -19393
6061 -19393 18817 69005 92338 55398 41416 19734 -5782 28191 56623 42131 -22997 -26402
6049 -26402 -7987 -1193 -66497 -55983 6706 39510 7193 48139 63201 11434 -1002 41282
6037 41282 30176 199 -23863 -13855 -7885 -12137 8752 50428 4778 -61593 -67847 6674
6025 6674 47919 39636 12778 27541 48059 23231 -3305 -14964 -77328 -47874 -62266 -44215
6013 -44215 -16796 -9014 14056 44262 9850 22371 13579 8240 -22380 25472 31732 37613 11325
6000 11325 93678 110367 6088 57271 113650 107049 124689 68035 20385 22131 40710 40105
5988 40105 10764 41564 65540 34833 12135 -11580 -23693 -10920 83997 83973 97545 137197
5976 137197 139677 53602 -15008 -33813 -38280 -7362 12902 14331 -8051 -42801 -19818 -17481
5964 -17481 26577 2983 -53119 -25638 -30632 -55076 -87243 -104818 -105088 -84213 -51028 -4970
5952 -4970 62631 50692 -23005 -126833 -132468 -56543 36775 78728 104467 1478 -31461 -12104
5940 -12104 7108 88509 63141 -32208 -42406 -38405 19616 79098 87710 60460 36220 55454
5928 55454 -12723 -12842 -10680 57720 55869 31345 24049 19629 13869 62281 59910 -7574 -13681 -20597
5914 -20597 -53826 -12590 68643 35025 3683 20841 74089 24877 -24991 -86381 -77969 -90337
5902 -90337 -94379 -24280 -32604 -75849 -71854 -8388 -23124 -54036 -18204 -35702 -22578 -24353 -15724
5889 -15724 7359 8814 10937 27950 9424 -15682 11724 55200 36527 -17570 -77251 -99944
5877 -99944 -142727 -64794 -15221 -24163 29662 11341 -14040 -19519 -6456 6049 -31410 -45641
5865 -45641 -55473 -43001 -39323 -6106 21674 -7524 23544 28545 -61266 -70203 -40154 -89917 -122805
5852 -122805 -84683 27875 50442 21588 32263 -10431 -37175 -6737 -84648 -73183 -11762
5841 -11762 -39268 -90630 -127598 -161700 -152042 -140252 -119389 -40008 -19665 -31806 -24403 -22904
5829 -22904 -40395 21629 58294 26717 1742 11742 52010 89511 50154 22836 6134 24286
5817 24286 49494 34855 -11858 -26921 -1475 -5283 431 -44544 -37503 -14819 -679 -46451
5805 -46451 -55713 -29410 54480 110933 84777 37853 55939 68394 56368 -3169 -19767 30358
5793 30358 41814 11056 24949 -49435 -113819 -139586 -121263 -96351 -16015 33448 48325 4918
5781 4918 -85672 -73072 -36236 26241 15670 -19385 1444 -22357 -51854 -76434 -31556 -18244
5769 -18244 57214 98330 106033 106807 30457 -37902 -6322 -7992 18674 -8679 -36364 -2987 15553
5756 15553 -42115 -162712 -179126 -90512 -44504 -51843 -65457 900 34360 1385 -983 -16483
5744 -16483 17076 224 -40139 -16926 -46474 -68566 -20226 -18054 28854 54240 101510 152599
5732 152599 74532 -19904 -53177 -97882 -85881 -78867 -36824 -24215 17236 49515 70854 2583
5720 2583 10855 109495 126697 92405 118700 63261 -9029 7010 -72202 -83898 -116037 -137431
5708 -137431 -142673 -108158 -90338 -93957 -48230 10893 85986 32955 15668 9720 4180 14275
5696 14275 29337 11835 -23648 -71758 -52231 -15586 -13697 -25770 11441 59739 100318 127092
5684 127092 117079 65946 76959 89754 88431 46071 -17602 -29305 -30247 -18660 19268 58606
5672 58606 66626 49167 -12774 -18937 39069 -24559 -73029 -146663 -154080 -114205 -85771 -52600
5660 -52600 19405 -791 15294 5923 -6412 -32932 -20084 10140 17937 -45206 -34339 7843
5648 7843 28467 -7794 -48585 -68230 -66548 -15089 40846 -34600 -52224 -25811 12180 55862
5636 55862 104841 80298 44687 14141 -75356 -69635 -49315 -93719 -121502 -119050 -59669 -29810
5624 -29810 2909 33240 34156 -10016 -10100 -27112 17981 -6507 27253 -5774 -6474 8351 -72767
5611 -72767 -92576 -36259 23325 -23750 -32311 -25593 990 8173 -2128 -44569 -27674 -99817
5599 -99817 -72525 -25102 -8855 35114 2277 -33853 35533 32924 -4133 21506 34624 8586
5587 8586 -25339 8793 -22429 -18769 -11654 23225 70467 121950 96797 68793 30302 26544 -8787
5574 -8787 -35022 -39076 58530 138343 139158 140304 123488 112461 100900 121995 120443 73105 47534
5561 47534 45438 102003 27838 -29436 -105542 -126229 -114819 -92797 -93903 -38949 14412 55224
5549 55224 82301 68371 65375 44934 39705 20372 19186 82733 137005 106057 116133 115310 24191
5536 24191 -36657 -29603 8225 1921 -32453 -23905 40875 13168 -63195 -78924 -73906 -87171 -73371
5523 -73371 -49595 -2304 32041 13974 21859 13796 -3804 -6178 -32955 -17074 30306 -4702
5511 -4702 -39446 -50001 -77627 -21996 -30998 -61860 -16009 63600 65996 102209 157239 139882
5499 139882 147413 106930 23786 17031 -59103 -77143 -93498 -46565 5911 26766 1124 24025
5487 24025 28998 58964 55567 27591 -13284 -42266 7901 44888 41030 -13306 -65246 -66923 -57796
5474 -57796 -70467 -65013 100 25948 22075 32648 62009 46048 -29790 -42208 -95842 -97948
5462 -97948 -85972 -78252 -64123 -63291 -41047 10829 12474 57605 49359 39146 -7946 -16041 -15818
5449 -15818 11562 -10330 6402 -1560 8844 -521 -5145 -53970 -62106 -16303 13947 84314 102444
5436 102444 69649 50501 80332 86675 27578 10296 17545 -19296 6222 -23978 14888 41867
5424 41867 94841 76073 2863 -30601 50402 67812 32202 27198 9004 -41412 -8696 30805
5412 30805 45941 41102 18405 -7730 -20899 -59664 -64318 -38495 29999 65617 -6234 -56246
5400 -56246 -89988 -52624 -47199 -71133 -131983 -77283 -42482 -59516 -49447 -88824 -74317 -74623
5388 -74623 -47558 -16528 27185 -7140 4512 -40698 -69930 -49898 8151 7901 -59529 -96497
5376 -96497 -71728 -66671 -71031 -39211 -121600 -138999 -128303 -94712 -132396 -100455 -75206 -80963
5364 -80963 -59564 -5446 -71541 -92063 -83755 -45022 -19378 -66867 -132478 -123894 -40492 58992
5352 58992 93861 69714 34963 -11057 -28860 -17631 -6292 16256 -28297 -31867 15149 -3995
5340 -3995 -7019 -18224 -45118 -28986 -70782 -67855 -52485 -38532 -42667 -42680 -23411 20492 34871
5327 34871 85569 116945 60866 -13505 -47834 -49192 -5254 77333 42011 18941 -10198 -1377
5315 -1377 -24354 -67707 -70406 -57630 -54426 -58744 -34512 -23419 26147 -1120 -9581 -27240 -15733
5302 -15733 -3034 -40642 -33267 -33630 -7543 17901 32574 -5028 3737 49820 14386 -65160 -31442
5289 -31442 36336 29190 -52281 -45768 12724 46052 2112 -22101 -61385 -64221 -30973 -11854
5277 -11854 34315 51361 57931 56872 5507 -51934 -48295 -48415 -5174 -31983 -102382 -51891 -33575
5264 -33575 -63783 -99323 -69888 -45863 -64217 -67632 -19023 27909 9720 -14240 -27317 -54848
5252 -54848 -56933 -61437 -19843 67608 106829 75877 94147 46771 53502 63659 86545 91252 52004
5239 52004 -20183 -88299 -164005 -114615 22026 75896 70720 37308 52514 13434 -22986 -49771
5227 -49771 -47264 38312 67228 30101 28624 35976 23753 41498 92716 99340 28988 -11535 -24541
5214 -24541 46166 26066 44552 67755 24489 24231 1171 -44188 -24648 -47269 -107115 -117396
5202 -117396 -107070 -99044 -111262 -139847 -114681 -62278 -34297 -44611 -31008 -20345 -31745 -102145
5190 -102145 -91922 -87284 -62041 -25857 -105 31600 47080 84074 46173 -16259 -27050 -75627
5178 -75627 -72588 -18017 -30500 -72608 -109777 -69073 -47161 -84196 -105305 -33513 11752 13766
5166 13766 -55214 -100458 -54325 -43266 -55710 6212 -14196 -46543 -50162 -78997 -70773 -102865
5154 -102865 -111328 -86596 -63949 -87045 16448 68020 78889 70013 83902 110009 95042 8392
5142 8392 19840 26234 8200 -14469 -19649 -6008 -14809 -30784 -49281 -89711 -62584 -13015 47359
5129 47359 13138 -9976 11100 -61067 -118768 -108485 -133107 -117864 -43553 -22402 21204 50202
5117 50202 32923 5681 -31498 5123 -13229 -38822 -61984 -94387 -49183 11968 75966 58517
5105 58517 26446 42265 33749 2137 -59719 -44246 -4028 59309 96913 103204 97246 45715
5093 45715 5001 -14888 -64206 -69932 -109017 -96919 -68105 -34944 -64060 3114 -48434 -55601
5081 -55601 -22847 8885 5793 311 -14478 -41314 -76697 -50642 -4542 47405 93634 36743
5069 36743 -7374 14233 14441 4152 -16537 -42641 5666 75016 84263 20427 -17338 -45881
5057 -45881 11264 -5167 -46954 -102412 -75389 -35549 -34695 40026 61764 16946 -52284 -101340
5045 -101340 -2479 8933 -28851 -87570 -126296 -142303 -194784 -206998 -153633 -74540 -10132 20103
5033 20103 -1149 -31216 -17076 -18249 -4981 -10225 -24395 44008 70966 28008 17955 -22150
5021 -22150 -14263 14957 39871 38362 22303 -26066 -19545 37700 11481 -35468 -67591 -76605 -90037
5008 -90037 -34421 23396 47991 21762 -34227 -44170 5651 68502 38122 -4467 6747 21795
4996 21795 56422 36486 -6306 -7914 5333 66788 68202 78889 68721 120573 78789 22959
4984 22959 17339 59434 87481 25685 -44604 -45329 -32411 12938 -3910 4913 -35903 -40684 -15527
4971 -15527 -17629 -24828 -1953 14249 57435 63722 41498 20129 75028 99299 89957 16735 -29746
4958 -29746 -56526 3809 42804 33677 70735 73735 29666 -80476 -140449 -122726 -105811 -64046
4946 -64046 -89293 -83610 -42558 -36353 -951 -7330 -44290 -110577 -111730 -2096 67820 71454 59194
4933 59194 41708 17919 1502 -16988 4865 -21608 -33784 -55813 -88418 -91660 -64289 8455
4921 8455 52738 13688 50283 61591 50391 38039 25268 -5187 -72027 -98503 -72433 -67365
4909 -67365 -146128 -164988 -107136 -52939 -17617 12759 31614 -20877 -53087 -53108 -68579 -53878
4897 -53878 6173 59819 26939 -40761 -55828 -47492 -14957 3804 74390 47756 37132 56290
4885 56290 61785 93700 95313 35795 16837 104610 99300 85762 85784 13194 4562 35505 20082
4872 20082 -15240 -53902 -68849 -92581 -71911 -30500 -28097 -27789 -28705 -29298 -63081 -3397 91726
4859 91726 85442 49331 69318 91494 64048 14164 -3674 63305 105635 107761 49499 23461
4847 23461 -10161 -32633 -12382 -24465 -61084 -91694 -56116 -43755 -41992 -25853 -23756 -35085
4835 -35085 -35051 -22881 -43428 -25510 -35893 -75828 -86384 -87647 -56802 -28562 -7999 63356 58528
4822 58528 11631 28925 25714 55369 17518 44640 32179 76948 130015 131415 70687 -12563
4810 -12563 -88030 -60306 -12328 42089 -30177 -83101 -41395 17324 -39742 -99436 -76552 -87528
4798 -87528 -138092 -72065 -26366 29383 14445 -1121 56290 62434 27747 11052 -32030 -43090
4786 -43090 3083 -2866 -34397 -8662 72321 43087 -766 -6508 -13778 -8269 16392 145 -26741
4773 -26741 -64468 -62377 -15860 26875 4392 -15677 -29938 -53201 -52201 -59018 -27329 -19811 -90869
4760 -90869 -110821 -102382 -100054 -66541 -65280 -87577 -95377 -79350 -38339 6064 38230 17326 -58467
4747 -58467 -44229 -22961 28639 45932 57827 50301 44561 19262 18140 -7207 -12355 -23207 -5350
4734 -5350 19642 61065 45461 98963 37119 -9566 25727 35644 27029 27320 -21365 -40513 -17898
4721 -17898 -63828 -101574 -44328 -16013 -34894 -12669 4619 -24047 -67836 -93129 -123731 -91444
4709 -91444 -16926 33183 9776 -65368 -140307 -157865 -118040 -135679 -141671 -83262 -71107 -123050
4697 -123050 -90963 -13525 22590 39523 40403 64371 21585 20727 91815 92002 107646 98073 118628
4684 118628 127711 72816 46018 32004 14867 23903 104993 107490 32475 17694 40953 62941
4672 62941 45136 59418 48355 53656 44835 88855 54366 13079 -9296 75687 112394 66055
4660 66055 23934 2500 -34016 -15350 -20386 -51411 -21701 -19594 -30646 -33076 -78256 -128906
4648 -128906 -157449 -153699 -98164 -8421 6242 32063 29552 44192 87137 67968 15647 -29768
4636 -29768 -26845 34775 31698 32222 1408 -37414 -33440 16181 37768 42941 52336 67623 11795
4623 11795 -36363 -77583 -82752 -15338 37788 10136 55796 42318 23108 5223 5238 24040 24939
4610 24939 67644 72183 42261 32388 4319 51163 19669 -3218 -71479 -141397 -83936 -15465
4598 -15465 -49379 -100974 -83065 -5237 13955 30322 44462 56232 13047 -23547 -45319 -31524
4586 -31524 -44296 -54946 55214 84541 2243 -24121 2865 -21805 -53919 -64168 -77452 -68739
4574 -68739 -74499 -72687 -23341 1604 1323 -12461 18598 10895 19385 3496 15548 -839 -2964
4561 -2964 -13829 21382 37807 10212 13618 24283 74508 67149 7683 -47425 -73100 -52850
4549 -52850 -8529 -14595 -19450 -63751 -92740 -85229 -72376 -41878 -80090 -26484 5 24793
4537 24793 53277 13966 33418 70143 58860 54287 77795 122875 113118 70816 48572 21424
4525 21424 -56200 -104535 -69484 12245 27501 1463 75699 124355 26917 -31446 -6410 2699
4513 2699 52182 101977 145428 96175 66671 42296 772 -7252 17484 34517 47205 -284
4501 -284 -14425 17858 -15773 -26405 -26193 -16009 -70379 -97051 -140032 -137453 -55663 -33429 -13798
4488 -13798 4093 56918 -4322 -89270 -128272 -137528 -86211 -35393 -101566 -167358 -195417 -157551
4476 -157551 -36998 -48813 -7682 17122 69180 -14287 -54338 -63614 -118888 -150509 -111184 -106090
4464 -106090 -49961 36057 30567 -31560 -67180 -70150 -2142 26139 -9446 73240 65200 -16095
4452 -16095 -58540 -49841 -26308 -41957 -4134 61715 65510 60659 -13595 -12256 -2292 23631 65064
4439 65064 -65772 -86445 -34435 -17553 -12700 -10014 -17727 8764 18797 -50883 -59208 -68384 -16204
4426 -16204 59735 7687 -47346 -68908 -58929 -11088 24939 32766 15979 24414 35112 39530 -646
4413 -646 -17560 -11662 -22416 -11386 21819 -15153 -52730 -95215 -38016 12209 15109 20094 32889
4400 32889 -42345 -122888 -131402 -105919 -63173 -20002 -11249 3211 -40730 -71683 -63790 -49844
4388 -49844 -36773 -46882 -38375 -42830 -2661 -36234 -92067 -56728 -38411 28226 66118 21505
4376 21505 -21155 -60252 -69110 -14190 -10395 -17720 41343 65521 101198 52879 30408 32591 58576
4363 58576 10197 -36242 8803 26840 4311 26916 109509 78753 20191 -22863 -51487 -72920
4351 -72920 -67773 -90589 -94650 -36006 16579 11066 23781 42514 -8355 30872 63300 39532
4339 39532 33796 83458 127430 79609 45879 46454 9426 -15913 -1739 54821 63599 59003 39490
4326 39490 -1073 -33281 -38464 -58746 -26807 -33812 -53553 -20915 -13352 -4579 18352 -45337 -71011
4313 -71011 -40536 -28987 5943 33196 16779 -16986 -1725 36955 -44139 -52697 -38978 -50733
4301 -50733 -13767 -37845 -58894 -55233 -13814 27174 -48845 -28090 -6417 -57056 -55343 -7372
4289 -7372 -12938 -24748 31654 50056 16639 -272 75346 54713 51017 69039 109715 71370
4277 71370 64156 71093 53749 25768 40821 -24397 -30992 -61555 -134420 -112378 -91236 -63743
4265 -63743 -38596 8214 6768 26635 48065 72621 117587 130485 91396 77089 29523 -3528
4253 -3528 -31034 -1607 -5619 -89384 -85204 -83658 -54693 -42370 -25115 3642 22435 44836 49965
4240 49965 -10587 -46428 -54137 -21516 36977 105013 78535 40799 13534 -13327 -40322 10227
4228 10227 19055 70572 106983 42018 -60081 -20720 -17110 -68894 -50644 -26399 -56045 -43585
4216 -43585 15587 4666 1861 57785 88381 101927 38555 47417 67631 57011 34831 -26984
4204 -26984 -13159 6786 -21758 -62384 -51256 -19100 13077 80471 80236 49526 5525 -9616
4192 -9616 -39057 2403 -22925 -12611 -21542 -29865 -68335 -75541 -22921 14230 -7268 -52101 -11439
4179 -11439 49216 5008 -22482 -14312 -55902 -19278 17200 10185 22025 -1383 3762 65736
4167 65736 44785 -20023 -95444 -130390 -84296 -77291 -24669 17151 13806 40431 28365 9517
4155 9517 35910 27508 22721 33822 -33389 -57927 -19032 -49848 -133769 -131312 -80661 -94210 -80120
4142 -80120 -44686 -87612 -77016 -84499 -61900 -72258 -63917 6697 65504 41888 37869 33019 -25767
4129 -25767 -53132 -84799 -120103 -86710 5699 24361 -68 -52441 -68112 -17618 10952 -5326
4117 -5326 -15688 69950 29865 -56211 -73492 -40003 -32549 -11269 18644 18789 13855 -7341 -8723
4104 -8723 50665 54326 75411 103705 126566 153780 60251 55646 28197 -71994 -132777 -73625
4092 -73625 -43363 -47194 -24129 -37182 -71601 -36882 -3466 30283 38486 -18294 -16770 48588
4080 48588 62593 43628 78550 141536 153625 139046 124175 45381 1201 -8 713 13065
4068 13065 12036 32177 -23844 -24895 -30175 -60674 -72833 -77008 31441 44430 56079 44508
4056 44508 33457 64182 78983 86954 84142 37359 7332 1 -24222 -20517 43828 53885 3378
4043 3378 -9827 9022 22123 49585 88189 78097 28415 -11999 25740 38430 -21697 4693
4031 4693 36912 -9532 26843 19674 -22850 14415 -10944 -19316 20502 18625 146 -11948 -12208
4018 -12208 -81105 -108681 -68433 -76503 -52812 -15435 1511 -40492 -63169 -19309 21012 -13906
4006 -13906 -15609 -4885 15995 -15189 -21571 -64422 -42999 -3593 14982 38516 -907 -62206
3994 -62206 -57547 -7939 74608 107065 61840 12392 37789 24429 7621 -4647 -18389 -31496
3982 -31496 -25104 -40325 -93082 -87627 -96456 -114943 -51639 -28369 -88534 -121467 -99206 -72411
3970 -72411 -46083 -47061 -70905 -60218 10132 53332 33750 48062 76558 44338 -4097 -23682
3958 -23682 59514 104894 106245 115919 84264 26981 58553 71161 72770 38098 62153 104753
3946 104753 66424 27971 9065 -29374 -16226 -44126 -59830 -25829 40945 51684 52190 32903
3934 32903 66013 84463 98013 75254 77188 69232 52608 44567 62943 70474 23367 -15932 -98782
3921 -98782 -84734 -14764 37040 63102 109037 110022 126754 118918 152955 108019 968 -76061
3909 -76061 -30427 38378 70805 57378 65660 57501 34409 -12978 -44030 -1219 -10 -3371 26572
3896 26572 50655 69971 43986 72994 55844 24744 -66716 307 32531 -4545 -4901 -14708
3884 -14708 5189 -25782 -70898 -46803 -44945 -80030 -74029 5713 75410 12892 -14410 28143
3872 28143 81431 108120 52233 -291 -11689 -5412 -21217 -15867 31415 67629 43516 -1180
3860 -1180 31472 11913 -37656 -83415 -129191 -105603 -79127 -38586 -56641 -6013 18754 12422
3848 12422 12128 2285 -23877 -15968 51913 34528 -12654 -51256 -92697 -70695 -32713 -9749 59888
3835 59888 82321 109815 -113 -60031 -40085 -28359 -11993 -4901 40904 69455 5891 -26923
3823 -26923 -71771 -64803 -88803 -71202 -97717 -40187 40788 74164 63162 -14222 -33271 -15796
3811 -15796 59005 67153 -3970 6110 -13476 -52529 -12719 11561 21933 73324 129675 166035
3799 166035 216469 145024 55608 21148 31761 52335 71619 34156 7985 36108 49481 -8869
3787 -8869 -7443 -4723 36955 41570 61272 85949 60703 46632 38283 43992 32888 41867 -2094
3774 -2094 -7203 -36636 -14923 7268 18364 48203 39929 18461 49849 128192 161672 159384 154676
3761 154676 118091 119408 95736 89590 70640 75591 87699 33256 -42979 -26147 -2570 30859
3749 30859 7950 -60401 -90577 -58731 -48456 6413 37200 25715 43492 90928 98520 7671
3737 7671 -15628 16007 -14352 -9960 32085 25015 27623 51611 68066 20681 3570 54629 -5903
3724 -5903 -22293 5199 45355 46148 45717 1205 -58715 -80716 -4877 -50930 -69428 -34359 -13067
3711 -13067 -5795 -14771 -31546 -32329 16118 19160 -33671 -43570 -45200 17006 40830 36239 2224
3698 2224 -9375 -31587 -102766 -123069 -87519 -77055 -107868 -104914 -41975 12030 28288 -1467
3686 -1467 -38706 -74204 -50207 38623 41009 67064 27025 50555 52772 71864 55150 13811
3674 13811 -9776 12261 69686 80832 48589 30458 16684 -24021 -66511 -68263 -52955 -37845
3662 -37845 -42235 115 17722 48363 -10381 -25941 -12279 -4830 1868 35162 5635 22003
3650 22003 51947 25793 -85978 -87117 -61012 -22701 15146 27209 54552 69934 114148 96100
3638 96100 68197 51359 -7205 -28200 -19974 -3805 21201 32493 82849 146599 160637 101771
3626 101771 104682 88173 42337 79690 54704 40586 75682 16037 -28863 -31820 -76937 -73935
3614 -73935 -157135 -176655 -129681 -99368 -118442 -102603 -17269 14964 74027 98756 59586 40045
3602 40045 11422 650 24603 71556 54857 17188 -21044 -32588 55376 65697 44990 9332
3590 9332 7087 79873 77755 55893 47969 -23901 -58728 -38837 -1601 17669 -30727 -60728 -74554
3577 -74554 -61748 1869 26813 41955 50522 39138 2407 -17565 -41926 -38878 -61501 -44843
3565 -44843 -23902 -57007 -127690 -133411 -19496 15787 28837 26710 -9393 -16612 35168 81912
3553 81912 72700 33093 44119 95660 106296 50012 -39634 -76457 -73052 -93789 -58636 14651
3541 14651 7458 -22215 -6409 -25561 2127 33788 5149 -22887 26756 51199 33905 22233
3529 22233 -4416 -57876 -59580 -55271 -34591 -14666 -4661 -35638 -43669 -34108 -15711 -21806 -27236
3516 -27236 -12618 -22671 -38761 -84592 -38314 31517 32134 -16868 -84586 -137583 -119048 3917
3504 3917 44893 20663 -6278 -99740 -116613 -111504 -132404 -69934 -10101 17708 78576 48339
3492 48339 31849 48633 40441 -15532 -26643 -22625 -15460 -106686 -118171 -82764 3940 4423 34903
3479 34903 41260 59972 68432 47477 47660 66533 40734 28642 9965 -65098 -38468 3837 15901
3466 15901 36113 24383 43847 122280 80515 53957 -53017 -109189 -70433 -55963 -12602 -30133
3454 -30133 -24798 4469 -27753 -72170 -33028 -9082 47930 37862 -3948 -40897 -15541 -33508
3442 -33508 -59778 7795 33549 23829 41372 84790 51562 719 -24882 7102 10618 -17508
3430 -17508 -9341 51303 36166 32675 13422 -19657 16894 26978 -22306 -31358 -57484 -116659
3418 -116659 -132948 -71867 -2995 15975 -9748 10968 -4085 -31070 14471 3220 -33453 -11286
3406 -11286 5914 46278 37058 31427 17612 33807 48581 -43758 -31450 -735 -8202 -11285 -13091
3393 -13091 -61621 -68718 -74735 -103876 -96541 -79298 -31544 -29967 -49844 -60803 -95504 -162208 -174184
3380 -174184 -168634 -104773 -76541 -77754 -106755 -92626 -96898 -102798 -66241 -46345 -78164 -60147
3368 -60147 8241 -19712 -31981 -2958 23845 -42566 -75028 -57171 -50627 -48469 -1154 59285
3356 59285 36866 -11491 -16956 -78617 -90908 -129135 -99579 -60187 1819 -30877 -82037 -53498
3344 -53498 -71706 -42451 -31071 -10788 18027 51846 100307 52495 1785 -11105 -37155 -44226
3332 -44226 -30857 31052 79969 81975 52513 30544 23869 34630 57527 66833 76018 67781 67323
3319 67323 95914 97518 79395 127281 123418 68278 70747 13258 16453 40742 15828 -50363 -32969
3306 -32969 8747 25338 33478 32827 -20351 -13721 11650 -9864 -11816 -37974 -54884 -5202 64487
3293 64487 66163 32231 -1753 -38920 -69749 -69584 -63364 -80265 -88039 -67488 -89995 -156592 -146066
3280 -146066 -69487 -32265 -84208 -23746 71244 117759 81369 94067 90594 96539 44765 -4896
3268 -4896 -20795 -57399 -1978 15832 -10744 2180 6276 -11253 -42849 -41755 -8248 34854
3256 34854 71052 -17283 -40046 -8231 -44228 -45915 -39046 -51966 -21318 40921 13338 -15391
3244 -15391 -33930 -78489 -56245 -51998 -71948 -34764 -34785 -15299 51653 75221 46869 37111 62446
3231 62446 58806 48152 27089 -8225 6426 10323 26293 68498 99948 90708 97470 87951 58726
3218 58726 42239 64735 68860 37725 -17224 -65966 -22713 -8832 71179 89107 64104 53335
3206 53335 28827 1200 729 -7561 -36013 -25235 -45516 -43864 -17474 13446 168 -35895 -10923
3193 -10923 18209 55973 32175 -36978 -83638 -78617 -91573 -48028 -30731 -49673 -31577 2321
3181 2321 73060 29494 43041 38809 36514 12881 4181 36919 82750 49147 18585 -25351 -25278
3168 -25278 71613 48049 19651 -5033 -17087 -22630 -34934 -78556 -51675 -29753 -34554 -17041
3156 -17041 -48807 -61805 -30198 -11418 19155 44440 41768 -33332 -90373 -37417 -85381 -97639
3144 -97639 -64695 -55714 19094 -10806 -33542 -91191 -73537 -39393 -10722 -11519 -77311 -85451 -117931
3131 -117931 -127236 -119513 -94990 -97117 -98870 -133954 -141500 -54712 33997 53810 27211 16452 46763
3118 46763 16242 21981 -27211 -19742 27131 62158 54300 32703 -17289 12211 13772 18790 22153
3105 22153 50231 18059 -26455 -69592 -86024 -70283 2673 41322 -18570 -66917 -15930 -10542
3093 -10542 14672 18631 27568 76695 79152 70946 51614 8631 -15595 5082 50956 42094 -10944
3080 -10944 16325 88054 106020 34565 22508 31301 -5068 -16372 -6247 -46306 -72741 -57961
3068 -57961 -77414 -87827 -85280 -5093 -25501 -102178 -99491 -75584 -131276 -98589 -69521 -30979
3056 -30979 -7018 -17382 -4514 -11459 -49935 -50625 -20786 -15618 -8491 41096 54435 37727 -30378
3043 -30378 -28028 -28629 -68013 -80364 -26976 39340 14201 -26111 -37565 7197 74641 100506
3031 100506 125723 179461 110121 47385 63327 44576 -748 -66733 -61445 -90698 -130836 -91747
3019 -91747 -4982 26711 52450 110428 97779 100196 131919 153470 160878 102718 112237 36486
3007 36486 7745 3873 2782 37409 53655 68785 33907 -27034 -21249 -13471 20616 14718 10120
2994 10120 -18990 -38603 -61706 -56952 1011 5249 29950 25108 16003 54278 34106 -8594 5668
2981 5668 58460 -15424 -45723 -106780 -119517 -88404 -102361 -70780 -22431 -4556 3379 22675
2969 22675 20144 20554 -6772 -9568 21987 -15817 -54022 -49342 -101840 -82095 -60092 -2435 24103
2956 24103 -24808 -24946 -18405 -36347 -6560 89412 108536 94950 73424 73902 81076 70332 79578
2943 79578 35813 14505 40464 71289 91547 61168 14241 5992 42845 46693 28557 -29435
2931 -29435 -32804 -38176 -67102 -72363 -77045 -3925 -10043 -19201 -3290 42161 59141 12804 3589
2918 3589 -25781 -28488 44742 5610 -34103 -116205 -127042 -131692 -108308 -60966 -55893 -12915 59757
2905 59757 42254 59317 75866 42387 -32510 -40097 -7643 10909 6918 -34023 -66950 -73020
2893 -73020 -7446 -10416 67534 59172 27338 -10693 -41090 -102618 -122770 -105414 -41281 -36767
2881 -36767 -9610 31482 8489 -4899 16097 23667 -4267 -23289 -19310 1450 2222 -43354 -55427
2868 -55427 -38439 -79223 -64805 -48965 -41488 -2712 2306 -22858 17691 66606 126626 101365
2856 101365 98062 91327 134159 158857 120361 99243 42905 -14935 -36492 -19780 10799 67899
2844 67899 32661 8041 19925 285 39106 38858 -56048 -62334 -46466 -41624 28755 42159 16843
2831 16843 8897 101234 126028 83267 24685 15231 -34342 -37924 -19333 -4713 3957 -16491 -21242
2818 -21242 -4641 -43280 -36523 1455 -27302 -68441 -62195 -48352 -44963 -48253 -32518 -60826 -62190
2805 -62190 -11967 -6405 -38505 -62263 -28561 -5660 7718 97120 121127 110834 99256 73004
2793 73004 31722 -1930 -24207 -52640 -38891 -18241 -94828 -73778 -47236 -79238 -78848 -23362
2781 -23362 -28756 -36270 12954 26415 10025 -3192 14280 -59844 -135920 -111127 -96664 -36949
2769 -36949 -74069 -23980 90598 83823 57310 17513 -20511 -53503 -44989 18935 24447 -10863
2757 -10863 -40650 357 55733 12729 45419 15001 -22751 -10655 27576 55323 36816 18340
2745 18340 -291 -17224 -5482 14670 40512 73535 54715 19784 38102 9710 -13684 -40846
2733 -40846 -70178 -35004 -10250 -81326 -116266 -76988 -85159 -112657 3683 58892 54466 57231
2721 57231 37335 60211 53556 10280 24148 95471 65270 35996 -8016 -29900 -25472 -6726
2709 -6726 17380 70340 118531 91459 18178 -33312 -49413 -36466 21526 64783 27109 32088
2697 32088 50211 -43723 -70336 -37860 17089 10979 -25851 -34170 4787 30895 -31524 -650
2685 -650 33492 17681 -11837 14189 -1329 -73246 -68618 -71332 -34892 32972 27072 -8937 59120
2672 59120 35399 -58562 -17245 -23082 8574 -17514 -11611 13865 50045 75630 14901 -28758
2660 -28758 -117391 -119292 -62182 -71366 -38072 -9124 -4294 -4779 -41018 -98404 -57141 -19625 53527
2647 53527 81582 85921 16637 -80491 -104007 -39838 38839 20706 -8850 -22792 -21878 -72647
2635 -72647 -118995 -68315 -15732 14902 -13815 -24334 -7258 -18582 -26763 -62112 -70821 -27078
2623 -27078 23433 -1176 47372 112977 33419 -53454 -80236 -75109 -29465 31449 26956 31110
2611 31110 68491 86384 90206 -17584 -71668 -181 21057 -22212 38154 4434 -51230 -116488
2599 -116488 -86356 -35512 -40101 -18396 9277 -5209 -3134 -43515 -54346 -74069 -37225 -6292
2587 -6292 16718 33418 10545 37446 59614 87808 58214 32630 -38270 -84517 -13207 -38591
2575 -38591 -36235 3250 76992 39032 -16710 3914 94870 45906 15205 -13243 -9646 -25906
2563 -25906 1851 8017 56704 63338 74427 107085 119588 71529 56790 56845 88077 28856 67966
2550 67966 75315 23446 50375 123107 137202 128887 91381 34846 -25432 -50401 9427 23186
2538 23186 54071 62899 -6975 -8237 48457 18055 -17746 6384 38155 75939 60786 -21985
2526 -21985 -44615 -45664 -81845 -105052 -93064 -94460 -96143 -65900 -33373 -13706 2938 -14839
2514 -14839 -26792 -64010 -36861 -76961 -48776 -1688 -12542 25630 60184 46859 -4224 31609
2502 31609 34722 -16201 -54529 -12816 14671 52785 85983 41107 -7102 19997 16600 10011
2490 10011 -1700 11262 3649 -60874 -28988 -1783 7787 16194 43179 -12517 -46955 -55404 -85199
2477 -85199 -80439 -43245 -9777 18179 -18919 -107059 -25982 27005 33593 28644 34102 81970 88547
2464 88547 103003 102590 95749 53210 -14609 -11616 33871 28199 13217 29006 18658 12771 -12186
2451 -12186 13544 17511 5038 26592 -28243 -75109 -101713 -58607 2783 36196 13222 -7556
2439 -7556 -9017 -13637 -20309 -50897 -118582 -92482 -69319 -63763 -64602 -38720 -30789 27010 65609
2426 65609 606 1050 -14731 -32054 -112376 -60526 19289 43031 19340 25887 37018 61906
2414 61906 94092 95032 52221 51016 116192 75778 103531 112243 83470 64230 96058 72370 34012
2401 34012 39714 18409 42320 40678 6024 36629 62376 88414 88326 17366 60925 105799 32448
2388 32448 43679 46844 65617 94822 89769 110829 54978 -2673 885 25186 34583 19069 -47111
2375 -47111 -117158 -86524 -12621 39306 54861 31623 74042 78136 55065 35270 68762 57947
2363 57947 37428 37167 -8245 -56999 -19215 -45228 -70737 -24433 35692 57075 50310 16370
2351 16370 24361 -12232 -43666 -79204 -21705 39827 8560 -10318 -3009 43775 83650 53307
2339 53307 37574 50686 78400 90286 98427 154305 157238 102605 94694 167081 158818 133921 100603
2326 100603 55002 15145 9936 57834 31549 -52107 -88506 -43052 -29375 -48712 -46063 -57731
2314 -57731 -60855 56235 86648 15033 5 -25076 14667 58121 57316 44003 7021 74590
2302 74590 2551 -84017 -61558 2528 -28945 -22404 17999 -17500 -13726 -37331 -80321 -35028
2290 -35028 4204 67729 43196 -53861 -59902 -45208 -12866 -7539 -40011 -100235 -100991 -56652 1868
2277 1868 -21480 -12070 -39813 -64047 -84260 -83518 -51418 674 -25394 -20287 -17394 -29501 -21926
2264 -21926 7053 1789 -1003 84526 130936 91492 72698 70048 17050 50472 21637 15326 -4312
2251 -4312 -55120 -55066 -40326 -68529 -46634 -39741 -26821 -17846 -62011 -17396 -2057 -3159 -7607
2238 -7607 19185 -31025 -49624 -34282 -60354 -55133 -53637 -46181 -61728 -133325 -109245 -63631 -54320
2225 -54320 -18169 37630 -22705 -23327 -7983 51042 73472 100813 126449 106571 110619 138401
2213 138401 83463 22966 -1559 10907 -17398 -6004 27004 36697 27748 42656 16800 9213
2201 9213 -12018 -27169 -22396 -28398 -54950 -79297 -68362 -93729 -97473 -104336 -95087 -53803 -62425
2188 -62425 -89649 -90539 -92431 -87746 20474 132004 141284 76209 19520 17828 31228 55027 44031
2175 44031 -41790 -110540 -64658 -13560 36244 57859 95487 34536 1016 12680 8078 32621
2163 32621 -4833 -1957 5210 5088 44782 47974 -5437 2928 -19120 -48547 -106849 -106438 -78002
2150 -78002 -23542 -27037 -35805 -11426 -2599 -46085 -24108 214 38978 54748 75960 99456
2138 99456 49562 -21181 -37845 -53710 -68135 -64234 -28039 -50349 -68683 -23785 -49538 -10703
2126 -10703 -38494 -54685 -33226 -25799 23358 77106 45973 22805 3414 -26228 -77394 -45768
2114 -45768 -41163 -4040 35558 55726 51747 22127 27957 -2787 -15150 2025 6045 -42066 -69999
2101 -69999 -33726 23160 61433 42673 62706 28257 -49456 -90350 -105533 -44783 10991 35903
2089 35903 3235 -17567 -35254 -4385 14509 44198 39588 32102 -9409 -22428 -56798 -34141
2077 -34141 -28343 -7377 -38091 -7903 -60497 -88201 2541 -47996 -40848 -55504 -26058 -20242
2065 -20242 -47808 16406 47190 14436 -24322 -22170 995 -46062 -10344 -12947 55971 119416
2053 119416 107258 68487 96442 129484 128028 113393 96424 4796 -11691 -25068 -4073 -15366
2041 -15366 8028 41632 649 -57812 -111515 -80150 -80215 -103289 -81571 -15191 -18721 -31867 -24320
2028 -24320 -30979 -60834 -55507 -16564 7731 20205 -6947 -45058 -61117 -103797 -138500 -78654
2016 -78654 -70070 -96481 -99323 -25714 -51314 -31307 -20851 -32158 30177 57469 25237 -24745
2004 -24745 -16005 -35771 -43227 -2123 -49755 -28173 -19319 -36028 -27496 -28643 30991 60903 76843
1991 76843 72220 62753 -16256 -35735 2935 -34399 -55477 5819 23731 1650 16344 -66665
1979 -66665 -132901 -127287 -27616 4794 47950 80940 52093 -19266 -32637 4464 30978 104296
1967 104296 118720 7615 -80003 -63719 -4303 68645 45226 -25479 -60153 -69126 -87079 -123090
1955 -123090 -172443 -146317 -67874 39542 -4660 -46851 -9639 51492 84695 99922 145242
1944 145242 112020 54800 -28323 -147260 -130586 -71176 -34367 -21187 -33292 726 -18907
1933 -18907 -58820 -14133 49145 26308 -29046 -10248 -29004 -80661 -56996 -48715 -20633 51156
1921 51156 136557 67671 -20374 -60681 13284 89424 110442 64773 4480 -17437 -12838 1682
1909 1682 9809 12371 30514 9358 26465 4310 -20497 -33706 -10382 -1463 -68212 -44667 -7413
1896 -7413 14510 2205 -39013 -68103 -41778 12783 -13284 -72253 -107794 -109357 -93121 -97004
1884 -97004 -79048 12105 14514 77864 27258 -23050 24105 67321 11071 -29617 -48174 -43681
1872 -43681 -68764 -42396 -6663 25092 -746 -12408 -34786 -47880 -16335 -41102 -41430 27502
1860 27502 72835 69146 -1608 -22360 2 125550 189454 160541 99091 46506 67970 49623
1848 49623 886 15031 9107 6127 41765 32809 12053 21429 104167 82233 22036 -4602 -36177
1835 -36177 -96971 -70092 -13489 -62457 -104171 -101445 -73723 -100906 -108274 -87461 -6027 85826
1823 85826 94052 110811 89465 33346 16005 46470 42878 26486 45435 -34594 -30287 26830
1811 26830 62697 36346 17482 42395 69719 35461 19790 58097 97116 73508 40276 33167
1799 33167 16585 4054 -39801 -69683 2353 42962 55444 88211 151481 127968 16776 -14486
1787 -14486 -28433 -9098 -6978 -30782 -20345 -10345 30115 3176 36527 19305 -7930 -47100
1775 -47100 -49147 -53612 -34386 -20838 -14596 -27418 -18152 30243 -1614 -59402 -17623 14354 -27814
1762 -27814 11598 55920 74135 93935 125331 74619 12743 -11779 -8489 -20334 -51749 -37432
1750 -37432 4931 -21642 -69929 -13936 44322 95500 70687 32754 -35691 -53221 -5894 46688
1738 46688 84375 84449 69163 92371 127518 117145 94699 92569 39927 11690 35563 29013 4956
1725 4956 11599 67208 19082 -24758 -34420 -65166 -26740 16983 9357 13289 -13178 -6501 47593
1712 47593 82778 21675 4157 6841 45176 18098 -40511 -81039 -102599 -115776 -57941 -18930
1700 -18930 -49144 -36998 -17982 -41444 -61923 -80345 -35922 46799 14464 -90238 -120129 -140368
1688 -140368 -141678 -118580 -121694 -157155 -125830 -109412 -41381 -2270 47255 108020 83268 13489
1676 13489 -17513 -34035 -20359 56221 69740 53010 24255 30753 70100 -12381 -17267 31067
1664 31067 -46966 -37575 33728 13096 -24565 19854 24662 23980 62892 74869 28204 48185 38595
1651 38595 34214 44354 11157 -5089 -42571 -31437 46381 22631 35603 33985 -20926 -98140
1639 -98140 -87756 -50681 -31646 -108806 -131958 -63733 -31015 27826 -22846 -49869 2557 6535
1627 6535 -11187 -15132 -29049 -53687 -60826 -39531 -25147 -44386 -45200 -22432 48128 -9882 -48723
1614 -48723 -10469 -5676 -60554 -120390 -28145 -9155 2438 -37110 -70387 -41874 -29124 -36922
1602 -36922 -20177 1109 -34603 -21241 -48392 -81158 -55946 910 20510 33287 28415 40354
1590 40354 -6312 -53004 -40332 30493 46924 -16439 -51217 -20070 32456 72455 88695 97258
1578 97258 106634 56687 31063 -12197 -57204 -40046 -29031 -26523 -35444 -58377 -20365 -17955 5143
1565 5143 5964 -11058 -76832 -41117 26834 44193 44495 21128 -14503 -23993 -42474 -39120 -38622 23440
1551 23440 240 2529 -41818 -92246 -16673 -69438 -124966 -161013 -85054 -34970 26717 45255
1539 45255 91780 107294 20808 -42693 -34681 -45214 20467 94102 90326 15043 4542 -42291
1527 -42291 -86365 -104258 -96752 3448 90706 94253 29415 48028 90026 53276 40364 87314
1515 87314 34597 -3021 8887 26326 33555 -1621 -29199 -32408 43418 45412 6353 13823 52854
1502 52854 69261 46792 31691 -17612 -21287 -34168 -51623 -55902 -18936 33790 19584 -26942
1490 -26942 -55321 -44266 -9400 -20685 -57363 -29280 -16050 -30870 -48944 13255 32663 38886
1478 38886 44461 34332 -30211 -99666 -86643 -45632 -11184 20507 100705 107051 29562 -20930
1466 -20930 3959 1541 -35414 -49793 -64002 -44743 -35865 -25448 -27231 -40056 -32955 -5445 6211
1453 6211 37642 37781 56818 71127 24426 10700 18718 -28655 -7537 77945 83750 52347 21271
1440 21271 13372 12792 -61416 -91240 -125154 -79226 -48475 1843 8284 -199 -15218 5088 58064
1427 58064 98011 121449 66276 14853 -27146 -636 -21755 -23424 -3998 22522 75725 72562
1415 72562 39612 20400 29865 18068 -42062 -46091 -25803 -46866 -16894 -41047 -65742 -103924
1403 -103924 -76267 -73200 -36480 14080 22325 4697 6594 33347 23025 25291 23257 33379 -1253
1390 -1253 27736 73928 58434 -35126 -53930 -32082 -15361 -32565 -31631 -16278 27515 -15938
1378 -15938 -20579 11817 21208 6454 -18102 -49938 -81325 -41880 16157 33165 -46634 -116384
1366 -116384 -98643 -35195 40004 4481 -51435 -35777 -49246 -67782 -47693 -56275 -53637 -28967
1354 -28967 -1482 -13565 -10898 13990 8042 32736 5777 -37910 -20285 6713 26768 31093
1342 31093 -34908 -80889 5772 22513 -41451 -75591 -60158 32331 71280 77499 49579 -30600
1330 -30600 -88687 -98276 -78906 -62798 -32706 -64674 -79650 -8865 43087 73375 49632 14018
1318 14018 51700 94480 88296 32035 -41564 -82298 -61434 -31443 -52434 -75771 -87522 -62431
1306 -62431 -14596 45327 38448 -29053 -40729 -48473 2055 60600 69859 67482 50013 30101 549
1293 549 -41190 -61736 -47083 -18249 -83332 -104258 -126904 -123110 -62180 4223 18169 -3757
1281 -3757 -20725 -44535 -44261 -52228 -106765 -125721 -57051 -11672 328 -10764 -36845 -47062 -23052
1268 -23052 -24010 1034 -5342 -16429 -51432 -26749 -44409 -36597 35907 83852 110910 85615 76537
1255 76537 12405 4042 58908 31779 3595 50968 18243 -8206 -90871 -108180 -105057 -54945
1243 -54945 -12563 53946 59119 35212 -18219 -79774 -49231 -25151 12586 57313 35764 33659
1231 33659 9311 -36869 -68966 -28803 -29358 -47112 -62952 -61700 -46659 3606 36638 92458
1219 92458 87886 1956 -87547 -124278 -107760 -93376 -60207 -4751 18256 17546 432 34253
1207 34253 59694 7444 -28469 -14402 -1145 32798 35883 33215 28464 -27970 -64253 -62973 -34764
1194 -34764 -15081 -34620 -55879 -37805 -21996 -31077 -6826 11711 -32543 -51616 -22307 -31941
1182 -31941 -18694 59376 117177 103848 63732 9840 36075 53462 7465 -13065 -30205 -68341
1170 -68341 -41409 -15084 -73222 -40590 10385 48514 64667 70920 11108 15732 -1793 -3095
1158 -3095 -3420 3002 13557 -28811 5929 -26931 -58548 -50006 -61900 -17679 26808 72190 108359
1145 108359 59531 35852 10288 42228 78318 67223 16333 72059 30643 6110 3438 47461
1133 47461 9519 -21631 -22456 -11346 18294 -42257 -73757 -29725 -54156 -80364 -31194 54202
1121 54202 54656 83138 86314 27060 -17308 2507 33460 33450 47015 -2282 -54193 -30005 21994
1108 21994 41238 9987 -67580 -87726 -34116 19445 59591 53353 25405 33770 -4764 -50253
1096 -50253 -26590 -14552 -59412 -58425 -51256 -43756 -46871 -37392 -5707 41162 58521 46270 -773
1083 -773 -54362 -42742 -56323 -100450 -114219 -27231 -9320 -23702 -34921 -23894 -215 63935
1071 63935 75880 23580 -33855 -56162 -24138 32986 89786 134468 105750 40352 40305 26998
1059 26998 87123 99541 107584 90223 7478 -5399 -22254 14855 38317 28055 22824 55521
1047 55521 35125 26659 -2875 21760 14795 -11049 44017 67435 8935 40855 35019 43886 53682
1034 53682 39446 19193 668 25932 54442 24262 17636 63543 92281 60022 94613 72747
1022 72747 -34050 -70628 -36103 -31603 -63574 5908 66671 102160 89170 96119 131905 71434
1010 71434 23822 30796 71151 72999 96631 85136 101310 110115 137758 121506 146285 69067
998 69067 25137 31828 35008 11921 -10067 -9418 29812 81157 52781 -22712 5816 68836 95854
985 95854 95187 58680 53996 48240 13031 -8488 1112 35938 36837 4256 59700 103301 110561 65636
971 65636 11972 -8045 -8391 14337 14210 3211 45960 74799 65604 28552 -34194 -106660 -113283
958 -113283 -76785 -18232 6268 -34697 -16305 32160 54501 90235 122160 118530 47081 -47389
946 -47389 -44906 -127678 -175392 -126985 -77504 -68522 -30941 -19253 7895 39741 57950 -738
934 -738 14120 22148 -53848 -7194 29623 55934 108416 137601 93322 28762 42052 9010 -34701
921 -34701 -29072 -5883 -19071 -11436 33062 43663 25462 43384 19167 23889 41114 67058 51015
908 51015 32614 -382 76139 96662 79876 67809 36248 4274 57755 56524 8148 46226
896 46226 49902 58952 139846 155274 143739 175299 164858 141181 152120 173033 133206 85926
884 85926 54234 31230 34217 72394 47067 4964 -14708 -46145 36506 48065 -11885 -9432
872 -9432 5765 88180 108268 119373 62355 -18023 -27111 49532 39305 41550 46751 31545 -2710
859 -2710 44569 43115 -2308 19454 61270 46805 36419 29889 69690 95226 74797 23164 57549
846 57549 60432 106945 117686 64499 65739 109318 128092 114842 71921 69730 67800 -11212 -35556
833 -35556 -52561 10758 51040 140349 115665 37962 -39559 -74937 -95595 -120117 -86723 -50293
821 -50293 15216 9612 13309 576 34407 89211 59841 54625 86885 31025 16523 22450 13869
808 13869 15482 54696 42026 11644 14926 60851 9052 -46755 -84787 -101176 -86774 -2694
796 -2694 54923 68858 89515 124455 93809 406 -80276 -96028 -10629 28478 -15339 -54053
784 -54053 -78960 -50598 -17545 38859 46969 36761 96134 127805 46262 17957 -12921 43796
772 43796 140928 143667 84883 29219 -67969 -89989 -14020 -10904 -5079 34892 -17412 -20177 25589
759 25589 65091 20122 -50472 -91328 -64585 -36664 47936 90777 47240 -20367 -15345 43675
747 43675 121147 54056 37676 85427 98658 558 -18880 4610 -827 75063 118795 105406
735 105406 77252 84542 55997 27580 75356 96714 80016 37692 52577 104810 89238 42048
723 42048 35311 32619 54997 85920 100506 51051 32974 48491 76876 47029 20564 -18561
711 -18561 -16029 29810 55950 63969 45335 63804 35691 -11893 -29901 -12104 2589 -37982
699 -37982 -84192 -10155 13804 21218 50052 35894 26065 30547 -24468 -20852 10234 22705 -45933
686 -45933 -85316 -28095 920 -26274 -45426 -129764 -103382 -39723 -62696 -84386 -85011 -60179
674 -60179 2133 -3993 43107 97007 125218 129752 131290 92186 40131 61425 -11893 -10548 17035
661 17035 43156 76417 34239 -7121 -59260 -26109 -32987 247 106938 165342 78056 27538
649 27538 66721 104117 161914 145960 -27633 -89747 -27325 75379 72371 93785 51292 13508
637 13508 22934 48176 15878 -57152 -93354 -65297 452 6467 22401 -55991 -18099 -38284
625 -38284 -56640 -30685 707 -19108 -5784 -2782 47274 26382 -5233 14942 66044 79239
613 79239 87308 80950 75042 38472 49999 16250 22871 32871 -3298 -27008 30949 56280 63271
600 63271 103348 90700 68409 78023 103701 78760 37099 43432 77053 94276 113915 51986
588 51986 -15361 -25523 -75979 -5288 23845 43669 10547 48594 40375 7241 -49197 -17170
576 -17170 16283 -18768 -43864 -59780 -83701 -17768 23420 68820 59483 97052 45426 814
564 814 15910 55337 57748 45323 78045 56440 69510 64077 81404 63133 -55692 -54022 -56114
551 -56114 -59011 -21200 -6054 -8878 -15114 -14346 19412 39176 34913 20574 17088 10237 13068 14705
537 14705 -1961 -20159 -17 52978 77256 131941 162666 157051 160420 95997 -3150 12890
525 12890 3627 -17844 46597 72496 90119 71318 100594 97439 69702 14690 40148 10235
513 10235 36032 101328 138964 150569 128711 101913 91897 102993 136012 96995 148656 149080
501 149080 128546 94600 75486 124002 129730 46664 65615 93476 152496 188953 102332 59167
489 59167 4568 -22485 51130 106955 54799 89224 86516 -9268 -96597 -55272 25536 78136
477 78136 107270 140135 140442 159679 126314 115640 108743 76875 86885 78972 63667 58590 83804
464 83804 73903 25746 -35454 -81427 -68919 -64302 -58141 -23897 1057 23455 30240 4935 -1319
451 -1319 -6500 57975 71132 81099 87838 47442 44938 84703 84168 21936 15347 -16154 -82290 -89322
437 -89322 -16362 14606 24510 64175 53330 33613 80343 122115 27065 -58337 -65028 -46134
425 -46134 -60025 -36886 -49814 -33762 38564 107110 74859 11212 -51995 -79562 -70277 -12997
413 -12997 2230 6589 -32919 -54068 5784 30420 -1659 -19353 752 78758 65875 39842
401 39842 47468 25741 -34013 -101098 -66158 -5944 11017 -6689 8874 44632 16321 8343
389 8343 19988 -2982 -7749 -44865 31847 2146 -1903 20650 31602 -11441 -12837 -1861 -12037
376 -12037 29153 82432 150032 162321 132656 64133 60395 26921 27446 48247 50667 62833 65578
363 65578 87636 56183 39982 45924 15573 24818 61440 67379 82485 46640 4081 7441 23347
350 23347 5231 -27324 -79061 -43478 6020 2669 -37427 -5473 23839 -21643 -47662 -26731
338 -26731 27617 33490 35070 58789 43538 27763 53676 53284 46782 59273 -6286 -1015 58191
325 58191 68838 35202 34377 27777 57796 83745 22101 -5038 48581 80087 57512 38444 33170
312 33170 79644 77329 22529 -27678 11844 53017 62438 82339 40232 27050 23604 55675 4904
299 4904 -20344 -50408 -56930 -40234 -25319 -17862 14219 20791 13488 69442 116281 73158 51895
286 51895 92739 129513 163334 162304 171149 161008 125028 96255 111882 105187 97358 103573 108932
273 108932 88736 61233 46953 46407 64174 106348 140111 122400 165152 139131 76118 21688
261 21688 7947 52214 137411 128947 104622 48313 4149 -19938 -25805 -3650 21736 10479
249 10479 13356 35568 29314 21465 26000 51637 60959 47845 25700 -25860 3778 -15536 -74488
236 -74488 -92896 -37501 7379 65044 97690 92558 78011 65308 89535 94130 89378 73528 46605
223 46605 76427 74003 83011 55315 51561 29827 36572 39779 44532 48735 28456 32854 90075 120772
209 120772 158327 121519 94359 67923 63809 67524 148988 173266 152824 83832 34240 -14203
197 -14203 9145 58405 87977 110687 84800 69527 121772 204285 192546 133129 115740 70209
185 70209 35291 70943 91721 91552 80009 76874 82995 104767 76060 58248 34520 28090 1327
$$ [...]
##END NTUPLES=NMR SPECTRUM
##END=
