##TITLE=Analysis number 319139
Compound Code ac 33594
Project Code adrs
Chemist Name acros
##JCAMPDX= 6.0         $$ Bruker NMR JCAMP-DX V2.0
##DATA TYPE= NMR SPECTRUM
##DATA CLASS= NTUPLES
##ORIGIN= Bruker BioSpin GmbH
##OWNER= nmr
$$ XWIN-NMR		Version 3.5
$$ Wed May  3 13:27:31 2006 GMT Daylight Time (UT+1h)  MAYBRIDGE\nmr@NMR_250MHZ
##.OBSERVE FREQUENCY= 250.131544655141
##.OBSERVE NUCLEUS= ^1H
##.ACQUISITION MODE= SIMULTANEOUS (DQD)
##.ACQUISITION SCHEME= undefined
##.AVERAGES= 16
##.DIGITISER RES= 18
##SPECTROMETER/DATA SYSTEM= dpx250
##.PULSE SEQUENCE= zg30
##.SOLVENT NAME= CDCl3
##.SHIFT REFERENCE= (INTERNAL, CDCl3, 0, 16.522)
##AUDIT TRAIL= $$ (NUMBER, WHEN, WHO, WHERE, WHAT)
$$ ##TITLE= Audit trail, XWIN-NMR		Version 3.5
$$ ##JCAMPDX= 5.01
$$ ##ORIGIN= Bruker BioSpin GmbH
$$ ##OWNER= nmr
$$ C:\u/data/dgb/nmr/ADRS/3730/pdata/1/auditp.txt
$$ ##AUDIT TRAIL=  $$ (NUMBER, WHEN, WHO, WHERE, WHAT)
(   1,<2006-05-03 13:26:53.76 +100>,<MAYBRIDGE\nmr>,<NMR_250MHZ>,
      <created by zg, POWCHK disabled, PULCHK disabled
       configuration hash MD5:
       84 BC 41 DB A1 6E 1D 46 DA 25 12 A5 C1 ED C5 3A
       data hash MD5: 64K
       B1 12 A2 46 3F 00 29 B6 04 F1 BE 6F 30 74 D0 7C>)
(   2,<2006-05-03 13:27:08.40 +100>,<MAYBRIDGE\nmr>,<NMR_250MHZ>,
      <Start of raw data processing
       ef LB = 0.3 FT_mod = 6 PKNL = 1 SI = 32K 
       data hash MD5: 32K
       72 06 0F 6D 05 CC D2 4A B3 56 BA DF B5 80 3D DE>)
(   3,<2006-05-03 13:27:11.07 +100>,<MAYBRIDGE\nmr>,<NMR_250MHZ>,
      <apk 
       data hash MD5: 32K
       AF 8F 5A 1D 1F 17 8E 62 BA 0F C6 65 1D 63 74 7C>)
(   4,<2006-05-03 13:27:12.37 +100>,<MAYBRIDGE\nmr>,<NMR_250MHZ>,
      <abs ABSG = 5 
       data hash MD5: 32K
       2B 45 97 85 EC E1 0F 53 FD 64 DB 91 7F 40 1C 69>)
$$ ##END=
$$ 
$$ hash MD5
$$ DF BD 20 88 DF E9 21 39 20 A8 2F 75 82 0D 1F D6
##$RELAX= 
##$RELAX= 
##$RELAX= 
##$RELAX= 
##$RELAX= 
##$RELAX= 
##$RELAX= 
$$ Bruker specific parameters
$$ --------------------------
##$DU= <C:\u>
##$EXPNO= 3730
##$NAME= <ADRS>
##$PROCNO= 1
##$TYPE= <nmr>
##$USER= <dgb>
##$AMP= (0..31)
100 100 100 100 100 100 100 100 100 100 100 100 100 100 100 100 100 100 
100 100 100 100 100 100 100 100 100 100 100 100 100 100 
##$AQSEQ= 0
##$AQ_mod= 3
##$AUNM= <au_zg>
##$AUTOPOS= <31 >
##$BF1= 250.13
##$BF2= 250.13
##$BF3= 250.13
##$BF4= 250.13
##$BF5= 500.13
##$BF6= 500.13
##$BF7= 500.13
##$BF8= 500.13
##$BYTORDA= 1
##$CFDGTYP= 0
##$CFRGTYP= 5
##$CHEMSTR= <none>
##$CNST= (0..31)
1 1 145 1 1 1 1 1 1 1 1 1 1 1 1 1 1 1 1 1 1 1 1 1 1 1 1 1 1 1 1 1 
##$CPDPRG= <>
##$CPDPRG1= <>
##$CPDPRG2= <>
##$CPDPRG3= <>
##$CPDPRG4= <mlev>
##$CPDPRG5= <mlev>
##$CPDPRG6= <mlev>
##$CPDPRG7= <mlev>
##$CPDPRG8= <mlev>
##$CPDPRGB= <>
##$CPDPRGT= <>
##$D= (0..31)
0 1 0 0 0 0 0 0 0 0.06 0 0 0 0 0 0 0.0002 0 0 0 0 0 0 0 0 0 0 0 0 0 0 
0 
##$DATE= 1146659212
##$DBL= (0..7)
120 120 120 120 120 120 120 120 
##$DBP= (0..7)
150 150 150 150 150 150 150 150 
##$DBP07= 0
##$DBPNAM0= <>
##$DBPNAM1= <>
##$DBPNAM2= <>
$$ [...]
##$SUBNAM7= <"">
##$SUBNAM8= <"">
##$SUBNAM9= <"">
##$SW= 20.6930455092707
##$SWIBOX= (0..15)
0 0 3 0 0 0 0 0 0 0 0 0 0 0 0 0 
##$SW_h= 5175.983436853
##$TD= 65536
##$TD0= 1
##$TE= 295.16
##$TE2= 300
##$TE3= 300
##$TEG= 300
##$TL= (0..7)
0 120 120 120 120 120 120 120 
##$TP= (0..7)
150 150 150 150 150 150 150 150 
##$TP07= 0
##$TPNAME0= <>
##$TPNAME1= <>
##$TPNAME2= <>
##$TPNAME3= <>
##$TPNAME4= <>
##$TPNAME5= <>
##$TPNAME6= <>
##$TPNAME7= <>
##$TPOAL= (0..7)
0.5 0.5 0.5 0.5 0.5 0.5 0.5 0.5 
##$TPOFFS= (0..7)
0 0 0 0 0 0 0 0 
##$TUNHIN= 0
##$TUNHOUT= 0
##$TUNXOUT= 0
##$USERA1= <user>
##$USERA2= <user>
##$USERA3= <user>
##$USERA4= <user>
##$USERA5= <user>
##$V9= 5
##$VALIST= <valist>
##$VCLIST= <CCCCCCCCCCCCCCC>
##$VD= 0
##$VDLIST= <DDDDDDDDDDDDDDD>
##$VPLIST= <PPPPPPPPPPPPPPP>
##$VTLIST= <TTTTTTTTTTTTTTT>
##$WBST= 1024
##$WBSW= 4
##$XGAIN= (0..3)
0 0 0 0 
##$XL= 0
##$YL= 0
##$YMAX_a= 558359
##$YMIN_a= -573130
##$ZGOPTNS= <>
##$ZL1= 120
##$ZL2= 120
##$ZL3= 120
##$ZL4= 120
##$ABSF1= 16.522
##$ABSF2= -4.171173
##$ABSG= 5
##$ABSL= 3
##$ALPHA= 0
##$AQORDER= 0
##$ASSFAC= 0
##$ASSFACI= 0
##$ASSFACX= 0
##$ASSWID= 0
##$AUNMP= <proc_1d>
##$AZFE= 0.1
##$AZFW= 0.1
##$BCFW= 0
##$BC_mod= 0
##$BYTORDP= 0
##$COROFFS= 0
##$CY= 12.5
##$DATMOD= 1
##$DC= 0
##$DFILT= <>
##$DTYPP= 0
##$F1P= 14.0000005364418
##$F2P= -0.99999901652339
##$FCOR= 0.5
##$FTSIZE= 32768
##$FT_mod= 6
##$GAMMA= 0
##$GB= 0
##$INTBC= 1
##$INTSCL= 1
##$ISEN= 128
##$LB= 0.3
##$LEV0= 0
##$LPBIN= 0
##$MAXI= 10000
##$MC2= 0
##$MEAN= 0
##$ME_mod= 0
##$MI= 0
##$NCOEF= 0
##$NC_proc= -3
##$NLEV= 6
##$NOISF1= 0
##$NOISF2= 0
##$NSP= 0
##$NTH_PI= 0
##$NZP= 0
##$OFFSET= 16.522
##$PC= 1
##$PHC0= 29.14027
##$PHC1= -11.9145
##$PH_mod= 1
##$PKNL= yes
##$PPARMOD= 0
##$PSCAL= 4
##$PSIGN= 0
##$REVERSE= no
##$SF= 250.13
##$SI= 32768
##$SIGF1= 0
##$SIGF2= 0
##$SINO= 400
##$SIOLD= 32768
##$SREGLST= <1H.CDCl3>
##$SSB= 0
##$STSI= 32768
##$STSR= 0
##$SW_p= 5175.98343685301
##$SYMM= 0
##$S_DEV= 0
##$TDeff= 65536
##$TDoff= 0
##$TI= <Analysis number 999999
Compound Code 99
Book Reference 9
Project Code 9>
##$TILT= no
##$TM1= 0
##$TM2= 0
##$TOPLEV= 0
##$USERP1= <user>
##$USERP2= <user>
##$USERP3= <user>
##$USERP4= <user>
##$USERP5= <user>
##$WDW= 1
##$XDIM= 32768
##$YMAX_p= 273043301
##$YMIN_p= -24322
$$ End of Bruker specific parameters
$$ ---------------------------------
##NTUPLES= NMR SPECTRUM
##VAR_NAME=  FREQUENCY,     SPECTRUM/REAL,   SPECTRUM/IMAG
##SYMBOL=    X,             R,               I
##VAR_TYPE=  INDEPENDENT,   DEPENDENT,       DEPENDENT
##VAR_FORM=  AFFN,          ASDF,            ASDF
##VAR_DIM=   32768,         32768,           32768
##UNITS=     HZ,            ARBITRARY UNITS, ARBITRARY UNITS
##FACTOR=    0.157963299565203, 1,           1
##FIRST=     4132.6476996994, 0,             0
##LAST=      -1043.33573715361, 0,           0
##MIN=       -1043.33573715361, -24322,      0
##MAX=       4132.6476996994, 273043301,     0
$$ Real data points
##PAGE= N=1
##DATA TABLE= (X++(R..R)), XYDATA
$$ [...]
14773b459k516k597l546o42M195N58K589L07k431J05J030M48k903j311J694L797
14757c682Q87k629n86K453L886K413J958m58l427p462n674k676K051O924M947
14742a075K262K161p78k09l086k6k376j855j127j682r44j936k044r68J290L665
14726h728M381M582k945j970J827J212o95l283K625K713J294J391j069k523L587
14711B399R90m432k022j50M77L201j803j732k105l36K924M428o56J312K448K166
14695G109k128m152j49K812R7J083r5o84o578m228K778K251P28j353j293l33J991
14678b144L04p31p67r35m70J807J437K682m84m382j466P12O46k817k584J393L005
14661d794N539M554k03J745j296j019J343K477J943j985k351K012q17k724j734
$$ plain form
14773 -2459 -4975 -7572 -11118 -11760 -7565 -7007 -4418 -4111 -6542 -6437 -5407 -4959 -7862 -9173 -7479 -3682
14757 -3682 -2795 -5424 -6010 -3557 329 2742 4700 4242 815 -6647 -12321 -14997 -12946 -6022 -1075
14742 -1075 1187 3348 2570 2361 -725 -751 -3127 -4982 -6109 -7791 -8735 -10671 -12715 -13683 -12393 -8728
14726 -8728 -4347 235 -2710 -4680 -2853 -1641 -2336 -5619 -2994 -281 1013 2404 1335 -1188 2399
14711 2399 3389 -1043 -3065 -3215 -2738 463 -1340 -3072 -5177 -5513 -2589 1839 1183 2495 4943 7109
14695 7109 4981 829 680 3492 3589 4672 4577 3893 -2685 -6913 -4135 -1884 -1156 -2509 -3802 -4135 -2144
14678 -2144 -1840 -2571 -3338 -4273 -4743 -2936 -1499 1183 699 -3683 -5149 -4437 -3791 -6608 -9192 -7799 -4794
14661 -4794 745 5299 5096 6841 5545 4526 5869 8346 10289 8304 5953 7965 7148 4424 2690
14646B690K67j440l276K538L268J91J303p30M077k93j611o711J916J603j984p13
14630A095p72k863j936Q26j249K694Q69K463N633m81j464m440M97j500k71J86
14614g13K70J107J832j237l744J570K615L8k660m86K951K340m04p126l618k078
14598i343n84P70N594L796J800o69j976k318L9q45K112J996J002j392l622j879
14582e519j936J876J442m126K00L622K364N99P0l711P36P96J245L20K761J096
14566A835j455j666j860J709M947j880m041k268M080J452R12j718Q2J799J325
14551C253l406j989j814L503Q00l657j078L718J42r68n56j241k270J189L394m26
14535a406O2L219P01l224o29j903J850J914k537L16K742k716k599j019K100j935
$$ plain form
14646 2690 2957 1517 -1759 779 4047 4238 5541 4811 8888 8595 6984 273 2189 3792 1808 1095
14630 1095 323 -2540 -4476 -3650 -4899 -2205 -1336 1127 6760 6279 4815 375 872 -628 -899 -713
14614 -713 -443 664 2496 1259 -2485 -915 1700 1738 -922 -1408 1543 3883 3479 -3647 -7265 -9343
14598 -9343 -9927 -9157 -3563 233 2033 1364 -612 -2930 -2891 -3736 -1624 372 1374 -18 -3640 -5519
14582 -5519 -7455 -5579 -4137 -8263 -8063 -4441 -2077 -1478 -1408 -5119 -4383 -3587 -2342 -2022 739 1835
14566 1835 380 -1286 -3146 -1437 3510 1630 -2411 -4679 -599 853 1765 47 129 1928 3253
14551 3253 -153 -2142 -3956 -453 347 -3310 -4388 -670 -528 -1496 -2052 -3293 -5563 -4374 -980 -1406
14535 -1406 -1344 1875 2576 -648 -1277 -3180 -1330 584 -1953 -1637 1105 -1611 -4210 -5229 -3129 -5064
14519e064r75N58K170j451l45j135l26j642K997K232l105K474m58K58L688j741
14503a865k826N30M134N8J164k05j257k005r19J568J102j551k42q14m40q96J321
14486c143k646J740k815K027o23j444L45J623R95K598j756l89L928q55k246j318
14470c979P75K598j53m01K023j649m67m85r24j782J442J521J363J126j936K145
14454A217M668j718N01k76k311k097r76n775q31K992M244l13L37k892k023L427
14438a826o28k560R21Q56K385k044j924j15J777j817J046K957K96k286J62K154
14422f46M223K522N54k044q667j642P638K125j760m329N77J81J442m37J165jK037
14405B938j862J170k153j735l44K295l079o35p39j055j246K059N287Q64n76r42
$$ plain form
14519 -5064 -6039 -5481 -3311 -4762 -5107 -6242 -6568 -8210 -5213 -2981 -6086 -3612 -4070 -3812 -124 -1865
14503 -1865 -4691 -4161 -27 31 1195 990 -267 -2272 -3191 -1623 -521 -2072 -2314 -3128 -3568 -4464 -3143
14486 -3143 -5789 -4049 -6864 -4837 -5460 -6904 -6559 -4936 -3941 -1343 -3099 -3488 440 -415 -2661 -3979
14470 -3979 -3204 -606 -759 -1160 863 -786 -1253 -1738 -2662 -4444 -3002 -1481 -118 1008 -928 1217
14454 1217 5885 4167 4668 4392 2081 -16 -992 -6767 -7598 -4606 -362 -675 -338 -3230 -5253 -1826
14438 -1826 -2454 -5014 -4093 -3237 -852 -2896 -4820 -4935 -3158 -4975 -3929 -972 -676 -2962 -2800 -646
14422 -646 3577 6099 6653 4609 -4058 -5700 1938 4063 2303 -2026 -1449 -1268 174 -263 902 901 2938
14405 2938 1076 2246 93 -1642 -1986 309 -2770 -3405 -4144 -5199 -6445 -4386 901 1765 1189 247
14389B47k824l11j76m265J396N320j657j88N80j096q2J925j140K870q86p72m223
14372e282J550M187L23k901j311k511j443n1L66J599K049o51J044k098N6p73k451
14355h298l6J09j275J757L601K661q34j583J241j46k542k972J231M457j89N25
14339b293M63O11L111Q75l418k512k375k82k574j284j519K771M193m59l138J934
14323e896J636j527k43M265j137j802J375M65m39q69K039j018l067r67K972P77
14307c436N604q59j024K459J694l764j753k738l221J879M763o35L292J624L0k039
14291A876j475q59r54j792j629J272J845j764k629j226J589N480J476L922J409
14276F541k120k135k164k584j454j807n84k246L069L160j735j417K213J860l057
$$ plain form
14389 247 -2577 -2888 -3064 -7329 -5933 -613 -2270 -2458 -1878 -2974 -3056 -1131 -2271 599 -287 -1059 -5282
14372 -5282 -3732 455 778 -2123 -3434 -5945 -7388 -7439 -7073 -5474 -3425 -4076 -3032 -5130 -5074 -5847 -8298
14355 -8298 -8334 -8225 -9500 -7743 -4142 -1481 -2315 -3898 -2657 -2803 -5345 -8317 -7086 -2629 -2818 -2293
14339 -2293 -1830 -1219 1892 2767 -651 -3163 -5538 -5820 -8394 -9678 -11197 -8426 -4233 -4692 -7830 -5896
14323 -5896 -4260 -5787 -6030 -1765 -2902 -4704 -3329 -2864 -3303 -4172 -2133 -3151 -6218 -7185 -4213 -3436
14307 -3436 2168 1309 285 2744 4438 674 -1079 -3817 -7038 -5159 -396 -1031 2261 3885 3915 1876
14291 1876 401 -458 -1412 -3204 -4833 -3561 -1716 -3480 -6109 -7335 -5746 -266 1210 5132 6541
14276 6541 4421 2286 122 -2462 -3916 -5723 -6307 -8553 -5484 -2324 -4059 -5476 -3263 -1403 -4460
14261d460j246K338J035q49R48M02j014J534K788n09l764j777N72M861L868J204
14245E931J200J591j525m013j368J674o75K47L247k533l735K111q22j598o26J318
14229D24l479l137O20J682K015K784M47J324J244k904J144NJ3L116o84l538k869
14212a793k291l40L860j15k26P77Q72R18n912l629J707K622J695j125k295N24
14196d751n69K436j349K362J899J62j065k323j533Q65j58k28K265R97J638p8k338
14179a768k861p58J574j010J409L663Q39k151Q03K507j857L57N252K390l139n876
14163f26k444o36L387M069M717o89k711l238j986O94j582l542J188J289l131J46
14147e095K000J221r3m734j256J452L884j049J674L392L746M204P1l836R51k15
$$ plain form
14261 -4460 -5706 -3368 -2333 -3182 -2234 -1832 -2846 -1312 1476 967 -2797 -4574 -4002 859 4727 5931
14245 5931 7131 8722 7197 3184 1816 3490 2815 3062 6309 3776 41 2152 1330 -268 -894 424
14229 424 -3055 -6192 -5572 -3890 -1875 909 1356 2680 3924 1020 2164 2169 2182 5298 4614 1076 -1793
14212 -1793 -4084 -4424 -564 -679 -905 -128 744 1662 -4250 -7879 -6172 -3550 -1855 -2980 -5275 -4751
14196 -4751 -5320 -2884 -4233 -1871 28 190 -875 -3198 -4731 -3866 -4024 -4252 -1987 -990 648 570 -1768
14179 -1768 -4629 -5387 -3813 -4823 -3414 249 1088 -1063 -260 2247 390 747 5999 8389 5250 -626
14163 -626 -3070 -3706 -319 3750 8467 7778 5067 1829 -157 537 -1045 -4587 -3399 -2110 -5241 -5095
14147 -5095 -3095 -1874 -1967 -6701 -7957 -6505 -2621 -3670 -1996 1396 5142 9346 9417 5581 6532 6317
14131F317m685M25M117j055m793m69j364M86j06o69o93J121O168O11m45m194p84
14114a2L47O23M439O034j931n131k939l110K458J753J501r76j117J231n90m197
14098a617l356k43L519K021N34j215Q1q81L065j51m157J852l18j921j322O12M025
14081E28Q30n8m617m684L176Q298Q2k127k210j965L04j076R57M553l179k715L58
14064c545L326J095J294k752l558J406O416m37q95J06J234L146J766l506j928
14049C168k169K91j16o74J379m805k066M099k325j875M292L237l128l604j151
14034e447o64r74L71K969J004j033M19J175K921K58p4k594K347k412l078L577
14018a235N141J560K631O275M73l803M39M297J0078K1037L0822M7287L0891k0559
$$ plain form
14131 6317 1632 2057 6174 5119 326 -143 -1507 -1021 -1127 -1796 -2489 -1368 4800 5411 4966 772 -12
14114 -12 335 958 5397 11431 9500 4369 1430 -1680 778 2531 4032 3056 1939 3170 2580 -1617
14098 -1617 -4973 -5216 -1697 324 858 -357 -276 -1157 1908 1757 -2400 -548 -866 -2787 -4109 -3497 528
14081 528 1358 1300 -3317 -8001 -4825 3473 3555 1428 -782 -2747 -2443 -3519 -2562 1991 -1188 -3903 -3545
14064 -3545 -219 876 2170 -582 -4140 -2734 3682 3245 2350 2456 3690 6836 8602 5096 3168
14049 3168 999 1290 1174 500 1879 -2926 -4992 -893 -3218 -5093 -801 2436 -692 -4296 -5447
14034 -5447 -6111 -7085 -6714 -3745 -2741 -3774 -3355 -2180 741 999 925 -1669 678 -1734 -4812 -1235
14018 -1235 3906 5466 8097 14372 14845 11042 11481 15778 25856 46893 77715 125002 155893 135334
14004A35334m0533k9248j6843j5298p394k222m366o995j345N65Q69k070J898K268
13990A4620l166j92j216m091k763K50K660J685k469n87k713J189J533j715k368
13975F57p9L196J582k17r20J849k153p282n09N654J104k036L546J749m177j099
13959H65L276J940J01l536J068J650j405M130J283k388r64J078J021j470j910
13944D739j190R31K496R16M001J470O16P20j68O761O712l110l792k838n846k570
13928I848n57j569J655l158k580k47N222L326q87l947k839k177m087k445N47M673
13912G78M540L515K50k385j052l758k058k244j394J791L172O31m867j338K230
13897b189J771K426k372j50j177j174j729O53l57K080l44l320k159L534K165K730
$$ plain form
14004 135334 94801 65553 48710 33412 26018 23796 19430 12435 11090 11655 12524 10454 12352 14620
13990 14620 11454 11262 10046 5955 3192 3442 6102 7787 5318 4731 2018 3207 4740 3025 657
13975 657 578 3774 5356 5139 4219 6068 3915 -3367 -3876 1778 2882 846 4392 6141 1964 865
13959 865 4141 6081 6182 2646 3714 5364 3959 8089 9372 6984 6020 7098 8119 6649 4739
13944 4739 3549 4480 6976 7892 11893 13363 13979 14699 14531 21292 28004 24894 21102 18264 12418 9848
13928 9848 9291 7722 9377 6219 3639 3392 8614 11940 11053 7106 4267 2090 -1997 -4442 -3895 778
13912 778 5318 8833 9083 6698 5646 1888 -170 -2414 -3808 -2017 1155 1786 -3081 -4419 -2189
13897 -2189 -418 2008 -364 -514 -1691 -2865 -4594 -3941 -4298 -2218 -2562 -5882 -8041 -4507 -2342 388
13881C88m777n785J475p30L661L840j457k915K199K149J086K813N75J122J922
13866E566R22j004k548r01N358n14l195K9j20m694O31L010L386L464L772J937
13850A5099o73L372P891Q201J1342J5370K6486L6040L9538L5440J0019j9174l8012
13837A50939l4663k4002j8000r386o545p762n434j707n374n229j743P27l117j370
13823B7334k234l007k986k596k865k283Q96J176J593J020k504n614k420K5m77
13808E058N422J412j303K63M57K267J877k706o958j123L93n85R94L939l102j378
13792D927o57K484J040J447n33J289j259m460n835j06K789K001n32J138K415m326
13776A822k969j950N77L808j993N96M984K721J229q78j042m63j57l740n179m574
$$ plain form
13881 388 -4389 -10174 -8699 -9429 -5768 -1928 -3385 -6300 -4101 -1952 -866 1947 2522 3644 5566
13866 5566 6488 5484 2936 2035 7393 6879 3684 3713 3593 -1101 -470 2540 5926 9390 13162 15099
13850 15099 14426 17798 25689 33890 45232 60602 87088 123128 162666 198106 208125 188951 150939
13837 150939 116276 92274 74274 64888 58343 50581 45147 43440 38066 32837 31094 31821 28704 27334
13823 27334 25100 22093 19107 16511 13646 11363 12259 13435 15028 16048 13544 7930 5510 5535 5058
13808 5058 10480 11892 10589 10852 11309 13576 15453 12747 5789 4666 5059 4474 5468 9407 6305 4927
13792 4927 4270 6754 7794 9241 8708 9997 8738 4278 -1557 -1663 1126 3127 2595 3733 6148 1822
13776 1822 -1147 -3097 -2520 1288 -705 -109 4875 7596 8825 7947 6905 6442 6285 2545 -2634 -7208
13760g208j256N66K550m8K391K779J061K948M18k784M313O88m638L98j947K49
13744D80J746k941O12K984K476K02k763m998k25L964O393N161m135m878k620n295
13728c837r84j789J081J437j603k105L663P58k285K852J083K476J365l827k257
13713c972K95p06o62r45j782J382M683l162J148J463J172j735l002k243N261J115
13697a690m58K849j353j823J657L395J29P19m604Q2L055Pj811J22P95K101J684
13680D856R98k89o142p597j466o5J00J144K097n74k822j056K558K149K302J359
13664b448n485J070J272J60m91K440M139J844P15q59L21l943j752L950o19j237
13648i23j645o48j302J816K343l99j94m72q64J399j311r94l510j335J880K228
$$ plain form
13760 -7208 -8464 -7898 -5348 -5396 -3005 -226 835 3783 4201 1417 5730 6418 1780 2178 231 480
13744 480 2226 -715 -103 2881 5357 5559 2796 -2202 -2427 1537 7930 13091 8956 4078 1458 -3837
13728 -3837 -4821 -6610 -5529 -4092 -5695 -7800 -4137 -3379 -5664 -2812 -1729 747 2112 -1715 -3972
13713 -3972 -3677 -4383 -5045 -5990 -7772 -6390 -1707 -4869 -3721 -2258 -1086 -2821 -5823 -8066 -2805 -1690
13697 -1690 -2148 701 -652 -2475 -818 2577 2706 3425 -1179 -1097 1958 1965 154 276 1071 3172 4856
13680 4856 5854 5565 -577 -8174 -9640 -9705 -9605 -8461 -6364 -6938 -9760 -10816 -8258 -6109 -3807 -2448
13664 -2448 -7933 -6863 -5591 -5431 -5922 -3482 657 2501 3216 2357 2678 -1265 -3017 933 314 -923
13648 -923 -2568 -3216 -4518 -2702 -359 -758 -952 -1424 -2288 -889 -2200 -3194 -6704 -8039 -6159 -3931
13632c931l60L520J399j259k409k406L726j33j072k54O639j43j134k273J355P25
13616A990K925l307l416l990j939O70J613L117M272q89k363j540P54Q2k680l727
13600h428J191L184Q62M062o11J881K003j993j584j629l82n86j525j56K577L080
13584A946N97l375K410j526o080m29K576M682J665M648M861L193k120m880n638
13569B530l721n659k420j986L822K038L520P991J321N424M658m379q572m596m760
13554d789l85J281J694l089k991J547K641l733M2K086K756L299j222P95J201j193
13538f0j999m37j767m321J824M631O396p09o810L34o00j71j804L340J892Q23L382
13521C944J121J09J850M455M274l754p826l715j088M20J771M573L356p31m524
$$ plain form
13632 -3931 -4291 -771 628 -631 -3040 -5446 -1720 -1853 -2925 -3179 3460 3317 2183 -90 1265 1990
13616 1990 4915 1608 -1808 -5798 -7737 -7067 -5454 -2337 1935 1046 -1317 -2857 -2103 -2021 -4701 -8428
13600 -8428 -7237 -4053 -3191 871 260 2141 4144 2151 567 -1062 -1444 -2030 -3555 -3711 -1134 1946
13584 1946 2543 -832 1578 52 -6028 -6457 -3881 801 2466 7114 11975 15168 13048 8168 2530
13569 2530 -1191 -6850 -9270 -11256 -7434 -5396 -1876 6115 7436 12860 17518 13139 4567 -29 -4789
13554 -4789 -5174 -3893 -2199 -5288 -8279 -6732 -4091 -7824 -7782 -5696 -2940 359 -863 -68 1133 -60
13538 -60 -2059 -2496 -4263 -8584 -6760 -2129 4267 3558 -3252 -2918 -3518 -3689 -5493 -2153 -261 562 3944
13521 3944 5065 5174 7024 11479 15753 11999 4173 458 -630 -210 1561 6134 9490 8759 4235
13506D235k023L40J441O31p15j80k056m696j37J612K526J583o42J359J344n584
13490i62p73L36J146O29L9J203r86k96J429L202K793j73j456k470R06k16j273
13473C078l01Q7n523q68M666J245q62k562J852J625j677M51N156O000M55l315
13457I507k002j993n669n74J01m75l679N84j227L267M093K458j47k585l982J36
13441b187j315j398J550N76l632l703L468K584R77j829l243N31L668M358M79J540
13425B424O53j155k938l053M114L371o97j937k693q69m160M24J149j014q90j405
13409h676N39L779N58k504J036O56J068J545j298J657j14l226j402l96K015J941
13393b822J240R33k748n057k46O604M606N025k84j571j455m798j340o89m508k965
$$ plain form
13506 4235 2212 2552 3993 4624 3909 3729 1673 -3023 -3160 -1548 978 2561 1919 3278 4622 -962
13490 -962 -1735 -1399 -253 376 415 1618 632 336 1765 4967 7760 7587 6131 3661 4567 4351 3078
13473 3078 2777 2864 -2659 -3527 1139 2384 1522 -1040 812 2437 760 1211 6367 12367 12822 9507
13457 9507 7505 5512 -157 -731 -630 -1105 -4784 -4200 -5427 -2160 1933 4391 4244 1659 -2323 -2187
13441 -2187 -3502 -4900 -3350 -2774 -6406 -10109 -6641 -4057 -3080 -4909 -8152 -7621 -3953 405 884 2424
13425 2424 3077 1922 -1016 -4069 45 3416 2719 782 -1911 -2780 -6940 -6516 -5367 -6381 -7271 -8676
13409 -8676 -8137 -4358 -3800 -6304 -5268 -4612 -3544 -1999 -3297 -1640 -1754 -4980 -6382 -6778 -4763 -2822
13393 -2822 -1582 -649 -3397 -8454 -8700 -2096 2510 7535 7251 5680 4225 -573 -1913 -2602 -7110 -10075
13377a0075K562N346J420M684J571j340R68k3P7l39R97J65o255q809l935Q16L696
13360h474M758M62l90n49J45K335m86jM847J833J776p66n192l370j040L7K582
13343a493K92M44l860k793q80O117L079j548m517k499J518J19J218J350O40K363
13327d50L2j879K532K128j327o590j810M70K879L604K566M186K90l225l560j49
13311c03L82J899Q89m368l822O741K674q39J587J429m248L53M528l886K85J267
13295D568j024j771r41l27j052J490K234l987n813k685L354O214K649j801k087
13280i79J559L140k14k6j977j952N7j147J419k968L30P42L234M909Q34j906k631
13263B424k542M87k3J899j573j10N94p49k332k130l201K311P038O74k279n77K449
$$ plain form
13377 -10075 -7513 -2167 -747 3937 5508 4168 5136 5113 5190 4851 5848 6013 -242 -9051 -12986 -12170 -8474
13360 -8474 -3716 -3254 -3644 -4193 -4048 -1713 -2199 -2200 2647 4480 6256 5490 298 -3072 -4112 -4075 -1493
13343 -1493 -1201 -757 -4617 -7410 -8290 -2173 906 -642 -5159 -7658 -6140 -6021 -4803 -3453 -2813 -450
13327 -450 -418 -2297 235 2363 1036 -5554 -7364 -6894 -4015 -411 2155 6341 6631 3406 -154 -303
13311 -303 79 1978 2867 -1501 -5323 1418 4092 3253 4840 6269 2021 2374 6902 3016 3301 4568
13295 4568 3544 1773 832 505 -547 943 3177 -810 -6623 -9308 -5954 260 2909 1108 -979
13280 -979 580 3720 3506 3480 1503 -449 -392 -1539 -120 -3088 -2758 -2016 1218 6127 6961 5055 2424
13263 2424 -118 369 346 2245 672 562 1156 407 -1925 -4055 -7256 -4945 2093 2767 488 -89 2360
13246B360K518m56j616l441K562J665M13L380K92k805l676j700L42J040j424J588
13230A042L160N509n69k436j792j469M685K698K579j827j578J060k955k401n017
13215F89n03m240O58L515k348K301l09q92j149J301K097j957J498L170l470k513
13199b152J713m46j109n44r40k283L140K580l176K286j139j986j36M814J325L42
13183B289m635o50j979p86P69K210j659J122L910O94J925K098j895j048l647j173
13167b455K378J299J182k481p30j045l891M18M560J602Q18l347n13L068K630k193
13151A300M42K773Q83l049l11N48n558J26J904o9J864N206k323l388l317M261
13135A292p73n478J107J286k65M253l270k902L745L457R20l291k208J153M81N77
$$ plain form
13246 2360 4878 4422 2806 -635 1927 3592 4005 7385 7677 4872 1196 -504 -162 878 -546 1042
13230 1042 4202 9711 9142 6706 4914 3445 8130 10828 13407 11580 10002 11062 8107 5706 689
13215 689 186 -4054 -3396 119 -2229 72 -237 -1129 -2278 -977 1120 -837 661 3831 361 -2152
13199 -2152 -439 -885 -1994 -2538 -3478 -5761 -2621 -41 -3217 -931 -2070 -4056 -4192 622 1947 2289
13183 2289 -2346 -2996 -4975 -5761 -4992 -2782 -4441 -3319 591 1285 3210 5308 3413 2365 -1282 -2455
13167 -2455 -77 1222 2404 -77 -807 -1852 -5743 -5325 -765 837 1655 -1692 -2205 863 3493 1300
13151 1300 1742 4515 5398 2349 2038 2586 -2972 -2846 -942 -1011 853 6059 3736 348 -2969 1292
13135 1292 519 -4959 -3852 -2566 -2831 1422 -1848 -4750 -1005 2452 3372 81 -2127 -974 -493 84
13119H4L006J599J162r67m902l904J954J648O36l145l249j74J161m47r76K60L338
13102b916K362l016k54K757K73K282J661k54r09J595P7o67m216j872k250j392
13086f739M53K168K984k44k224r85n07L073j143k385J084J056K672N753K810l337
13070D489j847m684k105k831R82j865J592K747N24K695j25k612m403R55J133j422
13054f777l552l248J403M324M43O74L763L883L354j587l234m799k8O316K224n997
13038b838j824M140M794k2k941k873k127q40m55N426R48k526n65L899J745P83
13022D724O15j619n870q40K584J300J578j908k545j79o41R34j594L397l67K00
13006b31Q09k166o49j73q67m07L038N166L88p27j353m660J001O43j242j511k231
$$ plain form
13119 84 3090 4689 5851 4884 -18 -3922 -1968 -320 316 -2829 -6078 -6252 -5091 -5538 -6514 -6254 -2916
13102 -2916 -554 -3570 -3824 -1067 -794 1488 3149 2895 1986 3581 3658 2991 -1225 -3097 -5347 -6739
13086 -6739 -6286 -4118 -1134 -1378 -3602 -4587 -5094 -2021 -3164 -5549 -4465 -3409 -737 5016 7826 4489
13070 4489 2642 -2042 -4147 -6978 -5996 -7861 -6269 -3522 -2998 -303 -428 -3040 -7443 -6488 -5355 -6777
13054 -6777 -10329 -13577 -12174 -7850 -7407 -6733 -2970 913 4267 2680 -554 -5353 -5381 935 3159 -2838
13038 -2838 -4662 -522 4272 4250 1309 -1564 -3691 -4531 -4986 440 1388 -1138 -1703 2196 3941 4724
13022 4724 5339 3720 -2150 -2990 -406 894 2472 564 -1981 -2160 -2801 -1867 -3461 -64 -431 -231
13006 -231 578 -1588 -2237 -2410 -3277 -3684 -646 4520 4908 4181 2828 -1832 -831 -188 -1430 -2941 -5172
12989e172o65L376N511N149j053j534k887N24L554l005J047m943l697K766L375
12974B346K921K695K218j709k761l722l907k769J446L90j226O953M574j056j853
12959D540l883m173j809K24J371L74J144J146R17K14K610j853k199Q08j022L672
12943B081K317l168k810l89k193J148P38k508L493M289o59m932j511L275L364
12928B535P66k072P52K389k156N011j813j191J330l353m286L981R92l240n65M209
12912C289K985k783m04M099L586J114n507m674l578K162N64R23K473J851J033
12897G133j959k147j456k585J097K390m004N94J660k028K666K612J365p02j449
12882C187J370K18m781m333l263J076K430J383K295M612k015q96j470m88q44l238
$$ plain form
12989 -5172 -5837 -2461 3050 8199 7146 5612 2725 3249 6803 3798 4845 -98 -3795 -1029 2346
12974 2346 5267 7962 10180 8471 5710 1988 -1919 -4688 -3242 -2852 -4078 2875 7449 6393 4540
12959 4540 657 -3516 -5325 -5101 -3730 -3356 -2212 -1066 -149 65 2675 822 -1377 -569 -1591 2081
12943 2081 4398 1230 -1580 -1969 -4162 -3014 -2276 -4784 -1291 2998 2339 -2593 -4104 -829 2535
12928 2535 3301 1229 1981 4370 2214 7225 5412 4221 5551 2198 -2088 1893 2885 -355 -920 3289
12912 3289 6274 3491 3087 7186 10772 11886 6379 1705 -1873 289 853 1776 4249 6100 7133
12897 7133 5174 3027 1571 -1014 83 2473 -1531 -937 723 -1305 1361 3973 5338 4636 3187
12882 3187 4557 4775 -6 -4339 -7602 -6526 -4096 -2713 -418 4194 2179 1283 -187 -675 -1519 -4757
12866d757j191q96L291L361M611J870k57K363K345l426n60o705m714K125M765
12851B225N84K92J291K344j063k493k511p56j399k719j58K829j874j630P27L740
12835e71l23k471j971n626p75R734O71J143K267m552l475l13J128M352J807J297
12819B322J724m843j291O395N565q26P76k820j962J49m41j122N98p67m890M36
12803i97J363J171M93j602N76j49J205m218k411L662J477M73j064Q98N667j014
12787E530j43o48J14l308n604j0K505K603J056J094k774r51J005Rk39r07K781
12770B113J782q94l275J129L451p51o733n287J393M926K999l54j002J470J918
12755B885J430n168k372K157L526j495m879P03J763m88J516L205l690j591n6o701
$$ plain form
12866 -4757 -5948 -6844 -3553 -192 4419 6289 6032 8395 10740 7314 6754 49 -4665 -2540 2225
12851 2225 2809 3101 4392 6736 5673 3180 669 -87 -1486 -4205 -4363 -1534 -3408 -5038 -4311 -571
12835 -571 -894 -3365 -5336 -10962 -11737 -2003 -1332 -189 2078 -2474 -5949 -6262 -5134 -782 1025 2322
12819 2322 4046 -797 -2088 4307 9872 9046 9822 7002 5040 5189 4748 3626 4224 3457 -1433 -997
12803 -997 366 1537 2030 428 1004 855 2060 -2158 -4569 -907 570 1043 -21 877 6544 5530
12787 5530 5387 4739 4853 1545 -4059 -4069 -1564 1039 2095 3189 415 -536 469 478 239 -668 2113
12770 2113 3895 3001 -274 855 4306 3555 -3178 -8465 -7072 -2146 853 499 -503 967 2885
12755 2885 4315 -853 -3225 -1068 2458 963 -3916 -3213 -1450 -1938 -422 2783 -907 -2498 -2554 -9255
12739i255m69J692K673K137k817j00J862K897q01j282J260l87P58L833L726o551
12723h24p691k840r30K868L867p20L744L686k848k461k317J737J691K773j339
12708a604j222j018l885j789N505J984l937l91K062K467l84J282J580J034j79
12693A505m91o039J279J477k737m588M539M210j168p47r63L1J949j209j383k026
12677f361K000p29k408j76L229K299L6l918Q10K796o00Q84k181l095l235N215
12661e434K710k105l222O71N18j913M046M267k930j094L588j08j510l45j029M050
12645A60M782L212l412l394j41m556j135J228M74k473j416J367m15L600K523o40
12629b36k340k389k574m43j265L212N757M876Q88m052o390j554L035M670K078
$$ plain form
12739 -9255 -9724 -8032 -5359 -3222 -6039 -6139 -4277 -1380 -2181 -3463 -2203 -2590 -1832 2001 5727 -824
12723 -824 -8515 -11355 -12285 -9417 -5550 -6270 -2526 1160 -1688 -4149 -6466 -4729 -3038 -265 -1604
12708 -1604 -2826 -3844 -7729 -9518 -4013 -2029 -5966 -6357 -4295 -1828 -2212 -930 650 1684 1505
12693 1505 1014 -5025 -3746 -2269 -5006 -9594 -5055 -845 -2013 -2760 -3723 -3692 -1743 -2952 -4335 -6361
12677 -6361 -4361 -5090 -7498 -7674 -4445 -2146 -2110 -6028 -5218 -2422 -3022 -2138 -4319 -7414 -10649 -5434
12661 -5434 -2724 -4829 -8051 -7380 -6862 -8775 -4729 -462 -3392 -4486 -898 -1006 -2516 -2861 -3890 160
12645 160 4942 8154 4742 1348 1207 -3349 -4484 -3256 -2782 -5255 -6671 -5304 -5719 -2119 404 -236
12629 -236 -2576 -4965 -7539 -7982 -9247 -6035 -278 4598 5486 1434 -4956 -6510 -3475 1195 3273
12614C273o677k982K094L527L771l54j286J359K020K415l219J20J466P17j752
12599D492l829J26l377k465K68J129J636q51k338L653N54k83M870J099J842l967
12583B559J475M397q52J52n932k675j672l97M945O68p44j341P38J869n085k897
12567d792k395K056J727K735K864K113p09l38j892l048K105k072j995p47Q36k857
12551f409q01J191J618J446o84Q59l97J325M738k624n301L209M918K003k153J428
12535D366j239O39K724J605k500q96Q96j528K219l016n967j348M824j977N85R42
12519C29M759Q38k142k10M253j223k707j047M04J978K547M41Q33m00j474J863
12503I042J067R84j465K358L987M52p60J685q58o216l769j426q61j605J011n58
$$ plain form
12614 3273 -3404 -6386 -4292 -765 3006 2652 1366 2725 4745 7160 3941 4061 5527 6244 4492
12599 4492 663 789 -2588 -5053 -4785 -3656 -2020 -2871 -5209 -1556 -1002 -1285 3585 4684 6526 2559
12583 2559 4034 8431 7579 7731 1799 -876 -2548 -2945 2000 2668 1924 583 1321 3190 -1895 -4792
12567 -4792 -7187 -5131 -3404 -669 2195 4308 3599 3261 1369 -1679 426 -1646 -3641 -4388 -3552 -6409
12551 -6409 -7210 -6019 -4401 -2955 -3639 -2780 -3177 -1852 2886 262 -5039 -1830 3088 5091 2938 4366
12535 4366 3127 3766 6490 8095 5595 4699 5595 4067 6286 3270 -2697 -4045 779 -1198 -613 329
12519 329 5088 5926 3784 3574 7827 6604 3897 2850 3254 5232 7779 8220 9053 8653 7179 9042
12503 9042 10109 11093 9628 11986 15973 16425 15665 17350 16492 10276 6507 5081 4220 2615 3626 3068
12487C068J56L385m404j844L473K573J664K80R76M222J044O05R24L591j365K095
12471B0443P975K696L617j714m131n672r359j443J47k221m045k103L69K869K902
12456A0330j054j080k562Q85M217L529J089M574M403P623R035L625J403K72p074
12441C9215p967l404n601n798K602J013j837L26M98n876k122n80R63J962J596
12426A4990J815J757Q14k68O970L333M166N393O282Q264M683j89m152p846q573
12411C7439q094l209r97l400l852J16J046J510L090n07K899N312j274l119M872
12396C1832K8j710O35M81N566R146J0283J0646N345k002p721p65P145J4019J7784
12381A00712K5094L1669K4203P327j4139k9938k5623k1965j5520r451o652m171
$$ plain form
12487 3068 3224 6609 2205 361 3834 6407 8071 8351 9327 13549 14593 15198 16122 19713 18348 20443
12471 20443 28418 31114 34731 33017 28886 23214 13855 12412 12559 10338 6293 4190 4559 7428 10330
12456 10330 9276 8196 5634 6519 10736 14265 15354 19928 24331 31954 40989 44614 46017 46289 39215
12441 39215 31248 27844 22243 16445 19047 20060 18223 18549 19047 13171 11049 10469 11432 13394 14990
12426 14990 16805 18562 19376 19108 26078 29411 33577 38970 45252 53516 58199 58010 53858 46012 37439
12411 37439 29345 26136 25139 21739 17887 18003 19049 20559 23649 23142 26041 31353 30079 26960 31832
12396 31832 31860 30150 30785 31266 36832 45978 56261 66907 72252 70250 62529 61764 68909 82928 100712
12381 100712 125806 157475 181678 189005 174866 144928 119305 97340 81820 72369 65717 61546
12369F1546k975n877o191k017M147N303L630j42k103j270p649k561m666l731q48
12354C4596p1j94k33O7k693k969k100L686l31k481r52o39J36J681m462j344n61
12337B1136J502j417J357J394J907j109k618m259m876M579K05l731k682k000k09
12322I179o26K517j882j516j620J175M127J324j631K45M10K168P68k178j300j383
12306I777l411L384Q31o60J096P52k252l279p22K820r14m71n147l548J517L788
12290C561J492M657J639p38K538k259m435M45J925j048k117j93J892Q15l616L080
12274G638R09J275J650l758k23J902J37k82k132k973K194K661j047j328k102P09
12258E230k721k937L559J156m931k084P30L962j751K752n86M36K727k885n520
$$ plain form
12369 61546 58571 52694 46503 44486 48633 53936 57566 57424 55321 54051 46402 43841 39175 35444 34596
12354 34596 34525 34331 34098 34165 31472 28503 26403 30089 29758 27277 26325 25686 25822 27503 23041 21697 21136
12337 21136 22638 21221 22578 23972 25879 24770 22152 17893 13017 17596 17801 14070 11388 9388 9179
12322 9179 8553 11070 9188 7672 6052 7227 11354 12678 11047 11292 11702 13870 14638 12460 11160 9777
12306 9777 6366 9750 10581 9921 11017 11769 9517 6238 5516 8336 7422 6951 1804 -1744 -227 3561
12290 3561 5053 9710 11349 10611 13149 10890 6455 6900 8825 7777 5660 5467 7359 8174 4558 7638
12274 7638 8547 9822 11472 7714 7491 9393 9530 9248 7116 4143 6337 8998 7951 6623 4521 5230
12258 5230 2509 -428 3131 4287 -644 -2728 -1998 1964 213 2965 2379 2815 5542 2657 -2863
12243b863k51K732K967K300k579j449K278j178K644rM171m43l008Q16m71l311
12227B346L19Q28M164N17k750j002l73j025L16r76J06k21K930q24q95K352J062
12210F874m051l330j019J654K759j838k650K202J528K036k175m789k643L465p19
12195b696K354N927K039m671l247k321L39j11K717l341J315M223p35rj981L203
12179C005r77K399J715k544M46J27l790K115j584m918q66K384L63K584P08J997
12163C164J871Q00O95l782P4o57M022J592k884j217J85J818j242q64R14k233l82
12146A874J181j906L155m74l511n77K633n07k254R45k41j573M75N13L149M81k681
12129F82k828O31K573K549L283o48k861J694q43l791j574l54J77j089L706l454
$$ plain form
12243 -2863 -3114 -382 2585 4885 2306 857 3135 1957 4601 4592 8763 8320 5312 6128 5657 2346
12227 2346 2665 3493 7657 8174 5424 4422 4049 3024 3340 2364 2470 2249 5179 4355 3460 5812 6874
12210 6874 2823 -507 -1526 128 2887 1049 -1601 601 2129 4165 1990 -2799 -5442 -1977 -2696
12195 -2696 -342 5585 7624 2953 -294 -2615 -2276 -2387 330 -3011 -1696 2527 1792 1783 -198 3005
12179 3005 2028 4427 6142 3598 4044 4171 381 2496 912 -4006 -4872 -2488 -2125 459 1167 3164
12163 3164 5035 5835 6530 2748 2822 2165 6187 7779 4895 3678 3863 5681 4439 3575 4489 2256 1874
12146 1874 3055 1149 4304 3830 319 -258 2375 1868 -386 559 318 -1255 -780 -267 2882 3363 682
12129 682 -2146 -1515 1058 3607 6890 6242 3381 5075 4232 441 -1133 -1487 -1310 -2399 1307 -2147
12113b147J92M768r53k831K3N318J316k085j085j216j224K762L268K985k202l059
12097C830l478l458m045P22L402j421K33M151J148j19j115L086q36j59J798r69
12081B770n644K361M338J95k960N100P335M093p77l175m28K291j32l157J185j380
12065A2015j111J73n77k0l813J333J632j651N61m55m238K100K533M737M926j849
12049A6296m308l909k360M007M219J379n05R5j759k389J815N324M195j031m511
12034A6558o89m169k525l486o936j826J076N012J676P66j623m348L76N049K477
12019G388M519N953j410j251m228m664K293M243R26n16P255L716l280n272o253
12004I419l051J689K308k987k989Q7M101K134m901l603q28K138N11M612N703L798
$$ plain form
12113 -2147 -1955 2813 1860 -971 -948 4370 5686 3601 2516 1300 76 2838 6106 9091 6889 3830
12097 3830 352 -3106 -7151 -6429 -3027 -4448 -4215 -64 1084 965 -150 2936 2100 1941 3739 2770
12081 2770 -2874 -513 3825 4020 1060 6160 13495 17588 16811 13636 13208 15499 15367 12210 13395 12015
12065 12015 10904 11077 10500 10480 6667 8000 9632 7981 8542 8087 3849 5949 8482 13219 18145 16296
12049 16296 11988 8079 5719 9726 13945 15324 14819 14914 13155 10766 12581 17905 22100 21069 16558
12034 16558 15869 11700 9175 5689 -1247 -3073 -1997 3015 4691 5457 3834 -514 -138 4911 7388
12019 7388 11907 17860 16450 15199 10971 6307 8600 12843 13769 13253 20508 24224 20944 15672 9419
12004 9419 6368 8057 10365 7378 4389 4476 8577 10711 5810 2207 1379 3517 4028 8640 14343 18141
11988A8141j197n051j707o96j827l321J668L186o3k137K329J984p09l138r02r45
11972E615k052K148j22m387K691L536J825J73j419m058K23K055P65R55q92j109
11956E947j103r21k15k62J548k815m75J88O094J0696l92p18k139j056j597N51
11940A3331k658j663k869k940R91K031J394j508M464q9k335k121m923k21K703
11925C587J346L080q07r91K918K051j72N89j298j256L600K078N97k490j039k201
11909I592R02l26O12k70m50J093K189k168J616K782p39Q19n375l767k044K831
11893G297J690j356o83J222K315J365j537m87k441n059L730L833r02j883j980
11878E124J261M348k388l451j110j001p82L120L877K251J873j660K030m996l92
$$ plain form
11988 18141 16944 11893 10186 9490 7663 4342 6010 9196 9133 6996 9325 11309 10600 7462 6560 5615
11972 5615 3563 5711 5589 1202 3893 7429 9254 9427 8008 3950 4173 6228 6993 7948 7056 5947
11956 5947 4844 3923 3708 3446 4994 2179 1704 1892 7986 18682 18290 17572 15433 14377 12780 13331
11940 13331 10673 9010 6141 3201 4192 6223 7617 6109 10573 10484 8149 6028 1105 884 3587
11925 3587 4933 8013 7206 6215 9133 11184 11012 11601 10303 9047 12647 14725 15322 12832 11793 9592
11909 9592 10494 10168 10780 10510 10060 11153 13342 11174 12790 15572 14833 15652 10277 6510 4466 7297
11893 7297 8987 7631 6948 8170 10485 11850 10313 9826 7385 2326 6056 9889 8987 7104 5124
11878 5124 6385 10733 8345 4894 3784 2783 2001 5121 8998 11249 13122 11462 13492 8496 8104
11863H104L027M08n331J387m40l556J476j376k857p89L973P92p10O04j68L054
11847G598J79L384K184o32k430j035k078l989K670K034K234K566j78k867l251
11832F389J12K967L378N225M512n344r799q005q449n177j820M000R098J7060K1912
11817C6059J7384O230j541j3893j8639j8936j2330l050L880K914J1082P900J057
11804A8117K08j365n116p071l01j296M54M426K381L64L010J34j996k350M397J784
11788A5780j996J372r79P13k597l229k734M268M122Q10k233o388Q70J180j507
11773G452j526p75N91k431k106J650M208K128Q98r81k481P76L649K100R45N04
11757A4601k905m989k67L100Q08k248l116O58J330L935N445k783j715L907P460
$$ plain form
11863 8104 11131 11539 6208 7595 7155 3599 5075 3699 842 53 4026 4818 4108 4712 4544 7598
11847 7598 7777 11161 13345 12713 10283 9248 7170 3181 5851 7885 10119 12685 12507 9640 6389
11832 6389 6501 9468 12846 18071 22583 17239 7440 -565 -9014 -14191 -16011 -12011 -2913 14147 36059
11817 36059 53443 59673 58132 44239 25600 6664 -5666 -8716 -4836 -1922 9160 17060 18117
11804 18117 18325 16960 11844 4773 4472 3176 3630 8056 10437 10801 13811 13945 11949 9599 13996 15780
11788 15780 13784 15156 14177 14890 12293 9064 6330 10598 14720 15530 13297 6909 7779 8959 7452
11773 7452 5926 5151 5742 3311 1205 2855 7063 9191 10089 9108 6627 7403 11052 13152 14097 14601
11757 14601 11696 6707 6440 9540 10348 8100 4984 5642 6972 10907 16352 13569 11854 15761 23221
11742B3221M473L064O263j444l261k957j460j590m528n791J812N84j611j098K081
11727A7758O72m402l400k644K495O621K649N78O502K729N258Q778J983m873j354
11712C9350m683l841o709j009j923l230O73J124m207p43K754l35l473m722L045
11697A2071L509J654j289O12K509N259M27j237k189k092j175J811k340L40k413
11682A5457o354p61m002J332M883l367o70M047L166k187k36l202k464L797O792
11667A6231J3241Q380N649K330k516n666m840m868j242r69k886m862Q32l33n394
11652A3087j750R66j309K396P082Q473O107M976J0567P521J1949R303Q009n357
11638H2020j2739j1561q214j0111o704k159K353N630J128p292o559m107o134q570
$$ plain form
11742 23221 27694 30758 37021 35577 32316 29359 27899 26309 21781 15990 17802 18386 16775 15677 17758
11727 17758 18430 14028 10628 7984 10479 17100 19749 20327 26829 29558 34816 43594 45577 40704 39350
11712 39350 34667 30826 24117 23108 21185 17955 18628 19752 15545 14802 17556 17221 13748 9026 12071
11697 12071 15580 17234 15945 16557 19066 24325 24752 23515 21326 19234 18059 19870 17530 17870 15457
11682 15457 9103 8342 4340 5672 10555 7188 6518 10565 13731 11544 11308 8106 5642 9439 16231
11667 16231 29472 37852 43501 45831 43315 37649 32809 27941 26699 25730 22844 17982 18814 18481 13087
11652 13087 11337 12303 10994 13390 20472 28945 35052 40028 50595 58116 70065 79368 87377 82020
11638 82020 69281 57720 49506 39395 32691 30532 32885 38515 39643 32351 25792 21685 15551 6981
11624F981l922j70Q81K367K575R746J6598J5519M873L660j012j1105r117m605
11610C3269n251K15j621l309j313k378O01j089j554j2l63N75j703J840N77l44
11594A8140M085Pk30J059K778j52J970J693r32q66L39n312q447k149o23j239j632
11577H489M61J71N763P19j786o95J39M268J0593P284R940Q580K525m125n620p155
11561C9551q220n247m18j177m02o83l161m558j798K488p68N910M282J21J620K100
11545B9640J22J589P508R890J333n445o110n868j390j737n935n035m82j690j11
11530A6279k925K966L681k524j903J692N42M509j683p92J857l202J062K26k536
11515A7249m323k443m72L280n8n47L373k333r72j228K014O15Q13L117q92O744
$$ plain form
11624 6981 3059 2889 3770 6137 8712 18458 35056 50575 55448 59108 58096 46991 37874 33269
11610 33269 28018 28233 26612 23303 21990 19612 20213 19124 17570 17558 17195 17770 16067 17907 18484 18140
11594 18140 22225 22232 22002 23061 25839 25687 27657 29350 28418 27552 27891 22579 14132 11983 11360 10121 8489
11577 8489 8950 9121 14884 15603 13817 13122 13261 17529 28122 35406 45346 53926 56451 52326 46706 39551
11561 39551 31331 26084 25666 24489 24087 23404 20243 15685 13887 16375 15607 21517 25799 25920 27540 29640
11545 29640 29762 31351 38859 48749 50082 44637 38527 32659 31269 29532 23597 18562 18080 16390 16279
11530 16279 13354 16320 20001 17477 15574 17266 17808 22317 20634 19842 21699 18497 19559 19785 17249
11515 17249 12926 10483 10011 13291 13233 12686 16059 13726 12754 11526 13540 14155 14968 18085 17193 23937
11499B3937N677J485j079j84L373l869l840p9k155N6j594j707J067j545N383J673
11483B6599l484k880L287L787L210QM351O956M477N039R652J992r870m088r53
11468D8083m560k888k801o477p58j893k041j799K498n777l291J005R28J362K517
11453B4108J135N880K653L940O110j083k824l076k657n298l737m682l116k011
11439A5342J656k509j417j814J349L138K539L691K844L43K857Q320M676J0213
11425E1228J0127Q418M425p89p072j1347j1477j0918j072o410o846k495N85L949
11411B0306J137j078L284J573j264N703L060O023Q842J7183K2920K4012J5479
11398A27180k010j9075k0098j4200j6688q988o390m039j478L400m35k989L336
$$ plain form
11499 23937 29614 31099 30020 29836 33209 29340 25500 25421 23266 23322 21728 20021 21088 19543 24926 26599
11483 26599 23115 20235 23522 27309 30519 30527 34878 41834 46311 51350 61002 62994 53124 49036 48083
11468 48083 43523 40635 37834 31357 30599 28706 26665 24866 27364 21587 18296 19301 20229 21591 24108
11453 24108 25243 31123 33776 37716 43826 42743 39919 36843 34186 28888 25151 20469 17353 15342
11439 15342 16998 14489 13072 11258 12607 15745 18284 21975 24819 25162 28019 36339 41015 51228
11425 51228 61355 69773 74198 73409 66337 54990 43513 32595 31523 25113 18267 15772 16357 20306
11411 20306 21443 20365 23649 25222 23958 29661 32721 38744 47586 64769 87689 111701 127180
11398 127180 125170 106095 85997 71797 55109 46121 39731 35692 34214 37614 37179 34190 37526
11385C7526n1k830J71J682M877K730L730O038R977P406N968K160l142q282j3688
11370E4272j2421m670k516j838J216j138m881Q50M849N229l384m27M380K390K806
11355D4717J674K337J723O737J0362J2080M933j867o94m592k992K326K727J623
11341H1094N227L985Q484J2595R768J1652J5741K1602L0108M2152M9685O3904
11329C55997R6528J32044J89714K75382L94134N51452O70998O01372K19947k75664
11319C211904n48563n42662m12162k84848j92953j28113q8629n8540l4642j0250
11309I10542K0009M5122O9878J08050J67937K53412L77944N62599Q36878J176510
11299D528881J404716J145256K56936p70043j240939j138721q38302n78496m04949
$$ plain form
11385 37526 37475 34645 34816 36498 41375 44105 47835 53873 63850 71256 77224 79384 76242 67960 54272
11370 54272 41851 37181 34665 32827 34043 32905 28024 28874 33723 38952 35568 35141 39521 41911 44717
11355 44717 46391 48728 50451 57188 67550 79630 84563 82696 82002 77410 74418 76744 79471 81094
11341 81094 86321 90306 98790 111385 121153 132805 148546 170148 200256 242408 292093 355997
11329 355997 452525 584569 774283 1049665 1443799 1995251 2666249 3267621 3487568 3211904
11319 3211904 2663341 2120679 1708517 1423669 1230716 1102603 1013974 955434 920792 910542
11309 910542 930551 975673 1045551 1153601 1321538 1574950 1952894 2515493 3352371 4528881
11299 4528881 5933597 7078853 7335789 6565746 5324807 4186086 3347784 2769288 2364339
11290B364339k90002k14073j57572j11602p5570m9275l2996j0182J3656N1394
11280A488117J03257J77386K86010M47388O35373P34273N34898N813n24271p00056
11270C188188n95280m22320k88001j94943j43370j05322p0712n4259l7779k3773
11260A252429n033J6875L6366O0347Q3910J23191J82396K70081M06193O10248
11250C037003Q96329J249175J433320J096581J67469q07032j223466j114911q17805
11241C916663n56564l81140k65362j84976j16830o4409q371M8965R6097J58261
11231B642334K49729L82088N79617Q71740J322189J989256K752410L024772J989753
11222A5803888k48762k186786k712458k246970j590983j078331p48544n45672
$$ plain form
11290 2364339 2074337 1860264 1702692 1591090 1515520 1466245 1433249 1423067 1436723 1488117
11280 1488117 1591374 1768760 2054770 2502158 3137531 3871804 4406702 4412515 3888244 3188188
11270 3188188 2592908 2170588 1882587 1687644 1544274 1438952 1368240 1313981 1276202 1252429
11260 1252429 1247396 1264271 1300637 1360984 1444894 1568085 1750481 2020562 2426755 3037003
11250 3037003 3933332 5182507 6615827 7712408 7879877 7072845 5849379 4734468 3916663
11241 3916663 3360099 2978959 2713597 2528621 2411791 2347382 2339011 2387976 2484073 2642334
11231 2642334 2892063 3274151 3853768 4725508 6047697 8036953 10789363 13814135 15803888
11222 15803888 15555126 13368340 10655882 8408912 6817929 5739598 4991054 4445382
11214D445382m10162l00842k19324j59221j04059n4898n556O1154J48204K64083
11204C664761M24942O68949R86175J297526J306501P17642k98692j108343j321522
11195F337939j106416q07311n67682m02641l09677k40736j86482j49555j22517
11186B444922j00989p8834n2413l7770k4180J605K4049O4130J20185J99329L31579
11175B891613N26908P49583Q15968M85460j66067o70059p53594n90125m03541
11166B886146k74746j91040j35507r7122p0582m0881j0595J3425M3969Q6159J39580
11155B348806K15459L31115N10737P85804J165191J526824J489058O98111n31320
11146H539785j334680j396120j084367p53938n10910l62023k73795k07651j60894
$$ plain form
11214 4445382 4035220 3734378 3515054 3355833 3251774 3196876 3191320 3252474 3400678 3664761
11204 3664761 4089703 4758652 5744827 7042353 8348854 9066496 8767804 7659461 6337939
11195 6337939 5231523 4424212 3856530 3453889 3144212 2903476 2716994 2567439 2444922
11186 2444922 2343933 2265099 2212686 2174916 2150736 2152341 2176390 2240520 2360705 2560034 2891613
11175 2891613 3418521 4168104 4984072 5469532 5303465 4633406 3879812 3289687 2886146
11166 2886146 2611400 2420360 2284853 2187731 2117149 2076268 2065673 2079098 2123067 2209226 2348806
11155 2348806 2564265 2895380 3406117 4191921 5357112 6883936 8372994 9071105 8539785
11146 8539785 7205105 5808985 4724618 3970680 3459770 3097747 2823952 2616301 2455407
11137B455407j13769q3023o3769l4701k315L1273Q5418J52793K48644L92803N82361
11126C651122P25477O37908J96780l73966p00710o93651n31925l79496k67691
11117B263848j93973j53574j26817j01820q5123p3317o5139n7958m7337l9865
11107A318925l9389l7603l6888l2412l3302k6954k7153k5361k2894k8228k6063
11096I82678k1006j8985j3566j5392j5199j8684j8217j4386j8778j9560j9214
11085G89691j9341j4925j5781j5725j5394j0831j5602j3865j2468j0904p556j5465
11073F21834j6791j0945p580o336p354o385r151p789j1230j1405r614j2193j0537
11060D94524o646n439p499o093l432r308q052j0553j0034o330j1491n507n584
$$ plain form
11137 2455407 2341638 2258615 2194846 2160145 2157830 2189103 2274521 2427314 2675958 3068761 3651122
11126 3651122 4376599 5014507 5211287 4837321 4136611 3442960 2911035 2531539 2263848
11117 2263848 2069875 1916301 1789484 1687664 1602541 1529224 1464085 1406127 1358790 1318925
11107 1318925 1279536 1241933 1205045 1172633 1139331 1112377 1085224 1059863 1036969 1008741 982678
11096 982678 961672 942687 929121 913729 898530 879846 861629 847243 828465 808905 789691
11085 789691 770350 755425 739644 723919 708525 697694 682092 668227 655759 644855 637299 621834
11073 621834 605043 594098 586518 580182 572828 566443 557292 549503 538273 526868 517254 505061 494524
11060 494524 487878 482439 474940 468847 465415 456107 448055 437502 427468 421138 409647 404140 398556
11047C98556k052j721k872n474q232n825o904o618j943o192n479o409p508p018
11033C24309n638o312m873r69J823k576n751n289n455o900p956p550m835m982
11019B57046m956o05j498l830n46m86n963n543r148j403N420j280m291m85k667
11004B19765j465j716k725n121m747p746n466m468J134J859o8m73p983m756n562
10989A70462m480L34L55k093m905j437k29k534k112p91l115k658J665k633m19
10974A45410K553k581k754J133j124n236m074m389l783m022K458k07J958J68n076
10959A20434k125L932j680k920j379o629m282L518L937K014R70j243p659q275
10945I8613j237J043J253J306k25n556J952l172p759M50K019L191M07j048k659
$$ plain form
11047 398556 396504 394783 391911 386437 378205 372380 365476 358858 356915 350723 345244 338835 331327 324309
11033 324309 318671 312359 307486 306517 308340 305764 300013 294724 289269 282369 274413 266863 262028 257046
11019 257046 252090 251485 249987 246157 245611 245125 239162 233619 224471 223068 228488 227208 222917 222432 219765
11004 219765 218300 216584 213859 208738 203991 196245 190779 186311 187445 189304 189236 188763 180780 176024 170462
10989 170462 165982 166316 166671 164578 159673 158236 158007 155473 153361 152570 149455 146797 148462 145829 145410
10974 145410 147963 145382 142628 143761 142637 137401 133327 128938 125155 121133 123591 123384 125342 125510 120434
10959 120434 118309 122241 120561 117641 116262 109633 105351 108869 112806 114820 115790 114547 106888 98613
10945 98613 97376 98419 99672 100978 100753 95197 97149 93977 86218 86668 88687 91878 92285 91237 88578
10930H8578j91M850J268J311J53R02k420j363k961n700p379o349j529n6K938J535
10914G3587M43k695p98OJ830j139j209K753M059P54J153j967J022M045M520k161
10898H4203K75N492L878p143m798l9k680n713m161k498J001n508J290M445P35
10883F8779k093J200O07j874K345L759J505O108P525R292L038n107r678m121p344
10868G3941p116j610J167K055l24J920J119k037n267j542J685k6l693r55N06l308
10852E6515J991J332P324J169m632n415k115l615k74J990j722J526k872o314J095
10837D5983M939J878J759J284n41j401K095M399K776L566l015K741Q983O824K800
10822H5070J296l509l311n812r613k644j789L736n540o503K133L372J230k94M46
$$ plain form
10930 88578 88387 93237 94505 95816 95969 96871 94451 93088 90127 84427 77048 70699 69170 69114 72052 73587
10914 73587 74030 71335 70537 70543 72373 71234 70025 72778 76837 77591 78744 76777 77799 81844 86364 84203
10898 84203 84478 89970 93848 86705 81907 81868 79188 73475 69314 66816 67817 62309 63599 68044 68779
10883 68779 66686 67886 68493 66619 68964 72723 74228 80336 87861 97153 100191 95084 85406 81285 73941
10868 73941 66825 65215 66382 68437 68113 70033 71152 69115 63848 62306 63991 63965 60272 59317 59823 56515
10852 56515 58506 59838 67162 68331 63699 58284 56169 52554 52280 54270 52548 54074 51202 44888 45983
10837 45983 50922 52800 54559 55843 55302 53901 55996 60395 63171 66737 63722 66463 75446 82270 85070
10822 85070 86366 82857 79546 73734 64121 61477 59688 63424 57884 51381 53514 56886 58116 57822 58268
10807E8268o44K852N750P735J1040Q431J0863J4866Q607M550n285j2661j4628
10794I9744p241l477k098l925m78j503o601r782m63j453J518J754k984k199K140
10779F2952K334O293P981O884L561K570n297n948r140n879J415p671p259l843
10765D8953l108J065L58m061J854K020k253M76L367L213K971K628K049L232P230
10750F9994P657L897L276J451j786m132R06n625o910m764l966k644j103J280L135
10735F0666O18p76L26L308O1N037P434P549O639K875N209L368l290q159n013n222
10719H0630q840o799j623j674k780m579k9N59k88K837L714J458P20j492K921Q392
10703G3127N130k56O183j300m670j258m984m565j999p87r245n341K206K697K446
$$ plain form
10807 58268 57624 60476 66226 73961 85001 93432 104295 119161 127768 132318 127033 114372 99744
10794 99744 92503 89026 86928 83003 82525 81022 74421 64639 64176 62723 64241 65995 63011 60812 62952
10779 62952 65286 71579 79560 86444 90005 92575 87278 81330 72190 66311 67726 60055 52796 48953
10765 48953 45845 46910 47268 43207 45061 47081 44828 45304 48671 51884 54855 57483 59532 62764 69994
10750 69994 77651 81548 84824 86275 84489 80357 81263 75638 68728 63964 59998 57354 56251 57531 60666
10735 60666 61284 60508 60834 64142 64203 69240 76674 84223 90862 93737 98946 102314 99024 90865 85852 80630
10719 80630 71790 64991 63368 61694 58914 54335 54306 54865 54577 57414 61128 62586 63306 61814 64735 73127
10703 73127 78257 78001 84184 82884 78214 76956 71972 67407 65408 64621 55376 50035 52241 54938 57384
10688E7384n704J278j058k164m72J272l68j290L054K477o77L872L311l358l329
10673E4228m546K18k99m786J675L053R79m123J091j327n902l241P48L164J276
10658D2208J403L507r13K81K62R211M436k282k222n157k693N900O476j303p052
10643E2062l894j490l750M093N42m74k977k765l981n68j944J417L455K429n3K80
10627D2382k06k314j590K706K63j495N95M57q40l981l281j193l584k28L193K544
10611C3428L862n14K820j195k589o86L76J952o50o17L600J026K271P88N75m099
10595D0348o810j580N638M813r04k717J58L074L76l735k976l151j893k21j33J30
10579C0417L262M8J743M765K111j657j002M679M267J829n713o726p05J66j167
$$ plain form
10688 57384 51680 52958 51900 49736 49264 50536 50168 48878 51932 54409 53732 57604 60915 57557 54228
10673 54228 49682 49900 49601 44815 46490 49543 50522 46399 47490 46163 40261 37020 37768 40932 42208
10658 42208 43611 47118 46205 46486 46748 55959 60395 58113 55891 50734 48041 53941 60417 59114 52062
10643 52062 48168 46678 42928 47021 47563 47089 44112 41347 37366 36798 34854 36271 39726 42155 42102 42382
10627 42382 42176 39862 38272 40978 41241 39746 40341 40798 39958 35977 32696 31503 27919 27691 30884 33428
10611 33428 37290 36776 39596 38401 35812 35126 35502 37454 36804 36187 39787 40813 43084 43872 44447 40348
10595 40348 33538 31958 37596 42409 41505 38788 38946 42020 42396 38661 35685 32534 30641 30420 30287 30417
10579 30417 33679 33727 35470 40235 42346 40689 39687 44366 48633 50462 44749 38023 37318 37484 36317
10564C6317J062j162L605n67j998Q40k6l378j286J309J345r51k635J754J652r60
10548C4921J69R21L855K002l5j774K723k482l080J514J536L350L294K352j90l829
10532D5247k458L74K107K004j982l893k391n40m63l13j12l059J995r8j938k102
10516C2378j136q15N621M998K510k231k40N156L659j247j001l671n130L91k224
10501C7018P77J801J181O900M386M912N297N017O722N351N377J1860J7554K5270
10487A39423M5542P6727J18089J78487K26860K00472P5558p6656j82951j96062
10477F05489j51948r9343o2197m0528k4631j7295j7535r220p960j5104j4125j1784
10465A33819n561o908p942p131n249n787n680q763k337j79o53m60k971J751r97
$$ plain form
10564 36317 37379 36217 39822 39255 37257 38097 38071 34693 33407 34716 36061 35110 32475 34229 35881 34921
10548 34921 35090 36011 39866 41868 41833 40059 42782 40300 37220 38734 40270 43620 46914 49266 49076 45247
10532 45247 42789 43163 45270 47274 45292 41399 39008 38468 38005 37692 37580 34521 36516 36418 34480 32378
10516 32378 31242 30427 36048 41046 43556 41325 41085 46241 49900 48653 47652 43981 38851 39242 37018
10501 37018 37795 39596 40777 47677 52063 56975 62272 67289 74011 79362 84739 96599 114153 139423
10487 139423 184965 261692 379781 558268 785128 985600 1061158 984502 801551 605489
10477 605489 453541 354198 292001 251473 226842 209547 192012 182792 174832 159728 145603 133819
10465 133819 128258 121350 113408 106277 101028 95241 89561 80798 78461 78282 77629 77169 74198 75949 74952
10450G4952N749N020k279L155J685k333k212j723n607L44J47J702K546l829k511
10435G4806k072k262L746N57k166k195q6O74k42l041p33j325m008j883n602l97
10419E3771k756K431L577Q66M874K7N46l524l038j265j634j459L08L810o98J687
10403E7523j259o370k381K307L374M765M339Q70K970m91n268J15N37l534j576
10388E5921K309L518L862P065L418J517J064P803J7200L2872N6379O9844N0257
10375C13029k5084o1223m5621l1438k5917j7985j4065l157p751p760p06l687j084
10362F7551M086j254p771k870j154k197m3O9j433K87J622J69J712L585N067J607
10346F9033j570l756k765k007m422k774n626k686n83j225j081P21M992K468L053
$$ plain form
10450 74952 80701 85721 83442 86597 88282 85949 83737 82014 76407 76751 76898 78600 81146 77317 74806
10435 74806 72734 70472 74218 74775 72609 70414 70328 71002 70760 67719 66986 65661 61653 59770 54168 53771
10419 53771 51015 53446 57023 57889 62763 62790 63336 59812 56774 55509 53875 52416 52724 56534 55836 57523
10403 57523 56264 49894 47513 49820 53194 57959 62298 63168 66138 65647 60379 60494 61031 57497 55921
10388 55921 58230 61748 65610 72675 76093 77610 78674 86477 103677 136549 192928 262772 313029
10375 313029 287945 226722 181101 149663 123746 105761 91696 88539 80788 73028 72322 68635 67551
10362 67551 71637 70383 62612 59742 58588 56391 56348 56417 54984 55271 56893 57062 58774 62359 67426 69033
10346 69033 67463 63707 60942 58935 54513 51739 46113 43427 42844 41619 40538 41259 46251 48719 51772
10331E1772N038o93j40N42J824M446R565J4711J7727K0861J9007R769j844q206
10317A44379j4678j3339r435q267p926n574m567q509o55K813J82L655J037n163
10303G3953j014j761j216j583N05N162J188J627K779l910o650k403l687k517n688
10288E4785l153p30Q026L791K394Q54k830L241P970m87l106q170n768p23p1m066
10272E1957k496l02j696O794O691L29L401M354L157R090M288O446M738K54p177
10257H9828j0067r941r682m613j139J630Q217O656K224L431J0529J0811Q070Q477
10243A14431M24q37m735m658J86L288L861M029m883n665o688l881l150j901P08
10228I0529k555K920L062J0j682j0518j1725j6858j4100m556j151L015K452K633
$$ plain form
10331 51772 56810 56117 55977 56519 58343 62789 72354 87065 104792 125653 144660 154429 152585 144379
10317 144379 129701 116362 106927 98660 90734 85160 80593 72084 71429 74242 74424 78079 79116 73953
10303 73953 72939 71178 69962 68379 68884 74046 75234 76861 79640 75730 69080 66677 62990 60473 54785
10288 54785 51632 50902 58928 62719 65113 65967 63137 66378 74348 73861 70755 62585 56817 56094 56023 51957
10272 51957 49461 49159 47463 54257 60948 61277 64678 69032 72189 81279 85567 92013 96751 97005 89828
10257 89828 79761 69820 60138 55525 54386 56016 64233 70889 73113 76544 87073 97884 105954 114431
10243 114431 114855 114018 109283 104625 104811 108099 111960 115989 111106 105441 98753 94872 91722 89821 90529
10228 90529 87974 90894 93956 93966 92284 81766 70041 53183 39083 34527 33376 36391 38843 41476
10214D1476R094J1929O486P746Q044O454L631k478p981n733q434k294J731J1L644
10199G3326J3291J3686J7774L2799L6828L4539K6533l619k7178m0878l8230l4782
10187A04089k4263j1106k317K001M436M545O094N732J859l096n718j949k927l63
10173G7017J422l98J0766J4788O132K105K002K495O820N872j497J38l285M76O213
10158A31066J5895J2234J0167L745K480K27l686K179M566P037N561K776J980L931
10144B00158L145N175J9982K4382J9817J0902P066N62m497q823r507o437Q187
10131B70112J5702J5603J5908J1033Q815J4131L1378N4049P7201O9911L6541l365
10119F17019k1437k4616j7125k782P009J8180K4373J1437o731j9738k4432j3891
$$ plain form
10214 41476 50570 62499 68985 76731 84775 91229 94860 92382 84401 78668 70234 67940 69671 69682 73326
10199 73326 86617 100303 118077 150876 187704 222243 248776 245157 217979 177101 138871 104089
10187 104089 79826 68720 66403 68404 72840 77385 83479 89211 91070 87974 82256 80307 77380 77017
10173 77017 78439 78041 88807 103595 109727 111832 113834 116329 123149 129021 127524 127662 124377 124853 131066
10158 131066 146961 159195 169362 173107 175587 175814 172128 174307 178873 185910 191471 194247 196227 200158
10144 200158 203303 208478 228460 252842 272659 283561 290627 291189 286692 277869 268362 261925 270112
10131 270112 285814 301417 317325 328358 337173 351304 382682 436731 513932 583843 620384 617019
10119 617019 595582 570966 553841 551059 558068 576248 600621 612058 605327 585589 561157 547266
10107E47266Q058L2122N2925P6271Q9266Q7611P0108M5971K8641K3840K6452M6401
10095A134932Q1245R7637R7971R4980R0169J05652J39796J96570K63568L32975
10085B635495M14913N07476O08919P58690R58218J162617J296769J318412J345551
10076A1007060J616102K297560L486006N379843Q540552J4041897K2930379L4066349
10068A03365748M1215166L5316575J3956353j3550891l2973274l6889923k9603684
10061H0836070j9943262j2656034q102668n346088l610557k468378j784953j538310
10053B5385820j605033j717323j667551j448744j178536r50884p88470o87260
10045A5342019o15598n59562n14320m76327m43884m15415l77756l41310l17890
$$ plain form
10107 547266 555324 587446 640371 716642 805908 893519 963627 1009598 1038239 1062079 1088531 1134932
10095 1134932 1216177 1313814 1411785 1506765 1596934 1702586 1842382 2038952 2302520 2635495
10085 2635495 3050408 3557884 4166803 4925493 5883711 7046328 8343097 9661509 11007060
10076 11007060 12623162 14920722 18406728 23786571 32327123 46369020 69299399 103365748
10068 103365748 144580914 179897489 193853842 180302951 147329677 110439754 80836070
10061 80836070 60892808 48236774 40134106 34788018 31177461 28709083 26924130 25385820
10053 25385820 23780787 22063464 20395913 18947169 17768633 16817749 16029279 15342019
10045 15342019 14726421 14166859 13652539 13176212 12732328 12316913 11939157 11597847 11279957
10036A1279957l18256l35302l33662l17202k91009k58235k33627k18193k02592
10027H771879j89259j79067j70840j74192j95813k22538k15142j90691j68977
10018G065360j52502j46762j35424j25240j16018j08763j06846j05246j12948
10009E955611j21552j38009j49123j56595j51399j36364j23476j13168j03672
10000D762253j07437j11381j07462r9712r7923q9746p8159o6745o6817n9261o1492
9989C816118p4736p9018q1436p6375o5346o6971o1313o3290o4893o2674o0312
9978C059754n4156n0450m3843m4334l9365l8740l7679m6195n0845m4216m3009
9967B566922l8720l4284l6006l4216l0115k3945k5021k0659o204J2006K5776q159
$$ plain form
10036 11279957 10961701 10626399 10292737 9975535 9684526 9426291 9192664 8974471 8771879
10027 8771879 8582620 8403553 8232713 8058521 7862708 7640170 7425028 7234337 7065360
10018 7065360 6912858 6766096 6630672 6505432 6389414 6280651 6173805 6068559 5955611
10009 5955611 5834059 5696050 5546927 5390332 5238933 5102569 4979093 4865925 4762253
10000 4762253 4654816 4543435 4435973 4336261 4238338 4148592 4070433 4003688 3936871 3877610 3816118
9989 3816118 3741382 3662364 3580928 3504553 3439207 3372236 3310923 3247633 3182740 3120066 3059754
9978 3059754 3005598 2955148 2911305 2866971 2827606 2788866 2751187 2704992 2654147 2609931 2566922
9967 2566922 2528202 2493918 2457912 2423696 2393581 2369636 2344615 2323956 2317752 2329758 2355534 2347375
9955B347375r7110r9054o7423m4805l5756k7547k8061l0932k7302l2218l7130
9944A820037l8525m4112n7666n7237m6835l1798j7466j0896j7471k4361l1719
9933A441951k8669k0707k0245j6386k3316k7608k6878l0890k7856k7860k0374
9922A171162j2226r283o518o341j1595o505q059j9882k2683k0222k5643k7701
9910I94504k6377k5363k5646k0980j5448r914j1011r895o133j1337j2144j1783
9898H08473j7853j9929j4432j0656p722p684j0502j5039j7993j3117j0997j1679
9886F50870r278j3418j5158j0376q760k323M563P080R935O815N98n905k823L27
9872F12147p241n176m076j3695k0051j9327k0233k1991j5902o083l648q85m796
$$ plain form
9955 2347375 2250265 2151211 2083788 2038983 2003227 1975680 1947619 1916687 1889385 1857167 1820037
9944 1820037 1781512 1737400 1679734 1622497 1575662 1543864 1526398 1515502 1498031 1473670 1441951
9933 1441951 1413282 1392575 1372330 1355944 1332628 1305020 1278142 1247252 1219396 1191536 1171162
9922 1171162 1158936 1149653 1143135 1136794 1125199 1118694 1110635 1090753 1068070 1047848 1022205 994504
9910 994504 968127 942764 917118 896138 880690 870776 859765 849870 843737 832400 820256 808473
9898 808473 790620 770691 756259 745603 737881 730197 719695 704656 686663 673546 662549 650870
9886 650870 641592 628174 613016 602640 593880 591557 596120 603200 613135 619950 620548 614643 611820 612147
9872 612147 604906 599730 595654 581959 561908 542581 522348 500357 484455 478372 474724 473839 469043
9859D69043r18L553l084o480j1232j1645j1283l400o90q368o801q83L011K730
9845D13553m03l757p067n127r521p970j0352o307m653q77J150l791n876m811n592
9830C38599m597l708l942k626J877K094o261j533k188n208J875M59m883p394p702
9815B94862j257J342j530l128m89l45k853j404k202l708l323n947o62l897o368
9800B59091o149k584J354L19N480L775P97o811j1293o009O94j908n328Q41k769
9785B29500l933r33k214N3J368l966m797k95K164L011M253m241o415n259m31k509
9769B05356n541l38J473K979K965Q41p578j1703r599n242p20j699m92O387L030
9754A80119J663R75k369m046l920l51L11j718n500k957L071m85k57p76L188o96
$$ plain form
9859 469043 468125 471678 468594 462114 450882 439237 427954 424554 423864 415496 408695 407812 410823 413553
9845 413553 413150 409393 402326 397199 387678 379708 369356 363049 358396 357519 358669 354878 349002 344191 338599
9830 338599 334002 330294 326352 323726 325603 327697 321436 319903 317715 312507 314382 314841 309958 302564 294862
9815 294862 293605 294947 293417 290289 289800 289455 286602 285198 282996 279288 275965 270018 269356 265459 259091
9800 259091 252942 250358 251712 252031 257511 261286 262083 255272 243979 237970 238664 236756 231428 232269 229500
9785 229500 225567 224634 222420 222473 223841 219875 215078 214783 216947 219958 224211 219970 213555 208296 207865 205356
9769 205356 199815 199477 200950 203929 206894 207735 200157 188454 178855 173613 172893 171194 170702 177089 180119
9754 180119 181782 182757 180388 176342 172422 172071 172382 170664 165164 162207 165278 164793 164536 163760 166948 166252
9738A66252r734n669j994k434n50P987K234k961k344k497r3j816K220N39j805
9723A47335k856k10p364r116j958K22K488n90Q93K836M652N230L98m593k051J461
9707A36777J63P88N4p16m158L237m69o139j67K671J559R47k3n735o67J482J180
9690A30784n282k607Q20k704n044l74J627l250j984k389O20l083q52O51M036K611
9674A13580K289N205M368N555M478N558J744j67N181R288Q094J0966J3658Q772
9660A98569N286M848O93J358K268L040M409J2132J7259L3681O4099J01054J53134
9647F01830K09381K24175J49912q31j32396j93409j71722j22119p8884m5367k8862
9636D11708j8276j0175j4486q967o196j5438j6116k4939k6432j7962j1577m217
$$ plain form
9738 166252 156518 150849 148855 146421 145871 153858 156092 153131 150787 148290 148197 146381 148601 149140 147335
9723 147335 144479 144269 136905 127789 125831 126053 128541 127951 128844 131680 136332 141562 141960 137367 135316 136777
9707 136777 136940 137728 137782 137066 132908 136145 135676 129537 129370 132041 133600 134547 134524 128789 128122 129604 130784
9690 130784 125502 122895 123715 121011 115967 115593 117220 113970 111986 109597 110217 107134 106282 106933 110969 113580
9674 113580 115869 121074 125442 130997 135475 141033 142777 142610 147791 157079 165173 176139 189797 198569
9660 198569 203855 208703 209396 210754 213022 216062 220471 232603 249862 283543 347642 448696 601830
9647 601830 811211 1035386 1185298 1184467 1052071 858662 686940 564821 485937 440570 411708
9636 411708 393432 383257 368771 359804 353608 338170 322054 297115 270683 252721 241144 236927
9624B36927j845k515K395O643Q433O119J808n693j1970j6111p608j0202r365o844
9610A90172l733J365j109L38k763r42O246J0381J3838J1423k795o470j4701j2586
9596A88664j1238q835o931n33r40k595q57K813K018N991J1358J2758R406J0702
9582B11781O432M95o870r214j1414r063m987n058p666J888l69j054j869N599Q853
9567A77484J5200J4319J1575J2030K493J746L414P02P0m971o783r345j7221j1662
9553A89051q555M64j67m135l649j062k299L173Q133O086M784R731R295K646m689
9538B08807q297n084q580j0219j0206o034k637k782p341m083j5j663n78J235J258
9523A43781J733l118l591J078j968K76P0n44j818K407m87m992M117M968k640j775
$$ plain form
9624 236927 235082 232567 234962 241605 250038 256157 257965 252272 240302 224191 216583 206381 197016 190172
9610 190172 186439 187804 186695 187033 184270 183328 189574 199955 213793 225216 222421 215951 201250 188664
9596 188664 177426 168591 161660 161127 160187 157592 156735 159548 161566 167557 178915 191673 201079 211781
9582 211781 218213 218708 211838 202624 191210 182147 177160 172102 164436 166324 165955 164901 163032 168631 177484
9567 177484 192684 207003 218578 230608 233101 234847 238261 238963 239033 234062 227279 217934 200713 189051
9553 189051 180496 180960 180793 176658 173009 171947 169648 172821 180954 187040 191824 201555 210850 213496 208807
9538 208807 200510 195426 186846 176627 166421 160387 157750 154968 147627 143544 143529 141866 141288 142523 143781
9523 143781 145514 142396 138805 139883 137915 138191 138261 137717 135899 138306 137819 132827 136944 141912 139272 137497
9507A37497K87K806k818k975J397j783j849L615k3J533k482j832k642K50K677
9492A33658M548R06L966K784K025L19L181k2k655o47J525n03P61p45p382n94M899
9475A46024L091N897k549n493n634m265m596l010j554J013K16N974k0J032q36
9460A35290k374l144J173p19j622j667k832o016J457P299M178L331k471j125q78
9445A29880R74J742M723J715L35L288P71M383j669J950m07K173n383K469L624
9430A50568N941M643k103k45R01R66L544j849q79J997M603L693N947J1771J4654
9415B04152J3092J5305J5020J1927J1273J2998J0248l77j5461j5257j0334l516
9403B49070N686N955J645o498j1039o205o191m635K483P57K677R457J5647J9212
$$ plain form
9507 137497 137784 140590 137772 134797 136194 134411 132562 136177 136154 137687 135205 133373 130731 130981 133658
9492 133658 138206 139112 143078 145862 147887 148206 151387 151365 148710 148063 149588 149085 149846 149101 141719 141125 146024
9475 146024 149115 155012 152463 146970 141336 137071 132475 129465 127911 128924 129140 135114 135094 136126 135290
9460 135290 132916 129772 130945 130226 128604 126937 124105 118089 119546 126845 131023 134354 131883 130758 129880
9445 129880 130854 132596 137319 139034 139369 142657 143428 147811 146142 148092 147685 149858 144475 146944 150568
9430 150568 156509 161152 159049 158804 159705 160671 164215 162366 161487 163484 168087 171780 177727 189498 204152
9415 204152 217244 232549 247569 259496 270769 283767 294015 293638 278177 262920 252586 249070
9403 249070 254756 260711 262356 255858 244819 238614 232423 227788 230271 231028 233705 243162 258809 278021
9389B78021J5826J8353J9700J8113N718j3800k5359j6405q146J153N305J34J8
9376B98631m530p204p846j0391j1278r223l573j297k92L20j129m15L762L082P33
9361B49350N582Q432j804j406Q182N954J640K734j145J495O717L218j597k419
9347B84933J764l31N383K861J247M49O477R894P910P592J3695J6262J0094K305
9333C70535K152L770P132J5143J9699J1375j1517j8871j3950j2767r171q130j1559
9320C43841o500K729P86M411J1342J6285J7035J7067R628P575P630P148J4153
9307D53130K2181K6057K6674Q829o554o878o296j961j573n373r380r745o820J788
9293D84079N377P909O072M578J4043J5744J3860J6627K0766K4570K5427K2754
$$ plain form
9389 278021 293847 312200 331900 350013 355731 341931 316572 300167 292021 293174 298479 298613 298631
9376 298631 294101 286897 279051 268660 257382 248159 244586 243289 242997 243317 242188 241773 245535 248617 249350
9361 249350 254932 263364 261560 260154 268336 274290 275930 278664 277519 279014 285731 288949 287352 284933
9347 284933 286697 286366 291749 294610 295857 296306 302783 312677 320587 328179 341874 358136 368230 370535
9333 370535 372687 376457 383589 398732 418431 429806 418289 399418 385468 372701 363530 355400 343841
9320 343841 337341 340070 340856 345267 356609 372894 389929 406996 416624 424199 431829 438977 453130
9307 453130 475311 501368 528042 536871 530317 523439 517143 515182 513609 508236 498856 489111 482291 484079
9293 484079 489456 497365 503437 508015 522058 537802 551662 568289 589055 613625 639052 661806
9281F61806J6091J9515K5414L2026M1633M7829M8358N6709P9606R9482J25511
9270A253980J60872K11270K83775L91326N38284P16691Q88535R44734P95434M88739
9260F673640J85282P9655K79871P64817J439017K053494K213655J576712K65749
9251A5531892j035355j654028j441565p52213J5226O15501Q60756O54149J22336
9242A2916699m03276o38284n35260l08563j81543k00353k45102j59222J46839
9233A0391935O80635J358266J931930J967328J154849k29616j436415j866581
9225A3952331j522690q28025j63257K64433L58517R2987m02860q97995j189628
9216I663813j212656j046384q17960o16091m62855l62413k88493k36035j93472
$$ plain form
9281 661806 677897 697412 722826 754852 796485 844314 892672 949381 1028987 1128469 1253980
9270 1253980 1414852 1626122 1909897 2301223 2839507 3556198 4444733 5389467 6184901 6673640
9260 6673640 6858922 6938577 7218448 7983265 9422282 11475776 13689431 15266143 15531892
9251 15531892 14496537 12842509 11400944 10648731 10663957 11279458 12140214 12794363 12916699
9242 12916699 12513423 11875139 11339879 11031316 10849773 10649420 10404318 10245096 10391935
9233 10391935 11072570 12430836 14362766 16330094 17484943 17255327 15818912 13952331
9225 13952331 12429641 11601616 11438359 11702792 12061309 12154296 11751436 10853441 9663813
9216 9663813 8451157 7404773 6586813 5970722 5507867 5145454 4856961 4620926 4427454
9207D427454j57027j26294j09949r8455q4183o8137n2352l6805k4153j3255p587
9196C649257r98J0608L8412P6025J29462J96625K83249L95516N69307Q28515J181073
9185G357051J546584J724188J496545Q33606K8419m85063m51387J04543R96604
9176A3151090J958993K553269K240559R02215q36043k027814k196823j612663
9168A4132783p81050n5834L93011M98222L36998J45024J39818L33259N00584M00799
9158A6043614J2092m52894o79088m91785Q7127R34233J794370K213532J725075
9149B1186276L40637j257886k223078k251662j676039r86995m68142k24017k62008
9140A2177086m98631p83389r60212r75726q71120p12169n65630m60149l84628
$$ plain form
9207 4427454 4270427 4144133 4034184 3935729 3851546 3783409 3731057 3694252 3670099 3656844 3649257
9196 3649257 3648259 3658867 3697279 3773304 3902766 4099391 4382640 4778156 5347463 6175978 7357051
9185 7357051 8903635 10627823 12124368 12957974 12986393 12501330 12049943 12154486 13151090
9176 13151090 15110083 17663352 19903911 20806126 19970083 17942269 15745446 14132783
9168 14132783 13351733 13295899 13688910 14187132 14524130 14669154 14808972 15142231 15642815 16043614
9158 16043614 16055706 15602812 14923724 14431939 14519066 15453299 17247669 19461201 21186276
9149 21186276 21526913 20269027 18045949 15794287 14118248 13131253 12663111 12439094 12177086
9140 12177086 11678455 10895066 9934854 8959128 8088008 7375839 6810209 6350060 5965432
9131E965432l20057k79017k45265k12465j83657j61896j48358j33883j19583j06624
9121D054627r8493r6124r1972r4159r4584r7166r3627q9004q5684p7151p1740
9110C064923p1707o8234o4930o6326o1486n7778n7870n7903n3169n2019m8755
9099B404746m3700m4292m7976m8525m4308l9009m0851l8929l9469l7816l9987
9088A939884l9228l8302l4478l2574l0265k6764k6341l1124k8004l0374k9801
9077A592629k9120k6019k3436k3093k5857k4924k4629k1959k0009k3544k3004
9066A327035j9178j9534j7413j9035j7651j7393j8124j6279j6804j8926j3565
9055A133133j4557k1399k0395j7074j4023p418j6891j6878j4238j3154j0670r964
$$ plain form
9131 5965432 5645375 5366358 5121093 4908628 4724971 4563075 4414717 4280834 4161251 4054627
9121 4054627 3956134 3860010 3768038 3673879 3579295 3482129 3388502 3299498 3213814 3136663 3064923
9110 3064923 2993216 2924982 2860052 2793726 2732240 2674462 2616592 2558689 2505520 2453501 2404746
9099 2404746 2361046 2316754 2268778 2220253 2175945 2136936 2096085 2057156 2017687 1979871 1939884
9088 1939884 1900656 1862354 1827876 1795302 1765037 1738273 1711932 1680808 1652804 1622430 1592629
9077 1592629 1563509 1537490 1514054 1490961 1465104 1440180 1415551 1393592 1373583 1350039 1327035
9066 1327035 1307857 1288323 1270910 1251875 1234224 1216831 1198707 1182428 1165624 1146698 1133133
9055 1133133 1118576 1097177 1076782 1059708 1045685 1038267 1021376 1004498 990260 977106 966436 956472
9043I56472q405j4047j5925j4599j4953p784j1639j3409q255r668j3007j3960
9031H10821j5098j1759q162q995j5228j1820j2432j1166o177n482n923n117n847
9018F87615r594j2428j1581j1695q346o156q138p850l886m434q095q547o192p180
9004E73493r921l128m530p255q460n442o920k740K655l076m340p944m050n137
8990E03205J443j418n48j938k840m313j157j801K207j842j901q957n853n242o5
8975D68980l106k304o431r923p399k257M58l767j953m71j925k662J938j697k70
8960D27211k533j925K465J150j426J46L525J356M84n8l892k746m775p025r970
8945D01987j280l052l749o387m86l110K382j745k496j342l541n084k226k175K864
$$ plain form
9043 956472 948067 934020 918095 903496 888543 880759 869120 855711 847456 837788 824781 810821
9031 810821 795723 783964 775802 766807 751579 739759 727327 716161 709984 704502 698579 693462 687615
9018 687615 678021 665593 654012 642317 633971 627815 619677 611827 607941 603507 595412 586865 580673 573493
9004 573493 563572 560444 555914 548659 540199 534757 527837 525097 527752 524676 520336 512392 508342 503205
8990 503205 504648 503230 502682 500744 497904 493591 492434 490633 492840 490998 489097 480140 474287 469045 468980
8975 468980 465874 463570 457139 447216 439817 437560 438018 434251 432298 431827 429902 427240 429178 427481 427211
8960 427211 424678 422753 425218 426368 424942 425088 428613 429969 430453 430395 426503 423757 418982 411957 401987
8945 401987 400707 397655 393906 387519 387033 383923 386305 384560 382064 380722 377181 372097 369871 367696 370560
8930C70560q65J611n30l706q113n595n286m410l98J13j392O24n137m341r79M283
8914C36439Q980J188m78k591k422k948K54J65o04k017k354p648q91O748J772l366
8898C30227o489m730m45j368L666L750M227K601l121M39p09K116j163m205J637
8883C26433K146O43j633k815k359R37L502R466N998K084J135O417N412Q82K732
8868C60980P275Q148J1140J6862J0163N805J857O539R583J1903J3358N306j264
8855D67655j1723j6608j4478j2280j7371j0626n962q060p428J391M064M073L224
8842C75871R80Q110J3092J0346P763K644Q21K35Q56L784P97q400j0607j2714j1048
8827C82530l129m611k257L251o60o45K040N374K396N426K915N987M411L422l200
$$ plain form
8930 370560 369695 371306 370776 367070 358957 353362 348076 343666 343268 343381 341989 342613 337476 333135 332156 336439
8914 336439 345419 346607 346129 343538 341116 338168 338422 338587 337983 335966 333612 325964 325073 331821 333593 330227
8898 330227 323738 319008 318563 317195 320861 324611 328838 331439 328318 328757 328048 330164 329001 324796 326433
8883 326433 328579 329222 327589 324774 322415 323352 326854 336320 342318 344402 345537 351954 357366 358248 360980
8868 360980 368255 376403 387543 404405 414568 420373 422230 428769 438352 450255 463613 468919 467655
8855 467655 455932 439324 424846 412566 395195 384569 378607 370547 363119 364510 368574 372647 375871
8842 375871 376851 384961 398053 408399 416162 418806 419627 419862 420718 424502 425299 416899 406292 393578 382530
8827 382530 379401 374790 372533 375784 375124 374479 376519 381893 384289 389715 392630 398617 403028 406450 403250
8812D03250j5235j1016j953k373p470r247j429J713J603q89K864L687M077J0079
8798C77661L960M219L696J1887J6202J4828J5617J5243J3848J9075J2944R970
8786E19150J2926R886J4017J1083Q371L532J514K181m334j6130k0869k5903k3622
8773D91802j6310j3809r443j0078m854j37J249M032N261R943J4618J6178J7145
8760E05597Q363L5l021o63K217L213K736j097p551j3328j6539j3385r862j1357
8746D45358m889M096J138K482M165O295J1757J6580J2796O300L312n986J392k339
8732E02457k486k080k28j862P03R109J0784J3733J9001K0098K2219K9924M4107
8719F65479O5485Q4488J17933J44664J66943J88432J93981J57579Q6309K6182
$$ plain form
8812 403250 388015 376999 375046 372673 365203 355956 354527 356240 357843 356954 359818 363505 367582 377661
8798 377661 381621 385840 389536 401423 417625 432453 448070 463313 477161 496236 509180 519150
8786 519150 532076 541962 555979 567062 575433 578965 580479 582660 578326 562196 541327 515424 491802
8773 491802 475492 461683 452240 442162 437308 437171 438420 442452 447713 457656 472274 488452 505597
8760 505597 513960 513995 510974 510311 512528 515741 518477 517380 509829 496501 479962 466577 456715 445358
8746 445358 440469 444565 445703 448185 452350 458645 470402 486982 499778 506078 509390 503404 504796 502457
8732 502457 499971 497891 497663 495801 496504 505613 516397 530130 549131 569229 591448 621372 665479
8719 665479 730964 815452 933385 1078049 1244992 1433424 1627405 1784984 1871293 1897475
8709A897475l4723j15989j68533j70689j56491j41665j16216q3760n7203m0030
8699H12176k5964j8955j8299j7415j9216k2750j6402j2894j0447j3694o441r227
8687F20472j1390p005m128p361n474p407n024n665o852l405Q0j871n612l419K004
8672E47943N058J896J973O260J3318J8886K0148J6387P564m024j0792j8032k2843
8659E83742j4553n260K76q4P60M429N681J677K912P738K987Q42J353m900m312
8644E83288k345j345k769J347M381J464J771M191Q079R113Q664J1020J7333P961
8630F52153L970j572n399q163k22Q65m094m698o839o385l36k206l191J57p62K241
8614F15519N075J2591J3079J0487j08l373p404j2126p197n003l78L27K484O507
$$ plain form
8709 1897475 1862752 1746763 1578230 1407541 1251050 1109385 993169 909409 852206 812176
8699 812176 786212 767257 748958 731543 712327 689577 673175 660281 649834 636140 629699 620472
8687 620472 609082 602077 597949 590588 585114 577707 572683 567018 560166 556761 556841 554970 549358 545939 547943
8672 547943 553001 554897 556870 563130 576448 595334 615482 631869 639433 635409 624617 606585 583742
8659 583742 569189 563929 564205 564121 564881 569310 574991 576668 579580 587318 590305 591147 592500 587600 583288
8644 583288 580943 579598 576829 578176 582557 584021 585792 589983 598062 607175 615839 626859 644192 652153
8630 652153 656123 654551 649152 640989 640767 641632 637538 632840 626001 619616 619280 617074 613883 614040 613278 615519
8614 615519 620594 633185 646264 656751 656643 653270 645866 633740 626543 621540 621162 621489 623973 630480
8600F30480P719M992K926N038M166J333K640K634J348M153O901M883M148O992
8586F90353J0381O820N961O416J0808J5526K3160K2416K5513K9814L2849K8690
8574I08707K5241J9248J3942J1405O643M59o412q467r254j8987k1206j1731o068
8561I03520q093p158l353J14M027L811L937K154L662J102l048l406J353K10O351
8546I05183N000j83r26J209K657L276R449R391Q286J0006J4027J2674R304J4609
8532A003962J3256J3937J2388J2566J8267K4569L3749M0755N3741P4234R7171
8521A398595J16749J31147J42727J39744J27382J16372R6417O9098L4595k696
8511B370130l2598n6572q1586r0774r3828q7388p9876o5876m0127j5419j183R459
$$ plain form
8600 630480 638199 643191 646117 651155 655321 656654 659294 661928 663276 667429 674330 679213 683361 690353
8586 690353 700734 707554 713515 719931 730739 746265 769425 791841 817354 847168 880017 908707
8574 908707 933948 953196 967138 978543 985186 985645 979233 970766 961512 942525 921319 909588 903520
8561 903520 895427 888269 884916 885030 889057 892868 896805 898959 902621 903723 900675 897269 898622 898832 905183
8546 905183 910183 910000 909074 910283 912940 916216 925665 935056 943342 953348 967375 980049 989353 1003962
8532 1003962 1017218 1031155 1043543 1056109 1074376 1098945 1132694 1173449 1227190 1301424 1398595
8521 1398595 1515344 1646491 1789218 1928962 2056344 2172716 2269133 2338231 2372826 2370130
8511 2370130 2337532 2280960 2199374 2108600 2014772 1927384 1847508 1781632 1741505 1726086 1724903 1734362
8499A734362K1455K9793L5230M4609M7841N2843N9465P1381Q4111J03567J35304
8488B419961J75578K32731K94785L41334L52993L67299M41788N70068O76561P00728
8478F573826O67998O48078O67870O90362O89594P53009R36361J052373Q78405
8469A3557876M41027Q9951J52180M50288M86628J09952l35337n13248m43744m30805
8459A3564768n59286o53770o44084o21078o12348o40271o87543o91630o26319
8450G828439n25988m32486l69617l34598l05785k69092k18457j79677j60746j49354
8440D882639j39844j26192j08552r1634p6817n1859l5769k5281j3505K819O261
8429D222266O302O909O827J8834L1315L1423L3156L5168M9250O4167P3345Q6393
$$ plain form
8499 1734362 1755817 1785610 1820840 1865449 1913290 1966133 2025598 2096979 2181090 2284657 2419961
8488 2419961 2595539 2828270 3123055 3464389 3817382 4184681 4626469 5196537 5873098 6573826
8478 6573826 7241824 7889902 8557772 9248134 9937728 10690737 11627098 12679471 13557876
8469 13557876 13998903 14088854 14241034 14691322 15177950 15287902 14952565 14439317 13995573 13564768
8459 13564768 13005482 12351712 11707628 11086550 10474202 9833931 9146388 8454758 7828439
8450 7828439 7302451 6869965 6500348 6165750 5859965 5590873 5372416 5192739 5031993 4882639
8440 4882639 4742795 4616603 4508051 4416417 4339600 4287741 4251972 4226691 4213186 4216005 4222266
8429 4222266 4228568 4235477 4242304 4261138 4292453 4323876 4357032 4392200 4441450 4505617 4578962 4665355
8417D665355J07371J30361J62756K06454K64308L43774M31574N02888N60894O33900
8407H009635P64379R23831J074878J198327J319503J448021J518133J480899J426988
8398A9164594J512351J702287J731852J385203P81464M55680O49509Q68181N51644
8389B8802765j85201o85253n69765l20704n13945r90332j264423j238343j094511
8380B1940288j049054j104946j117828j059375r95436r53976r08710q37542p22844
8371A3190577o07303n37641m86812m20716l40973k63503k02028j61240j29651
8362A0040710j08532r3237o9029l7624j4318J4867N6094Q6827J10557J36033J59652
8351A0282000J69983J76886J92198K06970K12788K37282K60144K87051L33853
$$ plain form
8417 4665355 4772726 4903087 5065843 5272297 5536605 5880379 6311953 6814841 7375735 8009635
8407 8009635 8774014 9697845 10772723 11971050 13290553 14738574 16256707 17737606 19164594
8398 19164594 20676945 22379232 24111084 25496287 26277751 26733431 27382940 28251121 28802765
8389 28802765 28617564 27932311 27362546 27041842 26527897 25537565 24273142 23034799 21940288
8380 21940288 20891234 19786288 18668460 17609085 16613649 15659673 14750963 13913421 13190577
8371 13190577 12583274 12045633 11558821 11138105 10797132 10533629 10331601 10170361 10040710
8362 10040710 9932178 9838941 9769912 9732288 9717970 9732837 9788931 9875758 9986315 10122348 10282000
8351 10282000 10451983 10628869 10821067 11028037 11240825 11478107 11738251 12025302 12359155
8342A2359155M04097M89116N98347P51679R25582J116632J334227J589132J884317
8333B1452284K169287K437026K765937L206380L784388M620925N961837Q050285
8325E4448349J1313280J6246308K2434060K8009078L1786054L4730142L4432165
8318B33399436K5146482J1539809K957574o415408k1162564l0288262l0014678
8311A85162389k7874161k5384748k0737463j5254752j0710221p556770n614668
8304G2029606m490639l769523l305624l036859k814602k561759k245231j916025
8296D7889344j697455j597980j513125j436568j396792j334014j220295j114056
8288C6579059j024081r32252q51578p85390p23191o69792o30881n84601n45942
$$ plain form
8342 12359155 12763252 13252368 13850715 14602394 15527976 16644608 17978835 19567967 21452284
8333 21452284 23621571 26058597 28824534 32030914 35815302 40436227 46398064 54448349
8325 54448349 65761629 82007937 104441997 132451075 164237129 198967271 233399436
8318 233399436 258545918 270085727 273043301 266627893 245465329 215177067 185162389
8311 185162389 157288228 131903480 111166017 95911265 85201044 77644274 72029606
8304 72029606 67538967 63769444 60463820 57426961 54612359 52050600 49805369 47889344
8296 47889344 46191889 44593909 43080784 41644216 40247424 38913410 37693115 36579059
8288 36579059 35554978 34622726 33771148 32985758 32262567 31592775 30961894 30377293 29831351
8279B9831351n26276n19266n13151n19032n09373m88662m72268m58027m44608
8270B5380688m21436l92820l72190l56711l43909l33559l31590l26990l25249
8261B2176234l28375l35968l47126l50565l50487l44108l27109l13009l03880
8252A9175607k99154l05573l12508l18038l23413l20364l06062l00805k98877
8243A6390813k89927k76261k67502k63126k53769k44143k39131k34577k22942
8234A4099435k15323k22560k21318k09373k05657j97316j90720j84759j79126
8225A2273283j67509j63492j60389j60885j55259j53537j49883j48303j39648
8216A0874378j37175j33531j28719j24199j20322j17146j15078j22708j30497
$$ plain form
8279 29831351 29305075 28785809 28272658 27753626 27244253 26755591 26283323 25825296 25380688
8270 25380688 24959252 24566432 24194242 23837531 23493622 23160063 22828473 22501483 22176234
8261 22176234 21847859 21511891 21164765 20814200 20463713 20119605 19792496 19479487 19175607
8252 19175607 18876453 18570880 18258372 17940334 17616921 17296557 16990495 16689690 16390813
8243 16390813 16100886 15824625 15557123 15293997 15040228 14796085 14556954 14322377 14099435
8234 14099435 13884112 13661552 13440234 13230861 13025204 12827888 12637168 12452409 12273283
8225 12273283 12105774 11942282 11781893 11621008 11465749 11312212 11162329 11014026 10874378
8216 10874378 10737203 10603672 10474953 10350754 10230432 10113286 9998208 9875500 9745003
8207I745003j27964j26083j25670j20027j08329r6350r4801q7280p6673p3755
8197H708071q1564r0436j02181j10756j22992j34775j37355j30091j29711j26414
8187G541796j10668r6370r2512q4363p6876p0976n9638n7735m8765m4501m0395
8176F758997l2705l5659l7075l3007l2433l4303l6322l8026l4867l8159m0617
8165F365824l3604k4661q767O78J5236L2354N1659P1329R0964J17419J46156J71662
8153F996249K00099K37757K74094L21118L82996M42784N06722N78213O53868P29819
8143A1323719Q33546R63373J108265J283493J526159J841558K237204K798785
8135B3916102L688792N075293P162172J0117834J3731972J7373496K0699336K3745957
$$ plain form
8207 9745003 9617039 9490956 9365286 9245259 9136930 9040580 8945779 8858499 8781826 8708071
8197 8708071 8626507 8536071 8433890 8323134 8200142 8065367 7928012 7797921 7668210 7541796
8187 7541796 7431128 7334758 7242246 7157883 7081007 7010031 6950393 6892658 6843893 6799392 6758997
8176 6758997 6726292 6690633 6653558 6620551 6588118 6553815 6517493 6479467 6444600 6406441 6365824
8165 6365824 6332220 6307559 6298792 6299470 6314706 6347060 6398719 6470048 6561012 6678431 6824587 6996249
8153 6996249 7196348 7434105 7708199 8029317 8412313 8855097 9361819 9940032 10593900 11323719
8143 11323719 12157265 13120638 14228903 15512396 17038555 18880113 21117317 23916102
8135 23916102 27604894 32680187 39842359 49960193 63692165 81065661 101764997 125510954
8127A25510954K5167840K2985765J8694244J4861228J0342485M140338k376788
8120B19326066q239491j2628935j6148356j9927747k1923969k0602382j7893942
8113A01961244j5167284j2208139r239982o836000n157439m060620l334638k851614
8105D3105528k522514k260703k023809j809732j628290j461412j304758j165885
8097B8928425j050234r62747q90235q26531p77072p31936o86585o53439o22668
8088B1726978n90880n52903n27777n04839m82284m59371m43475m27708m12038
8079A7325703l94845l81801l64089l47194l29325l12383k99667k82037k68382
8070A4345980k62797k61566k64772k67522k70677k73194k75342k73996k74691
$$ plain form
8127 125510954 150678794 173664559 192358803 207220031 217562516 221702854 219326066
8120 219326066 211086575 198457640 182309284 162381537 140457568 119855186 101961244
8113 101961244 86793960 74585821 65345839 58509839 53352400 49291780 45957142 43105528
8105 43105528 40583014 38322311 36298502 34488770 32860480 31399068 30094310 28928425
8097 28928425 27878191 26915444 26025209 25198678 24421606 23689670 23003085 22349646 21726978
8088 21726978 21136098 20583195 20055418 19550579 19068295 18608924 18165449 17737741 17325703
8079 17325703 16930858 16549057 16184968 15837774 15508449 15196066 14896399 14614362 14345980
8070 14345980 14083183 13821617 13556845 13289323 13018646 12745452 12470110 12196114 11921423
8061A1921423k76063k69134k67763k65649k49126k39410k29751k20212k06497
8052I697818k01163j90741j81428j73574j72541j65504j58175j58932j52019j42423
8042H001318j40207j46215j49088j43484j38178j30104j26792j17868j17412j10575
8032F681395j08690j06227j00067r8665r4870r2263q9800q6711q8634q7793q2232
8021E645443q1770p9317p7241p3350p0364o7494p5744q1700q2633p9808p2930
8010D803092o4733n8775n6768n6881n5492n7252n7341n8711n6743n0045n2836
7999D177515m4674m2077l0698J803L8904Q4414J08528N9245m0099j30721j65842
7988D016298j40373q7567l3044J9955M9285L5458k3694j08032j70729j80472j53564
$$ plain form
8061 11921423 11645360 11376226 11108463 10842814 10593688 10354278 10124527 9904315 9697818
8052 9697818 9496655 9305914 9124486 8950912 8778371 8612867 8454692 8295760 8143741 8001318
8042 8001318 7861111 7714896 7565808 7422324 7284146 7154042 7027250 6909382 6791970 6681395
8032 6681395 6572705 6466478 6366411 6267746 6172876 6080613 5990813 5904102 5815468 5727675 5645443
8021 5645443 5563673 5484356 5407115 5333765 5263401 5195907 5120163 5038463 4955830 4876022 4803092
8010 4803092 4738359 4679584 4622816 4565935 4510443 4453191 4395850 4337139 4280396 4230351 4177515
7999 4177515 4132841 4090764 4060066 4061869 4100773 4185187 4293715 4352960 4312861 4182140 4016298
7988 4016298 3875925 3788358 3755314 3775269 3824554 3860012 3836318 3728286 3557557 3377085 3223521
7977C223521j18940q7403o3990m9434m3345m1566l6769l5725l9058m2300m8262
7966B616729m9971n1983n1515m8264m5209m0807l7746k8581j8858k0302j1405
7955B212088L5J4478M8894R6582J19610Q6035J359r1795j33350j12919m7659J7933
7943B211291O8153Q4520M9035k2448r8008j36124j29997j01739o6114m2532l4124
7932A781913j9514p391p110M58Q131Q550K2560L4439N7669R3197J25005J54249
7920B252156J72111J71037J27610N0816j1911o8790j50770j94290j87221j67460
7910A993288j46381j26892j04020p9616o1429m9085m0769l6547l2995k9659k7983
7899A257912k7000k0912j6893j7695j9265k0688j6943j2604q676q081j0949j1766
$$ plain form
7977 3223521 3104581 3017178 2953188 2903754 2860409 2818843 2782074 2746349 2707291 2664991 2616729
7966 2616729 2566758 2514775 2463260 2414996 2369787 2328980 2291234 2262653 2243795 2223493 2212088
7955 2212088 2212123 2226601 2275495 2372077 2491687 2577722 2579081 2487286 2353936 2241017 2193358 2211291
7943 2211291 2279444 2363964 2412999 2390551 2292543 2156419 2026422 1924683 1858569 1816037 1781913
7932 1781913 1762399 1755008 1747898 1748356 1756487 1765037 1787597 1822036 1879705 1972902 2097907 2252156
7920 2252156 2424267 2595304 2722914 2773730 2761819 2693029 2542259 2347969 2160748 1993288
7910 1993288 1846907 1720015 1615995 1536379 1474950 1425865 1385096 1348549 1315554 1285895 1257912
7899 1257912 1230912 1210000 1193107 1175412 1156147 1135459 1118516 1105912 1097236 1089155 1078206 1066440
7887A066440m011k304q70j424q228j4423j2206j2755j4943j6185j6613j4808j8066
7874I29604j4061j4873j4776j7442j6030j5014j1489j5565j6058j9264j7512j5271
7862G42249j0264j1574j1476j2372j3145j4694r492p680p577r478o147q539j1034
7849F08777r428j1682o645p934q815m495m845j1216j0845n846r178n214j61k771
7835E09702k042j938l983l989m853k936n642o179o638n640j1889l718j072k606
7821D46577J56k272l545l356J786K111N691P845Q284P599J0278J1981J2536R646
7807E15317P581P745P512L332l031q342j0883q187r683r735j4489j7220j4837
7794D45080j7709j8043j4891j0909j1413j3521j0903j3024q501n421n200r28j093
$$ plain form
7887 1066440 1062429 1060125 1059255 1057831 1049603 1035180 1022974 1010219 995276 979091 962478 947670 929604
7874 929604 915543 900670 885894 868452 852422 837408 825919 810354 794296 775032 757520 742249
7862 742249 731985 720411 708935 696563 683418 668724 659232 651552 643975 634497 628350 619811 608777
7849 608777 599349 587667 581022 573088 564273 559778 554933 543717 532872 527026 517848 512634 512473 509702
7835 509702 507660 505722 501739 497750 492897 489961 484319 478140 471502 465862 453973 450255 449183 446577
7821 446577 446733 444461 440916 437560 439346 441457 447148 454993 463277 470876 481154 493135 505671 515317
7807 515317 522898 530643 538155 541487 538456 530114 519231 511044 501361 491626 477137 459917 445080
7794 445080 427371 409328 394437 383528 372115 358594 347691 334667 326166 320745 315545 314617 313524
7781C13524o845o858o290n095n160m987m008k090r9m21r11l845J416k236n700
7766B60395l78r63n157m478j368j481n185k852K620k908n756l453k539J290L005
7751B30792l04m099m30J895L914K292K594M509P898J4448J3087J9288J4541J8944
7737C29369L1431L9670N0915O9639R6773J19019J35759J43481J40992J15281R4139
7726A366468P5973L8661p128n0174p4719r4848j17272j33372j29600j14758r7333
7715F61898p9943o3909m4321l4640k4416j8020j5412j8794k0876j1539j0772p807
7703C11449j2233q423o712n299n350p475m262k994q331m124k083k376o336j0802
7689B24649p125m209m800q847j0153q194l776J175j109k920p355J916k78q590
$$ plain form
7781 313524 306679 299821 293531 288436 283276 278289 274281 272191 272092 271671 270760 266915 268331 266095 260395
7766 260395 260017 259054 253897 249419 248051 246570 241385 238533 241153 238245 232489 229036 226497 227787 230792
7751 230792 230488 226389 225959 227854 231768 234060 236654 241163 249061 263509 276596 295884 310425 329369
7737 329369 360800 400470 451385 521024 617797 736816 872575 1016056 1157048 1272329 1366468
7726 1366468 1442441 1481102 1473974 1423800 1349081 1254233 1136961 1003589 873989 759231 661898
7715 661898 581955 518046 473725 439085 414669 396649 381237 362443 341567 330028 319256 311449
7703 311449 299216 290793 284081 278782 273432 265957 261695 258701 250370 246246 244163 241787 235451 224649
7689 224649 217524 213315 208515 199668 189515 181321 177545 178720 177611 174691 167336 169252 168974 160384
7675A60384j064J272p91J10l431j304q60k875m903l200j968k807n134o487m589
7660A22353l005m943l781k333q11q15l02O29o29j89M41j731j749J420J622q01
7644A05376k133j41J231k132j561J59j501k580j292J0M605J259L11l791l334k622
7628I1864l721j00K078j111k965k433k854k732Q3k0O89j931j410p3j728l93K701
7611G5944j488J891j638j931j242n71o38J842m63J723j299l824j90J950m274l878
7595F1914l089K031O27j343k714R01K091M034M266J60o351o203l16k77j453M443
7579E8721M880L554j883j321L460j804n187r49K395l393m652j99j461n936L69
7564D6594L340M125Q6l803o8K62k200j381j953o80L051K069R87o26N92J70l164
$$ plain form
7675 160384 159320 160592 159801 159911 156480 155176 154316 151441 146538 143338 141370 138563 133429 126942 122353
7660 122353 119348 114405 110624 108291 107480 106665 106363 106992 106363 106174 106615 104884 103135 104555 106177 105376
7644 105376 103243 103102 104333 102201 100640 100799 99298 96718 95426 95436 100041 101300 101611 97820 94486 91864
7628 91864 88143 88043 90121 89010 86045 83612 80758 78026 78109 78089 78778 76847 75437 75364 73636 73243 75944
7611 75944 74456 76347 74709 72778 71536 70965 70327 72169 71706 73429 72130 68306 68116 70066 65792 61914
7595 61914 58825 60856 61483 60140 57426 58327 60418 64452 68718 68878 62527 56324 56008 55731 54278 58721
7579 58721 63601 67155 65272 63951 67411 65607 60420 59471 61866 58473 53821 53622 52161 46225 46594
7564 46594 49934 54059 54145 50342 50274 50536 48336 46955 45002 44322 47373 49442 50429 49803 50395 50565 47401
7547D7401k549J580L899m98l876l287m04M526Q6k895J344P87l837k791L613J830
7531D4929l325p79K008K93O30l034k933n275q35J72j825l467j965k392K021J883
7515B6106k506j268J751K6m065j792O67l421P65M329K782m51J372P20Q94k139
7499B3770l069L97j107L6L24m147m523k739J429K043k72j293j1K99j124J157q65
7482A0305J792K277M52j048q83J509K860L287K949k997j458J176K87O47k495O51
7466A9311N86r95L15j531m548J691R44N62J137J436J947J084l570m445k235J891
7450A3580j156m50L744J384k904n18L316L882q74j797M60j379p37j438M59M665
7434B0237K338J10k576o94m401l753j658P25L855M965J339o30k124p96n405j703
$$ plain form
7547 47401 44852 46432 50331 49833 45957 42670 42266 46792 46878 43983 45327 46114 42277 39486 43099 44929
7531 44929 41604 40825 42833 43126 43756 40722 37789 32514 31679 31851 30026 26559 24594 22202 24223 26106
7515 26106 23600 22332 24083 24109 20044 18252 18919 15498 16263 20592 23374 22923 24295 25015 25909 23770
7499 23770 20701 21098 19991 20027 20351 16204 11681 8942 10371 12414 12142 10849 10838 11137 10013 11170 10305
7482 10305 12097 14374 14826 13778 12895 14404 17264 20551 23500 20503 19045 20221 20508 21155 18660 19311
7466 19311 19897 18902 19217 17686 13138 14829 15773 16335 17472 18908 20855 21939 18369 13924 11689 13580
7450 13580 12424 11974 15718 17102 14198 13680 16996 20878 20004 18207 18667 17288 16551 15113 15572 20237
7434 20237 22575 22685 20109 19415 15014 11261 9603 10328 14183 19148 20487 19857 17733 16937 11532 9829
7418I829j685Q55K243K872M901J779K910K398m20k674n652m615K95Q00k810Q19
7402A1845K279N412Q84J321j670o502l874K846k789k252J317p21M135P10J224
7387A4165K26j843k532m421o40L481K297K211q56j377k858J69K452O92k151j170
7371G845j64p8J774k755m729n168K093K231j252K196L373k527J416o65m40k545
7355F05N71L626K046J756N156K37j09J405Q67m750m335L918J802Q02K546O53l963
7338A2833P77L279m161m297k77j050o0L666L46m31n129j856j943J170k372N62
7322A057j603J98J497K332L067j376q32J988m046J271Q40j676l86j953R03K386
7306C667J666j871L195N039K787l95l095o095k166j131j15J520mK073R8j600k286
$$ plain form
7418 9829 8144 8999 11242 14114 19015 20794 23704 26102 25682 23008 17356 12741 13036 13836 11026 11845
7402 11845 14124 19536 20420 21741 20071 13569 9695 12541 9752 7500 8817 8096 12231 12941 14165
7387 14165 14391 12548 10016 5595 4955 8436 10733 12944 12088 10711 7853 8022 10474 11166 9015 7845
7371 7845 7681 7603 9377 6622 1893 -3275 -1182 1049 -203 1993 5366 2839 4255 3590 3150 605
7355 605 1176 4802 6848 8604 13760 13997 13888 15293 16160 11410 7075 10993 12795 13597 16143 16796 12833
7338 12833 13610 16889 12728 8431 8154 7104 7044 10710 11056 10625 5496 3640 1697 2867 495 1057
7322 1057 -546 -348 1149 3481 6548 5172 4340 6328 2282 3553 4393 2717 2331 378 1281 3667
7306 3667 5333 3462 6657 11696 14483 14088 10993 4898 2732 1601 1486 3006 3002 5075 5173 3573 1287
7289A287j321O283L760j12j85r26L151k568j759K454n65j541J741R91K047Q96
7273A3633r482o261k87L543l43n42j377J726M699M918L501l707j670j686k915
7258C750l352J199J049j919K67N41p25j044P46J24k411j174J551r47J859M501
7242D015J708l670l283j285k795J329N706K865k036L26J022J506m626j190N016
7227D608L163J260m08k10q82l890R03M047j550k344j257K755k965L77k396M00
7211A611M975J106m901m938m89K518j107K436O749J083l155k299Q7K254L705J504
7195A1139O58p043m709q21J65O096J772M482J897j262k668k080N27n253L407j573
7179D734k066J843J392J197k519l729K03j754J783J17j770R54k698j48M573k076
$$ plain form
7289 1287 -34 6249 10009 9897 9712 8786 11937 9369 7610 10064 9499 7958 9699 10690 12737 13633
7273 13633 4151 -2110 -2397 1146 803 261 -1116 610 5309 10227 13728 10021 8351 6665 3750
7258 3750 398 1597 2646 727 994 1535 810 -234 512 636 -1775 -2949 -1398 -2345 -486 4015
7242 4015 5723 2053 -1230 -2515 -5310 -3981 1725 4590 2554 2880 3902 5408 782 -408 4608
7227 4608 7771 9031 8623 8413 7531 3641 4544 8591 7041 4697 3440 6195 3230 3607 1211 1611
7211 1611 6586 7692 2791 -2147 -2636 -118 -1225 1211 7960 9043 5888 3589 3676 5930 9635 11139
7195 11139 11797 4754 45 -776 -611 5485 7257 11739 13636 12374 9706 7626 8153 2900 6307 4734
7179 4734 2668 4511 5903 7100 4581 852 1055 -699 1084 1201 -569 385 -2313 -2461 2112 36
7163C6J083L520q9J30m193l84l694j982o44K760o70r45l437K430M148K6j790J553
7145b142J731k076m68l653r48J286M191M129M46J51k22j30k42k084m31K792o48
7128A682q3j05K1N16J090j598j946J790j572j87J634K374j183K33L1l619j280
7111b202M597M887j136R89o68j359k406j228k85J91q72J70j272J799j067P1m70
7094b61m877p1m31K486l928P38L436K006M623J483l236m021l427k320J182R19
7078e699q51J779N246J324k180k747j0J377m04k659J165J427k184J321K589m104
7062d610l53L173j586j89q48l656k762J576j214J078K051K719N71r33J535M687
7046A239J44K16J989J84Q46j173r27J881m0o134l812r97L522m88j774K355J590
$$ plain form
7163 36 1119 4639 4550 4680 487 103 -3591 -5573 -6217 -3457 -4127 -5072 -8509 -6079 -1931 -1905 -3695 -2142
7145 -2142 -411 -2487 -2955 -6608 -7556 -6270 -2079 2050 2496 2647 2425 2295 2053 -31 -462 2330 1682
7128 1682 1599 1494 1515 2031 3121 1523 -423 1367 -205 -392 1242 3616 2433 2666 2697 -922 -2202
7111 -2202 2395 7282 6146 7135 6467 5108 2702 1474 1189 1380 508 678 -594 1205 138 209 -261
7094 -261 -5138 -5209 -5640 -3154 -7082 -6344 -2908 -902 3721 5204 1968 -2053 -5480 -7800 -6618 -5699
7078 -5699 -6550 -4771 475 1799 -381 -3128 -3138 -1761 -2165 -4824 -3659 -2232 -4416 -3095 -506 -4610
7062 -4610 -4963 -1790 -3376 -3565 -4413 -8069 -10831 -9255 -10469 -9391 -7340 -4621 -4050 -4983 -3448 1239
7046 1239 1383 1599 3588 3772 4618 3445 2518 4399 4359 -1775 -5587 -6584 -3062 -3550 -5324 -2969 -1379
7029a379K831J649j69k287j725o03k376l95n04J720M00K449J441K91l808q95j766
7012e126P00K365l275m68N28k934P24j435M528N608j038m503j139R41j69J827
6996b866J014j944K487L121j135k373k528m368j56K068M20M119J79J735k270l861
6980f358M191L907r74m813j954j157n53j237J122J865K03J320J184l450k04M051
6964b857J940M981k1k65J90L136K009K783l836k932J655l98o39L78j578Q64l139
6947B271k19J78N20n45K21j527k019l537L087K402k796q52K162P556N409K490
6931A4801l728n865p74L078J096n083n120P84J200L39j431k30J909o78l026J120
6915a608K805Q02K893j953k889N18l75Q37j818k094q686O83L934N510l114q7J422
$$ plain form
7029 -1379 1452 3101 2932 645 -1080 -1683 -4059 -4454 -4958 -3238 -2838 -389 1052 1343 -2465 -3360 -5126
7012 -5126 -4426 -2061 -5336 -5804 -5276 -8210 -7486 -8921 -4393 1215 177 -4326 -5465 -4524 -4693 -2866
6996 -2866 -1852 -3796 -1309 1812 677 -1696 -4224 -8592 -8748 -6680 -6260 -2141 -1962 -227 -2497 -6358
6980 -6358 -2167 1740 766 -4047 -6001 -7158 -7711 -8948 -7826 -5961 -5758 -4438 -3254 -6704 -6908 -2857
6964 -2857 -917 4064 4043 3778 3968 7104 9113 11896 8060 5128 6783 6385 5746 6124 4546 5410 2271
6947 2271 2052 2230 2750 2205 2426 899 -1120 -4657 -1570 832 -1964 -2816 -654 6902 12311 14801
6931 14801 11073 5208 4434 7512 8608 3525 -1595 -811 389 728 -703 -933 976 298 -2728 -1608
6915 -1608 1197 1999 4892 2939 50 568 193 1030 -788 -2882 -11568 -10885 -6951 -1441 -4555 -4642 -3220
6898c220m17K983k09m669j667j432L631L964K630J106J786l048j625l306l44Q30
6882c007j981O32n67K091K350k753l608J534M931o47j14N82k911N71j009L503
6866d03J170l288k487j188o34J080L565J755M39J601J797P5J084K275k578m351
6850h8l70M36q1J837M716n552q424m297L096K504K68j045L561K566L267J217p584
6833c973l913k164l7K674M132K279J238K793n224l725j511K535P07m99J456M377
6817A145O66m674n798m30K109O25j856j340Q12K363K616L328J403J92M41O46n028
6800b780l796p60L575M110j280l323j200j144N64P23j157R85J856J095n0m77P43
6783b316J826K634J075o59P52J593j339k532N00R98l159j105J232K203k708o210
$$ plain form
6898 -3220 -3637 -654 -863 -5532 -7199 -8631 -5000 -1036 1594 2700 4486 1438 -187 -3493 -3837 -3007
6882 -3007 -4988 -4356 -4923 -2832 -482 -3235 -6843 -5309 -378 -1025 -1139 -557 -3468 -2897 -3906 -403
6866 -403 767 -2521 -5008 -6196 -6830 -5750 -2185 -430 9 1610 3407 3482 4566 6841 4263 -88
6850 -88 -458 -22 -103 1734 6450 898 -7526 -11823 -8727 -6223 -5955 -7000 -3439 -873 2394 3611 -3973
6833 -3973 -7886 -10050 -10087 -7413 -3281 -1002 236 3029 -2195 -5920 -7431 -4896 -4189 -4688 -3232 1145
6817 1145 1811 -2863 -8661 -9091 -6982 -6357 -8213 -9553 -8741 -6378 -3762 -434 969 1161 1602 2248 -2780
6800 -2780 -6576 -7336 -3761 349 -931 -4254 -5454 -6598 -6034 -5311 -6468 -5483 -3627 -2532 -2582 -3059 -2316
6783 -2316 -490 2144 3219 2560 3312 4905 3566 1034 1534 2532 -627 -1732 -500 1703 -1005 -7215
6767g215j155j713o651L41J796p68P51j719k924K597M352N339L896O636J137l618
6751A082n957J743J459j04K505l954j139j864j285J702j190k869J774K77l006
6736a0826j121K550J625j047o25OM524L483J019l550j385P77j12J298J287J213
6720h84J209k317l197K970L127L364k16k770k634k665R8j686J308J067j216l096
6704g538M661L508j090K703K106K418k926k471J610o69l783j881l249l165L580
6689f186L896J910J209L984q40p53r91K455M178k229m851j693K935k65M74K09
6673C442k695J756J798j423K00N150P957L460o528l539l890m076n3O26n094K033
6657h76L07j326j757j211M950K119n240M7L251L577N247l87o65L632M357l465
$$ plain form
6767 -7215 -8370 -10083 -16734 -16393 -14597 -15365 -14614 -16333 -19257 -16660 -12308 -6969 -3073 3563 4700 1082
6751 1082 -4875 -3132 -1673 -1777 728 -3226 -4365 -6229 -7514 -5812 -7002 -9871 -8097 -7820 -10826
6736 -10826 -11947 -9397 -7772 -8819 -9444 -9438 -4914 -1431 -412 -3962 -5347 -4570 -4682 -3384 -2097 -884
6720 -884 325 -1992 -5189 -2219 908 4272 4056 1286 -1348 -4013 -3915 -5601 -4293 -3226 -4442 -7538
6704 -7538 -2877 631 -459 2244 4350 6768 3842 1371 2981 2312 -1471 -3352 -6601 -9766 -6186
6689 -6186 -2290 -380 829 4813 3973 3220 2229 4684 8862 6633 1782 89 3024 2759 3233 3442
6673 3442 747 2503 4301 2878 3078 8228 16185 19645 13117 9578 5688 1612 1559 2185 -2909 -876
6657 -876 -569 -1895 -3652 -4863 87 2206 -3034 -2987 264 3841 9088 8701 8036 11668 16025 12560
6641A2560k119Q13k191l090m33O3r16j272K904K908K172K039q22j96k053m922
6625E445k499J344k901K15Q52j90l892L490L909q88k733k071K460K591l520j137
6609D75l09j392J575J449k277k337J981K664k478p4N21m20P06K181K002l029j351
6592a13n291j286k274k684q99M528O680L740J930J151l490k632K187J673n935
6577b715j2802p136j453O523R316P459O202P141R974M697m221o110r11o004j0846
6562h86j0663p938K344L506O937N654K12n07L849N018N286l238q527p630j342
6547g925m34K495M39n12J647l223m07m13J984k7L894J179j490l201j880N112K59
6530b503K21M091L192k591k464k120p176K398M310J535k741m01m58j356j032P44
$$ plain form
6641 12560 10441 11254 9063 5973 5540 5603 4687 3415 6319 9227 11399 13438 12616 12420 10367 5445
6625 5445 2946 4290 1389 1604 2456 2266 -1626 1864 5773 4885 2152 81 2541 5132 1612 475
6609 475 166 -1226 349 1798 -479 -2816 -835 1829 -649 -723 -202 -622 84 2265 4267 1238 -113
6592 -113 -5404 -6690 -8964 -11648 -12547 -8019 -1339 2401 4331 5482 1992 -640 1547 3220 -2715
6577 -2715 -15517 -22653 -24106 -17583 -8267 -808 5394 12535 22509 27206 22985 16875 15964 9960 -886
6562 -886 -11549 -19487 -17143 -13637 -6700 -1046 -834 -1341 2508 7526 12812 9574 1047 -6583 -7925
6547 -7925 -8359 -5864 -5425 -5937 -4290 -7513 -7920 -8333 -6349 -6376 -2482 -1303 -2793 -5994 -7874 -2762 -2503
6530 -2503 -2282 1809 5001 2410 -54 -2174 -9350 -6952 -2642 -1107 -3848 -4249 -4707 -6063 -7095 -6351
6514f351O94J518M387j629o810k941L114M8K81Q4n4o87p62K625L783K255l405
6497c850M425J56k506o87j462j25j835L06L474K098J194r06k20j087j0M69K54
6480c12O87k138l313k281K027J87l551K413P87N067K288l265l411l443m90L423
6464e325N033j465k234J40Q56K318J804L08K600j045o293k038k484o86Q79j073
6448h705J50L840K598K336r05m702L690q87k975p42J395L066K457l390k891O17
6432e048M895O6j061j971l962n96o3k56K166Q757M149n473n928j971K691Q93n27
6415c239j277j932m58J134J368k714o643R54Q225M218J931j541j481k828l66j411
6399f060J6M12j426j491k661O08N168L188j367k089J390Q42m790k584j57k833
$$ plain form
6514 -6351 -5657 -4139 248 -1381 -8191 -11132 -8018 -7970 -7689 -7605 -7659 -8346 -9108 -6483 -2700 -445 -3850
6497 -3850 575 731 -1775 -2462 -3924 -4049 -5884 -5578 -2104 -6 1188 282 62 -1025 -1035 -566 -312
6480 -312 375 -1763 -5076 -7357 -5330 -5143 -8694 -6281 -5494 -427 1861 -1404 -4815 -8258 -8748 -5325
6464 -5325 -292 -1757 -3991 -3851 -2995 -677 1127 1435 4035 2990 -3303 -5341 -7825 -8511 -7632 -8705
6448 -8705 -8555 -4715 -2117 219 -686 -5388 -1698 -2585 -5560 -6302 -4907 -1841 616 -2774 -5665 -5048
6432 -5048 -153 -87 -1148 -3119 -7081 -7677 -7740 -7996 -5830 2927 7076 1603 -4325 -6296 -3605 -2712 -3239
6415 -3239 -4516 -6448 -6906 -5772 -4404 -7118 -13761 -12807 -4582 -364 1567 26 -1455 -4283 -4649 -6060
6399 -6060 -6044 -5632 -7058 -8549 -11210 -10602 -5434 -2246 -3613 -5702 -4312 -3470 -8260 -10844 -11001 -13834
6383a3834o71K382J923N673Q885J2740Q382Q054O132J875M207J813p587j1020
6369B8954r297q124r805n391o594l784n76J375K689Q32O003J537N19k559M28P9
6353c714j667l10j928q58K733M925J001n428j464L161K262j922n877n93L178N303
6337a198J083K12K165j045l545o507J085N896K368j780j152q30o91r62O62K307
6321a932j096j345P80m27j474j708J262K790j953K789R12P51L262p54j835o40
6305f18J809r74j840j171K270L060J70j989l582N65j525K23P81J78j224l17M48
6288c736k78M3L232K678m07j764k245l409j255J764J258k119P77M397O35l0j59
6271f18J472m25L11R82l90K173j662j129j65O73j307q51j5l95k373k098J985k011
$$ plain form
6383 -13834 -14505 -12123 -10200 -4527 4358 17098 25480 33534 39666 41541 45748 47561 39974 28954
6369 28954 19657 11533 1728 -3663 -10257 -14041 -14617 -13242 -10553 -9721 -3718 -2181 -1662 -4221 -3793 -3714
6353 -3714 -5381 -5691 -7619 -8477 -5744 -819 182 -5246 -6710 -3549 -1287 -3209 -9086 -9679 -6501 -1198
6337 -1198 -115 97 2262 1217 -2328 -8835 -7750 -1854 514 -1266 -2418 -3248 -3939 -4901 -4239 -1932
6321 -1932 -3028 -4373 -3593 -4020 -5494 -7202 -5940 -3150 -5103 -2314 -1402 -651 2611 1857 22 -618
6305 -618 1191 217 -1623 -2794 -524 2536 2706 717 -2865 -2300 -3825 -3602 -2821 -2643 -3867 -4184 -3736
6288 -3736 -4014 -3971 -739 1939 1532 -232 -2477 -5886 -7141 -5377 -4119 -6238 -5461 -1064 -429 -459 -618
6271 -618 854 429 740 1722 1332 3505 1843 714 549 1222 -85 -936 -951 -1346 -3719 -5817 -3832 -5843
6253e843n056J556K670M554p6n39k319k670Q69N749n09j391k174k716K751p04
6237e848n77o63k219J063j493p4r88L602J520n68K557j347K094J668m289J491
6221d071L369L142k690k468K868k486j760O38p93N40k364k667j332q83L198K644
6205e115J979p80r23k372l824K693J800J646j011j400l28O89J378K662k734J230
6189d410J144j549l053j233l79l13L682J011j466o55m20p22l061K139K339p19
6173g665j283J426j067r10j642O30M860N356J774l22O633l500n952l515k853j594
6157i624j312l802r27L789N252J611J629K388q71j435L509J83J54l122o029j657
6141a0264M529M650l745j804J98M537K803k56o95M579m42m329k481j090J388J977
$$ plain form
6253 -5843 -10899 -9343 -6673 -2119 -2195 -2734 -5053 -7723 -6854 -1105 -1614 -3005 -5179 -7895 -5144 -5848
6237 -5848 -6425 -7088 -9307 -8244 -9737 -9811 -10799 -7197 -5677 -6245 -3688 -5035 -2941 -1273 -5562 -4071
6221 -4071 -702 2440 -250 -2718 150 -2336 -4096 -3458 -4251 -3711 -6075 -8742 -10074 -10957 -7759 -5115
6205 -5115 -3136 -3916 -4839 -7211 -11035 -8342 -6542 -4896 -5907 -7307 -7635 -6946 -5568 -2906 -5640 -4410
6189 -4410 -3266 -4815 -7868 -9101 -9480 -9793 -6111 -5100 -6566 -7221 -7641 -8363 -11424 -9285 -6946 -7665
6173 -7665 -8948 -7522 -8589 -9499 -11141 -10511 -5651 -295 1479 1157 7790 4290 -1662 -5177 -8030 -9624
6157 -9624 -10936 -14738 -15665 -11876 -6624 -5013 -3384 -996 -1867 -3302 207 390 544 -2578 -8607 -10264
6141 -10264 -5735 -1085 -4830 -6634 -6436 -1899 904 648 -47 4532 4090 -239 -2720 -3810 -2422 -445
6125d45l890l184j93J744l795k755M760L132k890j544j014k91L666N212P13j411
6109b185m25L09k406r08K205k943m278j365J0482L565j079j419J36k937R37l57
6093b668k561j005M796L020j111Q42k174n24j997L16n69j822K895L719K030l37
6077B850j314k732K592p57m17J308p3k529n395n719L406P311k45J690L523k888
6061F11j652J995L274P83l915m012J174O892K26p40m465j286P16j062J711K402
6045B652R17k954k262j274Q87j198l082J033k18k69m94L243k303k769J697K519
6029c875J099j519J821K386j393k367O43l75L887l518o622J085M091M623L499
6014C465k488j895j868K015O00o28J775J198J874j796l547p64r17k402J316l46
$$ plain form
6125 -445 -4335 -7519 -7712 -5968 -9763 -12518 -7758 -4626 -7516 -9060 -10074 -10365 -6699 -1487 -774 -2185
6109 -2185 -2610 -2301 -4707 -5615 -3410 -6353 -10631 -11996 -1514 2051 972 -447 -311 -3248 -2311 -2668
6093 -2668 -5229 -6234 -1438 1582 471 1313 -861 -1385 -3382 -3066 -3635 -5457 -2562 1157 3187 2850
6077 2850 1536 -1196 1396 639 222 1530 1457 -1072 -6467 -12186 -8780 -1469 -1714 -24 3499 611
6061 611 -1041 954 4228 5011 1096 -2916 -1742 5150 5376 4636 171 -1115 -399 -1461 250 2652
6045 2652 3569 615 -1647 -2921 -2034 -3232 -6314 -5281 -5499 -5768 -6262 -3019 -5322 -8091 -6394 -3875
6029 -3875 -2776 -4295 -2474 -88 -1481 -3848 -3205 -3580 307 -3211 -9833 -8748 -4657 -34 3465
6014 3465 977 -918 -2786 -771 -171 -799 976 2174 4048 2252 -1295 -2059 -2976 -5378 -4062 -4408
5998d408L054K764K562r82k845j319l758r78O76K074L25j051j491j37l30k912
5982h756m47M60L373K715P731L75N6N449L74m909J750q00r13k580p060m035j126
5965h343K758K367n55Q1k36K915R81R24k62K80J000J722k193r69J775k55k131
5948a41k194m17K263M353j346j704k670J524k618l31N856j795k897r47r18m649
5932h631J566M669l11k052l452q92M59o47J720J354J030L440Q42J499K073j542
5916A125k32j827k804K218M424o14j729o55m83m32l208O38M073j526k281j43N73
5899b883O55j21k961K032M950k984n002k440N480M442m00J577k152j131M87j467
5883a918o35K629J766k33r4k372Q2K666O89L36k428o157j979k007J55L6J115J291
$$ plain form
5998 -4408 -1354 1410 3972 2990 145 -1174 -4932 -5910 -5234 -3160 -2835 -3886 -5377 -5514 -5844 -8756
5982 -8756 -9203 -8743 -5370 -2655 5076 5451 5507 10956 11330 6421 8171 7371 6458 3878 -3182 -7217 -8343
5965 -8343 -5585 -3218 -3773 -3692 -3928 -1013 -32 892 630 910 1910 3632 1439 470 2245 1990 -141
5948 -141 -2335 -2752 -489 3864 2518 814 -1856 -332 -2950 -3281 2575 780 -2117 -3064 -3982 -8631
5932 -8631 -7065 -2396 -2707 -4759 -8211 -9103 -8644 -9291 -7571 -6217 -5187 -1747 -905 594 2667 1125
5916 1125 893 -934 -3738 -1520 2904 2290 561 -94 -577 -1009 -4217 -3579 494 -1032 -3313 -3456 -2883
5899 -2883 -2228 -2349 -5310 -3278 1672 -1312 -6314 -8754 -3274 1168 768 2345 193 -938 -451 -1918
5883 -1918 -2553 76 1842 1609 1515 -857 -775 1891 2580 2916 488 -5669 -7648 -9655 -9500 -9464 -8349 -7058
5865g058J869j848j452j16J137j333J970L924L285J906K657O32m110j144J797
5850B116Q69n92j699r74p30P15J086N4L589k1p08l528m156n93j971J046L503K458
5832D64J632m91j479j647j124J455j607k696k253O92L732M400L10O56J004k98
5816B750K303l700m007J772l17j023J236l74k368K212L44m422N24l50R38J856
5800b626L486P82L699j885J073l96o1p45q15q75O96L215P91J19r5j42q29M7k6
5781E413j477K914k97n011l262L200m204k041N915J612o42j564k273k621n54k956
5765g848j242R17L503M73J305m081j805M244L219J008m846J136N552l962j691
5750d118J714k438K46K729J250N424o18o733l436L655j47o39K863m64l755R32
$$ plain form
5865 -7058 -5189 -7037 -8489 -8605 -7468 -8801 -6831 -2907 378 2284 4941 5573 1463 319 2116
5850 2116 2985 2393 694 -280 -1010 -295 791 845 4434 4413 3705 177 -3979 -4572 -6543 -5497 -1994 464
5832 464 2096 1605 126 -1521 -2645 -1190 -2797 -5493 -7746 -7054 -3322 1078 1388 2044 3048 2750
5816 2750 5053 1353 -2654 -882 -1199 -2222 -986 -1360 -3728 -1516 -1172 -5594 -5070 -5420 -4482 -2626
5800 -2626 860 1642 5341 3456 4529 4133 4072 3327 2512 1637 2333 5548 6339 6458 6363 6221 5392 5439 5413
5781 5413 3936 6850 6553 1542 -1720 1480 -2724 -4765 1150 2762 2120 556 -1717 -4338 -4892 -7848
5765 -7848 -9090 -8173 -4670 -4197 -2892 -6973 -8778 -4534 -1315 -307 -5153 -4017 1535 -2427 -4118
5750 -4118 -2404 -4842 -4596 -1867 -617 4807 4189 -2544 -5980 -2325 -2472 -3111 -248 -712 -4467 -3535
5734c535Q70j128Q69O51L251O50j421k966k210n55K507p37K124J905l417N23j20
5717b739k852J091M277M18k74K461k516m003k644J90N714M016l605n882l100J706
5701g742O22L348M760L12M849L670p581m821m702j918M641K150J313K032j154
5686b21L044l76j334m054J394K069J002L60m476j413N86J677j526J926n37P78
5670a101j95J02N442k533k454n447m812K812k30j179L454L051j837k936J929M031
5654a903K540K85K70j348k931j412L356j220o41M774J580l254K45m151m9K017
5638a842j090k787j136J494M361j034k573K313m00J128k34j08J030p82k986j094
5622e740K125R98O25p56j426J128J983J726k978k874mP93K02J50N19K569l360
$$ plain form
5734 -3535 -2665 -3793 -2924 -2273 978 1628 207 -2759 -4969 -5524 -3017 -3754 -1630 275 -3142 -2619 -2739
5717 -2739 -5591 -4500 -223 195 -79 2382 -134 -4137 -6781 -6591 -877 3139 -466 -6348 -9448 -7742
5701 -7742 -7120 -3772 988 1300 6149 9819 2238 -2583 -7285 -9203 -4562 -2412 -1099 933 -221
5686 -221 2823 2447 1113 -2941 -1547 522 1524 1884 -2592 -4005 -3419 -1742 -3268 -1342 -1879 -1101
5670 -1101 -1296 -1194 4248 1715 -739 -6186 -10998 -8186 -8416 -9595 -6141 -3090 -4927 -7863 -5934 -1903
5654 -1903 637 922 1192 -156 -3087 -4499 -1143 -2363 -3004 1770 3350 96 341 -3810 -3859 -1842
5638 -1842 -2932 -5719 -6855 -5361 -1000 -2034 -4607 -2294 -2694 -1566 -1800 -1908 -878 -1660 -4646 -5740
5622 -5740 -3615 -2617 -1992 -2748 -4174 -3046 -1063 663 -2315 -5189 -5193 -4400 -4198 -4048 -3529 -960 -4320
5605d320l138L242M486J805j037O17m138o9p4r87K524j284K210K217j616m46J150
5588A142K818k731l255l40q68N12M96j042j540k964k635r99n63Q61M059J691N59
5571d799J764K242k115k179P02K32k685K618K035L239P25o76K412k462m501k347
5555e795L685L775k546k970j902J002L845L175l393m010N97k364l29j874K14J670
5539g220O35L755j657K634n05j216k044J169j038J666L626J764K342j397k214
5524C00k484O62j159j300J53j088K735j01K129k39l650l603K109r01k778K216
5508f999k64j207k09m78M482M581j692k024j436M572j787r596n253J41M585L670
5492h914K630L876j005J070j930k192r25M77n37m26K241K711L059n85j507Q03
$$ plain form
5605 -4320 -7458 -4216 270 2075 1038 1655 -2483 -2552 -2626 -3613 -1089 -2373 -163 2054 438 -8 1142
5588 1142 3960 1229 -2026 -2366 -3234 -2722 -2226 -3268 -4808 -7772 -10407 -11406 -11969 -11108 -7049 -5358 -4799
5571 -4799 -3035 -793 -2908 -5087 -4385 -4153 -6838 -4220 -2185 1054 1779 1103 3515 1053 -3448 -5795
5555 -5795 -2110 1665 -881 -3851 -5753 -4751 -906 2269 -1124 -5134 -4537 -6901 -7230 -9104 -8890 -7220
5539 -7220 -6585 -2830 -4487 -1853 -2358 -3574 -5618 -4449 -5487 -3821 -195 1569 3911 2514 300
5524 300 -2184 -1522 -2681 -3981 -3828 -4916 -2181 -2282 -153 -392 -4042 -7645 -5536 -6437 -9215 -6999
5508 -6999 -7263 -8470 -8679 -9157 -4675 -94 -1786 -3810 -5246 -674 -2461 -12057 -17310 -17169 -12584 -8914
5492 -8914 -6284 -2408 -3413 -2343 -4273 -6465 -7390 -6913 -7450 -7876 -5635 -2924 135 -450 -1957 -1154
5476a154J004K719k387l691J093K624N79j820k188R66K741M248M093l931r08m845
5460h57l265L182K465K588k79m75n05k068k241R14r86j255L231L771j450n297
5444b527m077L139N500J544J074j939M28M03o94J63k999j753K673K073Q50J531
5428E389k491m917J384L248j771k998P43Q22l560K153L092j12Q25J407l169j729
5412a684j445j251M72l105M74L237K381L665J869p05k593M70j863j086J43K310
5396A289n75l183j850O106O31K542m696j694N37l22j700l16l995j268M009Q606
5380D121L461k95j662j994j890J728k416m19N64J563K372k148R30K633p93n166
5364E89k134l092n556R65m97N63L704J712j325K956M071L748k9o90p14k153m195
$$ plain form
5476 -1154 -150 2569 182 -3509 -2416 208 787 -1033 -3221 -2255 486 4734 8827 4896 3988 -857
5460 -857 -4122 -940 1525 4113 3834 3359 2854 786 -1455 -541 -1527 -2782 449 4220 2770 -2527
5444 -2527 -6604 -3465 2035 3579 4653 2714 3142 3545 2851 3014 15 -1738 935 3008 3858 5389
5428 5389 2898 -2019 -635 2613 842 -2156 -1413 -591 -4151 -1998 1094 982 1807 3214 45 -1684
5412 -1684 -3129 -4380 -3908 -7013 -6539 -3302 -921 2744 4613 3908 1315 1785 -78 -1164 -1021 1289
5396 1289 714 -2469 -4319 1787 2418 4960 264 -1430 -893 -1215 -2915 -3231 -7226 -8494 -4485 4121
5380 4121 7582 7287 5625 3631 1741 3469 1053 634 1198 2761 5133 2985 3915 6548 5755 589
5364 589 -1545 -4637 -10193 -9228 -9725 -9162 -5458 -3746 -5071 -2115 1956 5704 5675 4985 4271 2118 -2077
5347b077k208J51j300L167j617L060O296j782m761k925J054q91k39l00J738N162
5331B528M691m100j499J833J55k105k284J621O6L297P84k814j760J412k925K346
5315A246Q41j534r17L589N32Q71l93M364p42m257k768j526k719j218k02L100j507
5298c240K599M92O41k530K147Q5l111j57N96J407K152K003K591n27l350j191L760
5281D367k027l082k196m197m297L031L710Q3p66K591M485J706k507j092r18Q93
5265b16j869J299K195P90m65o451J544L248O36J667J601L363k987o07J140J099
5249E987m140m058p18m27m26k658J62K540k396j989M314K571K517k596J177M082
5233C942j897k385N33K342K375J688K071j396j515k419lJ348O24k231k828Q02
$$ plain form
5347 -2077 -4285 -4134 -5434 -2267 -3884 -824 5472 3690 -1071 -3996 -2942 -3833 -4072 -4372 -2634 2528
5331 2528 7219 3119 1620 3453 3608 1503 -781 840 906 4203 4987 2173 413 1825 -1100 1246
5315 1246 2087 553 -364 3225 3757 4628 4235 8599 7857 3600 832 -694 -3413 -4631 -4833 -1733 -3240
5298 -3240 -641 -149 492 -2038 109 194 -2917 -3074 -2478 -1071 1081 3084 5675 5148 1798 607 4367
5281 4367 2340 -742 -2938 -7135 -11432 -8401 -4691 -4608 -5374 -2783 1702 3408 901 -191 -1109 -216
5265 -216 -2085 -786 1409 2199 1734 -4717 -3173 75 711 2378 3979 7342 4355 3748 4888 5987
5249 5987 1847 -2211 -2929 -3356 -3782 -6440 -6278 -3738 -6134 -8123 -3809 -1238 1279 -1317 -140 3942
5233 3942 2045 -340 193 2535 4910 6598 8669 7273 5758 3339 3336 4684 5308 3077 249 1051
5217A051M356j156l66q15j316n545k852k102R33k868k453L020P116j110o91M53
5201d345L096j488n697L07L391J63R43L007l670n96K90j757J728O281l383j511
5185c241j879P21j524j092p80K165L958K135J949j877o43n05Q43J005J116J686
5169D037O16N13J318O0l27l826m537J322L863K948p98J827r81l82m875m615K677
5152a160L084J80o12l245l193j422K007K535J896R47O83M156j605l790Q81R66
5136B308p93L832k066m850k803Q63O45l30K120O65K658j806k743L305K446L97
5120C848m007l658M06K922K004q89l328m778k615K538M627J956k260k42K229J098
5104a49o69J398M783K51o866k197l079J855K408J228m156P95P927j309k644j258
$$ plain form
5217 1051 5407 4251 3885 3070 1754 -3791 -6643 -8745 -7812 -10680 -13133 -10113 -2997 -4107 -4798 -4345
5201 -4345 -1249 -2737 -8434 -8127 -4736 -4573 -3630 -623 -4293 -4889 -4599 -6356 -4628 1653 -1730 -3241
5185 -3241 -5120 -4399 -5923 -7015 -7795 -5630 -1672 463 2412 535 -108 -613 230 1235 2351 4037
5169 4037 4653 5166 6484 6544 6217 2391 -2146 -824 3039 5987 5189 7016 6035 5653 778 -3837 -1160
5152 -1160 1924 2104 1492 -1753 -4946 -6368 -4361 -1826 70 1017 1700 5856 4251 461 1342 2308
5136 2308 1515 5347 3281 -1569 -4372 -3509 -2864 -3194 -1074 -409 2249 443 -2300 1005 3451 3848
5120 3848 -159 -3817 -3411 -489 1515 626 -2702 -7480 -10095 -7557 -2930 -974 -3234 -3476 -1247 -149
5104 -149 -818 580 5363 5614 -1252 -3449 -6528 -4673 -2265 -1037 -5193 -4398 3529 2220 -424 -1682
5088a682n430Q4J658J364r12L29r67P290P61m401k111Q25j569M47M064L970N59
5071D279m081o473R96L430n88L41n23L083M22k000J920K07q34J892o34L122r69
5054C590J94o01k27j451k121j773m206j09k704n98J913J791L193k631k646O95
5038g691J156J349m66R18m49O58p26j190j431L391J334K212j117n64j093l765
5022g474k900k447L762Q22m39L922M593n234j551N22J87r75M166M664k843k285
5006c510j495m11K514j808j755n64K443M591J58k420j383J88J25j749r12L321
4990b667L276K816m194j419k01L900p62L54K03k325j045o77J322n078k486L395
4974e588M708P71r7K672L153L643l358J425j000l029n539l472L993K48k731l51
$$ plain form
5088 -1682 -7112 -7028 -5370 -4006 -4918 -4589 -5556 1734 2495 -1906 -4017 -3192 -4761 -4314 -250 3720 4279
5071 4279 198 -6275 -5279 -1849 -2437 -2096 -2619 464 886 -1114 806 1013 179 2071 1437 4559 3590
5054 3590 3784 3183 2956 1505 -616 -2389 -6595 -6704 -9408 -10006 -8093 -6302 -3109 -5740 -8386 -7691
5038 -7691 -6535 -5186 -5652 -4734 -5183 -4525 -5251 -6441 -7872 -4481 -3147 -935 -2052 -2616 -3709 -7474
5022 -7474 -10374 -12821 -9059 -8237 -8676 -4754 -161 -5395 -6946 -6424 -6237 -7212 -3046 1618 -1225 -3510
5006 -3510 -5005 -5416 -2902 -4710 -6465 -7029 -4586 5 163 -2257 -3640 -3452 -3327 -5076 -5988 -2667
4990 -2667 609 3425 -769 -2188 -2389 1511 749 1103 1306 -1019 -2064 -2741 -1419 -6497 -8983 -5588
4974 -5588 -880 -109 -206 2466 5619 9262 5904 7329 6329 3300 -2239 -5711 -1718 -1470 -4201 -4552
4958d552L060j167j933m605k609M731N719R99L974j00k264R99j388m958J166N091
4942B163K59k542j246n47l14j396l168j601j077J445L764J920K710k59k718k29
4926b836j421l17P66J155K400j023l234j55M77pm253K418M459L418j734n31Q06
4909C88K872Q51J371N038k064j065m562q05M629L05l663l531j86J039J637L399
4893E653j649k342O6k97m754l831L736k60M06K776N10k531K029k86Q51K197K729
4876E003O61j28K701k927n781r69J716J932j404L49o61o96k191J670K070k142
4860g97J529J441O15J43j86r81K357L75L544m798o860n849P86K950L45J83N054
4843a49J348N13k226N45P60K992q82n713r22j785J180J75R18K527r29m07L049
$$ plain form
4958 -4552 -1492 -2659 -4592 -9197 -11806 -7075 -1356 -357 3617 3517 1253 2252 864 -4094 -2928 2163
4942 2163 2422 -120 -1366 -1913 -2227 -3623 -6791 -8392 -9469 -8024 -4260 -2340 370 111 -2607 -2836
4926 -2836 -4257 -4574 -3808 -2653 -253 -1276 -4510 -4665 -4188 -4195 -8448 -6030 -1571 1847 113 -418 388
4909 388 3260 4111 5482 10520 8456 7391 2829 2024 6653 6958 3295 -236 -422 617 2254 5653
4893 5653 4004 1662 1728 1431 -3323 -7154 -3418 -3678 -3272 -496 14 -2517 -488 -774 77 2274 5003
4876 5003 5664 5536 8237 5310 -471 -1440 276 2208 804 1153 492 -204 -2395 -725 1345 -797
4860 -797 732 2173 2788 2931 2745 1764 4121 4496 8040 3242 -3618 -9467 -8681 -5731 -5386 -5203 -149
4843 -149 1199 1712 -514 31 791 3783 2901 -2812 -3734 -5519 -4339 -4164 -3246 -719 -1648 -2055 994
4826I94J454K897M374K423m256l929k226k0l040j46M710K306J760k620P67J558
4810G006r61n547l892J502m016l320j161M454M539l77k112N44J048j243P59K518
4794b59L55m69J90K14Q93o59j744j647l041n542q24L014L693J663k543n541k38
4777a2485N211O200r5K634j370Q44J95k293m78J184J46k89j758q43l85j071j885
4760f538j013J070Q09K746O88K425J23j880k642R92Q52J173n50K77K62N94l01
4743i13p71l164K770L367m277l084N6J476J549J235K731Q48m708K23J625k293
4727c330l142l556L270O06J112M679K193o38j682J521R82j788N51j545K095n10
4711H18J908m49J900M307O93j098k845m822L07J358M981L460j360k646J479k047
$$ plain form
4826 994 2448 5345 9719 12142 7886 3957 1731 1711 -1329 -1475 3235 5541 7301 4681 5448 7006
4810 7006 6045 498 -3394 -1892 -5908 -9228 -10389 -5935 -1396 -1773 -3885 -3341 -2293 -3536 -2777 -259
4794 -259 96 -373 -183 31 924 265 -1479 -3126 -6167 -11709 -12533 -9519 -5826 -4163 -6706 -12247 -12485
4777 -12485 -7274 -1074 -1169 1465 95 939 1134 -1159 -1637 -453 -307 -596 -2354 -3197 -3582 -4653 -6538
4760 -6538 -7551 -6481 -5672 -2926 -2238 187 310 -1570 -4212 -3220 -2368 -1195 -1745 -1468 -1206 -612 -913
4743 -913 -1684 -4848 -2078 1289 -2988 -6072 -6016 -4540 -2991 -1756 975 1823 -2885 -2662 -1037 -3330
4727 -3330 -6472 -10028 -6758 -6152 -5040 -361 1832 1194 -488 1033 2015 227 778 -767 1328 818
4711 818 2726 2277 4177 8484 9177 8079 5234 412 719 2077 7058 10518 9158 6512 7991 5944
4695E944m030M91R50J459k366j842l375j419%K014K465M90j616l45M46J119J577
4678A962J709j274k349R69J184j646M93J89M1k440m99n46P60j868j425R09K44
4661c587p93J167P41J713J288j935K712L556k451j187p59K817k790q40L512J128
4645D292k443l486k838o95p8J030J676L347R77L10M373J800J929j612m881l269
4629D32l919k235m216m909k558p8k735q88N617M42L688M516p06L168N364N357
4613F340K468j233k043l631j143q41j445nk224m52j066J420M80k277m319K895
4597g076M435K276K2M23O20K24k671n567K133N127j78L362O23l012o907J847K894
4580a425J399J853n37L17J371j909K056O03m26j371P13k385j311n391l860n65
$$ plain form
4695 5944 1914 2405 3355 4814 2448 606 -2769 -4188 -4188 -2174 291 781 -835 -1180 -734 385 1962
4678 1962 3671 2397 48 1017 2201 555 1048 1237 1278 -1162 -1661 -2207 -1447 -3315 -4740 -3831 -3587
4661 -3587 -4380 -3213 -2472 -759 529 -1406 1306 4862 2411 1224 465 3282 492 -348 3164 4292
4645 4292 1849 -1637 -4475 -5170 -5248 -4218 -2542 805 1782 2092 6465 8265 10194 8582 3701 432
4629 432 -3487 -5722 -9938 -14847 -17405 -17483 -20218 -21106 -15489 -15047 -11359 -6843 -7549 -4381 983 6340
4613 6340 8808 7575 5532 1901 758 -83 -1528 -1533 -3757 -4209 -5275 -3855 -3375 -5652 -9971 -7076
4597 -7076 -2641 -365 -343 80 700 924 -1747 -7314 -5181 -54 -232 3130 3753 741 -6166 -4319 -1425
4580 -1425 -26 1827 1290 1607 2978 1069 3125 3728 3302 1931 2644 259 -1052 -6443 -10303 -10868
4564a0868N973J072P31L028J490K313m4n677o87J551P62M40l978K035M845l040
4548e4O74l456K146J527L35K996K925J871l57n858J369J730n74K065j117j584
4532D638J458J86k891m60K510J29J373q11n580l961K80O33K515K728J374k23l009
4515H89K826L254K049K623k364n548J073J902l363l277j954J827R20J050O4l809
4499a838l29M792r24l389R64L812J904p65k936j763M93O790K627l253l367k316
4483E02j593L23N64J379J391o75j994L894j829m690j55K233J687j198K95j038
4467i04m40k021L15m64J684K117O005j753m407k179L504n90K872K681K944k111
4451G253m900p47N4o31K374q35k511j922J945L386p96k357J499J837l173k01O91
$$ plain form
4564 -10868 -4895 -3823 -3092 -64 1426 3739 3695 -1982 -2669 -1118 -356 84 -3894 -1859 2986 -54
4548 -54 620 -2836 -690 837 1172 4168 7093 8964 8607 2749 4118 5848 5274 7339 6222 4638
4532 4638 6096 6282 3391 2931 5441 5570 6943 6132 552 -3409 -3129 -2496 19 2747 4121 3898 889
4515 889 3715 6969 9018 11641 9277 3729 4802 6704 3341 64 -1890 -63 857 1907 1971 -1838
4499 -1838 -2167 2625 1701 -1688 -724 3088 4992 4227 1291 -472 21 6811 9438 6185 2818 502
4483 502 -1091 -768 -204 1175 2566 1891 -103 3791 1962 -2728 -2883 -650 1037 -161 134 -904
4467 -904 -1344 -3365 -3050 -3514 -1830 287 6292 4539 132 -2047 1457 867 3739 6420 9364 7253
4451 7253 2353 1606 1660 1029 3403 2568 57 -1865 80 3466 2670 313 1812 3649 476 275 966
4434I66l60o28k984k841j701L061l33J554K644j655J35K379J572J52j75j004j169
4417c87J397p1J747K341q26K058J06q21l668j234k738N220j54o036r51K106m60
4400b371J958K919L259L386l365k322o43j894o64J510J783j923l216k366q95K644
4384b200j173O34M72p65J464l26N41P21J896Q79k850k240J282L106j083j188K264
4367A434q89m710j441J475J699j399k174q21J515J078J584k135L028L971l370
4352a155q57L358k976k088l005o92K13J626J426R20m95J184Q81K575K536m014
4336e63k368k461K074K515L487k980j897l24M060j850l355P37j023j246N695K798
4320C299K131p58k896J188k14j492j596q65j726l001j17j454k63N60j230J513
$$ plain form
4434 966 606 -22 -3006 -5847 -7548 -4487 -4820 -3266 -622 -2277 -2142 237 1809 1961 1786 782 -387
4417 -387 1010 939 2686 5027 4201 6259 6365 5544 1876 642 -2096 3124 2970 -3066 -4017 -1911 -2371
4400 -2371 -413 2506 5765 9151 5786 3464 2821 927 263 1773 3556 1633 -1583 -3949 -4844 -2200
4384 -2200 -3373 -2739 -2267 -3032 -1568 -1894 -1353 -632 1264 2143 -707 -2947 -1665 1441 358 -830 1434
4367 1434 545 -4165 -5606 -4131 -2432 -3831 -6005 -6826 -5311 -4233 -2649 -4784 -1756 2215 -1155
4352 -1155 -2012 1346 -1630 -3718 -6723 -7415 -7202 -5576 -4150 -3230 -3725 -2541 -1660 915 3451 -563
4336 -563 -2931 -5392 -3318 -803 2684 -296 -2193 -2517 1543 -307 -3662 -2925 -3948 -5194 501 3299
4320 3299 5430 4672 1776 2964 2750 1258 -338 -1203 -2929 -5930 -6047 -7501 -7764 -7204 -8434 -6921
4304f921k001J681K013J118j15J340N520J419k759r28j208n2k026J19J745K957
4288A902L49M86j09k928P24j074o36l04J86L707K584q33K193K76m417j849j17
4271A40J282Q49l296L644j904m74K100L611k672O73l24L79q1J697n5k615k734
4254B20k15R33l017j571j04K155L52K539j638J703j367j792P02L188J49J510J659
4237E406k54K182n61L985K099l054k005n69r54m408k282K353M802N26j717l328
4221B221o86j888j952J713K240l219j927j338R89N491L347%k508m493k10J418
4205h02j988k630K320m428J943J124M216J290L844j280m943l215M97L876P75o283
4189e684M18K880k51k805j561M840M643k95l556R21L117r35L142k366q25j51O96
$$ plain form
4304 -6921 -8922 -7241 -5228 -4110 -4225 -2885 2635 4054 1295 367 -841 -893 -2919 -2800 -1055 1902
4288 1902 2251 2737 2628 -300 424 -650 -1286 -1590 -1404 2303 4887 4054 6247 6523 2106 257 140
4271 140 1422 2271 -1025 2619 715 241 2341 5952 3280 3953 3629 4008 3927 5624 5569 2954 220
4254 220 5 938 -2079 -3650 -3754 -1599 -1247 1292 -346 1357 -10 -1802 -1100 2088 2237 3747 5406
4237 5406 5152 7334 6773 10758 12857 9803 7798 7229 6275 1867 -415 1938 6740 7266 5549 2221
4221 2221 1535 -353 -2305 -592 1648 -1571 -3498 -4836 -3847 1644 4991 4991 2483 -2010 -2220 -802
4205 -802 -2790 -5420 -3100 -7528 -5585 -4461 -245 1045 4889 3609 -1334 -4549 -4052 -176 599 -5684
4189 -5684 -5266 -2386 -2637 -5442 -7003 -2163 2480 2185 -1371 -450 2667 1732 4874 2508 1683 1532 2228
4172B228oK695k4k313k826l623J173K149j501j132K586Q25l107k786K872R54L219
4155A383M426N357m860o977k449O08K986k284M248L109K42k648k083l86O8J279
4139B019M671J95l565N97J684L400l849m558Q3N64k163j629k105Q59k469J929
4123d337L226l3k02j081J774K517J624l73j214J734J187M07L494o18q885p991
4107h771j878M999M035J721K814J439J402j676p612J351L072j770m64L093L36
4092B091n693k757Q27J847J749M8k87J84M419J23Q66Q44p933k831N253K212m223
4075c261j275M063k83N21J278j501J903M194p21l838p53L9N22r73M15k37K426
4058B519N82k28m094m920J540O290K927n550l663j518j875O245K149k115J028
$$ plain form
4172 2228 2222 4917 4893 2580 -246 -3869 -2696 -547 -2048 -3180 -594 231 -2876 -5662 -2790 -1836 1383
4155 1383 5809 11166 6306 -671 -3120 -2512 474 -1810 2438 5547 5789 3141 1058 672 740 2019
4139 2019 6690 6885 3320 3917 5601 9001 5152 594 677 1241 -922 -2551 -4656 -3797 -6266 -4337
4123 -4337 -1111 -1144 -1346 -2427 -653 1864 3488 3115 1901 3635 4822 5229 8723 8105 -780 -8771
4107 -8771 -10649 -5650 -1615 106 2920 4359 5761 4085 -3527 -2176 896 -874 -1338 1755 2091
4092 2091 -3602 -6359 -5532 -3685 -1936 -1888 -2175 -1991 2428 2551 3417 4261 -3672 -6503 -1250 962 -3261
4075 -3261 -4536 -473 -756 -235 1043 -458 1445 5639 4918 1080 327 366 888 -85 330 93 2519
4058 2519 3101 2873 -1221 -6141 -4601 1689 4616 -934 -4597 -6115 -7990 -1745 404 -1711 -683
4043f83r44K94K256n34n41j38o976j895K632M802O740j226q30m493j428L115M984
4026E135j749n707J178M857j332n762j763J984L077L224j839l013m58k488K930
4011a726K804M090J694p130l800Q20l98k333R98L284l215k278q83n01k04O170
3995b608N124j129m612k451K711N307J517l251j450j683k189J412J627L642M07
3980B374L868m573j248l27r07M271m88j150n804l683j03K395N268N867K184k082
3964E862o26O047m37k192k491k378L116j608m642k394n033l38K223M353q25k600
3948c963O97k12J99J869k379P1K730M446K533q67l19M342j786l633K680k358k570
3931A480K093J560Q33j593l740j825J960L887j498l451P52P52k223K85J838q71
$$ plain form
4043 -683 -1627 -1333 923 389 -152 -290 -7266 -9161 -6529 -1727 5013 3787 2957 -1536 -2964 151 5135
4026 5135 3386 -2321 -1143 3714 2382 -3380 -5143 -3159 -82 3142 1303 -1710 -2168 -4656 -1726
4011 -1726 1078 5168 6862 -268 -4068 -3248 -3646 -5979 -4981 -1697 -4912 -7190 -8073 -8574 -8778 -2608
3995 -2608 2516 1387 -3225 -5676 -2965 2342 3859 608 -842 -2525 -4714 -3302 -1675 1967 2374
3980 2374 6242 1669 421 94 -813 3458 2970 1820 -3984 -7667 -7770 -5375 -107 5760 7944 5862
3964 5862 5236 11283 10846 8654 6163 3785 6901 5293 651 -1743 -6776 -7114 -4891 -538 -1363 -3963
3948 -3963 -3266 -3478 -3279 -1410 -3789 -3718 -988 3458 5991 5124 4805 9147 7361 3728 6408 4050 1480
3931 1480 3573 5133 5966 4373 633 -1192 768 4655 3157 -294 458 1210 -1013 -728 1110 239
3915B39j685l75n0J299N07o026o410K125O404N800J415k029k000L223J116J60
3899C713j942O82m72j108Q65J258Q71Q26J181J807j592o230l686k593j506L829
3883d097L283M37K868J800r15n591k149N14L924k63L051j6l070n011j946K18J196
3866e767N045M809R75K162j316N4j985J258j127L76j93n650J49j16N65M71l38
3849f28r8K134K641M10j493k998n881R5j624m60j24J757J240M758M757N65l059
3832A992n423J332j887o92K639O173k87k370k621j144o9k24k276P56K874L204
3816A977O82m265p78N36k367M1j021J690L051j848R92J334J574K613l351K003
3800B863L235k004k357j393K10j159j479j346J676P53k229n75N44N048M931Q68
$$ plain form
3915 239 -1446 -1821 -1871 -572 -65 -6091 -12501 -10376 -3972 1828 3243 1214 -786 2437 3553 3713
3899 3713 1771 2453 1981 873 1738 2996 3867 4693 5874 7681 6089 -141 -3827 -6420 -7926 -4097
3883 -4097 -814 -377 2491 4291 3376 -2215 -4364 -3850 74 -189 2862 2846 -224 -5235 -7181 -6963 -5767
3866 -5767 -722 4087 5062 7224 5908 5962 3977 5235 4108 4484 4291 -1359 -1210 -1326 -761 -290 -628
3849 -628 -726 1408 4049 4459 2966 -32 -5913 -5818 -7442 -7902 -8026 -6269 -5029 -271 4486 5051 1992
3832 1992 -3431 -2099 -3986 -4678 -2039 4134 3847 1477 -1144 -2288 -2357 -2581 -4857 -4101 -1227 1977
3816 1977 2659 -1606 -2384 -1848 -4215 -4174 -5195 -3505 -454 -2302 -1310 24 1598 4211 860 2863
3800 2863 6098 4094 1737 344 554 -605 -2084 -3430 -1754 -1001 -3230 -3805 -3261 1787 6718 7586
3784G586n186L450L689r51m41k55j996k669j404o756j792L226O612K374J020k159
3768D348j476m845k154K873k630j734n96Q73K804Q01N679J551k447l171R36m730
3752c918k02l030j501l57J222j226p98K508M620K55R85L933M231j567l413l417
3736a675L048K617q1l874J337j082R71O098M77j043k186k940K599j783j981l118
3720b616k822L796J806n06J467m247L481L683j959k419J234K457K248p66k2K47
3704E062p14j567K2L985m877l075n43j31K508m57K00K363K319j937l25j670J178
3687B341p33l171k27O162L084l281J678K708n819J21M56J162J120n815n503K613
3671c104K673J220n52o84P31K852L84J597J43m929j554K660M521M759l652l716
$$ plain form
3784 7586 2400 5850 9539 8588 8147 7892 5896 3227 1823 -4933 -6725 -3499 3113 5487 6507 4348
3768 4348 2872 -1973 -4127 -1254 -3884 -5618 -6214 -5341 -2537 -1736 3943 5494 3047 -124 812 -3918
3752 -3918 -4120 -7150 -8651 -9008 -7786 -9012 -9810 -7302 -2682 -2427 -1442 2491 6722 5155 1742 -1675
3736 -1675 1373 3990 3909 35 1372 290 1261 7359 7836 6793 4607 1667 4266 2483 502 -2616
3720 -2616 -5438 -1642 164 -342 1125 -3122 359 4042 2083 -336 898 3355 5603 4837 4815 5062
3704 5062 4348 2781 2803 6788 1911 -1164 -1707 -1838 670 213 413 2776 5095 3158 2833 1163 2341
3687 2341 1608 -1563 -1790 4372 7456 4175 5853 8561 2742 2863 3319 4481 5601 -214 -5717 -3104
3671 -3104 -431 789 237 -447 284 3136 3520 5117 5260 331 -1223 1437 5958 10717 7065 3349
3655C349L391k750m321L13M085K374n110k974L006L66K806L16R11n55k943k6j068
3638A170Oj215n99k677M03K664J3j014r1N082K2k189M42J369K101P094j411l430
3620G740k74m068n018k967J210p91K047J860Q79J159J925m309k135O90q60k573
3604e485K214R35J269k47j382L290N006k361J530L47J151l3M34l52m921l064r38
3587b607K74j35j371m49K93O18J603J329M274K993n582j732j34r24p25j349M81
3570c143J153L242L717J718j071l201O26J120k451j339q0N66l13J419R76j080
3554A859K020N05J188j664Q59j053n35j093q4N26p81j939M39m79K440o68m581
3537c041j139Q10L485J920K93K546l54R6p66j818k162r82L475L928R66j965m185
$$ plain form
3655 3349 6740 3990 -331 -18 4067 6441 1331 -1643 1363 1729 4535 4851 5762 5207 2264 2238 1170
3638 1170 1176 -39 -638 -3315 -2912 -248 -235 -1249 -1340 3742 3764 1575 2017 3386 5487 12581 11170 7740
3620 7740 7466 3398 -1620 -4587 -3377 -4168 -2121 -261 618 1777 3702 -607 -2742 -2052 -2912 -5485
3604 -5485 -3271 -2336 -1067 -1314 -2696 594 5600 3239 4769 5116 6267 6234 6668 6316 1395 -1669 -2607
3587 -2607 -2333 -2468 -3839 -4288 -3995 -3377 -1774 -445 3829 6822 1240 -492 -626 -1550 -2275 -3624 -3143
3570 -3143 -1990 1252 4969 6687 5616 2415 3041 4161 1710 371 291 857 544 1963 2939 1859
3554 1859 3879 4384 5572 3908 4767 3714 3179 2086 2002 2528 1747 -192 247 -232 2208 1540 -3041
3537 -3041 -4180 -3370 115 2035 2328 4874 4520 4616 3850 2032 -130 -1112 2363 6291 7257 5292 1107
3520A107n3M271k044l013M035L986l446l194K43K67O20K87J680l324r13j883K051
3503F77m159j912L327j17M483K204J354k42k087k238P53O79m44l831q45J656J326
3486E84k902P35l66j167Q42K565k900j565M536J865o34k301N41m01m32k078J336
3469a742K934j678J857L688j014l493r95k25r06k765j836L218m02R71K861J220
3453A693K531J115l912m866l150j373k920J590J363M502N967K425K647J472n588
3438C496n677O53L90j554J391k041P06k96k89K424j434r81N236M392J048j600
3422E864m61k99j16k300m734j835J865L402j08n02K66L223L755k453k499M62K536
3405F066L8k237L57k145k73R60K151m87l078r00J515j11k21j575j900k319P41
$$ plain form
3520 1107 1054 5325 3281 268 4303 8289 4843 1649 1892 2159 2779 3066 4746 1422 509 -1374 677
3503 677 -3482 -5394 -2067 -2184 2299 4503 5857 5615 3528 1290 2043 2722 2278 -1553 -2398 -742 584
3486 584 -2318 -1583 -1949 -3116 -2274 291 -2609 -4174 362 2227 1593 -708 -167 -568 -1000 -3078 -1742
3469 -1742 1192 -486 1371 5059 4045 552 -443 -668 -1574 -4339 -6175 -2957 -3359 -2388 473 1693
3453 1693 4224 5339 1427 -3439 -6589 -7962 -10882 -9292 -7929 -3427 2540 4965 7612 9084 3496
3438 3496 -2181 -1528 -1138 -2692 -1301 -3342 -2636 -2932 -3221 -797 -2231 -3212 2024 6416 7464 5864
3422 5864 5403 5104 4988 2688 -2046 -3881 -2016 1386 1278 776 1042 4265 8020 5567 3068 3530 6066
3405 6066 6104 3867 4224 2079 1806 2766 4917 4430 1352 452 1967 1856 1635 60 -1840 -4159 -3418
3388c418l096K04M353M197J677K937J173j370n769j46k298M44M184k79p20j474
3372E99p25K421J703j185J084K524kJ25q50m5J505j56m627k563J889LJ944L565
3354G209q17j838l195m497k991L081J804j479J381j771j5J713l00M003L652l402
3338B538k696K25L415J424l733m02K252n85m086M43R61M2K861J15J861j582m326
3321a273P00Q82J164Q24k806q50M914o49l127J235N95k666m45K580J581J013j08
3304C564j361k033M4j619Q26L61j088k437J220L097L232k799j460l5L466o16p49
3287A613R87p62l55M176K635m040j898k063l507K440K031l80L96j164J176K379
3271C664K369L3o57R17j994k137k64L98m065O98O673K377J190l360k3O0m195m309
$$ plain form
3388 -3418 -6514 -6310 -1957 2240 3917 6854 8027 6657 888 742 -1556 -1112 3072 2793 2073 599
3372 599 -126 2295 3998 2813 3897 6421 6419 6544 5694 5649 7154 6998 2371 -192 1697 1700 3644 7209
3354 7209 6392 4554 1359 -3138 -6129 -3048 -1244 -2723 -1342 -3113 -3128 -1415 -1715 2288 5940 2538
3338 2538 -158 67 3482 4906 1173 771 3023 2438 -1648 -1205 -244 -202 2659 2774 4635 3053 -1273
3321 -1273 -573 309 1473 2297 -509 -1359 3555 2906 -221 1014 1609 -1057 -1502 1078 2659 3672 3564
3304 3564 2203 170 214 -1405 -579 -218 -1306 -3743 -2523 574 3806 1007 -453 -488 2978 2362 1613
3287 1613 2600 1838 1483 5659 8294 4254 2356 293 -3214 -774 1257 877 1273 109 1285 3664
3271 3664 6033 6066 5409 6326 4332 2195 1931 2329 -1736 -1038 5635 8012 9202 5842 5819 5879 1684 -2625
3253b625k513N03K969K660m33j425K381M130r14l212l737Q69j335L480M534K550
3237G882j608l027n881P13L878j234J699R23k106k291j769O20r18j948j405j071
3221g543M02R63M38K895N750k278j443L663m41o70j573J678N5j963P8p8K119K171
3203D223k240q05r50k936K972K397l66r27O70K803Q62l941l185l059l838k196
3187a0516K551K373Q8L893N532l138j250O78M48J807J116J432o29P45q15n433
3171a118J585M216k31j306L819l675j250J548j146j466O54j533l696P623Q88j258
3155C654j870o35P38J272j470j752m664K787J900L274L705M20O16j30k201n483
3139A61l96n15k049j399k745k870K216J462j487J850R78N059M688j478j2K078
$$ plain form
3253 -2625 -5138 -4635 -1666 994 561 -864 1517 5647 4733 1521 -2216 -1347 -2682 798 5332 7882
3237 7882 6274 3247 -2634 -1921 1957 723 2422 3345 1239 -1052 -2821 -2201 -3119 -5067 -6472 -7543
3221 -7543 -7141 -6178 -5740 -2845 2905 627 -816 2847 2406 1736 163 1841 1896 -67 11 -67 2052 4223
3203 4223 1983 1178 228 -2708 264 2661 2295 1368 2038 4841 5703 1762 -1423 -4482 -8320 -10516
3187 -10516 -7965 -5592 -5504 -1611 3921 783 -467 211 659 2466 3582 5014 4385 5130 4315 -1118
3171 -1118 467 4683 4452 3146 6965 3290 2040 3588 2442 976 1630 97 -3599 4024 4912 3654
3155 3654 1784 1149 1887 3159 1689 -63 -4727 -1940 -40 3234 6939 7359 7975 7845 5644 161
3139 161 -235 -750 -2799 -4198 -6943 -9813 -7597 -6135 -7622 -5772 -4794 265 4953 3475 3463 5541
3123E541k282K83j016j368L088O079J017m654q361l783J45N015N789k127k484
3108H82m240l255L987L407p00l56L878M130o9j092m072O58j23o74J995J753l33
3091E776j162l182K284R14m001J598R96m132M93M59P66M634R99o54j818K013m694
3074A289N7j66L363j529k77K554j519l573j520j320m518K421K025J497J191J323
3058A298J520J865k828k900P23M575k5l49j795l249k725N41K044J680K206j744
3042H37L052P55L956M6n46j238k671M52m12l493P44m22L26k023J413J901k096
3025E81j118J086r83j895k983M326J083l200j33R53J357J406j524l597n955J513
3009i083P324n29j083K328N76m397K10L019J411r06J034K038J157j536j782K893
$$ plain form
3123 5541 3259 3542 2526 1158 4246 10325 11342 6688 -1673 -5456 -5311 -296 5493 3366 882
3108 882 -3358 -6613 -2626 781 81 -275 3603 7733 7664 6572 2500 3158 3035 2361 4356 6109 5776
3091 5776 4614 1432 3716 4630 629 2227 3223 -909 -416 43 809 5443 6442 5788 3970 5983 1289
3074 1289 1346 1180 4543 3014 2737 5291 3772 199 -1321 -2641 -7159 -4738 -2713 -1216 -25 1298
3058 1298 2818 4683 1855 -1045 -322 4253 4228 3879 2084 -1165 -3890 -3349 -1305 375 2581 837
3042 837 3889 4644 8600 8646 8100 6862 4191 4643 4231 738 1482 1060 1386 -637 776 2677 581
3025 581 -537 549 -434 -2329 -5312 -986 97 -3103 -3236 -2283 -926 480 -1044 -4641 -10596 -9083
3009 -9083 -1759 -2288 -3371 -1043 -467 -4864 -4654 -1635 -224 -1130 -96 1942 3099 1563 -219 2674
2993B674J030P80k704j907m30J511K18J569J174M86p15j530k736k25K126J085
2977B406O61n04k701M43l02K800K03l481K401L050j661j154k76J22J419j267J213
2960C372p12k848q49M980K568J25o15p71j013J271l480K073k098l334L057M956
2944F682R39j062J207j190k413m213O90J70J843J440J268K18j598k730l507k392
2928d648K65J354P841m85J86q86j249K713L226K047j862J76k571j320j545j210
2912B032j602j857k797k62M00K664J141K528O04J067j406k955J224n32J705M92
2896B446l473L855O26Q64L110P43Q67k159R29m968J941j408m991k25Q39k50j826
2879c080L782P772L968Q58K55r94m458j324j33l15m074m168n82n90j10k560J225
$$ plain form
2993 2674 3704 4484 1780 -127 -557 954 1172 2741 3915 4401 3686 2156 -580 -805 1321 2406
2977 2406 3067 2563 -138 305 3 2803 3006 -475 1926 4976 3315 2161 1885 2007 3426 2159 3372
2960 3372 2660 -188 -1037 3943 6511 6636 6021 5250 4237 5508 2028 4101 2003 -1331 1726 6682
2944 6682 7621 6559 7766 6576 4163 -50 640 810 2653 4093 5361 5579 3981 1251 -2256 -4648
2928 -4648 -4383 -3029 4812 4327 4513 3627 2378 5091 8317 10364 8502 8678 6107 4787 3242 2032
2912 2032 430 -1427 -4224 -4486 -4086 -1422 -281 2247 2851 3918 2512 -443 781 249 1954 2446
2896 2446 -1027 2828 3454 4318 7428 8171 9038 6879 7808 2840 4781 3373 -1618 -1843 -1004 -1254 -3080
2879 -3080 702 8474 12442 13300 13555 12561 8103 6779 6646 6331 2257 -1911 -2493 -3083 -3193 -5753 -4528
2862d528N971K599J209j916R78L120m888k388k541R22j089jL798j99L181k918
2846A310j41L62q62j571q23K666M524j822k384J550n00P44k336j525j052j270
2830c130P81M765l848j315K939M413J049j739m093k584J156N76L62M72J70q79
2814i05n45k299k090J354R07J78M012K786J042l138q057K630q23K83M588K820
2798B743M99Q67k038r73j585O478L296m021n114k134K01l8j114k55k699J796J200
2781b891j510n93n10P1J985K208M232N36m557j256J622L47R15m57K505M09k257
2764G99j673J79J769J014l225p05M69m727K43L547N417L262j993o79K042m44o06
2747D689P22j32O45m97k141j492o01j578j084J040k05j671r53L883l44J773J739
$$ plain form
2862 -4528 1443 4042 5251 3335 4313 7433 2545 157 -2384 -1462 -2551 -2552 1246 1047 4228 1310
2846 1310 1169 1531 669 -902 -1725 941 5465 3643 1259 2809 2309 3053 717 -808 -1860 -3130
2830 -3130 -2349 2416 -1432 -2747 192 4605 5654 3915 -178 -2762 -1606 -1030 -668 -196 -26 -905
2814 -905 -1450 -3749 -5839 -4485 -3578 -3400 612 3398 4440 1302 -6755 -4125 -4948 -4665 -77 2743
2798 2743 3242 4109 2071 1098 -487 5991 9287 5266 152 -1982 -1781 -1819 -2933 -3188 -5887 -4091 -2891
2781 -2891 -4401 -4994 -5504 -5433 -3448 -1240 2992 3528 -1029 -2285 -663 -316 599 142 2647 3056 799
2764 799 -874 -695 1074 2088 -1137 -1842 -1373 -6100 -5857 -2310 3107 6369 4376 3697 5739 5295 4689
2747 4689 5411 5279 5924 5427 3286 1794 1193 -385 -1469 -429 -634 -2305 -3258 625 281 2054 3793
2730C793R55j853l7k039J85n75K308k365m512R74p36J102L574K075j207k310l41
2713a009K44M32N241L285N58j293k187m345J51k387k714l333j27L327N68J396
2697b193N251L362m412l114p64J263r95l328l121J083N461K706M22M458K195m458
2681C816l251J571J676K694j198k058k846k889n79k728n41r50L034K312k781j946
2665f664N03l207L440M651K461j011P66J529j018O99k251RJ837j05j693J156j324
2648b22J250N77O31k64m000l167k62j40q79O034K67J058M87j0Q5j97r34j732j826
2629c244k901R98K905q79k580Q31J252L425N58k56j150k573K886l563j73K648
2613a816j074n70K800K003L752m943j65j441L824J173k517j324N125K077k165
$$ plain form
2730 3793 4748 2895 2858 819 1004 429 2737 372 -4140 -3166 -3902 -2800 774 2849 1642 -668 -1009
2713 -1009 -765 -333 4908 8193 8751 7458 5271 926 1077 -1310 -4024 -7357 -7484 -4157 -3589 -2193
2697 -2193 3058 6420 2008 -1106 -1870 -607 -1602 -4930 -8051 -6968 -1507 1199 1621 6079 8274 3816
2681 3816 565 2136 3812 6506 5308 3250 404 -2485 -3064 -5792 -6333 -7283 -4249 -1937 -4718 -6664
2665 -6664 -6161 -9368 -5928 -1277 1184 173 939 2468 1450 2149 -102 -93 1744 1639 -54 1102 -222
2648 -222 1028 1605 2236 1972 -2028 -5195 -5457 -5597 -6476 -442 -175 883 1370 1360 1445 1248 314 -1418 -3244
2629 -3244 -6145 -5147 -2242 -3121 -5701 -4870 -3618 -193 365 109 -1041 -3614 -728 -4291 -4464 -1816
2613 -1816 -2890 -3460 -660 1343 5095 152 -13 -1454 2370 3543 1026 -298 4827 6904 4739
2598D739k867Q5L467j588l79p54m16L135p95K061j022l998j781k586L538j826
2582i87k020j75M14J564K444L641q14j243Q40k388k600L934L220P66J477l858
2566D215q037J241L318m840k422j190K218M010R59l377l922j644K849K803J674
2551b145N082M677ln494j811k300M14j497j315Q1J617M87K838J124o87J171l663
2534a424l89P73K156l24k269J028K836l067k2p98l597N36J05J395K21J789K153
2517A102RJ241j857o23L205m49n913m00j16k41q21l294L003L954L830M27j219
2500A838J936k309l057o74K161o71J440J08j643J939j528j353j502K616j987K71
2484b415l15J177j525k938k611Q344L683k325J085k094m367N94K668J069M984
$$ plain form
2598 4739 1872 1957 5424 3836 3457 2703 2287 5422 4627 6688 5666 1668 -113 -2699 839 -987
2582 -987 -3007 -3182 -2768 -1204 1240 4881 4067 2824 3664 1276 -1324 2610 5830 6596 8073 4215
2566 4215 -3822 -2581 737 -4103 -6525 -7715 -5497 -1487 -528 -3905 -7827 -9471 -6622 -3819 -2145
2551 -2145 2937 7614 7611 2117 306 -1994 -1580 -3077 -4392 -4311 -2694 -2207 631 1755 1068 2239 -1424
2534 -1424 -1813 -1040 1116 792 -1477 -449 2387 -680 -702 -1500 -5097 -4561 -4456 -3061 -2840 -1051 1102
2517 1102 1111 2352 495 -128 3077 2628 -3285 -3685 -3801 -4042 -4863 -8157 -5154 -1200 2630 3057 1838
2500 1838 3774 1465 -1592 -2266 -105 -776 664 772 -871 1068 -460 -1813 -3315 -699 -2686 -2415
2484 -2415 -2730 -1553 -3078 -6016 -8627 -283 3400 1075 2160 66 -4301 -3707 -1039 30 5014
2469E014l03k994j441J703k19j231k450L855l096k533k791K029L055J843R83P78
2453B202M45K168J134j387k655r12o650m504J162J159L537L589k95Q07j60n51
2437i11l016l372K958L503j597O86M087r28n050n15k095L643j582J574L144M02
2421I31j434n99R50K582p83l367k988K423J255K105R71n068K011M905R92k264
2405B622q16J776K990l201n411K844n18K790J599k809k29k351j894J04o2k396
2389d962P81L126K635r94L351J481P52M28n745o759k695L684J659M781p07k873
2373b057L0k182N24K717N382K18m164K540L030q15O08j472p81j96n60k157R62
2356A627L033j394j749r1L062l13q24J051L556j794j176K9k916l244l133Q76K850
$$ plain form
2469 5014 4711 1717 276 1979 1760 529 -1921 1934 -1162 -3695 -6486 -4457 -1402 441 1424 2202
2453 2202 2647 4815 5949 4562 1907 995 -5655 -10159 -8997 -7838 -4301 -712 -1007 -200 -360 -911
2437 -911 -3927 -7299 -4341 -838 -2435 -1749 2338 1410 -3640 -4155 -6250 -2607 -4189 -2615 529 931
2421 931 -503 -1102 -152 2430 1647 -1720 -4708 -2285 -1030 1075 2046 -3022 -1011 3894 4886 2622
2405 2622 1806 3582 6572 3371 -2040 804 286 3076 4675 1866 1637 -714 -2608 -2504 -2566 -4962
2389 -4962 -4181 -1055 1580 586 3937 5418 6170 6598 853 -5906 -8601 -4917 -3258 1523 816 -2057
2373 -2057 -2027 -4209 -3685 -968 4414 4632 468 3008 6038 5223 5831 4359 3578 3382 2822 665 1627
2356 1627 4660 3266 1517 1426 4488 4175 3351 4402 7958 6164 4988 5017 2101 -1143 -4276 -3400 -550
2339e50o86K08j585j844J021n09P65L070K849Q63J670pl180j631j086M82j566
2322a716k053L24M296R18J037l107k298n09K685L019j92l9j932L70J293m165r69
2305c038M073L016j501j928M62j971k983J16K338J297j968j497N24L503k482q81
2289b920q73j161k923j184j155M48O854K465M0L531O60l903l48J043J608k746
2273e64n483n76K914L235k667l549O345L780l132k201K458N96j827j696L016L318
2257C967j082k011q08J299k95R9L00r57K502J347r19k764K102j000k984j911L412
2240B97K25l089k4M356l533k232J491N607J612k611k562N153P73k832K073M36
2224E140m647J283O17J212m951n853J335M562J109J817K586p47m799Q11K670r04
$$ plain form
2339 -550 -1236 -1028 -2613 -4457 -3436 -3945 -3180 -110 2739 3602 5272 5265 2085 454 -632 -150 -1716
2322 -1716 -3769 -3445 851 1769 2806 -301 -2599 -3108 -423 2596 2404 2365 433 803 2096 -2069 -3038
2305 -3038 1035 4051 2550 622 1084 -887 -3870 -3754 -1416 -119 -2087 -3584 -3060 443 -2039 -2920
2289 -2920 -3793 -4954 -7877 -9061 -10216 -9768 -2914 -449 -409 3122 3782 -121 -469 574 2182 -564
2273 -564 -6047 -6623 -3709 -474 -3141 -6690 -345 3435 303 -1898 560 1156 -671 -2367 649 3967
2257 3967 2885 874 66 1365 1070 1169 1469 512 3014 4361 3442 678 2780 1780 -1204 -3115 297
2240 297 522 -2567 -2591 1765 -1768 -4000 -2509 3098 4710 2099 -463 4690 5463 2631 4704 5140
2224 5140 493 1776 2393 3605 -1346 -7199 -5864 -1302 -193 1624 4210 3463 -1336 -525 2145 1241
2208A241O56L03M359J176l164l787l54J641r26j633l59J003M38M47q88P57J70
2191A080j612K770J050J749k698r54O93k203l278K537k9j168Q08M74M277n44l364
2174d12j974K189K302j167j312k722j351N73n63k99J371n02j577k929o03M951
2158d025L020L53L055K823n700r64j45j24k440R40K128K893M110m542m764l387
2142f769J40M629L398J418k195k068q32K028L421M42j436k963K310l44j850O21
2126e0M55K036J867l73N13k588j563j302O292K583l616l590J969j182j817K768
2110B402P66K875k977n437l814L711M172L883L568k80j322K94p99j154R3N75m919
2093A637j676Q94J926k37j474j378m822M381L560k9n75P19J608j224l838j486
$$ plain form
2208 1241 1897 2200 6559 7735 4571 784 430 2071 1145 -488 -847 156 594 1041 153 910 1080
2191 1080 -532 2238 3288 5037 2339 1385 2078 -125 -3403 -866 -895 -2063 -1255 -781 3496 2952 -412
2174 -412 -2386 -197 2105 938 -374 -3096 -4447 -3874 -4437 -4736 -3365 -3867 -5444 -8373 -8976 -4025
2158 -4025 -1005 -652 2403 5226 -474 -1438 -1583 -1707 -4147 -3207 -1079 1814 5924 1382 -3382 -6769
2142 -6769 -6629 -2000 1398 2816 621 -1447 -2279 -251 3170 3612 2176 -787 1523 1179 -671 -50
2126 -50 405 2441 4308 3935 4448 1860 297 -1005 5287 7870 4254 664 2633 1451 -366 2402
2110 2402 3168 6043 3066 -2371 -6185 -2474 1698 5581 9149 8869 7547 7841 7042 5888 5981 6556 1637
2093 1637 -39 855 2781 2544 1070 -308 -5130 -749 2811 2782 2207 2926 4534 3310 -528 -2014
2077b014M2K266P99j358j005j327K397O117q16k89K64j110J299k362n192R52j182
2060b519J608k173K027m1k672J366j073q04M695q10l89K078J30k389l034J458
2044b542J853n18l173J820Q85K972L796N437P9n051p268k430L030K772J969k923
2028G08n099l99L173L329l341j275o70L52n75L042N590k069k32L53m024m158J546
2011c749j361j742K262O411K784k695n13N01j806l113p48J713K352J22Q21k839
1995a600p18L697K842m129J617l78j501n5N26j824m49j089M180K766l644j037
1979g96k117j925j597J364L663J142j253j158N263l421l744M58J061K321J638
1964H99K189J92n282k753K149L961j123J100k264l438K26N21J51j6J021J057L897
$$ plain form
2077 -2014 -1972 294 1093 -265 -1270 -2597 -200 5917 5101 4812 5076 3966 5265 2903 -2289 -1337 -2519
2060 -2519 -911 -3084 -1057 -1098 -3770 -2404 -3477 -4281 414 -396 -785 1293 1423 -966 -4000 -2542
2044 -2542 -689 -1207 -4380 -2560 -1675 1297 5093 10530 10609 5558 -1710 -4140 -1110 1662 3631 708
2028 708 -4391 -4790 -1617 1712 -1629 -2904 -3574 -3222 -3797 -755 4835 2766 2534 2887 -1137 -5295 -3749
2011 -3749 -5110 -6852 -4590 1821 4605 1910 1397 1898 92 -3021 -3769 -2056 296 418 1239 -1600
1995 -1600 -2318 1379 4221 92 1709 1331 -170 -225 301 -1523 -1972 -3061 1119 3885 241 -796
1979 -796 -2913 -4838 -6435 -5071 -1408 -266 -1519 -2677 2586 -835 -4579 -4121 -3060 -739 899
1964 899 3088 3280 -2002 -4755 -2606 1355 232 1332 -932 -4370 -4144 -3623 -3472 -3488 -2467 -1410 2487
1947B487R64k041j563j287k590L39L846K931J445k00J885k267k378M71k17n49
1931A276K614K421k855o63l258j12L997K375l216l474j990K816N4k83L180j471
1915A411l115K321K580L230j434n525j269k761K253K245j184m166L490R28p15
1900a711q70j027N19p40k054j692K443M510N511M03p62J406j906j844r67Q11J70
1883B200K274l158k215k501Q59J036j369m83J205r59J083R17j833j066J775L716
1867A481J286j689M92j837l942k622M61Q07K289M75J676m93l09j076l672K61K008
1850d404J14J251m800j803J247K695O92N619M821j057l705j890L79R09N056j063
1834D061l255L88K256P22J151q25m079J71P55L30L73K030m439p01J400L143k86
$$ plain form
1947 2487 3451 1410 -153 -1440 -4030 -3691 155 3086 4531 4331 6216 3949 1571 2042 1825 1276
1931 1276 3890 6311 3456 2793 -465 -577 3420 5795 2579 -895 -2885 -69 -15 -298 2882 1411
1915 1411 -1704 617 3197 6427 4993 -532 -1801 -4562 -2309 -64 -1248 -5414 -1924 -996 -1711
1900 -1711 -2581 -3608 -3089 -3829 -5883 -7575 -5132 -622 4889 5292 4530 5936 4030 2186 1219 2030 2200
1883 2200 4474 1316 -899 -3400 -2541 -1505 -2874 -3357 -2152 -3111 -2028 -1111 -2944 -4010 -2235 1481
1867 1481 2767 1078 1570 -267 -4209 -6831 -6370 -5563 -3274 -2799 -1123 -1616 -1925 -3001 -6673 -6412 -4404
1850 -4404 -4290 -3039 -7839 -9642 -8395 -5700 -5008 611 5432 4375 670 -1220 -841 68 5124 4061
1834 4061 806 1194 3450 4172 5323 4498 419 590 1345 1675 2048 4078 -361 -1062 338 3481 3195
1817C195j247K399k24j343J689l00k30k194j503l090p72o89L40J491O75J509K326
1800B032k566j829K473Q81k410K859M182N74N11l112l240L38j38R46J746j448
1784A799K36j96k8L36l929n364L225K620J715J250J945l314j814j861j405L877
1768i08J032j292L246p2j084k49L64j379j385J663q25k29J74J44M47L600j590
1751A657O00K915j255l209j133J259J049K934O04Q02m85l796m773J458J682j502
1735a193j76K029J247j729K028k786K521j305r51L456k65l085m749m3M805J764
1719A568l86k621L108J551k509l009J036M081j379k32o54l069Q71L525L085L437
1703H403n484l616j57R13r98J347M02k398J256K947K023Q77R09J035L985k132
$$ plain form
1817 3195 1948 4347 4123 2780 4469 4169 3939 1745 242 -2848 -3620 -4309 -3969 -2478 -1803 -294 2032
1800 2032 -534 -2363 110 991 -1419 1440 5622 6196 6707 3595 355 693 555 1501 3247 1799
1784 1799 2035 1839 1811 2147 -1782 -7146 -3921 -1301 414 1664 3609 295 -1519 -3380 -4785 -908
1768 -908 124 -1168 2078 2006 922 673 1037 -342 -1727 -64 -889 -1118 -944 -800 -353 3247 1657
1751 1657 2257 5172 3917 708 -425 834 1883 4817 5421 6223 5738 1942 -2831 -1373 309 -1193
1735 -1193 -1369 660 1907 178 2206 -580 1941 636 -315 3141 2876 -209 -4958 -5001 -196 1568
1719 1568 1182 -1439 1669 3220 711 -2298 -1262 2819 1440 1208 554 -2515 -1644 1881 4966 8403
1703 8403 2919 -697 -854 59 -939 408 810 -1588 -332 2615 4638 5515 6424 7459 11444 9312
1687I312m460m629L92K116j283J071k499l907J099L452m080q58L895K759j596
1672G84J808J754o22n759J078L681J533k905K475q14q88j278j960L66k20J187
1656B20m22r99Q72J265K094n889o15M658K003q77o39j886q54R83p71j226j125
1639c208K372j348J775M307n32l970j09M101p87j187j453q16j387K791J279l099
1623a271L22J796J654j00k58O51j309l53L244r70m343j223m124o15J709L367j291
1606c114N97o6k735r64p72l074K231j999K299L962K83O85o64k445n77q26L229
1589c950L281j888r21N77p18J005m70l148l822J379O346L672Q5n33m843p99l162
1572g909O4J606M972R16L290m38k5l86p323O59P432J553j424L81j481K45J846
$$ plain form
1687 9312 4852 223 615 2731 1448 2519 20 -3887 -2788 664 -3416 -4274 -379 2380 784
1672 784 2592 4346 3724 -2035 -957 2724 4257 1352 3827 3013 2125 847 -1113 -747 -967 220
1656 220 -202 -1201 -329 936 3030 -2859 -3474 1184 3187 2310 1671 -215 -1069 -86 -857 -2083 -3208
1639 -3208 -836 -2184 -409 3898 3366 -604 -713 3388 2601 1414 -39 -855 -2242 549 1828 -1271
1623 -1271 -949 847 2501 2401 2143 2794 1485 1132 4376 3406 -937 -2160 -6284 -6899 -5190 -1823 -3114
1606 -3114 -2517 -2583 -5318 -6282 -7054 -10128 -7897 -9896 -7597 -3635 -3352 -2667 -3331 -5776 -6353 -7179 -3950
1589 -3950 -669 -2557 -3478 -2901 -3619 -2614 -3084 -6232 -10054 -8675 -2329 1343 1428 895 -3948 -4747 -7909
1572 -7909 -7845 -6239 -1267 -351 2939 2501 2476 2090 -5233 -4574 2858 4411 2987 3368 1887 2132 3978
1555C978k151J614M4k848M694K643o28m778k249J334J910j615k701k37Q57J378
1539A245k480q96q70k593j505K663J673o94J835L043j755j810K41j443J38L725
1523E17p58l559j606L214K385J62m862j817O53J135k031l25M999J721k02p97j408
1506b579K72L546K6o92J868m549k465k773K487L801K784N57p27K547j047n21p65
1489A770K61M317Q20j316j555n450j563K047J018L67J139O8m511o138J850L154
1473c722j137K726L3M6M190K472j923k372J330K27n15K195K485k058m342k183
1457b548l21K326l366K388M955r40J491J042J215j950m544l713L00K488J816k467
1441a828q22j406j387O96k728j277L144K366N80R31k208q93J034N70r55m387R81
$$ plain form
1555 3978 1827 3441 3485 637 5331 7974 7346 2568 319 1653 3563 1948 -753 -990 -133 1245
1539 1245 -1235 -2131 -3001 -5594 -7099 -4436 -2763 -3457 -1622 1421 -334 -2144 -1903 -3346 -3208 517
1523 517 -241 -3800 -5406 -2192 193 355 -4507 -6324 -5671 -4536 -6567 -6892 -1893 -172 -374 -1171 -2579
1506 -2579 -2307 1239 1265 573 2441 -2108 -4573 -7346 -4859 -1058 1726 2283 1556 4103 3056 2535 1770
1489 1770 2031 6348 7168 5852 4297 -1153 -2716 -669 349 716 1855 1923 -2588 -8726 -6876 -3722
1473 -3722 -4859 -2133 -2100 -2054 2136 4608 2685 313 1643 1870 1355 3550 6035 3977 -365 -2548
1457 -2548 -2869 -543 -3909 -1521 3434 2494 3985 5027 6242 4292 -252 -3965 -3665 -1177 639 -1828
1441 -1828 -2650 -4056 -5443 -4747 -7475 -8752 -5608 -3242 -2662 -1731 -3939 -4832 -3798 -3228 -4183 -8570 -7589
1424g589M839O354m977q96r24J232M871J874k772K36O70j709K345j162j947J630
1408B075J234j19j531j210k655M067O024m184m115m91J087j690J099j936k08l
1392b556J97O90M94J290m20L73J110l178l697l33M43J859K346K234Q55K68k945
1375i70K147J939J216l063J666K893m243m424k553M017N14J923j526K94K935L127
1359E892J907j882j321l298m367j616k731q49K578L210K951o22l833J365L92q40
1343c064R97L446M407j79k548J521L189p41q36L25J20j690m258l055J420K3R08
1326a5J440m24j814j345k153J710L751J851L627r89m310m948J579J644r27k674
1310c997l466n79L539K284j76l152k591L749M401J576j447j124l02j948L528K627
$$ plain form
1424 -7589 -2750 3604 -1373 -2269 -3193 -1961 2910 4784 2012 2248 2918 1209 3554 2392 445 2075
1408 2075 3309 3190 1659 449 -2206 1861 7885 3701 -414 -905 182 -1508 -409 -2345 -2553 -2556
1392 -2556 -2359 -1669 -1175 115 -305 68 1178 -2000 -5697 -6030 -5587 -3728 -1382 852 1707 1975 -970
1375 -970 1177 3116 4332 1269 2935 5828 1585 -2839 -5392 -1375 -861 1062 -464 -170 2765 5892
1359 5892 7799 5917 4596 1298 -3069 -4685 -7416 -8265 -5687 -2477 474 -148 -3981 -2616 -2224 -3064
1343 -3064 -2067 1379 5786 5607 3059 4580 7769 7028 6192 6517 6637 4947 689 -2366 -946 -923 -15
1326 -15 1425 1001 -813 -2158 -4311 -2601 1150 3001 6628 5639 1329 -3619 -2040 -396 -1323 -3997
1310 -3997 -7463 -8042 -4503 -2219 -2395 -5547 -8138 -4389 12 1588 141 -983 -1285 -3233 295 2922
1294B922O04l214k755j054L035L840K800K288j853l295J741K349j672l513j168
1279A055n9K29K244n6o552j301J159P833j219k754M80j092l233l25K756J534m5
1262F54K171l004j927j716K724K788J48K309k059l587j598Q01j572J3L298J246
1246F89k782k281O29K798O47K639P09k90l568n546j512L679M80q86r86J32O30
1229d819q99n92k95j019j897P09J867l82M35O712O68j855j696Q03L172j743J004
1212A73J095K503Q21m840n569j313j731K506J421J789K995J273P10J59j89j494
1196C09k940j386M6R49j463j553j698L043j960m23M011L946j242k766k583Q65
$$ plain form
1294 2922 3526 312 -2443 -3497 -462 3378 6178 8466 6613 3318 5059 7408 5736 2223 1055
1279 1055 996 1225 3469 3413 -3139 -4440 -3281 4552 3333 579 1059 -33 -3266 -3591 -835 699 654
1262 654 2825 -179 -2106 -3822 -1098 1690 1838 4147 2088 -1499 -3097 -2296 -3868 -3855 -557 689
1246 689 -2093 -4374 -3745 -947 -300 2339 3048 2758 -810 -6356 -7868 -4189 -3709 -4595 -5581 -5449 -4819
1229 -4819 -5718 -6310 -6605 -7624 -9521 -8812 -6945 -7327 -6892 -180 488 -1367 -3063 -2260 912 -831 173
1212 173 1268 3771 4592 -248 -5817 -7130 -8861 -6355 -4934 -3145 -150 1123 1833 1992 1803 309
1196 309 -2631 -4017 -3971 -3022 -4485 -6038 -7736 -4693 -6653 -7076 -3065 881 -361 -3127 -5710 -4845
$$ [...]
##END NTUPLES=NMR SPECTRUM
##END=
