##TITLE=Analysis number 318947
Compound Code ac 34762
Project Code adrs
Chemist Name acros
##JCAMPDX= 6.0         $$ Bruker NMR JCAMP-DX V2.0
##DATA TYPE= NMR SPECTRUM
##DATA CLASS= NTUPLES
##ORIGIN= Bruker BioSpin GmbH
##OWNER= nmr
$$ XWIN-NMR		Version 3.5
$$ Tue Apr 25 14:59:31 2006 GMT Daylight Time (UT+1h)  MAYBRIDGE\nmr@NMR_250MHZ
##.OBSERVE FREQUENCY= 250.131544655141
##.OBSERVE NUCLEUS= ^1H
##.ACQUISITION MODE= SIMULTANEOUS (DQD)
##.ACQUISITION SCHEME= undefined
##.AVERAGES= 16
##.DIGITISER RES= 18
##SPECTROMETER/DATA SYSTEM= dpx250
##.PULSE SEQUENCE= zg30
##.SOLVENT NAME= DMSO
##.SHIFT REFERENCE= (INTERNAL, DMSO, 0, 16.522)
##AUDIT TRAIL= $$ (NUMBER, WHEN, WHO, WHERE, WHAT)
$$ ##TITLE= Audit trail, XWIN-NMR		Version 3.5
$$ ##JCAMPDX= 5.01
$$ ##ORIGIN= Bruker BioSpin GmbH
$$ ##OWNER= nmr
$$ C:\u/data/dgb/nmr/ADRS/3100/pdata/1/auditp.txt
$$ ##AUDIT TRAIL=  $$ (NUMBER, WHEN, WHO, WHERE, WHAT)
(   1,<2006-04-25 14:59:00.03 +100>,<MAYBRIDGE\nmr>,<NMR_250MHZ>,
      <created by zg, POWCHK disabled, PULCHK disabled
       configuration hash MD5:
       84 BC 41 DB A1 6E 1D 46 DA 25 12 A5 C1 ED C5 3A
       data hash MD5: 64K
       61 58 F5 57 FC 47 0A B7 56 61 19 C3 BE 6F D6 C6>)
(   2,<2006-04-25 14:59:18.17 +100>,<MAYBRIDGE\nmr>,<NMR_250MHZ>,
      <Start of raw data processing
       ef LB = 0.3 FT_mod = 6 PKNL = 1 SI = 32K 
       data hash MD5: 32K
       EF F4 CE B4 EB 00 71 CF 81 2F 78 77 AC F5 F6 7B>)
(   3,<2006-04-25 14:59:20.05 +100>,<MAYBRIDGE\nmr>,<NMR_250MHZ>,
      <apk 
       data hash MD5: 32K
       0D D2 38 07 53 71 E4 17 16 0E B0 69 8A 09 F9 0A>)
(   4,<2006-04-25 14:59:20.76 +100>,<MAYBRIDGE\nmr>,<NMR_250MHZ>,
      <abs ABSG = 5 
       data hash MD5: 32K
       50 CC EA 57 F8 4A 32 37 0F 96 69 83 66 24 25 B3>)
$$ ##END=
$$ 
$$ hash MD5
$$ 8A 7B B9 83 4E 54 02 F3 93 9B 25 49 EA B9 82 36
##$RELAX= 
##$RELAX= 
##$RELAX= 
##$RELAX= 
##$RELAX= 
##$RELAX= 
##$RELAX= 
$$ Bruker specific parameters
$$ --------------------------
##$DU= <C:\u>
##$EXPNO= 3100
##$NAME= <ADRS>
##$PROCNO= 1
##$TYPE= <nmr>
##$USER= <dgb>
##$AMP= (0..31)
100 100 100 100 100 100 100 100 100 100 100 100 100 100 100 100 100 100 
100 100 100 100 100 100 100 100 100 100 100 100 100 100 
##$AQSEQ= 0
##$AQ_mod= 3
##$AUNM= <au_zg>
##$AUTOPOS= <47 >
##$BF1= 250.13
##$BF2= 250.13
##$BF3= 250.13
##$BF4= 250.13
##$BF5= 500.13
##$BF6= 500.13
##$BF7= 500.13
##$BF8= 500.13
##$BYTORDA= 1
##$CFDGTYP= 0
##$CFRGTYP= 5
##$CHEMSTR= <none>
##$CNST= (0..31)
1 1 145 1 1 1 1 1 1 1 1 1 1 1 1 1 1 1 1 1 1 1 1 1 1 1 1 1 1 1 1 1 
##$CPDPRG= <>
##$CPDPRG1= <>
##$CPDPRG2= <>
##$CPDPRG3= <>
##$CPDPRG4= <mlev>
##$CPDPRG5= <mlev>
##$CPDPRG6= <mlev>
##$CPDPRG7= <mlev>
##$CPDPRG8= <mlev>
##$CPDPRGB= <>
##$CPDPRGT= <>
##$D= (0..31)
0 1 0 0 0 0 0 0 0 0.06 0 0 0 0 0 0 0.0002 0 0 0 0 0 0 0 0 0 0 0 0 0 0 
0 
##$DATE= 1145973539
##$DBL= (0..7)
120 120 120 120 120 120 120 120 
##$DBP= (0..7)
150 150 150 150 150 150 150 150 
##$DBP07= 0
##$DBPNAM0= <>
##$DBPNAM1= <>
##$DBPNAM2= <>
##$DBPNAM3= <>
$$ [...]
##$SUBNAM7= <"">
##$SUBNAM8= <"">
##$SUBNAM9= <"">
##$SW= 20.6930455092707
##$SWIBOX= (0..15)
0 0 3 0 0 0 0 0 0 0 0 0 0 0 0 0 
##$SW_h= 5175.983436853
##$TD= 65536
##$TD0= 1
##$TE= 295.16
##$TE2= 300
##$TE3= 300
##$TEG= 300
##$TL= (0..7)
0 120 120 120 120 120 120 120 
##$TP= (0..7)
150 150 150 150 150 150 150 150 
##$TP07= 0
##$TPNAME0= <>
##$TPNAME1= <>
##$TPNAME2= <>
##$TPNAME3= <>
##$TPNAME4= <>
##$TPNAME5= <>
##$TPNAME6= <>
##$TPNAME7= <>
##$TPOAL= (0..7)
0.5 0.5 0.5 0.5 0.5 0.5 0.5 0.5 
##$TPOFFS= (0..7)
0 0 0 0 0 0 0 0 
##$TUNHIN= 0
##$TUNHOUT= 0
##$TUNXOUT= 0
##$USERA1= <user>
##$USERA2= <user>
##$USERA3= <user>
##$USERA4= <user>
##$USERA5= <user>
##$V9= 5
##$VALIST= <valist>
##$VCLIST= <CCCCCCCCCCCCCCC>
##$VD= 0
##$VDLIST= <DDDDDDDDDDDDDDD>
##$VPLIST= <PPPPPPPPPPPPPPP>
##$VTLIST= <TTTTTTTTTTTTTTT>
##$WBST= 1024
##$WBSW= 4
##$XGAIN= (0..3)
0 0 0 0 
##$XL= 0
##$YL= 0
##$YMAX_a= 283995
##$YMIN_a= -422998
##$ZGOPTNS= <>
##$ZL1= 120
##$ZL2= 120
##$ZL3= 120
##$ZL4= 120
##$ABSF1= 16.522
##$ABSF2= -4.171173
##$ABSG= 5
##$ABSL= 3
##$ALPHA= 0
##$AQORDER= 0
##$ASSFAC= 0
##$ASSFACI= 0
##$ASSFACX= 0
##$ASSWID= 0
##$AUNMP= <proc_1d>
##$AZFE= 0.1
##$AZFW= 0.1
##$BCFW= 0
##$BC_mod= 0
##$BYTORDP= 0
##$COROFFS= 0
##$CY= 12.5
##$DATMOD= 1
##$DC= 0
##$DFILT= <>
##$DTYPP= 0
##$F1P= 14.0000005364418
##$F2P= -0.99999901652339
##$FCOR= 0.5
##$FTSIZE= 32768
##$FT_mod= 6
##$GAMMA= 0
##$GB= 0
##$INTBC= 1
##$INTSCL= 1
##$ISEN= 128
##$LB= 0.3
##$LEV0= 0
##$LPBIN= 0
##$MAXI= 10000
##$MC2= 0
##$MEAN= 0
##$ME_mod= 0
##$MI= 0
##$NCOEF= 0
##$NC_proc= -5
##$NLEV= 6
##$NOISF1= 0
##$NOISF2= 0
##$NSP= 0
##$NTH_PI= 0
##$NZP= 0
##$OFFSET= 16.522
##$PC= 1
##$PHC0= 160.1524
##$PHC1= 8.08936
##$PH_mod= 1
##$PKNL= yes
##$PPARMOD= 0
##$PSCAL= 4
##$PSIGN= 0
##$REVERSE= no
##$SF= 250.13
##$SI= 32768
##$SIGF1= 0
##$SIGF2= 0
##$SINO= 400
##$SIOLD= 32768
##$SREGLST= <1H.DMSO>
##$SSB= 0
##$STSI= 32768
##$STSR= 0
##$SW_p= 5175.98343685301
##$SYMM= 0
##$S_DEV= 0
##$TDeff= 65536
##$TDoff= 0
##$TI= <Analysis number 999999
Compound Code 99
Book Reference 9
Project Code 9>
##$TILT= no
##$TM1= 0
##$TM2= 0
##$TOPLEV= 0
##$USERP1= <user>
##$USERP2= <user>
##$USERP3= <user>
##$USERP4= <user>
##$USERP5= <user>
##$WDW= 1
##$XDIM= 32768
##$YMAX_p= 414618583
##$YMIN_p= -1027383
$$ End of Bruker specific parameters
$$ ---------------------------------
##NTUPLES= NMR SPECTRUM
##VAR_NAME=  FREQUENCY,     SPECTRUM/REAL,   SPECTRUM/IMAG
##SYMBOL=    X,             R,               I
##VAR_TYPE=  INDEPENDENT,   DEPENDENT,       DEPENDENT
##VAR_FORM=  AFFN,          ASDF,            ASDF
##VAR_DIM=   32768,         32768,           32768
##UNITS=     HZ,            ARBITRARY UNITS, ARBITRARY UNITS
##FACTOR=    0.157963299565203, 1,           1
##FIRST=     4132.6476996994, 0,             0
##LAST=      -1043.33573715361, 0,           0
##MIN=       -1043.33573715361, -1027383,    0
##MAX=       4132.6476996994, 414618583,     0
$$ Real data points
##PAGE= N=1
##DATA TABLE= (X++(R..R)), XYDATA
$$ [...]
15563C90853k84467k01211j95312L350M2767j15531j50687K02562K93943j9053
$$ 390853 106386 -94825 -290137 -286787 -244020 -359551 -510238 -307676 -13733 -32786
15553c2786q0392j17189J91806K11320J36734M329j50412r3012M9929J24782j90187
$$ -32786 -113178 -230367 -38561 172759 309493 313822 163410 70398 120327 245109 54922
15542E4922j4718M6353j91181k76727J55350O0800l09868j60995K25573K06105
$$ 54922 40204 86557 -104624 -381351 -226001 -165201 -475069 -636064 -410491 -204386
15532b04386R7031o8620j24054K1846N4075R1611j14337o466J80341J42232k0364
$$ -204386 -107355 -175975 -300029 -278183 -224108 -132497 -246834 -253300 -72959 69273 48909
15521D8909k16746j47028q615P2733J31893O4986K1017n4707r4843j11771N0386
$$ 48909 -167837 -314865 -323480 -250747 -118854 -53868 -32851 -87558 -182401 -294172 -243786
15510b43786K32994L5285K59016L1096l34084k67407J76564R3128O4375Q633k1414
$$ -243786 -10792 24493 283509 314605 -19479 -286886 -110322 -17194 47181 55814 34400
15499C4400j66584L5163O8692l710M940J17646J7353k40999k02553L5173K61611
$$ 34400 -132184 -97021 -28329 -32039 -27099 90547 107900 -133099 -335652 -300479 -38868
15488c8868N8147j96541j4244J63896N4864k14647j88816J69785k7547q5418j75964
$$ -38868 19279 -177262 -191506 -27610 27254 -187393 -376209 -206424 -233971 -319389 -495353
15477d95353o8212q3388J30828L23165R8762J54733k9377k45619K8167j4447k2216
$$ -495353 -563565 -646953 -516125 -192960 -94198 60535 31158 -214461 -186294 -200741 -222957
15466b22957J65948M7061K28951J55799j17677k96535j55524J44161L7749J2260
$$ -222957 -57009 -9948 219003 374802 257125 -39410 -194934 -50773 -13024 -764
15456g64J08392k23480M2010K01194j57242J17533k6847j55340j7257j22060J47087
$$ -764 107628 -115852 -73842 127352 -29890 87643 60796 -94544 -111801 -233861 -86774
15445h6774M8647r8252o0423K48610r5189j87187N3790J74102M8854L0593l6850
$$ -86774 -38127 -136379 -196802 51808 -43381 -230568 -176778 -2676 46178 76771 39921
15434C9921o4962k28446m24773j31991J34177P4942Q9122J66814J56791L1475
$$ 39921 -25041 -253487 -678260 -810251 -676074 -601132 -512010 -345196 -188405 -156930
15424a56930l7844j23785K33950L41907P2053j78649k77245k21493J83736L7083
$$ -156930 -194774 -318559 -84609 257298 329351 150702 -126543 -348036 -164300 -127217
15414a27217p7508J2573k44104j65857n5606J52671n4986N5783K04599J11954
$$ -127217 -204725 -192152 -436256 -602113 -657719 -505048 -560034 -504251 -299652 -187698
15404a87698o8961J2474N5808l78j15201J45245J27060N7519J42143L7048j22112
$$ -187698 -256659 -244185 -188377 -188755 -303956 -158711 -31651 25868 168011 205059 82947
15393H2947k24546k20584J27017j19247n7300J17903O6340k11168K06414L38498
$$ 82947 -141599 -362183 -235166 -354413 -411713 -293810 -227470 -438638 -232224 106274
15383A06274l1737M3901O8314J7893j03098J9834L5726r6530J60086j94323j88318
$$ 106274 74537 118438 186752 204645 101547 121381 157107 60577 220663 26340 -161978
15372a61978j40077L05346J95262L1313j0626k5787p4785q8619r5544J04870o062
$$ -161978 -302055 3291 198553 229866 219240 193453 118668 30049 -65495 39375 33313
15361C3313M2933j14697r0934J23736j18602k50467O8744L85607L2190O0794K5239
$$ 33313 76246 -38451 -129385 -5649 -124251 -374718 -305974 79633 111823 172617 197856
15350A97856K27537k3990l1435J55473P1865j46393l9126k077p5677j33361k01904
$$ 197856 425393 401403 369968 525441 597306 450913 411787 409710 334033 200672 -1232
15339a232j44648J94841r576j05563K18859K84986j04627k43004j48960j94158
$$ -1232 -145880 48961 39385 -66178 152681 437667 333040 90036 -58924 -253082
15329b53082O1890k7196o8393n3072l2148J1360J1157j03538J4017J41544J17516
$$ -253082 -191192 -218388 -286781 -339853 -372001 -360641 -349484 -453022 -439005 -297461 -179945
15318a79945N0291j88297j28737m1145j02712K57558K94002j01007o9121K08882
$$ -179945 -129654 -317951 -446688 -487833 -590545 -332987 -38985 -139992 -209113 -231
15308b31P0319O4937j40271q4874R628J53451n2267j49537k45718P8039L4239
$$ -231 70088 135025 -5246 -90120 -80492 72959 20692 -128845 -374563 -296524 -262285
15297b62285j55655m245K02454J82265m814k27919j84713n3694O2207o691q3799
$$ -262285 -417940 -422185 -219731 -37466 -42280 -270199 -454912 -508606 -446399 -453090 -536889
15286e36889P2973K9449N0600j08889m9610K15682K64484L95693k9842j68306
$$ -536889 -463916 -434467 -383867 -492756 -542366 -326684 -62200 333493 303651 135345
15276A35345K9239j37680j92577k8300o2775K40503J41436l801R3952L2090j60458
$$ 135345 164584 26904 -165673 -193973 -256748 -16245 125191 121390 215342 247432 86974
15265H6974j96616J732K35052q300n12053j7159K24890P7890j51919J88905J99228
$$ 86974 -109642 -107910 127142 118842 -393211 -410370 -185480 -107590 -259509 -70604 128624
15254A28624L8712j34744o4295J6594Q6009J55921j05416m7199o3467q0795O743
$$ 128624 167336 32592 -31703 -15109 70900 226821 121405 74206 10739 -70056 -63313
15243f3313K2546q8249K68896p8376Q5909K03427R3904j57854k00027n1832K31347
$$ -63313 -40767 -129016 139880 61504 147413 350840 444744 286890 86863 35031 266378
15232B66378J9088R2753o5050K5982O7285J05811r8579k30766j22130p2389r1265
$$ 266378 285466 378219 313169 339151 406436 512247 413668 182902 60772 -11617 -102882
15221a02882J2955J88720l5939q7912J41835n0193o2605J20170K3821n2955R2544
$$ -102882 -89927 98793 62854 -25058 116777 66584 3979 124149 147970 95015 187559
15210A87559J0629j6772j09678n9546m6122q3680l5097J3209P5688N1922q4183
$$ 187559 198188 181416 71738 12192 -33930 -117610 -152707 -139498 -63810 -11888 -96071
15199i6071J22042L0419k09312K9415k46796r9739K27802P9674j83789J50166
$$ -96071 25971 56390 -152922 -123507 -370303 -470042 -242240 -162566 -346355 -196189
15189a96189O9017l0386J98776J39057l2129k0726P0595r8282l66373N3676J96158
$$ -196189 -127172 -157558 41218 180275 148146 127420 198015 99733 -266640 -212964 -16806
15178a6806q4058l5446k95647j24946R9584J76408J77512J36913j03025k46488
$$ -16806 -100864 -136310 -431957 -556903 -457319 -280911 -103399 33514 -69511 -315999
15168c15999j3550J4169J26155J07279J95064p3458o5291n9260K51610l1625q8974
$$ -315999 -329549 -315380 -189225 -81946 113118 39660 -25631 -84891 166719 135094 46120
15157D6120n1194n9871j22781J33307K10669j97630M5201J73615J3680L9991k7709
$$ 46120 -5074 -64945 -187726 -54419 156250 -41380 3821 177436 191116 231107 203398
15146B03398k4198l7510j80014j38227R1682n9095q3983k9120j65492K84407L22497
$$ 203398 179200 141690 -38324 -176551 -84869 -143964 -227947 -257067 -422559 -138152 184345
15135A84345J10034j28006j20900j4242r6312J03123K16195p1210m92374j10747
$$ 184345 294379 166373 45473 31231 -65081 38042 254237 183027 -309347 -420094
15125d20094Q733J50196L35378n5647j35234j44854l925q9735p2314k06256Q8795
$$ -420094 -411361 -261165 74213 18566 -116668 -261522 -265447 -355182 -427496 -633752 -544957
15114e44957L24643K27810L5748k38917k45783k6337K74586J72366j53762r8191
$$ -544957 -220314 7496 43244 -195673 -441456 -467793 -193207 -20841 -174603 -272794
15104b72794L09053J0865k25575j4503L50172P9809j760j00919j11091L2785j13199
$$ -272794 36259 47124 -178451 -192954 157218 237027 235267 134348 23257 56042 -57157
15093e7157k84165M9983K62813N1701K6698K38781P7775l25391R85p1223L6326
$$ -57157 -341322 -291339 -28526 23175 49873 288654 366429 41038 42023 -29200 7126
15082G126J44531j79014j7518j25562r4374N8555P543M4253j22814k13108k36939
$$ 7126 151657 -27357 -44875 -170437 -264811 -206256 -198713 -154460 -277274 -490382 -727321
15071g27321P5444K46816K23372L05562K71231k26107j41002o1059R2254n8161
$$ -727321 -651877 -405061 -181689 123873 395104 168997 27995 -33064 59190 1029
15061A029r5399o2952j19656J84059p0817j71555j27757O8971J02472J34134j03382
$$ 1029 -94370 -157322 -276978 -92919 -163736 -335291 -463048 -394077 -291605 -157471 -260853
15050b60853m4254j3693k29491J93529R6252p1969q7057o7385k8388k8564Q3135
$$ -260853 -305107 -318800 -548291 -354762 -258510 -330479 -417536 -484921 -513309 -541873 -458738
15039d58738K65463J06918K59279P8093n9902r361M2594J4984N6897K1621m0640
$$ -458738 -193275 -86357 172922 251015 191113 181752 224346 239330 296227 317848 277208
15028B77208k84503n8312m494P1667j44553j03606J11681m9608k8806N5712k611
$$ 277208 -7295 -65607 -70101 1566 -142987 -246593 -134912 -184520 -213326 -157614 -160225
15017a60225J79591r5272j61445o2913L38765P226m54n2020j77544j0284j86050
$$ -160225 19366 -75906 -237351 -300264 38501 45727 45273 -6747 -184291 -194575 -380625
15006c80625J49916K28961L9398k46665J77392K45600m4467k21575j19282j0700
$$ -380625 -230709 -1748 37650 -209015 -31623 213977 169510 -52065 -171347 -182047
14996a82047j49709j63672P0530m7752K44863J47029k17300k94100J01707K28920
$$ -182047 -331756 -495428 -424898 -472650 -227787 -80758 -298058 -592158 -490451 -261531
14986b61531L43664R0823J70595K06019k841l7578j35328j34841M0947K6843j26678
$$ -261531 82133 172956 343551 549570 546729 509151 373823 238982 279929 306772 180094
14975A80094j80907m0333n3289k752o9542j90956K77632K51682Q5532J15349j88311
$$ 180094 -813 -41146 -94435 -97187 -166729 -357685 -80053 171629 257161 372510 184199
14964A84199q7664Q521q4386j53729J32916Q3639j7210J51602j13575k64040k40159
$$ 184199 96535 105056 20670 -133059 -143 83496 66286 217888 104313 -159727 -399886
14953c99886L611K02544M00637M038l40269M7448p9087L5401r812J7686j48110
$$ -399886 -396275 -193731 206906 210944 -129325 -81877 -160964 -125563 -135375 -117689 -265799
14942b65799q0307j4401q9817j27192P4490M83249J55685J39615j73973j92427
$$ -265799 -346106 -360507 -450324 -577516 -503026 -19777 135908 275523 101550 -90877
14932i0877P0179O5423k04342J18294K04799k2438k49353j19548K39341K21611
$$ -90877 -20698 44725 -159617 -41323 163476 141038 -108315 -227863 11478 233089
14922B33089k82137j95682N7189J6702J45366J97209J84119l4635J3972j88312
$$ 233089 -49048 -244730 -187541 -170839 -25473 171736 355855 321220 335192 146880
14912A46880k14598o4984K84410k6015k64950P3655L1069Q8009K02516q3404j04002
$$ 146880 -67718 -132702 151708 125693 -139257 -65602 -34533 53476 255992 172588 68586
14901F8586j39525O1652j3909o9668j224J5326L16440p579k0522j77953k33101
$$ 68586 -70939 -9287 -23196 -92864 -94088 -78762 237678 230099 209577 31624 -201477
14890b01477K6931J62300k09657N1993O8080J67481J57889M4343K14286J28958
$$ -201477 -174546 -12246 -221903 -169910 -101830 65651 223540 267883 482169 611127
14880F11127j41513l61172j54660j6678j21751j05814j73032J19525K55096Q2210
$$ 611127 469614 108442 -46218 -62896 -184647 -290461 -463493 -343968 -88872 -6662
14870f662j22096j74418K16169N0217o139q0061j39251J15474J02846O3819n7850
$$ -6662 -128758 -303176 -87007 -36790 -42929 -122990 -262241 -146767 -43921 19898 -37952
14859c7952j51803M7519J21433j11925J567n5212M1762L6346p7414k47888k00599
$$ -37952 -189755 -142236 -20803 -132728 -131161 -186373 -144611 -108265 -185679 -433567 -634166
14848f34166R7452K08246K8093J18829j39597K55191j8024O0581O0488j30667
$$ -634166 -536714 -328468 -300375 -181546 -321143 -65952 -83976 -23395 37093 -93574
14838i3574J3309J3946J4850O3489l48553J05966J75608k2412N4228j47116j07526
$$ -93574 -80265 -66319 -51469 12020 -336533 -230567 -54959 -77371 -23143 -170259 -277785
14827b77785K31699K35518j34488k84169O0817K68030R3990k57273k23567P0142
$$ -277785 -46086 189432 54944 -229225 -168408 99622 193612 -63661 -287228 -217086
14817b17086n0972k01048O5494J32745L45535J87527p8709l0835n9826p43j1422
$$ -217086 -268058 -469106 -403612 -270867 74668 262195 183486 152651 92825 92082 80660
14806H0660j06669k5755j28909J35684J52843j91071l42251K00658K12742M6060
$$ 80660 -26009 -51764 -180673 -44989 107854 -83217 -425468 -224810 -12068 33992
14796C3992O6129r0094r3774j53503M379N7041p4366J07448K43052j01512j59121
$$ 33992 100121 10027 -83747 -237250 -232871 -175830 -250196 -142748 100304 -1208 -160329
14785a60329p5315q1341l7022l4363q8456R1321J68703Q0659O1292Q0913N5040
$$ -160329 -235644 -316985 -354007 -388370 -476826 -385505 -216802 -136143 -74851 6062 61102
14774F1102o2954J05887K9397n3386J22644j79581k27071l09464p6308L42437
$$ 61102 -1852 104035 133432 80046 202690 23109 -203962 -513426 -589734 -247297
14764b47297K18233K13286J12472l41507l6634K99123O096k60863n5056J46886
$$ -247297 -29064 184222 296694 -44813 -81447 217676 223772 -37091 -92147 54739
14754E4739L47544j38531j43452m4223R6710r7345k30178J24087K2539j24241
$$ 54739 402283 263752 120300 76077 172787 75442 -154736 -30649 -8110 -132351
14744a32351k11043O6945J67642J29724k06064n4872L7647J13511P5559J05507
$$ -132351 -343394 -276449 -108807 20917 -185147 -240019 -202372 -88861 -13302 92205
14734I2205J09774K6456J139j50785q726k2983j14641j5967K86304Q3886j634
$$ 92205 201979 228435 229574 78789 70063 47080 -67561 -83528 202776 286662 285028
14723B85028q4958k08933j03491K32336O8851j24449k40115j228L08484j38154
$$ 285028 200070 -8863 -112354 119982 188833 64384 -175731 -176959 131525 -6629
14713f629l19855j30467j02846K08807J84523J12198J4016P1570j58624m6739
$$ -6629 -326484 -456951 -559797 -350990 -166467 -54269 -40253 31317 -127307 -174046
14703a74046K02647L831O9847O4460M7517o6246l6313o203l0933K3559k58079
$$ -174046 28601 32432 102279 166739 214256 148010 111697 105494 74561 98120 -159959
14692a59959j27972j8451J75262q2015m3235j263j09798K31215K19591J09544
$$ -159959 -287931 -306382 -131120 -213135 -256370 -257633 -367431 -136216 83375 192919
14682A92919m0457q7928j87014j5038K9988j9531m8781L2871K07964Q0672o8504
$$ 192919 152462 64534 -122480 -137518 -107530 -127061 -175842 -142971 64993 145665 77161
14671G7161j73983N0189J49798q2824j8053J9505j6161J41656r6679o9361P0049
$$ 77161 -96822 -46633 103165 20341 2288 21793 5632 147288 50609 -18752 51297
14660E1297p7104j18151p1986j07824J23254m5979k5288L78873J8383L0299J53607
$$ 51297 -25807 -143958 -215944 -323768 -200514 -246493 -271781 107092 125475 155774 309381
14649C09381k8315k57011j34295J9098K79257K27547r9907l23241l04372K2642
$$ 309381 281066 24055 -110240 -91142 188115 415662 315755 -7486 -311858 -289216
14639b89216P2489L17760Q7016R8951O5585k08666j93924o3459N8309J20714J0871
$$ -289216 -216727 101033 188049 287000 352585 143919 -50005 -113464 -55155 65559 76430
14628G6430J22116L8966n33n0572n2019L67208M947l23126l33491j27356j1365
$$ 76430 198546 237512 236979 186407 134388 501596 506543 183417 -150074 -277430 -288795
14617b88795l4430j03212j47281J33972J2589J85996L45713J73794J00428r0342
$$ -288795 -323225 -426437 -573718 -439746 -427157 -241161 104552 278346 378774 288432
14607B88432J92461k92911j43286q5224M6513K36981K22018o9578k58062k04494
$$ 288432 480893 187982 44696 -40528 5985 242966 464984 395406 137344 -67150
14597f7150l7463R1234M7325q4729l5771N1336k76555m3199K32226L59786K5865
$$ -67150 -104613 -13379 33946 -50783 -86554 -35218 -311773 -354972 -122746 237040 262905
14586B62905r6266Q6877N4553p3439N6916k49019j89804j61006J00081Q3495N3210
$$ 262905 166639 253516 308069 234630 291546 42527 -147277 -308283 -208202 -124707 -71497
14575g1497P2061J86547P0149j96777l8424K02135J46028j98599j57139N9482
$$ -71497 564 187111 257260 60483 22059 224194 370222 171623 14484 73966
14565G3966j44760l39570J22266n6274o8492N8355K10263K2072j9236J51326J78742
$$ 73966 -70794 -410364 -288098 -344372 -412864 -354509 -144246 -122174 -141410 9916 188658
14554A88658j06356m3509K3539M9816J69301M9267k24384J36193j0170k97423
$$ 188658 82302 38793 62332 112148 281449 330716 106332 242525 232355 -65068
14544f5068l44209k10031J64830N816l7805K00714L30591K36497k31069k06962
$$ -65068 -409277 -619308 -454478 -448662 -486467 -285753 44838 281335 50266 -156696
14534a56696k06727J96228J29600k21591j86941J20650L13257J3839j32318j6790
$$ -156696 -363423 -167195 -37595 -259186 -446127 -325477 -12220 1619 -130699 -147489
14524a47489Q6201j52438P4182J18024n426n5529n0321q7170J24739K34578P6604
$$ -147489 -61288 -213726 -139544 -21520 -26946 -82475 -132796 -219966 -95227 139351 215955
14513B15955j80294j56354L3041K93229m9976l18497l5909q6904J43012m1902
$$ 215955 35661 -120693 -87652 205577 155601 -162896 -198805 -285709 -142697 -184599
14503a84599N3821K28855L3662k9785J54936k231Q2513k34874j49073R1353k8069
$$ -184599 -130778 98077 131739 101954 256890 254659 337172 102298 -46775 44578 16509
14492A6509m7766j02263k3841K8722J69976K3940R471J77750M5691Q4274L1474
$$ 16509 -31257 -133520 -157361 -128639 41337 65277 74748 252498 298189 382463 413937
14481D13937J71350J1404k57688k66339k99726K64915l4207p4842O3688K9078
$$ 413937 585287 596691 339003 72664 -227062 37853 3646 -71196 -7508 21570
14471B1570K4787K0511j33663k18578J28537l0086j03194J61048L16731N8339
$$ 21570 46357 66868 -66795 -285373 -156836 -186922 -290116 -129068 187663 246002
14461B46002J27016J33432q6984j44732r2193j04574j30838r2319J70779N3464
$$ 246002 373018 506450 419466 274734 182541 77967 -52871 -145190 25589 79053
14451G9053j41727K49835J62434j88510k33310k09197k5793J33954R1983q8047
$$ 79053 -62674 187161 349595 161085 -72225 -281422 -307215 -173261 -81278 -169325
14441a69325j28406J96654J75618K9523L7196L52081O1840K0722j40225k31582
$$ -169325 -297731 -101077 74541 104064 141260 493341 555181 575903 435678 204096
14431B04096j53143J9803J16789k5151l32482k17797M8780J68281R7371m1096
$$ 204096 50953 70756 187545 162394 -170088 -387885 -339105 -170824 -73453 -114549
14421a14549k3994k00684R5230R0725M8937j59356J33340J23191J35444j92787
$$ -114549 -138543 -339227 -243997 -153272 -104335 -263691 -130351 -7160 128284 -64503
14411f4503j80356J33945k20549P9291R8036R8536l6702J07629j30825r4597k7067
$$ -64503 -244859 -110914 -331463 -252172 -154136 -55600 -92302 15327 -115498 -210095 -237162
14400b37162J4691K23207j04590k07214J24628J18597q7980J57774K11732m4536
$$ -237162 -222471 736 -103854 -311068 -186440 -67843 -155823 1951 213683 169147
14390A69147k2510J23253j7142j12147j76667J02539k0899k3951q8425j58862
$$ 169147 146637 269890 252748 140601 -36066 66473 45574 21623 -66802 -225664
14380b25664J65712J68506K3853Q5241P8491l07930j58566N7538N3243r9262P6134
$$ -225664 -59952 108554 132407 217648 296139 -11791 -170357 -112819 -59576 -158838 -82704
14369h2704j00045R0979o3411K01321l3318J00779M67k52910L0311J6345q7586
$$ -82704 -182749 -91770 -155181 46140 12822 113601 114068 -138842 -108531 -92186 -179772
14358a79772Q5807J00514L3183k17364Q8367J21431K27356J05429j41412l3012
$$ -179772 -93965 6549 39732 -177632 -89265 32166 259522 364951 223539 190527
14348A90527j42614N6700J32284K12949j4375l03106q9068L5822n9861m8107j6410
$$ 190527 47913 104613 236897 449846 435471 132365 43297 79119 19258 -28849 -45259
14337d5259K17129J39689M6508j72658j84818P0352J2767O2744p337M4382p3995
$$ -45259 171870 311559 358067 185409 591 70943 83710 146454 139117 183499 109504
14326A09504k05541j7045L6960k61177r6832L11921O7758k09167r7481J59556
$$ 109504 -96037 -113082 -76122 -337299 -434131 -122210 -54452 -263619 -361100 -201544
14316b01544k1616p5921M4553J74021o6025k8679j42616o2506K33511O8244L5460
$$ -201544 -223160 -299081 -254528 -80507 -146532 -175211 -317827 -380333 -146822 -78578 -43118
14305d3118J27461j90567k24143K953J30393N1927J1770j14174L9057j48732j47580
$$ -43118 84343 -106224 -330367 -327414 -197021 -145094 -133324 -247498 -208441 -357173 -504753
14294e04753p4908J5817Q6456K26475J1961K47720K65287k602j95969k1494j61102
$$ -504753 -579661 -563844 -477388 -250913 -238952 8768 274055 271453 75484 53990 -107112
14283a07112j13833Q7892J62961K8998l9692J792k6259o1831k5891j47015k31985
$$ -107112 -220945 -133053 29908 58906 19214 21006 -5253 -67084 -92975 -239990 -471975
14272d71975r9185L30195K87532J56286k0230l31710r1465K9912J55020L33979
$$ -471975 -571160 -240965 46567 202853 182623 -149087 -240552 -210640 -55620 278359
14262B78359K21283o1171j73464j72884j05182K51844l17358j76786j2264J73265
$$ 278359 499642 438471 265007 92123 -13059 238785 -78573 -255359 -267623 -94358
14252i4358O1619l0033P0578j12083K9543m775n1769K26635q9518k29768o7620
$$ -94358 -32739 -62772 7806 -104277 -74734 -79509 -131278 95357 5839 -223929 -291549
14241b91549P9947N6724j83454q3631q1610K00813J02985J97301L72455J10762
$$ -291549 -211602 -154878 -338332 -421963 -503573 -302760 -199775 -2474 369981 480743
14231D80743q051r4542n4415j82251k13889J10998K70213j39811j10763O3575
$$ 480743 472692 378150 323735 141484 -72405 38593 308806 168995 58232 121807
14221A21807q0029j42128L30931K46216o9750p5275m9498l9026l15123j28420
$$ 121807 41778 -100350 230581 476797 407047 331772 282274 243248 -71875 -200295
14211b00295l0829K6295j2386K50039J70553l0590j08016q4040j19339J13922
$$ -200295 -231124 -204829 -217215 32824 203377 172787 64771 -19269 -138608 -24686
14201b4686m0295J81315L3876k8095j4765O9505n7835L1792j60547p5041N3891
$$ -24686 -64981 116334 150210 122115 107350 176855 119020 150812 -9735 -84776 -30885
14190c0885j36701J42621l4054j64071k26712J20389J59021K19403j04305o3542
$$ -30885 -167586 -24965 -59019 -223090 -449802 -329413 -170392 49011 -55294 -118836
14180a18836K05360P3985j29055j53970m7676o0181j7884J67268L40681N9737
$$ -118836 86524 160509 31454 -122516 -170192 -230373 -248257 -80989 259692 319429
14170C19429m83492k45267L3316M09676K33119L6180L3724o2143j19968r8083
$$ 319429 -164063 -409330 -376014 33662 266781 302961 336685 274542 154574 56491
14160E6491J64835J16794j68432j62022k40083n2874N7029K3480J75235M6243
$$ 56491 221326 338120 169688 7666 -232417 -285291 -228262 -204782 -29547 16696
14150A6696l7642m2068r475R6300L58892Q9101p2969k55565k21693J31633J55337
$$ 16696 -20946 -63014 -72489 23811 382703 471804 398835 143270 -78423 53210 208547
14139B08547K32433q414r2007j7921o5392O4847M1678l0980l7741J04961l8106
$$ 208547 440980 432566 340559 322638 257246 322093 363771 332791 295050 400011 361905
14128C61905k19794j95909K64741J04371p9424J49033k01705j05013j28682q7979
$$ 361905 142111 -53798 210943 315314 235890 384923 183218 78205 -50477 -138456
14118a38456k0285R1820J04639l2085j08530m8269l4515j1728M5866J13471K91865
$$ -138456 -158741 -66921 37718 5633 -102897 -151166 -185681 -197409 -151543 -38072 253793
14107B53793J18349j0005k1402o835j41080l20269j91204j03723J03125J19856
$$ 253793 372142 362137 340735 333900 192820 -127449 -318653 -422376 -319251 -199395
14097a99395J2494L34274P8932L0275p6263j29868J25926Q5579J64897M119j07326
$$ -199395 -186901 147373 226305 256580 180317 50449 176375 261954 426851 430970 323644
14086C23644j03914L0242p1462M3756j86401J55103j9512j91222j46626L3827
$$ 323644 219730 249972 178510 222266 35865 190968 171456 -19766 -166392 -132565
14076a32565j30058k1746n1251J80857K40786R0234M7980L1521J03476k99378
$$ -132565 -262623 -284369 -335620 -154763 86023 176257 224237 255758 359234 59856
14066E9856k43240q6133j44195L98301K84568K28158j40258j85119l1897O877
$$ 59856 -183384 -269517 -413712 -15411 269157 497315 357057 171938 140041 146918
14056A46918n1796J03527m618j86033q7297K54190P8942j60664j0287k11346r6469
$$ 146918 95122 198649 194031 7998 -79299 174891 253833 93169 82882 -128464 -224933
14045b24933J46303J03380L423k65630J1684O8603R0988j28325J5859o9249J32663
$$ -224933 -78630 24750 28173 -237457 -225773 -157170 -66182 -194507 -178648 -247897 -115234
14034a15234P129J81629J26444m9401j83567j23515n8954J20864Q072j23023K20960
$$ -115234 -108105 73524 199968 150567 -33000 -156515 -215469 -94605 -86533 -209556 11404
14023A1404K92177L5399j6108k4889N3436j67596l250K9750l03249l91746j33511
$$ 11404 303581 338980 322872 297983 351419 183823 180573 210323 -92926 -484672 -618183
14012f18183M3284L00820J14944J6487Q7986L5894k9880J07913P0196l5598R5825
$$ -618183 -574899 -274079 -159135 -142648 -54662 -18768 -48648 59265 129461 93863 189688
14001A89688J30544J04856J31176j05019k95700m7997L8765j45376q8664N6488
$$ 189688 320232 425088 556264 451245 155545 107548 146313 937 -87727 -31239
13991c1239J20404j02119j02269p8530K30842J76243J71339j42304l2979r2643
$$ -31239 89165 -12954 -115223 -193753 37089 213332 384671 242367 209388 116745
13981A16745M2729m982J32695M29067o564l07928o6819K1368k93928k11252J09905
$$ 116745 159474 154492 287187 716254 709690 401762 334943 356311 62383 -148869 -38964
13970c8964J49448j5710n90Q1960N2925j76411L6962J0422j88046Q7386J42249
$$ -38964 110484 94774 94184 176144 229069 52658 89620 100042 -88004 -618 141631
13959A41631Q0446j39880n1330k0399r5748j71365l15472J37349L83244J39290
$$ 141631 222077 82197 30867 10468 -85280 -256645 -572117 -434768 -51524 87766
13949H7766n4050Q2386l7239J3507J42991r3112m33837M7201N4690n8792j93896
$$ 87766 33716 116102 78863 92370 235361 142249 -291588 -244387 -189697 -248489 -442385
13938d42385J30577L04527J40302j08004n9477n3207j1084j52357P5848J14493
$$ -442385 -311808 -7281 133021 25017 -34460 -87667 -98751 -251108 -175260 -60767
13928f0767K20963j09851j43133K03056r2817n3255L8301J62951j5996j14694
$$ -60767 160196 50345 -92788 110268 17451 -35804 2497 165448 149452 34758
13918C4758j42577k31898o4239R1913J96218K75706P9539K6701n7015j95465j64902
$$ 34758 -107819 -339717 -403956 -312043 -115825 159881 239420 266121 209106 13641 -151261
13907a51261L23951K33177j26131n118k83161j76927Q6741Q3350J10121J91935
$$ -151261 172690 405867 279736 274618 -8543 -185470 -98729 -15379 94742 286677
13897B86677N1425j64268L9417L8709J54032n9428k4680q8077L0790k6137r1187
$$ 286677 338102 173834 213251 251960 405992 346564 321884 233807 264597 238460 147273
13886A47273Q2723J74965p1336k31905j734J0682j46754R4738J24608k6013k83274
$$ 147273 229996 404961 333625 101720 99986 110668 -36086 58652 183260 157247 -126027
13875a26027J83069J6322j65442r3007m4958R7037J96131J689N0624L62K8284
$$ -126027 57042 73364 -92078 -185085 -230043 -133006 63125 64814 115438 115800 144084
13864A44084l3809K89279o2509k91490m6095J31245j02053j17792R4375l7812
$$ 144084 110275 399554 337045 45555 -540 130705 28652 -89140 5235 -32577
13854c2577j13838J04306K27451Q2473j66223N9875K07153j34713p5800k37062
$$ -32577 -146415 -42109 185342 267815 101592 161467 368620 233907 158107 -78955
13844g8955M477j128P9527K00343M4089j38822j01572q2421O2942N8498j23759
$$ -78955 -74478 -75606 3921 204264 248353 109531 7959 -74462 -11520 46978 -76781
13833g6781M6306P0160J88507R8801m964o3890q4742j00250Q7621L49022L8239
$$ -76781 -30475 39685 228192 326993 322029 258139 173397 73147 160768 509790 548029
13822E48029q1696j40259m91K372L2548j05858K18261L14816o512m10673j71950
$$ 548029 466333 326074 325583 327955 360503 254645 472906 787722 781210 370537 198587
13811A98587J17382P6982Q3193K00354j28326r0256j66366j78646j4048J09195
$$ 198587 315969 392951 476144 676498 548172 457916 291550 112904 98856 208051
13801B08051q9312j30811K7700M1292o8412k25298k5889J72945L63102J41209
$$ 208051 118739 -12072 15628 56920 -11492 -236790 -262679 -89734 273368 414577
13791D14577Q821n1718J76638k09884l34553J7318K77254J00073m3010l3750j28776
$$ 414577 423398 371680 548318 338434 3881 21199 298453 398526 355516 321766 192990
13780A92990l8971n7877m0394O1105m9285O0802k09251k8973R2421K02518J09363
$$ 192990 154019 96142 55748 116853 67568 128370 -80881 -109854 -17433 185085 294448
13769B94448M0322p5242j61494j1138K55391J09226l32808j74104j13588R3476
$$ 294448 334770 259528 98034 86896 342287 451513 118705 -55399 -168987 -75511
13759g5511j6677o3439Q1999K58244P0705j41498j05694J19697L0669J17628J13193
$$ -75511 -92188 -155627 -73628 184616 255321 113823 8129 127826 158495 276123 389316
13748C89316k7234K0851k72211k84190j10712J43208K23380J37388j11183k3292
$$ 389316 362082 382933 110722 -173468 -284180 -140972 82408 219796 108613 85321
13738H5321l1175J11005J10957J72864l43863q5514J26717m6167k57818q2407
$$ 85321 54146 165151 276108 448972 105109 19595 146312 100145 -157673 -240080
13728b40080Q6140j14959k2255m5582J15748K50251J65988j96198k1886Q1952
$$ -240080 -153940 -268899 -291154 -336736 -220988 29263 195251 -947 -22833 59119
13718E9119Q9296Q2767J43379J37924r6497j24264m7732J3497J60803K44510j07613
$$ 59119 148415 231182 374561 512485 415988 291724 243992 257489 418292 662802 555189
13707E55189J47198l6108j00248n5294r9512j01161j8376R8855j20980k50508
$$ 555189 702387 666279 566031 510737 411225 310064 291688 390543 269563 19055
13697A9055M085J86018L01199J0604Q0689j01526j59994n3296j03919l11579m3297
$$ 19055 23140 209158 510357 520961 601650 500124 340130 286834 182915 -128664 -171961
13686a71961j1883K66070M4351m7259j4329m4350r1003o502J57038J03767P4880
$$ -171961 -183844 82226 126577 79318 64989 20639 -70364 -76866 80172 183939 258819
13675B58819k6320k69082L6197O4156L1963N8252J23337L1838K42414k3282J13462
$$ 258819 232499 -36583 -386 63770 95733 153985 277322 309160 551574 528292 641754
13664F41754j36774j76326M444q5739m8546n0384q694q7004J8402P9599q816k326
$$ 641754 504980 328654 333098 247359 198813 148429 139735 52731 71133 150732 141916 139590
13652A39590j43374K07809J53614j68831k09155j33041K3560J7328p6655J23040
$$ 139590 -3784 204025 357639 188808 -20347 -153388 -129828 -112500 -189155 -66115
13642f6115J83552j30109n0188K28205J06462l4197j02601l56950J16773K99336
$$ -66115 117437 -12672 -62860 165345 271807 237610 135009 -221941 -105168 194168
13632A94168L02432O5714m1386p3684r4020l17275j77229J25362J48651n1231
$$ 194168 496600 562314 520928 447244 353224 35949 -141280 -15918 132733 81502
13622H1502l925l904N1691J11647L3378J53192K16531j06869j4527J07954q750
$$ 81502 77577 73673 125364 237011 270389 423581 640112 533243 518716 626670 617920
13611F17920L819m6366j84434J43940m5308R8270j7346p6009j21589j3415J6707
$$ 617920 621739 575373 390939 534879 489571 587841 570495 494486 372897 359482 376189
13600C76189o944m3140j11524j91638r9383k21411j77221n354K62644R6262j63504
$$ 376189 369245 326105 214581 22943 -76440 -297851 -475072 -480426 -217782 -121520 -285024
13589b85024J30419J31424P0892j94588J61668K10615k4323K5234o1560n2945
$$ -285024 -154605 -23181 47711 -146877 14791 225406 201083 226317 164757 111812
13579A11812L64416k738k40531m7995K64878K36966j35919j07540k9241l4562
$$ 111812 476228 473490 232959 184964 449842 686808 550889 443349 414108 379546
13569C79546J2771j51101J96535J263k45199k86573j8133J28978j3139j93602
$$ 379546 392317 241216 437751 439014 193815 -92758 -110891 18087 4948 -188654
13559a88654O5428K17223J23339j05298j5145J58553J07846K8321J40056O5055
$$ -188654 -123226 93997 217336 112038 96893 255446 363292 391613 531669 596724
13549E96724q5207o4380j75671j51545j63860J11678K21631j32640k59453j74257
$$ 596724 511517 447137 271466 119921 -43939 67739 289370 156730 -102723 -276980
13539b76980R894J94059N2997j93165O1698N6096J33698p6360J8469R9274n4607
$$ -276980 -267086 -73027 -20030 -213195 -151497 -95401 38297 -38063 -19594 79680 25073
13528B5073k47271J2811K88353K20494J23957q429j08790k59140k10788J07510
$$ 25073 -222198 -209387 78966 299460 423417 414988 306198 47058 -163730 -56220
13518e6220k4261K16471K12146P9128l62352N9033j1151j07753L22571O2755j05823
$$ -56220 -80481 135990 348136 427264 64912 123945 112794 5041 327612 390367 284544
13507B84544Q62J58534N4620l2070n5171j53255M7019L4470L1735k69460j3129
$$ 284544 285406 443940 498560 466490 411319 258064 305083 339553 371288 101828 88699
13496H8699K13701J26397j20037j06355k30369k7538j04776k9214l3148K10104
$$ 88699 302400 428797 308760 202405 -27964 -55502 -160278 -189492 -222640 -12536
13486a2536K35972K48427r480k37744R1865J86072j51264J0070j7623j99502j14003
$$ -12536 223436 471863 462383 224639 316504 502576 351312 361382 343759 144257 30254
13475C0254K5131P749R4978J41156K30061o0209j69444K00335k32933l28397Q3842
$$ 30254 55385 63134 158112 299268 529329 469120 299676 500011 267078 -61319 22523
13464B2523K33031j1133J7626j86151j08794j18779j21112O1611L30418m3267
$$ 22523 255554 244421 262047 75896 -32898 -151677 -272789 -211178 119240 75973
13454G5973M0371J06605r7968Q237M731j34930r8577n3084J15947O1767N8879
$$ 75973 116344 222949 124981 133218 137949 3019 -95558 -148642 -32695 29072 87951
13443H7951m5401L5957J93977J94155P0131k32225m5701K33542O1162k51907j20389
$$ 87951 42550 78507 272484 466639 536770 304545 258844 492386 553548 301641 181252
13432A81252R8908k4688J29466J1514k01904q8273J2764O0167l6875n0564m8110
$$ 181252 280160 255472 384938 396452 194548 106275 119039 179206 142331 91767 43657
13421D3657R625J69668J42396L899j21927L5605k1610p2531j24595N3281J3677
$$ 43657 53282 222950 365346 369245 247318 282923 261313 188782 64187 117468 131145
13410A31145J59859J09887j79151o6380K46865J35536J95893r1183j07167j66736
$$ 131145 291004 400891 221740 155360 402225 537761 733654 642471 535304 368568
13400C68568l763O5754J11429O467j33449l3398p8939Q1571Q7742J87315j83469
$$ 368568 364805 430559 541988 548455 415006 381608 302669 384240 471982 659297 475828
13389D75828j18019j82668J31722j14631j81863m3325k2679L37673m9014j5255
$$ 475828 357809 175141 306863 192232 10369 -32956 -55635 282038 233024 217769
13379B17769Q3626p8266j65093m3433l8073L0429J39362L2338N6222M163J2855
$$ 217769 301395 223129 58036 14603 -23470 6959 146321 178659 234881 239044 251899
13368B51899l2629j39621o6324K40765p8738m7558k70737R478J90884O5986K1492
$$ 251899 219270 79649 13325 254090 175352 127794 -142943 -133465 57419 123405 144897
13357A44897J01963J94776k82299r030M1938J1060M7305R3636k7009L8947K27029
$$ 144897 246860 441636 159337 150307 192245 203305 250610 344246 317237 356184 583213
13346E83213k43043Q6060l2250m28749L1319K83057R2403j36988k67776o9337
$$ 583213 340170 426230 393980 -34769 -3450 279607 372010 235022 -32754 -102091
13336a02091K23540K15104K25589L9714j51397j5151j7351j17948k20294K32580
$$ -102091 121449 336553 562142 601856 450459 435308 417957 300009 79715 312295
13326C12295j37346k28877K38449J38747l0228p2100j67439J39067L7884M6277
$$ 312295 174949 -53928 184521 323268 293040 220940 53501 192568 230452 276729
13316B76729q7708k7887M3422P0392J65761j5066o2475M8245m3843j335o2447
$$ 276729 189021 161134 204556 274948 440709 425643 363168 411413 367570 366235 303788
13305C03788j7661K6898n8670N3280j40767o5021J8005o9649r2251r493J70482
$$ 303788 286127 313025 254355 307635 166868 101847 119852 50203 -42048 -51541 118941
13294A18941M7801K02467J19647j93652j17299l3099P8752K39888j15027k46741
$$ 118941 166742 369209 488856 295204 177905 144806 223558 463446 348419 101678
13284A01678J89060O3574l74009j28170J90145K27489J04293R1779L6912n4051
$$ 101678 290738 354312 -19697 -147867 42278 269767 374060 465839 502751 448700
13274D48700j20989k51547J44279J11831J89353Q974k7311l1301q0218l0380M7568
$$ 448700 327711 76164 220443 332274 521627 530601 503290 471989 391771 361391 408959
13263D08959j5776j71940j82220Q3718K50231p6147l97214j87212m9877Q8601
$$ 408959 393183 221243 39023 122741 372972 296825 -100389 -287601 -337478 -248877
13253b48877N5323M39191K54856l74822j29922J80222L45536N3053J33060O232
$$ -248877 -193554 245637 500493 125671 -4251 175971 521507 574560 707620 713852
13243G13852R1014J75648N957k03478j78131k15287K4628q073P8632J3069M7294
$$ 713852 804866 980514 986471 782993 604862 389575 414203 406130 484762 497831 545125
13232E45125O0125k66266j65086M2184M7760J7576l71802k44232J54770r2666
$$ 545125 605250 338984 173898 216082 263842 281418 -90384 -334616 -179846 -272512
13222b72512K34392M58049K8763k7490j14818J95928P2257l4759m9432k9643J60025
$$ -272512 -38120 419929 448692 421202 306384 502312 574569 539810 490378 460735 620760
13211F20760l1553k26578k3758P3826L8677r5665K0800q3478m7847K13455P1056
$$ 620760 589207 362629 338871 412697 451374 355709 376509 293031 245184 458639 529695
13200E29695j76586q2977J16163K15991m2005l19830j86876J28208O0582K0841
$$ 529695 353109 270132 386295 602286 560281 240451 53575 181783 242365 263206
13190B63206K69289Q1238j00259r7545j22087R2459J30377k8203l030J05731O9563
$$ 263206 532495 613733 513474 415929 293842 386301 516678 488475 485445 591176 660739
13179F60739N72P626J6620o5318J6382J25171m1247j03509k27143k39810l1077
$$ 660739 661311 668937 685557 620239 636621 761792 720545 617036 389893 150083 119006
13168A19006j8939j21809j12250K05539K56009j69904k93683K83101p3115n2418
$$ 119006 100067 -21742 -133992 71547 327556 157652 -136031 147070 73955 21537
13158B1537K49296J98921R7616r8561K9652J01784j97428m52330o735R3447J33900
$$ 21537 270833 469754 567370 468809 498461 600245 402817 -49513 -56248 37199 171099
13147A71099J36314J01215N4666q3288j56528o0319P8991K7890K70194N4555k74755
$$ 171099 307413 408628 463294 380006 223478 163159 242150 270040 540234 594789 320034
13136C20034j45730R7346m72K4633N4255R7675J05330m4247p4353j58512o8183
$$ 320034 174304 271650 271178 295811 350066 447741 553071 508824 434471 275959 207776
13125B07776l195J50864Q1643J14301l00401j56405J40302K94547K2853Q646j32865
$$ 207776 204581 355445 437088 551389 250988 94583 234885 529432 552285 560931 428066
13114D28066m4966K82505n0538j68809k12350k35353R7796J37219O1334P388k9774
$$ 428066 383100 665605 615067 446258 233908 -1445 96351 233570 294904 302292 272518
13103B72518r5455J96115k1427J36219Q5601j61942k00091J45452Q8603j56164
$$ 272518 177063 373178 351751 487970 573571 411629 211538 356990 445593 289429
13093B89429O2019J22441J26899o7430q9088p2376J30838k7425l4796j2009k29568
$$ 289429 351448 473889 600788 533358 444270 371894 502732 475307 440511 428502 198934
13082A98934J73349n268O6591J03136K21609l2860j02433j85094k01535j05700
$$ 198934 372283 367015 433606 536742 758351 725491 623058 437964 236429 130729
13072A30729J18114n4020J7117L69293K94971J00171k18991l22144J62600n0978
$$ 130729 248843 194823 211940 581233 876204 976375 757384 435240 597840 546862
13062E46862j32298k96271j91705M50059M03442J70471r4760j27885j57423j01165
$$ 546862 414564 118293 -73412 376647 780089 950560 855800 727915 570492 469327
13052D69327n0700l7741k3592j63666R4507K4538j42223P2518P4840J02415M380
$$ 469327 418627 380886 357294 193628 288135 312673 170450 242968 317808 420223 424603
13041D24603j62311O7883o2473j61912K1516K48984l3868k3974j02947k84637
$$ 424603 262292 330175 267702 105790 127306 376290 342422 318448 215501 -69136
13031f9136Q5102K97274R9450K07911J26857r1083L1274J07198j04494J016j93268
$$ -69136 15966 313240 412690 620601 747458 656375 687649 794847 690353 691369 498101
13020D98101P704k033O7664J73550o2014k9039j08656K07422M0129k36004j64122
$$ 498101 505805 503772 571436 744986 682972 653933 545277 752699 792828 556824 392702
13009C92702j37300K54609N2861k2587N0825P6820m2211j75010k18863K31534
$$ 392702 255402 510011 562872 540285 591110 667930 625719 450709 231846 463380
12999D63380N6808J3845O3807J06507Q5998r0122j63180j93956q9712K32869P7760
$$ 463380 520188 534033 597840 704347 790345 700223 537043 343087 253375 486244 564004
12988E64004M1039J03338J22929o690j92929l35127m1690O4119J97122L4797P3013
$$ 564004 605043 708381 831310 824620 631691 296564 254874 318993 516115 550912 623925
12977F23925k7307J90101n7960j27950k15638j28787N7597J10969K21097K24979
$$ 623925 596618 786719 728759 600809 385171 256384 313981 424950 646047 871026
12967H71026m5313k2403J42164j40218M1619O845j03212k26442q8554R7800R1475
$$ 871026 825713 803310 945474 805256 846875 853720 750508 524066 435512 533312 624787
12956F24787J00883l61301r4729Q3414L8211K81981K77190m4727k21367q3547
$$ 624787 725670 364369 269640 353054 391265 673246 950436 905709 684342 600795
12946F00795O2194j27322J4648J22570J67533K1741p1259j98531N8246P9908k97706
$$ 600795 662989 535667 550315 672885 840418 862159 790900 592369 650615 730523 432817
12935D32817m0821K47253K16481J3330j66320j81659r7598l3313k29673j12543
$$ 432817 391996 639249 855730 869060 702740 521081 423483 390170 160497 47954
12925D7954K71414J93440K1350j79166m5341L0728r3250J24743J88874K01526
$$ 47954 319368 512808 534158 354992 309651 340379 247129 371872 560746 762272
12915G62272M2605k9235K3099p8073j26443J59134J56137j73507j14727p1043
$$ 762272 804877 775642 798741 720668 594225 753359 909496 735989 621262 550219
12905E50219k06781N2034R7970K14101N9112Q8574J38185j40790j56232j45475
$$ 550219 343438 395472 493442 707543 766655 855229 993414 852624 696392 550917
12895E50917k66962j30595J20506J72999J26524J485j57284L5563r9097r6539
$$ 550917 283955 153360 273866 446865 573389 574874 417590 453153 354056 257517
12885B57517p3412L02883L01163J82919N6487N6026j15880k39311j51441r363
$$ 257517 184105 486988 788151 971070 1027557 1083583 967703 728392 576951 567588
12875E67588M9934j40058J09308J16139P0136l7207o4143q6566n9779K11505L75533
$$ 567588 617522 477464 586772 702911 773047 735840 671697 585131 525352 736857 1112390
12864A112390M987p6177j67865o2492R9239N3074m7798q0187j09428O1922J0486
$$ 1112390 1117377 1041200 873335 810843 910082 963156 915358 835171 725743 787665 798151
12853G98151j02597k04828R0344J86670p9972k22037N5221J25673J26537m8544
$$ 798151 695554 490726 581070 767740 687768 465731 520952 646625 773162 724618
12843G24618j56011J62624J45544p8881j8050J87874J61835n9187J00883j87131
$$ 724618 568607 731231 876775 797894 779844 967718 1129553 1070366 1171249 984118
12833I84118k10585k8554N2082n6704j42851j36135j53050P3527L42535K09219
$$ 984118 773533 744979 797061 740357 597506 461371 308321 381848 724383 933602
12823I33602Q7754o6742j15767j22271J81388N1879N4568k08569j44839J83065
$$ 933602 1021356 954614 838847 716576 897964 949843 1004411 795842 651003 834068
12813H34068Q6177K4141J11243K10611m738r2931k03818o2601J42754R8539M0471
$$ 834068 920245 944386 1055629 1266240 1261502 1168571 964753 902152 1044906 1143445 1183916
12802A183916j00009l79911m9936J00515J64273n6306j77041L14315K51174l8147
$$ 1183916 1083907 703996 654060 754575 918848 862542 685501 999816 1250990 1212843
12792A212843l73275j23829n2782P6616K60331Q6396k16326Q7337O3808M2867
$$ 1212843 839568 715739 662957 739573 999904 1086300 869974 957311 1021119 1063986
12782A063986r5586k12554k81253K92787N3636K7672L08919J29989j35717j04014
$$ 1063986 968400 755846 474593 767380 821016 848688 1157607 1287596 1151879 1047865
12772A047865R910J1130J03110p1253r293l2699k9160J46937j52034r5632M5745
$$ 1047865 1057775 1068905 1172015 1100762 1091469 1058770 1029610 1176547 1024513 928881 974626
12761I74626R9063k0808k66205N6819L9301J36027j82210m21927n6261L5518K09317
$$ 974626 1073689 1052881 786676 843495 882796 1018823 836613 414686 358425 393943 603260
12750F03260J42569r1103J36028p3904L946k6860J79721r0203L12207m1531K8257
$$ 603260 745829 654726 790754 716850 720796 693936 873657 783454 1095661 1054130 1082387
12739A082387J38943n3936M1905k15821l8754R3488q1786L5213k5043j21755L7745
$$ 1082387 1221330 1167394 1209299 993478 954724 1048212 966426 1001639 976596 854841 892586
12728H92586j39683j26925Q1116K09259p8412K5288J90270L25867P8848j43763
$$ 892586 752903 625978 707094 916353 837941 863229 1053499 1379366 1458214 1314451
12718A314451j68665q7435l0451k1740K29044p8018J50056J29394Q2078k45036
$$ 1314451 1145786 1058351 1027900 1006160 1235204 1157186 1307242 1436636 1518714 1273678
12708A273678k68540j38002J1340k137m3332j20529q5098Q8658J41211L5099K8101
$$ 1273678 1005138 867136 878476 876339 833007 712478 627380 716038 857249 892348 920449
12697I20449o1751Q4072j46897J04142J06602j97020j37810o4551K51936n3540
$$ 920449 858698 942770 795873 900015 1006617 809597 671787 607236 859172 805632
12687H05632m4989k390O921j71641K26155J63649K3186j65841M9921K7394J20017
$$ 805632 760643 758253 765174 593533 819688 983337 1006523 840682 890603 917997 1038014
12676A038014J76502K9594q0776J84690J65322j02498k05699k90624Q3331J64873
$$ 1038014 1214516 1244110 1163334 1348024 1513346 1410848 1205149 914525 997856 1162729
12666A162729J34290J07940O3075P6915k29089o8079J1653K3822M5630j92305
$$ 1162729 1297019 1404959 1468034 1544949 1315860 1247781 1259434 1283256 1328886 1136581
12656A136581j10842L7646R2729J17559J73337J03708k4826j8003j37336j21423
$$ 1136581 1025739 1063385 1156114 1273673 1447010 1550718 1525892 1507889 1370553 1249130
12646A249130N822j3514k45193K6615J63281K3701R0106K01031m8180q4188j6234
$$ 1249130 1254952 1241438 996245 1022860 1186141 1209842 1299948 1500979 1452799 1368611 1352377
12635A352377r5921p4268P5914k4716J31838K03569p7741M2823O8512J61528r6584
$$ 1352377 1256456 1182188 1258102 1233386 1365224 1568793 1491052 1533875 1602387 1763915 1667331
12624A667331J4276l33964j85858M4637p2084J49700Q112J0562k46145j04172
$$ 1667331 1681607 1347643 1161785 1206422 1134338 1284038 1292150 1302712 1056567 952395
12614I52395K63059l1036j64487R4302N8574Q7903j242J197o0787N1269J18050
$$ 952395 1215454 1184418 1019931 1114233 1172807 1260710 1259468 1260665 1199878 1251147 1369197
12603A369197P5044k94812n8017j47894k3435J78857Q4099L4823J98290K29994
$$ 1369197 1444241 1149429 1091412 943518 920083 1098940 1183039 1217862 1416152 1646146
12593A646146J14958k44269J53093l7732l96891k2307L06628R3373R7929m9507
$$ 1646146 1761104 1516835 1669928 1632196 1235305 1212998 1519626 1612999 1710928 1661421
12583A661421j89244m0587j04387j40075K867K89946J49879K29947j64643j35293
$$ 1661421 1472177 1431590 1327203 1187128 1189995 1479941 1629820 1859767 1695124 1559831
12573A559831J54628Q3884N7807R743l10456j773K3076k08814r4964J58161K41389
$$ 1559831 1714459 1798343 1856150 1865893 1555437 1553664 1576740 1367926 1272962 1431123 1672512
12562A672512J65424J10453Q8452J98997L6090q9331k88563k31584j31782o2413
$$ 1672512 1837936 1948389 2036841 2235838 2271928 2182597 1894034 1662450 1530668 1468255
12552A468255j8531J19169m5586j18245J40220J7532O2733n8060J7849k0032J85136
$$ 1468255 1449724 1568893 1523307 1405062 1545282 1562814 1625547 1567487 1585336 1565304 1750440
12541A750440j2633l89126r1204L42954K12094m4838R4834m7074J25627l0393
$$ 1750440 1737807 1348681 1257477 1600431 1812525 1767687 1862521 1815447 1941074 1910681
12531A910681k42325j72606P7674P1125o8963k23010j05943J02199J52519p1419
$$ 1910681 1668356 1495750 1573424 1644549 1575586 1352576 1246633 1348832 1501351 1429932
12521A429932J36010J54149J37302N6548j86705N0367O2347J18726o2645j91272
$$ 1429932 1565942 1720091 1857393 1913941 1727236 1777603 1839950 1958676 1896031 1704759
12511A704759K09844J98214M7305m9428l2011j6402r3878J10527K66286j40348
$$ 1704759 1914603 2112817 2160122 2110694 2078683 2062281 1968403 2078930 2345216 2204868
12501B204868r5705J59330Q52o9632m0532l6882m5105n7411k02311J22016J78500
$$ 2204868 2109163 2268493 2269345 2199713 2159181 2122299 2077194 2019783 1817472 1939488 2117988
12490B117988j31558q6682K15997M17k24002J89835L72075j03720k53768j62100
$$ 2117988 1986430 1899748 2115745 2116162 1892160 2081995 2454070 2350350 2096582 1934482
12480A934482k9840k23437J18175J56323N5943J62985p8588l941N8024M6041r0875
$$ 1934482 1904642 1681205 1799380 1955703 2011646 2174631 2096043 2092102 2150126 2196167 2105292
12469B105292j38306J9880L5248O8366J49129L3381n7281L81117K46034r6209
$$ 2105292 1966986 1986866 2022114 2090480 2239609 2272990 2215709 2596826 2842860 2746651
12459B746651p0830N449k25681k67352j30012K5925J59844J24737J70550K9939
$$ 2746651 2675821 2681270 2455589 2188237 2058225 2084150 2243994 2368731 2539281 2569220
12449B569220K0119N4817J1811M0308l1285P1362j15198j47272P6209j255k08142
$$ 2569220 2589339 2644156 2655967 2696275 2664990 2736352 2621154 2473882 2550091 2548836 2340694
12438B340694n4035J74431M2587J30187j31105o5505o6017J21721J2247k0572
$$ 2340694 2286659 2461090 2503677 2633864 2502759 2437254 2371237 2492958 2505205 2484633
12428B484633N936M0235J53226J77867k56724j09610J61229P178l16932j75118
$$ 2484633 2490569 2530804 2684030 2861897 2605173 2495563 2656792 2663970 2347038 2171920
12418B171920l5527K02396K54132k4380q7453J08367K05171J47938n6097P7354
$$ 2171920 2136393 2338789 2592921 2568541 2481088 2589455 2794626 2942564 2886467 2963821
12408B963821j08281k99123K5137K4724J30785J58060K55465O5932k20509j22646
$$ 2963821 2855540 2556417 2581554 2606278 2737063 2895123 3150588 3216520 2996011 2873365
12398B873365p6407J09113J58364j33768n6985o2067q2089K94027N6847n0026
$$ 2873365 2796958 2906071 3064435 2930667 2873682 2811615 2729526 3023553 3080400 3030374
12388C030374J08711N6244j63668k94259o4959k714J76441j02360j45329O3445
$$ 3030374 3139085 3195329 3031661 2737402 2672443 2669729 2846170 2743810 2598481 2661926
12378B661926K04980K03765R7333l4034j71502k25213J18823K98648K49063J64283
$$ 2661926 2866906 3070671 3168004 3133970 2962468 2737255 2856078 3154726 3403789 3568072
12368C568072j44737m43165k20950K75429J82102L8582K46274N4599k80470J9835
$$ 3568072 3423335 2980170 2759220 3034649 3216751 3255333 3501607 3556206 3275736 3295571
12358C295571J18647o9308k40361K47113j1229P8461R6874R113K8294m6327j31752
$$ 3295571 3414218 3344910 3104549 3351662 3340433 3418894 3515768 3524881 3553175 3506848 3375096
12347C375096J66432N3869j25079j69592P3773J54810J87654P8355J21461K5768
$$ 3375096 3541528 3595397 3470318 3300726 3374499 3529309 3716963 3795318 3916779 3942547
12337C942547k76764r6378m554J17433j1206r8726J78778J32767K8761k11247
$$ 3942547 3665783 3569405 3564851 3682284 3671078 3572352 3751130 3883897 3912658 3701411
12327C701411Q6901J27267j15623j43840l6619J64056k29392N864l9648K7910
$$ 3701411 3788312 3915579 3799956 3656116 3619497 3783553 3554161 3560025 3520377 3548287
12317C548287L86674K10507J67415P7326k7119j26200O99J01401M4949O9999N5152
$$ 3548287 3934961 4145468 4312883 4390209 4363090 4236890 4237589 4338990 4383939 4453938 4509090
12306D509090J17668j64525j23645J89421K77835n8367j02065k27940j66773K0502
$$ 4509090 4626758 4462233 4338588 4528009 4805844 4747477 4645412 4417472 4250699 4271201
12296D271201J51840K43102j09864J54555K76915O9096k6699j59484k13577L6981
$$ 4271201 4423041 4666143 4556279 4710834 4987749 5056845 5030146 4870662 4657085 4694066
12286D694066j2496l27754L9039Q8714J39229K52449J86910j28645k72388M2638
$$ 4694066 4681570 4353816 4392855 4481569 4620798 4873247 5060157 4931512 4659124 4701762
12276D701762Q1604L9253M2351N8527j3159k986J11356M2216M7969J01884l4482
$$ 4701762 4783366 4822619 4864970 4923497 4910338 4907352 5018708 5060924 5108893 5210777 5176295
12265E176295j11468j40701j81085K66187J35790R2453k8544J18770l6537M9354
$$ 5176295 5064827 4924126 4743041 5009228 5145018 5237471 5208927 5327697 5291160 5340514
12255E340514J07189J81017J63902k26370k50359r2589M765L0833M42435J48628
$$ 5340514 5447703 5628720 5792622 5566252 5315893 5223304 5228069 5258902 5701337 5849965
12245E849965k7820L6100j25431J07666q9654J04135J29866M093O0188j2583N1562
$$ 5849965 5822145 5858245 5732814 5840480 5750826 5854961 5984827 5988920 6049108 6036525 6088087
12234F088087j32430l76645J62074R1733l0790L48148q9016J15387P0892k5483
$$ 6088087 5955657 5579012 5741086 5832819 5802029 6150177 6061161 6176548 6247440 6221957
12224F221957k08106J19402O63804K2563j91117l1457K9681j40827L1207J95870
$$ 6221957 6013851 6133253 6797057 6819620 6628503 6597046 6626727 6485900 6517107 6712977
12214F712977Q9879R6828l00712q9313J52963P9266j65241p9859J94826M24112
$$ 6712977 6802856 6899684 6598972 6509659 6662622 6741888 6576647 6496788 6691614 7115726
12204G115726L24784l05521k13430J23929q5723j62633j91877K85235J03409p4328
$$ 7115726 7440510 7134989 6921559 7045488 6959765 6797132 6605255 6890490 6993899 6919571
12194F919571L1589K47867K53689K82642j15615l10204j9548Q7370J60657L48334
$$ 6919571 6951160 7199027 7452716 7735358 7619743 7309539 7289991 7377361 7538018 7886352
12184G886352J66542r6443O8958m3498L7595R8403P7685J30809j45981k24704
$$ 7886352 8052894 7956451 8025409 7981911 8019506 8117909 8195594 8326403 8180422 7955718
12174G955718K23469R4074J66295K20521O0716O839k35861L821L54372k4555l03528
$$ 7955718 8179187 8273261 8439556 8660077 8720793 8727632 8491771 8495592 8849964 8825409 8521881
12163H521881J01165L69397K03897O5176J126k20388M6118J22131j0742J65519
$$ 8521881 8623046 8992443 9196340 9261516 9262642 9042254 9088372 9210503 9199761 9365280
12153I365280P5688l7936O5967j5135J21417o5460j3256K05729L16472L26412
$$ 9365280 9440968 9403032 9468999 9453864 9575281 9509821 9496565 9702294 10018766 10345178
12143A0345178j13609q9082O1209N6414J14339J45119R3329R8085o6188N8059
$$ 10345178 10231569 10142487 10203696 10260110 10374449 10519568 10612897 10710982 10644794 10702853
12133A0702853Q4619m7980P4517J06322J17104j7332J59098K5714Q88M7010J97380
$$ 10702853 10787472 10739492 10814009 10920331 11037435 11020103 11179201 11204915 11205803 11252813 11450193
12122A1450193K13542J06819J44055m2306j20927j0333J01939J74047R4531N281
$$ 11450193 11663735 11770554 11914609 11872303 11751376 11741043 11842982 12017029 12111560 12116841
12112A2116841K11761K04317M5239Q0629O6817k55223r8522J17230J13425J41894
$$ 12116841 12328602 12532919 12578158 12658787 12725604 12470381 12371859 12489089 12602514 12744408
12102A2744408J76891k1351K55605K43703k21338Q6255J36092M04684K05326K67129
$$ 12744408 12921299 12899948 13155553 13399256 13177918 13264173 13400265 13804949 14010275 14277404
12092A4277404K9107J41679l9435Q2161J62597o2550R9462J67903K02199K45216
$$ 14277404 14306511 14448190 14408755 14490916 14653513 14590963 14690425 14858328 15060527 15305743
12082A5305743r7563O3280K2519J56885P5070L33560K29880j57703J64878J41104
$$ 15305743 15208180 15271460 15293979 15450864 15525934 15859494 16089374 15931671 16096549 16237653
12072A6237653M9430K25854Q4780K16913j919N5850K00001N1742Q1466J11658
$$ 16237653 16287083 16512937 16597717 16814630 16812711 16868561 17068562 17120304 17201770 17313428
12062A7313428R9640M5843M2559k26657J53085M19513J04790P2739J28398K11401
$$ 17313428 17413068 17458911 17501470 17274813 17427898 17847411 17952201 18024940 18153338 18364739
12052A8364739J26023J0665Q5096J26490K35982J33048M630K37862M11581K40824
$$ 18364739 18490762 18501427 18586523 18713013 18948995 19082043 19086673 19324535 19736116 19976940
12042A9976940m4016J60297J77884l5472J0096L0346J88969K48993J73835J80957
$$ 19976940 19932924 20093221 20271105 20235633 20245729 20276075 20465044 20714037 20887872 21068829
12032B1068829K58591P503P7562L22828j0516K13531N4648R7932Q9672K65370
$$ 21068829 21327420 21334923 21412485 21735313 21724797 21938328 21992976 22090908 22180580 22445950
12022B2445950K33682O6242J94488J02634J88099q382o7349J21327L63305K60765
$$ 22445950 22679632 22745874 22940362 23042996 23231095 23222713 23155364 23276691 23639996 23900761
12012B3900761K55717O09528K81976j6953k54583j914J54201n8558J92989J21298
$$ 23900761 24156478 24766006 25047982 25031029 24776446 24774532 24928733 24870175 25063164 25184462
12002B5184462J21565M67858J31595j95884J55495K08991K74076L24131M02347
$$ 25184462 25306027 25773885 25905480 25709596 25865091 26074082 26348158 26672289 27074636
11993B7074636K09684m4714L3819O7676R7456L44492L36393J66440K68092M9392
$$ 27074636 27284320 27239606 27273425 27341101 27438557 27783049 28119442 28285882 28553974 28603366
11983B8603366j61984J60086K68820J19774J87480K0832j15414J45410L52895
$$ 28603366 28441382 28601468 28870288 28990062 29177542 29198374 29082960 29228370 29581265
11974B9581265L12327L29936L00137K70641J41819j42303p3819j312J41866J81564
$$ 29581265 29893592 30223528 30523665 30794306 30936125 30793822 30720003 30718691 30860557 31042121
11964C1042121K15988j16251J49140J72723L56862J79934n3487P4509M6208J60659
$$ 31042121 31258109 31141858 31290998 31463721 31820583 32000517 31947030 32021539 32067747 32228406
11954C2228406K00199K29925L29778J70897j44057k101K18975J1700j6206J00398
$$ 32228406 32428605 32658530 32988308 33159205 33015148 33013047 33232022 33243722 33227516 33327914
11944C3327914J1887J24272J80309k1629j7589J54178N6534M2438J23545p1585
$$ 33327914 33339801 33464073 33644382 33622753 33605164 33759342 33815876 33858314 33981859 33910274
11934C3910274M1933J08768J24744J20960K15871K56436J40695j31378k71717
$$ 33910274 33952207 34060975 34185719 34306679 34522550 34778986 34919681 34788303 34516586
11925C4516586j44883J78919J89249j92308p6089J92752L41114Q6548o7142p6320
$$ 34516586 34371703 34550622 34739871 34547563 34471474 34664226 35005340 35091888 35024746 34948426
11915C4948426J79672k5781j74693O5613J24518j3027j48371j92697j93036J18816
$$ 34948426 35128098 35102317 34927624 34993237 35117755 35104728 34956357 34763660 34570624 34689440
11905C4689440M5217j67065M6804J02755n7203p8663k39941m3974J53284K60577
$$ 34689440 34734657 34567592 34614396 34717151 34659948 34581285 34341344 34297370 34450654 34711231
11895C4711231J89682l6588l16496k54623p3270J04441o8619L1309k41493q6911
$$ 34711231 34900913 34864325 34547829 34293206 34219936 34324377 34255758 34287067 34045574 33958663
11885C3958663j53675L4511J40119k57799k67804k26006m0320m508N2639j93216
$$ 33958663 33804988 33839499 33979618 33721819 33454015 33228009 33187689 33183181 33235820 33042604
11875C3042604k70088l9435q0602n9977J17368k53577K4749j78023k50987k63571
$$ 33042604 32772516 32733081 32652479 32592502 32709870 32456293 32481042 32303019 32052032 31788461
11865C1788461q1853j93897j90653k9283j10223J40213o9859L964j75946j58810
$$ 31788461 31706608 31512711 31322058 31292775 31182552 31322765 31252906 31256870 31080924 30922114
11855C0922114m1133n1143k52926j52355j12137k37528N0795j74886j18371L3033
$$ 30922114 30880981 30829838 30576912 30424557 30312420 30074892 30125687 29950801 29832430 29865463
11845B9865463k14085j15642l4415k15823p1452l53347q3686j08745k83392k93662
$$ 29865463 29651378 29535736 29501321 29285498 29214046 28860699 28777013 28668268 28384876 28091214
11835B8091214k52703J9416k31554l90207j60726O2210j46922j01393j16768j34237
$$ 28091214 27838511 27857927 27626373 27236166 27075440 27137650 26990728 26889335 26772567 26638330
11825B6638330k60975l87845P6024j4516k7788R718k99000l70809k03547J13045
$$ 26638330 26377355 25989510 26065534 26051018 26023230 26032948 25733948 25363139 25159592 25272637
11815B5272637k61982j24594n0930j04743m6869k72312k16536j64023j92632j94775
$$ 25272637 25010655 24886061 24835131 24730388 24683519 24411207 24194671 24030648 23838016 23643241
11805B3643241k7764p6443l30663k32769j51118j36342k00853j33502j12245j26669
$$ 23643241 23615477 23539034 23208371 22975602 22824484 22688142 22487289 22353787 22241542 22114873
11795B2114873r1680K9492j81230j67275j72962j82497j52333r0324l0078k35856
$$ 22114873 22023193 22052685 21871455 21704180 21531218 21348721 21196388 21106064 21075986 20840130
11785B0840130q8599J69017k93992j77380k32635q0089O8174l67598r0976k04180
$$ 20840130 20751531 20920548 20626556 20449176 20216541 20136452 20204626 19837028 19746052 19541872
11775A9541872j02277j74357N6166M0506m37877k89340J06204J60802J14851j79254
$$ 19541872 19439595 19265238 19321404 19361910 18924033 18634693 18740897 18901699 19016550 18837296
11765A8837296n17694m54848j21407J70813J20778k63753k47391j44801K9781
$$ 18837296 18319602 17864754 17743347 17914160 18034938 17771185 17523794 17378993 17408774
11756A7408774J34911j98989l21860k94652l5316j16174n5885r8843K0711l5830
$$ 17408774 17543685 17344696 17022836 16728184 16692868 16576694 16520809 16421966 16442677 16406847
11746A6406847j26761l63775P6383N7503m6314j24801j28791m28960k07474K62299
$$ 16406847 16280086 15916311 15992694 16050197 16003883 15879082 15750291 15321331 15113857 15376156
11736A5376156m6031k58381k30100N6350J67913K0972j60893k40915J07058K07517
$$ 15376156 15330125 15071744 14841644 14897994 15065907 15086879 14925986 14685071 14792129 14999646
11726A4999646l63356j22468j51139k26873k09983M2269K705n4233j90982k38761
$$ 14999646 14636290 14513822 14362683 14135810 13925827 13968096 13970801 13916568 13725586 13486825
11716A3486825m4632j40269j24949j65546m3216m1750n7810J25335J9747j40248
$$ 13486825 13442193 13301924 13176975 13011429 12968213 12926463 12868653 12993988 13013735 12873487
11706A2873487l16458k74861J7713J46368j4443L4180j61804l33717j68820O5235
$$ 12873487 12557029 12282168 12299881 12446249 12431806 12465986 12304182 11970465 11801645 11866880
11696A1866880M5414K4369K8710j60117p2532j27200J01810K0489k69981q3207
$$ 11866880 11912294 11936663 11965373 11805256 11732724 11605524 11707334 11727823 11457842 11374635
11686A1374635k7030k50462k08789j20921q123j39736r3366l5723K45169J39138
$$ 11374635 11347605 11097143 10888354 10767433 10759310 10619574 10526208 10490485 10735654 10874792
11676A0874792k9370j99552p6004K9481k09485j40414l6864J78132k04921k98431
$$ 10874792 10845422 10645870 10569866 10599347 10389862 10249448 10212584 10390716 10185795 9887364
11666I887364q4917L49004k17553j65800J17354l7022j72577J05831q9357j26191
$$ 9887364 9802447 10151451 9933898 9768098 9885452 9848430 9675853 9781684 9692327 9566136
11656I566136m246j32474k0729M0667j25524l37353O9032j5023J3097q1916p9166
$$ 9566136 9561890 9429416 9408687 9449354 9323830 8986477 9055509 9040486 9053583 8971667 8892501
11645H892501J09556n3265M2947k60143j83281Q7281j51573j34056j30032o3753
$$ 8892501 9002057 8948792 8991739 8731596 8548315 8635596 8484023 8349967 8219935 8156182
11635H156182j40642J15201J18709K51570J05082q3399k93420m04896k5953k28296
$$ 8156182 8015540 8130741 8249450 8501020 8606102 8522703 8229283 7824387 7798434 7570138
11625G570138m263P6423L0370J0064J31180K70775j34048R523k42896k97477J724
$$ 7570138 7565875 7642298 7672668 7682732 7813912 8084687 7950639 7960162 7717266 7419789 7421513
11614G421513J51737R1608k69385n20909k39208j59222K81888K66890k4333k50248
$$ 7421513 7573250 7664858 7395473 6874564 6635356 6476134 6758022 7024912 7000579 6750331
11604F750331j84701K3435J68977q0302k03725J76708K32719k3425j37104J2116
$$ 6750331 6565630 6589065 6758042 6677740 6474015 6650723 6883442 6860017 6722913 6735029
11594F735029R9806j94745k36029k82731o9282J6946K31327J02961l32159l89640
$$ 6735029 6834835 6640090 6404061 6121330 6052048 6068994 6300321 6403282 6071123 5681483
11584E681483j80533O3803L22412J65938j17072n5585l613j06451M4785m4632
$$ 5681483 5500950 5564753 5887165 6053103 5936031 5880446 5876833 5770382 5815167 5770535
11574E770535j21774j30578j07162J93437L416O4986m9847o9184k9437J63230
$$ 5770535 5648761 5518183 5411021 5604458 5607874 5672860 5623013 5553829 5524392 5687622
11564E687622j8622r721j30585K17743J25722j13015m05764k98992Q3828J00666
$$ 5687622 5669000 5659279 5528694 5746437 5872159 5759144 5353380 5054388 5138216 5238882
11554E238882o846K2221p6190N0787n8704j36162J08607K2036o9611j8331J14482
$$ 5238882 5232036 5254257 5178067 5228854 5170150 5033988 5142595 5164631 5095020 5076689 5191171
11543E191171m5660j03270k31152p3459O0898K07256j49262o9733q8199J11669
$$ 5191171 5145511 5042241 4811089 4737630 4798528 5005784 4856522 4786789 4698590 4810259
11533D810259k9161K2631o8507n1502J98285P5547l2026j64456j60256L6848N8435
$$ 4810259 4781098 4803729 4735222 4683720 4882005 4957552 4925526 4761070 4600814 4637662 4696097
11522D696097k75990j54917J7939k3364J96670k1304j52274n6959r0508l2774
$$ 4696097 4420107 4265190 4283129 4259765 4456435 4435131 4282857 4225898 4135390 4102616
11512D102616J04759J60615r6089J07815j6988n547n7142J0702J55812k85065
$$ 4102616 4207375 4367990 4271901 4379716 4362728 4357181 4300039 4310741 4466553 4181488
11502D181488k60138L2349J33782J04425N6070k4057k00770q0300Q5100L5122
$$ 4181488 3921350 3953699 4087481 4191906 4247976 4223919 4023149 3942849 4027949 4063071
11492D063071k91815l18900j88220J49012K61760K23620J85350k7542q5121j86462
$$ 4063071 3771256 3452356 3264136 3413148 3674908 3898528 4083878 4056336 3971215 3784753
11482C784753L3537m1914j07913N9413l32242k953N0332J6293j06086j17073J45115
$$ 3784753 3818290 3776376 3668463 3727876 3395634 3392681 3443013 3459306 3353220 3236147 3381262
11471C381262j67934j74041J26462j32829K16259K17892l6609k11190r1969J65812
$$ 3381262 3213328 3039287 3165749 3032920 3249179 3467071 3430462 3219272 3127303 3293115
11461C293115O6119O7023k0780r3831L0439J40277J52322j20259j3680j23689
$$ 3293115 3359234 3426257 3405477 3311646 3342085 3482362 3634684 3514425 3500745 3377056
11451C377056k34462p2670K05994Q5603j48219k00019q1016J37635j19655J4700
$$ 3377056 3142594 3069924 3275918 3361521 3213302 3013283 2932267 3069902 2950247 2964947
11441B964947j11480N3667K57412R7908l7079K03018k8295k72710j55253J04691
$$ 2964947 2853467 2907134 3164546 3262454 3225375 3428393 3400098 3127388 2972135 3076826
11431C076826n9586l3773m7395k21913J7012J41464m4811J05488N6762k75749
$$ 3076826 3017240 2983467 2936072 2714159 2731171 2872635 2827824 2933312 2990074 2714325
11421B714325k67442j32878J88059K21115O3513J28670M218j35530k68490n251
$$ 2714325 2446883 2314005 2502064 2723179 2786692 2915362 2919580 2784050 2515560 2510309
11411B510309M2911J48287N5700p6786l41822o9407J94475L27526J06019j93037
$$ 2510309 2553220 2701507 2757207 2680421 2338599 2269192 2463667 2791193 2897212 2704175
11401B704175k02243J48796J76364J33923l00860j68369J61660M1316n1779j89420
$$ 2704175 2501932 2650728 2827092 2961015 2660155 2491786 2653446 2694762 2642983 2453563
11391B453563L8505R3961j26971l66251n7215K23658N618L0998J05097j04400
$$ 2453563 2492068 2586029 2459058 2092807 2035592 2259250 2264868 2295866 2400963 2296563
11381B296563j74229J94730K3881n3412R6650o342l3742j76519J34549R2663J48325
$$ 2296563 2122334 2317064 2340945 2287533 2384183 2377841 2344099 2167580 2302129 2394792 2543117
11370B543117J03799j48136j13550j15156j05448n3725N8702O4164J0247M9832
$$ 2543117 2646916 2498780 2385230 2270074 2164626 2110901 2169603 2233767 2244014 2293846
11360B293846k4141k5430k32859j07586J92961K29612N9146N0696J3444Q1526
$$ 2293846 2269705 2244275 2011416 1903830 2096791 2326403 2385549 2436245 2449689 2531215
11350B531215k02035k11138j30444N6238J58804M6489j18093r0722j9394j85149
$$ 2531215 2329180 2118042 1987598 2043836 2202640 2249129 2131036 2040314 2020920 1835771
11340A835771M8022o797o5017K5524j41719l6196P6424K07132K03324l9628j42569
$$ 1835771 1883793 1876996 1811979 1837503 1695784 1659588 1736012 1943144 2146468 2106840 1964271
11329A964271n3122m9708j22568N7571N023j6196P0261m0561j49193P0755P3130
$$ 1964271 1911149 1861441 1738873 1796444 1801467 1785271 1855532 1814971 1665778 1736533 1809663
11318A809663o1309Q9155O2844j62686Q3053K99913j16122l18327j52290K32134
$$ 1809663 1748354 1837509 1900353 1737667 1820720 2120633 2004511 1686184 1533894 1766028
11308A766028K6392J02315r1987k18619o2622n516J44186K81942Q9967k09400
$$ 1766028 1792420 1894735 1802748 1584129 1521507 1515991 1660177 1942119 2032086 1822686
11298A822686l1748J22140j36484l28203Q3886J78606j50473q7304l1642k6733
$$ 1822686 1790938 1913078 1776594 1448391 1532277 1710883 1560410 1473106 1441464 1414731
11288A414731j9643m1977L6732M2972L81653K68429j53536O3897L28016j06290
$$ 1414731 1395088 1353111 1389843 1432815 1814468 2082897 1929361 1993258 2321274 2214984
11278B214984j41347j65988r6854j2313q1924r3695J92626N1482j60921J2618
$$ 2214984 2073637 1907649 1810795 1798482 1716558 1622863 1815489 1866971 1706050 1718668
11268A718668N3906k6172k70315j6365J39067K33184J25638j97567k58580k93331
$$ 1718668 1772574 1746402 1476087 1459722 1598789 1831973 1957611 1760044 1501464 1208133
11258A208133o7550J28774J10485J53043j8125j24801j53153P0029L02907R8755
$$ 1208133 1140583 1269357 1379842 1532885 1514760 1389959 1236806 1306835 1609742 1708497
11248A708497M3698j83653k39734k4286J29101M6929J25347L2909J58190q6644
$$ 1708497 1752195 1568542 1328808 1304522 1433623 1480552 1605899 1638808 1796998 1710354
11238A710354k48245o0402J31967o2492L07802n6810o6025L9552N7471k19293
$$ 1710354 1462109 1401707 1533674 1471182 1778984 1722174 1656149 1695701 1753172 1533879
11228A533879m0518m8817p1805o5134q7347K21637J47078j44337j1541N2656J79108
$$ 1533879 1493361 1444544 1372739 1307605 1220258 1441895 1588973 1444636 1433095 1485751 1664859
11217A664859j27173j49571k00565J55118J44510J97360m6025N0762K8546l5766
$$ 1664859 1537686 1388115 1187550 1342668 1487178 1684538 1638513 1689275 1717821 1682055
11207A682055K22121j13783j14952Q0940L7658K77322M68926K80558L35372M83243
$$ 1682055 1904176 1790393 1675441 1756381 1794039 2071361 2540287 2820845 3156217 3639460
11197C639460O04522P58227M19779L54019j01549p63315p46650l84338m08940
$$ 3639460 4243982 5002209 5421988 5776007 5674458 4911143 4164493 3780155 3371215
11188C371215p39437o65407l22636J68988J33307q1548k50998j66431o1210l875
$$ 3371215 2631778 1966371 1643735 1812723 1946030 1864482 1613484 1447053 1385843 1381968
11178A381968J02881J26283j37036J33340J01860o3410J9627J00403K7446N9819
$$ 1381968 1484849 1611132 1474096 1607436 1709296 1645886 1665513 1765916 1793362 1853181
11168A853181J49663J18698j09555m51367j40653j10639J0035L6627l0816k14724
$$ 1853181 2002844 2121542 2011987 1560620 1419967 1309328 1319363 1355990 1325174 1110450
11158A110450k8405J45436Q9166m5525j41837N5951J08309L841M3767m8912K23934
$$ 1110450 1082045 1227481 1316647 1271122 1129285 1185236 1293545 1297386 1341153 1292241 1516175
11147A516175m5550j94758j30590K07235L6768M843K83922r6262j58269k16056
$$ 1516175 1470625 1275867 1145277 1352512 1389280 1394123 1678045 1581783 1423514 1207458
11137A207458j23479J13508K82199l3613k58043L4846M113N0803j27596j06001
$$ 1207458 1083979 1197487 1479686 1446073 1188030 1222876 1226989 1277792 1150196 1044195
11127A044195J8932k1090P4377L2347q2459P7468r274J46535R6349P0367o7070
$$ 1044195 1063127 1042037 1116414 1148761 1066302 1143770 1134496 1281031 1377380 1447747 1380677
11116A380677k23267j06888K0109j09238k32474J66660J14503N0058L7213M7576
$$ 1380677 1157410 1050522 1070631 961393 728919 895579 1010082 1060140 1097353 1144929
11106A144929J55767J7503r3299m3471K7199q9580k10554k03124J62469o6417
$$ 1144929 1300696 1318199 1224900 1181429 1208628 1119048 908494 705370 867839 801422
11096H01422K17256J99781M7807M4602J50587K538n7044m06796j16110P0589O6255
$$ 801422 1018678 1218459 1266266 1310868 1461455 1463993 1406949 1000153 884043 954632 1020887
11085A020887m6472p9889J4928o2280L0934l3850K7925n111j55214r2058J03702
$$ 1020887 974415 894526 909454 847174 878108 844258 872183 867072 711858 619800 723502
11074G23502j08972j60116R6942K91311o9092K2045J62581J37864q8892k86440
$$ 723502 614530 454414 551356 842667 773575 795620 958201 1096065 1007173 720733
11064G20733q1425J29412j04039R0286J37999O4406r2816M2447K79535Q2168j07775
$$ 720733 639308 768720 664681 754967 892966 957372 864556 907003 1186538 1268706 1160931
11053A160931P6453O9675K9044j52475M8823j97884k71815k07423J46616J48702
$$ 1160931 1237384 1307059 1336103 1183628 1232451 1034567 762752 555329 701945 850647
11043H50647K55900L28167Q5644j85699n3631M02382K71947j15594o7767R4211
$$ 850647 1106547 1434714 1520358 1334659 1281028 1683410 1955357 1839763 1771996 1866207
11033A866207n6509O1156M383L3585J18457K16611K28635J04335p2063l6158j19276
$$ 1866207 1809698 1870854 1875237 1908822 2027279 2243890 2472525 2576860 2504797 2468639 2349363
11022B349363m8946J20514j30515j614K02944J56188L5153j81869K42551L07178
$$ 2349363 2300417 2420931 2290416 2288802 2491746 2647934 2683087 2501218 2743769 3050947
11012C050947J66979k30350l32542J3842k8448K2542k78119j09442m9268j9835
$$ 3050947 3217926 2987576 2655034 2668876 2640428 2662970 2384851 2275409 2226141 2206306
11002B206306M2740J81591J84021j32364j34611p5715p6123k15295J3828J28789
$$ 2206306 2249046 2430637 2614658 2482294 2347683 2271968 2195845 1980550 1994378 2123167
10992B123167K37K0240j06808k63121l23553o8268J0724k02674j36184P828k05297
$$ 2123167 2123404 2143644 2036836 1773715 1450162 1381894 1392618 1189944 1053760 1061588 856291
10981H56291N950L21003J15281J49418j7116l81560j57063r6277q3458p0858K74446
$$ 856291 862241 1183244 1298525 1447943 1430827 1049267 892204 795927 712469 641611 916057
10970I16057R0600j18426r8134r3341m7742l0866K73599n6400l79459J47157k3121
$$ 916057 1006657 888231 790097 696756 649014 618148 891747 835347 455888 603045 579924
10959E79924m7000k1130J13990K441P8827J9802J40940R4013R6169M2877K26222
$$ 579924 532924 511794 625784 628225 707052 726854 867794 961807 1057976 1100853 1327075
10948A327075N93376M74899P25073O92926L77704K15361K43146j98748l89866
$$ 1327075 1920451 2395350 3120423 3813349 4191053 4406414 4649560 4450812 4060946
10939D060946m55223n58137m52864l35232l67130l17154k98959j69057M4828k0933
$$ 4060946 3605723 3047586 2594722 2259490 1892360 1575206 1276247 1107190 1152018 1131085
10929A131085p3377J15816l9157j98464j39385P9044j99807j26659K08881K46772
$$ 1131085 1057708 1173524 1134367 935903 796518 875562 675755 549096 757977 1004749
10919A004749o2510k26960k07710J45730K9241J35413N4832q9335k3745Q0111
$$ 1004749 942239 715279 507569 653299 682540 817953 872785 783450 759705 839816
10909H39816K06717J83628j38920l31030J58750P0060K4112j22063k21897m2926
$$ 839816 1046533 1230161 1091241 760211 918961 989021 1013133 891070 669173 626247
10899F26247P0740p6110R968N2935l4376k2506K4784p4936O0869L2270r5112r1748
$$ 626247 696987 620877 630845 683780 649404 626898 651682 576746 637615 669885 574773 483025
10887D83025K005m0614Q7483j9697q4585M4786j10741J83136K08050P5452Q0051
$$ 483025 485030 444416 531899 512202 427617 472403 361662 544798 752848 828300 908351
10876I08351r2926j53438q174k62962k36748K08579J95306m3001k03855k4426
$$ 908351 815425 661987 653813 390851 154103 362682 557988 514987 311132 286706
10866B86706J56251Q3218m4451k3732J04651M1904j81449k6142j59785j68289
$$ 286706 442957 526175 481724 457992 562643 604547 423098 396956 237171 68882
10856F8882K22453n7717P755N104M0544L9791O29J80745J86011Q952l53349k54857
$$ 68882 291335 233618 241373 246477 287021 326812 327441 508186 694197 703149 349800 94943
10844I4943J55486M55096j28003l2846j68443j40847J05285K70252K123M7818
$$ 94943 250429 705525 577522 544676 376233 235386 340671 610923 613046 660864
10834F60864p74j23622k45736j01468Q1935J18222J20193l17855r7468O7382j1076
$$ 660864 660090 536468 290732 189264 271199 389421 509614 191759 94291 161673 150597
10823A50597k52663Q5066J42421k3134Q4206K15885l8324k3887N5108O3516J33883
$$ 150597 -102066 -17000 125421 102287 186493 402378 364054 340167 395275 458791 592674
10812E92674M5793j50102k65749k50200j07410m251J18939P2810j06937M6044
$$ 592674 638467 488365 222616 -27584 -134994 -139245 -20306 52504 -54433 -8389
10802h389J06265R6708J18248j66792k91952J03330J69560j04529r9591n0591
$$ -8389 97876 194584 312832 146040 -145912 -42582 126978 22449 -77142 -127733
10792a27733K68531o9659R932K36376J03795q6546N9400o757l3467N1630m6148
$$ -127733 140798 71139 81071 317447 421242 334696 394096 387339 353872 405502 359354
10781C59354j05518k01242j91536O5889Q4410Q5483L6021n6518J00790p9231K2836
$$ 359354 253836 52594 -138942 -73053 11357 96840 132861 76343 177133 97902 120738
10770A20738L09142L00230J05878j08786l23691j38349Q5740j06299j1656O3797
$$ 120738 429880 730110 835988 727202 403511 265162 350902 244603 232947 296744
10760B96744N7721k9381j34828j23522j83595J20865K10580K56214J11393k53649
$$ 296744 354465 325084 190256 66734 -116861 4004 214584 470798 582191 328542
10750C28542j27196l1383j78444q3839N0318J63280J45139l5679j01455J06781
$$ 328542 201346 169963 -8481 -92320 -42002 121278 266417 230738 129283 236064
10740B36064K6251j05624m658n3922n7851K22951M38756J12962K6096j41233p7918
$$ 236064 262315 156691 152033 98111 40260 263211 701967 814929 841025 699792 621874
10729F21874J86366K55867j73866J5755M98665L10614j62079j63900j47888K03135
$$ 621874 808240 1064107 890241 905996 1404661 1715275 1553196 1389296 1241408 1444543
10719A444543K77470O8005J33980j24654K25612L18666p034J8678R2620j70363
$$ 1444543 1722013 1790018 1923998 1799344 2024956 2343622 2336588 2355266 2447886 2277523
10709B277523n2194K54154M26846J63074N3598K96596l012M31j54198o9438j17509
$$ 2277523 2225329 2479483 2906329 3069403 3123001 3419597 3416585 3417016 3262818 3193380 3075871
10698C075871J20376P1448J29772J02065k3942l51669k16432J37280Q7657k56961
$$ 3075871 3196247 3267695 3397467 3499532 3475590 3123921 2907489 3044769 3132426 2875465
10688B875465j41093l7773J80519K33039J01534J99892N990p0976m7937j57848
$$ 2875465 2734372 2696599 2877118 3110157 3211691 3411583 3417573 3346597 3298660 3140812
10678C140812k75916j12011K7781R2714J16540J29211J02679M6812K00809J17408
$$ 3140812 2864896 2752885 2780666 2873380 2989920 3119131 3221810 3268622 3469431 3586839
10668C586839J96705K85119L82404R01077J015137J097246J323976J272780R29067
$$ 3586839 3783544 4068663 4451067 5352144 6367281 7464527 8788503 10061283 10990350
10659A0990350N20784M08399m24527j068347j191098j131959j036183q95408m86429
$$ 10990350 11511134 11919533 11495006 10426659 9235561 8103602 7067419 6172011 5685582
10650E685582J3940q777j47056L4386j35602K96841J76835Q3912L20748O6569
$$ 5685582 5699522 5690745 5543689 5578075 5442473 5739314 5916149 6000061 6320809 6387378
10640F387378j0749q6798J26676o5063q2861k04222k94344L0835M03951M60315
$$ 6387378 6376629 6289831 6416507 6351444 6268583 6064361 5770017 5800852 6204803 6665118
10630F665118O49480N91639P28934J286382J387222J342576J369461J198441J138351
$$ 6665118 7314598 7906237 8635171 9921553 11308775 12651351 14020812 15219253 16357604
10621A6357604R25456P21563J363452J801747K398079L724330M873788O517443
$$ 16357604 17283060 18004623 19368075 21169822 23567901 27292231 32166019 38683462
10613C8683462Q293611J0313014J2804054J4994597J5440802J4362717J1838438
$$ 38683462 46977073 57290087 70094141 85088738 100529540 114892257 126730695
10606A26730695R274887N908618K176186L90591K213698P046432J3673166K0714425
$$ 126730695 136005582 141914200 144090386 144480977 146694675 153741107 167414273 188128698
10598A88128698K6195789K7571403K4458453J8801441J1118129J563674p747574
$$ 188128698 214324487 241895890 266354343 285155784 296273913 297837587 290090013
10591B90090013j2022959q639948L87738J1868367K3326257L1109305L2020112
$$ 290090013 278067054 269427106 269814844 281683211 305009468 336118773 368138885
10584C68138885K6526050J6232232L721416j1267563k5704229l2335189k8822048
$$ 368138885 394664935 410897167 414618583 403351020 377646791 345311602 316489554
10577C16489554j8419741o500884L910375J0896874J2642247Q908688J962615
$$ 316489554 298069813 291568929 295479304 306376178 319018425 327927113 329889728
10570C29889728o877090j6738335k5755195k8981161k5300457j8347570j0832330
$$ 329889728 323012638 306274303 280519108 251537947 226237490 207889920 197057590
10563A97057590m735253j277936l16239j742514m447842q079389j2542727j5854309
$$ 197057590 192322337 191044401 190728162 188985648 184537806 176458417 163915690 148061381
10555A48061381j7007162j5707230j3322467j0567031p972905o469128m899525
$$ 148061381 131054219 115346989 102024522 91457491 83484586 77015458 72115933
10548G2115933l737612l466879l027345k695466k643149k444458k304840j908285
$$ 72115933 68378321 64911442 61884097 59188631 56545482 54101024 51796184 49887899
10540D9887899j759121j721300j475292j253273j272471j357497j158781q47789
$$ 49887899 48128778 46407478 44932186 43678913 42406442 41048945 39890164 39042375
10532C9042375r08741j042957r07495j077020r71989q52508j053396q91522q42823
$$ 39042375 38133634 37090677 36183182 35106162 34134173 33281665 32228269 31336747 30493924
10523C0493924q36405o47354l34812n30063n89522n12074o47239o13058q89258
$$ 30493924 29657519 29010165 28675353 28145290 27555768 27043694 26396455 25783397 24894139
10514B4894139n08607l91928n47603m98901n13228o65734n25416m99796n71541
$$ 24894139 24385532 23993604 23446001 22947100 22433872 21768138 21242722 20742926 20171385
10505B0171385l31103q3065k44738m25422n96350m03819k70460o39328n06958
$$ 20171385 19840282 19757217 19512479 19087057 18490707 18086888 17816428 17177100 16670142
10496A6670142l61637k49507k9757k17502m87162n12217k28319j92848k97419
$$ 16670142 16308505 16058998 16029241 15811739 15324577 14812360 14584041 14391193 14093774
10487A4093774l31704J612k95952o7945j97200l54748j26597j26218j73278j50174
$$ 14093774 13762070 13763682 13467730 13399785 13202585 12847837 12721240 12595022 12421744 12271570
10477A2271570Q9788r9281J4064P5781p3970k14693l96390j80615k09582J62102
$$ 12271570 12361358 12262077 12276141 12351922 12277952 12063259 11666869 11486254 11276672 11438774
10467A1438774J7395n8749K29553J88695M41942J55020j57335j48917k73500k59673
$$ 11438774 11456169 11397420 11626973 11815668 12257610 12412630 12255295 12106378 11832878 11573205
10457A1573205N9529j12249l74425j17712M7779K46948K61903J07062k48829l26567
$$ 11573205 11632734 11520485 11146060 11028348 11076127 11323075 11584978 11692040 11443211 11116644
10447A1116644l97891J7679j35062j40083m26418j4599K31038l3855j12506j20379
$$ 11116644 10718753 10736432 10601370 10461287 10034869 10020270 10251308 10217453 10104947 9984568
10437I984568o6846j17592j15214m32129k45962j20361k65229j94463P8052K83550
$$ 9984568 9917722 9800130 9684916 9252787 9006825 8886464 8621235 8426772 8504824 8788374
10427H788374j67258l60047l35153k09249l92058m37080k6348k06939l9266K31476
$$ 8788374 8621116 8261069 7925916 7716667 7324609 6887529 6861181 6654242 6614976 6846452
10417F846452L4572k03146j26240k26939j18676l18838k46811o7807m7943M8991
$$ 6846452 6881024 6677878 6551638 6324699 6206023 5887185 5640374 5572567 5524624 5573615
10407E573615j29986m70204o7096J67267j81889j30881j26939l4869K20222J5674
$$ 5573615 5443629 4973425 4906329 5073596 4891707 4760826 4633887 4599018 4819240 4834914
10397D834914k44848j72287q6755k02661m6573m1762j18009j56100j04879j34840
$$ 4834914 4590066 4417779 4331024 4128363 4081790 4040028 3922019 3765919 3661040 3526200
10387C526200J10222j45895n2067K36186Q9962m6124N8945l1829j93977J36421
$$ 3526200 3636422 3490527 3438460 3674646 3764608 3718484 3777429 3745600 3551623 3688044
10377C688044j54887k34483L02442n2019j91379K5008M9447J16927j3701k716
$$ 3688044 3533157 3298674 3601116 3549097 3357718 3382726 3432173 3549100 3535399 3532683
10367C532683k1474k5097m33888n9041J52996K17823l7930q9529J3545j65670
$$ 3532683 3511209 3486112 3052224 2993183 3146179 3364002 3326072 3236543 3250088 3084418
10357C084418j89834j46875k6430J2864J4589J50336l6328N9120k21518k6655
$$ 3084418 2894584 2747709 2721279 2734143 2748732 2899068 2862740 2921860 2700342 2673687
10347B673687j23776o8151l4078R1230m4997o1350J43430J32778k78508q8j07128
$$ 2673687 2549911 2481760 2447682 2538912 2493915 2432565 2575995 2708773 2430265 2430177 2323049
10336B323049K93392j77010j45675L678J2160r6426K4332J66282m5142j12631
$$ 2323049 2616441 2439431 2293756 2297434 2309594 2213168 2237500 2403782 2358640 2246009
10326B246009j7966p1072K3907m9749J4593K2564Q0538j68890j79578j80840k303
$$ 2246009 2228043 2156971 2180878 2131129 2145722 2168286 2248824 2079934 1900356 1719516 1717213
10315A717213J1875j47364j04132O4391J88183N0408R755n4720j15585J76232
$$ 1717213 1729088 1581724 1477592 1541983 1730166 1780574 1790329 1735609 1620024 1796256
10305A796256r5550l6585q951K32670K36158K6045k18741j42095k16431k87998
$$ 1796256 1700706 1664121 1655170 1887840 2123998 2150043 1931302 1789207 1572776 1284778
10295A284778j65179K04303J24030N506m1379K90571n2115j06995j4465o3469
$$ 1284778 1119599 1323902 1447932 1453438 1412059 1702630 1650515 1543520 1529055 1465586
10285A465586k1873k4642r9198o7697L133O510N3850q3606l43906J94055M210
$$ 1465586 1443713 1419071 1319873 1252176 1255309 1261819 1315669 1232063 888157 1082212 1086422
10274A086422J26959P3361j94708o5027j48040J05600R3838j08683p9118L5416
$$ 1086422 1213381 1286742 1092034 1027007 878967 984567 1078405 969722 890604 926020
10264I26020J22567J46201J30281j01636o1582p2523J72754J31710N6052j20966
$$ 926020 1048587 1194788 1325069 1223433 1161851 1089328 1262082 1393792 1449844 1328878
10254A328878m22644L387K59475l3730r8484l9350K46830j73002Q6069M5383K2956
$$ 1328878 906234 909621 1169096 1135366 1036882 997532 1244362 1071360 1157429 1202812 1225768
10243A225768J28350r5814k80617n947K07998K0003j37681K1298j02252Q9987
$$ 1225768 1354118 1258304 977687 971740 1179738 1199741 1062060 1083358 981106 1071093
10233A071093L39413q9516R792K17027j19043k41248l25359j86121J7333L4231
$$ 1071093 1410506 1320990 1330782 1547809 1428766 1187518 862159 676038 693371 727602
10223G27602K49564J37622L2005J1533M8681r3504j63131r5277k66069M5103J3653
$$ 727602 977166 1114788 1146793 1158326 1207007 1113503 950372 855095 589026 634129 647782
10212F47782K54519K37852j00292j29358l5783p1644k86656M9508K18255K664
$$ 647782 902301 1140153 1039861 910503 874720 803076 516420 565928 784183 786847
10202G86847j72023J48433J01689N1889k25209o600K1153p1517j92049J13892
$$ 786847 614824 763257 864946 916835 691626 685026 706179 634662 442613 556505
10192E56505J57435N2453q4522q4816k3767j315j79301n5301n5089K62027J8301
$$ 556505 713940 766393 681871 597055 573288 571973 392672 337371 282282 544309 562610
10181E62610R7947L93607M1246j12627P0414K8170J6563j38478k22279J50822
$$ 562610 660557 1054164 1095410 982783 1053197 1081367 1097930 959452 737173 887995
10171H87995Q707N4744O5506J91884Q3108J73025L8537j21984J32003K55141L63962
$$ 887995 896702 951446 1016952 1208836 1291944 1464969 1503506 1381522 1513525 1768666 2132628
10160B132628L05771J56981k24550k24287k76349k7347N4492J51558M5309l4376
$$ 2132628 2438399 2595380 2370830 2146543 1870194 1842847 1897339 2048897 2094206 2059830
10150B059830K56812J76888J30925K53561k327J87219N052m62583k67054R2050
$$ 2059830 2316642 2493530 2624455 2878016 2875689 3062908 3067960 2605377 2338323 2430373
10140B430373J7359O6920n487Q7823J92846J00788q4072l25365q3238o391j28162
$$ 2430373 2447732 2514652 2509165 2596988 2789834 2890622 2806550 2481185 2397947 2391556 2263394
10129B263394n02146q674J05997j714l8343M0181K7980J14565j23474j61789j23371
$$ 2263394 1761248 1752574 1858571 1856857 1818514 1858695 1886675 2001240 1877766 1715977 1592606
10118A592606l4496j59927j79253j5364J01704n6347j50248k57898o2604j3255
$$ 1592606 1558110 1398183 1218930 1203566 1305270 1248923 1098675 840777 778173 764918
10108G64918j36349k3893q1434j34619R5890K60306J32601M1365k17927p6000
$$ 764918 628569 604676 523242 388623 484513 744819 877420 918785 700858 624858
10098F24858n7778o7247k5380j22760J97253J78471k30637m18573o0780J25007
$$ 624858 567080 499833 474453 351693 548946 727417 496780 78207 17427 142434
10088A42434J65680O2813J30322J23489j76212k15280k28143K77807L14946q047
$$ 142434 308114 370927 501249 624738 448526 233246 5103 282910 597856 589809
10078E89809j55110K4090Q8102j19065p4635l4868J98989N5222K76990O2041k96546
$$ 589809 434699 458789 546891 427826 353191 318323 517312 572534 849524 911565 615019
10067F15019k50638k35674L08926J98992Q8741J34719k70675j7431j16918j2345
$$ 615019 364381 128707 437633 636625 725366 860085 589410 571979 455061 442716
10057D42716J47428l7471j64815j00309n3771K08206L30251M13666j1121j17255
$$ 442716 590144 552673 387858 287549 233778 441984 772235 1185901 1174780 1057525
10047A057525k18458l29587k1986q1285M7948j75532k3631R6092p7816J36908
$$ 1057525 839067 509480 487494 406209 454157 278625 254994 351086 273270 410178
10037D10178L0073Q4660p3631j39228r1165O9561R7197J6905l27J34060K652l43203
$$ 410178 440251 524911 451280 312052 220887 290448 387645 404550 404223 538283 540935 197732
10025A97732j53467M87666J03365l06416M372l961M1470j41237m2826R6333j5049
$$ 197732 44265 531931 635296 328880 333252 329291 370761 229524 186698 283031 267982
10014B67982K34131q6549N9513J44847k2963L0977p9503k45252j43113J46620
$$ 267982 502113 415564 475077 619924 596961 627938 548435 303183 160070 306690
10004C06690J33809q6498O2384J1889j81341N7962K00290J10615q1659o1504J32035
$$ 306690 440499 354001 416385 428274 246933 304895 505185 615800 534141 472637 604672
9993F04672k91876k13597J32362J80454m9741l00980J99351K34617L2846o0345
$$ 604672 312796 99199 231561 412015 362274 61294 260645 495262 528108 467763
9983D67763R553J99018Q5464n0379k64438k03791J49391J02545k2312k11793j82037
$$ 467763 477316 676334 761798 711419 446981 243190 392581 495126 472814 261021 78984
9972G8984l3326M9162J65577K26956l1696L1114Q9960m0576r4470J89451L6739
$$ 78984 45658 94820 260397 487353 455657 486771 576731 536155 441685 631136 667875
9961F67875K4160j02978j25442j83895j15629j98962k12657P6416L14618J84376
$$ 667875 692035 589057 463615 279720 164091 -34871 -247528 -171112 143506 327882
9951C27882R6010N0922m7902k3799P6699Q2267j47756M5125k28166k20032o0375
$$ 327882 423892 474814 426912 403113 479812 562079 414323 459448 231282 11250 -49125
9940d9125N7475J97548j9038o7412J16608L4018P584P4868l9033k7125K8375j08901
$$ -49125 8350 205898 186860 119448 236056 270074 277658 352526 313493 286368 314743 205842
9928B05842j5252N24k16038K71058M68360J86901K8120J49151j53087j91231q2700
$$ 205842 190590 191114 -24924 246134 714494 901395 929515 1078666 925579 734348 651648
9917F51648J16724m8101j32125j77943M2743m070k42605N5992K48109J0404j11337
$$ 651648 768372 720271 588146 410203 452946 448876 206271 262263 510372 520776 409439
9906D09439l06178J47309O6738p0843j20233k3147K3150L8413K30362m2169j3956
$$ 409439 103261 250570 317308 246465 126232 103085 126235 164648 395010 352841 338885
9895C38885j52989o5298K9523J96555J08871k06032j44853J7658N4306Q4564n2816
$$ 338885 185896 120598 150121 346676 455547 249515 104662 122320 176626 261190 208374
9884B08374J50077n3718j03373J96377K1251K6645L24128j37127k70938m23166
$$ 208374 358451 304733 201360 397737 418988 445633 769761 632634 361696 -61470
9874f1470q6635R0894K90914J06509O8461j1722q8263Q7766J45497N2360o3384
$$ -61470 -148105 -57211 233703 340212 408673 396951 308688 396454 541951 594311 530927
9863E30927j94727O840N5797k58032N5026J91484j75001o3897K6240M7426j07479
$$ 530927 336200 343040 398837 140805 195831 387315 212314 148417 174657 222083 114604
9852A14604l24757j19431k3311R5286K25432P0882O6652q5957j27981k17846J22790
$$ 114604 -210153 -329584 -352895 -257609 -32177 38705 105357 19400 -108581 -326427 -203637
9841b03637K75198P418J2812N4096O3445q2134k4192J6445J06500O891L32859
$$ -203637 71561 78979 91791 145887 209332 127198 103006 119451 225951 232842 565701
9830E65701R371J872l32058k24300r2387K85144O404j52158J86882R6219j6500
$$ 565701 575072 576944 244886 20586 -71801 213343 219747 67589 254471 350690 334190
9819C34190l05773k12978K39883P4586J19535q0542j63860j4534j19997J88359
$$ 334190 28417 -184561 55322 129908 249443 168901 5041 -9493 -129490 58869
9809E8869J09777J20120k11109k53428J20987J96290Q2343l5159L1660J83498
$$ 58869 168646 288766 77657 -175771 -54784 141506 223849 188690 220350 403848
9799D03848P7790m7856R7609P6539j25155l48443j80164M6530k8450J29979Q6632
$$ 403848 481638 433782 531391 607930 482775 134332 -45832 698 -27752 102227 188859
9788A88859j36753J16448j88675o2891L653J57896L9080k2178J36322J36568R3757
$$ 188859 52106 168554 -20121 -83012 -79359 78537 117617 95439 231761 368329 462086
9777D62086k4212j44941L4492j92139m6068j50050j06655K9501L83695K32663
$$ 462086 437874 292933 327425 135286 89218 -60832 -167487 -137986 245709 478372
9767D78372M5735K3580k07666l15557n5554J68164J76778K3511o8177j76351J26098
$$ 478372 524107 547687 340021 24464 -31090 137074 313852 337363 269186 92835 218933
9756B18933J5581J09771J2166p0716P119J20618K49024j78433m12368R9061N27991
$$ 218933 234514 344285 356451 285735 292854 413472 662496 484063 71695 170756 698747
9745F98747J53786k00547O7243O0156j69118j72076O8090j3426r3310J04857q1241
$$ 698747 852533 651986 719229 779385 610267 438191 506281 492855 399545 504402 423161
9734D23161j86625j39409J44654J29388J90816j62914j52104K07142R6299K4009
$$ 423161 236536 97127 241781 371169 561985 399071 246967 454109 550408 574417
9724E74417l6482k2702J3108j13906l3435j62997j31158J81381o0922r3513k55349
$$ 574417 537935 515233 528341 414435 381000 218003 86845 268226 207304 113791 -141558
9713a41558j64069l1707l88M88060K71942j90263l16254q6966m2466J59037J20458
$$ -141558 -305627 -337334 -337722 150338 422280 232017 -84237 -171203 -213669 -54632 65826
9702F5826L1160J11143K2785O520l0954j57720r6471j08523J68635K02980O1779
$$ 65826 96986 208129 230914 237434 206480 48760 -47711 -156234 12401 215381 277160
9691B77160k54526N0028K24554O3j44544K3872K511k11139o4650j29417J0923
$$ 277160 22634 72662 297216 297279 152735 176607 179118 -32021 -96671 -226088 -215165
9680b15165J57516K1771J06959N236J348K19113J28546k52087k36438J6920J14746
$$ -215165 -57649 -35878 71081 76317 77665 296778 425324 173237 -63201 -46281 68465
9669F8465J39280Q7455O6388k95223k39152J198l2994k17527j3691Q364J39538
$$ 68465 207745 295200 361588 66365 -172787 -171589 -204583 -422110 -435801 -427437 -287899
9658b87899K9967P1391K95910J2026M3951j31059J88318K60521j60993K0610J52199
$$ -287899 -257932 -186541 109369 121395 165346 34287 222605 483126 322133 342743 494942
9647D94942K17973M50599J17349j25254J35399J93508j09916k04967m0751l64311
$$ 494942 712915 1163514 1280863 1155609 1291008 1484516 1374600 1169633 1128882 764571
9637G64571k02170m41786k83955K33666K47659k24189j06222J0838o8269P7348
$$ 764571 562401 120615 -163340 70326 317985 93796 -12426 -1588 -69857 7491
9627G491J18714O0832p5768L62184j31047k39897q4157j15829J22901J20387q7251
$$ 7491 126205 187037 111269 473453 342406 102509 18352 -97477 25424 145811 58560
9616E8560k04930n414L78741K02203R7845L1771k06723j22605N4542J26732j08734
$$ 58560 -146370 -151784 226957 429160 527005 558776 352053 229448 283990 410722 301988
9605C01988J25068n6626k59623m489J15888j08632j48033o0745P3277L31019K22198
$$ 301988 427056 370430 110807 106318 222206 113574 -34459 -95204 -21927 309092 531290
9594E31290J6012o619m5906k3329j18465l7812l3576n5571M4558l1940j7687k02469
$$ 531290 547302 540683 494777 471448 352983 315171 281595 226024 270582 238642 220955 18486
9582A8486j52876J98813q0463L03986R2292k52618k30470J71350j27399M7773
$$ 18486 -134390 64423 -16040 287946 380238 127620 -102850 68500 -58899 -11126
9572a1126R3166p8161j72502J20851J21803J51424J01294j10562k66439K6569
$$ -11126 82040 3879 -168623 -47772 74031 225455 326749 216187 -50252 -23683
9562b3683Q0316J35785R3171K39449p2186j75970o2843J60354j38813j33035o7969
$$ -23683 56633 192418 285589 525038 452852 276882 214039 374393 235580 102545 34576
9551C4576K12224K43071o8111j51948j15435j70075N9621Q730m4076J77881j15108
$$ 34576 246800 489871 421760 269812 154377 -15698 43923 52653 8577 186458 71350
9540G1350j70227J60294r6745P1205j37770j86203j54490J56875L22483J23179
$$ 71350 -98877 61417 -35328 35877 -101893 -288096 -442586 -285711 36772 159951
9530A59951o4197q8396o353k78642Q8014P0669O9056L30787J25249j95936k64304
$$ 159951 95754 7358 1005 -277637 -189623 -118954 -49898 280889 406138 210202 -54102
9519e4102K7289L377L35263K49837j2678j16515j10106j29239r4597k89523k49679
$$ -54102 -26813 -23436 311827 561664 548986 432471 322365 193126 98529 -190994 -440673
9508d40673L250j04812J88788R4479M3670k3492j41628M4070J38899J39999O422
$$ -440673 -437423 -542235 -353447 -258968 -215298 -238790 -380418 -336348 -197449 -57450 -51028
9497e1028k1630L3484J73526J50080p4366K9678J06032J69010m0804j30653m8865
$$ -51028 -72658 -39174 134352 284432 210066 239744 345776 514786 473982 343329 294464
9486B94464j77150k09534Q3350J28918k51682Q7664J39496j68291r657M3989j28629
$$ 294464 117314 -92220 -8870 120048 -131634 -43970 95526 -72765 -82422 -38433 -167062
9475a67062p7799J99040J54907J11003J92499O605k92595J86711M3297m1960j54635
$$ -167062 -244861 -45821 109086 220089 412588 419193 126598 313309 356606 314646 160011
9464A60011j13404n4616q7883o0038p4124p6416j0557J60923L30136J24575J65353
$$ 160011 46607 -8009 -95892 -155930 -230054 -306470 -317027 -156104 174032 298607 463960
9453D63960N3035j25264l53266j28130K05786K97265J26711k63416q5012J89599
$$ 463960 516995 391731 38465 -89665 116121 413386 540097 276681 191669 381268
9443C81268J38114P3641J88521L4147k47553k19851j09664M1312j21790K2037
$$ 381268 519382 593023 781544 815691 568138 348287 238623 279935 158145 180182
9433A80182m8563J013j36813J17636n0341J72994K16591j42224j27974J42283
$$ 180182 131619 132632 -4181 113455 63114 236108 452699 310475 182501 324784
9423C24784j6859n5016Q7400N2654R5104k5448l4576l683j01654K2314P7033j25426
$$ 324784 307925 252909 340309 392963 488067 462619 428043 424360 322706 345020 422053 296627
9411B96627J37152K88863k90360k20891R524P5140L23177r719j83216j01743m1458
$$ 296627 433779 722642 432282 211391 220915 296055 619232 609513 426297 324554 283096
9400B83096q6719j10248J26085J89277k1711j8138N6737j30072j74774j32629
$$ 283096 196377 86129 212214 401491 379780 361642 418379 288307 113533 -19096
9390a9096j93512j4262K91103J86997j02629P218J953n0053R0624J2430k29565
$$ -19096 -212608 -226870 64233 251230 148601 155819 157772 107719 198343 210773 -18792
9379a8792P4175j29280k44173j39377L33117J79998K43064m9467p6842K0217J41492
$$ -18792 55383 -73897 -318070 -457447 -124330 55668 298732 249265 172423 192640 334132
9368C34132J53437o2810j22141p3262P148k00578j4162Q4526k7016p6556J84851
$$ 334132 487569 424759 302618 229356 236504 35926 21764 106290 79274 2718 187569
9357A87569M50305K29887k50761m16517k49583M1024K35733o6695j69285o0418
$$ 187569 637874 867761 617000 200483 -49100 -8076 227657 160962 -8323 -68741
9347f8741J81715j2426l03589j7560K40779L0787r459R918K5678J79520K7953
$$ -68741 112974 100548 -203041 -220601 20178 50965 41506 51424 77102 256622 284575
9336B84575j8496J75043o3537k12652m0310k53079K2417L38414J9037j29836J09038
$$ 284575 266079 441122 377585 164933 124623 -128456 -106039 232375 251412 121576 230614
9325B30614n5170j73419O138K03189K91774J44588k62169j56470r3927j66503
$$ 230614 175444 2025 8163 211352 503126 647714 385545 229075 135148 -31355
9315c1355o398J21293J37839K82045n6695j80817N3962L6885j46315o9961k0871
$$ -31355 -37753 83540 221379 503424 446729 265912 319874 356759 210444 140483 119612
9304A19612Q3009k6109r9683k91203o5526L13617K10264M0390J84081k64368l73261
$$ 119612 202621 176512 76829 -214374 -279900 33717 243981 284371 468452 204084 -169177
9293a69177j23205N7531j8342j2799M8720O5310j0320J4716l5987J46273J59797
$$ -169177 -292382 -234851 -253193 -265992 -217272 -151962 -162282 -147566 -183553 -37280 122517
9282A22517Q3808k4820K5790j37373l7631k34689n4388M5221N2868Q6550J08973
$$ 122517 206325 181505 207295 69922 32291 -202398 -256786 -211565 -158697 -72147 36826
9271C6826N5800L7618N8900l19553p628L14232k6905o2415N9176m7146k11404
$$ 36826 92626 130244 189144 -130409 -138037 176195 149290 86875 146051 98905 -112499
9260a12499L2654K07976Q1102M699J9387J21055K23653n6199j95401M8742K3858
$$ -112499 -79845 128131 209233 213932 233319 354374 578027 521828 326427 375169 399027
9249C99027j38792k06722j18503O961J76554M6243L2722P408p7045j22799j87456
$$ 399027 260235 53513 -64990 -58029 118525 164768 197490 204898 127853 5054 -182402
9238a82402k18302K30087J75239O4100j72052j48999J04988R6670k11466l2244
$$ -182402 -400704 -170617 4622 68722 -103330 -252329 -147341 -50671 -262137 -294381
9228b94381L65151l6230k15660k13607j00722M7364j2535J66694L98697L83953
$$ -294381 70770 34540 -181120 -394727 -495449 -448085 -460620 -293926 104771 488724
9218D88724m0133k06307j26699n3175j43372k12736J90072N6636J9851R6414J60903
$$ 488724 448591 242284 115585 62410 -80962 -293698 -103626 -46990 -27139 69275 230178
9207B30178p0127k36654o8179J09198J29457J94066J19462k47891k74821k4208
$$ 230178 160051 -76603 -144782 -35584 93873 287939 407401 159510 -115311 -139519
9197a39519j15290J91709J86633J54898n164o6051j98474j53294J85277N8238
$$ -139519 -254809 -63100 123533 278431 273267 207216 8742 -144552 40725 98963
9187I8963j30787p2685l2496K15025K5866N3030k63087P965K21859j0655j83426
$$ 98963 -31824 -104509 -137005 78020 103886 156916 -106171 -98206 123653 112998 -70428
9176g0428j8341J1328K93754L29874J08674k252r3432j54755k46933n5189J93500
$$ -70428 -88769 -77441 216313 546187 654861 652609 559177 404422 157489 102300 295800
9165B95800j69910k54530J59116K03586J26451n9091j76554k26538j70383L0021
$$ 295800 125890 -128640 30476 234062 360513 301422 124868 -101670 -272053 -242032
9155b42032j4139l9864j22853Q8385j8298j66323K45853M58705J76540k39293
$$ -242032 -256171 -296035 -418888 -330503 -348801 -515124 -269271 189434 365974 126681
9145A26681j15986j35408K1134J41662J61848R7491q569j65857N4770P9220j3667
$$ 126681 10695 -124713 -103579 38083 199931 297422 288853 122996 177766 256986 243319
9134B43319j42888l42656j14667L66501J99126j30176P1293Q7490M4955j22015
$$ 243319 100431 -242225 -356892 9609 208735 78559 149852 237342 282297 160282
9124A60282j72973M238j190j4247k64k8762n4585Q4549J08291M8265k0834j33288
$$ 160282 -12691 -8453 -9643 -23890 -24154 -52916 -107501 -22952 85339 133604 112770 -20518
9112b0518o8109J11119P7837J64979j6434j3603k25455k22180O4092k047k3227
$$ -20518 -88627 22492 100329 265308 248874 235271 9816 -212364 -148272 -150319 -173546
9101a73546m363o94N9009l5753O0880q7933q2369Q6898m8785k29083k56362K14283
$$ -173546 -177909 -178603 -119594 -155347 -94467 -182400 -264769 -177871 -226656 -455739 -712101 -497818
9089d97818J79683L3121r3574M1615M4939P8542M3645K1528Q5546n7972J81172
$$ -497818 -318135 -285014 -378588 -336973 -292034 -213492 -169847 -148319 -62773 -120745 60427
9078F0427K07421k8777j06288K1771K1731k28634j60543p4643M122P9196J06748
$$ 60427 267848 239071 132783 154554 176285 -52349 -212892 -287535 -283413 -204217 -97469
9067i7469Q4244N5398n069M5711j03077M7405l7648r0505j56130M06319O4324
$$ -97469 -13225 42173 37104 82815 -20262 27143 -10505 -101010 -257140 149179 213503
9056B13503j03962n8092r817o5467J05706R7619K20651O8695P0429j74773L1738
$$ 213503 109541 51449 41632 -23835 81871 179490 400141 468836 539265 364492 396230
9045C96230J854l36049j58719J84257K19714l0293k8830j42634j8607K44677n1316
$$ 396230 398084 62035 -96684 87573 307287 276994 248164 105530 86923 331600 280284
9034B80284j19065L9717o0064J5915K0713o7243j08572R4059J61516p4499k29705
$$ 280284 161219 200936 140872 156787 177500 110257 1685 95744 257260 182761 -46944
9023d6944n9242J97666M6569k8868j41438o2741o5515r8177N0811K5547J36532
$$ -46944 -106186 91480 138049 109181 -32257 -94998 -160513 -258690 -207879 -182332 -45800
9012d5800J584J34704J74110k48974j16771J79987J65231j4943j16824j32981
$$ -45800 -44216 90488 264598 15624 -101147 78840 244071 229128 112304 -20677
9002b0677P6464j10216J98386M22J50388M1774l9234k77099l16524p9276K97032
$$ -20677 55787 -54429 143957 144379 294767 336541 297307 20208 -296316 -375592 -78560
8991g8560J29549k11348k5947K18582j03701j58092j22051k458J35584N9995o5397
$$ -78560 50989 -160359 -186306 32276 -71425 -229517 -351568 -354026 -218442 -158447 -223844
8980b23844j00194q3659M8108J24524J89049o734j11387L41432J82320j65168
$$ -223844 -324038 -407697 -359589 -235065 -46016 -52750 -164137 177295 359615 194447
8970A94447k12774k43460J20914K03553J67797P7291j13276j61956M4579m0436
$$ 194447 -18327 -261787 -140873 62680 230477 307768 194492 32536 77115 36679
8960C6679J30517K6867j23464R68J00297K20104K62340J18203k42404l61728J92857
$$ 36679 167196 194063 70599 71567 171864 391968 654308 772511 530107 168379 361236
8949C61236j9423k84238j72093j3525o4895q677O6999L43686P3056m7712k1258
$$ 361236 341813 57575 -114518 -128043 -192938 -201615 -134616 209070 282126 234414 213156
8938B13156P927j45352j83633j8961O5244j15037P9963J32858M31358l8867k34144
$$ 213156 221083 75731 -107902 -126863 -61619 -176656 -96693 36165 467523 428656 194512
8927A94512k90533j18905J87852J76888j82347k1019L12329J23461K5378k31584
$$ 194512 -96021 -214926 -27074 149814 -32533 -53552 258777 382238 407616 176032
8917A76032l7154J07923M3335l1647j58574n7867j82585j71829O2563J45613J95435
$$ 176032 138878 246801 290136 258489 99915 42048 -140537 -312366 -249803 -104190 91245
8906I1245N9714j59959J4029K485q9592M2288j38697j68853j17945K03664Q1607
$$ 91245 150959 -9000 5029 7514 -82078 -39790 -178487 -347340 -465285 -261621 -180014
8895a80014J4576M5825j37531M03177J32017j64301r4389j66042J67549J61758
$$ -180014 -165438 -119613 -257144 146033 278050 113749 19360 -146682 20867 182625
8885A82625O6177N699j17533M8812L140K63694L0500l34168k50115J26731N2267
$$ 182625 248802 254501 136968 185780 188920 452614 483114 148946 -101169 25562 77829
8874G7829L6484J0141M169J26848L40204N6333n26037l91370M9295Q6188L01048
$$ 77829 114313 124454 128623 255471 595675 652008 125971 -265399 -216104 -129916 171132
8863A71132J26919j96264k94800K9009J60879L75335j6591j10625j13666k6360
$$ 171132 298051 101787 -193013 -164004 -3125 372210 355619 244994 131328 104968
8853A04968J28178K27263K9595k40972r0401n4417k06601k27423L8457J56381
$$ 104968 233146 460409 490004 249032 158631 104214 -102387 -329810 -291353 -134972
8843a34972L0152Q8146R6694K6090k0850J4799J73941j11144l09128k2003K11440
$$ -134972 -104820 -16674 80020 106110 85260 100059 274000 162856 -146272 -168275 43165
8832D3165P1987k68675j01444R6285J10905K67770J63642P0340N066J52359N9367
$$ 43165 115152 -153523 -254967 -158682 -47777 219993 383635 453975 459041 611400 670767
8821F70767m2401k66285k35293J88793k4436k69635J20371p3666o8149J10120
$$ 670767 628366 362081 126788 315581 291145 21510 141881 68215 66 110186
8811A10186q7408j54908q4219J53837R4569N1046j34388j33351m2110j224Q7925
$$ 110186 22778 -132130 -216349 -62512 32057 83103 -51285 -184636 -226746 -227970 -140045
8800a40045J28425q100m7462K50914K60210o1615j62132n5617K11064j97868j22396
$$ -140045 -11620 -19720 -67182 183732 443942 382327 220195 164578 375642 177774 55378
8789E5378k10888j81314J90684P2780K83506j18461K23592J25768j24014l3218
$$ 55378 -155510 -336824 -146140 -73360 210146 91685 315277 441045 317031 283813
8779B83813Q2435j31974j99269K5442j94171n0442K35383K58788j41640k96981
$$ 283813 366248 234274 35005 60447 -133724 -184166 51217 310005 168365 -128616
8769a28616K04606K60323L51637J03715j28445j25452j32952k11007r9877Q6426
$$ -128616 75990 336313 687950 791665 663220 537768 404816 193809 93932 180358
8759A80358N292L6224N3480o8051l64240o7943K82088L16436j6897K3970n7490
$$ 180358 185650 221874 275354 207303 -156937 -224880 57208 373644 356747 380717 323227
8748C23227R0107k9121l52243k45755j27951J05302J94947L9870L8541K2941Q0512
$$ 323227 413334 384213 31970 -213785 -341736 -236434 -41487 -1617 36924 59865 140377
8737A40377k07311P6043j47002l6238k18822Q0298N1709j92372o0066L350J9830
$$ 140377 -66934 9109 -137893 -174131 -392953 -312655 -260946 -453318 -513384 -510034 -490204
8726d90204K89365q3675k89070K71586L51699k5060l87818M1202J41184p1019
$$ -490204 -200839 -284514 -573584 -301998 49701 24641 -363177 -321975 -180791 -251810
8716b51810k26091j0196j779L14443J89067j17655r8682K37776l4974j75840K03655
$$ -251810 -477901 -488097 -489876 -175433 13634 -104021 -202703 35073 99 -175741 27914
8705B7914N1045j05580L7957j24677k5865J79593N3852j10486k42298q6534K48066
$$ 27914 78959 -26621 11336 -113341 -139206 40387 94239 -16247 -258545 -345079 -97013
8694i7013J85395J67790K72837J41693k02163l02387m8570L2141J86060j05663
$$ -97013 88382 256172 529009 670702 468539 166152 117582 149723 335783 230120
8684B30120j6012K94314K21557n9586k11879k07190k64003m3799k0625P6104N1099
$$ 230120 214108 508422 729979 670393 458514 251324 -12679 -56478 -77103 -999 50100
8673E0100j11025R1905o9531j74162R3214K37401p1586j90290J55031J9655K6981
$$ 50100 -60925 30980 -38551 -212713 -119499 117902 46316 -143974 11057 30712 57693
8662E7693j50143K47260P4667k11379j13684J33421m8548M9511q1943r617O5313
$$ 57693 -92450 154810 229477 18098 -95586 37835 -10713 38798 -43145 -52762 12551
8651A2551j07612J1173J29731m4721n2247J58901K81662J6611k22218q4116k56222
$$ 12551 -95061 -83888 45843 1122 -51125 107776 389438 406049 183831 99715 -156507
8640a56507J33816J1714j03289q4814J34746K10115j35288m5593L2055k7052J18728
$$ -156507 -22691 -10977 -114266 -199080 -64334 145781 10493 -35100 -3045 -30097 88631
8629H8631j24778k91920K10971M47807j00956k73816j91772K11042m7195r2635
$$ 88631 -36147 -328067 -117096 330711 229755 -44061 -235833 -24791 -71986 -164621
8619a64621P7926J59420l4646j96600R6922l0862K6788R2683J84315K56571j54733
$$ -164621 -86695 72725 38079 -158521 -61599 -92461 -65673 27010 211325 467896 313163
8608C13163k82623m7123P1438J35206K23049P5398j0843j70498j25272K20914
$$ 313163 30540 -16583 54855 190061 413110 488508 477665 307167 181895 402809
8598D02809k48778J3610J76347j54579j69337o365L24739J7160m1470J9575k97318
$$ 402809 154031 167641 343988 189409 20072 13707 338446 355606 314136 333711 36393
8587C6393j53650J99638j0931j08132j16738L8110q77K37273J72615k7682j6242
$$ 36393 -117257 82381 71450 -36682 -153420 -115310 -116187 121086 293701 266019 249777
8576B49777j27026p0033n9299P5532j21266j85108N4813J88788o469l2291O7496
$$ 249777 122751 52718 -6581 68951 -52315 -237423 -182610 6178 -291 -32582 34914
8565C4914j70402l4884J67459J10534M7412l4349k45218R5491J72288j50200j29110
$$ 34914 -135488 -170372 -2913 107621 155033 120684 -124534 -29043 143245 -6955 -136065
8554a36065l8335M1985m9286K95524k01590l07681J74091j55179L2671K21466
$$ -136065 -174400 -132415 -181701 113823 -87767 -395448 -221357 -376536 -343865 -122399
8544a22399K53082j21982r3952L87883k61314l17850j39404O6145K9161K03946
$$ -122399 130683 8701 -85251 302632 41318 -276532 -415936 -349791 -320630 -116684
8534a16684O1536J22475K14301J49140J1247k38856K2755L2817k31896P8475P5561
$$ -116684 -55148 67327 281628 430768 442015 203159 225914 258731 26835 105310 180871
8523A80871j17533j49577K43556K24625L7770j56102j11597j20176j3033J59066
$$ 180871 63338 -86239 157317 381942 419712 263610 152013 31837 18804 177870
8513A77870m3269k469L6881p3424q2414l580p2386R4525j2889K9990L41154K2522
$$ 177870 134601 132132 169013 95589 13175 9595 -62791 31734 18845 48835 389989 412511
8501D12511k64877j97608J28193k8297K9044K24282J29847j08733Q5909o3811
$$ 412511 147634 -49974 78219 49922 78966 303248 433095 324362 410271 346460
8491C46460J45913R6541l02914r7926p1959L9699M2317O0938K14659j50863k91767
$$ 346460 492373 588914 286000 188074 116115 155814 198131 259069 473728 322865 31098
8480C1098j34439J50448R5002j42473R0145J6720l9883m8214J79922O5558l0709
$$ 31098 -103341 47107 142109 -364 89781 106501 66618 18404 198326 263884 233175
8469B33175j07872M9394N8739N6526r1594k68598j7503N4360M7742o619r9517
$$ 233175 125303 174697 233436 289962 198368 -70230 -87733 -33373 14369 7750 -91767
8458i1767j42320j12750L26590q3830J5086J70561J26722R8167j6045j01682k8804
$$ -91767 -234087 -346837 -20247 -104077 -88991 81570 208292 306459 290414 188732 159928
8447A59928m4045k87204K1756J98110n57k49340m8356M69205O1123k26944L7095
$$ 159928 115883 -171321 -149565 48545 47988 -201352 -249708 219497 280620 53676 90771
8436I0771O0149j89452j86835j07156J54640J31586j28126O7416r5154K431K73488
$$ 90771 150920 -38532 -225367 -332523 -177883 -46297 -174423 -107007 -202161 -199730 73758
8425G3758J3650j39786J85154N6184l8276q1674J66617P5928j66046k79134j08928
$$ 73758 87408 -52378 132776 188960 150684 69010 235627 311555 145509 -133625 -242553
8414b42553J48239j19479j060J78640J47372j06035k58518p6534L6128j303J33007
$$ -242553 -94314 -213793 -214853 -36213 111159 5124 -253394 -329928 -293800 -295103 -162096
8403a62096J76672r809K43319M6207j70627L372q994q0707J80738O205j90747
$$ -162096 14576 4767 248086 294293 123666 127038 118044 37337 218075 224280 33533
8392C3533K05612Q9976J30495N4913n5413Q7579k64998j50194K71837l6490j86710
$$ 33533 239145 329121 459616 514529 459116 546695 281697 131503 403340 366850 180140
8381A80140k08266J25987K93745J1265l42873j12869m4194l33265K42656K51435
$$ 180140 -28126 97861 391606 402871 59998 -52871 -97065 -430330 -187674 63761
8371F3761j957m9425j940r5437K66p7770n4093N6817J30568r0726k10933J77332
$$ 63761 61804 12379 10439 -84998 -84732 -162502 -216595 -159778 -29210 -119936 -330869 -153537
8359a53537L1743n3766J11208j58652R6216Q1425J28639r2388j68062r5363m4625
$$ -153537 -121794 -175560 -64352 -223004 -126788 -45363 83276 -9112 -177174 -272537 -317162
8348c17162j10909k57701K11091P3531J29735J9097o1271m3574K60985N4620m2328
$$ -317162 -428071 -685772 -474681 -401150 -271415 -252318 -313589 -357163 -96178 -41558 -83886
8337h3886J73149J05289l34604k52483k58966j00530K98245J80915J04827k5793
$$ -83886 89263 194552 -140052 -392535 -651501 -752031 -453786 -272871 -168044 -193837
8327a93837K2438P8516J10566r8438j44667O0285K37353M1288M7015j83200J51
$$ -193837 -171399 -92883 17683 -80755 -225422 -165137 72216 113504 160519 -22681 -22530
8316b2530j37846K903p547R3272o4613Q0316R1875k25627M5197O1624j1085J47416
$$ -22530 -160376 -157473 -165020 -71748 -136361 -56045 35830 -189797 -144600 -82976 -94061 53355
8304E3355o6179n6205P8466q7993o6720N7662J20667L9939K7136J22624r4157
$$ 53355 -12824 -69029 9437 -78556 -145276 -87614 33053 72992 100128 222752 128595
8293A28595K7428n0227L0459O3885n3174r3720J47508J00121J627k46258j88145
$$ 128595 156023 105796 136255 200140 146966 53246 200754 300875 302502 56244 -131901
8282a31901k48579K47198J04426n6672n3343L558j19679j47365K07709r6068j03577
$$ -131901 -380480 -133282 -28856 -85528 -138871 -135313 -254992 -402357 -194648 -290716 -394293
8271c94293j07851J76256K07209q7338j10670k9110J4945N13860P9844k1694n9324
$$ -394293 -502144 -325888 -118679 -206017 -316687 -345797 -330852 183008 262852 241158 181834
8260A81834P5091j99122j0418K3128k4624P7185J25675K8794j34826j29739J48863
$$ 181834 256925 57803 47385 70513 45889 123074 248749 277543 142717 12978 161841
8249A61841J24400j27866k7049m4780m8516j00772k5291k7033J52014J16123J0464
$$ 161841 286241 158375 131326 86546 38030 -62742 -88033 -115066 36948 153071 163535
8238A63535l26650p8516N4932P8615Q1904m7803k10425M4189J35313Q8286M7693
$$ 163535 -163115 -241631 -186699 -108084 -26180 -73983 -284408 -240219 -104906 -16620 31073
8227C1073j67497M8852J14061R3833n07k67804l3464J77715L28019j87961j33973
$$ 31073 -136424 -87572 26489 120322 119815 -147989 -181453 -3738 324281 136320 2347
8216B347o0960r778J40169R2777J62044O6266k0460r1896O061p3211k37778l45403
$$ 2347 -58613 -68391 71778 164555 326599 392865 372405 280509 286570 213359 -24419 -369822
8204c69822J29214L13917K48906q681j10866j42819J52559J27671L7342l85667
$$ -369822 -240608 73309 322215 313534 202668 59849 212408 340079 377421 -8246
8194h246k08081J10813K36864n2910J2453L6057J8131k26668P729j17195K4173
$$ -8246 -216327 -105514 131350 78440 90893 126950 145081 -81587 -73858 -191053 -166880
8183a66880J11492J55240P0224k05158j24578l5554m544Q6825Q7191J18426J37991
$$ -166880 -55388 99852 170076 -35082 -159660 -195214 -199758 -112933 -25742 92684 230675
8172B30675J43519L1080l03870j86334j65978r8655K86205L5132J49671J20572
$$ 230675 374194 405274 101404 -84930 -250908 -349563 -63358 -28226 121445 242017
8162B42017j80441j07100j37568r1180j06970o2099K22590L36493J38575l08820
$$ 242017 61576 -45524 -183092 -274272 -381242 -443341 -220751 115742 254317 -54503
8152e4503k02231K09863J56341l1596j58152Q0665l8971J33743J24778K37954
$$ -54503 -256734 -46871 109470 77874 -80278 387 -38584 95159 219937 457891
8142D57891n598j13127j50067j3647j7057J17499q7296j95391J23370l8660k09393
$$ 457891 452293 339166 189099 175452 158395 275894 188598 -6793 116577 77917 -131476
8131a31476K5144j8553L7301q6162m5241k5130J43083J8178q1709j83037j54331
$$ -131476 -106332 -124885 -87584 -173746 -218987 -244117 -101034 -82856 -164565 -347602 -501933
8120e01933K61579J42993q0284l8973R3554Q3289m9220n3462p2135R5338l2209
$$ -501933 -240354 -97361 -177645 -216618 -123064 -39775 -88995 -142457 -214592 -119254 -151463
8109a51463k4248q697J28057J3628l4247Q4836K01811j32174j7697J40399l3192
$$ -151463 -175711 -184408 -56351 -42723 -76970 7866 209677 77503 59806 200205 167013
8098A67013L7215l0427k96764k7337r1799k11449K35041R5034j4674K15171j26188
$$ 167013 204228 173801 -122963 -150300 -242099 -453548 -218507 -123473 -138147 77024 -49164
8087d9164P311K34681J69774j09363k15773q1449N1309Q6434J49438J58673j59753
$$ -49164 -41853 192828 362602 253239 37466 -43983 7326 93760 243198 401871 242118
8076B42118j84155j40082j89354o963k19729N7343K90995P1176P8121k05189j49571
$$ 242118 57963 -82119 -271473 -278436 -498165 -440822 -149827 -78651 -530 -205719 -355290
8065c55290J99737L03531R4326K7608k78083K82093k25q2218L6075l3727j14778
$$ -355290 -155553 147978 242304 269912 -8171 273922 273697 191479 227554 193827 79049
8054G9049J08891k3069k67566j99041L17173K03898j10971k00620k3403P8569
$$ 79049 187940 164871 -102695 -301736 15437 219335 108364 -92256 -115659 -37090
8044c7090L4682O1704L4894n9780j48633M0678j36323O0346K94135J35313k73627
$$ -37090 -2408 59296 94190 34410 -114223 -73545 -209868 -149522 144613 279926 6299
8033F299j91491q6589k4013K40810M6523J57743O6661o3465j46807k65939J47918
$$ 6299 -185192 -271781 -295794 -54984 -8461 149282 215943 152478 5671 -260268 -112350
8022a12350J6637J03157K82257j9324m6878j71317j60396k7679n8275J04943J61856
$$ -112350 -95713 7444 289701 270377 223499 52182 -108214 -135893 -194168 -89225 72631
8011G2631M5543k64493j72895J51739K05680R5788j17917j9426J10066J26193
$$ 72631 118174 -146319 -319214 -167475 38205 133993 16076 -3350 106716 232909
8001B32909o936l02669R3170J6833l8372j46040j44642J89572K92923L7171o8630
$$ 232909 225973 -76696 16474 33307 -5065 -151105 -295747 -106175 186748 223919 155289
7990A55289O5333k8313j63988k23596P2650M25834J42986j89044k84386r3489
$$ 155289 220622 192309 28321 -195275 -122625 303209 446195 257151 -27235 -120724
7980a20724K27577J58395M5183J5522j67205J05416q8818J15391m4397o8088j13378
$$ -120724 106853 265248 310431 325953 158748 264164 175346 290737 246340 178252 64874
7969F4874J20538j08617k20457r7528J9853O9768N5172P154J49500K7216l51533
$$ 64874 185412 76795 -143662 -241190 -221337 -151569 -96397 -89243 60257 87473 -264060
7958b64060l90125O0031L83334K74700K1026j26174j53379K9733L7172J8509J07691
$$ -264060 -654185 -594154 -210820 63880 84906 -41268 -194647 -164914 -127742 -109233 -1542
7947a542l7292k6890k44394q6837J13853K34342J87640j22280j43947P5277J95620
$$ -1542 -38834 -65724 -310118 -396955 -283102 -48760 138880 16600 -127347 -52070 143550
7936A43550J33401m0075m6500k2622r372K8603R159j47394n4782r6404j3908j43723
$$ 143550 276951 236876 190376 167754 158382 186985 196144 48750 -6032 -102436 -116344 -260067
7924b60067J45267J41325n6132k42830J7292J82521J0569j5413J00537O5805j48317
$$ -260067 -114800 26525 -29607 -272437 -255145 -72624 -62055 -77468 23069 88874 -59443
7913e9443r3827J83267j59746R4328J16177k5832J09396j98219j09296n8183J82289
$$ -59443 -153270 29997 -129749 -35421 80756 54924 164320 -33899 -143195 -201378 -19089
7902a9089O1858k58484O4899O2735j2160K969j78212j2449m1847J68377P4601
$$ -19089 42769 -215715 -150816 -88081 -100241 -97272 -275484 -287933 -329780 -161403 -86802
7891h6802M7478r7351K08149N4112l643J92311k14312m23849m3089l3272O8522
$$ -86802 -39324 -136675 71474 125586 121943 314254 99942 -323907 -366996 -400268 -331746
7880c31746J01428k839o6694N1206J04568o3767l885J35395k2094q3921L0483
$$ -331746 -230318 -233157 -299851 -248645 -144077 -207844 -211729 -76334 -98428 -182349 -151866
7869a51866P3150K8133l7166r6957K8185n8218J19033L9164N8186O3402r3756
$$ -151866 -78716 -50583 -87749 -184706 -156521 -214739 -95706 -56542 1644 65046 -28710
7858b8710K5241R0934J85409q4843Q2675l7424k6423l9854O1629j38481k73804
$$ -28710 -3469 87465 272874 188031 270706 233282 206859 167005 228634 90153 -183651
7847a83651k12866L24080J90042P6527n3903j5712J40404J55597q1121k44798
$$ -183651 -396517 -72437 117605 194132 140229 124517 264921 420518 339397 94599
7837I4599j44568p2080j05753J54924J23542j43799k02862p0841J04430J13831
$$ 94599 -49969 -122049 -227802 -72878 50664 -93135 -295997 -366838 -262408 -148577
7827a48577j1721m672J9425p2624R1622J22253l3957J50739k07506k22976j18057
$$ -148577 -160298 -164970 -145545 -218169 -126547 -4294 -38251 112488 -95018 -317994 -436051
7816d36051K10579j04509q319J42796j11266J29162J21638K11576K29292L11937
$$ -436051 -225472 -329981 -338300 -195504 -306770 -177608 -55970 155606 384898 696835
7806F96835J6915j84431j88761P2908j33527N4961L1034n2908j40146j37163K6000
$$ 696835 713750 529319 340558 413466 279939 334900 365934 313026 172880 35717 61717
7795F1717K54530o3186l49016j81472M2007r02n0489J29986L27335K1771j48521
$$ 61717 316247 253061 -95955 -277427 -235420 -236322 -286811 -156825 170510 192281 43760
7784D3760o6923o7063j45854n0610K80140J36638j5066j51162p6474p5036M7391
$$ 43760 -23163 -90226 -236080 -286690 -6550 130088 115022 -36140 -112614 -187650 -140259
7773a40259K00387J61553J8881k12734j18005O8619N920j5695L893R3578j56053
$$ -140259 60128 221681 240562 27828 -90177 -21558 -15638 -31333 -27440 66138 -89915
7762h9915n5153j62475j03310L4179j80768L5667L57004J63681L10686p1931p4865
$$ -89915 -145068 -307543 -410853 -376674 -557442 -521775 -164771 -1090 309596 237665 162800
7751A62800J26404J4341l5030n2319l0782N8434P3025j58047k68728k04443n484
$$ 162800 289204 303545 268515 216196 185414 243848 316873 158826 -109902 -314345 -319829
7740c19829J50806m1375n1264J22947J22142N0561J71615O9741k5477q5200j11251
$$ -319829 -169023 -210398 -261662 -138715 -16573 33988 205603 275344 249867 164667 53416
7729E3416k97896l7185K88871J54783Q421p0314M707R1457r9345r9854P0274r1778
$$ 53416 -244480 -281665 7206 161989 170410 100096 104803 196260 96915 -2939 67335 -24443
7717b4443j66500R5500Q555N4158O3004J89440k7181q1984n814r1518j06701J92587
$$ -24443 -190943 -95443 -86888 -32730 30274 219714 192533 110549 104735 13217 -93484 99103
7705I9103K69641o8666j57074k16197k002J33852N1550k00195l6191l0608R8280
$$ 99103 368744 300078 143004 -73193 -75195 58657 110207 -89988 -126179 -156787 -58507
7694e8507k4959M1695Q0437l1015J61021j8291j12809k83564m3976J20513J17677
$$ -58507 -83466 -41771 38666 7651 168672 150381 37572 -245992 -289968 -169455 -51778
7683e1778Q816P5579j39620J57830K08807K2515q034R7220j48864k30069k1188
$$ -51778 -42962 32617 -107003 50827 259634 282149 274115 371335 222471 -7598 -28786
7672b8786L2856J88848J07866k09865j27620j30079N1720J347k7561j88396J34083
$$ -28786 4070 192918 300784 90919 -36701 -166780 -115060 -113713 -141274 -329670 -195587
7661a95587J00500M6031k55495j9254K21399K4952j14939J11415n7432k4232K10709
$$ -195587 -95087 -49056 -304551 -323805 -102406 -77454 -192393 -80978 -138410 -162642 48067
7650D8067j40690J29572n4335m9164N4721k43089P078J35567R0285M0573K31965
$$ 48067 -92623 36949 -17386 -66550 -11829 -254918 -247840 -112273 -21988 18585 250550
7639B50550l1743Q644J8535n1575j32407j85907o5660J05102Q0360N1644K9487
$$ 250550 218807 227451 245986 194411 62004 -123903 -189563 -84461 -4101 47543 77030
7628G7030k17990j17270P004J18912J37985J67409j87209j93696K05633J44525
$$ 77030 -140960 -258230 -251226 -132314 5671 173080 -14129 -207825 -2192 142333
7618A42333K00813k39080k85625J83646J21936j15093j01068K8905o4222j90531
$$ 142333 343146 104066 -181559 2087 124023 8930 -92138 -63233 -127455 -317986
7608c17986j37092J50830J04486J61539p77N9745J64223J27572l07219j10973
$$ -317986 -455078 -304248 -199762 -38223 -39000 20745 184968 312540 5321 -105652
7598a05652j2982K70068K8940j08725k94947l67044K14033K79337J19253j04871
$$ -105652 -118634 151434 180374 71649 -223298 -590342 -376309 -96972 22281 -82590
7588h2590m1490m4881L5053J81251J58157M0059j4749J71660q2834j43059j94595
$$ -82590 -124080 -168961 -133908 47343 205500 245559 230810 402470 319636 176577 -18018
7577a8018q700J99724p3459J71557p7097j75967J3596l6629r4798R2266k5438
$$ -18018 -26718 173006 99547 271104 194007 18040 31636 -4993 -99791 -7525 -32963
7566c2963k24872k52123J27688L24368J0800L8212J82j6613j33841l1373K15810
$$ -32963 -257835 -509958 -382270 -57902 -47102 -8890 -8708 -25321 -159162 -190535 25275
7555B5275P4522Q3137J89502q5459j70590j24843j6990J98403O9248k81233O776
$$ 25275 99797 182934 372436 286977 116387 -8456 -25446 172957 242205 -39028 -32252
7544c2252M8874m5018n4903q1458M7847K72987J87419J89225k83034k36149j6661
$$ -32252 16622 -28396 -83299 -164757 -116910 156077 343496 532721 249687 13538 -3123
7533c123l6071J7178K29546n4095j39956k7616l6620J15362J60377o5544K650
$$ -3123 -39194 -22016 207530 153435 13479 -14137 -50757 64605 224982 159438 162088
7522A62088j90137O7615N3493K15024k98618l0318Q2730j08091j61980J40405
$$ 162088 -28049 39566 93059 308083 9465 -20853 61877 -46214 -208194 -67789
7512f7789Q4058O8094P8722j36960j17198j03359j4252R2461j80699L403L01799
$$ -67789 16269 84363 163085 26125 -91073 -194432 -208684 -116223 -296922 -293519 8280
7501H280J0546l4546j5766m8017k2774r2909k29837N5686p0417m6336m9996j2135
$$ 8280 18826 -15720 -31486 -79503 -102277 -195186 -425023 -369337 -439754 -486090 -536086 -548221
7489e48221R1797J29339L40625j674j21333j57462J29932j31233q0117l671j7818
$$ -548221 -456424 -327085 13540 11866 -109467 -266929 -136997 -268230 -348347 -352018 -369836
7478c69836J0801J62091k9644J85665P7705j15075k84738k60280K93863L32271
$$ -369836 -359035 -196944 -226588 -40923 36782 -78293 -363031 -623311 -329448 2823
7468B823R4814J78976P2851k36288k03251M1386p5253J40097o6981n6827N6656
$$ 2823 97637 276613 349464 113176 -90075 -48689 -123942 16155 -50826 -107653 -50997
7457e0997O3371J20865L6859m80056m1175L5039P9232Q6007J03768K42565P8299
$$ -50997 12374 133239 170098 -309958 -351133 -316094 -236862 -150855 -47087 195478 273777
7446B73777j52412O1581M0478K6780j02755j44728l6085k30458N8463J5791J5702
$$ 273777 121365 182946 223424 250204 147449 2721 -33364 -263822 -205359 -189568 -173866
7435a73866n0788N4590q5685l84J40077P9361j03737j58415J1761Q3173P1554
$$ -173866 -224654 -170064 -255749 -256133 -116056 -36695 -140432 -298847 -287086 -203913 -132359
7424a32359j4489J44655j7935N2054K5297k73904J94045J27284p1066o4706l24541
$$ -132359 -146848 -2193 -20128 31926 57223 -216681 -22636 104648 33582 -31124 -355665
7413c55665J243K38309Q8458R5872J56479Q1932M3432k26864k64062p4907r3428
$$ -355665 -354422 -116113 -27655 68217 224696 306628 350060 123196 -140866 -215773 -309201
7402c09201o8181K52710K43945J88285j82991o1484K11738l23948j79221l15804
$$ -309201 -377382 -124672 119273 307558 124567 63083 274821 -49127 -228348 -544152
7392e44152n3670L68284J85632j19976J48447k5688O5239M20238J67793k36203
$$ -544152 -597822 -229538 -43906 -163882 -15435 -41123 24116 444354 612147 375944
7382C75944R498m52605j05603J18921m7722j38843o707K07645p3515J51642J10119
$$ 375944 385442 -67163 -172766 -53845 -101567 -240410 -247117 -39472 -112987 38655 148774
7371A48774j1855p4530K6400k5872k97884k04970J48010K95841R7504l2699p9507
$$ 148774 136919 62389 88789 62917 -234967 -439937 -291927 3914 101418 68719 -10788
7360a0788j55467K240M09073Q9758j96160j55992l46574P8885j57278r6669L06596
$$ -10788 -166255 -164015 245058 334816 138656 -17336 -363910 -285025 -442303 -538972 -232376
7349b32376J06715j0712j43020J13755J35005J19768j24891j21220l7696n6460
$$ -232376 -125661 -136373 -279393 -165638 -30633 89135 -35756 -156976 -194672 -251132
7339b51132J19052j17975L44381M5794n0161j12345q1551O6397J20619R9094J21409
$$ -251132 -132080 -250055 94326 140120 89959 -22386 -103937 -37540 83079 182173 303582
7328C03582J83633k3348k15178j01522L3162p6437k39388k00813p6341n8147R1717
$$ 303582 487215 463867 248689 147167 180329 103892 -135496 -336309 -412650 -470797 -379080
7317c79080J49559j5776K14777j0079j25447J06305P1032Q7969P0355O3557J46146
$$ -379080 -229521 -245297 -30520 -40599 -166046 -59741 11291 99260 169615 233172 379318
7306C79318q7873j61707Q9741o8697o5388l6293J30746K75832j13966L3647k53239
$$ 379318 291445 129738 219479 150782 85394 49101 179847 455679 341713 375360 122121
7295A22121j63649J59753J79357j41713j11023j3749Q8250j72330j96323J44346
$$ 122121 -41528 118225 297582 155869 44846 31097 119347 -52983 -249306 -104960
7285a04960J98545J60399N4713j73639j01101O0294q1858L3276j60545l34126
$$ -104960 93585 253984 308697 135058 33957 94251 12393 45669 -114876 -449002
7275d49002Q3183L42814J29998K58374Q4117n7148J9122j48214j70420j64730
$$ -449002 -365819 -23005 106993 365367 449484 392336 411458 263244 92824 -71906
7265g1906N5741p9798k1641k8145j99466l2242J97705J41232N6778J7810J4661
$$ -71906 -16165 -95963 -117604 -145749 -345215 -377457 -179752 -38520 18258 36068 50729
7254E0729q3485M4436J68011N6034n0552J2461J9314j04792j75844K4386K2277
$$ 50729 -32756 11680 179691 235725 185173 197634 216948 112156 -63688 -39302 -17025
7243a7025q6610J15926j27754j23856L3393J01802J94055l03595k42975J51724
$$ -17025 -103635 12291 -115463 -239319 -205926 -104124 89931 -213664 -456639 -304915
7233c04915J01487P412j02479m939Q5971j6235o1404P8882J5995J16471K36982
$$ -304915 -203428 -196016 -298495 -303434 -217463 -233698 -295102 -216220 -200225 -83754 153228
7222A53228j43202j55303j71631J30889P6965J34244O4944r8685j5882n0460P832
$$ 153228 10026 -145277 -316908 -186019 -109054 25190 90134 -8551 -24433 -74893 -67061
7211f7061P0395Q2828q1119k73158j345O4897j06640j22407J01117K1070J58415
$$ -67061 3334 86162 5043 -268115 -269460 -204563 -311203 -433610 -332493 -311423 -153008
7200a53008J28069l332J81883O4936j80859N4251j7595J12808j34463m0170k45312
$$ -153008 -24939 -28271 153612 218548 37689 91940 74345 187153 52690 12520 -232792
7189b32792K97174J83384o9121j60955j58757p3027J20071M4132j25982j24611
$$ -232792 64382 247766 178645 17690 -141067 -214094 -94023 -49891 -175873 -300484
7179c00484P9300J00634Q9277K3085o2762p0065m3299K2440P6841l23024j59866
$$ -300484 -221184 -120550 -31273 -8188 -70950 -141015 -184314 -161874 -85033 -408057 -567923
7168e67923J94905Q0606Q5442J73335J47061J05900k77773k37693o2664J77256
$$ -567923 -373018 -292412 -206970 -33635 113426 219326 -58447 -296140 -358804 -181548
7158a81548j95441J05800j10756n1453J45307R1068j22315J94612J44205O68j10759
$$ -181548 -376989 -271189 -381945 -433398 -288091 -197023 -319338 -124726 19479 20147 -90612
7147i0612k71962J33750Q5015k1032K51726K37870j1318j67999r3574k1753l747
$$ -90612 -362574 -228824 -143809 -164841 86885 324755 313437 145438 51864 30111 26364
7136B6364l8172j58822K0269M1155J3231J1592J64576L67539j12352m61350j17362
$$ 26364 -11808 -170630 -150361 -109206 -95975 -84383 80193 447732 335380 -125970 -243332
7125b43332J09939m6147J2694J48894j1173Q3923l6870m8644L7385k9771j05449
$$ -243332 -133393 -179540 -166846 -17952 -29125 54798 17928 -30716 6669 -23102 -128551
7114a28551K26063K21461k50773j41295p0009n0085n2738K13651Q1242j21094
$$ -128551 97512 318973 68200 -73095 -143104 -193189 -245927 -32276 48966 -72128
7104g2128j29425K08516K43497n7287o7315M3146k42076k71705k28928K95418
$$ -72128 -201553 6963 250460 193173 125858 169004 -73072 -344777 -573705 -278287
7094b78287J77211r0719p4869j5094M0871L9284J22366P912j16110o6421j15607
$$ -278287 -101076 -191795 -266664 -281758 -240887 -201603 -79237 -71325 -187435 -253856 -369463
7083c69463J61032L42731q5788o7003k578j20559j27430J26460K1782O1614J55036
$$ -369463 -208431 134300 48512 -18491 -21069 -141628 -269058 -142598 -120816 -59202 95834
7072I5834Q9629M9949k24793j7594r7508j30269j07236j07264P109j67776p5336
$$ 95834 185463 235412 10619 -6975 -104483 -234752 -341988 -449252 -442143 -609919 -685255
7061f85255L44159J80428J48099j7211j3917L1809J03828j9033r4061M772j07102
$$ -685255 -341096 -160668 -12569 -29780 -43697 -11888 91940 72907 -21154 -16382 -123484
7050a23484p9514r0575J19714o9551J06121J75142r6153n0155j68180j80248J21945
$$ -123484 -202998 -293573 -173859 -243410 -137289 37853 -58300 -108455 -276635 -456883 -334938
7039c34938J05747K35569K47323q3362j64843m6221J1682j3022k08209k1817O133
$$ -334938 -229191 6378 253701 170339 5496 -40725 -29043 -42065 -250274 -272091 -265958
7028b65958J45245N6855J62655J05877K9099j10305r5010l2949n5K19701o6888
$$ -265958 -120713 -63858 98797 204674 233773 123468 28458 -4491 -4546 215155 148267
7017A48267R7572j34263k07353m6963j58381J03861J29016j5833L7652J14439
$$ 148267 245839 111576 -95777 -142740 -301121 -197260 -68244 -84077 -46425 68014
7007F8014J58676j56443o2201j24191J25042J13160O9765Q424l5248j10584j37829
$$ 68014 226690 70247 8046 -116145 8897 122057 191822 200246 164998 54414 -83415
6996h3415J42087K88337L0849j44373L0606j18489j24117K4212p5467r116o9162
$$ -83415 58672 347009 377858 233485 264091 145602 21485 45697 -29770 -38886 -108048
6985a08048J66685k3748j93402J73554L5228Q4504r1884j3770J36097K4534n6559
$$ -108048 58637 34889 -158513 15041 50269 134773 42889 29119 165216 189750 133191
6974A33191J50918O9525J0408M442k84431j16581o3178j32283j33672O1519K27186
$$ 133191 284109 353634 364042 368484 84053 -32528 -95706 -227989 -361661 -300142 -72956
6963g2956K2745j77223K24629M9378l638K8314k9638O4590J1950o4543q6029L3810
$$ -72956 -50211 -227434 -2805 46573 42935 71249 41611 106201 118151 53608 -32421 1389
6951A389m2995Q4064n0365r3170M6718K49166J07530N0703j37100j08260p8620
$$ 1389 -41606 42458 -7907 -101077 -54359 194807 302337 353040 215940 107680 29060
6940B9060k0178M88655Q9571R3082j12200k22103k56097p2106M402P2930K2012
$$ 29060 8882 497537 587108 680190 567990 345887 89790 17684 22086 95016 117028
6929A17028r4996J54248m9229k9982o0324J14753J44639J55195n5700q1119j69200
$$ 117028 22032 176280 127051 97069 36745 151498 296137 451332 395632 314513 145313
6918A45313l9770L6262q6115k5793j63838K01334J86438j2178k16415n9544l6663
$$ 145313 105543 141805 55690 29897 -133941 67393 253831 241653 25238 -34306 -70969
6907g0969l3871j5934K7299j25784J2727k04038J03343J29677J65739M1640o7751
$$ -70969 -104840 -120774 -93475 -219259 -206532 -410570 -307227 -177550 -11811 29829 -37922
6896c7922j06946p3061M1036K12229O7821Q7808J7320j86472k99306J68458K56258
$$ -37922 -144868 -217929 -176893 35336 103157 190965 208285 21813 -277493 -109035 147223
6885A47223p1081M1456p1638R0199J84984k00818j53585R888L7673O4090j93053
$$ 147223 76142 117598 45960 136159 321143 120325 -33260 -23372 14301 78391 -114662
6874a14662p0050j92726N9823J00345K08638o7413j51565K87669K430n0740J13592
$$ -114662 -184712 -377438 -317615 -217270 -8632 -76045 -227610 60059 62489 11749 125341
6863A25341J27526K3214j65216l80194j35593n5994n5930J54323K12461j07041
$$ 125341 252867 276081 110865 -269329 -404922 -460916 -516846 -362523 -150062 -257103
6853b57103K46525K34226j20590j08196j91780N7841J10129j69R42J63089L9587
$$ -257103 -10578 223648 103058 -5138 -196918 -139077 -28948 -29117 -28175 134914 174501
6842A74501J0845R94j5049J56571L8001O4455k75120k07243m671R4875K1683m0301
$$ 174501 185346 186340 171291 327862 365863 430318 155198 -52045 -56716 38159 59842 19541
6830A9541k9982q4292j61858j2736J04468K9006l3479O9650M22887J14795l60183
$$ 19541 -10441 -94733 -256591 -269327 -164859 -135853 -169332 -99682 323205 438000 77817
6819G7817p2458o1842J36455j51212k88584j20827K14344K72368r7946J3531L8624
$$ 77817 5359 -56483 79972 -71240 -359824 -480651 -266307 6061 -91885 -78354 -39730
6808c9730k13573j53785N2289L98293K07143N7108j17687k8931J02864K86865
$$ -39730 -253303 -407088 -354799 43494 250637 307745 190058 161127 263991 550856
6798E50856M4000j60020k28603j32306j23980L9479q3651r3156J18610K85979
$$ 550856 594856 434836 206233 73927 -50053 -10574 -94225 -187381 -68771 217208
6788B17208L36432k1901j24093M0454k32497r6827l5744j39577J55711K9372k0490
$$ 217208 553640 531739 407646 448100 215603 118776 83032 -56545 99166 128538 108048
6777A08048n6165j75745M1472k06975p1865m6925p5316j23201Q6523K51515K50686
$$ 108048 51883 -123862 -82390 -289365 -361230 -408155 -483471 -606672 -520149 -268634 -17948
6766a7948k99j43198l8019L7346J56603K146P4622j28832k63706j33980Q4020
$$ -17948 -18247 -161445 -199464 -162118 -5515 -3369 71253 -57579 -321285 -455265 -371245
6755c71245L24669j26293J53032J68263p3422j42983n7389k42252O2256j1498
$$ -371245 -46576 -172869 -19837 148426 75004 -67979 -125368 -367620 -305364 -316862
6745c16862J80728j43795o5238Q7955j45558J53703J72889q3623j73461m5553
$$ -316862 -136134 -279929 -345167 -257212 -402770 -249067 -76178 -159801 -333262 -378815
6735c78815o4269K34160J94639j37055Q9211l1057j27663j1663J94407J6954L6202
$$ -378815 -443084 -208924 -14285 -151340 -62129 -93186 -220849 -232512 -38105 -21151 15051
6724A5051L57125K5192j25673k29243k55501o6485N6305Q9298J20174J82832l0299
$$ 15051 372176 397368 271695 42452 -213049 -279534 -223229 -133931 -13757 169075 138776
6713A38776k41636K42951k38362p0906J04612m4829J58221Q6209J2152P8203L55
$$ 138776 -102860 140091 -98271 -169177 -64565 -109394 48827 135036 147188 225391 225746
6702B25746J52400j01113m2697p1910O1754j44753j11471j78502k15J10041J70422
$$ 225746 378146 277033 234336 162426 224180 79427 -32044 -210546 -210761 -100720 69702
6691F9702J77724J5696j43014k32340m1430J23657J01698L6875j52532j41400
$$ 69702 247426 263122 120108 -112232 -153662 -30005 71693 108568 -43964 -185364
6681a85364O7752M9413J40135M4822k39078j17528J14632l3601j63549J31280
$$ -185364 -117612 -68199 71936 116758 -122320 -239848 -125216 -158817 -322366 -191086
6671a91086K20316k50883n908j71232K2291R8378O7406j4480k4317r2828K75433
$$ -191086 29230 -221653 -227561 -398793 -376502 -278124 -210718 -225198 -249515 -342343 -66910
6660f6910j01579j93803Q0648J21977m189J61923P0222j41409m4276K89983p67
$$ -66910 -168489 -362292 -281644 -159667 -163856 -1933 68289 -73120 -117396 172587 171820
6649A71820l2183j00571n9826K60129P6465l12313k43338P3718k7734k267r2778
$$ 171820 139637 39066 -20760 239369 315834 3521 -239817 -166099 -193833 -196100 -288878
6638b88878Q3007K0578n8883j88605J96638J50577m7960M0271Q842n7155K9262
$$ -288878 -205871 -185293 -244176 -432781 -236143 -85566 -133526 -93255 -84413 -141568 -112306
6627a12306m838k16851j11449O7321O8824L75894J85246j61377m6789n6410k42923
$$ -112306 -117144 -333995 -445444 -378123 -309299 66595 251841 90464 43675 -12735 -255658
6616b55658J16947P8209j31489j1662J78222J0593l6685K24643J15638j35983
$$ -255658 -138711 -60502 -191991 -203653 -25431 -14838 -51523 173120 288758 152775
6606A52775Q7037j04202l677k11910r7073M7156o756p2566J72405J74204J42778
$$ 152775 239812 135610 131933 -79977 -177050 -129894 -136650 -209216 -36811 137393 280171
6595B80171J40639j71267k32920k39454j49609j91272J68485J87176J80993K52664
$$ 280171 420810 249543 16623 -222831 -372440 -563712 -395227 -208051 -27058 225606
6585B25606J18704j02306q8368n2051L0838q1763J4280K7665Q078J6029J43861
$$ 225606 344310 242004 153636 101585 132423 50660 64940 92605 100683 116712 260573
6574B60573j79152p9845o7209L8646j82716p9575P8560j63908j11310k9631K36309
$$ 260573 81421 1576 -65633 -26987 -209703 -289278 -210718 -374626 -485936 -515567 -279258
6563b79258J3466J80245p734j19234j83978Q4835K79321L38717n1717j31026o1448
$$ -279258 -265792 -85547 -93281 -212515 -396493 -311658 -32337 306380 254663 123637 62189
6552F2189K14055j0329j84211j42733l59864n9927L78581O030p7954N4660N0902
$$ 62189 276244 265915 81704 -61029 -420893 -480820 -102239 -96209 -174163 -119503 -68601
6541f8601j0274j94699k11072J20978J73874K10580J89734J28786O282k66793
$$ -68601 -78875 -273574 -484646 -363668 -189794 20786 210520 339306 345588 78795
6531G8795l46400j14563J32150K5757K50R8179K14887q980j05428k42029m2179
$$ 78795 -267605 -382168 -250018 -224261 -224011 -125832 89055 80075 -25353 -267382 -309561
6520c09561O3360J71318K5219Q6059K6109k03234l1999k04140J52866L23704J1207
$$ -309561 -246201 -74883 -49664 36395 62504 -140730 -172729 -376869 -224003 99701 110908
6509A10908j62273O0143k7990n2394l3062l2530J77594M20320k75916j53274M0114
$$ 110908 -51365 8778 -19212 -71606 -104668 -137198 40396 460716 184800 31526 71640
6498G1640p3271n6975L6389j40830J42099K05989J07247j26241j35410O9624k8569
$$ 71640 -1631 -58606 -22217 -163047 -20948 185041 292288 166047 30637 100261 71692
6487G1692j14190l0326J38809q2094j24622J6551j12622m4882J64706K48996j66586
$$ 71692 -42498 -72824 65985 -16109 -140731 -124180 -236802 -281684 -116978 132018 -34568
6476c4568k33809k04908N8784M8129r946R0930M518M7558K8964O0011K65797J53317
$$ -34568 -268377 -473285 -414501 -366372 -376318 -285388 -280870 -233312 -204348 -144337 121460 274777
6464B74777k16436j80695j8194j1093L9269o5082J0414J15111j4861O986J29833
$$ 274777 58341 -122354 -140548 -151641 -112372 -177454 -167040 -51929 -66790 -59804 70029
6453G0029J97383j20631j22178m0536L9418N6770k02592J09858J22637P0838q2041
$$ 70029 267412 146781 24603 -15933 23485 80255 -122337 -12479 110158 180996 98955
6442I8955L7518J89761j36280j16702m3366j28690O3214N100J3387J76682J13842
$$ 98955 136473 326234 189954 73252 29886 -98804 -35590 -30490 -17103 159579 273421
6431B73421p7161k7152k3000p3674K14328L8596J4096k87425l06687j8257J20899
$$ 273421 196260 169108 146108 72434 286762 325358 339454 52029 -254658 -272915 -152016
6420a52016J97000N4111m24676l76975P1880M27476J26532N1910K24043J72279
$$ -152016 44984 99095 -325581 -702556 -630676 -203200 -76668 -24758 199285 371564
6410C71564k22089k49631l9230j0165J72110r4336r4096j75255m9987k1874p6817
$$ 371564 149475 -100156 -139386 -149551 22559 -71777 -165873 -341128 -391115 -412989 -489806
6399d89806L20738Q4085n0123m0481J42349k5205j43772J09780J204J55085n268
$$ -489806 -169068 -84983 -135106 -175587 -33238 -58443 -202215 -92435 -91231 63854 58586
6388E8586j40486j13729Q9006M081n8308Q4634J80720K17945n568j77514N6838
$$ 58586 -81900 -195629 -106623 -102542 -160850 -76216 104504 322449 316881 139367 196205
6377A96205J18877k1616j74360p1960R453L8396L9782r00j68669k14016k05393
$$ 196205 315082 293466 119106 47146 56599 94995 134777 133877 -34792 -248808 -454201
6366d54201J21268K35115J05767P0625J6517j95218k84105J7782k5965J10679
$$ -454201 -332933 -97818 7949 78574 95091 -100127 -384232 -366450 -392415 -281736
6356b81736O0981j91847L1848J8046L56518K34035k45491j72262k99901r9294
$$ -281736 -220755 -412602 -380754 -362708 -6190 227845 -17646 -189908 -489809 -589103
6346e89103K42183j696j67128P2444J4818J05181K03685Q4464N0306K1019l0561
$$ -589103 -346920 -348616 -515744 -443300 -428482 -323301 -119616 -35152 15154 36173 5612
6335E612O8038k15325J2651M9512N66J16940K56498k6746j99364j81741j09846
$$ 5612 73650 -141675 -129024 -79512 -78946 37994 294492 267746 68382 -113359 -223205
6324b23205J59826J53176l1191j56497N4835L928L6024j98101J35513Q4484l1113
$$ -223205 -63379 89797 58606 -97891 -43056 -39128 -3104 -201205 -65692 18792 -12321
6313a2321r0529r6089p1612P2684N1543j89n6114k5747k642M5979k2907K87110
$$ -12321 -102850 -198939 -270551 -197867 -146324 -146513 -202627 -228374 -231016 -185037 -207944 79166
6301G9166m3581o1394J2756J07963P9340O0159J396j88621j61898K2632r953j09903
$$ 79166 35585 -25809 -13053 94910 174250 234409 235805 47184 -114714 -92082 -102035 -211938
6289b11938n0879n7303P8003l4531j44078J9957J12085L4382J83230K9975q0404
$$ -211938 -262817 -320120 -242117 -276648 -420726 -400769 -288684 -254302 -71072 -41097 -121501
6278a21501J15232k4602K4778R9451k56649r0429K57657J68808j39025K5664J72998
$$ -121501 -6269 -30871 -6093 93358 -163291 -253720 3937 172745 33720 59384 232382
6267B32382Q9694L7720j51449m13214j56017K11586J97449j97523o5249O4479
$$ 232382 322076 359796 208347 -204867 -360884 -149298 48151 -149372 -214621 -150142
6257a50142J55261K861j49668L1198K74786P9616j39198O5543j29158k28730P7667
$$ -150142 5119 7980 -141688 -110490 164296 243912 104714 170257 41099 -187631 -109964
6246a09964K32341j01175J72956p996j45273j9529K58750r1286l19540q8870Q0568
$$ -109964 122377 21202 194158 186162 40889 21360 280110 188824 -130716 -219586 -139018
6235a39018J58106J21418Q8780k54230Q2205K9866L2009j12377J13055J9259j25985
$$ -139018 19088 140506 229286 -24944 57261 87127 119136 6759 119814 139073 13088
6224A3088k79760N2783K4780p2571J64999j92874L34309L07832K04089l27598
$$ 13088 -266672 -213889 -189109 -261680 -96681 -289555 44754 352586 556675 229077
6214B29077k35753k15024L8359j61656l9983J03811p8659k8474J92217O2767J655
$$ 229077 -6676 -221700 -183341 -344997 -384980 -281169 -359828 -388302 -196085 -133318 -131663
6203a31663K0657n2062P548m8981K85151J46404j63498k88077p6154k1174Q5484
$$ -131663 -111006 -163068 -155520 -204501 80650 227054 63556 -224521 -300675 -321849 -236365
6192b36365K25510J26584L82416j53049l38870k21203k0052J9524O7993J35617
$$ -236365 -10855 115729 498145 345096 6226 -214977 -235029 -215505 -147512 -11895
6182a1895q635K11937k7732m03916n6981j48272j51025r3468L02377L12404j55035
$$ -11895 -20530 191407 163675 -240241 -297222 -445494 -596519 -689987 -387610 -75206 -230241
6171b30241l17292K47219R3077l16536p9681K17464J76200J13649k1989J62515
$$ -230241 -547533 -300314 -207237 -523773 -603454 -385990 -209790 -96141 -118130 44385
6161D4385L6754K05900l2349j08207j0927j84847j5061K1894m5909j76523K60979
$$ 44385 81139 287039 254690 146483 135556 -49291 -64352 -42458 -88367 -264890 -3911
6150c911J18891K395j24314j66541l6475m4761K2220j14971j27089m1005M0315
$$ -3911 114980 117375 -6939 -173480 -209955 -254716 -232496 -347467 -474556 -515561 -475246
6139d75246p7408J19427K55785j43047J21847L8342p3401J0640R609N9141n5592
$$ -475246 -552654 -433227 -177442 -320489 -198642 -160300 -233701 -223061 -213452 -154311 -209903
6128b09903J7440K98102J03113o4250J4356n02682l26151K94253J73418n4153
$$ -209903 -192463 105639 208752 144502 158858 -343824 -669975 -375722 -202304 -256457
6118b56457K46845J59116O2512j75254m7795k02283m7405J95783j11595k11475
$$ -256457 -9612 149504 212016 36762 -11033 -213316 -260721 -64938 -176533 -388008
6108c88008j67496q4342J57137P5302J46588K16908L075p0384J96356Q2043j41395
$$ -388008 -555504 -639846 -482709 -407407 -260819 -43911 -40836 -111220 85136 167179 25784
6097B5784j05080Q4819N8778j00176o683l3041J14053J33457j18792R962Q4745
$$ 25784 -79296 5523 64301 -35875 -42558 -75599 38454 171911 53119 63081 147826
6086A47826q8913j96621K2003L8744j38689q8941k0322R9228L4250p3320J92088
$$ 147826 58913 -137708 -115705 -76961 -215650 -304591 -324913 -225685 -191435 -264755 -72667
6075g2667L1203r1000k03647n8054J52487O3403R0310J1462m3028q5434l2370
$$ -72667 -41464 -132464 -336111 -394165 -241678 -178275 -87965 -76503 -119531 -204965 -237335
6064b37335j33143n2116K83607K05020J537R5467M1779J9509j10207j88721j50481
$$ -237335 -370478 -422594 -138987 66033 67570 163037 204816 224325 114118 -74603 -225084
6053b25084R6095J67547J01666J43664J66520J44212o8726l96864j18762N3512
$$ -225084 -128989 38558 140224 283888 450408 594620 525894 129030 10268 63780
6043F3780j08799O5172j59413j28504K3341j00089K36072J93214J57396n8434
$$ 63780 -45019 20153 -139260 -267764 -244423 -344512 -108440 84774 242170 183736
6033A83736N8626O0066P574j69892j42907j83114n3211J69747j97094j14750K24856
$$ 183736 242362 302428 310002 140110 -2797 -185911 -239122 -69375 -266469 -381219 -156363
6022a56363n1179m20746j9653K78208p9482L6701r3639j01240Q9592K56831J94288
$$ -156363 -207542 -628288 -647941 -369733 -449215 -412514 -506153 -607393 -517801 -260970 -66682
6011f6682N1633J50408j5766j73004J26086O505o0344j16796r1785J38915N1552
$$ -66682 -15049 135359 119593 -53411 72675 79180 18836 -97960 -189745 -50830 722
6000G22n5727J08467j1708j08322n274O317m1341p1526M4582p3486O5729P984
$$ 722 -55005 53462 41754 -66568 -71842 -65525 -106866 -178392 -133810 -207296 -141567 -133583
5988a33583K57955j4050j82732n5834p7869j5148K2566R2992J7865p1776Q0327
$$ -133583 124372 110322 -72410 -128244 -206113 -221261 -198695 -105703 -87838 -159614 -79287
5977g9287M4622J5212M4579k7027j90130J21267J52859r4394m4057K86534O5309
$$ -79287 -34665 -19453 25126 -1901 -192031 -70764 82095 -12299 -56356 230178 295487
5966B95487k86629k13684J76267J2971l4418l8359P633j15231j09496P0884J53151
$$ 295487 8858 -204826 -28559 -15588 -50006 -88365 -80732 -195963 -305459 -234575 -81424
5955h1424q6921K46734J000j17471j80832L5672P6560O1227j55157k388J26368
$$ -81424 -168345 78389 79389 -38082 -218914 -183242 -106682 -45455 -200612 -203000 -76632
5944g6632K10021J40420p1529k79134Q8510J63275J64138r4232l04928l75984
$$ -76632 133389 273809 202280 -76854 11656 174931 339069 244837 -60091 -436075
5934d36075k20398N3297R8927L49522J8198K6315R9591J51828M8374J37388j77449
$$ -436075 -656473 -603176 -504249 -154727 -136529 -110214 -10623 141205 189579 326967 149518
5923A49518j39720j39873n6367o1751J60736N8604l4338J18367J9765j02180r6577
$$ 149518 9798 -130075 -186442 -248193 -87457 -28853 -63191 55176 74941 -27239 -123816
5912a23816q9824K31205L27991M5789k18795j04785r1456K31547n627j70358k21606
$$ -123816 -213640 17565 345556 391345 172550 67765 -23691 207856 202229 31871 -189735
5901a89735j20365P8760j73254m8347L15908m7378j34196j57275J3756J27005
$$ -189735 -310100 -231340 -404594 -452941 -137033 -184411 -318607 -475882 -462126 -335121
5891c35121K18122K47048j57634k8357M7654J09848Q7028k11724j18289o631J33512
$$ -335121 -116999 130049 -27585 -55942 -8288 101560 188588 -23136 -141425 -148056 -14544
5880a4544J08976q8153J16796P5090j63345p3799n7563p3279l7613p3885J54981
$$ -14544 94432 6279 123075 198165 34820 -38979 -96542 -169821 -207434 -281319 -126338
5869a26338J56752j08368P7853r8352j66494j59271J56403K36276j88643Q9308
$$ -126338 30414 -77954 -101 -98453 -264947 -424218 -267815 -31539 -220182 -130874
5859a30874q3505j31616P3795K2337M148j6501K8611M4995K65R5811K4095K21296
$$ -130874 -214379 -345995 -272200 -249863 -245715 -262216 -233605 -188610 -188345 -92534 -68439 152857
5847A52857q1351P2825p5847l61305j0505J69203J16629k9137P2773j10039J5368
$$ 152857 71506 144331 68484 -292821 -303326 -134123 -17494 -46631 26142 -83897 -68529
5836f8529r0790j95236M3867j88449J43016J01705r472j19564j8872J44987K66828
$$ -68529 -159319 -354555 -310688 -499137 -356121 -254416 -263888 -383452 -402324 -257337 9491
5825I491m3554k11698r4296P1237k31776L919J24329P9640P5487L003R5596J17311
$$ 9491 -34063 -245761 -340057 -268820 -500596 -496677 -372348 -292708 -217221 -214218 -118622 -1311
5813a311p7543N9141p5339J37690J19559l5893q6107j16499j28558j68363K7890
$$ -1311 -78854 -19713 -95052 42638 162197 126304 40197 -76302 -204860 -373223 -345333
5802c45333J78170J75060o9603q4286J68924J17226j19909l9657N9942J24075
$$ -345333 -167163 7897 -61706 -145992 22932 140158 20249 -19408 40534 164609
5792A64609L5465m01804P2519J42478j26044p5925n8607Q9366M4806j39978k9060
$$ 164609 200074 -201730 -129211 13267 -112777 -188702 -247309 -157943 -113137 -253115 -282175
5781b82175K83137j0536N0591j25217j04605j04734K3355J26517j27275o5796
$$ -282175 962 -9574 41017 -84200 -188805 -293539 -270184 -143667 -270942 -336738
5771c36738K4132R9480K85322L67964K22634j17621k34361q9857p4892p6711j61278
$$ -336738 -312606 -213126 72196 440160 662794 545173 310812 220955 146063 69352 -91926
5760i1926J45225Q8442j79221k6794J72741j5655P9729n0209j62016j57876K29239
$$ -91926 53299 141741 -37480 -64274 108467 92812 172541 122332 -39684 -197560 31679
5749C1679J74368j27230o3894L4672K4133o7343K4552n2817J91252O0247o5616
$$ 31679 206047 78817 14923 49595 73728 6385 30937 -21880 169372 229619 164003
5738A64003k82742k61917K7943K12062K29503j65842j70828P6982N3330j7973
$$ 164003 -118739 -380656 -352713 -140651 88852 -76990 -247818 -170836 -117506 -135479
5728a35479j53735j96744k09592K67297J71426J82706K0308K23K2914k2595J75549
$$ -135479 -289214 -485958 -695550 -428253 -256827 -74121 -53813 -53590 -30676 -53271 122278
5717A22278K16444q0496k69770k24219j53910K00157N1363j19606K71279J59454
$$ 122278 338722 258226 -11544 -235763 -389673 -189516 -138153 -257759 13520 172974
5707A72974J76449l99370k08756P7833J02211J0969m5502n2412J1231J09546j19902
$$ 172974 349423 -49947 -258703 -180870 -78659 -67690 -113192 -165604 -154373 -44827 -164729
5696a64729r1112K08764K89324q616l1174r173j18703k55034j95237J40861J24586
$$ -164729 -255841 -47077 242247 233631 202457 193284 74581 -180453 -375690 -234829 -110243
5685a10243j58749J43600L21685J65910k29025j52775J21556l7401l0921j65244
$$ -110243 -268992 -125392 196293 362203 133178 -19597 101959 64558 33637 -131607
5675a31607L830q269l80688j25194J42758J76552J91118j62839P3744L9516k57797
$$ -131607 -127777 -136046 -516734 -641928 -499170 -322618 -131500 -294339 -220595 -181079 -438876
5664d38876J64657K84687j15636k5450K21232M1018j61181j42832J10064M8625
$$ -438876 -274219 10468 -105168 -130618 90614 131632 -29549 -172381 -62317 -13692
5654a3692N2582J84855P9679l6053j51376j86287p3645k28279l1746L32348Q9808
$$ -13692 38890 223745 303424 267371 115995 -70292 -143937 -372216 -403962 -71614 18194
5643A8194Q1129p8018j30792m769O7651J07992n0432j02831K28754J43613K4326
$$ 18194 99323 21305 -109487 -114256 -46605 61387 10955 -91876 136878 280491 304817
5632C04817o348l2312Q6649p7779j05062L1184j4979k62021J9252l864R8775M6020
$$ 304817 298469 266157 352806 275027 169965 201149 186170 -75851 -56599 -60463 38312 84332
5620H4332k28466K0314j48191J46222K97187j91827K6164k82931J52706K9993
$$ 84332 -144134 -123820 -272011 -125789 171398 -20429 5735 -277196 -124490 -94497
5610i4497q1775P9578Q5206J92536j95991j46380O6348J15097j75971n9956L5233
$$ -94497 -176272 -96694 -11488 181048 -14943 -161323 -94975 20122 -155849 -215805 -180572
5599a80572M8825J95425J25691J29621R46l76074l19115K43976K54898O2355o0239
$$ -180572 -131747 63678 189369 318990 319936 -56138 -375253 -131277 123621 185976 125737
5588A25737k70979K52099J85261j42254m5694J26522q4404k30480M9540K07026
$$ 125737 -145242 106857 292118 149864 104170 230692 146288 -84192 -34652 172374
5578A72374K7187J1348N341K2258j85427j89235n8661p3873K6722P3258L7275
$$ 172374 199561 210909 216250 238508 53081 -136154 -194815 -268688 -241966 -168708 -131433
5567a31433N2425j24321J68999p5190k30967R3441O5985k62528l7493J73229K05351
$$ -131433 -79008 -203329 -34330 -109520 -340487 -247046 -181061 -443589 -481082 -307853 -102502
5556a02502J33424j27957j2027q846N8347p6969r0302O4922J73694j06763p6821
$$ -102502 30922 -97035 -109062 -117908 -59561 -136530 -226832 -161910 11784 -94979 -171800
5545a71800K85350K65957k7514j27295j62263j00822k25225n8334j3496p4805
$$ -171800 113550 379507 351993 224698 62435 -38387 -263612 -321946 -335442 -410247
5535d10247M32858J34848k91920o2915j34828J39503q447J96264J08981j27069
$$ -410247 22611 157459 -134461 -197376 -332204 -192701 -201148 -4884 104097 -22972
5525b2972j63713K1556m172j21750l1971o9655J17629N270J83445m8974k60847
$$ -22972 -186685 -165129 -169301 -291051 -323022 -392677 -275048 -269778 -86333 -135307 -396154
5514c96154l6949L38241J82516p1025j96356N2855L62395m351N3628J50655J46713
$$ -396154 -433103 -94862 87654 16629 -179727 -126872 235523 231172 284800 435455 582168
5503E82168Q2301r7852j34356k01682k84997j05622R4645k02350k30548J82541
$$ 582168 664469 566617 432261 230579 -54418 -160040 -65395 -267745 -498293 -315752
5493c15752K58235N6685P7475o7619j59162J21252O476J44516J21576j16252k8246
$$ -315752 -57517 -832 76643 9024 -150138 -28886 -22410 122106 243682 127430 99184
5482I9184Q5270r124j16224k23426k2133R931k64490j28718J84588L36373n4587
$$ 99184 184454 175330 59106 -164320 -186453 -176522 -441012 -569730 -385142 -48769 -103356
5471a03356j87047K4705J3311Q3089L25409j89528o5109N2341J10276o824j44182
$$ -103356 -290403 -265698 -252387 -169298 156111 -33417 -98526 -46185 64091 57267 -86915
5460h6915m2815R9089O2407q2318j0819l6094o5148j36192J26126O5123j70469
$$ -86915 -129730 -30641 31766 -50552 -61371 -97465 -162613 -298805 -172679 -107556 -278025
5449b78025l1589K47174j51734p793r9541J85798L3238r7361J7473Q7671l4345
$$ -278025 -309614 -62440 -214174 -221967 -321508 -135710 -102472 -199833 -182360 -94689 -129034
5438a29034n5744j53845j02260M9556J74566P1467L9857n3505Q3595J19609k7371
$$ -129034 -184778 -338623 -440883 -391327 -216761 -145294 -105437 -158942 -75347 44262 16891
$$ [...]
##END NTUPLES=NMR SPECTRUM
##END=
