##TITLE=Analysis number 318115
Compound Code ac 35901
Project Code adrs
Chemist Name frontier sci
##JCAMPDX= 6.0         $$ Bruker NMR JCAMP-DX V2.0
##DATA TYPE= NMR SPECTRUM
##DATA CLASS= NTUPLES
##ORIGIN= Bruker BioSpin GmbH
##OWNER= nmr
$$ XWIN-NMR		Version 3.5
$$ Thu Mar 16 08:24:59 2006 GMT Standard Time (UT+0h)  MAYBRIDGE\nmr@NMR_250MHZ
##.OBSERVE FREQUENCY= 250.131544655141
##.OBSERVE NUCLEUS= ^1H
##.ACQUISITION MODE= SIMULTANEOUS (DQD)
##.ACQUISITION SCHEME= undefined
##.AVERAGES= 16
##.DIGITISER RES= 18
##SPECTROMETER/DATA SYSTEM= dpx250
##.PULSE SEQUENCE= zg30
##.SOLVENT NAME= DMSO
##.SHIFT REFERENCE= (INTERNAL, DMSO, 0, 16.522)
##AUDIT TRAIL= $$ (NUMBER, WHEN, WHO, WHERE, WHAT)
$$ ##TITLE= Audit trail, XWIN-NMR		Version 3.5
$$ ##JCAMPDX= 5.01
$$ ##ORIGIN= Bruker BioSpin GmbH
$$ ##OWNER= nmr
$$ C:\u/data/dgb/nmr/ADRS/810/pdata/1/auditp.txt
$$ ##AUDIT TRAIL=  $$ (NUMBER, WHEN, WHO, WHERE, WHAT)
(   1,<2006-03-16 08:24:37.53 +000>,<MAYBRIDGE\nmr>,<NMR_250MHZ>,
      <created by zg, POWCHK disabled, PULCHK disabled
       configuration hash MD5:
       84 BC 41 DB A1 6E 1D 46 DA 25 12 A5 C1 ED C5 3A
       data hash MD5: 64K
       AB 89 98 70 75 FB EA 81 01 10 36 83 16 72 1B 11>)
(   2,<2006-03-16 08:24:50.31 +000>,<MAYBRIDGE\nmr>,<NMR_250MHZ>,
      <Start of raw data processing
       ef LB = 0.3 FT_mod = 6 PKNL = 1 SI = 32K 
       data hash MD5: 32K
       C1 F7 B7 91 55 DD C7 D4 E4 0D 36 DA F8 53 39 31>)
(   3,<2006-03-16 08:24:51.80 +000>,<MAYBRIDGE\nmr>,<NMR_250MHZ>,
      <apk 
       data hash MD5: 32K
       A4 49 4E D4 65 A3 7B 9C 1A FD D9 BF 84 8B 07 70>)
(   4,<2006-03-16 08:24:52.55 +000>,<MAYBRIDGE\nmr>,<NMR_250MHZ>,
      <abs ABSG = 5 
       data hash MD5: 32K
       B3 56 FD FC 20 D7 B1 6A F6 8D BD 08 C9 5B 58 59>)
$$ ##END=
$$ 
$$ hash MD5
$$ 9F 66 B0 C0 7B 66 E2 31 E7 F7 90 60 5D 43 22 33
##$RELAX= 
##$RELAX= 
##$RELAX= 
##$RELAX= 
##$RELAX= 
##$RELAX= 
##$RELAX= 
$$ Bruker specific parameters
$$ --------------------------
##$DU= <C:\u>
##$EXPNO= 810
##$NAME= <ADRS>
##$PROCNO= 1
##$TYPE= <nmr>
##$USER= <dgb>
##$AMP= (0..31)
100 100 100 100 100 100 100 100 100 100 100 100 100 100 100 100 100 100 
100 100 100 100 100 100 100 100 100 100 100 100 100 100 
##$AQSEQ= 0
##$AQ_mod= 3
##$AUNM= <au_zg>
##$AUTOPOS= <3 >
##$BF1= 250.13
##$BF2= 250.13
##$BF3= 250.13
##$BF4= 250.13
##$BF5= 500.13
##$BF6= 500.13
##$BF7= 500.13
##$BF8= 500.13
##$BYTORDA= 1
##$CFDGTYP= 0
##$CFRGTYP= 5
##$CHEMSTR= <none>
##$CNST= (0..31)
1 1 145 1 1 1 1 1 1 1 1 1 1 1 1 1 1 1 1 1 1 1 1 1 1 1 1 1 1 1 1 1 
##$CPDPRG= <>
##$CPDPRG1= <>
##$CPDPRG2= <>
##$CPDPRG3= <>
##$CPDPRG4= <mlev>
##$CPDPRG5= <mlev>
##$CPDPRG6= <mlev>
##$CPDPRG7= <mlev>
##$CPDPRG8= <mlev>
##$CPDPRGB= <>
##$CPDPRGT= <>
##$D= (0..31)
0 1 0 0 0 0 0 0 0 0.06 0 0 0 0 0 0 0.0002 0 0 0 0 0 0 0 0 0 0 0 0 0 0 
0 
##$DATE= 1142497476
##$DBL= (0..7)
120 120 120 120 120 120 120 120 
##$DBP= (0..7)
150 150 150 150 150 150 150 150 
##$DBP07= 0
##$DBPNAM0= <>
##$DBPNAM1= <>
##$DBPNAM2= <>
$$ [...]
##$SUBNAM7= <"">
##$SUBNAM8= <"">
##$SUBNAM9= <"">
##$SW= 20.6930455092707
##$SWIBOX= (0..15)
0 0 3 0 0 0 0 0 0 0 0 0 0 0 0 0 
##$SW_h= 5175.983436853
##$TD= 65536
##$TD0= 1
##$TE= 293.16
##$TE2= 300
##$TE3= 300
##$TEG= 300
##$TL= (0..7)
0 120 120 120 120 120 120 120 
##$TP= (0..7)
150 150 150 150 150 150 150 150 
##$TP07= 0
##$TPNAME0= <>
##$TPNAME1= <>
##$TPNAME2= <>
##$TPNAME3= <>
##$TPNAME4= <>
##$TPNAME5= <>
##$TPNAME6= <>
##$TPNAME7= <>
##$TPOAL= (0..7)
0.5 0.5 0.5 0.5 0.5 0.5 0.5 0.5 
##$TPOFFS= (0..7)
0 0 0 0 0 0 0 0 
##$TUNHIN= 0
##$TUNHOUT= 0
##$TUNXOUT= 0
##$USERA1= <user>
##$USERA2= <user>
##$USERA3= <user>
##$USERA4= <user>
##$USERA5= <user>
##$V9= 5
##$VALIST= <valist>
##$VCLIST= <CCCCCCCCCCCCCCC>
##$VD= 0
##$VDLIST= <DDDDDDDDDDDDDDD>
##$VPLIST= <PPPPPPPPPPPPPPP>
##$VTLIST= <TTTTTTTTTTTTTTT>
##$WBST= 1024
##$WBSW= 4
##$XGAIN= (0..3)
0 0 0 0 
##$XL= 0
##$YL= 0
##$YMAX_a= 248915
##$YMIN_a= -368330
##$ZGOPTNS= <>
##$ZL1= 120
##$ZL2= 120
##$ZL3= 120
##$ZL4= 120
##$ABSF1= 16.522
##$ABSF2= -4.171173
##$ABSG= 5
##$ABSL= 3
##$ALPHA= 0
##$AQORDER= 0
##$ASSFAC= 0
##$ASSFACI= 0
##$ASSFACX= 0
##$ASSWID= 0
##$AUNMP= <proc_1d>
##$AZFE= 0.1
##$AZFW= 0.1
##$BCFW= 0
##$BC_mod= 0
##$BYTORDP= 0
##$COROFFS= 0
##$CY= 12.5
##$DATMOD= 1
##$DC= 0
##$DFILT= <>
##$DTYPP= 0
##$F1P= 14.0000005364418
##$F2P= -0.99999901652339
##$FCOR= 0.5
##$FTSIZE= 32768
##$FT_mod= 6
##$GAMMA= 0
##$GB= 0
##$INTBC= 1
##$INTSCL= 1
##$ISEN= 128
##$LB= 0.3
##$LEV0= 0
##$LPBIN= 0
##$MAXI= 10000
##$MC2= 0
##$MEAN= 0
##$ME_mod= 0
##$MI= 0
##$NCOEF= 0
##$NC_proc= -4
##$NLEV= 6
##$NOISF1= 0
##$NOISF2= 0
##$NSP= 0
##$NTH_PI= 0
##$NZP= 0
##$OFFSET= 16.522
##$PC= 1
##$PHC0= 163.9571
##$PHC1= 14.05069
##$PH_mod= 1
##$PKNL= yes
##$PPARMOD= 0
##$PSCAL= 4
##$PSIGN= 0
##$REVERSE= no
##$SF= 250.13
##$SI= 32768
##$SIGF1= 0
##$SIGF2= 0
##$SINO= 400
##$SIOLD= 32768
##$SREGLST= <1H.DMSO>
##$SSB= 0
##$STSI= 32768
##$STSR= 0
##$SW_p= 5175.98343685301
##$SYMM= 0
##$S_DEV= 0
##$TDeff= 65536
##$TDoff= 0
##$TI= <Analysis number 999999
Compound Code 99
Book Reference 9
Project Code 9>
##$TILT= no
##$TM1= 0
##$TM2= 0
##$TOPLEV= 0
##$USERP1= <user>
##$USERP2= <user>
##$USERP3= <user>
##$USERP4= <user>
##$USERP5= <user>
##$WDW= 1
##$XDIM= 32768
##$YMAX_p= 331349113
##$YMIN_p= -488523
$$ End of Bruker specific parameters
$$ ---------------------------------
##NTUPLES= NMR SPECTRUM
##VAR_NAME=  FREQUENCY,     SPECTRUM/REAL,   SPECTRUM/IMAG
##SYMBOL=    X,             R,               I
##VAR_TYPE=  INDEPENDENT,   DEPENDENT,       DEPENDENT
##VAR_FORM=  AFFN,          ASDF,            ASDF
##VAR_DIM=   32768,         32768,           32768
##UNITS=     HZ,            ARBITRARY UNITS, ARBITRARY UNITS
##FACTOR=    0.157963299565203, 1,           1
##FIRST=     4132.6476996994, 0,             0
##LAST=      -1043.33573715361, 0,           0
##MIN=       -1043.33573715361, -488523,     0
##MAX=       4132.6476996994, 331349113,     0
$$ Real data points
##PAGE= N=1
##DATA TABLE= (X++(R..R)), XYDATA
$$ [...]
$$ plain form
15895 -273996 -125138 -4850 81201 108479 53837 84635 69564 88461 114148 59297 -5831
15884 -5831 -42433 40558 111020 133490 -36244 50836 53985 -24903 29010 146441 98827 102119
15872 102119 187969 90217 10651 -22409 -132236 -124837 -46262 -92379 -185899 -162368 -202319
15861 -202319 -139750 18393 83434 65123 40703 -127 -94453 -157389 -49907 43848 -51734
15850 -51734 -61405 -240422 -290576 -142666 52284 122164 -1434 -120457 -232491 -278715 -300077
15839 -300077 -322387 -183693 -40661 66603 28064 -140994 -161956 -107787 -130523 -149386 -120289
15828 -120289 -131084 -114980 -52421 229319 311244 207501 70869 86611 63569 -77561 -109070
15817 -109070 -170799 -247588 -203727 -152862 -133595 -105798 -110412 -118306 -147669 -73646 -75132 -135748
$$ packed form
15895b73996J48858J20288Q6051K7278n4642L0798j5071J8897K5687n4851o5128
15884e831l6602Q2991P0462K2470j69734Q7080L149p8888N3913J17431m7614L292
15872A02119Q5850r7752p9566l3060j09827P399P8575m6117r3520K3531l9951
15861b02319O2569J58143O5041j8311k4420m0830r4326o2936J07482R3755r5582
15850e1734r671j79017n0154J47910J94950O9880j23598j19023j12034m6224k1362
15839c00077k2310J38694J43032J07264l8539j69058k0962N4169k2736j8863K9097
15828a20289j0795J6104O2559K81740Q1925j03743j36632J5742k3042j41130l1509
15817a09070o1729p6789M3861N0865J9267K7797m614p894k9363P4023j486o0616
$$ plain form
15805 -135748 -118482 -63489 -76567 -24687 -39016 -36146 -128143 -110682 33232 -89794 -296744
15794 -296744 -256646 -266525 -225353 -168997 -125601 -50201 -3727 -46168 3758 54445 59334 -85023
15782 -85023 -43646 -64026 -154597 -155966 17256 104408 109460 12856 56375 30198 -68 -27102
15770 -27102 -123037 -130277 -225382 -164057 -10850 -19886 -23281 40988 161987 189959 95546 -41001
15758 -41001 -183175 -165486 -48515 81926 174491 3197 -168683 -129840 -111231 -92392 -165424
15747 -165424 -182415 -73372 -115323 -64684 -70290 -97378 -177449 -235435 -233115 -149402 -176356 -159227
15735 -159227 99539 229164 181426 105234 -9742 -23 38316 27881 126415 -28349 -57221
15724 -57221 -28747 -30047 -57539 -176913 -187715 -79201 -78928 -89427 -101095 29693 124287 85134
$$ packed form
15805a35748J7266N4993j3078N1880j4329K870r1997J7461J43914j23026k06950
15794b96744M0098r879M1172N6356M3396P5400M6474m2441M9926N0687M889j44357
15782h5023M1377k0380r0571j369J73222Q7152N052r6604M3519k6177l0266k7034
15770b7102r5935p240r5105O1325J53207r036l395O4269J20999K7972r4413j36547
15758d1001j42174J7689J16971J30441R2565j71294j71880L8843J8609J8839p3032
15747a65424j6991J09043m1951N0639n606k7088q0071n7986K320Q3713k6954J7129
15735a59227K58766J29625m7738p6192j14976R719L8339j0435R8534j54764k8872
15724e7221K8474j300k7492j19374j0802J08514K73j0499j1668J30788R4594l9153
$$ plain form
15712 85134 9343 4983 123315 217197 67794 66195 -6292 -47661 -142434 -141385 -101966 -150025
15700 -150025 -167319 -320218 -433660 -411543 -380631 -346062 -301674 -304493 -189652 -171346 -262996
15689 -262996 -286955 -206568 -136779 -108094 11926 27033 116819 223076 152721 64769 45792
15678 45792 -55572 -106048 -202004 -239537 -158334 -82843 20492 153572 170556 133671 -54696
15667 -54696 -178132 -255043 -100923 -58999 -151414 -257598 -205058 -179972 -152830 -4560 90721
15656 90721 91998 -58783 -265646 -307226 -224179 -79190 -91844 -165310 -62186 16125 61894
15645 61894 97160 169001 76682 18499 90697 71137 84922 13762 40877 -21094 -138724
15634 -138724 -165593 -32328 -54976 -86459 -77870 -138234 -202101 -117476 -31564 29375 -69890
$$ packed form
15712H5134p5791m360J18332R3882j49403j599p2487m1369r4773J049L9419m8059
15700a50025j7294j52899j13442K2117L0912L4569M4388k819J14841J8306r1650
15689b62996k3959Q0387O9789K8685J20020J5107Q9786J06257p0355q7952j8977
15678D5792j01364n0476r5956l7533Q1203P5491J03335J33080J6984l6885j88367
15667e4696j23436p6911J54120M1924r2415j06184N2540K5086K7142J48270R5281
15656I0721J277j50781k06863m1580Q3047J44989j2654p3466J03124P8311M5769
15645F1894L5266P1841r2319n8183P2198j9560J3785p1160K7115o1971j17630
15634a38724k6869J33265k2648l1483Q589o0364o3867Q4625Q5912O0939r9265
$$ plain form
15623 -69890 -108414 -105424 -141399 -108659 -136120 -191952 -230912 -252080 -160841 -157426 -96380 26545
15611 26545 -66775 -101349 -191070 -171702 -149339 -255428 -276128 -245187 -196887 -42732 81742
15600 81742 -34622 -19851 -105052 -79500 -150684 -266081 -350481 -358003 -260120 -206927 -131325
15589 -131325 -219222 -379121 -439589 -310556 -190170 -124059 -76842 -225675 -274707 -415573
15579 -415573 -292992 -207819 -233505 -176695 -49529 -5310 50594 -64364 -59527 -15555 -37206
15568 -37206 41483 34346 90371 65906 -54800 -107647 -77538 -1423 112184 201206 200346 235241
15556 235241 141515 88880 70768 106324 -36600 -152946 -217158 -222236 -41961 54602 52237
15545 52237 84082 200110 272170 220501 88793 174125 234003 42082 25062 -15202 28134
$$ packed form
15623f9890l8524K990l5975L2740k7461n5832l8960k1168R1239L415O1046J22925
15611B6545r3320l4574q9721J9368K2363j06089k0700L0941M8300J54155J24474
15600H1742j16364J4771q5201K5552p1184j15397q4400p522R7883N3193P5602
15589a31325q7897j59899o0468J29033J20386O6111M7217j48833m9032j40866
15579d15573J22581Q5173k5686N6810J27166M4219N5904j14958M837M3972k1651
15568c7206P8689p137N6025k4465j20706n2847L0109P6115J13607Q9022q60L4895
15556B35241r3726n2635j8112L5556j42924j16346o4212n078J80275R6563k365
15545E2237L1845J16028P2060n1669j31708Q5332N9878j91921j7020m0264M3336
$$ plain form
15534 28134 9656 64685 194201 235500 62890 102888 -36156 -86170 -190865 -274328 -63372
15523 -63372 27563 27404 93657 93053 54089 -6170 -66630 -113643 -122042 -172520 -203572 -216673 -77219
15510 -77219 90630 235694 222136 189040 53358 -130049 -306244 -233027 -299505 -274639 -282097
15499 -282097 -207859 -14613 152143 157641 5149 -105256 -169054 -123182 -117701 -7875 61567
15488 61567 30864 30104 28648 107886 83910 78828 -124350 -166615 -54143 -100530 -150985 -156767
15476 -156767 -114053 -81851 -198642 -206390 -204392 -150508 -121601 -83978 -75278 -53874 62523 90137
15464 90137 57609 -176717 -208528 -104912 -116473 -160082 -87009 -83193 -49046 -17949 72827
15453 72827 174377 53588 -21771 -107337 -54575 -65874 -3646 51901 39139 46553 31569
$$ packed form
15534B8134j8478N5029J29516M1299j72610L9998j39044n0014j04695q3463K10956
15523f3372R0935j59O6253o04l8964o0259o0460m7013q399n0478l1052j3101J39454
15510g7219J67849J45064j3558l3096j35682j83407j76195P3217o6478K4866p458
15499b82097P4238J93246J66756N498j52492j10405o3798M5872N481J09826O9442
15488F1567l0703p60j456P9238k3976n082k03178m2265J12472m6387n0455n782
15476a56767M2714L2202j16791p748J998N3884K8907L7623Q700K1404J16397K7614
15464I0137l2528k34326l1811J03616j1561m3609P3073L816L4147L1097R0776
15453G2827J01550j20789p5359q5566N2762j1299O2228N5547j2762P414j4984
$$ plain form
15442 31569 -46009 -25007 -9459 -106865 4807 28021 -28156 -240984 -184038 35140 8554
15431 8554 -189692 -144037 -185868 -156505 -109157 -60604 -31244 -22747 -117388 -179881 -217529 -224793
15419 -224793 -153974 -47122 -40387 -88649 -198297 -304259 -200903 33 83206 10229 -20564
15408 -20564 -47305 14426 -18035 -85170 -64850 10275 -53308 -172599 -140393 -108250 -152470
15397 -152470 -119977 -142682 -68828 -39302 -108895 -219592 -259021 -190276 -29628 2101 -130837
15386 -130837 -193633 -112907 -93188 -92165 -143727 -283785 -227744 -118982 -176818 -160082 -36755
15375 -36755 80136 12086 -100814 -218327 -173343 -213655 -321847 -220533 -193125 -246694 -147414
15364 -147414 -109808 -164225 -282795 -133510 -48439 -57669 -9408 8007 81352 72733 -34697
$$ packed form
15442C1569p7578K1002J5548r7406J11672K3214n6177k12828N6946K19178k6586
15431H554j98246M5655m1831K9363M7348M8553K9360Q497r4641o2493l7648p264
15419b24793P0819J06852O735m8262j09648j05962J03356K00936Q3173p2977l0793
15408b0564k6741O1731l2461o7135K0320P5125o3583j19291L2206L2143m4220
15397a52470L2493k2705P3854K9526o9593j10697l9429O8745J60648L1729j32938
15386a30837o2796Q0726J9719J023n1562j40058N6041J08762n7836J6736J23327
15375c6755J16891o8050j12900j17513M4984m0312j08192J01314K7408n3569R9280
15364a47414L7606n4417j18570J49285Q5071r230M8261J7415P3345q619j07430
$$ plain form
15353 -34697 11833 149869 78813 50316 10710 44168 101430 -101909 -191949 -195993 -137096
15342 -137096 -87674 -66864 15145 135095 171411 100697 -41354 -170892 -300419 -238293 -198579
15331 -198579 -66879 -37321 443 -5504 -26329 -60947 22526 109973 81893 42011 14679
15320 14679 -52971 105570 268005 145902 65438 128496 184504 165775 77209 1125 -75546
15309 -75546 -214401 -176340 -125078 27903 132236 140413 130535 137332 144063 24789 -110792
15298 -110792 -165218 -87296 -91455 -222720 -158196 -69146 109543 123112 11103 9528 36115
15287 36115 84714 -35645 -92308 -67030 -199267 -98796 -29144 59763 -4088 -59022 -60831
15276 -60831 -176649 -208391 -73192 18484 8189 50369 -5159 36539 31490 88023 32986
$$ packed form
15353c4697M6530J38036p1056k8497l9606L3458N7262k03339r0040m044N8897
15342a37096M9422K0810Q2009J19950L6316p0714j42051j29538j29527O2126L9714
15331a98579J31700K9558L7764n947k0825l4618Q3473Q7447k8080l9882k7332
15320A4679o7650J58541J62435j22103q0464O3058N6008j8729q8566p6084p6671
15309g5546j38855L8061N1262J52981J04333Q177r878O797O731j19274j35581
15298a10792n4426P7922m159j31265O4524Q9050J78689J3569j12009j575K6587
15287C6115M8599j20359n6663K5278j32237J00471O9652Q8907o3851n4934j809
15276f0831j15818l1742J35199R1676j0295M2180n5528M1698n049N6533n5037
$$ plain form
15265 32986 81129 46006 34232 64887 1333 7078 18522 660 -37733 -36659 44400 94385
15253 94385 78325 37819 -175314 -174587 -255284 -312360 -341476 -335724 -141471 -44876 -82531 -108698
15241 -108698 -120028 -203905 -136722 -49393 28656 -1247 -65380 -31013 64501 62826 89246 -138324
15229 -138324 -235991 -247087 -357581 -392237 -322333 -160683 19045 -24614 -194808 -149911 -72079
15218 -72079 78990 46840 108159 96445 145986 264857 217906 81015 100048 186320 124554
15207 124554 121908 36907 -29552 42584 246634 261165 239061 190707 248995 185452 61932
15196 61932 130694 129286 140145 213925 90946 -74885 -165130 -174101 -210212 -170043 -192819 -244493
15184 -244493 -197400 -16389 -20874 -163123 -210571 -142725 39616 15955 38341 175405 85983
$$ packed form
15265C2986M8143l5123j1774L0655o3554N745J1444j7862l8393J074Q1059M9985
15253I4385j6060m0506k13133P27q0697n7076k9116N752J94253R6595l7655k6167
15241a08698j1330q3877O7183Q7329P8049k9903o4133L4367R5514j675K6420k27570
15229a38324r7667j1096j10494l4656O9904J61650J79728m3659j70194M4897P7832
15218g2079J51069l2150O1319j1714M9541J18871m6951j36891J9033Q6272o1766
15207A24554k646q5001o6459P2136K04050J4531k2104m8354N8288o3543j23520
15196F1932O8762j408J0859P3780j22979j65831r0245q971l6111M0169k2776n1674
15184b44493M7093J81011m485j42249m7448O7846J82341k3661K2386J37064q9422
$$ plain form
15173 85983 -52688 -89979 -77673 -35303 -51452 -158827 -282284 -222624 -34990 65118 -53366
15162 -53366 -34560 27586 -3359 -46112 -47738 -133908 -156194 -150531 -178656 -149163 -193891 -199465
15150 -199465 -239476 -221342 -129955 52516 10710 10379 -181977 -280209 -150748 -92856 -89053
15139 -89053 -193458 -186231 -167591 -254310 -290452 -200285 -177490 -141573 -59640 -48103 -43909 -98206
15127 -98206 -151017 -128651 -125915 -61300 -128172 -220281 -244236 -288260 -170950 1865 14433
15116 14433 -102447 -75315 -110651 -243560 -255076 -274672 -107541 -136030 -145841 -141345 -34932
15105 -34932 111457 68901 -22339 -56857 31286 10880 -169552 -410090 -305616 -159241 -40679
15094 -40679 -112707 -105245 34154 46351 -19303 147928 60714 -140709 -181456 -98709 -193527
$$ packed form
15173H5983j38671l7291J2306M2370j6149j07375j23457N9660J87634J00108j18484
15162e3366J8806O2146l0945m2753j626q6170k2286N663k8125K9493m4728n574
15150a99465m0011J8134R1387J82471m1806l31j92356r8232J29461N7892L803
15139h9053j04405P227J8640q6719l6142R0167K2795L5917Q1933J1537M194n4297
15127i8206n2811K2366K736O4615o6872r2109k3955m4024J17310J72815J2568
15116A4433j16880K7132l5336j32909j1516j9596J67131k8489r811M496J06413
15105c4932J46389m2556r1240l4518Q8143k0406j80432k40538J04474J46375J18562
15094d0679p2028P462J39399J2197o5654J67231q7214k01423m0747Q2747r4818
$$ plain form
15083 -193527 -309319 -322350 -236537 -245254 -125894 14058 42685 67576 85297 -62383 -134212
15072 -134212 -59857 -105306 44960 -72553 -93830 -63641 -26696 11407 108256 78649 83125
15061 83125 64014 -12360 -81505 -108574 -103395 36983 85796 97320 84855 -76232 -145996
15050 -145996 -128110 -6678 -18153 -113492 53482 7140 29604 -72484 -201611 -129740 -88504
15039 -88504 -106222 -89342 -131633 -146141 -127061 -68910 34196 160743 58292 -43284 36112
15028 36112 70279 99965 51135 -18523 -43069 -55694 -170067 -168910 -66662 -23464 -78916
15017 -78916 -144928 -43635 -4422 -119737 14325 10710 -66594 -43621 -153258 -111008 34880
15006 34880 134008 80748 97401 -2548 -192763 -382776 -362591 -325767 -391255 -268104 -153840
$$ packed form
15083a93527j15792j3031Q5813q717J19360J39952K8627K4891J7721j47680p1829
15072a34212P4355m5449J50266j17513k1277L0189L6945L8103R6849k9607M476
15061H3125j9111p6374o9145k7069N179J40378M8813J1524j2465j61087o9764
15050a45996J7886J21432j1475r5339J66974m6342K2464j02088j29127P1871M1236
15039h8504j7718J6880m2291j4508J9080N8151J03106J26547j02451j01576P9396
15028C6112L4167K9686m8830o9658k4546j2625j14373J157J02248M3198n5452
15017g8916o6012J01293L9213j15315J34062l615p7304K2973j09637M2250J45888
15006C4880R9128n3260J6653r9949j90215j90013K0185L6824o5488J23151J14264
$$ plain form
14995 -153840 -160615 -163456 -56946 7883 4821 35266 -54521 -183810 -211843 -342665 -331379
14984 -331379 -173026 -203422 -236155 -288053 -367228 -318724 -208055 -201514 -210524 -154538 -16800
14973 -16800 62742 158132 58243 -77941 -113765 -70305 -45246 -8673 115193 67352 28105
14962 28105 109268 -7601 -180019 -218593 -85434 -6659 -55502 -155975 -35501 122419
14952 122419 163235 256043 306199 173269 85050 177635 141263 -4968 -27518 21049 -73458
14941 -73458 -131929 -128490 -68010 -12734 -92189 -121206 -125794 -301912 -315517 -246752 -156110 -149502
14929 -149502 -59671 107402 149446 97859 161144 328145 298792 234971 153739 130368 110084
14918 110084 6676 43142 42131 13765 88112 90407 96238 62556 43805 -62433 -96968 6060
$$ packed form
14995a53840o775k841J06510O4829l062L0445q9787j29289k8033j30822J1286
14984c31379J58353l0396l2733n1898p9175M8504J10669O541r010N5986J37738
14973a6800P9542R5390r9889j36184l5824M3460K5059L6573J23866m7841l9247
14962B8105Q1163j16869j72418l8574J33159P8775m8843j00473J20474J57920
14952A22419M0816R2808N0156j32930q8219R2585l6372j46231k2550M8567r4507
14941g3458n8471L439O0480N5276p9455k9017m588j76118j3605O8765R0642O608
14929a49502Q9831J67073M2044n1587O3285J67001k9353o3821q1232k3371k0284
14918A10084j03408L6466j011k8366P4347K295N831l3682j8751j06238l4535J03028
$$ plain form
14906 6060 49498 44694 -134530 -113897 -143274 -155280 -181259 -181212 -185239 -142146 -182963 -202112 -113021
14893 -113021 -162409 -52285 34364 -40434 -153073 -172347 -234226 -292581 -91536 33699 -31074
14882 -31074 -132173 -21312 -6520 -16801 -134684 -269998 -252430 -206362 -140667 -210708 -233115
14871 -233115 -84039 -98646 -32938 16043 -67590 -161611 -170239 -138652 -109446 -4177 -61539
14860 -61539 -218203 -217522 -28787 23900 -69033 -133909 -49088 -191056 -166436 -154821 -208330
14849 -208330 -69356 -84974 -186056 -235898 -298611 -273475 -82124 -227252 -348528 -355961 -177309
14838 -177309 -2469 27945 -15372 -208790 -432824 -405369 -324850 -295871 -380827 -340449 -155378
14827 -155378 -170469 -180840 -115572 1407 88219 119359 62429 -10654 -89172 39176 -28809
$$ packed form
14906F060M3438m804j79224K0633k9377j2006k5979M7m027M3093m0817j9149Q9091
14893a13021m9388J10124Q6649p4798j12639j9274o1879n8355K01045J25235o4773
14882c1074j01099J10861J4792j0281j17883j35314J7568M6068O5695p0041k2407
14871b33115J49076j4607O5708M8981q3633r4021q628L1587K9206J05269n7362
14860f1539j56664O81J88735N2687r2933o4876Q4821j41968K4620J1615n3509
14849b08330J38974j5618j01082m9842o2713K5136J91351j45128j21276p433J78652
14838a77309J74840L0414m3317j93418k24034K7455Q0519K8979q4956M0378J85071
14827a55378j5091j0371O5268J16979Q6812L1140n6930p3083p8518J28348o7985
$$ plain form
14816 -28809 -114344 -57894 18770 14496 37133 62183 82210 97242 -29545 -118924 -192565 -172225
14804 -172225 -206856 -188054 23961 316445 308756 110428 -156150 -119862 -168637 -90928 -32583
14793 -32583 -117138 -181633 -96612 -66298 -16549 91983 -8470 -96877 -97845 62356 100110
14782 100110 38588 117044 107921 96227 92 27554 86080 131802 63920 64419 32872 -15946
14770 -15946 12961 122508 95298 88396 -94890 -172440 -239209 -194750 -208026 -265698 -115379
14759 -115379 82640 66022 182630 190266 141278 140619 194726 170992 204555 109821 -78401
14748 -78401 -100776 -114754 -190166 -252173 -254979 -195927 19951 52469 -86505 -161839 -80868
14737 -80868 28883 36256 157818 281081 102687 25526 1008 -17811 35000 68890 -20995
$$ packed form
14816b8809q5535N6450P6664m274K2637K5050K0027J5032j26787q9379p3641K0340
14804a72225l4631J8802K12015K92484p689j98328k66578L6288m8775P7709N8345
14793c2583q4555o4495Q5021L0314M9749J08532j00453q8407r68J60201L7754
14782A00110o1522P8456r123j1694r6135K7462N8526M5722o7882M99l1547m8818
14770a5946K8907J09547k7210o902j83286p7550o6769M4459j3276n7672J50319
14759a15379J98019j6618J16608P636m8988o59N4107k3734L3563r4734j88222
14748g8401k2375j3978p5412o2007k806N9052K15878L2518j38974p5334Q0971
14737h0868J09751P373J21562J23263j78394p7161k4518j8819N2811L3890q9885
$$ plain form
14726 -20995 -40801 -2430 -183701 -219882 -140948 -29310 102115 114527 53178 43403 53537
14715 53537 -97206 -185637 -272346 -201626 -95333 -69297 -107765 -211825 -48797 -97506 -260172
14704 -260172 -320936 -238895 -58374 -52523 -125123 -163262 -167986 -161988 -102571 -111888 -75375 186294
14692 186294 237626 94981 -30703 -35874 9734 134569 188242 62770 -146342 -99821 -179438
14681 -179438 -144434 -201513 -318056 -217401 -160975 -154458 -81835 -122821 -194430 -148036 -177182
14670 -177182 -165799 -180555 -240732 -247520 -126927 -199619 -249401 -72679 28079 -64242 -169284
14659 -169284 -177549 -131347 -79009 -68318 -149235 -238663 -321449 -301337 -368104 -272443 -136706
14648 -136706 -222592 -76347 145410 155080 178808 111740 -98011 -70172 82448 63414 -44471
$$ packed form
14726b0995j9806L8371j81271l6181P8934J11638J31425J2412o1349r775J0134
14715E3537j50743q8431q6709P0720J06293K6036l8468j04060J63028m8709j62666
14704b60172o0764Q2041J80521N851p2600l8139m724N998N9417r317L6513K61669
14692A86294N1332j42645j25684n171M5608J24835N3673j25472k09112M6521p9617
14681a79438L5004n7079j16543J00655N6426O517P2623m0986p1609M6394k9146
14670a77182J1383j4756o0177o788J20593p2692m9782J76722J00758r2321j05042
14659a69284q265M6202N2338J0691q0917q9428q2786K0112o6767R5661J35737
14648a36706q5886J46245K21757R670K3728o7068k09751K7839J52620j9034j07885
$$ plain form
14637 -44471 -37627 -59457 -74332 -150959 -251159 -159378 -120201 -193966 -271585 -316959 -251564 -69972
14625 -69972 85297 66516 130353 112478 -52264 -55849 -131720 -84135 -22317 -69117 -124555
14614 -124555 -96590 -122525 -186110 -85182 -163520 -317717 -329499 -182311 -72363 -67574 -69741
14603 -69741 -154489 -339676 -373349 -238865 -167073 -49997 -15644 26115 82832 137291 293633
14592 293633 251387 206767 22003 -183564 -115780 -148390 -138694 -79139 -19842 87666 69963
14581 69963 58475 -56560 -104897 -60763 -78596 48996 47355 -65143 -201064 -278911 -216315
14570 -216315 -100317 -35767 -33578 -12852 -32652 -47840 -68654 -120884 -214850 -170097 -59566
14559 -59566 -1181 60902 7816 4946 162054 221932 224032 121507 46724 -33253 -76052 17173
$$ packed form
14637d4471O844k1830j4875p6627j00200R1781L9177p3765p7619m5374O5395J81592
14625f9972J55269j8781O3837j7875j64742l585p5871M7585O1818m6800n5438
14614a24555K7965k5935o3585J00928p8338j54197j1782J47188J09948M789k167
14603f9741q4748j85187l3673J34484P1792J17076L4353M1759N6717N4459J56342
14592B93633m2246m4620j84764k05567O7784l2610R696N9555N9297J07508j7703
14581F9963j1488j15035m8337M4134j7833J27592j641j12498j35921p7847O2596
14570b16315J15998O4550K189K0726j9800j5188k0814n2230r3966M4753J10531
14559e9566N8385O2083n3086k870J57108N9878K100j02525p4783p9977m2799R3225
$$ plain form
14547 17173 19119 -59221 -78554 -1193 69591 84670 73713 62767 -61942 12413 97783 134365
14535 134365 8797 -106748 9550 -11250 -172300 -234367 -314177 -265962 -278959 -201188 -97111
14524 -97111 -142579 -158321 -156449 -125824 83503 29639 24923 60714 30727 43418 -62314 -94701
14512 -94701 -88923 -28257 -22944 -67061 -9581 -18692 -84091 -132604 -33196 2111 -77125 61538
14500 61538 36048 -31140 -38051 3899 37345 11386 -5852 -64137 14018 -10520 -124392 -111518
14488 -111518 -42390 115121 192268 95229 10712 -133551 -89233 -80810 45052 19705 33513
14477 33513 95718 113900 15465 -27459 -18210 -2535 61615 36735 29936 2099 37048 186591
14465 186591 208417 102642 19685 62879 129285 158975 93865 35634 -1056 -97918 -5237
$$ packed form
14547A7173J946p8340j9333P7361P0784J5079j0957j0946j24709P4355Q5370L6582
14535A34365j25568j15545J16298k0800j61050o2067p9810M8215j2997P7771J04077
14524i7111m5468j5742J872L0625K09327n3864m716L5791k9987J2691j05732l2387
14512i4701N778O0666N313m4117N7480r111o5399m8513R9408L5307p9236J38663
14500F1538k5490o7188o911M1950L3446k5959j7238n8285P8155k4538j13872J2874
14488a11518O9128J57511P7147r7039q4517j44263M4318Q423J25862k5347J3808
14477C3513O2205J8182r8435m2924R249J5675O4150k4880o799k7837L4949J49543
14465A86591K1826j05775q2957M3194O6406K9690o5110n8231l6690r6862R2681
$$ plain form
14454 -5237 217060 244668 134147 40687 99144 69838 187743 276325 206142 272697 386433
14443 386433 319381 197430 188898 181138 239769 212637 230719 86651 -24956 10595 145234
14432 145234 120461 17454 -30927 -136682 -69077 124080 198401 16941 14001 78377 174095
14421 174095 83975 57677 7927 -99426 -151542 -52320 -36812 -118455 -66186 -27409 -28604
14410 -28604 -10651 -79646 -52457 -11071 3388 -4627 -92211 -197868 -266629 -300360 -121927
14399 -121927 -14730 -107969 -164053 -6210 56861 61306 47374 46590 86806 184062 235117 19591
14387 19591 -103251 -20530 10919 12216 -105732 -271245 -222949 -78627 -86608 -33808 154408
14376 154408 205170 30970 28537 -59444 -146369 -32323 97322 -33565 -129607 -48376 -40047
$$ packed form
14454e237K22297K7608j10521r3460N8457k9306J17905Q8582p0183O6555J13736
14443C86433o7052j21951q532p760N8631k7132J8082j44068j11607L5551J34639
14432A45234k4773j03007m8381j05755O7605J93157P4321j81460k940O4376R5718
14421A74095r0120k6298m9750j07353n2116R9222J5508q1643N2269L8777j195
14410b8604J7953o8995K7189M1386J4459q015q7584j05657o8761l3731J78433
14399a21927J07197r3239n6084J57843O3071M445j3932p84M0216R7256N1055k15526
14387A9591j22842Q2721L1449J297j17948j65513M8296J44322p981N2800J88216
14376A54408N0762j74200k433q7981q6925J14046J29645j30887r6042Q1231Q329
$$ plain form
14365 -40047 -124197 -243854 -104048 21669 -16554 -167930 -180921 -43599 -19033 -66852 -11747
14354 -11747 6613 -79881 -68707 -33998 -131862 -88485 -86553 -121138 -15147 19183 53251 95439
14342 95439 31222 -52923 -211499 -194919 -84734 -101895 -100038 -98335 -116715 -24297 45701 120802
14330 120802 66814 6076 101283 11718 -71473 -61446 -108006 -48691 19904 12934 -42244 -111061
14318 -111061 -169141 -261073 -160493 -85191 -21096 -9596 -92575 -37766 49202 -10408 -131012
14307 -131012 -241341 -315667 -216720 -189440 -74887 8803 95090 166163 204414 70892 9978
14296 9978 179454 335628 327286 155071 -69501 -149401 138150 152592 60670 14346 -36210
14285 -36210 -20428 -25249 -23491 -68622 -4118 68756 124598 47370 34523 -131563 -247273 -264503
$$ packed form
14365d0047q4150j19657J39806J25717l8223j51376j2991J37322K4566m7819N5105
14354a1747J8360q6494J1174L4709r7864M3377J932l4585J05991L4330L4068M2188
14342I5439o4217q4145j58576J6580J10185j7161J857J703j8380R2418O9998P5101
14330A20802n3988o0738R5207q9565q3191J0027m6560N9315O8595o970n5178o8817
14318a11061n8080r1932J00580P5302O4095J1500q2979N4809Q6968n9610j20604
14307a31012j10329p4326R8947K7280J14553Q3690Q6287P1073L8251j33522o0914
14296I978J69476J56174q342j72215k24572p9900K87551J4442r1922m6324n0556
14285c6210J5782m821J758m5131O4504P2874N5842p7228j2847j66086j15710j7230
$$ plain form
14273 -264503 -111408 -9735 5712 -207379 -263764 -116575 31939 -3479 1345 61574 43016
14262 43016 -15722 -102462 -170165 -180165 -154162 -111704 35730 72457 110632 94627 97470 -1002
14250 -1002 -80368 -71412 -126446 -166239 -151057 -150893 -43408 -25274 -35852 -140033 -50854 -146142
14238 -146142 -255403 -137824 87865 69451 93899 50981 -58385 -103200 -119408 -129228 110558
14227 110558 139334 49043 10057 -17950 24809 133733 126184 85364 -25132 -113813 -94990
14216 -94990 -73487 -230871 -405220 -185244 -90111 -50778 -112562 -53907 16056 -60164 -179681
14205 -179681 -168534 -101657 -111631 -149974 -69231 6043 82073 140248 102059 1247 34232
14194 34232 -67554 -110571 -129306 -187761 -240137 -205947 -86228 271 41015 -159676 -165007
$$ packed form
14273b64503J53095J01673J5447k13091n6385J47189J48514l5418M824O0229j8558
14262D3016n8738q6740o7703j0000K6003M2458J47434L6727L8175j6005K843r8472
14250a002p9366Q956n5034l9793J5182J64J07485J8134j0578j04181Q9179r5288
14238a46142j09261J17579K25689j8414K4448m2918j09366m4815j6208r820K39786
14227A10558K8776r0291l8986k8007M2759J08924p549m0820j10496q8681J8823
14216i4990K1503j57384j74349K19976R5133L9333o1784N8655O9963p6220j19517
14205a79681J1147O6877r974l8343Q0743P5274P6030N8175l8189j00812L2985
14194C4232j01786m3017j8735n8455n2376L4190J19719Q6499M0744k00691n331
$$ plain form
14183 -165007 45367 64791 -13913 -77356 -90868 -34205 -249655 -359301 -183582 -180297 -277171
14172 -277171 -233696 -48894 136520 202406 261854 356921 371358 250140 126318 65378 180160
14161 180160 167007 97200 99661 113051 125825 139399 48420 5536 121790 54652 -32112
14150 -32112 -130116 -230109 -147120 -79433 -121810 -168277 -106939 -120185 -61054 77314 213583
14139 213583 175183 83324 57105 93556 -24588 -28509 -129461 -162533 -121717 -119150 -104730
14128 -104730 -175981 -231855 -136861 -23136 -20923 24767 92821 34760 15330 -117190 -30646
14117 -30646 -26124 -122977 -138679 -124803 33571 15826 -40852 -88822 -182777 -99628 -17623 -80387
14105 -80387 -127482 -259536 -143394 -83195 -112975 112347 160990 45505 -30812 13916 15571
$$ packed form
14183a65007K10374J9424p8704o3443j3512N6663k15450j09646J75719L285r6874
14172b77171M3475J84802J85414O5886N9448R5067J4437j21218j23822o0940J14782
14161A80160j3153o9807K461J3390J2774J3574r0979m2884J16254o7138q6764
14150c2112r8004r9993Q2989O7687m2377m6467O1338j3246N9131J38368J36269
14139B13583l8400r1859k6219L6451j18144l921j00952l3072M0816K567J4420
14128a04730p1251n5874R4994J13725K213M5690O8054n8061j9430j32520Q6544
14117c0646M522r6853j5702J3876J58374j7745n6678m7970r3955Q3149Q2005o2764
14105h0387m7095j32054J16142O0199k9780K25322M8643j15485p6317M4728J655
$$ plain form
14094 15571 -12017 -88114 -117368 -111517 -151721 -200599 -228215 -244116 -221351 -61882 -12282 -113688
14082 -113688 -197413 -153159 -196185 -153121 -635 5736 -112934 -28057 72776 103882 -16439
14071 -16439 -174004 -200379 -70154 -80568 -24484 -109741 -194102 -114979 -94264 -169427 -265541
14060 -265541 -192243 113911 206627 85389 78173 -4606 -39606 -15368 47646 36961 46944
14049 46944 -55892 -203923 -143742 -97651 -54618 93326 5305 15315 37225 27055 -33267
14038 -33267 -47293 -90274 -107517 -167376 -63637 -169853 -432041 -446803 -239916 -302004 -238760
14027 -238760 -88609 -87132 -249411 -114357 71915 -25093 72015 155176 33929 -33224 67894
14016 67894 86571 -42512 -127786 -137940 -124057 -140928 -176796 -78278 53613 23595 -2473
$$ packed form
14094A5571k7588p6097k9254N851m0204m8878k7616j5901K2765J59469M9600j01406
14082a13688q3725M4254m3026M3064J52486O371j18670Q4877J00833L1106j20321
14071a6439j57565k6375J30225j0414N6084q5257q4361P9123K0715p5163r6114
14060b65541P3298L06154R2716j21238p216q2779l5000K4238O3014j0685R983
14049D6944j02836j48031O0181M6091M3033J47944q8021J0010K1910j0170o0322
14038c3267j4026m2981j7243n9859J03739j06216k62188j4762K06887o2088O3244
14027b38760J50151J477j62279J35054J86272r7008R7108Q3161j21247o7153J01118
14016F7894J8677j29083q5274j0154J3883j6871l5868R8518J31891l0018k6068
$$ plain form
14005 -2473 -7430 62910 -16767 -101644 -80845 -193376 -117093 71520 85134 -79487 -153922
13994 -153922 -237005 -320064 -290196 -230536 -196848 -66791 109485 64172 -6431 -41843 -121489
13983 -121489 -32752 -77861 -94344 -134879 -76143 -60630 -71166 -98120 -104966 -60359 -63877 -87442
13971 -87442 -10726 -33315 -23510 34633 70066 126959 293372 215086 76539 -39042 -101499
13960 -101499 -34271 15992 -55572 -252297 -159140 -115923 -206427 -199942 -71128 35954 114579
13949 114579 217392 206248 146740 42243 112191 105387 -45013 -83212 -55494 5100 64780
13938 64780 31954 26896 -126822 -180224 -110585 49644 126698 198968 148900 47147 73760
13927 73760 3207 -36015 -96388 68295 183815 96641 -47208 -111646 -142652 -44675 -85755
$$ packed form
14005b473m957P0340p9677q4877K0799j12531P6283J88613J3614j64621p4435
13994a53922q3083q3059K9868N9660L3688J30057J76276m5313p0603l5412p9646
13983a21489Q8737m5109j6483m0535N8736J5513j0536k6954o846M4607l518k3565
13971h7442P6716k2589R805N8143L5433N6893J66413p8286j38547j15581o2457
13960a01499O7228N0263p1564j96725R3157M3217r0504O485J28814J07082P8625
13949A14579J02813j1144n9508j04497O9948o804j50400l8199K7718O0594N9680
13938F4780l2826n058j53718n3402O9639J60229P7054P2270n0068j01753K6613
13927G3760p0553l9222o0373J64683J15520q7174j43849o4438l1006R7977m1080
$$ plain form
13916 -85755 -1317 -19795 -62995 105042 211580 31555 -309061 -405141 -215924 -210547 -155757
13905 -155757 -139578 -137058 -92239 -177021 -113755 -127859 -53925 -7097 -112297 -79559 -58836
13894 -58836 -26233 -2038 -22477 -5904 9221 -37729 -87680 -60090 -68303 -62311 84739 866
13882 866 -27713 -20357 -38128 -56115 -128785 -283332 -253884 -81868 132648 154786 104878 143610
13870 143610 159263 61481 -65785 -84479 -106177 -71341 105338 121319 75839 -60010 36701
13859 36701 13846 -25195 -72126 -126089 -78593 -39380 -55998 -235198 -274731 -246769 -363488
13848 -363488 -268704 -71869 -51875 -170314 -140177 -162394 -228439 -230063 -153847 -308677 -241635
13837 -241635 -240197 -328839 -224324 -175977 -158689 -32345 3791 -71772 -13461 91904 -35175
$$ packed form
13916h5755Q4438j8478m3200J68037J06538j80025l40616r6080J89217N377N4790
13905a55757J6179K520M4819q4782O3266j4104P3934M6828j05200L2738K0723
13894e8836L2603K4195k0439J6573J5125m6950m9951K7590q213N992J47050q3873
13882H66k8579P356j7771j7987p2670j54547K9448J72016K14516K2138m9908L8732
13870A43610J5653r7782j27266j8694k1698L4836J76679J5981m5480j35849R6711
13859C6701k2855l9041m6931n3963M7496L9213j6618j79200l9533K7962j16719
13848c63488R4784J96835J9994j18439L0137k2217o6045j624P6216j54830O7042
13837b41635J438q8642J04515M8347J7288J26344L6136p5563N8311J05365j27079
$$ plain form
13826 -35175 -157590 -242595 -282846 -98250 19452 -26507 -53149 28353 131202 173744 232440
13815 232440 112439 12003 -18132 -49437 -114063 -92691 -112105 -118812 -71922 -43902 -100311
13804 -100311 41988 -26841 -85119 -53228 -66033 -138123 -248141 -196412 -52283 -611 -75666
13793 -75666 -94306 -59235 -148295 -102814 -50382 -37259 -121623 -211745 -173805 -46425 40903
13782 40903 134721 123408 98600 187491 215163 120753 -30379 -247183 -177860 -78459 -82028
13771 -82028 -121393 -51652 -114431 -145321 -59346 100208 92999 196313 83571 -4261 -114816
13760 -114816 -164699 -128892 44349 138818 147897 -1135 -154181 -386855 -322567 -261732 -223191
13749 -223191 -189271 -195970 -242101 -210195 -166985 41960 -23903 -119123 -23612 11009 32511
$$ packed form
13826c5175j22415q5005m0251J84596J17702m5959k6642Q1502J02849M2542N8696
13815B32440j20001j00436l0135l1305o4626K1372j9414o707M6890K8020n6409
13804a00311J42299o8829n8278L1891j2805p2090j10018N1729J44129N1672p5055
13793g5666j8640L5071q9060M5481N2432J3123q4364r0122L7940J27380Q7328
13782D0903R3818j1313k4808Q8891K7672r4410j51132k16804O9323R9401l569
13771h2028l9365O9741o2779l0890Q5975J59554p209J03314j12742q7832j10555
13760a14816m9883L5807J73241R4469R079j49032j53046k32674O4288O0835L8541
13749b23191L3920o699m6131L1906M3210K08945o5863r5220R5511L4621K1502
$$ plain form
13738 32511 -35947 -33676 -67109 -44248 -29823 -233405 -182610 -132684 -119271 -100182 -54745 -141191
13726 -141191 -93171 34131 -36511 -295009 -266170 -41199 -40302 -44447 -151603 -193700 -312186
13715 -312186 -274417 -204103 -160536 -58945 69859 144617 68771 -47867 31547 36194 -8029
13704 -8029 -40042 -70091 -28397 -95853 -141123 -261786 -333207 -64315 88240 100430 159688
13693 159688 217002 100171 109322 -42209 -212245 -220704 -268967 -132013 -53637 -114471 -155645
13682 -155645 -137791 -31999 -119665 -70193 -59720 -18344 -43350 -21158 -19930 -6042 50006
13671 50006 51285 143269 239608 165679 203671 304118 187922 117712 100264 -20595 -21242 -16016
13659 -16016 -64788 -41058 -120149 -69092 -258268 -346381 -208304 -237988 -114656 -13810 92034
$$ packed form
13738C2511o8458K271l3433K2861J4425k03582N0795M9926J3413J9089M5437q6446
13726a41191M8020J27302p0642k58498K8839K24971Q97m145j07156m2097j18486
13715c12186L7769P0314M3567J01591J28804P4758p5846j16638P9414M647m4223
13704h029l2013l0049M1694o7456m5270j20663p1421K68892J52555J2190N9258
13693A59688N7314j16831R151j51531j70036q459m8263J36954P8376o0834m1174
13682a55645J7854J05792q7666M9472J0473M1376k5006K2192J228J3888N6048
13671E0006J279R1984R6339p3929L7992J00447j16196p0210j7448j20859o47N226
13659a6016m8772K3730p9091N1057j89176q8113J38077k9684J23332J00846J05844
$$ plain form
13648 92034 74749 62040 194129 207274 45028 -81975 -5783 58948 23101 -38387 -91588
13637 -91588 -178669 -58566 52477 76513 103924 68957 78732 105370 70493 42471 9659
13626 9659 -20493 -67466 -207805 -180766 -98107 -122187 -163011 -156440 -178035 -153101 -164877 -127957
13614 -127957 -89777 -102539 -124330 -265765 -308147 -261913 -202720 -211482 -220379 -211617 -349097 -305248
13602 -305248 -119698 62545 86013 8572 -200908 -179092 -203065 -187085 -77025 -150330 -172923
13591 -172923 -175224 -73952 -121715 -201269 -28209 -67111 -148245 -134540 -44817 -53658 -91936
13580 -91936 2795 7492 -103422 -284933 -281860 -109538 16941 9800 -1724 -12178 -81296
13569 -81296 -21627 46402 32350 -67791 -67536 -26418 -21022 -24578 -12896 -94239 -158810 -119635
$$ packed form
13648I2034j7285j2709J32089J3145j62246j27003P6192O4731l5847o1488n3201
13637i1588q7081J20103J11043K4036K7411l4967R775K6638l4877k8022l2812
13626I659l0152m6973j40339K7039Q2659k4080m0824O571k1595K4934j1776L6920
13614a27957L8180j2762k1791j41435m2382M6234N9193q762q897Q762j37480M3849
13602c05248J85550J82243K3468p7441k09480K1816k3973J5980J10060p3305k2593
13591a72923k301J01272m7763p9554J73060l8902q1134J3705Q9723q841l8278
13580i1936R4731M697j10914j81511L073J72322J26479p141j1524j0454o9118
13569h1296N9669O8029j4052j00141K55M1118N396l556J1682q1343o4571L9175
$$ plain form
13557 -119635 -43406 -19954 -121229 -152938 -154011 -157953 -126987 91194 61061 138436 83817
13546 83817 64749 106126 137746 90678 -37731 -33989 -14502 -52826 65437 153349 223325
13535 223325 255059 153808 93130 15731 133474 105910 56707 48015 -46756 -65687 -71527
13524 -71527 54846 67631 -78304 -128990 -104662 43333 133652 78183 -6810 28318 3491
13513 3491 125214 74977 -35068 46609 -31444 -139639 -137642 -25643 114549 160869 135565
13502 135565 31590 -21892 -21624 -147499 -86066 -55517 -85963 -70356 -107798 -82849 2081
13491 2081 -87581 -88722 -63733 -71741 5145 -13668 -19528 -8472 24671 109499 177912 48404
13479 48404 31618 77855 -20041 -89473 -95573 -34824 84856 -18828 -196464 -230612 -118053
$$ packed form
13557a19635P6229K3452j01275l1709j073l942L0966K18181l0133P7375n4619
13546H3817j9068M1377L1620m7068j28409L742J9487l8324J18263Q7912O9976
13535B23325L1734j01251o0678p7399J17743k7564m9203q692r4771j8931n840
13524g1527J26373J2785j45935n0686K4328J47995R0319n5469q4993L5128k4827
13513C491J21723n0237j10045Q1677p8053j08195J997J11999J40192M6320k5304
13502A35565j03975n3482K68j25875O1433L0549l0446J5607l7442K4949Q4930
13491B081q9662j141K4989q008P6886j8813n860J1056L3143Q4828O8413j29508
13479D8404j6786M6237r7896o9432o100O0749J19680j03684j77636l4148J12559
$$ plain form
13468 -118053 -154465 5816 62759 -2229 -124490 -130098 -236470 -231494 -107002 -124275 -234519
13457 -234519 -246407 -326134 -326481 -330047 -405531 -432558 -246893 -161716 -234784 -260089 -7252 39517
13445 39517 9120 -34971 -122815 -232494 -369720 -385794 -330632 -161475 15817 -5991 -127465
13434 -127465 51227 65422 -52052 -81172 27261 47536 58120 -59931 -136972 -116076 -156238
13423 -156238 -179948 -180162 -11602 109812 68040 -44087 -99494 -48473 -85512 -36388 -72294
13412 -72294 -140553 -119235 -93063 -79181 -106926 -105714 30493 23846 -36101 -266767 -267632 -165589
13400 -165589 -98371 -79995 -73733 14917 -3500 4214 -72664 -193800 -192588 -190833 -182092 -249950
13388 -249950 -308817 -258006 -234811 -155842 -52615 64492 39550 -39490 -71253 -119068 -70406
$$ packed form
13468a18053l6412J60281N6943o4988j22261n608j06372M976J24492j7273j10244
13457b34519j1888p9727l47l566p5484k7027J85665Q5177p3068k5305K52837M6769
13445C9517l0397m4091q7844j09679j37226j6074N5162J69157J77292k1808j21474
13434a27465J78692J4195j17474k9120J08433K0275J0584j18051p7041K0896m0162
13423a56238k3710k14J68560J21414m1772j12127n5407N1021l7039M9124l5906
13412g2294o8259K1318K6172J3882k7745J212J36207o647n9947k30666q65J02043
13400a65589O7218J8376O262Q8650j8417P714p6878j21136J212J755Q741o7858
13388b49950n8867N0811K3195P8969J03227J17107k4942p9040l1763m7815M8662
$$ plain form
13377 -70406 -33310 -57741 -29738 -68567 -137392 -206999 -108522 -108130 -129748 -208920 -184938 -77402
13365 -77402 -26609 89016 77474 87415 85320 62693 97302 3818 -122789 -263019 -363702
13354 -363702 -225592 -130787 -37365 6733 79580 21647 65971 144241 158002 52611 -200567
13343 -200567 -199946 -37884 -76979 -91184 -13780 172803 75140 -112434 -189421 -153665 50250
13332 50250 -101444 -200861 -174224 -27450 89621 85534 -125777 -172988 -131121 -139582 -68073
13321 -68073 -18598 -167349 -160353 -236737 -255230 -304683 -356074 -314300 -273952 -336708 -188120
13310 -188120 -59568 44824 59536 28417 -34836 -171735 -262794 -196790 -81740 -70125 22055
13299 22055 117084 137521 92590 3184 -71981 -36740 113446 29861 63312 202950 237955
$$ packed form
13377g0406L7096k4431K8003l8829o8825o9607R8477L92k1618p9172K3982J07536
13365g7402N0793J15625j1542R941k095k2627L4609r3484j26607j40230j00683
13354c63702J38110R4805R3422M4098P2847n7933M4324P8270J3761j05391k53178
13343b00567O21J62062l9095j4205P7404J86583r7663j87574p6987L5756K03915
13332E0250j51694r9417K6637J46774J17071m087k11311m7211M1867q461P1509
13321f8073M9475j48751O996p6384j8493m9453n1391M1774M0348o2756J48588
13310a88120J28552J04392J4712l1119o3253j36899r1059O6004J15050J1615R2180
13299B2055R5029K0437m4931q9406p5165L5241J50186q3585L3451J39638L5005
$$ plain form
13288 237955 151837 104681 75320 52075 -54443 76980 166327 179134 84380 -36106 -99445
13277 -99445 -93764 7691 7437 49399 193608 279193 271655 191753 16722 -23597 -62392 -190731
13265 -190731 -344886 -385869 -342234 -293689 -196364 -19834 36610 76004 10808 60148 137815
13254 137815 62773 -29528 -81649 -165862 -173436 -70425 71351 87416 135158 83703 -35332
13243 -35332 -127969 -96739 36471 237137 275289 243315 84104 1868 -29487 -15687 5030
13232 5030 43424 55173 60217 -41323 -158311 -174609 -110642 -162366 -243613 -171038 -52855
13221 -52855 33115 12255 -113216 -86719 -38282 18376 -170406 -311323 -190334 -27139 79420
13210 79420 191279 156740 51422 38745 -82504 -55800 -1991 -18171 -240020 -283028 -292334
$$ packed form
13288B37955q6118m7156k9361k3245j06518J31423Q9347J2807r4754j20486o3339
13277i9445N681J01455k54M1962J44209Q5585p538p9902j75031m0319l8795j28339
13265a90731j54155m0983M3635M8545R7325J76530N6444L9394o5196M9340P7667
13254A37815p5042r2301n2121q4213p574J03011J41776J6065M7742n1455j19035
13243c5332r2637L1230J33210K00666L8152l1974j59211q2236l1355J3800K0717
13232E030L8394J1749N044j01540j16988j6298O3967n1724q1247P2575J18183
13221e2855Q5970k0860j25471K6497M8437N6658j88782j40917J20989J63195J06559
13210G9420J11859l4539j05318j2677j21249K6704N3809j6180k21849m3008r306
$$ plain form
13199 -292334 -127999 -82253 -137410 -121454 -100921 -160034 -108613 -93978 -201429 -280128 -165742
13188 -165742 -23042 -121511 -268237 -282165 -106035 -188468 -113231 -38860 97638 221958
13178 221958 219686 213911 187853 217994 127861 -28608 -33667 -22705 -11460 -110352 -164653 -114052
13166 -114052 -1423 84650 110469 86780 4111 17340 58834 99273 22878 -35361 -243121
13155 -243121 -290576 -338157 -249658 -85547 -19323 133045 173785 247966 352226 268722 136810
13144 136810 10115 -46110 -58251 5191 17395 47375 138950 258335 190554 142156 128903
13133 128903 174527 278611 406810 355998 224914 174670 35672 -26466 45341 102101 -870
13122 -870 -184413 -300093 -238401 -130438 -147660 -95589 -44554 62680 65666 -169075 -280296
$$ packed form
13199b92334J64335M5746n5157J5956K0533n9113N1421J4635j07451p8699J14386
13188a65742J42700r8469j46726j3928J76130q2433P5237P4371J36498J24320
13178B21958k272n775k6058L0141r0133j56469n059J0962J1245r8892n4301N0601
13166a14052J12629Q6073K5819k3689q2669J3229M1494M0439p6395n8239k07760
13155b43121m7455m7581Q8499J64111O6224J52368M0740P4181J04260q3504j31912
13144A36810j26695n6225j2141O3442J2204K9980R1575J19385o7781m8398j3253
13133A28903M5624J04084J28199n0812j31084n0244j38998o2138P1807N6760j02971
13122h70j83543j15680O1692J07963j7222N2071N1035J07234K986k34741j11221
$$ plain form
13111 -280296 -300909 -119456 -4249 108518 181236 107854 30698 14628 77674 -27131 -119362
13100 -119362 -219295 -173525 -235305 -350600 -433518 -161566 71635 154842 -13062 -58273 -4698
13089 -4698 -49579 -69107 -77361 -17105 -14290 -20636 -37355 -92718 -129896 -110036 -24837 259048
13077 259048 273391 94938 15620 -37749 -42549 -86486 -143508 -42230 -9783 -73130 -216495
13066 -216495 -249203 -265049 -343624 -354293 -211089 -196234 -291975 -232289 -190495 -55993 131726
13055 131726 261959 313290 248910 74957 -53375 -9850 39400 62611 187666 225460 213745
13044 213745 253198 176749 18371 -110202 -87421 -109540 -62657 -59371 -119795 -226961 -131922
13033 -131922 -103416 -226173 -292606 -354330 -363024 -95163 88639 75646 -34834 -74574 -50840
$$ packed form
13111b80296k0613J81453J15207J12767P2718p3382p7156j6070O3046j04805r2231
13100a19362r9933M5770o1780j15295q2918K71952K33201Q3207j67904m5211N3575
13089d698m4881j9528q254O0256K815o346j6719n5363l7178J9860Q5199K83885
13077B59048J4343j78453p9318n3369m800m3937n7022J01278L2447o3347j43365
13066b16495l2708j5846p8575j0669J43204J4855r5741N9686M1794J34502J87719
13055A31726J30233N1331o4380j73953j28332M3525M9250K3211J25055L7794j1715
13044B13745L9453p6449j58378j28573K2781k2119M6883L286o0424j07166R5039
13033a31922K8506j22757o6433o1724q694K67861J83802j2993j10480l9740K3734
$$ plain form
13022 -50840 -37619 13254 86871 137602 114266 134609 205511 210850 113648 -100578 -42934 4438
13010 4438 27131 21078 -116427 -167807 -60851 149382 88976 -28064 -78546 27324 53856
12999 53856 2520 -44260 -83556 13895 129806 111840 94043 12132 -78012 -118910 -149457
12988 -149457 -80167 -108532 -147344 -161140 -127168 4642 23014 -133799 -210859 -211666 -151091
12977 -151091 8260 26763 12431 -32136 -134053 -169708 -196306 -120931 -180182 -292204 -231493
12966 -231493 -204065 -179612 -134377 -173837 -138154 -23953 10644 15301 -127153 -111354 -207287
12955 -207287 -272092 -246087 -199039 -355753 -375373 -476520 -415215 -201339 -100697 -65688 -73712
12944 -73712 77381 96347 35349 25170 3344 -5472 -59103 -100256 -134557 -171945 -67464
$$ packed form
13022e0840J3221N0873P3617N0731k3336K0343P0902N339r7202k14226N7644M7372
13010D438K2693o053j37505n1380J06956K10233o0406j17040n0482J05870K6532
12999E3856n1336m6780l9296R7451J15911j7966j7797q1911r0144m0898l0547
12988a49457O9290k8365l8812j3796L3972J31810J8372j56813p7060q07O0575
12977a51091J59351J8503j4332m4567j01917l5655k6598P5375n9251j12022O0711
12966b31493K7428K4453M5235l9460L5683J14201L4597M657j42454J5799r5933
12955b07287o4805K6005M7048j56714j9620j01147O1305K13876J00642L5009q024
12944g3712J51093J8966o0998j0179k1826q816n3631m1153l4301l7388J04481
$$ plain form
12933 -67464 -56370 -129741 -81638 24583 80021 139991 181176 -70839 -208220 -225725 -200001
12922 -200001 -139411 -5060 204233 128906 134176 79018 64798 120818 163843 154077 118336
12911 118336 78559 19650 14587 78646 -66862 -140401 -147690 -268302 -293620 -257520 -251746 -224507
12899 -224507 -176908 -167862 -90617 -78211 -77013 -80361 -118888 -14194 -54435 -56535 -134186 -45255
12887 -45255 -12449 -14549 94593 55458 263322 256154 253435 208349 98732 -68046 -133361
12876 -133361 -39756 -89636 -137737 -131805 -174328 5079 61890 120969 186071 245979 324437
12865 324437 191492 109226 9723 -22690 98554 164613 68436 -9690 -10103 156796 172623
12854 172623 164479 69210 -22010 -37251 -49561 -79694 77197 107166 -15733 32517 101591
$$ packed form
12933f7464J1094p3371M8103J06221N5438N9970M1185k52015j37381j7505K5724
12922b00001O0590J34351K09293p5327N270n5158j4220N6020M3025r766l5741
12911A18336l9777n8909n063O4059j45508p3539p289j20612k5318L6100N774K7239
12899b24507M7599R046P7245J2406J198l348l8527J04694m0241k100p7651Q8931
12887d5255L2806k100J09142l9135K07864p168k719m5086j09617j66778o5315
12876a33361R3605m9880m8101N932m2523J79407N6811N9079O5102N9908P8458
12865C24437j32945q2266r9503l2413J21244O6059r6177p8126m13J66899J5827
12854A72623q144r5269r1220j5241j2310l0133J56891K9969j22899M8250O9074
$$ plain form
12843 101591 151189 145670 104453 -76385 -202086 -182805 -128697 -4913 89762 -63887 -69406
12832 -69406 2286 -43864 -130697 -9862 212873 161464 85407 101066 -31907 -11158 21516
12821 21516 119168 227744 210544 208087 109219 54871 -36180 -39742 -130608 25937 115060 -70670
12809 -70670 -43075 -6663 -22898 -217647 -198682 -116135 -146619 -145346 -11249 121759 198182
12798 198182 236089 176832 120012 88734 128368 194478 48188 -46686 71847 189032 37909
12787 37909 -129484 -32348 191387 132239 121160 189695 204245 156574 265884 188191 31848
12776 31848 -68409 -113724 -14552 133436 -2735 -82552 -33383 44736 168294 158580 53409
12765 53409 61303 25469 7949 86600 88258 57991 13133 57441 215255 142382 95539 146125
$$ packed form
12843A01591M9598n519m1217j80838j25701J9281N4108J23784R4675j53649n519
12832f9406P1692m6150q6833J20835K22735n1409p6057J5659j32973K0749L2674
12821B1516R7652J08576j7200k457r8868n4348r1051l562r0866J56545Q9123j85730
12809g0670K7595L6412j6235j94749J8965Q2547l0484J273J34097J33008P6423
12798A98182L7907n9257n6820l1278L9634O6110j46290r4874J18533J17185j51123
12787C7909j67393R7136K23735n9148j1079O8535J4550m7671J09310p7693j56343
12776C1848j00257m5315R9172J47988j36171p9817M9169P8119J23558r714j05171
12765E3409P894l5834j7520P8651J658l0267m4858M4308J57814p2873m6843N0586
$$ plain form
12753 146125 56519 -27111 43885 290749 353261 254232 227036 350492 337512 251085 211642
12742 211642 125372 166278 312953 168650 18264 -5543 73573 97072 4115 -56029 3979
12731 3979 -63428 -17414 -144858 -236223 -246686 -132299 -82636 -174104 -166404 -44030 62282
12720 62282 123405 252779 447033 419034 292705 190808 164151 176303 104791 -5246 -64037
12709 -64037 -21884 18037 -48782 106189 146495 133853 138697 98196 138224 122320 164593 150124
12697 150124 89390 -8388 -150027 -106613 -83599 -78699 -89691 -92975 -27233 -46270 40716 120957
12685 120957 98229 -15693 -54613 -63359 52257 147037 100122 37913 -65952 -80853 43280
12674 43280 260949 134584 -2010 53563 -67688 -20161 -13425 35923 80008 12076 9865
$$ packed form
12753A46125q9606q3630P0996K46864O2512r9029k7196J23456j2980q6427l9443
12742B11642q6270M0906J46675j44303j50386k3807P9116K3499r2957o0144O0008
12731C979o7407M6014j27444r1365j0463J14387M9663r1468P700J22374J06312
12720F2282O1123J29374J94254k7999j26329j01897k6657J2152p1512j10037n8791
12709f4037M2153L9921o6819J54971M0306j2642M844m0501M0028j5904M2273j4469
12697A50124o0734r7778j41639M3414K3014M900j0992l284O5742j9037Q6986Q0241
12685A20957k2728j13922l8920q746J15616R4780m6915o2209j03865j4901J24133
12674D3280K17669j26365j36594N5573j21251M7527O736M9348M4085o7932k211
$$ plain form
12663 9865 54086 46515 -50094 10324 27682 87989 22578 -136761 -91251 52982 185690
12652 185690 343244 158308 71354 145872 78881 -25781 -30212 -31350 -72816 -136061 -88477
12641 -88477 -99539 -87897 -170418 -234958 -18856 155719 235024 236912 131537 117397 229235
12630 229235 173691 119567 62714 55300 22609 -1463 -23813 -27872 -13962 173346 130710 168665
12618 168665 6551 6243 184912 47256 -17936 116374 161833 211044 234608 230564 227449
12607 227449 148484 136966 135379 413615 342416 163576 208915 237643 80257 -14071 -120672
12596 -120672 -241729 -337613 -403590 -298784 -208921 -197217 -266802 -183192 -149668 -176970 -168162
12585 -168162 -88244 -18275 34992 12911 -37064 72849 220569 207688 153848 62430 20208
$$ packed form
12663I865M4221p571r6609O0418J7358O0307o5411j59339M5510J44233J32708
12652A85690J57554j84936q6954P4518o6991j04662m431j138m1466o3245M7584
12641h8477j1062J1642q2521o4540K16102J74575P9305J888j05375j4140J11838
12630B29235n5544n4124n6853p414l2691k4072k2350m059J3910J87308m2636L7955
12618A68665j62114l08J78669j37656o5192J34310M5459M9211K3564m044l115
12607B27449p8965j1518j587K78236p1199j78840M5339K8728j57386r4328j06601
12596a20672j21057r5884o5977J04806Q9863J1704o9585Q3610L3524k7302Q808
12585a68162P9918O9969N3267k2081m9975J09913J47720j2881n3840r1418m2222
$$ plain form
12574 20208 65248 297323 202618 -16803 4973 95719 -12618 63139 -97410 -82966 108680
12563 108680 164559 250062 210681 121839 52975 41484 67788 -69897 -171626 -82558 -10854
12552 -10854 74309 55247 10913 129168 206816 193682 252616 215011 149137 1413 -29376
12541 -29376 -47721 19500 104695 63811 -22137 67628 72791 67969 129043 200328 238810 258500
12529 258500 55546 203982 398610 232690 305417 392657 305019 300473 175436 197748 336907
12518 336907 404202 355542 268130 218872 374027 308279 210056 205194 134556 75667 -1502
12507 -1502 6062 37362 76796 195167 128877 145713 168380 162684 136216 154782 240798 151999
12495 151999 75552 134283 139405 254426 361499 425205 382787 336259 168907 129510 131461
$$ packed form
12574B0208M5040K32075r4705k19421K1776R0746j08337P5757j60549J4444J91646
12563A08680N5879Q5503l9381q8842o8864j1491K6304j37685j01729Q9068P1704
12552a0854Q5163j9062m4334J18255P7648j3134N8934l7605o5874j47724l0789
12541b9376j8345O7221Q5195m0884q5948Q9765N163m822O1074P1285L8482J9690
12529B58500k02954J48436J94628j65920P2727Q7240q7638m546j25037K2312J39159
12518C36907O7295m8660q7412m9258J55155o5748r8223m862p0638n8889p7169
12507a502P564L1300L9434J18371o6290J6836K2667n696k6468J8566Q6016q8799
12495A51999p6447N8731N122J15021J07073O3706m2418m6528j67352l9397J951
$$ plain form
12484 131461 93788 49276 30123 189811 239164 208874 128337 109022 125371 228292 168650
12473 168650 64903 98644 196215 270639 189716 171186 235323 230635 180198 92135 -55911
12462 -55911 -118575 -168284 -218827 -118703 -107918 -41311 121047 171855 166415 59085 -31913
12451 -31913 -220898 -265358 -209990 60138 221677 174770 102816 17289 97248 75145 -1954
12440 -1954 69332 121087 106834 101735 -24692 35827 164791 179512 82254 -11931 21466 123720
12428 123720 154471 141068 145930 129075 116498 62298 115145 136742 227856 212917 155132 200787
12416 200787 224280 136946 7927 132254 293384 306883 347495 292673 140709 -18989
12406 -18989 -167806 -133259 15439 146463 103406 230255 358613 230830 147236 33472
$$ packed form
12484A31461l7673m4512j9153J59688M9353l0290q0537j9315J6349J02921n9642
12473A68650j03747L3741R7571P4424q0923j8530O4137m688n0437q8063j48046
12462e5911o2664m9709n0543J00124J0785O6607J62358N0808n440j07330r0998
12451c1913j88985m4460N5368K70128J61539m6907p1954q5527P9959k2103p7099
12440a954P1286N1755j4253n099j26427O0519J28964J4721r7258r4185L3397J02254
12428A23720L0751j3403M862j6855j2577n4200N2847K1597R1114j4939n7785M5655
12416B00787K3493q7334j29019J24327J61130J3499M0612n4822j51964j59698
12406a8989j48817L4547J48698J31024m3057J26849J28358j27783q3594j13764
$$ plain form
12396 33472 130157 353870 223376 194329 257471 198787 251612 382367 258068 142552 269384
12385 269384 238406 83728 81518 136759 267347 355030 392518 323410 304993 149688 66438
12374 66438 122625 293582 394994 366691 333474 296598 222556 173301 110065 244047 171054
12363 171054 248567 329108 286745 357498 208075 -69198 -120810 17827 202859 237993 262186
12352 262186 376077 376548 372817 424195 479353 380285 258084 171561 254004 358938 542514
12341 542514 663120 446986 460507 536681 574028 503692 518808 569300 447908 367007 365864
12330 365864 357042 331295 222450 162055 204497 252983 293182 321433 307953 362284 304131
12319 304131 233823 457795 431606 425950 364416 218133 256577 398054 323798 192559 188629
$$ packed form
12396C3472R6685K23713j30494k9047O3142n8684N2825J30755j24299j15516J26832
12385B69384l0978j54678k210N5241J30588Q7683L7488o9108j8417j55305q3250
12374F6438N6187J70957J01412k8303l3217l6876p4042m9255o3236J33982p2993
12363A71054P7513Q0541m2363P0753j49423k77273n1612J38637J85032L5134K4193
12352B62186J13891M71l731N1378N5158r9068j22201q6523Q2443J04934J83576
12341E42514J20606k16134J3521P6174L7347p0336J5116N0492j21392q0901j143
12330C65864q822k5747j08845o0395M2442M8486M0199K8251j3480N4331n8153
12319C04131p0308K23972k6189n656o1534j46283L8444J41477p4256j31239l930
$$ plain form
12308 188629 311615 379639 223322 308281 427543 490495 400336 379352 239208 185715 358380
12297 358380 389119 331111 384812 313682 241974 357197 543184 453402 228813 444124 603075
12286 603075 509055 510533 530427 411236 336927 443017 528793 574178 568169 545259 548898 497803
12274 497803 615650 585737 467591 441462 488453 405690 365114 370777 453925 417859 282831
12263 282831 265374 193613 315013 328676 309879 316818 406237 467411 412344 489056 484919 534613
12251 534613 500451 501593 490269 527269 554991 624126 661486 429687 399087 466498 350170
12240 350170 428799 571825 482714 406141 435359 501580 597623 573216 512790 375834 284126
12229 284126 398177 330327 406948 533635 562319 598413 593031 562567 531487 436914 426370
$$ packed form
12308A88629J22986O8024j56317Q4959J19262O2952r0159k0984j40144n3493J72665
12297C58380L0739n8008N3701p1130p1708J15223J85987q9782k24589K15311J58951
12286F03075r4020J478J9894j19191p4309J06090Q5776M5385o009k2910L639n1095
12274D97803J17847k9913j18146k6129M6991q2763m0576N663Q3148l6066j35028
12263B82831j7457p1761J21400J3663j8797O939Q9419O1174n5067P6712m137M9694
12251E34613l4162J142j1324L7000K7722O9135L7360k31799l0600O7411j16328
12240C50170P8629J43026q9111p6573K9218O6221R6043k4407o0426j36956r1708
12229B84126J14051o7850P6621J26687K8684L6094n382l0464l1080r4573j0544
$$ plain form
12218 426370 535600 661402 853816 926852 725251 590538 444100 460579 518788 490275
12208 490275 531487 528000 569851 684004 689422 674025 754242 599844 434135 479307 494543
12197 494543 519984 736232 800775 835815 885545 924734 843209 791668 579353 591784 703474
12186 703474 801671 928835 891559 721818 792908 847104 903436 883912 855628 718407 687428
12175 687428 749669 874626 986918 918251 904616 869348 777302 769665 879175 1041909 1096151
12164 1096151 1081490 1082999 1027643 960978 1026049 1084124 1025604 1084485 1105361 1079984 998236
12153 998236 842825 946427 1114573 1046376 1138416 1221229 1282944 1232252 1157324 1234568 1267758
12142 1267758 1133050 941462 933328 1035764 1095346 1137384 1225052 1184396 1222797 1288461 1301507
$$ packed form
12218D26370J09230J25802J92414P3036k01601j34713j46438J6479N8209k8513
12208D90275M1212l487M1851J14153N418j5397Q0217j54398j65709M5172J5236
12197D94543K5441K16248O4543L5040M9730L9189q1525n1541k12315J2431J11690
12186G03474R8197J27164l7276j69741P1090N4196N6332j9524k8284j37221l0979
12175F87428O2241J24957J12292o8667j3635l5268r2046p637J09510J62734N4242
12164A096151j4661J509n5356o6665O5071N8075n8520N8881K0876k5377q1748
12153I98236j55411J03602J68146o8197R2040Q2813O1715n0692p4928P7244L3190
12142A267758j34708j91588q134J02436N9582M2038Q7668m0656L8401O5664J3046
$$ plain form
12131 1301507 1303514 1308097 1406923 1395321 1547124 1566826 1496821 1447611 1242570 1305609 1416816
12120 1416816 1545203 1580720 1509032 1461406 1539465 1672943 1798973 1875680 1786818 1784824 1783805
12109 1783805 1753715 1902489 1982025 1965286 1702620 1609844 1659818 1772952 1931077 2058603
12099 2058603 2048966 2166161 2265218 2282889 2410877 2475546 2485116 2461745 2407213 2385437 2485188
12088 2485188 2529878 2608221 2660893 2574935 2514579 2598594 2662836 2729517 2785784 2723036 2664030
12077 2664030 2754238 2772741 2815266 2935927 3153150 3100626 3117549 3168239 3137048 3283313 3535418
12066 3535418 3521915 3366560 3271440 3266817 3435599 3599886 3658620 3828343 4058189 4097425
12056 4097425 4109967 4038589 4012962 3994507 4235999 4327205 4383316 4469027 4441522 4440103 4689786
$$ packed form
12131A301507K007M583R8826j1602J51803J9702p0005m9210k05041O3039J11207
12120A416816J28387L5517p1688m7626P8059J33478J26030P6707q8862j994j019
12109A783805l0090J48774P9536j6739k62666r2776M9974J13134J58125J27526
12099B058603r637J17195R9057J7671J27988O4669R570k3371n4532k1776R9751
12088B485188M4690P8343N2672q5958o0356Q4015O4242O6681N6267o2748n9006
12077B664030R0208J8503M2525J20661K17223n2524J6923N0690l1191J46265K52105
12066C535418j3503j55355r5120m623J68782J64287N8734J69723K29846L9236
12056D097425J2542p1378k5627j8455K41492R1206N6111Q5711k7505j419K49683
$$ plain form
12045 4689786 4859722 5039591 5079555 5016357 5036591 5047639 5083317 5173379 5323708 5624739
12035 5624739 5762424 5767505 5783390 5904939 6070955 6206860 6503130 6789541 6893117 6924266
12025 6924266 7069459 7156965 7231758 7262881 7461522 7747770 7965823 8140325 8314484 8610951
12015 8610951 8832905 8837932 9052748 9299877 9625501 9709140 9837432 10281995 10626759 11004860
12005 11004860 11413534 11648566 11852786 12006134 12057642 12216799 12555417 12842713 13182372
11996 13182372 13609874 13882822 14139677 14263439 14625695 15090231 15381952 15704895 16011137
11987 16011137 16337778 16756591 17056169 17257029 17481638 17836948 18237492 18611111 18999295
11978 18999295 19302545 19617332 20120177 20469324 20734046 20991402 21135614 21362565 21702598
$$ packed form
12045D689786J69936J79869L9964o3198K0234J1048L5678R0062J50329L01031
12035E624739J37685N081J5885J21549J66016J35905K96270K86411J03576L1149
12025F924266J45193Q7506P4793L1123J98641K86248K18053J74502J74159K96467
12015H610951K21954N027K14816K47129L25624Q3639J28292M44563L44764L78101
12005A1004860M08674K35032K04220J53348N1508J59157L38618K87296L39659
11996A3182372M27502K72948K56855J23762L62256M64536K91721L22943L06242
11987A6011137L26641M18813K99578K00860K24609L55310M00544L73619L88184
11978A8999295L03250L14787N02845L49147K64722K57356J44212K26951L40033
$$ plain form
11969 21702598 22084798 22382124 22586519 22710401 22842184 22960753 23048577 23379384 23773952
11960 23773952 23866725 23696984 23465804 23217144 23045773 22934782 22803302 22611872 22499776
11951 22499776 22294739 21949587 21804293 21664662 21415585 21097760 20895048 20634950 20399328
11942 20399328 20093130 19636848 19319430 18935342 18549905 18219696 17931875 17540182 17075027
11933 17075027 16746306 16550027 16343699 15906909 15439956 15203022 14994512 14677801 14377528
11924 14377528 14047438 13589704 13326151 13152944 12925812 12668494 12358162 12011267 11729485
11915 11729485 11297176 11040036 10814469 10698943 10384068 9933024 9540751 9375406 9321184
11906 9321184 9238626 9187584 8865861 8563963 8287046 8175756 8007156 7899263 7815517 7611192
$$ packed form
11969B1702598L82200K97326K04395J23882J31783J18569Q7824L30807L94568
11960B3773952R2773j69741k31180k48660j71371j10991j31480j91430j12096
11951B2499776k05037l45152j45294j39631k49077l17825k02712k60098k35622
11942B0399328l06198m56282l17418l84088l85437l30209k87821l91693m65155
11933A7075027l28721j96279k06328m36790m66953k36934k08510l16711l00273
11924A4377528l30090m57734k63553j73207k27132k57318l10332l46895k81782
11915A1729485m32309k57140k25567j15526l14875m51044l92273j65345n4222
11906I321184q2558n1042l21723l01898k76917j11290j68600j07893q3746k04325
$$ plain form
11896 7611192 7535243 7373434 7111607 6919275 6761784 6643605 6454737 6319081 6167898 6059404
11886 6059404 5926438 5910987 5769647 5532605 5466121 5406094 5281799 5091428 5075037 5056110
11876 5056110 4953018 4800295 4641914 4608934 4656615 4637367 4634561 4535245 4260119 4097015
11866 4097015 4103412 4064467 4020726 3854593 3690276 3688484 3558309 3451706 3353482 3327238 3251527
11855 3251527 3288383 3272453 3237611 3207849 3203850 3053037 2950085 2941787 2800198 2711929 2617347
11844 2617347 2580472 2634385 2585009 2513736 2522269 2494795 2626838 2541463 2387168 2199292 2200937
11833 2200937 2103018 2027384 2030337 2039609 2039790 1936744 2050639 2055546 2031779 1993096 1971574 2076318
11821 2076318 2113771 2038232 1931989 1870020 1955190 1979973 1818840 1791488 1960565 1913913 1816595
$$ packed form
11896G611192p5949j61809k61827j92332j57491j18179j88868j35656j51183j08494
11886F059404j32966j5451j41340k37042o6484o0027j24295j90371j6391j8927
11876E056110j03092j52723j58381l2980M7681j9248k806r9316k75126j63104
11866D097015O397l8945m3741j66133j64317j792j30175j06603r8224k6244p5711
11855C251527L6856j5930l4842k9762l999j50813j02952q298j41589q8269r4582
11844B617347l6875N3913m9376p1273Q533k7474J32043q5375j54295j87876J645
11833B200937r7919p5634K953R272J81j03046J13895M907k3767l8683k1522J04744
11821B076318L7453p5539j06243o1969Q5170K4783j61133k7352J69077m6652r7318
$$ plain form
11810 1816595 1799491 1762718 1760056 1695462 1520480 1508705 1449374 1407108 1398236 1462653 1510912
11799 1510912 1580188 1574744 1454093 1383195 1402079 1397739 1502528 1422771 1331864 1320915 1191847
11788 1191847 1090820 1182020 1235577 1384635 1352854 1337548 1314524 1330640 1272163 1170657 1173621
11777 1173621 1209417 1059811 1030477 1145688 1146789 1101816 1058288 1106731 1166845 1053050 1006809
11766 1006809 952468 936912 1021230 976897 838845 815814 965714 909955 855990 744084 792970
11755 792970 921413 942348 958320 1004180 1085896 999819 885124 862083 803057 790747 830708
11744 830708 845027 795583 780329 880627 863303 739993 641676 720270 798628 832617 813386
11733 813386 817646 828299 861130 862123 698025 521167 504369 600809 616735 589932 526007 506512
$$ packed form
11810A816595j7104l6773k662o4594j74982j1775n9331m2266q872O4417M8259
11799A510912O9276n444j20651p0898J8884m340J04789p9757r0907j0949j29068
11788A191847j01027R1200N3557J49058l1781j5306k3024J6116n8477j01506K964
11777A173621L5796j49606k9334J15211J101m4973m3528M8443O0114j13795m6241
11766A006809n4341j5556Q4318m4333j38052k3031J49900n5759n3965j11906M8886
11755G92970J28443K0935J5972M5860Q1716q6077j14695k3041n9026j2310L9961
11744H30708J4319m9444j5254J00298j7324j23310r8317P8594P8358L3989j9231
11733H13386M260J0653L2831R93j64098j76858j6798R6440J5926k6803o3925j9495
$$ plain form
11721 506512 626773 759157 668322 472485 536316 607424 631932 706035 715406 766401 728653
11710 728653 778236 659714 443783 416408 337948 335186 426872 518853 453542 386682 431268
11699 431268 388678 347877 410780 611058 602024 459663 490894 470229 465656 425033 476360
11688 476360 353642 358556 455195 386343 214003 208732 181559 264152 372096 365537 415207
11677 415207 480936 486734 577129 489308 313889 401324 436455 473475 373211 368210 466085
11666 466085 584369 402903 439336 495382 433767 413565 422176 407188 366947 306287 231212
11655 231212 189888 108558 -3042 50293 230740 232166 157354 153816 161275 179107 142622 42314
11643 42314 5625 -2880 71494 179718 100679 81435 107484 257755 274949 323669 398118
$$ packed form
11721E06512J20261J32384r0835j95837O3831P1108K4508P4103R371N0995l7748
11710G28653M9583j18522k15931k7375p8460k762R1686R1981o5311o6860M4586
11699D31268m2590m0801O2903K00278r034j42361L1231k0665m573m0623N1327
11688D76360j22718M914R6639o8852j72340n271k7173Q2593J07944o559M9670
11677D15207O5729N798R0395q7821j75419Q7435L5131L7020j00264n001R7875
11666D66085J18284j81466L6433N6046o1615k0202Q611j4988m0241o0660p5075
11655B31212m1324q1330j11600N3335J80447J426p4812l538P459J7832l6485j00308
11643D2314l6689q505P4374J08224p9039j9244K6049J50271J7194M8720P4449
$$ plain form
11632 398118 368336 264659 214441 203447 146335 127181 135048 154357 235111 340897 330641
11621 330641 344866 393924 289868 241372 201049 73839 124706 339050 437636 416726 461900
11610 461900 431724 400933 384837 374515 223761 148725 145934 236051 209019 155754 -3217
11599 -3217 48168 226299 290511 342858 494022 562444 454061 376397 297410 257213 156322
11588 156322 175771 179749 166269 156965 207689 195883 254782 202453 193251 336592 246898 262411
11576 262411 259074 362411 296558 202759 240008 157217 76781 102056 124447 230586 337053
11565 337053 450963 362815 263194 320374 339145 328273 245982 172767 201935 203755 256463
11554 256463 338405 232145 173454 36901 90035 225815 196603 87640 176010 320133
$$ packed form
11632C98118k9782j03677n0218j0994n7112j9154P867J9309Q0754J05786j0256
11621C30641J4225M9058j04056m8496m0323j27210N0867K14344R8586k0910M5174
11610D61900l0176l0791j6096j0322j50754p5036k791R0117k7032n3265j58971
11599c217N1385J78131O4212N2347J51164O8422j08383p7664p8987m0197j00891
11588A56322J9449L978j3480r304N0724j1806N8899n2329r202J43341q9694J5513
11576B62411l337J03337o5853r3799L7249q2791q0436K5275K2391J06139J06467
11565C37053J13910q8148r9621N7180J8771j0872q2291p3215K9168J820N2708
11554B56463Q1942j06260n8691j36553N3134J35780k9212j08963Q8370J44123
$$ plain form
11544 320133 290114 238904 210125 230628 299345 250329 245885 199384 84582 169875 194852
11533 194852 219264 213772 112918 -79560 19988 28669 78539 170268 142510 196303 182390
11522 182390 105523 201422 260507 281412 175035 192571 334452 424408 373768 393712 387107
11511 387107 280939 176183 123850 90303 61590 -79035 -34349 64329 165338 185883 160109
11500 160109 157201 179520 277949 277491 273210 233445 229783 100633 71733 64640 -30500 -103989
11488 -103989 -99162 -67324 67578 17393 -160692 -69520 74335 166081 187196 157989 330781
11477 330781 338317 368187 179132 154711 276313 265363 211825 170628 167584 186465 141900
11466 141900 173729 223610 76307 168039 223215 210273 179986 43754 39653 16296 83864
$$ packed form
11544C20133l0019n1210k8779K0503O8717m9016m444m6501j14802Q5293K4977
11533A94852K4412n492j00854j92478R9548Q681M9870R1729k7758N3793j3913
11522A82390p6867R5899N9085K0905j06377J7536J41881Q9956n0640J9944o605
11511C87107j06168j04756n2333l3547k8713j40625M4686R8678J01009K0545k5774
11500A60109k908K2319R8429m58m281l9765l662j29150k8900p093r5140p3489
11488a03989M827L1838J34902n0185j78085R1172J43855R1746K1115k9207J72792
11477C30781P536K9870j89055k4421J21602j0950n3538m1197l044J8881m4565
11466A41900L1829M9881j47303R1732N5176j2942l0287j36232m101k3357O7568
$$ plain form
11455 83864 194033 119310 204761 267678 101495 17517 63405 30614 115425 140363 9077
11444 9077 55211 162598 248237 251301 220137 222665 223676 210488 162503 67611 122310 134902
11432 134902 160489 92165 114045 6676 126427 227226 49758 -1206 -163582 -304029
11422 -304029 -117554 70090 39097 65609 -14840 36530 28437 -156488 -122604 -50623 -144422
11411 -144422 -126872 18482 -28325 -46298 5740 7398 89525 223289 168287 115918 49531
11400 49531 191575 166968 99952 152685 171367 80906 42280 163 -108398 70534 123837
11389 123837 137243 127420 -44977 -38472 -37388 9971 129985 135649 117885 5591 -59138 -56267
11377 -56267 -109576 6204 21715 -5897 63953 151270 340429 369429 292637 332224 295510
$$ packed form
11455H3864J10169p4723Q5451O2917j66183q3978M5888l2791Q4811K4938j31286
11444I077M6134J07387Q5639L064l1164K528J011j3188m7985r4892N4699J2592
11432A34902K5587o8324K1880j07369J19751J00799j77468n0964j62376j40447
11422c04029J86475J87644l0993K6512q0449N1370q093j84925L3884P1981r3799
11411a44422J7550J45354m6807j7973N2038J658Q2127J33764n5002n2369o6387
11400D9531J42044k4607o7016N2733J8682r0461l8626m2117j08561J78932N3303
11389A23837J3406r823j72397O505J084M7359J20014N664j7764j12294o4729K871
11377e6267n3309J15780J5511k7612O9850Q7317J89159K9000p6792L9587l6714
$$ plain form
11366 295510 302401 295691 229570 214937 222470 322186 303937 217013 237113 219088 295210 309995
11354 309995 193164 118830 148741 98141 71809 71416 128397 202472 155577 121269 158286 21738
11342 21738 -96308 -153299 -195127 -234923 -183796 1611 -87170 -142660 -39182 143503 168312
11331 168312 100719 -90549 -195576 -104120 -82552 -191026 -272431 -198776 -71621 -74551 -178114
11320 -178114 -127841 -130955 6732 -80585 -157235 -226401 -161501 -41279 8416 126243 51257
11309 51257 -55511 16652 -42062 -208544 -138719 -53846 107988 140294 -66496 -131374 -259461
11298 -259461 -197363 -248788 -188511 -41057 96996 155770 193703 187247 235149 170653 227685
11287 227685 298157 136428 83744 24000 35655 128216 193132 198688 164096 100220 31743
$$ packed form
11366B95510O891o710o6121j4633P533R9716j8249q6924K0100j8025P6122J4785
11354C09995j16831p4334K9911n0600k6332l93N6981P4075m6895l4308L7017j36548
11342B1738j18046n6991m1828l9796N1127J85407q8781n5490J03478J82685K4809
11331A68312o7593j91268j05027R1456K1568j08474q1405P3655J27155k930j03563
11320a78114N0273l114J37687q7317p6650o9166O4900J20222M9695J17827p4986
11309E1257j06768P2163n8714j66482O9825Q4873J61834L2306k06790o4878j28087
11298b59461O2098n1425O0277J47454J38053N8774L7933o456M7902o4496N7032
11287B27685P0472j61729n2684n9744J1655R2561O4916N556l4592o3876o8477
$$ plain form
11276 31743 39355 183657 194354 -20840 -156489 -202796 -138817 -53953 -17565 189318 369368
11265 369368 416597 288414 204241 45582 -5064 61128 96199 27442 -62266 -760 109588
11254 109588 185992 174648 66679 15503 -36150 96610 14852 50490 128829 55177 -159530
11243 -159530 -72233 95506 83667 82459 -36414 -18808 137258 203509 228470 257905 325619
11232 325619 257595 201992 215554 131375 -90048 -231307 -50224 98861 185999 191759 143300
11221 143300 165746 143246 165017 47643 -82370 -79036 -119922 -122582 -125277 -96596 -37534 -81489
11209 -81489 -47417 -12730 43575 -9086 6993 -9389 32516 -10858 -21671 39375 -18927 -8986
11197 -8986 8588 11164 51381 26290 19875 38355 130519 208388 165073 171465 166966 78816 -8907
$$ packed form
11276C1743P612J44302J0697k15194j35649m6307O3979Q4864L6388K06883J80050
11265C69368M7229j28183q4173j58659n0646O6192L5071o8757q9708O1506J10348
11254A09588P6404j1344j07969n1176n1653J32760q1758L5638P8339p3652k14707
11243a59530Q7297J67739j1839j208j18873J7606J56066O6251K4961K9435O7714
11232C25619o8024n5603J3562q4179k21423j41259J81083J49085Q7138N760m8459
11221A43300K2446k2500K1771j17374j30013L334m0886k660k695K8681N9062m3955
11209h1489L4072L4687N6305n2661J6079j6382M1905m3374j0813O1046n8302R941
11197h986J7574K576M0217k5091o415J8480R2164P7869m3315O392m499q8150q7723
$$ plain form
11184 -8907 -152515 -259085 -131472 -100504 -17992 -15773 -10600 24920 97416 81226 130886 194197
11172 194197 274230 191509 111344 66936 -63004 -168379 -175323 -241956 -164549 -100656 -70885
11161 -70885 -37953 56970 65230 97717 50363 -61546 -29007 135384 177936 -16391 -233379
11150 -233379 -232900 -263948 -233361 -240221 -162832 44699 -55533 -201690 -244399 -106677 28541
11139 28541 257683 123296 241268 354973 239815 92649 -104178 -91281 -7697 -32479
11129 -32479 -52797 40737 -34793 15612 75770 44225 57963 19766 -25661 -4997 71484 125226
11117 125226 -24559 -162244 -157435 -52768 55589 -30893 -35836 64096 -1884 -90033 -136216
11106 -136216 -187364 -129580 -137095 -127917 -128074 -135087 -77697 -89941 -249268 -383396 -298673 -145759
$$ packed form
11184h907j43608j06570J27613L0968Q2512K219N173L5520P2496j6190M9660O3311
11172A94197Q0033q2721q0165m4408j29940j05375o944o6633P7407O3893K9771
11161g0885L2932R4923Q260L2487m7354j11909L2539J64391M2552j94327k16988
11150b33379M79l1048L0587o860P7389K07531j00232j46157m2709J37722J35218
11139B8541K29142j34387J17972J13705j15158j47166j96827J2897Q3584k4782
11129c2479k0318R3534p5530N0405O0158l1545J3738l8197m5427K0664P6481N3742
11117A25226j49785j37685M809J04667J08357q6482m943R9932o5980q8149m6183
11106a36216n1148N7784p515R178j57p013N7390j2244j59327j34128Q4723J52914
$$ plain form
11094 -145759 -100867 -6137 -46085 -38907 60161 11257 -145579 -215680 -137606 -106248 -203191
11083 -203191 -314891 -284366 -264076 -180048 -112169 -87311 -18128 -6823 86850 73492 18329
11072 18329 55523 102032 -6056 -128607 -91979 -14379 31446 25751 -37410 -45245 -34319 -53879
11060 -53879 -88694 26810 17568 -56139 -62163 -100730 -161726 -190524 -133352 -154529 -110632 18857
11048 18857 137389 371921 453603 582264 779070 706226 674545 576771 517170 508181 414117
11037 414117 647679 809887 1048984 1240896 1134529 1033715 997391 1033721 1022214 952174
11027 952174 907546 901499 1101262 1458624 1760138 1997842 2038295 1801964 1481623 1172009
11017 1172009 1018016 983965 1033692 1077672 1012382 1092928 1271398 1446662 1445312 1316841 1152574
$$ packed form
11094a45759M4892R4730l9948P178R9068m8904j56836p0101P8074L1358r6943
11083b03191j11700L0525K0290Q4028O7879K4858O9183J1305R3673j3358n5163
11072A8329L7194M6509j08088j22551L6628P7600M5825n695o3161p835J0926j9560
11060e3879l4815J15504r242p3707o024l8567o0996k8798N7172k1177M3897J29489
11048A8857J18532K34532Q1682J28661J96806p2844l1681r7774n9601q989r4064
11037D14117K33562J62208K39097J91912j06367j00814l6324L6330j1507p0040
11027I52174m4628o047J99763L57362L01514K37704M0453k36331l20341l09614
11017A172009j53993l4051M9727M3980o5290Q0546J78470J75264j350j28471j64267
$$ plain form
11006 1152574 1016140 843801 759242 847728 867857 783361 723371 666347 622820 576565 495092
10995 495092 460499 368798 195740 164138 170720 145443 138895 185597 254546 227436 153951 -24913
10983 -24913 -172373 -86074 3423 35073 -15225 -138753 -178676 -279332 -242391 -100011 -106867
10972 -106867 -92321 -89110 -151927 -20020 28311 -104220 -118239 -17541 -73304 -296050 -232984
10961 -232984 -175375 -216829 -250139 -238762 -70298 -85893 -66231 -114593 -19749 58780 12763
10950 12763 -18855 -112639 -249775 -104177 -174793 -282060 -337395 -243344 -180291 -174303 -173740 -140133
10938 -140133 -121768 -84674 -10168 37687 78097 7793 61069 38103 13394 64879 203545
10927 203545 216827 123802 17663 -77656 -93092 -8571 -23870 -47048 146247 174104 -82093
$$ packed form
11006A152574j36434j72339q4559Q8486K0129q4496n9990n7024m3527m6255q1473
10995D95092l4593r1701j73058l1602O582k5277o548M6702O8949k7110p3485j78864
10983b4913j47460Q6299Q9497L1650n0298j23528l9923j00656L6941J42380o856
10972a06867J4546L211o2817J31907M8331j32531j4019J00698n5763k22746O3066
10961b32984N7609m1454l3310J1377J68464j5595J9662m8362R4844P8529m6017
10950A2763l1618r3784j37136J45598p0616j07267n5335R4051O3053N988N63L3607
10938a40133J8365L7094P4506M7855M0410p0304N3276k2966k4709N1485J38666
10927B03545J3282r3025j06139r5319j5436Q4521j5299k3178J93295K7857k56197
$$ plain form
10916 -82093 -324856 -377651 -357994 -356705 -351389 -217774 -223846 -330072 -67447 80842 93073
10905 93073 605 -201974 -188674 -143988 -106564 -143189 -181056 -198728 -105917 -15705 -89279
10894 -89279 -176094 -139848 -114263 -14346 19139 147271 86607 70974 12739 34530 -49191
10883 -49191 -30782 15643 -84097 -150146 -47136 125779 65104 7257 20202 31287 66456
10872 66456 29166 12621 18610 -24677 86598 189469 146524 159762 129345 54412 24676
10861 24676 215223 298308 272079 226399 255458 240664 291207 365882 318619 362729 315063
10850 315063 111457 172598 236095 112937 127336 219957 207410 273863 306718 201770 76149
10839 76149 -63969 -231245 -200203 -20591 106085 166482 143411 164596 60089 -39006 101725
$$ packed form
10916h2093k42763n2795J9657J289N316J33615o072j06226K62625J48289J2231
10905I3073r2468k02579J3300M4686L7424l6625l7867j7672R2811R0212p3574
10894h9279q6815L6246K5585R9917L3485J28132o0664j5633n8235K1791q3721
10883d9191J8409M6425r9740o6049J03010J72915o0675n7847J2945J1085L5169
10872F6456l7290j6545N989m3287J11275J02871m2945J3238l0417p4933k9736
10861B4676J90547Q3085k6229m5680K9059j4794N0543P4675m7263M4110m7666
10850C15063k03606O1141O3497j23158J4399R2621j2547O6453L2855j04948j25621
10839G6149j40118j67276L1042J79612J26676O0397k3071K1185j04507r9095J40731
$$ plain form
10828 101725 211346 114994 6250 123226 216788 207785 116927 160800 33172 -55083 -4120
10817 -4120 -28080 72960 106300 180787 35312 -25212 -8648 -106499 -152351 -295427 -168067
10806 -168067 -75786 -146658 -202146 -185112 -9224 209415 59893 43432 16707 40059 -56079
10795 -56079 -99055 -31620 -40827 -92023 -93204 17218 43080 132622 52408 -45235 -116595 -110166
10783 -110166 119872 234861 210474 151524 157752 255822 268024 200664 195961 117954 12453
10772 12453 41461 60867 -44787 -93647 -19871 -67565 -158802 -12679 201604 165903 208723
10761 208723 138500 114005 -28546 -165357 -140033 -62436 898 137242 238093 112167
10751 112167 -64867 -71280 11074 -8701 59804 66477 26970 66098 92766 166402 170791 126821
$$ packed form
10828A01725J09621r6352j08744J16976R3562r003r0858M3873j27628q8255N0963
10817d120k3960J01040L3340P4487j45475o0524J6564r7851m5852j43076J27360
10806a68067R2281p0872n5488J7034J75888K18639j49522j6461k6725K3352r6138
10795e6079m2976O7435r207n1196j181J10422K5862Q9542q0214r7643p1360O429
10783a10166K30038J14989k4387n8950O228R8070J2202o7360m703p8007j05501
10772A2453K9008J9406j05654m8860P3776m7694r1237J46123K14283l5701M2820
10761B08723p0223k4495j42551j36811K5324P7597O3334J36344J00851j25926
10751A12167j77034o413Q2354j9775O8505O673l9507L9128K6668P3636M389m3970
$$ plain form
10739 126821 167328 84042 -27182 17845 148376 151791 172436 192402 229542 249585 205103
10728 205103 113992 114545 103486 145683 337594 360052 299359 399506 435552 501605 654214
10717 654214 741929 695942 679280 629416 601307 577911 547982 510539 433954 355247 368763
10706 368763 513388 487479 434663 383821 376043 311282 312276 396188 494608 570446 526910 597248
10694 597248 780901 780564 822777 763644 759382 759170 663827 565904 459714 493700 484007 455390
10682 455390 554531 555471 570498 587786 661077 616467 425429 361452 257980 341847 452223
10671 452223 603333 633149 624678 567265 591793 568401 720786 795709 813207 828891 1028634
10660 1028634 1251744 1228096 1215521 1353428 1526096 1868073 2163231 2488150 2635793 2727060
$$ packed form
10739A26821M0507q3286j11224M5027J30531L415K0645J9966L7140K0043m4482
10728B05103r1111N53j1059M2197J91911K2458o0693J00147L6046O6053J52609
10717F54214Q7715m5987j6662m9864k8109k3396k9929l7443p6585p8707J3516
10706C68763J44625k5909n2816n0842p778o4761R94Q3912R8420P5838m3536P0338
10694E97248J83653l37M2213n9133m262k12r5343r7923j06190L3986r693k8617
10682D55390R9141R40J5027J7288P3291m4610j91038o3977j03472Q3867J10376
10671D52223J51110K9816q471n7413K4528k3392J52385P4923J7498J5684J99743
10660A028634K23110k3648j2575J37907J72668L41977K95158L24919J47643R1267
$$ plain form
10650 2727060 2958080 3026220 3030894 2916222 2711616 2626242 2593360 2697590 2728810 2804242 3037592
10639 3037592 3366918 3898006 4539293 5299643 6365466 7674317 8872719 9856718 10447874
10630 10447874 10768386 11267285 11819783 12513046 13748442 15696838 18316818 21871539 26851281
10621 26851281 33510669 41779809 52184291 65355295 80388658 94498024 104545533
10614 104545533 109352986 109565339 107252702 104887058 105090263 109827070 120293800 137913272
10606 137913272 163429576 193576467 220307277 235371937 236413846 226442261 211060198
10599 211060198 196128933 186957198 186709459 197182275 219347807 252490862 290495733
10592 290495733 320537246 331349113 321383870 296446725 263969204 232478869 208604791
$$ packed form
10650B727060K31020O8140M674j14672k04606q5374l2882J04230L1220P5432K33350
10639C037592L29326N31088O41287P60350J065823J308851J198402R83999N91156
10630A0447874L20512M98899N52498O93263J235396J948396K619980L554721M979742
10621B6851281O659388Q269140J0404482J3171004J5033363J4109366J0047509
10614A04545533M807453K12353k312637k365644K03205M736807J0466730J7619472
10606A37913272K5516304L0146891K6730810J5064660J041909r971585j5382063
10599B11060198j4931265r171735k47739J0472816K2165532L3143055L8004871
10592B90495733L0041513J0811867r965243k4937145l2477521l1490335k3874078
$$ plain form
10585 208604791 194988713 192110015 199293442 214763241 233009734 245051569 243789376
10578 243789376 229079131 205230385 177758231 152331125 132615480 119977921 113798732
10571 113798732 112957333 115548329 118735977 119045353 114052176 104071630 90642319 75841373
10563 75841373 61940551 50444569 41472326 34568455 29373991 25458117 22424307 20034800
10555 20034800 18199238 16463330 14909548 13558160 12488993 11437682 10455971 9682313
10547 9682313 9050431 8471543 7954023 7476391 7084716 6652193 6373921 6036109 5605054
10538 5605054 5120906 4856717 4581485 4129392 3871587 3809527 3739714 3655723 3540372 3301672
10528 3301672 3172492 3061981 2893400 2688765 2625002 2674043 2512318 2354697 2186575 1966254
$$ packed form
10585B08604791j3616078k878698P183427J5469799J8246493J2041835j262193
10578B43789376j4710245k3848746k7472154k5427106j9715645j2637559o179189
10571A13798732q41399K590996L187648L09376m993177r980546j3429311j4800946
10563G5841373j3900822j1495982q972243o903871n194464l915874l033810k389507
10555B0034800j835562j735908j553782j351388j069167j051311r81711p73658
10547I682313o31882n78888n17520m77632l91675m32523k78272l37812m31055
10538E605054m84148k64189k75232m52093k57805o2060o9813q3991j15351k38700
10528C301672j29180j10511j68581k04635o3763M9041j61725j57621j68122k20321
$$ plain form
10518 1966254 1780818 1744672 1654881 1541709 1425342 1470383 1434005 1334850 1291065 1206391 1340690
10507 1340690 1347679 1265006 1257484 1353387 1229160 1111498 1173919 1187629 1150822 1075127 986417
10496 986417 931583 848259 773715 819065 773462 770670 708408 694985 698246 747876 689777 727736
10484 727736 669320 452343 427911 352694 372922 323316 226414 308889 376035 325560 402008
10473 402008 498499 527061 531954 438238 400924 308715 268701 322169 366030 498479 564481
10462 564481 438146 436515 414168 517938 643504 673310 685424 744118 708963 715559 656227
10451 656227 721540 773811 751858 555030 508111 571315 458681 483581 358540 343446 477969
10440 477969 468214 374117 417991 535002 616470 675828 643826 624899 558338 437064 355915
$$ packed form
10518A966254j85436l6146q9791j13172j16367M5041l6378r9155m3785q4674J34299
10507A340690O989q2673p522R5903j24227j17662O2421J3710l6807p5695q8710
10496I86417n4834q3324p4544M5350m5603k792o2262j3423L261M9630n8099L7959
10484G27736n8416k16977k4432p5217K0228m9606r6902Q2475O7146n0475P6448
10473D02008R6491K8562M893r3716l7314r2209m0014N3468M3861J32449O6002
10462E64481j26335j631k2347J03770J25566K9806J2114N8694l5155O596n9332
10451F56227O5313N2271k1953j96828m6919O3204j12634K4900j25041j5094J34523
10440D77969r755r4097M3874J17011Q1468N9358l2002j8927o6561j21274q1149
$$ plain form
10429 355915 417791 312934 333224 328645 239922 361474 399983 476472 391896 307830 226923
10418 226923 356075 428520 373468 425136 558901 484827 395991 506402 506880 408447 376828
10407 376828 217841 50506 217328 326028 249567 425209 466868 482365 425114 317354
10397 317354 344113 468286 384690 263375 349420 477701 479079 406312 414198 424245 445242
10386 445242 320913 192573 334228 419009 412830 553073 502270 513946 552905 439487 454815
10375 454815 445028 421726 362884 378020 439859 466716 368345 342979 353661 404065 540642
10364 540642 522540 301162 318142 395747 402876 405589 383876 309125 239403 204702 197677 272728
10352 272728 363264 457006 446821 311457 257998 303570 379261 304722 315035 319910 393908
$$ packed form
10429C55915O1876j04857K0290m579q8723J21552L8509P6489q4576q4066q0907
10418B26923J29152P2445n5052N1668J33765p4074q8836J10411M78r8433l1619
10407C76828j58987j67335J66822J08700p6461J75642M1659J5497n7251j07760
10397C17354K6759J24173q3596j21315Q6045J28281J378p2767P886J0047K0997
10386D45242j24329j28340J41655Q4781o179J40243n0803J1676L8959j13418J5328
10375D54815r787k3302n8842J5136O1839K6857r8371k5366J0682N0404J36577
10364E40642j8102k21378J6980P7605P129K713k1713p4751o9722l4701p025P5051
10352B72728R0536R3742j0185j35364n3459M5572P5691p4539J0313M875P3998
$$ plain form
10341 393908 453307 317659 400865 334328 168630 17065 22216 -67827 74361 149837 167201
10330 167201 96540 -4334 62838 45412 63628 137484 69247 -16610 -39253 73111 112138
10319 112138 305598 239868 177092 178867 161967 63551 57259 192887 214427 209097 175583 124331
10307 124331 140746 224967 147571 196400 201485 105394 -50237 -84792 -80091 83549 99860
10296 99860 63465 93532 179868 205713 175500 120472 83402 105449 102402 247429 294669 261347
10284 261347 239167 189457 172020 131578 178868 227911 195408 148172 201592 255700 331306
10273 331306 259248 308916 210922 131405 206989 234552 228865 326805 387027 283784 297147
10262 297147 426971 468767 326210 303273 314481 261022 79115 18254 103832 264316 333607
$$ packed form
10341C93908N9399j35648Q3206o6537j65698j51565N151r0043J42188P5476J7364
10330A67201p0661j00874O7172j7426J8216P3856o8237q5857k2643J12364L9027
10319A12138J93460o5730o2776J775j6900r8416o292J35628K1540n330l3514n1252
10307A24331J6415Q4221p7396M8829N085r6091j55631l4555M701J63640J6311
10296I9860l6395L0067Q6336K5845l0213n5028l7070K2047l047J45027M7240l3322
10284B61347k2180m9710j7437m0442M7290M9043l2503m7236N3420N4108P5606
10273C31306p2058M9668r7994p9517P5584K7563n687R7940O0222j03243J3363
10262B97147J29824M1796j42557k2937J1208n3459j81907o0861Q5578J60484O9291
$$ plain form
10251 333607 303895 329473 347863 275556 235855 116376 112629 183976 180055 211660 185242 232265
10239 232265 218187 150026 240806 200884 194354 261595 295095 359707 297265 324524 359320 336386
10227 336386 264875 188356 117915 195724 206008 106953 125366 207134 131338 -610 15742
10216 15742 43279 107483 96606 -10131 32217 131820 297709 260976 226835 -10370 -27381
10205 -27381 139141 259562 371312 315057 220439 230956 268972 364201 326170 304255 350495
10194 350495 436805 401530 291529 266061 317005 351467 337249 196360 75909 33680 49662
10183 49662 101971 331379 437803 442285 512622 630063 893616 881881 729828 777976 740275
10172 740275 708516 736921 947249 1242936 1487833 1509387 1524888 1605628 1529492 1321207 1192184
$$ packed form
10251C33607k9712K5578J8390p2307l9701j19479l747P1347l921L1605k6418M7023
10239B32265j4078o8161R0780l9922o530O7241L3500O4612o2442K7259L4796k2934
10227C36386p1511p6519p0441P7809J0284r9055J8413Q1768p5796j31948J6352
10216A5742K7537O4204j0877j06737M2348R9603J65889l6733l4141k37205j7011
10205b7381J66522J20421J11750n6255r4618J0517L8016R5229l8031k1915M6240
10194C50495Q6310l5275j10001k5468N0944L4462j4218j40889j20451m2229J5982
10183D9662N2309K29408J06424M482P0337J17441K63553j1735j52053M8148l7701
10172G40275l1759K8405K10328K95687K44897K1554J5501Q0740p6136k08285j29023
$$ plain form
10161 1192184 1183898 1198146 1243012 1283493 1465234 1630828 1706961 1861576 1715830 1608121
10151 1608121 1618882 1547020 1430855 1307190 1261872 1266291 1185218 1234858 1310166 1268876 1162376
10140 1162376 1047188 873539 728116 665266 713760 653848 701428 881809 918167 971617
10130 971617 887751 790075 575186 483239 423133 464861 459734 271013 196932 259283 299728
10119 299728 382311 311100 207895 5936 -10457 35646 226313 164724 113961 108471 111166
10108 111166 226146 300732 326817 215407 157949 35093 46313 103185 65975 98910 67853
10097 67853 147369 117501 97035 -14102 44174 125112 8820 -33907 -30284 48747 120318
10086 120318 80080 -30127 -526 -44250 -3359 25152 60136 71207 94596 192324 127937
$$ packed form
10161A192184q286J4248M4866M0481J81741J65594P6133J54615j45746j07709
10151A608121J0761p1862j16165j23665m5318M419q1073M9640P5308m1290j06500
10140A162376j15188j73649j45423o2850M8494n9912M7580J80381L6358N3450
10130I71617q3866r7676k14889r1947o0106M1728n127j88721p4081O2351M0445
10119B99728Q2583p1211j03205k01959j6393M6103J90667o1589n0763n490K695
10108A11166J14980P4586K6085j11410n7458j22856J1220N6872l7210L2935l1057
10097F7853P9516k9868k0466j11137N8276Q0938j16292m2727L623P9031P1571
10086A20318m0238j10207K9601m3724M0891K8511L4984J1071K3389R7728o4387
$$ plain form
10075 127937 93860 54185 -56138 -62599 103288 182741 75513 75106 204333 199852 206269 191493
10063 191493 204649 96625 124876 225320 276667 290810 195695 166644 247494 205351 100958
10052 100958 110139 128171 98321 231182 137303 34195 147213 83501 -31362 -176266 -120613
10041 -120613 74644 150490 66170 103995 142613 24112 -120012 -118943 98839 118860 239286
10030 239286 287896 192814 101348 176833 223073 156223 189534 135358 136433 178088 112508 -29535
10018 -29535 -61400 -21301 53301 -924 -43863 40371 -62386 -198135 -166462 -108774 -11853
10007 -11853 -26201 13784 13557 -13725 11807 -157766 -231809 -218137 -118991 -65766 8525 9865
9995 9865 -76720 15396 27295 -70595 -112325 -179024 -65112 6411 37924 45871 57904 81878
$$ packed form
10075A27937l4077l9675j10323o461J65887P9453j07228m07J29227m481O417j4776
10063A91493J3156j08024K8251J00444N1347J4143r5115k9051Q0850m2143j04393
10052A00958R181J8032k9850J32861r3879j03108J13018o3712j14863j44904N5653
10041a20613J95257P5846q4320L7825L8618j18501j44124J069K17782K0021J20426
10030B39286M8610r5082r1466P5485M6240o6850L3311n4176J075M1655o5580j42043
10018b9535l1865M0099P4602n4225m2939Q4234j02757j35749L1673N7688R6921
10007a1853j4348L9985k27k7282K5532j69573p4043J3672R9146N3225P4291J340
9995I865q6585R2116J1899r7890m1730o6699J13912P1523L1513P947J2033K3974
$$ plain form
9983 81878 76097 84027 87658 174779 347976 275601 138275 145624 15325 -9431 74506 76426
9971 76426 111730 8261 29877 97628 64031 -48772 -35103 -103699 -259795 -299014 -241390
9960 -241390 -209678 -42013 -45102 -9754 -86535 -31881 98639 98973 22577 -54027 -105039 -83946
9948 -83946 -42901 -10226 54267 82630 219040 288962 298784 186423 167765 103389 54866 102694
9936 102694 82127 31730 176458 261283 325396 338888 311315 316686 282055 232837 223801 274854
9924 274854 287483 310507 207448 133278 118790 152538 172068 83741 -44532 -79841 -96304
9913 -96304 -83240 66306 3686 -110387 -51260 136556 180838 136460 100247 37788 -94484
9902 -94484 26912 20937 -19531 -69856 -16230 134702 77846 -18808 -118730 41740 -19631
$$ packed form
9983H1878n781P930L631Q7121J73197p2375j37326P349j30299k4756Q3937J920
9971G6426L5304j03469K1616O7751l3597j12803J3669o8596j56096l9219N7624
9960b41390L1712J67665l089L5348p6781N4654J30520L34p6396p6604n1012K1093
9948h3946M1045L2675O4493K8363J36410O9922R822j12361j8658o4376m8523M7828
9936A02694k0567n0397J44728Q4825O4113J3492k7573N371l4631m9218r036N1053
9924B74854J2629K3024j03059p4170j4488L3748J9530q8327j28273l5309j6463
9913i6304J3064J49546o2620j14073N9127J87816M4282m4378l6213o2459j32272
9902i4484J21396n975m0468n0325N3626J50932n6856r6654r9922J60470o1371
$$ plain form
9891 -19631 -106657 1294 -23182 159671 134324 3615 -101592 -61236 -102190 65317 192668
9880 192668 178378 81489 103665 -20430 22981 158118 114225 99160 102578 148861 181569
9869 181569 245912 195817 211647 210337 126998 175327 132266 19148 -41893 -47467 -78723 -162971
9857 -162971 -96484 -104326 -181124 -111505 -81064 -19854 48671 71725 185994 191788 65454 96633
9845 96633 95643 85294 187002 110152 73550 144672 103741 -32149 -51843 -64457 -99635 -14020
9833 -14020 8355 -48123 9625 48022 94117 113547 94636 141455 109262 141704 219205 195101
9821 195101 51941 -13756 -29913 -161004 -102184 -8850 -14132 122989 224333 161204 57428
9810 57428 -56422 -103757 -44885 -79081 48379 123938 131638 79653 41146 935 89040 190494
$$ packed form
9891a9631q7026J07951k4476J82853k5347j30709j05207M0356m0954J67507J27351
9880A92668j4290r6889K2176j24095M3411J35137m3893j5065L418M6283L2708
9869A81569O4343n0095J5830j310q3339M8329m3061j13118o1041n574l1256q4248
9857a62971O6487p842p6798O9619L0441O1210O8525K3054J14269N794j26334L1179
9845I6633r90j0349J01708p6850l6602P1122m0931j35890j9694j2614l5178Q5615
9833a4020K2375n6478N7748L8397M6095J9430j8911M6819l2193L2442P7501k4104
9821A95101j43160o5697j6157j31091N8820R3334n282J37121J01344o3129j03776
9810E7428j13850m7335N8872l4196J27460P5559P700n1985l8507m0211Q8105J01454
$$ plain form
9798 190494 179423 69741 -66334 -29330 -43977 -149224 -281867 -297428 -306178 -95051 -12338
9787 -12338 -4040 -59582 -78904 -20359 -83212 -185761 -136054 -113246 -126577 -35353 61648 119409
9775 119409 87444 -76095 -123336 -25870 18160 22604 -26521 31308 95161 82141 30011 -72057
9763 -72057 -95224 -43344 10687 -68757 -52668 39314 82237 61191 -66590 -170071 -32960
9752 -32960 193099 287798 353906 273978 164008 -4806 -36184 49902 -61554 -127948 -155031
9741 -155031 -145897 -73088 -26651 32473 65274 45005 -4553 176537 265910 159363 148795
9730 148795 276870 245081 137127 27707 12363 69940 202743 322309 247951 298536 317172
9719 317172 141743 -73677 -292393 -308217 -251641 -117191 -38461 39813 -82502 43622
$$ packed form
9798A90494j1071j09682j36075L7004j4647j05247j32643j5561q750K11127Q2713
9787a2338Q298n5542j9322N8545o2853j02549M9707K2808j3331R1224R7001N7761
9775A19409l1965j63539m7241R7466M4030M444m9125N7829O3853j3020n2130j02068
9763g2057k3167N1880N4031p9444J6089R1982M2923k1046j27781j03481J37111
9752c2960K26059R4699O6108p9928j09970j68814l1378Q6086j11456o6394k7083
9741a55031R134P2809M6437N9124L2801k0269m9558J81090Q9373j06547j0568
9730A48795J28075l1789j07954j09420j5344N7577J32803J19566p4358N0585J8636
9719C17172j75429k15420k18716j5824N6576J34450P8730P8274j22315J26124
$$ plain form
9709 43622 166203 118734 50660 -63089 -196246 -277574 -398890 -249294 -171249 -82776 49379
9698 49379 -57776 -300898 -250354 -213424 -156537 133012 266306 247837 183985 57797 77677
9687 77677 -38000 -118290 -122896 -125890 -123916 -201408 -277145 -196135 -70495 45164 80460 11803
9675 11803 -59478 -42057 -6539 -92247 -224296 -209936 -153530 -127610 -186460 -162688 -75468 75537
9663 75537 207331 122235 102506 130843 42974 -11828 141572 290973 423868 569835 790033
9652 790033 1133606 1281388 1131836 854311 768820 556102 219451 168864 187720 132332
9642 132332 178264 313519 378329 353550 327132 326118 200425 -3174 748 -22355 -35629
9631 -35629 -63174 -32576 -38165 38664 95466 122190 98167 79482 90354 -89238 -131250 -117403
$$ packed form
9709D3622J22581m7469o8074j13749j33157q1328j21316J49596P8045Q8473J32155
9698D9379j07155k43122N0544L6930N6887K89549J33294j8469o3852j26188J9880
9687G7677j15677q0290m606k994J974p7492p5737Q1010J25640J15659L5296o8657
9675A1803p1281J7421L5518q5708j32049J4360N6406K5920n8850K3772Q7220J51005
9663G5537J31794q5096j9729K8337q7869n4802J53400J49401J32895J45967K20198
9652G90033L43573J47782j49552k77525q5491k12718l36651n0587J8856n5388
9642A32332M5932J35255O4810k4779k6418j014j25693k03599L922k3103j3274
9631c5629k7545L0598n589P6829N6802K6724k4023j8685J0872j79592m2012J3847
$$ plain form
9619 -117403 81621 149899 129688 140433 189222 144446 44628 39466 111904 194347 268673 230118
9607 230118 130986 37181 81505 -3367 -98825 -44444 -30243 1213 -680 -32646 49975 141323
9595 141323 130941 79439 -65099 -34087 2261 -47617 -78779 40715 94960 107657 112546
9584 112546 119296 47567 145203 205995 197930 153170 118015 72239 110787 161655 79189 116460
9572 116460 179368 254063 154323 250060 387866 232171 85358 46398 -130602 -299188 -276596
9561 -276596 -337449 -401612 -304190 -217384 -238664 -221647 -132434 -207337 -195723 -85714 -17634
9550 -17634 -88122 -57066 21635 155237 173384 147138 183894 117033 3712 -43390 -81977
9539 -81977 -104437 -44952 81154 122125 152237 139245 150446 146795 100475 99266 105193 106920
$$ packed form
9619a17403J99024O8278k0211J0745M8789m4776r9818n162P2438Q2443P4326l8555
9607B30118r9132r3805M4324q4872r5458N4381J4201L1456j893l1966Q2621R1348
9595A41323j0382n1502j44538L1012L6348m9878l1162J19494N4245J2697M889
9584A12546O750p1729R7636O0792q065m4760l5155m5776L8548N0868q2466L7271
9572A16460O2908P4695r9740R5737J37806j55695j46813l8960j77000j68586K2592
9561b76596o0853o4163R7422Q6806k1280J7017Q9213p4903J1614J10009O8080
9550a7634p0488L1056P8701J33602J8147k6246L6756o6861j13321m7102l8587
9539h1977k2460N9485J26106M0971L0112j2992J1201l651m6320j209N927J727
$$ plain form
9527 106920 24153 34763 145052 178033 87804 143961 58613 103193 124753 173885 223388
9516 223388 266796 115135 -30819 -86631 -168593 -164156 -238790 -111959 62897 73970 -76805
9505 -76805 -23716 -43844 133451 168584 167005 167618 174440 132398 36860 52602 60162 126307 119473
9492 119473 207392 280582 77077 -71910 -3992 86679 107008 100601 41593 84269 52623
9481 52623 117742 63129 12510 87168 125951 131248 101960 126813 57245 82082 28936 -142983
9469 -142983 -130002 71470 105088 -70670 6111 117276 -21304 -28128 -2741 92471 195437
9458 195437 382228 251582 77613 161883 23438 -122944 5081 47205 73535 45998
9448 45998 22830 48312 -40559 1454 63575 196262 248407 146922 37663 29270 195935
$$ packed form
9527A06920q2767J0610J10289L2981r0229N6157q5348M4580K1560M9132M9503
9516B23388M3408j51661j45954n5812q1962M437p4634J26831J74856J1073j50775
9505g6805N3089k0128J77295L5133j579O13O822m2042r5538J5742P560O6145o834
9492A19473Q7919P3190k03505j48987O7918R0671K0329o407n9008M2676l1646
9481E2623O5119n4613n0619P4658L8783N297k9288K4853o9568K4837n3146j71919
9469a42983J2981K01472L3618j75758P6781J11165j38580o824K5387R5212J02966
9458A95437J86791j30646j73969Q4270j38445j46382J28025M2124K6330k7537
9448D5998k3168K5482q8871M2013O2121J32687N2145j01485j09259q393J66665
$$ plain form
9437 195935 220955 136947 58655 -103052 -200076 -82230 142961 122169 -25891 -39588 30395
9426 30395 36171 -87374 -3548 33179 -16798 21468 110552 105014 166882 140768 -11476 -76662
9414 -76662 -68486 -86340 -13157 108891 217589 107063 98267 240721 45171 20335 180445
9403 180445 226483 148607 67881 44806 -4273 43065 54300 -50770 -63544 -46761 -42270 -23097
9391 -23097 -28467 -168496 -194271 -114102 -94823 -136386 -31602 -34088 -2498 128907 142455 58869
9379 58869 75962 106641 82330 72368 35468 -11881 32261 26669 -16489 122167 89062 -60400
9367 -60400 -27375 96873 146929 -25668 -53485 -80322 -111863 28161 171786 215039 130663
9356 130663 73556 26181 66332 7176 -54817 -108276 -77538 -120239 -258437 -154683 -38396
$$ packed form
9437A95935K5020q4008p8292j61707r7024J17846K25191k0792j48060j3697O9983
9426C0395N776j23545Q3826L6727m9977L8266Q9084n538O1868k6114j52244o5186
9414g6662Q176j7854P3183J22048J08698j10526q796J42454j95550k4836J60110
9403A80445M6038p7876q0726k3075m9079M7338J1235j05070j2774J6783M491J9173
9391b3097n370j40029k5775Q0169J9279m1563J04784k486L1590J31405J3548q3586
9379E8869J7093L0679k4311r962l6900m7349M4142n592m3158J38656l3105j49462
9367f0400L3025J24248N0056j72597k7817k6837l1541J40024J43625M3253q4376
9356A30663n7107m7375M0151n9156o1993n3459L0738m2701j38198J03754J16287
$$ plain form
9345 -38396 108951 85767 -1754 71125 63905 105299 84878 187519 318872 308222 175038
9334 175038 59948 123498 145203 35512 -3814 77278 56130 92897 116436 28115 -19800
9323 -19800 -99003 -130728 -69472 30159 81104 177535 26439 -259001 -360965 -266643 -103504
9312 -103504 -52228 -108516 -169450 -147708 -8241 -3374 113728 126443 90148 -10217 -97226
9301 -97226 -36746 21222 10728 58687 123925 69242 -4103 57629 164778 150392 90642 60666
9289 60666 93835 87639 130149 192956 133579 4650 -39238 -82910 -36861 -27379 -32166 7452
9277 7452 65696 90801 20692 84999 207807 152565 106562 125167 130755 108891 153328 24697
9265 24697 -53408 -7993 -15552 -19961 48476 187423 255622 81640 56367 37161 -2252 -3945
$$ packed form
9345c8396J47347k3184q7521P2879p220M1394k0421J02641J31353j0650j33184
9334A75038j15090O3550K1705j09691l9326Q1092k1148L6767K3539q8321m7915
9323a9800p9203l1725O1256R9631N0945R6431j51096k85440j01964R4322J63139
9312a03504N1276n6288o0934K1742J39467M867J17102J2715l6295j00365q7009
9301i7226O0480N7968j0494M7959O5238n4683p3345O1732J07149j4386n9750k9976
9289F0666L3169o196M2510O2807n9377j28929m3888m3672M6049R482m787L9618
9277G452N8244K5105p0109O4307J22808n5242m6003J8605N588k1864M4437j28631
9265B4697p8105M5415p559m409O8437J38947O8199j73982k5273j9206l9413j693
$$ plain form
9253 -3945 -6226 -649 108083 240398 396733 361269 178742 -82695 -81119 -146443 -192466 -65933
9241 -65933 120571 232027 173815 208608 179943 196742 356274 314859 185194 123051 63871
9230 63871 51354 1973 102390 118676 50284 81462 125708 50471 -65798 -119683 -103757
9219 -103757 -68052 -219057 -124777 -149677 -93789 -74289 17344 156862 198643 113756 3328
9208 3328 124197 60227 66168 147317 112223 13017 -7801 5238 28758 68404 160809 123071
9196 123071 156526 16227 97419 333719 288070 146600 -1790 -43237 -77004 22143 135128
9185 135128 232641 246206 255620 241629 150202 123314 35191 100407 185253 183380 94348 -62699
9173 -62699 8654 13289 14686 46663 154973 -45257 -217305 -173784 -107456 -38934 72647
$$ packed form
9253c945k281N577J08732J32315J56335l5464j82527k61437J576o5324m6023J26533
9241f5933J86504J11456n8212L4793k8665J6799J59532m1415j29665o2143n9180
9230F3871j2517m9381J00417J6286o8392L1178M4246p5237j16269n3885J5926
9219a03757L5705j51005R4280k4900N5888J9500R1633J39518M1781q4887j10428
9208C328J20869o3970N941Q1149l5094r9206k0818J3039K3520L9646R2405l7738
9196A23071L3455j40299Q1192K36300m5649j41470j48390m1447l3767R9147J12985
9185A35128R7513J3565R414j3991r1427k6888q8123O5216Q4846j873q9032j57047
9173f2699P1353M635J397L1977J08310k00230j72048M3521O6328O8522J11581
$$ plain form
9162 72647 116064 24832 201488 307648 386081 300448 211590 75966 97187 7344 -41241
9151 -41241 22211 16817 143536 103644 107103 146679 116511 -3971 -24794 90221 129587 24723
9139 24723 -90938 -41202 208940 195300 80463 -19846 -38502 15137 172514 158843 77511
9128 77511 43050 93935 96192 60085 -24615 26628 116117 84575 113682 80376 16585 29588
9116 29588 -81352 -170391 -206723 -130699 -123607 -163647 -149189 -28098 1433 -14243 -124604
9105 -124604 -162101 -155821 -155792 -296302 -200667 -118588 -40706 33631 -8449 -96636 -128679 -117360
9093 -117360 -120100 -150277 -149137 -62215 82301 73386 -99325 -177750 -109988 -69394 58515 55455
9081 55455 -94475 -153025 -40710 34606 44095 81423 109676 49853 35268 -80821 -79476 -35096
$$ packed form
9162G2647M3417r1232J76656J06160P8433q5633q8858j35624K1221q9843m8585
9151d1241O3452n394J26719l9892L459L9576l0168j20482k0823J15015L9366j04864
9139B4723j15661M9736K50142j3640j14837j00309j8656N3639J57377j3671q1332
9128G7511l4461N0885K257l6107q4700N1243Q9489l1542K9107l3306o3791J3003
9116B9588j10940q9039l6332P6024P092m0040J4458J21091K9531j5676j10361
9105a24604l7497O280K9j40510R5635Q2079P7882P4337m2080q8187l2043J1319
9093a17360k740l0177J140Q6922J44516q915j72711p8425O7762M0594J27909l060
9081E5455j49930n8550J12315P5316R489L7328K8253n9823j4585j16089J345M4380
$$ plain form
9069 -35096 -65096 -62111 -8910 53347 150224 98519 -91768 -178676 -47506 42860 70525 87138
9057 87138 151746 312301 364248 257268 94768 57889 73872 145962 60419 65442 173603
9046 173603 258323 96921 -24936 -20557 -7040 -47385 -59812 71094 15425 -50218 -214999
9035 -214999 -92178 152527 288012 258153 189179 221081 372343 420258 227205 157677 295847
9024 295847 271792 157224 50374 -41877 -54074 -68853 -95291 -28047 61579 49139 159211
9013 159211 270431 190432 125239 117229 115667 107096 79109 110739 112396 57462 -38966 -35936
9001 -35936 -26458 -89829 48714 84128 157566 171682 202767 207157 143800 110703 29854 57080
8989 57080 151368 263034 252204 146647 164825 254101 261905 217736 138995 103599 -113048
$$ packed form
9069c5096l0000K985N3201O2257R6877n1705j90287q6908J31170R0366K7665J6613
9057H7138O4608J60555N1947j06980j62500l6879J5983P2090q5543N023J08161
9046A73603Q4720j61402j21857M379J3517m0345j2427J30906n5669o5643j64781
9035b14999J22821K44705J35485k9859o8974L1902J51262M7915j93053o9528J38170
9024B95847k4055j14568j06850r2251j2197j4779k6438O7244Q9626j2440J10072
9013A59211J11220p9999o5193q010j562q571k7987L1630J657n4934r6428L030
9001c5936R478o3371J38543L5414P3438J4116L1085M390o3357l3097q0849K7226
8989E7080R4288J11666j0830j05557J8178Q9276P804m4169p8741l5396k16647
$$ plain form
8978 -113048 -176102 -58152 155914 183646 -31809 -89653 -76569 2656 7473 -51927 -57403
8967 -57403 -5465 -88371 -57441 89865 151381 77240 46178 73778 66352 9573 -77469 -159537
8955 -159537 -281755 -310699 -222598 42055 45919 66471 111231 150519 102585 40693 -67688
8944 -67688 -108150 -140279 -134821 -143654 -31472 2860 -135881 -137086 -27243 -92110 -169052 -114800
8932 -114800 -37930 -15005 -36984 49815 40077 118422 167123 234917 173995 155641 143162 155881
8920 155881 110503 35721 392 4294 -40522 -121745 -123892 -16773 -29062 -83949 -46708 -95952
8908 -95952 -82768 -2495 70832 158538 104594 149458 203920 142620 175149 200640 195813 226784
8896 226784 195331 184343 155560 186319 163746 131378 -10195 33320 226579 299114 270032
$$ packed form
8978a13048o3054J17950K14066K7732k15455n7844J3084P9225M817n9400n476
8967e7403N1938q2906L0930J47306O1516p4141l1062K7600p426n6779q7042q2068
8955a59537j22218k8944Q8101K64653L864K0552M4760L9288m7934o1892j08381
8944f7688m0462l2129N458q833J12182L4332j38741j205J09843o4867p6942N4252
8932a14800P6870K2925k1979Q6799r738P8345M8701O7794o0922j8354j2479J2719
8920A55881m5378p4782l5329L902m4816q1223k147J07119j2289n4887L7241m9244
8908i5952J3184Q0273P3327Q7706n3944M4864N4462o1300L2529K5491m827L0971
8896B26784l1453j0988k8783L0759k2573l2368j41573M3515J93259P2535k9082
$$ plain form
8885 270032 156292 62609 -18827 -38805 -9404 4615 27647 -69050 -181325 -78244 49017
8874 49017 -47177 -214760 -167662 -142769 -26914 -14419 19061 38831 85923 65397 -31801
8863 -31801 -93950 -79709 -85101 4321 13905 125331 165931 208487 164888 58999 63549 227150
8851 227150 200994 109522 99617 39659 -40083 -180722 -186735 -198734 -136843 -36007 -34470 -57508
8839 -57508 138109 182115 86929 42827 129342 129646 30736 128786 188435 212120 69842 -105287
8827 -105287 -145161 -138453 -21329 34850 90571 -8045 -8676 6823 6374 94962 201422 293199
8815 293199 362038 335847 322968 375897 244585 123382 115673 252322 220027 75934 183565
8804 183565 171703 273325 193433 129822 208270 64890 -72521 -8297 114613 236273 173506
$$ packed form
8885B70032j13740r3683q1436j9978K9401J4019K3032r6697j12275J03081J27261
8874D9017r6194j67583M7098K4893J15855J2495L3480J9770M7092k0526r7198
8863c1801o2149J4241n392Q9422R584J11426M0600M2556m3599j05889M550J63601
8851B27150k6156r1472r905n9958p9742j40639o013j1999O1891J00836J537k3038
8839e7508J95617M4006r5186m4102Q6515L04r8910R8050N9649K3685j42278j75129
8827a05287l9874O708J17124N6179N5721r8616o31J5499m49Q8588J06460R1777
8815B93199O8839k6191j2879N2929j31312j21203p709J36649l2295j44093J07631
8804A83565j1862J01622p9892o3611P8448j43380j37411O4224J22910J21660o2767
$$ plain form
8793 173506 210061 142760 169699 269057 300739 338331 315181 340605 278728 240007 161770 148675
8781 148675 101926 228857 369993 363812 202748 158993 201220 244548 378236 489908 652249
8770 652249 696416 492548 311650 381519 346321 302577 216118 200346 213255 163929 248800
8759 248800 277884 256291 260360 331286 486196 519126 545881 547054 477907 478443 570597 365194
8747 365194 311014 452214 611480 610118 539115 520413 496869 539793 607841 676752 699048
8736 699048 574320 518848 527940 606821 735449 895354 1005918 901835 679714 643842 749484
8725 749484 906159 983829 917167 765749 687541 871395 1179671 1224190 1113733 1024493 976771
8714 976771 946589 820631 693367 640622 593145 595662 492985 391170 493341 633686 655175
$$ packed form
8793A73506L6555o7301K6939R9358L1682L7592k3150K5424o1877l8721p8237j3095
8781A48675m6749J26931J41136o181j61064m3755M2227M3328J33688J11672J62341
8770F52249M4167k03868j80898O9869l5198m3744q6459j5772J2909m9326Q4871
8759B48800K9084k1593M069P0926J54910L2930K6755J173o9147N36R2154k05403
8747C65194n4180J41200J59266j362p1003j8702k3544M2924O8048O8911K2296
8736F99048j24728n5472R092P8881J28628J59905J10564j04083k22121l5872J05642
8725G49484J56675P7670o6662j51418p8208J83854L08276M4519j10457q9240m7722
8714I76771l0182j25958j27264n2745m7477K517j02677j01815J02171J40345K1489
$$ plain form
8703 655175 564157 525528 551535 557576 555206 807518 967896 954584 989085 1172486 1426503
8692 1426503 1654257 1792324 1791752 1873998 2017589 1983068 2034627 2092411 1987854 1892304 1946307
8681 1946307 1845331 1785656 1785417 1752662 1699246 1602361 1626333 1582794 1664974 1729840 1763714 1748083
8669 1748083 1753156 1812009 1773309 1868858 1871318 1873470 1891003 1866228 2052177 2240937 2288477 2223057
8657 2223057 2121466 1948507 1828880 1823545 1751926 1844228 1922914 1998043 2156885 2226140 2260770
8646 2260770 2218381 2317340 2525350 2466295 2425570 2320741 2245281 2296190 2445447 2678258 2916448
8635 2916448 3052327 3061861 2965851 2898906 2915807 2837866 2778785 2692133 2545792 2660593 2575782
8624 2575782 2349569 2327204 2445641 2468291 2466811 2474656 2499959 2550432 2649342 2811278 2903610
$$ packed form
8703F55175r1018l8629K6007O041k370K52312J60378j3312L4501J83401K54017
8692A426503K27754J38067n72Q2246J43591l4521N1559N7784j04557r5550N4003
8681A946307j00976n9675k39l2755n3416r6885K3972m3539Q2180O4866L3874j5631
8669A748083N073N8853l8700R5549K460K152J7533k4775J85949J88760M7540o5420
8657B223057j01591j72959j19627n335p1619R2302P8686P5129J58842O9255L4630
8646B260770m2389R8959K08010n9055m0725j04829p5460N0909J49257K32811K38190
8635B916448J35879R534r6010o6945J6901p7941n9081q6652j46341J14801q4811
8624B575782k26213k2365J18437K2650j480P845K5303N0473R8910J61936R2332
$$ plain form
8613 2903610 2835308 2804085 2779476 2649037 2596048 2486157 2322599 2330653 2394658 2275240 2236619
8602 2236619 2170952 2105028 2131606 2238423 2186253 2297635 2437927 2450963 2349956 2329224 2439101
8591 2439101 2474494 2451362 2488494 2541859 2523970 2432417 2338608 2318949 2413381 2551565 2310798
8580 2310798 2067719 1844776 1611614 1492342 1335702 1308061 1099281 1079745 1078820 882901
8570 882901 689019 767570 893814 1004004 974215 831885 783205 931979 927410 1085374 1201792
8559 1201792 1303239 1375710 1445494 1606578 1592736 1537201 1601512 1589564 1615277 1638002 1627499
8548 1627499 1527418 1273181 1345754 1606001 1666342 1548116 1474736 1459358 1472461 1462621 1430446
8537 1430446 1391661 1359374 1206361 1084592 938647 792469 799075 827712 812010 768610 596710
$$ packed form
8613B903610o8302l1223k4609j30439n2989j09891j63558Q054O4005j19418l8621
8602B236619o5667o5924K6578J06817n2170J11382J40292J3036j01007k0732J09877
8591B439101L5393k3132L7132N3365j7889r1553r3809j9659R4432J38184k40767
8580B310798k43079k22943k33162j19272j56640k7641k08780j9536r25j95919
8570H82901j93882P8551J26244J10190k9789j42330m8680J48774m569J57964J16418
8559A201792J01447P2471O9784J61084j3842n5535O4311j1948K5713K2725j0503
8548A627499j00081k54237P2573K60247O0341j18226p3380j5378J3103r840l2175
8537A430446l8785l2287j53013j21769j45945j46178O606K8637j5702m3400j71900
$$ plain form
8526 596710 561334 554690 533595 457759 417272 519898 548523 513954 508334 630025 644791 672060
8514 672060 805132 710973 611924 617992 679480 524419 529186 732099 784400 712593 703904 737683
8502 737683 791200 929333 817128 632317 591868 790029 864111 765242 629252 547579 522137
8491 522137 581796 659832 586717 381530 368782 398385 385415 259838 193861 290396 233840
8480 233840 103559 244422 283796 65525 -115763 -261023 -244369 -81134 57561 96307
8470 96307 124324 272550 249993 209878 45234 -56009 -8178 136121 224532 246316 294656
8459 294656 297566 107659 158068 285417 292213 293135 213937 198950 181299 198188 274165 243527
8447 243527 282730 176955 38876 -63855 29231 -28913 -48286 -9893 101406 50982 97144
$$ packed form
8526E96710l5376o644k1095p5836m0487J02626K8625l4569n620J21691J4766K7269
8514F72060J33072r4159r9049O068O1488j55061M767K02913N2301p1807q689L3779
8502G37683N3517J38133j12205j84811m0449J98161P4082r8869j35990q1673k5442
8491E22137N9659P8036p3115k05187j2748K9603j2970j25577o5977R6535n6556
8480B33840j30281J40863L9374k18271j81288j45260J6654J63235J38695L8746
8470I6307K8017J48226k2557m0115j64644j01243M7831J44299Q8411K1784M8340
8459B94656K910j89907N0409J27349O796R22p9198j4987j7651J6889P5977l0638
8447B43527L9203j05775j38079j02731R3086n8144j9373L8393J11299n0424M6162
$$ plain form
8436 97144 51555 7325 93973 194130 166509 238273 248686 27612 -226380 -305828 -184160
8425 -184160 -207857 -321812 -214976 -40839 32909 12287 -39599 -23199 52863 1965 36668
8414 36668 144484 300285 323037 222214 91565 -48008 25863 65838 70892 127001 79454
8403 79454 223988 252444 304641 514895 678686 701377 609367 528385 459977 360035 198002
8392 198002 215920 276489 322524 430174 577957 449743 223108 23004 39452 -17346 117008
8381 117008 180515 46275 23361 116978 94259 92185 70970 173 -137784 -165306 -8517
8370 -8517 106514 -37244 -118944 -3763 8549 -47071 71300 49514 22777 169735 266388
8359 266388 325040 449357 631143 813221 1017432 1072303 1023778 914781 643692 376815
$$ packed form
8436I7144m5589m4230Q6648J00157k7621P1764J0413k21074k53992p9448J21668
8425a84160k3697j13955J06836J74137P3748k0622n1886J6400P6062n0898L4703
8414C6668J07816J55801K2752j00823j30649j39573P3871L9975N054N6109m7547
8403G9454J44534K8456N2197K10254J63791K2691r2010q0982o8408r9942j62033
8392A98002J7918O0569M6035J07650J47783j28214k26635k00104J6448n6798J34354
8381A17008O3507j34240k2914R3617k2719k074k1215p0797j37957k7522J56789
8370h517J15031j43758q1700J15181J2312n5620J18371k1786k6737J46958R6653
8359B66388N8652J24317J81786J82078K04211N4871m8525j08997k71089k66877
$$ plain form
8349 376815 299269 237553 219406 239200 201356 185318 102075 -79026 -137318 -83703 11121
8338 11121 1420 -46026 -32056 65679 101186 56310 -43168 54862 8957 -1531 -23944 -20244
8326 -20244 75614 148528 162213 36727 -32294 89798 104408 123380 74747 6536 38435
8315 38435 -39142 -79172 -44671 172386 418412 582341 547471 456043 468262 237311 -38331
8304 -38331 -7103 -11926 -3830 129501 116714 -31496 -56296 16708 53270 -3808 39161 -12063
8292 -12063 -72784 55785 62880 42504 8005 -28681 48078 26544 -90438 -182239 -74972
8281 -74972 111809 201492 99356 94260 166009 179937 84779 19079 91254 170463 319331
8270 319331 219171 93967 -29918 -91323 -145407 -83607 -95364 -88767 -156224 -114448 17403
$$ packed form
8349C76815p7546o1716j8147J9794l7844j6038q3243j81101n8292N3615R4824
8338A1121r701m7446J3970R7735L5507m4876r9478R8030m5905j0488k2413L700
8326b0244R5858P2914J3685j25486o9021J22092J4610J8972m8633o8211L1899
8315C8435p7577m0030L4501K17057K46026J63929l4870r1428J2219k30951k75642
8304c8331L1228m823Q096J33331j2787j48210k4800P3004L6562n7078M2969n1224
8292a2063o0721J28569P095k0376l4499l6686P6759k1534j16982r1801J07267
8281g4972J86781Q9683j02136n096P1749J3928r5158o5700P2175P9209J48868
8270C19331j00160j25204j23885o1405n4084O1800j1757O597o7457M1776J31851
$$ plain form
8259 17403 -4405 -26829 -27468 22025 57642 35901 5390 17611 9292 -41447 -110813 -139485
8247 -139485 14984 89631 119734 99074 23496 -78586 -187125 -186166 -245561 -378516 -245598
8236 -245598 -64121 127540 101472 165612 200941 103870 202488 265646 113538 33716 144445
8225 144445 88628 92417 -41237 -88347 -69698 -113426 -107185 46686 65271 122817 9744
8214 9744 -129274 -131519 -68769 12434 40245 237942 209007 86163 50110 70521 70777 112278
8202 112278 137597 11479 -21874 -60543 -142094 -131109 106708 88245 79367 26404 107264
8191 107264 138507 133654 2406 -4863 111982 28022 -79349 -25579 103930 254652 302770
8180 302770 412779 457070 331163 245284 67367 -85724 -167360 -102565 -46462 -20827 88730
$$ packed form
8259A7403k1808k2424o39M9493L5617k1741l0511J2221q319n0739o9366k8672
8247a39485J54469P4647L0103k0660p5578j02082j08539R59n9395j32955J32918
8236b45598J81477J91661k6068O4140L5329r7071R8618O3158j52108p9822J10729
8225A44445n5817L789j33654m7110J8649m3728O241J53871J8585N7546j13073
8214I744j39018k245O2750Q1203K7811J97697k8935j22844l6053K0411K56M1501
8202A12278K5319j26118l3353l8669q1551J0985K37817j8463q878n2963Q0860
8191A07264L1243m853j31248p269J16845q3960j07371N3770J29509J50722M8118
8180C02770J10009M4291j25907q5879j77917j53091q1636O4795N6103K5635J09557
$$ plain form
8169 88730 173384 176768 104818 82168 111499 175788 188995 155227 62229 112675 57627 10071
8157 10071 83544 79934 80680 147247 157931 86708 8354 104857 27603 10315 -114246 -205986
8145 -205986 -51709 37632 115219 57143 -19646 -153248 -121517 16545 45641 -18438 -106450
8134 -106450 -104001 -24717 26442 -47529 -152411 -117594 1566 66708 -117301 -176973 -154546
8123 -154546 -92997 95443 104993 -31416 -74118 -80017 -115159 -60708 -134669 -110028 -17774 283
8111 283 163415 148748 12998 -14053 2362 -61198 -44737 78879 41226 2584 -112608
8100 -112608 -162050 -73345 52238 44425 -2274 29352 -7435 -78476 -124732 -125989 -35302 -32031
8088 -32031 -138550 -23215 -30364 -134473 74458 100984 67437 153424 104185 26957 -56477
$$ packed form
8169H8730Q4654L384p1950k2650K9331O4289J3207l3768r2998N0446n5048m7556
8157A0071P3473l610P46O6567J0684p1223p8354R6503p7254j7288j24561r1740
8145b05986J54277Q9341P7587n8076p6789j33602L1731J38062K9096o4079q8012
8134a06450K449P9284N1159p3971j04882L4817J19160O5142j84009n9672K2427
8123a54546O1549J88440R550j36409m2702n899l5142N4451p3961K4641R2254J8057
8111B83J63132j4667j35750k7051J6415o3560J6461J23616l7653l8642j15192
8100a12608m9442Q8705J25583p813m6699L1626l6787p1041m6256j257R0687L271
8088c2031j06519J15335p149j04109K08931K6526l3547Q5987m9239p7228q3434
$$ plain form
8077 -56477 -119339 -276439 -214247 -223214 -294361 -284462 -218565 -225785 -247339 -108888 -13075 -83887
8065 -83887 -106548 -33920 -179299 -167010 -56531 16389 36753 -57319 72807 190309 196962
8054 196962 96667 17938 87104 97413 121917 267304 275634 283312 226948 151326 159948 246876
8042 246876 125918 -41924 55024 166603 134000 76102 108811 209581 339509 408529 285732
8031 285732 231946 221621 201973 253169 357503 437014 416322 257628 141491 198266 352561
8020 352561 395977 302574 332270 452493 538846 465795 391284 431111 545427 614747 737834
8009 737834 816012 962475 1141285 1274474 1703046 2183293 2891838 3655140 4133608 4455177
7999 4455177 4645059 4659185 4480991 4150547 3731601 3280639 2951799 2634377 2352239 2122511
$$ packed form
8077e6477o2862j57100O2192q967p1147R899O5897p220k1554J38451R5813p0812
8065h3887k2661P2628j45379J2289J10479P2920K0364r4072J30126J17502O653
8054A96962j00295p8729O9166J0309K4504J45387Q330P678n6364p5622Q622Q6928
8042B46876j20958j67842R6948J11579l2603n7898L2709J00770J29928O9020j22797
8031B85732n3786j0325j9648N1196J04334P9511k0692j58694j16137N6775J54295
8020C52561M3416r3403K9696J20223Q6353p3051p4511L9827J14316O9320J23087
8009G37834P8178J46463J78810J33189M28572M80247P08545P63302M78468L21569
7999D455177J89882J4126j78194l30444m18946m50962l28840l17422k82138k29728
$$ plain form
7989 2122511 2002914 1822958 1728777 1614506 1532482 1435798 1255535 1132206 1193270 1216080
7979 1216080 1069583 1051603 1144530 1191096 1325026 1266403 1234646 1265081 1277166 1242818 1255997
7968 1255997 1264090 1329676 1541215 1844582 2062893 2135140 2302639 2753621 3413422 4294452
7958 4294452 5757662 7620942 9107229 9569653 9312134 8454995 7382826 6394863 5567916
7949 5567916 4938320 4294646 3722017 3337052 3008332 2647068 2359385 2182009 2013294 1892668
7939 1892668 1916273 1893507 1736482 1654588 1629100 1585366 1565736 1458998 1144122 899609 997190
7928 997190 948533 985004 908994 1010559 1179883 1361206 1388778 1513928 1541198 1454627 1523913
7917 1523913 1671113 1948301 2187849 2281722 2437598 2706110 2928782 3081890 3121927 2944425
$$ packed form
7989B122511j19597j79956r4181j14271q2024r6684j80263j23329O1064K2810
7979A216080j46497j7980R2927M6566J33930n8623l1757L0435J2085l4348J3179
7968A255997Q093O5586K11539L03367K18311P2247J67499M50982O59801Q81030
7958D294452J463210J863280J486287M62424k57519q57139j072169r87963q26947
7949E567916o29596o43674n72629l84965l28720l61264k87683j77376j68715j20626
7939A892668K3605k2766j57025q1894k5488m3734j9630j06738l14876k44513R7581
7928I97190m8657L6471p6010J01565J69324J81323K7572J25150K7270q6571O9286
7917A523913J47200K77188K39548R3873J55876K68512K22672J53108M0037j77502
$$ plain form
7907 2944425 2750912 2514096 2281446 2145478 2003994 1692666 1378320 1043075 937503 878001
7897 878001 790083 766524 673775 697785 631316 483855 522803 531451 506865 373999 355443
7886 355443 347930 278298 370596 275421 209457 314494 330781 264961 240881 284613 197887 210049
7874 210049 263565 251737 291672 228769 110268 33768 -7895 -61288 -38547 -84363 -49494
7863 -49494 -21917 185761 237911 132229 204412 186148 129647 27390 -21738 37376 59291
7852 59291 59967 131744 104007 68332 146465 123682 47495 65498 87213 -4987 22336 66338
7840 66338 159983 116810 -37572 5336 93496 87823 -2303 68810 111938 -4902 -2487 20958
7828 20958 41796 71420 114738 209077 177670 14362 27084 37762 -50876 -70381 38269
$$ packed form
7907B944425j93513k36816k32650j35968j41484l11328l14346l35245j05572n9502
7897H78001q7918k3559r2749K4010o6469j47461L8948Q648k4586j32866j8556
7886C55443p513o9632R2298r5175o5964J05037J6287o5820k4080M3732q6726J2162
7874B10049N3516j1828L9935o2903j18501p6500m1663n3393K2741m5816L4869
7863d9494K7577K07678N2150j05682P2183j8264n6501j02257m9128N9114K1915
7852E9291O76P1777k7737l5675P8133k2783p6187J8003K1715r2200K7323M4002
7840F6338R3645m3173j54382M2908Q8160n673r0126P1113M3128j16840K415K3445
7828B0958K0838K9624M3318R4339l1407j63308J2722J0678q8638j9505J08650
$$ plain form
7817 38269 66683 3820 31348 80635 -7902 45679 162008 61264 -27785 90371 159763
7806 159763 98762 48463 106308 113582 31792 47753 58255 125717 174103 191620 204735 150767
7794 150767 76914 -76089 -82427 -40941 53674 265153 459878 306469 96808 186406 279005
7783 279005 191146 86402 -56466 -50983 -87715 -142936 -87254 -79892 22508 -106789 -139295
7772 -139295 -40361 106873 145555 -15733 -115840 -42982 -10067 125338 252992 165487 -31878
7761 -31878 -98240 -122062 -141884 -81751 -33136 -53625 -5971 -54038 -231581 -24951 23092
7750 23092 -5188 75362 144795 173724 154178 15059 -102141 -10616 36801 -66759 -51584
7739 -51584 30722 102248 3929 -29443 90425 55797 -80259 -179274 -280834 -134096 -78869
$$ packed form
7817C8269K8414o2863K7528M9287q8537N3581J16329j00744q9049J18156O9392
7806A59763o1001n0299N7845P274q1790J5961J0502O7462M8386J7517J3115n3968
7794A50767p3853j53003o338M1486R4615K11479J94725j53409k09661Q9598R2599
7783B79005q7859j04744j42868N483l6732n5221N5682P362J02400j29297l2506
7772a39295R8934J47234L8682j61288j00107P2858L2915J35405J27654q7505j97365
7761c1878o6362k3822j9822O0133M8615k0489M7654m8067j77543K06630M8043
7750B3092k8280Q0550O9433K8929j9546j39119j17200R1525M7417j03560J5175
7739e1584Q2306P1526r8319l3372J19868l4628j36056r9015j01560J46738N5227
$$ plain form
7728 -78869 -55388 -1580 137668 115829 -53681 -64034 67409 188538 274837 386558 277987
7717 277987 198268 64232 21617 -18041 -55018 16269 199187 187943 118588 5329 -35252
7706 -35252 56833 176303 159514 83689 63068 64192 82387 10168 18337 184358 31203 -128479
7694 -128479 -111179 57852 70343 -3880 -73781 13292 72288 101417 208501 197115 10101
7683 10101 -143369 -88239 37859 37050 44888 -59440 -206021 -123410 -23138 -67431 67137
7672 67137 47520 -47304 -8526 117479 120129 53009 107478 142502 130489 149181 142715 182248
7660 182248 208294 276781 267631 364901 335331 169333 37218 60442 103097 63208 57512 18513
7648 18513 100260 79328 13226 38749 -23047 -20245 73319 141573 107511 75246 107799 -11064
$$ packed form
7728g8869K3481N3808J39248k1839j69510j0353J31443J21129Q6299J11721j08571
7717B77987p9719j34036m2615l9658l6977P1287J82918j1244o9355j13259m0581
7706c5252R2085J19470j6789p5825k0621J124J8195p2219Q169J66021j53155j59682
7694a28479J7300J69031J2491p4223o9901Q7073N8996K9129J07084j1386j87014
7683A0101j53470N5130J26098q09P838j04328j46581Q2611J00272m4293J34568
7672F7137j9617r4824L8778J26005K650o7120N4469L5024j2013J8692o466L9533
7660A82248K6046O8487r150R7270k9570j65998j32115K3224M2655l9889n696l8999
7648A8513Q1747k0932o6102K5523o1796K802R3564O8254l4062l2265L2553j18863
$$ plain form
7636 -11064 -113692 -23889 -129645 -270159 -205560 -203786 -9377 143715 89930 40729 -57975
7625 -57975 -167443 -33630 60787 106903 83444 38343 14109 -2914 69713 77655 99905 160104
7613 160104 364929 335801 81702 52961 125672 158502 3870 15216 69367 -11679 -8172
7602 -8172 -163398 -201485 -31165 58184 176170 268650 163936 55979 84887 179017 272159
7591 272159 135028 21894 170615 325555 485618 442345 350369 457549 560257 565657
7581 565657 620016 705705 896790 1323749 1697664 2013735 2210422 2303149 2275811 2168702
7571 2168702 2023106 2083047 1995053 1822795 1650873 1541117 1383819 1315019 1343087 1315811
7561 1315811 1100897 1053300 1074217 1089635 968036 888136 911056 813079 833706 1009846 1082866
$$ packed form
7636a1064j02628Q9803j05756j40514O4599J774J94409J53092n3785m9201r8704
7625e7975j09468J33813R4417M6116k3459m5101k4234j7023P2627P942K2250O0199
7613A60104K04825k9128k54099k8741P2711L2830j54632J1346N4151q1046L507
7602h172j55226l8087J70320Q9349J17986R2480j04714j07957K8908R4130R3142
7591B72159j37131j13134J48721J54940J60063m3273r1976J07180J02708N400
7581E65657N4359Q5689J91085M26959L73915L16071J96687R2727k7338j07109
7571B168702j45596N9941q7994j72258j71922j09756j57298o8800K8068k7276
7561A315811k14914m7597K0917J5418j21599p9900K2920r7977K0627J76140P3020
$$ plain form
7550 1082866 1019370 1010290 969961 991843 1058588 909002 968049 1105536 1321066 1452686 1371196
7539 1371196 1466180 1631961 1869253 2234930 2435716 2511809 2668879 2870126 2987643 3074048
7529 3074048 3263555 3340638 3372378 3507323 3512364 3431384 3279883 3013376 2865700 2766380 2515172
7518 2515172 2123534 1892250 1769023 1671271 1539828 1330452 1138836 1023195 824998 678269
7508 678269 700499 579476 422202 508221 448712 437062 602378 580182 398649 374218 446017
7497 446017 434272 493189 577061 572095 545049 548225 715521 785955 910410 929412 1098348
7486 1098348 1148642 1280360 1402071 1461771 1636090 1843741 1939866 2014243 2186045 2173055
7476 2173055 2159275 1982219 1659328 1331478 1082162 918239 680772 599517 397186 267572
$$ packed form
7550A082866o3496r080m0329K1882O6745j49586N9047J37487K15530J31620q1490
7539A371196R4984J65781K37292L65677K00786P6093J57070K01247J17517Q6405
7529C074048J89507P7083L1740J34945N041q0980j51501k66507j47676r9320k51208
7518B515172l91638k31284j23227r7752j31443k09376j91616j15641j98197j46729
7508F78269K2230j21023j57274Q6019n9509j1650J65316k2196j81533k4431P1799
7497D46017j1745N8917Q3872m966k7046L176J67296P0434J24455J9002J68936
7486A098348N0294J31718J21711N9700J74319K07651R6125P4377J71802j2990
7476B173055j3780j77056l22891l27850k49316j63923k37467q1255k02331j29614
$$ plain form
7466 267572 301702 376284 313642 131416 126390 201881 149771 74185 22957 32574 -13401 -56853
7454 -56853 -51447 19230 19185 159630 311794 164640 61577 205895 171577 100200 215846
7443 215846 359233 441571 228380 106059 158613 258751 322633 270148 267440 208441 148190
7432 148190 124991 58254 -6798 -6278 50516 37865 32667 -65991 -73130 47256 170780 133784
7420 133784 50716 128358 222897 169819 133965 135717 64608 112827 141834 127287 127740 242172
7408 242172 91702 19694 -43822 -58411 -159315 -46658 29391 98253 77572 31164 28858
7397 28858 78349 211983 92713 44033 3370 -101102 -224568 -161148 -161488 -201555 -238764
7386 -238764 -114848 -29144 36181 -64283 -148473 -148408 -203890 -249833 -87172 36343 220251
$$ packed form
7466B67572L4130P4582o2642j82226n026P5491n2110p5586n1228R617m5975m3452
7454e6853N406P0677m5J40445J52164j47154j03063J44318l4318p1377J15646
7443B15846J43387Q2338k13191j22321N2554J00138O3882n2485k708n8999o0251
7432A48190k3199o6737o5052N20N6794j2651n198r8658p139J20386J23524l6996
7420A33784q3068P7642R4539n3078l5854J752p1109M8219K9007j4547M53J14432
7408B42172j50470p2008o3516j4589j00904J12657P6049O8862k0681m6408k306
7397B8858M9491J33634j19270m8680m0663j04472j23466O3420l40m0067l7209
7386b38764J23916Q5704O5325j00464q4190O5n5482m5943J62661J23515J83908
$$ plain form
7375 220251 193577 132311 105212 114848 129616 187678 162834 176897 97065 -72295 -66565 -19117
7363 -19117 29873 186186 132764 58716 104526 127545 19966 -69270 -104609 -110131 -109059 -118213
7351 -118213 -196765 -190988 -107515 -79646 -119707 -73717 83011 91197 140273 121245 58768 -19518
7339 -19518 -95053 -12014 49427 -94573 -183304 -109333 1325 20200 53565 -41716 -177134
7328 -177134 2734 62153 89261 56998 19174 -80111 -160637 -117649 5839 -76682 -195160
7317 -195160 -138180 80455 76138 -108168 -140332 -81952 54367 9060 8077 14182 -72774 -130608
7305 -130608 -10165 48841 -53309 -119761 -47818 -42098 7575 -18058 -61763 -32188 -57345
7294 -57345 -43689 -151881 -238784 -154204 -65037 18668 -148734 -149291 -147236 -44943 -97898 -115043
$$ packed form
7375B20251k6674o1266k7099R636J4768N8062k4844J4063p9832j69360N730M7448
7363a9117M8990J56313n3422p4048M5810K3019j07579q9236l5339n522J072r154
7351a18213p8552N777Q3473K7869m0061M5990J56728Q186M9076j9028o2477p8286
7339a9518p5535Q3039O1441j44000q8731P3971J10658J8875L3365r5281j35418
7328a77134J79868N9419K7108l2263l7824r9285q0526M2988J23488q2521j18478
7317a95160N6980K18635m317j84306l2164N8380J36319m5307r83O105q6956n7834
7305a30608J20443N9006j02150o6452P1943N720M9673k5633m3705K9575k5157
7294e7345J3656j08192q6903Q4580Q9167Q3705j67402n57K055J02293n2955j7145
$$ plain form
7282 -115043 -155657 -76524 -55449 -184255 -118553 -115391 -137260 -224428 -245695 -177424 -127951 -156170
7270 -156170 -125845 -56416 45687 12129 -135742 -205568 -144814 -172375 -159048 -134903 -44791
7259 -44791 60468 -142410 -342866 -380067 -304301 -93425 -24337 -86999 -99396 -104178 -77230
7248 -77230 6203 11391 -40426 -30590 -54339 -78273 -43247 31248 -44122 -50305 86106 124887
7236 124887 3279 -138274 -112655 6889 8159 -32439 -57126 -39642 -88010 -110515 -84805
7225 -84805 14173 -116288 -141037 -100404 -204948 -180342 -134266 -102377 -190260 -302203 -207172
7214 -207172 -183683 -68628 -59800 -103516 -117734 -141366 -159882 -24600 112557 187602 80780
7203 80780 8988 -30977 -7899 -5227 -255694 -214549 -58190 -129295 -176188 -78762 -38176 -9778
$$ packed form
7282a15043m0614P9133K1075j28806O5702L162k1869q7168k1267O8271M9473k8219
7270a56170L0325O9429J02103l3558j47871o9826O0754k7561J3327K4145R0112
7259d4791J05259k02878k00456l7201P5766K10876O9088o2662j2397m782K6948
7248g7230Q3433N188n1817R836k3749k3934L5026P4495p5370o183J36411L8781
7236A24887j21608j41553K5619J19544J270m0598k4687J7484m8368k2505K5710
7225h4805R8978j30461k4749M0633j04544K4606M6076L1889q7883j11943R5031
7214b07172K3489J15055Q828m3716j4218k3632j8516J35282J37157P5045j06822
7203H0780p1792l9965K3078K672k50467M1145J56359p1105m6893R7426M0586K8398
$$ plain form
7191 -9778 -30678 -170680 -179995 -186718 -113973 -123722 -82364 -380 133080 136497 62062 240009
7179 240009 221956 141243 44192 50764 -67171 27533 175854 96690 136774 97109 57305
7168 57305 17539 -64665 -205714 -286441 -196526 -124420 -118307 -33210 -67946 -144744 -108020 -124797
7156 -124797 -304465 -209950 -93144 -153656 -243750 -172839 -90152 -124894 -132218 -19842 11004
7145 11004 19833 112663 55751 11183 57800 162257 -15041 -120367 -174291 -45620 93777
7134 93777 87139 78064 51884 38548 -4907 163316 154176 -15399 -130387 -1801 -40153 -18282
7122 -18282 -60700 -62985 -89668 -103077 52709 152548 139090 174919 160584 105027 131886 85349
7110 85349 141668 90094 35248 53056 123659 79125 26117 -124287 -145777 -88289 106339
$$ packed form
7191i778k0900j40002r315o723P2745r749M1358Q1984J33460L417p4435J77947
7179B40009j8053q0713r7051O572j17935R4704J48321p9164M0084l9665l9804
7168E7305l9766q2204j41049q0727Q9915P2106O113Q5097l4736p6798L6724j6777
7156a24797j79668R4515J16806o0512r0094P0911Q2687l4742p324J12376L0846
7145A1004Q829R2830n6912m4568M6617J04457j77298j05326n3924J28671J39397
7134I3777o638r075k6180j3336m3455J68223r140j69575j14988J28586l8352K1871
7122a8282m2418k285k6683j3409J55786R9839j3458L5829j4335n5557K6859m6537
7110H5349N6319n1574n4846J7808P0603m4534n3008j50404k1490N7488J94628
$$ plain form
7099 106339 171814 20586 -74103 -152369 -254777 -233858 -123603 -3444 24842 -31324 -197087
7088 -197087 -216293 -117261 -112596 -62843 -34089 -31684 -49791 11567 67860 117497 199658 122340
7076 122340 -14133 16256 21522 52440 84311 124720 102350 113014 95470 222549 275548
7065 275548 274305 125244 -12661 -86947 -69560 -108035 -95833 -130883 -193739 -202364 -304851
7054 -304851 -195059 -76995 -112590 -101168 17816 119 50179 -13809 -18329 -163960 -115370
7043 -115370 -125991 31063 114820 -114346 -206883 -46101 9658 -78520 -52481 39786 101620
7032 101620 243765 172949 123722 -58128 -138860 -181271 -348631 -378548 -383674 -296637 -164463
7021 -164463 -116341 -119582 -161198 -118114 -152697 -41715 46820 152730 47016 84970 194217
$$ packed form
7099A06339O5475j51228r4689p8266j02408K0919J10255J20159K8286n6166j65763
7088a97087j9206R9032M665M9753K8754K405j8107O1358N6293M9637Q2161p7318
7076A22340j36473L0389N266L0918L1871M0409k2370J0664j7544J27079N2999
7065B75548j243j49061j37905p4286J7387l8475J2202l5050o2856q625j02487
7054c04851J09792J18064l5595J1422J18984j7697N0060o3988m520j45631M8590
7043a15370j0621J57054Q3757k29166r2537J60782N5759q8178K6039R2267O1834
7032A01620J42145p0816m9227j81850q0732m2411j67360k9917n126Q7037J32174
7021a64463M8122l241m1616M3084l4583J10982Q8535J05910j05714L7954J09247
$$ plain form
7010 194217 73825 81113 85787 132193 2150 -142676 -106551 18922 56043 -68486 -64919
6999 -64919 95490 188699 57888 -88380 -72591 24994 -136365 -291430 -221120 -139134 -192993
6988 -192993 -116702 -166440 -107515 81221 75563 -169682 -285845 -165523 -57701 4040 26415
6977 26415 15203 111216 132731 -15764 -61061 -166670 -122076 55153 30270 25470 -118351
6966 -118351 -190659 -153469 -62586 13736 -28010 -266279 -172932 71400 -55856 -106131 -104930
6955 -104930 -59099 67057 21204 46103 -35569 -78224 -51918 21708 167851 217643 290359
6944 290359 237055 87863 74545 149426 57332 -103192 -179097 -149680 -117568 -69896 13516
6933 13516 144837 138972 183905 168853 47698 -39480 -87298 -106138 -124367 -134712 -126778 -152797
$$ packed form
7010A94217j20392P288M674M6406j30043j44826L6125J25473L7121j24529L567
6999f4919J60409R3209j30811j46268J5789R7585j61359j55065P0310Q1986n3859
6988a92993P6291m9738N8925J88736n658k45245j16163J20322J07822O1741K2375
6977B6415j1212R6013K1515j48495m5297j05609M4594J77229k4883m800j43821
6966a18351p2308L7190R0883P6322m1746k38269R3347K44332j27256n0275J201
6955a04930M5831J26156m5853K4899q1672m2655K6306P3626J46143M9792P2716
6944B90359n3304j49192j3318P4881r2094j60524p5905K9417L2112M7672Q3412
6933A3516J31321n865M4933j5052j21155q7178m7818j8840j8229j0345P934k6019
$$ plain form
6921 -152797 -268794 -154508 13465 -11709 -106188 -138353 -240812 -373857 -437872 -318697
6911 -318697 -160755 -93506 29642 8557 78621 139092 135145 77248 -128189 -140181 -165582
6900 -165582 -278519 -296604 -333160 -333595 -175816 -143969 -81861 -22566 -18392 26398 156504 240897
6888 240897 98196 -106494 -226613 -278530 -124028 82306 81621 30867 -88536 -24805 -30691
6877 -30691 -60557 -38503 -89260 -104753 -109100 1837 153059 167529 116377 42840 66245 5578
6865 5578 23950 25318 81923 84102 112257 102058 101628 19722 -60961 -157054 -59512 -4130 -45747
6852 -45747 -123047 -157137 -51252 -2851 -36849 -116366 -28739 117556 190210 231087 282463
6841 282463 98269 -13320 113222 145240 235829 266170 160244 108192 143447 183868 40572
$$ packed form
6921a52797j15997J14286J67973k5174r4479l2165j02459j33045o4015J19175
6911c18697J57942O7249J23148k1085P0064O0471l947n7897k05437j1992k5401
6900a65582j12937j8085l6556m35J57779L1847O2108N9295M174M4790J30106Q4393
6888B40897j42701k04690j20119n1917J54502K06334o85n0754j19403O3731n886
6877c0691k9866K2054n0757j5493m347J10937J51222J4470n1152p3537K3405o0667
6865E578J8372J368N6605K179K8155j0199m30q1906q0683r6093R7542N5382m1617
6852d5747p7300l4090J05885M8401l3998p9517Q7627J46295P2654M0877N1376
6841B82463j84194j11589J26542L2018R0589L0341j05926n2052L5255M0421j43296
$$ plain form
6830 40572 52600 74634 40976 -9718 -49921 2784 -110073 -156120 -180283 -184332 -239581 -89126
6818 -89126 56724 15598 57586 137947 88164 68263 67305 -24357 -51952 21493 -147188 -140218
6806 -140218 -19597 10722 93400 -8267 -86756 -115749 63487 95727 -8725 -53225 -15418
6795 -15418 -37043 -109686 -74919 -121044 -150490 -83836 11509 72035 22267 -68975 -73827 -113412
6783 -113412 -168272 -209968 -61437 40510 48529 14773 30999 208895 336727 338974 123162
6772 123162 106902 138882 53787 -94501 -99703 -138303 -106979 -102793 -165785 -129819 14882 -29464
6760 -29464 -160729 14428 20003 -55211 -19724 153350 225899 11072 -27248 4693 -74729
6749 -74729 -194584 -182331 -67964 11925 175476 244792 179492 76978 -17972 -78382 -89568
$$ packed form
6830D0572J2028K2034l3658n0694m0203N2705j12857m6047k4163m049n5249J50455
6818h9126J45850m1126M1988Q0361m9783j9901r58r1662k7595P3445j68681O970
6806a40218J20621L0319Q2678j01667p8489k8993J79236L2240j04452m4500L7807
6795a5418k1625p2643L4767m6125k9446O6654R5345O0526m9768r1242m852l9585
6783a13412n4860m1696J48531J01947Q019l3756J6226J77896J27832K247k15812
6772A23162j6260L1980q5095j48288n202l8600L1324M186o2992L5966J44701m4346
6760b9464j31265J75157N575p5214L5487J73074P2549k14827l8320L1941p9422
6749g4729j19855J2253J14367P9889J63551O9316o5300j02514r4950o0410j1186
$$ plain form
6738 -89568 51161 187457 198826 -27350 -136533 -182922 -253371 -177254 -37236 -23498 29701
6727 29701 48034 150678 184446 129527 121922 142721 19548 43038 42082 77833 161549 52533
6715 52533 -29639 -22827 -159304 -49766 24058 -81050 5156 32521 6055 -61024 43788
6704 43788 66262 -146975 -60790 32568 89223 24965 41582 45468 -21923 6917 68078 137549
6692 137549 -59729 -238302 -226056 -233288 -101553 -71421 14587 72357 56677 -12608 -61719
6681 -61719 -141005 -218904 -16383 159271 107865 -3309 -112951 -85339 45432 35192 -84841
6670 -84841 -75617 -4100 -38290 -64662 -60462 -21097 188560 223169 58554 18487 51145 -22983
6658 -22983 -162981 -218325 -317456 -292009 -220208 -197815 -362414 -366870 -279033 -122742 -82853
$$ packed form
6738h9568J40729J36296J1369k26176j09183m6389p0449P6117J40018J3738N3199
6727B9701J8333J02644L3768n4919p605K0799j23173K3490r56L5751Q3716j09016
6715E2533q2172O812j36477J09538P3824j05108Q6206K7365k6466o7079J04812
6704D3788K2474k13237Q6185R3358N6655o4258J6617L886o7391K8840O1161O9471
6692A37549j97278j78573J2246p232J31735L0132Q6008N7770j5680o9285m9111
6681f1719p9286p7899K02521J75654n1406j11174j09642K7612J30771j0240j20033
6670h4841R224P1517l4190k6372M200L9365K09657L4609j64615m0067L2658p4128
6658b2983j39998n5344r9131K5447P1801K2393j64599m456Q7837J56291L9889
$$ plain form
6647 -82853 -127531 -225029 -96814 46674 90689 159384 104538 24116 -56067 -52943 -108655 -52321
6635 -52321 -116785 -74043 -64132 -119766 29705 34446 -30095 38849 100170 70135 43265 -58644
6623 -58644 -128294 -101090 -130468 -99435 -124032 -335860 -338636 -155956 -122115 -111243 -47129 -11685
6611 -11685 -141584 -190848 -109714 5253 17155 39374 211470 157616 -32826 -248541 -265431
6600 -265431 -155389 -220476 -92411 26258 100932 188320 43321 -6100 14450 45175 22734
6589 22734 105516 182420 300221 355145 251330 158964 156020 197554 243852 245134 298356 230116
6577 230116 31824 -78487 -132601 -78069 2999 154220 223076 162001 98725 38853 32753
6566 32753 -57123 -48052 -77235 -154873 -151688 26286 -11695 -35116 22970 -104887 -152791 8162
$$ packed form
6647h2853m4678r7498J28215J43488M4015O8695n4846q0422q0183L124n5712N6334
6635e2321o4464M2742R911n5634J49471M741o4541O8944O1321l0035k6870j01909
6623e8644o9650K7204k9378L1033k4597k11828k776J82680L3841J0872O4114L5444
6611a1685j29899m9264Q1134J14967J1902K2219J72096n3854j90442k15715j6890
6600b65431J10042o5087J28065J18669P4674Q7388j44999m9421K0550L0725k2441
6589B2734Q2782P6904J17801N4924j03815r2366k944M1534M6298J282N3222o8240
6577B30116j98292j10311n4114N4532Q1068J51221O8856o1075o3276n9872o100
6566C2753q9876R071k9183p7638L185J77974l7981k3421N8086j27857m7904J60953
$$ plain form
6554 8162 -19974 -48464 -119034 -137339 -99395 -55570 84868 146790 63356 8442 44742 -52455
6542 -52455 -90023 -55906 59823 3091 -28263 69303 167245 215030 296176 22939 -140625
6531 -140625 -95486 -105786 -175987 -158838 48663 138233 80044 83163 45205 23773 81225 125569
6519 125569 65326 54258 154462 250511 241685 214162 344865 370227 348218 267342 106114
6508 106114 66576 24648 -15221 -176906 -175535 -62856 103945 167762 171785 59713 -98908
6497 -98908 -115149 -102588 -116299 -116417 19652 52243 79403 -17852 -198430 -285513 -358889 -286188
6485 -286188 -145339 65267 27632 33980 34253 17615 -1155 -26353 46423 -7653 -124788 -72747
6473 -72747 -84435 -76689 8373 99048 -20467 -138513 -242938 -353213 -369166 -275495 -293625
$$ packed form
6554H162k8136k8490p0570j8305L7944M3825J40438O1922q3434n4914L6300r7197
6542e2455l7568L4117J15729n6732l1354R7566R7942M7785Q1146k73237j63564
6531a40625M5139j0300p0201J7149K07501Q9570n8189L119l7958k1432N7452M4344
6519A25569o0243j1068J00204R6049q826k7523J30703K5362k2009q0876j61228
6508A06114l9538m1928l9869j61685J371J12679J66801O3817M023j12072j58621
6497i8908j6241J2561j3711j18J36069L2591K7160r7255j80578q7083p3376P2701
6485b86188J40849K10606l7635O348K73j6638j8770k5198P2776n4076j17135N2041
6473g2747j1688P746Q5062R0675j19515j18046j04425j10275j5953R3671j8130
$$ plain form
6462 -293625 -317969 -345053 -236174 -168008 -84438 -17990 16550 -92939 -145378 -90459 -55429
6451 -55429 -261136 -328409 -139893 -156472 -156021 -76680 2260 -114995 -182278 -127627 -82172 -60088
6439 -60088 -74271 -88654 -146187 -180052 -99739 9108 -65294 -188920 -102550 28981 185774
6428 185774 237077 284834 180083 71185 -6010 170706 62917 -256200 -84601 90910
6418 90910 66872 39799 -28568 -75433 -25666 -7733 -11492 -178159 -106139 -166044 -160834 -47748
6406 -47748 -18423 -8921 -151710 -183433 -201338 -148099 -34993 -21781 65881 82154 125120 -55889
6394 -55889 -200588 -250277 -158587 51461 54199 3683 -59733 -78417 25638 8191 18810
6383 18810 128126 208651 140618 101128 115646 159981 142708 119682 196014 -24571 14628
$$ packed form
6462b93625k4344k7084J08879O8166Q3570O6448L4540j09489n2439N4919L5030
6451e5429k05707o7273J88516j6579M51P9341P8940j17255o7283N4651M5455K2084
6439f0088j4183j4383n7533l3865Q0313J08847p4402j23626Q6370J31531J56793
6428A85774N1303M7757j04751j08898p7195J76716j07789l19117J71599J75511
6418I0910k4038k7073o8367m6865M9767J7933l759j66667P2020n9905N210J13086
6406d7748K9325R502j42789l1723j7905N3239J13106J3212Q7662J6273M2966j81009
6394e5889j44699m9689R1690K10048K738n0516o3416j8684J04055j7447J0619
6383A8810J09316Q0525o8033l9490J4518M4335j7273k3026P6332k20585L9199
$$ plain form
6372 14628 -30099 -96097 -153917 -280831 -231921 -85791 -65640 -151080 -221212 -118068 -41538
6361 -41538 -26432 -85030 -60575 120217 64434 39772 17213 93179 115078 14047 -47295
6350 -47295 5370 16265 -11179 -7975 -7474 -59000 -234358 -194269 -224482 -213469 -99427 -45565
6338 -45565 12888 16113 -116612 -189260 -147481 -153040 -97577 -2262 -9222 -46285 -90961 -46805
6326 -46805 19820 196583 161863 16251 -60314 -133268 -113758 -262684 -160599 -48995 89048
6315 89048 61765 80149 201601 154660 68709 -55096 -187526 -160948 124364 215250 156147
6304 156147 153003 227352 248131 304650 195966 -52916 -65739 8193 13358 -61694 -25345 -68170
6292 -68170 -30559 69064 84292 -99029 -269911 -74416 8120 -23490 -113535 -94802 -75196
$$ packed form
6372A4628m4727o5998n7820j26914M8910J46130K0151q5440p0132J03144P6530
6361d1538J5106n8598K4455J80792n5783k4662k2559P5966K1899j01031o1342
6350d7295N2665J0895k7444L204N01n1526j75358M0089l0213J1013J14042N3862
6338d5565N8453L225j32725p2648M1779n559N5463R5315o960l7063m4676M4156
6326d6805O6625J76763l4720j45612p6565p2954J9510j48926J02085J11604J38043
6315H9048k7283J8384J21452m6941q5951j23805j32430K6578K85312R0886n9103
6304A56147l144P4349K0779N6519j08684k48882j2823P3932N165p5052L6349m2825
6292f8170L7611R9623J5228j83321j70882J95495Q2536l1610r0045J8733J9606
$$ plain form
6281 -75196 -158020 -171958 -63832 -113087 -107285 -59641 -52301 -188660 -62718 83753 -3685
6270 -3685 -71378 -26224 -31019 -132205 -151058 -223868 -147755 -60824 -58453 -79622 -40023 -80333
6258 -80333 -99650 -178233 -196097 -176942 -97022 -24292 22339 138182 129357 123099 49244 -13584
6246 -13584 -12915 -73615 -56018 -32906 -88209 862 6063 142901 87680 -37224 -27734 69858
6234 69858 -37749 1702 -62192 -80292 -113174 -129043 -207084 -61003 -14230 -7193 -58408 19068
6222 19068 -12261 -151110 -171827 -62021 148308 163256 146803 12383 -76914 -84720 -97433
6211 -97433 -76428 38972 98719 -53285 -17553 43374 76865 50778 155434 162051 6090
6200 6090 -79621 36572 96511 11220 -47204 -114530 -109363 -10751 -68560 -182383 -255752 -238935
$$ packed form
6281g5196q2824j3938J08126m9255N802M7644P340j36359J25942J46471q7438
6270c685o7693M5154m795j01186j8853p2810P6113Q6931K371k1169L9599m0310
6258h0333j9317p8583j7864J9155P9920P2730M6631J15843q825o258p3855o2828
6246a3584O69o0700J7597K3112n5303Q9071N201J36838n5221j24904R490R7592
6234F9858j07607L9451o3894j8100l2882j5869p8041J46081M6773P037n1215P7476
6222A9068l1329j38849k0717J09806K10329J4948j6453j34420q9297p806j2713
6211i7433K1005J15400N9747j52004L5732O0927L3491k6087J04656O617j55961
6200F090q5711J16193N9939q5291n8424o7326N167R8612n7809j13823p3369J6817
$$ plain form
6188 -238935 -87594 -131941 -179691 -171714 -98443 -24806 -34326 80135 38155 7529 -100232
6177 -100232 -262956 -210534 2806 51543 28490 67280 78237 -15412 4702 37278 -54274
6166 -54274 -149174 -142663 -104522 -55803 -117103 -143421 -68836 -77636 -225171 -254590 -236196 -302108
6154 -302108 -273946 -255640 -246470 -72097 36593 -31003 -33249 -34800 -221385 -246460 -37401
6143 -37401 121046 167778 162620 156714 134137 73288 2609 -86270 -62197 142732 308232 231267
6131 231267 -48150 -94482 24506 110600 99903 10026 45581 103949 68400 -108572 -292758
6120 -292758 -314531 -182751 -17527 -33706 -35077 -85631 -54469 -29699 -59194 -78627 -61152
6109 -61152 -66809 -100187 -68716 678 -11959 -39346 -49898 -37284 -41447 -98989 -196347 -101762
$$ packed form
6188b38935J51341m4347m7750P977P3271P3637r520J14461m1980l0626j07761
6177a00232j62724N2422K13340M8737k3053L8790J0957r3649K0114L2576r1552
6166e4274r4900O511L8141M8719o1300k6318P4585q800j47535k9419J8394o5912
6154c02108K8162J8306R170J74373J08690o7596k246j551j86585k5075K09059
6143c7401J58447M6732n158n906k2577o0849p0679q8879K4073K04929J65500p6965
6131B31267k79417m6332J18988Q6094j0697q9877L5555N8368l5549j76972j84186
6120b92758k1773J31780J65224j6179j371n0554L1162K4770k9495j9433J7475
6109f1152n657l3378L1471O9394j2637k7387j0552J2614m163n7542r7358R4585
$$ plain form
6097 -101762 -72168 -174150 -188863 -19440 78637 113267 28083 492 20910 53087 66391
6086 66391 -23228 -162567 -163782 82056 263388 118554 75170 106929 162351 -168 -59499
6075 -59499 -134566 -164073 -196402 -61616 -701 -56044 -202583 -373458 -237238 -139921 -95790
6064 -95790 -73771 -55417 -146871 -66809 -10892 57338 9640 -30372 -32524 -27961 -21532 18779
6052 18779 2306 75303 85595 -7506 -46133 80372 -2404 -84673 -29606 27352 -71357 -78317
6040 -78317 -115443 -128708 -83089 -8720 142413 199706 -43700 -148553 -150687 -175382 -252895
6029 -252895 -345491 -359357 -236861 -254153 -206378 -97636 -59304 -63015 -16995 119401 235802
6018 235802 118325 -224101 -232752 -106645 -18655 81963 -62596 -117088 -49335 89610 53578
$$ packed form
6097a01762K9594j01982j4713J69423R8077L4630q5184k7591K0418L2177J3304
6086F6391q9619j39339j215K45838J81332j44834m3384L1759N5422j62519n9331
6075e9499p5067k9507l2329J34786O0915n5343j46539j70875J36220R7317M4131
6064i5790K2019J8354r1454Q0062N5917O8230m7698m0012k152M563O429M0311
6052A8779j6473P2997J0292r3101l8627J26505q2776q2269N5067N6958r8709o960
6040g8317l7126j3265M5619P4369J51133N7293k43406j04853k134k4695p7513
6029b52895r2596j3866J22496j7292M7775J08742L8332l711M6020J36396J16401
6018B35802j17477l42426q651J26107Q7990J00618j44559n4492O7753J38945l6032
$$ plain form
6007 53578 -25743 41455 231298 242804 272506 376544 248811 145504 -9960 -72291 45529
5996 45529 61822 148707 140459 7289 -126614 -156358 -77826 -71535 -14304 152406 290682
5985 290682 272700 268076 169057 52908 42214 45704 67487 34971 1561 -45269 -91292 -142503
5973 -142503 -112223 -46266 42447 153611 223164 239485 108285 -62891 -110765 -131959 -50010
5962 -50010 -52143 -199883 -167096 29004 59852 32326 -17071 36631 20766 12554 32262 125376
5950 125376 163542 173361 75772 134015 -11348 -20242 -129771 -212014 -98970 -77449 -189205
5939 -189205 -124088 -33646 -221832 -399974 -347430 -266873 -159592 -82804 -290567 -353890 -219172
5928 -219172 -43490 -115806 -78449 -78563 -50689 -102579 -54223 19482 -38460 -117709 -101845 -135424
$$ packed form
6007E3578p9321O7198J89843J1506K9702J04038j27733j03307j55464o2331J17820
5996D5529J6293Q6885q248j33170j33903k9744P8532O291N7231J66710J38276
5985B90682j7982m624r9019j16149j0694L490K1783l2516l3410m6830m6023n1211
5973a42503L0280O5957Q8713J11164O9553J6321j31200j71176m7874k1194Q1949
5962e0010k133j47740L2787J96100L0848k7526m9397N3702j5865q212J9708R3114
5950A25376L8166R819r7589N8243j45363q894j09529q2243J13044K1521j11756
5939a89205O5117R0442j88186j78142N2544Q0557J07281P6788k07763o3323J34718
5928b19172J75682p2316L7357j14K7874n1890M8356P3705n7942p9249J5864l3579
$$ plain form
5916 -135424 -105164 -20307 32575 -3269 -9043 21977 152592 138243 140529 200851 200662 320205
5904 320205 343739 152218 -77198 46862 4090 -163458 -237083 -175635 -214620 -220103 -25994
5893 -25994 85928 160435 235915 186552 118673 110943 -18042 -3036 -49647 -97459 -115020 -56914
5881 -56914 -53310 -15186 76772 77037 106768 95873 54817 143033 86368 75788 104629 92943
5869 92943 44559 -34938 -150572 -114812 -175832 -254703 -291272 -101256 100233 283255 293521
5858 293521 128491 -49196 -51280 6274 37223 -18237 -137707 -151454 -97344 -11969 -36644
5847 -36644 -66530 17776 4177 -17583 79731 107310 101940 74309 88712 -70848 -84203 -89359
5835 -89359 -152691 -85689 42705 148427 193950 60279 -126807 -147211 -97826 -117153 21431
$$ packed form
5916a35424L0260Q4857N2882l5844n774L1020J30615j4349K286O0322j89J19543
5904C20205K3534j91521k29416J24060m2772j67548p3625O1448l8985n483J94109
5893b5994J11922P4507P5480m9363o7879p730j28985J5006m6611m7812j7561N8106
5881e6914L604L8124R1958K65K9731j0895m1056Q8216n6665j0580K8841j1686
5869I2943m8384p9497j15634L5760o1020p8871l6569J90016K01489J83022J0266
5858B93521j65030j77687k084N7554L0949n5460j19470j3747N4110Q5375k4675
5847c6644k9886Q4306j3599k1760R7314K7579n370k7631J4403j59560j3355n156
5835h9359o3332O7002J28394J05722M5523j33671j87086k0404M9385j9327J38584
$$ plain form
5824 21431 72559 -77630 -147458 -190640 -261125 -239856 -370283 -203615 -263338 -192846 -107299
5813 -107299 -75986 85876 110814 71166 -9022 -118714 -201402 2677 111329 19532 46832
5802 46832 126557 -10398 -32973 22274 81869 169133 146973 150774 151842 141884 125042 -28243
5790 -28243 -147973 -74017 75770 -68045 -135217 -179112 -152423 -227316 -261617 -121967 -61353
5779 -61353 -143666 -69215 8641 -138844 -182765 -177824 -184787 -272097 -38841 84454 64097 56257
5767 56257 -98905 -280380 -288985 -268562 -203547 -206275 -162152 -130362 -135489 -33851 13607 99989
5755 99989 33204 -42994 -67248 -33858 -44747 -58500 56257 96252 96865 152588 74292 96334
5743 96334 150387 73885 94978 118647 -7069 -232118 -189817 -64211 -127400 -97712 -35249
$$ packed form
5824B1431N1128j50189o9828m3182p0485K1269j30427J66668n9723P0492Q5547
5813a07299L1313J61862K4938l9648q0188j09692q2688K04079J08652r1797K7300
5802D6832P9725j36955k2575N5247N9595Q7264k2160L801J068r958j6842j53285
5790b8243j19730P3956J49787j43815o7172m3895K6689p4893l4301J39650O0614
5779f1353q2313P4451P7856j47485m3921M941o963q7310K33256J23295k0357p840
5767E6257j55162j81475q605K0423O5015k728M4123L1790n127J01638M7458Q6382
5755I9989o6785p6198k4254L3390j0889j3753J14757L9995O13N5723p8296K2042
5743I6334N4053p6502K1093K3669j25716k25049M2301J25606o3189K9688O2463
$$ plain form
5732 -35249 -31731 -131349 -170989 -129386 -140251 -73856 -2652 5462 -105104 -55887 33347 21314
5720 21314 -75997 -130064 -81340 -47788 -29393 36967 108888 38865 120622 242975 135701
5709 135701 -19053 -160624 34512 155496 90937 14597 -75161 -186872 5096 26071
5699 26071 -2063 -62297 21160 -48438 44064 -122253 -218946 -157714 -151483 -72724 2306 41841
5687 41841 -25082 -5792 160573 160332 96522 102761 86568 14965 104026 232466 168257 200263
5675 200263 169119 56801 88911 81784 275982 315892 188409 11519 -14439 3403 132646
5664 132646 153536 139365 102125 88843 171762 254845 242198 92574 66335 45951 22698
5653 22698 -39148 -80867 57398 159269 61998 -18828 92110 127274 11738 7447 -21714
$$ packed form
5732c5249L518r9618l9640M1603j0865O6395P1204Q114j10566M9217Q9234j2033
5720B1314r7311n4067M8724L3552J8395O6360P1921p0023Q1757J22353j07274
5709A35701j54754j41571J95136J20984o4559p6340q9758j11711J91968K0975
5699B6071k8134o0234Q3457o9598R2502j66317r6693O1232O231P8759P5030L9535
5687D1841o6923J9290J66365k41o3810O239j6193p1603Q9061J28440o4209L2006
5675B00263l1144j12318L2110p127J94198L9910j27483j76890k5958J7842J29243
5664A32646K0890j4171l7240j3282Q2919Q3083j2647j49624k6239k0384k3253
5653B2698o1846m1719J38265J01871r7271q0826J10938L5164j15536m291k9161
$$ plain form
5642 -21714 -6672 -13293 -25204 -21137 -18442 -29148 52030 102371 10419 -33621 -38437 77419
5630 77419 105925 -91550 -204069 -89683 -47557 121688 144344 -9009 -89038 -140479 -99247
5619 -99247 -14528 -102892 -147608 -187858 -241353 -213749 -174886 -128910 -143014 -160698 -267997 -269697
5607 -269697 -254061 -298004 -154993 -78536 12920 106428 138022 53082 84035 116827 61862
5596 61862 -84086 -194723 -218317 -231041 -284718 -156632 -100791 30281 82186 -58396 -52655
5585 -52655 -68354 -11871 24768 74333 -20916 -137193 -141068 -19004 67534 153226 254278
5574 254278 283426 316513 155166 99098 37726 -136270 -195223 -128790 -177500 -212419 -283192
5563 -283192 -262567 -222413 -113123 4309 -3036 -28970 51379 -70281 -146325 -51391 111785
$$ packed form
5642b1714J5042o621j1911M067K695j0706Q1178N0341r1952m4040m816J15856
5630G7419K8506j97475j12519J14386M2126J69245K2656j53353q0029n1441M1232
5619i9247Q4719q8364m4716m0250n3495K7604L8863M5976j4104j7684j07299j700
5607b69697J5636m3943J43011P6457R1456R3508L1594q4940L0953L2792n4965
5596F1862j45948j10637k3594j2724n3677J28086N5841J31072N1905j40582N741
5585e2655j5699N6483L6639M9565r5249j16277l875J22064Q6538Q5692J01052
5574B54278K9148L3087j61347n6068o1372j73996n8953O6433m8710l4919p0773
5563b83192K0625M0154J09290J17432p345k5934Q0349j21660p6044R4934J63176
$$ plain form
5552 111785 198976 191410 16356 -117017 -198352 -197586 -214138 -137369 -44942 -73207 -127697 -234728
5540 -234728 -273100 -168691 -18658 31548 72002 193105 60880 -98821 -238337 -59838
5530 -59838 53495 97064 128884 118475 78067 49893 152534 265784 248117 120639 89355
5519 89355 -178581 -253083 -140855 -125063 -128857 -46367 -95063 -29109 146979 291760 187657
5508 187657 -145433 -116666 4205 53925 123572 -36171 -45760 -53116 -48145 40040 34295 -65026
5496 -65026 -19053 -70037 -103440 -40936 -40881 -113126 -50684 6226 -31764 -104408 -72809 -48987
5484 -48987 -56281 -74153 -129143 -230390 -231570 -51112 84447 18612 -60525 -104997 -74628 -81912
5472 -81912 -142511 -27803 -122341 -23198 141643 187373 115656 -38109 52396 100737 99237
$$ packed form
5552A11785Q7191p566j75054j33373q1335P66j6552P6769R2427k8265n4490j07031
5540b34728l8372J04409J50033N0206M0454J21103j32225j59701j39516J78499
5530e9838J13333M3569L1820j0409m0408k8174J02641J13250j7667j27478l1284
5519H9355k67936p4502J12228J5792l794Q2490m8696O5954J76088J44781j04103
5508A87657l33090K8767J20871M9720O9647j59743r589p356M971Q8185n745r9321
5496f5026M5973n0984l3403O2504N5p2245O2442N6910l7990p2644L1599K3822
5484d8987p294j7872n4990j01247j180J80458J35559o5835p9137m4472L0369p284
5472h1912o0599J14708r4538R9143J64841M5730p1717j53765R0505M8341j500
$$ plain form
5461 99237 87009 67657 158322 205661 112299 -34278 -45126 -191374 -205650 -219602 -118855
5450 -118855 -108870 -50267 -25059 -125972 -96743 -16534 -46688 -85593 -138359 -41061 -131110 -201830
5438 -201830 -194399 -47053 -15904 26795 6625 -86328 -19864 -48372 -146615 -122366 -72828 -142645
5426 -142645 -68921 63228 163206 234468 105657 81075 -62790 -168262 -26984 38759 -23300
5415 -23300 -168769 -248753 -82276 206333 194880 -26033 18275 -62388 -80740 -75052 51736
5404 51736 178173 271006 270858 209084 45706 83313 131014 220813 265849 223892 171500 164116
5392 164116 -19533 -82260 31747 159601 170703 181468 116422 143805 141359 119648 72689
5381 72689 -34219 -69484 -14998 -67397 -148043 -45408 -60772 -190943 -148448 -104428 -40929
$$ packed form
5461I9237j2228j9352R0665M7339r3362j46577j0848j46248j4276j3952J00747
5450a18855R985N8603K5208j00913K9229Q0209l0154l8905n2766R7298r0049p0720
5438b01830P431J47346L1149M2699k0170r2953O6464k8508r8243K4249M9538o9817
5426a42645P3724J32149R9978P1262j28811k4582j43865j05472J41278O5743o2059
5415b3300j45469p9984J66477K88609j1453k20913M4308q0663j8352N688J26788
5404E1736J26437R2833j48o1774j63378L7607M7701Q9799M5036m1957n2392p384
5392A64116j83649o2727J14007J27854J1102J0765o5046K7383k446k1711m6959
5381G2689j06908l5265N4486n2399q0646J02635j5364j30171M2495M4020O3499
$$ plain form
5370 -40929 -84433 -139849 -227143 -249179 -208165 -212684 -215696 -224901 -133110 -47539 -71615 -9942
5358 -9942 56691 94683 135934 7541 14944 7679 -16698 -23738 85965 41626 -3543 68885
5346 68885 186056 216798 193356 105467 -54630 -120862 -186021 -193500 -197019 -229952 -184700 -183196
5334 -183196 -210370 -213706 -231955 -122984 -45308 -96055 -210161 -238587 -178207 -120764 -61283
5323 -61283 23419 30316 -26331 -98212 -65185 -14030 -5 -10441 105914 151084 153060 133442
5311 133442 48348 65492 162506 216069 167156 100845 78616 49576 31867 145761 86310
5300 86310 105161 89347 79883 123239 -33326 -162752 -55930 -17967 -97876 -217331 -228264
5289 -228264 -173271 -28453 18220 102718 101355 26056 9168 5525 -72027 -71895 -54174 -92124
$$ packed form
5370d0929m3504n5416q7294k2036M1014m519l012r205R1791Q5571k4076O1673
5358i942O6633L7992M1251j28393P403p265k4377p040J09703m4339m5169P2428
5346F8885J17171L0742k3442q7889j60097o6232o5159p479l519l2933M5252J504
5334a83196k7174l336j8249J08971P7676n0747j14106k8426O0380N7443N9481
5323f1283Q4702O897n6647p1881L3027N1155J4025j0436J16355M5170J976j9618
5311A33442q5094J7144R7014N3563m8913o6311k2229k9040j7709J13894n9451
5300H6310J8851j5814r464M3356j56565j29426J06822L7963p9909j19455j0933
5289b28264N4993J44818M6673Q4498j363p5299j6888l643p7552J32J7721l7950
$$ plain form
5277 -92124 -114332 -103534 21957 70238 3926 -87137 -86940 -5334 3848 -133619 -102292 115471
5265 115471 85665 36131 180920 210780 205339 188670 31054 -36559 5228 122177 49689
5254 49689 -93436 -264033 -247785 -235142 -129351 -112019 -85977 73483 80056 -62382 -165250
5243 -165250 -93580 -5457 54254 65768 43415 187084 138454 7383 92636 71770 56578
5232 56578 31153 -61972 -16004 39861 -58664 -102422 -148145 -95243 -142030 -22336 12341 -39597
5220 -39597 -80062 -70858 -76096 4820 36680 15842 162142 276548 289785 324645 322295 142657
5208 142657 70167 81063 187244 219269 67780 -49845 -4220 7090 25362 44894 -32307
$$ packed form
5277i2124k2208J0798J25491M8281o6312r1063J97Q1606R182j37467L1327K17763
5265A15471k9806m9534J44789K9860n441j6669j57616o7613M1787J16949p2488
5254D9689j43125j70597J6248J2643J05791J7332K6042J59460O573j42438j02868
5243a65250P1670Q8123N9711J1514k2353J43669m8630j31071Q5253k0866j5192
5232E6578k5425r3125M5968N5865r8525m3758m5723N2902m6787J19694L4677n1938
5220c9597m0465R204n238Q0916L1860k0838J46300J14406J3237L4860k350j79638
5208A42657p2490J0896J06181L2025j51489j17625M5625J1310J8272J9532p7201
$$ [...]
##END NTUPLES=NMR SPECTRUM
##END=
