##TITLE=Analysis number 317447
Compound Code ac 35937
Project Code qc-cat
Chemist Name ddc weighroom
##JCAMPDX= 6.0         $$ Bruker NMR JCAMP-DX V2.0
##DATA TYPE= NMR SPECTRUM
##DATA CLASS= NTUPLES
##ORIGIN= Bruker BioSpin GmbH
##OWNER= nmr
$$ XWIN-NMR		Version 3.5
$$ Mon Feb 20 17:10:07 2006 GMT Standard Time (UT+0h)  MAYBRIDGE\nmr@NMR_250MHZ
##.OBSERVE FREQUENCY= 250.131544655141
##.OBSERVE NUCLEUS= ^1H
##.ACQUISITION MODE= SIMULTANEOUS (DQD)
##.ACQUISITION SCHEME= undefined
##.AVERAGES= 16
##.DIGITISER RES= 18
##SPECTROMETER/DATA SYSTEM= dpx250
##.PULSE SEQUENCE= zg30
##.SOLVENT NAME= DMSO
##.SHIFT REFERENCE= (INTERNAL, DMSO, 0, 16.522)
##AUDIT TRAIL= $$ (NUMBER, WHEN, WHO, WHERE, WHAT)
$$ ##TITLE= Audit trail, XWIN-NMR		Version 3.5
$$ ##JCAMPDX= 5.01
$$ ##ORIGIN= Bruker BioSpin GmbH
$$ ##OWNER= nmr
$$ C:\u/data/dgb/nmr/ADRS/16420/pdata/1/auditp.txt
$$ ##AUDIT TRAIL=  $$ (NUMBER, WHEN, WHO, WHERE, WHAT)
(   1,<2006-02-20 17:09:23.57 +000>,<MAYBRIDGE\nmr>,<NMR_250MHZ>,
      <created by zg, POWCHK disabled, PULCHK disabled
       configuration hash MD5:
       84 BC 41 DB A1 6E 1D 46 DA 25 12 A5 C1 ED C5 3A
       data hash MD5: 64K
       24 EB 41 3B C3 90 E0 2F 9A CB E8 5D 0A BA 96 11>)
(   2,<2006-02-20 17:09:44.09 +000>,<MAYBRIDGE\nmr>,<NMR_250MHZ>,
      <Start of raw data processing
       ef LB = 0.3 FT_mod = 6 PKNL = 1 SI = 32K 
       data hash MD5: 32K
       51 E7 F3 30 8A 4B D2 60 1B 6F 93 F4 CC 31 03 9D>)
(   3,<2006-02-20 17:09:48.07 +000>,<MAYBRIDGE\nmr>,<NMR_250MHZ>,
      <apk 
       data hash MD5: 32K
       5D 74 8E 35 1D D9 CE BF 96 BD BE BB 29 B8 0A 8D>)
(   4,<2006-02-20 17:09:49.32 +000>,<MAYBRIDGE\nmr>,<NMR_250MHZ>,
      <abs ABSG = 5 
       data hash MD5: 32K
       70 C3 AF A3 47 A5 68 B3 A9 85 F2 38 9A 6E A0 24>)
$$ ##END=
$$ 
$$ hash MD5
$$ 66 DD E6 CF ED AE F0 87 8D 8C 19 07 F8 AF 74 D9
##$RELAX= 
##$RELAX= 
##$RELAX= 
##$RELAX= 
##$RELAX= 
##$RELAX= 
##$RELAX= 
$$ Bruker specific parameters
$$ --------------------------
##$DU= <C:\u>
##$EXPNO= 16420
##$NAME= <ADRS>
##$PROCNO= 1
##$TYPE= <nmr>
##$USER= <dgb>
##$AMP= (0..31)
100 100 100 100 100 100 100 100 100 100 100 100 100 100 100 100 100 100 
100 100 100 100 100 100 100 100 100 100 100 100 100 100 
##$AQSEQ= 0
##$AQ_mod= 3
##$AUNM= <au_zg>
##$AUTOPOS= <56 >
##$BF1= 250.13
##$BF2= 250.13
##$BF3= 250.13
##$BF4= 250.13
##$BF5= 500.13
##$BF6= 500.13
##$BF7= 500.13
##$BF8= 500.13
##$BYTORDA= 1
##$CFDGTYP= 0
##$CFRGTYP= 5
##$CHEMSTR= <none>
##$CNST= (0..31)
1 1 145 1 1 1 1 1 1 1 1 1 1 1 1 1 1 1 1 1 1 1 1 1 1 1 1 1 1 1 1 1 
##$CPDPRG= <>
##$CPDPRG1= <>
##$CPDPRG2= <>
##$CPDPRG3= <>
##$CPDPRG4= <mlev>
##$CPDPRG5= <mlev>
##$CPDPRG6= <mlev>
##$CPDPRG7= <mlev>
##$CPDPRG8= <mlev>
##$CPDPRGB= <>
##$CPDPRGT= <>
##$D= (0..31)
0 1 0 0 0 0 0 0 0 0.06 0 0 0 0 0 0 0.0002 0 0 0 0 0 0 0 0 0 0 0 0 0 0 
0 
##$DATE= 1140455361
##$DBL= (0..7)
120 120 120 120 120 120 120 120 
##$DBP= (0..7)
150 150 150 150 150 150 150 150 
##$DBP07= 0
##$DBPNAM0= <>
##$DBPNAM1= <>
##$DBPNAM2= <>
$$ [...]
##$SUBNAM7= <"">
##$SUBNAM8= <"">
##$SUBNAM9= <"">
##$SW= 20.6930455092707
##$SWIBOX= (0..15)
0 0 3 0 0 0 0 0 0 0 0 0 0 0 0 0 
##$SW_h= 5175.983436853
##$TD= 65536
##$TD0= 1
##$TE= 294.16
##$TE2= 300
##$TE3= 300
##$TEG= 300
##$TL= (0..7)
0 120 120 120 120 120 120 120 
##$TP= (0..7)
150 150 150 150 150 150 150 150 
##$TP07= 0
##$TPNAME0= <>
##$TPNAME1= <>
##$TPNAME2= <>
##$TPNAME3= <>
##$TPNAME4= <>
##$TPNAME5= <>
##$TPNAME6= <>
##$TPNAME7= <>
##$TPOAL= (0..7)
0.5 0.5 0.5 0.5 0.5 0.5 0.5 0.5 
##$TPOFFS= (0..7)
0 0 0 0 0 0 0 0 
##$TUNHIN= 0
##$TUNHOUT= 0
##$TUNXOUT= 0
##$USERA1= <user>
##$USERA2= <user>
##$USERA3= <user>
##$USERA4= <user>
##$USERA5= <user>
##$V9= 5
##$VALIST= <valist>
##$VCLIST= <CCCCCCCCCCCCCCC>
##$VD= 0
##$VDLIST= <DDDDDDDDDDDDDDD>
##$VPLIST= <PPPPPPPPPPPPPPP>
##$VTLIST= <TTTTTTTTTTTTTTT>
##$WBST= 1024
##$WBSW= 4
##$XGAIN= (0..3)
0 0 0 0 
##$XL= 0
##$YL= 0
##$YMAX_a= 310790
##$YMIN_a= -460967
##$ZGOPTNS= <>
##$ZL1= 120
##$ZL2= 120
##$ZL3= 120
##$ZL4= 120
##$ABSF1= 16.522
##$ABSF2= -4.171173
##$ABSG= 5
##$ABSL= 3
##$ALPHA= 0
##$AQORDER= 0
##$ASSFAC= 0
##$ASSFACI= 0
##$ASSFACX= 0
##$ASSWID= 0
##$AUNMP= <proc_1d>
##$AZFE= 0.1
##$AZFW= 0.1
##$BCFW= 0
##$BC_mod= 0
##$BYTORDP= 0
##$COROFFS= 0
##$CY= 12.5
##$DATMOD= 1
##$DC= 0
##$DFILT= <>
##$DTYPP= 0
##$F1P= 14.0000005364418
##$F2P= -0.99999901652339
##$FCOR= 0.5
##$FTSIZE= 32768
##$FT_mod= 6
##$GAMMA= 0
##$GB= 0
##$INTBC= 1
##$INTSCL= 1
##$ISEN= 128
##$LB= 0.3
##$LEV0= 0
##$LPBIN= 0
##$MAXI= 10000
##$MC2= 0
##$MEAN= 0
##$ME_mod= 0
##$MI= 0
##$NCOEF= 0
##$NC_proc= -5
##$NLEV= 6
##$NOISF1= 0
##$NOISF2= 0
##$NSP= 0
##$NTH_PI= 0
##$NZP= 0
##$OFFSET= 16.522
##$PC= 1
##$PHC0= 235.9507
##$PHC1= 9.184311
##$PH_mod= 1
##$PKNL= yes
##$PPARMOD= 0
##$PSCAL= 4
##$PSIGN= 0
##$REVERSE= no
##$SF= 250.13
##$SI= 32768
##$SIGF1= 0
##$SIGF2= 0
##$SINO= 400
##$SIOLD= 32768
##$SREGLST= <1H.DMSO>
##$SSB= 0
##$STSI= 32768
##$STSR= 0
##$SW_p= 5175.98343685301
##$SYMM= 0
##$S_DEV= 0
##$TDeff= 65536
##$TDoff= 0
##$TI= <Analysis number 999999
Compound Code 99
Book Reference 9
Project Code 9>
##$TILT= no
##$TM1= 0
##$TM2= 0
##$TOPLEV= 0
##$USERP1= <user>
##$USERP2= <user>
##$USERP3= <user>
##$USERP4= <user>
##$USERP5= <user>
##$WDW= 1
##$XDIM= 32768
##$YMAX_p= 532330410
##$YMIN_p= -932035
$$ End of Bruker specific parameters
$$ ---------------------------------
##NTUPLES= NMR SPECTRUM
##VAR_NAME=  FREQUENCY,     SPECTRUM/REAL,   SPECTRUM/IMAG
##SYMBOL=    X,             R,               I
##VAR_TYPE=  INDEPENDENT,   DEPENDENT,       DEPENDENT
##VAR_FORM=  AFFN,          ASDF,            ASDF
##VAR_DIM=   32768,         32768,           32768
##UNITS=     HZ,            ARBITRARY UNITS, ARBITRARY UNITS
##FACTOR=    0.157963299565203, 1,           1
##FIRST=     4132.6476996994, 0,             0
##LAST=      -1043.33573715361, 0,           0
##MIN=       -1043.33573715361, -932035,     0
##MAX=       4132.6476996994, 532330410,     0
$$ Real data points
##PAGE= N=1
##DATA TABLE= (X++(R..R)), XYDATA
$$ [...]
27613c27789N056J39270L92074R7369k26025J9649n1525m2322l70897J4637Q9136
27602b61367O9029q06O0590O0376J02403J5388j43052K11696J08920l0150J43941
27591C36968k30305j46540n782l0239j52551r3544L9039J51166m5074o429j68282
27580c51573J17814L73213J64348M5112l8784K57802k22831k33520j00467J45498
27570A56612j92194j31798P8166o337J55518L28342j63497l79173j148K24340
27560F8831L2018M2703L45132J4521N7898k55610k40469Q4457M1496r4314J21054
27549B17717N3755m7716p9503J03512l048k41923O5469L10457N3936L7794O5605
27538E36055K017q2846p6063o3149j51748j35601M6704j67765R3605j0625M2614
$$ y = [-327789, -322733, -183463, 208611, 305980, 79955, 99604, 48079, 5757, -365140, -350503, -261367, -192338, -193144, -132554, -72178, 30225, 45613, -97439, 114257, 223177, 193027, 336968, 106663, -39877, -45659, -75898, -228449, -321993, -282954, -131788, -176862, -183291, -351573, -233759, 139454, 303802, 348914, 310130, 567932, 345101, 111581, 11114, 156612, -35582, -167380, -89214, -95551, 59967, 388309, 224812, -154361, -155509, 68831, 100849, 143552, 488684, 503205, 561103, 305493, 65024, 149481, 190977, 96663, 217717, 271472, 223756, 144253, 247765, 244717, 2794, 68263, 378720, 432656, 470450, 536055, 538072, 455226, 379163, 316014, 164266, 28665, 75369, -92396, 1209, -9416, 33198]
27527C3198J1381k20773J4683J63735o2760K14583L10673k8000k01374k8948K54696
27516D61094l8674j88593m5259j71772j01692K76108p0534k87244J5903k2044
27506a72707O3230j38974J13662K75184m4657j88937K43043N449k23309j48168
27496b16184n1793M0924Q6799L26928j16266j11981J4810N2951P3030O4981K27044
27485C91243P8318N8373Q5559L7291P303N5233k7766k39824j13293k10059j00628
27474B1750k57697L0094k12Q8989m386J36059J12416j40277K55559j0016j23284
27463A08995k5461J33387K0524j29185n2633o1977k0412N1433J76121j45403J79840
27452B35229J87661K07570k1840k16556j52873M8523j627j43492l421k8344k14774
$$ y = [33198, 44579, -176194, -161511, 2224, -60536, 154047, 464720, 436720, 235346, 206398, 461094, 422420, 233827, 188568, 16796, -84896, 191212, 120678, -166566, -150663, -172707, -109477, -248451, -134789, 140395, 95738, -93199, 149844, 155293, -68016, -216184, -267977, -227053, -140254, 186674, 70408, -41573, -26763, 26188, 99218, 164199, 391243, 469561, 527934, 613493, 650784, 658087, 713320, 685554, 445730, 332437, 122378, 21750, -235947, -205853, -206065, -117076, -121462, 14597, 127013, -13264, 242295, 232279, 108995, 83534, 216921, 237445, 108260, 55627, -6350, -26762, 24671, 200792, 55389, 235229, 422890, 630460, 608620, 392064, 239191, 287714, 286087, 142595, 139174, 110830, -103944]
27441a03944r4405J5489J2001O3174J01248K55688j17130k7128j20665k47927
27431b63599J62974J46872j33329j7689J17360r3269k14806L37893K67317J65821
27421D75545K7176j0435k53578l00793k48094M6770J89590p6749j07257m663J84657
27410g7831L3334J20042M5754j29158k29289O2806k9721J19180J78281J85132
27400B78530r7934l84462j95654j48896M82K7920J7008J74055K7320N928N2193
27389b43510m8644r8903k69572M3164L02687L53136P9330m6499N9673J42642P7042
27378C50546j54953j70512Q4019j783L5911P8277L8106j28908j36740O9838N75014
27367F38815k280l39447j78507p0724l0187o4007L2037j20324K24267n0407j00081
$$ y = [-103944, -198349, -182860, -170859, -107685, -6437, 249251, 132121, 104993, -15672, -263599, -100625, 46247, -87082, -104771, 12589, -80680, -295486, 42407, 309724, 475545, 502721, 492286, 238708, -62085, -310179, -263409, -73819, -150568, -257825, -262488, -77831, -44497, 75545, 121299, -7859, -237148, -174342, -204063, -84883, 93398, 278530, 180596, -203866, -399520, -548416, -547934, -520014, -503006, -328951, -301631, -295703, -243510, -292154, -391057, -660629, -617465, -314778, 38358, 117688, 71189, 130862, 273504, 350546, 195593, 25081, 109100, 107317, 143228, 221505, 259611, 130703, -6037, 63801, 638815, 636535, 297088, 118581, 47857, 17670, -46337, -14300, -134624, 89643, 39236, -60845]
27356f0845J43265j13141l9789j15849j98479o0640L32870l675j74165o829P2576
27345b24701O4114R6127j74851q4675r6780J57803N7377n0153J60004K29820J49102
27334B83187J68025K48112m4525l20069j95496m1107j87909n4918k07164J00881
27324b50983J34401P3565Q3568J30169n0494l69204o6181r4618J21749Q3548j0082
27313b14562J01486J9014J43789Q2428j15121j66035k9236o59N6205J2173P8073
27302c2445Q6767J80583L1934j77668o7223J72378K15682K11843R6983M4473l32777
27291D30530j75989j6637l7802n3314j07440J48305J41069J0169j08381k03359
27281B7151J34791m5223J60765P5231m6268k65873j88725j43801K50016L20665
$$ y = [-60845, 82420, -30721, -70510, -186359, -384838, -445478, -112608, -116283, -290448, -297277, -224701, -160587, -64460, -239311, -323986, -420766, -262963, -205586, -255739, -95735, 134085, 283187, 451212, 699324, 654799, 334730, 139234, 98127, -89782, -144700, -351864, -250983, -116582, -43017, 40551, 170720, 120226, -248978, -315159, -409777, -288028, -204480, -214562, -113076, -94062, 49727, 132155, 17034, -149001, -178237, -178896, -122691, -110518, -32445, 54322, 234905, 266839, 89171, 21948, 194326, 410008, 621851, 718834, 763307, 430530, 254541, 237904, 200102, 146788, 39348, 187653, 328722, 338891, 230510, 27151, 161942, 116719, 277484, 352715, 306447, 40574, -148151, -291952, -41936, 278729]
27271B78729L31917J31543q4547k25519l78222p5146J8411n4302K44032K60188
27261D47084k4671j78945N4020K1713m2443J58538n9999L5100j07733k1659J27017
27250D08022j31102j75186j97268j56797J31440K22453J03644k46633j37537J63251
27240a5713L461J81084M44462K2683J45613k28350k19860j85002j94889q6714
27230a33225J24289R3749P8351J8271K72423J11903k48093p8411j27794j39164
27220b7701Q3838j20195k74016j64089L16031J90889k66265k80865R7097J73286
27210b71990J48697M8943j79647J45157K66041J7150m1966o068J07176K55445
27200D88938j49894j93136j18655j58681J66446K24153J70191M0947L2619k07779
$$ y = [278729, 610646, 742189, 657642, 432123, 53901, -21245, -2834, -57136, 186896, 447084, 422413, 243468, 297488, 319201, 276758, 435296, 375297, 410397, 302664, 281005, 408022, 276920, 101734, -95534, -252331, -120891, 101562, 205206, -41427, -178964, -15713, -12252, 168832, 613294, 635977, 781590, 553240, 333380, 148378, -46511, -133225, -8936, 84813, 163164, 181435, 453858, 565761, 317668, 239257, 111463, -27701, 56137, -64058, -338074, -502163, -186132, 4757, -261508, -542373, -445276, -271990, -123293, -74350, -253997, -108840, 157201, 174351, 132385, 126317, 233493, 488938, 339044, 145908, 27253, -131428, 35018, 259171, 429362, 470309, 502928, 295149]
27190B95149l80425k34071K66479J27522n8623M883m6111o2569Q1373K03189K19502
27179D16298J9998j54380j09341j68866k94365j08176j8477J60400o3523J78088
27169a42344J65681j6521O2381K02024j00378j30169L4531j58626k09191Q1766
27159b10846K45562Q8504j67836J79139J28889J07468q150P590J02518L6991Q2975
27148E92804Q516o6546k36071j86056k36447l0378R8682j14766r9171P7881K3392
27137a68160K3544R2133O8778o1636L6581j19170j3649M847j89670m7199N4329
27126c19272K04783j6285o6229j2924J60421J84326O8354K02215m4763l6596k52184
27115G1846Q0669Q2074p270j63200j1095M38007K4238m48044j05624J49510k37023
$$ y = [295149, -85276, -319347, -52868, 74654, 16031, 20914, -25197, -87766, -6393, 196796, 416298, 436296, 281916, 172575, 3709, -290656, -398832, -417309, -256909, -320432, -142344, 23337, 6816, 69197, 271221, 170843, 40674, 75205, -83421, -292612, -210846, 34716, 123220, -44616, 134523, 263412, 370880, 362730, 370320, 472838, 509829, 592804, 601320, 534774, 298703, 112647, -123800, -154178, -55496, -170262, -269433, -191552, -168160, -144616, -52483, 16295, -45341, -8760, -127930, -141579, -136732, -326402, -373601, -319272, -114489, -130774, -197003, -209927, -49506, 134820, 203174, 405389, 360626, 324030, 71846, 152515, 234589, 227319, 64119, 53024, 491031, 515269, 67225, -38399, 111111, -125912]
27104a25912P2972J95686J06068q8914M8121J6821J6553K72579J0584O15o8905
27093D56268n7814k97322l49683k7001p6549J4159K32847K77768J30079J38479
27083D41231J9206j05049j20430l19336p3100n235R422m8493j0455J42006L0386
27072c9847J7710j25319J09392J6637k69220L5025L21565n5978j09806j68724
27062b68565p0991J11985N7637J41681K915k52801O4281J05021q5753j33267J5664
27051c12193L66229q1523k17378N1253N6684r337j15064K46937K16061J9093J1035
27040B31797k92486J588K63059n0261j63091Q4221J68058K280J63105k1197k41203
27029A45870k25001L0468K56557Q9606l8246J97559J73172k15737j21557k12578
$$ y = [-125912, -52940, 142746, 248814, 159900, 208021, 224842, 241395, 513974, 524558, 525173, 456268, 398454, 101132, -248551, -275552, -352101, -337942, -105095, 172673, 302752, 441231, 460437, 355388, 234958, -84378, -157478, -162713, -153291, -201784, -212239, -70233, -39847, -22137, -147456, -38064, -21427, -290647, -255622, 65943, 9965, -99841, -268565, -339556, -227571, -169934, -28253, -25338, -278139, -213858, -108837, -194590, -327857, -312193, 54036, -27487, -244865, -193612, -136928, -146265, -261329, -14392, 201669, 220762, 231797, -60689, -59101, 203958, 153697, -9394, 74827, 242885, 245165, 408270, 387073, 145870, -79131, -48663, 207894, 297500, 259254, 456813, 629985, 414248, 292691, 80113]
27019H0113K929M8399J36227k97037k75717J53433J88099n1930n1606R8763m1394
27008i721K03576q2779J01571L18307k5210j61226k2719o4438k45963k20782M2526
26997a66858J28017O2274r8993o4940k6125K29720K43753J37706n3961k55650
26987A34943o5028O4280j8301k42484N1596L6610J47216K55999r3490j07137J36437
26976C00641m9092J08391K71921j29092k75353r9093p4248l14937q0388J97625
26966a43625J15755o6081k28462R3924l5069J45277q8538J31067Q4357P5789j1789
26955G2605k68761M3775L94316K69784Q754k83264k41239n2221Q1819J26363k56317
26944a04386j10826R6350K46111K0441k18990j73298J05547l3575O602j54549
$$ y = [80113, 83042, 131441, 267668, -29369, -305086, -151653, 36446, -15484, -67090, 31673, -9721, 193855, 111076, 212647, 530954, 505744, 344518, 321799, 257361, 11398, -209384, -166858, -38841, 23433, -75560, -140500, -166625, 63095, 306848, 444554, 390593, 134943, 69915, 134195, 115894, -126590, -74994, -38384, 108832, 364831, 271341, 164204, 300641, 251549, 359940, 631861, 502769, 227416, 128323, 54075, -260862, -341250, -143625, -27870, -93951, -322413, -228489, -263558, -118281, -206819, -75752, 8605, 84394, 72605, -196156, -152381, 241935, 511719, 520473, 237209, -4030, -56251, 25568, 151931, -104386, -215212, -118862, 127249, 147690, -71300, -244598, -139051, -172626, -166024, -320573]
26934c20573k27870J14857L5164Q8241Q2592L0110L08563J4284l16797j98714
26924c90143j05882R6232J61080K29647K33529p3653k3577O5093j04569j81962
26914i4205j09324l57447P5148K40808R5906k0763O7538K6480q5755K1741N6309
26903h3564J51668k04935j70036L70009j0429O3725K26588r6052k08716k0830
26893A7428R3915k3077P0008o6295j39962j52085K43636J15215j51612j37077
26883a29906p0588P1911J72104j67846j76927J42934j29309N0702K1732K57773
26873D2580J03852K21946p7277m79150j30646J78963M974O0595q2274j6632m6774
26862b19843p2199K2873K27366K0946o1838J4536O7067J00621q0255N7922N8234
$$ y = [-320573, -548443, -433586, -398422, -310181, -227589, -197479, 111084, 125368, -191429, -390143, -496025, -399793, -238713, -9066, 224463, 150810, 127233, 192326, 87757, -94205, -203529, -560976, -485828, -245020, -149114, -169877, -102339, -75859, -161614, -139873, -83564, 68104, -136831, -306867, 63142, 52713, 116438, 343026, 246974, 38258, 17428, 111343, 88266, 158274, 91979, -47983, -200068, 43568, 158783, 7171, -129906, -200494, -128583, 43521, -124325, -301252, -158318, -287627, -236925, -215193, 42580, 146432, 368378, 291101, -188049, -318695, -139732, -134758, -74163, -156437, -173069, -219843, -292042, -269169, -41803, -20857, -82695, -68159, -1092, 99529, 19274, 77196, 135430]
26851A35430j38694j46059k7641P357j42493j16900j7848J94260K50204n1973
26841e4357j74243j57984j90328Q4828N1013Q161J05320L17347J53331r3720J84078
26830B33446j18732m70169k22115J47405K04607J23251K48708Q3236R412j61828
26820G7221k47198r0882N8368R5329J49162O781O2872O8844j74500k03250l4641
26809b31894n6214K95348Q2410j99437M2976j06765M888R6638j76717n2344O1861
26798b39250N8146m2118K6693K8309L8776J05684K446O6888o4463j64882J31968
26787e1803j09767J0599J41861o9927N5062J68898j63898j21319J73409l2676
26777D39k6670l9479n7332N7232k1311M06969K58158J60359j20680l95361p7739
$$ y = [135430, -3264, -149323, -176964, -169607, -312100, -429000, -446848, -252588, -2384, -54357, -228600, -386584, -576912, -492084, -441071, -432910, -327590, -10243, 143088, 49368, 233446, 114714, -355455, -577570, -430165, -225558, -102307, 146401, 229637, 239049, 77221, -169977, -260859, -202491, -107162, 42000, 48781, 111653, 180497, 5997, -197253, -231894, -288108, 7240, 89650, -109787, -66811, -173576, -168688, -72050, -248767, -301111, -239250, -181104, -223222, -196529, -168220, -129444, -23760, -21314, 45574, -18889, -183771, -51803, -161570, -150971, -9110, -79037, -23975, 144923, -18975, -140294, 33115, 439, -26231, -65710, -123042, -65810, -87121, 319848, 578006, 738365, 617685, 222324, 144585]
26766A44585m6517j04227M2040J68892k1275j25545P4476j68234J9582K18029
26756B01806n7107J02337J56004j93996j42955O2237j43214k06863J28926P2835
26746a9990o6443j46232L0302K69674j7888J33611n1075j24280j9812j61447l5235
26735b08815P8462L42930K69480j253J390j86907j57147j31855p2113q7962K30015
26724G6225J50073p1528K494j86765p4896P885J5173O143p7141o4273J59177j6312
26712g3745m9216J59749K67001J46880k05608l77418j81215l1386J28529R6331
26702a20098j01020k9087N978J24560O9486J32312L87196J88255k45899k82593
26692A29090p2585m5755q5144j11337p1952K73681J77216R2659k43449p7859r6388
$$ y = [144585, 98068, -6159, 35881, 204773, 183498, 57953, 132429, -35805, -16223, 201806, 144699, 247036, 403040, 209044, 66089, 128326, -14888, -221751, -92825, -19990, -86433, -232665, -202363, 67311, 49423, 183034, 131959, 7679, -12133, -173580, -208815, -130353, 212577, 482057, 480804, 482194, 295287, 138140, 6285, -65828, -153790, 76225, 226298, 154770, 157264, -29501, -104397, -96512, -81339, -75196, -152337, -216610, -57433, -73745, -122961, 36788, 303789, 450669, 245061, -132357, -313572, -344958, -216429, -120098, -221118, -250205, -244227, -119667, -50181, 82131, 469327, 657582, 411683, 129090, 56505, 10750, -74394, -185731, -257683, 15998, 193214, 285873, 42424, -35435, -131823]
26681a31823k78464P5988Q6437r1990O7767L19261J03585K653j99116n0185M6308
26670d9579j05966o859R4650J15320Q5581p725j47518n1409k55197j41773M8240
26659d22235K62926K97661l05173k54360J91745K310r4263M8232l5521K89346
26649a9332J10785n3354k18718o3100K984N1773J85506M70433j48929Q470Q6601
26638D13119N470j4051k03952J03776J31459M6790l7560j92101j01748k2109l47322
26627b18229j33498p3211J4656K8558J69114R8083L0342J18682J27765n1432k0244
26616I0586J3227m1136r2777J67248l5868J5806q5285K61645L2259J9639L4610
26605C79954k07692k85143m5323N9053q7298o9287Q9662l793K81254O8763k00262
$$ y = [-131823, -410287, -334299, -247862, -339852, -272085, 47176, 150761, 153414, -45702, -95887, -49579, -155545, -162404, -67754, 47566, 133147, 125422, -22096, -73505, -328702, -470475, -422235, -159309, 138352, -166821, -421181, -229436, -227126, -321389, -273157, -308678, -19332, 91453, 38099, -180619, -243719, -240735, -188962, -3456, 466977, 318048, 326518, 413119, 418589, 404538, 200586, 304362, 435821, 482611, 445051, 252950, 151202, 129093, -218229, -351727, -424938, -410282, -381724, -212610, -114527, -84185, 34497, 162262, 110830, 90586, 103813, 62677, -30100, 137148, 101280, 117086, 31801, 293446, 325705, 345344, 379954, 172262, -112881, -158204, -99151, -186449, -255736, -166074, -169867, 111387, 180150, -20112]
26594b0112q2391o2844n121j00111o0122J2297K52120K14650r655M2889j7346
26583A64254L7755O1410n2707k17917Q258J14539Q7774j12700r5144j26044J94930
26572F4408J5744q3823q8022k06501P7880K03266K0885J84987j66522j89812J73805
26561F295j506n3884k11349p2406O9521J01734J20429J79780j67J58937O0784
26550C58168j0923r9643M3278l2856j31546J15455M0232j2453k31292J35636R2999
26539B67055J06017J06466J2798p4579M2010J75218n4199l11518n504P83j90364
26528G4183L72182k45307n89157K3720M15967J8920p0288o7074o1520k49881p2379
26517d50634K01702j3431j37026K23051L42792j37125m36558k57653J89224O8594
$$ y = [-20112, -102503, -165347, -170468, -270579, -330701, -318404, -66284, 148366, 138711, 181600, 164254, 202009, 263419, 210712, -7205, 1053, 115592, 203366, 90666, -4478, -130522, 64408, 80152, -3671, -91693, -298194, -220314, -17048, 3837, 188824, 22302, -167510, 6295, 4789, -49095, -260444, -332850, -263329, -161595, -41166, 138614, 138447, 297384, 358168, 347245, 247602, 290880, 258024, 126478, 241933, 282165, 269712, 38420, 174056, 267055, 373072, 479538, 492336, 417757, 459767, 634985, 580786, 269268, 263764, 264547, 74183, 446365, 201058, -388099, -364379, 51588, 70508, 220, -66854, -128374, -378255, -450634, -248932, -262363, -399389, -176338, 166454, 29329, -407229, -664882, -475658, -407064]
26507d07064M93Q8875J66386L76717P3636j12056N7355J42966j80235N1410Q0371
26496C38854l965k15330j24989K30234O0785O0678Q5079j45343n1681O5970J31575
26485D31867J59737j44091j77456q6430k6464k7177Q93n6789K25551M8839j87525
26474A60955O0946j36921J98243j0845k76313o9705K31383K20990j2026M636l76515
26463e172l25098J06770K64730K36857n0981j69284n8791R7778K1007q9733j66316
26452a38233k91976q9862J10003L14752Q7611M8759j60656j26930J64704L15606
26442B33778L32190k46669l17392o9877Q4500k14293o5483J74575J39018o7063
26432a6716q190j9397k0240J2576N7544L100J79230p2244j67061l80983N7575
$$ y = [-407064, -406571, -317696, -151310, 225407, 299043, 186987, 244342, 387308, 207073, 258483, 338854, 334889, 119559, -5430, 224804, 285589, 346267, 431346, 286003, 234322, 300292, 431867, 591604, 447513, 270057, 183627, 157163, 129986, 130879, 74090, 299641, 348480, 160955, 221901, 84980, 283223, 272378, -3935, -73640, 157743, 378733, 366707, 371343, -5172, -330270, -223500, 41230, 278087, 227106, 57822, -969, 96809, 117816, 28083, -138233, -430209, -520071, -410068, -95316, -7705, 41054, -119602, -246532, -81828, 233778, 565968, 319299, 1907, -67970, 16530, -197763, -263246, -88671, 50347, -16716, -24906, -44303, -64543, -51967, 5577, 8677, 187907, 115663, -51398, -432381, -374806]
26421c74806L44402J13215r4990J00830j26646n4152J69811p8551j39062K59444
26411A19495l9232k57118J91352L31654K7705r5192J6368J47613L8265k36122
26401B44788l74284k54866j62468p0765K10664K17241j37741L27742J50892n6501
26391I4702p3142N295K41254K7020m5199k08808q0144M1749J16253j41555j93971
26380b16546J24442j10949k49175J46438J15020J34063J11530N4684J00548P8460
26370B88515j36152J51150p4306k00254l8827L17396L03228j30724j46985O7896
26360D00937j70493l81246j29267o874j08375K80053J52006K4842k52937j63295
26350c54649K11008L96512K06415j3909l00657m26423Q5934K49973J06345N1678
$$ y = [-374806, -30404, 82811, -12179, 88651, -37995, -92147, 77664, -887, -139949, 119495, 80263, -176855, 14497, 346151, 373856, 278664, 295032, 442645, 480910, 244788, -129496, -384362, -546830, -617595, -406931, -189690, -327431, 311, 151203, 94702, 21560, 26855, 268109, 295129, 249930, 41122, -39022, 2727, 118980, -22575, -216546, -92104, -203053, -452228, -305790, -190770, -56707, 54823, 109507, 210055, 288515, 152363, 303513, 229207, 28953, -9874, 307522, 610750, 480026, 333041, 400937, 230444, -150802, -280069, -286943, -395318, -115265, 36741, 61583, -191354, -354649, -143641, 252871, 459286, 445377, 144720, -281703, -195769, 54204, 160549, 212227]
26340B12227L7977K2250k86429k33956k93575j00459j18090L04306K19907j83028
26330d18870j14107M1151M8264P6593O9625J25615j58691K6625K02190l9193L899
26319a36899n2975k03066J66561K52320L4859k5300O1593k06548k7304k2145J40458
26308a8446J34666N1777o2353m7267k1216j07604l56294n4673j47694k0164L37966
26297c11302J93749J44036j24477j27801M9230K92679l4057k23223L9559J07436
26287E829o965q1958J73585J92428N7952j54228k12980j60281j34405j16547J4402
26276d23168L29761J96825l28117o2846O8689m7402k2227P2242j01174R2282O5733
26265a59402K15058j49347k33077J38896p1442J0888K16612M7346j98831j06904
$$ y = [212227, 250204, 272454, -13975, -247931, -541506, -641965, -760055, -455749, -235842, -418870, -532977, -491826, -443562, -366969, -297344, -171729, -330420, -303795, -101605, -140798, -136899, -189874, -392940, -226379, 25941, 60800, 35500, 97093, -109455, -136759, -158904, -18446, 116220, 167997, 105644, 58377, 37161, -70443, -426737, -481410, -629104, -649268, -311302, -117553, 26483, -97994, -225795, -176565, 116114, 82057, -141166, -101607, 5829, -1136, -83094, 90491, 282919, 340871, 186643, -26337, -186618, -321023, -437570, -423168, -93407, 103418, -224699, -287545, -218856, -266258, -288485, -216243, -317417, -225135, -159402, 55656, -93691, -326768, -187872, -259314, -248426, -31814, 15532, -183299, -290203]
26255b90203K36369J31107m53011j13212K13408J22921M1664o8270J8447K4186
26245a36594j03124j3237K81946j15882O9279K5764j09076N8707J55310n9136
26235E3957j07605p6474j37955m2363M2078O8070N2049M5255K0811J958j24496
26224b04715J71062J07875J26370J77184Q0621k9714N6807j14748j78719k79634
26214h7611K31845Q7402J9287o1303J02469J73765l78575k50054J05711L52906
26204B95842J93737l4993j45300q7984o0497M8372J10897j38961l30223J0761
26194a38349L019Q0996L72126J5258M6436j10324l8208j95505J28641J53514l7536
26183B80068j19859K67198J0259j62096P5105M0943k37752j02580J89867M6648
$$ y = [-290203, -53834, 77273, -375738, -488950, -275542, -152621, -110957, -179227, -160780, -136594, -239718, -252955, 28991, -86891, -17612, 8152, -100924, -42217, 113093, 53957, -53648, -130122, -268077, -310440, -268362, -200292, -148243, -102988, -82177, -80219, -204715, -33653, 74222, 200592, 377776, 458397, 428683, 485490, 370742, 192023, -87611, 144234, 231636, 250923, 189620, 292089, 465854, 87279, -162775, -57064, 295842, 489579, 454586, 309286, 221302, 160805, 209177, 320074, 181113, -149110, -138349, -135330, -54334, 317792, 333050, 379486, 269162, 230954, 35449, 164090, 317604, 280068, 160209, 427407, 437666, 275570, 350675, 391618, 153866, 51286, 241153, 287801]
26173B87801M4015m2291l03896k63325j41250J05058J23149j7546O3697j30323
26163b74911p4514j60001M8934J29326J71806J77693R400K64417j48j53203j71458
26152c2659o9944L17236J24228l71857l62081P9434R6034J84165P7797m3486K40203
26141B39070J95857k66435r0977j21361n1012P4276m2125o1481J52530K46038
26131B74380K28867j94469m03501j2669j62327j00520p4993j62416K4225L20446
26121b62977J99875j3717j82471m9313J8965J30243M0116K2220r7789k34666m4345
26110d73859J33558j52464k907L17341J43838n2734j26889j58523J8737L48888
26100e014Q5513j06825q8023J8716O936K25217j01837l25652q9197j0913K47140
$$ y = [287801, 331816, 289525, -14371, -277696, -418946, -313888, -190739, -208285, -144588, -274911, -349425, -509426, -460492, -331166, -159360, 18333, 27733, 292150, 292002, 138799, -32659, -102603, 214633, 338861, -32996, -395077, -315643, -219609, -35444, 42353, -1133, 239070, 434927, 168492, 77515, -43846, -94858, -20582, -62707, -124188, 28342, 274380, 503247, 308778, -94723, -107392, -269719, -370239, -445232, -607648, -583423, -262977, -63102, -76819, -259290, -308603, -289638, -159395, -119279, -97059, -194848, -429514, -473859, -340301, -492765, -495672, -178331, -34493, -87227, -214116, -372639, -353902, -5014, 80499, -26326, -114349, -95633, -88697, 136520, 34683, -290969, -380166, -391079, -143939]
26089a43939n1151m9719R6538J46271P0826q8297J2684J56570K6401r1852j70918
26078h6586M7930n011o2418N6831k2569R4746o5271j09216N1664K24714M7534
26067A72348J27531J28113L7335n6915K7180j76744j86875j22997l5524J8732
26057f7816k35423l818J34968J54939n6950j0450j6521m0812o8328j11391m6311
26046c67913M7137J98049J43618J91431q5205j44155j50148k922J45059m6235
26036g1284o0989k31352j08357j2050L61664J41375l7460q7272J12180L3825p2990
26025c2710j80846q4453J8114N2875N0937j53540M8422j10408l6866p6005J23460
26014c81020O4208P0555Q9115M9908n0955j28262j70678J17158K91182K38084
$$ y = [-143939, -195090, -244809, -148271, -2000, 68826, -19471, -6787, 149783, 176184, 84332, -86586, -38656, -43667, -106085, -49254, -71823, 22923, -42348, -151564, -99900, 124814, 172348, 299879, 427992, 465327, 408412, 435592, 258848, 71973, -51024, -86548, -67816, -303239, -307057, -172089, -17150, -74100, -84550, -101071, -141883, -210211, -321602, -367913, -320776, -122727, 20891, 212322, 127117, -17038, -167186, -170108, -25049, -71284, -132273, -363625, -471982, -484032, -122368, 19007, -18453, -105725, 6455, 40280, -32710, -213556, -298009, -279895, -227020, -176083, -329623, -281201, -391609, -428475, -504480, -381020, -316812, -246257, -157142, -107234, -158189, -286451, -457129, -339971, -48789, 189295]
26004A89295j4981P688m6584j0703j30122J6950j2065k22934R7683J5179P4039
25993c6555J14460j81436k89001J61574O0942j7164j91799q762J3321K56223O932
25982a11265j8915j77156n503K23953l5045L9785o7502j60190j05683N2720M103
25971c60698J00409L8098J31553K54197K27183j08083l20205M5026J47673m2825
25961A12328j50537k81253j67546K96253R9145k1433K35322J26518K6159J30222
25951D05178O3954k53123j04247O9011j04469m7860o3389J19092J53176L09005
25941E46328Q8536k41369j29411J66939r8341j44203o1136K2875K4083R4409l9946
25930B28764J7349m2206j57294r46o5254l7098j82358J52185J82354K26004K24262
$$ y = [189295, 174314, 182002, 135418, 124715, -5407, 11543, -522, -223456, -125773, -110594, -36555, 77905, -103531, -392532, -230958, -170016, -187180, -378979, -387741, -374420, -118197, -111265, -130180, -307336, -312839, -88886, -123931, -84146, -151648, -311838, -417521, -364801, -360698, -260289, -222191, -90638, 163559, 390742, 282659, -37546, 7480, 155153, 112328, -38209, -319462, -487008, -190755, -91610, -113043, 122279, 248797, 274956, 405178, 469132, 216009, 111762, 180773, 76304, 28444, -34945, 84147, 237323, 546328, 634864, 393495, 264084, 431023, 332682, 188479, 127343, 150218, 174301, 268710, 228764, 246113, 203907, 46613, 45667, -19587, -56685, -239043, -86858, 95496, 321500, 545762]
25919E45762q7043L1853q3933o1736j03725o9473l84106j68632L26977j32072
25909a86128j51771K0868q1449J48806K50326k8178J44520K07588j9808j92375
25899A12399J2702J8909j517J63722j73894j53419j63329J6889k2489j28148P1870
25888b46305Q7956J29774M2380m814R3457J26855Q3773r600k44824k07647J96562
25877D7567J28772q5858l31746j05717K47352K95571m0697o432r7306j73246M8852
25866g2888M9541K12081j702l41625k28815K9701K22710L23450O8116m1814j93485
25855B5270j91886J21295J57705j35757J5632J03353j50208J41115J47069k15940
25845A7648m1974k43398n4227j33060J0134J70703J66454Q4856J39865k0412J50520
$$ y = [545762, 458719, 490572, 406639, 344903, 241178, 171705, -212401, -381033, -54056, -186128, -337899, -317031, -398480, -249674, 652, -27526, 116994, 324582, 304774, 112399, 125101, 144010, 142493, 306215, 132321, -21098, -184427, -167538, -190027, -318175, -246305, -158349, -28575, 13805, 8991, 102448, 229303, 313076, 303476, 58652, -148995, 47567, 176339, 90481, -241265, -346982, -99630, 195941, 155244, 148812, 51506, -121740, -72888, -23347, 188734, 187032, -154593, -383408, -353707, -130997, 192453, 260569, 218755, 25270, -166616, -45321, 112384, -23373, -7741, 95612, -54596, 86519, 233588, 17648, -24326, -267724, -321951, -455011, -444877, -274174, -107720, -22864, 117001, 96589, 247109]
25834B47109Q8874L0438K3573j09202j60379q8407p2413k01799R405Q9588K37917
25823I4704J46435k88872j75032n6576r425J98859P0714j96663o8210J53681J29979
25812d06j4694J03790q5839m2513L18241K31587j13389r3518q0014l8957n787
25801A78501n8461J01129l00103n717J21293K83960N3510l58107k74263P6324
25791a81934L22974r6496j75935k367r7344J84733k19678m3905L07591K32155
25781B29794N3074j9003k09539k2980K29747J34175n7955o9677l0346L2039k64787
25770D542j06733j62904J13006M2322J25549J13172j04465j53701K05841Q1062
25760A57691j86142j95656r8918o6054J12873K59091K54950j0326k57830J8949
$$ y = [247109, 335983, 366421, 389994, 280792, 120413, 32006, -40407, -242206, -232801, -143213, 94704, 241139, -47733, -222765, -279341, -288766, -89907, -19193, -215856, -284066, -130385, -406, -15100, 88690, 2851, -39662, 278579, 510166, 396777, 303259, 223245, 184288, 178501, 120040, 221169, -78934, -84651, 36642, 320602, 374112, 16005, -258258, -181934, 141040, 44544, -131391, -133758, -231102, -46369, -266047, -309952, -2361, 229794, 282868, 263865, 54326, 31346, 261093, 395268, 337313, 267636, 237290, 269329, 4542, -102191, -265095, -152089, -109767, 15782, 128954, 24489, -129212, 76629, 157691, -28451, -224107, -323025, -389079, -276206, -17115, 237835, 227509, -30321, -11372]
25750a1372J48039R0408j59837n5464N819J2831j65028j27792J33340J19029J6712
25739F685Q4800R7117J05336j07198J35938m1457j31063j38057j40086m432n9883
25728a92300J4525J34549L0707j04763R8854J6278j43075q4575q5867R4860L24510
25717A03703J60502j11838j85091m5757k8056J36013P4694j77768k31929J32280
25707a73247K67545r7154r4651J66608J56533R479j22395k27855j33115L26441
25697G8189J59137K22396q9772j52569r8643m0397m55m8703k90688j3808J83491
25686i1822L36962K46234P8866Q2603k17994q0016n1537j67407q7548m5164N5381
25675E8558J58795M43434j36004l27783l28691j31072O3774K6903j29598j5146
$$ y = [-11372, 136667, 227075, 67238, 11774, 17593, 30424, -134604, -262396, -129056, -10027, 6685, 91485, 188602, 293938, 186740, 322678, 281221, 150158, 12101, -127985, -132417, -192300, -177775, -43226, -12519, -117282, -18428, -2150, -145225, -229800, -315667, -220807, 103703, 264205, 152367, -32724, -78481, -106537, 29476, 104170, -73598, -305527, -173247, 94298, -2856, -97507, 69101, 225634, 235113, 112718, -115137, -248252, 78189, 237326, 459722, 369950, 217381, 118738, 78341, 77886, 29183, -261505, -275313, -91822, 245140, 491374, 570240, 652843, 434849, 354833, 303296, 135889, 48341, 3177, 58558, 217353, 660787, 524783, 197000, -131691, -262763, -198989, -172086, -301684, -316830]
25665c16830L98910K49193k73788j77272J46785K81781j77205k1304J17998M5118
25655B73386M227Q400J2678K5847j46880r3816o7234J1461O1136O9538j99987
25644d1244j5173O6803m4235J2437n3117J14558m1884k29389J04453K02680M3256
25633A19145j97452N882n2338k9401N2741K7425J81258K61367J4979j85762l6194
25622A61650j24518j65637J89110M15230j10803k07114K13417L714j32200j28112
25612A14737j5972j79168N522N9480O2838j50075J2983M9913M9289L1772p2005
25601c0686j0029Q9018L0079r8517j68047j02220k7099p1122L22726J69116o0671
25590D2548N7523J46661r0957j25773r5008m9872j81757k3179J0181j07011n0978
$$ y = [-316830, 82080, 331273, 57485, -119787, 26998, 308779, 131574, 110270, 228268, 273386, 277613, 286013, 298691, 324538, 177658, 83842, 16608, 28069, 89205, 158743, -41244, -56417, 10386, -33849, -21412, -74529, 40029, -1855, -231244, -126791, 75889, 119145, -78307, -72425, -124763, -154164, -101423, -73998, 107260, 368627, 383606, 197844, 161650, 37132, -128505, 60605, 475835, 365032, 157918, 371335, 375049, 242849, 114737, 98765, -80403, -74881, -15401, 47437, -102638, -89655, -39742, 9547, 41319, -30686, -40715, 48303, 78382, -20135, -188182, -290402, -317501, -388623, -65897, 103219, 42548, 100071, 246732, 155775, 30002, -65006, -114878, -296635, -319814, -309633, -416644, -467622]
25579d67622J7538L66324N4836j06894l1498o6046R2079j7502p5710J939Q6267
25568a46289L8447j01570M1913L53257J07816j40546n6360J59473J17881K7552
25558D01574j6176k46401j13087j98933j37665K1539J13169K39161j27896k23421
25548b88136R3904K97983J81418O2401K997k14518k52558Q2137K77286K08858
25538D51772J60903j10934o7114q8103k01880P8421J05766L1839J30529q117j02993
25527C80089j85093n1322K35256J02993j12172j80504O4735R7839k7266o4390
25517B60165L8752k9253j88952K368p7738K34219M5164q2391k96610J52114J05620
25506A63458R4655o7078j33339j1791M698j5334j66366L268J95120K32929J75116
$$ y = [-467622, -450084, -83760, -28924, -135818, -167316, -233362, -141283, -158785, -234495, -232556, -146289, -107842, -209412, -167499, 185758, 293574, 153028, 96668, 256141, 374022, 401574, 385398, 138997, 25910, -173023, -310688, -289149, -175980, 63181, -64715, -288136, -194232, 103751, 285169, 347570, 350567, 136049, -116509, -34372, 242914, 451772, 612675, 501741, 434627, 346524, 144644, 223065, 328831, 360670, 491199, 483082, 380089, 194996, 143674, 378930, 481923, 369751, 189247, 253982, 351821, 324555, 260165, 298917, 269664, 80712, 83080, 5342, 239561, 284725, 202334, -94276, 57838, 163458, 258113, 191035, 57696, 45905, 50603, 35269, -131097, -127829, 67291, 300220, 475336]
25495D75336n4142j34475k27190k22756J44762J62201j22425j62549L78293J87836
25485D24891N232m7059k715n7407M390R6363K40883k35492j92477J591j19974
25474A18226j29178l36757L9135L3687n6879J11092J71251Q311o1811j46902J93729
25463e6096o6700r3234M4991J04159K5323o3195J62549J4581P4610P5094j2106
25452B09976j57473k10417j12227n4183J14031J21179j75603L7721J46601K48733
25442A68338J67217N5439j1441j91015j24703P6681j35202n9937K59888P2713
25432B77978j30961k22887J49568N9391k75337p0846k83271o903N3101P0615N3396
25421c26156J69584O3338j45384r8342n4292J4882K04707K00129K65941M1049
$$ y = [475336, 421194, 286719, 59529, -163227, -18465, 143736, 21311, -141238, 237055, 424891, 430123, 383064, 380349, 322942, 327332, 423695, 664578, 429086, 236609, 238200, 118226, -10952, -347709, -308574, -274887, -331766, -220674, -49423, -41112, -102923, -249825, -56096, -122796, -216030, -171039, -66880, -41557, -104752, 57797, 72378, 146988, 222082, 209976, 52503, -157914, -270141, -324324, -210293, -89114, -264717, -226996, -80395, 168338, 335555, 390994, 379553, 188538, 63835, 140516, 5314, -54623, 205265, 277978, 147017, -75870, 73698, 133089, -142248, -213094, -496365, -503268, -450167, -379552, -326156, -156572, -93234, -238618, -336960, -391252, -376370, -171663, 28466, 294407, 335456]
25411C35456l1976k1433p3258j91664o4095K7246M783Q1862n4735j87890j89524
25400c65228l04044j11672L21150J36590K50665J6630J6027J31880O3654q478
25390A47174Q6914Q7964j49905p747j49199l0829j49529j05431J64062J03411
25380c115Q9320K7449j96609P1798m0148k6618m0432N8230R2702j47597k8980
25369a44000J73252j2286Q0946P0182j55615o0724r5076k86944J24391L44929
25359C9055J48446k24771j10716j63112p0495n4115j46652m7233L23211J54111
25349a52271k69699Q7776K10021J19793K5493N9611L4976M3158J28435j67567
25339A19726M646J33600N343j34420K38644J35065l0923j39079J32490l4315p0068
$$ y = [335456, 303480, 282047, 208789, 17125, -46970, -19724, -14941, 66921, 12186, -175704, -365228, -669272, -780944, -459794, -323204, -72539, -55909, -39882, 91998, 155652, 147174, 234088, 322052, 172147, 164400, 15201, -15628, -165157, -270588, -106526, -3115, 86205, 113654, -82955, -11157, -51305, -77923, -118355, -60125, 32577, -115020, -144000, 29252, 16966, 97912, 168094, 12479, -48245, -143321, -430265, -305874, 39055, 187501, -37270, -147986, -311098, -381593, -435708, -582360, -629593, -306382, -152271, -421970, -334194, -124173, -4380, 21113, 80724, 115700, 158858, 287293, 119726, 124372, 257972, 263315, 128895, 367539, 502604, 471681, 332602, 465092, 430777, 360709]
25328C60709l06275l04527j46909j06711j36613K48451J40577l3532p5389r7047
25318d57266N1420O6602K34194R200m9769M5182m9781K67491M8930k32623k11420
25307b77840L7866J12394J06639L80066P1226l08492j91895q5338J87215N2100
25297H3941j80011J31135L0410q134N548j84182J13225j58631k38410Q0259K39247
25286h5603O0758J92448J32486j36769j62635j87806j65966K4149K58858M00112
25276C30032q1387l49953j57652P9700o2178J51812o7597j14103Q4810M2260R8237
25265d6019L20595L10550L0518l54701k06313j55676K85968M3847k76379j14207
25255a61817N4464j22034j3123J02592K57950o7721q4212R6299K05558k54968
$$ y = [360709, 54434, -250093, -397002, -503713, -640326, -391875, -251298, -284830, -360219, -457266, -405846, -339244, -105050, -95850, -145619, -100437, -150218, 117273, 166203, -66420, -277840, -239974, -127580, -20941, 359125, 430351, 121859, -70036, -155374, 31841, 83941, -96070, 35065, 65475, 57341, 62889, -121293, -8068, -166699, -405109, -324850, -85603, -24845, 167603, 300089, 163320, 685, -187121, -353087, -328938, -70080, 330032, 248645, -101308, -258960, -179260, -241438, -89626, -157223, -271326, -186516, -144256, -46019, 274576, 585126, 615644, 260943, 54630, -101046, 184922, 228769, -47610, -161817, -107353, -229387, -242510, -139918, 118032, 50311, -33901, 62398, 267956, 12988]
25245A2988j58892K19660K36407Q8167j95724p3072q4792j55660O8480P5422p9252
25234d6268j42558l0725K2929J54445J28219m380M8019k14863j73546k05946Q5386
25223c79288L39449J24718J2209j36883J31532k4961m7343J3560J50492K8283
25213B11768L609l03181M3252l5356l1484o3315j44103m1959K62611J74513j63992
25202h7637m0540K63200J17394q6261p755l291k2018j40198J44689N2488k06609
25191a6538j04450K13391N149j73339p0769K6394J11773P4413J19144p2632p1043
25180D1493n4508J95222p2630L8218J08959k8072m030J05223k6078J81904K750
25169D88451l70634l60998j76925R997P0531J57494J84369M9518k72241k25724
$$ y = [12988, -145904, 73756, 310163, 398330, 202606, 129534, 44742, -110918, -42438, 32984, -46268, -188826, -219551, -196622, -42177, 86042, 81662, 129681, -85182, -258728, -464674, -379288, -39839, 84879, 97088, -39795, 91737, 66776, 19433, 32993, 183485, 211768, 215377, -87804, -44552, -79908, -111392, -174707, -318810, -360769, -98158, 76355, -87637, -128177, 135023, 252417, 166156, 158401, 155110, 133092, -7106, 137583, 190071, -16538, -120988, 92403, 97552, -75787, -146556, -120162, -8389, 66024, 185168, 112536, 41493, -13015, 182207, 109577, 147795, 256754, 228682, 224652, 329875, 303797, 485701, 488451, 117817, -243181, -420106, -410109, -339578, -182084, 2285, 51803, -220438, -446162]
25159d46162q5743M1941K04451M07378O6901j67406k68489J25668J83684K36624
25149B98847p2624q7878p1106j70031j09201N8182j06437J16972n6378j0564R2084
25138a18134j6102N1655N6343j53243J07809J24084j64287l1140O3267m5875N8449
25127f7174J51622J97537K1351m2272m0751r7530k35261m1407J06188O9846K0687
25116D2836J1966o3423p4287O6278k37808j29700N7326K14825L62832J65655j80281
25105B36219k05041j32637l6525p0810Q8342p5P5333L2588Q2364L07779n4889
25094C22648k99232j05556o1868m2283j14624R9482O3454L87140O9696l7578j75119
25083A06160k34713q5837R7030J91261j42685j15636m3362J5877k01820N0256
$$ y = [-446162, -531905, -489964, -285513, 121865, 188766, 21360, -247129, -121461, 62223, 298847, 226223, 138345, 67239, -102792, -211993, -153811, -260248, -143276, -199654, -210218, -118134, -134236, -82581, -26238, -179481, -71672, 52412, -111875, -143015, -79748, -125623, -67174, 84448, 281985, 303336, 261064, 220313, 122783, -112478, -153885, -47697, 22149, 42836, 54802, -8621, -82908, -16630, -254438, -384138, -326812, -111987, 250845, 416500, 236219, 31178, -101459, -137984, -208794, -120452, -120527, -45194, -12606, 69758, 377537, 322648, 23416, -82140, -144008, -186291, -300915, -201433, -137979, 249161, 318857, 281279, 106160, -128553, -214390, -117360, 73901, -68784, -184420, -227782, -211905, -413725, -363469]
25073c63469L06988K09252q5883k35434K23811J40507J25812J04325k16437k01393
25063H079Q7507n0128j09090j52486j4559L19363J14459j57385j44704L7764J34387
25052G3207L4378J90784J9676o4595j78104O0878p1978j82622j48971N0437J28646
25041h8264P3668j9472r0074j62037J24323J63730k09302k08912L4780O3926O8249
25030b49385J47727K80880L8147j96071R6599n146J369n3950n7306K0926q031
25019A5759P1447j33605p2600K10255Q9327o9484J44159m7777j08364k25515j05248
25008b31646Q8168q8490J35796j67511k07902J40482K45789j3454l9965q4826
24998b23559Q6468K0153j4385j34115O2717J81109L6384M689j9282q7977N0284
$$ y = [-363469, -56481, 152771, 66888, -168546, 55265, 195772, 321584, 425909, 209472, 8079, 95586, 45458, -63632, -216118, -230677, 88686, 203145, 45760, -98944, -61180, 73207, 107585, 298369, 318045, 253450, 75346, 136224, 64246, -118376, -267347, -216910, -88264, -14596, -34068, -124142, -286179, -161856, 1874, -207428, -416340, -381560, -317634, -249385, -101658, 179222, 217369, 21298, 117897, 112751, 114120, 60170, 2864, 23790, 15759, 87206, -46399, -118999, 91256, 180583, 111099, 255258, 207481, 99117, -126398, -231646, -143478, -231968, -96172, -263683, -471585, -331103, -85314, -98768, -138733, -223559, -137091, -116938, -131323, -265438, -202721, -21612, 14772, 19461, 179, -87798, -37514]
24987c7514K9918K62736R1940k14085k59875k26289L02470J90867r1604J06671
24977A55235k2123r886J05398J93295n6820j61051j71362j14424k01079J09803
24967a73014J55658J9063j11153j85378N4602J37711n209j16591o3988j38517
24957d26816m3480L30481J30529K5870J26575L210J0442n9338o8497k58482m928
24946b34434P4295k71517N3960R7016q2547J62965J77950j77128p4934J08773
24936a65601K15430k28116j99868J335J77897K28836o5411l8144J0889r4078r4310
24925b51141n7882J26042N2981J07942J22087K65547p6683n349J12296r3752k15516
24914H6572l2414J15820r1693j34098J6924J44132L9718M3723J40104Q7792k53231
$$ y = [-37514, -7596, 255140, 347080, 132995, -126880, -353169, -50699, 140168, 48564, 155235, 133112, 123226, 228624, 421919, 365099, 204048, 32686, -81738, -282817, -173014, -17356, 1707, -109446, -294824, -240222, -102511, -107720, -224311, -288299, -426816, -470296, -139815, -9286, 16584, 143159, 146369, 156811, 97473, 28976, -229506, -234434, -160139, -431656, -377696, -280680, -363227, -200262, -22312, -199440, -274374, -165601, 49829, -178287, -378155, -376820, -198923, 29913, -35498, -73642, -62753, -156831, -251141, -309023, -182981, -130000, -22058, 100029, 365576, 288893, 283544, 395840, 302088, 86572, 54158, 169978, 78285, -55813, -38889, 105243, 144961, 188684, 328788, 416580, 163349]
24903A63349J6776J64696j02178j95580j81970O6928L09309J54728j61364M7780
24893B82474j41800k69884O876n2007L368J04928K7251n5128l7158K0534k7K21277
24881A10704l5434j81501r6691N3323J43020j14745L2519M854k31860L2156j16723
24870d00378J44043J75478J11084j4258j68978p0975j96427J2536K2775j11084
24860d96184R4918J23435K0150o081j24662J23898K96111p882k72958o9806J22199
24849a96862n2172m299K47000J43680j12093J079l1608p7620K03290P8102j48576
24838D9921l29792J78996J74960J51319K244J43795j13887j10868Q7573J36753
24828C71014P5093k2480O3695k10162l04733O9960r0831K4364Q9663m4022J66110
$$ y = [163349, 180125, 344821, 242643, 47063, -134907, -67979, 241330, 396058, 234694, 282474, 140674, -129210, -122334, -174341, -170973, -66045, -38794, -93922, -131080, -110546, -110573, 110704, 75270, -106231, -202922, -149599, -6579, -121324, -88805, -83951, -315811, -283655, -400378, -256335, -80857, 30227, 15969, -153009, -223984, -420411, -407875, -385100, -496184, -401266, -277831, -257681, -263762, -388424, -264526, 31585, 23703, -249255, -319061, -196862, -249034, -253333, -6333, 137347, 25254, 26333, -5275, -82895, 120395, 198497, 49921, -279871, -100875, 74085, 225404, 227648, 371443, 257556, 146688, 234261, 371014, 446107, 423627, 487322, 277160, -27573, 42387, -48444, -24080, 65583, 21561, 187671]
24817A87671J89601k6364k11684j10923j78103J19351k1840j6615j4058R1645
24807H681o5273J069K04507j16985o6796L15728L6116l06466j04300K04128P0752
24796A81161l120j23757O4145j1776j13186q0446J45796K34227p8038P3678k5124
24785B63560J12783k59919m7174l561l9923J77670j20297k03428J16419J60215
24775A56345J57040p9284j71733l1410J02745M8684j63056j77624J157j30013
24765b87149Q5289L2352J14056j69938k4292K84725J17366j12236j69572j63901
24755b93300N4396j56400L8563R9929J81814K29314O1646o5985j07866p2791J13629
24744H2949K08984j55459k57337J06071J37030o2994J91521J5793q6064j41870
$$ y = [187671, 377272, 350908, 139224, 28301, -149802, -30451, -52291, -68906, -82964, 8681, -56592, -55523, 148984, 31999, -34797, 280931, 317047, 10581, -93719, 110409, 181161, 178041, 54284, 118429, 106653, -6533, -86979, 58817, 293044, 215006, 288684, 263560, 376343, 116424, 69250, 65689, 25766, 203436, 83139, -120289, -3870, 156345, 313385, 234101, 62368, 30958, 133703, 182387, 19331, -158293, -157136, -287149, -201860, -169508, -55452, -225390, -249682, 35043, 152409, 40173, -129399, -293300, -238904, -395304, -356741, -256812, -74998, 154316, 215962, 149977, 42111, -30680, 82949, 291933, 136474, -120863, -14792, 122238, 59244, 250765, 266558, 180494, 38624]
24734C8624J02885L9415j33258l17013O2294O8369J38848J9391N4149j94870m71598
24723e92764J47369N7404J69077J38510J19398j36170k62670l236J76527P5195
24713a11360j97046K51970R9721k4727j66844j24511m108L20755j2705p5758J50822
24702A06209K29470j32870k60545k7694J4126o927m411j07662N3364J64332J58971
24691A86363J27188N191k12122J14278j76855l14987j23642M1435j784J27657
24681b27278P2753J68637l9396k8085j30803J23323J39219o3586J4630L6560J36371
24670B02345K3445K38777k05233m1636J7721l5369J47710q2175j72641k08468
24660a15524J95946L4665j70751j29237N0910O5163P4483j14324J96173J33148
$$ y = [38624, 141509, 180924, 47666, -269347, -207053, -138684, 164, 19555, 73704, -121166, -592764, -445395, -387991, -218914, -80404, 38994, -97176, -359846, -363082, -186555, -111360, -308406, -56436, 43285, 18558, -148286, -272797, -276905, 43850, 31145, -44613, 106209, 335679, 202809, -57736, -85430, -71304, -78231, -82642, -190304, -136940, 27392, 186363, 313551, 318742, 106620, 220898, 44043, -270944, -394586, -353151, -354935, -227278, -154525, 14112, -25284, -53369, -184172, -60849, 78370, 14784, 29414, 65974, 202345, 225790, 464567, 259334, 217698, 235419, 200050, 347760, 265585, 92944, -115524, 80422, 115087, -55664, -184901, -133991, -68828, 5655, -108669, 87504, 220652]
24650B20652o7307R958M02828O6018k2404j87811j88012j4807m1761k68019k58971
24639c49636K12O2307J82637j7276o9187j04408R3051Q1203n8392J59590R9097
24628G9198r4808j16352j8009k2372q7069P4052J07871O9627p7496J6072r9658
24617a68944j98170p3158M2459L7099k03404J21386J94718P4294M1743q5653L510
24606b14120R1101K84877J18967L2466k05640k85644R9348q3184k77356Q8755
24596c50430J62096J92033R1170Q7142R9441p5841p2946l24413j36224L6882J21096
24585a69994L1838k21470J42969J89392P7003p772k33188R2679Q6862j04426O5141
24574e0966J73168l39248K9727K64100j63273j94684j86648L4941M17782L1112
$$ y = [220652, 153345, 163303, 566131, 632149, 609745, 421934, 233922, 219115, 177354, -90665, -349636, -349424, -287117, -104480, -121756, -190943, -295351, -202300, -121097, -179489, -19899, 79198, -15610, -131962, -149971, -172343, -259412, -185360, -77489, -7862, -85358, -69286, -168944, -367114, -440272, -397813, -360714, -564118, -442732, -248014, -173720, -131977, -217630, -214120, -123019, 161858, 280825, 313291, 107651, -177993, -78645, -161829, -439185, -350430, -188334, 3699, 94869, 182011, 281452, 205611, 132665, -191748, -327972, -291090, -169994, -138156, -359626, -216657, -27265, 49738, 41966, -191222, -98543, -11681, -116107, -50966, 122202, -217046, -187319, 76781, -86492, -281176, -467824, -432883, -15101, 16011]
24564A6011k53290p8052R8573K48871J04226j30663j94893r5531q524L8910O4071
24553a90291K56965l5363J03741L60195j02311j62998P6385p333j04002k77520
24543h2532p6772j72398M9724K3230R2838J08511J13406o3963J6736n467j21873
24532a18560J67589l2857o5276l8462j61732k35172n2538q6291J10233J39099
24522c73967K20167L20876k52912k3458K10987K3394o5109J81658j07962p3405
24512F0269J26753m9435k47428L3806J38736o5673L2238J33992o1271n4268L55162
24501D02881K2846j99728M5875K13378P6703l16967j15591r614j91289j38982
24491b10488P1254L1276J64164J75620m4363k75967N8738K29199k8732o6521J72925
$$ y = [16011, -237279, -315331, -216758, 32113, 136339, 5676, -189217, -284748, -293272, -254362, -190291, 66674, 31311, 135052, 495247, 392936, 229938, 306323, 298990, 194988, -82532, -159304, -331702, -281978, -258748, -165910, -57399, 56007, -7956, 8780, 3313, -118560, 49029, 16172, -49104, -87566, -249298, -484470, -537008, -623299, -513066, -373967, -153800, 167076, -85836, -109294, 101693, 125087, 59978, 241636, 133674, 60269, 187022, 137587, -109841, -76035, 62701, -2972, 29266, 163258, 101987, 47719, 402881, 425727, 225999, 271874, 485252, 561955, 244988, 129397, 119783, -71506, -210488, -139234, -107958, 56206, 231826, 187463, -88504, -29766, 199433, 170701, 104180, 277105]
24480B77105M6058k31k96647j21028j23179J26487r5945j48343O7964N2492J05617
24469a09650J7320m9202m6802O9799j20337J31624n7501j50732n6747r626K67443
24458a14411J85891J53848K1295l7529J8903q584j8888j1697M7143j43000J4438
24447A07409O7241R3312K14210l6240j90250j88039P6660j19766J55003o5834
24437A13706J64154J3299j07907M85j67198j01307N7471O5606j4118Q497J11641
24426A44329j44827O153J47261j19503l32054j1958Q443P0395N7270O1609o393
24415a19275J19883K9547K01966J01177k0144k37212k361k80920J35388J08197
24405C6246L4K0507O7607k02444j45642j372Q4086K08754J0054Q3350Q1403M3978
$$ y = [277105, 323163, 322932, 26285, -94743, -217922, -91435, -187380, -335723, -267759, -215267, -109650, -92330, -141532, -188334, -118535, -238872, -107248, -164749, -315481, -372228, -381854, -114411, 71480, 225328, 246623, 209094, 227997, 219413, 200525, 188828, 235971, 92971, 107409, 174650, 267962, 482172, 445932, 255682, 67643, 144303, 24537, 179540, 113706, 277860, 291159, 183252, 183737, 16539, -84768, -27297, 38309, 24191, 32688, 144329, -498, 5655, 152916, 33413, -298641, -310599, -302156, -231761, -174491, -112882, -119275, 608, 30155, 232121, 333298, 313154, 75942, 73581, -207339, -71951, 36246, 36280, 56787, 124394, -78050, -223692, -225064, -140978, 67776, 77830, 161180, 242583, 286561]
24393B86561K9705r1454p1582q1939j52386r4562J91027k14588l6951J76699J60891
24382A01421j61479J13354M2527J75976J06349K9748j5081j25174l21898j76290
24372b30547j81866L04420J89521N623n5451k28203j00162J22074K38625K48702
24362C12736l481k75881k11489R2580r9086J61223N1211j42781J13617O1712j2581
24351D7780k08762m7048o7993J26127K57824o0064p569j03714p9255j31409M0569
24340b33514n8038K941J87553R2530J40974k53107o6499J95559K2251p0823l9891
24329h0064j6208Q1172J26559q5474k04806m1689K22997q3999j98865j6544k6901
24318c23822o2441P1331m0008k7984O4736q1930L4257N0047R4576J3698N7863
$$ y = [286561, 316266, 224812, 153230, 71291, -81095, -175657, 15370, -199218, -236169, -59470, 101421, -60058, 53296, 95823, 271799, 378148, 407896, 392815, 267641, -54257, -230547, -412413, -107993, 81528, 87151, 31700, -196503, -296665, -174591, 64034, 312736, 309255, 33374, -178115, -85535, -184621, -23398, 27813, -114968, -1351, 60361, 47780, -160982, -208030, -276023, -149896, 107928, 47864, 40295, -63419, -142674, -274083, -233514, -291552, -288611, -101058, -8528, 132446, -120661, -187160, 8399, 30650, -40173, -80064, -96272, -15100, 111459, 25985, -178821, -220510, 2487, -81512, -280377, -296921, -323822, -386263, -314932, -354940, -382924, -318188, -400118, -365861, -315814, -221238, -207540, -149677]
24307a49677J27815M1501K59425P1755j76689p5676J23119P8577k44436q309P1078
24296A18483j86879j34981J63391J410o7598j10826K71448L19960q2299J7358
24286C09467O6246K6443k6116j25456j76048k9917J27065L2562J31602J46249
24276D82097j43448l62720p9767m7929n45j93285l9363J32992J45802k73210j34751
24265e14127K06428o9319N356J60009J19241l11623p9630J58184N2992L514j43098
24254d12073j14728L01981J04837l9120r9036J36039N4684J03565J14450l3422
24244A17177J18695k06895O1520j2713j17902k43448o2706K6568N9478p4154l50871
24233f85251L6988J59550L20663k2337Q3699J10833N8403K4900j15685q4866M4104
$$ y = [-149677, -21862, 19639, 279064, 350819, 174130, 98454, 221573, 300150, 55714, 47405, 118483, -68396, -203377, -39986, -38576, -106174, -217000, 54448, 374408, 292109, 309467, 375713, 402156, 376040, 250584, 74536, 44619, 171684, 204246, 335848, 482097, 338649, -24071, -103838, -151767, -152312, -345597, -384960, -251968, -106166, -379376, -514127, -307699, -377018, -371662, -211653, -92412, -404035, -483665, -325481, -272489, -268975, -412073, -526801, -224820, -119983, -159103, -258139, -122100, -67416, 36149, 150599, 117177, 235872, 28977, 90497, 77784, -40118, -283566, -346272, -319704, -260226, -334380, -685251, -648263, -488713, -168050, -190387, -106688, 4145, 62548, 87448, -28237, -113103, -68999]
24222f8999K30650P5084k18505j54273k65985N2637o6746R6784J86853K45415
24212A12915P5481k63564R2518J20652P7984o5032j05803J7893O4022K04759M9882
24201C81707m0821O8914j69853j25322l09600j68462O6663j29817l1619j72367
24191f30577j43199K9143M68489L70572l7518Q3027o7194j12790r8234K64025
24181A25744K63889l8898j27692j27314j73961O7309K26882N8596q4788j57207
24171C2560j70513k65823p7763L9260J44047J62861M2600k1396j17187j09359
24161c40713K55091L33872o0950P0738J26675j06418m2459k3540k23519n0559
24151f1782q5151p2634n9205J11824J96421q6886j5593o0835L9696J16565j38442
$$ y = [-68999, 161651, 236735, 18230, -136043, -402028, -349391, -416137, -319353, -132500, 112915, 188396, -75168, 17350, 138002, 215986, 150954, 45151, 63044, 127066, 331825, 381707, 340886, 409800, 239947, 114625, -194975, -363437, -296774, -426591, -458210, -630577, -773776, -744633, -276144, 94428, 56910, 139937, 72743, -40047, -138281, 125744, 389633, 350735, 223043, 95729, -78232, -10923, 215959, 274555, 189767, 32560, -137953, -403776, -481539, -442279, -298232, -135371, -92771, -114167, -231354, -340713, -85622, 248250, 187300, 258038, 384713, 278295, 235836, 212296, -11223, -61782, -146933, -219567, -278772, -166948, 29473, -57413, -73006, -133841, -94145, 22420, -116022]
24140a16022l4667o863o7268j687J6686K04688J6956q5987Q6304J83469J67464
24129C63073k2592l68749m20513m6883J65088J94194J98282j00279J02790k7125
24119C7286J6164O89P6686J28303j83541j58015P7426J78628J22760p8721l02889
24108h5224j12552J61417J8061K76893M7661m964M0383j86448l16624q2883j11297
24097c55577L0159M2209Q334j9710j0040J41343K68329q2528N0955J42266o7703
24086A48037r6951n2802M1085K73197P425k12250m60797p0793L91540N10805J6157
24075D94653P8297n3729l29935J2269J80137j00260k87367Q9500J18326k86278
24065h4387O178K72949r9223j45916j94411J43839K25114J46763J20111l8242
$$ y = [-116022, -150689, -157552, -224820, -226507, -209821, -5133, 11823, -74164, 12140, 195609, 363073, 340481, -28268, -448781, -495664, -330576, -136382, 61900, -38379, 64411, 37286, 53450, 54139, 130825, 259128, 75587, -82428, -5002, 173626, 296386, 217665, -85224, -197776, -36359, -18298, 258595, 306256, 301292, 341675, 155227, -161397, -244280, -355577, -325418, -283209, -274875, -294585, -304625, -163282, 105047, 22519, 73474, 215740, 148037, 51086, -1716, 39369, 312566, 319991, 107741, -353056, -423849, -32309, 478496, 494653, 572950, 519221, 189286, 201555, 381692, 281432, -5935, 83565, 201891, -84387, -78209, 194740, 95517, -50399, -244810, -100971, 124143, 270906, 391017, 352775]
24055C52775m4810k24940j05607Q9056j4120r7272r3003k43926k12351M0308o157
24044e60047J03776K01233K65010J52548J94687j51879r2877k1002P0851j63400
24034a100r770L2021Q388J7954l06310M6773P5352q7847J13375L4599K9469P5478
24022B8382L9858R9664J0486J97688m7398k22520Q7394j57017j02865K58088L0883
24011B22643j46791n1121K82694J75569k25981j90501J11763n7232j61953M6503
24001E593n3424j2532p3337m403J13714J10122J71270P884q2310k11468j10914
23990a39805L5970M01379J68057k35619j49455J68581J90420j78470l5427O3156
23980B88787m16187j32235N8910L8907M2525Q0587J03240j47785j65314m3419
$$ y = [352775, 307965, 83025, -22582, 66474, 52354, -44918, -137921, -381847, -594198, -553890, -560047, -456271, -255038, 9972, 162520, 357207, 205328, 112451, 91449, 162300, -1100, -10870, 21151, 29539, 47493, -258817, -212044, -136692, -224539, -111164, -76565, -47096, 28382, 68240, 167904, 178390, 376078, 328680, 106160, 193554, 36537, -66328, 191760, 222643, 75852, 24731, 307425, 482994, 257013, 66512, 178275, 121043, -40910, 5593, -47831, -60363, -133700, -138103, -24389, 85733, 257003, 264887, 182577, -28891, -139805, -103835, 297544, 465601, 229982, 80527, 249108, 439528, 261058, 225631, 288787, -127400, -259635, -200725, -161818, -119293, -38706, 64534, -83251, -248565, -291984]
23970b91984o6135q2044o4747K12020J7753j50406K8808R8271P5421J99168j84044
23959b07919j35166J1307J09758J39533M0173M8690O0464k49615J04319p0346
23949a48802P2042J51664j04204k36283N086l0327O6394j07984j3825J13720L7667
23938a94852L83110M99431J31608l94040m52641l6466q9666j7677K36026K5750
23928I0583j47838k80604J252J22963J60273J21607J82003k22429r7022r3472
23918a62684k07409r500J66040J003k05284J67562j592j38322J14835R1966J06128
23907g7257P6048l7768j2912j40232N4901J42622m2239m7221l445J37945R8050
23896A48492J05887p0837j68147k43522j41688j20602o1613k8956J76186L81262
$$ y = [-291984, -358119, -440163, -504910, -292890, -275137, -425543, -396735, -298464, -223043, -23875, -207919, -343085, -331778, -222020, -82487, -42314, 6376, 66840, -182775, -78456, -148802, -76760, 74904, -29300, -265583, -260497, -290824, -224430, -332414, -346239, -232519, -194852, 188258, 687689, 819297, 425257, -27384, -63850, -153516, -171193, 64833, 90583, -57255, -337859, -336607, -213644, -53371, 68236, 250239, 27810, -69212, -162684, -370093, -379593, -213553, -212550, -417834, -250272, -251864, -390186, -275351, -183385, -77257, -1209, -38977, -51889, -192121, -137220, 5402, -36837, -84058, -87503, 50442, 148492, 254379, 183542, 15395, -228127, -369815, -490417, -552030, -580986, -404800, -23538]
23886b3538n2627j62322Q2422R8140p1026j08641J76950L14562K3423L6438J13114
23875D26895o3420l47266J55385K05649j33674j72530j10612M5227J13489j51925
23865c2782r4025r6682n9087K3586R2937J06041M3957J66746j21447l56825j58228
23854d85809Q9139J13988p953R3322J14912R4359K03771J96329l00512p4007J20229
23843A57768j33752n4330k61223m44626p5984J74311K39629P8413l2605J97820
23833a54579K31591q3995p5328N3750J3502O558J10275J04098J47887M2725j49380
23822B47104j10654r5039j58043r6127L14074J91348j58631K452Q7811l8771q4133
23811A01391p9619J23099j3677r9947j31585j68438J0509L9616J88388J29732
$$ y = [-23538, -76165, -238487, -156065, -57925, -128951, -237592, -60642, 253920, 277343, 313781, 426895, 363475, 16209, 171594, 377243, 243569, 71039, -39573, 5654, 119143, -32782, -126807, -223489, -282576, -258990, -166053, -60012, -16055, 150691, 29244, -327581, -485809, -396670, -282682, -290635, -197313, -82401, 11958, 215729, 412058, 111546, 37539, 157768, 24016, -30314, -291537, -736163, -812147, -637836, -398207, -319794, -352399, -154579, 77012, -6983, -82311, -28561, -15059, -8501, 101774, 205872, 353759, 396484, 247104, 136450, 41411, -116632, -212759, 101315, 292663, 134032, 136484, 224295, 185524, 101391, 21772, 144871, 131194, 31247, -100338, -268776, -258267, -218651, -30263, 99469]
23801I9469l5313p0231L6582k98830m5711k9541N7854J24608j33448n4974K49886
23790i9649J90182K21345K19671k84453k47394j00144J1811j31232J73955Q6884
23780D0976j02579N2686J05055p4187L8360J9102j42411Q7937j05256j95070n7351
23769c32738J61030P2145J6073J43135p7790j65573Q9739j09194J52887J25303
23759G5017K43440k05927j61185j81199P2331P0313J2464j60481j81422K17318
23749a99331K47522j39754p4451J08464P7020O9243J054j95922p2302q305L23730
23738A36968K29431k4845r3489j36735n2022k1554J43597M5705j24705n84727
23728d82376l42728J74027J09247n5232K41941J42756J20041q1899J35997L3155
$$ y = [99469, 64156, -6075, 30507, -268323, -314034, -343575, -285721, -161113, -294561, -349535, -99649, 90533, 311878, 531549, 247096, -298, -100442, -88631, -219863, -45908, 40976, -61603, -8917, 96138, 21951, 60311, 79413, -62998, 24939, -80317, -275387, -332738, -171708, -99563, -83490, 59645, -18145, -183718, -93979, -203173, -50286, 75017, 318457, 112530, -48655, -229854, -157523, -87210, -74746, -235227, -416649, -199331, 48191, -91563, -166014, -57550, 19470, 88713, 89767, -106155, -178457, -186762, 136968, 366399, 341554, 248065, 111330, 59308, 37754, 181351, 227056, 102351, -482376, -825104, -651077, -541830, -597062, -355121, -212365, -92324, -174223, -38226, -5071]
23718e071j42364q1904J78110K9583l0929K4587O5365j64688j40789o1398K47848
23707h1650n1762L2593k2134j23111J94452J36727J78082q08j08538j61064n8627
23696f5840K2782K06842J80536j0834j42186m20546K4849O5616r9528j55128J2036
23685c81401L01322L5858j23122K08195L7220r3040j11371j6000j388R6267J5635
23674c1825R9779n7586K34470N6736j5694j22991j5255k04901j35664j27171l8562
23663c58664J02099J49738k59055O9713K75955j35563j43288M58530l509k06637
23653e0681j05435k0934J54321K16901o2228j30402n0866r4602P4747J40732k11359
23642a39806J12615r5101j7854j6767J20237n6599K5634J9257j69074J10295K99581
$$ y = [-5071, -147435, -229339, -51229, -21646, -52575, -27988, 37377, -127311, -268100, -329498, -81650, -133412, -100819, -122953, -246064, -51612, 85115, 263197, 262389, 153851, -7213, -65840, -43058, 163784, 344320, 333486, 191300, -229246, -204397, -138781, -238309, -393437, -381401, -80079, -44221, -167343, 40852, 78072, -14968, -126339, -142339, -143727, -47460, -31825, 67954, 10368, 244838, 301574, 285880, 162889, 147634, -57267, -192931, -320102, -358664, -256565, -106827, -365882, -296169, -20214, -155777, -299065, 159465, 155956, -50681, -156116, -177050, -22729, 194172, 131944, 1542, -49324, -143926, -69179, 71553, -139806, -27191, -122292, -140146, -156913, -36676, -93275, -67641, -48384, -217458, -107163, 192418]
23631A92418r8318j90439j4943N4064m1904l26610J84751N3468J0216R595l7603
23620b05305J90169J17301K92861J70115q8214k13276k35821k13448L0564J65884
23610A0830l3992J16101p6463O1357K57327n7824p181J47201j60316j02206k59903
23599a05069j8185J72032K61834L708M4011L6132Q7271P6990J26573q4787j36795
23588D63715j08398K1138j95605l05930K31342l738r6602m6163p5518J71657O7345
23577A23243M71p6291Q1189k66147J02089K20381k4941P2363J12287Q1808j10437
23566C16015M2059k48017k40387J70430O2489j29644J68623o0898o7354q1831
23556f8515O5355J59796q6060j44474J56851p4199L7544q1903r2315q0236K21752
$$ y = [192418, 94100, -96339, -111282, -57218, -99122, -425732, -240981, -187513, -177297, -167702, -205305, -15136, 102165, 395026, 565141, 476927, 263651, 27830, -185618, -155054, 10830, -23162, 92939, 16476, 77833, 335160, 277336, 270155, 417356, 257040, 154834, -105069, -123254, 48778, 310612, 314320, 358331, 394463, 481734, 558724, 685297, 600510, 463715, 355317, 376455, 180850, -125080, 106262, 102524, 5922, -40241, -115759, 55898, 123243, 123714, 47423, 128612, -137535, -35446, 184935, 159994, 232357, 344644, 426452, 316015, 358074, 110057, -130330, 40100, 102589, -27055, 141568, 80670, 13316, -68515, -3160, 156636, 70576, -73898, 82953, 8754, 46298, -35605, -127920, -208156, 13596]
23545A3596K22070N5544J61013k37821M603J04461P7653j71424k39081j4895k9389
23534e3670j51587K07051K01269J00115j7725j83016q8709R4356q3853j28866
23524a04635O8269K69487l993q4064o8972N3850j19591Q3767j3719J9975l0557
23513F9817p8357k73744m1800q179j4808J20218J99432J21474N1964j48214J27366
23502A25169K30169j08j16813r4027l788N9825J04346n4594j15191o7380o0707
23491F901j4822k3854R1063J34523K9800j3487Q2232k83569q3713l0883o3355
23480a69164j04166J36299m4252p355J5646r3981L34R0013J63095j60109j45866
23469c19506J34359J54484k6589j02908j64455p6970r9776O3563J64602K07605
$$ y = [13596, 235666, 291210, 452223, 214402, 219005, 323466, 401119, 229695, -9386, -24281, -53670, -205257, 1794, 203063, 303178, 285453, 102437, 13728, 108084, 24231, -104635, -36366, 233121, 229128, 145064, 76092, 129942, 10351, 94118, 80399, 100374, 69817, -8540, -282284, -324084, -332263, -347071, -226853, -27421, 94053, 146017, -2197, 125169, 355338, 355230, 238417, 144390, 140602, 200427, 304773, 250179, 134988, 67608, 6901, -7921, -31775, 59288, 193811, 223611, 210124, 292356, 8787, -74926, -105809, -169164, -273330, -137031, -181283, -188638, -172992, -266973, -266639, -176626, -13531, -173640, -319506, -185147, -30663, -57252, -160160, -324615, -401585, -501361, -437798, -273196, -65591]
23459f5591K14352n2m9554q397n05313Q6691M51058j91324j35550r2825n6756
23448c53261J52934j77622l9885J56619J80461J48145J22079L662k30579q4352
23438a21799J75172j5613P6983n1620J15369J39901l86542l41733r577J29590
23428b89869J77412K06261j68207r7577j23315J08129O2605j66980M6633O4734
23418a80174r0076j08845J20097l1348j87561O7897J36842J57021J8695J8925
23408g8527R0991O1048k2211j73047l5500q250o4544j25715l31396J96646K97932
23397a92573K67745J32750j71228n392r5959k27545J64590K44622j42766j62681
23387a88437K31809J20156j32984J98878j37217k11703J59025L0690O4969K48573
$$ y = [-65591, 148761, 148709, 99155, 90758, -414555, -327864, 123194, -68130, -203680, -296505, -353261, -200327, -377949, -417834, -261215, -80754, 67391, 189470, 193132, -37447, -121799, 53373, 37760, 114743, 63123, 178492, 318393, -68149, -409882, -419459, -289869, -112457, 93804, -74403, -171980, -295295, -187166, -124561, -291541, -244908, -180174, -270250, -379095, -258998, -290346, -477907, -410010, -273168, -116147, -97452, -78527, 12464, 73512, 51301, -121746, -157246, -165496, -230040, -355755, -687151, -490505, -192573, 75172, 207922, 36694, 31302, -64657, -292202, -127612, 117010, -25756, -188437, 43372, 163528, 30544, 229422, 92205, -119498, 39527, 70217, 135186, 383759]
23377C83759l3368j84708J0331J50892L0272K2493n8245N6280Q0542j21147j71945
23366A65156k58826k58928J19447J38633N5552N2591P9696J2167R666J00269n3939
23355A61484j03529r1383j37933j95011K50440L3336J77035L84979M1407n2843
23345D67982k1863j72120n2361j91531k90142M8259K25725K11665O1770K4056
23335C11440n5784J66168Q670j50868j16737J8616k41134l00809L39191K92212
23325B70965j42718j52488J58937q9448p0807j48867J83764J42777j04528j20982
23315g3395j87494L9575J84121L3492j09732j8034M347J24669K0098J65219m8713
23304A34153k94806j62572J09307J09140K0602l1955r9037l7845L0290J09297
$$ y = [383759, 350391, 165683, 176014, 326906, 357178, 379671, 321426, 377706, 458248, 337101, 165156, -93670, -352598, -233151, -94518, -38966, 13625, 93321, 105488, 115154, 215423, 161484, 57955, -33428, -171361, -366372, -115932, -82596, 94439, 479418, 520825, 467982, 446119, 273999, 221638, 30107, -260035, -211776, 13949, 225614, 287384, 311440, 255656, 421824, 430494, 279626, 162889, 181505, -59629, -360438, -21247, 270965, 128247, -24241, 134696, 45248, -25559, -174426, 9338, 152115, 47587, -73395, -260889, -221314, -37193, -3701, -113433, -131467, -127120, -2451, 17647, 182866, 134153, -160653, -323225, -213918, -104778, -84176, -116131, -215168, -253013, -222723, -113426]
23294a13426R5306P2577K2235O8645N1156j34871j35779m9845J97226P0854m3823
23283A00255Q2574J07152l58726o9552K00158p1015k42274r651m6120P5043K15481
23272a6675J60319k05866l29567k82789k1565K50478K02917r637R174l0994R315
23261b64890Q6286O4473K47443j09076J6386J04953K18519L3583k6900M2821l8323
23250C75275L7727k17167j6219J73349Q1101M7885p4262O864k47866k54070q2587
23239a69970J9756j37688m8316M5806J34389Q371Q5573J55222K25320L49459j09393
23228E58529j64790J2520k21009j40355J79335L6441p2302l33695J60586K3203
23218C8463K0569j46436J14062j3920l05891n2991N8305J87508j14474j02500
$$ y = [-113426, -18120, 54457, 76692, 145337, 196493, 61622, -74157, -124002, 73224, 144078, 100255, 182829, 289981, -68745, -138297, 61861, -9154, -251428, -261079, -307199, -232156, -16675, 143644, -62222, -391789, -674578, -696143, -445665, -242748, -252385, -243211, -274205, -264890, -178604, -114131, 133312, 24236, 40622, 145575, 364094, 397677, 370777, 413598, 375275, 413002, 195835, 179616, 352965, 434066, 481951, 407689, 414553, 166687, -87383, -169970, -150214, -287902, -336218, -290412, -156023, -147652, -62079, 93143, 318463, 667922, 558529, 393739, 406259, 185250, 44895, 224230, 260671, 188369, -145326, 15260, 38463, 59032, -87404, 26658, 12738, -293153, -346144, -287839, -100331, -214805, -317305]
23208c17305Q8644L6805k5891K1309O9700K7431j58153j98825K67120J75611m5361
23197e8915k4268j1842j07308K704K28710Q9137p494J36121j9937k02266J42233
23186A66875p2656N3446J20206j46885k6328m0735J9563q9258K3998O1885J78602
23175B48713K5100q247J25529j38293J03026k00398k42105K57010J93035J14745
23165D78115J13599l22383m2496l4790O9462m5005j15331M3516L30774j25980
23155C49481j29909n1210l18928k0829L30828L4276j87655n7002K15850l9538
23145A25364k24072j9378m5924J15102L19121M6536Q871K59050n9279l36213J79360
23134C68538Q2473k33981N3590j84716K4226R7021j58966J25840m9071p7009r9769
$$ y = [-317305, -228661, -191856, -217747, -196438, -126738, -99307, -257460, -456285, -189165, -13554, -58915, -83183, -95025, -202333, -199629, 29081, 118218, 110724, 246845, 226908, 24642, 166875, 94219, 147665, 267871, 120986, 94658, 53923, 73486, -15772, 8226, 70111, 248713, 273813, 265566, 391095, 252802, 355828, 155430, -86675, 170335, 363370, 478115, 591714, 269331, 226835, 192045, 261507, 216502, 101171, 144687, 475461, 349481, 219572, 168362, -150566, -171395, 159433, 193709, 6054, -50948, 164902, 125364, -98708, -118086, -164010, -48908, 270213, 316749, 325620, 584670, 525391, 189178, 368538, 451011, 217030, 270620, 85904, 110130, 207151, 48185, 174025, 124954, 47945, -51824]
23123e1824n8016L8276J25936j5788j78249j65713K12282J05894o6310j23093
23113a76605J4824j77954n7310J4863J57656q6169P2986K08252R3779l1133m0543
23102g354l9222r2249k57505J99292L8362N4056N0313K36981J56186R2398k91006
23091A40252j20911o6670J21957R8416o8732j97515l63323J43199K58291J25369
23081G0333K3707n5410k14722J11907J42436m6645k2521k32439k5323J33425K92953
23070A77701o4643J2553j90132J1217J32835N4422n755j96007K6031O1936P9850
23059A00008L7201J7784o5002L1930l7211j24841J13729N43105M39329L93180
23049A449212N11009K72470J90521k26420l89828j85750k55930l91568l25572
$$ y = [-51824, -109840, -71564, 54372, 38584, -139665, -305378, -93096, 12798, -53512, -176605, -161781, -339735, -397045, -382182, -224526, -310695, -237709, -29457, 64322, 33189, -7354, -46576, -138825, -396330, -197038, -158676, -104620, -54307, 182674, 338860, 431258, 140252, 19341, -47329, 74628, 173044, 104312, -93203, -456526, -313327, -55036, 70333, 94040, 38630, -176092, -64185, 78251, 31606, 9085, -223354, -248677, -115252, 177701, 113058, 125611, -64521, -53304, 79531, 133953, 128198, -67809, -41778, 20158, 100008, 137209, 154993, 89991, 121921, 84710, -40131, 73598, 616703, 1056032, 1449212, 1960221, 2232691, 2423212, 2196792, 1806964, 1621214, 1365284, 973716, 648144]
23040F48144M8054J76908J81963j53089k15969k79611l81486J70350L98314j05087
23030D88491o0022L9357R5892J2753j95269k44600k79689m1998K64651p8434o1413
23019f0281P6945r8441J70330J62064j20759k42226M5746R3783p8663p6764K58873
23008A30607J50837j57075J10706J51971k96699j58755K09216J13200N611j1023
22998B48596r6936N1468J07391P0762j63316m20936j41374M6803r4966J23354
22988b69154P7592J43100J42494k7415l6961J58439j39541P2275j3203n7397J63395
22977B13624O4548N0099J11132j4186j32249n0975q156j38160K2621Q0921j104
22966A98115J57550M0495j78881j06191q4503j53114q2825k19710j3521K9999
$$ y = [648144, 696198, 873106, 1055069, 901980, 686011, 406400, 24914, 195264, 593578, 488491, 428469, 467826, 563718, 576471, 381202, 136602, -143087, -185085, 79566, 1132, -60281, 16664, -81777, 88553, 250617, 129858, -112368, -66622, 27161, -51502, -128266, 130607, 281444, 124369, 235075, 387046, 90347, -68408, 140808, 254008, 259619, 248596, 151660, 203128, 310519, 381281, 217965, -202971, -344345, -297542, -392508, -269154, -191562, -48462, 94032, 66617, 29656, 188095, 48554, 120829, 107626, 50229, 213624, 278172, 328271, 439403, 425217, 292968, 241993, 233837, 95677, 118298, 199219, 198115, 355665, 396160, 217279, 111088, 26585, -126529, -209354, -429064, -442585, -412586]
22956d12586n8367K31433K06598J80266j43897k57507l1919L8880m3746j74853
22946d65698J80695k5245R3587L13981k064l441J31579l521k59615r9554j27775
22935b67071n389k1394m8063j7862J48307L37491k1213o9862j9268R5871R2323
22924B03870J85863j16236j96315j7440j50926J55000K66672J8277l23309J91230
22914B16686R5983l20747j68444L9843J24082J24334m6158J26748J34804K7302
22904C54433j03217j76281k44276R743J11397L7637O8000O4099l7972k54621j55195
22893c26253J44802M1587Q2301K94079M8434J58930k09241k87779o7740N1907
22883f8973j65078m5308J74982J28061m7374J32119j36676r2314N9487K71075
$$ y = [-412586, -470953, -239520, -32922, 147344, 3447, -254060, -285979, -247099, -290845, -465698, -285003, -310248, -216661, 97320, 95256, 91815, 223394, 219873, -39742, -139296, -267071, -272460, -293854, -341917, -359779, -211472, 126019, 104806, 34944, 15676, 111547, 203870, 389733, 273497, 77182, 59742, -91184, 63816, 330488, 348765, 25456, 216686, 312669, -8078, -176522, -136679, -12597, 111737, 65579, 192327, 327131, 354433, 251216, 74935, -169341, -159598, -48201, -10564, 57436, 121535, 83563, -171058, -326253, -181451, -139864, -57563, 236516, 284950, 443880, 234639, -53140, -120880, -68973, -234051, -279359, -104377, 23684, -23690, 108429, -28247, -120561, -61074, 210001]
22873B10001L96240o942l30739o3606O8553j67428l63670m7060K64945J2883M4047
22862A7224O0796J71819o3663j729J90426K11319k01633p16M553l74411o623J07365
22850A14727J4933j51528k13792P3071J15816K12689p8136k2441k65708l1719
22840b32088j23861R9446L69784M2991J90244P6312m5326k90344l11360l67769
22830e91971j76339L97207M81763K01031k46018l13680r3479J43609K33895j11077
22820g5059J35956j24126l26438J06784K24890O0287J14370J52933K4871l63202
22810f8734q1740p649k20611K78654N22433l3975L193K1457l43165j04702J509
22799c3330J70768K2531J8427J00957J52546J5390j19086j07994q4471O7252N1420
$$ y = [210001, 606241, 599299, 268560, 204954, 273507, 106079, -257591, -304651, -39706, -26823, 17224, 78020, 249839, 186176, 184447, 374873, 586192, 384559, 383843, 388396, 13985, 7362, 114727, 129660, -21868, -235660, -162589, -46773, 165916, 87780, 65339, -200369, -232088, -355949, -256503, 113281, 156272, 346516, 422828, 377502, 87158, -224202, -591971, -768310, -371103, 110660, 311691, 65673, -248007, -341486, -197877, 36018, -75059, 60897, -63229, -389667, -282883, -57993, 2294, 116664, 269597, 294468, -68734, -150474, -158123, -378734, -100080, 422353, 388378, 391571, 413028, 69863, -34839, -33330, 137438, 159969, 178396, 279353, 431899, 447289, 328203, 220209, 135738, 202990, 254410]
22788B54410Q3396R4895J13077k65863j49944j9283k2139m4559j24036P4743O2416
22777E7113Q9426K44471J31648L0877k46084Q0543k39235j88627j68443P9879
22767a28432N24413M7791l23825m5618j7790J63568q628J24559k3114P3210m046
22756C82088k10618l56081o3703L98385N9751q7897O9058j263m8740J85335K72004
22745E98319l79071O6343J14925J71422m8078j16552j4195r3305L644k7201n7063
22734B19188k1692J17265Q4539J42413j25117l5723K91546j3218l75395j71689
22724A12117P2088m9914j8221M6900Q6271j78888k77097p4991J71358J53092J40956
22713A83671j20270j39697J90454L54994J00735k20627J1618o0811j36194Q6406
$$ y = [254410, 337806, 432701, 545778, 279915, 129971, 110688, 88549, 43990, -80046, -5303, 57113, 146539, 391010, 522658, 553535, 307451, 387994, 148759, -39868, -208311, -128432, 395981, 443772, 119947, 74329, 56539, 220107, 211479, 336038, 312924, 386134, 382088, 171470, -184611, -248314, 150071, 209822, 121925, 190983, 189720, 140980, 326315, 598319, 219248, 285591, 400516, 571938, 523860, 407308, 393113, 299808, 303452, 276251, 219188, 197496, 314761, 399300, 541713, 416596, 380873, 672419, 659201, 283806, 112117, 184205, 134291, 116070, 162970, 249241, 70353, -206744, -281735, -110377, 42715, 183671, 63401, -76296, 114158, 469152, 569887, 349260, 360878, 300067, 163873, 250279]
22703B50279m9162J63588l0840q1361L7520L2097o4738P1265L6042j23557p3830
22692A67303J17208o4226Q5552P7334P9643K31669K11053k35606j7111J42350
22682G95169J07382j04685j824j41653k02076j1553k3356J0999J43819J52162
22672G24384M066k34001j38319K78765K15012p3720k0629R5476k6174o4319n9030
22661G01511r4140J74239K00464L4646j07510j4688k14466j06400P2481j48398
22651D97739K86049M11325j28900k58836k20026j21189K38041J23728J90048L03592
22641A321571P8353N8277J79741J16328L98330K83811J19331r8283N4627J77761
22631B689847J95460M52116L73901M35330N51934M97109P89937J393065J614363
$$ y = [250279, 201117, 364705, 333865, 252504, 290024, 322121, 257383, 328648, 364690, 241133, 167303, 284511, 220285, 305837, 383171, 462814, 694483, 905536, 669930, 652819, 795169, 902551, 797866, 796042, 654389, 452313, 440760, 417404, 428403, 572222, 724384, 728450, 494449, 356130, 634895, 849907, 776187, 755558, 851034, 824860, 760541, 701511, 607371, 781610, 982074, 1016720, 909210, 894522, 680056, 573656, 646137, 497739, 783788, 1195113, 1066213, 807377, 587351, 466162, 704203, 827931, 1017979, 1321571, 1399924, 1458201, 1637942, 1754270, 2152600, 2436411, 2555742, 2457459, 2512086, 2689847, 2885307, 3337423, 3711324, 4146654, 4698588, 5195697, 5985634, 7378699, 8993062]
22622H993062K110521K854906L622458M579645O711663R002104J1547265J3172321
22614F2593945J2661484R872015M568693j689324o913715j0342148j1741344j0910856
22606D8098750r504788p456068n528609m234108l506745k636119k055055j853581
22598A1323677j424415j030980j028934p08554p82253l21393l58646l29855k93837
22589E044810j56902l74819l72066k04345K4952k39469n34886k42214j96399j1595
22579B737067P143J14779Q3503q3114Q4574R653K6240m5429L80597P20554O49221
22568D684788M44167J58555k31254p77881n94570n39268l61983l92806l89655
22559B000093n0501K75804j07501L9263j00702k32330r1539P3913J49720j35522
$$ y = [8993062, 11103583, 13958489, 17580947, 22160592, 28872255, 37874359, 49421624, 62593945, 75255429, 85127444, 89696137, 88006813, 81093098, 70750950, 59009606, 48098750, 38593962, 31137894, 25609285, 21375177, 17868432, 15232313, 13177258, 11323677, 9899262, 8868282, 7839348, 7130794, 6348541, 6027148, 5668502, 5338647, 5044810, 4887908, 4513089, 4141023, 3936678, 3961630, 3722161, 3187275, 2945061, 2748662, 2737067, 2744210, 2858989, 2942492, 2859378, 2943952, 2953605, 2979845, 2934416, 3315013, 4035567, 4684788, 5128955, 5287510, 5056256, 4278375, 3683805, 3144537, 2782554, 2389748, 2000093, 1949592, 2225396, 2117895, 2157158, 2056456, 1824126, 1732587, 1806500, 1956220, 1820698]
22549A820698o864J4479r009J30398p4377J19165K75200L25139p1219k4467R33
22538B500076J28326Q5582n3996K4309j80378K96035M87497M96620N36680O5503
22528D386254j2150j44206n6492k7934J53350m8756j9508M22144M23948K72969
22518E349619J61154n6638N03089P06016P15168P40429P49745Q51609J308689
22509A1028880J675439J704711K312592L339271M701546O120940Q003650J0844095
22501D9731124J6446008K5587307M3629465P2011615R8783873J02702322Q1718588
22494D90610302M1720108j4700808o6513947q9845423q8711563p5144530n5025764
22487A42388375l6124208k3469023j6140365j1500210q570483o955874n603259
$$ y = [1820698, 1813834, 1828313, 1819304, 1949702, 1875325, 1994490, 2269690, 2594829, 2523610, 2499143, 2500076, 2628402, 2713984, 2659988, 2684297, 2503919, 2799954, 3287451, 3784071, 4320751, 4386254, 4374104, 4229898, 4173406, 4145472, 4298822, 4250066, 4230558, 4652702, 5076650, 5349619, 5510773, 5454135, 5957224, 6663240, 7378408, 8118837, 8868582, 9720191, 11028880, 12704319, 14409030, 16721622, 20060893, 24762439, 30883379, 38887029, 49731124, 66177132, 91764439, 135393904, 207405519, 306189392, 408891714, 490610302, 532330410, 517629602, 451115655, 361270232, 272558669, 197414139, 142388375, 106264167, 82795144, 66654779, 55154569, 46584086, 39628212, 34024953]
22480C4024953m432506l543382k940270k382012k197388k007777j443150j113247
22472A3965221r53208j012801r71125r97590j008706q29141o16866l01463l12272
22463F962049l74000j22195l80870l09954l33825j69368k04204m17714l36339
22454D313580k43376l66127k91341o2347j44406k11780M2085k16499n2367J09873
22444B877295j18745m9275k0177j82268k26185P486j05637j31830l7244l4594
22434A978826k73859j52667J48977M2915j48234j26797j8804J22596J35620o3233
22424A645340j13742K89324M10323Q17306N24428K54922O488k94018k93591m17017
22414B829763n81309n83344n72036k73759L69246J43773n10503j01561r390K4389
$$ y = [34024953, 29592447, 26049065, 23108795, 20726783, 18529395, 16521618, 15078468, 13965221, 13012013, 11999212, 11028087, 10030497, 9021791, 8192650, 7575784, 7274321, 6962049, 6588049, 6465854, 6084984, 5775030, 5441205, 5271837, 5067633, 4649919, 4313580, 4070204, 3704077, 3412736, 3350389, 3205983, 2994203, 3036288, 2819789, 2767422, 2877295, 2758550, 2709275, 2689098, 2506830, 2280645, 2288131, 2182494, 2050664, 2013420, 1978826, 1704967, 1552300, 1701277, 1744192, 1595958, 1469161, 1450357, 1572953, 1708573, 1645340, 1531598, 1820922, 2231245, 3048551, 3572979, 3827901, 3834389, 3540371, 3246780, 2829763, 2248454, 1665110, 1093074, 819315, 1188561, 1332334, 821831, 720270, 710880, 735269]
22404G35269o689N137N181j39415j64519j71008m8426J72515j49526r9706j74797
22393c5984J85298j25594M9864J78570M8898K14274K01605l22342j28388j65446
22383A00755j67625j6957O6280j01701k06382K15473J74159P4019L4956j25862
22373D7115r2324K17476J6324l15565k90190n7981J88838K15931K6850J31216
22363H7690l2584J55058j32341M0642m0391L0003L2112O0990j99767j12328o8692
22352a79608k5110N2149M7688K16031J71587J6355r566j07113q8931j33609K23236
22341A83109J45513m3332n4572R2124o7265j75189l65050j63873J39208K6136
22331b83191j3450R0326K84137K17890L4985k34040o3130K38395K09620J5028
$$ y = [735269, 728580, 733717, 738898, 599483, 434964, 263956, 215530, 388045, 238519, 138813, -35984, 149314, 23720, 73584, 252154, 301052, 515326, 716931, 394589, 266201, 100755, -66870, -83827, -17547, -119248, -325630, -110157, 64002, 138021, 172977, 47115, -45209, 172267, 188591, -126974, -417164, -475145, -286307, -70376, -43526, 87690, 55106, 210164, 77823, 118465, 78074, 108077, 140189, 201179, 1412, -110916, -179608, -204718, -152569, -104881, 111150, 282737, 299092, 289526, 182413, 93482, -40127, 183109, 328622, 285290, 230718, 322842, 255577, 80388, -284662, -448535, -309327, -283191, -296641, -206315, 77822, 295712, 330697, 96657, 33527, 271922, 481542, 496570]
22321D96570l43018j49492L5100j15952k01149o038L5637J91491P8355K8101r8690
22310d9085j16770J29231j33310k45192J7360J56010J1286Q3429j2125j78066
22300c37232J40684K18526j30765L2925q044Q0378m006J11380J13105o4926k29248
22289g7223o9946J34955K24194N347j12901j95917j45672J17764J87458J35426
22279B03485p1981o4271M1077m7233k50287k38574J9368J87883J60782Q7739Q223
22268C6211j02111L06431R7510j78819j39924j0601O9399j54025J7713p1658J188
22257a28686Q2546m9212n1037K36705M26193m7002k94781k15557J68841k2230
22247A05780p9664K15450k60831J61864o5792k65837k91095J24206L08611J32115
$$ y = [496570, 153552, 4060, 39160, -76792, -277941, -283979, -248342, -56851, 21504, 49605, -49085, -165855, -36624, -169934, -415126, -397766, -241756, -230470, -147041, -159166, -337232, -196548, 21978, -108787, -75862, -83906, -3528, -7534, 103846, 216951, 152025, -77223, -147169, -12214, 211980, 217327, 104426, -91491, -237163, -119399, 68059, 203485, 131504, 67233, 108310, 61077, -189210, -427784, -408416, -220533, -59751, 27988, 36211, -65900, 240531, 338041, 159222, 19298, 8697, 78096, -75929, -58216, -129874, -128686, -46140, -95352, -146389, 90316, 516509, 469507, 174726, -40831, 128010, 105780, 26116, 241566, -19265, 142599, 76807, -189030, -480125, -355919, -47308, 84807]
22237H4807k02003Q341J42485O4546p3482J6165J26160K4864P9536o7320K5669
22226B29768j28626j22477J11931l2791J67323j04869j98811j39746M4614J0418
22216a63266M0863j42710J50483J20899k07194j89055J15964K77325O2678n5915
22206A0072R4085k61463J3088K23632J75151k95871J31990k02186l78700O7354
22196d22848J54442N1604J35877j12934j18714q7199J19598K6748J66366J56725
22186F9665J9130j55237P0977R6900j52088j00422j35650R9415O4653j00839K9002
22175a94494o9401k286M2958p7460q1099k0339K47418L15848J32981O2801j29785
22164B27142l80349J3469K93175J13127m0839l1450j5237k43206k71266J3351
$$ y = [84807, -117196, -108855, 33630, 98176, 24694, 40859, 167019, 191883, 271419, 204099, 229768, 101142, -21335, 90596, 57805, 225128, 120259, -78552, -218298, -173684, -163266, -122403, -265113, -114630, 6269, -200925, -389980, -274016, 3309, 65987, 10072, 104157, -157306, -144218, 79414, 254565, -41306, 90684, -111502, -490202, -422848, -268406, -216802, -80925, -193859, -312573, -399772, -280174, -253426, -87060, 69665, 88795, -66442, 4535, 101435, -50653, -151075, -286725, -187310, -122657, -223496, -194494, -263895, -266181, -223223, -300683, -381782, -402121, -154703, 161145, 294126, 356927, 227142, -153207, -139738, 153437, 266564, 225725, 194275, 179038, -64168, -335434, -322083]
22154c22083J63422N5998m064J84739J12147O1631p5893k74425m5681R4483J68154
22143A18428o9012j6780K47375K3859O6710k61378j12079q8234j1519J05762j14297
22132a11165l12525J84914N9081j15182p7852L53092J50582j86l5696j55425p9797
22121a40159K18699J18027j28202o1247k5263j76232l03869r3881M30242L17402
22111A55517N0332n4951j14352k33277l7769j25852j06122K31757J30348K2353
22101h2016j3506o9086K0363P5390j36176J4646Q5268L35436j53239m5242j9277
22090A2561R4276J0563K3449n3433j96463m4194m8299P257J06462J56372j61326
22079i2775j05680l4766J64029K85302p7976l04796P5518j1779l4422n9035J36473
$$ y = [-322083, -158661, -102663, -106727, 78012, 190159, 251790, 175897, -98528, -144209, -49726, 118428, 49416, 32636, 280011, 303870, 370580, 109202, -2877, -91111, -102630, 3132, -111165, -423690, -238776, -179695, -294877, -372729, -19637, 130945, 130759, 95063, -60362, -140159, 78540, 196567, 68365, 7118, -18145, -194377, -498246, -592127, -161885, 155517, 205849, 150898, 36546, -196731, -234500, -360352, -466474, -234717, -104369, -82016, -95522, -164608, -144245, -68855, -205031, -190385, -105117, 230319, 77080, 31838, 12561, 106837, 117400, 140849, 87416, -109047, -153241, -201540, -194283, -87821, 68551, -92775, -198455, -233221, -69192, 216110, 138134, -166662, -91144, -102923, -137345, -196380, -59907]
22068e9907q2087J25744K26085j02899k7892J61103O6039l3427j09177J17158
22058B80740J6453J91794J16405j11931K247j00020j25986r4050k53682M5245
22048c2785l2477p5859J33319J04433j47908j47771N8141N0090l4544j50523k39421
22037e15305R4600K02193q3974Q3319K05899J10464J2754j71721k05944K8421
22027b39294K57852J10440j36420k95421N3062j2732j28629J30526J90707M6352
22017b3557P8632L3204k9571k49065K5612L03016M8736o4984M3943j04307l832
22006E7827m288J94699K0722j46588k0461j42509k6568J98828j02657r7638L10201
21995B41568Q0375k27635N740K17577J02964k66398k93534J32020j70524m5109
$$ y = [-59907, -141994, -16250, 209835, 106936, 79044, 240147, 306186, 272759, 163582, 280740, 297193, 488987, 605392, 493461, 495708, 395688, 269702, 175652, -78030, -32785, -65262, -141121, -7802, 96631, -51277, -199048, -140907, -90817, -125361, -275884, -515305, -420705, -218512, -302486, -219167, -13268, 97196, 109950, -61771, -267715, -239294, 18558, 128998, -7422, -302843, -249781, -262513, -391142, -260616, -69909, -23557, 55075, 88279, 58708, -190357, -164745, 138271, 187007, 122023, 165966, 61659, 57827, 53539, 248238, 268960, 122372, 101911, -40598, -67166, 131662, 29005, -68633, 241568, 321943, 94308, 100048, 317625, 420589, 154191, -139343, -7323, -177847, -222956]
21985b22956j96608L798Q0257K63490Q9939j5920m514q7531J32273J1727P9428
21974A33383N6874k13704q0550J05213j54663m02J28799M0404n1090n5452q6350
21963a77538P8794N9413M968K05429O7853j48163j03295Q6324M6635j75104q6931
21952a41615m9906q2518P8847J97932J42421p3848Q7483K2805r1624j57767J39645
21941G1855K73375j92363r5442L14779N48671O99851L47012J78547J66869J02276
21931B415430k35617k83594m54082k90961k83507o1091k3508k83182l16226k55156
21921g1494J98931N1790k16610J12862J44944q1977j82177M4025n5163n460O0026
21910c03k52278R8816K48464R8879L6931L8111k54319M7843j50K2982m861k6659
$$ y = [-222956, -419564, -415766, -335509, -72019, 17920, 2000, -2514, -90045, 42228, 53955, 133383, 190257, -23447, -103997, 1216, -153447, -153849, -25050, 15354, -35736, -91188, -177538, -98744, -39331, -34363, 171066, 238919, 90756, -12539, 73785, 120420, -54684, -141615, -191521, -274039, -195192, 2740, 145161, 71313, 158796, 181601, 89977, -67790, 71855, 345230, 152867, 57425, 372204, 920875, 1620726, 1967738, 2146285, 2313154, 2415430, 2179813, 1896219, 1442137, 1151176, 867669, 806578, 783070, 499888, 183662, -71494, 127437, 179227, -37383, 75479, 220423, 138446, -43731, 294, -54869, -60329, -303, -252581, -153765, 94699, 193578, 230509, 268620, 14301, 62144, 61994, 84976, 80115, 53456]
21898E3456p1285l191n7371m3573J141P9501K2335j57611r1748K01980K11384
21887A45018o0340k21975K9653M1295j57985J29176K21100K40581j18591l83683
21877a35751P0189L40977k03804j78182J34261r1998j73177q747J53894K05933
21867A13595J58749j5989k92723j33300J26299J22034L6853n7350q1768P0395
21857D6795Q2784O9305L4612j81334j26800K00067J16389l3698L3644m3961j60059
21846C7744k06725j82623J29134J16080k13269j49232K53343J38257J51979M1729
21836A16417j27561k94530L0602J6419j37349J17296K87321L01352K20795l04577
21826B26185k21708k07262p4434K7545J17748J56996j3393j10021R55M6177P2269
$$ y = [53456, -17829, -21020, -78391, -121964, -120823, -41322, -18987, -176598, -268346, -66366, 145018, 84678, -137297, -107644, -66349, -224334, -95158, 125942, 366523, 247932, -135751, -65562, 275415, 71611, -106571, 27690, -64308, -237485, -246232, -92338, 113595, 272344, 256355, -36368, -169668, -43369, 78665, 115518, 58168, -23600, 46795, 129579, 198884, 233496, 52162, -74638, 125429, 241818, 208120, 241764, 197803, 37744, -168981, -351604, -222470, -106390, -319659, -468891, -215548, -77291, 74688, 116417, -11144, -305674, -275072, -258653, -396002, -278706, 8615, 309967, 530762, 226185, 4477, -202785, -277219, -249674, -131926, 25070, 11677, -98344, -97389, -51212, 21057]
21815B1057l60892l49678P7975K09928J39370J99502J99500J41978k40676p5770
21805c7706L8180j90348Q7924J00578N8150r1355K0961J14342l9479p5667j36358
21794a50778j91099n520Q5570L286P7295O2634j37516q6345k01079q258J41518
21783d10292N2089J56743K58093M8473n3850J55363J85043j41169l7343o0197
21773A52953l1129m7750m9159N0909m5812j497K1249k1260N2365O2977J10410
21762B54256J92933j69725j68779K3078J31083n3493j92621j30786n6100J4369
21752a55785j01009j51402l9637O7587M2057n9317k47077O2524L43824K64805
21742B6570J63205l0704k05982l87374N6563K46262R0211j8370L2036R567j00059
$$ y = [21057, -339835, -689513, -611538, -401610, -262240, -62738, 136762, 278740, 38064, -37706, 474, -189874, -101950, -1372, 56778, -34577, -13616, 100726, 61247, -14420, -150778, -341877, -347397, -261827, -258541, -181246, -118612, -256128, -342473, -543552, -551810, -410292, -358203, -201460, 56633, 105106, 51256, 206619, 391662, 250493, 213150, 152953, 121824, 74074, 24915, 75824, 30012, 28515, 49764, 28504, 80869, 143846, 254256, 447189, 277464, 108685, 131763, 262846, 209353, 16732, -114054, -170154, -155785, -256794, -408196, -447833, -380246, -338189, -397506, -644583, -582059, -238235, 26570, 189775, 159071, -46911, -434285, -377722, -131460, -41249, -59619, -27583, -18016, -118075]
21731a18075r6408O080j60484j22303P0308r016L45737l6358P7093J52602L4981
21720A44157o3229l05401Q1294J12455q3831M0782L19880k713k79949j47219n6667
21709b40441J14348J30320K13440j89256Q5077J30266n9590j12418j49780l3222
21699a11256N61j2611P1695K5778q0929J2069L06450J06115p294n6549n541K0585
21687B69073L7399Q5669l76015j35737j3558J46713Q8468r5375j55619j40854
21677b89836J17514j1111m3017J40208L5521J62776J13272j6368k29778k40316
21667b61135p6319n1831l5234K02644L4905q704L143l6820j14942o9876j92135
21656f06304o233J46097M0613k7247K19002J20501j43293R7017j05941o7829q2152
$$ y = [-118075, -214483, -208403, -368887, -491190, -420882, -429898, -84161, -120519, -43426, 109176, 144157, 80928, -224473, -143179, -30724, -114555, -73773, 246107, 243394, -36555, -183774, -240441, -126093, 4227, 217667, 28411, 113488, 243754, 184164, 71746, -78034, -111256, -110695, -123306, -51611, -25833, -106762, -94693, 211757, 317872, 310578, 254029, 248488, 269073, 306472, 392141, 16126, -119611, -133169, 13544, 102012, 6637, -148982, -289836, -172322, -183433, -226450, -86242, -50721, 112055, 225327, 208959, -20819, -261135, -337454, -389285, -424519, -221875, -186970, -195674, -192531, -229351, -344293, -414169, -606304, -612537, -466440, -425827, -453074, -234072, -113571, -256864, -159847, -265788, -333617, -415769]
21645d15769P8535K65091R4536k2613J48826K2712k44380l04453l2573k2915j02179
21634e35182J65697J03868j26642p758N7800p0747l9746P0647P8281M5854J61106
21623i6822j31069r6454J98727M6233J71659j24816J6254Q4197j58056P8963J05176
21612I3992j61465O08q6976l9834J02668M1477r6410n8088L4153Q1693K36786
21601A48604L2938m95268L3328J47764j3091N7670j32717q1389J52039J90887
21591D0765Q9386j47091k8012J78606K15337O8765k23370n5299j30793R827j5373
21580B748J17665K2467j59179j56182j70160P3143J81092J58526J22600o1639
21570A31081j97270j95510J75113N3476L843N2284j66243N7885R3668k01041J24516
$$ y = [-415769, -337234, -72143, 22393, -220, 148606, 171318, -73062, -377515, -410088, -433003, -535182, -369485, -265617, -392259, -400017, -342217, -412964, -452710, -382063, -303782, -257928, -96822, -227891, -324345, -125618, -79385, 92274, -32542, -16288, 67909, -90147, -11184, 93992, -67473, -66865, -153841, -193675, -91007, -49530, -145940, -204028, -169875, -88182, 148604, 181542, -313726, -280398, -132634, -145725, -88055, -220772, -302161, -150122, 40765, 130151, -16940, -44952, 133654, 348991, 417756, 194386, 139087, 8294, 18121, 2748, 120413, 142880, -16299, -172481, -342641, -269498, -88406, 70120, 192720, 131081, -66189, -261699, -86586, -33110, -29267, 23017, -143226, -85341, 8327, -192714, -68198]
21559f8198n867o6682k2093q9581n3763k69996J82375L7177k028K48181K81909
21548A71434J95718o4040j89146k7782j32474K56611o6226l38657q6513p7696
21538c58771K38255L45131n378j47368j34855j26483j03927K0058M3882j26099
21528c55555r6784k5034j38722J1326j36683r6828J38617J49611J01750J88710
21518b59592L29592q8554p3546q0357N3382M5834k8397q6489k2376K87987Q6223
21507A63707O2008L1J03137k84345r6705P9294J18394J23322L119k79464p8228
21496h5730J34839J16359o3826J5553R1717q4400l7640l5973j61075J93403L2152
21485A15379m454j56289N0068N9158j2473J32125j61133j53332J14911r980l05260
$$ y = [-68198, -74065, -140747, -162840, -252421, -306184, -576180, -393805, -356628, -358656, -110475, 171434, 367152, 303112, 113966, 86184, -46290, 210321, 144095, -194562, -281075, -358771, -120516, 224615, 219237, 71869, -62986, -189469, -293396, -273338, -229456, -355555, -452339, -477373, -616095, -604769, -741452, -838280, -699663, -550052, -448302, -259592, 70000, -18554, -92100, -172457, -119075, -73241, -101638, -188127, -210503, 77484, 163707, 225715, 225746, 328883, 44538, -52167, 27127, 145521, 268843, 271962, -7502, -85730, 49109, 165468, 101642, 117195, 208912, 124512, 86872, 50899, -110176, 83227, 115379, 110925, -45364, 4704, 63862, 51389, 183514, 22381, -130951, -16040, -26020, -331280]
21474c31280k85126J20190M59157J64456R1591k06151k79235Q2580j60844J42866
21464b01796J91827l7601j33265J84912n905l41824j91825M0241M03983J12822
21454B1569n5329J64505J46422j75835q1538L01259M0660k87291j95358J36392
21444A5456O0704J8051k53671l45680n054J25819R4374J63264K08367L8720n1521
21433F8829p9039m3289L57155J27969j73182k13708k18142j29690K34741K09739
21423A41383k26336r615k32337J3003K00571L15835J39209O8755m8613k29898
21413A31957l5728q3137p1778j85264p7514K98679J67839Q7550l2765m1973l3180
21402A24686n1622L4947j84502j6154Q4564J00442K17578j0418j34558j67567
$$ y = [-331280, -616406, -496216, -37059, 127397, 218988, 12837, -266398, -183818, -344662, -201796, -9969, -47570, -180835, 4077, -1828, -343652, -535477, -495236, -91253, 21569, -33760, 130745, 277167, 101332, 19794, 321053, 361713, 74422, -120936, 15456, 76160, 94211, -159460, -505140, -510194, -384375, -290001, -126737, 81630, 120350, 68829, -10210, -53499, 303656, 431625, 258443, 44735, -173407, -303097, -68356, 141383, -84953, -94568, -326905, -313902, -113331, 202504, 341713, 410468, 361855, 131957, 96229, 13092, -58686, -243950, -321464, -22785, 145054, 232604, 199839, 157866, 124686, 73064, 108011, -76491, -92645, -8081, 92361, 309939, 299521, 164963, -2604]
21392b604o00k7876j24123j91824k03102q5865J42477L02707R1335j12076J0919
21381b00632K1823q2158j43570K6030m9276j08892J00803j6875K5827K74113K86422
21370A33615P9031j45232j28069N1260R6465j00453m6280o4888R6094P3883n4670
21359i244k24642k4382o881K60554J89843Q6635J74199l76416j21630J43355J90500
21348B81891m9601p2407m9902J21800Q0630K58801M6377l15950k7787L18178J61850
21337G53880r2783k24965j8571r8603k66550J6370M5764K43592L8153n34182n44878
21326f82773J82576K01506N5385J09569J24128J84077j43761k88177n0774L14262
21316F018j4648j53207j90557K29902P1316j11192Q3405Q029k17654J16024j18444
$$ y = [-2604, -3204, -31080, -155203, -347027, -550129, -635994, -493517, -190810, -99475, -211551, -200632, -178809, -260967, -404537, -378507, -427783, -536675, -435872, -452747, -426920, -152807, 133615, 212646, 67414, -60655, -9395, 87070, -13383, -59663, -124551, -28457, 45426, -9244, -233886, -258268, -265149, -4595, 185248, 271883, 446082, 69666, -51964, 91391, 281891, 232290, 159883, 109981, 231781, 312411, 571212, 617589, 301639, 273852, 592030, 753880, 661097, 436132, 417561, 318958, 52408, 68778, 114542, 358134, 396287, -137895, -682773, -500197, -298691, -243306, -133737, -9609, 174468, 30707, -257470, -308244, 6018, -8630, -161837, -352394, -122492, -51176, -162368, -78963, -70934, -288588, -172564, -291008]
21305b91008m806J11051N6280Q7164k0010O8354O2612j3648Q9999j11658r3873
21294e9543k01208J41389J43237n0549l9554L7923m53416k88684M2701Q7620J09388
21283e30696K62260J27959k30163P0500K44040K6970m3057J5933j911j25572j4696
21272a98433J3649j21688K06664K7964Q6317J16366m7585j06437K61456q6796
21262A51477j74197m0788J16596J27527p8744j46345r729k3284q9809K43531M8209
21251A24444j14648n919L3794J22921k32570j81427Q4226K95826K28517q4407
21241B70757j86814r0098N7904L03817r0480q4296l3360J38460m1920j76447j31343
21230f3820m0819j4939j5055J18982J31655J27835O743j85428j23900k65051j39519
$$ y = [-291008, -295814, -184763, -128483, -41319, -61329, 7025, 69637, 55989, 145988, 34330, -59543, -260751, -119362, 23875, -26674, -66228, -28305, -481721, -770405, -727704, -640084, -530696, -268436, -140477, -370640, -300140, -56100, -29130, -72187, -56254, -58165, -183737, -198433, -184784, -306472, -99808, -71844, 14473, 130839, 83254, -23183, 238273, 151477, -22720, -63508, 53088, 180615, 101871, -44474, -54203, -77487, -167296, 76235, 124444, 9796, 3877, 37671, 160592, -71978, -253405, -169179, 126647, 355164, 270757, 83943, -6155, 51749, 355566, 265086, 180790, 147430, 285890, 243970, 67523, -63820, -104639, -119578, -134633, -15651, 116004, 243839, 250582, 65154, -58746, -323797, -463316]
21219d63316R4402P5523j3763N3828j20490l443L66194J6248J58243J05605N478
21208B74509k96410j46745o0812L2332o5860J19972O9478L5800J68713l7418m42007
21197c48448j48483J72999K37233k03925j58N747R7973L0326L3855J51251L2607
21186F0977k36234j75780n6331j32410J47056J98278J38615K67584k6949j25792
21176E9014j9609j1775k73088q6661L0893J89463j2897J68875O2697j07959k5321
21165b6368j43729j63112r3740N9591J58727K00925j05088j17318J54445j35858
21155b11525m2094J59876L25685n4991k04320j43047n1962R6781p0355j10571
21145c06523J59129J3378n520J17641R7974r4830j915j4261P8062q3777K4270
$$ y = [-463316, -368914, -293391, -307154, -253326, -373816, -377259, -11065, 5183, 163426, 269031, 274509, -21901, -168646, -229458, -197126, -262986, -143014, -73536, -37736, 130977, 93559, -348448, -496931, -323932, -86699, -290624, -290782, -285035, -187062, -156736, -122881, 28370, 60977, -175257, -351037, -407368, -539778, -392722, -194444, -55829, 211755, 184806, 59014, 39405, 27630, -245458, -332119, -301226, -111763, -124660, 44215, 106912, -1047, -26368, -170097, -333209, -426949, -367358, -208631, -7706, -112794, -230112, -75667, -211525, -253619, -93743, 231942, 176951, -27369, -170416, -222378, -125597, -195952, -306523, -147394, -134016, -139536, -21895, 76079, -18751, -20666, -34927, 43135, -40642, -16372]
21134a6372L1453m6701K16105J55776q3186J20698p2841j86365l9808K45882R2876
21123D17517k8816j62126l6478l29759k03128J1502Q7984L77551j2931J55464
21113B76780p7228J52683K19185M0143k1003j24390k12043q5581J49505j2870
21103C05181k02214j9358J89060R2054l01356j08203K11685O7629k762O3467J68917
21092D64100j98045l39669K34072J46553R5647k94855j26671p040J56194R3055
21082B23341o0728P960p2884p3678k56728J65940K04467j74083l2690n0139P8686
21071d0536r0069P5882o5426P0955M04416J02650j65764o4393j28534j24748N3823
21060B8256q8681j62037L5200m7547M9836J91386J99952r164r4863q4481Q9775
$$ y = [-16372, 15081, -31620, 184485, 340261, 257075, 377773, 304932, 118567, 78759, 324641, 417517, 388701, 226575, 190097, -139662, -342790, -331288, -243304, 134247, 121316, 276780, 199552, 352235, 571420, 611563, 590560, 466170, 254127, 168546, 318051, 305181, 102967, 83609, 272669, 364723, 63367, -44836, 166849, 234478, 231716, 295183, 464100, 266055, -73614, 160458, 307011, 402658, 107803, -18868, -25908, 130286, 223341, 162613, 170573, 97689, 24011, -232717, -66777, 137690, -36393, -69083, -119222, -40536, -130605, -54723, -120149, -49194, 355222, 457872, 292108, 227715, 99181, -25567, 28256, -60425, -222462, -187262, -234809, -184973, 6413, 206365, 197201, 102338, 17857, 107632]
21049A07632J29950l8749K9458j2757j0333J13778j26357j42123q4698j47121
21039a81320n5319K3775P1133O9584K340M4806J36484J01609k80465l22725P1899
21028c18199K48851K12516l7719o7510J32189N6350j24947R2395J0164j41245
21018F2845J92874q0255l02139j24095P6164J18542k80777L14297J3873k09922
21008b18593K75157J07846p6113j10738O4625M8277m2163n0357j67930p3608l11470
20997e55067k2602K69237K20320J3085J95034J30103J5243j33851j41969j02736
20987a13203k650l429Q4482J08147j03690J57649P7635j19408q4714j89851r3192
20976b82224j55157m0354j6588m7421O7013J74870J97586l7903m3041J03759P4715
$$ y = [107632, 237582, 198833, 228291, 215534, 205201, 318979, 192622, 50499, -34199, -181320, -236639, -212864, -141731, -72147, -69807, -25001, 111483, 213092, -67373, -390098, -318199, -69348, 143168, 105449, 37939, 170128, 226478, 101531, 193926, 204090, 62845, 255719, 175464, -126675, -250770, -174606, -56064, -336841, -22544, -8671, -218593, 56564, 164410, 88297, -22441, 42184, 90461, 48298, -2059, -169989, -243597, -555067, -577669, -308432, -88112, -75027, 120007, 250110, 265353, 131502, -10467, -113203, -115853, -119282, -34800, 73347, -30343, 127306, 204941, 85533, 819, -189032, -282224, -437381, -477735, -494323, -541744, -474731, -299861, -102275, -140178, -183219, -79460, -4745]
20965d745k2359O2732K7980j03073J96451j3562j83136k56266J33547R7457j13957
20954a78931J40825O1918L1598J45602l04176p8962r288O1123j00622J4622O46928
20943D30637O1831k70812J80128l5941j43654Q4218Q8312k74629j13466p2147
20933f5523k43591n4362J79424j24100J92941L57420n8500m12l0736L6730j95292
20922f001n34770N1324M1177K16645J55974J53387J56998l0725K0489j97460K32260
20911B59298l9404j17650r7454J39256j13191j91063J16210N9708N9237q8985
20901a4038J27860l8025J79949J94681O4376j59241k94485q2469n6947M6018o8983
20890a01304k6319J90090J23794O7990K6200O0814M0334j52346N6607K01083j37081
$$ y = [-4745, -27104, 35628, 63608, -39465, 156986, 143424, -39712, -295978, -162431, -64974, -178931, -38106, 23812, 55410, 201012, -103164, -182126, -191414, -130291, -230913, -216291, 430637, 492468, 221656, 401784, 365843, 222189, 306407, 394719, 120090, 6624, -65523, -309114, -363476, -184052, -308152, -115211, 242209, 183709, 183297, 152561, 189291, -6001, -540771, -489447, -448270, -231625, -75651, 77736, 234734, 204009, 224498, 27038, 259298, 219894, 102244, 4790, 144046, 30855, -160208, -43998, 15710, 74947, -14038, 113822, 75797, 255746, 450427, 514803, 355562, 61077, -21392, -78339, -32321, -101304, -127623, 62467, 186261, 254251, 280451, 341265, 381599, 229253, 285860, 486943, 349862]
20879C49862L8371r9481j52176o7449J09816K55115J44328K8236j59207j53838
20869B93577n0988k03959j15228j04968J63992K9183J51730P2571n5915L081M6571
20858B29647J4651K395l26101j01555J3410N9151J54221K35220J19866L1336L7114
20847D69355j16884J46442r1720j03053k08367o2836J11823P9900j46322n9940
20837A8398L08924o1722M3790j27982k19504J33481L43952j29562j53481r1794
20827F4500n4195O0605L51015J74809n9904j35983l14818k29658K47096J02740
20817B06207k82637j41461P4303L0728k5658k3349j08626l62852r7685L75660
20807c55370J24133k78189p9356K66318M2441K0705n0247O0456j34422N8288J08895
$$ y = [349862, 388233, 288752, 136576, 69127, 178943, 434058, 578386, 606622, 447415, 293577, 242589, 38630, -76598, -181566, -17574, 11609, 163339, 235910, 179995, 183076, 229647, 244298, 246693, -79408, -180963, -167553, -108402, 45819, 281039, 400905, 432241, 469355, 352471, 498913, 407193, 304140, 95773, 32937, 144760, 224660, 78338, 18398, 327322, 265600, 309390, 181408, -38096, 95385, 439337, 309775, 156294, 64500, 10305, 70910, 421925, 596734, 536830, 400847, 86029, -143629, 103467, 206207, -76430, -217891, -143588, -112860, -138518, -161867, -270493, -633345, -731030, -355370, -231237, -509426, -588782, -322464, -280023, -259318, -309565, -249109, -383531, -325243, -216348]
20796b16348k241J82364J6850o9662q2513n9282l6594j81611K03296J31873n8662
20785a72530J53243j14134Q5716J01560J8437K628j32833M2276J30324j54907
20775d0220K5048M5134J6722j6420m26J36925m7882n9290M1300K5773m8202j93652
20763a15190o7926J52831L042N6371J72449M721l01780K3799J09981k0532k0176
20752b410m4138J95908j12309J7277k339k8919J54604O0407p5876l14826k65495
20741d18116R0562J28312K943K05375R1408M1989j47056m04003q1924M5918J21445
20730c23147K08248O6097m9939J4570J230K17036L68719P3657j80809j0968m0310
20719C44384j37990j46844J98645K49222L8967k09912k67105k2354j90196j06117
$$ y = [-216348, -218589, -36225, -19375, -89037, -171550, -230832, -267426, -449037, -245741, -113868, -172530, -19287, -133421, -47705, 53855, 72292, 74920, -57913, -15637, 114687, -40220, -15172, 29962, 46684, 30264, 29838, 166763, 118881, 59591, 100891, 126664, 78462, -115190, -183116, -30285, -27243, 29128, 201577, 206298, -95482, -71683, 38298, 17766, -2410, -46548, 149360, 37051, 54328, 51989, 23070, 177674, 238081, 162205, -152621, -418116, -327554, -199242, -196299, 9076, 100484, 142473, -4583, -408586, -490510, -444592, -323147, -114899, -48802, -98741, -84171, -82941, 134095, 502814, 576471, 395662, 384694, 344384, 206394, 59550, 258195, 507417, 546384, 336472, 69367, 47013, -143183, -249300]
20709b49300j22480J17138J17173O4958K8924M3236O7923n3217M3782P6012K8059
20698A62208J57299n9390o999j21707J27162l5454j25812l6050m0812j78005J17706
20687c9854N4890k2279o1735r9166l266j2926J5452q2970J49848K0708M563k0452
20675i7187l50480q987J7896J448N4841L18347K27717j09374j85610j04666J25149
20664a10906J50534J09625r299J46670J17696j68757j60304j92241m5356R8679
20654f3659j86776K7316r076m8197K21440K43268N6046l17685n3743J49437j74080
20643a55709k17200k98699m5055K72126K02490J06187R0922J03163K27892n3254
20633B32863k32498j7364L15489m4491j31641k25290j02993L81509k5261j55999
$$ y = [-249300, -371780, -254642, -137469, -72511, -43587, -351, 67572, 14355, 58137, 134149, 162208, 319507, 260117, 253118, 131411, 258573, 223119, 97307, 61257, 20445, -157560, -39854, 15036, -7243, -68978, -168144, -171410, -184336, -168884, -251854, -102006, -81298, -76735, -97187, -447667, -456654, -438758, -437310, -382469, -64122, 163595, 54221, -131389, -236055, -110906, 39628, 149253, 139954, 286624, 404320, 235563, 75259, -116982, -162338, -63659, -250435, -223119, -232195, -280392, -58952, 184316, 240362, -77323, -131066, 18371, -155709, -372909, -671608, -716663, -444537, -242047, -135860, -44938, 58225, 286117, 232863, 365, -16999, 298490, 253999, 122358, -102932, -205925, 175584, 150323, -5676]
20623e676k7335P7525o4290k34K03255J20663L7244j36960P7684J47263j33346
20612B95793o9128j23078j06093j62275l61990o0533K31017N2320M56317m5488
20602A06862j98338Q2932P7657m1469o2854N0729K80892o1268J9435K00280q2653
20591C72205k37966k64676k68200k21898K13148K53388N4804K1293J60824J67089
20581B50011j26391l1508N8855L18680j4918m8192j67852k77002P4738l10942
20571b74521L5596K05477P5859k02139K19357J08375r6052j36363k66596j686
20561c32693l13968k47100L87482K51077K3151J36269J25746o7515q4738j50637
20551b72926j08979P6515J85841K39332J69015j48213J95968q6083m00758j0166
$$ y = [-5676, -33011, 44514, -19776, -20010, 183245, 303908, 341152, 204192, 281876, 429139, 295793, 226665, 103587, -2506, -164781, -526771, -587304, -356287, -303967, 152350, 106862, -91476, -8544, 69113, 27644, -35210, 15519, 296411, 235143, 254578, 454858, 372205, 134239, -130437, -398637, -620535, -407387, -153999, -99195, -77902, 82922, 250011, 123620, 92112, 150967, 469647, 454729, 406537, 238685, -38317, 36421, -274521, -238925, -33448, 42411, -159728, 59629, 168004, 71952, -64411, -331007, -332693, -646661, -893761, -506279, -255202, -232051, -95782, 29964, -37551, -122289, -272926, -381905, -305390, -119549, 119783, 288798, 140585, 336553, 250470, -150288, -160454]
20541a60454j71339q9840M7388Q5429J00432Q8186K65664J28541k21765j69778
20531i7536J50479L8725k19747K42828N5764r4179N8112K72841Q0012q7191p5068
20520C25040j5901J13558Q484j69361J23502p3236j86352j391J203N8013k91758
20509a08199J99370Q1561J12220N5365j74754o0433K7362l4670p4670j44932M4654
20498g7126R9512j75885L7458J42572K4289j15652j34793k08962K34057m8679
20488b23209j06033J1460J40457K56751K0463J58815Q3133j16632K41727j14174
20478C52758m0158k8076j53830R3252L8964j98488r9267n5910K20229q3836o671
20467C8967J1622J17726j23114j57891R743J56169J06211O4441k01175J39632
$$ y = [-160454, -331793, -421633, -374245, -288816, -188384, -100198, 165466, 294007, 72242, -97536, 52943, 91668, -128079, 114749, 170513, 76334, 134446, 407287, 487299, 400108, 325040, 309139, 422697, 431181, 261820, 385322, 312086, 125734, 124343, 125546, 183559, -108199, 91171, 172732, 284952, 340317, 165563, 105130, 132492, 97822, 23152, -121780, -77126, 22386, -153499, -116041, 26531, 50820, -64832, -199625, -408587, -174530, -223209, -329242, -317782, -177325, 79426, 99889, 258704, 341837, 225205, 466932, 352758, 312600, 284524, 130694, 223946, 262910, 64422, -34845, -90755, 129474, 45638, 38967, 50589, 168315, 45201, -112690, -102947, 53222, 159433, 223874, 22699, 162331]
20457A62331N2942J19467k10881k93309K42421K43749K07342J6833j95287l9056
20447C06552l833p6281Q909J83719J09316J82083Q9996j40192k85362J56761J96045
20436G27713j46916k06409j98421k16045k3055Q9658M292K1955m7725l4746P1738
20425D2039O1245K1554n6683j12901k7455M0071l9063n9232K2415J58142j7714
20414C2418K50631J47885l53868l17791M147N355l1200J03090L39014J9614k15069
20403a5774J05190r852k38749J57668K9938o2863N8859M1636K50315L3045j07959
20392B41454l356O5101k1851K41281P9481j63786l4344q8188r5403P2955J5844
20381C09188j94183j32734q1445k6624J70485K34041J44381j96529m7244p596
$$ y = [162331, 215273, 334740, 123859, -169450, 72971, 316720, 524062, 540895, 345608, 306552, 302719, 226438, 235347, 419066, 528382, 710465, 800461, 660269, 374907, 531668, 727713, 580797, 374388, 175967, -40078, -63133, 26525, 30817, 52772, 5047, -29699, 42039, 103284, 124838, 68155, -44746, -72201, -32130, -71193, -130425, -108010, 50132, 32418, 283049, 430934, 77066, -240725, -236578, -231223, -262423, -159333, 179681, 199295, -15774, 89416, 79564, -159185, -1517, 28421, -34442, 24417, 66053, 316368, 349413, 241454, 238098, 303199, 281348, 522629, 602110, 438324, 403980, 315792, 220389, 293344, 309188, 115005, -17729, -99174, -125798, 44687, 278728, 423109, 226580, 179336, 171740]
20371A71740q7330j56106k3497L05626J63206Q3592L763l20284l5454J54697q7762
20360A72191K899O1759j76590K90719L42539o4960j98365N967k6732n1182j47052
20349B11193j40550J53654J27289n6694j86541k5613O8417K36021M7711K6588
20339D61475o5394k00211R7821R3102K8299l1692j20307J35269O4424Q2509k21018
20328C24277k06016J27870K3993K15098J50216P8516N1927j06231O5360J51600
20318H76610K48810p8337j0890J65646J72302j2194q3739j20544n776q4860j01866
20307I65162r8454K1800J02521K0089l2016n638j11776m5249o2308j15599K5822
20296F64354r3143n4200J6833j07245k3655j43513r6998J19210J49022r8328L2412
$$ y = [171740, 84410, -71696, -95193, 210433, 373639, 457231, 460994, 140710, 105256, 259953, 172191, 175090, 236849, 60259, 350978, 693517, 628557, 430192, 436159, 409427, 358245, 211193, 70643, 224297, 351586, 294892, 108351, 82738, 151155, 387176, 434887, 461475, 396081, 195870, 293691, 386793, 415092, 383400, 263093, 398362, 462786, 545295, 324277, 118261, 246131, 270124, 485222, 635438, 713954, 765881, 659650, 725010, 876610, 1125420, 1047083, 1036193, 1201839, 1374141, 1361947, 1278208, 1157664, 1151888, 1067028, 965162, 866708, 888508, 991029, 1011118, 979102, 973464, 861688, 816439, 754131, 638532, 664354, 571211, 517011, 533844, 426599, 402944, 259431, 162433, 281643, 430665, 332337, 364749]
20285C64749o0521N7736r2002J8380J71385J56782m29420n1470K23701J73732
20275E33052l9379J82228j40134l72102R81L86910L50075j0162l88096k56350
20265B47023j82591j10780K3777J94503Q2874k76190J18801O5306J89952K7217
20255C79892o3977J50505q0571r8363O5693J28398J14679k9049n1015P6094N2409
20244F44695j0877Q1886n9533j28148M1328J10296J7780p8921k11343J66611j38015
20233D35759j58480Q1494j37408q3434J07982J18636R2548L1355j72420K6155
20223C42187J46652O6929l2205k72594L9802O8792J95244J49546K4350j88363
20213E40340j17251j16440K08214J5422J53920K96796m8514L602j39420j65348
$$ y = [364749, 304228, 361964, 269962, 288342, 459727, 616509, 187089, 135619, 359320, 533052, 493673, 675901, 535767, 163665, 164646, 551556, 901631, 891469, 503373, 247023, 64432, -46348, -22571, 171932, 254806, -21384, 97417, 162723, 352675, 379892, 315915, 466420, 385849, 287486, 353179, 481577, 596256, 567207, 516192, 592286, 644695, 633818, 715704, 656171, 528023, 569351, 679647, 697427, 618506, 407163, 573774, 435759, 277279, 358773, 221365, 137931, 245913, 364549, 457097, 488452, 316032, 342187, 488839, 555768, 523563, 250969, 290771, 359563, 554807, 704353, 728703, 540340, 423089, 306649, 514863, 530285, 684205, 981001, 932487, 936089, 796669, 631321]
20203F31321j36075J34770K7708J45984j10676k75860p0625Q5086O7844J0062
20193E09539J43135M6256j10633K52331K11391L8625r0450j28099o390J88754
20183A054459m5383o7364j70137m3427L9140L76960K36590j06484l38061k54803
20173F81490j30575K09758J08299J73559J35052n6521k18059J7875j9647L9844
20163I41075M7561J71964l6704j23394k62025j34087q7797j53197K34308K87413
20153H85117J23809J65252J04462j51223O1909j28394k11977M0044j26666j00037
20143F62296l2373N2850K19676j19672j16946M0695N8240J21651L25568j9949
20133A192036l1096k23160l54779R6093q5872L9607J73758k47151o1809K91348
$$ y = [631321, 495246, 630016, 657724, 803708, 693032, 417172, 346547, 431633, 499477, 509539, 652674, 698930, 588297, 840628, 1052019, 1090644, 1000194, 872095, 865705, 1054459, 1009076, 941712, 771575, 728148, 767288, 1144248, 1380838, 1274354, 936293, 681490, 550915, 760673, 868972, 1042531, 1177583, 1121062, 903003, 920878, 901231, 941075, 988636, 1160600, 1123896, 1000502, 738477, 604390, 516593, 363396, 597704, 885117, 1008926, 1174178, 1278640, 1127417, 1189326, 1060932, 848955, 888999, 762333, 662296, 629923, 682773, 902449, 782777, 665831, 706526, 764766, 886417, 1211985, 1192036, 1160940, 937780, 583001, 679094, 593222, 632829, 806587, 559436, 497627, 788975]
20123G88975q4370q57O5438J0032J87097P4550q4263k5545p955J75150Q5575o8526
20111A115301M6624k0959j55136j10165j32603M0013J11946N4911j012L1490n0304
20100I30106l089J13780K66609j93792j62605K0532J45186N5494k66298k59558
20090F46365N661L28178M2856j45946l5850M03593K74297j79332r2788K21209
20080A468243K10322J4363k51318p5989L3249j27748j02029N5468j32052R7648
20070A190157M3294K15321M12512m2678j11977R5722j5775P5306j26183q2445
20060A653254m18893q7429J10383P4368K7422l1332J79496N6723j8654J22637
20050A667975P9267j63462o6338P5002Q9516j7519j26332J1878p9R8362L11107
$$ y = [788975, 704605, 703748, 769186, 779218, 966315, 1040865, 956602, 931057, 923102, 1098252, 1183827, 1115301, 1161925, 1140966, 985830, 875665, 743062, 783075, 895021, 949932, 948920, 980410, 930106, 927017, 1040797, 1307406, 1113614, 951009, 971541, 1116727, 1172221, 905923, 646365, 652026, 980204, 1023060, 877114, 841264, 1244857, 1519154, 1339822, 1247034, 1468243, 1678565, 1692928, 1441610, 1365621, 1398870, 1271122, 1169093, 1224561, 1092509, 1190157, 1233451, 1448772, 1861284, 1818606, 1706629, 1802351, 1786576, 1861882, 1735699, 1653254, 1234361, 1146932, 1257315, 1331683, 1359105, 1327773, 1507269, 1563992, 1545338, 1667975, 1747242, 1583780, 1517442, 1592444, 1681960, 1664441, 1538109, 1549987, 1549908, 1648270, 1959377]
20039A959377K8784k57402j39608k3973M1314J709L6574L4002J43516J40222R3648
20028B058163j24125j83090J4900J4501Q7180J73399J38447q9995k57359J95939
20018B027960N2385n8254q8399j9949l6865L066K40632K16001m9437M6895J84303
20007B518338K50055n1237j32565j50723r993Q2841K61191J84580o3795o9814
19997B818878k26480j7224M62993K67029J88534n5730k22417k5716J3973J70723
19987C374563K99768J21128N4591k61079k19174J46026K08064M05956L16578j03806
19977D342615m1854K10144L09223J86501J13954J98468K77615O4754J45889k3069
19967E784240J12472K87325N5650K91028J53101L58285N28855N63261L82911N93049
$$ y = [1959377, 1988161, 1730759, 1591151, 1567178, 1608492, 1610201, 1646775, 1680777, 1824293, 1964515, 2058163, 1934038, 1750948, 1765848, 1780349, 1867529, 2040928, 2179375, 2089380, 1832021, 2027960, 2080345, 2022091, 1933692, 1913743, 1876878, 1879944, 2120576, 2336577, 2287140, 2334035, 2518338, 2768393, 2717156, 2584591, 2433868, 2423875, 2506716, 2767907, 2952487, 2888692, 2818878, 2592398, 2575174, 3038167, 3305196, 3493730, 3438000, 3215583, 3189867, 3203840, 3374563, 3674331, 3795459, 3850050, 3588971, 3369797, 3515823, 3723887, 4129843, 4446421, 4342615, 4300761, 4510905, 4820128, 5006629, 5120583, 5319051, 5596666, 5661420, 5807309, 5784240, 5896712, 6184037, 6239687, 6530715, 6683816, 7042101, 7570956, 8134217, 8517128, 9110177]
19957I110177P68132P42994J342341J778602J738517K026108K298935K484717
19949B2290523K683332K683380K459898K541223K432130K104239J955253J953116
19941D1103094J783714J829788J710551J217724N22227m5983l01433o78661j059243
19932D6081778j133393j110096j416409j595521j612268j942776k151725k274902
19924C2844688k538869k596395k347650k236792j950784j776145j677250r65474
19916A6755329p62263n99170k05755l28984l65272k80799l05202j86691J979k63370
19906A3459802k92265o8129P5878P1901J79155J97480Q3937L4538r7399L3394
19896A3678292J88770K67946K17173K48307K99160L57239L74399K56806K91903
$$ y = [9110177, 9878309, 10621303, 11963644, 13742246, 15480763, 17506871, 19805806, 22290523, 24973855, 27657235, 30117133, 32658356, 35090486, 37194725, 39149978, 41103094, 42886808, 44716596, 46427147, 47644871, 48167098, 48121115, 47819682, 47141021, 46081778, 44948385, 43838289, 42421880, 40826359, 39214091, 37271315, 35119590, 32844688, 30305819, 27709424, 25361774, 23124982, 21174198, 19398053, 17720803, 16755329, 15993066, 15393896, 15188141, 14859157, 14493885, 14213086, 13907884, 13721193, 13723172, 13459802, 13167537, 13099408, 13175286, 13247187, 13426342, 13623822, 13707759, 13742297, 13644898, 13678292, 13867062, 14135008, 14352181, 14600488, 14899648, 15256887, 15631286, 15888092, 16179995]
19887A6179995K17780K29921L85211K75850L54291L06082L70797M42991P94412
19878A9557330O46165M22452O86586N77796P76529O23378N09648N89122P22622
19869B5111628Q33518R81388N15830P56350R95644J092761R11696P84905R17963
19860C2901683J139819J674832J290556J335665J452172J754662J519121J524274
19852D4592784J650020J645142K035456K046848K252651K426997K485928K584061
19844F1719887K696066K754262K596029L031426L643235L669251L619042L764308
19836H7493506M109403M254316M296527M501590M522656M626375N190375N512316
19828A24507064N760724O273271P325822Q404398J0346669J3102518J6681868
$$ y = [16179995, 16397775, 16627696, 17012907, 17288757, 17643048, 17949130, 18319927, 18762918, 19557330, 20203495, 20625947, 21312533, 21890329, 22666858, 23290236, 23799884, 24389006, 25111628, 25945146, 26926534, 27442364, 28198714, 29194358, 30287119, 31198815, 31983720, 32901683, 34041502, 35716334, 37006890, 38342555, 39794727, 41549389, 43068510, 44592784, 46242804, 47887946, 49923402, 51970250, 54222901, 56649898, 59135826, 61719887, 64415953, 67170215, 69766244, 72797670, 76440905, 80110156, 83729198, 87493506, 91602909, 95857225, 100153752, 104655342, 109177998, 113804373, 118994748, 124507064, 130267788, 136541059, 143866881, 152271279, 162617948, 175720466, 192402334]
19821A92402334J8188751J7096856J4538360J3230053J1758160Q354155N067890
19814B80636559N160275P482891R025462J0713990J2543722J1348123N168921
19807C42079943k237975p704554j2405002j5807767j5111853j1002934p967385
19800B69842473q503524j0134751j0238272j0972926j4179743j7728844j9591425
19793A78492988j9614341j8169122j5171385j1734364r339533p727215o691649
19786I0045379n597992m705482m397843l973282l230840l280312l086315l012258
19778E8761055k621902k293938k381541k195804k117371j945163k017298j412369
19770D1775669j468666j639402j433168j235729j193185q18951r46675j086434
$$ y = [192402334, 210591085, 227687941, 242226301, 255456354, 267214514, 275568669, 280636559, 285796834, 293279725, 302305187, 313019177, 325562899, 336911022, 342079943, 339841968, 332137414, 319732412, 303924645, 288812792, 277809858, 269842473, 261338949, 251204198, 240965926, 229993000, 215813257, 198084413, 178492988, 158878647, 140709525, 125538140, 113803776, 104464243, 96737028, 90045379, 84447387, 79741905, 75344062, 71370780, 68139940, 64859628, 61773313, 58761055, 56139153, 53845215, 51463674, 49267870, 47150499, 45205336, 43188038, 41775669, 40307003, 38667601, 37234433, 35998704, 34805519, 33986568, 33039893, 31953459]
19762C1953459j345957j253849j015187o81178p03568o32645q79597p98943o33310
19753B4009225l50648n70290q78103r08155o44915l16364l24352n50991o06708
19744A8858699n71479m44514m25354j78136l12858m29434m45752n30607k55202
19735A5265363l88278k37636l26292m02383k41035J18883l8604m41172m56884
19726A2851962j82497k89960k85006l48423l54059j9395k03265o1385j54082r1060
19716A0862830l6715n0447j35270k14712l61491j22815L3822J25088k00583j63993
19706I735714J55211k47738j46235J25969J97278J37017K30969J34364L77248
19697A0699797P99072R73554J047564J040952J245885J494799J532934J137341
$$ y = [31953459, 30607502, 29353653, 28338466, 27657288, 26953720, 26321075, 25441478, 24642535, 24009225, 23658577, 23088287, 22210184, 21302029, 20657114, 20340750, 20016398, 19465407, 18858699, 18287220, 17842706, 17417352, 17239216, 16926358, 16496924, 16051172, 15520565, 15265363, 14877085, 14639449, 14313157, 13910774, 13669739, 13788622, 13750018, 13308846, 12851962, 12669465, 12379505, 12094499, 11746076, 11392017, 11372622, 11169357, 11107972, 10953890, 10862830, 10826115, 10775668, 10640398, 10425686, 10064195, 9941380, 9975202, 10100290, 9899707, 9735714, 9890925, 9643187, 9496952, 9622921, 9820199, 9957216, 10188185, 10322549, 10699797, 11498869, 12472423, 13519987, 14560939, 15806824, 17301623, 18834557, 19971898]
19689A9971898P31015Q61890J063162J280920J038133J409195J408677P65828
19681B8530718M31540o1208o76472r42680j079707j202768q23311q80011j091656
19672B2204445j302891j605885j516072j259856j156509j115953j166930r61261
19664A2119088r76181p49419j64648j16902k28405l63097k26891k50802m9156
19655H993587k3995M7642L67289M04175L63851Q19169R91912J190095J503783
19646A4657508J535595J555275J238955J375128J291346Q69948J162599J554519
19638B5240873J524649J258960J231531K79410n91714r36220j297367j336804
19630B5373318j246248r15228q96695j065800j256296j469426j375919j976051
$$ y = [19971898, 20702913, 21564803, 22627965, 23908885, 24947018, 26356213, 27764890, 28530718, 28962258, 28901050, 28224578, 27281898, 26202191, 24999423, 24176112, 23296101, 22204445, 20901554, 19295669, 17779597, 16519741, 15363232, 14247279, 13080349, 12119088, 11142907, 10393488, 10228840, 10111938, 9883533, 9520436, 9293545, 9042743, 8993587, 8969592, 9017234, 9384523, 9788698, 10152549, 10971718, 11963630, 13153725, 14657508, 16193103, 17748378, 18987333, 20362461, 21653807, 22523755, 23686354, 25240873, 26765522, 28024482, 29256013, 29535423, 28943709, 28007489, 26710122, 25373318, 24127070, 23211842, 22315147, 21249347, 19993051, 18523625, 17147706, 15171655]
19622A5171655k034856j532127j146956p44868o64555o23780o60821n65705n02163
19613F695824m59279m06440m33482k34424k51747l87644k85930l8419M7518R4288
19603D340265k29360j44540p1682k38771J01309J27715K3909k71610j91809n00034
19593B945392k18395J02770L30004O1216l61880p3068J66864J40044M8485J44173
19583C285605j00192j88731j52886k17605k25869j54117j0399J25113K2074l36
19573B382657N2093J62222j17536k36227j53857K7376M7312j9416j59014K1512
19563B007122r5781O0759K64667M8613m6879j96371l08765q1719K77685N2296
19553A981627R0306J99402L2992j8337j61655J19368M35059o6131k48464P6356
$$ y = [15171655, 13136799, 11604672, 10457716, 9712848, 9048293, 8424513, 7763692, 7197987, 6695824, 6236545, 5830105, 5396623, 5162199, 4910452, 4522808, 4236878, 4198459, 4245977, 4340265, 4110905, 3966365, 3894683, 3655912, 3757221, 3884936, 3908845, 3637235, 3445426, 2945392, 2726997, 2829767, 3159771, 3220987, 2859107, 2786039, 2952903, 3092947, 3141432, 3285605, 3185413, 2996682, 2843796, 2626191, 2400322, 2246205, 2235806, 2360919, 2382993, 2382657, 2434750, 2596972, 2479436, 2243209, 2089352, 2116728, 2164040, 2144624, 1985610, 2007122, 1911341, 1972100, 2236767, 2285380, 2238501, 2042130, 1733365, 1651646, 1929331, 1981627, 2071933, 2271335, 2304327, 2285990, 2124335, 2243703, 2678762, 2612631, 2364167, 2440523]
19543B440523n7016k17398j43642k14786K4555J34643J23939J11738R0874p1176
19533B222254j09084R434K2067j02800l4646K9424j45554j02921K47326L08221
19523B343721O8197k41885j93050O1296J06388m9331O3768J44272K10171L7237
19513B550784R1041q1083k60967k2725R2057K6694L25882K35100L95778L00748
19503C653309j11481p3661J99769K28596K81179K61428K99173N14499L91898K36243
19493E880952r0732J80441N70149O16614N89821R73845R85659J368371J698490
19484A2773610K230307L312102N017545P423787J0578345J3258552J1897856O100737
19476G2592841Q87572j698659j477012K487506R868693J8178471K0686872J2074264
$$ y = [2440523, 2383507, 2166109, 2022467, 1807681, 1832236, 1966879, 2090818, 2202556, 2293430, 2222254, 2113170, 2122604, 2144671, 2041871, 2007225, 2036649, 1891095, 1788174, 2035500, 2343721, 2411918, 2170033, 1976983, 2038279, 2144667, 2095336, 2159104, 2303376, 2513547, 2550784, 2641825, 2560742, 2299775, 2277050, 2369107, 2395801, 2721683, 2956783, 3352561, 3653309, 3541828, 3468167, 3667936, 3896532, 4177711, 4439139, 4738312, 5252811, 5644709, 5880952, 5790220, 5970661, 6540810, 7157424, 7747245, 8721090, 9706749, 11075120, 12773610, 15003917, 18316019, 23333564, 30757351, 41335696, 54594248, 66492104, 72592841, 73480413, 71781754, 70304742, 72792248, 82660941, 100839412, 121526284, 133600548]
19468A33600548j123102j0515033j5113362j4980766r941470k654543L165331
19461H2437603L704665j626650p509652j0720170j1837191j0551458q229636n725187
19453B9942324m194098k851233j839938j473368j247556j036123j051087o03442
19445A5645479j83700m8358J22874L61435L06622P45262J289376J838914K669088
19436B2746992L969560O185611R731616J3343274J5136606J1178969L822451q60734
19428H5254345k619288p21575N723559J4903511K2353463K0191479O960264o768419
19420A45277339j4802827j7804402j5434721p969923P4547M287090J555394n067438
19412I0115059r910931j2617650j3316997j1256291q517636n918479m171913l130187
$$ y = [133600548, 132477446, 121962413, 106849051, 91868285, 81926815, 79272272, 82437603, 86142268, 84515618, 77005966, 66285796, 54448605, 43897147, 35667511, 29942324, 25748226, 22896993, 21057055, 19583687, 18336131, 17300008, 16248921, 15645479, 15461779, 15413421, 15536295, 15897730, 16204352, 16949614, 18238990, 20077904, 22746992, 26716552, 32902163, 42633779, 55977053, 71113659, 82292628, 86115079, 85254345, 82635057, 81913482, 87637041, 102540552, 124894015, 145085494, 152045758, 145277339, 130474512, 112670110, 97235389, 89265466, 89340013, 93627103, 95182497, 90115059, 80204128, 67586478, 54269481, 43013190, 34495554, 28577075, 24405162, 21274975]
19404B1274975k305693j983156j531722j462075j258595j005078r38077q32894
19396I957685o36998m98309o03473q03686o70504k81647j59967l72364j25331
19387E805406m17912l98196k40340l95080j78241j9599l58587m68402k322J47813
19377C474540n7150j96099J62344r4257k79402j27372J49548j33635l20173l94397
19367B183947K11332K66898k98027l40466P3037K3155O827j83782k65904q9681
19357A587336j0713K48n3524k908l7219k72495N2404K88852J92166m5275r7324
19346A601548k68633K0623J75474n6153l32618p3714j26457j49660O2459K33139
19336A086008j9162r950P8853K28801j22892k77009m6440K76781K08034j2361
$$ y = [21274975, 18969282, 16986126, 15454404, 13992329, 12733734, 11728656, 10790579, 9957685, 9320687, 8822378, 8218905, 7415219, 6744715, 6463068, 6303101, 5930737, 5805406, 5387494, 4989298, 4748958, 4353878, 4175637, 4156038, 3797451, 3329049, 3326727, 3474540, 3417390, 3221291, 3383635, 3289378, 3009976, 2882604, 3032152, 2898517, 2578344, 2183947, 2395279, 2662177, 2364150, 2023684, 2096721, 2119876, 2126703, 1942921, 1677017, 1587336, 1576623, 1576871, 1523347, 1520439, 1483220, 1210725, 1263129, 1551981, 1744147, 1698872, 1601548, 1332915, 1353538, 1529012, 1472859, 1140241, 1066527, 940070, 790410, 852869, 1086008, 1066846, 1056896, 1135749, 1364550, 1241658, 964649, 918209, 1194990, 1403024, 1390663]
19326A390663r4719R9796o9202M9695J09223L7212k1852r4581j94603j522K68022
19315A478132j48788L075M05585n5215M5239l64759j51202J16030j9597J04977
19305A413477L69380L65269m8226J3068j20875J57400J13026P7523q9410l5783
19295B214849k38258P2754K66261k9654o2954l1400q9980j13984j39821K19032
19285B066845L34611K000l17013o7935j67707k24847N8723k4344K94944K31896
19275B187173j28193j08878J1793K31572J50343R8298P6901L03345K57180O84656
19265C764190L23106L49029M34046O48886R53674P71254J181305J099159J342764
19256A0867413J325061R84623Q95666P40591N46699N49238P54387J209911J445752
$$ y = [1390663, 1295944, 1395740, 1326538, 1376233, 1485456, 1522668, 1500816, 1406235, 1211632, 1210110, 1478132, 1329344, 1332419, 1738004, 1682789, 1728028, 1363269, 1212067, 1328097, 1308500, 1413477, 1782857, 2148126, 2099900, 2112968, 1992093, 2149493, 2262519, 2340042, 2250632, 2214849, 1976591, 2049345, 2315606, 2285952, 2222998, 2191598, 2101618, 1987634, 1847813, 2066845, 2401456, 2403456, 2086443, 2018508, 1850801, 1625954, 1684677, 1660333, 1955277, 2187173, 2058980, 1950102, 1961895, 2193467, 2343810, 2442108, 2519009, 2822354, 3079534, 3764190, 4087296, 4436325, 4870371, 5519257, 6472931, 7244185, 8425490, 9524649, 10867413, 12192474, 13177097, 14072763, 14813354, 15360053, 15909291, 16663678, 17873589, 19319341]
19247A9319341J643946J207563O44645l9911p22483o71671o72061p27522m47363
19238A9534484j68336J10234K30830k02895n36192m69587m56911k61419q2699
19229A7697509K49836J256318K433713L635970N977355J0454642J4024841J2833932
19221F8564116O633171J72232m026030n129490k738225K784917J0508123J6196279
19213I2965093J6412135J2275533O653327j310865q496343j1903533j1930967
19206I4664380r642921m485567J878586P014556O861059J133380n110266q811090
19198H3502117j0075983r451390p810621o070925m777229m175296l246242k344528
19190C5549903j757286j052434o81729n63322q03471j178792j621909j499773
$$ y = [19319341, 20963287, 22170850, 22815495, 22775584, 22053101, 21381430, 20709369, 19981847, 19534484, 19366148, 19476382, 19707212, 19504317, 18968125, 18498538, 18041627, 17780208, 17697509, 17947345, 19203663, 21637376, 25273346, 31250701, 41705343, 55730184, 68564116, 75197287, 75369519, 71343489, 66213999, 63475774, 66260691, 76768814, 92965093, 109377228, 121652761, 128306088, 126995223, 118498880, 106595347, 94664380, 85021459, 80535892, 82414478, 89429034, 96290093, 97423473, 92313207, 83502117, 73426134, 63974744, 56164123, 50093198, 45315969, 41140673, 37894431, 35549903, 33792617, 32740183, 32058454, 31495132, 30691661, 29512869, 27890960, 26391187]
19182B6391187r87263k51527K87098J655988L586536O366961J0350265J5257223
19174F2656468J7441536J1863349K567066m057442p334888o438665j052741O839499
19166H2484182J4163447J7188672J5782011J1767809L538391q326096j5995837
19159A20602579j7642016j5459662r921066k515359M412074P127777K685202m693137
19151H4596392j0144129j2985565j2795303j0556827p896018n383692l760142
19144B1074716k698807k185917j700449j401015j307353q81502o27011o36538
19136I636124q19430o28195m60460n60646l62548m66936l69785j58544L3439k04708
19126E638311k69358k10059j45762M6837l03228n64045j02976k6040l71039j61626
$$ y = [26391187, 25403924, 25152397, 25439495, 27095483, 30682019, 37048980, 47399245, 62656468, 80098004, 91961353, 94528419, 90470977, 83136089, 76697424, 75644683, 82484182, 96647629, 113836301, 129618312, 141386121, 144924512, 136598416, 120602579, 102960563, 87500901, 77579835, 75064476, 79476550, 86604327, 89289529, 84596392, 74452263, 61466698, 48671395, 38114568, 30218550, 24834858, 21074716, 18375909, 16189992, 14489543, 13088528, 11781175, 10899673, 10272662, 9636124, 8816694, 8188499, 7728039, 7167393, 6804845, 6337909, 5968124, 5809580, 5843019, 5638311, 5368953, 5158894, 5013132, 5059969, 4756741, 4192696, 4089720, 4063680, 3692641, 3531015]
19116C531015j7715k23672j59312k70833k20967k11268j8478o9631j23322k28819
19106A986998J13971l0415k67104k65671j70297N8502R4277L1905m5804j65899
19096A340463j3180j03087m2750L5253l9336L7535R361k80346r6893J28599K04561
19085A180180m8839k75675j20006K44174J37620K8180o3004J1423N8974M9612
19075A202639k5151k05452n4095k67198O748J22514Q0928K3466p8256J32269j76819
19064G61593l3819J57077n9067j5639j26807M2338j07217j35391j66469J6331
19054C32930J09064K74708k5506k54414j37199o6107J12956L05878p4498j31666
19044D46146p3219j21M8386j49927J686j55916K06864K76028L7400j50823Q8077
$$ y = [3531015, 3513300, 3289628, 3130316, 2859483, 2638516, 2427248, 2408770, 2339139, 2215817, 1986998, 2100969, 2070554, 1803450, 1537779, 1367482, 1425984, 1520261, 1552166, 1506362, 1340463, 1327283, 1224196, 1181446, 1216699, 1177363, 1214898, 1224259, 943913, 847020, 975619, 1180180, 1131341, 855666, 735660, 979834, 1117454, 1145634, 1082630, 1094053, 1153027, 1202639, 1177488, 972036, 917941, 650743, 657491, 780005, 860933, 884399, 806143, 938412, 761593, 727774, 884851, 825784, 810145, 683338, 725676, 618459, 483068, 316599, 332930, 441994, 716702, 691196, 436782, 299583, 233476, 346432, 652310, 577812, 446146, 372927, 372806, 421192, 271265, 272951, 117035, 323899, 599927, 637327, 486504, 574581]
19033E74581J68413j62132j65669j05047l2421l9310o9586O9136j48193J5928
19023A05700j00679J38829K22123J13409m7104j75123o6377K1011Q7364R1342
19013C90495J30331k46240M6660K09447j07172J64716r6624r6653Q7117K66806
19003G48883K09335N7538j62885j74897j54119k91195r9148m0057J13687N075
18993B12217J53730L12169j44059M1629J71404J23492j71130l4826j37958k90798
18983B35870j17497L37851J31919J8051N0981K1476R779n7613L1108N4643k8394
18972F88174j31204J66120M7295j92748k55857o2703j24292j26268J34898J84262
18962C27677K45219o0023j79301j9650J39601J98401J31552p391l5683j48412
$$ y = [574581, 742994, 580862, 415193, 310146, 277725, 238415, 168829, 237965, 89772, 105700, 5021, 143850, 365973, 479382, 432278, 257155, 190778, 211789, 299153, 390495, 520826, 274586, 321246, 530693, 423521, 588237, 491613, 394960, 482077, 748883, 958218, 1015756, 852871, 677974, 523855, 232660, 133512, 93455, 207142, 212217, 365947, 678116, 534057, 575686, 747090, 870582, 699452, 664626, 526668, 235870, 118373, 456224, 588143, 606194, 657175, 678651, 688430, 630817, 661925, 716568, 688174, 556970, 723090, 770385, 577637, 321780, 259077, 134785, 8517, 143415, 327677, 572896, 512873, 333572, 313922, 453523, 651924, 783476, 776085, 740402, 591990]
18952E91990j20209k2754l539J70892q8140J55943j04755J6325L3938k9888k1055
18941E78748J60011j94208k07217o9800K6526M3391l05530j83103O4313J73412
18931H6543J21294k58855L5878L17853J61473k13173N7167P8849J67129p314L13212
18920H60056k9239j7629L760J35480P7319L1990j05187K36185o9550p4435k6395
18909A022355p0036L6395J5253j01620j72434j1928k05546P6487N5247k25453
18899D18720p5124K7661m894j11501m405p5294L2858q5968K35725J67166k06399
18888C18545o879j69051o6165J16603L40397J53755q4422o5921M3493M3422J56632
18877G80409R0289O8216j38835k67769j28515L33490J25482k01959j27818m5371
$$ y = [591990, 471781, 449027, 445488, 616380, 528240, 684183, 579428, 595753, 629691, 599803, 578748, 738759, 544551, 337334, 267534, 294060, 337451, 31921, -151182, -86869, 86543, 207837, -51018, -15140, 302713, 464186, 251013, 308180, 387029, 554158, 546844, 860056, 830817, 813188, 816948, 952428, 1029747, 1061737, 956550, 1192735, 1123185, 1048750, 1022355, 952319, 988714, 1003967, 902347, 729913, 717985, 512439, 588926, 644173, 418720, 343596, 371257, 366363, 254862, 250457, 175163, 208021, 122053, 357778, 524944, 318545, 311666, 142615, 76450, 193053, 533450, 687205, 602783, 536862, 580355, 623777, 780409, 870698, 938914, 800079, 532310, 403795, 737285, 862767, 660808, 532990, 487619]
18867D87619m16922p6112J60710j8479J61855J95701j1460p135O8168r6983l8621
18856D08341Q7246n8814j78801k2427l6217J71979J7629j01217j1612N09120J79346
18845I64573j62383m6730k8170j7120o4360l94175k6298M619N4252j04088n9928
18834A20192J97177J70204j22642J87058K22059j53864k25284J37880J85077q6728
18824F31129o6757M6526k67767l2004q2126J1656L7346o6797L2846J5694L5245
18813B94991J7306N5956n9262K8251J17800J63906J16330L8631L0945M0323Q7106
18802I32283m511L224l2776k0053J58915K58960r9480N7854L84009J19888j17625
18791A640688O275N1192J11322K10688J12847M24232L30739M53293O10147Q68582
$$ y = [487619, 70697, -5415, 155295, 136816, 298671, 494372, 482912, 475777, 543945, 446962, 408341, 495587, 436773, 257972, 235545, 199328, 371307, 388936, 287719, 276107, 785227, 964573, 802190, 755460, 727290, 710170, 645810, 251635, 225337, 229956, 284208, 180120, 120192, 317369, 487573, 364931, 551989, 774048, 620184, 394900, 532780, 717857, 631129, 564372, 610898, 343131, 311127, 229001, 240657, 278003, 211206, 244052, 259746, 294991, 312297, 368253, 308991, 337242, 455042, 618948, 735278, 773909, 804854, 845177, 932283, 927772, 930996, 898220, 878167, 1037082, 1296042, 1196562, 1254416, 1638425, 1758313, 1640688, 1646963, 1698155, 1809477, 2020165, 2133012, 2557244, 2887983, 3341276, 3951423, 4820005]
18781D820005R77235J108057J517577J925935K064456K395678K127979J689364
18773A8626286J127657O87707J63066p11598j601314j928265k080592j974958
18765A2307989j919069j422050j442522q37347o48453o90112n22457m83459k92309
18756D050211j83590J84973J33871j49354l82587n2267J5888n8015o0087M5187
18746C544230R4656q3621M8158J27330O820L27552O68569M35677M37955P15869
18736F323195O54414J254875J895104J890345K633942L001530L246380L419143
18728B4318928L448669L126658K630916J413057J04006j130148k323969k950072
18720B8638045l458664l750183l065769k574350k109562j749167j308847j182516
$$ y = [4820005, 5797240, 6905297, 8422874, 10348809, 12413265, 14808943, 16936922, 18626286, 19753943, 20441650, 20604716, 19893118, 18291804, 16363539, 14282947, 12307989, 10388920, 8966870, 7524348, 6687001, 6038548, 5348436, 4825979, 4342520, 4050211, 3866621, 4051594, 4185465, 4036111, 3653524, 3601257, 3617145, 3559130, 3499043, 3544230, 3638886, 3555265, 3603423, 3730753, 3737573, 4065125, 4733694, 5169371, 5607326, 6323195, 6977609, 8232484, 10127588, 12017933, 14651875, 17653405, 20899785, 24318928, 27767597, 30894255, 33525171, 34938228, 35042234, 33912086, 31588117, 28638045, 25179381, 21429198, 18363429, 15789079, 13679517, 11930350, 10621503, 9438987]
18712I438987q44942p90419m53233k74578n16921o12590l01931j03106j60010
18703E381257k61729k6964j27566P0787j52556J8417K71849L9057N3786J42223
18693E408561L01254L23141K70089L80560O16974N35394P14391J041924J002122
18684A0594410J464488J904488K103040K823216K775873K877568L361087L741431
18676C1645601M892254P178405J0817615J3968533J4617906J4654117J3851514
18669A11625945R089958J746159l770268q682049j3577010j6335111j5514734
18662F4582890j3263960j0702306q171149n851248l771233k822155k163580j565248
18654A6272011j205253j202793p03330n25139n56601k42660l38859k74094j20301
$$ y = [9438987, 8594045, 7803626, 7350393, 7075815, 6558894, 5946304, 5644373, 5541267, 5381257, 5119528, 5092564, 4964998, 5035785, 4883229, 4901646, 5173495, 5212552, 5266338, 5408561, 5709815, 6032956, 6303045, 6683605, 7300579, 7835973, 8550364, 9592288, 10594410, 12058898, 13963386, 16066426, 18889642, 21665515, 24543083, 27904170, 31645601, 36537855, 43716260, 54533875, 68502408, 83120314, 97774431, 111625945, 120715903, 122462062, 118691794, 110009745, 96432735, 80097624, 64582890, 51318930, 40616624, 32445475, 26594227, 22822994, 20000839, 17837259, 16272011, 15066758, 13863965, 13160635, 12635496, 12078895, 11836235, 11497376, 11223282, 11102981]
18645A1102981n9347k08817k18279q6849J73841J93378J10585j30179L28415K88955
18635A1494684P39970J425720K030502K711723L557239N399259Q279300J2244044
18627D7882441J7711138K2579577K6414076K7896191K5141761J8973042J0348009
18620A96946235j08476j0241343j8557256k3779983k5918952k4228941k0507573
18613G3603711j6104272j1494986q543553o332415m441507l154002k624682k296971
18605A8611323j730009j195897r60283m51423n17096p81104p47600m76716l15738
18596A1435457n59165o41027m95411m60596n51352j36307j88290j56934m6580
18587H199795J3274N16185P74948J041863J841796K756584L923260N943474R212769
$$ y = [11102981, 11043634, 10834817, 10616538, 10529689, 10703530, 10896908, 11007493, 10877314, 11205729, 11494684, 12234654, 13660374, 15690876, 18402599, 21959838, 27359097, 35638397, 47882441, 65593579, 88173156, 114587232, 142483423, 167625184, 186598226, 196946235, 196837759, 186596416, 168039160, 144259177, 118340225, 94111284, 73603711, 57499439, 46004453, 37460900, 31128485, 26686978, 23532976, 20908294, 18611323, 16881314, 15685417, 14725134, 14273711, 13756615, 12975511, 12227911, 11751195, 11435457, 10876292, 10235265, 9739854, 9279258, 8727906, 8591599, 8403309, 8246375, 8199795, 8213069, 8729254, 9504202, 10546065, 12387861, 15144445, 19067705, 25011179, 34223948]
18578C4223948J1876614J2376588J2249393J1367387P507227J657149k971563
18571H8286743o754561j0543445j2405630j2241163j0337301q217843o074537
18564B1712263m040597k986776j936551j733925j446944o56427r67254p05130
18556G238659l83393m17078q36020n44412m5944k34647j36317m50484m37620k62590
18546C490154j59503p0412J2573k89828r6563k86789k27795j81926j8820K5205
18536B196296M3128j68777l43158N3002q2041K29932R009k46230m78207j39650
18526A073304L9764J21018J27188r6676K1423j11187j64374j72686k698k26197
18516F08879J96155M41962j29122l49503P1740J04892P3874K6436j14758j48082
$$ y = [34223948, 46100562, 58477150, 70726543, 82093930, 89601157, 91258306, 88286743, 81532182, 70988737, 58583107, 46341944, 36004643, 27786800, 21712263, 17671666, 14684890, 12748339, 11014414, 9567470, 8911043, 7943789, 7238659, 6855266, 6438188, 5602168, 5057756, 5011812, 4777165, 4640848, 4190364, 3752744, 3490154, 3330651, 3260239, 3272812, 2982984, 2886421, 2599632, 2371837, 2189911, 2171091, 2196296, 2239424, 2070647, 1727489, 1780491, 1698450, 1928382, 1937391, 1691161, 1212954, 1073304, 1113068, 1234086, 1361274, 1264598, 1286021, 1174834, 1010460, 837774, 835076, 608879, 805034, 1246996, 1117874, 768371, 840111, 945003, 1018877, 1045313, 930555, 782473]
18506G82473J65037M8667J94968L14426j278l53575l66331j41014O1201o0024
18496F44550j84997j47574K01088K13505p2118j38158j86742j53540K6206o7789
18486A34431m4170N9083K60371l1825J48792j48941m8111j19862q0065j8448o0177
18475E1078j87943q3035L37477L53548p7216q0222K3496J27358L9835j74058K5023
18464C55341j03943j79022J46791K03169o8395j8377J67580m5983Q549l50700
18454A15010k48208j5755r039J02599k7436R5724R441J08405K32862J47260n3269
18443D57594j98974j4384l0244p6252J53817J47973o2817j21140K1940k72411
18433E102Q2535K792j1300j85784N0809O8550O2361K45198J89401J18605J4180
$$ y = [782473, 947510, 996177, 1191145, 1505571, 1504293, 1150718, 784387, 643373, 704574, 644550, 459553, 311979, 513067, 726572, 654454, 516296, 329554, 176014, 202220, 134431, 90261, 149344, 409715, 377890, 526682, 377741, 329630, 209768, 129703, 111255, 51078, -136865, -219900, 117577, 471125, 393909, 313687, 337183, 464541, 504376, 330318, 355341, 251398, 72376, 219167, 422336, 353941, 335564, 503144, 457161, 465710, 115010, -133198, -148953, -157992, -55393, -82829, 12895, 22336, 130741, 363603, 510863, 457594, 258620, 244236, 213992, 137740, 291557, 439530, 376713, 255573, 277513, 5102, 87637, 90429, 79129, -106655, -55846, 12704, 75065, 320263, 509664, 628269, 642449]
18422F42449J69568j75335l56025O6170k3272Q9324m9659j04482k1866O9903q01
18411C05974k61724j06486K00854k8813O8474N9352j83057k14509l2803J07401
18401h5337K06190J74307J54977k9825J6116j17379j5999j37701k57752k0558
18391a12961j18046m8721O0511L21480m0878J01091K9805j40071J0056K98679
18381C60945o9138j98940o2428R1180j11502R5116J37206j52651J7139L0420k18077
18370h0730P9132J48480j0292q5611M5121L33032J33064o654k7774k36098k0443
18359B71227n1207l61388n352L02414J17639P1546k66902j48963J2043L62744
18349C03801K65644n1057j68880j98493j47727r681J39977J56781L3541k81980
$$ y = [642449, 812017, 636682, 280657, 346827, 323555, 412879, 363220, 258738, 236872, 306775, 305974, 44250, -62236, 138618, 109805, 178279, 237631, 54574, -159935, -192738, -85337, 120853, 295160, 450137, 420312, 436428, 319049, 303050, 165349, -92403, -112961, -231007, -279728, -219217, 102263, 61385, 162476, 192281, 52210, 62266, 360945, 291807, 92867, 30439, 121619, 10117, 105233, 242439, 89788, 106927, 137347, -80730, -1598, 146882, 136590, 50979, 96100, 429132, 562196, 555542, 527768, 291670, 271227, 220020, -141368, -146720, 155694, 273333, 344879, 77977, -70986, -58943, 303801, 569445, 518388, 349508, 151015, 3288, -6393, 133584, 290365, 323906, 41926]
18339D1926m3934J97780L27606J44982m6719j87869l02940O1619j23n2978o4395
18328G4955K8470J7668J19899k56877K1394K11301j71773j77885K06949J40248
18318B14349l06119k20569R1667J47703J91561j6424p4433Q4R916k43698J75440
18307c0523K01535K60468J99274k71425j59682l1996R1032J95675q7813j48177
18297B18368K2777J30292J08626l1298j39788l14799p0523j59246O0502J98995
18287B3906J30590j75380J11181k11167j52414K28327N78443j10780l53962j78590
18277a09846K5647R9926J3758j86661j30709L5457J09307K67292K40150L7530
18267D01851j19069l20171J88464J51373m3329l8915j20022l6995L52117K65024
$$ y = [41926, -2008, 195772, 523378, 668360, 621641, 433772, 130832, 192451, 192328, 139350, 74955, 103425, 121093, 240992, -15885, 5509, 216810, 45037, -132848, 74101, 214349, -91770, -312339, -220672, -72969, 118592, 102168, 27735, 27819, 37735, -205963, -30523, 171012, 431480, 630754, 359329, 199647, 167651, 258683, 454358, 366545, 218368, 241145, 371437, 480063, 448765, 308977, -5822, -76345, -235591, -175089, 23906, 154496, -20884, 90297, -120870, -273284, -44957, 533486, 422706, 68744, -109846, -84199, 15727, 29485, -157176, -287885, -252428, -143121, 124171, 364321, 401851, 282782, -37389, 151075, 302448, 259119, 220204, 100182, 63187, 415304, 680328]
18257F80328j84270j3812n9090K59755j48839j9234j6755J84415j71520j90041
18247C20937j31584R107L8788j46072J4851M5252r6710K21524J72263l05179k42343
18236i9166J69945j17550j59583O8156N5228K4123L6125j81516n9910L1012J79244
18225e3892j35810l7458K3497J28574q0403j12994J5526J34350J58719J74062
18215B14171l618j14184k18563m304J96831J39015m1024j53196j02769J87978
18205A00337N409j55717R5993j36856k50472K69741J59932J7308j47040j89753
18195b31118p2323J64979J0362N9036j0158q6950J54175j67071j96004J03610
18185b71462r7248p1364k1514J63032K77972J12975J49177J32277P6320q2838
$$ y = [680328, 496058, 482246, 423156, 682911, 534072, 514838, 498083, 682498, 510978, 320937, 189353, 198460, 237248, 91176, 106027, 151279, 54569, 276093, 448356, 143177, -99166, 70779, -46771, -206354, -138198, -82970, -58847, -22722, -204238, -264148, -233136, -53892, -189702, -227160, -203663, -75089, -155492, -268486, -252960, -118610, 40109, 214171, 210553, 96369, -122194, -126498, 70333, 209348, 168324, 15128, -87641, 100337, 105746, -49971, 46022, -90834, -341306, -71565, 88367, 105675, -41365, -231118, -303441, -138462, -128100, -69064, -79222, -166172, -11997, -179068, -375072, -271462, -368710, -440074, -461588, -298556, -20584, 92391, 241568, 373845, 450165, 367327]
18175C67327j13507J40046k3079O3578l25773r8312q6565j25167P0390K05013
18165G3951K91952k5358k31662l03662Q2924J70988j01552k1963K35883O8923
18155B40424j03966o9693J98201j01832o043Q7199j79193M7155M0987L3883n4719
18144A32403L97980K0420j62944k27089p3151l4016J37263J7285J44340p4722
18134B77769j63537j31188M8934J80961J23407r4785l9071J0370R6914j03433
18124B06341o7537l4981p935N5858n2451k90163j25821L37111K84907j6522l6636
18113B52171J71032L9008J60272L58696N7378J28517N9620j22751J02295m5312
18103A160926k95696k44698m1166j71181q4159j01525r5783n7676k21840Q7216
$$ y = [367327, 253820, 393866, 370787, 434365, 108592, 10280, -76285, -201452, -131062, 73951, 365903, 340545, 108883, -194779, -111855, 59133, -42419, -64382, 171501, 240424, 136458, 66765, 264966, 163134, 157091, 244290, 65097, 112252, 153239, 187122, 132403, 530383, 550803, 387859, 160770, 87619, 53603, 190866, 208151, 352491, 277769, 114232, -16956, 31978, 212939, 336346, 241561, 202490, 212860, 309774, 206341, 138804, 103823, 95888, 151746, 99295, -190868, -316689, 20422, 305329, 288807, 252171, 423203, 462211, 622483, 981179, 1038557, 1167074, 1226694, 1103943, 1206238, 1160926, 865230, 620532, 579366, 408185, 324026, 222501, 126718, 69042, -152798, -65582]
18093f5582R3693Q7210J75401K35707M0466q5991j3782k09024n5899q6389j52837
18082c7027q5260j23053J99353p7510Q1128Q2320n1534n7543j20760j22029j1958
18071c23873J52279r2258m3430p962n2237o3708L6719K34514K01936J38927O6131
18060B47038K77681P5667O9660k66631k27450J60691j37937k36897N6422K43840
18050B62084J5599J6521L8376O1950J36160l3208j16875J9084J2277j37040N8209
18039C33137P6950k77886P5633J83295p2449l63281k33181M7046O1606j76863
18029c45993j5296M0652Q8781J40269K46245n9954k29640P0951J0092k96715k66772
18018f17380L3645L27310J19960R5773k809m674r6135j08245m686L11239N8499
$$ y = [-65582, 28111, 115321, 290722, 526429, 566895, 480904, 467122, 258098, 202199, 115810, -37027, -122287, -245340, -45987, -123497, -42369, 39951, -11583, -69126, -189886, -311915, -323873, -171594, -263852, -307282, -315244, -367481, -431189, -394470, -159956, 41980, 180907, 247038, 524719, 600386, 670046, 403415, 175965, 336656, 198719, -38178, 18244, 262084, 277683, 294204, 332580, 394530, 530690, 497482, 380607, 399691, 411968, 274928, 333137, 410087, 132201, 207834, 391129, 318680, -44601, -277782, -230736, -169130, -345993, -361289, -320637, -231856, -91587, 154658, 94704, -134936, -63985, -53893, -350608, -617380, -583735, -256425, -136465, -40692, -43501, -48175, -144310, -252555, -257241, 53998, 112497]
18007A12497J58496J22906k1730q6107J47651l84528O2704J1481r4156R5648Q9146
17996B14008k8031J74847k85961K3180O3379J98473Q0655r2620j50614j59347
17986C7969j6098m7277k8776J44606K2305r2208m0093J87275k28717O5314K05806
17975B10106J0458j76269j56784j08415j44470J6795J55741M4564j9107j02035
17965b69416J13616J70734K90135M5243q5098l08753j10381J05274R2501L4038
17955G7893J41084N8302k0782j79050j59172k21360j548O090p4889R3002K9283
17944b51147n0864m3259j54917J3535j08348j67243K32986L11719J6654r5987
17934b96871j68011r8246J09358J76196L52484K37534o6426q2799j23186j53374
$$ y = [112497, 270993, 393899, 372169, 286062, 433713, 49185, 111889, 123370, 29214, 124862, 214008, 185977, 360824, 74863, 98043, 161422, 359895, 440550, 347930, 197316, 37969, 21871, -25406, -54182, 90424, 112729, 20521, -19572, 167703, -61014, 4300, 210106, 220564, 44295, -112489, -220904, -365374, -348579, -192838, -148274, -167381, -269416, -155800, 14934, 305069, 350312, 265214, -43539, -153920, -48646, 43855, 77893, 218977, 277279, 256497, 77447, -81725, -303085, -304633, -298543, -373432, -280430, -251147, -302011, -345270, -500187, -486652, -595000, -762243, -529257, -217538, -200884, -296871, -464882, -563128, -453770, -277574, 74910, 312444, 246018, 163219, 40033, -113341]
17924a13341Q9934N4863j77136j32038k44785J82614K88223j51407j82172R3327
17914b91918L11306J38990J3888K6893r1104m0837k0195k12680Q8452J96245J86998
17903C06038j50101o7835k333r1918M9444K02384r7281l12426k9546K96544M7927
17892A50897l9968L1924N850m8434M8166j9986j09136O4704q0183j2104o7342
17881g5612J0965p0156j07150M4215M9067j0550p5564J51179J43768l5160K32767
17870B57769p1098J45734Q576l5652l61291j89182K0587K06665J06703J8829j80290
17859g2650J01596R5767J11148l2607K7472O6905q1698q7548q0668L0706n6559
17848B1864l23977J3194K66407K3840j69030J10461O8401q7221j60546P4171q700
$$ y = [-113341, -23407, 31456, -145680, -277718, -522503, -339889, -51666, -203073, -385245, -291918, 19388, 158378, 172266, 199159, 108055, 67218, 47023, -165657, -77205, 119040, 306038, 155937, 88102, 85769, -6149, 43295, 245679, 148398, -164028, -193574, 102970, 150897, 110929, 142853, 148703, 100269, 148435, 128449, 19313, 84017, 3834, -8270, -75612, -64647, -134803, -241953, -197738, -148671, -159221, -234785, -83606, 60162, 25002, 257769, 186671, 332405, 340981, 305329, -55962, -245144, -224557, -17892, 88811, 107640, -72650, 28946, 124713, 235861, 203254, 230726, 297631, 215933, 128385, 47717, 78423, 21864, -302113, -288919, -22512, 1328, -167702, -57241, 11160, -76061, -236607, -162436, -171136]
17837a71136Q3920K30059L0850j86830l7747p8565n7178K29777j49395k31296
17827c37541P8394J31057K50380R0814l47562m6722J18349j5850j0048J51158
17817F2429J17336l68957L076K17832K54731j0041o9311O6324k27384Q751Q3413
17806A38199l9525l11338j64505o8591j9511J33168J57401J15747M5506j06754
17796a20203j26850J26L1496q2994K78979K02258m1509K29275J25832k15132k21922
17785E9356j2559Q6610k7189l3353J1797m7586j0798L5053l8544R3341O9328M3272
17773B28728K43973L2523j24385p3908L39886j39522k74834k99503j00112L4492
17763a32662J01116K5250K8729p2543K3996j791L8692Q7181O1687n2735J524J9463
$$ y = [-171136, -87216, 142843, 173693, -13137, -50884, -129449, -186627, 43150, -106245, -337541, -259147, -128090, 122290, 213104, -134458, -181180, -62831, -78681, -88729, 62429, 179765, -189192, -186116, 31716, 286447, 276406, 207095, 273419, 46035, 54786, 138199, 98674, -212664, -377169, -445760, -465271, -332103, -174702, -58955, -13449, -120203, -247053, -246927, -215431, -298425, -19446, 182812, 141303, 370578, 496410, 281278, 59356, 46797, 133407, 106218, 72865, 84662, 37076, 26278, 61331, 22787, 116128, 185456, 228728, 472701, 505224, 380839, 306931, 646817, 507295, 232461, -67042, -167154, -132662, -31546, -6296, 22433, -50110, -26114, -27905, 10787, 97968, 159655, 106920, 108444, 127907]
17751A27907K36345N2421l43239k39398o7674R282O1262K17702K21869m5289J0838
17740B42026j6104k45383O0415m4640l6058L0731J74892j22912r7328j1841J40567
17729G4365n8668L3251r8647J24748q3642J99342J98648N6081p0720m35514q7961
17718a48717J18459j20625M366j21744p1948j37940O7732K7075M6855K53511J96833
17707A13857p7680Q1336l9826k29461m7415P6643J78396J14092P3083k32655j81048
17696a70678L1175K25391N9443m1027m2279K3185j27042K23429N5274j07997n9679
17685F9195k7854k07511k5563M5122l5959j1119j32799o393J74482o5384J11857
17674a11926Q3433J41640n0170j34424j89524j39418M0948J8693J86216K30727
$$ y = [127907, 364252, 416673, 73434, -165964, -233638, -224356, -163094, 54608, 276477, 231188, 242026, 225922, -19461, 40954, -3686, -39744, -9013, 165879, 42967, -54361, -66202, 74365, 15697, 48948, -49699, 75049, -8593, 190749, 389397, 445478, 374758, -60756, -148717, -30258, -150883, -146517, -268261, -340209, -478149, -410417, -383342, -336487, -82976, 113857, 36177, 117513, 77687, -151774, -199189, -122546, 55850, 169942, 243025, 10370, -170678, -139503, 85888, 145331, 104304, 62025, 85210, -41832, 181597, 236871, 128874, 69195, 41341, -166170, -191733, -146611, -182570, -193689, -326488, -332881, -158399, -223783, -111926, -28493, 113147, 62977, -71447, -260971, -400389, -359441, -340748, -154532, 76195]
17664G6195L3624l27628p134J39098j10328m1781l8782k00379L0413J176k085
17653d47611J66099J35768m1019J11013J83716J85645r2581k71088k41781J32181
17643a79658J06020K03378K3451P8292k1619M0233j45071j95813j20266l7863
17633b48916N129J31820J94146R8484j02491p4705k48337r9811J62671J91763
17623I753j88173O8449l8705k0191j00048m3060l1442j70870j18561K41557J26679
17612b64612l6270j83272M622L0322J07809P9850p186J10489J73659l6529J33594
$$ y = [76195, 109819, -217809, -224943, -85845, -196173, -237954, -276736, -477115, -446702, -445526, -447611, -281512, -145744, -186763, -75750, 107966, 293611, 201030, -70058, -311839, -179658, -73638, 129740, 153191, 231483, 209864, 250097, 105026, -90787, -211053, -248916, -243787, -111967, 82179, 180663, 78172, 3467, -244870, -344681, -182010, 9753, -178420, -109971, -148676, -168867, -268915, -311975, -343417, -514287, -632848, -391291, -264612, -300882, -484154, -479532, -449210, -341401, -261551, -268737, -158248, 15411, -21118, 112476]
$$ [...]
##END NTUPLES=NMR SPECTRUM
##END=
