##TITLE=Analysis number 319056
Compound Code ac 35953
Project Code adrs
Chemist Name frontier sci
##JCAMPDX= 6.0         $$ Bruker NMR JCAMP-DX V2.0
##DATA TYPE= NMR SPECTRUM
##DATA CLASS= NTUPLES
##ORIGIN= Bruker BioSpin GmbH
##OWNER= nmr
$$ XWIN-NMR		Version 3.5
$$ Fri Apr 28 11:10:04 2006 GMT Daylight Time (UT+1h)  MAYBRIDGE\nmr@NMR_250MHZ
##.OBSERVE FREQUENCY= 250.131544655141
##.OBSERVE NUCLEUS= ^1H
##.ACQUISITION MODE= SIMULTANEOUS (DQD)
##.ACQUISITION SCHEME= undefined
##.AVERAGES= 16
##.DIGITISER RES= 18
##SPECTROMETER/DATA SYSTEM= dpx250
##.PULSE SEQUENCE= zg30
##.SOLVENT NAME= DMSO
##.SHIFT REFERENCE= (INTERNAL, DMSO, 0, 16.522)
##AUDIT TRAIL= $$ (NUMBER, WHEN, WHO, WHERE, WHAT)
$$ ##TITLE= Audit trail, XWIN-NMR		Version 3.5
$$ ##JCAMPDX= 5.01
$$ ##ORIGIN= Bruker BioSpin GmbH
$$ ##OWNER= nmr
$$ C:\u/data/dgb/nmr/ADRS/3380/pdata/1/auditp.txt
$$ ##AUDIT TRAIL=  $$ (NUMBER, WHEN, WHO, WHERE, WHAT)
(   1,<2006-04-28 11:09:38.22 +100>,<MAYBRIDGE\nmr>,<NMR_250MHZ>,
      <created by zg, POWCHK disabled, PULCHK disabled
       configuration hash MD5:
       84 BC 41 DB A1 6E 1D 46 DA 25 12 A5 C1 ED C5 3A
       data hash MD5: 64K
       F1 5D C9 3F E0 93 30 44 B1 FF 68 2D 38 DC 69 E0>)
(   2,<2006-04-28 11:09:53.42 +100>,<MAYBRIDGE\nmr>,<NMR_250MHZ>,
      <Start of raw data processing
       ef LB = 0.3 FT_mod = 6 PKNL = 1 SI = 32K 
       data hash MD5: 32K
       2D 3A 14 B9 5F E6 B1 FA 98 39 70 97 91 CE 1F A1>)
(   3,<2006-04-28 11:09:54.95 +100>,<MAYBRIDGE\nmr>,<NMR_250MHZ>,
      <apk 
       data hash MD5: 32K
       2A 8B 71 3B 3F 25 7F 50 D8 55 A3 67 EA FD AF 76>)
(   4,<2006-04-28 11:09:55.75 +100>,<MAYBRIDGE\nmr>,<NMR_250MHZ>,
      <abs ABSG = 5 
       data hash MD5: 32K
       54 28 D1 4C F8 D1 E6 CF 3F E8 1D 9F 86 02 71 7A>)
$$ ##END=
$$ 
$$ hash MD5
$$ 3C C5 99 53 A6 A4 CD E9 F2 B1 1A CB 6E B5 FA C6
##$RELAX= 
##$RELAX= 
##$RELAX= 
##$RELAX= 
##$RELAX= 
##$RELAX= 
##$RELAX= 
$$ Bruker specific parameters
$$ --------------------------
##$DU= <C:\u>
##$EXPNO= 3380
##$NAME= <ADRS>
##$PROCNO= 1
##$TYPE= <nmr>
##$USER= <dgb>
##$AMP= (0..31)
100 100 100 100 100 100 100 100 100 100 100 100 100 100 100 100 100 100 
100 100 100 100 100 100 100 100 100 100 100 100 100 100 
##$AQSEQ= 0
##$AQ_mod= 3
##$AUNM= <au_zg>
##$AUTOPOS= <19 >
##$BF1= 250.13
##$BF2= 250.13
##$BF3= 250.13
##$BF4= 250.13
##$BF5= 500.13
##$BF6= 500.13
##$BF7= 500.13
##$BF8= 500.13
##$BYTORDA= 1
##$CFDGTYP= 0
##$CFRGTYP= 5
##$CHEMSTR= <none>
##$CNST= (0..31)
1 1 145 1 1 1 1 1 1 1 1 1 1 1 1 1 1 1 1 1 1 1 1 1 1 1 1 1 1 1 1 1 
##$CPDPRG= <>
##$CPDPRG1= <>
##$CPDPRG2= <>
##$CPDPRG3= <>
##$CPDPRG4= <mlev>
##$CPDPRG5= <mlev>
##$CPDPRG6= <mlev>
##$CPDPRG7= <mlev>
##$CPDPRG8= <mlev>
##$CPDPRGB= <>
##$CPDPRGT= <>
##$D= (0..31)
0 1 0 0 0 0 0 0 0 0.06 0 0 0 0 0 0 0.0002 0 0 0 0 0 0 0 0 0 0 0 0 0 0 
0 
##$DATE= 1146218976
##$DBL= (0..7)
120 120 120 120 120 120 120 120 
##$DBP= (0..7)
150 150 150 150 150 150 150 150 
##$DBP07= 0
##$DBPNAM0= <>
##$DBPNAM1= <>
##$DBPNAM2= <>
$$ [...]
##$SUBNAM7= <"">
##$SUBNAM8= <"">
##$SUBNAM9= <"">
##$SW= 20.6930455092707
##$SWIBOX= (0..15)
0 0 3 0 0 0 0 0 0 0 0 0 0 0 0 0 
##$SW_h= 5175.983436853
##$TD= 65536
##$TD0= 1
##$TE= 295.16
##$TE2= 300
##$TE3= 300
##$TEG= 300
##$TL= (0..7)
0 120 120 120 120 120 120 120 
##$TP= (0..7)
150 150 150 150 150 150 150 150 
##$TP07= 0
##$TPNAME0= <>
##$TPNAME1= <>
##$TPNAME2= <>
##$TPNAME3= <>
##$TPNAME4= <>
##$TPNAME5= <>
##$TPNAME6= <>
##$TPNAME7= <>
##$TPOAL= (0..7)
0.5 0.5 0.5 0.5 0.5 0.5 0.5 0.5 
##$TPOFFS= (0..7)
0 0 0 0 0 0 0 0 
##$TUNHIN= 0
##$TUNHOUT= 0
##$TUNXOUT= 0
##$USERA1= <user>
##$USERA2= <user>
##$USERA3= <user>
##$USERA4= <user>
##$USERA5= <user>
##$V9= 5
##$VALIST= <valist>
##$VCLIST= <CCCCCCCCCCCCCCC>
##$VD= 0
##$VDLIST= <DDDDDDDDDDDDDDD>
##$VPLIST= <PPPPPPPPPPPPPPP>
##$VTLIST= <TTTTTTTTTTTTTTT>
##$WBST= 1024
##$WBSW= 4
##$XGAIN= (0..3)
0 0 0 0 
##$XL= 0
##$YL= 0
##$YMAX_a= 305533
##$YMIN_a= -482604
##$ZGOPTNS= <>
##$ZL1= 120
##$ZL2= 120
##$ZL3= 120
##$ZL4= 120
##$ABSF1= 16.522
##$ABSF2= -4.171173
##$ABSG= 5
##$ABSL= 3
##$ALPHA= 0
##$AQORDER= 0
##$ASSFAC= 0
##$ASSFACI= 0
##$ASSFACX= 0
##$ASSWID= 0
##$AUNMP= <proc_1d>
##$AZFE= 0.1
##$AZFW= 0.1
##$BCFW= 0
##$BC_mod= 0
##$BYTORDP= 0
##$COROFFS= 0
##$CY= 12.5
##$DATMOD= 1
##$DC= 0
##$DFILT= <>
##$DTYPP= 0
##$F1P= 14.0000005364418
##$F2P= -0.99999901652339
##$FCOR= 0.5
##$FTSIZE= 32768
##$FT_mod= 6
##$GAMMA= 0
##$GB= 0
##$INTBC= 1
##$INTSCL= 1
##$ISEN= 128
##$LB= 0.3
##$LEV0= 0
##$LPBIN= 0
##$MAXI= 10000
##$MC2= 0
##$MEAN= 0
##$ME_mod= 0
##$MI= 0
##$NCOEF= 0
##$NC_proc= -4
##$NLEV= 6
##$NOISF1= 0
##$NOISF2= 0
##$NSP= 0
##$NTH_PI= 0
##$NZP= 0
##$OFFSET= 16.522
##$PC= 1
##$PHC0= 160.7201
##$PHC1= 8.893092
##$PH_mod= 1
##$PKNL= yes
##$PPARMOD= 0
##$PSCAL= 4
##$PSIGN= 0
##$REVERSE= no
##$SF= 250.13
##$SI= 32768
##$SIGF1= 0
##$SIGF2= 0
##$SINO= 400
##$SIOLD= 32768
##$SREGLST= <1H.DMSO>
##$SSB= 0
##$STSI= 32768
##$STSR= 0
##$SW_p= 5175.98343685301
##$SYMM= 0
##$S_DEV= 0
##$TDeff= 65536
##$TDoff= 0
##$TI= <Analysis number 999999
Compound Code 99
Book Reference 9
Project Code 9>
##$TILT= no
##$TM1= 0
##$TM2= 0
##$TOPLEV= 0
##$USERP1= <user>
##$USERP2= <user>
##$USERP3= <user>
##$USERP4= <user>
##$USERP5= <user>
##$WDW= 1
##$XDIM= 32768
##$YMAX_p= 387135418
##$YMIN_p= -371462
$$ End of Bruker specific parameters
$$ ---------------------------------
##NTUPLES= NMR SPECTRUM
##VAR_NAME=  FREQUENCY,     SPECTRUM/REAL,   SPECTRUM/IMAG
##SYMBOL=    X,             R,               I
##VAR_TYPE=  INDEPENDENT,   DEPENDENT,       DEPENDENT
##VAR_FORM=  AFFN,          ASDF,            ASDF
##VAR_DIM=   32768,         32768,           32768
##UNITS=     HZ,            ARBITRARY UNITS, ARBITRARY UNITS
##FACTOR=    0.157963299565203, 1,           1
##FIRST=     4132.6476996994, 0,             0
##LAST=      -1043.33573715361, 0,           0
##MIN=       -1043.33573715361, -371462,     0
##MAX=       4132.6476996994, 387135418,     0
$$ Real data points
##PAGE= N=1
##DATA TABLE= (X++(R..R)), XYDATA
$$ [...]
18187D83047K13R7325M8097L2371k3518K538J0545J4009J7416K2252M839Q0913
18175G90047P5134Q9903J32617J00833L9143m3173j22360j49047j31872l1791
18165G49434p245o7812n4260l0315J0048r9690O342L5078l6386m0724L5562J20839
18153F20871l6996n5420J6167P4802L3905K1299J05143N0015M6996J12844J89833
18142A179459J21064N7917J73570O7853J9992l9089k4127r0291j89170j06934
18132A170244Q2015j6730Q8838O486K2715N2705O1253O0717N2827J07779O8835
18121A757684k2433o0298l4118m2219j59695j98676k01868j27451K6712q783j8374
18110I10481K8119j11524j05241p2374L6426K8346k9594M7640m1189r8036M3100
$$ plain form
18187 483047 483260 580585 628682 661053 637535 640073 650618 664627 682043 704295 709134 790047
18175 790047 865181 955084 1087701 1188534 1227677 1184504 1062144 913097 781225 749434
18165 749434 742189 674377 620117 589802 599850 500160 506502 541580 505194 464470 500032 620871
18153 620871 583875 528455 544622 619424 653329 674628 779771 829786 876782 989626 1179459
18142 1179459 1300523 1358440 1532010 1599863 1619855 1580766 1556639 1466348 1277178 1170244
18132 1170244 1252259 1235529 1324367 1330853 1353568 1406273 1467526 1528243 1581070 1688849 1757684
18121 1757684 1735251 1674953 1640835 1598616 1438921 1240245 1038377 910926 937638 928855 910481
18110 910481 938600 827076 721835 649461 685887 714233 684639 732279 691090 593054 636154
18099F36154J40587k7559p9032r3460L6384J1194Q9757k8464p9214n5429K1356
18088E72274n7336q2358l9674J5234O2679P6097k5550N1671J7232p401q1593j42682
18076C58593q8271N116R6373Q7146o7548k3569j3291M4024J1747J5336J1487L442
18064D40585k0958J4649q062M9900M9282P492l5750Q213J8976o8360o8184K0263
18052D08046J2156N0309n7047l935o7709k5984J06965k1291J0080P9892O448K7753
18040E25683p3125P765L2142m5355M2012J0207j4655K691K4117r0757j3719r15
18028D06091n31m5740J431J6774M8074Q130J12335Q0447l7030n786j39748q9133
18016C55314J3610N6793P3205n8773N7730J17951R6504j9881N822O9541P6521
$$ plain form
18099 636154 776741 749182 670150 576690 613074 624268 714025 685561 606347 550918 572274
18088 572274 514938 432580 392906 408140 470819 546916 521366 573037 590269 582868 501275 358593
18076 358593 270322 275438 371811 458957 391409 367840 354549 398573 410320 425656 437143 440585
18064 440585 419627 434276 426214 476114 525396 532888 497138 505351 524327 455967 387783 408046
18052 408046 420202 470511 413464 409529 341820 315836 422801 401510 411590 491482 497930 525683
18040 525683 452558 460323 492465 447110 489122 499329 484674 487365 511482 420725 407006 406091
18028 406091 405560 359820 361251 378025 426099 434229 546564 627011 589981 584195 444447 355314
18016 355314 368924 425717 498922 440149 497879 615830 712334 692453 698275 767816 844337
18005H44337J11049J41576Q9087J25414l169q9438j81591j70478M020J1295J3502
17994H95604K1641K7755J33691J29320K9885J8405P2808l0684q4012O7579r7872
17983A184120j46534j29411o3919m7298j720j22929j83725L7041J60063O8334
17973G54022N9964J02705J36769M7319Q6351l3167M5115J1764o9194N0446J89828
17962A381922Q8678J607J766L7551m8693j13470j64168j39774q11O4312M1422
17951A150342L9188J0859O1156Q7707J43733Q5483L7245P2943K2376J0090q3003
17940A638119j92420j36141p7298l0805L2681o2673O8112K5908l6027L4155L9674
17929A303285O4274M2605M6752N7603P6830j436l2204j37845p7225K354m4492
$$ plain form
18005 844337 955386 1096962 1186049 1311463 1308294 1218856 1037265 866787 870807 882102 895604
17994 895604 917245 945000 1078691 1208011 1237896 1256301 1329109 1298425 1214413 1281992 1184120
17983 1184120 1037586 908175 844256 796958 795238 672309 488584 525625 685688 754022
17973 754022 813986 916691 1053460 1100779 1187130 1153963 1199078 1210842 1141648 1192094 1381922
17962 1381922 1470600 1472207 1473973 1511524 1462831 1349361 1185193 1045419 1044608 1108920 1150342
17951 1150342 1189530 1200389 1261545 1349252 1492985 1578468 1615713 1688656 1711032 1721122 1638119
17940 1638119 1445699 1309558 1232260 1201455 1234136 1171463 1239575 1265483 1229456 1263611 1303285
17929 1303285 1367559 1410164 1456916 1514519 1591349 1589913 1557709 1419864 1342639 1344993 1300501
17918A300501k7749N5032j5585p17q5396k8279N7566K7403R870Q7883J21659R9030
17906A601218l5321Q673Qj01029j09938K548L0599O9247R5780M4018n4321j08961
17894A442521M5223J21288J15111J38821P0597k6232R8007O0219O5233P6706M3803
17883B251297J3078R8319J38423J53342Q8923P1700J84771J91960K58148K84119
17873C734080K86315K68479K73308M08523N03662O76820Q90242J219552J604851
17864I865832J767763J845287J769053J459731J051104P45694L68463j31720n00325
17855A8240882q24466n08047K47529J240970K270212L632401N300416P025885
17847C6625782Q029039Q372243Q288320P716584O796893N782459M619138L471353
$$ plain form
17918 1300501 1272752 1327784 1312199 1311482 1226086 1197807 1255373 1282776 1292646 1380529 1502188 1601218
17906 1601218 1565897 1574570 1574578 1473549 1363611 1366159 1396758 1466005 1561785 1605803 1551482 1442521
17894 1442521 1487744 1609032 1724143 1862964 1933561 1907329 2005336 2065555 2130788 2207494 2251297
17883 2251297 2264375 2362694 2501117 2654459 2743382 2815082 2999853 3191813 3449961 3734080
17873 3734080 4020395 4288874 4562182 4970705 5474367 6151187 7041429 8260981 9865832
17864 9865832 11633595 13478882 15247935 16707666 17758770 18504464 18872927 18741207 18240882
17855 18240882 17416416 16908369 17155898 18396868 20667080 24299481 29599897 36625782
17847 36625782 44654821 53027064 61315384 69031968 75828861 81611320 86230458 89701811
17839H9701811K095487N11328j13744l4855n72168k015905m044884o133110p420764
17830G1973196p860915p195062n098989k285922N04847K833175M259189M626488
17822F1756007M352078L479668K008976K2877k541116m536387o136805o998600
17814E1406698o658806n619734m187198k736251j547909m67199O87229J990583
17806C2867413L441540M718128N028453M729870M065193L036181J499820m91348
17798E8895250k883204m846746o110529o632194n756390m090254k697307j386764
17790B4491862m03457M14336J009041J168860J187978Q35896N49361l841q48214
17781B8401822j660392k309979k637895k668236k253863j628252j146128r25234
$$ plain form
17839 89701811 91797298 92308626 92194882 92160027 91587859 89571954 85527070 79393960 71973196
17830 71973196 64112281 56917219 51818230 49532308 50037155 52870330 57129519 61756007
17822 61756007 66108085 69587753 71596729 71619606 69078490 64542103 58405298 51406698
17814 51406698 44747892 39128158 34940960 32204709 30656800 30189601 30876830 32867413
17806 32867413 36308953 41027081 46055534 50785404 54850597 57886778 59386598 58895250
17798 58895250 56012046 51165300 45054771 38422577 32666187 28575933 25878626 24491862
17790 24491862 24088405 24502741 25511782 26680642 27868620 28704516 29253877 29250036 28401822
17781 28401822 26741430 24431451 21793556 19125320 16871457 15243205 14097077 13171843
17773A3171843p37498o63259o14285m78625m65555m46391l32516j77830j77415
17764I078469k73710j83343j71272j28160j20167j17755p7455j49421k26304j79126
17754G451756j80887j97080j41667k04765k03422k45202j87552k13193j85284
17745E692704o2018j09079j87984n7265j70317j96684l676j5130j65654k3825
17735D701072n6533j87409j60004m9927q8918j37307j12003m8075j65979k07011
17725C487906K157n9786p2885n9971k1510J05562o2039m5726M3236L2171L4667
17714C383782M315p1987j00600M8481M9216L1489L2720m5114k5689n9332r5296
17703C151985J5034n8206j18309j36347n3786m9238l0806q718k4909K6924j8399
$$ plain form
17773 13171843 12434345 11771086 11156801 10678176 10212621 9766230 9433714 9255884 9078469
17764 9078469 8804759 8621416 8450144 8321984 8201817 8084062 8006607 7857186 7630882 7451756
17754 7451756 7270869 7073789 6932122 6727357 6523935 6278733 6091181 5877988 5692704
17745 5692704 5630686 5521607 5333623 5276358 5106041 4909357 4905681 4890551 4724897 4701072
17735 4701072 4644539 4457130 4297126 4247199 4158281 4020974 3908971 3860896 3694917 3487906
17725 3487906 3490063 3430277 3357392 3297421 3275911 3381473 3319434 3273708 3316944 3349115 3383782
17714 3383782 3388097 3316110 3215510 3263991 3313207 3344696 3377416 3332302 3306613 3247281 3151985
17703 3151985 3167019 3108813 2990504 2854157 2800371 2751133 2720327 2711609 2686700 2713624 2695225
17692B695225q389m0124l1296q8596j22364p6326k5719n1607q0801j08326p5004
17681A986673O682j5095n0499l5654p1978n93J0701R0306L2320j12704p5532J2562
17669A777189m7621j05634n3171j00091j03305m6391N000o4561r1820j380M4787
17658A213002j7012l8485j2309L9596q0160q8135R091M4585p494p838K560o6693
17646I90708n0249j1524o8585l2187o923N126M8496J9624n4515j0023k1516l4079
17634G74353j2417n1494K517p595Q2855L3196k0245p3184o5648K5255J0428k975
17622F95046k5760k8612j9197n6347J422M3838M5931O0720j00588K0349N4152
17611F90954L2183O8647J28162j1397j0337J0427l8792P8986j2184q7884R98J9198
$$ plain form
17692 2695225 2686836 2646712 2615416 2526820 2404456 2328130 2302411 2250804 2170003 2061677 1986673
17681 1986673 1993355 1978260 1927761 1892107 1820129 1819536 1830237 1920543 1952863 1840159 1764627 1777189
17669 1777189 1729568 1623934 1570763 1470672 1367367 1320976 1325976 1261415 1169595 1168215 1213002
17658 1213002 1195990 1157505 1145196 1184792 1104632 1016497 1025588 1070173 1062679 1054841 1057401 990708
17646 990708 940459 928935 860350 828163 821240 826366 874862 894486 839971 829948 808432 774353
17634 774353 761936 710442 712959 705364 788219 821415 801170 727986 662338 687593 698021 695046
17622 695046 669286 640674 621477 565130 566552 610390 656321 717041 616453 636802 690954
17611 690954 723137 791784 919946 908549 898212 908639 869847 948833 936649 848765 849763 868961
17599H68961j14583l2207k4994N3166m1595k4571M5369N6295J02923J51273J34867
17588A174904N5685n1386n6375O8084J02593N3302N6518N9541M4812J1546L5863
17577A555087q6339m2112n964k15066r4190L9834J8104k8592J2047L6307J5138
17566A204254k3101m668O8455P3969K9095l6297q5838r7656m2725n9641m6998
17555I78849O364j09751j13544p6342J1972N3209r5954q9384l3200M4464J29728
17544G06411q7365j9889P9126R6012K8859O261k8335J2397P8510K7887O6629J9584
17532I86087O4266N1743J52654Q7473P5489L8014k477r3525j32616M993M6307
17521A278408o9923p0597n5490j41414J5937R416P6929Q8772P645l8087P7682
$$ plain form
17599 868961 754378 722171 697177 750343 708748 684177 729546 785841 888764 1040037 1174904
17588 1174904 1230589 1179203 1122828 1190912 1293505 1346807 1403325 1462866 1507678 1519224 1555087
17577 1555087 1468748 1426636 1420672 1205606 1111416 1151250 1169354 1140762 1152809 1189116 1204254
17566 1204254 1181153 1176485 1244940 1318909 1348004 1311707 1225869 1128213 1085488 1025847 978849
17555 978849 985213 875462 761918 685576 697548 750757 654803 565419 532219 576683 706411
17544 706411 619046 599157 678283 774295 803154 809415 781080 793477 871987 899874 966503 986087
17532 986087 1050353 1102096 1254750 1342223 1417712 1455726 1453249 1359724 1227108 1232101 1278408
17521 1278408 1208485 1137888 1082398 940984 956921 966337 1043266 1132038 1139683 1101596 1179278
17510A179278J01789M6932m1418q8173l0296m2409p8923j11726m2411m3344o9219
17499G80080j2599q9863j16596j3029N106l9417j49130J8089L7869l5365L294
17488C88439j9180p5146j6935P5404O7902R035j5943O2726J3117N7322K6786m5466
17476E28061J1687p8232j66005o0326P1428L7516M7984M0155M115J7489n6322
17465C97550p5615j03311L9372Q530q7168o8507k6425N7950P8981J12768o7807
17454B66318m9759J064j767J5774l3190l174L9738M7597K7854j09230q2357M3555
17442A62423P2744p1773n2025q616J04714L5285m306j43814r0321K0507k965K5557
17430D7410K5836O7511o6065n6579K9978K2814j1759K6589N9995N0669j5563K8577
$$ plain form
17510 1179278 1281067 1327999 1286581 1198408 1168112 1125703 1046780 935054 892643 849299 780080
17499 780080 767481 677618 561022 547993 553099 513682 364552 382641 420510 385145 388439
17488 388439 369259 294113 277178 352582 420484 429519 413576 476302 489419 546741 573527 528061
17476 528061 539748 461516 295511 235185 306613 344129 392113 432268 436383 453872 397550
17465 397550 321935 218624 257996 266526 179358 110851 84426 142376 221357 334125 266318
17454 266318 216559 217623 215856 231630 198440 195266 235004 282601 310455 201225 118868 162423
17442 162423 235167 163394 111369 102753 207467 242752 238446 94632 4311 24818 21853 47410
17430 47410 73246 140757 74692 18113 48091 70905 59146 85735 145730 196399 180836 209413
17418B09413J4840O6j489K3020p3976n761L1631k7819o8731K6189R5903O0381
17406B83667q2787j52714n2835M8291r2781k3967J15600J9024m350J0963l6048
17395C2063p3233K6573K3944Q5844m7415p1395K9402N7728k5703K7567l7579J4835
17383D2631J3876l4871k6815L1331O155k4690K243L3217L4206K94l4883N5681
17371I8375K1024k2847M666K472m1495O0914J7978k8593L5774K4764M4589o360
17359B11261K7105J8853k924n3486l30L105k5468j8233J10443K3610J4999l9860
17347B69075j5392j1117n6210M969M7836M7496j1101K9735l0698n8788p749k0903
17335A87153J7866R3512K1931K1250J28982R0549J11519k8271j222J1024p0859
$$ plain form
17418 209413 224253 224319 222830 245850 171874 166113 197744 169925 101194 127383 223286 283667
17406 283667 200880 48166 -4669 43622 -49159 -73126 42474 61498 57148 68111 32063
17395 32063 -41170 -14597 9347 95191 47776 -23619 5783 63511 37808 65375 27796 42631
17383 42631 56507 21636 -5179 26152 32307 7617 9860 43077 77283 77577 42694 98375
17371 98375 119399 96552 101218 103690 62195 123109 141087 112494 148268 173032 217621 211261
17359 211261 238366 257219 254295 200809 200479 203584 178116 159883 270326 293936 308935 269075
17347 269075 253683 242566 186356 191325 239161 286657 275556 305291 274593 215805 208056 187153
17335 187153 205019 298531 320462 341712 470694 561243 672762 644491 643269 654293 583434
17324E83434n6313L898O6540j1077j02295l7323q3709l8858l4709J12247M7889
17313D49724L3907l6818j2679l0482q7660L2942M3033j1975k4653o1284j15360
17302A78695P931P2064n7433n8402j9827O7378K10o4611q2811o300O0891K812
17290A00597M798O2389L8797L8948o5012q383P0769n2649j096k971N5456l4153
17278B07490o7932m7205j0667j5893K994J32526J37332j7464o747N0115j6208
17267C48341j27522o0723m250l9192O0786m275m2579l9311m6968r4942K5846M3464
17255A8675j0254L1038K8849l0909L7232q13P330j221M418j8057o454N4183N3808
17242A67825M0282l2994J3762K2530P1519j00561j42421l6857N2295O8314l3921
$$ plain form
17324 583434 527121 531019 597559 586482 484187 446864 363155 324297 289588 401835 449724
17313 449724 483631 446813 434134 403652 315992 348934 391967 379992 355339 294055 178695
17302 178695 186626 258690 201257 142855 123028 190406 190616 126005 43194 36894 97785 100597
17290 100597 105395 167784 206581 245529 180517 172134 242903 190254 189158 186187 241643 207490
17278 207490 139558 92353 81686 65793 68787 201313 338645 321181 314434 364549 348341
17267 348341 220819 160096 155846 116654 177440 173165 130586 91275 44307 -50635 -24789 18675
17255 18675 8421 39459 68308 37399 74631 73818 81148 79927 84345 66288 59834 114017 167825
17242 167825 208107 175113 188875 211405 282924 182363 39942 3085 55380 123694 89773
17231H9773K8330L5135J3777n134q9226p4423P405n547j16959n5151L1044P6913
17219f4063P558M5527J04123J3074m7118k1842M1253q1535m6543l7867m9092j8913
17207a55438R3721M0736J0486j6188N3487j5785J2425m9399O4899L9147p4021
17196D070n8349N730Q3087l8013p6332O513K1619N6177k5199M268j172P528n3094
17183f3167O5269N7774N0111j9496o6756n3015m6332N7633K7325L8753Q4343L8736
17171A71178l0463l4549l717Q601m0390k093k0484k1447p031K2527M3699N0183
17159A36014j5606n1681J196j1295l0787k8668j8327L5351j7573M6028q536K6789
17147F2905P2650N805r7180k7772O2201J3571m4852o4222J2788q19j7410O233
$$ plain form
17231 89773 118103 153238 167015 161881 72655 -1768 5637 90 -116869 -172020 -140976 -64063
17219 -64063 -56505 -10978 93145 106219 59101 37259 78512 -3023 -49566 -87433 -136525 -155438
17207 -155438 -61717 -20981 -10495 -26683 26804 11019 23444 -25955 38944 78091 4070
17196 4070 -54279 -48549 34538 -3475 -79807 -73294 -51675 4502 -20697 -16429 -17601 -10073 -63167
17183 -63167 2102 59876 109987 90491 23735 -29280 -75612 -17979 9346 48099 132442 171178
17171 171178 140715 106166 102449 111050 70660 68567 48083 26636 19605 42132 85831 136014
17159 136014 120408 68727 69923 58628 27841 -827 -19154 16197 -1376 44652 36116 62905
17147 62905 135555 141360 44180 16408 78609 92180 47328 -16894 -4106 -4925 -22335 -16102
17135a6102k906j115O4370m3397P404l1494L4008m7352l2474j1528j22555q3947
17123b87088O9549R4025M6641k0158l25Q9528N4741J3342l6147L083j6394p3380
17111f2583P4561r110n5985J3656k0816n4249l0778J0309J320o709P7094J09098
17099D5808P0107l7426M3893N5498q9790l7494r279J0108l930N2559p080K237
17087I5211r199K6386M063p6250m4024m5192j45457J27914J46958P3412O8379
17076B22201p1749r4698K6086O4327o6342n0972L4681R323K593p8153N665M5815
17064D8777M4270J14935J04995j03077o3960L0818N5714n2862n7942J67171N6983
17053C45822m0910n9484O283J4421m5631j28820K1573R6901J03100m2289J6924
$$ plain form
17135 -16102 -19008 -20123 44247 850 8254 -23240 10768 -36584 -69058 -80586 -203141 -287088
17123 -287088 -217539 -123514 -76873 -97031 -97356 -7828 46913 60255 24108 27191 10797 -62583
17111 -62583 11978 2868 -53117 -39461 -60277 -114526 -145304 -134995 -133675 -140384 -63290 45808
17099 45808 115915 78489 122382 177880 88090 50596 41317 51425 47495 100054 92974 95211
17087 95211 86012 112398 116461 40211 -3813 -49005 -194462 -66548 80410 153822 222201
17076 222201 150452 55754 81840 146167 79825 28853 63534 72857 75450 -2703 2962 48777
17064 48777 93047 207982 312977 209900 145940 176758 232472 179610 121668 288839 345822
17053 345822 304912 245428 251711 266132 220501 91681 113254 210155 313255 270966 287890
17042B87890r979J1177J5587J1349R025n635r024O6117J13024K5476p5964k2339
17030D16704j13884o0112J13556J27708O5221j0913j8320l8479M7710R0668Q3206
17019G03065M851r77M3052K7085Q3153k2857j13618k9088O7356Q8937O1889L0020
17007I42868Q1825n02j1172r8877N2127J13984J5290m1895N857P5171K2767M1912
16995A199355k1268J4112L758J2030M245N4135J9653j1100p3635J0814O7547N126
16983A284772n7716J05150K4484j40378j49570J5790P9090J0577q1199o7923K9019
16972A052096MM6127k8032j79213p3815R3603L9869o0272p411l854r9816r4935
16960F84351Q03n754j19724n3255L3694L7578L5162n6614l4348m2448N08l924
$$ plain form
17042 287890 277911 289088 304675 316024 325049 319414 310390 376507 489531 515007 439043 416704
17030 416704 302820 242708 356264 483972 549193 538280 519960 481481 529191 619859 703065
17019 703065 707916 706939 749991 777076 860229 837372 723754 694666 762022 850959 912848 942868
17007 942868 1024693 1024191 1013019 914142 966269 1080253 1095543 1053648 1059505 1134676 1157443 1199355
16995 1199355 1178087 1192199 1195957 1207987 1212232 1266367 1286020 1274920 1201285 1212099 1279646 1284772
16983 1284772 1227056 1332206 1356690 1216312 1066742 1082532 1161622 1172199 1091000 1023077 1052096
16972 1052096 1052100 1098227 1070195 890982 817167 910770 950639 890367 882956 879102 779286 684351
16960 684351 685154 679400 559676 506421 540115 577693 612855 556241 521893 479445 479953 476029
16948D76029n4577l7344N5609M9344K7710n9818o4270n3944M5729n561k7013l4954
16936C16940K0906J4916M054M8857r812m3753n477l7644j5607K8767J756m287
16924C19616l7806n6533O3659N5776L0040M1850j8743j12638j85932n7565L2809
16913G4533P2985K9740K635o2124L6957m380m5671Q2721o730l1724J6122N4295
16901B19359N598O5758p9336l7733j1326j6752n5019K2988N427k3019N3110J3028
16889A62083M180o6561m9282Q0669N9922N6659r6068n3772n3126N0243K7581M9555
16877A72083j9078j31729q6494j7368O0829J30147o9325p3795j7450N9319P9081
16866H6220l0928j1238k5287k2139O7912O3351p1623o3159O1517M2498L7520q1017
$$ plain form
16948 476029 421452 384108 439717 489061 516771 456953 392683 338739 384468 378907 351894 316940
16936 316940 337846 352762 356816 405673 395861 352108 346631 308987 293380 322147 323903 319616
16924 319616 281810 225277 288936 344712 374752 416602 397859 285221 99289 41724 74533
16913 74533 147518 177258 179893 117769 154726 150346 104675 187396 180666 148942 165064 219359
16901 219359 224957 290715 211379 173646 162320 145568 90549 113537 118964 95945 149055 162083
16889 162083 166263 99702 50420 131089 191011 247670 151602 97830 44704 94947 122528 172083
16877 172083 153005 21276 -65218 -82586 -21757 108390 39065 -34730 -52180 7139 86220
16866 86220 55292 44054 18767 -3372 64540 127891 56268 -6891 54626 97124 134644 53627
16854E3627j3325L2846J14105M62j51467j52954J21587N1773J8751Q0294o4323
16843I1376M324j8189q2169j0396M1698N2192l9624k1511L2151l7952R579j6J11092
16830A32555L643k8670j3371j28304j3906L3654N0385j0541p0276r4563l5635
16819a75029L9238P1914k4846k4611K2685O9687k9700J6421Q9408l835l6418l6246
16807b1332L290n0029O3106J07006o2101m6072m5775l9980M0884K471o1613J9296
16795i0849L4970K8564j7111l8595N7093K1072l2135P0031J0840j4133q873L2248
16783E3122K9389p343n7461k6483n9964k8494N7608j5061m9099m021L9354k2024
16771i0477m484K6157N0508l0836n9511j24263o497L4241l1139L4632M6072Q1257
$$ plain form
16854 53627 40302 73148 187253 187715 36248 -116706 4881 56654 75405 155699 91376
16843 91376 95700 77511 -4658 -15054 26644 78836 39212 17701 49852 11900 21479 21463 132555
16830 132555 136198 107528 94157 -34147 -48053 -14399 35986 25445 -44831 -139394 -175029
16819 -175029 -135791 -63877 -88723 -113334 -90649 -20962 -50662 -34241 55167 51332 14914 -21332
16807 -21332 -18042 -68071 -4965 102041 39940 -6132 -51907 -91887 -51003 -48532 -110145 -90849
16795 -90849 -55879 -27315 -44426 -83021 -25928 -4856 -36991 33040 43880 29747 20874 53122
16783 53122 82511 75168 17707 -8776 -68740 -97234 -39626 -54687 -103786 -107807 -68453 -90477
16771 -90477 -94961 -68804 -18296 -49132 -108643 -232906 -239403 -205162 -236301 -201669 -155597 -74340
16759g4340O9830n1254o9792n0774q5823M5156O8129M6446R528n0481L914J09679
16747b9782J749j9207o3752N1705l6057j225R2646J8538p0321m7796N5262O0671
16735A2431M1603l3357J9659N0033j2549k4506l305J780p34l24j1338J0730Q4331
16722A34454n7922p0364j11547j25317q4165J43024N2574j23759k3891O3101K4888
16711a78924J67L6452P7258L1790R0763l8312N498n2618k000L4906j7457j6838
16699b9315m823J452K663O106L1843j02257m9913K1512m4139k2796N4390R8845
16687c6432M0055k3168n1784k7769Q432J31594j316l572m6839l5409K7836O059
16675a2313k1031o6878n8941n3209R38N8963L6767k7757L4932J03431K7961j3013
$$ plain form
16759 -74340 -4510 -55764 -125556 -176330 -262153 -216997 -148868 -102422 -92894 -143375 -139461 -29782
16747 -29782 -28033 -47240 -110992 -59287 -95344 -96569 -3923 14615 -55706 -103502 -48240 12431
16735 12431 54034 20677 40336 90369 77820 53314 50009 51789 51055 50731 39393 50123 134454
16722 134454 76532 6168 -105379 -230696 -314861 -171837 -119263 -243022 -266913 -203812 -178924
16711 -178924 -178757 -142305 -65047 -33257 57506 19194 24692 -27926 -29926 4980 -12477 -29315
16699 -29315 -34138 -32686 -30023 -23917 7926 -94331 -144244 -122732 -166871 -189667 -135277 -36432
16687 -36432 3623 -19545 -71329 -99098 -90666 40928 39612 36040 -10799 -46208 -18372 -12313
16675 -12313 -33344 -100222 -159163 -212372 -211434 -152471 -115704 -143461 -108529 -5098 22863 9850
16663I850M202k8518o1529N260q5526k1571J07907l018l0566q990p9310J05L7107
16650a54597K2460p98q1210O5275P4479R860J6898m5745K8998O5104n4279k3905
16638g7460j7388J6942p7925k9952m8642K4262Q2793m774m9275K7818O6598O1852
16626b5151k6971M7908Q8043j4222K5875k1888j6350o1984q0736k1537n9358m1587
16614b07958M4179L4191m9153J2211O1394q3040N4209L1119m9394n1778k0564
16603b24584K4560J6186M4925P5350o6675o5632R9809N8509k4762K6613j9760
16592e5461j9617N7003P8380j061j51211r0688m6454J00259J05237O1393m8345
16581a0565p2387K1491m07n9356n551J6262J9110l1280J5400m2686N9787J2629
$$ plain form
16663 9850 14052 -14466 -75995 -70735 -156261 -177832 -69925 -72943 -103509 -112499 -191809 -191704 -154597
16650 -154597 -132137 -132935 -214145 -148870 -74391 -64531 -47633 -93378 -64380 724 -53555 -77460
16638 -77460 -94848 -77906 -155831 -185783 -234425 -210163 -127370 -132144 -181419 -153601 -87003 -25151
16626 -25151 -52122 -4214 83829 69607 95482 73594 57244 -4740 -85476 -107013 -166371 -207958
16614 -207958 -163779 -129588 -178741 -166530 -105136 -188176 -133967 -102848 -152242 -204020 -224584
16603 -224584 -200024 -183838 -138913 -63563 -130238 -195870 -96061 -37552 -62314 -35701 -55461
16592 -55461 -75078 -18075 60305 59244 -91967 -182655 -229109 -128850 -23613 37780 -10565
16581 -10565 -82952 -61461 -61868 -121224 -126775 -110513 -91403 -122683 -107283 -149969 -90182 -77553
16569g7553j7177m7327o2719K3410Q7811n8748n9028k2590N1628O0052m5925P2032
16557i6134L9960r478n6817M0069K4169n7240K3109J1862l753M3780j4071j27904
16545a82448m8061Q8713J75L963O4166Q7709K5280o496J1225m0660K4990l0583
16533b027n5313j9897o0018j950k4624o2176P1431J14308P4334k502j06934m2624
16521a17992J8713J9793P881o1581M8195J422j2319K5885R7879j5105l9195m3091
16509f9515M6975K1215M617r156M6325j41713J7509M995q916r7k223o7517j0726
16496a68227Q2159L6135L8233j11370k7089P8012q759n1273J6179k0980l4927
16485a71907m1777J2467M1675p09j2734J1031L2934N0277J1330o862J9344M0684
$$ plain form
16569 -77553 -94730 -142057 -204776 -181366 -93555 -152303 -211331 -233921 -182293 -122241 -168166 -96134
16557 -96134 -56174 -65652 -122469 -82400 -58231 -115471 -92362 -80500 -84253 -40473 -54544 -182448
16545 -182448 -230509 -141796 -141621 -137658 -73492 14217 39497 33001 44226 3566 28556 -2027
16533 -2027 -57340 -77237 -137255 -139205 -163829 -226005 -154574 -40266 34068 31566 -75368 -117992
16521 -117992 -99279 -79486 -71605 -133186 -84991 -83569 -95888 -70003 27876 12771 -26424 -69515
16509 -69515 -22540 -1325 3292 -5864 40461 -101252 -83743 -78748 -87664 -87761 -89984 -157501 -168227
16496 -168227 -86068 -49933 -11700 -123070 -150159 -72147 -80906 -132179 -116000 -136980 -171907
16485 -171907 -213684 -201217 -159542 -160251 -172985 -161954 -129020 -78743 -67413 -74275 -54931 -14247
16473a4247J9818l2270j6045k7965m6076l3681K0002L6671L598Q779J7788K8022
16461c5606O040j7300l7418n8757L5308O7302r0058m867l1287p8356o819L5659
16449b16159R668M7659m2201N3022P2259N4103K4464o4983L8311K1328m8435l1748
16437h2712J40N3098K2795j1796L8285k217q2724p3794J6646N398o0256k7569
16425b04706J6502N5637M3167K7563l5603N414O3625J898R085K0415p5927r3510
16413a66440N8491R974l9422l0998M5245N8838j767L8112J03060L3646o0233k1473
16401B7033q4244q2938k6769J430k3791n3355L4606J9128K0404r140O5621M0138
16389g1877n2964P689j8816M820j84088J8079R3666J14081l6508o5637l760J9045
$$ plain form
16473 -14247 5571 -26699 -42744 -70709 -116785 -150466 -130464 -93793 -90195 -81416 -63628 -35606
16461 -35606 -29566 -46866 -84284 -143041 -107733 -40431 -130489 -135356 -166643 -244999 -251818 -216159
16449 -216159 -206491 -158832 -201033 -148011 -75752 -21649 2815 -62168 -23857 -2529 -50964 -82712
16437 -82712 -82572 -29474 -6679 -18475 19810 17593 -65131 -138925 -122279 -116881 -177137 -204706
16425 -204706 -188204 -132567 -89400 -61837 -97440 -92026 -28401 -26503 -17418 2997 -72930 -166440
16413 -166440 -107949 -97975 -137397 -168395 -123150 -64312 -66079 -27967 75093 108739 48506 27033
16401 27033 -57211 -140149 -166918 -165488 -189279 -242634 -208028 -188900 -168496 -177636 -112015 -71877
16389 -71877 -124841 -117152 -135968 -131148 -315236 -297157 -203491 -89410 -125918 -191555 -195315 -176270
16377a76270O3644N8000p4187N4255L2997q657J3623k1707o3533K047K8590J1050
16365h0148P5002N396k2863k5531l0865n5589K8123R2881k6485M5918j5610Q933
16353h38k9736o9483m0732Q0634M1365n2266m1006l5085M4071P3184M6422o3583
16341d7053N0985L0477n8545j05039p7081R5641N7800L0512J9982M739R5629N4287
16329A52334k3566r8763q4005j26850k4730P4484M1267k624N3522R9641K2581
16318H3291P2952K1635q936N7222M5161M902o6845l3207o7841k203k0885m6449
16306C8797N0667Q8070N8663j13490L2880Q3498M6952L3097n6138l2134n1914
16295A78948J7015R828L3492k2290l3047L8783L0012k6385J1120m5665q0295r055
$$ plain form
16377 -176270 -112626 -54626 -128813 -74558 -41561 -50218 -36595 -58302 -121835 -119788 -91198 -80148
16365 -80148 -5146 250 -22613 -48144 -79009 -134598 -106475 -13594 -40079 5839 -9771 -838
16353 -838 -30574 -100057 -140789 -60155 -18790 -71056 -112062 -147147 -103076 -29892 16530 -47053
16341 -47053 3932 34409 -24136 -129175 -206256 -110615 -52815 -22303 -2321 2418 98047 152334
16329 152334 128768 30005 -54000 -180850 -205580 -131096 -89829 -92453 -38931 60710 83291
16318 83291 156243 177878 168942 226164 271325 276227 209382 176175 108334 106131 85246 38797
16306 38797 89464 177534 236197 122707 155587 239085 286037 319134 262996 230862 178948
16295 178948 195963 205791 239283 216993 183946 222729 252741 226356 237476 191811 111516 102461
16283A02461N9968P9193l3422J8358k107L2342q248k8458j465J3518K8348m7522
16271B12966N448n4760p0220Q870L1414J7090j6517n0101j1954M2973J5490j5272
16259A15427p2455Q5205j4618k4092O1199p245n8833n1675J16944L4984m3298
16248A41543n5373r2615r3486j4731Q1057J5366L7488R8599L0066M7515o5971
16237A29458o1694j1549j68134k2165N8882k2127N0838j6665m6010j3803K2498
16226a00471J4749J7156O1006K8550k1893L5335j17414j12758O3201M4923n5267
16215a42883O684O5901P8304l4286R807N6471l4517k2153l0050k2310n4204m600
16203a27836k8276J9185N8998N2133r908k1556k1860j7789Q610j4086q1317M3304
$$ plain form
16283 102461 162429 241622 208200 226558 224451 256793 248545 220087 218622 232140 260488 212966
16271 212966 218414 163654 93434 102304 133718 150808 134291 84190 72236 115209 130699 115427
16259 115427 42972 128177 113559 89467 150666 143421 84588 32913 149857 184841 141543
16248 141543 86170 -6445 -99931 -114662 -33605 -18239 19249 117848 147914 195429 129458
16237 129458 67764 56215 -111919 -134084 -75202 -97329 -46491 -63156 -109166 -122969 -100471
16226 -100471 -85722 -68566 -7560 20990 -903 34432 -82982 -195740 -132539 -87616 -142883
16215 -142883 -136199 -70298 8006 -26280 -16473 39998 5481 -16672 -46722 -69032 -123236 -127836
16203 -127836 -156112 -136927 -77929 -25796 -35704 -57260 -79120 -96909 -88299 -102385 -183702 -140398
16191a40398O5450k1636N805j6111L8446L0467J9565K2962Q968n9172k4822K0699
16179d9777k9745O6819o1739m0264l1456j258J6426M8817R8770O9047k3533J6419
16167G8526k8832q7916o7524q004L3399O002J8580P7835l7434J322j01184m7940
16155a63170j2918N037J16939R4414j7240K4549J8912q5415n6850L262l6236l0688
16143a39404O8325J03277n151j5823o1110J4821Q6938l9359p0781Q3787O3396
16132H8916p7533p1306j1634k7143k1407n7448J2913M3170R6862P5503L499q0736
16120b6344l3691J54k8231O0384n6758N28K1491o4637l8777O0440O2833r648m1172
16107i3428r9323p7585M4601J07027K9670l4722k8931J8942K244l648k60L2869
$$ plain form
16191 -140398 -74948 -96584 -90779 -106890 -68444 -37977 -18412 4550 13518 -45654 -70476 -49777
16179 -49777 -79522 -12703 -74442 -114706 -146162 -147420 -130994 -82177 16593 85640 62107 78526
16167 78526 49694 -38222 -105746 -113750 -80351 -74349 -55769 22066 -15368 -14046 -115230 -163170
16155 -163170 -176088 -171051 -54112 40302 23062 47611 66523 -18892 -75742 -72480 -108716 -139404
16143 -139404 -71079 32198 27047 11224 -49886 -35065 51873 12514 -58267 25520 88916
16132 88916 11383 -59923 -71557 -98700 -120107 -177555 -164642 -121472 -24610 50893 54392 -26344
16120 -26344 -60035 -59881 -88112 -27728 -84486 -83958 -62467 -127104 -165881 -105441 -42608 -52256 -93428
16107 -93428 -192751 -270336 -225735 -118708 -89038 -123760 -152691 -133749 -131505 -135153 -135413 -102544
16095a02544K5012K5028k4536m6151M9910K8089M0428l0817p0439o6313k1651
16084a93984O2772L8044m0746J14813Q6393n1407j1584n2173K0880Q1140k9741
16073B4407q0724k5601L6089l2911K5257J1058k289k2865k6228J7483m991L0880
16061e0435J39571J815m9662m0378m8993m493k9970L2878J31091O4084j5843j00947
16049B8718j32269k0021n5709M3702P254m9037N7487m3448J0515L684j4373P3474
16037i0023Q0406J0313k81N2822m8462N789M0133l432m9372m1009L4738N174j8432
16024b1636M7793J93J1476k225J5664K505Q91o6014O929j7256l839k9745m3826
16011i9090n3006N8241O6979N5843r8872l2514J44267O8615p2595l9840j4412
$$ plain form
16095 -102544 -77532 -52504 -77040 -123191 -73281 -45192 -4764 -35581 -106020 -172333 -193984
16084 -193984 -131212 -93168 -133914 -19101 67292 15885 4301 -47872 -26992 54148 24407
16073 24407 -56317 -81918 -45829 -78740 -53483 -42425 -44714 -67579 -93807 -76324 -81315 -50435
16061 -50435 89136 90951 41289 911 -48082 -52575 -82545 -49667 81424 145508 129665 28718
16049 28718 -103551 -123572 -179281 -135579 -128325 -177362 -119875 -163323 -152808 -149124 -163497 -90023
16037 -90023 -9617 696 415 53237 4775 10564 50697 47265 -2107 -43116 -8378 -3204 -21636
16024 -21636 26157 26350 37826 35601 51265 53770 54661 -11353 -4424 -21680 -25519 -55264 -99090
16011 -99090 -152096 -93855 -26876 28967 -69905 -102419 41848 110463 37868 -1972 -16384
16000a6384M925p5386m2589l8364l343L8664j7491L7310P4510k3349o0536j3902
15988a35935l4830k3403N7251Q7458j4790r3235o0575o362K2056P9609O4392K8374
15976b9990k5194M9272k1389J6641l1958j2833N0033K9164k3037O037q3484m4862
15964a21600K7446m4936J148Q5079L1266n2693R998L8110O3647L9526p262m3139
15952B6590O4784K9047q7408l9445J4956o2465J4867N5400P6591j52953n0084
15941a10120l4520p585L1382k7637r7932M576N4983l2003M1610N0124K9697O826
15929i0599n7904M1524J05734K7261K0410N192j8675K0730j06299r4454o6657
15918b13737m7119N0389J36623Q742r9523m3439K0927l7049k7060k2153P5152
$$ plain form
16000 -16384 -11459 -86845 -129434 -167798 -171141 -132477 -149968 -112658 -38148 -61497 -122033 -135935
15988 -135935 -170765 -194168 -136917 -49459 -64249 -157484 -218059 -224421 -202365 -122756 -58364 -29990
15976 -29990 -55184 -5912 -27301 -10660 -42618 -55451 -5418 23746 709 6746 -76738 -121600
15964 -121600 -94154 -139090 -137942 -52863 -21597 -74290 -64292 -26182 37465 76991 69729 26590
15952 26590 91374 120421 33013 -6432 8524 -53941 -39074 16326 92917 -60036 -110120
15941 -110120 -144640 -152225 -120843 -148480 -246412 -241836 -186853 -218856 -177246 -127122 -97425 -90599
15929 -90599 -148503 -106979 -1245 26016 46426 51618 32943 53673 -52626 -147080 -213737
15918 -213737 -260856 -210467 -73844 -65102 -164625 -208064 -187137 -224186 -251246 -273399 -198247
15907a98247Q4109k4700o5765j888L6648j9568J584l6478O6171L2725J4285L3367
15895g7757N7818k6970O009q4290K5795m2668o9452J3290l0154K8061M5875M647
15883a49796J7580Q833j7659P9461O1718L0763p4567L0159N0643l5366o820m5017
15871e0068j071N892J4713n0048P699N8176l4869K9772L8020L3217o2589o5832
15859g6988r2295Q353J04059R7520p5556j10273J2152N0848p1807R377R7405L2421
15847a4784K8816j15827p0357N6600O9904L6392l7981n7488M4412L5746m8443
15836g3010N5030j7788l7637Q409l9339P2214J46538k4402j25405l9970R252N9006
15824g102l9007m3285j2814O5382k3689n6422L2979K3913K743J4951j8121j4015
$$ plain form
15907 -198247 -114138 -138838 -204603 -206491 -169843 -189411 -187827 -224305 -158134 -125409 -111124 -77757
15895 -77757 -19939 -46909 -40900 -125190 -99395 -142063 -211515 -198225 -228379 -200318 -154443 -149796
15883 -149796 -132216 -123383 -141042 -61581 137 30900 -43667 -13508 37135 1769 -5051 -50068
15871 -50068 -51139 -45247 -30534 -80582 -72883 -14707 -49576 -19804 18216 51433 -11156 -76988
15859 -76988 -169283 -160930 -56871 40649 -34907 -145180 -133028 -82180 -153987 -144610 -47205 -14784
15847 -14784 14032 -101795 -172152 -115552 -45648 -9256 -47237 -104725 -60313 -24567 -73010
15836 -73010 -17980 -35768 -73405 -64996 -104335 -32121 114417 90015 -35390 -75360 -66108 -7102
15824 -7102 -46109 -89394 -102208 -36826 -60515 -116937 -83958 -60045 -57302 -42351 -60472 -74487
15812g4487l571l0572J6470L7464K7524K3512j06394l6838j2502M2893M1834L5178
15800c9489l7707k6553K2686M8963m4793n9622O7206P0872m7858o0058L5273Q6124
15788A5044m4747K8355j0844J0539L0484n6886n3442M2083K6975L6756l87j097
15776B2833l3807k2457n2205j10394j4551K9432J03170J43941M8475M0955m0826
15765A14566o0845k4991L68j9007N991J3881k1316O7694j674l1059j7175j02145
15753g5712r0825P2152M6868l0983l0013k7931k788P9655Q178O8556n9562r2271
15741a34676O3864K8383Q6108k176J6171Q489r2585o1462j3622k4856L1337r495
15729a04520k1684n3828K0824O9119n3566k3437J8498N7368L9698j43695k7472
$$ plain form
15812 -74487 -78058 -108630 -92160 -54696 -27172 -3660 -110054 -146892 -159394 -116501 -74667 -39489
15800 -39489 -77196 -103749 -81063 -32100 -76893 -136515 -69309 1563 -46295 -106353 -71080 15044
15788 15044 -29703 -1348 -12192 -1653 28831 -28055 -81497 -39414 -12439 24317 23930 22833
15776 22833 -10974 -33431 -85636 -196030 -210581 -181149 -77979 65962 114437 155392 114566
15765 114566 53721 28730 29098 10091 16082 29963 8647 76341 74667 43608 26433 -75712
15753 -75712 -166537 -94385 -47517 -78500 -108513 -136444 -139232 -59577 -51399 17157 -42405 -134676
15741 -134676 -70812 -42429 43679 41503 57674 66163 -26422 -87884 -101506 -126362 -95025 -104520
15729 -104520 -126204 -180032 -159208 -90089 -143655 -167092 -148594 -91226 -51528 -195223 -222695
15718b22695O8695l3373j7683N1016M7773Q3871m1968j04433k703M6793k7968
15707a52675J7331P2180N6521l5897r370M3905K883n8404o3446k6544O740R5611
15695e1165l0733K8966M1577m0130K3124p9142m8695J3777l9645M6199M545l2751
15683a64073J3557N6556J01123j2914j14191o581P9377Q0104J5945r128j6878
15672B2897r0908p762J28538O7017r8464q2122o2961J9288J8002m1347o6836n2198
15660b46856j3988J7077M8011o036L2275j7582O057K1441K9571R747M9684l9840
15648a10439m9768l1211L3702O4535J28641M4905L77j22497k3957l6479O110m784
15636a00865o339J04344j4039n3712m4902L0323M0868P757J2810P571n8803j2891
$$ plain form
15718 -222695 -154000 -187373 -205056 -154040 -106267 -22396 -64364 -168797 -171500 -124707 -152675
15707 -152675 -135344 -63164 -6643 -42540 -51910 -8005 -5122 -63526 -126972 -153516 -146776 -51165
15695 -51165 -81898 -52932 -11355 -51485 -28361 -107503 -156198 -142421 -182066 -135867 -131322 -164073
15683 -164073 -150516 -93960 7163 -5751 -119942 -126523 -47146 32958 48903 39775 22897
15672 22897 -68011 -75773 52765 119782 21318 -60804 -123765 -104477 -86475 -127822 -194658 -246856
15660 -246856 -260844 -243767 -195756 -201792 -169517 -187099 -181042 -159601 -130030 -120283 -70599 -110439
15648 -110439 -160207 -191418 -157716 -93181 35460 80365 80742 -41755 -65712 -102191 -96081 -100865
15636 -100865 -107204 -2860 -16899 -70611 -115513 -85190 -44322 -36565 -23755 -16184 -74987 -87878
15624h7878K110j3101J9045N1421o160l7052Q4515l3571r9626m2467j2346n175
15612a80285M4249J38732O104j38382l696L7719M5695p335m2690j13268l1241
15601b44398j7247j6919K8590J18687J16286K6612J5817j3939J6153r12j06112
15590g7382r4385P0385k9640l8606L9231j3957J0560J3988J6300Q619l515K118
15578i6284L050l2333j1549n1495K4666J43109n9069p7360M5746P1481L4630p148
15566a2556l0387p9655l9245n0457O9157M7749K5073P6954L3295K2536n5625o2840
15554e6001l9265L1653L0695n5781j9081N8724o051R824M0506n0336N1493J3410
15542I790r6140p6891L9585n4942k8391Q9918P4561l41l3556J0316L2566K0703
$$ plain form
15624 -87878 -85768 -98869 -79824 -28403 -34563 -71615 12900 -20671 -120297 -162764 -175110 -180285
15612 -180285 -136036 2696 8800 -129582 -133278 -95559 -49864 -57199 -99889 -213157 -244398
15601 -244398 -261645 -278564 -249974 -131287 -15001 11611 27428 13489 29642 28730 -77382
15590 -77382 -171767 -101382 -131022 -169628 -130397 -144354 -133794 -119806 -103506 -94887 -98402 -96284
15578 -96284 -93234 -125567 -137116 -188611 -163945 -20836 -79905 -157265 -111519 -40038 -5408 -12556
15566 -12556 -42943 -122598 -161843 -212300 -143143 -95394 -70321 6633 39928 62464 6839 -56001
15554 -56001 -95266 -63613 -32918 -88699 -107780 -49056 -55107 -45283 -4777 -55113 -3620 9790
15542 9790 -86350 -163241 -123656 -178598 -206989 -117071 -42510 -42851 -76407 -66091 -33525 -12822
15530a2822L319R4086J2962j15676j31882j8004Q9486P1209k242n581N8732k5766
15518A7821m5403p8143n9501m5171o0506N2596J54180O8412p2412k0378o3521
15507a52026J1637L6976J4480n5079j0248P076l1272p1220R634N8124J14158N3355
15495a4405J0874J5393o2510L8452N3014n0846o1829J5611o5956k8525r069L9263
15483a20533K4l2815l9513O5201Q1803K8153P4870l933r0601l6049o2188K0651
15471a14930M563K7201j9296j24750k5762j744m5O9441Q9962r41L0031Q8847R1493
15458A14070q777r1716j14346m3733o71M1639L1029j3841J699Q9401J6842n3266
15446c1670N0774r6789k1059K1973n2780o5716o2363K6286J4834n3147M6936R0022
$$ plain form
15530 -12822 -9503 84583 97545 -18131 -150013 -168017 -78531 -7322 -9564 -15145 43587 17821
15518 17821 -27582 -105725 -165226 -210397 -270903 -218307 -64127 4285 -68127 -88505 -152026
15507 -152026 -140389 -103413 -88933 -144012 -154260 -147184 -178456 -249676 -240042 -181918 -67760 -14405
15495 -14405 -3531 11862 -50648 -12196 40818 -10028 -71857 -56246 -122202 -150727 -159796 -120533
15483 -120533 -120509 -153324 -192837 -127636 -45833 -17680 57190 53257 -37344 -73393 -135581 -114930
15471 -114930 -110367 -83166 -102462 -227212 -252974 -254718 -254763 -185322 -95360 -96301 -66270 22577 114070
15458 114070 105293 13577 -100769 -144502 -145173 -103534 -72505 -86346 -84647 4754 21596 -31670
15446 -31670 19104 -77685 -98744 -76771 -129551 -195267 -257630 -231344 -216510 -269657 -222721 -132699
15434a32699N9874K8573M175l967p9074J8033j7350l1173M5927L3116J2579m5667
15422a07653r8792q226R0002J07135j0707q0162m849K4340l8421l75N2817j5988
15410i0879j00700o3565L9897R0729N1523L14r467j03064p7095P9755K03311n285
15398A5474R2139k0548j09428p2736j4998j5686N3357J36654l4621m8859P629
15387a1623M593l5028O3745R105o0360j46794j6691L6494O8808J0721j3145K4368
15375f5807J42675l6674j07145l9850j8187J3097M3162K303J6302n9016m4320
15364a53460j9262j7544J1250L9183L3142N8377R527k8927k7705J6803p4997K436
15352a51177J53262L9565p7190M6404K0218p7774o820M224M3184j8854n2716K149
$$ plain form
15434 -132699 -72825 -44252 -40077 -44044 -123118 -105085 -122435 -153608 -107681 -74565 -61986 -107653
15422 -107653 -206445 -214671 -124669 -17534 -28241 -108403 -113252 -88912 -127333 -127708 -74891 -90879
15410 -90879 -191579 -255144 -215247 -124518 -72995 -72681 -82148 -185212 -262307 -182552 20759 15474
15398 15474 107613 87065 -22363 -95099 -110097 -125783 -72426 64228 29607 -19252 -11623
15387 -11623 -7030 -42058 21687 30792 -29568 -176362 -193053 -156559 -87751 -77030 -90175 -65807
15375 -65807 76868 40194 -66951 -106801 -124988 -111891 -68729 -66426 -50124 -109140 -153460
15364 -153460 -172722 -190266 -179016 -139833 -106691 -48314 -38787 -67714 -95419 -78616 -153613 -151177
15352 -151177 2085 41650 -35540 10864 31082 -46692 -53512 -49288 -6104 -24958 -77674 -75525
15340g5525p0425J0285L1784M8296K0504L7143l1841m6701Q3178L8830r8421P51
15328e2142L2061O691j43706r4392J05792M2934j8544k9370K3032p4898K7234
15317a75308J14406J9815j3195j1107l1849l6937K0099J6582J8917n4425N978
15306a27024L7677k563j0117m3545J7499L3630R787k1904j5248J00113k5111j13321
15294a60127l6886N8923J09891k2696r842M3280K3799J9090J0820o1669j30537
15283a55954r9843K0846P7362l3996Q7181M4713k524R6673n6789n4878l4860p5091
15271a87160j752k8088r377R8063J7166p250n1812K739P1699R272o8561J9364
15259a35697J29446K3342o4228j38067K1662L7113L277L3933N8504M0180R61L0112
$$ plain form
15340 -75525 -145950 -135665 -103881 -55585 -35081 2062 -29779 -76480 6698 45528 -52893 -52142
15328 -52142 -20081 -13390 -157096 -251488 -145696 -102762 -121306 -150676 -127644 -202542 -175308
15317 -175308 -60902 -41087 -54282 -65389 -97238 -134175 -114076 -97494 -78577 -133002 -127024
15306 -127024 -89347 -91910 -102027 -145572 -128073 -94443 -84656 -106560 -121808 -21695 -46806 -160127
15294 -160127 -197013 -138090 -28199 -50895 -60737 -17457 6342 25432 36252 -25417 -155954
15283 -155954 -255797 -234951 -157589 -191585 -104404 -59691 -62215 34458 -22331 -77209 -112069 -187160
15271 -187160 -188912 -217000 -226377 -128314 -111148 -118398 -170210 -167471 -95772 -86500 -155061 -135697
15259 -135697 -6251 17091 -47137 -185204 -163542 -126429 -123152 -89219 -30715 9465 10426 40538
15247D0538p2052q7665L579M5741M6660m5181n0103L2792j1850o515p7895l3948
15235b15899n167O992N6907N4899k5609J6389l6384Q2752K5452R8432o839p8603
15223b6678M6509J6177L1948P658p9856K7608k6746j2142k8247M0242l8169K693
15211c9003l521L8334J0036j54894r1157K4683J09276M1873O7603K4560p4257
15200d6467L3735k477k2144l9833j6330L6677O870K573M8177l2624m6329m4398
15188a22570J8438L9477J14386L8526n0200o1648l6683L4528l4200K8381q067
15177c9632q3613o784m6971L953j1295M2115j3305k7656K2365K678K3248R0512
15165d4385L9450K697k100q3303M6163K7330p1576k770O39J8728L1856L9260m4104
$$ plain form
15247 40538 -31514 -119179 -115600 -69859 -23199 -68380 -118483 -85691 -97541 -104056 -181951 -215899
15235 -215899 -221066 -214074 -157167 -102268 -127877 -111488 -147872 -65120 -39668 58764 51925 -26678
15223 -26678 19831 36008 67956 75614 -4242 23366 -3380 -15522 -43769 -3527 -41696 -39003
15211 -39003 -42524 -4190 5846 -149048 -240205 -215522 -106246 -64373 3230 27790 -46467
15200 -46467 -12732 -15209 -37353 -77186 -93516 -56839 -49969 -47396 781 -31843 -78172 -122570
15188 -122570 -104132 -64655 49731 88257 38057 -23591 -60274 -25746 -59946 -31565 -39632
15177 -39632 -123245 -130029 -177000 -173047 -184342 -142227 -155532 -183188 -160823 -158145 -134897 -44385
15165 -44385 -4935 -2238 -4338 -87641 -41478 -14148 -85724 -88494 -87855 -69127 -37271 1989 -42115
15152d2115M1598J4439l4847j6683k6751k9320p1263m183L8175r947J6984k3831
15140a47744K9365N329J24675O9410P8704J6423j8609j12028j20550n1229q474
15129a34728R8623j8257R961R2643K544j0722n5841n5941j0116O8889J1289J5151
15117A3495P697r1839o7993j3267M9631P2111p758p1356L3746O4256N2031l4140
15105F614j5982M1912k695l2914m3200m0882l9055K4867J47064K1240R254O592
15093H2815m1732p8138r4277q5712M3468J11763O9289J8775l6265m2061J9960
15082c2115L5381O1464l2561K4760Q3639K9048q8008j61013J832O8016N595J5546
15070A1584R5992K1708m8911l4118L583q0523m6362L6533R6236q5120j32218M0202
$$ plain form
15152 -42115 -517 13922 -20925 -37608 -64359 -93679 -164942 -169125 -130950 -140897 -123913 -147744
15140 -147744 -118379 -113050 11625 81035 159739 176162 157553 45525 -75025 -126254 -134728
15129 -134728 -36105 -54362 -44401 48242 50786 40064 -15777 -71718 -81834 -12945 -1656 13495
15117 13495 21192 -70647 -138640 -151907 -102276 -30165 -37923 -109279 -75533 -11277 40754 6614
15105 6614 -9368 32544 29849 -3065 -46265 -87147 -126202 -101335 45729 66969 76223 82815
15093 82815 41083 -37055 -131332 -217044 -173576 -61813 7476 26251 -10014 -52075 -32115
15082 -32115 3266 64730 32169 56929 140568 169616 81608 -79405 -77573 -9557 -3962 11584
15070 11584 107576 129284 80373 46255 49838 -30685 -77047 -40514 55722 -29398 -161616 -121414
15058a21414P0685Q239m228k7640N876K5616l9085j0097P2423L9425k3086l5642
15046c8928j9809M1170k5183l7068L1499R3p294J2958L8462M8350O1935L7603
15034A43788q0193n0808R413J50N2133k5960K2502R2747p7823k4973l139n9509
15022a672M6750r722j5343n3097L7743K1822j07547j12282J4117P8498O6841K2122
15010a1770k7961K2462M1824L5161p1721k0616L7381Q1187Q0088j0713p5822k2159
14998E7341n7584n0956o0519k7997j4359L865J08337R2940K6258J9117r1846p4572
14986f9975L9334R724J6018K9990K1089K4848J1907k9659k3319Q5703L3315M8759
14974A97734q8405q6484o045j756J266M8010j17882r7800L8142P8440J6037q4482
$$ plain form
15058 -121414 -50729 -42490 -46718 -74358 -68482 -42866 -81951 -92048 -19625 19800 -3286 -38928
15046 -38928 -58737 -17567 -42750 -79818 -48319 -48226 -55520 -42562 -4100 44250 106185 143788
15034 143788 63595 12787 22200 22350 74483 48523 71025 163772 85949 60976 57837 -1672
15022 -1672 45078 35356 20013 -33084 4659 26481 -81066 -193348 -179231 -100733 -33892 -11770
15010 -11770 -39731 -17269 24555 59716 -12005 -32621 4760 85947 166035 155322 79500 57341
14998 57341 -243 -51199 -111718 -139715 -154074 -150209 -41872 51068 77326 96443 4597 -69975
14986 -69975 -30641 -20917 -4899 25091 46180 71028 82935 53276 29957 115660 148975 197734
14974 197734 109329 22845 16800 15044 16310 64320 -53562 -151362 -113220 -34780 -18743 -103225
14962a03225m612K2445L9910K6274m258j76120r2931J24255Q6674r5926r4095
14951b71609Q836O5557M7098K9988J22249P5023l4435l9913J9533K6838m6939
14940B226K1775q2353q2065k5499J06403L2077p2895r0527j5429K2421J6299k9563
14928a97130P2507R0072J8241k9155m8660P102k2420j2708K6435O2466J04606
14917G1356n1910m923P291k4855L014M7251j9997l0583r65J7384M4380o1740n1450
14904e5747M0895O7078l6742k7832M7573m1784M5268p809k5966J39515P3009l8208
14892A79250q8166m2788Q4207k8780j1794l5366n8136J1862p961k6521j472j2072
14880c7737j0121Q5860O9296o0269j12177L3829O0736O478p7623p5667p5049p654
$$ plain form
14962 -103225 -107837 -85392 -45482 -19208 -23466 -199586 -292517 -168262 -81588 -177514 -271609
14951 -271609 -262773 -197216 -150118 -120130 2119 77142 42707 2794 22327 49165 2226
14940 2226 24001 -58352 -140417 -165916 -59513 -27436 -100331 -190858 -206287 -183866 -167567 -197130
14928 -197130 -124623 -34551 -16310 -45465 -94125 -87023 -109443 -122151 -95716 -33250 71356
14917 71356 19446 14523 21814 -3041 -27 47224 27227 -3356 -4321 13063 57443 -4297 -55747
14904 -55747 -14852 52226 15484 -12348 35225 -6559 38709 30900 4934 144449 217458 179250
14892 179250 91084 48296 132503 103723 91929 56563 -1573 10289 2328 -24193 -25665 -37737
14880 -37737 -47858 38002 107298 47029 -65148 -31319 29417 35895 -41728 -117395 -192444 -200098
14868b00098L5360O2052J6N0399M4914M5938L5961j62852j9539Q3149j9365o1927
14856a05992j9912K2094M5160O0546k310n6487L7279J20955L1172L2312k6288
14845A38529j12195J449K420l68m3172Q88N1792p4823k2546j8358j1360k7240
14833a14984J7066N8912l0513k1573K1008O3646L0616p2999r6009k2185M1495
14822a25520M0131j219k6738M6154j6508o0048r925M584M7390O1151M9789n4352
14810d5111J9516K5727r8967R374N009l8258j8344L9148k4097R2066J21611r783
14798G7891r1980l8382N3537O58J8301k2925m5630k3226m117K9402k7521j08499
14786a82491K8024J61299K7422p4662m9811K0459M3264k0906n3466n5009K3276
$$ plain form
14868 -200098 -164738 -102686 -102670 -52271 -7357 38581 74542 -88310 -107849 -24700 -44065 -105992
14856 -105992 -125904 -103810 -58650 1896 -414 -56901 -19622 101333 132505 164817 138529
14845 138529 26334 27783 30203 29835 -13337 -12449 39343 -35480 -58026 -76384 -87744 -114984
14833 -114984 -97918 -39006 -69519 -91092 -70084 -6438 24178 -48821 -144830 -167015 -125520
14822 -125520 -85389 -86608 -113346 -67192 -83700 -143748 -153673 -149089 -101699 -40548 9241 -45111
14810 -45111 -25595 132 -98835 -89461 -84452 -122710 -141054 -101906 -126003 -33937 87674 77891
14798 77891 -14089 -52471 1066 1724 20025 -2900 -48530 -71756 -75873 -46471 -73992 -182491
14786 -182491 -154467 6832 34254 -40408 -90219 -69760 -26496 -47402 -100868 -155877 -132601
14775a32601N0447L3420M1672m5162o4409k7742N883Q515K4441O2396M0682m1378
14763d3836K8777o1926P460J703K075j4285M1763J9982k1434j3445r8362K9224
14751a22304O0890L5654J01041J4677k6071o627P849k0980n6374L4141o506l6325
14739b0935q30L4138l4364m6245p337L6751K7968k1461M255k0740j381K6809j7738
14726d1110L0329o791L237J10510m7699n0974j7983J051R5929M5826n3832j08566
14714d0073J4483J8331j2250m4434p6500M2149J33694j9209O7308k9182l1425
14703B2892m5461n2488J092J5440L120J10119M554n4046l8001n9058n2221L4940
14691a09118O6735J7749r2073L640N2537J2052q261l8956j0224o781J9476N656
$$ plain form
14775 -132601 -82154 -48734 -7062 -52224 -116633 -144375 -138492 -129977 -105536 -43140 -2458 -43836
14763 -43836 -15059 -76985 -69525 -67822 -65747 -80032 -38269 -18287 -39721 -53166 -151528 -122304
14751 -122304 -61414 -25760 75281 89958 63887 57260 65109 44129 -12245 21896 15390 -20935
14739 -20935 -21765 12373 -21991 -68236 -75573 -38822 -10854 -32315 -28060 -48800 -50181 -23372 -41110
14726 -41110 -10781 -17572 -14335 96175 48476 -2498 -20481 -19430 76499 122325 68493 -40073
14714 -40073 -25590 -7259 -19509 -63943 -140443 -98294 35400 16191 83499 54317 22892
14703 22892 -22569 -75057 -73965 -58525 -55405 54714 59268 5222 -32779 -91837 -144058 -109118
14691 -109118 -42383 -24634 -116707 -113067 -60530 -48478 -56739 -95695 -105919 -112700 -93224 -87568
14679h7568l2412p3324j5349Q1202J999Q3409P2645o7033q7542l7285p551l0038
14667a98847M4264N0950P9797J27j0843m3980m0071p3950k694P3348j0799R9725
14655c2973O1787p6619j25133l2811J6522O722Q6834K3971R127r976n2681J203
14643a24027N1895j8101J08702M5190M551k5637k2814j9670L5074M9958J3534
14632I8655r639j03742n8468J6227j8765N1393l0341k669n180j17896R628N7705
14620a13092K7433o51n0356n335J2077L4971r27j5691R6544N1700j4964M0160
14608F1869J3058k6148M4784N3526k714l2799j41825k1381p876Q449j0758L08
14596f1507o2850k7198N2934P4987K8011Q3527m2584l0756r1891L7533R46q5289
$$ plain form
14679 -87568 -119980 -193304 -208653 -127451 -125452 -42043 30602 -36431 -123973 -161258 -168809 -198847
14667 -198847 -154583 -103633 -23836 -23709 -34552 -78532 -118603 -192553 -195247 -121899 -132698 -32973
14655 -32973 28814 -47805 -172938 -205749 -189227 -182505 -95671 -71700 -62573 -72549 -125230 -124027
14643 -124027 -72132 -90233 18469 63659 68210 42573 19759 89 35163 85121 98655
14632 98655 89016 -14726 -73194 -56967 -75732 -24339 -54680 -57349 -62529 -180425 -170797 -113092
14620 -113092 -85659 -86310 -136666 -142001 -129924 -94953 -95880 -111571 -15027 36673 21709 61869
14608 61869 74927 48779 93563 147089 144375 111576 -30249 -51630 -59506 -51057 -61815 -61507
14596 -61507 -124357 -151555 -98621 -23634 4377 87904 45320 14564 -77327 -39794 -38848 -124137
14584a24137m4424K566J182L16J7211Q1594J1623j6492J8110L0658P8377J5609
14572G2193o9901J4973Q072O5866L207o115O110q6710o2306J19437j8522o4520
14560a8216m3706J8234L2699k9618K508j6483N7782N0985R3947J4507j45472M116
14548B1283M2992m5642k1389j1164l2144P6042n2482j6847l6978k8610R1716k5786
14536c9009J4017L359j2955N9968J0252L3282l7035o4057r4838p1054K0204P65
14524a77101r784K2951N9386O1705K2671K8937M7866j8191n2639r7131l7234L4690
14512a13874n583l0963N1590R1327M161J3652J2840r954J6129P6313L776p4208
14500C5206p4788r2934J1392Q4809J13781M78o9164o0129K9500M8660j5297n9851
$$ plain form
14584 -124137 -168561 -165995 -164813 -164497 -147286 -65692 -54069 -70561 -52451 -21793 56584 72193
14572 72193 2292 17265 25337 91203 94410 88295 94405 7695 -54611 64826 46304 -18216
14560 -18216 -61922 -43688 -10989 -40607 -38099 -54582 3200 54185 148132 162639 17167 21283
14548 21283 64275 18633 -2756 -13920 -46064 29978 -22504 -39351 -76329 -104939 -13223 -39009
14536 -39009 -24992 -21633 -34588 25380 35632 68914 31879 -32178 -127016 -198070 -177866 -177101
14524 -177101 -186885 -163934 -104548 -42843 -20172 8765 56631 38440 -14199 -111330 -148564 -113874
14512 -113874 -119457 -150420 -98830 -7503 -3342 10310 23150 13196 29325 105638 109414 35206
14500 35206 -39582 -132516 -121124 -36315 77466 77944 8780 -51349 -21849 26811 11514 -48337
14488d8337J7501J6560k5063N1564o2279r9933j7158O9358O3359L2167R2705K112
14476I2556k0869k2329n3567j5049K4976J129l9992l0971M355J999m8669L2018
14464g4413J04539J1944o5917n567N0692N2331M5829j5393n9079k8229L8415M9389
14452A04541n7741N342l4344j0779j6615l147J0273p512m0360L6902L4777l6900
14440a5563l0410l0160K261O7555n8205l10M55Q1403o2415P2507l036n1811o713
14427c4442M2254j6821q310k3821m5018m6102L0600J5162j999O9919R4074K5997
14415A01493j41716j8140N4164J5506R2651l5078m2155M9908K7688m4180K8606
14404H8747q407n3277l4123n3235j2524n8537l4534k8393k9822r8J5729Q9848
$$ plain form
14488 -48337 -30836 -14276 -39339 12225 -50054 -149987 -167145 -97787 -34428 -2261 90444 92556
14476 92556 71687 49358 -4209 -19258 5718 6847 -33145 -64116 -59761 -57762 -106431 -74413
14464 -74413 30126 42070 -23847 -29414 21278 73609 119438 104045 44966 16737 55152 104541
14452 104541 46800 52142 17798 7019 -9596 -12743 -2470 -9982 -50342 -13440 21337 -15563
14440 -15563 -45973 -76133 -73872 -6317 -64522 -64832 -64377 17026 -45389 27118 24082 -27729 -34442
14427 -34442 7812 -9009 -17319 -41140 -86158 -132260 -101660 -86498 -88497 -18578 75496 101493
14415 101493 -40223 -58363 -4199 11307 103958 68880 26725 76633 104321 60141 88747
14404 88747 80340 27063 -7060 -60295 -72819 -131356 -165890 -194283 -224105 -224203 -208474 -118626
14392a18626q029j7014M975J9921M9946M0748K236Q291O3586Q7927Q764l5277
14380A07448L3042K1384k2362p0783q4343k2090L6097K5486l0236k9201j1180
14369d6738L9866O9907K8729m5118j28451K080M0488j8129q2249L6263P1722L1725
14357I5K6759K7115k6263J8009l9953l3680M432j1726j08015L028k7427j613J19480
14344d9759K5641n289o0137l7027N6653M7865J8086l9895R196J9874J0917j6583
14332b0458l9085l9091M6958O3574J5439L2015M3624j6123p3924K666L582M7004
14320F6181j1587Q0917R8066r3812j49154L8815O920K0229q2991k1747K3683j9984
14308d4464m2158j5517J4722N5553L7404j10163K238J16396L1910O654P1319l1228
$$ plain form
14392 -118626 -126655 -143669 -138694 -118773 -68827 -28079 -25843 -17552 46034 133961 142725 107448
14380 107448 140490 161874 139512 68729 -15614 -37704 -1607 23879 -6357 -35558 -46738
14369 -46738 -6872 63035 91764 46646 -81805 -79725 -39237 -57366 -139615 -103352 -31630 95
14357 95 26854 53969 27706 45715 5762 -27918 -23486 -35212 -143227 -140199 -167626 -169239 -49759
14344 -49759 -24118 -29407 -89544 -126571 -69918 -22053 -3967 -43862 -34666 -14792 -3875 -20458
14332 -20458 -59543 -98634 -51676 11898 27337 59352 102976 86853 12929 15595 19177 66181
14320 66181 54594 135511 233577 139765 -9389 29426 36346 56575 -26416 -48163 -24480 -44464
14308 -44464 -86622 -102139 -87417 -31864 5540 -104623 -102385 14011 45921 52575 123894 92666
14296I2666q2020k0605m4837j4179K7946O0899M8128j7410k0113J095k7488J0958
14284A5040R7873J356j32478m3890P6209J08798M760r1606n1698p5893O6087J25418
14272I9976K6287p4342k302P4446J16562l3213j20285j19365J1681M5375K8818
14261E3638J0982j2374l396q2109j9655j5187N1780J3259N6875l1695n9402l6674
14249g3958l6552k169J6585O3108R0741L2091k5361q5429P4100P0589J3624j1853
14237A25516Q017j8286j14370l8544J5366Q2953O5463o1404M165Q2965N792q0721
14225G6912n3042l9253j2147J22581K8588r4854j01713P4361P2672m6232L4270
14214F2143n5264k4121j9782M9593k3286o1755m427l4613J0265J14678k8019n4258
$$ plain form
14296 92666 10646 -9959 -54796 -68975 -41029 19870 67998 50588 30475 31570 4082 15040
14284 15040 112913 114269 -18209 -62099 14110 122908 127668 36062 -15636 -91529 -25442 99976
14272 99976 126263 51921 49619 124065 240627 207414 87129 -32236 -20555 24820 53638
14261 53638 64620 52246 48850 -33259 -52914 -68101 -16321 -3062 53813 22118 -37284 -73958
14249 -73958 -110510 -112679 -96094 -32986 57755 89846 64485 -20944 53156 123745 137369 125516
14237 125516 133533 115247 877 -37667 -22301 60652 126115 64711 68876 151841 157633 76912
14225 76912 23870 -15383 -27530 95051 123639 28785 -72928 1433 74105 27873 62143
14214 62143 6879 -17242 -37024 12569 -10717 -72472 -76899 -111512 -101247 13431 -14588 -68846
14202f8846K1831K2706o1463o0781J2248J3028P8868J34670L0198o6426p1260
14191a5227j0092l2k6735j11846K986M2607O1503L8705j7564k638J9288N3622
14179C4577l0167m8085L1734o9974k9247k1582k2634P001J10911k0678j03253
14168a61397j7689L4903R0519J35644K0265j0459j16885m5342M5815o995k6714
14157e8335N5454N6652n1498J1881L9068M497l3799k6293n8074N391M6881Q4828
14145G6653M0065l5276p2645j3921J1580j01932j2950j1036O5793J2239k0943
14134f2373K7636K5685O6821O1129m0727j8607k4712q2157n8608Q2824J20768
14123I7679J00636p0989p0018N442q9747m2274J388k0826K0193K2696Q3467J0551
$$ plain form
14202 -68846 -47015 -24309 -85772 -146553 -134305 -121277 -42409 92261 122459 56033 -15227
14191 -15227 -25319 -25351 -52086 -163932 -160946 -118339 -56836 -18131 -35695 -38333 -19045 34577
14179 34577 4410 -43675 -11941 -81915 -111162 -132744 -155378 -148377 -37466 -58144 -161397
14168 -161397 -179086 -144183 -53664 81980 102245 91786 -25099 -70441 -24626 -31621 -58335
14157 -58335 -2881 53771 2273 14154 53222 57719 23920 -2373 -60447 -55056 -8175 76653
14145 76653 116718 81442 8797 -5124 6456 -95476 -108426 -119462 -53669 -41430 -62373
14134 -62373 -34737 -9052 57769 118898 78171 59564 34852 -47305 -105913 -23089 97679
14123 97679 198315 127326 57308 62750 -26997 -69271 -67883 -88709 -68516 -45820 37647 48198
14111D8198n3470K6837J899k1243j2948k2992R2968m3996m3094j6554k1714k7944
14099i4053k0180K9942P7377N7979M4359P082j290L6132m7287p9843k6895O8962
14087E2285K865n3845M2742j6198M836M9900K1179n4500r341O3637M4512n5897
14075I2175j3525J814n5780q0118O4732Q2387n2443r417m8937j9321p2990Q6928
14063b4495L4906p8229k0772J07230n8768j8422J4444k957K8816j679p2133J408
14051i0651L5503J2504M755L1328M3774p2935m9096N0359J57237O1372l0942l6391
14039A16817o6353n1217J7992L9629N312m5866j7565O3061L484m0196k1143K1451
14027B5406j4812M3387P0320K9537n5169q6214m4653P6277Q4465J3325l9459o6945
$$ plain form
14111 48198 -5272 21565 23464 2221 -10727 -33719 59249 15253 -27841 -44395 -66109 -94053
14099 -94053 -114233 -84291 -6914 51065 95424 102506 101216 137348 90061 10218 -16677 52285
14087 52285 55150 1305 44047 27849 32685 82585 103764 49264 39923 103560 148072 92175
14075 92175 78650 80464 24684 -55434 9298 91685 39242 29825 -19112 -38433 -111423 -24495
14063 -24495 10411 -67818 -88590 18640 -40128 -58550 -44106 -47063 -18247 -19926 -92059 -90651
14051 -90651 -55148 -42644 -37889 -6561 37213 -35722 -84818 -34459 122778 184150 153208 116817
14039 116817 50464 -753 17239 56868 62180 16314 -1251 61810 65294 25098 3955 25406
14027 25406 10594 53981 124301 153838 98669 12455 -32198 44079 128544 141869 102410 35465
14015C5465j2871J4277p499J2718q4501q9114M5800k582o9461J4067p644R2907
14003e8438L6506j9084k4615l1908n6565K8909R1039J10253k6086n0830K2434
13992B1615l9635n7662m1549Q6607M0225l8764m1080L4448M0145j4503m2075j0397
13980f2625n8258j3055N0694O8462Q017j2584o7834n087L6998N0678O1129K5778
13968H2313L1487M1935J2553j2692k1714n9569j10983Q269N2411n160J1314R3896
13956A24060Q8J5252M576p3114j2367r3164o550N3767L2135P6671j5995q8617
13944A6742l2462N2030N4156Q528k5517k9251M1769l8317l2131M8733J3507M323
13932H2110o3323l0498Q0707j4826q5741K3921P2372P3876k3531o678O1150l3058
$$ plain form
14015 35465 22594 36871 29372 42090 -42411 -131525 -85725 -88307 -157768 -143701 -151345 -58438
14003 -58438 -21932 -41016 -65631 -97539 -154104 -125195 -34156 76097 50011 -819 21615
13992 21615 -18020 -75682 -117231 -30624 9601 -29163 -70243 -35795 4350 -10153 -52228 -62625
13980 -62625 -120883 -133938 -83244 -14782 -6765 -19349 -87183 -92270 -55272 -4594 56535 82313
13968 82313 113800 155735 168288 155596 133882 74313 -36670 -28401 24010 18850 30164 124060
13956 124060 124148 139400 143976 70862 58495 -34669 -41219 12548 44683 121354 105359 16742
13944 16742 -15720 36310 90466 98994 73477 44226 85995 47678 15547 64280 77787 82110
13932 82110 18787 -11711 68996 54170 -31571 -7650 64722 138598 115067 108389 169539 136481
13920A36481o2141n2109r314R505q148M511J0634M5966K2465J5271j0186K3806
13908A26741o7671j09343q3072J7108N1994Q9296l1878k8738J1661L5416r7178
13897h5664K5389J58938J5431j8760l6845n3082l0456m4931j03532P5968J40413
13886D2869N1927j3764k2225k374j1381q7057J1240R3540j10201o9672M1402O3951
13874a1745O4410Q7884k3220p6704o1562o3233J3126J1484j3444O051O9049N1505
13862E3601L6220j0057p0726N7775j442m44k9881n6914N7029m0773n0879J12858
13850E6367P4006p577n0609j196j8983j848j1113j7906l0627m5925m0514J7037
13838g8888o395L2887M0963j0499m3671M5470J9614L4048n1689q8916L2413M7948
$$ plain form
13920 136481 74340 22231 12917 22422 14274 18785 29419 75385 97850 113121 102935 126741
13908 126741 59070 -50273 -133345 -116237 -64243 25053 -6825 -35563 -23902 11514 -85664
13897 -85664 -60275 98663 114094 95334 58489 5407 -25049 -69980 -173512 -97544 42869
13886 42869 94796 81032 58807 56433 45052 -42005 -30765 62775 -47426 -117098 -75696 -11745
13874 -11745 52665 140549 117329 40625 -20937 -84170 -71044 -59560 -73004 -66953 2096 53601
13862 53601 89821 79764 9038 66813 65371 64927 35046 -21868 35161 -5612 -56491 56367
13850 56367 130373 122796 72187 70991 52008 50160 39047 21141 -9486 -55411 -95925 -78888
13838 -78888 -85283 -52396 -11433 -21932 -65603 -20133 -519 33529 -18160 -107076 -74663 -26715
13826b6715l683m4124Q3029O7455M10M0035p547o8930L206m3862l5644K0917r7432
13813a12885k5485O5511p5935n7019p746O6937J15304J24520k8128N215k4073
13802D6216q2919l2350P547K3516L1515P7522N4391L9531j02274p8276N1689m3114
13790g006m7031k1918N2413L3258O5775M8888p2332N807Q554m8814o190N5434
13778F6838P7440P4170r7101n9554q5909j5905J15959J1329k1196K4869k4786
13767F6154j09485n8994L1529n712m9787l2155J08248J3714k7139K4621K2836
13756a6170L0028j01789J8893L7431M6221L8193K8361l6224j3325R531j06232
13745f5082j2157K8281J0460n9671L7699N420J06349N3920k6006k4623o1842k5789
$$ plain form
13826 -26715 -30398 -74522 8507 75962 76372 116407 108860 39930 43136 -726 -36370 -15453 -112885
13813 -112885 -138370 -72859 -148794 -205813 -213559 -146622 -31318 93202 65074 70289 46216
13802 46216 -36703 -69053 -61506 -37990 -6475 71047 125438 164969 62695 -15581 36108 -7006
13790 -7006 -54037 -75955 -23542 9716 75491 124379 52047 57854 66408 17594 11404 66838
13778 66838 144278 218448 121347 61793 -24116 -40021 75938 87267 66071 90940 66154
13767 66154 -43331 -102325 -70796 -76508 -126295 -158450 -50202 -36488 -63627 -39006 -16170
13756 -16170 13858 -87931 -69038 -31607 14614 52807 81168 44944 31619 41150 -65082
13745 -65082 -77239 -48958 -38498 -98169 -60470 -55050 51299 105219 79213 54590 -7252 -33041
13733c3041O1968R7219O2243L2966j05841o4083j7881n7528m5116K9950M1500
13722B356k8008j1716R53J1860N3541R8706m2580k0956J0131O767r2411o235J19080
13709A01488J4715q8275l7300m0593m6789K7221K2635O6411J37767L9590M4834
13698B41704k280l8504j33868o4570j0894K7369O6575L1299k0343m0609N123J9653
13686H0655k0042m1666p1161m366M2462L4947M562M894J126m1124J3648J8993
13674B2928j4499j5905L3684N5374k6803K9321J8228m5626Q693k5001p444N0613
13662H3563M1491q3477J4358L9014o5330o9068M1654j3182L2947K6957M042j6460
13650C6509m995L4009M1143j5177m4424K5044L0649K0228k964n267m3436q6148
$$ plain form
13733 -33041 28927 126146 188389 221355 115514 51431 33550 -23978 -69094 -39144 2356
13722 2356 -25652 -37368 -36415 -24555 28986 127692 85112 64156 74287 81054 -11357 -17592 101488
13709 101488 116203 27928 -9372 -49965 -96754 -69533 -46898 19513 157280 196870 241704
13698 241704 239424 200920 67052 2482 -8412 18957 85532 116831 96488 55879 61002 80655
13686 80655 60613 18947 -52214 -56580 -14118 20829 25391 30285 31411 -9713 3935 22928
13674 22928 8429 -7476 26208 81582 54779 84100 102328 56702 65395 40394 32950 83563
13662 83563 125054 41577 55935 94949 29619 -39449 2205 -10977 21970 48927 52969 36509
13650 36509 31514 65523 106666 91489 47065 72109 102758 122986 120022 114755 71319 -14829
13638a4829p581l4607j1724R774N75l4293j4336M2275R8447O5058m3609r9316
13626d4166m6460K583N0915J08458L3200j2534M3712J5425l3630j2781P981q4191
13614B8512q3625o6528N5716P0941M2275K7997l5909j6976L943K4636J802N5274
13602A08058J0497m889n1072O8130J13464m6401n286m9403j8955j09087J5016
13591C0072P8152m7664J6753j6242L7037L485K9250K3371j7296Q880l8577m866
13579A02355L4509j2433j11901p878N2534m4579N7017L781j72584j2449P8172
13568c3456R4156J17508k6067k9151R243l0655j24575J8562M7818P7748J6451
13557A37582r4073J9389r9262n7800q3687J9587J30865J06229j1752j28028j03658
$$ plain form
13638 -14829 -22410 -57017 -68741 -58967 -58392 -92685 -107021 -64746 33701 98759 55150 -44166
13626 -44166 -90626 -88043 -37128 71330 104530 91996 135708 151133 117503 104722 112703 28512
13614 28512 -55113 -121641 -65925 5016 47291 75288 39379 22403 26346 50982 52784 108058
13602 108058 118555 113666 62594 130724 244188 197787 192501 143098 124143 15056 30072
13591 30072 108224 60560 77313 61071 98108 101593 130843 154214 136918 145798 107221 102355
13579 102355 136864 124431 12530 4652 57186 12607 69624 73405 -99179 -111628 -33456
13568 -33456 60700 178208 152141 122990 132233 101578 -22997 -4435 43383 121131 137582
13557 137582 43509 62898 -36364 -94164 -177851 -158264 -27399 78830 67078 -60950 -164608
13546a64608O0379R3449L9364O4330j8134m7135l8604J6502P8656M7036j9456
13535A11779M8070o5616l32j11746n9694J03073k6993j9285L7621K8491M0104
13524H5472P015L9431M2546n7627m8758K4901M2881q616j33556m2166J4828l1600
13512f5249j5470l0606J5712L9119O2092K2913k8182l0898R4225P631K1372n355
13500H7304L6425K0788n6039k611P520r7173M2827K6213j13828n2826N4770l6353
13488h2983K758N9096K496Q0811J24273p9523n6215P5012P9715n1002j51733o2126
13476e9421N9945J43722J1725l2069K021l4858M178k6821J0905O8600k0592k7374
13464I9961l5110n723m3510P12K0450j234P575N7705k1719m1812L961p728N1261
$$ plain form
13546 -164608 -104229 -10780 28584 92914 74780 27645 -10959 5543 84199 131235 111779
13535 111779 159849 94233 93901 -17845 -77539 25534 -1459 -20744 16877 45368 85472
13524 85472 92487 131918 174464 116837 68079 92980 135861 127245 -6311 -48477 -33649 -65249
13512 -65249 -80719 -111325 -95613 -56494 5598 28511 329 -30569 63656 71287 92659 87304
13500 87304 123729 144517 88478 85867 93387 -3786 39041 65254 -48574 -101400 -46630 -82983
13488 -82983 -80225 -21129 -18633 62178 186451 106928 50713 125725 205440 154438 2705 -59421
13476 -59421 524 144246 155971 123902 125923 91065 95243 68422 79327 147927 127335 99961
13464 99961 64851 59128 15618 16330 36780 35546 43121 100826 79107 37295 41256 33528 84789
13451H4789J1096J4092n9759Q028l7864o7326K9131j6580L4212J8499n8874L2147
13439h409M6617P6035m4510J0206n4678p8284K8981P2699R1100l6215l0847k2647
13427E0048J4029K4762l055N9619l292l6918k2569R2673l5068l0789p9769m9285
13415a9614M309j2316m124n9111J6738j5411k2730J23794O8354K3599o7387J4196
13403E0297M7669M5038P9260j4485j23700P673N3635k5985l7807k1539L4722J3384
13391A08162l0620j019n7938n3808k9328L7233M6608N8402P6017N837l1069j22987
13379E490R545N7122L5462l4587K2495n5616M3886M3886m3171k3013k551K2163
13367H1111j2973O059J4373k805j9810J8800o5188o6755P1066M0440J8169J78
$$ plain form
13451 84789 95885 109977 50218 58246 20382 -46944 -17813 -34393 -181 18318 -40556 -8409
13439 -8409 38208 114243 69733 79939 25261 -53023 -24042 48657 139757 103542 72695 50048
13427 50048 64077 88839 85784 145403 142111 105193 82624 175297 140229 109440 29671 -19614
13415 -19614 -15305 -27621 -31745 -90856 -74118 -89529 -112259 11535 79889 103488 36101 50297
13403 50297 97966 143004 222264 207779 84079 91752 145387 119402 81595 60056 94778 108162
13391 108162 77542 76523 18585 -35223 -64551 -27318 19290 77692 153709 159546 128477 5490
13379 5490 15035 72157 107619 73032 95527 39911 83797 127683 84512 61499 58948 81111
13367 81111 68138 74197 88570 85765 65955 84755 19567 -47188 23878 64318 82487 82665
13355H2665k77Q5561P5522j03498N115k2622p1868M5393R3333k9404L902J4398
13343A78220M9505o3676o6183o1629p3525l7233J5902M7300O9128K6168j0902
13332G3075m9120o1473j5559O5350J8345l1539J4276R6808J8880m6204Q626K3743
13320A15208L8241Q054j5881n1085o4460j013L3488o034L1083K0209J0433L6589
13308A54832o4609j9504j1466j07969j2717K3934l1236n2780N4384Q0616N0281
13297F3766l4305k290N8936j7782l0906K3642J3559L3249J8913o9927k1821M4927
13285G9961j0081J5093l6857L175K7509K0717j2848L2445N283M9331k0904l9121
13273A13703j6329R6785p449o9974j9452m8883m9410J8736O2657K6396o6896M1412
$$ plain form
13355 82665 82388 167949 243471 139973 145088 122466 50598 95991 189324 159920 163822 178220
13343 178220 227725 164049 97866 36237 -37288 -74521 -58619 -11319 57809 83977 73075
13332 73075 23955 -37518 -53077 12273 30618 -921 13355 110163 129043 82839 91465 115208
13320 115208 153449 161503 145622 94537 30077 29064 62552 56518 87601 107810 118243 154832
13308 154832 90223 70719 59253 -48716 -61433 -37499 -68735 -121515 -67131 13485 63766
13297 63766 29461 27171 86107 68325 37419 61061 74620 107869 126782 56855 35034 79961
13285 79961 69880 84973 48116 51291 78800 99517 86669 119114 124397 173728 152824 113703
13273 113703 97374 194159 186710 116736 97284 48401 -1009 17727 80384 106780 39884 81296
13261H1296P3921K7728M7552m8958r8199K1348J5857M8107l9055O858k7247K747
13249A11955j473l0925M5636M4325o5956q9425N4630P4866j3868m280l8818k7025
13237E9642L7578K9278l7372m5078O9575N3394l639k6914m561k1693l8802J2122
13225H3530j2725o5272n0628K7537j5722P0266O1035O288K6102J5479n2913R2490
13213A85467M3840o5639j5348r3291k1615K0521Q9808R0480k1005j3316Q8172
13202B88074M0626J8029p7908j8598K2237m522k4915j4695K5184M951Q8688o074
13190C41077K9381O6820J46736J47968J11713L3984K21402K93243L56781J87238
13180A936343Q1034M1914k9190k8418j60811k69046k35111k20682j37743j45469
$$ plain form
13261 81296 155217 182945 230497 181539 83340 104688 120545 168652 129597 136455 109208 111955
13249 111955 110482 79557 125193 169518 103562 14137 68767 143633 129765 125485 86667 59642
13237 59642 97220 126498 89126 44048 113623 167017 163378 136464 131903 110210 71408 83530
13225 83530 70805 5533 -45095 -17558 -33280 36986 98021 104309 130411 145890 92977 185467
13213 185467 229307 163668 148320 55029 33414 53935 143743 234223 213218 199902 288074
13202 288074 328700 346729 268821 250223 272460 267938 243023 228328 253512 258463 347151 341077
13190 341077 370458 437278 584014 731982 843695 877679 1099081 1392324 1749105 1936343
13180 1936343 2017377 2059291 2030101 2001683 1840872 1571826 1336715 1116033 978290 832821
13170H32821j29733r7534k8540O804m4226l4552k6856l6885k1956J2487K8277
13159D60107J9812N5709M1561k4695p9201k6621p2719j5748L7012m6091k4400
13148C24726R850L607m2122L905P0405N6679p716l4000J7661k2236l1632m965
13136C44162p800m2529J0485R198J2449O980M5004J8801n1554j0772j6884o6413
13124B51127m1073m6358L1762k2958p7460j8108K5986M6865J61409L9346q1516
13113B69022J3784k8802n7172j1P0551O0973L2158Q495q8071K8175L6531J1062
13101C56695j6797J6226K2517j06052o3461L9740P6075p2347K082K7907k7905
13090B54680l7055q1726J4557j4800J63J5292M751O4757O1082n879l2361o0066
$$ plain form
13170 832821 703088 605554 577014 583818 539592 505040 478184 441299 419343 431830 460107
13159 460107 479919 535628 577189 552494 473293 446672 373953 358205 395217 349126 324726
13148 324726 334576 338183 296061 299966 370371 427050 419334 385334 402995 380759 349127 344162
13136 344162 336362 293833 304318 313516 325965 332945 377949 396750 345196 334424 317540 251127
13124 251127 210054 163696 195458 172500 95040 76932 102918 149783 311192 350538 269022
13113 269022 282806 254004 196832 196821 267372 328345 360503 368998 280927 309102 345633 356695
13101 356695 339898 356124 378641 272589 209128 248868 324943 252596 254678 282585 254680
13090 254680 217625 135899 150456 135656 135819 151111 155862 220619 281701 275822 243461 183395
13078A83395K0005M6218m4165k0394L3546j893L3692N1609l246J4949J0964M8026
13066C72706M9349M5530n1965n9017q155p577m4627Q5573K8413o4234j25946k711
13054B17339J08996O2244j1656n8586q5454n5429N4758m8303l7512P2810Q6068
13043C05275m949k9678j7828m2783J6704M6521R687J8354K0063n8094K8855k653
13031B89474L7457R2105L9303L443j5720J67737J93869L0166M3920j8363k0149
13020H43242j27795k7439j22576j24118l6545j16408j03762R0257L2323p2938
13010B34241O7457Q3600m352m3410J3830j8406p2972L0974O2705l8609j23357
12999A91701K1573J35659M1500m910n089N5371m6900p2526r602M1029R7758O5095
$$ plain form
13078 183395 203400 249618 205453 185059 218605 216712 250404 302013 298767 313716 324680 372706
13066 372706 422055 467585 415620 356603 348448 340871 296244 381817 410230 345996 220050 217339
13054 217339 326335 388579 376923 318337 232883 177454 232212 183909 146397 219207 305275
13043 305275 300326 270648 252820 210037 226741 273262 282949 301303 321366 263272 292127 289474
13031 289474 326931 419036 458339 461782 446062 613799 807668 837834 881754 863391 843242
13020 843242 715447 688008 565432 441314 404769 288361 184599 274856 307179 234241
13010 234241 301698 385298 380946 337536 351366 332960 259988 290962 353667 315058 191701
12999 191701 213274 348933 390433 385523 380434 435805 388905 316379 306777 347806 445564 510659
12987E10659P2348L1294o5595p9268M244J01539R9717J28106J00412P7933J6303
12976I97692L6311J0254N2250j63624k72333j35504o3347J9970Q7571j22038j2272
12965D34930N8652o2816m536K8943o530o6034k2229n0615P7334P2055j3927q011
12953D37216K2765j5222j5377j6744L6369K3114q591o9262l0485j6269L2260K1228
12941D01002p568j3055J4665M9297N4318L6527Q5940L4680j0176J86N463l4866
12929F16413m0779n8329j736n1503j6474N3747l5955k8081l2680m3967K7498O7704
12917D55858M0858M2963L1810k2342L9323j6405m9950o3759n3623o0656r9112
12906B44965J6443J03j1341M5152L8021M3783P4151o2492j8713k1357n9164K6779
$$ plain form
12987 510659 583007 614301 548706 469438 473682 575221 674938 803044 903456 981389 997692
12976 997692 1034003 1044257 1096507 932883 660550 525046 461699 481669 569240 447202 434930
12965 434930 493582 430766 426230 455173 448643 382609 360380 309765 387099 459154 445227 437216
12953 437216 459981 444759 429382 412638 449007 472121 463530 394268 363783 347514 379774 401002
12941 401002 393434 380379 395044 444341 498659 535186 621126 655806 645630 645816 651279 616413
12929 616413 575634 517305 515569 464066 447592 501339 465384 437303 404623 360656 388154 455858
12917 455858 496716 539679 571489 549147 588470 572065 522115 458356 404733 344077 244965
12906 244965 261408 261511 250170 295322 333343 377126 451277 388785 370072 348715 289551 316330
12894C16330M2148M9496o0482j4261l3986j3034L5109Q4061J10547o2131p6348
12883C77449N2941Q5081L3060K3118n8593k3365N2267k027n8697o4211M7910Q1375
12871E46308J15508k4394J9496L4412j4970n1721J0799Q9245J31179l9089K3366
12860H40139K3260O1156J60573J88660J73870K99408L78091L57275M40604O05354
12850C528390N34869L98533J04011l71001n46689n65194n54060l55409j95896
12841A977554j32983j50370m4170l9164o3908m4716r192m8797o300m3448K7103
12830A421609O3005P3189l3626p2250N7838O030j0863M9044N9273M4710l1393
12819A626566l4460l9362J5638M3806J3071L6731M9081O395K5839K1862n4276
$$ plain form
12894 316330 358478 407974 347492 333231 299245 286211 321320 405381 515928 453797 377449
12883 377449 430390 515471 548531 571649 513056 489691 541958 539931 481234 417023 464933 546308
12871 546308 661816 637422 656918 691330 676360 624639 635438 724683 855862 816773 840139
12860 840139 863399 924555 1085128 1273788 1447658 1747066 2125157 2482432 2923036 3528390
12850 3528390 4063259 4461792 4565803 4194802 3648113 3082919 2528859 2173450 1977554
12841 1977554 1844571 1694201 1650031 1610867 1546959 1502243 1493051 1444254 1437954 1394506 1421609
12830 1421609 1484614 1557803 1524177 1451927 1509765 1515795 1504932 1553976 1613249 1657959 1626566
12819 1626566 1592106 1552744 1568382 1612188 1625259 1661990 1711071 1717466 1743305 1765167 1710891
12808A710891j3835Q6580J02509l6343n5164L2339L3854N2126P9204n8578p1923
12797A861660o260n7283L942J30154J27347R8287O1078J61214J06340J06717J25642
12786B718838J30206J43440L39016L08348J92558J49375K03605K43229J67872
12777D596487K1362q7586j78592j68831q8115L0470l08r729J11987J82333J59679
12766D569157L9434J26280K31614J91628K55532L36367J97239K23438L77745L17085
12756F865519L47599L58791L23469M61412N94958O02360O67111Q26993R02151
12747A1950363J042787J125608J289118J319489J486408J688240J795019K142805
12739B3839837K528492L039014L712707M747361O027119P754820J0243050J4082558
$$ plain form
12808 1710891 1697056 1783636 1886145 1849802 1794638 1826977 1860831 1912957 1992161 1933583 1861660
12797 1861660 1855400 1798117 1802059 1932213 2059560 2157847 2218925 2380139 2486479 2593196 2718838
12786 2718838 2849044 2992484 3331500 3639848 3832406 3981781 4185386 4428615 4596487
12777 4596487 4617849 4530263 4351671 4182840 4094725 4125195 4124887 4115158 4227145 4409478 4569157
12766 4569157 4608591 4734871 4966485 5158113 5413645 5750012 5947251 6170689 6548434 6865519
12756 6865519 7213118 7571909 7895378 8356790 8951748 9554108 10221219 11048212 11950363
12747 11950363 12993150 14118758 15407876 16727365 18213773 19902013 21697032 23839837
12739 23839837 26368329 29407343 33120050 37867411 43894530 51649350 61892400 75974958
12731G5974958J9809112K8404998L9467825N0455046N4715359M7075004L2548788
12724C48451090K1415277J4554416K714635k1179886m8293859o0366351n3747185
12717B03548137m0106743k8202806j9900682j4462844j0864296q388287o619639
12710G5002840n512633m690438m195077l700219l343949k925837k460565j873483
12702D6300639j292274q78455l87744m3271J83018K66368J66393J18450P2404
12693D4505528J21053O0836j32734l62408n79106o01885p21944j053981j573006
12684C9662353k086078k526102k674396k571657k266876j925489j574136j396702
12676B2640917j332504r32557q12345q73400p33180o09810n24142n69990m88063
$$ plain form
12731 75974958 95784070 124189068 163656893 214111939 268827298 315902302 348451090
12724 348451090 369866367 384420783 387135418 365955532 317661673 257295322 203548137
12717 203548137 163441394 135238588 115337906 100875062 90010766 81622479 75002840
12710 75002840 69490207 64799769 60604692 56904473 53560524 50634687 48174122 46300639
12702 46300639 45008365 44129910 43742166 43698895 43881913 44148281 44314674 44433124 44505528
12693 44505528 44626581 44687417 44554683 44192275 43613169 43011284 42289340 41235359 39662353
12684 39662353 37576275 35050173 32375777 29804120 27537244 25611755 24037619 22640917
12676 22640917 21308413 20375856 19563511 18690111 17956931 17347121 16822979 16252989 15764926
12667A5764926n09300n12794m52025l96956l81323l97007m07522l30147l25477
12658A2052375j99601k64659l16808k82637k42932k95379k08669k27806k41257
12649I772627j85287j98448j85926k01878j54685j56767j69618j45061r5147q2797
12639H197013q4519j32159k29552j57476j61286j91875j76593r6726j83847k19009
12629F563971j16942j21399o5216k5889j05056j31793q7325k4544P391j1866o8955
12618E812377p3067j05789m0583M6935n3625o3898o6258j6558o6333K7661R7298
12607E498160Q2120P5572J45768K65637L30248M22384O54793Q61030Q66865P87897
12597I990474O12409M31627K70334k09783o45932r64037j048984q25848o71211
$$ plain form
12667 15764926 15255626 14742832 14290807 13893851 13512528 13115521 12707999 12377852 12052375
12658 12052375 11852774 11588115 11271307 10988670 10745738 10450359 10241690 10013884 9772627
12649 9772627 9587340 9388892 9202966 9001088 8846403 8689636 8520018 8374957 8279810 8197013
12639 8197013 8112494 7980335 7750783 7593307 7432021 7240146 7063553 6966827 6782980 6563971
12629 6563971 6447029 6325630 6260414 6234525 6129469 5997676 5910351 5885807 5893198 5881332 5812377
12618 5812377 5739310 5633521 5592938 5639873 5586248 5522350 5456092 5439534 5373201 5400862 5498160
12607 5498160 5580280 5655852 5801620 6067257 6397505 6819889 7474682 8335712 9202577 9990474
12597 9990474 10602883 11034510 11304844 11095061 10449129 9485092 8436108 7610260 6939049
12588F939049l94812k61072k52609k08141k86532k87952k25417k20672k00097
12579D601745p0830j07242o8444r1353j32993m5956n1503j06364j59101p5444
12569C692515j16648j68958j88355j12778r9350m457M5746N7281q8296n9597o3832
12558B893271o7475j9992j16306p0044j4723j10196p0193p2039p8851L5549P1470
12547B380471n1955l5736K0915k6711o8144N2160o7934o3406l4657M738k377J441
12535B108805j2532q2521j28811j51375o439Q9499K2161p0973q1471m8331j8778
12524A619234n801K8657o0766j13151l9636J1887L2438m4608p4539L1142l9653
12513A345204p9009m6293j102m831m7477m3637R1589M029Q446k8968k7145N3715
$$ plain form
12588 6939049 6544237 6283165 6030556 5822415 5535883 5247931 5022514 4801842 4601745
12579 4601745 4530915 4423673 4355229 4263876 4130883 4084927 4033424 3927060 3767959 3692515
12569 3692515 3575867 3406909 3218554 3105776 3006426 3001969 3047715 3104996 3016700 2957103 2893271
12558 2893271 2825796 2805804 2689498 2619454 2604731 2494535 2424342 2352303 2273452 2309001 2380471
12547 2380471 2328516 2292780 2313695 2286984 2218840 2271000 2203066 2139660 2105003 2109741 2107364 2108805
12535 2108805 2096273 2013752 1884941 1733566 1727127 1816626 1838787 1767814 1686343 1638012 1619234
12524 1619234 1613433 1642090 1581324 1468173 1428537 1440424 1472862 1428254 1353715 1384857 1345204
12513 1345204 1266195 1219902 1218800 1213969 1166492 1122855 1214444 1218473 1226919 1197951 1170806 1224521
12501A224521j4054j4568o4497p378l4422N5645J2100k4633j4655l4970o3020
12490A020069k7584M6256k1011J10539J10934m8165j58015j3373R451L0915L8549
12479A098565k8539j5888j7387p4160j1160K0835o1176J3660J0696k5253L720
12468I13913k226O5720m9305l7311p593o4055r5703P186R7921L1799K0217M1224
12456I21787n0152m2508m6803p4519o0306p2624M1243P8471J7821n3521j643j0554
12444F46692J6008o346N9242q57j05438J7581P6427O5938Q453o5485J9762n1770
12432F80207r2952k6128l9532m1259K029J33249L0105p9882K8220j5600n1424
12421E27033P3661N6756p2646j31985q1619l2343Q787o3168p713P2453K8949P695
$$ plain form
12501 1224521 1210467 1195899 1131402 1124024 1089602 1145247 1157347 1132714 1118059 1083089 1020069
12490 1020069 992485 1038741 1017730 1128269 1239203 1191038 1033023 1019650 1029101 1060016 1098565
12479 1098565 1070026 1054138 1036751 962591 951431 972266 911090 924750 935446 910193 913913
12468 913913 911687 977407 928102 890791 883198 819143 723440 730626 828547 860346 880563 921787
12456 921787 871635 829127 782324 707805 647499 574875 616118 694589 712410 658889 657246 646692
12444 646692 662700 656354 715596 714739 609301 626882 703309 769247 777700 712215 731977 680207
12432 680207 587255 561127 521595 480336 482365 615614 645719 565837 594057 578457 527033
12421 527033 600694 657450 584804 452819 371200 338857 347644 284476 276763 349216 378165 385860
12409C85860M7800k1128K5652K9699j2465J10440R9673o2608Q450k30j16148k9050
12397D65945j5250p4478K2352R0114J2831J232k7994j7736L7262J5798M3248P913
12385E61237J2240m8227l3218l2812N3290P9245j1334O3137o5945m0768N0351
12374E87196k6128J6286N6497p0538q33J15808R4694N5750Q4299Q2522M3297P4963
12362A113813Q4671L5816r9735j12067j00346o4948j15904n872L8549N141J9388
12351G98506M8309K6435N1884j6165J9014J12853K031q7519m0157N7414R8204
12340A070809M0667J5035m1848J8592J19051l7978r9611J4712O8951L7489L95
12329A206264R3788N5001Q0878K35559K44442J78579O9418J8040N9041k4502n5332
$$ plain form
12409 385860 433660 412532 438184 467883 455418 565858 665531 602923 611373 611143 494995 465945
12397 465945 450695 376217 398569 488683 501514 502746 474752 457016 494278 510076 553324 561237
12385 561237 573477 525250 492032 459220 512510 591755 580421 643558 577613 536845 587196
12374 587196 561068 577354 633851 563313 562480 678288 772982 828732 913031 995553 1038850 1113813
12362 1113813 1198484 1234300 1134565 1022498 922152 857204 741300 735428 773977 779118 798506
12351 798506 846815 873250 925134 908969 927983 1040836 1042867 955348 915191 972605 1070809
12340 1070809 1111476 1126511 1084663 1103255 1222306 1184328 1084717 1099429 1168380 1205869 1206264
12329 1206264 1300052 1355053 1435931 1671490 1915932 2094511 2163929 2181969 2241010 2216508 2161176
12318B161176k82281l01550r0548k5612l2527P735J2969K6941N084j02148q9409
12307A289830n2005k1927n6685m5774J0714P403m1610P9998O2164k3898r0630
12296A117580l7871K9481m7325o1518m0588j5019L8868O6141J3430j3532N8087
12285A107734P3070J11278J57394j16799j00993Q5956O7025L9805o4848j86522
12275A173100p8696j13832l7186K6142l2208R4520P8233J31222J82294J57374
12265A580963J49135J95324J88134J24619Q3903J07340N4514j62084j79906k44730
12255A897212l04542k44211p5000n8669j17448q2905p7041n3331l8282L3560k2592
12244H56751M2390M145p1511J3313L9775O631q1372J5616l2270P369M7045m5859
$$ plain form
12318 2161176 1878895 1577345 1486797 1461185 1428658 1436393 1449362 1476303 1481387 1379239 1289830
12307 1289830 1237825 1215898 1159213 1113439 1124153 1131556 1089946 1169944 1232108 1208210 1117580
12296 1117580 1079709 1109190 1061865 1000347 959759 944740 983608 1049749 1063179 1049647 1107734
12285 1107734 1180804 1292082 1449476 1332677 1231684 1317640 1384665 1424470 1359622 1173100
12275 1173100 1094404 980572 943386 969528 937320 1031840 1110073 1241295 1423589 1580963
12265 1580963 1730098 1925422 2113556 2238175 2322078 2429418 2483932 2321848 2141942 1897212
12255 1897212 1592670 1348459 1273459 1214790 1097342 1014437 937396 884065 845783 879343 856751
12244 856751 899141 903286 831775 845088 884863 891494 810122 825738 793468 800837 847882 802023
12232H02023o8912N1227K5147n6448r4903l9091R9036N2432k2978J9517q3174
12221F83876p2531N941J18465R7121R0616p6655j10682j6433n2483n9434L5187
12210F42988p510N601K0493k0373N2634n0202J7229L3497O5533j5324j7002r2739
12198F34825k3035L452k0798L5171M9023N6571q8687n170L8948j0563K1295m9533
12186F41499l6845k2657m6462l6164M3790K17518L95r2550K5079J4254l8429o6966
12174F02462m4062K6408n495p0796n021J08612M9737L7749k0283n0753l5927l3990
12162E58641l0954j3472N7245O4892l3786M0759K3023J5277o139O3222M0528n0778
12150G28458L2418P0035r7915j67645L4279J18094N8606M2230N314K2324o9120
$$ plain form
12232 802023 733111 784338 809485 753037 658134 619043 718079 770511 747533 767050 683876
12221 683876 611345 617286 735751 832872 923488 846833 736151 719718 667235 607801 642988
12210 642988 635478 641079 661572 641199 693833 643631 660860 694357 759890 744566 727564 634825
12198 634825 611790 615242 594444 629615 678638 735209 646522 641352 680300 669737 691032 641499
12186 641499 604654 581997 535535 499371 543161 760679 761074 668524 693603 707857 669428 602462
12174 602462 558400 584808 579313 508517 503496 612108 661845 699594 679311 628558 592631 558641
12162 558641 527687 514215 571460 636352 602566 643325 666348 681625 675486 738708 779236 728458
12150 728458 760876 830911 732996 565351 599630 717724 776330 818560 823874 846198 777078
12139G77078j0529N9406k1054q819m5066j6219l4092o2023j2051N7528K5865L5036
12127G45060L2962J9844n1541O061K5268O0339J0737J4706l8556R090N3184l0360
12115H56794K8036k2407M515J1573l3359o2057P0474J03741N5704J5067k7279
12104A000802k9363j2883m2680N5411J74658k3150p2694j01002L2028J22994J14665
12093A218786M1897l0177q0725L5311O6627N2173P70j06982o1809M4001P3348
12082A253220m9200l7161P203O4070J1375N3638Q3789L5884o342L8020J05569
12071A560065K4384k4409O854R4418P1068j7388o4120j9584P3117J11026k9794
12060A785637K145N4069L4646k7256o599Q075K8969K2508J06761M0340L6475Q4655
$$ plain form
12139 777078 766549 825955 804901 796082 751016 734797 700705 638682 626631 684159 710024 745060
12127 745060 778022 797866 746325 752386 777654 837993 848730 863436 824880 833970 887154 856794
12115 856794 884830 862423 866938 878511 845152 783095 853569 957310 1013014 1028081 1000802
12104 1000802 971439 958556 915876 971287 1145945 1122795 1050101 949099 981127 1104121 1218786
12093 1218786 1260683 1230506 1149781 1185092 1251719 1303892 1304662 1197680 1135871 1179872 1253220
12082 1253220 1204020 1166859 1174062 1238132 1249507 1303145 1386934 1422818 1416476 1454496 1560065
12071 1560065 1584449 1560040 1566894 1661312 1732380 1714992 1650872 1631288 1704405 1815431 1785637
12060 1785637 1787782 1841851 1876497 1849241 1842642 1850717 1879686 1902194 2008955 2049295 2085770 2170425
12048B170425m4818o2579M5241N0705M3663O5236O5765r075M175k7912l4105P4957
12036B341678J34671o6523J7032O2472L6815O9497O5774P9279L5487M362J18337
12025B898881N5965k5836k1435k8157J8847K9831J82296J5080N3926J10143J0893
12014C300434o811J2312o80O7596J40759J16680J64330J08170N5002R2665J26985
12003D177442l0519j25655P4231K23325Q2084N7994Q2259J79042J72447J01858
11993D994508m2121J61909J87626L4425J44256K29739J56936J03801J92679J89600
11983F353358J30758J71052K22237K35915K51471J82580J70981K07242K37335
11974H162929J70986J75080L57485L77802K79989K45629K41339L59990M23021
$$ plain form
12048 2170425 2125607 2063028 2108269 2158974 2202637 2267873 2333638 2324563 2328738 2300826 2266721 2341678
12036 2341678 2476349 2409826 2426858 2489330 2526145 2595642 2661416 2740695 2776182 2780544 2898881
12025 2898881 2954846 2929010 2907575 2879418 2898265 2928096 3110392 3125472 3179398 3289541 3300434
12014 3300434 3293623 3305935 3305255 3372851 3513610 3630290 3794620 3902790 3957792 4050457 4177442
12003 4177442 4146923 4021268 4095499 4318824 4400908 4458902 4541161 4720203 4892650 4994508
11993 4994508 4952387 5114296 5301922 5336347 5480603 5710342 5867278 5971079 6163758 6353358
11983 6353358 6484116 6655168 6877405 7113320 7364791 7547371 7718352 7925594 8162929
11974 8162929 8333915 8508995 8866480 9244282 9524271 9769900 10011239 10371229 10794250
11965A0794250L81266L22872L80405M98561M17701M09193N76701M30062M12748
11956A4623759O35476N71772M85787N80788P36709O30399O54222N86018O01246
11947B0106176O56506P11482P58083O67712P72754P11322P08636P23213P27690
11938B6543574O56029O71164P41857O81513N71969N55499M29286M55475M54274
11929C1760640K49768J61755J81703J44535K865j24083j96893k10532k37752k88384
11919C1443622m77369n94335m39065m77908n98812o50870o00271o47969p06418
11910B6250605o36096n12570n94100p45006p25603o33972n24396m86601n49050
11901B0843211o72195o70583m87510m79610n33598n55913n48954m46724l65089
$$ plain form
11965 10794250 11175516 11498388 11878793 12377354 12795055 13204248 13780949 14211011 14623759
11956 14623759 15259235 15831007 16316794 16897582 17634291 18264690 18918912 19504930 20106176
11947 20106176 20762682 21474164 22232247 22899959 23672713 24384035 25092671 25815884 26543574
11938 26543574 27199603 27870767 28612624 29294137 29866106 30421605 30850891 31306366 31760640
11929 31760640 32010408 32172163 32353866 32498401 32501266 32377183 32180290 31969758 31732006 31443622
11919 31443622 30966253 30371918 29932853 29454945 28856133 28205263 27604992 26957023 26250605
11910 26250605 25614509 25101939 24507839 23762833 23037230 22403258 21878862 21392261 20843211
11901 20843211 20171016 19500433 19012923 18533313 17999715 17443802 16894848 16448124 16083035
11892A6083035m11433m19325m74017m54651l22142l15656l52523l82739l44040
11883A2606509k79094l39670l17174l14999k54247k67701k00841k75561k86474
11874A0070748j99457j61429k35306k84307k44884j95927k10309j94715j69074
11865H175340k39769j29913q9193k27968k08576k23021q9401j6318j02380j39905
11855F708896j18018j18802j82537k01662j38904j47300p7475p7492k39216j15780
11845E291710q035J0938j42283j30736j50879n9144j50191r3443L3067J3894j20513
11834D494385j10312j07971j05619j501p0148j42099n6709O796p9820j03275p6069
11823C647658r5081K3706p157j19472j17379n4883m8880j7189K8147n7374j61500
$$ plain form
11892 16083035 15671602 15252277 14778260 14323609 14001467 13685811 13333288 12950549 12606509
11883 12606509 12327415 11987745 11670571 11355572 11101325 10833624 10632783 10357222 10070748
11874 10070748 9871291 9709862 9474556 9190249 8945365 8749438 8539129 8344414 8175340
11865 8175340 7935571 7805658 7716465 7488497 7279921 7056900 6967499 6951181 6848801 6708896
11855 6708896 6590878 6472076 6289539 6087877 5948973 5801673 5724198 5646706 5407490 5291710
11845 5291710 5283675 5294613 5152330 5021594 4870715 4811571 4661380 4567937 4601004 4614898 4494385
11834 4494385 4384073 4276102 4170483 4168982 4098834 3956735 3900026 3906822 3827002 3723727 3647658
11823 3647658 3552577 3576283 3569126 3449654 3332275 3277392 3228512 3211323 3239470 3182096 3020596
11812C020596j08712K6373K0772j4367k5808k9791N841o8503m7515k4263o2494
11801B692129l1697k0957L6206O4443j03098j5578l3180j202j2809r1215j59355
11790B323687l9659L2090j1162m8108J2842n3856j19389p8396o4641o075m1314
11779A906019K9090P7150K415p8326o7825r046q960n3163n0384N704r432p284
11767A735958j3241j2547J5107n4894n5978J0941o7206l3065k031q761o8845o3358
11755A382080K2486K7834j14030r6757k0705Q177K6719J0900r2127o3361M0489
11744A131705r8204M4647M4967K2958m9803K9976J05p6568k2065M2447L8791j3634
11732A095322l1685Q845K576j0152n3148J4676o2533j1640m4378k3809l01l973
$$ plain form
11812 3020596 2911884 2938257 2959029 2944662 2918854 2889063 2894904 2826401 2778886 2754623 2692129
11801 2692129 2660432 2639475 2675681 2740124 2637026 2621448 2588268 2587066 2574257 2483042 2323687
11790 2323687 2284028 2316118 2304956 2256848 2269690 2215834 2096445 2018049 1953408 1947333 1906019
11779 1906019 1935109 2012259 2014674 1936348 1868523 1859477 1850517 1797354 1746970 1752674 1743242 1735958
11767 1735958 1722717 1710170 1725277 1670383 1614405 1625346 1558140 1525075 1523044 1514283 1445438 1382080
11755 1382080 1404566 1432400 1318370 1221613 1200908 1209085 1235804 1246704 1154577 1091216 1131705
11744 1131705 1033501 1078148 1123115 1146073 1096270 1126246 1126351 1049783 1027718 1070165 1108956 1095322
11732 1095322 1063637 1072482 1075058 1064906 1011758 1026434 963901 952261 907883 884074 883773 879800
11720H79800k559m7424M2516J0486q5928q007K1480m4726M9763j0325q5379q4545
11708F35152l0417J5284L9859M5062m9463m622N5472K7538m1407l7850k6876k5767
11696F01965k7339J9905R790K7719O0551O424q1999o3889L962L0016K2206J8509
11684F27820l4244K7322K5846m1275j14128p2670L0456J00654J4351k6112j1500
11673E26520L9464j18357q3983K2255o7327Q9768M7034k3513M6219j406n6787
11662D19887N7674M630N327J683k7432K4703N0048q7458k7079m7852p7272j5359
11650B81500N8848R9025P4466l3688j08303J6347n1648K6220O9608O1896P7517
11639E71788r5242r3521m7442N6751J06930l7405p9328J2713m5224o9314O784
$$ plain form
11720 879800 877241 829817 872333 882819 796891 788884 810364 765638 815401 805076 719697 635152
11708 635152 604735 620019 659878 704940 655477 650855 706327 733865 692458 654608 627732 601965
11696 601965 574626 594531 604321 632040 692591 699015 617016 553127 557089 587105 609311 627820
11684 627820 593576 620898 646744 605469 491341 418671 449127 549781 564132 538020 526520
11673 526520 565984 447627 363644 385899 318572 408340 455374 431861 478080 476674 419887
11662 419887 477561 482191 487518 489201 461769 486472 536520 449062 421983 374131 296859 281500
11650 281500 340348 439373 513839 480151 371848 388195 336547 362767 432375 494271 571788
11639 571788 476546 383025 335583 392334 499264 461859 382531 395244 350020 280706 287490
11628B87490M5705L4985j8091o5408n8820o2639k4705J16433N0132j3098j5763
11617B76221J9406M7994K643o8860M4033L1274q6105N09L7928O8877J243o1139
11605C14024J9213o3888N6090L210K9132M793o427j06706q9407l7493n907M9920
11593A66554J02615m7075k5158R405J487n0328o0269J6333J8436J3941R6007N3049
11581B94997m660m835j7652m7985k4607M9081M5191j21920m3951K1709K501k7512
11569A20357k8420m2106P2398o8864j831n054P8257Q4494O8467O338j56578j15280
11557A2178M5357L0920j6439N9880K5829J2120m4362L1662k9031L1877K5034L4218
11545B19243n4049M0391Q4840q874K8493p6635q2039k038l8129q5652p2956J2580
$$ plain form
11628 287490 333195 368180 350089 284681 225861 163222 138517 254950 305082 291984 276221
11617 276221 295627 343621 346264 277404 321437 352711 266606 267115 305043 373920 375163 314024
11605 314024 333237 269349 325439 328649 357781 362574 356147 249441 160034 122541 116634 166554
11593 166554 269169 222094 196936 206341 207828 157500 97231 113564 132000 145941 241948 294997
11581 294997 290337 285502 267850 219865 195258 244339 289530 167610 123659 145368 147869 120357
11569 120357 91937 49831 122229 53365 51534 46480 124737 209231 277698 284036 127458 12178
11557 12178 57535 88455 72016 131896 157725 169845 125483 157145 128114 159991 185025 219243
11545 219243 165194 205585 290425 281551 310044 233409 151370 149332 111203 25551 -47405 -34825
11533c4825Q4154n7691Q3999M5498j9515L884O3114k8409j7281k7593n901J3507
11521A02941L7722P340K7107Q4515O9455M799p707O1351p5764l561l6500o5770
11509B05928r9188N6416L7854q9154j4346M3418m4406q27j1178p5342p6801M3046
11497b4580N3512M426m6368j2049J36017J00810j5837n6339L3359K2249m1596
11486A53604J5469k6858m0587j17174o9602Q4134J29082r616n3985Q777Q7984
11475A61228p60k4113O7486N0420j3962p6587J4818P0889o4615q1126j4665K3953
11463A12966k3340J6607O9125K9317m8826o9732p8772K4376p751n2146K118m1016
11451f7074j2146R1773j5418M5244O2664l412n0744m7618J33661L5152k7960j03347
$$ plain form
11533 -34825 49329 -8362 75637 121135 101620 105504 168618 140209 122928 95335 89434 102941
11521 102941 140663 148003 175110 259625 329080 333879 326172 387523 311759 308198 271698 205928
11509 205928 106740 163156 201010 111856 97510 140928 96522 95695 84517 9175 -67626 -24580
11497 -24580 28932 33358 -13010 -25059 110958 211768 195931 139592 172951 195200 153604
11486 153604 169073 142215 101628 -15546 -85148 -1014 128068 118452 64467 73244 161228
11475 161228 160468 136355 203841 254261 240299 163712 178530 249419 184804 103678 89013 112966
11463 112966 89626 106233 175358 204675 155849 86117 7345 31721 23970 -28176 -26058 -67074
11451 -67074 -79220 12553 -2865 42379 105043 101631 50887 3269 136930 172082 144122 40775
11439D0775o6604M2901m9600q3301k3211O4603k526N9469N2403q81q557K6984
11427E2455L5222K1597o0674m7750m940O3227N7123Q0786l4473p3414k3860N9787
11415A25086K402q416Q48o3440N8579j523K1408m8495k2842q268p7261k8002N8120
11402H196m3379O9319P5334K3830j6649k622k4812k1346n2737k392Q5814O8146
11390A66702r143q6963o7960O3708n1668n1235n8289K3553L7901N4353k865p3995
11378e5901n3838M6684P7867N9872o7357l5891K0818L4580N0506k7182k4137l248
11366B2773P1320M2617n145K7277o0521o840O7793k113p8710l2788l0902Q2400
11354I7161N4356k6607j30819l991L5188j8178K5968J43357M0972r4364J0761
$$ plain form
11439 40775 -25829 17072 -32528 -115829 -139040 -74437 -76963 -17494 34909 34028 25471 52455
11427 52455 87677 109274 48600 850 -4090 59137 116260 197046 162573 89159 65299 125086
11415 125086 127488 119072 119920 56480 115059 113536 134944 86449 63607 55339 -21922 -49924 8196
11402 8196 -35183 34136 109470 133300 116651 114029 89217 67871 15134 12742 98556 166702
11390 166702 157559 70596 2636 66344 14676 -36559 -94848 -71295 -33394 20959 18094 -55901
11378 -55901 -109739 -63055 14812 74684 7327 -28564 -7746 26834 77340 50158 26021 22773
11366 22773 94093 136710 131565 158842 98321 91481 159274 157161 78451 45663 14761 97161
11354 97161 151517 124910 -5909 -9900 25288 7110 33078 176435 217407 123043 133804
11343A33804M0787m1436l3286M3652N9738n4872m4745l9228l4333R552K8809m0630
11331B7812m5511n2042J3090M2274M4065L231M610M9974L3541m8495j9106J1899
11319F5342J7253P669l9885o7485L3990M1022n7630p1089J076J48339q140l5676
11307C4786M222j9660Q8074J16787K7606r2118l8003J2912l3151P843N9902M2093
11295B11293n5962k9464j0729O4457o5821k22J39554N3408l6963q9909K1852K7071
11283B28565l9178J0093m1491o7252l0366L2605J5391J1968J7261m7545O5728
11272A55779l4285o2345L1817k9286L6709l8701j0272K0587K0931Q1011J6656
11261A88601k8511m0833p9842p341m1340n3519Q9725Q8753N4951K4926j4921q1868
$$ plain form
11343 133804 174591 133155 99869 143521 203259 148387 103642 64414 30081 39633 68442 27812
11331 27812 -17699 -69741 -56651 -14377 29688 32919 37529 87503 121044 72549 53443 65342
11319 65342 82595 90264 50379 -17106 16884 57906 276 -70813 -69737 78602 70462 34786
11307 34786 39008 19348 107422 224209 251815 159697 121694 134606 101455 109298 169200 211293
11295 211293 155331 125867 115138 179595 113774 113552 253106 306514 269551 179642 201494 228565
11283 228565 189387 199480 157989 90737 60371 92976 108367 120335 137596 90051 155779
11272 155779 121494 59149 90966 61680 98389 59688 49416 70003 90934 171945 188601
11261 188601 160090 119257 39415 32074 -9266 -62785 26940 115693 170644 195570 180649 98781
11249I8781o03j8900J3113n7818r9016r0000m780R3188Q9240K0380j7845K0198
11237D5938O4207k116j21666j2261J33456N6831K135J3419r678J5447l1364J9795
11225A74143l3698m0723l1055n0048l9292M9529N4227L7795M6814N404r0243q8972
11213f119K0381Q0092K0213n3959k3192L8363N1950R2842k9414m6078p6501o3666
11201D912J13113n5460p5689N0877J661j43005k3632J3794l0134O7732J0897P3562
11189H628P4089o8598K1379L5690N4401p1954r8013R3987J01210m7034q8639p934
11177G212o4698P2436J9696L7838M311K1957O6659n9303M7577k452n4307j10289
11165a3363j8256R3584p10k5217N0438K0232m1007m11O5023L5139K2172n4279
$$ plain form
11249 98781 98178 79278 92391 34573 -64443 -154443 -159223 -66035 23205 43585 25740 45938
11237 45938 110145 108029 -13637 -25898 107558 164389 166524 179943 170265 185712 154348 174143
11225 174143 140445 99722 68667 18619 -20673 28856 83083 120878 167692 173096 82853 -6119
11213 -6119 14262 94354 114567 60608 37416 75779 127729 220571 191157 145079 68578 4912
11201 4912 118025 62565 -13124 37753 39414 -103591 -127223 -113429 -143563 -75831 -64934 8628
11189 8628 82717 14119 35498 71188 125589 53635 -44378 49609 150819 103785 15146 7212
11177 7212 -57486 14950 34646 72484 76795 98752 165411 106108 153685 151233 96926 -13363
11165 -13363 -31619 61965 61255 36038 86476 106708 65701 65290 130313 165452 187624 133345
11153A33345L7410j6860j8864K8796m435q374L2040p524p7160j1198M3027O42
11141A30845p937j01501r4779P9484Q8304J2508J79642R864o9501P509K9781N9557
11129C23776n7058n0843P8913K6824l5769j15007n9445O7372N0694n0466l7804
11118A41187J18058N6027N5675n8281j13622k6237K6194K6115l1059l3944n3334
11107A06779J7576P8706Q0529m9157M691J6881n165K337R449M8751O7942L6770
11095D16089o9034j3896m172P7975m3309j52794m3346N7157K7622l4825r392P127
11083B15202K3570n3409r0964q1231O5937K420l0807M2536Q8197J076Q689j0299
11071A80917j8664n2424J2881Q5554l7754n5136j761P8234l4993N0564j9169N4781
$$ plain form
11153 133345 170755 153895 135031 163827 159392 151018 183058 175534 98374 87176 130203 130845
11141 130845 122908 21407 -73372 6112 94416 106924 286566 296430 226929 234438 264219 323776
11129 323776 266718 215875 294788 321612 285843 170836 111391 178763 229457 178991 141187
11118 141187 259245 315272 370947 312666 199044 172807 199001 225116 194057 160113 106779
11107 106779 124355 203061 283590 234433 239124 256005 250840 253177 262626 311377 379319 416089
11095 416089 347055 333159 328987 406962 363653 210859 167513 224670 252292 217467 208075 215202
11083 215202 238772 185363 94399 13168 79105 81525 50718 93254 181451 182527 191216 180917
11071 180917 162253 109829 122710 208264 170510 115374 113613 191847 156854 207418 188249 243030
11059B43030o4592K2047j5630l81M2544r0337m1366M4474R5234k7151q4837P5327
11047A98362O1610J9964p0518j3702O447K5818J35844K5486K9209Q0279M4577
11036E43376K305p8847Q366M176p447P0216J7365K9899L7868O5044M8167R0539
11024H31027N0844P448k3244j00372p7478O2493P0976R2310R811J3600Q3036K9351
11012A049802j07605K6103N941j04446L5916r1400m4024N5125M4674k4494j5498
11001H30094N6366k0739n3700j02860r3201r0386M036K623l8589k6565m4465K1558
10989D44172P8067k7294m5819o8791j9355k0524R09p2764j09187q4132n6r815
10977F5411L2570J49044m784l8121r4058j18801M1945O9417J15168n3412J8928
$$ plain form
11059 243030 178438 200485 184855 184474 227018 136681 95315 139789 235023 207872 123035 198362
11047 198362 259972 279936 209418 195716 202163 227981 363825 389311 418520 498799 543376
11036 543376 545681 466834 475200 479376 471929 542145 559510 589409 627277 692321 740488 831027
11024 831027 881871 889319 866075 765703 688225 750718 821694 914004 923815 937415 1020451 1049802
11012 1049802 942197 968300 974241 869795 905711 814311 770287 825412 870086 845592 830094
11001 830094 886460 865721 812021 709161 615960 525574 529610 532233 493644 467079 422614 444172
10989 444172 522239 494945 449126 380335 360980 340456 341365 268601 159414 75282 75226 65411
10977 65411 97981 247025 242241 204120 110062 -8739 33206 102623 217791 164379 183307
10966A83307P7901k8481j10583m5846P5383Q3025k7958q9843J32478P4271P589
10955C31243r6702j1213L0533n2906O489k9361M056j8007r339N8538P1371J9374
10943C04076n170n6379k4973p738n4405J486l7653o5519m4695O9416J17930O9029
10931B65405N3286o1323k6933k7097j6411j5691l1752J202R4910M3836m8678k0542
10919B10212o3183j9927j6245O503K1018p3284J286N2586L2073K6630J51j8558
10907A59262k5131m2006n1527N1132r169N8986J9647l5714L1404N7237k747P309
10895B18683r184j851j23077j105Q5586K3767M0020m3925m4029O3336M7419P1003
10883C26643M0867j07155j04764k7738J20082P1961M7516k0155k8492q4320k4408
$$ plain form
10966 183307 261208 232727 122144 76298 151681 234706 206748 116905 249383 323654 331243
10955 331243 234541 223328 253861 200955 207444 178083 182139 164132 154793 213331 284702 304076
10943 304076 298906 242527 217554 209816 155411 156897 119244 53725 9030 78446 196376 265405
10931 265405 318691 257368 230435 203338 186927 171236 139484 140686 235596 279432 230754 210212
10919 210212 147029 127102 110857 117360 138378 65094 66380 118966 151039 177669 177820 159262
10907 159262 134131 92125 40598 91730 82561 141547 161194 125480 156884 214121 211374 218683
10895 218683 209499 207648 84571 83466 169052 192819 232839 188914 144885 208221 255640 326643
10883 326643 367510 260355 155591 127853 247935 319896 367412 347257 318765 234445 210037
10872B10037q5934l974N1640J8543J0347P3235k5811q0449n1619Q376P8484K1139
10860B24014N200J1994k9054j6516J1359M0245K9332O0266j3604k7255k9789N4053
10848C20245k7555j32395l0561M9338k0209P0415J9279o6691k0100n0101J3515
10837A25180P8702K9700L509l992q1152k7138J21365o698l4037M370R676r660
10825B09825M5639O7230L4411p1167j36267L673J4040j3767J3726J0370j1947
10814A65766J2470N6449N7791n4958m7923J4296M1542l5881n3230k8531K2534
10803A50325R7892K9546j07650k8091J4497R0718l1307m6859m4612j10463K5097
10792C9093P1706L2219J3525L2169P3883P0302j164p2313n9534m5295l9761K369
$$ plain form
10872 210037 124103 120129 171769 190312 200659 273894 248083 167634 116015 124391 202875 224014
10860 224014 229214 241208 212154 195638 206997 247242 276574 336840 323236 295981 266192 320245
10848 320245 292690 160295 129734 179072 158863 229278 248557 181866 161766 111665 125180
10837 125180 203882 233582 237091 233099 151947 124809 246174 239476 205439 209809 219485 209825
10825 209825 255464 322694 357105 285938 149671 153344 167384 153617 167343 177713 165766
10814 165766 178236 234685 292476 237518 189595 203891 245433 209552 156322 127791 150325
10803 150325 248217 277763 170113 142022 156519 247237 215930 169071 124459 13996 39093
10792 39093 110799 143018 156543 188712 262595 332897 331733 259420 199886 154591 114830 117199
10780A17199l9332R619J26778J21400L4451K215q502n9490p1679J2200o8430n3718
10768A22711N8099N7144K6998m8381n4022J6140N8671n249p809j27P3497m9364
10756B48308m1911n6661M2955j6186L7072k876K8401R7735P641j2974k0652O9174
10744C80026J1758o085N4838K2665Q438O43n2688K2789Q056m6108K4359J21008
10732E49699K489L7177j9128n8520J0079R184P2566J12823J21542J68583J66567
10721A173061J24867Q2585J14584o4180q7903j51984q7467m4455k7818J37904
10711A169194K03736J67835J60148J02274n9692l5754j31331j69962j20991o0795
10701A224662k3525l5229J43726R1501M4652L6346m4524j10169j33571j15467
$$ plain form
10780 117199 77867 87486 214264 335664 370115 372330 363828 304338 232659 244859 176429 122711
10768 122711 180810 237954 264952 216571 162549 178689 237360 232111 224302 224175 297672 248308
10756 248308 206397 149736 192691 176505 213577 210701 239102 336837 344478 331504 310852 380026
10744 380026 391784 385699 440537 463202 471640 472283 419595 442384 450440 404332 428691 549699
10732 549699 552188 589365 570237 511717 521796 530980 603546 716369 837911 1006494 1173061
10721 1173061 1297928 1380513 1495097 1430917 1343014 1191030 1103563 1059108 1031290 1169194
10711 1169194 1372930 1540765 1700913 1803187 1743495 1707741 1576410 1406448 1285457 1224662
10701 1224662 1201137 1165908 1309634 1401135 1445787 1482133 1437609 1327440 1193869 1078402
10691A078402o3751m8123p854N6453M0965o535L7440J1810j7151k5013q1509j24965
10679H50169l0601p9452k7724R1938K8766n4125L361l4292k705P2182o523J3898
10667H24892M3184j4040n840m1451l365P9258J7795m0780m4933L4939J467J5611
10655H66737O8265Q6311L2908L7073N0461M8346O5444M0361P5118J17198Q5033
10644A573255J25322J91821J04237N2988q3134j0082n7687o7040q8810k0342J22836
10633A843364J77425J61292J27850L19878K60851L56509M43018L98964M59638
10624D548789M52370M17297L58085L63965L56316M58671O51337Q93739J321735
10615I822304J770618K442458L080668L988263M865917N297865N181684M479045
$$ plain form
10691 1078402 1014651 966528 958674 1015127 1056092 1049557 1086997 1098807 1081656 1056643 975134 850169
10679 850169 819568 740116 712392 804330 833096 778971 782332 748040 745335 817517 810994 824892
10667 824892 868076 854036 848196 806745 803380 882638 900433 859653 814720 849659 851126 866737
10655 866737 935002 1021313 1054221 1091294 1141755 1190101 1255545 1295906 1371024 1488222 1573255
10644 1573255 1698577 1890398 1994635 2047623 1964489 1954407 1896720 1829680 1740870 1720528 1843364
10633 1843364 2020789 2182081 2309931 2629809 2890660 3247169 3690187 4089151 4548789
10624 4548789 5001159 5418456 5776541 6140506 6496822 6955493 7606830 8500569 9822304
10615 9822304 11592922 14035380 17116048 21104311 25970228 31268093 36449777 40928822
10607D0928822L801273L436838K810674J772451Q40705J113187K622525N067034
10599F2393509P835077R040130Q408171O865390N604188M752871K968859l33569
10591A07534626l319773l370881l31745M200928Q389830J0377148R266123O669134
10583A39415390M628611K871420n23705o024700j0836595j1340365p837845k900226
10575A07451985R89955K814341K553399J212743j7090j116971l488746p223097
10567A03176519j0154150j0052344p609314m659447k255299j018848r10852j349795
10559F5166470j774052k372507l525125m903231n897640o002033n196061m133802
10551C1362019l146880k446947j963547j478426j236857j105768r06063q17095
$$ plain form
10607 40928822 44730095 48166933 50977607 52750058 53590763 54703950 57326475 62393509
10599 62393509 70228586 79268716 87676887 94542277 100146465 104899336 107868195 107534626
10591 107534626 104214853 100843972 100512227 104713155 113102985 123480133 132746256 139415390
10583 139415390 144044001 146915421 146391716 140367016 129530421 118190056 110352211 107451985
10575 107451985 108441940 111256281 113809680 115022423 115005333 113888362 110399616 103176519
10567 103176519 93022369 82970025 75360711 70701264 68445965 67427117 66516265 65166470
10559 65166470 63392418 61019911 57494786 52591555 46693915 40691882 35495821 31362019
10551 31362019 28215139 25768192 23804645 22326219 21089362 19983594 19077531 18260436
10543A8260436p20887o68551n74393n48981o12090n67133m48380l37436m62984
10534A3319601m23805m68186l65439l42269l14983l38841l38833m09066l27274
10525I990905k96442k85415k53681j36778j29411j95175k51633j90421j50981
10516H100968k09108j72206k61319k81736r1078q9781r9735k27749l31363j78995
10506F157898j08303j13258j07265j13553j42207j39220j26249j70224j34813
10497E002806j02324j15771q5392r4700j38548o9177k2796K4559p3478P57k1303
10486D304633j67891m2359K6873N154r8092q0166N0958k1935n2142L6018j06753
10475C854298j91974o8118L1234j4103K0399P0693R3911O2583L2147m5287j00606
$$ plain form
10543 18260436 17539549 16870998 16296605 15747624 15135534 14568401 14120021 13782585 13319601
10534 13319601 12895796 12427610 12062171 11719902 11404919 11066078 10727245 10318179 9990905
10525 9990905 9694463 9409048 9155367 9018589 8889178 8694003 8442370 8251949 8100968
10516 8100968 7891860 7719654 7458335 7176599 7085521 6995740 6896005 6668256 6336893 6157898
10506 6157898 6049595 5936337 5829072 5715519 5573312 5434092 5307843 5137619 5002806
10497 5002806 4900482 4784711 4699319 4604619 4466071 4396894 4374098 4398657 4325179 4325936 4304633
10486 4304633 4136742 4094383 4121256 4126410 4028318 3948152 3999110 3977175 3925033 3961051 3854298
10475 3854298 3662324 3594206 3625440 3611337 3631736 3702429 3796340 3858923 3891070 3845783 3745177
10464C745177n3566O08q5719m8319L0825K4994K8579l141k7793K4555J468l9044
10452C598624j69954j94595j26621j30549o4770N3099j3381J7276O9239l0617
10442C007751n2470l8214j27387j54985j09528r7250j70255j40553k5279L5617
10432B127447n1540j31892m0698O3805j13488j14234j75695J3411o2479n4228
10422A460409N4306k738p5704l3732p2265p338K1010J4178k3121j8865n7755m9369
10410A209016q48o6837j02735q6570j597k7382l7575P1665L4837j681m8301J9219
10398I61211K6936q3715q9858r1843p3834J4451M4808P486r4701o4178O9207P4883
10386G00853r1484P547N6076l6029K0844N2365L024L7523p7239m3933j2792p8458
$$ plain form
10464 3745177 3691611 3692219 3606500 3558181 3589006 3614000 3642579 3639438 3611645 3636200 3637668 3598624
10452 3598624 3428670 3234075 3107454 2976905 2912135 2965234 2951853 2969129 3038368 3007751
10442 3007751 2955281 2917067 2789680 2634695 2525167 2427917 2257662 2117109 2091830 2127447
10432 2127447 2075907 1944015 1903317 1967122 1853634 1739400 1563705 1577116 1514637 1460409
10422 1460409 1514715 1511977 1436273 1402541 1330276 1322938 1343948 1358126 1335005 1316140 1258385 1209016
10410 1209016 1208168 1141331 1038596 952026 950429 923047 885472 957137 991974 990293 941992 961211
10398 961211 988147 904432 814574 722731 648897 663348 708156 715642 620941 556763 625970 700853
10386 700853 609369 616916 672992 636963 657807 710172 713196 750719 673480 629547 616755 538297
10374E38297M0197k9749m7785L2276L0794j11122L9660K3444o0257m0169m306
10363D11280k2890K7035L8986m0135k687L0287J257n9383K2751O9779J8223l4462
10351D60041k36j8303m5282K6940L3109m6528k6046o8074k241J41252m801m656
10339D45175k7243p6935k2747m8555L8093N8548k1361Q09l9907j09897J797P2305
10327B70082Q6703l2035j24827m2202O4309M9056k3841k6204L8035n633M59O4357
10315C18259O1381J8908l998j8483j7031j24664O8808O5895o6881j935n2068j2806
10303B35385r652M4675N9901P672n9794l2978K7963n8278m2224P523J6441J78621
10291C75255j6869p7083n4343J1925n3154k7006j8059j4457l5169j4345j6822
$$ plain form
10374 538297 578494 548745 500960 533236 564030 452908 492568 516012 455755 415586 411280
10363 411280 388390 415425 454411 414276 411589 441876 443133 383750 406501 476280 494503 460041
10351 460041 459805 441502 396220 423160 456269 409741 383695 315621 313380 454632 449831 445175
10339 445175 417932 340997 318250 269695 307788 366336 344975 345784 305877 195980 197777 270082
10327 270082 356785 324750 199923 157721 222030 271086 247245 221041 259076 253443 253902 318259
10315 318259 379640 398548 394550 376067 359036 234372 303180 369075 302194 300259 248191 235385
10303 235385 225733 270408 330309 337981 278187 245209 273172 214894 172670 180193 196634 375255
10291 375255 358386 281303 226960 238885 185731 158725 140666 126209 91040 76695 59873
10280E9873k8647j3343k0838O1395k6118J3318O8276j7193q5047L7911J02171
10269A51758K5501L8045l033q450R225k5220p6882j03887p2390j4102m3806J27074
10257C833N1407j23223l433r877l7020J5338P6044J12676P280l0377j25Q7173
10245A49696o805j5618L3791q0193o8878p0272j8056Q9624K6618M2548N5393P920
10233A45768l5282o3969m6008l8692J7454O760o9139q3159K5180J11453J13176
10222H3542l6746N2957N9552n4035j305L6734p108L5682l1170n2091r333N311
10210H1990M179O87n6135K1554m1434J6822L5442k8733j7736j9567N7584K8830
10198H3483k0101M0760P1762p7617l5421J2622l5013j04543n1498j8610P0924
$$ plain form
10280 59873 31226 17883 -2955 58440 32322 45640 113916 96723 11676 49587 151758
10269 151758 177259 215304 212271 203821 213046 187826 110944 7057 -65333 -79435 -123241 3833
10257 3833 55240 -67983 -71416 -81293 -118313 -102975 -26931 85745 93025 62648 62523 149696
10245 149696 142891 127273 161064 80871 11993 -58279 -76335 13289 39907 82455 137848 145768
10233 145768 110486 46517 509 -38183 -20729 -13969 -83108 -166267 -141087 -29634 83542
10222 83542 46796 99753 159305 105270 103965 140699 133591 169273 138103 86012 76679 81990
10210 81990 86169 86856 30721 52275 10841 27663 63105 34372 16636 -2931 54653 83483
10198 83483 63382 104142 175904 98287 62866 75488 40475 -64068 -115566 -134176 -63252
10187f3252J78621L442l4482m5213k9337J12186o8651m0665L3324N4316j0062
10176I0227J19284l4796n3555M5752L5387L9890R735j03251N2607Q0063M8277
10165C29620M6701j0098L9936J9101n947j2148N7727R1724J7414K8543n9264n3287
10153D90022m2771k4497K5552J52777J34884N0650J0244m7770r4652j0960K0133
10142F63612Q7733j3780o8136j37854O100J05654N3596N277L954L0526p6649l4002
10130F26031r9075r7935m5553k4076n3283J08508K7828n6871n1795M0584L9946
10119D14309q5250j84600r2533J12414L2107o0385j28113J7431K3036j3708L4616
10108F9324Q2239J4043j43284j00771K8928L9687J3388k5827J05028M1986k9706
$$ plain form
10187 -63252 115369 118811 84329 39116 9779 121965 53314 12649 45973 100289 90227
10176 90227 209511 174715 121160 166912 202299 242189 251924 148673 201280 281343 329620
10165 329620 376321 366223 406159 425260 419313 407165 464892 556616 574030 602573 543309 490022
10153 490022 447251 422754 448306 601083 735967 786617 796861 749091 654439 643479 663612
10142 663612 751345 737565 669429 531575 537675 643329 696925 702202 706156 736682 660033 626031
10130 626031 526956 429021 383468 359392 306109 414617 442445 385574 333779 374363 414309
10119 414309 329059 144459 51926 164340 196447 136062 7949 25380 48416 34708 69324
10108 69324 151563 165606 22322 -78449 -49521 -9834 3554 -22273 82755 124741 95035
10097I5035j20362l3725k718J9491O4112J8674p8483n0821K1877R545P4568j3404
10085C789O975M1775l2515p443M7421l9169j8182R04J07232J9206J7716m982l6181
10072A06546p2771q5013o5065M7786N6950K978l9100K3537Q339J5307J05259j928
10060A02825k1875m5018L4803j7953k5227J0440K0907M396o1303j5654p8586l1609
10048a23854J5113Q8380L5049o5053o4625p9130j8932J07915J08508L5364j12501
10037g3766l4340N7656P6826J0901o6194L6245K2237p0228j6202K2418k4919N1126
10025h240R9281L0389k2765k5348l040j9503J9299k2493L4075q969n8763j7621
10013c698q3923j18196O0853J22759K8523l0148L9018L2408m5374M7546j9217
$$ plain form
10097 95035 -25327 -59052 -61770 -42279 21833 40507 -37976 -88797 -66920 -57375 17193 3789
10085 3789 10764 52539 20024 12581 60002 20833 2651 3555 110787 129993 147709 142727 106546
10072 106546 33775 -51238 -116303 -68517 -11567 -8589 -47689 -24152 -15813 -506 104753 102825
10060 102825 80950 35932 70735 52782 27555 37995 58902 63298 1995 -13659 -92245 -123854
10048 -123854 -108741 -20361 14688 -50365 -114990 -194120 -213052 -105137 3371 38735 -73766
10037 -73766 -108106 -50450 26376 37277 -28917 7328 29565 -40663 -56865 -34447 -59366 -8240
10025 -8240 91041 121430 98665 73317 70277 50774 70073 47580 81655 72686 13923 -3698
10013 -3698 -87621 -205817 -144964 -22205 6318 -23830 15188 47596 2222 49768 30551
10002C0551n6682o202K2682Q3692K6671m750q8880m7888J0499j4868l8513j8071
9990a01759k764L1679M9711l96n7713J4994O8346k8150n6154p898k6597Q5512
9978c1189N8964K0144k9098K850k2485l4142p4524J4478o3402L3298O5942P1668
9966A2504q481j01772j9273l3787k0224P6166O1636J6431J0932n902n7367j5802
9954h4939K1456j2092L2042K5839n3325o2565j11064Q24J05580M5818k1102J9827
9942i3701O945P2567J5807r675M1346l3308r2380l0792J29615K7321m6325q336
9930b0916k4630O891k3656N1449m2186J4298J8040J0990k2204m0411j01270L0588
9918a43017M0201M3233j2444l055J26849j2693N166M4856o9339p0980L1040K6898
$$ plain form
10002 30551 -26131 -32333 -9651 74041 100712 95962 7082 -40806 -30307 -45175 -83688 -101759
9990 -101759 -104523 -72844 -23133 -23529 -81242 -66248 2098 -26052 -82206 -90104 -116701 -31189
9978 -31189 27775 47919 18821 21671 -814 -34956 -109480 -95002 -158404 -125106 -59164 12504
9966 12504 4023 -97749 -117022 -150809 -171033 -94867 -33231 -16800 -5868 -11770 -69137 -84939
9954 -84939 -63483 -75575 -43533 -17694 -71019 -133584 -244648 -243824 -138244 -92426 -113528 -93701
9942 -93701 -86756 -14189 1618 -8057 33289 -19 -92399 -123191 6424 33745 -12580 -20916
9930 -20916 -45546 -38655 -62311 -10862 -53048 -38750 -20710 -9720 -31924 -72335 -173605 -143017
9918 -143017 -102816 -59583 -72027 -75082 51767 39074 44240 89096 19757 -51223 -20183 6715
9906F715k7337n2420l9686R4046J19218N2393m7681j18793K1780J813P1964J2817
9894I4829l7135L0525j3087k8792J5415m8111N9928L4146j9531n3387j9470M6836
9882F2166o8337o0071M0289j2113j6798K9824R2254O1432K6435n0426K5762M6884
9870A77301K3764p4625j7409M899j1992q5016P3381p085p2673J5226N2214J1671
9858H9656k5719p3961p4757n340P2395P7148L6249m460l3852m5409k531L2748
9846D2167M6860k0535l5181o4112K3576P5793n7469O1855Q915k2337j01082k5697
9834f7247J22544Q1320l7740m9226j5753l3516K2007q724k269q320p2424m3873
9822a13221L4489J9268P1734k6160j5444O0001R3272m3596k7709k2246J2446L5286
$$ plain form
9906 6715 -20622 -73042 -112728 -18682 100536 152929 105248 -13545 8235 10048 82012 94829
9894 94829 57694 88219 75132 46340 61755 13644 73572 107718 88187 34800 15330 62166
9882 62166 -6171 -66242 -25953 -38066 -54864 -25040 67214 128646 155081 104655 130417 177301
9870 177301 201065 126440 109031 113930 101938 16922 90303 83218 10545 25771 77985 89656
9858 89656 63937 -10024 -84781 -90121 -17726 59422 95671 91211 57359 11950 9419 42167
9846 42167 89027 68492 33311 -30801 -7225 68568 11099 72954 81869 59532 -41550 -67247
9834 -67247 55297 136617 98877 49651 33898 382 22389 13665 11396 3076 -69348 -113221
9822 -113221 -78732 -59464 12270 -13890 -29334 30667 123939 80343 52634 30388 42834 78120
9810G8120k3229J850m4083o3776J0642O599K0822m0772n5638O785Q8650N6288
9798D2258J1961m8489L9879q1589k9351k6320k3853M0584K8964j0873M4048O3399
9786E0618J0764K2780r5144k6861j6359Q6799R0895k832J41755K38538L37652
9775H38605M25924M89106K28808J6306J23949J15411O881k44330n02668n04545
9765I93447l25518j92626j79535J7734j9508r6765L5895p0797j35812J71998L6804
9754B35317j2091q3818o3355O7055M6059K694l6305L5687p3543p5547j3857j11651
9742h3355J9654O8547l2036L9975k175p385R2077r683o3384K4780l7709k2840
9730a3534K9916L5598m9385M4697P253M0630K8022q3245m1312k1586p3107O011
$$ plain form
9810 78120 54891 56741 12658 -51118 -40476 -33877 -13055 -53827 -109465 -102680 -14030 42258
9798 42258 54219 5730 45609 -35980 -65331 -91651 -115504 -74920 -45956 -56829 -12781 50618
9786 50618 61382 84162 -10982 -37843 -54202 32597 123492 120660 262415 500953 838605
9775 838605 1264529 1753635 1982443 1998749 2122698 2238109 2244990 2000660 1497992 993447
9765 993447 667929 475303 295768 313502 293994 197229 233124 162327 26515 198513 235317
9754 235317 223226 139408 76053 143108 189167 191861 155556 191243 117700 42153 28296 -83355
9742 -83355 -63701 4846 -27190 12785 10610 3225 95302 85619 22235 47015 9306 -13534
9730 -13534 16382 51980 2595 47292 54545 95175 123197 39952 -1360 -22946 -96053 -90042
9718i0042J32644K5794m6578q4517r2257n0591J12200L9689J4189J5117q5559
9707a09911J1632k282j1511P3631Q1454k9656k578M9579l5647l5434J20097N519
9695A14893j5160M402k4958j3768o4219m0372l05k1558k8007K4956n1299K2277
9683i3118k4902O8492Q9619j3068N8338K239j14041l43K1229j6871k6677M9694
9671E91N0442j4540m4364m530J4093J993m29K751n0301j8369m6939J5835J9781
9658g3986M1425K9085J09135J18795M6351r5718p7725k6860J03294J13856J96593
9647D84245J42677j2875N1931J8223m9156J0301J3675k14766j75160n0462l6368
9636A82265j9127l6134j6279L9023M0934j2459o9809r3920r3230P02R0084M0430
$$ plain form
9718 -90042 42602 68396 21818 -62699 -154956 -205547 -93347 -53658 -39469 -24352 -109911
9707 -109911 -98279 -100561 -112072 -38441 43013 13357 10779 60358 24711 -10723 109374 114893
9695 114893 99733 104135 79177 65409 1190 -39182 -39487 -61045 -89052 -64096 -115395 -93118
9683 -93118 -118020 -49528 40091 27023 85361 87600 -26441 -26784 -5555 -22426 -49103 591
9671 591 51033 36493 -7871 -12401 1692 3685 3256 6007 -44294 -62663 -109602 -93767 -73986
9658 -73986 -32561 -3476 105659 224454 270805 175087 97362 70502 173796 287652 484245
9647 484245 626922 614047 665978 684201 635045 645346 659021 444255 269095 218633 182265
9636 182265 163138 127004 110725 149748 190682 178223 108414 14494 -78736 -78034 12050 52480
9624E2480K2773j6758M2914o7844k0505L5176J2310M5828O2190p8678q946K8970
9612A09910J4541m8040k2746L8517N790l1255L8848M3425J4321J7596p703o1540
9600A11664j7150j3081l1730l0452j5441L7026K2424j4710K6232K7099q371n901
9588H7609n1644M2062O4955l66J4782J9654j07713q7574k9912L7792p381R541
9576h195L5283j3873j14938O1263J68150J09798j21348m8597k4935m4495J22715
9565A20828N506n8939K711J9376m7608j2112r732j3128L9384J6047L7028K3758
9553A23119o0906m8120K2119j5896n9791L7892P8234m9585o3964n4734l3300J10049
9541a4883q122l0895m575r379J9698M4590M2777J844J5440l9392J3783M8862k1135
$$ plain form
9624 52480 75253 58495 101409 33565 13060 48236 60546 106374 168564 89886 80940 109910
9612 109910 124451 76411 53665 92182 97972 66717 105565 148990 163311 180907 173204 111664
9600 111664 94514 81433 49703 19251 3810 40836 63260 48550 74782 101881 93510 87609
9588 87609 35965 78027 142982 142616 157398 177052 69339 -18235 -48147 -10355 -17736 -8195
9576 -8195 27088 13215 -101723 -40460 127690 237488 116140 67543 42608 -1887 120828
9565 120828 126334 67395 70106 89482 41874 29762 20030 6902 46286 62333 99361 123119
9553 123119 62213 14093 36212 20316 -39475 -1583 76651 27066 -36898 -91632 -124932 -14883
9541 -14883 -23005 -53900 -58475 -67854 -48156 -3566 39211 41055 56495 17103 30886 79748 58613
9528E8613n2468j05982K5925O144q5123J6913j0878L0531J7946L6439O4709M0518
9516D3287l1014o319N4222l2558j19942m616J03961R9531p5011p8828M5794K6792
9504B5299j08M3744l3374M0748n981n1999P1807O1919l498o4984L3455K8444l7784
9491A07688K8299N5144K2233k6991j69701j16117o121P0194P7135K2320N174M3189
9479A12446j22185m5826J00562O4650N8949k4429n9556m2391K6768N0443q5979
9468C3452n0962n385J18882L9949n6790L6195n86m4695m826N5914R3410M9573
9456B64131M684O4925J8501r8030k4902J05749J29013J23003N0387R2219O1085
9445G90765j6579o5971j23947l1258n6066m2925p4141J415O3103K8805l1601p6908
$$ plain form
9528 58613 6145 -99837 -73912 -67768 -152891 -135978 -146856 -116325 -98379 -61940 2769 43287
9516 43287 12273 5954 60176 27618 -92324 -96940 7021 106552 31541 -47287 -1493 25299
9504 25299 25191 68935 35561 76309 70328 18329 90136 152055 148557 83573 117028 145472 107688
9491 107688 135987 191131 213364 186373 16672 -99445 -105566 -35372 41763 64083 69257 112446
9479 112446 -9739 -55565 44997 109647 168596 144167 84611 42220 68988 119431 33452
9468 33452 -17510 -22895 95987 135936 79146 115341 114755 70060 65234 121148 214558 264131
9456 264131 268815 333740 352241 254211 229309 335058 464071 587074 637461 729680 790765
9445 790765 774186 708215 584268 553010 496944 454019 379878 381293 444396 473201 441600 364692
9433C64692P6647L5043J20313J44304Q2914Q7235O3000J7300L9068n2164q1355
9422H96997m9585q199p0025m2234J8358l9641l6111l130K5869P8423J38016P9740
9410I88478J78470L39464L21412N3742M0445J50033J45984M0917k42428l13606
9400A702911l63579k78876m4775r1760k4108q058k1753p2346Q371N9765L3588
9389H99380M5331Q90K6467M9581l9947l1820p7951o2000N8800M083p8018m1774
9377G53022p672n8458j82133j27560o7226L6110P5636Q7397Q3359N8852J21386
9366G72713J26710j0093o9937k3838R394m6167M286j24903j85180q0276O2402
9355D35111K1308k5119j4909M1849n8074L088J2952n5991j10173n0123o5206R993
$$ plain form
9433 364692 441339 476382 596695 740999 823913 911148 974148 991448 1030516 978352 896997
9422 896997 847412 839213 769188 726954 745312 705671 669560 666430 692299 770722 908738 988478
9410 988478 1166948 1506412 1827824 1881566 1922011 2072044 2218028 2258945 2016517 1702911
9400 1702911 1339332 1060456 1015681 923921 899813 891755 870002 797656 806027 865792 899380
9389 899380 944711 945601 972068 1021649 981702 949882 871931 809931 868731 872814 794796 753022
9377 753022 745350 686892 504759 377199 309973 346083 421719 509116 592475 651327 772713
9366 772713 899423 889330 819393 795555 804949 758782 763068 638165 452985 372709 435111
9355 435111 456419 431300 416391 458240 400166 403254 416206 360215 250042 199919 134713 144706
9343A44706m1653r4955k7065Q6498J33363m3793k2696K5644N326j6553j1854j7805
9331A19163m2707N5363r840l0536o568O0253K8001J7323m2998l7302L154K2782
9319A36088J1590m4577j75088l6570J08440L2801l2371q0107j8952n438M8256
9308e5928M2399P1313m2771K705R4823m7383o1498M8328k4586l1536K6381J8632
9296D0879p2345N3853N3777M830k1603l0958L1090L8969p233m8047j7566l680
9284B1966m8718p4481J00707J25280M3853j713m6368L8364k9147k7880k6568P0856
9272A46151J9582j04306k4526j2368p262m0189l627O2263N814l7813J9810p0179
9260d6650k46p564n4491K3358L7755P1552k1374j6396K0872M8702j079l0358k8415
$$ plain form
9343 144706 103053 8098 -18967 67531 200894 157101 134405 160049 165375 148822 136968 119163
9331 119163 76456 131819 121979 91443 84875 145128 173129 190452 147454 110152 113306 136088
9319 136088 147678 103101 -71987 -108557 -117 32684 313 -79794 -98746 -104184 -55928
9308 -55928 -13529 57784 15013 17718 112541 65158 3660 51988 27402 -4134 22247 40879
9296 40879 -31466 22387 76164 80994 59391 28433 59523 98492 91259 43212 25646 21966
9284 21966 -26752 -101233 -526 124754 168607 166894 120526 158890 129743 101863 75295 146151
9272 146151 165733 61427 36901 24533 17271 -22918 -26545 35718 41532 3719 23529 -46650
9260 -46650 -46896 -54460 -108951 -85593 -47838 23714 2340 -14056 6816 55518 54439 24081 -4334
9247d334k6778K5142J06014M5327o3776j00432k0486m9700m992K6008k6833k7301
9235a22141L2035J3451o9963M3987P2969J3120l5943k5499l949L0707P6425L3523
9223E8722j0148K2371l0285R516o2246n0487l8696O5858j0573j6662K4564L8616
9211E50q8645j6716J03871J07919R5264k8684j02382l7719M4369p5511m2623P2963
9199C2656k7904k1272k7182L6658m475n9246n7165o481K7593M4708L5898m8570
9187g4782k3921O7366k4230J2568k2478l0584N585j2614M7910M5227j3710p3038
9175i6701k0523L1788N1752j3155K03K4088M2213L9713j4096j909q1583m9258
9163h7468J0265L3742O50J987L5688j8479r8939K3874N7017N2438J6759N253R8179
$$ plain form
9247 -4334 -31112 -5970 100044 145371 81595 -18837 -39323 -89023 -94015 -68007 -94840 -122141
9235 -122141 -90106 -76655 -146618 -102631 -29662 -16542 -52485 -77984 -81933 -51226 25199 58722
9223 58722 48574 70945 40660 50176 -12070 -62557 -101253 -35395 -45968 -62630 -38066 550
9211 550 -88095 -104811 -940 106979 202243 173559 71177 33458 77827 2316 -40307 32656
9199 32656 4752 -16520 -43702 -7044 -11519 -70765 -127930 -134411 -106818 -62110 -26212 -74782
9187 -74782 -98703 -31337 -55567 -42999 -65477 -96061 -90476 -103090 -55180 -9953 -23663 -96701
9175 -96701 -117224 -85436 -33684 -46839 -46636 -22548 19665 59378 45282 43373 -38210 -87468
9163 -87468 -77203 -43461 -42811 -40824 -5136 -23615 -122554 -98680 -41663 10775 27534 32787 130966
9150A30966J38003M114m4896j70483j23618L6634L2092o6723n7111O104J65438
9139E0520P7101n377N1929R348j12697j11770j01328M3261M6378R3032M125p3613
9127b9091O0324L2982k0523q1443l6479M7997j1538n1912J1454j5878Q582J9642
9115f5883l8666J26304R5242l6342M8585J3222k6548o4427q7856k3438J6422L4979
9103h406R6629m989m9826o7363o3227l0552R227J01056K6081j6950m9215j9771
9091g7306l0720j7094R3177J8085j03547j3853R5900J1281m1032o3549n3645L8919
9079a43384J06230K3002L104M7241mr8645k131O266K6257r394o4937j04058J304
9066b09149J11318J15609Q4572m7415m9755M5610j8039J1393l0495K4472j4624
$$ plain form
9150 130966 268969 273083 228187 57704 -65914 -29280 2812 -63911 -121022 -114918 50520
9139 50520 127621 122244 174173 183521 70824 -40946 -142274 -99013 -52635 40397 44522 -29091
9127 -29091 31233 64215 43692 -37751 -74230 -26233 -37771 -89683 -78229 -94107 -85525 -65883
9115 -65883 -104549 21755 116997 80655 129240 142462 115914 51487 -36369 -59807 -43385 -8406
9103 -8406 88223 83234 33408 -33955 -97182 -127734 -118507 -17451 8630 -8320 -57535 -77306
9091 -77306 -108026 -125120 -31943 -13858 -117405 -131258 -35358 -24077 -65109 -128658 -182303 -143384
9079 -143384 -37154 -14152 -11048 36193 36189 -62456 -64587 -58321 -32064 -41458 -106395 -210453 -209149
9066 -209149 -97831 17778 102350 54935 5180 50790 32751 44144 13649 38121 23497
9055B3497q3207N1903P0388m5285j09279O8738r982o3296k4861L1279Q6016k3635
9043b7724K2964J04478m236n2672k8603L8559P9988J755J3138j2492p4648n1972
9031H535k3923k0892M959L6341n8284j1838n5597l2359O9904J01699J2809k7802
9019C552P7500r6889n7200L7410N5529L8143o6001j3677J02197J4549j16529k9577
9007e0993L7535m0464J3301R7138o9911M7472O5243J7521l1494l0727n2724m0297
8995c8400K8961L3248P1690n4678N6948N8831m7170j11129J3345K5643J295L2598
8983G1182l8182K1922p8668j0739K6617l0974o7365N5921O4268R447j1637k2998
8971a1206n5205N1478L2210N3102P2535j7150O608m1817m4594q1976k7844P7039
$$ plain form
9055 23497 -59710 -7807 62581 17296 -91983 -23245 -33227 -96523 -121384 -90105 -4089 -27724
9043 -27724 -4760 99718 95482 42810 14207 52766 132754 134509 147647 135155 60507 8535
9031 8535 -15388 -36280 -31321 5020 -53264 -65102 -120699 -153058 -83154 18545 31354 3552
9019 3552 81052 -15837 -73037 -35627 19902 58045 -7956 -21633 80564 95113 -21416 -50993
9007 -50993 -13458 -53922 -40621 56517 -13394 34078 99321 116842 85348 54621 1897 -38400
8995 -38400 -9439 23809 95499 40821 97769 156600 109430 -1699 11646 37289 38584 71182
8983 71182 33000 54922 -23746 -34485 -7868 -38842 -106207 -50286 13982 23429 11792 -11206
8971 -11206 -66411 -14933 17277 70379 142914 125764 132372 90555 45961 -36015 -63859 13180
8959A3180K583K1821J16800o6779q8071o8464k8158N4836M6551l1737O515P5013
8947E4090P757O748K1955q6022k5554J5385k2990m2405m5200k1644J8883Q0239
8935c8758L7518O5292J0469j0309N1443M8015m6980o5730p68J3167J3701N062
8923H2122L0916J2866j03505k7475J868J4625P315J9944J11023o195p5956K2591
8911I0139p53o0442o2576J3460p7001N9840P4948K5685P0867r0714q2320l1322
8899g0189K7201O573N4737k7161o815j4884J766O5401M9942m1912j1299M1357
8887G4717q500j845J6730j6402j5307L0057m61n4155p1728k4552O1911L4864j6292
8874I037j3779n9914n18J4022J6967K4344K553Q3344M1407l8496J9873l9842j09080
$$ plain form
8959 13180 15763 37584 154384 87605 -466 -68930 -97088 -42252 4299 -27438 -20923 54090
8947 54090 61847 68595 90550 4528 -21026 -5641 -28631 -71036 -116236 -137880 -118997 -38758
8935 -38758 -1240 64052 74521 64212 115655 163670 116690 50960 50192 63359 77060 82122
8923 82122 113038 125904 22399 -5076 -3208 11417 18732 38676 149699 143504 67548 90139
8911 90139 89386 28944 -33632 -20172 -97173 -37333 37615 63300 134167 43453 -38867 -70189
8899 -70189 -42988 -36415 18322 -8839 -15654 -30538 -28772 36629 86571 44659 33360 74717
8887 74717 66217 64372 81102 64700 49393 79450 78989 24834 -46894 -71446 -9535 25329 9037
8874 9037 -4742 -64656 -65174 -51152 -34185 -9841 -7288 76056 117463 78967 98840 58998 -50082
8861e0082r7349Q7683O5040j3831Q132M4003m0650M0534m5038n1012l5428j2597
8849a00595O5062J16789L4040l2229j9820l3680r161p4993j1199N7911R3880M6552
8837A32557M6633K9239P4893k1146m2707P6602M3399l0084q5384m1027o5616j22601
8825e242L7949K8926l7355P6401j6018J0257L3265o4055j1146N894k4765N732
8813C9843K5357q888Q010l5547J3523j8130j210o2688J8100M3158K0657J1853
8801E4038j0183M5970m0173j21334N092J376M7821P0512J9357l2570k5684n6183
8789d1961l8148J1879J05581N4492L1928p8789n2792P9063O3673m2119L1680K576
8777A27063p1448K6885K9498l1144j3166N2712R1393j6783K779j9180L9859l7975
$$ plain form
8861 -50082 -147431 -59748 5292 -8539 -407 43596 2946 43480 -1558 -52570 -87998 -100595
8849 -100595 -35533 81256 115296 83067 63247 29567 20406 -54587 -65786 -7875 86005 132557
8837 132557 179190 208429 283322 262176 219469 296071 339470 309386 224002 182975 117359 -5242
8825 -5242 32707 61633 24278 100679 84661 94918 128183 64128 52982 58876 34111 39843
8813 39843 65200 56312 64322 28775 42298 24168 22958 -39730 -21630 21528 42185 54038
8801 54038 43855 89825 49652 -71682 -66590 -65214 -17393 53119 72476 39906 14222 -41961
8789 -41961 -80109 -68230 37351 91843 123771 44982 -7810 71253 134926 92807 124487 127063
8777 127063 55615 82500 111998 80854 67688 120400 211793 195010 197789 178609 218468 180493
8765A80493J4090j2716p966J0213l9346j0740Q96k3724K1234n9678j15236Q0234
8753C7754P2697J5503r6891k5244R7472J7603K2628j01599l8954k9198O8257J6692
8741E6720m7211J8757L7688O3267K5463o6167m3119n5442m3491N0510R5615J8348
8729A10938O7378m7935P992K2120q4155j00378k7749M9946O7727M1904O0016l4399
8717A33405q6736k4555O4517P217K0407o3452j32913P2873P5272j2457m6081M3125
8705E0622K632o763L3354l2904p8119j3299m2833P4482J04030K3456n1365K8382
8693I1675J5989l0057J4272l4708m1469O600o9217K675M0175j126O229R867M4296
8680E5201M0243N1255N3070j1201k6986m9938o0502o6024L7825J16783k921J7704
$$ plain form
8765 180493 194583 181867 173901 184114 144768 134028 134924 111200 132434 72756 -42480 37754
8753 37754 110451 125954 29063 3819 101291 118894 141522 39923 969 -28229 40028 56720
8741 56720 9509 28266 65954 129221 154684 88517 45398 -10044 -53535 -3025 92590 110938
8729 110938 178316 130381 138373 160493 76338 -24040 -51789 -1843 65884 107788 167804 133405
8717 133405 46669 22114 86631 93848 114255 50803 -82110 -9237 66035 53578 7497 50622
8705 50622 53254 46491 79845 46941 -31178 -44477 -87310 -12828 91202 114658 63293 91675
8693 91675 107664 77607 91879 57171 15702 22302 -46915 -44240 -4065 -5191 1038 10905 55201
8680 55201 95444 146699 199769 188568 161582 111644 51142 -14882 22943 139726 136805 154509
8668A54509j6900q1828j8710Q0969K5961J0713L9055N7895m3270p7441m1584o4832
8656B4537m6006P8785N1404k7330l8581j5325M7177Q1539k7402m2393R935m4409
8644E1931l2191M9921J40280k4298j848k8212M4327M7359j02102o3965l4099L7115
8632H4218K9285K5667M8037J02324k5172m6746O1862j4386m7659j02745j23044
8621h359j7462O5915J56923O5164m6105J4424p0110k3468l8858M4289j0543K9040
8609A60850P4718M4173j5824n7018j2251J9306K2366Q6609M9907k4308j0709N0244
8597C88063M5372O3244j1656l724p2911n0674P3810L6599k191l4738n2046k9493
8585C49655M210L0690J841M0811L3k5999P2582N2553M5088n563J1784m9118r4361
$$ plain form
8668 154509 137609 55781 37071 118040 144001 154714 193769 251664 208394 130953 89369 24537
8656 24537 -21469 57316 108720 81390 42809 27484 74661 156200 128798 86405 96340 51931
8644 51931 19740 69661 209941 185643 183795 155583 199910 247269 145167 81202 47103 84218
8632 84218 113503 139170 187207 289531 264359 217613 279475 265089 217430 114685 -8359
8621 -8359 -25821 40094 197017 262181 216076 230500 160390 136922 98064 142353 131810 160850
8609 160850 235568 279741 263917 206899 194648 213954 236320 322929 372836 348528 337819 388063
8597 388063 433435 496679 485023 481299 408388 357714 431524 468123 465932 431194 379148 349655
8585 349655 353865 384555 386396 427207 427240 401241 473823 526376 571464 565901 577685 528567 434206
8572D34206p0338K084K4549J721n5912o9355L49m1764N586J6042K2034J02989
8560C72191q2889q919l776l1929q8162m2419J4737L4931N6784N4592L5801j4513
8548B96429o8176j4507K1123J1631k8108j9439j9574M697M3529K7067p4585j2542
8536A67545M4985j3842N633L3048L2622L2084n51O6136J12242J25166L4185L5856
8524F75109L2441O9362k6685q7389j33186n9308j54884j53746N041J9272n7280
8513A28747Q6197O5293l4610l5140j13532p3688M6705Q1157J02013M9433j4809
8502B87766q2749m0743N6443Q6338n952N53l1535m056K2527m0679p1975q682K4385
8489A91641m3735L0832N0756P5352P7042J94901K93443K15517K8695n2394J14507
$$ plain form
8572 434206 363868 365952 390501 392222 336310 266955 267304 225540 231126 247168 269202 372191
8560 372191 289302 280383 276607 244678 156516 114097 128834 163765 220549 275141 310942 296429
8548 296429 228253 213746 234869 246500 218392 198953 179379 184076 227605 254672 180087 167545
8536 167545 212530 198688 204321 237369 269991 302075 301524 367660 479902 605068 639253 675109
8524 675109 707550 776912 750227 662838 529652 470344 315460 161714 166755 186027 128747
8513 128747 214944 280237 245627 210487 96955 23267 69972 151129 253142 302575 287766
8502 287766 205017 164274 220717 307055 301103 301656 270121 266065 288592 247913 175938 167256 191641
8489 191641 147906 178738 229494 304846 381888 576789 870232 1085749 1114444 1062050 1176557
8478A176557K29167P1031k29328l96782k52811j56111p0881j26812p1121m0176
8468A32733j5382J6547K3710m1039p3626M0016Q6229L6912k2172J513P16N1774
8456B37931K3917m945n2847o6673l2067K3296Q1422j0107l5252K5349l5357N2026
8444B06693R5593K7359K9984p111K776N4771P9003R5285J1432n2591L772j6525
8432E30441k5116p4168p1633p7688n7126n3715n0776N1075P1373k2444k9767J4695
8420B05151J9600P2044l6303j11299l1478J364l8121j0167o8295K1494N4157n0958
8408B7189K1442R8607r982j16650k6056J30955m3228l8521M8904P9796j9223p2025
8396H1208p562j05806J569R0591N6480J1352j6724n6960O5285R140m661Q2288
$$ plain form
8478 1176557 1405724 1476755 1247427 850645 597834 441723 370842 244030 172909 132733
8468 132733 117351 133898 157608 116569 42943 82959 169188 206100 183928 185441 186157 237931
8456 237931 261848 256903 204056 137383 105316 128612 210034 199927 164675 190024 154667 206693
8444 206693 302286 329645 359629 352518 355294 410065 489068 584353 595785 543194 546966 530441
8432 530441 505325 431157 359524 281836 224710 170995 120219 171294 242667 220223 190456 205151
8420 205151 224751 296795 260492 149193 117715 119079 80958 70791 2496 23990 78147 27189
8408 27189 48631 147238 137256 20606 -5450 125505 82277 43756 92660 172456 153233 81208
8396 81208 73646 -32160 -30591 60000 116480 127832 111108 54148 119433 128573 123912 206200
8384B06200J1104r058J0657p5528l4055K436k3005j9363M6282O8170k6783n0385
8372A06672m169o2325K2271J7760j6078L1159J4715K6574l1337J3785J49M0801
8360A59977J8852l9676m4287J7530J0377N8854k1739N6112L5149J3826l0276p0703
8348A63996j3975m3345L6145L9584J1479K5205N7967n9258K588j9205j909k4699
8336A74573L6667o3045J3784J03975m4231o6664m8487o1791l660l959J2291l0661
8324A8792r694K4374P2347k3447J575m6687n6206O7281J04385o5621j8155j321
8312F7623o9862k748L3213R9986L5338r5858O509J05538m6037p7439n5676M0715
8300D1302m8777k4435L3896L175M0658j0256n0646k4891K8405N4520K6749N185
$$ plain form
8384 206200 217304 208246 218903 143375 109320 111756 88751 69388 115670 183840 157057 106672
8372 106672 102503 40178 62449 80209 64131 95290 110005 136579 105242 119027 119176 159977
8360 159977 178829 139153 94866 112396 122773 181627 159888 216000 251149 264975 234699 163996
8348 163996 150021 106676 142821 182405 193884 219089 277056 217798 220386 201181 199272 174573
8336 174573 211240 148195 161979 265954 221723 155059 106572 44781 41121 37162 49453 18792
8324 18792 9098 33472 105819 82372 83947 37260 -18946 48335 152720 87099 68944 67623
8312 67623 -2239 -4987 28226 128212 163550 67692 74201 179739 133702 56263 587 41302
8300 41302 -7475 -31910 1986 5161 45819 35563 -15083 -39974 -11569 42951 69700 74885
8288G4885K4949k0678l1993l5435L3598l0778K9095l5848o0568o247J7009k6918
8276f8929O513j4188O994k8652P8882J08979M7232L5867P9422m2778j21000K7933
8264A16275J7199n4896n6608M4999l9497m2968M2492k7104r724P302n7602L7346
8252b2786N2854M3666O8633l4499k9180P0121K836P698J4549p4252J7217q5569
8240C1288r8517j5424N8835P9426l4609K25n7574k1112N6769N3878n3118m3895
8228d3828K5845Q3558N451l1173j2448J3826M4532m7853k3193j9673k3458k3966
8216e2380K8895N5506K1273K5495q3524m6801m5482n5491M1602J7687j7776L1697
8204g9299M3854M5145J19192P061m4646m0796l8887L2948K0571K7451j12771L0870
$$ plain form
8288 74885 99834 79156 47163 11728 45326 14548 43643 7795 -52773 -59020 -42011 -68929
8276 -68929 -62416 -76604 -69610 -98262 -19380 89599 136831 172698 252120 209342 88342 116275
8264 116275 133474 78578 21970 66969 27472 -15496 26996 -108 -9832 -2530 -60132 -22786
8252 -22786 30068 73734 142367 107868 78688 148809 151645 159343 173892 99640 116857 31288
8240 31288 -67229 -82653 -23818 55608 20999 21224 -36350 -57462 -693 53185 67 -43828
8228 -43828 -17983 65575 71026 39853 27405 41231 85763 37910 14717 -4956 -28414 -52380
8216 -52380 -23485 32021 53294 78789 -4735 -51536 -97018 -152509 -110907 -93220 -110996 -79299
8204 -79299 -35445 9700 128892 135953 91307 50511 11624 44572 65143 92594 -20177 10693
8192A0693R4087J5168j3612q9001r3596M2245N575k0703O355M1641P347L2963
8180C9162l0729r4755k3909P7018K7708L9966k9509r2643k2782P2736J04629L3201
8168A00093k9115O313o7284r1470K3627j814N3024Q479o3982m621M6870Q1766
8156F1886l0150p9542k4503N7346J8651p1874k8139l6967L7659K0693P9516J6409
8144B0985o5223l412L0436Q027l4751j9062K9662J79147N1210j20176q0529l9982
8132d3668P986j6255p129O2993L0207o0232o5539R1587L2948l4433P2296L5250
8120A06011q9898m4566j04910M0693J07304N3280J07q8321o2158k235O0255O1073
8108C6635J6022K063l9896p9123j41l8229M1552P1847N8196k6947k3361J7908
$$ plain form
8192 10693 104780 119948 106336 17335 -76261 -34016 -28441 -49144 -42789 -1148 6199 39162
8180 39162 8433 -86322 -110231 -33213 -5505 34461 4952 -87691 -110473 -37737 66892 100093
8168 100093 70978 77291 10007 -81463 -57836 -59650 -6626 1853 -62129 -66750 -19880 61886
8156 61886 31736 -47806 -72309 -14963 3688 -68186 -96325 -133292 -95633 -74940 4576 20985
8144 20985 -44238 -47650 -17214 -9187 -43938 -63000 -33338 145809 197019 76843 -3686 -43668
8132 -43668 -35682 -51937 -59066 3927 34134 -26098 -91637 -50 32898 -1535 70761 106011
8120 106011 16113 -28453 -133363 -92670 14634 67914 68021 -20300 -82458 -84693 -24438 36635
8108 36635 52657 54720 14824 -64299 -64440 -102669 -61117 10730 68926 41979 18618 36526
8096C6526K6373L2685P4640j0859k9374p7802k5244O4211m823m1763L2167L2347
8084A09084p091o7730j1079l4146k2152M4318p1375J4544J48510P0750l9597k05840
8072g1804K3404J03240O4538J8746l8016p5461M2024L4884o0983n3948L4800P6596
8060I8020p5286r7108J321p5902n5625k476J31608L7886J01869N1476J0563L224
8048A29570n097n7425l5300O8133M5748m5838n6448m5159L7155k1219O0235Q9797
8036A64152m7115O902p9824P303J2049K33m4921J4722J4219J6597k039m4787k4639
8023g148K5223K8928J8402K9900P3544m722J6057M7590j106J4684K6137n8293
8011B09196l9102k1682l6553p833L6302Q262j0510L8709R292o1951r6132o7716
$$ plain form
8096 36526 62899 95584 170224 159365 129991 52189 26945 91156 86333 44570 76737 109084
8084 109084 101993 34263 23184 -10962 -33114 11204 -60171 -45627 102883 173633 134036 -71804
8072 -71804 -48400 54840 119378 138124 100108 24647 66671 101555 40572 -13376 21424 98020
8060 98020 22734 -74374 -73053 -148955 -204580 -207056 -75448 -37562 64307 115783 126346 129570
8048 129570 124473 67048 31748 99881 145629 99791 43343 -1816 35339 14120 74355 164152
8036 164152 117037 123939 44115 51418 63467 63700 18779 33501 47720 64317 62278 17491 -7148
8023 -7148 18075 47003 65405 95305 168849 164127 180184 227774 226668 241352 267489 209196
8011 209196 170094 148412 111859 104026 140328 148590 138080 176789 186081 124130 27998 -39718
7999c9718M2865L8086N469l9280K5377O1702M4943k5381L9715J01631L1839k2379
7987B64869M7858K7138O7490P3690o7137n8048L7256K1843k2116N4516m7871l6555
7975C62933J2475m7042m8844M2475K4750J11529l3519q4477m1147m339J5849n9493
7963B51150k5876j7878q0635j3753L1464K3267P4222P6837l1940K0086L6899q7838
7951B56005m2719m91P0277M2977R155j7524J4159L112J0482J0038P5903j0326
7939D21048p2487p9635N319P8747L1494m6885m1267n7457k7873m5710j6340n0947
7927I8007l5531K2715K7084L978R281J8290m5127Q0061P0875j1090p1659K491
7915A69375k1882j18288M6464k6830k19O2351P7585M8551Q377j5244o6135K5071
$$ plain form
7999 -39718 3147 41233 46702 7422 32799 94501 139444 114063 153778 255409 287248 264869
7987 264869 312727 339865 407355 481045 413908 355860 393116 414959 392843 447359 399488 362933
7975 362933 375408 328366 279522 321997 346747 458276 424757 340280 299133 294794 310643 251150
7963 251150 225274 207396 126761 113008 144472 167739 241961 318798 286858 306944 343843 256005
7951 256005 213286 212795 283072 326049 335204 317680 331839 334951 345433 355471 431374 421048
7939 421048 348561 268926 274245 352992 384486 337601 296334 238877 211004 165294 148954 98007
7927 98007 62476 85191 112275 116253 125534 143824 98697 178758 249633 238543 166884 169375
7915 169375 147493 29205 75669 48839 48620 110971 188556 237107 245484 230240 164105 189176
7903A89176J4221k441m5669n1739K9474k1353l1835m4330j43161l4559Q4160J29058
7891G1002J04458L3147N0314J2571q191p6398p7247n3999l9700p3352Q8067J06137
7879A36809K9590m2458r5733J23015Q8767o4781n8139J70954Q6473j40344j11288
7868A22865l7430l0603r724P480j984j5688l417o6397M8367J1144M5268K2639
7856I2520j4980J6779k9895j00626l2908J7898R3206N1071m390r3328q5456o2127
7844a52236p1588N097M4285K4804L6719Q8988M2520p281m1546n65N6747q857k1733
7831d646Q3249P2710j21242m9848K1269n8955n1773J5302K8332M2607O6361P4299
7819A17665N426m726q2012M5136J9471m2407Q9592M4367l3905l7625L997p9231
$$ plain form
7903 189176 203397 200956 155287 103548 133022 111669 79834 35504 -107657 -142216 -58056 71002
7891 71002 175460 208607 258921 271492 263301 186903 109656 55657 15957 -57395 30672 136809
7879 136809 166399 123941 28208 151223 239990 175209 117070 288024 374497 234153 122865
7868 122865 85435 54832 45108 52588 50604 34916 31499 -34898 13469 24613 69881 92520
7856 92520 77540 94319 64424 -36202 -69110 -51212 41994 93065 88675 -4653 -90109 -152236
7844 -152236 -223824 -218727 -174442 -149638 -112919 -23931 18589 11308 -30238 -30803 25944 17087 -4646
7831 -4646 78603 151313 30071 -19777 1492 -57463 -109236 -93934 -65602 -22995 43366 117665
7819 117665 123091 118365 36353 81489 100960 58553 148145 192512 158607 120982 124979 45748
7807D5748m9670p5603j044J27658P1297j4519k5090J4927L1890m681n8932j64498
7795a02517m7996O4825j9230j9731J6018M6970Q9984R3635M9008r0811k6638n2648
7783H69O7437L2327j7873R547k6854O314l0549L6427m1502j6365R785j223j5808
7770A2532r3434l1626J8041l7029M1219n8928K7237k930j8839J00528r594q4590
7758a37413K2321J27213J7622l6808N7296l8050p0028K7920N3360N668l9193j5959
7746b6051K3639j0369j1081k6935k1663Q9449J30569m6400K1046L200n9180K0853
7734H7077m0637o4038j1190L1138l028n297N4944M5873o3891l6393M5486N4893
7722I4937l9754r8083M3651Q5701o3792o6830R427L3778j1579j9575L6127k7727
$$ plain form
7807 45748 -3922 -79525 -80569 47089 118386 103867 78777 93704 125594 120913 61981 -102517
7795 -102517 -150513 -85688 -104918 -124649 -108631 -61661 28323 121958 170966 80155 53517 869
7783 869 68306 100633 82760 92307 65453 71767 41218 77645 36143 19778 29563 28340 12532
7770 12532 -80902 -112528 -94487 -131516 -90297 -149225 -121988 -124918 -143757 -43229 -52823 -137413
7758 -137413 -115092 12121 29743 -7065 50231 12181 -57847 -29927 23433 29101 -10092 -26051
7746 -26051 -2412 -12781 -23862 -50797 -72460 16989 147558 101158 122204 125404 66224 87077
7734 87077 46440 -17598 -28788 2350 -678 -5975 48969 94842 30951 -5442 40044 94937
7722 94937 55183 -42900 751 86452 22660 -44170 -34743 -965 -12544 -32119 4008 -23719
7710b3719J6375p724P391l5487q998j1223k9806m6985M0058R2819R3294l2896
7698E3099J4112M7610j9996m8186l3985j2881q6653J463Q0570o8923j3759L4704
7686e2825j3771p9872p026k1606O35P5015R2944k8776l0485K0013L9407k028K7402
7673A9027K0043O944l4346q1189n9918M0300K1844l9057K0416J2662m8660o0947
7661a82881L07J7735K191Q843R359l297M3077J42518L9804j2806J3921L318r9439
7648a7350m9144q431L0142N3321N3578J0552K1184m2266R031m7403o0940K0233
7636b7493q2425m6964J4965K6331R6333l3020P794J9000J7554m9316M7462K0468
7624A0689Q744N8941q4032n1196J1760K7799k8039k2337p8259N4558P4279L1396
$$ plain form
7710 -23719 -7344 -15068 -7677 -43164 -52162 -63385 -93191 -140176 -100118 -7299 85995 53099
7698 53099 67211 114821 94825 46639 12654 -227 -86880 -85417 -4847 -73770 -87529 -52825
7686 -52825 -66596 -146468 -153494 -175100 -174465 -99450 -6506 -35282 -65767 -45754 -6347 -8375 19027
7673 19027 39070 46014 11668 -69521 -129439 -89139 -67295 -106352 -85936 -73274 -121934 -182881
7661 -182881 -182574 -164839 -162648 -153805 -144446 -147743 -104666 37852 77656 64850 78771 82089 -17350
7648 -17350 -66494 -74925 -44783 8538 62116 72668 93852 51586 60617 13214 -47726 -27493
7636 -27493 -109918 -156882 -141917 -115586 -19253 -52273 -44479 -25479 -7925 -57241 -9779 10689
7624 10689 19433 78374 -5658 -56854 -45094 -17295 -45334 -67671 -145930 -91372 -17093 14303
7612A4303m5405L3569J03505M1002k5296p2378j1907j01030m1181J17492J8967
7601C1641P7094j8487p7305l9477l5100J8609k3894n8152j4526J7267j5700P285
7589a30745K9368Q1353j6969n3850O4812L4128k5008N22j0117l5737j6768j8245
7577i7256j4760K7710m7313O3238O3106j01053l752J14387J7948q6349n4928r167
7565a28189Q817J9954l8356J1500R3226K3286j8018n1270j11704L2209J32092
7554b6453N7784R235N3010p6125l5329j1286P4223K5560q3829j08267k5960j6167
7542a63604J05346L9779K1871k9093j6937j9971o4170L7496L3834r580k6499R0076
7530a452J0908j0339l2871J1704q4171m5650J4563O5950J9244j6068J3932J1768
$$ plain form
7612 14303 -31102 2467 105972 146974 121678 49300 37393 -63637 -104818 12674 31641
7601 31641 108735 90248 12943 -26534 -61634 -43025 -66919 -125071 -139597 -122330 -138030 -130745
7589 -130745 -101377 -20024 -36993 -90843 -26031 8097 -16911 -16389 -26506 -62243 -79011 -97256
7577 -97256 -112016 -84306 -131619 -68381 -5275 -106328 -110080 4307 22255 -64094 -119022 -128189
7565 -128189 -119372 -99418 -137774 -126274 -33048 -9762 -27780 -79050 -190754 -158545 -26453
7554 -26453 31331 40566 93576 17451 -17878 -29164 45059 70619 -13210 -121477 -147437 -163604
7542 -163604 -58258 -18479 3392 -25701 -42638 -62609 -126779 -89283 -55449 -65029 -91528 -1452
7530 -1452 9456 -883 -33754 -22050 -106221 -151871 -137308 -71358 -52114 -68182 -54250 -42482
7518d2482q5451Q687M1117m1950j0901M6469j0192k7610L5707L9445o9850P5435
7506d1576M9954j6O0901J8772o0509k1574k3220k6193O1570J972L3260P60o2053
7493g952n0651k505J6351j2995K6582m8229q085l191N7326K1037m4516l5484n2730
7480a45042N7904J05546J4473n4401K7028L6924K3752K1677n0957r4973k0544
7469g8613J09961r27r404j220j01549L0707M0932m3073r811L871j8739K2102N2564
7456c199k245j0975J2271M25k2844j9907K4159m0532M0661K9357K5778k4457o1970
7443e3478J0360N1502J6108m9892l30q3333k7631J9251M1928P3583k8782P520
7431b3194P6706J8573j0837p3713P6837L3461m6712j4179k4586N6901R0027M8596
$$ plain form
7518 -42482 -127933 -119246 -78129 -120079 -130980 -84511 -94703 -122313 -86606 -47161 -117011 -41576
7506 -41576 8378 8362 69263 88035 27526 5952 -17268 -43461 18109 20081 53341 54101 -7952
7493 -7952 -58603 -61108 -44757 -57752 -31170 -79399 -87484 -90675 -33349 -12312 -56828 -92312 -145042
7480 -145042 -87138 18408 32881 -21520 5508 42432 66184 87861 36904 -58069 -78613
7469 -78613 31348 30421 21017 19797 -81752 -51045 -10113 -53186 -62997 -59126 -77865 -55763 -3199
7456 -3199 -5444 -16419 -4148 -3723 -26567 -46474 -22315 -62847 -22186 7171 32949 8492 -53478
7443 -53478 -43118 8384 24492 -25400 -25730 -109063 -136694 -117443 -75515 -1932 -30714 -23194
7431 -23194 53512 72085 61248 -12465 64372 97833 51121 36942 12356 69257 159284 207880
7419B07880n6068l1722k8286N6317o2059o0474k5365q6147q3870N1640O9560Q7224
7407C8630l6518l3299p3116l3569M1734J10204l2808L1824j08818j8381N0110
7396f4007l4329n578Q2000L0712r436O3792J6217K5799M0394J5928m8655j15427
7384b590j1489N6793R0532l7033K7124O204o9574k5900k6761n8752M276N2950
7372E780l2525K5093R4960n594j03362j12510m3925K2523K7899L4847J2062n2188
7360a26940j132n5385K6791J47263Q8568n5657m4732q4475n6507R65N3942K1820
7348h5479l7657O8620l0862p2069M1309J32475L7799m9017r0158N7656M9959J8436
7336D1012O815q5463j60929J5743K4637k8493R0449J13221M1308K2827m4955m4609
$$ plain form
7419 207880 151812 120090 91804 148121 86062 25588 223 -85924 -169794 -118154 -48594 38630
7407 38630 2112 -31187 -104303 -137872 -96138 14066 -18742 13082 -95736 -114117 -64007
7396 -64007 -98336 -103914 -21914 8798 -638 63154 79371 105170 145564 161492 112837 -2590
7384 -2590 -14079 42714 133246 96213 123337 129541 59967 34067 7306 -51446 -47170 5780
7372 5780 -26745 -1652 93308 87714 -15648 -128158 -172083 -149560 -121661 -86814 -74752 -126940
7360 -126940 -128072 -183457 -156666 -9403 79165 23508 -21224 -105699 -162206 -161241 -107299 -85479
7348 -85479 -123136 -54516 -85378 -157447 -116138 16337 54136 5119 -85039 -27383 22576 41012
7336 41012 47827 -37636 -198565 -182822 -158185 -186678 -96229 16992 58300 81127 36172 -8437
7324h437K5322J4306l0366n8765p8830N13Q6902M5663o153N7292l3271n1172j8169
7311e5165K178M2567L0908j4306k2152L4044j27500o600J07784J02150N102L3503
7299A32513M0802p154j58172j17881k7218M7205K2406l677j4950L9397M5324M0558
$$ plain form
7324 -8437 16885 31191 825 -57940 -136770 -136257 -49355 -3692 -9845 47447 14176 -36996 -55165
7311 -55165 -52987 -10420 20488 6182 -15970 18074 -109426 -116026 -8242 93908 99010 132513
7299 132513 173315 166161 7989 -109892 -137110 -89905 -67499 -71176 -86126 -46729 -1405 39153
$$ [...]
##END NTUPLES=NMR SPECTRUM
##END=
