##TITLE=Analysis number 315368
Compound Code ac 35960
Project Code adrs
Chemist Name frontier sci
##JCAMPDX= 6.0         $$ Bruker NMR JCAMP-DX V2.0
##DATA TYPE= NMR SPECTRUM
##DATA CLASS= NTUPLES
##ORIGIN= Bruker BioSpin GmbH
##OWNER= NMR
$$ XWIN-NMR		Version 3.5
$$ Wed Nov 16 15:20:33 2005 GMT Standard Time (UT+0h)  MAYBRIDGE\NMR@NMR_250MHZ
##.OBSERVE FREQUENCY= 250.131544655141
##.OBSERVE NUCLEUS= ^1H
##.ACQUISITION MODE= SIMULTANEOUS (DQD)
##.ACQUISITION SCHEME= undefined
##.AVERAGES= 16
##.DIGITISER RES= 18
##SPECTROMETER/DATA SYSTEM= dpx250
##.PULSE SEQUENCE= zg30
##.SOLVENT NAME= DMSO
##.SHIFT REFERENCE= (INTERNAL, DMSO, 0, 16.522)
##AUDIT TRAIL= $$ (NUMBER, WHEN, WHO, WHERE, WHAT)
$$ ##TITLE= Audit trail, XWIN-NMR		Version 3.5
$$ ##JCAMPDX= 5.01
$$ ##ORIGIN= Bruker BioSpin GmbH
$$ ##OWNER= NMR
$$ C:\u/data/dgb/nmr/ADRS/12510/pdata/1/auditp.txt
$$ ##AUDIT TRAIL=  $$ (NUMBER, WHEN, WHO, WHERE, WHAT)
(   1,<2005-11-16 15:20:11.20 +000>,<MAYBRIDGE\NMR>,<NMR_250MHZ>,
      <created by zg, POWCHK disabled, PULCHK disabled
       configuration hash MD5:
       62 19 C7 07 E1 42 D1 B7 37 6C 3D D0 77 39 F9 E6
       data hash MD5: 64K
       09 11 58 07 AF E1 57 2A 01 7E F6 74 B7 37 B8 60>)
(   2,<2005-11-16 15:20:23.79 +000>,<MAYBRIDGE\NMR>,<NMR_250MHZ>,
      <Start of raw data processing
       ef LB = 0.3 FT_mod = 6 PKNL = 1 SI = 32K 
       data hash MD5: 32K
       7A 07 3D 4B 75 18 13 F1 63 84 29 A3 C6 D9 69 C5>)
(   3,<2005-11-16 15:20:26.04 +000>,<MAYBRIDGE\NMR>,<NMR_250MHZ>,
      <apk 
       data hash MD5: 32K
       42 60 D3 B5 C7 6C 63 A1 C7 F4 ED 74 78 D0 6B 31>)
(   4,<2005-11-16 15:20:26.85 +000>,<MAYBRIDGE\NMR>,<NMR_250MHZ>,
      <abs ABSG = 5 
       data hash MD5: 32K
       1B CB 7C 8C E8 AB 4F 5A 8D E9 D2 F9 E0 C2 3F 0B>)
$$ ##END=
$$ 
$$ hash MD5
$$ 41 02 46 3C 32 F9 52 FC 2F FE 16 84 22 EC FD EA
##$RELAX= 
##$RELAX= 
##$RELAX= 
##$RELAX= 
##$RELAX= 
##$RELAX= 
##$RELAX= 
$$ Bruker specific parameters
$$ --------------------------
##$DU= <C:\u>
##$EXPNO= 12510
##$NAME= <ADRS>
##$PROCNO= 1
##$TYPE= <nmr>
##$USER= <dgb>
##$AMP= (0..31)
100 100 100 100 100 100 100 100 100 100 100 100 100 100 100 100 100 100 
100 100 100 100 100 100 100 100 100 100 100 100 100 100 
##$AQSEQ= 0
##$AQ_mod= 3
##$AUNM= <au_zg>
##$AUTOPOS= <43 >
##$BF1= 250.13
##$BF2= 250.13
##$BF3= 250.13
##$BF4= 250.13
##$BF5= 500.13
##$BF6= 500.13
##$BF7= 500.13
##$BF8= 500.13
##$BYTORDA= 1
##$CFDGTYP= 0
##$CFRGTYP= 5
##$CHEMSTR= <none>
##$CNST= (0..31)
1 1 145 1 1 1 1 1 1 1 1 1 1 1 1 1 1 1 1 1 1 1 1 1 1 1 1 1 1 1 1 1 
##$CPDPRG= <>
##$CPDPRG1= <>
##$CPDPRG2= <>
##$CPDPRG3= <>
##$CPDPRG4= <mlev>
##$CPDPRG5= <mlev>
##$CPDPRG6= <mlev>
##$CPDPRG7= <mlev>
##$CPDPRG8= <mlev>
##$CPDPRGB= <>
##$CPDPRGT= <>
##$D= (0..31)
0 1 0 0 0 0 0 0 0 0.06 0 0 0 0 0 0 0.0002 0 0 0 0 0 0 0 0 0 0 0 0 0 0 
0 
##$DATE= 1132154410
##$DBL= (0..7)
120 120 120 120 120 120 120 120 
##$DBP= (0..7)
150 150 150 150 150 150 150 150 
##$DBP07= 0
##$DBPNAM0= <>
##$DBPNAM1= <>
##$DBPNAM2= <>
$$ [...]
##$SUBNAM7= <"">
##$SUBNAM8= <"">
##$SUBNAM9= <"">
##$SW= 20.6930455092707
##$SWIBOX= (0..15)
0 0 3 0 0 0 0 0 0 0 0 0 0 0 0 0 
##$SW_h= 5175.983436853
##$TD= 65536
##$TD0= 1
##$TE= 295.16
##$TE2= 300
##$TE3= 300
##$TEG= 300
##$TL= (0..7)
0 120 120 120 120 120 120 120 
##$TP= (0..7)
150 150 150 150 150 150 150 150 
##$TP07= 0
##$TPNAME0= <>
##$TPNAME1= <>
##$TPNAME2= <>
##$TPNAME3= <>
##$TPNAME4= <>
##$TPNAME5= <>
##$TPNAME6= <>
##$TPNAME7= <>
##$TPOAL= (0..7)
0.5 0.5 0.5 0.5 0.5 0.5 0.5 0.5 
##$TPOFFS= (0..7)
0 0 0 0 0 0 0 0 
##$TUNHIN= 0
##$TUNHOUT= 0
##$TUNXOUT= 0
##$USERA1= <user>
##$USERA2= <user>
##$USERA3= <user>
##$USERA4= <user>
##$USERA5= <user>
##$V9= 5
##$VALIST= <valist>
##$VCLIST= <CCCCCCCCCCCCCCC>
##$VD= 0
##$VDLIST= <DDDDDDDDDDDDDDD>
##$VPLIST= <PPPPPPPPPPPPPPP>
##$VTLIST= <TTTTTTTTTTTTTTT>
##$WBST= 1024
##$WBSW= 4
##$XGAIN= (0..3)
0 0 0 0 
##$XL= 0
##$YL= 0
##$YMAX_a= 565451
##$YMIN_a= -404646
##$ZGOPTNS= <>
##$ZL1= 120
##$ZL2= 120
##$ZL3= 120
##$ZL4= 120
##$ABSF1= 16.522
##$ABSF2= -4.171173
##$ABSG= 5
##$ABSL= 3
##$ALPHA= 0
##$AQORDER= 0
##$ASSFAC= 0
##$ASSFACI= 0
##$ASSFACX= 0
##$ASSWID= 0
##$AUNMP= <proc_1d>
##$AZFE= 0.1
##$AZFW= 0.1
##$BCFW= 0
##$BC_mod= 0
##$BYTORDP= 0
##$COROFFS= 0
##$CY= 12.5
##$DATMOD= 1
##$DC= 0
##$DFILT= <>
##$DTYPP= 0
##$F1P= 14.0000005364418
##$F2P= -0.99999901652339
##$FCOR= 0.5
##$FTSIZE= 32768
##$FT_mod= 6
##$GAMMA= 0
##$GB= 0
##$INTBC= 1
##$INTSCL= 1
##$ISEN= 128
##$LB= 0.3
##$LEV0= 0
##$LPBIN= 0
##$MAXI= 10000
##$MC2= 0
##$MEAN= 0
##$ME_mod= 0
##$MI= 0
##$NCOEF= 0
##$NC_proc= -3
##$NLEV= 6
##$NOISF1= 0
##$NOISF2= 0
##$NSP= 0
##$NTH_PI= 0
##$NZP= 0
##$OFFSET= 16.522
##$PC= 1
##$PHC0= 43.57211
##$PHC1= 69.48093
##$PH_mod= 1
##$PKNL= yes
##$PPARMOD= 0
##$PSCAL= 4
##$PSIGN= 0
##$REVERSE= no
##$SF= 250.13
##$SI= 32768
##$SIGF1= 0
##$SIGF2= 0
##$SINO= 400
##$SIOLD= 32768
##$SREGLST= <1H.DMSO>
##$SSB= 0
##$STSI= 32768
##$STSR= 0
##$SW_p= 5175.98343685301
##$SYMM= 0
##$S_DEV= 0
##$TDeff= 65536
##$TDoff= 0
##$TI= <Analysis number 999999
Compound Code 99
Book Reference 9
Project Code 9>
##$TILT= no
##$TM1= 0
##$TM2= 0
##$TOPLEV= 0
##$USERP1= <user>
##$USERP2= <user>
##$USERP3= <user>
##$USERP4= <user>
##$USERP5= <user>
##$WDW= 1
##$XDIM= 32768
##$YMAX_p= 316592359
##$YMIN_p= -4339633
$$ End of Bruker specific parameters
$$ ---------------------------------
##NTUPLES= NMR SPECTRUM
##VAR_NAME=  FREQUENCY,     SPECTRUM/REAL,   SPECTRUM/IMAG
##SYMBOL=    X,             R,               I
##VAR_TYPE=  INDEPENDENT,   DEPENDENT,       DEPENDENT
##VAR_FORM=  AFFN,          ASDF,            ASDF
##VAR_DIM=   32768,         32768,           32768
##UNITS=     HZ,            ARBITRARY UNITS, ARBITRARY UNITS
##FACTOR=    0.157963299565203, 1,           1
##FIRST=     4132.6476996994, 0,             0
##LAST=      -1043.33573715361, 0,           0
##MIN=       -1043.33573715361, -4339633,    0
##MAX=       4132.6476996994, 316592359,     0
$$ Real data points
##PAGE= N=1
##DATA TABLE= (X++(R..R)), XYDATA
$$ [...]
19677 2620783 2628660 2627628 2633348 2650152 2704121 2693754 2683104 2728895 2741220 2739708 2763073 2750447
19665 2750447 2764646 2776066 2754455 2734970 2774223 2829026 2871962 2905247 2923353 2932184 2938501 2956685
19653 2956685 2944160 2894834 2922119 2941837 2941388 2977655 3030822 3056279 3070596 3090241 3054018 3065881
19641 3065881 3088796 3140305 3155620 3161486 3088207 3101974 3151058 3178150 3173674 3210766 3258439 3334059
19629 3334059 3352221 3365706 3370384 3363058 3370759 3403940 3423428 3427341 3406850 3419418 3493836 3539754
19617 3539754 3508415 3469794 3479873 3520581 3555893 3588832 3611728 3628099 3658734 3689323 3695043
19606 3695043 3678207 3718286 3743115 3749474 3777827 3793969 3846479 3893346 3868663 3866229 3882097 3914005
19594 3914005 3964112 3997520 3985079 4005615 4032570 4066689 4132581 4146432 4123946 4153365 4238124
19583 4238124 4247060 4265999 4268982 4269841 4290339 4323222 4349881 4347363 4380686 4384756 4363389 4391561
19571 4391561 4413107 4437978 4490528 4492958 4524212 4509795 4556943 4580584 4583985 4588680 4649731 4690373
19559 4690373 4703265 4721112 4781751 4782984 4762106 4801030 4817100 4832906 4840821 4865484 4929046 4964252
19547 4964252 4970991 4948004 4940116 4986106 5038694 5070322 5065818 5093622 5153265 5199489 5246341 5245981
19535 5245981 5255322 5281192 5276242 5282000 5320968 5386500 5442061 5486793 5489947 5481163 5488998 5510170
19523 5510170 5533216 5520175 5539058 5593542 5622952 5632526 5639282 5670265 5719429 5739555 5700441 5761802
19511 5761802 5785247 5816861 5857814 5867898 5888372 5864372 5846320 5862812 5894472 5899219 5890236 5916154
19499 5916154 5922802 5964696 5981855 5968860 6015570 6022191 5996195 5996315 6007911 6030425 6035093 6051781
19487 6051781 6077314 6097536 6132551 6151973 6125259 6155285 6212103 6248483 6229606 6246488 6284787
19476 6284787 6317989 6332719 6310163 6311128 6326783 6349813 6343816 6314297 6310108 6328121 6363076 6357633
19464 6357633 6362277 6359481 6384456 6392586 6433590 6459198 6472724 6436753 6410246 6408665 6424945 6394278
19452 6394278 6370789 6368988 6380365 6406356 6418648 6417539 6437310 6414062 6366307 6407885 6476306 6471486
19440 6471486 6441319 6378184 6345527 6371493 6393958 6366304 6365649 6363299 6374684 6374319 6367985 6363925 6408594
19427 6408594 6386469 6387276 6403826 6436495 6419711 6366604 6295100 6247596 6261630 6280842 6252127 6241402
19415 6241402 6232748 6171040 6166962 6200617 6200911 6187774 6130279 6093642 6114869 6120963 6121254 6111579 6025362
19402 6025362 5981327 5961163 5957960 5983991 5968453 5950722 5935270 5915933 5935415 5930913 5875776 5830001
19390 5830001 5853699 5846935 5814447 5784507 5780567 5739147 5723447 5692770 5690894 5712116 5712042 5674326
19378 5674326 5680213 5646761 5563992 5534598 5531027 5518686 5474389 5432549 5416344 5407072 5408359 5406114
19366 5406114 5378124 5334830 5337719 5341707 5314392 5286865 5289599 5280028 5222478 5162895 5127316 5075021
19354 5075021 5040742 5049959 5066723 5061135 5061176 5034813 4989378 4957325 4944726 4922455 4894539 4884123
19342 4884123 4847752 4818816 4837359 4815859 4767145 4708438 4673738 4629502 4615734 4623748 4597354
19331 4597354 4557009 4543792 4527789 4513712 4470114 4483113 4458411 4417146 4419723 4416541 4426953 4396104
19319 4396104 4350095 4286901 4231085 4239548 4235598 4241708 4198126 4101042 4088539 4057632 4042081 4009470
19307 4009470 3964812 3932030 3948371 3938241 3920858 3936693 3930711 3890488 3866450 3830872 3800999
19296 3800999 3826545 3813287 3771333 3709303 3664943 3673019 3694592 3682136 3656500 3663139 3661273 3622836
19284 3622836 3581192 3557764 3524678 3511391 3521412 3524413 3483320 3464670 3426950 3416469 3387371
19273 3387371 3377384 3372064 3326330 3273171 3196110 3174799 3228003 3230463 3232922 3241418 3221313 3198859
19261 3198859 3148507 3121537 3132437 3134065 3060554 3012947 2961391 2918644 2947749 2963712 2984142
19250 2984142 2972064 2938380 2913444 2902557 2892197 2898466 2868652 2806555 2790600 2813699 2864049
19239 2864049 2849357 2798807 2757633 2766553 2752812 2739250 2716738 2701230 2700884 2649745 2607833 2590455
19227 2590455 2628691 2651436 2651185 2629792 2592948 2582019 2596611 2569126 2567407 2562903 2521190 2462544
19215 2462544 2429305 2467898 2429142 2380636 2416723 2439736 2405503 2363433 2351215 2366686 2332919
19204 2332919 2321724 2289139 2239572 2242662 2240379 2203784 2169509 2146068 2133885 2164331 2222207 2201635
19192 2201635 2172875 2179186 2191603 2174842 2158154 2168498 2124512 2116631 2118245 2122714 2097315 2057525
19180 2057525 2035337 2027660 2038978 2022244 2003225 1998835 1991514 1974635 1960592 1957981 1932675 1928012
19168 1928012 1953878 1973769 1971086 1970896 1981340 1949741 1903991 1899141 1911663 1902659 1912810 1902746
19156 1902746 1876433 1879300 1858315 1820448 1801287 1784013 1768302 1766130 1708388 1671291 1688228 1737199
19144 1737199 1807166 1823409 1830779 1773087 1767613 1749764 1694891 1641138 1562154 1552396 1550462 1525435
19132 1525435 1546832 1549490 1555126 1544167 1539730 1563933 1586181 1579260 1569504 1548860 1538711 1520532
19120 1520532 1579245 1566287 1499743 1476400 1492720 1486653 1468844 1450777 1406730 1351884 1322300
19109 1322300 1343366 1336654 1383665 1448971 1423402 1398247 1430328 1423721 1422574 1403957 1423326 1448644
19097 1448644 1433450 1442609 1398434 1381736 1358696 1343723 1327203 1304408 1360053 1422520 1394542
19086 1394542 1346716 1290375 1255114 1259287 1253470 1254540 1272164 1293916 1294970 1301372 1274635 1273587
19074 1273587 1271567 1273313 1254553 1241196 1214428 1198760 1206929 1217041 1189096 1191302 1206751 1193926
19062 1193926 1127745 1103049 1162049 1168892 1187915 1229946 1234423 1189496 1127122 1129039 1119751 1087773
19050 1087773 1071759 1131730 1133946 1117431 1123328 1137117 1143806 1184955 1197926 1152722 1139275 1114836
19038 1114836 1107590 1086683 1079579 1095360 1066675 1036750 1004108 996304 1058936 1103202 1095467 1073741
19026 1073741 1062879 1046642 1015517 998091 1057522 1083473 1055715 1011229 1013828 1018125 997997 1029484
19014 1029484 986660 999829 1027859 1014108 1013679 990146 994445 985752 970429 992823 979151 993187
19002 993187 1005336 966868 986858 1003594 960757 946620 987109 1008532 971135 963872 985563 996869
18990 996869 999909 986281 935514 921080 912867 933116 944484 927735 936599 954714 950281 921301
18978 921301 884819 907289 897574 871459 896747 893215 888478 889079 882309 855756 866107 926327 914754
18965 914754 884326 880512 906226 916064 905443 914164 896043 892067 859426 840323 911352 905581
18953 905581 900991 914036 916289 920034 923724 886115 843994 833859 840481 856315 890563 891734 890342
18940 890342 914739 928494 952476 939543 962359 1027566 1054732 1088856 1153325 1199114 1232311
18929 1232311 1248379 1252758 1225828 1247231 1270362 1268680 1254849 1220850 1212963 1145258 1072632 982784
18917 982784 978481 967039 927796 903318 854903 788425 774534 757043 757192 721094 710115 732212
18905 732212 727319 713807 707723 712012 701949 706870 741577 727743 723181 749599 728337 704737
18893 704737 710512 664614 649264 709683 729113 717559 755030 793270 747458 716592 729547 727085
18881 727085 698473 708135 756182 754238 697378 687005 708223 698966 701830 692443 666588 650348
18869 650348 662258 657432 690971 717103 726748 729751 750902 743156 695876 640839 612739 608477
18857 608477 621711 640929 618585 668481 664084 647805 665889 672594 706165 729198 722689 709192
18845 709192 714524 708643 715224 712537 684380 659902 649027 646354 631702 587591 594334 611699 628895
18832 628895 633777 635227 629384 631798 666219 619048 646365 653249 639499 631608 691815 715107 712605
18819 712605 678594 660702 656015 651282 609973 626049 657015 665522 687976 670981 631741 612231
18807 612231 619399 602390 592107 636519 699073 706293 673001 689828 669025 598179 556702 630304
18795 630304 672017 708705 722762 737600 722787 648058 612288 605166 629170 649572 672211 666098
18783 666098 660879 639481 619563 625787 613934 613419 620248 620403 608016 590858 547578 555983 574199
18770 574199 568483 580625 571901 552044 522340 523137 548265 600034 634057 640136 674197 699544
18758 699544 679357 627196 646168 672243 708941 721104 667618 655505 701288 757056 820462
18747 820462 799081 784502 821306 868197 907331 923383 920137 953197 934469 921129 959832 1018752
18735 1018752 1041590 1026600 1000198 985033 928653 906111 869764 874430 895388 880902 810326
18724 810326 762080 746641 740230 729527 750476 739788 648471 578332 560874 562314 537708 520937
18712 520937 541986 590314 593928 583237 561068 550269 553818 571719 618494 620977 582265 561552
18700 561552 593836 616810 635105 608673 614000 586551 561907 533926 545165 594368 560732 534864
18688 534864 546172 523557 521421 555645 540376 485062 493599 525198 557755 565321 540263 566869
18676 566869 599148 594624 608730 660013 730975 703263 676275 655407 672610 671122 662604 655388
18664 655388 661661 657729 638969 627891 648700 610678 628959 635627 628276 595042 539149 499601
18652 499601 530744 525936 512209 554492 608303 625368 639950 629495 625914 639705 613252 622446
18640 622446 663566 621835 589608 574624 582716 544746 550832 575682 579534 566247 606019 639227
18628 639227 642631 633627 630530 590336 598591 643850 624108 600673 582266 584940 576841 598073 624599
18615 624599 671438 697108 734201 716677 734707 716416 742434 767038 764500 800899 851464 854443
18603 854443 779142 759672 676642 618825 601555 571436 586886 610907 609823 621097 625436 654465
18591 654465 644325 637871 693949 699941 686645 683319 675649 677755 705225 733438 752223 761357 758141
18578 758141 791023 807051 815619 835719 841505 830165 813024 770033 701067 645966 618474 616540
18566 616540 650208 692392 737638 779065 783604 788582 806609 768377 726732 754541 766994 755567
18554 755567 772422 784818 760038 774371 770746 753034 721178 724050 763918 802208 818940 835783
18542 835783 895584 899914 911538 906267 862655 851995 851132 901967 901144 893632 883509 902897 855466
18529 855466 826439 872660 894390 866593 844413 838406 853665 854413 855435 848041 854703 881896 842292
18516 842292 841026 841649 864199 868514 830505 844722 897017 931730 938425 933299 939099 962152 943079
18503 943079 965008 962655 1002073 1013515 1034617 1038171 1010647 1008727 1010122 999984 1021202 1020323 1000824
18490 1000824 1013371 1025458 1058338 1045568 1042104 1067588 1125613 1124499 1146258 1210181 1260024 1281209
18478 1281209 1294476 1326383 1320314 1336240 1317308 1307831 1381598 1410279 1459150 1500746 1567232 1598447
18466 1598447 1587409 1592058 1622486 1688997 1723616 1758511 1781267 1782386 1825514 1923689 1996322 2046606
18454 2046606 2096286 2166852 2269757 2418717 2636148 2876902 3082040 3319840 3517652 3699991
18444 3699991 3891641 4128208 4433427 4748552 5055143 5260833 5446313 5553112 5611273 5719707
18434 5719707 5826444 6060327 6377364 6788568 7337557 8146592 9196561 10580644 12371668
18425 12371668 14766825 18045286 22743722 29450990 38697210 50721532 64808976 78229687
18417 78229687 87134024 91292262 92692638 90876362 87820644 87628385 91070495 94799248
18409 94799248 94513828 90246508 82401854 69462510 54151400 40627356 30256482 22744324
18401 22744324 17514615 13823442 11221442 9312130 7872871 6745626 5880603 5222063
18393 5222063 4673237 4262155 3971715 3712418 3447276 3184319 2964600 2778875 2627046
18384 2627046 2467836 2287229 2145676 2030722 1890764 1771584 1628000 1503497 1399748
18375 1399748 1284151 1148287 1035191 939333 793114 668371 604763 534543 475626 396412
18365 396412 369200 338065 339085 333688 292263 256879 236862 227677 231746 249121 325845 373275
18353 373275 350340 373994 409219 461567 500941 563840 613984 637514 649295 636915 615713
18342 615713 624843 640074 683076 694426 700996 676798 610653 532414 449617 418261 345546 292522
18330 292522 275849 242974 229235 217544 267046 254750 240707 265978 281712 288255 342926 368653
18318 368653 375615 365010 346320 343276 349371 396781 464952 491078 510897 530449 540587 578379
18306 578379 607849 600312 671085 741858 772045 795712 782821 789157 828684 902947 940872 1009908
18294 1009908 1063393 1096671 1144081 1194307 1243090 1210747 1122786 1012957 911893 901281 869580
18283 869580 816100 766010 705500 654164 662767 652708 573265 563367 547323 484423 441344 467449
18271 467449 519928 536936 543911 572818 594956 633573 666931 694055 676269 658052 675432 678613
18259 678613 695554 734670 788983 854659 910779 936067 929681 905840 911764 981339 1006449 1006845
18247 1006845 1033219 1061708 968904 900683 940411 896643 864834 920623 934393 928052 926872 921964
18235 921964 901879 889933 875271 911669 938508 928949 919033 915381 932815 944179 999383 1049788
18223 1049788 1088703 1085162 1089101 1131453 1165390 1231930 1332241 1404711 1490391 1549357 1559731
18212 1559731 1547281 1605687 1701780 1800081 1893887 1992764 2030856 2064541 2093143 2120557 2219769
18201 2219769 2339113 2484577 2600535 2684570 2805348 2945437 3102627 3309224 3521189 3723401
18191 3723401 3927367 4195244 4514756 4879221 5297971 5828970 6470297 7243559 8226245
18182 8226245 9416117 10922499 13017919 15799664 19209177 22864736 26378943 29846668
18174 29846668 34206439 40986815 50841332 61684888 67459504 65220511 60818161 60498138
18166 60498138 66742041 78886441 91388545 94825773 85859941 71503093 60977887
18159 60977887 57526246 59508753 63084703 62163263 53514225 42149440 33405043 28033564
18151 28033564 24565966 21660675 18569719 15337919 12387223 10025162 8354604 7250448
18143 7250448 6568513 6040883 5568203 5109054 4682804 4356122 4161172 4018244 3883680
18134 3883680 3689740 3429158 3175897 2862404 2591569 2407391 2231882 2025019 1809650
18125 1809650 1595054 1435003 1280524 1151936 1086927 1018982 936262 801261 692935 644670
18115 644670 598116 602328 593492 590422 513964 420248 367465 336168 299165 249328 215056 192064
18103 192064 166749 142724 124253 92927 60138 -1533 9380 -12460 -73888 -63586 -2262
18092 -2262 65672 60158 73184 103357 149136 148853 104172 117509 150996 170817 189172 207933
18080 207933 187434 168550 187052 217308 222487 197243 181017 119431 121464 143834 133050 92195
18068 92195 115742 84307 44294 38234 70243 86813 54910 45042 15518 -15234 -26075 -34263
18056 -34263 -44528 -11770 -11639 -33115 -25165 -9216 -59469 -87995 -71799 -41954 -33134 -25516 -4422
18043 -4422 -17864 15317 5159 -8675 -23080 -50001 -64135 -90997 -82677 -76236 -88175 -86983
18031 -86983 -89703 -101440 -84769 -33449 -54129 -63219 -64021 -70927 -90539 -105444 -72222 -86876 -85799
18018 -85799 -103681 -129660 -76115 -37027 -13687 -6622 -16073 -1143 12643 20300 17136 21478 36875
18005 36875 25948 -9178 -8985 -1547 -47543 -58596 -19181 -21893 -21552 -14831 13134 45154 47992
17992 47992 60846 81779 84742 70168 68583 68028 98963 129388 155257 126259 121001 115119 81180
17979 81180 95043 110754 123052 121781 153738 180051 222919 299289 337293 324363 326168 359229
17967 359229 422301 461722 439331 469539 535901 658147 794094 900285 1019092 1132294
17957 1132294 1317436 1538507 1771289 1975651 2221327 2487708 2732741 2994454 3190364
17948 3190364 3369344 3530082 3706942 3909160 4092555 4197297 4196384 4147891 4010680 3817977
17938 3817977 3637886 3508708 3398906 3167766 2877555 2611675 2341634 2093806 1823078
17929 1823078 1571938 1391779 1260345 1052647 901642 864879 737495 592938 501006 500543
17919 500543 510708 503149 445782 426068 405416 384168 413318 426945 441617 474547 486739 495364
17907 495364 474014 483017 528076 557484 591932 679883 730954 793693 890361 987935 1122431
17896 1122431 1231231 1320718 1411979 1501015 1647199 1797843 2002103 2288014 2573963 2835033
17886 2835033 3114837 3468126 3814994 4135973 4426821 4681260 4886033 4965226 4958211 4897995
17876 4897995 4784012 4658061 4549707 4341446 4069204 3764894 3370421 2956830 2536413
17867 2536413 2136626 1813629 1545479 1307004 1162476 1043534 899126 741757 677304 641973
17857 641973 569064 474762 422126 410323 403565 357747 361763 341311 274950 266862 267189 249191
17845 249191 207549 164675 207551 194672 202090 185591 165747 131439 90701 54348 58343 94257
17833 94257 97464 66929 68579 89484 58451 41065 54619 35349 -31791 -42546 -37697 -27756
17821 -27756 -20426 -19328 -9218 37429 879 -25566 -14248 12406 38576 77855 107371 93540
17809 93540 38400 15790 23348 13286 10578 19528 67092 66100 61472 75690 102014 109699 70729
17796 70729 39209 44591 19990 -3490 -13114 30521 68822 71401 42706 36181 47495 41461 18052
17783 18052 20638 81864 106325 88940 77885 90289 135913 133870 105480 127591 136338 171571
17771 171571 192194 206050 222459 250293 233743 219298 204919 178065 150608 177159 147703
17760 147703 114405 128228 150260 142535 149190 154405 174140 168737 125783 49108 36179 44561
17748 44561 80157 99719 123675 133551 153087 163999 100504 73551 38846 91694 153988 174806
17736 174806 163068 162686 137483 126618 105890 107983 129014 139567 143006 151790 143018 145754 200437
17723 200437 288427 355584 373725 415084 475475 572391 622795 690577 778901 890406 977497
17712 977497 1023321 1028730 1086330 1147204 1266709 1310317 1332117 1325417 1288756 1275415 1249191 1184731
17700 1184731 1118678 1072846 1020832 947619 829960 710240 612648 532856 477595 428056 388435
17689 388435 371348 357017 340088 284599 234313 221346 190060 192670 163228 149731 133267 116899
17677 116899 96164 87993 95532 126683 128502 128729 157371 130988 89157 91033 85401 69057 137848
17664 137848 105054 83236 81287 68289 67604 79442 49984 33393 35640 24162 84294 139777
17652 139777 138256 118736 92801 161818 230810 232069 208070 268585 318271 317434 321700 299794
17640 299794 281460 189578 167342 159956 163210 211987 143201 129345 140404 141418 190393 211816
17628 211816 233950 254418 208088 145943 161264 174331 176380 184467 232805 225533 227166 253811
17616 253811 304812 287874 273630 274199 274662 266191 240230 210073 190167 196120 211686 208593 197166
17603 197166 188009 190729 193531 223619 242693 247033 273738 333880 376004 432540 440914 469569
17591 469569 486781 529368 502766 478378 464349 518778 563341 589060 571768 469317 418314
17580 418314 379224 379822 418959 428402 402927 371719 301975 255562 277243 228235 167139 158382
17568 158382 191690 209580 181978 180889 168004 171312 184202 166360 174543 223506 247004 254712
17556 254712 202306 189253 176418 169434 173195 185501 197712 176734 181970 181911 210482 221302 269329
17543 269329 317721 341146 397960 498626 572562 635092 805149 963667 1079268 1187698
17533 1187698 1319017 1432618 1513869 1603800 1631849 1609120 1557015 1566887 1614319 1610695 1541246
17522 1541246 1445162 1250019 1105002 994092 844692 718977 661629 593284 482660 449809
17512 449809 370997 302677 283614 266013 267673 276354 270446 242043 226610 241934 254790 267899
17500 267899 284155 262789 222477 182895 174217 204273 240499 247073 229921 234287 239262 205383
17488 205383 204431 217574 207841 160009 154602 195201 191760 127106 127076 166202 164531 137891 114541
17475 114541 93794 121314 112283 90716 139336 143570 153824 157220 149371 173713 132617 104031
17463 104031 130583 116288 147770 168584 198298 215237 260655 304629 369793 328384 373382
17452 373382 419631 497243 634023 686468 664029 594097 573728 545652 592026 699635 723572
17441 723572 652220 580572 533758 511690 514981 558651 568460 538093 490244 511611 543981 586215
17429 586215 649025 714853 683769 608878 522279 529041 551955 634344 730620 757417 629835
17418 629835 538399 448715 394856 354727 322628 275864 251342 233313 201874 196650 231418 235042
17406 235042 195762 167917 172756 190976 213036 210837 196388 190299 166079 155184 159520 130775
17394 130775 119077 156800 170322 171280 193218 199672 156165 160742 124677 90934 139288 148564
17382 148564 141615 191113 239957 221818 191925 191660 185249 186200 219115 186414 181708 179870 178525
17369 178525 167825 190912 214998 262094 264783 237406 214509 183816 168319 177626 208016 215731
17357 215731 224555 214571 210009 167029 136102 161770 188910 150117 136474 90114 79663 127303
17345 127303 157339 179952 197880 180239 179292 199112 206195 208344 165767 157966 164428 177014 177309
17332 177309 175038 182254 161787 132265 127872 209250 213229 196348 182007 161061 169541 153415
17320 153415 165878 182519 219006 239025 198693 186625 204754 190120 163029 153154 205111 211006
17308 211006 184622 184880 222468 242798 232591 205430 159305 159182 174303 166476 192011 217837
17296 217837 211279 193637 181345 180298 152160 170578 152816 184108 203155 226784 204268 176481
17284 176481 161933 166807 139167 148436 198486 210107 225459 205060 161489 153770 164411 178177
17272 178177 181112 140252 129548 155128 169161 214793 246168 252329 238267 238404 266649 289643
17260 289643 255665 234705 206347 197717 239262 256939 198042 173393 161910 189609 207846 214307
17248 214307 193284 237862 291304 246917 202639 169155 182249 206605 187792 164168 154102
17237 154102 205055 266411 259096 239222 250331 216055 182661 189544 205009 218511 235534 229050
17225 229050 207510 186226 189254 145814 199192 227954 217791 231851 217148 218445 214075 238437
17213 238437 218791 208430 208255 208027 194252 211173 238237 215075 206797 215147 199060 217802 236713
17200 236713 196846 169804 213033 234806 229214 258095 255309 282066 270372 297529 294222 264739
17188 264739 214219 197526 256241 237859 200439 174342 180975 202377 189114 195911 211454 214675
17176 214675 201503 203969 201855 203005 229520 232921 230806 234454 208268 236468 249500 263309 289664
17163 289664 269706 230319 187355 198249 194832 191721 213894 213904 234715 246903 245525 273776 238635
17150 238635 225790 252339 262438 233222 226444 217887 193022 224053 250946 207674 176359 157781
17138 157781 166474 189249 225768 268360 250421 239940 244171 284930 306508 276346 291578 298097
17126 298097 263635 275099 256055 227513 265138 293897 262173 298356 308350 286173 277608 241105
17114 241105 241494 258039 268363 324128 355097 338744 295529 248936 203349 190237 215111 228469
17102 228469 243586 227277 215608 241221 272437 261642 262283 281734 258641 255735 211730 215749
17090 215749 268119 236751 202163 217772 262137 260051 259150 197079 199217 224442 262445 258617
17078 258617 259956 242857 258703 271460 274844 267299 262341 268436 255748 251590 267376 274987 290300
17065 290300 320842 365557 339562 297297 266752 250556 240424 222592 242858 275023 241855
17054 241855 242084 257623 284764 285819 290312 274426 240638 242386 289659 302952 282942 283660 254668
17041 254668 281424 252765 234869 221501 197307 205519 221757 249857 254742 269550 237548 205439
17029 205439 257372 284754 312111 318998 367786 371459 340688 290502 249842 251527 249168 239074
17017 239074 229709 256219 298087 289058 240787 261271 269844 255707 239104 238729 272774 270037 239821
17004 239821 227705 214356 219640 259286 295265 340069 331159 290458 247055 216824 217536 232844
16992 232844 268843 289489 295071 288190 288225 271011 257350 235604 293878 317777 266138 280747
16980 280747 288108 293534 301520 314705 247930 219649 218346 226712 265626 293825 290931 257781 300230
16967 300230 293575 263760 260775 295862 324346 320283 302527 270149 234286 230211 232804 255128
16955 255128 260444 317280 368109 306818 269587 274510 274676 309575 301325 283839 284063 316168 345490
16942 345490 342218 302687 238611 219560 252389 289298 314004 326046 299373 239273 240683 283685
16930 283685 284012 299561 311772 310224 335218 334391 307908 295784 261124 265043 291392 288107 336214
16917 336214 342242 319673 279344 270432 256384 280411 305061 285722 266128 271988 235035 260388
16905 260388 301989 267314 239039 236403 229687 234192 253218 232173 229539 210015 179984 196333
16893 196333 208756 200203 219613 284467 298303 278050 284165 252834 237436 252953 255238 291844
16881 291844 337819 344574 299746 289089 279635 277353 309115 317488 313667 297955 273301 237020
16869 237020 259061 260959 256441 275837 292340 308261 288766 237735 247268 284282 298617 316751
16857 316751 340939 346367 314566 285493 280028 307039 286251 272728 271272 265113 264164 259461 215597
16844 215597 204380 224328 242162 247395 263127 254628 279036 275207 303858 303013 302112 296365 288024
16831 288024 277108 304459 316261 284471 251438 279957 319263 317101 334608 348745 322333 280190
16819 280190 284123 296475 294350 272649 262041 292556 303544 273544 257330 206605 204663 200479
16807 200479 186885 181862 206740 205361 241760 240560 270985 240386 227991 257477 274506 292936
16795 292936 286926 298631 293320 279857 279335 317321 328988 298997 266156 273797 310631 258578
16783 258578 252189 293596 305064 320648 286386 220806 240607 267654 213784 201559 213169 235406
16771 235406 257555 282349 269652 262083 202474 199734 241079 254373 258038 281781 291668 269714
16759 269714 304107 314571 293030 294150 296445 316621 315247 315716 259080 216115 220277 221352 214438
16746 214438 221437 232703 251482 243762 213166 222607 229169 222355 188462 161563 194068 268633
16734 268633 316401 353671 341165 282175 240840 235265 264071 271315 287599 291448 279203 311647
16722 311647 302160 264172 257707 291535 312895 269999 282344 305179 269257 227745 236673 213137
16710 213137 211681 192597 195165 204383 238422 245591 272107 277510 267823 254581 215783 222141 203303
16697 203303 226497 216597 218208 229354 263791 308422 300366 327013 334091 304112 286484 239060
16685 239060 217162 232229 286761 282888 280026 276440 262791 232935 223866 243052 250978 236592
16673 236592 208785 179857 216651 249354 249746 240905 294213 312352 319682 361693 358098 319764
16661 319764 306178 305725 273967 258703 274262 277942 331436 340275 317694 285786 261854 222649
16649 222649 214718 262476 279585 269482 236198 217689 227962 213704 192051 207585 238493 247697
16637 247697 239534 241388 240040 272867 274322 250398 251248 261829 250451 278535 304246 268780 266884
16624 266884 261420 234481 200750 232253 260810 235171 230901 214318 204954 219142 220266 200803
16612 200803 188483 184403 163616 157310 216292 231343 206324 141762 138153 178096 213749 229360
16600 229360 260122 266347 266222 235224 241036 251564 246930 225832 208003 207592 182226 188658 219578
16587 219578 244031 266079 216316 212931 255702 281506 300533 279504 236362 237336 248091 249735
16575 249735 226485 258818 259177 258448 225886 231057 267535 261879 228728 178874 160164 161233 170335
16562 170335 218398 226477 239574 239426 202907 209298 200996 158708 125061 106039 168174 192550
16550 192550 167184 150746 182895 164610 153737 200299 209215 175928 158541 120879 149758 176036
16538 176036 204950 231475 237522 223637 203450 202308 212275 211213 198691 190602 163562 232778
16526 232778 276631 229907 236332 237824 251861 271637 296237 254248 196088 204558 164136 139429
16514 139429 123190 107055 87748 124279 138144 192136 190544 167181 205227 207839 216187 207683
16502 207683 206534 184830 187099 220188 215331 245368 247575 242866 246582 235873 232098 195031 201300
16489 201300 262476 263687 230979 187888 222009 243523 209694 152249 154263 199322 216640 153608
16477 153608 121755 146367 142204 166217 199612 167290 158762 132703 137584 186724 249890 213183
16465 213183 215251 242680 237210 236930 231529 181777 161527 148565 171203 188258 182205 185087 181179
16452 181179 180209 194471 202219 209697 222991 217790 207919 196024 203505 209547 149851 148491 170575
16439 170575 181473 193340 192001 187967 190344 176544 182119 193825 173745 174691 149015 115352 140893
16426 140893 170278 174429 151768 184619 153761 156698 161562 150035 191287 229650 236592 212842
16414 212842 188933 167834 156311 134779 162084 167567 187246 198927 212114 214333 167848 176061
16402 176061 162266 152084 153429 148545 162220 168269 172930 193970 170808 209867 196064 162497
16390 162497 147521 142329 138676 175650 175868 166130 149414 127822 160253 170431 191691 183576 174689
16377 174689 164888 142043 188920 189230 206083 189458 188121 189465 206086 203159 197266 198592 169678
16364 169678 160967 157420 143860 129718 142940 156278 152731 153265 127387 136789 174490 171487 198224
16351 198224 193208 185953 197395 220637 197649 217406 194548 193949 209873 197689 182333 169682
16339 169682 166463 171195 122172 102317 98128 144167 137226 112016 107172 119952 138235 158234
16327 158234 174761 215283 196648 180952 200488 156128 89360 64405 124307 177044 160402
16316 160402 129926 139822 143505 139513 129283 160849 180486 135592 90437 107242 148499 161745
16304 161745 169529 139052 121668 106286 44822 59163 103283 82493 89031 117279 135770 145481
16292 145481 147798 147362 164183 143792 150883 161026 162758 174845 170060 163468 196059 184863 171648
16279 171648 209291 234907 208069 196203 185238 149144 141149 140842 129431 113308 76783 76997
16267 76997 113514 122929 112213 104651 115957 132378 129798 133633 132921 172916 147806 100292 119669
16254 119669 189711 192083 125596 124162 160401 174129 161297 125914 121866 133671 168287 201432
16242 201432 216458 158272 115039 121108 102215 102147 89180 112988 166535 152902 141810 110413
16230 110413 66205 94529 97258 91557 105523 125785 159022 149643 119586 90147 114797 113041
16218 113041 85189 80317 95289 112112 131968 149828 180733 183997 171809 171184 178897 135230
16206 135230 108290 95876 118705 134678 154221 173393 110294 51820 62212 86469 104545
16195 104545 126421 115040 124313 172417 222194 229460 143839 103326 116390 99485 80665 112801
16183 112801 151285 163264 135719 103066 139314 139828 124694 140105 141277 134838 120121 88878
16171 88878 85803 92791 105012 134929 131196 89537 98481 67546 90332 89072 73215 42265 37449
16158 37449 66123 112349 164681 169345 166207 136747 142633 140513 135624 141729 111858 126604 126847
16145 126847 107622 105648 122716 141151 173768 168047 137219 77978 92762 135050 108867 74882
16133 74882 75737 82591 81180 80708 79324 104044 100202 105389 76385 56105 42984 64415 54535 63367
16119 63367 56530 61535 97415 109161 91742 122509 129182 115625 80128 77956 108915 108998 88759
16106 88759 81698 77459 27749 -4983 28104 27817 33391 34714 43977 55442 67641 102497 95479
16093 95479 101541 75305 57564 52948 31457 28144 53240 60698 34585 32134 12956 55719 89456
16080 89456 77518 65802 75112 106334 116380 117506 92668 78494 26500 26841 50342 24243
16068 24243 56883 68689 76071 104422 94705 31805 45619 93978 69642 74999 121108 103343
16056 103343 106451 112633 91788 79543 99562 124358 122151 115964 123311 171571 185072 140490
16044 140490 94488 87282 55646 54242 39862 40642 66088 52848 78916 91418 100037 122109
16032 122109 84427 49583 55885 46645 5488 38093 104969 133612 136813 126936 121339 168274
16020 168274 176123 146358 118312 114530 116940 96556 66845 73211 79050 58510 50509 85908 126697
16007 126697 117758 74740 35601 38906 65768 76693 89582 105989 111211 111515 89245 86440 75702
15994 75702 56485 97533 90917 77331 38166 43297 32092 8736 44624 79441 65830 23613
15982 23613 517 9148 53568 82071 72728 73308 65032 80455 49229 36062 44771 24711 37725
15969 37725 70838 64685 98884 116322 98594 99308 101495 101025 97389 76793 45061 37311 84406
15956 84406 67959 53066 25938 25177 46600 49665 88493 84894 47723 6687 24271 63328
15944 63328 21999 992 26226 -25037 19351 39920 37848 26472 28790 33207 39112 49760
15932 49760 2401 35339 45962 56440 1792 -16411 25126 20177 45030 77863 94537 97546
15920 97546 108516 121045 101467 77792 81630 75405 47258 5258 31311 53881 35614 -95
15908 -95 17248 31185 -5235 1617 41023 47000 22379 11617 21491 23486 11791 15370 6541
15895 6541 8295 -3845 19682 78816 99110 81021 70014 94211 120905 137098 139267 59195
15883 59195 -13754 -46502 -14343 -14176 -21417 5766 14993 34599 53894 63397 29382 -11335 -3692
15870 -3692 7597 11474 6753 -883 -19919 -39110 -47034 -22270 -12443 21642 56534 31340 20919
15857 20919 16087 27643 41198 45504 8356 393 -12013 -10077 -10096 -25265 -20552 7399 20649
15844 20649 12785 18731 760 -3704 25969 21051 850 -7672 -15117 2944 9301 17663 44616
15831 44616 14126 4016 24618 16838 12058 -9946 -6038 4380 36048 88172 102755 89714
15819 89714 99291 44640 69246 74678 52098 -7389 -17743 10617 43143 93024 104169 41687
15807 41687 -3114 27607 32014 29482 12795 -29926 -49451 -22253 -841 15234 40671 38376
15795 38376 58877 64273 69956 42893 -13774 -55852 -42817 -17689 11812 26673 -22671 -35968
15783 -35968 -30806 954 31956 20536 49848 61347 87168 73015 29915 7187 -34773 -51063
15771 -51063 -53956 -36882 -1180 49063 86993 64967 84434 126686 109668 92335 64668 9481
15759 9481 2737 36285 66845 92898 110537 86584 60089 25652 10366 -34036 -45041 -82385
15747 -82385 -100772 -50755 -8117 46778 54369 9644 -13007 15404 36400 13095 -20023 -21728
15735 -21728 -27861 -42677 -71397 -56097 -22464 -1970 9655 42703 31978 5522 -1154 31621
15723 31621 21045 13366 -18826 -35349 -22683 23298 73569 48296 6735 -1783 18385 7492
15711 7492 10727 -4498 -15432 12377 5059 36692 76718 43072 4047 28425 53602 64721
15699 64721 24120 13644 40728 42356 23119 -33141 -48477 -52947 16446 1378 -10851 -44451
15687 -44451 -57370 -20908 -16989 -22783 -16817 -22614 -27814 -25948 -14603 -10152 -23173 -19647 -45372
15674 -45372 -55575 -60472 -104386 -94214 -74031 -59386 -50715 -43073 -49791 -29923 9646 -27891
15662 -27891 -37101 -43330 -48861 -49476 269 -32857 -15353 21515 23830 10736 34759 49656 -9072
15649 -9072 -52134 -54081 -48555 -38753 -15603 26324 31386 14349 19818 45434 30779 25921 2596
15636 2596 -32458 -63115 -55819 -93255 -75901 -51360 -76190 -96641 -84365 -49175 -49418 -75488
15624 -75488 -83241 -44705 -24914 -39968 -33845 -16566 -10052 -2953 55366 38854 2678 -31079
15612 -31079 -29599 -40279 -49739 886 52276 81153 40532 -3902 1166 22838 11790 -40758
15600 -40758 -41308 -14793 36650 45113 45302 47452 31958 3824 -43007 -29935 5301 -2332 -13061
15587 -13061 -39387 -3719 -7217 -29522 -14293 -10881 -7015 49717 52190 -21608 -13171 -16241 -42738
15574 -42738 -46524 -13434 3388 34066 -19705 -34973 -38357 -44634 -35533 -54956 -83237 -98117
15562 -98117 -57740 -51738 -58378 -63885 -39796 -30528 -36970 -47453 -79511 -90895 -66658 -83483 -76586
15549 -76586 -33614 -26098 -7129 37173 59683 48609 -28612 -60191 -51719 -39231 -43032 -42049 -28354
15536 -28354 6639 -4536 2097 -15353 -29224 -14359 -45101 -63166 -34694 -33562 -48752 -75554
15524 -75554 -56740 -16272 -25020 -25238 -52073 -68674 -60702 -55570 -59901 -44406 -39284 -65912 -101350
15511 -101350 -104332 -110968 -103357 -97192 -63251 -16335 27661 -18964 -79902 -70802 -62319 -52025 -26894
15498 -26894 -36088 -52919 -91557 -80079 -49693 -28666 -38499 -20034 40539 60313 20959 -52473
15486 -52473 -64210 -48186 -41008 -12005 -12283 34363 29900 26659 -7182 -26729 -5496 -1810 -43487
15473 -43487 -31141 -52153 -42875 -20347 -21518 -16185 -4642 -13377 -18429 4408 23914 -1795 -74027
15460 -74027 -104695 -54491 -17634 -8474 -46243 -49844 -27516 -29479 -40006 -49948 -65833 -83772
15448 -83772 -99836 -88270 -42347 -20055 -46605 -37530 -19935 -20667 -77478 -81315 -73584 -59937 -28170
15435 -28170 9413 163 -60471 -97897 -105045 -84579 -50987 -24832 -21136 -14336 -11081 -46025 -49121
15422 -49121 -61429 -65086 -78162 -55463 -44089 -66333 -65352 -68452 -11973 7266 -29524 -11868
15410 -11868 -19883 -31019 -29041 -48543 -59997 -42943 -49673 -70062 -75421 -116209 -102995 -69344
15398 -69344 -41890 -15914 -42704 -55284 -70317 -114212 -106498 -119585 -130386 -108249 -73478 -80182
15386 -80182 -70125 -57259 -19885 2785 11038 24038 26382 -35440 -25896 -71358 -91479 -49055
15374 -49055 -34724 -82775 -124025 -91406 -65770 -22019 4256 -9388 1994 -15329 -79544 -138125
15362 -138125 -155958 -110007 -140645 -101432 -91140 -93812 -95050 -80966 -74433 -32065 -37842 -33882
15350 -33882 -42087 -22890 -30069 -63497 -94809 -100488 -93055 -108938 -31644 -3737 -26685 -1331
15338 -1331 30006 4818 -51381 -77629 -56086 -22063 -10233 4134 -30716 -35752 -21815 -75912
15326 -75912 -71529 -33199 -8546 -34786 -37282 -36234 -75076 -88518 -77477 -61627 -29746 -17553
15314 -17553 -34128 -37278 -24315 -10258 -11970 -33840 -41728 -26934 -63449 -84960 -116751 -113208
15302 -113208 -102553 -89682 -69994 -64936 -94631 -99690 -83362 -80698 -39733 1197 41477 35671
15290 35671 -14416 -64974 -91801 -78994 -46151 -50762 -58784 -24096 -8190 -57580 -93176 -100060
15278 -100060 -104705 -95244 -90837 -92086 -21429 -26830 -54615 -29643 -7994 15869 -24616 -32097 -43511
15265 -43511 -49767 -19171 -15121 -23372 -11365 -10805 9250 8486 19177 55656 37709 -22455 -41903
15252 -41903 -56526 -76038 -56209 -50619 -51641 -54502 -31535 -16815 -17542 -23000 -29161 -1388 -11398
15239 -11398 -41773 -69554 -104966 -71684 -67560 -111176 -96178 -66515 -65898 -57574 -52820 -60795 -30690
15226 -30690 -9111 -17159 -7573 -4766 8337 10146 2032 -15950 -50414 -58649 -58360 -74001 -59148
15213 -59148 -85034 -90751 -99846 -58460 -43376 -18586 -36504 -71751 -108935 -115877 -126341 -65098
15201 -65098 -68484 -118778 -133115 -89138 -50773 -27083 -23997 -42331 -33929 -60874 -81000 -95943
15189 -95943 -100407 -68757 -62547 -52948 -47353 -27232 -3937 13256 -34822 -44045 -51438 -74520 -58780
15176 -58780 -43755 -24495 -30609 -41781 -33692 -30499 -32278 -10543 -35583 -19323 -5500 -39397
15164 -39397 -44323 -41322 -49144 -61163 -69833 -70289 -27022 -12584 -35001 -47057 -65771 -43795 -34728
15151 -34728 -61458 -53133 -66862 -92318 -106346 -87313 -82816 -75333 -40104 -27455 2296 -24407
15139 -24407 -56310 -78129 -49654 -27113 -10929 15368 49663 58670 30464 -3131 -48165 -46614
15127 -46614 -8145 -1641 -457 -18280 -14672 -31076 -70956 -145310 -152326 -131933 -98036 -97389 -73747
15114 -73747 -106274 -141918 -117929 -97787 -120342 -116426 -69374 -76933 -91851 -116030 -97548 -94484
15102 -94484 -98834 -78845 -55351 -81337 -119425 -117728 -98848 -57884 -61695 -31903 -49400 -55505
15090 -55505 -38943 -31591 -20737 -14842 -46866 -71997 -30680 -27035 -25881 -20936 -25926 -43043 -31417
15077 -31417 -25800 -48661 -18653 -14664 -19314 -21600 -15456 -14438 35188 3850 5517 28072 -36038
15064 -36038 -71351 -50480 -39333 -6977 -37383 -89010 -80902 -84364 -110872 -100852 -87121 -95913
15052 -95913 -63729 -70578 -81731 -106985 -92922 -63502 -48131 -45690 -55468 -17583 -19442 -22334 -63561
15039 -63561 -85333 -82715 -55217 -50871 -81010 -165806 -192294 -102516 -29564 -64959 -100308 -61132
15027 -61132 -68157 -69045 -86530 -116555 -106526 -93580 -102861 -102050 -75026 -66461 -69427 -52911 -59113
15014 -59113 -61406 -83163 -114679 -29370 -24469 -67240 -90563 -113719 -112767 -146427 -177408 -161547
15002 -161547 -137329 -135685 -131922 -104872 -80667 -43022 -22358 -55607 -83510 -85964 -37131 355
14990 355 -19477 -64969 -73655 -86411 -43119 -60792 -103369 -77561 -95560 -124139 -93310 -74726
14978 -74726 -54004 -46869 -77622 -94274 -87037 -38899 -17858 -16368 -5844 3134 4042 -42428 -63818
14965 -63818 -64478 -54311 -60449 -61611 -55499 -45539 -69679 -90756 -82454 -76125 -62882 -94317 -103926
14952 -103926 -111888 -113525 -78143 -19993 16027 7768 -30496 -52294 -58529 -92087 -84634 -104036
14940 -104036 -112552 -74121 -58024 -47528 -52359 -74445 -116309 -97770 -92636 -82007 -75604 -88857
14928 -88857 -75800 -52769 -37093 -68229 -113814 -134866 -100972 -53242 -59283 -77764 -88763 -81671
14916 -81671 -87595 -63194 -38055 4395 -27770 -71752 -54372 -65166 -22975 6083 -22216 -69766
14904 -69766 -70516 -32312 -14621 -31218 -47191 -44321 -42610 -42721 -35623 -21493 -29718 -14040 -18276
14891 -18276 -70982 -75874 -52664 -75061 -88054 -103881 -74587 -13295 -59576 -120779 -113641 -116084
14879 -116084 -109290 -112447 -135857 -136114 -137911 -140830 -153409 -120530 -61349 -58750 -66138 -66019 -50799
14866 -50799 -63429 -70424 -77135 -38959 -5686 -38259 -61165 -51486 -55469 -67113 -52445 -30549
14854 -30549 -57926 -108811 -134674 -121171 -138708 -109094 -93579 -48111 -17687 -69711 -140535 -165406
14842 -165406 -135272 -119615 -130769 -90349 -90195 -52542 -83195 -120356 -146004 -136182 -127582 -98905
14830 -98905 -60416 -56770 -68801 -60753 -83903 -93756 -45711 -19687 5025 -24608 -44469 -49957
14818 -49957 -38969 -69941 -62458 -58908 -75713 -93453 -117947 -90209 -55263 -72579 -53987 -69887
14806 -69887 -117930 -96010 -66707 -80712 -58007 -17904 -13632 -10942 -21512 -39499 -40423 -29742
14794 -29742 -42260 -53574 -50512 -29122 -31158 -64465 -58326 -37423 -20308 -42000 -98265 -111398
14782 -111398 -89108 -84525 -50091 -24614 -5630 -32683 -73305 -107906 -117514 -80892 -23927 -44652
14770 -44652 -41765 9240 -21204 -40564 -85130 -92110 -89710 -77900 -42944 -85839 -93130 -67937
14758 -67937 -69674 -81997 -95969 -105353 -70193 -58403 -73387 -45293 -57533 -111270 -126584 -94875
14746 -94875 -88153 -68974 -144913 -170601 -110220 -48103 -48584 -52966 -59377 -66473 -89980 -99530 -85967
14733 -85967 -52079 -29054 -5108 -48182 -61654 -103988 -91741 -42628 -17536 -10668 -11934 -35264
14721 -35264 -64093 -74582 -80435 -59623 -710 -534 -17812 -54885 -72725 -91203 -93971 -102473 -48698
14708 -48698 -42297 -80154 -100209 -144423 -121877 -95908 -96161 -67256 -80935 -125527 -162692 -131415
14696 -131415 -114483 -122343 -121295 -71848 -44576 -20555 -36112 -62617 -122972 -121074 -114916 -128240
14684 -128240 -134592 -104769 -85345 -53012 -31121 -33786 -37384 -49108 -59609 -94666 -115543 -89963
14672 -89963 -125206 -137804 -137037 -113534 -77053 -58275 -66747 -108812 -92704 -60990 -60111 -96889 -117278
14659 -117278 -108389 -104277 -129466 -123804 -82404 -31161 -17855 -52286 -83674 -49881 -23309 -39902
14647 -39902 -81495 -84433 -102223 -133285 -152500 -109961 -131422 -118087 -143053 -70456 -29881 -21694
14635 -21694 -67545 -114565 -136514 -107560 -103296 -110362 -128272 -126669 -124701 -96664 -56785 -32564
14623 -32564 -31223 -38369 -32787 -62507 -77590 -56057 -27692 -32430 -34404 -54414 -89434 -127853 -117208
14610 -117208 -60116 -17166 -15892 -32558 -45447 -41801 -53667 -94643 -102918 -104852 -123642 -143081
14598 -143081 -113536 -85690 -84465 -103143 -103728 -85244 -70686 -42909 -50075 -57476 -66999 -63284 -53513
14585 -53513 -34138 -73879 -125336 -174255 -162995 -139179 -108179 -105422 -90078 -95742 -82152 -79131
14573 -79131 -82294 -116185 -101010 -55939 -54559 -49588 -61118 -77271 -84469 -107875 -130281 -133983 -108144
14560 -108144 -60585 -61269 -62345 -60416 -47330 -54272 -25979 -49522 -48498 -15987 -29582 -46954 -61309
14547 -61309 -55798 -98410 -129962 -133193 -95778 -64593 -55767 -38724 -75538 -129308 -108652 -95413
14535 -95413 -81917 -89802 -79317 -68447 -34235 -71709 -133802 -138157 -121868 -83789 -55347 -71700
14523 -71700 -66434 -79304 -45480 -9190 -25725 -53487 -79624 -90782 -90885 -102317 -122563 -128643
14511 -128643 -108050 -118181 -114112 -90826 -83218 -71632 -44706 -72591 -55860 -57611 -63241 -52289
14499 -52289 -33073 -28245 -41820 -74375 -61611 -44541 -77037 -53150 -49172 -99830 -99382 -83531
14487 -83531 -73608 -102552 -91852 -77258 -90182 -119280 -139457 -86156 -90613 -124097 -141613 -122953
14475 -122953 -120336 -78460 -53545 -77652 -83399 -95028 -78285 -77658 -102141 -131066 -110076 -64257
14463 -64257 -50317 -70070 -83307 -81407 -88594 -61434 -83974 -125519 -151640 -134690 -91251 -67465
14451 -67465 -65532 -115788 -120803 -95822 -107640 -66460 -10896 -18658 -18889 -20643 -32322 -67341 -92370
14438 -92370 -110335 -122176 -111745 -136778 -124577 -79300 -74623 -46677 -33741 -41968 -34105 -42123
14426 -42123 -64266 -93317 -114454 -89046 -100809 -107935 -103546 -93303 -88700 -67568 -103792 -120458
14414 -120458 -105400 -64040 -33656 -42930 -97900 -81410 -79965 -70375 -42764 -39626 -69867 -78485
14402 -78485 -65981 -51359 -49919 -59285 -32651 -16019 -78413 -72548 -63725 -89383 -101228 -68537
14390 -68537 -31091 -33734 -98294 -167920 -191021 -157002 -133422 -143776 -126150 -101557 -87907 -92985
14378 -92985 -93225 -117300 -126433 -75500 -84483 -82766 -63340 -44918 -12108 8391 -2611 -20916 -12539
14365 -12539 -23654 -19062 -16412 14375 -11309 -69416 -107287 -114337 -141685 -130845 -105657 -88801
14353 -88801 -68531 -60494 -94096 -91044 -89207 -84649 -34882 -49573 -49374 -697 -9190 -36608 -64130
14340 -64130 -67241 -95825 -74501 -64337 -95904 -94697 -70790 -60191 -31160 -34513 -50537 -35765
14328 -35765 -78054 -91397 -64633 -53238 -61857 -61912 -46336 -33561 -51119 -92328 -98164 -76353 -84583
14315 -84583 -111786 -128311 -77154 -58969 -83080 -60762 -45776 -32624 -59787 -78009 -55414 -50592
14303 -50592 -70927 -79723 -59367 -43186 -47625 -72365 -109770 -144325 -123613 -86504 -102728 -94641
14291 -94641 -90589 -87461 -62512 -67787 -66760 -40904 -64377 -105383 -124988 -102834 -73357 -86487
14279 -86487 -91801 -88409 -88543 -63098 -58024 -75515 -87649 -96676 -108804 -92583 -80798 -91706 -88883
14266 -88883 -66138 -26744 16855 6128 4953 -15143 -29836 -48629 -66244 -80715 -86746 -100346
14254 -100346 -111991 -119303 -105400 -95416 -96960 -105878 -80206 -62847 -58031 -44601 -65152 -97779
14242 -97779 -110783 -72505 -35164 -48832 -44867 -44151 -65593 -91246 -107828 -100886 -86699 -79976 -61977
14229 -61977 -48746 -62343 -76870 -72256 -78446 -116862 -107846 -98689 -35107 22794 18667 -14767 -57998
14216 -57998 -60460 -61226 -50735 -60449 -60794 -56568 -68797 -73599 -58474 -55076 -56936 -75886 -79513 -65276
14202 -65276 -63882 -46524 13797 -7681 -46589 -104795 -97755 -80944 -100717 -112057 -80069 -62631
14190 -62631 -53935 -63827 -59992 -40400 -51507 -49733 -51662 -35594 -36514 -65848 -105666 -71449 -37743
14177 -37743 48676 39863 -11819 -40818 -28689 -13610 -36857 -56790 -71283 -124918 -92214 -74570
14165 -74570 -71146 -75231 -83753 -61760 -61414 -42170 -40190 -36324 -33907 -42071 -71465 -78168 -78608 -116565
14151 -116565 -115105 -87847 -70049 -108920 -129501 -98621 -83528 -96967 -91846 -88102 -74857 -65986
14139 -65986 -93599 -125998 -143693 -101606 -69573 -71297 -103512 -86112 -68829 -86827 -117410 -138336
14127 -138336 -144397 -96597 -47346 -59381 -54338 -42209 -40508 -50357 -48679 -100441 -118395 -73341
14115 -73341 -52319 -58274 -63632 -30344 -27109 -69544 -63135 -54309 474 -18513 -64544 -79347 -73548
14102 -73548 -72563 -57751 -88995 -96813 -87464 -85838 -93067 -99639 -111092 -116891 -101543 -84661 -50781
14089 -50781 -9760 69 15493 -5395 -960 -1503 -76037 -92807 -75634 -65828 -80997 -60161 -77211
14076 -77211 -87029 -106980 -66588 -20923 -50564 -61729 -63084 -51332 -61870 -57832 -55642 -58084 -57591
14063 -57591 -66659 -115243 -119426 -124908 -134584 -130749 -126337 -108764 -137356 -108793 -37870 -8907 -1898
14050 -1898 -29280 -39280 -47188 -42859 -29316 -8351 -42222 -75189 -81201 -56492 -40227 -81660
14038 -81660 -80923 -64471 -57540 -72148 -57673 -41194 -35327 -83699 -111388 -101089 -79377 -59918
14026 -59918 -61148 -28854 241 31556 32148 -57047 -75120 -53430 -37959 1602 -41529 -109513
14014 -109513 -111099 -85548 -63221 -50595 -76142 -101356 -66457 -43389 -78965 -104031 -93852 -105130
14002 -105130 -101960 -123209 -112431 -59455 -53618 -59091 -76623 -88215 -65420 -41010 -37353 -37652 -3864
13989 -3864 -24856 -24214 -41905 -61500 -51227 -67212 -67291 -45460 -54721 -54656 -53608 -67640 -48054 -16727
13975 -16727 -4249 -24372 -63668 -37378 514 -12763 -39376 -68141 -21952 -28651 -43038 -19493
13963 -19493 -41983 -41780 -38195 -68700 -64502 -47713 -34356 -52398 -66337 -37960 -32542 -57371 -18082
13950 -18082 -26259 -34597 -27334 -40633 -60205 -43356 -53829 -41768 -11924 21540 18990 2122
13938 2122 -14458 -1082 -6611 -21383 -51461 -57748 -80181 -74662 -88745 -93710 -103745 -134127 -117708
13925 -117708 -94709 -103866 -114224 -87755 -47061 -2668 -33923 -35546 -30999 -69623 -93659 -122217
13913 -122217 -115519 -63979 -65675 -93563 -99968 -45613 24721 8229 -53432 -74554 -79612 -19458
13901 -19458 15033 25799 -31852 -57605 -94511 -78706 -45868 -52737 -68942 -104667 -75308 -26180
13889 -26180 -16005 1753 3894 -8171 -6606 8124 27461 22384 10838 -12678 -17173 14269
13877 14269 23105 -13162 -13803 -23313 -46304 -68925 -67517 -50267 -46789 -33978 -48612 -25239 -3554
13864 -3554 -19777 -16946 -25394 -49649 -96845 -106233 -92126 -75216 -72780 -90741 -118787 -119478 -98752
13851 -98752 -59766 -46355 -34096 -29890 -23675 -45907 -70029 -39206 -1552 39203 29098 7351
13839 7351 -17053 -43979 -50565 -36850 8726 9713 -41736 -79047 -72781 -64457 -22155 -59180 -57823
13826 -57823 -32165 -11060 -33660 -52650 -65222 -53660 -64344 -72468 -81483 -122784 -83407 -54062
13814 -54062 -21727 929 -36166 -52366 -69308 -59553 -30505 -23738 -30605 -29825 -21113 5275 -13669
13801 -13669 -23282 -7275 18680 -3903 -36725 -58855 -80775 -85941 -65307 -75865 -103995 -94654
13789 -94654 -96963 -96548 -54901 -50414 -67060 -82008 -42083 -31022 -31934 -35475 -55726 -75150 -90294
13776 -90294 -104442 -91512 -115262 -159026 -135310 -54077 -62763 -43294 -42539 -27805 -35453 -25845 -43521
13763 -43521 -53077 -69445 -76122 -69030 -82789 -90727 -76811 -38989 -5344 7667 36384 20574
13751 20574 -1238 -27874 -32539 188 17308 4859 -12894 -23875 1748 -3181 -15791 -22457
13739 -22457 -21014 -66029 -70688 -52851 -85166 -68629 -50685 -25315 3482 46114 -3517 -52509
13727 -52509 -54298 -17849 -10959 -9101 -33527 -37641 -24531 -11175 15935 43552 34902 16696 -11054
13714 -11054 -38239 -74965 -92613 -43902 5384 57228 24384 8904 17595 -15759 -71293 -86827
13702 -86827 -64987 -51573 -2145 31137 20353 -909 -39386 -49905 -63684 -63833 -69058 -77204
13690 -77204 -87829 -95175 -60930 -29991 -23511 -69464 -73856 -46921 -34709 -83750 -57198 -21989
13678 -21989 -43663 -35904 -17968 -1883 -21751 -14734 12420 30495 34298 21023 -10891 -49630
13666 -49630 -33058 -35352 -67869 -48293 -24948 -53115 -50959 -23478 1577 -4498 -70905 -78491
13654 -78491 -43483 -40392 -20105 -10262 -10835 -35277 -40173 -28893 -9421 -7310 -11574 -34784 -1291
13641 -1291 -1955 -29120 -42451 -51967 -45768 -51706 -49601 -69021 -64888 -46147 -15494 17296 -12686
13628 -12686 -28255 -50736 -11229 7538 20885 -32944 -83400 -81320 -34983 -39892 -50045 -41044
13616 -41044 -47735 -96795 -68749 -33287 -21721 -57658 -81342 -82672 -38760 -17726 -44419 -55225
13604 -55225 -29919 34079 52413 50413 18642 -20136 -16402 7899 1531 7915 11337 -19264 -49590
13591 -49590 -56745 -57597 -48139 -41290 -68075 -86187 -60203 -49768 -33167 -40105 -25198 -9280 3501
13578 3501 20603 19386 -18586 -4788 -35278 -45716 -23835 -25335 -29576 -7286 16275 39694
13566 39694 28009 3827 434 42763 31617 -14483 -48453 -64376 -55145 -40893 -43912 -43759 -68227
13553 -68227 -43967 -9545 -27615 -48244 -68805 -67227 -32869 33712 43228 47738 10401 2080
13541 2080 -22060 -18761 -9608 -42406 -11920 31341 55585 69939 84808 70205 51900 -13096
13529 -13096 -55558 -80397 -63303 -78348 -43636 15601 29319 18897 27136 -23964 -69566 -73062
13517 -73062 -18692 11604 -27960 -86136 -87110 -98202 -75092 -74519 -88772 -43089 -9263 -22316
13505 -22316 -25721 -21963 -27638 -22409 -39100 -30049 -33282 -23198 13229 36298 1781 -12078 -66188
13492 -66188 -74425 -77727 -64890 -73908 -41311 -24266 -13222 12918 17882 33369 25139 5084 -15875
13479 -15875 -28572 -23750 -1931 -40 3257 -37139 -1795 34149 53 -39683 -11653 20790
13467 20790 42493 67424 59930 85016 91356 48026 12935 -9183 7604 18567 184 -16353
13455 -16353 -12819 -39953 -68239 -67106 -50217 -38587 -717 -9858 -3028 34383 -3329 -26337
13443 -26337 -23248 10329 -4574 -9193 2788 -16463 -40458 -63416 -89694 -97950 -85030 -31674
13431 -31674 -10261 16854 6154 40018 64747 51367 5125 -38796 -12053 -15135 -8199 12725
13419 12725 39052 37876 -3744 -35795 854 -14606 -26802 -39556 -16464 -32794 -39579 -19266
13407 -19266 -5946 6613 38207 16748 6675 -15477 -17607 14381 19460 1663 41980 80033
13395 80033 97971 133637 76539 -4611 -22879 -25139 -7526 -9490 -15762 -35129 -5442 -1584
13383 -1584 17617 6019 26374 77330 115473 102720 73867 54414 36271 13616 15633 8683
13371 8683 661 9405 14602 -449 22024 -27130 -30811 -31169 -30381 -48964 -29507 -29458 -9121 36592
13357 36592 9352 -13262 68037 132717 95623 38498 9161 -12993 18286 49778 10739 -32812
13345 -32812 -2926 25662 28536 20841 45871 57946 8806 -43368 3929 74057 43871 21517
13333 21517 -15313 16156 44710 61664 28547 -32218 -46994 -48043 -33316 -35413 -32607 18076
13321 18076 10904 23323 27774 54166 58408 36600 36448 26003 60592 74701 61400 61799 39425
13308 39425 54259 73484 56110 69015 68773 51824 66529 75731 118290 98634 53122 41857
13296 41857 12247 3983 -968 -14819 24741 73189 61690 52082 8531 -21189 -7973 3847
13284 3847 35435 51036 68057 108770 73107 79503 88071 24496 18260 -7016 19530 56995
13272 56995 64534 57665 7212 355 14071 22321 71376 103132 97277 109981 66079 15152 1727
13259 1727 29029 63531 74874 72069 64992 46675 16078 -9069 13972 22263 22647 -364 -8355
13246 -8355 2040 22804 -13751 -1505 37887 30311 37044 40249 -8496 -40213 -9992 -13860 9219
13233 9219 39686 85051 115083 137649 122751 102159 73069 84450 32946 33274 77821 98669
13221 98669 100299 105778 143796 147766 92290 31375 48441 65330 113859 78766 12460 -33195
13209 -33195 -26186 5559 21844 23636 34221 22326 1119 24138 51786 66370 87210 103978
13197 103978 127670 116908 91894 67168 46015 60880 40914 26672 41930 71285 82848
13186 82848 86678 91621 76076 78091 62887 55506 90191 127282 105919 95725 84083 72590
13174 72590 101976 96084 100614 67403 65422 91586 66002 60275 101634 113634 80376 76133 86944
13161 86944 86658 90242 67724 43370 55151 71738 111866 104573 81741 65643 17726 -10355
13149 -10355 13763 39848 67476 87403 95943 89775 74036 74364 71234 80063 58814 57097 27673
13136 27673 54519 56582 76077 65148 83985 140335 128109 116020 94290 86095 87444 69260
13124 69260 66624 64218 83398 124306 154523 113327 60121 28324 63878 119881 100128 98341
13112 98341 111251 77900 120986 109304 116698 129538 115031 106030 102147 53820 57323 66757 81783
13099 81783 116473 115895 105895 120209 151614 175327 143857 98682 115197 154662 150641 169091
13087 169091 158850 120853 98153 105507 138033 186912 158581 127494 181877 156474 131104 123477
13075 123477 80634 79402 121856 131149 120269 171893 173879 140907 143157 121880 147303 139867
13063 139867 115070 90469 76672 97133 120676 84228 96576 107746 40284 7355 24603
13052 24603 59353 66535 114680 140479 143778 106688 89287 115002 126186 116082 125921 103141
13040 103141 66167 99533 126100 159616 138364 161395 171171 155938 100603 33843 24530 36600
13028 36600 67067 93771 89406 67915 79491 116505 82207 111584 124453 151757 170581 173074
13016 173074 154301 170892 179667 189092 186057 157700 174298 163599 143524 97356 116885 135908
13004 135908 140083 112108 82348 85545 100970 119985 132387 140306 123823 145131 168941 159746
12992 159746 179075 164113 125895 86370 85332 114019 120811 69797 106927 127703 122380 114097
12980 114097 126180 148359 178509 167267 137445 163589 130333 92867 145058 132055 96138
12969 96138 152052 130481 132961 163622 175119 186844 207598 170430 159507 137517 109965 99078
12957 99078 139152 151571 160845 197642 168522 115365 103984 131598 130764 96367 116238 114756
12945 114756 115730 107755 87353 83520 92627 127987 172172 155357 145384 141354 150557 169358 160537
12932 160537 136594 142414 113629 110509 114755 120014 167850 190297 163812 98850 101243 144636
12920 144636 146340 126412 180341 240979 232461 231955 251425 178954 148675 150306 172833 129027
12908 129027 140278 168806 171560 155969 146511 135319 124759 103511 103868 133821 135950 128940 169725
12895 169725 190719 179833 120179 134175 186671 201545 197012 155637 104538 90995 114569 147816
12883 147816 166868 227749 244224 236068 204099 227635 239772 210681 227966 228666 188200 169188
12871 169188 179221 206622 191269 176381 169552 179436 218720 224425 233897 258607 229307 215673
12859 215673 209583 219645 257015 256588 247570 212830 160550 192365 193855 180177 191031 211928
12847 211928 258383 258752 238821 233797 188414 158859 198738 259977 226525 203939 246128 245938
12835 245938 206962 188099 182992 197865 182000 198585 209384 251534 271132 278681 260741 259083
12823 259083 288545 237896 238616 254026 280746 283353 225562 175385 177439 200596 207773 214865 244982
12810 244982 253813 233738 222958 235105 233378 230293 210890 210144 228983 210614 240127 264720
12798 264720 242586 237392 228886 248125 283430 269326 207964 184932 218370 228580 209960 204885
12786 204885 228505 224912 219982 265195 305218 302859 282166 244083 210203 204637 220642 238059
12774 238059 262933 285983 255446 247871 245667 294255 318163 311188 308678 284149 250586 239294
12762 239294 210053 234604 248819 214367 221731 205412 226576 224857 217936 234955 256763 233009
12750 233009 257889 293035 280494 246782 221652 210498 204294 183170 185657 212269 230551 218220
12738 218220 240753 273925 271144 269504 234006 226561 262101 281942 281598 266074 259915 283682 353065
12725 353065 350698 327834 291886 262249 258716 259273 294991 331706 304281 304880 313235 273991 296421
12712 296421 270345 230622 265187 287922 314438 300751 293488 211887 203016 212046 222778 235359
12700 235359 260266 279705 296204 302588 294258 252613 250450 309126 317354 327567 350909 349944 336066
12687 336066 321093 280452 299677 334915 271407 225222 223232 279688 312276 376838 354570 312960
12675 312960 303323 284391 291880 298621 335933 370881 389537 379562 338995 322309 322302 318919 294749
12662 294749 277327 280992 284950 284282 302573 307719 326267 335557 325786 305102 293697 281793 309334
12649 309334 314990 307444 307985 312156 288182 292056 307079 284359 251047 285243 335278 372091 350236
12636 350236 309128 289814 294941 303563 355286 380706 375909 319463 289219 335043 373619 347285
12624 347285 350936 313301 325958 342916 320317 269510 286135 314728 313801 338559 349118 372793
12612 372793 363817 337112 391587 413778 398160 385714 356349 355353 357637 347185 364932 395335
12600 395335 379366 385168 378566 384326 389054 399511 433079 412950 363187 392977 425594 410220
12588 410220 394141 361956 316636 277875 303655 308122 324230 352137 361663 343426 311152 331661
12576 331661 334352 358494 380895 362161 359327 355111 402738 441130 417329 393724 385483 401737
12564 401737 387416 354057 323514 286048 326153 360224 370740 390200 376210 421373 447540
12553 447540 443843 427447 392732 350381 378614 378154 336115 340456 356837 318693 302512 350728
12541 350728 361504 390457 406034 382843 371637 346354 279095 287326 310839 360847 405091 393079
12529 393079 386907 401564 452520 454186 380268 356245 323380 303461 374026 417190 431440 417043
12517 417043 418616 417959 405881 392315 404433 423971 375930 358545 352004 381979 425932 418802
12505 418802 427118 425879 436356 433997 426107 401637 354977 385201 413507 408564 409652 403778 363749
12492 363749 357173 369579 386700 411683 429459 424818 378141 374398 345160 303682 323293 332962
12480 332962 364055 375268 376201 400940 393895 363972 368934 380631 425138 455183 454921 441561 443391
12467 443391 415796 391440 405838 398519 375069 396846 410802 382657 394933 379073 380239 382890
12455 382890 378550 368937 413188 452746 455297 423641 422412 456481 402739 356716 362874 387782
12443 387782 463377 444786 413320 399990 387219 399613 394624 389796 409507 401631 414549 436683
12431 436683 452305 452382 448361 479322 455660 439089 430006 444889 472483 485569 502364 461522
12419 461522 399796 416684 464757 458163 445304 437475 445528 477145 473222 479180 471420 476582 453524
12406 453524 457930 479877 434073 468500 490740 474899 457679 453577 482986 495497 477712 445492
12394 445492 441558 496695 482831 489682 504221 500135 511032 468985 426172 442683 486593 494497
12382 494497 496543 496004 535757 520412 503060 510720 499064 442852 493444 509360 540861 551901
12370 551901 536593 484661 456781 436084 436915 449709 477556 486105 488591 474759 464745 467787
12358 467787 463528 466149 454914 464569 467486 473595 501544 518056 532005 535304 526329 492109 499441
12345 499441 488459 440382 441442 492755 509513 515319 515400 536310 556392 568713 514444 469919
12333 469919 464849 477279 484496 456853 477940 509337 459097 411253 467400 515604 545173 563062
12321 563062 617153 606313 578985 579879 532698 518795 506141 529113 552683 526198 518909 500289
12309 500289 499649 511982 547349 605861 607884 579310 544068 538969 520918 493032 473332 429554
12297 429554 460277 505981 521018 477172 478298 465515 448828 439093 460802 494725 514246 510195
12285 510195 504938 494421 494170 510907 526106 487347 446573 467786 460698 458049 453326 452354 449172
12272 449172 428569 463403 497784 528862 516664 574821 607195 602960 557026 521911 506687 499602
12260 499602 506174 524790 553725 565378 558731 563217 525036 484150 484743 523291 492685 480576
12248 480576 496589 494308 485629 492864 471593 491044 502837 537086 525457 486056 502627 473053
12236 473053 466764 483346 474211 477266 430495 443628 484623 446527 437909 475977 482619 480834 496089
12223 496089 510578 519165 512115 510146 538404 550225 552585 507638 460002 432393 451519 513090
12211 513090 471357 444046 432349 424453 441814 506284 502197 472994 452031 444027 497083 494928
12199 494928 504412 499124 486573 475022 466497 506698 552455 542107 564857 568049 497760 483168
12187 483168 505587 512413 502345 473406 478416 488115 508406 542094 522509 507491 507148 519061
12175 519061 509284 500390 504694 508401 510589 501586 538312 548737 549779 540556 526066 571098 551490
12162 551490 549989 578928 556942 542448 503825 493084 531119 566310 565244 550931 496874 465156
12150 465156 457485 517460 547586 530209 484700 480173 490967 495288 482005 505603 529572 529078
12138 529078 528733 507637 509421 522301 554403 567340 549258 476665 516516 496419 429429 433119
12126 433119 482172 480374 476574 477015 460518 490470 485377 495861 480291 424133 430819 484383 560541
12113 560541 570652 533916 532817 544306 532787 459925 445579 454156 468084 433988 437325 451045
12101 451045 435840 442652 467497 491056 498869 478218 461001 440761 469301 471602 462055 488504
12089 488504 492775 500945 507875 500802 467214 440656 430836 447413 475860 447957 455689 495733 485248
12076 485248 509269 509201 490461 480438 461045 461007 440739 474634 495792 513769 457509 455672 486966
12063 486966 485281 504480 486794 440362 417383 433106 457060 454206 424993 409957 400514 392287
12051 392287 377215 407697 453242 465635 457328 452173 463443 463388 456401 402104 426193 451677 458461
12038 458461 506760 510947 472524 443217 443584 448863 430712 439645 437572 453891 449847 456417 460029
12025 460029 469077 449675 401825 392559 417013 433223 456384 443270 419339 410278 416432 434512
12013 434512 394665 333939 325713 363193 394001 409690 393062 418407 404970 397031 444143 474473
12001 474473 451235 460231 516599 512885 500223 509456 505243 461264 437137 443155 444944 416349 397448
11988 397448 421246 386861 424810 448365 451403 409263 435384 463125 430422 407669 376731 366238
11976 366238 370683 367504 403156 397588 394545 420361 388020 407008 416315 420979 394350 375575 376477
11963 376477 355123 349953 354791 357186 361969 397650 421850 451772 404231 409126 394172 409357
11951 409357 400900 424980 446399 450777 437806 471223 472879 431967 411988 410338 375364 396841
11939 396841 396747 372216 369256 407695 369528 314757 301615 314069 349801 365182 377975 357926
11927 357926 364547 400277 357261 337395 300972 287979 325611 366765 330090 289152 302047 345599
11915 345599 339354 320243 330224 310135 301926 291010 300268 370651 418501 428865 428550 408781 388644
11902 388644 378292 347662 318283 308078 281539 286862 293458 279156 295803 320716 317096 350858
11890 350858 349671 359177 343261 363317 396509 383202 346679 358498 369900 386598 392975 359671
11878 359671 322540 304169 323410 351498 373730 375982 349064 334237 349361 372501 392615 397299
11866 397299 369206 350203 343811 323309 326747 286611 279757 339172 326180 282363 306595 304083
11854 304083 295205 315411 339199 309949 285808 248636 286068 344540 362922 336135 303473 312864
11842 312864 282886 313355 285589 306990 369388 379337 319424 299181 303900 307486 307073 336834
11830 336834 339041 290009 251604 242031 273466 314349 291308 259452 288367 346079 318860 283328
11818 283328 311054 347492 345327 331681 278097 243309 267853 246113 203415 224195 254391 274711
11806 274711 301353 319203 307804 293928 270860 285883 282332 272425 278148 272022 282864 302039
11794 302039 294950 244785 234535 236511 240996 230722 255096 283698 249277 255196 251920 244559 237170
11781 237170 247693 241116 260598 275594 256236 252607 236740 231231 231641 239302 271147 266245 249823
11768 249823 255107 249079 225099 212128 196053 203435 187310 193300 206404 197005 187827 204093 214535
11755 214535 256468 271501 234852 192972 187838 175536 169083 207428 233732 187712 167614 166122
11743 166122 162730 150113 168843 160195 141543 129143 162896 167094 165423 187269 170257 154867
11731 154867 170217 141297 158605 164445 186356 191703 189586 176036 176330 166945 124184 98813 149136
11718 149136 162535 162458 146463 138626 177816 168757 178118 186067 197216 200922 202112 208306 159290
11705 159290 79232 73701 94491 71044 77997 124342 153620 150191 147710 116304 126658 152004
11693 152004 150389 152660 179110 139898 135107 147699 152438 184669 200770 191496 125790 80852
11681 80852 17334 6981 64356 91606 115501 132599 113023 108975 114235 103799 96233 90838
11669 90838 85200 70697 57182 64593 49766 52430 44860 61771 46934 38375 57550 59087 88862
11656 88862 116222 131672 121884 129516 83028 71523 75202 25078 9932 -705 19886 51386
11644 51386 90003 103233 93054 41053 32745 10521 -12197 -6341 14793 20367 22237 48184
11632 48184 44365 45512 42126 37751 36856 21246 30067 38902 42955 61504 61366 26809 13689 31395
11618 31395 77409 45290 31258 43106 39259 77273 61365 69722 18404 -13698 22860 55294
11606 55294 47550 61914 69162 64320 56275 50192 19566 -19950 -27254 24555 59385 1889 -39094
11593 -39094 -36749 -19617 3100 13681 -5454 38088 29395 12938 31263 76946 83170 76122
11581 76122 58567 22952 17132 -3199 10928 3298 -4832 -43573 -18932 6743 -1954 655 3958
11568 3958 -18713 -18620 -23477 -15644 18536 16445 29823 78206 46722 26166 12427 35034 3658
11555 3658 -62678 -96790 -75274 -61240 -87212 -71365 -51410 -44959 -24991 -4876 16285 16181
11543 16181 10544 -35386 -56979 -79510 -51816 -46348 -46412 -52330 -62754 -28715 9353 33646 56582
11530 56582 -17439 -54714 -55560 -57039 -20347 -18928 -30163 -35126 -30405 -25465 -63618 -74581 -76648
11517 -76648 -45148 -36247 -31032 4067 -15729 -9369 -23842 -68723 -110823 -111470 -56286 -267 -45413
11504 -45413 -25639 -13334 -49662 -93050 -81388 -110107 -146588 -150755 -118886 -155737 -157715 -161842
11492 -161842 -162861 -104486 -99096 -90044 -99679 -111347 -81786 -111282 -99669 -88828 -75715 -72534
11480 -72534 -90040 -120317 -110910 -109439 -111842 -131136 -90898 -85905 -66623 -66162 -64373 -98602 -147395
11467 -147395 -144917 -125241 -124053 -138193 -136964 -138760 -132614 -146752 -105967 -103187 -141756 -176442 -167284
11454 -167284 -139658 -157726 -143974 -125153 -113967 -161267 -187054 -171856 -151101 -164690 -163020 -133697
11442 -133697 -89165 -84161 -92404 -111675 -150133 -174447 -245379 -302102 -289287 -238956 -206313 -156181
11430 -156181 -131571 -131393 -146085 -116148 -68221 -83617 -125216 -165820 -187798 -189067 -150905 -127738
11418 -127738 -135901 -123684 -147627 -152991 -176115 -167956 -131721 -156585 -212755 -215185 -187347 -184202
11406 -184202 -146794 -124238 -154972 -151089 -138947 -163255 -200519 -217233 -210458 -174308 -192274 -192819
11394 -192819 -204726 -210207 -189315 -204632 -219882 -192509 -213884 -212289 -186626 -196072 -199632 -209972
11382 -209972 -197609 -227014 -249454 -253368 -199368 -169516 -108239 -138619 -230745 -260318 -233305 -257640
11370 -257640 -241751 -211295 -180458 -174193 -207630 -267232 -289520 -322032 -289891 -281107 -271874 -295769
11358 -295769 -305633 -294022 -259114 -266924 -259807 -250541 -257984 -256020 -230402 -251553 -261493 -228886 -251151
11345 -251151 -218742 -166234 -149021 -148858 -205091 -193646 -211162 -222889 -241366 -243760 -236362 -218446
11333 -218446 -207979 -238972 -263267 -267353 -273022 -226032 -198042 -246542 -264135 -284355 -267288 -301432
11321 -301432 -302202 -307877 -306322 -286685 -286285 -315374 -291930 -274417 -289319 -260740 -247560 -250532 -240067
11308 -240067 -261724 -240993 -216645 -183830 -188721 -213438 -218342 -224275 -279225 -300061 -305918 -299543
11296 -299543 -279645 -305988 -285272 -272487 -275437 -327769 -341006 -345962 -333780 -303949 -301238 -287117
11284 -287117 -284177 -328067 -341714 -336875 -337529 -338280 -303231 -328999 -330288 -317756 -351059 -336849 -299336
11271 -299336 -253568 -266813 -287584 -276980 -332165 -356137 -332607 -290727 -256611 -291666 -322270
11260 -322270 -326341 -250327 -238516 -263697 -260836 -303626 -308788 -334279 -335752 -333021 -343575 -340547 -366473
11247 -366473 -362309 -390093 -405114 -389910 -351217 -344021 -337934 -372802 -384488 -336136 -321106 -334232
11235 -334232 -353268 -385731 -363261 -315258 -349723 -377905 -395175 -384108 -414844 -413755 -391293 -386933
11223 -386933 -379570 -366842 -380706 -399305 -409346 -412526 -377091 -353858 -375852 -365298 -350771 -390884
11211 -390884 -415871 -419167 -462898 -454653 -428026 -408505 -385411 -338980 -307788 -291903 -323053 -383614
11199 -383614 -430132 -419910 -409915 -385156 -381702 -363475 -390855 -406692 -454954 -478044 -454377 -450087
11187 -450087 -445591 -455059 -454283 -422177 -415227 -424673 -424182 -418277 -425477 -384245 -362379 -379607 -388978 -416090
11173 -416090 -435100 -439509 -425555 -429396 -466372 -471840 -484462 -525675 -488253 -456336 -467580 -475582
11161 -475582 -461993 -448023 -450698 -457639 -485961 -486687 -484308 -491334 -501579 -493468 -470882 -433551 -432559
11148 -432559 -429699 -448400 -495667 -518617 -458964 -450473 -457090 -455857 -486640 -519984 -503662 -535150
11136 -535150 -485209 -478104 -528326 -533963 -483926 -477180 -478690 -468072 -480705 -472138 -473595 -506776 -540854
11123 -540854 -548520 -534154 -536496 -584370 -599633 -564792 -538339 -552899 -551469 -531108 -515000 -522467
11111 -522467 -518548 -545264 -529417 -518879 -503010 -486152 -488493 -517675 -500945 -515993 -540208 -526868
11099 -526868 -536367 -562154 -569719 -562816 -559632 -559458 -495755 -511918 -525421 -529472 -510748 -527168 -533836
11086 -533836 -500173 -496407 -527781 -560067 -547930 -558569 -579219 -573774 -557258 -557411 -539103 -526676
11074 -526676 -545733 -513893 -512434 -553070 -576620 -572491 -569368 -575443 -579665 -572788 -561424 -583248 -592452
11061 -592452 -590969 -559471 -617373 -594684 -569858 -587512 -532887 -539795 -567105 -567930 -541059 -551210
11049 -551210 -569266 -643878 -667894 -569618 -518632 -588387 -622767 -649523 -653631 -649700 -621026 -603299
11037 -603299 -572034 -591922 -605592 -594320 -552307 -504866 -511985 -490347 -479496 -494908 -491130 -469914
11025 -469914 -437699 -423787 -395580 -431601 -475144 -507766 -485143 -415547 -398182 -410374 -384489
11014 -384489 -399597 -373028 -359351 -373948 -404748 -464408 -486747 -486133 -467691 -465291 -440545 -407230
11002 -407230 -425540 -419042 -441064 -443159 -445205 -476476 -488626 -471233 -483333 -504479 -486476 -508730
10990 -508730 -549771 -581704 -564209 -540376 -537322 -520613 -555425 -587714 -620422 -596353 -584855 -616146
10978 -616146 -649022 -643820 -627068 -637937 -665783 -671682 -670009 -695729 -719936 -726868 -670452 -687627
10966 -687627 -712000 -748531 -788265 -763797 -736975 -718597 -754445 -738795 -742914 -741915 -723190 -708784
10954 -708784 -656802 -667130 -711760 -773881 -787701 -782076 -797928 -749636 -728285 -742246 -741497 -756227
10942 -756227 -819238 -824139 -817512 -799875 -763345 -736205 -753960 -759233 -740506 -727839 -753501 -760119
10930 -760119 -767856 -819855 -818585 -834450 -851230 -827897 -790301 -791289 -774037 -768199 -799740 -809783
10918 -809783 -796408 -789847 -793730 -812675 -812028 -840935 -830392 -795496 -790782 -780402 -803223 -830359
10906 -830359 -861778 -869692 -819946 -779526 -778614 -818426 -806645 -813578 -811373 -840672 -889326 -898866 -883073
10893 -883073 -853502 -867489 -892134 -899380 -856275 -838315 -863115 -840603 -865650 -868084 -881353 -885716
10881 -885716 -895217 -914420 -899841 -909907 -904179 -903775 -904569 -863710 -866553 -892769 -878429 -868277 -893032
10868 -893032 -889352 -902874 -916667 -924987 -927090 -926777 -928375 -936945 -942138 -954568 -961124 -956078 -952756 -937314
10854 -937314 -958086 -961689 -942511 -910819 -902001 -932773 -943695 -950856 -954981 -994013 -993516 -982030 -981842
10841 -981842 -996745 -1018890 -1033276 -1038503 -1010634 -989472 -982883 -988956 -1034573 -1064569 -1068940 -1050280
10829 -1050280 -1033217 -1025621 -1006567 -986006 -980648 -983365 -987385 -982917 -993246 -1031590 -1057624 -999940
10817 -999940 -1003782 -998175 -990223 -1016428 -1028922 -1047914 -1056252 -1063950 -1101912 -1101914 -1124457 -1127266 -1089191
10804 -1089191 -1029792 -1057662 -1054569 -1019358 -1029899 -1053717 -1040528 -1006425 -1054572 -1092880 -1087602 -1123962
10792 -1123962 -1119055 -1148960 -1152433 -1121797 -1100314 -1107963 -1090750 -1108114 -1135181 -1155069 -1126151 -1155889
10780 -1155889 -1176893 -1166634 -1156677 -1161772 -1190243 -1158409 -1192931 -1251262 -1238020 -1220308 -1199901 -1182599
10768 -1182599 -1197163 -1196267 -1215266 -1251816 -1343128 -1335504 -1276732 -1269629 -1283865 -1287944 -1297528 -1261281
10756 -1261281 -1291797 -1287521 -1294605 -1291722 -1316957 -1301571 -1312548 -1292821 -1343679 -1385405 -1378819 -1377440
10744 -1377440 -1427443 -1414145 -1354105 -1310554 -1371480 -1391604 -1396413 -1391414 -1384002 -1367145 -1361487 -1364881
10732 -1364881 -1375627 -1404900 -1446186 -1448778 -1396385 -1396433 -1387988 -1431503 -1438573 -1433575 -1443109 -1410541 -1414229
10719 -1414229 -1424619 -1446310 -1482362 -1490440 -1511526 -1527721 -1558173 -1516868 -1489034 -1475527 -1489460
10708 -1489460 -1548639 -1577665 -1601434 -1570029 -1515118 -1524651 -1541898 -1562526 -1565766 -1591410 -1594752 -1589212
10696 -1589212 -1568876 -1598221 -1648197 -1685676 -1709854 -1708529 -1739863 -1729700 -1711302 -1752521 -1776153
10685 -1776153 -1771286 -1740767 -1725348 -1746312 -1776958 -1792027 -1794843 -1794423 -1810829 -1836242 -1908403 -1986193
10673 -1986193 -2031376 -2015995 -2015559 -1989714 -1973154 -2011299 -2000037 -2005031 -2054249 -2066562 -2059712 -2120556
10661 -2120556 -2185009 -2182514 -2171804 -2168311 -2198438 -2224331 -2298236 -2303355 -2333942 -2369036 -2393758 -2386470
10649 -2386470 -2366592 -2383769 -2397791 -2433014 -2459796 -2507181 -2497551 -2529909 -2550446 -2571917 -2587862
10638 -2587862 -2584055 -2637669 -2699343 -2717879 -2712196 -2739161 -2780707 -2796103 -2853934 -2905317 -2935416 -2990360
10626 -2990360 -3021768 -3028854 -3010057 -3041633 -3093271 -3079439 -3074024 -3053370 -3006060 -2925671 -2771364
10615 -2771364 -2551203 -2168743 -1559912 -608553 813779 2772514 5365288 8427095 11249654
10606 11249654 13002004 13322438 12671760 11634372 10913768 10878956 11789715 14036142 17847057
10597 17847057 23313630 29859554 35602937 38283103 37278849 33984284 30377061 27744325
10589 27744325 26677333 27366578 30172939 35334789 42775950 51213651 57816554 59589344
10581 59589344 56002186 49453075 42786567 37520531 34138984 32685549 33199608 35617637
10573 35617637 39589608 44009594 46854895 46254733 42235750 36573191 31184100 26957588
10565 26957588 24054772 22420158 21917202 22354179 23350214 24336567 24554361 23430906 20980445
10556 20980445 18015079 15192699 12782911 10882468 9419346 8271659 7365224 6646725
10548 6646725 6066848 5606144 5164408 4754903 4396310 4114772 3825006 3560892 3368935
10539 3368935 3213724 3099114 3080066 3104177 3175505 3279304 3384455 3434769 3391923 3368436
10529 3368436 3312746 3285682 3272762 3252086 3098365 2862140 2634997 2421874 2183553 1990776
10519 1990776 1873320 1733555 1626087 1566243 1495977 1415321 1372705 1395428 1418661 1461112 1576365
10508 1576365 1783071 2143775 2622140 3146947 3566730 3806715 3896503 3920235 3920774 4008148
10498 4008148 4155887 4176602 4018981 3661205 3160404 2617156 2199445 1858934 1606155 1403502
10488 1403502 1261510 1180371 1079247 1003972 911061 826549 769669 713557 673861 618350 620221
10477 620221 621429 587292 494624 428918 372811 325184 295988 260587 203503 143372 112575 126238
10465 126238 114402 69159 54190 75790 60612 29657 2957 -28603 -98056 -99527 -122827 -86039
10453 -86039 -78508 -112382 -133646 -177148 -181737 -176663 -183619 -173010 -184424 -191250 -150484 -155426 -202854
10440 -202854 -257809 -302519 -320561 -342314 -366960 -386520 -381334 -406249 -437719 -425096 -472594 -523889
10428 -523889 -535583 -551285 -546686 -535397 -508079 -519459 -589881 -633689 -654690 -625902 -637494 -650402
10416 -650402 -646684 -631020 -641011 -656388 -645440 -633267 -671177 -736449 -777973 -766305 -716106 -702714
10404 -702714 -722721 -781218 -770576 -743135 -751835 -777439 -791852 -810423 -841744 -860129 -850222 -800639
10392 -800639 -778297 -779434 -791456 -780782 -761913 -738302 -773855 -788819 -812707 -795131 -803095 -843482
10380 -843482 -826130 -789477 -763641 -699438 -591783 -487166 -367765 -243592 -118861 -34362
10370 -34362 -96724 -269082 -362688 -527407 -720384 -833819 -903303 -943583 -956272 -970349 -1038529
10359 -1038529 -1061309 -1050586 -1056501 -1071158 -1132436 -1172023 -1187587 -1200322 -1219920 -1218207 -1206733 -1261644
10347 -1261644 -1311438 -1321082 -1348824 -1389288 -1353765 -1349235 -1412420 -1415392 -1378468 -1310239 -1313789 -1387331
10335 -1387331 -1390674 -1383144 -1374180 -1362555 -1355343 -1414911 -1445152 -1478544 -1505085 -1523410 -1551077 -1564972
10323 -1564972 -1587577 -1571484 -1553320 -1576801 -1611688 -1630136 -1658654 -1664909 -1658525 -1659965 -1633351 -1682446
10311 -1682446 -1734947 -1771892 -1742145 -1711285 -1733212 -1767073 -1784498 -1795062 -1840452 -1851960 -1816738
10300 -1816738 -1845999 -1907114 -1922697 -1931316 -1921335 -1933903 -1942209 -1962024 -1995377 -2018930 -2034631 -2027585
10288 -2027585 -2011007 -2064279 -2063197 -2061639 -2069274 -2105420 -2087125 -2053035 -2025314 -2008649 -2040455 -2076126
10276 -2076126 -2126054 -2142060 -2180694 -2192149 -2235183 -2267105 -2285667 -2311013 -2295938 -2282978 -2255766
10265 -2255766 -2231023 -2221910 -2236524 -2264287 -2269527 -2262286 -2290912 -2291117 -2311445 -2333567 -2359775 -2388632
10253 -2388632 -2448174 -2503841 -2551649 -2586085 -2610108 -2641580 -2700418 -2767135 -2787632 -2820702 -2863312
10242 -2863312 -2916511 -2946637 -2981301 -3043975 -3074503 -3111173 -3143712 -3154394 -3194631 -3225486 -3260143
10231 -3260143 -3310635 -3337988 -3327633 -3359090 -3421109 -3458176 -3476583 -3502242 -3581336 -3659212 -3706439
10220 -3706439 -3715430 -3737954 -3787762 -3806296 -3787932 -3858707 -3935854 -3983184 -4021630 -4025309 -4052121 -4109133
10208 -4109133 -4137379 -4141665 -4196937 -4229117 -4257178 -4266785 -4284846 -4329562 -4339633 -4316488 -4298422 -4290723
10196 -4290723 -4211655 -4128281 -4036297 -3892206 -3769940 -3643456 -3513551 -3408931 -3336246 -3150317
10186 -3150317 -2894639 -2650243 -2444837 -2258773 -2071358 -1861577 -1564670 -1156319 -767190
10177 -767190 -417241 -90014 171768 313856 355347 376813 320817 212752 34235 -236816
10167 -236816 -613092 -1101769 -1588924 -2100422 -2584936 -3003831 -3353955 -3641458 -3827210 -3898587
10157 -3898587 -3882144 -3768783 -3483616 -3068598 -2538019 -1994405 -1413239 -691072 186223 1291473
10147 1291473 2574355 4035119 5787863 8039835 11217145 15981074 23283872 34620643
10139 34620643 52327162 79624464 119140413 169058055 218917906 255705198 277093424
10132 277093424 285203991 285684653 291177983 305286231 316592359 315257101 298440605 264491688
10124 264491688 221596684 182287977 151904590 129620859 113066820 100479196 90673736
10117 90673736 82846376 76474730 71004178 65937807 61043784 56282315 51721026 47548317
10109 47548317 43841699 40593208 37631432 34960177 32507359 30277268 28318117 26585534
10101 26585534 25084201 23791066 22657704 21624053 20641944 19768135 18922434 18131329 17431875
10092 17431875 16791626 16174255 15561689 15016858 14506314 14051237 13602883 13203784 12893473
10083 12893473 12609556 12381046 12262325 12196680 12236848 12375195 12676458 13055071 13445047 13767149
10073 13767149 13886627 13896023 13795682 13700524 13630243 13510608 13278102 12885566 12342541 11715687
10063 11715687 11061754 10431202 9863680 9372953 8985861 8703692 8437617 8183621 7927953
10054 7927953 7710907 7534239 7409630 7226709 7068806 6901681 6753438 6655172 6538061 6367136
10044 6367136 6179853 6068869 6011968 5891984 5752323 5693911 5652725 5586147 5509474 5427925
10034 5427925 5328165 5255838 5190792 5136336 5060390 4981075 4957329 4932206 4864937 4814160 4742913
10023 4742913 4712047 4663094 4612629 4562717 4480240 4403917 4383834 4389584 4345569 4294307 4235766
10012 4235766 4141846 4072364 4025528 3980151 3937894 3925314 3924931 3858275 3826393 3804494 3768491 3723040
10000 3723040 3689707 3632455 3614115 3591868 3541021 3540296 3542803 3508885 3475661 3441156 3416628 3387949
9988 3387949 3366194 3371640 3338226 3277951 3234058 3206988 3126323 3061263 3002957 3009369 3039994 3054453
9976 3054453 3049798 3000648 3015441 3012461 2969815 2987788 3005475 2983942 2924982 2870163 2889656 2921266
9964 2921266 2905596 2881978 2852311 2819111 2802596 2779952 2792015 2736487 2676338 2688657 2660780
9953 2660780 2659120 2674231 2652408 2637612 2667793 2667684 2638753 2643934 2588609 2561312 2563916 2561044 2568594
9940 2568594 2547649 2488583 2457655 2429510 2416322 2390929 2352207 2308303 2291878 2261294 2219110
9929 2219110 2217151 2260853 2236954 2211631 2180542 2192543 2179173 2171587 2173172 2167720 2145981 2107712
9917 2107712 2097275 2114211 2143429 2161106 2125131 2103424 2115004 2088037 2080167 2099423 2094978 2085184
9905 2085184 2069424 2061405 2048129 1999529 1976339 1978680 1996863 1991578 1968537 1990821 2041641 2037412
9893 2037412 1956354 1923234 1920912 1946049 1909952 1893228 1904613 1893016 1896192 1909822 1903801 1866957
9881 1866957 1854352 1860985 1833394 1835915 1836941 1857724 1876332 1879379 1870992 1849395 1831419 1821051
9869 1821051 1796780 1753808 1727211 1683755 1648969 1685759 1676296 1632270 1697519 1741489 1735580 1722660
9857 1722660 1717820 1700846 1632164 1635852 1630777 1676840 1685242 1691270 1649983 1600320 1577641 1585458 1614561
9844 1614561 1618310 1624385 1634002 1633344 1656007 1654191 1622671 1607337 1595760 1594404 1568914 1532627 1515153
9831 1515153 1513671 1558445 1544333 1487131 1494077 1498240 1453571 1486490 1503055 1455175 1404769 1381054
9819 1381054 1390433 1384169 1375251 1380663 1344251 1355411 1373834 1357370 1315813 1306478 1322690 1365001
9807 1365001 1323177 1304031 1311192 1333602 1336081 1320605 1334231 1350563 1331167 1306622 1306445 1328230
9795 1328230 1352099 1378649 1370016 1329564 1318096 1340250 1363275 1326955 1302287 1312249 1326014 1327122
9783 1327122 1296047 1288107 1245361 1247891 1296150 1259992 1213367 1228204 1257458 1224455 1206591 1217402
9771 1217402 1186516 1186054 1195232 1224981 1190289 1190477 1187470 1203418 1181643 1171482 1165272 1143477 1128506
9758 1128506 1124693 1102574 1083394 1111306 1148554 1171412 1187493 1171139 1156708 1163209 1168098 1228856
9746 1228856 1221708 1191408 1151351 1102913 1109076 1128678 1139310 1186914 1226754 1275139 1310467 1405251
9734 1405251 1577187 1787186 2018483 2283741 2476364 2579233 2616576 2625634 2645127 2663359
9724 2663359 2728624 2673264 2563694 2428207 2258825 2080488 1918643 1794598 1683365 1615104
9714 1615104 1562845 1506937 1471817 1453050 1435440 1398503 1338883 1299616 1257648 1263588 1260289 1241115
9702 1241115 1239616 1235691 1222852 1168523 1113784 1073337 1055113 1106818 1105818 1141075 1131174 1141561
9690 1141561 1105921 1069478 1067500 1093290 1064577 1060378 1048559 1060578 1019408 1018634 1058044 1036454
9678 1036454 1000664 980248 998880 1023821 1012905 1000319 1037099 1025547 1000679 987567 936558
9667 936558 942575 965096 955803 966735 996028 1006091 976831 1021818 1049570 1035712 1020477 1037409
9655 1037409 1011719 1014298 1023137 951960 915890 923566 960183 976282 975177 969664 1011600 1056222
9643 1056222 1069666 1035490 991785 968400 978712 964081 936762 914901 927587 928017 938225 935557
9631 935557 886422 841436 825190 834821 879469 883253 870687 852232 812259 840003 853758 860508
9619 860508 856892 858678 831116 838958 848826 838242 841952 839375 827124 786602 770763 775031 775469
9606 775469 780963 808150 813249 818148 814508 797279 773163 760401 726149 745902 768882 765096 792291
9593 792291 793677 762675 744902 735586 801625 807944 782089 804844 796126 788469 806139 794088 725010
9580 725010 685354 750297 813265 810301 828223 817080 785688 762029 734617 742587 770378 776521
9568 776521 831179 836600 806589 752864 745940 756669 764861 756653 742234 770747 783848 733490
9556 733490 704971 731385 766204 792198 793666 764991 754239 739202 727594 674658 687252 695799
9544 695799 715175 729149 694903 668850 657824 661358 685740 732471 761386 728823 728181 715659
9532 715659 695252 688018 735901 746550 753847 733790 706900 719492 728450 686569 628089 610501
9520 610501 621757 620203 624915 665093 663420 650573 669481 677003 651553 668286 650776 653277 659373
9507 659373 702466 718921 690995 643811 648513 671538 687428 697660 673721 689714 734618 733608
9495 733608 710797 731543 697747 666328 671950 667359 664797 632512 624654 591506 580024 571808 567593
9482 567593 609833 617296 583592 573919 584001 623193 608442 595503 653769 688979 708653 715671
9470 715671 664250 622515 600949 599500 606371 621334 607467 589488 588281 606950 614777 615782 622431
9457 622431 607103 605439 603725 577768 560442 578899 648445 681061 670372 616315 589397 619074
9445 619074 617913 541567 487003 516456 529793 527133 556208 592928 614703 604730 553658 587967
9433 587967 587525 543195 539104 533041 498233 527689 543125 526101 498783 516246 521873 506000 491901
9420 491901 529410 557199 583254 602094 618244 593655 568529 566794 559078 554892 551487 517667
9408 517667 511655 551113 601843 599030 592944 582394 589537 579029 566015 562975 548233 523126 495300
9395 495300 479281 489398 487821 488576 504239 508193 564092 596945 582666 554120 529161 522265 549815
9382 549815 557678 549694 553739 516788 468293 480151 501053 509631 458648 443160 456569 480372
9370 480372 526613 522837 524356 531604 541668 528867 536534 544101 483083 469043 472604 488460 529060
9357 529060 554967 542914 554249 506316 455424 447702 468841 538769 558045 532122 574371 541326
9345 541326 488011 491284 494252 466811 485836 468137 461215 443012 462026 438665 413899 462603
9333 462603 456959 456809 473749 472246 477257 464978 442378 443078 481266 482505 450896 442889 462784
9320 462784 455833 428990 380200 459614 486254 467356 437687 457155 463642 453654 481650 512802
9308 512802 493648 461532 480714 519580 516987 509952 503185 496129 459720 440771 456233 453198 444790
9295 444790 463132 439773 425786 403415 416465 443686 433140 415561 391429 380803 392561 415801
9283 415801 426676 430850 412840 458312 473080 417769 384352 396040 423425 403522 373967 366310
9271 366310 409000 433899 426673 417488 441351 413468 390507 396100 420388 390900 377904 416594
9259 416594 454727 441208 389199 373824 383440 429517 456342 465025 447701 427225 404237 401209
9247 401209 413560 453813 433226 389189 398217 388148 381437 397202 400379 431325 424762 407814
9235 407814 395514 403867 384219 406398 368243 359179 366385 393686 414032 424551 401652 364026
9223 364026 336393 351270 342646 376365 370649 355832 333645 370681 403765 370365 352472 350431
9211 350431 348759 331717 348525 363987 351876 321827 317681 330009 344794 320248 321360 332454
9199 332454 359253 378292 354641 379608 394241 379151 346509 332412 365894 401420 361022 343645
9187 343645 351877 357318 377386 407585 425785 398382 356667 378711 390294 338669 341783 343845
9175 343845 375553 388437 334822 297217 324974 328038 347224 357096 376478 386096 363031 345963
9163 345963 284358 299310 328843 314506 346082 399712 471027 432962 378911 337373 328804 332126
9151 332126 352968 354681 356057 317373 299279 316480 339326 359016 386455 404222 388650 324677
9139 324677 317533 344520 325675 312611 312130 326789 359879 407575 342542 325730 320936 327735 348271
9126 348271 358775 337667 342642 356752 318998 296303 305136 342399 354485 335457 308349 322393
9114 322393 334528 325867 289654 289457 326702 348231 344278 307268 288409 289418 281887 243545 259667
9101 259667 305328 335987 347700 326697 273073 306640 302000 259606 272630 315552 352925 355042
9089 355042 308842 253572 192184 221556 281180 274008 273955 291725 269931 265509 296003 336263 346795
9076 346795 327551 306858 310440 307056 317727 284344 284256 273772 269934 264942 227194 250384 258767
9063 258767 244128 233292 214173 202969 236561 257405 245901 233601 225013 255880 293130 273036
9051 273036 227767 245654 288492 320783 335832 316713 283634 293679 293871 257468 204582 245587
9039 245587 258049 232099 244306 237910 230633 241935 269269 283749 246664 196568 203018 216035
9027 216035 226521 242569 266559 279360 255863 279219 334031 370695 384368 361556 320916 316405
9015 316405 277970 274429 305403 287962 292817 299692 256887 193390 201588 228490 268066 290533
9003 290533 291433 264934 232810 249414 251076 226370 167409 155208 241584 262265 222129 222597 262856
8990 262856 271529 218105 205950 236364 277310 235947 221832 204655 174524 169281 174857 191341
8978 191341 209073 228349 218652 237919 273411 281045 277553 258996 240736 224822 250567 267385
8966 267385 238471 254602 185377 139098 148897 146658 183969 223707 221764 236931 224505 227515
8954 227515 235502 222406 246758 248328 239520 172226 106936 85518 135124 160772 151966 177506
8942 177506 186692 219843 259294 258294 243260 241082 246900 264002 254775 249471 189656 145498 156144
8929 156144 177557 175084 182727 206149 226830 246558 245299 245503 253530 208213 202002 161562 143171
8916 143171 146473 119252 135127 203618 221179 222934 200125 218024 204868 181734 172001 169116
8904 169116 179002 188582 198266 204496 164358 136265 177160 174732 162339 169246 167216 164748 177821
8891 177821 196141 163904 128235 109361 104338 83049 59476 101674 146938 176127 210790 225496
8879 225496 154964 124203 124738 158826 161878 123604 131437 134259 139544 94290 119661 139599 132549
8866 132549 156502 116470 119282 138626 128636 163606 150691 133412 166198 134625 100223 115778
8854 115778 114872 141447 170017 117600 85503 113620 125786 167886 193004 140117 112627 99055
8842 99055 118629 79948 93112 152872 121473 56220 69282 90694 110519 94724 98208 67742
8830 67742 54453 56919 95102 97523 85208 41193 41861 55040 53602 77928 98126 83766 92749
8817 92749 82957 68259 53660 75244 71142 77558 59705 117425 138713 118041 128932 114215
8805 114215 66140 33995 12498 51631 31409 24028 28602 30101 26686 39045 61150 65636 54963
8792 54963 33728 56681 70870 49249 44407 50352 46679 100617 156984 174621 199412 202159 199819
8779 199819 191071 191427 163457 148724 143202 133749 116984 152203 182964 242037 373000 525874
8767 525874 644766 819160 929975 921449 838770 709224 578021 495032 437538 388416 331140
8756 331140 305434 269396 231859 204094 180199 189141 215292 197364 187378 180476 212635 260518
8744 260518 350994 365602 340932 320721 327324 351127 355942 352815 385349 433877 472148 490188
8732 490188 527118 591822 646959 617870 630815 717269 720010 692972 681590 666652 650483 616926
8720 616926 553637 513320 548422 625437 699661 793783 857825 912948 887777 859905 776045 695798
8708 695798 689096 675881 606446 506545 471432 442679 460769 457668 421624 416611 415717 454296 449383
8695 449383 486795 547444 623813 700648 840842 961920 1108271 1265502 1373803 1476091
8685 1476091 1585542 1637743 1652468 1653531 1648905 1630532 1573047 1560421 1507403 1423968 1384538 1351754
8673 1351754 1296695 1285671 1249356 1223461 1207170 1237521 1332153 1444303 1457324 1415934 1420668
8662 1420668 1408880 1437518 1495310 1511886 1503296 1508734 1571937 1698676 1801617 1851166 1834290
8651 1834290 1747588 1686444 1678827 1709336 1779787 1875323 1953808 2057479 2177069 2296668 2333338
8640 2333338 2330606 2287695 2265614 2315154 2368018 2421162 2470725 2495088 2580503 2676318 2763728 2821214
8628 2821214 2836753 2760690 2673193 2624183 2660322 2748395 2759457 2720603 2632460 2583509 2583884 2608043
8616 2608043 2657940 2610527 2587805 2550144 2517277 2579945 2690723 2747514 2822119 2931088 2933710
8605 2933710 2822529 2741182 2637820 2574014 2562169 2600400 2678141 2672993 2634577 2552234 2533541
8594 2533541 2519965 2534537 2578928 2605276 2653051 2698359 2726324 2789276 2857571 2935084 2950692
8583 2950692 2925283 2951773 2976049 2974292 2985194 2995552 3043556 3116491 3113490 3021941 2881159 2716350
8571 2716350 2571024 2428590 2292851 2158244 2056799 1990679 1881736 1833822 1768350 1708873
8561 1708873 1656477 1648594 1682787 1745347 1742802 1773129 1844772 1913558 1894921 1898669 1922654 1964352
8549 1964352 1961514 1967922 2036309 2086925 2056192 2027851 2066678 2077947 2047300 2046717 2054236 2040263
8537 2040263 2015312 2037031 2054743 2107102 2153019 2126753 2003438 1904069 1809360 1721101 1584108
8526 1584108 1519748 1488079 1447396 1409895 1393568 1362977 1310857 1271595 1223681 1183924 1171750
8515 1171750 1167387 1164935 1161398 1144780 1158223 1174462 1180915 1197486 1204107 1191711 1204675 1215120
8503 1215120 1198992 1201817 1218721 1228065 1265146 1261461 1221293 1205751 1251742 1261188 1283590 1336132
8491 1336132 1361166 1358823 1396218 1403471 1353130 1342237 1366168 1364397 1299734 1233816 1192106 1129678
8479 1129678 1088069 1041955 985932 948750 965971 944167 871262 806200 808675 830764 828379 811107
8467 811107 789393 755308 715044 719435 713111 729050 726574 707724 706238 732500 703179 661790
8455 661790 666919 694801 723668 760619 815791 812380 810735 808628 772657 744675 744216 788157 782948
8442 782948 775235 770397 733413 705621 669305 640020 618447 628409 644198 630522 609183 615633
8430 615633 634964 685122 709916 692695 611278 529950 494732 523721 525727 490329 533858 591674
8418 591674 583981 556697 503999 491791 488070 446764 411266 397893 415105 449558 482783 433128
8406 433128 416436 415974 395100 406157 431108 392089 414477 456359 473489 458076 403263 393251
8394 393251 424537 414424 434537 464596 484296 478467 492447 501838 479399 486717 464953 456292
8382 456292 444335 432365 396931 393812 347138 362574 377600 417605 409987 404878 365258 346174
8370 346174 347603 388274 392966 392790 388055 418508 433631 403216 410430 390971 342289 348559 360504
8357 360504 366202 362284 353926 327793 281069 279101 259141 260114 260428 273825 295372 317502 351378
8344 351378 344035 347846 347086 345967 352885 402542 427591 392812 396273 375047 320962 297758 322049
8331 322049 328972 350382 366377 388810 404472 419092 427258 418388 403772 376128 344319 341110
8319 341110 344694 323690 273119 302996 304405 264310 266538 293085 298969 294134 276270 288412 304638
8306 304638 298419 311237 391548 433028 396014 370920 349869 334929 318664 317139 304301 306741
8294 306741 320597 300334 261443 235048 234579 226148 229636 241145 253475 260917 283185 340949 435364
8281 435364 443169 374561 297506 262220 245102 235423 249783 277576 278531 263530 279745 259786
8269 259786 217549 190434 227750 240515 254324 256970 229603 228028 223017 188290 170586 195309
8257 195309 180371 228762 243566 275411 240454 183282 180690 201663 280161 270778 215811 217025
8245 217025 258394 313075 374012 359193 296054 243531 213993 211510 218206 199128 214089 219555
8233 219555 203398 227903 242980 210361 188227 165926 168195 173382 154746 143299 154281 157612
8221 157612 147889 163878 192584 193279 199854 198344 161379 137952 174985 185682 203272 224727 243387
8208 243387 236434 229052 238836 220616 223540 222585 193696 183092 156283 172241 208977 233587 235430
8195 235430 255978 195628 159476 196423 209482 184534 187998 197232 225056 244857 234193 223208
8183 223208 214046 188209 185722 224207 240961 215119 188276 189505 172922 140953 161435 163018
8171 163018 106879 123250 172870 188897 152919 119442 116028 154401 155782 139170 138364 135824 131499
8158 131499 110366 123002 176552 195146 161219 114222 81636 142218 147096 114496 106545 89145
8146 89145 80616 134193 145435 130134 159278 192968 191883 128213 129173 144758 90886 87323 107614
8133 107614 136444 154935 174820 150869 129731 141871 148675 184620 190743 141019 106782 86245
8121 86245 55167 42164 66591 60516 62413 104954 117390 122055 126838 114650 121180 124397 125228
8108 125228 143741 150816 143755 152230 135256 132830 154435 115352 97597 115899 91415 82410 52444
8095 52444 38186 67222 110090 142847 157723 114364 63355 75105 66408 73154 117576 121339
8083 121339 83700 73419 54060 38643 24979 46755 40458 26934 44635 42264 7309 -21702
8071 -21702 -1613 37697 73786 36861 21587 6508 23097 61856 113057 92021 17250 7958
8059 7958 33651 3069 -6396 17139 61814 46620 25247 16996 9538 -7757 -28607 -49324 -44851
8046 -44851 -32924 -61878 -63563 -34218 -24885 -58430 -120098 -119071 -63454 -54525 -48821 -37038 -48371
8033 -48371 -43847 -20998 -16374 1687 18011 1531 -20818 -40157 -70909 -90758 -73846 -41408
8021 -41408 -44162 -43176 -52590 -75625 -76390 -71189 -86671 -89500 -79858 -99510 -131816 -99131 -36908 -32715
8007 -32715 -51462 -95873 -64146 -24579 47627 93332 194834 363936 580701 937246 1440124
7996 1440124 2000754 2595596 3228193 3835913 4298737 4540716 4492036 4236551 3783494 3286275
7986 3286275 2894739 2625025 2426152 2250681 2072234 1956128 1825530 1690335 1564414 1429292
7976 1429292 1286195 1166574 1070004 1036236 1018596 971227 946349 922549 949996 988971 937044
7965 937044 875954 833831 789982 715819 702130 785334 869454 962428 1048817 1150700 1312184
7954 1312184 1618816 2164796 3032590 4443032 6385750 8397033 9673168 9686628 8744963
7945 8744963 7521366 6502641 5738666 5230933 4869445 4526247 4202113 3891379 3637708
7936 3637708 3404725 3244700 3078326 2916218 2818046 2720072 2651596 2602506 2487057 2291469
7926 2291469 2120830 1985945 1835598 1696772 1604951 1570073 1496523 1486100 1551047 1592568 1655828
7915 1655828 1780399 1876200 1908645 1884659 1876602 1964687 2081863 2299279 2561250 2811279 3063706
7904 3063706 3320590 3519092 3631113 3608757 3457077 3236676 3018839 2847296 2595697 2279253
7894 2279253 1988153 1785941 1663500 1567582 1491695 1402262 1336267 1287684 1206702 1120525 1089264
7883 1089264 1060745 1039183 1048861 1057544 1009516 903072 877176 907845 873921 889248 894480 863491
7871 863491 838932 815715 758495 770880 754571 751286 702843 693001 682274 654956 655189 633086
7859 633086 637479 620201 610364 607950 622145 625098 612053 609348 565829 537172 548978 552787 552251
7846 552251 576584 612360 572091 543323 493898 514770 545056 572501 569759 546987 513012 514998
7834 514998 517898 525449 507329 479037 511504 530850 533664 561281 555473 484458 422300 451741
7822 451741 491410 488766 461359 440843 418255 425725 453293 470035 462775 507616 524515 521436
7810 521436 471218 406891 374771 379752 398931 410299 414425 426127 396750 343612 356870 360105
7798 360105 377051 368585 347092 358324 369113 418869 420858 379953 352827 359349 360617 344645
7786 344645 337949 339722 385364 413013 389398 329123 292268 258677 296149 341576 329843 333293
7774 333293 324522 285641 246589 256701 289279 307033 348531 362552 350994 294881 274350 320631
7762 320631 348804 346645 376597 356335 375019 401636 381903 384623 374946 338506 304632 331093
7750 331093 319267 301900 257377 264124 320380 342611 371179 346976 306091 286451 221728 183590
7738 183590 189732 219596 261634 263737 264615 266422 261105 253782 264160 307144 305086 267185 235653
7725 235653 206722 180978 198055 214606 209340 255416 266396 227261 176833 172150 155003 148746
7713 148746 198166 251665 274780 283047 263114 242840 207566 232913 280368 276511 237627 243369
7701 243369 216856 157891 149996 160293 197842 133534 134845 148105 139806 138588 178740 159720
7689 159720 194890 200591 150912 115552 111847 139093 168235 197090 194638 210983 198181 186046
7677 186046 172930 139421 141133 146535 142816 158891 158711 173521 146665 142876 180547 214787 236373
7664 236373 219962 209569 203527 239051 269888 254258 221906 130094 101439 119023 113941 145556
7652 145556 122071 74303 79349 93417 140702 114039 98964 138506 162274 172899 162576 134205
7640 134205 127137 132575 130099 104494 108234 107423 109248 174526 154717 125101 157378 152944 168895
7627 168895 166035 134995 76214 39095 81731 130569 123989 96452 94446 92182 89480 51617 69339
7614 69339 77443 56330 85097 77596 66369 78103 112270 105066 63824 47710 47132 6180 -15342
7601 -15342 22157 57788 113213 134311 129463 92034 69745 70540 56125 57636 59788 30506 36803
7588 36803 52223 87223 93270 109433 144980 123271 143498 185779 235225 279565 320557 407605
7576 407605 522322 673856 885231 1140022 1400010 1648550 1843591 1925090 1956410 1909266
7566 1909266 1811616 1701542 1622802 1517540 1387586 1279459 1269327 1248754 1244619 1205878 1139808
7555 1139808 1088579 1047333 952505 857060 810353 719507 701503 734535 752758 740327 770492
7544 770492 800579 789140 811594 790496 833367 873395 907024 936298 996679 1118796 1263852
7533 1263852 1449780 1632719 1837703 2051479 2231537 2419067 2630204 2800901 2886585 2997408
7523 2997408 3161114 3280164 3319528 3290501 3252492 3188542 3071266 2951596 2833567 2667758
7513 2667758 2480422 2278039 2068028 1909279 1751739 1582688 1463038 1376398 1299554 1212898
7503 1212898 1150310 1119841 1079551 1021254 980634 948065 916417 920814 916113 854127 820393 819271
7491 819271 825258 821766 844678 850686 829658 835426 893838 959007 1075449 1169765 1255491 1389231
7479 1389231 1585769 1780036 1972115 2216191 2397961 2541172 2547480 2458685 2261571 2045880
7469 2045880 1870802 1668103 1470833 1296257 1158457 1072831 974193 931234 866288 867157 840511
7458 840511 789090 742842 690918 693331 665436 661259 643303 613894 604709 549893 445310 470320
7446 470320 531771 520271 513681 515522 500903 484264 458947 472116 461720 452457 422435 403821
7434 403821 380892 393824 378624 362495 384628 403315 379058 329144 374535 391347 418759 410777
7422 410777 389654 396416 388105 363233 373736 357406 399990 432384 397324 395111 363396 353292
7410 353292 351902 350031 374359 388568 380921 403039 407515 387409 388645 360981 323474 344171 355147
7397 355147 371071 363000 395576 367661 337853 321366 344428 350936 393057 387812 361672 322437
7385 322437 322682 330571 334008 337162 315075 291176 276286 289420 283197 290178 328732 349796 330545
7372 330545 339453 330297 288913 288583 277437 279275 283515 284976 302382 320199 334220 320299 289810
7359 289810 295900 291307 319808 351607 335431 302610 308943 336498 299764 298660 286044 292753 320336
7346 320336 324000 313332 338249 381481 355898 361915 354022 319998 315318 316948 332093 332445 322414
7333 322414 350467 346869 355023 366518 335941 337728 344566 321730 290239 284405 288514 253085 270659
7320 270659 314378 342005 349686 316163 302902 301010 304592 306820 290644 279253 259844 244421
7308 244421 243128 288619 270501 273051 265667 278432 297374 323424 303135 276819 252326 249234
7296 249234 260568 312764 284974 252854 250097 281266 252580 231505 223876 201352 188740 164490
7284 164490 166143 228820 258610 282961 287938 291327 276686 262594 285485 282119 243064 222595
7272 222595 239732 229375 231812 238914 211515 223060 201589 179585 171030 178072 192810 172649
7260 172649 137697 112935 108269 149241 177624 200497 249938 253246 238065 192747 220603 264727
7248 264727 232400 173852 141322 140559 151846 155225 156168 181655 201375 211313 228095 189074 159449
7235 159449 139313 120332 138746 148866 126552 121734 147244 202860 202751 179372 192666 195934
7223 195934 217887 179079 141850 113592 132794 153687 165899 185835 169428 132930 99700 77899
7211 77899 69579 101479 140593 158667 169155 203542 202795 178454 199073 180785 142854 171386
7199 171386 157484 177754 169723 118419 104138 97229 108973 88101 138976 194636 193534 168090
7187 168090 180619 181399 133540 105897 117061 133898 132894 119337 106488 131432 151490 178209
7175 178209 161079 114884 124427 128132 137282 158567 163961 195757 200053 183741 212577 204420 160152
7162 160152 166184 138663 103022 110859 124783 114932 145367 174290 165714 155080 136930 108462
7150 108462 91829 134764 178561 222271 223651 222602 225234 222338 203689 165418 137224 147161 189391
7137 189391 202750 181891 175445 147622 138158 147457 135366 143996 117183 131853 144951 88270
7125 88270 112126 165324 156744 161220 149568 106589 108225 166167 191497 195637 203201 175313 123734
7112 123734 64972 110757 147081 127351 98834 104558 128471 119828 129402 155482 171369 204249
7100 204249 182946 177062 195700 215147 234548 243843 205161 151521 142086 128528 137791 136852 122220
7087 122220 99240 136881 159801 136883 131030 109419 126389 176957 179426 190444 239612 186153
7075 186153 131115 95507 101364 134965 106975 91068 119538 125823 136134 157924 156389 137411
7063 137411 77418 84329 65944 62273 107885 122396 77712 65945 80275 71680 66079 68647 69470
7050 69470 99999 128016 77355 26399 67697 134714 140248 122487 127087 126741 134803 123634 129359
7037 129359 118270 102851 104503 100301 95431 60542 55326 72150 92341 118781 132291 104018
7025 104018 85890 107408 133700 147708 145655 108311 85752 98853 80615 115678 98655 119671
7013 119671 135734 119091 130772 129775 124575 138121 158402 175855 148009 105014 96185 131020
7001 131020 146415 166734 174149 167323 135275 149772 129504 101856 138082 151168 161255 135358
6989 135358 136503 125336 107956 139461 180702 182101 151672 139561 141005 174007 139292 125126
6977 125126 111372 77566 88985 122389 92499 75550 80886 88407 91980 91123 69941 66286 71274
6964 71274 144687 167188 174625 210889 229656 211706 174201 141536 140742 127380 103507 49022
6952 49022 77584 103717 94392 105020 116061 141704 140103 188461 164365 123890 118208 125497 112310
6939 112310 117665 125555 109584 66511 62453 106266 135070 152001 128344 118892 104807 94415
6927 94415 106536 91387 77487 53505 71744 96986 109716 126082 158606 128508 90530 105094
6915 105094 104716 119216 132706 111928 88055 66618 77098 77499 39783 47143 94932 171446 169111
6902 169111 134249 147844 128991 83990 101590 103193 114922 93902 98187 112344 75491 43753
6890 43753 68035 86884 93589 77443 56170 81498 93480 85038 83247 84317 83812 83291 81375 62192
6876 62192 34649 40393 63598 77209 72621 47007 23583 57694 87754 120685 89779 83492
6864 83492 92337 92098 43641 33731 28931 31124 28227 54639 62581 44512 53844 88439 112082 68108
6850 68108 53813 44628 37902 52859 56977 108235 137365 106618 83674 47241 61085 108410
6838 108410 120920 111134 46036 40810 87927 118518 118577 104986 90972 66667 48923 88144 138616
6825 138616 155122 128694 120726 145050 138125 113240 92903 85405 114102 145006 89985 84381
6813 84381 113894 126761 119844 97265 124724 142071 145330 114710 57068 46800 60735 49632
6801 49632 67468 126997 157486 163200 84717 84314 116093 91964 134923 143805 120641 62327 46889
6788 46889 45081 58514 68670 82140 80908 128475 118893 90329 70438 64984 68467 66727 46236
6775 46236 54335 72535 71861 70767 103235 89935 96750 85375 69248 79025 81779 105165 85634
6762 85634 66017 47569 86071 97908 122711 156492 136614 104608 77403 71555 49393 48947
6750 48947 53823 38712 51569 84142 88808 86287 57345 51071 40511 13996 32271 68069 94655
6737 94655 122601 118431 119310 125182 104807 83563 57527 89472 146715 134387 80779 57775 27668
6724 27668 36992 73997 77277 53543 51825 57779 90318 117291 94731 63408 26053 -21646 -18070
6711 -18070 47367 65627 64604 93145 69077 54645 75736 62620 91647 125491 128016 94982
6699 94982 41696 45008 74033 58494 20603 45256 52303 40620 42590 42697 52228 76195 69541
6686 69541 71575 62996 75031 67191 34221 31932 50364 65471 57467 90461 92191 75343 71700
6673 71700 91908 94288 56950 51315 56168 72364 101783 97597 112855 111925 82666 104862 92071
6660 92071 78751 64012 69978 44610 26283 46862 105639 134731 111944 111788 95173 92264 119964
6647 119964 115411 90412 50601 27467 32029 61381 66227 24485 29169 58628 62773 51591 46180
6634 46180 70027 44104 46671 68708 52216 40851 57948 76507 84515 52190 29593 30598
6622 30598 52350 66583 55052 26301 47282 45318 56372 55915 75365 126671 124841 135756 99109
6609 99109 65983 48975 32124 31833 64625 106816 147590 119432 125328 139785 103999 108799 91259
6596 91259 85195 83831 72906 82010 137334 149072 120083 110775 103694 43688 75260 88580 69934
6583 69934 78625 95885 109970 68327 15471 -282 468 65447 105806 96377 80702 76899 50090
6570 50090 11445 53211 53697 92832 108561 58559 26787 50137 53141 46331 25668 33709 34970
6557 34970 29071 31324 22154 31148 74627 61092 28703 40238 23126 9844 26488 26597 24941
6544 24941 22084 720 15791 38055 79429 56904 36501 44676 99149 116998 116348 105394 83228
6531 83228 69974 49981 14596 32781 51348 51614 101127 97408 76897 120665 114359 112984 123595
6518 123595 96970 88290 77189 64612 79895 89867 107046 117123 100352 31031 -20257 -28934
6506 -28934 -3659 78386 117893 97127 59100 10563 23776 43737 56749 36825 11961 -11151
6494 -11151 18563 75251 108713 88092 75040 50022 80948 99114 108204 95601 99058 115014
6482 115014 134312 81168 66908 94224 107949 69853 56832 52519 21175 -9695 3161 11334
6470 11334 61139 101194 136939 155844 128006 106331 79658 75520 63625 69234 49840 57595
6458 57595 57633 60847 31685 58400 61998 30947 11096 12383 71416 55619 61455 60429 42637
6445 42637 35956 23585 40053 85347 94266 53485 81455 97186 35285 -21274 -47493 -26595
6433 -26595 32307 71745 53587 74211 66451 43494 -659 -20604 -2358 38313 68421 67627
6421 67627 58978 33893 54570 79914 70896 80312 108846 80285 61052 51694 54371 79770 104565
6408 104565 100547 50711 51440 51682 -1135 -28061 10365 43377 39626 23838 41828 49970 22570
6395 22570 58132 66404 37729 32676 45187 38464 35297 35679 47760 48931 53842 38679 43198 86582
6381 86582 62858 76309 96957 60377 36593 55398 78977 109131 106259 47340 16510 27175
6369 27175 35314 22740 -1296 -13367 17113 24181 30447 71622 109482 103868 98617 35055 -26846
6356 -26846 -732 27884 56310 48973 63471 26008 11385 -9286 -37723 -37140 13575 57676
6344 57676 77021 93155 87069 57087 59801 35136 16657 44229 52030 81239 90517 39799 45679
6331 45679 24241 33601 52352 67042 38439 29638 28181 29024 73293 114004 86976 40313 5811
6318 5811 635 15507 5178 13599 44467 49867 49176 77337 42237 25880 9818 8497 8935 20296
6304 20296 28940 6571 44847 61355 54897 65627 79444 109439 95991 75403 112401 132872
6292 132872 119560 77229 52201 63008 71787 50186 24014 68491 85738 38489 10800 43184
6280 43184 36370 52186 82647 87708 85552 101128 89512 110158 123681 122139 77327 51710 73551
6267 73551 65329 30578 5901 24697 30875 31075 15710 30206 14126 16137 35917 87486 102406
6254 102406 115082 97394 91124 118432 122987 112735 82528 50184 52312 42390 84372 99217
6242 99217 83954 108397 107082 56045 21187 -6312 -28791 -23269 -6842 42203 112157 89569
6230 89569 112878 104836 71248 78231 84404 47490 23303 10795 21848 60332 70586 23582
6218 23582 -20504 5886 13676 8485 14419 -3336 12385 28229 18117 -6598 11779 39265
6206 39265 42333 -11357 -17075 33319 65151 63154 30214 7906 3083 24987 30641 41393 55298
6193 55298 56716 81176 102388 110957 72764 35987 31589 73750 95544 75998 52550 35139
6181 35139 35446 10630 16820 23237 42401 36776 -13056 -20578 2297 27385 -12006 -12458 13458
6168 13458 35750 13053 20810 59480 64565 67605 68607 27940 24293 15656 -22453 -7935 8444
6155 8444 69481 88389 76335 80392 56421 63039 77319 51979 -19399 9590 20883 5691
6143 5691 37002 61370 76857 64469 61261 60710 66479 44412 54529 54242 43030 16649 30251
6130 30251 33495 14820 9374 -2855 -14917 -8278 11213 -5091 909 26686 37896 38809 48218
6117 48218 35690 4036 23897 61952 76032 23367 22230 46771 49994 62448 67972 33062
6105 33062 5581 38222 37773 23130 -15571 -42248 -9370 24164 69470 69145 39128 15558 1582
6092 1582 -6752 -27274 -26189 9366 33201 18844 8026 25960 -715 18748 -18196 -46793
6080 -46793 -43477 -13454 -13855 -20027 -20330 -40399 -26067 13215 28032 16943 -44972 -57563 -21774
6067 -21774 -19473 5737 25409 42604 35782 -17304 -4465 8053 3118 -17135 -35226 -17607
6055 -17607 19546 28667 3685 32191 80972 53680 59254 80261 52587 53537 49930 64076 54002
6042 54002 3940 525 29543 11965 -3249 46369 57851 44207 35307 47749 52756 49482 38000
6029 38000 49828 29685 73357 86013 69415 19125 -13234 -4153 -17231 -66737 -59897 -84386
6017 -84386 -79957 -39633 -28460 -62497 -64566 -57441 9183 59883 24979 -7769 -43862 -31117
6005 -31117 -45244 -49121 -20375 17809 54531 66691 93458 91721 79291 41454 -15852 9576
5993 9576 22624 10535 -15545 -34200 7885 14073 11696 21575 23781 27838 16828 35121 32701
5980 32701 6839 -9881 11067 18550 19069 29123 46865 41759 19485 8935 1684 13214 -1476
5967 -1476 -45862 -76607 -62311 -12249 24540 1724 -20789 1333 -37356 -48142 -2474 20015
5955 20015 44265 26697 17155 -11636 -47328 6936 50945 40439 -11825 -27503 -15080 10282
5943 10282 18310 44837 82551 99458 79670 22616 -19211 8900 33472 17051 27201 30891
5931 30891 54565 48480 35338 52217 46752 43820 18227 -16950 -51971 -68057 -86447 -65286
5919 -65286 -57895 -43573 -25152 -33291 -19680 -10941 8525 7287 5169 -44213 -53938 -54077 -71042
5906 -71042 -39945 13895 9904 -19847 -30567 -23341 -48479 -28110 -33746 -67216 -20374 5293
5894 5293 14417 -2942 4920 -9505 -34501 -6777 14504 -16004 -26706 -8568 27029 34884 46179
5881 46179 23871 -23352 -27558 -4833 18123 7117 -56861 -71357 -48813 -43272 -32761 18621
5869 18621 2714 -9355 1396 -20434 21681 47482 51824 18120 -10507 -50973 -38357 9779
5857 9779 43143 38230 1388 -27905 -45337 -57256 -13644 36591 39895 -5805 -18989 15435
5845 15435 14533 -10862 -3310 34482 50201 53073 45415 -4459 -9271 18117 29117 20170 -8898
5832 -8898 16076 24309 47946 55671 31951 28494 65528 3209 -23518 21675 28238 9969 16571
5819 16571 17649 -7640 -11275 15338 58800 55617 32624 -777 27455 32214 34094 50183 43468
5806 43468 39703 22604 23400 17792 33328 37505 22173 14168 19819 35823 43917 53005 37447 35422
5792 35422 47260 17855 -7871 22398 -904 -6681 -10711 -15848 11546 40537 52762 11291
5780 11291 -3571 9750 17898 47655 52670 22389 17909 21064 -20018 -36388 -15168 16890 18787
5767 18787 44398 75188 43501 -586 -5806 45401 58964 49678 48530 17684 33304 63740
5755 63740 15927 26887 83895 68618 28780 37384 29013 4073 -20046 -22762 35906 53687
5743 53687 78818 67549 26106 17244 6471 53010 69744 55725 20626 30185 58802 55469
5731 55469 -4430 16477 34845 28356 12079 10 14756 18344 10380 11279 -32184 -53142 -64472
5718 -64472 -34582 -19272 20417 72069 43834 19076 22909 6705 1915 -12533 10490 16211
5706 16211 -7280 -26357 -10402 -6108 22992 17664 -30462 -19184 8147 -13393 -35650 -9972
5694 -9972 -16792 -68064 -46472 -7753 23468 7414 -27381 -39216 -68813 -92826 -88535 -52498
5682 -52498 -38653 15570 9238 12883 13631 -23533 -20917 -22358 -59895 -68009 11103 80098 92329
5669 92329 92652 76630 72703 78253 36488 15803 -1022 -2484 17263 52543 63093 44385 -26857
5656 -26857 -74118 -51390 -25885 9863 39060 16576 2806 27068 11666 -21951 11287 87167
5644 87167 77849 53795 41630 54271 24689 17172 15627 27646 22842 6159 1166 8958 24663
5631 24663 52496 92412 46225 -1546 -10948 16942 55446 35594 5924 -4381 -29057 2250
5619 2250 -2357 -18390 -3822 6761 -30073 -37116 32049 16561 2951 17351 37147 54039
5607 54039 40906 33809 59993 66194 91761 50717 29539 27263 -8671 -22068 6021 10806 23797
5594 23797 35980 49177 36512 32935 36264 32081 -10810 -43001 -41630 -5639 45654 93025 82096
5581 82096 12298 -1579 4086 17595 2207 19708 23115 38435 -4996 3425 13347 -9457 21706
5568 21706 16096 -2811 1586 7211 11358 -16186 -42608 -40843 -17334 -35297 -47193 -23205 940
5555 940 -6043 -31898 -23199 13126 13055 -37710 -33449 -44249 -51994 -47972 5632 19952 143 -48831
5541 -48831 -71053 -41776 8729 45376 -2205 -32063 -47687 -34741 -34199 -26999 3084 19482
5529 19482 -34569 -48791 -72808 -93040 -80279 -13360 -17961 -42418 11921 2636 -43215 -4874
5517 -4874 7379 -7054 -39444 -31311 -10132 16011 31014 13493 -663 -3522 2749 17027 23818
5504 23818 16750 41660 49128 36451 57745 89742 43942 52132 75446 68335 58783 48694 20531
5491 20531 21886 -19150 -34017 -7170 -1017 -11110 -34874 14731 -4372 19618 9702 20377
5479 20377 42941 32108 27205 28472 19918 35988 40567 37114 17775 27169 25030 7879 25380
5466 25380 35434 48063 56184 68816 94153 114405 137405 85016 37031 50507 74742 34521
5454 34521 16063 9844 15545 18946 56327 48697 -3816 -12628 -18452 -30785 -9472 -13044 -62201
5441 -62201 -57427 7185 29731 -16919 -32087 14392 59915 64665 23807 1561 53106 69798
5429 69798 60074 8300 -57469 -32259 -7446 -30430 5993 25870 16265 -2469 -19180 -8872
5417 -8872 -11173 22419 37641 1769 -14808 -28856 -32996 -36376 -3366 -44193 -84081 -78400 -70119
5404 -70119 -52120 -43912 20371 54748 40618 35299 15026 -21326 -61093 -41463 -24372 -28795
5392 -28795 -10151 -5052 -44846 -18890 3465 2446 7351 7578 5151 -8888 6164 32312 7881
5379 7881 -6503 14899 9023 -3480 -19698 -42237 -28648 -9202 -8361 -26480 -29786 -4796 -3906
5366 -3906 -13080 -20354 -17884 2261 9767 -8556 10259 14036 25924 31308 24832 10219 12179 18039
5352 18039 1252 18023 47165 33515 8018 9383 -20827 -20425 32010 72073 45186 36858 30580
5339 30580 59872 79822 80370 89484 96599 98404 73209 46848 55458 69871 76729 59872 79737
5326 79737 83270 72719 32497 -8660 -35519 -26791 -11635 22766 58899 84759 69471 60241
5314 60241 39103 11039 -3276 -28192 -56905 -61246 -13842 18754 21770 19869 45151 43632 15995
5301 15995 -2063 -28601 -16637 3916 28178 26722 39432 70943 49763 49639 61507 45892
5289 45892 37631 45940 30934 33664 22140 17370 11208 15778 43 -6701 -28555 -55993 -38575
5276 -38575 -15007 -52955 -53475 -23088 12202 42631 35395 -30851 -36254 9735 70686 65489 29466
5263 29466 -17729 -27922 -40523 -41157 -25583 1061 21804 -6143 -26446 11808 41751 23198
5251 23198 -11450 7793 9747 27918 18375 5735 30454 43749 57251 29481 16082 -16569
5239 -16569 -14410 -2088 -49195 -52617 -19781 606 -34226 -35721 -32884 -41131 -32586 19617 62315
5226 62315 37206 4992 -34994 -39496 11688 17706 -17240 -23045 -61177 -43951 -19205 -23922 -62064
5213 -62064 -61402 -52500 -18189 -1014 -37869 -32043 7129 27889 36060 23494 22989 4808 10966
5200 10966 30037 38530 25232 11150 31488 5515 -9472 -15949 -65135 -89006 -67041 -55910
5188 -55910 -46038 -27202 10052 40502 49742 62151 40323 -1215 -11470 -19060 -67930 -85361
5176 -85361 -88024 -45392 -3670 17512 7526 5884 13540 28408 30071 9323 1395 -23366 -19055
5163 -19055 3294 3941 -3843 -45434 -68746 -56839 -66784 -44519 -60309 -33602 -905 -13673 -34874
5150 -34874 -24046 -30477 -65467 -46572 -25184 -25814 20521 43471 222 -44061 -61505 -48912
5138 -48912 -42689 -4855 5138 22385 44789 36929 28916 40184 52048 83725 31743 -12737 -53229
5125 -53229 -49881 -37440 26232 23613 17149 -3309 -13174 -42201 -66899 -27515 -15018 -34536 -41808
5112 -41808 -40775 -22042 -27505 -5742 -13556 -59288 -38582 8232 -23891 -34576 -72 36522
5100 36522 20811 -12576 -13173 -23743 -68244 -92221 -88884 -87510 -43931 -21522 -58140 -93707 -95754
5087 -95754 -99460 -68108 -15692 -15984 14582 29035 -3667 -5257 -15202 -12460 -17336 -44416 -24632
5074 -24632 -28709 940 10407 3165 -47420 -38560 -15137 -41950 -30557 -19056 -42525 -34180 -59958
5061 -59958 -43376 -25521 -22553 19509 50253 26163 28806 26565 -21512 -65317 -62369 -74246 -1806
5048 -1806 30102 5260 -24992 -21550 -26168 -18457 2987 4921 -33168 -35888 -31458 -38399 -30640 3892
5034 3892 13947 -6340 -50454 -74415 -66471 -42557 -51578 -50867 -12446 -44054 -50374 -23123 559
5021 559 8850 13887 -6433 -5348 -12348 -27960 1999 6048 -3179 16266 -32163 -76714 -93745
5008 -93745 -61515 -21938 22910 12700 7247 -36794 -53808 -15762 -58150 -39300 -34661 -6396
4996 -6396 -6266 -38558 22149 23575 -6923 -11587 -11380 41875 55623 28695 -33107 -57820 -34342
4983 -34342 -13460 -14156 -25642 -5209 -11276 -616 7943 -35609 -69485 -91396 -51827 3406 65095
4970 65095 63529 82254 67756 25451 -43935 -66569 -67243 -43237 -19438 -28313 -13659 19428 1567
4957 1567 12831 19357 36458 71887 33225 42255 18608 -2315 -2643 702 -9181 16457 -16150
4944 -16150 -44559 -60623 -71125 -95863 -47469 -14206 -4411 -29861 -55368 -91371 -95783 -77904
4932 -77904 -4899 52346 48847 16942 -11769 -10551 -11464 -11395 -17373 -36158 19084 38025 33993 56486
4918 56486 84205 89780 63334 17360 -14452 -16818 -39427 -31503 -42160 -81877 -109385 -62430
4906 -62430 -11719 38840 21268 -10846 -37963 -31564 -22915 -23144 -57892 -25680 -5553 -41388 -28844
4893 -28844 -4126 6863 -9420 -30692 -41239 -24319 13682 -3217 -6840 -7625 -22376 -20477 -35867
4880 -35867 -61165 -10483 21919 6433 -29156 -34947 -36826 -12709 -4008 -9102 -23161 -16893 -39761
4867 -39761 -41006 5022 37679 -4170 -35444 -16922 -37036 -72248 -68664 -39198 797 17009
4855 17009 -20329 -35711 -50549 24457 14387 18292 6887 -38455 -57227 -53803 -10153 15534
4843 15534 19411 7961 -1393 45956 43409 17369 -20144 42578 -2140 -71532 -64626 -74225 -66504
4830 -66504 -57641 -30852 -16506 -22772 -18633 -1212 -22454 -45614 -25603 -4562 2360 1367 -45055
4817 -45055 -53309 -35631 -7891 41582 47820 30978 24349 -40076 -67255 -17264 22630 23212 24484
4804 24484 24664 12264 -25756 -41903 -39316 -16686 -37502 -81309 -114527 -84685 -30559 -8729
4792 -8729 -37133 -62158 -27575 -32579 -13122 -34342 -52123 -39691 -19381 -4784 42268 7145
4780 7145 -18443 11233 39370 34818 37164 6372 -6909 -34544 -47671 -77894 -69272 -70138 -108147
4767 -108147 -73131 -45564 -8307 -27155 -58025 -51207 -4433 3302 -15294 -6377 -14189 -32642
4755 -32642 -56540 -55014 -58941 -64114 -22041 -10981 -18161 -29968 -15041 -10510 12740 30077 18891
4742 18891 5978 32246 19964 10934 41207 20468 44531 73795 68063 17752 16368 26015 4828
4729 4828 -20404 -26732 -17255 32975 21893 -36224 -83936 -137250 -131532 -120267 -118544 -104434 -63893
4716 -63893 -45745 -31589 -21538 -33602 -18186 15629 23612 11539 -21838 -23384 -10161 34384
4704 34384 13846 -27066 -28971 -18462 3430 22224 8859 -23899 -27698 -13486 -6378 -8699 854
4691 854 -27555 -60716 -56529 -49931 -39303 -44505 -31521 -26489 -23694 -25170 -41091 -20204 10623
4678 10623 8208 -8676 -20556 -34430 -61262 -90289 -107871 -92751 -69830 -69025 -96568 -99532 -98745
4665 -98745 -129999 -117983 -71024 -54150 -47963 1427 23329 18127 -9152 -29065 -31360 -21190
4653 -21190 -2506 -4357 -13665 -6318 5431 6939 -35826 -49069 -90783 -79359 -60400 -89304 -111654
4640 -111654 -75859 -59782 -45262 -19526 13984 12926 4341 -239 -35151 -22280 -56941 -75184
4628 -75184 -51818 -15430 6134 -3583 23947 22019 16703 -3021 -36423 -57166 -69469 -41784
4616 -41784 -67002 -59751 -35210 -8312 10871 -29663 -55258 -54395 -73151 -56704 -77801 -83624 -44138
4603 -44138 -11592 10905 33716 -11914 -13099 -5355 -2525 1334 36117 -3242 -42270 -12838 -52283
4590 -52283 -72259 -51786 -75518 -54433 -23850 -17898 -14569 -6096 12667 34834 -5345 -55735
4578 -55735 -23785 -6651 -26209 -69957 -66469 -11150 -36611 -70645 -47524 -19805 -9997 -29698
4566 -29698 -44039 -26986 -30944 -52544 -13058 -4322 -16262 -29869 -27495 -30468 -25697 -12020 24960
4553 24960 71159 50932 491 -9181 19114 36216 3561 -3973 -1890 4475 4680 -15762 -12101
4540 -12101 -30719 -8597 -17475 595 -33549 -58383 -60967 -52137 -28180 8754 33742 325
4528 325 -27428 -60188 -110770 -100503 -31207 -30978 -16824 466 -11566 -8791 8380 32585 56634
4515 56634 54594 14920 14991 30449 -4197 -34221 -55754 -41154 -32261 -48074 -62484 -44992 -19169
4502 -19169 -10019 6283 -22668 -19151 9901 23873 -26315 -64821 -63639 -32007 -43289 -64286
4490 -64286 -43596 -5591 -3755 -38279 -71551 -36583 -17433 -34562 -60056 -73396 -52610 -59079
4478 -59079 -29492 2602 411 -16879 -4064 12410 -7537 -38503 -45417 -65907 -74585 -91560
4466 -91560 -75274 -83499 -80177 -60005 -18889 -10674 -28382 -55444 -404 -18111 -61151 -74755
4454 -74755 -71665 -86754 -70843 -35968 -7683 -32759 -63556 -85145 -44053 -41562 -72525 -71735 -61736
4441 -61736 -60733 -38168 983 -49887 -103154 -101754 -67036 -47662 -36867 -45019 -72240 -84467
4429 -84467 -52528 -29344 10590 17381 -4126 14176 23105 -16717 -22246 11475 29456 3681
4417 3681 -5450 -18610 -85924 -134564 -119842 -47030 -1181 27503 -5257 -10027 -19833 -21953 8261
4404 8261 19458 61967 22508 -30046 -1341 22841 -18497 -67698 -56071 -13690 -23935 -42453
4392 -42453 -38951 -23917 -19409 -49913 -28882 3121 15519 -10895 -9159 -36061 -71868 -45956
4380 -45956 -21675 -44341 -10479 1203 -34615 -22948 -38083 -67742 -85926 -83257 -41903 -36664
4368 -36664 -45103 -9428 7719 -29708 -21276 4753 -32303 -38833 -46147 -40485 -29039 -48179 -51225
4355 -51225 -77643 -70659 -79972 -84328 -91064 -127022 -101559 -65209 -86174 -66949 2858 24199 1880
4342 1880 -28160 -36344 -28690 -35791 -23434 4546 -23731 -94811 -108364 -81175 -70720 -94104 -85300
4329 -85300 -28167 13219 -21933 -5199 28337 14647 -32799 -61399 -30033 -36491 -50788 -34563
4317 -34563 -57162 -43454 -52771 -38692 -22113 -2216 914 -19444 -17103 -31685 -56832 -41333
4305 -41333 -7689 -14019 -26851 -20859 -59713 -60245 -58055 -47558 -24549 -14577 1754 -21155 -34539
4292 -34539 -49770 -47691 -8830 9775 13305 25016 -17085 -37496 -25233 -9506 -3271 38064
4280 38064 41197 19410 37535 37602 27681 23426 22703 60220 35070 12269 -29038 -25161 -47782 -23142
4266 -23142 -32067 -43037 -66549 -60075 -20840 18646 32456 36095 21487 23009 -29736 -38682 -16345
4253 -16345 -8586 -85122 -109345 -94355 -37772 -4210 -10098 -24147 -34733 -25526 -30251 -24231 -25371
4240 -25371 -22819 -30324 -30372 -9164 -25652 -26415 -40883 -63010 -55002 -32031 -2732 -16139 -5299
4227 -5299 -12144 -10765 -43922 -76555 -75191 -44144 -19911 -35619 -25231 -33845 -18682 15232 8663
4214 8663 -22311 -17695 17518 878 1413 17191 23426 67765 63618 64735 56912 871 -50589
4201 -50589 -62235 -44160 -46744 -53552 -49331 -79063 -73656 -58992 -57336 -66242 -79394 -109103 -118146
4188 -118146 -93218 -75238 -54290 -54133 -78616 -75143 -74918 -56314 -37209 -47097 -76164 -64094 -20093
4175 -20093 -13078 -22292 -14028 -26027 -43099 -37014 -33748 -20018 36491 7120 -35712 -66607 -51906
4162 -51906 -44785 -68984 -91289 -64968 -47142 -76634 -69832 -55418 -52426 -11523 -17478 -43059 -52155
4149 -52155 -47008 -27151 -26073 -7563 18771 28795 24003 16906 8864 -30109 -49958 -51468 -71450
4136 -71450 -23202 -5413 19217 3723 -40077 -18100 -23038 -22619 -16304 4667 -5621 -43927 -32742
4123 -32742 30178 51910 -6848 -51391 -56348 -33294 -24675 2197 -2966 -7969 -22489 -22505 -8210
4110 -8210 -17458 4187 -1994 -6978 11013 21496 24289 -32826 -54646 -57848 -79099 -18309 24935
4097 24935 6071 -7001 15538 50117 78133 103086 61479 7169 -2128 37521 81771 57631
4085 57631 -10215 -16238 -6171 -11650 -36126 -43418 -51039 -61750 -28451 30045 4947 -47133 -45950
4072 -45950 -52195 -58112 -61242 -68645 -40821 -13240 -61270 -59056 -48068 -82288 -96697 -94847 -61002
4059 -61002 -36134 -45487 -35957 -25722 -39598 -54138 -64798 -28461 8728 -18214 839 -24803
4047 -24803 -24027 -56711 -52343 -29982 -29678 -37171 -66019 -43163 -32095 -56130 -49626 -16861 -25689
4034 -25689 -64917 -101008 -72364 -70684 -75327 -14316 32608 9312 21294 28677 17485 38500
4022 38500 19183 14969 88 -37946 -68711 -82822 -89438 -98574 -95949 -98438 -57355 -53363 -68024
4009 -68024 -80919 -44551 -11902 -45288 -33679 -9543 -8095 -11690 -34767 -40937 -21548 19827
3997 19827 31217 -9967 -34183 -29083 -54278 -86415 -80008 -37157 -33992 -52309 -48220 -21833 -4728
3984 -4728 -3654 10764 19045 27558 -3077 -26862 -41728 -41990 -35253 -52344 -51480 -57110 -6411 -8773
3970 -8773 -25536 25733 46100 16201 -34140 -41383 -38536 -57268 -47675 -42307 -42415 -65784 -79840
3957 -79840 -75735 -96220 -83123 -76287 -64024 -48010 -44915 -36006 -20900 -44316 -32737 -3246 1886
3944 1886 -42601 -63266 -73643 -74866 -40906 -26635 -31735 -49462 -62663 -82922 -109273 -78361
3932 -78361 -78776 -30757 40382 47585 47503 49262 43830 3043 -19955 -51745 -65766 -42957 -2057
3919 -2057 -57115 -98805 -65268 -30382 11431 24837 6028 -4314 -17257 -82958 -110546 -94847
3907 -94847 -77016 -45796 -21997 -29779 -49340 -40064 -64639 -22551 4910 7082 -34338 -82168
3895 -82168 -71043 -23290 -27256 -10431 -14395 15524 48537 36675 34001 31671 19946 -11133 -44292
3882 -44292 -71946 -80533 -58378 -3173 3335 -17942 -11447 14048 20054 18638 -7234 -5406 -30501
3869 -30501 -51410 -60480 -44080 -2944 30805 35337 20815 27181 41011 24405 -9793 -47226
3857 -47226 -55756 -36047 -22205 -34343 -82073 -111127 -80510 -75617 -104041 -95968 -40762 -46092 -76579
3844 -76579 -74328 -72304 -41438 -19623 -51436 -33599 -22592 -21152 -29461 -7680 -16498 -30441 -33446
3831 -33446 -56016 -15493 -1905 32646 62121 16514 221 -13532 -10908 -42868 -52487 -28743
3819 -28743 -45067 -58041 -79125 -44783 -17945 -42901 -71536 -49820 2347 32003 22351 -14872
3807 -14872 -41222 -41932 -42493 -35379 -46901 -32418 -84250 -82114 -27567 11932 -15432 -27818 6204
3794 6204 -15861 -28834 -26744 -39148 -37583 -26551 -5060 3704 16034 19267 -2045 -3715 18408
3781 18408 31315 40390 53217 53966 78736 42248 8492 -16272 -37546 -23217 31946 32446 41704
3768 41704 2895 -13304 -17303 -21877 -3348 31834 1100 -39015 -8746 12656 182 6368
3756 6368 38394 49207 46250 2968 -15382 -26460 -27660 -30525 -1064 38125 27146 -11425 -30338
3743 -30338 -63078 -52103 -38918 -25526 -53234 -37292 -16829 -11722 -50765 -99758 -86783 -76156
3731 -76156 -46128 -33049 -16737 3800 -10147 -3218 -38925 -71672 -62875 -84682 -83389 -45857
3719 -45857 -34035 -30531 -21485 13803 9540 -35334 -26413 -28496 -52924 -51613 -24807 -32282 -36234
3706 -36234 -43636 -37984 -30462 -4939 -54004 -60092 -16106 29188 20963 -41943 -51894 -29969 -20724
3693 -20724 -28696 -44262 -12939 -4680 2785 -16947 -22672 -46078 -69727 -60170 -96938 -99461 -66852
3680 -66852 -16408 268 -50631 -88839 -103809 -103781 -87114 -89402 -95431 -59530 -14452 -9736 -882
3667 -882 37339 40060 3031 -55748 -58238 -90193 -119214 -121786 -88329 -26817 -37707 -32281 -36514
3654 -36514 -31335 -16387 16520 23769 -40531 -98576 -117735 -93836 -95994 -95112 -115604 -70182 -47000
3641 -47000 -60756 -52734 -79665 -121270 -129749 -129668 -122612 -96123 -79663 -38233 -17369 -46501 -63785
3628 -63785 -61842 -85675 -50717 -47583 -31576 -18229 -3393 -16843 -15017 -5183 -53635 -61801 -19128
3615 -19128 -2363 -14366 34678 10291 -38711 -60393 -59588 -33723 -31196 -1216 28350 34886 26950
3602 26950 -5112 -38424 4586 7939 -14361 -40078 -53605 -25169 -32713 -22674 -1896 -1863 1517
3589 1517 18563 -4196 -29743 -49699 -63750 -18079 -15102 -11765 -10830 -26858 -37054 -47337 -31158
3576 -31158 1753 -8538 -36636 -45166 -2015 12846 -12206 -4167 9673 -373 -15839 -35835
3564 -35835 -72134 -98078 -77239 -23267 -48442 -38241 -16803 -321 -4782 -11461 -33061 -73684
3552 -73684 -43962 1547 23216 15808 9562 22560 16218 55169 70169 57760 46938 30159
3540 30159 -964 -65 -24964 -71654 -67934 -48654 -62552 -39811 -35950 -32022 -7872 -31938 -15558
3527 -15558 19048 19323 -34425 -65783 -53742 -21947 -16083 -15637 -2013 19951 10069 -11531 37
3514 37 -13393 -1987 14377 12504 -10517 -31436 -83608 -87942 -42407 9862 10509 -49433 -62999
3501 -62999 -65897 -73209 -63490 -47644 -35363 -50856 -58682 -35127 -25394 -33514 -73591 -61988 -59410
3488 -59410 -44197 -69838 -53524 -66474 -93300 -78595 -18882 -20386 6439 53032 48860 14450
3476 14450 -31677 -29817 -27268 -18881 -5198 -3941 -24280 -22274 -19367 -1406 1416 5751 45964
3463 45964 9457 335 -56483 -93587 -68338 -11884 38317 21472 11565 -17965 -58601 -72988
3451 -72988 -74598 -57565 -68389 -71618 -3209 32953 39692 41160 62583 66299 54928 -9100 -18094
3438 -18094 42121 12320 -29160 -55263 -24835 9885 20013 37164 14459 -6785 -24424 -11595
3426 -11595 25970 26119 14204 -10590 -228 31001 24566 -17587 -215 835 32596 18224 -29213
3413 -29213 -41350 -57828 -18783 1914 19279 53675 74410 33385 -11504 -4499 -33668 5695
3401 5695 -2031 -46005 -58759 -32399 -8408 -50024 -41146 -3661 -9408 37614 46736 46294 1677
3388 1677 -12545 -5760 -5999 -10511 12763 9572 -56337 -47228 -28487 -26127 -13509 1475 5145 10628
3374 10628 -7834 -49774 -79255 -44517 -25788 -39442 -10413 -1152 5745 9319 6270 -27390 -30911
3361 -30911 -29223 -23739 -512 2361 19480 62821 40542 -43128 -58568 -66210 -63316 -56043 -73016
3348 -73016 -50548 -34479 -23267 1339 -28636 -25002 -39651 -60065 -53652 -62619 -58267 -995 12182
3335 12182 16165 34797 8717 -8200 -3968 -19158 -42758 -47315 144 30059 48417 26931
3323 26931 6446 -4445 -2697 26881 17521 -49560 -76860 -74297 -117348 -125761 -46756 -15069 23917
3310 23917 50148 -5373 -88729 -153700 -149325 -75657 -18840 -19032 -3899 -135 -21792 -11896 -36225
3297 -36225 -70961 -35164 46067 33588 -53023 -46727 -27646 -38833 -46016 -53919 -82307 -83685 -94060
3284 -94060 -53140 -64883 -64048 -59156 -39443 -50361 -100204 -64380 -20738 23455 21748 18808 26073
3271 26073 18129 17998 32629 17333 36580 26018 -11618 -30475 -54355 -60737 -49632 -33688 -40996
3258 -40996 -52821 -45325 -62420 -72907 -97032 -81145 -64423 -86927 -62196 -22821 -67970 -91230
3246 -91230 -59785 -81286 -77812 -31457 8631 41160 26457 -6147 -39687 -3706 1129 7940
3234 7940 14045 58668 56297 50466 24407 10898 1721 -21352 3764 9608 5678 17324 -15400
3221 -15400 -3535 -41717 -33073 -58201 -57423 -30093 -10378 27741 32529 30765 6673 6905 -7414
3208 -7414 12418 -5586 -45858 -21480 2624 11558 11736 -4059 -38353 -44761 -46487 -55103 -24940
3195 -24940 2437 53419 61311 45450 -3695 -83828 -70808 -14988 -10298 -17535 -10754 -714 -1952
3182 -1952 15888 31331 7404 -50065 -88510 -77352 -68323 -58906 -25465 8131 -42010 -92586
3170 -92586 -74416 -41623 -47728 -27286 -50741 -86789 -76076 -85031 -64903 -16365 6853 -30709
3158 -30709 -28481 -9750 -43231 -49155 -42968 -56036 -49932 -39360 -27909 10131 19416 16552 -14887
3145 -14887 -8664 -14644 -24387 -7911 -39126 -66423 -82186 -90568 -63434 -40510 -41053 -31416 -58779
3132 -58779 -17932 -18521 -46673 -72740 -63095 -25632 -53229 -49716 -26843 -48484 -57984 -50621 -43338
3119 -43338 -36581 -69846 -52431 -47965 -11968 21892 22896 36670 26196 884 14188 28530
3107 28530 -724 289 6080 14545 -723 -9628 -15393 -35439 -57664 -43799 -4100 158 -11068
3094 -11068 -11932 -3029 31951 34334 27394 -14961 -19559 -9208 -1352 -1907 41281 43415 32708 4330
3080 4330 -567 -12736 -39578 -52228 -37114 -70201 -83234 -98801 -83062 -36309 -37870 -52520
3068 -52520 -59597 -43549 -26827 -25210 3504 -7668 -64594 -82674 -71828 -65925 -57385 -65231 -43259
3055 -43259 -22662 -4589 8728 -28165 -40046 -6334 -22348 -34574 -50594 -56711 -15129 21529
3043 21529 4752 -9619 -13253 -38233 -15124 12163 -12820 -9193 9035 33964 77374 49138
3031 49138 9390 2530 21381 25922 -15599 -21618 -82 -63280 -106672 -133649 -112729 -65317
3019 -65317 -38597 -40953 -33579 -14436 -33578 -76736 -62503 -26111 -9876 -8118 -32509 -33400 -1771
3006 -1771 -25231 -3259 -34411 -41809 -28515 -38767 -31214 -6420 5956 20816 -8206 -30896
2994 -30896 -68176 -116047 -117787 -104094 -63607 -8103 -9272 4412 -11055 -36719 -39567 -26869
2982 -26869 -48516 -79560 -82486 -36469 13855 45682 28891 -5509 -42999 -43376 -23192 8345
2970 8345 13701 20133 13731 53591 111442 54302 6483 -12318 -34543 -20364 -11190 -1741 25492
2957 25492 21898 -35770 -42824 9186 29721 -2321 36823 61867 1115 -6924 -6029 3693 27409
2944 27409 19297 31765 6841 -2234 16935 46648 85938 109110 102347 71897 36216 32671 52838
2931 52838 -6067 -20766 -27508 -36773 -39949 -72741 -99426 -118495 -85010 -68262 -45505 -33036
2919 -33036 -47493 -52117 -37529 -544 -12016 -37571 -42387 -51183 -51095 -62622 -61754 -31990 -48906
2906 -48906 -15587 -68888 -125772 -110719 -108919 -75034 -72792 -40260 -32467 -52691 -65063 -48479
2894 -48479 -21004 -29247 -40430 -23840 -22409 -71529 -108893 -122558 -114163 -47426 -24232 -5949
2882 -5949 -10656 -16786 -44804 -44769 8549 14369 -16744 -60693 -82426 -105567 -96164 -13379 -24909
2869 -24909 -41344 -26284 -39850 -74404 -85057 -103204 -92080 -86699 -75091 -67067 -49917 -1359
2857 -1359 13873 22167 19711 8488 833 -12927 -59339 -60556 -42404 -2458 15798 27724 44821
2844 44821 49534 62947 37131 14055 -13531 15517 54701 41146 17920 6869 18410 3872
2832 3872 3679 -31153 -51158 -72966 -53378 -24626 -27836 -32010 -20524 -9400 2175 -19830 -40185
2819 -40185 -4848 10778 -28614 -22417 -41665 -82049 -73904 -44313 -52516 -55316 -58760 -45703 -86871
2806 -86871 -87086 -44248 -28611 -69594 -112791 -158126 -128443 -74423 -59303 -35570 -26387 -14222
2794 -14222 -22590 -7365 19394 7340 -54459 -34952 10664 -1460 -33632 13695 14541 34880
2782 34880 9253 -28719 -29996 -31824 -50521 -51953 -25419 -53749 -63345 -80352 -64604 -78020 -54111
2769 -54111 -22807 -34539 -10718 -3788 -40059 -28236 -12951 -16679 -67591 -106831 -85693 -59579
2757 -59579 -55491 -94757 -72185 -48525 -83123 -54848 -42897 -20922 -13408 -15606 -22585 8718 21363
2744 21363 -1582 -2771 -25123 -39069 -45763 -39531 -20103 -38819 -30934 -49149 -17862 1463 -76752
2731 -76752 -61984 -14334 -21779 -1676 42371 46001 49153 28113 115 7852 15451 2392 1478
2718 1478 16078 10231 -8369 -11579 -410 23743 21681 37917 6593 -8149 -22506 -50646 -40628
2705 -40628 -64676 -95442 -83580 -67675 -27821 -26003 -10285 -5158 -29831 -30271 -59134 -96175 -73251
2692 -73251 -67229 -98296 -81222 9945 10173 -1725 5702 16322 11905 18039 -43605 -39022 -18128
2679 -18128 -26663 -25821 -25300 -20490 -8984 -26074 -52148 -40081 -19066 -2764 -26410 -5469 -38903
2666 -38903 -25035 -2378 22998 28572 16912 22752 31356 14116 23972 20600 -3227 1892 -13842
2653 -13842 -43331 -56719 -52909 -65324 -63722 -77635 -67979 -52826 -68252 -48887 -50374 -73855 -104533
2640 -104533 -71102 -6663 9350 -8379 -46157 -61234 -12374 21254 63169 44532 -17880 -57482
2628 -57482 -41711 -28064 14625 40839 8475 -24094 -12866 24028 21078 29904 28615 58215
2616 58215 73251 -8499 -63540 -79005 -24661 -27498 -44525 -5504 3120 -3334 -16799 -22369 -53039
2603 -53039 -51709 -31930 -53302 -41990 -35175 -23977 -56286 -26437 -43966 -65769 -61219 -27074
2591 -27074 -16616 -21198 -29478 -65245 -54111 -51971 -90078 -73409 -37980 -33867 -62311 -87374 -103432
2578 -103432 -114787 -66638 -11113 32875 7815 -23564 -48714 -40028 -28903 -38344 -12409 -9277
2566 -9277 -21799 -51610 -73576 -52499 13329 36812 -16282 -30196 -34704 -79918 -69190 -70899
2554 -70899 -63543 -40311 -37668 -27588 -52340 -72078 -75346 -45833 -19817 -7612 -5856 -43543 -26450
2541 -26450 3773 -3085 16261 29995 12311 31846 82838 93155 45071 -21351 1023 -7225
2529 -7225 2948 2171 5468 -6483 -4282 -19991 -12896 24292 48726 61811 20426 20212 33691
2516 33691 49870 29672 -24211 -45309 -48601 -56122 -45012 -66548 -58143 -44693 -59423 -35398
2504 -35398 -41719 -24871 -11719 31463 13690 -12728 -16647 -21632 -30557 -28708 -46182 -64165 -82185
2491 -82185 -76738 -38336 -26202 -62701 -37364 -22349 -34517 -29989 -18091 -23826 -53476 -8298
2479 -8298 37494 67263 34813 -5022 -55962 -32030 -17554 -15815 -6083 8905 -33954 -66555
2467 -66555 -88525 -107042 -81745 4650 8974 -47920 -27375 -41804 -75539 -93493 -107753 -91108
2455 -91108 -38468 -44210 -51731 -45247 -15194 66114 66801 45470 7464 -23260 -6520 -12814 -4606
2442 -4606 -82917 -79718 -71102 -78768 -42784 -19667 -61795 -60561 -32416 -35792 -37733 -11988 -24702
2429 -24702 -17637 -32592 -44836 11836 24720 32484 29061 21618 33773 25652 31429 27406 7767
2416 7767 -26360 -25097 -25090 -7006 14446 43554 36115 27131 27729 12919 -45023 -87038 -82709 -58194
2402 -58194 -52097 -11515 -13414 -35139 -13428 -18636 -54928 -10121 -7616 11733 33781 20597 15189
2389 15189 11037 7930 -14325 -22747 -22136 -27059 9031 33408 8955 13792 35352 37815 50296
2376 50296 51449 18959 1596 659 56233 48411 51342 -7296 -24134 -31521 20564 32450 -22454
2363 -22454 -36420 -38371 2293 -711 -37299 -89034 -84959 -65952 -74419 -74691 -100354 -92099 -61417
2350 -61417 -42226 -19530 -46930 -52408 -46074 -23210 30003 44568 -2539 -3455 596 -11904 -17525
2337 -17525 16047 -1496 2094 -5019 -46856 -92457 -80843 -54207 -18494 34415 44934 25065
2325 25065 9091 -7233 -53256 -74506 -66345 -45777 -17742 23563 45422 52042 38935 31699
2313 31699 40742 68162 42244 5665 -15531 -4804 -5912 -12521 -2752 -16096 -5688 25875 24692
2300 24692 38863 14831 -31277 -91942 -87313 -38411 -12528 -5138 15651 6941 4477 10371 33088
2287 33088 35096 25078 -12874 -24312 -30148 -36095 -24945 22036 67045 49136 49782 30989 10766
2274 10766 -33325 -28866 -35031 -38828 -3928 16176 38099 27946 43988 36083 -3419 -23969 22130
2261 22130 15030 -10256 -27956 3856 16739 11497 13241 16670 -13353 -29052 -29315 -25872 -46574
2248 -46574 -46318 -51105 -30661 5391 28038 40884 20623 38910 28532 22911 37047 61067 52345
2235 52345 31395 41316 77167 68601 29766 12199 -32318 -32647 -27908 -29484 -15967 1097 40173
2222 40173 -2956 -44728 -41111 -10103 20155 -13700 -18649 6647 -15346 -39291 -15145 -36167
2210 -36167 -36859 -43140 -28897 -29586 -27905 -5068 53935 39735 -18330 -29204 6147 23043 6688
2197 6688 1900 -26153 -32391 -24494 -35601 -14878 11856 3270 -10157 -16002 -1852 -9204 6104
2184 6104 -35781 -64877 -55202 -50630 -60228 -45668 -10504 11859 21590 29703 -14153 -11164 16963
2171 16963 8342 -43664 -47607 -33473 -19718 -46980 -64922 -76315 -51717 -19299 22805 74914
2159 74914 38214 24943 21112 22673 22630 6532 5095 8794 22260 13014 -22003 -49982 -60099
2146 -60099 -33959 -30939 -37561 -13929 49067 30772 -906 56787 60506 65087 78432 52384 27917
2133 27917 -398 -51749 -70309 -53650 -32917 -27051 2533 -3450 -38066 -9504 14794 -372
2121 -372 -30510 -57783 -81378 -64933 -70077 -28303 6297 7929 -4021 -6934 28705 15577 -12275
2108 -12275 11200 58710 81444 29262 -7523 -11372 -43767 -45952 -40602 -1878 18672 36562
2096 36562 -1772 -54059 -20189 -16590 -25495 1056 10652 -8649 8601 26332 28031 -7130 -30384
2083 -30384 3493 38429 52143 37524 26521 5428 -53926 -100774 -49834 434 -992 8257
2071 8257 26879 -21909 -30501 -2898 -20209 -63064 -65612 -82283 -46570 -52416 -87135 -58324 -90289
2058 -90289 -91523 -53653 -36301 8081 7223 -6193 -9594 5254 8394 15833 34299 6064 -5683
2045 -5683 3375 60261 86587 67973 29824 16036 1145 -24646 -58221 -55610 -45920 -70704 -66557
2032 -66557 -52465 -57625 -51706 17974 46606 50840 19113 -5685 8486 67346 49942 44177 47059
2019 47059 31299 37221 12021 7821 -24278 5009 28686 59752 57630 45919 42170 53035 52145
2006 52145 43882 56208 43236 51448 17204 -22222 -30165 13211 34598 42633 48089 22775 1116
1993 1116 -6565 2040 2742 10349 -4713 -16088 -17144 2389 31126 45778 38604 17666 38438
1980 38438 21520 -26307 -44437 -17472 6505 -19637 -18597 -17784 -28697 -18811 -10616 -36377 -27056
1967 -27056 -11013 -26974 -34325 -33410 -16973 12928 18270 10130 39243 54683 5034 -38659 9911
1954 9911 32230 30176 23483 17376 37314 59442 41905 17489 15739 43873 9486 19713 25128
1941 25128 35755 4629 3225 -12603 24892 57617 47960 33024 -17078 -15603 34969 28157 37080
1928 37080 38294 14927 -4133 -16367 -14345 -32404 -85273 -56695 -37931 -38498 -37999 -61263 -37660
1915 -37660 5230 8307 15970 3634 -4029 -18548 -5466 -3563 18584 27153 27188 53132 7374
1902 7374 -3690 1938 23697 -6446 -1389 6539 -16371 -57756 -54353 -34506 -21225 -28123 -48622
1889 -48622 -48200 -30174 -5063 78859 98044 86194 57495 4201 28684 50873 53359 38405
1877 38405 56339 37640 4282 -10453 -33942 -52709 -18764 -9442 1947 10372 40828 37839
1865 37839 29902 4489 12206 8969 -57025 -80301 -42630 -6883 16580 17220 12379 9123 14074
1852 14074 37774 42517 58447 23699 33356 31945 -7190 -55301 -52889 10038 9672 19013 -3829
1839 -3829 -36508 -63925 -92425 -80700 -34939 6606 34938 20905 25567 65599 64586 21129
1827 21129 -13004 -35819 -39142 -130 12953 65206 58041 14897 -4000 -2433 31235 44515
1815 44515 11659 -9698 -13813 23119 4733 33903 45536 10590 15056 38142 3942 14414
1803 14414 3154 -8269 -14323 19421 17475 -2959 -50709 -46589 -51573 -40336 -50515 -47365 -22017
1790 -22017 -7308 -4868 -11443 -12209 -7538 -23104 -39176 -46246 -26111 26257 57633 57658 54293 49270
1776 49270 -4550 -24989 -14080 -23076 1882 -21718 8759 4121 -29003 -30164 -74 48753
1764 48753 15865 -20925 -32667 -17202 23700 42444 30999 46925 52728 51153 48639 19044
1752 19044 15466 4980 -26828 -33572 -15669 11352 15981 17151 66819 105985 89201 83468 51549
1739 51549 30402 28446 31612 56875 53559 50288 51938 35385 33165 -4264 -32613 -10999 31578
1726 31578 89024 46401 24024 28066 17805 5657 -796 -15377 27421 50716 62262 50070
1714 50070 69931 87253 40209 27006 20951 49748 64450 55518 33446 -1934 12970 29598
1702 29598 28210 4829 15535 49667 44371 48363 41578 38543 3939 -47734 -67722 -50597 15979
1689 15979 48296 21471 11300 16726 16151 33982 31354 52242 53839 41904 48325 78652 100402
1676 100402 77909 59449 40159 2572 -14949 -13059 -14526 -503 18523 -29303 -38377 -6491
1664 -6491 57317 46765 32821 42389 37921 34279 32461 10087 32337 52807 81483 56890 42987
1651 42987 47667 46213 43822 27541 5136 -13869 -18441 -46336 -35258 -18558 1375 20648 52148
1638 52148 33132 1917 -40005 -51571 -26496 10573 44243 22472 -28263 -20754 -5741 -8719
1626 -8719 -18180 11594 39511 28417 20141 30341 35089 17834 36579 48821 67691 40963 2100
1613 2100 -35563 -31012 -21100 -4158 21803 19514 42776 22131 11527 10853 20493 29192 23006 7267
1599 7267 -31564 -10681 12942 24304 5341 32945 38070 14076 -24228 -19915 22362 9841
1587 9841 15188 24861 -8291 -72038 -55044 -13060 13506 7992 25711 39204 63313 60373 24859
1574 24859 23541 9967 -15798 -21193 -25950 -16265 -12613 10532 -35743 -62563 -51815 -63335 -39015
1561 -39015 -33824 -51945 -65628 -42814 -13638 -16384 4911 40302 62892 12802 2103 -24863
1549 -24863 -36430 -53292 -59821 -81583 -91759 -100054 -55435 -8329 12957 24755 -10364 -45676
1537 -45676 -11767 16471 43387 25669 51374 40644 53992 46275 -11280 4691 17428 -5870
1525 -5870 -1383 2779 4149 4754 -17297 116 -24202 -51289 -9668 13094 -31175 -69619 -43596
1512 -43596 -24761 -26161 -20192 -10714 -28911 -2940 -13670 -15043 -9470 15763 -16279 -32514 -47501
1499 -47501 -21913 26530 53859 -1317 -23478 18900 40403 75620 69797 52714 19359 9540
1487 9540 -19651 -56148 -35331 29043 55854 60982 67402 79412 111502 135090 123876 121310 86683
1474 86683 67974 59809 40558 15379 -9488 -9191 -13527 -792 19338 -5822 -5666 -1641 -17053
1461 -17053 -16092 -25689 -44183 -30501 7882 66773 95380 71269 58192 29259 -11388 -37288
1449 -37288 -41481 -12147 29325 35943 26381 17655 20850 2827 -33177 -40656 -7593 25463 68696
1436 68696 58761 31604 31492 16488 47492 53653 21921 28214 65604 39875 29664 13611 32408
1423 32408 86437 50774 18069 23420 83984 106363 88141 60137 44925 8826 19306 23279
1411 23279 17743 67147 94526 99723 123894 88207 16850 -12351 -24230 7196 -62572 -124297
1399 -124297 -102707 -27722 -7553 4630 25069 55045 94507 107127 122712 85391 78833 54381
1387 54381 22109 19791 18222 14254 30426 44594 56009 19129 -26462 -23774 -47185 -56358 -34691
1374 -34691 -36409 -22234 -726 30621 7535 -16206 16479 18916 15733 43147 43959 55176 62512
1361 62512 38182 28995 23423 28836 40018 51012 8644 -11414 8389 8273 29088 55733 68236
1348 68236 99189 93166 74807 59610 28160 50418 54635 17937 23358 18869 54970 63245 49595
1335 49595 60008 58100 61976 57524 10382 11807 21674 31720 33213 15635 -11943 -7187 2066
1322 2066 15701 -10603 657 42751 53647 31877 40717 27278 15205 -12586 -26551 -14087
1310 -14087 -30443 -14707 27759 25148 20946 37723 84313 70902 17934 -41338 -36011 7294
1298 7294 -21945 -72884 -55015 -45306 14473 32323 1395 -16957 -20772 14048 33584 34566 50864
1285 50864 64402 47005 51390 33030 -24087 -30968 -4063 2543 19334 48289 64504 55345 256
1272 256 -17327 -34929 -23863 -14475 -39984 -47058 -29090 -25613 -24191 17109 44233 15745 -23587
1259 -23587 1277 76078 91451 69876 4744 -26264 -22316 31131 64165 30268 32385 16345
1247 16345 18066 44554 95444 86270 65896 49714 36835 631 -33966 -32305 -26545 1943 -12449
1234 -12449 -34574 -34181 -36580 36586 80336 40211 24063 24578 10696 -5203 45858 56282 82650
1221 82650 79888 21395 24771 -12158 -38697 -30296 -23553 -17327 -5494 29993 19587 17403 47159
1208 47159 105333 80598 35668 9102 -43512 -26575 55215 53788 16145 -14758 5492 -6205
1196 -6205 3672 33296 -2191 -29969 7452 31897 38327 41420 22603 19013 30175 11081 14890
1183 14890 17172 15725 27403 48947 32456 -13835 -43607 -16661 27463 11437 8599 9038 16323
1170 16323 43131 40127 4542 -2089 812 -24107 -35837 -51433 -39404 4721 28650 7117
1158 7117 -6438 7063 -10603 -1061 -18557 -45737 -28670 -18135 -76079 -57684 -20570 -15271
1146 -15271 10810 28776 18146 5050 -534 -12070 2124 12141 35946 42972 25633 21192
1134 21192 10139 10105 42284 25879 -14902 7296 600 25228 73651 40927 13632 17440 -8739
1121 -8739 -22628 -25222 -3452 -32238 -27078 -8956 7530 49910 31806 32262 39957 39959 49065 67989
1107 67989 55389 -356 -37678 -56015 -30610 -22464 -40383 -32251 -16747 -11005 -16221 14158 57662
1094 57662 90416 53298 14347 11404 -18622 -19706 -24463 -37913 -39303 -74314 -12435 17133 -9704
1081 -9704 34541 103884 95769 40601 75539 112840 117013 99034 65174 53886 74952 115002
1069 115002 107522 45836 21791 42337 34776 46907 49201 47820 51692 49520 45129 65468 70369
1056 70369 35753 35500 21554 -17195 -53964 -64942 -50023 -37543 -2349 45803 30917 50795
1044 50795 38007 33709 39186 45330 17682 14769 23249 20528 24684 29537 27497 38776 36570 75251
1030 75251 85599 85996 77982 88813 85185 74612 72890 37344 11675 11635 42986 57499 45781
1017 45781 52142 92092 105187 95303 77464 74085 27726 18899 16401 43684 90390 95383 84295
1004 84295 38626 25744 -7207 -29810 -64122 -41626 7289 42269 68062 62048 64510 82814
992 82814 112181 110357 95963 51685 29142 46635 60853 46622 44755 11022 17647 35632 76793
979 76793 99167 71441 24981 10992 37559 59394 14747 54393 63413 57750 78728 69263 55846
966 55846 32206 21275 -6973 -49677 -28194 11660 16036 21745 57015 83083 76521 75905 99608
953 99608 72902 10486 -10228 11858 71819 75563 53671 43539 39895 16483 31128 80771
941 80771 70421 34997 43016 57094 54399 37423 43938 37685 39211 56903 54801 9965 1884
928 1884 20660 23341 52356 70829 88484 67178 40755 31755 21924 7116 -31921 -60159 -42447
915 -42447 -30461 -16312 -15856 -13489 -14843 -20078 -31648 -15922 -3473 -10115 -18953 3884 -17808
902 -17808 -27207 30507 58245 69102 50255 36900 36868 38881 27926 4470 14315 72128 121577
889 121577 106126 95258 50458 38541 56375 109381 109878 75210 51603 28265 -29698 -30537 -5210
876 -5210 24523 25474 28603 45444 41234 70876 95793 80090 60452 40147 25142 24607 51058
863 51058 44605 45327 22930 -32699 -56095 -52768 15965 24017 -13579 -5144 3317 22785 12123
850 12123 -7720 9929 46895 71936 69240 44378 42705 80234 33342 -15421 -37721 -74766
838 -74766 -83540 -24642 -2504 -5561 -28346 -1424 26546 39904 42181 44092 50277 44199 41500
825 41500 28605 38602 64585 75014 74379 48730 38410 10481 31285 12779 5519 54922 36841
812 36841 15704 533 -18040 2359 -9800 -688 16408 80390 82406 30008 25658 26116 61361
799 61361 69922 42745 6552 -5537 -29375 5956 58638 76411 97439 82537 35028 4740
787 4740 6017 13798 17578 -7552 4985 15351 25498 40279 41842 51529 54228 73769 71776 26021
773 26021 -1526 15612 -1961 5169 -2950 -1155 3244 16762 33955 44304 6851 28578 23849
760 23849 12123 29712 51327 60690 97086 98847 113807 107633 44207 74625 93941 121443 118122
747 118122 73097 59309 60553 54551 24862 13900 50690 45578 22500 16069 47525 58982 21867
734 21867 23598 -15698 -11447 42263 74315 36650 25216 54800 66265 56929 33375 20840 4881
721 4881 -15402 24104 43437 22773 63884 69462 85245 127395 99623 53297 38011 44659 72482
708 72482 74807 89988 105093 91462 55766 44312 60120 76379 89144 55827 43558 98697
696 98697 113708 79141 59185 65730 29127 15570 22202 3941 6891 20907 39466 45401 66412
683 66412 30910 29668 28200 -19376 8977 36665 24178 6834 31981 49004 18730 16769 23633
670 23633 23811 9581 28996 27401 5769 19386 49519 50324 71612 75531 40683 16953 24170
657 24170 4651 -25518 -25052 -9331 26185 56396 76354 39122 -18043 -8342 -8072 26197 46307
644 46307 47024 50822 38893 879 -14249 -22011 -38442 -38721 542 38314 22226 19326 13686 -451
630 -451 -5961 3838 39325 50767 50923 53866 64713 45213 37875 34021 40627 38839 65622 70734
616 70734 50131 9021 9895 24843 46006 40468 15031 -22676 -13875 34096 29078 12366 30590
603 30590 39235 38933 20796 45826 71323 67715 36922 4251 17446 23511 39482 46861 56522
590 56522 82803 86447 74123 25356 24735 28666 -5159 -6888 34459 66628 84314 79846 22863
577 22863 33904 47118 28286 2820 -5685 -3811 17699 32521 41165 36366 90072 145853 115156
564 115156 95355 56634 22107 28306 31545 22770 24068 5178 -12947 38461 37031 53396 99116
551 99116 121446 76138 66183 71681 69401 47657 -9788 47656 58443 70025 108343 99141 77522
538 77522 84570 72910 49007 31707 21375 2496 29882 44636 38285 7484 10945 24320 -20702
525 -20702 -19590 1666 875 11782 52803 80202 66407 28401 12714 -16697 -3019 19619 -353
512 -353 24301 7038 8096 11962 -15153 -26889 14322 -13765 13630 45170 100836 118943 81679
499 81679 68968 105743 116248 145396 169638 139281 103847 93748 77778 59165 50433 48373
487 48373 48236 62003 62454 64462 31337 15482 -12077 -4619 11840 26212 34572 80795 89274 52729
473 52729 40751 71189 80118 71676 95230 109500 112947 96752 55712 69473 98768 121360 93868
460 93868 59776 49952 87610 101821 93650 103927 90174 77933 64228 46869 29335 -4311
448 -4311 -5778 -28280 -8960 29546 90750 65794 70618 101931 52162 52401 80437 100813 75497
435 75497 43761 26031 25331 39879 28982 7389 -23149 -12829 13468 53976 65422 54891
423 54891 45197 44659 33118 50377 49405 41184 37539 15888 32032 50434 47803 58670 58071 83343
409 83343 96610 85541 70730 91421 85469 90704 62460 34905 34852 52268 46113 38513 2398
396 2398 -14635 921 43589 69068 87846 81388 65282 26957 40333 66239 74422 93423 117218
383 117218 105358 90160 83718 85666 73013 78182 58975 48177 24382 19029 27118 1231 28911
370 28911 39371 26823 -7661 -20707 -14455 -8330 36550 41571 25811 24371 14161 25898 40642
357 40642 36806 9153 -14781 -3344 28339 32383 12979 19324 21672 40120 37162 46081 50783
344 50783 40107 12164 5033 -7486 40845 51102 43894 39970 4943 -2534 31481 66566 34137
331 34137 39894 38394 73726 73812 21701 11567 45070 80417 77912 93081 81093 46252 31392
318 31392 -956 -12978 -18112 -19784 -14973 30965 66692 107343 110072 77228 87018 75167 36086
305 36086 15190 32794 43543 42932 54330 64841 76930 50098 78132 74608 57349 47212 40750
292 40750 37589 44886 59850 79750 62198 69028 68999 92755 72109 81319 91265 71692 67263 100775
278 100775 108024 95567 61041 42467 33191 65632 118588 166163 141691 110941 107885 105602 63123
265 63123 56893 20651 17034 37647 38289 28727 43363 61403 61372 63038 52655 88509 71441 54521
251 54521 82953 124984 137236 108679 71360 53770 37144 70288 39328 22217 61036 106429
239 106429 139003 113246 86591 77801 70355 81107 53309 51145 41180 24936 51275 13482 13578
$$ [...]
##END NTUPLES=NMR SPECTRUM
##END=
