##TITLE=Analysis number 319593
Compound Code ac 35975
Project Code adrs
Chemist Name frontier sci
##JCAMPDX= 6.0         $$ Bruker NMR JCAMP-DX V2.0
##DATA TYPE= NMR SPECTRUM
##DATA CLASS= NTUPLES
##ORIGIN= Bruker BioSpin GmbH
##OWNER= nmr
$$ XWIN-NMR		Version 3.5
$$ Fri May 19 14:49:09 2006 GMT Daylight Time (UT+1h)  MAYBRIDGE\nmr@NMR_250MHZ
##.OBSERVE FREQUENCY= 250.131544655141
##.OBSERVE NUCLEUS= ^1H
##.ACQUISITION MODE= SIMULTANEOUS (DQD)
##.ACQUISITION SCHEME= undefined
##.AVERAGES= 16
##.DIGITISER RES= 18
##SPECTROMETER/DATA SYSTEM= dpx250
##.PULSE SEQUENCE= zg30
##.SOLVENT NAME= DMSO
##.SHIFT REFERENCE= (INTERNAL, DMSO, 0, 16.522)
##AUDIT TRAIL= $$ (NUMBER, WHEN, WHO, WHERE, WHAT)
$$ ##TITLE= Audit trail, XWIN-NMR		Version 3.5
$$ ##JCAMPDX= 5.01
$$ ##ORIGIN= Bruker BioSpin GmbH
$$ ##OWNER= nmr
$$ C:\u/data/dgb/nmr/ADRS/4820/pdata/1/auditp.txt
$$ ##AUDIT TRAIL=  $$ (NUMBER, WHEN, WHO, WHERE, WHAT)
(   1,<2006-05-19 14:48:22.51 +100>,<MAYBRIDGE\nmr>,<NMR_250MHZ>,
      <created by zg, POWCHK disabled, PULCHK disabled
       configuration hash MD5:
       84 BC 41 DB A1 6E 1D 46 DA 25 12 A5 C1 ED C5 3A
       data hash MD5: 64K
       02 58 8D 87 52 6C D8 21 2E 02 66 58 4F CC 07 99>)
(   2,<2006-05-19 14:48:46.42 +100>,<MAYBRIDGE\nmr>,<NMR_250MHZ>,
      <Start of raw data processing
       ef LB = 0.3 FT_mod = 6 PKNL = 1 SI = 32K 
       data hash MD5: 32K
       04 1E C1 AF AF 87 E0 CC D3 B0 BB 4B 41 65 96 41>)
(   3,<2006-05-19 14:48:51.08 +100>,<MAYBRIDGE\nmr>,<NMR_250MHZ>,
      <apk 
       data hash MD5: 32K
       5F BC D4 78 D2 FA E6 BE C7 67 B1 DD 37 F1 01 51>)
(   4,<2006-05-19 14:48:52.66 +100>,<MAYBRIDGE\nmr>,<NMR_250MHZ>,
      <abs ABSG = 5 
       data hash MD5: 32K
       B6 CA F0 6D 32 44 F8 1D B5 DE 77 AB 64 E7 93 4D>)
$$ ##END=
$$ 
$$ hash MD5
$$ E9 0F 2F E9 59 AC 38 D1 47 09 0B 8E 6E 8E BE 86
##$RELAX= 
##$RELAX= 
##$RELAX= 
##$RELAX= 
##$RELAX= 
##$RELAX= 
##$RELAX= 
$$ Bruker specific parameters
$$ --------------------------
##$DU= <C:\u>
##$EXPNO= 4820
##$NAME= <ADRS>
##$PROCNO= 1
##$TYPE= <nmr>
##$USER= <dgb>
##$AMP= (0..31)
100 100 100 100 100 100 100 100 100 100 100 100 100 100 100 100 100 100 
100 100 100 100 100 100 100 100 100 100 100 100 100 100 
##$AQSEQ= 0
##$AQ_mod= 3
##$AUNM= <au_zg>
##$AUTOPOS= <43 >
##$BF1= 250.13
##$BF2= 250.13
##$BF3= 250.13
##$BF4= 250.13
##$BF5= 500.13
##$BF6= 500.13
##$BF7= 500.13
##$BF8= 500.13
##$BYTORDA= 1
##$CFDGTYP= 0
##$CFRGTYP= 5
##$CHEMSTR= <none>
##$CNST= (0..31)
1 1 145 1 1 1 1 1 1 1 1 1 1 1 1 1 1 1 1 1 1 1 1 1 1 1 1 1 1 1 1 1 
##$CPDPRG= <>
##$CPDPRG1= <>
##$CPDPRG2= <>
##$CPDPRG3= <>
##$CPDPRG4= <mlev>
##$CPDPRG5= <mlev>
##$CPDPRG6= <mlev>
##$CPDPRG7= <mlev>
##$CPDPRG8= <mlev>
##$CPDPRGB= <>
##$CPDPRGT= <>
##$D= (0..31)
0 1 0 0 0 0 0 0 0 0.06 0 0 0 0 0 0 0.0002 0 0 0 0 0 0 0 0 0 0 0 0 0 0 
0 
##$DATE= 1148046500
##$DBL= (0..7)
120 120 120 120 120 120 120 120 
##$DBP= (0..7)
150 150 150 150 150 150 150 150 
##$DBP07= 0
##$DBPNAM0= <>
##$DBPNAM1= <>
##$DBPNAM2= <>
$$ [...]
##$SUBNAM6= <"">
##$SUBNAM7= <"">
##$SUBNAM8= <"">
##$SUBNAM9= <"">
##$SW= 20.6930455092707
##$SWIBOX= (0..15)
0 0 3 0 0 0 0 0 0 0 0 0 0 0 0 0 
##$SW_h= 5175.983436853
##$TD= 65536
##$TD0= 1
##$TE= 295.16
##$TE2= 300
##$TE3= 300
##$TEG= 300
##$TL= (0..7)
0 120 120 120 120 120 120 120 
##$TP= (0..7)
150 150 150 150 150 150 150 150 
##$TP07= 0
##$TPNAME0= <>
##$TPNAME1= <>
##$TPNAME2= <>
##$TPNAME3= <>
##$TPNAME4= <>
##$TPNAME5= <>
##$TPNAME6= <>
##$TPNAME7= <>
##$TPOAL= (0..7)
0.5 0.5 0.5 0.5 0.5 0.5 0.5 0.5 
##$TPOFFS= (0..7)
0 0 0 0 0 0 0 0 
##$TUNHIN= 0
##$TUNHOUT= 0
##$TUNXOUT= 0
##$USERA1= <user>
##$USERA2= <user>
##$USERA3= <user>
##$USERA4= <user>
##$USERA5= <user>
##$V9= 5
##$VALIST= <valist>
##$VCLIST= <CCCCCCCCCCCCCCC>
##$VD= 0
##$VDLIST= <DDDDDDDDDDDDDDD>
##$VPLIST= <PPPPPPPPPPPPPPP>
##$VTLIST= <TTTTTTTTTTTTTTT>
##$WBST= 1024
##$WBSW= 4
##$XGAIN= (0..3)
0 0 0 0 
##$XL= 0
##$YL= 0
##$YMAX_a= 453002
##$YMIN_a= -530554
##$ZGOPTNS= <>
##$ZL1= 120
##$ZL2= 120
##$ZL3= 120
##$ZL4= 120
##$ABSF1= 16.522
##$ABSF2= -4.171173
##$ABSG= 5
##$ABSL= 3
##$ALPHA= 0
##$AQORDER= 0
##$ASSFAC= 0
##$ASSFACI= 0
##$ASSFACX= 0
##$ASSWID= 0
##$AUNMP= <proc_1d>
##$AZFE= 0.1
##$AZFW= 0.1
##$BCFW= 0
##$BC_mod= 0
##$BYTORDP= 0
##$COROFFS= 0
##$CY= 12.5
##$DATMOD= 1
##$DC= 0
##$DFILT= <>
##$DTYPP= 0
##$F1P= 14.0000005364418
##$F2P= -0.99999901652339
##$FCOR= 0.5
##$FTSIZE= 32768
##$FT_mod= 6
##$GAMMA= 0
##$GB= 0
##$INTBC= 1
##$INTSCL= 1
##$ISEN= 128
##$LB= 0.3
##$LEV0= 0
##$LPBIN= 0
##$MAXI= 10000
##$MC2= 0
##$MEAN= 0
##$ME_mod= 0
##$MI= 0
##$NCOEF= 0
##$NC_proc= -5
##$NLEV= 6
##$NOISF1= 0
##$NOISF2= 0
##$NSP= 0
##$NTH_PI= 0
##$NZP= 0
##$OFFSET= 16.522
##$PC= 1
##$PHC0= 161.0629
##$PHC1= 10.311
##$PH_mod= 1
##$PKNL= yes
##$PPARMOD= 0
##$PSCAL= 4
##$PSIGN= 0
##$REVERSE= no
##$SF= 250.13
##$SI= 32768
##$SIGF1= 0
##$SIGF2= 0
##$SINO= 400
##$SIOLD= 32768
##$SREGLST= <1H.DMSO>
##$SSB= 0
##$STSI= 32768
##$STSR= 0
##$SW_p= 5175.98343685301
##$SYMM= 0
##$S_DEV= 0
##$TDeff= 65536
##$TDoff= 0
##$TI= <Analysis number 999999
Compound Code 99
Book Reference 9
Project Code 9>
##$TILT= no
##$TM1= 0
##$TM2= 0
##$TOPLEV= 0
##$USERP1= <user>
##$USERP2= <user>
##$USERP3= <user>
##$USERP4= <user>
##$USERP5= <user>
##$WDW= 1
##$XDIM= 32768
##$YMAX_p= 316215488
##$YMIN_p= -1106916
$$ End of Bruker specific parameters
$$ ---------------------------------
##NTUPLES= NMR SPECTRUM
##VAR_NAME=  FREQUENCY,     SPECTRUM/REAL,   SPECTRUM/IMAG
##SYMBOL=    X,             R,               I
##VAR_TYPE=  INDEPENDENT,   DEPENDENT,       DEPENDENT
##VAR_FORM=  AFFN,          ASDF,            ASDF
##VAR_DIM=   32768,         32768,           32768
##UNITS=     HZ,            ARBITRARY UNITS, ARBITRARY UNITS
##FACTOR=    0.157963299565203, 1,           1
##FIRST=     4132.6476996994, 0,             0
##LAST=      -1043.33573715361, 0,           0
##MIN=       -1043.33573715361, -1106916,    0
##MAX=       4132.6476996994, 316215488,     0
$$ Real data points
##PAGE= N=1
##DATA TABLE= (X++(R..R)), XYDATA
$$ [...]
24472a61288J44087j43801r1796K2982J6252K09517J13439j84888l69233N1142
$$ -161288 -17201 -161002 -252798 -229816 -213564 -4047 109392 -75496 -444729 -393587
24462c93587J32690P2590K33441J28204j5197k38242q0674j00029K1657Q3327
$$ -393587 -260897 -188307 45134 173338 158141 -80101 -160775 -260804 -239147 -155820
24452a55820K0668P716j58771l08885m3101J72510L14160J6038j40778O2080K24188
$$ -155820 -135152 -127436 -286207 -595092 -638193 -465683 -151523 -135485 -276263 -214183 10005
24441A0005m5988k11170n6525M7832l3774k8352K30333J28113j27923J85545R4519
$$ 10005 -35983 -247153 -303678 -255846 -289620 -317972 -87639 40474 -87449 98096 192615
24430A92615j31176j45855j36770k5394L9200P287O7510M4163j44812k5793O1293
$$ 192615 61439 -84416 -221186 -246580 -207380 -200093 -132583 -88420 -233232 -259025 -197732
24419a97732r5023K0842j12052P6468J35243l3656l10914l9326M3287k2620J33295
$$ -197732 -292755 -271913 -383965 -307497 -172254 -205910 -516824 -556150 -512863 -535483 -402188
24408d02188K32266K95610K39683L0525k15617j57058J4787k74770O3544J83313
$$ -402188 -169922 125688 365371 395896 180279 23221 38008 -236762 -173218 10095
24398A0095J31016J26555k14358o5883k2239j01535K25894J12173j74079Q2916
$$ 10095 141111 267666 53308 -12575 -34814 -136349 89545 201718 27639 110555
24388A10555k95698j52564L6379L30081L8941k35143J00786K54755k31795k76891
$$ 110555 -185143 -337707 -301328 28753 67694 -167449 -66663 188092 -43703 -320594
24378c20594L3111J49368K9319K0222k0154k06194N0132R1419J5918K34505j15766
$$ -320594 -287483 -138115 -108796 -88574 -108728 -314922 -264790 -173371 -157453 77052 -38714
24367c8714M8814K23445J73322j47268m0006J16370o5719Q1610o5590o6418j13790
$$ -38714 10100 233545 406867 259599 219593 335963 270244 351854 286264 219846 106056
24356A06056j953K22611p9365p5377p0517j31623R8685J71036j41622n8645Q9543
$$ 106056 104103 326714 247349 171972 101455 -30168 68517 239553 97931 39286 128829
24345A28829J30220Q6067k43372j53762j1105N0889l1391m3088K16526m2480k94068
$$ 128829 259049 345116 101744 -52018 -63123 -12234 -43625 -86713 129813 87333 -206735
24334b06735j53959J21720K32321J41349j08796k97869j41114K84395L38791p2627
$$ -206735 -360694 -238974 -6653 134696 25900 -271969 -413083 -128688 210103 137476
24324A37476J0035J00620N2153k25245j64368O2825J57276L13480p5981j91852
$$ 137476 147511 248131 300284 75039 -89329 -26504 130772 444252 368271 176419
24314A76419L747j88517Q3968J18684M121L24693l1139o7927L8070r9081j45931
$$ 176419 180166 -8351 75617 194301 198422 523115 491976 424049 462119 363038 217107
24303B17107p55o059J31989k13445k57726P4821P4946J86659j77344L0933J30917
$$ 217107 216352 210293 342282 128837 -128889 -54068 20878 207537 30193 61126 192043
24292A92043j86360M2654L8242p1505j5545m3608N2164j92355O13J01284j05958
$$ 192043 5683 48337 86579 15074 -471 -44079 8085 -184270 -183657 -82373 -188331
24281a88331j9992J46859n2707N5730Q2487j25250j23948N802J39662Q375P5879
$$ -188331 -208323 -61464 -114171 -58441 24046 -101204 -225152 -219350 -79688 -71313 4566
24270D566o4242J32497j35647k63662j68751P7077K65818L87982r4827l3053k46216
$$ 4566 -59676 72821 -62826 -326488 -495239 -418162 -152344 235638 140811 107758 -138458
24259a38458j24011j24318Q0115J20650J80626J90770M529k41940P9241J55047
$$ -138458 -262469 -386787 -306672 -186022 -5396 185374 189903 -52037 27204 182251
24249A82251j96711q8845j43798J59243K22403M3153p3474o5073J31652M1153
$$ 182251 -14460 -103305 -247103 -87860 134543 177696 104222 39149 170801 211954
24239B11954l23493j21824q7091j15268K63587J99866Q7098l0090p1313j10688
$$ 211954 -111539 -233363 -320454 -435722 -172135 27731 114829 84739 13426 -97262
24229i7262J7421k5616j39805R1537j0167j30552j37821J22291j18745j3149P1639
$$ -97262 -79841 -105457 -245262 -153725 -163892 -294444 -432265 -309974 -428719 -441868 -370229
24218c70229J74229p7412N2693J5004L34705J50113j06276j51926P3296J4425
$$ -370229 -196000 -273412 -220719 -205715 128990 279103 172827 20901 94197 108622
24208A08622k45584K6876L36491K31992K10808j25881j44789r8822m34429j37452
$$ 108622 -136962 -110086 226405 458397 669205 543324 398535 299713 -134716 -272168
24198b72168j45278K58041o5795k48309r1916K53817K38729j8630k49610j4427
$$ -272168 -417446 -159405 -225200 -473509 -565425 -311608 -72879 -91509 -341119 -355546
24188c55546k4815K00233K7466P9189J41252k17813m4384K4517j29618O2167K16805
$$ -355546 -380361 -180128 -152662 -73473 67779 -150034 -194418 -169901 -299519 -237352 -20547
24177b0547J44326j5465k21557k40014L12368M845j94627k74626m8421N2337K07707
$$ -20547 123779 108314 -113243 -353257 -40889 -36044 -230671 -505297 -553718 -501381 -293674
24166b93674J04719n6159o1583J16425K69142J13014j06325j15013K1686n6613
$$ -293674 -188955 -245114 -306697 -190272 78870 191884 85559 -29454 -7768 -64381
24156f4381P1777K6256j17041j7604J53917J37494j04143m3506L8113K97099P9036
$$ -64381 7396 33652 -83389 -100993 52924 190418 86275 42769 80882 377981 457017
24145D57017k25913j11128J1421k0767Q4907q8896M8060J82550O538k48196q041
$$ 457017 231104 119976 131397 110630 195537 106641 154701 337251 343789 95593 87552
24134H7552j05100K90035j54013J1103K4572O8848J01399j78198j20177Q2793
$$ 87552 -17548 272487 118474 129577 154149 222997 324396 146198 26021 108814
24124A08814j04754j66977J42823J06507r7652k4759Q0220j06524k21830o794
$$ 108814 4060 -162917 -20094 86413 -11239 -35998 44222 -62302 -284132 -290926
24114b90926q9546J08926L72702p306j94648J35183J34658j71104q8662M9682
$$ -290926 -380472 -271546 101156 93850 -100798 34385 169043 -2061 -90723 -41041
24104d1041L5402j87874j00155J03612J08234o3934M5888K5039K78189O3656r6221
$$ -41041 -5639 -193513 -293668 -190056 -81822 -145756 -99868 -74829 203360 267016 170795
24093A70795K23205r5j0077l1228j09532j88351j03611J50611J3695Q40r583P2329
$$ 170795 394000 393905 383828 352600 243068 54717 -48894 101717 115412 116252 106669 178998
24081A78998N8517p369k3072n7080J78547p9714l45271J36986K05724j12563j51197
$$ 178998 237515 230146 207074 149994 328541 248827 -96444 40542 246266 133703 -17494
24070a7494J42062K74406K08968k50256l25769j54075J27137O750M0658j09417
$$ -17494 124568 398974 607942 357686 31917 -122158 4979 11729 52387 -57030
24060e7030k41600o3051P7209Q8105n9480L62351O0112j86795R4431J19071O0646
$$ -57030 -298630 -361681 -284472 -196367 -255847 106504 166616 -20179 74252 193323 253969
24049B53969j16191k43498L0670Q0393p4539J82389k48234k83303J56235K1614
$$ 253969 137778 -105720 -75050 5343 -69196 113193 -135041 -418344 -262109 -240495
24039b40495K49882K04120j19509k08135j79515p8778r7769J05881M7454J298
$$ -240495 9387 213507 93998 -114137 -293652 -372430 -470199 -364318 -316864 -315566
24029c15566J9417J45302Q7043l3784R4224K2497k16128q8798J37695L80856K87467
$$ -315566 -296149 -150847 -63804 -97588 -3364 19133 -196995 -285793 -148098 232758 520225
24018E20225P191j09352o9704j37131l7867R9414m79480k53884k919J19281J52064
$$ 520225 527416 418064 348360 211229 173362 272776 -206704 -460588 -463507 -344226 -192162
24007a92162k9694O4094k38873j85372J11004L53426N2402j58992j6538r1617
$$ -192162 -221856 -157762 -396635 -582007 -471003 -117577 -65175 -224167 -240705 -332322
23997c32322l2722Q8785J12157q2653K15502J26277m7562j52569o8146q7994J34836
$$ -332322 -365044 -276259 -164102 -246755 -31253 95024 47462 -105107 -173253 -261247 -126411
23986a26411N3044j56267l9124o7934j77494J11922J30651J17178J03297R5939
$$ -126411 -73367 -229634 -268758 -336692 -514186 -402264 -271613 -154435 -51138 44801
23976D4801K2490j69971k58393k5850K06253L06789l1176k20689L22881l8709
$$ 44801 67291 -102680 -361073 -386923 -180670 126119 94943 -125746 197135 158426
23966A58426j08575p9081Q6607J19090j63272j16207j435j05170K9980K16739
$$ 158426 49851 -29230 57377 176467 13195 -103012 -104447 -209617 -179637 37102
23956C7102Q1862j2837j18965n7331r6499p227J75499J11515j58566M6954j10098
$$ 37102 118964 106127 -12838 -70169 -166668 -173895 1604 113119 -45447 1507 -108591
23945a08591L0274K90819J45529m912L3108j24181k14767K6588K70858p8712k26787
$$ -108591 -78317 212502 358031 353119 386227 262046 47279 73867 344725 266013 39226
23934C9226P9212J65864Q1444j83054l2417j30399j57331j64407n8842L765M0279
$$ 39226 118438 284302 365746 182692 150275 19876 -137455 -301862 -360704 -356939 -316660
23923c16660P165k0988j9435o567J12015R3797Q2698j06527o5959L2967K0648
$$ -316660 -309495 -330483 -349918 -356485 -244470 -150673 -67975 -174502 -240461 -207494 -186846
23912a86846J36027r1202j46848J07180J21508k45204j25421J52813k3402P2739
$$ -186846 -50819 -142021 -288869 -181689 -60181 -305385 -430806 -277993 -301395 -228656
23902b28656l9186j28973J4726r8417k8825j16739m1817J96536M7665q6126J32106
$$ -228656 -267842 -396815 -382089 -480506 -509331 -626070 -667887 -471351 -423686 -509812 -377706
23891c77706r7579J61387J93818P1457J10226R1700j14764k16954M1764j65940
$$ -377706 -475285 -313898 -120080 -48623 61603 153303 38539 -178415 -136651 -302591
23881c02591j13275N4507K13786m8327J62244K67265O3214j38535J4427j89883
$$ -302591 -415866 -361359 -147573 -195900 -33656 233609 296823 158288 172715 -17168
23871a7168m8993K72007n156M486m100k40650Q8913J92534P8727j7611N3672k28087
$$ -17168 -66161 205846 200690 205176 201076 -39574 49339 241873 320600 302989 356661 128574
23859A28574j33074Q7695j75995m1898o3848j52206J32727K37691j00247j38096
$$ 128574 -4500 83195 -92800 -134698 -198546 -350752 -218025 19666 -80581 -218677
23849b18677M6202n72k5916J59199K42996J54980Q6570o1632j97127r9827J33695
$$ -218677 -172475 -173047 -198963 -39764 203232 358212 444782 383150 186023 86196 219891
23838B19891J51744j1848o1084L3090j59043M0032j12871K9397P3457J15709o300
$$ 219891 371635 359787 298703 331793 172750 212782 99911 129308 202765 318474 312174
23827C12174j41957j51026k5863J21482m3549r880m6333K05257k71287l63875
$$ 312174 170217 19191 -6672 114810 71261 61381 15048 220305 -50982 -414857
23817d14857K68011J45877m49819l53105K0209R9479J36432K36812J16595N5367
$$ -414857 -146846 -969 -450788 -803893 -783684 -684205 -547773 -310961 -194366 -138999
23807a38999j27201O661P8419K11625J36210J61230j28449k7623N8813Q0584m6882
$$ -138999 -266200 -259539 -181120 30505 166715 327945 199496 171873 230686 311270 264388
23796B64388l68683o2566K39850J2467l75164r0567K11272J67025J83623l26402
$$ 264388 -104295 -166861 72989 85456 -289708 -380275 -169003 -1978 181645 -144757
23786a44757j71840j6401J0731o2372M6303N3380j78073o8445Q8592j15244q9243
$$ -144757 -316597 -332998 -322267 -384639 -338336 -284956 -463029 -531474 -442882 -558126 -647369
23775f47369L46155J16201o030L36295Q9996k57811p897P8188J47194J37977j20466
$$ -647369 -301214 -185013 -191043 145252 235248 -22563 -30460 47728 194922 332899 212433
23764B12433j57965O6202o9383k1440k3312o0097J4522m7189K01375m6230j56419
$$ 212433 54468 120670 51287 29847 6535 -53562 -39040 -86229 115146 68916 -87503
23753h7503J7099J59032k19820j72826J52834J49275K3717k47180J12679J08032
$$ -87503 -70404 88628 -131192 -304018 -151184 -1909 21808 -225372 -112693 -4661
23743d661q9935R0726M16067n5521k62406p9407j05505j46924j8637n7550Q7925
$$ -4661 -94596 -3870 412197 356676 94270 14863 -90642 -237566 -256203 -313753 -225828
23732b25828N5529j86448O1981K22143J26869K21729l16554k08366r0254o7897
$$ -225828 -170299 -356747 -294766 -72623 54246 275975 -40579 -248945 -339199 -407096
23722d07096m0183P4562J3286M1744Q1543L510l321j82715K01522K4865q1183
$$ -407096 -447279 -372717 -359431 -317687 -236144 -232634 -235955 -418670 -217148 -192283 -273466
23711b73466P6906J24194J26485M2329R5449J1373p0320q185j07868j36647N0
$$ -273466 -196560 -72366 54119 96448 191897 203270 132950 124765 16897 -119750 -119700
23700a19700J92862k3957j01275j23586j03197M3043Q9403R9752L28918O2233
$$ -119700 73162 49205 -52070 -175656 -278853 -235810 -146407 -46655 282263 344496
23690C44496m51577k75648L01332L16275K7688j78717j32110K4033J13265J94603
$$ 344496 -107081 -382729 -81397 234878 262566 83849 -48261 -24228 89037 283640
23680B83640m24p3165j16418P4981j60721l11404j37620K91647J06112k35605
$$ 283640 283216 210051 93633 168614 7893 -303511 -441131 -149484 -43372 -278977
23670b78977q0723K80087J66380J7582j67679M0123j25601j49300r435P589K35692
$$ -278977 -359700 -79613 86767 104349 -63330 -23207 -148808 -298108 -307543 -299954 -64262
23659f4262K30143N864Q4016q7409j99740j52172K31821J3068n0831R2288J92796
$$ -64262 165881 171745 255761 168352 -31388 -183560 48261 61329 10498 102786 295582
23648B95582k2678k08300r316m422m7509p0685J31226K99194k19269j79651O7307
$$ 295582 272904 64604 55288 50866 3357 -67328 63898 363092 143823 -35828 31479
23637C1479R5076n7859k25474q0014j2001O7126J70702k10713j19707n3019L19634
$$ 31479 126555 68696 -156778 -236792 -248793 -181667 -10965 -221678 -341385 -394404 -74770
23626g4770M66837J15193o6940N4383q21j41386j57206J03649J57727j66351n7663
$$ -74770 392067 507260 440320 494703 493882 352496 195290 298939 456666 290315 232652
23615B32652m6928j72348j89420K5185k6325J35482Q9598l5345L593M8028N4795
$$ 232652 185724 13376 -176044 -150859 -177184 -41702 47896 12551 16144 64172 118967
23604A18967k82831M5774n3980O7910Q6159N4868K90854j3330L0934j03827k89248
$$ 118967 -163864 -118090 -172070 -104160 -18001 36867 327721 314391 345325 241498 -47750
23593d7750j09072L132M841l831J57470j36856k56468j51902O8377J08663q0900
$$ -47750 -156822 -153690 -148849 -152680 4790 -132066 -388534 -540436 -472059 -363396 -444296
23582d44296k04382M10825J89903n0800o7559K9659R9357N1226O3492o4766r4324
$$ -444296 -648678 -237853 -47950 -98750 -166309 -136650 -37293 13933 77425 12659 -81665
23571h1665p0202k1536j52416N0205J28189j5275j23789J94029J41300l8351N3509
$$ -81665 -151867 -173403 -325819 -275614 -147425 -162700 -286489 -92460 48840 10489 63998
23560F3998Q4497k5624q5893k06334P3366J27738K09990j0601N0229q586J14454
$$ 63998 148495 122871 36978 -169356 -95990 31748 241738 231137 281366 272780 387234
23549C87234l2254k8135k13656k21141j07168K24314J59986K22523l6680j41634
$$ 387234 354980 326845 113189 -107952 -215120 9194 169180 391703 355023 213389
23539B13389K2128k3529q7414N7164r7744j74615J7388J90820M5895j57255j71800
$$ 213389 235517 211988 124574 181738 83994 -90621 -73233 117587 163482 6227 -165573
23528a65573n6460J30041J05939K1045k08493j67258p3175j46101P0452K94319
$$ -165573 -222033 -91992 13947 34992 -173501 -340759 -413934 -560035 -489583 -195264
23518a95264L99308J06267j51313j34670Q1291m133l8950L2141m4467M4852M1292
$$ -195264 204044 310311 158998 24328 105619 101486 62536 94677 50210 95062 136354
23507A36354K2820L6079j09986j41859k92130l66645M6740K14783M9192P5728
$$ 136354 159174 195253 85267 -56592 -348722 -715367 -668627 -453844 -404652 -328924
23497c28924M0279J94798K21229R5694j31074m1884j03608j33494K31685J80651
$$ -328924 -288645 -93847 127382 223076 92002 50118 -53490 -186984 44701 225352
23487B25352j5599k2701j32079k05033k4901N8007k0011P8583j11810j01258R4097
$$ 225352 209753 187052 54973 -150060 -174961 -116954 -136965 -58382 -170192 -271450 -177353
23476a77353M6513l0890m8802J33033K30722j23112r1030K03242j31300r6041
$$ -177353 -130840 -161730 -210532 -77499 153223 30111 -60919 142323 11023 -85018
23466h5018j7494k062K74260j10931l01052P1867L23681Q7215M1968O2898R4477
$$ -85018 -102512 -104574 169686 58755 -242297 -170430 153251 240466 282434 345332 439809
23455D39809k92540k69093K19560P740N258K86171l12k74833k76965P8906j63379
$$ 439809 147269 -121824 97736 105476 110734 396905 396593 121760 -155205 -76299 -239678
23444b39678L6485m7374O0004K06268k10297k18253M2624K92306K848N113J46389
$$ -239678 -203193 -250567 -190563 15705 -194592 -412845 -370221 -77915 -75067 -69954 76435
23433G6435m2675J52275k82799K4676J71268J46850R6579l32914j0739J76350
$$ 76435 33760 186035 -96764 -72088 99180 246030 342609 9695 -1044 175306
23423A75306J08518j25715q3348k56588N3799K93139J52472N4819j52536j94791
$$ 175306 283824 158109 74761 -181827 -128028 165111 317583 372402 219866 25075
23413B5075l0461J4456K7760L7971Q4898j26955p6667k1750p7299l7837R6553
$$ 25075 -5386 9070 36830 74801 159699 32744 -43923 -65673 -142972 -180809 -84256
23402h4256r5556j16838K42922R4454Q8196l3656O2886j2986R9122q3240l49176
$$ -84256 -179812 -296650 -53728 40726 128922 95266 158152 145166 244288 161048 -188128
23391a88128j32743N9476J6922L7705N091p3128n1786k0598Q8151j60551k58341
$$ -188128 -320871 -261395 -244473 -206768 -201677 -274805 -326591 -347189 -259038 -419589 -677930
23380f77930J4372K10021M11458R1532k31372J6661J02152J26696j46107n2264
$$ -677930 -663558 -453537 -42079 49453 -181919 -165258 -63106 63590 -82517 -134781
23370a34781j1806J53412J20256r9899n9574L0025J2149P805M1153n0564k53089
$$ -134781 -146587 6825 127081 27182 -32392 -2367 9782 17587 58740 8176 -244913
23359b44913k84366q5414J51058J44286K36525L3134l49636K1761J63020J22676
$$ -244913 -529279 -614693 -463635 -319349 -82824 -49690 -399326 -377565 -214545 -91869
23349i1869P8846J95724M5303j2890p8588k18132n5638m4778j6607J64150J14730
$$ -91869 -13023 182701 228004 215114 136526 -81606 -137244 -182022 -198629 -34479 80251
23338H0251j11038j53724q075K73085L34564m3809k5390J87496j71109k19027
$$ 80251 -30787 -184511 -192586 80499 415063 371254 345864 533360 362251 143224
23328A43224M994O5634n8960q9697q1164N0001j0773q8748J43028K56l50726r3744
$$ 143224 148218 213852 154892 65195 -15969 34032 23259 -65489 77539 77795 -272931 -366675
23316c66675K41957K08296P9853n6536j91854l51652j14377J16609J88875J3553
$$ -366675 -124718 83578 163431 106895 -84959 -436611 -550988 -434379 -245504 -231951
23306b31951j52753m5181J55390K27708j03538j05507R4239R0457j20778j5473
$$ -231951 -384704 -429885 -274495 -46787 -150325 -255832 -161593 -71136 -191914 -207387
23296b07387R7547n7386J21308K09651j44114n40k4322M6106R8001j30317k40149
$$ -207387 -109840 -167226 -45918 163733 19619 19079 -5243 40863 138864 8547 -231602
23285b31602p833L76296N6027L2573K27937m8940k64871q936J40065J3448l15771
$$ -231602 -239435 136861 192888 225461 453398 404458 139587 130651 270716 284164 -31607
23274c1607k01368P8664R9613J01544j38737o3853L80961J19836k49168J63741
$$ -31607 -232975 -154311 -54698 46846 -91891 -155744 225217 345053 95885 259626
23264B59626J53243k2148k18900j26075j62386j73712L9299K18261J35380m675
$$ 259626 412869 390721 171821 45746 -116640 -290352 -251053 -32792 102588 97913
23254I7913J5199r759l9492k29747K99401l4717k84827P28J80707M1818K996K92204
$$ 97913 113112 103353 63861 -165886 133515 98798 -186029 -185301 -4594 37224 40220 332424
23242C32424m0645j74875k19642k0742P3338K1013j46425j17738K44786j44188
$$ 332424 291779 116904 -102738 -123480 -50142 -29129 -175554 -293292 -48506 -192694
23232a92694k37557J45392R5752Q5389N8065j29179j44878J17261j90950Q3570
$$ -192694 -430251 -284859 -189107 -103718 -45653 -174832 -319710 -202449 -393399 -309829
23222c09829K0276q5554K08984L42276m6262j28957j38232K0640j24555p6214
$$ -309829 -289553 -375107 -166123 176153 129891 934 -137298 -116658 -241213 -317427
23212c17427K2906l1876p7513m1693R9157J78674Q0739K9827q2886q4710L73405
$$ -317427 -294521 -326397 -403910 -445603 -346446 -167772 -87033 -57206 -140092 -224802 148603
23201A48603J03122k99802M4769P1530j62995L5053n5486J12210l2275k79720
$$ 148603 251725 -48077 -3308 68222 -94773 -59720 -115206 -2996 -35271 -314991
23191c14991k21474L3418N2406Q8169P8855j47725K42674m6373o7917j82503j1546
$$ -314991 -536465 -503047 -450641 -362472 -283617 -431342 -188668 -235041 -302958 -485461 -497007
23180d97007P1335K81071j84856J3098L26131J47650k32426q2968r4856J67426
$$ -497007 -425672 -144601 -329457 -316359 9772 157422 -75004 -157972 -252828 -85402
23170h5402L32397J13272M034q2367j74880j70731P9979K25383K37989o9624k05959
$$ -85402 246995 360267 364301 281934 107054 -63677 16302 241685 479674 410050 204091
23159B04091j88930N8601K29015j69924L3569j19863o1452j7385j46945n2220
$$ 204091 15161 73762 302777 132853 166422 46559 -14893 -32278 -179223 -231443
23149b31443J59591J39189j48893P5369n5011k39945l1797P6047n421J0820r7063
$$ -231443 -71852 67337 -81556 -6187 -61198 -301143 -332940 -256893 -262314 -251494 -348557
23138c48557K20117K24752o4825j20986j22989J09108R1849j54531q0418k3783
$$ -348557 -128440 96312 31487 -89499 -212488 -103380 -11531 -166062 -246480 -270263
23128b70263l6620J04001Q3396j66464K50068M15920L8640l35124J07539M0242
$$ -270263 -306883 -202882 -119486 -285950 -35882 380038 418678 83554 191093 231335
23118B31335j09273j32177j27344j76306Q023p8177N7703j43984n2550J43862
$$ 231335 122062 -10115 -137459 -313765 -305742 -383919 -326216 -470200 -522750 -378888
23108c78888K20860K12822J71991N2890j73614K09601N7763q3357l1908j19880
$$ -378888 -158028 54794 226785 279675 106061 315662 373425 290068 258160 138280
23098A38280j42442J6503m4779L5356M1850k0560q3063k2317J41598o6561K823
$$ 138280 -4162 12341 -32438 2918 44768 24208 -58855 -81172 60426 -6135 -3312
23087c312p7177o2857r388j6712L1995K01684L1715j6980j77776J12013K27761
$$ -3312 -80489 -143346 -152734 -169446 -137451 64233 95948 78968 -98808 13205 240966
23076B40966j24631J56541n0060l77084K3576J15463M0949K60901J2499j95775
$$ 240966 116335 272876 222816 -154268 -130692 -15229 25720 286621 299120 103345
23066A03345K9568J10723j93770l6651J25794J74051r52j92021k02545M4649o1031
$$ 103345 132913 243636 49866 13215 139009 313060 312108 120087 -82458 -37809 -98840
23055i8840L847L9243J04451j20728j32249J45713J6751j8948j74999J14291m3527
$$ -98840 -94993 -55750 48701 -72027 -204276 -58563 -41812 -60760 -235759 -121468 -164995
23044a64995K9396j45198j37173J42072J80595l1892j48786Q5211J40012J3277
$$ -164995 -135599 -280797 -417970 -275898 -95303 -127195 -275981 -190770 -50758 -37481
23034c7481l64142k6893k2971K07242m6169J33836J00440o0744m6212J7460O6862
$$ -37481 -401623 -428516 -451487 -244245 -290414 -156578 -56138 -116882 -163094 -145634 -78772
23023g8772J09602K60902l2746k00860p5803o9434J80922N0344j0831J19541k01237
$$ -78772 30830 291732 258986 58126 -17677 -87111 93811 144155 133324 252865 51628
23012E1628j81680R3184L5384k3749K09511M8724n13559l1848K61991R2206J82090
$$ 51628 -130052 -36868 -1484 -25233 184278 233002 -280557 -312405 -50414 41792 223882
23001B23882K05028K8110O5193q8242j98349k12420j3387J81050K61308O1904
$$ 223882 428910 457020 522213 433971 235622 23202 9815 190865 452173 514077
22991E14077j56562P5473q8906j42460J1479j77765k95002J1154l6337J29015
$$ 514077 357515 432988 344082 201622 213101 35336 -259666 -248512 -284849 -155834
22981a55834K78944n8714J35227k2633j2j63020k23202j52014j23874J82883R7349
$$ -155834 123110 64396 199623 176990 176978 13958 -209244 -361258 -485132 -302249 -204900
22970b04900J08551q6229j98952L40461J25658n8146l3953j31763j5110N5483
$$ -204900 -96349 -182578 -381530 -41069 84589 26443 -7510 -139273 -154383 -98900
22960i8900j62680J99068K25200n541m1594j02379R992j72371K4598J8100J16305
$$ -98900 -261580 -62512 162688 157147 115553 13174 23166 -149205 -124607 -106507 9798
22949I798P7384J8892j58211N4451L0015j43843j47227J48703K1781j9302J58282
$$ 9798 87182 106074 -52137 2314 32329 -111514 -258741 -110038 -88257 -107559 50723
22938E0723m430j20676q1905N8983Q4746J56321J24839k05614k95641R0712N1879
$$ 50723 46293 -74383 -156288 -97305 -12559 143762 268601 62987 -232654 -141942 -90063
22927i0063J22926J94721k01132l11177N0373M586J35087j7963j96999J25398
$$ -90063 32863 227584 26452 -284725 -234352 -229766 -94679 -112642 -309641 -184243
22917a84243Q2624j37390j11095Q0087J08980R2862j65918q9975J38541K12641
$$ -184243 -101619 -239009 -350104 -270017 -161037 -68175 -234093 -324068 -185527 27114
22907B7114R4432l9431j65254l83473j6980J78654k3446k07979K29990L15245
$$ 27114 121546 82115 -83139 -466612 -483592 -304938 -328384 -536363 -306373 8872
22897H872m2912k45448K71637P9217l5152q9747j23947n1377L11803L3745l38607
$$ 8872 -34040 -279488 -7851 71366 36214 -53533 -177480 -228857 82946 116691 -221916
22886b21916o4074N7353K30252O2416K68322o8533q7779j25746l4243K52464R66
$$ -221916 -285990 -228637 1615 64031 332353 263820 176041 50295 16052 268516 269482
22875B69482j37482M0123k3237l9212O6031j57892k68236Q042n7752l6056m5817
$$ 269482 132000 172123 148886 109674 175705 17813 -250423 -242381 -300133 -336189 -382006
22864c82006K45964K9551J20338M1525k3358M4480j65490r4009K22312O7689k38858
$$ -382006 -136042 -106491 13847 55372 32014 76494 -88996 -183005 39307 106996 -131862
22853a31862j25532r5045K31014L02045j24724p3083j53394Q2898k63866J00275
$$ -131862 -257394 -352439 -121425 180620 55896 -17187 -170581 -87683 -351549 -251274
22843b51274K01751O2292m734p1468O615J32762o2664J21225R8342K469k49031
$$ -251274 -49523 12769 8035 -63433 -56818 75944 13280 134505 232847 235316 -13715
22832a3715k27296J5422R3627N6536R4653j3287k27511j37941J8665J05312o2619
$$ -13715 -241011 -225589 -131962 -75426 19227 5940 -221571 -359512 -340847 -235535 -298154
22821b98154J24033k4611P9926O0359k7991j04669j1409R3800K37291O6259p4118
$$ -298154 -174121 -198732 -118806 -58447 -86438 -191107 -202516 -108716 128575 194834 120716
22810A20716N187j40652J05332O3492R729j81914k05391N2757o7474M3703K34274
$$ 120716 125903 -14749 90583 154075 163804 -18110 -223501 -170744 -238218 -194515 39759
22799C9759P1015k46994N0295J13309J54881L0498k16454L0851j02786j47685
$$ 39759 110774 -136220 -85925 27384 182265 212763 -3691 27160 -75626 -223311
22789b23311j07844J06174p2011J1254M2799K82062K97428J78844l3695L9196
$$ -223311 -331155 -224981 -296992 -285738 -242939 39123 336551 515395 481700 520896
22779E20896j31305m08169k19637O0021K34589k25140j00722J78936J31130M25974
$$ 520896 389591 -18578 -238215 -178194 56395 -168745 -269467 -90531 40599 466573
22769D66573j28790j47696k25958k31823q146J37263K62631n2398k77439Q5544
$$ 466573 337783 190087 -35871 -267694 -275840 -138577 124054 71656 -205783 -120239
22759a20239J60131K10286j08787l42776r7595L7944l3925r9997O9771J29925
$$ -120239 39892 250178 141391 -201385 -298980 -261036 -294961 -394958 -325187 -195262
22749a95262P8604J17904J23642j90436o1879R0522j23991J7790j62661j80582
$$ -195262 -116658 1246 124888 -65548 -127427 -36905 -160896 -143106 -305767 -486349
22739d86349J38911R4117q5924N544L4012O6721m1190k24300k34386L28158J18158
$$ -486349 -347438 -253321 -339245 -333701 -299689 -232968 -274158 -498458 -732844 -404686 -286528
22728b86528L6095M7050J03219k30525P6435J22903N6941k55994m7251J80734
$$ -286528 -250433 -203383 -100164 -330689 -254254 -131351 -74410 -330404 -377655 -196921
22718a96921K34954k861m8600M621o8743K74935r220N3959m2948p4419k28501
$$ -196921 38033 35172 -13428 -8807 -77550 197385 188165 242124 199176 124757 -103744
22707a03744k44929j20812N958J74842L58177R3343l47127k25520K35894J61511
$$ -103744 -348673 -469485 -463527 -288685 69492 162835 -184292 -409812 -173918 -12407
22697a2407K25057J1754l5636q3734j50498k02433j96000k6569n7799P3008N9629
$$ -12407 212650 224404 188768 105034 -45464 -247897 -443897 -470466 -528265 -455257 -395628
22686c95628O5306J44135J25162p5828q0237L9889K85184j0829n157p8200k08918
$$ -395628 -330322 -186187 -61025 -136853 -217090 -177201 107983 97154 91997 13797 -195121
22675a95121M4273J25654m3911j47225k14837k0393J5387o589J83763j76054j60018
$$ -195121 -150848 -25194 -69105 -216330 -431167 -451560 -436173 -442762 -258999 -435053 -595071
22664e95071K2224q3339K84758K34895j16235K4474Q4147n7473J23345j56157
$$ -595071 -572847 -656186 -371428 -136533 -252768 -228294 -144147 -201620 -78275 -234432
22654b34432j21594J54445K95211Q2545k23250R6463k1327L9165P4547l17665
$$ -234432 -356026 -201581 93630 176175 -47075 49388 28061 67226 141773 -175892
22644a75892K48392J54328j0997J9520k36599o3763K6124j0763N8050l0166l5313
$$ -175892 72500 226828 215831 235351 -1248 -65011 -38887 -49650 8400 -21766 -57079
22633e7079K26296J71384o0084j26693k70501O8698o6524R0056R532k46981r923
$$ -57079 169217 340601 280517 153824 -116677 -47979 -114503 -24447 -14915 -261896 -271819
22622b71819K3025O4102J42299L1721K5156j03500q3454J86000m8181j19193p5565
$$ -271819 -248794 -184692 -42393 -10672 14484 -89016 -172470 13530 -34651 -153844 -229409
22611b29409J34856j39843j03075l4288p4009K34516K87017P2673J1474l84572
$$ -229409 -94553 -234396 -337471 -371759 -445768 -211252 75765 148438 159912 -224660
22601b24660j96746q8739J07663J70103J21591m9269r9552k7198N1171k7258L7377
$$ -224660 -421406 -510145 -402482 -232379 -110788 -160057 -259609 -286807 -235636 -262894 -225517
22590b25517J49150j36118R034K08833m3560Q3182p7830o2966j50878m7794M9035
$$ -225517 -76367 -212485 -203451 5382 -38178 45004 -32826 -95792 -246670 -294464 -245429
22579b45429n9765J72075J45544o8488J94592n8210J50664L8444m8315K984l2902
$$ -245429 -305194 -133119 12425 -56063 138529 80319 230983 269427 221112 224096 191194
22568A91194o2202p5963k33647R0838j3054J63690J71714j64296j75675p7299
$$ 191194 128992 53029 -180618 -89780 -102834 60856 232570 68274 -107401 -184700
22558a84700k02222k3854Q3904J9176P4823R5468k31346O4898J68832l36468Q3776
$$ -184700 -386922 -410776 -326872 -307696 -232873 -137405 -368751 -303853 -135021 -471489 -387713
22547c87713J97725J7101q060J0835l11120k89889O1173J92041K20214J51147
$$ -387713 -189988 -172887 -180947 -170112 -481232 -771121 -709948 -517907 -297693 -146546
22537a46546n4673J37460j2736q7157K35901o0441m20852p1949K26762O7086J01649
$$ -146546 -201219 -63759 -76495 -163652 72249 11808 -409044 -480993 -254231 -187145 -85496
22526h5496J03918K1283J45472J18984j19429r4436k6900N6200J09185L8971q3652
$$ -85496 18422 39705 185177 304161 184732 90296 63396 119596 228781 267752 184100
22515A84100j97156k48298j64243Q0183J50358J04836L1694q0105j53352j50190
$$ 184100 -13056 -261354 -425597 -345414 -195056 -90220 -58526 -138631 -291983 -442173
22505d42173M0341K53615J44195K18950R1810M6645p9281K7901M851k16922q1609
$$ -442173 -401832 -148217 -4022 214928 306738 353383 274102 302003 306854 89932 8323
22494H323m0655r121n2245k35490n5875Q3647K68447L2143J04669J14790K8952
$$ 8323 -32332 -41453 -93698 -329188 -385063 -301416 -32969 -826 103843 218633 247585
22483B47585j83450j11362J35171p5338p9584J95417J02524n1338K39573n6742
$$ 247585 64135 -47227 87944 12606 -66978 128439 230963 179625 419198 362456
22473C62456k93437J59535k30037M8735K88039O5261M0107k95924j47167J32687
$$ 362456 69019 228554 -1483 47252 335291 400552 440659 144735 -2432 130255
22463A30255J86385j75338R668j84066J02819Q2184L7207M7389j05355N662j02430
$$ 130255 316640 141302 150970 -33096 69723 151907 189114 236503 131148 136810 34380
22452C4380k0629o218m1425k39205m0446o8152l5363J6220K41286L631m6573j91655
$$ 34380 13751 7533 -33892 -273097 -313543 -381695 -417058 -400838 -159552 -155921 -202494 -394149
22440c94149J52706J57057J8654j31974K7468J06605J09815L8830M517j83195
$$ -394149 -241443 -84386 -65732 -197706 -170238 -63633 46182 85012 89529 -93666
22430i3666q6768J69782N3207J90727J70977j78986j91053j78892R9433j505K6509
$$ -93666 -180434 -10652 42555 233282 404259 225273 34220 -144672 -45239 -46744 -20235
22419b0235M1258k06362j62945P119J09706J2608n7894K05645J77977K31369j26235
$$ -20235 21023 -185339 -348284 -341165 -231459 -218851 -276745 -71100 106877 338246 212011
22408B12011k47639j69182o8888j03111J35802K30899J42905J02290P930O0723
$$ 212011 -35628 -204810 -273698 -376809 -241007 -10108 132797 235087 243017 303740
22398C03740R0063j99186j43214M3576J37095o3828k4454K613j96211p7461J51064
$$ 303740 393803 194617 51403 94979 232074 168246 143792 146405 -49806 -127267 23797
22387B3797K57246K7279m01672j94738J7925K76822M8644R1017l9058O6078o5804
$$ 23797 281043 308322 -93350 -288088 -270163 6659 55303 146320 107262 173340 107536
22376A07536q7257J69853M3923k5189r0983j42654j4395k03063q5133k2411L1522
$$ 107536 20279 190132 234055 208866 117883 -24771 -39166 -242229 -327362 -349773 -318251
22365c18251J47622N7554L382K61059K50899k35474r9623k18938O8827j06909
$$ -318251 -170629 -113075 -109693 151366 402265 166791 67168 -151770 -82943 -189852
22355a89852J93393J64563j46720J64003q7516l33794K7018Q1673K47497K57800
$$ -189852 3541 168104 21384 185387 97871 -235923 -208905 -127232 120265 378065
22345C78065j11171j35738j0184l30541j25107J46139J47455q970j14853M7361
$$ 378065 266894 131156 120972 -209569 -334676 -188537 -41082 -50052 -164905 -117544
22335a17544J94163K98081p5109p2129O893l21501k30145M6658K0181j9960O5815
$$ -117544 76619 374700 299591 227462 234355 -87146 -317291 -270633 -250452 -270412 -204597
22324b04597R272j19516l9794j17402O6077K34578P8518j42850J11294K49130
$$ -204597 -195325 -314841 -354635 -472037 -405960 -171382 -92864 -235714 -124420 124710
22314A24710n3555k33228J57422J38884j59469j63387l8249q4238J49911Q2675
$$ 124710 71155 -162073 -4651 134233 -25236 -188623 -226872 -311110 -161199 -78524
22304g8524J32237m5727k98791j05104J2047j91830J41330K28373M0644l8600
$$ -78524 53713 7986 -290805 -395909 -383862 -575692 -434362 -205989 -165345 -203945
22294b03945Q0499L49361J7673k25902q211k8733K88079j0805l47216q5725J5771
$$ -203945 -123446 225915 243588 17686 9475 -19258 268821 258016 -89200 -174925 -159154
22283a59154M9325q4593J9951N8905r0322J4364J09077J6742k2753q2613j26416
$$ -159154 -109829 -194422 -174471 -115566 -205888 -191524 -82447 -65705 -88458 -171071 -297487
22272b97487n0904K36741K84591j1711j78103q248K44652n7491k15345q8935K02649
$$ -297487 -348391 -111650 172941 161230 -16873 -25121 219531 162040 -53305 -142240 60409
22261F0409q7556j37369K01110L48954o4919k67234q8692J55940o1816r3948j54952
$$ 60409 -27147 -164516 36594 385548 320629 53395 -35297 120643 58827 -35121 -190073
22250a90073j27240J52880o386J07076K19997P830j70637n3211r6173j34116K79649
$$ -190073 -317313 -164433 -170819 -63743 156254 164084 -6553 -59764 -155937 -290053 -10404
22239a0404K59913P5765M6244l86783l49106j42125Q3315K72290o7060N3706J97187
$$ -10404 249509 325274 371518 -15265 -364371 -506496 -423181 -150891 -217951 -164245 32942
22228C2942o6566j75534M6015R2852j24297l5371J94970J65801j44658L5999o0156
$$ 32942 -33624 -209158 -163143 -70291 -194588 -229959 -34989 130812 -13846 22153 -38003
22217c8003k55496N8982K41871K03194J95467k97341o4534J12217M3326O159J89963
$$ -38003 -293499 -234517 7354 210548 406015 108674 44140 156357 199683 205842 395805
22206C95805K39561m7140K1108j52130k99205j36746j7198m2469l88713q220K10301
$$ 395805 635366 588226 609334 457204 157999 21253 4055 -38414 -427127 -435347 -225046
22195b25046J02098n2751p1208L0433k5945l2009O7601J84854Q2358j15065n7083
$$ -225046 -122948 -175699 -246907 -216474 -242419 -274428 -206827 -21973 60385 -54680 -111763
22184a11763N1011M0289j47133j0052N2822j52345k29401L39861J77742L3085
$$ -111763 -60752 -20463 -167596 -177648 -124826 -277171 -506572 -166711 11031 44116
22174D4116K05373J06399l22023l3290l7876K1914j64948k1858J01084J20637
$$ 44116 249489 355888 33865 575 -37301 -15387 -180335 -202193 -101109 19528
22164A9528J5508j46145j50502O621K62910K25061j15319j13833j5187K1308l2452
$$ 19528 35036 -111109 -261611 -254990 7920 232981 117662 3829 -11358 9950 -22502
22153b2502K912P9273M1593J53460k53823k29980N2308J80492K00101L2603k27916
$$ -22502 -19590 59683 101276 254736 913 -229067 -176759 3733 203834 236437 8521
22142H521q3335R346j75066j01376K702j80889j24810J86066R6878R7443J07411
$$ 8521 -74814 -65468 -240534 -341910 -339208 -520097 -644907 -458841 -361963 -264520 -157109
22131a57109p2087j81668j51670K40802M6050L08455J61179j59973j89914J15992
$$ -157109 -229196 -410864 -562534 -321732 -275682 32773 193952 33979 -155935 -39943
22121c9943j46518k40951L2172J11773N8763Q3417K85584o184J71923o7694j42031
$$ -39943 -186461 -427412 -395240 -283467 -224704 -141287 144297 138113 310036 242342 100311
22110A00311O1823j69361j25696K4165J11495J04693k23778n5508k658K19388
$$ 100311 162134 -7227 -132923 -108758 2737 107430 -116348 -171856 -174514 44874
22100D4874l6335J8133N2386J70614n9415j78264Q6513j12128j76070J90117j23757
$$ 44874 8539 26672 79058 249672 190257 11993 98506 -13622 -189692 425 -123332
22089a23332O0015J03895O1562o4280K04185j10297j27584j17480J71J86285J90
$$ -123332 -63317 40578 102140 37860 242045 131748 4164 -113316 -113145 73140 73330
22078G3330k48767j8947J55633m9349k07513J9057J52075L0730k620l4844L795
$$ 73330 -175437 -194384 -38751 -88100 -295613 -276556 -124481 -93751 -96371 -131215 -127420
22067a27420k704L4305j16735j56135j67591J22568J09950K68561K87991l3432
$$ -127420 -130124 -95819 -212554 -368689 -536280 -413712 -303762 -35201 252790 219358
22057B19358k38312k33895K04849K38441J7046N6244o6224l49993m7997n2945
$$ 219358 -18954 -252849 -48000 190441 207487 263731 197507 -152486 -200483 -253428
22047b53428P9451J79304k60828O5082R7952L40162L00577L4686r4503k8356o060
$$ -253428 -173977 5327 -255501 -190419 -92467 247695 548272 582958 488455 460099 454039
22036D54039R0865K15996o1038j17332m02300j79065p6820M0656N4319J15757
$$ 454039 544904 760900 699862 582530 180230 1165 -75655 -34999 19320 135077
22026A35077K54878p1789k65257k8341n6387J07993R2121k69410j64576K36782
$$ 135077 389955 318166 52909 24568 -31819 76174 168295 -101115 -265691 -28909
22016b8909K11023l5863J27257L617k0356r910k18623j12261K11499k13479M3176
$$ -28909 182114 146251 273508 277125 256769 246859 28236 -84025 127474 -86005 -42829
22005d2829j70649k34906J14900L27768N7182k21009Q5337O9547K20385m0248
$$ -42829 -213478 -448384 -333484 -5716 51466 -169543 -84206 -14659 205726 165478
21995A65478j66169m7959k4470j52248j56709J57356J70510Q3325o8189r5993
$$ 165478 -691 -48650 -73120 -225368 -382077 -224721 -54211 29114 -39075 -135068
21985a35068J81003M8102M1913o8831j39519j18488J52250k8691L8683n2473j0490
$$ -135068 45935 94037 135950 67119 -72400 -190888 -38638 -67329 -28646 -81119 -91609
21974i1609R9715o6607j1045j01621l2562R7791j0255Q3895J09606J47279R1531
$$ -91609 8106 -58501 -69546 -171167 -203729 -105938 -116193 -32298 77308 224587 316118
21963C16118k13318m7337l5461p5687o4689j6275J04340j1184j53009O2385P0358
$$ 316118 102800 55463 20002 -55685 -120374 -136649 -32309 -43493 -196502 -134117 -63759
21952f3759l2712J10541Q6690J1923P9730J35411l5286J87036M2448j62419r186
$$ -63759 -96471 14070 100760 112683 192413 327824 292538 479574 522022 359603 350417
21941C50417o4491j2870l76947P7852J85878K02483M8315j37653j04992l80190
$$ 350417 285926 273056 -103891 -26039 159839 362322 410637 272984 167992 -212198
21931b12198n3392J28259j19067K00957K61981j19094k53811K9989J41532K62379
$$ -212198 -265590 -137331 -256398 -55441 206540 87446 -166365 -136376 5156 267535
21921B67535M207j94636N0715k05134j88505J16820l1009j85174j15010J63443
$$ 267535 271742 77106 127821 -77313 -265818 -148998 -180007 -365181 -480191 -316748
21911c16748M94361J54258r8267j87954k01144J6681K18186J4808k73515l1019
$$ -316748 177613 331871 233604 45650 -155494 -138813 79373 94181 -179334 -210353
21901b10353J98986k25468j78929J25300K21820O6747q741J17802P8974P8763
$$ -210353 -11367 -236835 -415764 -290464 -68644 -1897 -10638 107164 186138 264901
21891B64901k72238j65331j11676j10997J06200J19334L0538j39023J49503j2424
$$ 264901 -7337 -172668 -284344 -395341 -289141 -169807 -139269 -278292 -128789 -141213
21881a41213o9935J33597J85596k05915l11893Q2636K59936L6430O4664J19232
$$ -141213 -211148 -77551 108045 -97870 -409763 -327127 -67191 -30761 33903 153135
21871A53135J82020j38449j86823n9682J0802L5542J85331O6944R818l16157Q7626
$$ 153135 335155 196706 9883 -49799 -38997 -3455 181876 248820 258638 -57519 30107
21860C0107J69389J94361K3011j61062m45079k29117J14655J70450N5428L62308
$$ 30107 199496 393857 416868 255806 -189273 -418390 -303735 -133285 -77857 284451
21850B84451j1793j20361j39955j70139r2839K10141J03457J98027R1036j43969
$$ 284451 272658 152297 12342 -157797 -250636 -40495 62962 260989 352025 208056
21840B08056J86545k0827l48277n4593N718j10532j71774J0629m7114J7254L00483
$$ 208056 394601 373774 25497 -29096 -23378 -133910 -305684 -295055 -342169 -324915 -24432
21829b4432J44777N1582j30965P1928M6520L1756j66425j3682J93581J20684l04025
$$ -24432 120345 171927 40962 112890 159410 191166 24741 11059 204640 325324 21299
21818B1299j85495K75471K34063j10972k12673j96327l5829l6631J91825K51811
$$ 21299 -164196 111275 345338 234366 21693 -174634 -210463 -247094 -55269 196542
21808A96542J25410j16532k59536j76600J24692o6987k67015L21443K30433k2311
$$ 196542 321952 205420 -54116 -230716 -106024 -173011 -440026 -118583 111850 89539
21798H9539j75513k77135O9208K06973J41704J87297P8235j32674l9367k50388
$$ 89539 -85974 -363109 -293901 -86928 54776 242073 320308 187634 148267 -102121
21788a02121q221k1746K49074J86514J04828K1326k634j51375J36443K0392j48342
$$ -102121 -110342 -132088 116986 303500 408328 429654 427020 275645 412088 432480 284138
21777B84138k20272J78445J3556j52504k1433L1133m6981j13227N2949o0887N4198
$$ 284138 63866 242311 255867 103363 81930 113063 66082 -47145 5804 -55083 -885
21766h85M3839j78025j27139k1893k3388J49691J02041n8109j94308Q7047l3597
$$ -885 42954 -135071 -262210 -284103 -307491 -157800 -55759 -113868 -308176 -221129 -254726
21755b54726q8256J31448J23558K56680J33579k75958n999K4326N2396J08639
$$ -254726 -342982 -211534 -87976 168704 302283 26325 20326 44652 97048 205687
21745B05687m0219j37069r9032J15543M3135L916L330J39822j51931M5726O5791
$$ 205687 165468 28399 -70633 44910 88045 91961 95291 235113 83182 128908 194699
21734A94699J05441k23979J26158K11307j1395o8040J28573K2283j54019q5170
$$ 194699 300140 76161 202319 413626 402231 334191 462764 485047 331028 245858
21724B45858k27601k25569k0119J38578j04211L884K13506r0017k8605J02232
$$ 245858 18257 -207312 -227431 -88853 -193064 -189180 24326 -65691 -94296 7936
21714G936R8593N5112k01604O1208j39016M7009k3512n7503M9673m6431j55680
$$ 7936 106529 161641 -39963 21245 -117771 -70762 -94274 -151777 -102104 -148535 -304215
21703c04215K2196n7208J06242K08321p5288L195l8601L40188J87748q0243k86063
$$ -304215 -282019 -339227 -232985 -24664 -99952 -96757 -135358 204830 392578 312335 26272
21692B6272j20938L4960J79603J7396j54208o7925J15299r5786L7134n8820k59653
$$ 26272 -94666 -59706 119897 137293 -16915 -84840 30459 -65327 -28193 -87013 -346666
21681c46666k4665J60541M7679J22883L17028l4476J42084j16561l08566o3072
$$ -346666 -371331 -210790 -163111 -40228 276800 242324 384408 267847 -40719 -103791
21671a03791J26152J30450r9969J74576j25175l34114j05217K1025n7263K31929
$$ -103791 22361 152811 52842 227418 102243 -231871 -337088 -316063 -373326 -141397
21661a41397Q9727K7022k1121M5282j00017p7283K06215J47166r6802l1992p2896
$$ -141397 -51670 -24648 -45769 -487 -100504 -177787 28428 175594 78792 46800 -26096
21650b6096l6199j57885q3242J50538Q8098K00498j44187J02111k5157J8056n6740
$$ -26096 -62295 -220180 -303422 -152884 -64786 135712 -8475 93636 68479 86535 29795
21639B9795q8135K76550k2999q4423l7669k28573M4522K46999p477k04090j407
$$ 29795 -58340 218210 195211 110788 73119 -155454 -110932 136067 128590 -75500 -76907
21628g6907o3047O43N069n3823j02335N3794J77369n4230k00638j22515j818k6414
$$ -76907 -139954 -139311 -134242 -188065 -290400 -236606 -59237 -113467 -314105 -436620 -438438 -464852
21616d64852n5772J52360K11452J91863L3132J33588J232j51266J15287J56212
$$ -464852 -520624 -368264 -156812 35051 68183 201771 203003 51737 167024 323236
21606C23236N9633p1477j11034n1867k652J83797k2313N5238k79469j93301n5136
$$ 323236 382869 311392 200358 148491 145839 329636 307323 362561 83092 -110209 -165345
21595a65345J32351k3838R6035R0758l0805K8764j17915J60934M3610j17227k88901
$$ -165345 -32994 -56832 39203 129961 99156 127920 10005 170939 214549 97322 -191579
21584a91579J31127j56252P4125K5592r3265J9698O2320J60647J2722K7906k13505
$$ -191579 -60452 -216704 -142579 -116987 -210252 -190554 -128234 32413 45135 73041 -140464
21573a40464k21431J92777L83493J18511L4953J4769m54K7060r8686j11118N7501
$$ -140464 -361895 -169118 214375 332886 367839 382608 382154 409214 310528 199410 256911
21562B56911j32254K2924M9966k7194r6368j43621j1635J70963J21007J768p8974
$$ 256911 124657 147581 197547 170353 73985 -69636 -81271 89692 210699 212467 133493
21551A33493m4747j42139j87384K25522L45305L351p8547k14700J19131k2839
$$ 133493 88746 -53393 -240777 -15255 330050 333401 254854 40154 159285 136446
21541A36446j293J99702M3249k90761R3040j93545n0253J10384J01280j72908
$$ 136446 135153 334855 378104 87343 180383 -13162 -63415 46969 148249 -24659
21531b4659j62725J24071L94813Q9410j87716k29753j00730O499J57246L00823
$$ -24659 -187384 -63313 331500 420910 233194 3441 -97289 -90790 66456 367279
21521C67279R7226p8274j41761k6175Q5593M2585N3736K33312k3385j95112l32119
$$ 367279 464505 386231 244470 218295 303888 346473 400209 633521 610136 415024 82905
21510H2905j7658J35897p8493l04555m0107K71789n8347j67975P4628N3185J76765
$$ 82905 65247 201144 122651 -181904 -222011 49778 -8569 -176544 -101916 -48731 128034
21499A28034j90439k97108o649J50493K30801R8218K2931J00670o5523k32361
$$ 128034 -62405 -359513 -366162 -215669 15132 113350 136281 236951 171428 -60933
21489f0933r69J52713J85355O784J58734P1474l42952j44385J28858k3668J0792
$$ -60933 -61902 90811 276166 282950 441684 513158 170206 25821 154679 131011 141803
21478A41803r9482J9642O7978M8023p3994j67179o568K4721N3984J7602L3675
$$ 141803 42321 61963 129941 177964 103970 -63209 -69777 -45056 8928 26530 60205
21467F0205J00794L1252O5314J33127l68529k31422K11099J28505J39315n6106
$$ 60205 160999 192251 257565 390692 22163 -209259 1840 130345 269660 213554
21457B13554J69796R1019r9323K4962l45778m34052j36666K23958L08838o360
$$ 213554 383350 474369 375046 400008 54230 -379822 -516488 -292530 16308 9948
21447I948R7592N1659N4167n66k1418p8633j66189k5087k20814N428M9410R8014
$$ 9948 107540 159199 213366 212800 191382 112749 -53440 -78527 -299341 -293913 -244503 -146489
21435a46489M0861K57504J17211k82416p7772j8785L9793J0672k23200k0629J28043
$$ -146489 -105628 151876 269087 -13329 -91101 -109886 -70093 -59421 -282621 -303250 -175207
21424a75207n4199R7789J569L1032N2472O5919n272J8178J48818K7429n2153M0751
$$ -175207 -229406 -131617 -130048 -99016 -46544 19375 14103 32281 181099 208528 156375 197126
21412A97126O3927l561j64350P0691Q5608P9648P5790j94403J51171M655l18982
$$ 197126 261053 257492 93142 163833 249441 329089 404879 210476 361647 366302 47320
21401D7320k26526j50068J41279K53060J89738J3633J47694N2065j07740j44521
$$ 47320 -179206 -329274 -187995 65065 254803 268436 416130 468195 360455 215934
21391B15934J2185Q1650q7171l02383l44595m3049J36926J26093R9834L77534
$$ 215934 228119 309769 222598 -79785 -424380 -467429 -330503 -204410 -104576 272958
21381B72958l0915l06049j02791K36242P4949j13591j87666J9152R6238J9302
$$ 272958 242043 -64006 -166797 69445 144394 30803 -156863 -137711 -41473 -22171
21371b2171o1551J80929J3985l6625J51427j2574o7273J05183R3589K7916p0976
$$ -22171 -83722 97207 111192 74567 225994 213420 146147 251330 344919 372835 301859
21360C01859l16055j89423l2893N2075Q1727n2012K56261L00146m1225j96096
$$ 301859 -14196 -203619 -236512 -184437 -102710 -154722 101539 401685 360460 164364
21350A64364j2183J20312k05895k50336J31746J05758j48116k27951K1112L20187
$$ 164364 152181 272493 66598 -183738 -51992 53766 -94350 -322301 -301189 18998
21340A8998J32006O2669k0918J8069J49032L71407j16903k45278j58213r9229
$$ 18998 151004 213673 192755 210824 359856 731263 614360 369082 210869 111640
21330A11640j10506L4026j10328J2029K5217N6019J6415O0281K30833k14819j81032
$$ 111640 1134 35160 -75168 -63139 -37922 18097 34512 94793 325626 110807 -70225
21319g0225J75159L17231M1963j74862j06968J30599K4671l11253j97246J64505
$$ -70225 104934 422165 464128 289266 182298 312897 337568 26315 -170931 -6426
21309f426J15826O1435q0223O3920j9606l0089m6712k44073p7177n4194O1644
$$ -6426 109400 170835 90612 154532 134926 104837 58125 -185948 -263125 -317319 -255675
21298b55675J56775J39164j79547k47614K45845O3086j4934L2253j5127K55156
$$ -255675 -98900 40264 -139283 -386897 -141052 -77966 -92900 -60647 -75774 179382
21288A79382K21041j48333j32176K30629J35539n275k03759j24127Q1180M0937
$$ 179382 400423 252090 119914 350543 486082 480807 277048 152921 234101 275038
21278B75038j09901j67614Q1701J41897J77773O0390M5017k29152k53936l6997
$$ 275038 165137 -2477 79224 221121 398894 459284 504301 275149 21213 -15784
21268a5784R8376q2731N3238J86337N8847j80423J9044J23537j87942l85367R9717
$$ -15784 82592 -139 53099 239436 298283 117860 136904 260441 72499 -312868 -213151
21257b13151J81551J84979O5450m5812q8394r4949r0500K95260O9179p1850k88321
$$ -213151 -31600 153379 218829 173017 84623 -10326 -100826 194434 263613 191763 -96558
21246i6558j26727J02379K4154j26805R0024K79932L1664k22708J7183K44594
$$ -96558 -223285 -120906 -96752 -223557 -133533 146399 178063 -44645 -27462 217132
21236B17132J3902O4494j01983p9292j06372Q0542l971q4901q4941j1966J28840
$$ 217132 231034 295528 193545 114253 7881 88423 84452 -449 -85390 -97356 31484
21225C1484q3900o8471j89101J82024l0072l3454j0873K46488M46581Q0330p6082
$$ 31484 -52416 -120887 -309988 -127964 -158036 -191490 -202363 44125 490706 571036 494954
21214D94954k62646j82824O2606n780j39903K0248r2498K02621L3635k61483J10658
$$ 494954 232308 49484 112090 106310 -33593 -13345 -105843 96778 130413 -131070 -20412
21203b0412J95447N8164P0748M6388n3587l242m7594j00949J15906J32903J06401
$$ -20412 175035 233199 303947 350335 296748 293506 245912 144963 260869 393772 500173
21192E00173l77400k57317R3307l7176P1966O6916J69661K95732q0095j17166
$$ 500173 122773 -134544 -41237 -78413 -6447 60469 230130 525862 445767 328601
21182C28601O9491q3563K1306O9731j42633k4177j12040Q8881J68599r6917J29085
$$ 328601 398092 314529 335835 405566 262933 238756 126716 215597 384196 287279 416364
21171D16364k06903J77610p6756k58775j69193m1672K87709J86334M791K8123
$$ 416364 209461 387071 310315 51540 -117653 -159325 128384 314718 319509 347632
21161C47632j0024j51882j3022r3757j48227k0318J34727j0423J12290J43504
$$ 347632 337608 185726 172704 78947 -69280 -89598 45129 34706 146996 290500
21151B90500o5921K4878M1105J23017j52341k66791Q4372P1026L58519J14637
$$ 290500 224579 249457 290562 413579 261238 -5553 78819 149845 508364 623001
21141F23001k09828n0346M4041j33119J6052P5087K4606j82876k49853j06515
$$ 623001 413173 362827 406868 273749 289801 364888 389494 206618 -43235 -149750
21131a49750J06444j41496l3842K25255J74623M0416R6223j71594j33187q2813
$$ -149750 -43306 -184802 -218644 6611 181234 221650 317873 146279 13092 -69721
21121f9721o6044L57914J51096j03973k56492J8357J33395j23421k40590R9713
$$ -69721 -135765 222149 373245 269272 12780 31137 164532 41111 -199479 -99766
21111i9766J12134O1985j68417K1900J82293J66576k1169j28688Q4642j04678
$$ -99766 12368 74353 -94064 -72164 110129 276705 255536 126848 211490 106812
21101A06812J0967k0100R2923l6799j96439j04441R511k7018R7030m5211n8615
$$ 106812 117779 97679 190602 153803 -42636 -147077 -137566 -164584 -67554 -112765 -171380
21090a71380m6591j44762o683j30970J28087J21415K7660J08183J58058J41648
$$ -171380 -217971 -362733 -369416 -500386 -372299 -250884 -223224 -115041 43017 184665
21080A84665J02987o7995q9523k24591J01000J70244L3511j98646l5757J09814
$$ 184665 287652 219657 130134 -94457 6543 176787 210298 11652 -24105 85709
21070H5709J07427o1898k1175j2448L04511J09442j30650n1711p3954q6157j92774
$$ 85709 193136 131238 110063 97615 402126 511568 380918 329207 255253 169096 -23678
21059b3678J77116j20227k40679J44776J29702R7100J74494Q707J20939J2410
$$ -23678 153438 33211 -207468 -62692 67010 164110 338604 347311 468250 480660
21049D80660r4786p8906N3546j13827o9603L2868j33810M3313J63483m8137J47085
$$ 480660 385874 306968 360514 246687 177084 209952 76142 119455 282938 234801 381886
21038C81886o4583q66l25067j88554j16892O7277K19922M3053J52269n1225n8193
$$ 381886 317303 316437 -8630 -197184 -314076 -246799 -26877 16176 168445 117220 59027
21027E9027J58685J14506P1564j14334n9K07091K25054k7183j35935J9233n2503
$$ 59027 217712 332218 403782 289448 289389 496480 721534 694351 558416 577649 525146
21016E25146k2837N4984j8547k06538n5394j92564N6820k2752K43921L3379R1024
$$ 525146 502309 557293 538746 332208 276814 84250 141070 118318 362239 395618 486642
21005D86642j12144k5155N3226k93025k21747L33691J88474K128p5012l0033M0025
$$ 486642 374498 349343 402569 109544 -112203 221488 409962 412090 337078 307045 347070
20994C47070R2268k02999j42799k518K3302j2956M4550p6074K77805r5606J4795
$$ 347070 439338 236339 93540 91022 114324 101368 145918 69844 347649 252043 266838
20983B66838K3391N0478j66044J28200J37912k14291k29717j21038k3336l7552
$$ 266838 290229 340707 174663 302863 440775 226484 -3233 -124271 -147607 -185159
20973a85159K06041j14328M842j9634m531J08003K45036l1702j11179J73649N8787
$$ -185159 20882 -93446 -88604 -108238 -112769 -4766 240270 208568 97389 271038 329825
20962C29825k35791L3187o8776r6089K40524J53764j44857j62171j56704r9482
$$ 329825 94034 127221 58445 -37644 202880 356644 211787 49616 -107088 -206570
20952b06570l3068N957J60769P5206K5219L5181J71976K73570R238j33853j64488
$$ -206570 -239638 -233681 -72912 2294 27513 62694 234670 508240 517478 383625 219137
20941B19137j01595J94208r4738j34817K01670R7007J6575j07651O6706j18265
$$ 219137 117542 311750 217012 82195 283865 380872 397447 289796 356502 238237
20931B38237l21942k4831M9110K03130P2110K46631J23164k02298k35562J28297
$$ 238237 -83705 -108536 -59426 143704 215814 462445 585609 383311 147749 276046
20921B76046J97002k9847l60717n3199J61325K00315J59524k9558J23528j60535
$$ 276046 473048 443201 82484 29285 190610 390925 550449 520891 644419 483884
20911D83884j10583K12741O0703j07767J06248R8602j70829j00908j87069r8097
$$ 483884 373301 586042 646745 538978 645226 743828 572999 472091 285022 186925
20901A86925k04902o0499L4927O3327K58346J20343M8774K9962J41997j51157
$$ 186925 -17977 -78476 -43549 19778 278124 398467 447241 477203 619200 468043
20891D68043J03149J53170m1773k84263n2246k95624j939P8112q9554J44980N7794
$$ 468043 571192 724362 682589 398326 346080 50456 48517 126629 37075 182055 239849
20880B39849n2627n7552M6549j38778l175L7483l03227J03199K08167N8846N1693
$$ 239849 187222 129670 176219 37441 34266 71749 -231478 -128279 79888 138734 190427
20869A90427j6603m3760j63206R427J88491L50096O5971R0517q0567k72446l37993
$$ 190427 173824 130064 -33142 -23715 164776 514872 580843 671360 590793 318347 -19646
20858a9646k01800k3357N7866M4420n1777m1362K39304L28540K0934l37311L6235
$$ -19646 -221446 -244803 -186937 -142517 -194294 -235656 3648 332188 353122 15811 52046
20847E2046J58877l0308J62222R9453K42668l8985k69108k65602J08873J78379
$$ 52046 210923 180615 342837 442290 684958 645973 376865 111263 220136 398515
20837C98515o8792j16252p4034J02458N3729j54152j95893K32283J28067o5404
$$ 398515 329723 213471 139437 241895 295624 141472 -54421 177862 305929 240525
20827B40525p8907R8119M3964k24809K33062P4608j9856p1797K1472j31910Q999
$$ 240525 161618 259737 303701 78892 311954 386562 366706 294909 316381 184471 193470
20816A93470K17705M6033j40672p466R2123K53167N135J01351M359j4540j62766
$$ 193470 411175 457208 316536 309070 401193 654360 659495 760846 765205 750665 587899
20805E87899o9685j78917j63359n9019K06498J85994N7468J16592P1987J68635
$$ 587899 518214 339297 175938 116919 323417 509411 566879 683471 755458 924093
20795I24093p0035l27706j34428J00782j61697m3148j81799J23106J01531J39632
$$ 924093 854058 526352 391924 492706 331009 287861 106062 229168 330699 470331
20785D70331Q6342j76054j79001O9549j22180P4641N353o9105m5348j14667j14141
$$ 470331 556673 380619 201618 271167 148987 223628 228981 159876 114528 -139 -114280
20774a14280p5952m9080J61564L48848L8030k74935l42623R3667L47178L18539
$$ -114280 -190232 -239312 -77748 271100 309130 34195 -308428 -214761 132417 450956
20764D50956l5304j11261m4667q5427n3934M9941P328j53200Q7044K76491k45432
$$ 450956 415652 304391 259724 174297 120363 170304 177632 24432 111476 387967 142535
20753A42535j05758P8693M4553J15921P2016J27114Q2849n3355j90585l9770N7196
$$ 142535 36777 115470 160023 275944 347960 475074 557923 504568 313983 274213 331409
20742C31409j03866J0835R7567O9427Q2923j17849k10460j51702J99988J46443
$$ 331409 227543 238378 335945 405372 488295 370446 159986 8284 208272 354715
20732C54715j58001p4339K23543M8655m9438M0671j51141l7357j19608o5226o5732
$$ 354715 196714 122375 345918 394573 345135 385806 234665 197308 77700 12474 -53258
20721e3258L4367p5731J04936J78843j31395j81169m4669K03580J22485P8637
$$ -53258 -18891 -94622 10314 189157 57762 -123407 -168076 35504 157989 236626
20711B36626O4908Q3308j13437l920K22377p9017k97613O130J16254L71225K10442
$$ 236626 301534 384842 271405 267485 489862 410845 113232 119362 235616 606841 817283
20700H17283l24713J6783Q9357J28574j37577j15198k49209l00305L45898K50745
$$ 817283 492570 509353 598710 727284 589707 474509 225300 -75005 270893 521638
20690E21638L6086j05720j78045r0719j33349p4895J59874J62240m3722J07660
$$ 521638 557724 452004 273959 183240 49891 -25004 134870 297110 253388 361048
20680C61048N2196J04130p4779N2820K34158m3839k30550J34060r0839l94477
$$ 361048 413244 517374 442595 495415 729573 685734 455184 589244 498405 103928
20670A03928N8369K92098o3636J124J2320j18035k59666k27642j647K47422J84988
$$ 103928 162297 454395 390759 391883 404203 286168 26502 -201140 -202787 44635 229623
20659B29623r7168K762j4152k2879K55854J72097J28651O1226j3969R028l19962
$$ 229623 132455 135217 121065 98186 354040 526137 654788 716014 702045 711073 391111
20648C91111j26123J80992R2538m0538M8339K06340K4141K15582R8781j47817
$$ 391111 264988 445980 538518 497980 546319 752659 776800 992382 1091163 943346
20638I43346k06568R0947k6548J39422l36422n9016Q7862o7045j9127K75926k04557
$$ 943346 736778 827725 801177 940599 604177 545161 633023 565978 546851 822777 618220
20627F18220l02566n8740m7251K55351J33855p6949J62342k07819j28737K7045
$$ 618220 315654 256914 209663 465014 598869 521920 684262 476443 347706 374751
20617C74751K06717R6276K9043J38992o4502j64777m1737p454j74455j01343J56728
$$ 374751 581468 677744 706787 845779 781277 616500 574763 567309 392854 291511 448239
20606D48239l4843M2199K47738K01811O7249k25289k44504m5293K60381l357M3093
$$ 448239 413396 455595 703333 905144 972393 747104 502600 457307 717688 714331 757424
20595G57424j7513L8133j34660k48081K28570K62134k9333j21106j22477k0164
$$ 757424 739911 778044 643384 395303 623873 886007 856674 735568 613091 592927
20585E92927j30733O9059L7213Q7024N2919M0888N3347k9052k93658J01983K67681
$$ 592927 462194 531253 568466 655490 708409 749297 802644 773592 479934 581917 849598
20574H49598j11633j38551j81388J7611J98239O4943j9461p5180O3818K41244
$$ 849598 737965 599414 418026 435637 633876 698819 679358 604178 667996 909240
20564I09240N2268j53149N3350O4158m015l01887k78229j69230P6852L81141J92874
$$ 909240 961508 808359 861709 925867 921852 619965 341736 172506 249358 630499 823373
20553H23373m5672j1592J27221J17961n19J7205o3142j51989l15261J31671J21087
$$ 823373 777701 766109 893330 1011291 1010772 1027977 964835 812846 497585 629256 750343
20542G50343j00790o185J55266j66784j77512J42633J36863K19606r3270l8043
$$ 750343 649553 643368 798634 631850 454338 596971 733834 953440 860170 822127
20532H22127J02926r2604p0680j49047j30529j3694n1540J29234o1551n8644R1349
$$ 822127 925053 832449 761769 612722 482193 468499 416959 546193 484642 425998 517347
20521E17347o5318Q1182J04474o7067m5067p6380J71926J60593P973j48309l2616
$$ 517347 452029 533211 637685 570618 525551 449171 621097 781690 789663 641354 608738
20510F08738J32280L53974j46393J86606O6093j12728k39726o1818k8770K8331
$$ 608738 741018 1094992 948599 1135205 1201298 1088570 848844 787026 758256 786587
20500G86587o2127k31359R5676J50002o153p8943J6480p6086j42271J09455p8467
$$ 786587 724460 493101 588777 738779 732626 653683 670163 594077 451806 561261 482794
20489D82794q7902Q9352Q9877L36736J82590p5410j2839J56677K37492n1702k36564
$$ 482794 394892 484244 574121 910857 1093447 1018037 1005198 1161875 1399367 1347665 1111101
20478A111101k44174j70796L6940K27507j3257K08219J84310l27850j56007O7505
$$ 1111101 866927 696131 733071 960578 947321 1155540 1339850 1012000 855993 923498
20468I23498O5634q1297p7654P7213M0061q7005p0176o9025p977J89287J60143
$$ 923498 989132 907835 830181 907394 947455 860450 790274 721249 713272 902559 1062702
20457A062702L31811m1366j58982j00948k74673j25962l1519j5340l3114m9843
$$ 1062702 1394513 1353147 1194165 1093217 818544 692582 661063 645723 612609 562766
20447E62766K22709J74967M2302p1125k72267N2557J88498L94394j03362j40491
$$ 562766 785475 960442 1002744 931619 659352 711909 900407 1294801 1191439 1050948
20437A050948j69815k38763q7961K08491K11496O4952j40529r6005K8568P3609
$$ 1050948 881133 642370 554409 762900 974396 1039348 898819 802814 831382 904991
20427I04991o5451p4278J54100J19028j03016p2681k43541q2403K60335J76982
$$ 904991 839540 765262 919362 1038390 935374 862693 619152 536749 797084 974066
20417I74066j31989o8768O3687l4707P8047j2383K14261J29959k02690l13223
$$ 974066 842077 773309 836996 802289 880336 867953 1082214 1212173 1009483 696260
20407F96260j44656K51993J0885J14781N59K24391K21956j57093j80362j3374
$$ 696260 551604 803597 814482 929263 929822 1154213 1376169 1219076 1038714 1025340
20397A025340j38980j11752K12109K33308O0646l5416k03908j5636N5961J272
$$ 1025340 886360 774608 986717 1220025 1280671 1245255 1041347 1025711 1081672 1082944
20387A082944K10973O6382J21486J27273l88873k54366q8109o5151M06631K91578
$$ 1082944 1293917 1360299 1481785 1609058 1220185 965819 877710 812559 1219190 1510768
20377A510768M0163Q7988k02407j98024J24113n7156k70536j25873l0328n8829
$$ 1510768 1550931 1638919 1436512 1238488 1362601 1305445 1034909 909036 878708 819879
20367H19879n7944M7174J54519J21460R6548K01511J83517j65343p2902j03485
$$ 819879 761935 809109 963628 1085088 1181636 1383147 1566664 1401321 1328419 1224934
20357A224934o3165j28466K59087K74684l184J35353j36417k40938k51854l9963
$$ 1224934 1161769 1033303 1292390 1567074 1563890 1699243 1562826 1321888 1070034 1030071
20347A030071K42065o4531J6377J44124K639j36161J88539K06574j46486j38734
$$ 1030071 1272136 1207605 1223982 1368106 1370745 1234584 1423123 1629697 1483211 1344477
20337A344477k16426J09140k1307M0244M7124j60345p2295L53972J67377k8733
$$ 1344477 1128051 1237191 1215884 1256128 1303252 1142907 1070612 1424584 1591961 1563228
20327A563228j8605j10563q1985J99295K01597R5940k90714j83106M3582O3888
$$ 1563228 1544623 1434060 1352075 1551370 1752967 1848907 1558193 1375087 1418669 1482557
20317A482557K7612L19436J92283j18649j37730j34677J9834P6683J50276p5570
$$ 1482557 1510169 1829605 2021888 1903239 1765509 1630832 1650666 1727349 1877625 1802055
20307A802055p7810Q8145j11209k94679j4390J16997P7908r3421o2219R3153l4760
$$ 1802055 1724245 1812390 1701181 1406502 1392112 1509109 1587017 1493596 1431377 1524530 1489770
20296A489770n650J45339N6679n919j7634j07512J48922J90499K56936O1426j74706
$$ 1489770 1484120 1629459 1686138 1680219 1662585 1555073 1703995 1894494 2151430 2212856 2038150
20285B038150o3651j62065N1488k2611j08458k64103k77113j99391K49324K59569
$$ 2038150 1974499 1812434 1863922 1841311 1732853 1468750 1191637 992246 1241570 1501139
20275A501139J61693J32776K70660J91121j85354R3536j3544j43230j11593R6855
$$ 1501139 1662832 1795608 2066268 2257389 2072035 2165571 2152027 2008797 1897204 1994059
20265A994059J30586o9220J07962O0848L8665j18974k4658k056k9426n4970j21114
$$ 1994059 2124645 2055425 2163387 2224235 2262900 2143926 2119268 2117212 2087786 2032816 1911702
20254A911702k8798J43995R764j21456O4064K04742J10853L5018k46586p2748
$$ 1911702 1882904 2026899 2036663 1915207 1979271 2184013 2294866 2329884 2083298 2010550
20244B010550J26148j03j4331P78J6465K05751J56578q2623j49388k7344L001
$$ 2010550 2136698 2136595 2122264 2123042 2139507 2345258 2501836 2419213 2269825 2242481 2245482
20233B245482k53579n08J76460N0457j09555m9025j48616R5260J2989R8164J02842
$$ 2245482 1991903 1991395 2167855 2218312 2108757 2059732 1911116 2006376 2019365 2117529 2220371
20222B220371J15353p8045k92774j29412J47555K61492K19568J53861k7891Q8543
$$ 2220371 2335724 2257679 1964905 1835493 1983048 2244540 2464108 2617969 2590078 2678621
20212B678621J38883q2426n6122J42285L407k8273p4473J23622J72717J14692
$$ 2678621 2817504 2735078 2678956 2821241 2824648 2796375 2721902 2845524 3018241 3132933
20202C132933M2958j00997j35572J42654M9106J36823J8715l64577p8759R6814
$$ 3132933 3175891 3074894 2939322 3081976 3131082 3267905 3286620 2922043 2843284 2940098
20192B940098p4538j19587L7820n9947p3442M9339J23800K41468P1426J69550
$$ 2940098 2865560 2745973 2783793 2723846 2650404 2699743 2823543 3065011 3136437 3305987
20182C305987j62953n3969L0941J77616l2425q6704m5585J7423J32817L3770k51843
$$ 3305987 3143034 3089065 3120006 3297622 3265197 3178493 3132908 3150331 3283148 3316918 3065075
20171C065075j55769K1456M3575l3705j06601Q0879J36727j47782l1454k22839
$$ 3065075 2909306 2930762 2974337 2940632 2834031 2914910 3051637 2903855 2872401 2649562
20161B649562p6221K24842N36129l5967k24549J49021O1921j50945j96542K16630
$$ 2649562 2573341 2798183 3334312 3298345 3073796 3222817 3284738 3133793 2937251 3153881
20151C153881L30953J43999J42319j74404k84147j37745l0141J87615K61562N7261
$$ 3153881 3484834 3628833 3771152 3596748 3312601 3174856 3144715 3332330 3593892 3651153
20141C651153m1624l5681K44491k2827m534q9034J02460J45069J88381K29031
$$ 3651153 3609529 3573848 3818339 3795512 3790978 3701944 3804404 3949473 4137854 4366885
20131D366885j79744k71347K06425L9372j04895M9486J01440K2794Q3936j4563
$$ 4366885 4187141 3915794 4122219 4161591 4056696 4106182 4207622 4230416 4314352 4299789
20121D299789j10813K03121L06721J57543k50883k6605l7559J13774J64832l4169
$$ 4299789 4188976 4392097 4698818 4856361 4605478 4578873 4541314 4655088 4819920 4785751
20111D785751P0280J94453J56888m8356j16587M3360J44236J7767q1653j8596
$$ 4785751 4856031 5050484 5207372 5159016 5042429 5085789 5230025 5247792 5166139 5147543
20101E147543M24975j2354R7344O7057j20077j62265L59738L27016N6417j743
$$ 5147543 5572518 5560164 5657508 5724565 5604488 5442223 5801961 6128977 6185394 6183651
20091F183651k80823j35688J37809k9573j97424L5326J78361M1197l6331J65035
$$ 6183651 5902828 5767140 5904949 5875376 5677952 5713278 5891639 5932836 5896505 6061540
20081F061540J01949j62314j20970J88037L0115P5732P499o6626j38146M7987
$$ 6061540 6163489 6001175 5880205 6068242 6098357 6174089 6181588 6114962 5976816 6024803
20071F024803Q8433L0415p5136J37623J02679l9153q3529J40070r8279K15944
$$ 6024803 6113236 6143651 6068515 6206138 6308817 6269664 6186135 6326205 6227926 6443870
20061F443870P5907r0256K24263L57444k0311J75800J48287J14860J64422P8529
$$ 6443870 6519777 6429521 6653784 7011228 6990917 7166717 7315004 7429864 7594286 7672815
20051G672815J23297j74909k46771J99405K92956J28912K11180J86281J5808j68353
$$ 7672815 7796112 7621203 7374432 7573837 7866793 7995705 8206885 8393166 8408974 8240621
20041H240621l7491j01679J27754K22303J38521j2828l8302J14352q2643j17312
$$ 8240621 8203130 8101451 8229205 8451508 8590029 8577201 8538899 8653251 8570608 8453296
20031H453296j6013M07490K69249K18153j64454K6802L3584o2461l20092L9336
$$ 8453296 8437283 8844773 9114022 9332175 9167721 9194523 9228107 9165646 8845554 8884890
20021H884890P7701J69563n112K4160L9680K93705K82346J92195L48102L1380
$$ 8884890 8962591 9132154 9127042 9151202 9190882 9484587 9766933 9959128 10307230 10338610
20011A0338610P6928q36n6747J70169J51510L26545Q619J02587J05663L5517J41148
$$ 10338610 10415538 10414702 10357955 10528124 10679634 11006179 11014798 11117385 11223048 11258565 11399713
20000A1399713K55826L35802J29762M476L48697O1216r792J48777J55570j11630
$$ 11399713 11655539 11991341 12121103 12125579 12474276 12535492 12525700 12674477 12830047 12718417
19990A2718417j96939K09059M21324L13229N9626K52252J0417K31554j04701Q3283
$$ 12718417 12521478 12730537 13151861 13465090 13524716 13776968 13787385 14018939 13914238 13997521
19980A3997521J55386Q9255j02160j21421J00916L25454K87308R8513o9981N0181
$$ 13997521 14152907 14242162 14140002 14018581 14119497 14444951 14732259 14830772 14760791 14810972
19970A4810972J43502j9618j25828p5882R8730n156K32482J35497N4449M08n1845
$$ 14810972 14954474 14934856 14809028 14733146 14831876 14826720 15059202 15194699 15249148 15249556 15197711
19959A5197711L5205J73715K44491J52755J88717J60267R5375j6758j9144J67575
$$ 15197711 15232916 15406631 15651122 15803877 15992594 16152861 16248236 16231478 16212334 16379909
19949A6379909m9809J34122L07822K51162J23802N7852o6460J8473K86668L25231
$$ 16379909 16330100 16464222 16772044 17023206 17147008 17204860 17138400 17156873 17443541 17768772
19939A7768772Q7781j32746P1553K76035J01333J06705p5140K62625K10272k08970
$$ 17768772 17856553 17723807 17795360 18071395 18172728 18279433 18204293 18466918 18677190 18468220
19929A8468220k85142j59225M11409L19132j1526J14304J71649J63595N572R3502
$$ 18468220 18183078 18023853 18435262 18754394 18742868 18857172 19028821 19192416 19197988 19291490
19919A9291490j6164j36213l9719j4843R0061K95775j6944j01648M5867J25616
$$ 19291490 19275326 19139113 19099394 19084551 19174612 19470387 19453443 19351795 19397662 19523278
19909A9523278J15398j1781K45703l4751R3828j09529p2442K16564L3389P3158
$$ 19523278 19638676 19626895 19872598 19837847 19931675 19822146 19749704 19966268 19999657 20072815
19899B0072815L59216M4240j36453j22926m3019k11734J32545R9140k9194K17144
$$ 20072815 20432031 20476271 20339818 20216892 20173873 19962139 20094684 20193824 20164630 20381774
19889B0381774J52123M1339J79636j1512m5850r2987j13957J9853J03046o559
$$ 20381774 20533897 20575236 20754872 20743360 20697510 20604523 20490566 20510419 20613465 20606906
19879B0606906J91245J4768m4963j62691J10413J23298k71645k83083Q3084m5704
$$ 20606906 20798151 20812919 20767956 20605265 20715678 20838976 20567331 20284248 20367332 20321628
19869B0321628m3045j86564j72025P412l381j81301q3000K1420M5674j5336J918
$$ 20321628 20278583 20092019 19919994 19927406 19924025 19742724 19659724 19681144 19726818 19711482 19713400
19858A9713400j79235j41674j50318l9209k1630P0605L0703n6649q5583j15385
$$ 19713400 19534165 19392491 19242173 19202964 19181334 19251939 19282642 19225993 19140410 19025025
19848A9025025j86021l80803j13794J91181O7550J0186j40886J77492J05515k19968
$$ 19025025 18839004 18458201 18344407 18535588 18603138 18613324 18472438 18649930 18755445 18535477
19838A8535477k4199l5121Q3504m38887k60614j27426J14137L5500m7666j34719
$$ 18535477 18511278 18476157 18559661 18120774 17860160 17732734 17846871 17882371 17834705 17699986
19828A7699986n5728j89085N852j237l39911j58921k05337j97829J42650J48954
$$ 17699986 17644258 17455173 17461025 17459788 17119877 16960956 16755619 16557790 16700440 16849394
19818A6849394k6448j23250r3828k40224k23581k83632j0400J37654K046j54955
$$ 16849394 16822946 16699696 16605868 16365644 16142063 15858431 15848031 15985685 15987731 15832776
19808A5832776j12348k14903l0535n426l71481l06338q113j33400j93427J34131
$$ 15832776 15720428 15505525 15474990 15469564 15098083 14791745 14783632 14650232 14456805 14590936
19798A4590936J24704k30326j96522n9456q1351j30374j01387J45236O1266k62374
$$ 14590936 14715640 14485314 14288792 14229336 14147985 14017611 13916224 14061460 14122726 13860352
19788A3860352N1556q9255l3989l35042j35890k45892J02502N6934L5133O0468
$$ 13860352 13911908 13822653 13788664 13453622 13317732 13071840 13174342 13231276 13266409 13326877
19778A3326877K5421j22500k99865j75267n7099j68405j87104q5485n1556O6775
$$ 13326877 13352298 13229798 12929933 12754666 12697567 12529162 12342058 12256573 12205017 12271792
19768A2271792j9746j99666J16076j50873m8574J66020k42542j26352k5166j08433
$$ 12271792 12252046 12052380 12168456 12017583 11969009 12135029 11892487 11766135 11740969 11632536
19758A1632536r8386l2415J63k23964o6695J19546j61487N9919j99034j43836
$$ 11632536 11534150 11501735 11501898 11277934 11211239 11330785 11169298 11229217 11030183 10886347
19748A0886347J86689Q1191m8887k38986r8593j54448K4992o8835m98312j79549
$$ 10886347 11073036 11154227 11105340 10866354 10767761 10613313 10638305 10569470 10071158 9891609
19738I891609j8589J36172r380J5365J21473Q9610p7298j09170r6836l4246j44549
$$ 9891609 9873020 10009192 9999812 10015177 10136650 10226260 10148962 10039792 9942956 9908710 9764161
19727I764161l61455k1430K08221Q6387j10228j71882K33999J54370j6096k52649
$$ 9764161 9402706 9381276 9589497 9675884 9565656 9393774 9627773 9782143 9766047 9513398
19717I513398l10292j82687K61553K23134k84619q6107j66678p0134K63309J45838
$$ 9513398 9203106 9020419 9281972 9505106 9220487 9134380 8967702 8897568 9160877 9306715
19707I306715J05037j11576k95957o0621q715j7503J05126Q5672k90811k4465
$$ 9306715 9411752 9300176 9004219 8943598 8934883 8917380 9022506 9108178 8817367 8792902
19697H792902J50121n6388R7342j26448k24685j46979J56117k63586l89972P819
$$ 8792902 8943023 8886635 8983977 8857529 8632844 8485865 8641982 8378396 7988424 7996243
19687G996243M8067j40840N8899M7801J28695j47339o5091j56960m27K39018j44478
$$ 7996243 8044310 7903470 7962369 8010170 8138865 7991526 7926435 7769475 7769048 8008066 7863588
19676G863588j90336L00514R2370j81049k44608K25937J9359R2015J10146j31719
$$ 7863588 7673252 7973766 8066136 7885087 7640479 7866416 7885775 7977790 8087936 7956217
19666G956217J7599L3996K61907J9779j79213K9246M1739j8904j45089K22083
$$ 7956217 7973816 8007812 8269719 8289498 8110285 8139531 8181270 8162366 8017277 8239360
19656H239360j0382K0185M3080p9906j55987j54341l1417J954m5091Q9072o3643
$$ 8239360 8228978 8249163 8292243 8212337 8056350 7902009 7870592 7872546 7827455 7916527 7852884
19645G852884J9859j65727J21095J19702j63675J28756K94242O7719j72316p3108
$$ 7852884 7872743 7707016 7828111 7947813 7784138 7912894 8207136 8274855 8102539 8029431
19635H029431J13136K96851L98046K07657J80137M553j33140j71992j24405K96159
$$ 8029431 8142567 8439418 8837464 9045121 9225258 9229811 9096671 8924679 8800274 9096433
19625I096433N23113L99088J29446L91706K99052K34386M82109P45720M03157
$$ 9096433 9619546 10018634 10148080 10539786 10838838 11073224 11555333 12301053 12704210
19616A2704210J51717N69321O62930Q85799Q52382O27095R72381J581969J831491
$$ 12704210 12855927 13425248 14088178 14973977 15826359 16453454 17425835 19007804 20839295
19607B0839295K076366K061429K744504L306433L387227L643235M499269N070517
$$ 20839295 22915661 24977090 27721594 31028027 34415254 38058489 42557758 47628275
19599D7628275N495111N695253N955203O443895O429326O453768O502070N931028
$$ 47628275 53123386 58818639 64773842 71217737 77647063 84100831 90602901 96533929
19591I6533929N442235M866368M256490K969884K160516J234380N9485q19946
$$ 96533929 101976164 106842532 111099022 114068906 116229422 117463802 117523287 116703341
19583A16703341j699032k451147l306153l668499m562614n078755n437125n264346
$$ 116703341 115004309 112553162 109247009 105578510 101015896 95937141 90500016 85235670
19575H5235670n074870n129576m874950m409987l862318l704510l172931k504604
$$ 85235670 80160800 75031224 70156274 65746287 61883969 58179459 55006528 52501924
19567E2501924j993522j482293j148609n76744j73935M48805Q88932J063970J866844
$$ 52501924 50508402 49026109 47877500 47300756 47126821 47575626 48464558 49528528 51395372
19558E1395372K594533K726040L255480M149880M764345N448002N935008O185506
$$ 51395372 53989905 56715945 59971425 64121305 68885650 74333652 80268660 86454166
19550H6454166O593894O638977O669516O729570O384664O133428N437781M261845
$$ 86454166 93048060 99687037 106356553 113086123 119470787 125604215 131041996 135303841
19542A35303841L297584K389579J095385p5949j180897k215153l481842m362367
$$ 135303841 138601425 140991004 142086389 142010440 140829543 138614390 135132548 130770181
19534A30770181m930744n472292n637461n893530o307404o378909o085184n944604
$$ 130770181 125839437 120367145 114729684 108836154 102528750 96149841 90064657 84120053
19526H4120053n695103n253081m714345m175480l552172l147766k666929k261616
$$ 84120053 78424950 73171869 68457524 64282044 60729872 57582106 54915177 52653561
19518E2653561j919030j285801r62741j104253j158011o59601k39627o4054N50208
$$ 52653561 50734531 49448730 48485989 47381736 46223725 45564124 45324497 45260443 45810651
19509D5810651L83678P55530J003187J711102K181497K869832L309073L821990
$$ 45810651 46194329 46949859 47953046 49664148 51845645 54715477 58024550 61846540
19501F1846540M725728N934604O840599Q187747R258871J0478024J1229637J2501389
$$ 61846540 66572268 72506872 79347471 87535218 96794089 107272113 118501750 131003139
19493A31003139J3894951J4318005J5014669J5072373J4934559J4990853J4292793
$$ 131003139 144898090 159216095 174230764 189303137 204237696 219228549 233521342
19486B33521342J3814704J2463510J1376157J0430070R020192P602098O068433
$$ 233521342 247336046 259799556 271175713 281605783 290625975 298228073 304296506
19479C04296506M937504L673295K319203R88980o72708k161868l455836n126699
$$ 304296506 309234010 312907305 315226508 316215488 315542780 313380912 309925076 304798377
19471C04798377o547201p995642r853337j1411200j2344293j3143247j3726731
$$ 304798377 298251176 290255534 280402197 268990997 256646704 243503457 229776726
19464B29776726j4191875j4428607j4250291j3485485j2807330j2089001j1281597
$$ 229776726 215584851 201156244 186905953 173420468 160613138 148524137 137242540
19457A37242540r983783q545787p770004o638882n927061m978698m415070m032753
$$ 137242540 127258757 118712970 110942966 104304084 98377023 93398325 88983255 84950502
19449H4950502l229251k760508k308440j833484j204567q09758n54503j054O38661
$$ 84950502 81721251 78960743 76652303 74818819 73614252 72804494 72249991 72248937 72887598
19440G2887598R42443J261008J897769K339420K164154K028631J953142K067964
$$ 72887598 73830041 75091049 76988818 79328238 81492392 83521023 85474165 87542129
19432H7542129J924870J948308J350176J092615R00447J66248q59990j329523
$$ 87542129 89466999 91415307 92765483 93858098 94758545 94924793 94064803 92735280
19424I2735280j728649k066761k642311l090340l370597l328373l356280l643277
$$ 92735280 91006631 88939870 86297559 83207219 79836622 76508249 73151969 69508692
19416F9508692l651500l350600l325347l120747k844112k553341k326238k071939
$$ 69508692 65857192 62506592 59181245 56060498 53216386 50663045 48336807 46264868
19408D6264868j759038j492744j255407j133243q76179m21710m76985k64782K57848
$$ 46264868 44505830 43013086 41757679 40624436 39748257 39326547 38849562 38584780 38842628
19399C8842628L49238N53075Q21112J107822J793942K060390K517290K514727
$$ 38842628 39191866 39744941 40566053 41673875 43467817 45528207 48045497 50560224
19391E0560224K596897K930515L337847L399654L211691L373875L481393K861967
$$ 50560224 53157121 56087636 59425483 62825137 66036828 69410703 72892096 75754063
19383G5754063K299634J899081J543813O36971k11200q78248j312457j869519
$$ 75754063 78053697 79952778 81496591 82133562 81922362 81044114 79731657 77862138
19375G7862138k508206l004769l408324l642683l750276l612145l219493l382386
$$ 77862138 75353932 72349163 68940839 65298156 61547880 57935735 54716242 51333856
19367E1333856l528901l428690l224587l034674k628380k114972j810081j510481
$$ 51333856 47804955 44376265 41151678 38117004 35488624 33373652 31563571 30053090
19359C0053090j210192j147089j145773j298323r49891r02872n31384n80346n98284
$$ 30053090 28842898 27695809 26550036 25251713 24301822 23398950 22867566 22287220 21688936
19350B1688936r45939p37007l22192m47445m68397o40475m46460k78501k80523
$$ 21688936 20742997 20005990 19683798 19236353 18767956 18127481 17681021 17402520 17121997
19341A7121997m77948k61249j85165n16334o17187m21559k48026m45238l05571
$$ 17121997 16644049 16382800 16197635 15681301 15064114 14642555 14394529 13949291 13643720
19332A3643720j97081k71154k64068l35863m15534k85211k66792J3879O9020k46100
$$ 13643720 13446639 13175485 12911417 12575554 12160020 11874809 11608017 11621896 11690916 11444816
19322A1444816k54439j44953l16724m99316k56466J4462r1925j75756L7967J41938
$$ 11444816 11190377 11045424 10728700 10229384 9972918 9987380 9895455 9719699 9757666 9899604
19312I899604m8810l03141J9942l07306p5790L60150n6833M3527p4668l22263
$$ 9899604 9850794 9547653 9567595 9260289 9184499 9544649 9487816 9531343 9456675 9134412
19302I134412j90523j74543p9062j43910j22215J5058j35887k19506k10677j04309
$$ 9134412 8943889 8769346 8690284 8546374 8424159 8439217 8303330 8083824 7873147 7768838
19292G768838O7963j59606k32280j77893R4574p148j01920o5060k71496N4546
$$ 7768838 7836801 7677195 7444915 7267022 7361596 7354448 7252528 7187468 6915972 6970518
19282F970518j9996J52395K75001K33851K4987O1238J74064L71892L11078M27359
$$ 6970518 6950522 7102917 7377918 7611769 7636756 7697994 7872058 8243950 8555028 8982387
19272H982387K26048J41569N37292N89832M25040M54845J95079K71644J11860
$$ 8982387 9208435 9350004 9887296 10477128 10902168 11357013 11552092 11823736 11935596
19263A1935596j62711k7338N873j98118n0030j98049k13835k73758k67951l92662
$$ 11935596 11772885 11745547 11751420 11553302 11503272 11305223 11091388 10817630 10549679 10157017
19253A0157017l52408j72747l90275m45468j90764k27260l43393k75258l0342
$$ 10157017 9804609 9631862 9241587 8796119 8605355 8378095 8034702 7759444 7729102
19244G729102k52741l41577k51912J92541k07425k12929Q5602K42844J65290J98110
$$ 7729102 7476361 7134784 6882872 7075413 6867988 6655059 6740661 6983505 7148795 7346905
19234G346905J20712J9938K34825L85753K99983L37050K62717L08475N33955L81140
$$ 7346905 7467617 7487555 7722380 8108133 8408116 8745166 9007883 9316358 9850313 10231453
19224A0231453L18718N04996M99638N37749N31847L01814K54845J12771k4389
$$ 10231453 10550171 11055167 11554805 12092554 12624401 12926215 13181060 13293831 13269442
19215A3269442j14983p2747K79325J05012k6725l5724L6008J08836R795L5861
$$ 13269442 13154459 13081712 13361037 13466049 13439324 13403600 13439608 13548444 13558239 13594100
19205A3594100o1771p9774J68978J64646L46961K43210L16526L01379N66686L14831
$$ 13594100 13532329 13452555 13621533 13786179 14133140 14376350 14692876 14994255 15560941 15875772
19195A5875772K43516J79293J70866K50935J73559N6506p2505K4750j8245n35688
$$ 15875772 16119288 16298581 16469447 16720382 16893941 16950447 16877942 16902692 16884447 16348759
19185A6348759j89006k58608n05936l89133k84647l01892m71273n29503p66947
$$ 16348759 16159753 15901145 15395209 15006076 14721429 14419537 13948264 13418761 12651814
19176A2651814q95504q19810n91120n15424m05788n72235n50486m32193n64058
$$ 12651814 11756310 10936500 10345380 9829956 9424168 8851933 8301447 7869254 7305196
19167G305196m67372l02769m36227k7083j8081l21433j62865J1426k18879r6737
$$ 7305196 6837824 6535055 6098828 6071745 6053664 5732231 5569366 5580792 5361913 5265176
19157E265176l0352k71454j71469k64006r4505P5497J45914j12207L5399N3967
$$ 5265176 5234824 4963370 4791901 4527895 4433390 4508887 4654801 4542594 4577993 4631960
19147D631960j25542j49400j07403j28388K14254k77931m1506j71683o5257J42813
$$ 4631960 4506418 4357018 4249615 4121227 4335481 4057550 4016044 3844361 3779104 3921917
19137C921917J48725j92065k22522j69304k05996M6677M3691M965L084k58908
$$ 3921917 4070642 3878577 3656055 3486751 3280755 3327432 3371123 3376088 3379172 3120264
19127C120264k81901j7709J12647m7911j30071r9464K21395J71042q982r8668
$$ 3120264 2838363 2820654 2933301 2885390 2755319 2655855 2877250 3048292 3039310 2940642
19117B940642R7117J3689j13774j01487Q0813J01549p4468o605k5444l6799r5910
$$ 2940642 3037759 3051448 2937674 2836187 2917000 3018549 2944081 2937476 2912032 2875233 2779323
19106B779323l4398Q1693L2968o5503l884Q5904q1401K14620j2739j31358j69771
$$ 2779323 2744925 2826618 2859586 2794083 2790199 2876103 2794702 3009322 2996583 2865225 2695454
19095B695454o3186r9269j57008p4963Q3059j4160K3375N0120k02345l38803R1770
$$ 2695454 2632268 2532999 2375991 2301028 2384087 2369927 2393302 2443422 2241077 1902274 1994044
19084A994044L75368J12392L84490L75979k06215j68183j19445J742j37704m2706
$$ 1994044 2369412 2481804 2866294 3242273 3036058 2867875 2748430 2750172 2612468 2569762
19074B569762m0165j92345r5693R0746Q2976j6879R704N4356p0961N1665l9231
$$ 2569762 2529597 2337252 2241559 2332305 2415281 2398402 2408106 2462462 2391501 2443166 2403935
19063B403935j31577J2841K06157K37822O1042q6631k46417j05858k4534j8321
$$ 2403935 2272358 2285199 2491356 2729178 2790220 2703589 2457172 2351314 2326780 2308459
19053B308459L27227K18123j28091P571N03653J33896j28488j57712J56210K39079
$$ 2308459 2635686 2853809 2725718 2733289 3236942 3370838 3242350 3084638 3240848 3479927
19043C479927R0978Q8804J09692j17442n7494k2126k7526M1426L11370K607K7675
$$ 3479927 3570905 3659709 3769401 3651959 3594465 3572339 3544813 3586239 3897609 3900216 3927891
19032C927891J96441n7537j77814J3790K71580J12781n3700q1604k25681J42369
$$ 3927891 4124332 4066795 3888981 3902771 4174351 4287132 4233432 4151828 3926147 4068516
19022D068516K09927j82135l14650K09050J65765j80152j38232j89939K29589
$$ 4068516 4278443 4096308 3781658 3990708 4156473 3976321 3838089 3648150 3877739
19013C877739j36220P8783K14797J40597P5411p575r1886J89218N24431K22617
$$ 3877739 3741519 3820302 4035099 4175696 4251107 4243532 4151646 4340864 4865295 5087912
19003E087912J48823M01622K36148J25978R238K63881L41313K37034M42278L17893
$$ 5087912 5236735 5638357 5874505 6000483 6009721 6273602 6614915 6851949 7294227 7612120
18993G612120J29275L72215N20048R02112Q36682N71175R76553J058548J120733
$$ 7612120 7741395 8113610 8633658 9535770 10372452 10943627 11920180 12978728 14099461
18984A4099461J581514J942487K150036K142032K537202K967545L342444L819543
$$ 14099461 15680975 17623462 19773498 21915530 24452732 27420277 30762721 34582264
18976C4582264L841956L763389L863477M224818M027481L961557L487469L397526
$$ 34582264 38424220 42187609 46051086 50275904 54303385 58264942 61752411 65149937
18968F5149937L344946K986427K971277K992601K482377J770344J311996J181276
$$ 65149937 68494883 71481310 74452587 77445188 79927565 81697909 83009905 84191181
18960H4191181Q09012N97240j38716n85767m08463m84557q74238q28341o12901
$$ 84191181 85000193 85597433 85458717 84872950 84464487 83979930 83105692 82277351 81664450
18951H1664450p44889p40309n70267m84078j038476q99889n10375l84858o27852
$$ 81664450 80919561 80179252 79608985 79124907 78086431 77186542 76676167 76291309 75663457
18942G5663457j86261P065O28326N09037Q49958J270580J618946J849100J943036
$$ 75663457 75477196 75484261 76112587 76621624 77471582 78742162 80361108 82210208 84153244
18933H4153244K333455K994731L412584L760069L959596M113481M575298M769538
$$ 84153244 86486699 89481430 92894014 96654083 100613679 104727160 109302458 114071996
18925A14071996M386056M270849M565964M159326L465725L242947K931549K347720
$$ 114071996 118458052 122728901 127294865 131454191 134919916 138162863 141094412 143442132
18917A43442132J730688J432423J346114J220169Q84254M91828m853l94789j234499
$$ 143442132 145172820 146605243 147951357 149171526 150055780 150547608 150542755 150147966 148913467
18908A48913467j616230j955026j980634k324170k612144k547629k349575k495317
$$ 148913467 147297237 145342211 143361577 141037407 138425263 135877634 133528059 131032742
18900A31032742k677618k646760k449589k323799k061685k504665k569174k441401
$$ 131032742 128355124 125708364 123258775 120934976 118873291 116368626 113799452 111358051
18892A11358051k028364j806432j502084j341761j214270r61154n18878q76099
$$ 111358051 109329687 107523255 106021171 104679410 103465140 102503986 101985108 101109009
18884A01109009j015744j106432j244343j549484k059286k467956k276185k497248
$$ 101109009 100093265 98986833 97742490 96193006 94133720 91665764 89389579 86892331
18876H6892331k781688k794134k955343k883276l522662l569278l415323l544316
$$ 86892331 84110643 81316509 78361166 75477890 71955228 68385950 64970627 61426311
18868F1426311l345164l422463l455402l037596k925242k698610k409585k072179
$$ 61426311 58081147 54658684 51203282 48165686 45240444 42541834 40132249 38060070
18860C8060070j708283j529576j317813j329556p92396p96493r22658r88937j172474
$$ 38060070 36351787 34822211 33504398 32174842 31382446 30585953 29663295 28674358 27501884
18851B7501884p97036o22091o83034n17948m85976n80473l52072m71063l57089
$$ 27501884 26704848 26082757 25399723 24881775 24395799 23815326 23463254 22992191 22635102
18842B2635102m29007o01863k67159m70980j21032k10703o42253n25401k45519
$$ 22635102 22206095 21604232 21337073 20866093 20745061 20534358 19892105 19366704 19121185
18833A9121185o3124l80197l33773l49401m50431k90393k53650k52587J03280
$$ 19121185 19058061 18677864 18344091 17994690 17544259 17253866 17000216 16747629 16850909
18824A6850909l9372j58112J64900k4006k1032n1368o8736k1404L1525J6680j4747
$$ 16850909 16811537 16653425 16818325 16794319 16773287 16721919 16653183 16631779 16663304 16679984 16665237
18813A6665237J80774J06644J73988K35904J07891J79898J39225J27856K89626
$$ 16665237 16846011 16952655 17126643 17362547 17470438 17650336 17789561 17917417 18207043
18804A8207043L77186M77425M83743M65887J1207J09840M86300O05118N18378
$$ 18207043 18584229 19061654 19545397 20011284 20022491 20132331 20618631 21223749 21742127
18795B1742127P36491R40428J085933J106368J305208J693901K209269K860468
$$ 21742127 22478618 23419046 24504979 25611347 26916555 28610456 30819725 33680193
18787C3680193L547225M271229M934012N534925N870663O471698O787189O799379
$$ 33680193 37227418 41498647 46432659 51967584 57838247 64309945 71097134 77896513
18779G7896513O241769N880770N198741L987893K525721J368539k02180j831277
$$ 77896513 84138282 90019052 95217793 99205686 101731407 103099946 102897766 101066489
18771A01066489l206929m145760m574816n234918n704013n330144n197110m717416
$$ 101066489 97859560 93713800 89138984 83904066 78200053 72869909 67672799 62955383
18763F2955383m135867l973189l082063k300400k059697j779539j416425r04520
$$ 62955383 58819516 54846327 51764264 49463864 47404167 45624628 44208203 43303683
18755D3303683j017766m95205m36569l86926j41975n79581Q9452N54371Q39901
$$ 43303683 42285917 41790712 41354143 40967217 40825242 40245661 40335113 40889484 41729385
18746D1729385Q47694Q62480J231357K125100K541616L284240M035140M720065
$$ 41729385 42577079 43439559 44670916 46796016 49337632 52621872 56657012 61377077
18738F1377077N707063O634757P610965Q726749R241435Q964148R067501Q445982
$$ 61377077 67084140 73718897 81329862 90056611 99298046 108262194 117329695 125775677
18730A25775677P575504N927470M136057K325443M25432j608770l536232n477774
$$ 125775677 133351181 139278651 143414708 145740151 146165583 144556813 141020581 135542807
18722A35542807o954620p460766q035151q624196q372683p855314p314799o778053
$$ 135542807 128588187 121127421 113092270 104468074 96095391 88240077 80925278 74147225
18714G4147225o022282n228628m438941l551977l248551k550427k243832k037475
$$ 74147225 68124943 62896315 58457374 54905397 51656846 49106419 46862587 44825112
18706D4825112j647394j190827j263710j191290j056024q11008m12760j77605
$$ 44825112 43177718 41986891 40723181 39531891 38475867 37664859 37252099 37074494
18698C7074494J2196j13955J54931Q69660J376252J247698J708030K827230L747364
$$ 37074494 37086690 36972735 37127666 37997326 39373578 40621276 42329306 45156536 48903900
18689D8903900M335906N044292N948770O676236P130552P063501O772096O432646
$$ 48903900 53239806 58284098 64232868 70909104 78039656 85103157 91875253 98307899
18681I8307899N780389M913219L385971J516843l28768j443890l015788m626240
$$ 98307899 104088288 109001507 112387478 113904321 113575553 112131663 109115875 104489635
18673A04489635n680690o450215o616753o838995o858159o326095n564301n092680
$$ 104489635 98808945 92358730 85741977 78902982 72044823 65718728 60154427 55061747
18665E5061747m345296l663119l250141k829460k319955j523206j173132j118526
$$ 55061747 50716451 47053332 43803191 40973731 38653776 37130570 35957438 34838912
18657C4838912r03973q88340r12688q89921n05265k98499m31250l31777R8097
$$ 34838912 33934939 33046599 32133911 31243990 30738725 30440226 30008976 29677199 29775296
18648B9775296J28899M09524Q61395J122503J456728J754486K135748K795430
$$ 29775296 29904195 30313719 31175114 32297617 33754345 35508831 37644579 40440009
18640D0440009L532332M335058M664012N160070N291545N199243M979407M810613
$$ 40440009 43972341 48307399 52971411 58131481 63423026 68622269 73601676 78412289
18632G8412289M202256K974018J762772R14406k11434j643088l190815l839282
$$ 78412289 82614545 85588563 87351335 88265741 88054307 86411219 83220404 79381122
18624G9381122m668352n241571n238622n023266n157483m572001m398659l994521
$$ 79381122 74712770 69471199 64232577 59209311 54051828 49479827 45081168 41086647
18616D1086647l492112k800515j926024j717661j597702j443291j015388r97575
$$ 41086647 37594535 34794020 32867996 31150335 29552633 28109342 27093954 26096379
18608B6096379o58635n17441l58385j99927o33247m54205k66730n46976l8191
$$ 26096379 25437744 24920303 24561918 24361991 23728744 23274539 23007809 22460833 22422642
18599B2422642L12047K17352K29017O81977J049696J546984J351575J287329J591187
$$ 22422642 22734689 22952041 23181058 23863035 24912731 26459715 27811290 29098619 30689806
18590C0689806J785826K039441K208388K063499J933648J608491J657292J131692
$$ 30689806 32475632 34515073 36723461 38786960 40720608 42329099 43986391 45118083
18582D5118083L48951j39971n30293j051014j608151j860035k350791k409722
$$ 45118083 45467034 45327063 44796770 43745756 42137605 40277570 37926779 35517057
18574C5517057k222410k485891k503197k457173k101644j855838j752605j357111
$$ 35517057 33294647 30808756 28305559 25848386 23746742 21890904 20138299 18781188
18566A8781188j038724r15569q08390l62871m88818q07478o51179l23950l83737
$$ 18781188 17742464 16826895 16018505 15655634 15166816 14359338 13708159 13384209 13000472
18557A3000472m57160n43232o5090J03965j67890j09882j33380j11964k42831
$$ 13000472 12543312 12000080 11934990 12038955 11871065 11761183 11627803 11515839 11273008
18548A1273008k72284q8633M5732Q3265R8721O8299J77581j76439j82644l33526
$$ 11273008 11000724 10912091 10957823 11041088 11139809 11208108 11385689 11209250 11026606 10693080
18538A0693080l00615l37502r1057n24454k44605k53297m28464l91778k06207
$$ 10693080 10392465 10054963 9963906 9439452 9194847 8941550 8513086 8121308 7915101
18529G915101k89731k28272k85275k96691k4033j86272j00386j80428j86136j37444
$$ 7915101 7625370 7397098 7111823 6815132 6791099 6604827 6504441 6324013 6137877 6000433
18519F000433M6186o9510k66820j69166K59690J32813j50905p7804j86877k63681
$$ 6000433 6046619 5977109 5710289 5541123 5800813 5933626 5782721 5704917 5518040 5254359
18509E254359k84006l43407m87790l13090O1161K01523J75449J60267j23729j11389
$$ 5254359 4970353 4626946 4139156 3826066 3887227 4088750 4264199 4424466 4300737 4189348
18499D189348k17315j58502l5520j42680l59586r9412N6522J49390j7960j0010
$$ 4189348 3972033 3813531 3778011 3635331 3275745 3176333 3232855 3382245 3364285 3354275
18489C354275O9943k3962J63027j83904j35023K5318k07790k8173K4638R0179
$$ 3354275 3424218 3400256 3563283 3379379 3244356 3269674 3061884 3033711 3058349 3148528
18479C148528k2532J1617k30817j14065j25208l38795l1936K74944J55909j0836
$$ 3148528 3125996 3137613 2906796 2792731 2667523 2328728 2296792 2571736 2727645 2716809
18469B716809k08856j7963L67218J00341l72198o4538Q2516j84408k07380p6798
$$ 2716809 2507953 2489990 2857208 2957549 2585351 2520813 2603329 2418921 2211541 2134743
18459B134743N073J87765K30727k39280j76798J21833K44265K3351M7092j94842
$$ 2134743 2139816 2327581 2558308 2319028 2142230 2264063 2508328 2531679 2578771 2383929
18449B383929k53995J45807N8957N7042L8681j38493k45923N5024J70557J30065
$$ 2383929 2129934 2275741 2334698 2391740 2430421 2291928 2046005 2101029 2271586 2401651
18439B401651q9034k27822j43543j64445O641O0459J51017M7371j33805J40094
$$ 2401651 2312617 2084795 1941252 1776807 1783448 1843907 1994924 2042295 1908490 2048584
18429B048584p151k60007o7010R7289Q0072j23482N1069R2395r3033j61247L5538
$$ 2048584 2041433 1781426 1714416 1811705 1891777 1768295 1819364 1911759 1818726 1657479 1693017
18418A693017J36298O4801m7436L863J9194r3577O2997J46597m40637o1247M2826
$$ 1693017 1829315 1894116 1846680 1850543 1869737 1776160 1839157 1985754 1545117 1483870 1526696
18407A526696j16705j32850J71283J81557J34282n7911j46390P3392j32472r0143
$$ 1526696 1409991 1277141 1448424 1629981 1764263 1706352 1559962 1633354 1500882 1410739
18397A410739J80432J51568Q0543N7807q1672j40522j34476P3952P3593j02437
$$ 1410739 1591171 1742739 1823282 1881089 1799417 1658895 1524419 1598371 1671964 1569527
18387A569527k72964M17411K93475m061k42384l38862j65489J24528l75116l3605
$$ 1569527 1296563 1713974 2007449 2003388 1761004 1422142 1256653 1381181 1006065 972460
18377I72460O3562M2680j41883p2555O8707J41776N6098j31596M3187K48910K28953
$$ 972460 1036022 1078702 936819 864264 932971 1074747 1130845 999249 1042436 1291346 1520299
18366A520299k71289l0415j71629j12288J43115K9056J19934R3113q3851k5614
$$ 1520299 1249010 1218595 1046966 934678 1077793 1106849 1226783 1319896 1236045 1210431
18356A210431J58431n0338n8199J02325j90557j20365L60449J7779r3986k74104
$$ 1210431 1368862 1318524 1260325 1362650 1172093 1051728 1412177 1429956 1335970 1061866
18346A061866k00193j19172J90423k856j22576q4963l6046p2730J33897K9499
$$ 1061866 861673 742501 932924 930068 807492 722529 686483 613753 747650 777149
18336G77149j7988k8504P3111J59635L6872l15502j03449J18239J24759j0407
$$ 777149 759161 730657 803768 963403 1000275 684773 581324 699563 824322 813915
18326H13915J10996j58952j41593m4527k56220m72579J5573L41836P9626j03516
$$ 813915 924911 765959 624366 579839 323619 -148960 -133387 208449 288075 184559
18316A84559J04929J37393N4473k4738J58906M2728K13872m7729m72545j6928
$$ 184559 289488 426881 481354 456616 615522 658250 872122 824393 351848 334920
18306C34920J80865N3324R1058l6514k8017J23244J77956j18566Q148k74527j39626
$$ 334920 515785 569109 660167 623653 595636 718880 896836 778270 786418 511891 372265
18295C72265J27091n2624j80611N1436Q5228j5139l17025P2066J78974j10323
$$ 372265 499356 446732 266121 317557 402785 387646 70621 142687 321661 211338
18285B11338K0123N6455m7718O7933K67537J13711P526p1361m3577J22702P5791
$$ 211338 231461 287916 240198 308131 575668 689379 696905 625544 581967 704669 780460
18274G80460j57260k3089o8235o1600K65084J56205q1823O3121J49406p290o563
$$ 780460 623200 600111 531876 470276 735360 891565 809742 872863 1022269 1014979 1008416
18263A008416k7139K9624j78396j41286k01728k7801R5456J49088j56434p2881
$$ 1008416 981277 1010901 832505 691219 489491 461690 557146 706234 549800 476919
18253D76919o0073k8169J89143N3961r0741J53375P5000N2805J3577R0891k14399
$$ 476919 416846 388677 577820 631781 541040 694415 769415 822220 835797 926688 712289
18242G12289K6050J7763k7665l3923k35207j37392J18446m0635J29229p2326L2519
$$ 712289 738339 756102 728437 694514 459307 321915 440361 399726 528955 456629 489148
18231D89148n1025j27663J04832r0804J08122K28393n6744M5777M5368p9091j54807
$$ 489148 438123 310460 415292 324488 432610 661003 604259 650036 695404 616313 461506
18220D61506j34189J44460m9143M6379J74932O8864J57947K51176j51917k80670
$$ 461506 327317 471777 422634 469013 643945 712809 870756 1121932 970015 689345
18210F89345k69564O6890N49187j46646j50521K1678o7417j56996k35970r3482
$$ 689345 419781 486671 1035858 889212 738691 760369 692952 535956 299986 206504
18200B06504L98240J88218m15276l51322m6621L77409N0302O0943k09288J77800
$$ 206504 604744 792962 377686 26364 -20257 357152 407454 468397 259109 436909
18190D36909L74008J11953l03154k03327j14103M3082p5256r8691N8635M9538
$$ 436909 810917 922870 619716 416389 302286 345368 270112 171421 230056 279594
18180B79594Q8959K94679j99172R9300N0570j53645p5784n1966k4926L39594L42796
$$ 279594 368553 663232 464060 563360 613930 460285 384501 332535 307609 647203 989999
18169I89999R2641k6154j73943j87156j20074r7884N3811R7608J16641K6338O8243
$$ 989999 1082640 1056486 882543 695387 575313 477429 531240 628848 745489 771827 840070
18158H40070j20492l40148o7838J64630J0735L540N036k05601j46471l8798l0695
$$ 840070 719578 379430 311592 476222 486957 490497 495533 289932 143461 104663 73968
18147G3968J89278N8449J42050j03118k05029m5237q13J12562J45052n9688K8488
$$ 73968 263246 321695 463745 360627 155598 110361 109548 222110 367162 307474 335962
18136C35962q6313j46830J19612J53406q04k1251K07080J14691j39073l52822
$$ 335962 249649 102819 222431 375837 375033 353782 560862 675553 536480 183658
18126A83658K59365n8394L611J3715J23917M0078j23830n8454r9309N7132M0873
$$ 183658 443023 384629 388240 401955 525872 565950 442120 383666 284357 341489 382362
18115C82362n9729N0128M24957J14233q9881j53994k05264j78623N5341j33938
$$ 382362 322633 372761 797718 911951 822070 668076 462812 284189 339530 205592
18105B05592N3665J36148Q153J46999l12293o1055J80918M8524J91843J11453
$$ 205592 259257 395405 403558 550557 238264 177209 358127 406651 598494 709947
18095G09947k89634k20039J44909k58075L3554l8512P5119j42844L2764J70984
$$ 709947 420313 200274 345183 87108 120662 82150 157269 14425 47189 218173
18085B18173J18758k74447J06799j79569l09936J28163J23164J91437J32479j64719
$$ 218173 336931 62484 169283 -10286 -320222 -192059 -68895 122542 255021 90302
18075I0302R9453K48190k8870j18506P2000M851j9621j94390j74254J98472j01535
$$ 90302 189755 437945 409075 290569 362569 367420 347799 153409 -20845 177627 76092
18064G6092R884L27288K78373J28305k01909j11229K2459o8516j13071j81702
$$ 76092 85976 413264 691637 819942 618033 506804 529263 460747 347676 165974
18054A65974j44392k7954K54487m4473k86408J51338p3694j61541K2081J02227
$$ 165974 21582 -6372 248115 203642 -82766 68572 -5122 -166663 -144582 -42355
18044d2355J70030q3412R4728J32493K31843L892q027k15179j00458j08280m1243
$$ -42355 127675 44263 138991 271484 503327 507219 499192 284013 183555 75275 34032
18033C4032q516j0005r7828j39808J9648O7087l7254Q7961J23128P2836j1381
$$ 34032 25516 15511 -82317 -222125 -202477 -135390 -172644 -84683 38445 111281 99900
18022I9900N25J40127Q9363n4487q013P5148l2175k77107Q1055J17919M8418k47104
$$ 99900 100425 240552 329915 275428 267415 342563 310388 33281 114336 232255 280673 33569
18010C3569J5575R1624p4982J35247P1493q6409k1456l9593j00253j74649L6066
$$ 33569 49144 140768 65786 201033 272526 186117 164661 125068 24815 -149834 -113768
17999a13768p0754P5265K93911L0856K01415J931J20523J11728j38620j85297
$$ -113768 -184522 -109257 184654 215510 416925 418856 539379 651107 512487 327190
17989C27190Q1602j23988k76337j58470M8429J6492J16217k8831l4255n696K6859
$$ 327190 408792 284804 8467 -150003 -101574 -85082 31135 2304 -31951 -37647 -10788
17978a0788J97880j72606q8975R4027K83921K41322J12037j49185l4746l3011
$$ -10788 187092 14486 -74489 19538 303459 544781 656818 507633 472887 439876
17968D39876M6285k06486j55214j95860J26558j2597O9636J42655k61419o8847
$$ 439876 486161 279675 124461 -71399 55159 42562 112198 254853 -6566 -75413
17958g5413J95918r9880j37191j29057Q676Q5303J14824j21042j49930L13867
$$ -75413 120505 20625 -116566 -245623 -236947 -151644 -36820 -157862 -307792 6075
17948F075r258r2462j1704J28955L33051L9340j83814k9068j34297L8805k15598
$$ 6075 -3183 -95645 -107349 21606 354657 393997 210183 181115 46818 85623 -129975
17937a29975J3869R6665K40799J79883J8240m4486k55249r9010k36644j2170J78303
$$ -129975 -116106 -19441 221358 401241 419481 374995 119746 20736 -215908 -228078 -49775
17926d9775J39777j83709n9215O8762K98497J24909n055j97910J64697M3933N9885
$$ -49775 90002 -93707 -152922 -84160 214337 339246 334191 136281 300978 344911 404796
17915D04796J75240m4083k37477j39259Q0483n5788O1375L3464L6365m6203l6265
$$ 404796 580036 535953 298476 159217 239700 183912 245287 278751 315116 268913 232648
17904B32648m5536O4121M5286j49161l5763j22747p8846K20301j11653j8005J0970
$$ 232648 187112 251233 296519 147358 111595 -11152 -89998 130303 18650 645 11615
17893A1615k47087l6362j29207K21562N2449J54888K43411L2243j46266n4199
$$ 11615 -235472 -271834 -401041 -179479 -127030 27858 271269 303512 157246 103047
17883A03047j50320J14409n5600r1905j22937r4020p847N3671K4232k73716L4700
$$ 103047 -47273 67136 11536 -80369 -203306 -297326 -305173 -251502 -227270 -500986 -466286
17872d66286J07886K33752K9205k9897j10297r8449J64965j51607N9834J02453
$$ -466286 -358400 -124648 -95443 -125340 -235637 -334086 -169121 -320728 -260894 -158441
17862a58441r0175q5509k62740M1326L06020K25602o6989j23866k57485r8313
$$ -158441 -248616 -334125 -596865 -555539 -249519 -23917 -90906 -214772 -472257 -570570
17852e70570n1751J66768K91798j52688o5560j08223K82952J17023J06904R0433
$$ -570570 -622321 -455553 -163755 -316443 -382003 -490226 -207274 -90251 16653 107086
17842A07086N6584J6177P0407j35981q8650q965k8106k11444n4611k6071P2909
$$ 107086 163670 179847 250254 114273 25623 16658 -11448 -222892 -277503 -303574 -230665
17831b30665K63035J11433L32871N3376k77925l31781j47889J17135L09761J04595
$$ -230665 32370 143803 476674 530050 252125 -79656 -227545 -110410 199351 303946
17821C03946j29563n9769j82794Q45O5054L6204P2798j35686J24824o92n0209
$$ 303946 174383 114614 -68180 -67335 -2281 33923 106721 -28965 95859 95167 44958
17810D4958K778L2185J91868k5999K14535n7661N9984p1981J766j89937k32277
$$ 44958 47736 79921 271789 245790 460325 402664 462648 390667 392433 202496 -29781
17799b9781O188j75610K1053J47805J45002Q7996P7146J05394j94911j59521K16602
$$ -29781 -23593 -199203 -178150 -30345 114657 202653 279799 385193 190282 30761 247363
17788B47363q9679j43076K5J68885j28059j79535k2036J08251O5185q3418O4413
$$ 247363 157684 14608 14633 183518 55459 -124076 -146112 -37861 27324 -56094 8319
17777H319J59830q7603k34000J0672k9753J5277J50834J35043J39061l8288K3493
$$ 8319 168149 80546 -153454 -142782 -172535 -157258 -6424 128619 267680 229392 252885
17766B52885J78672K7061k55854k22478q0253J6888J10417o7062r5025p5563J90104
$$ 252885 431557 458618 202764 -19714 -99967 -83079 27338 -39724 -134749 -210312 -20208
17755b0208r2578K17559k3935m34737j06951J86106R6049L1733K19511M7232o4001
$$ -20208 -112786 104773 80838 -353899 -460850 -274744 -178695 -146962 72549 119781 55780
17744E5780j57672m4447M4451J36149K03796k2260j35690K63609k08862k32938
$$ 55780 -101892 -146339 -101888 34261 238057 215797 80107 343716 134854 -98084
17734i8084j92056J4888J8958p1434Q4588J33484K45176M8488j2215M999j07832
$$ -98084 -290140 -275252 -256294 -327728 -243140 -109656 135520 184008 171793 176792 68960
17723F8960k00226k29707o076J58619K81279J34331k19919p4545p571j04176r5141
$$ 68960 -131266 -360973 -367049 -208430 72849 207180 -12739 -87284 -94855 -199031 -294172
17712b94172J05592M2634k2194j77086l12814J32534L86988M5688Q3210J0685
$$ -294172 -188580 -145946 -168140 -345226 -658040 -525506 -138518 -92830 -9620 1065
17702A065J24283q0911k23709o5630J66892K941J2109J13449j78663r2060M8332
$$ 1065 125348 44437 -179272 -244902 -78010 -75069 -62960 50489 -128174 -220234 -171902
17691a71902L16907J00892n18907j32920K26078K10263l4568Q3943m9855m2261
$$ -171902 145005 245897 -273010 -405930 -179852 30411 -4157 79786 29931 -12330
17681a2330j4892J05864J17395j45917o9237q4405J09940r1485J25138J32317
$$ -12330 -27222 78642 196037 50120 -19117 -103522 6418 -85067 40071 172388
17671A72388M0762j07095j55793J23959N2558J59794j50467l36920J06838J3872
$$ 172388 213150 106055 -49738 74221 126779 286573 136106 -200814 -93976 -80104
17661h0104l2268j00897L06702R7699L8552j3327J41155n8392k03240k85221L4975
$$ -80104 -112372 -213269 93433 191132 229684 216357 357512 299120 95880 -189341 -154366
17650a54366K24007J42726O9929j63068k58659j32948o8098K14627K35031j3636
$$ -154366 69641 212367 282296 119228 -139431 -272379 -340477 -125850 109181 95545
17640I5545k90042J67204K31618O9829J29122L0928j86820M813j3032l0442l36408
$$ 95545 -194497 -27293 204325 274154 403276 434204 247384 252197 239165 208723 -127685
17629a27685J90202K22652r4046l8885R4576J11390m4445o4926j8478j3792j8221
$$ -127685 62517 285169 191123 152238 246814 358204 313759 248833 230355 216563 198342
17618A98342n066k74120o9616j06694M3162J02467J95777J18274k22892j41079
$$ 198342 193276 -80844 -150460 -257154 -213992 -111525 84252 202526 -20366 -161445
17608a61445K7814j13388j05275M9828k75Q4240l9376J98676N5737j83262r665
$$ -161445 -133631 -247019 -352294 -302466 -302741 -218501 -257877 -59201 -3464 -186726 -196391
17597a96391J5037J92379J86816k16801j32999o0890J84098O9232M0734j26362
$$ -196391 -181354 11025 197841 -18960 -151959 -212849 -28751 40481 81215 -45147
17587d5147j78207j3948M1343Q512L1802J42546j32318k08991M9248J81793M7644
$$ -45147 -223354 -237302 -195959 -187447 -155645 -13099 -145417 -354408 -305160 -123367 -75723
17576g5723J71476K47971K0405k81443q8413K05651P6549j86357j68795N0811
$$ -75723 95753 343724 364129 82686 -5727 199924 276473 90116 -78679 -27868
17566b7868R934q2610k98826K75990L70180J66865j58446k34221J6703O928m6557
$$ -27868 -17934 -100544 -399370 -123380 246800 413665 255219 20998 37701 44629 -1928
17555a928K1029J32056m1165o3835K18035k4230J2824k5604R1795K8173l15618
$$ -1928 19101 151157 109992 46157 264192 239962 252786 227182 318977 347150 31532
17544C1532m9677r024J3870N9893J07669J95196k2772j82102K3322j26464k8760
$$ 31532 -18145 -27169 -13299 46594 154263 349459 326687 144585 167907 41443 12683
17533A2683j27369J0516k8753J40195J6127J21874J04897r5108k81539J0142J00520
$$ 12683 -114686 -104170 -132923 7272 23399 145273 250170 155062 -126477 -116335 -15815
17522a5815k77364Q5751J90031j25214p2066O8326k2002Q0487j97975k75101j5909
$$ -15815 -293179 -207428 -17397 -142611 -214677 -146351 -168353 -87866 -285841 -560942 -576851
17511e76851L81916L36261n9833k92757O3753O3563N6991L39358j41257k02557
$$ -576851 -194935 141326 81493 -211264 -147511 -83948 -26957 312401 171144 -31413
17501c1413K077J30321J13826j06995j60052p8596K01537n3779r7285k16713O2395
$$ -31413 -29336 100985 214811 107816 -52236 -130832 70705 16926 -80359 -297072 -234677
17490b34677J43585n888O0120o7460L7562K22956l5953O1842l10837r6024p3279
$$ -234677 -91092 -96980 -36860 -104320 -66758 156198 120245 182087 -128750 -224774 -298053
17479b98053J91051J38082j07080N0172J3428k5786j70922Q9561J09641n9264
$$ -298053 -107002 31080 -76000 -25828 -12400 -38186 -209108 -119547 -9906 -69170
17469f9170k4136j95607l6807o8314J02176K55982m4926j41554k29750K18919
$$ -69170 -93306 -288913 -325720 -394034 -291858 -35876 -80802 -222356 -452106 -233187
17459b33187R1835P2645l7478J08693J31699Q1312L4032r124K47200O9965j86246
$$ -233187 -141352 -68707 -106185 2508 134207 215519 249551 240427 487627 557592 371346
17448C71346m20188j45357j14526J17601j77193j11669j51236j56146J97196K74171
$$ 371346 -48842 -194199 -308725 -191124 -368317 -479986 -631222 -787368 -590172 -316001
17438c16001J70223M3740o6737N9710k5903l2173l7517L9851K14226P8751o2011
$$ -316001 -145778 -102038 -168775 -109065 -134968 -167141 -204658 -164807 49419 128170 66159
17427F6159j33671J03890k01456j13604l6499q1523N34394L32507l0694p2426
$$ 66159 -67512 36378 -165078 -278682 -315181 -396704 137690 470197 439503 367077
17417C67077k82790j62932K44109J44641k69403l19846l0161j57649Q9812R4037
$$ 367077 84287 -78645 165464 310105 40702 -279144 -309305 -466954 -377142 -283105
17407b83105j00276o6280J81652J86355n3433q3410K95766K1317o5305Q1683k7022
$$ -283105 -383381 -449661 -268009 -81654 -135087 -218497 77269 98586 33281 114964 87942
17396H7942J4918j96276j15025J88572J58818o6253q0778k50664N6736n0832p405
$$ 87942 102860 -93416 -208441 -19869 138949 72696 -8082 -258746 -202010 -252842 -260247
17385b60247n7950J28659J45727n6189p0754J67744m2426j12269O9028n0808o1645
$$ -260247 -318197 -189538 -43811 -100000 -170754 -3010 -45436 -157705 -88677 -139485 -201130
17374b01130J80261N2356K6031J2314k16515k78921q3232K01510J9527k1455j5133
$$ -201130 -20869 31487 57518 69832 -146683 -425604 -508836 -307326 -287799 -309254 -324387
17363c24387n989Q4944K4133M0025K7199R1200K81922K0078m29271k95693J67933
$$ -324387 -330376 -245432 -221299 -181274 -154075 -62875 219047 239125 -190146 -485839 -317906
17352c17906K66279L01675j13414j49127j82274J10897J05513J05365j87288j64678
$$ -317906 -51627 250048 136634 -12493 -194767 -83870 21643 127008 -60280 -224958
17342b24958J05378r9929j8987Q2191K23658J2061k3802J7642k21825r1676J11516
$$ -224958 -119580 -219509 -238496 -156305 67353 79414 55612 73254 -148571 -240247 -128731
17331a28731j4192j14282J72275o4626m4190J79475M3502M4270n577j11691j10436
$$ -128731 -142923 -257205 -84930 -149556 -193746 -14271 29231 73501 67924 -43767 -154203
17320a54203J78172j13027m8341R3600q1455J4638K02462j5774j55949L13771
$$ -154203 23969 -89058 -137399 -43799 -125254 -110616 91846 76072 -79877 233894
17310B33894L4957j8856j86152k1447J19811J93747L6446n2067m6761L2476q6560
$$ 233894 268851 249995 63843 42396 162207 355954 392400 340333 293572 326048 239488
17299B39488P6474J52930M3246j08374q883j50125k94754l52785J79575L16529
$$ 239488 315962 468892 512138 403764 394881 244756 -49998 -402783 -223208 93321
17289I3321j24601p2047j52108J45580K97045R1246j03993k46167j18434n9743
$$ 93321 -31280 -103327 -255435 -109855 187190 278436 174443 -71724 -190158 -249901
17279b49901J13918P755P9351n7928m9680n80J03574K47606j20546j29733j07749
$$ -249901 -135983 -128228 -48877 -106805 -156485 -157065 -53491 194115 73569 -56164 -163913
17268a63913p7725R346m7793j99130j02110J54724l3181j57205R6308L12886K29868
$$ -163913 -241638 -232292 -280085 -479215 -581325 -426601 -459782 -616987 -520679 -207793 22075
17257B2075k26521j03290p0048L9886J52833L1288j00516q0055J92324J4174j48960
$$ 22075 -204446 -307736 -377784 -337898 -185065 -153777 -254293 -334348 -142024 -127850 -276810
17246b76810q6382M4938O2633j04032k2662J26246J02251l8374l1236K44996n2095
$$ -276810 -363192 -318254 -255621 -359653 -382315 -256069 -153818 -192192 -223428 21568 -30527
17235c0527J83952r5932k37581q4965J5720J53592J4318k16483J00279K4432j3474
$$ -30527 153425 57493 -180088 -265053 -249333 -95741 -81423 -297906 -197627 -173195 -186669
17224a86669L1613Q6391j64068J17657J29530j70986K5623J41233J19662M9257
$$ -186669 -155056 -68665 -232733 -115076 14454 -156532 -130909 10324 129986 179243
17214A79243K01528j31856j5553j30505q7742l23314j45996J24326K2930j10683
$$ 179243 380771 248915 233362 102857 15115 -308199 -454195 -329869 -306939 -417622
17204d17622J61696R9229l19116j05976L4497J27711K58289J77642j0299j02413
$$ -417622 -255926 -156697 -475813 -581789 -547292 -419581 -161292 16350 6051 -96362
17194i6362k46130M8052L07659K88786j31529J07365r6599k4365j21569r2039
$$ -96362 -342492 -294440 13219 302005 170476 277841 181242 156877 35308 -56731
17184e6731j36744O307J92823J77279N1411k51740k46237j04769k5311n2371j58956
$$ -56731 -193475 -187168 5655 182934 234345 -17395 -263632 -368401 -393712 -446083 -605039
17173f05039K57167n3944K8311K42429K34576l2542j82767j95125K04863l128
$$ -605039 -347872 -401816 -373505 -131076 103500 70958 -111809 -306934 -102071 -105199
17163a05199J41044J73092K6810L1870j0437j55238J42518l1372j27614N4136
$$ -105199 35845 208937 235747 267617 257180 101942 244460 213088 85474 139610
17153A39610K64292J05652j58758k28241j93776l4846n3694m1700q8592J797j0863
$$ 139610 403902 509554 350796 122555 -71221 -106067 -159761 -201461 -290053 -288256 -299119
17142b99119K61823J98460J50013Q769j53133j32694l1797N9436K8974q4785J01933
$$ -299119 -37296 161164 311177 319946 166813 34119 2322 61758 90732 5947 107880
17131A07880J71572m1689k43861p5586R2603K4834j46438q4440j64177n1077K01400
$$ 107880 279452 237763 -6098 -81684 10919 35753 -110685 -195125 -359302 -410379 -208979
17120b08979J63674j24793r4388l6369N6633J407R262J84556j27020j54521L6020
$$ -208979 -45305 -170098 -264486 -300855 -244222 -242815 -233553 -48997 -176017 -330538 -294518
17109b94518k336j46767o6375j17636j9759K62485J58904n1355L4473j78920n3796
$$ -294518 -296854 -443621 -509996 -627632 -647391 -384906 -226002 -277357 -242884 -421804 -475600
17098d75600R0545K10940M9683J09673J20360R0296J17768l02890l15371P3535
$$ -475600 -385055 -174115 -124432 -14759 105601 195897 313665 10775 -304596 -231061
17088b31061R1442j47859K98321R7545K46790j10075j5694K2664q2799k6865n9783
$$ -231061 -139619 -287478 10843 108388 355178 245103 229409 252073 169274 142409 82626
17077H2626O276j5915n3252P395j31360M89j41056l8350Q4583J76305j96392j50924
$$ 82626 88902 72987 19735 27130 -104230 -103741 -244797 -283147 -198564 -22259 -218651 -369575
17065c69575O4421R6793l3754o2355N9140j58645P100K11772n3979p6735J51196
$$ -369575 -305154 -208361 -242115 -304470 -245330 -403975 -396875 -185103 -239082 -315817 -164621
17054a64621r1873j97195J56782J15520p976Q3770R0499J11860M7758j57606j51673
$$ -164621 -256494 -453689 -296907 -181387 -189363 -105593 -15094 96766 144524 -13082 -164755
17043a64755J53633K50840r8870J5452n6910l1194j3614Q4343K4085k23932j48420
$$ -164755 -11122 239718 140848 156300 99390 68196 54582 138925 163010 -60922 -209342
17032b09342j79201J972L53019P5355q4521L5168L6404P6341P0095m6712n2376
$$ -209342 -388543 -386571 -33552 41803 -42718 -7550 28854 105195 175290 128578 76202
17021G6202j89212j51393P0727Q4442R7307L5696j13057O1702j27271j33992M7624
$$ 76202 -113010 -264403 -193676 -109234 -11927 23769 -89288 -27586 -154857 -288849 -241225
17010b41225p2008K22771P5950l2504k27602R5450K49006m7269J26955J09630
$$ -241225 -313233 -90462 -14512 -47016 -274618 -179168 69838 22569 149524 259154
17000B59154j04588j33749k05710N7657R2317n1582P2853J76503r3654j96779
$$ 259154 154566 20817 -184893 -127236 -34919 -86501 -13648 162855 69201 -127578
16990a27578N4549J51034M7054r3799L4903J1j08186m688r8069q372J92871J1415
$$ -127578 -73029 78005 125059 31260 66163 66174 -42012 -46700 -144769 -153141 39730 51145
16978E1145k51334p4695K21171P7436J4351J36781n3467r4935K76108Q0477J3761
$$ 51145 -200189 -274884 -53713 23723 38074 174855 121388 26453 302561 383038 396799
16967C96799k01742k36371o2481n9288J46184j93137q9891P1791K29258J6316
$$ 396799 195057 -41314 -103795 -163083 -16899 -210036 -299927 -228136 1122 17438
16957A7438p2259j82274o9931N4283N8143R4829k6824L8697O6570j81867M1054
$$ 17438 -54821 -237095 -307026 -252743 -194600 -99771 -126595 -87898 -21328 -203195 -162141
16946a62141K64246O579j64758k6514J77628j22954J9744J06853l29262k09433
$$ -162141 102105 108684 -56074 -82588 95040 -27914 -8170 98683 -230579 -440012
16936d40012K76830J12380j370j55907k68425K20595J52782J60467j21503j21374
$$ -440012 -163182 -50802 -52172 -208079 -476504 -255909 -103127 57340 -64163 -185537
16926a85537P5399J03957O1917j33259j97482m089J33525q6306Q18j22647K47142
$$ -185537 -110138 -6181 55736 -77523 -275005 -279094 -145569 -231875 -231057 -353704 -106562
16915a06562K40122k17107Q3247n0475l1437M14646K97685k20149l22709j61236
$$ -106562 133560 -83547 -300 -50775 -82212 332434 630119 409970 87261 -73975
16905g3975K22295J37325k45531j34530k82421j01683K36996M71383L18357j26567
$$ -73975 148320 285645 40114 -94416 -376837 -478520 -241524 229859 548216 421649
16895D21649l58236k04410K62472J82208k65680j99531N4256M7759k01270R502
$$ 421649 63413 -140997 121475 303683 38003 -161528 -107272 -59513 -260783 -251281
16885b51281Q6058l4614L64110K78549j35171k9117O935q9447j11134J42197j54892
$$ -251281 -165223 -199837 164273 442822 307651 278534 285469 196022 84888 227085 72193
16874G2193j19865k872j10757j31227J17024M3184l9564q2136N4236J19405j31824
$$ 72193 -47672 -50544 -161301 -292528 -175504 -132320 -171884 -254020 -199784 -80379 -212203
16863b12203J39777J72779N5927k53876l17603q254J69371n8299j05641P7014
$$ -212203 -72426 100353 156280 -97596 -415199 -423453 -254082 -312381 -418022 -341008
16853c41008O8179N3325M5770M7328J6571q5529R2286r5183n8543J55009J2574
$$ -341008 -272829 -219504 -173734 -126406 -109835 -195364 -103078 -198261 -256804 -101795 -89221
16842h9221j87984J8962L4979J96237L16378J54483K5011j24614l96192m33919
$$ -89221 -277205 -258243 -223264 -27027 289351 443834 468845 344231 -51961 -485880
16832d85880j01001J70645J62694j49164M3629K60538K0389l07103O852R0098
$$ -485880 -586881 -416236 -253542 -402706 -359077 -98539 -78150 -385253 -378401 -288303
16822b88303N390L80687l7069j45765j7097o6193j53595J43290m1876k125J91746
$$ -288303 -282913 97774 60705 -85060 -102157 -168350 -321945 -178655 -220531 -222656 -30910
16811c0910J77345Q1201j86238k33764j21277L12q8152M7745j5633N3335J21897
$$ -30910 146435 227636 41398 -192366 -313643 -313331 -401483 -353738 -369371 -316036 -194139
16800a94139L1791R9275R9806J70234r882l68101L337K00014j27091K9315J89523
$$ -194139 -162348 -63073 36733 206967 197085 -171016 -167679 32335 -94756 -65441 124082
16789A24082N2043k35074j45762O7503J57474J279p9565J73225j83831j17801
$$ 124082 176125 -58949 -204711 -137208 20266 21545 -58020 115205 -68626 -186427
16779a86427J64932O5132l54296q9360L12390K55901m3135k72197P6487J65413
$$ -186427 -21495 43637 -310659 -400019 -87629 168272 125137 -147060 -70573 94840
16769I4840O459n6274j58108k12583q430J04239R6728K43936P7624j4888j20518
$$ 94840 101299 45025 -113083 -325666 -334096 -229857 -133129 110807 188431 173543 53025
16758E3025m962J12406n8063k7704j55905o0348r8985j4371O8350P5033k46385
$$ 53025 48063 160469 102406 74702 -81203 -141551 -240536 -254907 -186557 -111524 -357909
16747c57909L4083j1996Q3797R0364j63727j7017J03017J7504N3370k15733J59116
$$ -357909 -323826 -335822 -252025 -161661 -325388 -342405 -239388 -221884 -168514 -384247 -225131
16736b25131K86147j69982l07658j70691J95744K61163L533K24658j7731j76678
$$ -225131 61016 -108966 -416624 -587315 -391571 -130408 -126875 97783 80052 -96626
16726i6626l3322j16105J07377Q6791j4775j38044J36658O4311k40086n6595K27817
$$ -96626 -129948 -246053 -138676 -51885 -66660 -204704 -68046 -3735 -243821 -300416 -72599
16715g2599K91l7111K9353k0848M9107q5460j66414j35160K12323K20169j07217
$$ -72599 -72308 -109419 -80066 -100914 -51807 -137267 -303681 -438841 -226518 -6349 -113566
16704a13566r6535K25117K5577P7950K9857k22080j40624j66649m618L15919o8538
$$ -113566 -210101 15016 40593 118543 148400 -73680 -214304 -380953 -385571 -69652 -138190
16693a38190k46991K68374J80757j97842k77338j75750K10725K58586M4306J49576
$$ -138190 -385181 -116807 63950 -133892 -411230 -586980 -376255 -117669 -73363 76213
16683G6213j03155K3781M3975j27222j57105O6254r1225o6336k71212q3651K13002
$$ 76213 -26942 -3161 40814 -86408 -243513 -177259 -268484 -334820 -606032 -689683 -476681
16672d76681K20341J17626l3835K56177P6849l14554N9760M1160J0632o8955N6429
$$ -476681 -256340 -138714 -172549 83628 160477 -154077 -94317 -53157 -42525 -111480 -55051
16661e5051k6281J47960R9203j98991k67794l6942M50338K4095k6562j39044k31278
$$ -55051 -81332 66628 165831 -33160 -300954 -337896 112442 136537 109975 -29069 -260347
16650b60347j30033J3447K02770L60404J96440J30508L2499k47546P0125K5422
$$ -260347 -390380 -376933 -174163 186241 382681 513189 545688 298142 368267 393689
16640C93689k87730j37877k2325L6938K33178j17117j66554j7978J77575J37020
$$ 393689 105959 -31918 -54243 -17305 215873 98756 -67798 -85776 91799 228819
16630B28819l6776J2692N9700k33521j30135Q0267J73149O5059j80480J4601k02363
$$ 228819 192043 204735 264435 30914 -99221 -18954 154195 219254 38774 53375 -148988
16619a48988j34889J44576L27243K53813J4027k24758l83608q9399K24721Q2845
$$ -148988 -283877 -139301 187942 441755 455782 231024 -152584 -241983 -17262 65583
16609F5583j7537j8248L2863J01649j14276j91264q4614k56663j10793J34681
$$ 65583 48046 29798 62661 164310 50034 -141230 -225844 -482507 -593300 -458619
16599d58619Q9277K28758J40421R3146K7501j17734o1961K4014J31157J42383
$$ -458619 -369342 -140584 -163 92983 120484 2750 -59211 -35197 95960 238343
16589B38343j5376R5068j06841k6005P6235L9925k12318j04814L2651R5212j13372
$$ 238343 222967 318035 211194 185189 261424 301349 89031 -15783 16868 112080 -1292
16578a292r3697r2706J98597J60655o1345N6293J4906q1080k21015j02355k2915
$$ -1292 -94989 -187695 10902 171557 110212 166505 181411 100331 -120684 -223039 -245954
16567b45954M4765j3219M5786Q6573Q2110J05487m867m7450O2n9677k8835q6815
$$ -245954 -201189 -214408 -168622 -82049 61 105548 100681 53231 53293 -6384 -35219 -122034
16555a22034N3535K83405r5380m32642J3990L12392m327o0687N6624m7619j9897
$$ -122034 -68499 214906 119526 -313116 -299126 13266 8939 -51748 4876 -42743 -62640
16544f2640j87551j19856j5815K4616O9950M2280L08023J44134M1353Q6931k18442
$$ -62640 -250191 -370047 -385862 -361246 -291296 -249016 59007 203141 244494 331425 112983
16533A12983k68680r7611n2241l947O4312K04045J83345q8029k00133J36797J47470
$$ 112983 -155697 -253308 -305549 -309496 -245184 -41139 142206 54177 -145956 -9159 138311
16522A38311L51P7875l06752J3101J97298Q8313J72158J42038q9699j3724j39621
$$ 138311 138662 216537 -90215 -77114 120184 208497 380655 522693 432994 419270 279649
16511B79649l7226R9626J38845K1145K0592l60105l17241R553o4876o748M0213
$$ 279649 242423 342049 480894 502039 522631 162526 -154715 -145162 -210038 -216786 -176573
16500a76573J41052p4498M7161K58673n518l21535k07707R884j74285O8577J05527
$$ -176573 -35521 -110019 -62858 195815 190297 -131238 -338945 -329061 -503346 -434769 -329242
16489c29242K08651r6696j59674J41763L71798K34294p1139j84949m3910J58415
$$ -329242 -120591 -217287 -376961 -235198 136600 370894 299755 114806 70896 229311
16479B29311N9777p2311j58077R5192l6458q593j80094j52310M339r6373P1366
$$ 229311 289088 216777 58700 153892 117434 108841 -71253 -223563 -219224 -315597 -244231
16468b44231j13095J31917j03517j64125L8390J92764K02362J88285J52202l56201
$$ -244231 -357326 -225409 -328926 -493051 -454661 -261897 -59535 128750 280952 -75249
16458g5249j43218O0679J34862j40493J54095o9178k30280k6652K4479o728J56309
$$ -75249 -218467 -157788 -22926 -163419 -9324 -78502 -308782 -335434 -310955 -317683 -161374
16447a61374l2853J10177L3295K93l17903j55586J88146P8421j28541J3861K69009
$$ -161374 -194227 -84050 -50755 -50462 -368365 -523951 -335805 -257384 -385925 -372064 -103055
16436a03055R3600j82670j09876l3635J34322O33544P6236j83094l04585k13385
$$ -103055 -9455 -192125 -302001 -335636 -201314 432230 508466 325372 20787 -192598
16426a92598q3061J3559J05527J44857N4211j30716O4388J37743j8034L3126q4790
$$ -192598 -275659 -262100 -156573 -11716 42495 -88221 -23833 113910 95876 129002 44212
16415D4212p1074l1180n9579J19503N7393l48288N8949j03609o6721k04071J72354
$$ 44212 -26862 -58042 -117621 1882 59275 -289013 -230064 -333673 -400394 -604465 -432111
16404d32111M38997p1898l1943K92163J77895m0562k11561j67065j22730o9304
$$ -432111 6886 -65012 -96955 195208 373103 332541 120980 -46085 -168815 -238119
16394b38119J37502K28511l9539j09129k28681j00042j06826m3317m2434J71062
$$ -238119 -100617 127894 88355 -20774 -249455 -349497 -456323 -499640 -542074 -371012
16384c71012R0696P1597m731j20953j04953R629m2586J29424J98470j00784j35525
$$ -371012 -280316 -208719 -213450 -334403 -439356 -429727 -472313 -342889 -144419 -245203 -380728
16373c80728J04226J20753J95396P4771M4660l23187j73085j8357l5999P8854
$$ -380728 -276502 -155749 39647 114418 159078 -164109 -337194 -355551 -391550 -312696
16363c12696N7508K6604o5952o742J37069K81726J21869j51651j00201k569m5214
$$ -312696 -255188 -228584 -294536 -301278 -164209 117517 239386 87735 -12466 -15035 -60249
16352f0249j8538J41165N8798q0322j67077l4810r8101M7264K20846J19835J29840
$$ -60249 -78787 62378 121176 40854 -126223 -161033 -259134 -211870 8976 128811 258651
16341B58651N6505j45906p8525l9749J48045J8480J04690j15525J5185J16012
$$ 258651 315156 169250 90725 50976 199021 217501 322191 206666 221851 337863
16331C37863q0740l62389j74565o315m844J09208J58410L92697M3807k93454j35146
$$ 337863 257123 -105266 -279831 -286146 -290990 -181782 -23372 369325 413132 119678 -15468
16320a5468P1842k02470j61091K2158L38662K91262J00562l5873k28354j28306
$$ -15468 56374 -146096 -307187 -285029 53633 344895 445457 409584 181230 52924
16310E2924J16241n9127n2531m4218j51643j29157J63020J06265O70j29309j78666
$$ 52924 169165 110038 57507 13289 -138354 -267511 -104491 1774 2444 -126865 -305531
16299c05531k13892p6958L14320L51939l8984J38834J61236k04608j4256N9241
$$ -305531 -519423 -596381 -282061 69878 30894 169728 330964 126356 112100 171341
16289A71341k05316p5095l3331J05599J84403J37134L2912j05668J27238o9978
$$ 171341 -33975 -109070 -142401 -36802 147601 284735 317647 211979 339217 269239
16279B69239l50500k69643K28180J5959q6814J9444q785P1580Q5139J87740j35436
$$ 269239 -81261 -350904 -122724 -106765 -193579 -174135 -182920 -111340 -26201 161539 26103
16268B6103j06361L8492l42862j86805K57493K40491k93292K7287j7352J069R4549
$$ 26103 -80258 -41766 -384628 -571433 -313940 -73449 -366741 -339454 -356806 -355737 -261188
16257b61188P3081K32629J61864Q9052j38057j38545K7082l7065n5648n9309O3134
$$ -261188 -188107 44522 206386 295438 157381 18836 45918 8853 -46795 -106104 -42970
16246d2970j03554j18472M5405J24825J76807n0400M241n7235r4743k42173j71041
$$ -42970 -146524 -264996 -219591 -94766 82041 31641 35882 -21353 -116096 -358269 -529310
16235e29310J37066M24877J79404J28179M1065q820k47478r9258k24123k59107
$$ -529310 -392244 32633 212037 340216 381281 372461 124983 25725 -198398 -457505
16225d57505O9623N6285J21019L08381o2065L0447J4984j32947N9386J92832j07710
$$ -457505 -387882 -331597 -210578 97803 35738 66185 81169 -51778 7608 200440 92730
16214I2730m4034M0759R7398m2698M7049j4819k82640j07311p9725J42511J57501
$$ 92730 48696 89455 186853 144155 191204 176385 -106255 -213566 -293291 -150780 6721
16203F721N449n7671j77739j51527J05801P3656k7635J18171p9771j37207l7042
$$ 6721 12170 -45501 -223240 -374767 -268966 -195310 -222945 -104774 -184545 -321752 -358794
16192c58794O2980j6619R336M7819J1903N5418J00091M0368J9957P5004l2508
$$ -358794 -295814 -312433 -303097 -255278 -243375 -187957 -87866 -47498 -27541 47463 14955
16181A4955O2083O9197J52454j29518j02598N3194j12400p7677N436J32245M9449
$$ 14955 77038 146235 298689 169171 66573 119767 7367 -70310 -64874 67371 116820
16170A16820j24923j52929J58073Q0053m5073k50340k36501J2262J29791N2946
$$ 116820 -8103 -161032 -2959 77094 32021 -218319 -454820 -442558 -312767 -259821
16160b59821N5546J45167J31090K70824p8342j96144P2906J88959K3044L9154
$$ -259821 -204275 -59108 71982 342806 264464 68320 141226 330185 353229 392383
16150C92383j95574r5574j30630Q7647k6290O6179J34141q1247J74264p6433j96313
$$ 392383 196809 101235 -29395 58252 31962 98141 232282 151035 325299 248866 52553
16139E2553l0636j23473J16939M2993O1095j13964j76948j11791J1689N8744M2019
$$ 52553 21917 -101556 15383 58376 119471 5507 -171441 -283232 -271543 -212799 -170780
16128a70780K3596q848J2504Q1428J99382l2070R3809j02760k4073o8993p0138
$$ -170780 -147184 -156032 -143528 -62100 137282 105212 199021 96261 72188 3195 -66943
16117f6943j17560O792k4752R3258K40569K66864o3870j43982j56611m3960Q6967
$$ -66943 -184503 -177711 -202463 -109205 131364 398228 334358 190376 33765 -10195 76772
16106G6772j41161n9954p6803p4470k26211M1246L79338o807j16416J09492K8228
$$ 76772 -64389 -124343 -201146 -275616 -501827 -460581 -81243 -88050 -204466 -94974 -66746
16095f6746j51916k11176l241J16337m0696j16937J45429M63186J67656l08365
$$ -66746 -218662 -429838 -433079 -316742 -357438 -474375 -328946 134240 301896 -6469
16085f469p3452R6173j13130j44038j5721K40681J53086j89614k22354j2413k1028
$$ -6469 -79921 16252 -96878 -240916 -256637 -15956 137130 -52484 -274838 -287251 -308279
16074c08279K9089J0397J9173K23619J83843N9107J9053q0807k39001j6573O6794
$$ -308279 -279190 -268793 -249620 -26001 157842 216949 236002 155195 -83806 -100379 -33585
16063c3585j79501p9127J24416o4425Q1609P8822J10969Q0931k28823k57146J21854
$$ -33585 -213086 -292213 -167797 -232222 -150613 -71791 39178 120109 -108714 -365860 -244006
16052b44006N3002J50459P511K66097Q2034n298J5978P6357j66638k04364M9677
$$ -244006 -191004 -40545 -33034 233063 315097 309799 325777 402134 235496 31132 80809
16041H0809p3202p2215P2850Q6562Q7918j00117L2424q1721j22907N268m9372
$$ 80809 7607 -64608 8242 94804 182722 82605 115029 33308 -89599 -84331 -133703
16030a33703p626n313N7531L4932j75547l0497J80565J8192J52284K7219j08029
$$ -133703 -141329 -146642 -89111 -54179 -229726 -260223 -79658 -61466 90818 118037 10008
16019A0008n8449J24492p8705j52679K7696J74448L17248K08364l6178j38720
$$ 10008 -48441 76051 -2654 -155333 -127637 46811 364059 572423 536245 397525
16009C97525j58409j09272R8024J31610k51849m8567L90179J15284k40876k04227
$$ 397525 239116 129844 227868 359478 107629 59062 449241 564525 323649 119422
15999A19422J0728J76428k5730l04943L6916r5171M0596L705J47209m3142k035
$$ 119422 130150 306578 280848 -24095 12821 -82350 -41754 -38049 109160 66018 63983
15988F3983J13368q7124R7077K9861l47258k66566j16668J24297J90993j04133
$$ 63983 177351 90227 187304 217165 -130093 -396659 -513327 -389030 -198037 -302170
15978c02170j26588P8934J6214j08433p6861J15831m6003J3428K28739O6022m4246
$$ -302170 -428758 -349824 -333610 -442043 -518904 -403073 -449076 -435648 -206909 -140887 -185133
15967a85133N4540p795Q2601K5411R1249J39956j36224j05017m9L23324L2447
$$ -185133 -130593 -138388 -55787 -30376 60873 200829 64605 -40412 -40461 282863 315310
15956C15310k14830j60739k39016q5121M0631R778N71O5899J8107j70331J12482
$$ 315310 100480 -60259 -299275 -384396 -343765 -333987 -333416 -267517 -249410 -419741 -307259
15945c07259P1070L35807J84038j25801k15202N318j27975k66160j80997m1284
$$ -307259 -236189 99618 283656 157855 -57347 -52029 -180004 -446164 -627161 -668445
15935f68445N5069K93074q5290O4426Q5568j49713k75248L5682J97316R2536N4863
$$ -668445 -613376 -320302 -405592 -341166 -255598 -405311 -680559 -644877 -447561 -355025 -300162
15924c00162J5179P6959L29081j61211l19860J01801R1565J36879n8382L3140
$$ -300162 -284983 -208024 121057 -40154 -360014 -258213 -166648 -29769 -88151 -55011
15914e5011K21546j43552p3070J4253j83866j14391L78224L46906j07881j22184
$$ -55011 166535 22983 -50087 -35834 -219700 -334091 44133 391039 283158 160974
15904A60974o7956J2903j25445m0632L13485O2973M8542n0619j90096Q7972L3478
$$ 160974 93018 105921 -19524 -60156 253329 316302 364844 314225 124129 212101 245579
15893B45579J405j6970n6476j73053j16921p0954P9124j20177j44578L00255J67876
$$ 245579 246984 230014 173538 485 -116436 -187390 -108266 -228443 -373021 -72766 95110
15882I5110j67391R3399M7290j40300k0072K67268J78921j93158l67827r428N8516
$$ 95110 -72281 21118 68408 -71892 -91964 175304 354225 161067 -206760 -216188 -157672
15871a57672r0592j9901R7420j40144l1108N2020j46354K13106M0346n572L2046
$$ -157672 -248264 -268165 -170745 -310889 -341997 -289977 -436331 -223225 -182879 -188451 -156405
15860a56405Q5653j75869l6060J01573j06275n7136J25183m2888M9614K5787q6446
$$ -156405 -70752 -246621 -282681 -181108 -287383 -344519 -219336 -262224 -212610 -186823 -273269
15849b73269j7679J40759j2434o6580J87902q8158n6969M3254j1441q892J25228
$$ -273269 -290948 -150189 -162623 -229203 -41301 -129459 -186428 -143174 -154615 -163507 -38279
15838c8279N171j22253j87041K8046J78893J37745o6818j4254N1317k21673j63593
$$ -38279 -33108 -155361 -342402 -314356 -135463 2282 -64536 -78790 -27473 -249146 -412739
15827d12739J89259K94566K85580m1531Q655j99621k92628j64710J5696N6237
$$ -412739 -223480 71086 356666 315135 323790 124169 -168459 -333169 -317473 -261236
15817b61236J96456j53652l78927N4524L62869J00340k99687J26691J19828J2022
$$ -261236 -64780 -218432 -597359 -542835 -179966 -79626 -379313 -252622 -132794 -120772
15807a20772k896N6388Q8365L0325K7033q2229J25176l7159K35034K621j13383
$$ -120772 -123668 -67280 21085 51410 78443 -3786 121390 84231 319265 321886 208503
15796B08503J25994j91502q9648R7230M8473j8629k49189k12635J46301K28686
$$ 208503 334497 142995 53347 150577 199050 180421 -68768 -281403 -135102 93584
15786I3584J19734o9416q6979l91085J57037J71984k29375J62052J16457l06845
$$ 93584 213318 143902 56923 -334162 -177125 -5141 -234516 -72464 43993 -262852
15776b62852j21459j441K423K69064o8013N9069J93816p2107j79460M4184J06607
$$ -262852 -384311 -385752 -383329 -114265 -182278 -123209 70607 -1500 -180960 -136776 -30169
15765c0169L4338O0220j55095J13525l3622j6903m0971j84222j1691J20085j12634
$$ -30169 4169 64389 -90706 22819 -10803 -27706 -68677 -252899 -264590 -144505 -257139
15754b57139N2169n1815J21037P4195K2217N0401k8948k22746l1030k2235J25092
$$ -257139 -204970 -256785 -135748 -61553 -39336 11065 -17883 -240629 -271659 -293894 -168802
15743a68802k441j66143l0159K44747J19429j73532J90364j3571R8157q6482l0095
$$ -168802 -171243 -337386 -367545 -122798 -3369 -176901 13463 -108 98049 11567 -18528
15732a8528l3769J9277M1166J68819j98361q7760n4106M2429K4534P7131K04963
$$ -18528 -52297 -33020 8146 176965 -21396 -109156 -163262 -120833 -96299 -19168 185795
15721A85795m50587l77318K00355O930R4878K49575Q6512k5653J22107n6075N2743
$$ 185795 -264792 -642110 -441755 -434825 -339947 -90372 -3860 -29513 92594 36519 89262
15710H9262j22737j69519m3725j76829J8755K49158k2068j08405L4418R8514O1314
$$ 89262 -33475 -202994 -246719 -423548 -404793 -155635 -177703 -286108 -251690 -153176 -91862
15699i1862q8732N1292o1456M7362J05881M4890J41766j2460j43441o2492K14527
$$ -91862 -180594 -129302 -190758 -143396 -37515 7375 149141 136681 -6760 -69252 145275
15688A45275K00014q5389o3516j76312j13018q9258R3330J05657j19952k7867
$$ 145275 345289 259900 196384 20072 -92946 -182204 -88874 16783 -103169 -131036
15678a31036q5090M8315K52320N1095l3343l6465K14114l39766l6845l7833J87718
$$ -131036 -216126 -167811 84509 135604 102261 65796 279910 -59856 -96701 -134534 53184
15667E3184j81810j90167J16981K89919R8266O1701j64809n1236n8200m1465O755
$$ 53184 -128626 -318793 -201812 88107 186373 248074 83265 32029 -26171 -67636 -60881
15656f0881J25258J7201l63592j16385l19601p357K37845l0611R8428J19809K0470
$$ -60881 64377 81578 -282014 -398399 -718000 -725357 -487512 -518123 -419695 -299886 -279416
15645b79416J89256K47578j99412k13890K8509n7120r084O6596J92200R1482N6504
$$ -279416 -90160 157418 -41994 -255884 -227375 -284495 -293579 -226983 -34783 56699 113203
15634A13203j81650J72179l7946o9446K771k71515n4053K54355M1553j79378j63044
$$ 113203 -68447 103732 65786 -3660 -889 -272404 -326457 -72102 -30549 -209927 -372971
15623c72971M0906L47463L3020j10169J21278j36614m316k27806k73251L5283
$$ -372971 -332065 15398 48418 -61751 59527 -77087 -81403 -309209 -582460 -547177
15613e47177J51955m6367P6613K06275L3011j37385j4497Q6055j12702J38127
$$ -547177 -395222 -441589 -364976 -158701 -125690 -263075 -277572 -191517 -304219 -166092
15603a66092j65892J4651J81410L04978J44757j77434k86341k0045K3232Q7649
$$ -166092 -331984 -317333 -135923 169055 313812 136378 -149963 -170008 -146776 -59127
15593e9127K82111O4707K10740k0879j42027m90136m1336N7866j10045K4288l8601
$$ -59127 222984 287691 498431 477552 335525 -154611 -195947 -138081 -248126 -223838 -262439
15582b62439K4018K15668k1617p4151J32327K09904n1308J56683j12544p9698
$$ -262439 -238421 -22753 -44370 -118521 13806 223710 172402 329085 216541 136843
15572A36843l0623J342q1473k29671k18024N0662K22750M0002q971n1130J31471
$$ 136843 106220 107562 26089 -203582 -421606 -370944 -148194 -108192 -117163 -168293 -36822
15561c6822O5678J36576o7066r9636L4253m4302r6883P7025K2728k1589q4024
$$ -36822 28856 165432 98366 -1270 32983 -11319 -108202 -31177 -8449 -30038 -114062
15550a14062j40379M8951M20115p9617J4073m4834j30894Q2388P7469k43997j54277
$$ -114062 -254441 -205490 214625 135008 149081 104247 -26647 55741 133210 -110787 -265064
15539b65064j38829N8898L05335J33090r2919m3314J00222l6589j04727l01994
$$ -265064 -403893 -344995 -39660 93430 511 -42803 57419 20830 -83897 -385891
15529c85891O772L15939K80599L43o2423k9140l06315k91759j12315l5550j9410
$$ -385891 -379119 -63180 217419 217762 155339 126199 -180116 -471875 -584190 -619740 -639150
15518f39150R5172m7638J31893K99494J24436k07293p9808O6695J79472P4141
$$ -639150 -543978 -591616 -459723 -160229 -35793 -243086 -322894 -256199 -76727 -2586
15508b586J76129K4663j01194j33918k77746j22672k15581Q0921K16927j3636
$$ -2586 173543 198206 97012 -36906 -314652 -437324 -652905 -571984 -355057 -368693
15498c68693J55863K06242J54010o480p2663r7132J1383j15444j51715R6346J26326
$$ -368693 -212830 -6588 147422 140942 68279 -28853 -17470 -132914 -284629 -188283 -61957
15487f1957K2008M4492p0112j36284j00253o051J02416j5642P2908J44207J36893
$$ -61957 -39949 4543 -65569 -201853 -302106 -308157 -205741 -221383 -148475 -4268 132625
15476A32625m2538P8325k14147l15702j42313r7713l2130R1831J72843o8949J6081
$$ 132625 90087 168412 -45735 -361437 -503750 -601463 -633593 -541762 -368919 -437868 -421787
15465d21787J93862J16663j9718k17592j19833J02675o8262M0787Q2393L14105
$$ -421787 -227925 -111262 -130980 -348572 -468405 -365730 -433992 -393205 -310812 3293
15455C293k3983J73587K89973j00456q5764q6909r326j50388J13632J53107j359
$$ 3293 -20690 152897 442870 342414 256650 169741 160415 10027 123659 276766 275407
15444B75407l274q171j28241j81565j92685J15633K76374k62057j17631N8239
$$ 275407 272133 263962 135721 -45844 -238529 -122896 153478 -108579 -226210 -167971
15434a67971N2069K8733J2464M9143J83462L01207k0569j75003k27380k58938
$$ -167971 -115902 -87169 -74705 -25562 157900 459107 438538 263535 36155 -222783
15424b22783J37902M2942j87437R9439K5099M263J2368q5551J87363P1092j45818
$$ -222783 -84881 -41939 -229376 -129937 -104838 -100575 -88207 -173758 13605 84697 -61121
15413f1121P3500j6167J44409J44423j99006j47269K753n490j11245q8574K45394
$$ -61121 12379 -3788 140621 285044 86038 -61231 -58478 -63968 -175213 -263787 -18393
15402a8393P7756N39j15881k23601K9907j6480k2967O1663j62804o2662K47520
$$ -18393 59363 59902 -55979 -279580 -249673 -266153 -289120 -227457 -390261 -452923 -205403
15391b05403M3334j21897K09642J73587q7268j37498j30485j57162k0364q817
$$ -205403 -162069 -283966 -74324 99263 11995 -125503 -255988 -413150 -433514 -442331
15381d42331J45255K28157P9638J29802k35414m2512n8299J8225k1638p9912l72043
$$ -442331 -297076 -68919 10719 140521 -94893 -137405 -195704 -177479 -199117 -279029 -651072
15370f51072q9083L12873L91122L5284K2816j78170j40537P0419J49603K47623
$$ -651072 -740155 -427282 -36160 -876 21940 -156230 -296767 -226348 -76745 170878
15360A70878N3166o6559K3129K7913p7226l14838J97374J92822l1841j28773j22858
$$ 170878 224044 157485 180614 208527 131301 -183537 13837 206659 174818 46045 -76813
15349g6813k3750J34433J9128J10294J49820m30500j17537O6459N9370J42539
$$ -76813 -100563 33870 52998 163292 313112 -117388 -234925 -168466 -109096 33443
15339C3443K15392k28583j07737k41408l4836M6538O2779L8822K21840K05767
$$ 33443 248835 20252 -87485 -328893 -363729 -317191 -254412 -215590 6250 212017
15329B12017q5706k05428K75842K38j52821n9916k1098j32111N0687Q4198o0424
$$ 212017 126311 -79117 196725 196963 44142 -15774 -36872 -168983 -118296 -34098 -94522
15318i4522k00726n7815k36607N6025J2475P2999J30951O9386o7353j08698K26865
$$ -94522 -295248 -353063 -589670 -533645 -521170 -448171 -317220 -247834 -315187 -423885 -197020
15307a97020L17223L87687J07704k67948k18730j67524m37784k26990L0826j6810
$$ -197020 120203 507890 615594 347646 128916 -38608 -476392 -703382 -672556 -689366
15297f89366J547P4050R3605K51999K78605j28213J50850J7994n1058r3397J8091
$$ -689366 -687819 -613769 -520164 -268165 10440 -117773 33077 51071 13 -93384 -75293
15286g5293N6512J28349k89007L7589k4444k00262j97197K25277K54598N5333
$$ -75293 -18781 109568 -179439 -141850 -166294 -366556 -563753 -338476 -83878 -28545
15276b8545O8801L9631r9082J50003j80650L2636O5567j07510j23579n5550l2863
$$ -28545 40256 79887 -19195 130808 -49842 -17206 48361 -59149 -182728 -238278 -271141
15265b71141O3542k77245j89352J17440p5640j85533k88987L26617K51356J26250
$$ -271141 -207599 -484844 -674196 -556756 -632396 -817929 -1106916 -780299 -528943 -402693
15255d02693j34608J3226n0820Q5504l6591J55639K37881o5202L58J32100o7411
$$ -402693 -537301 -524075 -574895 -489391 -525982 -370343 -132462 -197664 -197306 -65206 -132617
15244a32617J25190M9960n0191k21802j17558l372J72040J88480K10601J60776
$$ -132617 -7427 42533 -7658 -229460 -347018 -350390 -178350 10130 220731 381507
15234C81507O9834m2472j72425o0248J9495m76000k75653M68989J37207j79766
$$ 381507 451341 408869 236444 176196 195691 -280309 -555962 -86973 50234 -129532
15224a29532k7404O7777j16507J55948k7469k2331Q3020N4471O4773q6135M8418
$$ -129532 -156936 -89159 -205666 -49718 -77187 -99518 -16498 37973 102746 16611 65029
15213F5029p9981o1173l05497J93529K63439j10675l8358J55018J43114K8046
$$ 65029 -14952 -76125 -381622 -188093 75346 -35329 -73687 81331 224445 252491
15203B52491k81068r5698L90746K90447j52973q3586K8100O8113j37487N3533
$$ 252491 -28577 -124275 266471 556918 403945 320359 348459 416572 279085 332618
15193C32618J70956j41458l17970l68371j82351J87311K09168J16154J10162r6959
$$ 332618 503574 362116 44146 -324225 -506576 -319265 -110097 6057 116219 19260
15183A9260k20714j4785j16130O3506J65653L9720m0282K30165N9837O5408O0188
$$ 19260 -201454 -216239 -332369 -268863 -103210 -63490 -103772 126393 186230 251638 311826
15172C11826l11130p1637l7921k04527j13745K55523J81205j75315j04994l8623
$$ 311826 696 -70941 -108862 -313389 -427134 -171611 9594 -165721 -270715 -309338
15162c09338Q8880j09985l3042J07278n7541k8856K86114K23982N9967o431j12091
$$ -309338 -220458 -330443 -363485 -256207 -313748 -342604 -56490 167492 227459 221028 108937
15151A08937J39743J18812J02803J32154k52437j54669M6014M5030M1458j68393
$$ 108937 248680 367492 470295 602449 350012 195343 241357 286387 327845 159452
15141A59452m61557L3156J32577O4573n1314P2867J8022k3997n4268n5037O082
$$ 159452 -302105 -268949 -136372 -71799 -123113 -50246 -32224 -56221 -110489 -165526 -159444
15130a59444P7592J2451j23730L3896j01057J59666K51149j11990j58249m6215
$$ -159444 -81852 -69401 -193131 -159235 -260292 -100626 150523 38533 -119716 -165931
15120a65931O9446o4030m0519K30681l5195o8762J35666j36965j31542q8123M2483
$$ -165931 -96485 -160515 -201034 29647 -5548 -74310 61356 -75609 -207151 -295274 -252791
15109b52791K56276M8296l01802j4043j5284k70495J70214K60018M7050R4351
$$ -252791 3485 51781 -250021 -264064 -279348 -549843 -379629 -119611 -72561 21790
15099B1790R2521M4638J45053j1867j67610L6309J83319J62591l9468k61644j98074
$$ 21790 114311 158949 304002 292135 124525 160834 344153 506744 467276 205632 7558
15088G558j55734j92835q0497J07155J6861J41540O3420L2775j4447n8778j0038
$$ 7558 -148176 -341011 -421508 -314353 -297492 -155952 -92532 -59757 -74204 -132982 -143020
15077a43020R2249j22521j62744J59491j68012j40975L6708j60495Q4749K34330
$$ -143020 -50771 -173292 -336036 -176545 -344557 -485532 -448824 -609319 -524570 -290240
15067b90240O0243J10385j81367l24527J86241K75618K71478k1293j68011K08860
$$ -290240 -229997 -119612 -300979 -625506 -439265 -163647 107831 86538 -81473 127387
15057A27387J61581l9881J7415r0392k03226l18834k2761k9527R8033L13496O9419
$$ 127387 288968 249087 266502 176110 -27116 -345950 -368711 -398238 -300205 13291 82710
15046H2710M5499r5822j13729O108R5851q64q8120P4070j22234K35128q871j71728
$$ 82710 128209 32387 -81342 -75234 20617 19753 -68367 5703 -116531 118597 109726 -62002
15034f2002J09113P052j28784p7384J46394K15742O7074j93739j73018L374K05389
$$ -62002 47111 54163 -74621 -152005 -5611 210131 277205 83466 -89552 -86178 119211
15023A19211L2228K2690k4846o9419J8538r0739m5270N1052k40004J29767p7401
$$ 119211 151439 174129 149283 79864 98402 7663 -37607 13445 -226559 -96792 -174193
15012a74193q9486K7477K86525l6783N7328j53909K2330j20815k41157j5504J68702
$$ -174193 -263679 -236202 50323 13540 70868 -83041 -60711 -181526 -422683 -438187 -269485
15001b69485J73042J69889J53786j08950k56844j08323l6661n900Q4402L1710
$$ -269485 -96443 73446 227232 118282 -138562 -246885 -283546 -289446 -205044 -173334
14991a73334P9967O3439m8987J17182J44863j4462j30523j59275R2775J59426
$$ -173334 -93367 -29928 -78915 38267 183130 168668 38145 -121130 -28355 131071
14981A31071m3377j22529Q4398K8439j57953k01287J33695k6304M7763L34938
$$ 131071 87694 -34835 49563 78002 -79951 -281238 -147543 -173847 -126084 208854
14971B08854J70652k0794j39412j87059k03396J3890R4157J25943O1162l9276
$$ 208854 379506 358712 219300 32241 -171155 -157265 -63108 62835 123997 84721
14961H4721P6528j81413k46522J63355L7835k04662R2097k4996J29153J30011
$$ 84721 161249 -20164 -266686 -103331 -65496 -270158 -178061 -203057 -73904 56107
14951E6107L8758r5419k78246J10501J19108l2708p8801l8650L818K04997M9067
$$ 56107 94865 -554 -278800 -168299 -49191 -81899 -160700 -199350 -195532 9465 58532
14940E8532l9922N8342r043O9368k01366p7795o4354j19725O9772L49528m8509
$$ 58532 18610 76952 67909 137277 -64089 -141884 -206238 -325963 -256191 93337 44828
14929D4828K0778N7863J5453K7687J87829k55382j82497j06436j61140j06815
$$ 44828 65606 123469 138922 166609 354438 99056 -83441 -189877 -351017 -457832
14919d57832K50993K04627N1637j5778p4551M4508m3539k18232j56760O9619K77225
$$ -457832 -206839 -2212 49425 33647 -40904 3604 -39935 -258167 -414927 -345308 -68083
14908f8083r0716o5231k8462j82999L9558r2541k24624o476M88396J56280M3506
$$ -68083 -158799 -224030 -252492 -435491 -395933 -488474 -713098 -719574 -231178 -74898 -31392
14897c1392J831k21513O9844L9984K04095j16346r6651K7548L5168K6898m9031
$$ -31392 -29561 -251074 -181230 -141246 62849 -53497 -150148 -122600 -87432 -60534 -109565
14886a09565J12577L8293N2771K5289j3971m0313J05015n2336j70027k52024j63924
$$ -109565 3012 41305 94076 119365 105394 65081 170096 117760 -52267 -304291 -468215
14875d68215K48309K33515K201k80820m3296K13083P966r3706k2057J16056Q2875
$$ -468215 -219906 13609 15810 -265010 -308306 -95223 -87257 -180963 -203020 -86964 -4089
14864d089j59644j95820j34080J4282K91083K44185j2468o6387j74513m6257J95225
$$ -4089 -163733 -359553 -493633 -479351 -188268 55917 43449 -22938 -197451 -243708 -48483
14853d8483n7537N3959n0583k90229L8264K0998N4903J80013J79874n5880j11988
$$ -48483 -106020 -52061 -102644 -392873 -354609 -333611 -278708 -98695 81179 25299 -86689
14842h6689J62378K5914o7530o6937R0911k95614q8822n764Q5135J16566P4696
$$ -86689 75689 101603 34073 -32864 58047 -237567 -326389 -332153 -247018 -130452 -55756
14831e5756J49893J69785q754o2849K1719j07717j54067N7556j95804j51030P3829
$$ -55756 94137 263922 255168 192319 214038 106321 -47746 9810 -185994 -337024 -263195
14820b63195L8002N6043J890j0681J95783l5564M13r4273n4410P1877j6310j1439
$$ -263195 -225193 -169150 -167260 -177941 17842 -17722 -17309 -111582 -165992 -94115 -110425 -121864
14808a21864K84332R6713m29808J22807Q8558L5210J30585m6166o8790j014k11370
$$ -121864 162468 259181 -170627 -47820 40738 75948 206533 160367 91577 90563 -120807
14797a20807j74480J39560J81017M231j85813l16360j00983N1894J21132N3554
$$ -120807 -295287 -155727 25290 29521 -156292 -472652 -573635 -521741 -400609 -347055
14787c47055J31353L802K39636J79012J80195k8912k60637n6765M5052j73061
$$ -347055 -215702 -211900 27736 206748 386943 358031 97394 40629 85681 -87380
14777h7380J6566K60839K5133n709j10462q7495k10839J5751M7540n5418K93946
$$ -87380 -70814 190025 215158 209449 98987 11492 -199347 -183596 -136056 -191474 102472
14766A02472o9847J2361K7324q483j81734j12737l7057l622q5485k0J90912K48164
$$ 102472 32625 44986 72310 63827 -117907 -230644 -267701 -271323 -356808 -356828 -165916 82248
14754H2248J43619P2538m5239l52951l953l8378j35436l4393N6427M9284q2844
$$ 82248 225867 298405 253166 -99785 -103738 -142116 -277552 -311945 -255518 -206234 -289078
14743b89078q6186R3323n2254o3864k4494q445R828m2970n2144K73670K26745
$$ -289078 -375264 -281941 -334195 -398059 -422553 -430998 -421170 -464140 -516284 -242614 -15869
14732a5869M278k24815m12415k0134K9702o2792J66704Q1229P1343K24068j1758
$$ -15869 -11591 -236406 -648821 -668955 -639253 -702045 -535341 -454112 -382769 -158701 -170459
14721a70459J46741o0625j88007j13231K0353J94592Q3524k6904j79413k3355
$$ -170459 -23718 -84343 -272350 -385581 -365228 -170636 -87112 -114016 -293429 -316784
14711c16784K8620k4186m8660L01554K05102q0002k85206J77718r4405j70311
$$ -316784 -288164 -312350 -361010 -59456 145646 65644 -219562 -41844 -136249 -306560
14701c06560J0196J22054q1212J5093J82539o6207k56098k30496l9150J82296
$$ -306560 -296364 -174310 -255522 -240429 -57890 -124097 -380195 -610691 -649841 -467545
14691d67545M30138K63373j29689l1703j48170j27549j07671L3496L13823k127
$$ -467545 -37407 225966 96277 64574 -83596 -211145 -318816 -285320 28503 26376
14681B6376l3470l8189o9936O0953Q8375k4764J33819J39932j63476k82399j37767
$$ 26376 -7094 -45283 -115219 -54266 34109 9345 143164 283096 119620 -162779 -300546
14670c00546p0089Q1102J78811N2331o1006J83614J51987K51334n7064j78678
$$ -300546 -370635 -289533 -110722 -58391 -119397 64217 216204 467538 410474 231796
14660B31796j17014r573l8138O8620o1887j00986l33083r0430M15199J92174Q1157
$$ 231796 114782 105209 67071 135691 73804 -27182 -360265 -450695 -35496 156678 237835
14649B37835j54662K65434n9049l34510J7706j59354k0167k50574J61232J86514
$$ 237835 83173 348607 289558 -44952 -27246 -186600 -206767 -457341 -296109 -109595
14639a09595P1879O407j38091K92474l8403L8000N5864o3024j36100L34189N1817
$$ -109595 -37716 -31309 -169400 123074 84671 122671 178535 115511 -20589 313600 365417
14628C65417n2817k19983k39978o4943K34684K38420J59453J57458k40980r5558
$$ 365417 312600 92617 -147361 -212304 22380 260800 420253 577711 336731 241173
14618B41173j61669k1267q7285j0925p7652J7223j48764j976J2148Q8547j24120
$$ 241173 79504 58237 -29048 -39973 -117625 -100402 -249166 -251142 -238994 -150447 -274567
14607b74567Q6273M19641j4100j05511p9308R9872N2180k24120R714j9808j53688
$$ -274567 -188294 231347 217247 111736 32428 132300 184480 -39640 -29926 -49734 -203422
14596b03422j5916j06964n0948J45083M50367P0559k5450j19026j41737J13640
$$ -203422 -219338 -326302 -377250 -232167 218200 288759 263309 144283 2546 116186
14586A16186k8463j93249p8172M01026O4327l36945l28004k49859O4712J67639
$$ 116186 87723 -105526 -183698 217328 281655 -55290 -383294 -633153 -568441 -400802
14576d00802L27315R9390j16834m3343n653L0899O7846J16173j78822k19426j46756
$$ -400802 -73487 25903 -90931 -134274 -139927 -109028 -41182 74991 -103831 -323257 -470013
14565d70013K10683K71284n9718r7682p9094J54670M8970j05776p0343J01214
$$ -470013 -259330 11954 -47764 -145446 -224540 -69870 -20900 -126676 -197019 -95805
14555i5805K13162K913q3582l6841j38233l4201J77674j55587J44981Q8114K20361
$$ -95805 117357 120270 36688 -153 -138386 -172587 5087 -150500 -5519 82595 302956
$$ [...]
##END NTUPLES=NMR SPECTRUM
##END=
