##TITLE=Analysis number 316013
Compound Code ac 40197
Project Code adrs
Chemist Name shaunh
##JCAMPDX= 6.0         $$ Bruker NMR JCAMP-DX V2.0
##DATA TYPE= NMR SPECTRUM
##DATA CLASS= NTUPLES
##ORIGIN= Bruker BioSpin GmbH
##OWNER= NMR
$$ XWIN-NMR		Version 3.5
$$ Tue Dec 13 13:43:34 2005 GMT Standard Time (UT+0h)  MAYBRIDGE\NMR@NMR_250MHZ
##.OBSERVE FREQUENCY= 250.131544655141
##.OBSERVE NUCLEUS= ^1H
##.ACQUISITION MODE= SIMULTANEOUS (DQD)
##.ACQUISITION SCHEME= undefined
##.AVERAGES= 16
##.DIGITISER RES= 18
##SPECTROMETER/DATA SYSTEM= dpx250
##.PULSE SEQUENCE= zg30
##.SOLVENT NAME= DMSO
##.SHIFT REFERENCE= (INTERNAL, DMSO, 0, 16.522)
##AUDIT TRAIL= $$ (NUMBER, WHEN, WHO, WHERE, WHAT)
$$ ##TITLE= Audit trail, XWIN-NMR		Version 3.5
$$ ##JCAMPDX= 5.01
$$ ##ORIGIN= Bruker BioSpin GmbH
$$ ##OWNER= NMR
$$ C:\u/data/dgb/nmr/ADRS/13770/pdata/1/auditp.txt
$$ ##AUDIT TRAIL=  $$ (NUMBER, WHEN, WHO, WHERE, WHAT)
(   1,<2005-12-13 13:43:10.85 +000>,<MAYBRIDGE\NMR>,<NMR_250MHZ>,
      <created by zg, POWCHK disabled, PULCHK disabled
       configuration hash MD5:
       62 19 C7 07 E1 42 D1 B7 37 6C 3D D0 77 39 F9 E6
       data hash MD5: 64K
       1A B3 78 B9 EF 9E 78 5A C8 77 C3 32 84 F9 00 94>)
(   2,<2005-12-13 13:43:25.61 +000>,<MAYBRIDGE\NMR>,<NMR_250MHZ>,
      <Start of raw data processing
       ef LB = 0.3 FT_mod = 6 PKNL = 1 SI = 32K 
       data hash MD5: 32K
       78 7E FC 10 44 05 E9 16 C0 9F 30 3E 62 0E C2 9D>)
(   3,<2005-12-13 13:43:27.41 +000>,<MAYBRIDGE\NMR>,<NMR_250MHZ>,
      <apk 
       data hash MD5: 32K
       5A 24 F6 84 2D 4D 7B 98 38 D7 D5 FF AD CE A8 75>)
(   4,<2005-12-13 13:43:28.46 +000>,<MAYBRIDGE\NMR>,<NMR_250MHZ>,
      <abs ABSG = 5 
       data hash MD5: 32K
       21 8B D0 85 58 4C 4F 5C E8 41 FC EF 15 82 4B 49>)
$$ ##END=
$$ 
$$ hash MD5
$$ C7 22 A4 6A 2B 0C 70 70 05 E5 57 01 30 8A CF B8
##$RELAX= 
##$RELAX= 
##$RELAX= 
##$RELAX= 
##$RELAX= 
##$RELAX= 
##$RELAX= 
$$ Bruker specific parameters
$$ --------------------------
##$DU= <C:\u>
##$EXPNO= 13770
##$NAME= <ADRS>
##$PROCNO= 1
##$TYPE= <nmr>
##$USER= <dgb>
##$AMP= (0..31)
100 100 100 100 100 100 100 100 100 100 100 100 100 100 100 100 100 100 
100 100 100 100 100 100 100 100 100 100 100 100 100 100 
##$AQSEQ= 0
##$AQ_mod= 3
##$AUNM= <au_zg>
##$AUTOPOS= <40 >
##$BF1= 250.13
##$BF2= 250.13
##$BF3= 250.13
##$BF4= 250.13
##$BF5= 500.13
##$BF6= 500.13
##$BF7= 500.13
##$BF8= 500.13
##$BYTORDA= 1
##$CFDGTYP= 0
##$CFRGTYP= 5
##$CHEMSTR= <none>
##$CNST= (0..31)
1 1 145 1 1 1 1 1 1 1 1 1 1 1 1 1 1 1 1 1 1 1 1 1 1 1 1 1 1 1 1 1 
##$CPDPRG= <>
##$CPDPRG1= <>
##$CPDPRG2= <>
##$CPDPRG3= <>
##$CPDPRG4= <mlev>
##$CPDPRG5= <mlev>
##$CPDPRG6= <mlev>
##$CPDPRG7= <mlev>
##$CPDPRG8= <mlev>
##$CPDPRGB= <>
##$CPDPRGT= <>
##$D= (0..31)
0 1 0 0 0 0 0 0 0 0.06 0 0 0 0 0 0 0.0002 0 0 0 0 0 0 0 0 0 0 0 0 0 0 
0 
##$DATE= 1134481389
##$DBL= (0..7)
120 120 120 120 120 120 120 120 
##$DBP= (0..7)
150 150 150 150 150 150 150 150 
##$DBP07= 0
##$DBPNAM0= <>
##$DBPNAM1= <>
##$DBPNAM2= <>
$$ [...]
##$SUBNAM7= <"">
##$SUBNAM8= <"">
##$SUBNAM9= <"">
##$SW= 20.6930455092707
##$SWIBOX= (0..15)
0 0 3 0 0 0 0 0 0 0 0 0 0 0 0 0 
##$SW_h= 5175.983436853
##$TD= 65536
##$TD0= 1
##$TE= 294.16
##$TE2= 300
##$TE3= 300
##$TEG= 300
##$TL= (0..7)
0 120 120 120 120 120 120 120 
##$TP= (0..7)
150 150 150 150 150 150 150 150 
##$TP07= 0
##$TPNAME0= <>
##$TPNAME1= <>
##$TPNAME2= <>
##$TPNAME3= <>
##$TPNAME4= <>
##$TPNAME5= <>
##$TPNAME6= <>
##$TPNAME7= <>
##$TPOAL= (0..7)
0.5 0.5 0.5 0.5 0.5 0.5 0.5 0.5 
##$TPOFFS= (0..7)
0 0 0 0 0 0 0 0 
##$TUNHIN= 0
##$TUNHOUT= 0
##$TUNXOUT= 0
##$USERA1= <user>
##$USERA2= <user>
##$USERA3= <user>
##$USERA4= <user>
##$USERA5= <user>
##$V9= 5
##$VALIST= <valist>
##$VCLIST= <CCCCCCCCCCCCCCC>
##$VD= 0
##$VDLIST= <DDDDDDDDDDDDDDD>
##$VPLIST= <PPPPPPPPPPPPPPP>
##$VTLIST= <TTTTTTTTTTTTTTT>
##$WBST= 1024
##$WBSW= 4
##$XGAIN= (0..3)
0 0 0 0 
##$XL= 0
##$YL= 0
##$YMAX_a= 455842
##$YMIN_a= -493943
##$ZGOPTNS= <>
##$ZL1= 120
##$ZL2= 120
##$ZL3= 120
##$ZL4= 120
##$ABSF1= 16.522
##$ABSF2= -4.171173
##$ABSG= 5
##$ABSL= 3
##$ALPHA= 0
##$AQORDER= 0
##$ASSFAC= 0
##$ASSFACI= 0
##$ASSFACX= 0
##$ASSWID= 0
##$AUNMP= <proc_1d>
##$AZFE= 0.1
##$AZFW= 0.1
##$BCFW= 0
##$BC_mod= 0
##$BYTORDP= 0
##$COROFFS= 0
##$CY= 12.5
##$DATMOD= 1
##$DC= 0
##$DFILT= <>
##$DTYPP= 0
##$F1P= 14.0000005364418
##$F2P= -0.99999901652339
##$FCOR= 0.5
##$FTSIZE= 32768
##$FT_mod= 6
##$GAMMA= 0
##$GB= 0
##$INTBC= 1
##$INTSCL= 1
##$ISEN= 128
##$LB= 0.3
##$LEV0= 0
##$LPBIN= 0
##$MAXI= 10000
##$MC2= 0
##$MEAN= 0
##$ME_mod= 0
##$MI= 0
##$NCOEF= 0
##$NC_proc= -4
##$NLEV= 6
##$NOISF1= 0
##$NOISF2= 0
##$NSP= 0
##$NTH_PI= 0
##$NZP= 0
##$OFFSET= 16.522
##$PC= 1
##$PHC0= 77.78185
##$PHC1= 6.562925
##$PH_mod= 1
##$PKNL= yes
##$PPARMOD= 0
##$PSCAL= 4
##$PSIGN= 0
##$REVERSE= no
##$SF= 250.13
##$SI= 32768
##$SIGF1= 0
##$SIGF2= 0
##$SINO= 400
##$SIOLD= 32768
##$SREGLST= <1H.DMSO>
##$SSB= 0
##$STSI= 32768
##$STSR= 0
##$SW_p= 5175.98343685301
##$SYMM= 0
##$S_DEV= 0
##$TDeff= 65536
##$TDoff= 0
##$TI= <Analysis number 999999
Compound Code 99
Book Reference 9
Project Code 9>
##$TILT= no
##$TM1= 0
##$TM2= 0
##$TOPLEV= 0
##$USERP1= <user>
##$USERP2= <user>
##$USERP3= <user>
##$USERP4= <user>
##$USERP5= <user>
##$WDW= 1
##$XDIM= 32768
##$YMAX_p= 291389607
##$YMIN_p= -382600
$$ End of Bruker specific parameters
$$ ---------------------------------
##NTUPLES= NMR SPECTRUM
##VAR_NAME=  FREQUENCY,     SPECTRUM/REAL,   SPECTRUM/IMAG
##SYMBOL=    X,             R,               I
##VAR_TYPE=  INDEPENDENT,   DEPENDENT,       DEPENDENT
##VAR_FORM=  AFFN,          ASDF,            ASDF
##VAR_DIM=   32768,         32768,           32768
##UNITS=     HZ,            ARBITRARY UNITS, ARBITRARY UNITS
##FACTOR=    0.157963299565203, 1,           1
##FIRST=     4132.6476996994, 0,             0
##LAST=      -1043.33573715361, 0,           0
##MIN=       -1043.33573715361, -382600,     0
##MAX=       4132.6476996994, 291389607,     0
$$ Real data points
##PAGE= N=1
##DATA TABLE= (X++(R..R)), XYDATA
$$ [...]
$$ plain form
23369 -7781 -73450 -40151 26 40634 116936 175805 197315 186682 115369 -2229 24620 94708
23357 94708 62878 -8270 -31623 -26371 32108 -49907 -113895 -11155 22028 -5456 -91584 -73269
23345 -73269 -29923 -136948 -244307 -199773 -163897 -125593 -119086 -82867 -115134 -114905 -118124 -33537
23333 -33537 -15765 -35589 -17132 -15306 -9665 6056 19341 -61566 -128066 -188055 -146898 -182668
23321 -182668 -107535 -25775 19210 293 -38190 -74777 -51339 -57635 -68330 -58523 -78319 -156373
23309 -156373 -133205 -37620 55679 37744 25187 22066 31181 18427 81075 88781 52797 36688
23297 36688 29522 28589 31391 23338 13056 56999 74039 96047 31064 -47050 -52869 -57364 -160434
23284 -160434 -121143 -81736 -8063 -33159 -28107 14392 -31434 -45589 -57864 -53285 -67397 -80954
$$ packed form
23369g781o5669L3299M0177M0608P6302N8869K1510j0633p1313j17598K6849P0088
23357I4708l1830p1148k3353N252N8479q2015o3988J02740L3183k7484q6128J8315
23345g3269M3346j07025j07359M4534L5876L8304O507L6219l2267K29l219Q4587
23333c3537J7772j9824J8457J826N641J5721J3285q0907o6500n9989M1157l5770
23321a82668P5133Q1760M4985j8917l8483l6587K3438o296j0695R807j9796p8054
23309a56373K3168R5585R3299j7935j2557l121R115j2754O2648P706l5984j6109
23297C6688p166r33K802q053j0282M3943J7040K2008o4983p8114n819m495j03070
23284a60434L9291L9407P3673k5096N052M2499m5826j4155j2275M579j4112j3557
$$ plain form
23272 -80954 -60059 -53832 -13385 4334 170 -31537 -62833 -37361 -139362 -159490 -142142 -143849
23260 -143849 -172104 -148122 -119357 -3056 11923 -16003 25165 56544 45733 -16682 -72742
23249 -72742 -21553 12123 -68053 -58373 -107246 -109610 -17851 37014 59896 46418 108587 77482
23237 77482 -39835 -81465 -67771 -107955 -187582 -163953 -66505 910 -4380 -4686 -33901 -23688
23225 -23688 -65450 -71381 -47056 40515 74242 31071 -41083 -75161 -76971 -121277 -144359 -158668
23213 -158668 -67524 -112336 -165805 -194340 -112894 -68818 -111124 -99871 -90268 -70235 -60421 -150558
23201 -150558 -124548 -49603 61004 51074 -7530 -18450 -30672 -7696 58815 160469 85720
23190 85720 -41253 -25176 -8859 -6990 90323 120467 21843 4169 73403 85477 -35476
$$ packed form
23272h0954K0895O227M0447J7719m164l1707l1296K5472j02001k0128J7348j707
23260a43849k8255K3982K8765J16301J4979k7926M1168L1379j0811o2415n6060
23249g2742N1189L3676q0176R680m8873k364R1759N4865K2882j3478O2169l1105
23237G7482j17317m1630J3694m0184p9627K3629R7448O7415n290l06k9215J0213
23225b3688m1762n931K4325Q7571L3727m3171p2154l4078j810m4306k3082j4309
23213a58668R1144m4812n3469k8535Q1446M4076m2306J1253R603K0033R814r0137
23201a50558K6010P4945J10607r930n8604j0920j2222K2976O6511J01654p4749
23190H5720j26973J6077J6317J869R7313L0144r8624j7674O9234J2074j20953
$$ plain form
23179 -35476 -42336 -29109 -127493 -42222 74344 -50250 -122999 -47303 -3851 4531 -12144 15203
23167 15203 22753 63539 98257 77750 -1044 -40240 4138 -15432 -91045 -127740 -108886 -37047
23155 -37047 3336 32435 103500 111729 37632 32269 -44045 -106169 -119894 -125929 -83502 -110862
23143 -110862 -145952 -139320 -172948 -159762 -126351 -61030 -77044 -113037 -93410 -97170 -102749 -36180
23131 -36180 54335 96729 76238 -200 108218 77816 -11644 4545 111355 112668 126584
23120 126584 64140 19740 24134 96268 -26462 -100238 -42657 -37466 -8033 27776 19808 -10662
23108 -10662 -49339 23449 49420 88716 103308 65787 -31266 -58313 52989 104987 59147
23097 59147 42815 19872 15994 71214 46368 2264 -56767 -35042 -295 -52141 -47816 -36583
$$ packed form
23179c5476o860J3227r8384Q5271J16566j24594p2749P5696M3452Q382j6675K7347
23167A5203P550M0786L4718k0507p8794l9196M4378j9570p5613l6695J8854P1839
23155c7047M0383K9099P1065Q229p4097n363p6314o2124j3725o035M2427k7360
23143a10862l5090O632l3628J3186L3411O5321j6014l5993J9627l760n579O6569
23131c6180R0515M2394k0491p6438J08418l0402q9460J6189J06810J313J3916
23120A26584o2444m4400M394P2134j22730p3776N7581N191K9433L5809p968l0470
23108a0662l8677P2788K5971L9296J4592l7521r7053k7047J11302N1998m5840
23097E9147j6332k2943l878N5220k4846m4104n9031K1725L4747n1846M325J1233
$$ plain form
23085 -36583 -7026 -15282 -31518 -35070 -34568 -8010 -26420 -104195 -92480 -9857 -55879 -326
23073 -326 -8978 -79779 -2466 -6792 -43537 -45482 22341 31722 2461 -50530 -89499 -84704 -98471
23060 -98471 -109788 -59081 -53632 -118731 -143163 -123458 -60542 -38653 -44714 -94845 -151779 -64951
23048 -64951 -65470 33669 130288 70888 47222 80750 64924 43843 -9438 121439 137755 67848
23036 67848 27377 15271 -41514 -18457 -19486 -99686 -71098 -21573 -38709 7642 59382 156270
23024 156270 197092 103053 105610 94455 97639 90774 30437 -74818 -113312 -118354 -85455 -167478
23012 -167478 -132714 -35019 29531 39560 -50560 -25505 12664 -115614 -148995 -140435 -70352
23001 -70352 41305 61096 69208 57479 50911 -18704 29508 70171 23135 -22669 -107238 -89043
$$ packed form
23085c6583K9557q256j6236l552N02K6558j8410p7775J1715Q2623m6022N5553
23073c26q652p0801P7313m326l6745j945O7823R381k9261n2991l8969M795j3767
23060i8471j1317N0707N449o5099k4432J9705O2916K1889o061n0131n6934Q6828
23048f4951n19R9139R6619n9400k3666L3528j5826k1081n3281J30877J6316o9907
23036F7848m0471j2106n6785K3057j029q0200K8588M9525j7136M6351N1740R6888
23024A56270M0822r4039K557j1155L184o865o0337j05255l8494n042L2899q2023
23012a67478L4764R7695O4550J0029r0120K5055L8169j28278l3381Q560P0083
23001g0352J11657J9791Q112j1729o568o9615M8212M0663m7036m5804q4569J8195
$$ plain form
22989 -89043 -108072 -182514 -140617 -125027 -52649 64331 80910 73885 118242 120589 -49807 -93467
22977 -93467 -67623 -87984 -108338 -137885 -48697 -43506 -36125 -9034 -3174 -9880 -11899 8906 30801
22964 30801 6911 9851 4070 21602 51080 73625 30673 12277 57139 126621 62105 4878
22952 4878 -54429 -63232 -47594 34119 135414 96046 81925 80623 -6070 -93448 -37555 3269
22940 3269 -37807 -20913 -4719 73160 -44080 -166943 -112897 -145146 -135682 -99266 -162618 -219291
22928 -219291 -231403 -149603 -83908 -40391 -72465 -55394 -65487 -29528 -2468 -84035 -146997
22917 -146997 -123545 -136100 -119349 28843 50998 47392 41150 84426 52966 35770 25530 -17953
22905 -17953 -100004 -175723 -119461 -6250 17563 17464 4205 -24984 -48630 -8911 -5339 -25013
$$ packed form
22989h9043j9029p4442M1897J5590P2378J16980J6579p025M4357K347j70396m3660
22977i3467K5844k0361k0354k9547Q9188N191P381K7091N860o706k019K0805K1895
22964C0801k3890K940n781J7532K9478K2545m2952j8396M4862O9482o4516n7227
22952D878n9307q803J5638Q1713J01295l9368j4121j302q6693q7378N5893M0824
22940C269m1076J6894J6194P7879j17240j22863N4046l2249R464L6416o3352n6673
22928b19291j2112Q1800O5695M3517l2074J7071j0093L5959K7060q1567o2962
22917a46997K3452j2555J6751J48192K2155l606o242M3276l1460j7196j0240m3483
22905a7953q2051p5719N6262J13211K3813r9j3259k9189k3646L9719L572j9674
$$ plain form
22893 -25013 -79081 -116779 -124400 -55032 -34206 75907 189702 141735 106507 106427 48648 40288
22881 40288 21271 -29293 -26 20355 5541 40588 59414 17088 -13807 -16123 -25938 -5418
22869 -5418 -6472 20511 57707 62083 91384 87743 82526 66150 95078 4460 -106526 -119262
22857 -119262 -113444 -129684 -119475 -49241 -16988 1755 -53074 -53157 56161 79019 63884 97947
22845 97947 90597 21608 18160 30715 91033 73051 80404 49460 9209 -41243 -56083 -12807
22833 -12807 100128 151549 69886 54543 58993 -44055 -114412 -112713 -94000 -29210 -86854 -28048
22821 -28048 14127 89413 54415 21823 -21292 -2248 89046 107746 -7098 -100593 -147376
22810 -147376 -130493 -121092 -113128 -90330 -45401 -49397 -77328 -48635 -80991 -77395 -90852 -37430
$$ packed form
22893b5013n4068l7698p621O9368K0826J10113J13795m7967l5228q0n7779q360
22881D0288j9017n0564K9267K0381j4814L5047J8826m2326l0895k316r815K0520
22869e418j054K6983L7196M376K9301l641n217j6376K8928r0618j10986j2736
22857a19262N818j6240J0209P0234L2253J8743n4829q3J09318K2858j5135L4063
22845I7947p350o8989l448J2555O0318j7982P353l0944m0251n0452j4840M3276
22833a2807J12935N1421q1663j5343M450j03048p0357J699J8713O4790n7644N8806
22821b8048M2175P5286l4998l2592m3115J9044R1294J8700j14844r3495m6783
22810a47376J6883R401P964K2798M4929l996k7931K8693l2356L596j3457N3422
$$ plain form
22798 -37430 -19391 -89210 -139628 -75108 3488 11426 12110 -23584 11727 -49714 -93795 -81564
22786 -81564 -76030 -78832 781 85319 93343 85046 1823 -12209 78821 99347 65899 99074
22774 99074 124871 114008 50822 26027 77491 88806 50215 19993 4463 29821 41899 20906
22762 20906 -884 14523 47260 63536 12260 -86017 -157405 -80491 -8060 -38623 -38418 -26459
22750 -26459 -41030 -72085 -51761 -44924 -32235 -55780 -119515 -245303 -268721 -182736 -131609 -114982
22738 -114982 -123407 -121603 -133129 -101086 -100051 -8491 44332 107915 77406 62552 68122 23128
22726 23128 21903 52718 43753 58041 -36954 -52501 -80520 -99425 21314 10161 40638 -13913
22714 -13913 -49966 -80642 -118018 -89806 -92497 -17134 -4698 -90686 -155878 -229420 -191194 -129576
$$ packed form
22798c7430J8039o9819n0418O4520P8596P938O84l5694L5311o1441m4081J2231
22786h1564N534k802P9613Q4538Q024q297q3223j4032R1030K0526l3448L3175
22774I9074K5797j0863o3186k4795N1464J1315l8591l0222j5530K5358J2078k0993
22762B0906k1790J5407L2737J6276n1276r8277p1388P6914P2431l0563K05J1959
22750b6459j4571l1055K0324O837J2689k3545o3735j25788k3418Q5985N1127J6627
22738a14982q425J804j1526L2043J035R1560N2823O3583l0509j4854N570m4994
22726B3128j225L0815q965J4288r4995j5547k8019j8905J20739j1153L0477n4551
22714a3913l6053l0676l7376K8212k691P5363J2436q5988o5192p3542L8226O1618
$$ plain form
22702 -129576 -131832 -68486 -41687 9050 46690 69026 -28550 -66877 20981 107330 110840 72737
22690 72737 35129 27978 34676 -13622 -5458 -4279 -50550 -13229 -60836 -25064 -53577 -9883
22678 -9883 13136 39557 18302 40293 37848 9424 -14219 -26758 36830 68759 79862 35975
22666 35975 -154585 -161318 -97877 -55928 16249 40620 84318 72049 32301 -129 -58003 -72904
22654 -72904 -15008 57825 185618 153796 120649 68169 110834 70638 2738 16452 68879
22643 68879 47455 60837 19816 -45527 -53942 -33719 -44579 -22955 22926 -80815 -138755 -117655
22631 -117655 -143683 -162463 -154722 -74197 -81336 -141284 -130409 -46325 44586 51902 46034 31840
22619 31840 6361 40342 86196 132137 83825 -74115 -158229 -136341 -49783 -4346 14045
$$ packed form
22702a29576k256O3346K6799N0737L7640K2336r7576l8327Q7858Q6349L510l8103
22690G2737l7608p151O698m8298Q164J179m6271L7321m7607L5772k8513M3694
22678i883K3019K6421k1255K1991k445k8424k3643j2539O3588L1929J1103m3887
22666C5975j90560o733O3441M1949P2177K4371M3698j2269l9748l2430n7874j4901
22654g2904N7896P2833J27793l1822l3147n2480M2665m0196o7900J3714N2427
22643F8879k1424J3382m1021o5343q415K0223j0860K1624M5881j03741n7940K1100
22631a17655k6028j8780P741Q0525p139n9948J0875Q4084R0911P316n868j4194
22619C1840k5479L3981M5854M5941m8312j57940q4114K1888Q6558M5437J8391
$$ plain form
22608 14045 74655 67224 28527 -59163 -52290 -64871 -54203 35080 82999 77522 2244 32723
22596 32723 45750 71208 25296 22220 -19960 25300 105083 38290 -54295 -15364 20506 75022
22584 75022 64719 -50772 -51117 16658 34356 -49350 -16695 28016 66001 69335 16118 -13772
22572 -13772 -14074 20409 -23001 -95641 -116930 -84307 24229 -7508 -53650 -18414 -44294 -80989
22560 -80989 -32901 -35136 -29012 -76480 -83556 -59021 -43484 -51089 21653 69636 52484 22597
22548 22597 -96668 -46376 46890 -6644 4766 14546 -56359 -137372 -96143 14208 -15063
22537 -15063 -98177 -108798 -105643 -143146 -125919 -28015 52607 5999 36618 -19488 -56608 -69848
22525 -69848 -67301 -61525 -100291 -91771 -42081 60203 13165 -28919 -8374 -19920 -50698 -19984
$$ packed form
22608A4045O0610p431l8697q7690O873j2581J0668Q9283M7919n477p5278L0479
22596C2723J3027K5458m5912l076m2180M5260P9783o6793r2585L8931L5870N4516
22584G5022j0303j15491l45O7775J7698q3706L2655M4711L7985L334n3217k9890
22572a3772l02L4483m3410p2640k1289L2623J08536l1737m6142L5236k5880l6695
22560h0989M8088k235O124m7468p076K4535J5537p605P2742M7983j7152k9887
22548B2597j19265N0292R3266n3534J1410R780p0905q1013M1229J10351k9271
22537a5063q3114j0621L155l7503J7227R7904Q0622m6608L0619n6106l7120j3240
22525f9848K547N776l8766Q520M9690J02284m7038m2084K0545j1546l0778L0714
$$ plain form
22513 -19984 54828 101645 11446 -93035 -90102 -125102 -127045 -78941 -101816 -116349 -113514 -19475
22501 -19475 -5926 -78163 -135796 -129916 -94757 -112168 -50544 -36687 -86873 -75495 1514 60725
22489 60725 5916 56472 56330 -93897 -165558 -208549 -189913 -115252 -70611 -26587 -68503 -68579
22477 -68579 -93240 -136048 -219684 -154522 -42486 36850 81840 61483 76834 145005 38389
22466 38389 -19571 -22688 69008 129804 118686 40047 50088 -7460 -72639 -53789 47975 -1378
22454 -1378 -99167 -157154 -106761 -37763 -45866 18277 18194 -7424 82200 61294 126900 70899 53944
22441 53944 85790 42955 -6649 -99996 -269497 -234555 -86960 -111192 -48675 12709 -65982
22430 -65982 -79888 -155069 -153086 -162316 -131338 -118042 -117606 -94067 -79332 -99231 -66757 -29543
$$ packed form
22513a9984P4812M6817r0199j04481K933l5000j943M8104k2875j4533K835R4039
22501a9475J3549p2237n7633N880L5159j7411O1624J3857n0186J1378P7009N9211
22489F0725n4809N0556j42j50227p1661m2991J8636P4661M4641M4024m1916p6
22477f8579k4661m2808q3636O5162J12036P9336M4990k0357J5351O8171j06616
22466C8389n7960l117R1696O0796j1118p8639J0041n7548o5179J8850J01764m9353
22454a378r7789n7987N0393O8998q103O4143q3k5618Q9624k0906O5606n6001j6955
22441E3944L1846m2835m9604r3347j69501L4942J47595k4232O2517O1384p8691
22430f5982j3906p5181J983r230L0978J3296M36K3539J4735j9899L2474L7214
$$ plain form
22418 -29543 -82848 -46023 52539 135759 241646 237563 36556 37455 2932 -23346 -4417 1069
22406 1069 -20835 13093 66070 48944 -70273 -168025 -115935 -73315 -14832 24307 -7180 -36167
22394 -36167 -116142 -130521 -119385 -140785 -48473 67087 98874 50078 46116 30924 23851 47706
22382 47706 50693 29289 16212 11661 62711 2892 -26160 56788 80980 79265 56702 63740
22370 63740 -17376 -81503 -122704 -148042 -83454 -45536 -33858 -76911 -86491 -110959 -86455 -106535
22358 -106535 -172850 -191414 -81201 -43275 -72369 -42439 37691 51446 64572 91206 41969
22347 41969 -12504 -42056 -51972 -111546 -103931 66827 41467 -32318 -69643 -5384 6387 -48359
22335 -48359 31866 112661 84350 83848 55524 -24117 33069 92451 142386 123913 23931 -64850
$$ packed form
22418b9543n3305L6825R8562Q3220J05887m083k01007Q99l4523k6278J8929N486
22406A069k1904L3928N2977j7126j19217r7752N2090M2620N8483L9139l1487k8987
22394c6167p9975j4379J1136k1400R2312J15560L1787m8796l962j5192p073K3855
22382D7706K987k1404j3077m551N1050n9819k9052Q2948K4192j715k2563P038
22370F3740q1116o4127m1201k5338O4588L7918J1678m3053r580k4468K4504k0080
22358a06535o6315j8564J10213L7926k9094K9930Q0130J3755J3126K6634m9237
22347D1969n4473k9552r916n9574P615J70758k5360p3785l7325O4259J1771n4746
22335d8359Q0225Q0795k8311n02k8324p9641N7186N9382M9935j8473r9982q8781
$$ plain form
22323 -64850 -81999 -44082 -45698 -9048 33436 -24222 -19490 33881 20982 -29947 -10654 -10593 41443
22310 41443 70879 -61828 -189109 -118424 33727 73248 78899 60618 -15827 -62068 -137440
22299 -137440 -75549 25691 96732 49522 5973 30242 52261 70391 48674 -2808 -74737
22288 -74737 -142091 -106817 -49990 96589 104427 63980 39668 2379 6330 18092 66793 53975
22276 53975 -37103 -152003 -109051 -37820 -95718 -11052 39513 932 18714 -16365 8615
22265 8615 16120 -9095 -15316 -13877 -47111 -62073 -29368 -36483 -103732 -84023 -41451 -56673 -69933
22252 -69933 2301 54641 -13217 -24025 -28198 -71479 -43298 31894 -3001 6865 11202 -36007
22240 -36007 -40810 -21328 -24789 -99286 -77988 -24578 21818 101794 29818 16181 -15682 22568
$$ packed form
22323f4850j7149L7917j616L6650M2484n7658M732N3371j2899n0929J9293O1N2036
22310D1443K9436j32707j27281P0685J52151L9521N651j8281p6445m6241p5372
22299a37440O1891J01240P1041m7210m3549K4269K2019J8130k1717n1482p1929
22288g4737o7354L5274N6827J46579P838m0447k4312l7289L951J1762M8701j2818
22276E3975r1078j14900M2952P1231n7898Q4666N0565l8581J7782l5079K4980
22265H615P505k5215o221J439l3234j4962L2705p115o7249J9709M2572j5222j3260
22252f9933P2234N2340o7858j0808m173m3281K8181P5192l4895R866M337m7209
22240c6007m803J9482l461p4497K1298N3410M6396P9976p1976j3637l1863L8250
$$ plain form
22228 22568 166192 152147 93981 50274 39298 30051 70116 73674 48354 28541 -76785 -168025
22216 -168025 -132964 -44452 -10107 -33227 62801 38105 14219 46123 62298 29249 35776 68226
22204 68226 7780 14390 6015 -19113 -15401 53798 18010 -1505 -47968 -18264 -7133 11120
22192 11120 70736 -28814 -70737 -39021 -45617 -40099 -57583 -45453 -24908 17631 566 -2032
22180 -2032 -36985 52988 140619 135269 62514 22503 -10882 -21135 16955 -60896 10428 60342
22168 60342 -81633 -189435 -145506 -52126 56931 40470 30948 -26615 -33201 25598 -18670
22157 -18670 -43830 -2461 -10718 33907 69607 49331 86192 88366 -37479 -14071 16669 19472
22145 19472 13764 44369 70236 36792 -6545 37293 36208 1221 17049 44399 -16489 -68544
$$ packed form
22228B2568J43624j4045n8166m3707j0976r247M0065L558k5320j9813j05326r1240
22216a68025L5061Q8512L4345k3120R6028k4696k3886L1904J6175l3049O527L2450
22204F8226o0446O610q375k5128L712O9199l5788j9515m6463K9704J1131J8253
22192A1120N9616r9550m1923L1716o596N518j7484J2130K0545M2539j7065k598
22180b032l4953Q9973Q7631n350p2755m0011l3385j0253L8090p7851P1324M9914
22168F0342j41975j07802M3929R3380J09057j6461r522n7563o586N8799m4268
22157a8670k5160M1369q257M4625L5700k0276L6861K174j25845K3408L0740K803
22145A9472n708L0605K5867l3444m3337M3838j085l4987J5828K7350o0888n2055
$$ plain form
22133 -68544 -30311 -44565 -99987 -142637 -10992 116724 83559 24959 -24847 -46466 -82862
22122 -82862 -119776 -95618 -100470 -88862 -79877 -37093 -21105 29501 3648 -10186 -46187 -133387
22110 -133387 -105057 9044 68085 46213 65383 91140 54472 -16217 -94122 -97598 -45582
22099 -45582 -23064 -23243 1728 -5643 -97612 -135513 -182137 -168449 -160504 -89872 -33296 -27594 -2809
22086 -2809 -38854 -59864 17342 116577 115679 111159 102921 43237 2815 8155 33063 -41730 -88710
22073 -88710 -122967 -156339 -134307 -130491 -25304 40307 -52250 -39387 -83025 -133171 -221500 -208107
22061 -208107 -162185 -84822 -84225 -69646 -13322 -14721 -32846 4553 -16274 -34294 25190 99939
22049 99939 81990 54359 34954 93135 112610 100279 107820 30395 16421 72108 43684 39859
$$ packed form
22133f8544L8233j4254n5422m2650J31645J27716l3165n8600m9806k1619l6396
22122h2862l6914K4158m852J1608Q985M2784J5988N0606k5853j3834l6001q7200
22110a33387K8330J14101N9041k1872J9170K5757l6668p0689p7905l476N2016
22099d5582K2518j79K4971p371r1969l7901m6624J3688P945P0632N6576N702K4785
22086b809l6045k1010P7206R9235q98m520q238n9684m0422N340K4908p4793m6980
22073h8710l4257l3372K2032L816J05187O5611r2557J2863m3638n0146q8329J3393
22061b08107M5922P7363N97J4579N6324j399j8125L7399k0827j8020N9484P4749
22049I9939j7949k7631j9405N8181J9475j2331P541p7425j3974N5687k8424l825
$$ plain form
22037 39859 101882 109155 38658 58623 43903 57066 -24564 -100915 -125410 -53946 -111841 -115789
22025 -115789 -129298 -186976 -134788 -38323 19933 13342 -27285 -52580 -28442 -92664 -95967 20205
22013 20205 2436 -78344 -129590 -142659 -79914 -7293 23494 34788 49192 124606 91902 70813
22001 70813 100825 -9779 -135661 -158402 -82423 -4054 -1546 -15937 -65358 41770 104820
21990 104820 29379 -1400 43982 -13646 -56908 -106665 -53118 -85617 -109652 -152627 -181196
21979 -181196 -152573 -159386 -128013 -157544 -176002 -109145 -147612 -154769 -61679 -57294 -111728 -131465
21967 -131465 -85243 -25822 1173 20932 -63178 -48058 49630 64493 -81238 -141942 -178395
21956 -178395 -182691 -111245 -155096 -149478 -135989 -129246 -101267 -140173 -117569 40492 158439 176567
$$ packed form
22037C9859O2023P273p0497J9965j4720J3163q1630p6351k4495P1464n7895l948
22025a15789j3509n7678N2188R6465N8256o591m0627k5295K4138o4222l303J16172
22013B0205j7769q0780n1246j3069O2745P2621L0787J1294J4404P5414l2704k1089
22001G0813L0012j10604j25882k2741P5979P8369K508j4391m9421J07128O3050
21990A04820p5441l0779M5382n7628m3262m9757N3547l2499k4035m2975k8569
21979a81196K8623o813L1373k9531j8458O6857l8467p157R3090M385n4434j9737
21967a31465M6222N9421K6995J9759q4110J5120R7688J4863j45731o0704l6453
21956a78395m296P1446m3851N618J3489O743K7979l8906K2604J58061J17947J8128
$$ plain form
21944 176567 80187 -33582 -2266 71880 -41797 -65672 -69759 -85424 -59707 -488 -11156
21933 -11156 -11973 -3286 -37722 -36419 -43726 -61007 -128288 -117529 -159122 -236331 -251383 -149662
21921 -149662 -134250 -79623 -46451 -96815 -31073 11362 -98 32058 58624 45580 41127 -14245
21909 -14245 -27399 -484 5433 -317 -27331 -30127 -638 56965 72277 46087 16716 -88295
21897 -88295 -150160 -91796 -12695 30281 18716 22804 44431 43808 17293 -65948 -106429 8869
21885 8869 50167 -30490 -76048 -187074 -223720 -160140 -55928 -223 -8787 -66422 -117162 -120371
21873 -120371 -103502 -26701 20085 24413 -21287 -67877 2635 39811 93303 40794 -77794
21862 -77794 -107744 -79132 -73283 -17628 -18512 -59071 -87432 -83225 -51510 -103221 -81768 -75353 -109487
$$ packed form
21944A76567r6380j13769L1316P4146j13677k3875m087j5665K5717N9219j0668
21933a1156q17Q687l4436J303p307j7281o7281J0759m1593p7209j5052J01721
21921a49662J5412N4627L3172n0364O5742M2435j1460L2156K6566j3044m453n5372
21909a4245j3154K6915N917n750k7014k796K9489N7603J5312k6190k9371j05011
21897h8295o1865N8364P9101M2976j1565M088K1627o23k6515q3241m0481J15298
21885H869M1298q0657m5558j11026l6646O3580J04212N5705q564n7635n0740l209
21873a20371J6869P6801M6786M328m5700m6590P0512L7176N3492n2509j18588
21862g7794k9950K8612N849N5655q84m0559k8361M207L1715n1711K1453O415l4134
$$ plain form
21849 -109487 -76138 -63328 -108928 -53611 -25137 101825 129980 129039 117158 66685 13159 68967
21837 68967 60222 41268 27790 -20214 -85140 -70321 1521 -52656 -106769 -77755 -22081 -712
21825 -712 72312 185549 159192 87887 58928 5199 78730 4688 -44744 -31093 33478 20654
21813 20654 -104645 -142977 -23643 26041 -64373 -138526 -71934 -22140 57984 151088 101607
21802 101607 81569 -4072 -70020 -82155 -36506 -3023 21103 62543 41300 -7646 -20520
21791 -20520 -7623 -20678 -88918 -55975 -76501 -100725 -115715 -69957 -30650 -48029 -99756 -135989
21779 -135989 -125925 -44790 26202 3384 65262 21886 -11531 -25480 -12058 -26485 -11943
21768 -11943 -6155 -112651 -186850 -126317 -111227 -134131 -142126 -103806 -35293 45066 62583 28657
$$ packed form
21849a09487L3349J2810m5600N5317K8474J26962K8155r41j1881n0473n3526N5808
21837F8967q745j8954j3478m8004o4926J4819P1842n4177n4113K9014N5674K1369
21825g12P3024J13237k6357p1305k8959n3729P3531p4042m9432J3651O4571j2824
21813B0654j25299l8332J19334M9684r0414p4153O6592M9794Q0124R3104m9481
21802A01607k0038q5641o5948j2135M5649L3483K4126M1440k1243m8946j2874
21791b0520J2897j3055o8240L2943k0526k4224j4990M5758L9307j7379n1727l6233
21779a35989J0064Q1135P0992k2818O1878m3376l3417j3949J3422j4427J4542
21768a1943N788j06496p4199O0533J5090k2904p995L8320O8513Q0359J7517l3926
$$ plain form
21756 28657 -1517 -2392 -45153 -68535 -101986 -114113 -79233 -57230 -93748 -127199 -160194 -122829
21744 -122829 -37114 -46419 -96568 -11606 55301 1513 -42843 -134937 -155588 -123324 -39586 55105
21732 55105 103008 76813 12211 65390 89122 13444 -45740 -76555 -59820 -9719 70737 47868
21720 47868 -22043 12455 -19710 -79263 -144115 -229253 -141520 -92003 -131686 -173432 -113511 -98878
21708 -98878 -84822 -70793 -55233 -55164 40925 51136 11086 42043 67662 32725 -204 -751 -34112
21695 -34112 -17594 5470 -26050 -42991 -73837 -72123 80218 174011 107787 30285 7506 -18359
21683 -18359 -24705 -13789 -29210 16384 64326 23170 -58950 -168690 -111876 -39945 -38008 -57719
21671 -57719 3876 64252 70256 127816 146236 46964 -50559 -39470 47106 23283 53054 96430
$$ packed form
21756B8657l0174q75m2761k3382l3451j2127L4880K2003l6518l3451l2995L7365
21744a22829Q5715r305n0149Q4962O6907n3788m4356r2094k0651L2264Q3738R4691
21732E5105M7903k6195o4602N3179K3732p5678n9184l0815J6735N0101Q0456k2869
21720D7868o9911L4498l2165n9553o4852q5138Q7733M9517l9683m1746N9921J4633
21708i8878J4056J4029J5560O9R6089J0211m0050L0957K5619l4937l2929n47l3361
21695c4112J6518K3064l1520j6941l0846J714J52341R3793o6224p7502k2779k5865
21683a8359o346J0916j5421M5594M7942m1156q2120j09740N6814P1931J937j9711
21671e7719O1595O0376O004N7560J8420r9272r7523J1089Q6576k3823K9771M3376
$$ plain form
21659 96430 91812 125350 63380 -35789 -15921 46292 18207 -62119 -126906 -138957 -122283 -111185
21647 -111185 -70746 -80930 -121073 -80275 -21524 -12189 -93369 -54776 -59348 -33494 -22056 -80547
21635 -80547 -85062 -107891 -88673 -49400 -107675 13607 103097 64437 65681 91535 7709 -51699
21623 -51699 -82732 -9210 -46185 -30875 -5890 -3120 76078 88912 -48307 -188737 -161502
21612 -161502 52405 65469 84833 137300 144771 106999 79974 105432 105999 55015 18234 -16928
21600 -16928 -20410 29938 -57621 -85335 -109866 -102164 -95070 -9612 23027 6403 -42974 861
21588 861 48255 84622 36394 -7255 -21552 -70467 -51343 -47110 -30982 34521 -28604 -44212
21576 -44212 35468 80298 108751 79555 -13951 -83034 -61082 10825 12411 9624 -40709 -73654
$$ packed form
21659I6430m618L3538o1970r9169J9868O2213k8085q0326o4787j2051J6674J1098
21647a11185M0439j0184m0143M0798N8751R335q1180L8593m572K5854J1438n8491
21635h0547m515k2829J9218L9273n8275J21282Q9490l8660J244K5854q3826n9408
21623e1699l1033P3522l6975J5310K4985K770P9198J2834j37219j40430K7235
21612a61502K13907J3064J9364N2467P471l7772k7025K5458N67n0984l6781l5162
21600a6928l482N0348q7559k7714k4531P702P094Q5458L2639j6624m9377M3835
21588H61M7394L6367m8228m3649j4297m8915J9124M233J6128O5503o3125j5608
21576d4212P9680M4830K8453k9196r3506o9083K1952P1907J586k787n0333l2945
$$ plain form
21564 -73654 -23552 1879 -24355 -80615 -65148 -35334 -53230 -23498 5877 -51350 -47281 -51271
21552 -51271 -8084 14123 76981 54186 30108 -46389 -61737 -18548 22158 11453 24310 -5835
21540 -5835 -29884 17676 -67777 -34479 -5429 -11923 37357 3961 50752 76211 48512 66885
21528 66885 41094 155670 167675 101920 59653 -52453 -108802 -165686 -162758 -105271 -45833
21517 -45833 31831 -10579 -69406 -26270 -34311 -159726 -140562 -53535 12019 9765 -40765 -52270
21505 -52270 -57185 -90020 -82092 -76071 -21116 -37340 -64544 -95248 -76905 17711 39913 61399
21493 61399 68952 64914 -4350 11336 5256 -86141 -107624 -61492 -30029 -85681 -91603 33893
21481 33893 17990 35561 54270 -49263 -76022 -26730 28082 104042 122757 199453 131740
$$ packed form
21564g3654N0102K5431k6234n6260J5467K9814j7896K9732K9375n7227M069l990
21552e1271M3187K2207O2858k2795k4078p6497j5348M3189M0706j0705J2857l0145
21540e835k4049M7560q5453L3298K9050o494M9280l3396M6791K5459k7699J8373
21528F6885k5791J14576J2005o5755m2267j12106n6349n6884K928N7487N9438
21517d5833P7664m2410n8827M3136q041j25415J9164Q7027O5554k254n0530j1505
21505e2270m915l2835P928O021N4955j6224k7204l0704J8343R4616K2202K1486
21493F1399P553m038o9264J5686o080r1397k1483M6132L1463n5652n922J25496
21481C3893j5903J7571J8709j03533k6759M9292N4812P5960J8715P6696o7713
$$ plain form
21470 131740 8975 20941 111044 67589 52307 13493 -53522 -21916 -11525 81547 71494
21459 71494 12912 -76032 -64444 -35470 -47883 -95501 -129392 -171319 -103115 23937 332
21448 332 -27692 23055 20653 27857 103848 96029 52751 74494 99284 24792 -33638 -39010 -735
21435 -735 32551 -8327 -113640 -121242 -166947 -138491 -59246 -68784 -45783 4973 32312 -34937
21423 -34937 -83760 -84616 -25179 9797 -44485 -33905 -19896 -70139 -68075 -53694 -71610 -50717
21411 -50717 -89101 -144015 -139912 -90480 -161174 -110189 -51670 -94528 -26480 44094 -13789 -82039
21399 -82039 -113151 -154329 -169670 -180292 -226432 -165716 -59160 -101305 -93655 -48748 -19431 -5661
21387 -5661 -35385 -149507 -191120 -141393 -110970 -137328 -63625 3456 -53836 -139483 -86668 -48549
$$ packed form
21470A31740j22765J1966R0103m3455j5282l8814o7015L1606J0391R3072j0053
21459G1494n8582q8944J1588K8974j2413m7618l3891m1927O8204J27052k3605
21448C32k8024N0747k402P204P5991p819m3278K1743K4790p4492n8430n372L8275
21435g35L3286m0878j05313p602m5705K8456P9245r538K3001N0756K7339o7249
21423c4937m8823q56N9437L4976n4282J0580J4009n0243K064J4381j7916K0893
21411e0717l8384n4914M103M9432p0694N0985N8519m2858O8048P0574n7883o8250
21399h2039l1112m1178j5341j0622m6140O0716J06556m2145P650M4907K9317J3770
21387e661k9724j14122m1613M9727L0423k6358P3703O7081n7292q5647N2815L8119
$$ plain form
21375 -48549 -101081 -104437 8729 101753 180343 191264 149569 154184 196983 198912 147685 141523
21363 141523 90100 26666 -20800 -64904 -54731 -73335 -117090 -143836 -67016 -32664 -102026
21352 -102026 -115586 -108194 -72176 -55733 -15184 -72062 -59771 -7713 14487 23311 8095 68705
21340 68705 45398 -6400 7487 -36652 4876 -24126 -7496 -5717 -31317 -70896 -63396 -90696
21328 -90696 -92535 -33037 22123 19423 -5499 -44229 -48502 2427 25164 39912 36941 21200
21316 21200 103316 116590 67758 -13585 26102 104516 129377 44105 23632 47875 79402 54607
21304 54607 -7060 -15259 -25367 -53414 -59909 -73306 -88418 -97419 -148855 -78932 27433 16144
21292 16144 3451 19145 -6149 -62131 -99122 -10332 62414 5149 6746 28567 68104 50460
$$ packed form
21375d8549n2532l356J13166R3024P8590J0921m1695M615M2799J929n1227o162
21363A41523n1423o3434m7466m4104J0173j8604m3755k6746P6820L4352o9362
21352a02026j3560P392L6018J6443M0549n6878J2291N2058K2200Q824j5216O0610
21340F8705k3307n1798J3887m4139M1528k9002J6630J779k5600l9579P500k7300
21328i0696j839N9498N5160k700k4922l8730m273N0929K2737J4748k971j5741
21316B1200Q2116J3274m8832q1343L9687P8414K4861q5272k0473K4243L1527k4795
21304E4607o1667q199j0108k8047o495j3397j5112r001n1436O9923J06365j1289
21292A6144j2693J5694k5294n5982l6991Q8790P2746n7265J597K1821L9537j7644
$$ plain form
21280 50460 85345 67045 89673 159564 80117 45419 55325 28031 22428 -14015 10646 145735
21268 145735 104510 58248 56719 67694 60559 119389 86608 7193 -5222 27711 109136 109332
21256 109332 67997 97368 96869 120118 105608 53557 31879 -26138 54790 111936 -18395 -105369
21244 -105369 -98306 -64518 -16183 -48021 -123370 -134321 7981 99446 28165 -33259 3701
21233 3701 52507 78514 63608 10069 10588 47084 -28972 -82459 -36096 66585 31650 -64812
21221 -64812 -107277 -67760 -91996 -104708 -100915 -113930 -107484 -89747 -112096 -201516 -173562 -83556
21209 -83556 -34788 -57752 -3091 82007 53610 -13332 -16714 16649 7469 15702 -5009 -60074
21197 -60074 -94194 -198555 -142593 -106451 -104141 -101484 -164982 -151529 -86579 -121255 -138482 -102618
$$ packed form
21280E0460L4885j8300K2628O9891p9447l4698R906k7294n603l6443K4661J35089
21268A45735m1225m6262j529J0975p135N8830l2781p9415j2415L2933Q1425J96
21256A09332m1335K9371m99K3249j4510n2051k1678n8017Q0928N7146j30331q6974
21244a05369P063L3788M8335l1838p5349j0951J42302R1465p1281o1424L6960
21233C701M8806K6007j4906n3539N19L6496p6056n3487M6363J02681l4935r6462
21221f4812m2465L9517k4236j2712L793j3015O446J7737k2349q9420K7954R0006
21209h3556M8768k2964N4661Q5098k8397o6942l382L3363r180Q233k0711n5065
21197f0074l4120j04361N5962L6142K310K657o3498J3453O4950l4676j7227L5864
$$ plain form
21185 -102618 -104543 -87529 3963 16859 -6752 -35508 -34041 4658 26260 -43444 -79993 -114089
21173 -114089 -81030 -19211 -37904 -26769 15523 -41932 -137246 -114281 20954 -106773 -142491
21162 -142491 -34949 30822 100491 104950 25544 -21083 -40447 6400 58775 110891 96823
21151 96823 15888 -57685 -55995 -66214 -99988 -34256 -23662 -36147 12125 34338 42822 45692
21139 45692 14521 -76633 -102400 -124686 -173459 -172744 -131622 -10719 25639 -10535 -54949 -136656
21127 -136656 -119523 -129238 -163097 -125553 -119934 -7661 62348 -12 -81964 -44688 17472 -9082
21115 -9082 -3859 -14349 -47995 -77395 -66138 -75424 -58727 -29310 -38718 -70043 -39639 -40012 -32739
21102 -32739 -13104 -55151 -69925 -74080 -77307 25579 -3472 -4271 56118 128850 104600 55581
$$ packed form
21185a02618j925J7014R1492J2896k3611k8756J467L8699K1602o9704l6549l4096
21173a14089L3059O1819j8693J1135M2292n7455r5314K2965J35235j27727l5718
21162a42491J07542O5771O9669M459p9406m6627j9364M6847N2375N2116j4068
21151I6823q0935p3573J690j0219l3774O5732J0594j2485M8272K2213Q484K870
21139D5692l1171r1154k5767k2286m8773P15M1122J20903L6358l6174m4414q1707
21127a36656J7133r715l3859L7544N619J12273P0009o2360q1952L7276O2160k6554
21115i082N223j0490l3646k9400J1257r286J6697K9417r408l1325L0404l73P273
21102c2739J9635m2047j4774m155l227J02886k9051p99O0389P2732k4250m9019
$$ plain form
21090 55581 -56020 -126196 -119882 -55583 -95971 -119289 -80063 -50660 -64561 -29562 -32032 -40795
21078 -40795 -58607 -55130 45179 30829 -6615 -29329 8428 6376 -24543 -35786 -13419 21977
21066 21977 1374 14476 -57935 -124281 -118235 -108612 -18040 44686 61714 25220 34747 20820
21054 20820 -13859 -5915 9563 -103874 -162974 -233181 -218356 -135971 -48558 -46775 -91431 -150966
21042 -150966 -101887 -54613 -5771 41518 31657 18941 -6382 -2770 28149 82848 84058 -5542
21030 -5542 -48923 -37830 -23579 -9643 -89508 -35789 -3843 -4573 -12615 -40789 -83510 -68717
21018 -68717 -2958 -23391 -36500 23011 -30103 -131410 -146110 -139561 -87601 -128340 -160132 -136785
21006 -136785 -128138 -133720 -47560 -21563 386 21938 -22077 -11393 36926 27357 67438 52484
$$ packed form
21090E5581j11601p0176O314O4299m0388k3318L9226K9403j3901L4999k470q763
21078d0795j7812L477J00309j4350l7444k2714L7757k052l0919j1243K2367L5396
21066B1977k0603J3102p2411o6346O046R623R0572O2726J7028l6494R527j3927
21054B0820l4679P944J5478j13437n9100p0207J4825Q2385Q7413J783m4656n9535
21042a50966M9079M7274M8842M7289r861j2716k5323L612L0919N4699J210q9600
21030e542m3381J1093J4251J3936p9865N3719L1946p30q042k8174m2721J4793
21018f8717O5759k0433j3109N9511n3114j01307j4700O549N1960m0739l1792K3347
21006a36785Q647n582Q6160K5997K1949K1552m4015J0684M8319r569M0081j4954
$$ plain form
20994 52484 -5604 -28603 -19149 -1120 -92928 -144510 -160538 -157043 -100624 19853 40601 14057
20982 14057 10911 -6570 -27315 -41029 -28985 28250 31334 -41791 -2454 25009 54302 77273
20970 77273 30570 15248 54698 73223 19645 -54155 -58406 -49316 -59144 -33927 -12111 35392
20958 35392 112346 102384 -62618 -165995 -188752 -149422 -37522 24506 45356 104563 121859
20947 121859 167763 184602 157445 108664 39550 -117620 -112843 -81916 -34505 3209 1507 37447
20935 37447 53470 71750 -15650 -4143 44220 58480 1704 37232 96773 115264 110615 101899
20923 101899 94983 65547 -49834 -25454 34618 41456 24199 44026 -30176 -12919 -10756 -22078
20911 -22078 -60378 -116194 -119267 -118602 -74619 51313 106335 44134 28640 80503 47466 42931
$$ packed form
20994E2484n8088k2999R454J8029r1808n1582j6028L495N6419J20477K0748k6544
20982A4057l146j7481k0745j3714J2044N7235L084p3125L9337K7463K9293K2971
20970G7273m6703j5322L9450J8525n3578p3800m251R090r828K5217K1816M7503
20958C5392P6954r962j65002j03377k2757L9330J11900O2028K0850N9207J7296
20947A21859M5904J6839k7157m8781o9114j57170M777L0927M7411L7714j702L5940
20935C7447J6023J8280q7400J1507M8363J4260n6776L5528N9541J8491m649q716
20923A01899o916k9436j15381K4380O0072O838j7257J9827p4202J7257K163j1322
20911b2078l8300n5816l073O65M3983J25932N5022o2201j5494N1863l3037m535
$$ plain form
20899 42931 6560 -24482 -23614 -41820 38820 49738 31570 64361 40223 -32655 -45 48952
20887 48952 90749 112539 121482 91050 -15812 -63322 5576 1718 18199 -11339 30702 74598
20875 74598 100502 59762 -29737 -48119 -16250 48783 110974 112363 120529 165204 72994 -15105
20863 -15105 -42796 -53640 -73793 -135440 -108019 -23124 -81978 -24755 74662 -45447 -96673
20852 -96673 -119595 -118762 -16592 53679 132764 148226 77202 -11132 9570 16234 -43 42044
20840 42044 99027 78035 95467 35526 -65317 8994 -4511 -6657 -45068 -98705 -133171 -113980
20828 -113980 -107421 -118499 -86061 -85121 -116348 -57079 32315 -14411 24721 24097 -2597 -868 -22030
20815 -22030 41393 48280 94422 165244 171779 128447 9907 4381 -25749 -26660 -92373 -94823 -44521
$$ packed form
20899D2931l6371l1042Q68j8206Q0640J0918j8168L2791k4138p2878L2610M8997
20887D8952M1797K1790Q943l0432j06862m7510O8898l858J6481k9538M2041M3896
20875G4598K5904m0740q9499j8382L1869O5033O2191J389Q166M4675r2210q8099
20863a5105k7691j0844k0153o1647K7421Q4895n8854N7223R9417j20109n1226
20852i6673k2922Q33J02170P0271P9085J5462p1024q8334K0702O664j6277M2087
20840D2044N6983k0992J7432n9941j00843P4311j3505k146l8411n3637l4466J9191
20828a13980O559j1078L2438R40l1227N9269Q9394m6726L9132o24k6694J729k1162
20815b2030O3423O887M6142P0822O535m3332j18540n526l0130r11o5713k450N0302
$$ plain form
20802 -44521 -17735 30280 24023 793 -53583 -30112 -216 -13026 -36509 -53506 -59635 -77697
20790 -77697 -70516 -39195 -29256 -27062 -60321 -20873 28683 104500 36783 25896 -39767 -13102
20778 -13102 -16814 -53874 -33594 -40371 -34301 -90573 -141352 -171929 -152032 -117852 -177140 -241249
20766 -241249 -209333 -126312 -132509 -133148 -133335 -89499 -31709 -8068 -32039 -52223 -9252 63379
20754 63379 43247 -26915 -16505 -26383 -56831 -20730 17972 50988 58353 110619 155236 109902
20742 109902 55557 -22422 -44521 -38312 -8803 67468 39926 -26430 -73055 19315 63827 99723
20730 99723 71024 57196 -66889 -55316 -9072 -28606 -97279 -98504 -105833 -14102 107427 99154
20718 99154 72749 1175 -57974 -41294 -37788 -45829 -70828 -68449 -80634 -104870 -67571 -10005
$$ packed form
20802d4521K6786M8015o257k3230n4376K3471K9896j2810k3483j6997o129j8062
20790g7697P181L1321R939K194l3259L9448M9556P5817o7717j0887o5663K6665
20778a3102l712l7060K0280o777O070n6272n0779l0577J9897L4180n9288o4109
20766b41249L1916Q3021o197o39j87M3836N7790K3641k3971k0184M2971P2631
20754F3379k0132p0162J0410r878l0448L6101L8702L3016P365N2266M4617m5334
20742A09902n4345p7979k2099O209K9509P6271k7542o6356m6625R2370M4512L5896
20730I9723k8699j3828j24085J1573M6244j9534o8673j225p329R1731J21529q273
20718I9154k6405p1574n9149J6680L506q041k4999K379j2185k4236L7299N7566
$$ plain form
20706 -10005 -5573 -7093 -102596 -122515 -74991 11794 -42830 -46886 -105521 -102915 -65249 -90884
20694 -90884 -115198 -126415 -101378 -76672 -109937 -91662 -54485 -37859 -146213 -194371 -177835
20683 -177835 -178927 -157926 -142342 -97093 4590 -77925 -239278 -260022 -210446 -87211 -93400
20672 -93400 -174935 -179848 -244118 -237129 -43824 1115 -59419 -52279 -64562 -101855 -45274 -22284
20660 -22284 -24888 -5893 -7725 -26601 -44444 -32125 -4017 63369 518 -13491 46486 40346
20648 40346 28526 19955 -26539 -84128 4009 65131 121154 163740 157261 134787 62291 11194
20636 11194 39747 -6642 22049 93396 57011 65313 100683 67470 42411 -62441 -160157 -87488
20624 -87488 33843 60926 69784 49110 58052 -41777 -148068 -106839 -64829 54840 144110
$$ packed form
20706a0005M432j520r5503j9919M7524Q6785n4624m056n8635K606L7666k5635
20694i0884k4314j1217K5037K4706l3265J8275L7177J6626j08354m8158J6536
20683a77835j092K1001J5584M5249J01683q2515j61353k0744M9576J23235o189
20672i3400q1535m913o4270O989J93305M4939o0534P140j2283l7293N6581K2990
20660b2284k604J8995j832j8876j7843J2319K8108O7386o2851j4009N9977o140
20648D0346j1820q571m6494n7589Q8137O1122N6023M2586o479k2474p2496n1097
20636A1194K8553m6389K8691P1347l6385Q302L5370l3213k5059j04852r7716P2669
20624h7488J21331K7083Q858k0674Q942r9829j06291M1229M2010J19669Q9270
$$ plain form
20613 144110 78210 39606 27589 -959 -1911 -39094 -22579 34436 64937 40082 -38130 -133779
20601 -133779 -113978 -8817 43637 71683 27491 91951 104227 77719 93630 -27305 -19748
20590 -19748 -8122 1821 -59647 -58808 -69672 -70243 -102188 -85781 -59819 -58549 -40135 73600 162555
20577 162555 93526 2503 -92771 -113259 -110200 -152312 -143436 -113226 -112199 -158560 -140419 -179833
20565 -179833 -175375 -127040 -138922 -93784 -104140 -141999 -28014 12897 -7195 -69978 -29898
20554 -29898 41599 91861 128408 92564 74593 71974 59376 -26126 -103086 -106249 -64433 -60888
20542 -60888 3291 -19090 -23291 -73308 -93500 -4477 105226 95517 134280 82784 -18360 -7675
20530 -7675 -7982 -24286 -39046 18793 60720 87775 57919 41069 71227 98172 55524 -10312
$$ packed form
20613A44110o5900l8604j2017k8548r52l7183J6515N7015L0501k4855p8212r5649
20601a33779J9801J05161N2454K8046m4192O4460J2276k6508J5911j20935P557
20590a9748J1626R943o1468Q39j0864n71l1945J6407K5962J270J8414J13735Q8955
20577A62555o9029r1023r5274k0488L059m2112Q876L0210J027m6361J8141l9414
20565a79833M458M8335j1882M5138j0356l7859J13985M0911k0092o2783M0080
20554b9898P1497N0262L6547l5844j7971k619j2598q5502p6960l163M1816L545
20542f0888O4179k2381m201n0017k0192Q9023J09703r709L8763n1496j01144J0685
20530g675l07j6304j4760N7839M1927K7055k9856j6850L0158K6945m2648o5836
$$ plain form
20518 -10312 -25182 -29896 5858 -7474 61431 95713 185651 137704 36515 -48471 -98165 -102667
20506 -102667 -47497 -35268 94952 128132 47196 10589 -59868 -117677 -104883 -157813 -173163
20495 -173163 -198872 -175605 -199765 -143342 -98592 -83551 -116702 -79275 -31917 16039 19158 128578
20483 128578 194272 191991 257467 198304 88598 50432 10935 1187 -44836 8275 19957 -25582
20471 -25582 -14964 -142415 -205590 -111268 -82588 -137320 -138039 -40844 -16991 27530 2105 -39365
20459 -39365 -6967 29996 35399 -2592 -7849 26697 50383 21169 11641 -82229 -176649 -154145
20447 -154145 -68337 -32034 27898 -12193 -55310 -139542 -152959 -123843 -106725 -148201 -160690
20436 -160690 -130952 -123499 -106714 -109349 -128830 -42529 15223 54524 97066 19944 28474 -339
$$ packed form
20518a0312j4870m714L5754j3332O8905L4282Q9938m7947j01189q4986m9694m502
20506a02667N5170J2229J30220L3180q0936l6607p0457n7809J2794n2930j5350
20495a73163k5709K3267k4160N6423M4750J5041l3151L7427M7358M7956L119J09420
20483A28578O5694k281O5476n9163j09706l8166l9497r748m6023N3111J1682m5539
20471b5582J0618j27451o3175R4322K8680n4732p19R7195K3853M4521k5425m1470
20459c9365L2398L6963N403l7991n257L4546K3686k9214r528r3870r4420K2504
20447a54145Q5808L6303N9932m0091m3117q4232j3417K9116J7118m1476j2489
20436a60690K9738P453J6785k635j9481Q6301N7752L9301M2542p7122Q530k8813
$$ plain form
20424 -339 -25753 -31348 8460 -74968 -55123 49943 65946 31364 -16217 -84770 -63629 -9258
20412 -9258 12719 -5495 -15701 -16630 -72677 -96836 -126179 -96786 -28389 -14127 38042 92797
20400 92797 106708 100469 23952 -67589 -161986 -187151 -77496 -42707 -8636 -13887 -45134 23178
20388 23178 59097 2271 -49666 9832 32652 -53941 -138724 -110168 -63032 -111112 -145065 -119362
20376 -119362 -107830 -125563 -47029 67820 137016 72292 93719 85973 9993 41193 24421
20365 24421 -74744 -97070 -60440 -1950 -12216 20319 23507 18820 29845 50396 33968 -25438
20353 -25438 -68135 -40257 -27166 -14089 -107918 -127136 -78121 -69783 -68129 -78431 -70329 -77304
20341 -77304 -76716 -31302 15412 -636 -1757 -14054 -102942 -110450 -91837 -40999 28997 58283
$$ packed form
20424c39k5414n595L9808q3428J9845J05066J6003l4582m7581o8553K1141N4371
20412i258K1977j8214j0206r29n6047k4159k9343K9393O8397J4262N2169N4755
20400I2797J3911o239p6517r1541r4397k5165J09655L4789L4071n251l1247O8312
20388B3178L5919n6826n1937N9498K2820q6593q4783K8556M7136m8080l3953K5703
20376a19362J1532j7733P8534J14849O9196o4724K1427p746p5980L1200j6772
20365B4421r9165k2326L6630N8490j0266L2535L188m687J1025K0551j6428n9406
20353b5438m2697K7878J3091J3077r3829j9218M9015Q338J654j0302Q102o975
20341g7304N88M5414M6714j6048j121j2297q8888p508J8613N0838O9996K9286
$$ plain form
20329 58283 62145 37260 8918 -36992 -130664 -159411 -145792 -166250 -134485 -144725 -144589 -145279 -170903
20316 -170903 -93871 -127054 -155771 -111282 -65050 -27576 -45135 -78922 -93915 -78952 -4904
20305 -4904 66780 79906 159673 134299 80397 31159 36832 9747 11799 -5123 -85663 -92027
20293 -92027 -64642 -87251 -77202 -33221 12892 -53932 -71968 -32776 -46983 -28827 -31322 -107554
20281 -107554 -116478 -5353 11739 16832 -10081 6965 6350 161 -50296 -53140 -57788 -117297 -102871
20268 -102871 -76289 -32502 -1166 6581 31428 -11505 -35655 -7346 36521 48841 43148 59736
20256 59736 112564 65567 -870 -8722 21587 119536 85911 88982 48271 75215 86549 47998
20244 47998 4091 -49185 -50584 -81582 -183676 -142924 -22434 -23000 2802 -38350 -56480 7715
$$ packed form
20329E8283L862k4885k8342m5910r3672k8747J3619k0458L1765j0240J36o90k5624
20316a70903P7032l3183k8717M4489M6232L7474j7559l3787j4993J4963P4048
20305d904P1684J3126P9767k5374n3902m9238N673k7085K052j6922q0540o364
20293i2027K7385k2609J0049M3981M6113o6824j8036L9192j4207J8156k495p6232
20281a07554q924J11125J7092N093k6913J7046o15o189n0457k844m648n9509J4426
20268a02871K6582M3787L1336P747K4847m2933k4150K8309M3867J2320n693J6588
20256E9736N2828m6997o6437p852L0309R7949l3625L071m0711K6944J1334l8551
20244D7998m3907n3276j399l0998j02094M0752J20490n66K5802m1152j8130O4195
$$ plain form
20232 7715 42735 56538 70949 57933 30836 11293 26975 55054 12397 -45703 -40015 8137
20220 8137 -15200 6101 -19124 -75068 -57505 -121137 -154100 -84823 -40023 -42994 -38262 -63363
20208 -63363 -47759 -37819 34009 108750 54340 -27494 -19979 15714 -84371 -127181 -137533 -59826
20196 -59826 13437 41129 -35335 -32964 32866 105746 86829 38983 10397 33681 86987 46901
20184 46901 124586 137136 47558 -52436 -72659 -16554 13858 14898 -44117 -83192 -134653 -142957
20172 -142957 -108660 -92414 -43986 24761 -12165 -23537 -18577 -79766 -105530 -110135 -70654 -99334
20160 -99334 -137848 -76670 -40198 -9102 65134 87055 48605 31585 -70691 -103065 -91162
20149 -91162 -16980 14661 11230 -59405 -88227 -58505 -4115 -9970 24163 49704 -17397 -32584
$$ packed form
20232G715L5020J3803J4411j3016k7097j9543J5682K8079m2657n8100N688M8152
20220H137k3337K1301k5225n5944J7563o3632l2963O9277M4800k971M732k5101
20208f3363J5604R940P1828P4741n4410q1834P515L5693j00085m2810j0352P7707
20196e9826P3263K7692p6464K371O5830P2880j8917m7846k8586K3284N3306m0086
20184D6901P7685J2550q9578r9994k0223N6105L0412J040n9015l9075n1461q304
20172a42957L4297J6246M8428O8747l6926j1372M960o1189k5764m605L9481k8680
20160i9334l8514O1178L6472L1096P4236K1921l8450j7020j02276l2374J1903
20149i1162P4182L1641l431p0635k8822K9722N4390n855L4133K5541o7101j5187
$$ plain form
20137 -32584 3445 -27559 12094 13841 17590 19174 30302 31465 19614 10717 -14902 -9603 -36055
20124 -36055 -134117 -129799 -22950 -56497 -91039 -119849 -149842 -168982 -161847 -141313 -108136 -78269
20112 -78269 -28339 1291 8310 -11035 -65777 14139 39427 -64761 16203 44314 -36232 -9428
20100 -9428 -37190 -102173 24534 100089 89911 56192 43237 -44536 -67383 13719 81082 86986
20088 86986 100384 86228 427 5020 9757 -4318 53426 135182 84095 74364 157048 171599
20076 171599 87832 -4140 41569 77281 -13043 -93308 -89749 -44648 32805 34618 22430 -37952
20064 -37952 -106113 -173811 -135272 7087 18273 7060 32771 -20381 -25363 -54352 -64936 -6865
20052 -6865 -3814 -69637 -75273 -44348 -71976 -58988 -46969 -101049 -135763 -184046 -199178 -171117
$$ packed form
20137c2584L6029l1004L9653J747L749J584J1128J163j1851q897k5619N299k6452
20124c6055r8062M318J06849l3547l4542k8810k9993j9140P135K0534L3177K9867
20112g8269M9930K9630P019j9345n4742P9916K5288j04188Q0964K8111q0546K6804
20100i428k7762o4983J26707P5555j0178l3719j2955q7773k2847Q1102O7363N904
20088H6986J3398j4156q5801M593M737j4075N7744Q1756n1087r731Q2684J4551
20076A71599q3767r1972M5709L5712r0324q0265L559M5101P7453J813j2188o0382
20064c7952o8161o7698L8539J42359J1186j1213K5711n3152m982k8989j0584N8071
20052f865L051o5823n636L0925k7628J2988J2019n4080l4714m8283j5132K8061
$$ plain form
20040 -171117 -161431 -142633 -127957 -141683 -102792 -22650 44109 42232 34710 78540 46390 28090
20028 28090 -33543 -75442 12945 16004 -36746 -9196 42727 12871 24626 -42324 -121709 -119922
20016 -119922 -162733 -122027 -59044 2901 14533 -5030 21394 -32015 -108399 -153955 -112435
20005 -112435 -32111 -7785 -53699 -125159 -24324 15493 -770 -10895 -18311 19645 -24352
19994 -24352 -124282 -149869 -124844 -124490 -128355 -47492 15083 77000 71600 28888 -84158 -158089
19982 -158089 -171005 -151424 27511 22250 25870 59342 -64988 -64915 10947 -8429 -82245 -122425
19970 -122425 -95127 -78705 -59069 -76493 -130793 -62828 51311 10894 68507 125033 19689
19959 19689 -58385 -31056 -31887 -109654 -116617 -146605 -211142 -72030 38625 -78922 -64669 51530
$$ packed form
20040a71117R686J8798J4676j3726L8891Q0142O6759j877p522M3830l2150j8300
20028B8090o1633m1899Q8387L059n2750K7550N1923k9856J1755o6950p9385J787
20016a19922m2811M0706O2983O1945J1632j9563K6424n3409p6384m5556M1520
20005a12435Q0324K4326m5914p1460J00835L9817j6263j0125p416L7956m3997
19994b4352r9930k5587K5025L54l865Q0863O2575O1917n400m2712j13046p3931
19982a58089j2916J9581J78935n261L620L3472j24330P3P5862j9376p3816m0180
19970a22425K7298J6422J9636j7424n4300O7965J14139m0417N7613N6526j05344
19959A9689p8074K7329q31p7767o963k9988o4537J39112J10655j17547J4253J16199
$$ plain form
19947 51530 19330 -31456 -32707 -28222 -65034 -128599 -83060 -91415 -80032 -109265 -131520 -116046
19935 -116046 -16312 -18310 -55324 20914 55254 -37192 -74855 -44875 6535 8916 -20569 -19703
19923 -19703 -34442 -85540 -84304 -54551 -56465 -71792 -63583 -94382 -76257 -59718 -14320 -50687
19911 -50687 -91354 24888 124843 91609 74203 57548 126515 137496 97507 66913 -3278
19900 -3278 -5097 97634 72327 88001 102026 112204 63722 -42723 -22330 37622 99537 111536
19888 111536 80939 56064 68171 83376 13755 1959 37019 26549 3506 3080 -18136 -75071
19876 -75071 -74004 -43983 -2163 4090 33513 -31271 -69467 -82067 -58265 -9 13051 -11346
19864 -11346 8348 -54530 -49991 6327 37425 14440 -69041 -107674 -124436 -115171 -53082 28140
$$ packed form
19947E1530l2200n0786j251M485l6812o3565M5539q355J1383k9233k2255J5474
19935a16046R9734j998l7014P6238L4340r2446l7663K9980N1410K381k9485Q66
19923a9703j4739n1098J236K9753j914j5327Q209l0799J8125J6539M5398l6367
19911e0687m0667J16242R9955l3234j7406j6655O8967J0981l9989l0594p0191
19900c278j819J02731k5307J5674J4025J0178m8482j06445K0393N9952O1915J1999
19888A11536l0597k4875J2107J5205o9621j1796L5060j0470k3043m26k1216n6935
19876g5071J067L0021M1820O253K9423o4784l8196j2600K3802N8256J3060k4397
19864a1346J9694o2878M539N6318L1098k2985q3481l8633j6762R265O2089Q1222
$$ plain form
19852 28140 69907 40884 -20816 48914 16771 -113281 -172337 -246499 -175386 -101535 -73690
19841 -73690 -65144 -64256 -82054 -152694 -136141 -87089 -69445 -81335 -3915 7430 -53977 -32727
19829 -32727 -10119 34324 46283 31645 35947 77222 103939 99191 20177 -52601 -18042 -55008
19817 -55008 -86772 -77703 -118339 -92246 -6471 43938 6155 40463 46465 -12552 -12292 72256
19805 72256 -10104 -66952 -156603 -201508 -174605 -110848 -20505 6735 57416 72553 3119 -62460
19793 -62460 -45510 -43891 -86283 -47567 -45860 -74714 -82427 -22089 41025 57264 8066 -33384
19781 -33384 -5425 17045 78594 54050 45106 44879 46919 39062 12872 -38377 -34162 -107421 -77859
19768 -77859 -14260 -30740 -52485 5704 32312 19044 82258 119170 17247 -69166 -41201
$$ packed form
19852B8140M1767k9023o1700O9730l2143j30052n9056p4162P1113P3851K7845
19841g3690Q546Q88j7798p0640J6553M9052J7644j1890P7420J1345o1407K1250
19829c2727K2608M4443J1959j4638M302M1275K6717m748p9014p2778L4559l6966
19817e5008l1764R069m0636K6093Q5775N0409l7783L4308O002n9017K60Q4548
19805G2256q2360n6848q9651m4905K6903O3757R0343K7240N0681J5137o9434o5579
19793f2460J6950J619m2392L8716J707k8854p713O0338O3114J6239m9198m1450
19781c3384K7959K2470O1549k4544q944k27K040p857k6190n1249M215p3259K9562
19768g7859O3599j6480k1745N8189K6608j3268O3214L6912j01923q6413K7965
$$ plain form
19757 -41201 -55721 -108515 -78510 -9060 73208 84527 131986 106378 -17502 -81089 -112661
19746 -112661 -145099 -63246 39909 -44858 -62639 -85813 -66265 -34655 -33336 -4809 52217
19735 52217 77458 88524 27949 -46463 -44986 -12626 -14087 -60124 -169578 -172336 -124603 -54903
19723 -54903 7308 49542 17654 56494 -12416 -69301 -83119 -1013 52975 -9256 -52671 -124420
19711 -124420 -123030 -150722 -86515 -50361 -13313 48783 95400 73580 83461 46182 7240 -18170
19699 -18170 -52473 -50665 5224 52397 28083 88390 81959 -15580 -30045 -72762 -126678 -69463
19687 -69463 459 -10823 -111627 -104048 -67371 -19290 76264 103414 92864 52189 17124 7377
19675 7377 14625 -55623 -74779 -35761 27266 100629 134524 93315 43629 -45072 -88834 -98091
$$ packed form
19757d1201j4520n2794L0005O9450Q2268J1319M7459k5608j23880o3587l1572
19746a12661l2438Q1853J03155q4767j7781k3174J9548L1610J319K8527N7026
19735E2217K5241J1066o0575p4412J477L2360j461m6037j09454k758M7733O9700
19723e4903O2211M2234l1888L8840o8910n6885j3818Q2106N3988o2231m3415p1749
19711a24420J390k7692O4207L6154L7048O2096M6617k1820R881l7279l8942k5410
19699a8170l4303J808N5889M7173k4314O0307o431r7539j4465m2717n3916N7215
19687f9463O9922j1282j00804P579L6677M8081R5554K7150j0550m0675l5065r747
19675G377P248p0248j9156L9018O3027P3363L3895m1209m9686q8701m3762r257
$$ plain form
19663 -98091 -97473 -8000 88607 163421 155330 86645 -67528 -114390 -61592 -40015 -77361 -53627
19651 -53627 -80059 -59206 -13372 19319 45393 76717 51859 54300 -27528 -64186 -5611 -19579
19639 -19579 -97849 -115671 -126403 -95520 -56970 -37449 -18602 -13006 -28159 -13108 45708 -713
19627 -713 -71514 -121050 -80839 11764 -4924 -18625 -46014 -79373 -39245 -72036 -51945 10646
19615 10646 27094 20035 112829 136984 109307 53295 119806 102792 -59874 -62434 -27489 -33323
19603 -33323 11641 55656 47427 42352 35969 55666 181865 213371 205352 150611 164138 165623
19591 165623 74102 48709 -44358 -99432 -118387 -77290 -118945 -169924 -113595 -22813 -17314 -43238
19579 -43238 24562 53014 47949 76496 28007 87975 105287 77157 120138 203954 187346 84332
$$ packed form
19663i8091O18Q9473R6607P4814q091o8685j54173m6862N2798K1577l7346K3734
19651e3627k6432K0853M5834L2691K6074L1324k4858K441q1828l6658N8575j3968
19639a9579p8270j7822j0732L0883L8550J9521J8847N596j5153J5051N8816m6421
19627g13p0801m9536M0211R2603j6688j3701k7389l3359M0128l2791K0091O2591
19615A0646J6448p059R2794K4155k7677n6012O6511j7014j62666k560L4945n834
19603c3323M4964M4015q229n075o383J9697J26199L1506q019n4741J3527J485
19591A65623r1521k5393r3067n5074j8955M1097m1655n0979N6329R0782N499k5924
19579d3238O7800K8452n065K8547m8489N9968J7312k8130M2981Q3816j6608j03014
$$ plain form
19567 84332 -2687 16343 17945 6353 -21279 45305 71904 -7318 -41202 -78489 -98928 -52902
19555 -52902 -10322 -25419 5526 144444 114720 64756 59202 25431 -97770 -151951 -85507
19544 -85507 -60895 -124976 -109964 -62157 14905 -16922 46702 70797 30377 9455 61729 73965
19532 73965 16841 -9286 58380 109731 75402 57761 9436 -35466 -52466 -47183 27552 54122
19520 54122 15760 11274 30716 -11429 -45215 8322 88742 54667 43589 40058 -76707 -106223
19508 -106223 -85404 -69228 -66186 -99185 -140948 -180174 -124000 -132090 -181116 -173155 -138032 -67837
19496 -67837 -101360 -53352 14754 -52430 -38431 -42468 -21215 11986 -43503 -112931 -85663 -50448
19484 -50448 -74723 -75320 -85573 -110579 -93524 -106174 -50949 -2722 -3799 10738 17424 19461 45011
$$ packed form
19567H4332q7019J9030J602j1592k7632O6584K6599p9222l3884l7287k0439M6026
19555e2902M2580j5097L0945J38918k9724m9964n554l3771j23201n4181O6444
19544h5507K4612o4081J5012M7807P7062l1827O3624K4095m0420k0922N2274J2236
19532G3965n7124k6127O7666N1351l4329j7641m8325m4902j7000N283P4735K6570
19520E4122l8362m486J9442m2145l3786N3537Q0420l4075j1078l531j16765k9516
19508a06223K0819J6176L042l2999m1763l9226N6174q090m9026P961L5123P0195
19496f7837l3523M8008O8106o7184J3999m037K1253L3201n5489o9428K7268L5215
19484e0448k4275n97j0253k5006J7055j2650N5225M8227j077J4537O686K037K5550
$$ plain form
19471 45011 22869 -35986 -65800 26982 -2844 6943 28233 -272 20471 74901 84525 7272
19459 7272 -68641 -35521 -105968 -132671 -125333 -64546 -11689 20190 140979 185357 109764 6230
19447 6230 34869 52491 38112 75723 105738 36821 -6113 16339 48605 44126 -40432 48927
19435 48927 38592 20897 28927 -47584 -136080 -99165 -105187 -62678 -48621 -70116 -53525 -54668
19423 -54668 -18303 26902 28483 82136 150026 55133 -13272 18301 -7772 36716 35492 -4900
19411 -4900 -33305 -61391 -85841 -101006 -101834 -47261 -26611 -47092 -50870 -45801 -57961 -37291 -23950
19398 -23950 -33017 -40225 31033 103954 153555 48519 -49542 -84798 3022 148715 218096 155756
19386 155756 67573 2319 -84158 -69745 -16190 15932 145307 137615 55530 81927 35057
$$ packed form
19471D5011k2142n8855k9814R2782k9826R787K1290k8505K0743N4430R624p7253
19459G272p5913L3120p0447k6703P338O0787N2857L1879J20789M4378p5593j03534
19447F230K8639J7622j4379L7611L0015o8917m2934K2452L2266m479q4558Q9359
19435D8927j0335j7695Q030p6511q8496L6915o022M2509J4057k1495J6591j143
19423e4668L6365M5205J581N3653O7890r4893o8405L1573k6073M4488j224m0392
19411d900k8405k8086k4450j5165q28N4573K0650k0481l778N069j2160K0670J3341
19398b3950r067p208P1258P2921M9601j05036r8061l5256Q7820J45693O9381o2340
19386A55756q8183o5254q6477J4413N3555L2122J29375p692q2085K6397m6870
$$ plain form
19375 35057 15540 60754 79628 138574 140899 194947 196257 46369 12965 113304 67245 -2345
19363 -2345 -2091 -11469 -24183 50449 121031 109107 31735 116927 131192 52600 -66770 -72653
19351 -72653 -33823 -38437 -114416 -103845 -96215 -86394 -3199 33264 -32984 23434 -41871 -52384
19339 -52384 -40816 27567 7761 19417 54718 48640 89650 51791 11578 -7723 -42626 -29549
19327 -29549 90139 92945 61493 11164 -46535 -100322 -24412 63177 51429 -50794 30970
19316 30970 71237 92194 44756 39162 53234 34173 30491 44033 -5834 -2113 14166 9043
19304 9043 -48101 -18020 15459 16065 16846 2741 -6820 -50077 -59279 -121672 -139738 -131956 -50967
19291 -50967 36560 55959 -6716 -95480 -136432 -159895 -103808 -63038 36056 103312 86246 -12768
$$ packed form
19375C5057j9517M5214J8874N8946K325N4048J310j49888l3404J00339m6059o9590
19363b345K54r378j2714P4632P0582j1924p7372Q5192J4265p8592j19370n883
19351g2653L8830m614p5979J0571P630R821Q3195L6463o6248N6418o5305j0513
19339e2384J1568O8383j9806J1656L5301o078M1010l7859m0213j9301l4903J3077
19327b9549J19688K806l1452n0329n7699n3787P5910Q7589j1748j02223Q1764
19316C0970M0267K0957m7438n594J4072j9061l682J3542m9867L721J6279n123
19304I043n7144L0081L3479O06P81j4105r561m3257r202o2393j8066P782Q0989
19291e0967Q7527J9399o2675q8764m0952k3463N6087M0770R9094O7256j7066r9014
$$ plain form
19279 -12768 -27795 41651 79400 105701 69151 -48088 -52226 -71192 -59369 29041 19050 -11898
19267 -11898 3280 163163 214559 111564 37826 92439 122495 105178 71209 22246 21344 42914
19255 42914 98307 146258 76400 69463 147007 258305 268604 211579 182036 153986 134137 82726
19243 82726 61624 104164 83193 135942 149631 70074 15942 17617 -680 -36755 -23034 45293
19231 45293 80969 16172 41007 142014 135096 27426 27267 -31277 -34757 66856 67677 84349
19219 84349 77154 104711 167311 216002 150670 125873 93060 35250 -6993 -37350 -34638 -4003
19207 -4003 -81933 -44526 40103 -6000 -89587 -61850 8088 26798 80930 124013 99790 136774
19195 136774 53699 -3721 -34182 -84427 -95062 -29726 9220 35096 61030 -4528 -76533
$$ packed form
19279a2768j5027O9446L7749K6301l6550j17239m138j8966J1823Q8410r991l0948
19267a1898J5178J59883N1396j02995p3738N4613L0056j7317l3969m8963r02K1570
19255D2914N5393M7951o9858o937P7544J11298J0299n7025k9543k8050j9849n1411
19243H2726k1102M2540k0971N2749J3689p9557n4132J675j8297l6075J3721O8327
19231D5293L5676o4797K4835J01007o918j07670j59n8544l480J01613Q21J6672
19219H4349p195K7557O2600M8691o5332k4797l2813n7810m2243l0357K712L0635
19207d003p7930L7407Q4629m6103q3587K7737O9938J8710N4132M3083k4223L6984
19195A36774q3075n7420l0461n0245j0635O5336L8946K5876K5934o5558p2005
$$ plain form
19184 -76533 -109650 -37652 7692 -1274 -83501 -194782 -168921 -45995 16832 46196 75632
19173 75632 124214 148445 186566 185978 145081 79571 67191 117171 128732 13786 124502 137165
19161 137165 155720 157682 118089 67506 98208 68175 22095 43282 87396 84565 100929 196131
19149 196131 277050 257136 255055 306104 305693 373097 503358 465403 383748 451200 554988 509835
19137 509835 499916 509685 519538 615898 795137 937642 957888 869546 775744 661913 568066
19126 568066 495687 392782 323230 204278 175495 201885 182169 209853 254363 279025 241724
19115 241724 183639 240533 240278 182116 169951 227330 235532 204763 141714 92682 155045 134577
19103 134577 114272 120178 96076 101476 181733 233873 267267 306323 265816 229117 297433 392342
$$ packed form
19184g6533l3117P1998M5344q966q2227j11281K5861J22926O2827K9364K9436
19173G5632M8582K4231L8121n88m0897o5510j2380M9980J1561j14946J10716J2663
19161A37165J8555J962l9593n0583L0702l0033m6080K1187M4114k831J6364R5202
19149A96131Q0919j9914k081N1049m11O7404J30261l7955q1655O7452J03788m5153
19137E09835r919R769R853R6360J79239J42505K0246q8342r3802j13831r3847
19126E68066p2379j02905o9552j18952k8783K6390j9716K7684M4510K4662l7301
19115B41724n8085N6894k55n8162j2165N7379Q202l0769o3049m9032O2363k0468
19103A34577k0305N906k4102N400Q0257N2140L3394L9056m0507l6699O8316R4909
$$ plain form
19091 392342 478850 509902 610241 740906 818341 865444 848330 794571 763025 750891 610715
19080 610715 502941 571942 616956 545006 373388 245573 284961 324780 336836 212967 162095
19069 162095 159615 190688 97808 70426 39060 19284 53821 33372 17596 -54397 21498 89984
19057 89984 112086 198309 114448 18137 18963 18672 52364 99140 68598 83197 227351 267503
19045 267503 210304 197875 163909 148178 73643 98466 88378 160357 174113 122329 129149 73154
19033 73154 114634 83314 88277 84711 63087 6052 64780 66941 60235 112929 157310 125599
19021 125599 41540 55736 116054 98561 51012 61203 48567 58020 81301 21723 13290 19603
19009 19603 -27970 -10852 -63145 -74502 -4418 -15218 -69828 -5098 67963 123106 128847 74942
$$ packed form
19091C92342Q6508L1052J00339J30665P7435M7103j7114n3759l1546j2134j40176
19080F10715j07774O9001M5014p1950j71618j27815L9388L9819J2056j23869n0872
19069A62095k480L1073r2880k7382l1366j9776L4537k0449j5776p1993P5895O8486
19057H9984K2102Q6223q3861r6311Q26k91L3692M6776l0542J4599J44154M0152
19045B67503n7199j2429l3966j5731p4535K4823j0088P1979J3756n1784O820n5995
19033G3154M1480l1320M963l566k1624n7035N8728K161o706N2694M4381l1711
19021A25599q4059J4196O0318j7493m7549J0191j2636R453K3281n9578q433O313
19009A9603m7573J7118n2293j1357P0084j0800n4610O4730P3061N5143N741n3905
$$ plain form
18997 74942 61189 129128 133779 138448 172489 154865 80506 76262 107525 116916 62086 77673
18985 77673 72211 45202 75222 91745 143326 122323 67412 124873 134113 152693 141693 83632
18973 83632 14903 -4015 954 8481 31781 80909 58302 -12871 -57374 -8321 22852 -17401
18961 -17401 88097 97254 71635 104211 139458 96988 51735 11644 35505 43143 105185 205766
18949 205766 152233 69509 9406 15538 42243 50429 111466 145568 158151 137786 163294 152704
18937 152704 68893 36581 88939 134938 127167 2861 -11759 -52412 -45620 46205 58271 16756
18925 16756 107127 131172 151706 250269 179894 66530 118222 112350 109035 151178 125811 71416
18913 71416 152049 182119 165868 140748 122385 125971 119173 71873 137587 172723 166537 99366
$$ packed form
18997G4942j3753O7939M651M669L4041j7624p4359m244L1263R391n4830J5587
18985G7673n462k7009L0020J6523N1581k1003n4911N7461R240J8580j1000n8061
18973H3632o8729j8918M969P527K3300M9128k2607p1173m4503M9053L1173m0253
18961a7401J05498R157k5619L2576L5247m2470m5253m0091K3861P638O2042J00581
18949B05766n3533q2724o0103O132K6705Q186O1037L4102J2583k0365K5508j0590
18937A52704q3811l2312N2358M5999p771j24306j4620m0653O792R1825J2066m1515
18925A6756R0371K4045K0534R8563p0375j13364N1692n872l315M2143k5367n4395
18913G1416Q0633L0070j6251k5120j8363L586o798m7300O5714L5136o186o7171
$$ plain form
18901 99366 66010 15080 17851 76303 130109 172768 112409 82553 126697 167356 124329 66445
18889 66445 153983 228171 163288 85528 31402 51550 113574 140233 126709 113548 154496 165356
18877 165356 299277 327705 254022 238333 266361 311726 299514 315935 335577 358177 305849
18866 305849 257874 284261 271952 362249 369413 349615 321506 195042 107225 168051 145720
18855 145720 137061 143423 233960 184427 211184 253385 166520 81100 114254 159788 98889 140891
18843 140891 146453 108278 159750 128248 38558 40926 -9781 -48732 -39633 -62129 -56318 -22275
18831 -22275 177253 172104 178872 129695 71220 97089 195855 288983 302063 292553 281420 285156
18819 285156 303028 395784 427931 392713 333645 321413 374721 449780 456669 369893 353028 345749
$$ packed form
18901I9366l3356n0930K771N8452N3806M2659o0359k9856M4144M0659m3027n7884
18889F6445Q7538P4188o4883p7760n4126K0148O2024K6659j3524j3161M0948J0860
18877A65356J33921K8428p3683j5689K8028M5365j2212J6421J9642K2600n2328
18866C05849m7975K6387j2309R0297P164j9798k8109j26464q7817O0826k2331
18855A45720q659O362R0537m9533K6757M2201q6865q5420L3154M5534o0899M2002
18843A40891N562l8175N1472l1502q9690K368n0707l8951R099k2496N811L4043
18831b2275J99528n149O768m9177n8475K5869R8766R3128J3080r510j1133L736
18819B85156J7872R2756L2147l5218n9068j2232N3308P5059O889q6776j6865p279
$$ plain form
18807 345749 374237 424656 403528 369379 353882 321582 301288 350928 392517 362313 305358
18796 305358 278078 136053 73275 122971 61641 70125 146750 199296 273998 214650 163996
18785 163996 201095 167572 208392 202502 184073 157534 182954 98474 120053 116815 139913 271019
18773 271019 335670 274888 180951 122406 80027 112320 133542 146197 124829 60234 93009
18762 93009 140965 218124 250482 224806 193981 216104 177571 241970 239109 277602 275834 243013
18750 243013 189482 132217 178910 256054 311771 320548 385642 428681 455872 501893 531329 491787
18738 491787 461940 495912 678348 809419 808516 708972 672108 686888 700509 716094 684904
18727 684904 616962 527316 460082 428479 468055 545079 569564 511624 469013 398109 397649 399552
$$ packed form
18807C45749K8488N0419k1128l4149j5497l2300k0294M9640M1589l0204n6955
18796C05358k7280j42025o2778M9696o1330Q484P6625N2546P4702n9348n0654
18785A63996L7099l3523M0820n890j8429k6539K5420q4480K1579l238K3098J31106
18773B71019O4651o0782r3937n8545m2379L2293K1222J2655k1368o4595L2775
18762I3009M7956P7159L2358k5676l0825K2123l8533O4399k861L8493j768l2821
18750B43013n3531n7265M6693P7144N5717Q777O5094M3039K7191M6021K9436l9542
18738D91787k9847L3972J82436J31071r03r9544l6864J4780J3621J5585l1190
18727F84904o7942q9646o7234l1603L9576P7024K4485n7940m2611p0904m60J903
$$ plain form
18715 399552 478976 536925 456548 404419 453997 520742 610289 631241 633985 630551 612033 667111
18703 667111 776478 855198 872400 885431 908457 925536 936361 944919 959617 1070652 1100758
18692 1100758 1111364 1163087 1227972 1284485 1381161 1513493 1580784 1566075 1488191 1339556 1280462
18681 1280462 1325724 1369053 1316319 1304115 1270034 1202568 1252817 1254231 1257727 1262635 1254358 1286984
18669 1286984 1392624 1458434 1437940 1461341 1600883 1656775 1774919 1829304 1822606 1941624 2075933
18658 2075933 2162556 2280443 2314613 2318654 2414167 2598250 2840019 3150442 3477898 3843765
18648 3843765 4203169 4633138 5029941 5452746 5743737 5995977 6399443 6843959 7227601
18639 7227601 7524199 7904846 8290744 8737750 9328947 10123992 11030105 12285816 13956631
$$ packed form
18715C99552P9424N7949q0377n2129M9578O6745Q9547K0952K744l434j8518N5078
18703F67111J09367P8720J7202J3031K3026J7079J0825Q558J4698J11035L0106
18692A100758J0606N1723O4885N6513R6676J32332O7291j4709p7884j48635n9094
18681A280462M5262M3329n2734j2204l4081o7466N0249J414L496M908q277L2626
18669A286984J05640O5810k0494K3401J39542N5892J18144N4385o698J19018J34309
18658B075933Q6623J17887L4170M041R5513J84083K41769L10423L27456L65867
18648C843765L59404M29969L96803M22805K90991K52240M03466M44516L83642
18639G227601K96598L80647L85898M47006N91197P95045R06113J255711J670815
$$ plain form
18630 13956631 16080353 18862267 22950085 28795571 37222430 49894593 68738480 94204979
18622 94204979 117706645 124417820 118262670 109733488 99886133 90899788 88945410 96841489
18614 96841489 111133737 121236426 125193192 130274703 131863667 121568852 106398671
18607 106398671 93562524 81480962 68550201 56641749 47354264 40224867 34119918
18600 34119918 28982658 25207706 22564477 20461526 18982937 18120027 17890150 17836507 17932263
18591 17932263 18237605 18925564 20185212 22307970 25645987 29965969 33231248 33389052
18583 33389052 31719166 29643377 27280429 25220491 24366050 24929932 26793185 29917426
18575 29917426 34736448 41945066 52689028 68665605 92250485 124454048 154982869
$$ packed form
18630A3956631K123722K781914M087818N845486Q426859J2672163J8843887K5466499
18622I4204979K3501666O711175o155150q529182r847355q986345j954378P896079
18614I6841489J4292248J0102689L956766N081511J588964j0294815j5170181
18607A06398671j2836147j2081562j2930761j1908452r287485p129397o104949
18600C4119918n137260l774952k643229k102951j478589q62910k29877n3643R5756
18591A7932263L05342O87959J259648K122758L338017M319982L265279J57804
18583C3389052j669886k075789k362948k059938q54441N63882J863253L124241
18575B9917426M819022P208618J0743962J5976577K3584880L2203563L0528821
$$ plain form
18568 154982869 166031049 164528230 164548491 166604266 167637442 164379121 160733570 159359688
18560 159359688 150160432 129470112 107350851 87448251 68615896 52686280 40950259
18553 40950259 32822551 27061177 22861543 19782229 17365264 15569456 14202934 13018787
18545 13018787 11958862 11033735 10188465 9350938 8626776 7945945 7340747 6983932 6644532
18536 6644532 6213606 5850957 5407900 4892495 4403482 4010620 3700040 3408963 3230356
18527 3230356 3057691 2891976 2665435 2428981 2271904 2175318 2095884 1985618 1922730 1849503
18517 1849503 1813153 1763283 1681966 1590619 1470411 1381247 1309326 1235750 1178890 1136245 1124928
18506 1124928 1099250 1012555 1044887 956352 892394 856767 863682 805960 749074 746390 744431 771903
$$ packed form
18568A54982869J1048180j502819K0261K055775J033176l258321l645551j373882
18560A59359688r199256k0690320k2119261j9902600j8832355j5929616j1736021
18553D0950259q127708n761374m199634l079314k416965j795808j366522j184147
18545A3018787j059925r25127q45270q37527p24162o80831o05198l56815l39400
18536F644532m30926l62649m43057n15405m89013l92862l10580k91077j78607
18527C230356j72665j65715k26541k36454j57077r6586p9434j10266o2888p3227
18517A849503l6350m9870q1317r1347j20208q9164p1921p3576n6860m2645j1317
18506A124928k5678q6695L2332q8535o3958l5627O915n7722n6886k684j959K7472
$$ plain form
18494 771903 814962 802456 792240 786085 713292 690629 602360 597925 575546 653958 735964 742253
18482 742253 727744 705380 582389 516186 549781 604680 667990 623906 593058 639010 613488
18471 613488 529612 502879 447948 445914 473524 521974 572647 590358 560492 550995 599425 716178
18459 716178 797441 879883 928285 906111 813284 729866 751215 807164 843590 816886 798013
18448 798013 700719 675902 558317 398686 321183 375444 467719 471324 572667 586698 609674
18437 609674 660661 672345 695924 777592 873378 861920 907545 1023543 1156553 1197876 1199898
18426 1199898 1155944 1133102 1149418 1116542 1130301 1139885 1105972 1073945 1076168 1057970 1011860 1048617
18414 1048617 1076214 1103563 1207043 1170446 1160411 1227726 1286528 1264738 1298405 1330111 1284016
$$ packed form
18494G71903M3059j2506j0216o155p2793k2663q8269m435k2379P8412Q2006O289
18482G42253j4509k2364j22991o6203L3595N4899O3310m4084l0848M5952k5522
18471F13488q3876k6733n4931k034K7610M8450N0673J7711k9866r497M8430J16753
18459G16178Q1263Q2442M8402k2174r2827q3418K1349N5949L6426k6704j8873
18448G98013r7294k4817j17585j59631p7503N4261R2275L605J01343J4031K2976
18437F09674N0987J1684K3579Q1668R5786j1458M5625J15998J33010M1323K022
18426A199898m3954k2842J6316l2876J3759R584l3913l2027K223j8198m6110L6757
18414A048617K7597K7349J03480l6597j0035O7315N8802k1790L3667L1706m6095
$$ plain form
18403 1284016 1274199 1239779 1138201 1021696 916029 891690 845518 836456 881943 826955 762266
18392 762266 681089 627810 570920 502304 612763 716139 739424 739187 797784 855949 942746
18381 942746 1056662 1181125 1231116 1298868 1348508 1353071 1312796 1227738 1228987 1220054 1182402 1221940
18369 1221940 1243335 1184988 1154757 1081131 1072307 1114776 1098344 1111549 1032744 1040545 1008044 824987
18357 824987 772542 735687 784672 832943 841293 811816 809227 807425 719329 602562 577860 542195
18345 542195 610908 720092 660922 634105 637810 517086 499945 550310 540844 516294 450070
18334 450070 382460 342717 323835 339488 399093 413237 402649 405045 365046 331515 312021 349029
18322 349029 362545 284851 321983 261842 203647 293479 434392 431178 460472 477673 446799
$$ packed form
18403A284016r817l4420j01578j16505j05667k4339m6172r062M5487n4988o4689
18392G62266q1177n3279n6890o8616J10459J03376K3285k37N8597N8165Q6797
18381I42746J13916J24463M9991O7752M9640M563m0275q5058J249q933l7652L9538
18369A221940K1395n8347l0231p3626q824M2469j6432J3205p8805P801l2501j83057
18357H24987n2445l6855M8985M8271Q350k9477k589j802q8096j16767k4702l5665
18345E42195O8713J09184n9170k6817L705j20724j7141N0365r466k4550o6224
18334D50070o7610l9743j8882J5653N9605J4144j0588K396l9999l3531j9494L7008
18322C49029J3516p7694L7132o0141n8195Q9832J40913l214K9294J7201l0874
$$ plain form
18311 446799 365509 369699 430686 463126 473644 464707 464093 385378 292810 365046 432710 410896
18299 410896 434525 471116 459161 381282 278090 276902 361228 324531 240061 247639 340756 363840
18287 363840 391313 457258 486238 446516 497220 423755 412685 441967 392024 320175 416585
18276 416585 569079 618171 547477 470134 379267 388165 485479 634021 672941 695899 845508
18265 845508 900726 878603 877219 877523 873336 827696 862944 891916 846309 884631 880951 850670
18253 850670 912016 901597 857852 853463 903729 851210 902564 989074 957695 834031 784455
18242 784455 771681 806832 854718 865030 965712 1029991 1042992 1056660 1046859 1066764 1181632
18231 1181632 1215291 1191660 1214593 1210954 1294926 1465974 1526172 1586226 1610213 1687481 1734350
$$ packed form
18311D46799q1290M190O0987L2440J0518q937o14p8715r2568P2236O7664k1814
18299D10896K3629L6591j1955p7879j03192j188Q4326l6697q4470P578R3117K3084
18287C63840K7473O5945K8980l9722N0704p3465j1070K9282m9943p1849R6410
18276D16585J52494M9092p0694p7343r0867Q898R7314J48542L8920K2958J49609
18265H45508N5218k2123j384L04m187m5640L5248K8972m5607L8322l680l0281
18253H50670O1346j0419m3745m389N0266n2519N1354Q6510l1379j23664m9576
18242G84455j2774L5151M7886J0312J00682O4279J3001J3668r801J9905J14868
18231A181632L3659k3631K2933l639Q3972J71048O0198O0054K3987P7268M6869
$$ plain form
18220 1734350 1904108 2168955 2285299 2452465 2519427 2742616 2910115 2942148 2980946 3114039
18210 3114039 3364166 3479799 3723554 3966487 4200959 4443563 4721523 5107974 5568847
18201 5568847 6273893 7170014 8283360 9741612 11716652 14623248 18872207 25178864
18193 25178864 34382654 45791176 54034678 54824213 51901883 48289300 44436216 42535856
18185 42535856 45047646 52110750 59284451 59644518 54225957 47401574 39490962 31231385
18177 31231385 24494252 19780537 16578514 14497421 13053259 11983757 11211767 10671443
18169 10671443 10289438 9935501 9615310 9504261 9461042 9416574 9420017 9540654 9754795 10140365
18159 10140365 10450675 10948920 11623969 12395564 13430998 14854809 16699592 18823094 21652991
$$ packed form
18220A734350J69758K64847J16344J67166O6962K23189J67499L2033L8798J33093
18210C114039K50127J15633K43755K42933K34472K42604K77960L86451M60873
18201E568847P05046Q96121J113346J458252J975040K906596M248959O306657
18193B5178864R203790J1408522Q243502P89535k922330l612583l853084j900360
18185D2535856K511790P063104P173701L60067n418561o824383p910612q259577
18177C1231385o737133m713715l202023k081093j444162j069502p71990n40324
18169A0671443l82005l53937l20191j11049m3219m4468L443J20637K14141L85570
18159A0140365L10310M98245O75049P71595J035434J423811J844783K123502K829897
$$ plain form
18150 21652991 25505102 30959945 38708219 49458617 64426054 85883205 114926260
18143 114926260 144466732 160015891 160258191 155596991 149956564 140156211 124597886 108545542
18135 108545542 95899154 86439757 81399538 83336567 90567570 94359626 88351570 78263916
18127 78263916 67407221 55375281 44598029 36967198 32101350 28913339 26146591 23507895
18119 23507895 21374552 19552895 17992051 16572781 15498610 14876199 14550043 14263716
18111 14263716 13994228 13903633 14026459 14436812 15127322 16076520 17173514 18262165 19581633
18102 19581633 21446085 24053363 27958192 33687333 41993090 54497744 73049992 97363468
18094 97363468 118600983 123849323 117414880 108524335 98458503 90403975 90075182 99479535
$$ packed form
18150B1652991L852111N454843P748274J0750398J4967437K1457151K9043055
18143A14926260K9540472J5549159K42300m661200n640427r800353j5558325j6052344
18135A08545542j2646388r459397n040219J937029P231003L792056o008056j0087654
18127G8263916j0856695j2031940j0777252p630831m865848l188011k766748k638696
18119B3507895k133343j821657j560844j419270j074171o22411l26156k86327
18111A4263716k69488r0595J22826M10353O90510R49198J096994J088651J319468
18102A9581633J864452K607278L904829N729141Q305757J2504654J8552248K4313476
18094I7363468K1237515N248340o434443q890545j0065832q054528l28793R404353
$$ plain form
18086 99479535 114122827 120653229 112884937 99220817 83515507 66002003 50276731
18079 50276731 38679551 30635438 25042388 20961160 18007832 15739732 13922319 12382560
18071 12382560 11186436 10260825 9467235 8680158 8071172 7603572 7176765 6972764 6715425
18062 6715425 6443888 6126088 5851696 5583603 5342278 5210253 5133234 5098777 4985354 4912886
18052 4912886 4789735 4518013 4348223 4142367 4007759 3910386 3911485 3968167 3958633 3816675
18042 3816675 3544467 3309032 3127720 2968326 2811970 2545272 2372559 2361247 2391704 2390947
18032 2390947 2281741 2165501 1967575 1817490 1806634 1849667 1899530 1858163 1866349 1918367 1957516
18021 1957516 1943300 1826377 1739631 1784800 1828980 1936678 2018031 2049261 2028684 1984566 2063237
$$ packed form
18086I9479535J4643292O530402p768292j3664120j5705310j7513504j5725272
18079E0276731j1597180q044113n593050m081228k953328k268100j817413j539759
18071A2382560j196124r25611p93590p87077o08986m67600m26807k04001k57339
18062F715425k71537l17800k74392k68093k41325j32025p7019l4457j13423p2468
18052D912886j23151k71722j69790k05856j34608r7373J099N6682r534j41958
18042C816675k72208k35435j81312j59394j56356k66698j72713j1312L0457p57
18032B390947j09206j16240j97926j50085j0856M3033M9863m1367Q186N2018L9149
18021A957516j4216j16923q6746M5169M4180J07698Q1353L1230k0577m4118P8671
$$ plain form
18010 2063237 2095663 2085060 2061637 2069884 2117562 2186537 2245012 2288862 2456079 2580935 2638557
17999 2638557 2682434 2709140 2739067 2880392 2979662 3022162 3142606 3351750 3469172 3507413
17989 3507413 3506239 3541029 3459146 3462833 3506323 3532898 3610087 3685615 3692645 3770649 3871693 3966488
17977 3966488 4031272 4154202 4438310 4727757 5029908 5326265 5621059 5853512 6002735 6152214
17967 6152214 6216172 6408436 6609132 6724224 6928044 7235397 7651900 8088396 8603024 9202623
17957 9202623 10086013 11292905 12786247 14549354 16774681 19675709 23791310 29582098
17949 29582098 38052318 50182139 65577040 78032354 81421059 80121859 78596399 77673765
17941 77673765 80751148 91924158 112483985 135213030 143098025 133433577 117934365
$$ packed form
18010B063237L2426j0603k3423Q247M7678O8975N8475M3850J67217J24856N7622
17999B638557M3877K6706K9927J41325R9270M2500J20444K09144J17422L8241
17989C507413j174L4790q1883L687M3490K6575P7189P5528P030P8004J01044R4795
17977C966488O4784J22930K84108K89447L02151K96357K94794K32453J49223J49479
17967F152214O3958J92264K00696J15092K03820L07353M16503M36496N14628N99599
17957I202623Q83390J206892J493342J763107K225327K901028M115601N790788
17949B9582098Q470220J2129821J5394901J2455314L388705j299200j525460r22634
17941G7673765L077383J1173010K0559827K2729045P884995r664448j5499212
$$ plain form
17934 117934365 99523952 78917327 61329789 49072966 40911796 35630359 32248051
17927 32248051 30174677 28877960 27999440 27682989 27699783 28040026 28603018 29597391 31076857
17918 31076857 33215214 36371067 41093663 47880394 57621452 71789146 92529231 121660857
17910 121660857 154943468 176505457 178680756 173032719 166619550 162423498 168964386 193038121
17902 193038121 234225022 275430168 291389607 289022069 280445143 260233500 238091923
17895 238091923 229230881 232912627 236233022 228069166 215724741 204343552 186251493
17888 186251493 161189578 138665298 121286664 106259457 91691616 78233398 67220734
17881 67220734 57971581 50020315 43698604 38917169 35250218 32485894 30434103 29023417
$$ packed form
17934A17934365j8410413k0606625j7587538j2256823q161170n281437l382308
17927C2248051k073374j296717q78520l16451J6794L40243N62992R94373J479466
17918C1076857K138357L155853M722596O786731R741058J4167694K0740085K9131626
17910A21660857L3282611K1561989K175299n648037o413169m196052O540888K4073735
17902A93038121M1186901M1205146J5959439k367538q576926k0211643k2141577
17895B38091923q861042L681746L320395q163856j2344425j1381189j8092059
17888A86251493k5061915k2524280j7378634j5027207j4567841j3458218j1012664
17881F7220734r249153p951266o321711m781435l666951k764324k051791j410686
$$ plain form
17873 29023417 27972620 27187090 26837791 26837942 27265515 28247755 30170426 33212051 37884929
17864 37884929 44907416 55377778 70596055 89274747 104462351 112201805 118482530
17857 118482530 123881155 122774473 119121197 120527734 128261021 140247506 153354878 170401279
17849 170401279 191986522 200838102 185856058 162126859 137959705 112816829 91958710
17842 91958710 79830693 75673511 74527032 69879979 61943263 53729787 45177592 36699649
17834 36699649 29798447 24769826 21117573 18416529 16367164 14699986 13302692 12127229
17826 12127229 11153779 10228005 9410679 8677304 7979556 7380366 6909423 6367972 5927259
17817 5927259 5644647 5469516 5226523 4846118 4471481 4173338 3975732 3773791 3590620
$$ packed form
17873B9023417j050797p85530l49299J51M27573R82240J922671L041625M672878
17864C7884929P022487J0470362J5218277J8678692J5187604P739454O280725
17857A18482530N398625j106682l653276J406537P733287J1986485J3107372J7046401
17849A70401279K1585243Q851580j4982044k3729199k4167154k5142876k0858119
17842I1958710j2128017m157182j146479m647053p936716q213476q552195q477943
17834C6699649o901202n028621l652253k701044k049365j667178j397294j175463
17826A2127229r73450r25774q17326p33375o97748n99190m70943n41451m40713
17817E927259k82612j75131k42993l80405l74637k98143j97606k01941j83171
$$ plain form
17808 3590620 3423108 3329024 3203167 3030824 2932202 2773830 2610706 2482027 2276719 2137647
17798 2137647 2068111 1982026 1897290 1809208 1750186 1546771 1438830 1400431 1342793 1240727 1128627
17787 1128627 1093695 1045399 917051 834749 880017 999885 958019 909058 826925 697555 583051
17776 583051 440827 514945 615515 645561 752388 793134 749932 687587 576766 583018 659332
17765 659332 771746 798511 791711 834420 845310 854166 790480 751692 837625 928903 887838 798697
17753 798697 816997 773279 699339 679869 667541 613916 555102 621484 590134 650257 637709
17742 637709 647873 632839 590830 551765 514244 400145 300248 275124 290940 217642 213911
17731 213911 240700 320414 342955 291899 259138 210988 177541 231160 343996 462371 580882
$$ packed form
17808C590620j67512r4084j25857j72343r8622j58372j63124j28679k05308j39072
17798B137647o9536q6085q4736q8082n9022k03415j07941l8399n7638j02066j12100
17787A128627l4932m8296j28348q2302M5268J19868m1866m8961q2133j29370j14504
17776E83051j42224P4118J00570L0046J06827M0746m3202o2345j10821O252P6314
17765F59332J12414K6765o800M2709J0890Q856o3686l8788Q5933R1278m1065q9141
17753G98697J8300m3718p3940j9470j2328n3625n8814O6382l1350O0123j2548
17742F37709J0164j5034m2009l9065l7521j14099r9897k5124J5816p3298l731
17731B13911K6789P9714K2541n1056l2761m8150l3447N3619J12836J18375J18511
$$ plain form
17720 580882 530442 496852 490951 482536 502737 595900 697917 686131 574611 565591 584160 569750
17708 569750 533380 462863 448928 518719 526895 531529 561595 607636 594047 550770 456939 315476
17696 315476 254565 274311 342872 409482 439284 451953 370251 341753 325137 274725 334020
17685 334020 347349 371661 413949 414306 386274 331193 330618 383209 373278 359159 439970 479902
17673 479902 445760 414294 457481 518840 590041 718607 854556 980593 976913 956092 845141
17662 845141 793206 853782 889620 869947 850776 783858 686344 600546 594456 553330 501814 483010
17650 483010 434418 406691 364220 265703 190788 157644 147287 110731 153910 186623 205265
17639 205265 246113 235537 197742 134853 151764 203155 186508 206591 222266 292890 283494 256591
$$ packed form
17720E80882n0440l3590n901q415K0201R3163J02017j1786j11520r020J8569j4410
17708E69750l6370p0517j3935O9791Q176M634L0066M6041j3589m3277r3831j41463
17696C15476o0911J9746O8561O6610K9802J2669q1702k8498j6616n0412N9295
17685C34020J3329K4312M2288L57k8032n5081n75N2591r931j4119Q0811L9932
17673D79902l4142l1466M3187O1359P1201J28566J35949J26037l680k0821j10951
17662H45141n1935O0576L5838j9673j9171o6918r7514q5798o090m1126n1516j8804
17650D83010m8592k7727m2471r8517p4915l3144j0357l6556M3179L2713J8642
17639B05265M0848j0576l7795o2889J6911N1391j6647K0083J5675P0624r396k6903
$$ plain form
17627 256591 253454 264275 279791 292938 376434 406540 487168 567340 621599 588137 646430 718154
17615 718154 693804 742443 797663 968710 966769 879655 861165 734975 655906 580326 467119
17604 467119 339705 267008 286584 253914 307459 255837 84317 59866 109645 140200 113833
17593 113833 117866 114505 95355 51369 33622 12021 3996 -19070 110281 105819 63338 111503
17581 111503 82277 64254 94345 127531 143745 163627 182140 217958 202662 229094 207651
17570 207651 220589 298606 266630 324508 381218 391481 402497 316011 296867 324291 266421
17559 266421 272359 247475 111958 113707 55723 16016 44891 78037 -44047 -92374 -9283
17548 -9283 40136 -23014 22393 73665 60115 62592 45306 10185 -18351 -49869 1725 47459
$$ packed form
17627B56591l137J0821J5516J3147Q3496L0106Q0628Q0172N4259l3462N8293P1724
17615G18154k4350M8639N5220J71047j941q7114j8490j26190p9069p5580j13207
17604D67119j27414p2697J9576l2670N3545n1622j71520k4451M9779L0555k6367
17593A13833M033l361j9150m3986j7747k1601q025k3066J29351m462m2481M8165
17581A11503k9226j8023L0091L3186J6214J9882J8513L5818j5296K6432k1443
17570B07651J2938P8017l1976N7878N6710J0263J1016q6486j9144K7424n7870
17559B66421N938k4884j35517J749n7984l9707K8875L3146j22084m8327Q3091
17548i283M9419o3150M5407N1272j3550K477j7286l5121k8536l1518N1594M5734
$$ plain form
17536 47459 78731 87037 177551 163781 157384 242375 222901 133073 9874 4804 10506 31215
17524 31215 -1669 1142 8946 52758 100038 57141 18879 14986 53822 6099 -15898 -27988
17512 -27988 -12153 -11414 8417 46196 106603 132783 73162 -10397 -38505 -24067 44570 110484
17500 110484 20469 11429 12617 41005 142151 97633 128283 185012 193933 194906 165314 151373
17488 151373 164774 93394 45212 64412 101938 101901 26413 47531 3576 14198 87701 22408
17476 22408 -26274 -35173 -34978 -38814 -45587 -28116 6535 27212 -7059 11606 119613 203974
17464 203974 199247 98730 101683 80132 97775 116661 86121 107657 118318 90266 61679 1379
17452 1379 17878 64435 11062 -15140 -6202 18052 156563 186115 141533 96801 51511 41577
$$ packed form
17536D7459L1272Q306R0514j3770o397Q4991j9474q9828j23199n070N702K0709
17524C1215l2884K811P804M3812M7280m2897l8262l893L8836m7723k1997j2090
17512b7988J5835P39J9831L7779O0407K6180n9621q3559k8108J4438O8637O5914
17500A10484r0015r040J188K8388J01146m4518L0650N6729Q921R73k9592j3941
17488A51373J3401p1380m8182J9200L7526l7p5488K1118m3955J0622P3503o5293
17476B2408m8682q899J95l836o773J7471L4651K0677l4271J8665J08007Q4361
17464B03974m727j00517K953k1551J7643J8886l0540K1536J0661k8052k8587o0300
17452A379J6499M6557n3373k6202Q938K4254J38511K9552m4582m4732m5290r934
$$ plain form
17440 41577 103712 98803 150154 115113 99122 151908 251866 229728 170323 216588 318324 457397
17428 457397 637849 627871 527950 512812 551160 505330 461386 448931 420551 407347 395867
17417 395867 361647 289669 184210 159517 108690 185902 258630 242907 211625 222181 157902
17406 157902 118801 90730 19980 75239 84172 103867 187176 288363 257574 235079 346670
17395 346670 376986 490558 602087 755492 813860 902795 1016366 983315 1039864 1073796 1068500
17384 1068500 1127589 1219936 1375849 1440296 1347097 1307479 1213426 1197881 1142101 1001948 990372
17373 990372 1090755 1018309 908396 812548 766018 693671 580924 453033 339085 228119
17363 228119 207679 159817 155951 203906 122295 89926 116806 233152 248995 158195 130833
$$ packed form
17440D1577O2135m909N1351l5041j5991N2786R9958k2138n9405M6265J01736J39073
17428D57397J80452r978r9921j5138L8348m5830m3944j2455k8380j3204j1480
17417C95867l4220p1978j05459k4693n0827P7212P2728j5723l1282J0556o4279
17406A57902l9101k8071p0750N5259Q933J9695Q3309J01187l0789k2495J11591
17395C46670L0316J13572J11529J53405N8368Q8935J13571l3051N6549L3932n296
17384A068500N9089R2347J55913O4447r3199l9618r4053j5545n5780j40153j1576
17373I90372J00383p2446j09913r5848m6530p2347j12747j27891j13948j10966
17363B28119k0440m7862l866M7955q1611l2369K6880J16346J5843r0800k7362
$$ plain form
17352 130833 93593 118320 208312 218797 186323 224497 318335 334139 265705 349265 509114
17341 509114 647030 662131 635472 625927 709555 743250 780056 836175 974813 969024 969808 988089
17329 988089 959222 905001 832357 750877 684837 651229 603580 591445 577489 472556 310370
17318 310370 228134 222734 197718 191738 138438 130239 86992 17526 -10900 95953 133877 108142
17306 108142 50403 56133 40151 2208 -31536 -54708 -32322 -14518 28084 124384 77163 -92273
17294 -92273 -93368 -35171 -39178 -26005 -10535 20674 -18458 -92942 -114661 -73546 -5216 -55761
17282 -55761 -67576 -47753 10316 -9880 -75994 -114549 -129920 -99847 17392 -6285 -55750
17271 -55750 -38071 34900 52357 5263 -16352 -1539 -2130 -13217 62940 83307 -63351 -115169
$$ packed form
17352A30833l7240K4727Q9992J0485l2474L8174R3838J5804o8434Q3560J59849
17341E09114J37916J5101k6659r545Q3628L3695L6806N6119J38638n789P84J8281
17329I88089k8867n4221p2644q1480o6040l3608m7649j2135j3956j04933j62186
17318C10370q2236n400k5016n980n3300q199m3247o9466k8426J06853L7924k5735
17306A08142n7739N730j5982l7943l3744k3172K2386J7804M2602R6300m7221j69436
17294i2273j095N8197m007J3173J5470L1209l9132p4484k1719M1115O8330n0545
17282e5761j1815J9823N8069k0196o6114l8555j5371L0073J17239k3677m9465
17271e5750J7679P2971J7457m7094k1615J4813n91j1087P6157K0367j46658n1818
$$ plain form
17259 -115169 -106130 -103866 -40006 19450 39279 55520 31699 24137 36252 -14302 -100316 -180551
17247 -180551 -261188 -246772 -188320 -161397 -129123 -123774 -142723 -191844 -191283 -225603 -247159 -183744
17235 -183744 -112901 -87846 -38647 45057 74193 5181 37500 49063 28745 37649 182 -24403
17223 -24403 -2318 33112 43767 147628 177882 106697 -6093 -4081 -29876 -39044 -62715 -45147
17211 -45147 3359 68554 78911 71684 137600 138274 45375 63595 -57430 -126058 -99578 1848
17199 1848 9432 5535 2153 -13147 -7441 -79345 -89744 -84051 -13613 59758 -90060 -35544 31601
17186 31601 84491 77418 49359 36831 -83222 -140066 -118750 -116458 11242 -25483 -56914 -84573
17174 -84573 -129656 -53465 -27213 -2952 -2254 21399 -60230 -48939 -51278 -76356 -71725 -104130
$$ packed form
17259a15169R039K264O3860N9456J9829J6241k3821p562J2115n0554q6014q0235
17247a80551q0637J4416N8452K6923L2274N349j8949m9121N61l4320k1556O3415
17235a83744P0843K5055M9199Q3704K9136o9012L2319J1563k0318Q904l7467k4585
17223b4403K2085L5430J0655J03861L0254p1185j12790K012k5795r168k3671J7568
17211d5147M8506O5195J0357p227O5916O74r2899J8220j21025o8628K6480J01426
17199A848P584l897l382j5300N706p1904j0399N693P0438P3371j49818N4516O7145
17186C1601N2890p073k8059j2528j20053n6844K1316K292J27700l6725l1431k7659
17174h4573m5083P6191K6252K4261O98K3653q1629J1291k339k5078M631l2405
$$ plain form
17162 -104130 -132926 -77484 -37107 -20367 31729 58857 62066 76330 -620 -75763 -98887 -75956
17150 -75956 -117329 -106459 -81448 12618 1414 -34268 -104874 -138931 -81423 24852 27667 46257
17138 46257 -12938 -84400 -72208 -160685 -157354 -129300 -112323 -118886 -76674 -14477 7540 60095
17126 60095 -39781 -92351 -63089 -49215 14977 7667 -8836 -34500 5625 105247 89448 -6221
17114 -6221 -125000 -87695 -92703 -75893 -92223 -86184 -83085 -81998 -85408 -64579 -39313 -44328 -37216
17101 -37216 -11783 1613 -80679 -81292 -111716 -151652 -110149 -122808 -59647 47425 57849 35628
17089 35628 44016 5529 7378 41148 30743 62755 96671 116846 153172 123742 112241 110442
17077 110442 79905 6429 -22372 5278 -38779 54128 83464 83133 32587 9743 36744 7872
$$ packed form
17162a04130k8796N5442M0377J6740N2096K7128L209J4264p6950p5143k3124K2931
17150g5956m1373J0870K5011R4066j1204l5682p0606l4057N7508J06275K815J8590
17138D6257n9195p1462J2192q8477L331K8054J6977o563M2212O2197K2017N2555
17126F0095r9876n2570K9262J3874O4192p310j6503k5664M0125R9622j5799r5669
17114f221j18779L7305n008J6810j6330O039L099J087l410K0829K5266n015P112
17101c7216K5433J3396q2292o13l0424l9936M1503j2659O3161J07072J0424k2221
17089C5628Q388l8487J849L3770j0405L2012L3916K0175L6326k9430j1501j799
17077A10442l0537p3476k8801K7650m4057R2907K9336l31n0546k2844K7001k8872
$$ plain form
17065 7872 27333 68115 -31039 -62542 -47122 -66561 17849 46721 78302 58767 -51198 -65931
17053 -65931 -109676 -69373 -35491 -11450 -65903 15930 129476 181119 168178 138337 124206
17042 124206 92342 28483 6568 24865 22126 45933 59604 -62063 -86210 -133542 -128099 -115289
17030 -115289 -82139 -155666 -195220 -201778 -201454 -199281 -185181 -107755 -132057 -106331 15583 61338
17018 61338 46883 -32317 -54195 -52634 -38369 28610 50674 -25386 -61301 -3237 13373 38337
17006 38337 49799 50844 48096 -493 -67846 -10698 -57345 -34166 -44785 -71172 -107304 -149861
16994 -149861 -167267 -95332 -25593 -55641 -124064 -91800 -24647 -19388 9326 26016 87475 104677
16982 104677 32312 -80474 -110585 -8588 42435 81316 74863 24317 1467 -410 -5468 37999
$$ packed form
17065G872J9461M0782r9154l1503J5420j9439Q4410K8872L1581j9535j09965j4733
17053f5931m3745M0303L3882K4041n4453Q1833J13546N1643j2941k9841j4131
17042A24206l1864o3859k1915J8297k739K3807J3671j21667k4147m7332N443J2810
17030a15289L3150p3527l9554o558L24K173J4100P7426k4302K5726J21914M5755
17018F1338j4455p9200k1878J561J4265O6979K2064p6060l5915N8064J6610K4964
17006C8337J1462J045k748m8589o7353N7148m6647K3179j0619k6387l6132m2557
16994a49861j7406P1935O9739l0048o8423L2264O7153N259K8714J6690O1459J7202
16982A04677p2365j12786l0111J01997N1023L8881o453n0546k2850j877n058M3467
$$ plain form
16970 37999 104364 93772 42313 20727 12872 -67353 -115444 -57399 -39241 -34030 -58191 12324
16958 12324 26674 13294 -28067 -60447 -1192 36064 72544 -5892 -114335 -74253 -5099
16947 -5099 -7316 -46962 9292 51046 107898 51174 30204 -110567 -180669 -107491 -161943 -167616
16935 -167616 -169940 -174335 -131364 -20461 28026 -16631 -66849 -137223 -104610 -27168 -17316 17198
16923 17198 22120 1444 -21106 -16899 21343 57266 84854 76582 88856 92218 50666 67117
16911 67117 81383 -812 -106351 -159855 -179006 -79078 -68323 -36249 34767 8363 -46043
16900 -46043 -99709 -96544 -96520 -74687 -23734 16872 47658 39244 -12228 -84389 -84368 -57153 -4587
16887 -4587 -55997 -59130 -23658 -44845 16093 19449 49643 572 -99310 -54114 -58091 -111106
$$ packed form
16970C7999O6365j0592n1459k1586p855q0225m8091N8045J8158N211k4161P0515
16958A2324J4350j3380m1361l2380N9255L7256L6480p8436j08443M0082O9154
16947e099k217l9646N6254M1754N6852n6724k0970j40771p0102P3178n4452n673
16935a67616k324m395M2971J10903M8487m4657n0218p0374L2613P7442R852L4514
16923A7198M922k0676k2550M207L8242L5923K7588q272J2274L362m1552J6451
16911F7117J4266q2195j05539n3504j9151R9928J0755L2074P1016k6404n4406
16900d6043n3666L165K4K1833N0953M0606L0786q414n1472p2161K1K7215N2566
16887d587n1410l133L5472k1187O0938L356L0194m9071r9882M5196l977n3015
$$ plain form
16875 -111106 -124283 -92559 -75479 -114168 -194233 -150481 -119594 -156558 -128642 -34231 -52678
16864 -52678 -48296 -2512 -52217 -92597 -64106 21487 -30242 -124842 -116250 -108421 -43004 44725
16852 44725 46434 29033 48559 -1764 -41589 -115272 -124973 -21277 -20211 -47918 -101475 -111850
16840 -111850 -133940 -131380 -9554 98313 31084 -3496 -39865 -69845 -31726 -78437 -151767
16829 -151767 -122532 -70369 -71530 -73113 2304 7911 -54843 -15114 48621 -15923 -68535 -34554
16817 -34554 -1483 25797 -19675 -6768 16610 -12461 11921 65616 129881 82715 15658 -48192
16805 -48192 -53926 -48736 -34742 59655 116523 130658 148840 167752 104445 -45461 33661 164455
16793 164455 166176 37770 904 29972 -15707 15345 11396 -38571 -60962 -54903 7808 49720
$$ packed form
16875a11106j3177L1724J7080l8689q0065M3752L0887l6964K7916R4411j8447
16864e2678M382M5784m9705m0380K8491Q5593n1729r4600Q592P829O5417Q7729
16852D4725J709j7401J9526n0323l9825p3683r701J03696J066k7707n3557j0375
16840a11850k2090K560J21826J07867o7229l4580l6369k9980L8119m6711p3330
16829a51767K9235N2163j161j583P5417N607o2754L9729O3735o4544n2612L3981
16817c4554L3071K7280m5472J2907K3378k9071K4382N3695O4265m7166o7057o3850
16805d8192n734N190J3994R4397N6868J4135J8182J8912o3307j49906P9122J30794
16793A64455J721j28406l6866K9068m5679L1052l949m9967k2391O059O2711M1912
$$ plain form
16781 49720 71003 83971 82519 129165 159612 86829 -35738 -94116 -49024 -54975 -112346 -56270
16769 -56270 7927 -17462 -110498 -112151 -85684 -95097 -33282 -12664 -3374 36699 -6022 648
16757 648 32508 -26416 -67466 -34302 30480 25919 -81435 -115350 -34182 -9271 29479 87045
16745 87045 95853 23760 -20347 -311 -35713 68317 130075 43337 -69625 -118792 -129854
16734 -129854 -156966 -96891 -42231 -61041 -41754 -4408 25260 -33400 -15793 81791 141377
16723 141377 156175 153184 98628 68224 -5903 50362 56676 5436 17584 29776 15882 43004
16711 43004 25947 -75286 -61919 -30203 -25704 99947 142053 88201 23549 23814 38041 28939
16699 28939 75725 113370 58812 -3170 -35266 -63859 -55378 -107838 -104432 -80914 -98695 -47855
$$ packed form
16781D9720K1283J2968j452M6646L0447p2783j22567n8378M5092n951n7371N6076
16769e6270O4197k5389r3036j653K6467r413O1815K0618R290M0073m2721O670
16757F48L1860n8924m1050L3164O4782m561j07354l3915Q1168K4911L8750N7566
16745H7045Q808p2093m4107K0036l5402J04030O1758q6738j12962m9167j1062
16734a29854k7112O0075N4660j8810J9287L7346K9668n8660J7607R7584N9586
16723A41377J4798k991n4556l0404p4127N6265O314n1240J2148J2192j3894K7122
16711D3004j7057j01233J3367L1716M499J25651M2106n3852o4652K65J4227r102
16699B8939M6786L7645n4558o1982l2096k8593Q481n2460L406K3518j7781N0840
$$ plain form
16687 -47855 55710 71092 65488 6304 9 -27535 -88554 -75494 -62976 -74775 -28153 54494
16675 54494 107111 91366 -12808 -37154 3157 -33943 -84156 -136141 -120740 -77536 -35737
16664 -35737 -33738 -89239 -137453 -167044 -114124 -85364 -88074 -78496 -36574 -140704 -124645 -71169
16652 -71169 -47941 -74803 -79091 -56202 46604 73771 15914 -62919 -105735 -138448 -126639 -16143
16640 -16143 47118 24401 39238 19991 -47289 -64711 -33240 -33929 -28629 -46496 -126063 -188352
16628 -188352 -251981 -197753 -93543 -11116 -112459 -149478 -109583 -56836 -400 74926 126656
16617 126656 84911 109493 87584 12175 -29083 3762 -12318 -24526 55 -17636 -52322
16606 -52322 -165229 -67307 28659 -7057 3834 5578 -38590 -36542 -51405 -111655 -65759 -158208
$$ packed form
16687d7855J03565J5382n604n9184o295k7544o1019J3060J2518j1799M6622Q2647
16675E4494N2617j5745j04174k4346M0311l7100n0213n1985J5401M3204M1799
16664c5737J999n5501m8214k9591N2920K8760k710R578M1922j04130J6059N3476
16652g1169K3228k6862m288K2889J02806K7167n7857p8833m2816l2713J1809J10496
16640a6143O3261k2717J4837j9247o7280j7422L1471o89N300j7867p9567o2289
16628a88352o3629N4228J04210Q2427j01343l7019L9895N2747N6436P5326N1730
16617A26656m1745K4582k1909p5409m1258L2845j6080j2208K4581j7691l4686
16606e2322j12907R7922R5966l5716J0891J744m4168K048j4863o0250M5896r2449
$$ plain form
16594 -158208 -204471 -129504 -65867 -156413 -176321 -138529 -53150 -50459 -53819 -55118 -127774 -160028
16582 -160028 -64748 -43992 -103438 -150247 -130458 -143279 -137278 -132115 -95598 -94037 -140974 -218671
16570 -218671 -222469 -223934 -130558 -108328 -46485 44553 47838 -7455 5545 -58823 -99904 -145293
16558 -145293 -82656 -55714 -141751 -155393 -75395 11973 113427 109663 72122 14816 -11008
16547 -11008 -4261 -101902 -88389 -91397 -52057 -15691 -28777 -29312 -14093 -42753 -129810 -222796
16535 -222796 -175907 -78492 -23479 -3226 -19638 -151338 -197344 -75481 -53881 -58692 -19189
16524 -19189 5983 15178 28240 -41233 -129832 -134712 -121093 -34991 -31082 -129278 -214283 -88301
16512 -88301 -983 31432 28864 44753 72417 44012 60183 -18838 -74668 -66518 -24041 15377
$$ packed form
16594a58208m6263P4967O3637r0546j9908L7792Q5379K691l360j299p2656l2254
16582a60028R5280K0756n9446m6809J9789j2821O001N163L6517J561m6937p7697
16570b18671l798j465R3376K2230O1843R1038L285n5293J3000o4368m1081m5389
16558a45293O2637K6942q6037j3642P9998Q7368J01454l764l7541n7306k5824
16547a1008O747r7641J3513l008L9340L6366j3086n35J5219k8660q7057r2986
16535b22796M6889R7415N5013K0253j6412j31700m6006J21863K1600m811L9503
16524a9189K5172R195J3062o9473q8599m880J3619Q6102L909r8196q5005J25982
16512h8301Q7318L2415k568J5889K7664k8405J6171p9021n5830Q150M2477L9418
$$ plain form
16500 15377 35518 60773 65239 29058 -792 -30324 -116617 -138123 -117121 -35323 -17989 28522
16488 28522 -6821 -46055 -17753 -34504 -84424 -100863 -32532 62814 47058 -4119 -25769 -23666
16476 -23666 -36414 -96843 -109867 -71916 -53709 -19495 -17463 -76164 -82137 -16925 -36872 -26307
16464 -26307 13000 38015 -32535 21318 57009 19387 35681 20523 7209 -4556 27567 -25854
16452 -25854 -74944 -134532 -160995 -160996 -194152 -84568 27572 58133 31741 13438 42328 68178
16440 68178 19540 -4772 26958 25505 47200 87828 106593 66189 11935 -47410 -98443 -110795
16428 -110795 -47459 -10070 72158 42254 26473 -3919 -17677 -5460 -23549 -16224 41079 50951
16416 50951 -24965 -95127 -105442 -22068 41032 26371 -64536 -83173 -113667 -91853 -123467 -116105
$$ packed form
16500A5377K0141K5255M466l6181k9850k9532q6293k1506K1002Q1798J7334M6511
16488B8522l5343l9234K8302j6751m9920j6439O8331R5346j5756n1177k1650K103
16476b3666j2748o0429j3024L7951J8207L4214K032n8701n973O5212j9947J0565
16464b6307L9307K5015p0550N3853L5691l7622J6294j5158j3314j1765L2123n3421
16452b5854m9090n9588k6463jl3156J09584J12140L0561k6392j8303K8890K5850
16440F8178m8638k4312L1730j453K1695M0628J8765m0404n4254n9345n1033j2352
16428a10795O3336L7389Q2228k9904j5781l0392j3758J2217j8089P325N7303R872
16416E0951p5916p0162j0315Q3374O3100j4661r0907j8637l0494K1814l1614P362
$$ plain form
16404 -116105 -131128 -124054 -121805 -61619 -68615 -92082 -57074 -14147 -47198 -95276 -37259 -50433
16392 -50433 -40319 10241 44754 13169 21760 57987 99347 99606 31084 -73470 -101578 -82220
16380 -82220 -66198 68706 43763 -4504 -20674 -50042 -92251 -198688 -203677 -135327 -98604
16369 -98604 -91421 -95119 -843 64216 13954 10601 -34980 -72712 7948 46335 22813 36964
16357 36964 105548 104512 50355 53056 79486 137792 38807 -75179 -100625 -128941 -125782 -77384
16345 -77384 -151212 -189140 -227046 -177405 -64302 -47352 -8387 31620 -56297 -98815 -138726
16334 -138726 -164529 -74908 12148 31854 5254 -21215 -17764 -27799 -4706 -28038 -67976 -45812
16322 -45812 -3097 24135 9146 -67758 -56446 -78695 -86085 -13279 -22423 -76133 -28675 -4005
$$ packed form
16404a16105j5023P074K249O0186o996k3467L5008M2927l3051m8078N8017j3174
16392e0433J0114N0560L4513l1585Q591L6227M1360K59o8522j04554k8108J9358
16380h2220J6022J34904k4943m8267j6170k9368m2209j06437m989O8350L6723
16369i8604P183l698R4276O5059n0262l353m5581l7732Q0660L8387k3522J4151
16357C6964O8584j036n4157K701K6430N8306r8985j13986k5446k8316L159M8398
16345g7384p3828l7928l7906M9641J13103J6950L8965M0007q7917m2518l9911
16334a38726k5803Q9621Q7056J9706k6600k6469L451j0035K3093k3332l9938K2164
16322d5812M2715K7232j4989p6904J1312k2249p390P2806r144n3710M7458K4670
$$ plain form
16310 -4005 -86768 -65761 -130449 -182591 -136249 -39782 -10884 25093 56838 57787 -4713 -48659
16298 -48659 -3963 4013 -14011 -78420 -27793 -75389 -88202 -24311 -49901 -49069 -68655 -42293
16286 -42293 9739 -16723 -139925 -188947 -64904 375 -51327 -83263 15304 49637 -19865
16275 -19865 -58507 -96111 -131938 -173710 -174919 -162662 -153564 -134810 -233486 -221586 -174777 -171393
16263 -171393 -158364 -204229 -175660 -157249 -132605 -72094 -11339 21860 15478 83026 19049 64485
16251 64485 59226 4424 -34910 7439 -46971 -65350 -30049 -25547 -38934 -8266 -36008 -100311
16239 -100311 -117216 -144965 -148705 -149263 -92425 -26659 -23364 -56054 -36254 -20977 -89671 -90949
16227 -90949 -13580 -5122 91114 131017 68483 45075 19050 22509 85035 -15785 -40678 10451
$$ packed form
16310d005q2763K1007o4688n2142M6342R6467K8898L5977L1745R49o2500m3946
16298d8659M4696P976j8024o4409N0627m7596j2813O3891k5590Q32j9586K6362
16286d2293N2032k6462j23202m9022J24043O5279n1702l1936R8567L4333o9502
16275a9865l8642l7604l5827m1772j209J2257R098J8754r8676J1900M6809L384
16263a71393J3029m5865K8569J8411K4644O0511O0755L3199o382O7548o3977M5436
16251F4485n259n4802l9334M2349n4410j8379L5301M502j3387L0668k7742o4303
16239a00311j6905k7749l740n58N6838O5766L295l2690J9800J5277o8694j278
16227i0949P7369Q458R6236L9903o2534k3408k6025L459O2526j00820k4893N1129
$$ plain form
16215 10451 80545 143240 93861 4316 -50843 -41234 -62279 -58179 -62559 -34255 -69424 -124503
16203 -124503 -76868 2176 37362 15978 -37347 -74726 -42410 -12149 79236 46753 75396
16192 75396 56231 17750 -43517 -60342 -79808 -49649 -69210 -55093 21692 29065 -90166 -162958
16180 -162958 -142654 -90041 -95385 -118204 -103504 -75148 -50837 -47505 -73277 -95611 -38838 40997
16168 40997 -21952 -104373 -91200 -116721 -53727 6502 -48017 -147276 -103272 -54589 -79106 -61407
16156 -61407 -91317 -89437 -85856 -44315 -12859 -12019 -22835 34112 31982 36976 20347 -31579 -17017
16143 -17017 7182 15266 71357 35031 -40753 -54880 4833 15249 -37832 -70885 -68352 -49444
16131 -49444 -104312 -99865 -146567 -123963 -10685 3821 -3899 -71588 -68460 -88583 -83403 -93421
$$ packed form
16215A0451P0094O2695m9379q9545n5159R609k1045M100m380K8304l5169n5079
16203a24503M7635P9044L5186k1384n3325l7379L2316L0261R1385l2483K8643
16192G5396j9165l8481o1267j6825j9466L0159j9561J4117P6785P373j19231p2792
16180a62958K0304N2613n344k2819J4700K8356K4311L332k5772k2334N6773P9835
16168D0997o2949q2421J3173k5521O2994O0229n4519r9259M4004M8683k4517J7699
16156f1407k9910J880L581M1541L1456Q40j0816N6947k130M994j6629n1926J4562
16143a7017K4199Q084N6091l6326p5784j4127N9713J0416n3081l3053K533J8908
16131d9444n4868M447m6702K2604J13278J4506p720o7689L128k0123N180j0018
$$ plain form
16119 -93421 -82785 -35577 -31284 -45832 -62599 -78485 -93809 -137097 -182297 -104623 9803 119600
16107 119600 83484 141892 73798 29535 -42820 -84230 -38628 2383 58740 56212 59640 84887
16095 84887 78351 28431 -9970 -8352 7046 -54622 -71498 59408 44343 -29539 -12882 46022
16083 46022 75184 59916 -49926 -44129 38540 42176 -54702 -200701 -194101 -132818 -82773 -42954
16071 -42954 -52749 -118784 -48136 -33106 -6801 -93355 -78664 -62378 -75335 -83259 -70902 -76456
16059 -76456 -150400 -137789 -132760 -137111 -121319 -130461 -167448 -149992 -172780 -145739 -142109 -83742
16047 -83742 -68290 -25214 -20451 -76597 -90395 -147189 -102657 -144651 -116034 -79566 -92427 -37889
16035 -37889 -30733 -65362 -79190 -79478 -37729 32702 69484 43528 38000 45360 -36846 96 -10679
$$ packed form
16119i3421J0636M7208M293j4548j6767j5886j5324m3288m5200P7674J14426J09797
16107A19600l6116N8408o8094m4263p2355m1410M5602M1011N6357k528L428K5247
16095H4887o536m9920l8401J618J5398o1668j6876J30906j5065p3882J6657N8904
16083D6022K9162j5268j09842N797Q2669L636r6878j45999O600O1283N0045L9819
16071d2954r795o6035P0648J5030K6305q6554J4691J6286j2957p924J2357n554
16059g6456p3944J2611N029m351J5792r142l6987J7456k2788K7041L630N8367
16047h3742J5452M3076M763n6146j3798n6794M4532m1994K8617L6468j2861N4538
16035c7889P156l4629j3828k88M1749P0431L6782k5956n528P360q2206L6942j0775
$$ plain form
16022 -10679 31908 59185 57157 44830 68301 54659 13612 29543 24344 56133 61842 -23641
16010 -23641 -74204 -24446 19560 32377 30305 2633 -6809 -48885 -32558 -4118 -78766 -156947
15998 -156947 -140007 -54536 34077 94207 90556 35430 29326 19803 -22128 -104160 -114974 -38797
15986 -38797 14699 6168 -6624 -45851 25693 92532 96117 82337 22120 14348 -2037 -49922
15974 -49922 -132011 -140931 -34930 20181 -21491 -63258 -105094 -209544 -285134 -222014 -105474
15963 -105474 -55779 1517 -92364 -122137 10205 123394 168476 104867 47234 31404 38637
15952 38637 28693 34444 78948 7495 -21542 -27605 19988 87874 172165 187184 101287 172529
15940 172529 134301 18953 -20373 -20859 49274 7291 31017 78721 64118 58980 891 10324
$$ packed form
16022a0679M2587K7277k028j2327K3471j3642m1047J5931n199L1789N709q5483
16010b3641n0563M9758M4006J2817k072k7672r442m2076J6327K8440p4648p8181
15998a56947J6940Q5471Q8613O0130l651n5126o104r523m1931q2032j0814P6177
15986c8797N3496q531j2792l9227P1544O6839L585j3780o0217p772j6385m7885
15974d9922q2089q920J06001N5111m1672m1767m1836j04450p5590O3120J16540
15963a05474M9695N7296r3881k9773J32342J13189M5082o3609n7633j5830P233
15952C8637r944N751M4504p1453k9037o063M7593O7886Q4291J5019q5897P1242
15940A72529l8228j15348l9326m86P0133m1983K3726M7704j4603n138n8089R433
$$ plain form
15928 10324 -10911 -52592 -7680 -64940 -88769 -25735 27575 9284 -48637 -39426 -57836 -48695
15916 -48695 -29680 -19083 62656 33660 18284 -27225 -33798 -135055 -129665 -91753 -102196 -68690
15904 -68690 -47783 -17211 -23213 -64534 -59941 -5035 -27715 -66918 -75938 -57305 -90868 -90838 -153576
15891 -153576 -119454 -47960 34298 66559 71181 -23635 -100246 -96728 -100126 -88636 -182790 -173345
15879 -173345 -98761 -14594 7965 -29154 -87876 -52399 -34005 -23697 -37399 -21018 -26110 -20442
15867 -20442 -63928 -104132 -73395 -85581 -27018 -55127 -71894 -32512 -28097 -10510 21848 11347
15855 11347 -53171 -145124 -130357 16633 137779 129298 100579 28101 -97957 -88365 -87483 13342
15843 13342 119005 165001 162861 76243 -10924 -33161 -56903 -146883 -142176 -89308 -85358 -86429
$$ packed form
15928A0324k1235m1681M4912n7260k3829O3034N3310j8291n7921R211j8410R141
15916d8695J9015J0597Q1739k8996j5376m5509o573j01257N390L7912j0443L3506
15904f8690K0907L0572o002m1321M593N4906k2680l9203r020J8633l3563L0o2738
15891a53576L4122P1494Q2258L2261M622r4816p6611L518l398J1490r4154R445
15879a73345P4584Q4167K2559l7119n8722L5477J8394J0308j3702J6381n092N668
15867b0442m3486m0204L0737j2186N8563k8109j6767L9382M415J7587L2358j0501
15855A1347o4518r1953J4767J46990J21146q481k8719p2478j26058R592Q82J00825
15843A3342J05663M5996k140q6618q7167k2237k3742q9980M707N2868L950j071
$$ plain form
15831 -86429 -101706 -169871 -156242 -114675 -56481 -48349 -11515 20378 43224 68920 33112 22634
15819 22634 -44532 -106114 -78335 -84283 -57778 -49788 -53366 -20014 10149 6654 2927 86197 104222
15806 104222 52770 81127 24338 26801 -7132 1399 -76952 -110534 -210405 -185559 -129437 35866
15794 35866 106613 99731 96542 -52938 -113092 -108289 -122255 -49351 104164 113890 39000 42624
15782 42624 120616 166932 45130 -11138 1334 -10892 2407 -34015 -59703 -60906 -77384 -10710
15770 -10710 -52442 -90933 -99974 -88963 -3948 6513 18106 29094 8029 -34223 21836 55679
15758 55679 25485 -25611 -40619 25315 4002 -63686 -78185 -90440 -93327 -88425 -85090 17110
15746 17110 135092 177498 163100 43362 -89580 -63254 -50330 -34385 -87494 -153404 -82637
$$ packed form
15831h6429j5277o8165J3629M1567N8194Q132L6834L1893K2846K5696l5808j0478
15819B2634o7166o1582K7779n948K6505P990l578L3352L0163l495l727Q3270J8025
15806A04222n1452K8357n6789K463l3933Q531p8351l3582r9871K4846N6122J65303
15794C5866P0747o882l189j49480o0154M803j3966P2904J53515R726p4890L624
15782D2624P7992M6316j21802n6268J2472j2226J3299l6422k5688j203j6478O6674
15770a0710m1732l8491r041J1011Q5015J0461J1593J0988k1065m2252N6059L3843
15758E5679l0194n1096j5008O5934k1313o7688j4499j2255k887M902L335J02200
15746A7110J17982M2406j4398j19738j32942K6326J2924J5945n3109o5910P0767
$$ plain form
15735 -82637 -96698 -114185 -10241 41418 150732 119751 60068 45751 55090 82165 100437
15724 100437 59753 57930 20074 16944 -19626 39143 34717 -3100 -57871 -130564 -59004 -48084
15712 -48084 10541 9684 -40524 -59982 -38271 -76915 -105328 -155766 -199462 -129041 -56705 -2123
15700 -2123 -12325 13888 40908 6332 -29269 6784 22274 35707 21995 25980 79884 10214
15688 10214 -16237 1063 24403 92086 110814 99614 -33287 -121688 -79772 -14874 18324
15677 18324 9387 -63282 -167551 -112320 -65649 -72325 -52805 3238 126898 44821 -49611 36145
15665 36145 80164 43360 -7461 -63672 -7741 41034 41731 51271 40557 -43713 -122568 -92484
15653 -92484 -95451 -40744 28505 6814 -30929 -74673 -77752 -59901 -32337 -81248 -79868 60532
$$ packed form
15735h2637j4061j7487J03944N1659J09314l0981n9683j4317R339K7075J8272
15724A00437m0684j823l7856l130l6570N8769m426l7817n4771p2693P1560J0920
15712d8084N8625q57n0208j9458K1711l8644k8413n0438m3696P0421P2336N4582
15700b123j0202K6213K7020l4576l5601L6053J5490J3433j3712L985N3904o9670
15688A0214k6451J7300K3340O7683J8728j1200j32901q8401M1916O4898L3198
15677A8324q937p2669j04269N5231M6671o676J9520N6043J23660q2077r4432Q5756
15665C6145M4019l6804n0821n6211N5931M8775O97R540j0714q4270p8855L0084
15653i2484k967N4707O9249k1691l7743m3744l079J7851K7564m8911J380J40400
$$ plain form
15641 60532 132250 148911 137132 80470 67740 112813 74056 44867 31344 -8225 22578 -8483
15629 -8483 -7092 -17121 -79086 -130762 -97998 -66032 -3036 36844 -10562 60319 124383 135850
15617 135850 71704 722 -86296 -98426 -116056 -181379 -121733 -59242 -48810 -123779 -112499
15606 -112499 -182254 -147255 -35370 -5590 -58407 -95633 -50345 -124441 -135247 -167734 -191213
15595 -191213 -221550 -179737 -168887 -124837 -55152 -73826 -101240 -121041 -116007 -86853 -35475 -40917
15583 -40917 -124802 -133302 -72006 -52164 -91768 -55111 -42242 -122552 -139737 -151677 -232821 -297985
15571 -297985 -282267 -142478 -71057 -71299 -43937 38535 62383 54014 -44997 -155097 -94126 31758
15559 31758 -33855 -70207 -127032 -140486 -154833 -164511 -120913 27429 50342 -8098 -21783 -60163
$$ packed form
15641F0532P1718J6661j1779n6662j2730M5073l8757k9189j3523l9569L0803l1061
15629h483J391j0029o1965n1676L2764L1966O2996L9880m7406P0881O4064J1467
15617A35850o4146p0982q7018j2130j7630o5323N9646O2491J0432p4969J1280
15606a12499o9755L4999J11885K9780n2817l7226M5288p4096j0806l2487k3479
15595a91213l0337M1813J0850M4050O9685j8674k7414j9801N034K9154N1378n442
15583d0917q3885q500O1296J9842l9604L6657J2869q0310j7185j1940q1144o5164
15571b97985J5718J39789P1421k42K7362Q2472K3848q369r9011j10100O0971J25884
15559C1758o5613l6352n6825j3454j4347r678M3598J48342K2913n8440j3685l8380
$$ plain form
15547 -60163 -21540 68513 90635 108404 46804 41300 78671 67190 37689 15636 56616 16944
15535 16944 10404 78605 719 -7457 -47226 -30125 -19283 84064 161345 206306 107749 -22647
15523 -22647 -63608 -100115 -86993 -20901 -19792 -10290 -27188 -116657 -48818 -42184 -54940 -27502
15511 -27502 -38737 -14557 43087 6007 -56902 -75373 -162351 -154827 -76720 -85166 -30162 -6052
15499 -6052 -4048 -3351 -19866 -76074 -114803 -97620 -21583 11408 18826 -28011 -56771 -94505 -118146
15486 -118146 -161468 -138281 -88337 -76401 19128 -15680 -33450 -13651 76878 138831 136004 97428
15474 97428 62395 44067 44346 -67053 -164808 -139490 -37753 14527 -21109 -98684 -111627 -60030
15462 -60030 -24079 -52194 -57009 -40842 -18304 -23120 -35634 -32756 -63088 -11299 21375 46140
$$ packed form
15547f0163L8623R0053K2122J7769o1600n504L7371j1481k9501k2053M0980l9672
15535A6944o540O8201p7886q176l9769J7101J0842J03347P7281M4961r8557j30396
15523b2647m0961l6507J3122O6092J109R502j6898q9469O7839O634j2756K7438
15511b7502j1235K4180N7644l7080o2909j8471q6978P524P8107q446N5004K4110
15499f052K004O97j6515n6208l8729J7183P6037L2991P418m6837k8760l7734k3641
15486a18146m3322K3187M9944J1936R5529l4808j7770J9799R0529O1953k827l8576
15474I7428l5033j8328K79j11399r7755K5318J01737N2280l5636p7575j2943N1597
15462f0030L5951k8115m815J6167K2538m816j2514K878l0332N1789L2674K4765
$$ plain form
15450 46140 48199 7843 15393 47409 28986 51150 41264 97521 -14689 -99127 -144247 -134603
15438 -134603 -138811 -175003 -104188 -41989 3205 -6223 -35662 -7578 -47134 -5934 21150 9053
15426 9053 62579 66403 -653 -9011 -9946 -1607 -29751 44056 73252 -67601 -7625 43610 -45706
15413 -45706 -45420 88561 88348 55657 -15728 -23699 -63485 -125325 -57242 31614 64147 57129 154475
15400 154475 134515 74523 50305 132558 137674 147870 103283 80316 104403 43632 -14155 -13809
15388 -13809 -45437 -57841 34847 50025 43976 49731 2016 -5169 -4661 -25058 31020 5889 29477
15375 29477 66375 61048 11684 -30163 -17330 -37193 -152134 -119929 3497 75654 4322
15364 4322 -29804 7095 40578 19849 -89400 -103708 -62807 67746 42781 -40988 -50143 -128229
$$ packed form
15450D6140K059m0356P550L2016j8423K2164r886N6257j12210q4438m5120R644
15438a34603m208l6192P0815O2199M5194r428k9439K8084l9556M1200K7084j2097
15426I053N3526L824o7056q358r35Q339k8144P3807K9196j40853N9976N1235q9316
15413d5706K86J33981k13l2691p1385p971l9786o1840O8083Q8856L2533p018R7346
15400A54475j9960n9992k4218Q2253N116J0196m4587k2967K4087o0771n7787L46
15388a3809l1628j2404R2688J5178o049N755m7715p185N08k0397N6078k5131K3588
15375B9477L6898n327m9364m1847J2833j9863j14941L2205J23426P2157p1332
15364D322l4126L6899L3483k0729j09249j4308M0901J30553k4965q3769r155p8086
$$ plain form
15352 -128229 -118232 -136828 -113038 -161504 -175975 -125115 -9785 30307 21825 -22520 -10580 31531
15340 31531 50681 78939 74822 65438 60887 35310 4908 75188 120739 87024 19081 42169
15328 42169 -49463 -113873 -41033 19216 28347 -10036 8458 -9526 -80652 -56684 26879 77816
15316 77816 2612 -46640 -14304 44086 71710 29213 111341 130251 92311 116845 120572 46033
15304 46033 -15969 -40409 -2284 75935 62900 23738 5358 -36345 -138013 -133910 -91056 -69090
15292 -69090 950 2167 -42344 -36494 2550 -22009 -35949 -14879 24521 39910 41268 -26880
15280 -26880 -46146 -48514 -99511 -55144 -57122 -701 5642 -20652 -38084 17636 -59441 -48434
15268 -48434 13436 62628 88024 77417 82150 75447 114586 94933 56329 25662 78097 72319
$$ packed form
15352a28229R997j8596K3790m8466j4471N0860J15330M0092q482m4345J1940M2111
15340C1531J9150K8258m117r384m551k5577l0402P0280M5551l3715o7943K3088
15328D2169r1632o4410P2840O0249R131l8383J8494j7984p1126K3968Q3563N0937
15316G7816p5204m9252L2336N8390K7624m2497Q2128J8910l7940K4534L727p4539
15304D6033o2002k4440L8125P8219j3035l9162j8380m1703j01668M103M2854K1966
15292f9090P0040J217m4511N850L9044k4559j3940K1070L9400J5389J358o8148
15280b6880j9266k368n0997M4367j978N6421O343k6294j7432N5720p7077J1007
15268d8434O1870M9192K5396j0607M733o703L9139j9653l8604l0667N2435n778
$$ plain form
15256 72319 91520 85592 117227 87356 -2837 -42046 -18395 -12619 14186 3012 -50412 -18528
15244 -18528 38650 63895 46174 -723 5271 -6357 -71798 -51644 -51679 -81182 -108138 -80508
15232 -80508 -57061 18808 12374 57157 58944 166235 127170 74138 23435 -41780 -70456 -83523
15220 -83523 -35607 -31360 40389 -8998 32253 69698 139657 63307 52938 -45450 -32279 -85519
15208 -85519 -49403 -33704 -54510 -50127 -73644 -141495 -107509 -75854 -86965 -54428 10266 65177
15196 65177 87093 36511 11135 -107177 -173005 -51528 59165 155851 127121 37198 -18003
15185 -18003 -39772 54781 113019 156328 150852 107408 117458 116557 72410 78814 57887 44114
15173 44114 83381 87851 -20877 -101114 -30050 -20798 1981 33146 62139 66611 45157 43959
$$ packed form
15256G2319J9201n928L1635k9871r0193l9209K3651N776K6805j1174n3424L1884
15244a8528N7178K5245j7721m6897N994j1628o5441K0154l5k9503k6956K7630
15232h0508K3447P5869o434M4783J787J07291l9065n3032n0703o5215k8676j3067
15220h3523M7916M247P1749m9387M1251L7445O9959p6350j0369r8388J3171n3240
15208h5519L6116J5699k0806M383k3517o7851L3986L1655j1111L2537O4694N4911
15196F5177K1916n0582k5376j18312o5828J21477J10693R6686k8730q9923n5201
15185a8003k1769R4553N8238M3309n476m3444J0050r01m4147O404k0927j3773
15173D4114L9267M470j08728q0237P1064R252K2779L1165K8993M472k1454j198
$$ plain form
15161 43959 15170 9014 -7497 20636 36065 -6758 -28760 22945 67594 21099 -5623 -89998
15149 -89998 -110290 -118767 -148139 -171771 -191120 -122646 -12543 82138 14363 -518 28436 13686
15137 13686 -46589 -89626 -83204 -16176 33598 -78742 -225316 -141752 -87011 -60498 -7749
15126 -7749 22767 127310 129277 107872 97518 114627 192528 125795 39337 -24371 -48206 -77362
15114 -77362 -45586 -2778 6955 51762 -37592 -211925 -259349 -160870 -15058 22264 -18614
15103 -18614 -28078 -26301 -62187 -13832 43588 32987 -19516 -59878 -59672 -3530 87 -6150 56356
15090 56356 145611 37191 -29053 -11244 -4362 42464 131819 150255 118162 100027 60585 30583
15078 30583 26807 -16342 -66772 -146476 -176165 -52446 -28144 7167 38681 -7927 -76196 -54683
$$ packed form
15161D3959k8789o156j6511K8133J5429m2823k2002N1705M4649m6495k6722q4375
15149h9998k0292q477k9372k3632j9349O8474J10103R4681o7775j4881K8954j4750
15137A3686o0275m3037O422O7028M9774j12340j46574Q3564N4741K6513N2749
15126g749L0516J04543J967k1405j0354J7109P7901o6733q6458o3708k3835k9156
15114g7362L1776M2808R733M4807q9354j74333m7424R8479J45812L7322m0878
15103a8614r464J777l5886M8355N7420j0601n2503m0362K06N6142L617o237O2506
15090E6356Q9255j08420o6244J7809O882M6826Q9355J8436l2093j8135l9442l0002
15078C0583l776m3149n0430p9704k9689J23719K4302L5311L1514m6608o8269K1513
$$ plain form
15066 -54683 -37987 -65131 -48217 -18528 -4593 -58921 -39466 -36143 -6112 -89349 -51304 -18558
15054 -18558 -28279 -22527 -63585 -55565 178 -19314 -30390 -18373 -76429 -19586 57309 -61717
15042 -61717 -103686 -64946 45739 38155 -75044 -127599 -112420 -118273 -54315 26587 14586 5727
15030 5727 101880 78752 137610 88444 -2811 -10080 17344 30203 76740 63420 123207 128234
15018 128234 23625 44294 107461 63614 32621 10376 -102987 -140183 -59731 -36700 38934
15007 38934 26204 -14233 -80140 -78873 -46268 -42446 -32985 -21839 -168615 -230501 -201191 -98120
14995 -98120 -70872 -17642 41678 1637 -63408 -85810 -102732 -151258 -260068 -239991 -114098
14984 -114098 -85541 -112403 -91771 -31664 66675 124344 168307 123759 101079 90646 73865
$$ packed form
15066e4683J6696k7144J6914K9689J3935n4328J9455L323L0031q3237L8045L2746
15054a8558r721N752m1058Q020N5743j9492j1076J2017n8056N6843P6895j19026
15042f1717m1969L8740J10685p584j13199n2555J5179n853O3958Q0902j2001q859
15030E727R6153k3128N8858m9166r1255p269K7424J2859M6537j3320N9787N027
15018A28234j04609K0669O3167m3847l0993k2245j13363l7196Q0452K3031P5634
15007C8934j2730m0437o5907J267L2605L822R461J1146j46776o1886K9310J03071
14995i8120K7248N3230N9320m0041o5045k2402j6922m8526j08810K0077J25893
14984a14098K8557k6862K0632O0107R8339N7669M3963m4548k2680j0433j6781
$$ plain form
14973 73865 25594 34242 60708 60551 47379 85686 83882 17078 -14221 -75855 -144956 -164643
14961 -164643 -126608 -89681 -85089 -98797 -128103 -80144 -44601 23826 37849 -15069 -4066 -36443
14949 -36443 -15673 21471 107962 143797 38978 -31340 -72724 -7291 51469 27827 -27615
14938 -27615 -103832 -116374 15451 39590 19024 38354 -34873 -68080 -1400 31854 -23310
14927 -23310 -25659 1956 -10732 -62975 14922 -16596 -33362 15719 -32780 -76199 47092 97836
14915 97836 57817 36299 29604 -17815 -33755 13199 17710 8520 32172 -53043 -6831 19871
14903 19871 -61283 -89024 -57095 -123654 -175611 -227805 -189993 -143602 -97893 -51060 -65841 -44095
14891 -44095 37750 32051 -16184 -8156 51187 82728 58562 27153 -92155 -84368 -126890 -90058
$$ packed form
14973G3865m8271Q648K6466j57j3172L8307j804o6804l1299o1634o9101j9687
14961a64643L8035L6927M592j3708k9306M7959L5543O8427J4023n2918J1003l2377
14949c6443K0770L7144Q6491L5835j04819p0318m1384O5433N8760k3642n5442
14938b7615p6217j2542J31825K4139k0566J9330p3227l3207O6680L3254n5164
14927b3310k349K7615j2688n2243P7897l1518j6766M9081m8499m3419J23291N0744
14915I7836m0019k1518o695m7419j5940M6954M511r190K3652q5215M6212K6702
14903A9871q1154k7741L1929o6559n1957n2194L7812M6391M5709M6833j4781K1746
14891d4095Q1845n699m8235Q028N9343L1541k4166l1409j19308P787m2522L6832
$$ plain form
14879 -90058 -136355 -104501 6483 132691 3283 -43022 -19119 -133803 -130987 -46337 -3115
14868 -3115 -63085 -92984 -48120 -47884 9264 32240 1353 43227 -9209 -16160 25932 42117
14856 42117 -26135 -35916 74435 53656 20333 21925 -100105 -158439 -176629 -135173 -69234 -18001
14844 -18001 10695 15891 82588 61834 -11674 -86114 -122150 -98697 -16338 -16190 -38416 -103776
14832 -103776 -74223 -24060 50831 83555 67103 20302 -2447 -15591 -6689 -128694 -177917
14821 -177917 -138002 -91416 -28420 -11888 -41074 -44039 -60346 -83898 -97852 -34421 -4458 -48128
14809 -48128 -102273 -121647 -89108 20105 84502 -12484 -78477 -50496 46173 29324 -10752
14798 -10752 -53706 -39386 -58729 -61664 -14979 77685 85457 63661 58348 40380 40233 2193 19375
$$ packed form
14879i0058m6297L1854J10984J26208j29408m6305K3903j14684K816Q4650M3222
14868c115n9970k9899M4864K36N7148K2976l0887M1874n2436o951M2092J6185
14856D2117o8252r781J10351k0779l3323J592j22030n8334j8190M1456O5939N1233
14844a8001K8696N196O6697k0754p3508p4440l6036K3453Q2359J48k2226o5360
14832a03776K9553N0163P4891L2724j6452m6801k2749j3144Q902j22005m9223
14821a77917L9915M6586O2996J6532k9186k965j6307k3552j3954O3431K9963m3670
14809d8128n4145j9374L2539J09213O4397r6986o5993K7981R6669j6849m0076
14798a0752m2954J4320j9343k935M6685R2664P772k1796n313j7968j47l8040J7182
$$ plain form
14785 19375 2360 -33005 34646 7504 -7859 -49715 -35327 -26383 -45758 -107735 -99036 -50977
14773 -50977 2613 59235 104464 51861 -3467 20330 -58885 -108750 -58722 7209 35815 103194
14761 103194 79221 144987 116987 20481 -49394 -65171 -6499 22893 22806 85766 176570 155437
14749 155437 144162 45581 11896 73924 62809 -17440 -69944 8207 6841 -65244 -135556 -72447
14737 -72447 -67950 -118126 -128687 -119889 -40490 2969 -12936 10261 7878 14016 55442 11028
14725 11028 -61331 -90343 -101944 -27647 41527 28344 8924 56566 146779 132275 -10617
14714 -10617 -140730 -190091 -69984 64936 97863 58403 22038 27843 895 15167 82090
14703 82090 43938 -42268 -56166 -66111 -40376 8705 29923 25455 -25173 -107710 -65599 -54006
$$ packed form
14785A9375j7015l5365O7651k7142j5363m1856J4388Q944j9375o1977Q699M8059
14773e0977N3590N6622M5229n2603n5328K3797p9215m9865N0028O5931K8606O7379
14761A03194k3973O5766k8000r6506o9875j5777N8672K9392q7O2960R0804k1133
14749A55437j1275r8581l3685O2028j1115q0249n2504P8151j366p2085p0312O3109
14737g2447M497n0176j0561Q798P9399M3459j5905K3197k383O138M1426m4414
14725A1028p2359k9012j1601P4297O9174j3183j9420M7642R0213j4504j42892
14714a0617j30113m9361J20107J34920L2927l9460l6365N805k6948J4272O6923
14703H2090l8152q6206j3898r945K5735M9081K1218m468n0628q2537M2111J1593
$$ plain form
14691 -54006 -17862 -4810 -56136 -64446 -100372 -42286 18348 28758 36349 135988 122615 44674
14679 44674 35386 35536 59143 96132 80288 72856 73256 172150 117582 42437 -18642 -125209 -179722
14666 -179722 -135825 -93726 -146206 -225847 -190297 -121388 -24868 -27671 -33484 8474 -12653 -3252
14654 -3252 19637 72260 89993 114522 161667 46663 -72599 -126270 -96138 -83835 -74607 -24848
14642 -24848 95377 104229 -55900 -35615 73223 103559 26457 42219 70910 39512 -32128
14631 -32128 -71803 -38496 -33905 -68030 -44469 -11711 50653 119969 177157 146604 153797 39936
14619 39936 -51433 5916 48177 14046 -10400 37423 -17147 -19238 27062 80271 57956 9782
14607 9782 81830 100742 134672 95173 97028 99075 47017 18479 -26295 -62017 -85704 -71929
$$ packed form
14691e4006L6144J3052n1326q310l5926N8086O0634J0410P591R9639j3373p7941
14679D4674r288J50K3607L6989j5844p432M00R8894n4568p5145o1079j06567n4513
14666a79722M3897M2099n2480p9641L5550O8909R6520k803n813M1958k1127R401
14654c252K2889N2623J7733K4529M7145j15004j19262n3671L0132J2303R228M9759
14642b4848J20225Q852j60129K0285J08838L0336p7102J5762K8691l1398p1640
14631c2128l9675L3307M591l4125K3561L2758O2364O9316N7188l0553P193j13861
14619C9936r1369N7349M2261l4131k4446M7823n4570k091M6300N3209k2315m8174
14607I782P2048J8912L3930l9499J855K047n2058k8538m4774l5722k3687J3775
$$ plain form
14595 -71929 -57273 -81307 -109033 -52830 -38755 -32926 -35850 -44531 -62407 102453 192027 188218
14583 188218 139628 72758 26808 126933 152230 90614 13655 -11279 -6495 75576 161036
14572 161036 168847 127821 27247 -22315 -5244 5565 -9811 -11027 -3916 -22379 -113657 -122272
14560 -122272 -96652 -13204 -35006 -49982 -45836 -20180 -75129 -59025 -59896 -76591 -35693 5724
14548 5724 34234 53125 -17490 -72317 -57830 -92772 -58533 -13544 -105713 -80285 -73931 -96549
14536 -96549 -9187 24070 -20686 -49176 -105780 -76357 18109 -7566 -69944 19601 49050 33303
14524 33303 -61374 -112272 -110813 -84575 -89560 -106570 -81186 -45074 -101417 -38048 -41464 -113508
14512 -113508 -104446 -54028 -60222 -52830 -43639 -7855 -12664 -35023 20340 132194 138029 110531
$$ packed form
14595g1929J4656k4034k7726N6203J4075N829k924q681j7876J64860Q9574l809
14583A88218m8590o6870m5950J00125K5297o1616p6959k4934M784Q2071Q5460
14572A61036P811m1026j00574m9562J7071J0809j5376j216P111j8463r1278q615
14560a22272K5620Q3448k1802j4976M146K5656n4949J6104q71j6695M0898M1417
14548E724K8510J8891p0615n4827J4487l4942L4239M4989r2169K5428O354k2618
14536i6549Q7362L3257m4756k8490n6604K9423R4466k5675o2378Q9545K9449j5747
14524C3303r4677n0898J459K6238m985j7010K5384L6112n6343O3369l416p2044
14512a13508R062N0418o194P392R191L5784m809k2359N5363J11854N835k7498
$$ plain form
14500 110531 142527 96320 -16114 -31468 108 12893 27842 17825 -32393 -60018 61557
14489 61557 67192 89116 -38725 -2851 159957 169548 135227 27918 87200 116966 114164 140589
14477 140589 131041 38562 -42797 -34355 2450 32818 9140 -15704 38795 21394 1676 -36662
14465 -36662 -8478 64553 55810 42383 69393 49223 70290 18135 40171 -16665 -96300 -136979
14453 -136979 -21405 41232 20752 -19067 245 4016 -56336 -116351 -180093 -173795 -129600 -60813
14441 -60813 -2722 -3229 56071 37199 24086 -5999 47722 131156 66576 32020 -11329 -56124
14429 -56124 -74349 -8452 87627 42895 -30374 -32964 59008 125621 125816 87923 78131 77614 94278
14416 94278 46522 -19650 -28837 -51068 -1750 6992 -105340 -171844 -129398 -147602 -185240 -165981
$$ packed form
14500A10531L1996m6207j12434j5354L1576J2785J4949j0017n0218k7625J21575
14489F1557N635K1924j27841L5874J62808R591l4321j07309N9282K9766k802K6425
14477A40589r548r2479q1359Q442L6805L0368k3678k4844N4499j7401j9718l8338
14465c6662K8184P3031q743j3427K7010k0170K1067n2155K2036n6836p9635m0679
14453a36979J15574O2637k0480l9819J9312L771o0352o0015o3742O298M4195O8787
14441f0813N8091n07N9300j8872j3113l0085N3721Q3434o4580l4556m3349m4795
14429e6124j8225O5897R6079m4732p3269k590R1972O6613J95l7893r792n17J6664
14416I4278m7756o6172r187k2231M9318Q742j12332o6504M2446j8204l7638J9259
$$ plain form
14404 -165981 -75397 18181 105940 126655 132084 155058 123860 44807 8667 30168 11033 -59181
14392 -59181 -68254 -96710 -89956 -83608 -89143 -130959 -93682 -35480 14890 9731 50474 63683 -47044
14379 -47044 -8126 23055 15313 45584 27222 -47887 -91424 -49199 -32387 17726 -86331 -138219
14367 -138219 -124649 -67658 -17768 29829 119093 155960 81199 5179 -77282 -83348 32982
14356 32982 17301 -77756 -67227 -46810 26626 -39359 -27889 -48890 -61608 -40351 48408 89725
14344 89725 19271 -14403 -48196 -58940 -55719 -104939 -132736 -172330 -162099 -169585 -114758 -68089
14332 -68089 13098 -51877 -20512 7396 -12247 -96660 -124244 6623 49374 35456 17810
14321 17810 -7355 -49177 -69239 -88525 -131831 -118517 -65641 -9428 859 -57871 -73975 -24925
$$ packed form
14404a65981R0584R3578Q7759K0715N429K2974l1198p9053l6140K1501j9135p0214
14392e9181r073k8456O754O348n535m1816L7277N8202N0370n159M0743J3209j10727
14379d7044L8918L1181p742L0271j8362p5109m3537M2225J6812N0113j04057n1888
14367a38219J3570N6991M9890M7597Q9264L6867p4761p6020q2461o066J16330
14356C2982j5681r5057J0529K0417P3436o5985J1470k1001j2718K1257Q8759M1317
14344H9725p0454l3674l3793j0744L221m9220k7797l9594J0231p486N4827M6669
14332f8089Q1187o4975L1365K7908j9643q4413k7584J30867M2751j3918j7646
14321A7810k5165m1822k0062j9286m3306J3314N2876N6213J0287n8730j6104M9050
$$ plain form
14309 -24925 -47241 -13331 14649 -73036 -124706 -80853 -160117 -116502 -81582 -115535 -124308 -54206
14297 -54206 17759 790 10018 -19926 -10421 -21279 -37808 -82305 -116103 -33881 59656 73324
14285 73324 18407 -23485 58279 128869 75403 -5271 -62045 -88779 -43869 -8376 25624 69966
14273 69966 -44372 -73773 -36071 -46192 -50822 -56733 -41978 -12993 33468 -19993 -35469 -16920
14261 -16920 39731 31071 -1204 -118962 -150941 -76657 -8995 -14601 -11306 36512 16783 -7025
14249 -7025 -28056 -45155 -27028 -18979 18761 90491 117185 5609 -74693 -89396 -7050 -34787
14237 -34787 -16152 80702 10947 -97209 -127179 -153724 -129080 -127424 -123973 -93511 -113250 -132447
14225 -132447 -76432 -20173 10165 104624 71783 -6112 -52608 -135075 -101611 543 -23378
$$ packed form
14309b4925k2316L3910K7980q7685n1670M3853p9264M3615L4920l3953q773P0102
14297e4206P1965j6969R228k9944R505j0858j6529m4497l3798Q2222R3537J3668
14285G3324n4917m1892Q1764P0590n3466q0674n6774k6734M4910L5493L4000M4342
14273F9966j14338k9401L7702j0121m630n911J4755K8985M6461n3461j5476J8549
14261a6920N6651q660l2275j17758l1979P4284O7662n606L295M7818j9729k3808
14249g025k1031j7099J8127Q049L7740P1730K6694j11576q0302j4703Q2346k7737
14237c4787J8635R6854o9755j08156k9970k6545K4644J656L451L0462j9739j9197
14225a32447N6015N6259L0338R4459l2841p7895m6496q2467L3464J02154k3921
$$ plain form
14214 -23378 -52914 -117216 -173190 -146787 -91566 -77317 -78883 -4676 20506 17154 -24969 -44712
14202 -44712 -25564 -40213 -88430 -92964 -80419 -43709 -7744 72109 132942 79058 56178 83352
14190 83352 43486 1967 -46690 -53966 -64675 2094 8614 -66296 -66964 -44713 -4776 96924
14178 96924 129146 138218 87873 43779 25979 41201 103294 86867 28857 -41156 4169 20293
14166 20293 -66573 -103476 -11298 -785 86763 29850 27051 -19117 -14444 27244 98911 117203
14154 117203 72486 -34081 -24090 -12723 -40917 -34370 -82838 -45751 -23045 -47511 -64228 -33159
14142 -33159 -43309 -129258 -172063 -106206 46898 145802 131114 43509 -1571 -784 -17288 -56380
14130 -56380 -8108 38793 51119 -22720 -165488 -178391 -44927 67094 45672 -60417 -57110
$$ packed form
14214b3378k9536o4302n5974K6403N5221J4249j566P4207K5182l352m2123j9743
14202d4712J9148j4649m8217m534J2545L6710L5965P9853O0833n3884k2880K7174
14190H3352l9866m1519m8657p276j0709O6769O520p4910o68K2251L9937J01700
14178I6924L2222R072n0345m4094j7800J5222O2093j6427n8010p0013M5325J6124
14166B0293q6866l6903R2178J0513Q7548n6913k799m6168M673M1688P1667J8292
14154A17203m4717j06567R991J1367k8194O547m8468L7087K2706k4466j6717L1069
14142c3159j0150q5949m2805O5857J53104R8904j4688q7605m5080P87j6504l9092
14130e6380M8272M6901J2326p3839j42768j2903J33464J12021k1422j06089L307
$$ plain form
14119 -57110 -23246 -80972 -79556 -25049 14138 14113 15008 -29492 21957 79795 6589 -23861 -18256
14106 -18256 -70790 -15315 42052 57073 32983 84296 66476 57899 29037 3495 -56865 33707
14094 33707 60832 143684 184840 95491 33698 156493 134775 115182 150805 234259 126581
14083 126581 69844 86841 -39646 4143 75296 76159 3948 -50078 -67305 -59626 -27804 -12995
14071 -12995 -43182 -75001 19722 87646 10181 -33514 -23885 47232 49539 -79573 -117928 -137269
14059 -137269 -7121 168022 125084 -11549 -142401 -133963 4945 79224 136961 126477 86895
14048 86895 100314 91989 53822 67084 65343 -2664 -1993 49203 88945 84001 -26324 -101889
14036 -101889 -118838 -117980 -72744 -99350 -82064 -122358 -76724 -11756 -41533 -28038 -19009 -46478
$$ packed form
14119e7110L3864n7726J416N4507L9187k5Q95m4500N1449N7838p3206l0450N605
14106a8256n2534N5475N7367J5021k4090N1313j7820q577k8862k5542o0360R0572
14094C3707K7125Q2852M1156q9349o1793J22795k1718j9593L5623Q3454j07678
14083A26581n6737J6997j26487M3789P1153Q63p2211n4026j7227P679L1822J4809
14071a2995l0187l1819R4723O7924p7465m3695R629P1117K307j29112l8355j9341
14059a37269J30148J75143m2938j36633j30852Q438J38908P4279N7737j0484l9582
14048H6895J3419q325l8167J3262j741o8007O71N1196L9742m944j10325p5565
14036a01889j6949Q58M5236k6606J7286m0294M5634O4968k9777J3495R029k7469
$$ plain form
14024 -46478 -68216 -65785 -63826 23765 26127 16691 11883 1469 -50496 -95424 -39414 95538
14012 95538 145931 54155 10025 -21223 30278 76325 106147 148255 77741 12508 -2658 -8727
14000 -8727 -34405 -101310 -122974 -100693 405 52399 53670 87249 101893 52242 27745 -33970
13988 -33970 -43955 -33489 -104116 -81117 -70748 -126880 -42400 21541 51811 50350 107924 32531
13976 32531 -40535 -56536 -80308 -102898 -56869 2346 -67464 -63465 -70466 -22318 -29375 50000
13964 50000 -10102 -6107 36053 74760 192758 216320 192040 41909 37218 93771 38153 -48355
13952 -48355 -97868 -100585 -57522 -58415 -30028 58479 124641 45826 78132 122056 86640 88460
13940 88460 101959 83240 18271 55100 32099 -6286 9751 -38082 -53847 21610 104759 87630
$$ packed form
14024d6478k1738K431J959Q7591K362r436m808j0414n1965m4928N6010J34952
14012I5538N0393r1776m4130l1248N1501M6047K9822M2108p0514o5233j5166o069
14000h727k5678o6905k1664K2281J01098N1994J271L3579J4644m9651k4497o1715
13988c3970r985J0466p0627K2999J0369n6132Q4480O3941L0270j461N7574p5393
13976C2531p3066j6001k3772k2590M6029N9215o9810L999p001M8148p057P9375
13964E0000o0102L995M2160L8707J17998K3562k4280j50131m691N6553n5618q6508
13952d8355m9513k717M3063q93K8387Q8507O6162p8815L2306M3924l5416J820
13940H8460J3499j8719o4969L6829k3001l8385J6037m7833j5765P5457Q3149j7129
$$ plain form
13928 87630 68372 11311 -52023 -36467 -70106 -56121 -88452 -72024 -96855 -123105 -158493 -44296
13916 -44296 -10395 -79723 -63613 -76734 -49044 2813 -28066 7181 23411 -68443 -88527 -60844
13904 -60844 -3900 11783 14354 43845 9259 47866 162760 163093 119515 92486 118342 74691
13892 74691 27034 8228 -58429 -84427 -3298 14579 16661 38054 75132 64324 72310 44615
13880 44615 23807 24529 52864 39575 -10237 -41032 -8004 3746 -29804 -78101 -60381 13904
13868 13904 -7904 -35180 -8011 -40805 -90325 -16493 -9802 34550 9205 -8517 -37949 -51950
13856 -51950 -48767 -27528 -31331 -57424 -52118 23175 -31430 -23601 -11648 -34211 -68966 -11466
13844 -11466 -38739 -59613 -39557 -72168 -85775 -33947 -66877 -78174 -24775 92691 87452 30822
$$ packed form
13928H7630j9258n7061o3334J5556l3639J3985l2331J6428k4831k6250l5388J14197
13916d4296L3901o9328J6110j3121K7690N1857l0879L5247J6230r1854k0084K7683
13904f0844N6944J5683K571K9491l4586L8607J14894L33m3578k7029K5856m3651
13892G4691m7657j8806o6657k5998Q1129J7877K082K1393L7078j0808P986k7695
13880D4615k0808P22K8335j3289m9812l0795L3028J1750l3550m8297J7720P4285
13868A3904k1808k7276K7169l2794m9520P3832O691M4352k5345j7722k9432j4001
13856e1950L183K1239l803k6093N306P5293n4605P829J1953k2563l4755N7500
13844a1466k7273k0874K0056l2611j3607N1828l2930j1297N3399J17466n239n6630
$$ plain form
13832 30822 -11179 -117718 -128825 -145175 -118521 -37654 -90051 -77281 -42357 -107478 -102078 -137364
13820 -137364 -92651 -52873 -69471 -63056 -89883 -56366 -35056 -10785 -16028 -71918 -109107 -54389
13808 -54389 -78192 -48946 -4173 -4502 25120 84309 136146 58553 34380 1595 31052 3659
13796 3659 -37912 -24772 -44 -33121 -64896 -110133 -101858 -75525 33973 83010 35159 35729
13784 35729 39024 60022 38534 118692 154224 84229 -41441 -129744 -181458 -124037 -78051 -9914
13772 -9914 -23564 -9146 -45183 -122258 -103025 -102975 -62683 -18497 17679 26119 -23257 16448 44347
13759 44347 87285 156048 104961 67641 -8862 -105413 -120436 -96065 -156110 -165206 -49547 22479
13747 22479 -54208 -77827 -17389 50584 89014 55835 53298 77372 126008 73720 30951 11214
$$ packed form
13832C0822m2001j06539j1107j6350K6654Q0867n2397J2770L4924o5121N400l5286
13820a37364M4713L9778j6598O415k6827L3517K1310K4271n243n5890l7189N4718
13808e4389k3803K9246M4773l29K9622N9189N1837p7593k4173l2785K9457k7393
13796C659m1571J3140K4728l3077l1775m5237Q275K6333J09498M9037m7851N70
13784C5729L295K0998k1488Q0158L5532o9995j25670q8303n1714N7421M5986O8137
13772i914j3650J4418l6037p7075J9233N0M0292M4186L6176Q440m9376L9705K7899
13759D4347M2938O8763n1087l7320p6503r6551j5023K4371o0045r096J15659P2026
13747B2479p6687k3619O0438O7973L8430l3179k537K4074M8636n2288m2769j9737
$$ plain form
13735 11214 -66558 -69026 -62331 -47680 -92496 20681 118556 72264 16079 72810 107346 91242
13723 91242 69665 28660 38107 112285 132612 140145 217448 235161 147613 42136 96182 141340
13711 141340 83776 20573 -85525 -89933 -88198 -43123 24557 78402 18335 19288 17398 -7145
13699 -7145 1861 -35251 -94544 -41442 9673 -3357 -17945 -54444 -72568 -75569 -84603 -132989
13687 -132989 -154183 -4431 24992 37308 55153 -96643 -187030 -117137 -35099 -40893 -56880
13676 -56880 -59475 -7567 36077 106706 78579 88058 76933 29350 41102 52884 103745 89576
13664 89576 94218 53559 -43034 -112264 -153299 -211900 -173937 -74452 464 -14817 12994 11828
13652 11828 5213 36580 87676 142160 153488 155634 143064 117186 94583 61639 7210 25559
$$ packed form
13735A1214p7772k468O695J4651m4816J13177R7875m6292n6185N6731L4536j6104
13723I1242k1577m1005R447P4178K0327P533P7303J7713q7548j05477N4046M5158
13711A41340n7564o3203j06098m408J735M5075O7680N3845o0067R53j890k4543
13699g145R006l7112n9293N3102N1115j3030j4588l6499j8124l001r034m8386
13687a32989k1194J49752K9423J2316J7845j51796r0387O9893Q2038n794j5987
13676e6880k595N1908M3644P0629k8127R479j1125m7583J1752J1782N0861j4169
13664H9576M642m0659r6593o9230m1035n8601L7963R9485P4916j5281K7811j166
13652A1828o615L1367N1096N4484J1328K146j2570k5878k2603l2944n4429J8349
$$ plain form
13640 25559 -3107 -46643 -14399 84847 54995 -51999 -86829 -179945 -193038 -200721 -221204 -82551
13628 -82551 -24917 17414 -44191 -18981 -8386 -29621 -15640 20849 -50396 -76932 -79044 -82998
13616 -82998 27192 121530 143141 105016 -6123 -71447 12023 29525 52797 79561 58631
13605 58631 54462 40585 87010 117234 18008 -125789 -106773 -66609 -37850 35020 85047 179479
13593 179479 172865 135577 63691 47935 60892 48606 45960 62622 126182 123351 104358 45254
13581 45254 57896 30545 12358 32177 -725 3652 -1924 -9651 -45344 -26865 28021 37347
13569 37347 67692 140019 69580 2124 -61427 -73527 50792 45089 9175 68910 193188
13558 193188 105594 38970 38711 2435 12635 -8549 36939 142742 173858 167022 161703 110980
$$ packed form
13640B5559k8666m3536L2244R9246k9852j06994l4830r3116j3093p683k0483J38653
13628h2551N7634M2331o1605K5210J0595k1235J3981L6489p1245k6536k112l954
13616h2998J10190R4338K1611l8125j11139o5324Q3470J7502K3272K6764k0930
13605E8631m169j3877M6425L0224r9226j43797J9016M0164K8759P2870N0027R4432
13593A79479o614l7288p1886j5756J2957j2286k646J6662O3560k831j8993n9104
13581D5254J2642k7351j8187J9819l2902M377n576p727l5693J8479N4886R326
13569C7347L0345P2327p0439o7456o3551j2100J24319n703l5914N9735J24278
13558A93188q7594o6624k59l6276J0200k1184M5488J05803L1116o836n319n0723
$$ plain form
13546 110980 -12137 -31783 -80918 -49396 -23346 -67165 -45608 -15719 -33710 25056 33403
13535 33403 13823 74662 51315 47823 39736 77932 91169 30500 31155 69283 86971 28125
13523 28125 24913 16150 38109 5078 20674 -32308 -17372 103257 89324 32671 -10614 -52717
13511 -52717 -105609 -89195 -102683 -90105 -168073 -202315 -105357 -67879 -136167 -138398 -11302 18965
13499 18965 53460 170846 108565 47852 -37306 -40938 110925 151916 134771 169362 234400
13488 234400 162897 132637 48785 29940 28602 25127 42913 41978 65396 -13338 -14592 46529
13476 46529 105550 160063 178548 142810 100246 58743 23854 21499 17761 110198 120420 140493
13464 140493 109433 70940 31348 -36980 -47904 -28984 -78848 -23120 -20109 -43263 50723 188568
$$ packed form
13546A10980j23117j9646m9135L1522K6050m3819K1557K9889j7991N8766Q347
13535C3403j9580O0839k3347l492q087L8196J3237o0669O55L8128J7688n8846
13523B8125l212q763K1959l3031J5596n2982J4936J20629j3933n6653m3285m2103
13511e2717n2892J6414j3488J2578p7968l4242R6958L7478o8288k231J27096L0267
13499A8965L4495J17386o2281o0713q5158l632J51863M0991j7145L4591O5038
13488B34400p1503l0260q3852j8845j338l475J7786r35K3418p8734j254O1121
13476D6529N9021N4513J8485l5738m2564m1503l4889k355l738R2437J0222K0073
13464A40493l1060l8493l9592o8328j0924J8920m9864N5728L011k3154R3986J37845
$$ plain form
13452 188568 188117 189497 76218 63512 28865 -21370 -11014 -23276 -13925 80275 44310 -2855
13440 -2855 -22874 -40605 -45100 -86292 -96603 -24479 24332 -8870 -12285 11378 48384 26432
13428 26432 22495 59120 76394 61682 73316 49109 -35402 -4094 25879 119437 132944 120689
13416 120689 70940 141326 98057 62227 42275 -19681 -111833 -115030 -89825 -88420 3367 109642
13404 109642 123301 73648 40282 33862 68393 123955 94942 61167 82894 72909 102944 34382
13392 34382 58460 103951 103115 120683 115852 41217 -50 -41336 -105592 -123236 -126848 -130499 -40068
13379 -40068 1906 70175 64657 3948 -40480 -35180 761 26734 72321 40689 35705 153010
13367 153010 97227 -9695 -82177 -79275 37270 96673 127408 79716 134467 266385 236164
$$ packed form
13452A88568m51J380j13279j2706l4647n0235J0356j2262R351R4200l5965m7165
13440b855k0019j7731m495m1192j0311P2124M8811l3202l415K3663L7006k1952
13428B6432l937L6625J7274j4712J1634k4207q4511L1308K9973R3558J3507j2255
13416A20689m9749P0386m3269l5830j9952o1956r2152l197K5205J405R1787J06275
13404A09642J3659m9653l3366o420L4531N5562k9013l3775K1727r985L0035o8562
13392C4382K4078M5491q36J7568m831p4635m1267m1286o4256j7644l612l651R0431
13379d0068M1974O8269n518o0709m4428N300L5941K5973M5587l1632m984J17305
13367A53010n5783j06922p2482K902J16545N9403L0735m7692N4751J31918l0221
$$ plain form
13356 236164 172760 201243 77678 5550 81493 134691 93431 -1001 -27168 -18500 22160
13345 22160 -1898 36678 110877 119837 95629 86932 125677 113177 81426 64572 94414 145669
13333 145669 126018 103484 95878 128485 181148 108479 50503 55880 -10142 -83369 -56885 -61026
13321 -61026 -79076 -91532 -58455 36991 95016 6997 -118725 -138107 -60190 11042 -30235
13310 -30235 -29186 -12172 90745 80464 7874 26404 69698 -2408 -31155 58568 127295 76144
13298 76144 108189 136294 67410 47687 5628 -47861 -41807 39550 46549 92941 -27844 -55794
13286 -55794 -27156 -41567 43561 137657 101666 -61312 -93840 -31819 28756 54174 43052
13275 43052 54213 4145 -72984 -17947 48578 -45453 -43828 -11201 -147043 -173897 -177341 -99399
$$ packed form
13356B36164o3404K8483j23565p2128P5943N3198m1260r4432k6167Q668M0660
13345B2160k4058L8576P4199Q960k4208q697L8745j2500l1751j6854K9842N1255
13333A45669j9651k2534p606L2607N2663p2669n7976N377o6022p3227K6484m141
13321f1026j8050j2456L3077R5446N8025q8019j25722j9382P7917P1232m1277
13310c0235J049J7014J02917j0281p2590J8530M3294p2106k8747Q9723O8727n1151
13298G6144L2045K8105o8884j9723m2059n3489O054Q1357O999M6392j20785k7950
13286e5794K8638j4411Q5128R4096l5991j62978l2528O2021O0575K5418j1122
13275D3052J1161n0068p7129N5037O6525r4031J625L2627j35842k6854l444P7942
$$ plain form
13263 -99399 -4544 42500 107996 65560 57298 77429 28757 -1458 1055 -12233 -1583 -58104
13251 -58104 -81748 -10305 6584 -20672 -4397 59809 114517 83619 41581 1905 -20577 -47516
13239 -47516 -40863 -64113 8513 34024 -38607 -58183 -29924 88220 -13856 -17214 74719 89317
13227 89317 132395 127183 114328 109685 126419 41297 8453 -29145 -48516 -54134 -53381 -17133 57989
13214 57989 24330 -19204 -3539 8810 -85152 -108072 -103511 -74919 -110241 -124285 -112855 -56790
13202 -56790 31773 -76138 -58681 -34304 42501 87893 73173 -6203 -113247 -99659 -1522
13191 -1522 40640 65176 52832 29911 66570 92093 147165 118280 11690 -46364 -101218 -91694
13179 -91694 -37907 -14868 -45994 -98093 -94267 -70450 -21991 123878 172635 106683 75716 74490
$$ packed form
13263i9399R4855M7044O5496m2436q262K0131m8672l0215K513j3288J0650n6521
13251e8104k3644P1443J6889k7256J6275O4206N4708l0898m2038l9676k2482k6939
13239d7516O653k3250P2626K5511p2631j9576K8259J18144j02076l358R1933J4598
13227H9317M3078n212j2855m643J6734q5122l2844l7598j9371n618P53L6248P5122
13214E7989l3659m3534J5665J2349r3962k2920M561K8592l5322j4044J1430N6065
13202e6790Q8563j07911J7457K4377P6805M5392j4720p9376j07044J3588R8137
13191a522M2162K4536j2344k2921L6659K5523N5072k8885j06590n8054n4854R524
13179i1694N3787K3039l1126n2099L826K3817M8459J45869M8757o5952l0967j226
$$ plain form
13167 74490 40937 -30386 -38901 -40973 -7485 15993 132874 220089 194529 113175 83190 84366
13155 84366 56355 -13432 -73456 -36106 14038 30257 24525 -8812 17741 15241 -2066 48801
13143 48801 70969 19810 -54482 -30487 -30528 -28373 -64377 -23588 2787 -6241 4081 -42613 -110357
13130 -110357 -47635 -1674 -53617 -73230 -27754 -15661 22682 37028 -14044 -70630 -105581
13119 -105581 -77821 -59191 -50182 -27366 32674 25178 -14438 29065 -6796 -8378 116359 16788
13107 16788 -101645 -42353 637 13433 -1346 -26434 -67057 -102569 -58000 49085 159895
13096 159895 123805 120406 117682 -52012 -92726 -157520 -133103 1048 53109 129728 174306
13085 174306 147297 27745 -38574 13579 90800 52634 18159 -37868 20045 85257 91671
$$ packed form
13167G4490l3553p1323q515k072L3488K3478J16881Q7215k5560q1354k9985J176
13155H4366k8011o9787o0024L7350N0144J6219n732l3337K6553k500j7307N0867
13143D8801K2168n1159p4292K3995m1K155l6004M0789K6375r028J0322m6694o7744
13130a10357O2722M5961n1943j9613M5476J2093L8343J4346n1072n6586l4951
13119a05581K7760J8630R009K2816O0040p496l9616M3503l5861j582J24737r9571
13107A6788j18433N9292M2990J2796j4779k5088m0623l5512M4569J07085J10810
13096A59895l6090l399k724j69694m0714o4794K4417J34151N2061P6619M4578
13085A74306k7009j19552o6319N2153P7221l8166l4475n6027N7913O5212O414
$$ plain form
13074 91671 11915 18003 54005 77532 84950 120676 191426 239786 232888 250518 176958 72553
13062 72553 33286 25745 70861 191298 110700 43192 38669 14576 -3045 -25925 24135 -3292
13050 -3292 -70299 -65890 -79979 -53522 40282 76231 139104 92450 158473 148462 62300 55856
13038 55856 6402 27727 50969 59728 73575 167337 175746 124106 120606 74600 94324 43257
13026 43257 -89268 -122117 -40150 -20791 -63668 -57360 36645 37726 -30176 -82724 -43137 -40550
13014 -40550 -77860 -92618 -12376 -19066 14555 52117 51338 -23343 -119897 15485 104183 192044
13002 192044 135935 79169 121950 75608 3796 -97511 -102619 -84639 11388 62992 50402
12991 50402 -394 22143 -2512 -31515 -102107 -39450 60521 36513 95418 100399 63217 61718
$$ packed form
13074I1671p9756O088L6002K3527P418L5726P0750M8360o898J7630p3560j04405
13062G2553l9267p541M5116J20437q0598o7508m523k4093j7621k2880N0060k7427
13050c292o7007M409j4089K6457R3804L5949O2873m6654O6023j0011q6162o444
13038E5856m9454K1325K3242Q759J3847R3762Q409n1640l500m6006J9724n1067
13026D3257j32525l2849Q1967J9359m2877O308R4005J081o7902n2548L9587K587
13014d0550l7310j4758Q0242o690L3621L7562p79p4681r6554J35382Q8698Q7861
13002A92044n6109n6766M2781m6342p1812j01307n108J7980R6027N1604j2590
12991E0402n0796K2537k4655k9003p0592O2657R9971k4008N8905M981l7182j499
$$ plain form
12979 61718 67992 66967 7400 -57701 36071 119960 162754 177050 158203 126608 16431 -36700
12967 -36700 64197 36334 -105363 -128889 -116265 -44936 94649 48612 -20847 50732 125712
12956 125712 111542 49086 52360 120461 118925 44424 -69309 -104542 -103519 -29556 73325 79517
12944 79517 139775 184138 204551 154645 66797 45809 -54238 -58495 -86263 -97666 -85453 -57449
12932 -57449 -35178 65174 168674 136609 83162 110058 32581 -55066 -29098 -52521 -88348
12921 -88348 -19998 29501 36337 50484 68316 77665 83057 47265 20888 63967 144643 105458
12909 105458 73730 97891 87683 74903 138196 125389 53356 10373 31456 29966 -103111
12898 -103111 -115579 -6386 79072 52235 73210 94230 14082 -25797 -58630 -44128 -5101
$$ packed form
12979F1718O274j025n9567o5101R3772Q3889M2794J4296j8847l1595j10177n3131
12967c6700J00897k7863j41697k3526J2624P1329J39585m6037o9459P1579P4980
12956A25712j4170o2456L274O8101j536p4501j13733l5233J023P3963J02881O192
12944G9517O0258M4363K0413m9906q7848k0988j00047m257k7768j1403J2213K8004
12932e7449K2271J00352J03500l2065n3447K6896p7477q7647K5968k3423l5827
12921h8348O8350M9499O836J4147J7832R349N392l5792k6377M3079Q0676l9185
12909A05458l1728K4161j0208j2780O3293j2807p2033m2983K1083j490j33077
12898a03111j2468J09193Q5458k6837K0975K1020q0148l9879l2833J4502L9027
$$ plain form
12887 -5101 47756 29787 46824 34495 87465 94813 90210 112087 55185 100128 200099 175231
12875 175231 32685 -58456 16123 36328 30430 -44439 -61433 -96384 -54031 5120 93757
12864 93757 101650 86178 105655 10021 -29231 36340 39817 138184 77072 75957 161201 90806
12852 90806 -50605 -55753 25425 25669 9599 40585 29121 116742 117339 110804 137955 136140 188166
12839 188166 161567 74384 60767 58994 28298 111304 111943 36372 67215 -8375 -99547 -185893
12827 -185893 -143478 -75789 -34763 -20133 17206 44380 89801 72781 39538 105233 127546
12816 127546 133667 43075 47650 67983 96402 121193 74251 17178 57570 129561 76604 150352
12804 150352 159239 166293 175575 119085 178043 144746 124525 137957 154051 228637 261005 237637
$$ packed form
12887e101N2857j7969J7037j2329N2970P348m603K1877n6902M4943R9971k4868
12875A75231j42546r1141P4579K0205n898p4869j6994l4951M2353N9151Q8637
12864I3757P893j5472J9477r5634l9252O5571L477R8367o1112j115Q5244p0395
12852I0806j41411n148Q1178K44j6070L0986j1464Q7621N97o535K7151j815N2026
12839A88166k6599q7183j3617j773l0696Q3006O39p5571L0843p5590r1172q6346
12827a85893M2415O7689M1026J4630L7339K7174M5421j7020l3243O5695K2313
12816A27546O121r0592M575K0333K8419K4791m6942n7073M0392P1991n2957P3748
12804A50352Q887P054R282n6490N8958l3297k0221J3432J6094P4586L2368k3368
$$ plain form
12792 237637 146701 134738 119707 92993 90522 128386 88917 148525 245951 224266 151304 103905
12780 103905 136285 69457 54985 126541 168940 175718 157034 146600 101812 109842 103237 73286
12768 73286 105948 41178 -20298 -81636 -117745 -121076 -96065 -51003 -26774 -65843 -64008 -10520
12756 -10520 45592 20992 10655 51964 -7258 16234 100982 117240 139044 173878 76163 -75566
12744 -75566 -124714 -109017 -13703 24331 83209 161796 205327 170277 108057 121904 166923 108100
12732 108100 65333 77735 6397 -110914 -106929 43247 106243 109011 47321 22059 31017 -4299
12720 -4299 -29916 19922 -24719 -120841 -85072 -69618 -49979 -18376 -57469 -93754 -71980 -37613
12708 -37613 31041 80359 80709 144036 130893 150418 151080 149272 106848 66666 73842 94870 75004
$$ packed form
12792B37637r0936j1963j5031k6714k471L7864l9469N9608R7426k1685p2962m7399
12780A03905L2380o6828j4472P1556M2399O778j8684j0434m4788Q030o605k9951
12768G3286L2662o4770o1476o1338l6109l331K5011M5062K4229l9069J835N3488
12756a0520N6112k4600j0337M1309n9222K3492Q4748J6258K1804L4834r7715j51729
12744g5566m9148J5697R5314L8034N8878P8587M3531l5050o2220J3847M5019n8823
12732A08100m2767J2402p1338j17311L985J50176O2996K768o1690k5262Q958l5316
12720d299k5617M9838m4641r6122L5769J5454J9639L1603l9093l6285K1774L4367
12708c7613O8654M9318L50O3327j3143J9525O62j808m2424m0182P176K1028j9866
$$ plain form
12695 75004 29039 50814 -6541 24010 45501 88263 116787 113023 111701 138253 146266 87844
12683 87844 18475 13861 32653 72488 64416 47717 63092 188585 193610 194041 189951 135097 141289
12670 141289 150138 38283 -29266 35032 31453 31948 44801 72819 91439 103310 80862 90574
12658 90574 69876 95266 105647 14347 19496 72579 83065 21308 -59994 -120957 -89357 -23060
12646 -23060 39787 38742 65674 125089 150774 240491 195512 150338 154990 214534 259263 229504
12634 229504 182688 138048 112050 162029 99723 46139 56336 51473 40417 24182 74048 55019
12622 55019 162034 250436 193376 44129 -64845 -104338 -66971 -42944 87112 187010 94269
12611 94269 28483 -11000 39094 33805 66459 86215 167398 162819 122284 130053 140522 158533
$$ packed form
12695G5004m5965K1775n7355L0551K1491M2762K8524l764j322K6552Q013n8422
12683H7844o9369m614J8792L9835q072j6699J5375J25493N025M31m090n4854O192
12670A41289Q849j11855o7549O4298l579M95J2853K8018J8620J1871k2448R712
12658I0574k0698K5390J0381r1300N149N3083J0486o1757q1302o0963L1600O6297
12646b3060O2847j045K6932N9415K5685Q9717m4979m5174M652N9544M4729k9759
12634B29504m6816m4640k5998M9979o2306n3584J0197m863j1056j6235M9866j9029
12622E5019J07015Q8402n7060j49247j08974l9493L7367K4027J30056R9898r2741
12611I4269o5786l9483N0094n289L2654J9756Q1183m579m0535P769J0469J8011
$$ plain form
12599 158533 163277 143246 62934 79031 116087 116324 80892 90134 106841 186134 214297 192246
12587 192246 214588 273095 273620 186246 125774 121898 129982 110831 118572 151151 180855 177687 244868
12574 244868 276257 218756 124096 49921 58573 151386 252286 234379 197750 227402 247701
12563 247701 221285 170385 129364 167261 245953 233124 236560 220449 140539 119400 55858 48781
12551 48781 33586 -33049 6705 90167 78461 4691 127273 183634 152752 209816 275696
12540 275696 269563 165392 97678 177230 233274 212217 204054 151375 140815 92604 35477 64355
12528 64355 52093 46729 132744 148606 131606 191216 151461 214086 245993 224945 221766 170877
12516 170877 107187 90990 148748 144110 144386 211845 132209 144506 141823 56500 48967 76389
$$ packed form
12599A58533M744k0031q0312J6097L7056K37l5432R242J6707P9293K8163k2051
12587A92246K2342N8507N25q7374o0472l876Q084j9151P741L2579K9704l168O7181
12574B44868L1389n7501r4660p4175Q652R2813J00900j7907l6629K9652K0299
12563B47701k6416n0900m1021L7897P8692j2829L436j6111p9910k1139o3542p077
12551D8781j5195o6635L9754Q3462j1706p3770J22582N6361l0882N7064O5880
12540B75696o133j04171o7714P9552N6044k1057q163n2679j0560m8211n7127K8878
12528F4355j2262n364Q6015J5862j7000N9610l9755O2625L1907k1048l179n0889
12516A70877o3690j6197N7758m638K76O7459p9636J2297k683q5323p533K7422
$$ plain form
12504 76389 73997 107357 141227 149815 99676 79301 26987 7539 34829 45303 77720 7379
12492 7379 47204 213383 308035 282078 255754 244900 280562 265254 215972 157880 163156 158849
12480 158849 61724 27099 62849 137676 156237 174811 135925 166151 216409 149039 169517
12469 169517 167419 149839 130159 170121 227319 243618 177310 156444 127629 134610 154209 100273
12457 100273 101726 191800 231522 163429 83719 79329 172885 172558 234632 190832 162071 147861
12445 147861 158982 196140 162464 37981 -46362 34773 140236 212712 238270 177585 105206
12434 105206 181222 175189 109794 117278 141908 156377 35752 -16801 42851 161190 171088 48584
12422 48584 70638 147465 178562 96495 41696 57696 88103 87312 100050 88871 59939 51574
$$ packed form
12504G6389k392L3360L3870Q588n0139k0375n2314j9448K7290J0474L2417p0341
12492G379L9825J66179R4652k5957k6324j0854L5662j5308m9282n8092N276m307
12480A58849r7125l4625L5750P4827J8561J8574l8886L0226N0258o7370K0478
12469A69517k098j7580j9680L9962N7198J6299o6308k0866k8815O981J9599n3936
12457A00273J453R0074L9722o8093p9710m390R3556l27O2074m3800k8761j4210
12445A47861J1121L7158l3676j24483q4343Q1135J05463P2476K5558o0685p2379
12434A05206P6016o033o5395P484K4630J4469j20625n2553N9652J18339R898j22504
12422D8584K2054P6827L1097q2067n4799J6000L0407p91J2738j1179k8932q365
$$ plain form
12410 51574 95628 117540 125451 223508 276574 238878 183976 171873 132884 112981 161113 134199
12398 134199 135149 200007 225790 194876 250618 292860 293281 290252 253806 271525 215403 172101
12386 172101 210533 172764 151728 207819 226889 173213 160923 117579 100167 186134 267000
12375 267000 306331 305895 224949 108558 77408 134812 139484 267824 324361 285690 265263 187738
12363 187738 155868 160423 182335 188420 219691 277186 252187 311755 319056 350275 350906 238718
12351 238718 128006 43816 131952 316302 401855 401843 343790 240199 171996 160396 228460
12340 228460 204899 173640 141771 212680 297452 236121 185182 205322 217251 319035 322917
12329 322917 232858 193242 127737 202093 190947 143981 170459 270411 272698 316623 361073 374488
$$ packed form
12410E1574M4054K1912P911R8057N3066l7696n4902j2103l8989j9903M8132k6914
12398A34199R50O4858K5783l0914N5742M2242M21l029l6446J7719n6122m3302
12386A72101L8432l7769k1036N6091J9070n3676j2290m3344j7412Q5967Q0866
12375B67000L9331m36q0946j16391l1150N7404M672J28340N6537l8671k0427p7525
12363A87738l1870M555K1912O085L1271N7495k4999N9568P301L1219O31j12188
12351B38718j10712q4190Q8136J84350Q5553j2n8053j03591o8203j1600O8064
12340B28460k3561l1259l1869P0909Q4772o1331n0939K0140J1929J01784L882
12329C22917r0059l9616o5505P4356j1146m6966K6478R9952K287M3925M4450J3415
$$ plain form
12317 374488 335143 379540 381939 385659 370881 349528 303372 270100 252510 266753 281422 189137
12305 189137 185721 217654 285331 265377 175434 192287 205111 173972 126436 144243 184028 164275
12293 164275 190008 203763 256953 339645 336435 268274 261784 216386 211551 227536 249220 323040
$$ packed form
12317C74488l9345M4397K399L720j4778k1353m6156l3272j7590J4243J4669r2285
12305A89137l416L1933O7677j9954q9943J6853J2824l1139m7536J7807L9785j9753
12293A64275K5733J3755N3190Q2692l210o8161o490m5398m835J5985K1684P3820
$$ [...]
##END NTUPLES=NMR SPECTRUM
##END=
