##TITLE=Analysis number 318598
Compound Code ac 42553
Project Code adrs
Chemist Name epsilon
##JCAMPDX= 6.0         $$ Bruker NMR JCAMP-DX V2.0
##DATA TYPE= NMR SPECTRUM
##DATA CLASS= NTUPLES
##ORIGIN= Bruker BioSpin GmbH
##OWNER= nmr
$$ XWIN-NMR		Version 3.5
$$ Wed Apr  5 14:34:41 2006 GMT Daylight Time (UT+1h)  MAYBRIDGE\nmr@NMR_250MHZ
##.OBSERVE FREQUENCY= 250.131544655141
##.OBSERVE NUCLEUS= ^1H
##.ACQUISITION MODE= SIMULTANEOUS (DQD)
##.ACQUISITION SCHEME= undefined
##.AVERAGES= 16
##.DIGITISER RES= 18
##SPECTROMETER/DATA SYSTEM= dpx250
##.PULSE SEQUENCE= zg30
##.SOLVENT NAME= CDCl3
##.SHIFT REFERENCE= (INTERNAL, CDCl3, 0, 16.522)
##AUDIT TRAIL= $$ (NUMBER, WHEN, WHO, WHERE, WHAT)
$$ ##TITLE= Audit trail, XWIN-NMR		Version 3.5
$$ ##JCAMPDX= 5.01
$$ ##ORIGIN= Bruker BioSpin GmbH
$$ ##OWNER= nmr
$$ C:\u/data/dgb/nmr/ADRS/2080/pdata/1/auditp.txt
$$ ##AUDIT TRAIL=  $$ (NUMBER, WHEN, WHO, WHERE, WHAT)
(   1,<2006-04-05 14:34:15.71 +100>,<MAYBRIDGE\nmr>,<NMR_250MHZ>,
      <created by zg, POWCHK disabled, PULCHK disabled
       configuration hash MD5:
       84 BC 41 DB A1 6E 1D 46 DA 25 12 A5 C1 ED C5 3A
       data hash MD5: 64K
       D0 CF 28 20 5F 83 22 6A 10 38 F9 3C 5D BC D0 A8>)
(   2,<2006-04-05 14:34:30.21 +100>,<MAYBRIDGE\nmr>,<NMR_250MHZ>,
      <Start of raw data processing
       ef LB = 0.3 FT_mod = 6 PKNL = 1 SI = 32K 
       data hash MD5: 32K
       D6 F9 A3 72 EC C7 5D 46 81 AE EE BB B8 FC FB 5B>)
(   3,<2006-04-05 14:34:32.26 +100>,<MAYBRIDGE\nmr>,<NMR_250MHZ>,
      <apk 
       data hash MD5: 32K
       73 3B 71 7A 41 B2 96 D6 A6 1C 7A 12 1C E8 96 B9>)
(   4,<2006-04-05 14:34:33.04 +100>,<MAYBRIDGE\nmr>,<NMR_250MHZ>,
      <abs ABSG = 5 
       data hash MD5: 32K
       1D EC 9A 87 43 17 47 BA A7 FD 69 2B F2 50 27 12>)
$$ ##END=
$$ 
$$ hash MD5
$$ 30 93 21 58 8D 0D 4A 13 83 2C 46 44 CE 26 0E 86
##$RELAX= 
##$RELAX= 
##$RELAX= 
##$RELAX= 
##$RELAX= 
##$RELAX= 
##$RELAX= 
$$ Bruker specific parameters
$$ --------------------------
##$DU= <C:\u>
##$EXPNO= 2080
##$NAME= <ADRS>
##$PROCNO= 1
##$TYPE= <nmr>
##$USER= <dgb>
##$AMP= (0..31)
100 100 100 100 100 100 100 100 100 100 100 100 100 100 100 100 100 100 
100 100 100 100 100 100 100 100 100 100 100 100 100 100 
##$AQSEQ= 0
##$AQ_mod= 3
##$AUNM= <au_zg>
##$AUTOPOS= <43 >
##$BF1= 250.13
##$BF2= 250.13
##$BF3= 250.13
##$BF4= 250.13
##$BF5= 500.13
##$BF6= 500.13
##$BF7= 500.13
##$BF8= 500.13
##$BYTORDA= 1
##$CFDGTYP= 0
##$CFRGTYP= 5
##$CHEMSTR= <none>
##$CNST= (0..31)
1 1 145 1 1 1 1 1 1 1 1 1 1 1 1 1 1 1 1 1 1 1 1 1 1 1 1 1 1 1 1 1 
##$CPDPRG= <>
##$CPDPRG1= <>
##$CPDPRG2= <>
##$CPDPRG3= <>
##$CPDPRG4= <mlev>
##$CPDPRG5= <mlev>
##$CPDPRG6= <mlev>
##$CPDPRG7= <mlev>
##$CPDPRG8= <mlev>
##$CPDPRGB= <>
##$CPDPRGT= <>
##$D= (0..31)
0 1 0 0 0 0 0 0 0 0.06 0 0 0 0 0 0 0.0002 0 0 0 0 0 0 0 0 0 0 0 0 0 0 
0 
##$DATE= 1144244054
##$DBL= (0..7)
120 120 120 120 120 120 120 120 
##$DBP= (0..7)
150 150 150 150 150 150 150 150 
##$DBP07= 0
##$DBPNAM0= <>
##$DBPNAM1= <>
##$DBPNAM2= <>
$$ [...]
##$SUBNAM7= <"">
##$SUBNAM8= <"">
##$SUBNAM9= <"">
##$SW= 20.6930455092707
##$SWIBOX= (0..15)
0 0 3 0 0 0 0 0 0 0 0 0 0 0 0 0 
##$SW_h= 5175.983436853
##$TD= 65536
##$TD0= 1
##$TE= 295.16
##$TE2= 300
##$TE3= 300
##$TEG= 300
##$TL= (0..7)
0 120 120 120 120 120 120 120 
##$TP= (0..7)
150 150 150 150 150 150 150 150 
##$TP07= 0
##$TPNAME0= <>
##$TPNAME1= <>
##$TPNAME2= <>
##$TPNAME3= <>
##$TPNAME4= <>
##$TPNAME5= <>
##$TPNAME6= <>
##$TPNAME7= <>
##$TPOAL= (0..7)
0.5 0.5 0.5 0.5 0.5 0.5 0.5 0.5 
##$TPOFFS= (0..7)
0 0 0 0 0 0 0 0 
##$TUNHIN= 0
##$TUNHOUT= 0
##$TUNXOUT= 0
##$USERA1= <user>
##$USERA2= <user>
##$USERA3= <user>
##$USERA4= <user>
##$USERA5= <user>
##$V9= 5
##$VALIST= <valist>
##$VCLIST= <CCCCCCCCCCCCCCC>
##$VD= 0
##$VDLIST= <DDDDDDDDDDDDDDD>
##$VPLIST= <PPPPPPPPPPPPPPP>
##$VTLIST= <TTTTTTTTTTTTTTT>
##$WBST= 1024
##$WBSW= 4
##$XGAIN= (0..3)
0 0 0 0 
##$XL= 0
##$YL= 0
##$YMAX_a= 600853
##$YMIN_a= -563782
##$ZGOPTNS= <>
##$ZL1= 120
##$ZL2= 120
##$ZL3= 120
##$ZL4= 120
##$ABSF1= 16.522
##$ABSF2= -4.171173
##$ABSG= 5
##$ABSL= 3
##$ALPHA= 0
##$AQORDER= 0
##$ASSFAC= 0
##$ASSFACI= 0
##$ASSFACX= 0
##$ASSWID= 0
##$AUNMP= <proc_1d>
##$AZFE= 0.1
##$AZFW= 0.1
##$BCFW= 0
##$BC_mod= 0
##$BYTORDP= 0
##$COROFFS= 0
##$CY= 12.5
##$DATMOD= 1
##$DC= 0
##$DFILT= <>
##$DTYPP= 0
##$F1P= 14.0000005364418
##$F2P= -0.99999901652339
##$FCOR= 0.5
##$FTSIZE= 32768
##$FT_mod= 6
##$GAMMA= 0
##$GB= 0
##$INTBC= 1
##$INTSCL= 1
##$ISEN= 128
##$LB= 0.3
##$LEV0= 0
##$LPBIN= 0
##$MAXI= 10000
##$MC2= 0
##$MEAN= 0
##$ME_mod= 0
##$MI= 0
##$NCOEF= 0
##$NC_proc= -3
##$NLEV= 6
##$NOISF1= 0
##$NOISF2= 0
##$NSP= 0
##$NTH_PI= 0
##$NZP= 0
##$OFFSET= 16.522
##$PC= 1
##$PHC0= 4.038193
##$PHC1= 28.44534
##$PH_mod= 1
##$PKNL= yes
##$PPARMOD= 0
##$PSCAL= 4
##$PSIGN= 0
##$REVERSE= no
##$SF= 250.13
##$SI= 32768
##$SIGF1= 0
##$SIGF2= 0
##$SINO= 400
##$SIOLD= 32768
##$SREGLST= <1H.CDCl3>
##$SSB= 0
##$STSI= 32768
##$STSR= 0
##$SW_p= 5175.98343685301
##$SYMM= 0
##$S_DEV= 0
##$TDeff= 65536
##$TDoff= 0
##$TI= <Analysis number 999999
Compound Code 99
Book Reference 9
Project Code 9>
##$TILT= no
##$TM1= 0
##$TM2= 0
##$TOPLEV= 0
##$USERP1= <user>
##$USERP2= <user>
##$USERP3= <user>
##$USERP4= <user>
##$USERP5= <user>
##$WDW= 1
##$XDIM= 32768
##$YMAX_p= 381761741
##$YMIN_p= -27085
$$ End of Bruker specific parameters
$$ ---------------------------------
##NTUPLES= NMR SPECTRUM
##VAR_NAME=  FREQUENCY,     SPECTRUM/REAL,   SPECTRUM/IMAG
##SYMBOL=    X,             R,               I
##VAR_TYPE=  INDEPENDENT,   DEPENDENT,       DEPENDENT
##VAR_FORM=  AFFN,          ASDF,            ASDF
##VAR_DIM=   32768,         32768,           32768
##UNITS=     HZ,            ARBITRARY UNITS, ARBITRARY UNITS
##FACTOR=    0.157963299565203, 1,           1
##FIRST=     4132.6476996994, 0,             0
##LAST=      -1043.33573715361, 0,           0
##MIN=       -1043.33573715361, -27085,      0
##MAX=       4132.6476996994, 381761741,     0
$$ Real data points
##PAGE= N=1
##DATA TABLE= (X++(R..R)), XYDATA
$$ [...]
19094B805K871m566m58o438n010K386Q991J2595m036l153o180n63P87P495l866
$$ 2805 5676 1110 652 -5786 -10796 -8410 581 13176 9140 5987 -193 -756 31 7526 3660
19079C660m070Q57o930K725O284L608N309m52r09o435m849j939N280j547M044
$$ 3660 -410 447 -6483 -3758 2526 6134 11443 10991 10082 3647 -1202 -3141 2139 592 4636
19064D636K763J627l157J30M837n30J825m344k679L24j995K684n71L260Q643q905
$$ 4636 7399 9026 5869 5999 10836 10306 12131 7787 5108 5432 3437 6121 5550 8810 17453 8548
19048H548j0508L394N534J133q74J724M103J677l384m53K425l262q872j979j562
$$ 8548 -1960 1434 6968 8101 7227 8951 13054 14731 11347 10894 13319 10057 1185 -794 -2356
19033b356O156N031j4513p502L940M556J810J1393P93J988p08O75N84K378l049
$$ -2356 3800 8831 -5682 -13184 -9244 -4688 -2878 8515 9308 11296 10588 11263 11847 14225 11176
19018A1176m551l981K296L564j269L324O46J998j480J097l942j931n31M577P94
$$ 11176 6625 2644 4940 8504 7235 10559 11205 13203 11723 12820 8878 6947 6416 10993 11787
19003A1787j550M2M690l168p941j235N76M302j0335k062L608O795r727o618O187
$$ 11787 10237 10279 14969 11801 3860 2625 3201 7503 -2832 -4894 -1286 5509 -4218 -10836 -4649
18988d649O965J5K566L793r50p639m692K315L15J988j157l783K291K535M789k815
$$ -4649 2316 2331 4897 8690 7740 101 -4591 -2276 -1961 27 -1130 -4913 -2622 -87 4702 1887
18972A887n74M447k806k483P412M735k383p288j0980K120J276O65m2J622M890
$$ 1887 1313 5760 2954 471 7883 12618 10235 2947 -8033 -5913 -4637 -3972 -4014 -2392 2498
18957B498K717k362j696n331N290N82q180N687Q690k257n593J233P017J749l982
$$ 2498 5215 2853 1157 -4174 1116 1698 -6482 -795 7895 5638 45 1278 8295 10044 6062
18942F062k672l580l032o309J677J773k013J026Q239J855J588m469J119j172M064
$$ 6062 3390 -190 -3222 -9531 -7854 -6081 -8094 -7068 1171 3026 4614 145 1264 92 4156
18927D156N356p42j0334n642k029m49P86M261N582n990J990N97k096K125j698
$$ 4156 9512 8770 -1564 -7206 -9235 -9684 -8898 -4637 945 -5045 -3055 -2458 -4554 -2429 -4127
18912d127j947L029L639M036p01l489K307l889l109J426r26J652J735J94J089
$$ -4127 -6074 -3045 594 4630 3929 440 2747 -1142 -4251 -2825 -3751 -2099 -364 -170 919
18897I19Q60J192l043l55p207m350J1362M331k259m892R26J302N9r014M128L514
$$ 919 1779 2971 -72 -427 -7634 -11984 -622 3709 1450 -3442 -2516 -1214 -1155 -10169 -6041 -2527
18881b527K390J035R63K175j717M493J180j22p029m736L648J475j206j158j821
$$ -2527 -137 898 1861 4036 2319 6812 7992 7870 841 -3895 -247 1228 22 -1136 -2957
18866b957N426n59m292j490k310R102M305j603J674o29m15l290M737o146p79j363
$$ -2957 2469 1910 -2382 -3872 -6182 2920 7225 5622 7296 6667 6252 2962 7699 1553 774 -589
18850e89M817j869j284p97k910K392L166m898q402K283P305n61o079j570O101
$$ -589 4228 2359 1075 278 -2632 -240 2926 -1972 -10374 -8091 -786 -1347 -7426 -8996 -2895
18835b895P169j101o508N059M6q176j069L400P66R88l53r20Q398K976N182r14
$$ -2895 4274 3173 -3335 1724 1770 -6406 -7475 -4075 -3309 -2321 -2674 -3594 4804 7780 12962 12048
18819A2048N04l903k977p097k345J2187K557j356l838k08J442l519k598J459J350
$$ 12048 12552 8649 5672 -1425 -3770 8417 10974 9618 5780 5572 7014 3495 897 2356 3706
18804C706k503m912k430O225J821J044q395j3284L328L263Q094O517o213k712
$$ 3706 1203 -3709 -6139 86 1907 2951 -5444 -18728 -15400 -12137 -4043 2474 -3739 -6451
18790f451N789J802L364j005l152q6p398N582M750n429k33N567P888j911o784
$$ -6451 -662 1140 4504 3499 347 261 -7137 -1555 3195 -2234 -2467 3100 10988 9077 2293
18775B293k512O98L662l7L486L165J4484K1025J0244p152j6811j0535n506r111
$$ 2293 -219 479 4141 4104 7590 10755 25239 46264 56508 49356 32545 22010 16504 7393
18761G393k389K240n880k522N400j690k800N349R909K601n981j3893k064M574
$$ 7393 5004 7244 1364 -1158 4242 2552 -248 5101 15010 17611 11630 -2263 -4327 247
18747B47n068l776L527m197K319O069J20L99o35l76q76L467j213J500j321M68
$$ 247 -4821 -8597 -5070 -9267 -6948 -879 -759 -360 -995 -1371 -2247 1220 7 1507 186 654
18731F54Q594K080m09K496N9J153l041K932l960o807j198n477J145L567J701M608
$$ 654 9248 11328 10919 13415 13474 14627 11586 14518 10558 3751 2553 -2924 -1779 1788 3489 8097
18715H097J88q75k255K44J532k786K542j373J025K147q019k054K981L395j917
$$ 8097 8285 7410 5155 5399 6931 4145 6687 5314 6339 8486 467 -1587 1394 4789 2872
18700B872k463k111j50l85J911q43j103M882j967R41P617N837k351m638k767J999
$$ 2872 409 -1702 -1852 -2237 -326 -1169 -2272 2610 643 1584 9201 15038 12687 8049 5282 7281
18684G281o17k728K442M3K892p31k502Q18l372K967k957q376O353O142j100K076
$$ 7281 6664 3936 6378 6421 9313 8582 6080 6898 3526 6493 3536 -4840 1513 7655 6555 8631
18668H631N30m624n53o006K952P032N663J990m65J859j374k795J902J606L503
$$ 8631 9161 4537 3984 -2022 930 7962 13625 15615 15150 17009 15635 12840 14742 16348 19851
18653A9851J921r21k229l091k04K322p62q177j459l558k267j66J123K944N5j927
$$ 19851 21772 20851 18622 15531 15327 17649 16887 8710 7251 3693 1426 1260 2383 5327 5382 3455
18637C455P073n6j211J112l729m698k762J373k478M782K934l720O878K964n263
$$ 3455 10528 10472 9261 10373 6644 1946 -816 557 -1921 2861 5795 2075 8953 11917 6654
18622F654K773M118k456r666o808Q504L278n174m18K706L016M25k419l280L549
$$ 6654 9427 13545 11089 1423 -5385 3119 6397 1223 805 3511 6527 6952 4533 1253 4802
18607D802O121J468k909L831R60k477q47o34O476J491k61L197P171j730n89q91
$$ 4802 10923 12391 9482 13313 14273 11796 10949 10315 16791 18282 18021 21218 28389 26659 26070 25179
18591B5179m211j610R947N902N451M242l335J0531L390p995j2798k681k75n628
$$ 25179 20968 19358 29305 35207 40658 44900 41565 52096 55486 47491 34693 32012 31737 26109
18577B6109p285L827P692j603J076N299q130q535l110N245n16J98m492p003j36
$$ 26109 18824 22651 30343 28740 29816 35115 26985 18450 15340 20585 20069 20267 15775 8772 8636
18562H636R681P814P644o1L24P165M473m173j0956k047l335j480N773L304P477
$$ 8636 18317 26131 33775 33714 34038 41203 45676 41503 30547 28500 25165 23685 29458 32762 40239
18547D0239Q297M613J43r731j001m301K084n88J340k664j586j768m525k342M517
$$ 40239 48536 53149 53292 43561 42560 38259 40343 39755 41095 38431 36845 35077 30552 28210 32727
18532C2727n948m196J389O390J662o425o931L95Q607J900p944J747l545l848n542
$$ 32727 26779 22583 23972 30362 32024 25599 18668 19063 27670 29570 21626 23373 19828 15980 10438
18517A0438N712Q61n544q603L321R803K214J844j295p068N29J073P699J533J389
$$ 10438 16150 17011 11467 2864 6185 15988 18202 20046 18751 11683 12212 13285 20984 22517 23906
18502B3906O8m853p991o936L094M917j133k739k81N232J233K655r13k502K715
$$ 23906 23974 19121 11130 4194 7288 12205 11072 8333 8052 13284 14517 17172 16259 13757 16472
18487A6472L038l939k294m115J026N26N82K731N00K781k877M081K045L96n972
$$ 16472 19510 15571 13277 9162 10188 10714 11296 14027 14527 17308 14431 18512 20557 20953 14981
18472A4981K340l237m735j72K98%K694l370P37l515J994L031k844j544Q31j10
$$ 14981 17321 14084 9349 9177 9475 9475 12169 8799 9536 6021 8015 11046 8202 6658 7489 7379
18456G379J557M76K568J651k251J422J925l385k743m94J92P164M859J780m210
$$ 7379 8936 9412 11980 13631 11380 12802 14727 11342 8599 8105 8297 15461 20320 22100 17890
18441A7890j1170l89L575J614N151O717l861q880j744J783j747J952K147j761
$$ 17890 6720 6331 9906 11520 16671 23388 19527 10647 8903 10686 8939 10891 13038 11277
18427A1277k652M23k155O23P532M865K334q92p872K932O839k612K062j889o228
$$ 11277 8625 9048 6893 7516 15048 19913 22247 21355 13483 16415 23254 20642 22704 20815 14587
18412A4587m109L43j262l978l891Q70O437J614k81p104o574N558N304m729p874
$$ 14587 10478 10821 9559 5581 1690 2560 8997 10611 10330 3226 -3348 2210 7514 2785 -5089
18397e089k01J2337Q63r34L322j341m495N86P228J49n626J655K167k444J706M841
$$ -5089 -5290 7047 7910 6976 10298 8957 4462 5048 12276 12425 6799 8454 10621 8177 9883 14724
18381A4724R032L382L41r186J923M359J033k744j792K126o171r832M158N081k083
$$ 14724 23756 27138 27479 18293 20216 24575 25608 22864 21072 23198 17027 7195 11353 16434 14351
18366A4351P910L225l615j497K36k053k982L922J839L943n02p50K889l94M382
$$ 14351 22261 25486 21871 20374 20610 18557 15575 19497 21336 25279 24777 24027 26916 26522 30904
18351C0904Q554K925L895O640Q752R032J0136j417k604q741N02J259J5927K3590
$$ 30904 39458 42383 46278 52918 61670 70702 80838 79421 76817 68076 68578 69837 85764 109354
18337A09354J9569P351l629k0625k3530j2175r0R868L142l931j4972j6820n749
$$ 109354 128923 136274 132645 112020 88490 76315 76225 86093 89235 85304 70332 53512 47763
18324D7763q0j004j1149p890M326K046k009K471k74m072o509k617J257L358N154
$$ 47763 47683 46679 35530 27640 31966 34012 32003 34474 34200 30128 23619 21002 22259 25617 30771
18309C0771O643o369j0278k98m821j090M912Q570R752n878j115M163q225k934
$$ 30771 37414 31045 20767 20469 15648 14558 19470 28040 37792 31914 30799 34962 26737 23803
18295B3803J0190k354r526o356K490L307j077l737J299P418j014P828k237n163
$$ 23803 33993 31639 22113 15757 18247 21554 20477 16740 18039 25457 24443 32271 30034 24871
18281B4871l334J11O133l903R17l412k31n427o02K226Q48J569P33j518O175l043
$$ 24871 21537 21648 27781 23878 24795 21383 21152 15725 15123 17349 18197 19766 20499 18981 25156 22113
18265B2113l228m161J452K346n59l148k288J560N565l613M104M6J758O31q30Q18
$$ 22113 18885 14724 16176 18522 17963 14815 12527 14087 19652 16039 20143 20189 21947 22578 21748 22566
18249B2566k315k742K599O924K005K543j06K947N666L380N526m741j890n75P622
$$ 22566 20251 17509 20108 27032 29037 31580 31474 34421 40087 43467 48993 44252 42362 41787 49409
18234D9409M511N648k334p874j3989o905N58N553k066K229m483k908L354O342
$$ 49409 53920 59568 57234 49360 35371 28466 29024 34577 32511 34740 30257 27349 30703 37045
18220C7045K133J594P12o546k603j934j188M167M512j685J195n549m485O693O895
$$ 37045 39178 40772 41484 34938 32335 30401 29213 33380 37892 36207 37402 31853 27368 34061 40956
18205D0956K073n391o984N596k688L461L215M176K696N65k811l272j278o455j260
$$ 40956 43029 37638 30654 36250 33562 37023 40238 44414 47110 47675 44864 41592 40314 33859 32599
18190C2599M959Q50k283L163k181j96P02Q997L08K640j08j0679p122O824M924
$$ 32599 37558 38408 36125 39288 37107 36911 37613 46610 46918 49558 49450 38771 31649 38473 43397
18175D3397N209L315o88m657m201j811j45j396l243O533L841M951q27M385L613
$$ 43397 48606 51921 51233 46576 42375 40564 40419 39023 35780 42313 46154 51105 50278 54663 58276
18160E8276K810p77N095N64k629p92p67N278P880L242O126K799m148q16Q189R141
$$ 58276 61086 60309 65404 65968 63339 62547 61780 67058 74938 78180 84306 87105 82957 82141 90330 99471
18144I9471O081O891n642p287k046P025J2737J1092L0M291p43k898K693L572o44
$$ 99471 105552 112443 106801 99514 97468 104493 117230 128322 128352 132643 131900 129002 131695 135267 134623
18129A34623P953J4642J4050J2108J6934J1966J3598K2780K3303K7691L7687N9807
$$ 134623 142576 157218 171268 183376 200310 212276 225874 248654 271957 299648 337335 397142
18117C97142P7387R2740J13717J52702K16566L30020N33461R13803J522813J876065
$$ 397142 474529 567269 680986 833688 1050254 1380274 1913735 2827538 4350351 6226416
18107F226416J133394P5030j596209k066352j305487p01627l95090k40855j54491
$$ 6226416 7359810 7434840 5838631 3772279 2466792 1765165 1370075 1129220 974729
18098I74729j00001p3155o3479n1217m2407l6980m2767l3136l1295k6441k7688
$$ 974729 874728 801573 738094 686877 644470 607490 564723 531587 500292 473851 446163
18087D46163k0560j7873j8992j5609m864r949r812n313j6887p504k159n716k550
$$ 446163 425603 407730 388738 373129 368265 358316 348504 343191 326304 318800 316641 310925 308375
18074C08375o859j4931j1954k163M576P127k213j1388n360k456j0218j0998j1983
$$ 308375 301516 286585 274631 272468 277044 284171 281958 270570 265210 262754 252536 241538 229555
18061B29555k066l521m934K513M32r595j1125q715Q64k757p085m579n810j873
$$ 229555 227489 223968 219034 221547 221979 212384 201259 192544 193408 190651 183566 178987 173177 171304
18047A71304p05J624m255k274m739o016K25J788J124m743n491j96j161N861J885
$$ 171304 170599 172223 167968 165694 160955 154939 155164 156952 158076 153333 147842 147646 146485 152346 154231
18032A54231R901O849K139J0294O594R755J8887J6288P440N861J309Q76m525j5726
$$ 154231 164132 170981 173120 183414 190008 199763 218650 234938 242378 248239 249548 250424 245899 230173
18018B30173j5301q226N769R717J0211Q391J656j3692k4250k6726k4333j6514
$$ 230173 214872 206646 212415 222132 232343 240734 242390 228698 204448 177722 153389 136875
18006A36875j3649n436r094k392N79K481p55q581k3O915R844M454N743j711q300
$$ 136875 123226 117790 108696 106304 106883 109364 108609 100028 100005 106920 116764 121218 126961 125250 116950
17991A16950o634o690r889O212M712M852L098J2160K1932K8183L5658L0318K6072
$$ 116950 110316 103626 93737 99949 104661 109513 112611 124771 146703 174886 210544 240862 266934
17978B66934K1905J6062k437j5297r867q794p414k3164k6391j8211j3049j3551
$$ 266934 288839 304901 302464 287167 277300 268506 261092 237928 211537 193326 180277 166726
17966A66726j2391j1856q147j0322j3292j0243j83l951m00m016r116j346K81q20
$$ 166726 154335 142479 134332 124010 110718 100475 100292 96341 95941 91925 82809 81463 81744 80924
17952H0924n545l830M91R16o631o684l230J298j563k216j658R24Q00J415l796
$$ 80924 75379 71549 72040 72956 66325 59641 56411 57709 56146 53930 52272 53196 53996 55411 51615
17937E1615k344P263J2641R269j390o742M102O627M617N709J5100J4628J0934
$$ 51615 49271 56534 69175 78444 77054 70312 74414 81041 85658 91367 106467 121095 132029
17924A32029J4602J4185J4849K1051K4353K0608J1844K4091K2731K4097K6812
$$ 132029 146631 160816 175665 196716 221069 241677 253521 277612 300343 324440 351252
17913C51252J3361L680K91m856J95K351p549k1251j2419p901j5386k3004k7441
$$ 351252 364613 368293 368584 363728 363923 366274 358725 337474 325055 317154 301768 278764 251323
17900B51323k0309k0521j7554k4287j3408j0372n079r298o842P21J98o235m482
$$ 251323 231014 210493 192939 168652 155244 144872 139793 130495 123653 124374 124572 118337 113855
17887A13855p611r747k059O336J0624N358N715Q111N014j377J133J0029J1549
$$ 113855 106244 96497 94438 100774 111398 116756 122471 130582 135596 134219 135352 145381 156930
17874A56930j218k168Q730J4342O998J2708J0568l143j121r04J989n292n594M034
$$ 156930 155712 153544 162274 176616 183614 196322 206890 203747 202626 201722 203711 198419 192825 196859
17860A96859L606j184j241n473M434R73m651j5173j7413j6949j7589j4802j8316
$$ 196859 200465 199281 198040 192567 197001 197974 193323 178150 160737 143788 126199 111397 93081
17847I3081j6171p823k901m70j768k178K441n931J777M101L743J468o187n181
$$ 93081 76910 69087 66186 65716 63948 61770 64211 58280 60057 64158 67901 69369 63182 58001
17833E8001K870n355j266j328j803J967q433J114J241m619j0323m551k031O653
$$ 58001 60871 55516 54250 52922 51119 53086 44653 45767 47008 42389 32066 27515 25484 32137
17819C2137J058l329M64MM177N543O312K763N410l65n089j1250j0466O996J81
$$ 32137 33195 29866 30330 30334 34511 40054 46366 49129 54539 54174 49085 37835 27369 34365 34546
17804C4546o241O842N687N869j0061m883m694N4o003k907o150m817M755j24l077
$$ 34546 28305 35147 40834 46703 36642 31759 27065 27119 21116 18209 12059 7242 11997 11873 8796
17789H796o069L056N080k14K32J170o481L51J010j767o05k769o823P67j126P680
$$ 8796 2727 5783 10863 10649 10881 12051 5570 5921 6931 5164 4559 1790 -5033 -4266 -5392 2288
17773B288M955n009l631j93N32K944R78L84N499R260M624p7N683m190r283j643
$$ 2288 7243 2234 -1397 -1590 -1058 1886 2864 3248 8747 18007 22631 22554 28237 24047 14764 13121
17757A3121M390o244l920k600o510m940L012O795K8J663O01o965k142J410J673
$$ 13121 17511 11267 7347 4747 -1763 -6703 -3691 3104 3132 4795 5396 -1569 -3711 -2301 -628
17742f28Q85P03J594l129m298k032j156O177K357P48M255n595p442M931J248m35
$$ -628 257 960 2554 -575 -4873 -6905 -8061 -1884 473 1221 5476 -119 -7561 -2630 -1382 -1817
17726a817K834m475l334K411o559J029J2193J685J608J683N66m641n14p687p551
$$ -1817 1017 -3458 -6792 -4381 -10940 -9911 2282 3967 5575 7258 7824 3183 2669 -5018 -12569
17711a2569n91K298Q63K081j260l273J361M615M774M960r446o6J2314N545l526
$$ -12569 -13160 -10862 -9999 -7918 -9178 -12451 -11090 -6475 -1701 3259 -6187 -6253 6061 11606 8080
17696H080j1089o810j961O783O807J719J946n944O87J828L847L849L482l637K274
$$ 8080 -3009 -9819 -11780 -4997 1810 3529 5475 -469 218 2046 5893 9742 13224 9587 11861
17681A1861q189j0174N932k123o939M552L209N297l532m725m061O785J0437L309
$$ 11861 3672 -6502 -570 -2693 -9632 -5080 -1871 3426 -106 -4831 -8892 -2107 8330 11639
17667A1639o742Q09p81K282K952L874q22K5n444J403r139m414p06K993L420K645
$$ 11639 4897 5706 4925 7207 10159 14033 13211 13236 7792 9195 56 -4358 -5064 -2071 1349 3994
17651C994l611j039r86L83l091j945o30L498L136J942l401K516l917p085N037
$$ 3994 383 -656 -1642 -1259 -4350 -6295 -6925 -3427 -291 1651 -1750 766 -3151 -10236 -5199
17636e199M692L424k603N930m39j2099j224K724l39L04J130j363l577L716L373
$$ -5199 -507 2917 314 6244 5805 -6294 -7518 -4794 -5133 -4829 -3699 -5062 -8639 -4923 -1550
17621a550r40M448L080j814L28K885K357p319o23N949o199l082j419q41K587N885
$$ -1550 -2490 1958 5038 3224 3552 6437 8794 1475 852 6801 602 -2480 -3899 -4740 -2153 3732
17605C732J379j446N894m230o544M059L868n68o779o829m49M722p898j748L041
$$ 3732 5111 3665 9559 5329 -1215 2844 6712 6144 -635 -7464 -7913 -3191 -11089 -12837 -9796
17590i796K143l007O5k522N79L931k82K504K482o564j617M584l04J318K216l441
$$ -9796 -7653 -10660 -10595 -13117 -12538 -8607 -8889 -6385 -3903 -10467 -12084 -7500 -7804 -6486 -4270 -7711
17574g711J033J922k737j028J618J601o770j092l258J958J413R500M758L947j340
$$ -7711 -6678 -4756 -7493 -8521 -6903 -5302 -12072 -13164 -16422 -14464 -13051 -3551 1207 5154 3814
17559C814q32p06M454K696r298n535L139L670m119q169k760L31N808L990O417
$$ 3814 2982 2276 6730 9426 128 -5407 -2268 1402 -2717 -10886 -13646 -13315 -7507 -3517 2900
17544B900n403n894M185Q078n286L88l74k789m764M746Q332J967n227Q080k060
$$ 2900 -2503 -8397 -4212 3866 -1420 -1032 -1406 -4195 -8959 -4213 4119 6086 859 8939 6879
17529F879n953n837L16J775j298O013J208l848n610l075N154O769l790o658O607
$$ 6879 926 -4911 -4595 -2820 -4118 1895 3103 -745 -6355 -9430 -4276 2493 -1297 -7955 -1348
17514a348L920r69J662j095p06m04p796r45K799m05m73o850p472K722J222j438
$$ -1348 2572 1603 3265 2170 1464 1060 -6736 -7681 -4882 -5287 -5760 -12610 -20082 -17360 -16138 -17576
17498a7576N201J0468M608j554J122l436j967K709m334N9j509k471k357K035N324
$$ -17576 -12375 -1907 2701 1147 2269 -1167 -3134 -425 -4759 -4700 -6209 -8680 -11037 -9002 -3678
17483c678r9n918m282K872Q833o018r00M652l102l581k61j277K585L984N471l014
$$ -3678 -3777 -9695 -13977 -11105 -2272 -8290 -9190 -4538 -7640 -11221 -11482 -12759 -10174 -6190 -719 -3733
17467c733M47j138j996N833L405k81n263m582L915j404Q11n816q93K061Q113k720
$$ -3733 -3286 -4424 -6420 -587 2818 2537 -2726 -7308 -3393 -4797 -3986 -9802 -10695 -8634 -521 -3241
17451c241R95J949K189M336M508J786j07L10j295K337P69K381Q312R246k686j3950
$$ -3241 -2246 -297 1892 6228 10736 12522 12415 12725 11430 13767 14536 16917 25229 34475 31789 17839
17435A7839k603J585q338K374l463n307K72L922q12m137N766L799J321j242l197
$$ 17839 15236 16821 8483 10857 7394 2087 2359 6281 5469 1332 7098 10897 12218 10976 7779
17420G779r137p924q68m74k292O249P226N393j757q89L141k346j82n42L191j517
$$ 7779 -1358 -9282 -10150 -10624 -12916 -6667 559 5952 4195 3306 6447 4101 3919 3377 6568 5051
17404E051o497J234J569J956m579K544k146n054l752J190j623k698R88O624m942
$$ 5051 -1446 -212 1357 3313 -1266 1278 -868 -5922 -9674 -8484 -10107 -12805 -11817 -5193 -10135
17389a0135k075P01Q76R913L620p366r47m436J390K161l254k609l106M922N293
$$ -10135 -12210 -11509 -10633 -720 2900 -4466 -5413 -9849 -8459 -6298 -9552 -12161 -15267 -10345 -5052
17374e052k142l329K77P173J988q16j254M284k747J981k556J729m155k219L023
$$ -5052 -7194 -10523 -10246 -3073 -1085 -1901 -3155 1129 -1618 363 -2193 -464 -4619 -6838 -3815
17359c815j797o523o613o15l127P676R303M853k403k536L63O031K544J296r347
$$ -3815 -5612 -12135 -18748 -19363 -22490 -14814 -5511 -658 -3061 -5597 -5234 797 3341 4637 -4710
17344d710n386k94R920L754k067p296l700R68N621l74r23N009M117o541J007J530
$$ -4710 -10096 -10390 -470 3284 1217 -6079 -9779 -8811 -3190 -3564 -4487 522 4639 -1902 -895 635
17328F35q31Q683K637k066m66k748K307m001p028n052L969M054k072k563j637
$$ 635 -196 8487 11124 9058 8592 5844 8151 4150 -2878 -7930 -3961 93 -1979 -4542 -6179
17313f179M502N938r320m091Q809o064m455O904P611K776m194p092k003M005L726
$$ -6179 -1677 4261 -5059 -9150 -341 -6405 -10860 -3956 3655 6431 2237 -4855 -6858 -2853 873
17298H73k126J075q754m212Q61L249J661M028K98k858k565l239M102M258K471
$$ 873 -1253 -178 -8932 -13144 -12283 -9034 -7373 -3345 -3047 -5905 -8470 -11709 -7607 -3349 -878
17283h78J299K24L790p051q981J706K469M026K53q040J18j081l143K891j061J496
$$ -878 421 645 4435 -2616 -11597 -9891 -7422 -3396 -3143 -11183 -11065 -12146 -15289 -12398 -13459 -11963
17267a1963K704J659J780K476O67j195L256L196K50K730j101o651Q72j740O564
$$ -11963 -9259 -7600 -5820 -3344 -2677 -3872 -616 2580 2830 5560 4459 -2192 -1320 -3060 3504
17252C504K037k113l041J974k663k196j549J327L495J419j122J167L08M564j837
$$ 3504 5541 3428 387 2361 -302 -2498 -4047 -2720 775 2194 1072 2239 2547 7111 5274
17237E274K695m521r618q729K430L068K168M224M80k297m295J218k453j969R48
$$ 5274 7969 3448 -6170 -14899 -12469 -9401 -7233 -3009 -2529 -4826 -9121 -7903 -10356 -12325 -11377
17222a1377L574n84j805n42n835L236J910K051M143N787j029n113j0753M803L822
$$ -11377 -7803 -8387 -10192 -10734 -16569 -13333 -11423 -9372 -5229 558 -471 -5584 -16337 -11534 -7712
17207g712K716m55K923O795j0515r024M39P52P053K824k287j837K029K621L20
$$ -7712 -4996 -5451 -2528 4267 -6248 -15272 -14833 -14081 -7028 -4204 -6491 -8328 -6299 -3678 -3358
17192c358l498J348R119L246r64j349j015K087k982j1464q718j909O959M728k215
$$ -3358 -6856 -5508 3611 6857 5893 4544 3529 5616 2634 -8830 -17548 -19457 -12498 -7770 -9985
17177i985k912J268J994K223O16L793O479n033n849N639L441j892j0740j014K24
$$ -9985 -12897 -11629 -9635 -7412 -6796 -3003 3476 -1557 -7406 -1767 1674 -218 -10958 -11972 -11748
17162a1748L605O10K292L285M545m360o968L769M933L798j402j0240o918R36R204
$$ -11748 -8143 -7533 -5241 -1956 2589 -1771 -8739 -4970 -37 3761 2359 -7881 -14799 -13863 -4659
17147d659L381N20n596m577J151J350J230J115N992k205q872P615M162J116Q33
$$ -4659 -1278 -758 -6354 -10931 -9780 -8430 -7200 -6085 -93 -2298 -11170 -3555 607 1723 2556
17132B556r162k048k974N009R286J024m316l363k207J552M731m238k744o76M52
$$ 2556 -6606 -8654 -11628 -6619 2667 3691 -625 -3988 -6195 -4643 88 -4150 -6894 -7570 -7118
17117g118k714o397l222J1860P077n227q288L822M683J987J473O5R48l7j913N988
$$ -7118 -9832 -16229 -19451 -7591 -514 -5741 -14029 -10207 -5524 -3537 -2064 -1999 -1051 -1088 -3001 2987
17101B987J009J536j957k571J968l402K094r34j2861j0372P4J7026K157k557k130
$$ 2987 3996 5532 3575 1004 2972 -430 1664 730 -12131 -22503 -22429 -5403 -3246 -5803 -7933
17086g933L78K185M106K871l390k429j147P570Q977q46k45p30n164j0353n23J970
$$ -7933 -7555 -5370 -1264 1607 -1783 -4212 -5359 2211 11188 10342 10097 9367 4203 -6150 -6673 -4703
17070d703O634M319k219J012N30o857r050N3M742m013k101j276P907Q756J778
$$ -4703 1931 6250 4031 5043 5573 -1284 -10334 -10281 -5539 -9552 -11653 -12929 -5022 3734 5512
17055E512n326j2560j911P09N693j320k640J310J0615M488o42J192l9J685m116
$$ 5512 186 -12374 -14285 -13576 -7883 -9203 -11843 -10533 82 4570 3928 5120 5081 6766 2650
17040B650L325L352j523p17n325p778o00k125lJ090K846r6l614K698m583j922
$$ 2650 5975 9327 7804 7087 1762 -6016 -6616 -8741 -8744 -7654 -4808 -4904 -8518 -5820 -10403 -12325
17024a2325k134n323L353J647O169Q536J230p89R98k231K865N067l740q251M974
$$ -12325 -14459 -19782 -16429 -14782 -8613 -77 1153 364 1362 -869 1996 7063 3323 -4928 46
17009D6l65l481O624O633M958L500N634J168R971J2846N357M634N026L945L560
$$ 46 -319 -3800 2824 9457 14415 17915 23549 24717 34688 47534 52891 57525 62551 66496 70056
16994G0056L282K769M558M431j140q412j3637j2293p502J357P053P538J2255Q352
$$ 70056 73338 76107 80665 85096 83956 75544 61907 49614 42112 43469 50522 58060 70315 78667
16980G8667L655L011o432l933L133M058k666r239j0413j5620r782l911o26k180
$$ 78667 82322 85333 78901 74968 78101 82159 79493 70254 59841 44221 34439 30528 29902 27722
16966B7722m181J979R83m512r418j056k686K751l07J135m052n013m63M394N582
$$ 27722 23541 25520 26503 21991 12573 11517 8831 11582 11275 12410 8358 3345 2882 7276 12858
16951A2858L648l564m141J836j321L93M503j70M196J233l514m612n598m379l754
$$ 12858 16506 12942 8801 10637 9316 9709 14212 14042 18238 19471 15957 11345 5747 1368 -2386
16936b386R3K181L122K461J335M60l74J947M921M442m098q617k483M21o872o100
$$ -2386 -2293 -112 3010 5471 6806 7266 6892 8839 13760 18202 14104 5487 3004 3425 -3447 -9547
16920i547j577K533l021K754K589N094J528O84m43o143l804J084J74j077L766
$$ -9547 -11124 -8591 -11612 -8858 -6269 -1175 353 1037 594 -5549 -9353 -8269 -8095 -9172 -5406
16905e406Q37J488J550m521J420l922M943M212J713q19l146J269M265P27n674
$$ -5406 -4569 -3081 -1531 -6052 -4632 -8554 -3611 601 2314 1495 -1651 -382 3883 4610 -1064
16890a064J638n23o353P45J908K678k855L118j344k158O169J52q020l148N899
$$ -1064 574 51 -6302 -5557 -3649 -971 -3826 -708 -2052 -4210 1959 2111 -5909 -9057 -3158
16875c158N707J28q717l345q90J29q7J131L690K335L14k852l124r04P364N735
$$ -3158 2549 2677 -6040 -9385 -10275 -10146 -10233 -9102 -5412 -3077 -2763 -5615 -8739 -9643 -2279 3456
16859C456j987Q8k789j773j025n870m549R94Q662O985M372N070j808r951k343
$$ 3456 1469 1557 -1232 -3005 -4030 -9900 -14449 -13455 -4793 2192 6564 11634 9826 -125 -2468
16844b468Q17l24P74J204k805j368j927p172m022Q427L679K664k80r53L433K898
$$ -2468 -1651 -1975 -1201 3 -2802 -4170 -6097 -13269 -17291 -8864 -5185 -2521 -2801 -3754 -321 2577
16828B577j713K462n161j173J328L483k753o530M435j133l404k029J700J577n209
$$ 2577 864 3326 -1835 -3008 -1680 1803 -950 -7480 -3045 -4178 -7582 -9611 -7911 -6334 -11543
16813a1543m24K609N535j142L366M6m105L617M509K130n520j558R583l824l98
$$ -11543 -11967 -9358 -3823 -4965 -1599 -1553 -5658 -2041 2468 4598 -922 -2480 7103 3279 2881
16798B881K788j1254m312P032Q358n833j1249n552M152R456M735N677N52l898
$$ 2881 5669 -5585 -9897 -2865 5493 -340 -11589 -17141 -12989 -3533 1202 6879 7431 3533
16784C533p419l231P843N345j444m188j94J732n923n022P780K865J497P39p107
$$ 3533 -3886 -7117 726 6071 4627 439 245 1977 -3946 -8968 -1188 1677 3174 3913 -3194
16769c194k821K397j04M199J9n908L273J689n298k5J315m030M851N722l104J942
$$ -3194 -6015 -3618 -3722 477 496 -5412 -2139 -450 -5748 -5773 -4458 -8488 -3637 2085 -1019 923
16753I23J94j3068l34L717k025j920N951N511N213l094J458k233P11K968J66k590
$$ 923 1117 -11951 -12285 -8568 -10593 -12513 -6562 -1051 4162 1068 2526 293 1004 3972 4138 1548
16737A548J864j234n705j588L899j17p092N98L168P205K656K426m947q549n693
$$ 1548 3412 2178 -3527 -5115 -1216 -1333 -8425 -7827 -4659 2546 5202 7628 2681 -5868 -11561
16722a1561k79K688M227M189l875p161N065O477l594q266j339K851Q042J479l673
$$ -11561 -11840 -9152 -4925 -736 -4611 -11772 -6707 -230 -3824 -12090 -13429 -10578 -2536 -1057 -4730
16707d730p189J752Q723M577n135K541k462P70m96j261Q8K597O159K36n910r067
$$ -4730 -11919 -10167 -1444 3133 -2002 539 -1923 -1153 -1649 -2910 -2822 -225 5934 6170 260 -8807
16691h807K855m050j330P453k474q985J778K104Q134L306k294O004J0303J1022
$$ -8807 -5952 -10002 -11332 -3879 -6353 -15338 -13560 -11456 -3322 -16 -2310 3694 13997 25019
16677B5019J5516J7082R769K437p575n459M459N708J2899K4901J1565m732k1646
$$ 25019 40535 57617 67386 69823 62248 56789 61248 66956 79855 104756 116321 111589 89943
16664H9943k8095j3700k270L584Q720R693j227j1260j2348o427j0192j0766j0658
$$ 89943 61848 48148 45878 49462 58182 67875 66648 55388 43040 36613 26421 15655 4997
16651D997M566K697J338J88K117K994j71L256m045q612P20J411l570n109k945
$$ 4997 9563 12260 13598 13786 15903 18897 18726 21982 17937 9325 10045 11456 7886 2777 -168
16636a68n73J872P944K836m322L040P342n625l311L506l898o786K972p787p795
$$ -168 -741 1131 9075 11911 7589 10629 17971 12346 9035 12541 8643 1857 4829 -2958 -10753
16621a0753j241Q71M841j186J506L420P917L633J042j59r520K915J567O77J045
$$ -10753 -11994 -11123 -6282 -7468 -5962 -2542 5375 9008 10050 9891 371 3286 4853 5530 6575
16606F575m479n465M699J162j538J42P077m17j0677q70J217J885j195M042M120
$$ 6575 2096 -3369 1330 2492 954 1096 8173 7756 -2921 -3791 -2574 -689 -1884 2158 6278
16591F278m885j450J108m779j601R012L584L877J819q872r6L800m969l56j769
$$ 6278 1393 -57 1051 -3728 -5329 3683 7267 11144 12963 4091 3995 7795 2826 2470 701
16576G01k05n044k407O380P678m794k522j098Q36j274k999k151k261q50P136Q475
$$ 701 496 -4548 -6955 -575 7103 2309 -213 -1311 -475 -1749 -4748 -6899 -9160 -10010 -2874 5601
16560E601L039k275j216K763k658k910j983l90J169l429j495K476M28M75q02n567
$$ 5601 8640 6365 5149 7912 5254 2344 361 -29 1140 -2289 -3784 -1308 -880 -405 -1207 -6774
16544f774m631N315N301P581J914L67j902m899l445j327Q61k010k452l911o51
$$ -6774 -11405 -6090 -789 6792 8706 9073 7171 2272 -1173 -2500 -1639 -3649 -6101 -10012 -10663
16529a0663Q95R75K712J0358J981n327r047r772P118L147L707K332p88J299N514
$$ -10663 -9768 -8793 -6081 4277 6258 931 -8116 -17888 -10770 -7623 -3916 -1584 -2372 -1073 4441
16514D441p437m602o351J380K120l316Q489Q294k135l898m546l530Q690J90l003
$$ 4441 -2996 -7598 -13949 -12569 -10449 -13765 -5276 3018 883 -3015 -7561 -11091 -2401 -2211 -5214
16499e214k366M203l691k189J840J660o290o39O495P884N196j012m728J393m801
$$ -5214 -7580 -3377 -7068 -9257 -7417 -5757 -12047 -12686 -6191 1693 6889 5877 1149 2542 -2259
16484b259m420K361K811P988L171o192q209O186M133m820J493m238l074J511O226
$$ -2259 -6679 -4318 -1507 6481 9652 3460 -4749 1437 5570 750 2243 -1995 -5069 -3558 2668
16469B668J255J559L546k609J252L838n009o514k623l799N104L019n721l49K753
$$ 2668 3923 5482 9028 6419 7671 11509 6500 -14 -2637 -6436 -1332 1687 -4034 -4383 -1630
16454a630O719o285k538J309P40N846M517J280N976l521l793r16j665J651J184
$$ -1630 5089 -1196 -3734 -2425 -1685 4161 8678 9958 15934 12413 8620 7704 6039 7690 8874
16439H874j1903o902l251o864J4762Q429l987K018M564M366J087l969q889R33
$$ 8874 -3029 -9931 -13182 -20046 -5284 3145 -842 1176 5740 10106 11193 7224 -1665 -732
16425g32j113L532L263l92J148n82m500L486O015M118k246k118j999K803k094
$$ -732 -1845 1687 4950 4558 5706 5124 624 4110 10125 14243 11997 9879 7880 10683 8589
16410H589r298p818l343N240N172j364k882o729K084k459p98N139N872N346k54
$$ 8589 -709 -8527 -11870 -6630 -1458 -2822 -5704 -12433 -10349 -12808 -13606 -8467 -2595 2751 2497
16395B497m860K565k541j99M141N913L731M075N247j490k609j172r215m401J118
$$ 2497 -2363 202 -2339 -2538 1603 7516 11247 15322 20569 19079 16470 15298 6083 1682 2800
16380B800K485J298m14m352K294M242l317j0402o583K997L838J144L58O823m765
$$ 2800 5285 6583 6169 1817 4111 8353 5036 -5366 -11949 -8952 -5114 -3970 -3612 3211 -1554
16365a554j648O534p171Q24N118K501l62P798p581p651M329L535n950j125j724
$$ -1554 -3202 3332 -3839 -3015 2103 4604 4242 12040 4459 -3192 1137 4672 -1278 -2403 -4127
16350d127K302L193M252P061m930M811N944O66k103K949q275j488N323r44j365
$$ -4127 -1825 1368 5620 12681 7751 12562 18506 19172 17069 20018 11743 10255 15578 14634 13269
16335A3269l678L426L977O127J3197M406k601L338o77n900n877r823r354k608
$$ 13269 9591 13017 16994 23121 36318 40724 38123 41461 40784 34884 29007 19184 9830 7222
16321G222N747M666J082k544K536Q547M264J208q719j0066l453m51p06O547P576
$$ 7222 12969 17635 18717 16173 18709 27256 31520 32728 24009 13943 10490 10039 9333 15880 23456
16306B3456L513l072q543k146p47P302j208N46R2M535J0190N446O251N545K354
$$ 23456 26969 23897 15354 13208 12461 19763 18555 19101 19193 23728 33918 39364 45615 51160 53514
16291E3514o988p448j1691o172p449K062p229j0475J05K304N521m703L677N400
$$ 53514 46526 39078 27387 21215 13766 15828 8599 -1876 -1771 533 6054 1351 5028 10428
16277A0428P8n814l604o84m197P825L409N30l380k035o912j10O709k973m329J1632
$$ 10428 10506 4692 1088 404 -3793 4032 7441 7971 4591 2556 -4356 -4466 2243 -730 -5059 6573
16261F573J1572q290j0625n434P21N721L585M345l285n243k511j110J886k594
$$ 6573 18145 9855 -770 -6204 -5483 238 3823 8168 4883 -360 -2871 -3981 -2095 -4689
16247d689l592K584M899J98o76l801N434J989O259j940o057j104M724n87J995
$$ -4689 -8281 -5697 -798 -600 -1276 -5077 357 2346 8605 6665 608 -496 4228 3641 5636
16232E636O69j0404J0251O945N70j947j477l279L32M210P742M22q512r854P592
$$ 5636 6305 -4099 6152 13097 13667 11720 10243 6964 7296 11506 19248 19670 11158 1304 8896
16217H896k732r498m168j394m419J936K371n016K62P601M755M071N349m132n328
$$ 8896 6164 -3334 -7502 -8896 -13315 -11379 -9008 -14024 -13762 -6161 -1406 2665 8014 3882 -1446
16202a446j569M216K550k347l878k519l500P895m008n395J774Q98J217p80k47
$$ -1446 -3015 1201 3751 1404 -2474 -4993 -8493 -598 -4606 -10001 -8227 -7329 -6112 -6892 -7139
16187g139Q07L429n22m627j788M134J829j352L163J064J394j872j289k050M630
$$ -7139 -6332 -2903 -3425 -8052 -9840 -5706 -3877 -5229 -2066 -1002 392 -1480 -2769 -4819 -189
16172a89J76J764N572j225q077j561M298j992K81n059M44K470k869q3R34J1578
$$ -189 -13 1751 7323 6098 -1979 -3540 758 -1234 -953 -6012 -5568 -3098 -5967 -6050 -5116 6462
16156F462Q054l464l756L864Q824M991m182n89n596n348q23J333j52J028J765
$$ 6462 14516 11052 7296 11160 19984 24975 20793 20204 14608 9260 8437 9770 9618 10646 12411
16141A2411q874k820Q07K848L832P90P316l230j509O430P070j496L032N87o817
$$ 12411 3537 717 1524 4372 8204 8994 16310 13080 11571 18001 25071 23575 26607 27194 20377
16126B0377l237m986p268J047L89k374J25j411J121p888o435k192M192P263n99
$$ 20377 17140 12154 4886 5933 6322 3948 4073 2662 3783 -4105 -10540 -12732 -8540 -1277 -1876
16111a876j59l399N944N06j521M87j66R54K380j489j818M461N868n917k951J362
$$ -1876 -2035 -5434 510 1016 -505 -18 -184 770 3150 1661 -157 4304 10172 4255 1304 2666
16095B666L256p690j990O74N15K835O14J407j046L855KK764P874k310n850J652
$$ 2666 5922 -1768 -3758 -3084 -2569 266 880 2287 1241 5096 5098 7862 15736 13426 7576 9228
16079I228Q07m692n443l538k497K060o346j359n003N093J0841K284M705P497N92
$$ 9228 10035 5343 -100 -3638 -6135 -4075 -10421 -11780 -16783 -11690 -849 1435 6140 13637 14229
16064A4229j0209m452M257L300k27j312n821j817K142P034O042p589p552M536
$$ 14229 4020 -432 3825 7125 6898 5586 -235 -2052 90 7124 13166 5577 -1975 2561
16050B561N379L481J069r039k125M045K784M489o381p756K825L678r814k768j845
$$ 2561 7940 11421 12490 3451 1326 5371 8155 12644 6263 -1493 1332 5010 -4804 -7572 -9417
16035i417M241R20j630m499k780N232j645k008K826R324L949L722j733O23O335
$$ -9417 -5176 -4256 -5886 -10385 -13165 -7933 -9578 -11586 -8760 564 4513 8235 6502 7125 13460
16020A3460j616k606J502p80K648K814O3l4n028q87M44M2j984l648n065n563J436
$$ 13460 11844 9238 10740 9960 12608 15422 15485 15451 10423 9536 9980 10022 8038 4390 -675 -6238 -4802
16003d802j512R75l315K587J826Q98J2730K765p437m992J2215J979p112l626M369
$$ -4802 -6314 -5339 -8654 -6067 -4241 -3343 9387 12152 4715 -277 11938 13917 6805 3179 7548
15988G548o977o483l824P77j653K119N148O653o294q008N140O700k448L499J027
$$ 7548 571 -5912 -9736 -8959 -10612 -8493 -3345 3308 -2986 -10994 -5854 846 -1602 1897 2924
15973B924k992J3N342k945k480j416L480n580L104N089l135N901K841n29j547
$$ 2924 -68 -55 5287 2342 -138 -1554 1926 -3654 -550 4539 1404 7305 10146 9617 8070
15958H070k434M562P270m71L550Q77l283o333N3P114M86p014j0657J547M585J93
$$ 8070 5636 10198 17468 16997 20547 21424 18141 11808 11861 18975 19461 12447 1790 3337 7922 8115
15942H115K103l029l022L027L958L25n121J314R80q62j52M924k636r55L284k428
$$ 8115 10218 7189 4167 7194 11152 11477 6356 7670 8650 7788 7636 12560 9924 8969 12253 9825
15926I825N11L222o336n571M347N850j287J668O23k296j0201p720K954P307J641
$$ 9825 10336 13558 7222 1651 5998 11848 10561 12229 12852 10556 355 -7365 -4411 2896 4537
15911D537L148r68k104m67n923m445K178L017O970k869l804Q99O074K854l60L166
$$ 4537 7685 6717 4613 4146 -1777 -6222 -4044 -1027 5943 3074 -730 169 6243 9097 8737 11903
15895A1903K140k850l28O039m528r923m040n31M816J0033J12k726R15J551m127
$$ 11903 14043 11193 10865 16904 12376 2453 -1587 -2118 2698 12731 12843 10117 11032 12583 8456
15880H456O868N391j125L660P436N509O176P070J4054N949M630J8545J3646m82
$$ 8456 15324 20715 19590 23250 30686 36195 42371 49441 63495 69444 74074 92619 106265 105783
15866A05783j0313j3664q520n992K4o330o743j2831j1886p968k675m044l785O002
$$ 105783 95470 81806 73286 67294 67318 60988 54245 41414 29528 21560 18885 14841 11056 17058
15852A7058q20m21J950O649L503p448l542K906K005k251j954m665L67l75J976
$$ 17058 16238 15817 17767 24416 27919 20471 16929 19835 21840 19589 17635 12970 13337 12962 14938
15837A4938p121n52L823L775m808m283m06K631L225o275K06j290L41P76L959j753
$$ 14938 7817 7265 11088 14863 10055 5772 5366 7997 11222 4947 5153 3863 4204 4980 8939 7186
15821G186l681k590j171N303j517o797j925N564K779q39p590j977M553R394K684
$$ 7186 3505 915 -256 5047 3530 -3267 -5192 372 3151 2312 -5278 -7255 -2702 6692 9376
15806I376k931m289N497K858P750K472r931m890n58k129p82J48K249J76j515m404
$$ 9376 6445 2156 7653 10511 18261 20733 10802 5912 5354 3225 2443 2591 4840 5016 3501 -903
15790i03l759m46K459N507m199p32P81K783O500K901P036k233l359P7k980j972
$$ -903 -4662 -5108 -2649 2858 -1341 -2073 -1292 1491 7991 10892 17928 15695 12336 12413 9433 7461
15774G461K397K109K074J348L291j351r497N08l446k744k285k327J073j561M274
$$ 7461 9858 11967 14041 15389 18680 17329 7832 8340 4894 2150 -135 -2462 -1389 -2950 1324
15759A324J381K963K046N0n772L351J233K667o4j479K260J424o235J277k90N83
$$ 1324 2705 5668 7714 7764 1992 5343 6576 9243 9179 7700 9960 11384 5149 6426 6136 6719
15743F719l957m045K747K285j055M644o754l383n19M022M576O692k484m086m56
$$ 6719 2762 -1283 1464 3749 2694 7338 584 -2799 -3318 704 5280 11972 9488 5402 4946
15728D946P74J290J219l599q17l004L23j688K208O95j614k774k248l995j549l817
$$ 4946 5720 7010 8229 4630 3813 809 1132 -556 1652 2347 733 -2041 -4289 -8284 -9833 -13650
15712a3650O541J3624N442q562q303K434M682l123k536L685J490j064M035L94
$$ -13650 -7109 6515 11957 3395 -4908 -2474 2208 -915 -3451 234 1724 660 4695 5089
15698E089R95O435J858j0074j0604N992j135k262M128O12k145R77k758Q84k292
$$ 5089 6084 12519 14377 4303 -6301 -309 -1444 -3706 422 1034 -1111 -134 -2892 -2008 -4300
15683d300K655l531j279Q589q39k78L202l496O381O200J383k358q828p684O6R731
$$ -4300 -1645 -5176 -6455 2134 1295 1017 4219 723 7104 13304 14687 12329 3501 -4183 -4117 5614
15667E614R381l255k727j089O471l329L401m046l863Q62J938P813O562j555j2657
$$ 5614 14995 11740 9013 7924 14395 11066 14467 10421 6558 7420 9358 17171 23733 22178 9521
15652I521p312k149L31j03n044j127r05J645J0123J0898J385K41p018m273k255
$$ 9521 2209 60 391 288 -4756 -5883 -6788 -5143 4980 15878 17263 17504 10486 6213 3958
15637C958K395K236Q25K863J953q856K042k38o38Q89l047k341j506R99N958L099
$$ 3958 6353 8589 9414 12277 14230 5374 7416 7178 6540 7429 4382 2041 535 1534 7492 10591
15621A0591j440l263l909K060R5O897Q33j2266k150K621k103j48Nl30k885K605
$$ 10591 9151 5888 1979 4039 4134 11031 11864 -402 -2552 69 -2034 -2182 -2177 -2507 -5392 -2787
15605b787J212M14l7q538l29P593Q048J042q38J127J622k267j301J115k485M443
$$ -2787 -1575 -1161 -1198 -9736 -10065 -2472 5576 6618 5780 6907 8529 6262 4961 6076 3591 8034
15589H034J1272K440n935n18j31m666p481m061L68M999n700J27N1j459K910L487
$$ 8034 19306 21746 15811 15293 15162 10496 3015 -1046 -678 4321 -1379 -1252 -1201 -2660 250 3737
15573C737m947j680k324K733n447o683P637J0182m61l01o618k066J198K218L015
$$ 3737 -1210 -2890 -5214 -2481 -7928 -14611 -6974 3208 2747 2446 -4172 -6238 -5040 -2822 193
15558A93J14J907L460l129J084k01m154j274L999R09J385l457L435M377l541o359
$$ 193 307 2214 5674 2545 3629 3428 -726 -2000 1999 2908 4293 836 4271 8648 5107 -1252
15542a252J95k521J1991K37o687k761K786m114n414M185R393J0550P615J0015
$$ -1252 -1057 -3578 8413 8650 1963 -798 1988 -2126 -7540 -3355 6038 16588 24203 34218
15528C4218N649j999n143n932q963q196m5K14m54j0088m528R687P424J914j588
$$ 34218 39867 37868 32725 26793 17830 9634 9589 9803 9349 -739 -5267 4420 11844 13758 12170
15513A2170j3140o490L894J2578J5571L973p387j4916J454j840J429j369o602
$$ 12170 -970 -7460 -3566 9012 24583 28556 21169 6253 7707 5867 7296 5927 -675
15500f75k354P783R518K575m541j2772o97P383J0740o219q406K494L134K872K182
$$ -675 -3029 4754 14272 16847 12306 -466 -1163 6220 16960 10741 2335 4829 7963 10835 13017
15485A3017n779r442j167M660o04O015j750k379N502J0363l396l076k178j05j262
$$ 13017 7238 -2204 -3371 1289 685 6700 4950 2571 8073 18436 15040 11964 9786 9681 8419
15470H419j074l16M25j448q23k365j366k15r55M926O355K034o934Q27M185l339
$$ 8419 7345 7029 7454 6006 5183 2818 1452 1237 282 5208 11563 13597 6663 7490 11675 8336
15454H336M494l323m683p2j363l372j638o7K644K045m028K73M071J561J638L362
$$ 8336 12830 9507 4824 4752 3389 17 -1621 -1688 956 3001 -1027 -754 3317 4878 6516 9878
15438I878m192M40j033j911k282L883L989l551N8m19J231M686k895K263p439r370
$$ 9878 5686 6126 5093 3182 900 4783 8772 5221 5279 4860 6091 10777 7882 10145 2706 -6664
15422f664l175K462O36M770K436n92K74n694M831N944J951n194l195N336O948
$$ -6664 -9839 -7377 -6741 -1971 465 -127 147 -5547 -716 5228 7179 1985 -1210 4126 11074
15407A1074J558j475k613k679R81L057k011O146K450m678o660r21M067M069o550
$$ 11074 12632 11157 8544 5865 6846 9903 7892 14038 16488 11810 5150 4229 8296 12365 5815
15392E815r272N110J26k152Q652m756l832K223M289m54k601L788k03n739l015
$$ 5815 -3457 1653 1779 -373 8279 3523 -309 1914 6203 5749 3148 6936 6733 994 -2021
15377b021O665L667Q66j457m958n909R71p557r12m217j845J1829N947M946K703
$$ -2021 4644 8311 9177 7720 2762 -3147 -2176 -9733 -10645 -14862 -16707 -4878 1069 6015 8718
15362H718K251M960m369o82J472m51n059J355m126o192j5J017k95l142M553j64
$$ 8718 10969 15929 11560 10878 12350 11899 6840 8195 4069 -2123 -2138 -1121 -1416 -4558 -5 -169
15346a69m520J422k027j455P060l761l511k236Q359N870k033k20Q47J937Q873
$$ -169 -4689 -3267 -5294 -6749 311 -3450 -6961 -9197 -838 5032 2999 2779 3626 5563 14436
15331A4436J739m864L4j29l00l50n084R09O78j494R376J997o965l413K064L786
$$ 14436 16175 11311 11345 11216 10916 10566 5482 6391 7069 5575 14951 16948 9983 6570 8634 12420
15315A2420L749k965k384K174j766m066o452p8O584j944l099P37N37L635q35P23
$$ 12420 16169 13204 10820 12994 11228 7162 710 632 7216 5272 2173 2910 3447 7082 6247 6970
15299F970n539k252j211P170M084k650m618p81P381l745k853M612j891n324L31
$$ 6970 1431 -821 -2032 5138 9222 6572 1954 1173 8554 4809 1956 6568 4677 -647 -316
15284c16P94j740o98J914L027r82o18P516Q287l344J13j207m637r23o340J185
$$ -316 478 -1262 -1960 -46 2981 1999 1381 8897 17184 13840 13953 12746 8109 7186 846 2031
15268B031P380j334j005r20N399J104o298o330J51L382o25J226K088P14K588j740
$$ 2031 9411 8077 7072 6152 11551 12655 6357 27 178 3560 2935 4161 6249 6963 9551 7811
15252G811k343M83K933M566P70l933l099l370j856p775k485K101Q135O069k049
$$ 7811 5468 5951 8884 13450 14220 10287 7188 3818 1962 -5813 -8298 -6197 1938 8007 5958
15237E958N537K206J91j0988l81j549m641j775J810L230K730N133N22m401O227
$$ 5958 11495 13701 13892 2904 2523 974 -3667 -5442 -3632 -402 2328 7461 7983 3582 9809
15222I809J818l039L686N968o13j100k35R73j234N682k187q81n03k696p001k644
$$ 9809 11627 8588 12274 18242 17629 16529 16294 17267 16033 21715 19528 18647 18144 15448 8447 5803
15206E803J355l34m173L914L82J040M34n501Q47M327J434j952n22k901O15l753
$$ 5803 7158 6824 2651 6565 6947 7987 8421 2920 3767 8094 9528 7576 7054 4153 4768 1015
15190A015J612j586Q000N159k861k028n673J306P732M83L229K54r615l298K836
$$ 1015 2627 1041 9041 14200 11339 9311 3638 4944 12676 13159 16388 16642 7027 3729 6565
15175F565J461m012K922K192m602l023M188J368L59j330l523o20J596K311M694
$$ 6565 8026 4014 6936 9128 4526 1503 5691 7059 7418 6088 2565 1945 3541 5852 10546
15160A0546m971R04P914O15N59n285j691j032M236r45k296J580m177o809o10l989
$$ 10546 5575 6479 14393 15008 15567 10282 8591 7559 11795 10850 8554 10134 5957 -852 -1462 -5451
15144e451P282J328J416N237j895K587J96m969N63P814L368l910N399P62j976
$$ -5451 1831 3159 4575 9812 7917 10504 10700 5731 6294 14108 17476 13566 18965 19727 17751
15129A7751N243j175O77p420M33J007p216L707M536r68m189j17n072l15J971M869
$$ 17751 22994 21819 22496 15076 15509 16516 9300 13007 17543 16575 12386 12269 7197 6882 8853 13722
15113A3722J15L287l819j827k492L910L612N025M220l109k339o312k643J754k944
$$ 13722 13837 17124 13305 11478 8986 12896 16508 21533 25753 22644 20305 13993 11350 13104 10160
15098A0160O014K994R49j837n69n001P19M167j039n518n74L775J319J1871l251
$$ 10160 16174 19168 20117 18280 17711 12710 13429 17596 16557 11039 10465 14240 15559 27430 24179
15083B4179J763k626m195j364j873l313j641N112L923L186p00j428P28N5j1k343
$$ 24179 25942 23316 19121 17757 15884 12571 10930 16042 19965 23151 22451 21023 21751 21806 21795 19452
15067A9452j402l655O248M576K192k360q041K819P524k994n345n318l510j649
$$ 19452 18050 14395 20643 25219 27411 25051 17010 19829 27353 24359 19014 13696 10186 8537
15053H537m052j401o121J296Q968K260o734M52j761l310m75n003L502J1147J1654
$$ 8537 4485 3084 -3037 -1741 7227 9487 2753 3205 1444 -1866 -2341 -7344 -3842 7305 18959
15038A8959L313k555p378p355J395M829M449m0r295N750L960J88K04K518M484
$$ 18959 22272 19717 12339 4984 6379 11208 15657 15617 6322 12072 16032 16220 16424 18942 23426
15023B3426K68j1462k106J097N5N008n014j325j743J419r59m596j842O515O633
$$ 23426 23694 12232 10126 11223 11278 16286 11272 9947 8204 9623 8664 4068 2226 8741 15374
15008A5374l646l653j467K111k584M517N549K540L71n766N52J0860Q216m59r387
$$ 15374 11728 8075 6608 8719 6135 10652 16201 18741 19112 13346 13898 24758 32974 32515 23128
14993B3128k791J967m79J915n374q195k51O157O170P5m299m378N614O662K944
$$ 23128 20337 22304 21825 23740 18366 10171 9920 16077 22247 22322 18023 13645 19259 25921 28865
14978B8865N959o76J093K889m751O89N64m971k127O985R261J596l636j379J540
$$ 28865 34824 34148 35241 38130 33379 34068 34632 29661 27534 34519 43780 45376 41740 40361 41901
14963D1901J761N008J0993J9072J7537J2591J3242K2481L3500M1829O6257J12244
$$ 41901 43662 48670 59663 78735 96272 108863 122105 144586 178086 219915 286172 398416
14951C98416J94466L35674M58399L23743P9135k99084n02557l40410j89359r8375
$$ 398416 592882 928556 1386955 1710698 1789833 1490749 988192 647782 458423 360048
14941C60048o2550m1930k9482j6182r467j2035j9300j4582p223r603q541J894
$$ 360048 297498 255568 226086 209904 200437 188402 169102 154520 147297 137694 129153 131047
14929A31047k1m232j3267q726l334J1064l491j0400m222l115p612r168n878J88
$$ 131047 131026 126794 113527 104801 101467 112531 109040 98640 94418 91303 83691 74523 68645 68833
14915F8833p81M493Q25k737L905j506k32m131l555K286n169j132N529N4q596r392
$$ 68833 68052 72545 73370 70633 74538 73032 72800 68669 65114 67400 62231 61099 66628 66682 58086 48694
14899D8694K745K581l28p244k429K077n167n095J380M24k68P849j521o041k636
$$ 48694 51439 54020 53692 46448 44019 46096 40929 35834 37214 37638 37370 45219 43698 37657 35021
14884C5021L617O182N095R39q984p745N537j485k432q01o324L519N793L196N859
$$ 35021 38638 44820 49915 50854 41870 34125 39662 38177 35745 34944 28620 32139 37932 41128 46987
14869D6987n05J349J075m80J868k872l309K21O024P675R958J3851J0362L198Q54
$$ 46987 46482 47831 48906 48426 50294 47422 44113 44334 50358 58033 67991 81842 92204 95402 96256
14854I6256j0495j6765j5862Q13j647l920N978O312l138j191P005J4229K0848
$$ 96256 85761 68996 53134 53947 52300 48380 54358 60670 57532 56341 63346 77575 98423
14841I8423L0305K7114J3786m261k5294l5505k0678j0460q183n362k669m244l428
$$ 98423 128728 155842 169628 165367 140073 104568 83890 73430 65247 59885 57216 52972 49544
14828D9544J260J0158P498O735Q865J4828J0160l010j0613k3484j3202p093p673
$$ 49544 50804 60962 68460 75195 84060 98888 109048 106038 95425 71941 58739 51646 43973
14815D3973k750j287M203p137p12N745k056L401P9k258K29K36n974p86K99m677
$$ 43973 41223 39936 44139 37002 36290 42035 39979 43380 43459 41201 41430 41666 35692 34906 35205 30528
14799C0528n75J179O61O776m8r266l512q17m115j29N258j655n27P553K104m593
$$ 30528 29953 31132 31793 38569 38521 29255 25743 24926 20811 20682 25940 24285 23758 31311 33415 28822
14783B8822k051N81J642O930K13j167N0q419j5126N606O368q05j2262M798P409
$$ 28822 26771 27352 28994 35924 36137 34970 35020 26601 11475 17081 23449 22644 10382 15180 22589
14768B2589n56M260K550l176L743j510k177p085j382j263k156j925K851N643N433
$$ 22589 22033 26293 28843 25667 29410 27900 25723 18638 17256 15993 13837 11912 14763 20406 25839
14753B5839j714m008j336j093J357q91j372K234p083M46Q18P677O61j332l939
$$ 25839 24125 20117 18781 17688 19045 18154 16782 19016 11933 12379 13197 20874 21535 20203 16264
14738A6264K500l315l672P174J78J61N37j019j880q19j0919r881M481K07L502
$$ 16264 18764 15449 11777 18951 19129 19290 19827 18808 16928 16109 5190 -4691 -210 -3 3499
14723C499N675m544J279k014J324O917L1R25K236k884j813K10l24j897n94O890
$$ 3499 9174 4630 5909 3895 5219 12136 12167 13092 15328 12444 10631 10841 10517 8620 8026 14916
14707A4916L735m243m459M828J0284p57j0218n726K738K958L53K43J653O26Q47
$$ 14916 18651 14408 9949 14777 25061 24304 14086 8360 11098 14056 14409 14652 16305 16931 17778
14692A7778L461l085m680L784J535n143J77j278k201L732p30n510l966k424N656
$$ 17778 21239 18154 13474 17258 18793 13650 13827 12549 10348 14080 13350 7840 3874 1450 7106
14677G106K252J885R27N352k80l858K382M525O870rK132n236j0441N69M591o946
$$ 7106 9358 11243 12170 17522 17242 13384 15766 20291 27161 27152 29284 24048 13607 14176 18767 11821
14661A1821K183j178n83l26L739k641l37Q748N2l328J338O065j779n254l353l604
$$ 11821 14004 12826 12243 11917 15656 13015 12678 21426 21478 18150 19488 25553 23774 18520 15167 11563
14645A1563j278O301L768o237k055J011j293J933o47r849M251P358j505J934P2
$$ 11563 10285 16586 20354 14117 12062 13073 11780 13713 13066 3217 7468 14826 13321 15255 15327
14630A5327O404J552R60L205j37o330k565L517O634M72n645k381N933N588J763
$$ 15327 21731 23283 24243 27448 27311 20981 18416 21933 28567 29039 23394 21013 26946 32534 34297
14615C4297j118Q32l518o31L473M432K381M264K821p208r394J240k973k358j804
$$ 34297 33179 34011 30493 29862 33335 37767 40148 44412 47233 40025 30631 31871 28898 26540 24736
14600B4736J024l138j080m95k146P796Q422k498m742m107k110K896O837j110K672
$$ 24736 25760 22622 21542 21047 18901 26697 35119 32621 27879 23772 21662 24558 31395 30285 32957
14585C2957N425k575j736J18N413J529j980n771j827k698j695L191J0954J2504
$$ 32957 38382 35807 34071 34189 39602 41131 39151 33380 31553 28855 27160 30351 41305 53809
14571E3809l802l697j456R05R49K597o797q245q154m481O505K210j854k325q233
$$ 53809 50007 46310 44854 45759 46708 49305 42508 34263 26109 21628 28133 30343 28489 26164 17931
14556A7931L498M096J757n136r182J325N053Q502R611L372Q512J3j024N228M854
$$ 17931 21429 25525 27282 22146 12964 14289 19342 27844 37455 40827 49339 49352 48328 53556 58410
14541E8410m768k883p618o989k056J733j826L977J93M757K028M398N585k860o362
$$ 58410 53642 50759 43141 36152 34096 35829 34003 37980 38173 42930 44958 49356 54941 52081 45719
14526D5719n453o03L232o105n594j666J706l626n7R65N465J0934J962r235q604
$$ 45719 40266 39663 42895 36790 31196 29530 31236 27610 27553 28518 33983 44917 46879 37644 29040
14511B9040K616J836P228O654j350m371k433O020J166k33j2658p752N90M499k540
$$ 29040 31656 33492 40720 47374 46024 41653 39220 45240 46406 46173 33515 25763 26353 30852 28312
14496B8312q629m203R27N040K454N923J860K202M873m997J455n905r174j141l618
$$ 28312 19683 15480 16407 21447 23901 29824 31684 33886 38759 33762 35217 29312 20138 18997 15379
14481A5379J436K231K45L692L204J902m211n171r39J511N857l246j697J981K602
$$ 15379 16815 19046 19291 22983 26187 28089 23878 18707 17768 19279 25136 21890 20193 22174 24776
14466B4776j253j368L14N370P393L649o558j0361n374R386Q513j487k550k007
$$ 24776 23523 22155 22469 27839 35232 38881 32323 21962 16588 25974 34487 33000 30450 28443
14452B8443n649J442J06j847o513l488M451P184o752j935j191n13K634j495l935
$$ 28443 22794 24236 24342 22495 15982 12494 16945 24129 17377 15442 14251 13738 16372 14877 10942
14437A0942M913K840L970J457J794l579k113n955P290j817j1000m096L548M655
$$ 10942 15855 18695 22665 24122 25916 22337 20224 14269 21559 19742 8742 4646 8194 12849
14423A2849K960M593m833o700N293J907J981j630j967L972M658k885k429O15J890
$$ 12849 15809 20402 15569 8869 14162 16069 18050 16420 14453 18425 23083 20198 17769 18384 20274
14408B0274K578O552M661J674j2587q510K493M800K554m24M696l838K41j367l09
$$ 20274 22852 29404 34065 35739 23152 14642 17135 21935 24489 24065 28761 24923 25164 23797 23488
14393B3488l390M691K061M156L513l249K132J485K239M271K092R39M38M42k217
$$ 23488 20098 24789 26850 31006 34519 31270 33402 34887 37126 41397 43489 44428 44866 45308 43091
14378D3091J027j326K385m287k841l906o7M631L126j464o640m489l084m06K030
$$ 43091 44118 42792 45177 40890 38049 34143 34076 38707 41833 40369 33729 29240 26156 25750 27780
14363B7780L172P009K90j000L286K100J421k455N868L071o10Q92R45l29N10n836
$$ 27780 30952 37961 38251 37251 40537 42637 44058 41603 47471 50542 49932 50824 51769 51440 51950 46114
14347D6114m689r9N344P204m85K850N843n584M531N815J440K625O24N77P676L159
$$ 46114 41425 41326 46670 53874 53389 56239 62082 56498 61029 66844 68284 70909 71533 72110 79786 82945
14331H2945J0797J9810J6735N561r484j1345r672n675o069N300J5460J8406K1156
$$ 82945 93742 113552 130287 135848 126364 115019 105347 99672 93603 98903 114363 132769 153925
14318A53925J7048Q111j81j486j0151k2173j7522j0468p907l033O061N162J4933
$$ 153925 170973 179084 178903 177417 167266 145093 127571 117103 109196 106163 112224 117386 132319
14305A32319J6920J4517l162k2802j5828j9453q156l293o229o170r389o912P67
$$ 132319 149239 163756 160594 137792 121964 102511 94355 91062 84833 78663 69274 62362 63129
14292F3129l147j351N507J915L8O064p7r986j006k260M708J363q604p283m820
$$ 63129 59982 58631 64138 66053 66091 72155 72078 62092 61086 58826 63534 64897 56293 49010 44190
14277D4190J945L075L93m716N768J2313k508j2089l771l043k254R03P10k286J60
$$ 44190 46135 49210 49603 44887 50655 62968 60460 48371 44600 41557 39303 40206 40916 38630 38790
14262C8790j812K436J0619J463K580m329k403j689N539J113j228j612J091J026
$$ 38790 36978 39414 50033 51496 54076 49747 47344 45655 51194 52307 51079 49467 50558 51584
14248E1584o428n149o217j42o220m550R70P425P740k238m655J36M662k847N455
$$ 51584 45156 40007 33790 33648 27428 22878 23848 31273 39013 36775 32120 32256 36918 34071 39526
14233C9526M54j3402j0637n875J447Q025R044K117K538Q418o264p508n84K373
$$ 39526 39980 26578 15941 10066 11513 19538 28582 30699 33237 41655 35391 27883 27299 29672
14219B9672o45J097j202l344m873K352K632K360J091k205k801N74M746L214N911
$$ 29672 29027 30124 28922 25578 20705 23057 25689 28049 29140 26935 24134 24708 29454 32668 38579
14204C8579k575n383K975j429j177J721m576k571k230j226j200J919L949N458
$$ 38579 36004 30621 33596 32167 30990 32711 28135 25564 23334 22108 20908 22827 26776 32234
14190C2234l781K43l748p480R37L451k533N70N330j301K564j448l245k935j831
$$ 32234 28453 28696 24948 17468 18405 21856 19323 19893 25223 23922 26486 25038 21793 18858 17027
14175A7027L121J3224R078j728l906l812l149k130l99R406n12j2344r74O884o528
$$ 17027 20148 33372 42450 40722 36816 33004 29855 27725 27326 36732 36220 23876 22902 29786 23258
14160B3258l109N517j359q513j975O9J2446N655K881n491J83r90L283J425q13
$$ 23258 20149 25666 24307 15794 13819 13888 26334 31989 34870 29379 29562 28572 31855 33280 32467
14145C2467q219L263O349p3j865p34M06Q384L462o66l72M684k585n541n975k06
$$ 32467 24248 27511 33860 33787 31922 31188 31594 39978 43440 42774 42402 47086 44501 38960 32985 32779
14129C2779j838l34N065O903q248o649L955P8k576l45P65P098j505l808M107L726
$$ 32779 30941 30607 35672 42575 34327 27678 31633 31711 29135 28790 29555 36653 35148 31340 35447 39173
14113C9173L40o326r267k463K508L924Q212J8q633o436L956o33Q726K38K874J060
$$ 39173 39513 33187 23920 21457 23965 27889 36101 36119 27486 21050 25006 24373 33099 33337 36211 37271
14097C7271j198K217k181j666n412L665n12QN727l992p331J951K332o37N514j356
$$ 37271 36073 38290 36109 34443 29031 32696 32184 32192 37919 33927 26596 28547 30879 30242 35756 34400
14081C4400m635J750N25r56k108P195l068k415K421k048j648L356j332J208k806
$$ 34400 29765 31515 32040 31084 28976 36171 33103 30688 33109 31061 29413 32769 31437 32645 29839
14066B9839k271j0m77k880k594P064O775J344n112n689J013k875k710K754O73
$$ 29839 27568 27558 27081 24201 21607 28671 35446 36790 31678 25989 27002 24127 21417 24171 24844
14051B4844M811J674J814K008J466j308m349K70m190k944M749N36l469m319N887
$$ 24844 29655 31329 33143 35151 36617 35309 30960 31230 27040 24096 28845 29381 25912 21593 27480
14036B7480M851J379o52n16j371J0637k536o417o55j717N612L594q886l737P693
$$ 27480 32331 33710 33058 32542 31171 41808 39272 32855 32200 30483 36095 39689 30803 27066 34759
14021C4759M333J274L218L79L500j260l769j157p595o620o82j995M596J3814N763
$$ 34759 39092 40366 43584 43963 47463 46203 42434 41277 33682 27062 26380 24385 28981 42795 48558
14006D8558n970n674l907P62l800M656o6k609j256P814m27O667m55k284M475R03
$$ 48558 42588 36914 33007 33769 29969 34625 34559 31950 30694 38508 38081 44748 44293 42009 46484 47387
13990D7387J271n516j108M817r749q651K657K089J635M438K728m523K094n847
$$ 47387 48658 43142 42034 46851 37102 28451 31108 33197 34832 39270 41998 37475 39569 33722
13976C3722j882N372m53l128k052J660o714K756k522L700R483O595P55K271j810
$$ 33722 31840 37212 36759 33631 31579 33239 26525 29281 26759 30459 39942 46537 47292 49563 47753
13961D7753m774j259M238Q750K095q498l630Q95k63k569J308k890p08J019K19
$$ 47753 42979 41720 45958 54708 56803 48305 44675 45570 45307 42738 44046 41156 40448 41467 41686
13946D1686J470k957j882R86L45k701J99J610m566J757O072P536L501K097o41
$$ 41686 43156 40199 38317 39303 39648 36947 37146 38756 34190 35947 42019 49555 53056 55153 54512
13931E4512K010M32m966m604n052m653l795K572L580K450l83K502k762k813L270
$$ 54512 56522 56954 51988 47384 42332 37679 33884 36456 40036 42486 42103 44605 41843 39030 42300
13916D2300n43Q52j259j063l444L687L613m901J878L102K012k375K792J813J297
$$ 42300 41757 42609 41350 40287 36843 40530 44143 39242 41120 44222 46234 43859 46651 48464 49761
13901D9761q63N522J0156M492K110j300O96n962J347N679J0297J3973J8379K0404
$$ 49761 48898 54420 64576 69068 71178 69878 70574 64612 65959 71638 81935 95908 114287 134691
13887A34691L5102L7292L9995K2713o18n858l499P343j0720k8474l7531l0209
$$ 134691 169793 207085 247080 269793 269175 263317 259818 267161 256441 227967 190436 160227
13875A60227k9263k4867p349r430l436k929n027J099q1n187j505k287R59k264
$$ 160227 130964 106097 98748 89318 85882 82953 77926 79025 78944 73757 72252 69965 70924 68660
13861F8660q074m752m591P621l22j944m457j588K299j448P809K747n327j04l199
$$ 68660 60586 55834 51243 58864 58542 56598 52141 50553 52852 51404 59213 61960 56633 56529 53330
13846E3330M131r14O261l822n711l312j798L063J774l086K425O675j337l551j597
$$ 53330 57461 56547 62808 58986 53275 49963 48165 51228 53002 49916 52341 59016 57679 54128 52531
13831E2531j597j535N60L562j575j693L298J172q256j0563j941M341J55O06P67
$$ 52531 50934 49399 49959 53521 51946 50253 53551 54723 46467 35904 33963 38304 38459 39065 39832
13816C9832J589J670N707J581j623L829K113J413m389o058L79P843O940N49J082
$$ 39832 41421 43091 48798 50379 48756 52585 54698 56111 51722 45664 46043 53886 60826 61375 62457
13801F2457k070l797n639J568M091J310J009p042L248J805j2J580j630o894n483
$$ 62457 60387 56590 50951 52519 56610 57920 58929 51887 55135 56940 56928 58508 56878 49984 44501
13786D4501k97K780J139j703N247J612p573J714L942M135j250k293M080l493j162
$$ 44501 44204 46984 48123 46420 51667 53279 45706 47420 51362 55497 54247 51954 56034 52541 51379
13771E1379O305r73q85K896n367k271n390o337j139L50j338j434O068J115J036
$$ 51379 57684 56711 55826 58722 53355 51084 45694 39357 38218 38568 37230 35796 41864 42979 44015
13756D4015r77j807p878l112n993M483J1539L978j031N152L556J129J506m49M044
$$ 44015 43038 41231 33353 30241 24248 28731 40270 44248 43217 48369 51925 53054 54560 54111 58155
13741E8155k820n534J931L814k36P719P11o710n092o051n773P318O544L707L405
$$ 58155 55335 49801 51732 55546 55310 63029 63740 57030 51938 45887 40114 47432 53976 57683 61088
13726F1088L259R90R456l810j0455R16j811r062K137M927j840k644p382K39M783
$$ 61088 64347 65337 74793 70983 60528 61444 59633 50571 52708 57635 55795 53151 45769 46008 50791
13711E0791J377l437L418J568l434J406N4J041L976N823q73q55q92p433K0J385
$$ 50791 52168 48731 52149 53717 50283 51689 51743 52784 56760 62583 61710 60855 59963 52530 52550 53935
13695E3935K070r79K237k09l465j28N032O558J936m763o178k208o784N020l149
$$ 53935 56005 55026 57263 57054 53589 53461 58493 65051 66987 62224 56046 53838 47054 52074 48925
13680D8925p087O424M152J682J839O847J811O406K164k202n354j2485j739j221
$$ 48925 41838 48262 52414 54096 55935 62782 64593 70999 73163 70961 65607 53122 51383 50162
13666E0162K802R043o89k251m189j1136M027l428l904Q717P864K302m743m41M471
$$ 50162 52964 62007 61318 59067 54878 43742 47769 44341 40437 49154 57018 59320 54577 54136 58607
13651E8607K424J078J838K351r492l502q21N415O711l022p489M969P678k218o374
$$ 58607 61031 62109 63947 66298 56806 53304 52483 57898 64609 61587 54098 59067 66745 64527 58153
13636E8153m482l765K869M913J474O206J358m387j793J297p39L928L499L207n01
$$ 58153 53671 49906 52775 57688 59162 65368 66726 62339 60546 61843 61104 65032 68531 71738 71237
13621G1237k213J52k9J2180J916j017o246j548K20Q502R866l610r034k514q0k946
$$ 71237 69024 69176 69147 81327 83243 82226 75980 74432 74652 83154 93020 89410 80376 77862 77782 74836
13605G4836n08P049P988R095O160l129j0097j192N58N430R56o117N01O842j832
$$ 74836 74328 81377 89365 98460 104620 101491 91394 90202 90760 96190 97146 91029 91530 98372 96540
13590I6540k718j1276o102K848K278k479J952P508l676p174k974n86m016P887
$$ 96540 93822 82546 76444 79292 81570 79091 81043 88551 84875 77701 74727 74141 70125 78012
13576G8012J3812j622K544L053N476j20l706m737K98K343M352L150m157k955O444
$$ 78012 91824 90202 92746 95799 101275 101155 97449 92712 93010 95353 99705 102855 98698 95743 102187
13561A02187M812m042q162K185M311m924m795j998L27P151J608p453o826Q91J20
$$ 102187 106999 102957 94795 96980 101291 96367 91572 89574 89901 97052 98660 91207 84381 85272 85392
13546H5392N892J716M772N677j575k594k289q80n157O251M731L758R99J354k753
$$ 85392 91284 93000 97772 103449 101874 99280 96991 96111 90954 97205 101936 105694 106693 108047 105294
13531A05294m684m48P52P604j919o499R300N406n369j445P565K45l691K086l789
$$ 105294 100610 100162 100914 108518 106599 100100 109400 114806 109437 107992 115557 115802 112111 114197 110408
13516A10408l83l830N718l895n327n933p334K852L856J2012L829j938m93K922
$$ 110408 110025 106195 111913 108018 102691 96758 89424 92276 96132 108144 111973 110035 109542 112464
13502A12464j483j718m051r26J463N145R556M465r818m898n070l439J615J133
$$ 112464 110981 109263 105212 104286 105749 110894 120450 124915 115097 110199 105129 101690 103305 104438
13488A04438M993P266l6n622k079J448P648j0736r989J135l573J32O362L602L980
$$ 104438 109431 116697 116661 111039 108960 110408 118056 107320 97331 98466 94893 95025 101387 104989 108969
13473A08969J040m221m792K756L399K595L997Q09o76j922j528L966m527n324M425
$$ 108969 110009 105788 100996 103752 107151 109746 113743 114552 113876 111954 110426 114392 109865 104541 108966
13458A08966l787k350l172M036K200r17l078k102J134K359N492N307J906n751
$$ 108966 105179 102829 99657 103693 105893 104976 101898 99796 100930 103289 108781 114088 115994 110243
13444A10243K302L930L149l9L316L661L352o07M578l657m134P40N045R429l230
$$ 110243 112545 116475 119624 119585 122901 126562 129914 129307 133885 130228 126094 126834 131879 141308 138078
13429A38078n904p718K27K314J096O821N030J0383M689L671m1n13J098J763J3542
$$ 138078 132174 124456 124683 126997 128093 134914 139944 150327 155016 158687 158646 158133 159231 160994 174536
13414A74536O572L373R794N478J5483L2879N4661Q1635J15126J60221J79556J38081
$$ 174536 181108 184481 194275 199753 215236 248115 302776 384411 499537 659758 839314 977395
13402I77395Q1931J2916k8358o6203j43689j91794j47490r4233n1631k7441j7647
$$ 977395 1059326 1072242 1043884 977681 833992 642198 494708 400475 348844 321403 303756
13391C03756j6154j8178j2163l350l281j0031j4002j2642j1008l925O177l831
$$ 303756 287602 269424 257261 253911 250630 240599 226597 213955 202947 199022 205199 201368
13379B01368k161j5J257o119l296L616L851j779p07m374j1638P21O516Q17j448
$$ 201368 199207 199192 200449 194330 191034 194650 198501 196722 196015 191641 180003 180724 187240 188057 186609
13364A86609m332l929k6L309k374j2051M238Q193N352L989n258R77L324N823J3824
$$ 186609 182277 178348 178322 181631 179257 167206 171444 179637 184989 188978 183720 184697 188021 193844 207668
13349B07668J4279j079j430J6705J7319J9896L0243M4342O0779R7525J42804K01133
$$ 207668 221947 220868 219438 236143 253462 273358 303601 347943 408722 506247 649051 850184
13337H50184K09878J71072R4667R772m3770r8132j88510k19434j74642j16925
$$ 850184 1060062 1231134 1325801 1335573 1291803 1193671 1005161 785727 611085 494160
13327D94160o2361k7547j9799j9393j3690o510j7256j5793j2204r088j2183q940
$$ 494160 431799 404252 384453 365060 351370 344860 327604 311811 299607 290519 278336 269396
13315B69396m964n179r95j697n165j189P246l266j4857n113m651n766m184K832
$$ 269396 264432 259253 258258 256561 251396 250207 257453 254187 239330 234217 229566 223800 219616 222448
13301B22448K256m502k772l07m328j655K130M79j1567o988m715j0951k196L793
$$ 222448 224704 220202 217430 217123 212795 211140 213270 213749 202182 195194 190479 179528 177332 181125
13287A81125l83O804N425L496K105N518N838R91j905M790J73p629J982l203k79
$$ 181125 180742 187546 192971 196467 198572 204090 209928 210919 209014 213804 213977 206348 208330 205127 204848
13272B04848J15l890j3367o919M509p7L672N680j592P77k91O600P511M692Q978
$$ 204848 204963 201073 187706 180787 185296 185219 188891 194571 192979 193756 193465 200065 207576 212268 221246
13257B21246J390K210O235O176j116Q862O66q675r920j1993k351n63J1409K0935
$$ 221246 222636 224846 231081 237257 236141 245003 245669 236994 227074 215081 212730 212167 223576 244511
13243B44511J8758J2800P594K1513L2857M1790M5690L8360J2121j6104l1954l9847
$$ 244511 263269 276069 283663 305176 338033 379823 425513 463873 475994 459890 427936 388089
13231C88089m6493l1261j6999r898r375q439j2886k644l80J274J521q929K934
$$ 388089 341596 310335 293336 283438 274063 265624 252738 250094 249714 250988 252509 243580 246514
13218B46514J1185J1301P968N681J491K347O685J9624K8149L7170M0731K7169
$$ 246514 257699 269000 276968 282649 284140 286487 293172 312796 340945 378115 418846 446015
13206D46015N351j5099k1857l1067l3376k3158j4646j0011k404K005n063Q475
$$ 446015 451366 436267 414410 383343 349967 326809 312163 302152 299748 301753 296690 305165
13194C05165J4764P268J0679O317P696P729R176M063k298r374j1820j162Q85J371
$$ 305165 319929 327197 337876 344193 351889 359618 368794 372857 370559 361185 349365 348203 349088 350459
13180C50459J9184L3785J4141M455J5680m282j6237j7831j2864m847n872o094
$$ 350459 369643 403428 417569 422024 437704 433422 417185 399354 386490 381643 375771 369677
13168C69677n568q62k897L45O65m602j11J3057J1915K898R829J9073K5053K0249
$$ 369677 364109 363247 360350 360695 361360 356758 356647 369704 381619 384517 394346 413419 438472 458721
13154D58721N0751Q7949J53047J94144J58873R0679q107k4041L5518L2102l5567
$$ 458721 509472 597421 750468 944612 1103485 1194164 1186057 1162016 1197534 1229636 1194069
13143A194069j43400j82444j39830q2596l0761j2184Q314K7854M3673P8085J13100
$$ 1194069 1050669 868225 728395 645799 615038 602854 611168 639022 682695 760780 873880
13132H73880J69898J79562J24522M4690l3201J23M7211R323p7375j86757j90585
$$ 873880 1043778 1223340 1347862 1392552 1359351 1359474 1406685 1416008 1338633 1151876 961291
13121I61291j27232q4013o0981m9404l8722l0968k3335j209K0571O834K051K3541
$$ 961291 834059 750046 689065 639661 600939 569971 546636 545427 565998 572832 574883 598424
13109E98424j0655j2633M358k0466k7868r722q379j2258o270n691J919l479m101
$$ 598424 587769 575136 579494 559028 531160 521438 513059 500801 494531 488840 490759 487280 483179
13096D83179j606l112o4K193J44J4771J4914L917M379K776J2844J3341J7150J0429
$$ 483179 481573 478461 478397 480590 480734 495505 510419 514336 518715 521491 534335 547676 564826 575255
13082E75255N243j0465l1970m4120l8337k3244j1298p386M221J3444K0756J0625
$$ 575255 580498 570033 538063 493943 455606 432362 421064 413678 417899 431343 452099 462724
13070D62724J2848J200P409R482J2405K8570L3206L0767K8857L7481O2148P6286
$$ 462724 475572 476772 484181 493663 506068 534638 567844 598611 627468 664949 727097 803383
13058H03383R2434J18852J43485J50249J33336R7235K5396p4663j85804k03978
$$ 803383 895817 1014669 1158154 1308403 1441739 1538974 1564370 1489707 1303903 1099925
13048A099925j45621p3717l3817k3184j1768r327j0680O335P827j122q020K040
$$ 1099925 954304 880587 846770 823586 811818 802491 791811 798146 805973 804851 796831 798871
13036G98871Q209Q460L107R889R267j348j571j262P18M190J0126J4115N234R483
$$ 798871 807080 815540 818647 828536 837803 836455 834884 833622 834340 838530 848656 862771 868005 877488
13022H77488J984j089l647P168K6789M0585K3501j5794l3656l6730l6060l4480
$$ 877488 879472 878383 874736 881904 908693 949278 972779 956985 923329 886599 850539 816059
13010H16059k2503l051J5352J4335J4542J5147J7207O463J1089K0885K2958K0366
$$ 816059 793556 790505 805857 820192 834734 849881 867088 873551 884640 905525 928483 948849
12998I48849J1043J1955K8219M8665O7878Q2270J01150J42012J87835K19929K15193
$$ 948849 959892 971847 1000066 1048731 1116609 1198879 1300029 1442041 1629876 1849805 2064998
12987B064998J92741J14182q881j28058j64031j48536j13374n3140j5661R217
$$ 2064998 2257739 2371921 2363040 2234982 2070951 1922415 1809041 1755901 1740240 1749457
12977A749457J5327Q29o169m262l464K0471M2518M9853O1124O6220P3369O8350
$$ 1749457 1764784 1765613 1759444 1755182 1751718 1772189 1814707 1864560 1925684 1991904 2065273 2133623
12965B133623N8380L4687K8710J4433K6357L9256M8345P1828J06483J39352J61769
$$ 2133623 2192003 2226690 2255400 2269833 2296190 2335446 2383791 2455619 2562102 2701454 2863223
12954B863223J81139K20017K90167M02454N54900O55936O62163O21934N49829
$$ 2863223 3044362 3264379 3554546 3957000 4511900 5167836 5829999 6451933 7001762
12945G001762M99660M60537L54137K80747M33627O95837R82059J364054J921819
$$ 7001762 7501422 7961959 8316096 8596843 9030470 9726307 10708366 12072420 13994239
12936A3994239K647154L641651N145682P639532J1922581J8634957K6213232L2064568
$$ 13994239 16641393 20283044 25428726 33068258 44990839 63625796 89839028 121903596
12928A21903596L7245671L2500897J4507499o818190l4049056m5035902l5508071
$$ 121903596 159149267 191650164 206157663 199339473 165290417 120254515 84746444
12921H4746444k1948942j2954282q052299n355174l752123k771442k135272j712785
$$ 84746444 62797502 49843220 41790921 36435747 32683624 29912182 27776910 26064125
12913B6064125j384497j114125r16076p29963o22432o07119o18667p06182q15021
$$ 26064125 24679628 23565503 22649427 21919464 21297032 20689913 20071246 19365064 18550043
12904A8550043q33187q39125q77081q16588o98308n82710n11558m45494l86067
$$ 18550043 17716856 16877731 16000650 15184062 14485754 13903044 13391486 12945992 12559925
12895A2559925l45159l08553k89391k46558j83571j37433p6530j1256P0819J30610
$$ 12559925 12214766 11906213 11616822 11370264 11186693 11049260 10972730 10961474 11032293 11162903
12885A1162903K29324L95517N68660O54103O21060N69735N12094M54611L72124
$$ 11162903 11392227 11787744 12356404 13010507 13631567 14201302 14713396 15168007 15540131
12876A5540131K31991J84079M25041P95088J166347J665446K383260L284322M513459
$$ 15540131 15772122 15956201 16381242 17176330 18342677 20008123 22391383 25675705 30189164
12867C0189164O414125R458723J4661181K3899902L8305783N2286569N1222632
$$ 30189164 36603289 46062012 60723193 84623095 122928878 175215447 226438079
12860B26438079L0560818J650365l1703263m3069892l8351553l5319837k6772137
$$ 226438079 256998897 258649262 226945999 183876107 145524554 110204717 83432580
12853H3432580j7077189j0633660o949680m868417l615801k824130k283512j877844
$$ 83432580 66355391 55721731 48772051 43903634 40287833 37463703 35180191 33302347
12845C3302347j554115j270336j013625q72538q80578r23954j031402j119281
$$ 33302347 31748232 30477896 29464271 28591733 27711155 26787201 25755799 24636518
12837B4636518j147708j181242j254265j175690j005364q59262p47996o53733
$$ 24636518 23488810 22307568 21053303 19877613 18872249 18012987 17264991 16611258
12829A6611258n79355n19803m83302m59138m48376m20545l88922l54914l02221
$$ 16611258 16031903 15512100 15028798 14569660 14121284 13700739 13311817 12956903 12654682
12820A2654682k56155k28918k15385k15739k20944k31566k36408k38728k46454
$$ 12654682 12398527 12169609 11954224 11738485 11517541 11285975 11049567 10810839 10564385
12811A0564385k46294k22388j97061j72292j50931j14489m8925K840N2068J07771
$$ 10564385 10318091 10095703 9898642 9726350 9575419 9460930 9412005 9414845 9466913 9574684
12801I574684Q2450l1222j44724j85090j35319j67088k08676k59704l56738l52512
$$ 9574684 9657134 9625912 9481188 9296098 9160779 8993691 8785015 8525311 8168573 7816061
12791G816061k63956k18934k17035j82680j61391j46590j28149j22742j20335
$$ 7816061 7552105 7333171 7116136 6933456 6772065 6625475 6497326 6374584 6254249
12782F254249j18058j19517j26636j22709j11964j14057j32858j38820j44895
$$ 6254249 6136191 6016674 5890038 5767329 5655365 5541308 5408450 5269630 5124735
12773E124735j51765j49078j35156j06014q4554n4246m6618o5115p1793p3418
$$ 5124735 4972970 4823892 4688736 4582722 4498168 4443922 4397304 4332189 4260396 4186978
12763D186978o7645o0755o6747o9581n2780m9876n2509o2764m6789m0680m4517
$$ 4186978 4119333 4058578 3991831 3922250 3869470 3819594 3767085 3704321 3657532 3616852 3572335
12752C572335n1709n2438m4272m2418l0743k5881k9588l3487j1918Q754J4929
$$ 3572335 3520626 3468188 3423916 3381498 3350755 3324874 3295286 3261799 3249881 3258635 3273564
12741C273564K1087L4871L8880N4993J20058J75154J67471Q9395p511j12002j37271
$$ 3273564 3294651 3329522 3368402 3423395 3543453 3718607 3886078 3975473 3967962 3855960 3718689
12730C718689o6924k3628j20976j90903j83725j43086r9204p4039n8254m8196
$$ 3718689 3651765 3628137 3507161 3316258 3132533 2989447 2890243 2816204 2757950 2709754
12720B709754m8386m9611m5128l2193l0881k4094k8883k5262j7474k3296k4357
$$ 2709754 2661368 2611757 2566629 2534436 2503555 2479461 2450578 2425316 2407842 2384546 2360189
12709B360189l4723n1323o1939o4736o1744m2904j8208N956P16k9062m0991n7135
$$ 2360189 2325466 2274143 2212204 2147468 2085724 2042820 2024612 2030568 2031284 2002222 1961231 1904096
12697A904096o8763p1769o5779m8079l2465k3494j1436n299n968k296m040K259
$$ 1904096 1835333 1763564 1697785 1649706 1617241 1593747 1582311 1577012 1571044 1568748 1564708 1566967
12685A566967N177J0246J2790K2965L7963N3440P9003J08701J49220J95126K46835
$$ 1566967 1572144 1582390 1595180 1618145 1656108 1709548 1788551 1897252 2046472 2241598 2488433
12674B488433K80959K89926K50170J54424M7911n6015j87951k40305k24050k27138
$$ 2488433 2769392 3059318 3309488 3463912 3511823 3455808 3267857 3027552 2803502 2576364
12664B576364j99819j31939r1887p6258o1282o1855m6024k5546j0625k21p080
$$ 2576364 2376545 2244606 2152719 2076461 2015179 1953324 1907300 1881754 1871129 1870908 1863828
12653A863828r727j4291j3913j7921l1161k7504j2986j6429p028q858n193r518
$$ 1863828 1854101 1839810 1825897 1807976 1776815 1749311 1736325 1719896 1712868 1704010 1698817 1689299
12641A689299j3880j7527k4167k8764k3168q335q942q597n804p444k1011j6329
$$ 1689299 1675419 1657892 1633725 1604961 1581793 1573458 1564516 1555919 1550115 1542671 1521660 1505331
12629A505331j3189q172j2043O213J0548J2822J3344M232M066n80Q9j51j4464
$$ 1505331 1492142 1483970 1471927 1478140 1488688 1501510 1514854 1519086 1523152 1522572 1522661 1522510 1508046
12616A508046l757P048J3836L2981M3399M9387N3714L6859O215Q979K8877N4918
$$ 1508046 1504289 1511337 1525173 1558154 1601553 1650940 1704654 1741513 1747728 1756707 1785584 1840502
12604A840502O3313Q5844J38204J35794J06630Q1009L4363L8329O4946M7517R883
$$ 1840502 1903815 1989659 2127863 2263657 2370287 2451296 2485659 2523988 2588934 2636451 2646334
12593B646334k5608n4155k6431J9675M2862O6845J04143J56969J90497K27051
$$ 2646334 2620726 2566571 2540140 2559815 2602677 2669522 2773665 2930634 3121131 3348182
12583C348182K95780L41114L05705J99188Q2272L3867Q8063J47034J15605J6816
$$ 3348182 3643962 3985076 4290781 4489969 4572241 4606108 4694171 4841205 4956810 4973626
12573D973626k7762O0618J94355K91157L80278M94934O13969Q00139R51813R42745
$$ 4973626 4945864 5006482 5200837 5491994 5872272 6367206 6981175 7781314 8733127 9675872
12563I675872R17373Q70123R85625J415245J968671K493474L043568L674121M550263
$$ 9675872 10593245 11463368 12448993 13864238 15832909 18326383 21369951 25044072 29594335
12554B9594335O041434Q158905J1293374J6664566K6221186M1116584N4539312
$$ 29594335 35635769 43794674 55088048 71752614 97973800 139090384 193629696
12547A93629696N8537083O0535331M4760588K0631937L667106l0198894n0661733
$$ 193629696 252166779 312702110 357462698 378094635 381761741 351562847 300901114
12540C00901114n0311764n6337651m8756779l1844744j9484615j2404045q482939
$$ 300901114 250589350 194251699 145494920 113650176 94165561 81761516 73278577
12533G3278577o287777n053607m331539l816979l407931l056891k667651k263725
$$ 73278577 66990800 61937193 57605654 53788675 50380744 47323853 44656202 42392477
12525D2392477j928570j773075j775488j885064j777101j549505j370160j265177
$$ 42392477 40463907 38690832 36915344 35030280 33253179 31703674 30333514 29068337
12517B9068337j164488j075038r76231q26297o58204n39615n16144n57867o28782
$$ 29068337 27903849 26828811 25852580 25026283 24368079 23828464 23312320 22754453 22125671
12508B2125671o39907n39247m86873n28550o12204o33060n59102m77492m31582
$$ 22125671 21485764 20946517 20459644 19931094 19318890 18685830 18126728 17649236 17217654
12499A7217654m15966m02273l87472m03374l86963l42440k94352k61935k59916
$$ 17217654 16801688 16399415 16011943 15608569 15221606 14879166 14584814 14322879 14062963
12490A4062963k71163k76584k50705k26953k18819k50092k83963k48257j86965
$$ 14062963 13791800 13515216 13264511 13037558 12818739 12568647 12284684 12036427 11849462
12481A1849462j30628r8390q8598r3911j42082j99549k51574k99552l43663l36999
$$ 11849462 11718834 11620444 11531846 11437935 11295853 11096304 10844730 10545178 10201515 9864516
12471I864516l03284k69397k20080j84516j65525j54538j55095j55789j53112
$$ 9864516 9561232 9291835 9071755 8887239 8721714 8567176 8412081 8256292 8103180
12462H103180j58269j52821j49534j53968j46719j37565j34465j17519r6208q5527
$$ 8103180 7944911 7792090 7642556 7488588 7341869 7204304 7069839 6952320 6856112 6770585
12452F770585o9380m6260k2896J6688O9149Q4064N0327j6856q2007j18165j52451
$$ 6770585 6701205 6654945 6632049 6648737 6717886 6801950 6852277 6835421 6753414 6635249 6482798
12441F482798k12200k69289k47898k02433j60818j43112j21619r9916p7317p9388
$$ 6482798 6270598 6001309 5753411 5550978 5390160 5247048 5125429 5025513 4948196 4868808
12431D868808o7101m8034l4207j9787j1134q980Q937M2093P1677Q6959Q8871J14420
$$ 4868808 4801707 4753673 4719466 4699679 4688545 4679565 4688502 4730595 4802272 4889231 4978102 5092522
12419E092522Q8737J8241K6118K7242l8591k9369M7772J6602J0116M5304O904
$$ 5092522 5181259 5199500 5225618 5252860 5214269 5184900 5232672 5249274 5259390 5304694 5311598
12408E311598m6515p9342r8063r9104j01738r7968p7682n0800m7399m4544l8261
$$ 5311598 5265083 5185741 5087678 4988574 4886836 4788868 4711186 4660386 4612987 4568443 4530182
12397D530182l7867l3344k1882k7571l2163m8377m2886m2410m0644l4259j5315
$$ 4530182 4492315 4458971 4437089 4409518 4377355 4328978 4286092 4243682 4203038 4168779 4153464
12386D153464J6874K9178N4208J23685J87919K64114K99588K72116K24060J63509
$$ 4153464 4170338 4199516 4253724 4377409 4565328 4829442 5129030 5401146 5625206 5788715
12376E788715J54393J52852J25605J32148K53787L79098M46807M69934M67968
$$ 5788715 5943108 6095960 6221565 6353713 6607500 6986598 7433405 7903339 8371307
12367H371307M92443N99027Q58877J199773J634051K162449K780396L645330N029985
$$ 8371307 8863750 9462777 10321654 11521427 13155478 15317927 18098323 21743653 26773638
12358B6773638P322303J0896611J5392698K0529983K6700981K9729388K8698642
$$ 26773638 34095941 44992552 60385250 80915233 107616214 137345602 166044244
12351A66044244K5679454J4471744K504289p319680k1118742k7378633k7152993
$$ 166044244 191723698 206195442 208699731 201380051 180261309 152882676 125729683
12344A25729683k6337328k1655921j5070126r881929o662679m675287l439525
$$ 125729683 99392355 77736434 62666308 52784379 46121700 41446413 38006888
12337C8006888k740978k357500k116111j873074j605935j365650j177057j053672
$$ 38006888 35265910 32908410 30792299 28919225 27313290 25947640 24770583 23716911
12329B3716911r76794r35630r05077q55781p84119p19988o64534o26662n93979
$$ 23716911 22740117 21804487 20899410 20043629 19259510 18539522 17874988 17248326 16654347
12320A6654347n47673n11002m68234m27265l92740l49454l14089k59741k10216
$$ 16654347 16106674 15595672 15127438 14700173 14307433 13957979 13643890 13384149 13173933
12311A3173933j63183j14531p1676l9983K0125Q7034J48956J72993J54532J22610
$$ 13173933 13010750 12896219 12824543 12784560 12804685 12891719 13040675 13213668 13368200 13490810
12301A3490810J12055J61678L13489M99900P64356J126154J532571K021743K694848
$$ 13490810 13602865 13764543 14078032 14577932 15342288 16468442 18001013 20022756 22717604
12292B2717604L721409N493489Q537423J3169819J8638730K2739243K4784403
$$ 22717604 26439013 31932502 40469925 53639744 72278474 95017717 119802120
12285A19802120K4194244J7635959R702439K87621j2021543j7538980k0472222
$$ 119802120 143996364 161632323 171334762 171622383 159600840 142061860 121589638
12278A21589638k3010196j9405676j4629389j1078296p839121n409547l803096
$$ 121589638 98579442 79173766 64544377 53466081 45626960 40217413 36414317
12271C6414317k820285k265768j951338j773665j564501j331433j138347j002358
$$ 36414317 33594032 31328264 29376926 27603261 26038760 24707327 23568980 22566622
12263B2566622r24768q83872q54006q07574p54253p11512o68981o19606n79013
$$ 22566622 21641854 20757982 19903976 19096402 18342149 17630637 16961656 16342050 15763037
12254A5763037n33186m98832m60129m21472l98087l84569l69530l47151l23369
$$ 15763037 15229851 14731019 14270890 13849418 13451331 13066762 12697232 12350081 12026712
12245A2026712l08642k78319k52595k31081k10813j97238k02256k08694k21602
$$ 12026712 11718070 11439751 11187156 10956075 10745262 10548024 10345768 10137074 9915472
12236I915472k17021k20349k02320j87459j66344j35799j28090j11492r3655r3946
$$ 9915472 9698451 9478102 9275782 9088323 8921979 8786180 8658090 8546598 8452943 8358997
12226H358997j07018j01090j24546j59526j55616j61871j82410j64584j48461
$$ 8358997 8251979 8150889 8026343 7866817 7711201 7549330 7366920 7202336 7053875
12217G053875j45779j40468j33225j30027j32336j25058j13409j01084r9448r3003
$$ 7053875 6908096 6767628 6634403 6504376 6372040 6246982 6133573 6032489 5933041 5840038
12207E840038r1883j00675r5970r7693r8260r3169j09396j11622j26119j27914
$$ 5840038 5748155 5647480 5551510 5453817 5355557 5262388 5152992 5041370 4915251 4787337
12197D787337j28929j25507j16713j12824r9486q3290o8319o2644n8409n4393
$$ 4787337 4658408 4532901 4416188 4303364 4203878 4120588 4052269 3989625 3931216 3876823
12187C876823o2065o5609o2946o4781n8869o0016n2498m8299n5273n7736n4862
$$ 3876823 3814758 3749149 3686203 3621422 3562553 3502537 3450039 3401740 3346467 3288731 3233869
12176C233869n9327m9296m1985m9873n0429l3720k8194l1570l3861k3682j1214
$$ 3233869 3174542 3125246 3083261 3033388 2982959 2949239 2921045 2889475 2855614 2831932 2820718
12165B820718R916J1237J3903Q268L216J2804Q651k5980l4742l3332n5675q3903
$$ 2820718 2830634 2841871 2855774 2864042 2867258 2880062 2888713 2862733 2827991 2794659 2738984 2655081
12153B655081p1504n8400p3083n1010k9652l8092l9900l6770k9133k5036k9657
$$ 2655081 2583577 2525177 2452094 2401084 2371432 2333340 2293440 2256670 2227537 2202501 2172844
12142B172844l5363l6338k5779k2688k3460k5122l0772k9227k6468l1839m9293
$$ 2172844 2137481 2101143 2075364 2052676 2029216 2004094 1973322 1944095 1917627 1885788 1836495
12131A836495o1592n9379m5919m6852m8423l8854k5291k7827k8792j9533j8037
$$ 1836495 1774903 1715524 1669605 1622753 1574330 1535476 1510185 1482358 1453566 1434033 1415996
12120A415996k5395k3878j5539j3765j7877j3117p649j5083k2580k9180k6206
$$ 1415996 1390601 1366723 1351184 1337419 1319542 1306425 1298776 1283693 1261113 1231933 1205727
12109A205727k7489j5834r219j4958k0343j3366j0645p589m318p862J66J086p258
$$ 1205727 1178238 1162404 1153185 1138227 1117884 1104518 1093873 1086284 1081966 1074104 1074270 1075356 1068098
12096A068098k2238k2537j5632k0354j8578j1072o800j4041j7065N255J9986J7463
$$ 1068098 1045860 1023323 1007691 987337 968759 957687 950887 936846 919781 925036 945022 962485
12084I62485K1278J3680k252k8328m8276n2137m0286k4863j9480j4590k7074k0684
$$ 962485 983763 997443 995191 966863 918587 866450 826164 801301 781821 767231 740157 719473
12072G19473j4174j7810j1563n331p540j6181r988q842j3434j2006p140j0132
$$ 719473 705299 687489 675926 670595 663055 646874 636886 628044 614610 602604 595464 585332
12060E85332j0433q043K021K721j4044j0785r339j5001j1129k790K418j983r367
$$ 585332 574899 566856 568877 571598 557554 546769 537430 522429 511300 508510 510928 508945 499578
12047D99578j4377j6626j6562j5364j5938j0665j1727j7821m463m970M142Q840
$$ 499578 485201 468575 452013 436649 420711 410046 398319 380498 376035 371065 375207 384047
12035C84047M598Q141P121J157o698j3235j5182r247j3334j8045m972m889o597
$$ 384047 388645 396786 403907 405064 398366 385131 369949 360702 347368 329323 324351 319462 312865
12022C12865p048Q0L80j0951k451R500Q416O070P60n448l509l471j393o009r603
$$ 312865 305817 305897 306277 295326 292875 302375 310791 316861 317621 312173 308664 305193 303800 297791 288188
12007B88188q56k176n695q954o681k864N74n630q121m905j57L943o586m803r60
$$ 288188 287332 285156 279461 270507 263826 260962 261536 255906 247785 242880 242723 246666 240080 235277 234317
11992B34317j811k930q449K003L306k063o247l518L81J2626K5543K3153J832m422
$$ 234317 232506 229576 221127 223130 226436 224373 218126 214608 214989 227615 253158 276311 278143 273721
11978B73721j8454l6602k2218j2744j1302n00J0482R649J8476J9216K0059N216
$$ 273721 255267 218665 196447 183703 172401 171901 182383 192032 210508 229724 249783 254999
11966B54999m148R628L697l866J9698M4605O5077J11370J71587J94339J58109
$$ 254999 250851 260479 264176 260310 280008 324613 389690 501060 672647 866986 1025095
11955A025095O6961j8914j3960M6588N1575j2563j34096j81808j37881p3700k8079
$$ 1025095 1092056 1073142 1059182 1105770 1157345 1144782 1010686 828878 690997 617297 589218
11944E89218n387o569p643M509M2954J00794J66255J59786R7416L018m3344Q76
$$ 589218 583831 577262 569619 574128 617082 717876 884131 1043917 1141333 1144351 1101007 1101883
11932A101883L5710o084j03131j84852j68272j02932n1776l1483o640j3199k1250
$$ 1101883 1137593 1131509 1028378 843526 675254 572322 520546 489063 482423 469224 447974
11921D47974k5401l3154l1942j7307j6599j9002j5581j8111j6524m071l464P120
$$ 447974 422573 389419 357477 340170 323571 304569 288988 270877 254353 250282 246818 253938
11909B53938N823Q457m15j709M330J5087K3678K8882M3866O6000J06812J54317
$$ 253938 259761 268218 267803 266094 270424 285511 309189 338071 381937 447937 554749 709066
11897G09066J87559J73953J04370J6017j7432J3158J0994n7922j56135j97727
$$ 709066 896625 1070578 1174948 1190965 1173533 1186691 1197685 1139763 983628 785901
11887G85901j58554j05582n6718m3484k9947j1544j0757j8566o972N892J0157
$$ 785901 627347 521765 465047 421563 391616 380072 369315 350749 343777 349669 359826
11876C59826K3020M1408Q0650J40044J81895J29434K2275j25697j91747j41834
$$ 359826 382846 424254 504904 644948 826843 956277 978552 852855 661108 519274
11866E19274r1607n4215m2522k5442j3874j8469q359p016o311o204l193j990p620
$$ 519274 427667 373452 330930 305488 291614 273145 264786 257770 251459 245255 242062 240072 232452
11853B32452r005j0475q788j1020j4731r708n484j614O344J424n430R853J0326
$$ 232452 223447 212972 204184 193164 178433 168725 163241 161627 167971 169395 163965 173818 184144
11840A84144O902P078M959j00j845J4881L4879M8106Q5797J45420J65056J45388
$$ 184144 191046 198124 203083 202983 201138 216019 250898 299004 384801 530221 695277 840665
11828H40665P7869k156j5448J3484N634n1927j24779j61697j27347p6099m9910
$$ 840665 918534 916378 900930 914414 920048 868121 743342 581645 454298 378199 328289
11817C28289l3892k5865k0204j6210o949j590j3663j1039m942k440q660o407j1838
$$ 328289 294397 268532 248328 232118 225169 223579 209916 198877 193935 191495 182835 176428 164590
11804A64590l440o28o830o461p466j4985p428J850O361K729j932r548j145m513
$$ 164590 161150 160522 153692 147231 139765 124780 117352 119202 125563 128292 126360 116812 115667 111154
11790A11154j1352m475k090K912K550m555L228l261k928j1014k654M46J384j255
$$ 111154 99802 95327 93237 96149 98699 94144 97372 94111 91183 80169 77515 77961 79345 78090
11776G8090K99j617O131J062j238R33m335k907p19J069n126j3597o454L934P245
$$ 78090 78389 76772 82903 83965 82727 83660 79325 76418 75699 76768 71642 58045 51591 55525 62770
11761F2770n78J511K474m475o212k308m660n360J047N896M681K5n334K103J448
$$ 62770 62192 63703 66177 61702 55490 53182 48522 43162 44209 50105 54786 54811 49477 51580 53028
11746E3028K036k941j859N709M720k593q295o664j413J0474n100m427K71k491
$$ 53028 55064 52123 50264 55973 60693 58100 49805 43141 41728 52202 47102 42675 42946 40455
11732D0455n953k559k601K64R11J382k89n859M462j428L497K886r057m796n87
$$ 40455 34502 31943 29342 29606 30517 31899 31610 25751 30213 28785 32282 35168 26111 21315 20728
11717B0728J0147J799n797o044j0512p093J816M432J0625J4015l972k635N645
$$ 20728 30875 32674 26877 20833 10321 3228 5044 9476 20101 34116 30144 27509 33154
11704C3154l809n213j2510j598L285Q683P58n198j414P20M391K491l047m780N265
$$ 33154 29345 24132 11622 10024 13309 21992 22750 17552 16138 16858 21249 23740 20693 15913 21178
11689B1178K596p78J311n524O64k811j026k108n09M375K713j232l824k407L31
$$ 21178 23774 22996 24307 18783 19447 16636 15610 13502 12993 17368 20081 18849 15025 12618 12949
11674A2949P008J889M539R269N83J881l913j756m430o181q373K874Q549R765K354
$$ 12949 19957 21846 26385 35654 36237 38118 34205 32449 28019 21838 13465 16339 24888 34653 37007
11659C7007j73j82j3578j5907P86n760j3308l911O000P576j237J392M684J14L714
$$ 37007 36834 36652 23074 7167 7953 2193 -11115 -15026 -9026 -1450 -2687 -1295 3389 3503 7217
11644G217L187o56j756L72r33j219k563P05L127J926j196L52l866k191m98K488
$$ 7217 10404 9748 7992 8364 7431 6212 3649 4354 7481 9407 8211 8563 4697 2506 2008 4496
11628D496N335O35R34N503J05k916k548j0645m817P594M627k843L967K065k655
$$ 4496 9831 10466 11400 16903 17008 14092 11544 899 -3918 3676 8303 5460 9427 11492 8837
11613H837N37M859m610j523K981m034K164o52r18j775m142L26L039J664j946p01
$$ 8837 9374 14233 9623 8100 11081 7047 9211 8559 7641 5866 1724 2050 5089 6753 4807 4106
11597D106p747m598N081N597R281J766m773j179j527K552q58j365J084o348n847
$$ 4106 -3641 -8239 -3158 2439 11720 13486 8713 7534 6007 8559 7701 6336 7420 1072 -4775
11582d775r62j713M679N156k269l203l234N554K484J512p200j981m361M055J1496
$$ -4775 -5737 -7450 -2771 2385 116 -3087 -6321 -767 1717 3229 -3971 -5952 -10313 -6258 5238
11567E238M652Q40o809n769K63L152K669K298j544J299P115m567o123j013L046
$$ 5238 9890 10730 3921 -1848 -1585 1567 4236 6534 4990 6289 13404 8837 2714 1701 4747
11552D747M487Q444m156m700j87K992L279J608q80n771o839k106J333K732k287
$$ 4747 9234 17678 13522 8822 8635 11627 14906 16514 15634 9863 3024 918 2251 4983 2696
11537B696R32j41L880J834j719l134R93o79p836J043k605j498P801L431r93l488
$$ 2696 3628 3487 7367 9201 7482 4348 5341 4662 -3174 -2131 -4736 -6234 1567 4998 4005 517
11521E17N300M297r86j538m547j475n41m334K268j670K815j894k425l898k878
$$ 517 5817 10114 9128 7590 3043 1568 1027 -3307 -1039 -2709 106 -1788 -4213 -8111 -10989
11506a0989k081L312L745J914l592m488J727P177N868J595m873M912M390k664
$$ -10989 -13070 -9758 -6013 -4099 -7691 -12179 -10452 -3275 2593 4188 -685 4227 8617 5953
11492E953m460j431K329J949M581k143K923n02j420m299j606j860r82L332j88
$$ 5953 1493 62 2391 4340 8921 6778 9701 9199 7779 3480 1874 14 -968 2364 2176
11477B176n78m01m330N62M666O20M922K093n288n080j059O663O03k559m772p68
$$ 2176 1598 1197 -3133 -2571 2095 2715 7637 9730 4442 -638 -1697 4966 5569 3010 -1762 -2530
11461b530k110j798K550j169m059m78K835K272j51n65J767K696o137n564M958
$$ -2530 -4640 -6438 -3888 -5057 -9116 -9594 -6759 -4487 -4638 -5203 -3436 -740 -6877 -12441 -7483
11446g483J818l73l711n283q637M00R178J927K541k947m850J105k612l137K749
$$ -7483 -5665 -6038 -9749 -15032 -23669 -23269 -14091 -12164 -9623 -12570 -17420 -16315 -18927 -22064 -19315
11431a9315r68R93N548r2J276N769j038L361k063k698P36M248n95l058N246N399
$$ -19315 -20283 -19290 -13742 -13834 -12558 -6789 -7827 -4466 -6529 -9227 -8491 -4243 -4838 -7896 -2650 2749
11415B749j601j102n230J550K293K237M740k422r697o965k767M865P012J226J90
$$ 2749 1148 46 -5184 -3634 -1341 896 5636 3214 -6483 -13448 -16215 -11350 -4338 -3112 -2922
11400b922j880J421P226L623N233N329L975j1893r942q225r513P179R305r83M635
$$ -2922 -4802 -3381 3845 7468 12701 18030 22005 10112 170 -8055 -17568 -10389 -1084 -2067 2568
11385B568L845r956p914Q14K468P850N899j144o115p45M35M054m90n052N679O895
$$ 2568 6413 -3543 -11457 -10643 -8175 -325 5574 4430 -1685 -2430 -1995 2059 1569 -3483 2196 9091
11369I091j983p39K214p388m198k773O932K609K390M761K511q519r829l273r01
$$ 9091 7108 6369 8583 1195 -3003 -5776 1156 3765 6155 10916 13427 4908 -4921 -8194 -9095
11354i095n618L0N89M190L711M306k317k103j2842J952Q055N599K510K817K423
$$ -9095 -14713 -14683 -14094 -9904 -6193 -1887 -4204 -6307 -19149 -17197 -9142 -3543 -1033 1784 4207
11339D207M800Q42n276k571R244J280r121k942K078k540k681m354k261O443K979
$$ 4207 9007 9849 4573 2002 11246 12526 3405 463 2541 1 -2680 -7034 -9295 -2852 127
11324A27k672M843J0162N383r291m653l295p08m53K155p241n81L236L23N226j339
$$ 127 -2545 2298 12460 17843 8552 3899 604 -104 -557 1598 -5643 -6224 -2988 -2665 2561 1222
11308A222j163J944j22P00j909J707J174m015l172j7M8r81J228N872O377M894
$$ 1222 59 2003 1881 2581 672 2379 3553 -462 -3634 -3651 -3603 -4584 -3356 2516 8893 13787
11292A3787k937k677m385m7P718n793j0264r65M445p67k811r162J239O745k6l427
$$ 13787 10850 8173 3788 3741 11459 5666 -4598 -5563 -1118 -1885 -4696 -13858 -12619 -5874 -5900 -9327
11276i327P116P254M137k416k593L598O871j160m814j673m136m966J945n826k696
$$ -9327 -2211 5043 9180 6764 4171 7769 14640 13480 8666 6993 2857 -2109 -164 -5990 -8686
11261h686k245K739N632Q77m16l143m808L100O179o076q639P904R214n490p35
$$ -8686 -10931 -8192 -2560 -1683 -2099 -5242 -10050 -6950 -771 -6847 -15486 -7582 1632 -3858 -4593
11246d593K441K608J541k806P21m151R06k058N070M422k006q878k405O77j722
$$ -4593 -2152 456 1997 -809 -88 -4239 -3333 -5391 -321 4101 2095 -6783 -9188 -8511 -10233
11231a0233J143K89m0j095j709j532j218j315P241K563q41j962j296m5M03P01
$$ -10233 -9090 -8801 -8841 -9936 -11645 -13177 -14395 -15710 -8469 -5906 -6747 -8709 -10005 -10050 -9647 -8946
11215h946J544O301M360J980o723k309p705m953j229Q110M306j082p35K802K21
$$ -8946 -7402 -1101 3259 5239 -1484 -3793 -11498 -16451 -17680 -9570 -5264 -6346 -7081 -4279 -4058
11200d058O298j271L928j472p3l80R17j161L108n125k001K548J024N396J545J080
$$ -4058 2240 969 4897 3425 3352 2972 3889 2728 5836 711 -1290 1258 2282 7678 9223 10303
11184A0303k471m623k424m495k543N19n622M613K274k696O030j465J69L106j643
$$ 10303 7832 3209 785 -3710 -6253 -5734 -11356 -6743 -4469 -7165 -1135 -2600 -2431 675 -968
11169i68m633l122J326N517P66J324K917m298J637l07j178M945j147n099k044
$$ -968 -5601 -8723 -7397 -1880 -1114 210 3127 -1171 466 159 -1019 3926 2779 -2320 -4364
11154d364q8K131K015j752N963j922k768K508J366J794l796J762p876j274O038
$$ -4364 -4452 -2321 -306 -2058 3905 1983 -785 1723 3089 4883 1087 2849 -5027 -6301 -263
11139b63K211m62n28L123q087q93Q55l11K668j272l00L693J1427k120j1210j1071
$$ -263 1948 1486 958 4081 -4006 -4899 -4044 -4355 -1687 -2959 -3259 434 11861 9741 -1469 -12540
11123a2540j69L317R33r12k16K086m674K202P656N047O21l740j922o890L394P497
$$ -12540 -12709 -9392 -8459 -9371 -9587 -7501 -12175 -9973 -2317 2730 3351 -389 -2311 -9201 -5807 1690
11107A690N13L97M289P331o971m332J405o089M218P168k85L818O207j946p000
$$ 1690 2203 2600 6889 14220 7249 2917 4322 -1767 2451 9619 9334 13152 19359 17413 10413
11092A0413r599l387l125O85M14K681P194k502n471l736j0481l193Q940P569J0536
$$ 10413 814 -2573 -5698 -5013 -4599 -1918 5276 2774 -2697 -6433 -16914 -20107 -11167 -3598 6938
11077F938K622K286m068q936j138R116R339l498m194o706m125l260j456L060n229
$$ 6938 9560 11846 7778 -1158 -2296 6820 16159 12661 8467 1761 -2364 -5624 -7080 -4020 -9249
11062i249L488J329J922l331K004Q92l064o012L152M267k749j80K642Kn701L150
$$ -9249 -5761 -4432 -2510 -5841 -3837 -2945 -6009 -12021 -8869 -4602 -7351 -7531 -4889 -4887 -10588 -7438
11046g438R32J389J829q66l119J180M007k8M206K468n258p573L099K150O097J195
$$ -7438 -6506 -5117 -3288 -4154 -7273 -6093 -2086 -2114 2092 4560 -698 -8271 -5172 -3022 3075 4270
11030D270k993m728m034k899O47L038R860L353P22n612q359l027K997k066R76
$$ 4270 1277 -3451 -7485 -10384 -9737 -6699 3161 6514 7236 1624 -6735 -9762 -6765 -8831 -7855
11015g855L596J62k154M015L817n57M318L471J936K402J72m886n875k346l0M422
$$ -7855 -4259 -4097 -6251 -2236 1581 1024 5342 8813 10749 13151 13323 8437 2562 216 186 4608
10999D608n620j63K5o511J700M045L567L03J063k020j44K304N935k152p77K697
$$ 4608 -1012 -1175 -1150 -7661 -5961 -1916 1651 1954 3017 997 853 3157 9092 6940 6163 8860
10983H860q084o020o228r57k879k894j393P915k216q74N30N336L781L69L495k916
$$ 8860 776 -5244 -11472 -12429 -15308 -18202 -19595 -11680 -13896 -14770 -14240 -8904 -5123 -4754 -1259 -4175
10967d175Q004M931l334m02k825n832k120Q83M326p047j348L320K722n702o234
$$ -4175 3829 8760 5426 5024 2199 -3633 -5753 -4870 -544 -7591 -8939 -5619 -2897 -8599 -14833
10952a4833N304k911j300P19R63L305j732p79L234N270Q447l71o407K925L537
$$ -14833 -9529 -12440 -13740 -13021 -12058 -8753 -10485 -11264 -8030 -2760 5687 5316 -1091 1834 5371
10937E371n874q621k489M604L747O9K15K770k620p642L314O205L124j497k326
$$ 5371 -503 -9124 -11613 -7009 -3262 -3193 -2978 -208 -2828 -10470 -7156 -951 2173 676 -1650
10922a650K150M115j1181n719m102O076O391O554l834l151O280J322k701k522
$$ -1650 500 4615 -6566 -12285 -16387 -10311 -3920 2634 -1200 -4351 1929 3251 550 -1972
10908a972K692N187n475n839l86K280m161J835J703n576j010K696r19J979L468
$$ -1972 720 5907 432 -5407 -5793 -3513 -7674 -5839 -4136 -9712 -10722 -8026 -8945 -6966 -3498
10893c498O377K282r47k724k35R85l865q10l967j370Q222J838q09J181n232n136
$$ -3498 2879 5161 4214 1490 1255 2240 -1625 -2435 -6402 -7772 450 2288 1479 2660 -2572 -7708
10877g708J349J184n678N68N394O311L812n145o586L871K020k727J275K482K616
$$ -7708 -6359 -5175 -10853 -10285 -4891 1420 5232 87 -6499 -2628 -608 -3335 -2060 422 3038
10862C038o890k51j199J181L89q63j125L362K468K83L206r43o162j070M734R96
$$ 3038 -3852 -4103 -5302 -4121 -3732 -4595 -5720 -2358 110 393 3599 2656 -3506 -4576 158 1154
10846A154j2098o196L862P658j99p951lJ455n022J663K868l012L270L113j445
$$ 1154 -10944 -17140 -13278 -5620 -5819 -13770 -13773 -12318 -17340 -15677 -12809 -15821 -12551 -9438 -10883
10831a0883k703k202o334K076P118R22P076j798o380l286N404R279K112L947N887
$$ -10883 -13586 -15788 -22122 -20046 -12928 -12006 -4930 -6728 -13108 -16394 -10990 -1711 401 4348 10235
10816A0235m23n45j0802l263o248k639Q11J827m813Q593P934o67j73O004M9j907
$$ 10235 9812 9267 -1535 -4798 -11046 -13685 -12874 -11047 -15860 -7267 667 0 -173 5831 5880 3973
10800C973k024j1477k246N443L187k026j303n537k149N577O745n284o336m13K980
$$ 3973 1949 -9528 -11774 -6331 -3144 -5170 -6473 -12010 -14159 -8582 -1837 -7121 -13457 -13870 -10890
10785a0890Q397k361K892m533m840J65j732K653M273O70J783R130K265m766m006
$$ -10890 -2493 -4854 -1962 -6495 -11335 -11170 -12902 -10249 -5976 -5306 -3523 5607 7872 3106 -900
10770i00J239L828J369j773J620o991o237k68j535k02M479q722m544L829J292
$$ -900 339 4167 5536 3763 5383 -1608 -7845 -8113 -9648 -9850 -5371 -14093 -18637 -14808 -13516
10755a3516L975rk727J864K255K453l930o926N372Q692j0322K477M827l739j3723
$$ -13516 -9541 -9550 -12277 -10413 -8158 -5705 -9635 -16561 -11189 -2497 -12819 -10342 -5515 -9254 -22977
10740b2977j557P160J677K075K678M263J606l950k094r90K160L073n472K033K60
$$ -22977 -24534 -17374 -15697 -13622 -10944 -6681 -5075 -9025 -11119 -12109 -9949 -6876 -12348 -10315 -10055
10725a0055J604R372L873m704o914J68N281j111k343J835L089k209m08j959J999
$$ -10055 -8451 921 4794 90 -6824 -6656 -1375 -2486 -4829 -2994 95 -2114 -2522 -4481 -2482
10710b482O77L975J455j71Q826o451m659O113M27J136M263k037q249m839k707
$$ -2482 -1805 2170 3625 3454 12280 5829 1170 7283 7710 8846 13109 11072 2823 -2016 -4723
10695d723m90j0190l685J137q80N49O409P10j164J5422l532l534j688j463J805
$$ -4723 -5213 -15403 -19088 -17951 -18831 -18282 -11873 -11163 -12327 3095 -437 -3971 -5659 -7122 -5317
10680e317k962l319L773M819J321P365O496j303p217j031L492J889l05n77n832
$$ -5317 -8279 -11598 -7825 -3006 -1685 5680 12176 10873 3656 2625 6117 8006 7701 7124 1292
10665A292k435M974L376o071r377l435J056L506n74J939l55N414L978J215k79
$$ 1292 -1143 3831 7207 1136 -8241 -11676 -10620 -7114 -7688 -5749 -6104 -690 3288 4503 4224
10650D224K563L483L892p21O277K048j0177r031n285p436l310j028O69M092P52
$$ 4224 6787 10270 14162 13441 19718 21766 11589 2558 -2727 -10163 -13473 -14501 -13832 -9740 -8988
10635h988L196j49L389M390M17j154l710R1m8J970L202N120J419n579n377k880
$$ -8988 -5792 -5941 -2552 1838 2255 1101 -2609 -2518 -2566 -596 2606 7726 9145 3566 -1811 -4691
10619d691L650l570q764K839K599K198M451M48N390k495l948n669m674o560k68
$$ -4691 -1041 -4611 -13375 -10536 -7937 -5739 -1288 -840 4550 2055 -1893 -7562 -12236 -18796 -19064
10604a9064N564P334O811Q60k068l416k385r79J900l444r065N635P318L074j0418
$$ -19064 -13500 -6166 645 1505 -563 -3979 -6364 -7343 -5443 -8887 -17952 -12317 -4999 -1925 -12343
10589a2343p2m4k57J678M670J069K627L98K50m994m965O753O577j303M416M335
$$ -12343 -12415 -12459 -12716 -11038 -6368 -5299 -2672 -2274 -2024 -7018 -11983 -5230 1347 44 4460 8795
10573H795j794k525l69m4l738j1990j125L847m22q11M850N696K926J305k575m112
$$ 8795 7001 4476 4107 4063 325 -11665 -12790 -8943 -9365 -10176 -5326 370 3296 4601 2026 -2086
10557b086k779n927l305l340K724L880N440j588m186J027r32L531L780m371o47
$$ -2086 -4865 -10792 -14097 -17437 -14713 -10833 -5393 -6981 -11167 -10140 -11072 -7541 -3761 -8132 -8779
10542h779j161O234O664n14P87J048m797L010n499l112N162n88j650J79K614p781
$$ -8779 -9940 -3706 2958 2444 3231 4279 -518 2492 -3007 -6119 -957 -1545 -3195 -3016 -402 -8183
10526h183o44R49J192Q30L904m793k222N225l658j602K010l081Q56P160M180k489
$$ -8183 -8827 -7878 -6686 -5856 -1952 -6745 -8967 -3742 -7400 -9002 -6992 -10073 -9217 -2057 2123 -366
10510c66j011j674m529m61M714K826m834k499J795K266n048N081j621K788q38
$$ -366 -1377 -3051 -7580 -8041 -3327 -501 -5335 -7834 -6039 -3773 -8821 -3740 -5361 -2573 -3411
10495c411n112O691K494R75o0k576p044K70L078L57M8j536K438L817M917M224
$$ -3411 -8523 -1832 662 1637 1577 -999 -8043 -7773 -4695 -4338 -4290 -5826 -3388 429 5346 9570
10479I570j895l55M599o218o651N287p59Q06n77o751n013l856j511j958M118J0537
$$ 9570 7675 7320 11919 5701 -950 4337 3578 4384 3807 -2944 -7957 -11813 -13324 -15282 -11164 -627
10463f27L440m106l504L063J120l123L68M508K612o195J810Q49K694j294p744
$$ -627 2813 -1293 -4797 -1734 -614 -3737 -3369 1139 3751 -2444 -634 215 2909 1615 -6129
10448f129n962M912Q597P258M67o156m460j92J1731L057m957o944J352K434n229
$$ -6129 -12091 -7179 1418 8676 9143 2987 -1473 -1665 10066 13123 8166 1222 2574 5008 -221
10433b21Q045L41j150m405l803l219k784O801L472q752n42j617M681M955K299
$$ -221 7824 8165 7015 2610 -1193 -4412 -7196 -395 3077 -5675 -6217 -7834 -3153 1802 4101
10418D101O826N47o867J585l993o85l02m651n451M702R446r11J884J800Q72j2
$$ 4101 10927 11474 4607 6192 2199 1514 1212 -3439 -8890 -4188 5258 4347 6231 8031 8903 8891
10402H891k757l895k641j378J890K350l086J231J418j806L30l296k48J835l086
$$ 8891 6134 2239 -402 -1780 110 2460 -626 605 2023 217 547 -2749 -2997 -1162 -4248
10387d248J519p34L472O31k333K801J627J41K969O35k380m740l823m661j1250
$$ -4248 -2729 -3463 9 640 -1693 1108 2735 2876 5845 6480 4100 -640 -4463 -9124 -20374
10372b0374K965R883P761j181n356J42L662q20l155k314n820j355O819R195J3146
$$ -20374 -17409 -7526 235 -946 -6302 -6160 -2498 -3318 -6473 -8787 -14607 -15962 -9143 52 13198
10357A3198k369q825l265j384J412L426M007L04j137l688n049L529R962J305p453
$$ 13198 10829 2004 -1261 -2645 -1233 2193 6200 6504 5367 1679 -3370 159 10121 11426 3973
10342C973L706k255N347N798Q554Q116O195Q282k274N27J158J533L312j293j987
$$ 3973 7679 5424 10771 16569 25123 33239 39434 47716 45442 45969 47127 48660 51972 50679 48692
10327D8692l500L074l566k908o989p940k987p329p012j733O196j871l132Q426
$$ 48692 45192 48266 44700 41792 34803 26863 23876 16547 9535 7802 13998 12127 8995 17421
10313A7421q97j037q58M202l72m206L30N21J587J478l426Q53J781J311j804l064
$$ 17421 16524 15487 14629 18831 18459 14253 14583 15104 16691 18169 14743 15596 17377 18688 16884 13820
10297A3820K338J886N092K687K965l519n049m75O74k001K122l936k617k932R131
$$ 13820 16158 18044 23136 25823 28788 25269 20220 19745 20419 18418 20540 16604 13987 11055 20186
10282B0186J5464R350j015o086K824J1469N036o708N524J4898K0706L2268L1849
$$ 20186 35650 45000 43985 37899 40723 52192 57228 50520 56044 70942 91648 123916 155765
10269A55765M9070Q3019R1700J06154J05588J08715J06948Q4140N0952J5981j3344
$$ 155765 204835 287854 379554 485708 591296 700011 806959 891099 942051 958032 944688
10258I44688m6784p7556q8243r6016r4814q1284p4941o3594n0263l3714k2649
$$ 944688 897904 820348 732105 636089 541275 459991 385050 321456 271193 237479 214830
10247B14830k1213k1066p262o625o108p340q876p614r591k363m140j1451K040
$$ 214830 193617 172551 165289 158664 152556 145216 136340 128726 119135 116772 112632 101181 103221
10234A03221J2479P99l528p517o345q336j531k432j318k032N503M31k741j632
$$ 103221 115700 116499 112971 105454 99109 90773 89242 86810 85492 83460 88963 89394 86653 85021
10220H5021J212l048m432J826j0578j1299M77M785j707p740l246o225L723J3038
$$ 85021 86233 83185 78753 80579 70001 58702 59179 63964 62257 54517 51271 45046 48769 61807
10206F1807M413N34l979p659N10K833q99l703j543J038m749l071k804k315n827
$$ 61807 66220 66754 62775 55116 55626 58459 57560 53857 52314 53352 48603 45532 42728 40413 34586
10191C4586o479l247j72K470O059J7064M317j442n453j781l152n739R58K847j882
$$ 34586 28107 24860 24688 27158 33217 50281 54598 53156 47703 45922 42770 37031 37989 40836 38954
10176C8954k260q4L253m197q6m926n231K029K774L771r33p731j0069K96J490k134
$$ 38954 36694 36610 39863 35666 35580 30654 25423 27452 30226 33997 33064 25333 15264 15560 17050 14916
10160A4916L34K908J0092R78j583q13J624K047Q91K991J846K358O214J732R50
$$ 14916 15250 18158 28250 29228 27645 26832 28456 30503 31394 34385 36231 38589 44803 46535 47485
10145D7485J967J857L480L9o878q619n99M865p64J284j253J773J526k439p607
$$ 47485 49452 51309 54789 54828 47950 39331 38732 43597 42833 44117 42864 44637 46163 43724 36117
10130C6117l122k981J831L355j133k818k109j648p991j224j594P246O532O76K128
$$ 36117 32995 30014 31845 35200 34067 31249 29140 27492 19501 18277 16683 23929 30461 31137 33265
10115C3265j778r823j493M02n339p655P617N1k963L592j218l806l091N496J684
$$ 33265 31487 21664 20171 20573 15234 7579 15196 15247 12284 15876 14658 10852 7761 13257 14941
10100A4941L318j481m229k487n017q70O845J927r22M116M067l300n024l599j94
$$ 14941 18259 16778 12549 10062 5045 4175 11020 12947 12025 16141 20208 16908 11884 8285 8091
10085H091O846l295q960L060K58P07K754j581L668k118k097K375K80J505l689
$$ 8091 14937 11642 2682 5742 6000 6707 9461 7880 11548 9430 7333 9708 9988 11493 7804
10070G804K091N169m242j959j104n429l757P513K294K839Q539l5n744k69M380
$$ 7804 9895 15064 10822 8863 7759 2330 -1427 6086 8380 11219 19758 19723 13979 13710 18090
10055A8090K393K065Q19l493J619J591P766K841k157o293p503k566m707O67k095
$$ 18090 20483 22548 23367 19874 21493 23084 30850 33691 31534 25241 17738 15172 10465 11132 9037
10040I037l411P646K753J999m513l063K925p980N75O009m428n905r53n022J065
$$ 9037 5626 13272 16025 18024 13511 10448 13373 5393 5968 11977 7549 1644 691 -4331 -3266
10025c266J40M914L373O75K637m54N651j315m802j3776q195Q47L108K774J0108
$$ -3266 -3126 1788 5161 5836 8473 8019 13670 12355 7553 -6223 -14418 -13571 -10463 -7689 2419
10010B419J098q076q86j912L27k04P005R132N513k713k981N751J215j575o263
$$ 2419 3517 -4559 -5445 -7357 -7030 -7234 -229 8903 14416 11703 8722 14473 15688 14113 7850
9995G850k280M514j679n339O37L471k262p21K30K840K988N90K153N819j807J405
$$ 7850 5570 10084 8405 3066 3703 7174 4912 4191 4421 7261 10249 10839 12992 18811 17004 18409
9979A8409R71M76j310K691J3323J0497J3947K5063M8620N8766L7268O065m6160
$$ 18409 19380 19856 18546 21237 34560 45057 59004 84067 132687 191453 228721 234786 188626
9966A88626o6547m0243j6673o431k563m888o665k855j1541m208J126r62N30n308
$$ 188626 122079 81836 65163 58732 56169 51281 44616 41761 30220 26012 27138 26176 26706 21398
9952B1398q394O153N673j301j963l267O78k473L4M892M326l690k983j993l598
$$ 21398 13004 19157 24830 23529 21566 18299 18977 16504 16538 21430 25756 22066 19083 17090 13492
9937A3492j750P457M216m736j0679M205K588l937Q00J4790Q050k291l481p107
$$ 13492 11742 19199 23415 18679 8000 12205 14793 10856 11656 26446 34496 32205 28724 21617
9923B1617l565l898k024N19L794N482L733n796m559M878j20j369l034J943j196
$$ 21617 18052 14154 12130 12649 16443 21925 25658 19862 15303 20181 20061 18692 15658 17601 16405
9908A6405J892Q198L199J123M409P2o557L995P04p370J218Q069O143J291k551
$$ 16405 18297 26495 29694 30817 35226 35298 28741 32736 33440 26070 27288 35357 41500 42791 40240
9893D0240N985L699n172L446l645l344m734L633P178j219j4251p080o415K673
$$ 40240 46225 49924 44752 48198 44553 41209 36475 40108 47286 46067 31816 24736 18321 20994
9879B0994L782K555M456R21m756j078O699M277l268m138l693o605p744J960L902
$$ 20994 24776 27331 31787 32708 27952 26874 33573 37850 34582 30444 26751 20146 12402 14362 18264
9864A8264N793l049K369L362l842k468N197L978m516J176M475j268M389M954K462
$$ 18264 24057 21008 23377 26739 22897 20429 25626 29604 25088 26264 30739 29471 33860 38814 41276
9849D1276M423J147J771N917J560m643j071q05J533k56l44m274j2569M23J51N973
$$ 41276 45699 46846 48617 54534 56094 51451 50380 49575 51108 50852 50508 46234 33665 34088 34239 40212
9833D0212O0p054n235L096J912k400n516m439j472k546J306J3703k818j961r85
$$ 40212 40272 33218 27983 31079 32991 30591 25075 20636 19164 16618 17924 31627 28809 26848 25863
9818B5863k083M809J332L39m984O31J567M11L7O832Q978K842R841J6613K0885
$$ 25863 23780 28589 29921 30260 25276 25907 27474 27885 27922 34754 43732 46574 56415 73028 93913
9803I3913L4537N9223J04431J64062J87718J10514L222j59419j77628j25226p4774
$$ 93913 128450 187673 292104 456166 643884 754398 757620 598201 420573 295347 220573
9792B20573m8764l0102j5428j0199q995j3116q190K241n715j0749p250O005J430
$$ 220573 171809 141707 126279 116080 107085 93969 85779 88020 82305 71556 64306 70311 71741
9779G1741k61k015k636M761O521q260r981r83l523j043M282L546k124j041M33
$$ 71741 71480 69465 66829 71590 78111 69851 59870 58887 55364 54321 58603 62149 60025 58984 59417
9764E9417J3009J8927J8202J7959Q928j3555j8711j5239j1155q480j1250q399
$$ 59417 72426 91353 109555 127514 136442 122887 104176 88937 77782 69302 58052 49653
9752D9653p757J881M054p50l667o284p84K44n214J604P195j103J737J440n613
$$ 49653 41896 43777 47831 47081 43414 37130 36346 36590 31376 32980 40175 39072 40809 42249 36636
9737C6636k922K10k854l105L54J668O125j416l655K006J128J785j211k687j095
$$ 36636 33714 33924 31070 27965 28319 29987 36112 34696 31041 33047 34175 35960 34749 32062 30967
9722C0967P038L633K268m899o274l856n658M431P025P73N12q101o758N254j580
$$ 30967 38005 41638 43906 39007 32733 28877 23219 27650 34675 35448 35960 27859 21101 26355 24775
9707B4775L483Q237M681O341m863q067O44k52j634k230K146k785k049j885J870
$$ 24775 28258 36495 41176 47517 42654 34587 35231 34979 33345 31115 33261 30476 28427 26542 28412
9692B8412J172K154K298o538o510n411M926L978o0m147l809k738J075J0175J2062
$$ 28412 29584 31738 34036 27498 20988 15577 20503 24481 24421 20274 16465 13727 14802 24977 37039
9677C7039k917n343m38k39Q43O705M616o644n716J571L271m990j923J888m319
$$ 37039 34122 28779 28341 28102 28945 35650 40266 33622 27906 29477 32748 27758 25835 27723 23404
9662B3404j482N828M133j466J211n105m431K283L071o125N52N514Q428J0247l00
$$ 23404 21922 27750 31883 30417 31628 26523 22092 24375 27446 21321 21873 27387 35815 46062 45762
9647D5762j490j9M799k323L62j422N161N145J3n70L753K932L364L990K38m689
$$ 45762 44272 44253 49052 46729 47091 45669 50830 55975 55988 55418 59171 62103 65467 69457 69695 65006
9631F5006n28M300K517M470J759O634l300O230R523L253j283K508P706J0827J174
$$ 65006 64478 68778 71295 75765 77524 84158 80858 87088 96611 99864 98581 101089 108795 119622 120796
9616A20796M901J0437J4372J8481J5764J2998J3187J0478J7085J9095K1934K9844
$$ 120796 125697 136134 150506 168987 184751 197749 210936 221414 238499 257594 279528 309372
9604C09372L1631L5745L3422L2717M7468N4308N3714N7049O3953P2360Q4169Q7108
$$ 309372 341003 376748 410170 442887 490355 544663 598377 655426 719379 791739 875908 963016
9592I63016Q1221P9765P8057P3356N6091L4296J1710k1424l8246n3123o4220o4140
$$ 963016 1044237 1124002 1202059 1275415 1331506 1365802 1377512 1356088 1317842 1264719 1200499 1136359
9580A136359o8161o6487n6014n4034n0713n7338m5624m4585m2337l7364l4003
$$ 1136359 1068198 1001711 945697 891663 840950 783612 737988 693403 651066 613702 579699
9569E79699k6884k4635k4885k4857k3577k1231j7697j6026j7369j7037j2215j3561
$$ 579699 552815 528180 503295 478438 454861 433630 415933 399907 382538 365501 353286 339725
9557C39725j3511r930j0881j1358k141q415p212j4871j0168l581m023r027n647
$$ 339725 326214 316284 305403 294045 291904 283489 276277 261406 251238 247657 243634 234607 228960
9544B28960l859l726q170k007o86q945r086j1962k890n99p404J792O802k541k312
$$ 228960 225101 221375 213205 211198 210512 201567 192481 180519 177629 177030 169626 171418 178220 175679 173367
9529A73367m299p071J174p159m958j0854o118l86L949j520j1442m210o787l975
$$ 173367 169068 161997 163171 156012 151054 140200 134082 133696 137645 136125 124683 120473 113686 109711
9515A09711l44K095K280k112M22N592K239l453J944N896J050j2526q745o990n903
$$ 109711 109367 111462 113742 111630 112052 117644 119883 116430 118374 124270 125320 112794 104049 97059 91156
9500I1156K230k000J183j743r978k021J936M822n435k999o95J465j413L754J860
$$ 91156 93386 91386 92569 90826 80848 78827 80763 85585 80150 77151 76456 77921 76508 80262 82122
9485H2122p03l496K617J625q119o290J330M425j289j185j946q83k358P213J1905
$$ 82122 81419 77923 80540 82165 74046 67756 69086 73511 72222 71037 69091 68208 65850 73063 84968
9470H4968P593J811L575O627L22q040r953j1919o137K394N298j297p819n633n540
$$ 84968 92561 94372 97947 104574 104896 96856 86903 74984 68847 71241 76539 75242 67423 61790 56250
9455E6250j937R987N37K14J988n200q6N300K258l895R96m814O14M455n986n427
$$ 56250 54313 64300 64837 65051 67039 61839 61753 67053 69311 65416 66412 61598 62212 66667 60681 55254
9439E5254q55m442l602K714j0070O98O915K279K47j960j038q50J817j122m293
$$ 55254 54399 49957 46355 49069 38999 39697 46612 48891 49138 47178 46140 45290 47107 45985 41692
9424D1692P86j757J391j23j022L70k002J651l184o91o33K701K09l772O87K503
$$ 41692 42478 40721 42112 41989 40967 41337 39335 40986 37802 37111 36478 39179 39388 35616 36303 38806
9408C8806K330K19l728L239J661k465m254K685l483j808n704j940r104o735M358
$$ 38806 41136 41355 37627 40866 42527 40062 35808 38493 35010 33202 27498 25558 16454 9719 14077
9393A4077R786J807O34p142l713k158j303L693N206L736M422l515j536L055j934
$$ 14077 23863 25670 26304 19162 15449 13291 11988 15681 20887 24623 29045 25530 23994 27049 25115
9378B5115N395p747j0807M414M157K2n456K244L216l61j776J533j877r84l633
$$ 25115 30510 22763 11956 16370 20527 20549 15093 17337 20553 20192 18416 19949 18072 17088 13455
9363A3455l154M853R951K433p227l918J485K484r80p224o337N03l927Q46m47R15
$$ 13455 10301 15154 25105 27538 20311 16393 17878 20362 19382 12158 5821 6324 2397 3243 2796 3711
9347C711R81L0N657q69L265l709k481K307j036L430L268m14n174n303n812J0317
$$ 3711 4692 4722 10379 9510 12775 9066 6585 8892 7856 11286 14554 14140 8966 3663 -2149 8168
9331H168J2661k231K6k269M38k087P74O808j116Q59o065m875p188M46L049n504
$$ 8168 20829 18598 18624 16355 16793 14706 15480 22288 21172 22031 15966 11091 3903 4349 7398 1894
9315A894n32O527J74L050J937J632K856m187K439m260r445k903n28L106N771P586
$$ 1894 1362 7889 8063 11113 13050 14682 17538 13351 15790 11530 2085 -818 -1346 1760 7531 15117
9299A5117K18n328k783r320n553O84N976Q010L674N031l601o872j34m306p100
$$ 15117 15335 10007 7224 -2096 -7649 -6965 -989 7021 10695 15726 12125 5253 5119 813 -6287
9284f287J097M386N977O312J539J761O041m167r152o267M626L469P34O662K058
$$ -6287 -5190 -804 5173 11485 13024 14785 20826 16659 7507 1240 5866 9335 10069 16731 18789
9269A8789k016m164n835n040N858O564L556o877m46N172N395K858l763O64o02
$$ 18789 16773 12609 6774 1734 7592 14156 17712 10835 10389 15561 20956 23814 20051 20715 20113
9254B0113l961l694N44j778l05l7J50j203P041J620p564L254J307O54k680o322
$$ 20113 16152 12458 13002 11224 10919 10882 11032 9829 16870 18490 10926 14180 15487 16141 13461 7139
9238G139j0382r37J1516J251r194l069L614M855j482L842L432N825N86q23R45
$$ 7139 -3243 -4180 7336 8587 -607 -3676 -62 4793 3311 7153 10585 16410 16996 16173 17118
9223A7118r43n284l315N9K998N678M069m270p638l273Q42J622m526J334Q553m084
$$ 17118 16175 10891 7576 7635 10633 16311 20380 16110 8472 5199 6041 7663 3137 4471 13024 8940
9207H940n093J664J0554J2745K26j3870o437n634J0724M00J444K499p349l666
$$ 8940 3847 5511 16065 28810 29036 15166 8729 3095 13819 14219 15663 18162 10813 7147
9193G147N437J803L268J908k41J425K160J3024J0325j234j1278l973J398j170
$$ 7147 12584 14387 17655 19563 19322 20747 22907 35931 46256 45022 33744 29771 31169 29999
9179B9999K83j883m871L325L770L885o007m247K992O283m167J265m79k000K716
$$ 29999 30282 28399 23528 26853 30623 34508 28501 24254 27246 33529 29362 30627 30148 28148 30864
9164C0864n449J556L627l340k827o600K284P541J767q40n971m715n370k400R802
$$ 30864 25415 26971 30598 27258 24431 17831 20115 27656 29423 28583 22612 17897 12527 10127 19929
9149A9929J727j461L950m113m096L70j033Ll708j360M418l90J703J0278k287l102
$$ 19929 21656 20195 24145 20032 15936 16306 15273 15276 11568 10208 14626 14236 15939 26217 23930 20828
9133B0828m607p76n699l231N964K807m812j103o340j35O539P833M03q243p637
$$ 20828 16221 15445 9746 6515 12479 15286 10474 9371 3031 2896 9435 17268 17671 9428 1791
9118A791o258M887R561k758o168O614Q655K505J880k697m910j936m107O48K280
$$ 1791 -4467 420 9981 7223 1055 7669 16324 18829 20709 18012 13102 11166 7059 7707 9987
9103I987N509R97l938n52M992o912n396j018K583J585j898l539J101r79J643J695
$$ 9987 15496 16493 12555 12003 16995 10083 4687 3669 6252 7837 5939 2400 3501 2522 4165 5860
9087E860K666O015O203o59j622n462l539O18J782N080O365K313l377k645o541
$$ 5860 8526 14541 20744 20085 18463 13001 9462 10080 11862 16942 23307 25620 22243 19598 13057
9072A3057l017L662L366l813k762K664m62O159j830o020O647P898P100R73K606
$$ 13057 10040 13702 17068 13255 10493 13157 12695 18854 17024 11004 17651 25549 32649 33622 36228
9057C6228K688n75k589o511n379l178m696p082K361K965M759l557J649P109l297
$$ 36228 38916 38341 35752 29241 23862 20684 15988 8906 11267 14232 18991 15434 17083 24192 20895
9042B0895k941j586O75j810p790n092j884j24k372J10PK963P758k801l604M62
$$ 20895 17954 16368 17043 15233 7443 2351 467 343 -2029 -1919 -1912 1051 8809 6008 2404 2866
9026B866N751r11l529l462M065J0033j270o056R30Q29J106J796l685J08N080o52
$$ 2866 8617 7706 4177 715 4780 14813 13543 7487 8417 9246 10352 12148 8463 8571 13651 12999
9010A2999m160K745k787L758O398J373q727q737L321J069l476n51M135l928K749
$$ 12999 8839 11584 8797 12555 18953 20326 11599 2862 6183 7252 3776 3225 7360 3432 6181
8995F181J124R882k95n271o302r415j298q76J864O515M97J224j834l640L399L727
$$ 6181 7305 17187 16892 11621 5319 -4096 -5394 -6270 -4406 2109 2606 3830 1996 -1644 1755 5482
8979E482j980N750M844M384k567j104J488P369P70o274p149j063k348l211k601
$$ 5482 3502 9252 14096 18480 15913 14809 16297 23666 24436 18162 11013 9950 7602 4391 1790
8964A790J596j572J579m45l167k730J660O092K392p94k325J0516R823Q919l441
$$ 1790 3386 1814 3393 2948 -219 -2949 -1289 4803 7195 6401 4076 14592 24415 33334 29893
8949B9893q715j0172j0086R48J170k389O68R940N197q38L137j224L346m39K828
$$ 29893 21178 11006 920 1868 3038 649 1317 11257 16454 15616 18753 17529 20875 20436 23264
8934B3264K579J314j998N037k411k889O29m631n794K872L93n891L237M218m549
$$ 23264 25843 27157 25159 30196 27785 24896 25525 20894 15100 17972 18365 12474 15711 19929 15380
8919A5380q541K41P835R091P63r62j0242n725k5K761J3J310O86K470O167M536
$$ 15380 6839 7080 14915 24006 24769 23807 13565 7840 7815 10576 10589 11899 12585 15055 21222 25758
8903B5758k953q830m405l939J901Q011J0209J957j2577p842P62J020l317L080
$$ 25758 22805 13975 9570 5631 7532 15543 25752 27709 15132 7290 8052 9072 5755 8835
8889H835O021m944J04M868l609j943k333l816J180L323o38M624Q471j241J147
$$ 8835 14856 9912 10016 14884 11275 9332 6999 3183 4363 7686 7048 11672 20143 18902 20049
8874B0049m517L504j634R97J077o670k342q84j769P519P984m582p35O979j581
$$ 20049 15532 19036 17402 18399 19476 12806 10464 9580 7811 15330 23314 18732 17997 24976 23395
8859B3395j2091k608j913Q10O910M896p691l775n597J515M830J680q27j2097n652
$$ 23395 11304 8696 6783 7593 14503 19399 11708 7933 2336 3851 8681 10361 9534 -2563 -8215
8844h215l88O793M361k437J627P19O370j044p855o94L404K611M022N164q36o254
$$ -8215 -8603 -1810 2551 114 1741 2460 8830 7786 -69 -763 2641 5252 9274 14438 13602 7348
8828G348k633j074M338O330K07q947k333K012K317j0814l651P119K563k017k098
$$ 7348 4715 3641 7979 14309 14516 5569 3236 5248 7565 -3249 -6900 219 2782 765 -1333
8813a333k057N409j389k883P076M753j045l285q989P95M945M513N017k39m472
$$ -1333 -3390 2019 630 -2253 4823 9576 8531 5246 -3743 -2948 1997 6510 11527 11288 6816
8798F816k666L812j023J820L034k846l750m872N243J988o824J7K672P686O627
$$ 6816 4150 7962 6939 8759 11793 8947 5197 325 5568 7556 732 749 3421 11107 17734
8783A7734J936K123j353q525M62O843J475N29k291j0195o524K519M699M048k167
$$ 17734 19670 21793 20440 11915 12377 19220 20695 21224 18933 8738 2214 4733 9432 13480 11313
8768A1313K181L751l022m590n003j37O671l172k798n3K118l512l434L259M455
$$ 11313 13494 17245 14223 9633 4630 4493 11164 7992 5194 5141 7259 3747 313 3572 8027
8753H027K585j086m939m977L107O058m662j853M389q77L446M977R42N00L275J275
$$ 8027 10612 9526 4587 -390 2717 8775 4113 2260 6649 5772 9218 14195 15137 15637 18912 20187
8737B0187m681m117J933n124p2j922O84k892L022O182P247R581R704M694R784
$$ 20187 15506 11389 13322 8198 8126 6204 6888 3996 7018 13200 20447 30028 39732 44426 54210
8722E4210j819o723q239j2231j0384K813Q896P56k59K900o999m268j222J892L605
$$ 54210 52391 45668 37429 25198 14814 17627 26523 27279 27020 29920 22921 18653 17431 19323 22928
8707B2928k373k033j73n528m689R44O72J788J530P10m069N220K828j234q814L197
$$ 22928 20555 18522 18349 12821 8132 9076 9748 11536 13066 13776 9707 14927 17755 16521 7707 10904
8691A0904M463L905p93n700Q040K384L416J0084M407m201m492o049o313o84L043
$$ 10904 15367 19272 18479 12779 20819 23203 26619 36703 41110 36909 32417 26368 20055 19371 22414
8676B2414l984k00q0j305q076k475L604m645K013l522k82K082O132L561R3J283
$$ 22414 18430 18230 18150 16845 8769 6294 9898 5253 7266 3744 3462 5544 11676 15237 15330 16613
8660A6613m16M739M332o692o917r99O044M471J077M12n103o20K036k309n573l712
$$ 16613 16197 20936 25268 18576 11659 10660 16704 21175 22252 22664 17561 16941 18977 16668 11095 7383
8644G383P769P098L868K850N079L281l481l949M655K153p38L5m81J898J108l627
$$ 7383 15152 22250 26118 28968 34047 37328 33847 29898 34553 36706 35968 36003 35522 37420 38528 34901
8628C4901j458J4198P208J781m861k389L760k757O090P630J4638J5852K8632L8298
$$ 34901 33443 47641 54849 56630 51769 49380 53140 50383 56473 64103 78741 94593 123225 161523
8614A61523O5007R5754J45055J70081J39985N1486o1108j38788j55148j21711
$$ 161523 226530 322284 467339 637420 777405 828891 767783 628995 473847 352136
8604C52136p5383n2119k2111j3102j3299j6545j1649l9J222l257q592j1490j0769
$$ 352136 276753 224634 202523 189421 176122 159577 147928 147889 149111 145854 137262 125772 115003
8591A15003l720j761n172P95j870r127l178m004l104J685L293n24k370o671j823
$$ 115003 111283 109522 104350 105145 103275 94148 90970 86966 83862 85547 88840 88316 85946 79275 77452
8576G7452Q943q291l687k4k244j302M031M717J005N595J0226Q665J6068J5964
$$ 77452 86395 78104 74417 74393 72149 70847 74878 79595 80600 86195 96421 105086 121154 137118
8562A37118q063j1300j1544j0255j3511j0013m776O059R055J048j312k130L319
$$ 137118 129055 117755 106211 95956 82445 72432 67656 73715 82770 83818 82506 80376 83695
8549H3695K525R98J0630J2733P314M316J4164K0653K7142K2060J6313K122M414
$$ 83695 86220 87218 97848 110581 117895 122211 136375 157028 184170 206230 222543 224665 229079
8536B29079J3336M5862P0635J01822J96785L58037N00827L91506J45409k58511
$$ 229079 242415 288277 358912 460734 657519 1015556 1516383 1907889 2053298 1794787
8526A794787n14672l73103k21789j27942q3251n7878l5917k5533j2201j4076j5160
$$ 1794787 1280115 907012 685223 557281 474030 416152 380235 354702 342501 328425 313265
8515C13265j4874j6939r311o048j1921j0276k612N524J4212K0501L2228O0439
$$ 313265 298391 281452 272141 266093 254172 243896 241284 246808 261020 281521 313749 374188
8503C74188P7441O1694K0737l7719p5080p8527n5710k8819j7068k1553j6382j5818
$$ 374188 451629 513323 534060 496341 421261 342734 287024 258205 241137 219584 203202 187384
8491A87384m694m146k634L566O449J0900O225l172j1062j817j403N045K838j2735
$$ 187384 182690 178544 175910 179476 185925 196825 203050 199878 188816 186999 185596 190641 193479 180744
8477A80744j5955j0854K065m75K415L448p94j0422q406Q06K504J5147K3844K9763
$$ 180744 164789 153935 156000 155525 157940 161388 160594 150172 141766 142572 145076 160223 184067 213830
8463B13830N3596P7659P3673L3306k3221p9354p6019m7792k9735j2536j2307j7342
$$ 213830 267426 345085 418758 452064 428843 349489 273470 225678 195943 183407 171100 153758
8451A53758r957k396l04j1156o440O868M555k021L145J3160K441k109p780m035
$$ 153758 143801 141405 141101 129945 123505 130373 134928 132907 136052 149212 151653 149544 141764 137729
8437A37729J720r959r515p029q188l637k678M606J869M066m796r754j1221j0198
$$ 137729 139449 129490 119975 112946 104758 101121 98443 103049 104918 108984 104188 94434 83213 73015
8423G3015k907K183p14N275l381j2925k034M237K265O66n002J26Q500K314Q774
$$ 73015 70108 72291 71577 76852 73471 60546 58512 62749 65014 65680 60678 60804 69304 71618 80392
8408H0392M73o399P006K850j4668r137O087j794n958L360l195n251q66K561M995
$$ 80392 80865 74466 81472 84322 69654 60517 66604 64810 58852 62212 59017 53766 52900 55461 60456
8393F0456o29q77p685j041k614m2m505j191l379j54J56l852K856R75L471N984
$$ 60456 59827 58950 51265 50224 47610 47568 43063 41872 38493 38339 38495 34643 37499 38474 41945 47929
8377D7929J293J504O86n929k123n052N763O71j36L13j381l938n217n28M643J66
$$ 47929 49222 50726 51412 45483 43360 38308 44071 44742 44606 44919 43538 39600 34383 33855 38498 38664
8361C8664K078J420j843l956K851o741j874L426O765q60j158L59L118J003l683
$$ 38664 40742 42162 40319 36363 39214 32473 30599 34025 40790 39930 38772 39131 42249 43252 39569
8346C9569q623N51P627l055O72K187l85n292k934P87L344q98j0099l697J008J167
$$ 39569 30946 31497 39124 36069 36741 38928 38543 33251 30317 31104 34448 33550 23451 19754 20762 21929
8330B1929M826n81J317k973j806Q201K284j546k607J258q4n148m517k440M79N472
$$ 21929 26755 26174 27491 24518 22712 30913 33197 31651 29044 30302 30218 25070 20553 18113 18592 24064
8314B4064K526k022K019P774N19n683j1993r78N77J42O679m314K496L973o56p412
$$ 24064 26590 24568 26587 34361 34880 29197 17204 16226 16803 16945 23624 19310 21806 25779 25123 17711
8298A7711k115M095m724N826l615q115o572o66L935J0539O047j097k917j669l777
$$ 17711 15596 19691 14967 20793 17178 9063 2491 1825 5760 16299 22346 21249 18332 16663 12886
8283A2886j0986K267Q332M33k294m823j746l933l223J212O585K46L075k8M286
$$ 12886 1900 4167 12499 12932 10638 5815 4069 136 -3087 -1875 4710 4956 8031 8003 12289
8268A2289M736M631M503o877j381L820L342p386o665j75J872m289P56N959m421
$$ 12289 17025 21656 26159 19282 17901 21721 25063 17677 11012 10837 12709 8420 9176 15135 10714
8253A0714q95K027j125r5L560L28m604M143Q509J814j90J94m126p652l621M65
$$ 10714 9819 11846 10721 10626 14186 14514 9910 14053 22562 24376 24186 24380 20254 12602 8981 9446
8237I446n120J437J74L990K738P529j983k076nK957M295R91r641l065J89n163
$$ 9446 4326 5763 5937 9927 12665 20194 18211 16135 16130 19087 23382 24373 14732 11667 11856 6693
8221F693j356M080m66J841m842p353k029K413O751j965j738K623M000R47p84l620
$$ 6693 5337 9417 8951 10792 5950 -1403 -3432 -1019 5732 3767 2029 4652 8652 9599 8815 5195
8205E195j0210m233M368M426N990K781M663J766j255q83m318J407j522J804l551
$$ 5195 -5015 -9248 -4880 -454 5536 8317 12980 14746 13491 12608 8290 9697 8175 9979 6428
8190F428K259K466n968O845K365o46k251j128o005k105k899L834N699J856J597
$$ 6428 8687 11153 5185 12030 14395 13749 11498 10370 4365 2260 -639 3195 8894 10750 12347
8175A2347L97N040J525M58k315r96M192N991k422K057P056R050K3139K1204J1912
$$ 12347 12744 17784 19309 19767 17452 16456 20648 26639 24217 26274 33330 42380 65519 86723 98635
8160I8635k190j8448k3342j8041j1637m442p037j275N382K031n532M2R11L844
$$ 98635 96445 77997 54655 36614 24977 20535 13498 12223 17605 19636 14104 14146 15057 18901
8146A8901J248K073Q79j395K706l26n8l735o585q43N959M657p172m723n97k04
$$ 18901 20149 22222 23101 21706 24412 24086 24028 20293 13708 12865 18824 23481 16309 11586 10989 10785
8130A0785q71N362K453J672N9J749J729q05J73n387m015Jk663j654L622j068n810
$$ 10785 9914 15276 17729 19401 19460 21209 22938 22133 22306 16919 12904 12905 10242 8588 12210 11142 5332
8113E332M131J620o432o223k28J1476P312j938k960K476K89l044o893j544l416
$$ 5332 9463 11083 4651 -1572 -1800 9676 16988 15050 12090 14566 14855 11811 4918 3374 -42
8098d2m940M526P03m344J073J0437J0265q97o754q120L218O457k898R38o95j1901
$$ -42 -4982 -456 247 -4097 -3024 7413 17678 16781 10027 1907 5125 11582 8684 9622 8927 -2974
8082b974k283M894P973J218k847J091L276M708K701m473k794Q34q58L307Q01j0057
$$ -2974 -5257 -363 7610 8828 5981 7072 10348 15056 17757 13284 10490 11324 10466 13773 14574 4517
8066D517L632N910l741M697O743J649k438m07q383n670k038J264L121M317K272
$$ 4517 8149 14059 10318 15015 21758 23407 20969 20562 12179 6509 4471 5735 8856 13173 15445
8051A5445k537m218P181K50N607O195o873N13q071k276l832j185K105n228M103
$$ 15445 12908 8690 15871 16121 21728 27923 21050 21563 13492 11216 7384 6199 8304 3076 7179
8036G179N679K486L485p684q086J67k769O609R75J1564j4k576m642m74O44J576
$$ 7179 12858 15344 18829 11145 3059 3226 457 7066 8041 19605 19591 17015 12373 11899 12543 14119
8020A4119O350L333K447n150j0774j0604l755R631M927P847K139o544o71l9m67
$$ 14119 20469 23802 26249 21099 10325 -279 -4034 5597 10524 18371 20510 13966 13295 13256 12789
8005A2789L200O529K258J998J537o23K789N320n195n347r230O78M164j4n664M143
$$ 12789 15989 22518 24776 26774 28311 27688 30477 35797 30602 25255 16025 16703 20867 20853 15189 19332
7989A9332M103j781p81n14j308k313l424k978J888o152j26j178M027L670L310
$$ 19332 23435 21654 20873 20359 19051 16738 13314 10336 12224 6072 5946 4768 8795 12465 15775
7974A5775Q404j202r722M445K456L067M476P584j837j746r981L053k151n7Q845
$$ 15775 24179 22977 13255 17700 20156 23223 27699 35283 33446 31700 21719 24772 22621 22564 31409
7959C1409M226o095K655K52q284p706j647R9N21J443m894l112K858J746O353k4
$$ 31409 35635 29540 32195 32447 24163 16457 14810 14909 15430 16873 11979 8867 11725 13471 19824 19800
7943A9800K015m519k781m431J924k74J943j402J335L830L623Q736L457m143o023
$$ 19800 21815 17296 14515 10084 12008 11734 13677 12275 13610 17440 21063 29799 33256 29113 23090
7928B3090l901J505K58j101k505j070L625m456l413l144O002Q38n245L424Q075
$$ 23090 19189 20694 20952 19851 17346 16276 19901 15445 12032 8888 14890 15728 10483 13907 21982
7913B1982L020l123m648j34L613k325J105K707k497n450p057p758L19P943j729
$$ 21982 25002 21879 17231 17097 20710 18385 19490 22197 19700 14250 7193 -565 -246 7697 5968
7898E968R396q11K579M811r519l836L539N709m82O131j09m978k235n033N23J636
$$ 5968 15364 14553 17132 21943 12424 8588 12127 17836 17354 23485 23376 18398 16163 11130 11653 13289
7882A3289p67M016o60r64L02K679k253k105r59P571l676p785P494j044l387M426
$$ 13289 12522 16538 15878 14914 15216 17895 15642 13537 12578 20149 16473 8688 16182 15138 11751 16177
7866A6177O98k893K286K789O067j441k665p04l841o222J376j17m208J572R435
$$ 16177 16875 13982 16268 19057 25124 23683 21018 20314 16473 10251 11627 11510 7302 8874 18309
7851A8309o19o711n135K174M190K029m272m361n859M377N963K710J898J370n588
$$ 18309 17690 10979 5844 8018 12208 14237 9965 5604 -255 4122 10085 12795 14693 16063 10475
7836A0475k123j968Q25M325j607m134l596L230m685N423J2523M538j1028q196
$$ 10475 8352 6384 7209 11534 9927 5793 2197 5427 742 6165 18688 23226 12198 4002
7822D002p5Q963J469r371l114o60L651Q746j488m434O898K83J551P92j0989p787
$$ 4002 3927 12890 14359 4988 1874 1214 4865 13611 12123 7689 14587 14870 16421 17213 6224 -1563
7806a563L400L232K634M151p273l800J063n76k069L46L764P949m4o736o624P81
$$ -1563 1837 5069 7703 11854 4581 781 1844 1268 -801 -455 3309 11258 11214 4478 -2146 -1365
7790a365J408L568l368l846j16n72m102j066M426k60J13j626r36O887P165Q09
$$ -1365 43 3611 243 -3603 -3719 -4291 -8393 -9459 -5033 -5293 -5180 -6806 -7742 -855 6310 7119
7774G119l354q15M634j220R76q09l082k338K784J262K674k305L932K263m322m670
$$ 7119 3765 2950 7584 6364 7340 6531 3449 1111 3895 5157 7831 5526 9458 11721 7399 2729
7758B729J227Q681J059j199l847n28J969n348K07L111L520j817p298o240L084
$$ 2729 3956 12637 13696 12497 8650 8122 10091 4743 4950 8061 11581 9764 2466 -3774 -690
7743f90M574J594O002J430n476n640K725n21j359l175l859k3k678M793L371M279
$$ -690 3884 5478 11480 12910 7434 1794 4519 3998 2639 -536 -4395 -4418 -7096 -2303 1068 5347
7727E347p333k874P625R30P89J37l195k49n221l09J492N820o163k857j547N117
$$ 5347 -1986 -4860 2765 3695 4484 4621 1426 1177 -4044 -4353 -2861 2959 -3204 -6061 -7608 -2491
7711b491L270J292l188J370K810O68n136L135J948m518l616M831P329O78o285
$$ -2491 779 2071 -1117 253 3063 3731 -1405 1730 3678 -840 -4456 375 7704 8382 2097
7696B097n525n524J456Q250J077l247N932O129L102m327l272k012J56N848J489
$$ 2097 -3428 -8952 -7496 754 1831 -1416 4516 10645 13747 9420 6148 4136 4292 10140 11629
7681A1629N64j916J16p41l966r624r9L3j493R52Q090N617N79n744j728P98J636
$$ 11629 12193 10277 10393 9652 5686 -3938 -4037 -4004 -5497 -4545 3545 9162 9741 3997 2269 3067 4703
7664D703o851J130J158J65M239j972L577P15K105J165n390m542l521J526J104
$$ 4703 -2148 -1018 140 305 4544 2572 6149 6864 8969 10134 4744 202 -3319 -1793 -689
7649f89r37L222m016m218M752Q787j46n24j2812n677P604N953K698n804m003o658
$$ -689 -1626 1596 -2420 -6638 -1886 6901 6755 6231 -6581 -12258 -4654 1299 3997 -1807 -5810 -12468
7633a2468p879l80N729M691j906l625J2265P691o654L067J993j0200k615L570
$$ -12468 -20347 -20727 -14998 -10307 -12213 -15838 -3573 4118 -2536 531 2524 -7676 -10291 -6721
7619f721M671K678m179R40L759L995M231q732m277j341N209R10m454m467J31K221
$$ -6721 -2050 628 -3551 -2611 1148 5143 9374 642 -3635 -4976 233 1143 -3311 -7778 -7647 -5426
7603e426O911P721K939k676m397p206k731O264K187l551N089J886m236q727K035
$$ -5426 1485 9206 12145 9469 5072 -2134 -4865 1399 3586 35 5124 7010 2774 -5953 -3918
7588c918k413K048L133k455K098Q234K654k349l636M904k454o458k122k183J854
$$ -3918 -6331 -4283 -1150 -3605 -1507 6727 9381 7032 3396 8300 5846 -612 -2734 -4917 -3063
7573c063M273L601l87J161J732k091o703k713N088Q725p52l762K210k30k129j215
$$ -3063 1210 4811 4424 5585 7317 5226 -1477 -4190 898 9623 8871 5109 7319 7089 4960 3745
7557C745M133n137o351l010m12k113M217J0526Q83q140m222J0044j832j0429n227
$$ 3745 7878 2741 -3610 -6620 -7032 -9145 -4928 5598 6481 -1659 -5881 4163 2331 -8098 -13325
7542a3325K804P116N314m626P188M968K211k171q114p001J339P859O798j139n384
$$ -13325 -10521 -3405 1909 -2717 4471 9439 11650 9479 1365 -5636 -4297 3562 10360 9221 3837
7527C837o87m896j468m006L117K336m065L973K298l749j062r36J157Q246r69q678
$$ 3837 3150 -1746 -3214 -7220 -4103 -1767 -5832 -1859 439 -3310 -4372 -5308 -4151 4095 3126 -5552
7511e552p37K928M457K417k172N618K990q970p717p26J840r69K060L791K17n13
$$ -5552 -6289 -3361 1096 3513 1341 6959 9949 979 -6738 -7464 -5624 -6593 -4533 -742 -525 -1038
7495a038N164n397P76L526j580r71m929L70L430L217p81k839j191Q80j901Q741
$$ -1038 4126 -1271 -495 3031 1451 480 -4449 -4079 -649 2568 1787 -1052 -2243 -1363 -3264 5477
7479E477N509k208r808p816K429P179L475k158J999j946l343n642j295r32K878
$$ 5477 10986 8778 -1030 -8846 -6417 762 4237 2079 4078 2132 -1211 -6853 -8148 -9080 -6202
7464f202M705L322p206j095J0005O129J15o924p333L914J046k885O804k143l643
$$ -6202 -1497 1825 -5381 -6476 3529 9658 9773 2849 -4484 -570 476 -2409 4395 2252 -1391
7449a391K426N051m83n364L663J298J477Q12o393m114q74J0889k289r099n960
$$ -1391 1035 6086 5603 239 3902 5200 6677 7489 1096 -3018 -3892 6997 4708 -4391 -10351
7434a0351L922j931J168K472P588r7o41J010l299l974o819l871K473q18L230L157
$$ -10351 -6429 -8360 -7192 -4720 2868 2771 2130 3140 -159 -4133 -10952 -14823 -12350 -13168 -9938 -6781
7418f781M744O632r59p118N244q315m708N891M328P177k722K554P91l846o426
$$ -6781 -2037 4595 3636 -3482 1762 -6553 -11261 -5370 -1042 6135 3413 5967 6758 2912 -3514
7403c514K982j065M663J596m224m133O388K954l667k114k201K161L392j386o146
$$ -3514 -532 -1597 3066 4662 438 -3695 2693 5647 1980 -134 -2335 -174 3218 1832 -4314
7388d314o497L443J901L31L982k388L892J049M345O922m559O49p35J317k827r153
$$ -4314 -10811 -7368 -5467 -5136 -1154 -3542 350 1399 5744 12666 8107 8756 8021 9338 6511 -2642
7372b642q725j009O385P757k862K97J0472O759m849j753o474k291p199K401P744
$$ -2642 -11367 -12376 -5991 1766 -1096 -799 9673 16432 11583 9830 3356 1065 -6134 -3733 4011
7357D011K268l408j580M202L519J054l625o593J683k589N517J624R50j163l248
$$ 4011 6279 2871 1291 5493 9012 10066 6441 -152 1531 -1058 4459 6083 7033 5870 2622
7342B622m289o192k980L090O852M7K99O16K597j810l4J891J044n55m530K735J123
$$ 2622 -1667 -7859 -10839 -7749 -897 -850 -551 65 2662 852 818 2709 3753 3198 -1332 1403 2526
7325B526L687n03o945l074K752J200o360K411K800O157K936j0520j965R221j67
$$ 2526 6213 5710 -1235 -4309 -1557 -357 -6717 -4306 -1506 4651 7587 -2933 -4898 4323 4156
7310D156j0057Q63O300L95K382M557m562q458l901M666J467K60J073P790k004
$$ 4156 -5901 -5038 1262 1657 4039 8596 4034 -4424 -8325 -3659 -2192 -1932 -859 6931 4927
7295D927j093r45J335J043q380m131P508K182P80l472n059j358L679J59j671L759
$$ 4927 3834 2889 4224 5267 -3113 -7244 264 2446 3226 -246 -5305 -6663 -2984 -2825 -4496 -737
7279g37L357J943l946N05K389M713M062l232k861n490k75P8J584k394q47k466
$$ -737 2620 4563 617 1122 3511 8224 12286 9054 6193 703 428 506 2090 -304 -1151 -3617
7263c617o507r4N590o32j728N656O576k675k621M267K504P60p215m108J708P96
$$ -3617 -10124 -10218 -4628 -5260 -6988 -1332 5244 2569 -52 4215 6719 7479 264 -3844 -2136 -1340
7247a340k311k102M987l55K831J455M450o43l615m945Q58P80L977r3L267R7o841
$$ -1340 -3651 -5753 -766 -1121 1710 3165 7615 6972 3357 -1588 -730 50 4027 3934 7201 7298 457
7230D57o488M523J768l200L559m967K444K820l893M7q10N28O490m076k407J270
$$ 457 -6031 -1508 260 -2940 619 -4348 -1904 916 -2977 -2930 -3740 -3212 3278 -798 -3205 -1935
7214a935P608O438J34n718k701r46m409l836Q702Q39o677l502j330M287N913K027
$$ -1935 5673 12111 12245 6527 3826 2880 -1529 -5365 3337 4176 -2501 -6003 -7333 -3046 2867 4894
7198D894m105J666N794L030Q95m287l130j484j617k93m181m792l057n517N91P23
$$ 4894 789 2455 8249 11279 12174 7887 4757 3273 1656 1363 -2818 -7610 -10667 -16184 -15593 -14870
7182a4870P30K279L298K099j144j446R783K831p4M046J89k443J56K056J188J290
$$ -14870 -14140 -11861 -8563 -6464 -7608 -9054 729 3560 3486 7532 7721 5278 5434 7490 8678 9968
7166I968J000q233k647k274N55J684J798K345N389R16r921m92L151n233p145Q24
$$ 9968 10968 2735 88 -2186 -1631 53 1851 4196 9585 10501 580 88 3239 -1994 -9139 -8315
7150h315P728P452q27o133K224j834k666N823p041R24L41R83M8r35R288K665l877
$$ -8315 -587 6865 6038 -95 2129 295 -2371 3452 -3589 -2665 -2324 -1341 -1293 -2228 7060 9725 5848
7133E848l549q567k204n946O661O311Q855L3l440q006m415O067M516m47o505k007
$$ 5848 2299 -6268 -8472 -14418 -7757 -1446 7409 7442 4002 -4004 -8419 -2352 2164 1717 -4788 -6795
7117f795o37K866N55K976J817l907J729Q3k462M206n20n519L061p7k149K921M974
$$ -6795 -7432 -4566 -4011 -1035 782 -3125 -1396 -1313 -3775 431 -89 -5608 -2547 -2624 -4773 -1852 3122
7100C122l878k753j0J0004k601l01L402J555l633M887L662j951p594O80k6L63
$$ 3122 -756 -3509 -3519 6485 3884 3583 6985 8540 4907 9794 13456 11505 3911 4591 4565 4928
7084D928K217l842n95R32J995k956K872J547q679n070J199J0942k314o173K222
$$ 4928 7145 3303 2708 3640 5635 2679 5551 7098 -1581 -6651 -5452 5490 3176 -2997 -775
7069g75L323j190N4l608J354k163k830K891n942m066L482J787Q002K472L009l473
$$ -775 2548 1358 1412 -2196 -842 -3005 -5835 -2944 -8886 -12952 -9470 -7683 319 2791 5800 2327
7053B327r18j799o662m254K932j7M524J860l653n145m982k277L800J3876J580
$$ 2327 1409 -390 -7052 -11306 -8374 -8391 -3867 -2007 -5660 -10805 -15787 -18064 -14264 -388 1192
7038A192m545k062N62K105M472N878k969n060n220L101L284M355J127K389K810
$$ 1192 -3353 -5415 -4853 -2748 1724 7602 4633 -427 -5647 -2546 738 5093 6220 8609 11419
7023A1419k727j860j260n088q827j525l58m68K755J0719P350m13j176j727n596
$$ 11419 8692 6832 5572 484 -8343 -9868 -10226 -10694 -7939 2780 10130 9717 8541 6814 1218
7008A218o519l975k801R453J1224L664J805J206l17j933j929q807k186k736k473
$$ 1218 -5301 -9276 -12077 -2624 8600 12264 14069 15275 14958 13025 11096 2289 103 -2633 -5106
6993e106k158L283j521k263J093L610J898L113L106l715K031O559o105k89L642
$$ -5106 -7264 -3981 -5502 -7765 -6672 -3062 -1164 1949 5055 1340 3371 9930 3825 3536 7178
6978G178R60j120m39o170k184M050l902n37j433j46k077N162L530l260k08N210
$$ 7178 8138 7018 6579 409 -1775 2275 -1627 -2164 -3597 -3743 -5820 -658 2872 -388 -596 4614
6962D614L263P47j642m965K413j58j989j071Q41o53k699o297Q93O347l684q2Q686
$$ 4614 7877 8624 6982 2017 4430 4272 2283 1212 2053 1400 -1299 -7596 -6703 -356 -4040 -4122 4564
6945D564J302k55K982q497n073M517J112k860k334l986O899O578L995M419k717
$$ 4564 5866 5611 8593 96 -4977 -460 652 -2208 -4542 -8528 -1629 4949 8944 13363 10646
6930A0646n223o962j127J657m776m568o05j230N551k27l692k414J949L064o79
$$ 10646 5423 -1539 -2666 -1009 -5785 -10353 -10958 -12188 -6637 -6864 -10556 -12970 -11021 -7957 -8636
6915h636P954M711j839k189O64K407L908m331j062k527k368m243L909K47l507
$$ -8636 -682 4029 2190 1 665 3072 6980 2649 1587 -940 -3308 -7551 -3642 -3395 -6902
6900f902K461K536K799K152k766K451K795m14p700j464j5q442p848L358j879Q250
$$ -6902 -4441 -1905 894 3046 280 2731 5526 5112 -2588 -4052 -4067 -12509 -20357 -16999 -18878 -10628
6884a0628Q302l579J145Q747K334J74l289j505k211k710j800R61M5K945L880K96
$$ -10628 -2326 -5905 -4760 3987 6321 6495 3206 1701 -510 -3220 -5020 -4059 -4014 -1069 2811 3107
6868C107m203M446N285k067k97m68O500k284q131l977J845M827k273q316n589
$$ 3107 -1096 3350 8635 6568 6271 5803 12303 10019 1888 -2089 -244 4583 2310 -6006 -11595
6853a1595j694N952J0629R485m232p546L19K277k053k766K13L046K048P507J399
$$ -11595 -13289 -7337 3292 12777 8545 999 1318 3595 1542 -1224 -1011 2035 4083 11590 12989
6838A2989p039p337j459p363m067R213P103M723k912J39m977N853J827o300j659
$$ 12989 5950 -1387 -2846 -10209 -14276 -5063 2040 6763 3851 3990 -987 4866 6693 393 -1266
6823a266R68j629J381Q55K151j674k209j529N421l432l398l80l563j939M3J252
$$ -1266 -298 -1927 -546 309 2460 786 -1423 -2952 2469 -963 -4361 -4741 -8304 -10243 -10200 -8948
6807h948N392J766m006j347N264N355Q54k478o92L242P88L738j971p116k512J573
$$ -8948 -3556 -1790 -5796 -7143 -1879 3476 4330 1852 1160 4402 5190 8928 6957 -159 -2671 -1098
6791a098l377l960m817N906P572K418j592P55J279J927r97l433j290L030J360
$$ -1098 -4475 -8435 -13252 -7346 226 2644 1052 1807 3086 5013 4016 583 -707 2323 3683
6776C683M831O43l21p906p078P31j570O91K780O058J91r852m784j674K148L820
$$ 3683 8514 9157 8836 930 -6148 -5417 -6987 -6296 -3516 2542 2733 -7119 -11903 -13577 -11429 -7609
6760g609L514R817L817k102p948O97j663j2l492j482q98n027n43L946L909M021
$$ -7609 -4095 5722 9539 7437 -511 186 -1477 -1489 -4981 -6463 -7361 -12388 -12931 -8985 -5076 -1055
6744a055J031M84k209N24K311L493M995k161o267k321j629q927l987N264P115
$$ -1055 -24 460 -1749 -1225 1086 4579 9574 7413 1146 -1175 -2804 -11731 -15718 -10454 -3339
6729c339L833N250M65n167k179J581N64k251O16j78J950R00L139p82m951O454
$$ -3339 494 5744 6209 1042 -1137 444 1008 -1243 -627 -805 1145 2045 5184 4402 -549 5905
6713E905J621j87o298J186J470n07l190l947J377P648M504l333p168k918m345
$$ 5905 7526 7339 1041 2227 3697 3190 0 -3947 -2570 5078 9582 6249 -919 -3837 -8182
6698h182K673M577L517k575l80Q48l097M06N771m670R10k175p19k574P88L379
$$ -8182 -5509 -932 2585 10 -370 478 -2619 -2213 3558 -1112 -202 -2377 -3096 -5670 -4882 -1503
6682a503K258n103K968K13j494n779M84M948k140K711K663J500m24M04J961K840
$$ -1503 755 -4348 -1380 -1167 -2661 -8440 -7956 -3008 -5148 -2437 226 1726 1302 1706 3667 6507
6666F507q325k797o325N4M904K554n05k026j183K308M959Q375P51l119n485k067
$$ 6507 -1818 -4615 -10940 -10886 -5982 -3428 -3933 -5959 -7142 -4834 125 8500 9251 6132 647 -1420
6650a420M994k593j2073j30p410j092Q445O464P255m068k109M078J003m297j497
$$ -1420 3574 981 -11092 -11222 -18632 -19724 -11279 -4815 2440 -1628 -3737 341 1344 -2953 -4450
6635d450j044R4K170j762k937M752N070L605o754k738l579L029K182M421J014
$$ -4450 -5494 -5400 -3230 -4992 -7929 -3177 1893 5498 -1256 -3994 -7573 -4544 -2362 2059 3073
6620C073l432m145L170k125o147O198K892R977j717m233k203j749J0570Q35o185
$$ 3073 -359 -4504 -1334 -3459 -9606 -3408 -516 9461 7744 3511 1308 -441 10129 10964 4779
6605D779n338J018m422k066j102j900n513N382O194m813L90L364p4j269n763j970
$$ 4779 -559 459 -3963 -6029 -7131 -9031 -14544 -9162 -2968 -7781 -7391 -4027 -4101 -5370 -11133 -13103
6589a3103M220k705K87O405O55K612n297m840M960K318L706J688K269j574m240
$$ -13103 -8883 -11588 -11301 -4896 -4241 -1629 -6926 -11766 -6806 -4488 -782 906 3175 1601 -2639
6574b639o492L96O125L278N221j443n22j117m293l32O28p072p365M466Q913L162
$$ -2639 -9131 -8735 -2610 668 5889 4446 3924 2807 -1486 -1818 -1190 -8262 -15627 -11161 -2248 914
6558I14J742L555K466j231k417o051O18M777L13m464l250L93M647o811l416j090
$$ 914 2656 6211 8677 7446 5029 -1022 -404 4373 4686 222 -3028 -2635 2012 -4799 -8215 -9305
6542i305O253P654M46k573k919L800J640L564q26q159l278p8m018J978M325N141
$$ -9305 -3052 4602 5048 2475 -444 3356 4996 8560 7734 -425 -3703 -3781 -7799 -5821 -1496 3645
6526C645j668j0624j652l212O116O490P27m813p306k776O60Q618R990Q39N5K6
$$ 3645 1977 -8647 -10299 -13511 -7395 -905 -178 -4991 -12297 -15073 -14413 -5795 4195 5034 5089 5115
6510E115m407l735o068n226J086m297K099N578Q48M906o9J065m565m051M679l24
$$ 5115 708 -3027 -9095 -14321 -13235 -17532 -15433 -9855 -9007 -4101 -4170 -3105 -7670 -11721 -7042 -7366
6494g366M890M865l618k632k335J295j041M406N007k61j583l206o869j99J219
$$ -7366 -2476 2389 -1229 -3861 -6196 -4901 -5942 -1536 3471 3210 1627 -1579 -8448 -8647 -7428
6479g428M513O785J971p041K477K85k900N10K68m865k283N261J405k1N836k983
$$ -7428 -2915 3870 5841 -1200 1277 1562 -1338 -828 -560 -5425 -7708 -2447 -1042 -1063 4773 1790
6463A790m221J562M06l900p935L122K980O40k444M60K701Q05J258j689N561O344
$$ 1790 -2431 -869 -463 -4363 -12298 -9176 -6196 -5556 -8000 -7540 -4839 -4034 -2776 -4465 1096 7440
6447G440L897o262j392j77r172m769L020k29j449l26L930j786O406L568J306k686
$$ 7440 11337 5075 3683 3506 -5666 -10435 -7415 -7644 -9093 -9419 -5489 -7275 -869 2699 4005 1319
6431A319K424k831j6R283J316o241L792j00k415K904l40m902o749J618j974K48
$$ 1319 3743 912 896 10179 11495 5254 9046 8946 6531 9435 9095 4193 -2556 -938 -2912 -2664
6415b664P686J129j435l767N39m395l248k114J8N106J793J31k797j554L901M029
$$ -2664 5022 6151 4716 949 1488 -2907 -6155 -8269 -8251 -3145 -1352 -1221 -4018 -5572 -1671 2358
6399B358l414m04m352P79K4L156j765K42N684J2175J368q57J321K50q029o030
$$ 2358 -1056 -1460 -5812 -5033 -5009 -1853 -3618 -3376 2308 14483 15851 14994 16315 16565 8536 2506
6383B506M216M209j1482m520J632R528M357k527j686o074n417j412L97M837K627
$$ 2506 6722 10931 -551 -5071 -3439 6089 10446 7919 6233 159 -5258 -6670 -6273 -1436 1191
6368A191l117l160P04j736p96O51M570j839O91N000K143k460j999n751J772N151
$$ 1191 -1926 -5086 -4382 -6118 -6914 -6263 -1693 -3532 -2841 2159 4302 1842 -157 -5908 -4136 1015
6352A015j8m782J981L548r11L885K595K676j985p486j2083j861P44Q31Q428J416
$$ 1015 997 -3785 -1804 1744 833 4718 7313 9989 8004 518 -11565 -13426 -12682 -11851 -3423 -2007
6336b007p358L682L311K453k516o274n212O458J0015J801K153o802m887M72J120
$$ -2007 -9365 -5683 -2372 81 -2435 -8709 -13921 -7463 2552 4353 6506 -296 -5183 -4711 -3591
6321c591L87J06K190j664k126L278M781P446K519j0187j0450n724J4188R577k225
$$ -3591 -3204 -3098 -908 -2572 -4698 -1420 3361 10807 13326 3139 -7311 -13035 1153 10730 8505
6306H505kn663m743K983J865K820K6p175j995L340j193O010J679l501p37j96l222
$$ 8505 8503 2840 -1903 1080 2945 5765 5791 -1384 -3379 -39 -1232 4778 6457 2956 2219 2023 -1199
6289a199O52m88j030m55n414k578M588P352m448M24L737L544l82N52L240M272
$$ -1199 -547 -1035 -2065 -2520 -7934 -10512 -5924 1428 -3020 -2596 1141 4685 4303 4855 8095 12367
6273A2367J436l760k120m109j524K086J448n815j795j417J0442r85k251L518m501
$$ 12367 13803 10043 7923 3814 2290 4376 5824 9 -1786 -3203 7239 6254 4003 7521 3020
6258C020p332q103n730L778K218M496K910K221J581K552k864K218r91J60p0M30
$$ 3020 -4312 -12415 -18145 -14367 -12149 -7653 -4743 -2522 -941 1611 -1253 965 -26 134 64 494
6242D94j536j995L960n282j918Q856L918J500k050M719j75n674o155K963L345
$$ 494 -1042 -3037 923 -4359 -6277 2579 6497 7997 5947 10666 10491 4817 -1338 1625 4970
6227D970k308j413O330J987K896l141r098j102p373m316M936P14p870P695O292
$$ 4970 2662 1249 7579 9566 12462 9321 223 -879 -8252 -12568 -7632 -6918 -14788 -7093 -801
6212h01j799q84j649o485K020K360N830J497K385J24K409J544k728j505K80o000
$$ -801 -2600 -3484 -5133 -11618 -9598 -7238 -1408 89 2474 2598 5007 6551 3823 2318 2598 -3402
6196c402l272N76K857L109k979l333l245o422J323K766k909M090J968N990N500
$$ -3402 -6674 -6098 -3241 -132 -3111 -6444 -9689 -16111 -14788 -12022 -14931 -10841 -8873 -2883 2617
6181B617L182L013k072m687K020n268k348N050m792j910P809O860J545k619K680
$$ 2617 5799 8812 6740 2053 4073 -1195 -3543 1507 -3285 -5195 2614 9474 11019 8400 11080
6166A1080K61j789r426q1K757J605l26J363J383R77L150o6k198n617K218N263
$$ 11080 11341 9552 126 45 2802 4407 4081 5444 6827 7804 10954 10888 8690 3073 5291 10554
6150A0554L565n445p039o104k312Q224P514p243j889J751k419q618J415P052N648
$$ 10554 14119 8674 1635 -4469 -6781 1443 8957 1714 -175 1576 -843 -9461 -8046 -994 4654
6135D654m425m05o43k575n608P567P30m415P314J714n175l831K647J203k507j311
$$ 4654 229 -176 -819 -3394 -9002 -1435 -705 -5120 2194 3908 -1267 -5098 -2451 -1248 -3755 -5066
6119e066J664j26R81o23M425R76j74K992k897o544J513l013j059O579j20J875
$$ -5066 -3402 -3528 -2547 -3170 1255 2231 2057 5049 2152 -4392 -2879 -5892 -6951 -372 -492 1383
6103A383n529k789j376J6006K077o606k668N033R337l12j456p957p803L645J181
$$ 1383 -4146 -6935 -8311 7695 9772 3166 498 5531 14868 14556 13100 5143 -2660 985 2166
6088B166n814K171O236J765j143Q37k443p151r45P204j587k795L225j967n16k681
$$ 2166 -3648 -1477 4759 6524 5381 6218 3775 -3376 -4321 2883 1296 -1499 1726 -241 -757 -3438
6072c438M457K521N17j0853o859R143R681l824j973k716J007p231o890M941N351
$$ -3438 1019 3540 4057 -6796 -13655 -4512 5169 1345 -628 -3344 -2337 -9568 -16458 -11517 -6166
6057f166p836L446L356P788J661N646N99k180m713J123M327M991J246m188p830
$$ -6166 -14002 -10556 -7200 588 2249 7895 8494 6314 1601 2724 7051 12042 13288 9100 1270
6042A270o382k044J0814L603n212j757K898L550Q83L296n923k043O76L76l315
$$ 1270 -5112 -7156 3658 7261 2049 292 3190 6740 7623 10919 4996 2953 3629 4005 690
6027F90k920M286K792j165m238n612L799K569K564K61q639p779K596Q880K637
$$ 690 -2230 2056 4848 3683 -555 -6167 -2368 201 2765 3026 -5613 -13392 -10796 -1916 721
6012G21j850M426L788p655J016K147k238N411K555l891m550K397j033J296K58
$$ 721 -1129 3297 7085 -570 446 2593 355 5766 8321 4430 -120 2277 1244 2540 2798
5997B798M632j198n186l335J838k548J649m14k000J566l65N87j475m860K353K372
$$ 2798 7430 6232 1046 -2289 -451 -2999 -1350 -1764 -3764 -2198 -2563 -1976 -3451 -8311 -5958 -3586
5981c586k184j147l371K771M033P89j475l282L026p234m084P056K288K992k03
$$ -3586 -5770 -6917 -10288 -7517 -3484 -2695 -4170 -7452 -4426 -11660 -15744 -8688 -6400 -3408 -3611
5966c611M495N393j215o610J03n167o22k516o335J679L725M796p27l264L644j762
$$ -3611 884 6277 5062 -1548 -1445 -6612 -7234 -9750 -16085 -14406 -10681 -5885 -6612 -9876 -6232 -7994
5950g994O74M987J145j037l768K413J07K016O797L339k761k692n934j21l357l572
$$ -7994 -7320 -2333 -1188 -2225 -5993 -3580 -3473 -1457 5340 8679 5918 3226 -2708 -2829 -6186 -9758
5934i758P184N976N844m546m297L903p99J140K376P33J781J816j559k313q004
$$ -9758 -2574 3402 9246 4700 403 4306 3507 4647 7023 7756 9537 11353 9794 7481 -523
5919e23m673q91J119O173J862l9l863L385k048o75j458K294N3o019k160O202K485
$$ -523 -5196 -6087 -4968 1205 3067 3028 -835 2550 502 -173 -1631 663 716 -5303 -7463 -1261 1224
5902A224j758p967J192R351k396j347l807m143M375K282M47L70J866N96K294k113
$$ 1224 -534 -8501 -7309 2042 -354 -1701 -5508 -9651 -5276 -2994 -2547 -2177 -311 285 2579 466
5886D66m542m517k413N897n93j325j743L583L707l024K476M764L136j889n535
$$ 466 -4076 -8593 -11006 -5109 -5702 -7027 -8770 -5187 -1480 -4504 -2028 2736 5872 3983 -1552
$$ [...]
##END NTUPLES=NMR SPECTRUM
##END=
