##TITLE=Analysis number 318802
Compound Code aw 00210
Project Code adrs
Chemist Name melford
##JCAMPDX= 6.0         $$ Bruker NMR JCAMP-DX V2.0
##DATA TYPE= NMR SPECTRUM
##DATA CLASS= NTUPLES
##ORIGIN= Bruker BioSpin GmbH
##OWNER= nmr
$$ XWIN-NMR		Version 3.5
$$ Tue Apr 18 13:52:06 2006 GMT Daylight Time (UT+1h)  MAYBRIDGE\nmr@NMR_250MHZ
##.OBSERVE FREQUENCY= 250.131544655141
##.OBSERVE NUCLEUS= ^1H
##.ACQUISITION MODE= SIMULTANEOUS (DQD)
##.ACQUISITION SCHEME= undefined
##.AVERAGES= 16
##.DIGITISER RES= 18
##SPECTROMETER/DATA SYSTEM= dpx250
##.PULSE SEQUENCE= zg30
##.SOLVENT NAME= CDCl3
##.SHIFT REFERENCE= (INTERNAL, CDCl3, 0, 16.522)
##AUDIT TRAIL= $$ (NUMBER, WHEN, WHO, WHERE, WHAT)
$$ ##TITLE= Audit trail, XWIN-NMR		Version 3.5
$$ ##JCAMPDX= 5.01
$$ ##ORIGIN= Bruker BioSpin GmbH
$$ ##OWNER= nmr
$$ C:\u/data/dgb/nmr/ADRS/2670/pdata/1/auditp.txt
$$ ##AUDIT TRAIL=  $$ (NUMBER, WHEN, WHO, WHERE, WHAT)
(   1,<2006-04-18 13:51:41.16 +100>,<MAYBRIDGE\nmr>,<NMR_250MHZ>,
      <created by zg, POWCHK disabled, PULCHK disabled
       configuration hash MD5:
       84 BC 41 DB A1 6E 1D 46 DA 25 12 A5 C1 ED C5 3A
       data hash MD5: 64K
       46 9B 19 77 86 A4 9E B0 61 B7 30 33 E2 80 05 51>)
(   2,<2006-04-18 13:51:53.58 +100>,<MAYBRIDGE\nmr>,<NMR_250MHZ>,
      <Start of raw data processing
       ef LB = 0.3 FT_mod = 6 PKNL = 1 SI = 32K 
       data hash MD5: 32K
       17 E6 66 C2 84 EC 23 8A D4 B7 EF 5C 72 D2 56 30>)
(   3,<2006-04-18 13:51:55.89 +100>,<MAYBRIDGE\nmr>,<NMR_250MHZ>,
      <apk 
       data hash MD5: 32K
       98 A8 0A 5E D4 A4 EB 51 27 5F 17 AA 2B 79 4D 30>)
(   4,<2006-04-18 13:51:56.87 +100>,<MAYBRIDGE\nmr>,<NMR_250MHZ>,
      <abs ABSG = 5 
       data hash MD5: 32K
       AC BF AA DA 64 91 D3 C3 59 23 3D 10 A2 5E B9 3E>)
$$ ##END=
$$ 
$$ hash MD5
$$ 13 DB 04 83 EF 52 03 A3 F3 72 D7 4C 82 89 02 FB
##$RELAX= 
##$RELAX= 
##$RELAX= 
##$RELAX= 
##$RELAX= 
##$RELAX= 
##$RELAX= 
$$ Bruker specific parameters
$$ --------------------------
##$DU= <C:\u>
##$EXPNO= 2670
##$NAME= <ADRS>
##$PROCNO= 1
##$TYPE= <nmr>
##$USER= <dgb>
##$AMP= (0..31)
100 100 100 100 100 100 100 100 100 100 100 100 100 100 100 100 100 100 
100 100 100 100 100 100 100 100 100 100 100 100 100 100 
##$AQSEQ= 0
##$AQ_mod= 3
##$AUNM= <au_zg>
##$AUTOPOS= <48 >
##$BF1= 250.13
##$BF2= 250.13
##$BF3= 250.13
##$BF4= 250.13
##$BF5= 500.13
##$BF6= 500.13
##$BF7= 500.13
##$BF8= 500.13
##$BYTORDA= 1
##$CFDGTYP= 0
##$CFRGTYP= 5
##$CHEMSTR= <none>
##$CNST= (0..31)
1 1 145 1 1 1 1 1 1 1 1 1 1 1 1 1 1 1 1 1 1 1 1 1 1 1 1 1 1 1 1 1 
##$CPDPRG= <>
##$CPDPRG1= <>
##$CPDPRG2= <>
##$CPDPRG3= <>
##$CPDPRG4= <mlev>
##$CPDPRG5= <mlev>
##$CPDPRG6= <mlev>
##$CPDPRG7= <mlev>
##$CPDPRG8= <mlev>
##$CPDPRGB= <>
##$CPDPRGT= <>
##$D= (0..31)
0 1 0 0 0 0 0 0 0 0.06 0 0 0 0 0 0 0.0002 0 0 0 0 0 0 0 0 0 0 0 0 0 0 
0 
##$DATE= 1145364699
##$DBL= (0..7)
120 120 120 120 120 120 120 120 
##$DBP= (0..7)
150 150 150 150 150 150 150 150 
##$DBP07= 0
##$DBPNAM0= <>
##$DBPNAM1= <>
##$DBPNAM2= <>
$$ [...]
##$SUBNAM7= <"">
##$SUBNAM8= <"">
##$SUBNAM9= <"">
##$SW= 20.6930455092707
##$SWIBOX= (0..15)
0 0 3 0 0 0 0 0 0 0 0 0 0 0 0 0 
##$SW_h= 5175.983436853
##$TD= 65536
##$TD0= 1
##$TE= 294.16
##$TE2= 300
##$TE3= 300
##$TEG= 300
##$TL= (0..7)
0 120 120 120 120 120 120 120 
##$TP= (0..7)
150 150 150 150 150 150 150 150 
##$TP07= 0
##$TPNAME0= <>
##$TPNAME1= <>
##$TPNAME2= <>
##$TPNAME3= <>
##$TPNAME4= <>
##$TPNAME5= <>
##$TPNAME6= <>
##$TPNAME7= <>
##$TPOAL= (0..7)
0.5 0.5 0.5 0.5 0.5 0.5 0.5 0.5 
##$TPOFFS= (0..7)
0 0 0 0 0 0 0 0 
##$TUNHIN= 0
##$TUNHOUT= 0
##$TUNXOUT= 0
##$USERA1= <user>
##$USERA2= <user>
##$USERA3= <user>
##$USERA4= <user>
##$USERA5= <user>
##$V9= 5
##$VALIST= <valist>
##$VCLIST= <CCCCCCCCCCCCCCC>
##$VD= 0
##$VDLIST= <DDDDDDDDDDDDDDD>
##$VPLIST= <PPPPPPPPPPPPPPP>
##$VTLIST= <TTTTTTTTTTTTTTT>
##$WBST= 1024
##$WBSW= 4
##$XGAIN= (0..3)
0 0 0 0 
##$XL= 0
##$YL= 0
##$YMAX_a= 650354
##$YMIN_a= -611928
##$ZGOPTNS= <>
##$ZL1= 120
##$ZL2= 120
##$ZL3= 120
##$ZL4= 120
##$ABSF1= 16.522
##$ABSF2= -4.171173
##$ABSG= 5
##$ABSL= 3
##$ALPHA= 0
##$AQORDER= 0
##$ASSFAC= 0
##$ASSFACI= 0
##$ASSFACX= 0
##$ASSWID= 0
##$AUNMP= <proc_1d>
##$AZFE= 0.1
##$AZFW= 0.1
##$BCFW= 0
##$BC_mod= 0
##$BYTORDP= 0
##$COROFFS= 0
##$CY= 12.5
##$DATMOD= 1
##$DC= 0
##$DFILT= <>
##$DTYPP= 0
##$F1P= 14.0000005364418
##$F2P= -0.99999901652339
##$FCOR= 0.5
##$FTSIZE= 32768
##$FT_mod= 6
##$GAMMA= 0
##$GB= 0
##$INTBC= 1
##$INTSCL= 1
##$ISEN= 128
##$LB= 0.3
##$LEV0= 0
##$LPBIN= 0
##$MAXI= 10000
##$MC2= 0
##$MEAN= 0
##$ME_mod= 0
##$MI= 0
##$NCOEF= 0
##$NC_proc= -3
##$NLEV= 6
##$NOISF1= 0
##$NOISF2= 0
##$NSP= 0
##$NTH_PI= 0
##$NZP= 0
##$OFFSET= 16.522
##$PC= 1
##$PHC0= 25.04961
##$PHC1= -8.273059
##$PH_mod= 1
##$PKNL= yes
##$PPARMOD= 0
##$PSCAL= 4
##$PSIGN= 0
##$REVERSE= no
##$SF= 250.13
##$SI= 32768
##$SIGF1= 0
##$SIGF2= 0
##$SINO= 400
##$SIOLD= 32768
##$SREGLST= <1H.CDCl3>
##$SSB= 0
##$STSI= 32768
##$STSR= 0
##$SW_p= 5175.98343685301
##$SYMM= 0
##$S_DEV= 0
##$TDeff= 65536
##$TDoff= 0
##$TI= <Analysis number 999999
Compound Code 99
Book Reference 9
Project Code 9>
##$TILT= no
##$TM1= 0
##$TM2= 0
##$TOPLEV= 0
##$USERP1= <user>
##$USERP2= <user>
##$USERP3= <user>
##$USERP4= <user>
##$USERP5= <user>
##$WDW= 1
##$XDIM= 32768
##$YMAX_p= 526339728
##$YMIN_p= -237383
$$ End of Bruker specific parameters
$$ ---------------------------------
##NTUPLES= NMR SPECTRUM
##VAR_NAME=  FREQUENCY,     SPECTRUM/REAL,   SPECTRUM/IMAG
##SYMBOL=    X,             R,               I
##VAR_TYPE=  INDEPENDENT,   DEPENDENT,       DEPENDENT
##VAR_FORM=  AFFN,          ASDF,            ASDF
##VAR_DIM=   32768,         32768,           32768
##UNITS=     HZ,            ARBITRARY UNITS, ARBITRARY UNITS
##FACTOR=    0.157963299565203, 1,           1
##FIRST=     4132.6476996994, 0,             0
##LAST=      -1043.33573715361, 0,           0
##MIN=       -1043.33573715361, -237383,     0
##MAX=       4132.6476996994, 526339728,     0
$$ Real data points
##PAGE= N=1
##DATA TABLE= (X++(R..R)), XYDATA
$$ [...]
15161g60J942p09P67K694J550j184l139k595J100M131O4k212j163M73J892m211
$$ -760 1182 473 1240 3934 5484 4300 1161 -1434 -334 3797 3861 1649 486 959 2851 -1360
15145a360n051L94M221K880J676N65j70l420J133j012L180R06m033k154j937K332
$$ -1360 -6411 -6017 -1796 1084 2760 3325 3155 -265 868 -144 3036 3942 -91 -2245 -4182 -1850
15129a850J53k425N626K761Q98J98m975N28l969j056M392M038J023K63k069l009
$$ -1850 -1697 -4122 1504 4265 5163 5361 386 914 -3055 -4111 281 4319 5342 5605 3536 527
15113E27l538k764K52M55q15J358N51j690K874N49j918K824J667L31l11K197l95
$$ 527 -3011 -5775 -5523 -5068 -5883 -4525 -3974 -5664 -2790 -2241 -4159 -1335 332 663 352 2549 2154
15096B154k204qK091J681k684l278N13J338N48O06J289L8o21m993l951r53J137
$$ 2154 -50 -58 2033 3714 1030 -2248 -1735 -397 151 757 2046 2084 1463 -3530 -7481 -8434 -7297
15079g297o2J660L181K343j690M153o1l971J338J016j96l370l540l239L265J072
$$ -7297 -7359 -5699 -2518 -175 -1865 2288 2227 -1744 -406 610 414 -2956 -6496 -9735 -6470 -5398
15063e398j911J28k671l577n04L564K519K905M28k509k058K885K103N655j630
$$ -5398 -7309 -7181 -9852 -13429 -13933 -10369 -7850 -4945 -4517 -7026 -9084 -6199 -4096 1559 -71
15048g1k474P42K948o5m492m077r05J20N6O51K259m00k198K227K858j958M07K971
$$ -71 -2545 -1803 1145 1080 -3412 -7489 -8394 -8274 -8218 -7567 -5308 -5708 -7906 -5679 -2821 -4779 -4372 -1401
15030a401Q57J489j679k25L96R50k765j643j74K759J861k581m32m487R38L411
$$ -1401 -544 945 -734 -959 -563 387 -2378 -4021 -4195 -1436 425 -2156 -2588 -7075 -6137 -2726
15014b726Q52K081J089r86k840l553k74L448j57J952K107l24P82J004k81L086
$$ -2726 -1874 207 1296 310 -2530 -6083 -6357 -2909 -3066 -1114 993 669 1451 2455 2174 5260
14998E260K5r47J485R24l402m516j209P6j131L32o36P64j957j111r0L416L400
$$ 5260 5285 4338 5823 6747 3345 -1171 -2380 -2304 -3435 -3103 -3739 -2975 -4932 -6043 -6133 -2717 683
14981F83J867N50k037k774j085K482j008J156k15j931Q99k94J248J625k650l811
$$ 683 2550 3100 1063 -1711 -2796 -314 -1322 -166 -381 -2312 -1413 -1707 -459 1166 -1484 -5295
14965e295k10L085N829R44l485J126j132j535l752r53J872n06r52K460M159o20
$$ -5295 -5505 -2420 3409 4353 868 1994 862 -673 -4425 -5378 -3506 -4012 -4964 -2504 1655 1035
14949A035K056J081m55l218j715j37l277k834K509L075P99K221J075l371n456
$$ 1035 3091 4172 3717 499 -1216 -1353 -4630 -7464 -4955 -1880 -1081 1140 2215 -1156 -6612
14934f612J899M068m14K390r25o061l915K002K128M704J707L923j936m052k947
$$ -6612 -4713 -645 -1059 1331 406 -5655 -9570 -7568 -5440 -736 971 4894 2958 -1094 -4041
14919d041k739j391R16m98J040m75M243k859r61J105R1L01k458k997L349J161
$$ -4041 -6780 -8171 -7255 -7753 -6713 -7188 -2945 -5804 -6765 -5660 -5569 -5268 -7726 -10723 -7374 -6213
14903f213r25K194J346O0K309k3k371k71n71O61J051K331J966k739k185J088l700
$$ -6213 -7138 -4944 -3598 -3538 -1229 -1252 -3623 -3894 -4465 -3804 -2753 -422 1544 -1195 -3380 -2292 -5992
14886e992j333J679j752J713k102M117L574m068j549O45K372K848L836N36o979
$$ -5992 -7325 -5646 -7398 -5685 -7787 -3670 -96 -4164 -5713 -5068 -2696 152 3988 4524 -2455
14871b455n073l41J065M12l730L809P727K419l16J656l952k370J528k592M8j254
$$ -2455 -7528 -7869 -6804 -6392 -10122 -6313 1414 3833 3517 5173 1221 -1149 379 -2213 -2165 -3419
14855c419j505j523K426N420J943k280j140k553k68J131l766O9J55r62L565L209
$$ -3419 -4924 -6447 -4021 1399 3342 1062 -78 -2631 -2899 -1768 -5534 -5465 -5310 -6272 -2707 502
14839E02k440k21o51k649K597p30Q72k461N16j159q53J16j298j006r05L921N840
$$ 502 -1938 -2159 -2810 -5459 -2862 -3592 -2720 -5181 -4665 -5824 -6677 -6561 -7859 -8865 -9770 -5849 -9
14822iJ903L387J204J66p48k290l449r1l82l367k799l366K43K993L45J172R69
$$ -9 1894 5281 6485 6651 5903 3613 164 73 -309 -3676 -6475 -9841 -9598 -6605 -6260 -5088 -4119
14805d119K256L19j506K377J224Q40K107M81k483K410J79j253O63J49q68j978
$$ -4119 -1863 -1544 -3050 -673 551 1391 3498 3979 1496 3906 4085 2832 3495 3644 2776 798
14789G98L11P35M64K393j475l004R04Q12r80j839k233J20n35M47M219j298p57
$$ 798 1109 1844 2308 4701 3226 222 1126 1938 958 -881 -3114 -2994 -3529 -3082 1137 -161 -918
14772i18k91k48K050k110k554o12L264N0M36J278J75R0j336j660M05Q94M45q24
$$ -918 -1209 -1457 593 -1517 -4071 -4683 -1419 -1369 -933 345 520 610 -726 -2386 -1981 -1087 -642 -1466
14754a466j109j042p61J298k24K228L680m885p548J542J831J466J24K93o40j679
$$ -1466 -2575 -3617 -4378 -3080 -3304 -1076 2604 -2281 -9829 -8287 -6456 -4990 -4866 -4573 -5213 -6892
14738f892j008j591L592O235L386m26m203J29L137k563n31J252j808k603M553
$$ -6892 -7900 -9491 -5899 336 3722 3296 -907 -778 2359 -204 -735 517 -1291 -3894 659
14723F59k76K322j088k529J96N15j100J757j408k976P58K694K445J189P70r71
$$ 659 383 2705 1617 -912 -716 -201 -1301 456 -952 -3928 -3170 -476 1969 3158 3928 2957
14707B957o913O5P073J078L483L589l657j138o12L57j284k487R22m55J893J598
$$ 2957 -3956 -3891 3182 4260 7743 11332 7675 6537 5925 6282 4998 2511 3433 2978 4871 6469
14691F469n87l14K803n09j740J473R40k412m045K02J731K523J224r19q03k356
$$ 6469 5882 5568 8371 7862 6122 7595 8535 6123 2078 2280 4011 6534 7758 6839 6036 3680
14675C680K038K849j846L00k361j11J635n99l042l131P15K788J078K28M425K144
$$ 3680 5718 8567 6721 7021 4660 4549 6184 5585 2543 -588 127 2915 3993 4221 8646 10790
14659A0790J960J763L346o015p152k471M985R41L912L611L887j690l869l944l49
$$ 10790 12750 14513 17859 11844 4692 2221 7206 8147 12059 15670 19557 17867 13998 10054 9705
14644I705M10J899L72m912j065M457Q763k309Q40k438o482J633Q10J072j77K2
$$ 9705 10115 12014 12386 7474 6409 10866 19629 17320 18160 15722 9240 10873 11683 12755 12578 12600
14628A2600K35K394m62J108J642m61m721k70K272P64j119j67K300O53n89K605
$$ 12600 12835 15229 14767 15875 17517 17056 12335 12065 14337 15101 13982 13815 16115 16768 16179 18784
14612A8784J063L2l50J925l240k129J196K543J09N21J384r2j574k083j458J564
$$ 18784 19847 19879 19529 21454 18214 16085 17281 19824 19933 20454 21838 21746 20172 18089 16631 18195
14596A8195L034j342j712k60j625N46L092J002L19j12o420p15k383L289q02m272
$$ 18195 21229 19887 18175 17915 16290 16836 19928 20930 21249 21137 14717 14002 11619 14908 14106 9834
14580I834R20M56K890L495j032k303K326Q00Q80l12l264j019k928R46L005J435
$$ 9834 10754 11210 14100 17595 16563 14260 16586 17386 18266 17954 14690 13671 10743 11689 14694 16129
14564A6129O65N203l308q486j207J888M160J532j406K367P41n016j641k324kj165
$$ 16129 16794 21997 18689 10203 8996 10884 15044 16576 15170 17537 18278 13262 11621 9297 9295 8130
14548H130k440M50j02l106K84M628k290k741j780J588p44j356k082k722P75L517
$$ 8130 5690 6140 6038 2932 3216 7844 5554 2813 1033 2621 1877 521 -1561 -4283 -3508 9
14532IL702L251j156K10K735n57j892K655N2j137j700J349N56j41k248n076K166
$$ 9 3711 6962 5806 6016 8751 8194 6302 8957 9009 7872 6172 7521 8077 7936 5688 612 2778
14515B778J016r67J534J76K39j105J09K204j190j794L314Q46K268K696l226l970
$$ 2778 3794 2827 4361 4537 4776 3671 3780 5984 4794 3000 6314 7160 9428 12124 8898 4928
14499D928l303j87J077j857L351L216M49j028m671k739L234m34O00K377k170k641
$$ 4928 1625 1438 2515 658 4009 7225 7674 6646 1975 -764 2470 2036 2636 5013 2843 202
14483B02p79K011k540J603L298j356l324J220l87l57L010L867J046j953k578m86
$$ 202 -577 1434 -1106 497 3795 2439 -885 335 -52 -409 2601 6468 7514 5561 2983 2497
14467B497J99j306p65k108Q06j600j923R00K136J619K236j075k422o3R91K976
$$ 2497 2696 1390 625 -1483 -677 -2277 -4200 -3300 -1164 455 2691 1616 -806 -869 122 3098
14451C098J953j052l277o64J159k010K792N205n01l020n034M72J531r73k847Q29
$$ 3098 5051 3999 722 58 1217 -793 1999 7204 6703 3683 -1351 -879 652 -321 -3168 -2339
14435b339m38k023k858K642O823J865j388k004k691n61J647M453K199k428j880
$$ -2339 -2777 -4800 -7658 -5016 1807 3672 2284 280 -2411 -2972 -1325 3128 5327 2899 1019
14420A019J153J522J092j48j311l424m698k783K861K067K905M743o89l044q39
$$ 1019 2172 3694 4786 4638 3327 -97 -4795 -7578 -4717 -2650 255 4998 4309 1265 426
14405D26j760r99j822m75Q05k05L82M08O27J26k16K340J25l51K033j464k222k936
$$ 426 -1334 -2333 -4155 -4630 -3825 -4030 -3648 -3240 -2613 -2487 -2703 -363 -238 -589 1444 -20 -2242 -5178
14387e178k71J828L002K83J2m502l548J053K256J853j57n44j34J224P83J880j06
$$ -5178 -5449 -3621 -619 -336 -324 -4826 -8374 -7321 -5065 -3212 -3369 -3913 -4047 -2823 -2040 -160 -266
14370b66J40k127M519L750j921o72K663l353n966R58L199l23K115j041L354O35
$$ -266 -126 -2253 2266 6016 4095 3423 6086 2733 -3233 -2275 924 601 2716 1675 5029 5664
14354E664k438K383O05r90l491J803J109N25j288l572n547m482R02J899J895j496
$$ 5664 3226 5609 6214 5224 1733 3536 4645 5170 3882 310 -5237 -9719 -8817 -6918 -5023 -6519
14338f519M401Q570J156r41k238j096j013k784k072l88k08r65J564J553K609R9
$$ -6519 -2118 6452 7608 6667 4429 3333 2320 -464 -2536 -2924 -3132 -4097 -2533 -980 1629 1728
14322A728J229K44J699j65L056j569o351n478j020M944K485J539N60m15l217K557
$$ 1728 2957 3201 4900 4735 7791 6222 -129 -5607 -6627 -1683 802 2341 2901 2486 -731 1826
14306A826K64K070j655k140O62J683j277k857K180K782J894m825l750L862P60
$$ 1826 2090 4160 2505 365 1027 2710 1433 -1424 756 3538 5432 607 -3143 719 1479
14291A479k980NJ708L30J098q83L967k144n086N157k293n934R85N87J917J014
$$ 1479 -1501 -1496 212 542 1640 757 4724 2580 -2506 2651 358 -5576 -4591 -4004 -2087 -1073
14275a073K34m39l676K330K489l062q11M30M265L035l755k157J774K839K830Q68
$$ -1073 -839 -1278 -4954 -2624 -135 -3197 -4008 -3578 687 3722 -33 -2190 -416 2423 5253 6121
14259F121l051k977k29j270J500j44P59P17k298j486m154j856N01L349L528K427
$$ 6121 3070 93 -136 -1406 94 -50 709 1426 -872 -2358 -6512 -8368 -7867 -4518 -990 1437
14243A437m301m596J683K607P43J96j398l620L474L674k188J352J306m812m529
$$ 1437 -2864 -7460 -5777 -3170 -2427 -2231 -3629 -7249 -3775 -101 -2289 -937 369 -4443 -8972
14228h972k5L004q53q64Q11o50K06L671L159q95m71l827M124N10k901j584j764
$$ -8972 -8997 -5993 -6846 -7710 -6899 -7549 -7343 -3672 -513 -1408 -1879 -5706 -1582 -1072 -3973 -5557 -7321
14211g321j007N31J531J563N354J842k296N2J51O7N49n23o29k145J912L975M046
$$ -7321 -8328 -7797 -6266 -4703 651 2493 197 249 400 467 1016 493 -136 -2281 -369 3606 7652
14194G652J536o414m156j47K610L023r82l431K458J458k483j905K03M305O31k034
$$ 7652 9188 2774 -1382 -1529 1081 4104 3122 -309 2149 3607 1124 -781 -578 3727 4358 2324
14178B324k430m550l020J698K974K254l576l627J199J506M674j047m040M296L299
$$ 2324 -106 -4656 -7676 -5978 -3004 -750 -4326 -7953 -6754 -5248 -574 -1621 -5661 -1365 1934
14163A934N17m527j52J230J245j013L337p19m600P0l190r57J501oM65k481K441
$$ 1934 2451 -2076 -2228 -998 247 -766 2571 1852 -2748 -2678 -5868 -6825 -5324 -5330 -4865 -7346 -4905
14146d905M753K81k127j20K00K910P38J126k460r64J798j625l39K19q22o13l86
$$ -4905 -152 129 -1998 -2118 -1918 992 1730 2856 396 -568 1230 -395 -734 -515 -1337 -1950 -2336
14129b336k284k817l159l342J837M093N375K32K169o01j61M10L025k573K58L265
$$ -2336 -4620 -7437 -10596 -13938 -12101 -8008 -2633 -2401 -232 -833 -994 -584 2441 -132 126 3391
14113C391J064n019J967L162j286K765J018K159m28n841n672L850L805j673j677
$$ 3391 4455 -564 1403 4565 3279 6044 7062 9221 8793 2952 -2720 1130 4935 3262 1585
14098A585R53K1M66J211J268j711k126k797l240k164N818M511j654J366k545j760
$$ 1585 2538 2559 3025 4236 5504 3793 1667 -1130 -4370 -6534 -716 3795 2141 3507 962 -798
14082g98k281J653p20o70L325K843M72o10o28m191m01n59j162J169m769r09L294
$$ -798 -3079 -1426 -2146 -2816 509 3352 3824 3214 2586 -1605 -2006 -2565 -3727 -2558 -7327 -8236 -4942
14065d942J858M345Q55P48p76L901L339J775k946l558m999R69L5n47J232M49o03
$$ -4942 -3084 1261 2116 2864 2088 5989 9328 11103 8157 4599 -400 569 604 57 1289 1738 1135
14048A135n38l94j057J548L317K767j012j436m300J056N98J07k411j280j442K916
$$ 1135 597 203 -854 694 4011 6778 5766 4330 30 1086 1684 1791 -620 -1900 -3342 -426
14032d26J916j089p0M082L5K3L350k31l886J126k866k364O84N17l34L692j581
$$ -426 1490 401 331 4413 4448 4471 7821 7590 3704 4830 1964 -400 284 801 467 4159 2578
14015B578O23j848j279J734P0k492j271K770J9n90J101N44K174m48O97k263m01
$$ 2578 3201 1353 74 1808 1878 -614 -1885 885 904 314 1415 1959 4133 3685 4382 2119 1718
13998A718P67q96p37j892M404O06k614k2R10m0p84k716l12M065N6O65J266M84
$$ 1718 2485 1589 852 -1040 3364 3970 1356 1334 2244 2204 1420 -1296 -1608 2457 2513 3178 4444 4928
13980D928k083l603K984J730j484K025k595J114J840j627r57j50n005j446J380
$$ 4928 2845 -758 2226 3956 2472 4497 1902 3016 4856 3229 2272 2122 -2883 -4329 -2949
13965b949q42j195r03L060M611N45l266k389k319j813o9M588J187j280L422l626
$$ -2949 -3791 -4986 -5889 -2829 1782 2327 -939 -3328 -5647 -7460 -7529 -2941 -1754 -3034 388 -3238
13949c238j766q24k008n71L572L375j668n72L871L131j987k762j817K634P45j693
$$ -3238 -5004 -5828 -7836 -8407 -4835 -1460 -3128 -3700 171 3302 1315 -1447 -3264 -630 115 -1578
13933a578k294j744N07J573J40k268j556K893Q99m50m60j533k27K706k258M501
$$ -1578 -3872 -5616 -5109 -3536 -3396 -5664 -7220 -4327 -3428 -3878 -4338 -5871 -6098 -3392 -5650 -1149
13917a149M59j811K244l949q33m443n97L297K730k81p48Q51k630j84j170j435
$$ -1149 -690 -2501 -257 -4206 -5039 -9482 -10079 -6782 -4052 -4333 -5081 -4230 -6860 -7044 -8214 -9649
13901i649q08M536M096n33J369L941j282j915r56p14J709n77l801Q98Q6k651q85
$$ -9649 -10457 -5921 -1825 -2358 -989 2952 1670 -245 -1201 -1915 -206 -783 -4584 -3686 -3600 -6251 -7136
13884g136N951J989l464J564M106O48j020k625j875l244N812J045l360L66J949
$$ -7136 -1185 804 -2660 -1096 3010 3658 2638 13 -1862 -5106 706 1751 -1609 -1243 706
13869G06J333k564j493j954N30K71r31K485l47l8J988O9K573j461k995l655n67
$$ 706 2039 -525 -2018 -3972 -3442 -3171 -4102 -1617 -1964 -2002 -14 55 2628 1167 -1828 -5483 -6050
13852f050o83M365L190p10j858m613l028K855O622K467j375j858l684J68L545
$$ -6050 -6733 -2368 822 112 -1746 -6359 -9387 -6532 90 2557 1182 -676 -4360 -4192 -647
13837f47K985j358k293l842l145J581L935j89k198k554J552K020j960j79q66j48
$$ -647 2338 980 -1313 -5155 -8300 -6719 -2784 -2973 -5171 -7725 -6173 -4153 -6113 -6292 -7158 -7306
13821g306M07K875j490K362k263k275l070J406L49L110q0j163l31j600o51K026
$$ -7306 -6899 -4024 -5514 -3152 -5415 -7690 -10760 -9354 -9005 -5895 -5975 -7138 -7469 -9069 -9720 -7694
13805g694M042K326k239k144k192n91K851k517O70Q03J025Q27R79j443j968K111
$$ -7694 -3652 -1326 -3565 -5709 -7901 -8492 -5641 -8158 -7488 -6685 -5660 -4833 -3854 -5297 -7265 -5154
13789e154n973k97J604J994N563o96j789k131n085j633K101L764K314r1k313K161
$$ -5154 -11127 -11424 -9820 -7826 -2263 -2959 -4748 -6879 -11964 -13597 -11496 -7732 -5418 -5509 -7822 -5661
13773e661k742N648p20j915R9l321O076K061m274k06l15m171j214L754j41j861
$$ -5661 -8403 -2755 -3475 -5390 -5291 -8612 -2536 -475 -4749 -4955 -5270 -9441 -10655 -6901 -7042 -8903
13757h903K087L13n70j56q65j090K101J990J27m466j257K145J067k152J43L810
$$ -8903 -6816 -6503 -7073 -7229 -8094 -9184 -7083 -5093 -4966 -9432 -10689 -8544 -7477 -9629 -9486 -5676
13741e676N059p91j565q0K97j93m7J333K180j811K185m571n498k126P29J461N296
$$ -5676 -617 -1408 -2973 -3053 -2756 -2949 -2996 -1663 517 -1294 891 -3680 -9178 -11304 -10575 -9114 -3818
13724c818J679m782k103L855k187L97j697K620M69k513k45L206N65L53k706J196
$$ -3818 -2139 -6921 -9024 -5169 -7356 -6959 -8656 -6036 -5567 -8080 -8325 -5119 -4554 -4201 -6907 -5711
13708e711k12k246J801M645K24o637j713J817K609J491J112M783Q36j743l658
$$ -5711 -5923 -8169 -6368 -1723 -1499 -8136 -9849 -8032 -5423 -3932 -2820 1963 2799 1056 -2602
13693b602m080j086P93M959K171K757l399m059m2J170p81K8L190O04m714l726
$$ -2602 -6682 -7768 -6975 -2016 155 2912 -487 -4546 -4588 -3418 -4199 -4171 -981 -377 -5091 -8817
13677h817j298K207M826l96J779j697j246K705L805J497l177K96L28K603k386
$$ -8817 -10115 -7908 -3082 -3478 -1699 -3396 -4642 -1937 1868 3365 188 484 812 3415 1029
13662A029o78j636J089j950j956M071K088j392N50J63l888j399p05J045L727J824
$$ 1029 351 -1285 -196 -2146 -4102 -31 2057 665 1215 1378 -2510 -3909 -4614 -3569 158 1982
13646A982j097j213l188k729k953M742O3n110m663J919R065K28n165k58P525N694
$$ 1982 885 -328 -3516 -6245 -9198 -4456 -4393 -9503 -14166 -12247 -3182 -2954 -8119 -8377 -852 4842
13630D842m026k129k223j85k501K16q19Q37j948K474L809P68j546J36o43j01k559
$$ 4842 816 -1313 -3536 -3721 -6222 -6006 -6825 -5988 -7936 -5462 -1653 -885 -2431 -2295 -2938 -3039 -5598
13613e598L586M94j521o26l845J192O73K86l33r34J004R2l02L475k75L32k290
$$ -5598 -2012 -1518 -3039 -3665 -7510 -6318 -5645 -5359 -5692 -6626 -5622 -5530 -5832 -2357 -2632 -2300 -4590
13596d590J737K919p82q16r06k859J605K820m213j983o78K715J877j969j864J312
$$ -4590 -2853 66 -716 -1532 -2438 -5297 -3692 -872 -5085 -7068 -7746 -5031 -3154 -5123 -6987 -5675
13580e675J787R92J21j376L087k480j550K009k0j377K538J141J981j520l918k154
$$ -5675 -3888 -2896 -2775 -4151 -1064 -3544 -5094 -3085 -3105 -4482 -1944 -803 1178 -342 -4260 -6414
13564f414M602j117m611m016j256J586L175Q9q30J879R23K199J722p86p13k839
$$ -6414 -1812 -2929 -7540 -11556 -12812 -11226 -8051 -7962 -8792 -6913 -5990 -3791 -2069 -2855 -3568 -6407
13548f407k564K602l942j314P077m000m435K558L569J308j919k082j443Q99k01
$$ -6407 -8971 -6369 -10311 -11625 -4548 -8548 -12983 -10425 -6856 -5548 -7467 -9549 -10992 -10093 -10294
13533a0294M63J356P737k57m424m356J162J635r0k92q86j30N224J502k958k757
$$ -10294 -9831 -8475 -738 -995 -5419 -9775 -8613 -6978 -7068 -7360 -8246 -8376 -3152 -1650 -4608 -7365
13517g365K16j081J941j786j350K425J845K580m044m325j604J206J223L118R44
$$ -7365 -7149 -8230 -6289 -8075 -9425 -7000 -5155 -2575 -6619 -10944 -12548 -11342 -10119 -7001 -6057
13502f057j952J614m14k524k246K172J715L918J690J38n06l683j418R16p1K676
$$ -6057 -8009 -6395 -6809 -9333 -11579 -9407 -7692 -3774 -2084 -1946 -2452 -6135 -7553 -6637 -6708 -4032
13486d032j432m378j180N771Q56K292j049n060M6j908j527O57j155J372K381L279
$$ -4032 -5464 -9842 -11022 -5251 -4395 -2103 -3152 -8212 -8166 -10074 -11601 -10944 -12099 -10727 -8346 -5067
13470e067O82J62J607K441N44j84l76j015M32N00J186j690l337j087j907k560
$$ -5067 -4385 -4223 -2616 -175 369 185 -191 -1206 -774 -274 912 -778 -4115 -5202 -7109 -9669
13454i669K46j426O029P345L09j885J087k071l496l321p64j357L301N968j864
$$ -9669 -9423 -10849 -4820 2525 2834 949 2036 -35 -3531 -6852 -7616 -8973 -5672 296 -1568
13439a568L61M16l42J405j750q48j370o93M430K433j348k3N90R69P39p614m931
$$ -1568 -1207 -791 -1133 272 -1478 -2326 -3696 -4389 41 2474 1126 1103 1693 2662 3401 -4213 -9144
13422i144M203K537L591K425n524k866r44J504L956m58J017N85J574L657k018
$$ -9144 -4941 -2404 1187 3612 -1912 -4778 -5722 -4218 -262 -720 297 882 2456 6113 4095
13407D095k281n934m549j456K63l755J538L957J013J237K572k45l44K299M453
$$ 4095 1814 -4120 -8669 -10125 -9862 -13617 -12079 -8122 -7109 -5872 -3300 -3545 -3889 -1590 2863
13392B863j10o92j007l028k159q62L442k37Q69j743k84l291L330O46k434L64J768
$$ 2863 2753 2061 1054 -1974 -4133 -4995 -1553 -1790 -921 -2664 -2948 -6239 -2909 -2263 -4697 -4333 -2565
13375b565r91L100p21N78O20L116J204M85n3N19M380L037N09Qk738l219j458M44
$$ -2565 -3556 -456 -1177 -599 21 3137 4341 4826 4773 5292 9672 12709 13218 13226 10488 7269 5811 6255
13357F255J263l745o04N07m343J468L310k175M91L271l552j828j13N2k280J358
$$ 6255 7518 3773 3169 3676 -667 801 4111 1936 2427 5698 2146 318 205 257 -2023 -665
13341f65K088o53J148n57M54j339l149k84M844P16j238l875p15M374l409J70p3
$$ -665 1423 770 1918 1361 1815 476 -2673 -2957 1887 2603 1365 -2510 -3225 1149 -2260 -2090 -2163
13324b163K73l9j075P12J085j904j840K377K380J144L02N17r30o274k168k076
$$ -2163 -1890 -1929 -3004 -2292 -1207 -3111 -4951 -2574 -194 950 1252 1769 839 -5435 -7603 -9679
13308i679K282J054j301L58L989J37o36q83J282L065J071K76L015l347l277m803
$$ -9679 -7397 -6343 -7644 -7286 -3297 -3160 -3796 -4679 -3397 -332 739 1015 4030 683 -2594 -7397
13292g397n792M879P142p80k899K946J004r70l96k254O71l0M587l284j163j264
$$ -7397 -13189 -8310 -1168 -1948 -4847 -1901 -897 -1867 -2263 -4517 -3846 -3876 711 -2573 -3736 -5000
13276e000KJ730M052J313o520m099K415K950J010q12J33k887j553M283P368P09
$$ -5000 -4998 -3268 784 2097 -4423 -8522 -6107 -3157 -2147 -2959 -2826 -5713 -7266 -2983 4385 5094
13260E094j003m402o093L180J415j55k54N79k211r87r09M9m67k194k433J223k33
$$ 5094 4091 -311 -6404 -3224 -1809 -1964 -2218 -1639 -3850 -4837 -5746 -5697 -6164 -8358 -10791 -9568 -9801
13243i801K224L062j10n12J85J881M757K622j765J257K084O37k524M01j267l563
$$ -9801 -7577 -4515 -4625 -5137 -4952 -3071 1686 4308 2543 3800 5884 6521 3997 4398 3131 -432
13227d32k339o49K01j553l176k793j353M992m20o60j327m22n6K152J311j066J84
$$ -432 -2771 -3420 -3219 -4772 -7948 -10741 -12094 -7102 -7522 -8182 -9509 -9931 -9987 -7835 -6524 -7590 -7406
13210g406K666p88j570K10M39p1p08O9k450j125K44K378r37L491Q88O369j872
$$ -7406 -4740 -5528 -7098 -6888 -6449 -6520 -7228 -7159 -9609 -10734 -10490 -8112 -9049 -5558 -4670 1699 -173
13193a73m875J795J997n093k20J953k16K062Q428O2n256m768k396K562J700R64
$$ -173 -5048 -3253 -1256 -6349 -6569 -4616 -4832 -2770 5658 5720 464 -4304 -6700 -4138 -2438 -1474
13177a474L854J692k220M21j852r97r84l218j015j390R93M570K258L035J585j238
$$ -1474 2380 4072 1852 2273 421 -576 -1560 -4778 -5793 -7183 -6190 -1620 638 3673 5258 4020
13161D020k250J492J304k602P65j630o055K45L026J153n93m10J453k079l388n85
$$ 4020 1770 3262 4566 1964 2729 1099 -4956 -4711 -1685 -532 -1125 -1535 -82 -2161 -5549 -6134
13145f134j254l121K566K490L196L148K113k885n048R16j857o653j44J195O166
$$ -6134 -7388 -10509 -7943 -5453 -2257 891 3004 119 -4929 -4013 -5870 -12523 -12667 -11472 -5306
13130e306O27j440N049O264m569n305j597J189j781j798j116J249K946L954K012
$$ -5306 -4679 -6119 -1070 5194 625 -4680 -6277 -5088 -6869 -8667 -9783 -8534 -5588 -1634 378
13115C78m000j020J970J672m97J463J06n183j721L135N34p94J669L62q86K177
$$ 378 -3622 -4642 -2672 -1000 -1497 -34 72 -5111 -6832 -3697 -3163 -3957 -2288 -1926 -2812 -635
13099f35k022j572M529M350r72j775k434j015P58l329m48q68k71L33N91M180m87
$$ -635 -2657 -4229 300 4650 3678 1903 -531 -1546 -788 -4117 -4565 -5433 -5704 -5371 -4780 -600 -1087
13082a087p95K83k793O91J447K867J516J633N177M09j917k384o26k669l357n14
$$ -1087 -1882 -1599 -4392 -3701 -2254 613 2129 3762 8939 9348 7431 5047 4421 1752 -1605 -2119
13066b119J006M98m198R01j537j896M377J766k01k166l160J000K712Q7N22L105
$$ -2119 -1113 -615 -4813 -3912 -5449 -7345 -2968 -1202 -1403 -3569 -6729 -5729 -3017 -2930 -2408 697
13050F97n28k85J226j293n179j632J107k50k7L017M956J698m035k882p53k55j236
$$ 697 169 -116 1110 -183 -5362 -6994 -5887 -6137 -6164 -3147 1809 3507 -528 -3410 -4163 -4418 -5654
13033e654j628J833N276O117j436m866m351K304K761P74L736M369k216j265r34
$$ -5654 -7282 -5449 -173 5944 4508 -358 -4709 -2405 356 1130 4866 9235 7019 5754 4820
13018D820j642K36J719q33k285m51j650k971J689J357k329k028k76J831J141J651
$$ 4820 3178 3414 5133 4300 2015 1564 -86 -3057 -1368 -11 -2340 -4368 -4644 -2813 -1672 -21
13002b1K233J171K459J912k271k931n78Q72l397J743K874k590k205j03K28N523
$$ -21 2212 3383 5842 7754 5483 2552 1974 2846 -551 1192 4066 1476 -729 -832 -604 4919
12986D919N68m49J160M490M647o68o52K098J555N72j513K164M13J172k375L409
$$ 4919 5487 5038 6198 10688 15335 14667 14015 16113 17668 18240 16727 18891 19304 20476 18101 21510
12970B1510J212K534M572q36k524k318l028K782L458m04q32L31j272l423k70L054
$$ 21510 22722 25256 29828 28992 26468 24150 21122 23904 27362 26958 26126 26457 25185 21762 21492 24546
12954B4546j921m605j182l192k173J213L538J90j298k07N00r93O53J93l765j967
$$ 24546 22625 18020 16838 13646 11473 12686 16224 16414 15116 14909 15409 14416 15069 15262 11497 9530
12938I530m887j683k238J686M020k73r39n19o61p16l803K17L767k198J02J251
$$ 9530 4643 2960 722 2408 6428 6155 5216 4697 4036 3320 -483 -266 3501 1303 1405 2656
12922B656K583o51R77j339K123J108j62k574j0l001k38L170k694j887K70Q96M906
$$ 2656 5239 4588 5565 4226 6349 7457 7295 4721 4711 1710 1472 4642 1948 61 331 1227 6133
12905F133j11o583l699Q5L332L404J506K849k409l434l237J159L528M09m161k423
$$ 6133 6022 -561 -4260 -4175 -843 2561 4067 6916 4507 1073 -2164 -1005 2523 2932 -1229 -3652
12889c652J329j68K787m46j553j097l850K018M637J85O40N760k29n806q25J548
$$ -3652 -2323 -2491 296 -150 -1703 -2800 -6650 -4632 5 190 830 6590 6361 555 -270 1278
12873A278l580p04J177l66J998j239j597K041M994O61L628n08p44l097l133J725
$$ 1278 -2302 -3006 -1829 -2195 -197 -1436 -3033 -992 4002 4663 8291 7783 7039 3942 809 2534
12857B534K384l505k227m72n264j408K843L000J969m19j090j200o78K21J180l48
$$ 2534 4918 1413 -814 -1286 -6550 -7958 -5115 -2115 -146 -565 -1655 -2855 -3533 -3312 -2132 -2480
12841b480l87L03P98l089l659K270L338R292K532k333j784j44P92K075j956J271
$$ -2480 -2867 -2564 -1766 -4855 -8514 -6244 -2906 6386 8918 6585 4801 4657 5449 7524 5568 6839
12825F839j730q53j194M01J149m321k519o92K136M810K396m321K167K991m985
$$ 6839 5109 4256 3062 3463 4612 291 -2228 -2920 -784 4026 6422 2101 4268 7259 2274
12810B274n033K638L93M93J379J332J561P315K850n53j322L43J389J733q98K089
$$ 2274 -2759 -121 272 765 2144 3476 5037 12352 15202 14649 13327 13670 15059 16792 15894 17983
12794A7983n27k68p50k77j280K65j29P29m62j903k820m058j457l094p50J916K83
$$ 17983 17456 17188 16438 16161 14881 15146 15017 15746 15284 13381 10561 6503 5046 1952 1202 3118 3401
12777C401L29J302l244J72M9l67L338K330l269k053j571j119M624J458K658n87
$$ 3401 3730 5032 1788 1960 2009 1642 4980 7310 4041 1988 417 -702 3922 5380 8038 7451
12761G451k253k144m242k921k069P07K345M236k87K120o20l98k733L069L54K237
$$ 7451 5198 3054 -1188 -4109 -6178 -5471 -3126 1110 823 2943 2323 1925 -808 2261 2615 4852
12745D852q00p79K990K102j039m687l006L20R86K763p28J199n49J075M375J016
$$ 4852 4052 3273 6263 8365 7326 2639 -367 -47 939 3702 2974 4173 3624 4699 9074 10090
12729A0090j324k467n789l406N05K09j471L620K668P95J14k505k729K252N239
$$ 10090 8766 6299 510 -2896 -2391 -2182 -3653 -33 2635 3430 3544 1039 -1690 562 5801
12714E801k634n239K049j67L533k19K212J416r62j11k694N00K078K402K705k238
$$ 5801 3167 -2072 -23 -190 3343 3124 5336 6752 5790 5679 2985 3485 5563 7965 10670 8432
12698H432R72k20J979K265k10k370k059O00L160J354l07L52K79M0K227p85k290
$$ 8432 9404 9184 11163 13428 13218 10848 8789 9389 12549 13903 13596 13948 14227 14267 16494 15709 13419
12681A3419n010n16L647k53p10k020J480j344k486j339J598l79q9j5M54J268L868
$$ 13419 8409 7893 11540 11287 10577 8557 10037 8693 6207 4868 6466 6087 5998 5983 6437 7705 11573
12664A1573J728l678l6K061L329m79j418l887l247K033K599j223m15M970j319
$$ 11573 13301 9623 9587 11648 14977 14498 13080 9193 5946 7979 10578 9355 8940 13910 12591
12649A2591l081o44m1k56m54m75K10N094J177l399j966k570J652K422k234m557
$$ 12591 9510 8866 8825 8569 8115 7640 7850 12944 14121 10722 8756 6186 7838 10260 8026 3469
12633C469L06n05K332K051L122l17j101J391j992k597j929P79J997n13n545P94
$$ 3469 3775 3270 5602 7653 10775 10458 9357 10748 8756 6159 4230 5009 7006 6493 948 1742
12617A742O106j40j97r52k438M53N54J311o133P13P71k226Q03L237M719J137j482
$$ 1742 7848 7708 7511 6559 4121 4574 5128 6439 306 1019 1790 -436 367 3604 8323 9460 7978
12600G978L652o14l024K565P21n111l36J543J692j593L025k608J015J997J389
$$ 7978 11630 11016 7992 10557 11278 6167 5831 7374 9066 7473 10498 7890 8905 10902 12291
12585A2291j637l733J68K008q86L47J087K775O24k312k327K004R49K0m327k876
$$ 12291 10654 6921 7089 9097 8211 8558 9645 12420 13044 10732 8405 10409 11358 11378 7051 4175
12569D175K394N845P16j312q56K495K328k842m380M92M582K208k899R96j74j995
$$ 4175 6569 12414 13130 11818 10962 13457 15785 12943 8563 9055 13637 15845 12946 13942 13768 11773
12553A1773J72L490K873J237o34P60j515k13j401p17L244J291k048k034k911R33
$$ 11773 11945 15435 18308 19545 18911 19671 18156 17943 16542 15825 19069 20360 18312 16278 13367 14300
12537A4300K795j614N8N360j294l646r43J304l0J982r25J997K87L098K15k215
$$ 14300 17095 15481 15539 20899 19605 15959 15016 16320 16290 18272 17347 19344 19631 22729 22944 20729
12521B0729K554l747j723N698l840J305K837O01J45k880l21J608L665J504L355
$$ 20729 23283 19536 17813 23511 19671 20976 23813 24414 24559 21679 21358 22966 26631 28135 31490
12506C1490J458k290J699L249M060N474k8J684N240K75q06J937N380M76J530J695
$$ 31490 32948 30658 32357 35606 39666 45140 45112 46796 52036 52311 51505 53442 58822 59298 60828 62523
12490F2523k208m570m683m93P60m685n075l618O02L08l41L017K509J004m90k508
$$ 62523 60315 55745 51062 50569 51329 46644 41569 37951 38553 38861 38520 41537 44046 45050 44560 42052
12474D2052m4q71J937O328J660J59N351J587K197M716M085N739P544K647J427
$$ 42052 42008 41137 43074 49402 51062 51221 56572 58159 60356 65072 69157 74896 82440 85087 86514
12459H6514O123N523L049O311J391j529l182k229j549q353o976j765k473l882
$$ 86514 92637 98160 101209 107520 108911 107382 104200 101971 100422 92069 85093 83328 80855 76973
12445G6973k165j757N03m281k999j162L758P54p484k805K118J471n95N056k344
$$ 76973 74808 73051 73554 69273 66274 65112 68870 69624 62140 59335 61453 62924 62329 67385 65041
12430F5041J007O311J0493J281O66O061R076O978L023R832J5095R656Q710K904
$$ 65041 66048 72359 82852 84133 84799 90860 99936 106914 109937 119769 134864 144520 153230 156134
12416A56134L127M616J68m240o784l192o936p505o439o248o330n185j532k617
$$ 156134 159261 163877 164045 159805 153021 149829 142893 135388 128949 122701 116371 111186 109654 107037
12402A07037j437k682J180j275j248M72m85N404N97L916J371L483L118J839N622
$$ 107037 105600 102918 104098 102823 101575 102047 101562 106966 107563 111479 112850 116333 119451 121290 126912
12387A26912J0203N394Q67J040M995M669L964P668O644O206N352p85N19l214k738
$$ 126912 137115 142509 143376 144416 149411 154080 158044 165712 172356 178562 183914 183129 183648 180434 177696
12372A77696k280k351m281l537o396n690n002o824p129l845l68K735j786l815
$$ 177696 175416 173065 168784 165247 158851 153161 148159 141335 134206 130361 129993 132728 130942 127127
12358A27127j035J675j894K997R469K315K884M581O810L933O15n94p269l147k587
$$ 127127 126092 127767 125873 128870 138339 140654 143538 148119 154929 158862 159477 158883 151614 148467 145880
12343A45880j033k510j926k4k569J828K877N233K67n455k961j281K89k420O10
$$ 145880 144847 142337 140411 140387 137818 139646 142523 147756 148023 142568 139607 138326 138615 136195 136805
12328A36805m255n479j936q24k687j604o80n41L67K552K248l65m487J26j200p995
$$ 136805 132550 127071 125135 124311 121624 120020 119340 118799 119166 121718 123966 123601 119114 119240 118040 110045
12312A10045n446K325J412m826o307l562j651q44r16j262n506m794k698R71L440
$$ 110045 104599 106924 108336 103510 97203 93641 91990 91146 90230 88968 83462 78668 75970 76941 80381
12297H0381l121J88O338J907n379j353n27n72K406L640O249M329k95J52N96M80
$$ 80381 77260 77448 83786 85693 80314 78961 78434 77862 80268 83908 90157 94486 94191 94343 94939 95419
12281I5419m862l624m16K77m277n038l773n582o734r62J039N82k053j103o02j006
$$ 95419 90557 86933 86517 86794 82517 77479 73706 68124 61390 60428 61467 62049 59996 58893 58291 57285
12265E7285o55n143n238K90j43k927K372J586J399J899P19L519k682l355N57j802
$$ 57285 56630 51487 46249 46539 46396 43469 45841 47427 48826 50725 51444 54963 52281 48926 49483 47681
12249D7681K536K08l654K222N39k353n9L144L538J021j165n553k009P78K795M211
$$ 47681 50217 50425 46771 48993 49532 47179 47120 50264 53802 54823 53658 48105 46096 46874 49669 53880
12233E3880j858m740L36R34Q16j039l901j215K067K589j525k590K715M930K259
$$ 53880 52022 47282 47618 48552 49368 48329 44428 43213 45280 47869 46344 43754 46469 51399 53658
12218E3658K079R60k394Q4K345j105J327P036J897j961N086J592l069K114L818
$$ 53658 55737 56697 54303 54387 56732 55627 56954 63990 65887 63926 69012 70604 67535 69649 73467
12203G3467o75K11R78J472M585K585N297P349J73L029O135N390P012J824l782
$$ 73467 72792 73003 73981 75453 80038 82623 87920 95269 95442 98471 104606 109996 117008 118832 115050
12188A15050m7K308O968m92l282j104K302K73j02J604L947J045L162L849J829
$$ 115050 115003 117311 124279 123787 120505 119401 121703 121976 121874 123478 127425 128470 131632 135481 137310
12173A37310k141K66R17m80O53N741k437J777P162K329L181M694K602L633N862
$$ 137310 135169 135435 136352 135872 136525 142266 139829 141606 148768 151097 154278 158972 161574 165207 171069
12158A71069N689L324O128O491R488O945P157P664k65k15M737O087L585l109j117
$$ 171069 176758 180082 186210 192701 202189 209134 216291 223955 223690 223475 228212 234299 237884 234775 233658
12143B33658J652O70K824J723J467J947J393K734L605r50j34M301N717K609P365
$$ 233658 235310 235980 238804 240527 241994 243941 245334 248068 251673 250723 250589 254890 260607 263216 270581
12128B70581N851O054K894J912P577M671M535Q309R349J1189J1888J0467J0238
$$ 270581 276432 282486 285380 287292 294869 299540 304075 312384 321733 332922 344810 355277 365515
12115C65515J1270J6151J7269J8746J4745J1939J0281J3603J6064J2812J0391
$$ 365515 376785 392936 410205 428951 443696 455635 465916 479519 495583 508395 518786
12104E18786O524P808R774J4457J3183J3259J5203J7833J8567K1595K3141K3987
$$ 518786 525310 533118 542892 557349 570532 583791 598994 616827 635394 656989 680130 704117
12092G04117K8114L6629M0946M9303N4950N9474O1247O9814Q2270R1677J10390
$$ 704117 732231 768860 809806 859109 914059 973533 1034780 1104594 1186864 1278541 1388931
12081A388931J22401J36416J60622J79043K14540K47154K82780L34899L95202
$$ 1388931 1511332 1647748 1808370 1987413 2201953 2449107 2731887 3066786 3461988
12072C461988M59083N30013N93316O47229O81536O78250O21007N09494L52216
$$ 3461988 3921071 4451084 5044400 5691629 6373165 7051415 7672422 8181916 8534132
12063H534132J57081m1865k13724l44564m26220m50194m46175m13670l67966l18576
$$ 8534132 8691213 8649348 8435624 8091060 7664840 7214646 6768471 6354801 5986835 5668259
12053E668259k64533k16370j76337j35768r3439n6968k3167N858M3967Q4299J23450
$$ 5668259 5403726 5187356 5011019 4875251 4781812 4724844 4701677 4707535 4751502 4835801 4959251
12042D959251J65485K12562K53878L01408L58412M20441M91459N77790O64917
$$ 4959251 5124736 5337298 5591176 5892584 6250996 6671437 7162896 7740686 8405603
12033H405603P58961Q55324R35763R96136J029814J013694R37236Q00532N94862
$$ 8405603 9164564 10019888 10955651 11951787 12981601 13995295 14932531 15733063 16327925
12024A6327925L41106P9170j72878l84299n48044o46912p01564p08357o87430
$$ 16327925 16669031 16748201 16575323 16191024 15642980 14996068 14294504 13586147 12898717
12015A2898717o48476n90496n40686m79371m17711l60755l06995k49108k00324
$$ 12898717 12250241 11659745 11119059 10639688 10221977 9861222 9554227 9305119 9104795
12006I104795j50229r3980l8632J5496Q0354J41346K09897K86113L71937M64739
$$ 9104795 8954566 8860586 8821954 8837450 8917804 9059150 9269047 9555160 9927097 10391836
11996A0391836N82585P15546Q58356J026431J210046J396224J563480J695936
$$ 10391836 10974421 11689967 12548323 13574754 14784800 16181024 17744504 19440440
11988A9440440J758975J729633J580557J315556R56974N35692J01694l06997o64292
$$ 19440440 21199415 22929048 24509605 25825161 26782135 27317827 27419521 27112524 26448232
11979B6448232r41878j128660j233448j257935j211758j109465r77724q20519
$$ 26448232 25506354 24377694 23144246 21886311 20674553 19565088 18587364 17766845
11971A7766845o60477m99588l43116j92688m2367R7099K25644L45402M29722N01101
$$ 17766845 17106368 16606780 16263664 16070976 16028609 16125708 16351352 16696754 17126476 17627577
11961A7627577N48812N86544O16551O49992O90578P39281P85270Q21168Q24660
$$ 17627577 18176389 18762933 19379484 20029476 20720054 21459335 22244605 23065773 23890433
11952B3890433P95097P56520P02266O51131O27007O32827O55077O63550O39618
$$ 23890433 24685530 25442050 26144316 26795447 27422454 28055281 28710358 29373908 30013526
11943C0013526N54698L99286J65320j29809m42877p29871r46235j076408j124105
$$ 30013526 30568224 30967510 31132830 31003021 30560144 29830273 28884038 27807630 26683525
11934B6683525j103042j026726r08469p67265o05969m28639k44132m9159J62992
$$ 26683525 25580483 24553757 23645288 22878023 22272054 21843415 21599283 21550124 21713116
11925B1713116L63154N64173P49928Q87871R66287R44137Q18039N87566K73155
$$ 21713116 22076270 22640443 23390371 24278242 25244529 26188666 27006705 27594271 27867426
11916B7867426o6557l84608o31788p92708q37473p87783o65340m90772l01456
$$ 27867426 27800869 27416261 26784473 25991765 25154292 24366509 23701169 23210397 22908941
11907B2908941j17098N2956J76640K53545K66107K05494J00315m5529j92082l04481
$$ 22908941 22791843 22844799 23021439 23274984 23541091 23746585 23846900 23801371 23609289 23304808
11897B3304808l83061m18831m10021l69415l22590k71803k19849j65637j27578
$$ 23304808 22921747 22502916 22092895 21723480 21400890 21129087 20909238 20743601 20616023
11888B0616023j12034j19273j56986k29813l21362m09525m83939n30565n42201
$$ 20616023 20503989 20384716 20227730 19997917 19676555 19267030 18783091 18252526 17710325
11879A7710325n23892m79488m23638l80984l54227l47499l60912l85325m10935
$$ 17710325 17186433 16706945 16283307 15902323 15548096 15200597 14839685 14454360 14043425
11870A4043425m29647m34405m30164m05419l63079l04093k35934j56273p8964
$$ 14043425 13613778 13179373 12749209 12343790 11980711 11676618 11440684 11284411 11205447
11861A1205447O775Q8523J63969K43432L15302L71818M08842M08993L50370K49846
$$ 11205447 11212222 11300745 11464714 11708146 12023448 12395266 12804108 13213101 13563471 13813317
11851A3813317J00659r0593k92755m78570o16225p04057p42223p34640o96183
$$ 13813317 13913976 13823383 13530628 13052058 12435833 11731776 10989553 10254913 9558730
11842I558730o29752n65468n03389m45504l98257l55753l17740k83976k57802
$$ 9558730 8928978 8363510 7860121 7414617 7016360 6660607 6342867 6058891 5801089
11833E801089k32785k08579j87110j69789j52376j44185j38871j27453j20915
$$ 5801089 5568304 5359725 5172615 5002826 4850450 4706265 4567394 4439941 4319026
11824D319026j22470j16502j04395j00430r7193r1803q7160p9824p7873p5365
$$ 4319026 4196556 4080054 3975659 3875229 3778036 3686233 3599073 3519249 3441376 3366011
11814C366011p6225p5798p1242p0675o5171o5186o3867o2095o2305n3719n6826
$$ 3366011 3289786 3213988 3142746 3072071 3006900 2941714 2877847 2815752 2753447 2699728 2642902
11803B642902n4515m8898m9516m5897m2104m3089m0881l9786l8768l5355l6631
$$ 2642902 2588387 2539489 2489973 2444076 2401972 2358883 2318002 2278216 2239448 2204093 2167462
11792B167462l6805l6846l3772k8850l2392l5150l3989k5872k5738k8888k5483
$$ 2167462 2130657 2093811 2060039 2031189 1998797 1963647 1929658 1903786 1878048 1849160 1823677
11781A823677k3947k3188k4763k1852k5607k6178k6403k6563k6891k8940k5896
$$ 1823677 1799730 1776542 1751779 1729927 1704320 1678142 1651739 1625176 1598285 1569345 1543449
11770A543449k5554k2754j7872k0396k4034k3743j6833k1035k6684k0322j8792
$$ 1543449 1517895 1495141 1477269 1456873 1432839 1409096 1392263 1371228 1344544 1324222 1305430
11759A305430j9988j8103k3147k3731k4906k1830j5683j4730j6504k1897j6921
$$ 1305430 1285442 1267339 1244192 1220461 1195555 1173725 1158042 1143312 1126808 1104911 1087990
11748A087990j4899j6381j6325j5094j7802j5596j4967j0542j6467j2545q429
$$ 1087990 1073091 1056710 1040385 1025291 1007489 991893 976926 966384 949917 937372 928943
11737I28943j2137j2085j1766j2707j6233r723j1496o882n394o449m126p808j0456
$$ 928943 916806 904721 892955 880248 864015 854292 842796 835914 830520 824071 819945 812137 801681
11724H01681j4622j2954n787q034j2235j4071j1231q967p147k461q665j1775j0516
$$ 801681 787059 774105 768318 760284 748049 733978 722747 713780 706633 704172 695507 683732 673216
11711F73216q594o398j0654j1213r571j1727j2246n079q299j0879j0642q261j1398
$$ 673216 664622 658224 647570 636357 626786 615059 602813 597734 589435 578556 567914 559653 548255
11698E48255r913r066j1469q247o590j867k623l467m462j0712o927n327l993j0838
$$ 548255 538342 529276 517807 509560 502970 501103 498480 495013 490551 479839 472912 467585 463592 452754
11684D52754r414k605n731p932m564k499l765k942l458m208m163m849n259q225
$$ 452754 443340 440735 435004 427072 422508 420009 416244 413302 409844 405636 401473 396624 391365 383140
11670C83140l995l332n552k371l65k884n015k442j969l190m055l498n646q780
$$ 383140 379145 375813 370261 367890 367525 364641 359626 357184 355215 352025 347970 344472 338826 330046
11656C30046m317K176k658p96K025L43l757o025n516l391k622j243p18k068j662
$$ 330046 325729 327905 325247 324451 326476 326819 323062 317037 311521 308130 305508 304265 303547 301479 299817
11641B99817N191K58n412j18P05K005n51J732O26o40j094j19n05j791L361L59
$$ 299817 305008 305266 299854 299736 300441 302446 301895 303627 304253 303613 302519 302400 301895 300104 303465 303824
11625C03824K189n684n404l024m241l225l576j886k019j660J549J787o100l097
$$ 303824 306013 300329 294925 291901 287660 284435 280859 278973 276954 275294 276843 278630 272530 269433
11611B69433L779l43J435J432l19K075O282J328k77l684K44M701L376j327K243
$$ 269433 273212 272869 274304 275736 275417 277492 283774 285102 284825 281141 281385 286086 289462 288135 290378
11596B90378p65J59j17L397N516O139J666l349J006m98M315K627j487J649j251
$$ 290378 289613 289772 289655 293052 298568 304707 306373 303024 304030 303532 307847 310474 308987 310636 309385
11581C09385l727n983o430l225K549k819q517j392J165k006P04n86L217L261K570
$$ 309385 305658 299675 293245 290020 292569 289750 281233 279841 281006 279000 279704 279118 282335 285596 288166
11566B88166O884N555K293M041L356J258Q29O773Q394O161K763L349N37j082J483
$$ 288166 295050 300605 302898 306939 310295 311553 312382 319155 327549 333710 336473 339822 340359 339277 340760
11551C40760L377L838M050M451J24K112P00m16j720j380k955j424k299n819j957
$$ 340760 344137 347975 352025 356476 356600 358712 359412 358996 357276 355896 352941 351517 349218 343399 341442
11536C41442l82M38m403j877j79j883L945O438P968Q963N752M467J755K484M800
$$ 341442 341060 341498 337095 335218 335039 333156 337101 343539 351507 360470 366222 370689 372444 374928 379728
11521C79728O224R766Q579P471L523K479j201k439l677m705p627j432k323n02
$$ 379728 385952 395718 404297 411768 415291 417770 416569 414130 410453 405748 398121 396689 394366 393864
11507C93864l386j765L95K380L341o31j389l207j967j589J695l391l720k375Q
$$ 393864 390478 388713 389108 391488 394829 394198 392809 389602 387635 386046 387741 384350 380630 378255 378263
11492C78263l09J571O820p28l808j156M300O218L640J536J522M750L785k697m014
$$ 378263 377954 379525 386345 385617 381809 380653 384953 391171 394811 396347 397869 402619 406404 403707 399693
11477C99693l292n290j0548j3262r277n061p842n450l070j56K605M588L564O391
$$ 399693 396401 391111 380563 367301 358024 352963 345121 339671 336601 336445 339050 343638 347202 353593
11463C53593M684L439O31o71K560L048J59m431j728K022J288L190K502r18j08
$$ 353593 358277 361716 362347 361676 364236 367284 367443 363012 361284 363306 364594 367784 370286 369368 369260
11448C69260m379o562q115p465r335j1477j0831q538q383j090J217k393k198k854
$$ 369260 364881 358319 350204 342739 333404 321927 311096 302558 294175 293085 294302 291909 289711 286857
11434B86857J60K983M564M218P15M02M145N844L003L089K846n121J106M390N30
$$ 286857 287017 290000 294564 298782 299497 299899 304044 309888 312891 315980 318826 313705 314811 319201 319731
11419C19731m24K254k751K56k634l974n096o814o662n898n226p539r818r771q745
$$ 319731 319307 321561 318810 319066 316432 312458 307362 300548 293886 287988 282762 275223 265405 255634 246889
11404B46889j0275r57o09n496q303o895n954r847m245r12M188P330O579O270J006
$$ 246889 236614 235657 235048 229552 221249 214354 208400 198553 194308 193396 197584 204914 211493 217763 218769
11389B18769K58K852J157M497j453o47l369l628k008L354k572n623j097l442o702
$$ 218769 219027 221879 223036 227533 226080 225433 222064 218436 216428 219782 217210 211587 210490 207048 200346
11374B00346o220n209l344o211o813q248m762l778n83m777k751k913m019o64J142
$$ 200346 194126 188917 185573 179362 172549 164301 159539 155761 155178 150401 147650 144737 140718 140054 141196
11359A41196R85J163j956k440k899j393J067p03k437k088K305j96k442O816J462
$$ 141196 142181 143344 141388 138948 136049 134656 135723 135020 132583 130495 132800 132604 130162 136978 138440
11344A38440l475n020l853k423m15j06M01j368K44P77k317L879K605o93J045K465
$$ 138440 134965 129945 126092 123669 123254 123148 123549 122181 122425 123202 120885 124764 127369 126676 127721 130186
11328A30186m43k652j618l042m763K32K655L902K942j01J274K447J521n215k155
$$ 130186 129743 127091 125473 122431 117668 117900 120555 124457 127399 127298 128572 131019 132540 127325 125170
11313A25170M09K351k008r03m112m183O276J643l42j438j407P58L398k020k373
$$ 125170 125579 127930 125922 125019 120907 116724 123000 124643 124301 122863 121456 122214 125612 123592 121219
11298A21219J582L104K241J174Q52K931P63J490L91K968L13K163M826K020L11
$$ 121219 122801 125905 128146 129320 130172 133103 133866 135356 135747 138715 139028 141191 146017 148037 148348
11283A48348L265O464J658K120O047N78K012N296M155N620j439K875J773J566
$$ 148348 151613 158077 159735 161855 167902 168480 170492 175788 179943 185563 184124 186999 188772 190338
11269A90338K502L344P648O510K688L497O395N526p00q22L523N054K259K792r0
$$ 190338 192840 196184 203832 210342 213030 216527 222922 228448 227748 226926 230449 235503 237762 240554 240464
11254B40464k219j130K633J190L309N740M05N060N927L025Q838K495K25N231Q400
$$ 240464 238245 237115 239748 240938 244247 249987 250392 255452 261379 264404 273242 275737 275962 281193 289593
11239B89593R393N144K347N249O133N807N801M540P495N841O653J1026O410N155
$$ 289593 298986 304130 306477 311726 317859 323666 329467 334007 341502 347343 353996 365022 371432 376587
11225C76587M946P677N786M435K267M71l40m041O64p45L31N916k161J248j476
$$ 376587 381533 389210 394996 399431 401698 402169 401829 397788 398452 397707 398038 403954 401793 403041 401565
11210D01565k72J627J474J853O494M557Q19P256R938P098R421O049R708J0250
$$ 401565 401293 402920 404394 406247 412741 417298 418117 425373 435311 442409 451830 457879 467587 477837
11196D77837J0128Q855J2366J1524Q857N606O798Q725M969P084O408R449Q331
$$ 477837 487965 496820 509186 520710 529567 535173 541971 550696 555665 562749 569157 578606 586937
11183E86937R134N386R711J1316J0252J1101J4373J6444J6126J8123J6034K0550
$$ 586937 596071 601457 611168 622484 632736 643837 658210 674654 690780 708903 724937 745487
11171G45487J3850J8682K2389K8438L0163L4795L5025L1820L5616L4844M0907
$$ 745487 759337 778019 800408 828846 859009 893804 928829 960649 996265 1031109 1072016
11160A072016M8112M6685N6718O0779O1723Q0100R0249J00292J16831J39536J67130
$$ 1072016 1120128 1166813 1223531 1284310 1346033 1426133 1516382 1616674 1733505 1873041 2040171
11149B040171J91612K26436K72601L30628L94248M66199N57616O52403P46162
$$ 2040171 2231783 2458219 2730820 3061448 3455696 3921895 4479511 5131914 5878076
11140E878076Q40201R02142R22816Q76626P48579N53286L16769O6385j54034l10704
$$ 5878076 6718277 7620419 8543235 9419861 10168440 10721726 11038495 11104880 10950846 10640142
11130A0640142m01866m33354m17478l74654l15321k47979j73698r3357o989P7811
$$ 10640142 10238276 9804922 9387444 9012790 8697469 8449490 8275792 8182435 8175446 8253257
11120H253257J65482K53712L49389M50065N42696O15652O61501O83397O78191
$$ 8253257 8418739 8672451 9021840 9471905 10014601 10630253 11291754 11975151 12653342
11111A2653342O50159O20765O12399O40154P22085Q38681R70963J105970J212020
$$ 12653342 13303501 13924266 14536665 15176819 15898904 16737585 17708548 18814518 20026538
11102B0026538J246682J182111J029029Q00686N01007J84059j27162l99877o07443
$$ 20026538 21273220 22455331 23484360 24285046 24786053 24970112 24842950 24443073 23835630
11093B3835630p47790q31341q79945q87693q75537q24154p51969o49526n21480
$$ 23835630 23087840 22256499 21376554 20488861 19613324 18789170 18037201 17387675 16866195
11084A6866195l81751k35563j01390L9543J68252K87429L97603M73173N19149
$$ 16866195 16484444 16248881 16147491 16187034 16355286 16642715 17040318 17513491 18032640
11075A8032640N46083N71647O03334O61709P23536P80388Q12640P90393P02721
$$ 18032640 18578723 19150370 19753704 20415413 21138949 21919337 22731977 23522370 24225091
11066B4225091N45880L36085R5822j54782l79519n49603o39575o46157n86121
$$ 24225091 24770971 25107056 25202878 25048096 24668577 24118974 23479399 22833242 22247121
11057B2247121m75553l36767j78654k7910J12865K38805L37913M09020M32641
$$ 22247121 21771568 21434801 21256147 21228237 21341102 21579907 21917820 22326840 22759481
11048B2759481L81966K68522J29065k4634j48974k13438k13539j39529k6114J19167
$$ 22759481 23141447 23409969 23539034 23514400 23365426 23151988 22938449 22798920 22772806 22891973
11038B2891973K72430M25183N42251O09247O02211N02320K97863L679l32158o69675
$$ 22891973 23164403 23589586 24131837 24741084 25343295 25845615 26143478 26147157 25814999 25145324
11028B5145324r31710j085508j104850r96750q01024n49522k71615O57K48814
$$ 25145324 24213614 23128106 22023256 21026506 20225482 19675960 19404345 19405002 19653816
11019A9653816M59745O31003P67828Q68017R37980R75843R82801R48074Q67587
$$ 19653816 20113561 20744564 21512392 22380409 23318389 24294232 25277033 26225107 27092694
11010B7092694P30122N67058L97364K40027J03786p416q5632j38339j75372k22215
$$ 27092694 27822816 28389874 28787238 29027265 29131051 29123635 29038003 28899664 28724292 28502077
11000B8502077k83573l62287m57820n78256p10247q44910r48375j002197j009039
$$ 28502077 28218504 27856217 27398397 26820141 26109894 25264984 24316609 23314412 22305373
10991B2305373r63429q79311p75059o73659n86504n06153m39109l77781l15810
$$ 22305373 21341944 20462633 19687574 19013915 18427411 17921258 17482149 17104368 16788558
10982A6788558k33531j34889j5189J36697L08351M90490O62052P93090Q47685
$$ 16788558 16555027 16420138 16404949 16541646 16849997 17340487 18002539 18795629 19643314
10973A9643314Q08342O69422M69287K45363M9022q9528j63168j82631j64892j54537
$$ 19643314 20451656 21121078 21590365 21835728 21884750 21795222 21632054 21449423 21284531 21129994
10963B1129994j71018k41234l73852n64037p76598r81820j142001j230218j239098
$$ 21129994 20958976 20717742 20343890 19779853 19003255 18021435 16879434 15649216 14410118
10954A4410118j179595j074824r49201q27286p14161o14228n30049m52274l95383
$$ 14410118 13230523 12155699 11206498 10379212 9665051 9050823 8520774 8068500 7673117
10945G673117l51098l15189k82166k52556k32311k13802k02730j88018j79970
$$ 7673117 7322019 7006830 6724664 6472108 6239797 6025995 5823265 5635247 5455277
10936E455277j71654j64344j53704j41490j34735j30864j24733j12356j08020
$$ 5455277 5283623 5119279 4965575 4824085 4689350 4558486 4433753 4321397 4213377
10927D213377j03818r8240r1116q3551q1579q1149p3250p3371p4314p0103o4225
$$ 4213377 4109559 4011319 3920203 3836652 3755073 3673924 3600674 3527303 3452989 3382886 3318661
10916C318661n9613n8753o0592n8794n7138n7939n4176n4212n3631n8138n4606
$$ 3318661 3259048 3200295 3139703 3080909 3023771 2965832 2911656 2857444 2803813 2745675 2691069
10905B691069n1179n3123n4332m9915n2387n1463m7391m3147m0995l8383l4458
$$ 2691069 2639890 2586767 2532435 2482520 2430133 2378670 2331279 2288132 2247137 2208754 2174296
10894B174296l5744l8142l2945k9762k6116k8564k6312k5403k1541k2638k5082
$$ 2174296 2138552 2100410 2067465 2037703 2011587 1983023 1956711 1931308 1909767 1887129 1862047
10883A862047k3971k1204k2719k6142k3831k6945k5820k5657k6840k5500k3947
$$ 1862047 1838076 1816872 1794153 1768011 1744180 1717235 1691415 1665758 1638918 1613418 1589471
10872A589471k3161k3738k0905k1611k2706k6184k8613k3186l0431k9239k4081
$$ 1589471 1566310 1542572 1521667 1500056 1477350 1451166 1422553 1399367 1368936 1339697 1315616
10861A315616k1628k2396k2184j8279j7328j6425j9635j3550j4222j2504j0700
$$ 1315616 1293988 1271592 1249408 1231129 1213801 1197376 1177741 1164191 1149969 1137465 1126765
10850A126765j0284r647p833o075o535m571m089n316j880j914k680q239r575j3275
$$ 1126765 1116481 1106834 1099001 1092926 1086391 1081820 1077731 1072415 1070535 1068621 1065941 1057702 1048127 1034852
10836A034852j5525j6339j4400j9090j9767j5546j2923j7659j6280j5884j3687
$$ 1034852 1019327 1002988 988588 969498 949731 934185 921262 903603 887323 871439 857752
10825H57752j1220j5868j3485j5426j4239j3905j1504j1611j5734j1047n609m707
$$ 857752 846532 830664 817179 801753 787514 773609 762105 750494 734760 723713 718104 713397
10813G13397q094j2680j0809q639m424n559l324J988J546N376K41o71J786R5j0077
$$ 713397 705303 692623 681814 673175 668751 663192 659868 661856 663402 668778 669019 668348 670134 670229 660152
10798F60152j8123j9493j6799j6870j6591j4726j5133j0584k781k809q237j0446
$$ 660152 642029 622536 605737 588867 572276 557550 542417 531833 529052 526243 518006 507560
10786E07560j0507j2116n265o116o832q888l170j88o300p299m369p277p489m141
$$ 507560 497053 484937 479672 473556 466724 457836 454666 454478 448178 440879 436510 429233 421744 417603
10772D17603m955j857l424m71L751K406K774N769Kl635m945r016q579j0376l979
$$ 417603 412648 410791 407367 406896 410647 413053 415827 421596 421598 417963 413018 404002 395423 385047 381068
10757C81068q888q436j0059n550j557j592l940k616j0260p517l441k354m580q472
$$ 381068 372180 363744 353685 348135 346578 344986 341046 338430 328170 320653 317212 314858 310278 301806
10743C01806K83k161k625n978m387j202O42p85k40l063J704J327M41k998q06K328
$$ 301806 302089 299928 297303 291325 286938 285736 286378 285593 285353 282290 283994 285321 285762 282764 281958 284286
10727B84286M148J471j957j850K205M721L931L594K056k656n236j123P07J72M911
$$ 284286 288434 289905 287948 286098 288303 293024 296955 300549 302605 299949 294713 293590 294297 294469 299380
10712B99380M298J422k61m248N38j73n225j534n866n133k206o61K422K490j659
$$ 299380 303678 305100 304839 300591 301129 300956 295731 294197 288331 283198 280992 280331 282753 285243 283584
10697B83584o09j339L521L040m84L967N694R540L03j212J138K028K981J530K848
$$ 283584 282975 281636 285157 288197 287713 291680 297374 306914 307217 306005 307143 309171 312152 313682 316530
10682C16530K488J567M106L603L401O548P066M830p14r50K637k473l029m542m197
$$ 316530 319018 320585 324691 328294 331695 338243 345309 350139 349425 348475 351112 348639 345610 341068 336871
10667C36871m792l899k800k617j522P79J644k904j215j622K180n88k813J408K348
$$ 336871 332079 328180 325380 322763 321241 322020 323664 320760 319545 317923 320103 319515 316702 318110 320458
10652C20458L934j076p4l243K82Lr99J365N779L741K184J852L802j233l608k157
$$ 320458 324392 323316 323242 319999 320281 320284 319285 320650 326429 330170 332354 334206 338008 336775 333167 331010
10636C31010Q9j51j862j286n692j89r50R80R28L632N264K710k618m56k395Q97
$$ 331010 331099 330948 329086 327800 322108 321919 320969 321949 322877 326509 331773 334483 331865 331409 329014 329911
10620C29911J13m028j515j107m463k620M29L71o6j49L915K795M803P980P070Q257
$$ 329911 330024 325996 324481 323374 318911 316291 316720 317091 317025 316876 320791 323586 328389 336369 343439 351696
10604C51696Q588R61j925k538k760j0148j8059j3190o568p49J958J000k376K750
$$ 351696 360284 361245 359320 356782 354022 343874 325815 312625 306057 305308 307266 308266 305890 308640
10590C08640L698K327J463J783P317O343O759K05l540J424l082k144p83l933n672
$$ 308640 312338 314665 316128 317911 325228 331571 338330 338535 334995 336419 333337 331193 330410 326477 320805
10575C20805m814k801l255p253o401r19l436r320n538j302L910L322K906M586
$$ 320805 315991 313190 309935 302682 296281 295362 291926 282606 277068 275766 279676 282998 285904 290490
10561B90490J0063J6100J1535P987M99J294m405l441q850p517k821q173r002p267
$$ 290490 300553 316653 328188 336175 336674 337968 333563 330122 321272 313755 310934 302761 293759 286492
10547B86492o798p375m450o494o175N29N121l293q870J791j740n825q686j1024
$$ 286492 279694 272319 267869 261375 255200 255729 260850 257557 248687 250478 248738 242913 234227 223203
10533B23203j1599o635p640j0548p572o587l343n083n224j79o20k330lJ7N13j530
$$ 223203 211604 204969 197329 186781 179209 172622 169279 164196 158972 158793 158173 155843 155840 155857 156370 154840
10517A54840K345O166N679P427J2774R745O312K53o965j2736j3619j0984j0030
$$ 154840 157185 163351 169030 176457 189231 198976 205288 205541 198576 185840 172221 161237 151207
10504A51207m018n702j026J752L13p65m420q971k782J773n65M14J248l4k787k149
$$ 151207 147189 141487 140461 142213 142526 141761 137341 128370 125588 127361 126796 127210 128458 128424 125637 123488
10488A23488j53m921p010k746q3k156n320j466L748K056k301p57k099K05k016
$$ 123488 123335 118414 111404 108658 108575 106419 101099 99633 103381 105437 103136 102379 100280 100485 98469
10473I8469j154l091O84J435j479J738l767j448p53M4K369L695k915N85k94l63
$$ 98469 97315 94224 94908 96343 94864 96602 92835 91387 90634 90678 93047 96742 93827 94412 94118 93755
10457I3755K831L635j590j274j352M376j060n569j242k407K036q25k079j547k819
$$ 93755 96586 100221 98631 97357 96005 100381 99321 93752 92510 90103 92139 91314 89235 87688 84869
10442H4869l260R26L571j731j52r58l175R50J779J740K738K299J323q60K384q46
$$ 84869 81609 82535 86106 84375 84223 83265 80090 81040 82819 84559 87297 89596 90919 90059 92443 91597
10426I1597m987j49N881K326p83J688q07k778l98k639o303j767J258J710k446
$$ 91597 86610 86461 92342 94668 93885 95573 94766 91988 91590 88951 82648 80881 82139 83849 81403
10411H1403m136j159L17P80M006Q74r58j380K012N551J052o53l364J916J978J239
$$ 81403 77267 76108 76425 77205 81211 82085 81127 79747 81759 87310 88362 87709 84345 86261 88239 89478
10395H9478N36O021L957M785Q04l744l177J521M634L19n318J244n860J360P887
$$ 89478 90014 96035 99992 104777 105581 101837 98660 100181 104815 105134 99816 101060 95200 96560 104447
10380A04447M475K387M732M614O608J1667J1560Q939j95m505q681q907j0092n057
$$ 104447 108922 111309 116041 120655 127263 138930 150490 159429 159234 154729 146048 137141 127049 121992
10366A21992n931l273J682l037n533o14N22l552l756r14K846k094K06l92J917
$$ 121992 116061 112788 114470 111433 105900 105286 105808 102256 98500 97586 100432 98338 98544 98152 100069
10351A00069L419n52j017K401K461M615J672R07N789M057J699K384q76j616N2
$$ 100069 103488 102936 101919 104320 106781 111396 113068 113975 119764 123821 125520 127904 127028 125412 125464
10336A25464J830J362N08r02J728K760N436R424J0893J0599O035K013l704o658
$$ 125464 127294 128656 129164 128262 129990 132750 138186 147610 158503 169102 175137 177150 173446 166788
10322A66788n172j1604j3210p663q013k027L084J867j85J326R682M211j339k869
$$ 166788 161616 150012 136802 129139 121126 119099 122183 124050 123865 125191 134873 139084 137745 134876
10308A34876m060o18m25l612l965R7k911M3M198j605l88K351J548m632l554m314
$$ 134876 130816 130198 129773 126161 122196 122293 119382 119425 123623 122018 121630 123981 125529 120897 117343 113029
10292A13029k223K81k054N75J494j567k586K676J643l36R898M645Q194J2379J3100
$$ 113029 110806 111087 109033 109608 111102 109535 106949 109625 111268 110932 120830 125475 133669 146048 159148
10277A59148J4978R911J576j2866j3450j4001j3947r454o034m058K578l487k235
$$ 159148 174126 184037 185613 172747 159297 145296 131349 121895 115861 111803 114381 110894 108659
10264A08659L598L447R64l941r583m021J580K191o35l506O07k463K290J664K513
$$ 108659 112257 115704 116668 112727 103144 99123 100703 102894 102259 98753 99360 96897 99187 100851 103364
10249A03364J106l050K054n712k441k33N097J329l53k465l584K340L397L532N923
$$ 103364 104470 101420 103474 97762 95321 95088 100185 101514 101161 98696 95112 97452 100849 104381 110304
10234A10304O000N393J256k44m720k134m136j470l82k025n464o104N14l59l132
$$ 110304 116304 121697 122953 122709 117989 115855 111719 110249 109867 107842 102378 96274 96788 96429 93297
10219I3297j988L6K565k849l849j87K31M748J67n480L92J294L617k53L34K62K60
$$ 93297 91309 91345 93910 91061 87212 87025 87256 92004 92171 86691 87083 88377 91994 91741 92075 92337 92597
10202I2597Q27L381J01K898j437k259j290j246l65n490l202j40j517J151K991
$$ 92597 93424 96805 96906 99804 98367 96108 94818 93572 93207 87717 84515 84375 82858 84009 87000
10187H7000k193m470l318J039P33Q74K847k05m301l063p02m61R49M586L151M048
$$ 87000 84807 80337 77019 78058 78791 79665 82512 82307 78006 74943 74241 73780 74729 79315 82466 86514
10171H6514k90m416L08J263n75k250L57K545j500m266l182L183k73J457M23L095
$$ 86514 86224 81808 82116 83379 82804 80554 80911 83456 81956 77690 74508 77691 77418 78875 79298 82393
10155H2393K40q42P0M81m693J800L908L005K098j802j614k3q72j558k731k785
$$ 82393 82633 81791 81861 82342 77649 79449 83357 86362 88460 86658 85044 85021 84149 82591 79860 77075
10139G7075k798q49K134L022n314m417L062K902L533j007k533L353N75m92j642
$$ 77075 74277 73428 75562 78584 73270 68853 71915 74817 78350 77343 74810 78163 78738 78246 76604
10124G6604P14O09R67K216K792K812K185k140l574q8L159l43m166l067J825R85
$$ 76604 77318 77927 78894 81110 83902 86714 88899 86759 83185 83097 86256 85913 81747 78680 80505 81490
10108H1490Q99kJ440j299k501j040m974r97P564J770j126P4L734L24l001l30j235
$$ 81490 82389 82387 83827 82528 80027 78987 74013 73016 80580 82350 81224 81298 85032 85356 82355 82025 80790
10091H0790j713k11n382l757J767L468K811O309k01L139L511n60J589J811L451
$$ 80790 79077 78866 73484 69727 71494 74962 77773 84082 83881 87020 90531 89971 91560 93371 96822
10076I6822l096j916l468j005m32k268o06L436m7j483j057m850j500N779M886
$$ 96822 93726 91810 88342 87337 86905 84637 84031 87467 87420 85937 84880 80030 78530 84309 89195
10061H9195j074K010j876l793K83k2n761k529n2L569K149J810J963R54k66On167
$$ 89195 88121 90131 88255 84462 84745 84723 78962 76433 76381 79950 82099 83909 85872 86826 86560 86566 81399
10044H1399m81L831N658J082j376k179k860O73M55M61l401j574J369N8J639O19
$$ 81399 80918 84749 90407 91489 90113 87934 85074 85747 86202 86663 83262 81688 83057 83115 84754 85373
10028H5373k15k223j095q4N59k44L466K489P37o68k504L48N42J761M852P65L84
$$ 85373 85158 82935 81840 81756 82315 82071 85537 88026 88763 88095 85591 85939 86481 88242 93094 93859 94243
10011I4243K563m087p072o735Q87O203R35j555j890m413k761K285M267k721m2
$$ 94243 96806 92719 85647 78912 79799 86002 86937 85382 83492 79079 76318 78603 82870 80149 80107
9996H0107K120K769k018L712K589j619m25k263J5K205J448k207p85o19M69k22
$$ 80107 82227 84996 82978 86690 89279 87660 87235 84972 84987 87192 88640 86433 85648 85029 85498 85276
9980H5276k215M056M742k68K544k278L596L648O02n499j782q05j121l202n23j245
$$ 85276 83061 87117 91859 91591 94135 91857 95453 99101 99703 94204 92422 91617 90496 87294 86771 85526
9964H5526l871o41L153J574j710L094K603N809k80o800m85J238N247L886R42r66
$$ 85526 81655 81014 84167 85741 84031 87125 89728 95537 95257 88457 87972 89210 94457 98343 99285 98319
9948I8319J388K88J1n82l046m506n05L573j176j30k56n04l672J305l84o054r0
$$ 98319 99707 99995 100006 99424 96378 91872 91367 94940 93764 93634 93378 92874 89202 90507 90123 84069 83979
9931H3979J943K377J786M70m55K204K539m54r87L077J167j344m197K98k51m3o8
$$ 83979 85922 88299 90085 90555 90100 92304 94843 94389 93402 96479 97646 96302 92105 92403 92152 92109 92041
9914I2041p93o798O51M466K079M810L273J961l081k016O71P26k152j464k3K776
$$ 92041 91248 84450 85101 89567 91646 96456 99729 101690 98609 96593 97264 97990 95838 94374 94351 97127
9898I7127K001l31J426j528k546K414L43j376o18j10N938J343j570M32L08j449
$$ 97127 99128 98797 100223 98695 96149 98563 98906 97530 96912 96802 102740 104083 102513 102945 103253 101804
9882A01804l66k342k503L830K530J698Q91l710o52n35l65M91O22O43j22L71P52
$$ 101804 101438 99096 96593 100423 102953 104651 105542 101832 101180 100645 100280 100771 101393 102036 101914 102285 103037
9865A03037k360k717O62K204p37K234n38j211M172N804K118J135P16k873o918
$$ 103037 100677 97960 98622 100826 100089 102323 101785 100574 104746 110550 112668 113803 114519 111646 104728
9850A04728k175O49J296K008k175J541m64j223m51K77J710K10L780J478n95R28
$$ 104728 102553 103202 104498 106506 104331 105872 105408 104185 103734 104011 105721 105931 109711 111189 110594 111522
9834A11522k826l474J318O91J593n216J405K979K438j643l36j461K055J807j048
$$ 111522 108696 105222 106540 107231 108824 103608 105013 107992 110430 108787 108451 106990 109045 110852 109804
9819A09804q94J978J18j482l243L34j37j224K343O612L523R91j427L79k725j070
$$ 109804 108910 110888 111006 109524 106281 106615 106478 105254 107597 114209 117732 118723 117296 117675 114950 113880
9803A13880N015P280K698j931p548j71j91J823N702K836J802K041J838k777l231
$$ 113880 118895 126175 128873 126942 119394 119223 119032 120855 126557 129393 131195 133236 135074 132297 129066
9788A29066j514q7J634j416N32n5L525J693K162J153o17N11J537O59k604M07k32
$$ 129066 127552 127465 129099 127683 128215 128160 131685 133378 135540 136693 136076 136587 138124 138783 136179 136586 136354
9771A36354O07K858L863J838q85o50M62R52K472P116P951N028q06k542J620O3
$$ 136354 136961 139819 143682 145520 144635 143985 144447 145399 147871 154987 162938 167966 167160 164618 166238 166301
9755A66301l152J383N63J06n263k28m36K72K420J286k56J131l75O224J505k146
$$ 166301 163149 164532 165095 165201 159938 159710 159274 159546 161966 163252 162996 164127 163752 169976 171481 169335
9739A69335j755N955j020j727lJ031K378J664m728n39m70K972N358p85M079O558
$$ 169335 167580 173535 172515 170788 170785 171816 174194 175858 171130 170591 170121 173093 178451 177666 181745 188303
9723A88303P44N23J624%K633N52L951L591J025l453m185l077R65j77l54L967J227
$$ 188303 189047 189570 191194 191194 193827 194379 198330 201921 202946 199493 195308 192231 193196 193019 192665 196632 197859
9706A97859j147K66J535J830J657j661K98L473L047k244l98K382J671k55k320
$$ 197859 196712 196978 198513 200343 202000 200339 200637 204110 207157 204913 204515 206897 208568 208313 205993
9691B05993j108k098k136J763L023K351J290j660k326p22j431j756L320J852K283
$$ 205993 204885 202787 200651 202414 205437 207788 209078 207418 205092 204370 202939 201183 204503 206355 208638
9676B08638O58n42l206K68J474J456M1M671J640j835K383K389j394L52l79l61
$$ 208638 209296 208754 205548 205816 207290 208746 208787 213458 215098 213263 215646 218035 216641 216993 216614 216253
9660B16253j900k939j60K603K132k813j569m38k512p188m814k117K513k03K932
$$ 216253 214353 211414 211254 213857 215989 213176 211607 211169 208657 201469 196655 194538 197051 196848 199780
9645A99780K080j17k083p144p480k766Q96L909J280J488J345j486j357J707K475
$$ 199780 201860 201743 199660 192516 185036 182270 183166 187075 188355 189843 191188 189702 188345 190052 192527
9630A92527J664J550M160L279J09J725k543j248o13m466o106n2J276k674J731
$$ 192527 194191 195741 199901 203180 203289 205014 202471 201223 200610 196144 190038 189986 191262 188588 190319
9615A90319q01j980K501l214k679P33m70J672J154R50L88j561l015l202j123K589
$$ 190319 189518 187538 190039 186825 184146 184879 184409 186081 187235 188185 188573 187012 183997 180795 179672 182261
9599A82261k245l029K440j325m573M523K431J657J365K311n33J374O209K605l522
$$ 182261 180016 176987 179427 178102 173529 178052 180483 182140 183505 185816 185283 186657 192866 195471 191949
9584A91949o40j544o06J883K32m89m39Q71k36p71K184j719j325J014o001q33Q185
$$ 191949 191309 189765 189159 191042 191274 190785 190346 191217 190981 190210 192394 190675 189350 190364 184363 183530 191715
9567A91715J625j149K277M481Q84k750k301L87k345j174K064J018J647J785P906
$$ 191715 193340 192191 194468 198949 199833 197083 194782 195169 192824 191650 193714 194732 196379 198164 206070
9552B06070P568L280J902N87Q62M137q79l066K536N190J579k143k317m449J905
$$ 206070 213638 216918 218820 219407 220269 224406 223527 220461 222997 228187 229766 227623 225306 220857 222762
9537B22762N450O382n4q40K128N870P664K508M872J252R5j727m770j11N964K004
$$ 222762 228212 234594 234540 233700 235828 241698 249362 251870 256742 257994 258089 256362 251592 251481 257445 259449
9521B59449P93L021K990N78M805L377M986R05k083j304J587K446j476M480Q592
$$ 259449 260242 263263 266253 266831 271636 275013 279999 280904 278821 277517 279104 281550 280074 284554 293146
9506B93146N914m230J841O632k221M427N460K178P96K665J870N677M677M374K220
$$ 293146 299060 294830 296671 303303 301082 305509 310969 313147 313943 316608 318478 324155 328832 333206 335426
9491C35426N999L027K988K123P27L743O764K897N281K493J940J458J247K286K502
$$ 335426 341425 344452 347440 349563 350290 354033 360797 363694 368975 371468 373408 374866 376113 378399 380901
9476C80901K987P509N608M083P294L167L355P741M222L918M614L476O829M874
$$ 380901 383888 391397 397005 401088 408382 411549 414904 422645 426867 430785 435399 438875 445704 450578
9462D50578k107j433M274P073O998J0305P420M426N864L777N994L178L509M464
$$ 450578 448471 447038 451312 458385 465383 475688 483108 487534 493398 497175 503169 506347 509856 514320
9448E14320P787M788R111R772Q298P277O067N653O047P714Q778K773M915J2823
$$ 514320 522107 526895 536006 545778 554076 561353 567420 573073 579120 586834 595612 598385 603300 616123
9434F16123J5716J6199J2128J5144J4647Q759J0225J4025J3000J6094J7612J7913
$$ 616123 631839 648038 660166 675310 689957 698716 708941 722966 735966 752060 769672 787585
9422G87585J9508K4148L1265L3811M2138M7455N1504N7432O5398P7679Q8404R9197
$$ 787585 807093 831241 862506 896317 938455 985910 1037414 1094846 1160244 1237923 1326327 1425524
9410A425524J22196J44134J60460J77184J85845J92852J95015J75329J40658R6598
$$ 1425524 1547720 1691854 1852314 2029498 2215343 2408195 2603210 2778539 2919197 3015795
9400C015795M2293j1296n5323p9741q9073q9911p8579o3725n3287l4185k0044
$$ 3015795 3058088 3046792 2991469 2911728 2822655 2732744 2654165 2590440 2537153 2502968 2482924
9389B482924J943J6760L1739N5019P5984R7235J14246J32676J49983J59498J66849
$$ 2482924 2484867 2501627 2533366 2588385 2664369 2761604 2875850 3008526 3158509 3318007 3484856
9378C484856J77207J89605J99933K11535K32664K53518K84269L20286L54779L77942
$$ 3484856 3662063 3851668 4051601 4263136 4495800 4749318 5033587 5353873 5708652 6086594
9368F086594L86701L85218L57155L15033K66445K14028J65066J09007O1349J9011
$$ 6086594 6473295 6858513 7215668 7530701 7797146 8011174 8176240 8285247 8346596 8365607
9358H365607j4005l8277n2038o0972o6156n7668l9866j0784K6750P0862J03143
$$ 8365607 8351602 8313325 8261287 8200315 8134159 8076491 8036625 8025841 8052591 8123453 8226596
9347H226596J35135J60823J63952J53816J29117J05663Q3210O0362O0094P9072
$$ 8226596 8361731 8522554 8686506 8840322 8969439 9075102 9158312 9218674 9278768 9357840
9337I357840R9149J30593J75405K37076K92227L45188L94156M22409M30812M23974
$$ 9357840 9456989 9587582 9762987 10000063 10292290 10637478 11031634 11454043 11884855 12308829
9327A2308829L85024L31254K65293J90826J19488N5021J1956j2296j1963L655
$$ 12308829 12693853 13025107 13290400 13481226 13600714 13655735 13667691 13655395 13643432 13647087
9317A3647087L3400N9508Q4113R9098J08240J16709J21522J14107J06901Q9389
$$ 13647087 13680487 13739995 13824108 13923206 14031446 14148155 14269677 14383784 14490685 14580074
9307A4580074O4205L4613L229k6475n8434p2893r1294j04030j14053j25425j36290
$$ 14580074 14644279 14678892 14682121 14655646 14597212 14524319 14433025 14328995 14214942 14089517 13953227
9296A3953227j40357j27764j07327o8551k7308J0171M2762O1818O8460O4364N7451
$$ 13953227 13812870 13685106 13577779 13509228 13481920 13492091 13534853 13596671 13665131 13729495 13786946
9285A3786946M6702L0779K9020L7851M4415N7102P4571R1934J06719J10758J17313
$$ 13786946 13833648 13864427 13893447 13931298 13975713 14032815 14107386 14199320 14306039 14416797 14534110
9274A4534110J39524J69470J99631K07826J89706J37916N3113o3163j78674k94861
$$ 14534110 14673634 14843104 15042735 15250561 15440267 15578183 15631296 15568133 15389459 15094598
9264A5094598l91654m52666m77639m68497m41226m08253l68531l42380l16469
$$ 15094598 14702944 14250278 13772639 13304142 12862916 12454663 12086132 11743752 11427283
9255A1427283k89364k63695k45964k26802k20448k13918k08289k06724k01434
$$ 11427283 11137919 10874224 10628260 10401458 10181010 9967092 9758803 9552079 9350645
9246I350645j81955j43702j01255m9610J1653N7880R6430J23364J41918J44745
$$ 9350645 9168690 9024988 8923733 8874123 8885776 8943656 9040086 9163450 9305368 9450113
9236I450113J39283J25880J08583Q9956Q0117N6012K6149k0494p0926j27254j92190
$$ 9450113 9589396 9715276 9823859 9913815 9993932 10049944 10076093 10055599 9984673 9857419 9665229
9225I665229k43658k87124l11928l14184l07872k91135k50837k13399j76076j30247
$$ 9665229 9421571 9134447 8822519 8508335 8200463 7909328 7658491 7445092 7269016 7138769
9215G138769q9218n8756m1372m2064o2114r9847j42516j89842k26957k53654k59051
$$ 7138769 7049551 6990795 6949423 6907359 6845245 6745398 6602882 6413040 6186083 5932429 5673378
9204E673378k54651k30063j96732j52890j18015q2726m4838j5748J0656L1595
$$ 5673378 5418727 5188664 4991932 4839042 4721027 4638301 4593463 4577715 4588371 4619966
9194D619966L0951K5717P711k0900o9273j15967j52500j79669j93912j96916j86185
$$ 4619966 4650917 4676634 4684345 4663445 4594172 4478205 4325705 4146036 3952124 3755208 3569023
9183C569023j75581j57811j40960j23446j06932r9130q7459q7245q0526p5319
$$ 3569023 3393442 3235631 3094671 2971225 2864293 2765163 2677704 2590459 2509933 2434614
9173B434614o7524o0701n4083n0101m4116m0101l1309k9329l1048k3537k2848
$$ 2434614 2367090 2306389 2252306 2202205 2158089 2117988 2086679 2057350 2026302 2002765 1979917
9162A979917k4091k1017j9727j9213j6691j5233j5108j3853j3908j5669j0282
$$ 1979917 1955826 1934809 1915082 1895869 1879178 1863945 1848837 1834984 1821076 1805407 1795125
9151A795125j2789j6379j5689j6288j3798j3435j8081j5865j6905j9161j8056
$$ 1795125 1782336 1765957 1750268 1733980 1720182 1706747 1688666 1672801 1655896 1636735 1618679
9140A618679j4504j9883j9134j7466k0211j3335p664j1187j1546r531p941k549
$$ 1618679 1604175 1584292 1565158 1547692 1527481 1514146 1506482 1495295 1483749 1474218 1466277 1463728
9128A463728L43r50k873n603p887q466j1346j8801j5930j9389k0314j0895n210
$$ 1463728 1464071 1463121 1460248 1454645 1446758 1438292 1426946 1408145 1392215 1372826 1352512 1341617 1336407
9115A336407j378L518O167O120Q573L957P751J1935P742L750j40j595K388P330
$$ 1336407 1335029 1338547 1344714 1350834 1359407 1363364 1371115 1383050 1390792 1394542 1394402 1392807 1395195 1402525
9101A402525J0623R074J4941J5185J0089J0828J5572J8213J8515K0517J7627J7889
$$ 1402525 1413148 1422222 1437163 1452348 1462437 1473265 1488837 1507050 1525565 1546082 1563709 1581598
9089A581598J6544J9859K1876J8783J6368J6385J7449K3120K7377L3304M2029
$$ 1581598 1598142 1618001 1639877 1658660 1675028 1691413 1708862 1731982 1759359 1792663 1834692
9078A834692M5057N5739N8067O0129O8534O7229O4440O3638O6589P8877J01059
$$ 1834692 1879749 1935488 1993555 2053684 2122218 2189447 2253887 2317525 2384114 2462991 2564050
9067B564050J18339J29494J23273J02838P8328O0759O1634O6636P9348R7093J18029
$$ 2564050 2682389 2811883 2935156 3037994 3116322 3177081 3238715 3305351 3384699 3481792 3599821
9056C599821J41069J46264J56363J76737J87822K09623K41089K72461L02124L35877
$$ 3599821 3740890 3887154 4043517 4220254 4408076 4617699 4858788 5131249 5433373 5769250
9046E769250L74078M14638M57826N03327N54904O13369O73409P39131Q21062R04791
$$ 5769250 6143328 6557966 7015792 7519119 8074023 8687392 9360801 10099932 10920994 11825785
9036A1825785R89455J081009J170128J241047J301613J323581J304897J242816
$$ 11825785 12815240 13896249 15066377 16307424 17609037 18932618 20237515 21480331
9028B1480331J121184R40594P03165M15598J07381j97280m75731p10899q91906
$$ 21480331 22601515 23542109 24245274 24660872 24768253 24570973 24095242 23384343 22492437
9019B2492437j012400j086400j104630j091803j058207j009787r54425q92393
$$ 22492437 21480037 20393637 19289007 18197204 17138997 16129210 15174785 14282392
9011A4282392q28396p65986o99066o35741n78626n28247m75761m36710m00738
$$ 14282392 13453996 12688010 11988944 11353203 10774577 10246330 9770569 9333859 8933121
9002H933121l78716l58534l38392l23104l02063k82521k65214k52325k41175k34400
$$ 8933121 8554405 8195871 7857479 7534375 7232312 6949791 6684577 6432252 6191077 5956677
8992E956677k19171k02102j92250j86344j78630j66724j58980j38690j18464j05418
$$ 5956677 5737506 5535404 5343154 5156810 4978180 4811456 4652476 4513786 4395322 4289904
8982D289904r9623q7486q3983q4633q7501q8099q9217q6387q5810q2387p5305
$$ 4289904 4190281 4102795 4018812 3934179 3846678 3758579 3669362 3582975 3497165 3414778 3339473
8971C339473n8658l3683l620J7205L4820L6610K1683l439k7730m4610n2517n7850
$$ 3339473 3280815 3247132 3243512 3260717 3295537 3332147 3353830 3350391 3322661 3278051 3225534 3167684
8959C167684n5397n1306l5955k3614j9841j1916r973p515L878J7897L0135M6441
$$ 3167684 3112287 3060981 3025026 3001412 2981571 2969655 2959682 2952167 2956045 2973942 3004077 3050518
8947C050518P9595J17370J54082K14561K84898L37954L69111L43408K83751K00806
$$ 3050518 3130113 3247483 3401565 3616126 3901024 4238978 4608089 4951497 5235248 5436054
8937E436054K8102j99059l40658l55335k93476k14139j46714j06766q6665p7897
$$ 5436054 5464156 5265097 4924439 4569104 4275628 4061489 3914775 3808009 3721344 3643447
8927C643447p4491p0858o5477n7226m4256l3453k6019k4268k0591n419k121j491
$$ 3643447 3568956 3498098 3432621 3375395 3331139 3297686 3271667 3247399 3226808 3221389 3219268 3217777
8915C217777j412m13K358J211o792j5623k3813k3876j9885j5454j1815o697o336
$$ 3217777 3216365 3215952 3218310 3219521 3212729 3197106 3173293 3149417 3129532 3114078 3102263 3095566 3089230
8902C089230k507J628n998j2790o941K10k329K322K711P000J0918K927l732N189
$$ 3089230 3086723 3088351 3082353 3069563 3062622 3062832 3060503 3062825 3065536 3072536 3083454 3086381 3082649 3087838
8888C087838J1776J1839K3324K6513L3086L2132L6338L9874M2603L9258L5251
$$ 3087838 3099614 3111453 3134777 3161290 3194376 3226508 3262846 3302720 3345323 3384581 3419832
8877C419832L0201K1445J5645K4426L0052L5225M7918N5729O5318O8328P5841
$$ 3419832 3450033 3471478 3487123 3511549 3541601 3576826 3624744 3680473 3745791 3814119 3889960
8866C889960Q5215R4881J02113J02933J04377J02794J03553J12312J40507J69697
$$ 3889960 3975175 4070056 4172169 4275102 4379479 4482273 4585826 4698138 4838645 5008342
8856E008342J94529K22801K44360K50783K55378K58291K66396K84450L05689L34352
$$ 5008342 5202871 5425672 5670032 5920815 6176193 6434484 6700880 6985330 7291019 7625371
8846G625371L51572L63014L90169M17057M63985N39763O31315P37985Q46155R56099
$$ 7625371 7976943 8339957 8730126 9147183 9611168 10150931 10782246 11520231 12366386 13322485
8836A3322485J081460J258863J507056J842678K259319K748539L293386L852230
$$ 13322485 14403945 15662808 17169864 19012542 21271861 24020400 27313786 31166016
8828C1166016M442098N098853N836730O677338P756768R354156J1797827J5540031
$$ 31166016 35608114 40706967 46543697 53221035 60977803 70331959 82129786 97669817
8820I7669817K1082476K8916619L9589691N3235447O7898674P6989143P1345061
$$ 97669817 118752293 147668912 187258603 240494050 308392724 385381867 456726928
8813D56726928M9741537J9871263j5198441n2024232p4686010p3685882n9394837
$$ 456726928 506468465 526339728 511141287 459117055 384431045 310745163 251350326
8806B51350326m4044659l2057455k3484698j7523303j3465484j0661595q740801
$$ 251350326 207305667 175248212 151763514 134240211 120774727 110113132 101372331
8799A01372331p500801o718364o183120n741786n224028m603837l989794l469152
$$ 101372331 93871530 87153166 80970046 75228260 70004232 65400395 61410601 57941449
8791E7941449l050264k703946k418931k165000j921906j718801j593597j527800
$$ 57941449 54891185 52187239 49768308 47603308 45681402 43962601 42369004 40841204
8783D0841204j497382j484171j478062j450605j400869j311941j208340j103395
$$ 40841204 39343822 37859651 36381589 34930984 33530115 32218174 31009834 29906439
8775B9906439j013358r49718q99443q45750p88155p23231o67652o29508o01493
$$ 29906439 28893081 27943363 27043920 26198170 25410015 24686784 24019132 23389624 22788131
8766B2788131n81869n56340n31462n16446n08326n00863m97750m86738m79934
$$ 22788131 22206262 21649922 21118460 20602014 20093688 19592825 19095075 18608337 18128403
8757A8128403m59848m40620m23023m02570l89040l75033l75157l74240l73408
$$ 18128403 17668555 17227935 16804912 16402342 16013302 15638269 15263112 14888872 14515464
8748A4515464l65798l58891l44985l32503l21926l06797k94428k83671k72343
$$ 14515464 14149666 13790775 13445790 13113287 12791361 12484564 12190136 11906465 11634122
8739A1634122k65795k57524k53389k39831k31651k24267k11036j97096j88519
$$ 11634122 11368327 11110803 10857414 10617583 10385932 10161665 9950629 9753533 9565014
8730I565014j87576j85673j95305k06462k09595k05958k01227j89540j79361j69296
$$ 9565014 9377438 9191765 8996460 8789998 8580403 8374445 8173218 7983678 7804317 7635021
8720G635021j59965j54002j51617j55406j50828j37091j38169j34834j20125j15448
$$ 7635021 7475056 7321054 7169437 7014031 6863203 6726112 6587943 6453109 6332984 6217536
8710F217536j08567r9949r2659q9612q3188q3786q5293p6947o5187n9177n7321
$$ 6217536 6108969 6009020 5916361 5826749 5743561 5659775 5574482 5497535 5432348 5373171 5315850
8699E315850n8767n2270l8058j6135J5399N1421J06937J84660K73558L53708L67757
$$ 5315850 5257083 5204813 5166755 5150620 5166019 5217440 5324377 5509037 5782595 6136303 6504060
8688F504060K57724M7354j22095k11686k38509k46072k75700k78660k48640k09348
$$ 6504060 6761784 6809138 6687043 6475357 6236848 5990776 5715076 5436416 5187776 4978428
8678D978428j75770j42519j23676j10596j06167j15460j19971j17260j19927j16419
$$ 4978428 4802658 4660139 4536463 4425867 4319700 4204240 4084269 3967009 3847082 3730663
8668C730663j08662j03577j03199j07845j01771r4372q0485o2633l3717K203K6571
$$ 3730663 3622001 3518424 3415225 3307380 3205609 3111237 3030752 2968119 2934402 2936605 2963176
8657B963176K9809K7222P060k4676m6281o0720p3899p6668o5320n8676n2583m4910
$$ 2963176 2992985 3020207 3027267 3002591 2956310 2895590 2821691 2745023 2679703 2621027 2568444 2523534
8645B523534m1982l0731k5663k0251k4182k8488l6727m2280m3625n1944n7316
$$ 2523534 2481552 2450821 2425158 2404907 2380725 2352237 2315510 2273230 2229605 2177661 2120345
8634B120345n4540n4205n8453n3351m8640m6731m2770l6324l9231m2703m0090
$$ 2120345 2065805 2011600 1953147 1899796 1851156 1804425 1761655 1725331 1686100 1643397 1603307
8623A603307l0770k7946l1587k4718k0221k2011k2642k6662l4900m0044l6339
$$ 1603307 1572537 1544591 1513004 1488286 1468065 1446054 1423412 1396750 1361850 1321806 1285467
8612A285467l3421k4154j8659k2672j6960o967j306o66n936o019j1505j2861j7472
$$ 1285467 1252046 1227892 1209233 1186561 1169601 1162634 1161328 1160662 1154726 1148707 1137202 1124341 1106869
8599A106869k0095k0149k0451k4814k1105j4666j5485j6088j4343j5138j4102
$$ 1106869 1086774 1066625 1046174 1021360 1000255 985589 970104 954016 939673 924535 910433
8588I10433j6452j6026j3315j7558j7742j7675j2744p474q372o683k410k832n802
$$ 910433 893981 877955 864640 847082 829340 811665 798921 791447 783075 776392 773982 771150 765348
8575G65348q119j5341k0712j8928k1648k1377j2281j0616o600m825j218k31l614
$$ 765348 757229 741888 721176 702248 680600 659223 646942 636326 629726 624901 623683 623452 619838
8562F19838K11M756m910j7828j8365k3975k2675k1692j4817o447q469q231n274
$$ 619838 620049 624805 619895 602067 583702 559727 537052 515360 500543 494096 485627 477396 472122
8549D72122o864j00K655N040K253l062l483n873p801j4732k647m049j1467j1575
$$ 472122 465258 465158 467813 472853 475106 472044 468561 462688 454887 440155 437508 433459 421992 410417
8535D10417q850n294l2j802J869k75m005k006m937n307k292J78m578n437l944
$$ 410417 401567 396273 396241 394439 396308 396033 392028 390022 385085 379778 377486 377664 373086 367649 363705
8520C63705q043j0331j0594o143l890j891K121K093k32K266O212J557j755j1539
$$ 363705 355662 345331 334737 328594 324704 322813 324934 327027 326795 329061 335273 336830 335075 323536
8506C23536j1993j7114j8672j4604r452p60K787P575O798K1330K9462K6244J2945
$$ 323536 311543 294429 275757 261153 251701 250941 253728 261303 268101 289431 318893 345137 358082
8493C58082M383j3722l1481k6659j8092j3809q889q187m013p081j0081j0964q205
$$ 358082 362465 348743 317262 290603 272511 258702 249813 241626 237613 230532 220451 209487 201282
8480B01282q168m559n483m530l210j694j0245p340k408K079n51p019q086l964
$$ 201282 193114 188555 183072 178542 175332 173638 163393 156053 153645 155724 155173 148154 140068 136104
8466A36104l053j971j266k270J182m807K597P884N281K991M02j709M546K364p696
$$ 136104 133051 131080 129814 127544 128726 123919 126516 134400 139681 142672 143074 141365 145911 148275 140579
8451A40579n379k720n912j237M148N026M419L330O862J222M95j132n752p470r722
$$ 140579 135200 132480 126568 125331 129479 134505 138924 142254 149116 150338 150833 149701 143949 136479 126757
8436A26757k166J475O397R12L048Q931J0888J5073J7913J9957J9778K4721K8061
$$ 126757 124591 126066 132463 133375 136423 145354 156242 171315 189228 209185 228963 253684 281745
8423B81745L3817M9436O0028P5347R1842J13022J39369J70969J93183K06606K16250
$$ 281745 315562 364998 425026 500373 592215 705237 844606 1015575 1208758 1415364 1631614
8412A631614K07713J84900J38163P7751J9476m7038j04096j47292j78341j93327
$$ 1631614 1839327 2024227 2162390 2240141 2259617 2212579 2108483 1961191 1782850 1589523
8402A589523j84392j72968j54533j29532j13410r8078p8262o2742n4117m2927
$$ 1589523 1405131 1232163 1077630 948098 834688 736610 658348 595606 541489 498562
8392D98562l8892k9009k8744k5224k1282j8533j4327j5564r614p162r690r899
$$ 498562 459670 430661 401917 376693 355411 336878 322551 306987 297373 290211 280521 270622
8380B70622j2786j3982j3138o630l113r929p092k167o713r974j0800q216q205
$$ 270622 257836 243854 230716 224086 220973 211044 203952 201785 195072 185098 174298 166082 157877
8367A57877p947k188j891m674j345l894q535r621o295m066m395n777n458n296
$$ 157877 149930 147742 145851 141177 139832 135938 127403 117782 111487 107421 103026 97249 91791 86495
8353H6495r607j3467k2466k2935k1388j4125m308k744K962P809J1697J6187J4513
$$ 86495 76888 63421 40955 18020 -3368 -17493 -21801 -24545 -21583 -13774 -2077 14110 28623
8340B8623J4238J859Q72O375j912o054o955n180k797K798N560k273J32q02n99
$$ 28623 42861 44720 45592 51967 50055 44001 37046 31866 29069 31867 37427 35154 35286 34484 33885
8325C3885j610l178n569o510m584k692k505N256J664L8L933J633J266J531k09
$$ 33885 32275 29097 23528 17018 12434 9742 7237 12493 14157 14195 18128 19761 21027 22558 22349
8310B2349M14j43j23K63l223m538j589O55k546j339J240j082j543j390M008J632
$$ 22349 22763 22620 22497 22760 19537 14999 13410 14065 11519 10180 11420 10338 8795 7405 11413 13045
8294A3045K850J410r77l060j231m82j978N678K301K176Q95J858j184l232n558
$$ 13045 15895 17305 16328 13268 12037 11555 9577 15255 17556 19732 20627 22485 21301 18069 12511
8279A2511l168k363J297K751J778J137K003J071l816j756q86j785K104k693m232
$$ 12511 9343 6980 8277 11028 12806 13943 15946 17017 13201 11445 10559 8774 10878 8185 3953
8264C953l029k839J347Q8k05l692k58P79J793J030p44k726O55p85J183J04N383
$$ 3953 924 -1915 -568 -480 -685 -4377 -4635 -3856 -2063 -1033 -1777 -4503 -3848 -4633 -3450 -3346 2037
8247B037L425k846m571J62p01J857J903j241n11L854M697J706j089L634j239m647
$$ 2037 5462 2616 -1955 -1793 -2494 -637 1266 25 -486 3368 8065 9771 8682 12316 11077 6430
8231F430k725j45K186P94N13m8j325j490l634q05j98K63m050l800L74Q74P97P0
$$ 6430 3705 3560 5746 6540 7053 7005 5680 4190 556 -249 -447 -184 -4234 -8034 -7660 -6786 -5989 -5919
8213e919O34n251k698p53L569M097L309O7R37l429l761k554J802j755l083k962
$$ -5919 -5285 -10536 -13234 -13987 -10418 -6321 -3012 -2945 -2008 -5437 -9198 -11752 -9950 -11705 -14788 -17750
8197a7750J75J306j97k102L32L191j036M012P462J496J581J621n004l572Q26M094
$$ -17750 -17575 -16269 -16466 -18568 -18236 -15045 -16081 -12069 -4607 -3111 -1530 91 -4913 -8485 -7659 -3565
8181c565N204M588R19L878M0j54M25P84K154j667j743M046L21l89k270m326l529
$$ -3565 1639 6227 7146 11024 11064 10910 11335 12119 14273 12606 10863 14909 15230 14841 12571 8245 4716
8164D716k403l071m714q20L329K704J146J004k016J034J476k369k804m070K83
$$ 4716 2313 -758 -5472 -6292 -2963 -259 887 1891 -125 909 2385 16 -2788 -6858 -6575
8149f575L010j175J350J995q76J664J217J464J61L639M303N41k255P84J022r15
$$ -6575 -3565 -4740 -3390 -1395 -2271 -607 610 2074 2235 5874 10177 10718 8463 9247 10269 9354
8133I354L784L092M60m574j311L8j99j893n50l463j74O279K390l412k463N89j442
$$ 9354 13138 16230 16690 12116 10805 10843 10644 8751 8201 4738 4564 10843 13233 9821 7358 7947 6505
8116F505m081n618j592k801l241k352P93O055M468O685j514k300P18o33k996k631
$$ 6505 2424 -3194 -4786 -7587 -10828 -13180 -12387 -6332 -1864 4821 3307 1007 1725 1092 -1904 -4535
8100d535K064j510m147j002L517J062K708K180J603k96L036o15j910o391l85l033
$$ -4535 -2471 -3981 -8128 -9130 -5613 -4551 -1843 337 1940 1644 4680 4065 2155 -4236 -4621 -7654
8084g654l042N00j140j078m42L040L02o37M534K28J690J465k015j076L077M629
$$ -7654 -10696 -10196 -11336 -12414 -12856 -9816 -9514 -10151 -5617 -5389 -3699 -2234 -4249 -5325 -2248 2381
8068B381j363K280M967J731j616m822R03J666r27J760K259o02p11Q25k329n531
$$ 2381 1018 3298 8265 9996 8380 3558 4461 6127 5200 6960 9219 8617 7906 8731 6402 871
8052H71l255j72M580K993m08m327m182J507K398l090l75L63J67l22P7M714L543
$$ 871 -2384 -2556 2024 5017 4609 282 -3900 -2393 5 -3085 -3460 -3097 -2930 -3252 -3175 1539 5082
8035E082K126J943L461L173K613j240j802k762n895l444j227j118J766m719P09
$$ 5082 7208 9151 12612 15785 18398 17158 15356 12594 6699 3255 2028 910 2676 -2043 -1334
8020a334J830L007j478k795j909K989N43P92J99J160M075L812L124j133k048L683
$$ -1334 496 3503 2025 -770 -2679 310 853 1645 1844 3004 7079 10891 14015 12882 10834 14517
8004A4517K910L548O488J628L370J195M178N715N112J0074J3766J3091J6261J7121
$$ 14517 17427 20975 27463 29091 32461 33656 37834 43549 48661 58735 72501 85592 101853 118974
7990A18974J8995K2633K0247J7037M833j0366j3954j9108k4327k2096j2718j3377
$$ 118974 137969 160602 180849 197886 202719 192353 178399 159291 134964 112868 100150 86773
7978H6773j4473j0902p138r24j637n569n807o119m07k92k304j20M457K264j293
$$ 86773 72300 61398 54260 53336 51699 46130 40323 34204 33797 33505 31201 31081 35538 37802 36509
7963C6509j972M105M276K977N474L820M011J157Q186J2424J0598P546N281L780
$$ 36509 34537 38642 42918 45895 51369 55189 59200 60357 68543 80967 91565 99111 104392 108172
7949A08172Q166J3565K3967K7689L5304M1423M2865N0735M3939K7138K271k0812
$$ 108172 116338 129903 153870 181559 216863 258286 301151 351886 395825 422963 425234 404422
7937D04422l7739m7017m7200m1270k9460j8534j3840j6033j0761j2561j3362j2349
$$ 404422 366683 319666 272466 231196 201736 183202 169362 153329 142568 130007 116645 104296
7925A04296j1500q563m410l159j151k305K9l029l549r57Q28Q64k164K79J644J004
$$ 104296 92796 84233 79823 76664 75513 73208 73237 70208 66659 65702 66530 67394 65230 65509 67153 68157
7909F8157J536N520P444O699M373P192O121Q062J3452J7940J8693K5914K4614
$$ 68157 69693 75213 82657 89356 93729 100921 107042 115104 128556 146496 165189 191103 215717
7896B15717L0939L0763K7737J1881P32j1390j9548k3558k2580j5902j5507j7544
$$ 215717 246656 277419 305156 317037 317769 306379 286831 263273 240693 224791 209284 191740
7884A91740j3610j7466j9377j6090q830j0702r672o832n302p400j655l65k379
$$ 191740 178130 160664 141287 125197 116367 105665 95993 89161 83859 76459 74804 74439 72060
7871G2060j942m391p554j496m832q053k169k955J016K257J23n37K604K022k861
$$ 72060 70118 65727 58173 56677 51845 43792 41623 38668 39684 41941 42064 41527 44131 46153 43292
7856D3292J606M375M786O014O116K245L412N006M261K882j278l93J842p69q41
$$ 43292 44898 49273 54059 60073 66189 68434 71846 76852 81113 83995 82717 82324 84166 83397 82556
7841H2556N44m909p198r82k528k705p526n125l701j642k304j099l499j66k314
$$ 82556 83100 78191 70993 70011 67483 64778 57252 52127 48426 46784 44480 43381 39882 39716 37402
7826C7402m901p102j522k60J640J689P30k552m559j708K0M18k220j598R32M25
$$ 37402 32501 25399 23877 23617 25257 26946 27676 25124 20565 18857 18877 19295 17075 15477 16409 16834
7810A6834K206k709j478l698k517L634K164Q4j92m33j221J571j724J847l030j069
$$ 16834 19040 16331 14853 11155 8638 12272 14436 14520 14328 13895 12674 14245 12521 14368 11338 10269
7794A0269N39L25j897j848m293L101J294N79L223j042k008l573j333O96K90R48
$$ 10269 10808 11133 9236 7388 3095 6196 7490 8069 11292 10250 8242 4669 3336 4032 4322 5270
7778E270J159J434m884j687j957j359K179J696J27J943J370l937j767r02l52Q19
$$ 5270 6429 7863 2979 1292 -665 -2024 155 1851 1978 3921 5291 1354 -413 -1315 -1667 -848
7762h48Q85M9k947j973q61J81J24L321j438R56Q48M470l388k08P26J8J283N38
$$ -848 37 86 -2861 -4834 -5695 -5514 -5390 -2069 -3507 -2551 -1703 2767 -621 -829 -103 -85 1198 1736
7744A736j273m543j859K269j792l156J906R11O233K818k141k023l118j650L6L195
$$ 1736 463 -4080 -5939 -3670 -5462 -8618 -6712 -5801 432 3250 1109 -914 -4032 -5682 -5646 -2451
7728b451k73J225j877l693J033j440j199j607J663J810J68j660m34J315p11N327
$$ -2451 -2724 -1499 -3376 -7069 -6036 -7476 -8675 -10282 -8619 -6809 -6641 -8301 -8735 -7420 -8131 -2804
7712b804K827N60k169K89M603L306k203m298Q95j586j055j336l581j972o8j130
$$ -2804 23 583 -1586 -1297 3306 6612 4409 111 1006 -580 -1635 -2971 -6552 -8524 -8592 -9722
7696i722k362l07K995j498K017K528j56m38r83R87k725k955j18K98M132n24n107
$$ -9722 -12084 -12391 -9396 -10894 -8877 -6349 -6505 -6943 -7926 -6939 -9664 -12619 -12737 -12439 -8307 -8831 -13938
7679a3938J171J751J543J720J591k159J053j481K7l942l872L435M384K989l017
$$ -13938 -12767 -11016 -9473 -7753 -6162 -8321 -7268 -8749 -8722 -12664 -16536 -13101 -8717 -5728 -8745
7664h745l080n237r7K727M839K501k680m041l792k72q97J782K002L07M243N653
$$ -8745 -11825 -17062 -17159 -14432 -9593 -7092 -9772 -13813 -17605 -17877 -18774 -16992 -14990 -14683 -10440 -4787
7648d787k516m661j434M069r18L131j460K89k036j892k156K182M068j176o195
$$ -4787 -7303 -11964 -13398 -9329 -10247 -7116 -8576 -8287 -10323 -12215 -14371 -12189 -8121 -9297 -15492
7633a5492K742L574p59k112J248j380K121r78j259j011K752N567L207L086P1k740
$$ -15492 -12750 -9176 -9935 -12047 -10799 -12179 -10058 -11036 -12295 -13306 -10554 -4987 -1780 1306 1377 -1363
7617a363j142J056j921n95M10j353J861p64m42k446k981o20K524m82r22j721q09
$$ -1363 -2505 -1449 -3370 -3965 -3555 -4908 -3047 -3811 -4253 -6699 -9680 -10300 -7776 -8258 -9180 -10901 -11710
7600a1710R01L480p18J701J475Q27k576j27J608q09j227j173M313K387n3k897
$$ -11710 -10809 -7329 -8047 -6346 -4871 -4044 -6620 -6747 -5139 -5948 -7175 -8348 -4035 -1648 -1701 -4598
7584d598l916n28J843N29k119k648k018j502k152J089K533J728L669L076J112
$$ -4598 -8514 -9042 -7199 -6670 -8789 -11437 -13455 -14957 -17109 -16020 -13487 -11759 -8090 -5014 -3902
7569c902n263P20N156j516l926n922l971J079P918k63m689m697j524M055N479
$$ -3902 -9165 -8445 -3289 -4805 -8731 -14653 -18624 -17545 -9627 -9890 -14579 -19276 -20800 -16745 -11266
7554a1266l189k022Qm360l344O10M589M007m102j192K291m18L067j036m97R17
$$ -11266 -14455 -16477 -16469 -20829 -24173 -23563 -18974 -14967 -19069 -20261 -17970 -18388 -15321 -16357 -16854 -15937
7538a5937J695O15J112K01J785j418J712N642J807j301J108K689P49j363j682
$$ -15937 -14242 -13627 -12515 -12314 -10529 -11947 -10235 -4593 -2786 -4087 -2979 -290 459 -904 -2586
7523b586k955k949Q26L834k277j888k283j637L773J79K915j42K590l92o001Q35
$$ -2586 -5541 -8490 -7664 -3830 -6107 -7995 -10278 -11915 -8142 -7963 -5048 -5190 -2600 -2992 -8993 -8158
7507h158L460K897p85j132J564j764k067k813J313L112J849r2K467P35p128l481
$$ -8158 -4698 -1801 -2586 -3718 -2154 -3918 -5985 -8798 -7485 -4373 -2524 -2616 -149 586 -6542 -10023
7491a0023m13L326Q14J494j580k095k139j709M62K858j328j113R85n48J474K289
$$ -10023 -10436 -7110 -6296 -4802 -6382 -8477 -10616 -12325 -11863 -9005 -10333 -11446 -10461 -11009 -9535 -7246
7475g246n58J616j27J147j882J037K053p03r71o211j052L815k59q95K982j27O40
$$ -7246 -7804 -6188 -6315 -5168 -7050 -6013 -3960 -4663 -5634 -11845 -12897 -9082 -9341 -10236 -7254 -7381 -6741
7458f741m9J326K24q5r10j963J917J693K031J170J16m458Q52K644J525K500m34
$$ -6741 -6790 -5464 -5240 -5325 -6235 -8198 -6281 -4588 -2557 -1387 -1271 -5729 -4877 -2233 -708 1792 1358
7441A358n265R19j851m243K195K473P89j454l361m39n714k023J650K114L272j881
$$ 1358 -3907 -2988 -4839 -9082 -6887 -4414 -3625 -5079 -8440 -8879 -14593 -16616 -14966 -12852 -9580 -11461
7425a1461K404k0P88n83j445O09r16j043k336O75J967L398J533m250n58r04j90
$$ -11461 -9057 -9077 -8289 -8872 -10317 -9708 -10624 -11667 -14003 -13328 -11361 -7963 -6430 -10680 -11238 -12142 -12332
7408a2332L197K018M41n49n35J353K044K948r68m05o69l857m801k82o04K482L219
$$ -12332 -9135 -7117 -6676 -7225 -7760 -6407 -4363 -1415 -2383 -2788 -3457 -7314 -12115 -12397 -13001 -10519 -7300
7391g300J358m481n299r38k493L191M831o62n12J727K057J978q52j167J520j351
$$ -7300 -5942 -10423 -15722 -16660 -19153 -15962 -11131 -11793 -12305 -10578 -8521 -6543 -7395 -8562 -7042 -8393
7375h393L038N27j657O17l9M10k260l036p06J828Q57j079L71K949K325n1k305
$$ -8393 -5355 -4828 -6485 -5868 -5907 -5497 -7757 -10793 -11499 -9671 -8814 -9893 -9522 -6573 -4248 -4299 -6604
7358f604m18M304P49K389l04K24N96o613o928j856M935K453J224k724n171K107
$$ -6604 -7022 -2718 -1969 420 116 340 936 -5677 -12605 -14461 -9526 -7073 -5849 -8573 -13744 -11637
7342a1637K133k840K226j27L002M223q21n511J457O282L94j940p82q39j445K428
$$ -11637 -9504 -12344 -10118 -10245 -7243 -3020 -3841 -9352 -7895 -1613 -1219 -3159 -3941 -4780 -6225 -3797
7326c797l97J391J301k910n432J466K800k64R66p02k699J331l95M290J64j587
$$ -3797 -4194 -2803 -1502 -4412 -9844 -8378 -5578 -5842 -4876 -5578 -8277 -6946 -7341 -3051 -2887 -4474
7310d474l839m945O216M010M673l190m174n93k13N90j77j370k835N45m67K177
$$ -4474 -8313 -13258 -7042 -3032 1641 -1549 -5723 -6316 -6529 -5939 -6116 -7486 -10321 -9776 -10243 -8066
7294h066R08j242L07J111l59P37n43n340q44L638J216K913J204j104O0J181J103
$$ -8066 -7158 -8400 -8093 -6982 -7341 -6604 -7147 -12487 -13331 -9693 -8477 -5564 -4360 -5464 -5404 -4223 -3120
7277c120k989k578k048K18K651J752M829L73k144k981K350J341l521q8j538j84
$$ -3120 -6109 -8687 -10735 -10517 -7866 -6114 -1285 -912 -3056 -6037 -3687 -2346 -5867 -5955 -7493 -7677
7261g677k061J693k60j784J651J31r78L321K719K682k237N39j967O40J678l20
$$ -7677 -9738 -8045 -8305 -10089 -8438 -8307 -9285 -5964 -3245 -563 -2800 -2261 -4228 -3588 -1910 -2230
7245b230M88M017J004R98m323n235j976j632L33R21r10p04L403j089l05O93j042
$$ -2230 -1742 2275 3279 4277 -46 -5281 -7257 -8889 -8556 -7635 -8545 -9249 -5846 -6935 -7240 -6547 -7589
7228g589o02R36L414k019k070r4N113j150p92L66J15n699K129K763q45P83k814
$$ -7589 -8191 -7255 -3841 -5860 -7930 -8024 -2911 -4061 -4853 -4487 -4372 -10071 -7942 -5179 -6024 -5241 -8055
7211h055K08j830n16n15K167j921k263M57M124N732m3j270r10P41j50J867J255
$$ -8055 -7847 -9677 -10193 -10708 -8541 -10462 -12725 -12268 -8144 -2412 -2455 -3725 -4635 -3894 -4044 -2177 -922
7194i22N51j144K165p71k304j299J083L093k27l86J358j133m646K206j176j021
$$ -922 -371 -1515 650 -121 -2425 -3724 -2641 452 225 -161 1197 64 -4582 -2376 -3552 -4573
7178d573J449K161J95m202K222O66r07j639m651O80L645j537n332k721L64K711
$$ -4573 -3124 -963 -768 -4970 -2748 -2082 -2989 -4628 -9279 -8599 -4954 -6491 -11823 -14544 -14180 -11469
7162a1469K337K797q32O57p45k27J472K615n50k656J343K634r2j245K688K216
$$ -11469 -9132 -6335 -7167 -6510 -7255 -7482 -6010 -3395 -3945 -6601 -5258 -2624 -2716 -3961 -1273 943
7146I43P43k489q64n69L102j97m02j200n645k224M852M533N95k553k516K599j655
$$ 943 1686 -803 -1667 -2236 866 669 267 -933 -6578 -8802 -3950 583 1178 -1375 -3891 -1292 -2947
7129b947k192l820P89j440J968K979L18o82k524J891j314P57J383L043l327J260
$$ -2947 -5139 -8959 -8170 -9610 -7642 -4663 -4345 -5027 -7551 -5660 -6974 -6217 -4834 -1791 -5118 -3858
7113c858L606K574j434n712k837j064j106p76K858q36k181p13k24M551L992o01
$$ -3858 -252 2322 888 -4824 -7661 -8725 -9831 -10607 -7749 -8585 -10766 -11479 -11703 -7152 -3160 -3761
7097c761l517M7K558L3M562j766m142j552K683n73j075K933M697L89l931m292
$$ -3761 -7278 -7231 -4673 -4640 -78 -1844 -5986 -7538 -4855 -5428 -6503 -3570 1127 1516 -2415 -6707
7081f707K497K270N9o60j082k317L131n1L77R19k909J415j043J977l466j679k207
$$ -6707 -4210 -1940 -1881 -2541 -3623 -5940 -2809 -2860 -2483 -1564 -4473 -3058 -4101 -2124 -5590 -7269 -9476
7064i476p37J010K312R27K011J823O783L125l077o790m117O11J9r05J251M87O40
$$ -9476 -10213 -9203 -6891 -5964 -3953 -2130 4653 7778 4701 -2089 -6206 -5595 -5576 -6481 -5230 -4743 -4103
7047d103k491j966j027L155n50O74q25J476K136J586K742K430j011j409N61M055
$$ -4103 -6594 -8560 -9587 -6432 -6982 -6308 -7133 -5657 -3521 -1935 807 3237 2226 817 1378 5433
7031E433L976l308o294m735J418J004L67J395J350l441o12j928l379L607K774
$$ 5433 9409 6101 -193 -4928 -3510 -2506 -2139 -744 606 -2835 -3447 -5375 -8754 -5147 -2373
7016b373J494n450l835L900J410J703J028j777j406K239k243k214K34J918L397
$$ -2373 -879 -6329 -10164 -6264 -4854 -3151 -2123 -3900 -5306 -3067 -5310 -7524 -7290 -5372 -1975
7001a975j43m070k634J281M902j123j084p83K510p44J21n5p01o6J928Q22k689
$$ -1975 -2118 -6188 -8822 -7541 -2639 -3762 -4846 -5629 -3119 -3863 -3742 -3797 -4498 -4564 -2636 -1814 -4503
6984d503j813p48K927J069k515j668j813J013L886O225J34j869m066m054n50J362
$$ -4503 -6316 -7064 -4137 -3068 -5583 -7251 -9064 -8051 -4165 2060 2194 325 -3741 -7795 -8345 -6983
6968f983j214k766J932J796p32q74J423M362J734Q37j160l891J027K6R42L083
$$ -6983 -8197 -10963 -9031 -7235 -7967 -8841 -7418 -3056 -1322 -485 -1645 -5536 -4509 -4483 -3541 -458
6952d58K398L295m512N13j718k558l460o27L123l512l9j60N094M04m450j412k630
$$ -458 1940 5235 723 1236 -482 -3040 -6500 -7127 -4004 -7516 -7555 -7715 -2621 -2217 -6667 -8079 -10709
6935a0709J055n07L377R71M082R23j836K367J78l617p41k403j041K932R144K302
$$ -10709 -9654 -10161 -6784 -5813 -1731 -808 -2644 -277 -99 -3716 -4457 -6860 -7901 -4969 4175 6477
6919F477k075l034l51J571j443L06J96J828l032l642j78J303K5j0l376K81K843
$$ 6477 4402 1368 1017 2588 1145 1451 1647 3475 443 -3199 -3377 -2074 -2049 -2059 -5435 -5154 -2311
6902b311M086p3j993j690N351l92n344O66O540m72k858k800l528K894J270K520
$$ -2311 1775 1702 -291 -1981 3370 2978 -2366 -1700 4840 4368 1510 -1290 -4818 -1924 -654 1866
6886A866j019n383l078j169j407M495M119k070k8j175j117J70K018j554n30p55
$$ 1866 847 -4536 -7614 -8783 -10190 -5695 -1576 -3646 -3674 -4849 -5966 -5796 -3778 -5332 -5862 -6617
6870f617M897K316J413k366n721j335L081J509J326m7M99r68k363j852j772j264
$$ -6617 -1720 596 2009 -357 -6078 -7413 -4332 -2823 -1497 -1544 -1045 -2013 -4376 -6228 -8000 -9264
6854i264K258M192r70l210l092K855N8k576L31L33q66M017J424j210J591j27k537
$$ -9264 -7006 -2814 -3784 -6994 -10086 -7231 -7173 -9749 -9418 -9085 -9951 -5934 -4510 -5720 -4129 -4256 -6793
6837f793k582L460K274M9J823n325k640J420M490M523J581J441k659l713M842
$$ -6793 -9375 -5915 -3641 -3592 -1769 -7094 -9734 -8314 -3824 699 2280 3721 1062 -2651 2191
6822B191J411J905o347m182m62K502Q1K058J338l33k96J439L001k328m662m195
$$ 2191 3602 5507 -840 -5022 -5484 -2982 -2901 -843 495 162 -134 1305 4306 1978 -2684 -6879
6806f879k23k714N18q47j337k271K84M827J924r80N135L961J219k87o402O39J050
$$ -6879 -7102 -9816 -9298 -10145 -11482 -13753 -13469 -8642 -6718 -7698 -2563 1398 2617 2330 -4072 -3433 -2383
6789b383j930J281J396L044M23j418k305J098O7O1l504j759J50J309j013k358
$$ -2383 -4313 -3032 -1636 1408 1831 413 -1892 -794 -727 -666 -4170 -5929 -5779 -4470 -5483 -7841
6773g841J628Q69l78L371m9o74k460k63m362o45K495M44Q54o86R88J097j957j460
$$ -7841 -6213 -5344 -5722 -2351 -2400 -3074 -5534 -5797 -10159 -10804 -8309 -7865 -7011 -7697 -6709 -5612 -7569 -9029
6755i029o92k29J902O348K135k630j458K113L006n803o246N427M08o10J392K522
$$ -9029 -9721 -9950 -8048 -1700 435 -2195 -3653 -1540 1466 -4337 -10583 -5156 -4748 -5358 -3966 -1444
6739a444P36j470K736l977k569N225l0r15M261Q16l865M578l278l810J908J629
$$ -1444 -708 -2178 558 -3419 -5988 -763 -793 -1708 2553 3369 -496 4082 804 -3006 -1098 531
6723E31l511j335M534J172p73k151M13l050l00L267J171m405M64K909K608M11
$$ 531 -2980 -4315 219 1391 618 -1533 -1120 -4170 -4470 -1203 -32 -4437 -3973 -1064 1544 1955
6707A955M15j553k810m829J801j519J204K633k95J293J514J484J163o12p29N84
$$ 1955 2370 817 -1993 -6822 -5021 -6540 -5336 -2703 -2998 -1705 -191 1293 2456 1844 1115 1699
6691A699K933L126K82j683k5l242J649L033l901l944l80k515O27j307j51L838
$$ 1699 4632 7758 8040 6357 6332 3090 4739 7772 3871 -73 -453 -2968 -2341 -3648 -3799 39
6675C9Q86M62k807k534K762J140J088L08O780L293k467o614J1R12O34M115l514
$$ 39 925 1387 -1420 -3954 -1192 -52 1036 1344 8124 11417 8950 2336 2347 3259 3893 8008 4494
6658D494m473m46K709L722k267n728N92Q85m52J741M51m705l825K399L675P011
$$ 4494 21 -425 2284 6006 3739 -1989 -1397 -512 -964 777 1228 -3477 -7302 -4903 -1228 5783
6642E783M58q37j559o047o0k330k658L372L409j019Q58L801K589k254q14N622
$$ 5783 6241 5404 3845 -2202 -2262 -4592 -7250 -3878 -469 -1488 -630 3171 5760 3506 2692 8314
6626H314O13j685k059J823K626R17K784M260j981L23K847n093l271J23q09n58
$$ 8314 8927 7242 5183 7006 9632 10549 13333 17593 15612 15935 18782 13689 10418 10541 9732 9174
6610I174J959j248m135K462L500k168m584o645m098j065K257K41Q76J876K227
$$ 9174 11133 9885 5750 8212 11712 9544 4960 -1685 -5783 -6848 -4591 -4350 -3474 -1598 629
6595F29N37Q97J856l113J811Q50M17j935K433k108k439o99k971m8o30J740j79
$$ 629 1166 2063 3919 806 2617 3467 3884 1949 4382 2274 -165 -864 -3835 -3883 -4513 -2773 -2952
6578b952M269K866k351q39K321J306M20J704k05o809M9M249M44j099j225j683
$$ -2952 1317 4183 1832 993 3314 4620 5040 6744 6539 -270 -221 4028 4472 3373 2148 465
6562D65M75K181l796k037n96j494J94K255L469p20k468j31m66N84M344L328k221
$$ 465 940 3121 -675 -2712 -3308 -4802 -4608 -2353 1116 396 -2072 -2203 -2669 -2085 2259 5587 3366
6545C366m677k648q49O037J492k763j623J797p88k860R52K681J16K614J545l547
$$ 3366 -1311 -3959 -4808 1229 2721 -42 -1665 132 -656 -3516 -2564 117 233 2847 4392 845
6529H45k005L60L571o120j558L831J919k0O09l092R95M57j614n924k742K323l08
$$ 845 -1160 -800 2771 -3349 -4907 -1076 843 823 1432 -1660 -665 -208 -1822 -7746 -10488 -8165 -8473
6512h473J462L510j108Q83n54l037o19K148m26P6J488J980k93j596J39j978n59
$$ -8473 -7011 -3501 -4609 -3726 -4280 -7317 -7936 -5788 -6214 -6138 -4650 -2670 -2963 -4559 -4420 -6398 -6957
6495f957J280j066J089K580M030n096l242J196K411j871K042J568N11J750L49
$$ -6957 -5677 -6743 -5654 -3074 956 -4140 -7382 -6186 -3775 -5646 -3604 -2036 -1525 225 574
6480E74K736r59k341mk021k624j346P81M472M199j125o991j710j7J381L085M563
$$ 574 3310 2351 10 6 -2015 -4639 -5985 -5204 -732 3467 2342 -4649 -6359 -6376 -4995 -1910 2653
6463B653n81j969m079L30O01l638j050J709L195J397J930J533k625p509K057L838
$$ 2653 2072 103 -3976 -3646 -3045 -6683 -7733 -6024 -2829 -1432 498 2031 -594 -8103 -6046 -2208
6447b208O711M60l912p71J860j76J001m29j417L10j151M01j88J119l525k999K124
$$ -2208 4503 4963 1051 280 2140 1964 2965 2536 1119 1429 278 679 491 1610 -1915 -4914 -2790
6430b790N054j065o216j193J865N04L709k935R52m31j079M262J899k840o19R5
$$ -2790 2264 1199 -5017 -6210 -4345 -3841 -132 -3067 -2115 -2546 -3625 637 2536 -304 -923 -828
6414h28k191m53K54L882j886j358J294L423m496K381J56m531j313j668j349M000
$$ -828 -3019 -3472 -3218 664 -1222 -2580 -1286 2137 -2359 22 178 -4353 -5666 -7334 -8683 -4683
6398d683K161M71M315j857j830j239j947k4O85R75J963q17j421m617r70l92L630
$$ -4683 -2522 -2051 2264 407 -1423 -2662 -4609 -4633 -3948 -2973 -1010 -1827 -3248 -7865 -8835 -9227 -5597
6381e597J286Q19k785k724J385P07k527J987N523P895J218j370l101j603J336
$$ -5597 -4311 -3492 -6277 -9001 -7616 -6909 -9436 -7449 -1926 5969 7187 5817 2716 1113 2449
6366B449K062k982k300o365n62M486N692L729j132l435j608J875Q49K623j594
$$ 2449 4511 1529 -771 -7136 -7698 -3212 2480 6209 5077 1642 34 1909 2758 5381 3787
6351C787m414nj262l762r796j095K833J928j064M290L635q33K454K036l88j63
$$ 3787 -627 -632 -1894 -5656 -15452 -16547 -13714 -11786 -12850 -8560 -4925 -5758 -3304 -1268 -1656 -1819
6335a819K010k138p15K982j367l238p79P33K013l938k305M72L76N48N521k237
$$ -1819 191 -1947 -2662 320 -1047 -4285 -5064 -4331 -2318 -6256 -8561 -8089 -7713 -7165 -1644 -3881
6319c881o38k09R61K568o2J210J719J640k023J454K793l574l063q09K399J667
$$ -3881 -4519 -4728 -3767 -1199 -1261 -51 1668 3308 1285 2739 5532 1958 -1105 -1914 485 2152
6303B152l663J104O25J359J022j632l496k442P2O09m178J487J382O22j470J732
$$ 2152 -1511 -407 218 1577 2599 967 -2529 -4971 -4899 -4290 -8468 -6981 -5599 -4977 -6447 -4715
6287d715j61N9P05K176J918k122J033j440j676J003j269R27O33m08j57K331L919
$$ -4715 -4876 -4817 -4112 -1936 -18 -2140 -1107 -2547 -4223 -3220 -4489 -3562 -2929 -3337 -3494 -1163 2756
6270B756M907j076j262j678o747l670K210P231m230o66L42K837J28J636L95J952
$$ 2756 7663 6587 5325 3647 -3100 -6770 -4560 2671 -1559 -2225 -1883 954 1082 2718 3113 5065
6254E065J611j359p92K725K688p5k358o129l547K504R91l318l199Q74j018J318
$$ 5065 6676 5317 4525 7250 9938 9863 7505 1376 -2171 333 1324 -1994 -5193 -4319 -5337 -4019
6238d019J381K070L896P68l49j475k044k838m82K591K507L628r19k634l254J560
$$ -4019 -2638 -568 3328 4096 3747 2272 228 -2610 -3092 -501 2006 5634 4715 2081 -1173 387
6222C87P19M44K365J706j122N49l753j614P12J81L045m33m323J144M263k585j980
$$ 387 1106 1550 3915 5621 4499 5048 1295 -319 393 574 3619 3186 -1137 7 4270 1685 -295
6205b95J527o93q57n87j180l8K638L080o65j475l029q18K297J687N145K28j790
$$ -295 1232 539 -318 -905 -2085 -2123 515 3595 2930 1455 -1574 -2392 -95 1592 6737 6965 5175
6188E175j212R18j741q557k089J619K769j58J514L216q50M032L48l517k529j519
$$ 5175 3963 4881 3140 -5417 -7506 -5887 -3118 -3276 -1762 1454 604 4636 4984 1467 -1062 -2581
6172b581k166k837j000n18K682K102q12P60M25j813L001K624Qk16r70l968m39
$$ -2581 -4747 -7584 -8584 -9102 -6420 -4318 -5130 -4370 -3945 -5758 -2757 -133 -125 -341 -1311 -5279 -5718
6155e718j172N217L675K626j532m68J60p111l094J525J861J160k078j030L474
$$ -5718 -6890 -1673 2002 4628 3096 2628 2788 -4323 -7417 -5892 -4031 -2871 -4949 -5979 -2505
6140b505L457q50l011k831p43N958L969r54l397J361K125j768k015k871l534k3
$$ -2505 952 102 -2909 -5740 -6483 -525 3444 2490 -907 454 2579 811 -1204 -4075 -7609 -7632
6124g632L211N479K266l681R10M043J521m148l154l61P11J595q8K598Q82L864
$$ -7632 -4421 1058 3324 -357 553 4596 6117 1969 -1185 -1546 -835 760 672 3270 4152 8016
6108H016j63m605m435J561O99M80m930j217K131J283L83J130l83J106K341J622
$$ 8016 7853 3248 -1187 374 1073 1553 -3377 -4594 -2463 -1180 -797 333 -50 1056 3397 5019
6092E019q43l030l399j50P14k980l697k27J422M028O90k726l613L087M09j466
$$ 5019 4176 1146 -2253 -2403 -1689 -4669 -8366 -8593 -7171 -3143 -2453 -5179 -8792 -5705 -5296 -6762
6076f762Q77N215N9j677q71O96M499j00m243o5j246m21j059n42J107J912J775
$$ -6762 -5885 -670 -611 -2288 -3159 -2463 2036 1936 -2307 -2372 -3618 -4039 -5098 -5640 -4533 -2621 -846
6059h46N763K899R08j742m049l669j625J689M01L159n90n02k956J265K466m148
$$ -846 4917 7816 8724 6982 2933 -736 -2361 -672 -271 2888 2298 1796 -1160 105 2571 -1577
6043a577j684M110J616j292n471r53P77M986N670N80k974J768R65k74j793j691
$$ -1577 -3261 849 2465 1173 -4298 -5251 -4474 512 6182 6762 3788 5556 6521 6247 4454 2763
6027B763N59K701k08k87J674J060l792l030m024K913M60j469k956k456k378J811
$$ 2763 3322 6023 5815 5528 7202 8262 4470 1440 -2584 329 789 -680 -3636 -6092 -8470 -6659
6011f659K106J729K45K878M849K134l853m104J70L242J74m467l189N797r85q0
$$ -6659 -4553 -2824 -2579 299 5148 7282 3429 -675 -505 2737 2911 -1556 -4745 1052 67 -13
5995a3j704l425n86L572L686n33L467l77p873k970j038K266O164J654l85J504
$$ -13 -1717 -5142 -5728 -2156 1530 997 4464 4087 -3786 -6756 -7794 -5528 636 2290 1905 3409
5979C409k842m778K759l122l253J179O315J565l018O493p25m455L253J097j120
$$ 3409 567 -4211 -1452 -4574 -7827 -6648 -333 1232 -1786 4707 3982 -473 2780 3877 2757
5964B757K582L216J224k326o59m471j412O06N90K83j035l236L429J658k447l582
$$ 2757 5339 8555 9779 7453 6794 2323 911 1517 2107 2390 1355 -1881 1548 3206 759 -2823
5948b823J998L34J85j73J97J686K431m072k864P99P8J94k978q90P9J711J948j370
$$ -2823 -825 -491 -306 -479 -282 1404 3835 -237 -3101 -2302 -2224 -2030 -5008 -5898 -5819 -4108 -2160 -3530
5930c530K512p28j189O26M060J728J03j158l36K141N25l040l707l70J480q8k526
$$ -3530 -1018 -1746 -2935 -2309 1751 3479 3582 2424 2088 4229 4754 1714 -1993 -2363 -883 -971 -3497
5913c497k802k460k390j236J061N282K649j519J269K546J010L681q90K140k549
$$ -3497 -6299 -8759 -11149 -12385 -11324 -6042 -3393 -4912 -3643 -1097 -87 3594 2704 4844 2295
5898B295O45j470m356j53J01K28J578m22O08n60Q79N171J301j637m968J255k357
$$ 2295 2940 1470 -2886 -3039 -2938 -2710 -1132 -1554 -946 -1506 -627 4544 5845 4208 -760 495 -1862
5881a862k942K224K362N894j173r64J453k635L14J54j967K118k809m05j22j854
$$ -1862 -4804 -2580 -218 5676 4503 3539 4992 2357 2671 2825 858 2976 167 -238 -360 -2214
5865b214p48k420L815J637L276J275m278j408J388K49j144l9j16L531K576J932
$$ -2214 -2962 -5382 -1567 70 3346 4621 343 -1065 323 572 -572 -611 -727 2804 5380 7312
5849G312O41j038k009k657p7n265J455K44P10M168M327L26j907p880m711Q021
$$ 7312 7953 6915 4906 2249 2172 -3093 -1638 -1394 -684 3484 7811 8137 6230 -1650 -6361 1660
5833A660p62j876L103m4k842l407J042l60n895J280M230O055k546j69j977R95
$$ 1660 898 -978 2125 2081 -761 -4168 -3126 -3486 -9381 -8101 -3871 2184 -362 -531 -2508 -1513
5817a513K965n45L48m681O50l70o36P12L93P09j018j034O69J454o27J968J317
$$ -1513 1452 907 1255 -3426 -2776 -3146 -3782 -3070 -2677 -1968 -2986 -4020 -3351 -1897 -2524 -556 761
5800G61k988r16M570J431j367J598J273j752p337j073L276O19m27m848j808J044
$$ 761 -2227 -3143 1427 2858 1491 3089 4362 2610 -4727 -5800 -2524 -1905 -2332 -7180 -8988 -7944
5784g944K114M771M413k063l235L88L051L58n579j574M822Q333j237m530j642
$$ -7944 -5830 -1059 3354 1291 -1944 -1556 1495 1853 -3726 -5300 -478 7855 6618 2088 446
5769D46k231J889l710r40K723L759O98K199j642N5k174j673P20M320J583j913
$$ 446 -1785 104 -3606 -4546 -1823 1936 2634 4833 3191 3246 1072 -601 119 4439 6022 4109
5753D109L293j712M200J565o467j948m292L84M072N11p30q64K550k314J23j126
$$ 4109 7402 5690 9890 11455 4988 3040 -1252 -868 3204 3715 2985 2121 4671 2357 2480 1354
5737A354m569K073o63L081J349q99K510J763j663J586j032j576l52j271Q09j374
$$ 1354 -3215 -1142 -1805 1276 2625 1726 4236 5999 4336 5922 4890 3314 2962 1691 2500 1126
5721A126o42L247j86j796o17N16l03q81j112Q94K393q6J311J574j065k832k145
$$ 1126 484 3731 3545 1749 1132 1648 1345 464 -648 246 2639 2553 3864 5438 4373 1541 -604
5704f04K15P277R7k461L238O64m519k060R5k912l038j227q91n74M11K350K344
$$ -604 -389 6888 6985 4524 7762 8426 3907 1847 1942 -970 -4008 -5235 -6126 -6700 -6289 -3939 -1595
5687a595K164L498K181n97K25j472J577k400m152k902k453q03J387M664P310k759
$$ -1595 569 4067 6248 5651 5876 4404 5981 3581 -571 -3473 -5926 -6729 -5342 -678 6632 3873
5671C873q539p86M264P94J480K136L75m154l768J114L637L11j17o092n683K57
$$ 3873 -4666 -5452 -1188 -394 1086 3222 3597 -557 -4325 -3211 426 737 620 -5472 -11155 -10898
5655a0898m69K456J972J966J78P08J31K016K257j677k133j29K478J799j545L250
$$ -10898 -11367 -8911 -6939 -4973 -4795 -4087 -3956 -1940 317 -1360 -3493 -3622 -1144 655 -890 2360
5639B360M458n181l15q29l130m57K767k413N38O09K292k011k186q00L021M825
$$ 2360 6818 1637 1322 493 -2637 -3094 -327 -2740 -2202 -1593 699 -1312 -3498 -4298 -1277 3548
5623C548J578k454j394j254J920J955Q85p95k905j646k401J043J867K142K428
$$ 3548 5126 2672 1278 24 1944 3899 4784 3989 1084 -562 -2963 -1920 -53 2089 4517
5608D517n30Qj335O6j975J938L93j452j4R74j433K430j507k19M545J59m869k058
$$ 4517 3987 3995 2660 2726 751 2689 3082 1630 1616 2590 1157 3587 2080 1861 6406 6565 1696 -362
5590c62J107J968K378m59j040m27j448k889J445L586J931l144O70J120k715K400
$$ -362 745 2713 5091 4632 3592 3165 1717 -1172 273 3859 5790 2646 3316 4436 1721 4121
5574D121L063p10k350M1k9L516j18k571r7J169k79l021j630p17M82l128j870k318
$$ 4121 7184 6474 4124 4165 4136 7652 7534 4963 4866 6035 5756 2735 1105 388 870 -2258 -4128 -6446
5556f446N697Q55K10J783j388j423j109k099J157L499L392n554k469M674p89J841
$$ -6446 -749 106 316 2099 711 -712 -1821 -3920 -2763 736 4128 -1426 -3895 779 -10 1831
5540A831K128j888o304k53J659N36J582J892O68J304j708m242m276J789L841P4
$$ 1831 3959 2071 -4233 -4486 -2827 -2291 -709 1183 1851 3155 1447 -2795 -7071 -5282 -1441 -1367
5524a367o47j314P429L050p57l003l155m796j84j121J955M491j200m448q18K017
$$ -1367 -2014 -3328 4101 7151 6394 3391 236 -4560 -4744 -5865 -3910 581 -619 -5067 -5885 -3868
5508c868M19j372P82j154M56J888l51m78K946K365N08P57J0o29k934n301q09P51
$$ -3868 -3449 -4821 -4039 -5193 -4737 -2849 -3200 -3678 -732 1633 2141 2898 2908 2279 -655 -5956 -6765 -6014
5490f014o85m324J531N766k38k816K106O35K437J518K274O0K906R48l234j251
$$ -6014 -6699 -11023 -9492 -3726 -3964 -6780 -4674 -4039 -1602 -84 2190 2250 5156 6104 2870 1619
5474A619k253K081M1j642J437q96M116K210J310R82m375j411l110j839j98P644
$$ 1619 -634 1447 1488 -154 1283 387 4503 6713 8023 9005 4630 3219 109 -1730 -1928 5716
5458E716l7l956m00M37k199k034R81K226n329j621J575K459R63j930J87N134J738
$$ 5716 5679 1723 1323 1760 -439 -2473 -1492 734 -4595 -6216 -4641 -2182 -1219 -3149 -2962 2172 3910
5441C910j126j924k180l138M757j298M067M777Q07j576l414M04R23j760k694j841
$$ 3910 2784 860 -1320 -4458 299 -999 3068 7845 8652 7076 3662 4066 4989 3229 535 -1306
5425a306N412M095j690l758K291J837j377m782k36N93L867K447l018m639L2J699
$$ -1306 4106 8201 6511 2753 5044 6881 5504 722 486 1079 4946 7393 4375 -264 -232 1467
5409A467j612l239l474l75Q789N31n92R88K047j121o14k636j245K840K032j856
$$ 1467 -145 -3384 -6858 -7233 1556 2087 1495 2483 4530 3409 2795 159 -1086 1754 3786 1930
5393A930J659q58l617r08O10l907k043M688L835j034K204J531J882j486p200r40
$$ 1930 3589 2731 -886 -1794 -1184 -5091 -7134 -2446 1389 355 2559 4090 5972 4486 -2714 -3654
5377c654K530L38p62J950K570J373j883k696k169L689K24k769M501o52M79L34
$$ -3654 -1124 -786 -1548 402 2972 4345 2462 -234 -2403 1286 1510 -1259 3242 2590 3069 3403
5361C403l486j150J041j083K725L640q69j414j392k923Q38J102J648j248o93O49
$$ 3403 -83 -1233 -192 -1275 1450 5090 4221 2807 1415 -1508 -670 432 2080 832 139 788
5345G88m067k16m15M787L931j159j000q33K237M289l30m377k10Q76K044K828l673
$$ 788 -3279 -3495 -3910 877 4808 3649 2649 1816 4053 8342 8012 3635 3425 4301 6345 9173 5500
5328E500m633k924M944J5K091l59k319k404L781J629R41j171r88l086P60L068
$$ 5500 867 -2057 2887 2902 4993 4634 2315 -89 3692 5321 6262 5091 4103 1017 1777 4845
5312D845L240p43n720j571Q12m51J75m187K005N599K279k9k486l182k02K001j02
$$ 4845 8085 7342 1622 51 863 412 587 -3600 -1595 4004 6283 6254 3768 586 384 2385 2283
5295B283L99L24j223J015M361L479l656p701J975L454j208k407J85M362J946k236
$$ 2283 2682 3006 1783 2798 7159 10638 6982 -719 1256 4710 3502 1095 1280 5642 7588 5352
5279E352L78k208l170j472j917K028l642k988K731q83K072k573j838N585L228
$$ 5352 5730 3522 352 -1120 -3037 -1009 -4651 -7639 -4908 -5791 -3719 -6292 -8130 -2545 683
5264F83k215j076j889K197o16N16M542P57j060j412k48k29r34j388L054l10l618
$$ 683 -1532 -2608 -4497 -2300 -2916 -2400 2142 2899 1839 427 179 -50 -984 -2372 682 372 -3246
5247c246m240j683Q71K422m60K209J44j948J798L161K288j097J235k001k307k415
$$ -3246 -7486 -9169 -8298 -5876 -6336 -4127 -3983 -5931 -4133 -972 1316 219 1454 -547 -2854 -5269
5231e269o26M22L41K748K335k761j741k968K935N258R56J950r80m353p2K499k38
$$ -5269 -5895 -5473 -5132 -2384 -49 -2810 -4551 -7519 -4584 674 1630 3580 2600 -1753 -1825 674 436
5214D36M120K028k654l499q33K675J384R47J209k080l522l888K710L618J258M314
$$ 436 4556 6584 3930 431 -402 2273 3657 4604 5813 3733 211 -3677 -967 2651 3909 8223
5198H223J588m328m822K85j653k00M375k171j146J325K183O23l844j503K982o56
$$ 8223 9811 5483 661 946 -707 -907 3468 1297 151 1476 3659 4282 438 -1065 1917 1261
5182A261L45l31k988L8q84K276M423L38j447k212Q11K724k609L8J691j726j873
$$ 1261 1606 1275 -1713 -1675 -2559 -283 4140 4478 3031 819 1630 4354 1745 1783 3474 1748 -125
5165a25J672k346k133K632J274J645k938r63j198r54J229J365k67l494J103L365
$$ -125 1547 -799 -2932 -300 974 2619 -319 -1282 -2480 -3434 -2205 -840 -1107 -4601 -3498 -133
5149a33J17l345k740L095J835j525N038L1O35k618k880M961J72l561p95k629L341
$$ -133 -16 -3361 -6101 -3006 -1171 -2696 2342 2373 3008 390 -2490 2471 2643 -918 -1713 -4342 -1001
5132a001K636R69J228k649J958j593K283J160j966j24o32L031j248j964j126P91
$$ -1001 1635 2604 3832 1183 3141 1548 3831 4991 3025 2901 2269 5300 4052 2088 962 1753
5116A753l59l283l19k496P74M157L912M174m35j717k705l049K38m94J109O83j135
$$ 1753 1394 -1889 -2208 -4704 -3930 227 4139 8313 7878 6161 3456 407 645 151 1260 1943 808
5099H08R24L723m189N43K768J58k942N2l10m767o53m94K96L982j333P01J853K611
$$ 808 1732 5455 1266 1809 4577 4735 1793 1845 1535 -3232 -3885 -4379 -4083 -101 -1434 -733 1120 3731
5081C731j110m75k839j454O64O92k956j519L576J339q91K929o19J274J554M99
$$ 3731 2621 2146 -693 -2147 -1483 -791 -3747 -5266 -1690 -351 -1242 1687 1068 2342 3896 4395
5065D395j736n619r76J152L301j038l147L548K656L47k955k191N983m729n88j798
$$ 4395 2659 -2960 -3936 -2784 517 -521 -3668 -120 2536 2883 -72 -2263 3720 -1009 -1597 -3395
5049c395j684k480J675l772j771M141Q17L849N01N98N121L024l262k436k092J126
$$ -3395 -5079 -7559 -5884 -9656 -11427 -7286 -6469 -2620 -2119 -1521 3600 6624 3362 926 -1166 -40
5033d0j683K293l52r74j39r07k434q54J249J943Q37k058L395r7k63J877k893J179
$$ -40 -1723 570 218 -756 -895 -1802 -4236 -5090 -3841 -1898 -1061 -3119 276 179 -84 1793 -1100 79
5015G9J717j485o54l913O29k6K920L220l5j942K042J770L779J740r87J316j20
$$ 79 1796 311 -343 -4256 -3627 -3653 -733 2487 2452 510 2552 4322 8101 9841 8854 10170 10050
4998A0050m18k000l76j165l53J067J26L78K628k418l686J300p99J414J237J316
$$ 10050 9632 7632 7256 6091 5738 6805 6931 7309 9937 7519 3833 5133 4334 5748 6985 8301
4982H301j390J162m025r03J253j754Q27L144k717m076K163L406J314j662K691
$$ 8301 6911 8073 4048 3145 4398 2644 3471 6615 3898 -178 1985 5391 6705 5043 7734
4967G734O08O10m718j323L847m308m02L40Q72K067M02m615l611J142L511P863
$$ 7734 8342 8952 4234 2911 6758 2450 2048 2388 3260 5327 5729 1114 -2497 -1355 2156 10019
4951A0019k570q798L920K508j761K746M4K989J923o065m461k38J710k80k414k190
$$ 10019 7449 -1349 2571 5079 3318 6064 6108 9097 11020 4955 494 256 1966 1686 -728 -2918
4935b918K939r3k245Q5J712M883K789M263k190q050o500K387N178j776p51J490
$$ -2918 21 -72 -2317 -2232 -520 4363 7152 11415 9225 1175 -5325 -2938 2240 464 -287 1203
4919A203K292k400j096j337l037Q91K098M18q97l467j477q82j848m130M046J940
$$ 1203 3495 1095 -1 -1338 -4375 -3484 -1386 -968 -1865 -5332 -6809 -7691 -9539 -13669 -9623 -7683
4903g683n59N310j328k156j192J695M97m38L777j565L924J738q02l681k202Q34
$$ -7683 -8242 -2932 -4260 -6416 -7608 -5913 -5416 -5854 -2077 -3642 282 2020 1218 -2463 -4665 -3831
4887c831O543J228k527k034m83N87j429M087J597l225k508J973M00J841K305J271
$$ -3831 2712 3940 1413 -621 -1104 -517 -1946 2141 3738 513 -1995 -22 378 2219 4524 5795
4871E795l595P52k27j102l338j261k585K658L27m332J717N14J385K521Q31L770
$$ 5795 2200 2952 2725 1623 -1715 -2976 -5561 -2903 -2576 -6908 -5191 -4677 -3292 -771 60 3830
4855C830j08k004J450K287j989k480j748J522K182q44K963J853n040k123O42L85
$$ 3830 3722 1718 3168 5455 3466 986 -762 760 2942 2098 5061 6914 1874 -249 393 778
4839G78J102j259J728J571L105J365R36n094l113j177O77k815R57k23J233L74
$$ 778 1880 621 2349 3920 7025 8390 9326 4232 1119 -58 619 -2196 -1239 -1462 -229 145
4823A45K02j04o9K89J309j862J831k109K83K980j677J107J874j163q91k05J883
$$ 145 347 243 174 463 1772 -90 1741 -368 -85 2895 1218 2325 4199 3036 2145 1940 3823
4806C823M06K037lk248J29m741J926M167J742m753m725L66K033J204K470J899
$$ 3823 4229 6266 6263 4015 4144 -597 1329 5496 7238 2485 -2240 -1874 159 1363 3833 5732
4790E732K746l746p513l856M927L769O2J033L164q63l112l965j471O07J329k63
$$ 5732 8478 4732 -2781 -6637 -1710 2059 2121 3154 6318 5455 2343 -1622 -3093 -2486 -1157 -1420
4774a420K255L521J335j011j567R54o29l150K28J156k036n756J79K489j213O46
$$ -1420 835 4356 5691 4680 3113 4067 3438 288 516 1672 -364 -6120 -5941 -3452 -4665 -4019
4758d019J135J813K500j905j171L591K553j806k169K628k217j813j498k047k859
$$ -4019 -2884 -1071 1429 -476 -1647 1944 4497 2691 522 3150 933 -880 -2378 -4425 -7284
4743g284K913J436K54K241L846j134j492K15L195k50p21J916J378k850m331N33
$$ -7284 -4371 -2935 -2681 -440 3406 2272 780 995 4190 3940 3219 5135 6513 3663 -668 -135
4727a35l280m354P56L393L924J1J335j12M13J080L364j371k231j191j571L40J869
$$ -135 -3415 -7769 -7013 -3620 304 315 1650 1538 1951 3031 6395 5024 2793 1602 31 371 2240
4710B240J400J953j996m84J629n549n089Q85p90m376J008J130m53J303J211k304
$$ 2240 3640 5593 3597 3113 4742 -807 -5896 -5011 -5801 -10177 -9169 -8039 -8492 -7189 -5978 -8282
4694h282J591L15J148J585L791K229K828k099J292N80L802m05m538k778J780J551
$$ -8282 -6691 -6376 -5228 -3643 148 2377 5205 3106 4398 4978 8780 8375 3837 1059 2839 4390
4678D390k091j174M958K000J32k685p780J096J860l038J617R7J229J101j936R34
$$ 4390 2299 1125 6083 8083 8215 5530 -2250 -1154 706 -2332 -715 -618 611 1712 -224 710
4662G10L950J834op85k892o74J865o48P89K350J646j318j691m66K816o659k194
$$ 710 4660 6494 6488 5703 2811 2137 4002 3354 4143 6493 8139 6821 5130 4664 7480 821 -1373
4645a373L994J440P4L1j605j074P51J152m718J998j682l502K752M16J310l74L176
$$ -1373 2621 4061 4135 4166 2561 1487 2238 3390 -1328 670 -1012 -4514 -1762 -1346 -36 -410 2766
4628B766l23m865K13J619L258n183j873r0O56K214L289L839k513k277J161l165
$$ 2766 2443 -2422 -2209 -590 2668 -2515 -4388 -4478 -3822 -1608 1681 5520 3007 730 1891 -1274
4612a274M125K783l788j539k98rk307L819k001j221P5j45J365j67m75L793M25
$$ -1274 2851 5634 1846 307 9 0 -2307 1512 -489 -1710 -1635 -1780 -415 -582 -1057 2736 3161
4595C161k120m633J146M583L203J12k952J509n50O86r99j721K398L295J612m152
$$ 3161 1041 -3592 -2446 2137 5340 5452 2500 4009 3459 4145 3146 1425 3823 7118 8730 4578
4579D578J416M086k174n855j036m51J606m15Q90N68j721n53L828N161j789l449
$$ 4578 5994 10080 7906 2051 1015 564 2170 1755 2645 3213 1492 939 4767 9928 8139 4690
4563D690J883j744j971n06P94j849L444K514k951n161J445K692P66K338K215J509
$$ 4690 6573 4829 2858 2352 3146 1297 4741 7255 4304 -857 588 3280 4046 6384 8599 10108
4547A0108n56l351o56J36l726k574J36J805m29j000j276J641L427k07o89j691
$$ 10108 9552 6201 5545 5681 1955 -619 -483 1322 893 -107 -1383 258 3685 3478 2789 1098
4531A098K382l529k46J35r43K204K322k494j654N36j113K852O43j442k742j952
$$ 1098 3480 -49 -295 -160 -1103 1101 3423 929 -725 -189 -1302 1550 2193 751 -1991 -3943
4515c943L299l298l27J700L581K682r74p85j640l911J261o80K19J592q01j579
$$ -3943 -644 -3942 -4269 -2569 1012 3694 2720 1935 295 -3616 -2355 -3035 -2816 -1224 -2025 -3604
4499c604K274J636K174o9k848k359L261O48K78N60M851K1l993j663L589j265j061
$$ -3604 -1330 306 2480 2411 -437 -2796 465 1113 1391 1951 6802 6823 2830 1167 4756 3491 2430
4482B430l439j70K699J470l362q04J007l516K236K609J590N03K583K711j065N26
$$ 2430 -1009 -1179 1520 2990 -372 -1176 -169 -3685 -1449 1160 2750 3253 5836 8547 7482 8008
4466H008l46j304J547j073O2J823l517J05l198l075J714O14N247m27n2j003k685
$$ 8008 7662 6358 7905 6832 6894 8717 5200 5305 2107 -968 746 1360 6607 6180 6128 5125 2440
4449B440J791K612k736j686K89k582J31K768L84K713L227l399l51k33J186J80
$$ 2440 4231 6843 4107 2421 2710 128 259 3027 3411 6124 9351 5952 5601 5368 6554 6734
4433F734K692k170l612P5l194K825K706l340l233j797L097j904K446j216o76l048
$$ 6734 9426 7256 3644 3719 525 3350 6056 2716 -517 -2314 783 -1121 1325 109 -567 -3615
4417c615K282K590J672m368j651L080P46k94m322J083k463N072K175k441L908
$$ -3615 -1333 1257 2929 -1439 -3090 -10 736 442 -3880 -2797 -5260 -188 1987 -454 3454
4402C454L747m278p49j621j082K470K357K96K10k496k576J414N489J033k221j916
$$ 3454 7201 2923 2174 553 -529 1941 4298 4594 4804 2308 -268 1146 6635 7668 5447 3531
4386C531j810k692j08K273J114l492J243M722K406m091o445L689N720j271m069
$$ 3531 1721 -971 -1079 1194 2308 -1184 59 4781 7187 3096 -3349 340 6060 4789 720
4371G20l164L91L308l471Kj479o81J803R13N290j218o425j372L444l793J463O230
$$ 720 -2444 -2053 1255 -2216 -2214 -3693 -4374 -2571 -1658 3632 2414 -4011 -5383 -1939 -5732 -4269 1961
4354A961o975J524r87Q21K601K179K840o42k431J544o55m685k655K959j802M83
$$ 1961 -5014 -3490 -4477 -3656 -1055 1124 3964 3322 891 2435 1780 -2905 -5560 -2601 -4403 -3920
4338c920J354J795K103O18l56j546m126J461J044O86J65J752j06p111p91L953
$$ -3920 -2566 -771 1332 1950 1594 48 -4078 -2617 -1573 -887 -722 1030 924 -6187 -6978 -3025
4322c025j277M205J455j46k027K60J336o8k139J026P31q35L438J495J5k479r05
$$ -3025 -4302 -97 1358 1212 -815 -555 781 713 -1426 -400 331 -504 2934 4429 4444 1965 1060
4305A060L490j238j86P4j002j822L683m48O39L08l100q26L529J490Q46k906j840
$$ 1060 4550 3312 3126 3200 2198 376 4059 3611 4250 4558 1458 632 4161 5651 6497 3591 1751
4288A751K27n73j101J599k194J184m58k520l13K204J553l2J726N38K151o38j595
$$ 1751 1978 1405 304 1903 -291 893 435 -2085 -2398 -194 1359 1327 3053 3591 5742 5104 3509
4271C509k705m564j681M523M325J10k073J351J51J713N77j171q55J703N32K626
$$ 3509 804 -3760 -5441 -918 3407 3517 1444 2795 2946 4659 5236 4065 3210 4913 5445 8071
4255H071J449L87l910k092J389K099k109m15R68k621n042l996M331P765J027N3
$$ 8071 9520 9907 5997 3905 5294 7393 5284 4869 5837 3216 -1826 -5822 -1491 6274 7301 7354
4239G354m62O58R48j91n496J620m31k317J526j513k708m389J122N505O654Q05
$$ 7354 6892 7550 8498 8307 2811 4431 4000 1683 3209 1696 -1012 -5401 -4279 1226 7880 8685
4223H685l854j31l243j918j034K27O723K303J062m628k552n317o915N296L314
$$ 8685 4831 4700 1457 -461 -1495 -1268 5455 7758 8820 4192 1640 -3677 -10592 -5296 -1982
4208a982J508K553J971M87k319n636k531J677O60m4k801L81K108j453M62L352
$$ -1982 -474 2079 4050 4537 2218 -3418 -5949 -4272 -3612 -3656 -6457 -6076 -3968 -5421 -4959 -1607
4192a607l138n93M148Q146k094L76n11p108j285j896K60O801M951j119L53O66
$$ -1607 -4745 -5338 -1190 6956 4862 5238 4727 -2381 -3666 -5562 -5302 1499 6450 5331 5684 6350
4176F350j672k137J21Q63j008K490r21j203M01L892N71o875m740r41P765K705
$$ 6350 4678 2541 2662 3525 2517 5007 4086 2883 3284 7176 7747 872 -3868 -4809 2956 5661
4160E661j945N46M07L72j871L097j024K698k52k757j985k61J904K358q73J714
$$ 5661 3716 4262 4669 5041 3170 6267 5243 7941 7689 4932 2947 2686 4590 6948 6075 7789
4144G789K01j367K799J561k825m563J602K494k799j032q35r82j437l11j313R40
$$ 7789 7990 6623 9422 10983 8158 3595 5197 7691 4892 3860 3025 2043 606 295 -1018 -78
4128g8j649K38K094j387J634m66n62M45j298J321K248k55j703J539n59J875L313
$$ -78 -1727 -1489 605 -782 852 386 -176 269 -1029 292 2540 2285 582 2121 1562 3437 6750
4111F750k759q17k26k56k845r30j552j055L585M049o38J672K774k668m536K711
$$ 6750 3991 3174 2948 2692 -153 -1083 -2635 -3690 -105 3944 3306 4978 7752 5084 548 3259
4095C259L033n377j479j480J713n14n16j549L287R15K347L772K304k318o251l646
$$ 3259 6292 915 -564 -2044 -331 -845 -1361 -2910 377 1292 3639 7411 9715 7397 1146 -2500
4079b500j66j155L006M035N467J741j905j572J693R57j289O66k604j472j94j349
$$ -2500 -2666 -3821 -815 3220 8687 10428 8523 6951 8644 9601 8312 8978 6374 4902 4708 3359
4063C359k208l150k680K563l90J683O005R31l900J909J916L05p63k27K972L16
$$ 3359 1151 -1999 -4679 -2116 -2506 -823 5182 6113 2213 4122 6038 6343 5580 5353 8325 8641
4047H641J189n965n46n09J144K116k4K500K91m8r82o98K37j856pl957j884L635
$$ 8641 9830 3865 3319 2810 3954 6070 6046 8546 8837 8789 7807 7109 7346 5490 5483 1526 -358 3277
4029C277N105j421l418l770l526L67M188M328O96Q45r19l444j451O8j141n05n12
$$ 3277 8382 6961 3543 -227 -3753 -3386 802 5130 5826 6671 5752 2308 857 925 -216 -721 -1233
4012a233k711k58K029L624Q9j393j071J765J513j71L52K51Q56k080m603K067L143
$$ -1233 -3944 -4202 -2173 1451 1540 147 -924 841 2354 2183 2535 2786 3642 1562 -3041 -974 2169
3995B169K317o10n095k515J127j844K037j094L75O89m29K524L137J243j790j684
$$ 2169 4486 3876 -1219 -3734 -2607 -4451 -2414 -3508 -3133 -2444 -2873 -349 2788 4031 2241 557
3979E57L008j08J717K232k022k323J47K305L15P35K809l475o499J956J303o94
$$ 557 3565 3457 5174 7406 5384 3061 3208 5513 5828 6563 9372 5897 -602 1354 2657 1963
3963A963O68P56l13l936j680J954L265j79l596P34M34K245j819o306J380K407
$$ 1963 2631 3387 3074 -862 -2542 -588 2677 2498 -1098 -364 70 2315 496 -5810 -4430 -2023
3947b023J119M147L939m189K29O25j936k362J683l7n06K148j216P64p30J54L292
$$ -2023 -904 3243 7182 2993 3222 3847 1911 -451 1232 1195 689 2837 1621 2385 1655 1809 5101
3930E101m498nj312k211K293R70n9M83L24P82K10j021J600P17k653J514R06j481
$$ 5101 603 598 -714 -2925 -632 338 279 762 1086 1868 2078 1057 2657 3374 721 2235 3141 1660
3912A660O94J821k021l602J746L359K31n845j21M639K602l337k607M080J279L19
$$ 1660 2354 4175 2154 -1448 298 3657 3888 -1957 -2078 2561 5163 1826 -781 3299 4578 4897
3896D897k894k778P83J404L167k118J298P72L252L305l811J631j360n665l116
$$ 4897 2003 -775 8 1412 4579 2461 3759 4531 7783 11088 7277 8908 7548 1883 -1233
3881a233k477J013K483P23k752j310J270K488M18l362k40l87J792K577k29j230
$$ -1233 -3710 -2697 -214 509 -2243 -3553 -2283 205 623 -2739 -2979 -3366 -1574 1003 774 -456
3865d56K105n97k288l04K144R01O61K154K896j93j290J885q32m833j919M220J650
$$ -456 1649 1052 -1236 -1540 604 1505 2166 4320 7216 7023 5733 7618 6786 1953 34 4254 5904
3848E904m099j06J030l90J380k879K81L89j543J020J546j563K510j384n76k487
$$ 5904 1805 1699 2729 2339 3719 840 1121 1510 -33 987 2533 970 3480 2096 1520 -967
3832i67l515P34L29m141o22K109L094J948K189k108J815q72J31M26j692k103J398
$$ -967 -4482 -3748 -3419 -7560 -8182 -6073 -2979 -1031 1158 -950 865 -7 124 550 -1142 -3245 -1847
3815a847J641N4J037R47L44j440l70L311k32L040O23m176k709J60l401Q45P10
$$ -1847 -206 -152 885 1832 2176 736 366 3677 3445 6485 7108 2932 223 383 -3018 -2173 -1463
3798a463p33K52J072L191K481r54K961o14L88J664m22m466J71j300K666p74l041
$$ -1463 -2196 -1944 -872 2319 4800 3846 6807 6193 6581 8245 7823 3357 3528 2228 4894 4120 1079
3781A079k31J446N510q25k591l695o23O210j299k756k762j368N461K822j093j459
$$ 1079 848 2294 7804 6979 4388 693 70 6280 4981 2225 -537 -1905 3556 6378 5285 3826
3765C826J823J317K083n001k979J486j373M021L142J084l077j537n807k221R12
$$ 3826 5649 6966 9049 4048 1069 2555 1182 5203 8345 9429 6352 4815 -992 -3213 -2301
3750b301K446J258L067k985K95K976O22k017m85Q83l078O81K37N053L138l866
$$ -2301 145 1403 4470 1485 1780 4756 5378 3361 2876 3759 681 1362 1599 6652 9790 5924
3734E924r26k589k418j064J545L981j657J024n95k690P85K956K469l15L075K220
$$ 5924 4998 2409 -9 -1073 472 4453 2796 3820 3225 535 1320 4276 6745 6430 9505 11725
3718A1725J796Q43k995m248l895l376K071L290j556m913p59K631K909J278k045
$$ 11725 13521 14364 11369 7121 3226 -150 1921 5211 3655 -1258 -2017 614 3523 4801 2756
3703B756K0P66k751J834J759k047j50m663k852l88j930K546L844K819l047J808
$$ 2756 2776 3542 791 2625 4384 2337 2187 -2476 -5328 -5716 -7646 -5100 -1256 1563 -1484 324
3687C24q00j21K952k368o53n10j605n99j019k8j611j559L4K939K079J87Q26O89
$$ 324 -476 -597 2355 -13 -666 -1176 -2781 -3380 -4399 -4427 -6038 -7597 -7563 -4624 -2545 -2358 -1532 -843
3669h43l04J476k090J320M921p70l311l615K135M910J263k116q11p99J069K298
$$ -843 -1147 329 -1761 -441 4480 3710 399 -3216 -1081 3829 5092 2976 2165 1366 2435 4733
3653D733l429J231J136n426J634k147k191J326P77M165Q76j806K022k262q20K721
$$ 4733 1304 2535 3671 -1755 -121 -2268 -4459 -3133 -2356 1809 2685 879 2901 639 -181 2540
3637B540j429l939R97J839K126L20p36o744k88j69J212L328J157J163k548l70
$$ 2540 1111 -2828 -1831 8 2134 2454 1718 -5026 -5314 -5483 -4271 -943 214 1377 -1171 -1541
3621a541j427j465l296M356N531K433r33O52k863J377K076m052k044J581K288
$$ -1541 -2968 -4433 -7729 -3373 2158 4591 3658 4310 1447 2824 4900 848 -1196 385 2673
3606B673L749M95l6K443m759n116Q91L541M921q5K172j696l926l212k63j94K95
$$ 2673 6422 6917 6881 9324 4565 -551 340 3881 8802 8717 10889 9193 5267 2055 1792 1598 1893
3589A893K51K235K762K78o945o734p28k07k504J351K823M216K357J173k236K113
$$ 1893 2144 4379 7141 7419 474 -6260 -6988 -7195 -9699 -8348 -5525 -1309 1048 2221 -15 2098
3573B098L660k134j634k414k056J659L07J755J610o81J11J647p24k854L759K720
$$ 2098 5758 3624 1990 -424 -2480 -821 -514 1241 2851 2170 2281 3928 3204 350 4109 6829
3557F829j626l39o49R93m132q07j055r37K979J328J83J510K68Q69O3k334k125
$$ 6829 5203 4864 4215 5208 1076 269 -786 -1723 1256 2584 2767 4277 4545 5414 5477 3143 1018
3540A018o11L347M9j30k719O4o2L319K72K531J471M6k918n694k201q56j69N91
$$ 1018 407 3754 3803 3673 954 1018 956 4275 4547 7078 8549 8595 5677 -17 -2218 -3074 -3243 -2652
3522b652j840k61Q79K943L772k893J321J879Q87K756K338k924j059k93k757q78
$$ -2652 -4492 -4753 -3874 -931 2841 -52 1269 3148 4035 6791 9129 6205 5146 4853 2096 1218
3506A218j441J026J451J519M792J427n447k775k236l944J958J441k758L78J777
$$ 1218 -223 803 2254 3773 8565 9992 4545 1770 -466 -4410 -2452 -1011 -3769 -3391 -1614
3491a614J78l03L789q61l80K615N27M7K0R06j205l034j689N25N04r14q95L031
$$ -1614 -1436 -1739 2050 1189 809 3424 3951 3998 4018 4924 3719 685 -1004 -479 25 -889 -1784 1247
3473A247P765L155p441n371l406J066k068Q08N244N01m953J058J876J682J092
$$ 1247 9012 12167 4726 -645 -4051 -2985 -5053 -4245 999 1500 -3453 -2395 -519 1163 2255
3458B255J940J048m396p77L847J719j263j344n844p33J146j196k036P23Q15j054
$$ 2255 4195 5243 847 70 3917 5636 4373 3029 -2815 -3548 -2402 -3598 -5634 -4911 -4096 -5150
3442e150k538O22M858L433R61Qk969q70j590m445K606k221m528O77R56K039J203
$$ -5150 -7688 -7066 -2208 1225 2186 2194 -775 -1645 -3235 -7680 -5074 -7295 -11823 -11146 -10190 -8151 -6948
3425f948N65L949L352L335k426n021m428L52M420M234k758K106J848J733j5J915
$$ -6948 -6383 -2434 918 4253 1827 -3194 -7622 -7270 -2850 1384 -1374 732 2580 4313 4298 6213
3409F213K9j496J528m66l322j652K89L202K251m225l415j631J270L418j860L389
$$ 6213 6242 4746 6274 5808 2486 834 1123 4325 6576 2351 -1064 -2695 -1425 1993 133 3522
3393C522q76l459r66j387K63k648J698M230m79k490j396L79N869L447l32k408
$$ 3522 2646 -813 -1779 -3166 -2903 -5551 -3853 377 -102 -2592 -3988 -3609 2260 5707 5375 2967
3377B967m062K230K89L650p20l416j089J485M167k562j424J448k225J275J567
$$ 2967 -1095 1135 1424 5074 4354 938 -151 1334 5501 2939 1515 2963 738 2013 3580
3362C580k679k843k62J540J886k95l014L370m39j855K700k386P83n37K651J817
$$ 3580 901 -1942 -2204 -664 1222 927 -2087 1283 844 -1011 1689 -697 86 -451 2200 4017
3346D017j84K566k912j389Q49K852k333m477n93K205l87j813Q59M758K025n771
$$ 4017 3833 6399 3487 2098 2947 5799 3466 -1011 -1604 601 214 -1599 -740 4018 6043 272
3330B72O90R51L047k974l757Q22P57j516j38J003j750P50L9j191L069r66K70K640
$$ 272 962 1913 4960 1986 -1771 -949 -192 -1708 -1846 -843 -2593 -1843 -1804 -2995 74 -892 -622 2018
3312B018l1k477J201J979k80j382K014J532N23j238K093l83K499n48J781j141
$$ 2018 1987 -490 711 2690 2410 1028 3042 4574 5097 3859 5952 5569 8068 7520 9301 8160
3296H160l481j734k902J070R48k184j740M499N78k139J626R89J851M28l757j681
$$ 8160 4679 2945 43 1113 2061 -123 -1863 2636 3214 1075 2701 3690 5541 5969 2212 531
3280E31K702j98J010k273M52m192K452N479J738L330j832j215L72R28j741o94
$$ 531 3233 3035 4045 1772 2224 -1968 484 5963 7701 11031 9199 7984 8356 9284 7543 6849
3264F849J399j901J46j406n940j294J783N8J732J09l483J24j313J136m66L619
$$ 6849 8248 6347 6493 5087 -853 -2147 -364 -306 1426 1535 -1948 -1824 -3137 -2001 -2467 1152
3248A152M542m209m378j390J053k301j453k25j22K723J227M41J759j002K923J527
$$ 1152 5694 1485 -2893 -4283 -3230 -5531 -6984 -7209 -7331 -4608 -3381 -2940 -1181 -2183 740 2267
3232B267J547j320m61j766K319O35Q84n5Q89l364j616J257J008q35L070L18j895
$$ 2267 3814 2494 2033 267 2586 3221 4105 4050 4939 1575 -41 1216 2224 1389 4459 4777 2882
3215B882j981J91L256J103O42m298j245p55j686m787q69J328k379N24M369O83
$$ 2882 901 1092 4348 5451 6093 1795 550 -205 -1891 -6678 -7547 -6219 -8598 -8074 -3705 -3022
3199c022M79K676K350k910q18J921N663l36k088J659k052N204k642L76j139n24
$$ -3022 -2543 133 2483 -427 -1245 676 6339 6003 3915 5574 3522 8726 6084 6460 5321 4797
3183D797R20o75j153l53M7r99j960q39M713J608j891J67Q39k854p88m297q15K660
$$ 4797 5717 5042 3889 3536 3583 2584 624 -215 4498 6106 4215 4382 5221 2367 1579 -2718 -3533 -873
3165h73N281j431P45J117j290K395J219n3j318N256O138J66n449l507l280l975
$$ -873 4408 2977 3722 4839 3549 5944 7163 7110 5792 11048 17186 17352 11903 8396 5116 1141
3149A141k972K59Q36J345K42k991Q09J224J180L076k223j810L58r45K807Q65j370
$$ 1141 -1831 -1572 -736 609 851 -2140 -1331 -107 1073 4149 1926 116 474 -471 2336 3201 1831
3132A831O04j252p53L51k310l454K106J656m577K545J929K631L485n345J199K890
$$ 1831 2435 1183 430 781 -1529 -4983 -2877 -1221 -5798 -3253 -1324 1307 4792 -553 646 3536
3116C536J131M7k510n31M391k662o140L44M731J885k353l033J178J173l135m279
$$ 3536 4667 4714 2204 1673 6064 3402 -2738 -2394 2337 4222 1869 -1164 14 1187 -1948 -6227
3100f227L645L073L827K634m142m473K953J135J622L336m905l893K088K635K188
$$ -6227 -2582 491 4318 6952 2810 -1663 1290 2425 4047 7383 2478 -1415 673 3308 5496
3085E496l20k220m302J261J560K887K910l534j525m24o36j062L044k010o44m04
$$ 5496 5176 2956 -1346 -85 1475 4362 7272 3738 2213 1789 1153 91 3135 1125 481 77
3069G7J58J134j310O47O37j851k490k128N95J009J536O66L438K94J516R53M402
$$ 77 235 1369 59 706 1343 -508 -2998 -5126 -4531 -3522 -1986 -1320 2118 2412 3928 4881 9283
3052I283J730k340l540q38k281J18k670M071J351m027k525L506M30p0J716k200
$$ 9283 11013 8673 5133 4295 2014 2132 -538 3533 4884 857 -1668 1838 2268 2198 3914 1714
3036A714J169L344j818k074M10p44j24K153j802K67K091q60r87l334q84R84l738
$$ 1714 2883 6227 4409 2335 2745 2001 1877 4030 2228 2495 4586 3726 2739 -595 -1479 -495 -4233
3019d233J303J979n289k511M725J377K479L024j91k42K655k053k206K78k495J087
$$ -4233 -2930 -951 -6240 -8751 -4026 -2649 -170 2854 2663 2421 5076 3023 817 1095 -1400 -313
3003c13K729M096l224l672j545k027o40J322K806K514k10N86k15k601q23L175
$$ -313 2416 6512 3288 -384 -1929 -3956 -4596 -3274 -468 2046 1836 2422 2207 -394 -1217 1958
2987A958K360r39r18L117J462J31n841J194M326m01n295m647K903r46m778L196
$$ 1958 4318 3379 2461 5578 7040 7171 1330 2524 6850 6449 1154 -3493 -590 -1536 -6314 -3118
2971c118M179l26K988J335N13j380N41L450K470n66m770l58O81R42n72k742J00
$$ -3118 1061 735 3723 5058 5571 4191 4732 8182 10652 10086 5316 4958 5639 6581 6009 3267 3367
2954C367M16J909K228m622M01J783L715J6k856j714k801k352k66o74r75J9K322
$$ 3367 3783 5692 7920 3298 3699 5482 9197 9213 6357 4643 1842 -510 -776 -1450 -2425 -2406 -84
2937h4J948j981j493J18M099N98j353Q21N84l389k936K649M083L680J26J244o76
$$ -84 1864 -117 -1610 -1492 2607 3205 1852 2673 3257 -132 -3068 -419 3664 7344 7470 8714 8038
2920H038j248m840j001K583J978l134j678J772j510O5K281O83r13k818k047m87
$$ 8038 6790 1950 949 3532 5510 2376 698 2470 960 1025 3306 3989 3076 258 -1789 -2276
2904b276J559M58J664n110K157O485N97N48J371l657J858J59m464k562J221J948
$$ -2276 -717 -259 1405 -3705 -1548 4937 5534 6082 7453 3796 5654 5813 1349 -1213 8 1956
2888A956K75l359o08l165j644O644L194j644l120J362r85j163J967J841N45m16
$$ 1956 2231 -1128 -1736 -4901 -6545 99 3293 1649 -1471 -109 -1094 -2257 -290 1551 2096 1680
2872A680K58l537l004Q68J02j208o84J299L656K331K744k783m447J763J210J439
$$ 1680 1938 -1599 -4603 -3735 -3633 -4841 -5525 -4226 -570 1761 4505 1722 -2725 -962 248 1687
2856A687P65K125L149m63n684n076j188l33L704M028J25k370R63M108j543j709
$$ 1687 2452 4577 7726 7263 1579 -3497 -4685 -5018 -1314 2714 2839 469 1432 5540 3997 2288
2840B288r07k043j003K738Q98j256J670o73n371M51p90J672J269N18K048k581
$$ 2288 1381 -662 -1665 1073 1971 715 2385 1712 -3659 -3208 -3998 -2326 -1057 -539 1509 -1072
2824a072r51r43J870m71m022J628J483J699j369N10K736j155j520N386N534j387
$$ -1072 -2023 -2966 -1096 -1567 -5589 -3961 -2478 -779 -2148 -1638 1098 -57 -1577 3809 9343 7956
2808G956j726k18r9l13J266j758j626j725j036R81K502K459j731L24l373J33O70
$$ 7956 6230 6012 5913 5600 6866 5108 3482 1757 721 1702 4204 6663 4932 5256 1883 2016 2686
2791B686l07K349o1O79J84j032j124k548l641M68K782o2m897k769j38J938K307
$$ 2686 2379 4728 4667 5346 5530 4498 3374 826 -2815 -2347 435 373 -4524 -7293 -7431 -5493 -3186
2774c186N27J333M780J069k650k189J688N60k31R4R72L893M21n55k563r253k216
$$ -3186 -2659 -1326 3454 4523 1873 -316 1372 1932 1701 1795 2767 6660 7081 6526 3963 -5290 -7506
2757g506M687K523k450M71k87l843j054K860j323M90J265j38J708K351K080L04
$$ -7506 -2819 -296 -2746 -2275 -2562 -6405 -7459 -4599 -5922 -5432 -4167 -4305 -2597 -246 1834 2138
2741B138L732R12k359l297J565J226N17l087m310l702J226M223K477K741L227
$$ 2138 5870 6782 4423 1126 2691 3917 4434 1347 -2963 -6665 -5439 -1216 1261 4002 7229
2726G229k173n597j654O03k120K28L126M995r0j207J907j6l674m207K625K909
$$ 7229 5056 -541 -2195 -1592 -3712 -3484 -358 4637 4547 3340 5247 5231 1557 -2650 -25 2884
2710B884J040L216m92l489q5j8l783k606K341J908J568k037m675j546L457N321
$$ 2884 3924 7140 6648 3159 3074 3056 -727 -3333 -992 916 2484 447 -4228 -5774 -2317 3004
2694C004L470m204k306r3L460K426k741j177L540J56k932J524P34L086l839o13
$$ 3004 6474 2270 -36 -129 3331 5757 3016 1839 5379 5535 2603 4127 4861 7947 4108 3495
2678C495k683L151l16R82k237l554O90L476Q23j593j801J688J921q49k245k926
$$ 3495 812 3963 3647 4629 2392 -1162 -472 3004 3827 2234 433 2121 4042 3193 948 -1978
2662a978l346j004K215L135M132k385l858J943J47J190J811l173o97N335l83K044
$$ -1978 -5324 -6328 -4113 -978 3154 769 -3089 -1146 -999 191 2002 -1171 -1868 3467 3084 5128
2646E128K548m703l692M122J605N3m257k656J229J609j253K689P91K431r19k498
$$ 5128 7676 2973 -719 3403 5008 5061 804 -1852 -623 986 -267 2422 3213 5644 4725 2227
2630B227j565j605j983J681K163K453k074m16K90J335j175K989M141k972q521
$$ 2227 662 -943 -2926 -1245 918 3371 1297 881 1171 2506 1331 4320 8461 5489 -3032
2615c032n021L234L366j22r10K577k131k42q68l141K123M669M042j296q440l427
$$ -3032 -8053 -4819 -1453 -1575 -2485 92 -2039 -2281 -3149 -6290 -4167 502 4544 3248 -5192 -8619
2599h619O130M414L474L89j250N11M82o02l332m107J893N140J534j722l386j066
$$ -8619 -2489 1925 5399 5788 4538 5049 5531 4929 1597 -2510 -617 4523 6057 4335 949 -117
2583a17N32Q05J592L149J06o168K98j90j771l043K544P55l298k060L998M157m220
$$ -117 415 1220 2812 5961 6067 -101 197 7 -1764 -4807 -2263 -1508 -4806 -6866 -2868 1289 -2931
2566b931m129J897Q88L520J916k661o21m46j354N49Q95P37N599K938j92k467J027
$$ -2931 -7060 -5163 -4275 -755 1161 -1500 -2121 -2567 -3921 -3372 -2477 -1740 3859 6797 6605 4138 5165
2549E165K420l920j22L21K090N30k83K770n233k875n83k842n46M143k51m46L291
$$ 5165 7585 3665 3543 3864 5954 6484 6201 8971 3738 863 280 -2562 -3108 1035 784 338 3629
2532C629K568J412l855k200n320J94N200r21K64J504l968l754J694J415K673r26
$$ 3629 6197 7609 3754 1554 -3766 -3572 1628 707 971 2475 -1493 -5247 -3553 -2138 535 -391
2516c91j635L314q9j379J157K059K310J202J655j27k979J873L17k793j182n51
$$ -391 -2026 1288 1199 -180 977 3036 5346 6548 8203 8076 5097 6970 7287 4494 3312 2761
2500B761m280K714P95K6R83j641l122M565M404J226k766k810l84K286L27j543
$$ 2761 -1519 1195 1990 2016 2999 1358 -1764 2801 7205 8431 5665 2855 2471 4757 5084 3541
2484C541J476M31j629j072m946J463N371J391N89l705k735m243j517Q55L398J669
$$ 3541 5017 5448 3819 2747 -2199 -736 4635 6026 6615 2910 175 -4068 -5585 -4730 -1332 337
2468C37L83r04rj344K87j71L212J038n34L19J027k506J24K49K897J799n29o712
$$ 337 720 -184 -193 -1537 -1250 -1421 1791 2829 2295 2614 3641 1135 1259 1508 4405 6204 5675 -1037
2450a037K770O007j62P67N01O98m451j725m083J57M35q15L255J135l840k652L98
$$ -1037 1733 7740 7578 8345 8846 9544 5093 3368 -715 -558 -123 -938 2317 3452 -388 -3040 -2642
2433b642j112o9M839p7p27j667k754k265R73M39j541O70K748O542J573L559j625
$$ -2642 -3754 -3823 1016 939 212 -1455 -4209 -6474 -5501 -5062 -6603 -5933 -3185 3357 4930 8489 6864
2416F864n989l161K438J213J098P37K06j279j994n717k134j0J252L977L875K875
$$ 6864 875 -2286 152 1365 2463 3200 3406 2127 133 -5584 -7718 -7728 -6476 -2499 1376 4251
2400D251L227k25K141k205n037n636j26M026M006k071k775J985M79l38k52q24
$$ 4251 7478 7253 9394 7189 2152 -3484 -3610 416 4422 2351 -424 1561 2040 1702 1450 626
2384F26j455Q0P37L575K134k914j220J567L124m484k457l627Q57Q532K904l783
$$ 626 -829 -749 -12 3563 5697 2783 1563 3130 6254 1770 -687 -4314 -3457 5075 7979 4196
2368D196o114l590J974M29M03m21K0L5M34j280j400J706K691K849j743k916J461
$$ 4196 -1918 -5508 -3534 -3105 -2702 -3123 -3103 -3068 -2634 -3914 -5314 -3608 -917 1932 189 -2727 -1266
2351a266Q93J429K731o51m223K15Q07J84K149k091j490J315R1l052r85M114L661
$$ -1266 -373 1056 3787 3136 -1087 -872 -65 119 2268 177 -1313 2 93 -2959 -3944 170 3831
2334C831j03j78K862L142j128j852l391l26M51M99j590J018L44K966k373l103
$$ 3831 3728 3550 6412 9554 8426 6574 3183 2857 3308 3807 2217 3235 3579 6545 4172 1069
2318A069k140L747K632J978j084j84j618j800l415j984J407q83m772R68R57r70
$$ 1069 -1071 2676 5308 7286 6202 6018 4400 2600 -815 -2799 -1392 -2275 -7047 -6079 -5122 -6092
2302f092J716j805n97K143L783J515k555j169J110l481M91K16k036L339O981K758
$$ -6092 -4376 -6181 -6778 -4635 -852 663 -1892 -3061 -1951 -5432 -4941 -4725 -6761 -3422 3559 6317
2286F317p374k963J44Q660N792r16l399l973l403k877K18K049J771n066j380r3
$$ 6317 -1057 -4020 -3876 4784 10576 9660 6261 2288 -1115 -3992 -3774 -1725 46 -5020 -6400 -6493
2270f493M066L240P88J355O44m13k462q19J811N32K708J44m185k18m215L020O087
$$ -6493 -2427 813 1601 2956 3600 3187 725 -94 1717 2249 4957 5101 916 698 -3517 -497 5590
2253E590l652o934j023L992o39k878M509J707j230j787j264R55L242k786N144
$$ 5590 1938 -4996 -6019 -2027 -2666 -5544 -1035 672 -558 -2345 -3609 -2654 588 -2198 2946
2238B946K715j092k557k943J700J994m038j891J943J348R97k510j144J547j56
$$ 2946 5661 4569 2012 -931 769 2763 -1275 -3166 -1223 125 1122 -1388 -2532 -985 -1141
2223a141k358l789K39P004L382m46j458N94P15m20M63J667j17M51j609J721K017
$$ -1141 -3499 -7288 -7049 -45 3337 2891 1433 2027 2742 2322 2785 4452 4335 4786 3177 4898 6915
2206F915L73l116r99k399j92K764M684L415k171m735l651J844K055M129K03l276
$$ 6915 7288 4172 3173 774 582 3346 8030 11445 9274 4539 888 2732 4787 8916 9119 5843
2190E843m101m515o89M32o48j198K059K557J969j15N97J148k460j39k086k076
$$ 5843 1742 -2773 -3462 -3030 -3678 -4876 -2817 -260 1709 1594 2191 3339 879 740 -1346 -3422
2174c422J790q65j328L239M286p95n84k627J464K887o942J337J974L405J535l271
$$ -3422 -1632 -2497 -3825 -586 3700 2905 2321 -306 1158 4045 -2897 -1560 414 3819 5354 2083
2158B083m630l229J81k260N98K694K17k131k433J008K940K181N718M895k190p070
$$ 2083 -2547 -5776 -5595 -7855 -7257 -4563 -4346 -6477 -8910 -7902 -4962 -2781 2937 7832 5642 -1428
2142a428J360L856j156j229j362N45k003k20L247J180k001j859k375l32M053K789
$$ -1428 -68 3788 2632 1403 41 586 -1417 -1637 1610 2790 789 -1070 -3445 -3777 276 3065
2126C065r18l809j81m168k836N286L265k906j454J375m83K065K703q02l230L992
$$ 3065 2147 -1662 -1843 -6011 -8847 -3561 -296 -3202 -4656 -3281 -3764 -1699 1004 202 -3028 964
2110I64L595p57J591M040n404p185j881j256J288K889L564N4l998k201r9L607
$$ 964 4559 3802 5393 9433 4029 -3156 -5037 -6293 -5005 -2116 1448 1502 -2496 -4697 -4796 -1189
2094a189r16k018K716J220K350k232K73L945N50j605l118j127J240p74J797R51
$$ -1189 -2105 -4123 -1407 -187 2163 -69 204 4149 4699 3094 -24 -1151 89 -685 1112 2063
2078B063P31M49j960o56l731N92j158q25n02J528J443J437K641J303M38j771q4
$$ 2063 2794 3243 1283 627 -3104 -2512 -3670 -4495 -4997 -3469 -2026 -589 2052 3355 3793 2022 1938
2061A938j244m024k76L970J206k266J083J243K51J08Q35m33j787j516K432K75
$$ 1938 694 -3330 -3606 364 1570 -696 387 1630 1881 1989 2824 2391 604 -912 1520 1795
2045A795j082J636L245J592j633k062o748J449K758k402j058J597N313K80k368
$$ 1795 713 2349 5594 7186 5553 3491 -3257 -1808 950 -1452 -2510 -913 4400 4680 2312
2030B312J679J723k904j714l255M89o78m65r60m90L105j920j921k757J499N580
$$ 2312 3991 5714 2810 1096 -2159 -1670 -2348 -2813 -3773 -4263 -1158 -3078 -4999 -7756 -6257 -677
2014f77J578j256M5J271J363k089j761l692J122M047K132l439k600k509N8N612
$$ -677 901 -355 -310 961 2324 235 -1526 -5218 -4096 -49 2083 -1356 -3956 -6465 -6407 -795
1998g95l7l715J64N466N75l405k629L716L047j411k408J102L060M083k799k454
$$ -795 -832 -4547 -4383 1083 1658 -1747 -4376 -660 2387 976 -1432 -330 2730 6813 4014 1560
1982A560l6k357l628K084J709N392M90k587K415j155k941O42K385m263m992l236
$$ 1560 1524 -833 -4461 -2377 -668 4724 5214 2627 5042 3887 946 1588 3973 -290 -5282 -8518
1966h518J971J802J209L823O081K024l423m826J040p37j020O99k821k840J40M559
$$ -8518 -6547 -4745 -3536 287 6368 8392 4969 143 1183 446 -574 125 -2696 -5536 -5396 -837
1950h37n12j216J535M01K576L250l36n364n252L448K412o12m79n15k932J958L37
$$ -837 -1349 -2565 -1030 -629 1947 5197 4861 -503 -5755 -2307 105 -507 -986 -1501 -4433 -2475 -2138
1933b138K410K851j106l78J699J06m235l349l70K798j43K43K270j60j015n138
$$ -2138 272 3123 2017 1639 3338 3444 -791 -4140 -4510 -1712 -1855 -1612 658 498 -517 -5655
1917e655m836k116L929J790J839K895K905k260M16J299j008K519l331K253j964
$$ -5655 -10491 -12607 -8678 -6888 -5049 -2154 751 -1509 -1093 206 -802 1717 -1614 639 -1325
1902a325k766j530K901l2k543O012L63j132K17L937r07m71q41n82o51K96R04o2
$$ -1325 -4091 -5621 -2720 -2752 -5295 717 1080 -52 165 4102 3195 2724 1883 1301 650 946 1850 1788
1884A788J57m285m409j269K372j384n93N114K478K451o95k139k007l085K590K214
$$ 1788 1945 -2340 -6749 -8018 -5646 -7030 -7623 -2509 -31 2420 1725 -414 -2421 -5506 -2916 -702
1868g02L159j925k711M376j547q41K917M924R75k809p38l701n130K849K803M640
$$ -702 2457 532 -2179 2197 650 -191 2726 7650 8625 5816 5078 1377 -3753 -904 1899 6539
1852F539j163k421K779K149j508n976k230M355K930q0O30Q4j574j444j449N076
$$ 6539 5376 2955 5734 7883 6375 399 -1831 2524 5454 5374 6004 6088 4514 3070 1621 6697
1836F697N025k7l177l744K655M38m155n012J208K578k6k038l748L792J321j061
$$ 6697 11722 11695 8518 4774 7429 7867 3712 -1300 -92 2486 2460 422 -3326 466 1787 726
1820G26l399n262Pk541J754N451KO69L916l029J155K952j619k590l30J989k962
$$ 726 -2673 -7935 -7928 -10469 -8715 -3264 -3262 -2593 1323 -1706 -551 2401 782 -1808 -2138 -149 -3111
1803c111j786M704r68O34K737J21m091l807L017K018j007m28k416K346M591j987
$$ -3111 -4897 -193 -1161 -527 2210 2331 -1760 -5567 -2550 -532 -1539 -1967 -4383 -2037 2554 567
1787E67l161P77L16O07O49M405J500k824m727O38J792j813R3M452N58k870j157
$$ 567 -2594 -1817 -1501 -894 -245 4160 5660 2836 -1891 -1253 539 -1274 -1181 3271 3829 959 -198
1770a98K355J127K809K802n867m270P41O3j229j861j251q63j992K339L425j407
$$ -198 2157 3284 6093 8895 3028 -1242 -501 -438 -1667 -3528 -4779 -5642 -7634 -5295 -1870 -3277
1754c277L444k698j542L319j421M97J434k980K200R46J830J144J666k540n096
$$ -3277 167 -2531 -4073 -754 -2175 -1678 -244 -3224 -1024 -78 1752 2896 4562 2022 -3074
1739c074o70P17j380j993k123K731L555J148J5p98r57N77o22M36O37J814K103
$$ -3074 -3744 -3027 -4407 -6400 -8523 -5792 -2237 -1089 -1074 -1872 -2829 -2252 -2874 -2438 -1801 13 2116
1722B116K34n624m34j626L771o67P98k90K824M12l734J052J456J334j727P87L015
$$ 2116 2350 -3274 -3708 -5334 -1563 -2230 -1432 -1722 1102 1514 -2220 -1168 288 1622 -105 682 3697
1705C697J330j743l475k989j04L135j98J49Q58j136k317k224K103M080k310k631
$$ 3697 5027 3284 -191 -3180 -3284 -149 -347 -198 660 -476 -2793 -5017 -2914 1166 -1144 -3775
1689c775O812k48k149k763l218j676M101P40j123M282k32k250o85K598J375L047
$$ -3775 3037 2789 640 -2123 -5341 -7017 -2916 -2176 -3299 983 751 -1499 -2184 414 1789 4836
1673D836l76L816n62o148m537O4k059j670j642k4M712M413O68J60q28K326L112
$$ 4836 4460 8276 7714 1566 -2971 -2907 -4966 -6636 -8278 -8302 -3590 823 1491 1651 823 3149 6261
$$ [...]
##END NTUPLES=NMR SPECTRUM
##END=
