##TITLE=Analysis number 319124
Compound Code btb 00549
Project Code adrs
Chemist Name fudan
##JCAMPDX= 6.0         $$ Bruker NMR JCAMP-DX V2.0
##DATA TYPE= NMR SPECTRUM
##DATA CLASS= NTUPLES
##ORIGIN= Bruker BioSpin GmbH
##OWNER= nmr
$$ XWIN-NMR		Version 3.5
$$ Wed May  3 10:36:08 2006 GMT Daylight Time (UT+1h)  MAYBRIDGE\nmr@NMR_250MHZ
##.OBSERVE FREQUENCY= 250.131544655141
##.OBSERVE NUCLEUS= ^1H
##.ACQUISITION MODE= SIMULTANEOUS (DQD)
##.ACQUISITION SCHEME= undefined
##.AVERAGES= 16
##.DIGITISER RES= 18
##SPECTROMETER/DATA SYSTEM= dpx250
##.PULSE SEQUENCE= zg30
##.SOLVENT NAME= CDCl3
##.SHIFT REFERENCE= (INTERNAL, CDCl3, 0, 16.522)
##AUDIT TRAIL= $$ (NUMBER, WHEN, WHO, WHERE, WHAT)
$$ ##TITLE= Audit trail, XWIN-NMR		Version 3.5
$$ ##JCAMPDX= 5.01
$$ ##ORIGIN= Bruker BioSpin GmbH
$$ ##OWNER= nmr
$$ C:\u/data/dgb/nmr/ADRS/3580/pdata/1/auditp.txt
$$ ##AUDIT TRAIL=  $$ (NUMBER, WHEN, WHO, WHERE, WHAT)
(   1,<2006-05-03 10:35:33.76 +100>,<MAYBRIDGE\nmr>,<NMR_250MHZ>,
      <created by zg, POWCHK disabled, PULCHK disabled
       configuration hash MD5:
       84 BC 41 DB A1 6E 1D 46 DA 25 12 A5 C1 ED C5 3A
       data hash MD5: 64K
       45 CC C7 B2 8D AF D1 25 5D C5 13 1D 41 B3 D0 B0>)
(   2,<2006-05-03 10:35:53.67 +100>,<MAYBRIDGE\nmr>,<NMR_250MHZ>,
      <Start of raw data processing
       ef LB = 0.3 FT_mod = 6 PKNL = 1 SI = 32K 
       data hash MD5: 32K
       1D E3 5E 15 87 4B 79 9D 78 E9 90 C0 C6 C5 AD 7A>)
(   3,<2006-05-03 10:35:55.54 +100>,<MAYBRIDGE\nmr>,<NMR_250MHZ>,
      <apk 
       data hash MD5: 32K
       2A BF 0C B7 B8 7F E8 6E 2C D0 85 04 69 7D 19 1F>)
(   4,<2006-05-03 10:35:56.62 +100>,<MAYBRIDGE\nmr>,<NMR_250MHZ>,
      <abs ABSG = 5 
       data hash MD5: 32K
       3C 5E 0B 54 EC 38 A4 55 AC 7A D8 D6 C6 31 F3 3D>)
$$ ##END=
$$ 
$$ hash MD5
$$ F5 10 AD 97 35 42 29 EA 24 A9 8C 1C 5C 9F CD 5B
##$RELAX= 
##$RELAX= 
##$RELAX= 
##$RELAX= 
##$RELAX= 
##$RELAX= 
##$RELAX= 
$$ Bruker specific parameters
$$ --------------------------
##$DU= <C:\u>
##$EXPNO= 3580
##$NAME= <ADRS>
##$PROCNO= 1
##$TYPE= <nmr>
##$USER= <dgb>
##$AMP= (0..31)
100 100 100 100 100 100 100 100 100 100 100 100 100 100 100 100 100 100 
100 100 100 100 100 100 100 100 100 100 100 100 100 100 
##$AQSEQ= 0
##$AQ_mod= 3
##$AUNM= <au_zg>
##$AUTOPOS= <10 >
##$BF1= 250.13
##$BF2= 250.13
##$BF3= 250.13
##$BF4= 250.13
##$BF5= 500.13
##$BF6= 500.13
##$BF7= 500.13
##$BF8= 500.13
##$BYTORDA= 1
##$CFDGTYP= 0
##$CFRGTYP= 5
##$CHEMSTR= <none>
##$CNST= (0..31)
1 1 145 1 1 1 1 1 1 1 1 1 1 1 1 1 1 1 1 1 1 1 1 1 1 1 1 1 1 1 1 1 
##$CPDPRG= <>
##$CPDPRG1= <>
##$CPDPRG2= <>
##$CPDPRG3= <>
##$CPDPRG4= <mlev>
##$CPDPRG5= <mlev>
##$CPDPRG6= <mlev>
##$CPDPRG7= <mlev>
##$CPDPRG8= <mlev>
##$CPDPRGB= <>
##$CPDPRGT= <>
##$D= (0..31)
0 1 0 0 0 0 0 0 0 0.06 0 0 0 0 0 0 0.0002 0 0 0 0 0 0 0 0 0 0 0 0 0 0 
0 
##$DATE= 1146648932
##$DBL= (0..7)
120 120 120 120 120 120 120 120 
##$DBP= (0..7)
150 150 150 150 150 150 150 150 
##$DBP07= 0
##$DBPNAM0= <>
##$DBPNAM1= <>
##$DBPNAM2= <>
$$ [...]
##$SUBNAM7= <"">
##$SUBNAM8= <"">
##$SUBNAM9= <"">
##$SW= 20.6930455092707
##$SWIBOX= (0..15)
0 0 3 0 0 0 0 0 0 0 0 0 0 0 0 0 
##$SW_h= 5175.983436853
##$TD= 65536
##$TD0= 1
##$TE= 295.16
##$TE2= 300
##$TE3= 300
##$TEG= 300
##$TL= (0..7)
0 120 120 120 120 120 120 120 
##$TP= (0..7)
150 150 150 150 150 150 150 150 
##$TP07= 0
##$TPNAME0= <>
##$TPNAME1= <>
##$TPNAME2= <>
##$TPNAME3= <>
##$TPNAME4= <>
##$TPNAME5= <>
##$TPNAME6= <>
##$TPNAME7= <>
##$TPOAL= (0..7)
0.5 0.5 0.5 0.5 0.5 0.5 0.5 0.5 
##$TPOFFS= (0..7)
0 0 0 0 0 0 0 0 
##$TUNHIN= 0
##$TUNHOUT= 0
##$TUNXOUT= 0
##$USERA1= <user>
##$USERA2= <user>
##$USERA3= <user>
##$USERA4= <user>
##$USERA5= <user>
##$V9= 5
##$VALIST= <valist>
##$VCLIST= <CCCCCCCCCCCCCCC>
##$VD= 0
##$VDLIST= <DDDDDDDDDDDDDDD>
##$VPLIST= <PPPPPPPPPPPPPPP>
##$VTLIST= <TTTTTTTTTTTTTTT>
##$WBST= 1024
##$WBSW= 4
##$XGAIN= (0..3)
0 0 0 0 
##$XL= 0
##$YL= 0
##$YMAX_a= 265977
##$YMIN_a= -408885
##$ZGOPTNS= <>
##$ZL1= 120
##$ZL2= 120
##$ZL3= 120
##$ZL4= 120
##$ABSF1= 16.522
##$ABSF2= -4.171173
##$ABSG= 5
##$ABSL= 3
##$ALPHA= 0
##$AQORDER= 0
##$ASSFAC= 0
##$ASSFACI= 0
##$ASSFACX= 0
##$ASSWID= 0
##$AUNMP= <proc_1d>
##$AZFE= 0.1
##$AZFW= 0.1
##$BCFW= 0
##$BC_mod= 0
##$BYTORDP= 0
##$COROFFS= 0
##$CY= 12.5
##$DATMOD= 1
##$DC= 0
##$DFILT= <>
##$DTYPP= 0
##$F1P= 14.0000005364418
##$F2P= -0.99999901652339
##$FCOR= 0.5
##$FTSIZE= 32768
##$FT_mod= 6
##$GAMMA= 0
##$GB= 0
##$INTBC= 1
##$INTSCL= 1
##$ISEN= 128
##$LB= 0.3
##$LEV0= 0
##$LPBIN= 0
##$MAXI= 10000
##$MC2= 0
##$MEAN= 0
##$ME_mod= 0
##$MI= 0
##$NCOEF= 0
##$NC_proc= -4
##$NLEV= 6
##$NOISF1= 0
##$NOISF2= 0
##$NSP= 0
##$NTH_PI= 0
##$NZP= 0
##$OFFSET= 16.522
##$PC= 1
##$PHC0= 173.5551
##$PHC1= 10.47206
##$PH_mod= 1
##$PKNL= yes
##$PPARMOD= 0
##$PSCAL= 4
##$PSIGN= 0
##$REVERSE= no
##$SF= 250.13
##$SI= 32768
##$SIGF1= 0
##$SIGF2= 0
##$SINO= 400
##$SIOLD= 32768
##$SREGLST= <1H.CDCl3>
##$SSB= 0
##$STSI= 32768
##$STSR= 0
##$SW_p= 5175.98343685301
##$SYMM= 0
##$S_DEV= 0
##$TDeff= 65536
##$TDoff= 0
##$TI= <Analysis number 999999
Compound Code 99
Book Reference 9
Project Code 9>
##$TILT= no
##$TM1= 0
##$TM2= 0
##$TOPLEV= 0
##$USERP1= <user>
##$USERP2= <user>
##$USERP3= <user>
##$USERP4= <user>
##$USERP5= <user>
##$WDW= 1
##$XDIM= 32768
##$YMAX_p= 335559068
##$YMIN_p= -384443
$$ End of Bruker specific parameters
$$ ---------------------------------
##NTUPLES= NMR SPECTRUM
##VAR_NAME=  FREQUENCY,     SPECTRUM/REAL,   SPECTRUM/IMAG
##SYMBOL=    X,             R,               I
##VAR_TYPE=  INDEPENDENT,   DEPENDENT,       DEPENDENT
##VAR_FORM=  AFFN,          ASDF,            ASDF
##VAR_DIM=   32768,         32768,           32768
##UNITS=     HZ,            ARBITRARY UNITS, ARBITRARY UNITS
##FACTOR=    0.157963299565203, 1,           1
##FIRST=     4132.6476996994, 0,             0
##LAST=      -1043.33573715361, 0,           0
##MIN=       -1043.33573715361, -384443,     0
##MAX=       4132.6476996994, 335559068,     0
$$ Real data points
##PAGE= N=1
##DATA TABLE= (X++(R..R)), XYDATA
$$ [...]
$$ plain form
15386 181209 160436 72806 -9806 -123368 -226819 -267497 -101884 16307 59292 30986 77389
15375 77389 88786 67480 3136 -27708 30500 -40617 -17645 2034 -103497 -113816 -66500
15364 -66500 -23848 -21831 -157653 -186888 -118649 -4134 59729 29668 63808 10793 -45589
15353 -45589 -31376 -40922 -55441 -106072 -68672 35683 10404 -65750 -71900 1173 150991 201551
15341 201551 221162 105248 83574 160594 167085 70712 -71279 -94750 -86791 50383 144939
15330 144939 145788 103877 -32889 -117841 -103364 -141670 -137501 -105829 -77075 3511 -21972 94384
15318 94384 206152 157443 153106 42009 64460 21027 38810 41414 88558 70877 51771 -5902
15306 -5902 68931 87139 -50230 -16778 -50281 -83394 -58135 -67651 -93589 -28813 40646 -26438
$$ packed form
15386A81209k0773q7630q2612j13562j03451m0678J65613J18191M2985k8306M6403
15375G7389J1397k1306o4344l0844N8208p1117K2972J9679j05531j0319M7316
15364f6500M2652K017j35822k9235O8239J14515O3863l0061L4140n3015n6382
15353d5589J4213r546j4519n0631L7400J04355k5279p6154o150P3073J49818N0560
15341B01551J9611j15914k1674P7020O491r6373j41991k3471P959J37174R4556
15330A44939Q49m1911j36766q4952J4477l8306M169L1672K8754Q0586k5483J16356
15318I4384J11768m8709m337j11097K2451m3433J7783K604M7144j7681j9106n7673
15306e902P4833J8208j37369L3452l3503l3113K5259r516k5938O4776O9459o7084
$$ plain form
15294 -26438 -72695 -2556 12010 -5929 -55524 -123455 -37953 141 16167 -4131 56222 -5779
15282 -5779 461 42125 139488 176515 99733 82196 169530 226583 227062 187158 250022 167902
15270 167902 93680 107886 115953 141031 155531 25215 -76033 -70775 -28732 36345 130306
15259 130306 73954 -9726 -40435 3771 -117475 -106972 -21573 14971 -10920 -67756 -60040
15248 -60040 40891 31872 -47807 -17825 99549 99281 49375 -49932 -438 -26871 9229 -83262
15236 -83262 -68686 21088 21400 5654 -107591 -216371 -196113 -14666 38963 66935 48396
15225 48396 -46911 -226694 -261471 -149969 -92684 -154587 -108182 -160812 -101855 -88045 -15806
15214 -15806 -10856 -53041 -45977 9932 95485 182042 56314 11951 -5487 -59581 -44053 -32684
$$ packed form
15294b6438m6257P0139J4566j7939m9595o7931Q5502L8094J6026k0298O0353o2001
15282e779O240M1664R7363L7027p6782j7537Q7334N7053M79l9904O2864q2120
15270A67902p4222J4206Q067K5078J4500j30316j01248N258M2043O5077R3961
15259A30306n6352q3680l0709M4206j21246J0503Q5399L6544k5891n6836P716
15248f0040J00931r019p9679K9982J17374k68m9906r9307M9494k6433L6100r2491
15236h3262J4576Q9774L12j5746j13245j08780K0258J81447N3629K7972j8539
15225D8396r5307j79783l4777J11502N7285o1903M6405n2630N8957J3810P2239
15214a5806M950m2185P064N5909Q5553Q6557j25728m4363j7438n4094J5528J1369
$$ plain form
15202 -32684 -3551 -12648 66877 135410 105865 140737 144702 149379 150492 150813 103563 113490 93337
15189 93337 88109 109757 50358 2286 -66058 -47515 28098 31001 90946 50592 -15301 -89899
15177 -89899 49010 48084 -61495 -46312 35879 42823 63888 103369 74704 34018 27490 86179
15165 86179 75356 29104 -15381 -25278 -29108 36222 23392 52656 5742 -29926 -50657 -123883
15153 -123883 -84144 -74889 -44816 -54156 -119746 -96675 -10058 28487 25812 47150 -32684 -67981
15141 -67981 -10685 87457 139896 121563 64847 -10093 -38367 -79882 21310 93367 14575
15130 14575 19458 32874 55440 -4020 81961 21864 -125706 -156434 -69860 69965 77977 55230
15118 55230 49976 -21817 -41292 2484 26732 82476 88209 40085 -4847 39215 -29889 -83645
$$ packed form
15202c2684K9133r097P9525O8533k9545L4872L965M677J113L21m7250R927k0153
15189I3337n228K1648n9399m8072o8344J8543P5613K903N9945m0354o5893p4598
15177h9899J38909r26j09579J5183Q2191O944K1065L9481k8665m0686o528N8689
15165H6179j0823m6252m4485r897l830O5330j2830K9264m6914l5668k0731p3226
15153a23883L9739R255L0073r340o5590K3071Q6617L8545k675K1338p9834l5297
15141f7981N7296R8142N2439j8333n6716p4940k8274m1515J01192P2057p8792
15130A4575M883J3416K2566n9460Q5981o0097j47570l0728Q6574J39825Q012k2747
15118E5230n254p1793j9475M3776K4248N5744N733m8124m4932M4062o9104n3756
$$ plain form
15106 -83645 -106818 -89790 -81971 -135351 -181762 -199021 -179718 -107914 -2255 32661 -28561 -40632
15094 -40632 -126903 -69754 -28021 -29992 -17458 -49933 10455 109672 117218 152644 141045 193610
15082 193610 273530 261929 291776 124307 54725 98497 213250 237235 130591 -5791 3509
15071 3509 25901 58586 135572 100553 8368 -22880 -16496 24231 23122 -68493 -33440 -31909
15059 -31909 -87259 27658 151610 103615 94298 131125 53892 56320 77365 113225 -3354
15048 -3354 -60241 -96428 29751 84743 59736 130828 193614 149626 47854 10507 4501 170905
15036 170905 201569 46640 45924 -57607 12914 125109 69884 5497 -47061 -15059 6244
15025 6244 -43720 -25168 -13039 -57042 17406 -26079 -101511 -72006 -3613 89020 127153 51325
$$ packed form
15106h3645k3173J7028P819n3380m6411j7259J9303P1804J05659L4916o1222j2071
15094d0632q6271N7149M1733j971J2534l2475O0388R9217P546L5426j1599N2565
15082A93610P9920j1601K9847j67469o9582M3772J14753K3985j06644j36382R300
15071C509K2392L2685P6986l5019r2185l1248O384M0727j109r1615L5053J531
15059c1909n5350J14917J23952m7995r317L6827p7233K428K1045L5860j16579
15048c354n6887l6187J26179N4992k5007P1092O2786m3988j01772l7347o006J66404
15036A70905L0664j54929p16j03531P0521J12195n5225o4387n2558L2002K1303
15025F244m9964J8552J2129m4003P4448m3485p5432K9505O8393R2633L8133p5828
$$ plain form
15013 51325 -6190 97622 170141 77431 -15475 -4587 -33315 -54217 -55505 -29364 -37698 -83749
15001 -83749 -124912 -120041 -63808 -92413 -34978 38882 72076 127444 77466 13111 2635 70600
14989 70600 48061 -51979 -69232 -46260 -109049 -55771 41223 90742 43182 -117835 -154191
14978 -154191 -89966 64291 41289 5100 -71018 20782 45977 -108395 -145767 -135960 -41227
14967 -41227 1588 -104388 -98614 -74261 -123764 -152338 -95283 -157583 -143106 14436 5669 15335
14955 15335 -15494 -69824 -75287 -9120 -31468 -32346 -20324 -68283 -157007 -184334 -48881 35020
14943 35020 6352 40781 -19444 -39062 -71759 -11580 26291 -98829 -87471 34883 49383
14932 49383 6708 -84214 -106800 -82952 -28440 -24187 -5451 30111 -16029 -134290 -209370 -145667
$$ packed form
15013E1325n7515J03812P2519r2710r2906J0888k8728k0902j288K6141q334m6051
15001h3749m1163M871N6233k8605N7435P3860L3194N5368m9978o4355j0476O7965
14989G0600k2539j00040j7253K2972o2789N3278R6994M9519m7560j61017l6356
14978a54191O4225J54257k3002l6189p6118R1800K5195j54372l7372R807R4733
14967d1227M2815j05976N774K4353m9503k8574N7055o2300J4477J57542q767R666
14955A5335l0829n4330n463O6167k2348q78J2022m7959q8724k7327J35453Q3901
14943C5020k8668L4429o0225j9618l2697O0179L7871j25120J1358J22354J4500
14932D9383m2675r0922k2586K3848N4512M253J8736L5562m6140j18261p5080O3703
$$ plain form
14920 -145667 -98579 -2904 62205 121041 39243 -33201 -84273 -126652 -57965 -9718 -32545
14909 -32545 -11643 -6053 54711 95276 -48941 -39652 7169 81814 37997 -23950 -4394 9871
14897 9871 17589 -15607 -67223 -151243 -96738 -39978 -8475 -93922 -137350 -91382 -63075 -74585
14885 -74585 -52228 -5752 -17431 -120447 -184042 -146436 -68784 -38569 -141152 -255023 -226721
14874 -226721 -151438 -95032 -74723 57426 -12190 -79491 -113330 -84503 -119412 -148077 -122737
14863 -122737 -196805 -275880 -257248 -190797 -137490 -66925 -73495 -91104 -25458 -112936 -123322 -147791
14851 -147791 -59033 -71165 -17750 24549 32927 53297 40201 29707 35746 90170 183008 282245
14839 282245 239894 61009 -82215 -131317 -48542 5625 75121 89793 121071 136392 58451
$$ packed form
14920a45667M7088R5675O5109N8836q1798p2444n1072m2379O8687M8247k2827
14909c2545K0902N590O0764M0565j44217R289M6821P4645m3817o1947J9556J4265
14897I871P718l3196n1616q4020N4505N6760L1503q5447m3428M5968K8307j1510
14885g4585K2357M6476j1679j03016o3595L7606P7652L0215j02583j13871K8302
14874b26721P5283N6406K0309J32149o9616o7301l3839K8827l4909k8665K5340
14863a22737p4068p9075J8632O6451N3307P0565o570j7609O5646q7478j0386k4469
14851a47791Q8758j2132N3415M2299Q378K0370j3096j0494O039N4424R2838R9237
14839B82245m2351j78885j43224m9102Q2775N4167O9496J4672L1278J5321p7941
$$ plain form
14828 58451 -122655 -189802 -51671 75535 104094 2195 -64754 -60025 -53164 -14125 -28811
14817 -28811 44951 95469 84640 58910 119200 85468 -3386 -24468 25178 -80786 -48940
14806 -48940 -12562 21821 99745 65591 -10808 -45201 -18680 42598 89880 69345 11138 15319
14794 15319 18177 3224 -27530 -27322 -54141 -24370 -65038 -115515 -74427 -107415 -52908 55749
14782 55749 88079 -11502 -57135 -110601 -73920 35023 8002 -32018 -62304 -103953 62081
14771 62081 194480 179244 225356 184557 121653 346 -62766 -13680 7472 4366 -48288
14760 -48288 -54019 -47470 -79516 -103569 -7079 -39501 -96842 -198953 -172095 -99985 -106906 -206378
14748 -206378 -231163 -101038 -32320 -102476 -63904 -68962 -110902 -49744 -27472 -130364 -168118
$$ packed form
14828E8451j81106o7147J38131J27206K8559j01899o6949M729O861L9039j4686
14817b8811P3762N0518j0829k5730O0290l3732q8854k1082M9646j05964L1846
14806d8940L6378L4383P7924l4154p6399l4393K6521O1278M7282k0535n8207M181
14794A5319K858j4953l0754K08k6819K9771m0668n0477M1088l2988N4507J08657
14782E5749L2330r9581m5633n3466L6681J08943k7021m0020l0286m1649J66034
14771F2081J32399j5236M6112m0799o2904j21307o3112M9086K1152l106n2654
14760d8288n731O549l2046k4053R6490l2422n7341j02111K6858P2110o921r9472
14748b06378k4785J30125O8718p0156L8572n058m1940O1158K2272j02892l7754
$$ plain form
14737 -168118 -94145 -29405 -45720 -55194 -45826 -26116 -59638 -1311 -5306 3810 -78434 -161680
14725 -161680 -138080 -104274 -106742 -15847 46771 63980 25443 -42019 -40992 -9276 -2874 -14696
14713 -14696 83802 149270 11115 -42573 -82323 -57286 -21337 -39075 2307 31319 10653
14702 10653 -56289 -172157 -176689 -117015 -95658 6220 29650 22817 68885 8769 11586 -82873
14690 -82873 -70926 -88450 -128904 -125829 -7649 7220 -80010 -118043 -129226 -68070 52283
14679 52283 3609 -139123 -172440 -153166 -115818 -91924 -84078 -39380 39639 -26506 -43696 19119
14667 19119 -85156 -101830 -32277 -85153 -17710 -68218 -31900 -35039 4161 -32845 -65905 -93291
14655 -93291 -32962 -14806 -927 -101543 -208259 -161807 -62105 -5066 -48695 -40267 7970
$$ packed form
14737a68118P3973O4740j6315r474R368J9710l3522N8327l995R116q2244q3246
14725a61680K3600L3806k468R0895O2618J7209l8537o7462J027L1716O402j1822
14713a4696R8498O5468j38155n3688l9750K5037L5949j7738M1382K9012k0666
14702A0653o6942j15868m532N9674K1357J01878K3430o833M6068o0116K817r4459
14690h2873J1947j7524m0454L075J18180J4869q7230l8033j1183O1156J20353
14679E2283m8674j42732l3317J9274L7348K3894P846M4698P9019o6145j7190O2815
14667A9119j04275j6674O9553n2876O7443n0508L6318l139L9200l7006l3060k7386
14655i3291O0329J8156J3879j00616j06716M6452R9702N7039m3629Q428M8237
$$ plain form
14644 7970 61068 67924 3851 -42505 -52663 -127337 -215464 -184502 -244302 -138779 -106362 -129064
14632 -129064 -190593 -221786 -189611 -203979 -196887 -132962 -169201 -175318 -179100 -250880 -107161 10580
14620 10580 60571 -21429 -57360 -12420 -52982 -170106 -167192 -62540 -93078 -1639 12572
14609 12572 -92154 -313379 -282873 -138061 -76912 -26974 40373 32588 -30283 -1014 4773
14598 4773 -101555 -61832 -22602 100043 72556 -32333 14852 15846 -125769 -21006 131848
14587 131848 60369 -57167 -105213 -138704 -29341 -35358 -7601 1981 96568 134126 15123
14576 15123 -62240 -28472 -23418 -124029 -120447 -10540 -11617 -21981 57528 4185 16578 -9492
14564 -9492 -1341 -21093 -60301 -42829 -10446 99432 95642 -48502 -53578 -72585 -113 -73976
$$ packed form
14644G970N3098O856o4073m6356j0158p4674q8127L0962n9800J05523L2417k2702
14632a29064o1529l1193L2175j4368P092O3925l6239o117l782p1780J43719J17741
14620A0580M9991q2000l5931M4940m0562j17124K914J04652l0538R1439J4211
14609A2572j04726k21225L0506J44812O1149M9938O7347p785o2871K9269N787
14598D773j06328L9723L9230J22645k7487j04889M7185R94j41615J04763J52854
14587A31848p1479j17536m8046l3491J09363o017K7757R582R4587L7558j19003
14576A5123p7363L3768N054j00611L582J09907j077j0364P9509n3343J2393k6070
14564i492Q151j9752l9208J7472L2383J09878l790j44144n076j9007P2472p3863
$$ plain form
14552 -73976 -23810 6337 34957 58383 169709 105101 79695 67023 23388 12880 111087
14541 111087 182041 186563 113381 35070 30798 111598 178052 149189 132610 82941 -16304 -22185
14529 -22185 16826 113793 98178 97764 87247 50813 -61918 -45025 -102154 -74291 8197 12020
14517 12020 -63139 -37567 17421 149804 236210 238375 152423 -1052 -44718 12127 77674
14506 77674 -20857 -94275 -152969 -98611 -48697 -10488 -75463 -90102 -70653 -95727 -51846 -92535
14494 -92535 -73728 -67117 -31462 -14416 -57808 -118411 -210621 -144470 -84880 -59704 -87760 -182567
14482 -182567 -190886 -180950 -155033 -183689 -116285 -88737 55760 130197 83450 -44512 -204193
14471 -204193 -157832 -143988 -68350 -67003 -151869 -119520 8363 2257 -12836 87087 77328 -63001
$$ packed form
14552g3976N0166L0147K8620K3426J11326o4608k5406j2672m3635j0508R8207
14541A11087P0954M522p3182p8311m272Q0800O6454k8863j6579m9669r9245n881
14529b2185L9011R6967j5615m14j0517l6434j12731J6893n7129K7863Q2488L823
14517A2020p5159K5572N4988J32383Q6406K165q5952j53475m3666N6845O5547
14506G7674r8531p3418n8694N4358M9914L8209o4975j4639J9449k5074M3881m0689
14494i2535J8807O611L5655J7046m3392o0603r2210O6151N9590K5176k8056r4807
14482a82567q319R936K5917k8656O7404K7548J44497P4437m6747j27962j59681
14471b04193M6361J3844P5638J347q4866L2349J27883o106j5093R9923r759j40329
$$ plain form
14459 -63001 -155416 -196749 -131345 -8406 -73941 -102439 -80303 -49300 -122734 -140257 -138380 -130655
14447 -130655 -114469 -57011 -22827 -111847 -154392 -127833 -130549 -75598 -136826 -246308 -145796
14436 -145796 -201740 -133521 -19798 86982 13610 -77347 -98203 -70610 27205 136610 154624
14425 154624 86683 165307 261499 165495 87798 129465 95682 56113 -11859 -148630 -159829
14414 -159829 -87339 40214 33336 6718 -52760 19029 35180 96231 183178 125471 17552
14403 17552 -22655 -12335 41661 -3313 53195 74661 99309 184831 189435 180235 90117 -1714
14391 -1714 -23909 -93444 -154578 -97653 -37551 2394 -41090 -64327 -88782 -79577 10869 -35457
14379 -35457 -73837 -178391 -140035 -26006 -69568 -81112 -244261 -131603 -83569 -61229 78999
$$ packed form
14459f3001r2415m1333O5404J22939o5535k8498K2136L1003p3434j7523J877P725
14447a30655J6186N7458L4184q9020m2545K6559k716N4951o1228j09482J00512
14436a45796n5944O8219J13723J06780p3372r0957k0856K7593R7815J09405J8014
14425A54624o7941P8624R6192r6004p7697M1667l3783l9569o7972j36771j1199
14414a59829P2490J27553o878k6618n9478P1789J6151O1051Q6947n7707j07919
14403A7552m0207J0320N3996m4974N6508K1466K4648Q5522M604r200r0118r1831
14391a714k2195o9535o1134N6925O0102L9945m3484k3237k4455R205R0446m6326
14379c5457l8380j04554L8356J14029m3562j1544j63149J12658M8034K2340J40228
$$ plain form
14368 78999 53573 27952 59339 85099 73956 -7423 -15704 -7042 -63925 -45323 -169187 -299277
14356 -299277 -280416 -151934 -108430 -92392 -118745 41968 41538 -29574 47957 47884 28527 -14492
14344 -14492 8694 82595 75224 151204 139931 59107 -15659 -80758 -88065 -100276 -91617 -94821
14332 -94821 -54583 -110547 -111667 -171471 -152038 -26833 61866 91279 202250 204068 -15083
14321 -15083 -199824 -110917 20896 82005 27990 75546 104035 22766 18414 -59548 9824
14310 9824 116964 129546 -9897 -154729 -39935 72565 71743 154403 158238 129760 235507
14299 235507 190117 96213 119717 256577 248552 163738 105214 168872 213880 98863 19175
14288 19175 2186 49788 -38981 -65420 -48667 -46493 26708 14844 99586 95958 15290 -62221
$$ packed form
14368G8999k5426k5621L1387K5760j1143q1379q281Q662n6883J8602j23864j30090
14356b99277J8861J28482M3504J6038k6353J60713m30p1112P7531p3j9357m3019
14344a4492K3186P3901p371P5980j1273q0824p4766o5099p307j2211Q659l204
14332i4821M0238n5964j120n9804J9433J25205Q8699K9413J10971J818k19151
14321a5083j84741Q8907J31813O1109n4015M7556K8489q1269m352p7962O9372
14310I824J07140J2582j39443j44832J14794J12500q22Q2660L835k8478J05747
14299B35507m5390r3904K3504J36860q025q4814n8524O3658M5008j15017p9688
14288A9175j6989M7602q8769k6439J6753K174P3201j1864Q4742l628q0668p7511
$$ plain form
14276 -62221 -142309 -56478 53451 101428 145886 64308 -93572 -95383 -109997 -136488 -127772 -128232
14264 -128232 -273009 -265542 -123564 -21596 27246 -25086 66092 205753 293221 225116 118162
14253 118162 -158 -116199 -198163 -235300 -177591 -73556 -47870 -37042 -94046 -120302 -168757
14242 -168757 -133500 -101618 -89338 -79041 -36791 -7668 -24127 44100 50646 -32014 -80365 -12392
14230 -12392 64327 64075 -66443 -193604 -298709 -269981 -115814 39138 76218 -49846 -117259
14219 -117259 -103734 -133731 -131671 30866 -63990 -108744 -44878 -39993 -85970 -65570 -68312 -33365
14207 -33365 -111667 -67751 48417 48883 -68797 -28864 1808 -96247 -77712 -54367 -54773 -11595
14195 -11595 -108189 -111643 -116408 -143570 -112909 -37878 -99519 25655 50351 -7976 86564 57017
$$ packed form
14276f2221q0088Q5831J09929M7977M4458q1578j57880j811j4614k6491Q716m60
14264a28232j44777P467J41978J01968M8842n2332R1178J39661Q7468o8105j06954
14253A18162j18320j16041q1964l7137N7709J04035K5686J0828n7004k6256m8455
14242a68757L5257L1882J2280J0297M2250K9123j6459O8227O546q2660m8351O7973
14230a2392P6719k52j30518j27161j05105K8728J54167J54952L7080j26064o7413
14219a17259J3525k9997K060J62537r4856m4754O3866M885m5977K0400k742L4947
14207c3365p8302M3916J16168M66j17680L9933L0672r8055J8535K3345m06M3178
14195a1595r6594l454m765k7162L0661P5031o1641J25174K4696n8327R4540k9547
$$ plain form
14183 57017 42500 -2770 -18731 -71887 -75604 -32606 -74155 -150509 -104516 -66901 -79433 -79839
14171 -79839 -45680 -44047 -96979 -151043 -45346 120145 112559 -16830 -131463 -219999 -152067
14160 -152067 38808 41447 55736 22472 94804 94120 30637 -5295 -66618 -9574 -2882 -63830
14148 -63830 -92654 -142762 -135716 -70218 536 92277 120266 21659 -9259 53106 -87329 -156867
14136 -156867 18465 56114 14853 -41429 -96088 -119601 -42887 -153188 -93188 -25712 -52109
14125 -52109 192 20981 -65361 -100703 -111469 -96766 -16951 -29996 -121688 -247259 -321166
14114 -321166 -275991 -199556 -101015 -76277 -107873 -71196 -36777 48901 151476 155098 55286
14103 55286 -65430 37332 -71858 -174658 -238803 -252972 -137983 -98935 -73899 -68546 -88085
$$ packed form
14183E7017j4517m5270j5961n3156l717M2998m1549p6354M5993L7615j2532m06
14171g9839L4159J633n2932n4064J05697J65491p586j29389j14633q8536O7932
14160a52067J90875K639J4289l3264P2332o84o3483l5932o1323N7044O692o0948
14148f3830k8824n0108P046O5498P0754R1741K7989r8607l0918O2365j40435o9538
14136a56867J75332L7649m1261n6282n4659k3513P6714j10301O0000O7476k6397
14125e2109N2301K0789q6342l5342j0766J4703P9815j3045r1692j25571p3907
14114c21166M5175P6435R8541K4738l1596L6677L4419Q5678J02575L622r9812
14103E5286j20716J02762j09190j02800o4145j4169J14989L9048K5036N353j9539
$$ plain form
14092 -88085 -81244 -179162 -266049 -246606 -119432 -78211 144242 132119 74676 100826 102160 21255
14080 21255 -44087 -66228 41497 24957 71496 110052 81576 91796 49429 -45411 -55691
14069 -55691 -37045 -82119 -75683 -28232 -61907 -53355 20836 81667 147725 93465 -703 -66302
14057 -66302 -61913 -126878 -130000 -35884 30508 90058 37717 -36551 -167287 -190720 -149838 -171952
14045 -171952 -103818 -84853 32971 99709 -1307 -58121 -76918 56924 91126 22333 -88006
14034 -88006 -170891 -117814 17536 105383 45539 23909 -31769 -60687 -48427 17360 -29685
14023 -29685 -44710 -26654 1642 6386 -27019 -1442 -13251 -49448 -84430 -123256 -157753 -214106
14011 -214106 -141477 -41937 80257 32519 11519 84489 1590 34191 28825 -69247 -43049
$$ packed form
14092h8085O841r7918q6887J9443J27174M1221K22453j2123n7443K6150J334q0905
14080B1255o5342k2141J07725j6540M6539L8556k8476J0220m2367r4840j0280
14069e5691J8646m5074O436M7451l3675Q552P4191O0831O6058n4260r4168o5599
14057f6302M389o4965l122R4116O6392N9550n2341p4268j30736k3433M0882k2114
14045a71952O8134J8965J17824O6738j01016n6814j8797J33842L4202o8793j10339
14034h8006q2885N3077J35350Q7847n9844k1630n5678k8918J2260O5787m7045
14023b9685j5025J8056K8296M744l3405K5577j1809l6197l4982l8826l4497n6353
14011b14106P2629R9540J22194m7738k1000P2970q2899L2601n366r8072K6198
$$ plain form
14000 -43049 35706 119488 99201 78034 68977 -25063 -119127 -87438 3400 83025 25571 18304
13988 18304 -9670 -1078 -87585 -111601 -84932 -60349 21175 105453 73337 76280 97001 22232
13976 22232 58628 113346 128617 112014 101067 -67124 -107275 -163515 -186622 -154686 -135753
13965 -135753 -46602 -11961 -8660 -11887 -13775 13735 -12797 -52963 -40641 2511 21156 -12195
13953 -12195 2031 43343 1359 -95759 -132745 -104308 -88558 -29262 109020 167652 157352
13942 157352 91506 59318 43560 12012 -84416 -53460 98589 164646 129492 61242 37945
13931 37945 59880 97431 103409 73655 -79018 -32044 -37716 -101333 -14852 111326 143458 -3658
13919 -3658 -84830 -27728 3829 -409 29281 -38176 -36241 57280 84149 158841 151769 -7021
$$ packed form
14000d3049P8755Q3782k0287k1167r057r4040r4064L1689R0838P9625n7454p267
13988A8304k7974Q592q6507k4016K6669K4583Q1524Q4278l2116K943K0721p4769
13976B2232L6396N4718J5271j6603j0947j68191m0151n6240k3107L1936J8933
13965a35753Q9151L4641L301l227j888K7510k6532m0166J2322M3152J8645l3351
13953a2195J4226M1312m1984r7118l6986K8437J5750N9296J38282N8632j0300
13942A57352o5846l2188j5758l1548r6428L0956J52049O6057l5154o8250k3297
13931C7945K1935L7551N978k9754j52673M6974n672o3617Q6481J26178L2132j47116
13919c658q1172N7102L1557m238K9690o7457J935R3521K6869P4692p072j58790
$$ plain form
13907 -7021 -46089 125170 113401 -13882 14395 69377 -17421 -28497 -12427 -15457 -68644 -35213
13895 -35213 -85578 -99509 -60780 -44710 -107518 -35766 6664 44760 15324 -67272 -15401 -22840
13883 -22840 7623 4576 -48404 -168985 -166016 -65815 -55237 -88799 -116711 -49068 43945 102278
13871 102278 13562 -50053 -31198 -13979 -57066 -34821 -6855 -1484 94783 85456 47833 42496
13859 42496 -20499 -48534 -41510 23028 81093 117650 70009 32781 63762 68264 58775 157139
13847 157139 178525 78247 -54825 -72063 -20243 -102738 -58884 66437 45461 -54170 -70292
13836 -70292 -72449 -80279 -130178 -29561 -23680 -124207 -28708 -59489 -175457 -140123 -76158 -108988
13824 -108988 -144098 -77980 -64004 -53125 -52004 -8514 -75100 -115871 -124197 -167291 -51448 -74899
$$ packed form
13907g021l9068J71259j1769j27283K8277N4982q6798j1076J6070l030n3187L3431
13895c5213n0365j3931L8729J6070o2808P1752M2430L8096k9436q2596N1871p439
13883b2840L0463l047n2980j20581K969J00201J0578l3562k7912O7643R3013N8333
13871A02278q8716o3615J8855J7219m3087K2245K7966N371R6267r327l7623n337
13859D2496o2995k8035P024O4538N8065L6557m7641l7228L0981M502r489R8364
13847A57139K1386j00278j33072j7238N1820q2495M3854J25321k0976r9631j6122
13836g0292k157p830m9899J00617N881j00527R5499l0781j15968L5334O3965l2830
13824a08988l5110O6118J3976J0879J121M3490o6586m0771q326m3094J15843k3451
$$ plain form
13812 -74899 -3358 57556 -22463 6591 21884 12333 66833 98297 -45599 -128529 -219674 -251430
13800 -251430 -234472 -112249 -86300 -14988 36503 27792 21427 25938 19170 27860 38303 -70223
13788 -70223 -134279 -47790 -58762 -53263 -69599 -36845 62020 105767 55219 -153699 -242518 -139992
13776 -139992 -36514 34926 -48944 -72266 -136379 -98547 8559 35597 49588 49056 52187 8539
13764 8539 -45180 -64944 -87615 -44420 -14212 12575 -58078 -50634 -25444 83335 190499 157953
13752 157953 104590 120305 133710 30657 -26899 18873 47875 68114 72032 202051 283969
13741 283969 177331 166255 99055 -83529 -148285 -85476 16736 120391 88704 -40778
13731 -40778 -241569 -352889 -247683 -199935 -173888 -142537 -94362 -60624 -42014 78526 89795
$$ packed form
13812g4899P1541O0914q0019K9054J5293r551N4500L1464j43896q2930r1145l1756
13800b51430J6958J22223K5949P1312N1491q711o365M511o768Q690J0443j08526
13788g0223o4056Q6489j0972N499j6336L2754R8865M3747n0548k08918q8819J02526
13776a39992J03478P1440q3870k3322o4113L7832J07106K7038J3991n32L131m3648
13764H539n3719j9764k2671M3195L0208K6787p0653P444K5190J08779J07164l2546
13752A57953n3363J5715J3405j03053n7556M5772K9002K0239L918J30019Q1918
13741B83969j06638j1076o7200j82584o4756O2809J02212J03655l1687j29482
13731d0778k00791j11320J05206M7748K6047L1351M8175L3738J8610J20540J1269
$$ plain form
13720 89795 113541 131430 110944 36843 -6041 -138233 -280743 -238052 -190648 -232860 -185912
13709 -185912 -66368 -83934 -41059 56885 -1200 -90254 -101307 -78574 -161635 -269564 -174443
13698 -174443 -113690 -78512 1877 11 22696 -27638 34717 143594 142520 110061 99573 135198
13686 135198 48467 -88307 -137073 -117918 -142223 -155492 -137281 -22454 50862 137782 100056
13675 100056 110381 53401 4482 3979 -145396 -131297 -95054 -111813 -178450 -176196 -152048 -63052
13663 -63052 -27629 -18032 -19531 40347 30568 -52801 -61009 28970 60109 57698 23182 -28174 -91814
13650 -91814 -142260 -111216 -121958 -63542 -89097 -121829 -109998 -85982 -111503 -79980 -156851 -108043
13638 -108043 24605 48294 -20758 20169 9609 -7330 -45288 -25713 -26665 -38115 18939 41302
$$ packed form
13720H9795K3746J7889k0486p4101m2884j32192j42510M2691M7404m2212M6948
13709a85912J19544j7566M2875R7944n8085q9054j1053K2733q3061j07929R5121
13698a74443O0753L5178Q0389j866K2685n0334O2355J08877j074l2459j0488L5625
13686A35198q6731j36774m8766J9155k4305j3269J8211J14827P3316Q6920l7726
13675A00056J0325n6980m8919n03j49375J4099L6243j6759o6637K254K4148Q8996
13663f3052L5423R597j499N9878r779q3369q208Q9979L1139k411l4516n1356o3640
13650i1814n0446L1044j0742N8416k5555l2732J1831K4016k5521L1523p6871M8808
13638a08043J32648K3689o9052M0927j0560j6939l7958J9575r52j1450N7054K2363
$$ plain form
13626 41302 57685 -56733 -112624 -167904 -151884 -51492 -30530 -57065 -130285 -161438 -201890
13615 -201890 -84265 -72578 11651 96267 64243 -29944 -32156 -43347 -41337 -105192 -64494 -57390
13603 -57390 -80061 -47693 -55816 -84549 -93279 -28594 -17896 -47030 -61466 25387 31335 23660
13591 23660 -665 18607 24846 -50232 -8002 -78124 -132800 -84823 -111582 -52290 40598 78791
13579 78791 56325 66943 133774 193204 228365 125440 50600 87464 161771 57251 66298
13568 66298 147274 184525 123554 58640 -30988 -79937 -49046 -6477 -91535 -61302 -154976 -211554
13556 -211554 -117158 -24897 175981 209801 161141 101301 134288 150381 187897 115024 48517
13545 48517 178088 211378 96438 55614 19747 7060 5403 92213 28551 -10095 -24991
$$ packed form
13626D1302J6383j14418n5891n5280J6020J00392K0962k6535p3220l1153m0452
13615b01890J17625J1687Q4229Q4616l2024r4187k212j1191K010o3855M0698P104
13603e7390k2671L2368q123k8733q730O4685J0698k9134j4436Q6853N948p675
13591B3660k4325J9272O239p5078M2230p0122n4676M7977k6759N9292R2888L8193
13579G8791k2466J0618O6831N9430L5161j02925p4840L6864P4307j04520R047
13568F6298Q0976L7251o0971o4914q9628m8949L0891M2569q5058L0233r3674n6578
13556b11554R4396R2261K00878L3820m8660n9840L2987J6093L7516p2873o6507
13545D8517J29571L3290j14940m0824l5867j2687j657Q6810o3662l8646j4896
$$ plain form
13534 -24991 41836 37803 8771 14119 119551 204464 131954 86710 102181 51831 -44268 -124080
13522 -124080 -215009 -193586 -126893 -121742 13778 103359 106711 92177 142014 93069 24522 60288
13510 60288 22699 -55194 -50026 -132158 -78588 7775 -25836 4569 -50518 -31387 -12675 -59
13498 -59 8151 -22413 -75539 -35473 53976 65776 -37125 -95800 -111219 -106045 -77805 -115077
13486 -115077 72583 207524 133924 41032 22935 -27069 7148 17884 -64648 -37327 69894
13475 69894 27903 -19502 9765 -9301 -80468 31080 142341 177363 198749 80668 -36881
13464 -36881 -28517 -84894 26332 121439 106674 75789 65906 27700 -37117 -14717 -30311 9488
13452 9488 8909 16913 41605 53801 50888 33810 -1870 -1551 -39365 -1469 72838 -124606 -187960
$$ packed form
13534b4991O6827m033k9032N348J05432Q4913p2510m5244J5471n0350r6099p9812
13522a24080r0929K1423O6693N151J35520Q9581L352j4534M9837m8945o8547L5766
13510F0288l7589p7893N168q2132N3570Q6363l3611L0405n5087J9131J8712J2616
13498e9Q210l0564n3126M0066Q9449J1800j02901n8675j5419N174K8240l7272
13486a15077J87660J34941p3600r2892j8097n0004L4217J0736q2532K7321J07221
13475F9894m1991m7405K9267j9066p1167J11548J11261L5022K1386j18081j17549
13464c6881Q364n6377J11226R5107j4765l0885r883l8206o4817K2400j5594L9799
13452I488n79Q004K4692J2196k913j7078l5680L19l7814L7896P4307j97444o3354
$$ plain form
13439 -187960 -133540 -140374 -64537 95922 102314 53567 175440 278888 196614 63193 23879
13428 23879 10900 21551 -6015 -78259 -47030 -41353 -59157 -65305 8316 80201 28482 -77155
13416 -77155 -93356 -59406 -64072 -106728 58937 124802 106417 99101 32920 45600 -67865 -91459
13404 -91459 -111404 -166509 -162378 -229649 -156334 14164 22711 23042 65252 95866 135222 96056
13392 96056 182918 176024 95746 47847 4842 99773 76911 88790 121092 17681 40761 132710
13380 132710 113087 -6629 -54791 22578 -37871 -44831 37315 -17849 -39712 11184 -271
13369 -271 96136 130658 124697 91410 -4710 -68458 44688 -56429 -80099 -64516 8532 58510
13357 58510 95387 79601 42760 80591 100413 129055 36048 -59775 -31929 -77811 -122133 -116989
$$ packed form
13439a87960N4420o834P5837J60459O392m8747J21873J03448q2274j33421l9314
13428B3879j2979J0651k7566p2244L1229N677j7804o148P3621P1885n1719j05637
13416g7155j6201L3950m666m2656J65665O5865j8385p316o6181J2680j13465k3594
13404i1459j9945n5105M131o7271P3315J70498Q547L31M2210L0614L9356l9166
13392I6056Q6862o894q0278m7899m3005R4931k2862J1879L2302j03411K3080R1949
13380A32710j9623j19716m8162P7369o0449o960Q2146n5164k1863N0896j1455
13369b71R6407L4522n961l3287r6120o3748J13146j01117k3670J5583P3048M9978
13357E8510L6877j5786l6841L7831J9822K8642r3007r5823K7846m5882m4322N144
$$ plain form
13345 -116989 -115818 -32761 -9064 -92005 -79551 -73370 -113999 -86492 -156635 -207972 -166675 -162275
13333 -162275 -165699 -295256 -287973 -229694 -182607 -73498 32607 73914 57536 -20504 -62207
13322 -62207 -33167 53787 80746 79102 73759 139467 76998 4189 -121607 -135846 -79791 19201
13310 19201 32598 11434 -68871 -198629 -131304 -30717 -31460 -119354 -83940 -125821 -169199 -137816
13298 -137816 -151733 -113493 -125853 -118567 -81151 -67728 -71707 -155944 -198113 -124350 -18921 -5867
13286 -5867 -87873 -60087 -150972 -100680 72939 62209 96976 -9814 -50748 -75779 -108719
13275 -108719 -47359 -71934 -103648 -132345 -71923 19290 81694 73204 51228 69996 8085 24709
13263 24709 60616 14871 -21794 -7257 3829 -56844 -95749 -75797 -178690 -88675 19488
$$ packed form
13345a16989J171Q3057K3697q2941J2454O181m0629K7507p0143n1337M1297M400
13333a62275l424j29557P283N8279M7087J09109J06105M1307j6378p8040m1703
13322f2207K9040Q6954K6959j644n343O5708o2469p2809j25796j4239N6055R8992
13310A9201J3397k1164q0305j29758O7325J00587p43q7894L5414m1881m3378L1383
13298a37816j3917L8240j2360P286L7416J3423l979q4237m2169P3763J05429J3054
13286e867q2006K7786r0885N0292J73619j0730L4767j06790m0934k5031l2940
13275a08719O1360k4575l1714k8697O0422R1213O2404q490k1976J8768o1911J6624
13263B4709L5907m5745l6665J4537J1086o0673l8905J9952j02893R0015J08163
$$ plain form
13252 19488 78014 35419 26425 4537 -59848 -68665 -123995 -76131 -85486 -105840 -60806 -75806
13240 -75806 -71054 23396 -18350 -147257 -140756 -116179 -128026 -215933 -215005 -142985 -32497 -80842
13228 -80842 -93715 -78524 18618 -2633 -37227 -3011 -36274 -123573 -31913 -15969 -12480 22301
13216 22301 38431 -32831 -76592 -67612 -6210 -8174 -58121 -134290 -93760 -47340 31557 69977
13204 69977 -27480 -103390 -90014 -31488 -48748 751 40215 43112 87106 86858 35717 34070
13192 34070 -73021 -121564 -32419 -53773 -35946 -17924 -4985 -84601 -122680 -108694 -45442
13181 -45442 11937 -75574 -184369 -158152 -178554 -166085 -147080 -94489 -78747 -11341 -64961
13170 -64961 -157524 -175705 -148092 -65350 -82722 -108352 -164942 -78230 92326 4422 -115813
$$ packed form
13252A9488N8526m2595q994k1888o4385q817n5330M7864r355k0354M5034j5000
13240g5806M752R4450m1746j28907O501K4577j1847q7907R28P2020J10488m8345
13228h0842j2873J5191R7142k1251l4594L4216l3263q7299R1660J5944L489L4781
13216B2301J6130p1262m3761Q980O1402j964m9947p6169M0530M6420P8897L8420
13204F9977r7457p5910J3376N8526j7260M9499L9464K897M3994k48n1141j647
13192C4070j07091m8543Q9145k1354J7827J8022J2939p9616l8079J3986O3252
13181d5442N7379q7511j08795K6217k0402J2469J9005N2591J5742O7406n3620
13170f4961r2563j8181K7613Q2742j7372k5630n6590Q6712J70556q7904j20235
$$ plain form
13159 -115813 -104480 -67193 -69416 -15713 -17889 21072 -16296 -69783 36371 -10125 -76729 -16639
13147 -16639 -70491 -138415 -141795 -102015 -82215 -109118 -117063 -14031 24679 -84051 -111491 -13108
13135 -13108 -4265 31716 -21569 -45566 -78225 -50200 -46163 -101185 -146559 -65239 -116114 -144262
13123 -144262 -126648 -104526 -72609 62536 141048 149773 17032 -73149 11575 -69959 -93935
13112 -93935 -77710 -123067 -131288 -48897 6310 -113242 -162877 -148247 -118526 -46994 -58172 -100647
13100 -100647 -160515 -79662 23648 140032 114766 66870 31460 -10588 23659 -73417 11072
13089 11072 72994 19558 72565 -4699 -110850 -163902 -169116 -26470 1406 -115310 -133540
13078 -133540 54855 144820 119082 106128 156258 191185 175161 228782 260631 236742 146450
$$ packed form
13159a15813J1333L7287k223N3703k176L8961l7368n3487J06154m6496o6604O0090
13147a6639n3852o7924l380L9780J9800k6903p945J03032L8710j08730k7440R8383
13135a3108Q843L5981n3285k3997l2659K8025M037n5022m5374Q1320n0875k8148
13123a44262J7614K2122L1917J35145P8512Q725j32741r0181Q4724q1534k3976
13112i3935J6225m5357q221Q2391N5207j19552m9635J4630K9721P1532j1178m2475
13100a00647n9868Q0853J03310J16384k5266m7896l5410m2048L4247r7076Q4489
13089A1072O1922n3436N3007p7264j06151n3052n214J42646K7876j16716j8230
13078a33540J88395Q9965k5738j2954N0130L4927j6024N3621L1849k3889r0292
$$ plain form
13067 146450 -47660 -88614 -105655 -139311 -98369 4038 -11545 -48989 -50302 -64165 -36548
13056 -36548 10906 110908 146883 141373 112494 71679 201147 258299 225045 124557 -11122
13045 -11122 -28043 5412 102161 183706 256548 228182 296705 266131 219429 72589 52043
13034 52043 61828 18418 77773 86316 26394 -7927 -85682 -129574 18984 89141 38998 9614
13022 9614 -51257 -19491 12652 -41270 -98505 -106042 -78086 97242 155108 55124 -52610 -62347
13010 -62347 -70353 -62584 -68529 -6242 -22591 -30708 -16666 -4769 9607 48474 16023 -48673
12998 -48673 -33707 -127434 -114512 -44502 -101525 -115175 -171231 -141095 -95974 -24863 -10331 -42284
12986 -42284 -51103 56947 176292 222507 104348 -81914 -74341 -11991 132872 176557 154463
$$ packed form
13067A46450j94110m0954j7041l3656M0942J02407j5583l7444j313j3863K7617
13056c6548M7454J00002L5975n510k8879m0815J29468N7152l3254j00488j35679
13045a1122j6921L3455R6749Q1545P2842k8366O8523l0574m6702j46840k0546
13034E2043R785m3410N9355Q543n9922l4321p7755m3892J48558P0157n0143k9384
13022I614o0871L1766L2143n3922n7235p537K7956J75328N7866r9984j07734r737
13010f2347q006P769n945O2287j6349q117J4042J1897J4376L8867l2451o4696
12998d8673J4966r3727J2922P0010n7023j3650n6056L0136M5121P1111J4532l1953
12986d2284q819J08050J19345M6215j18159j86262P573O2350J44863M3685k2094
$$ plain form
12975 154463 75388 115071 115300 135999 36539 -2064 52648 45709 6734 13982 10090 -41938
12963 -41938 28619 24497 59895 134355 263080 299155 211118 176907 224376 176334 157067 137387
12951 137387 60495 45400 44303 146266 118337 51460 -48919 -52280 -27705 31195 67524
12940 67524 56328 -6115 7423 -5080 26858 -9887 -55272 -52121 -53704 -28679 7025 -83164
12928 -83164 -20216 18472 -25862 -17205 102212 105972 197291 161886 122817 51161 11906 16035
12916 16035 26008 25323 20378 840 98530 87890 91017 26078 14813 20323 37211 -77214 -38325
12903 -38325 69366 160369 181501 114984 45936 93121 31078 9096 51065 99557 76247
12892 76247 113483 94641 111110 109295 97883 38765 -4774 117309 82004 130988 223860 170855
$$ packed form
12975A54463p9075L9683K29K0699r9460l8603N4712o939l8975P248l892n2028
12963d1938P0557m122L5398P4460J28725L6075q8037l4211M7469m8042j9267j9680
12951A37387p6892j5095j097J01963k7929o6877j00379l361K4575N8900L6329
12940F7524j1196o2443J3538j2503L1938l6745m5385L151j583K5025L5704r0189
12928h3164O2948L8688m4334Q657J19417L760R1319l5405l9069p1656l9255M129
12916A6035R973o85m945j9538R7690j0640L127o4939j1265N510J6888j14425L8889
12903c8325J07691R1003K1132o6517o9048M7185o2043k1982M1969M8492k3310
12892G6247L7236j8842J6469j815j1412n9118m3539J22083l5305M8984R2872n3005
$$ plain form
12880 170855 121135 88074 123170 135528 84002 135051 120430 14425 -77041 -15667 63959
12869 63959 77936 108276 67754 81715 23155 13323 -11677 87614 201539 165451 202505 132626
12857 132626 38695 94651 135445 76935 210826 227975 107169 44663 13568 -49071 -54449
12846 -54449 -22294 -28869 19122 -2278 30025 84592 111743 56261 -15190 -3888 36464 118882
12834 118882 133768 138955 157592 244585 272907 93116 83833 142624 57752 -16434 -343 8875
12822 8875 28356 22509 58160 70316 18716 -98120 -57482 19416 136088 214395 179140 130938
12810 130938 75422 118127 177614 212787 165087 248457 258337 281447 215430 88147 -17713
12799 -17713 508 103161 109487 167863 185923 211214 222640 166651 149678 125773 55331 94355
$$ packed form
12880A70855m9720l3061L5096J2358n1526N1049j4621j06005r1466O1374P9626
12869F3959J3977L0340m0522J3961n8560r832k5000R9291J13925l6088L7054o9879
12857A32626r3931N5956M0794n8510J33891J7149j20806o2506l1095o2639n378
12846e4449L2155o575M7991k1400L2303N4567K7151n5482p1451J1302M0352Q2418
12834A18882J4886N187J8637Q6993K8322j79791r283N8791q4872p4186J6091R218
12822H875J9481n847L5651J2156n1600j16836M0638P6898J16672P8307l5255m8202
12810A30938n5516M2705N9487L5173m7700Q3370R880K3110o6017j27283j05860
12799a7713J8221J02653O326N8376J8060K5291J1426n5989j6973k3905p0442L9024
$$ plain form
12787 94355 114441 78674 91016 83090 83082 87549 108427 82058 38892 71320 165731 207485 221768
12774 221768 216298 102732 108952 109525 141507 137970 132950 168111 164274 145190 146336 102486 145171
12761 145171 156976 30083 28800 108580 147687 200208 225899 107909 90408 128478 144256
12750 144256 198756 205142 111686 35451 28345 70828 74987 98404 65892 122619 279109 303768
12738 303768 286166 258691 267248 260989 194810 79369 148103 143128 165424 163081 193962 105834
12726 105834 144833 188591 211878 163883 87330 9246 95925 80982 116801 156510 139891
12715 139891 168128 154851 197935 225725 152847 121240 205545 261023 281994 224457 199620
12704 199620 161479 120934 119524 101475 48547 -5353 22080 93060 111837 129338 258456
$$ packed form
12787I4355K0086l5767J2342p926qM467K0878k6369m3166L2428R4411M1754J4283
12774B21768n470j13566O220N73L1982l537n020L5161l837j9084J146m3850M2685
12761A45171J1805j26893j283P9780L9107N2521K5691j17990j7501L8070J5778
12750A44256N4500O386r3456p6235p106M2483M159K3417l2512N6727J56490K4659
12738C03768j7602k7475Q557o259o6179j15441O8734m975K2296k343L0881q8128
12726A05834L8999M3758K3287m7995p6553p8084Q6679j4943L5819L9709j6619
12715A39891K8237j3277M3084K7790p2878l1607Q4305N5478K0971n7537k4837
12704A99620l8141m0545j410j8049n2928n3900K7433P0980J8777J7501J29118
$$ plain form
12693 258456 225148 281647 231525 226671 363084 376313 377053 350851 320103 318470 203444 223056
12681 223056 217555 154040 134928 281482 394944 356475 294611 257391 310344 361456 402044
12670 402044 366230 325512 236903 141923 133389 197337 222569 231291 191736 209983 200424 143758
12658 143758 243846 353899 270036 156718 216564 248343 317186 269650 243258 234314 252639
12647 252639 355998 392422 406384 351311 256593 139434 190939 233829 170752 161341 175681
12636 175681 197549 237314 182554 157761 115214 212958 338437 303806 255827 235637 385165
12625 385165 406927 286625 227154 321683 315703 258282 247260 213751 233965 186635 243893
12614 243893 238207 136042 29754 147860 307110 381094 437804 402444 461663 502801 571773
$$ packed form
12693B58456l3308N6499n0122m854J36413J3229P40k6202l0748j633j15026J9612
12681B23056n501o3515j9112J46554J13462l8469o1864l7220N2953N1112M0588
12670D02044l5814m0718q8609r4980q534O3948K5232Q722l9555J8247r559n6666
12658A43758J00088J10053q3863j13318N9846L1779O8843m7536k6392q944J8325
12647B52639J03359L6424J3962n5073r4718j17159N1505M2890o3077r411J4340
12636A75681K1868L9765n4760k4793m2547R7744J25479l4631m7979k0190J49528
12625C85165K1762j20302n9471R4529n980n7421j1022l3509K0214m7330N7258
12614B43893n686j02165j06288J18106J59250P3984N6710l5360N9219M1138O8972
$$ plain form
12603 571773 565313 517027 476743 419492 254705 229932 222994 307492 309633 329877 339717 290213
12591 290213 178233 169279 268256 373201 393049 362517 346271 384442 396866 351899 446643
12580 446643 643663 668210 607984 606693 571566 535436 499139 468000 449873 423298 471168
12569 471168 522915 502705 508778 572698 515278 527396 469410 502528 625431 714550 643777
12558 643777 607668 555197 528336 561489 552165 539695 665135 727187 643404 640533 647626 677161
12546 677161 744608 778241 759742 741584 691413 671183 676567 653330 641709 698901 750874 796184
12534 796184 840544 840613 774606 742736 773215 807594 754277 721304 793757 761100 691034 674536
12522 674536 797341 830891 885971 871971 747513 651792 757143 859749 840880 891079 1040163
$$ packed form
12603E71773o460m8286m0284n7251j64787k4773o938Q4498K141K0244R840m9504
12591B90213j11980q954R8977J04945J9848l0532j6246L8171J2424m4967R4744
12580D46643J97020K4547o0226j291l5127l6130l6297l1139j8127k6575M7870
12569D71168N1747k0210O073O3920n7420J2118n7986L3118J22903Q9119p0773
12558F43777l6109n2471k6861L3153r324j2470J25440O2052q3783k871P093K9535
12546F77161O7447L3633j8499j8158n0171k0230N384k3237j1621N7192N1973M5310
12534G96184M4360O9o6007l1870L0479L4379n3317l2973P2453l2657p0066j6498
12522F74536J22805L3550N5080j4000j24458r5721J05351J02606j8869N0199J49084
$$ plain form
12511 1040163 1174332 1225597 1086637 945904 941191 925939 963458 1047399 1076315 1120403 1154366
12500 1154366 1122430 1049167 1069842 1023705 1114961 1231445 1173208 1224964 1254700 1351449 1360748
12489 1360748 1324742 1288043 1223192 1123487 1072917 1142607 1267690 1236822 1239607 1344807 1341372
12478 1341372 1253526 1320762 1404995 1494295 1568218 1632292 1661364 1485299 1491868 1544239 1554975
12467 1554975 1623272 1700677 1762035 1710452 1691017 1638482 1661423 1712117 1873685 1900346 1941399
12456 1941399 1944736 1951125 1962081 1859787 1809956 1900487 2016193 2002909 2119389 2149047 2119601
12445 2119601 2136144 2236913 2241464 2244693 2294691 2381016 2472498 2504101 2415156 2466962 2576985
12434 2576985 2601123 2728142 2773766 2738653 2782110 2887004 2982431 3082695 3106863 3113524 3175447
$$ packed form
12511A040163J34169N1265j38960j40733m713j5252L7519Q3941K8916M4088L3963
12500A154366l1936p3263K0675m6137R1256J16484n8237N1756K9736R6749R299
12489A360748l6006l6699o4851r9705n0570O9690J25083l0868K785J05200l435
12478A341372q7846O7236Q4233Q9300P3923O4074K9072j76065O569N2371J0736
12467A554975O8297P7405O1358n1583j9435n2535K2941N0694J61568K6661M1053
12456A941399L337O389J0956j02294m9831R0531J15706j3284J16480K9658k9446
12445B119601J6543J00769M551L229M9998Q6325R1482L1603q8945N1806J10023
12434B576985K4138J27019M5624l5113M3457J04894R5427J00264K4168O661O1923
$$ plain form
12423 3175447 3226780 3261315 3384796 3513134 3516949 3662746 3724566 3719043 3789604 3924111 4031338
12412 4031338 3964944 3933780 4058007 4162852 4254004 4339762 4434318 4656918 4806498 4902267
12402 4902267 4978501 5155628 5228226 5229324 5281823 5432757 5570608 5751543 5955682 6152586
12392 6152586 6238282 6327764 6554950 6749684 6912543 7101210 7269733 7445779 7629877 7812895
12382 7812895 8023757 8350119 8678545 8895862 9169299 9355089 9555991 9763841 10046961
12373 10046961 10257380 10516575 10847236 11206071 11569364 11976290 12296052 12609414 12987107
12364 12987107 13419166 14008406 14535762 15069065 15615260 16082793 16564702 16967924 17391448
12355 17391448 18015747 18758240 19457549 20077807 20613700 21126814 21834767 22673316 23466398
$$ packed form
12423C175447N1333L4535J23481J28338L815J45797O1820n523P0561J34507J07227
12412D031338o6394l1164J24227J04845R1152Q5758R4556K22600J49580R5769
12402D902267P6234J77127P2598J098N2499J50934J37851J80935K04139J96904
12392F152586Q5696Q9482K27186J94734J62859J88667J68523J76046J84098J83018
12382G812895K10862L26362L28426K17317K73437J85790K00902K07850K83120
12373A0046961K10419K59195L30661L58835L63293M06926L19762L13362L77693
12364A2987107M32059N89240N27356N33303N46195M67533M81909M03222M23524
12355A7391448O24299P42493O99309O20258N35893N13114P07953Q38549P93082
$$ plain form
12346 23466398 24195071 24929554 25648508 26214423 26958668 27696354 28437469 29179253 29908403
12337 29908403 30599185 31281497 31955356 32608393 33142701 33690816 34284402 34887548 35331466
12328 35331466 35741796 36148620 36512585 36773920 36881378 37002174 37065277 36904098 36705909
12319 36705909 36652341 36512674 36094046 35603148 35238609 34945259 34522025 34153139 33646764
12310 33646764 33113652 32507449 31986605 31464162 30891314 30354587 29810808 29195428 28613619
12301 28613619 28092150 27570280 26952619 26406266 25805567 25144174 24644787 24084054 23537456
12292 23537456 23033421 22482394 21953169 21493989 21086149 20612373 20167016 19767890 19347742
12283 19347742 18919836 18585353 18218438 17806215 17461432 17170906 16862676 16455644 16089596
$$ packed form
12346B3466398P28673P34483P18954N65915P44245P37686P41115P41784P29150
12337B9908403O90782O82312O73859O53037N34308N48115N93586O03146M43918
12328C5331466M10330M06824L63965K61335J07458J20796O3103j61179j98189
12319C6705909n3568j39667m18628m90898l64539k93350m23234l68886n06375
12310C3646764n33112o06203n20844n22443n72848n36727n43779o15380n81809
12301B8613619n21469n21870o17661n46353o00699o61393m99387n60733n46598
12292B3537456n04035n51027n29225m59180m07840m73776m45357l99126m20148
12283A9347742m27906l34483l66915m12223l44783k90526l08230m07032l66048
$$ plain form
12274 16089596 15681286 15262399 14943788 14696931 14431867 14068758 13743786 13564097 13356754
12265 13356754 13104069 12826964 12577974 12393641 12108011 11938765 11801383 11642144 11408024
12256 11408024 11148285 10905802 10759748 10603847 10489201 10300278 10085967 9892284 9708159
12247 9708159 9428748 9174414 9009413 8911794 8787122 8748276 8573552 8363448 8267178 8193110
12237 8193110 8037192 7908457 7760526 7625081 7392994 7243782 7143814 6970446 6865845 6775140
12227 6775140 6556593 6481791 6477577 6361683 6216010 6082999 5994921 5912784 5965946 5907639 5796017
12216 5796017 5706381 5613494 5458251 5356296 5323882 5314227 5239432 5147397 5078242 5071293 4937098
12205 4937098 4751407 4668789 4717246 4689822 4611890 4590620 4513989 4490561 4437935 4406032 4357545
$$ packed form
12274A6089596m08310m18887l18611k46857k65064l63109l24972j79689k07343
12265A3356754k52685k77105k48990j84333k85630j69246j37382j59239k34120
12256A1408024k59739k42483j46054j55901j14646j88923k14311j93683j84125
12247I708159k79411k54334j65001r7619j24672l8846j74724k10104r6270p4068
12237H193110j55918j28735j47931j35445k32087j49212r9968j73368j04601r0705
12227F775140k18547p4802m214j15894j45673j33011q8078q2137N3162n8307j11622
12216E796017q9636r2887j55243j01955l2414r655p4795r2035o9155o949j34195
12205D937098j85691q2618M8457k7424p7932k1270p6631k3428n2626l1903m8487
$$ plain form
12194 4357545 4189488 4152540 4182823 4131005 4099981 4044756 3923387 3806481 3691072 3573461
12184 3573461 3473124 3532132 3620107 3644924 3635124 3547188 3442188 3352043 3291331 3171833 3051282
12173 3051282 2994085 2951498 2872402 2862632 2939968 3011553 2945922 2916795 3001191 2918865 2732832
12162 2732832 2660224 2587076 2507707 2514397 2615582 2670719 2612452 2501964 2402968 2461998 2538389
12151 2538389 2491603 2298895 2351913 2455032 2384351 2364472 2386250 2266793 2288945 2234871 2301930
12140 2301930 2358795 2221446 2205393 2363749 2438044 2417529 2336414 2344654 2481685 2549675 2635006
12129 2635006 2752596 2733559 2667264 2531854 2438371 2421935 2420719 2317906 2212972 2048962
12119 2048962 1937006 1962369 1811172 1797528 1788516 1753378 1674114 1564201 1500519 1543385 1535365
$$ packed form
12194D357545j68057l6948L0283n1818l1024n5225j21369j16906j15409j17611
12184C573461j00337N9008Q7975K4817r800q7936j05000r0145o0712j19498j20551
12173C051282n7197m2587p9096r770P7336P1585o5631k9127Q4396q2326j86033
12162B732832p2608p3148p9369O690J01185N5137n8267j10488r8996N9030P6391
12151B538389m6786j92708N3018J03119p0681j9879K1778j19457K2152n4074O7059
12140B301930N6865j37349j6053J58356P4295k0515q1115Q240J37031O7990Q5331
12129B635006J17590j9037o6295j35410r3483j6436j216j02813j04934j64010
12119B048962j11956K5363j51197j3644r012l5138p9264j09913o3682M2866q020
$$ plain form
12108 1535365 1592610 1730124 1770617 1710737 1563658 1452646 1429833 1524388 1550343 1578347 1531781
12097 1531781 1442004 1371148 1403321 1400527 1457057 1389508 1362328 1316938 1262541 1227270 1311235
12086 1311235 1298591 1307904 1344787 1219964 1227153 1239986 1287666 1219129 1158673 1184904 1172622
12075 1172622 1187379 1127898 1138109 1134167 961741 936892 1073877 1173240 1071785 923809 797245
12064 797245 837781 1072187 1032289 912796 822143 960099 1030502 993825 1078116 1027094 833811
12053 833811 832095 860440 808224 803174 895180 910171 992914 1003490 880303 882650 818384 752149
12041 752149 726881 739910 838702 863075 841594 764804 683395 749802 703415 755374 812644
12030 812644 900095 916508 992688 995016 932755 942932 911609 851716 717063 639981 644609 715154
$$ packed form
12108A535365N7245J37514M0493n9880j47079j11012k2813R4555K5955K8004m6566
12097A531781q9777p0856L2173k794N6530o7549k7180m5390n4397l5271Q3965
12086A311235j2644R313L6883j24823P189J2833M7680o8537o0456K6231j2282
12075A172622J4757n9481J0211l942j72426k4849J36985R9363j01455j47976j26564
12064G97245M0536K34406l9898j19493r0653J37956P0403l6677Q4291n1022j93283
12053H33811j716K8345n2216n050R2006J4991Q2743J0576j23187K347o4266o6235
12041G52149k5268J3029R8792K4373k1481p6790q1409O6407m6387N1959N7270
12030H12644Q7451J6413P6180K328o2261J0177l1323n9893j34653p7082M628P0545
$$ plain form
12018 715154 775274 779266 767663 659208 609332 608518 636374 641819 630168 528978 390060 450113
12006 450113 559287 683616 742816 754679 792092 767021 623439 446819 366985 372622 438654
11995 438654 469636 460258 476281 512919 619573 629413 531866 486716 488059 514582 559778 523383
11983 523383 449728 497513 532283 504240 425367 427315 376469 338263 416042 467335 583570
11972 583570 567454 441912 507355 536632 628642 642938 525666 422620 448067 471915 604216
11961 604216 626981 528945 398689 386297 479348 462355 421802 317192 334523 295379 272544
11950 272544 357928 386513 399440 415072 430152 422510 357340 331333 420032 366260 364703 315681
11938 315681 251634 248918 270301 323632 298754 304676 329060 373659 310610 194454 212504 271085
$$ packed form
12018G15154O0120L992j1603j08455m9876q14K7856N445j1651j01190j38918O0053
12006D50113J09174J24329N9200J1863L7413k5071j43582j76620p9834N637O6032
11995D38654L0982r378J6023L6638J06654R840r7547m5150J343K6523M5196l6395
11983E23383p3655M7785L4770k8043p8873J948n0846l8206P7779N1293J16235
11972E83570j6116j25542O5443K9277R2010J4296j17272j03046K5447K3848J32301
11961F04216K2765r8036j30256j2392R3051j6993m0553j04610J7331l9144k2835
11950B72544Q5384K8585J2927J5632J5080p642o5170k6007Q8699n3772j557m9022
11938C15681o4047k716K1383N3331k4878N922K4384M4599o3049j16156J8050N8581
$$ plain form
11926 271085 407014 355366 364504 356515 364645 354678 247953 254563 287416 363847 343293 293423
11914 293423 313206 368682 282458 221087 214542 289967 406758 524845 410725 260494 131856
11903 131856 93613 149733 251992 249221 250733 286325 404954 407122 483320 529048 482788 453179
11891 453179 428938 405128 402903 266999 298866 340161 309834 225194 178601 259276 386378
11880 386378 346087 214108 107056 99460 188388 194686 166784 181486 183105 230235 314394 352806
11868 352806 301810 131815 178069 219609 235244 133055 101176 112770 205219 334553 410452
11857 410452 384388 306312 269749 258240 178957 104041 151311 209351 88078 22696 141522
11846 141522 189307 173226 238559 251478 316619 342575 251288 141441 65666 51555 144525
$$ packed form
11926B71085J35929n1648R138p989Q130r967j06725O610L2853P6431k0554m9870
11914B93423J9783N5476q6224o1371o545P5425J16791J18087j14120j50231j28638
11903A31856l8243N6120J02259k771J512L5592J18629K168P6198M5728m6260k9609
11891D53179k4241k3810k225j35904L1867M1295l0327q4640m6593Q0675J27102
11880C86378m0291j31979j07052p596Q8928O298k7902J4702J619M7130Q4159L8412
11868C52806n0996j69995M6254M1540J5635j02189l1879J1594R2449J29334P5899
11857D10452k6064p8076l6563j1509p9283p4916M7270N8040j21273o5382J18826
11846A41522M7785j6081O5333J2919O5141K5956r1287j09847p5775j4111R2970
$$ plain form
11835 144525 158616 194231 143910 160229 117508 36512 93150 191934 155513 78146 84723 103280
11823 103280 144458 94694 39528 -29391 -23878 27394 80302 164244 222073 149881 141312 174914
11811 174914 146920 150442 145012 81878 44930 84344 75851 134334 229919 119353 108473 85389
11799 85389 76804 95292 163525 239055 171144 153190 312198 353924 306241 241350 106030
11788 106030 77896 112280 86674 16560 21715 82916 -654 -101292 -65283 20964 90851
11777 90851 154010 113556 131649 193130 132926 96792 56568 131697 80742 68147 136390 126006
11765 126006 149636 109534 43080 74063 16198 29363 58024 207117 272925 190818 63802
11754 63802 78536 140137 117837 121322 160386 293965 291006 219430 253247 161183 71072 7651
$$ packed form
11835A44525J4091L5615n0321J6319m2721q0996N6638R8784l6421p7367O577J8557
11823A03280M1178m9764n5166o8919N513N1272N2908Q3942N7829p2192q569L3602
11811A74914k7994L522n430o3134l6948L9414q493N8483R5585j10566j0880k3084
11799H5389q585J8488O8233P5530o7911j7954J59008M1726m7683o4891j35320
11788A06030k8134L4384k5606p0114N155O1201q3570j00638L6009Q6247O9887
11777I0851O3159m0454J8093O1481o0204l6134m0224P5129n0955j2595O8243j0384
11765A26006K3630m0102o6454L0983n7865J3165K8661J49093O5808q2107j27016
11754F3802J4734O1601k2300L485L9064J33579k959p1576L3817r2064r0111o3421
$$ plain form
11742 7651 165603 178973 107403 47090 77535 190704 215043 152756 74780 46838 73871
11731 73871 186689 242228 117057 118396 177057 198587 210872 255326 316536 171723 63177
11720 63177 36593 42478 77893 104933 93893 78798 120085 79392 33967 17540 13128 120962
11708 120962 76670 -23360 61402 32359 39980 54601 42594 44105 93597 164356 163452 140095
11696 140095 80493 23798 -45273 60608 158547 175031 126698 77849 4431 -36584 68085
11685 68085 169370 188531 211141 159234 48395 -4906 26237 245459 325208 185111 62397
11674 62397 144286 147577 140101 150175 52001 -17064 -97189 -29528 53564 122834 75349 47840
11662 47840 129193 94781 115658 151820 131863 110321 86009 113459 84707 13851 -52116 -37067
$$ packed form
11742G651J57952J3370p1570o0313L0445J13169K4339o2287p7976k7942K7033
11731G3871J12818N5539j25171J339N8661K1530J2285M4454O1210j44813j08546
11720F3177k6584N885L5415K7040j1040j5095M1287m0693m5425j6427m412J07834
11708A20962m4292j00030Q4762k9043P621J4621j2007J511M9492P0759r04k3357
11696A40095n9602n6695o9071J05881R7939J6484m8333m8849p3418m1015J04669
11685F8085J01285J9161K2610n1907j10839n3301L1143K19222P9749j40097j22714
11674F2397Q1889L291p476J0074r8174o9065q0125O7661Q3092O9270m7485k7509
11662D7840Q1353l4412K0877L6162j9957k1542k4312K7450k8752p0856o5967J5049
$$ plain form
11650 -37067 5602 5255 46805 70425 108862 -28503 -109840 -62901 -5447 54786 150594 132351
11638 132351 122412 -59571 -78599 21454 113075 94643 7658 30467 -5789 -144656 -170539
11627 -170539 -80324 22582 9278 -40865 -21515 3955 33746 38623 12306 -17157 -102571
11616 -102571 -75030 -12069 132074 52645 24102 -99186 -71244 -47518 -97566 10105 95984
11605 95984 137684 190564 107764 122924 122184 153397 124812 112057 72382 55162 118699 237757
11593 237757 186570 106887 56591 71842 57837 -31276 10168 -35447 -125509 -24938 34235
11582 34235 -24179 -42267 -18768 -9604 11660 94252 211130 202005 171520 130209 76843 6503
11570 6503 -37553 37026 89727 69448 19912 10299 106919 160243 -4313 -88231 -47958 6322
$$ packed form
11650c7067M2669l47M1550K3620L8437j37365q1337M6939N7454O0233R5808j8243
11638A32351r939j81983j9028J00053R1621j8432q6985K2809l6256j38867k5883
11627a70539R0215J02906j3304n0143J9350K5470K9791M877k6317k9463q5414
11616a02571K7541O2961J44143p9429k8543j23288K7942K3726n0048J07671Q5879
11605I5984M1700N2880q2800J5160p40L1213k8585j2755l9675j7220O3537J19058
11593B37757n1187p9683n0296J5251j4005q9113M1444m5615r0062J00571N9173
11582C4235n8414j8088K3499R164K1264Q2592J16878r125l0485m1311n3366p0340
11570F503m4056P4579N2701k0279m9536r613R6620N3324j64556q3918M0273N4280
$$ plain form
11558 6322 50567 86744 75672 -2972 -15059 30293 46854 85421 -7476 -2731 -21262 -25462
11546 -25462 -57190 20606 34796 46597 65331 108569 133025 116414 111363 88701 83701 6555
11534 6555 -5465 -14727 -39116 -20578 42239 -90502 -54953 75414 15609 -3890 -56613 -114921
11522 -114921 -90497 -163860 -103503 -28526 2313 35138 55755 61488 86225 83217 178341 208140
11510 208140 93319 141690 206871 134437 86510 116863 67284 4211 -75138 -48694 3825
11499 3825 53187 120662 119944 84681 56069 132963 167133 143775 44770 -114300 -81819 -59391
11487 -59391 -109481 -60448 -144297 -153509 -147736 -126569 -78597 -11567 -34294 -11980 -70216 -129483
11475 -129483 -101728 -69399 -57779 3903 81149 81692 26619 39479 147114 106668 -1482
$$ packed form
11558F322M4245L6177j1072p8644j2087M5352J6561L8567r2897M745j8531m200
11546b5462l1728P7796J4190J1801J8734M3238K4456j6611n051k2662n000p7146
11534F555j2020r262k4389J8538O2817j32741L5549J30367n9805j9499n2723n8308
11522a14921K4424p3363O0357P4977L0839L2825K0617N733K4737l008R5124K9799
11510B08140j14821M8371O5181p2434m7927L0353m9579o3073p9349K6444N2519
11499C825M9362O7475p18l5263k8612P6894L4170k3358r9005j59070L2481K2428
11487e9391n0090M9033q3849r212N773K1167M7972O7030k2727K2314n8236n9267
11475a29483K7755L2329J1620O1682P7246N43n5073J2860J07635m0446j08150
$$ plain form
11464 -1482 62142 43688 -19845 9840 77865 110270 107899 123155 205265 205009 180768 182641 233477
11451 233477 131250 -57026 -144206 -1935 153706 174800 144972 11368 -32322 48517
11441 48517 -2246 11887 66047 100370 29163 98108 75657 -11971 67447 104124 137551 90154
11429 90154 71433 108856 102762 28231 -63339 -156728 -88295 -932 100212 247439 117090
11418 117090 114955 93071 -8518 -13841 -62248 -130598 -52189 -135329 -99815 -21258 39534 16590
11406 16590 8395 41035 -5199 -67560 -204008 -174021 -137351 -174784 -112107 -72002 20001 122707
11394 122707 180707 183671 63251 -24707 -16233 -16194 53589 103060 23669 -37614 -79199 -27966
11382 -27966 -67457 -222302 -312754 -245432 -166111 -236297 -310152 -196607 -126003 -220395 -139386
$$ packed form
11464a482O3624j8454o3533K9685O8025L2405k371J5256Q2110k56k4241J873N0836
11451B33477j02227j88276q7180J42271J55641K1094k9828j33604m3690Q0839
11441D8517n0763J4133N4160L4323p1207O8945k2451q7628P9418L6677L3427m7397
11429I0154j8721L7423o094p4531r1570r3389O8433Q7363J01144J47227j30349
11418A17090k135k1884j01589n323m8407o8350P8409q3140L5514P8557O0792k2944
11406A6590q195L2640m6234o2361j36448K9987L6670l7433O2677M0105R2003J02706
11394A22707N8000K964j20420q7958Q474L9O9783M9471p9391o1283m1585N1233
11382b7966l9491j54845r0452O7322P9321p0186p3855J13545P0604r4392Q1009
$$ plain form
11371 -139386 -88995 22896 64536 -21833 49550 -2506 -58087 -28886 84430 230981 299222
11360 299222 165850 21717 -5582 15700 34882 72539 27487 85952 117789 70099 38450
11349 38450 48635 219379 194255 233783 183298 30261 -128403 -104314 26698 107166 94775
11338 94775 41361 108130 77934 61333 131523 24017 122858 53123 79682 -100 -45559
11327 -45559 -42559 20969 13080 -96131 -76442 -138114 -114612 -32529 12070 93614 12816 100630
11315 100630 170778 150948 198603 160902 133814 40575 -79780 -65906 10452 37394 -67459
11304 -67459 -214033 -252807 -137936 -55881 -126605 -94523 -21354 -115680 -57896 42078 37235
11293 37235 -130926 -208901 -205949 -162638 -154364 -155833 -10981 101542 101805 -48536 -74224 -111109
$$ packed form
11371a39386N0391J11891M1640q6369P1383n2056n5581K9201J13316J46551O8241
11360B99222j33372j44133k7299K1282J9182L7657m5052N8465L1837m7690l1649
11349C8450J0185J70744k5124L9528n0485j53037j58664K4089J31012Q0468j2391
11338I4775n3414O6769l0196j6601P0190j07506R8841o9735K6559p9782m5459
11327d5559L000O3528p889j09211J9689o1672K3502Q2083M4599Q1544q0798Q7814
11315A00630P0148j9830M7655l7701k7088r3239j20355J3874P6358K6942j04853
11304f7459j46574l8774J14871Q2055p0724L2082P3169r4326N7784R9974m843
11293C7235j68161p7975K952M3311Q274j469J44852J12523K63j50341k5688l6885
$$ plain form
11281 -111109 -87496 -33970 -45406 -50107 -135149 -248354 -308104 -327155 -294990 -339627 -205895
11270 -205895 -30638 25252 -6333 -30027 -69788 -36520 -83846 -36860 85331 75273 -34175
11259 -34175 -103827 -120509 -128245 -128776 -176892 -111350 -90197 -106793 -96164 -211576 -196053 -190545
11247 -190545 -300097 -253791 -263452 -210607 -164882 -29034 85641 64575 -29877 -52994 -85808
11236 -85808 -64418 -11472 21418 47653 24374 47184 68686 -13859 -10211 63275 169216 259547
11224 259547 89703 -124853 -107572 7414 -27628 -40569 -33052 -63911 -125894 -14903 -8681
11213 -8681 -158729 -238535 -184334 -35031 37731 106748 55670 -35957 -78276 -45647 -39559 -27788
11201 -27788 47465 -58674 -96208 -114118 -132078 -158766 -125494 -61050 30062 -78240 -65952
$$ packed form
11281a11109K3613N3526j1436m701q5042j13205n9750j9051L2165m4637J33732
11270b05895J75257N5890l1585k3694l9761L3268m7326M6986J22191j0058j09448
11259c4175o9652j6682p736n31m8116O5542K1153j6596J0629j15412J5523N508
11247a90545j09552M6306r661N2845M5725J35848J14675k1066r4452k3117l2814
11236h5808K1390N2946L2890K6235k3279K2810K1502q2545L648P3486J05941R0331
11224B59547j69844k14556J7281J14986l5042j2941P517l0859o1983J10991O222
11213h681j50048p9806N4201J49303P2762O9017n1078r1627m2319L2629O088J1771
11201b7788P5253j06139l7534j7910j7960k6688L3272O4444R1112j08302J2288
$$ plain form
11190 -65952 -58230 -49588 14 100176 60345 42602 20176 28796 31088 74451 130025 216397
11178 216397 126235 89482 89053 74277 70081 50761 -3783 -55057 -194866 -280561 -264415 -150057
11166 -150057 -236869 -302107 -384443 -331054 -308553 -134206 -98521 -192591 -210884 -263495 -263788 -189547
11154 -189547 -110799 -171542 -138194 -112551 -119804 -47084 -40165 -81115 -119415 -152388 -135813 -60369
11142 -60369 -232115 -334215 -306184 -246454 -250500 -220191 -132728 -68267 -25969 -35777 -1120 -11503
11130 -11503 -172930 -250951 -154632 -115325 -79937 -171071 -252034 -195945 -67352 -120658 -143473
11119 -143473 -121240 -34266 86477 65886 -36490 -100412 -75967 -98659 -44758 -58996 19369
11108 19369 98996 -5391 -49603 -102984 -124628 -67307 -51261 -27669 7062 4818 -30499 -65955
$$ packed form
11190f5952P722Q642M9602J00162l9831j7743k2426Q620K292M3363N5574Q6372
11178B16397r0162l6753m29j4776m196j9320n4544n1274j39809q5695J6146J14358
11166a50057q6812o5238q2336N3389K2501J74347L5685r4070j8293n2611k93P4241
11154a89547P8748o0743L3348K5643p253P2720O919m0950l8300l2973J6575P5444
11142f0369j71746j02100K8031N9730m046L0309Q7463O4461M2298r808L4657j0383
11130a1503j61427p8021R6319L9307L5388r1134q0963N6089J28593n3306k2815
11119a43473K2233Q6974J20743k0591j02376o3922K4445k2692N3901j4238P8365
11108A9369P9627j04387m4212n3381k1644N7321J6046K3592L4731k244l5317l5456
$$ plain form
11096 -65955 -106238 -114361 -88898 -57348 4693 -40955 -144980 -187278 -84919 -33434 71480
11085 71480 44960 105982 113826 126839 62043 84288 164501 173369 185656 183157 139454 65172
11073 65172 97357 157389 256945 264156 250457 216491 262830 297355 418509 594762 668741
11062 668741 742835 991597 1310344 1551773 1899675 2341468 2632612 2545710 2190809 1760423
11052 1760423 1437342 1187513 977795 756745 642716 625770 585583 479796 382801 319702
11042 319702 244406 272039 290111 274024 274690 266136 227117 263739 307626 311412 284921 299768
11030 299768 226884 259757 222689 177203 103911 131706 215580 249138 142520 149273 154956 162708
11018 162708 132836 221695 280346 190474 39122 -9673 44821 130421 129356 40229 27982
$$ packed form
11096f5955m0283q123K5463L1550O2041m5648j04025m2298J02359N1485J04914
11085G1480k6520O1022P844J3013o4796K2245Q0213Q868J2287k499m3703p4282
11073F5172L2185O0032R9556P211j3699l3966M6339L4525J21154J76253P3979
11062F68741P4094K48762L18747K41429L47902M41793K91144q6902l54901m30386
11052A760423l23081k49829k09718k21050j14029j6946m0187j05787r6995o3099
11042C19702p5296K7633J8072j6087O66q554l9019L6622M3887L786k6491J4847
11030B99768p2884L2873l7068m5486p3292K7795Q3874L3558j06618O753N683P752
11018A62708k9872Q8859N8651q9872j51352m8795N4494Q5600j065q9127j2247
$$ plain form
11007 27982 68100 135375 193801 168294 86724 25460 2105 56876 114773 -713 -75994
10996 -75994 -31964 -19128 -41615 43282 171609 197743 187733 91227 161297 108849 96366
10985 96366 -18463 -44240 18772 2394 69239 134338 103621 62919 107242 89160 31421
10974 31421 22434 42733 -29035 16674 -34931 -174244 -228925 -136386 8939 40568 5958
10963 5958 2238 -22484 -29643 -41397 -70367 -38291 21456 124211 110121 19020 37653 242249
10951 242249 259007 205095 111700 -62541 -176812 -191741 -65826 108123 114732 17629 51274
10940 51274 61392 -28399 -76977 -70255 -114021 -66005 -39477 -95505 -77288 -70016 -21914 -95056
10928 -95056 -123649 -124873 -32428 56341 -3667 57614 204521 127604 -23508 -145497 -158114
$$ packed form
11007B7982M0118O7275N8426k5507q1570o1264k3355N4771N7897j15486p5281
10996g5994M4030J2836k2487Q4897J28327K6134j0010r6506P0070n2448j2483
10985I6366j14829k5777O3012j6378O6845O5099l0717m0702M4323j8082n7739
10974C1421q987K0299p1768M5709n1605j39313n4681R2539J45325L1629l4610
10963E958l720k4722p159j1754k8970L2076N9747J02755j4090r1101J8633K04596
10951B42249J6758n3912r3395j74241j14271j4929J25915J73949O609r7103L3645
10940E1274J0118q9791m8578O722m3766M8016K6528n6028J8217P272M8102p3142
10928i5056k8593j224R2445Q8769o0008O1281J46907p6917j51112j21989j2617
$$ plain form
10917 -158114 -166548 -114962 10302 4380 47538 80932 122691 135650 20648 -63696 -20305
10906 -20305 -41680 41783 143602 129052 233288 263360 321907 345038 448324 635418 827964
10895 827964 796566 675636 546890 533494 359318 179874 263175 235955 203925 122997 75915
10884 75915 91029 24279 75703 113646 194488 120550 83228 -39295 -102823 -173454 -256287
10873 -256287 -198366 -99397 -41296 -143 14121 -8517 -28273 -13269 -74521 -93597 51785
10862 51785 108044 43343 4221 -39776 -22174 82364 150016 40610 -104528 -154030 -104748
10851 -104748 -23678 -68920 -119181 -193778 -178310 -134414 -77573 -22680 -77686 -74246 -97837 -80462
10839 -80462 5787 47445 63740 3100 62312 60716 -96766 -144760 -87468 -112488 -99892 -45397
$$ packed form
10917a58114q434N1586J25264n922M3158L3394M1759J2959j15002q4344M3391
10906b0305k1375Q3463J01819j4550J04236L0072N8547K3131J03286J87094J92546
10895H27964l1398j20930j28746j3396j74176j79444Q3301k7220l2030q0928m7082
10884G5915J5114o6750N1424L7943Q0842p3938l7322j22523o3528p0631q2833
10873b56287N7921R8969N8101M1153J4264k2638j9756J5004o1252j9076J45382
10862E1785N6259o4701l9122m3997J7602J04538O7652j09406j45138m9502M9282
10851a04748Q1070m5242n0261p4597J5468M3896N6841N4893n5006L440k3591J7375
10839h0462Q6249M1658J6295o0640N9212j596j57482m7994N7292k5020J2596N4495
$$ plain form
10827 -45397 44731 83698 129705 230971 152970 72384 -79035 -56489 47093 147731 126837
10816 126837 125762 76399 37476 -15807 -47419 47950 -23528 -94289 -139989 -88636 16005
10805 16005 499 95718 75007 27799 48756 -126123 -197244 -227455 -288740 -281583 -266583 -315224
10793 -315224 -320140 -198773 -97670 -44047 46375 199438 150130 48658 -79678 31842
10783 31842 145047 111550 -100588 -185790 -162889 -106495 -60833 -632 110624 43011 -8209
10772 -8209 42250 -7640 -67934 -18532 78513 112845 -73023 -111379 -83828 -200346 -109534
10761 -109534 48830 6539 -49493 -106844 -80352 -83564 -106713 -6295 -4448 -39174 21163
10750 21163 -33931 -97063 16711 18945 14999 34637 -26450 -146898 -226514 -196562 -152294 -122412
$$ packed form
10827d5397R0128L8967M6007J01266p8001q0586j51419K2546J03582J00638k0894
10816A26837j075m9363l8923n3283l1612R5369p1478p0761m5700N1353J04641
10805A6005j5506R5219k0711m7208K0957j74879p1121l0211o1285P157J5000m8641
10793c15224m916J21367J01103N3623R0422J53063m9308j01472j28336J11520
10783C1842J13205l3497k12138q5202K2901N6394M5662O0201J11256o7613n1220
10772h209N0459m9890o0294M9402R7045L4332j85868l8356K7551j16518R0812
10761a09534J58364m2291n6032n7351K6492l212k3149J00418J847l4726O0337
10750B1163n5094o3132J13774K234l946J9638o1087j20448p9616K9952M4268K9882
$$ plain form
10738 -122412 -64297 -46104 -62858 25375 82251 14802 -42218 -77165 22424 -24956 -105347
10727 -105347 -83823 -147348 -207438 -191211 -131278 -123732 -106058 -52264 9712 108531 60565 29631
10715 29631 41743 -10885 -16703 63138 76266 37232 -58987 -135944 -154093 -85856 -28929 -62917
10703 -62917 -81592 -75734 -189201 -193487 -138098 -121886 -60528 -45434 -32728 15770 16903 -17301
10691 -17301 41959 142733 118915 102858 73186 -25270 -53792 61537 112852 15804 -87221
10680 -87221 -31148 65621 130479 85427 -5979 1543 37909 -49638 -57967 6890 -35213 -199354
10668 -199354 -284069 -282642 -224661 -88345 -29696 -8660 -4650 -104069 -138673 -93199 -12630 13391
10656 13391 -36338 -103444 -173766 -197015 -98122 -105097 -54248 -37163 -47818 -46722 -58724 -111337
$$ packed form
10738a22412N8115J8193j6754Q8233N6876o7449n7020l4947R9589m7380q0391
10727a05347K1524o3525o0090J6227N9933P546J7674N3794O1976R8819m7966l0934
10715B9631J2112n2628n818P9841J3128l9034r6219p6957j8149O8237N6927l3988
10703f2917j8675N858j13467m286N5389J6212O1358J5094J2706M8498J133l4204
10691a7301N9260J00774k3818j6057k9672r8456k8522J15329N1315r7048j03025
10680h7221N6073R6769O4858m5052r1406P522L6366q7547q329O4857m2103j64141
10668a99354q4715J427N7981J36316N8649K1036M010r9419l4604M5474Q0569K6021
10656A3391m9729o7106p0322k3249R8893o975N0849J7085j0655J096j2002n2613
$$ plain form
10644 -111337 -89097 2843 -77879 -63398 24039 100376 138792 94644 5541 -152321 -195469
10633 -195469 -215362 -132924 -174388 -41944 59691 19465 26959 5986 -2692 9643 4242 138379
10621 138379 189794 95926 -9578 -45733 -7193 -16118 -69595 -24279 -35942 -83523 -96834
10610 -96834 -50658 -23038 -69641 -196829 -112907 30267 88244 142519 26998 -32485 -81633
10599 -81633 -72396 -67199 -118938 -191830 -141548 -194292 -111937 -16884 53154 42114 34591 -14976
10587 -14976 107331 105393 109343 98756 -58811 -131856 -205799 -76922 -5194 124846 69782
10576 69782 47088 3027 -32863 -92764 -112499 -93668 -82724 -50482 -79226 -100450 -144650 -186914
10564 -186914 -177266 -166836 -86592 -93829 -56875 -142026 -154444 -142822 -120622 -159647 -12595 60486
$$ packed form
10644a11337K2240R1940q0722J4481Q7437P6337L8416m4148q9103j57862m3148
10633a95469j9893Q2438m1464J32444J01635m0226P494k0973q678J2335n401J34137
10621A38379N1415r3868j05504l6155L8540q925n3477M5316j1663m7581j3311
10610i6834M6176K7620m6603j27188Q3922J43174N7977N4275j15521n9483m9148
10599h1633R237N197n1739p2892N0282n2744Q2355R5053P0038j1040p523m9567
10587a4976J22307j938L950j0587j57567p3045p3943J28877P1728J30040n5064
10576F9782k2694m4061l5890n9901j9735J8831J0944L2242k8744k1224m4200m2264
10564a86914R648J0430Q0244p237L6954q5151j2418J1622K2200l9025J47052P3081
$$ plain form
10552 60486 89960 131903 8624 9787 2514 -4764 -63851 -64300 -137856 -215318 -172042 -143208
10540 -143208 -178815 -202508 -133562 -115763 -148014 -132337 -109555 -114492 -240093 -213679 -147343
10529 -147343 -51782 -48202 -101000 -99428 -230418 -276340 -99402 26205 9873 25313 18299
10518 18299 13324 -55002 -61177 -66245 -121586 -218183 -156152 -97730 3068 29323 43572 100289
10506 100289 138081 100608 67538 -31300 -32341 -7306 -16829 -75932 -114967 -85545 -54968 15666
10494 15666 103265 75141 105095 92435 192593 202081 107889 111825 249248 416443 481153
10483 481153 490297 514278 632332 830561 885904 923968 871348 869614 870001 856838 820163 732793
10471 732793 643820 465230 257148 292793 347284 334482 221719 46410 -94600 -40705
$$ packed form
10552F0486K9474M1943j23279J163p273p278n9087m49p3556p7462M3276K8834
10540a43208l5607k3693O8946J7799l2251J5677K2782m937j25601K6414O6336
10529a47343R5561L580n2798J572j30990m5922J76938J25607j6332J5440p014
10518A8299m975o8326o175n068n5341r6597O2031N8422J00798K6255J4249N6717
10506A00289L7792l7473l3070r8838j041K5035r523n9103l9035K9422L0577P0634
10494A5666Q7599k8124K9954j2660J00158R488r4192L936J37423J67195O4710
10483D81153R144K3981J18054J98229N5343L8064n2620j734L87j3163l6675q7370
10471G32793q8973j78590k08082L5645N4491j2802j12763j75309j41010N3895
$$ plain form
10461 -40705 -16370 58375 96624 96974 120389 15910 -97953 -196184 -97541 53670 -8369
10450 -8369 -56460 45551 79190 124938 25488 -152577 -180388 -49600 42433 96261 140017
10439 140017 71656 1758 82494 142157 60187 26426 -8566 111880 96788 -101557 -115618
10428 -115618 -7765 64768 71628 -4020 -54439 -101602 -120929 -153669 -102975 -12136 118047
10417 118047 75490 27461 63003 44038 106520 117152 155811 78518 141740 384389 504811
10406 504811 529315 753973 1012447 1215565 1345280 1490569 1645999 1609851 1467129 1356417
10396 1356417 1279433 1094125 926359 746628 553273 432123 445174 381551 257105 317189
10386 317189 309580 307781 282727 252572 249276 163262 139652 212199 162836 127417 2134 -4574
$$ packed form
10461d0705K4335P4745L8249L50K3415j04479j13863r8231R8643J51211o2039
10450h369m8091J02011L3639M5748r9450j78065k7811J30788R2033N3828M3756
10439A40017o8361o9898Q0736N9663q1970l3761l4992J20446j5092j98345j4061
10428a15618J07853P2533O860p5648n0419m7163j9327l2740N0694R0839J30183
10417A18047m2557m8029L5542j8965O2482J0632L8659p7293O3222K42649J20422
10406E04811K4504K24658K58474K03118J29715J45289J55430l6148j42722j10712
10396A356417p6984j85308j67766j79731j93355j21150J3051o3623j24446O0084
10386C17189p609j799k5054l0155l296q6014k3610P2547m9363l5419j25283o708
$$ plain form
10374 -4574 152643 123415 89669 50518 101380 89369 26158 -45285 -91391 60364 50465 -47950
10362 -47950 -45696 43685 82604 -23110 -127487 -86629 -66713 -152639 -84570 18848 -36206
10351 -36206 -73337 23056 88118 47439 23710 84178 63778 54909 -1773 -77432 -62912 12234
10339 12234 34555 -3218 85800 9255 -11479 -41933 30143 99822 111990 12053 29064 173101
10327 173101 139972 42216 -29841 -68086 -26843 -44705 39266 153235 170625 103703 27295
10316 27295 -22015 102528 210139 235786 255640 306216 265034 149580 138372 97527 22766
10305 22766 41480 187108 117656 121911 200385 176830 173969 177550 50622 55839 146811 99903
10293 99903 89537 78200 13599 -6568 79877 80136 74870 79961 40628 -49190 -112947 -99518
$$ packed form
10374d574J57217k9228l3746l9151N0862j2011o3211p1443m6106J51755r899r8415
10362d7950K254Q9381L8919j05714j04377M0858J9916q5926O8069J03418n5054
10351c6206l7131R6393O5062m0679k3729O0468k0400q869n6682p5659J4520P5146
10339A2234K2321l7773Q9018p6545k0734l0454P2076O9679J2168r9937J7011J44037
10327A73101l3129r7756p2057l8245M1243j7862Q3971J13969J7390o6922p6408
10316B7295m9310J24543J07611K5647J9854N0576m1182j15454j1208m0845p4761
10305B2766J8714J45628o9452M255P8474k3555k861L581j26928N217R0972m6908
10293I9903j0366j1337o4601k0167Q6445K59n266N091l9333q9818o3757J3429
$$ plain form
10281 -99518 -19915 -12378 13919 29051 76676 10908 -3972 -124020 -151528 -298244 -309772
10270 -309772 -241096 -191048 -285417 -206033 -163372 -87237 -4881 -74275 -121256 28601 118719
10259 118719 222218 360310 363899 319802 289954 281026 255967 238669 212421 165192 162070 163699
10247 163699 191661 45013 -46014 36986 30368 -61015 -74516 24049 42721 57682 13757
10236 13757 -27292 4949 78514 29104 -16549 -28349 15217 67653 44050 80366 133793 112296
10224 112296 73519 -101360 -212375 -225317 -169306 -81217 -57893 70731 7919 1086 126532
10213 126532 142423 158985 215929 220875 137910 69871 83234 59678 43950 88237 98407 165342
10201 165342 258153 155120 43875 56234 153097 286073 323151 262891 199271 151784 192906
$$ packed form
10281i9518P9603P537K6297J5132M7625o5768j4880j20048k7508j46716j1528
10270c09772O8676N0048r4369P9384M2661P6135Q2356o9394m6981J49857R0118
10259A18719J03499J38092L589m4097k9848q928k5059j7298k6248m7229l122J629
10247A63699K7962j46648r1027Q3000o618r1383j3501R8565J8672J4961m3925
10236A3757m1049L2241P3565m9410m5653j1800M3566N2436k3603L6316N3427k1497
10224A12296l8777j74879j11015j2942N6011Q8089K3324J28624o2812o833J25446
10213A26532J5891J6562N6944M946q2965o8039J3363k3556j5728M4287J0170O6935
10201A65342R2811j03033j11245J2359R6863J32976L7078o0260o3620m7487M1122
$$ plain form
10190 192906 301443 331934 324929 284748 219929 266261 321365 282710 338519 374819 346266
10179 346266 333089 241909 229014 287442 380061 420594 452801 525141 664648 604794 579400
10168 579400 601100 663606 750735 735238 680230 683134 740440 821999 791246 831299 915730 840721
10156 840721 793762 868633 862291 875539 908643 889608 954943 1043188 1065813 1157816 1174819 1155577
10144 1155577 1187612 1210391 1308186 1321807 1326550 1447811 1656343 1661145 1742630 1884204 1959599
10133 1959599 2080900 1990608 2019331 2116570 2213210 2343727 2502612 2586322 2726198 2893711
10123 2893711 2950720 3060008 3189548 3282812 3407918 3617494 3770687 3921636 4230771 4495059
10113 4495059 4767558 5046854 5258931 5588705 5992228 6320347 6758532 7188017 7720371
$$ packed form
10190A92906J08537L0491p005m0181o4819M6332N5104l8655N5809L6300k8553
10179C46266j3177r1180j2895N8428R2619M0533L2207P2340J39507n9854k5394
10168E79400K1700O2506Q7129j5497n5008K904N7306Q1559l0753M0053Q4431p5009
10156H40721m6959P4871o342J3248L3104j9035O5335Q8245K2625R2003J7003j9242
10144A155577L2035K2779R7795J3621M743J21261K08532M802Q1485J41574P5395
10133A959599J21301r0292K8723R7239R6640J30517J58885Q3710J39876J67513
10123B893711N7009J09288J29540R3264J25106K09576J53193J50949L09135K64288
10113D495059K72499K79296K12077L29774M03523L28119M38185M29485N32354
$$ plain form
10104 7720371 8184734 8787642 9530626 10315609 11116471 12063551 13141739 14368452 15800441
10095 15800441 17381474 19099226 21010153 23086416 25452872 28237238 31521806 35435494
10087 35435494 40022193 45488834 52174201 60157524 69529973 80651777 93811145 108894538
10079 108894538 125627269 143103836 159824225 173656274 182864458 185953496 182722740
10072 182722740 174133846 161911901 148066790 134269807 121242185 109538437 99231031
10065 99231031 90329885 82573370 75866450 70088001 65262856 61099048 57446207 54218849
10057 54218849 51512647 49000547 46750820 44804294 42827234 40962343 39235007 37559750
10049 37559750 36029722 34545906 33229567 32054802 30964265 30028226 29134049 28100784
$$ packed form
10104G720371M64363O02908P42984P84983Q00862R47080J078188J226713J431989
10095A5800441J581033J717752J910927K076263K366456K784366L284568L913688
10087C5435494M586699N466641O685367P983323R372449J1121804J3159368J5083393
10079A08894538J6732731J7476567J6720389J3832049R208184L089038l230756
10072A82722740q588894j2221945j3845111j3796983j3027622j1703748j0307406
10065I9231031q901146p756515o706920n778449m825145m163808l652841l227358
10057E4218849k706202k512100k249727j946526j977060j864891j727336j675257
10049C7559750j530028j483816j316339j174765j090537r36039q94177j033265
$$ plain form
10041 28100784 27277071 26600288 25933663 25431020 24957697 24443994 23920442 23456749 23135875
10032 23135875 22751618 22481691 22297572 22234096 22141992 22173855 22447517 22987530 23595566 24424020
10022 24424020 25547244 26656487 27861053 29226550 30719657 32443936 34581853 37378948
10014 37378948 41253956 46646304 54629593 66613442 84757049 111387346 147141275
10007 147141275 190407279 235729914 276163277 308451998 327793897 335559068 331229487
10000 331229487 314243712 285954531 247735120 207041699 168721467 137267514 114622931
9993 114622931 99034710 88194689 80342514 74547731 69989360 66166553 62922850 60083743
9985 60083743 57357890 54665963 52137127 49782948 47492967 45353239 43377557 41552816
$$ packed form
10041B8100784q23713o76783o66625n02643m73323n13703n23552m63693l20874
10032B3135875l84257k69927j84119o3476r2104L1863K73662N40013O08036Q28454
10022B4424020J123224J109243J204566J365497J493107J724279K137917K797095
10014C7378948L875008N392348P983289J1983849J8143607K6630297L5753929
10007A47141275M3266004M5322635M0433363L2288721J9341899P765171m329581
10000C31229487j6985775k8289181l8219411m0693421l8320232l1453953k2644583
9993A14622931j5588221j0840021p852175n794783m558371l822807l243703k839107
9985F0083743k725853k691927k528836k354179k289981k139728j975682j824741
$$ plain form
9977 41552816 40005316 38513892 37172704 35883108 34523802 33249784 32203941 31281974
9969 31281974 30361343 29552731 28675393 27813156 27101912 26340606 25694832 25120705 24405001
9960 24405001 23708768 23028721 22419014 21875987 21304519 20757028 20248155 19640602 19193200
9951 19193200 18794866 18400771 18029557 17663001 17371022 17098502 16933739 16742869 16346019
9942 16346019 15914963 15711263 15488475 15221622 14950717 14705344 14430295 14198278 13835568
9933 13835568 13532415 13297748 13131017 12928199 12689400 12416113 12280225 12083413 11840081
9924 11840081 11587574 11366841 11171488 10971149 10732970 10579649 10373167 10138554 10000154
9915 10000154 9890477 9784434 9481758 9228745 9105799 8950624 8765849 8617136 8597131 8474457
$$ packed form
9977D1552816j547500j491424j341188j289596j359306j274018j045843r21967
9969C1281974r20631q08612q77338q62237p11244p61306o45774n74127p15704
9960B4405001o96233o80047o09707n43027n71468n47491n08873o07553m47402
9951A9193200l98334l94095l71214l66556k91979k72520j64763j90870l96850
9942A6346019m31056k03700k22788k66853k70905k45373k75049k32017l62710
9933A3835568l03153k34667j66731k02818k38799k73287j35888j96812k43332
9924A1840081k52507k20733j95353k00339k38179j53321k06482k34613j38400
9915A0000154j09677j06043l02676k53013j22946j55175j84775j48713k0005j22674
$$ plain form
9905 8474457 8273519 8109655 7922686 7781584 7614544 7680402 7690941 7565235 7441392 7385071
9895 7385071 7170991 7006866 6906556 6776708 6682702 6640829 6464391 6310479 6234501 6065246
9885 6065246 5883303 5716681 5771974 5732382 5619167 5555106 5474276 5513004 5432084 5298027 5153127
9874 5153127 5069183 5060279 5101534 5013589 4849995 4762030 4736382 4615555 4634817 4628971 4467539
9863 4467539 4281827 4302383 4350396 4342711 4205237 4212149 4280975 4163183 4154783 4249243 4112738
9852 4112738 3888860 3772549 3794179 3834545 3695812 3677987 3665546 3596373 3462064 3318456
9842 3318456 3298510 3322309 3320612 3304271 3403046 3331337 3332070 3382152 3378682 3332420 3295456 3233342
9830 3233342 3218016 3169537 3137336 3133835 3138021 3050971 2965846 2870425 2739895 2764354 2747875 2752728
$$ packed form
9905H474457k00938j63864j86969j41102j67040O5858J0539j25706j23843n6321
9895G385071k14080j64125j00310j29848r4006m1873j76438j53912p5978j69255
9885F065246j81943j66622N5293l9592j13215o4061q0830L8728q0920j34057j44900
9874E153127q3944q904M1255q7945j63594q7965k5648j20827J9262n846j61432
9863D467539j85712K0556M8013p685j37474O912O8826j17792q400R4460j36505
9852D112738k23878j16311K1630M0366j38733j7825j2441o9173j34309j43608
9842C318456j9946K3799j697j6341R8775p1709P33N0082l470m6262l6964o2114
9830C233342j5326m8479l2201l501M186q7050q5125r5421j30530K4459j6479M853
$$ plain form
9818 2752728 2744889 2709761 2722403 2704673 2706236 2661818 2640756 2561058 2399148 2419309 2551115
9807 2551115 2504091 2452962 2427199 2371481 2341462 2341979 2318739 2267847 2297566 2270319 2336930 2415034
9795 2415034 2386470 2345879 2366374 2277469 2253356 2198238 2213046 2313465 2263402 2270023 2197354
9784 2197354 2120861 2100026 2149338 2220948 2122092 2122326 2212885 2353490 2280700 2188323 2188513 2235163
9772 2235163 2292964 2204369 2085234 2057012 1977679 1941253 1972841 2060266 2047195 2012198 1989025
9761 1989025 1958333 1938468 2029535 2026083 1899835 1791165 1867307 1880775 1981034 2033231 1962968
9750 1962968 1938315 1884519 1713946 1731778 1803859 1859503 1794978 1865337 1917337 1882504 1983468
9739 1983468 1956501 1933862 2001996 2010708 2008822 2115591 2119969 2046395 1959039 1876004 1802500 1821622
$$ packed form
9818B752728p839l5128J2642j7730J563m4418k1062p9698j61910K0161J31806
9807B551115m7024n1129k5763n5718l0019N17k3240n0892K9719k7247O6611P8104
9795B415034k8564m0591K0495q8905k4113n5118J4808J00419n0063O621p2669
9784B197354p6493k0835M9312P1610r8856K34R0559J40605p2790r2377J90M6650
9772B235163N7801q8595j19135k8222p9333l6426L1588Q7425j3071l4997k3173
9761A989025l0692j9865R1067l452j26248j08670P6142J3468J00259N2197p0263
9750A962968k4653n3796j70573J7832P2081N5644o4525P0359N2000l4833J00964
9739A983468k6967k2639O8134Q712j886J06769M378p3574q7356q3035p3504J9122
$$ plain form
9727 1821622 1838295 1894747 1945763 2013140 1981868 2024400 2103793 2094595 2134720 2113554 2125191 2067241
9715 2067241 2047449 2084577 2133306 2176136 2218923 2330095 2242908 2113517 2147026 2207280 2283337
9704 2283337 2333851 2378638 2471524 2468905 2401439 2377715 2459279 2491670 2613321 2514118 2450804
9693 2450804 2461786 2462311 2480546 2570042 2796282 2900190 2965704 3077598 3087905 3063327 3188433
9682 3188433 3297793 3347027 3322361 3376724 3475046 3523345 3564226 3678972 3822007 4062701 4286241
9671 4286241 4401834 4543228 4685812 4754498 4870124 4986241 5069231 5129091 5163198 5195013
9661 5195013 5125538 5141729 5166667 5160742 5196585 5195961 5276599 5323899 5317834 5392684 5444108 5425954
9649 5425954 5463174 5652397 5722100 5803458 5857112 5895121 6001478 6085458 6128600 6112559 6025212
$$ packed form
9727A821622J6673N6452N1016O7377l1272M2532P9393r198M0125k1166J1637n7950
9715B067241j9792L7128M8729M2830M2787J11172q7187j29391L3509O0254P6057
9704B283337N0514M4787R2886k619o7466k3724Q1564L2391J21651r9203o3314
9693B450804J0982N25J8235Q9496K26240J03908O5514J11894J0307k4578J25106
9682C188433J09360M9234k4666N4363R8322M8299M0881J14746J43035K40694K23540
9671D286241J15593J41394J42584O8686J15626J16117Q2990N9860L4107L1815
9661E195013o9475J6191K4938n925L5843o24Q0638M7300o065P4850N1424j8154
9649E425954L7220J89223O9703Q1358N3654L8009J06357Q3980M3142j6041q7347
$$ plain form
9638 6025212 5995919 6137703 6297073 6413857 6498812 6516223 6496877 6489801 6447818 6377715 6246761
9627 6246761 6156572 6113780 6155568 6097389 6000256 5910913 5856724 5806476 5775484 5778239 5690559 5435732
9615 5435732 5306254 5263750 5319331 5322533 5231056 5164474 5032279 4920241 4996470 5213406 5449125
9604 5449125 5524818 5670272 5855123 6036951 6069372 5919743 5745948 5603003 5441703 5041893
9594 5041893 4619883 4291234 4020328 3877389 3752799 3646097 3552057 3417788 3375958 3239509
9584 3239509 3211391 3159541 3127893 3040142 2890925 2811549 2694764 2581435 2570600 2511431 2462533
9573 2462533 2431395 2385322 2442923 2417203 2288419 2294167 2326371 2292816 2249083 2229278 2195224
9562 2195224 2178807 2142684 2106135 2030216 1956620 1971737 2099644 2118756 2013575 1979363 1964154
$$ packed form
9638F025212k9293J41784J59370J16784Q4955J7411j9346p076m1983p0103j30954
9627F246761r0189m2792M1788n8179r7133q9343n4189n0248l0992K755q7680k54827
9615E435732j29478m2504N5581L202r1477o6582j32195j12038P6229K16936K35719
9604E449125P5693J45454J84851J81828L2421j49629j73795j42945j61300l99810
9594E041893m22010l28649k70906j42939j24590j06702r4040j34269m1830j36449
9584C239509k8118n1850l1648q7751j49217p9376j16785j13329j0835n9169m8898
9573B462533l1138m6073N7601k5720j28784N748L2204l3555m3733j9805l4054
9562B195224j6417l6123l6549p5919p3596J5117J27907J9112j05181l4212j5209
$$ plain form
9551 1964154 1921886 1874710 1874791 1765343 1754616 1655147 1651459 1645923 1624032 1474897 1319497 1240265
9539 1240265 1232702 1267270 1381420 1467469 1498586 1386062 1397703 1423634 1413577 1422282 1319363
9528 1319363 1260677 1324838 1335843 1427649 1417456 1374400 1263039 1154414 1220786 1217976 1206713
9517 1206713 1086376 997336 980471 1032588 1006293 925783 941855 1076827 1201941 1116904 1023309
9506 1023309 1122245 981031 910230 945128 954040 917569 1045306 981511 867555 817532 857747
9495 857747 892020 882081 839029 815795 736831 697674 775863 829471 823481 847238 951017 937659
9483 937659 896204 861468 671446 596724 640507 539547 500059 531286 503474 413683 495833
9472 495833 498210 531367 618273 663002 571129 658281 686827 695446 696202 667070 684634 761868
$$ packed form
9551A964154m2268m7176Q1j09448j0727r9469l688n536k1891j49135j55400p9232
9539A240265p563L4568J14150Q6049L1117j12524J1641K5931j0057Q705j02919
9528A319363n8686O4161J1005R1806j0193m3056j11361j08625O6372k810j1263
9517A206713j20337q9040j6865N2117k6295q0510J6072J34972J25114q5037r3595
9506A023309R8936j41214p0801L4898Q912l6471J27737o3795j13956n0023M0215
9495H57747L4273r939m3052k3234p8964l9157P8189N3608n990K3757J03779j3358
9483I37659m1455l4736j90022p4722M3783j00960l9488L1227k7812q9791Q2150
9472D95833K377L3157Q6906M4729r1873Q7152K8546Q619P56k9132J7564P7234
$$ plain form
9460 761868 799454 735890 675393 601792 596426 597236 619924 681378 630031 522256 463237 462049
9448 462049 535613 615700 726207 670476 649970 755575 805048 692696 627386 539127 546655
9437 546655 546261 562726 574121 588489 602129 641230 583372 509320 498896 565861 525880 566117
9425 566117 561182 626472 610451 553715 501418 622317 638289 559352 588450 550745 476039 440092
9413 440092 523149 508707 490015 495216 508082 527187 548588 605479 615688 577050 616695 618916
9401 618916 616321 601979 543553 494291 491548 441906 472018 429189 368118 377492 451622 462032
9389 462032 441747 497376 528742 566847 590631 527675 457116 399174 306099 384519 495819
9378 495819 554812 564426 484735 357679 317887 358192 427475 425926 500324 576358 585654 657592
$$ packed form
9460G61868L7586o3564o0497p3601n366Q10K2688O1454n1347j07775n9019j188
9448D62049P3564Q0087J10507n5731k0506J05605M9473j12352o5310q8259P528
9437E46655l94J6465J1395J4368J3640L9101n7858p4052j0424O6965l9981M0237
9425E66117m935O5290j6021n6736n2297J20899J5972p8937K9098l7705p4706l5947
9413D40092Q3057j4442j8692N201J2866J9105K1401N6891J0209l8638L9645K221
9401F18916k595j4342n8426m9262k743m9642L0112m2829o1071R374P4130J0410
9389D62032k0285N5629L1366L8105K3784o2956p0559n7942r3075P8420J11300
9378D95819N8993R614p9691j27056l9792M0305O9283j549P4398P6034R296P1938
$$ plain form
9366 657592 670047 584266 585098 598655 625810 613716 580725 640236 547928 556298 658551 646110
9354 646110 613816 647587 544715 529097 600777 648675 579155 529461 530896 626849 633497 640911
9342 640911 569992 443341 464035 417254 304298 404013 405146 430977 518329 655191 678976
9331 678976 565568 531363 456210 416679 491831 592788 575529 546841 598742 611583 668113
9320 668113 715250 668820 570545 610655 673429 614314 629168 661507 662881 656324 629218 606163
9308 606163 691217 861056 791250 751242 726199 743108 762154 774086 711144 609002 683850
9297 683850 702587 742853 868938 857824 771187 682738 611397 619882 737634 855957 868637
9286 868637 793909 780056 776422 745088 661132 659692 655731 668561 795697 844324 853168 830302
$$ packed form
9366F57592J2455q5781Q32J3557K7155j2094l2991N9511r2308Q370J02253j2441
9354F46110l2294L3771j02872j5618P1680M7898o9520m9694J435R5953O648P414
9342F40911p0919j26651K0694m6781j12956R9715J133K5831Q7352J36862K3785
9331F78976j13408l4205p5153l9531P5152J00957j7259k8688N1901J2841N6530
9320F68113M7137m6430r8275M0110O2774n9115J4854L2339J374o557k7106k3055
9308F06163Q5054J69839o9806m0008k5043J6909J9046J1932o2942j02142P4848
9297F83850J8737M0266J26085j1114q6637q8449p1341Q485J17752J18323J2680
9286H68637p4728j3853l634l1334q3956j440l961J2830J27136M8627Q844k2866
$$ plain form
9274 830302 781464 825465 927641 945989 992757 1041997 1058085 1047385 1124761 1220227 1242806
9263 1242806 1201435 1203792 1163464 1053181 1034710 1023995 1051391 1116990 1148435 1111182 1133762
9252 1133762 1258568 1269255 1243667 1215278 1282261 1295174 1287224 1335373 1294273 1290399 1285542 1335704
9240 1335704 1383612 1473719 1424121 1313567 1294840 1380757 1478465 1455906 1462745 1546995 1656751
9229 1656751 1667632 1537659 1562442 1544114 1567564 1511720 1538912 1592299 1660430 1728750 1717172
9218 1717172 1647827 1735773 1807314 1834780 2060477 2048733 2002918 2082585 2121073 2051343 2039398
9207 2039398 2198653 2296604 2245812 2233131 2166820 2194218 2232813 2261114 2381573 2349645 2300925
9196 2300925 2226337 2255009 2336171 2376504 2465854 2557998 2608286 2625259 2582800 2543843 2556900
$$ packed form
9274H30302m8838M4001J02176J8348M6768M9240J6088j0700P7376R5466K2579
9263A242806m1371K357m0328j10283j8471j0715K7396O5599L1445l7253K2580
9252A133762J24806J0687k5588k8389O6983J2913p950M8149m1100l874m857N0162
9240A335704M7908R0107m9598j10554j8727Q5917R7708k2559O839Q4250J09756
9229A656751J0881j29973K4783j8328K3450n5844K7192N3387O8131O8320j1578
9218A717172o9345Q7946P1541K7466K25697j1744m5815P9667L8488o9730j1945
9207B039398J59255R7951n0792j2681o6311K7398L8595K8301J20459l1928m8720
9196B300925p4588K8672Q1162M0333Q9350R2144N0288J6973m2459l8957J3057
$$ plain form
9185 2556900 2615343 2592793 2605180 2531635 2527848 2560406 2583534 2657075 2747175 2881490 2855049
9174 2855049 2839103 2816771 2832039 2865948 2911157 2862143 2876203 2941647 2937954 2878216 2841303 2757179
9162 2757179 2675887 2669448 2698473 2689430 2692450 2636518 2584292 2603920 2634226 2611050 2600663 2631873
9150 2631873 2642821 2627889 2635883 2554416 2337763 2208969 2273046 2387647 2508289 2622397 2452210
9139 2452210 2336095 2384017 2401352 2456206 2408399 2358155 2335362 2303782 2208746 2210402 2181895
9128 2181895 2115719 2102962 2214235 2249876 2107523 2081010 2128709 2068066 2060487 2106893 2129723
9117 2129723 2001321 1909521 1934297 1899001 1867488 1862445 1811813 1803246 1814361 1795996 1825705 1780809
9105 1780809 1766437 1861884 1816561 1780072 1710170 1683077 1579410 1506983 1547161 1587123 1420542
$$ packed form
9185B556900N8443k2550J2387p3545l787L2558K3128P3541R0100J34315k6441
9174B855049j5946k2332J5268L3909M5209m9014J4060O5444l693n9738l6913q4124
9162B757179q1292o439K9025r043L020n5932n2226J9628L0306k3176j0387L1210
9150B631873J0948j4932P994q1467k16653j28794O4077J14601J20642J14108j70187
9139B452210j16115M7922J7335N4854m7807n0244k2793l1580r5036J656k8507
9128B181895o6176j2757J11273L5641j42353k6513M7699o0643p579M6406K2830
9117B129723j28402r1800K4776l5296l1513n043n0632q567J1115j8365K9709m4896
9105A780809j4372R5447m5323l6489o9902k7093j03667p2427M0178L9962j66581
$$ plain form
9094 1420542 1310475 1297671 1358506 1401489 1381479 1353489 1330750 1282614 1225567 1256120 1321930
9083 1321930 1202789 1237814 1180557 1098612 1080102 1198308 1259125 1196915 1152081 1160068 1136163
9072 1136163 1127117 1137261 1180268 1216750 1145649 1187202 1197154 1308521 1307224 1215896 1137709 1154210
9060 1154210 1126288 1047010 964843 978458 986809 963334 862562 932876 997783 984026 993019 1076541
9048 1076541 1081811 1013987 871014 850201 733160 679861 706912 763466 804231 748842 697401
9037 697401 641344 710611 804736 803139 800737 790634 843147 886704 826917 701922 665460 794949
9025 794949 859699 752187 669247 696276 808408 743130 677766 700127 652912 654185 784788
9014 784788 888218 810822 770131 863339 815726 708114 704900 713240 689252 637152 706698 661319
$$ packed form
9094A420542j10067j2804O0835M2983k0010k7990k2739m8136n7047L0553O5810
9083A321930j19141L5025n7257q1945j8510J18206O0817o2210m4834P987k3905
9072A136163r046J0144M3007L6482p1101M1553R952J11367j297r1328p8187J6501
9060A154210k7922p9278q2167J3615Q351k3475j00772P0314O4907j3757Q993Q3522
9048A076541N270o7824j42973k0813j17041n3299K7051N6554M0765n5389n1441
9037F97401n6057O9267R4125j597k402j0103N2513M3557n9787j24995l6462J29489
9025G94949O4750j07512q2940K7029J12132o5278o5364K2361m7215J273J30603
9014G84788J03430p7396m0691R3208m7613j07612l214Q340k3988n2100O9546m5379
$$ plain form
9002 661319 710404 886518 781063 667623 567924 451401 364850 419846 514060 514279 512359
8991 512359 512035 478941 604402 704514 628337 484390 406390 469325 456525 426830 382109
8980 382109 358096 352962 334892 387788 483167 457590 424713 430410 416566 472467 398552 264227
8968 264227 308005 319676 320391 352081 354744 378091 399716 373108 415082 403520 327327 385145
8956 385145 476169 463017 416315 351701 382300 344406 310662 381008 361883 365099 415425 517711
8944 517711 574994 540395 500587 468846 399966 417774 350561 277373 326180 327763 330168 427363
8932 427363 509493 397901 234807 302186 478378 511928 426344 370524 372867 434503 461094
8921 461094 408311 407561 406092 357058 431326 518808 557586 501633 478402 355173 313591 319578
$$ packed form
9002F61319M9085J76114j05455j13440r9699j16523q6551N4996R4214K19j920
8991E12359l24l3094J25461J00112p6177j43947p8000O2935j2800k9695m4721
8980C82109k4013n134j8070N2896R5379k5577l2877N697j3844N5901p3915j34325
8968B64227M3778J1671P15L1690K663K3347K1625k6608M1974j1562p6193N7818
8956C85145R1024j3152m6702o4614L0599l7894l3744P0346j9125L216N0326J02286
8944E17711N7283l4599l9808l1741o8880J7808o7213p3188M8807J583K405R7195
8932D27363Q2130j11592j63094O7379J76192L3550q5584n5820K343O1636K6591
8921D61094n2783p50j469m9034P4268Q7482L8778n5953k3231j23229m1582N987
$$ plain form
8909 319578 349796 354989 376064 417508 519737 517819 514583 454140 432301 368170 398822 442310
8897 442310 374926 432931 454947 402861 304827 242996 277748 260552 257601 221577 184120 172648
8885 172648 238366 275238 271499 172952 145704 154631 135181 220197 311222 269478 231806 126978
8873 126978 144788 135214 143170 186930 192003 184109 226061 272231 251743 198247 235380 332997
8861 332997 400067 376313 347247 265650 235618 294738 331072 203356 32749 25857 60713
8850 60713 -14285 8485 43271 65954 236789 247213 238631 277447 377391 375899 333743 265575
8838 265575 177159 85485 51432 119878 171520 158353 120644 145210 159276 162805 250140 179295
8826 179295 182775 113426 29259 16619 132066 205510 177314 154169 270012 307499 245386
$$ packed form
8909C19578L0218N193K1075M1444J02229j918l236o0443k1839o4131L0652M3488
8897D42310o7384N8005K2016n2086r8034o1831L4752j7196k951l6024l7457j1472
8885A72648O5718L6872l739r8547k7248Q927j9450Q5016R1025m1744l7672j04828
8873A26978J7810r574P956M3760N073p894M1952M6170k0488n3496L7133R7617
8861C32997O7070k3754k9066q1597l0032N9120L6334j27716j70607o892L4856
8850F0713p4998K2770L4786K2683J70835J0424q582L8816R9944j492m2156o8168
8838B65575q8416r1674l4053O8446N1642j3167l7709K4566J4066L529Q7335p0845
8826A79295L480o9349q4167j2640J15447P3444k8196k3145J15843L7487o2113
$$ plain form
8815 245386 258018 281126 311989 369099 321237 327521 316019 301493 265399 306710 273324 260508
8803 260508 310898 321997 364884 292143 224308 233765 159007 282067 360807 380579 507990
8792 507990 497156 440981 384485 322553 280531 206221 141888 216559 304327 286381 279597 289425
8780 289425 368574 350863 312943 324754 317727 303329 189859 154499 222270 323838 361047
8769 361047 402975 316741 348022 523958 630643 529732 495705 465369 445053 381333 264823
8758 264823 209675 284498 269762 241263 251197 324689 308963 234897 23443 -54151 85780
8747 85780 243121 255526 239579 225161 211752 222465 179156 101593 174390 185994 188419 331122
8735 331122 407684 309755 343481 483888 430261 404479 435456 329550 311295 362261 345591
$$ packed form
8815B45386J2632K3108L0863N7110m7862O284j1502j4526l6094M1311l3386j2816
8803B60508N0390J1099M2887p2741o7835R457p4758J23060P8740J9772J27411
8792E07990j0834n6175n6496o1932m2022p4310o4333P4671Q7768j7946o784R828
8780B89425P9149j7711l7920J1811p027j4398j13470l5360O7771J01568L7209
8769C61047M1928q6234L1281J75936J06685j00911l4027l0336k0316o3720j16510
8758B64823n5148P4823j4736k8499R934P3492j5726p4066k11454p7594J39931
8747H5780J57341J2405j5947j4418j3409J0713m3309p7563P2797J1604K425J42703
8735C31122P6562r7929L3726J40407n3627k5782L0977j05906j8255N0966j6670
$$ plain form
8724 345591 304206 305304 399933 512104 493564 409563 447160 461394 438964 506781 551791 443304
8712 443304 358125 218977 276735 376894 416295 404787 418739 352529 261704 199976 195634
8701 195634 183666 196763 204275 233837 294443 291248 321508 244522 216851 285653 294953 354441
8689 354441 435136 321097 152606 42494 51587 61186 90796 235976 205129 112376 209439
8678 209439 184666 223384 247982 259582 273361 281976 324892 190910 176306 225882 267298 245158
8666 245158 237916 331499 253004 71373 20418 64445 195164 237658 220427 177821 147675
8655 147675 146256 113013 79348 139872 147392 167120 152566 118627 98014 81382 113016 244330
8643 244330 288481 230477 122596 86781 86454 217597 227836 274502 333782 412275 309867
$$ packed form
8724C45591m1385J098R4629J12171j8540q4001L7597J4234k2430O7817M5010j08487
8712D43304q5179j39148N7758J00159L9401j1508J3952o6210r0825o1728m342
8701A95634j1968J3097P512K9562O0606l195L0260p6986k7671O8802R300N9488
8689C54441Q0695j14039j68491j10112R093R599K9610J45180l0847r2753R7063
8678B09439k4773L8718K4598J1600J3779Q615M2916j33982j4604M9576M1416k2140
8666B45158p242R3583p8495j81631n0955M4027J30719M2494j7231m2606l0146
8655A47675j419l3243l3665O0524P520J9728j4554l3939k0613j6632L1634J31314
8643B44330M4151n8004j07881l5815l27J31143J0239M6666N9280P8493j02408
$$ plain form
8632 309867 375215 339749 290817 165703 145182 296075 319881 338221 360727 311989 233987
8621 233987 218121 261439 221512 227808 167958 233851 188052 212707 164225 126357 117679 92420
8609 92420 82605 110723 138494 206637 343944 372688 289819 251914 260284 292174 306737 366724
8597 366724 393387 377981 401575 370831 290149 280291 228671 257310 328437 409506 348455 302854
8585 302854 142002 167174 220258 195103 155395 198947 184194 259058 310111 401517 307091
8574 307091 262419 284648 279164 140142 144837 128343 137611 199884 205059 137837 129391 210012
8562 210012 149131 138283 88690 91612 69212 114602 192983 196948 209421 201158 208642 192812
8550 192812 236277 276469 306863 234801 89602 -11232 131357 199060 175208 166547 153085
$$ packed form
8632C09867O5348l5466m8932j25114k0521J50893K3806J8340K2506m8738p8002
8621B33987j5866M3318l9927O296n9850O5893m5799K4655m8482l7868q678k5259
8609I2420r815K8118K7771O8143J37307K8744q2869l7905Q370L1890J4563N9987
8597C66724K6663j5406K3594l0744q0682r858n1620K8639P1127Q1069o1051m5601
8585C02854j60852K5172N3084k5155l9708M3552j4753P4864N1053R1406r4426
8574C07091m4672K2229n484j39022M695j6494R268O2273N175o7222q446Q0621
8562B10012o0881j0848m9593K922k2400M5390P8381L965J2473q263P484j5830
8550A92812M3465M0192L0394p2062j45199j00834J42589O7703k3852q661j3462
$$ plain form
8539 153085 181429 135332 -26093 -114243 -36082 12764 131783 162298 193357 324989 320578
8528 320578 337869 424990 427943 398540 412909 351717 227757 321739 474733 449687 368548
8517 368548 387546 479306 446566 330549 337181 423146 580006 677655 902844 1201906 1239397
8506 1239397 1303515 1340011 1198810 1044909 907450 775492 804908 690543 604632 629514
8496 629514 643467 504937 465574 419777 475893 574466 593611 517921 404082 379766 418500
8485 418500 423655 416008 414241 497646 617155 431320 496002 541019 624048 617183 578984 594926
8473 594926 659132 666511 789314 911262 1036550 1186577 1183135 1051003 1026104 1015610 932272
8462 932272 723268 752102 785768 738242 636802 535587 593111 697716 611849 521290 369094
$$ packed form
8539A53085K8344m6097j61425q8150P8161M8846J19019L0515L1059J31632m411
8528C20578J7291Q7121K953k9403J4369o1192j23960R3982J52994k5046q1139
8517C68548J8998R1760l2740j16017O632Q5965J56860R7649K25189K99062L7491
8506A239397O4118L6496j41201j53901j37459j31958K9416j14365q5911K4882
8496F29514J3953j38530l9363m5797N6116R8573J9145p5690j13839k4316L8734
8485D18500N155p647j767Q3405J19509j85835O4682M5017Q3029o865l8199J5942
8473E94926O4206P379J22803J21948J25288J50027l442j32132k4899j0494q3338
8462I32272k09004K8834L3666m7526j01440j01215N7524J04605q5867r0559j52196
$$ plain form
8451 369094 295122 211217 112518 119857 164229 140642 246708 345632 376948 373885 315898 192087
8439 192087 228387 263262 181229 228427 264415 189441 170994 212183 212798 266419 321635 364871
8427 364871 377466 382884 354977 362601 179975 138705 200907 196410 181327 118712 29083 58833
8415 58833 79572 50275 40387 45721 71393 88384 141693 188964 222607 273675 249907 317782
8403 317782 323599 233092 218973 115326 120004 198240 184721 201531 226201 183017 174364 232291
8391 232291 265907 182082 7966 -66089 -154732 -14220 19572 -98277 -83541 28455 45025
8380 45025 30773 120878 205291 265532 164547 180550 234225 144637 114565 98584 149182 68287
8368 68287 47987 -5269 30774 49305 39002 38758 20544 80872 111834 130732 28251 -66621
$$ packed form
8451C69094p3972q3905r8699P339M4372k3587J06066R8924L1316l063n7987j23811
8439A92087L6300L4875q2033M7198L5988p4974j8447M1189O15N3621N5216M3236
8427C64871J2595N418k7907P624j82626m1270O2202m497j5083o2615q9629K9750
8415E8833K0739k9297r888N334K5672J6991N3309M7271L3643N1068k3768O7875
8403C17782N817r0507j4119j03647M678P8236j3519J6810K4670m3184q653N7927
8391B32291L3616q3825j74116p4055q8643J40512L3792j17849J4736J11996J6570
8380D5025j4252R0105Q4413O0241j00985J6003N3675q9588l0072j5981N0598q0895
8368F8287k0300n3256L6043J8531j0303k44j8214O0328L0962J8898j02481r4872
$$ plain form
8356 -66621 -31300 -9833 -20103 -6198 46995 35084 60712 67277 93268 36224 34450 8573
8344 8573 13951 -41756 -28570 12637 -38174 -13348 30804 125582 241115 216188 46113 -32694
8332 -32694 94349 186553 216962 192458 238560 288677 248309 149868 141398 92676 25950 -37910
8320 -37910 47634 101503 64041 -43609 -24259 17216 17577 -39467 -51384 2007 -20666 41653
8308 41653 90392 23666 -21031 -63137 -110848 -67385 32140 -27487 -12508 -20586 -111552 -179398
8296 -179398 -98686 7536 137074 131570 51191 147001 257392 188772 138161 43026 63456
8285 63456 80045 88228 137619 48293 -37773 -84381 -18181 20111 85449 137471 236139 224483
8273 224483 171030 94825 82248 104586 121431 75232 49593 31443 -11731 6655 65978 85207
$$ packed form
8356f6621L5321K1467j0270J3905N3193j1911K5628O565K5991n7044j774k5877
8344H573N378n5707J3186M1207n0811K4826M4152R4778J15533k4927j70075p8807
8332c2694J27043R2204L0409k4504M6102N0117m0368r8441q470m8722o6726o3860
8320c7910Q5544N3869l7462j07650J9350M1475L61n7044j1917N3391k2673O2319
8308D1653M8739o6726m4697m2106m7711M3463R9525n9627J4979q078r0966o7846
8296a79398Q0712J06222J29538n504q0379R5810J10391o8620n0611r5135K0430
8285F3456J6589Q183M9391q9326q6066m6608O6200L8292O5338N2022R8668j1656
8273B24483n3453p6205j2577K2338J6845m6199k5639j8150m3174J8386N9323J9229
$$ plain form
8261 85207 6421 -20033 134662 171836 62606 63566 88015 159671 88923 -19552 45492 27569
8249 27569 -15113 23587 66265 26343 62973 73368 -1285 -117873 -33323 55165 19329 77097
8237 77097 77820 104695 168451 107072 95096 166175 67270 87937 149999 123393 89584 32330
8225 32330 107238 96511 126828 92282 133203 114858 -30881 -198006 -256562 -219945 -59478
8214 -59478 -66709 -79799 -18096 -13211 -29342 -33072 -20997 73784 83615 79378 102107 127112 60930
8201 60930 35126 -1180 -10283 35748 130084 181733 116999 131475 78644 61656 126397 174602
8189 174602 131805 125435 87099 113828 145222 96063 27987 -116372 -141791 -59265 54236
8178 54236 87929 123099 115168 118057 68506 55509 104987 189748 139676 146552 191706 277077
$$ packed form
8261H5207p8786k6454J54695L7174j09230R60K4449P1656p0748j08475O5044j7923
8249B7569m2682L8700M2678l9922L6630J0395p4653j16588Q4550Q8488l5836N7768
8237G7097P23K6875O3756o1379j1976P1079r8905K0667O2062k6606l3809n7254
8225C2330P4908j0727L0317l4546M0921j8345j45739j67125n8556L6617J60467
8214e9478p231j3090O1703M885j6131l730J2075R4781R831m237K2729K5005o6182
8201F0930k5804l6306r103M6031R4336N1649o4734J4476n2831j6988O4741M8205
8189A74602m2797o370l8336K6729L1394m9159o8076j44359k5419Q2526J13501
8178E4236L3693L5170p931K889m9551j2997M9478Q4761n0072O876M5154Q5371
$$ plain form
8166 277077 245432 233178 198288 102456 63153 68659 81334 -14250 -56795 -103007 16702 64947
8154 64947 -89480 -114545 -64190 10440 11958 24225 71847 79188 62623 69545 81296 96582
8142 96582 183513 199945 88022 28468 -39618 -93733 -141912 -40609 86625 170418 174591
8131 174591 144478 57009 106825 155399 177139 116309 59325 56050 140688 189377 209558 181216
8119 181216 102375 38149 53277 78489 64175 -16130 34918 69146 -8192 620 163311 131976
8107 131976 94394 110692 127772 9292 16526 78125 41705 -1475 872 16995 85901 143616
8095 143616 280116 265954 154979 106221 154440 153229 85021 -5970 12420 -44893 -91999
8084 -91999 -29513 428 -7412 -51083 29696 65452 24995 -92129 -57834 -13181 -2009 2578
$$ packed form
8166B77077l1645j2254l4890r5832l9303N506J2675r5584m2545m6212J19709M8245
8154F4947j54427k5065N0355P4630J518J2267M7622P341j6565O922J1751J5286
8142I6582Q6931J6432j11923n9554o8086n4115m8179J01303J27234Q3793M173
8131A74591l0113q7469M9816M8574K1740o0830n6984l275Q4638M8689K0181k8342
8119A81216p8841o4226J5128K5212j4314q0305N1048L4228p7338Q812J62691l1335
8107A31976l7582J6298J7080j18480P234O1599l6420m3180K347J6123O8906N7715
8095A43616J36500j4162j10975m8758M8219j211o8208r0991J8390n7313m7106
8084i1999O2486K9941p840m3671Q0779L5756m0457j17124L4295M4653J1172M587
$$ plain form
8072 2578 -35553 68982 94512 59518 70048 148742 138915 177401 207685 147625 199322 251133
8060 251133 209996 167674 141074 106673 237831 277719 235711 240112 242332 132416 94257 35103
8048 35103 -15872 -60023 22144 109673 98493 93288 160413 50775 197156 149552 64917 30717
8036 30717 68375 141079 74246 72722 117877 136573 154232 38833 -51855 -30040 -16091 -39868
8024 -39868 22912 77096 153850 169838 102028 181701 162180 86018 90783 89221 63940 53022
8012 53022 8590 45151 205165 205566 116979 148302 223033 336752 298674 331921 307399 214566
8000 214566 214472 114848 2856 117884 75370 112237 138588 125294 134542 187808 280040 286471
7988 286471 254206 183304 135129 63048 137417 93116 132307 151651 52000 -31613 -3838 44920
$$ packed form
8072B578l8131J04535K5530l4994J0530P8694r827L8486L0284o0060N1697N1811
8060B51133m1137m2322k6600l4401J31158L9888m2008M401K220j09916l8159n9154
8048C5103n0975m4151Q2167Q7529j1180n205O7125j09638J46381m7604q4635l4200
8036C0717L7658P2704o6833j524M5155J8696J7659j15399r0688K1815J3949k3777
8024c9868O2780N4184P6754J5988o7810P9673j9521p6162M765j562k5281j0918
8012E3022m4432L6561J60014M01q8587L1323P4731J13719l8078L3247k4522r2833
8000B14566r4r9624j11992J15028m2514L6867K6351j3294R248N3266R2232O431
7988B86471l2265p0902m8175p2081P4369m4301L9191J9344r9651q3613K7775M8758
$$ plain form
7976 44920 37481 -64785 -95264 -71729 19130 105974 178552 128446 135135 175432 230455 180391
7964 180391 240864 203406 233809 244477 112945 34612 84528 130049 178596 269291 273741 248425
7952 248425 201947 182592 180165 171533 190264 246806 221917 205970 257751 209745 159999 66180
7940 66180 33462 31144 -16551 -32122 -36007 -70991 -37334 13233 24414 28820 115946 287329
7928 287329 362597 260860 132511 59967 32825 146317 217955 199279 152079 145501 180715
7917 180715 149620 223598 187602 288005 428819 288465 235088 248604 225777 239979 144528
7906 144528 171877 215353 301056 306868 300698 242842 215779 143926 68833 8313 710 -369
7894 -369 -13666 19589 77440 32307 63324 97276 129554 97635 146965 102314 101039 31394
$$ packed form
7976D4920p439j02266l0479K3535R0859Q6844P2578n0106O689M0297N5023n0064
7964A80391O0473l7458L0403J0668j31532p8333M9916M5521M8547R0695M450k5316
7952B48425m6478j9355k427q632J8731N6542k4889j5947N1781m8006m9746r3819
7940F6180l2718k318m7695j5571l885l4984L3657N0567J1181M406Q7126J71383
7928B87329P5268j01737j28349p2544k7142J13492P1638j8676m7200o578L5214
7917A80715l1095P3978l5996J00403J40814j40354n3377J3516k2827J4202r5451
7906A44528K7349M3476Q5703N812o170n7856k7063p1853p5093o0520p603j079
7894c69j3297L3255N7851m5133L1017L3952L2278l1919M9330m4651j275o9645
$$ plain form
7882 31394 26590 -6450 99427 153903 172438 230866 274618 261619 266213 283847 236609 75570
7870 75570 -92563 -28120 12781 33515 30736 110852 81937 138527 82531 24505 55020 38572
7858 38572 83893 134345 4027 19558 52787 34857 63839 23135 -15893 73803 230467
7847 230467 184861 75269 47805 129287 203537 140944 120033 108327 93466 75618 193976
7836 193976 139245 -33530 -46070 -22545 48075 52059 -62271 -168510 -184781 -107715 -1137
7825 -1137 23358 89347 121990 53224 76059 82405 6187 -27610 63200 156589 19921 -38774
7813 -38774 -33944 -187377 -231780 -52696 -10942 -126959 -108172 61307 141395 197264 233228
7802 233228 228786 184035 149823 85379 51183 59044 -11904 -80094 4766 -6692 15060 37733
$$ packed form
7882C1394m804l3040J05877N4476J8535N8428M3752j2999M594J7634m7238j61039
7870G5570j68133O4443M0901K0734k779Q0116k8915N6590n5996n8026L0515j6448
7858C8572M5321N0452j30318J5531L3229j7930K8982m0704l9028Q9696J56664
7847B30467m5606j09592k7464Q1482P4250o2593k0911j1706j4861j7848J18358
7836A93976n4731j72775j2540K3525P0620L984j14330j06239j6271P7066J06578
7825a137K4495O5989L2643o8766K2835O346p6218l3797R0810R3389j36668n8695
7813c8774M830j53433m4403J79084M1754j16017J8787J69479Q0088N5869L5964
7802B33228m442m4751l4212o4444l4196P861p0948o8190Q4860j1458K1752K2673
$$ plain form
7790 37733 2555 44774 77929 42087 4943 37729 58504 16881 116641 214789 213304 185827
7778 185827 145217 -43359 -54353 -3113 -1803 25472 21539 -1765 -4688 44422 26388 20479
7766 20479 60000 21207 74032 38686 67018 50709 -10974 -15885 59268 118322 65775 31982
7754 31982 35246 98953 174250 158903 131443 164543 134374 44759 -1116 42454 100004 147415
7742 147415 207207 164022 113715 40046 2551 -531 -81830 -80733 -40682 -38521 -117978 -79093
7730 -79093 -104901 -179250 -126209 -75683 49468 98510 22634 -80905 -177256 -166424 -146208
7719 -146208 -95662 -57585 -73423 -109052 -142836 -164983 -88665 -57417 -58446 46722 115937 -39085
7707 -39085 -109655 -98926 -50523 13913 -26737 -12718 4721 36590 -51911 -80186 -80009 -32890
$$ packed form
7790C7733l5178M2219L3155l5842l7144L2786K0775m1623R9760R8148j485k7477
7778A85827m0610j88576j0994N1240J310K7275l933k3304k923M9110j8034n909
7766B0479L9521l8793N2825l5346K8332j6309o1683m911P5153N9054n2547l3793
7754C1982L264O3707P5297j5347k7460L3100l0169q9615m5875M3570N7550M7411
7742A47415N9792m3185n0307p3669l7495l082q1299J097M0051K161p9457L8885
7730g9093k5808p4349N3041N0526J25151M9042p5876j03539r6351J0832K0216
7719a46208N0546L8077j5838l5629l3784k2147P6318L1248j029J05168O9215j55022
7707c9085p0570J0729M8403O4436m0650J4019J7439L1869q8501k8275J77M7119
$$ plain form
7695 -32890 -64837 -52795 3833 32048 -32053 -106291 -69271 -63222 -90423 -119535 -27624 12195
7683 12195 80866 138767 89982 66824 94224 100973 96867 151255 98807 49030 49646 106222 114681
7670 114681 82885 104658 79852 1781 73244 77194 41546 -48897 22716 -15836 2090 33404
7658 33404 -38022 12352 158107 139476 86702 31319 43286 39228 19465 -41618 -163596 -184298
7646 -184298 -172878 -54597 84541 82705 -79729 -155855 -172870 -138471 -61356 -29516 43831
7635 43831 79568 170416 148284 71335 71368 -4991 -128203 -142038 -71184 -54309 -7910 -771
7623 -771 -54950 52189 60057 15434 -31411 4437 49312 -28491 -34200 -93047 -38214 46998
7611 46998 85396 9696 -15101 -79068 -122565 -102888 -120085 -87313 -60389 -71879 -71269 -49316
$$ packed form
7695c2890l1947J2042N6628K8215o4101p4238L7020O049k7201k9112R1911L9819
7683A2195O8671N7901m8785k3158K7400O749m106N4388n2448m9777O16N6576Q459
7670A14681l1796K1773k4806p8071P1463L950l5648r0443P1613l8552J7926L1314
7658C3404p1426N0374J45755j8631n2774n5383J1967m058j9763o1083j21978k0702
7646a84298J1420J18281J39138j836j62434p6126j7015L4399P7115L1840P3347
7635D3831L5737R0848k2132p6949L3p6359j23212j3835P0854J6875M6399P139
7623g71n4179J07139P868m4623m6845L5848M4875p7803n709n8847N4833Q5212
7611D6998L8398p5700k4797o3967m3497J9677j7197L2772K6924j1490O10K1953
$$ plain form
7599 -49316 -3578 4681 -153631 -205025 -127584 -132322 -104423 -38990 8904 -33164 22647 33171
7587 33171 29307 -83843 -134198 -236579 -282175 -216431 -87881 4852 8431 -93135 -104016
7576 -104016 -185540 -179265 -110093 -16237 48308 75283 40548 -4115 18150 121416 114642 67620
7564 67620 98711 30582 44241 -18699 -29165 112413 67313 -20656 55373 169595 120992
7553 120992 119831 95653 38488 51540 23483 -30494 65487 103982 21820 -123644 -113811 -1632
7541 -1632 80361 116155 59662 -22753 -116877 -126468 -94086 -54637 -2395 83492 62885 -34991
7529 -34991 -12074 48879 65902 71506 87743 104221 109800 170645 112470 -7042 -17662 -11586
7517 -11586 14532 30859 25614 -15417 51164 77806 57085 47953 33153 -52268 -108795 -80173
$$ packed form
7599d9316M5738Q259j58312n1394P7441m738K7899O5433M7894m2068N5811J0524
7587C3171l864j13150n0355j02381m5596O5744J28550R2733L579j01566j0881
7576a04016q1524O275O9172R3856O4545K6975l4735m4663K2265J03266o774m7022
7564F7620L1091o8129J3659o2940j0466J41578m5100q7969P6029J14222m8603
7553A20992j161k4178n7165J3052k8057n3977R5981L8495q2162j45464R833J12179
7541a632Q1993L5794n6493q2415r4124r591L2382L9449N2242Q5887k0607r7876
7529c4991K2917O0953J7023N604J6237J6478N579O0845n8175j19512j0620O076
7517a1586K6118J6327n245m1031O6581K6642k0721r132j4800q5421n6527K8622
$$ plain form
7505 -80173 -100004 -68767 -119506 -160073 4760 23719 64526 77401 98247 42280 51229 31079
7493 31079 54747 92540 84417 171669 77832 -6118 29694 40708 55457 183033 164682 42343
7481 42343 103488 168031 39013 -97437 -127481 -133773 -114509 31510 73186 119207 158441
7470 158441 69917 14372 27576 -893 58789 69823 -26032 -75263 -63218 -104608 -65520 -92110
7458 -92110 -98565 -70892 -101498 -84341 80503 108154 45845 90595 132269 201892 228193 161353
7446 161353 91240 37315 -47652 37575 164014 150143 62609 103270 154617 140652 117065
7435 117065 -28492 -78764 -61443 -16536 22265 19775 -71479 -78596 1583 135670 119475 20862
7423 20862 -50939 -20997 43852 48817 42596 21308 33899 128464 156804 76008 111406 166014
$$ packed form
7505h0173j9831L1237n0739m0567J64833J8959M0807J2875K0846n5967Q949k0150
7493C1079K3668L7793q123Q7252r3837q3950L5812J1014J4749J27576j8351j22339
7481D2343O1145O4543j29018j36450l0044o292J9264J46019M1676M6021L9234
7470A58441q8524n5545J3204k8469N9682J1034r5855m9231J2045m1390L9088k6590
7458i2110o455K7673l0606J7157J64844K7651o2309M4750M1674O9623K6301o6840
7446A61353p0113n3925q4967Q5227J26439j3871q7534M0661N1347j3965k3587
7435A17065j45557n0272J7321M4907L8801k490r1254p117Q0179J34087j6195r8613
7423B0862p1801K9942O4849M965o221k1288J2591R4565K8340q0796L5398N4608
$$ plain form
7411 166014 235620 179422 109235 131602 146686 124779 134447 154203 255911 218282 175209 135025
7399 135025 156258 57570 1030 -85260 -171563 -243747 -235835 -161903 -59122 -29719 -45783 98180
7387 98180 142885 38863 -25317 -147690 -95134 -124079 -164066 -95663 -7537 83544 59207
7376 59207 161057 194143 222002 57857 -14815 75653 122165 81230 -25061 -43190 -50155
7365 -50155 -158735 -44976 95654 38761 54943 135614 199655 117279 22118 19819 53664
7354 53664 81849 -31861 -103755 -58981 4374 -31028 -128446 -101587 -153071 -74007 -106742 -86312
7342 -86312 -76326 -35629 -19964 -21108 -4767 -93787 -99503 -10793 612 -86306 -97335 -17139
7330 -17139 20681 71763 23867 9679 -94885 -42882 24236 30122 11540 8348 31890 87427
$$ packed form
7411A66014O9606n6198p0187K2367J5084k1907R668J9756J01708l7629m3073m0184
7399A35025K1233r8688n6540q6290q6303p2184P912P3932J02781K9403j6064J43963
7387I8180M4705j04022o4180j22373N2556k8945l9987O8403Q8126R1081k4337
7376E9207J01850L3086K7859j64145p2672R0468M6512m0935j06291j8129o965
7365e0155j08580J13759J40630n6893J6182Q0671O4041q2376r5161k299L3845
7354E3664K8185j13710p1894M4774O3355l5402r7418K6859n1484P9064l2735K0430
7342h6312R986M0697J5665j144J6341q9020n716Q8710J1405q6918j1029Q0196
7330a7139L7820N1082m7896j4188j04564N2003O7118N886j8582l192K3542N5537
$$ plain form
7318 87427 148349 71341 -25041 61430 124126 66122 85036 59744 12682 73114 47875 30204
7306 30204 -5328 -45996 -77048 -75810 -61802 -93724 -123209 -20923 50491 -69224 -120513 -239744
7294 -239744 -168157 -81644 50789 63693 11887 31041 -32361 -12887 -13163 -59565 -120452 -13258
7282 -13258 15104 17233 154811 109040 64478 63751 61835 53259 56130 -53615 -105847 -44550 -59415
7269 -59415 -78938 -70428 -46427 18127 16710 -67042 -127282 -104503 -73439 59663 19939 -39466
7257 -39466 -87601 -26146 -56125 -96141 -85729 -138783 -124596 -20262 -15206 -22674 -51594 -46008
7245 -46008 37121 25792 58993 -302 -84789 -133043 -85331 -81250 -32771 19332 60047 37639
7233 37639 -14181 -90124 -87453 -61069 22311 102618 119066 81813 45705 15388 -15692 -122949
$$ packed form
7318H7427O0922p7008r6382Q6471O2696n8004J8914k5292m7062O0432k5239j7671
7306C0204l5532m0668l1052J238J4008l1922k9485J02286P1414j19715n1289j19231
7294b39744P1587Q6513J32433J2904n1806J9154o3402J9474k76m6402o0887J07194
7282a3258K8362K129J37578m5771m4562p27j916q576K871j09745n2232O1297j4865
7269e9415j9523Q510K4001O4554j417q3752o0240K2779L1064J33102l9724n9405
7257c9466m8135O1455k9979m0016J0412n3054J4187J04334N056p468k8920N586
7245d6008Q3129j1329L3201n9295q4487m8254M7712M081M8479N2103M0715k2408
7233C7639n1820p5943K671K6384Q3380Q0307J6448l7253l6108l0317l1080j07257
$$ plain form
7221 -122949 -190041 -108406 -79019 56276 119996 97286 23799 -9227 -40139 -162188 -55106
7210 -55106 -368 -68472 -36025 57748 75930 -37210 -95471 -69731 -94273 -71144 27730 71333
7198 71333 -45107 -61480 -54358 -54189 3452 25290 -65936 -117028 -104067 -108960 -88807 -54426
7186 -54426 28211 57377 -43274 -98435 -89429 -140984 -94672 -121914 -40407 -68801 -41357 -5575
7174 -5575 32836 -18342 22854 30406 -13393 -32616 -27590 31445 2745 -89103 -28198 -1844
7162 -1844 88665 152984 47758 39267 4698 -35426 -47344 23571 23110 20661 46477 114684 97952
7149 97952 96878 -65989 -100262 -10772 140393 171979 144985 50030 -18809 -61607 -64906 -161086
7137 -161086 -108774 -117569 -194672 -189829 -114182 -64071 -116350 -83514 -18246 84924 212677 255930
$$ packed form
7221a22949o7092Q1635K9387J35295O3720k2710p3487l3026l0912j22049J07082
7210e5106N4738o8104L2447R3773J8182j13140n8261K5740k4542K3129R8874M3603
7198G1333j16440j6373P122J69N7641K1838r1226n1092J2961m893K0153L4381
7186e4426Q2637K9166j00651n5161R006n1555M6312k7242Q1507k8394K7444L5782
7174e575L8411n1178M1196P552m3799j9223N026N9035k8700r1848O0905K6354
7162a844R0509O4319j05226q491l4569m0124j1918P0915m61k449K5816O8207j6732
7149I7952j074j62867l4273Q9490J51165L1586k6994r4955o8839m2798l299r6180
7137a61086N2312q795p7103M843P5647N0111n2279L2836O5268J03170J27753M3253
$$ plain form
7125 255930 154165 58770 -16736 -132090 -135635 52579 112126 -1108 -141180 -158667 -52954
7114 -52954 52473 58335 9804 -21960 47617 65565 -66313 -118103 -86855 -41290 -11881 5519
7102 5519 -31715 -89082 38174 61079 39774 48931 190008 265420 268251 184979 121658 209849
7090 209849 185443 18733 -3980 -7043 49547 41989 -115772 -128466 -134176 -39915 -37539 -72316
7078 -72316 -58155 -91098 -104725 -60868 62464 95412 68485 59461 -1903 -70592 -136971 -218549
7066 -218549 -171406 -60157 -37562 -117574 -10625 -16150 -13265 65494 -12352 -44173 -39567 -42338
7054 -42338 -64701 143030 174938 184225 68580 39401 28105 54063 66922 108310 162745 182037
7042 182037 159517 66696 14566 8201 1086 -1801 15174 12769 33365 48525 36446 178317
$$ packed form
7125B55930j01765r5395p5506j15354l545J88214N9547j13234j40072j7487J05713
7114e2954J05427N862m8531l1764O9577J7948j31878n1790L1248M5565K9409J7400
7102E519l7234n7367J27256K2905k1305R157J41077P5412K831q3272o3321Q8191
7090B09849k4406j66710k2713l063N6590p558j57761j2694n710R4261K376l4777
7078g2316J4161l2943j3627M3857J23332L2948k6927r024o1364o8689o6379q1578
7066b18549M7143J11249K2595q0012J06949n525K885P8759p7846l1821M606k771
7054d2338k2363K07731L1908R287j15645k9179j1296K5958J2859M1388N4435J9292
7042A82037k2520r2821n2130o365p115k887J6975k405K0596J5160j2079J41871
$$ plain form
7030 178317 232039 219394 109411 33531 72976 86847 -20716 -106634 -93360 -124570 -115713
7019 -115713 -67133 -64300 13136 29304 -47542 46578 69170 32199 -24729 -122200 -146588 -180090
7007 -180090 -154511 -110750 -3930 45892 50924 74615 188077 123663 -18098 57277 157692
6996 157692 101610 46702 5472 46764 20393 -54017 -75051 -67004 36405 65058 51415 -292
6984 -292 15365 66746 86728 163380 191260 187620 165816 126941 132493 -43436 -147717 -176983
6972 -176983 -119348 -59536 33426 83343 60916 41395 69359 103513 58006 -6824 -44783 -18435
6960 -18435 89828 120327 94895 -18809 -84064 -694 94242 -7078 -9077 35959 17274
6949 17274 -11493 52128 127511 78155 83154 73296 74700 146742 138115 46235 -9151 62219 98553
$$ packed form
7030A78317N3722j2645j09983p5880L9445J3871j07563q5918J3274l1210Q857
7019a15713M8580K833P7436J6168p6846R4120K2592l6971n6928r7471k4388l3502
7007a80090K5579M3761J06820M9822N032K3691J13462o4414j41761P5375J00415
6996A57692n6082n4908m1230M1292k6371p4410k1034Q047J03409K8653j3643n1707
6984b92J5657N1381J9982P6652K7880l640k1804l8875N552j75929j04281k9266
6972a76983N7635N9812R2962M9917k2427j9521K7964L4154m5507o4830l7959K6348
6960a8435J08263L0499k5432j13704o5255Q3370R4936j01320j999M5036j8685
6949A7274k8767O3621P5383m9356M999r858J404P2042q627r1880n5386P1370L6334
$$ plain form
6936 98553 82987 73552 115262 145616 91034 -34501 -149755 -159897 -88220 -94827 -35664 -47890
6924 -47890 -110569 -97882 -144347 -84430 -42934 -72087 57475 100687 -22824 11570 92378
6913 92378 175786 174547 124649 4663 3668 -107879 -254237 -263712 -141834 -44992 -51263 -93224
6901 -93224 -100427 -62809 -40352 -39721 -39346 -31310 -12084 77819 -16824 -8265 684 -5662 -80849 -149459
6887 -149459 -136643 92265 135063 63505 544 6727 122989 176949 170642 56661 54161 42909
6875 42909 113303 125244 70822 88236 135649 40018 41483 74398 -30584 -11301 -68199 -88947
6863 -88947 -14148 -15803 -19417 21936 29631 48046 100375 152360 128871 69932 -2569 -20887
6851 -20887 -114896 -128143 -43307 -9736 -9620 -61801 9236 37689 23236 14777 20638 20278 15892
$$ packed form
6936I8553j5566r435M1710L0354n4582j25535j15254j0142P1677o607N9163j2226
6924d7890o2679J2687m6465N9917M1496k9153J29562M3212j23511L4394Q0808
6913I2378Q3408j239m9898j19986r95j11547j46358r475J21878R6842o271m1961
6901i3224p203L7618K2457O31L75Q036J9226Q9903r4643Q559Q949o346p5187o8610
6887a49459J2816K28908M2798p1558o2961O183J16262N3960o307j13981k500j1252
6875D2909P0394J1941n4422J7414M7413r5631J465L2915j04982J9283n6898k0748
6863h8947P4799j655l614M1353P695J8415N2329N1985k3489n8939p2501j8318
6851b0887r4009j3247Q4836L3571J16n2181P1037K8453j4453q459N861l60m386
$$ plain form
6838 15892 6346 -16233 27373 56299 83651 121706 135372 102614 10336 -78771 -40598 6
6826 6 -9036 -72571 -83911 9642 50298 16195 -1177 -43128 12553 -8255 -49643 -32579 -66743
6813 -66743 -52028 -93455 27089 82689 79122 67901 22320 -55594 -58820 -2474 50479 122342
6801 122342 65611 15695 65233 163531 136848 60009 88782 103584 80495 86365 35890 -9601
6789 -9601 -163201 -154127 -64011 -141405 -223110 -218189 -167964 -43182 -93107 -18792 -79405 -67112
6777 -67112 -115945 -182064 -261234 -184638 22329 93155 24120 -93592 -92919 -87891 21537 169611
6765 169611 136022 41229 16082 -20653 9292 7646 22260 -64250 -79227 -22747 2769 -64874
6753 -64874 -75277 12068 76082 76761 -45619 -154865 -58089 -4059 21887 59029 52288 66750
$$ packed form
6838A5892r546k2579M3606K8926K7352L8055J3666l2758r2278q9107L8173M0604
6826Fr042o3535j1340R3553M0656l4103j7372m1951N5681k0808m1388J7064l4164
6813f6743J4715m1427J20544N5600l567j1221m5581p7914l226N6346N2953P1863
6801A22342n6731m9916M9538R8298k6683p6839K8773J4802k3089N870n0475m5491
6789i601j53600R074R0116p7394q1705M921N0225J24782m9925P4315o0613J2293
6777f7112m8833o6119p9170P6596K06967P0826o9035j17712O73N028J09428J48074
6765A69611l3589r4793k5147l6735K9945j646J4614q6510j4977N6480K5516o7643
6753f4874j0403Q7345O4014O79j22380j09246R6776N4030K5946L7142o741J4462
$$ plain form
6741 66750 61001 -72288 -64989 -70867 -4458 67312 -6430 -18976 -8204 -36807 -44662 37210
6729 37210 65660 61214 78461 129210 134165 191879 181074 78797 89031 91651 79385 117709
6717 117709 99559 -8697 3581 85280 104234 153657 194494 118057 71813 180788 11911
6706 11911 -136772 -124878 -107901 -37082 -13536 41354 107627 104040 104538 121866 98288 25533
6694 25533 -30665 29198 58656 52278 99963 156450 225684 295236 204366 159604 126738 100511
6682 100511 -15472 -200701 -283818 -81937 69985 70481 72503 98836 19890 -12120 138047
6671 138047 140969 63027 117492 156035 78383 -73414 -95456 5282 41993 -78368 -89804
6660 -89804 -16373 -13266 51017 54651 2029 -25249 -31764 -31898 -44255 -18291 -58249 -146224 -80291
$$ packed form
6741F6750n749j33289P299n878O6409P1770p3742j2546J0772k8603p855Q1872
6729C7210K8450m446J7247N0749M955N7714j0805j02277J0234K620j2266L8324
6717A17709j8150j08256J2278Q1699J8954M9423M0837p6437m6244J08975j68877
6706A1911j48683J1894J6977P0819K3546N4890O6273l587M98J7328k3578p2755
6694B5533n6198N9863K9458o378M7685N6487O9234O9552r0870m4762l2866k6227
6682A00511j15983j85229q3117K01881J51922M96K022K6333p8946l2010J50167
6671A38047K922p7942N4465L8543p7652j51797k2042J00738L6711j20361j1436
6660h9804P3431L107O4283L634n2622k7278o515j34j2357K5964l9958q7975O5933
$$ plain form
6647 -80291 17804 40639 2721 -44228 -67485 -102657 -74287 -17903 21417 46650 -493 -44282
6635 -44282 -97312 -97629 -152184 -209383 -203615 -107660 -16180 69992 12858 45561 126771 161098
6623 161098 54016 -21131 -1666 -53034 -102363 19625 7112 12432 -89495 -66458 -15538
6612 -15538 49360 5404 38047 -9715 -110034 -58770 -168651 -156376 -139076 -238608 -233638 -115902
6600 -115902 -13458 -44405 -11574 -3380 86652 161540 170017 133890 46561 82600 53290 -95470
6588 -95470 -120765 -46026 -34400 -93638 -76748 -35556 -43151 -73979 -51258 -24269 -34790 445
6576 445 -17442 69363 65162 186 103063 209491 144202 53525 90596 169093 113323 -78228
6564 -78228 -137773 -30803 94088 79502 39812 16701 40939 40461 31876 -19111 16899 21783
$$ packed form
6647h0291R8095K2835l7918m6949k3257l5172K8370N6384L9320K5233m7143m3789
6635d4282n3030l17n4555n7199N768R5955R1480Q6172n7134L2703Q1210L4327
6623A61098j07082p5147J9465n1368m9329J21988j2513N320j01927K3037N0920
6612a5538O4898m3956L2643m7762j00319N1264j09881J2275J7300r9532M970J17736
6600a15902J02444l0947L2831Q194R0032P4888Q477l6127q7329L6039k9310j48760
6588i5470k5295P4739J1626n9238J6890M1192p595l0828K2721K6989j0521L5235
6576D45j7887Q6805m201o4976J02877J06428o5289r0677L7071P8497n5770j91551
6564g8228n9545J06970J24891j4586l9690k3111K4238m78q585n0987L6010M884
$$ plain form
6552 21783 -31360 -58898 -28817 -1088 -36789 -54482 -140879 -124259 -93863 -44373 -43475 1374
6540 1374 34208 -17143 -118486 -190177 -183659 -106440 -3248 -48675 -74333 -100642 -109887 -49256
6528 -49256 16786 -26268 -84477 -28671 5439 66585 153383 155771 107107 144306 61406 97513
6516 97513 128782 127789 53114 -100805 -78397 -64985 -53997 -70397 -50206 -6988 81431 130897
6504 130897 24087 -28204 58901 -546 12098 -17006 -70620 -18619 51337 68498 13896
6493 13896 63077 136608 30920 14728 16343 -97342 -150995 -164020 -115999 -95490 -91757 -37692
6481 -37692 -19735 -1846 -74668 -22042 16312 38311 23463 -20108 98732 14390 -39403 -49032
6469 -49032 -114829 -223041 -228886 -152629 -149829 -142400 -116824 -140141 -96042 -62116 -70605 -97247
$$ packed form
6552B1783n3143k7538L0081K7729l5701j7693q6397J6620L0396M9490Q98M4849
6540A374L2834n1351j01343p1691O518P7219J03192m5427k5658k6309r245O0631
6528d9256O6042m3054n8209N5806L4110O1146Q6798K388m8664L7199q2900L6107
6516I7513L1269r93p4675j53919K2408J3412J0988j6400K0191M3218Q8419M9466
6504A30897j06810n2291Q7105n9447J2644k9104n3614N2001O9956J7161n4602
6493A3896M9181P3531j05688j6192J615j13685n3653j3025M8021K0509L733N4065
6481c7692J7957J7889p2822N2626L8354K1999j4848m3571J18840q4342n3793r629
6469d9032o5797j08212n845P6257K800P429K5576k3317M4099L3926q489k6642
$$ plain form
6457 -97247 -14181 -15913 -91004 -31158 16170 -7287 -31759 66280 118659 52618 83710 10758
6445 10758 -82998 -44448 38098 27977 45779 -44937 -101488 -140488 -157024 -117399 -89589 -158574
6433 -158574 -153351 -144783 -128779 -26937 13255 -94638 -78684 -71744 22585 29988 29783 67974
6421 67974 174676 190373 143271 113433 85146 72471 52507 44262 -87431 -114102 -68983 -35924
6409 -35924 -80680 -89953 -85516 -83653 -81937 -16530 37990 98806 45770 -78566 -25336 70313
6397 70313 16316 -67851 -15755 -16585 -125326 -84952 -76825 -112115 -172280 -122394 -145249 -44526
6385 -44526 -62045 -108193 -65078 -66679 -134066 -31176 64730 159991 106787 52177 66438 111564
6373 111564 184006 219357 110174 65511 523 -30898 -10316 6933 76673 138526 107296
$$ packed form
6457i7247Q3066j732p5091N9846M7328k3457k4472R8039N2379o6041L1092p2952
6445A0758r3756L8550Q2546j0121J7802r0716n6551l9000j6536L9625K7810o8985
6433a58574N223Q568J6004J01842M0192j07893J5954O940R4329P403k05L8191
6421F7974J06702J5697m7102k9838k8287j2675j9964q245j31693k6671M5119L3059
6409c5924m4756r273M437J863J716O5407N4520O0816n3036j24336N3230R5649
6397G0313n3997q4167N2096q30j08741M0374Q127l5290o0165M9886k2855J00723
6385d4526j7519m6148M3115j601o7387J02890R5906R5261n3204n4610J4261M5126
6373A11564P2442L5351j09183m4663o4988l1421K0582J7249O9740O1853l1230
$$ plain form
6362 107296 45086 79378 165439 200003 147636 79070 69432 484 35730 110740 90032 63493
6350 63493 78683 41223 -47686 -86763 -120955 -150070 -146513 -117235 -72469 -61210 -86451 -95626
6338 -95626 -75549 -47857 -23975 -51252 -73758 -107909 -110333 -8879 103211 22895 -72588 -139250
6326 -139250 -178837 -127204 -98883 -68009 4212 2900 -68775 -169867 -98027 -53200 -72219 -26930
6314 -26930 35746 99238 100947 24902 -37233 -12457 -26742 75776 77860 17607 -109715 -106614
6302 -106614 -23556 -1000 -49088 43437 121296 157656 103395 48657 72548 -47524 -84700
6291 -84700 -53098 -34202 -15005 -23348 -22576 73053 210429 288095 219742 258634 222656 195196
6279 195196 115274 29756 21788 36139 34603 -14926 29520 -1920 -7314 -51692 -35844 -130786
$$ packed form
6362A07296o2210L4292Q6061L4564n2367o8566r638o8948L5246P5010k0708k6539
6350F3493J5190l7460q8909l9077l4192k9115L557K9278M4766J1259k5241r175
6338i5626K0077K7692K3882k7277k2506l4151k424J01454J12090q0316r5483o6662
6326a39250l9587N1633K8321L0874P2221j312p1675j01092P1840M4827j9019M5289
6314b6930O2676O3492J709p6045o2135K4776j4285J02518K084o0253j27322L101
6302a06614Q3058K2556m8088R2525P7859L6360n4261n4738K3891j20072l7176
6291h4700L1602J8896J9197q343P72R5629J37376P7666o8353L8892l5978k7460
6279A95196p9922q5518p968J4351j536m9529M4446l1440n394m4378J5848r4942
$$ plain form
6267 -130786 -154658 -166446 -202532 -237396 -222081 -148051 -134372 -216208 -176517 -20997 21083
6256 21083 -26479 -55460 -138651 -213234 -311286 -333241 -226392 -137430 -133688 -257434 -212143 -66316
6244 -66316 25300 23191 -77356 -67244 16645 150687 106151 -13434 -16198 1557 -22500 -75884
6232 -75884 -176771 -149853 -100121 -164632 -171954 -92124 -40875 64430 85983 -15609 67335
6221 67335 124692 57841 -27294 -47725 45142 47053 -55822 5801 36168 10954 -47026 73598
6209 73598 111781 76394 91736 78047 -40608 -93329 -129298 -168696 -250266 -312530 -351755 -316715
6197 -316715 -274998 -95376 -29290 -51943 -47148 -131278 -45576 -18778 -1012 -31309 -83843 -118568
6185 -118568 -123379 -142624 -114027 -140725 -76690 -46143 -26218 -61356 -104595 -57705 -56123 -127642
$$ packed form
6267a30786k3872j1788l6086l4864J5315P4030J3679q1836L9691J55520M2080
6256B1083m7562k8981q3191p4583r8052k1955J06849Q8962L742j23746M5291J45827
6244f6316R1616k109j00547J0112Q3889J34042m4536j19585k764J7755k4057n3384
6232g5884j00887K6918M9732o4511p322P9830N1249J05305K1553j01592Q2944
6221F7335N7357o6851q5135k0431R2867J911j02875O1623L0367k5214n7980J20624
6209G3598L8183l5387J5342j3689j18655n2721l5969l9398q1570o2264l9225L5040
6197c16715M1717J79622O6086k2653M795q4130Q5702K6798J7766l0297n2534l4725
6185a18568m811j9245K8597k6698O4035L0547J9925l5138m3239M6890J582p1519
$$ plain form
6173 -127642 -57927 -1600 11028 62024 101296 115843 -20976 -86178 -69264 -43558 -76660
6162 -76660 -117512 -55232 -41979 -22846 11166 9118 -7624 -45647 9549 -6508 -2934 -51852
6150 -51852 -481 95472 45587 -54772 -92020 -94095 -152327 -16540 88629 25699 42960
6139 42960 79414 91192 -14952 -52036 -66397 -39876 -69633 -80642 -13493 18258 5685 -77535
6127 -77535 -31358 -57080 -14440 -6885 66858 96977 128933 52602 -17529 -68967 -1016 48205
6115 48205 -4542 -22229 17507 131496 173331 41828 -29946 -68599 15422 92114 76946
6104 76946 78332 56782 489 -17108 -24112 8556 -9681 -8754 -39722 -108256 -137718 -174859 -29995
6091 -29995 109957 181162 79215 -27102 35890 112609 68792 -937 91803 118338 8681
$$ packed form
6173a27642O9715N6327J2628N0996L9272J4547j36819o5202J6914K5706l3102
6162g6660m0852O2280J3253J9133L4012k048j6742l8023N5196j6057L574m8918
6150e1852N1371R5953m9885j00359l7248k075n8232J35787J05169o2930J7261
6139D2960L6454J1778j06144l7084j4361K6521k9757j1009O7149L1751j2573q3220
6127g7535M6177k5722M2640P555P3743L0119L1956p6331p0131n1438O7951M9221
6115D8205n2747j7687L9736J13989M1835j31503p1774l8653Q4021P6692j5168
6104G6946J386k1550n6293j7597p004L2668j8237R27l0968o8534k9462l7141J44864
6091b9995J39952P1205j01947j06317O2992P6719m3817o9729R2740K6535j09657
$$ plain form
6080 8681 13505 34242 30979 66121 79749 4472 -31332 -4889 -66685 -88684 -119184 -137003
6068 -137003 -3216 150130 164635 199936 159621 93051 -26304 12646 -38078 -110673 -96264
6057 -96264 -31120 52822 -30029 -103920 -138630 -92161 -18553 -22918 -109898 -107138 -84208 -136604
6045 -136604 -237369 -184023 -94445 -21560 -11508 -98570 -31295 -43694 53898 87365 31003
6034 31003 45796 -6982 -111780 -87928 -20779 1307 9985 29638 56445 99666 159365 129443
6022 129443 -30899 -87364 44289 54219 22394 -65681 -82014 41104 -25223 -71145 -48257
6011 -48257 -80035 -61222 -38199 -59316 -63983 -41138 -8131 30802 58846 -62080 -77856 91666
5999 91666 208072 197493 154660 119866 49882 -3394 4667 62929 165285 79749 5528 -39046
$$ packed form
6080H681M824K0737l263L5142J3628p5277l5804K6443o1796k1999l0500j7819
6068a37003J33787J53346J4505L5301m0315o6570j19355L8950n0724p2595J4409
6057i6264O5144Q3942q2851p3891l4710M6469P3608m365q6980K760K2930n2396
6045a36604j00765N3346Q9578P2885J0052q7062O7275j2399R7592L3467n6362
6034C1003J4793n2778j04798K3852O7149K2086Q678J9653K6807M3221N9699k9922
6022A29443j60342n6465J31653R930l1825q8075j6333J23118o6327m5922K2888
6011d8257l1778J8813K3023k1117m667K2845L3007L8933K8044j20926j5776J69522
5999I1666J16406j0579m2833l4794o9984n3276Q061N8262J02356q5536p4221m4574
$$ plain form
5987 -39046 -44162 -82491 21696 131344 78073 94407 72484 137801 147593 148475 55721 -58885
5975 -58885 -89939 -1752 -33739 61389 165398 143527 41297 54036 31682 177320 218308
5964 218308 129756 79177 151474 120750 6107 -50858 -16196 92248 115433 45714 -18443
5953 -18443 -42991 -45951 -105442 -69144 -95662 -38384 22540 106668 178743 108027 -17356 -96542
5941 -96542 -165335 -220416 -86112 -5650 -76320 -117030 -164723 -127565 -82649 -125647 -175639 -175159
5929 -175159 -132833 444 178346 139802 107782 54171 66020 73371 -1861 -46665 -28783
5918 -28783 77302 228000 165690 203301 273081 163341 94549 105955 21342 -50270 -62101
5907 -62101 -27874 27831 20638 59390 59760 32523 53957 4355 11757 58628 100173 39994 -10422
$$ packed form
5987c9046n116l8329J04187J09648n3271J6334k1923O5317R792Q82r2754j14606
5975e8885l1054Q8187l1987R5128J04009k1871j02230J2739k2354J45638M0988
5964B18308q8552n0579P2297l0724j14643n6965L4662J08444K3185o9719o4157
5953a8443k4548k960n9491L6298k6518N7278O0924Q4128P2075p0716j25383p9186
5941i6542o8793n5081J34304Q0462p0670m0710m7693L7158M4916m2998m9992M80
5929a75159M2326J33277J77902l8544l2020n3611J1849P351p5232m4804J7882
5918b8783J06085J50698o2310L7611O9780j09740o8792J1406q4613p1612j1831
5907f2101L4227N5705p193L8752L70k7237K1434m9602P402M6871M1545o0179n0416
$$ plain form
5894 -10422 16993 46287 72636 30762 159990 184728 130960 39367 -50091 -98742 -39848 -107614
5882 -107614 -28947 56147 68291 -34706 -1289 159083 167571 94558 145535 121136 -7965
5871 -7965 -80647 -61630 65729 103815 -3199 -117970 -125093 -154519 -60877 -55482 -148764 -202975
5859 -202975 -146832 -110526 -65797 18560 42943 20360 37170 20061 34955 -31442 -56265 -8522
5847 -8522 -81926 -142652 -36563 -74594 -168001 -62795 -37726 -54028 -3637 -87503 -94883 -111599
5835 -111599 -150906 -146065 -206299 -118171 -86926 -145363 -12595 50223 40633 17074 -10579 15513
5823 15513 95285 101053 90552 31560 -5455 -3326 42792 42369 106045 58155 -54805 -155523
5811 -155523 -117696 -40301 -4274 66447 -6473 -94970 -87866 -32405 -3937 -41181 -34106 -96451
$$ packed form
5894a0422K7415K9294K6349m1874J29228K4738n3768r1593q9458m8651N8894o7766
5882a07614P8667Q5094J2144j02997L3417J60372Q488p3013N0977k4399j29101
5871g965p2682J9017J27359L8086j07014j14771p123k9426R3642N395r3282n4211
5859b02975N6143L6306M4729Q4357K4383k2583J6810j7109J4894o6397k4823M7743
5847h522p3404o0726J06089l8031r3407J05206K5069j6302N0391q3866p380j6716
5835a11599l9307M841o0234Q8128L1245n8437J32768O2818r590k3559k7653K6092
5823A5513P9772N768j0501n8992l7015K129M6118m23O3676m7890j12960j00718
5811a55523L7827P7395L6027P0721p2920q8497P104N5461K8468l7244P075o2345
$$ plain form
5799 -96451 -135801 -169688 -216280 -181740 -135719 -222601 -200656 -15786 -17069 -19332 -60458 -79857
5787 -79857 65446 37930 -15332 -132655 -151391 -5516 -77877 -149221 -105509 -67547 -101460
5776 -101460 -127130 -73954 -6630 -130548 1108 11045 -14003 -54366 -2193 -63016 -87696
5765 -87696 -160387 -93841 -14974 -18990 15845 -25694 -73262 -56171 -27714 -85245 -77370 -84704
5753 -84704 -103651 -93124 77317 115945 76995 -48367 -117852 -100255 -141819 -66426 -32378
5742 -32378 -63117 -32178 664 -39606 51926 -22174 3375 65223 47512 106164 71414 15036
5730 15036 -35498 -40654 12614 20094 -14554 -35072 -18680 54661 54637 -44527 31816 111673 99244
5717 99244 -13136 -97147 -163426 -185095 -183731 -141038 -142111 -121218 -6133 4877 -110206 -189308
$$ packed form
5799i6451l9350l3887m6592L4540M6021q6882K1945J84870j283k263m1126j9399
5787g9857J45303k7516n3262j17323j8736J45875p2361p1344M3712L7962l3913
5776a01460k5670N3176O7324j23918J31656R937k5048m0363N2173o0823k4680
5765h7696p2691O6546P8867m016L4835m1539m7568J7091K8457n7531P875p334
5753h4704j8947J0527J70441L8628l8950j25362o9485J7597m1564P5393L4048
5742c2378l0739L0939L2842m0270R1532p4100K5549O1848j7711N8652l4750n6378
5730A5036n0534n156N3268P480l4648k0518J6392P3341k4r9164P6343P9857j2429
5717I9244j12380q4011o6279k1669J364M2693j073K0893J15085J1010j15083p9102
$$ plain form
5705 -189308 -64007 -17047 -141568 -243493 -192350 -182056 -198917 -122548 -156531 -163187 -153842
5694 -153842 -100810 -120700 -152262 -117789 -42056 42062 16552 64059 -30992 -117187 -106918 19324
5682 19324 -50043 -43913 -38265 6236 -15324 35138 133884 283119 245280 101461 30471 -2587
5670 -2587 -17543 51468 -6869 -143772 -140081 -6010 17928 24066 90281 124429 23648 72723
5658 72723 95588 49864 98781 114560 -49512 -89584 -118093 -191259 -229316 -150992 -19210
5647 -19210 85840 95262 25907 -19169 -104677 -112751 -87633 -45679 62817 72741 127343 166707
5635 166707 254614 241338 120446 44372 74318 111794 48491 19519 3468 -95755 -173235
5624 -173235 -98812 -201758 -143541 -56245 10670 -5696 -81134 -144337 -218653 -178213 -79699
$$ packed form
5705a89308J25301M6960j24521j01925N1143J0294j6861P6369l3983o656R345
5694a53842N3032j9890l1562L4473P5733Q4118k5510M7507r5051q6195J0269J26242
5682A9324o9367O130N648M4501k1560N0462R8746J49235l7839j43819p0990l3058
5670b587j4956O9011n8337j36903L691J34071K3938O138O6215L4148j00781M9075
5658G2723K2865m5724M8917J5779j64072m0072k8509p3166l8057P8324J31782
5647a9210J05050R422o9355m5076q5508q074K5118M1954J08496R924N4602L9364
5635A66707Q7907j3276j20892p6074K9946L7476o3303k8972j6051r9223p7480
5624a73235P4423j02946N8217Q7296O6915j6366p5438o3203p4316M0440R8514
$$ plain form
5613 -79699 -56904 -65541 -47001 45528 98834 103772 59916 -22152 -101629 -149677 -151168 -82617
5601 -82617 -98881 -208479 -245006 -211520 -223946 -279397 -147367 -40173 -94252 -105771 -83376
5590 -83376 -116992 -135224 -135870 -191574 -239683 -262665 -183600 -141360 -96655 9959 -60699 -161130
5578 -161130 -118618 -30813 23989 8419 76619 97254 123710 50828 -31857 32118 66993 33876
5566 33876 69451 140822 217461 115399 -34027 46241 115937 102440 -15423 -122976 -82168
5555 -82168 -43079 -113263 -144887 -104530 -83199 -83915 -86438 -72870 -35043 -13755 -66605 -41215
5543 -41215 -26895 -72016 33048 32313 -9939 -76847 -110275 -50583 124526 182267 140448 60711
5531 60711 -111675 -144224 -39289 22022 -21376 -125964 -164511 -187583 -137236 -187436 -150884
$$ packed form
5613g9699K2795q637J8540R2529N3306M938m3856q2068p9477m8048j491O8551
5601h2617j6264j09598l6527L3486j2426n5451J32030J07194n4079j1519K2395
5590h3376l3616j8232o46n5704m8109k2982P9065M2240M4705J06614p0658j00431
5578a61130M2512Q7805N4802j5570O8200K0635K6456p2882q2685O3975L4875l3117
5566C3876L5575P1371P6639j02062j49426Q0268O9696j3497j17863j07553M0808
5555h2168L9089p0184l1624M0357K1331p16k523J3568L7827K1288n2850K5390
5543d1215J4320m5121J05064p35m2252o6908l3428N9692J75109N7741m1819p9737
5531F0711j72386l2549J04935O1311m3398j04588l8547k3072N0347n0200L6552
$$ plain form
5520 -150884 -96988 -185631 -174243 -179578 -172645 -85607 -45300 34013 60424 78779 11346 31553
5508 31553 29390 -30466 -55613 -45110 -103584 -61302 48791 98244 23704 -57717 -30112 65019
5496 65019 88470 92369 84116 42576 54216 -3063 42748 120943 135016 -4870 17608 39862
5484 39862 -107715 2099 92139 143745 132940 40953 -37337 -58476 -80896 -96587 -40968
5473 -40968 -13939 29309 117841 74080 24131 -36854 24810 72237 29907 13798 68591 80448
5461 80448 132528 81457 -29996 -128014 -99635 -53983 -5842 -26990 -76749 -111051 -70088 -19869
5449 -19869 19735 -24011 -55962 -108788 36810 61009 104594 171248 159786 56341 -12911
5438 -12911 -54814 -35933 -26366 -82117 -110925 -98053 -112880 -138394 -91997 -41412 -62940 18986
$$ packed form
5520a50884N3896q8643J1388n335O933Q7038M0307P9313K6411J8355o7433K0207
5508C1553k163n9856k5147J0503n8474M2282J10093M9453p4540q1421K7605R5131
5496F5019K3451L899q253m1540J1640n7279M5811P8195J4073j39886K2478K2254
5484C9862j47577J09814R0040N1606j0805r1987p8290k1139k2420j5691N5619
5473d0968K7029M3248Q8532m3761m9949o0985O1664M7427m2330j6109N4793J1857
5461H0448N2080n1071j11453r8018K8379M5652M8141k1148m9759l4302M0963N0219
5449a9869L9604m3746l1951n2826J45598K4199M3585O6654j1462j03445o9252
5438a2911m1903J8881R567n5751k8808J2872j4827k5514M6397N0585k1528Q1926
$$ plain form
5426 18986 59653 39 -116885 -140866 -103219 -44324 33569 17258 -38807 -26519 17329 44640
5414 44640 54069 -7940 -32955 27397 -15374 -17546 -47701 21017 49671 119366 24018 -54228
5402 -54228 -21215 34890 38626 -17556 -19290 -141636 -216041 -270558 -166141 -469 -19519 -119276
5390 -119276 -137424 -47857 -69090 -84480 -60597 -20016 -70222 -29351 -7581 -15294 115861 231359
5378 231359 112118 -11003 28413 62946 13631 85479 58334 -1583 49814 31999 25302
5367 25302 34275 37167 83621 18374 -111696 -35125 -53549 -75231 20405 62086 -32786 -126404
5355 -126404 -147830 -64238 -65989 -81826 -65121 -10201 -22475 12125 9033 -26427 -14405 31772
5343 31772 105785 -45967 -169235 -142370 -124962 -264049 -233827 -216741 -278491 -287845 -215473
$$ packed form
5426A8986M0667n9614j16924k3981L7647N8895P7893j6311n6065J2288M3848K7311
5414D4640R429o2009k5015O0352m2771k172l0155O8718K8654O9695r5348p8246
5402e4228L3013N6105L736n6182j734j22346p4405n4517J04417J65672j9050r9757
5390a19276j8148Q9567k1233j5390K3883M0581n0206M0871K1770p713J31155J15498
5378B31359j19241j23121L9416L4533m9315P1848k7145n9917N1397j7815o697
5367B5302Q973K892M6454o5247j30070P6571j8424k1682R5636M1681r4872r3618
5355a26404k1426Q3592j751j5837J6705N4920j2274L4600l092l5460J2022M6177
5343C1772P4013j51752j23268K6865J7408j39087L0222J7086o1750r354P2372
$$ plain form
5332 -215473 -166762 -63108 -102086 -69048 -65007 -56622 -99522 -82535 -107460 -88062 18522 26016
5320 26016 117417 207005 44859 -27212 -47405 -127497 -160398 -159920 -52044 20809 -99259 -230630
5308 -230630 -127463 -67256 25900 18995 -97043 -87547 -64 -23978 15155 79665 -4026 -50514
5296 -50514 -84087 53869 80992 -44993 -9323 -28197 -102190 -78213 -100805 -66554 -97714
5285 -97714 -70382 -15456 -43828 -71105 -87451 11678 102758 45519 4245 -44913 -95725 -132691
5273 -132691 -101059 -95350 -145172 -81026 -110169 -104619 -24042 -58788 -71812 -165367 -191638 -149470
5261 -149470 -86638 -112656 -93333 33190 26755 -125869 -88217 9866 131410 108902 57169
5250 57169 27624 87625 52052 54267 63195 55490 95292 46629 509 21884 7446 63433
$$ packed form
5332b15473M8711J03654l8978L3038M041Q385m2900J6987k4925J9398J06584P494
5320B6016R1401Q9588j62146p2071k0193q0092l2901M78J07876P2853j20068j31371
5308b30630J03167O0207R3156o905j16038R496Q7483k3914L9133O4510q3691m6488
5296e0514l3573J37956K7123j25985L5670j8874p3993K3977k2592L4251l1160
5285i7714K7332N4926k8372k7277j6346R9129R1080n7239m1274m9158n0812l6966
5273a32691L1632N709m9822O4146k9143N550Q0577l4746j3024r3555k6271M2168
5261a49470O2832k6018J9323J26523o435j52624L7652R8083J21544k2508n1733
5250E7169k9545O0001l5573K215Q928p705L9802m8663m6120K1375j4438N5987
$$ plain form
5238 63433 166450 229333 168259 47222 -100221 -120508 -60102 72115 115523 142351 113540
5227 113540 59676 -62271 -107722 -101427 -125554 -85001 -129439 -151842 -39930 35956 61657
5216 61657 105607 204419 220018 196775 132825 67205 31482 -31921 74 12729 -17664 84696
5204 84696 128631 46374 -92443 -241723 -250461 -222146 -232040 -140011 41425 151265 125617
5193 125617 152487 148552 155159 134645 168786 68057 37681 -63969 -180252 -113989 -100056
5182 -100056 -80751 -88220 -45349 -85457 -84235 -167416 -254864 -129070 -48804 -46873 -56436 29270
5170 29270 120254 60705 26702 55569 101345 -1629 -68162 32274 71029 -85934 -127143
5159 -127143 -37555 -27064 -90247 -52813 -25255 111326 149246 98930 39984 128316 184953
$$ packed form
5238F3433J03017O2883o1074j21037j47443k0287O0406J32217M3408K6828k8811
5227A13540n3864j21947m5451O295k4127M0553m4438k2403J11912P5886K5701
5216F1657M3950R8812J5599k3243o3950o5620l5723o3403L1995J2655l0393J02360
5204H4696M3935q2257j38817j49280q738K8315r894R2029J81436J09840k5648
5193A25617K6870l935O607k0514L4141j00729l0376j01650j16283O6263J3933
5182a00056J9305p469M2871m0108J222q3181q7448J25794Q0266J931r563Q5706
5170B9270R0984n9549l4003K8867M5776j02974o6533J00436L8755j56963m1209
5159a27143Q9588J0491o3183L7434K7558J36581L7920n0316n8946Q8332N6637
$$ plain form
5148 184953 74366 2360 -34314 -14369 -41996 -97077 -132498 -130553 -111311 -88493 -92894 -114695
5136 -114695 -204297 -86429 -143560 -153619 -141343 -153066 -138352 -94797 25315 52016 56164
5125 56164 57834 36140 -26590 -56779 -22228 20711 -34479 -172909 -213040 -112531 -88920 -36282
5113 -36282 -45 19557 97099 198169 204314 105285 -24501 -55660 -15121 6680 -1730 12085
5101 12085 -98000 -177944 -181487 -87840 -98837 -94107 -20981 50633 35534 40222 -76792 -27853
5089 -27853 27659 -34255 -1563 -17564 -26430 -13990 -45915 -89258 -50041 -16219 38971 203029
5077 203029 153119 98268 62226 69880 73795 49145 -9222 -163722 -75739 2246 -32985 -36513
5065 -36513 75648 92983 60998 -12032 19383 42119 42042 82512 20012 13301 42628 63922
$$ packed form
5148A84953j10587p2006l6674J9945k7627n5081l5421J945J9242K2818m401k1801
5136a14695q9602J17868n7131j0059J2276j1723J4714M3555J20112K6701M148
5125E6164J670k1694o2730l0189L4551M2939n5190j38430m0131J00509K3611N2638
5113c6282L6237J9602P7542J01070O145r9029j29786l1159M0539K1801q410J3815
5101A2085j10085p9944l543R3647j0997M730P3126P1614j5099M688j17014M8939
5089b7853N5512o1914L2692j6001q866J2440l1925m3343L9217L3822N5190J64058
5077B03029m9910n4851l6042P654L915k4650n8367j54500Q7983P7985l5231l528
5065c6513J12161J7335l1985p3030L1415K2736p7M0470o2500o711K9327K1294
$$ plain form
5053 63922 32788 -17201 -17707 50103 39014 36836 -18641 -29321 -1834 12788 -51216 -33394
5041 -33394 90029 158746 138837 110792 26629 -66109 -32823 -16072 -52831 -37678 -31074 -20673
5029 -20673 19028 -29470 -58175 -23579 -124769 -66323 41428 96977 105887 69775 -10635 -27481
5017 -27481 97207 79740 -14349 -59247 -96463 -162644 -94456 -26257 62782 125724 2966
5006 2966 -58838 -76858 6291 -58390 -94292 -33514 52991 47732 -28375 -120792 -195728 -200335
4994 -200335 -252664 -166335 -9571 129001 132186 145628 115691 55274 60683 57105 43778 49710
4982 49710 -16408 9152 4314 7079 -86952 -100217 -98951 -66369 -148356 -201331 -46490 20340
4970 20340 16819 -112322 -126501 -129218 -179583 -154640 -56526 94303 -36163 -71559 3929 -69388
$$ packed form
5053F3922l1134m9989n06O7810j1089k178n5477j0680K7487J4622o4004J7822
5041c3394J23423O8717j9909k8045q4163r2738L3286J6751l6759J5153O604J0401
5029b0673L9701m8498k8705L4596j01190N8446J07751N5549Q910l6112q0410j6846
5017b7481J24688j7467r4089m4898l7216o6181O8188O8199Q9039O2942j22758
5006B966o1804j8020Q3149o4681l5902O0778Q6505n259p6107r2417p4936m607
4994b00335n2329Q6329J56764J38572L185J3442k9937o0417N409l578j3327N932
4982D9710o6118K5560m838K765r4031j3265J266L2582q1987n2975J54841O6830
4970B0340l521j29141j4179k717n0365K4943R8114J50829j30466l5396P5488p3317
$$ plain form
4958 -69388 22666 137358 162582 88585 53633 64696 74483 -17942 -96070 -54502 -24687 -32756
4946 -32756 14978 -38164 -74260 2747 85486 100825 -7850 -125899 -141302 -116225 -91000
4935 -91000 -84774 -31145 30107 9513 -11589 -63867 -21876 -81454 -140432 -168053 -200326 -110452
4923 -110452 -32972 -80685 -55620 -40399 -53973 -47580 -58483 -8881 113538 182145 83458 -21793
4911 -21793 55844 92877 113270 148279 137118 143505 63930 18138 34017 -18409 1625 -8087
4899 -8087 -111274 -124900 -76760 -133478 -79804 -43395 -74722 -1917 -13820 20880 56195 92930
4887 92930 33711 -138849 -264290 -223318 -128238 93916 203124 235316 108425 -60078 -90961
4876 -90961 -133819 -176456 -125719 -30218 22751 -87433 -183694 -118393 -57680 -57272 -107983 -64632
$$ packed form
4958f9388R2054J14692K5224p3997l4952J1063R787r2425p8128M1568K9815q069
4946c2756M7734n3142l6096P7007Q2739J5339j08675j18049j5403K5077K5225
4935i1000O226N3629O1252k0594k1102n2278M1991n9578n8978k7621l2273Q9874
4923a10452P7480m7713K5065J5221j3574O393j0903M9602J22419O8607r8687j05251
4911b1793P7637L7033K0393L5009j1161O387p9575m5792J5879n2426K0034r712
4899h087j03187j3626M8140n6718N3674L6409l1327P2805j1903L4700L5315L6735
4887I2930n9219j72560j25441M0972R5080K22154J09208L2192j26891j68503l0883
4876i0961m2858m2637N0737R5501N2969j10184r6261O5301O0713M08n0711M3351
$$ plain form
4864 -64632 -141860 -155947 -158203 -170661 -145542 -144668 -156172 -90072 -44332 68958 24520 -26100
4852 -26100 137443 103927 14854 14273 -53398 -83447 -103396 -128753 -14593 3452 -58761 -36218
4840 -36218 55651 120437 162614 132399 45929 -49440 -115852 -61008 -89763 -136421 -4245 51833
4828 51833 102138 120336 181155 130287 7988 13195 47341 69873 104521 -48589 -95991 -95791
4816 -95791 -43426 22542 -46324 -56285 -22080 5153 -6025 -1228 15887 42591 70252 9044
4804 9044 -67807 -32203 -71346 -86364 -65494 -42654 -50272 -72242 -29947 23392 -25599 -106952
4792 -106952 -87918 -45535 -45094 16138 38499 -33576 -86837 -47383 -98900 -74724 42446 135596
4780 135596 83128 174176 308554 210521 35015 -30505 -38222 -12008 91279 46492 100547
$$ packed form
4864f4632p7228j4087k256j2458K5119Q74j1504O6100M5740J13290m4438n0620
4852b6100J63543l3516q9073n81o7671l0049j9949k5357J14160J8045o2213K2543
4840c6218R1869O4786M2177l0215q6470r5369o6412N4844k8755m6658J32176N6078
4828E1833N0305J8198O0819n0868j22299N207L4146K2532L4648j53110m7402K00
4816i5791N2365O5968o8866r961L4205K7233j1178M797J7115K6704K7661o1208
4804I044p6851L5604l9143j5018K0870K2840p618k1970M2295N3339m8991q1353
4792a06952J9034M2383M41O1232K2361p2075n3261L9454n1517K4176J17170R3150
4780A35596n2468R1048J34378r8033j75506o5520p717K6214J03287m4787N4055
$$ plain form
4769 100547 90452 -65075 -154023 -146438 -125915 -32645 -41580 8262 -40152 -37471 56915 119498
4757 119498 66473 -17221 25438 -48400 33053 -6843 -91635 -185491 -207955 -137277 -77688 -123105
4745 -123105 -115853 -145771 -195429 -259560 -210305 -134911 -110986 -57678 24854 -8821 -87640 -107625
4733 -107625 -39271 -62185 18340 205766 213952 158522 77036 77137 28944 -87162 -74292 -110708
4721 -110708 -6586 174397 148891 103849 39931 51819 61998 132072 84500 -20679 -896
4710 -896 -44425 -96661 42421 148867 156351 143938 42982 17148 -61642 -98562 -31097 89019
4698 89019 85166 29942 -104138 -199387 -228027 -204787 -140927 -219606 -223507 -126526 -30112 -56600
4686 -56600 -145697 -31667 34137 2897 -30362 -88703 -25283 56722 88274 -29044 -104708
$$ packed form
4769A00547j0095j55527q8948P585K0523R3270q935M9842m8414K681R4386O2583
4757A19498n3025q3694M2659p3838Q1453l9896q4792r3856k2464P0678N9589m5417
4745a23105P252k9918m9658o4131M9255P5394K3925N3308Q2532l3675p8819j9985
4733a07625O8354k2914Q0525J87426Q186n5430q1486J01m8193j16106J2870l6416
4721a10708J04122J80983k5506m5042o3918J1888J0179P0074m7572j05179J9783
4710h96m3529n2236J39082J06446P484j2413j00956k5834p8790l6920O7465J20116
4698H9019l853n5224j34080r5249k8640K3240O3860p8679l901R6981R6414k6488
4686e6600q9097J14030O5804l1240l3259n8341O3420Q2005L1552j17318p5664
$$ plain form
4675 -104708 -44445 -12585 16642 -93869 -120819 -5761 50867 -14523 -74664 -122053 -111210
4664 -111210 -79431 -159292 -77653 -65451 -15894 58911 21630 -16459 -14734 62542 93673 84522
4652 84522 123746 180016 48981 27192 -13060 -33895 22402 127217 120205 87875 87687 77911
4640 77911 114606 37871 9856 58694 86674 157469 135766 113160 9675 18965 40654 51724
4628 51724 4724 -44271 -44181 -59222 12924 51484 -24752 -1127 32620 134904 196099 117193
4616 117193 62624 34621 159 42466 82684 175593 159183 168926 144121 115887 95157 161023
4604 161023 200688 113940 106356 26073 -21583 46203 13735 50109 43686 62728 158669 172281
4592 172281 102332 13589 25428 70982 79220 38807 6456 -97996 -66913 45940 50158 5689
$$ packed form
4675a04708O0263L1860K9227j10511k6950J15058N6628o5390o0141m7389J0843
4664a11210L1779p9861Q1639J2202M9557P4805l7281l8089J725P7276L1131r151
4652H4522L9224N6270j31035k1789m0252k0835N6297J04815p012l2330j88r776
4640G7911L6695p6735k8015M8838K7980P0795k1703k2606j03485R290K1689J1070
4628E1724m7000m8995R0j5041P2146L8560p6236K3625L3747J02284O1195p8906
4616A17193n4569k8003l4462M2307M0218R2909j6410R743k4805k8234k0730O5866
4604A61023L9665q6748p584q0283m7656O7786l2468L6374o423J9042R5941J3612
4592A72281o9949q8743J1839M5554Q238m0413l2351j04452L1083J12853M218m4469
$$ plain form
4580 5689 -5854 -22384 -113950 -134047 -127513 891 39446 12619 126314 128048 156754 130856
4568 130856 60504 75684 46645 8660 -113510 -176171 -162281 -141104 -164942 -20621 29939
4557 29939 -75834 -183286 -277583 -190483 -162911 -17320 13006 17574 175792 52028 -84861
4546 -84861 41841 165371 51314 49347 88210 77724 34621 92292 188918 205341 225020
4535 225020 193598 59633 13094 9807 46280 796 -47650 -27175 -11316 1331 101500
4524 101500 157930 2659 -51050 -306 -73546 -35601 75607 65505 16134 41853 -12553
4513 -12553 -3281 6513 -23456 -29007 52911 69800 43205 35688 9303 -29081 -39153 18224 -23876
4500 -23876 -4776 44611 -1939 -134385 -178145 -136149 -56350 -24687 -95064 -46427 24072 -26745
$$ packed form
4580E689j1543j6530r1566k0097O534J28404L8555k6827J13695J734K8706k5898
4568A30856p0352J5180k9039l7985j22170o2661J3890K1177k3838J44321N0560
4557B9939j05773j07452r4297Q7100K7572J45591L0326M568J58218j23764j36889
4546h4861J26702J23530j14057j967L8863j0486m3103N7671R6626J6423J9679
4535B25020l1422j33965m6539l287L6473m5484m8446K0475J5859J2647J00169
4524A01500N6430j55271n3709N0744p3240L7945J11208j0102m9371K5719n4406
4513a2553R272R794k9969n551Q1918J6889k6595p517k6385l8384j0072N7377m2100
4500b3876J9100M9387m6550j32446m3760M1996P9799L1663p0377M8637P0499n0817
$$ plain form
4488 -26745 -23249 -2619 98176 117297 344 4688 19923 68837 124511 101285 -8472 -75919
4476 -75919 38965 8009 21491 32449 -8579 -155010 -124057 -66576 -172543 -274912 -258947
4465 -258947 -151374 -152633 -91509 -65977 -68693 -44844 -146043 -125688 130552 137956 59109 30015
$$ packed form
4488b6745L496K0630J00795J9121j16953M344J5235M8914N5674k3226j09757o7447
4476g5919J14884l0956J3482J0958m1028j46431L0953N7481j05967j02369J5965
4465b58947J07573j259O1124K5532k716K3849j01199K0355K56240P404p8847k9094
$$ [...]
##END NTUPLES=NMR SPECTRUM
##END=
