##TITLE=Analysis number 320608
Compound Code cc 45809
Book Reference 468/91
Project Code adrs
Chemist Name colinb
##JCAMPDX= 6.0         $$ Bruker NMR JCAMP-DX V2.0
##DATA TYPE= NMR SPECTRUM
##DATA CLASS= NTUPLES
##ORIGIN= Bruker BioSpin GmbH
##OWNER= nmr
$$ XWIN-NMR		Version 3.5
$$ Mon Jul  3 08:35:15 2006 GMT Daylight Time (UT+1h)  MAYBRIDGE\nmr@NMR_250MHZ
##.OBSERVE FREQUENCY= 250.131544655141
##.OBSERVE NUCLEUS= ^1H
##.ACQUISITION MODE= SIMULTANEOUS (DQD)
##.ACQUISITION SCHEME= undefined
##.AVERAGES= 16
##.DIGITISER RES= 18
##SPECTROMETER/DATA SYSTEM= dpx250
##.PULSE SEQUENCE= zg30
##.SOLVENT NAME= CDCl3
##.SHIFT REFERENCE= (INTERNAL, CDCl3, 0, 16.522)
##AUDIT TRAIL= $$ (NUMBER, WHEN, WHO, WHERE, WHAT)
$$ ##TITLE= Audit trail, XWIN-NMR		Version 3.5
$$ ##JCAMPDX= 5.01
$$ ##ORIGIN= Bruker BioSpin GmbH
$$ ##OWNER= nmr
$$ C:\u/data/dgb/nmr/ADRS/2020/pdata/1/auditp.txt
$$ ##AUDIT TRAIL=  $$ (NUMBER, WHEN, WHO, WHERE, WHAT)
(   1,<2006-07-03 08:34:48.95 +100>,<MAYBRIDGE\nmr>,<NMR_250MHZ>,
      <created by zg, POWCHK disabled, PULCHK disabled
       configuration hash MD5:
       E2 DF 36 D8 04 B2 41 60 5A D7 A3 38 5A 4B D0 FE
       data hash MD5: 64K
       8D F7 C8 79 54 55 52 BD 5E 69 55 F8 D5 3E 0C B2>)
(   2,<2006-07-03 08:35:04.13 +100>,<MAYBRIDGE\nmr>,<NMR_250MHZ>,
      <Start of raw data processing
       ef LB = 0.3 FT_mod = 6 PKNL = 1 SI = 32K 
       data hash MD5: 32K
       F6 CA 49 D6 56 E7 AA D5 D9 59 97 0C C6 46 E1 E6>)
(   3,<2006-07-03 08:35:05.63 +100>,<MAYBRIDGE\nmr>,<NMR_250MHZ>,
      <apk 
       data hash MD5: 32K
       3C FA 88 1B 20 5E 2C 39 36 E1 98 31 33 1B 8B E7>)
(   4,<2006-07-03 08:35:06.49 +100>,<MAYBRIDGE\nmr>,<NMR_250MHZ>,
      <abs ABSG = 5 
       data hash MD5: 32K
       10 F5 61 FC F4 D6 E1 49 E8 99 FC 31 41 22 D7 1B>)
$$ ##END=
$$ 
$$ hash MD5
$$ 05 B0 0E 61 AC 3F E8 FF 7D AF E7 F0 42 5E 83 19
##$RELAX= 
##$RELAX= 
##$RELAX= 
##$RELAX= 
##$RELAX= 
##$RELAX= 
##$RELAX= 
$$ Bruker specific parameters
$$ --------------------------
##$DU= <C:\u>
##$EXPNO= 2020
##$NAME= <ADRS>
##$PROCNO= 1
##$TYPE= <nmr>
##$USER= <dgb>
##$AMP= (0..31)
100 100 100 100 100 100 100 100 100 100 100 100 100 100 100 100 100 100 
100 100 100 100 100 100 100 100 100 100 100 100 100 100 
##$AQSEQ= 0
##$AQ_mod= 3
##$AUNM= <au_zg>
##$AUTOPOS= <3 >
##$BF1= 250.13
##$BF2= 250.13
##$BF3= 250.13
##$BF4= 250.13
##$BF5= 500.13
##$BF6= 500.13
##$BF7= 500.13
##$BF8= 500.13
##$BYTORDA= 1
##$CFDGTYP= 0
##$CFRGTYP= 5
##$CHEMSTR= <none>
##$CNST= (0..31)
1 1 145 1 1 1 1 1 1 1 1 1 1 1 1 1 1 1 1 1 1 1 1 1 1 1 1 1 1 1 1 1 
##$CPDPRG= <>
##$CPDPRG1= <>
##$CPDPRG2= <>
##$CPDPRG3= <>
##$CPDPRG4= <mlev>
##$CPDPRG5= <mlev>
##$CPDPRG6= <mlev>
##$CPDPRG7= <mlev>
##$CPDPRG8= <mlev>
##$CPDPRGB= <>
##$CPDPRGT= <>
##$D= (0..31)
0 1 0 0 0 0 0 0 0 0.06 0 0 0 0 0 0 0.0002 0 0 0 0 0 0 0 0 0 0 0 0 0 0 
0 
##$DATE= 1151912087
##$DBL= (0..7)
120 120 120 120 120 120 120 120 
##$DBP= (0..7)
150 150 150 150 150 150 150 150 
##$DBP07= 0
##$DBPNAM0= <>
##$DBPNAM1= <>
$$ [...]
##$SUBNAM7= <"">
##$SUBNAM8= <"">
##$SUBNAM9= <"">
##$SW= 20.6930455092707
##$SWIBOX= (0..15)
0 0 3 0 0 0 0 0 0 0 0 0 0 0 0 0 
##$SW_h= 5175.983436853
##$TD= 65536
##$TD0= 1
##$TE= 298.16
##$TE2= 300
##$TE3= 300
##$TEG= 300
##$TL= (0..7)
0 120 120 120 120 120 120 120 
##$TP= (0..7)
150 150 150 150 150 150 150 150 
##$TP07= 0
##$TPNAME0= <>
##$TPNAME1= <>
##$TPNAME2= <>
##$TPNAME3= <>
##$TPNAME4= <>
##$TPNAME5= <>
##$TPNAME6= <>
##$TPNAME7= <>
##$TPOAL= (0..7)
0.5 0.5 0.5 0.5 0.5 0.5 0.5 0.5 
##$TPOFFS= (0..7)
0 0 0 0 0 0 0 0 
##$TUNHIN= 0
##$TUNHOUT= 0
##$TUNXOUT= 0
##$USERA1= <user>
##$USERA2= <user>
##$USERA3= <user>
##$USERA4= <user>
##$USERA5= <user>
##$V9= 5
##$VALIST= <valist>
##$VCLIST= <CCCCCCCCCCCCCCC>
##$VD= 0
##$VDLIST= <DDDDDDDDDDDDDDD>
##$VPLIST= <PPPPPPPPPPPPPPP>
##$VTLIST= <TTTTTTTTTTTTTTT>
##$WBST= 1024
##$WBSW= 4
##$XGAIN= (0..3)
0 0 0 0 
##$XL= 0
##$YL= 0
##$YMAX_a= 338767
##$YMIN_a= -536091
##$ZGOPTNS= <>
##$ZL1= 120
##$ZL2= 120
##$ZL3= 120
##$ZL4= 120
##$ABSF1= 16.522
##$ABSF2= -4.171173
##$ABSG= 5
##$ABSL= 3
##$ALPHA= 0
##$AQORDER= 0
##$ASSFAC= 0
##$ASSFACI= 0
##$ASSFACX= 0
##$ASSWID= 0
##$AUNMP= <proc_1d>
##$AZFE= 0.1
##$AZFW= 0.1
##$BCFW= 0
##$BC_mod= 0
##$BYTORDP= 0
##$COROFFS= 0
##$CY= 12.5
##$DATMOD= 1
##$DC= 0
##$DFILT= <>
##$DTYPP= 0
##$F1P= 14.0000005364418
##$F2P= -0.99999901652339
##$FCOR= 0.5
##$FTSIZE= 32768
##$FT_mod= 6
##$GAMMA= 0
##$GB= 0
##$INTBC= 1
##$INTSCL= 1
##$ISEN= 128
##$LB= 0.3
##$LEV0= 0
##$LPBIN= 0
##$MAXI= 10000
##$MC2= 0
##$MEAN= 0
##$ME_mod= 0
##$MI= 0
##$NCOEF= 0
##$NC_proc= -3
##$NLEV= 6
##$NOISF1= 0
##$NOISF2= 0
##$NSP= 0
##$NTH_PI= 0
##$NZP= 0
##$OFFSET= 16.522
##$PC= 1
##$PHC0= 159.6326
##$PHC1= 8.521518
##$PH_mod= 1
##$PKNL= yes
##$PPARMOD= 0
##$PSCAL= 4
##$PSIGN= 0
##$REVERSE= no
##$SF= 250.13
##$SI= 32768
##$SIGF1= 0
##$SIGF2= 0
##$SINO= 400
##$SIOLD= 32768
##$SREGLST= <1H.CDCl3>
##$SSB= 0
##$STSI= 32768
##$STSR= 0
##$SW_p= 5175.98343685301
##$SYMM= 0
##$S_DEV= 0
##$TDeff= 65536
##$TDoff= 0
##$TI= <Analysis number 999999
Compound Code 99
Book Reference 9
Project Code 9>
##$TILT= no
##$TM1= 0
##$TM2= 0
##$TOPLEV= 0
##$USERP1= <user>
##$USERP2= <user>
##$USERP3= <user>
##$USERP4= <user>
##$USERP5= <user>
##$WDW= 1
##$XDIM= 32768
##$YMAX_p= 362268256
##$YMIN_p= -134523
$$ End of Bruker specific parameters
$$ ---------------------------------
##NTUPLES= NMR SPECTRUM
##VAR_NAME=  FREQUENCY,     SPECTRUM/REAL,   SPECTRUM/IMAG
##SYMBOL=    X,             R,               I
##VAR_TYPE=  INDEPENDENT,   DEPENDENT,       DEPENDENT
##VAR_FORM=  AFFN,          ASDF,            ASDF
##VAR_DIM=   32768,         32768,           32768
##UNITS=     HZ,            ARBITRARY UNITS, ARBITRARY UNITS
##FACTOR=    0.157963299565203, 1,           1
##FIRST=     4132.6476996994, 0,             0
##LAST=      -1043.33573715361, 0,           0
##MIN=       -1043.33573715361, -134523,     0
##MAX=       4132.6476996994, 362268256,     0
$$ Real data points
##PAGE= N=1
##DATA TABLE= (X++(R..R)), XYDATA
$$ [...]
22893 39551 37045 14273 13554 991 21420 47858 22283 -15561 13234 -15022 -38867 -44496
22881 -44496 -26812 10764 27229 20465 38735 12158 19074 44309 3128 -25552 -18646 -25913
22869 -25913 -24130 -21210 -44163 -32790 -7148 -4305 522 -10197 -15638 -25565 -4487 18092 61038
22856 61038 117777 167609 205113 233122 231947 212676 210643 170048 101985 56970 53614 40166
22844 40166 37528 46594 52468 70748 78777 46741 15625 -24429 -40263 -21864 -6175 -6876 5251
22831 5251 17501 7592 -341 1648 -7715 -2408 4185 -13842 -43345 -77194 -87975 -45437 -17691
22818 -17691 -15560 -19881 -16753 -5897 -952 5331 -12856 -25471 3437 5381 4995 -6888 -10209
22805 -10209 18373 -1078 -18776 -1212 21691 3500 -1158 -33159 -44490 -23458 -6755 -4512
22793 -4512 13181 -256 -23225 -6783 14596 27396 30611 13326 -19578 -32713 16229 35197
22781 35197 19351 36630 46331 7039 2565 -2670 -8885 8668 3521 13090 15584 23606 6746
22768 6746 82 -16574 2045 12658 -15911 -26110 -1751 -6861 -3179 5696 -29406 -52407 -60179
22755 -60179 -50187 -24857 -13687 -3353 13996 9887 14623 12602 16551 17560 4090 7426 -16807
22742 -16807 -57905 -48373 -31073 -11958 -3292 12773 13174 -10563 -24334 -27916 -35345 -20003 13003
22729 13003 12107 -10561 -7834 -12378 -1905 16052 32429 29708 23512 30535 26240 33699 33072 16392
22715 16392 -17690 -47495 -19166 3385 14551 20791 44105 37310 29411 21240 6742 15178 39326
22702 39326 53913 78430 35324 -14948 2312 31859 34353 18238 25631 19848 8179 -11844
22690 -11844 -26150 -13437 2832 -1334 4794 -13256 -19470 -31288 -21862 -12039 -5516 -819 -8950
22677 -8950 514 19527 28596 26062 -2138 -9912 19556 27921 10409 -2780 23585 36016 47985
22664 47985 38037 28861 23951 16625 15916 42341 50660 47291 42911 28630 59273 23652 -21284
22651 -21284 -5250 20115 9041 24066 55025 49844 27792 3475 4747 16502 -9295 -10165
22639 -10165 12546 3600 13448 2038 -12233 -23535 -13289 -4739 -9573 -4086 427 10421 3712
22626 3712 1399 -15924 4429 11262 -4958 -17292 -23599 -44742 -25581 17028 11777 29548 35337
22613 35337 42317 52925 52314 37141 17342 34499 21741 11495 8991 13538 16126 -1475 8826
22600 8826 6964 5865 6144 -20620 -63221 -70811 -43376 -14556 -1150 -19527 -33598 -5440 3033
22587 3033 1979 1425 -23637 -9149 -8710 -8616 -1406 -2998 19795 17747 8481 -766 -14639 -37663
22573 -37663 -32156 -53930 -31057 4607 3957 -21075 -27845 -34338 -31768 -11421 -31645 -28796 -32788
22560 -32788 -52921 -33728 -12487 9037 9785 12052 12190 -5241 -7028 -1945 11545 16128 29287
22547 29287 38576 31039 34654 49661 69004 63507 57736 71770 61886 20768 -10332 18534 41590
22534 41590 38757 31231 37590 21359 7851 15946 -12875 -15841 -7477 24463 41012 28737 48422
22521 48422 46710 52787 54165 18941 -1432 -11532 11197 10505 -4775 -7902 -18335 -32162 -28022
22508 -28022 -29266 -45895 -25400 3614 4589 18975 17217 12820 6668 6822 12183 6886 21910 50558
22494 50558 14049 -4085 -22322 -28125 -19386 -26703 -48413 -33006 -17384 -4383 -21586 -31687
22482 -31687 -15249 -7787 -7469 -47213 -55984 -38440 -31 -21250 -11140 -20927 -13936 12040 14203
22469 14203 13092 -24250 -49687 -48036 -27873 23889 30422 15835 15897 33724 5715 -16831 -10135
22456 -10135 -12098 -14483 4212 2483 -5971 -2893 -9771 -6865 26461 32420 29468 17032 -14880
22443 -14880 -24061 -12725 2852 17771 16249 3141 -31001 -49785 -29184 7828 37530 31028
22431 31028 21661 -1383 -30387 -41815 -32029 -37994 -31122 6328 11166 30769 26839 43420 73704
22418 73704 59021 20374 -17686 -10585 -31741 -24207 -35711 -46147 -44415 -53082 -20130 13300
22406 13300 13273 -24599 -44008 -54090 -37668 -33352 -43390 -24688 -17667 2011 20657 -26465 -68922
22393 -68922 -51845 -38426 -24977 -34748 -17027 -13845 4955 -26154 -13705 14734 33319 -3643
22381 -3643 8021 25256 52996 61988 35053 -206 -7581 12193 26542 4645 -1331 28751
22369 28751 35888 35638 36502 16175 12888 11643 14195 4051 13201 26623 22193 39022 34067 17009
22355 17009 2601 -8390 -34684 -21420 412 -17824 -8113 -20125 -25764 -4537 -5876 -1715
22343 -1715 5446 -8652 -38218 -35397 -20566 -43719 -26120 -10963 434 10047 1108 -6661 -10076
22330 -10076 -12367 -22424 -11580 -16917 -22486 -18580 -13474 -6227 -6026 3968 707 -25924 -25397 -41424
22316 -41424 -51692 -10788 -7277 -17806 -40495 -43107 -38385 -12733 11388 -6085 11891 26840
22304 26840 32550 33404 23150 1380 -18897 -30773 -18110 -14707 -12637 -9145 -2969 4214 -5954
22291 -5954 -30342 -9670 36156 66421 54705 22108 6869 -28608 -32670 -14089 -19608 -17127
22279 -17127 -33434 -11366 -4157 -45017 -38159 -6720 3635 32325 54061 20154 -8023 -26029
22267 -26029 -39623 -33705 -10428 -7076 -11128 -10338 1830 22624 6537 -42067 -48714 -38012 -36500
22254 -36500 -37288 -31761 -14638 -162 -22151 -5348 29419 23764 3563 3806 16390 30504 16680
22241 16680 -9945 -8576 -21809 -44435 -51865 -30778 -2793 -6982 -18504 -28463 -29526 -11551 -16076
22228 -16076 -33846 -49008 -50628 -32945 -31017 -37064 -33953 -6924 -9721 -27070 -26368 -23891 -2550
22215 -2550 3968 -11636 -10046 -9458 -5818 6595 23267 20869 9134 -6925 -14849 -7380 32217
22202 32217 52248 35403 -198 7925 -16247 -23875 -25681 -31767 -19207 -21349 -18080 -7163 9365
22189 9365 16946 8064 -879 -5453 334 3462 12488 30820 38618 22544 6322 28248 8832
22176 8832 19185 27411 40719 47187 20716 23579 17817 10575 286 -599 -9712 -16027 34913 57447
22162 57447 11488 -29767 -28980 -39412 -18423 -28704 13332 39865 21737 3116 -6811 10281
22150 10281 20250 38092 10954 8535 15993 -15876 -15734 -16522 -1570 14370 -8343 -11164 15576
22137 15576 2659 -12814 -1144 21484 31609 41656 21401 -1459 -7283 2144 -8551 19494
22125 19494 19971 19304 2122 12052 7903 -3645 8388 13659 2968 24615 15736 12612 -2558
22112 -2558 -2833 -2757 -4364 20751 27791 19998 14837 24831 39175 15250 12866 2204 3609 6793
22098 6793 1419 -18430 12059 2498 -27908 -24412 -15189 -25984 -35419 -23818 -25644 -39385 -39436 -10849
22084 -10849 6241 -20177 -29809 10534 46481 43049 13081 18875 38644 12540 4254 4402 36547
22071 36547 56222 37223 40114 36808 42845 -5777 -36637 -7411 -7746 -30060 -15309 21542 35889
22058 35889 33368 27325 15157 14855 28297 31939 -254 -14153 -34387 -13384 19753 22278 14777
22045 14777 32862 21144 -13300 -9551 -5107 -23783 -28261 -301 -34876 -35741 19406 28516 16863
22032 16863 18096 -8598 -40321 -21437 6329 2535 12719 -12443 -12188 -5970 32230 40760 20524
22019 20524 -3522 -3426 12987 17880 10089 -9812 -19967 6629 17811 1440 -10546 -42572 -67841
22006 -67841 -69331 -70327 -89371 -80087 -54644 -23840 -7848 -1267 -5178 2634 22749 16080 23872
21993 23872 21863 3298 -20292 -76877 -70506 -29324 11648 4633 -8363 3524 -2479 10458
21981 10458 3112 -5923 -16465 -16262 -43028 -67760 -60161 -75638 -49686 -14970 1224 -6159 3942
21968 3942 10199 29112 37094 20275 4328 -4746 -22361 -28890 -20586 -20706 -10408 -30477 -55507
21955 -55507 -17551 -18358 -35598 -27351 -32682 -2472 33752 17779 -1338 3515 -22161 -27070 -30165
21942 -30165 -13894 -4155 -12348 -10221 29137 14586 -10527 -42216 -52466 -43933 -30733 -31005 -30514
21929 -30514 5322 -21758 -51977 -23441 -1988 7877 1444 -6881 -17223 -20501 -27618 -42586 -15323
21916 -15323 13284 16563 24086 -1353 -8201 -5757 -33583 -30789 5921 14778 14955 8013 11562 24466
21902 24466 36580 38431 40341 18957 29501 15558 28623 37747 39143 55933 48078 18732 4702
21889 4702 -11626 -14598 -18468 -432 36745 68101 68508 54981 48921 15390 -2816 6298 12319
21876 12319 4373 5065 1891 -11982 -10385 -49508 -57301 -46491 -37130 -42428 -38688 -52397 -81600
21863 -81600 -75176 -70591 -39140 -20410 2859 5337 -5784 -17877 7344 9968 -4909 -6085 9694
21850 9694 6741 -191 39084 23337 5014 -3398 20181 30742 25978 32689 3439 -1698 -2127
21837 -2127 -2892 14483 37244 60543 10864 -32218 -18450 -9897 -27255 -44602 -38142 -27373 -19922
21824 -19922 -2330 33640 37318 47079 84855 77419 28090 -1955 18115 5705 -24217 -6277
21812 -6277 14648 -1929 -42918 -24592 -10267 -18053 -12091 -8492 -17725 -10064 2625 17891 30529
21799 30529 19718 -21496 -871 24375 36423 13559 -1891 -1405 -6964 4885 33298 38755
21787 38755 13985 2922 -4356 -9224 8492 -6213 -24968 -10085 20967 8776 -17757 -39840
21775 -39840 -32210 -16861 -20887 -11644 763 15100 27054 27531 -8799 -5314 4642 -6911 -29672
21762 -29672 -42825 -17683 1192 27824 18647 -155 -10742 22628 56025 51992 23744 8785
21750 8785 7180 7310 15263 22268 17844 17831 -6464 14203 38711 17250 -12111 -9243 -17852 10098
21736 10098 15189 10474 141 -28168 -53297 -28686 1279 -19821 -25514 3054 -9429 -27894
21724 -27894 -36640 -45750 -804 27794 32273 12954 15876 23367 9056 -21580 -19769 2263 25471
21711 25471 19456 18904 21940 -26657 -35419 -21879 5837 18036 -4304 -22637 -3736 8722 -3573
21698 -3573 9358 17721 10165 33474 59892 66431 61017 15552 20353 24541 16592 12138 1618
21685 1618 -38484 -52223 -36003 25824 66350 27854 -5095 9984 20633 20768 19192 -14017
21673 -14017 -50477 -17982 4482 31727 28040 8898 -2672 11338 4235 9333 12519 35851
21661 35851 36883 32963 24415 1516 -20409 -31210 13388 20904 23126 42102 64487 51061 39081
21648 39081 22573 18413 9167 12706 8749 12760 23330 5183 -32351 -32620 -58285 -65663 -25779
21635 -25779 616 43691 22857 -5940 -16090 -4299 -13293 -57788 -36241 -9645 6543 19858
21623 19858 41619 41876 46907 57601 41552 40978 48433 51027 24704 22225 21136 36839 54157
21610 54157 53675 38484 10805 -3126 -28757 -18418 -13617 -15159 -11923 -16895 -2591 1080 2860
21597 2860 -7301 9611 13997 29045 41601 33107 27026 15431 11250 21001 25265 -67 -30497
21584 -30497 -11028 32659 35371 27987 1096 -9781 -9910 12524 46826 46511 48720 52959 61245
21571 61245 26837 -15593 -47625 -43972 -18483 -8543 -36014 -58053 -51373 -24281 -3870 14535
21559 14535 3623 -3250 23038 9097 -4586 16113 26391 -2969 -29662 -38091 -25261 -40051
21547 -40051 -8477 -758 -15655 12100 14618 -6588 -19107 -4091 -10803 18689 12481 7682 21712
21534 21712 30048 24847 27159 2105 6327 19981 30021 38440 23887 -2173 -9464 -17602 2367
21521 2367 20586 9672 -37004 -58350 -36515 -17846 -17733 -19971 -13840 -8854 -5179 27474 34478
21508 34478 10266 6204 -29866 -40517 -35093 -45937 -41834 -24936 -957 1916 -5044 5607 -7196
21495 -7196 -40368 -33256 -22035 -46980 -35008 -24902 -18054 -18987 493 3444 7301 8580 13069
21482 13069 18256 13292 5005 17649 26767 8349 -15527 -19224 -10666 -9201 -12763 -16733 -27686
21469 -27686 -46964 -38534 -56642 -42248 -3641 8014 16333 -6429 -15980 -34131 -3841 -9194
21457 -9194 -39557 -37016 -27443 -27113 -10855 -18349 -29761 -43946 -40016 -38487 -17488 -20774 -28789 -7524
21443 -7524 -2140 -25167 -37994 -4651 14488 -30387 -44487 -27974 -22825 -13899 -22732 -13841 -3446
21430 -3446 2245 5205 -14513 -47491 -46920 -27651 -120 -4328 -27784 -26187 360 23280 8045
21417 8045 -8565 -27954 -30026 -37350 -28869 -21175 7228 31230 33835 20726 7365 841 -11070
21404 -11070 -29720 -26783 -3653 11396 18183 131 -10510 -35983 -24951 -7110 -26349 -28995
21392 -28995 -45044 -49480 -27486 -7651 -5945 -32594 -42678 -45230 -34310 -34126 -19801 -5190 -5110
21379 -5110 -297 -11469 -35948 -52052 -46854 -11028 -652 -12407 -29305 -31912 -11014 -444
21367 -444 -8103 -24160 -25398 -24532 -32416 -65229 -49391 -37933 4443 11353 18496 14010 20147 6364
21353 6364 -20645 -33916 -29466 -33151 -24512 -5424 -11700 -6517 12615 13102 6799 -12698 -35934
21340 -35934 -38400 -11584 6203 33255 17295 -8446 -6025 -3773 -30917 -13960 14648 -10265
21328 -10265 -23399 -12454 -15767 6752 18244 3887 -3539 635 -6457 -37562 -28624 -22926 -16004
21315 -16004 -17819 -19384 -38118 -5187 7541 -934 -1266 -6578 -36425 -42457 -4805 31524 49484
21302 49484 28613 -1755 -18633 -25437 -30357 -31150 -26600 -8792 -14624 -5352 6615 -15720 -22252
21289 -22252 -36501 -58307 -53106 -28210 -35190 -28344 -29600 -7962 11486 15595 11768 12110 -5885
21276 -5885 -21009 -49545 -47738 -38401 5758 30697 13380 13407 28116 35312 33597 42573 23796
21263 23796 -2743 -12879 -2220 4404 -3743 -22738 -46493 -51970 -34097 12486 11166 -8096
21251 -8096 28735 49517 48915 4140 -29251 -32528 -9425 -4167 -20857 -32258 -56676 -67091 -57055
21238 -57055 -47092 -28083 -12585 -8697 4568 15982 -5268 -9487 -17268 -27463 -16945 -18450 -41792
21225 -41792 -52117 -70543 -53670 -32377 -14327 -11411 -3552 -15155 -44616 -43299 -16017 -13223
21213 -13223 -15973 -6209 -3374 5783 18657 28934 47248 367 -22055 -19135 -19382 -15584 -40073
21200 -40073 -2910 -15674 -34306 -12087 -24190 -56498 -29768 -16542 -35014 -30774 -35414 -44714
21188 -44714 -20405 8146 24229 10455 -9305 -29865 4377 -1577 -7908 387 -23029 -14142
21176 -14142 -4300 28297 53268 33815 14844 1806 -23298 -901 -5664 34236 5157 4959
21164 4959 11306 -23791 -26081 -29504 -50092 -41692 -42251 -3405 35501 22740 -5027 -16710 728
21151 728 -2978 -4501 -20669 -36459 -41992 -17875 -22361 -10362 -6561 -14530 2512 10310 2241 -15190
21137 -15190 -705 15502 7456 -15760 -21005 -33804 -52944 -55980 -27991 -26700 -48528 -36464
21125 -36464 -33183 -48857 -43493 -55286 -53051 -51943 -44709 -27745 -16056 3035 -3383 -16746 -560
21112 -560 27848 30950 13969 18053 36950 23921 -9257 -19006 20403 12098 -4657 -4276 -918
21099 -918 -4432 3413 5964 1006 -26365 -15775 -1712 25624 17455 -3369 6782 27562 47641
21086 47641 36738 -9450 -24153 -22701 11705 5304 -13267 -39512 -64637 -51463 -24102 -15745
21074 -15745 -11110 -36738 -40580 -46648 -27105 -21954 -17350 8862 24137 5192 5679 34590 33507
21061 33507 4932 11873 -13826 -28466 -21268 -9191 -17179 -23509 -40404 -43364 -8498 -896 -23664
21048 -23664 -33866 -34424 -38386 -32427 -32904 -29729 -22423 -26138 -13328 9245 8768 20766 46152 21763
21034 21763 1789 -1291 3629 21810 13066 -4446 -13248 -23297 -16264 -18910 -13153 -17347 -40848
21021 -40848 -20161 4104 -2169 5786 -15753 -24511 -33271 -36267 -29833 -8490 -8593 3409 5078
21008 5078 13294 22704 34786 13725 -25372 -27130 -22145 3717 0 -7100 13412 8545 10919
20995 10919 37816 34386 2999 -616 29008 -349 -8260 -19732 -9880 2502 -8182 -28976
20983 -28976 -44625 -38161 -26674 -30734 -33107 -13215 -8566 5053 21980 20760 -9146 -9776 5117
20970 5117 11172 -1981 -15255 4781 34745 35046 20838 28442 33178 19770 1055 -21117 -11897
20957 -11897 9727 8258 -2841 -6592 -3983 8629 12083 22482 -1845 3690 -7734 -27263 -30215
20944 -30215 -13786 9814 28928 23951 -1259 8586 13808 -13786 -21324 -8629 7676 5130 -11419
20931 -11419 -6202 10773 25028 -4203 -17046 9103 30622 6426 3325 15372 -7957 -12525
20919 -12525 -26683 -29736 8599 18801 23899 11527 5237 4862 -23295 -20647 -17451 -12856 -11963 -4284
20905 -4284 -15202 -25524 -22322 -6990 -3506 21547 13448 -1807 -29672 -24808 -7797 -25155 -29137
20892 -29137 -12103 9934 -10971 1838 20348 31845 2882 -22127 -12308 -8375 13059 27601
20880 27601 40638 41985 18239 39347 56549 65830 43899 43141 42018 49199 47890 44857 18546
20867 18546 -22209 -32967 -38297 -34709 -24912 -19496 -19884 -10424 -13947 -16871 -20436 441 19227 17647
20853 17647 17041 22823 26999 29076 30707 16322 15530 16253 19984 -3071 -4710 58796 106714 89184
20839 89184 23149 -18821 -15469 -847 297 -10278 -21548 -788 15134 25399 28661 29303 38231
20826 38231 43673 27809 14410 20633 7674 -10382 -17105 -19106 -46794 -37399 -14094 -22318 -11890
20813 -11890 -43128 -48361 -49217 -36312 -41245 -44026 -59988 -93770 -63717 -45515 -45818 -50354 -29476
20800 -29476 -10692 -8122 -16860 1102 22598 9129 -19947 -11272 14498 -12405 1512 -2320
20788 -2320 -40164 -65587 -67313 -35830 -26951 -42836 -40557 -20192 -22269 -5022 4910 -16260 -27468
20775 -27468 -24758 -37163 -20946 9975 46000 47402 29276 4405 -22666 -12736 -784 2912
20763 2912 2347 -18966 -33567 -21743 -29592 -33541 -27091 -41390 -13752 11350 5443 -1675 4101
20750 4101 -3095 221 15485 16693 -37213 -29845 -38716 -34537 -25899 -30991 -25605 -49522 -34108 -31434
20736 -31434 -56236 -43449 -17068 -2651 13483 -4142 -14266 -23583 18019 2347 -26541 -25680
20724 -25680 -14349 -13765 -3991 -14089 -38346 -34309 -24236 -8853 -15333 -22528 -48738 -32606 -38260
20711 -38260 -42299 -28733 -59664 -61566 -48726 -25138 -3242 14918 -1806 -15358 171 5605
20699 5605 19437 10829 9562 2818 -11117 -9827 -8426 -8107 -7364 -2932 -22288 -18305 -35142 -37774
20685 -37774 -33813 -45908 -37985 -24929 22788 43691 50038 34655 -3793 -14173 -25954 -51673
20673 -51673 -36651 -49347 -64724 -66366 -40971 10571 8627 -14945 5616 8684 -12570 -10882
20661 -10882 -15224 6904 -185 -3863 -1641 -16801 -40836 -23734 -16077 3039 2161 -4099 -27137
20648 -27137 -29221 -32042 -2111 -25560 -26396 -25834 -44063 -29672 -23396 -25902 -3807 -5639 -26871
20635 -26871 -36591 -14313 -3848 -20132 -30986 -43943 -47443 -40657 -49357 -29882 14112 4583 -6593
20622 -6593 -7027 -3497 -15371 -20922 -25662 -24645 920 7924 -7182 -13689 -15724 -11113 -2032 -9678
20608 -9678 -15592 -335 -16577 -19566 -44570 -28473 -22825 -26667 -8214 -29943 -29669 -3423 26864
20595 26864 -1936 -51182 -91174 -84990 -55661 -42407 -29929 -37449 -30428 -18859 -15846 -33637
20583 -33637 -39642 -46407 -37482 -37510 -16737 15067 23957 23806 6976 -30209 -18509 -6568 -3881 -1690
20569 -1690 2299 3410 4636 -6387 1888 3691 20670 14555 -16691 -73049 -54481 -21402 -3147
20556 -3147 17898 47186 28316 16179 -12061 -17552 -8200 -31073 -26018 -14337 -8183 8000 -14033
20543 -14033 -40853 -55627 -45219 -21204 -3868 11136 32080 24329 -4330 744 17072 25482
20531 25482 33116 23863 -5905 -9042 -16726 -26571 -40778 -43103 -30043 -37810 -47436 -49019 -48937 -46815
20517 -46815 -28248 2323 5863 16674 12795 22792 25645 32507 43364 40302 46007 33403 20090
20504 20090 40633 53171 23846 8723 -6533 3616 2122 -432 3481 15364 12064 1378
20492 1378 -324 23336 51542 49495 39710 30015 39819 16252 2778 7777 26108 16329 18838
20479 18838 39123 59799 55521 54936 54854 48997 46564 50095 21757 3521 -26314 -12560 2542
20466 2542 3954 13514 22939 27738 39034 18671 -7400 9844 24227 27245 -24546 -69868 -54745
20453 -54745 -55456 -12705 14747 27930 -12430 -30492 -34839 -22026 639 -4839 -5498 -1278 -19877
20440 -19877 -24015 -48984 -41251 -48871 -40230 -18584 -4235 13373 25481 12409 29845 11873
20428 11873 -2946 17966 22492 8190 -21897 -38956 -17908 -8760 -9958 -5583 -10962 -4405 -24750
20415 -24750 -42139 5907 10472 -9899 16398 13394 -1538 -3010 -2214 14753 -4917 -17042 -10346
20402 -10346 -29581 -34335 -26134 -8502 621 15362 7169 -13612 2957 44347 30544 2972
20390 2972 4275 -10734 -17602 -17589 -47699 -25752 7064 34739 32543 16905 3685 -17289 -21201
20377 -21201 8108 38497 7204 -14810 -32955 -15964 19936 -7644 -28216 -47066 -28397 -1690
20365 -1690 7413 -3354 10110 51784 45807 33483 16023 2922 20818 4044 -10365 3929
20353 3929 27293 23364 6769 -31172 -52802 -39737 -18672 -20545 -22232 -12511 -29560 -50351 -40294
20340 -40294 -18559 -2945 8547 -33821 -25998 -33601 -61732 -46745 -20073 -10062 -17773 -45624
20328 -45624 -55571 -37642 -63204 -37426 -37251 -23709 -30092 -46618 -35903 5562 28040 31034 20293
20315 20293 10934 20867 43834 22172 1362 1992 1925 -12280 -6108 -5805 -26874 -51739 -29194 -13698
20301 -13698 -9296 -1253 -10149 -31757 -63697 -57225 -43598 -30961 -27963 -28999 -28690 -19603 -16716 -4716
20287 -4716 -11119 1185 8771 2040 -10515 -10104 -3087 4622 33388 25752 -7222 -26434 -35183 -30767
20273 -30767 -31937 12032 46402 22957 -2146 178 14196 989 -16428 -4422 7471 12311
20261 12311 2797 4967 -10252 -39165 -902 44096 30312 22982 -8457 -25725 -9920 -3902
20249 -3902 -15346 -24188 -39206 -33704 -19225 -2387 -21121 -39545 -37230 -11513 -16859 -25240 -26797
20236 -26797 -28472 -15665 -1844 -11805 -22713 -11077 -8946 14616 21257 22246 7859 5711 18322
20223 18322 28292 19744 6190 -3268 -10199 -22681 -40939 -29310 -19421 -14275 840 -16729 -24341
20210 -24341 5555 -5652 -38955 -10959 9162 11967 10350 3685 16923 -22985 -42035 -25844
20198 -25844 -45598 -53355 -58444 -55873 -48034 -44740 -29170 391 -9183 -25701 -30077 -32085 -20281
20185 -20281 -16464 -19913 -49204 -60344 -42032 -30160 -21257 3343 12708 15269 14509 24732 41016
20172 41016 23094 27175 5439 11488 867 -15921 4380 5658 -17768 2006 19112 -3741
20160 -3741 -24212 -26864 -17282 12594 37852 19209 21831 14915 1133 -17768 -50447 -70996 -59421
20147 -59421 -27567 -28467 -35955 -43918 -37814 -22526 -23951 2597 24376 27343 42426 40644 50152
20134 50152 39671 27625 -255 -1547 32982 20815 5481 4579 -8984 4148 -10093 -12145
20122 -12145 16106 42983 40368 28006 14101 3725 -2067 -17018 -46009 -25420 -32113 -49612
20110 -49612 -40049 -33831 -21648 -19616 -37756 -22359 9028 21316 36493 42147 43871 29177 33519
20097 33519 -6422 -39593 -28048 -8738 -2405 619 -7764 -147 -20731 -28242 -26411 -26024 -22667
20084 -22667 -15897 -6194 34077 46439 43756 52778 26031 23400 43728 48506 40475 11290 -7143
20071 -7143 -576 12592 44919 39159 28923 33423 58560 43278 47731 46824 41036 28068 -449
20058 -449 -22864 -7049 4248 -9831 4058 -29289 -35216 -18253 10579 32306 39653 28584
20046 28584 18799 622 -41023 -27360 -25448 -10041 14918 28964 22282 25834 19536 15964 38066
20033 38066 19997 15434 11308 -1198 -5645 1609 23235 33113 24609 22578 13653 8196 -14290
20020 -14290 -22630 -7568 18847 35135 21369 8756 29332 52360 54100 58396 62260 67289 25443
20007 25443 -6306 -7762 -13054 -17065 -29004 -37797 -13105 648 -29615 -19855 2055 50141 91658
19994 91658 60852 41982 63784 47139 25753 -1587 642 6573 24943 2860 -6960 -483
19982 -483 10208 8312 7858 -16384 -12181 16856 32649 46023 2574 -11673 11365 21761 15881
19969 15881 45200 48095 21780 -9937 -2388 -10505 -9342 -10667 -6179 -10085 18669 33867 29163
19956 29163 14963 -5497 -11620 10402 18830 30508 14129 7271 20441 17050 43025 42921 17457
19943 17457 -3012 -1514 440 1617 -14046 4314 23179 30415 19321 -9627 -15660 -8888 -14120
19930 -14120 -45451 -27000 -12828 5596 1257 10392 -5888 -31360 -31200 -16985 -7410 573 -9552
19917 -9552 -26291 -13286 -12944 3940 -24045 -57769 -44658 -26817 8877 37425 63465 53038
19905 53038 39349 17043 4740 15904 55059 56423 29217 17023 -3460 10592 -6270 -36276
19893 -36276 -33513 -22119 -21295 -11249 22852 10456 -190 -26731 -15959 -32092 -27434 2895
19881 2895 1881 157 -5271 -41750 -39314 -22417 -7676 4057 32539 28057 8430 -8033 -19560
19868 -19560 -28789 -25647 872 11397 -1853 22984 12675 -5550 -29978 -36589 -31713 -41182 -55911
19855 -55911 -55593 -58398 -69544 -79680 -47655 -34735 -21293 -28129 -18943 29844 5089 -13536 -4074
19842 -4074 14411 14350 36781 37325 20083 30630 51085 10625 -13005 3598 31228 40956 21375
19829 21375 31624 61322 65057 42852 34582 23336 30334 42497 47815 -10710 -32244 -21918
19817 -21918 8144 29956 45115 54267 67079 50611 24259 10751 39198 46923 45416 34739
19805 34739 21247 35926 26171 14912 -25893 -42077 -39499 -12962 -14646 26244 28893 -11621
19793 -11621 -22650 -18034 -27557 -8584 20326 -41146 -47525 -17701 -18544 -16360 -31250 -58209 -47289
19780 -47289 -7948 -9896 -40412 -45934 -29043 -3064 -15638 -59390 -33303 4888 17175 28673
19768 28673 33058 24063 8456 2968 -37276 -52443 -37333 -8080 -7567 -9320 10783 39906 23501
19755 23501 -2988 -19720 -20324 -9409 -7435 396 1210 6105 17398 29930 13910 4517 10117
19742 10117 11374 19832 23940 23359 33033 20539 -18492 -36355 -58248 -51185 -28545 -20763 9431
19729 9431 48958 45904 19646 15647 -16597 -15841 -1150 9878 23030 39798 22924 5921 13103
19716 13103 24241 27747 22734 7487 -12042 -18876 -6774 -9130 -15013 -17891 -31306 -20684 2627
19703 2627 17297 38036 61146 58565 48435 16981 3899 -1822 -6645 5844 -3558 -14344 -5961
19690 -5961 -2891 -15176 -15689 -4809 -6572 -2030 -5663 1277 5463 3087 19908 18403 100 9132
19676 9132 26084 53182 21115 15571 -343 -5640 17924 3680 -32611 -5736 -19494 -27962
19664 -27962 -45390 -13692 15900 -1770 660 11190 19039 -11395 -26677 -21611 -23436 963
19652 963 647 34273 34879 13762 7634 2351 6896 943 22570 17016 8041 -8526 -4773 17522
19638 17522 22943 -11904 -1695 -7064 -44311 -9487 21860 15473 3782 30605 48832 43467
19626 43467 35968 36467 24137 3117 -16795 -5432 -486 -4658 -10038 4265 27061 8152 9949
19613 9949 6262 -25784 -27658 -12067 -36948 -48637 -73683 -61030 -30735 -20844 1894 -7166 -1794
19600 -1794 -7552 -39465 -20135 -20057 -21475 -34557 -35780 -51457 -46473 -57808 -57886 -23929 3119 -24267
19586 -24267 -19136 -2856 -20164 5198 39405 38912 37717 30671 30104 27480 14743 10564 18924 38710
19572 38710 23875 6082 -17597 -38167 -31396 -14630 -23368 -37838 -15465 -4721 14218 5106
19560 5106 -22 -10543 -17913 -11206 -28673 -32633 -40844 -15806 -9334 3644 18921 -2687 -17313
19547 -17313 -20586 -15240 -20125 -7148 22872 38884 19945 4658 4425 22905 21088 164 -3762
19534 -3762 -6287 9757 33379 40243 27812 12793 25062 54771 34874 20575 6083 -9797
19522 -9797 -15790 -2223 9492 -1091 -9226 -8717 -9877 -3495 -21266 -41966 -37769 -27329 -29394
19509 -29394 -23233 -12884 -25803 -32261 -17432 10847 21520 11965 10978 -13548 -39049 -13163 -1365
19496 -1365 -1792 -21362 -34565 -8823 -6550 -263 775 -25857 -47412 -23572 -4210 -4365 -19896
19483 -19896 -7668 13905 6584 5514 18210 15209 26579 41330 54736 28332 -2561 14015
19471 14015 -20641 -23016 7152 16629 24356 38026 53965 48894 24865 640 -8423 -23730 -34025
19458 -34025 -58795 -44980 -5132 -3727 -18525 -3591 -15199 -8950 2004 -32967 -45743 -28274
19446 -28274 1089 37505 44522 9655 -8959 -15868 -29979 -23697 -6424 6358 17021 -1900
19434 -1900 -30977 -36576 -23466 -13366 7496 -10557 -18919 -10377 13393 36901 46525 22822 31617
19421 31617 37507 -8773 -48964 -50558 -8317 -1051 2438 36019 29917 -16128 -20226 3196 -8377
19408 -8377 -12261 -1794 6144 12856 -8174 -45529 -44758 -70317 -75326 -36697 -10772 5955 18031
19395 18031 -6383 -10576 -25023 -16115 4361 -2876 -25933 -58100 -43375 -12660 10922 23050
19383 23050 40146 30893 -1470 -13363 -8853 -12158 21874 14466 -15926 -6671 16383 16795 9106
19370 9106 -12846 -29313 -30194 -37626 -14660 -20692 -3724 -1088 -17208 -1947 -11938 -15253 -17702
19357 -17702 11437 28538 13027 14233 -210 -21374 -8386 4787 2511 -9354 -15751 -29149
19345 -29149 -27152 -14832 -29443 -26382 2749 35706 35088 9921 29908 30245 35342 763 -8314
19332 -8314 -17176 -26334 -36363 -43652 -57255 -26777 13417 16815 1454 -35087 -29608 11546 31818
19319 31818 48613 8460 -12106 -17286 -23405 15354 11435 -6955 5256 -2487 1527 -28365 -25886
19306 -25886 -15671 -25672 -2374 13714 11258 -15265 -21557 -14107 16130 -4530 -17755 6448
19294 6448 31611 65174 62866 63140 41920 29990 15293 3192 8288 -3651 -8356 -30788 -32015
19281 -32015 -11772 -22482 -29223 -10429 -10039 2193 21516 39512 49463 32453 38318 19580 10247
19268 10247 13824 34445 35102 51633 85921 79210 49858 57187 72475 57446 66390 31336 19409
19255 19409 20690 23935 54509 73700 55653 43895 36010 30943 41790 66798 61708 50178 56215
19242 56215 33183 23196 15005 65711 62802 11611 -9897 -14015 3334 15919 32581 13782
19230 13782 15078 30223 27476 17891 6962 26164 15517 -13405 -17320 -15253 -26053 -42682 -37736
19217 -37736 2932 -6311 -7623 165 11588 -18398 -21806 -20019 -36098 -41400 -29296 -14833 -36932
19204 -36932 -16095 -4588 2595 2319 -17671 -42933 -25209 10009 22822 41646 40264 43263 24710
19191 24710 23448 8871 24761 31091 34870 51877 59550 79039 52140 25913 -16789 -64119
19179 -64119 -41212 1595 33481 18619 19755 30322 17416 33447 58841 70422 64929 70394
19167 70394 58989 -2464 -32118 -22395 -12624 14114 17398 12587 5727 -5052 -22046 -17014 6737
19154 6737 20937 6121 -3433 -5234 -336 -12045 -4155 -8733 6352 35341 35149 14260 40417
19141 40417 30230 -467 -12759 -28103 -26123 -17993 25532 17345 -17058 -10508 -5670 25541 25524
19128 25524 34947 62109 61274 37549 29126 26826 17986 -3818 -14312 7985 34487 34451 30589 26053
19114 26053 1887 -9010 18689 8287 1593 -3080 -13434 -65 -11979 5913 5091 -19781
19102 -19781 -37508 -45573 669 5984 11572 22620 38285 49942 29919 29356 33658 22733 16325
19089 16325 -7964 5418 42689 28094 19849 38740 28192 36640 15980 26541 48674 58493
19077 58493 15942 9781 -507 5163 -5739 12341 20196 11572 -4758 -23173 -21013 -29017 -36026
19064 -36026 -30651 -14618 -6341 -3589 3159 6048 25884 -1427 -33501 -31447 -21008 -40037 -67571
19051 -67571 -32420 -7646 -1092 19244 -5801 -15776 19917 47828 33567 4000 -25572 -11631
19039 -11631 -15025 -8582 -16652 -15633 -21519 -16891 -14470 -20773 -25490 -27898 -27846 -5036 -10919 25085
19025 25085 21552 32507 8558 -21928 -25600 -15515 246 13444 18170 19431 30627 16392
19013 16392 17731 44377 56311 34402 -5518 3906 -19287 -41522 -62138 -45187 -22151 -6001
19001 -6001 -6251 22063 16423 -8305 -39899 -34384 4384 11910 515 27652 47111 58810 41959
18988 41959 43559 49940 45014 45018 34463 23825 27618 14869 20883 19398 -8147 -21866 -14541 -20932
18974 -20932 -10745 14453 38117 35157 -8625 -19736 -4880 6680 -8421 10537 24247 27433
18962 27433 34475 48299 1562 -55903 -53766 -32430 10468 -3686 -31507 -46429 -15981 12717
18950 12717 -2215 -10778 9576 2057 -35214 -8011 24373 21532 24440 34820 18690 17637 30527
18937 30527 36521 63238 60338 38745 14968 17526 43269 35653 37249 9548 9138 18089 7361
18924 7361 22771 28952 7135 43080 57804 44847 42550 38573 4286 12692 14728 15652 11699
18911 11699 30453 36793 60112 58730 56962 31971 35413 69913 50425 57095 54533 36591 43533
18898 43533 50739 83535 57763 50559 38571 31305 38939 61843 67241 47567 23135 4102 -5766
18885 -5766 21501 42015 56914 23272 26550 46744 37212 25421 2823 -5290 -1045 13254 27252
18872 27252 18700 17289 22856 36397 18494 3125 -8880 -17624 -23900 -30993 -46828 -40813 -44305
18859 -44305 -40811 -40651 -39855 -22352 -24045 -23851 13289 33328 36833 30726 1919 10516 6865 12964
18845 12964 15015 14329 24514 62622 82000 49757 41452 58021 36768 -14994 -28196 -25158 17369
18832 17369 31240 52262 44553 46483 54381 57512 70461 67956 51113 34885 34218 11141 16914
18819 16914 2137 11457 17861 13859 8135 -3501 9357 13432 11875 16636 -9967 -15509 16493
18806 16493 61177 69820 40729 17027 -1710 9857 25285 22956 38930 34232 23260 29721
18794 29721 33364 33893 -3560 -13325 -15738 1647 23399 21858 21567 29850 35875 39190 43526 61912
18780 61912 80098 78400 66779 44947 22922 30116 48668 59796 85502 105994 129514 177279
18768 177279 213820 222830 220654 215597 191917 121531 50239 19339 55473 53774 39580 55949
18756 55949 72957 74032 68299 59831 69253 89719 104490 111577 98946 117647 115763 104562 123241
18743 123241 136272 113440 119879 91588 63373 102419 117139 106450 72825 53164 66045 59849
18731 59849 55853 41330 37617 58934 46957 56342 34510 18041 4044 4846 17885 47278 79897
18718 79897 87422 96835 114978 154357 171135 178604 177851 160814 192736 243625 264976 249040 230776
18705 230776 224691 200420 187886 216499 242862 275610 302039 281511 246199 210427 207962 196600
18693 196600 187386 171427 156161 128981 124203 143706 103587 84533 71626 80412 92628 90385
18681 90385 77363 67824 63220 69995 113291 120173 105119 97704 101121 90475 89809 85578 101617
18668 101617 108004 118503 142516 143448 146644 197590 226966 215854 215177 221086 226152 227426 223490
18655 223490 234302 287903 301592 282614 264460 272566 265800 270725 277608 235240 176829 155916
18643 155916 149770 153429 153292 154693 134341 120695 128861 104357 75319 92926 113691 103892 89833
18630 89833 61557 59538 81152 102199 74919 76495 71266 97839 113014 98478 106900 144567
18618 144567 151711 164444 178358 188134 195557 166929 150979 119961 96371 76137 73776 98001
18606 98001 106556 98692 81827 72196 59931 45527 56977 62947 72491 73981 51630 45433 21212
18593 21212 35758 51153 62214 63937 59391 55422 49415 72538 94412 97847 85138 76647 87862
18580 87862 86030 63542 27452 28241 33468 62365 92809 136678 182228 185850 198210 215148 253626
18567 253626 257571 252271 247825 254811 234581 221019 201425 168224 162397 149359 114568 76040
18555 76040 64804 72523 82444 80377 70837 84950 97425 75292 61983 64932 81297 82076 73096
18542 73096 60762 60710 57384 45660 70670 82042 77934 75828 94741 89281 57243 41806 45550
18529 45550 80818 109014 112817 131479 139324 115153 116108 120193 143884 178051 204867 233928 239895
18516 239895 219654 191666 179842 172751 148972 121100 117122 95442 64914 68187 86207 101315
18504 101315 94248 122247 149837 145537 121198 83852 57752 69983 79887 92252 105262 103774
18492 103774 77724 68906 78983 105491 81805 62473 64277 52851 84545 75966 109253 141275
18480 141275 157479 147810 115998 101940 89513 89307 116833 120757 81917 75970 70909 50845 56164
18467 56164 45463 61326 84699 76818 105186 116091 97417 99478 122484 118243 106447 116304
18455 116304 109387 143406 127207 114909 119311 117134 103798 98787 80195 92856 109559 145480
18443 145480 190710 229032 253772 304598 343111 384894 418637 430403 447444 465651 433694
18432 433694 387336 358176 359772 346934 330631 342890 321974 315988 321397 296722 309026 347424
18420 347424 384698 439204 462311 460033 461684 445703 422742 393268 358326 333265 292227 232748
18408 232748 212974 241836 243701 220083 218352 220147 208370 207513 199624 203949 217142 209254 219518
18395 219518 223128 227851 257662 293245 349366 425087 434296 436872 486872 513498 519839 508526
18383 508526 503641 482489 469820 470711 449385 389026 347295 317799 290803 268322 263970 238220
18371 238220 245593 229410 220745 210659 196414 172739 155368 171012 188892 210227 219999 195375
18359 195375 190966 207010 193778 171813 155848 142292 112467 91804 103611 131043 164438 169066
18347 169066 180849 194038 189100 239600 275719 301395 326348 359862 383187 419252 443040 439587
18335 439587 454174 469149 491557 487628 482175 459057 444749 421342 397681 346524 330890 331660
18323 331660 325535 294531 257340 264162 255784 244509 243523 211292 206484 215320 209956 197805 175456
18310 175456 183162 190954 178905 182090 185762 203934 226625 240292 217943 221813 216971 193710 169641
18297 169641 174056 189663 181101 185880 196536 209352 195062 210397 247422 267540 248033 232137
18285 232137 248814 273444 302502 309595 300510 275553 301350 332095 308135 294197 267195 233797
18273 233797 210006 221418 247715 228917 224190 223135 249681 272281 309060 318760 289322 282864
18261 282864 282288 270854 269747 238319 254719 271707 320123 353207 364108 342059 331416 367206
18249 367206 400832 407384 434136 422764 414550 427470 461814 507728 568891 610479 649097 699179
18237 699179 745534 806451 885456 922166 960590 1030029 1115171 1191114 1301121 1450123 1646546
18226 1646546 1911586 2328109 2970208 3886961 5071319 6492276 8043998 9589541 11051540
18217 11051540 12399212 13673347 14869343 16014773 17073133 17945393 18533312 18714788
18209 18714788 18499353 17998921 17282149 16415707 15502006 14449685 13190554 11757520 10179973
18200 10179973 8634872 7277603 6158828 5398126 4900054 4541141 4265147 4076739 3925419
18191 3925419 3750531 3610892 3511346 3476462 3447330 3436385 3419971 3442403 3487476 3532991 3611130
18180 3611130 3729341 3910565 4169029 4497794 4956249 5557754 6406632 7673601 9522450
18171 9522450 12011066 15111224 18683845 22505955 26237475 29712484 32939092 35896308
18163 35896308 38564561 40943654 42939550 44296244 44801870 44253212 42894386 41084050
18155 41084050 38957109 36652198 34226566 31496414 28430009 24941950 21191708 17696305
18147 17696305 14728215 12360001 10747481 9711724 8976796 8439826 8051551 7791265 7586546
18138 7586546 7393002 7182881 7006527 6842506 6661376 6461598 6269966 6061537 5865163
18129 5865163 5687075 5543107 5433856 5345866 5311141 5323890 5407815 5559694 5777358 6129195
18119 6129195 6651512 7377841 8413487 10019934 12581978 16729789 23415331 33644604
18111 33644604 46863666 58456058 64615871 66894502 66039805 59412472 45161303 31733735
18103 31733735 22944854 17490981 14230074 12235769 10930459 10004169 9312250 8735926
18095 8735926 8274276 7904774 7628867 7444727 7264148 7132575 7043713 6959832 6855742 6729000
18085 6729000 6587213 6436812 6309965 6200529 6097408 6066918 6083227 6167760 6332438 6616196
18075 6616196 6999716 7632729 8699238 10312941 12954304 17165595 23047995 30168029
18067 30168029 37506101 43905676 48116863 49228750 47088998 42283197 36270623 30223742
18059 30223742 25444473 22194046 20132585 18486157 16692520 14680115 12561495 10603081
18051 10603081 9058725 8011618 7339863 6885499 6535972 6302588 6145681 6018579 5903591
18042 5903591 5787628 5740752 5676311 5567531 5440377 5332336 5179103 5015549 4863883 4750027
18032 4750027 4669493 4597833 4540074 4465961 4394367 4339453 4319206 4379314 4522492 4750226 5098736
18021 5098736 5712966 6709876 8400350 11022541 14505062 18506972 22343476 25359229
18013 25359229 26831712 26432960 24155882 20555935 16330619 12366495 9372325 7408865
18005 7408865 6214486 5465178 4929768 4538776 4235595 3997033 3811256 3636818 3496312
17996 3496312 3366684 3277349 3248993 3181303 3140720 3138951 3137939 3136667 3115542 3070436 2956808
17985 2956808 2828958 2704673 2562217 2425763 2306255 2207302 2149614 2087174 2008704 1951978
17975 1951978 1949883 1918116 1846612 1781510 1723459 1712721 1684331 1634256 1630309 1642628 1669231 1693218
17963 1693218 1730429 1759151 1794789 1821673 1853628 1915034 1966961 1990793 2044644 2134143 2229762
17952 2229762 2310529 2393746 2502745 2630765 2812881 2978553 3177672 3446716 3824495 4354226
17942 4354226 5145524 6370003 8214012 10807816 13787449 16719934 20138600 24469208
17934 24469208 28768694 31448544 33294681 36076763 38996955 39644145 38573708 38756513
17926 38756513 40061586 39622693 37003254 34811390 33645607 31420159 27185872 23112681
17918 23112681 20297244 17815800 14938817 12186379 10303992 9175600 8439943 7921613
17910 7921613 7539239 7257724 7051846 6879939 6749129 6638049 6514031 6430781 6382757 6360251
17900 6360251 6426516 6604850 6968641 7576239 8581803 10049732 11720413 13462106 15553160
17891 15553160 18172272 20628763 22055420 23207271 24878464 26285416 26164297 25424131
17883 25424131 25633092 26200923 25593098 24140076 23292165 22872107 21630977 19645237 18287742
17874 18287742 17843702 17919874 18659976 20971187 25403697 31777541 39296386 46777598 52837194
17865 52837194 56293895 56336161 52887129 46676456 38988948 31405017 25084751 20587147
17857 20587147 17799176 16286744 15628370 15710130 16613256 18610807 22085247 27356242 34375037
17848 34375037 42363567 50104394 56182004 59402280 58951330 54824223 47867536 39529215
17840 39529215 31399721 24610847 19640328 16281669 14047422 12486154 11347367 10468414
17832 10468414 9786296 9234430 8801948 8437212 8121486 7864185 7657583 7477137 7261355
17823 7261355 7069056 6911499 6677140 6427294 6181652 5905046 5625399 5336407 5060418
17814 5060418 4773710 4518920 4327121 4146427 3986676 3856444 3710783 3570228 3460797
17805 3460797 3368369 3291936 3177803 3050264 2940359 2853118 2781869 2705240 2630545 2539754 2479219
17794 2479219 2406563 2296022 2214262 2175922 2109038 2073943 2034780 2001694 1952647 1864435 1765339
17783 1765339 1754240 1771190 1742508 1709279 1629020 1556871 1492999 1434357 1388451 1370390 1352441
17772 1352441 1320594 1254425 1195956 1127300 1098601 1072065 1066729 1057166 995931 960672 945193 948627
17760 948627 929531 882478 847959 847122 821686 795125 789422 773541 743713 729231 709218 708243
17748 708243 720586 690929 678480 680483 676044 632833 599283 596655 576055 512467 477502 471438
17736 471438 464858 432649 440606 422967 390286 419120 436144 440420 410607 392430 390666 376679
17724 376679 377222 370837 369898 347421 334468 316003 323078 320157 295509 278485 255228 224106 237481
17711 237481 283746 280481 254648 241335 233747 270989 285296 286505 358592 386819 392503 388912
17699 388912 376154 384577 418823 465576 483829 544205 626580 666399 689282 691578 740396 788213
17687 788213 800852 797980 803310 770015 727655 683616 639669 595694 535358 468121 391683 348354
17675 348354 305639 254801 217838 202136 227833 247736 234044 235546 232597 212199 203220 214571
17663 214571 224743 216140 235636 233251 234651 231450 231098 239847 225657 239268 244219 254789 277525
17650 277525 296238 319595 354142 377632 400506 415164 440650 475487 488272 510312 525665
17639 525665 495736 458056 455563 437522 377067 287368 228263 244278 231032 205060 186508 205237
17627 205237 202623 226159 260443 291481 304380 306264 319789 339563 333476 342422 306373 265245
17615 265245 229125 196585 141847 106989 112903 135780 147798 183545 227968 224157 236948 246105
17603 246105 270204 275753 243497 215493 214274 207702 168285 119395 75297 70138 96807 87278
17591 87278 61196 74308 93702 111163 133078 94071 66855 62987 99940 126024 116668 111457
17579 111457 103164 99961 78766 76871 62182 24078 21164 3383 -1392 -4754 -20533 -37477 -16851
17566 -16851 9381 39977 74892 112578 133482 132109 124791 150101 193415 220986 235948 234525
17554 234525 236529 256342 244364 205334 161181 145556 148361 158784 160260 158492 112790 87968
17542 87968 48186 68406 77664 66352 62605 46977 26682 20396 20890 20222 5533 -21723 -33477
17529 -33477 -24241 15018 48683 67279 67261 52180 42265 52368 31912 10856 47736 77751 73013
17516 73013 24087 -5834 8231 -13731 -39910 -9019 22914 40387 68114 113570 105001 104040
17504 104040 72953 67379 85170 74230 46764 8505 1088 4778 -26279 141 52977 76435
17492 76435 78626 52240 41354 33010 22740 516 -14069 -10930 13050 42502 39845 44019 47170
17479 47170 25407 22547 48164 74552 82404 76569 89823 87333 65430 37795 54525 101979
17467 101979 124840 143078 179344 178712 181772 221047 262745 312127 341734 402127 431474 436532
17455 436532 426765 406455 386862 373748 338472 352106 374655 382155 382153 362222 331453 354570 382139
17442 382139 371282 350747 324369 284770 235250 245768 223638 196732 204068 233960 267853 287257
17430 287257 251568 231835 248824 255377 211711 173663 165841 164469 167577 188154 171556 146780
17418 146780 147898 108704 92442 93401 90543 100959 104795 110698 108080 77229 59461 56231 73770
17405 73770 83488 81035 45310 28329 56648 72776 88212 98773 68191 53081 91291 119018
17393 119018 112868 127301 144477 164253 192360 220678 193115 158148 158598 144820 128231 117999
17381 117999 141976 150546 106174 102001 94704 69924 63412 77563 59893 66470 75386 56452 47283
17368 47283 34170 44896 54687 83879 84275 27880 -17160 -10127 -34457 -47138 -13689 630
17356 630 -7702 -17434 -11038 8977 39213 59996 44007 69436 81428 83359 89528 91063 62275
17343 62275 32486 21627 16319 21907 24994 67296 99442 80746 77883 63355 46120 41851 56267
17330 56267 19322 -19550 26133 51037 68608 62102 59950 63300 75870 61535 48051 48581 41982
17317 41982 30649 29874 22478 25469 36970 7375 -13080 -6236 8517 36688 26534 12226 10893
17304 10893 34997 27724 54517 72238 69808 49264 40548 60639 73738 76195 76342 82257 100040
17291 100040 145473 179865 179222 203083 207347 219525 247675 235710 180642 132875 132699 126767 158012
17278 158012 143936 112723 107562 97225 96127 141118 177287 199380 218153 255390 299708 317635
17266 317635 300866 270382 232649 207378 200656 162847 114219 67339 52195 46343 50715 56730
17254 56730 73960 75138 62063 65568 64096 63222 62463 62489 79754 77585 57548 51560 85397 120730
17240 120730 131815 134490 112115 108774 93384 85715 60071 71704 87759 82909 99166 111361
17228 111361 107123 97200 101430 92321 94067 115804 101664 99315 92852 76395 65473 82874 75596
17215 75596 72724 101451 119582 107010 76125 69210 77783 66252 70529 89888 94419 109685 107014
17202 107014 100101 111665 128768 121586 125627 105151 103255 144117 181424 184839 155353 139181
17190 139181 116792 113851 142119 158327 130311 120157 108881 105241 111906 109084 126146 134713
17178 134713 143675 165895 136948 97421 93204 103138 118706 151581 167743 165817 145866 136561
17166 136561 124693 117900 140837 153633 152873 157259 172285 182246 192379 205294 186751 197686
17154 197686 236179 215473 211006 212483 230435 219485 214963 229573 221635 218400 246502 258453
17142 258453 255805 244372 280988 321304 335538 378623 395522 390205 406260 438160 461948 487900
17130 487900 505629 523962 575466 589238 648891 706820 749634 804441 893799 996523 1105524
17119 1105524 1210632 1336906 1479179 1569299 1697829 1852517 1989117 2187962 2452060 2715579
17109 2715579 3036272 3443119 3973501 4732206 5893431 7688210 10551779 15261548 21968567
17100 21968567 28915617 33887216 37604496 41545226 44991644 45405393 43342912 40995535
17092 40995535 39226199 37038823 32069046 24589926 18733241 15547327 14104239 13816829
17084 13816829 14619815 16802510 20979148 27068326 33077035 37167131 40282194 43590135
17076 43590135 46184520 45797951 43389308 40897723 38883805 36226556 30684050 23105267
17068 23105267 17296427 13851742 11785154 10412870 9428960 8714813 8194926 7781567 7375809
17059 7375809 7018381 6699572 6420691 6173491 5889288 5616620 5373576 5149183 4929580
17050 4929580 4729718 4572825 4367338 4169270 4008179 3833725 3661541 3530787 3375319
17041 3375319 3187993 3020152 2906769 2840921 2755285 2662621 2558020 2455868 2394336 2328424
17031 2328424 2237831 2150358 2103968 2071459 2002953 1929729 1857761 1800072 1746832 1707386 1651119
17020 1651119 1621297 1565760 1518847 1453402 1373885 1290254 1230419 1222679 1226692 1209484 1177774 1144114
17008 1144114 1134402 1079201 1051665 999981 966375 951697 937325 897692 866776 841101 831641 804818
16996 804818 767877 766315 749422 761687 742680 711359 672297 633602 603350 592865 588334 588593
16984 588593 558015 535717 504080 517052 544919 544757 503323 479422 462978 442413 414705 404995
16972 404995 421048 415606 381747 352647 362688 376512 371425 333963 312283 296597 309302 315352
16960 315352 316240 298815 283561 281246 259393 225599 184465 184516 189676 182742 169232 174850 200816
16947 200816 177921 140736 157861 173491 145928 109362 138948 174929 146132 101774 96451 102401
16935 102401 89352 88401 83534 79819 53247 61828 87959 105469 99895 110535 104352 79731 52944
16922 52944 83386 77233 71628 94913 104618 114877 143059 163309 224944 286951 291292 319863
16910 319863 352050 357326 366669 372115 355340 311989 269150 229464 186290 190353 191526 151323
16898 151323 136564 151742 170277 161170 140107 189108 248932 285658 328982 355798 348611 330132
16886 330132 345975 353704 350916 334050 306036 256788 186864 163104 134508 97750 116985 96768
16874 96768 103683 99834 92447 86145 82774 86754 91642 91486 95205 81184 52567 61888 72500 73851
16860 73851 71286 102116 118887 136463 133904 122904 108435 118463 114259 107138 75085 58944
16848 58944 45576 55413 59418 71968 76754 77118 67370 38917 19051 16715 44467 37453 38926
16835 38926 62599 81018 51721 42126 17314 48139 58277 50783 55358 66348 64273 53605
16823 53605 42802 31461 27817 20393 9635 -2018 -26880 -24082 -15861 4722 20502 16420 42896
16810 42896 52938 83075 73815 63628 31268 36296 26753 18239 23080 -2599 -15562 -24971 1289
16797 1289 22357 18962 5381 -14617 24956 45654 35360 17113 -16221 -27678 -16079 -15996 -13712
16784 -13712 -29878 -28120 -33669 -35180 -21907 -7117 14164 -2575 -25171 -45430 -72729 -61645
16772 -61645 -8709 15302 24447 47954 58821 63294 45630 34070 55974 54586 29862 -6369
16760 -6369 -10546 29133 40768 17777 10022 17692 21859 37863 33385 11077 -6909 -21365 -48144
16747 -48144 -36710 -46401 -49899 -38933 -18481 -20037 -7485 -9617 5253 -7757 -31212 -62661
16735 -62661 -82976 -35102 9246 4819 -9326 -47946 -47845 -38718 -4959 7081 12763 16964 28088
16722 28088 34014 20707 -13469 -29121 -22963 -16678 -21996 -56438 -51802 -27107 -17334 4770 3713
16709 3713 -11706 -22751 -5329 26940 20192 -74 -24543 -35115 -14075 -9219 6624 -9793
16697 -9793 -14295 -34697 -20290 -6691 -12858 -21658 14179 22528 -7847 -5658 -18012 -9947 -17121
16684 -17121 -25886 -7216 26829 6987 -5369 -5127 -15630 -22864 -5408 18267 32965 36455 23232
16671 23232 16680 16499 11143 -2537 -24804 -27682 -1178 14961 13403 -8533 -18535 -27917 -5809
16658 -5809 -5244 -9141 10021 -3474 -10640 -54830 -33571 -21730 -21121 -13285 -18243 5657 23787
16645 23787 274 -4184 -4607 -29977 -45790 -22926 -11320 -3840 -19686 -21963 -24873 -42701 -49197
16632 -49197 -57457 -37041 -59500 -37292 -24530 -42561 -42976 -49318 -46190 -29553 -20702 20395 13751
16619 13751 12278 17255 13799 7873 -15656 -13643 15631 29842 29791 12470 -11353 -28157 -34623
16606 -34623 -42624 -22002 10635 -14143 -39028 -25652 -30496 -19399 -22728 -44808 2309 5911
16594 5911 -29095 -43033 -44880 -23314 982 -1629 659 18682 12183 -17690 -38493 -25980 19645
16581 19645 20290 -23883 -2891 13777 2547 -457 -6749 -9865 -25213 -28129 -11766 24045 67536
16568 67536 38819 10682 -20895 -19507 17556 43080 33914 11433 6209 11696 -964 -9749 39352
16555 39352 47548 36381 33078 64568 103770 141303 180895 220264 249409 249145 261347 247405
16543 247405 237010 210147 214492 210262 204626 193872 181712 167591 109356 77582 55680 71696
16531 71696 95548 149748 163799 179900 171538 203839 236287 242241 214413 192781 203521 212007
16519 212007 182230 151070 114614 93640 69844 57969 61524 69862 58817 22262 25437 17300
16507 17300 2911 15098 17480 -2998 1964 -3815 -14516 -20972 -30365 -25211 -6631 9854 4165
16494 4165 25900 22105 26266 16199 -7764 -22217 1890 31271 49174 34430 -9413 -16633
16482 -16633 -7562 -15019 -54218 -40001 -39168 -46121 -52106 -52909 -59374 -65480 -45400 -43313 -25480 5961
16468 5961 25893 5700 -24207 -53408 -47496 -32821 -18874 -29834 249 18236 8289 -7699
16456 -7699 -32584 -27809 -13651 -13433 15493 24000 9273 -9083 -16676 -7674 -22209 -43454 -50859
16443 -50859 -73490 -78496 -75705 -86557 -77363 -52773 -64937 -54312 -43524 -48548 -38236 -300
16431 -300 6435 -8613 -24387 -30679 10129 36555 16184 4343 9172 48554 42717 14420 13118
16418 13118 25121 21308 -17860 917 45221 40564 4060 92 4292 -5814 -32424 -35773 -24364
16405 -24364 -38623 -41105 -23357 -40734 -60765 -43534 -47961 -52155 -37874 -48656 -40956 -26971
16393 -26971 -25651 -53852 -60914 -34156 -13569 -14317 1262 22423 16421 21659 1838 -3519 -28230
16380 -28230 -34110 -29821 -6383 -3491 -5375 -10809 -1187 -4863 -29400 -28456 -9100 -7900 2147 17136
16366 17136 -18122 -55793 -43652 -15052 11027 18589 -1524 -10802 -36889 -23297 -16492 -21266
16354 -21266 -21069 -31893 -33239 -22883 -23288 -5062 5235 21489 40889 -17798 -34468 -7349 -19693
16341 -19693 -44781 -71878 -70062 -50990 -11126 11101 -16153 -49489 -41210 -13144 4979 -2783
16329 -2783 7379 -15909 -10854 -31578 -53772 -40927 -18163 -27009 -9090 30323 35108 27327 35894
16316 35894 44963 13495 -7094 -10531 -51762 -54477 -42717 -34000 -33371 -23077 -26130 -24746 -33414
16303 -33414 -41170 -20502 -13365 -6566 -25840 -37577 -54455 -25380 -43823 -34926 -10873 -17058 -11803
16290 -11803 -15843 -11491 -1180 -19934 -40068 -47743 -30080 -13981 1812 -10308 -28860 -14501
16278 -14501 22119 30901 12320 -11843 -21542 -19051 -1743 -16827 -23997 -7869 -11235 -18999 -35819
16265 -35819 -29434 10779 6551 -21340 -13631 -11662 -14292 -18859 -8559 17335 -12990 -50059 -33678
16252 -33678 -24503 -10349 17961 37309 24575 -258 9306 18529 -15413 -59258 -52777 -14173
16240 -14173 11405 67364 96611 65511 47045 41112 16702 -6905 -6555 11583 29109 16287
16228 16287 -8633 -23207 -4626 -7090 -9054 -26439 -14831 -23837 -24858 -26035 -1941 4166 -20615
16215 -20615 -1754 17644 15314 10809 2625 16116 36723 39963 32186 13509 -5549 4494 2978
16202 2978 996 9629 -1522 -9991 15759 15623 -16158 6696 17719 12018 -14228 -16818 14841
16189 14841 -2243 -18812 -39220 -36983 -2900 3220 -10500 -11572 -12879 -28636 -52466 -35855
16177 -35855 2919 -5734 -8610 -1386 -13163 -846 12810 -6094 -1806 12428 37072 40429 20404
16164 20404 -3118 -31181 -26498 -23982 -15046 -30817 -23402 -24612 -17775 -7287 -21757 -26997 -16907
16151 -16907 -16137 -11694 -28239 -13478 600 -8926 -28536 -17393 -20519 -33804 -14977 -20362 -22106
16138 -22106 -45929 -63228 -63252 -31993 -20820 -52702 -48316 -51255 -33272 -49903 -27236 26070 66159
16125 66159 71719 37716 20177 -7789 -28399 -16010 -57043 -49104 9403 42006 37606 6468
16113 6468 1643 407 -24220 -5739 12242 -5152 -20961 -26840 -42049 -56488 -73741 -40946
16101 -40946 -16040 -24815 -27583 -39251 -70566 -91418 -86997 -67167 -40361 -29036 -20361 -28550 -52685
16088 -52685 -57142 -46658 -52413 -37005 -52292 -46127 -24060 -40250 -49558 -71347 -47499 -6233
16076 -6233 5785 13471 21661 16783 15962 33406 16567 177 21896 6348 -22554 -30601 -38436
16063 -38436 -32952 -19455 3668 17382 23443 13003 -10337 -31480 -27171 -14051 -10480 5558
16051 5558 -31499 -69052 -87273 -91535 -51931 -13083 -18136 -31386 -23987 -47794 -67778 -57950 -41157
16038 -41157 -10660 4792 -10049 -37881 -50730 -52998 -57918 -27303 -438 3317 12228 -862
16026 -862 -7909 -16788 -1451 3068 22897 39823 19946 -14147 -6232 -12104 -8010 -8901 10992 11436
16012 11436 -12071 -16461 -26892 -19797 8376 9255 -16902 -20379 -20224 -5573 -14864 -38540 -43852
15999 -43852 -50862 -44052 -20564 -19969 -19636 -32541 -31185 -18175 2340 14226 19627 11518 -2873
15986 -2873 -32824 -30430 -17271 -2245 4588 -14498 -7914 -4294 -24149 -29753 -18401 -11522 2310
15973 2310 -16433 -36946 -47796 -26872 7744 5386 12820 14502 -3757 -14019 -7742 2747 -853
15960 -853 -17359 -50968 -52661 -43711 -28657 -12655 -11636 -26235 -40672 -46646 -39658 -41740 -21438
15947 -21438 -5573 13628 10979 15709 12260 30280 20426 7111 16976 3996 -7385 12145 24798
15934 24798 4412 -3018 -2283 -17680 -25390 -34891 -33125 -45534 -62455 -53853 -32590 -51662 -33781
15921 -33781 35477 58718 47360 33972 -13713 -18796 -33620 -49054 -28944 -16550 -16129 -21039
15909 -21039 -23271 6905 18472 4885 -5207 -31337 -30626 -13749 -11843 -3470 -5204 -32132 -40483
15896 -40483 -7768 -8370 -7336 10615 9441 18248 9404 24061 25788 -14541 -53592 -32802 -18568
15883 -18568 -2292 2085 4469 501 -23177 -42574 -36445 -5137 -14398 -42814 -57277 -45555 -30067
15870 -30067 -33569 -28221 -32159 -37308 -12050 3088 -10810 -16220 -24680 -18571 -19477 -34619 -28997 -21566
15856 -21566 9261 21505 28515 -5654 -16674 -22337 -27193 -12250 -4840 2481 11362 36039 25311
15843 25311 29733 12371 -20476 -34320 -34719 -3149 48742 53800 10144 -17699 -5419 -8551 -19230
15830 -19230 -32979 -20895 -39089 -48282 -12109 -7388 13871 33912 21589 15728 16329 25065 30483
15817 30483 41215 28935 26899 35456 -4419 -22152 -30206 -35786 -61802 -68236 -47927 -14108 -19909
15804 -19909 -45940 -29510 -40231 -24667 -15546 -14350 -33363 -27709 -35780 -62782 -55501 -20781 5502
15791 5502 20931 25758 13781 23566 24975 -7533 -13825 -13010 14742 -12439 -23081 -26923 -25841
15778 -25841 -23239 -36379 -37509 -8180 20844 38376 24335 -14731 -28190 -19878 -6816 -24975
15766 -24975 -2447 26885 23683 15183 21044 -11396 2414 1025 -12041 -33215 -29400 -35799 -13355
15753 -13355 274 -11315 5797 22170 32247 -4066 -29081 -17168 -13348 9549 22774 -13190
15741 -13190 2311 7468 -20119 -49003 -40813 -23601 18397 13908 -4564 -33816 -54924 -60976
15729 -60976 -44461 -19198 -26763 -55682 -17911 16783 14644 5230 -3426 2673 1110 2431 12412
15716 12412 9614 48792 34599 -13345 -15997 -34117 -19166 15854 7213 -6197 -5402 -3646 -3786
15703 -3786 -22134 -20562 -12423 6482 23708 28297 20393 -2328 13514 14669 12560 24221 7781
15690 7781 4299 1158 12262 -5551 -49594 -48358 -14090 -48928 -42121 -5793 19521 17314 20782
15677 20782 16420 17003 -4200 7971 8387 -7905 -5246 -4311 -8651 3014 -8266 -21905 -9850
15664 -9850 -22093 -36573 -39677 -16578 -258 -4115 -24281 -26104 -29848 -24487 -59830 -60304 -41153
15651 -41153 -44708 -31386 -24758 -21348 -24483 -39495 -20577 8635 -1394 -14951 -15102 -119 -8301
15638 -8301 -32728 -18137 37966 42717 32448 14302 -27786 -47876 -52384 -54730 -23011 377
15626 377 11235 -19747 -6961 804 1154 12382 22945 23175 38445 25517 -960 -24988 -24997 -45922
15612 -45922 -48416 -48974 -60476 -44923 -19039 -36584 -19178 -3336 -24799 -28352 -7612 -1555 -732
15599 -732 -6928 -17738 -7823 -26497 -48155 -45144 -17623 22435 24596 19163 12710 8589 -22014
15586 -22014 -37719 -26811 -9152 -22083 -35696 -41603 -18382 -12175 -15653 -5589 -5326 -8458 20998
15573 20998 62560 50158 23666 5492 -9533 -6937 -21335 -36618 -17502 -26929 -37115 -6030
15561 -6030 4530 -2009 7076 -8034 -22200 -17680 16318 17181 3260 6334 483 4702 16587
15548 16587 49962 29590 -699 211 3947 -1795 -4800 -8074 -5968 -7462 6777 32604 7288
15535 7288 -5921 -3284 -7174 -28379 -29294 -16302 -42977 -58112 -20987 -13477 1975 -3826 -2538
15522 -2538 -17591 -26350 -31895 -31024 -4810 9027 -138 11016 16907 31417 33237 25738 51915
15509 51915 65731 65471 54403 89585 54008 -5829 -29393 -23086 -2568 4721 5516 -19248 -20911
15496 -20911 -15296 -43438 -73629 -56821 -15207 18951 52299 26158 -14779 -40737 -42312 -11438
15484 -11438 25652 45100 7670 -25978 -14726 8704 -2987 8339 6274 1381 -7139 13373
15472 13373 50572 67054 56652 55908 20402 15381 16955 9993 -13976 -388 24933 7742 31597
15459 31597 42670 55954 52376 68485 64466 33638 5399 26378 25613 -23911 2434 49467
15447 49467 46815 17377 32903 58757 44047 30920 35521 -726 -30794 -27350 8215 30413
15435 30413 38147 20748 -11940 -16904 -34552 -21766 -42489 -23943 3256 11431 7496 13130 18525
15422 18525 14640 563 13175 19677 14120 8252 4365 -15260 -3007 -3880 4868 23879 12485
15409 12485 -1780 -21651 -20978 -18587 -17146 -8256 -2402 -19806 -33487 -15456 4551 1889 6045
15396 6045 26929 3337 -11351 -16970 786 6988 3954 22965 3859 -13413 -24966 -32331 -22965
15383 -22965 -1480 796 -12318 -199 -18739 -6285 -1119 11908 -8817 -41791 -24754 -25158
15371 -25158 -38164 -18668 -17935 -27771 -20872 -9486 -10876 -20673 -20161 -10645 -3304 -5570 1009 10767
15357 10767 11464 2895 -16614 8964 -471 -17576 -27892 -38993 -25247 -22458 -20957 -17407 -33496
15344 -33496 -33809 -28364 -18826 -8116 -5712 9007 21945 20903 30463 14010 3490 -34669 -28261
15331 -28261 -27143 -46078 -34756 -38356 -60204 -45129 -33294 -23797 27159 49407 38864 30547
15319 30547 10452 -24264 -35777 -32067 -3780 6445 -2203 4833 1100 3796 19259 14914 -19845
15306 -19845 -628 39572 28695 25391 40303 -5860 -35973 -22278 -33678 -9306 3161 36697
15294 36697 53081 42517 72405 58994 33269 24679 15758 31938 39229 43408 52826 43062 20149
15281 20149 -6299 6613 24404 30008 17743 18913 33936 73632 101535 66184 9981 23081
15269 23081 47492 36621 45079 36481 20689 34167 56635 87825 99364 74715 55947 -11347
15257 -11347 -7139 -18622 -23998 -9525 -14714 -18160 -13711 -1060 -4183 -24225 -8486 -2997 -6858
15244 -6858 -22682 -11995 -1839 -5251 6653 -10728 -23912 -21230 -23751 -26691 -13557 1434 -14319
15231 -14319 -29455 -24152 6720 -4584 4412 14893 20983 25579 -18058 -23370 -33364 -13282 32652
15218 32652 25772 28650 52393 52990 46673 28867 9559 9829 692 14095 -21385 -30872 -34691 -40652
15204 -40652 -36405 -29203 -19977 -25454 -44146 -42863 -40812 -25654 -24846 -25686 -4879 23465 7508 3346
15190 3346 -1244 11337 12416 17810 15413 -16657 -5518 -3751 -6712 4128 4250 11412 2186 8372
15176 8372 -1973 -3991 -3932 -9950 465 -27809 -24155 -15603 -6150 3859 -1993 -4569 16678 33358
15162 33358 50758 37865 38367 34719 54870 25886 -5696 17065 54073 42624 -8598 -6591
15150 -6591 -8755 9804 6816 13403 17730 13206 -1003 -4183 6065 25499 37662 33334 29887
15137 29887 11457 -5878 -6849 1448 9495 24073 -7160 -14512 -40046 -46089 -42136 -10595 -1435
15124 -1435 -13111 -1471 35320 42943 49152 61598 44968 26929 -2374 -37374 -26421 -5092
15112 -5092 -28029 -39983 -21740 -9372 -13535 -28556 -27293 -14164 -31296 -41563 -49213 -41153 -24177
15099 -24177 2704 19196 21270 -3367 -28811 -16707 521 3586 -480 43102 38701 -7054
15087 -7054 -26207 -29465 -8686 1163 7537 6263 29543 39177 30895 15060 6365 1016 25230
15074 25230 32421 43360 66954 72565 44157 -796 -24200 -12608 -783 -6794 -25699 -38808
15062 -38808 -17134 2113 25437 826 -16369 -6693 8621 12069 15731 26202 31462 16308
15050 16308 4301 1230 -7723 7124 25658 31626 31806 53501 55495 18574 -52733 -63987 -40248
15037 -40248 -3531 5951 -27315 -28609 -10057 -6159 34992 33016 7496 12181 -647 -5493 -1553
15024 -1553 8730 6941 14079 -19701 -50028 -44038 -13102 12891 27691 24957 44970 51889 40272
15011 40272 1059 13983 12716 15192 41499 40481 37076 13456 19518 41284 42158 33603 27670
14998 27670 29786 54972 55435 12864 3425 41257 73063 76588 66840 43234 77506 113010 112908
14985 112908 123771 142615 163144 171986 188946 214944 237799 224967 244264 248779 236732 256061
14973 256061 270352 277273 270733 278203 294859 314773 361318 352116 328965 326430 341329 350439 323839
14960 323839 314446 299344 270188 266917 276413 312919 330965 316694 315846 283758 249413 237383
14948 237383 226577 205439 172284 183785 209188 191129 179808 166285 159884 145562 158060 172074
14936 172074 181745 152284 123913 83439 71045 61100 55911 59963 28635 11565 35238 44429
14924 44429 51446 31281 29401 37018 41508 54146 78716 86962 73329 46698 39655 59862 66000
14911 66000 56634 36034 15962 13988 39969 55788 32862 6328 773 23399 35679 39568
14899 39568 44959 47137 58179 70618 103993 93821 75172 35294 22761 20506 23149 56279
14887 56279 66084 33994 1623 13281 58349 65773 60572 45740 56216 65453 63052 44739 53876
14874 53876 58132 55220 33860 17017 26413 -21 -22007 -5154 25054 25484 18196 -10561 -9777
14861 -9777 14643 18767 29243 39068 20726 14244 39959 37406 25011 18468 29025 39149 26886
14848 26886 -2789 -5085 4952 -2777 -5272 20798 34217 33167 44670 44873 49776 32495 29719
14835 29719 32403 35740 34263 12492 15687 -2585 20256 4953 24783 38937 30281 15160 -6707
14822 -6707 -35752 -41255 -20857 19286 17648 -1929 -16766 -13473 -21124 -16155 18166 29018 12118
14809 12118 8846 15735 12571 23970 36390 51423 44959 28367 21071 48905 75646 66681 65546
14796 65546 67391 42468 32019 33496 44850 34547 30285 22552 25050 42036 41800 41545 39419 42580
14782 42580 39906 67027 70870 69732 62024 88911 107945 58766 75288 100869 75948 78342 79070
14769 79070 80456 85107 90770 102199 126831 95183 57625 65016 99496 122153 125457 110299 77216
14756 77216 64586 69127 83287 73969 60164 31966 33621 65769 59960 60194 43988 17757 38573
14743 38573 55569 53603 44084 42297 39436 44176 43918 64355 105663 68052 17535 22183 28640
14730 28640 35271 44730 31175 32833 56631 47956 36398 48362 73582 80206 43423 43578 40642
14717 40642 71536 95092 89486 89188 84568 90240 83069 67883 70777 55984 37439 29432 48388
14704 48388 38522 57241 46902 14192 28253 40007 51272 63216 76658 58186 55181 45323
14692 45323 31769 54483 69417 65357 30270 23139 31440 20755 17592 12405 5908 37720 55283
14679 55283 62075 94088 143713 149410 126559 99456 107478 115174 139179 141972 149866 159757 101207
14666 101207 102933 140858 135928 101250 83076 122143 175012 199823 184175 171511 170546 158693
14654 158693 153345 166271 170060 179172 162473 160468 190679 209964 207622 235119 255973 218314
14642 218314 250595 295462 334323 324485 318875 307356 328541 344653 375406 385379 362580 370695
14630 370695 432994 463216 471180 503618 524571 542010 554650 578403 611213 616837 615340 644798
14618 644798 648286 662021 663623 669454 696014 716118 698642 713664 731573 710388 711606 727796
14606 727796 729102 752874 767901 786136 800338 805012 777196 784855 798262 822982 816585 789467
14594 789467 803147 816273 846027 878055 880503 851044 855946 872578 890468 910974 933705 967805
14582 967805 1007869 1040367 1072185 1086681 1133721 1197049 1233090 1316157 1405034 1494894 1610419
14571 1610419 1749203 1884694 2029299 2188564 2370618 2505486 2629983 2757834 2891723
14562 2891723 3019369 3161486 3330315 3516546 3751674 4070972 4410948 4803073 5235769
14553 5235769 5736683 6293633 6885500 7565602 8294755 9085858 9973300 10963480 12073364
14544 12073364 13273481 14623352 16130156 17748344 19479784 21411319 23452188 25604608
14536 25604608 27844766 30164323 32538256 34948663 37345532 39667326 41905362 43988645
14528 43988645 45953785 47781357 49434975 50905681 52234694 53385211 54350423 55191335
14520 55191335 55887206 56481722 56989261 57357261 57642461 57869620 57995807 57991814 57921369 57764139
14510 57764139 57432713 56904850 56175038 55293566 54196414 52900745 51375907 49692179 47846230
14501 47846230 45870549 43757825 41598495 39412702 37227882 35096415 33009539 30959041
14493 30959041 29037709 27228462 25555156 24007156 22518556 21098796 19857533 18715006
14485 18715006 17680378 16721585 15816753 14959925 14163510 13442687 12796886 12149602 11572124
14476 11572124 11045163 10529052 10059222 9633561 9198674 8794890 8438806 8062717 7718646
14467 7718646 7394249 7088956 6825871 6587616 6337700 6073207 5860196 5623852 5434705
14458 5434705 5272956 5093087 4897154 4704242 4532381 4379803 4237463 4093238 3972903
14449 3972903 3855554 3716347 3594319 3494125 3371621 3255269 3126674 3048770 2972027 2909951
14439 2909951 2845319 2737447 2658303 2571550 2471205 2383311 2307198 2252000 2217382 2171891 2117265
14428 2117265 2056516 2007507 1950053 1875307 1821899 1756834 1694766 1633142 1604198 1578607 1533254
14417 1533254 1493898 1456702 1431485 1411735 1368506 1318235 1256478 1228635 1194548 1172776 1178364
14406 1178364 1172013 1118136 1089798 1076011 1062224 1030138 982918 932685 944191 929917 884200
14395 884200 852317 808269 748339 751359 732169 716633 702832 683598 674234 659912 649801 629163
14383 629163 597882 574173 555100 539423 510102 476669 438099 452528 434540 415230 409878 407183
14371 407183 362127 342961 357184 353912 334563 336337 318133 292522 284715 267047 252121 253732
14359 253732 263997 247538 247165 259860 254627 253683 258432 234448 225875 193296 185203 191078 203877
14346 203877 215610 190209 182332 178468 196399 208546 204672 206311 231170 237223 212305 204070 176438
14333 176438 195806 197805 175071 158161 165391 170635 154150 133891 153464 176783 219573 230957
14321 230957 233445 230579 204704 191657 196149 198730 205620 207037 190082 148960 150283 161818 145495
14308 145495 139778 137966 151630 160709 124493 88030 99127 137686 114986 101152 99454 104452
14296 104452 115146 124037 119096 126923 76536 51136 69654 90594 114895 133536 97772 81593
14284 81593 83095 74694 89178 97713 108412 115890 117797 105909 98933 99260 111381 120708 142421
14271 142421 153899 147983 139798 147317 132665 107263 128852 103332 71139 63009 58400 65926 55051
14258 55051 79210 113751 109380 96026 77582 50992 45835 51468 73989 93417 84998 71009
14246 71009 45915 16531 -2067 -15573 4295 52292 58139 28769 38013 42270 16584 33049
14234 33049 27432 24844 35810 22188 -6817 2031 7228 34594 50780 25298 17161 -1470 1055
14221 1055 -18431 -16926 -46486 -43190 -12468 -10362 -17998 -15089 1741 8914 10451 14469 2163
14208 2163 11834 -1846 7426 19312 20146 16707 26409 12286 48104 49593 33764 -2295 5257
14195 5257 45941 54945 25926 19837 -13131 -35799 -27322 -12202 -7367 -4589 -2395 7354 17884
14182 17884 -26 -2632 2269 6477 14238 -5903 -29776 -31484 -28424 -21506 20037 27481 34570
14169 34570 27596 4194 -9610 7232 -17441 -4248 -5775 -12802 33906 56092 75086 47848
14157 47848 17333 12707 12444 -15809 -16591 -8658 -958 9306 5176 -23344 -19947 -21288 -5242 5811
14143 5811 14612 15037 19347 11211 19754 3288 -26824 -19854 6317 17466 -3422 -28587 -20308
14130 -20308 -20723 -16186 -9393 -12542 -25607 -37044 -14126 6989 -7989 -25876 -26934 -7472 -15548
14117 -15548 -29604 -29538 -27075 124 -4048 -6766 6809 44468 49565 22810 34072 37473 44796
14104 44796 28089 13156 14804 10385 25899 50003 47942 13525 12819 11859 47154 89276 89825
14091 89825 90609 123085 108825 78146 38621 59090 82732 126202 163352 168779 181024 172966
14079 172966 195057 197529 193878 246094 274034 269794 249987 257617 265076 255029 278913 275594 298301
14066 298301 286158 270580 301511 343242 383803 334329 310288 300628 316980 321076 325375 340189
14054 340189 330814 344755 357531 321107 275776 273174 264319 275262 271879 245299 236082 223344
14042 223344 195055 187799 160308 143391 136375 110263 96629 98670 90291 95551 80322 61542
14030 61542 66024 88717 115357 122067 93043 78443 68122 79864 71063 84476 72746 65672
14018 65672 84156 93146 80987 51876 45725 28437 -8013 -9537 -12746 24810 51211 30928
14006 30928 37433 18354 -3826 23658 57479 53091 24064 2427 24370 67466 115789 117158
13994 117158 67084 31055 13463 16410 24220 23463 -1092 21014 44411 27862 34345 38948 20885
13981 20885 8836 41930 76175 85484 60818 59035 50535 62042 59773 46851 39621 885 -18520
13968 -18520 6388 17131 10421 -172 18851 13008 20185 -2400 -18447 10016 48051 75651
13956 75651 59621 28808 37353 51509 48023 14556 7781 9638 -8313 -18138 7998 27683 10901
13943 10901 -37676 -28942 -13649 -1305 22754 16041 13444 -2849 972 16005 1990 22119
13931 22119 41290 61322 55411 63435 22291 -23389 -10526 8359 -10351 -16287 37398 61710
13919 61710 59678 57890 14373 -32620 -47910 -44555 -41427 3584 8451 4030 10869 20855 20483 13001
13905 13001 14635 17016 27731 29509 56892 42981 28644 7106 -4582 5411 9514 34456 36782
13892 36782 4276 -17254 -13346 8937 15608 19500 -9723 -20161 -15692 -10794 -38135 -37864 -40176
13879 -40176 -64637 -74503 -31293 13888 -1458 -17944 -14339 -11616 -18293 -2021 -4752 1635 -9537
13866 -9537 1913 1638 -6323 15872 26555 17353 -8524 -4674 -25394 -33367 -20682 -20086 -25645 14525
13852 14525 30134 31495 39624 51412 43681 44098 37104 25248 20835 -1401 -16044 -39768 -43761
13839 -43761 -14766 -14671 -1427 -13328 -12966 -27599 -23660 -14724 -15877 -379 22763 18334 -5175
13826 -5175 -6161 -14926 -40180 -52353 -12144 15306 6662 -8877 7672 26483 26562 26112 17097 9479
13812 9479 5277 -1276 -13736 -6991 -2806 26387 9313 -11538 15721 22151 17185 44125 28362
13799 28362 26411 7543 34806 41239 14495 21896 23566 11143 18769 -8089 -26550 20715 40929
13786 40929 28771 10359 -17451 -24016 -45212 -37852 -29216 -16316 -11098 -11400 -21812 -32103 -37713
13773 -37713 -4719 2562 -6561 -12986 -8654 -768 -27223 -32861 -25904 -40766 -37422 -57243 -36879
13760 -36879 -12654 -24737 -48892 -55481 -69873 -64133 -56405 -38732 -43979 -42167 -30909 -29940 -25822
13747 -25822 -7133 16271 20133 3549 -8718 -34378 -48262 -6881 7502 8039 54423 44848
13735 44848 14405 24933 16958 2580 13891 40214 35297 38784 48830 30429 -4167 -22680
13723 -22680 -13816 -8389 -21696 -23928 16654 22275 4543 -1249 5672 -4861 -28834 8006 23223
13710 23223 8068 -10407 -51534 -47007 11034 44534 42127 31218 10942 -22329 -5797 51129
13698 51129 32462 34242 33492 32789 44021 29170 -9480 -13987 -25374 -8753 4001 37211 60994
13685 60994 63499 46889 -5613 -11870 6611 9715 -17283 -27108 -10084 -25515 -28770 -28289 -31820
13672 -31820 26231 40671 30951 -13715 -19768 -18907 -533 14819 7879 -10353 -31266 -44346 -25461
13659 -25461 -23288 -40367 -47392 -16154 15621 2844 -1626 -13885 -24307 7434 20794 13515
13647 13515 27885 33546 40928 17261 16337 19771 19323 -18862 -31690 -43342 -18494 -24789 -21532
13634 -21532 -27731 -33419 -45683 -17427 -36558 -56909 -54946 -26288 -27068 -9584 -10403 -23816 -3106
13621 -3106 34792 40494 19365 -22067 -27486 -6502 1221 8643 32891 3939 -11996 -15649 -30372
13608 -30372 -15994 10156 7716 5155 9991 8607 -19764 -34494 -47148 -40974 -32607 -1360 2496
13595 2496 -12959 -21261 -6708 -19958 -19326 -17932 2162 -8286 -41680 -37874 -45505 -40072 -28659
13582 -28659 13521 20654 1560 -3608 21794 -3639 -15520 4336 10731 23789 28585 37214 58865
13569 58865 51294 44791 33233 31184 -25552 -22107 -14213 -14867 -8496 -3868 -41046 -56161 -36043
13556 -36043 -18208 -29045 -13078 -9088 -370 21646 6287 -18553 -8423 10676 -1741 774
13544 774 16615 10337 35282 47441 16088 -11094 -16386 -36396 -31777 -17700 -11070 -22434 10932
13531 10932 11153 10167 26340 24661 15632 -4910 4930 6024 -945 6171 9020 -8122 -15538 -21408
13517 -21408 -11861 -27310 -26738 -34955 -5064 20229 49119 56095 58689 41357 31757 13780 9946
13504 9946 3851 -13513 -30355 -40465 -26699 -29735 -42934 -36217 -53770 -84658 -61685 -3849
13492 -3849 -2057 -6427 -35256 -32045 -27152 -53662 -50353 -27235 -20043 5036 13157 -32715 -65050
13479 -65050 -55911 -55244 -25931 -885 -4921 -665 33844 31659 12181 16205 21818 28855 7826
13466 7826 8412 -1415 -11107 -36715 -48916 -19544 -37848 -53942 -53146 -26740 -30318 -32047 -13330
13453 -13330 -9995 26 -4011 -16422 -3494 13413 23849 9537 12494 29516 38138 71265
13441 71265 63362 20573 404 15042 13065 39214 54526 43681 48231 37746 19740 -14726
13429 -14726 -8662 -4377 1724 28132 45042 24173 -9119 -30754 -21032 -30019 -19713 -9075 8868
13416 8868 -2767 -19180 5048 -13039 -23781 -43981 -42877 -35996 -3392 -9660 5802 -5868
13404 -5868 -25862 -10018 5672 18564 22925 17442 14248 38646 55771 26553 4681 -69 -9299
13391 -9299 1919 21087 370 8062 22876 21144 -12658 28652 28768 28431 29024 27225 25449 23396
13377 23396 32484 28705 21391 -5854 -29185 -34489 -18864 -2103 -5735 -11857 -10936 -3172 15531
13364 15531 -683 21408 10364 -1406 15258 3286 20928 34160 35227 23011 -16655 -23152
13352 -23152 -5389 30117 28389 27140 22409 30504 16853 3048 -20504 -22682 34791 56809 54095
13339 54095 55339 74770 87320 80503 30898 25765 18306 -4725 -7271 -4913 5329 -13534 -36877
13326 -36877 -38216 -13974 9311 -2771 -18486 -6720 14031 8394 793 -6676 -36798 -11839
13314 -11839 -6133 2503 23260 23906 16675 -1583 -3269 15436 -12058 -15902 -19531 7117 15224
13301 15224 5711 9639 34408 54954 65711 45704 46190 28272 14079 30737 53014 76082
13289 76082 65650 45046 20945 27311 35733 10892 -10280 -25805 -26763 14191 37020 55446
13277 55446 45223 60207 44354 21034 514 -17557 -34270 -38411 -16201 -3346 -465 -22822
13265 -22822 -27345 -8272 -10479 -4130 1973 7203 -12879 13561 31404 32446 14057 10269 -16709
13252 -16709 -23348 -32854 -16287 -4458 13945 23325 13519 37905 13890 15622 13059 10786 8997
13239 8997 2177 -15293 -18103 -20405 -17936 -15495 -17633 9808 5209 2578 37440 34580 34556 42939
13225 42939 41917 32401 31106 37263 21898 12396 36596 21695 12003 9154 18709 8391 30402
13212 30402 40454 30479 -1176 -13011 -23089 -51460 -33570 40515 73109 82131 70642 56270
13200 56270 30427 6507 -1058 -6704 -24826 -3958 -7513 23341 25041 11250 5056 22374 67770
13187 67770 47359 19770 6705 3798 41698 32018 -6008 -39058 -31329 -44369 -34706 -30922 -20312
13174 -20312 -14398 -8759 12625 10541 12347 28895 47486 51962 26285 24205 22782 -3938 -9955
13161 -9955 -2792 3454 20143 16114 30156 31600 41960 37939 16182 19764 45801 12432 -14718
13148 -14718 -19926 -41256 -22738 540 14803 48813 69947 51976 53988 51335 19619 -787
13136 -787 -16768 -21126 -23048 -18113 8095 38273 42209 41334 50302 25553 26076 16457 6136 25623
13122 25623 71187 92267 74584 84198 93121 147878 174008 205878 247893 296333 367264 465607
13110 465607 642014 999867 1526765 2110720 2509223 2668895 2723412 2662731 2233193 1626842
13100 1626842 1267494 1153871 1229492 1464646 1752540 2004664 2150478 2179837 2073100 1859428
13090 1859428 1477190 1075294 803569 655836 580484 484427 456995 420553 381052 364085
13080 364085 337773 287197 253569 230554 249362 246608 228841 218681 244428 278662 262396 221766
13068 221766 214667 216374 187502 183564 204418 209344 179196 167385 162157 150152 130724 116706
13056 116706 125224 103180 92332 111357 134446 123227 100066 84382 73424 75724 64337 89343
13044 89343 107804 106693 118229 91230 69842 57234 33350 40448 62301 101017 114240 90404
13032 90404 88745 122344 146631 111123 104427 66989 52085 61228 60127 51596 75317 84671 73316
13019 73316 80833 72753 72917 74310 84040 91379 58307 41218 40313 42441 43875 36989 55027 56029
13005 56029 71143 86548 71721 66889 65272 58940 70212 97528 97483 104726 96344 85586 105846
12992 105846 81200 71928 71154 63956 64472 65052 53026 46512 39846 25165 46836 44001 45193 44652
12978 44652 47800 52537 63550 62409 56006 41080 6096 11622 32503 50945 23754 26798 43425
12965 43425 46873 59906 47234 31671 52353 41370 23025 27808 42555 58741 43518 44033
12953 44033 21191 11041 24560 52860 93232 68794 59098 73183 63786 49838 75398 68216
12941 68216 59246 73077 53433 25941 15585 35167 35366 29704 14890 7099 1002 14961 36150
12928 36150 56521 76333 86513 66236 83899 84847 101244 135268 158976 193443 186294 216047
12916 216047 238530 241419 232057 238806 221595 223398 227072 175555 129282 122493 99732 82722 74111
12903 74111 77334 90249 80423 116693 142282 106156 93991 95551 103843 129291 126839 121304 129562
12890 129562 108974 93555 91698 119064 104107 118583 120033 132630 156547 144889 123636 118540
12878 118540 79328 60291 59736 50803 24991 13100 64383 86766 103083 97443 84384 75501
12866 75501 76878 59577 35781 36363 52541 49761 86204 97678 100183 78847 79765 77378 72358
12853 72358 69306 19638 -19905 -56252 -90683 -105293 -123898 -134523 -110038 -63467 -45932 -12276
12841 -12276 7176 40060 53771 29768 23262 20591 19139 44026 65753 86818 94595 90790 54586
12828 54586 44936 61519 86588 84680 74374 92992 79093 39948 43221 54743 29247 18436
12816 18436 25410 33765 58516 51326 56183 46932 65031 69082 65289 63996 87710 104718 119490
12803 119490 161680 153776 154398 155210 186982 202649 181719 165337 157094 190084 246098 303129 351824
12790 351824 414035 455237 445983 435539 440315 421715 366637 299495 248134 242019 227864 190996
12778 190996 174365 183201 196549 236896 244657 205632 204181 209942 214300 235888 273947 299602
12766 299602 330604 341920 336405 344885 344805 352311 389798 415607 438970 438024 438759 453711 512131
12753 512131 623779 736028 845380 951993 1010329 1040920 1004403 920364 806223 675751
12743 675751 579641 522384 507060 486515 464591 466830 472889 453840 425569 391070 391250 383281
12731 383281 367966 382192 384544 365531 389725 413569 458052 511761 552442 617548 665423 680286
12719 680286 692907 693972 694172 718534 734128 738840 735734 745087 768320 783421 783933 785091 806454
12706 806454 858456 914610 976057 1051289 1118875 1123967 1147288 1181307 1259973 1317635 1377083 1527732
12694 1527732 1656245 1801877 1942423 2051733 2176438 2325217 2479489 2619810 2798321
12685 2798321 3003562 3222229 3495102 3812016 4195204 4666972 5290838 6022854 6916247
12676 6916247 7997185 9312788 11034930 13200729 15828239 19026017 22881510 27662528
12668 27662528 33974698 42940822 56937863 80679416 121453619 182521398 252727837
12661 252727837 311992192 348363289 362268256 351252689 306333298 235655665 163902350
12654 163902350 113790802 85634981 69643484 59601239 52627912 47299040 42915410
12647 42915410 39076458 35681051 32786080 30484132 28668115 27225826 26008870 24934993
12639 24934993 23937621 23008512 22158983 21292006 20463708 19592073 18668723 17748762 16864181
12630 16864181 16032518 15258521 14601312 14026217 13516597 13088531 12676756 12243987 11817951
12621 11817951 11416865 11029503 10613512 10238224 9892609 9544663 9202383 8943284 8698193
12612 8698193 8446152 8232855 7955122 7664650 7383901 7102125 6873486 6666076 6434869
12603 6434869 6193624 5962013 5751096 5568072 5415520 5285867 5194968 5105281 5020862 4922997
12593 4922997 4860506 4804703 4703693 4561772 4431183 4276886 4116537 3982652 3855729 3775192
12583 3775192 3681768 3592920 3548888 3481891 3383995 3242896 3123892 3023003 2958409 2879464 2846223
12572 2846223 2816092 2771825 2726509 2678572 2582705 2505813 2447118 2374167 2276801 2155364 2077636
12561 2077636 2036716 2014672 1997921 1993127 1985102 1940693 1918272 1934482 1954609 1931177 1934726 1899676
12549 1899676 1838947 1782218 1767277 1747131 1729000 1683754 1640665 1637402 1646091 1633599 1600029 1542036
12537 1542036 1480615 1441287 1408450 1410510 1413972 1387877 1390397 1454466 1618189 1906873 2306073
12526 2306073 2734399 3043998 3178263 3134050 2895304 2480408 1995980 1581218 1280728 1122348
12516 1122348 1029066 956361 907357 888651 895135 905394 874980 833133 780776 728238 686248
12505 686248 674665 649081 592746 566252 556296 563010 544973 497655 487864 479655 493627 520062
12493 520062 537765 502938 440558 395131 399492 426020 446496 456333 455262 478294 468915 423232
12481 423232 408013 402553 409197 426126 433133 438346 472624 503154 537115 536237 509257 479815 462454
12468 462454 438940 402898 361753 366955 371090 356057 338040 345202 358743 348079 343293 338583
12456 338583 316542 329769 325173 331664 340642 344602 362542 385455 397546 384883 377489 414097
12444 414097 433408 419651 382786 329921 290663 254802 243826 240728 228331 239733 255166 270568
12432 270568 281442 266728 294656 310335 267008 229543 210515 243671 244313 243222 274096 283600
12420 283600 268561 249874 257142 257948 251442 260074 245363 238222 263723 279293 275978 255167 254375
12407 254375 253004 266838 258724 210786 180395 156619 113063 88343 113851 144878 173112 165516
12395 165516 154323 159571 173104 203733 215411 175222 144088 151391 122744 109902 130199 151143
12383 151143 172352 162771 161475 170341 188134 157635 119180 162061 176073 165768 129882 86886
12371 86886 68170 52317 56594 55062 61612 64671 66886 64045 50728 34712 12388 -2853 8981
12358 8981 21533 46709 71014 108458 92964 97151 82236 25381 -2590 28805 41194 37017
12346 37017 70309 76015 57978 46365 32248 11065 18661 37237 40015 8689 -1441 -13697
12334 -13697 18635 45742 38697 44240 53098 77098 81604 76148 54485 56413 58911 33618 6221
12321 6221 22522 54881 64494 51825 40143 10078 -14598 -11804 -5668 16422 8846 17291 19833
12308 19833 11339 7751 -12675 8853 37722 30190 10925 33287 60374 31785 13382 31920
12296 31920 38397 35251 -18603 -31802 -10401 -1450 6431 28510 33253 27768 25736 35030 1215
12283 1215 3491 -17723 -8751 6568 43658 61457 67376 48200 50192 67581 98590 80756 62531
12270 62531 65919 54483 47167 34815 51216 64266 47601 42855 45028 35245 11770 13910 8602
12257 8602 -4721 -1593 -12728 -43911 -38702 -15059 14838 24208 28011 21010 8800 20273 71073
12244 71073 113664 101622 90222 60282 47334 51516 59840 61449 60310 73652 96757 139657
12232 139657 123868 98571 115578 147000 190395 226290 248741 306372 441718 699301 1071226
12221 1071226 1424375 1697339 1871245 1892266 1788187 1520851 1145642 780209 529630 394520
12211 394520 345356 311031 280851 238389 191418 178476 184568 181759 143235 112154 118143 139192
12199 139192 100466 111569 139149 147467 144902 107316 102686 115505 84252 95559 102928 119199
12187 119199 127815 116320 103492 87176 90380 100997 88443 91187 83167 44614 40487 28310
12175 28310 6376 20947 28484 46225 74814 72715 68337 51672 53075 26372 22456 29215 38805
12162 38805 36935 23195 21148 -15027 -4193 16051 53349 53966 47830 39473 39790 48809 38731
12149 38731 24850 47495 18921 10652 -7289 14813 42882 48574 38500 50176 49178 24004
12137 24004 38640 53238 54798 32274 26995 39935 63651 47353 29820 -14599 -21688 -31024
12125 -31024 -35604 -31743 -26390 3990 48027 37642 39654 25527 24154 10568 -329 9013 23931
12112 23931 35172 36342 22765 40859 59197 84933 67082 20945 26556 33965 25176 33866 27700
12099 27700 28545 38813 56722 69572 53948 25174 18177 20679 2245 -15759 -24853 55 3236
12086 3236 -12081 7789 32657 41558 40690 26599 14530 -9057 -20139 -27815 -5940 319 -5049
12073 -5049 9703 5452 9326 36668 16011 -6252 -4442 -13636 -33888 -31860 -11869 8356 39381
12060 39381 45633 14592 962 -11091 -18612 6549 34384 21738 16786 26964 2891 5647
12048 5647 -11485 -22914 -1746 15676 23731 40496 18080 -19698 -38581 -61251 -58760 -48876
12036 -48876 -32906 -9446 12147 35999 37380 16150 9021 4872 -7771 -22507 -21768 22789 46872
12023 46872 45264 44548 29845 18371 8906 5550 3358 4129 32177 42356 32991 53828 59831 48573
12009 48573 36927 1524 -4657 -45209 -64590 -34636 -24773 -21230 78 4571 -10340 -28902
11997 -28902 -27006 -39793 -47472 -35937 -18997 6224 14621 32435 18728 -6289 6598 38449
11985 38449 62872 39040 17827 9138 34888 15487 13343 9496 18966 46692 62949 59230 8400
11972 8400 5692 9139 20292 -1048 14679 44073 17033 17712 37503 35282 41731 17616 -19057
11959 -19057 7451 32463 25757 5929 -624 14479 4792 -6762 -3813 -36393 -67911 -38822
11947 -38822 -14773 -6651 -3114 -5222 -7174 -5931 -9564 -10176 7607 -6728 -6527 -23931 -34886 -55283
11933 -55283 -61798 -47490 -54198 -38253 -6861 2183 -9302 -8815 -2777 -15373 -25845 -37103 3822
11920 3822 9863 27068 46270 22334 21988 8675 1516 3651 20148 18678 41872 32377 -1893
11907 -1893 -3285 -14728 -3563 -5220 17180 28867 41155 61218 46620 27013 1476 7701
11895 7701 14423 13310 19133 31113 28816 18995 22809 17320 -3706 3428 16871 25245 43634 32562
11881 32562 6934 -7181 -22390 -23511 -9962 17788 23567 34377 59777 63567 37919 28360
11869 28360 14444 38800 51210 20114 50573 71553 43823 17153 34367 52099 37624 29092
11857 29092 28442 31933 25518 -2984 -16914 -4247 26834 21883 13561 11024 5801 -4838 647
11844 647 4842 15035 -5452 -2050 37360 18861 -4000 -22709 -35660 -23626 -32562 -38489 -15686
11831 -15686 -16243 -16446 -21739 -3040 -6805 -18797 -14949 -6137 1887 1475 1067 6773 21512 34215
11817 34215 31008 20624 8092 -3341 4136 -25674 -27734 -3972 9674 17658 23470 -11324 -20411
11804 -20411 -687 26836 41649 47339 53936 43184 16731 -1254 -27883 -38655 -23703 -31198
11792 -31198 -22602 -29707 -38036 -5896 6202 -15723 -23275 2119 8709 -16576 -18926 -30 21765
11779 21765 36914 53019 46276 11269 -1014 98 -12375 -17599 -2351 -6872 488 30906 19774
11766 19774 -12394 23410 29074 18162 23534 12336 8414 1524 9361 13495 14872 -1216 -5804
11753 -5804 4919 13240 21127 40296 45376 44649 49152 35496 49838 45625 1845 -38062 -20958
11740 -20958 -37431 -56509 -62682 -51432 -52093 -7788 6908 13319 23873 24115 28642 13061 -6995
11727 -6995 -20658 4363 5420 -7057 -7314 3704 15553 8751 -13961 18657 23067 6597 -30941
11714 -30941 -39966 -18537 9744 -16903 -52789 -33506 -8841 12030 -18199 2081 2978 3849 2210
11701 2210 -4040 -25651 -45786 -36042 -14290 3263 -12433 -2480 -15019 -25545 -7362 76 9608
11688 9608 20344 25867 39687 23219 -30531 -35330 11281 16654 4568 6125 -6581 -22790 -25636
11675 -25636 -24243 -34422 -22221 -20580 -734 14905 32593 -8115 -22045 -21835 -21489 -22441 -24273
11662 -24273 -5380 -12453 -12605 -41501 -23527 -13514 4534 8287 15967 15881 12641 -5064 -8881 -20972
11648 -20972 -5488 5046 -19986 -46296 -35478 -21215 -30212 -21116 27309 28831 30454 25350 -1948
11635 -1948 -5480 -7700 -31210 -10157 -17292 -37190 -47329 -20990 3713 -2478 -6598 -12689 -18543
11622 -18543 -14113 15014 39267 54945 46130 55464 45935 40177 48981 68921 47012 22278 7804
11609 7804 -8273 11989 27710 31970 -7065 -597 16240 4193 -11686 -15052 -25482 -22635 5249
11596 5249 30282 11799 5114 -24965 -25563 -16234 -11877 3147 22692 21811 -6398 -32671 -38057
11583 -38057 -40901 -23920 -11041 -11756 -23077 -27991 -13565 -1584 -1944 2503 -2747 -3902 -43244
11570 -43244 -48310 -12757 23125 37072 17079 -19428 -24291 -16022 -18913 -4434 3795 21964 4489
11557 4489 -1196 -21774 -28935 -13064 -26668 -52496 -52812 -24664 -9456 -13342 -14304 -31172 -10294
11544 -10294 10453 19680 16082 14033 1879 -2982 -2363 1767 10286 -12013 -33015 -42510 -18717
11531 -18717 13077 17510 12656 6613 -16144 -33609 -14637 8759 34301 46632 29716 17551
11519 17551 25309 2108 -25712 -17113 -38347 -51498 -36077 2851 26080 24243 15297 8785 -6966
11506 -6966 -34522 -35338 -7987 15683 2630 -13373 -32157 -28180 5461 -12097 -46151 -46686 -45992
11493 -45992 -26055 -11031 18042 17259 3837 1944 -3173 -6254 4876 15212 32682 38595 52977
11480 52977 56421 27974 34234 31059 19957 22796 22539 48124 41798 20396 -3233 -14634 -12875
11467 -12875 1057 7827 -3029 -1267 1878 15221 2822 -11443 -23562 -38463 -33444 -49648
11455 -49648 -22259 -29396 -47866 -40957 -41106 -14886 620 -7708 -31362 -39116 -47235 -58714 -7295
11442 -7295 -13218 -28545 -30961 -22609 -658 -19978 -36973 -46175 -16868 -16000 -27346 -38597 -20754
11429 -20754 -20995 -34698 -38529 -19005 -13703 -7466 -21114 -19724 -25807 -28712 -24705 -6634 -32829
11416 -32829 -42879 -26136 22333 30252 13091 16056 2792 13482 20477 29455 27594 2812 31229
11403 31229 47718 51251 34735 -4517 -20502 -11989 -28429 -33000 -39252 -56266 -33446 -20953
11391 -20953 -8855 -15274 -3568 8751 -9779 -40564 -56958 -52866 -41130 -40613 -73681 -74565 -49056
11378 -49056 -23638 9620 29109 35596 226 -14436 -22842 -43755 -40075 -34538 -10526 -3075 -10738
11365 -10738 -777 10037 7424 17739 2960 -7815 36246 43992 -419 -5934 -14943 -17782 -45255
11352 -45255 -72987 -62100 -51062 3264 36774 4668 -19057 -22849 -15744 -14144 -19714 3870
11340 3870 11588 20856 12769 14114 15085 29105 13397 -1736 -6254 -14234 -20024 -37976 -41106 -31040
11326 -31040 -26678 -7518 -18148 -19007 -6031 -40579 -33257 -18105 -34973 -37156 -35230 -19836 -41751
11313 -41751 -36011 -16257 -14011 -7559 2396 45275 17558 -19859 -12176 -13033 -29595 -27107 6376
11300 6376 4817 -20244 -21354 -28215 -38811 -59504 -70351 -80974 -40744 -38362 -25698 -13506 -3415
11287 -3415 18152 28108 12909 11979 36521 71508 64130 76612 62039 29458 5703 19503 22824
11274 22824 -1266 1276 11088 22515 5208 -24435 -20467 12050 6490 -16524 -20416 -1876 6568
11261 6568 14419 13307 50 -10655 -6272 -12064 20717 51798 24281 -16048 -4916 30150 57443
11248 57443 11292 -3456 17578 32762 13708 -6007 -11046 909 11367 36256 43644 37869
11236 37869 10192 3686 -4642 -21487 -18397 -17745 -23179 -19000 -7861 -37057 -18958 -21122 -15897
11223 -15897 5276 16468 7070 -27327 -49318 -47884 -36463 -32493 -5835 15353 14736 6711 -16084
11210 -16084 -7245 25458 29557 44715 29998 -26727 -47858 -33157 -6997 14675 21228 -4127
11198 -4127 -29274 -22796 -346 -5785 375 -2896 -7242 -8050 1185 565 370 8992 -31200 -38799 -26754
11183 -26754 -1519 9897 4667 13146 18295 36986 35316 46752 65839 57834 40086 37352 3484
11170 3484 -6981 -17903 -19590 -7780 9492 13113 16289 -879 -31258 -37388 -50862 -47177 -36572
11157 -36572 -20952 -14670 -28865 -32997 -31364 -46136 -43744 -19237 -33707 -44496 -26269 -12524
11145 -12524 -19110 -40856 -41037 -23287 -9725 823 -4273 22400 38217 56264 36351 23212
11133 23212 -2674 -28159 20762 8644 1528 32875 37747 15953 -5494 -9550 1086 4139
11121 4139 -19085 -9 21430 10058 35733 36107 6959 7660 -12148 -2441 -3663 -24252 -14656
11108 -14656 -24347 -25417 3886 -1635 -5346 -18967 -24681 -36285 -60342 -75847 -65565 -42303 -21251
11095 -21251 -14727 -3948 9461 1590 2928 -8436 -6184 -6777 -11176 -45254 -57812 -42812 -17178
11082 -17178 -3866 -7316 -1677 -5347 -20974 -2672 24868 45387 40932 23084 16900 21798 13103
11069 13103 22050 25094 4148 9817 25813 44094 42931 21988 9861 15437 -14539 -29756 -24391
11056 -24391 -28621 -69550 -72648 -57990 -23432 -6858 -180 8290 47134 62062 33530 -3613
11044 -3613 -14193 10063 -441 -42133 -43889 -42544 -26402 3418 42914 63743 22018 -1528
11032 -1528 -50447 -38998 -14280 -34799 -48463 -16709 25896 7989 -12889 26774 12811 1828
11020 1828 -12615 -12700 -8358 -4251 -39221 -73398 -68740 -47070 -36678 -10135 7041 -8630 -9663
11007 -9663 8612 26113 24548 11461 -8413 -16815 -8559 21987 22049 18373 20138 12677 -3313 5135
10993 5135 -22814 -14168 -37516 -34653 -18280 3952 25443 40943 32584 25654 42218 39839 19605
10980 19605 33780 35876 25822 -8734 11467 25139 25957 34006 18237 -23277 -32323 -1102 1330
10967 1330 22982 19343 6840 -1518 21238 32875 38434 69062 64034 12858 7896 12560 -14193
10954 -14193 -10252 3964 8722 2841 -3035 -10753 -17972 -27225 -63097 -64778 -57469 -57747 -50336 -22953
10940 -22953 2084 32651 61316 60130 60022 41659 17114 -52 -12416 -10121 -31559 -34264 -59148
10927 -59148 -37427 3689 33109 49417 68170 45774 6880 -13557 -38810 -27570 -10849 -13010
10915 -13010 -27323 -26880 -44999 -69476 -84455 -74937 -49542 -48895 -23891 -1638 15200 3482 -1615
10902 -1615 -10168 -32759 -31590 -30471 -27035 -34152 -41989 -35949 -21264 10862 29024 33864 21673
10889 21673 688 9659 34253 57135 56954 30577 22351 4989 6144 -14778 -44842 -36898 -8248
10876 -8248 -10101 -14633 -34112 -16001 -26986 -44069 -65000 -81652 -81541 -56546 -25918 -72055 -73304
10863 -73304 -45028 -30694 -18383 -28728 -21763 -864 -15482 -42107 -40263 -24109 -38349 -17537
10851 -17537 -842 2498 8593 23354 14245 11194 12069 -17414 -3206 28389 14999 24895 18302
10838 18302 27844 8224 -16050 24019 28319 8017 3570 -15624 -27689 -21536 -26520 -12783 -2460
10825 -2460 5922 5041 -16362 1206 1472 9690 7075 2728 6409 10741 -1626 -25556 -33091 -27662
10811 -27662 4343 30145 59470 76859 100626 62150 35214 -11786 -35895 -70688 -39469 -1932
10799 -1932 -8711 -24179 -17248 7941 10722 -2900 -779 24454 1308 -21665 -12166 -3326 -8886
10786 -8886 -20774 -9848 -22620 -13273 -1935 -14745 -6173 -12169 -13048 -10576 -24755 -4670 -3167
10773 -3167 -20477 -32254 -2762 17119 -13534 -42024 -36053 -32913 -28190 -43265 -30110 -12480
10761 -12480 -26647 -26 27497 24860 14918 9083 7574 15097 35124 43547 1438 -41812 -30447
10748 -30447 -12817 -27775 -72294 -86332 -65230 -19238 -23964 -3628 -19690 -51134 -74113 -66601
10736 -66601 -55484 -30418 7279 32996 21551 -11415 -8376 -957 -21164 -37645 -62858 -60080
10724 -60080 -56242 -35283 -37569 -51524 -23399 7257 6451 16162 23228 17438 9770 9835 -14249 7942
10710 7942 2980 7483 33578 18459 -4426 -4006 -27050 -37281 -51818 -35988 -6105 13679 4248
10697 4248 -8374 -9705 -4871 -12768 1847 -15327 9317 47493 38609 24421 14703 4476 -10687
10684 -10687 -11079 11672 11799 17746 27229 -16814 -13986 11424 -12647 -26818 7228 27033 29024
10671 29024 17057 -4991 5097 2276 -23617 -35544 -39621 -9020 9673 -22684 -36603 -17001
10659 -17001 -27301 -42486 -55967 -78978 -63610 -18353 -1688 30458 44732 34652 43296 8159
10647 8159 -29167 -25019 8126 38938 55203 28672 2467 2894 29615 45858 26746 75975
10635 75975 91007 78629 57500 42451 42199 61999 53979 51275 91835 125408 173503 180670 185528
10622 185528 230637 346255 523351 765792 1003993 1213317 1369559 1459702 1506395 1499133
10612 1499133 1498726 1490755 1473663 1464189 1403997 1243419 1002860 746952 586843 493911 389246
10601 389246 324336 278690 227987 197812 174377 177186 189768 189928 199960 241139 241782 195182
10589 195182 203199 205485 191559 174290 132548 122386 111895 108005 109265 114775 123306 97814 94746
10576 94746 118347 100990 81947 78348 57058 49236 45181 37426 -4291 -11326 -12890 12712 30884
10563 30884 54250 53893 37124 55128 60227 49973 57167 19761 21021 28091 23865 14185 31028
10550 31028 30877 18199 5552 17126 40812 30520 14751 26269 39556 32458 29777 8514
10538 8514 35767 67347 74690 53478 39905 38036 32167 17467 27432 68493 75081 83620 90028
10525 90028 79880 39885 36493 14924 7904 30694 65767 66284 37176 17319 -7032 -6009 8070
10512 8070 16149 15176 15987 13476 9665 3761 8386 20045 -2861 -6058 -3880 -38021 -34860 -9416
10498 -9416 943 -20075 -54331 -22971 1467 -12005 -7234 -20992 -28974 13364 27607 17722
10486 17722 7429 11752 7322 17977 21254 12093 -12032 -14275 -21520 -44818 -43652 -23401 -33385
10473 -33385 -29587 -12266 -18300 15278 46847 50065 35772 24369 23863 20021 13052 9747 -9781
10460 -9781 -24018 -18744 -26767 -13195 29599 31880 -12254 -23940 4377 17115 30538 56205
10448 56205 76044 59629 50361 23712 13175 -3616 -13121 -11474 11895 13049 8500 -23115 -38173
10435 -38173 -24326 -9680 -10641 5612 9066 -5026 -826 -3010 -14271 -28247 -18904 -10857 2658
10422 2658 16958 25423 14987 -6965 -4734 28319 56347 35904 9725 -7728 -7968 21026 11517
10409 11517 -1129 3427 -2749 12960 21414 6329 -18331 -32812 -40492 -27911 9452 7416 -2141
10396 -2141 -23229 -84 -686 8836 595 -16170 13443 8048 1203 12991 -6123 13221 40284
10383 40284 22350 26035 25663 11579 4041 -14396 -29666 -10808 26420 16260 11801 19430 30696
10370 30696 19524 33020 16085 -19265 -34731 -20542 -7349 14020 48934 44725 22545 16551
10358 16551 10966 -19441 -16664 -24030 1422 24026 33443 32410 19835 3627 -35407 -52084 -22021
10345 -22021 -20787 -10946 15599 -31204 -37259 -15785 -5792 -574 -5660 4157 -2485 4072 -6309
10332 -6309 26938 38166 9537 -46391 -65237 -66555 -23971 10358 -4101 -22145 -46956 -63633
10320 -63633 -48839 -31171 -26503 -40621 -24264 -18249 9941 6381 -11560 -33557 -50959 -26616
10308 -26616 -21564 -28133 -24680 -18317 3940 27316 37020 28439 30210 12136 -916 -24241 -22004
10295 -22004 -20176 981 -1202 -3843 -221 915 12301 20200 29277 10245 17038 51825 36180
10282 36180 20422 2842 -1663 -19777 -28083 -14582 7632 3788 -25270 -24207 -9283 -15379 -32004
10269 -32004 -33505 -27393 -12434 -11634 11660 16641 32134 35755 -10092 -4773 13364 25717 10405
10256 10405 16966 25490 12166 -17552 2355 30337 20854 21348 21699 30055 49318 54417 54533 70024
10242 70024 60039 96532 158796 200367 252610 366554 477410 570130 677994 816416 890148
10231 890148 892824 913591 933546 877383 769633 656943 584869 495546 382158 280956 221393
10220 221393 192948 182571 187076 181751 171001 179087 168905 176198 119706 118887 152786 135670 94727
10207 94727 54593 83254 96631 51965 44537 37359 43589 27202 13540 15341 54259 60247 34836
10194 34836 9697 7083 -693 10531 11813 16706 6898 19980 19209 29968 34562 46753 43253
10181 43253 30487 19621 51367 53771 -9398 -18371 16173 34007 28951 3552 -24772 -4235
10169 -4235 4898 23619 2216 -1148 -109 12261 18862 30721 5720 -7547 7414 26326 7162
10156 7162 -29561 -37034 -14091 19981 -1123 -10725 -15670 -4013 -8128 -6466 5577 16839 36799
10143 36799 15761 -8106 7786 10163 22117 872 -29084 -23170 -16540 10257 27424 41979
10131 41979 35713 23798 35479 34171 17716 -6484 -3284 8460 40748 31349 14513 18418 4098
10118 4098 1090 31028 43065 34930 7285 19311 24648 29176 44569 17510 5818 -22621 -52442
10105 -52442 -26431 -11620 -12562 -19128 -25687 -11231 -17079 -5124 4869 -48 15514 21158 -462
10092 -462 -2090 -8707 -3596 11247 16042 30634 16340 -14058 -33381 -38503 -21296 -26151 -28432
10079 -28432 -29944 -27694 -39804 -57843 -62802 -60311 -19742 -30326 -4048 9380 -14913 -45431
10067 -45431 -77216 -70418 -49161 -41335 -37417 -16730 -8252 -4813 -23774 -13582 16250 40367 55794
10054 55794 31625 9700 -18583 -15495 385 35191 10709 -26394 -40317 -24323 11548 11753
10042 11753 -19080 -34210 1698 6172 -2234 8064 11126 13420 -13952 -2485 3438 5663 -12147
10029 -12147 -6912 -8897 -24991 -25864 -14984 11046 29708 28210 15772 4366 -17902 -12624 289
10016 289 -6608 -18185 -4669 12660 23875 33241 40389 30203 -1710 -3416 -508 -15086 -25793
10003 -25793 -12060 -20264 -10217 11785 37779 20766 -10246 15461 40888 42420 46373 7399
9991 7399 23442 23827 5303 17577 -10684 -14358 -5562 2905 6778 1079 4859 -10788 -20556 -24463
9977 -24463 -13485 6102 -13379 17895 43310 69755 51553 -18445 -42629 -48664 -51667 -51325 -45154
9964 -45154 -47720 -42123 -48405 -29520 5776 41144 36408 25206 23089 29445 15594 -2657 13092
9951 13092 39157 44943 27690 6760 -2270 -3766 -7203 -9031 -8442 -4155 14872 32292 37420 13700
9937 13700 -9424 -22136 -32665 6886 -9306 -13397 -14025 -21540 -16082 -26634 -2167 27920 31374
9924 31374 14620 8885 -10364 3225 5803 8291 19398 31403 -4514 -13324 -8672 -10587 1070
9911 1070 22153 55322 51602 55164 68858 64619 55539 13705 10093 8999 -5102 -11040 -19971 -34851
9897 -34851 -31813 -5438 4314 10247 19885 9655 14486 -4327 16955 -2342 -25967 -18452 -6097
9884 -6097 36813 50597 17321 -9932 -8551 3659 -7553 2078 3894 16228 22375 24689 20501
9871 20501 36288 19441 5009 6596 -12293 -5453 15835 1027 -1035 17944 8515 6898 -15313
9858 -15313 -26665 -31158 3210 36275 33063 17909 -11768 -16609 -21939 -5818 -18559 -32264 -47712
9845 -47712 -33709 -49316 -51141 -26052 -29469 -43446 -58728 -65329 -47564 2794 -21213 -37615
9833 -37615 -3650 -21078 -44656 -55572 -52031 -35169 -27760 -27759 -15419 23574 38772 35837 63301
9820 63301 32582 -12099 -4231 13728 18504 12313 15057 -609 -2086 -2347 9847 14963 36812
9807 36812 23591 -18899 -58861 -34745 -4303 5680 -6075 -520 10742 20751 24034 38340
9795 38340 40155 19814 -9532 -27480 -3432 28312 30119 17236 43751 39677 19008 6706
9783 6706 21011 35252 10430 1087 -11500 -17898 3621 18421 24194 15049 4282 -5655 16248
9770 16248 7352 -8593 -12147 -7774 -10877 1409 8423 26328 -8426 -46968 -55773 -48050 -22963
9757 -22963 -20181 -28019 -8092 717 5922 7418 -1562 -20779 -7807 -18821 -4893 -17980 -24296
9744 -24296 -826 7398 11830 8661 15418 41063 20004 193 -7283 -5262 5993 11071 -1122
9731 -1122 -12189 -14801 -11595 -26694 -27001 -5579 19734 3157 -14859 -10595 12550 21092 42167
9718 42167 33303 49889 42395 63571 57429 41332 23231 9539 -21489 -34498 -28930 -35953 -24787
9705 -24787 6126 40754 60312 41176 8452 -15751 1402 48976 72828 49474 13448 -4174
9693 -4174 13567 28968 43168 41354 13881 -3844 -7885 -18517 -35895 -51193 -55304 -47764 -31431
9680 -31431 -11993 19678 36781 50409 26150 19155 811 -35590 -57179 -50579 -1965 9897
9668 9897 35209 30071 37095 65132 35635 17307 31972 38965 38872 22070 24638 36541 47977
9655 47977 53213 34933 37234 30744 31867 23642 12522 9000 28670 23911 -20860 -14802 -21869 -6456
9641 -6456 6356 13504 -35235 -14372 23517 39459 57485 40519 31732 33490 49425 16021 -2087
9628 -2087 8035 5387 4203 -10292 -1523 48274 44355 37057 24198 16535 -4849 4410 29910
9615 29910 40209 77259 49024 26813 11912 12222 65740 50220 41574 40732 63250 65445 34671
9602 34671 71396 80360 53871 54887 79954 124131 139595 142766 182678 219522 209806 176040 150150
9589 150150 112898 95905 79830 90533 85575 82126 78641 130430 158404 142599 153513 161653
9577 161653 169125 181472 173600 200961 236186 198638 181224 195404 221697 244225 239114 208007
9565 208007 158070 129794 121349 145674 178739 215540 259686 290836 327341 420701 498065 521456
9553 521456 522206 524941 508364 458119 357419 293284 251516 232200 227369 213968 193573 209770
9541 209770 228468 229855 220553 200766 206691 206111 199742 228307 252197 226143 216620 226632 222166
9528 222166 225789 233633 197216 150049 144661 160488 143965 127787 129353 138870 138603 160616 181375
9515 181375 205078 243057 270528 267655 257779 265301 256914 217377 193034 150718 134932 151147
9503 151147 137512 101704 90298 85221 101192 138361 173227 155743 130209 110995 119329 132766
9491 132766 108025 110336 118443 88119 85521 81767 98240 100078 86102 112063 102123 111809 102058
9478 102058 101132 64901 58974 85332 76229 53011 65221 63292 39708 50460 63402 66985 65460
9465 65460 89124 85866 61261 67451 88028 121054 126625 111317 107472 128683 133554 101284 95638
9452 95638 86962 77325 126356 151687 163198 132315 134374 143061 130807 138844 146026 140597 113427
9439 113427 78549 76749 95007 109479 104391 117623 133252 129076 145603 159994 156599 143597
9427 143597 142996 158265 166624 152688 124556 116825 96983 95721 127490 175780 184579 162609 145086
9414 145086 145610 142321 176149 190520 186681 185270 224777 247751 240577 227901 226685 258634 272461
9401 272461 271401 262356 279284 289834 330046 361446 377288 399989 407957 411376 400711 424037
9389 424037 438539 431389 443201 448422 474531 496513 502406 531992 553929 572379 573402 586875
9377 586875 637099 675431 721906 747252 761671 807911 890389 945636 968022 1007044 1098349 1161928
9365 1161928 1195191 1239911 1306508 1416045 1515117 1609503 1700363 1808202 1946969 2091035 2181903
9354 2181903 2307150 2477100 2636296 2836920 3035968 3228327 3450297 3687940 3939179 4193873
9344 4193873 4436286 4715972 5010976 5299952 5595135 5903092 6207220 6531472 6870894 7211047
9334 7211047 7565642 7892947 8224400 8529781 8843300 9187547 9547982 9857267 10181875 10543256
9324 10543256 10924673 11327418 11731217 12132120 12539922 12995799 13476001 13989343 14521122
9315 14521122 15092483 15695510 16360690 17068361 17744709 18412442 19134440 19861843 20572125
9306 20572125 21247852 21864597 22397427 22871477 23207675 23432783 23560020 23524282 23343504 23011368
9296 23011368 22620674 22192021 21677613 21098878 20459174 19805486 19182990 18586356 18021172
9287 18021172 17456864 16891187 16377475 15905139 15395228 14903150 14461246 14080994 13722585
9278 13722585 13355852 13018582 12703339 12351409 12032653 11776522 11495044 11260613 11034636
9269 11034636 10777737 10516499 10237874 9967229 9734025 9462993 9145044 8847221 8542180
9260 8542180 8241204 7919762 7614516 7355633 7113801 6871162 6625453 6383952 6137325 5877381
9250 5877381 5665945 5460797 5281561 5113273 4969879 4815526 4643231 4459761 4295245 4132497
9240 4132497 3977453 3812026 3692952 3575632 3442357 3327818 3256234 3221707 3137049 3024845
9230 3024845 2938281 2845681 2769624 2704672 2631153 2544924 2469266 2421770 2383676 2329312 2259115
9219 2259115 2188410 2103533 2044938 2016002 2019064 1999226 1955380 1917450 1843496 1789947 1759991 1732751
9207 1732751 1710687 1665243 1633804 1615264 1608546 1612150 1601510 1594457 1554219 1530721 1526200 1520003
9195 1520003 1525838 1503594 1497855 1504373 1521098 1501612 1499036 1499505 1450611 1465031 1519812 1545041 1554382
9182 1554382 1563711 1601864 1625136 1646687 1660212 1674272 1684323 1728964 1778037 1809282 1893601 1974233
9170 1974233 2026216 2125454 2239414 2335042 2427733 2578128 2736503 2872963 3038467 3242054
9160 3242054 3444535 3664745 3908579 4159826 4435522 4715707 4994358 5235507 5449386 5614204
9150 5614204 5723776 5749323 5740477 5622196 5465627 5283017 5023509 4749296 4497306 4214035
9140 4214035 3924206 3664039 3435434 3230542 3043069 2842325 2681542 2508410 2344984 2238281
9130 2238281 2133643 1992475 1900999 1828579 1736117 1655305 1555051 1478060 1408720 1373139 1344458
9119 1344458 1314811 1260297 1192459 1124597 1079311 1018338 974394 937309 904374 903179 864237 825476
9107 825476 854661 856920 819352 780238 754951 718283 667814 649836 633822 606195 622576 628302
9095 628302 627688 581624 565259 550471 529248 470847 448738 476745 509162 508297 505758 495347 461172
9082 461172 434023 398938 368237 336930 313287 313444 317186 312857 331480 347262 346840 343205 324072
9069 324072 319003 312683 291012 289451 267971 253164 243086 217857 213859 238846 243060 243428 228212
9056 228212 174535 177719 205769 217676 228393 262400 243982 213085 187618 190074 186257 194927
9044 194927 175967 166937 181330 192220 171376 170445 150022 132108 150705 164795 160740 154841 171594
9031 171594 172889 137966 133026 137204 154473 159058 150548 113587 118644 104501 86211 86910 87632 95634
9017 95634 95293 95565 90364 84184 92316 87796 89993 104557 88344 95480 86255 108715 122726 76327
9003 76327 56213 58694 74295 90049 82885 73624 73290 55462 85250 111118 110504 110662 98868 113295
8989 113295 106756 87662 75852 69699 50110 69250 91865 86883 70770 77316 64444 25821
8977 25821 -3486 23568 41533 39080 44310 59073 52103 41188 39173 42636 60843 52270 35420
8964 35420 39769 46243 65314 93593 105515 88232 73409 61775 49414 44115 63950 76975
8952 76975 68109 67454 100268 87158 69084 55105 16953 11113 24463 37107 42338 39917 24835
8939 24835 24644 54056 52268 61821 80461 110003 155777 155179 158204 146109 109292 108549 132787 164445
8925 164445 161819 147609 123129 101867 105870 108953 138332 186707 231464 267736 331433 420402
8913 420402 488879 553640 585681 617619 704742 842784 1036891 1356731 1875497 2702783 3955245
8902 3955245 5475596 6699513 7318508 7600718 7460453 6546439 4916608 3436614 2518426
8893 2518426 1975939 1647575 1441621 1280198 1166285 1069218 991650 961466 931833 865347
8883 865347 806673 754336 687867 632162 579379 549249 533594 522044 513317 495804 477856 446317
8871 446317 434040 432412 387482 320216 318727 343855 360411 326534 291061 294169 282744 257689
8859 257689 274755 284396 267711 248811 280470 294628 262253 234446 239247 236505 216818 214353
8847 214353 205228 196486 198722 189378 161678 142243 140718 123223 122477 140411 138095 120129 108932
8834 108932 100669 118435 128301 128857 113394 99832 105129 120973 140286 120981 128492 121963 130711
8821 130711 117492 122077 122007 103848 90757 70192 67524 50110 54839 47159 52583 56652 56863 71006
8807 71006 86292 84933 94005 68922 47359 60620 72038 62984 49026 28324 28853 58727 60470
8794 60470 68590 95985 82311 55748 50732 52062 32214 38354 49730 38276 34198 36069 31838
8781 31838 33117 21671 24833 48740 62695 42493 -8232 -21592 -25775 1377 21835 38439
8769 38439 45564 50635 87203 94574 63051 44225 34285 23556 16195 8632 16117 61964 54238
8756 54238 25486 30411 75219 82184 64946 41776 58884 51488 58127 48267 42184 52947 49570
8743 49570 60039 70267 57977 18022 15955 34816 33101 35290 30079 12193 25158 13832 25705
8730 25705 -15777 -7376 27932 13234 -4287 5769 20503 19066 20757 56206 53810 60294 51125
8717 51125 37696 38139 41801 44676 55852 37562 61396 83596 78957 46955 36573 30806 15611
8704 15611 30058 29413 19264 33336 23826 33216 50095 35035 32819 9817 20725 9068 3560
8691 3560 21993 24673 35592 29275 55786 61652 59955 49552 32816 47003 84845 75194 48735
8678 48735 29532 26155 16904 -7015 -7320 14459 30499 40835 55176 31101 25148 18364 18883
8665 18883 40942 56963 44973 66646 75397 54955 69462 107102 107076 94295 90640 79187 42318
8652 42318 24427 58392 60599 56258 49247 76999 91295 77325 73476 64480 51980 45411 73100
8639 73100 91534 96430 78611 59880 59168 67813 57226 63827 93025 115071 128041 128684 134683
8626 134683 163175 193422 178759 177823 178461 159182 136133 146159 150218 142770 123012 104599 89700
8613 89700 76622 35270 61398 86635 84340 72281 71353 64880 60660 80795 74082 67643 72837
8600 72837 69055 62162 65596 93819 103171 84858 74822 56927 37448 26366 27721 39629 64886
8587 64886 70642 60121 37258 17565 23062 17676 42327 68874 61014 52455 71671 89676 48790
8574 48790 20034 19882 17100 39040 53966 74089 83407 62874 46770 74821 68232 75290 47455
8561 47455 43012 80393 79919 67481 74136 91415 71792 15235 19941 27467 44788 71188 61347
8548 61347 45374 6437 17918 17595 23014 15675 27941 41138 25797 25891 42456 61426 59101
8535 59101 56485 37687 33584 52748 45665 32127 31530 23390 22382 9599 -7419 -13397 -6981 -14814
8521 -14814 39507 59576 67450 57992 50630 50243 37017 29051 15682 34536 49349 51485 58096
8508 58096 45562 55915 38021 11139 18306 31366 38595 27557 22735 26390 186 25132 32450
8495 32450 52060 76215 64326 38882 53213 65091 43347 24817 8716 -10731 -2977 30054
8483 30054 55426 27952 24518 2291 4378 22273 4333 3990 31242 17592 11182 -5596 -5204
8470 -5204 778 -11596 16964 8517 27192 51812 44396 10582 -21921 -12642 -22649 -18680 -8106
8457 -8106 5009 7120 17421 11689 2915 -4313 -19420 23198 58586 47931 17730 7853 14739
8444 14739 11022 40185 49182 56407 51557 25335 -8880 5935 3966 -7597 2119 9654 7355
8431 7355 -4281 -8404 -23461 -253 17723 46066 32727 23608 35681 28534 23736 23955 13385
8418 13385 -15049 -2105 11929 7799 -14305 -24 -14260 -19808 -8603 2731 -4655 7118
8406 7118 20067 11309 20682 34886 32756 32985 28748 10507 -12034 -15022 -12717 -42702 -34155 -4181
8392 -4181 -8370 -13821 -37 17338 40256 8186 -8162 6562 20971 -1162 -1328 9010 -7336
8379 -7336 -31331 -19619 37183 50424 39803 48852 39326 4948 -14653 -4669 7299 -12555 -53845
8366 -53845 -60776 -24182 -7715 5154 10108 -13449 -16784 -25995 -30388 -3681 41722 38956 54878
8353 54878 64024 53524 44638 45930 34393 22180 8747 7682 45820 46892 13796 8260 -2293
8340 -2293 -15852 -19396 -27289 -23047 -1601 13104 1119 11891 -18047 -22347 -9125 -2176 -27122
8327 -27122 -29945 -31568 -5109 -14205 -19661 3941 15300 -4560 -15696 -7803 21122 37783 44522
8314 44522 68886 33900 18467 37094 39099 39160 32570 18131 21881 35795 31779 29396 10332
8301 10332 7193 -2603 3665 -8454 -46643 -46036 -26597 -20118 -3114 46231 45350 25093 23069 19026
8287 19026 13361 -5883 -21128 -12834 -22065 -28033 -33114 -37515 -24561 -4884 22042 16210 13211
8274 13211 29331 47108 26008 -11859 -60893 -15421 4380 13364 2018 14641 27939 24677
8262 24677 27772 -3334 -15376 -19369 -27326 -57253 -58582 -20257 -29671 -23925 9058 29445 58528
8249 58528 50613 32897 27642 27903 29410 25514 2775 660 10460 31190 18866 33650 23819 4024
8235 4024 14133 13584 4546 -3041 34638 74799 64057 14370 -27580 -31417 -21911 1306 26633
8222 26633 22113 54226 63848 70643 46311 9610 8001 6476 12293 40531 47445 45469 34159
8209 34159 23935 16436 19073 6259 -14301 5770 600 7587 -8538 -18979 -35925 -17792 -13954
8196 -13954 -24664 17686 24160 6158 -9739 -27009 -18791 -12438 -15128 -11553 5543 16837 36052
8183 36052 52242 46548 19411 2229 -4135 -12463 -31354 -34159 -15094 -12138 -29328 -26611 9467
8170 9467 22382 20711 21506 1202 1344 -3028 -11080 -17716 -1114 -14866 -39386 -33578 1804 2780
8156 2780 -12511 -11011 -10838 -870 12520 22563 34271 16886 503 -15819 -24821 -38771 -18115
8143 -18115 -8181 -8257 26226 48525 46789 57429 17751 -7411 -34002 -21290 -14600 -24734 -13335
8130 -13335 -1419 8831 20925 14183 27691 687 -24062 1548 21768 27416 7211 12659
8118 12659 20609 12502 -4624 -18932 -15620 -10530 10122 5310 7676 -13529 -17542 -3612 12513
8105 12513 32574 23784 14088 32341 47051 69940 73562 37198 -4166 -13140 -4838 -6646 12024
8092 12024 21372 17114 36551 49767 42996 36189 29981 14500 10527 23332 32908 14246 7599
8079 7599 4280 -10934 27639 32491 34071 24445 35842 17748 -317 13718 28291 28756 24408
8066 24408 45364 61629 50449 47658 36741 49156 39278 29028 50302 57734 6877 -1962 19746
8053 19746 25789 -9162 -30617 -39212 -10004 29730 47237 31236 875 168 -3984 12414 30501
8040 30501 30696 66914 89566 79457 60256 41939 42584 22224 6201 -4985 -11520 14987 59041
8027 59041 69815 59567 58505 64870 55013 17867 5979 9460 12885 10967 3718 -34366 -61561
8014 -61561 -60103 -47708 -27950 -26829 -8188 20555 17775 17662 12147 -6896 1978 -6779 -17317
8001 -17317 26 52996 79000 69502 37856 12250 8044 12735 14234 6692 26455 22772 28887
7988 28887 63467 73661 90352 99153 90354 80189 115792 134238 95614 81671 73840 58723
7976 58723 62079 68379 71777 49785 52588 55014 42584 35711 39136 28883 4065 -6065 22969
7963 22969 55595 57631 57260 40088 30436 28683 64831 96086 67074 54653 34540 18809 7555
7950 7555 45020 77718 64025 78534 47059 37603 49981 85071 85101 67448 52686 22137 18227
7937 18227 51300 23616 1855 11090 14345 19299 25872 34430 34465 51135 69539 46611 28905
7924 28905 35861 63362 67649 51824 62123 65300 34288 -6704 -4037 8361 12838 14727 38353
7911 38353 45913 40882 35410 56571 28612 13650 48663 28997 9351 744 -8870 33443 53508
7898 53508 33316 16190 5625 878 -8034 1182 2773 694 13011 51106 70521 72259 68124
7885 68124 65772 61256 43902 47861 55233 34274 4072 17087 11041 -26180 -27060 -20534 -29084 -43256
7871 -43256 -35297 -28792 -33808 -27508 -380 15416 16771 7075 358 5761 -17491 -11611 10893 -10549
7857 -10549 -29195 1072 -13440 -18367 -15448 -36452 -26359 -3840 18389 23441 -15775 -28455
7845 -28455 -22600 -28641 -36914 -37302 -38179 -47867 -55048 -24485 2848 4413 -5991 -47838 -63753 -29303
7831 -29303 7020 12229 16117 25943 13649 -21890 -20113 7127 19336 5488 -25131 -38837 -4523
7818 -4523 2379 45340 46600 24935 4006 34667 59051 53600 39089 37290 13645 -13814 -25883
7805 -25883 -5351 16222 12885 13910 -11935 -10924 7055 18589 15370 -6957 -22875 -38408 -13374
7792 -13374 19073 56412 35175 37025 12504 -15086 -28287 -27399 -13744 13482 18611 -9128 -40433
7779 -40433 -38185 -21300 -18471 -25953 -13536 -11143 4644 -1623 2275 -5570 -7669 2153 -13941 2814
7765 2814 29182 38069 2907 -31044 -51512 -66788 -61756 -8094 4626 -30076 -29874 -1267 -6952
7752 -6952 2542 16733 -15355 -50250 -32956 -45978 -23585 -4608 -11301 -14123 8657 -10 -7597
7739 -7597 -7861 -20410 -10565 -20442 -55643 -71126 -43844 -57139 -60270 -48596 -9881 -1054 -17350
7726 -17350 -24856 -14966 -13152 -11936 -14549 -13311 -33191 -44253 -32050 -32220 -14117 -4350 6998 2349
7712 2349 -6537 -16223 715 -16633 -39292 -38199 -22404 -4106 29296 41758 41757 44985 48336 33849
7698 33849 39998 38631 24284 13604 22193 14676 -1006 -12319 -24517 -35377 -48607 -32662 -20155
7685 -20155 -12146 -7237 3839 14700 4331 -5682 -21571 -5791 5785 -1905 -15123 -23669 -26099
7672 -26099 -29983 -32103 -52164 -27361 -19265 -29923 -39896 -11461 3428 31036 18986 -24332 -33979
7659 -33979 -13519 32903 33042 20055 16874 5045 -4518 -13073 9973 -2616 -21681 -4998 6612
7646 6612 14540 37572 41019 18331 9242 34702 35637 14059 -8903 -2580 -19618 -20101 -12549 -28047
7632 -28047 -36552 -69620 -56418 -24454 -29230 -29124 -14126 14260 28180 30789 17390 26702 -3732
7619 -3732 -35113 -21124 5366 14266 -319 -15986 -1027 690 -2662 -862 -18564 -18920 -19474 -22567
7605 -22567 -27027 -11430 -11894 1277 33504 38750 51773 47085 24562 8442 -1375 -19837 -19078
7592 -19078 -15591 -40 15459 1390 9421 25592 10106 2248 -6838 -17266 -36465 -25144 -35253
7579 -35253 -57230 -29482 -20073 -16853 -15679 -11521 -30799 -40628 -26984 -32364 -73169 -46861 16620
7566 16620 39051 4831 1906 13748 -1383 -17407 -16632 2785 6334 -9479 -17748 -31594 -43432
7553 -43432 -41155 -56403 -80572 -55237 -47467 -54207 -30662 -37462 -57696 -16108 -10332 -27743 -40840
7540 -40840 -39834 -47041 -51392 -62893 -78708 -53430 -47169 -29393 -21343 -7891 -21837 -53045 -31316
7527 -31316 -5193 -28866 -37795 4302 1985 9477 14535 2979 7263 8487 -26260 -33423 7009
7514 7009 22928 24042 28793 2483 -1357 7418 5332 -4428 12037 17107 5978 -2938 -38356 -54293
7500 -54293 -44964 -35325 -23441 -2948 2405 -17164 -4827 5683 -9900 20180 19316 13379 -5685
7487 -5685 -34946 -24779 -9272 7440 24196 27460 -5602 13603 43448 54953 56399 62012 58523
7474 58523 48908 32669 10746 3669 -26776 -32771 -55113 -52688 -51489 -31505 -31642 1221 535 -30035
7460 -30035 -102 -8908 -11572 29083 34692 42025 24249 2626 18790 12375 13441 6434 2875
7447 2875 -20394 -5603 -14541 -41742 -54286 -70169 -60961 -17218 20919 24134 15494 -11742 -16908
7434 -16908 -10807 -12232 -11610 -18944 -2435 11267 5144 -1284 10576 4280 -9843 -16389 -38355 -37801
7420 -37801 -37369 -40201 -17174 -13501 -8971 11243 8812 13338 6865 -29443 -30331 -2397 2626 -2047
7406 -2047 9171 -27032 -41386 -21990 13613 15371 10324 13932 21696 27057 -3441 -16467 -9307
7393 -9307 14100 44067 41851 46093 24229 2996 -20452 -15858 11029 26061 22125 -731 5348
7380 5348 9615 11540 30006 35481 31106 30849 7223 5700 -10674 -30939 -24464 -11145 -14594 -22915
7366 -22915 -25211 1489 20468 -7368 -5175 -2259 -24377 -31064 -24962 -48230 -33643 -2842 8102
7353 8102 648 -11018 -5271 -9351 1933 -6101 2009 576 6657 28894 30473 3455 -762 -8241
7339 -8241 -16050 -54281 -81268 -54243 -56729 -65755 -68925 -71398 -32928 7909 8792 3972 22909 16316
7325 16316 14914 20438 39750 47247 27618 13923 15969 37593 44747 19670 26185 15280 2297
7312 2297 -7658 3567 19973 -4799 -27225 -2798 17565 3538 -9454 -13876 -12578 12765 3022
7299 3022 -15287 -20466 -21528 -17809 -21552 3369 23051 21385 30978 15660 -5366 -37413 -20664
7286 -20664 -13430 -15613 -21512 -30081 -13768 16282 23841 6393 -12252 8778 14191 42107 67067
7273 67067 47840 34407 28045 16069 143 -13852 -18440 -23601 -34603 -22491 -10803 -28777
7261 -28777 -18258 -9858 -7698 -36756 2404 26390 12517 -9052 -15033 9676 13203 23458 31603
7248 31603 23359 19132 11064 -13955 -32218 -55632 -48728 -32819 -36161 -5257 -619 -9492 25521
7235 25521 8701 6211 25786 12671 13722 22371 19088 28617 10525 -10011 -6789 3290 6259
7222 6259 37313 34862 1405 194 7337 -13691 -22276 -20943 -14729 -26 -2503 19237 51379
7209 51379 45256 -159 -25545 -8645 11059 18135 24365 21225 30732 15530 21507 47488 21348
7196 21348 -12826 3786 -17512 -2739 9802 -16123 -6663 -11467 -24202 -13238 -10771 3908
7184 3908 33424 41416 44579 25997 29436 18204 15812 37295 41906 -161 -3109 -19175 -12666
7171 -12666 5336 6605 8971 11340 19985 18771 -15370 -5126 29895 21145 32815 36521 40682
7158 40682 27697 13793 28176 39414 22063 15160 18414 3917 -23559 -16949 -21510 -25920 -23656
7145 -23656 -23608 -33189 -32158 -17444 -4874 -9927 -9605 19990 31958 17227 -8882 -6186 -13028 -11322
7131 -11322 -26346 -7851 -13675 -12994 -27868 -46514 -55163 -47955 -52312 -51358 -43150 -24363 -6743 -237
7117 -237 -20605 -9980 130 -131 10342 -4133 -1872 20745 16525 13163 16584 -21635 -65928
7104 -65928 -61405 -40148 -28690 -40904 -25890 -4630 -9260 -2808 -6010 21503 14615 2294 -13507
7091 -13507 -21624 -32485 -11433 1966 -9862 -27263 -46465 -30366 -25695 -21372 -33092 -35219 14348
7078 14348 32462 34136 43085 54119 51944 16359 -4788 -3257 16014 44719 15836 -26129 -36970
7065 -36970 -16795 9577 24045 2070 -16831 15605 47439 42816 45299 53369 49408 34145 47337
7052 47337 32991 282 4926 17575 -7328 14 25855 -6195 -38829 -45739 -66761 -60831 -58750
7039 -58750 -54442 -50052 -34775 -20959 -12722 7364 10529 19241 -33530 -49634 -61063 -46094 -11134
7026 -11134 4310 7786 41221 41665 14481 -10606 -16259 -44098 -48107 -59986 -51199 -17649 10813
7013 10813 -9247 -33093 -21396 -31137 -35789 -17412 -18038 -30488 -28069 -6739 -25634 -49211 -48804
7000 -48804 -47023 -31231 -9829 -14259 -6559 1780 20641 21412 -4706 -27486 -14002 -2071 43544
6987 43544 49783 13441 -20467 -61734 -90097 -75410 -38446 -22577 -36218 -65615 -71902 -45647
6975 -45647 -5239 8515 31545 10082 6782 -14199 -22986 -33538 -34296 -31238 -17678 12158 33659
6962 33659 21155 -3559 344 -1041 -22380 -17617 -1357 -17648 5009 5234 -2354 5968 11708
6949 11708 1016 -10331 -30091 -15025 -17296 -23466 -26784 -35073 -47730 -41010 -12100 9782 32207
6936 32207 11338 -13064 5484 21842 3060 13571 9985 -20379 -51540 -38474 -200 -16178
6924 -16178 -22860 -30417 -35872 -8212 13285 16070 3291 9211 23593 19185 -15181 -46633 -55304
6911 -55304 -26804 -36151 -42001 -7748 12387 31580 16343 -19486 -26594 -37884 -26107 -11678
6899 -11678 -1709 24452 27564 5832 -10620 -41064 -51231 -66214 -52693 -45980 -42906 -47536 -15144
6886 -15144 -2851 3748 -20599 -36736 -45057 -21594 14069 34209 33853 31268 25769 3398 7115
6873 7115 2190 -7616 -34183 -40919 -30691 5999 25104 5290 4076 -8396 -16621 -35760 -56839
6860 -56839 -75656 -91130 -120664 -87966 -54388 -16788 -25645 -7720 23783 -10169 -11796 21922
6848 21922 17664 -21257 -6278 17610 28347 19316 26633 31456 27614 21426 12742 18927 4076
6835 4076 -1155 -11607 -23119 -30032 -27345 -14649 -19114 -32104 -34069 -10006 11953 39638 21720
6822 21720 18295 3974 34626 20927 -5387 3721 5650 14729 20834 3629 15736 9769 -18977
6809 -18977 -19583 -65708 -67064 -53651 -37981 -11450 -22631 -27358 -27625 -35716 -36399 -29507 -36847 -29624
6795 -29624 -4614 -15096 -10935 -16342 -26146 -13279 8038 4247 -7512 -6540 9238 -8359 -15131
6782 -15131 -24790 -31493 -33523 -19978 -21577 -39058 -36145 -3819 14484 -4484 -9064 -23063 -53637
6769 -53637 -73163 -67615 -56938 -45593 -32552 -27013 -29655 -20269 -16642 -29219 -54219 -55880 -48014
6756 -48014 -32332 -2099 21488 -11062 1217 -10820 -22941 -11754 1655 7531 11642 14520
6744 14520 14347 -7357 -29697 -32096 -19738 -22449 -34442 -34911 -14175 17084 -720 -14724 -6460
6731 -6460 -3334 259 647 -1442 18070 33586 17875 -21969 -31894 -8140 -40587 -52204 -52365 -30434
6717 -30434 11407 17361 -10130 -5664 5371 28338 11239 -12131 -2189 -9412 -10822 -1340 -5796
6704 -5796 -22367 -21643 -4831 1040 7236 12188 10290 -3749 -14472 -34934 -34394 -32541 -10641 16698
6690 16698 6240 23791 17916 7213 -23838 -47036 -12543 -9439 -32031 -41175 -47534 -43250 -22215
6677 -22215 -15321 -6394 2489 -415 -26814 -29527 -48165 -48507 -31178 -36710 -20455 -6315 -17702
6664 -17702 -41166 -51749 -51806 4851 62394 68037 25897 41067 60333 40573 18909 15725 37758
6651 37758 36114 3225 10744 30013 49663 50772 12405 -28200 -43692 -70413 -38938 -22759
6639 -22759 12769 10589 -28957 -23221 -12925 4781 4529 -3668 -33566 -44692 -37864 -44791 -19328
6626 -19328 -16582 -16210 11955 18140 26017 25046 32762 18460 -23050 -13686 14854 21373 34702 11587
6612 11587 -3008 3884 27608 25060 20890 18747 -5347 -7098 -1267 1262 -23282 -22976 -574 -6845
6598 -6845 6338 3182 -3376 11102 7899 5616 9402 -5446 43173 44959 20015 31056 13681
6585 13681 -3888 12187 27326 44110 70294 54270 10716 -32301 -49615 -18546 11008 13777
6573 13777 17801 20392 7085 32564 17754 -10135 -2224 6672 -9996 -2137 11710 5556 6722
6560 6722 23130 61730 46305 21389 36470 7070 -9426 -10090 -1888 -515 -4109 -526 -14788
6547 -14788 -17121 11293 27918 18472 -3391 -2277 -41686 -50222 -37683 -48607 -39805 -64 47605
6534 47605 46399 21076 5382 16767 -2674 -29106 -16839 -19814 -36540 -2159 22796 6133
6522 6133 -18547 -12670 7246 6230 -2472 -7354 -938 -1952 22572 23911 -975 -46511 -61326
6509 -61326 -72064 -57660 -30436 -3615 21233 27559 4559 -13845 -37398 -51723 -15951 21324
6497 21324 30449 21594 6165 7669 -6535 -19833 15050 35962 6701 3166 4919 10980 6635
6484 6635 -9800 1810 -15856 -7055 492 6767 8844 10761 12105 -15365 -13517 -34078 -24059
6471 -24059 -8905 -24512 -29642 -33266 -10392 10992 3290 -21 11215 13881 -2435 -11062 -20745
6458 -20745 -43405 -36499 1389 23393 46696 61013 31492 -1733 -21776 -4148 -24137 -27473
6446 -27473 -18209 -22031 -12926 -14131 -12787 -12629 -21585 -35303 -47278 -54741 -53094 -27400 -22793 -37780
6432 -37780 -3715 5539 6652 13121 28539 38068 15293 -4683 -5037 -5713 -15355 -39613 -32749 -5367
6418 -5367 -11009 -42099 -36286 -20095 -2071 -40857 -71818 -76780 -65143 -16021 21992 42153 23887
6405 23887 13488 12430 11317 2616 -4200 -31788 -24250 -2403 -19088 -37540 -54444 -27602 -1499
6392 -1499 -22556 -4604 14418 34033 40319 25285 32562 27675 25226 33822 9309 5969 32828
6379 32828 47450 27092 10689 -12183 -11718 21091 22924 18099 5213 -17194 -19688 -4359 -28787
6366 -28787 -43351 -38488 -24402 -19908 -27227 -2553 16414 10166 -8854 4819 10897 -1993 -4428
6353 -4428 3488 6511 19253 12345 -5424 -29384 -36898 -7566 -873 15131 11877 -13236 -21708
6340 -21708 -26629 -12662 -12446 -32707 -57323 -75064 -8047 10799 -8772 656 14353 -13662 -16795
6327 -16795 -8109 -7848 -48373 -61132 -38182 -3905 8021 23438 35518 18281 6761 15105 3682
6314 3682 3390 8725 2190 13104 -8569 -31140 -26980 -30129 -37906 -56424 -62572 -31474 502 -6827
6300 -6827 16642 17604 -6248 6004 5424 1848 -11291 -14333 -24622 -7958 2492 17718 11426
6287 11426 13890 6172 2614 23385 46146 46632 21002 -27307 -84176 -74193 -40287 15560 29332
6274 29332 10081 13351 40879 23026 -17359 -41116 -25029 -19607 -29337 -39156 -53970 -59974 -83194
6261 -83194 -68306 -51312 -41541 -16793 18779 23224 16713 29414 15217 27879 7043 -21084
6249 -21084 -9329 -22331 -56236 -67214 -38857 -56710 -37881 -24481 -40554 -72700 -85986 -74404
6237 -74404 -57200 -19027 14141 11247 -869 -16382 -2761 7848 -15130 -46475 -49320 -14868
6225 -14868 16552 23870 -13004 -27893 -41124 -17261 -15804 -3631 5507 7888 -14502 -17447 -14582
6212 -14582 2443 -664 -14109 -18658 -30018 -18860 -13074 -37687 -44430 -22481 21830 27756 20444
6199 20444 15358 -11600 -17737 -5820 3050 -12706 -12087 15458 43833 34330 9881 -5215 -5473
6186 -5473 -16926 3954 21683 18672 7963 3706 1631 17923 238 -28487 -31285 -22614 -21031
6173 -21031 -15510 1377 8708 -18386 -48216 -19397 18250 21473 28630 12621 3596 -15860 -34843
6160 -34843 -46984 -44155 -20870 -16281 -16671 -27015 -41177 -42587 -44066 -42254 -19091 -8547 6077
6147 6077 1979 -18928 -14427 -29834 -34876 -25846 18601 32210 42873 34184 9383 -20791 -6765
6134 -6765 -7072 9764 29027 25539 42237 54099 35637 13370 -9531 -15892 -19407 -30513 -25142
6121 -25142 -1125 15949 3187 6009 35099 43573 46445 22440 867 -1778 577 4592 11611
6108 11611 11683 25465 28309 5447 13213 29115 23322 -7577 2464 21450 15981 -3988 -206
6095 -206 -2714 13908 5905 -3034 4431 12033 26920 17675 31395 44200 24360 -9927 -37332
6082 -37332 -32574 1877 12216 -20371 -44253 -50549 -41757 -24662 215 681 -9308 -18245 -30771
6069 -30771 -16762 17043 44104 8793 14438 -6816 -11108 -17433 -1937 -8517 -13266 -16745 -30444
6056 -30444 -36749 -15383 6046 4031 -4057 -10990 -8972 15958 12744 34168 24657 3401 4181 -3747
6042 -3747 -37000 -21477 -2836 -15923 -15892 -31024 -28300 -37676 -54128 -33483 -17730 11134 7487
6029 7487 -10837 11011 20518 40878 25563 35132 36981 -6289 -10034 22491 9423 243 25914
6016 25914 48274 50805 26365 56352 39881 9902 3162 4207 11119 6667 14104 12669 12758 29698
6002 29698 38575 17159 17715 24276 60188 52707 31222 4369 2237 19277 -12935 -43709 -36551
5989 -36551 2152 14389 -4196 1004 -6081 4541 18279 -13730 -15936 -5736 -22788 -50751
5977 -50751 -63508 -84989 -60787 -19679 3244 18910 31134 35463 26312 27708 28927 -29032 -38650
5964 -38650 -40560 -36317 6422 17514 3407 5036 -6614 -19042 -25535 -44049 -49257 -40010 -40940
5951 -40940 -49834 -33987 -9399 -13186 3957 5994 7218 -18155 -45546 -23528 -23376 -5136 2673
5938 2673 3872 10230 21662 23989 48610 61882 52391 20628 -7041 40 7729 24115 17365
5925 17365 4425 22850 41610 25729 23216 -11340 -13105 -10174 -15399 -17919 -21701 -6489 -16588
5912 -16588 -21099 -37599 -54358 -49481 -43788 -74865 -80918 -46486 -25230 -12752 2728 -20029 -24082
5899 -24082 11172 -845 -25387 -29369 -18480 -20519 -718 9104 -16024 312 19760 -923
5887 -923 -8898 -3027 3230 1474 -11687 -6328 -3150 -21960 -30996 -7200 12307 9539 -4332 -30672
5873 -30672 -12071 14880 47195 57974 25952 6151 20947 12246 22274 41218 39392 -1063
5861 -1063 -4287 24059 15771 22463 7734 -7981 -1670 3219 35928 39509 15256 -10094 -25014
5848 -25014 -27506 -23638 -29767 -21887 -4094 -7515 -21169 8880 6413 -7133 36244 26485 17204
5835 17204 -19031 -44825 -34375 -19975 -8329 5758 17249 12530 10609 4122 -927 -2659 3251
5822 3251 1932 -13461 -8703 -13891 -34560 -46496 -29882 -16946 -13469 -21498 -17332 18887 16206
5809 16206 5274 9612 -11661 -724 6379 18675 25548 26520 31926 36145 11945 -9595 -16246
5796 -16246 -39128 -21839 -22665 -19185 20692 21185 -927 -2225 -21609 -37561 -11408 -3879 20388
5783 20388 38588 43460 55145 40461 44781 52746 44473 34871 28011 -3119 -30455 -17266 -13951
5770 -13951 -8641 244 -9980 -41107 -57267 -25319 31174 30830 28034 18598 48898 45811 5566
5757 5566 -1724 30404 26389 -5179 -43503 -35895 -25748 -46518 -50075 -31769 -31511 -39052 -1766
5744 -1766 6858 -2208 -18977 -6778 3435 -8839 -57690 -73659 -70448 -62495 -65869 -59293 -47872
5731 -47872 -7775 7969 -7891 -9049 -18895 -27478 -29589 802 22966 24013 15058 26901 10988
5718 10988 -8827 -15642 2270 11692 -8811 -26773 -36790 -47679 -38848 -19317 -33691 -54870
5706 -54870 -17100 -13839 -36466 -37570 -31137 -14480 -25653 -11466 -13380 -27083 -31497 -25641 -29035
5693 -29035 -24906 -2104 6701 17253 7259 15221 25708 23489 22555 1749 -12461 2426 8617
5680 8617 28628 53528 32677 23912 29556 23072 -12059 -14698 -10595 -22122 -12001 -12439 -8575 9564
5666 9564 13228 12009 12017 19914 9881 11484 -3788 -2819 -4678 1120 15981 13256 19425 29024 8035
5651 8035 -12652 -14337 -18039 -15702 -6150 -23030 -49897 -58309 -48505 -18096 -4544 9615 8541
5638 8541 23857 71131 70500 765 -18512 -9959 -34269 -14266 2648 2398 17613 13868 -14780
5625 -14780 -30106 -24522 6003 14480 30655 34700 29294 16677 -225 -36016 -3024 -21286 -27025
5612 -27025 -23995 9273 5751 14801 12457 10196 31063 25681 5825 -25681 -44163 -39303 -17383
5599 -17383 -1214 7662 8374 -13314 -24274 -20722 -8210 5586 21853 8459 -19270 -22521 -14695
5586 -14695 1771 25093 21829 -8041 -1827 -2622 -22988 -32363 -26772 -41169 -52812 -41103 -37981
5573 -37981 -23656 -17039 -29062 -41525 -39854 -28449 -30241 -37883 -37593 -11011 19397 5827 -24565
5560 -24565 -29088 -26701 -28284 -54876 -62499 -61923 -49360 -17932 -21765 -7443 -3182 -11634 -29845 -15946
5546 -15946 6325 -10645 -23988 -11462 6062 18899 8624 13088 -6676 -7579 -24889 -18008 -35998
5533 -35998 -41708 -25538 11813 37970 12345 -13337 -42639 -37196 -28641 -27629 -9619 27952 30448
5520 30448 -791 -2732 -9964 -15042 -21990 -19642 6675 -2590 -30397 -61394 -77253 -52253 -27856
5507 -27856 -8612 -1852 10171 3742 -9569 8092 22329 11141 27343 30415 -18609 -42848
5495 -42848 -29961 -36374 -30427 -26725 -32811 -6429 7945 -25931 -42818 -39140 -36135 -17089 -25216
5482 -25216 -20779 -2798 -5347 -26953 -30215 -17090 117 29673 9940 15902 -2507 -19997 -22174
5469 -22174 -24209 -23771 12558 21564 4659 11065 35132 50397 22205 26043 21615 27313 35383 26054
5455 26054 13941 17627 -7635 -12876 12025 -2039 -2813 8558 -3571 -17646 -41050 -44736 -28709
5442 -28709 -15989 -6860 -3146 2933 -20909 -60187 -62157 -19135 9726 24673 20085 18416 -20172
5429 -20172 -34674 -5447 251 -29426 -62256 -63100 -41042 -4688 11529 6963 -8180 -10299 -17408
5416 -17408 -18498 -32859 -38955 -41021 -29142 -27598 -26428 -5439 -5653 -6966 -10377 -9702 -13614 -36975
5402 -36975 -4782 28216 29876 17640 5298 21037 25864 14823 5558 32249 70285 55263
5390 55263 28604 -16133 -19433 6389 38467 32150 25162 10989 41960 45516 16799 18566 36026
5377 36026 27462 16018 -4815 -27785 -58129 -46259 -50985 -40310 -33482 -22555 -28771 -27092 -11663
5364 -11663 -5803 8927 29126 14602 49 -16822 -12115 -884 25800 18315 -4358 3470 39
5351 39 1866 -16629 -10345 7487 -1097 -10943 -29026 -29996 -21137 2900 -19334 -37037 -12191 -12777
5337 -12777 -46908 -81991 -69774 -32007 -28881 -35862 -26891 -12775 -20228 -16066 -4035 -30231 -28433
5324 -28433 -32185 -25164 505 -1129 -6431 -3375 3629 -17524 -32847 -34042 -31797 -10366 -5752 13270
5310 13270 16098 28291 21896 10732 -23383 -21290 -16224 -16668 -47222 -47298 -31443 -28616 -49057 -39222
5296 -39222 -39746 -34834 -8255 -15443 -39072 -11142 14908 38912 31673 9451 -18431 -31457 1177
5283 1177 21775 -384 5062 35398 20401 -39509 -46064 -38238 -25807 -21777 -26660 -2762 22383
5270 22383 39161 69350 48406 14745 -3843 -43192 -64424 -49195 -33363 -15836 -12329 -21118
5258 -21118 -40863 -6570 14403 9712 24705 36062 21103 7911 14843 16105 5607 17071
5246 17071 23979 -15764 -16399 2996 11141 -4652 -34891 -55521 -28896 -21311 -10215 -6252 -4435
5233 -4435 -22362 -30190 -18224 2838 18628 30301 55636 28228 -7118 -27692 -48433 -46012
5221 -46012 -46721 -16799 -16706 6780 7593 16964 6234 5578 -28916 -62432 -41857 -6595 -36935 -57833
5207 -57833 -55749 -62461 -37162 -27695 -39351 -24889 -45982 -54284 -21261 -4370 1300 8962 22755
5194 22755 4870 -35760 -40519 -33548 -15568 -29062 -30702 -21770 -19228 -11921 27131 29645 319
5181 319 -12031 -15845 9857 13179 22078 14061 10406 27373 1916 -12917 -21743 -4775 29915
5168 29915 38163 11922 -10420 -4376 -7084 3305 18376 5282 -18860 -24747 -17565 -24747 -3223
5155 -3223 825 -21114 -16187 24547 34150 26527 15754 12505 619 24712 6533 -8744 9516
5142 9516 -4889 -14930 -13936 -10564 -9505 -12662 15084 36074 16054 4582 -14267 -22977 -20091
5129 -20091 -23882 -20925 -19008 -30408 -40779 -48018 -494 9354 -6236 -2525 4893 2076 10435 8235
5115 8235 520 1114 -2389 -15328 -2229 35782 27338 1829 -4332 7783 1434 -16085 -17456 -8460
5101 -8460 10634 32602 15210 -6196 -15244 -11602 26900 43291 20437 -409 -14655 -15003 -6727
5088 -6727 5918 -979 -15816 12294 -2906 -15655 6463 26035 22099 -11118 -17266 -13692 -21858
5075 -21858 -17754 2505 -18179 -13582 -3454 -23131 -8739 -23447 -49625 -39196 -7399 15085
5063 15085 14525 1838 -19411 -20652 -20449 -12656 -43096 -74423 -63185 -60585 -62039 -56322 -68863 -62230
5049 -62230 -84238 -30155 -4928 -9987 -8628 -19612 -45143 -22428 -16083 -15345 -8006 -3761 35533
5036 35533 26518 13032 5510 24602 4335 4169 31680 16962 14609 12921 -10563 -51531 -39851
5023 -39851 -14324 10666 28465 25306 12411 -6006 -1553 11318 11959 -3012 3449 -8515 -30437
5010 -30437 -26080 20974 29672 12923 9889 950 4355 7241 3941 17225 37953 35361 22882
4997 22882 7292 18447 1309 -5416 4897 -1389 2117 -30043 -58160 -38986 -31607 -10830 11477
4984 11477 10014 7305 -12272 -36142 -18973 834 2563 -20363 -34872 -13612 18183 20704 12568
4971 12568 7859 11537 -37911 -23846 -10385 -17412 -24183 -26229 -31586 11306 5500 -17380 -34083
4958 -34083 -26794 -24631 -26037 -49185 -32391 -9841 -10340 -12036 -30986 -27995 -4268 -5804 12053
4945 12053 27898 4318 -18967 -32591 -45548 -42001 -39548 -77988 -41483 6841 22179 2801
4933 2801 16222 11796 -12250 -34328 -42228 -44551 -45025 -15440 -2223 -9778 -9026 -4138 -9723 -17223
4919 -17223 -16674 -2355 -21875 -5858 3018 2058 31106 41208 19310 1388 9609 12975 16146
4906 16146 34582 16429 6989 13439 -5538 -323 10814 21523 19493 -8604 4435 26708 13498
4893 13498 -15744 -20868 -32535 -40385 -49663 -44895 -50265 -57640 -46758 -16253 12574 16351 -1451
4880 -1451 160 2417 13200 10409 2415 -2803 -13806 -20692 -7389 9066 22861 6811 1818
4867 1818 6011 5068 1203 -16870 -50450 -52568 -43384 -36600 -39042 -25232 -12065 -14983 -2960 -19009
4853 -19009 -39461 -33149 -9871 -20273 -26787 -48698 -47517 -3727 15664 28720 33775 20120 -3347
4840 -3347 -8916 -33180 -28429 -30826 -24677 -23639 -53884 -32459 -49988 -49262 -65392 -78666 -68301
4827 -68301 -62377 -40039 -16588 5643 -2342 23813 50746 5010 -13794 -3129 -15403 -48325
4815 -48325 -48609 -6280 6238 -17193 -25617 -16423 10074 8843 822 -22897 -60717 -76363 -54865
4802 -54865 -29170 3065 26643 5006 26991 38043 8698 -4032 16552 7255 9063 4451
4790 4451 10405 828 -18821 -28023 -24438 9187 11000 51412 47490 35695 34248 31538 12255 24879
4776 24879 24802 28480 37897 26034 4668 6093 31454 13728 -10040 -11492 -13278 -11953 533 8916
4762 8916 33285 30721 9251 -11963 -39892 -43304 -44045 -53797 -28497 -19139 -26196 -32978 9088 22021
4748 22021 18637 29141 15257 -12892 518 33486 19879 8659 25375 25265 2059 35526
4736 35526 35770 13635 4778 29388 40318 40988 43167 27372 -3017 -18194 -4880 -1559 -3243
4723 -3243 19549 17759 12705 11231 7526 -3754 11195 23345 7689 13351 -9649 -23833 -14593
4710 -14593 15844 19627 12747 6463 -8806 2632 23673 31472 16932 -6555 5444 -24690 -61670
4697 -61670 -88064 -80680 -54449 -16429 -1964 -19344 -18951 -11847 -26883 -28120 -13273 -19859 -39696
4684 -39696 -46545 -32025 -25478 -3863 4381 -31238 -24879 -14595 -18513 -20734 -8018 -12548 -8534
4671 -8534 16279 -363 -31976 -60050 -58729 -29946 -24265 -8981 -9011 -21405 -16332 -16232 -34438 -27169
4657 -27169 -40376 -35690 -41985 -38949 -25135 -38141 -15318 -10320 -879 13599 13308 -14745 -27589
4644 -27589 -7432 27631 21852 7597 25726 29831 866 -8750 -17252 -756 5810 -11837 -22810
4631 -22810 -20245 -25402 -52102 -34603 -44224 -50176 -52420 -20243 -12478 -14249 -46467 -59266 -48220
4618 -48220 -35277 -28094 -24776 -39107 -61882 -87624 -61031 -37263 -20624 -12781 45507 67309
4606 67309 43080 31766 43201 36434 29946 42594 47200 36384 9531 16104 8215 -12453 -12363
4593 -12363 -32083 -40372 -26274 -27917 6237 -4526 -38129 -16336 -6272 -6878 5840 -19109 -3600
4580 -3600 16641 12705 17270 8878 19708 15935 11805 -18127 -25017 2057 -965 -15606 -13965 -16992
4566 -16992 -34993 -22915 -25102 -14916 2714 -11258 -18798 -16071 377 -1445 -14569 -3810 27823
4553 27823 18279 711 -31333 -27003 2736 31850 10157 -15981 -32406 -35375 -46344 -32515
4541 -32515 -18964 -15861 -12046 -4642 1275 -22258 -2449 14726 2204 2887 33825 38723 26379
4528 26379 31171 50675 43937 41684 53553 79004 86228 48839 26691 28264 13623 8657 -6721
4515 -6721 -5988 18227 19749 22516 43784 27455 781 -18831 -10745 14539 16096 -7562 18694
4502 18694 17923 20706 13253 40089 56022 42655 31808 8834 -17266 -20245 -3754 333 -8219
4489 -8219 -22184 -39513 -28958 -23561 -38360 -30530 -38180 -35043 -41498 -46399 -36492 -20879 -7698
4476 -7698 -22280 -30401 2560 8854 8615 16604 -6263 3234 876 23687 25985 36772 50947 56533
4462 56533 22462 -10958 -7993 5024 11415 12627 30365 25834 737 22881 57088 18938 -15227
4449 -15227 -10772 683 15324 -27239 -25248 9201 -7181 -23737 -7283 -15099 -31471 -26031 -6582
4436 -6582 -748 -14293 -30228 -20322 1850 21202 22839 49609 46420 25273 26933 17807 8491
4423 8491 -10669 -7565 114 -7384 -33684 -21412 11640 44970 27362 -14676 -34704 -16741 -30162
4410 -30162 1400 -620 -12454 -26272 15495 13411 252 -8849 -8459 -823 16975 37325 64148
4397 64148 52313 28239 25644 65486 60468 45944 53120 53410 62746 37518 23017 16744 -7355
4384 -7355 -187 -8130 -38214 -57049 -50513 -44383 -39428 -32575 -33699 -31301 -41194 -26482 3887 23475
4370 23475 -604 -21443 -18074 -56464 -67596 -67849 -51192 -32193 -11266 -2554 2036 -15889 -6645
4357 -6645 20557 55656 35699 -21691 -50237 -32418 -475 20000 1532 19049 33929 15624
4345 15624 8476 3493 9615 -541 -36594 -21083 5616 -9804 -32114 -39318 -21648 10012 25356
4332 25356 20405 1678 -31382 -32795 -30177 -8676 -26870 -20432 9271 2230 -11938 -3196 -14181
4319 -14181 -13212 4097 -6171 -21218 -24724 -46358 -52412 -41546 -29726 -10785 -9797 19349 23874
4306 23874 -14302 -12012 18784 6640 -2802 -16057 -18835 -29194 -10097 10853 -4453 9364
4294 9364 -22241 -35104 -13786 -20931 -4657 27624 28886 8059 -12547 -36533 -23886 -9372
4282 -9372 -7479 -23643 -17693 -20599 -825 31658 31344 27867 15159 954 8203 13654 21179 7740
4268 7740 32339 54320 23621 3453 976 4628 19893 39032 34922 28233 28945 27998 1161 -144
4254 -144 3281 7188 32452 32790 11791 13385 21944 46346 41852 37421 7266 2607 25554 48176
4240 48176 40403 34046 29125 3781 627 529 -20417 -15358 -25023 -49092 -36552 -17826 -27903 5232
4226 5232 16040 997 -31136 -20912 -21042 -32029 -37268 -8293 -27300 -34438 -34367 -33105 -49624 -65421
4212 -65421 -53813 -18724 -23071 -51100 -73535 -75364 -61212 -66873 -39835 -20773 14536 46427
4200 46427 44997 35380 17809 -4379 -14411 5871 39370 35654 34860 28002 20889 -12711 -41718
4187 -41718 -20047 5832 13485 11878 4583 -41725 -26780 9081 -2862 -5933 10417 -2233 -7560
4174 -7560 -31072 -67215 -27053 22381 50364 56520 18234 -36404 -23684 -26039 -20518 -23263 -19838
4161 -19838 -32791 -4057 18796 -1564 -5221 -9706 -5172 1032 8349 11859 2578 -10800 20586
4148 20586 16960 14152 30224 32566 21372 3708 -16922 -16214 -18787 -7082 -4309 5770 14934
4135 14934 7539 10454 10910 38329 5987 681 10755 11664 20902 7025 -18290 -19906 -2082 19534
4121 19534 30454 13971 5614 -37162 -73212 -62157 -58214 -68480 -45197 -30991 -36634 -37455 -40479
4108 -40479 -10717 1339 -27735 -27369 -4950 31119 45393 30126 19913 26127 15943 8398 -14703
4095 -14703 -22942 -26820 -18814 -3573 -3116 -11122 -26256 5102 16521 30779 40461 15852 -13067
4082 -13067 -36408 -10230 -14721 -16414 -7773 -18848 -38840 -35529 -25241 -25129 -7986 3717 29753
4069 29753 56748 38445 39369 21362 27092 53114 23097 22874 19145 16978 9420 -14938 -13429 -11731
4055 -11731 -16161 4908 14104 -11074 -10495 37238 80485 81029 32786 -4983 1982 5220 13192 12797
4041 12797 3403 44418 50890 12737 -13897 -21225 -9147 11328 20240 -10984 -36539 -6214 29577
4028 29577 42408 38764 11901 -8348 -42 -17091 -38210 -43869 -38593 -26287 -24978 1711 25699
4015 25699 -9971 -50451 -59856 -53970 -48703 -40633 -28751 -26261 -10973 -1921 19124 4843 5274
4002 5274 20765 25374 22173 16675 7363 26316 19473 13029 34010 28338 -3430 1184 894 526
3988 526 12280 -19254 -52379 -51764 -32716 -44784 -52938 -58625 -31053 -21345 -49715 -48496 -14720
3975 -14720 -43215 -60042 -40519 -23813 -20963 -13055 -2067 1153 -5469 4523 37458 50801 73825
3962 73825 55841 58113 19721 4756 -2577 -14416 -9654 -2636 -12620 -9428 -14276 -2303 -4904
3949 -4904 -10216 8138 20393 22568 7777 -13578 -26772 -23246 -23415 -1987 -6263 -28098 -10604
3936 -10604 -5554 -17879 -12238 7705 5272 -5733 3246 29617 25816 2529 10314 4792 12730
3923 12730 21865 18382 -26815 -39221 -22461 7070 -21641 -29558 -22978 -14940 20566 33977 38419
3910 38419 52084 50035 34518 54577 35394 27450 14348 21307 11912 30563 4415 -28608 -27443
3897 -27443 -31915 -31691 -31384 -9384 8945 -16545 -39488 -36553 -11430 28916 22285 -9914 -9882 -485
3883 -485 -15133 -30146 -14917 9621 4068 -109 -1293 10013 35684 12443 -8100 -6663 -15647
3870 -15647 -46854 -36252 412 4944 31994 49195 13848 -5192 22526 44390 29922 28518
3858 28518 9437 14118 -1054 -14731 9900 10432 12601 7492 -11713 -8516 -6917 3970 10315
3845 10315 -14381 -22528 -4388 -10757 -34552 -37652 -19117 3040 9587 22542 11216 -6580 -3445
3832 -3445 7417 16783 44791 50641 49464 26101 46351 32082 1076 7305 8988 8619 4614 -7334
3818 -7334 -40666 -71570 -50385 -26254 -3089 -26978 -54316 -32924 -24990 -45929 -45665 -22902 -12529
3805 -12529 -17394 -55042 -54328 -49516 -26835 -2080 -1791 -25613 -42147 -40452 -30221 -32573 -38915 -50816
3791 -50816 -23853 -20419 -11699 10194 23746 19027 18565 -6871 680 31019 33436 24962 25981 6750
3777 6750 -17518 -4901 -6828 -2617 11971 40574 55964 47802 20326 -19639 -22256 528 -8352
3764 -8352 -19244 -32765 -27146 -5020 30100 33670 42839 45119 31994 17383 28383 47093 22823
3751 22823 -15799 -30184 19080 28922 3239 -5062 -22208 2680 22333 26701 35377 35620 18205
3738 18205 19557 -1755 -40512 -43768 -31422 -40322 -37308 -36756 -4280 30403 41650 45229 35556
3725 35556 20154 40947 42091 33836 15455 3929 -8885 22802 11006 236 6346 22964
3713 22964 12320 4834 16577 8885 5649 7958 7003 -11717 13906 -10898 -23489 -23989 -27091 7285
3699 7285 1626 -8264 22272 55791 56675 19628 -10867 -16695 7791 10790 14635 -613 3192 1143
3685 1143 17146 40342 29361 233 -33511 -55940 -89874 -105739 -86485 -51174 -50773 -20560
3673 -20560 -19243 -50194 -33750 -12860 -6284 -8759 -39139 -37354 -26651 -41384 -15126 -2046 -11711
3660 -11711 -35837 -42653 -26920 -17586 -12299 -9256 -32731 -51603 -42139 -40238 -23199 -14474 19396
3647 19396 19949 -25505 -35135 -10586 -3006 4509 8991 -3471 -11606 -26919 -29579 -15268 -940
3634 -940 -8424 -37602 -25503 -14178 3921 11954 -6755 -23011 -16471 -33704 -55718 -49816 -30460
3621 -30460 -16043 6480 14965 -8213 -11674 -18564 -27055 -43464 -34085 -3118 16722 -10989 -50166
3608 -50166 -32920 -23453 -25523 -35990 -39062 -24694 -20435 -24342 -44996 -31885 -36766 -35646 -37750
3595 -37750 -14966 -20673 5214 -29890 -33947 -15509 -20990 -34742 -33028 -28784 -3400 23748 18880
3582 18880 -4288 -7160 7138 15055 -19005 -27873 -4909 21281 35240 17057 -22873 -26227 -43870
3569 -43870 -38961 13187 49952 36509 18584 5069 -1640 -2571 24744 40166 44116 14366 17045
3556 17045 31759 18544 7189 -9033 -24094 -61354 -76812 -46784 -18532 -30023 2935 -6473
3544 -6473 -6622 -31407 -24195 -9057 -15356 -37473 -39316 -27492 2466 31229 48251 5365 452
3531 452 -13842 -26223 -22139 -6069 -15620 -51503 -58538 -16291 27166 50907 72033 72421 51351
3518 51351 54757 32264 11532 14754 18534 -1018 -34461 -48043 -30960 -25615 1985 -21342 -35652
3505 -35652 -60057 -60038 -21668 17866 40294 61187 52675 45031 41873 36930 11422 -18951 -39788
3492 -39788 -16241 17113 27565 21772 12166 6083 13912 11303 16487 14347 -12567 -15624 -4631
3479 -4631 -13995 6783 -4014 20378 47470 37148 36421 35642 30796 49638 46670 32562 27470 -12029
3465 -12029 -57700 -60406 -68961 -34726 -4386 -2493 2270 -6802 -2525 19063 -1218 262 17671
3452 17671 -15228 -12260 3241 -13604 -7459 23977 44483 38847 446 -13196 7177 26139
3440 26139 9296 -23092 -30984 -3181 -28877 -26615 -18130 -23514 -26121 -10874 -30192 -46934 -38874
3427 -38874 -17618 6336 5364 5475 5885 24540 52993 45190 21993 11820 17285 38465 47393 51882
3413 51882 39109 35848 34846 23355 29487 30405 38400 25595 -10112 -5658 -426 -14791 -18684 -31372
3399 -31372 -36558 -8780 13548 36445 14861 22891 49080 38652 969 12432 5578 14111 22392
3386 22392 -13143 -19169 1575 -2581 -38648 -22671 1694 29678 30613 29826 36764 7987 20369
3373 20369 14668 -2506 -17529 1792 16559 22125 -8347 -32036 -11814 1527 26818 4249
3361 4249 2455 11737 -6247 -2311 -2127 30161 47888 36154 31690 26806 3221 -23573 -5705
3348 -5705 -3083 24000 38191 25586 22738 12612 29411 59755 50232 36436 43113 48398 22917
3335 22917 -3534 -14973 -34704 -59311 -52058 -47922 -50322 -41269 -33063 -27879 -37547 -39156 -29392 2274
3321 2274 -8802 -7210 6265 -20160 -11254 3762 20453 13900 20978 14665 24876 6682 -13367
3308 -13367 -11881 -15847 -20214 -25650 -14117 -6283 -23010 -46783 -20965 5276 1747 124 4835
3295 4835 23053 25064 -17430 4548 23736 852 -11521 -1982 32630 32286 -34495 -9895 36605
3282 36605 27387 -11528 -14930 -23720 -74506 -79642 -43917 1677 19936 50569 32669 -1486 18005
3269 18005 41161 9971 -15531 -39930 -41442 -42183 -49381 -31368 -42283 -19258 -8928 10075 15742
3256 15742 -6343 -27268 -48605 -20873 -18685 -22863 -4621 2335 10653 24966 52664 80317 79491
3243 79491 68885 56902 73712 79760 58517 78026 72144 38582 16452 -11094 -6498 -8529 16636
3230 16636 11990 14413 55727 40308 16882 26984 16259 9523 15579 8275 6595 -17071 -33134
3217 -33134 -27764 -18223 -2789 -18504 -40829 -43097 -27753 -28201 6985 26580 29295 42158 33460
3204 33460 19536 15877 28949 20296 3799 -13877 -22918 -53346 -52325 11346 10811 -19387 -30521
3191 -30521 -47304 -31148 -14780 2217 9635 8370 -20459 -29370 -15283 1390 -13018 -18347 -12591
3178 -12591 -4071 -4547 7422 8943 -9544 8478 37839 33968 4016 -40985 -76972 -81802 -69438
3165 -69438 -56956 -51955 -21648 7898 -153 30535 56905 98612 82132 59928 8965 -7832
3153 -7832 -35976 -6638 91 6401 1716 1848 -3600 -20275 -1261 25473 4099 -8287 -25591
3140 -25591 -33173 -31481 -39598 -33169 -18955 -8660 21195 51937 15761 8399 -2099 -22171 -22928
3127 -22928 -5980 -4829 -3250 12138 10874 2437 -10181 -31535 -29145 -36679 -52759 -50909 -63893
3114 -63893 -71775 -88077 -49278 10431 6297 -11100 -20480 -10244 5632 17593 3700 22210
3102 22210 21690 25098 44967 45148 4538 -17277 -39170 -33465 -24460 -22484 -34958 -36507 -11378 -9120
3088 -9120 3235 19197 10373 -16667 -39013 -11902 1978 -12193 -17574 358 -3637 5411 6371
3075 6371 -16265 -25971 -28166 -584 -9320 7158 11377 1753 -8044 -15477 -14500 -21557 -27482 -20764
3061 -20764 -17243 -5690 -669 -5445 -14395 -11992 7353 32304 52761 48786 3917 -12150 -9235
3048 -9235 -11846 1253 20584 3645 12915 25998 23497 3033 -16425 -20818 15638 37881 21753
3035 21753 20740 22908 5267 -18386 -31342 -42322 -19612 -5585 -30196 -26694 -26702 2877 41078
3022 41078 49506 43428 -610 -18012 -29151 -29285 22245 64356 70743 30275 22555 21765 12261 -7260
3008 -7260 -8845 -13170 5956 10600 -5221 -12204 4824 20811 22291 10993 22349 32029 44556
2995 44556 23096 18741 6538 792 -25058 -19224 -7866 -1826 -7569 -14498 -29405 -32069 -18094
2982 -18094 19267 32838 -1478 -37685 -27411 -13306 3413 638 -13099 11055 18418 17333
2970 17333 26859 33247 32973 50032 30776 27406 8045 4039 25047 23670 40412 35692 -490
2957 -490 -44508 -56673 -47537 -22925 -21648 -10795 -1385 29027 64509 64166 12738 -18399 -21012
2944 -21012 -19143 -15544 13306 12337 11097 -3675 522 12327 45540 21770 16692 2610 -38304
2931 -38304 -48894 -42638 780 21831 -9888 -16114 -8049 10310 14155 14962 11409 -38164 -81109
2918 -81109 -74764 -24555 -25351 -38476 -33353 -27716 -4219 23000 47348 39191 42758 30401 28543
2905 28543 21991 3679 -7951 -4334 -3296 -7303 12179 30319 14761 6994 -2062 -12767 -16192
2892 -16192 -22492 -31117 -38063 -27710 -21953 -6413 -10101 -31192 -29185 -25323 -27954 -28897 -25802 -24650
2878 -24650 5391 29223 5762 -29915 -10809 -15865 -60258 -51077 -36042 -28474 -32236 -26059 -17263
2865 -17263 -18756 -6704 -3244 3104 14397 -3675 -14855 -37916 -48808 -46585 -29462 -16344 -2909
2852 -2909 -7023 -4808 4447 -3434 618 12322 32192 26795 8269 35932 24081 14520 -803
2839 -803 7158 4636 -3816 1427 3875 16256 26623 9776 -5540 4404 20283 333 -30763
2826 -30763 -27984 7086 -10053 -24023 -2038 34643 44756 17816 -16220 -26106 -5031 -25831
2814 -25831 -26027 -4714 5783 30763 28329 11597 26613 34462 19962 -1371 -2615 -5195 -19728
2801 -19728 -5921 -7002 -19157 -9832 14127 16406 22370 23821 3232 631 19268 43741 30265
2788 30265 23161 23639 20360 24610 23170 24036 47337 32853 26349 -16431 -36635 7407 32988 22913
2774 22913 17050 9284 -23865 -20825 -19589 -15608 -34756 -36726 -16471 -6279 13695 8697 17213
2761 17213 24856 4310 3159 20443 15199 21420 41990 61105 63731 89223 82717 58234 43604
2748 43604 2810 -12181 12593 18122 13797 5231 12592 30802 10937 -10671 -16647 -26009 -6987
2735 -6987 8007 -13405 -21693 -42001 -33358 -14830 7283 32115 2665 7804 39705 27990 -7661
2722 -7661 -1760 -10309 -9749 -209 10494 26085 -810 -26224 -16806 -35069 -6644 28870 21154
2709 21154 -15096 -21657 -18795 -23827 -47004 -25057 -576 -26909 -49798 -41952 -15834 79 23984
2696 23984 21712 12456 31323 31149 -9192 -31098 6297 20267 -14676 3896 27078 35218 28744
2683 28744 5543 6736 4274 -6393 -3951 3265 -32180 -53608 -82467 -74662 -38375 -4416 -977
2670 -977 -30432 -26502 -3370 9071 11030 11595 11032 -1449 -18714 -4105 14034 8706 -28223 -48233
2656 -48233 -19013 -5990 -22769 -19029 8848 14848 -11374 -10692 1103 16732 24277 14940 18183
2643 18183 15199 -7590 2397 -7166 -15291 5793 22468 7953 9489 5468 7091 -1516 19233
2630 19233 22954 24941 30549 16327 8056 36647 51780 34892 28756 49614 31208 -7498 -12484
2617 -12484 -7563 -7706 -12748 -31858 -47951 -36523 -2768 22956 25628 25578 -13577 -18734 -1984 -4468
2603 -4468 -1364 -20842 -26707 -20516 -28488 -20384 28290 25747 19446 22130 51614 58448 56813 58459
2589 58459 45309 15437 24359 49386 36758 7959 -4368 11815 19687 1158 15269 28822
2577 28822 32227 12269 14348 20435 28771 30273 -3648 -19967 -5495 27067 26275 -12987 -17228
2564 -17228 -15618 -11403 -24130 -6171 15940 -804 -1457 5995 12448 41956 23123 2102 -25643
2551 -25643 -12766 -15813 -25574 -320 17786 10549 25541 25032 10515 -12794 -16466 13637 27955
2538 27955 38069 20223 -21814 -8917 15259 21587 -781 -10576 -13276 -3495 10805 -8440 295
2525 295 20271 25213 -20406 -17363 -11989 13458 5172 -8282 2359 8269 14289 -10568 -29618
2512 -29618 4993 25782 49098 23785 -25820 -14413 -9267 13712 30201 21992 -885 -49946
2500 -49946 -45941 -47266 -72582 -60453 -23071 5991 9627 -7320 -1597 4710 -13495 -53282 -43107
2487 -43107 -37118 566 38997 32600 23021 1811 -2658 -255 8765 -17618 -73713 -84854 -73195
2474 -73195 -60254 -62474 -44942 -30614 -36574 -22641 -40361 -31813 -26921 -4637 6984 24538 2283
2461 2283 -27060 -35884 -9090 3090 8894 9767 -4974 -17157 -12770 -23143 -31184 -26704 -13056
2448 -13056 -18890 2076 16547 2322 9817 37510 58540 50637 37362 29926 13765 13220 30314
2435 30314 41337 11897 -21998 -29136 -8785 -11270 -22680 -11996 11171 -17186 -58391 -30089
2423 -30089 -4659 15825 7608 2857 17853 13937 4275 19234 36358 41959 30073 1165 -23354
2410 -23354 -65258 -47717 -52936 -44063 -42959 -13626 -5370 -36613 -60790 -57671 -49009 -18629 -39375
2397 -39375 -35228 6745 21652 52957 40084 19503 9456 45 -5280 5524 13674 21354 23374
2384 23374 26780 29705 49424 64598 56243 51411 33042 -9611 -35288 -36816 -34479 -36746 -21436
2371 -21436 -13351 -25989 -12989 -14241 19030 31057 31629 8507 22603 29521 1925 -25915 -22743
2358 -22743 -23742 -22889 4976 12471 -9317 -11742 -8608 9601 -12376 -3739 -10832 1636 6510 -21952
2344 -21952 -32756 -27588 -18557 23984 5352 -9218 14242 -12711 -23347 -10096 -25066 -26792
2332 -26792 7532 2119 -6481 36696 26301 2082 -24540 -27838 1838 29216 18614 -4441
2320 -4441 -15786 16989 36661 32774 1343 -17538 -7875 -6516 -18275 -585 7340 15718 43625
2307 43625 52616 36065 22064 8026 11828 6590 -24267 -20233 -9248 721 -2082 -804 -16643
2294 -16643 -2943 -4157 17990 60929 64211 35118 26856 9026 -15993 -50467 -30678 15290
2282 15290 21349 34645 19250 26569 46450 37317 33237 39675 15185 19331 -3430 -28467 -33739
2269 -33739 -37967 -2569 16722 20230 15057 -11574 -28432 -17767 -14352 -3832 -9424 14512 37540
2256 37540 49787 35756 21501 4626 6224 -26674 -21510 -6257 10530 20371 24398 3942 6161
2243 6161 -3849 -12188 -21051 700 7706 22043 12500 7760 -5698 12562 12268 4582 2122 2728
2229 2728 10044 37174 3139 -5515 10031 14813 41516 47685 29946 18988 18786 -7724 2569
2216 2569 30115 4502 -1245 7027 31656 39129 55034 88589 78102 22746 645 18417 18357
2203 18357 -2086 -66 25639 46336 52713 13200 -6963 20425 28725 53577 51290 22744 26389
2190 26389 14540 -6407 -8643 -8566 7451 26276 16436 -3991 -25679 -18789 -7763 1751 -8951
2177 -8951 -21138 -49885 -38010 -4097 8423 995 -17773 -5301 15498 25397 34389 46951 51470
2164 51470 36987 21364 16116 62930 94695 66665 21620 9808 23818 9142 -6519 -35907
2152 -35907 -38978 -19800 -33379 -43545 -44221 -7645 26274 21109 10738 -13838 -27925 -48404 -21779
2139 -21779 -2409 -2558 -3401 1621 18078 45654 35345 23063 23012 12744 18626 4407 14985 44537
2125 44537 53349 70509 36070 17004 13691 6355 8508 26341 32946 38327 28633 2505 -3885
2112 -3885 -5300 1018 29245 68083 69804 29680 -33065 -58398 -51889 -61689 -29783 -3252 -26637
2099 -26637 -9822 11125 -13932 -21953 -24398 -12353 11438 28018 -3048 -27257 -10413 1680
2087 1680 -5056 -21638 -6774 20928 16503 8667 11147 4911 -7289 9061 31418 45560 56623
2074 56623 46522 50626 40354 45036 47704 6500 -21321 -45557 -34964 -23188 28254 60601
2062 60601 55865 19785 22705 21777 17614 10832 8970 27737 29793 50688 59911 28552 24060 39367
2048 39367 36508 -2880 -11197 -19019 -13910 -12877 -13809 -15374 -28909 -33046 -40931 -39017 4406 23966
2034 23966 34243 9655 -11745 -15131 -13035 -37218 -51148 -35888 9837 28579 8518 3876
2022 3876 1051 -24797 -14159 17833 8084 -7247 -9796 -3346 -17960 -20173 -25264 -28964 -36498 -25595
$$ [...]
##END NTUPLES=NMR SPECTRUM
##END=
