##TITLE=Analysis number 321657
Compound Code cc 45909
Book Reference 438/172/1
Project Code adrs
Chemist Name antons
##JCAMPDX= 6.0         $$ Bruker NMR JCAMP-DX V2.0
##DATA TYPE= NMR SPECTRUM
##DATA CLASS= NTUPLES
##ORIGIN= Bruker BioSpin GmbH
##OWNER= nmr
$$ XWIN-NMR		Version 3.5
$$ Mon Aug 21 12:16:43 2006 GMT Daylight Time (UT+1h)  MAYBRIDGE\nmr@NMR_250MHZ
##.OBSERVE FREQUENCY= 250.131544655141
##.OBSERVE NUCLEUS= ^1H
##.ACQUISITION MODE= SIMULTANEOUS (DQD)
##.ACQUISITION SCHEME= undefined
##.AVERAGES= 16
##.DIGITISER RES= 18
##SPECTROMETER/DATA SYSTEM= dpx250
##.PULSE SEQUENCE= zg30
##.SOLVENT NAME= DMSO
##.SHIFT REFERENCE= (INTERNAL, DMSO, 0, 16.522)
##AUDIT TRAIL= $$ (NUMBER, WHEN, WHO, WHERE, WHAT)
$$ ##TITLE= Audit trail, XWIN-NMR		Version 3.5
$$ ##JCAMPDX= 5.01
$$ ##ORIGIN= Bruker BioSpin GmbH
$$ ##OWNER= nmr
$$ C:\u/data/dgb/nmr/ADRS/1260/pdata/1/auditp.txt
$$ ##AUDIT TRAIL=  $$ (NUMBER, WHEN, WHO, WHERE, WHAT)
(   1,<2006-08-21 12:16:22.45 +100>,<MAYBRIDGE\nmr>,<NMR_250MHZ>,
      <created by zg, POWCHK disabled, PULCHK disabled
       configuration hash MD5:
       E2 DF 36 D8 04 B2 41 60 5A D7 A3 38 5A 4B D0 FE
       data hash MD5: 64K
       0D EE 51 A8 C4 B5 F4 02 41 09 E1 97 28 FE CE 15>)
(   2,<2006-08-21 12:16:34.19 +100>,<MAYBRIDGE\nmr>,<NMR_250MHZ>,
      <Start of raw data processing
       ef LB = 0.3 FT_mod = 6 PKNL = 1 SI = 32K 
       data hash MD5: 32K
       72 F7 2F B9 67 1E 72 6A 83 47 30 42 F1 1A 08 D9>)
(   3,<2006-08-21 12:16:35.92 +100>,<MAYBRIDGE\nmr>,<NMR_250MHZ>,
      <apk 
       data hash MD5: 32K
       AF 33 A3 8B A0 E3 C7 37 E2 39 7C FF 46 AC 42 B5>)
(   4,<2006-08-21 12:16:36.73 +100>,<MAYBRIDGE\nmr>,<NMR_250MHZ>,
      <abs ABSG = 5 
       data hash MD5: 32K
       13 31 07 C6 DC 3C 1C 4B 70 78 20 30 17 10 F2 FB>)
$$ ##END=
$$ 
$$ hash MD5
$$ 1C 14 07 79 11 F4 2C D4 7B 98 42 A3 EA 63 DA 87
##$RELAX= 
##$RELAX= 
##$RELAX= 
##$RELAX= 
##$RELAX= 
##$RELAX= 
##$RELAX= 
$$ Bruker specific parameters
$$ --------------------------
##$DU= <C:\u>
##$EXPNO= 1260
##$NAME= <ADRS>
##$PROCNO= 1
##$TYPE= <nmr>
##$USER= <dgb>
##$AMP= (0..31)
100 100 100 100 100 100 100 100 100 100 100 100 100 100 100 100 100 100 
100 100 100 100 100 100 100 100 100 100 100 100 100 100 
##$AQSEQ= 0
##$AQ_mod= 3
##$AUNM= <au_zg>
##$AUTOPOS= <51 >
##$BF1= 250.13
##$BF2= 250.13
##$BF3= 250.13
##$BF4= 250.13
##$BF5= 500.13
##$BF6= 500.13
##$BF7= 500.13
##$BF8= 500.13
##$BYTORDA= 1
##$CFDGTYP= 0
##$CFRGTYP= 5
##$CHEMSTR= <none>
##$CNST= (0..31)
1 1 145 1 1 1 1 1 1 1 1 1 1 1 1 1 1 1 1 1 1 1 1 1 1 1 1 1 1 1 1 1 
##$CPDPRG= <>
##$CPDPRG1= <>
##$CPDPRG2= <>
##$CPDPRG3= <>
##$CPDPRG4= <mlev>
##$CPDPRG5= <mlev>
##$CPDPRG6= <mlev>
##$CPDPRG7= <mlev>
##$CPDPRG8= <mlev>
##$CPDPRGB= <>
##$CPDPRGT= <>
##$D= (0..31)
0 1 0 0 0 0 0 0 0 0.06 0 0 0 0 0 0 0.0002 0 0 0 0 0 0 0 0 0 0 0 0 0 0 
0 
##$DATE= 1156158981
##$DBL= (0..7)
120 120 120 120 120 120 120 120 
##$DBP= (0..7)
150 150 150 150 150 150 150 150 
##$DBP07= 0
##$DBPNAM0= <>
##$DBPNAM1= <>
$$ [...]
##$SUBNAM7= <"">
##$SUBNAM8= <"">
##$SUBNAM9= <"">
##$SW= 20.6930455092707
##$SWIBOX= (0..15)
0 0 3 0 0 0 0 0 0 0 0 0 0 0 0 0 
##$SW_h= 5175.983436853
##$TD= 65536
##$TD0= 1
##$TE= 295.16
##$TE2= 300
##$TE3= 300
##$TEG= 300
##$TL= (0..7)
0 120 120 120 120 120 120 120 
##$TP= (0..7)
150 150 150 150 150 150 150 150 
##$TP07= 0
##$TPNAME0= <>
##$TPNAME1= <>
##$TPNAME2= <>
##$TPNAME3= <>
##$TPNAME4= <>
##$TPNAME5= <>
##$TPNAME6= <>
##$TPNAME7= <>
##$TPOAL= (0..7)
0.5 0.5 0.5 0.5 0.5 0.5 0.5 0.5 
##$TPOFFS= (0..7)
0 0 0 0 0 0 0 0 
##$TUNHIN= 0
##$TUNHOUT= 0
##$TUNXOUT= 0
##$USERA1= <user>
##$USERA2= <user>
##$USERA3= <user>
##$USERA4= <user>
##$USERA5= <user>
##$V9= 5
##$VALIST= <valist>
##$VCLIST= <CCCCCCCCCCCCCCC>
##$VD= 0
##$VDLIST= <DDDDDDDDDDDDDDD>
##$VPLIST= <PPPPPPPPPPPPPPP>
##$VTLIST= <TTTTTTTTTTTTTTT>
##$WBST= 1024
##$WBSW= 4
##$XGAIN= (0..3)
0 0 0 0 
##$XL= 0
##$YL= 0
##$YMAX_a= 257042
##$YMIN_a= -473597
##$ZGOPTNS= <>
##$ZL1= 120
##$ZL2= 120
##$ZL3= 120
##$ZL4= 120
##$ABSF1= 16.522
##$ABSF2= -4.171173
##$ABSG= 5
##$ABSL= 3
##$ALPHA= 0
##$AQORDER= 0
##$ASSFAC= 0
##$ASSFACI= 0
##$ASSFACX= 0
##$ASSWID= 0
##$AUNMP= <proc_1d>
##$AZFE= 0.1
##$AZFW= 0.1
##$BCFW= 0
##$BC_mod= 0
##$BYTORDP= 0
##$COROFFS= 0
##$CY= 12.5
##$DATMOD= 1
##$DC= 0
##$DFILT= <>
##$DTYPP= 0
##$F1P= 14.0000005364418
##$F2P= -0.99999901652339
##$FCOR= 0.5
##$FTSIZE= 32768
##$FT_mod= 6
##$GAMMA= 0
##$GB= 0
##$INTBC= 1
##$INTSCL= 1
##$ISEN= 128
##$LB= 0.3
##$LEV0= 0
##$LPBIN= 0
##$MAXI= 10000
##$MC2= 0
##$MEAN= 0
##$ME_mod= 0
##$MI= 0
##$NCOEF= 0
##$NC_proc= -4
##$NLEV= 6
##$NOISF1= 0
##$NOISF2= 0
##$NSP= 0
##$NTH_PI= 0
##$NZP= 0
##$OFFSET= 16.522
##$PC= 1
##$PHC0= 125.1595
##$PHC1= 28.13655
##$PH_mod= 1
##$PKNL= yes
##$PPARMOD= 0
##$PSCAL= 4
##$PSIGN= 0
##$REVERSE= no
##$SF= 250.13
##$SI= 32768
##$SIGF1= 0
##$SIGF2= 0
##$SINO= 400
##$SIOLD= 32768
##$SREGLST= <1H.DMSO>
##$SSB= 0
##$STSI= 32768
##$STSR= 0
##$SW_p= 5175.98343685301
##$SYMM= 0
##$S_DEV= 0
##$TDeff= 65536
##$TDoff= 0
##$TI= <Analysis number 999999
Compound Code 99
Book Reference 9
Project Code 9>
##$TILT= no
##$TM1= 0
##$TM2= 0
##$TOPLEV= 0
##$USERP1= <user>
##$USERP2= <user>
##$USERP3= <user>
##$USERP4= <user>
##$USERP5= <user>
##$WDW= 1
##$XDIM= 32768
##$YMAX_p= 315679289
##$YMIN_p= -384260
$$ End of Bruker specific parameters
$$ ---------------------------------
##NTUPLES= NMR SPECTRUM
##VAR_NAME=  FREQUENCY,     SPECTRUM/REAL,   SPECTRUM/IMAG
##SYMBOL=    X,             R,               I
##VAR_TYPE=  INDEPENDENT,   DEPENDENT,       DEPENDENT
##VAR_FORM=  AFFN,          ASDF,            ASDF
##VAR_DIM=   32768,         32768,           32768
##UNITS=     HZ,            ARBITRARY UNITS, ARBITRARY UNITS
##FACTOR=    0.157963299565203, 1,           1
##FIRST=     4132.6476996994, 0,             0
##LAST=      -1043.33573715361, 0,           0
##MIN=       -1043.33573715361, -384260,     0
##MAX=       4132.6476996994, 315679289,     0
$$ Real data points
##PAGE= N=1
##DATA TABLE= (X++(R..R)), XYDATA
$$ [...]
19420E80141q2002q3765n9048o7849L1950k9945m9165r219Q715l4394l2713n199
19408A67507J7363N9538o562K328n698l293j0552j5977k7446L3694j3889o8811
19396A28202j4317L979j6215P936N120m477j870l5820j4837K401R91k1599k6581
19383A2913k0103J8898j1689O557k1375J4294M3579j0183j2341k020k2593k6263
19371c0326N411J2406n376r054J0595R819m3915m0461j2951l3363M821L0832N5701
19358d5861Q216o0457K2863K0090j7505J2379K3086J5203N795J3498M5386L0497
19346G3190L9793N2876N1895p731M80J7914J7792n4273l5335n022n5525k5813
19334G0241p204j724k9170R26l1004k8112O584K0994l6682l5936j3129k4696P711
$$ plain form
19420 580141 498139 414374 355326 287477 319427 289482 240317 231098 239813 205419 172706 167507
19408 167507 184870 244408 237846 240174 234476 231183 220631 204654 177208 210902 197013 128202
19396 128202 113885 117864 101649 109585 114705 110228 108358 72538 57701 60102 61093 39494 12913
19383 12913 -7190 11708 19 6576 -14799 -505 43074 32891 20550 18530 -4063 -30326
19371 -30326 -24915 -12509 -17885 -26939 -16344 -6525 -50440 -90901 -103852 -137215 -132394 -101562 -45861
19358 -45861 -37645 -98102 -75239 -55149 -72654 -60275 -37189 -21986 -16191 -2693 42693 73190
19346 73190 112983 165859 217754 210023 210503 228417 246209 191936 156601 151579 96054 70241
19334 70241 63037 61313 32143 33069 2065 -26047 -19463 1531 -35151 -71087 -84216 -108912 -101201
19321a01201J8003L1528M936N3734L7200l61J9389M7038L1572N2796J9142L630
19309B17406J5473r607j3483K965l3675j04648j04425n252r302k0845o698o897
19297g8988L3618K8956j1949l8814m252M618j4149j3174K294J5347m608j5390
19285i6491l5537k8857M8503J0132m648l0560k1607K6024J4334o857j2194J2887
19273a24871K4366K8894p185J2415k0197n6799j9033K2209O630k0369m94K7860
19261a26574M6383M992l7981l7666P600l0432L732J8704j5676j3783N412O945
19249a68344K3668Q034j6426R114L3636N440n240j3417j3224M8929L4254k4043
19237g7619k5301J8121J1145K126l6820J2596K0475j0507k0979J35K6870K6731
$$ plain form
19321 -101201 -83198 -51670 -46734 7000 44200 43839 63228 110266 141838 194634 213776 217406
19309 217406 232879 223272 209789 212754 179079 74431 -29994 -35246 -44548 -65393 -72091 -78988
19297 -78988 -45370 -16414 -28363 -67177 -71429 -66811 -80960 -94134 -91840 -76493 -81101 -96491
19285 -96491 -132028 -160885 -112382 -102250 -106898 -137458 -159065 -133041 -118707 -125564 -137758 -124871
19273 -124871 -100505 -71611 -78796 -66381 -86578 -143377 -162410 -140201 -133571 -153940 -154434 -126574
19261 -126574 -80191 -75199 -113180 -150846 -143246 -173678 -169946 -151242 -166918 -180701 -175289 -168344
19249 -168344 -144676 -136642 -153068 -143954 -110318 -104878 -110118 -123535 -136759 -87830 -53576 -77619
19237 -77619 -102920 -84799 -73654 -71528 -108348 -95752 -75277 -85784 -106763 -106628 -79758 -53027
19225e3027l9169o873J5671j2671J1983l85P971M6633N232n0144J2276K1510m5229
19212h6222Q968j355m947M8246L7807l8074l0903R731J2551K0369j4902l3446
19200g2177J4031N0348P197J5871l630L6001J9445l8024p1913Q768k4682Q900
19188d9865L600k1187K0560M9682K2244l4433k7146O664M869J5340L6182k4639
19176A871l6448m176N886K0891L6053k8948n427K7585L127k257K4125k201n127
19163C4954J3966K805l0789K3653J1829K8223L2533l5818l6406m440q965K9156
19151F0701O098L8743N2336O4721J417l997n622R743M0632O0818p145q04l2582
19138B85059m05Q198p187k9145Q387J4659j2897j4432K0049q51l2952j5631k2077
$$ plain form
19225 -53027 -92196 -99069 -83398 -96069 -84086 -84471 -76500 -29867 -24635 -74779 -62503 -40993 -86222
19212 -86222 -77254 -78609 -83556 -35310 2497 -35577 -66480 -56749 -44198 -23829 -38731 -72177
19200 -72177 -58146 -7798 -601 15270 11640 47641 67086 29062 -42851 -34083 -58765 -49865
19188 -49865 -46265 -67452 -46892 2790 25034 -9399 -36545 -29881 -25012 -9672 26510 1871
19176 1871 -34577 -38753 -32867 -11976 24077 -4871 -10298 17287 20414 18157 42282 40081 34954
19163 34954 48920 51725 20936 44589 56418 84641 117174 81356 44950 40510 31545 60701
19151 60701 66799 105542 157878 222599 224016 220019 214397 224140 264772 325590 318445 317641 285059
19138 285059 284654 292852 285665 256520 264907 279566 266669 252237 272286 271435 238483 222852 200775
19125B00775j1464k3514j7699L354L0702l6050k0556k260j3065p484O8897Q88
19113A72524M444J5299j7192j5085k9921K1729K3865l7913o119K7362J4749P0668
19101B44410N1541P051M7225J1399N7341K7488M2205J40185J58063p319K4266
19090H03855J2500j08851j19846p6026n2120m8803k4049L5881m3789n2294m987
19079C21471o9860J721N7234R241o074o2644N851O4263N9684K3779K4823N6346
19067D85835J1934L4196M4374O8133L5285k5160m0397j4146l8025n0449n769q197
19055D97614k8696R103k7031n319L9783L867J4949M9793P3021N9304N6192Q2212
19043H24792Q8862L5029J1227M2597j0367m9063Q065J4402l8016l7063k3528k2105
$$ plain form
19125 200775 189311 165797 148098 151452 182154 146104 125548 123288 110223 102739 171636 172524
19113 172524 176968 192267 175075 159990 130069 151798 175663 137750 131631 158993 173742 244410
19101 244410 295951 303002 350227 361626 418967 446455 488660 628845 786908 779589 803855
19090 803855 816355 707504 587658 511632 459512 410709 386660 422541 378752 326458 321471
19079 321471 251611 253332 310566 319807 313733 251089 256940 321203 380887 404666 429489 485835
19067 485835 497769 531965 576339 644472 679757 654597 614200 600054 562029 511580 505811 497614
19055 497614 468918 478021 450990 445671 485454 489321 504270 554063 627084 686388 742580 824792
19043 824792 913654 948683 959910 1002507 992140 943077 951142 965544 927528 890465 866937 844832
19031H44832k6700p4081n4559j8531k5227k3303n278k9506j8515M022m3756k2107
19019E07291j7904k1255k5089K9551N6473M9266N1777N0086p026m6542n3j4291
19007F12284m4755l5385l8785j4736j69K2809m3095k9642m7970m3209m594j5563
18995C17190l895J078M7682n677l7789k7068q572j1143n512J7825j1002j0279
18983B62838r337j7676K392L2832K6574q140J0501K7162n242l6215j9544K9986
18971B96131M1984R402J5504k6321r482J3902J3602J6207L1778O395J3416n544
18959D16974K2826J3214K0276J6719N8717K5076k8535j1207P871J7043M1542l6928
18947E63588j3877J0411k5150Q64P161m0409m4105l2797j3538o19r67k2938N53
$$ plain form
19031 844832 818132 744051 689492 670961 645734 622431 617153 587647 569132 573154 529398 507291
19019 507291 489387 468132 443043 472594 529067 578333 630110 680196 673170 626628 626575 612284
19007 612284 567529 532144 493359 478623 478454 501263 458168 428526 380556 337347 332753 317190
18995 317190 313295 314373 362055 356378 318589 291521 282949 271806 266294 284119 273117 262838
18983 262838 253501 235825 238217 271049 297623 289483 299984 327146 321904 285689 266145 296131
18971 296131 338115 347517 363021 336700 327218 341120 354722 370929 402707 409102 422518 416974
18959 416974 439800 453014 473290 490009 548726 573802 545267 534060 541931 558974 600516 563588
18947 563588 549711 560122 534972 535836 542997 502588 458483 425686 412148 411529 410562 387624 388177
18934C88177o2812l5406O289k2689o843j2138K39N568k4075K1620M0180j3374
18922B84736m0834K9381J6998l8582K9794N1399O95J6217q947l4425j7685J2162
18910C00909R232N6084K8154j9934l1791J1168O4324N9125O835K4391N7475Q7458
18898F53430N7354J30060J58571P2501L6490K960o2179l2563k2139o3505q4267
18887H46713o9294m0437l4475n4778o8051m6844m2634m4088J3979J6426k3679
18876D52838j1882k267R92j1476J5390j4664k8482k4772r342M4692K9242J0621
18864D50890k1809l8685k5900J9604L7262l1584k79o773j9182j5041R411l0353
18852C27561p904J8093K5287j5496m458l856K5412J8244j964q251R221M142K8816
$$ plain form
18934 388177 325365 289959 296248 273559 266716 254578 254817 260385 236310 257930 298110 284736
18922 284736 243902 273283 290281 251699 281493 332892 333587 349804 340857 306432 288747 300909
18910 300909 310141 366225 394379 374445 342654 353822 418146 477271 484106 508497 565972 653430
18898 653430 710784 840844 999415 1071916 1108406 1111366 1049187 1016624 994485 930980 846713
18887 846713 777419 736982 702507 647729 579678 532834 490200 446112 460091 476517 452838
18876 452838 440956 438689 439681 428205 443595 428931 400449 375677 366335 411027 440269 450890
18864 450890 429081 390396 364496 384100 421362 389778 389499 382726 363544 348503 357914 327561
18852 327561 319657 337750 363037 347541 343083 339227 364639 382883 380919 372668 381889 386031 414847
18839D14847K7437N750L1044p418o323j7592K3049J6669l094l3448J0766J276
18827D62963j6035l6444n789M0309j2839k0196l591P923M9812J9184l0420l8905
18815D15972q395J3972K1439K0627j2147q308j1887j2649m119M4632N535j8848
18803D45824j908N6218P424m1229J9907J0497j22L300N770j5504M3129K5214l481
18790E55039J5656p19j5976j3138K4858J3211k9806K818P44J2981J5636o328N703
18777E80679j9402m253N908m3449n976L0872O3948j9441k1853n118r461m0660
18765E11794L9744M1067Q750J9014K4952J2748m505j6441k1053K8804K3438P356
18753F75668l9217r065J5965j472l8712k2677j9008J6302K6816J7983J9898K2336
$$ plain form
18839 414847 442284 448034 479078 471660 465337 447745 470794 487463 484369 450921 461687 462963
18827 462963 446928 410484 404695 445004 432165 411969 408378 416301 466113 485297 454877 415972
18815 415972 407577 421549 442988 463615 451468 443160 431273 418624 414505 459137 464672 445824
18803 445824 443916 500134 507558 466329 486236 496733 496611 499911 505681 490177 533306 558520 555039
18790 555039 570695 569976 554000 540862 565720 578931 549125 551943 552687 565668 581304 574976 580679
18777 580679 561277 557024 562932 519483 513507 544379 608327 588886 567033 561915 552454 511794
18765 511794 551538 592605 601355 620369 645321 658069 653564 637123 616070 644874 668312 675668
18753 675668 636451 627386 643351 641879 603167 580490 561482 577784 604600 622583 642481 664817
18741F64817J6867k5612k3117J7303L8066J6908j3228q356J3686N455K5181L1325
18729G59295k243L4182M4400N3644Q243l7708j870p437l730K5067j3480l419R217
18716H64161N1992J5175o687L4354K8855P884k5770M3447L5690m8972j3189Q43
18704I87783l6673K2708K8325n308r929L7229K9571q180m124L2862N5410L2647
18692A162321k82j2413L383q856K1868L2227L8428P195O479l0102n895l884l9701
18679A170768k390J9527K2607J8292J8922K8614L9583P5882K1734J1908L7602
18668A463049R071L3420L5686K1747J8180O91K2567K6132J7434j6932j3922j3465
18656A603658k3179k6313j1663J8772k0384j410J8769L6084J6159N4966O5080
$$ plain form
18741 664817 681684 656072 632955 650258 688324 705232 692004 683648 697334 702789 727970 759295
18729 759295 757052 791234 835634 889278 897521 859813 857943 850506 846776 871843 858363 854944 864161
18716 864161 916153 931328 924641 958995 987850 995734 969964 1013411 1049101 1000129 986940 987783
18704 987783 951110 973818 1002143 996835 986906 1024135 1053706 1045526 1041402 1074264 1129674 1162321
18692 1162321 1162039 1149626 1153009 1144153 1166021 1198248 1236676 1243871 1250350 1220248 1214353 1210469 1170768
18679 1170768 1168378 1187905 1210512 1228804 1247726 1276340 1315923 1391805 1413539 1425447 1463049
18668 1463049 1472120 1505540 1541226 1562973 1581153 1581844 1604411 1630543 1647977 1631045 1617123 1603658
18656 1603658 1580479 1554166 1542503 1561275 1540891 1539481 1558250 1594334 1610493 1665459 1730539
18645A730539J0599k2118K0468P7577P2083O2936J6562k678l959j7940k3072l160
18633A917837r280K7606j4601L0147J0117k4332j5470K7186p162K9496M3767O1654
18621B076965L8901O0875L8272L3112K9798O8541N2779P459J1576K0146N2801
18610B491225N2694M6527L7840J2844L4655P0005P6156M581L0330N5959P4885
18599B987701N8426J7013P0131O4048J00324J00418J01269J54859J26614J21263
18589C902066J54371J66488J84234K15764K51115K42545K32808K45002K51117
18580E845510K68818L21030L12054L23129L56358L98318M86116N99701P40951
18571I651985R19177J195578J637277K246131L042446M319889N945555P563711
$$ plain form
18645 1730539 1741138 1719020 1739488 1817065 1889148 1952084 1968646 1965968 1962009 1944069 1920997 1917837
18633 1917837 1908557 1936163 1921562 1951709 1961826 1937494 1922024 1949210 1942048 1971544 2015311 2076965
18621 2076965 2115866 2176741 2215013 2248125 2277923 2346464 2399243 2406702 2418278 2438424 2491225
18610 2491225 2543919 2590446 2628286 2641130 2675785 2745790 2821946 2826527 2856857 2912816 2987701
18599 2987701 3046127 3063140 3133271 3197319 3297643 3398061 3499330 3654189 3780803 3902066
18589 3902066 4056437 4222925 4407159 4622923 4874038 5116583 5349391 5594393 5845510
18580 5845510 6114328 6435358 6747412 7070541 7426899 7825217 8311333 8911034 9651985
18571 9651985 10571162 11766740 13404017 15650148 18692594 23012483 28958038 36521749
18563C6521749Q571964Q807083Q859595R038433Q199231N617756K298973l05564
18555H7609220k403282m949322o924698p104266n715812l569791j512234P9086
18547E5508901J231552K389809M029095N716242O416068N855565N523318O318267
18539I2988817O524935M769430K777194K583315L627181L361699J217535l85557
18531A17464549J9037R34420j30234k823712m418602m289752m461121o262770
18523I6031815p753198p503197o509468n826565n537652m860999l666080k096323
18515E2278333k80053J819226M471144P517200R877666J0391343R273969P650381
18507A02999209N730054K383114j799053m848010o233507p227348q724653r582246
$$ plain form
18563 36521749 45093713 53900796 62760391 71798824 79998055 85615811 87914784 87609220
18555 87609220 85205938 80256616 73331918 66227652 60511840 56942049 55429815 55508901
18547 55508901 56740453 59130262 63159357 68875599 75291667 81147232 86670550 92988817
18539 92988817 99513752 104283182 107060376 109643691 113270872 116632571 117850106 117464549
18531 117464549 117483586 118418006 118287772 115464060 111045458 106755706 102294585 96031815
18523 96031815 88278617 80775420 74265952 68439387 62901735 58040736 54374656 52278333
18515 52278333 51998280 53817506 58288650 65805850 75683516 86074859 95348828 102999209
18507 102999209 108729263 111112377 109313324 104465314 98231807 91004459 82279806 72697560
18499G2697560r146313p937121o605410n505490m683188l989643l359190k794673
18491B8676532k325016j958310j649079j408007j204633j075702r46029r02384
18483A7207372q21699p96493p42083o70519o52640o29060n82622n16555m77324
18474A1318377l99451m09609l85094l55079l33547l35136l09641k75397k59610
18465H255813k26902k01446k06034j91033j85966j83952j66072j39346j40326
18456F614736j23083j18345j59473j69964j51532j40233j24387j26152q3848j36609
18446E281110j60156j73260j70625j36057j84852j73563j08512j28067j41748
18437C904270r4754q8043j17077r9178j04862q2248j48704r6335j18462j65487
$$ plain form
18499 72697560 63551247 55614126 49008716 43503226 38820038 34830395 31471205 28676532
18491 28676532 26351516 24393206 22744127 21336120 20131487 19055785 18109756 17207372
18483 17207372 16385673 15589180 14847097 14176578 13523938 12894878 12312256 11795701 11318377
18474 11318377 10918926 10509317 10124223 9769144 9435597 9100461 8790820 8515423 8255813
18465 8255813 8028911 7827465 7621431 7430398 7244432 7060480 6894408 6755062 6614736
18456 6614736 6491653 6373308 6213835 6043871 5892339 5752106 5627719 5501567 5417719 5281110
18446 5281110 5120954 4947694 4777069 4641012 4456160 4282597 4174085 4046018 3904270
18437 3904270 3809516 3721473 3604396 3505218 3400356 3318108 3169404 3073069 2954607 2789120
18427B789120q6045j09065j08171n9060k2751k6911o9680j07313r0621P037j1753
18416B104787m4073n5707m1243n4132l1021m5636p3979l4509j5035n9034l4446
18405A615972j1448m3430n1245j05117l8755j3353l1235k2896n8852o5398j8901
18394A155342L1659l6858n563k5779q3218n1026n1701k2489m4587l7671J4695
18383H42804m5613k5202o5841l9326k6884l3332l6343m0212m0332l9273j7904
18372D32542J005m832k646n0161n8502n892l7754l1236J190l204J9191j2456N773
18359B53018L8576j0123m3303m197j3059l4489p7342l8449L2556R82k7646q839
18347F7685J5356Q098K932O858k6543k1510L241L706m603J3656K2455K795k4761
$$ plain form
18427 2789120 2703075 2594010 2485839 2426779 2404028 2377117 2307437 2200124 2109503 2116540 2104787
18416 2104787 2060714 2005007 1963764 1909632 1878611 1832975 1758996 1724487 1709452 1650418 1615972
18405 1615972 1604524 1561094 1509849 1404732 1365977 1352624 1321389 1298493 1239641 1174243 1155342
18394 1155342 1187001 1150143 1144580 1118801 1035583 984557 932856 910367 865780 828109 842804
18383 842804 797191 771989 706148 666822 639938 606606 570263 530051 489719 450446 432542
18372 432542 433547 428715 426069 375908 317406 311514 273760 242524 243714 240510 259701 247245 253018
18359 253018 291594 281471 238168 233971 220912 186423 109081 70632 103188 104170 76524 67685
18347 67685 83041 91139 94071 100929 74386 52876 56117 59823 55220 68876 91331 94126 69365
18334F9365l5387l9471m3322K294j0200n577j0315J2986L6122J4966P08o8751
18322g6582J5531Q205k9736j6066K98j0979K124k431k5155M0839J8106m3711l0293
18309a49850j6457M327J9420j3158l491J4650j1577j9687o1491q949N2110r244
18297b03397k850Q730J2790k2644m0628k2516q96J9531L2007Q722L5818K3634
18285a51699J8057J7087k4527m480J160L5152J4028k8424r352j2731P455J9961
18273a18313J4684j4183l6346j2727N3745J4748j774k5695j4795n0784L3776L3398
18261a24266N190k5098j5809J3605K9987M449m1927j2657k7066L852J725K7835
18249a60180J99k7046k5538k2767L9697L627J1881O844N315p621J2543j5302j7554
$$ plain form
18334 69365 33978 -5493 -48815 -46521 -56721 -62298 -72613 -59627 -23505 -8539 -7831 -76582
18322 -76582 -61051 -52846 -82582 -98648 -98350 -109329 -107205 -109636 -134791 -93952 -75846 -119557 -149850
18309 -149850 -166307 -161980 -142560 -155718 -159209 -144559 -156136 -175823 -237314 -246263 -194153 -203397
18297 -203397 -206247 -197517 -184727 -207371 -247999 -270515 -271411 -251880 -219873 -211151 -175333 -151699
18285 -151699 -133642 -116555 -141082 -145562 -144402 -109250 -95222 -123646 -132998 -145729 -138274 -118313
18273 -118313 -103629 -117812 -154158 -166885 -113140 -98392 -100166 -125861 -140656 -191440 -157664 -124266
18261 -124266 -119076 -144174 -159983 -146378 -116391 -111942 -153869 -166526 -193592 -189740 -188015 -160180
18249 -160180 -159981 -187027 -212565 -235332 -195635 -192008 -180127 -173283 -167968 -175589 -163046 -178348 -195902
18236a95902M239M8473K2120l4021Q636J661N512K9178J9947O358k5199J4243
18224i4755N650j1198m3511P180J2966R138J6827n86l0532m4804J8591L9782K153
18211a13099k859k2259l3077M964J0617M3901K484j1081L105k3712N272l5386
18199a71130p069j697J4504M671J4040K5155R055J1523L3057j8677l6354j6122
18187a39044l0426k437J4625M3779o231j1031J5086k8003K1754R741k8173k5225
18175a65585J8053O7955K2320l3084o088J2419k3894j0252M088j4602J2202J2351
18163a04117j6950j4305M6928J3447J2731O351J4512r582k1300J4324j2596l8361
18151a08918l262M2234P637N583k3363k932K7321M0570M2054j671n8334r127K0912
$$ plain form
18236 -195902 -191663 -143190 -121070 -155091 -146455 -144794 -139282 -110104 -90157 -83799 -108998 -94755
18224 -94755 -89105 -100303 -143814 -136634 -123668 -114530 -97703 -98289 -128821 -173625 -155034 -115252 -113099
18211 -113099 -115958 -138217 -171294 -166330 -155713 -111812 -109328 -120409 -117304 -141016 -135744 -171130
18199 -171130 -178199 -179896 -165392 -160721 -146681 -121526 -112471 -100948 -67891 -86568 -122922 -139044
18187 -139044 -169470 -171907 -157282 -113503 -119734 -130765 -115679 -143682 -121928 -112187 -140360 -165585
18175 -165585 -147532 -79577 -57257 -90341 -96429 -84010 -107904 -118156 -114068 -128670 -116468 -104117
18163 -104117 -121067 -135372 -88444 -74997 -62266 -55915 -41403 -50985 -72285 -57961 -70557 -108918
18151 -108918 -112180 -69946 -62309 -56726 -80089 -83021 -55700 -15130 26924 25253 -33081 -42208 -21296
18138b1296N4990O572O566K738k9128k8452m131L0805J2133k2205M664J5213K1362
18125D9831j2262P48K5424J4174n03L093K2411J1916j6181J4329N874j8492j6236
18112H4126K4488j445K5579K2039K1524j0153j7782J4666j3119L4249K330K0013
18100B06515M7324K6993j5826J545J1740k6694j0228k2262j1109J2917J1780K260
18088B34955r084j7289N8613n248j7142J6660K0373J0156Q586m5112q052R579
18076B56995K8283p957k4557n369J4573P307P305J3879J3653K037J1604r866L0718
18063C38605M8233K5461M3367K2748K4700N7497N6999L6674K4452K4835N8933
18052G62504L4886m78O428O4141P3930M0098K856K1143M6121L1924Q387M4386
$$ plain form
18138 -21296 33694 40266 46832 49570 20442 -8010 -12141 18664 30797 8592 13256 28469 49831
18125 49831 37569 38317 63741 77915 77412 80505 102916 114832 98651 112980 118854 100362 84126
18112 84126 108614 107169 132748 154787 176311 166158 148376 163042 149923 184172 186502 206515
18100 206515 253839 280832 265006 266551 278291 251597 241369 219107 207998 220915 232695 234955
18088 234955 225871 208582 267195 261947 244805 261465 281838 291994 300580 255468 247416 256995
18076 256995 285278 277321 252764 247395 261968 269275 276580 290459 304112 306149 317753 307887 338605
18063 338605 386838 412299 455666 478414 503114 560611 617610 654284 678736 703571 762504
18052 762504 797390 796912 803340 867481 941411 981509 984365 1005508 1051629 1083553 1091940 1136326
18040A136326P1592P1769N6587P3271M3611J5235M9603N5379j8078J4751r939
18029A560107r516n612k6256k1271K3755l0466o2410k3173j8890l4117J5127P720
18017A374998L51Q736P823K8438J6566L5077J7382M0213L3979O7056R6219R2640
18005A819478J40160J47921J48036J78101J32479O5850N5710P0148R6375P5807
17995B930065N8698L0449N1276J06632J28756J32066J68136J74606J87008K01984
17985D169676J93112L06140L79796M09993M80495O21857Q63793J111102J597438
17976A0133402K312676L243399M343640N452607O525895P324649P167697N917546
17968E2421511M358977K943211J541699L30768j86406M42405J367077J745153
$$ plain form
18040 1136326 1207918 1279687 1336274 1409545 1453156 1468391 1517994 1573373 1555295 1570046 1560107
18029 1560107 1550591 1544979 1518723 1497452 1521207 1490741 1428331 1405158 1386268 1352151 1367278 1374998
18017 1374998 1375349 1384085 1391908 1420346 1436912 1471989 1489371 1529584 1563563 1630619 1726838 1819478
18005 1819478 1959638 2107559 2255595 2433696 2566175 2632025 2687735 2757883 2854258 2930065
17995 2930065 2988763 3019212 3070488 3177120 3305876 3437942 3606078 3780684 3967692 4169676
17985 4169676 4362788 4668928 5048724 5458717 5939212 6561069 7424862 8535964 10133402
17976 10133402 12446078 15689477 20033117 25485724 32011619 39336268 46503965 52421511
17968 52421511 56780488 59723699 61265398 61596166 61409760 61852165 63219242 64964395
17960F4964395J267784K35728r78887k358223m004757n348463n702546n378892
17952D2696139m919318m383890l790876l193435k718997k243092j874897j560886
17944A8010748j235927r46224p54586n42591l64493l04235k48033j66938j60273
17935A3287448k62274k93349k83716k67926k05931j24275p3068P5755J84056L56234
17925A2392954O60002J093251J702073K456895L344277M215984N082612N605649
17917C6553697N286508M273563L169356K173493J081709K56491K04195Q95203
17909E3894215J687855J855970J160036R2056r62318k367016l917963n079007
17901D6363828n196784m861572m528180m051194l461740k866387k382710k001385
$$ plain form
17960 64964395 66232179 66467907 65489020 63130797 59126040 53777577 48075031 42696139
17952 42696139 37776821 33392931 29602055 26408620 23689623 21446531 19571634 18010748
17944 18010748 16774821 15828597 15074011 14531420 14166927 13862692 13614659 13447721 13287448
17935 13287448 13025174 12731825 12448109 12180183 11974252 11849977 11776909 11852664 12036720 12392954
17925 12392954 13052956 14146207 15848280 18305175 21649452 25865436 30948048 36553697
17917 36553697 41840205 46113768 49283124 51456617 52538326 52794817 52999012 53894215
17909 53894215 55582070 57438040 58598076 58690132 57727814 55360798 51442835 46363828
17901 46363828 41167044 36305472 31777292 27726098 24264358 21397971 19015261 17013876
17893A7013876j698690j432278j211353j009330q64394p70806o47649n44280n16450
17884H318646m52846l81897l80722l55559l23419k93664k53008k23099k22848
17875E431584k14727k18874j64754j73399j58943j59859j87322j92704j12649
17866C848353j34189j78547j37937j20581p7649j17532j02972q1580n5164j12774
17856B729428j45539q5112k4823r9108r4621r4481m9391k6059l3195q3282q7657
17845A906160o0464k9815l8258q5543p0949m5161q926o1776j08533n0477n8544
17834A287714o9089k9673l7549m7784k8831k4246m1531m1598l6436l3052j9941
17823H77984k8297l2591r262o1257n9082m346m91l4305o521K2354j3877q828m1999
$$ plain form
17893 17013876 15315186 13882908 12671555 11662225 10797831 10027025 9379376 8835096 8318646
17884 8318646 7865800 7483903 7103181 6747622 6424203 6130539 5877531 5654432 5431584
17875 5431584 5216857 4997983 4833229 4659830 4500887 4341028 4153706 3961002 3848353
17866 3848353 3714164 3535617 3397680 3277099 3199450 3081918 2978946 2897366 2842202 2729428
17856 2729428 2583889 2498777 2473954 2374846 2280225 2185744 2136353 2110294 2077099 1993817 1906160
17845 1906160 1845696 1815881 1777623 1692080 1621131 1575970 1567044 1505268 1396735 1346258 1287714
17834 1287714 1218625 1188952 1151403 1103619 1074788 1050542 1009011 967413 930977 897925 877984
17823 877984 849687 817096 807834 746577 687495 683149 682658 648353 641832 664186 650309 641481 599482
17810E99482o4407l028j4912j4336j9024o2959l3698k139j4155k1290l001j6872
17798C29661K0261p09J7714j8840o7922n8135r510o357p956J2442j41k6346r509
17785A74653j483m0940o4837j4886J981J5001Q562k6501n3842k3119K0385k0322
17773b5348m7257l5854P146J2105k6672L223j2049m600M653J3842M7271K2145
17761d1395K1158J6323m3049o1477M395j8787k4301J6827L4687m354J1474K6508
17749f1991N6608Q5019K2632R561j0182l757j2139L9791L6886l1766k7981j6875
17737H5806j1849n1098k4565m8679j6130j8840n636J5140k7114k5921j6043j1797
17725a56726j0119j0841K52j7203K4391J1530M1753N8923L8780J5872L0947N6767
$$ plain form
17810 599482 535075 532047 517135 502799 483775 420816 387118 384979 370824 349534 346533 329661
17798 329661 349922 349213 366927 348087 280165 222030 212520 206163 198207 210649 210508 184162 174653
17785 174653 173170 132230 67393 52507 54488 69489 78051 51550 -2292 -25411 -5026 -25348
17773 -25348 -72605 -108459 -101313 -89208 -115880 -112657 -124706 -129306 -124653 -110811 -63540 -41395
17761 -41395 -20237 -3914 -46963 -108440 -104045 -122832 -147133 -130306 -95619 -99973 -88499 -61991
17749 -61991 -5383 79636 102268 111829 101647 97890 85751 125542 162428 130662 102681 85806
17737 85806 73957 22859 -1706 -50385 -66515 -85355 -90991 -75851 -102965 -128886 -144929 -156726
17725 -156726 -166845 -177686 -177434 -194637 -170246 -158716 -116963 -58040 -19260 -3388 27559 84326
17713H4326L8524j1644k3430m455O721k3478l0183k9224n0875j7015m0506n1841
17701a53080l8833p607J7887j3854j40j0398j6344l1657l3749k0404K6126K6387
17689b55666O760k7875J4946M2289P476n2191j4538L870q295q791q173L9685m449
17676b64952p539L922K5354O007n977K4770K9039k2834l2438j9942K2053N471
17664b37066k9805k0393j43J3884K6725J4143n0133k2886j7725j628O284P55J3128
17651c04860J4623o491k417m2635k8947j3533J7264L3347L0677R865l947M781
17639b92273K6731L4163n744k3624p107j7777k972M931l4114J957P207O975K6221
17626b75426o437j0473l0860j0765J7229L2770k2881Q83J1127J972l70K9263k476
$$ plain form
17713 84326 122850 111206 87776 83321 90042 66564 36381 7157 -43718 -60733 -101239 -153080
17701 -153080 -191913 -199520 -181633 -195487 -195627 -206025 -222369 -254026 -287775 -308179 -282053 -255666
17689 -255666 -248906 -276781 -261835 -219546 -212070 -264261 -278799 -274929 -283224 -292015 -300188 -260503 -264952
17676 -264952 -272491 -268569 -243215 -237208 -243185 -218415 -189376 -212210 -244648 -264590 -242537 -237066
17664 -237066 -266871 -287264 -287407 -273523 -246798 -232655 -282788 -305674 -323399 -325027 -318743 -317988 -304860
17651 -304860 -290237 -296728 -299145 -341780 -370727 -384260 -366996 -333649 -302972 -293107 -297054 -292273
17639 -292273 -265542 -231379 -237123 -260747 -267854 -285631 -288603 -283672 -317786 -315829 -308622 -301647 -275426
17626 -275426 -281863 -292336 -323196 -333961 -316732 -283962 -306843 -305960 -294833 -292861 -293231 -263968 -266444
17613b66444J2670l995j8239l846N402j2507r16j3269m430K4166K80j8439K758
17600b96809L9262J336m3148k8458r96k9N044J7243K010P155l3912p104K8241
17587c10165j5191j7481L014m303M7372Q030m252k5434k7766j1561N314L133k076
17574c51366K8143k232m127l207l2914J816j756P398K3357R850L2663M5367j2270
17561b59278l9296k8373o008K0713n547N889M745k2160j5452R772O2478q09k7393
17548c00719K739j5025n802L2790j2708K5832L174l2458k0285l1367J0236N811
17536c37782k1492M0290J0817K1276O676K405J603K8165p605J375K719P15q994
17523b59832J6758j2731j9676J3407Q081j8840l267j5821j2909j819K1367L7173
$$ plain form
17613 -266444 -253774 -257769 -276008 -279854 -274452 -286959 -287875 -301144 -305574 -281408 -281128 -299567 -296809
17600 -296809 -257547 -256211 -299359 -327817 -328813 -328842 -323798 -306555 -304545 -297390 -331302 -338406 -310165
17587 -310165 -325356 -342837 -339823 -344126 -296754 -288724 -292976 -318410 -346176 -357737 -352423 -349290 -351366
17574 -351366 -323223 -325455 -329582 -332789 -365703 -363887 -365643 -358245 -334888 -325038 -292375 -247008 -259278
17561 -259278 -298574 -326947 -332955 -312242 -317789 -311900 -307155 -329315 -344767 -334995 -272517 -273326 -300719
17548 -300719 -297980 -313005 -318807 -286017 -298725 -272893 -269719 -302177 -322462 -353829 -343593 -337782
17536 -337782 -359274 -318984 -308167 -286891 -280215 -277810 -276207 -248042 -255647 -254272 -251553 -250838 -259832
17523 -259832 -243074 -255805 -275481 -262074 -253993 -272833 -276100 -291921 -304830 -306649 -285282 -248109
17511b48109q697q143p930L0573j3720l4041K747M874J6972k6331K2237L1762
17499b37806j103k9979m882J4887J3520j9681o12L163K2668l857K5560k903l1416
17486b52441M101J0411J4266l694P261n88L1112J5585J645k566j0727K6773M6523
17473a12339K8607N8499L0208L0955L4867N3554M6483L301l9764m3966n852K6190
17461A10743J0444j1237n4320l6626k0568P231k4869j9841k2423k7848M703L589
17449h1022k3103l3482J0002j9877l381J9655L0853j7620j4094J1974k3496j1063
17437a54654J1350L469J8358J5488m2930l4889J7639j7245m0360k7863P016K6143
17425b18478L8156L69N6107L2868q170K4092K9016J3390K792J4705L3976K1812
$$ plain form
17511 -248109 -256806 -264949 -272879 -242306 -256026 -290067 -287320 -282446 -265474 -291805 -269568 -237806
17499 -237806 -238909 -268888 -273770 -258883 -245363 -265044 -265656 -262493 -239825 -243682 -218122 -221025 -252441
17486 -252441 -248340 -237929 -223663 -227357 -220096 -220684 -189572 -173987 -172342 -174908 -185635 -158862 -112339
17473 -112339 -83732 -25233 4975 35930 70797 124351 170834 174135 134371 90405 84553 110743
17461 110743 121187 109950 55630 19004 -1564 5667 -19202 -39043 -61466 -89314 -84611 -81022
17449 -81022 -104125 -137607 -127605 -147482 -150863 -131208 -100355 -117975 -132069 -120095 -143591 -154654
17437 -154654 -143304 -139835 -121477 -105989 -148919 -183808 -166169 -183414 -223774 -251637 -244621 -218478
17425 -218478 -180322 -179953 -123846 -90978 -99148 -75056 -46040 -32650 -29858 -15153 18823 40635
17413D0635o316N803o18Q589K7826J1789l3864l1400l1181j5672k5286j1023q099
17400f8817k0158q429m3846m8176N105q495j0854J0955j0220K255K3026K0794
17388a56860l5877J6744l611K301K4885J2786p884k8422n046m301J2209L0792
17376a42284l2421m5026j6330k0643j5724J3859Q36K4504K6413l0745J9575J9138
17364a98848O4274L2833l9416l7183j5234M869J0746n237j6715q281j4050N545
17352b16697J9374j4379J2542R023L5686l5790K450J6755j5819m8258m8978M2982
17340b41109L6237J209J228K741j1887j3193L6886M7435j646j0437n122l1274
17328a88932k4879L2717J4726q260p525l1888k5203j1583L2463n862j9523j4498
$$ plain form
17413 40635 34319 40122 39504 48093 75919 87708 53844 22444 -8737 -24409 -49695 -60718 -68817
17400 -68817 -88975 -97404 -141250 -189426 -184321 -192816 -203670 -192715 -202935 -200680 -177654 -156860
17388 -156860 -192737 -175993 -179604 -177303 -152418 -139632 -147516 -175938 -180984 -185285 -173076 -142284
17376 -142284 -174705 -219731 -236061 -256704 -272428 -258569 -257733 -233229 -206816 -237561 -217986 -198848
17364 -198848 -134574 -101741 -141157 -178340 -193574 -188705 -177959 -183196 -199911 -208192 -222242 -216697
17352 -216697 -197323 -211702 -199160 -190137 -154451 -190241 -187791 -171036 -186855 -235113 -284091 -241109
17340 -241109 -204872 -203663 -202435 -199694 -211581 -224774 -187888 -140453 -142099 -152536 -157658 -188932
17328 -188932 -213811 -181094 -166368 -174628 -182153 -214041 -239244 -250827 -218364 -224226 -243749 -258247
17316b58247K6526L0817o758n1741J8764J750L500L4701J6933J097l3198K385
17304b13471L293k894J08k340L0090k6961R110j7012L3139L8386k8525l922R38
17291a80061l185R220J5780m7570l0638J4639L623K8399K9102n210k0336j2469
17279a98706j1359j3732k377q279K4022K760J088P959r640k0997j6073L2825M7564
17266a64945k3222k4075m3325j1086J5276Q001L127J1561L1899j0123k7546J0305
17254b24153K1368L3286K6371k2989K8200L833l7384l7948j24J7349k217J6590
17242a77818J3637J7113k4380n3414k9523K6046L2651k7326J5162k2062k9800
17231b59714L3430O3981N159J5386l4300l0537J498N086M37k6606J5445K8473
$$ plain form
17316 -258247 -231721 -200904 -207662 -259403 -240639 -238889 -235389 -200688 -183755 -182658 -215856 -213471
17304 -213471 -210178 -213072 -212964 -215304 -185214 -212175 -203065 -220077 -186938 -148552 -177077 -180999 -180061
17291 -180061 -183246 -174026 -158246 -205816 -236454 -221815 -218192 -189793 -160691 -165901 -186237 -198706
17279 -198706 -210065 -223797 -226174 -234453 -210431 -207671 -206583 -198624 -208264 -229261 -245334 -212509 -164945
17266 -164945 -188167 -212242 -255567 -266653 -251377 -243376 -240249 -228688 -196789 -206912 -234458 -224153
17254 -224153 -202785 -169499 -143128 -166117 -137917 -134084 -171468 -209416 -209540 -192191 -194408 -177818
17242 -177818 -164181 -147068 -171448 -224862 -254385 -228339 -195688 -223014 -207852 -229914 -259714
17231 -259714 -226284 -162303 -157144 -141758 -176058 -206595 -205097 -200011 -199574 -226180 -210735 -182262
17219a82262K7519J4772n161L064j6185q778J1284R040K8539J794n506l8078M242
17206a55716j7942J165K9171J5773j7778j7119q668M01k6525K3573p95o09k3803
17193a98872j2942J021m005J9106J8170o828K2520N755K4782L8036K058n0046
17181a41245k2885Q593j6040m2305K0402J4195L9002K8847l4646m4383K1400R187
17169a59878K048J0835k2019j8551k3072j0987m358M0559M7023J9518j9683r794
17157a48359R228l337k1353K0160Q644R118M822l6659K551K6903j5613l6417l5643
17144b15955L1158N0464K8853j6768p7905o1168J0185M7487L908j3367Q378N374
17132a99356L0574R222l9154m423J5047p933p438L4709R861J065Q48o194P975
$$ plain form
17219 -182262 -154743 -139971 -145132 -142068 -158253 -167031 -155747 -146707 -118168 -116374 -121880 -159958 -155716
17206 -155716 -173658 -172493 -143322 -127549 -145327 -162446 -171114 -170713 -197238 -173665 -174460 -175069 -198872
17193 -198872 -211814 -210793 -214798 -195692 -177522 -184350 -161830 -156075 -131293 -93257 -91199 -141245
17181 -141245 -164130 -155537 -171577 -213882 -193480 -179285 -140283 -111436 -146082 -190465 -169065 -159878
17169 -159878 -157830 -146995 -169014 -187565 -210637 -221624 -225982 -185423 -138400 -118882 -138565 -148359
17157 -148359 -139131 -142468 -163821 -143661 -135017 -125899 -121077 -157736 -155185 -128282 -143895 -180312 -215955
17144 -215955 -184797 -134333 -105480 -122248 -200153 -261321 -251136 -203649 -199741 -213108 -204730 -199356
17132 -199356 -168782 -159560 -198714 -203137 -188090 -196023 -203461 -168752 -158891 -157826 -156978 -163172 -155197
17119a55197n556j5310j898j6588r22R292j7040K6681J5481M9155o173m5483Q442
17106a55116j5786k5614Q941P33K1163o864j2126N377J348K4442K1936q959L4211
17093a06314L3437k7408k3614J0881P505j0179j7733l4842O878L4950j0502k9658
17081a66599j7885J6648J9042k0198j5849L1368M6536j3973m4003l0437K0912
17070a74438J4785L9798l2803k9184K1464K9419p063k2234o458o019K6123l8630
17058a85240J050J2599r263L7521k281j8367M105J7126j2282j5876K2888L5882
17046a12138J8783j0243K984l2113o5458j7812M7971J6819m521L8030r797k2473
17034a49968k7559k5837j3968K2732L3438K7516K7378k1589k1766L024k8085j6882
$$ plain form
17119 -155197 -160753 -176063 -177961 -194549 -195471 -186179 -203219 -176538 -161057 -111902 -118075 -163558 -155116
17106 -155116 -170902 -196516 -187575 -186842 -165679 -172543 -184669 -179292 -177944 -153502 -131566 -140525 -106314
17093 -106314 -72877 -100285 -123899 -113018 -105513 -115692 -133425 -168267 -161389 -126439 -136941 -166599
17081 -166599 -184484 -167836 -148794 -168992 -184841 -153473 -106937 -120910 -164913 -195350 -174438
17070 -174438 -159653 -119855 -152658 -181842 -160378 -130959 -138022 -160256 -166714 -172733 -146610 -185240
17058 -185240 -184190 -171591 -180854 -143333 -145614 -163981 -159876 -142750 -155032 -170908 -148020 -112138
17046 -112138 -93355 -103598 -100614 -132727 -198185 -215997 -168026 -151207 -155728 -117698 -127495 -149968
17034 -149968 -177527 -203364 -217332 -194600 -161162 -133646 -106268 -127857 -149623 -146599 -174684 -191566
17022a91566K0484J7235j7795Q420J413k4647L2339n678M601K0936l1844j9688
17010a85790O993L0219J7811j1125O952J84J0213k5571N700K2856q54l004j8706
16997a44122K4380O976O75j050m2128l4245K2718O488j9495Q435K922k6184K9318
16984a65312N60R490O805M198k996n807K3974j8066L6940J8683j7736m933N414
16971a08786P191J0710J1692k155k6087j3986J2013J3333P413k0139p250p530
16959a23581j1222m086k457J6889J8221N7351J647n4305j8794K8437L8038J4359
16947c9503k8616j3600J7036J2839k858k3090J0520n0617l3168j622L7263N001
16935a10415l7570r146M695J5720o689l3669r252n775R292O0842J8583k5492J0914
$$ plain form
17022 -191566 -171082 -153847 -171642 -163222 -161809 -186456 -154117 -159795 -155194 -134258 -166102 -185790
17010 -185790 -178797 -148578 -130767 -141892 -134940 -134756 -124543 -150114 -144414 -121558 -122412 -125416 -144122
16997 -144122 -119742 -112766 -112091 -113141 -155269 -189514 -166796 -160308 -179803 -171368 -168446 -194630 -165312
16984 -165312 -164752 -155262 -148457 -144259 -147255 -153062 -129088 -147154 -110214 -91531 -109267 -114200 -108786
16971 -108786 -101595 -90885 -79193 -81348 -107435 -121421 -109408 -96075 -88662 -108801 -116051 -123581
16959 -123581 -134803 -138889 -141346 -124457 -106236 -48885 -47238 -101543 -120337 -91900 -53862 -39503
16947 -39503 -68119 -81719 -64683 -51844 -54702 -77792 -67272 -117889 -151057 -152679 -115416 -110415
16935 -110415 -147985 -157131 -152436 -136716 -143405 -177074 -186326 -192101 -182809 -121967 -103384 -128876 -117962
16922a17962O4902k377n8283m9121j6669N6172K0271nK713J4212j3842l5599k8882
16909a64470L2606J2476P352L0134J5801J3627j2878m7303J094J270J6665p547
16897a01173M603l8626l0059j2884m05M1282L3109j6214J3616Q402r176L2822
16885g4703M5201Q740j1661j4265j2968K929K345l416j1924J4959N2414k0967
16873b3316j6721j9360l5950k6390Q999J7634K1353j6055J1403p526l2992o909
16861a25830j247J3632R799j5045R404K7127q41K2409J9237m4977L3328J7083
16849c5921j6837o157l1452L083K7027j0538L954p844k0338L7514L5502k3454
16837d5461l3144j9301j2078j101k3259j4004M8212J8228m910m5879j6426M697
$$ plain form
16922 -117962 -53060 -55437 -113720 -162841 -179510 -123338 -103067 -103072 -100359 -86147 -99989 -135588 -164470
16909 -164470 -131864 -119388 -112036 -81902 -66101 -52474 -65352 -112655 -111561 -110291 -93626 -101173
16897 -101173 -96570 -135196 -165255 -178139 -178544 -137262 -104153 -120367 -106751 -98349 -107525 -74703
16885 -74703 -29502 -20762 -32423 -46688 -59656 -56727 -54382 -57798 -69722 -54763 -2349 -23316
16873 -23316 -40037 -59397 -95347 -121737 -112738 -95104 -73751 -89806 -78403 -85929 -118921 -125830
16861 -125830 -127077 -113445 -103646 -118691 -109287 -82160 -83001 -60592 -41355 -86332 -53004 -35921
16849 -35921 -52758 -58915 -90367 -87284 -60257 -70795 -66841 -74685 -95023 -57509 -22007 -45461
16837 -45461 -78605 -97906 -109984 -111085 -134344 -148348 -100136 -81908 -86818 -132697 -149123 -144426
16825a44426j5520k1975J8591J7564O288M2640J9903N3525J3523k1106k8225n3679
16813a12897m760N448O15L3171j3274N449j0216p398J0807M4833K6803q433n1515
16800h1367l1522m431J8780J0344J6364K0869m3838p1044j7264O3820N7322Q233
16788e3734p438l7412k4790k5138j5973Q46J1471R123K2119M2436J3402j0558
16776g5646j5148k9382Q191K3884Q027L6601J5864l4717K1138j8921n34K1437
16764c9206k0288l3918o1121j5799M8041N138J1458j0057L1543O732l992M714
16752g6755j7958k340K4419O198K9343q212j2521J8104k0478m5850P881J2003
16740h6166j9286K4478L5210R783j9854j2430j0094l2309j9409K0575j618o398
$$ plain form
16825 -144426 -159946 -181921 -163330 -145766 -139478 -96838 -76935 -23410 -9887 -30993 -59218 -112897
16813 -112897 -117657 -112209 -111594 -78423 -91697 -86248 -96464 -103862 -93055 -48222 -21419 -29852 -81367
16800 -81367 -112889 -117320 -98540 -88196 -71832 -50963 -94801 -165845 -183109 -119289 -61967 -53734
16788 -53734 -61172 -98584 -123374 -148512 -164485 -163639 -152168 -143045 -120926 -78490 -65088 -75646
16776 -75646 -90794 -120176 -111985 -88101 -80074 -43473 -27609 -62326 -41188 -60109 -60643 -39206
16764 -39206 -59494 -93412 -154533 -170332 -122291 -117153 -105695 -115752 -84209 -77477 -81469 -76755
16752 -76755 -94713 -97053 -72634 -66436 -37093 -45305 -57826 -39722 -60200 -106050 -98169 -86166
16740 -86166 -105452 -80974 -45764 -35981 -55835 -68265 -78359 -110668 -130077 -109502 -111120 -117518
16728a17518p395M1353K3103k2492J944K7138K6151J1922n0550l1241j9362K9046
16716h7901L1721p474l395J5890j5075n5446J198M4072M566k7959k3765k66J5861
16703a07973L0640J6829L2218J7286q85m8124j3065M865j1668K2788K3603k9178
16691f2664L854K655q869J1094m095J7536J7532j9680l5364m0940K047J4681J0448
16678i1765K3551K2840M69J0312K4436J5647L0579k0093j9310k6009O162J4606
16666h575L8745J3991j208m4962k487J2219j5650l7637j3442j0987j7741J9199
16654f8535M916l5207r67M7747l134k2756j2295j6135J2675J0388K4094J4870
16642d4339L8264Q091l3217J6630L895l0300K3706o621q310J464J9828j6003J722
$$ plain form
16728 -117518 -124913 -83560 -60457 -82949 -81005 -53867 -27716 -15794 -66344 -97585 -116947 -87901
16716 -87901 -56180 -63654 -67049 -51159 -66234 -121680 -120482 -76410 -71844 -99803 -123568 -123834 -107973
16703 -107973 -77333 -60504 -28286 -11000 -11885 -60009 -73074 -68209 -79877 -57089 -33486 -62664
16691 -62664 -58810 -56155 -65024 -53930 -58025 -40489 -22957 -42637 -78001 -118941 -116894 -102213 -91765
16678 -91765 -68214 -45374 -44905 -34593 -10157 5490 36069 15976 -3334 -29343 -23181 -8575
16666 -8575 30170 44161 42953 -2009 -4496 7723 -7927 -45564 -59006 -69993 -87734 -68535
16654 -68535 -63619 -98826 -99793 -52046 -55180 -77936 -90231 -106366 -93691 -83303 -59209 -44339
16642 -44339 -6075 2016 -31201 -14571 -10676 -40976 -17270 -23891 -32201 -30737 -10909 -26912 -25190
16629b5190K5560k2129l786J0716N652K2698q958j5093P247o973k0750l98N36
16616c0868l5671J4948l900j0762l542J9817k8185n463M4937j1414k5132K4693
16604e0542K1800p985k2256K5738L5686l1969l7582q58q293K0724Q370j8157r710
16591g5034n246L514L1606l6949k8831l421j5840j0362M8851N3864N1401j2891
16579F62o5205k0615N824q69Q156k3393L7860J5472K5384J0094o9247j8886L2136
16566f2627K3247J0838J407k397j5544n9658p652J6165J0082J4378r239j5635
16554i6635N0806M9476n8149j6559J0020M0847K0403l3377o3999k7206J613J9969
16542a02791K1633j200P424j9755j8449K5357J7691K6928K87l1211k8836k1055
$$ plain form
16629 -25190 370 -21759 -25545 -14829 -9177 13521 4563 -10530 -3283 -10256 -31006 -31404 -30868
16616 -30868 -66539 -51591 -55491 -66253 -69795 -49978 -78163 -83626 -38689 -50103 -75235 -50542
16604 -50542 -28742 -36727 -58983 -33245 2441 -29528 -67110 -67968 -76261 -55537 -47167 -65324 -75034
16591 -75034 -80280 -76766 -45160 -82109 -110940 -114361 -130201 -140563 -91712 -37848 13553 662
16579 662 -64543 -85158 -79334 -80203 -72047 -95440 -57580 -42108 -16724 -6630 -75877 -94763 -62627
16566 -62627 -39380 -28542 -27135 -29532 -45076 -104734 -112386 -96221 -86139 -71761 -81000 -96635
16554 -96635 -45829 3647 -54502 -71061 -61041 -20194 209 -33168 -97167 -124373 -122760 -102791
16542 -102791 -81158 -82358 -74934 -94689 -113138 -87781 -70090 -43162 -42875 -74086 -102922 -123977
16530a23977j0443k0368j978M1793L1814J5472k5663J367K1643l1385j7889J9425
16518a00189M287J6492O7264Q462R483J5117O276j5973l0962k3570j6133K099
16506e7347K3975j1275J299K345l442l957k0755N379J0627j1557J6378K6153O431
16493a5746J5K3755l7826m2024m2111K1708m080j704K679j0854J9865r77j7678
16480a04978k3384p895J0218j743j0269J3258M9437n931j0720K3726R847J115
16468e7319q161k5680k3655j2217N749L7872J4904j2622k1617n631L3252K6316
16456d8809r083J0215M3010K823j1832k0285Q203l129k6128k4672L1014J5289
16444c3384j0779K535m82p270j3988L5466P389q194K1571j4658k7229l0789j9006
$$ plain form
16530 -123977 -134420 -154788 -156766 -114973 -83159 -67687 -93350 -91983 -70340 -101725 -119614 -100189
16518 -100189 -95902 -79410 -12146 -3684 5799 20916 27192 11219 -19743 -43313 -59446 -57347
16506 -57347 -33372 -44647 -43348 -41003 -44445 -48402 -69157 -63778 -53151 -64708 -48330 -22177 -15746
16493 -15746 -15731 8024 -29802 -71826 -113937 -92229 -96309 -98013 -95334 -106188 -86323 -87300 -104978
16480 -104978 -128362 -136257 -126039 -127782 -138051 -124793 -75356 -81287 -92007 -68281 -58434 -57319
16468 -57319 -65480 -91160 -114815 -127032 -121283 -83411 -68507 -81129 -102746 -108377 -75125 -48809
16456 -48809 -57892 -47677 -4667 -1844 -13676 -33961 -25758 -28887 -55015 -79687 -48673 -33384
16444 -33384 -44163 -41628 -42110 -49380 -63368 -27902 -20513 -28707 -7136 -21794 -49023 -79812 -98818
16431i8818K0707J2357M9599K6583k4559j7061J2531L9845o712m4268j6504o166
16419e2466r719L5361K022j6945p002j2477J1871N676P415J769j7335k437O65
16406e3602Q613K7375J0668j5888q684J1996l1561P791l0925m667K9003K4504
16394b5377K4145Q507o91j7075k549l2276k5139J0466J6704j1244Q777k899k1057
16381f9708j3284m225J1702O333l7069k6490J6671N1218L2800J188j6645L76P882
16368c9251P36k2451J220J5919J5802K9721j6544O899k7438o064j0876N418j8737
16355f5646L0083J4879p885J7888k1112l428J7755L7516l6131r060L4200l493
16343E566O056q837j409k3465k9138k2376k6651L7065o63k251K2982J5468J6290
$$ plain form
16431 -98818 -78111 -65754 -16155 10428 -14131 -31192 -18661 21184 14472 -29796 -46300 -52466
16419 -52466 -62185 -26824 -24802 -41747 -48749 -61226 -49355 -43679 -36264 -34495 -51830 -54267 -53602
16406 -53602 -44989 -17614 -6946 -22834 -31518 -19522 -51083 -43292 -74217 -78884 -49881 -25377
16394 -25377 -1232 7275 6584 -10491 -13040 -45316 -70455 -59989 -43285 -54529 -45752 -48651 -69708
16381 -69708 -82992 -87217 -75515 -69182 -106251 -132741 -116070 -64852 -32052 -30864 -47509 -47133 -39251
16368 -39251 -38515 -60966 -59746 -43827 -28025 1696 -14848 -7949 -35387 -41451 -52327 -46909 -65646
16355 -65646 -35563 -20684 -28569 -10681 -31793 -35221 -17466 20050 -16081 -25141 9059 5566
16343 5566 11622 2785 1376 -22089 -51227 -73603 -100254 -63189 -63852 -66103 -43121 -27653 -11363
16330a1363m2128l9801k309L9614N1800l3079K1792L5199k4373p772j1389k3830
16318d7639J5353J3173o17j3003n648J0545K635l1725n512K9330P978j2681l1175
16305f8986N407L333M031K385m595O676k1623j891j5595k7198l3905j4711k689
16292a69361M3090L2875O239J5874P870M4444L8968k2978l7470K0138K2465O358
16280H512j2758J7349q818l1614k8635O297n63J6517o863p740L8075L085j2386
16267a9542L049K2965j3693m754j9498k0905K565R018K5929k4139k1214J7715
16255d2504J4508o312L0284j0993j835Q38j3174M2391K2319R57M174k1305P94
16242B0142N174j7343O13J405j3522j8015r169l3775k9193n002L9771J5195r227
$$ plain form
16330 -11363 -53491 -93292 -95601 -55987 -4187 -37266 -15474 19725 -4648 -12420 -23809 -47639
16318 -47639 -32286 -19113 -19730 -32733 -38381 -27836 -25201 -56926 -62438 -33108 -25130 -37811 -68986
16305 -68986 -63579 -60246 -56215 -53830 -58425 -51749 -73372 -75263 -90858 -118056 -151961 -166672 -169361
16292 -169361 -126271 -93396 -87157 -71283 -63413 -18969 19999 -2979 -40449 -20311 2154 8512
16280 8512 -4246 13103 4285 -27329 -55964 -49667 -50230 -33713 -40576 -48316 -10241 -7156 -19542
16267 -19542 -16493 6472 -7221 -11975 -31473 -52378 -49813 -40795 -14866 -39005 -60219 -42504
16255 -42504 -27996 -34308 -4024 -15017 -16852 -16014 -29188 13203 35522 36479 40653 19348 20142
16242 20142 25316 7973 8586 9991 -3531 -21546 -30715 -64490 -93683 -98685 -58914 -43719 -52946
16229e2946k019K5822o056K9581K7109j1661l1584n6138l2485L319L4634Q478
16217f3946J0865j8099k395R787k878L384L901L1603L1366P098n8121k5676K1487
16204e1624L4016K6497j5803J9063P059j5732J433m4940j7792j0653J2648K9365
16192b6463P905j3353j7859l005L4915J5221k0568m0121p997K3609m456J4636
16180c7536L8728N8093l5290j5555J4375r878L5745m0339j3621L7765j4224l1273
16168a3010J1887l2188j5217Q433M7909J1417k8389K1586K7091M0151N239M844
16156H9753l9350j8532K084l0691j1453l370J8396M0218K0118k9224m974J5994
16144D8969l6722m6927o257L2127K5756p755j9656k2212J6606K209P181j976j5016
$$ plain form
16229 -52946 -54965 -29143 -35199 -5618 21491 9830 -21754 -77892 -110377 -107058 -72424 -63946
16217 -63946 -53081 -71180 -73575 -63788 -66666 -63282 -59381 -27778 3588 10686 -47435 -73111 -51624
16204 -51624 -17608 8889 -6914 12149 19208 3476 4909 -40031 -57823 -68476 -55828 -26463
16192 -26463 -18558 -31911 -49770 -52775 -17860 -2639 -23207 -63328 -71325 -47716 -52172 -37536
16180 -37536 1192 59285 23995 8440 22815 12937 48682 8343 -5278 32487 18263 -13010
16168 -13010 -1123 -33311 -48528 -40095 7814 19231 -9158 12428 39519 79670 84909 89753
16156 89753 50403 31871 33955 3264 -8189 -11559 6837 47055 67173 37949 32975 48969
16144 48969 12247 -34680 -40937 -8810 16946 9191 -10465 -32677 -16071 -13862 -6681 -8657 -23673
16131b3673P954l439K0178J1400N069M322N737N474m4531k4699J7705q221J0779
16118a5945k8396k3085J4130K7834L988L072L6312L9436k4118M83K4007j2063
16106D5655N172j2104r777l90k0k5404K0811k500k2871m0212K0064K5841K0457
16093B4722j6620j1350k9531j2485R844K2258N1721j8794l4926Q378J6931K4163
16081C4311L0845L1857o50o3368j5494q272p592J9248k2507n287N418j7129j643
16068b0263J9332J4462K0014j2694q904J50k541k183j1741j9989J5896L3613L0991
16055E6143j9797q101M029m3677l4637J3963M1922M0594j5927q893J3596K3911
16043F3126j0294l0104K9824K3953K0470j5304k5668N494k2641p15J4717p496
$$ plain form
16131 -23673 -15719 -19158 1020 12420 17489 21811 27548 33022 -11509 -36208 -18503 -26724 -15945
16118 -15945 -44341 -67426 -53296 -25462 -21474 -18402 17910 57346 33228 33711 57718 45655
16106 45655 50827 38723 28946 28556 28536 3132 23943 21443 -1428 -41640 -21576 4265 24722
16093 24722 8102 -3248 -32779 -45264 -35420 -13162 38559 19765 -15161 -6783 10148 34311
16081 34311 65156 97013 96363 32995 17501 9229 1637 20885 -1622 -6909 -1491 -18620 -20263
16068 -20263 -931 13531 33545 20851 11947 12097 9556 7373 -4368 -24357 -8461 25152 56143
16055 56143 36346 28245 32274 -11403 -46040 -32077 9845 50439 34512 25619 39215 63126
16043 63126 52832 22728 52552 76505 96975 81671 56003 61497 38856 38141 52858 45362
16031D5362q410O673m215k6184M824j2544j6729Q800J7573J237P545m514j7951
16018A467m512K8443J908N537j644p463j2846J2825K0414J4827l4296j3780k213
16005H667l5319K5223L0116p439N388j91l1075N746N6846M476O658R542p039o866
15991F4733l721l4980k1578k7290N237q468J7455M4947L2700K888m979k0739k3113
15978B3092o607r843k3078L8030J4045k8732R894j80L0447j3042k7409j2920M004
15965b299J7612n304k3243o627K296L934R151o470K1922M0480k889J5080j5625
15952D8018j4109l618K3565p978k4798j6082J2405Q772J5203J5592K844J5836
15940G5650j326j731j0116k3158N296o438j7284R058j8977j9156j4657L3837j290
$$ plain form
16031 45362 36952 43625 39410 13226 18050 5506 -11223 -2423 15150 16387 23932 19418 1467
16018 1467 -3045 25398 27306 32843 31199 23736 10890 23715 44129 58956 24660 10880 8667
16005 8667 -26652 -1429 28687 21248 26636 26445 -4630 1116 57962 62438 69096 78638 71599 64733
15991 64733 61012 26032 4454 -22836 -17599 -26067 -8612 36335 69035 71923 66944 46205 23092
15978 23092 16485 6642 -16436 21594 35639 6907 16801 16621 47068 34026 6617 -6303 -2299
15965 -2299 15313 10009 -13234 -19861 -17565 -13631 -4480 -10950 10972 51452 48563 63643 48018
15952 48018 33909 30291 53856 45878 21080 4998 17403 26175 41378 56970 59814 75650
15940 75650 74324 72593 62477 39319 44615 38177 20893 29951 10974 -8182 -22839 10998 9708
15927I708r53n925l277O818K9761J5339j1530k2199l125k4925j3810q808L8798
15914E872K5255k400J1284M432k7518j3853J6668K3983N221k6788R985J967l0977
15901C131J130N717k807Q763J1443p928k3970J7945j6815R278N88J8601J0649
15888C5725L1775J1299J2576j1075o04J5345j2080K1105J1090m245n971j7063
15876H7877K1375J414P123l9059K757N464R912p637R563M9388k4867k7932p202
15863H8176K2581j0607j2286K0600J262k8936m5187R38M885l988m209J0739K0374
15850F4342L5017J7094j8365l9062J1461J3923L4858J2316P365L005n3668J1213
15838I9499Q762l0758J3927n530l0162J811K2037J3504R699P070o299j7096k1057
$$ plain form
15927 9708 8755 2830 -447 6371 36132 51471 39941 17742 14617 -10308 -24118 -32926 5872
15914 5872 31127 28727 40011 44443 16925 3072 19740 43723 48944 22156 32141 34108 3131
15901 3131 4261 9978 7171 15934 27377 19449 -4521 13424 -3391 5887 6475 25076 35725
15888 35725 67500 78799 91375 80300 79696 95041 82961 104066 115156 110911 104940 87877
15876 87877 109252 110666 117789 78730 81487 86951 96863 89226 98789 148177 123310 95378 88176
15863 88176 110757 100150 87864 108464 109726 80790 35603 36541 41426 37438 33229 43968 64342
15850 64342 99359 116453 98088 59026 70487 84410 119268 131584 138949 141954 88286 99499
15838 99499 108261 77503 91430 85900 55738 57549 79586 93090 102789 109859 103560 86464 65407
15825F5407j3213l907J6576j346L7536j550j4825K251N720M9991M2239J365m9574
15812A36670l3633K0146O698j4849J6999k993j0216j2093O196n602M0533L4035
15800A81891j4902j4781m3925p2477r055J6711K7940R369L6590K3588J1015p599
15788A44365N622j1635k2527J007j2058p43M202J334q736J8401K7562L530J525
15775A51849j3645j0594J0472J4323n26n765o683j4340j3676l273j095M657m5812
15762F5892m7601O75J8119o03L0517J2180J4744K6183K062N989j5826l325J1920
15749A20926k7276J021M81j6711l7561k1690J0828L165K9185J5077j6104N879
15737F7220K0877m9572m1124J8712K6453L7119L1989m020j0506m9294n0064j3414
$$ plain form
15825 65407 52194 48287 64863 63517 101053 99503 84678 86929 92649 142640 184879 186244 136670
15812 136670 103037 123183 129881 115032 132031 129038 118822 106729 112925 107323 147856 181891
15800 181891 166989 152208 108283 35806 26751 43462 71402 80771 117361 140949 151964 144365
15788 144365 149987 138352 115825 116832 104774 104031 108233 109567 100831 119232 146794 150324 151849
15775 151849 138204 127610 138082 152405 151879 146114 139431 125091 111415 108142 107047 111704 65892
15762 65892 18291 18966 37085 36482 66999 79179 93923 120106 122168 128157 112331 109006 120926
15749 120926 93650 94671 95152 78441 40880 19190 30018 33183 62368 77445 61341 67220
15737 67220 88097 38525 -2599 16113 42566 79685 111674 107654 97148 47854 -2210 -15624
15725a5624K5758M6739R696K2502j2060l1626N77j7197k3398j1815N0622M714
15713D8888j3360l411M085L3184j0987K6259m355m4624j2419m326J0409K5465
15701E4808P92r481L002J1819K6382L780j9175j6605j86m9522o9966O995L3187
15688b4170J727L945L3229K3104J1821l9726J5987L462p461L5561J8187O953j1289
15675G1330J5312r5n5242k5480J5646K8630N0065j0583j9435J1940M0497l531
15663A19054n3485j6759Q400j7890K0461M3435l909m7329m3628j0295L9055L9904
15651G7014O917j054M9305j6763j9689P863J746k5158k1209K9357N2798n773p317
15638A28037K065j4073j0717j3208J0080J1473k2513p094K1702K13L3918J8670
$$ plain form
15725 -15624 10134 56873 66569 89071 77011 45385 45962 28765 5367 -6448 44174 48888
15713 48888 35528 32117 36202 69386 58399 84658 80303 35679 23260 18934 29343 54808
15701 54808 55600 46119 49121 60940 87322 91102 71927 55322 55136 5614 -64352 -57357 -24170
15688 -24170 -22443 -18498 14731 37835 49656 9930 25917 29379 21918 57479 75666 82619 71330
15675 71330 86642 86547 31305 5825 21471 50101 100166 89583 70148 82088 122585 119054
15663 119054 65569 48810 57210 39320 59781 103216 99307 51978 8350 -1945 37110 77014
15651 77014 83931 82877 132182 115419 95730 103593 105339 80181 58972 88329 141127 135354 128037
15638 128037 130102 116029 105312 92104 102184 113657 91144 84050 105752 105965 139883 158553
15626A58553q135r740k0281J8874q388k1274K3212L1547Q649P971J5159l7872
15614A58275n1059j7309L0108N267l1008q45K0986K2712l4816O557P479R986l4475
15601I1858j5976J743q225K5435j1976M599J3661l492K6741l6686l4066J4443
15589F8059J4833K5729K0657k7611l0760j4194j0129J5247J3182L0472m413j6046
15577H5026j9175R339J7388R645L7281O085P276j6964P76l1217j8035K0763J4226
15564A22414J4723k2399j8801j0261R795O360J4554l1709o3369M991J6041K7611
15552F9950M344L4936K407j3734L3642j3114j405q269O24J9300j6986j9300m1535
15539E0860J3378R864J7615j3728N063k7607N229K0018L2871K1268K9122k7187
$$ plain form
15626 158553 150418 140678 120397 139271 130883 109609 132821 164368 173017 180988 196147 158275
15614 158275 107216 89907 120015 125282 94274 93429 114415 137127 102311 108868 116347 126333 91858
15601 91858 75882 77625 69400 94835 82859 87458 101119 97627 124368 87682 53616 68059
15589 68059 82892 108621 129278 101667 70907 56713 46584 61831 75013 105485 101072 85026
15577 85026 65851 75190 92578 102223 139504 145589 152865 135901 136677 105460 87425 108188 122414
15564 122414 137137 114738 95937 85676 95471 101831 116385 84676 21307 26298 42339 69950
15552 69950 74294 109230 111637 97903 131545 118431 117026 108757 109381 128681 111695 92395 50860
15539 50860 64238 74102 91717 77989 83052 55445 60674 80692 113563 134831 163953 136766
15527A36766o2775j8620Q266n777L810K85k1891k7196n055K7237m260K9106L5295
15514I5191L011J5701R304k6676k9142p339k0142k6193M4536Q234j918k1125k6266
15501A7176L1342R885j2366K917K0872J1241j4970p622j4574Q2L9793P124n623
15488H5277J7927o961j1207J7902p081M3498L1233k4163J5415K929j3068m0045
15476A11656K6408R907k6862l9359K6310N3665N008P529J4724k4481k7577L3925
15464A70853L3900M2389N1887K7505J7283N1473M7623O7132J2919l3795k3779
15453D65390l4719n8387j8515l791Q954j8618K8419J4257l2274J002L4955L2302
15441D18975r012n9128k8890J4310j9598q126n416j4530l0088n4172l8942n112
$$ plain form
15527 136766 73991 55371 63637 57860 61670 61955 40064 12868 7813 35050 30790 59896 95191
15514 95191 98202 113903 123207 96531 67389 60050 39908 13715 58251 66485 64567 43442 17176
15501 17176 48518 58403 46037 48954 69826 81067 66097 58475 43901 43983 83776 90900 85277
15488 85277 103204 96243 85036 102938 95857 139355 170588 146425 161840 164769 151701 111656
15476 111656 138064 147971 121109 81750 108060 161725 166733 174262 188986 164505 136928 170853
15464 170853 204753 247142 299029 326534 343817 395290 442913 510045 522964 489169 465390
15453 465390 430671 372284 353769 349978 358932 340314 368733 382990 350716 351718 386673 418975
15441 418975 409963 350835 321945 336255 316657 308531 303115 288585 258497 204325 165383 160271
15429A60271j4876J4033K8900k066L3122M2757r499l6243k7275J1049j6909j8929
15417A64335l1422l0222o409o833l292J6308J8051p152k3051P048k8188j7015
15405E2158L9495M2224l9749k4277M3671L6061l1581j0255k3405J514J0276l279
15393I2853J2307l5133N764L6652R040p577k9718j8918J0240j7160j2841K3643
15381F9152J1841k0987M6093j4760l4856J1658l0485j8046j1801R474K906M5009
15369F5198R977Q370k1160R089J2494k070k1786j7210O935M6396l357l9874K5234
15356G8236J4606J1840M68j9756l1661m312l880L4503K695k3003j1958K8055L3186
15343A09019M0048m899o0068k3498j6045j9529O875R739K730R825J1071J226J9670
$$ plain form
15429 160271 145395 159428 188328 186262 219384 262141 252642 216399 189124 200173 183264 164335
15417 164335 132913 102691 96282 89449 86157 102465 120516 113364 90313 97361 69173 52158
15405 52158 91653 133877 94128 69851 113522 149583 118002 107747 84342 85856 96132 92853
15393 92853 105160 70027 75791 112443 121483 113906 84188 65270 75510 58350 45509 69152
15381 69152 80993 60006 106099 91339 56483 68141 37656 19610 7809 17283 20189 65198
15369 65198 75175 83545 62385 71474 83968 81898 60112 42902 49837 96233 92876 53002 78236
15356 78236 92842 104682 105150 85394 53733 49421 45541 80044 82739 59736 47778 75833 109019
15343 109019 149067 144168 84100 60602 44557 25028 31903 41642 44372 54197 65268 66494 86164
15330H6164O778j4707J3294K3101l2648P08M2044l7326j6298K1794J9863K5703
15318A38470K1071l8673k6717K069j3322J6580J8082k6164j2297K376L5413M5137
15306A62025K7290k5387m3960m350o659J7167L955l0521J5026J8134n1453k35
15294H1032L4123O092K3732K4370k7626k1810j1184j6524M8283J502j7559k4038
15282A00393L2912M2426J4580n700K249q379l3690R255k0187l2053k3111J165
15270G9860N5395l5257m4366l093J1596K7846n851J30q30m2860L623k912L2883
15257G6164j5277K3729K8139J965k2411k614m1405j8055K0471J9190n355J8784
15245H3325n486K4139L927j8304n491J4333m750J3210k346q657o293J1267j9397
$$ plain form
15330 86164 92942 78235 91529 114630 81982 82690 124734 87408 71110 92904 112767 138470
15318 138470 159541 120868 94151 96220 82898 99478 117560 91396 79099 81475 116888 162025
15306 162025 189315 163928 119968 115618 108959 126126 130081 99560 114586 132720 81267 81032
15294 81032 115155 121247 144979 169349 141723 119913 108729 92205 140488 141990 124431 100393
15282 100393 133305 175731 190311 184611 186860 178481 144791 154046 133859 101806 78695 79860
15270 79860 135255 99998 55632 52539 64135 91981 86130 86260 85430 42570 46193 43281 76164
15257 76164 60887 84616 112755 114720 92309 89695 48290 30235 50706 69896 64541 83325
15245 83325 77839 101978 105905 87601 82110 96443 91693 104903 102557 93900 87607 98874 79477
15232G9477m5165k5095J8764L9723O0071j4963l9217l5174K542J8037K3319J89
15220H2508J4640o021j3664p189p046L1435R591K9222j3499K0063k114j0698J1449
15207A38677M938k1419k9042o695q888K7553J2030j9996k8303m7144K6675L3651
15195H2037j526k3192m044k0764N469J4663K9704j3126k5280K2585J7535n187
15183G8874m8985l0450J0053J5788O317O700J788J2377L455K8206J2742o1856
15171C5009q961q042K9172O700m87R439l946j6966m851j6714j0766l44L3416K3011
15157F5670M5187J1714R497k6222l0291K9309o698j8808m53K3385J8725k9319
15145I1696l4332M994l0686k5640k1710Q108R903M0458n13M962j3072J2814l3394
$$ plain form
15232 79477 34312 9217 27981 67704 127775 112812 73595 38421 40963 59000 82319 82508
15220 82508 97148 91127 77463 70274 63228 94663 104254 133476 119977 140040 137926 127228 138677
15207 138677 143615 122196 93154 86459 77571 105124 117154 97158 68855 21711 48386 82037
15195 82037 80511 57319 53275 32511 37980 52643 82347 69221 43941 66526 84061 78874
15183 78874 29889 -561 9492 25280 31597 38297 40085 52462 55917 84123 96865 35009
15171 35009 26048 18006 47178 53878 53391 62830 58884 41918 37067 20353 9587 9243 42659 65670
15157 65670 110857 122571 132068 105846 75555 104864 98166 79358 78905 102290 121015 91696
15145 91696 57364 62358 31672 6032 -15678 -7570 2333 42791 42278 47240 34168 46982 13588
15132A3588m398K8538L111j695J581L4136K9892k1627l8230Q351n829j8840L3513
15119F2091L6909Q150l8178l7256n410M678j9666L5958K3228J6495n066j6370
15107F5563J0792m666k1139J9655J8603l5039j4169L626N2972L4643l5513k2179
15095G3149O772j0010j1777k1172k7216L1393M3284r440J286j401o643p875O1742
15082A22092K517l3213q840P051n434j6582m415j5784O188K6869j2961o965J0497
15069G1020N7379K1314m2003N635j6780K174P686J9755J1865L1959p754m4663
15057A17587k6245J5909J3524p49l420l4752J9845L7601J2448O585L390k6940
15045A34783j4403l876j0082m0586J1280M143J586L8328M8686O68q890l5072j7814
$$ plain form
15132 13588 9190 37728 40839 39144 40725 74861 104753 83126 44896 53247 47418 28578 62091
15119 62091 99000 107150 68972 31716 26306 30984 11318 47276 70504 86999 81933 65563
15107 65563 76355 71689 50550 70205 88808 53769 39600 43226 96198 130841 95328 73149
15095 73149 79921 69911 58134 36962 9746 41139 84423 74983 76269 74868 68225 60350 122092
15082 122092 124609 91396 82556 89607 84173 67591 63176 47392 53580 80449 67488 60523 71020
15069 71020 128399 149713 107710 113345 96565 98739 106425 126180 138045 170004 162250 117587
15057 117587 91342 107251 120775 120026 116606 81854 101699 139300 151748 158333 161723 134783
15045 134783 120380 116504 106422 65836 77116 81259 82845 121173 169859 170527 161637 126565 108751
15032A08751m0833L2073n751P034k573l1202J1720M5094j1881o1956k3156J5397
15020D2717J8672K3403m3243k2336L2807l1563R163M6286M0937P499j5010M200
15008A13532j3106m3930k6645J9459L7045M5775J829j4987K181j315n923K3344
14996A37259K823j7946l0364j6226m416K4901L7497k5798o2678l2643l2850L727
14984a6714K4856J0049J6658L5302L6310O31p1572M3468K1744L4265n718n3986
14972G5293l3474k558L9138K5024l6945L4712L1167j774J1127K3801j1830l3482
14960A20199j5222J3370j4396r812Q746l3633r059K4500M2725k224l5769L6617
14948A26042J6244k9943k6633k7984K4088M303K3530L4698R855j412j3125j0869
$$ plain form
15032 108751 67918 99991 94240 101274 98701 67499 79219 124313 112432 50476 27320 42717
15020 42717 61389 84792 41549 19213 52020 20457 29620 75906 116843 124342 109332 113532
15008 113532 100426 56496 29851 49310 86355 132130 133959 118972 121153 119838 113915 137259
14996 137259 140082 122136 91772 75546 71130 96031 133528 107730 45052 12409 -20441 -16714
14984 -16714 8142 18191 34849 70151 106461 107092 35520 78988 100732 134997 129279 75293
14972 75293 41819 39261 78399 103423 66478 101190 132357 130583 141710 165511 153681 120199
14960 120199 104977 118347 103951 94139 102885 69252 60193 84693 127418 125194 89425 126042
14948 126042 142286 112343 85710 57726 81814 86117 109647 144345 154200 152788 139663 128794
14936A28794J3644J1759K952r587N067j2727o299j030K1945O675n2849m1345P48
14923F7747J3928K0381K7492k3434n7268r172L5183J4250O529K816J683K3377
14911A23512l7991j508q39J0042K2555p992l1581l3144M1593M9553k3797p498
14899A02905J4064P283k857k4161l327j468r253j9684R118j7633n502L6339K3636
14886A09460J7670J9187K3293J5526j2656m1932l8581j9912K1908K8531k9160
14875I3334l2007j9921l476K8411K453j1562P735q847N35j5030O66N909K077J5679
14861F5956j2325k3681q560J6071K3544K1233J1260K6358m751P38M942k4180O579
14848A03184l1298n0967R540J021J5888J9962j3644K8905K8961k6402k8344l6177
$$ plain form
14936 128794 142438 154197 157149 147562 152629 139902 133603 132573 154518 161193 108344 66999 67747
14923 67747 81675 102056 129548 106114 48846 39674 74857 89107 95636 98452 100135 123512
14911 123512 85521 84013 83174 93216 115771 107779 76198 43054 84647 134200 110403 102905
14899 102905 116969 124252 121395 97234 93907 92439 83186 63502 72620 54987 49485 85824 109460
14886 109460 127130 146317 169610 185136 172480 130548 91967 72055 93963 122494 93334
14875 93334 61327 41406 37930 66341 68794 57232 64967 56120 56655 41625 42291 48200 50277 65956
14861 65956 53631 29950 21390 37461 61005 82238 93498 119856 115105 115843 120785 96605 103184
14848 103184 71886 20919 30459 31480 47368 67330 53686 82591 111552 85150 56806 20629
14836B0629J1479K3528N543k2188M822L6949o785l9764k0514J6150j6499J3207
14824B6557O4315K6658k7884L532M0543L8855k0605l2889k2796l8352p654P786
14812E8066K1525L1614J5108k5606l4933J7881j631k933j8529K1780K6317o032
14800A02627K5632J0262n9429l3362L1970K6008L809J4690j5527m0356q3051k238
14788a8965M1580K9406O2677j2962k8431n7892j6775M0818J0454R538J2960m1086
14776C1322m9897L1745L6768l3979P374N9187r230O345L715K4292j4204m0578
14764E2860R974K3070K0934J6665k7503l0826L3277K1742j9165m701k0060j2200
14752F4067K8722l2974l5211K8520L3286k20l4908j189k2072R454o185M530K4014
$$ plain form
14836 20629 32108 55636 61179 38991 43813 80762 73977 34213 13699 29849 13350 26557
14824 26557 90872 117530 89646 93178 133721 172576 151971 119082 96286 57934 50280 58066
14812 58066 79591 111205 126313 100707 65774 83655 82024 79091 60562 82342 108659 102627
14800 102627 128259 138521 79092 45730 77700 103708 107517 122207 106680 66324 -16727 -18965
14788 -18965 22615 52021 114698 101736 73305 15413 -1362 39456 49910 59448 72408 31322
14776 31322 -18575 13170 49938 15959 23333 82520 73290 79635 83350 107642 93438 52860
14764 52860 62834 85904 106838 123503 96000 65174 98451 120193 101028 96327 76267 64067
14752 64067 92789 59815 24604 53124 86410 86190 51282 50093 28021 37475 31290 35820 59834
14739E9834L5850j5039k9681k3082q547J5006N267J401M4470q92k2609p009j3260
14726D1709k5882j835M514P202J1283K1454R1r36p548J119p238P165L5181j0421
14712G5858K633m009m2090J5428K1835O666o07R864q538M2998J1768k6825l6210
14699F8771J768K5359k2762j5209n839M1021j1705K043J7878p244n4206k046K2754
14686F0583M2517K796o3909M724J0586k3254J3325K6638j1158N163K0313p967
14674H0357k0477k1129j4847M4300L8973Q871m1769l1316k6280K9699O1157k3834
14662H3705j9717K495n278j104p482J528l6541k8866r719Q372L7350J5403R216
14649D9362j4453L406K0256l1194j3134K9469J9222L8958l2450L384K1465K4329
$$ plain form
14739 59834 95684 80645 50964 27882 19335 34341 39608 41009 85479 84587 61978 54969 41709
14726 41709 15827 13992 18506 25708 36991 58445 58536 57600 50052 51171 43933 51098 86279 75858
14712 75858 78491 74482 32392 47820 69655 76321 75714 85578 77040 120038 131806 104981 68771
14699 68771 70539 95898 73136 57927 52088 93109 81404 83447 101325 94081 39875 37829 60583
14686 60583 103100 105896 41987 46711 57297 34043 47368 74006 62848 68011 88324 80357
14674 80357 59880 38751 23904 68204 107177 116048 74279 42963 16683 46382 107539 83705
14662 83705 63988 66483 61205 60101 52619 54147 17606 -11260 -20979 -12607 24743 40146 49362
14649 49362 34909 38315 58571 27377 14243 43712 62934 101892 69442 72826 94291 118620
14637A18620j8602j71J0481j0614j894K3914j2565J8612K5445j6319k0393Q799
14625A25313j6300P056j5678j5556K7833k678l5648K5458L0604j6275k9965J9953
14613A04117j2065p254J5759O313q615k782K9644J2136J674j1922m1045r424p746
14600F8790M779l2653m1330J8060L1419J3060M154K3821j8770k3324j307j1693
14588C5006L0273k8035J8621j0313q276M6879L3003K529k8553J1131K1949k6399
14576I7815k5455J2536o15q509k300j9992K7481K5623L0424K0421l2979j7425
14564A07025N975k7944m2866J6391J3119O748J4187J9707Q687o420j5066n697
14552I3846n525J2374m1L8144j5090m4411O719O845l638l131j9522M989J2872
$$ plain form
14637 118620 100018 99847 110328 99714 97820 121734 109169 127781 153226 136907 116514 125313
14625 125313 109013 116069 100391 84835 112668 109990 74342 99800 130404 114129 84164 104117
14613 104117 92052 84798 100557 106870 98255 95473 125117 137253 138927 127005 85960 76536 68790
14600 68790 73569 40916 -414 17646 49065 62125 66279 90100 71330 48006 46699 35006
14588 35006 65279 37244 55865 45552 37276 84155 117158 119687 91134 102265 124214 97815
14576 97815 72360 84896 84281 75772 73472 53480 80961 106584 137008 157429 124450 107025
14564 107025 113000 85056 42190 58581 71700 78448 92635 112342 121029 114609 99543 93846
14552 93846 88321 100695 100654 138798 123708 79297 86016 92861 89223 86092 66570 71559 84431
14539H4431k2911n050J1685Q985J7368k005q023Q470J2561O443J6365k9082k6874
14526G2363k0089j4992J2762J2631M8799j1841R093O612J7777R644J25K9253n518
14513A66619k6477j9380k1267J2711Q806K6471j9800m9888j5078m236o168q286
14501D4027J973q456j6819n692J3364K2257M5263L5108k442Q713j5984L5J7760
14488A39107j2603j3727j4416l0858l120k1217P469j4665J9722J6654q156j0186
14476E4004M5953J4634P419J5320l7377p077J8849L5741R088q785k3527P245l7708
14463I3779l5827K1467k136j2907J0343J3311l9653m5010L1144O719K5560K1552
14451H8342m327J383K4637J5233k0378m0091j6326M7700L5012r881m8396j5557
$$ plain form
14539 84431 61520 56470 68155 77140 94508 92503 84480 92950 105511 111954 128319 99237 72363
14526 72363 52274 37282 50044 62675 111474 99633 108726 115338 133115 142759 142884 172137 166619
14513 166619 140142 120762 99495 112206 121012 147483 127683 77795 62717 58481 52313 44027
14501 44027 46000 37544 20725 15033 28397 50654 95917 131025 128583 137296 121312 121347 139107
14488 139107 126504 112777 98361 67503 64383 43166 50635 35970 55692 72346 64190 54004
14476 54004 99957 114591 122010 137330 99953 92876 111725 147466 156554 147769 124242 131487 93779
14463 93779 57952 79419 77283 64376 74719 88030 48377 3367 34511 41230 66790 88342
14451 88342 84015 85398 110035 125268 104890 64799 48473 96173 131185 121304 72908 57351
14439E7351R698J7527J4938J5758j0178l9489K35o914P293M3933N8738M903j5464
14426A58329l9265l0519j5262M782j870K0474J73L652J6193l0542j5282p486J7129
14413H0506K5241L5504L0255L368L2720o369k5737l2466o1359K3437J1724P729
14401A24553J4175q046J1610K9585j0096J2004J3850l8210j3743K042j03k6202
14389A11419L315J9001L818l0842j6786Q083K181j0838J4696M0229n00M001j8077
14376A29700k1284J0994K181l716j0508m4124m3445N704L8565L0859P437N142
14364A07505j3675j0927K029q504K502r3J1269N3959j7145m024K3351K4433j530
14351A69150J5650J0516J7422J831N6540M5291N9327R3750Q8387J15532R6882
$$ plain form
14439 57351 67049 84576 99514 115272 105094 65605 65840 58926 66219 110152 168890 173793 158329
14426 158329 119064 88545 73283 78065 76195 96669 96842 100494 116687 86145 70863 63377 80506
14413 80506 105747 141251 171506 174874 207594 201225 175488 143022 81663 105100 116824 124553
14401 124553 138728 130682 142292 171877 161781 173785 187635 149425 135682 137724 137621 111419
14389 111419 114734 133735 137553 106711 89925 98008 100189 89351 104047 144276 143776 147777 129700
14376 129700 108416 119410 121591 117875 107367 63243 19798 25502 64067 94926 102363 107505
14364 107505 93830 82903 84932 76428 78930 78837 90106 144065 126920 122896 146247 170680 169150
14351 169150 184800 195316 212738 214569 271109 316400 375727 469477 557864 673396 770278
14340G70278J74076J66928J62528J47536J22497J01007L7839j6999k2357r6522
14330A546811r7077p2764p4507j37822j63839r6449j14692q3236o6818o3022o6445
14319E10140m9887j5131j3424r440k2681n3555m413n076R048J1211O429k6511
14307C36710l0541k1747j8032j1136j8088j7919j890K5386J2827n323n8930k0280
14295A71037J2103k2761k303L9755J7673k543l0173j4592j7114k7353k624K5135
14283A46240L248p261L0182L3014j4993j1500j9714j074K374J6581K3416j6312
14271A84201L0024J287k0580n1486j0733j5118K5619j0641l1856K6676M1373J3311
14259A82077p525K8265o666l9135j2983J2435J2847k4169p786j112l783j1018
$$ plain form
14340 770278 944354 1111282 1273810 1421346 1543843 1644850 1682689 1665690 1643333 1546811
14330 1546811 1449734 1376970 1302463 1164641 1000802 904353 789661 706425 639607 576585 510140
14319 510140 460253 445122 431698 422258 399577 346022 341609 336533 345581 356792 363221 336710
14307 336710 306169 284422 266390 255254 237166 219247 217357 242743 255570 250247 191317 171037
14295 171037 183140 160379 158076 197831 215504 212961 182788 168196 151082 123729 121105 146240
14283 146240 149488 142227 172409 205423 190430 178930 159216 158142 160516 177097 200513 184201
14271 184201 214225 215512 194932 143446 132713 117595 143214 132573 100717 127393 168766 182077
14259 182077 174552 202817 196151 157016 144033 156468 169315 145146 137360 136248 132465 121447
14247A21447J8553L1112M795j7587L3041P139j9450r886m341j2142J1125j0548
14235A53258M748j2122J7349j0855j8723j491Q838M3520m0402p619J4945J9081
14223A70527L4683K898o223l9222n5496j8055K2879K5027p174p388j6319L1680
14211A37817P1469L5350l9221l9451o086m652l9760m8189J5610J8743q616R713
14199A02727j092J9106J1189J8066k4024L4180k910M086l752J82j2510o811o135
14186A32302l0146l6080l360N3728M1621j1225L805j5200m7441k6127L9506O3013
14174A64396L9224K0448o119r653l8140k8642K4723l2551q375J174n472N963J7372
14161A44348n131o548j197O500M2072N2808L7509j5390m9Q100L4417N7849M602
$$ plain form
14247 121447 140000 171112 175907 158320 191361 198500 179050 169164 164823 152681 163806 153258
14235 153258 158006 145884 163233 152378 133655 132164 141002 184522 144120 136501 151446 170527
14223 170527 205210 208108 201885 162663 107167 89112 111991 137018 129844 122456 106137 137817
14211 137817 209286 244636 205415 165964 159878 155226 115466 67277 82887 101630 93014 102727
14199 102727 101635 120741 131930 149996 125972 160152 157242 161328 157576 157758 145248 138437 132302
14186 132302 102156 66076 62716 116444 158065 146840 150645 135445 88004 61877 101383 164396
14174 164396 203620 224068 217949 208296 170156 141514 166237 133686 125311 126485 121013 126976 144348
14161 144348 139217 132669 131472 137972 180044 232852 270361 254971 254922 263022 297439 355288 359890
14148C59890O259k2163k7033o065n050m882M099p92k1839k5851k155k2958j4239
14135B17221J9391N1951o351j1469k1791j8330J6567K2701k6176K0032J6501j9057
14123B61190p009O115J6114M3982K5904R162L0933J7456M8138L7356K2018L1345
14111E42704q263J1289K1598j6808j0100O189L1105n7193m3322k3210q508L3956
14099D79437k0748q9064j1910K5595r655m3882k2365R901k6033O066k4430j9414
14087B53498j7758k3643J0424O0485J4215r175J7987L5390j816J0752l783j8317
14075C28259K8218N0725L6545k7014j1427j3475k8135n91J9818J0731r756M131
14063C88029J460k085L841l447m0693j455N0190K3545L6491j188n399M2632J7837
$$ plain form
14148 359890 366149 343986 316953 310888 305838 300956 305055 304263 282424 256573 254418 231460 217221
14135 217221 236612 288563 282212 270743 248952 230622 247189 269890 243714 263746 280247 261190
14123 261190 254181 260296 276410 320392 346296 355458 386391 403847 451985 489341 511359 542704
14111 542704 534441 545730 567328 550520 540420 546609 577714 520521 477199 453989 445481 479437
14099 479437 458689 369625 357715 383310 373655 329773 307408 317309 291276 297342 272912 253498
14087 253498 235740 212097 222521 283006 297221 288046 306033 341423 339607 350359 346576 328259
14075 328259 356477 407202 443747 416733 405306 391831 363696 363105 382923 393654 383898 388029
14063 388029 389489 387404 391245 387798 347105 345650 395840 419385 455876 454688 449289 491921 509758
14050E09758r228r251l5559l4106J154j0684M833J7491K6188J2903J8917n713
14038D86703M002r42O8685P9758J8023L359l452K3218M6122N2597P0249L3973
14026H82295K0708K6146J8248l6081m1682j8630l3766m4724o4619q0914j04082
14015E22899n7792j9861K5645R699J445J2016l367O887O37l322J0047J5721j9010
14002E01644L2032n5O555L253K4640M8200J4248k8606l4402K3221L8634l616j800
13989F23948M1588O451P961q23m856q119n119K0675M5054K4059Q743J3525L9983
13976H13070J6738M199N7447N8595m314J0886J7627L2588M4095M9895P4063P3835
13964A248724M3741Q6667P8005O7351P0286P4423K7283O3098Q4881O9051P646
$$ plain form
14050 509758 500530 491279 455720 421614 422768 412084 416917 434408 460596 473499 492416 486703
14038 486703 490705 489763 558448 638206 656229 659588 656136 679354 725476 778073 848322 882295
14026 882295 903003 929149 947397 911316 869634 851004 817238 772514 707895 626981 522899
14015 522899 465107 445246 470891 480590 482035 494051 490684 497571 498208 494886 504933 520654 501644
14002 501644 533676 533621 540176 543429 568069 616269 630517 601911 567509 590730 629364 625748 623948
13989 623948 665536 671987 679948 679125 674269 666150 661031 681706 726760 750819 759562 773087 813070
13976 813070 829808 834007 891454 950049 945735 956621 974248 1006836 1050931 1100826 1174889 1248724
13964 1248724 1292465 1379132 1457137 1524488 1594774 1669197 1696480 1759578 1844459 1913510 1921156
13953A921156q006l996m646m2943j0969J9123L7033J3508N3566N4653J8083J1606
13941B058168R2335J08496J07199J02829J45834J39055J19949J46884J47237J57962
13931C325948J61036J32908J70621K20117K55028K82210L08502L36846M03971
13922E597187M07368M61727N60985O64981P91440Q65190J015998J257643J503860
13913A3126379J769287K040574K380643K832116L468357M250250N374101P194940
13905D2436647J0006217J4143418J9426860K4650147K8764871L1999947L4085727
13898B05513834L3707909K9868619K2971948J5399295Q217684l89111j0110059
13891C05180119j7946267k2767531k5122310k6112457k5987280k3701785k0232040
$$ plain form
13953 1921156 1913150 1909154 1904508 1861565 1850596 1869719 1906752 1920260 1973826 2028479 2046562 2058168
13941 2058168 2150503 2258999 2366198 2469027 2614861 2753916 2873865 3020749 3167986 3325948
13931 3325948 3486984 3619892 3790513 4010630 4265658 4547868 4856370 5193216 5597187
13922 5597187 6004555 6466282 7027267 7692248 8483688 9348878 10364876 11622519 13126379
13913 13126379 14895666 16936240 19316883 22148999 25617356 29867606 35241707 42436647
13905 42436647 52442864 66586282 86013142 110663289 139428160 171428107 205513834
13898 205513834 239221743 269090362 292062310 307461605 315679289 315290178 305180119
13891 305180119 287233852 264466321 239344011 213231554 187244274 163542489 143310449
13884A43310449j6982208j4456202j2396191j0675559r101275p723877o691666
13877F5283471n776625m965082m375710l838467l396253k967586k678728k312994
13869C4972026k002899j806390j604833j427285j302312j187063j045296r44542
13861B3651406q84353q51370q00918p07266o63818o59626o50526o06839n36143
13852A7290547m60826m08211m49125m79302m56195l87972l64526l52302l39685
13843A3592403l29477l25849l38750l33414k78944k70873k38503k53063k92419
13834A0931111k77619k86509k33125k33262k24192k33023k18288k02857k40699
13825H781537k25079j92461k30250k36097k13579j92501j61996j72308j66880
$$ plain form
13884 143310449 126328241 111872039 99475848 88800289 79699014 71975137 65283471
13877 65283471 59506846 54541764 50166054 46327587 42931334 39963748 37285020 34972026
13869 34972026 32969127 31162737 29557904 28130619 26828307 25641244 24595948 23651406
13861 23651406 22767053 21915683 21114765 20407499 19743681 19084055 18433529 17826690 17290547
13852 17290547 16829721 16421510 15972385 15493083 15036888 14648916 14284390 13932088 13592403
13843 13592403 13262926 12937077 12598327 12264913 11985969 11715096 11476593 11223530 10931111
13834 10931111 10653492 10366983 10133858 9900596 9676404 9443381 9225093 9022236 8781537
13825 8781537 8556458 8363997 8133747 7897650 7684071 7491570 7329574 7157266 6990386
13816F990386j63829j59650j69964k32601k36693j74290j52412j45878r7196q2560
13806E375313p0220r1807q3417j09365n6444p7309j17668j16189j09031r2616
13796D451247j09195j23531r5896q3684m1639o6450p5153q0549p7567o5678p4563
13785C557342q6434q5565p2055l9121l5125p4212l1858j3749n3466l2640k2807
13774C010310l2918l8438l4639k8626q5917j08734r7089o6382j03212q2466j07315
13763B224574j32285r3745j10142o8703j3909l9414R73k1702j1309L3119o366
13752A761091o7469m9686r877j7217k4605m1789k9187k3603P967J1868j0081k1844
13740A485568l4028m0861l6015m4330o2345P564K4978l227n3369m3829k7692l453
$$ plain form
13816 6990386 6826557 6666907 6496943 6264342 6027649 5853359 5700947 5555069 5457873 5375313
13806 5375313 5305093 5213286 5129869 5020504 4964060 4886751 4769083 4652894 4543863 4451247
13796 4451247 4342052 4218521 4122625 4038941 3997302 3930852 3855699 3775150 3697583 3631905 3557342
13785 3557342 3470908 3385343 3313288 3274167 3239042 3164830 3132972 3119223 3065757 3033117 3010310
13774 3010310 2977392 2938954 2904315 2875689 2789772 2681038 2583949 2517567 2414355 2331889 2224574
13763 2224574 2092289 1998544 1888402 1819699 1805790 1766376 1767349 1745647 1734338 1767457 1761091
13752 1761091 1693622 1643936 1634059 1616842 1592237 1550448 1521261 1497658 1505625 1517493 1507412 1485568
13740 1485568 1451540 1410679 1374664 1330334 1267989 1275553 1300531 1297304 1243935 1200106 1172414 1168961
13728A168961k560l0487k5368r149J8655J5851l0108l3410k9380n900k0894P258
13716A023469l6332m4910j1465j8214k8885l8188m1338j6430N585L4090j6531
13705H10851n2407k5315l3185q365Q528K5935J352j9215O789k81j1852k059l0316
13692F70460n1095m9512n997K7234l2297q972J6601L1211j4572k2742J9406j8947
13680E60778J6412q870j8761K7096j0514k5156k3456l7461j1396j3165J0104J4292
13668D79903J2782N207j0669k1290l2949J6017J0456k0186k1513P266j4245O997
13656D17776j0461m8486k3707j292q836L146K7101l6704m785M3393j9690p5510
13644B61945R572K6665J3918o643k1889m5835K3725J19j3263J0132m324J7106
$$ plain form
13728 1168961 1166401 1135914 1110546 1101397 1120052 1135903 1105795 1072385 1043005 1037105 1016211 1023469
13716 1023469 987137 942227 930762 912548 883663 845475 804137 787707 793292 827382 810851
13705 810851 758444 733129 699944 691579 700107 726042 727394 708179 714968 714687 702835 700776 670460
13692 670460 619365 569853 563856 591090 558793 549821 566422 597633 583061 560319 579725 560778
13680 560778 577190 568320 549559 576655 566141 540985 517529 480068 468672 455507 465611 479903
13668 479903 492685 497892 487223 465933 432984 449001 459457 439271 417758 425024 410779 417776
13656 417776 407315 358829 335122 333830 324994 328140 355241 318537 313752 357145 337455 261945
13644 261945 271517 298182 312100 305457 283568 237733 261458 261577 248314 258446 254122 271228
13632B71228o638R226k0866k0982n865N146K0902q015L881m699l541j0811l2009
13619A96957n351r01k73J0812K1907N792l616J1798K3962R649Q955j7472l9347
13606B22872L137j1157k5911p268r57N0878M601l0754k6242J6780J1650O1112
13594B68741K0954m4845m9433o6972r314L4863N9529o749l976J4995j8417p466
13582A91910n4579Q187L1117J501L5105q392K650O603K0873L7523K589l1155j8143
13569B25789j7951M54J4374L0420O800J109j4567L913Q834o362j3912k4648k1521
13556A92732K5444j5140p387k6303j688k817l0948K3083J8061J2347j2883k2164
13544A52337R507J9358q010j1186j5661l3233K2897L4926P631o0306N908M5014
$$ plain form
13632 271228 264590 273816 252950 231968 226103 231249 252151 244136 248017 243318 239777 228966 196957
13619 196957 191606 190705 190432 201244 223151 228943 225327 237125 261087 270736 279691 262219 222872
13606 222872 226009 214852 188941 181673 180716 231594 236195 205441 179199 195979 207629 268741
13594 268741 289695 244850 195417 128445 119131 153994 213523 206774 202798 217793 199376 191910
13582 191910 137331 145518 176635 178136 213241 204849 207499 214102 234975 272498 275087 243932 225789
13569 225789 207838 208292 222666 253086 259886 260995 246428 250341 259175 252813 238901 214253 192732
13556 192732 218176 203036 195649 169346 167658 164841 133893 156976 175037 187384 174501 152337
13544 152337 161844 181202 173192 162006 146345 113112 136009 170935 178566 118260 124168 169182
13532A69182j6036p0491K216Q328r988l5223k13L5608J0418o928K9627o080M590
13519A15010K5764J1038k088J7424R385M041J3264J6334P960l2584j8306k2248
13507A44994l5160j4249K6357K7164K9642j3324j9707k0301M730J937N287l3097
13495A04273K825l8028k1909N0563J4679k213O0413M1144k3696m2462q048N0740
13483A88281O1824l9446m0400k7037J2497r229j2556J4057J812n712k8676r959
13471A05456j4339r722K5230M6362J6637P706J6546K2436N1049J498o09M7976
13459C16226N0187M8883J18114J15982J45001J83557J86134J69183J28160J07195
13449A568622P1480K4553L0394q102r6633j11915r4490r8829j30802q6087j00007
$$ plain form
13532 169182 153146 82655 84871 93199 83211 47988 47775 83383 93801 86873 116500 110420 115010
13519 115010 140774 151812 149724 167148 176533 180574 193838 210172 218132 185548 167242 144994
13507 144994 109834 95585 121942 149106 178748 165424 145717 125416 130146 132083 137370 104273
13495 104273 107098 69070 47161 97724 112403 110190 170603 211747 188051 145589 137541 188281
13483 188281 250105 210659 170259 143222 155719 146490 133934 147991 149803 144091 115415 105456
13471 105456 91117 81395 106625 152987 169624 177330 193876 216312 267361 268859 268250 316226
13459 316226 366413 415296 533410 649392 794393 977950 1164084 1333267 1461427 1568622
13449 1568622 1640102 1664655 1695049 1686947 1590314 1478399 1383909 1285080 1154278 1068191 968184
13438I68184j28823r9730m8593m8276o9475m1937m131l9450o4480j5553K0603
13427D28339q028j1931l4986k1489K9142M1494K8871O884o4208j4284Q160l9149
13415C48815l7837r776l6597l1516q229k0572J7458J8938L136K2386l2202j2087
13403B21917p120P394K063L508k6459n196R736j3290k8832j7089L5798K6896p197
13390B02129P175j998j6135j2584K000l1704j8609k7870M276K5861j1806K4082
13378A44817M729K5708J2738q886k0076j4988L1371M735k8307j9138J2319j7282
13366A27740k0500j4082K3637K3845j7104k7095Q978J4435Q279Q593L446K1560
13354A61732O831j4875J5576q910k2470j7474j177K0543J949P563n047P426J054
$$ plain form
13438 968184 839361 739631 691038 642762 573287 531350 527219 487769 423289 407736 428339
13427 428339 420311 408380 373394 351905 381047 422541 451412 458296 394088 379804 387964 348815
13415 348815 310978 301202 264605 233089 224860 204288 221746 240684 243820 266206 234004 221917
13403 221917 214797 222191 224254 227762 201303 196107 205843 192553 163721 146632 182430 209326 202129
13390 202129 209304 207306 191171 178587 180587 148883 130274 102404 106680 132541 120735 144817
13378 144817 149546 175254 187992 179106 159030 144042 175413 180148 151841 132703 145022 127740
13366 127740 107240 93158 116795 140640 123536 96441 105419 119854 128133 136726 140172 161732
13354 161732 168563 153688 169264 160354 137884 120410 119233 139776 141725 149288 144241 151667 152721
13341A52721l7367k111M5582J7062o108L238J5715j3247m8660l1708J8501J9126
13329A32744K0936M3070o070j1296m8473o1595J7264L5697J4660J6878j5034o4489
13317G4292L3532O5927k4126l7358k2344J6025J9398K8640r824j2420n546l5581
13305I0615K6043K1999m486M0100j6798P784K4580r675m4853R361J5107O424k675
13292A63526J0837k9039n194m528J0158L0711N616k4549K3035k6869P250j934
13280A59020k0933j3573J2408N1831L1082K338r129q900J3674j3052k3874Q264
13268A89156M290k6100j4757k3992L995o302l8082j3925J618N4481M3832o352
13256A67862l8988k9149N508J637J6931L903N5o644J2407K7442Q33p438l0415
$$ plain form
13341 152721 115354 113243 158825 175887 169779 173017 188732 175485 126825 95117 113618 132744
13329 132744 153680 196750 190680 179384 130911 69316 86580 122277 136937 153815 138781 74292
13317 74292 107824 173751 149625 112267 89923 105948 125346 153986 144162 131742 126196 90615
13305 90615 116658 138657 134171 174271 157473 165257 189837 180162 135309 144670 159777 166201 163526
13292 163526 174363 145324 140130 135602 145760 176471 182087 157538 180573 153704 160954 159020
13280 159020 138087 124514 136922 188753 219835 222173 213044 204144 217818 204766 180892 189156
13268 189156 193446 167346 152589 128597 132592 126290 88208 74283 75901 130382 174214 167862
13256 167862 128874 99725 105233 106870 123801 127704 127759 121115 133522 160964 161797 154359 123944
13243A23944j5461Q55K6376j49j6424k8859K5118J0067k4705r113K6343L2451
13231A50443K0172l1452J3638n32m8957J2437j6293K2825j9129j129k8205K8380
13219A02198M000j8698N2806M3299k2756k9032m387J3863n713j7083Q560k3709
13207A03348m0795J360r677P938P951J5372J5328o954m904K7818r807j0230J407
13194I8155Q850K0811R847K6153m143m7008k6637L3291L7834K9152J449k6302
13182A61452j2029J2456j6022m5112l0155n690J0195K1820n035J4474K5637L8600
13170A70591n828k0257O900L5776J0759l0992k5467L999J4334k2625k2398K6515
13158A41307k75n197J6426n908l8803N357K6234K2383j249Q78k9970O825N77K4323
$$ plain form
13243 123944 108483 109338 135714 135565 119141 90282 115400 125467 100762 91649 117992 150443
13231 150443 170615 139163 152801 152269 103312 115749 99456 122281 103152 102023 73818 102198
13219 102198 106198 87500 140306 183605 160849 131817 127430 141293 135580 118497 127057 103348
13207 103348 62553 63913 54236 62174 70125 85497 100825 93871 88967 116785 106978 96748 98155
13194 98155 107005 127816 137663 163816 159673 112665 86028 119319 157153 186305 187754 161452
13182 161452 149423 161879 145857 100745 70590 64900 75095 96915 91880 106354 131991 170591
13170 170591 164763 144506 151406 187182 197941 166949 141482 145481 159815 137190 114792 141307
13158 141307 141032 135835 152261 146353 107550 112907 139141 161524 160275 161153 131183 138008 138585 162908
13144A62908k261K6340K1554L248k0707M726j5077l3623m4096M667q649k7871
13132G1159J7185K6863J1225J5816J2250r567K625j9270J1299J0150O687l943
13120A52479j9135k0398J5584Q620N144K504n177l904K5711K8380k7630j4143
13108A48035J9495L551o393L4842J2918l3843j9510j9276K0214L0632k5123j1065
13096A54477l7422k3077N7866K5607K9820K0650j2339m0711l244K8363L9169j2817
13084B26342j2190L5450J2087K3986k3088k514P520L2081J7095j2694o655J6353
13072C13773j5927l6417K3280K1393K2044M6516N335l3193P659J8971N1511N701
13060D30646j1602J2491J2346j0129j7722j0842l3787l8068m8745o365R886L8101
$$ plain form
13144 162908 160647 186987 208541 211789 191082 195808 180731 147108 103012 107679 99030 71159
13132 71159 88344 115207 126432 142248 154498 144931 147556 128286 139585 149735 156422 152479
13120 152479 133344 112946 128530 137150 142294 144798 139621 135717 161428 189808 162178 148035
13108 148035 167530 171081 164688 199530 212448 178605 159095 139819 160033 190665 165542 154477
13096 154477 117055 93978 151844 177451 207271 227921 215582 174871 171627 199990 239159 226342
13084 226342 214152 249602 261689 285675 262587 260073 267593 299674 316769 304075 297420 313773
13072 313773 297846 261429 284709 306102 328146 374662 379997 346804 354463 373434 424945 430646
13060 430646 419044 431535 443881 433752 416030 405188 371401 333333 284588 278223 288109 326210
13048C26210M4281Q8837N1817P2475R1983R5962J21555J21255J29399J48616J31900
13037A424290O4668L1523K6760k5782o9076q5803j07106o8443n1581l6372o9091
13026A033987m2094j8332l1466k587n8815o1011p1943k136M0182K0385M6263P1278
13014I23711M4404Q9262J74020K17988K53026K42397K05391J13024N0415k7728
13004B285910j33375j63880j82280j42883p9338j04109r7676o2023q6423j7295
12994A216628j1604k5618M3728M3852R5639J38398J90887K14319J51004J50556
12984B207789R7097n5998j01008j46360j93297j62342j03765j63127j13839j08039
12974A157111p3475n7990n4734r6308n6875j5082j8287l0570p831m0792n6396
$$ plain form
13048 326210 370491 459328 511145 583620 675603 771565 893120 1014375 1143774 1292390 1424290
13037 1424290 1488958 1520481 1547241 1521459 1452383 1366580 1259474 1191031 1139450 1103078 1033987
13026 1033987 991893 973561 942095 939508 880693 819682 747739 745603 785785 806170 852433 923711
13014 923711 968115 1057377 1231397 1449385 1702411 1944808 2150199 2263223 2313638 2285910
13004 2285910 2152535 1988655 1806375 1663492 1584154 1480045 1382369 1320346 1233923 1216628
12994 1216628 1205024 1179406 1223134 1266986 1362625 1501023 1691910 1906229 2057233 2207789
12984 2207789 2304886 2248888 2147880 2001520 1808223 1645881 1542116 1378989 1265150 1157111
12974 1157111 1083636 1025646 970912 874604 817729 802647 784360 753790 745959 705167 648771
12963F48771n2521n461K2692P036p653r49l3105m750k9295j6064p828k8597J7516
12950E09792K3076k5610l3561m3593j1380m1576J2520L9866L1831r287j4875l2310
12938D04893J2802P345m1820K9734r080j4001J016J8823n5n77J1870j7965l4636
12925C68349L984J4704K5075J9184K1842q786n927L106k0224n5941q517n855J4297
12912C65291J4269M484K7697R060R059K857J1974J6856J0314k8211j1061j2472
12900D20117m0917k5012n0523k5723J8774L5340q478l2946J1985k2098J9644N919
12888C06082j502p273j989K5797K2634l4210P489L4351L729p015k7802j0828j4058
12875B95405j4062N2046M1326j1075k3802m017l7453r065j2694j0872J2171m9199
$$ plain form
12963 648771 596250 590789 613481 620517 612864 611915 578810 574060 544765 528701 520873 492276 509792
12950 509792 532868 507258 473697 430104 418724 377148 389668 429534 461365 452078 437203 404893
12938 404893 417695 425040 383220 412954 403874 389873 390889 409712 409657 409080 420950 402985 368349
12925 368349 372333 387037 412112 431296 453138 444352 438425 441531 421307 365366 356849 350994 365291
12912 365291 379560 384044 411741 420801 429860 432717 444691 461547 471861 443650 432589 420117
12900 420117 379200 354188 303665 277942 296716 332056 323578 290632 302617 280519 300163 306082
12888 306082 304580 297307 295318 321115 343749 309539 317028 351379 355108 348093 320291 309463 295405
12875 295405 281343 333389 374715 363640 339838 335821 298368 289303 276609 265737 277908 228709
12863B28709m3850K3383K5349k4203k6610M2471R372K6278M8903J1460o1773L7766
12851B97255M7235j6071J103N993J1441j1543n131k9037J1006J6824O431l1713
12839C03793Q073q651l5205J1971j1005m867J3650K670K18J9109N316j0070l5060
12826B59942P375Q251L7471K8440M4099l8801k9098J378l259k2931R990J9944
12814C22801J5583q670j6769l192j1126P64m0820k3035L1715L8876j1638j2271
12802B82218K8464K7046j4461o9948j2166K9717O7170n823j3866L7918r712j8334
12790C28223j6382j7433N7935J8765O781j5429j5078l5845k2199l373O367N580
12778B97912K729j7902K588P783N134R657J7272k8203k3037j4055j3112L0528
$$ plain form
12863 228709 184859 208242 233591 209388 182778 225249 234621 260899 309802 321262 259489 297255
12851 297255 344490 328419 329522 335515 346956 335413 330282 301245 312251 329075 335506 303793
12839 303793 311866 303215 268010 279981 268976 264109 277759 280429 280647 299756 305072 295002 259942
12826 259942 267317 275568 313039 341479 385578 346777 317679 319057 315798 292867 302857 322801
12814 322801 338384 329714 312945 309753 298627 299391 258571 235536 267251 306127 294489 282218
12802 282218 310682 337728 323267 253319 241153 270870 338040 332217 318351 356269 346557 328223
12790 328223 311841 294408 352343 371108 377889 362460 347382 311537 289338 285965 292332 297912
12778 297912 300641 282739 285327 293110 298244 307901 325173 296970 273933 259878 246766 277294
12766B77294K2036K0143r232q177J7497N399q07K204L3600J6694J3080k7152j8609
12753C43970j8129j7718n464j7295j8047P1977N9466L2750k0611N863K195m691
12741D14266j426L2619j2342K4482l6555k5997m9211j3111k2284l3516L4499L557
12729C14981M377J7573J9584K5148m1938K7520O572j4784m526k0833O444p360
12717C32758K1276K5749n972j3094L3430k299m1921L312m159L2549O337q125p767
12704C72074L9029m485q744j5412P766O6992O5805K4637r495j6460j2125k2991
12692D86591q934J4075L0025M505j583l318l0464N987L1115M7302K7215J1479
12680F13995K5907K3615K5109K0772P5105J45319J66643K12729K51130K87708
$$ plain form
12766 277294 299330 319473 310241 302064 319561 324960 324153 326357 359957 376651 389731 362579 343970
12753 343970 325841 308123 302659 285364 267317 339294 398760 431510 410899 416762 418957 414266
12741 414266 412840 445459 433117 457599 421044 395047 345836 332725 310441 276925 311424 314981
12729 314981 319358 336931 356515 381663 339725 367245 373817 359033 354507 333674 340118 332758
12717 332758 354034 379783 373811 360717 394147 391848 349927 353239 349080 381629 387966 379841 372074
12704 372074 411103 406618 397874 382462 390228 457220 523025 547662 538167 521707 509582 486591
12692 486591 477657 491732 521757 526262 524679 521361 490897 496884 527999 575301 602516 613995
12680 613995 639902 663517 688626 709398 784503 929822 1096465 1309194 1560324 1848032
12670A848032K14828J01970M7556j1442j23873k04951j57668j71064j47186j23630
12660A272572p1666r5109j22437j9526o001m7829n2648o5836O986L984m2523k9241
12648G30726L7471O1919L2343N7517O2502O0644N0385j1341M734l4686m6800l8699
12636I66715l869k9331M566J113J6286j8076m897j6614n8431j2707L8372J9364
12624I02491K1917M6838K6432J6142O0524L1083l8286m2925j7387l3170n9640
12613I14019n3372q1186o6242k2840r041j7863j9327n2189p163K4834k945j7894
12601E88791M594n549l0452o9319J7663J7759J2709R955l1770k525k0524j0573
12589D80759R214K1179M1283K0647k5065p393l791m9609j3128J2223p10q250k931
$$ plain form
12670 1848032 2062860 2164830 2212386 2200944 2077071 1872120 1714452 1543388 1396202 1272572
12660 1272572 1200906 1105797 983360 963834 957833 910004 857356 791520 798506 802490 759967 730726
12648 730726 768197 830116 862459 919976 982478 1043122 1093507 1082166 1086900 1052214 1005414 966715
12636 966715 962846 933515 938081 939194 955480 937404 932507 915893 857462 844755 883127 902491
12624 902491 924408 971246 997678 1013820 1074344 1105427 1067141 1024216 1006829 973659 914019
12613 914019 860647 779461 713219 690379 681338 663475 644148 591959 584796 609630 606685 588791
12601 588791 593385 587836 557384 488065 505728 523487 536196 546151 514381 511856 491332 480759
12589 480759 489973 511152 552435 573082 548017 540624 536833 487224 474096 486319 485609 477359 474428
12576D74428R205j2523Q312j3781J475k7767o514O980J0125N2022K8564q794l3997
12563D87735n8458K5038J7681j2982k6779n5978N847L7357L5817L5267K0809m6922
12551D64432l4219K5106J5962n6828k5050L377O422j4105p245L2014L5626K6522
12539D72014J2757l2544k2470n60J6447k7794j3159L808L2333j5087J3656L1908
12527D71309J3492r48M664j8590K4439r647m147k784m0911j7700k8339l8733K7337
12514C79442N5984M0469J936r485M115k9123o858L492M607J1915K8157K972R545
12501D97168J3933k3479j0481k5333n0121J5934J5243k4075P650k0306L61M5235
12489D41729j3610J4910P3Q019K0621L0539K8768k8968l8083k0367J0042K8104
$$ plain form
12576 474428 483633 471110 479422 465641 467116 439349 432835 439815 449940 501962 530526 521732 487735
12563 487735 429277 454315 471996 459014 432235 376257 382104 419461 455278 490545 511354 464432
12551 464432 430213 455319 471281 414453 389403 392780 399202 385097 377852 409866 445492 472014
12539 472014 484771 452227 429757 429197 445644 417850 404691 408499 440832 425745 439401 471309
12527 471309 484801 483853 488517 469927 494366 484719 480572 477788 436877 419177 390838 352105 379442
12514 379442 435426 475895 477831 468346 472461 443338 436480 439972 444579 456494 484651 487623 497168
12501 497168 511101 487622 477141 451808 401687 417621 432864 408789 416439 396133 396494 441729
12489 441729 428119 443029 443102 451121 471742 502281 531049 502081 463998 443631 453673 481777
12477D81777j0434J9562j623m6392j4793J4027j3680j6064j961L9703M9191k7695
12465D71618p294J0613k953K6709n496l8836j3553M7759K8070l3303k5400K3777
12453D81711M0303k5838p702m36n016J2929K8950j1806k0447J091K9677M084k3560
12440E03940P941L9653l0513n972k1518o0368j910M3435P440l3636n155K4386
12428D67723r30l1227k9151m393k466l777k7601L3765N0187j4343J54r157O623
12415D35407k6929J0322J7899J8349K7640k6220j2892j8004K4148K7867k0088
12404D57499J9298L986K2831J0549j4221j2894j1594o828N831K0521J2800j3255
12392D94523m789p16j3782k938j6582o564j3724o740m7111K0756j6525J8834P8596
$$ plain form
12477 481777 471343 490905 489282 442890 428097 442124 428444 412380 410419 450122 499313 471618
12465 471618 464324 474937 471984 498693 493197 454361 440808 488567 516637 483334 457934 481711
12453 481711 522014 496176 488474 488038 483022 495951 524901 513095 492648 493739 523416 527500 503940
12440 503940 511881 551534 521021 515049 493531 433163 431253 474688 482128 448492 443337 467723
12428 467723 466793 435566 406415 402022 399556 395779 368178 401943 452130 437787 437941 428784 435407
12415 435407 408478 418800 436699 455048 482688 456468 443576 425572 449720 477587 457499
12404 457499 476797 480783 503614 514163 499942 487048 475454 468626 474457 494978 507778 494523
12392 494523 489734 489018 475236 472298 455716 449152 435428 428688 381577 402333 385808 404642 483238
12379D83238J2888q608j6687k8003o456L2625M4108L3443k5369k6146l2117j1953
12367D50963J1622M0011J9690p616j6780J4906Q217O48J2546m385l2298j5586
12355D81938m430L9790L2893L2660j5004j8914O321J7670l0349k3429J2070l0586
12343E00630j3138j5086l2542l135K7571K0735j2827K024r791R533M2110K6169
12331E42253q746j366j0745l0743l4183O677m553J9232M400J2621Q67j3565K6058
12318E08207K7961l728K1779m687o224q26N418n3484l59J5562J0133K2389q594
12305E33547j2135J07k6151L4157M611J8301j1537j1330M5022J6440Q784J576
12293F01392k7903K7943J3008k6705N634k781l9604M90K6271J4658j4271k0177
$$ plain form
12379 483238 496126 487518 470831 442828 436372 468997 513105 546548 521179 495033 462916 450963
12367 450963 462585 502596 522286 514670 497890 512796 521013 521661 534207 529822 497524 481938
12355 481938 477508 517298 550191 582851 567847 548933 555254 572924 542575 519146 531216 500630
12343 500630 487492 472406 439864 436729 464300 485035 472208 474232 464441 473974 516084 542253
12331 542253 533507 532141 521396 490653 456470 463147 458594 477826 482226 494847 495714 482149 508207
12318 508207 536168 532440 554219 549532 543308 542482 547900 494416 494057 509619 519752 542141 533547
12305 533547 521412 521519 495368 529525 534136 552437 540900 529570 574592 591032 599816 601392
12293 601392 573489 601432 614440 587735 593369 590588 550984 551474 577745 592403 578132 557955
12281E57955k0072p480K0482K66k3012O543K5437P715J0346J3601J37L513l2294
12268E63137N427K3393J0902n440k0363k387O999j49O33J1779J322k3797n378
12255E66078j79J6566j0195J3690M2070K9095o428j5741j4828L1165k1883r405
12243F20005j0749R834K0054J0117j6955l4332P169K0015J4416j6962k6523L7154
12231F33243L4414k0532j7480N9709L95m8377k0661K0887j2107j7087J6135L9018
12219F67557k9288r436Q486k1303k1001L583J7138J682N093j9249J0436j6855
12207E96843q663k6052K9264L4649k5922l569L1063N318O029J979J4387J3921
12195F69247j0121r134n160l0918J9417J3815J7336K0515K6599L0912N773k8510
$$ plain form
12281 557955 537883 530403 550885 551151 528139 534682 560119 567834 578180 591781 591918 595431 563137
12268 563137 568564 591957 602859 597419 577056 574669 581668 581519 582152 593931 595253 571456 566078
12255 566078 565899 582465 572270 585960 628030 657125 650697 634956 620128 651293 629410 620005
12243 620005 609256 619090 639144 649261 632306 597974 605143 625158 639574 622612 596089 633243
12231 633243 667657 647125 629645 689354 689749 641372 620711 641598 629491 612404 628539 667557
12219 667557 638269 628833 637319 616016 595015 598598 615736 617418 622511 603262 613698 596843
12207 596843 588180 562128 591392 626041 600119 596550 627613 632931 638960 640939 655326 669247
12195 669247 659126 649992 644832 613914 633331 647146 664482 684997 711596 742508 748281 719771
12183G19771k4227l9046k1774j071P949P267J0665l5306j7515J3462Q679M0330
12171F69184n804R309J0951O8848K2267R436O9056K961J6330R2136M9291J1237
12159A025202J1698J4411J9975J4847Q422K920n050P475k0557m1435l5729Q850
12147A011029K2256J066J8048j0726N035k9843j0288P5557O5639K398k907K3663
12135A170927L4564K3246K96l0089j3078J9122L5783K1489K5297J06J1409k6852
12123A272220K1693N4575J6593j4083j7628j4019j61k1204j7844J7748o002N921
12111A297809k896n2006l6967l616l058j4397K678l7442K5841j1322J4750K2715
12099A202089O186M302Q911K8836q484k0990l5002j7514n14k1543j2320k8120
$$ plain form
12183 719771 695544 656498 634724 633653 641602 648869 659534 624228 606713 620175 628854 669184
12171 669184 663380 672689 683640 752488 774755 784191 853247 856208 872538 964674 1013965 1025202
12159 1025202 1036900 1051311 1071286 1086133 1094555 1097475 1092425 1099900 1079343 1037908 1002179 1011029
12147 1011029 1033285 1034351 1052399 1041673 1046708 1016865 1006577 1082134 1147773 1150171 1147264 1170927
12135 1170927 1205491 1228737 1229033 1198944 1185866 1204988 1240771 1262260 1287557 1287663 1299072 1272220
12123 1272220 1293913 1348488 1365081 1350998 1333370 1319351 1319190 1297986 1280142 1297890 1291888 1297809
12111 1297809 1294913 1242907 1205940 1202324 1199266 1184869 1187547 1150105 1175946 1164624 1179374 1202089
12099 1202089 1208275 1212577 1221488 1250324 1241840 1220850 1185848 1168334 1167820 1146277 1133957 1105837
12087A105837m59j3290n8455l2005o429o8772n7387l8231m323k822j7255J4758
12075H21167M6967j6944n9547k2092J3569k091j6868p955j2593N788P904N363
12063G62668k3695j0639J4968k9859j5114O704l3029m698j1195K6738K3711J8745
12051G25305l9307K2561M4506k3115o2703j5748J471J3859O130K067l741P150
12039F78435q006M7329J4795J1241j607q050m707j0213j6682R636J7644K1089
12027G50904k2401j8497k8089j2138J9580J5560J1637L983k4553R772R348r46
12015G14160k4408j6285j584m8408m1186M1578M9848J4028k4361l4966K8673N2678
12003G09767n233l3076l9867M9312K5975O994J2208J3611K7900L4789J0160k6682
$$ plain form
12087 1105837 1105378 1092088 1033633 1001628 995199 926427 869040 830809 826486 823664 806409 821167
12075 821167 868134 851190 791643 769551 783120 781029 764161 756206 743613 749401 757305 762668
12063 762668 738973 728334 743302 713443 698329 705033 672004 667306 656111 682849 706560 725305
12051 725305 685998 708559 753065 729950 667247 651499 652970 666829 672959 675026 671285 678435
12039 678435 670429 717758 732553 743794 742187 734137 729430 719217 702535 712171 729815 750904
12027 750904 728503 710006 681917 669779 689359 704919 716556 720539 695986 705758 715106 714160
12015 714160 689752 673467 671883 623475 582289 623867 673715 687743 663382 628416 657089 709767
12003 709767 704534 671458 631591 680903 706878 713872 726080 739691 767591 802380 812540 785858
11991G85858j0550k5595m5072J1566K8099K2549K0339q190m3824j8365j1100K9106
11979G34821o687l3600m7274k8078M3588L195J6154J782M2543J3355k0658l7493
11967F81648J77L7551L3576k8539k9739j4013J3908J3592r80l3500Q452K2860
11955G04993J9563k3772j2013m093J0257J6714J2067k0199l5102k2708J490J2434
11943F59631J379P900J7295j3982j5916k7428l1183K4667M6072K611k3326j7511
11931F30209N091j3119J4556L6015J5151j4642n897J5815j3393k1130J4872L9250
11919G02778J4842j3695j6726q50l9002k9766n500J2004L5280j2019j8589L6818
11907F65575K184k2758L0048r971k6102m3956m567K2721J2782k4573j4423J5433
$$ plain form
11991 785858 775308 749713 704641 716207 744306 766855 787194 779004 735180 716815 705715 734821
11979 734821 728134 694534 647260 619182 662770 665965 682119 683901 726444 739799 719141 681648
11967 681648 681825 719376 752952 724413 694674 680661 694569 708161 707181 673681 682133 704993
11955 704993 724556 700784 688771 684678 694935 711649 723716 703517 668415 645707 647197 659631
11943 659631 661010 668910 686205 672223 656307 628879 597696 622363 668435 671046 647720 630209
11931 630209 635300 622181 636737 672752 687903 673261 667364 683179 669786 648656 663528 702778
11919 702778 717620 703925 687199 686349 647347 617581 612081 624085 659365 647346 628757 665575
11907 665575 667759 645001 675049 665078 638976 595020 590453 613174 625956 601383 586960 602393
11895F02393J6577L641j3525l8410l8076J3508M4766j0268k8319l2820J8453j1766
11883E26154J7209J0991M8371L0726P553j8163j2372j0953j0469M0880j1290p366
11871F11271m095K9465l1953k6674l077Q216L4159l984l956j0722O015j1611J0169
11858F03223R08m4220J7686N1800O561r533k1767j6712R012k3087m758J5110k9052
11845E55171l6301K663j8438L8901O6417J6342j1214k4908j5510K1646K4722J3853
11833F33344p645k9649l8760p031J4746p223L1260K4493k6540N633q832n674K2058
11820F00180K6675l3020J321K9498j0089l1284l1565q559k6097j9401M7468N3593
11808E98720M4432J1398k4193l6653k1517l4323k877j107J6818l3067l1569K4396
$$ plain form
11895 602393 618970 622611 609086 570676 532600 546108 590874 580606 552287 519467 537920 526154
11883 526154 543363 554354 602725 633451 641004 622841 610469 599516 589047 629927 618637 611271
11871 611271 607176 636641 604688 578014 574937 583153 617312 613328 609372 598650 604665 593054 603223
11858 603223 604131 559911 577597 629397 635958 626425 604658 587946 596958 573871 569113 584223 555171
11845 555171 518870 521533 503095 541996 608413 624755 613541 588633 573123 594769 619491 633344
11833 633344 625699 596050 557290 550259 565005 557782 589042 613535 586995 592628 583796 578122 600180
11820 600180 626855 593835 595156 624654 614565 583281 551716 543157 517060 497659 545127 598720
11808 598720 643152 654550 630357 593704 572187 537864 534987 533880 550698 517631 486062 510458
11796E10458K0459K0668J5797k804k621r564j8262K1714K591l3419m0155o757
11784D78105j2786j3550M0354M5297L5419k3012j7798n118j2462j8783o650P364
11772D96380J9338N007J2745R666L951L68M746k4309j1101r448L0666k3026o409
11759E08574P088J4996N508k3495M0731j7759m3317K5357j8941j3575K8816J7604
11747E31587M841Q872n500l5257J2556N4133J2702m3383k5698l964k9749m023
11735D77117K6906k0305j1294j2979p11m582j0962j2048j5595k7749Q813L9384
11723D35995M073J6531J0493j6020j1540j9447J0513p16J4663N0591K377j3588
11711D83925l0840k1963n224J382M7373J4919o667n5640K3548K6420J2952k7462
$$ plain form
11796 510458 530917 551585 567382 564578 561957 552393 534131 555845 558436 525017 484862 478105
11784 478105 465319 451769 492123 537420 572839 549827 532029 526911 514449 495666 489016 496380
11772 496380 515718 520725 533470 543136 547087 547455 552201 527892 516791 507343 538009 514983 508574
11759 508574 515662 530658 536166 512671 553402 535643 492326 517683 498742 485167 513983 531587
11747 531587 536428 545300 539800 504543 517099 571232 583934 540551 514853 510889 481140 477117
11735 477117 504023 483718 472424 459445 458734 454152 443190 431142 415547 387798 396611 435995
11723 435995 440068 456599 467092 451072 439532 420085 430598 429882 444545 495136 497513 483925
11711 483925 453085 431122 425898 427280 474653 489572 482905 427265 450813 477233 490185 462723
11699D62723N284K1323k700J2989n342J0366l7191k978p725M224J1468k2504p432
11686D42505m6951q047l5167J4361K9421n068j4551N3590O282j7129K0761J6716
11674D56723j135L12o471L422k0246j4978P70K8076K135k5590j8761K397k294
11661D04360N0322J690n3203j7194L4801j8410j5260R830m352j1586l0074j2590
11649C38334j0210N1772J0362m246J718j120J6683l0701n7604L8661M5767k255
11637C97161j3939K9984K3367R95k466K5572k6105q412K1770j57O774k9175m281
11624D21088q206L5696k7403j2072M335L889m861q270l785j7083j4330L0009L1287
11611D30294p081L5017n1999m5981j7715N273K4129J520j0343j832K0838J6225
$$ plain form
11699 462723 468007 489330 486630 499619 494277 504643 467452 464474 456749 460973 472441 449937 442505
11686 442505 395554 387507 352340 366701 396122 391054 376503 430093 436375 419246 440007 456723
11674 456723 455588 455900 449429 452851 432605 417627 418397 446473 448608 423018 404257 406654 404360
11661 404360 454682 456372 403169 385975 420776 402366 387106 396936 392584 380998 350924 338334
11649 338334 328124 379896 390258 386012 387730 386610 403293 372592 314988 353649 399416 397161
11637 397161 383222 413206 436573 437568 435102 460674 434569 426157 447927 447770 454544 425369 421088
11624 421088 412882 448578 421175 409103 413438 417327 412466 404196 400411 383328 368998 399007 430294
11611 430294 423213 458230 406231 360250 342535 347808 371937 373457 363114 361282 382120 398345
11599C98345j9234j0640N227m0277l596k4901L034m852J4577K6900M2341J0234
11587C97158m5530l3752J4446m446L0277M953K2202L0417l1729J6785k8191k209
11575C70381k5592m1170O491K6725k4338k834J9361K8529K1996K861j9776k8887
11563C33747k1805K6113j2101l3224L3677J9596J0222O669k1825k7430j4824n129
11551B93686K9021j5656J0326K2306J4711K0735R971k3389k5650o3537P411K3638
11539C03573M0941l4826k0086j1144J7764L1243L8858J1278R401k5444J7438l3315
11527C45681k9123j6903j7648Q565l1407m2824M5050Q1553J6091p244j3015J853
11515C40629K1656P080R22J4292J768j1558j4489l608l114K4699L366o570o032
$$ plain form
11599 398345 379111 368471 373698 333421 329825 304924 307958 303106 317683 344583 386924 397158
11587 397158 351628 317876 332322 327876 358153 363106 385308 415725 383996 400781 372590 370381
11575 370381 344789 303619 310110 336835 312497 309663 329024 357553 379549 382410 362634 333747
11563 333747 311942 338055 325954 292730 326407 346003 356225 362894 341069 313639 298815 293686
11551 293686 322707 307051 317377 339683 354394 375129 385100 361711 336061 272524 279935 303573
11539 303573 344514 309688 289602 278458 296222 327465 366323 377601 387002 361558 378996 345681
11527 345681 316558 299655 282007 290572 259165 216341 261391 342944 359035 351791 338776 340629
11515 340629 362285 369365 370287 384579 386347 374789 360300 356692 353578 378277 381643 375073 369041
11502C69041P047K4097j6562n010M91n7885m1663J6338m4449k0198J0362L0351
11490B71960j0415J0353L4195l3662j0443n578o512Q472J1675L6921J3450J9865
11478C40281L7291n512J1016L1165J7286k7441k4440n8725O768J0352Q403J9133
11466C65577j0088l6858n7647P12M1084J3203j9939l8010L5360M2988J6206Q31
11454C53419k3023q630j6393j8469J590j2861k7309j5786k2140M0656N2358l371
11442C00041n7717l1867L5033k2128L0965O2776m1458l7944L041m63J933L2197
11430B74409j5045j229n296K5086J9448R29m1967k6540j6626O4641J3186j5644
11418B75352j4566O907K9688j3882j1005k1494K1906L1472k72Q332R061k5940
$$ plain form
11502 369041 376088 400185 383623 378613 379104 321219 279556 295894 251445 231247 241609 271960
11490 271960 261545 271898 306093 272431 261988 256410 249898 258370 270045 306966 320416 340281
11478 340281 377572 372060 383076 414241 431527 404086 379646 320921 327689 338041 346444 365577
11466 365577 355489 318631 260984 261696 302780 315983 296044 258034 293394 336382 352588 353419
11454 353419 330396 321766 305373 286904 288494 275633 248324 232538 210398 251054 303412 300041
11442 300041 242324 210457 245490 223362 254327 317103 275645 237701 240742 240279 242212 274409
11430 274409 259364 258135 252839 277925 297373 298302 256335 229795 213169 277810 290996 275352
11418 275352 260786 267693 297381 283499 272494 251000 272906 304378 304106 312438 321499 295559
11406B95559l2630j4025K2114p697j0577J8856m223k0660j4687j1074J2294m751
11394B28499M4088K0469l4646k8475J4461N745j5043M1668M5007k8668j7784j6394
11382B58927j1732p788k7193j1055J9542j3600l9992J6296J0616J8519K971k7208
11370A88303M873L235Q780J6932p927n421l8564j6544L2272L6953m153Q251J53
11357B27143k1382o63O995o697J3932M9258j4143l2645j1511L0841M497k3162
11345B22463J1977K0951N713J3570k3726k0492M9685M1350j055m524j048m0047
11333B74817o2832k5909k3348J7845O831J1209J7716q730k6779k5055j4359J144
11321A42550K2833M1684M0837J3213o589n889J7677m485q191j8874J8423M8496
$$ plain form
11406 295559 262929 248904 271018 263321 252744 271600 267377 246717 232030 220956 233250 228499
11394 228499 272587 293056 258410 229935 244396 250141 235098 276766 321773 293105 275321 258927
11382 258927 247195 239407 212214 201159 220701 207101 167109 183405 194021 212540 215511 188303
11370 188303 193176 196411 205191 222123 214196 208775 170211 153667 185939 222892 218739 226990 227143
11357 227143 205761 205098 212093 205396 219328 268586 254443 221798 210287 241128 245625 222463
11345 222463 234440 255391 261104 274674 250948 230456 280141 321491 320436 315912 314864 274817
11333 274817 211985 186076 162728 180573 187404 198613 216329 207599 180820 155765 141406 142550
11321 142550 165383 207067 247904 261117 254528 248639 266316 261831 253640 234766 253189 301685
11309C01685J5698O200l0183r457n301j2565N336j4767n577L7201j9252k4682
11297B44336K8130J0385j4565K417k2474j5617k150l3047l250J344R574j4771
11285A90312K6141k04J5491J9834j5717k2044l1036K3275K0249k6360n185q95
11273A93861J5760n1319k4473p986Q855j318p82J6646J5178r620L0217R674K6400
11260B21093J7195k8576p329J8755J45m6670l5119K033J1907Q310J0251j2968
11248A59027L45K753q011q939l0692J3200k1518M3648L4565l2450m363N534p873
11235A45226j3125K4901o321j6215N292j8075J3580q98k0241L058N551J7438k9165
11222A11006j3774n364R276j5288n15K5052J5634J1557l6656k7153L7059J965
$$ plain form
11309 301685 317383 323583 293400 283943 278642 266077 271413 256646 251069 288270 269018 244336
11297 244336 272466 282851 268286 270703 248229 232612 230462 197415 194165 195509 205083 190312
11285 190312 216453 216249 231740 251574 235857 213813 182777 206052 226301 199941 194756 193861
11273 193861 209621 158302 133829 125843 134698 133380 132598 149244 164422 154802 185019 194693 221093
11260 221093 238288 209712 202383 221138 221283 174613 139494 141527 153434 161744 171995 159027
11248 159027 159372 162125 154114 145175 114483 127683 106165 149813 184378 151928 147565 153099 145226
11235 145226 132101 157002 150681 134466 139758 121683 135263 134365 114124 117182 122733 140171 111006
11222 111006 97232 91868 101144 85856 85341 110393 126027 137584 100928 73775 110834 112799
11210A12799K0803K8797J116k4961L226N299P348m5316m3903M044L400L4753K6148
11197A33553R127L5739J3853l2002l3908m490k1316k6735K0781j8896j9334L7883
11185I4255L7061Q45K0106k8680k3893j5220J322j373K0785J7161k2107j1650
11173H8612M1279J2356L0541l3556k8778N58M209L1237k366o663j7152j5624L07
11160A04960J3014L7641p857r368J776J1816n4093l4845K8090K4052m9787k485
11148F2914J3490j0107O608K8974j9946j4899J1887N62K569J5294r661K4781n150
11135A07316P44P4M226o706K2369n568j9935J1133n652k5070l5335n933Q641J7362
11121F7666R359K3145K4938J031l2480k6637k2466J6560J0797K324K1858q875
$$ plain form
11210 112799 133602 162399 163515 138554 141780 147079 154427 109111 65208 69252 72652 107405 133553
11197 133553 142680 178419 192272 160270 126362 121872 100556 73821 94602 75706 56372 94255
11185 94255 131316 132161 152267 123587 99694 84474 85796 84423 105208 122369 100262 88612
11173 88612 129891 142247 172788 139232 110454 111012 115221 146458 144092 137429 120277 104653 104960
11160 104960 117974 155615 147758 138390 140166 151982 97889 63044 91134 115186 65399 62914
11148 62914 76404 66297 72905 101879 81933 67034 78921 79483 82052 97346 87685 112466 107316
11135 107316 108060 108134 112360 105654 128023 122455 102520 113653 108001 82931 47596 41663 50304 67666
11121 67666 77025 100170 125108 126139 93659 67022 44556 61116 71913 74237 96095 87220
11109H7220l1406J6939J7843m75k5914J0444M434k9783j3935N91P623j3019J8016
11096D8578O8051j0533k9861J3945L0056L3143p975j0047k2802m0810N350J5754
11084I2849q598J8764j902l3811q540Q993M1947K8741P672o800l591p7840j0191
11071D7693q908K1138M7132n712J7012n286j5239J375N276J2708m628J950P265
11058A21776p123l804J116K937J3980q874j3131O328l2090J8674J7313J3208m53
11045A29857K168J0434j0398k3411M7978K6313M3595j1372j4334j5458M651J9087
11033B09110J8977p385l38o224L3307J3822m922J4027O267j8187K483M6690o167
11020C01460j6824K8956J9688M5794J085k2334n002L2152J3581J409P058J9911
$$ plain form
11109 87220 55814 72753 90596 90121 64207 74651 79085 49302 35367 35958 43581 30562 48578
11096 48578 116629 106096 76235 90180 120236 153379 145404 135357 112555 71745 77095 92849
11084 92849 84251 103015 101113 67302 58762 67755 109702 138443 146115 139315 135724 57884 47693
11071 47693 38785 59923 107055 101343 118355 113069 97830 99205 104481 117189 112561 114511 121776
11058 121776 114653 110849 111965 114902 128882 120008 106877 113205 81115 99789 117102 130310 129857
11045 129857 132025 142459 132061 108650 156628 182941 226536 215164 200830 185372 190023 209110
11033 209110 228087 220702 220364 214140 247447 261269 256347 270374 276641 258454 260937 307627 301460
11020 301460 284636 313592 333280 379074 380159 357825 352823 384975 398556 399965 407023 426934
11008D26934j9377l3527o563N0009N8944L064l8720k5640l5839o291O7001J4712
10996D54707j5275q758J1938l6801n0599l6369l5934j2319p86l1287r121J1754
10984B41150J4524J892J5258M0479m5161m7680l7323J0243m998N91j0847k9745
10972A48383J4079Q037M0161R234j3049K3025J6452J287Q760m794k6768O335K8692
10959B59834j0294l5173O79L9288K5890m1049k6253k7998J0499K865M12J9847
10947B18547R844j0231q84J9214l9488k1374J4454j2590ML3939J6558k1184k8847
10934A77962o438J8603J1377K6862k4247J6199M455l0266j3195j3134K362j5999
10922A54541J755k563j7016P82J4972J7078J87J8639j1461k2742J2565r051j6398
$$ plain form
11008 426934 407557 374030 367467 417476 476420 479484 440764 415124 379285 372994 439995 454707
10996 454707 439432 430674 442612 405811 355212 318843 282909 270590 269804 238517 229396 241150
10984 241150 255674 257566 272824 313303 268142 220462 183139 193382 188384 188975 178128 148383
10972 148383 162462 170499 210660 219894 206845 229870 246322 247609 256369 251575 224807 231142 259834
10959 259834 249540 214367 215046 254334 280224 239175 212922 184924 195423 198288 198700 218547
10947 218547 228391 218160 217276 236490 197002 175628 190082 177492 177496 211435 227993 206809 177962
10934 177962 171524 190127 201504 228366 204119 220318 224773 194507 181312 168178 170540 154541
10922 154541 156296 153733 136717 137499 152471 169549 169736 188375 176914 154172 166737 157686 141288
10909A41288j6839J1408q061P423J1971m3776J327k8979L9954j2852j8730l8643
10897D5491J5906K0761n238j9137j7755K1687j3736K0614j8347K2011N8179K738
10885A33174k0532j1053r297n963O076j0625m1362k4436L9659L9373j6489l6797
10873D1728m1129l3520L24K7380L7925M367k1826k0328K1167O054K5915L797p687
10860D4167O164K8974Q418m4323j9061k0628J6360j2661j474K4917J5439k4868
10848B1424j2923l1617L8730K5307k4475m3387m233J1242M425J3076l4445Q620
10836b8256M6159N0470J3400j9581r860j9862m8150l2831L0529K8305L0482O47
10824D1452q541p243l0130k9929J9385J5110j2486K0201K0362m9070k7596J5512
$$ plain form
10909 141288 124449 135857 127796 135219 147190 103414 104741 75762 115716 102864 84134 45491
10897 45491 61397 82158 76920 57783 40028 61715 47979 68593 50246 72257 130436 133174
10885 133174 112642 101589 92292 86329 92405 81780 40418 15982 55641 95014 78525 41728
10873 41728 599 -32921 -32597 -5217 32708 37075 15249 -5079 16088 22142 48057 51854 44167
10860 44167 50331 79305 87723 43400 24339 3711 20071 7410 5936 30853 46292 21424
10848 21424 8501 -23116 15614 40921 16446 -26941 -31174 -19932 -15507 -2431 -36876 -28256
10836 -28256 17903 68373 81773 62192 52332 32470 -15680 -48511 -17982 10323 40805 41452
10824 41452 32911 25668 -4462 -34391 -15006 104 -12382 7819 28181 -20889 -48485 -32973
10812c2973J9955K7114J0075K2495M022j0969l2629r550K951K5892J2284m6152
10800g485q147l2593k26J8934o297r523K0555Q526K2034J964m682j384K992K1498
10786B6166l4569l836J9029j411J1338k8871p931M9845j6392k5901j855j6764
10774c1152j9880j0195p043O178K3605J6987J192k5952k7230M1153N7774k1411
10762D026L599K4057m22J1158l9270j884l739k3338R891J0486K521Q06l543j4333
10748a9985K0516k6285p15J912K5044J4292m5374k5955k4670k913K9409P890k2512
10735f9346J5256K0999m7580k913R35P078j6405k9006J1195L7422K1046j7674
10723f8993q144k1383K3276M5589J6675j3300K3383n413l7076k2875J9744J1058
$$ plain form
10812 -32973 -13018 14096 24171 46666 50688 39719 7090 -2460 491 26383 38667 -7485
10800 -7485 -15632 -48225 -48451 -29517 -35814 -45337 -24782 -16256 5778 7742 3060 1676 4668 26166
10786 26166 -8403 -12239 6790 5379 16717 -12154 -20085 29760 13368 -12533 -14388 -31152
10774 -31152 -51032 -61227 -68270 -62092 -38487 -21500 -20308 -46260 -73490 -32337 25437 4026
10762 4026 7625 31682 31260 42418 3148 1264 -2475 -25813 -15922 -5436 -2915 -2109 -5652 -19985
10748 -19985 531 -25754 -26469 -24557 487 14779 -30595 -56550 -81220 -84133 -54724 -46834 -69346
10735 -69346 -54090 -33091 -80671 -83584 -82649 -75571 -91976 -120982 -109787 -72365 -51319 -68993
10723 -68993 -77137 -98520 -75244 -29655 -12980 -26280 -2897 -8310 -45386 -68261 -48517 -37459
10711c7459j3638l2367K756k6450J8666J9300j305K6339k4129n760L362k18m2984
10698a13887K0272K6656k9846j4515j163L1095Q003J0858O476k0602j9524j6857
10686a13034k132m5399l1003M0995J7740k6608j9097j3646j1019k6605L0282L5977
10674a63549j96K586m468j4902j5150N7432p582j431K4555K3546o400j5011j6177
10661a36747l5336j0203N9956N9617j9937l5887m5705l4106o2M8876K1659k0678
10649a48553K4641M3547P043L127N5624K9782M991K7267J2032M4554K4454P0724
10637A99233Q7280J41809J27264J21455J20232J05931J78774J95911J41263J36967
10627A556119R1274Q7983K4084M3332K0543m2570r288j7711K1081J67478K98467
$$ plain form
10711 -37459 -51097 -83464 -80708 -107158 -88492 -69192 -70497 -44158 -68287 -74047 -70685 -70903 -113887
10698 -113887 -93615 -66959 -96805 -111320 -112483 -81388 -73385 -62527 -56051 -76653 -96177 -113034
10686 -113034 -115166 -160565 -191568 -150573 -132833 -159441 -178538 -192184 -203203 -229808 -199526 -163549
10674 -163549 -163745 -161159 -165627 -180529 -195679 -138247 -145829 -147260 -122705 -99159 -105559 -120570 -136747
10661 -136747 -172083 -182286 -122330 -62713 -82650 -118537 -164242 -198348 -198410 -149534 -127875 -148553
10649 -148553 -123912 -80365 -73322 -70195 -14571 15211 20202 47469 59501 104055 128509 199233
10637 199233 286513 428322 555586 677041 797273 903204 1081978 1277889 1419152 1556119
10627 1556119 1647393 1735376 1759460 1802792 1823335 1780765 1771477 1753766 1774847 1942325 2240792
10616B240792M06980O37939Q98203J181061J442435J609308J576154J351175J074625
10607A2418672O62642L14532J46103K71238O94511J334993K069730K739169L037023
10598B3688613K755059K122832J375199M80266m38722q38953n25778K61998J255830
10589C0136344K348886L298042L557224K876004J813166P17610o69609k063380
10581D2014287k596644k284849j504912o13931L42898R61398J069904O93056J1576
10572C8092783p27887j563480k378323k583168k285874j753869j205104p56506
10564B4838572m32671l74400n51484p36225j008376j353890j647416j685824j566709
10555A5481577j400646j204159j060470j001445q21048p08700o04468m78138m71912
$$ plain form
10616 2240792 2647772 3285711 4183914 5364975 6807410 8416718 9992872 11344047 12418672
10607 12418672 13081314 13395846 13541949 13813187 14507698 15842691 17912421 20651590 23688613
10598 23688613 26443672 28566504 29941703 30421969 29983247 29144294 28618516 28880514 30136344
10589 30136344 32485230 35783272 39340496 42216500 44029666 44747276 44077667 42014287
10581 42014287 39417643 37132794 35627882 35013951 35356849 36318247 37388151 38081207 38092783
10572 38092783 37364896 35801416 33423093 30839925 28554051 26800182 25595078 24838572
10564 24838572 24405901 24031501 23480017 22743792 21735416 20381526 18734110 17048286 15481577
10555 15481577 14080931 12876772 11816302 10814857 9993809 9285109 8680641 8202503 7730591
10546G730591m60479l51181k81988k93422k85882k67624k29788j74266r6646j70556
10536E118759j82413j79767j88950j36623j02179j03394j21532j40619j04164
10527C859118r4664j14706r7065q5299j00937o9860n7813j06418o5398m6230q8537
10516B932191p2636k6514q4426p6016l3128l0286j9281l8916r5461q5063m8514
10505B321950k3096m6490n2594n0897l5791m2943j0863o4032l0844l4255n863
10494A924282l6441k9489m4836o135o15j6367p6697j6084j4159n4177n6617j0319
10482A562346j8056l7303p2269p3991m9796j2466O200m6394m3373j792k2606j3867
10470A176633M939j4298k3036n5880m2303R12j4103q026k8028l1203m2110l2213
$$ plain form
10546 7730591 7270112 6918931 6636943 6343521 6057639 5790015 5560227 5385961 5289315 5118759
10536 5118759 4936346 4756579 4567629 4431006 4328827 4225433 4103901 3963282 3859118
10527 3859118 3764454 3649748 3552683 3467384 3366447 3296587 3238774 3132356 3066958 3020728 2932191
10516 2932191 2859555 2833041 2748615 2672599 2639471 2609185 2589904 2550988 2455527 2370464 2321950
10505 2321950 2298854 2252364 2199770 2148873 2113082 2070139 2059276 1995244 1964400 1930145 1924282
10494 1924282 1887841 1858352 1813516 1807381 1806766 1790399 1713702 1697618 1683459 1629282 1572665 1562346
10482 1562346 1544290 1506987 1434718 1360727 1310931 1298465 1304665 1258271 1214898 1213106 1190500 1176633
10470 1176633 1181572 1167274 1144238 1088358 1046055 1046967 1032864 1024838 996810 965607 923497 891284
10458H91284K3732J6940k1604l9051l5161J2578k5402k2727j8383J3459J3656
10447H09321m998j6050n750j9108j6541J5168L4868L6944L4898J2778L71J7886
10435H99787l5381J4362l6830k6335m2890j5734j0055K2465j4265p9054o1814
10424F14256J0520o6946n4392k8339O806l345J4250P60l6478k1169O268m3031
10412C99160k137J0060l7229r426K0306J299k9015j8260j5920J483j6014r2J0532
10399C14747l8652k2302K3205K5969j3982J4993J2616J073k1325k5958M467j8288
10387B56563J2199l236k5126Q045K1908j1523k0373r791Q577J212q890J6194Q400
10374B54159k8204k8442n376J8209P008J629l179j8303n324k158j1566M827J6107
$$ plain form
10458 891284 915016 931956 910352 871301 836140 848718 823316 800589 782206 795665 809321
10447 809321 804323 788273 782523 763415 746874 762042 796910 833854 868752 881530 881901 899787
10435 899787 864406 878768 841938 815603 772713 756979 746924 769389 755124 676070 614256
10424 614256 624776 557830 503438 475099 481905 478560 492810 493570 457092 435923 442191 399160
10412 399160 397023 407083 369854 360428 380734 382033 353018 334758 318838 320321 304307 304215 314747
10399 314747 276095 253793 276998 302967 288985 303978 316594 317667 296342 270384 274851 256563
10387 256563 268762 265526 240400 248445 270353 258830 238457 228666 237243 238455 229565 245759 254159
10374 254159 225955 197513 192137 210346 217354 218983 215804 197501 192177 190019 178453 183280 199387
10361A99387J1839Q357k7704l9364l2449L3337k0017m7034L8368K6790K7150l0597
10349A48063l9296J1182M1268J0953K0506K0041q436r908j5584J6705L4114o605
10337B23003k0866k3607k1270N336J2921r286m2292J7698K4338o85k5347l4878
10325A05065J9267J621J9953l8088o937j8886o909K9157k3962j8436K9498J5656
10313A06999j8163K286m387O144m1314k1310J6028J4184k4978k3613L0674Q655
10301E1205Q246j4102K4963J6232p180k7469o2591j4707M3998O69k4182J5950
10289A1032P088J853K1472j1634j1174K4837O914L050j1955P160k5936l3415L3628
10276B2920k810k3249K7304l25j0435K1928J8553l4071j7722Q892K3006L9268
$$ plain form
10361 199387 211226 219583 191879 152515 120066 153403 133386 86352 124720 151510 178660 148063
10349 148063 108767 119949 161217 172170 192676 212717 204281 194373 178789 195494 229608 223003
10337 223003 202137 178530 157260 162596 175517 166231 123939 141637 165975 165290 139943 105065
10325 105065 124332 125953 145906 107818 100881 81995 75086 104243 80281 61845 91343 106999
10313 106999 88836 91122 86735 92879 51565 30255 46283 60467 35489 11876 42550 51205
10301 51205 59451 45349 70312 86544 79364 51895 -10696 -25403 18595 19264 -4918 11032
10289 11032 18120 19973 41445 29811 18637 43474 50388 53438 41483 48643 22707 -10708 22920
10276 22920 20110 -3139 24165 23840 13405 35333 53886 19815 2093 10985 33991 73259
10264G3259j971R148p256j7025k2787J582K972k0162K0877j3843k0865n92n663
10251b326L1773j051j5889m0048m06M6070N0793k9738p7532n3483J3583m418k2938
10238a05610L0827K4717M490K4987K851L1686K501m9509n621L306K0981K5605
10226A1211J1424J3959j3028r120O180m694k5119j7778o99J9744o174J0599J8469
10213A4974K5164j4716j7314k943k6302K010J9898K4934j3006l7469k692K4094
10201c368J8940J4300O811L7522k539l8282l7322J6516K8254k0196j5170J7472
10189B2938K3187l448K5768j4257j9810n2037p435j3686k239M3191J5544m6481
10177b8765L4475K3764m1838J3551O3221M6858J9534j7899J6561q773n0935j5583
$$ plain form
10264 73259 71288 80436 73180 56155 33368 34950 37922 17760 38637 24794 3929 3337 -2326
10251 -2326 29447 28396 12507 -27541 -27947 18123 68916 39178 -38354 -91837 -78254 -82672 -105610
10238 -105610 -74783 -50066 -45576 -20589 -17738 13948 16449 -33060 -38681 -35375 -14394 11211
10226 11211 22635 36594 23566 14446 20626 15932 -9187 -26965 -27664 -7920 -14094 -3495 14974
10213 14974 40138 25422 8108 5165 -21137 -19127 771 25705 12699 -24770 -27462 -3368
10201 -3368 15572 29872 36683 74205 71666 33384 -3938 12578 40832 20636 5466 22938
10189 22938 46125 42677 68445 54188 34378 -17659 -25094 -38780 -41019 2172 17716 -28765
10177 -28765 5710 29474 -12364 1187 64408 111266 130800 112901 129462 120689 69754 54171
10165E4171K8612q906q311K2564j3917r033L5317K145K7609N257R740J0613J0032
10152A65893J9414K6714J5362N513k907O34k5336j8538m562J6740q484J823K4341
10139B16607J2215K861n579k551l0299o9549k5222J9670N211R478N282j0806o1077
10126F6241L445J3786L2962M058j2272j227j0414m755k3892J336R555q570k1849
10113D8404N52M57q54K1743o299m9895j7193Q242m016N4232p523L375J4412K6004
10099I1641M872j3049k3178n666P038M158k017Q637L1317m966r700m2796K0041
10086F6332M4842j3887n3108l742K4939M153k0697l2721k5823J8763K5824q41
10074C4034L541J0129j6559l5946k3289j994J8284L1791r579J6007J5057l2989
$$ plain form
10165 54171 82783 73877 65566 88130 74213 65180 100497 102642 130251 135508 145248 155861 165893
10152 165893 185307 212021 227383 232896 229989 230623 205287 186749 182187 198927 190443 192266 216607
10139 216607 228822 231683 226104 223553 193254 123705 98483 118153 123364 132842 138124 127318 66241
10126 66241 69686 83472 116434 120492 108220 106993 96579 91824 67932 69268 78823 70253 48404
10113 48404 48956 49413 48559 70302 64003 14108 -3085 5157 1141 55373 47850 51225 65637 91641
10099 91641 96513 83464 60286 54620 61658 65816 63799 72436 103753 98787 89087 46291 66332
10086 66332 111174 97287 44179 40437 65376 69529 48832 16111 -9712 9051 34875 34034
10074 34034 37575 47704 31145 -4801 -28090 -30084 -11800 19991 10412 26419 41476 8487
10062H487j6528l8564j9153M0442K4755J8408J9599n109N700J0660l135J1728
10050E7290k177m0678L5058L0422M3032K5844j6356M192j1896j6309j4087j2786
10038H1549k3130k6742J0596N69j2802J168k0364k277K039K4159K6487M763K6865
10025I2880m0794q402L1378j722j5415j1528K0591k9588K4042j9085l3919k1331
10013a2893o058L1030O719k2542J5480n692p541K5536N177l4511k2645l8643j69
10000f6752J7170L1520K0224l247J4705J1919J0295l657j2101j0146M404m6285
9988c1951k6273K1725L4760k7817r213J8370N799K2594k4949p348j1465l9379
9976g5147K6448o278j3252L4572K9090l0454k8676R493J2649L090o494J992M5757
$$ plain form
10062 8487 -8041 -46605 -65758 -25316 -561 17847 37446 32337 38037 48697 45562 57290
10050 57290 55113 14435 49493 79915 122947 148791 132435 136627 124731 108422 94335 81549
10038 81549 58419 31677 42273 42842 30040 31208 10844 8567 10606 34765 61252 66015 92880
10025 92880 52086 43684 75062 73340 57925 46397 66988 37400 61442 42357 8438 -12893
10013 -12893 -18951 12079 18798 -3744 11736 6044 -1497 24039 29216 -5295 -27940 -66583 -66752
10000 -66752 -49582 -18062 2162 -1085 13620 25539 35834 32177 20076 9930 14334 -31951
9988 -31951 -58224 -36499 -1739 -29556 -38769 -20399 -14600 7994 -16955 -24303 -35768 -75147
9976 -75147 -48699 -54977 -68229 -33657 -4567 -35021 -63697 -54204 -41555 -38465 -44959 -42967 2790
9963B790L5969n4742j3946J6193q652M813J7888J0295J0351k3272m3857R151R286
9950b7733j9606j269n216O325j0391k2502j2666Q535M1532J0871j9179l4318J7427
9937f8190K8755J1209j9498n0447j1365M7927J4474j2685L920L6687J0382k3148
9925c1979o1696k3231K6019N2025J7996j8588l037R239J721J4015J8648J4716
9913A5848p565K7967M2513N3953J0790j6959N4573O3168J24225K10315M94189
9902A073017R65871J046047M06978J68602L49640j58249q69709o72639m06424
9893A903134k20670k08791k14295k12648j48596j35252q7802o2134q9594q5090
9883D38262m0125n1940l6378j2045k434j8492k0912m3777j8272M5620M86q392
$$ plain form
9963 2790 38759 -15983 -29929 -13736 -22388 -17575 313 10608 20959 -2313 -46170 -37019 -27733
9950 -27733 -47339 -48608 -53824 -47499 -57890 -80392 -93058 -84523 -42991 -32120 -51299 -85617 -68190
9937 -68190 -39435 -28226 -47724 -98171 -109536 -61609 -47135 -59820 -55900 -19213 -8831 -31979
9925 -31979 -93675 -116906 -90887 -38862 -20866 -39454 -42491 -33252 -31531 -17516 1132 15848
9913 15848 8283 36250 78763 132716 143506 126547 181120 244288 368513 578828 1073017
9902 1073017 2038888 3084935 3491913 3660515 4010155 3851906 2982197 2309558 1903134
9893 1903134 1682464 1473673 1259378 1046730 898134 762882 675080 612946 523352 438262
9883 438262 398137 346197 309819 297774 295340 276848 255936 212159 193887 239507 239993 231601
9871B31601j6081k9014o3084l7088K2867M4128L0462k7760m0536K0880l6336j0674
9859H9365j3836j8079J2165l745j4179J9849J9965m215k8978j4541k4519k1043
9847a791Q923K5990k2572l9939n299l3153N2J9069j861K5783N5483J0288m4806
9834c833j7573l3506K8618o487J2993N442m567p713k229J0706J1106L602J4761
9821A1320q254k2933J3607R590j7442p67M831k8791m051L5766J998j186N479k6186
9807b7019l3362K657k374k0918J8450K0782j769K3314K3722j9347k9786Q569j1822
9794d8903k6337J2118L9108L6497k0370j1373K0731J8173N26l7738l0068K6404
9782b1232J2097K2474j9644m3423N609L711j2751q541O779Q067j4706k3785J5968
$$ plain form
9871 231601 215520 186506 123422 86334 109201 153329 183791 156031 115495 136375 100039 89365
9859 89365 75529 57450 69615 65870 51691 71540 91505 87290 58312 43771 19252 -1791
9847 -1791 7132 33122 10550 -29389 -34688 -67841 -67789 -48720 -50581 -24798 30685 40973 -3833
9834 -3833 -21406 -54912 -26294 -32781 -19788 -14346 -18913 -26626 -28855 -18149 -7043 -3441 11320
9821 11320 3066 -19867 -6260 3330 -14112 -14879 -10048 -38839 -42890 -7124 -5126 -6312 -833 -27019
9807 -27019 -60381 -57724 -60098 -81016 -62566 -41784 -43553 -20239 3483 -15864 -45650 -37081 -48903
9794 -48903 -75240 -63122 -24014 12483 -7887 -19260 1471 19644 20170 -17568 -47636 -21232
9782 -21232 -9135 13339 -6305 -49728 -44119 -40408 -53159 -61700 -54921 -46854 -61560 -85345 -69377
9769f9377K1187k589J098j8108k1817o633n107J2377L5057q098J6177J8395l5277
9756f2715k6939O394L0172q440m4996M819M1011J7331J981L0870J8324j2575k3934
9743b8697l3037N40k278l575J162j094q767l48O564K9749j5160j1059k8764J4323
9729h0441j5825M396K3143L7236k6570j1392j4967j9702K1774r512J1430k6976
9717a07406K2944M3318M3053j4570l6037m6904n107o693l3132k6676N0817L2826
9705h3567k0443J3167K9084O955j3620j2488K429K1921M398K5K930k1246k7754
9692i8209k626P263q64Q2l0141K6706P723P919J7530J247J1498L3443j0752n195
9678c4376k8362k8296k6462L1231n00N577Q362j8430J9522J2241j3359J9430k1161
$$ plain form
9769 -69377 -48190 -50779 -49681 -67789 -89606 -96239 -101346 -88969 -53912 -62010 -45833 -27438 -62715
9756 -62715 -89654 -83260 -53088 -61528 -106524 -101705 -60694 -43363 -41382 -10512 7812 -4763 -28697
9743 -28697 -61734 -61194 -63472 -67047 -65885 -66979 -75746 -76094 -69530 -39781 -54941 -66000 -94764 -80441
9729 -80441 -96266 -91870 -68727 -31491 -58061 -69453 -84420 -104122 -82348 -91860 -80430 -107406
9717 -107406 -84462 -41144 1909 -12661 -48698 -95602 -100709 -107402 -140534 -167210 -116393 -83567
9705 -83567 -104010 -90843 -61759 -54804 -68424 -80912 -78483 -56562 -52164 -52139 -49209 -70455 -98209
9692 -98209 -100835 -93572 -94436 -94354 -124495 -97789 -90066 -82147 -64617 -63370 -51872 -18429 -29181 -34376
9678 -34376 -62738 -91034 -117496 -86265 -86765 -81188 -72826 -91256 -71734 -59493 -72852 -53422 -74583
9665g4583j0913j9222k9033K18K5893K103O584j0110k2394J5039M4744J333l3721
9652a04062L388L0382J5395J901J0372j3567j1175M307K1260P136j6601j7754
9640f9018o711j4074R582K8605J2806L8761j2870n7151K3071R188r254l9048J5787
9627g0326j0882l4548m7876K2026M7682L2742j1300j1280K7319K0268j7438k9774
9615h3387j3603K7469L9819k5328k3480l3386J6727L7055K901J792j8351P522
9603f4250j507l0993K6501K5178k79n174J0991k3101k2742N845J3977R813J2059
9590d3682k0932j3803j5711k1293k0094P242J7813j9405L2439K9032J1210J2005
9578d5179K2070J6719J941J0498p2895m5550k015o544J3681M8676K3522l0037
$$ plain form
9665 -74583 -85496 -104718 -133751 -133533 -107640 -105537 -98953 -109063 -131457 -116418 -71674 -70341 -104062
9652 -104062 -100674 -70292 -54897 -52996 -42624 -56191 -67366 -63059 -41799 -34663 -51264 -69018
9640 -69018 -75729 -89803 -80221 -51616 -38810 -49 -12919 -70070 -46999 -37811 -47065 -86113 -70326
9627 -70326 -81208 -115756 -163632 -141606 -93924 -61182 -72482 -83762 -56443 -36175 -53613 -83387
9615 -83387 -96990 -69521 -29702 -55030 -78510 -111896 -95169 -58114 -55213 -53421 -71772 -64250
9603 -64250 -65757 -96750 -70249 -45071 -45350 -50524 -39533 -62634 -85376 -79531 -65554 -55741 -43682
9590 -43682 -64614 -78417 -94128 -115421 -135515 -128273 -110460 -129865 -97426 -68394 -57184 -45179
9578 -45179 -23109 -6390 -4449 6049 -66846 -112396 -114411 -120955 -107274 -58598 -35076 -65113
9566f5113j6421l7297N298O5341M1434l0505j4674N123j5243q163k7467j5653
9554a13340j5939K1421N1878N862J9795L3890l946l7613j7552j4716k6591M1129
9542e5722O5256p394l5612J5897q263m0716p565L6545j4373n5804j46L1523M15
9529g5959L1999k567l0236l4335j0019k0386j6073k576Q589R674l883l5258n400
9516a86430K4540K0119K8241P520n0761k2689K8552J9082O6713K4408j8445k5550
9504h4700K0442L185L414J1596m2320n458p870p463j325M0130J6925l8710j1752
9491a03906L2670Q514M4645L1095J8091k4262n4004o7066l3776L3969L1144J0698
9479g2188J411j6443J3206M5293Q129p2338k2330J8952J1728J8504l1504p341
$$ plain form
9566 -65113 -81534 -118831 -113533 -48192 -6758 -37263 -51937 -46814 -62057 -70220 -97687 -113340
9554 -113340 -129279 -107858 -55980 -50118 -30323 3567 -379 -37992 -55544 -70260 -96851 -55722
9542 -55722 9534 2140 -33472 -17575 -25838 -66554 -74119 -37574 -51947 -107751 -107897 -76374 -75959
9529 -75959 -43960 -46527 -76763 -111098 -121117 -141503 -157576 -160152 -151563 -141889 -145772 -181030 -186430
9516 -186430 -161890 -141771 -113530 -106010 -156771 -179460 -150908 -131826 -65113 -40705 -59150 -84700
9504 -84700 -64258 -61073 -57659 -46063 -88383 -93841 -101711 -109174 -110499 -70369 -53444 -92154 -103906
9491 -103906 -71236 -62722 -18077 13018 31109 6847 -47157 -114223 -147999 -114030 -82886 -72188
9479 -72188 -70777 -87220 -74014 -28721 -20592 -92930 -115260 -96308 -84580 -66076 -97580 -104921
9467a04921l406o48M101J987K6167L2134j0925m514j2608R870M3479R244k5763
9454c5803j0404k1234k2641K0786N75J8935l8335k3955L0147L6668j0201k1331
9442g6793L862p547L2855R209n0515j2493L6203N43k870J7039k0352J1641L9900
9429a9318L5358K8102l2793K9468J14456J73292J75969J77557J93699J56394J19164
9418A151348L7360K8393k7860q0724r1427j10114j29271j17985r6779o6672l5481
9407D60788n7564p6640m6726p4760j8966n768k4360k7907p862l3901n06M564k165
9394H8227l9715j2043k2695J12l4389m1413K3766M6527Q188p494j061l2j6324
9381h346k7685R488k4733L051J0160J5702l2449J0525J859J9925L7235l477m6261
$$ plain form
9467 -104921 -108327 -108975 -104874 -102887 -76720 -44586 -55511 -60025 -72633 -62763 -19284 -10040 -35803
9454 -35803 -46207 -67441 -90082 -69296 -68721 -49786 -88121 -112076 -81929 -45261 -55462 -76793
9442 -76793 -72931 -80478 -47623 -38414 -88929 -101422 -65219 -64676 -67546 -50507 -70859 -59218 -19318
9429 -19318 16040 44142 11349 40817 155273 328565 504534 682091 875790 1032184 1151348
9418 1151348 1188708 1217101 1189241 1108517 1017090 906976 777705 659720 562941 496269 460788
9407 460788 403224 326584 279858 205098 186132 180364 156004 128097 120235 86334 85828 90392 88227
9394 88227 48512 36469 13774 13886 -20503 -61916 -38150 8377 16565 9071 8010 7978 -8346
9381 -8346 -36031 -26543 -51276 -48225 -38065 -22363 -54812 -44287 -42428 -22503 14732 11255 -35006
9368c5006j3547Q945q258k5519l7570K5681L9469n82M971L2256m9827l4665L233
9355i0419Q574p918j3612p977J8952J0959o688L356L041R120K0229L2563L1331
9342A1511k4226m4296l1026L4104o906k0064O489P2627M2485k7688k0713j2886
9330b0589L1935k6328J2009K0807l8196l9654L3292L6544j4893j852K6513l4029
9318a4441m4395q330L706J1786K867k5438p68L1990J3216l2838L615K2642M0341
9305C953P405P0j0756l7320j6177j73k6349K5255p976r850J5470j0558J5932j3253
9291f4327L5629r985m3345n4278K995M294N8396l2075K54J6793K8120J5181k8845
9278g1193j2235q488k5681r890J4209O6948P0501J7455o54k8044m6565l3961K5568
$$ plain form
9368 -35006 -48553 -39608 -47866 -73385 -110955 -85274 -45805 -46387 -41416 -9160 -58987 -93652 -90419
9355 -90419 -81845 -89763 -103375 -111352 -92400 -81441 -88129 -84773 -81732 -72612 -52383 -19820 11511
9342 11511 -12715 -57011 -88037 -53933 -60839 -80903 -74414 -1787 40698 13010 -7703 -20589
9330 -20589 11346 -14982 -2973 17834 -20362 -60016 -26724 9820 -5073 -6925 19588 -14441
9318 -14441 -58836 -67166 -63460 -51674 -48807 -74245 -75013 -43023 -29807 -62645 -59030 -36388 3953
9305 3953 11358 11428 672 -36648 -52825 -52998 -79347 -54092 -62068 -71918 -56448 -67006 -51074 -64327
9291 -64327 -28698 -38683 -82028 -136306 -133311 -129017 -70621 -102696 -102442 -85649 -57529 -42348 -71193
9278 -71193 -83428 -91916 -117597 -127487 -113278 -46330 24171 41626 40972 12928 -33637 -67598 -42030
9265d2030K0947J1248l3152m5395j1183L9219J8986n908n445l8102R600J9687
9253f1528L8607l0881j1661M1720j9492m2274K3515J7875R342l5636j0094M3587
9241c6920J4859j8736m3085j4591O195J444R617K4469p545o370J9556p235j7479
9228g5821K436m2079o829j0943o984j1252P4762J0386k0082J2925R059J558J2265
9215e0599o5066j4663Q0121M0482l6719p06J6525k4303l4182J4777m772J1833
9203f7272J506j9910P663J2235M825J5230j2986l4298L363M0876M4834M5208r742
9190C1532m4064k9839N966K0206K8377k148k9962P194K413n222J0481o619l9218
9177e0903K5967J6597j428j8822L8417K0377l3122m7051j9761l0390j87J4640
$$ plain form
9265 -42030 -21083 -9835 -42987 -88382 -99565 -60346 -41360 -47268 -52713 -90815 -81215 -61528
9253 -61528 -22921 -53802 -65463 -23743 -43235 -85509 -61994 -44119 -34777 -70413 -80507 -36920
9241 -36920 -22061 -40797 -83882 -98473 -92278 -90834 -81217 -56748 -64293 -70663 -51107 -58342 -75821
9228 -75821 -73385 -115464 -122293 -133236 -140220 -151472 -76710 -66324 -86406 -73481 -64422 -62864 -50599
9215 -50599 -115665 -130328 -50207 -9725 -46444 -47150 -30625 -54928 -89110 -74333 -79105 -67272
9203 -67272 -65766 -85676 -78013 -65778 -60953 -45723 -58709 -93007 -89644 -48768 -3934 41274 31532
9190 31532 -12532 -42371 -36405 -16199 12178 10030 -19932 -12738 -10325 -15547 -5066 -11685 -50903
9177 -50903 -24936 -8339 -9767 -28589 9828 30205 -2917 -49968 -69729 -100119 -100306 -85666
9165h5666L9346M0169K7366m502L4915R93n6488k0662M1041Q691n879K864n320
9152A6868N9174N1305n0551k3452L3944N45O775L2048j6051l7698l2143q742O108
9139C8130R009K0552m366n829k0794q881R027L4602L7267J7572m466m500o017
9126A11306n887L5908j7933K8185J6031r350m1422l7432J5803J8695J9087J0630
9114A43621k0746R1j0295J8413L0903J6414K1602j1189J3947N9275L5527j398
9102B96165k9814N822K3828J2889k1702K5117N8129L1479J8563O76J6187J9438
9090D56777K9937J539q827L8478M2931j316J2214L9999L9736K5685N737J7557
9078G00447J7531o076O296J7732j4661m0876N2955N273j9085j4313j3678j7975
$$ plain form
9165 -85666 -46320 -6151 21215 16713 51628 52621 -3867 -24529 16512 25203 19324 22188 16868
9152 16868 76042 127347 76796 53344 87288 87833 94608 126656 110605 72907 40764 32022 38130
9139 38130 47139 67691 63325 57496 36702 27821 36848 71450 108717 126289 121823 117323 111306
9126 111306 105419 141327 123394 151579 167610 158260 116838 79406 95209 113904 132991 143621
9114 143621 122875 122966 112671 131084 161987 178401 200003 188814 202761 262036 297563 296165
9102 296165 266351 272173 296001 308890 287188 312305 370434 401913 420476 421152 437339 456777
9090 456777 486714 488253 479426 517904 560835 559519 571733 611732 651468 677153 682890 700447
9078 700447 717978 711902 718198 735930 721269 680393 733348 738621 719536 705223 691545 673570
9066F73570k7631m1779k4830M2535L5800M9398l7584l2887n64j0093k941l4509
9054E88485m2413j9475K9903J6083K915Q810k0177P225J6714K1600k8318l9183
9042E42169k1819j4386M8679L6618L9332J41m4428l6276j9407p104k1971J034
9030E02582M4330L6937j8193q315K0371L1499j5890m3773j3190p92j7777k3916
9018D93873k2324j2327m522J2164n66R51N328j3134j1350k3609l3229j7606P110
9005C80759m846l2207J709j897q266M200l6140k8834L1838K4973K1508j6434k4842
8992C11521j9436j2677P365k1407k4141l418M5448Q620m5654j763J3092l4948
8980B22602m9367k0804L1699O282k1038k6132j3471l105J7659J1624M7419K0137
$$ plain form
9066 673570 645939 604160 579330 621865 657665 707063 669479 636592 636028 625935 622994 588485
9054 588485 546072 526597 556500 572583 575498 584308 564131 571356 588070 609670 581352 542169
9042 542169 520350 505964 554643 591261 630593 630734 586306 550030 530623 523519 501548 502582
9030 502582 546912 583849 565656 557341 577712 609211 593321 549548 536358 535566 517789 493873
9018 493873 471549 459222 454700 466864 466298 467249 472577 459443 448093 424484 391255 373649 380759
9005 380759 375913 343706 345415 343518 335252 339452 303312 274478 306316 331289 352797 336363 311521
8992 311521 292085 279408 286773 265366 241225 237807 283255 291875 246221 244458 257550 222602
8980 222602 173235 152431 184130 190412 169374 143242 129771 126666 144325 155949 203368 223505
8968B23505m4777m4214j3135J7545K6865j4072l3285l3294l5538K4752M1157J2585
8956A28094k9530R830j859K5477K3617j2534m8698k6334M748j9462K920M7764
8944A04033L9748L0388r864j3236l301l4671k8175q71q043j4545j326J8776M990
8931H3903O026Q829N26j372K905l2420k2739M2871L3080l761k4376j6929r0j0989
8917F5464P509j4449J5650J6374j5957K9540K2923J112j5712k5936N659L87k7525
8904F5039k3488l584L5138N3281J6933k8001k2113Q300M838m6790j4313K5N895
8891E1160M1081M8694j4175l2663p686k7134k5005J3966J5354q738j7360J5600
8879E3094L257J7372K5552O342r822k5039j2665l571M3842K0048k5982o205p225
$$ plain form
8968 223505 178728 134514 121379 138924 165789 151717 118432 85138 49600 74352 115509 128094
8956 128094 98564 108394 106535 132012 155629 143095 94397 68063 72811 53349 56269 104033
8944 104033 143781 174169 164305 151069 147768 113097 84922 84051 76008 61463 60137 78913 83903
8931 83903 89929 98758 99284 97912 100817 68397 45658 88529 121609 117848 93472 76543 76453 65464
8917 65464 72973 58524 74174 90548 74591 104131 127054 128166 112454 86518 92177 92564 65039
8904 65039 41551 37967 73105 126386 143319 115318 93205 101505 106343 59553 45240 45265 51160
8891 51160 92241 140935 126760 94097 86411 59277 34272 48238 63592 54854 37494 53094
8879 53094 56351 73723 99275 105617 95795 70756 58091 54520 98362 118410 92428 86223 78998
8866G8998j990J7644P340J9147k9129m2622N5989j4715j33l9847j9176L0023L2604
8853I4133k970r964r210j6775j0747L6300J0171L310j7430l1781l4705l098L9582
8840D6816m423p343j2273J295O888R863R526J9055k6790p936J5888Q918k3960
8827C5524L0420J8041k5447J6443J6858j6594j6243M758j1960k5240l7803j833
8815a3076k868L7282J2954K802j036J1183r808k4403J223K0086L8877N375l1892
8802D6699Q907K2522k7799l799j0468m1316k8242N604J6060M3832K886k2581l5082
8789b2777O834m710k266K6850M562J1266K0663o865j6628k1096o9J5849l53l0354
8775a9094J1869J8234j514m356j7584J3214m793l1142r812k934J8918R343L3841
$$ plain form
8866 78998 77008 94652 101992 121139 92010 49388 105377 90662 90529 50682 31506 61529 94133
8853 94133 91163 81199 71989 55214 44467 80767 90938 94248 76818 45037 10332 7234 46816
8840 46816 42393 35050 22777 24072 30960 40823 50349 69404 42614 34678 50566 59484 35524
8827 35524 65944 83985 58538 74981 91839 75245 59002 63760 51800 26560 -11243 -13076
8815 -13076 -15944 21338 34292 37094 36058 47241 37433 13030 14253 34339 73216 78591 46699
8802 46699 55606 78128 50329 46530 36062 -5254 -33496 -27892 -11832 32000 34886 12305 -22777
8789 -22777 -15943 -20653 -22919 3931 8493 19759 40422 33557 16929 -4167 -4236 11613 11260 -19094
8775 -19094 -7225 11009 9495 5139 -12445 769 -4024 -35166 -44978 -47912 -28994 -19651 14190
8762A4190J3166K1454k5699m7121p895p12L0329J1743N954K6050L675j8773N019
8749C1380K4422j9981J4465j6933j687J6024k4277m7732l3528J0239J2037J9888
8737a5683J2412k7539j3908Q723L8496j7637k0586J6513n052J3634J9307p03k0569
8724a2592j4656K1054p083K453o534l698J5592R075j1808k8447L2213J0808p355
8711i78o1446L897K2449O97m200M3086J1928j2454K67k833q233Q675M029j2107
8697g223j3165k04J3994n801l1693m7040K9567J5137O840n983k0296J2984k594
8684e5477N748L7787J5500M423k0105p100j0258L450j0967m9260J7468M6603M5351
8671B3163n3326m3104o309K4428M7086J9310M903j9174k712p578J1218J4761L1903
$$ plain form
8762 14190 27356 48810 23111 -24010 -31905 -32617 -2288 9455 15409 41459 45134 26361 31380
8749 31380 55802 35821 50286 33353 31666 47690 23413 -24319 -57847 -47608 -35571 -15683
8737 -15683 -3271 -30810 -44718 -35995 2501 -15136 -35722 -19209 -24261 -10627 8680 7977 -12592
8724 -12592 -27248 -6194 -13277 -10824 -17358 -21056 -5464 3611 -8197 -36644 -4431 6377 -978
8711 -978 -62424 -58527 -36078 -35381 -39581 3505 15433 2979 3246 413 -7820 855 4884 -7223
8697 -7223 -20388 -20592 -6598 -12399 -44092 -91132 -61565 -46428 -39588 -45571 -65867 -52883 -55477
8684 -55477 -49729 -11942 3558 7981 -12124 -19224 -29482 -26032 -36999 -86259 -68791 -22188 23163
8671 23163 -30163 -73267 -79576 -55148 -8062 11248 16151 -3023 -5735 -13313 -2095 12666 44569
8658D4569N673k1759l1419M2146K7661L697j6220j2802J7182k7939L63K0039j1451
8645C9740L1006L189k1208j7634J6044J400l5488K0693K2424N367N34K7685O896
8632A00648j7240m341n301k042J026L6615K2816l4211P58j4038k7554p30L6173
8619I2579K0069n582n585r080q361J6731J0125M91q570j6508J0667k653j1047
8606H3276K5676j5536R164l2470p745L5244n509K9422L1510j5963J4903L5519
8594A87491K4098j3860j5725K5690l353j0771N4002K5634l7600j2536J9507K0449
8582B63026j904L4468K6410L8312L0162R841J5880M2170L6527L7768L3394J4234
8570E80288j1996j7808K1749l0204L242k345p8302k0138k7286K3657j0521k3205
$$ plain form
8658 44569 50242 28483 -2936 39210 66871 70568 54348 41546 58728 30789 31152 51191 39740
8645 39740 70746 73935 52727 35093 51137 52537 17049 37742 60166 65533 66067 93752 100648
8632 100648 83408 79067 73766 71724 72750 109365 132181 97970 98728 84690 57136 56406 92579
8619 92579 112648 107066 101481 92401 84040 100771 110896 111387 102817 86309 96976 94323 83276
8606 83276 108952 93416 102580 70110 62365 97609 92100 121522 153032 137069 151972 187491
8594 187491 211589 197729 182004 207694 204341 193570 247572 273206 235606 223070 242577 263026
8582 263026 261122 295590 322000 360312 390474 400315 416195 458365 494892 532660 566054 580288
8570 580288 568292 550484 572233 542029 545271 542926 464624 444486 417200 440857 430336 407131
8558D07131j2821q810j1284K640q699m3769j7168m726j3611p480L5718j0522j5346
8545B91253L30j3193j9287j9963j5593J0774q066Q678J9934r836K2446J9840j5155
8532B72162R784r371o921q146q449r809N3204L361k5823j0924j3187J2046j6728
8519B41199l3545k555M4994J0321l1123J0202j0067k3655k3533L5900j1478K7912
8507B34572J7925j2860Q107j3839m3330J7389K1934O48J0126k2914K2921M215
8495B44894o807j0497o189r574m0004j473K6833K911k1228k708r415K6194K0851
8482B13788m0193m029J5058J8855m2845k0614Q664q902J4194l457j1783J8434
8470A57170j4990j8567n104m710l11K7419J0706j1092k5151K0736k4044j8805
$$ plain form
8558 407131 394310 385500 374216 376856 368157 324388 307220 302494 288883 281403 317121 306599 291253
8545 291253 291583 278390 259103 239140 223547 234321 226255 234933 254867 245031 267477 287317 272162
8532 272162 281946 272575 265654 257508 249059 239250 292454 295815 269992 259068 245881 257927 241199
8519 241199 207654 205099 250093 260414 229291 239493 229426 205771 182238 218138 206660 234572
8507 234572 252497 239637 247744 233905 190575 207964 229898 230546 240672 217758 240679 244894
8495 244894 238087 227590 221401 211827 171823 170350 197183 200094 178866 176158 166743 192937 213788
8482 213788 173595 169566 184624 203479 160634 140020 148684 139782 153976 150519 138736 157170
8470 157170 142180 123613 118509 113799 113488 140907 151613 140521 115370 136106 112062 93257
8458I3257J4046k551q864J4311k1079J568J4776L6310J8997l472n5398o607M979
8445A00273M322k5560J458j2438J875R795L6928n459K0064P30m205L951m7790
8432H3944L143J0448L1223K3711l6004m4380m3207J8509L9523K5837l111j7953
8420I1683j6375P443k5603j0584K8023J0712l911J5524m15M612J6113k7936j2569
8407G6717k6682P424q743l6798j9780K3565o524k2490L5928M3084j5404n7763
8395g466j4560j785J8901L2635N1136j494j269L8806J6364j5663l7509J9024p250
8382H9870j5805l1750J9940K2822j5155m0904J646m471J3760k230k0751L9856
8370E6828k5048j1105K7877k741j6837j981j608M2304j738m0262m724j1673m530
$$ plain form
8458 93257 107303 104752 95888 110199 89120 90688 105464 141774 160771 157299 101901 95294 100273
8445 100273 104595 79035 80493 68055 69930 79725 116653 111194 131258 131988 127783 131734 83944
8432 83944 87087 97535 128758 152469 116465 72085 28878 47387 86910 112747 109636 91683
8420 91683 75308 82751 57148 46564 74587 85299 81388 96912 96497 101109 117222 89286 76717
8407 76717 50035 57459 48716 11918 -7862 15703 9179 -13311 22617 65701 50297 -7466
8395 -7466 -22026 -23811 -4910 27725 78861 77367 76098 114904 131268 115605 78096 97120 89870
8382 89870 74065 42315 62255 85077 69922 29018 30664 26193 39953 37723 16972 56828
8370 56828 31780 20675 48552 45811 28974 26993 25385 67689 65951 25689 20965 9292 4762
8357D762K1115M3795o642m6366j1952K0529Q884K424j9405J0652j3909R184k5214
8344b143k9982J6902Q488J2858j0536j6094L4801j372j8959k0985k1847K043L4954
8331a1872L568K1513L9197K2122N598l7958k8327j0867K4098L4500K4053k8573
8319E7052m9125j7885M918K8743L5688J4016P235O990k6312l0423N009m2258l1769
8306c8121K3572L5273p074J5444L4113k9451k0293L4057P0794j6224n1799j4048
8294C6243k7605p87M2379j9524N911n214k6807m8J0920J4485J0004k2042O638
8281B4553J5181k4503J2031N6769J4988l7721r186p858k3518j0612j7133k1745
8269b8754m061K532r752m70L6892M1208k8560j9972m0193J2864L0572k0166k3165
$$ plain form
8357 4762 25877 69672 63030 16664 4712 25241 34125 36549 17144 27796 13887 23071 -2143
8344 -2143 -32125 -15223 -6735 6123 -4413 -20507 14294 12922 -6037 -27022 -48869 -46826 -11872
8331 -11872 -8304 13209 52406 74528 80126 42168 13841 2974 27072 61572 85625 57052
8319 57052 7927 -9958 -5040 23703 59391 73407 80642 87632 61320 30897 35906 -6352 -38121
8306 -38121 -14549 20724 13650 29094 63207 33756 13463 47520 118314 102090 50291 36243
8294 36243 8638 7851 50230 30706 36617 31403 4596 4548 15468 29953 39957 17915 24553
8281 24553 39734 15231 27262 84031 99019 61298 52112 44254 20736 10124 -7009 -28754
8269 -28754 -32815 -30283 -40035 -40505 -3613 37595 9035 -10937 -51130 -38266 -7694 -27860 -51025
$$ [...]
##END NTUPLES=NMR SPECTRUM
##END=
