##TITLE=317085
cc 46613
468/33
adrs
colin
##JCAMPDX= 6.0         $$ Bruker NMR JCAMP-DX V2.0
##DATA TYPE= NMR SPECTRUM
##DATA CLASS= NTUPLES
##ORIGIN= Bruker BioSpin GmbH
##OWNER= nmr
$$ XWIN-NMR		Version 3.5
$$ Wed Jul 12 09:04:13 2006 GMT Daylight Time (UT+1h)  MAYBRIDGE\nmr@NMR_250MHZ
##.OBSERVE FREQUENCY= 250.131544655141
##.OBSERVE NUCLEUS= ^1H
##.ACQUISITION MODE= SIMULTANEOUS (DQD)
##.ACQUISITION SCHEME= undefined
##.AVERAGES= 1
##.DIGITISER RES= 18
##SPECTROMETER/DATA SYSTEM= dpx250
##.PULSE SEQUENCE= zg30
##.SOLVENT NAME= CDCl3
##.SHIFT REFERENCE= (INTERNAL, CDCl3, 0, 16.4503)
##AUDIT TRAIL= $$ (NUMBER, WHEN, WHO, WHERE, WHAT)
$$ ##TITLE= Audit trail, XWIN-NMR		Version 3.5
$$ ##JCAMPDX= 5.01
$$ ##ORIGIN= Bruker BioSpin GmbH
$$ ##OWNER= nmr
$$ C:/u/data/dgb/nmr/ADRS/15700/pdata/1/auditp.txt
$$ ##AUDIT TRAIL=  $$ (NUMBER, WHEN, WHO, WHERE, WHAT)
(   1,<2006-02-07 14:19:08.38 +000>,<MAYBRIDGE\nmr>,<NMR_250MHZ>,
      <created by zg, POWCHK disabled, PULCHK disabled
       terminated by command 'halt'
       configuration hash MD5:
       84 BC 41 DB A1 6E 1D 46 DA 25 12 A5 C1 ED C5 3A
       data hash MD5: 64K
       9F 62 99 BC 6D 27 0E C3 83 4A 61 04 25 96 AC B3>)
(   2,<2006-02-07 14:19:15.46 +000>,<MAYBRIDGE\nmr>,<NMR_250MHZ>,
      <Start of raw data processing
       ef LB = 0.3 FT_mod = 6 PKNL = 1 SI = 32K 
       data hash MD5: 32K
       44 CC B5 65 D9 49 F3 98 6E EC FB 12 D1 8B AA 90>)
(   3,<2006-02-07 14:19:17.46 +000>,<MAYBRIDGE\nmr>,<NMR_250MHZ>,
      <apk 
       data hash MD5: 32K
       84 11 3A ED 5D F6 3B 99 EC 29 0D 32 24 1E FE 16>)
(   4,<2006-02-07 14:19:18.46 +000>,<MAYBRIDGE\nmr>,<NMR_250MHZ>,
      <abs ABSG = 5 
       data hash MD5: 32K
       B0 40 4A FA FC B7 20 D4 4E F7 D4 8F F8 FA B2 67>)
$$ ##END=
$$ 
$$ hash MD5
$$ E5 7E 93 03 A2 46 E8 4B BB 5A 45 91 75 82 9C 6C
##$RELAX= 
##$RELAX= 
##$RELAX= 
##$RELAX= 
##$RELAX= 
##$RELAX= 
##$RELAX= 
$$ Bruker specific parameters
$$ --------------------------
##$DU= <C:\Restored>
##$EXPNO= 15700
##$NAME= <ADRS>
##$PROCNO= 1
##$TYPE= <nmr>
##$USER= <dgb>
##$AMP= (0..31)
100 100 100 100 100 100 100 100 100 100 100 100 100 100 100 100 100 100 
100 100 100 100 100 100 100 100 100 100 100 100 100 100 
##$AQSEQ= 0
##$AQ_mod= 3
##$AUNM= <au_zg>
##$AUTOPOS= <9 >
##$BF1= 250.13
##$BF2= 250.13
##$BF3= 250.13
##$BF4= 250.13
##$BF5= 500.13
##$BF6= 500.13
##$BF7= 500.13
##$BF8= 500.13
##$BYTORDA= 1
##$CFDGTYP= 0
##$CFRGTYP= 5
##$CHEMSTR= <none>
##$CNST= (0..31)
1 1 145 1 1 1 1 1 1 1 1 1 1 1 1 1 1 1 1 1 1 1 1 1 1 1 1 1 1 1 1 1 
##$CPDPRG= <>
##$CPDPRG1= <>
##$CPDPRG2= <>
##$CPDPRG3= <>
##$CPDPRG4= <mlev>
##$CPDPRG5= <mlev>
##$CPDPRG6= <mlev>
##$CPDPRG7= <mlev>
##$CPDPRG8= <mlev>
##$CPDPRGB= <>
##$CPDPRGT= <>
##$D= (0..31)
0 1 0 0 0 0 0 0 0 0.06 0 0 0 0 0 0 0.0002 0 0 0 0 0 0 0 0 0 0 0 0 0 0 
0 
##$DATE= 1139321946
##$DBL= (0..7)
120 120 120 120 120 120 120 120 
##$DBP= (0..7)
150 150 150 150 150 150 150 150 
##$DBP07= 0
##$DBPNAM0= <>
##$DBPNAM1= <>
##$DBPNAM2= <>
##$DBPNAM3= <>
$$ [...]
##$SUBNAM7= <"">
##$SUBNAM8= <"">
##$SUBNAM9= <"">
##$SW= 20.6930455092707
##$SWIBOX= (0..15)
0 0 3 0 0 0 0 0 0 0 0 0 0 0 0 0 
##$SW_h= 5175.983436853
##$TD= 65536
##$TD0= 1
##$TE= 293.16
##$TE2= 300
##$TE3= 300
##$TEG= 300
##$TL= (0..7)
0 120 120 120 120 120 120 120 
##$TP= (0..7)
150 150 150 150 150 150 150 150 
##$TP07= 0
##$TPNAME0= <>
##$TPNAME1= <>
##$TPNAME2= <>
##$TPNAME3= <>
##$TPNAME4= <>
##$TPNAME5= <>
##$TPNAME6= <>
##$TPNAME7= <>
##$TPOAL= (0..7)
0.5 0.5 0.5 0.5 0.5 0.5 0.5 0.5 
##$TPOFFS= (0..7)
0 0 0 0 0 0 0 0 
##$TUNHIN= 0
##$TUNHOUT= 0
##$TUNXOUT= 0
##$USERA1= <user>
##$USERA2= <user>
##$USERA3= <user>
##$USERA4= <user>
##$USERA5= <user>
##$V9= 5
##$VALIST= <valist>
##$VCLIST= <CCCCCCCCCCCCCCC>
##$VD= 0
##$VDLIST= <DDDDDDDDDDDDDDD>
##$VPLIST= <PPPPPPPPPPPPPPP>
##$VTLIST= <TTTTTTTTTTTTTTT>
##$WBST= 1024
##$WBSW= 4
##$XGAIN= (0..3)
0 0 0 0 
##$XL= 0
##$YL= 0
##$YMAX_a= 29071
##$YMIN_a= -26101
##$ZGOPTNS= <>
##$ZL1= 120
##$ZL2= 120
##$ZL3= 120
##$ZL4= 120
##$ABSF1= 16.45035
##$ABSF2= -4.242823
##$ABSG= 5
##$ABSL= 3
##$ALPHA= 0
##$AQORDER= 0
##$ASSFAC= 0
##$ASSFACI= 0
##$ASSFACX= 0
##$ASSWID= 0
##$AUNMP= <proc_1d>
##$AZFE= 0.1
##$AZFW= 0.1
##$BCFW= 0
##$BC_mod= 0
##$BYTORDP= 0
##$COROFFS= 0
##$CY= 12.5
##$DATMOD= 1
##$DC= 0
##$DFILT= <>
##$DTYPP= 0
##$F1P= 14.0000005364418
##$F2P= -0.99999901652339
##$FCOR= 0.5
##$FTSIZE= 32768
##$FT_mod= 6
##$GAMMA= 0
##$GB= 0
##$INTBC= 1
##$INTSCL= 1
##$ISEN= 128
##$LB= 0.3
##$LEV0= 0
##$LPBIN= 0
##$MAXI= 10000
##$MC2= 0
##$MEAN= 0
##$ME_mod= 0
##$MI= 0
##$NCOEF= 0
##$NC_proc= -7
##$NLEV= 6
##$NOISF1= 0
##$NOISF2= 0
##$NSP= 0
##$NTH_PI= 0
##$NZP= 0
##$OFFSET= 16.45035
##$PC= 1
##$PHC0= 98.84578
##$PHC1= 8.483262
##$PH_mod= 1
##$PKNL= yes
##$PPARMOD= 0
##$PSCAL= 4
##$PSIGN= 0
##$REVERSE= no
##$SF= 250.130017920307
##$SI= 32768
##$SIGF1= 0
##$SIGF2= 0
##$SINO= 400
##$SIOLD= 32768
##$SREGLST= <1H.CDCl3>
##$SSB= 0
##$STSI= 32768
##$STSR= 0
##$SW_p= 5175.98343685301
##$SYMM= 0
##$S_DEV= 0
##$TDeff= 65536
##$TDoff= 0
##$TI= <Analysis number 999999
Compound Code 99
Book Reference 9
Project Code 9>
##$TILT= no
##$TM1= 0
##$TM2= 0
##$TOPLEV= 0
##$USERP1= <user>
##$USERP2= <user>
##$USERP3= <user>
##$USERP4= <user>
##$USERP5= <user>
##$WDW= 1
##$XDIM= 32768
##$YMAX_p= 527175577
##$YMIN_p= -834257
$$ End of Bruker specific parameters
$$ ---------------------------------
##NTUPLES= NMR SPECTRUM
##VAR_NAME=  FREQUENCY,     SPECTRUM/REAL,   SPECTRUM/IMAG
##SYMBOL=    X,             R,               I
##VAR_TYPE=  INDEPENDENT,   DEPENDENT,       DEPENDENT
##VAR_FORM=  AFFN,          ASDF,            ASDF
##VAR_DIM=   32768,         32768,           32768
##UNITS=     HZ,            ARBITRARY UNITS, ARBITRARY UNITS
##FACTOR=    0.157963299565203, 1,           1
##FIRST=     4114.72629220514, 0,            0
##LAST=      -1061.25714464787, 0,           0
##MIN=       -1061.25714464787, -834257,     0
##MAX=       4114.72629220514, 527175577,    0
$$ Real data points
##PAGE= N=1
##DATA TABLE= (X++(R..R)), XYDATA
$$ [...]
18134C2445040M620285L691821p84645m838769o751624o845541n424131l850664
$$ 32445040 37065325 40757146 39972501 35133732 28382108 21536567 16112436 12261772
18126A2261772k635692j671057j072112p04797l84102k52725J08947P19247J292846
$$ 12261772 9626080 7955023 6882911 6178114 5794012 5541287 5650234 6369481 7662327
18117G662327J634600N57434p25786j361013j090466k90845M10968J301435K907964
$$ 7662327 9296927 9854361 9128575 7767562 6677096 6386251 6797219 8098654 11006618
18108A1006618N766045J2085190K3317199J6271388p807954j5703326j6871604
$$ 11006618 16772663 28857853 52175052 68446440 60638486 44935160 28063556
18101B8063556j0036261m970118k458208r22179M43109R05610k22409j215729
$$ 28063556 18027295 13057177 10598969 9676790 10119899 11025509 10803100 9587371
18093I587371j475853j169064n08465K73990J513517K802753K314002o40114k278030
$$ 9587371 8111518 6942454 6433989 6707979 8221496 11024249 13338251 12698137 10420107
18084A0420107k583369j817136q55129k1398N69837R91439J05179r78166j321785
$$ 10420107 7836738 6019602 5164473 5143075 5712912 6704351 6809530 5831364 4509579
18075D509579j139894p21062n57023m37183l05508k00055J13859Q8180k10636
$$ 4509579 3369685 2648623 2091600 1654417 1348909 1148854 1262713 1350893 1140257
18066A140257k32957j41641M5672m510j6461j10600j91966l7080j911K7300L3786
$$ 1140257 907300 765659 811331 806821 790360 679760 487794 450714 448803 476103 509889
18055E09889O2021q6958j32988L8142j4495p7664l1087m9593j3816k0938o0020
$$ 509889 571910 484952 351964 390106 375611 297947 266860 217267 203451 182513 122493
18044A22493r9144R2774J7917P3454J806j4587M4423k9877K2960o2007j5243q6769
$$ 122493 23349 116123 134040 207494 209300 194713 239136 209259 232219 170212 154969 68200
18032F8200o1526P33L8457n8533M0192O3884j7608o5698p4093M8120M2445N8209
$$ 68200 6674 7407 45864 -12669 27523 91407 73799 8101 -65992 -17872 24573 82782
18020H2782l2233J02534r8953j12096p129M2836J40157R5187J3520r3406k9172
$$ 82782 50549 153083 54130 -57966 -65095 -22259 117898 213085 226605 133199 104027
18009A04027L6876J50197o1370j14179j51610P1706N6202r3450o6732L9360n2758
$$ 104027 140903 291100 229730 115551 -36059 35647 91849 -1601 -68333 -28973 -81731
17998h1731j9823m910R191N5623K2810m8281j12654j485J46206M3448j01183o7477
$$ -81731 -101554 -106464 -97273 -41650 -18840 -67121 -179775 -181260 -35054 8394 -92789 -160266
17986a60266j3390M7062q793O2543M896J26960J34984R211m1066j7679j15066
$$ -160266 -173656 -126594 -135387 -72844 -67948 59012 193996 203207 162141 144462 29396
17975B9396j04000Q5016M7371o5759O101j0562m0340J7197J03566M1011K1675
$$ 29396 -74604 10412 57783 -7976 -1875 -12437 -52777 -35580 67986 108997 130672
17964A30672p5699q293P6349l8025l7108J34287O909o1220k8860M5097j15609
$$ 130672 54973 46680 123029 85004 47896 182183 189092 127872 99012 144109 28500
17953B8500j71841l599P3410p3505l0018L7116K8489j41606j2639R0172J1650
$$ 28500 -143341 -146940 -73530 -147035 -177053 -139937 -111448 -253054 -265693 -175521 -163871
17942a63871O6296K8070k5368r6697O7136N0984o3479M3539j20999p4543R9081
$$ -163871 -97575 -69505 -94873 -191570 -124434 -73450 -136929 -93390 -214389 -288932 -189851
17931a89851J49377L8613l5165M3410J6087j46204J1960J19670L9453J55925m4791
$$ -189851 -40474 -1861 -37026 6384 22471 -123733 -111773 7897 47350 203275 158484
17920A58484j6792q4564K8541J9323K6762j38144k06599l7593P7462N9592j1613
$$ 158484 141692 57128 85669 104992 131754 -6390 -212989 -250582 -173120 -113528 -125141
17909a25141M8687P7074J6567k8627j56979l1662O4683J21938P4842j9090r9367
$$ -125141 -76454 620 17187 -11440 -168419 -200081 -135398 -13460 61382 42292 -57075
17898e7075j1248n0949O5549R1707o7714N2663J6984R2374o3231j17116j5464
$$ -57075 -68323 -119272 -53723 37984 -29730 22933 39917 132291 69060 -48056 -63520
17887f3520Q624j6443Q959L4959m6504n84o5455p848j05814J1822J22975R7293
$$ -63520 -54896 -71339 -62380 -27421 -73925 -74509 -139964 -147812 -253626 -241804 -118829 -21536
17875b1536R5488N4086j66936k8847j1126j62191R209Q5116o2648J4740R0582
$$ -21536 73952 128038 -38898 -67745 -78871 -241062 -231853 -146737 -209385 -194645 -104063
17864a04063J5252M2649Q0397n60M4030K1056l1925K8133N0571l7518m7077K8398
$$ -104063 -88811 -46162 34235 33675 77705 98761 66836 94969 145540 108022 60945 89343
17852H9343N6309L361j9162m760j3468j7721L8697j08286j28100j7151J90815
$$ 89343 145652 149013 129851 125091 111623 93902 132599 24313 -103787 -120938 69877
17841F9877O3459l4523J7192j13095k614o9144J09617J24119P9410K39455J06871
$$ 69877 133336 98813 116005 2910 296 -68848 40769 164888 244298 483753 590624
17830E90624n4836j94052k55237j90769J1645J05918J52244O4733n3425n3771
$$ 590624 535788 341736 86499 -104270 -92625 13293 165537 230270 176845 123074
17820A23074M2254J14066p7181N368K2347m7059M279j40965j18523j5800P0921
$$ 123074 165328 279394 202213 207581 229928 182869 187148 46183 -72340 -88140 -17219
17809a7219Q6019p6948k7874R5361j5307L7848l0246l9149Q1325k6661l2091L3690
$$ -17219 68800 -8148 -36022 59339 44032 81880 51634 12485 93810 67149 35058 68748
17797F8748k3912J05770L4238l2627k5681N1121J49865J33706R339K9259J63517
$$ 68748 44836 150606 184844 152217 126536 177657 327522 461228 470567 499826 663343
17786F63343j55144j95143j7057J5929n5953q8705p2852J02209R6808j0348r040
$$ 663343 508199 313056 295999 311928 255975 167270 94418 196627 293435 283087 274047
17775B74047J234k5590p9479q7593j25918p1607m2196Q105J21892K09479O0771
$$ 274047 275281 249691 170212 82619 -43299 -114906 -157102 -148997 -27105 182374 243145
17764B43145J2409R8590p4390j03082K2264k4963m8064r7354m9654q8486o0970
$$ 243145 255554 354144 279754 176672 198936 173973 125909 28555 -21099 -109585 -170555
17753a70555m1399R3246J04783K08775R8751o3202j12224L8041r3887r8869J59405
$$ -170555 -211954 -118708 -13925 194850 293601 230399 118175 156216 62329 -36540 122865
17742A22865N7877k442j5223n7942p9687j7710J062j5345m2710N4025P381p7925
$$ 122865 180742 178300 163077 105135 25448 7738 8800 -6545 -49255 4770 12151 -65774
17730f5774k464M8841m2544Q1707J536j21411M9379J51912l5253n0536n3768m9423
$$ -65774 -68238 -19397 -61941 19766 21302 -100109 -50730 101182 65929 15393 -38375 -87798
17718h7798R4828J14779M1809J0080j25893l4455j09165J2495J50121R3316l7893
$$ -87798 7030 121809 163618 173698 47805 13350 -95815 -83320 66801 160117 122224
17707A22224M6415r1203p1102J07906j6006k0702J21227m5921m9117k5479l7180
$$ 122224 168639 77436 6334 114240 98234 77532 198759 152838 103721 78242 41062
17696D1062J2032O0275P5226J6313o1819m4271p9145p2875k6858N1273J65261
$$ 41062 53094 113369 188595 204908 143089 98818 19673 -53202 -80060 -28787 136474
17685A36474Q3073o2776N57L9543J726j52882p9747Q0883J09003J08877J59147
$$ 136474 219547 156771 157328 196871 198597 45715 -34032 46851 155854 264731 423878
17674D23878q4541o1321j31879j76923j0033n2691K1794J26834P90j4293M7055
$$ 423878 339337 278016 146137 -30786 -40819 -93510 -71716 55118 55908 41615 88670
17663H8670K7572l6299k2548n4375n3001M3577J19876j1622q5958k5592j11539
$$ 88670 116242 79943 57395 3020 -49981 -6404 113472 101850 15892 -9700 -121239
17652a21239j19221M3632m8330L1722M8015l3786P1753N8451J750j8012N9567
$$ -121239 -240460 -196828 -245158 -213436 -165421 -199207 -127454 -69003 -67253 -85265 -25698
17641b5698K2907J13391J92013n1508m4789j1762L068r5698j50333J24644J52166
$$ -25698 -2791 110600 302613 251105 206316 194554 197622 101924 -48409 76235 228401
17630B28401Q4946P9314k656j08580o8779j12299q6812M8491M5137J65786K6947
$$ 228401 313347 392661 390005 281425 212646 100347 13535 62026 107163 272949 299896
17619B99896j03329j07635n4935j30036j15085j13372J99459K16488O3343o7386
$$ 299896 196567 88932 33997 -96039 -211124 -324496 -125037 91451 154794 87408
17609H7408O1428K9146o4940K099l4415r9642j440Q1548l3807l4951N8642J02035
$$ 87408 148836 177982 113042 115141 80726 -18916 -20356 61192 27385 -7566 51076 153111
17597A53111N3057l0195q0191M7406q4748k45082j15126K00574R1903j14959O09
$$ 153111 206168 175973 95782 143188 58440 -186642 -301768 -101194 -9291 -124250 -123641
17586a23641k0226k9704q4162J50179Q3141r3653j22421L6091J13823O747J8447
$$ -123641 -143867 -173571 -257733 -107554 -24413 -118066 -240487 -204396 -90573 -83826 -65379
17575f5379L2879K2348N4452o7513R1985J18068l0718k23947j30834O5498q9013
$$ -65379 -32500 -10152 44300 -23213 68772 186840 156122 -67825 -198659 -133161 -222174
17564b22174N5275M9831k174P2379O5901m6173m6667m0128N6209n9299j607P3211
$$ -222174 -166899 -117068 -119242 -46863 19038 -27135 -73802 -113930 -57721 -117020 -118627 -45416
17552d5416M2958M9505O097L9376n4006O4938P0073p0069N0966n8363K6378M3082
$$ -45416 -2458 47047 53144 92520 38514 103452 173525 103456 154422 96059 122437 165519
17540A65519R2114Q552j51845m3780l8938p7541J5191R4142l8171j5011J26208
$$ 165519 257633 266185 114340 70560 31622 -45919 -30728 63414 25243 10232 136440
17529A36440o5958j22019N532P3536p624J0394P2152K4946K4916k8516m38j90625
$$ 136440 70482 -51537 -46005 27531 19907 30301 102453 127399 152315 123799 123361 -67264
17517f7264m4020P9047O343n735N0874L0700N5507N2193J3554n81j24507k5995
$$ -67264 -111284 -32237 -25894 -31629 19245 49945 105452 157645 171199 170618 46111 20116
17505B0116O3316O5748j17246j03859O2835N5586j082l960K3746j07345l4509
$$ 20116 83432 149180 31934 -71925 -9090 46496 45414 41454 65200 -42145 -76654
17494g6654J5678K5199M9628n9641k9065l170j08322k3934N7083M6984J30874
$$ -76654 -60976 -35777 13851 -45790 -74855 -78025 -186347 -210281 -153198 -106214 24660
17483B4660l2723o1909j21619o5043L3789K1436O5621j063p263P9529Q6359j32243
$$ 24660 -8063 -69972 -191591 -256634 -222845 -201409 -135788 -136851 -144114 -64585 21774 -110469
17471a10469m0947J8479K11082K01667J1590j15079n4574j54148J9589p372j9962
$$ -110469 -151416 -132937 78145 279812 291402 176323 121749 -32399 -12810 -20182 -40144
17460d0144m8351M7010J26549m200N5152n4470j51231n809J8020L7518L9393M4281
$$ -40144 -88495 -41485 85064 80864 136016 81546 -69685 -75494 -57474 -19956 19437 63718
17448F3718n3478m2249N2382J9545l6626Q3233J3767o8464R9965K27435M4717
$$ 63718 10240 -32009 20373 39918 3292 86525 100292 31828 131793 359228 403945
17437D03945j32519j50372j3553Q1106j01572k8646l5720R9958l1769j50486J21848
$$ 403945 271426 121054 107501 188607 87035 58389 22669 122627 90858 -59628 62220
17426F2220L1194J3228q3058o0479J2957p263J16609J35298p5705j00211N8037
$$ 62220 93414 106642 23584 -36895 -23938 -31201 85408 220706 145001 44790 102827
17415A02827j07495J00237Q8944l0851l3476o0442l1132J1727O9938M0363O5918
$$ 102827 -4668 95569 184513 153662 120186 59744 28612 40339 110277 150640 216558
17404B16558o5415q0651p9228R047n8183j3562o8317K0239P9511j98926J3740
$$ 216558 151143 70492 -8736 311 -57872 -71434 -139751 -119512 -40001 -238927 -225187
17393b25187N3371R115P6199O9010J60761J61175Q013N20O5283J08866J17881
$$ -225187 -171816 -162701 -86502 -17492 143269 304444 312457 312977 378260 487126 605007
17382F05007R8129j48419j75314P722j1255j13807q2967l9052J4687J02013n9474
$$ 605007 703136 554717 379403 387125 375870 262063 179096 140044 154731 256744 197270
17371A97270j14307K364J1564R6128m5738n3942r0689l9892j17989p9889P0211
$$ 197270 82963 85327 96891 193019 147281 93339 2650 -37242 -155231 -235120 -164909
17360a64909J51549Q4484j5618j45112o191M8744n9457K8503N8489q2889p2459
$$ -164909 -13360 71124 55506 -89606 -95797 -47053 -106510 -78007 -19518 -102407 -174866
17349a74866r3838m6335J26770J07352Q9714L1506O1298m8993o8640j25798R5174
$$ -174866 -268704 -315039 -188269 -80917 8797 40303 101601 52608 -16032 -141830 -46656
17338d6656J03247j7579r5794o5025J23437R1230J711j7122p2918R417j1321P6476
$$ -46656 56591 39012 -56782 -121807 1630 92860 94571 77449 4531 13948 2627 79103
17326G9103O2385M8892M347J6070O6536N0080o7433m6533k0595n316n9544k147
$$ 79103 141488 190380 194727 210797 277333 327413 259980 213447 192852 187536 127992 125845
17314A25845j09996j0225M8570j5182q6941l8031o5266k7070l0032n8465L9583
$$ 125845 15849 5624 54194 39012 -47929 -85960 -151226 -178296 -208328 -266793 -227210
17303b27210L1165P0664K8319q640Q3639K9354j73720r2751O6399J42314J29884
$$ -227210 -196045 -125381 -97062 -105702 -22063 7291 -166429 -259180 -192781 -50467 79417
17292G9417l7634n4324l9579r4578r6873P5383J29678J6678J1404M3391l3414
$$ 79417 41783 -12541 -52120 -146698 -243571 -168188 -38510 -21832 -10428 32963 -451
17281d51N1665p0145M81J24778L0838r8751j80k9273m9320L0357l1649r3109K5135
$$ -451 51214 -18931 -18450 106328 137166 38415 38235 8962 -40358 -10001 -41650 -134759 -109624
17268a09624j33073J56134J68362j9991J2088P6669j43800j4694p7273j30293
$$ -109624 -242697 -86563 81799 61808 73896 150565 6765 -7929 -85202 -215495
17258b15495K40326m6671O8081J65235L9448o6555o7126o4310L0050M677m3876
$$ -215495 24831 -21840 46241 211476 250924 184369 117243 52933 82983 87660 43784
17247D3784l7213q0699L869O8944k3150p192q5563O5339P7504J0704O6256N9942
$$ 43784 6571 -74128 -70259 -1315 -24465 -31657 -117220 -51881 25623 36327 102583 162525
17235A62525j04225r3259p6413p5165O636M9061j5524J90231J85276n1206o9737
$$ 162525 58300 -34959 -111372 -186537 -179901 -130840 -146364 43867 229143 177937 108200
17224A08200q7111n5128p1193K9492J37851O1480p8107K2648l4209M152J5378
$$ 108200 21089 -34039 -105232 -75740 62111 123591 45484 68132 33923 38075 53453
17213E3453o6545k13388J7961J01225j1067M076J5023p6724O1915M6235L8624
$$ 53453 -13092 -226480 -208519 -107294 -118361 -114285 -99262 -175986 -114071 -67836 -29212
17202b9212m415L153R2270j04334q61N0208N9589M1097j69319j16320J53796J71794
$$ -29212 -33627 -30474 61796 -42538 -43399 6809 66398 107495 -61824 -178144 -24348 147446
17190A47446M1905n2183j16598j04975o7439j39223L3852N2789J88681K2998j9485
$$ 147446 189351 137168 20570 -84405 -151844 -291067 -257215 -204426 -15745 7253 -12232
17179a2232J2994L7424n582j5000N5982J8670l2120p2249q2488O6737J9047Q6687
$$ -12232 762 38186 32604 17604 73586 92256 60136 -12113 -94601 -27864 -8817 77870
17167G7870N4029q6162p4523m0892n8031k4405j563J13629M231j64059M4139j3485
$$ 77870 131899 45737 -28786 -69678 -127709 -152114 -153677 -40048 -35817 -199876 -155737 -169222
17155a69222J3237L9472K4925o557J14105Q6314N9309r2818r3755k3508r732O3172
$$ -169222 -155985 -116513 -91588 -98145 15960 102274 161583 68765 -24990 -48498 -58230 4942
17143D942j1981r5053L6996J2289L7260M002K8389j22384J03952Q6841m0513R1140
$$ 4942 -7039 -102092 -65096 -52807 -15547 -11545 16844 -105540 -1588 85253 44740 135880
17131A35880k7047p8596j24134j06267m2555L4169J15589P0521Q2727O4165j25222
$$ 135880 108833 30237 -93897 -200164 -242719 -208550 -92961 -22440 60287 124452 -770
17120g70l947O3337P6801n8505n1067m4738J1559r553K179j17435q2283J75236
$$ -770 -4717 58620 135421 76916 25849 -18889 -7330 -16883 -14704 -132139 -214422 -39186
17108c9186J45831L8525J0754n5535J253M9097n8158j00566R7493Q169j62779
$$ -39186 106645 145170 155924 100389 101642 150739 92581 -7985 89508 97677 -65102
17097f5102n646J17946N8327R216q0824o9753l1545j5143o7700l7583R9965Q4896
$$ -65102 -70748 47198 105525 114741 33917 -35836 -67381 -82524 -150224 -187807 -87842 -2946
17085b946r6782M0797k6710O4554L1799j11271j01050O844P7927J11180J17321
$$ -2946 -99728 -58931 -85641 -21087 10712 -100559 -201609 -194765 -116838 -5658 111663
17074A11663j30690j33205J04386j8022p2999j49696M9812K3241K2389J2205O4811
$$ 111663 -19027 -152232 -47846 -65868 -138867 -288563 -238751 -215510 -193121 -180916 -116105
17063a16105P2533L9171j09076l0619J9687L1104J2343J1883P2652M7357j42387
$$ -116105 -43572 -4401 -113477 -144096 -124409 -93305 -80962 -69079 3573 50930 -91457
17052i1457R9790P5019m105Q301r2443q7518J6990j1986o1783r9448Q1954K04018
$$ -91457 8333 83352 79247 87548 -4895 -92413 -75423 -87409 -149192 -248640 -166686 37332
17040C7332Q5295N8642m2402m8338r9091m7489Q0195O1521j8731j8313J15127
$$ 37332 122627 181269 138867 90529 -8562 -56051 24144 85665 66934 48621 163748
17029A63748K8479J6633m712m837k1360j37007J9898J6830j1905K80K1204J55027
$$ 163748 192227 208860 204148 199311 177951 40944 60842 77672 65767 66047 87251 242278
17017B42278L9528p3260q7308j45454m7865r259r2078j9737L08759J09620K6026
$$ 242278 281806 208546 121238 -24216 -72081 -81340 -173418 -193155 115604 225224 251250
17006B51250r6841o4298j0510J8585j9219J736o8376p8536o1791k7104L8611P4054
$$ 251250 154409 90111 79601 98186 78967 80703 12327 -66209 -128000 -155104 -116493 -42439
16994d2439R0345J66374P7729l7774n5099p1103m9912k8289j1367J27835J085
$$ -42439 47906 214280 292009 254235 199136 128033 78121 49832 38465 166300 167385
16983A67385k6049k223Q0154n8655p7502N3394r7916r2508R359k590M650J336
$$ 167385 141336 139113 219267 160612 83110 136504 38588 -53920 -44561 -47151 -42501 -41165
16971d1165Q3938N8325o1154r5818J10973J09517l3616j51923p3150p1420P784
$$ -41165 42773 101098 39944 -55874 55099 164616 131000 -20923 -94073 -165493 -157709
16960a57709K0788j7534L1401N7982Q5630R1751j082R1913j70166n4162K819l0394
$$ -157709 -136921 -154455 -123054 -65072 20558 112309 111227 203140 32974 -21188 -18369 -48763
16948d8763J356K7717Q4216n4367K6995L0643q6673J2591J00847J3639j52404
$$ -48763 -47407 -19690 64526 10159 37154 67797 -18876 -6285 94562 108201 -44203
16937d4203J0418k6032k1890J29846j4104K1893J7603j24336k6011K6711R3335
$$ -44203 -33785 -59817 -81707 48139 34035 55928 73531 -50805 -76816 -50105 43230
16926D3230N1240K1883k1534j25278r2662J9754M4620J8353j02709k8228O3082
$$ 43230 94470 116353 94819 -30459 -123121 -103367 -58747 -40394 -143103 -171331 -108249
16915a08249J36483J9779q4076q0350j7974k2261M0927K7435L0055R2721O447
$$ -108249 28234 48013 -36063 -116413 -134387 -156648 -115721 -88286 -58231 34490 40937
16904D0937k884J56993j37372p8148M5722N3776K355L6927J15121o3687j14292
$$ 40937 38053 195046 57674 -20474 25248 79024 81379 118306 233427 169740 55448
16893E5448J06311R5718k1655K078k68J04469M7063J3392n8305O2019K9526j8293
$$ 55448 161759 257477 235822 237900 237632 342101 389164 402556 344251 406270 435796 417503
16881D17503p8278k8253Q9596L6635m8808M4326K41858l3073q8833o517j15572
$$ 417503 339225 310972 400568 437203 388395 432721 674579 641506 552673 546156 430584
16870D30584J65096K66087P1371l0093P5077Q6487J48335K47486K97196K34930
$$ 430584 595680 861767 933138 903045 978122 1064609 1212944 1460430 1757626 1992556
16860A992556J49255J41442K33382L05781L61590K30929K44705M47574M19785
$$ 1992556 2141811 2283253 2516635 2822416 3184006 3414935 3659640 4107214 4526999
16851D526999M85521O36852Q47615J238241J911738L264439N446762R227905J3650399
$$ 4526999 5012520 5649372 6496987 7735228 9646966 12911405 18358167 27586072 41236471
16842D1236471J4282441J0919570J0735303J5155853J3411714o71903r355873
$$ 41236471 55518912 66438482 77173785 92329638 105741352 105069449 95713576
16835I5713576j0902228r745782j1877173j3891601j3195503j0182647o780391
$$ 95713576 84811348 75065566 63188393 49296792 36101289 25918642 19138251
16828A9138251m413622k847224k120738j592860j112538q97693q42668n32937
$$ 19138251 14724629 11877405 9756667 8163807 7051269 6153576 5310908 4777971
16820D777971l26468k92752m837K27437J30306O1034J27415Q5334k75835m46297
$$ 4777971 4451503 4158751 4153914 4381351 4511657 4572691 4700106 4785440 4509605 4063308
16810D063308m92722o46977m81815l45361j69621j90283l00705k94530L8840J57421
$$ 4063308 3570586 2923609 2441794 2096433 1926812 1736529 1435824 1141294 1180134 1337555
16800A337555n2051k2973k13289j41437o8730m4849l814r4959q1549j01483r4704
$$ 1337555 1285504 1262531 1049242 907805 839075 794226 790412 695453 613904 512421 417717
16789D17717K992k1227K9814l7761q8851m6724o1533p2522m6411P9067P8204j88246
$$ 417717 420709 399482 429296 391535 302684 255960 194427 121905 75494 154561 232765 44519
16777D4519k3396K4279L4903K0319l787O2883J95562L9977k02945K79l6422J9928
$$ 44519 21123 45402 80305 100624 96837 159720 355282 395259 192314 192593 156171 176099
16765A76099p7767Q599N4117r360M2943K0375K7418N3669p8049j8174p0093L3839
$$ 176099 98332 106931 161048 151688 194631 215006 242424 296093 218044 199870 129777 163616
16753A63616j4136j25066P850p1301J02513R0812k4342q5550N786J39149N9272
$$ 163616 149480 24414 32264 -39037 63476 154288 129946 44396 50182 189331 248603
16742B48603j08662J805N3600J1667L0369J4767M9836j93423l1300Q7757p6603
$$ 248603 139941 141746 195346 207013 237382 252149 301985 108562 77262 165019 88416
16731H8416j00512J08131J3163k428p55O3067o6990m3651K4024J33553P4731o2636
$$ 88416 -12096 96035 109198 106770 106015 169082 102092 58441 82465 216018 290749 228113
16719B28113o1625k0482J71107R4359j43993r9903P2354P3053M7080l2441k23460
$$ 228113 166488 146006 317113 411472 267479 167576 239930 312983 360063 327622 104162
16708A04162j43987k4484m5511O5042M0620j45723j88704M2229J27675J5412j9369
$$ 104162 -39825 -64309 -109820 -44778 -4158 -149881 -338585 -296356 -168681 -153269 -172638
16697a72638o3363J0714J18319n823M6263k1752O3057r6337m7507J56621n4151
$$ -172638 -236001 -225287 -106968 -112791 -66528 -88280 -25223 -121560 -169067 -12446 -66597
16686f6597k79231q8730Q1957J55843L1107o0080O3406J36958R7501n147n8097
$$ -66597 -345828 -434558 -352601 -196758 -165651 -225731 -162325 -25367 72134 66987 8890
16675H890Q8743r5969j81116p5753l6278O8530M7460R5773J25967J5036j25749
$$ 8890 97633 1664 -179452 -255205 -291483 -222953 -175493 -79720 46247 61283 -64466
16664f4466K8538j2658K5159l8048r7439J00J28329N2855n1451n7482m6421n5406
$$ -64466 -35928 -48586 -23427 -61475 -158914 -158814 -30485 22370 -29081 -86563 -132984 -188390
16652a88390J50715M9447r1808j09859O8675k3150m8912o9324K515j3230J39685
$$ -188390 -37675 11772 -80036 -189895 -121220 -144370 -193282 -262606 -260091 -273321 -133636
16641a33636N6119K2443m34q2316L7736j6898N4013J18107o36p8199R3602N0882
$$ -133636 -77517 -55074 -55508 -137824 -100088 -116986 -62973 55134 54498 -23701 69901 120783
16629A20783o5802O622m2733j62378q2865m9472J88316J17846M9727m3542j53577
$$ 120783 54981 61603 18870 -143508 -226373 -275845 -87529 30317 80044 36502 -117075
16618a17075n9075M0085l8900p1015r67J1748L4750j4173R815R0100N7966O8674
$$ -117075 -176150 -136065 -174965 -245980 -246947 -235199 -200449 -214622 -204807 -114707 -56741 11933
16606A1933J55260l9885l0925n9545p3269o5925q7435k2685K3738p821J23754
$$ 11933 167193 127308 96383 36838 -36431 -102356 -189791 -212476 -188738 -196559 -72805
16595g2805J16144K2625o512k839q0595p18O7388J2610j01704l3561K3912m4167
$$ -72805 43339 65964 59452 56613 -23982 -24700 42688 55298 -46406 -79967 -56055 -100222
16583a00222N379K4064M661K9494q6719L8354m7864l6649J8640K1167j2237M9765
$$ -100222 -94843 -70779 -66118 -36624 -123343 -84989 -132853 -169502 -150862 -129695 -141932 -92167
16571i2167J9612J1098j4000L0455L4134o4161m2343r4003J6931J82510K1289
$$ -92167 -72555 -61457 -75457 -45002 -10868 -75029 -117372 -211375 -194444 -11934 9355
16560I355l0210N3581k6070N3949L3648K8450m0341j10791p5267OP3239P8698
$$ 9355 -20855 32726 6656 60605 94253 122703 82362 -28429 -103696 -103690 -30451 48247
16548D8247J23930J4753j59142j27501J5673J09625m5520o7088Q079n2325M6525
$$ 48247 172177 186930 27788 -99713 -84040 25585 -19935 -87023 -78944 -131269 -84744
16537h4744J28991J16249k6278j79109l6909J27251L1980m2900j04604J2282J6054
$$ -84744 44247 160496 134218 -44891 -81800 45451 77431 34531 -70073 -57791 -41737
16526d1737N4392j1636l2065k0300O9926J7913P5618k2137K0327M8123j22852
$$ -41737 12655 1019 -31046 -51346 18580 36493 112111 89974 110301 158424 35572
16515C5572m4654J2918r4654n1212k1166J40352R6804p2193p4574M5088Q1971
$$ 35572 -9082 3836 -90818 -142030 -163196 -22844 73960 1767 -72807 -27719 54252
16504E4252J6736l5902p7777p4394k3802J72473J02802L3281m00p9897o271Q6962
$$ 54252 70988 35086 -42691 -117085 -140887 31586 134388 167669 167269 87372 81101 168063
16492A68063L365n9916j05965P7148J8563J04316P0108j23174M5067J720K8210
$$ 168063 171428 111512 5547 82695 101258 205574 275682 152508 197575 199295 227505
16481B27505r2249m5953L6372j01763L297l927j08750l9074N1076K4687j2702
$$ 227505 135256 89303 125675 23912 27209 23282 -85468 -124542 -73466 -48779 -61481
16470f1481j048J40634p1569N591L0763m0308j03099L621K5420m7221k5007J38166
$$ -61481 -62529 78105 6536 12127 42890 2582 -100517 -96896 -71476 -118697 -143704 -5538
16458e538L2991n1951p4337j36267N527O7073J03062Q1830R7896o1316l9329l4871
$$ -5538 27453 -24498 -98835 -235102 -229575 -162502 -59440 22390 120286 58970 19641 -15230
16446a5230q7827J8879J29976M2913j20524j41533k2870P6137L4065l0806L1404
$$ -15230 -103057 -84178 45798 88711 -31813 -173346 -196216 -120079 -86014 -116820 -85416
16435h5416j9126N2873O3397l2668N4864J56156M7382l2368p7970r6114p0338
$$ -85416 -104542 -51669 11728 -20940 33924 190080 237462 205094 127124 31010 -39328
16424c9328k4862r2190L554K03891K03801j20260j31133r0692O8417Q4435R224
$$ -39328 -64190 -156380 -152826 51065 254866 134606 3473 -87219 -18802 65633 74857
16413G4857o7867M5303J6019Q1757M3666R6971J01891j10277o2584j72393q0183
$$ 74857 6990 52293 68312 150069 193735 290706 392597 282320 219736 47343 -32840
16402c2840J82591r5287j59895L6032K4061K5935q4587p8745j66413J41438M1306
$$ -32840 149751 54464 -105431 -69399 -45338 -19403 -103990 -182735 -349148 -207710 -166404
16391a66404J12013P9032k4806Q8766k5739o4119L1041O1068R3671M2509R5868
$$ -166404 -54391 24641 -165 88601 62862 -1257 29784 90852 184523 227032 322900
16380C22900m2559k3531J78254K48775Q4016j05722j86784j28490O62L0999p6341
$$ 322900 280341 256810 435064 683839 767855 662133 475349 346859 347521 378520 302179
16369C02179j41864j09968J9448J45109l4302q2926M6647R5795j01882j2010k1577
$$ 302179 160315 50347 69795 214904 180602 97676 144323 240118 138236 126226 104649
16358A04649N5640R3905J46889j7355j74847j35835M1670j11439k2180J15270
$$ 104649 160289 254194 401083 383728 208881 73046 114716 3277 -18903 96367
16348I6367L8870o8861k02745r486J20094M8093N6779J11955j61496J552J8423
$$ 96367 135237 66376 -136369 -145855 -25761 22332 79111 191066 29570 31122 49545
16337D9545O3606p6519j38194L8825J64338J189J5990j11611j70419n3789J08815
$$ 49545 113151 36632 -101562 -62737 101601 102790 118780 7169 -163250 -217039 -108224
16326a08224J06982J05435R4115K3714r2801j19830j13196j5842N6141R885J0118
$$ -108224 -1242 104193 198308 222022 129221 9391 -103805 -119647 -63506 -53621 -43503
16315d3503J4479M8883l5319q1653R8008O7883o6451N146M9309n8659l2935r2853
$$ -43503 -29024 19859 -15460 -97113 895 68778 2327 7473 56782 -1877 -34812 -127665
16303a27665r8277m5651R7078J4397J21124J1965k0569j00709j4107P3305J40551
$$ -127665 -225942 -271593 -174515 -160118 -38994 -27029 -47598 -148307 -162414 -89109 51442
16292E1442J31673O9630j6986n5388O0223J30723J54207R816j38632N4268o2813
$$ 51442 183115 252745 235759 180371 240594 371317 525524 535340 396708 450976 388163
16281C88163K2992k4861p334j51080j19497P6118j19505m853K8183o4874L2106
$$ 388163 411155 386294 378960 227880 108383 184501 64996 60143 88326 23452 55558
16270E5558N2995J6764j75173n7481N4337O6501o6408j15687Q4961l5119L9220
$$ 55558 108553 125317 -49856 -107337 -53000 13501 -52907 -168594 -83633 -118752 -79532
16259g9532r3927L6274Q5119O8121M6279O8605m1665j48158k242n8231k6417J18114
$$ -79532 -173459 -137185 -52066 16055 62334 130939 89274 -58884 -61126 -119357 -145774 -27660
16247b7660l5629N2611K2583k5561J00716k9920Q6018K7157j34633J4078o1968
$$ -27660 -63289 -10678 11905 -13656 87060 57140 143158 170315 35682 49760 -12208
16236a2208l7522o9876n6255m565K3307M5816m4350K0901J11424r806K9210m451
$$ -12208 -49730 -119606 -175861 -180426 -157119 -111303 -155653 -134752 -23328 -33134 -3924 -8375
16224h375j6675p7245p6015J20742j3435P480q7410L2061P3083O7652k444O5669
$$ -8375 -25050 -102295 -178310 -57568 -71003 -63523 -150933 -118872 -45789 21863 19419 85088
16212H5088L640j09112j13080k3983J38884k3969m8294P305J57782K9517n0148
$$ 85088 88728 -20384 -133464 -157447 -18563 -42532 -90826 -83521 74261 103778 53630
16201E3630j03903l7626q958k0488Q1184l634M5670j37047p3994l2882M8827J14852
$$ 53630 -50273 -87899 -96857 -117345 -36161 -39795 5875 -131172 -205166 -238048 -189221 -74369
16189g4369J12284Q8799n1003k7272P2945j5544j13623j46348r867m8262J28848
$$ -74369 37915 126714 75711 48439 121384 105840 -7783 -154131 -163998 -212260 -83412
16178h3412N2390n9179K7662J57197Q3991o9019m5519p3397O7638o960j21920
$$ -83412 -31022 -90201 -62539 94658 178649 109630 64111 -9286 58352 51392 -70528
16167g0528j52943k8643p526J07709R1513n8539o4839N2476o7275j02571n9631
$$ -70528 -223471 -252114 -259640 -151931 -60418 -118957 -183796 -131320 -198595 -301166 -360797
16156c60797N1951J9443O5513R9878p4446q9714k8106P0303P7374p7884n7077
$$ -360797 -308846 -289403 -223890 -124012 -198458 -288172 -316278 -245975 -168601 -246485 -303562
16145c03562J20197J78014M4618l7820O2221K3439k3713M6409m1832o3160m6365
$$ -303562 -183365 -5351 39267 1447 63668 87107 63394 109803 67971 4811 -41554
16134d1554L0660l90l6480M3205N8394K949O0787j00833p8899j52212j72394O1752
$$ -41554 -10894 -11284 -47764 -4559 53835 56784 117571 16738 -62161 -214373 -386767 -325015
16122c25015J84731O682l0846Q802n1123l4132j1862K1765R1572L5251J66724
$$ -325015 -140284 -133602 -164448 -155646 -206769 -240901 -252763 -230998 -139426 -104175 62549
16111F2549O7791r3138q2692P6391J34752J23487l2092l3892o2233j70818p0282
$$ 62549 130340 37202 -45490 30901 165653 289140 257048 223156 160923 -9895 -80177
16100h0177K8241q3977O4282m2489r0801J17754J47858r948p1148Q066K8114J02045
$$ -80177 -51936 -135913 -71631 -114120 -204921 -87167 60691 50743 -20405 -12339 15775 117820
16088A17820j7847N9307o7458o6607m700N0754N7116p5204j02290n1433m239L012
$$ 117820 99973 159280 91822 25215 20515 71269 128385 53181 -49109 -100542 -104781 -101769
16076a01769Q7139P8013J152L3447K2808k5629K8693j45231k09306j06605M0718
$$ -101769 -14630 63383 64535 97982 120790 95161 123854 -21377 -230683 -337288 -296570
16065b96570J29889J62030J00410K6131J7099r2737R5824j5204j44508l0522R2823
$$ -296570 -166681 -4651 95759 121890 138989 46252 142076 126872 -17636 -48158 44665
16054D4665l994j62734k2204M6211R539K2494k7185o1659q7600P7221Q644o6530
$$ 44665 40671 -122063 -144267 -98056 -88517 -66023 -93208 -154867 -242467 -165246 -156602 -223132
16042b23132J72191Q2458J0277L9293o896K1669P8425q5157m7517o9886j15232
$$ -223132 -50941 31517 41794 81087 74191 95860 174285 89128 41611 -28275 -143507
16031a43507M6387J15006o5243O0149J35627r8961j67314q332K5899M4466O9582
$$ -143507 -97120 17886 -47357 12792 148419 49458 -117856 -126188 -100289 -55823 13759
16020A3759J17518q1974o5713L8556l1711Q452j51585p1154J43867J06629L3764
$$ 13759 131277 49303 -16410 22146 -9565 -1113 -152698 -223852 -79985 26644 60408
16009F0408p9332o595j45j23168J2196O0559J01041P9630j0006L4185q556J4798
$$ 60408 -18924 -25519 -25664 -148832 -136636 -76077 24964 104594 94588 128773 120217 135015
15997A35015n1568m8111K6246J01809J3076m0071r6005Q83m3875P4090J28936
$$ 135015 83447 35336 61582 163391 176467 136396 40391 41274 -2601 71489 200425
15986B00425j22258P692k657J0944j11580j4489L7515q0697N8049J0631L3796
$$ 200425 78167 85859 83202 94146 -17434 -31923 5592 -75105 -17056 -6425 27371
15975B7371k5132l7400n8209j22945j28611P8057J09486l4877k1299N0582j7906
$$ 27371 2239 -35161 -93370 -216315 -344926 -266869 -157383 -192260 -213559 -162977 -180883
15964a80883L5388m0311M399O0860J3998K61O626J42287L8621j56721l9691O0728
$$ -180883 -145495 -185806 -181407 -120547 -106549 -106288 -99662 42625 81246 -75475 -115166 -54438
15952e4438L1342j2635Q3701Q0996k2433r660l0067R608m9004n3500J7038L8350
$$ -54438 -23096 -35731 47970 128966 106533 96873 66806 76414 27410 -26090 -9052 29298
15940B9298r92j12557L4337K9878M9345L3532k6121l0947L2220l633l3810r2536
$$ 29298 28306 -84251 -49914 -20036 29309 62841 36720 5773 37993 34360 550 -91986
15928i1986r603K0373o4995r9773J84394J29870M2868o4975p3350j8460J2896
$$ -91986 -101589 -81216 -146211 -245984 -61590 68280 111148 46173 -27177 -45637 -32741
15917c2741k7239j30372j0121J76630J13795k940r225o568j18277j3899j52066
$$ -32741 -59980 -190352 -200473 -23843 89952 87012 77787 71219 -47058 -60957 -213023
15906b13023K1922R1358j2645l0414O7947q7236r0843J63582J86896Q5857J5705
$$ -213023 -191101 -99743 -112388 -142802 -74855 -162091 -252934 -89352 97544 183401 199106
15895A99106o3078p0229L2245M4679j61807M364j02905r1907L712J50824J22391
$$ 199106 136028 65799 98044 142723 -19084 -14720 -117625 -209532 -205820 -54996 67395
15884F7395k5567M110j08944j42045r000o5394K9365P8894j7068j08659l2823
$$ 67395 41828 45938 -63006 -205051 -214051 -279445 -250080 -171186 -188254 -296913 -329736
15873c29736J68106K7948R5270Q6835r5352L1512o378l8994k4943m7877N511O1410
$$ -329736 -161630 -133682 -38412 48423 -46929 -15417 -21795 -60789 -85732 -133609 -128098 -66688
15861f6688N3724N903m2829j48489J6289J22516J16252m1785M2466L1337k3841
$$ -66688 -12964 -7061 -49890 -198379 -182090 -59574 56678 14893 57359 88696 64855
15850F4855q8914M2618n3549p330n7426N0372j8891P2358L0097j0310J7647j68291
$$ 64855 -24059 18559 -34990 -42320 -99746 -49374 -68265 4093 34190 23880 41527 -126764
15838a26764K6819J78277J30029k4838r0357o6809j55137q6718J55712K0632k00428
$$ -126764 -99945 78332 208361 183523 93166 26357 -128780 -215498 -59786 -39154 -239582
15827b39582k5890Q8093M6986J36341q2688K0109K3398j94172l1761K02540O5334
$$ -239582 -265472 -177379 -130393 5948 -76740 -56631 -33233 -227405 -259166 -56626 8708
15816H708j06530P2590J54220J3298J01585k3456j22612o8888q379K8500N5222
$$ 8708 -97822 -25232 128988 142286 243871 220415 97803 28915 20536 49036 104258
15805A04258l5624j54784j07977M6356P2156q5876l6440k484Q2953J79395l0941
$$ 104258 68634 -86150 -194127 -147771 -75615 -161491 -197931 -200415 -117462 61933 30992
15794C0992n1030k352J2620o0658N3931q7957N6753J26262n6254l9841K5959p0317
$$ 30992 -20038 -22390 -9770 -70428 -16497 -104454 -47701 78561 22307 -17534 8425 -61892
15782f1892J33928M3891L7056q9244k09633j8125P798m886J6541m6063m4806N8912
$$ -61892 72036 115927 152983 63739 -145894 -164019 -156221 -161107 -144566 -190629 -235435 -176523
15770a76523J01147L7703l1753j2892M1496J18441J24522Q5724l6551l2244n8695
$$ -176523 -75376 -37673 -69426 -82318 -40822 77619 202141 287865 251314 219070 160375
15759A60375j10939p7352N2897O8357J6763o7614k4900q8787j31566j7387O9091
$$ 160375 49436 -27916 24981 93338 110101 42487 17587 -71200 -202766 -220153 -151062
15748a51062M8208M4040J5724K4371r1587m6J10098p171O4444J99459M8903p9517
$$ -151062 -102854 -58814 -43090 -18719 -110306 -110352 -254 -7425 57019 256478 305381 225864
15736B25864q5453k7813l1036j51000l6811N051P8865O8312l8602k8208M8809
$$ 225864 140411 112598 81562 -69438 -106249 -101198 -22333 45979 7377 -20831 27978
15725B7978M8396P2650p2673n7760O6167Q0884m2409j05137o2097j11889m743
$$ 27978 76374 149024 76351 18591 84758 165642 123233 18096 -44001 -155890 -160633
15714a60633P5222k380n2885N2758O5078M6567l6130j31311j1948R9682O4381
$$ -160633 -85411 -87791 -140676 -87918 -22840 23727 -12403 -143714 -155662 -55980 8401
15703H401Q1801k3482j06706k117J23577M5753j6302p4101j15846N4284j7252
$$ 8401 90202 66720 -39986 -42103 81474 127227 110925 36824 -79022 -24738 -41990
15692d1990N0746J4982k6264j6107J29446j5180k3695l3503k6700q9550j4628
$$ -41990 8756 23738 -2526 -18633 110813 95633 71938 38435 11735 -77815 -92443
15681i2443P21J35070K3691N2698j05945j67001n336Q780J46485J42652j4175
$$ -92443 -91722 43348 67039 119737 13792 -153209 -158545 -149765 -3280 139372 125197
15670A25197j66457r531J1687m0384K3268p7179J02139N7107L9199N5336q0925
$$ 125197 -41260 -50791 -39104 -79488 -56220 -133399 -31260 25847 65046 120382 39457
15659C9457o9906N2717Q4010O1787k2102o8768j7640L4992r032j7239n499n3321
$$ 39457 -30449 22268 106278 168065 145963 77195 59555 94547 85515 68276 62777 9456
15647I456J9541k2546k0581N7902n5036M3836M6689M6171q0909m6127o558J27980
$$ 9456 28997 6451 -14130 43772 -11264 32572 79261 125432 44523 -1604 -8162 119818
15635A19818J32277P2986L9332j84025j27998p2238o2400K8827j5620L5826j214
$$ 119818 252095 325081 364413 180388 52390 -19848 -82248 -53421 -69041 -33215 -34429
15624c4429j7127q4157m8543l0343J17455N5701q2483N9877J5921O3135L1269
$$ -34429 -51556 -135713 -184256 -214599 -97144 -41443 -123926 -64049 -48128 15007 46276
15613D6276P658j87470m3382R0358j5349j07138Q7175j2199q0790K00895O6662
$$ 46276 53934 -133536 -176918 -86560 -101909 -209047 -121872 -134071 -214861 -13966 52696
15602E2696m0696j80468L6689P4941P9301j3990l8784j10103p1945N9178O3951
$$ 52696 12000 -168468 -131779 -56838 22463 8473 -30311 -140414 -212359 -153181 -89230
15591h9230n7023r9581j5994j5333K3347R8141P0712n776J308K0635N4683P4131
$$ -89230 -146253 -245834 -261828 -277161 -253814 -155673 -84961 -90737 -89429 -68794 -14111 60020
15579F0020M620M8063l1154L2914k2337K5541O0160N52n5611m4702M3487K3291
$$ 60020 64640 112703 81549 114463 92126 117667 177827 178379 122768 78066 121553 144844
15567A44844r4743j61241p7812M027J05623J5932l3327L1103Q8737J20542N7913
$$ 144844 50101 -111140 -188952 -184925 -79302 -63370 -96697 -65594 23143 143685 201598
15556B01598q2208r7083o6591O1851K4577q4010M9914J3868k0922J86731J9803
$$ 201598 119390 22307 -44284 17567 42144 -41866 8048 21916 994 187725 207528
15545B07528j17552k1939r9862q5571j0548o6898p2878Q352J18241M1213j26045
$$ 207528 89976 68037 -31825 -117396 -127944 -194842 -267720 -259368 -141127 -99914 -225959
15534b25959m8797J51210J03906j51880r4557R4469L9672N3230o2365N088R0774
$$ -225959 -274756 -123546 -19640 -171520 -266077 -171608 -131936 -78706 -141071 -135983 -45209
15523d5209o088r6387n8565J51562K32273j7414j29374k4385j8689r4839Q3582
$$ -45209 -51297 -147684 -206249 -54687 177586 160172 30798 6413 -12276 -107115 -23533
15512b3533K18609j37293j36181Q2746j06662j08817J28294J36221P586n1060
$$ -23533 195076 57783 -78398 4348 -102314 -211131 -82837 53384 60970 9910
15502I910p5908J12299J0707N7919J0572q729j01229j06650J1943n3337N211J03865
$$ 9910 -65998 46301 57008 114927 125499 116770 15541 -91109 -79166 -132503 -127292 -23427
15490b3427L8110q0847l9564P0831Q8808K6868O866k2924j9787p0774p9289M1473
$$ -23427 14683 -66164 -105728 -34897 53911 80779 87645 64721 44934 -25840 -105129 -63656
15478f3656N4057p8313k0340L8072l3440L9146j4695l2208o5025q5905r9661Q9104
$$ -63656 -9599 -87912 -108252 -70180 -103620 -64474 -79169 -111377 -176402 -262307 -361968 -272864
15466b72864J59426R468q8030J6480O1371l9662n7823K0090J33267J45986k608
$$ -272864 -113438 -103970 -192000 -175520 -114149 -153811 -211634 -191544 -58277 87709 85101
15455H5101o6829j5560K3177K1752L0118J2615q1272o4025q855m2670K9723K0469
$$ 85101 18272 2712 25889 47641 77759 90374 9102 -54923 -63778 -106448 -76725 -56256
15443e6256R1478m9289m2225J08914K32438L333k04569o9599j4440j071M3818
$$ -56256 35222 -14067 -56292 52622 285060 288393 83824 14225 -215 -1286 42532
15432D2532M8421j18414o9532j01598L3546K1506j0084m7232Q6531N3466m8935
$$ 42532 90953 -27461 -96993 -198591 -165045 -143539 -153623 -200855 -114324 -60858 -109793
15421a09793J13416J60155l7182r3602j09558K1328k741O2602J22150j09710m1299
$$ -109793 3623 163778 126596 32994 -76564 -55236 -57977 4625 126775 17065 -24234
15410b4234l648O2235m1206q3962O5344Q1360P0068L5584q234q8030p6533j7842
$$ -24234 -27882 34353 -6853 -90815 -25471 55889 125957 161541 153307 65277 -11256 -29098
15398b9098J81598O1473j66918l6949p1075r5491P0607M3890M8716O5520k8894
$$ -29098 152500 213973 47055 10106 -60969 -156460 -85853 -41963 6753 72273 43379
15387D3379j07628P563J05341L1653j02943p3593n5083J07228j3529p1251Q6156
$$ 43379 -64249 -56686 48655 80308 -22635 -96228 -151311 -44083 -57612 -128863 -42707
15376d2707J10818K7931k9474L0588j5490m7428j4453r6072p8195l3132M6835
$$ -42707 68111 96042 66568 97156 81666 34238 19785 -76287 -154482 -187614 -140779
15365a40779J3263J7534R1982J22543N6439j19259j45418m9696O5757J58987P7204
$$ -140779 -127516 -109982 -18000 104543 160982 41723 -103695 -153391 -87634 71353 148557
15354A48557n7223r6543r6915o0076j38774M3427N0653M0195J46343N7535p1702
$$ 148557 91334 -5209 -102124 -162200 -300974 -257547 -206894 -166699 -20356 37179 -34523
15343c4523Q2921J11989o4637r1246o4029P1701p2250n3997l5338M0769k946l1591
$$ -34523 48398 160387 95750 4504 -59525 12176 -60074 -114071 -149409 -108640 -111586 -143177
15331a43177N8884Q0889K3131M079j14238J0923Q0108o474j4829J02817K3691
$$ -143177 -84293 -3404 19727 23806 -90432 -79509 599 -5875 -20704 82113 105804
15320A05804n4660n7739k9286L0383K1827j83018m4286J9335J1240N9570Q6954
$$ 105804 51144 -6595 -35881 -5498 16329 -166689 -210975 -191640 -180400 -120830 -33876
15309c3876N8605L2295j09530r7245l6902j3966L8867O6921p750M2547k5623j1086
$$ -33876 24729 57024 -52506 -149751 -186653 -200619 -161752 -94831 -102581 -60034 -85657 -96743
15297i6743J57304P8576j12880q9952O7443J04628M8756m3912L6660J6345r6704
$$ -96743 60561 139137 26257 -63695 3748 108376 157132 113220 149880 166225 69521
15286F9521n2003K3035M3621L6845p1585K4419k1317j42972L897J31110O9290
$$ 69521 17518 40553 84174 121019 49434 73853 52536 -90436 -86539 44571 113861
15275A13861L2971l0966j25646J0215m5880P7059l0393n7145k9039L2294p5249
$$ 113861 146832 115866 -9780 435 -45445 31614 1221 -55924 -84963 -52669 -127918
15264a27918K8334M3004L5513m7999k9130J60430R1696o2293j02522q8589N0940
$$ -127918 -99584 -56580 -21067 -69066 -98196 62234 153930 91637 -10885 -99474 -48534
15253d8534P472j31041m8689P7304J53239J3630M3619n9686q9214l1226K5669
$$ -48534 -41062 -172103 -220792 -143488 9751 23381 67000 7314 -81900 -113126 -87457
15242h7457J34981k4571p2508J12723O773j67161r1610R511N1857M3742J79742
$$ -87457 47524 22953 -49555 63168 69941 -97220 -188830 -179319 -127462 -83720 96022
15231I6022r0515m8985M820n642J5308J07884n4793p880K6980j76257r78J36954
$$ 96022 5507 -43478 -38658 -44300 -28992 78892 24099 16219 43199 -133058 -134036 2918
15219B918O4833k4253p6357n9058J04952J21248n5513o5023L5109P9842Q8370
$$ 2918 67751 43498 -32859 -91917 13035 134283 78770 13747 48856 128698 217068
15208B17068l6045n5357o663o589j3476R673K5198n7494L5103Q2587l4397o5758
$$ 217068 181023 125666 119003 112414 98938 108611 133809 76315 111418 194005 159608 93850
15196I3850m5946R5615l3283j14830K5540l781J28806K7112n9032n9600n9283
$$ 93850 47904 143519 110236 -4594 20946 17165 145971 173083 114051 54451 -4832
15185d832J18269l655p3412m3988N1362n0491r504J5869n5167N02m1462j16831
$$ -4832 113437 109782 36370 -7618 43744 -6747 -16251 -382 -55549 -55047 -96509 -213340
15173b13340j7550J76967J10360j11481J6899L3743L2222q2991K6387R8022J04994
$$ -213340 -230890 -53923 56437 -55044 -38145 -4402 27820 -55171 -28784 69238 174232
15162A74232J0229N2228j8820L2746L5322k36958j24858L4886J07239n6794j87326
$$ 174232 184461 236689 217869 250615 285937 48979 -75879 -40993 66246 9452 -177874
15151a77874j19167R5382J08093J09173q9062K7663N6069l6923j0729M9639k9590
$$ -177874 -297041 -201659 -93566 15607 -73455 -45792 10277 -26646 -37375 12264 -17326
15140a7326j6618O6267l5513l0989r057r096j13685Q0081O1449m8384o3364J15289
$$ -17326 -33944 32323 -3190 -34179 -43236 -52332 -166017 -85936 -24487 -72871 -136235 -20946
15128b0946J37070O1373r2798Q180J0683n4546n5637J065L529j39899m3521K2505
$$ -20946 116124 177497 84699 92879 103562 49016 -6621 -5556 -2027 -141926 -185447 -162942
15116a62942Q4812L8374p2020j97862p8119L8215J80493J99925L2268M5656n6
$$ -162942 -78130 -39756 -111776 -309638 -387757 -349542 -169049 30876 63144 108800 108744
15105A08744j60686j26760J1000J98801L4834q2711o4206k560J09708r513O2411
$$ 108744 -51942 -178702 -167702 31099 65933 -16778 -80984 -83544 26164 16651 79062
15094G9062M6664q3148K1376l3762m7881O8109J7899m0534o7305p992l796Q3103
$$ 79062 125726 42578 63954 30192 -17689 50420 68319 27785 -39520 -47512 -51308 31795
15082C1795k9164o5185n8739L3559M6759Q1207J22814k2229j04220K077Q35q7892
$$ 31795 2631 -62554 -121293 -87734 -40975 40232 163046 140817 36597 38674 39509 -48383
15070d8383r7079j08457j24545r136J07672P2403M0835O6910N7329K5253O9625
$$ -48383 -145462 -253919 -378464 -387600 -279928 -207525 -166690 -99780 -42451 -17198 52427
15059E2427K6554K5424p3967p0624K1589J03036k7418q4954m1414Q3356Q0407
$$ 52427 78981 104405 30438 -40186 -18597 84439 57021 -27933 -69347 14009 94416
15048I4416k0425p8956K8747O0069M238k1275r0609M1178O501m5984P7698n74
$$ 94416 73991 -4965 23782 83851 88089 66814 -23795 17383 23884 -22100 55598 55024
15036E5024O4081j16614q9775j8117O3924O6876j56701J9118L113k6983L3354
$$ 55024 119105 2491 -87284 -105401 -41477 25399 -131302 -112184 -109071 -136054 -102700
15025a02700J33463Q860n6495L2185N7310k334j5757n96j2451l5450N4990J03039
$$ -102700 30763 39623 -16872 15313 72623 70289 54532 53936 41485 6035 61025 164064
15013A64064K8494n2334m0015n6247j2812O9666k9075j60885K3228j3333j54015
$$ 164064 192558 140224 100209 43962 31150 100816 71741 -89144 -65916 -79249 -233264
15002b33264N2874k586J7704J09946N0703J2370k8437n930M3692K10073K41775
$$ -233264 -180390 -182976 -165272 -55326 -4623 7747 -20690 -26620 17072 227145 468920
14991D68920J55860k2213p1095j13169k66842j26007O0699j42158k30039L1402
$$ 468920 624780 602567 531472 418303 151461 25454 86153 -56005 -286044 -254642
14981b54642M2942K5727K08258J88205R9170j65108j65700P2443O8768M571j9507
$$ -254642 -211700 -185973 22285 210490 309660 144552 -21148 51295 120063 124634 105127
14970A05127p0958l1304j1429n3536n2496P7378M6834J23350K3592j29623o3177
$$ 105127 34169 2865 -8564 -62100 -114596 -37218 9616 132966 156558 26935 -36242
14959c6242M5505p2713n2318m1067Q9015M2532l0579j08179Q591R0066L7509l0826
$$ -36242 9263 -63450 -115768 -156835 -67820 -25288 -55867 -164046 -155455 -65389 -27880 -58706
14947e8706l8210j9339j27728j8229K6163J67941l5950k0418O1071O1327P656
$$ -58706 -96916 -116255 -243983 -262212 -236049 -68108 -104058 -124476 -63405 -2078 5578
14936E578q6014l6341J1694J32663J1471p3194k0500Q5285j24740p751J3541j6756
$$ 5578 -80436 -116777 -105083 27580 39051 -34143 -54643 30642 -94098 -101849 -88308 -105064
14924a05064n74K0995K0788J73345J88783j89552q3513K918j18977m399O3370
$$ -105064 -105638 -84643 -63855 109490 298273 108721 25208 28126 -90851 -95250 -31880
14913c1880l0457O987N4277r941j11272n9840j5760N3885P7646o0827P7311p889
$$ -31880 -62337 -55350 -1073 -11014 -122286 -182126 -197886 -144001 -66355 -127182 -49871 -57760
14901e7760p8739r4818M0232J10127J37045L0251Q7712j24865M2559m6538J48170
$$ -57760 -136499 -231317 -191085 -80958 56087 86338 174050 49185 91744 45206 193376
14890A93376J18174k8324P6519p3256j32561p6009j28331N452O4720J9678o8308
$$ 193376 311550 283226 359745 286489 153928 77919 -50412 -44960 19760 39438 -28870
14879b8870p4037J5111l4201k350j1638o531l9524K536J18382J22381p3931j45454
$$ -28870 -102907 -87796 -121997 -124347 -135985 -142516 -182040 -179504 -61122 61259 -12672 -158126
14867a58126j509Q7650L4709O128n4878L478O9993k1976l8882J9384J22949j5471
$$ -158126 -159635 -71985 -37276 -31148 -86026 -82548 -12555 -34531 -73413 -54029 68920 53449
14855E3449l3301N4596o1864p7623J932L767m3997J5923J52963J9056l5897j872
$$ 53449 20148 74744 12880 -64743 -62811 -59044 -103041 -87118 65845 84901 49004 47132
14843D7132n0811j0757r4271k7494J14829L5304q9620M5840O5602q2699n6415
$$ 47132 -3679 -14436 -108707 -136201 -21372 13932 -75688 -29848 35754 -46945 -103360
14832a03360l8233M0389J4923J08095M9632r1717N3501m2393l7155l0451p9630
$$ -103360 -141593 -101204 -86281 21814 71446 -20271 33230 -9163 -46318 -76769 -156399
14821a56399J07982J3759k0878J07591j1009P186p0770k9535j66295j6937q705
$$ -156399 -48417 -34658 -55536 52055 41046 48232 -22538 -52073 -218368 -235305 -244010
14810b44010M3902J18237m2257r4096k2954j04741j05639R9157J90729K05632
$$ -244010 -200108 -81871 -124128 -218224 -241178 -345919 -451558 -352401 -161672 43960
14800D3960P7555j16814n5171O5063J41390l5788n4060l347m2928p1892l993q195
$$ 43960 121515 4701 -50470 14593 155983 120195 66135 62788 19860 -52032 -56025 -64220
14788f4220q5202q4736l3601k9947J56569K30451j44384p1944m5967l4045n7028
$$ -64220 -149422 -234158 -267759 -297706 -141137 89314 -55070 -127014 -172981 -207026 -264054
14777b64054M929L7894L3303O4970j7157r4J25445Q1210L9709m0380M4565o4859
$$ -264054 -259125 -221231 -187928 -122958 -140115 -140209 -14764 66446 106155 65775 110340 45481
14765D5481p8953M4332J3299k7545R6002R6773n5506k12771j20366m653n7106
$$ 45481 -33472 10860 24159 -3386 92616 189389 133883 -78888 -199254 -203907 -261013
14754b61013J9763O8449J89636J28143m9365q4689L274n7573q9579p6771J396
$$ -261013 -241250 -172801 16835 144978 95613 10924 14198 -43375 -132954 -209725 -208329
14743b08329P3056J14057K0401l911M9860n6434j51050P2412J66810M602n8335
$$ -208329 -135273 -21216 -815 -4726 45134 -11300 -162350 -89938 76872 81474 23139
14732B3139m4792j23933q520M5867J1983K4286j3727L1664R1146O1581k5544l8420
$$ 23139 -21653 -145586 -154106 -108239 -96256 -71970 -85697 -54033 37113 98694 73150 34730
14720C4730p5682k9202M6138K460j80685p3363N4712N09P1429J32651l4950j51478
$$ 34730 -40952 -70154 -24016 -21556 -202241 -275604 -220892 -220383 -148954 -16303 -51253 -202731
14708b02731J8614N6081L7106r7505N9464L6407M5399J13119J6499J5198K6550
$$ -202731 -184117 -128036 -90930 -188435 -128971 -92564 -47165 65954 82453 97651 124201
14697A24201j10370l0034m3061j39327J1531J59572L3859Q787J2500J0009n6132
$$ 124201 13831 -16203 -59264 -198591 -187060 -27488 6371 15158 27658 37667 -18465
14686a8465k1608Q6941M7329j9268J28844j6558k19137L2238P6193M0702m7571
$$ -18465 -40073 46868 94197 74929 203773 187215 -31922 316 76509 117211 69640
14675F9640j8509j2291n9477j8889j9645K1620j9434o5245k2119J30353P9431
$$ 69640 51131 38840 -20637 -39526 -59171 -37551 -56985 -122230 -144349 -13996 65435
14664F5435M333j56311j5834J26051k8832m2808O9399K4378O640l8981J544r0555
$$ 65435 69768 -86543 -102377 23674 -5158 -47966 21433 45811 52451 13470 15014 -75541
14652g5541r0028k8130P7126J18748j4011o1877M2978j4604m8899J4113L3190
$$ -75541 -165569 -193699 -116573 2175 -11836 -73713 -30735 -45339 -94238 -80125 -46935
14641d6935N7962r3498j05338Q117Q0526J06293R4065m3340j08664k1061N3127
$$ -46935 11027 -82471 -187809 -179692 -99166 7127 101192 57852 -50812 -71873 -18746
14630a8746J5255K1333J6441o1971N9179M8287L3984n1484n1185p7170o6620q5590
$$ -18746 -3491 17842 34283 -27688 31491 79778 113762 62278 11093 -66077 -132697 -218287
14618b18287j7913K120J60965J57141o353J306q3098K730J16426K6115o1775p0268
$$ -218287 -236200 -234080 -73115 84026 77673 78979 -4119 -1389 115037 141152 79377 9109
14606I109n5963J15775m1944M1255j1189j5619M4379j8277L8723q2543N8451K3886
$$ 9109 -46854 68921 26977 68232 57043 41424 85803 67526 106249 23706 82157 106043
14594A06043r2598j07916P1368L6461m9789j48623k5776o4304n1752J05741L4947
$$ 106043 13445 -94471 -23103 13358 -36431 -185054 -210830 -275134 -326886 -221145 -186198
14583a86198n4955J1844k1831M7035k305P8412L7846P9345l9273n0869K05662
$$ -186198 -241153 -229309 -251140 -204105 -206410 -127998 -90152 -10807 -50080 -100949 104713
14572A04713K9674l1771O1529N5725k0325p6704r6576l3283k9692R674O3072j0767
$$ 104713 134387 102616 164145 219870 199545 122841 26265 -7018 -36710 -27036 36036 25269
14560B5269j0322N913n3029m9149Q495k16285M4545K14591M2188n1530m4518j8358
$$ 25269 14947 20860 -32169 -81318 -72823 -289108 -244563 -29972 12216 -39314 -83832 -102190
14548a02190N2025O314K7838r0050j35665m2056J16657J9398J18589L2434j03710
$$ -102190 -50165 -43851 -16013 -106063 -241728 -283784 -167127 -147729 -29140 3294 -100416
14537a00416o1306J5587J44K12123J45370j01363q5110l7431R6359m5095p1511
$$ -100416 -161722 -146135 -145991 66132 211502 110139 25029 -12402 83957 38862 -32649
14526c2649m9930J768O7926Q9904j3606j6412k5931o0781M3379j7374R86O2115
$$ -32649 -82579 -80811 -12885 77019 63413 47001 21070 -39711 3668 -13706 -12720 49395
14514D9395K0121j33079m6521j6859l6137q5007J1086J61777R4537P3654N9805
$$ 49395 69516 -63563 -110084 -126943 -163080 -248087 -237001 -75224 19313 92967 152772
14503A52772j63915j07651J00560O4980J3785m9160j00914N9050k2121J1547J03704
$$ 152772 -11143 -118794 -18234 46746 60531 11371 -89543 -30493 -52614 -41067 62637
14492F2637J0165J30655M6498j25349K4098o0602O2363J8448L9818j14801O033
$$ 62637 72802 203457 249955 124606 148704 88102 150465 168913 208731 93930 99963
14481I9963R3019Q3733p8702k2491N5822k9466j66471j02246j76751r732J29556
$$ 99963 192982 276715 198013 175522 231344 201878 35407 -66839 -243590 -253322 -123766
14470a23766N8532r6591J6456J22264J20555L1460j9880p5227q7119N8050L2640
$$ -123766 -65234 -161825 -145369 -23105 97450 128910 109030 33803 -53316 4734 37374
14459C7374J0706P0826l1403n8259o6386q2492M2631J04162P0840K2295L4606
$$ 37374 48080 118906 87503 29244 -37142 -119634 -77003 27159 97999 120294 154900
14448A54900r4479q2209j16283J3678J81453R4521L639n0157j01788j18651p4072
$$ 154900 60421 -21788 -138071 -124393 57060 151581 155220 105063 3275 -115376 -189448
14437a89448L7372L7845K8619m7020l1680J5472j05662Q0003N889J24581N2120
$$ -189448 -152076 -114231 -85612 -132632 -164312 -148840 -254502 -174499 -168610 -44029 8091
14426H091j05878k2271j45493O5336Q3838J88563K5422q8973q1551n0961p2413
$$ 8091 -97787 -120058 -265551 -200215 -116377 72186 97608 8635 -72916 -123877 -196290
14415a96290k4937m0740Q7863J41122N0309j4266M9392n3725p2142k310O0937
$$ -196290 -221227 -261967 -174104 -32982 17327 3061 52453 -1272 -73414 -75724 -14787
14404a4787k0214P5283M7713M0411j05395l5140p9090l4848l671O5854j5476K9217
$$ -14787 -35001 40282 87995 128406 23011 -12129 -91219 -126067 -129738 -63884 -79360 -50143
14392e0143Q4836O444N5902k8461n8965Q9786J81349j47041j15283k7140P9213
$$ -50143 34693 41137 97039 68578 9613 99399 280748 133707 18424 -8716 70497
14381G0497j1862k0676J04827j67058l4437M7490j20153j1735P6462p8416N5446
$$ 70497 58635 37959 142786 -24272 -58709 -11219 -131372 -143107 -66645 -145061 -89615
14370h9615Q281J05428K6461o9277m3011R770r714J14932N0669j25635r4845Q6329
$$ -89615 -81334 24094 50555 -18722 -61733 -51963 -61677 53255 103924 -21711 -116556 -30227
14358c0227j78145J8943K9495J2303Q1296P6899r0974j42185O0968k0194r4461
$$ -30227 -208372 -189429 -159934 -147631 -66335 10564 -80410 -222595 -161627 -181821 -276282
14347b76282p067J9698k6919K14670Q2577j31550P6236J14701N5263l9786j47088
$$ -276282 -283349 -263651 -290570 -75900 6677 -124873 -48637 66064 121327 81541 -65547
14336f5547l6812p9339O0220K5791n9151J28969M8425l9865J5987N2684j02011
$$ -65547 -102359 -181698 -121478 -95687 -154838 -25869 22556 -17309 -1322 51362 -50649
14325e0649m3587L6269l249j1815m1558K6175n1137j35053P799J11977J31671
$$ -50649 -94236 -57967 -61216 -73031 -114589 -88414 -139551 -274604 -266805 -154828 -23157
14314b3157n6924K841J40426J31733k2860q7805q957p9219J3436L806k5028k7008
$$ -23157 -80081 -77240 63186 194919 172059 84254 75297 -3922 9514 13320 -11708 -38716
14302c8716m678J9491K9615N6000J6421r57J0557K9438k3070O2919J6914j66586
$$ -38716 -43394 -23903 5712 61712 78133 77176 87733 117171 94101 157020 173934 7348
14290G348k1868L2061R9064o236M0580l1428o5070m0636M1927K6155P3939m6090
$$ 7348 -14520 17541 116605 110369 150949 119521 54451 13815 55742 81897 155836 109746
14278A09746n511L4288L5801l3049q9216j12637K0369J04057J00672j55718j51988
$$ 109746 104235 138523 174324 141275 52059 -60578 -40209 63848 164520 8802 -143186
14267a43186P2632P6079M2122j4640l4134p2155P1909J12885M939p6550j2325
$$ -143186 -70554 5525 47647 33007 -1127 -73282 -1373 111512 116451 39901 27576
14256B7576l3475Q144P0456j19910k05317J03714J81608K229m5117L8189M849
$$ 27576 -5899 2245 72701 -47209 -252526 -148812 32796 35025 -10092 28097 32946
14245C2946l3278Q3225J196O474p486j76036j11744k2558l0695O1218O6867p132
$$ 32946 -332 82893 84089 90563 83077 -92959 -204703 -227261 -257956 -196738 -129871 -137003
14233a37003j749j6996Q6312N8318r9709J13621l5279j03367o0290p0138Q2796
$$ -137003 -138752 -155748 -69436 -11118 -110827 2794 -32485 -135852 -196142 -266280 -183484
14222a83484J90521L2231l0296j17131r0268P1702P6067Q6663M2233m2260J8443
$$ -183484 7037 39268 8972 -108159 -198427 -126725 -50658 36005 78238 35978 54421
14211E4421k5314k9250m3646p6100O6883Q3110L9706J5708q0215J0334K8635P782
$$ 54421 29107 -143 -43789 -119889 -53006 30104 69810 85518 5303 15637 44272 52054
14199E2054q83O8458R0743n0407p1917l4183q1021n9924J23929n4231r36M7350
$$ 52054 51171 119629 210372 159965 88048 53865 -27156 -87080 36849 -17382 -18318 29032
14187B9032P4527j02038m0453K7668J25295l8761l1349r595m0920P9684J18541
$$ 29032 103559 1521 -38932 -11264 114031 75270 43921 34326 -6594 73090 191631
14176A91631j02031j17842J4626j7889q3944O6323J0684j3044j7384j3329k4415
$$ 191631 89600 -28242 -13616 -31505 -115449 -49126 -38442 -51486 -68870 -82199 -106614
14165a06614l4211n1892K0687l3690L1170J08843N803r9421m6148J02155N2694
$$ -106614 -140825 -192717 -172030 -205720 -174550 -65707 -59904 -159325 -205473 -103318 -50624
14154e0624J0184J233q0215m835J00363R0699J47381Q2381R3713m0178k01855
$$ -50624 -40440 -39207 -119422 -124257 -23894 66805 214186 296567 390280 350102 148247
14143A48247l7011k9328m6370k7185k9632L2140j01812J8336Q904N0234J80402
$$ 148247 111236 81908 35538 8353 -21279 10861 -90951 -72615 -63711 -13477 166925
14132A66925M0048k6474o4756q9010m6251k7049j04163n2283Q4841P5777N079
$$ 166925 206973 180499 115743 26733 -19518 -46567 -150730 -203013 -118172 -42395 -37316
14121c7316M9771l6093j34919Q7388N446o5851j1853L3271q031L6974N7424P04
$$ -37316 12455 -23638 -158557 -71169 -65723 -131574 -143427 -110156 -118187 -81213 -23789 -23085
14109b3085P2764M0758k0990L4139j50472n5057k7095J2614L6544J35931m2055
$$ -23085 49679 90437 69447 103586 -46886 -101943 -129038 -116424 -79880 56051 13996
14098A3996p6368j35725m5718O0397J23065O3063j1689p0570k1003O0392J6582
$$ 13996 -62372 -198097 -243815 -183418 -60353 2710 -8979 -79549 -100552 -40160 -23578
14087b3578r9560j25267m4131J30781N1863r3405O5657k4961J02167L5704K4436
$$ -23578 -123138 -248405 -292536 -161755 -109892 -203297 -137640 -162601 -60434 -24730 -294
14076b94j09980J5429K1122J14020P253p0784o2358N3257o005J2906j29161k17037
$$ -294 -110274 -94845 -73723 40297 47550 -23234 -85592 -32335 -38340 -25434 -154595 -371632
14064c71632J20531O5720R7430K05432l2597m516m6171k9917K2461o8735j1813
$$ -371632 -251101 -185381 -87951 117481 84884 80368 34197 4280 26741 -41994 -53807
14053e3807p2991j22015J4497L9763J15219q5123L3183L3775M9877p2290l8019
$$ -53807 -126798 -248813 -234316 -194553 -79334 -164457 -131274 -97499 -47622 -119912 -157931
14042a57931j5225K4191j3519p0945L6731J31568J24395n0313k4118L4780K4300
$$ -157931 -173156 -148965 -162484 -233429 -196698 -65130 59265 8952 -15166 19614 43914
14031D3914R086j4750K2886l6667R479m4800q1740M0450K5739O4065Q9075O2949
$$ 43914 53000 38250 61136 24469 33948 -10852 -92592 -52142 -26403 37662 126737 189686
14019A89686l6701N9474J14885k4518j56135q8486K0546K0223R8809J64656J05284
$$ 189686 152985 212459 327344 302826 146691 58205 78751 98974 197783 362439 467723
14008D67723J5451M3307N6812J77288L35480N75067R46074R96210M76916J75315
$$ 467723 483174 526481 583293 760581 1096061 1671128 2617202 3613412 4090328 4265643
13998D265643j4556m70983p30210p82254o66627m40457k00921j21285j00726j17212
$$ 4265643 4251087 3780104 3049894 2267640 1601013 1160556 959635 838350 737624 620412
13988F20412j02837N888q0834q1225n5312p0839O1598k1076m5144j04509Q8877
$$ 620412 517575 523463 442629 361404 306092 235253 296851 275775 230631 126122 214999
13977B14999L7536j15329r6985N276R0199K9307J2687Q5462J8838M2052r4516
$$ 214999 252535 137206 40221 45497 135696 165003 177690 263152 281990 324042 229526
13966B29526q4764P325k7618n4850R530P9930o2257N846j1175j47034k5630M3142
$$ 229526 144762 152087 124469 69619 79149 159079 96822 102668 91493 -55541 -81171 -38029
13954c8029O8154k4913L8996J23308j08211j92201j13605L1476J43788R530m3695
$$ -38029 30125 5212 44208 167516 59305 -132896 -246501 -215025 -71237 -61707 -105402
13943a05402j01579P5295P9114Q1747R6609p1995m7507l2953m9209r04m8469J03574
$$ -105402 -206981 -131686 -52572 29175 125784 53789 6282 -26671 -75880 -76784 -125253 -21679
13931b1679J10005r3635L8941R1578o3111j33177o8797R9429K6694j5335j5012
$$ -21679 88326 -5309 33632 125210 62099 -71078 -139875 -40446 -13752 -29087 -44099
13920d4099k0811k4960N3121J46998J34389o0079j75711n9552l1411O7686Q4528
$$ -44099 -64910 -89870 -36749 110249 244638 184559 8848 -50704 -82115 -14429 70099
13909G0099R0599m1431l5697p8570m3164Q2980P1300k3064K9437K1023l7288q3609
$$ 70099 160698 119267 83570 5000 -38164 44816 116116 93052 122489 143512 106224 22615
13897B2615J2737o087o9122j30161j54285L9487J04940J93920K4605N9101l4576
$$ 22615 35352 29265 -39857 -170018 -324303 -284816 -179876 14044 38649 97750 63174
13886F3174p5004n2716J9013P645n9494J3356n509O7611Q2040m6757N2213j2995
$$ 63174 -11830 -64546 -45533 -37888 -97382 -84026 -89535 -21924 60116 13359 65572 52577
13874E2577j8095k4641J57742Q9878j52879l5782l7708R1280N3769k6173j52115
$$ 52577 34482 9841 167583 257461 104582 68800 31092 122372 176141 149968 -2147
13863b147j92238l4045j5109J09766J47171J02923l9424o4987M2205J1362p3228
$$ -2147 -194385 -228430 -243539 -133773 13398 116321 76897 11910 54115 65477 -7751
13852g751J01975N2908P8556M4765j09001o6747k8754m5351O3345q7527l2266
$$ -7751 94224 147132 225688 270453 161452 94705 65951 20600 83945 -3582 -35848
13841c5848P3564P1418j05864m4661j9849P8901P6151P8673o2202j7659n1031
$$ -35848 37716 109134 3270 -41391 -61240 17661 93812 172485 110283 92624 41593
13830D1593j13872o7355J83284Q9025K0107j0819n3099j14476j4850K0759P1713
$$ 41593 -72279 -139634 43650 132675 152782 141963 88864 -25612 -40462 -19703 52010
13819E2010J0417j62064J06N8003j4359n2683K365o969L4533o8817M5446J3141
$$ 52010 62427 -99637 -99531 -41528 -55887 -108570 -106205 -113174 -78641 -147458 -102012 -88871
13807h8871k8953N7162M898j20014K2090J16718K1781J24471J9186o9841k0579
$$ -88871 -117824 -60662 -55764 -175778 -153688 -36970 -15189 109282 128468 58627 38048
13796C8048M9605M3046n4103k4426j428K6474m3246j41904r124p148Q2004J49229
$$ 38048 87653 130699 76596 52170 50742 77216 33970 -107934 -117058 -124206 -42202 107027
13784A07027Q3722j37755j46552P3947M9990J2404q2619r3375K7116J27339J02098
$$ 107027 190749 52994 -93558 -19611 30379 42783 -39836 -133211 -106095 21244 123342
13773A23342l942k9451r2232M9249J11550M2848j39197o3432m0249j176j0621
$$ 123342 119400 89949 -2283 46966 158516 201364 62167 -1265 -41514 -42690 -53311
13762e3311m2615q6326Q6892J65622j6559P975j8523o0734n5710O0525O5751P4382
$$ -53311 -95926 -182252 -95360 70262 53703 61678 43155 -17579 -73289 -12764 52987 127369
13750A27369r7183K9309J05349p2133n6082m3329O8393R7441q5628p3442j12673
$$ 127369 30186 59495 164844 92711 36629 -6700 61693 159134 73506 64 -112609
13739a12609o4678k2009N2691J8635J09464P5248K8783J26917r4742j32064o7080
$$ -112609 -177287 -199296 -146605 -127970 -18506 56742 85525 212442 117700 -14364 -81444
13728h1444J56351J32274n4972j23258m1617R879m0808K3192K7317J23211O5271
$$ -81444 74907 207181 152209 28951 -12666 -2787 -43595 -20403 6914 130125 195396
13717A95396n2401K2573j35862j36255N471K0864l6976o4664J01923l7930J7924
$$ 195396 142995 165568 29706 -106549 -101078 -80214 -117190 -181854 -79931 -117861 -99937
13706i9937q516q0907j50130l2958M8168P3658J71750k5946l3453j6848l7621
$$ -99937 -108453 -189360 -339490 -372448 -324280 -250622 -78872 -104818 -138271 -155119 -192740
13695a92740J938K5222k7052n479J11096j23158J00041K3549p012j3748Q1002
$$ -192740 -190802 -165580 -192632 -198111 -87015 -210173 -110132 -86583 -93595 -107343 -26341
13684b6341O7867j8770r0132l1208l0819M036R8525m7155P4610k256j94344o8386
$$ -26341 41526 22756 -67376 -98584 -129403 -125367 -26842 -73997 613 -1643 -195987 -264373
13672b64373L2123J25263R630M573O1554j0646j02650r0767q96K0454J26879J92708
$$ -264373 -232250 -106987 -97357 -92784 -31230 -41876 -144526 -235293 -236189 -215735 -88856 103852
13660A03852O3428j42064p2415O8281J03535K2555J5437k8778j16719k0961p1912
$$ 103852 167280 25216 -47199 21082 124617 147172 162609 133831 17112 -3849 -75761
13649g5761m8267Q8505m433P819p5351Q6586Q7611J248J30760m8575j44871o1720
$$ -75761 -124028 -35523 -39956 -32137 -107488 -20902 66709 67957 198717 150142 5271 -56449
13637e6449Q5420k1521J5030j2850j7441M564R3321K2312j37400J6521k4591l4793
$$ -56449 28971 7450 22480 9630 -7811 -3247 90074 112386 -25014 -8493 -33084 -67877
13625f7877K949l564Q7697l7956q690M0014J3384m8755m8722m3234m583Q5649
$$ -67877 -64928 -68492 19205 -18751 -27441 12573 25957 -22798 -71520 -114754 -119337 -33688
13613c3688O503N0822J61388J07704m7592k4546J5085M3967j40008M3892J20036
$$ -33688 -27185 23637 185025 292729 245137 220591 235676 279643 139635 183527 303563
13602C03563r1696j07339j084P56r3071k0056k5847p4663k3389J4261Q4592J99600
$$ 303563 211867 104528 103444 104200 11129 -8927 -34774 -109437 -132826 -118565 -33973 165627
13590A65627N8543l5178m9050N094m2571L7419n6765o9144o8830r554k5078j0384
$$ 165627 224170 188992 139942 145036 102465 139884 83119 13975 -54855 -64409 -89487 -99871
13578i9871M9917J7827K0139k319N9609j1248q4608j40981n1364l9323M5097J15291
$$ -99871 -49954 -32127 -11988 -14307 45302 34054 -50554 -191535 -242899 -282222 -237125 -121834
13566a21834O09O43l494m3815n591P3724J96837r1932k2921j34517O6324R3643
$$ -121834 -121225 -120582 -124076 -167891 -173482 -99758 97079 5147 -17774 -152291 -85967 7676
13554G676q7174j00204M7643L0235Q0594J0848q7939p4872J38300J55934m548
$$ 7676 -79498 -179702 -132059 -101824 -21230 -10382 -98321 -173193 -34893 121041 116493
13543A16493o6989n7476n9288L5430k3813L975Q7901J13611L3092k5077m9148
$$ 116493 49504 -7972 -67260 -31830 -55643 -51668 36233 149844 182936 157859 108711
13532A08711j49989j68872M6722K1910N3774k8174l5954J09575M3852O8109J221
$$ 108711 -41278 -210150 -163428 -141518 -87744 -115918 -151872 -42297 1555 69664 70885
13521G0885j01228l8219N2675k6522N7298q358m0913J05244k3879l2418M9728
$$ 70885 -30343 -68562 -15887 -42409 14889 6531 -34382 70862 46983 14565 64293
13510F4293J938j04435p1233m953K6659o6789J1028K1092J36534J01120q02r5700
$$ 64293 66231 -38204 -109437 -114390 -87731 -154520 -143492 -122400 14134 115254 114452 18752
13498A8752r0296J19011P1293j02958O816K8317j0944l8689O8780J52163L2394
$$ 18752 -71544 47467 118760 15802 22618 50935 39991 1302 70082 222245 254639
13487B54639j8842j45400r4701M0257n161q6114M8080o428K6169k4772N3890L7135
$$ 254639 235797 90397 -4304 35953 30792 -55322 -7242 -13670 12499 -12273 41617 78752
13475G8752r6357j73692R1074K01781R9436q1383j71522j20682l7947Q0621j1267
$$ 78752 -17605 -191297 -100223 101558 200994 119611 -51911 -172593 -210540 -129919 -141186
13464a41186K6978J73980K5237n7135j15023n14M3714K1529r51N3284N3178L5034
$$ -141186 -114208 59772 85009 27874 -87149 -87663 -43949 -22420 -23371 29913 83091 118125
13452A18125j28263k0871R7771R3495N0288j66109q4169N6846P203r6117Q9566
$$ 118125 -10138 -31009 66762 160257 210545 44436 -39733 17113 24316 -71801 17765
13441A7765r0249k149J39681P3220l0160j23212L0185P7461J8316k6767o3608
$$ 17765 -72484 -74633 65048 138268 108108 -15104 15081 92542 110858 84091 20483
13430B0483n9108n0634R7043k8740L3463Q1687q2422n7494j6366q2724Q013J39401
$$ 20483 -38625 -89259 7784 -20956 12507 94194 11772 -45722 -62088 -144812 -136799 2602
13418B602J4864Q7634Q827p4751K2208K1918L2812l1232n2466q6547j7057m4568
$$ 2602 17466 105100 113927 39176 61384 83302 116114 84882 32416 -54131 -71188 -115756
13406a15756R5418K6857m0780M5639R90O571O0893n4005K8996L893K0194N6682
$$ -115756 -20338 6519 -34261 11378 12368 18939 79832 25827 54823 58716 78910 135592
13394A35592n8118o0084q7293p7701Q8698O3050p8112Q2928O0843k7000r2191
$$ 135592 77474 17390 -69903 -147604 -58906 4144 -73968 8960 69803 42803 -49388
13383d9388M1720J34482j13947K5063M8446p2784o5632j52476j13270Q4529J11341
$$ -49388 -7668 126814 12867 37930 86376 13592 -52040 -204516 -317786 -233257 -121916
13372a21916M369O5285n3672L6962o6573r0069M3065J92796P00m2990L7395R2821
$$ -121916 -117547 -52262 -105934 -68972 -135545 -225614 -182549 10247 10947 -32043 5352 98173
13360I8173o2631p0912J685J32325j9161j03451L2322j14464Q1921l1211j23147
$$ 98173 35542 -35370 -33685 98640 79479 -23972 8350 -106114 -24193 -55404 -178551
13349a78551k7723O0419k5366l7114n7008J29460R1793K7227R0602j0138k6240
$$ -178551 -206274 -145855 -171221 -208335 -265343 -135883 -44090 -16863 73739 63601 37361
13338C7361M9677o2842k2955P9037K0977p3673m7976l8031N8770J45020m5693
$$ 37361 87038 24196 1241 80278 101255 27582 -20394 -58425 345 145365 99672
13327I9672j140P0046m0629k04787o5835q5340m8205J03253R5357J47325K25427
$$ 99672 98532 168578 127949 -76838 -142673 -228013 -276218 -172965 -77608 69717 295144
13316B95144K3834q9858k11343p2883J24858k6707l8336J83520M6934j19626j19717
$$ 295144 318978 229120 17777 -55106 69752 43045 4709 188229 235163 115537 -4180
13305d180j12055m2219j1583o9435j00199J51545K20329q4514Q0429Q5344N2960
$$ -4180 -116235 -158454 -170037 -239472 -339671 -188126 32203 -52311 28118 113462 166422
13294A66422r2247j57L2227P6612q846r5854j1486Q3182m8958n2198P881J9045
$$ 166422 74175 74018 106245 182857 174011 78157 66671 149853 100895 48697 56578 75623
13282G5623M4466R3992L6796o4006N4428J42399K9744j04614r1550o7872K1754
$$ 75623 120089 214081 250877 186871 241299 383698 413442 308828 217278 149406 171160
13271A71160L5633l4722j27642j3725n6129j00044k0174N705L4721P4827k9560
$$ 171160 206793 172071 44429 30704 -25425 -125469 -145643 -139938 -105217 -30390 -59950
13260e9950J49708Q9119p7718J05958K13922J15238j5705M4390Q3963L5977m7022
$$ -59950 89758 178877 101159 207117 421039 536277 520572 564962 648925 684902 637880
13249F37880p086q6647j51237p1266k4482p6524q3725j03524J395Q9016p4308
$$ 637880 630794 544147 392910 321644 297162 220638 136913 33389 34784 123800 49492
13238D9492l7309j08596p6774J9106J38310P4607O1544N2269J85305M24742K70225
$$ 49492 12183 -96413 -173187 -154081 -15771 58836 120380 172649 357954 782696 1052921
13227A052921P3279N0450l5987o8332m2476j61657j52281p5889r3774r8577O1241
$$ 1052921 1126200 1176650 1140663 1072331 1029855 868198 715917 640028 546254 447677 508918
13216E08918K3272j11415j15677R0738J45896K34526N81071Q36747O22237j17474
$$ 508918 532190 420775 305098 395836 541732 776258 1357329 2194076 2816313 2698839
13206B698839o14999o28560l99775k87491j79356J2650n2937q0810j12105K0634
$$ 2698839 2083840 1455280 1055505 768014 588658 601308 548371 467561 355456 376090
13196C76090o2765p3476j46601p8942J5790o5707l9290J12025M0092J8360p8532
$$ 376090 313325 239849 93248 14306 30096 -35611 -74901 37124 77216 95576 17044
13185A7044o1993N0020J21935J2745j83847J11687Q1901q4054K3254R6629m395
$$ 17044 -44949 5071 127006 139751 -44096 67591 149492 65438 88692 185321 180926
13174A80926k8651M2979j10195p5705M761P1668j25531k4441l4288o4275K0230
$$ 180926 152275 195254 85059 9354 14115 85783 -39748 -64189 -98477 -162752 -142522
13163a42522K4023j0908L04l2790m0454J02044J05898j4256j2173J37420J90130
$$ -142522 -118499 -129407 -129103 -161893 -202347 -100303 5595 -8661 -20834 116586 306716
13152C06716j713r5859p0548k451m0059m1229O0693P647p8421l9704n9470Q956
$$ 306716 305003 209144 138596 136145 96086 54857 115550 123197 44776 5072 -54398 -45442
13140d5442j2277M2400P3279l0728j56648p837K9112l3543q212J3780j9348J9688
$$ -45442 -57719 -15319 57960 27232 -129416 -137253 -108141 -141684 -149896 -136116 -155464 -135776
13128a35776j8555R8645p8884J4400M3267K804J1966N0616k9439q6623l7600O5050
$$ -135776 -154331 -55686 -134570 -120170 -76903 -74099 -62133 -11517 -40956 -127579 -165179 -100129
13116a00129M6902J18918J4812M579j57804p7763M0688K2396l2851J59697J40797
$$ -100129 -53227 65691 80503 85082 -72722 -150485 -109797 -87401 -120252 39445 180242
13105A80242K068j46115J4732l4737k4419q9093M3664J17423n9114j7263L7709
$$ 180242 182310 36195 50927 16190 -8229 -97322 -53658 63765 4651 -12612 25097
13094B5097k6945J0912R6123K3097n5932r9206Q4182m638l7284K2710M7464M0983
$$ 25097 -1848 9064 105187 128284 72352 -26854 57328 52690 15406 38116 85580 126563
13082A26563q7530J10184J30922j2509j91874q2988N4192p0418l671P3450m5030
$$ 126563 39033 149217 280139 267630 75756 -7232 46960 -23458 -27129 46321 1291
13071A291m404P8645K2693k7172L5431n4018j21319j7703Q437n2866P4869J01669
$$ 1291 -3113 75532 98225 71053 106484 52466 -68853 -86556 -78119 -130985 -56116 45553
13059D5553j3637R8123J57718J8328j7613j64219l6570J22896J78613n9006j17095
$$ 45553 31916 130039 287757 306085 288472 124253 87683 210579 389192 330186 213091
13048B13091m5016j2141O1432J9326r4673j06862M5582L0096R563J28293J6104
$$ 213091 168075 155934 217366 236692 142019 35157 80739 110835 120398 248691 264795
13037B64795j7051j08775n0468J61501m3201j40583K4810q5094L9739L28949K88968
$$ 264795 247744 138969 88501 250002 206801 66218 91028 5934 45673 374622 663590
13026F63590J9170k9211j8606j56641k74038j56206N4092P5265M5023K8873q4126
$$ 663590 682760 653549 634943 478302 204264 48058 102150 177415 222438 251311 167185
13015A67185j03009n7869j32101R2271j21790m8342J23818R1339k0884n090J07522
$$ 167185 64176 6307 -125794 -33523 -155313 -203655 -79837 11502 -9382 -14472 93050
13004I3050n0821K6020K05031P3483k5907j9049j01097L0239M7967R7530j05171
$$ 93050 42229 68249 273280 346763 320856 301807 200710 230949 278916 376446 271275
12993B71275q9656k6610J23589K68979J05076p7077m1737q1563q5433m98j85398
$$ 271275 181619 155009 278598 547577 652653 575576 533839 452276 366843 366345 180947
12982A80947j06468K3472o9641k4069K7626N0606R3480K1213q7596j5490j6607
$$ 180947 74479 97951 28310 4241 31867 82473 175953 197166 109570 94080 77473
12971G7473K08070J11405L1242j17665K5764j4464J9391J44495N3270R0934K46382
$$ 77473 285543 396948 428190 310525 336289 321825 341216 485711 538981 629915 876297
12960H76297K69871J06676q7531p4764r4061p6007J612O628P2930J23713K11686
$$ 876297 1146168 1252844 1165313 1090549 996488 920481 922093 928721 1001651 1125364 1337050
12949A337050J53533K25540N23835N72279L48737k81720n95464m94377l25941
$$ 1337050 1490583 1716123 2239958 2812237 3160974 2879254 2283790 1789413 1463472
12940A463472m9097r5482l657J0681j48991k28165k02883n3490r2412j02951j10472
$$ 1463472 1414375 1318893 1315236 1325917 1176926 948761 745878 692388 599976 497025 386553
12929C86553n0581L2769Q7797P6981K99707J9779q9440k9910o5581n5479N0692
$$ 386553 335972 368741 456538 533519 833226 853005 763565 733655 668074 612595 663287
12918F63287o7449L0925P7406n949J994K6690K60011K03495r5784j15196j23508
$$ 663287 595838 626763 704169 698220 700214 726904 986915 1190410 1094626 979430 855922
12907H55922M6417O6355k2501l9699R1349n2153L3996M5886k48617l25499l85184
$$ 855922 902339 968694 946193 906494 997843 945690 979686 1025572 776955 451456 66272
12896F6272m30870j04018L7697n05N2645k3150j0150O7902P1826Q9325R8866J37003
$$ 66272 -364598 -468616 -430919 -431424 -378779 -401929 -412079 -344177 -272351 -183026 -84160 52843
12884E2843J90141J30659m3943j57434k9108p124J51921J59804p8561R0960J52604
$$ 52843 242984 373643 329700 172266 143158 136034 287955 447759 369198 460158 612762
12873F12762J1787j50168L8442J40528K45591N2104k8403p6205k7793j7159K5146
$$ 612762 624549 474381 512823 653351 898942 951046 922643 846438 818645 801486 826632
12862H26632r976m2813j14875p4938J20821J20061k6225j81165q9492K366L5748
$$ 826632 816656 773843 658968 584030 704851 824912 798687 617522 528030 530396 566144
12851E66144J7103J7602R8486K60012K35193J54792K54279L28392M08952P20628
$$ 566144 583247 600849 699335 959347 1194540 1349332 1603611 1932003 2340955 3061583
12841C061583J265433K487301L184471R62219j487130k143279j916414j342126
$$ 3061583 4327016 6814317 9998788 10961007 9473877 7330598 5414184 4072058
12833D072058p09762k17411o2111J9931R2562M9848J07596J05000K90022L26808
$$ 4072058 3362296 3144885 3082774 3102705 3195267 3245115 3352711 3457711 3747733 4074541
12823D074541M73940M82156N30866M51477O68206R43720R28005Q99092R10655
$$ 4074541 4548481 5030637 5561503 6012980 6681186 7624906 8552911 9452003 10362658
12814A0362658J095592J278839J457552J840718K184714K899507M167310O249506
$$ 10362658 11458250 12737089 14194641 16035359 18220073 21119580 25286890 31536396
12806C1536396J0002704J6308948K5381123L6190406L9433228K5688339R348066
$$ 31536396 41539100 57848048 83229171 119419577 158852805 184541144 193889210
12799A93889210M416641M278237o848760k4531337l4470519l3455586k5674948
$$ 193889210 198305851 202584088 195735328 171203991 136733472 103277886 77602938
12792G7602938j7279419j1338068p895415n627475l864641k544355j866041j440067
$$ 77602938 60323519 48985451 41090036 35462561 31597920 29053565 27187524 25747457
12784B5747457j096883o13970j93101R1620J132899K953891N009586P271336R653938
$$ 25747457 24650574 24036604 23843503 23935123 25068022 28021913 33031499 40302835 49956773
12775D9956773J4981264K6224166N0227232R6361588J57990300J31434254j3475891
$$ 49956773 64938037 91162203 141389435 237751023 395741323 527175577 513699686
12768E13699686j04079884j30782653r8499978n6081691l0987012j9619503j4023170
$$ 513699686 409619802 278837149 180337171 124255480 93268468 73648965 59625795
12761E9625795j0939940q611776p095676n749619m375831l381084k968857k273326
$$ 59625795 48685855 40074079 32978403 27228784 22852953 19471869 16503012 14229686
12753A4229686j678516j194514q21471o25862o08396n48713l53426k38915m05235
$$ 14229686 12551170 11356656 10535185 9909323 9300927 8752214 8398788 8159873 7754638
12744G754638l76595l68732m90107k96461j92273j49311j05452k64105l35493
$$ 7754638 7378043 7009311 6519204 6222743 6030470 5881159 5775707 5511602 5176109
12735E176109k76727m008J0737j06089n35020p04596n44140k91441q063n1958
$$ 5176109 4899382 4895374 4906111 4800022 4265002 3560406 3016266 2724825 2716762 2664804
12725B664804j70964p5956n3474j29110j37389k19886l37476j81063O5565J05725
$$ 2664804 2493840 2417884 2364410 2235300 2097911 1878025 1540549 1359486 1425051 1530776
12715A530776J02143J62137J17157n7038o3692j7103p5436p4487j18257L8046
$$ 1530776 1632919 1795056 1912213 1855175 1791483 1774380 1698944 1624457 1506200 1544246
12705A544246j7771j28346P9000J5902j48417J3164N508q8471o5571Q1931j16477
$$ 1544246 1526475 1398129 1477129 1493031 1344614 1357778 1363286 1274815 1209244 1291175 1174698
12694A174698l4726o3555j30987L6663J6892J14069n0317n6776j8476L5635J41636
$$ 1174698 1139972 1076417 945430 982093 998985 1113054 1062737 1005961 987485 1023120 1164756
12683A164756l8457j49776l3911K3049K2740m9777P8963J38256J26885K8980J7983
$$ 1164756 1126299 976523 942612 965661 988401 938624 1017587 1155843 1282728 1311708 1329691
12672A329691m5081k08079k15516k37773k28409k07867K3941l7434j02420N085
$$ 1329691 1284610 1076531 861015 623242 394833 186966 210907 173473 71053 76138
12662G6138L3740J9672k5068Q154r6883o8464k4985J00602P2791J81110J06399
$$ 76138 109878 129550 104482 112636 15753 -52711 -77696 22906 95697 276807 383206
12651C83206l6828J01752L79856L98189K26049L51988M39962L74602j73921o47725
$$ 383206 346378 448130 827986 1226175 1452224 1804212 2244174 2618776 2444855 1797130
12641A797130q13408o61038j99639m6571P5038p6524r3633J5966m5077M2636O929
$$ 1797130 983722 322684 123045 76474 151512 74988 -18645 -2679 -47756 -5120 1809
12630A809r3157M1663N2116k6883R5155J79425J50080o0049r9157L9370Q2408
$$ 1809 -91348 -49685 2431 -24452 70703 250128 400208 340159 241002 280372 362780
12619C62780M6314K07275N04398M35491O21179M76918j20699n15613m97070l81206
$$ 362780 409094 616369 1120767 1556258 2177437 2654355 2533656 2018043 1520973 1139767
12609A139767k53952j98066k02713j30726q9857k2800q1003r5225o4848L508J07277
$$ 1139767 885815 687749 485036 354310 264453 241653 160650 65425 577 4085 111362
12598A11362J06072M8396J11410l4854j1890R0884l3055p7073J9349o1053j21617
$$ 111362 217434 265830 377240 342386 330496 421380 388325 311252 330601 269548 147931
12587A47931L7341L6791p9590j28162j70523k17212l10217j50616J65214J70539
$$ 147931 185272 222063 142473 14311 -156212 -373424 -683641 -834257 -669043 -498504
12577d98504O1357Q0310M8920K19416K60356J51690j29698j56576j2412P9244
$$ -498504 -437147 -356837 -307917 -88501 171855 323545 193847 37271 24859 104103
12567A04103J01652R4449N3567O8239k9328L5267J49522R4016L34400L88027M17642
$$ 104103 205755 300204 353771 422010 392682 427949 577471 671487 1005887 1393914 1811556
12556A811556L0210j65919l18533k72550l34496k19475j07030j32592K6742l0636
$$ 1811556 1841766 1675847 1357314 1084764 750268 530793 423763 291171 317913 287277
12546B87277p3045j4006O9130m5557j2542j1042K4869R8407r258n070Q1524N2354
$$ 287277 214232 200226 269356 223799 211257 200215 225084 323491 314233 309163 390687 443041
12534D43041n3239j19950j13098o8198q8870p1925r459N0076J12045K6273m2284
$$ 443041 389802 269852 156754 88556 -314 -72239 -81698 -31622 80423 106696 64412
12523F4412j9020J84092J59281Q9796q7171R9494n9891m8129M6715p5122L5358
$$ 64412 45392 229484 388765 478561 391390 490884 430993 382864 429579 354457 389815
12512C89815j0692q43j10193j42687o0498j05618Q1795O3508k7861N5315N784
$$ 389815 379123 378280 268087 125400 64902 -40716 41079 104587 76726 132041 137825
12501A37825o8819j2126j787M9913P0252p3211m6626o8177l7969O1010R1768n9082
$$ 137825 69006 56880 55093 105006 175258 102047 55421 -12756 -50725 10285 102053 42971
12489D2971j14002K5955J7261J6522J11550R9852k7708q7116R6041O2531O597
$$ 42971 -71031 -45076 -27815 -11293 100257 200109 172401 85285 181326 243857 250454
12478B50454n9633o9402l7610j3904Q8948m481r0911m0914J13012Q1031R7165
$$ 250454 190821 121419 83809 69905 158853 154372 63461 22547 135559 216590 313755
12467C13755j02577j86052j45137P7002N6260O988k3318k3577J10531P6178k8487
$$ 313755 211178 25126 -120011 -43009 13251 20239 -3079 -26656 83875 160053 131566
12456A31566n7839L3393K9422n7030j98505L04Q2485M7511M7787N7805J43073
$$ 131566 73727 107120 136542 79512 -118993 -118689 -36204 11307 59094 116899 259972
12445B59972o3534j23689L340m3377l6693L4349O4490n669m8608J89147P5761
$$ 259972 196438 72749 76089 32712 -3981 30368 94858 89189 40581 229728 305489
12434C05489K1110K1462o5134l2193j9805k9440l3259p1511l6584p8886j8042
$$ 305489 326599 348061 282927 250734 230929 201489 168230 96719 60135 -18751 -36793
12423c6793R2333O0435m0487m7418K221R8352P8601j04677l66L0538K0384J2562
$$ -36793 55540 115975 75488 28070 30291 128643 207244 102567 102201 132739 153123 165685
12411A65685q4046n9593P8525j0921m8927J9751L5506m9094m9823P6495N2316
$$ 165685 81639 22046 100571 89650 40723 60474 95980 46886 -2937 73558 125874
12400A25874J06630J10826J03652k7068M6216J0797q2545j52763k4164n6448j6147
$$ 125874 232504 343330 446982 419914 466130 476927 394382 241619 217455 161007 144860
12389A44860K066m6739k7804J62908j1988Q722n3780l168N4595j2549O2935m202
$$ 144860 146926 100187 72383 235291 223303 232025 178245 175077 229672 217123 280058 275856
12377B75856q9459l5594L5318P3968J30801n881J74342L00707L50635Q9787q8018
$$ 275856 186397 150803 186121 260089 390890 385009 559351 860058 1210693 1300480 1212462
12366A212462O750n3344j61692j86975k65558j84320Q635L8024o1687p6021L4640
$$ 1212462 1219212 1165868 1004176 817201 551643 367323 375958 413982 352295 276274 310914
12355C10914j29073r7394n9404K2573Q9095r6563l3778M6139J28883k0768j5385
$$ 310914 181841 84447 25043 47616 136711 40148 6370 52509 181392 160624 145239
12344A45239O524j4867O978n0172l9547P4582k4737K1981R1484j4038q1113N4845
$$ 145239 151763 136896 143874 93702 54155 128737 104000 125981 217465 203427 122314 177159
12332A77159J21688l9352N7189J32210K87000M61519P58784P23043j78318o11768
$$ 177159 298847 259495 316684 448894 735894 1197413 1956197 2679240 2500922 1889154
12322A889154n48157m68841k59766j32136K6307q553j33921j17111q9029M235
$$ 1889154 1340997 872156 612390 480254 506561 498008 364087 246976 157947 162182
12312A62182K7687r2612j60411M3209J16553R4724N9983Q9595J37879j17772j27254
$$ 162182 189869 97257 -63154 -19945 96608 191332 251315 340910 478789 361017 233763
12301B33763j22250j16820r3341P1063J05348k7588o1976j9742L0647Q7430l5279
$$ 233763 111513 -5307 -98648 -27585 77763 50175 -11801 -31543 -896 86534 51255
12290E1255r3822P5286l6013O9364J984r9478N2334J8201n5666K2605L2559K9169
$$ 51255 -42567 32719 -3294 66070 68054 -31424 20910 39111 -16555 6050 38609 67778
12278F7778l2276r5412o2599O1109k8945j2203J30993o1586n9390O2838J32339
$$ 67778 35502 -59910 -122509 -61400 -90345 -102548 28445 -33141 -92531 -29693 102646
12267A02646j192k459q450R082J8253k3462j7136o8765J27770J69021m7558q9046
$$ 102646 101454 98995 90545 99627 117880 94418 77282 8517 136287 305308 257750 168704
12255A68704L7252P0541p7407m8574p6081n3757J33387N2049k4733M7107J5574
$$ 168704 205956 276497 199090 150516 74435 20678 154065 206114 181381 228488 244062
12244B44062k0870n2513j31004j58356J00001N0820n0022K7797j04299l2190N9431
$$ 244062 223192 170679 39675 -118681 -18680 32140 -17882 9915 -94384 -126574 -67143
12233f7143j7986j9013Q1613J30102K3803k1106k8177o5916p1074j57777m1826
$$ -67143 -85129 -104142 -22529 107573 131376 110270 82093 16177 -54897 -212674 -254500
12222b54500k0610J00296J07250j2969K1083j09287M4768j7089o6436m1144j4131
$$ -254500 -275110 -174814 -67564 -80533 -59450 -168737 -123969 -141058 -207494 -248638 -262769
12211b62769J26650J43193N5509Q9270N3416k9105j9504j20521j11548k9452Q5086
$$ -262769 -136119 7074 62583 151853 205269 176164 156660 36139 -75409 -104861 -19775
12200a9775m347j675k9405J53119k8441q8322P0287L6974n6866j01736n2139O1484
$$ -19775 -24122 -25797 -55202 97917 69476 -18846 51441 88415 31549 -70187 -122326 -60842
12188f0842M5153m376N4179j4786p2319O725p0985N89l4643m1496J49176N4424
$$ -60842 -15689 -20065 34114 19328 -52991 -46266 -117251 -116662 -151305 -192801 -43625 10799
12176A0799j12971m3493J15020K10738O7708j52954K8038j00442r9937N083o4964
$$ 10799 -102172 -145665 -30645 180093 247801 94847 122885 22443 -77494 -72411 -137375
12165a37375Q175J36373k122Q729J09029J12470m989j6488m4155j06624j39069
$$ -137375 -129200 7173 5051 13780 122809 235279 230290 213802 169647 63023 -76046
12154g6046M7890Q9829r002k3353N0921O6232p3969L3055j10457J7327J03190
$$ -76046 -28156 61673 52671 29318 80239 146471 72502 105557 -4900 12427 115617
12143A15617Q6089o8329j14581r1252l8155M0907P8613m2407j33797j7095p2726
$$ 115617 201706 133377 18796 -72456 -110611 -69704 8909 -33498 -167295 -184390 -257116
12132b57116O3481N4732L4110P0881M2779P2783j9798J10138p7978L4061N0651
$$ -257116 -193635 -138903 -104793 -33912 8867 81650 61852 171990 94012 128073 178724
12121A78724M4995j45620j72711N020O3146j9335L2397M3895k4785J5171J4804
$$ 178724 223719 78099 -94612 -89592 -26446 -45781 -13384 30511 5726 20897 35701
12110C5701R6760r243o2435K5536M815L3862M1707j1144o3688p7133N7210O5945
$$ 35701 132461 123218 60783 86319 91134 124996 166703 155559 91871 14738 71948 137893
12098A37893K0368p0442j04548O375K9540p5748J45509J89237k1491k19415l3416
$$ 137893 158261 87819 -16729 -10354 19186 -56562 88947 278184 256693 37278 3862
12087C862Q1441m4340q5780q090p1384J25358K6291m0694q5932P2109Q8028k7162
$$ 3862 85303 40963 -44817 -52907 -124291 1067 27358 -13336 -99268 -27159 60869 33707
12075C3707j36363O1651K290r028J7445k0989m2663J4778J48370L0568O422J5263
$$ 33707 -102656 -41005 -38715 -47743 -30298 -51287 -93950 -79172 69198 99766 106188 121451
12063A21451q140l8453L940j8535k1823j1528j1614n8008o0319O4065N4260K8978
$$ 121451 113311 74858 78798 60263 38440 26912 15298 -42710 -103029 -38964 15296 44274
12051D4274q8763Q5980N8310j19660k7911J31923L8657M9816m6284r297q9734
$$ 44274 -44489 41491 99801 -19859 -47770 84153 122810 172626 126342 117045 27311
12040B7311p3224K2148J17353Q7218Q7415m9622m1350j7632m4393L0661J03358
$$ 27311 -45913 -23765 93588 180806 268221 218599 177249 159617 115224 145885 249243
12029B49243n092j27124r3337Q6261Q7713l8155j14407L3622j55528k1789R8047
$$ 249243 244151 117027 23690 109951 197664 159509 45102 78724 -76804 -98593 -546
12018e46L053M8817M8923r9322p7461n15m4144Q9524K1396O7462O590J09026p2068
$$ -546 2507 51324 100247 925 -76536 -77051 -121195 -31671 -10275 57187 63777 172803 100735
12005A00735l1493J65501o6347n9025P6208j67956r5908k5667K0601L7039m2537
$$ 100735 69242 234743 168396 109371 185579 17623 -78285 -103952 -83351 -46312 -88849
11994h8849l3292L9650M8548j28432M5479j7171K6912k1118n1178P5380M0892
$$ -88849 -122141 -82491 -33943 -162375 -116896 -134067 -107155 -128273 -179451 -104071 -63179
11983f3179j6810K0196L1349n9981j5911J35508J03238M1926o597N3419j06267
$$ -63179 -79989 -59793 -28444 -88425 -104336 31172 134410 176336 169739 223158 116891
11972A16891N9879K5902j57281p5023j8162o4895p9134J4280Q8654J42368P4815
$$ 116891 176770 202672 45391 -29632 -47794 -112689 -191823 -177543 -88889 53479 128294
11961A28294J2361J8149o9408K8081n8236j7587J96392L8430L3085m9082K2982
$$ 128294 140655 158804 89396 117477 59241 41654 238046 276476 309561 260479 283461
11950B83461M0240o7569j84144j22959p020P387o8671L0972M9746K9809R5276
$$ 283461 323701 256132 71988 -50971 -57991 -50604 -119275 -88303 -38557 -8748 86528
11939H6528l5219J0489P5334l874j78177j11031m6923M1333Q7009p436K8916j218
$$ 86528 51309 61798 137132 133258 -44919 -155950 -202873 -161540 -74531 -81967 -53051 -54269
11927e4269L3729J2299q7119n346j03589o4932N1673Q2036P3023l9746o1701m8399
$$ -54269 -20540 -8241 -95360 -100706 -204295 -269227 -217554 -135518 -62495 -102241 -163942 -212341
11915b12341M2944J14225n1748n7088P9985J16181M0555p209k0175j0871p2457
$$ -212341 -169397 -55172 -106920 -164008 -84023 32158 72713 65504 45329 34458 -37999
11904c7999P631M2944M05r40O4198Q8772j14846m7776J24809j8099k2226k8634
$$ -37999 -30368 12576 12981 12041 76239 165011 50165 2389 127198 109099 86873 58239
11892E8239j3633j03588K3809O9385K6535o984K5759L027J8626k5095n3003p4112
$$ 58239 44606 -58982 -35173 34212 60747 53763 79522 82549 101175 76080 23077 -51035
11880e1035p9845K4627Q6842J20920q646Q3499L7955l4297q0493q7455J18934
$$ -51035 -130880 -106253 -19411 101509 92863 176362 214317 180020 99527 12072 131006
11869A31006J5005K283J053J31025r4540j65169L7221K2283q4384q955k7895j7777
$$ 131006 146011 148294 149347 280372 185832 20663 57884 80167 -4217 -13172 -41067 -58844
11857e8844l3877J51590n8782j04456n7493p2065J8485K09954Q4337o2252k33298
$$ -58844 -92721 58869 87 -104369 -161862 -233927 -215442 -5488 78849 16597 -216701
11846b16701n6705K29230R7583N6691k4631j94390K694l2332k9008K7661N1219
$$ -216701 -273406 -44176 53407 110098 85467 -108923 -106229 -138561 -167569 -139908 -88689
11835h8689k4035k6258P6689j0682J4352L9365K5203N7083r6535j24726k0403
$$ -88689 -112724 -138982 -62293 -72975 -58623 -19258 5945 63028 -33507 -158233 -178636
11824a78636j2058L6058J4054k2051J4681O7999l5849O5521N81l6548n8726P7938
$$ -178636 -190694 -154636 -140582 -162633 -147952 -79953 -115802 -50281 -49700 -86248 -144974 -67036
11812f7036J22034n619j7657p5662j20203Q5975J04973P763k4700O5446L9148
$$ -67036 54998 49379 31722 -43940 -164143 -78168 26805 34568 9868 75314 114462
11801A14462j39330o076O2239N1146j3466j99524j33366K4784R5121J20650j8596
$$ 114462 -24868 -30944 31295 82441 68975 -130549 -263915 -239131 -144010 -23360 -41956
11790d1956j02859m5898R5098R8512J97030J34034N2305j94516j63152N74p972
$$ -41956 -144815 -190713 -95615 2897 199927 333961 386266 191750 28598 29172 21200
11779B1200L3729M1465j1577n7120J0628j01415m3659K2498j81O1786n0966N796
$$ 21200 54929 96394 84817 27697 38325 -63090 -106749 -84251 -84432 -22646 -73612 -67816
11767f7816n8992L8653J2045j5192m370L3126J11449N313l0348r7258M187K967
$$ -67816 -126808 -88155 -76110 -91302 -95672 -62546 48903 54216 23868 -73390 -69203 -66236
11755f6236o6576L595j3641n767P3470J3982L4068L8745l5812m7760J52233o789
$$ -66236 -132812 -129217 -142858 -148625 -75155 -61173 -27105 11640 -24172 -71932 80301 73512
11743G3512n9748n150j16289k6386o4678Q5960o5646L1110L6194J528l0552k307
$$ 73512 13764 8614 -107675 -134061 -198739 -112779 -178425 -147315 -111121 -109593 -140145 -142452
11731a42452L7743J01766J5559j3183k393O0886o3365j86545N6415J40454l6353
$$ -142452 -104709 -2943 12616 -567 -2960 57926 -5439 -191984 -135569 4885 -31468
11720c1468P0816P8018j64588R428L3977P6014l6356j10902O9103N8357j54871
$$ -31468 39348 117366 -47222 -37794 -3817 72197 35841 -75061 -5958 52399 -102472
11709a02472j5685J12979j7911P226L003l1814N5738j21361j40117K8101J46381
$$ -102472 -118157 -5178 -23089 -15863 -12860 -44674 11064 -110297 -250414 -222313 -75932
11698g5932M4731r3022K7126J23435J01293K2531m428j31773M8700q0412p1636
$$ -75932 -31201 -124223 -97097 26338 127631 150162 145734 13961 62661 -17751 -89387
11687h9387m1156k710M2544J2653M3504p0804O4479J48376k4183n5099m2653k0832
$$ -89387 -130543 -133253 -90709 -78056 -34552 -105356 -40877 107499 83316 28217 -14436 -35268
11675c5268j10619m841Q638K5771K86j14200o9299J22906J28184M6070K1679O4674
$$ -35268 -145887 -150728 -142090 -116319 -116033 -230233 -299532 -176626 -48442 -2372 19307 83981
11663H3981L1119l8813o9394O3459L6411J8711M7251j7745j24587n5227R5473
$$ 83981 115100 76287 6893 70352 106763 125474 172725 154980 30393 -24834 70639
11652G0639J85568N6708j49540j12712M0048O5532K9750r2299j07332l2883N4094
$$ 70639 256207 312915 163375 50663 90711 156243 185993 93694 -13638 -46521 7573
11641G573q0770l0544m210N831m678M0630J08140J9481j16298o7736K941L783
$$ 7573 -73197 -103741 -107951 -102120 -106798 -66168 41972 61453 -54845 -122581 -119640 -115857
11629a15857Q3809n5466n540K2147j4713L0310l2033r8994j00513O463L2423Q5541
$$ -115857 -32048 -87514 -93054 -70907 -85620 -55310 -87343 -186337 -286850 -280387 -247964 -162423
11617a62423N7646O7291N4987m2687N6342o74M9687p1213l8816p7006m7694Q6888
$$ -162423 -104777 -37486 17501 -25186 31156 30482 80169 8956 -29860 -106866 -154560 -67672
11605f7672j1484k5230J13992L6660j22328j74050M5563K79114L0013P8630J46999
$$ -67672 -79156 -104386 9606 46266 -76062 -250112 -204549 74565 104578 183208 330207
11594C30207j28698j03743J3096O8618m5393o1701J03598N7463r9875o2039K1014
$$ 330207 201509 97766 110862 179480 134087 72386 175984 233447 133572 71533 92547
11583I2547L0208J5116M0385l1727o9720n0321J00800p4242j3150J39077k7227
$$ 92547 122755 137871 178256 146529 76809 26488 127288 53046 39896 178973 151746
11572A51746l6516r6961n8776l9289n824q393k1771j20005l8590O5057K2706M5728
$$ 151746 115230 18269 -40507 -79796 -85620 -94013 -115784 -235789 -274379 -209322 -186616 -140888
11560a40888Q7974M072J9460J7931J0957R745j3945O3354l9301j29678P4200J33492
$$ -140888 -52914 -48842 -29382 -11451 -494 9251 -4694 58660 19359 -110319 -36119 97373
11548I7373l4066j31790m0994l02p0327j22446p819J82756K00928K9596j36722
$$ 97373 63307 -68483 -109477 -109779 -180106 -302552 -310371 -127615 73313 102909 -33813
11537c3813j62431L170L1226m8616P642o2657K5545n1939Q7284R4505k4196j7097
$$ -33813 -196244 -193074 -161848 -210464 -202822 -265479 -239934 -291873 -204589 -110084 -134280 -151377
11525a51377J0738J5335J02114Q679M8397m3442J4187J9478J6258o7638K5207
$$ -151377 -140639 -125304 -23190 -14511 33886 -9556 4631 24109 40367 -27271 -2064
11514b064m0970o7088R6873R1751k2965q8169j50494Q0606K8684K8664o2383k1099
$$ -2064 -43034 -110122 -13249 78502 55537 -32632 -183126 -102520 -73836 -45172 -107555 -128654
11502a28654n9925Q0924N345p8562j0366J53162p0378r8742J26118J70196J7172
$$ -128654 -188579 -107655 -102310 -180872 -191238 -38076 -108454 -207196 -81078 89118 106290
11491A06290M3373M3311m8864N220M4315q9637l5358j35847o1081R9326P510L9477
$$ 106290 149663 192974 144110 149330 193645 104008 68650 -67197 -128278 -28952 -21442 18035
11479A8035j4064r8410R38R0101J8167l4632j8565p9059J9596M0385Q2122K8063
$$ 18035 3971 -94439 -93501 -3400 14767 -19865 -38430 -117489 -97893 -57508 24614 52677
11467E2677j13246m106K420R631M4866k3421r3505r395Q8891L5041L5654n0803
$$ 52677 -60569 -64675 -62255 -52624 -7758 -31179 -124684 -134079 -45188 -10147 25507 -25296
11455b5296q7254O1849j0907j5290O0136L0087K1426o2201Q2812J50032q6973
$$ -25296 -112550 -50701 -61608 -76898 -16762 13325 34751 -27450 55362 205394 118421
11444A18421j48413n9191r1231M432M0578J23847p688o4697K3232L0076p8658
$$ 118421 -29992 -89183 -180414 -175982 -135404 -11557 -19245 -83942 -60710 -30634 -109292
11433a09292j31600L6996Q6930l7498n2998o5166J01579J4482l2044J409J9619
$$ -109292 -240892 -203896 -116966 -154464 -207462 -272628 -171049 -156567 -188611 -187202 -167583
11422a67583J68344j8306l6439m5878o3655P0537M6488k9583q8078J24171J41342
$$ -167583 761 -17545 -53984 -99862 -163517 -92980 -46492 -76075 -164153 -39982 101360
11411A01360J1842J9709o3835j60668q176M0044j1591p4459r403N1954J41328
$$ 101360 113202 132911 69076 -91592 -99768 -59724 -71315 -145774 -155177 -103223 38105
11400C8105M2427r4105j14389J6642O0931J20752j3295n8686q1639k008k4514
$$ 38105 80532 -13573 -127962 -111320 -50389 70363 57068 -1618 -83257 -85265 -109779
11389a09779j45389k3512J19737J88022K373o0880Q466P0403m7562N0552l8378
$$ -109779 -255168 -278680 -158943 29079 31452 -29428 -20962 49441 1879 52431 14053
11378A4053l7699J28729l4908l9632r6682j08154q5543J26370O4484N7013m1159
$$ 14053 -23646 105083 70175 30543 -66139 -174293 -259836 -133466 -68982 -11969 -53128
11367e3128J63603M6743p616Q7772j6405j35170q9848j33692N5909J11618O708
$$ -53128 110475 157218 149602 237374 220969 85799 -4049 -137741 -81832 29786 36494
11356C6494j56896q3009Q2776J09151R1000J8775j29995K6605n8519p108q015
$$ 36494 -120402 -203411 -120635 -11484 79516 98291 -31704 -5099 -63618 -70726 -78741
11345g8741j05053j2524p649j3116J61894k0447O0068P7721J1903n6802j04465
$$ -78741 -183794 -196318 -203967 -217083 -55189 -75636 -15568 62153 74056 17254 -87211
11334h7211K4941L5100j6587N8247J0475o2673k4258Q223R4478L8783l0031n5961
$$ -87211 -62270 -27170 -43757 14490 24965 -37708 -61966 -53743 40735 79518 49487 -6474
11322f474q3278J0689Q4836m2529p3952J7787M5018J36209O1320k8127J2081M04
$$ -6474 -89752 -79063 5773 -36756 -110708 -92921 -47903 88306 149626 121499 133580 133984
11310A33984j84887j48006p6949L7300R3874J27481O3268p834l1865q782q648
$$ 133984 -50903 -198909 -275858 -238558 -144684 -17203 46065 38231 6366 -2416 -11064
11299a1064Q844q8980l9477j01785O6520J14312J09790O6955j53395m722o1923
$$ -11064 -2220 -91200 -130677 -232462 -165942 -51630 58160 125115 -28280 -33002 -94925
11288i4925L3701M7554L2140O653k4578K5899p8565m7498J24881J41405J39927
$$ -94925 -61224 -13670 18470 25123 545 26444 -52121 -99619 25262 166667 306594
11277C06594J28523n4217O5304M1707m244J1696J34047J8901k28581k41030q0883
$$ 306594 435117 380900 446204 487911 483667 495363 629410 648311 419730 178700 97817
11266I7817N5253p4523k4631N0976L9593j5639Q291l2206l9223q3161l6889p1033
$$ 97817 153070 78547 53916 104892 144485 128846 137137 104931 65708 -17453 -54342 -125375
11254a25375o8012J35159O8872M6227K1699p985j46494o969k2854Q6315P7341
$$ -125375 -193387 -58228 10644 56871 78570 70585 -75909 -82878 -105732 -19417 57924
11243E7924m3025n6225q1156M3593p3496j4357J2639R4232J7240j8300J36499
$$ 57924 14899 -41326 -122482 -78889 -152385 -166742 -154103 -59871 -42631 -60931 75568
11232G5568n2931j9753L971J06431K3811k83577j07976R536J2251O1510N4557
$$ 75568 22637 2884 6855 113286 137097 -146480 -254456 -244920 -232669 -171159 -116602
11221a16602J62703L0014j2879O5266q3149o8672k4874J52958m0712p7225n4199
$$ -116602 46101 76115 63236 128502 45353 -23319 -48193 104765 64053 -13172 -67371
11210f7371q500j39503j59887J26944M2704j8476K3768M5334M2276p3117k04078
$$ -67371 -75871 -215374 -375261 -248317 -205613 -224089 -200321 -154987 -112711 -185828 -389906
11199c89906J03942J33672J29437O8325K4337q560m4255o9326j582p7708J08155
$$ -389906 -285964 -152292 -22855 45470 69807 61247 16992 -52334 -53916 -131624 -23469
11188b3469J23896J75736M0099j62972j27572r5462N3091J74957M5730r7441j41456
$$ -23469 100427 276163 316262 153290 25718 -69744 -16653 158304 204034 106593 -34863
11177c4863J5229J16797P4757q0787r5974O891N2962J22655n8162j7312K23796
$$ -34863 -19634 97163 171920 91133 -4841 2050 55012 177667 119505 102193 325989
11166C25989Q3065J0836J05409J7464k2047k08782j11279j09875O6826j8977J8221
$$ 325989 409054 419890 525299 542763 520716 311934 200655 90780 157606 138629 156850
11155A56850J013p2526k1563K16839p7829k01662q5385L2253O6708o7408M4911
$$ 156850 157863 85337 63774 280613 202784 1122 -84263 -52010 14698 -52710 -7799
11144g799K1253J4920J01404p7722m8998j1460M2121J0794o7878l6012J20813
$$ -7799 13454 28374 129778 52056 3058 -8402 33719 44513 -23365 -59377 61436
11133F1436J50952l1212o6829j9541j5537n7595R6152n8325p1382l7407J20001
$$ 61436 212388 181176 114347 94806 79269 21674 117826 59501 -11881 -49288 70713
11122G0713k3933l3740M1864j08494o9882P1722m906J0151O3571j36661j94058
$$ 70713 46780 13040 54904 -53590 -123472 -51750 -56656 -46505 17066 -119595 -313653
11111c13653j5555J95705J17209k2876j19552l7868Q7453J08963O7743M8362q5146
$$ -313653 -329208 -133503 -16294 -39170 -158722 -196590 -109137 -174 67569 115931 30785
11100C0785p0469o252o2881K3493o6076l8373j2983L6076J44280L961m7142M455
$$ 30785 -39684 -45936 -108817 -85324 -151400 -189773 -202756 -166680 -22400 -18439 -65581 -61126
11088f1126m2076r3772p7583J2738P5194o7212R676R9758J4935M7572M2828R4320
$$ -61126 -103202 -196974 -274557 -261819 -186625 -253837 -244161 -144403 -129468 -81896 -39068 55252
11076E5252R4513o8372n6828J920Q9620j05484j00914O2964J34154j00577r540
$$ 55252 149765 81393 24565 26485 116105 10621 -90293 -27329 106825 6248 -3292
11065c292R645j7306j235M8508Q6867q7157j43465o3257k6421N5251Q0294p6104
$$ -3292 6353 -10953 -12188 36320 123187 36030 -107435 -170692 -197113 -141862 -61568 -137672
11053a37672J1919m6681q1715O5284J30759n5164j2468l0867P8970K0436n7681
$$ -137672 -125753 -172434 -254149 -188865 -58106 -113270 -125738 -156605 -77635 -57199 -114880
11042a14880m5615k1481m1287Q8J94041n5651m5441J78481R442q9422K9840P5034
$$ -114880 -160495 -181976 -223263 -223175 -29134 -84785 -130226 48255 57697 -31725 -1885 73149
11030G3149P4295j32827m3588L1816m4345o4907n8024m4697L1503N6022O3312
$$ 73149 147444 14617 -28971 2845 -41500 -106407 -164431 -209128 -177625 -121603 -58291
11019e8291J1564N7141p3393p9417m1120J6495J19026N3379l974n9807N9399Q958
$$ -58291 -46727 10414 -62979 -142396 -183516 -167021 -47995 5384 1410 -58397 1002 9960
11007I960R7224J5651n7537R3305J210p2884n4532Q2766M4332l3484l9267n7110
$$ 9960 107184 122835 65298 158603 159813 86929 32397 115163 159495 126011 86744 29634
10995B9634r6782j23633N5012k5589k6575k1970Q3579Q0806M5634l7036l2740
$$ 29634 -67148 -190781 -135769 -161358 -187933 -209903 -126324 -45518 116 -36920 -69660
10984f9660N9733m4357o0178j7120Q310J60004J30250O9794r4921j53884j8582
$$ -69660 -9927 -54284 -114462 -131582 -123272 36732 166982 236776 141855 -12029 -30611
10973c0611K8699o8089m8145R5271j8533j3869J9285K0998k38K0435K4038J7893
$$ -30611 -1912 -70001 -118146 -22875 -41408 -55277 -35992 -14994 -15232 5203 29241 47134
10961D7134J6889O4757o006k333j32294J0291m6962q563P0016O2244k06220r290
$$ 47134 64023 128780 122774 120441 -11853 -1562 -48524 -57087 12929 75173 -131047 -140337
10949a40337r56R9213J99489L5769o6132j13541m587o2744m8472J40259N8740
$$ -140337 -141293 -42080 157409 193178 127046 13505 8918 -53826 -102298 37961 96701
10938I6701o2565L670Q6310K7000n9740o3709n9593q2160o3872o1879l3196K5577
$$ 96701 34136 37806 124116 151116 91376 27667 -31926 -114086 -177958 -239837 -273033 -247456
10926b47456J64954P5386N368r6842o2778O0701J20038J0376M699M8921j59908
$$ -247456 -82502 -7116 -1748 -98590 -161368 -100667 19371 29747 34446 83367 -76541
10915g6541r8249J23146J10527M0302J384j58322p1732n4740l9462k424k3384
$$ -76541 -174790 -51644 58883 99185 100569 -57753 -129485 -184225 -223687 -226111 -249495
10904b49495j6872K4201P8632l6733l695Q8968K21293J58658j08051l3201O6398
$$ -249495 -266367 -242166 -163534 -200267 -203962 -114994 106299 264957 156906 123705 190103
10893A90103k7404k6600p7951p3610l3475L408J17927N9634j22506j39469Q4651
$$ 190103 162699 136099 58148 -15462 -48937 -45529 72398 132032 9526 -129943 -45292
10882d5292J12423J80251Q576k88548k07414q1930j0105Q6195N0848l6422L041
$$ -45292 67131 247382 255958 -32590 -240004 -321934 -332039 -245844 -194996 -231418 -228377
10871b28377K07893K19664q0936p0229m3016k463J1869j27798o8051K5937K18868
$$ -228377 -20484 199180 118244 48015 4999 2536 14405 -113393 -181444 -155507 63361
10860F3361O0573r8153o4270p5674R4289j024j27402K8139Q6000P048p4705K295
$$ 63361 123934 25781 -38489 -114163 -19874 -20898 -148300 -120161 -34161 -27113 -101818 -99523
10848i9523R2770M4676P7686r7299o6071k1693l3990m672l2928J07703j9004q4611
$$ -99523 -6753 37923 115609 18310 -47761 -69454 -103444 -108116 -141044 -33341 -52345 -136956
10836a36956R225Q0280O1490K6054J9569r287k8441Q1861N76P0563p2632j23962
$$ -136956 -127731 -47451 14039 40093 59662 50375 21934 103795 104371 174934 102302 -21660
10824b1660j7509j03779l4477K7985J00384j0146j1380N7543J46674L0947M8681
$$ -21660 -39169 -142948 -177425 -149440 -49056 -59202 -70582 -13039 133635 164582 213263
10813B13263m8727p9176j44944q9529L7181K1421K5967K1268L9102J2295j20758
$$ 213263 164536 85360 -59584 -149113 -111932 -90511 -64544 -43276 -4174 8121 -112637
10802a12637r0716j8352o2280M7826J26755P2874N4040M3950q8185k1914J0901
$$ -112637 -203353 -221705 -283985 -236159 -109404 -36530 17510 61460 -26725 -48639 -37738
10791c7738J7J5183q704J21788k2036j83185o2557O4185l3902o6035q8261L5597
$$ -37738 -37721 -22538 -31242 90546 68510 -114675 -177232 -113047 -146949 -212984 -301245 -265648
10779b65648j9104O0843K22240K9664j00492O6762k4980K5733L6226N2056K8891
$$ -265648 -284752 -223909 -1669 27995 -72497 -5735 -30715 -4982 31244 83300 112191
10768A12191o0845k0138M6903N6894n0511p5656r1147K8919K2858K5744l4458
$$ 112191 51346 31208 78111 135005 84494 8838 -82309 -53390 -30532 -4788 -39246
10757c9246N9773R201j24751j55674J61728J50232n2171n0139o3887L155K9093
$$ -39246 20527 29728 -95023 -250697 -88969 61263 9092 -41047 -104934 -101779 -72686
10746g2686N3530J6484O7104r0640k1950J49775j04845p6464j1262Q5812J0364
$$ -72686 -19156 -2672 64432 -26208 -48158 101617 -3228 -79692 -90954 -5142 5222
10735E222L9808M2670j82019J017M7596P5441Q1457j0975k0191k9839R088K1665
$$ 5222 45030 87700 -94319 -93302 -45706 29735 111192 100217 80026 50187 59275 80940
10723H0940q5810k4657Q9159n9326n2966J133Q415J01326o3765l9461O289N3104
$$ 80940 -4870 -29527 59632 306 -52660 -51527 -43112 58214 -5551 -45012 -38723 14381
10711A4381j6033r8831l0676k1260n9293J8965M125M0732n4712n7827K8837J75028
$$ 14381 -1652 -100483 -131159 -152419 -211712 -192747 -188622 -147890 -202602 -260429 -231592 -56564
10699e6564L9018o7012R5854J59144J04754K6637p4712j71567k399o9656q7004
$$ -56564 -17546 -84558 11296 170440 275194 301831 227119 55552 53153 -16503 -103507
10688a03507O265O7769J21360r8267P646L7521m5007n1077N058n3553R366R261
$$ -103507 -97242 -29473 91887 -6380 1266 38787 -6220 -57297 -52239 -105792 -96426 -87165
10676h7165J694K7682M4933L0006K1978P2572k6773o230k1632n3953K296r521
$$ -87165 -85471 -57789 -12856 17150 39128 111700 84927 78697 57065 3112 5408 -4113
10664d113j33386j02177m6459J08255J21761J34896L4876M5981p2151n6859O5509
$$ -4113 -137499 -239676 -286135 -177880 -56119 78777 113653 159634 87483 30624 96133
10653I6133K0274j6869J1863N2197m2527k04684n788J7857P82r790L8489Q9230
$$ 96133 116407 99538 111401 163598 121071 -83613 -89401 -71544 -70762 -80552 -42063 47167
10641D7167Q526K5477k563k0092J8160O380p2361j9498m9060O4150M9238p3191
$$ 47167 55693 81170 78607 58515 76675 83055 10694 -8804 -57864 6286 55524 -17667
10629a7667K5590p8458r0894J13487K84207L8582m8606m7373k5766P8860Q547
$$ -17667 7923 -70535 -161429 -47942 236265 274847 226241 178868 153102 231962 240509
10618B40509j41943j16798r9096m0760J34624k5923L3120J14913O0031j26166
$$ 240509 98566 -18232 -117328 -158088 -23464 -49387 -16267 98646 158677 32511
10608C2511j92779l9615M2514o3179M2540J38456K6137L9658O1393Q182l3382
$$ 32511 -160268 -199883 -157369 -220548 -178008 -39552 -13415 26243 87636 95818 62436
10597F2436m8910j25747j17072n152Q3253l831Q1938L3259L5176M7774p8035m8186
$$ 62436 13526 -112221 -229293 -234445 -151192 -155023 -73085 -39826 -4650 43124 -34911 -83097
10585h3097j108p8717j2383R8804J9809p4013K22m0336M1712J75961j36865j66341
$$ -83097 -84205 -162922 -175305 -76501 -56692 -130705 -130483 -170819 -129107 46854 -90011 -256352
10573b56352Q5020O1934l8821J2300R4068L7645p5315P424J11174R4387q3890
$$ -256352 -171332 -109398 -148219 -135919 -41851 -4206 -79521 -72097 39077 133464 49574
10562D9574k6567o3548o5285P9555Q4039m807k04954m4040k3650k0708Q3474P621
$$ 49574 23007 -40541 -105826 -26271 57768 52961 -151993 -196033 -219683 -240391 -156917 -149296
10550a49296q7691l1112L9193J81727J17508N105L3523j5286r3295k3987l1109
$$ -149296 -236987 -268099 -228906 -47179 70329 75434 108957 93671 376 -23611 -54720
10539e4720m1682J8325J31532R3703K6791p0846k13234K3617K3917K1678L0566
$$ -54720 -96402 -78077 53455 147158 173949 103103 -110131 -86514 -62597 -40919 -10353
10528a0353L232J7329K0216Q087P6981N4632k0694r753Q0204j44554L5617j13119
$$ -10353 -7121 10208 30424 38511 115492 170124 149430 139677 219881 75327 110944 -2175
10516b175m8252M4440j24362l7646k3860O4113J05590J42207J8588o786j20420
$$ -2175 -50427 -5987 -130349 -167995 -191855 -127742 -22152 120055 138643 131857 11437
10505A1437j3991J20154O4113l6723P669n0143q9659M7364P3587l1604r7438o2852
$$ 11437 -2554 117600 181713 144990 152659 102516 12857 60221 133808 102204 4766 -58086
10493e8086l929J69815r2031K2600N9622j03925N4465Q7202o2105M3337j37660
$$ -58086 -62015 107800 15769 38369 97991 -5934 48531 135733 73628 116965 -20695
10482b0695m8153O7198o4682L7014N2123N4136J63518j8592M1994K6136o5771
$$ -20695 -68848 -1650 -66332 -29318 22805 76941 240459 221867 263861 289997 224226
10471B24226j52847m5164O2817J09488j3279J4805j03245j42978n7709N5946P1623
$$ 224226 71379 26215 89032 198520 185241 200046 96801 -46177 -103886 -47940 23683
10460B3683n6185p912q6292L6938J13776L8708k3883M393n2504n7832R2768l0120
$$ 23683 -32502 -40414 -126706 -89768 24008 62716 38833 43226 -9278 -67110 25658 -4462
10448d462j67169o5146K01934J54818m0499j11494j1287o664q4582m0471O4738
$$ -4462 -171631 -236777 -34843 119975 79476 -32018 -43305 -49969 -134551 -175022 -110284
10437a10284J37662Q0420J131r399J48422N0159j12222j51509J058R5454l5980
$$ -110284 27378 107798 108929 99530 247952 298111 185889 34380 35438 130892 94912
10426I4912p9105M5232j46467m6690R1600K5535k0526l2627p1755p5675m8315
$$ 94912 15807 61039 -85428 -132118 -40518 -14983 -35509 -68136 -139891 -215566 -263881
10415b63881J0114N5132M2679Q221J5273J04850J20498Q5802K3306q8706n7799
$$ -263881 -253767 -198635 -155956 -147735 -132462 -27612 92886 178688 201994 113288 55489
10404E5489n003P0330p9519j43565J2366J45188J09840K4803q0300n4148p4480
$$ 55489 50486 120816 41297 -102268 -89902 55286 165126 189929 109629 55481 -18999
10393a8999n5927O3825o2003N5255J08985R9487j23647o0229j78173j11939L8384
$$ -18999 -74926 -11101 -73104 -17849 91136 190623 66976 6747 -171426 -283365 -244981
10382b44981j2972J37915J60603Q6641p4425p5869m6178r8989l0198J6297O0935
$$ -244981 -257953 -120038 40565 127206 52781 -23088 -69266 -168255 -198453 -182156 -121221
10371a21221Q5097j2921k1687O7312K4591K0352k6567j10085p2493Q8375k8589
$$ -121221 -36124 -49045 -70732 -3420 21171 41523 14956 -95129 -167622 -79247 -107836
10360a07836j21717J96704Q7102n305j6860N0852j65218j10891N3864R5905l414
$$ -107836 -229553 -32849 54253 48948 32088 82940 -82278 -193169 -139305 -43400 -46814
10349d6814q656L2838O1870l5193J5268P7747J617J2267L4789j53135p4661j02402
$$ -46814 -55470 -22632 39238 4045 19313 97060 98677 110944 145733 -7402 -82063 -184465
10337a84465Q3030M1338o7156J70q9714n2355P9972J66793k7372N7238J47233
$$ -184465 -101435 -60097 -127253 -127083 -216797 -269152 -189180 -22387 -49759 7479 154712
10326A54712M4207j30712r7067j27239j06342Q0416M8198N5256l9725l3317J9735
$$ 154712 198919 68207 -28860 -156099 -262441 -182025 -133827 -78571 -118296 -151613 -131878
10315a31878j2702l7836R7555J16284o6808j33197J48428J14970J10622k3322
$$ -131878 -144580 -182416 -84861 31423 -35385 -168582 -20154 94816 205438 182116
10305A82116j09752p7117j1229O1770Q9129n2487L0722O1257p6085q2280K9457
$$ 182116 72364 -4753 -15982 45788 134917 82430 113152 174409 98324 16044 45501
10294D5501o4128J2312K9128l2447N7145l1097J9435o3008O2721j5360J84k3258
$$ 45501 -18627 -6315 22813 -9634 47511 16414 35849 -27159 35562 20202 20386 -2872
10282b872J01735j1842l7904J5681P1650P9748o1213r3470J8563j2342J4246m8179
$$ -2872 98863 87021 49117 64798 136448 216196 154983 61513 80076 67734 81980 33801
10270C3801J4550r101j04041n2575l972L7416J05343P3968k3790p8297J5614J2148
$$ 33801 48351 39250 -64791 -117366 -121338 -83922 21421 95389 71599 -6698 8916 21064
10258B1064M3215O4155j20312m6892k1418o9533O9138N0790J6376m9469p3087
$$ 21064 64279 128434 8122 -38770 -60188 -129721 -60583 -9793 6583 -42886 -115973
10247a15973j3178Q0282J44686k7703k0568p7909M6168L0180j9270M368M4040
$$ -115973 -129151 -48869 95817 68114 47546 -30363 15805 45985 26715 31083 75123
10236G5123j04278l1206J54291O3571n0629j04693J00134O6096j77646l6609l1167
$$ 75123 -29155 -60361 93930 157501 106872 2179 102313 168409 -9237 -45846 -77013
10225g7013n5750J9472J36107L9624Q3585O2939o5682o3575m7472m3260P145J30873
$$ -77013 -132763 -113291 22816 62440 146025 208964 143282 79707 32235 -11025 -3880 126993
10213A26993O2965j8386l345k1693j14269n9658l36k4165j00042K3898J27319
$$ 126993 189958 171572 168227 146534 32265 -27393 -27729 -51894 -151936 -128038 -719
10202g19J13987q8595l1082R8289q32j3661n2179k8355j09871r3047l3249N4740
$$ -719 113268 24673 -6409 91880 91048 77387 25208 -3147 -113018 -206065 -239314 -184574
10190a84574L3159m5814O0885K0058O8854J59249l301j1853m0288J6101L4724
$$ -184574 -151415 -197229 -136344 -116286 -47432 111817 108516 96663 56375 72476 107200
10179A07200L9802o2728m7974j40986J4613J00614K5219J0206j4730m6636o5169
$$ 107200 147002 84274 36300 -104686 -90073 10541 35760 45966 31236 -15400 -80569
10168h0569p5527k2009L4476r8130P0038J12327P1106M1560l1852l1038P9978
$$ -80569 -156096 -178105 -143629 -241759 -171721 -59394 11712 53272 21420 -9618 70360
10157G0360m8898P0703Q830M9812J8841r4235j77831o2417P0716j8096Q0281P8177
$$ 70360 21462 92165 100995 150807 169648 75413 -102418 -164835 -94119 -112215 -31934 46243
10145D6243R1491J33092J53513l4290j72062n9074J4840r2649n1709O5288J0080
$$ 46243 137734 270826 424339 390049 217987 158913 173753 81104 29395 94683 104763
10134A04763k2503o3074m1642K9626r297n2400J9401l6955N9313r585j2707l3903
$$ 104763 82260 19186 -22456 7170 -2127 -54527 -35126 -72081 -12768 -22353 -35060 -68963
10122f8963m6174O0669M3804J30298j15880j44320L7650k5216N7060K1875J8213
$$ -68963 -115137 -54468 -10664 119634 3754 -140566 -102916 -128132 -71072 -49197 -30984
10111c0984q3113m3365M9019M415J15496M1409q8742l6514L6432J6820L4520n2644
$$ -30984 -114097 -157462 -108443 -104028 11468 52877 -35865 -72379 -35947 -19127 15393 -37251
10099c7251j02087K7598P816L3284J52521Q3713o2928q0070M5362k3232k0201
$$ -37251 -139338 -111740 -103924 -70640 81881 165594 102666 22596 67958 44726 24525
10088B4525R4474j12222r1662n324P7523K2314q6398N9899R9844l5008k2573Q5190
$$ 24525 118999 6777 -84885 -90209 -12686 9628 -76770 -16871 82973 47965 25392 110582
10076A10582J6838l3435k0324M2693J7307k5542J03739J0511o3361l7403r0234
$$ 110582 127420 93985 73661 116354 133661 108119 211858 222369 159008 121605 31371
10065C1371q5056J4571L0721J28669n9917p4518K9263J34972M0121p0769J4385
$$ 31371 -53685 -39114 -8393 120276 60359 -14159 15104 150076 190197 119428 133813
10054A33813j04907M714j2644k5355Q2599N8164o6830j552j550q9061l7123P9881
$$ 133813 28906 33620 20976 -4379 78220 136384 69554 68002 66452 -22609 -59732 20149
10042B0149O1820K0458m2353m0263k4982K312J9594M2724L171o9809k2957j21831
$$ 20149 81969 102427 60074 19811 -5171 -2859 16735 59459 62630 -7179 -30136 -151967
10030a51967N8966j1475m5033L0350j9279n0175n7919O2851J8725J5389K7392
$$ -151967 -93001 -104476 -149509 -119159 -138438 -188613 -246532 -183681 -164956 -149567 -122175
10019a22175j11064J3603J22597N3095J28452R8502j44057l8315J39240j8871
$$ -122175 -233239 -219636 -97039 -43944 84508 183010 38953 638 139878 121007
10009A21007q0326L3371p5290M2055k3215L687M4445J53423L8113j31366j42094
$$ 121007 40681 74052 -1238 40817 17602 21289 65734 219157 257270 125904 -16190
9998a6190j2755P3107K2301j22573n9619N4764k2681O525J8166J3425r6276R471
$$ -16190 -28945 44162 66463 -56110 -115729 -60965 -83646 -77121 -58955 -45530 -141806 -132335
9986a32335J07419N9056J39390P0358k6604r9176m3555l9439q7258M788L3662
$$ -132335 -24916 34140 173530 243888 217284 118108 74553 35114 -52144 -47356 -13694
9975a3694l5988o4751J67440N556P389j2020n9384J0134K2450L1607J56106n204
$$ -13694 -49682 -114433 53007 58563 65952 53932 -5452 4682 27132 58739 214845 209641
9963B09641j73385n1422q0137m0717J643k4610l1490L3835J72836R426l8203M0208
$$ 209641 36256 -15166 -95303 -136020 -134377 -158987 -190477 -156642 16194 25620 -12583 27625
9951B7625R1162k8107J32802M7609n9165K4657p6184L5724N6054l510o9931L5634
$$ 27625 118787 90680 223482 271091 211926 236583 160399 196123 252177 248667 178736 214370
9939B14370P3695j6120q3026m2921r8052M3343M5531J2535n5148l3374j8948N5410
$$ 214370 288065 271945 188919 145998 47946 91289 136820 149355 94207 60833 41885 97295
9927I7295R0976m7577j8857l0196k7378J6359K7810J10195K5890o362j2466k502
$$ 97295 188271 140694 121837 91641 64263 80622 108432 218627 244517 238155 225689 223187
9915B23187N7471k3740k3161N4003K6615q8629k7469K9657r9353p6195K7567J9562
$$ 223187 280658 256918 233757 287760 314375 225746 198277 227934 128581 52386 79953 99515
9903I9515K284M692p0855O7547l6259m2732j0399J42690O3240j23080j19195m8695
$$ 99515 101799 106491 35636 103183 66924 24192 13793 156483 219723 96643 -22552 -71247
9891g1247M4027J00043O7395K387l5903j28380K3491K0838j4520o6448o2112N3328
$$ -71247 -27220 72823 140218 142605 106702 -21678 1813 22651 8131 -58317 -120429 -67101
9879f7101K9444J10683n6472k3510L1887j04906k2333N5731n5116R8348K7532
$$ -67101 -37657 73026 16554 -6956 24931 -79975 -102308 -46577 -101693 -3345 24187
9868B4187J27977J452j34219j1463J81664L7465Q07p6541r8782L8797n416O7575
$$ 24187 152164 153616 19397 7934 189598 227063 227870 151329 52547 91344 85928 153503
9856A53503L7301M1715j13556j2266p58j27519K492R4165r885Q955J8217j4194
$$ 153503 190804 232519 118963 106697 105939 -21580 -19088 75077 65192 74147 92364 78170
9844G8170j3697Q3055M5644j54151J39455k3495j29927j38795k8270p0803m6623
$$ 78170 64473 147528 193172 39021 178476 154981 25054 -113741 -142011 -212814 -259437
9833b59437M8197J32969K01259p2007n8669J6469L1825J4849n64j40599j02097
$$ -259437 -211240 -78271 122988 50981 -7688 8781 40606 55455 54891 -85708 -187805
9822a87805M8204O4163J6447L7611j19651K0476P5638o5374K3122O9108J409Q0465
$$ -187805 -139601 -75438 -58991 -21380 -141031 -120555 -44917 -110291 -87169 -18061 -16652 63813
9810F3813n8672o4252m280N0443l4495j68614Q209J47529K1602Q051M811J03930
$$ 63813 5141 -59111 -63391 -12948 -47443 -216057 -207848 -60319 -38717 -30666 -25855 78075
9798G8075q0945n3025J20291J00489K3346Q8094j9278j0064j12987j77689p8956
$$ 78075 -2870 -55895 64396 164885 188231 276325 257047 246983 133996 -43693 -122649
9787a22649M223o2419J06459K3599M1907l8149M0925N0435M5967J4274q686J9807
$$ -122649 -118426 -180845 -74386 -50787 -8880 -47029 -6104 44331 90298 104572 95886 115693
9775A15693K8140r7888l0247J38413L2789q9955n1360J2036n1025q488j8099N3763
$$ 115693 143833 45945 15698 154111 186900 96945 45585 57621 6596 -1892 -19991 33772
9763C3772k746q042L4050Q4253o1008N1218j14109n0352J4788j17186L324j164
$$ 33772 31026 22984 57034 141287 80279 131497 17388 -32964 -18176 -135362 -132038 -133202
9751a33202N7243k8376J10476P4226j4925p3163J7496O1634l2985O1283N6785
$$ -133202 -75959 -104335 6141 80367 65442 -7721 9775 71409 38424 99707 156492
9740A56492m1862n2989m282m1825l7869j9183N1995m488k5527k645J32177M9369
$$ 156492 114630 61641 57359 15534 -22335 -41518 10477 5989 -19538 -22183 109994 159363
9728A59363j8806P4475L6637L913R8564J23412J38133k0782r9888j70601J5773
$$ 159363 140557 215032 251669 255582 354146 477558 615691 594909 495021 324420 340193
9717C40193J5617j5007r8996p0477L7615Q1188l6364j35371m432P7026k8272q9803
$$ 340193 355810 340803 241807 171330 208945 290133 253769 118398 113966 190992 162720 72917
9705G2917j6067r9490K9501j2987n3517M3255O6353M3475q6634O1022O3672j41040
$$ 72917 56850 -42640 -13139 -26126 -79643 -36388 29965 73440 -13194 47828 111500 -29540
9693b9540l366j0096j42813M806J76641M5498m6832p2261j54485j9438k9340N6408
$$ -29540 -32906 -43002 -185815 -181009 -4368 41130 -5702 -77963 -232448 -251886 -281226 -224818
9681b24818J45739J64922J38570l8908n7688O0444R5997M4419p3892j0591j19159
$$ -224818 -79079 85843 224413 185505 127817 188261 284258 328677 254785 244194 125035
9670A25035m729j8888n4919n2517j64606J21180q2535m4475M2349K2507J10134
$$ 125035 120306 101418 46499 -6018 -170624 -49444 -131979 -176454 -134105 -111598 -1464
9659a464P9833M3259k4472L7862J00702L563n8965K827l1584o3520J7115n6616
$$ -1464 78369 121628 97156 135018 235720 239283 180318 183145 151561 88041 105156 48540
9647D8540r0302n1434o157Q1568J67437l5485o8349J50916j5156q6596m3786k6216
$$ 48540 -41762 -93196 -99353 -17785 149652 114167 45818 196734 181578 94982 51196 24980
9635B4980j6921m0137m9783O0648R1219P4818P7967j58448o4067k3036L6137n4853
$$ 24980 8059 -32078 -81861 -21213 70006 144824 222791 64343 276 -22760 13377 -41476
9623d1476J5565n95J5716O5937M3164j0055J0546O95j15717r6563J96750J02627
$$ -41476 -25911 -26506 -10790 55147 98311 88256 98802 99497 -16220 -112783 83967 186594
9611A86594j20161o3840n6971M4532P1431N7404J04030p3626Q1083p7867l9646
$$ 186594 66433 2593 -54378 -9846 61585 118989 223019 149393 230476 152609 112963
9600A12963J936M1903J1760j48767j4726K7542P959n3036J1600l4978J21990K436
$$ 112963 114899 156802 168562 19795 5069 32611 40570 -12466 -866 -35844 86146 88582
9588H8582j28790P2515K8487Q1027Q7044r1817q7854J2651k5934l0597m792M5500
$$ 88582 -40208 32307 60794 141821 228865 137048 49194 61845 35911 5314 522 46022
9576D6022L4217R1855L0610K5855L2250m5730l5022r0893j27640m3049l4224j14715
$$ 46022 80239 172094 202704 228559 260809 215079 180057 89164 -38476 -81525 -115749 -230464
9564b30464J91585Q4776o8431J6919Q4220k761k8815q527n836K822j5984l2422
$$ -230464 -38879 45897 -22534 -5615 78605 75844 47029 38502 32666 35488 19504 -12918
9552a2918q3252p8272Q192j753N5407N3280l3289J33520P0650K1359N1568j8476
$$ -12918 -96170 -174442 -166250 -168003 -112596 -59316 -92605 40915 111565 132924 184492 166016
9540A66016m5867P8913n0390j37238m1658l2352r416R620Q9501M587j04698M1534
$$ 166016 120149 199062 148672 11434 -30224 -62576 -71992 -62372 27129 31716 -72982 -31448
9528c1448Q1484J20927j07012n8949k235N8345q2032o08R6807n6990l4281J30118
$$ -31448 50036 170963 63951 5002 2767 61112 -20920 -21528 75279 18289 -15992 114126
9516A14126N0979N3009o6094k9072o0643l4134o2622J867l423P7035L3510M0420
$$ 114126 165105 218114 152020 122948 62305 28171 -34451 -32584 -36007 41028 74538 114958
9504A14958M6978m2598o9336j11701m2861L8454k8462L8783J16133P1819P6060
$$ 114958 161936 119338 50002 -61699 -104560 -66106 -94568 -55785 60348 132167 208227
9493B08227q0766p4318O5190N9527J6972p1032k5366p2951j02476l9857P6987
$$ 208227 127461 53143 118333 177860 194832 123800 98434 25483 -76993 -116850 -39863
9482c9863M1277l4655m834R6994K8276J02122M6666N9339r6209l4253l8469L9883
$$ -39863 1414 -33241 -38075 58919 87195 189317 235983 295322 199113 164860 126391 166274
9470A66274L4994L0876k7351J16729r261q2354o4769O429j01959j35316K6467
$$ 166274 201268 232144 204793 321522 312261 229907 165138 171567 69608 -65708 -39241
9459c9241N3199l814K0739J6017j1492M5734Q9764m2213p4729O5265m7297p7602
$$ -39241 13958 10144 30883 46900 35408 81142 170906 128693 53964 119229 71932 -5670
9447e670j4035P3446m5036R2859N4006o5202l565J3509J0614M8813j09253L0995
$$ -5670 -19705 53741 8705 101564 155570 90368 86803 100312 110926 159739 50486 81481
9435H1481J85234L3140j30561k1686M4958n2425K5144P9051n2567k4950m7037
$$ 81481 266715 299855 169294 147608 192566 140141 165285 244336 191769 166819 119782
9424A19782n5900k9955l3635j9470N1768n808n7366p9663L2450M3557Q4684J16257
$$ 119782 63882 33927 292 -19178 32590 26782 -30584 -110247 -77797 -34240 50444 166701
9412A66701J01675j15844k9589j66909q3114K07536M9628j8938P6982j3643M4879
$$ 166701 268376 152532 122943 -43966 -127080 80456 130084 111146 188128 174485 219364
9401B19364j06348k6894L4705K658O9238j10286l66J00405j1729o4022j6778j9195
$$ 219364 113016 86122 120827 123485 192723 82437 82071 182476 170747 106725 89947 70752
9389G0752L7582q271L8770P1533k1228l7727N890O4568K3193J333m7377o9516
$$ 70752 108334 100063 138833 210366 189138 151411 157301 221869 245062 246395 199018 129502
9377A29502j18468p0787P9022O7081k3946j40865M8259Q0819l4941J04420P1849
$$ 129502 11034 -59753 19269 86350 62404 -78461 -30202 50617 15676 120096 191945
9366A91945J8763K8060Q1468N7535n0225j71206L679Q6952r5969l0288M4886J8137
$$ 191945 210708 238768 320236 377771 327546 156340 160019 246971 151002 120714 165600 183737
9354A83737J44435j11876j56903j09324k1671j5575j3392Q8957L1636m1974o5281
$$ 183737 328172 216296 59393 -49931 -71602 -87177 -100569 -11612 20024 -21950 -87231
9343h7231N9619N7427j4098P2814j16355J8989K7982o063p1934Q4109o1171m329
$$ -87231 -27612 29815 15717 88531 -27824 -8835 19147 13084 -58850 25259 -35912 -40241
9331d0241j3762K3504P2744J18837P6987M9645j09625k1397N4548n2609r723o7559
$$ -40241 -54003 -30499 42245 161082 238069 287714 178089 156692 211240 158631 148908 81349
9319H1349J1598j14026n9076R4255J22489q0136l2084O0950J18601k649K7604
$$ 81349 92947 -21079 -80155 14100 136589 56453 24369 85319 203920 201271 228875
9308B28875q828J05597N3249m6527j4028J6685j21895k32786j06706N6748J28047
$$ 228875 220047 325644 378893 332366 318338 335023 213128 -19658 -126364 -69616 58431
9297E8431R9729j01949m3301k8081n6550m8423K8574J8859N2178N9400J3414J0833
$$ 58431 158160 56211 12910 -15171 -71721 -120144 -91570 -72711 -20533 38867 52281 63114
9285F3114K8126Q7384J19301j479m7738p9061n5646J2791Q7814N4016J33434o8847
$$ 63114 91240 178624 297925 296446 248708 169647 114001 126792 214606 268622 402056 333209
9273C33209o7294j35301o6867p8561J35604J03527k6047l1493J7048J3870J5737
$$ 333209 265915 130614 63747 -14814 120790 224317 198270 166777 183825 197695 213432
9262B13432J14849p597j33800O91j4061k6613L0829N9304P6756m7742k26315q3028
$$ 213432 328281 320684 186884 187575 173514 146901 177730 237034 313790 266048 39733 -43295
9250d3295L6035l6475j37653o6596Q2567J96355n4546l0517O0241J00514P2051
$$ -43295 -7260 -43735 -181388 -247984 -165417 30938 -23608 -54125 6116 106630 178681
9239A78681J4883J58784j2646l4183j464j42556M6390M0947j989M645j61725k3924
$$ 178681 193564 352348 339702 305519 304055 161499 207889 248836 246847 251492 89767 65843
9227F5843L6784o3527j9076j9352J14669Q4501K0402J4553j3509j89267q0023
$$ 65843 102627 39100 20024 672 115341 199842 220244 234797 221288 32021 -48002
9216d8002j3684N7103J23104L0099K2080Q7600p6746L5061J18646N0424r2876
$$ -48002 -61686 -4583 118521 148620 170700 258300 181554 216615 335261 385685 292809
9205B92809k5235q2587j73009Q1170J11465P8757j64535p4285J9828l0398j1236
$$ 292809 267574 184987 11978 93148 204613 283370 118835 44550 64378 33980 22744
9194B2744Q2196R8521M0863p4763l1235N3620O2028o2074k2170p06j942J10701
$$ 22744 104940 203461 244324 169561 138326 191946 253974 191900 169730 169024 167082 277783
9182B77783Q9180J1545J51n7176k46969O5456R6638L5478M2518o9729n4361J15656
$$ 277783 366963 378508 378659 321483 74514 139970 236608 272086 314604 244875 190514 306170
9170C06170o3452P4711k0276j3966j5262j0699M9893N2701K9204K884l8692l6076
$$ 306170 242718 317429 297153 283187 267925 257226 307119 359820 389024 391908 353216 317140
9158C17140j3514P3113o1458j9632J7445j1949q4657n5072m3485j2896Q9811M7255
$$ 317140 303626 376739 315281 295649 313094 301145 216488 161416 117931 105035 194846 242101
9146B42101q2441L5161M1024j4476R2526J19269R397l8641M670l8834o9479J7429
$$ 242101 159660 194821 235845 221369 313895 433164 442561 403920 408590 369756 300277 317706
9134C17706L0435j352j296l7384j1519Q9185K9044n1797M6891Q420L3832j7437
$$ 317706 348141 346789 345493 308109 296590 385775 414819 363022 409913 418333 452165 434728
9122D34728k4757j71066P0853m1717r0613L7883M9182k025M7013o6554J40944
$$ 434728 409971 238905 309758 268041 177428 215311 264493 262468 309481 242927 383871
9111C83871M8566L0408K6198n7396j20856q8651L2173m8311M8688O8014J7650
$$ 383871 432437 462845 489043 431647 310791 222140 254313 206002 254690 322704 340354
9100C40354j8844P7599N1204M9679J00955J11468j274j36509q5286P929j9174
$$ 340354 321510 399109 450313 499992 600947 712415 711141 574632 489346 497275 478101
9089D78101j42135r742J12001J69867q136r8474o6614O2012P4336L3007J5311
$$ 478101 335966 326224 438225 608092 599956 501482 434868 496880 571216 604223 619534
9078F19534L4440J11848m9389k2283q4352l4328J9321n2436J9321J24878p4748
$$ 619534 653974 765822 716433 694150 609798 575470 594791 542355 561676 686554 611806
9067F11806o1785J68505J1389r3570o6508m2811R9972j6622r9028J44697J65310
$$ 611806 550021 718526 729915 636345 569837 527026 626998 610376 511348 656045 821355
9056H21355q0086j16906j531l2195R8989J20130l6568K9726R5043j7321n9152
$$ 821355 741269 624363 622832 590637 689626 809756 773188 802914 897957 880636 821484
9045H21484j6051p6809j43252J504J12382J22704l0406N6738j3683o2364j7312
$$ 821484 805433 728624 585372 586876 699258 821962 791556 848294 834611 772247 754935
9034G54935J5927P2819K20729O6936r6689o1716O2717l2864l0112L9367p2667
$$ 754935 770862 843681 1064410 1131346 1034657 972941 1035658 1002794 972682 1012049 939382
9023I39382j98423P2625k1179k056N9817Q4041P9285j089n4755P9053K5827N9213
$$ 939382 740959 813584 792405 790349 850166 934207 1013492 1012403 957648 1036701 1062528 1121741
9011A121741Q689m9345J20646n9950r2216M699R38J70877M7792M0962r2660K4984
$$ 1121741 1130430 1081085 1201731 1141781 1049565 1054264 1055202 1226079 1273871 1314833 1222173 1247157
8999A247157N0710j6556J19304J58698l8261K1694J33496o7185j57882J5966P3660
$$ 1247157 1297867 1281311 1400615 1559313 1521052 1542746 1676242 1609057 1451175 1467141 1540801
8988A540801M3504K6324o4845J1995q1765J4202J56065J23862J08769l8349j29273
$$ 1540801 1584305 1610629 1545784 1557779 1476014 1490216 1646281 1770143 1878912 1840563 1711290
8977A711290j18866R8762N9719J6991k372n923Q2566O4024o4708Q851o9601J24248
$$ 1711290 1592424 1691186 1750905 1767896 1765524 1759601 1842167 1906191 1841483 1850334 1780733 1904981
8965A904981J33058l2701R718J70906P1087k6443j66934j17973l5609J0282K0184
$$ 1904981 2038039 2005338 2015056 2185962 2257049 2230606 2063672 1945699 1910090 1920372 1940556
8954A940556J11721J36676P6348Q688L4565J9616j2350J00321J05396N4512J1072
$$ 1940556 2052277 2188953 2265301 2273989 2308554 2328170 2315820 2416141 2521537 2576049 2587121
8943B587121j14301o4992M2011J96738J36193J11745L0679J13998m6199m8425
$$ 2587121 2472820 2407828 2449839 2646577 2782770 2894515 2925194 3039192 2992993 2944568
8933B944568J62457J52891J70722P3002J09361J8526P3508J34220J05254j5080
$$ 2944568 3107025 3259916 3430638 3503640 3613001 3631527 3705035 3839255 3944509 3929429
8923C929429j5857J29872P1569J09983P0023J65560R8763P6509M6494K219R4700
$$ 3929429 3913572 4043444 4115013 4224996 4295019 4460579 4559342 4635851 4682345 4684564 4779264
8912D779264J92128J03899J41093K19261J26834P1187K69318J96073J26544K67248
$$ 4779264 4971392 5075291 5216384 5435645 5562479 5633666 5902984 6099057 6225601 6492849
8902F492849J26776J14497J13190J32096K80004K10310K31706K41772K18900K50675
$$ 6492849 6619625 6734122 6847312 6979408 7259412 7469722 7701428 7943200 8162100 8412775
8892H412775K34189K00455L80460M27859L46382L00726J67955L50667L83131L12779
$$ 8412775 8646964 8847419 9227879 9655738 10002120 10302846 10470801 10821468 11204599 11517378
8882A1517378L32098K19681L66429N51422N79185M74909M67849L89898L96800
$$ 11517378 11849476 12069157 12435586 12987008 13566193 14041102 14508951 14898849 15295649
8873A5295649N62152N11667O63654N23582M54067M80977M28610O22951N69382
$$ 15295649 15857801 16369468 17033122 17556704 18010771 18491748 18920358 19543309 20112691
8864B0112691N76131N34653P08944P61323O51359N59322N52575N34915N15755
$$ 20112691 20688822 21223475 21932419 22693742 23345101 23904423 24456998 24991913 25507668
8855B5507668O33148M95891O26612M51158L38365L91250K38086J35735K9416J80974
$$ 25507668 26140816 26636707 27263319 27714477 28052842 28444092 28682178 28817913 28847329 29028303
8845B9028303P4832J04133L0318j47621k01745r5847q1589l59641l65435k52697
$$ 29028303 29103135 29207268 29237586 29089965 28888220 28792373 28710784 28351143 27985708 27733011
8835B7733011m91455o12764m91411m85818n53167o59350n73294n71458n25730
$$ 27733011 27241556 26628792 26137381 25651563 25098396 24439046 23865752 23294294 22768564
8826B2768564n61763m32072o40880n51566o09718p51896n80952m82018n70683
$$ 22768564 22206801 21774729 21133849 20582283 19972565 19220669 18639717 18157699 17587016
8817A7587016n06886n19674n47161n35119m98732m06219m39022m50732m41070
$$ 17587016 17080130 16560456 16013295 15478176 14979444 14573225 14134203 13683471 13242401
8808A3242401l32188l75277l61091m32302k43155k94600l14757j98307k42751
$$ 13242401 12910213 12534936 12173845 11741543 11498388 11203788 10889031 10690724 10447973
8799A0447973m35032m08671l76418k47365r9962k24061k80833l06982k11914k65464
$$ 10447973 10012941 9604270 9227852 8980487 8880525 8656464 8375631 8068649 7856735 7591271
8789G591271j27576j15989j83335k79476l25997j78904p2031q0965j98152k33623
$$ 7591271 7463695 7347706 7164371 6884895 6558898 6379994 6307963 6226998 6028846 5795223
8779E795223j69554p0063j34117j08878k05814j34917q7311L8551M3450l2768
$$ 5795223 5625669 5555606 5421489 5312611 5106797 4971880 4884569 4923120 4966570 4933802
8769D933802j43582j52121j97474k35805k87163k9878J6038r2133j1789j56036
$$ 4933802 4790220 4638099 4440625 4204820 3917657 3887779 3903817 3811684 3799895 3643859
8759C643859j03108P2981j340j32961Q166j4256j47079k03443o2304n0178l7123
$$ 3643859 3540751 3613732 3612392 3479431 3487597 3473341 3326262 3122819 3060515 3010337 2973214
8748B973214J02798M8749n8406o0016k25236j31791q9722j09381J2109Q1354o6321
$$ 2973214 3076012 3124761 3066355 3006339 2781103 2649312 2559590 2450209 2462318 2543672 2477351
8737B477351j46179j1076p9525k7763J4056r0411o2913J1303l3965m3753j7498
$$ 2477351 2331172 2320096 2240571 2212808 2226864 2136453 2073540 2084843 2050878 2007125 1989627
8726A989627j21993Q3456Q3861r2392j1315J3744J2608l0748m7830j43473N1299
$$ 1989627 1867634 1951090 2034951 1942559 1931244 1944988 1957596 1926848 1879018 1735545 1786844
8715A786844n6580j37389L4608J29036M1141j46220o5628M5935o4991j49984p050
$$ 1786844 1730264 1592875 1627483 1756519 1797660 1651440 1585812 1631747 1566756 1416772 1409722
8704A409722L4325N9715P5835j38734o3238L3907K3162o7191k18629r8943N8266
$$ 1409722 1444047 1503762 1579597 1440863 1377625 1411532 1434694 1367503 1148874 1049931 1108197
8693A108197L2394r6o0097q044k394j8402j17293n9504j13782R8621J28658j03798
$$ 1108197 1140591 1140495 1080398 1072354 1069960 1051558 934265 874761 760979 859600 988258 884460
8681H84460q7126J3317J3317R1956m5475j43880k7167L2483l1628l6566r8957
$$ 884460 797334 810651 823968 915924 870449 726569 699402 731885 700257 663691 564734
8670E64734M2625J55660R1765k7123k6338n0733j07306L6259l4290K1362J56091
$$ 564734 607359 763019 854784 827661 801323 750590 643284 679543 645253 666615 822706
8659H22706L3662n6665K1326J08313n5463r4891J7395q2193o8910j37243j37157
$$ 822706 856368 799703 821029 929342 873879 778988 796383 714190 645280 508037 370880
8648C70880M8899J26599Q3893j06414O1480J29374N0507o2342j310P7694p8221
$$ 370880 419779 546378 630271 523857 585337 714711 765218 702876 701566 779260 701039
8637G01039p5915j01604j12418Q3721J87141J54168M1564m7706j29532m7800p2712
$$ 701039 625124 523520 411102 494823 681964 836132 877696 829990 700458 652658 579946
8626E79946p0319o5656n0745J16226O9027m159k1807M6157O1768k0618r5170q4101
$$ 579946 509627 443971 393226 509452 578479 574320 552513 598670 660438 639820 544650 460549
8614D60549l1864J22528L7700K0882O6493q4125m0055J36412M063l3626r2535
$$ 460549 428685 551213 588913 609795 676288 592163 552108 688520 692583 658957 566422
8603E66422l8316J3681m8085k2093r500Q0409J7360k5909q7335K9699l6668j30091
$$ 566422 528106 541787 493702 471609 462109 542518 559878 533969 446634 476333 439665 309574
8591C09574j5113m4199J15201P6907l7131p1409M7137o5296j59005J8794L7765
$$ 309574 294461 250262 365463 442370 405239 333830 380967 315671 156666 175460 213225
8580B13225J9579N8728P5171Q0037n9423m3955o1804l4729J12524m4347l0769
$$ 213225 232804 291532 366703 446740 387317 343362 281558 246829 359353 315006 284237
8569B84237L9927O5464Q707P5521L6582p03J4884N9639K2784n544k6834q0463
$$ 284237 324164 389628 398335 473856 510438 509735 524619 584258 607042 601498 574664 494201
8557D94201L120J4368k7169r8707k5900K6388n5269j8978L7397P3424M9171j32354
$$ 494201 497321 511689 484520 385813 359913 386301 331032 312054 349451 422875 472046 339692
8545C39692l1186R1492j59276r5365N0839o314J16974L8522o1737m3563L4109
$$ 339692 308506 399998 240722 145357 196196 189882 306856 345378 283641 240078 274187
8534B74187M0611j4688N1265Q4714r3502m2513o0454j05545M5496L7226l1952
$$ 274187 314798 300110 351375 436089 342587 300074 239620 134075 179571 216797 184845
8523A84845p371J04650Q4427l5387M5485n3582j15385R1112M8505r2232j24608
$$ 184845 177474 282124 366551 331164 376649 323067 207682 298794 347299 255067 130459
8512A30459K6095J56741J32166j1411M1763L0410Q882o3393k09577J4878O6892
$$ 130459 156554 313295 445461 434050 475813 506223 515105 451712 242135 257013 323905
8501C23905k4540m7691K4987p7920N4105O1747K0867j53266j52017R2936J74738
$$ 323905 299365 251674 276661 198741 252846 314593 335460 182194 30177 123113 297851
8490B97851r9013M96o4504k2906P8959N4640j0749l8906J03582L7760k5578k8886
$$ 297851 198838 199334 134830 111924 190883 245523 234774 195868 299450 337210 311632 282746
8478B82746j02621N7132n787L9791N994j44221l0015N2063l295Q9126k8133q5753
$$ 282746 180125 237257 231470 271261 277255 133034 103019 155082 151787 240913 212780 127027
8466A27027j16176M4084L3456P0657R2929o0493j56180J1336L035k4953R8804
$$ 127027 10851 54935 88391 159048 251977 191484 35304 46640 49675 24722 123526
8455A23526P7326q0870j21448L6623J39825J42429r0374J3961L7421J265N282
$$ 123526 200852 119982 -1466 35157 174982 317411 227037 240998 278419 279684 284966
8444B84966k1230N0613j25647M954J23272L5480R037l5072r0355n5600J72105
$$ 284966 263736 314349 188702 193656 316928 352408 361445 326373 236018 180418 352523
8433C52523k66j26114n8592J17831R1433k8219l8452k0339l9206Q4831j42346
$$ 352523 352257 226143 167551 285382 376815 348596 310144 289805 250599 335430 193084
8422A93084j82614j69032j1076L0945J04153J4605J23594O5481m4298q55l9867
$$ 193084 10470 -158562 -169638 -138693 -34540 -19935 103659 169140 124842 123987 84120
8411H4120j05865n970O4352O9809J0232J9136J1947l1310K4320j4400N816O5959
$$ 84120 -21745 -27715 36637 106446 116678 135814 147761 116451 140771 126371 132187 198146
8399A98146N0301p7545O8254q6786l3970l216K6450O713P2874q6379l5159l9067
$$ 198146 248447 170902 239156 152370 118400 115184 141634 148347 221221 134842 99683 60616
8387F0616j76855q3882M0844J96892J45280Q833Q5919n2239j63953k4331J27171
$$ 60616 -116239 -200121 -159277 37615 182895 191728 277647 225408 61455 37124 164295
8376A64295N9337j02660j95932O3959k3642m8470M2136p0306m4370J20656J13914
$$ 164295 223632 120972 -74960 -11001 -34643 -83113 -40977 -111283 -155653 -34997 78917
8365G8917R1526k3506J1967o1841m5391j6816m650J3182j62347j22900P0615J25070
$$ 78917 170443 146937 158904 97063 51672 34856 30206 43388 -118959 -241859 -171244 -46174
8353d6174J34984p2213j15539Q8776O7553M7661J1638N2974k089K6866R6493R4073
$$ -46174 88810 16597 -98942 -10166 57387 105048 116686 169660 167571 194437 290930 385003
8341C85003l0196j34281o093q9431J03855M7385p0881j62286j6434N5411m0962
$$ 385003 354807 220526 214433 125002 228857 276242 205361 43075 26641 82052 41090
8330D1090k3566J37715J29065o8274o5398n4357L4401L9816j02127Q1689L8973
$$ 41090 17524 155239 284304 216030 150632 96275 130676 170492 68365 150054 189027
8319A89027P750j14158j53185J5628m5133M864J63606K503j00723K4673O5104
$$ 189027 196777 82619 -70566 -54938 -100071 -95207 68399 70902 -29821 -5148 59956
8308E9956J60911j03027L9130j5161p8586J8126m5021j7757K0890P5706j41908
$$ 59956 220867 117840 156970 141809 63223 81349 36328 18571 39461 115167 -26741
8297b6741k324J25844k64M6411K6545m5442k638p3886q5217O9894P5158N1973
$$ -26741 -29065 96779 96515 142926 169471 124029 121391 47505 -37712 32182 107340 159313
8285A59313K6607n0526p8094l5198M1926j8546O1531R54K889k548k3982n356p3695
$$ 159313 185920 135394 57300 22102 64028 45482 107013 107967 110856 108308 84326 78970 5275
8272E275J7497j9971P0255P3369l7428m1557q2236J05242N8179j420j61004J23362
$$ 5275 22772 2801 73056 146425 108997 67440 -14796 90446 148625 147205 -13799 109563
8260A09563N3418r5276p3800R2384J00929n561L8587K4937L498k0987l3264k3889
$$ 109563 162981 67705 -6095 86289 187218 181657 220244 245181 248679 227692 194428 170539
8248A70539p0119J38044o9847R075K4459q7416r9667L0166K6532J74677l7755
$$ 170539 100420 238464 168617 177692 202151 114735 15068 45234 71766 246443 208688
8237B08688k9610j3886q8911m2212j8097o7922p1732O8359J31302M0883j29177
$$ 208688 179078 165192 76281 34069 15972 -51950 -123682 -55323 75979 116862 -12315
8226a2315j544Q8967r8285m8277l095O1750j23660n2625R8019J63190M0588N4958
$$ -12315 -13859 75108 -23177 -71454 -74549 -12799 -136459 -189084 -91065 72125 112713 167671
8214A67671m9626L3813K125M6116m0723o7101j8614K0067m4227j16477l8934J04142
$$ 167671 118045 151858 153983 200099 159376 92275 73661 93728 49501 -66976 -105910 -1768
8202a768O2600N3307M6334J5283R0134p3399j63996j43915Q2731J71830Q4120
$$ -1768 60832 114139 160473 175756 265890 192491 28495 -115420 -32689 139141 223261
8191B23261j27507M962k0612j07353j11006P3270N3130j7197Q8576J27829o0779
$$ 223261 95754 100716 80104 -27249 -138255 -64985 -11855 -29052 59524 187353 126574
8180A26574l4095l3215l5444Q619J16570N2047j8703K8970k7259j72435r0337
$$ 126574 92479 59264 23820 32439 149009 201056 182353 211323 184064 11629 -78708
8169g8708J31362M2727O995J21121o7659j62984p3460k3254j1776R3769L5680
$$ -78708 52654 95381 102376 223497 155838 -7146 -80606 -103860 -115636 -21867 13813
8158A3813J0760k1122j3827o6211R4628R4121j19056n0783M2744P5402j26979
$$ 13813 24573 3451 -10376 -76587 18041 112162 -6894 -57677 -14933 60469 -66510
8147f6510j21721J51160M4782j3832L4312l4336l9447N959J3196l7041Q0997p2608
$$ -66510 -188231 -37071 7711 -6121 28191 -6145 -45592 -39633 -26437 -63478 17519 -55089
8135e5089o6777J37769K4105j88990k0600L2583J49291J20343j5940j40057j15310
$$ -55089 -121866 15903 40008 -148982 -169582 -136999 12292 132635 116695 -23362 -138672
8124a38672N591Q2103Q270J31033n3227r943o0022p3520L3858P8312L1947q264
$$ -138672 -133081 -50978 -42708 88325 35098 25155 -34867 -108387 -74529 3783 35730 27466
8112B7466q0551n4588m3803m9386K2053J21907q3004j9766j5262M1043R368m9596
$$ 27466 -53085 -107673 -151476 -200862 -178809 -56902 -139906 -159672 -174934 -133891 -124523 -174119
8100a74119R4156J99954J10279M7892j18941p7620p2540N7939n920R97M5602J05738
$$ -174119 -79963 119991 230270 278162 159221 81601 9061 67000 61080 62077 107679 213417
8088B13417n9461j35776k4023L9401j111k5640j09471j56560L8709J11227N7048
$$ 213417 153956 18180 -5843 33558 32447 6807 -102664 -259224 -220515 -109288 -52240
8077e2240R2037P8602m3101j69737K5890J65652Q5344p1679p4481j9104K4980
$$ -52240 39797 118399 75298 -94439 -68549 97103 182447 110768 36287 17183 42163
8066D2163j2357L5077j0093j9828m984o2681L0133l7153j8157l6761O5487M8089
$$ 42163 29806 64883 54790 34962 29978 -32703 -2570 -39723 -57880 -94641 -29154 18935
8054A8935N8793n8429j33897J15397M6544L7218l2491J745j60451N5958J73558
$$ 18935 77728 19299 -114598 799 47343 84561 52070 53815 -106636 -50678 122880
8043A22880R0449L6826l7803n8587k2518l9578J52Q7319q2761q1601O6265O5572
$$ 122880 213329 250155 212352 153765 131247 91669 91821 179140 96379 14778 81043 146615
8031A46615o9294o5098n3860L7837j2021J48301J24887L5536m7245j67753j03015
$$ 146615 77321 12223 -41637 -3800 -15821 132480 257367 292903 245658 77905 -25110
8020b5110R645j02450j1398L666m1876q5559L7551K56622O4695J6540L0932r9216
$$ -25110 -15465 -117915 -129313 -125647 -167523 -253082 -215531 41091 105786 122326 153258 54042
8008E4042R5799j46344p2855j3721J25365K9202O1921K9541J39060j08526j67565
$$ 54042 149841 3497 -69358 -83079 42286 71488 133409 162950 302010 193484 25919
7997B5919K3441K4869r878k3147L7217J92859j08543j42671j6267K0005M9099
$$ 25919 49360 74229 64351 41204 78421 271280 162737 20066 3799 23804 72903
7986G2903M5577j5898j9165O1487J8317m0032k6251J49804J18082j93528k02381
$$ 72903 118480 102582 83417 144904 163221 123189 96938 246742 364824 171296 -31085
7975c1085n0087J34716J1007R911j5717l7934r7885l3070O6832r5108j8107J48632
$$ -31085 -81172 53544 64551 74462 58745 20811 -77074 -110144 -43312 -138420 -156527 -7895
7963g895P8583K4234j13261j64652P9725K5954L4292k0062N5842m69J16022o4889
$$ -7895 70688 94922 -18339 -182991 -103266 -77312 -43020 -63082 -7240 -7709 108313 43424
7951D3424K2993J02355P6036k83973p3370Q9203R4839M0271n6477j568J8607n4475
$$ 43424 66417 168772 244808 -39165 -112535 -23332 71507 111778 55301 53733 72340 17865
7939A7865N2624R222J5207Q9955l4252O341k6981j48123K0651j6907p4847O8091
$$ 17865 70489 79711 94918 184873 150621 156962 129981 -18142 2509 -14398 -89245 -21154
7927b1154m2971N4648J655O6398J8268j8330j0298k171J5971K9886J9091N3540
$$ -21154 -64125 -9477 -7822 58576 76844 58514 48216 46045 62016 91902 110993 164533
7915A64533N866p0961o6834j6841M0866K1288l0069j5583O1806O7559p489n0074
$$ 164533 170399 99438 32604 15763 56629 77917 47848 32265 94071 161630 154141 104067
7903A04067p9561r9786l3937N3237R3311L041k46684k3776K94765J25826r9443
$$ 104067 24506 -75280 -109217 -55980 37331 40372 -206312 -230088 64677 190503 91060
7892I1060j67110N8118K8727M1957n1205p9967K5942N4636L3522O6686j5106j38535
$$ 91060 -76050 -17932 10795 52752 1547 -78420 -52478 2158 35680 102366 87260 -51275
7880e1275j1280m3928M756R0691J49199K4881p4168K717Q5143j12529p3825P1949
$$ -51275 -62555 -106483 -101727 -11036 138163 163044 88876 91593 176736 64207 -9618 62331
7868F2331j2533r2781L8019J33293l4455j42945K1641R4633J20317j458k25537
$$ 62331 49798 -42983 -4964 128329 93874 -49071 -27430 67203 187520 186062 -39475
7857c9475r8572r9410r008k831J4492K3031J27401J15138L7962n180j4638o8766
$$ -39475 -138047 -237457 -246465 -249296 -234804 -211773 -84372 30766 68728 63548 48910 -19856
7845a9856p7909R8383J00405n5010o7267O7618M8070k227K5696N303P5954p8610
$$ -19856 -97765 618 101023 46013 -21254 46364 94434 92207 117903 123206 199160 120550
7833A20550j9326M9522p2227j12281l9448L5377j03j6743j1385p786J21879K63426
$$ 120550 101224 150746 78519 -33762 -73210 -37833 -37936 -54679 -66064 -73850 48029 311455
7821C11455l4661j09978j06162L2919P6955j09325L8078l0842k1092K9660K0904
$$ 311455 276794 166816 60654 93573 170528 61203 99281 68439 47347 77007 97911
7810I7911q3807J07652n725o0089m2685m6843l8183J3711K2273m9295M8160L5740
$$ 97911 14104 121756 116031 55942 13257 -33586 -71769 -58058 -35785 -85080 -36920 -1180
7798a180m8095o6658L8362J03182M2759m7317Q2399P7742m0701l8856r9365k30456
$$ -1180 -49275 -115933 -77571 25611 68370 21053 103452 181194 140493 101637 2272 -228184
7786b28184O9772P6025m7282M6198j5199J71265J00091o6462n5181p0989O296
$$ -228184 -158412 -82387 -129669 -83471 -98670 72595 172686 106224 51043 -19946 -13650
7775a3650k6448j3790J29525J9256j22473r7409J50408l3244q2704n609N9561
$$ -13650 -40098 -53888 75637 94893 -27580 -124989 25419 -7825 -90529 -96138 -36577
7764c6577j14449k8313K5594Q2999m209l2032J6636J07124O9836j59359j16160
$$ -36577 -151026 -179339 -153745 -70746 -74955 -106987 -90351 16773 86609 -72750 -188910
7753a88910L7534N0396L9527R8285m4035n5352N1446N2021l7797j4966m3925K8275
$$ -188910 -151376 -100980 -61453 36832 -7203 -62555 -11109 40912 3115 -11851 -55776 -27501
7741b7501P8668j08616O2957L0236j8061O1244R1613q872o4876k12828n4254J33997
$$ -27501 51167 -57449 5508 35744 17683 78927 170540 161668 96792 -116036 -170290 -36293
7729c6293P0784J1946q9770j57691N574Q1740q325j00425K0617R2340J14838p4785
$$ -36293 34491 46437 -43333 -201024 -195450 -113710 -122035 -222460 -201843 -109503 5335 -69450
7717f9450o363O7611M9016o8164n7178N0165N7551K7914p5717J5252O3072p2257
$$ -69450 -75813 -8202 40814 -27350 -84528 -34363 23188 51102 -24615 -9363 53709 -18548
7705a8548j32768q2409K4776K29328J92772o9079m5215j72872K0341M1200p74
$$ -18548 -151316 -233725 -208949 20379 213151 144072 98857 -74015 -53674 -12474 -13248
7694a3248L8135L8953p9907p5606p5713L9021l0426N6434Q9375R5664n6866j01554
$$ -13248 24887 63840 -16067 -91673 -167386 -128365 -158791 -102357 -12982 82682 25816 -75738
7682g5738K6803L0667O7839K2628n2886J07871L4318k05072j00147N5012N5846
$$ -75738 -48935 -18268 49571 72199 19313 127184 161502 -43570 -143717 -88705 -32859
7671c2859k7740n5441K0028R6663K4503l3604J3293L4661m581j69234m0556j1305
$$ -32859 -60599 -116040 -96012 651 25154 -8450 4843 39504 34923 -134311 -174867 -186172
7659a86172Q5660P9571N164j4488J4033O3641Q3940L2925p7912M7394L0228o6326
$$ -186172 -100512 -20941 -15777 -30265 -16232 47409 131349 164274 86362 133756 163984 97658
7647I7658j1854j13170k8837O24n3265R0221J08646j53825L3596O4345o937P2662
$$ 97658 85804 -27366 -56203 -55579 -108844 -18623 90023 -63802 -30206 34139 27202 99864
7635I9864j2249R400Q895j81876k7702j0125j8021J04759k1566j58188k07179
$$ 99864 87615 97015 105910 -75966 -103668 -113793 -131814 -27055 -48621 -206809 -413988
7624d13988l1940M2325J64130J6636N4431R6088Q3550O2043k9414p8966o3059
$$ -413988 -445928 -403603 -239473 -222837 -168406 -72318 11232 73275 43861 -35105 -98164
7613i8164K5018J64699L9872j89678j15283Q8512O4753P8805o1842K5913M9122
$$ -98164 -73146 91553 131425 -58253 -173536 -85024 -20271 58534 -3308 22605 71727
7602G1727P0585q0083l9790J52864O9741n7440p239q8845J71725L9588q8333m5488
$$ 71727 142312 62229 22439 175303 245044 187604 180365 91520 263245 302833 214500 169012
7590A69012m5042N6549n5831k26628j8504M7156r7100N8254J25132P4891k9590
$$ 169012 123970 180519 124688 -101940 -120444 -73288 -170388 -112134 12998 87889 58299
7579E8299m1112J3587L6802j3889j25012q4763Q3435O4591m0636j25183N5873
$$ 58299 17187 30774 67576 53687 -71325 -156088 -72653 -8062 -48698 -173881 -118008
7568a18008O5176l0731P7345Q3627K5029j577Q2086M6902K2446k3876j39868q8679
$$ -118008 -52832 -83563 -6218 77409 102438 100861 182947 229849 252295 228419 88551 -128
7556a28K6153K2605O733O9971J15440j27045P500J7589O7615R0680p7297j65145
$$ -128 26025 48630 55363 125334 240774 113729 121229 138818 206433 297113 219816 54671
7544E4671k0264J64255J63944j4992m7605j65798k39022p8635K2777N6139J7869
$$ 54671 34407 198662 362606 347614 300009 134211 -104811 -183446 -160669 -104530 -86661
7533h6661P0441j9910O9604J21352K1441j59755j58223j0994R3481K7693q5645
$$ -86661 -16220 -36130 33474 154826 176267 16512 -141711 -152705 -59224 -31531 -117176
7522a17176l9910M0382J0940N9530L8712n3413J2646o7504o3497j01871R2637
$$ -117176 -157086 -116704 -105764 -46234 -7522 -60935 -48289 -115793 -179290 -281161 -188524
7511a88524R9567J04122K0816j88897Q7120N5327M0047K4885j30377l575m2677
$$ -188524 -88957 15165 35981 -152916 -65796 -10469 29578 54463 -75914 -79489 -122166
7500a22166l4452Q2113M8064o5740n8729N4921O1161P6292L8549P149o4619p2384
$$ -122166 -156618 -74505 -26441 -92181 -150910 -95989 -34828 41464 80013 87162 22543 -49841
7488d9841J24788R2902n6410k11364Q0944J67470L6154M4028m9518j49435o1566
$$ -49841 74947 167849 111439 -99925 -18981 148489 184643 228671 179153 29718 -31848
7477c1848o6791P5715J35587O4363j74866K8967J31685R5690K1741m0813r9747
$$ -31848 -98639 -22924 112663 177026 2160 31127 162812 258502 280243 239430 139683
7466A39683P358Q1516K6142o5714o1219O236q4852j46354k5007J0337L2919K5810
$$ 139683 147041 228557 254699 188985 127766 134002 49150 -97204 -122211 -111874 -78955 -53145
7454e3145J0157MK2841p0396j23489K9249J50856O9558p7418K8065J13487R28
$$ -53145 -42988 -42984 -20143 -90539 -214028 -184779 -33923 35635 -41783 -13718 99769 100697
7442A00697j47096J1144J05948l9394j70799j0243J17318m159j07865p190k2271
$$ 100697 -46399 -35255 70693 31299 -139500 -149743 -32425 -36584 -144449 -151639 -173910
7431a73910j2074P0339J0138k1755P1421j071K8162L7633M375k6174L9003M8849
$$ -173910 -185984 -115645 -105507 -127262 -55841 -56912 -28750 8883 13258 -12916 26087 74936
7419G4936o9881j05259m4529Q5732Q0892K12402k752q0289k40611J829J12910
$$ 74936 5055 -100204 -144733 -59001 21891 234293 231541 151252 -89359 -87530 25380
7408B5380O0794N6387n409j02359O4546M2610j04607o5903r5687n0493Q6879P7213
$$ 25380 86174 142561 137152 34793 99339 141949 37342 -28561 -124248 -174741 -87862 -10649
7396a0649j5642o1609l3460M9973N0185O0520m9557p4423l6166M5808J1964J24324
$$ -10649 -26291 -87900 -121360 -71387 -21202 39318 -10239 -84662 -120828 -75020 -63056 61268
7384F1268J2536O0587o2561j01510r2617K5433j643N7991N2054P3527K2850m4704
$$ 61268 73804 134391 71830 -29680 -122297 -96864 -98507 -40516 11538 85065 107915 63211
7372F3211M2725k5820K540R4855K4636k7219l8206o6249P871M7013l4873r9733
$$ 63211 105936 80116 82656 177511 202147 174928 136722 70473 78344 125357 90484 -9249
7360i249j4828N084N9122o4620n5157J72691J18151J34747n8445p1711J5901j42625
$$ -9249 -24077 -18993 40129 -24491 -79648 93043 211194 345941 287496 215785 231686 89061
7348H9061m6063n6609K9183l7151k8498j580n4968Q7243J03182Q016q7263o224
$$ 89061 42998 -13611 15572 -21579 -50077 -51657 -106625 -19382 83800 91816 4553 -1671
7336a671p1137m5683L9349q7642o3972J07696J15122K6277L5979q3132J7890Q2772
$$ -1671 -72808 -118491 -79142 -166784 -230756 -123060 -7938 18339 54318 -28814 -10924 71848
7324G1848P4575J5006M4141P1201o4278j52837N3097P2797n7433j91166j6590
$$ 71848 146423 161429 205570 276771 212493 59656 112753 185550 128117 -63049 -79639
$$ [...]
##END NTUPLES=NMR SPECTRUM
##END=
