##TITLE=Analysis number 321833
Compound Code cc 46746
Book Reference 449/142
Project Code adrs
Chemist Name davee
##JCAMPDX= 6.0         $$ Bruker NMR JCAMP-DX V2.0
##DATA TYPE= NMR SPECTRUM
##DATA CLASS= NTUPLES
##ORIGIN= Bruker BioSpin GmbH
##OWNER= nmr
$$ XWIN-NMR		Version 3.5
$$ Wed Aug 30 11:29:47 2006 GMT Daylight Time (UT+1h)  MAYBRIDGE\nmr@NMR_250MHZ
##.OBSERVE FREQUENCY= 250.131544655141
##.OBSERVE NUCLEUS= ^1H
##.ACQUISITION MODE= SIMULTANEOUS (DQD)
##.ACQUISITION SCHEME= undefined
##.AVERAGES= 16
##.DIGITISER RES= 18
##SPECTROMETER/DATA SYSTEM= dpx250
##.PULSE SEQUENCE= zg30
##.SOLVENT NAME= CDCl3
##.SHIFT REFERENCE= (INTERNAL, CDCl3, 0, 16.522)
##AUDIT TRAIL= $$ (NUMBER, WHEN, WHO, WHERE, WHAT)
$$ ##TITLE= Audit trail, XWIN-NMR		Version 3.5
$$ ##JCAMPDX= 5.01
$$ ##ORIGIN= Bruker BioSpin GmbH
$$ ##OWNER= nmr
$$ C:\u/data/dgb/nmr/ADRS/1900/pdata/1/auditp.txt
$$ ##AUDIT TRAIL=  $$ (NUMBER, WHEN, WHO, WHERE, WHAT)
(   1,<2006-08-30 11:29:23.65 +100>,<MAYBRIDGE\nmr>,<NMR_250MHZ>,
      <created by zg, POWCHK disabled, PULCHK disabled
       configuration hash MD5:
       E2 DF 36 D8 04 B2 41 60 5A D7 A3 38 5A 4B D0 FE
       data hash MD5: 64K
       DD 67 F7 4A 82 15 30 E1 CB 82 2A E7 EE 4F 8A 8B>)
(   2,<2006-08-30 11:29:39.53 +100>,<MAYBRIDGE\nmr>,<NMR_250MHZ>,
      <Start of raw data processing
       ef LB = 0.3 FT_mod = 6 PKNL = 1 SI = 32K 
       data hash MD5: 32K
       D1 10 F4 A5 A7 F1 8B 0D D5 85 79 5F 2D AC BB 39>)
(   3,<2006-08-30 11:29:41.23 +100>,<MAYBRIDGE\nmr>,<NMR_250MHZ>,
      <apk 
       data hash MD5: 32K
       09 62 AE 23 EE AB 23 7F F7 70 77 F1 21 D2 85 B1>)
(   4,<2006-08-30 11:29:42.00 +100>,<MAYBRIDGE\nmr>,<NMR_250MHZ>,
      <abs ABSG = 5 
       data hash MD5: 32K
       25 A2 93 B0 96 70 FD D7 05 CA 43 14 67 45 AA 1D>)
$$ ##END=
$$ 
$$ hash MD5
$$ 0E 91 DC A7 EB 9C 1C 19 BE FE DE 84 7B 1F F7 7B
##$RELAX= 
##$RELAX= 
##$RELAX= 
##$RELAX= 
##$RELAX= 
##$RELAX= 
##$RELAX= 
$$ Bruker specific parameters
$$ --------------------------
##$DU= <C:\u>
##$EXPNO= 1900
##$NAME= <ADRS>
##$PROCNO= 1
##$TYPE= <nmr>
##$USER= <dgb>
##$AMP= (0..31)
100 100 100 100 100 100 100 100 100 100 100 100 100 100 100 100 100 100 
100 100 100 100 100 100 100 100 100 100 100 100 100 100 
##$AQSEQ= 0
##$AQ_mod= 3
##$AUNM= <au_zg>
##$AUTOPOS= <17 >
##$BF1= 250.13
##$BF2= 250.13
##$BF3= 250.13
##$BF4= 250.13
##$BF5= 500.13
##$BF6= 500.13
##$BF7= 500.13
##$BF8= 500.13
##$BYTORDA= 1
##$CFDGTYP= 0
##$CFRGTYP= 5
##$CHEMSTR= <none>
##$CNST= (0..31)
1 1 145 1 1 1 1 1 1 1 1 1 1 1 1 1 1 1 1 1 1 1 1 1 1 1 1 1 1 1 1 1 
##$CPDPRG= <>
##$CPDPRG1= <>
##$CPDPRG2= <>
##$CPDPRG3= <>
##$CPDPRG4= <mlev>
##$CPDPRG5= <mlev>
##$CPDPRG6= <mlev>
##$CPDPRG7= <mlev>
##$CPDPRG8= <mlev>
##$CPDPRGB= <>
##$CPDPRGT= <>
##$D= (0..31)
0 1 0 0 0 0 0 0 0 0.06 0 0 0 0 0 0 0.0002 0 0 0 0 0 0 0 0 0 0 0 0 0 0 
0 
##$DATE= 1156933762
##$DBL= (0..7)
120 120 120 120 120 120 120 120 
##$DBP= (0..7)
150 150 150 150 150 150 150 150 
##$DBP07= 0
##$DBPNAM0= <>
##$DBPNAM1= <>
$$ [...]
##$SUBNAM7= <"">
##$SUBNAM8= <"">
##$SUBNAM9= <"">
##$SW= 20.6930455092707
##$SWIBOX= (0..15)
0 0 3 0 0 0 0 0 0 0 0 0 0 0 0 0 
##$SW_h= 5175.983436853
##$TD= 65536
##$TD0= 1
##$TE= 296.16
##$TE2= 300
##$TE3= 300
##$TEG= 300
##$TL= (0..7)
0 120 120 120 120 120 120 120 
##$TP= (0..7)
150 150 150 150 150 150 150 150 
##$TP07= 0
##$TPNAME0= <>
##$TPNAME1= <>
##$TPNAME2= <>
##$TPNAME3= <>
##$TPNAME4= <>
##$TPNAME5= <>
##$TPNAME6= <>
##$TPNAME7= <>
##$TPOAL= (0..7)
0.5 0.5 0.5 0.5 0.5 0.5 0.5 0.5 
##$TPOFFS= (0..7)
0 0 0 0 0 0 0 0 
##$TUNHIN= 0
##$TUNHOUT= 0
##$TUNXOUT= 0
##$USERA1= <user>
##$USERA2= <user>
##$USERA3= <user>
##$USERA4= <user>
##$USERA5= <user>
##$V9= 5
##$VALIST= <valist>
##$VCLIST= <CCCCCCCCCCCCCCC>
##$VD= 0
##$VDLIST= <DDDDDDDDDDDDDDD>
##$VPLIST= <PPPPPPPPPPPPPPP>
##$VTLIST= <TTTTTTTTTTTTTTT>
##$WBST= 1024
##$WBSW= 4
##$XGAIN= (0..3)
0 0 0 0 
##$XL= 0
##$YL= 0
##$YMAX_a= 329376
##$YMIN_a= -487227
##$ZGOPTNS= <>
##$ZL1= 120
##$ZL2= 120
##$ZL3= 120
##$ZL4= 120
##$ABSF1= 16.522
##$ABSF2= -4.171173
##$ABSG= 5
##$ABSL= 3
##$ALPHA= 0
##$AQORDER= 0
##$ASSFAC= 0
##$ASSFACI= 0
##$ASSFACX= 0
##$ASSWID= 0
##$AUNMP= <proc_1d>
##$AZFE= 0.1
##$AZFW= 0.1
##$BCFW= 0
##$BC_mod= 0
##$BYTORDP= 0
##$COROFFS= 0
##$CY= 12.5
##$DATMOD= 1
##$DC= 0
##$DFILT= <>
##$DTYPP= 0
##$F1P= 14.0000005364418
##$F2P= -0.99999901652339
##$FCOR= 0.5
##$FTSIZE= 32768
##$FT_mod= 6
##$GAMMA= 0
##$GB= 0
##$INTBC= 1
##$INTSCL= 1
##$ISEN= 128
##$LB= 0.3
##$LEV0= 0
##$LPBIN= 0
##$MAXI= 10000
##$MC2= 0
##$MEAN= 0
##$ME_mod= 0
##$MI= 0
##$NCOEF= 0
##$NC_proc= -4
##$NLEV= 6
##$NOISF1= 0
##$NOISF2= 0
##$NSP= 0
##$NTH_PI= 0
##$NZP= 0
##$OFFSET= 16.522
##$PC= 1
##$PHC0= 149.6219
##$PHC1= 5.344551
##$PH_mod= 1
##$PKNL= yes
##$PPARMOD= 0
##$PSCAL= 4
##$PSIGN= 0
##$REVERSE= no
##$SF= 250.13
##$SI= 32768
##$SIGF1= 0
##$SIGF2= 0
##$SINO= 400
##$SIOLD= 32768
##$SREGLST= <1H.CDCl3>
##$SSB= 0
##$STSI= 32768
##$STSR= 0
##$SW_p= 5175.98343685301
##$SYMM= 0
##$S_DEV= 0
##$TDeff= 65536
##$TDoff= 0
##$TI= <Analysis number 999999
Compound Code 99
Book Reference 9
Project Code 9>
##$TILT= no
##$TM1= 0
##$TM2= 0
##$TOPLEV= 0
##$USERP1= <user>
##$USERP2= <user>
##$USERP3= <user>
##$USERP4= <user>
##$USERP5= <user>
##$WDW= 1
##$XDIM= 32768
##$YMAX_p= 587097957
##$YMIN_p= -145222
$$ End of Bruker specific parameters
$$ ---------------------------------
##NTUPLES= NMR SPECTRUM
##VAR_NAME=  FREQUENCY,     SPECTRUM/REAL,   SPECTRUM/IMAG
##SYMBOL=    X,             R,               I
##VAR_TYPE=  INDEPENDENT,   DEPENDENT,       DEPENDENT
##VAR_FORM=  AFFN,          ASDF,            ASDF
##VAR_DIM=   32768,         32768,           32768
##UNITS=     HZ,            ARBITRARY UNITS, ARBITRARY UNITS
##FACTOR=    0.157963299565203, 1,           1
##FIRST=     4132.6476996994, 0,             0
##LAST=      -1043.33573715361, 0,           0
##MIN=       -1043.33573715361, -145222,     0
##MAX=       4132.6476996994, 587097957,     0
$$ Real data points
##PAGE= N=1
##DATA TABLE= (X++(R..R)), XYDATA
$$ [...]
$$ plain form
16274 3270 -30268 -68221 -52263 -56293 -38604 -15130 -38995 -47296 -47129 -60038 -42195 -30582 -6452
16261 -6452 13493 -32791 -40626 -48331 -69645 -64813 -68592 -84731 -51698 -16876 -10930 -27589 -42479
16248 -42479 -56379 -35098 -12585 -34689 -46492 -41222 -13869 5149 10191 -10855 -63490 -60498
16236 -60498 -48918 -24459 -9565 -9252 -41809 -52173 -73843 -53229 -26424 -21261 -6168 -39948
16224 -39948 -27420 -26983 -37567 -67553 -51974 -24820 -20360 -10068 37731 33475 352 -5089 24223
16211 24223 5701 -11502 1790 -6153 -2794 16682 -7178 -36087 -1611 20281 -5509 43227
16199 43227 29294 -49001 -66004 -25262 7669 -4967 -45415 -38348 -23494 -20673 -51389 -83921
16187 -83921 -73549 -58789 -22652 -25198 -39456 -42358 -48990 -67029 -62522 -30500 17670 23855 11674
$$ packed form
16274C270l3538l7953J5958m030J7689K3474k3865q301J67j2909J7843J1613K4130
16261f452J9945m6284p835p705k1314M832l779j6139L3033L4822N946j6659j4890
16248d2479j3900K1281K2513k2104j1803N270K7353J9018N042k1046n2635K992
16236f0498J1580K4459J4894L13l2557j0364k1670K0614K6805N163J5093l3780
16224c9948J2528M37j0584k9986J5579K7154M460J0292M7799m256l3123n441K9312
16211B4223j8522j7203J3292p943L359J9476k3860k8909L4476K1892k5790M8736
16199D3227j3933p8295j7003M0742L2931j2636m0448P067J4854K821l0716l2532
16187h3921J0372J4760L6137k546j4258k902o632j8039M507L2022M8170O185j2181
$$ plain form
16174 11674 -3486 -12792 -2346 -6220 7371 15992 1902 -11195 -39984 -28696 -2502 -5137
16162 -5137 229 24941 40927 50381 -5821 -30913 -16537 7675 16224 4057 -14382 -37596
16150 -37596 -36651 -20231 -26117 -12814 123 -55762 -105662 -99275 -57787 -10554 -38957 -65516
16138 -65516 -99965 -79039 -55903 -21474 25938 22781 -6713 -14378 -11663 -36274 -52939 -37301
16126 -37301 -15023 -19895 -36721 -54886 -63740 -76004 -49213 7107 1540 2654 19018 -2853
16114 -2853 -15786 -18525 -3977 51511 56149 25471 7381 7787 17240 45762 42012 29151 24763
16101 24763 -23359 -63035 -31605 -44032 -66872 -80483 -74984 -78887 -76803 -73018 -54661 -37802
16089 -37802 -14841 8799 27184 28394 67763 53937 -1262 -62231 -74076 -20962 -34669 -51041
$$ packed form
16174A1674j5160r306J0446l874J3591Q621j4090j3097k8789J1288K6194k635
16162e137N366K4712J5986R454n6202k5092J4376K4212Q549j2167j8439k3214
16150c7596R45J6420n886J3303J2937n5885m9900O387M1488M7233k8403k6559
16138f5516l4449K0926K3136L4429M7412l157k9494p665K715k4611j6665J5638
16126c7301K2278m872j6826j8165q854j2264K6791N6320n567J114J6364k1871
16114b853j2933k739J4548N5488M638l0678j8090M06R453K8522l750j2861m388
16101B4763m8122l9676L1430j2427k2840j3611N499l903K084L785J8357J6859
16089c7802K2961K3640J8385J210L9369j3826n5199o0969j1845N3114j3707j6372
$$ plain form
16077 -51041 -16735 -34700 -44197 -33749 6685 13730 1335 26886 27582 6000 22781 31001 14047
16064 14047 -39215 -62031 -12678 6036 2959 17968 8951 12016 14940 -412 -7644 -23481 -36252
16051 -36252 -76395 -87339 -65427 -51139 -69236 -70197 -74629 -28815 6541 -1112 25381 47257
16039 47257 60823 40578 33313 16446 17602 51966 65101 62606 68943 45405 17210 39412
16027 39412 1145 -4665 -16419 14467 17895 12720 23092 16213 43896 62488 77474 55316
16015 55316 5994 -7918 -9015 -16558 -27742 -14684 4222 36420 71773 44624 5060 -27958
16003 -27958 -16097 -7673 4672 -32936 -54152 -17702 -16705 -48963 -67717 -60166 -61025 -22624 -6649
15990 -6649 -23537 -20549 -11545 22535 48346 22316 -14199 -32111 -26029 -48252 -33375 -20200
$$ packed form
16077e1041L4306j7965r497J0448M0434P045j2395K5551O96k1582J6781Q220j6954
16064A4047n3262k2816M9353J8714l077J5009r017L065K924j5352p232j5837j2771
16051c6252m0143j0944K1912J4288j8097r61m432M5814L5356p653K6493K1876
16039D7257J3566k0245p265j6867J156L4364J3135k495O337k3538k8195K2202
16027C9412l8267n810j1754L0886L428n175J0372o879K7683J8592J4986k2158
16015E5316m9322j3912j097p543j1184J3058J8906L2198L5353k7149l9564l3018
16003b7958J1861Q424J2345l7608k1216L6450R97l2258j8754P551q59L8401J5975
15990f649j6888K988R004L4080K5811k6030l6515j7912O082k2223J4877J3175
$$ plain form
15978 -20200 -36230 -55300 -31537 -22966 -5464 -5557 -12371 9465 5680 14523 -6167 24571 40556
15965 40556 43687 546 -43475 -24951 23095 56736 40045 18728 26109 31953 39495 24186
15953 24186 18545 33486 66397 51472 15846 -8754 -25381 -63874 -47850 -15954 -41799 -24357
15941 -24357 15769 2687 -22574 -33330 -38264 -19622 60519 67453 51477 53801 51495 10452
15929 10452 -21535 -11206 22167 35835 17478 -26084 -8972 4479 26128 14203 -10716 -13352
15917 -13352 -60199 -76146 9216 31632 57398 43820 34483 33114 36852 -2891 -21091 -46102
15905 -46102 -81957 -33513 -10498 8914 -5419 -27429 -14587 -34163 -26972 10792 -33076 -66743
15893 -66743 -82986 -61863 -29618 -46718 -60375 -94000 -98899 -84790 -53651 -65812 -61044 -24147
$$ packed form
15978b0200j6030j9070K3763Q571J7502r3o814K1836l785Q843k0690L0738J5985
15965D0556L131m3141m4021J8524M8046L3641j6691k1317P381N844P542j5309
15953B4186n641J4941L2911j4925l5626k4600j6627l8493J6024L1896k5845J7442
15941b4357M0126j3082k5261j0756m934J8642Q0141O934j5976K324k306m1043
15929A0452l1987J0329L3373J3668j8357m3562J7112J3451K1649j1925k4919k636
15917a3352m6847j5947Q5362K2416K5766j3578r337j369L738l9743j8200k5011
15905d6102l5855M8444K3015J9412j4333k2010J2842j9576P191L7764m3868l3667
15893f6743j6243K1123L2245j7100j3657l3625m899J4109L1139j2161M768L6897
$$ plain form
15881 -24147 -3800 -12389 -2618 31792 33501 3800 -27667 -38552 -37981 -65113 -80568 -73023 -49160
15868 -49160 -9762 -26874 -57783 -51457 -42446 -6794 -20789 -66041 -49552 -37298 -13479 -30934
15856 -30934 -22708 -8236 5024 13893 704 -10114 -8048 -12926 -44127 -9780 44616 69092
15844 69092 54294 27072 8853 -25177 -76274 -70577 -74848 -80111 -44908 -11931 -19398 -27165 -13555
15831 -13555 -48605 -59691 -17577 10265 24553 5436 32904 24119 6723 9843 -2741 -7883
15819 -7883 -3910 -39087 -6496 10533 -31095 -20213 -47453 -50701 -27101 -41683 -48247 -41928 9055
15806 9055 13998 -10554 -29309 -25063 -13435 -10014 28641 35867 24889 5542 -16058 -11928 -4851
15793 -4851 21694 12793 -6653 -7040 2964 50517 51315 17540 9076 -22367 -45693 -34487 -5191
$$ packed form
15881b4147K0347q589R771L4410J709k9701l1467j0885N71k7132j5455P545K3863
15868d9160L9398j7112l0909O326R011L5652j3995m5252J6489J2254K3819j7455
15856c0934Q226J4472J3260Q869j3189j0818K066m878l1201L4347N4396K4476
15844F9092j4798k7222j8219l4030n1097N697m271n263L5203L2977p467p767J3610
15831a3555l5050j1086M2114K7842J4288j9117K7468q785j7396L120j2584n142
15819g883L973l5177L2591J7029m1628J0882k7240l248K3600j4582o564O319N0983
15806I055M943k4552j8755M246J1628L421L8655P226j0978j9347k1600M130P077
15793d851K6545q901j9446l87J0004M7553P98l3775q464l1443k3326J1206K9296
$$ plain form
15780 -5191 837 -3306 2501 -13110 -35597 -53955 -22987 -21 14770 5639 -6994 -5914 3563
15767 3563 29359 19641 32631 66964 25357 -64584 -54940 -32078 -6761 -17886 -569 -22541
15755 -22541 -43786 -65886 -47526 -34083 -35115 -46221 -29941 -19153 -21590 -12297 -12203 -16745 -3923
15742 -3923 -7996 6246 -1363 39310 32430 -3796 -54685 -46941 -27579 19092 54452 31969 -46414
15729 -46414 -110305 -109601 -58579 -22964 -12685 -15969 -27993 -34448 -41098 -22378 -10639 29919 23596
15716 23596 -21388 -52155 -55687 -26778 8987 25612 20199 6795 -13237 -42580 -22082 -17636
15704 -17636 -15605 7070 -10575 -25180 -62698 -43478 -31815 -23268 -579 7346 -19416 -90099
15692 -90099 -81962 -42367 -27233 8717 29924 16026 22922 51429 52068 31691 17669 2772
$$ packed form
15780e191O028m143N807j5611k2487j8358L0968K2966J4791r131j2633J080R477
15767C563K5796r718J2990L4333m1607q9941R644K2862K5317j1125J7317k1972
15755b2541k1245k2100J8360J3443j032j1106J6280J0788k437R293R4m542J2822
15742c923m073J4242p609M0673o880l6226n0889P744J9362M6671L5360k2483p8383
15729d6414o3891P04N1022L5615J0279l284j2024o455o650J8720J1739M0558o323
15716B3596m4984l0767l532K8909L5765J6625n413j3404k0032k9343K0498M446
15704a7636K031K2675j7645j4605l7518J9220J1663Q547K2689P925k6762p0683
15692i0099Q137L9595J5134L5950K1207j3898O896K8507O39k0377j4022j4897
$$ plain form
15680 2772 -105 -19016 -68872 -51653 -13903 5382 25395 1249 -48780 -30508 -3502 599
15668 599 23629 -615 -1613 35668 42308 4082 1675 33052 23510 8672 -12688 -31438 -24894
15655 -24894 32794 80486 47018 8134 -24502 -7142 18335 21731 14023 -5000 -6684 36994
15643 36994 8881 -10646 3415 39922 63668 15139 2252 820 6621 -15050 -16359 -46188
15631 -46188 -58989 -84718 -43079 -26592 -35458 14281 14459 13115 54868 67914 42642 7717
15619 7717 23766 36822 -3901 -14972 -27537 -17291 4514 -279 -20260 -33073 -18349 12406
15607 12406 47724 58831 -1229 -26496 -17605 39911 50431 64168 80654 15392 -29165 -43635
15595 -43635 -15655 -19722 -72967 -64093 -32320 6436 35028 38990 19950 -4358 -10045 -15377 15714
$$ packed form
15680B772k877j8911m9856J7219L7750J9285K0013k4146n0029J8272K7006M101
15668E99K3030k4244r98L7281O640l8226k407L1377r542j4838k1360j8750O544
15655b4894N7688M7692l3468l8884l2636J7360K5477L396p708j9023j684M3678
15643C6994k8113j9527J4061L6507K3746m8529j2887j432N801k1671j309k9829
15631d6188j2801k5729M1639J6487q866M9739J78j344M1753J3046k5272l4925
15619G717J6049J3056m0723j1071j2565J0246K1805m793j9981j2813J4724L0755
15607A2406L5318J1107o0060k5267Q891N7516J0520J3737J6486o5262m4557j4470
15595d3635K7980m067n3245Q874L1773L8756K8592L962j9040k4308n687n332L1091
$$ plain form
15582 15714 27380 23561 1137 11770 -12202 -12798 -11748 -13854 20258 40152 30448 -8150 -11365
15569 -11365 12023 -2695 23919 29868 510 3418 -25399 -25463 -25425 -5419 4399 718 -8438 -592
15555 -592 -6984 -17321 -31010 -48674 -38179 -36957 -15153 -4586 -43235 -65791 -49224 -32680
15543 -32680 -30853 -30652 -62802 -21641 -29266 -24797 -32834 -66439 -37973 -4596 -6566 3879 10588
15530 10588 -3565 -24638 -48055 -51061 -63578 -23293 29021 28102 13884 3596 29716 28757 34123
15517 34123 19142 -3022 -10780 15841 -7103 -3779 -14325 -34527 -83172 -93155 -69181 -22608
15505 -22608 -5312 -9113 -28215 -30672 -9272 -44073 -24709 -6348 31805 -7249 -26740 -45907
15493 -45907 -64596 -54886 -18363 -14232 -5890 6502 27140 29486 -3176 28418 34461 34651 51485
$$ packed form
15582A5714J1666l819k2424J0633k3972n96J050k106L4112J9894r704l8598l215
15569a1365K3388j4718K6614N949k9358K908k8817o4L8K0006R818l681r156P846
15555e92o392j0337j3689j7664J0495J222K1804J0567l8649k2556J6567J6544
15543c2680J827K01l2150M1161p625M469q037l3605K8466L3377j970J0445O709
15530A0588j4153k1073k3417l006j2517M0285N2314r19j4218j0288K6120r59N366
15517C4123j4981k2164p758K6621k2944L324j0546k0202m8645r983K3974M6573
15505b2608J7296l801j9102k457K1400l4801J9364J8361L8153l9054j9491j9167
15493d5907j8689R710L6523M131Q342J2392K0638K346l2662L1594O043J90J6834
$$ plain form
15480 51485 54703 22146 13148 18864 19355 38278 33327 4587 -34534 -55579 -37898 -16090 -13436
15467 -13436 -15223 -41826 -39805 -2365 -15820 -30689 -19959 -5284 16087 10610 -30077 -18617
15455 -18617 3817 51775 128747 156045 131210 118998 120923 138227 145000 206825 249640 204401
15443 204401 167368 118106 90630 122061 121173 70332 42607 56060 65162 76087 79830 61748
15431 61748 34422 23074 5064 -30130 -22963 28260 25893 6262 6730 13337 22093 33760 35439
15418 35439 11723 -7394 -42149 -51219 -44870 -24766 -37582 -24848 33461 43725 27047 29142
15406 29142 24159 18438 43000 59952 65150 36021 -4838 -16395 -57648 -65272 -20905 11159
15394 11159 21094 2894 -6709 7866 -14830 -15483 28584 80753 109713 60353 4841 -16041
$$ packed form
15480E1485L218l2557q998N716M91J8923m951k8740l9121k1045J7681K1808K654
15467a3436j787k6603K021L7440j3455j4869J0730J4675K1371n477m0687J1460
15455a8617K2434M7958P6972K7298k4835j2212J925J7304O773O1825M2815m5239
15443B04401l7033m9262k7476L1431q88n0841k7725J3453R102J0925L743j8082
15431F1748k7326j1348j8010l5194P167N1223k367j9631M68O607Q756J1667J679
15418C5439k3716j9117l4755r070O349K0104j2816J2734N8309J0264j6678K095
15406B9142m983n721K4562J6952N198k9129m0859j1557m1253p624M4367L2064
15394A1159R935j8200r603J4575k2696o53M4067N2169K8960m9360n5512k0882
$$ plain form
15382 -16041 -22703 -18617 52231 59700 14875 6436 32708 36010 6472 -27134 -23075 18641 -192
15369 -192 -16397 -28077 -27911 -32274 -32964 -62943 -87000 -60060 6538 28754 49961 16648 8432
15356 8432 1056 -13469 -46766 -12293 -21267 -37856 -51106 -67373 -46523 -58197 -19299 24344
15344 24344 5349 -23943 -40394 -20426 80 23312 8232 -21932 -22124 -17652 9809 -15737
15332 -15737 -8530 -17382 -14097 -9558 -22617 -33819 -16549 270 -1093 12722 41569 36218 -1571
15319 -1571 -41755 -40781 -25948 -50957 -38166 -13249 -16767 25505 30592 21662 18984 -2533 -16351
15306 -16351 5869 4780 -4024 -5403 30715 22513 -4604 -28493 -2220 -16711 -56216 -88199
15294 -88199 -56178 -37076 -11188 -10917 13153 33886 1602 -7229 -22096 -41367 -58361 -18761
$$ packed form
15382a6041o662M086P0848P469m4825q439K6272L302k9538l3606M059M1716j8833
15369a92j6205j1680J66m363o90k9979k4057K6940O6598K2216K1207l3313q216
15356H432p376j4525l3297L4473q974j6589j3250j6267K0850j1674L8898M3643
15344B4344j8995k9292j6451J9968K0506K3232j5080l0164j92M472K7461k5546
15332a5737P207q852L285M539j3059j1202J7270J6819j363J3815K8847n351l7789
15319a571m0184R74J4833k5009J2791K4917l518M2272N087q930k678k1517j3818
15306a6351K2220j089q804j379L6118q202k7117k3889K6273j4491l9505l1983
15294h8199L2021J9102K5888K71K4070K0733l2284q831j4867j9271j6994L9600
$$ plain form
15282 -18761 4505 24032 21808 -12334 20941 30693 41694 3461 3827 26164 9510 11587 -5127
15269 -5127 -31385 -45491 -24932 -12282 -35955 -26618 -11056 9234 -27881 -23963 2783 -32141
15257 -32141 -48585 -39578 -53269 -43005 -8427 1650 -12588 19 -889 -38167 -52192 -78365
15245 -78365 -85294 -70419 -69681 -11880 6454 -28073 -40426 -37389 -23301 -16977 -10917 -11203 -11117 -12743
15231 -12743 19634 4840 -10766 -34775 -38112 -18416 15909 23013 20348 24894 2112 -15403
15219 -15403 -20075 -16760 -19585 -39033 -19644 6854 -12009 -42259 -57676 -22008 7794 38347
15207 38347 -9270 -27755 7624 -10128 -9805 11140 31265 34418 7931 5904 21385 -6520
15195 -6520 -49937 -70072 -27607 -14768 5778 7247 6293 1109 11028 -10210 -17172 -35785 -24444
$$ packed form
15282a8761K3266J9527k224l4142L3275R752J1001l8233L66K2337j6654K077j6714
15269e127k6258j4106K0559J2650k3673R337J5562K0290l7115L918K6746l4924
15257c2141j6444R007j3691J0264L4578J0077j4238J2607r08l7278j4025k6173
15245g8365o929J4875P38N7801J8334l4527j2353L037J4088O324O060k86Q6j626
15231a2743L2377j4794j5606k4009l337J9696L4325P104k665M546k2782j7515
15219a5403m672L315k825j9448J9389K6498j8863l0250j5417L5668K9802L0553
15207C8347m7617j8485L5379j7752L23K0945K0125L153k6487k027J5481k7905
15195f520m3417k0135M2465J2839K0546J469r54n184R919k1238o962j8613J1341
$$ plain form
15182 -24444 -2001 -10740 -31701 -28856 -50260 -37836 -33054 -45688 -42379 -40672 -58049 -43102 -45462
15169 -45462 -48689 -41578 5571 22994 -11796 -18255 -29413 -8921 -30724 -3047 7806 9878
15157 9878 -6123 -48709 -103043 -132147 -89714 -56215 -46574 -54994 -92203 -63703 -20879 -16432
15145 -16432 -30242 -15453 1930 -17070 -26600 -18913 25636 33028 -3585 -31511 -78663 -84889
15133 -84889 -73418 -67311 -72431 -83880 -130269 -111270 -52657 -38671 -10487 -14545 -12823 -15216 -40540
15120 -40540 -61713 -33945 -38691 -53534 -73707 -55541 201 6602 22266 9093 -254 -48091
15108 -48091 -108568 -66291 -19782 -21629 -49694 -37737 -38001 7239 24976 18041 -4688 -45122
15096 -45122 -54078 -36031 -51091 -42215 -35245 -32779 -22426 -6023 -13169 -48112 -70334 -74806 -62579
$$ packed form
15182b4444K2443q739k0961K845k1404J2424M782j2634L309J707j7377J4947k360
15169d5462l227P111M7149J7423l4790o459j1158K0492k1803K7677J0853K072
15157I878j6001m2586n4334k9104M2433L3499R641q420l7209K8500M2824M447
15145a6432j3810J4789J7383j9000r530P687M4549P392l6613k7926m7152o226
15133h4889J1471O107n120j1449m6389J8999N8613J3986K8184m058J722k393k5324
15120d0540k1173K7768m746j4843k0173J8166N5742O401J5664j3173r347m7837
15108d8091o0477M2277M6509j847k8065J1957k64M5240J7737o935k2729m0434
15096d5122q956J8047j5060Q876O970K466J0353J6403p146l4943k2222m472J2227
$$ plain form
15083 -62579 -34833 -52859 -24963 1774 -27500 -43966 -19959 -40531 -43830 -10211 7583 10760
15071 10760 6280 3942 29565 56810 54031 21499 24019 27360 23224 23032 18280 -7641 -38758
15058 -38758 -42196 -36591 -29458 -12296 -1120 -29938 -71540 -82071 -50130 -1594 16970 -2312
15046 -2312 25944 46254 16322 -22898 -54970 -70026 -60188 -41875 -12083 15012 13268 -12914
15034 -12914 -26786 -42190 -34678 -25274 20122 24690 -6803 21793 53567 40686 27373 -19955
15022 -19955 13391 33415 31379 29467 59708 63084 40866 7568 10563 26790 -4124 -16068
15010 -16068 8564 36588 8266 -17709 -18343 -31251 -70480 -78472 -64746 -39806 -32708 8717
14998 8717 21138 20498 -5002 -11195 8540 23127 -43460 -44758 -27647 -22749 11303 21084 16789
$$ packed form
15083f2579K7746j8026K7896K6737k9274j6466K4007k0572l299L3619J7794L177
15071A0760m480k338K5623K7245k779l2532K520L341m136j92m752k5921l1117
15058c8758l438N605P133J7162J1176k8818m1602j0531L1941M8536J8564j9282
15046b312K8256K0310k9932l9220l2072j5056R838J8313K9792K7095j744k6182
15034a2914j3872j5404P512R404M5396M568l1493K8596L1774j2881j3313m7328
15022a9955L3346K0024k036j912L0241L376k2218l3298K995J6227l0914j1944
15010a6068K4632K8024k8322k5975o34j2908l9229p992J3726K4940P098M1425
14998H717J2421o40k5500o193J9735J4587o6587j298J7111M898L4052R781m295
$$ plain form
14985 16789 11627 -47764 -58499 -2004 -22562 -28155 -6128 37557 58550 32925 26350 47827
14973 47827 27239 -2952 -9106 -1984 -1707 -13259 -31339 -31533 -17348 -9739 -12047 5664 -1249
14960 -1249 1940 -21404 -66467 -107972 -78446 -44502 -53913 -56813 -44472 -24419 10703 -2107
14948 -2107 -1123 -25143 -23421 -51248 -47688 -52018 -68309 -40325 -4608 -93 19035 3341 728
14935 728 31958 -5528 -35218 -53475 -67609 -15200 -7065 -21063 -20372 -3430 -6770 -35148 -57426
14922 -57426 -18549 -5283 1557 -27030 -29484 -27255 6910 34853 21511 -2068 729 15250
14910 15250 10584 34919 1867 -46721 -48853 -20250 -34127 -6245 28910 -7600 2786 7097
14898 7097 22405 10643 -12949 -35496 15850 25199 -964 -16508 -1809 20973 11525 23968
$$ packed form
14985A6789n162n9391j0735N6495k0558n593K2027M3685K0993k5625o575K1477
14973D7827k0588l0191o154P122K77j1552j8080j94J4185P609k308J7711o913
14960a249L189k3344m5063m1505K9526L3944r411k900J2341K0053L5122j2810
14948b107R84k4020J722k7827L560m330j6291K7984L5717M515J9128j5694k613
14935G28L1230l7486k9690j8257j4134N2409Q135j3998O91J6942l340k8378k2278
14922e7426L8877J3266O840k8587k454K229L4165K7943j3342k3579K797J4521
14910A5250m666K4335l3052m8588k132K8603j3877K7882L5155l6510J0386M311
14898G097J5308j1762k3592k2547N1346R349k6163j5544J4699K2782r448J2443
$$ plain form
14886 23968 36964 36478 25990 -26266 -34530 -37675 1793 5867 -3202 14844 26752 22523 19595
14873 19595 61436 57840 46446 7897 -15641 -2203 -14282 -4987 37545 59780 38907 45417
14861 45417 9723 -15831 -45376 -67651 -74502 -76052 -88231 -68253 -36856 -21723 -10838 -39911
14849 -39911 -43367 -5396 41324 49282 69343 65957 69981 60089 30949 14433 11030 -4863 -9606
14836 -9606 9755 6525 2948 -12549 1106 -18194 -63980 -73723 -64093 -52108 -33474 33297 55140
14823 55140 45186 14275 39341 8336 -21492 -4741 28415 -11347 7703 22466 34935 30499
14811 30499 -4519 -27323 -23112 -36386 -2608 -13711 -9628 -6481 27816 13675 1280 23418
14799 23418 4063 -11537 13290 52340 18696 3630 -29357 -35911 -33912 22136 55795 73911
$$ packed form
14886B3968J2996m86j0488n2256q264l145L9468M074r069J8046J1908m229k928
14873A9595M1841l596j1394l8549k3538J3438j2079R295M2532K2235k0873O510
14861D5417l5694k5554k9545k2275o851j550j2179J9978L1397J5133J0885k9073
14849c9911l456L7971M6720P958K0061l386M024r892k9140j6516l403j5893m743
14836i606J9361l230l577j5497J3655j9300m5786r743R630J1985J8634O6771K1843
14823E5140r954l0911K5066l1005k9828J6751L3156l9762J9050J4763J2469m436
14811C0499l5018k2804M211j3274L3778j1103M083L147L4297j4141j2395K2138
14799B3418j9355j5600K4827L9050l3644j5066l2987o554J999N6048L3659J8116
$$ plain form
14787 73911 40949 14338 8361 -6084 14580 44772 9061 12020 22178 -32620 -29235 2920
14775 2920 -17375 -41059 -44716 -67371 -74055 -46911 -44092 -26189 24798 41906 10335 5525 -42921
14762 -42921 -30862 23277 56164 32309 12609 8495 -5216 -29502 -41195 -53108 -39200 -9160
14750 -9160 -14303 -80003 -68621 -71651 -61543 -41039 -42044 -59587 -37985 -7650 -21417 -24915 -25217
14737 -25217 -20231 -27527 4177 11425 -4621 -34752 -50073 -63368 -35707 -37761 -57314 -34574
14725 -34574 -11108 -2906 5598 -15020 -4734 -49218 -66105 -37312 -72375 -76878 -81314 -43027
14713 -43027 22886 10578 23049 21523 -16519 -3095 61342 85672 57779 26761 -1369 -5122
14701 -5122 -33679 -45185 -49420 -34440 -9966 16993 8847 -26847 -52221 -79349 -66527 -55650
$$ packed form
14787G3911l2962k6611n977j4445K0664L0192l5711K959J0158n4798L385L2155
14775B920k0295k3684l657k2655o684K7144K819J7903N0987J7108l1571m810m8446
14762d2921J2059N4139L2887k3855j9700m114j3711k4286j1693j1913J3908L0040
14750i160n143o5700J1382l030J0108K0504j005j7543K1602L0335j3767l498l02
14737b5217M986p296L1704P248j6046l0131j5321j3295K7661k054j9553K2740
14725c4574K3466Q202Q504k0618J0286m4484j6887K8793l5063m503m436L8287
14713d3027O5913j2308J2471j526l8042J3424O4437K4330k7893l1018k8130l753
14701e122k8557j1506m235J4980K4474K6959q146l5694k5374k7128J2822J0877
$$ plain form
14689 -55650 -7875 34844 12543 5002 4390 7370 29492 40383 22416 8838 19878 34157
14677 34157 33133 3640 31178 45357 13362 35059 82621 106306 99745 90229 69343 42168
14665 42168 24594 16524 -7940 28982 4776 5744 -829 -24432 2713 23355 2231 -14412
14653 -14412 -1201 24573 13861 18695 62555 74095 30488 -19454 -69769 -50288 -14483 9323
14641 9323 20555 10470 34745 -13951 -38908 -24080 -25233 -12774 21858 15680 -9611 -8773 -22126
14628 -22126 -8089 -6577 -7733 583 -278 -5357 -14201 -27409 -19664 -49304 -57017 -9960 36248
14615 36248 30946 25431 24530 34270 2793 -66461 -71117 -61820 -35189 -3128 -19154 -36165 -65143
14602 -65143 -44101 -22799 -13945 -43728 -82337 -84876 -39146 -27186 -29452 -21042 -20402 -25603 -15851
$$ packed form
14689e5650M7775M2719k2301p541o12K980K2122J0891j7967j3578J1040J4279
14677C4157j024k9493K7538J4179l1995K1697M7562K3685o561r516k0886k7175
14665D2168j7574q070k4464L6922k4206R68o573k3603K7145K0642k1124j6643
14653a4412J3211K5774j0712M834M3860J1540m3607m9942n0315J9481L5805K3806
14641I323J1232j0085K4275m8696k4957J4828j153J2459L4632o178k5291Q38j3353
14628b2126J4037J512j156Q316q61n079q844j3208P745k9640p713M7057M6208
14615C6248n302n515r01R740l1477o9254m656R297K6631L2061j6026j7011k8978
14602f5143K1042K1302Q854k9783l8609k539M5730J1960k266Q410O40n201R752
$$ plain form
14589 -15851 24563 46588 24308 5813 4087 -26565 -74448 -91449 -88757 -66114 -51931 -61913
14577 -61913 -108405 -90191 -58562 -9738 21815 14028 -10553 -21639 -44204 -68940 -60641 -62905
14565 -62905 -86779 -65803 -46206 -54531 -15796 17066 40163 54729 5757 -34350 3975 36162
14553 36162 36936 33600 64913 49526 49000 52505 55289 26453 25350 7965 -13698 -50640 -55253
14540 -55253 -49251 1822 29592 -15073 -9141 14268 46430 50991 18461 -41518 -70045 -35559
14528 -35559 15149 -3776 -43943 -45095 -24387 -9044 9940 37798 69968 80358 61302 31264
14516 31264 -10055 -40708 -23375 -5539 7973 12441 -5434 -10532 -35635 -24947 -29877 -21083
14504 -21083 10043 37568 51201 32279 -9953 -48538 -11720 8313 44592 45010 -2249 -10130
$$ packed form
14589a5851M0414K2025k2280j8495j726l0652m7883j7001K692K2643J4183r982
14577f1913m6492J8214L1629M8824L1553p787k4581j1086k2565k4736Q299k264
14565f2905k3874K0976J9597q325L8735L2862K3097J4566m8972m0107L8325L2187
14553C6162P74l336L1313j5387n26L505K784k8836j103j7385k1663l6942m613
14540e5253O002N1073K7770m4665N932K3409L2162M561l2530n9979k8527L4486
14528c5559N0708j8925m0167j152K0708J5343J8984K7858L2170J0390j9056l0038
14516C1264m1319l0653J7333J7836J3512M468j7875n098k5103J0688m930Q794
14504b1083L1126K7525J3633j8922m2232l8585L6818K0033L6279M18m7259p881
$$ plain form
14492 -10130 -11234 -18022 -18585 4608 -33704 -40555 -2680 696 -9043 9686 33007 56251 30192
14479 30192 -3408 -16788 -10934 7323 11899 20662 -17094 -10549 3305 -10658 -2320 15675 3235
14466 3235 -32588 -31595 -10778 2351 31484 37008 17791 -15201 -38775 -16092 22599 39977
14454 39977 38585 42299 19335 -14373 -8937 22690 25814 41400 1768 -47826 -46554 -19853 -1814
14441 -1814 6508 13800 31200 43841 32743 -23430 -4934 20300 9925 -7872 17541 -3111
14429 -3111 9603 29767 21190 7185 -3481 -5151 3742 53851 58251 58185 28837 33937 40395 83759
14415 83759 99886 57574 28871 15469 -42890 -50225 -42982 -48886 -49487 -12894 42945 34989 34821
14402 34821 27029 18057 31109 29956 41286 11636 -64142 -89079 -59794 19448 4458 172
$$ packed form
14492a0130j104o788n63K3193l8312o851L7875L376r739J8729K3321K3244k6059
14479C0192l3600j3380N854J8257M576Q763l7756O545J3854j3963Q338J7995j2440
14466C235l5823R93K0817J3129K9133N524j9217l2992k3574K2683L8691J7378
14454C9977j392L714k2964l3708N436L1627L124J5586l9632m9594J272K6701J8039
14441a814Q322P292J7400J2641j1098n6173J8496K5234j0375j7797K5413k0652
14429c111J2714K0164q577j4005j0666j670Q893N0109M400o6k9348N100O458M3364
14415H3759J6127m2312k8703j3402n8359p335P243n904o01L6593N5839p956j68
14402C4821p792q972J3052j153J1330k9650p5778k4937K9285P9242j4990m286
$$ plain form
14390 172 14616 41531 54974 61398 58827 30897 10916 9086 19179 21528 5442 -26221 -57745
14377 -57745 -23462 34081 38115 13318 10847 -16898 -1064 -1353 -12352 -12627 18868 26634 -2277
14364 -2277 -7547 -57152 -55735 -12569 28118 18815 -7685 -17904 12806 13209 -1685 25634 42909
14351 42909 52360 31217 -7636 -43117 -24053 69816 115674 93765 36751 54452 76547 77409
14339 77409 22750 17223 36887 31143 15292 -1951 14471 50307 70975 44448 49815 72305
14327 72305 72895 28530 1679 18055 51482 41635 47920 38133 15879 4221 3061 27692 13361
14314 13361 12183 -4843 17477 55170 41696 1592 -4163 -6175 -5712 11073 45588 45994 36513
14301 36513 32820 30953 33356 41606 63848 87773 63003 26584 20851 61283 69994 76007 92706
$$ packed form
14390A72J4444K6915J3443O424k571k7930j9981j830J0093K349j6086l1663l1524
14377e7745L4283N7543M034k4797k471k7745J5834k89j0999k75L1495P766k8911
14364b277n270m9605J417M3166M0687r303k6500j0219L0710M03j4894K7319J7275
14351D2909R451k1143l8853l5481J9064R3869M5858k1909n7014J7701K2095Q62
14339G7409n4659n527J9664n744j5851j7243J6422L5836K0668k6527N367K2490
14327G2305N90m4365k6851J6376L3427r847O285r787k2254j1658j160K4631j4331
14314A3361j178j7026K2320L7693j3474m0104n755k012M63J6785L4515M06r481
14301C6513l693j867K403Q250K2242K3925k4770l6419n733M0432Q711O013J6699
$$ plain form
14288 92706 94833 86544 63858 46855 43292 19476 11481 -4614 20130 40609 54151 58845 78335
14275 78335 107299 114907 78698 49886 22640 35774 69848 84795 80314 39550 5183 37399
14263 37399 24294 68266 98372 75050 80957 100537 94573 67013 73373 104241 139437 142908
14251 142908 112496 81964 94891 79875 100446 116151 108370 104498 107051 95484 98220 128461
14239 128461 134236 125649 105397 134047 199335 243410 230246 224810 274490 303243 311013 281675
14227 281675 284701 315931 302321 330772 355946 380805 415764 491768 546098 600492 656226 707560
14215 707560 804018 928047 1089394 1252042 1464622 1727623 2086280 2623337 3413958 4605606
14205 4605606 6203117 7842379 9001326 9418272 9401466 9494834 10017943 10715237 11018420
$$ packed form
14288I2706K127q289k2686j7003l563k3816p995j6095K4744K0479J3542M694J9490
14275G8335K8964P608l6209k8812k7246J3134L4074J4947m481m0764l4367L2216
14263C7399j3105M3972L0106k3322N907J9580n964k7560O360L0868L5196L471
14251A42908l0412l0532J2927j5016K0571J5705p781l872K553j1567K736L0241
14239A28461N775q587k0252K8650O5288M4075j3164n436M9680K8753P770k9338
14227B81675L026L1230j3610K8451K5174K4859L4959P6004N4330N4394N5734N1334
14215G07560R6458J24029J61347J62648K12580K63001L58657N37057P90621J191648
14205D605606J597511J639262J158947M16946j6806R3368N23109O97294L03183
$$ plain form
14196 11018420 10539363 9405913 8112535 6992387 6090889 5347787 4714324 4153099 3684264
14187 3684264 3342544 3056382 2742008 2494675 2323996 2165940 2008959 1870242 1749411
14178 1749411 1620908 1504485 1443744 1367587 1284028 1203684 1118886 1073753 1053696 1024130 976471
14167 976471 923149 901880 879187 835817 806094 802947 803746 771536 743484 763674 738205 692906
14155 692906 708980 710970 687104 642868 606933 577454 561461 507203 509594 529941 556481 493572
14143 493572 426768 399599 369363 413158 434578 411347 415499 425951 409495 395288 419455 424658
14131 424658 407253 379401 352783 349442 360383 370920 361963 367526 365944 382266 402326 397713
14119 397713 389986 372533 359911 362412 375226 376515 334867 270653 243693 250661 271551 292417
$$ packed form
14196A1018420m79057j133450j293378j120148r01498p43102o33463n61225m68835
14187C684264l41720k86162l14374k47333j70679j58056j56981j38717j20831
14178A749411j28503j16423o0741p6157q3559q0344q4798m5133k0057k9566m7659
14167I76471n3322k1269k2693m3370k9723l147P99l2210k8052K0190k5469m5299
14155F92906J6074J990k3866m4236l5935k9479j5993n4258K391K0347K6540o2909
14143D93572o6804k7169l0236M3795K1420k3231M152J0452j6456j4207K4167N203
14131D24658j7405k7852k6618l341J0941J0537q957N563j582J6322K0060m613
14119C97713p727j7453j2622K501J2814J289m1648o4214k6960O968K0890K0866
$$ plain form
14107 292417 252253 211570 210130 212322 248030 271605 276276 287692 289064 280993 283188 267864 243559
14094 243559 247716 272934 269721 220651 194446 167248 195865 199772 223242 214275 239954 219454
14082 219454 197938 185307 177308 197522 214873 243547 232138 224318 254798 215961 210789 206528
14070 206528 199348 226832 210343 181683 213032 214267 179249 190420 201534 212085 224756 194173
14058 194173 193582 208453 201931 201878 193410 177703 147275 169642 222528 273290 250583 244358 192534
14045 192534 159131 160078 136507 157648 206881 217475 210290 233197 262987 222816 183354 183805
14033 183805 140268 138044 162611 153248 146530 147235 170608 206752 196167 168993 134235 194101
14021 194101 247446 251418 233242 216395 210524 187780 136614 124674 140768 148656 170773 201762
$$ packed form
14107B92417m0164m0683j440K192L5708K3575M671J1416J372q071K195j5324k4305
14094B43559M157K5218l213m9070k6205k7198K8617L907K3470q967K5679k0500
14082B19454k1516j2631p999K0214J7351K8674j1409p820L0480l8837n172m261
14070B06528p180K7484j6489k8660L1349J235l5018J1171J1114J0551J2671l0583
14058A94173n91J4871o522n3q468j5707l0428K2367N2886N0762k2707o225n1824
14045A92534l3403R47k3571K1141M9233J0594p185K2907K9790m0171l9462M51
14033A83805m3537k224K4567r363o718P05K3373L6144j0585k7174l4758N9866
14021A94101N3345L972j8176j6847n871k2744n1166j1940J6094P888K2117L0989
$$ plain form
14009 201762 201042 195187 167208 122697 72268 76410 94463 148887 178571 170761 188026 216509
13997 216509 213434 163161 157156 174042 154497 133678 123745 114777 145999 158607 131352 121918
13985 121918 138708 120574 107818 70314 66037 44424 56884 69184 40980 53483 78742 98157
13973 98157 110193 125169 131684 117284 123873 93120 87627 93178 104255 94210 108673 116305 123887
13960 123887 116635 102668 57500 56921 49282 54302 89890 128190 100346 68503 71721 67908 50183
13947 50183 38195 15223 28423 32392 54420 76967 56540 47983 38974 38912 91696 89884 92409
13934 92409 121027 130514 110864 117650 118659 116518 143105 149671 97569 63657 54689 50891 14275
13921 14275 -14969 3911 59324 51103 69685 45608 20180 27086 9662 12277 12981 5874 1936
$$ packed form
14009B01762p20n855k7979m4511n0429M142J8053N4424K9684p810J7265K8483
13997B16509l075n0273o005J6886j9545k0819r933q968L1222J2608k7255r434
13985A21918J6790j8134j2756l7504m277k1613J2460J2300k8204J2503K5259J9415
13973I8157J2036J4976O515j4400O589l0753n493N551J1077j0045J4463P632P582
13960A23887p252j3967m5168n79p639N020L5588L8300k7844l1843L218l813j7725
13947E0183j1988k2972J3200L969K2028K2547k0427q557r009o2N2784j812K525
13934I2409K8618R487j9650O786J009k141K6587O566n2102l3912q968l798l6616
13921A4275k9244J8880N5413q221J8582k4077k5428O906j7424K615P04p107l938
$$ plain form
13908 1936 22178 8066 14128 18619 60832 35918 30451 13595 13913 28025 -28188 -28798 34996
13895 34996 94967 50364 -19748 -23059 -8305 23925 44412 33987 8811 7335 22986 45326
13883 45326 20431 38168 74535 72270 58994 40472 6463 -24554 -43767 -48123 -1088 30002
13871 30002 16439 9304 119 28263 57032 42947 14906 -17943 -25317 -29376 -10838 -16158 -6709
13858 -6709 3668 -34704 -42751 -38301 -32754 -6418 11509 7520 -6916 -30449 -31613 -20831 -35260
13845 -35260 -32956 -24886 9303 42666 43683 25395 13709 43062 62387 39170 10981 27938
13833 27938 21264 39575 27416 46360 71622 60432 37980 46314 53419 58026 102965 84234
13821 84234 33348 25636 17449 -10141 31936 36495 5941 -39722 -10508 8063 -215 32106
$$ packed form
13908A936K0242j4112O062M491M2213k4914n467j6856L18J4112n6213o10O3794
13895C4996N9971m4603p0112l311J4754L2230K0487j0425k5176j476J5651K2340
13883D5326k4895J7737L6367k265j3276j8522l4009l1017j9213m356M7035L1090
13871C0002j3563p135r185K8144K8769j4085k8041l2849p374m059J8538n320R449
13858f709J0377l8372q047M450N547K6336J7927l989j4436k3533j164J0782j4429
13845c5260K304Q070L4189L3363J017j8288j1686K9353J9325k3217k8189J6957
13833B7938o674J8311j2159J8944K5262j1190k2452Q334P105M607M4939j8731
13821H4234n0886p712q187k7590M2077M559l0554m5663K9214J8571q278L2321
$$ plain form
13809 32106 47410 47929 51628 67975 89295 74711 62715 62578 33380 60531 82523 51477 -3271
13796 -3271 -48406 -12359 7097 10740 -15253 -29265 -25009 -30826 -53914 -21097 33952 43669 55325
13783 55325 48426 41005 26627 39533 42731 25137 7097 -4500 435 9367 10820 47315 46578
13770 46578 43882 28475 6788 -11941 6400 16060 14876 -4157 6989 16002 34074 70232
13758 70232 84669 64385 41335 35603 51218 53458 43580 43310 4247 1906 36362 35270 2972
13745 2972 25258 25902 16584 73315 105584 102964 37041 -23088 -12738 -14420 -6293 8627 16331
13732 16331 28417 27115 46213 70231 48248 33684 37957 59607 73922 23718 3882 29030
13720 29030 52707 18112 -1664 -17004 -1520 19361 67915 62833 35253 21254 1230 -31303
$$ packed form
13809C2106J5304N19L699J6347K1320j4584j1996j37k9198K7151K1992l1046n4748
13796c271m5135L6047J9456L643k5993j4012M256n817k3088L2817N5049R717J1656
13783E5325o899p421j4378J2906L198j7594j8040j1597M935Q932J453L6495p37
13770D6578k696j5407k1687j8729J8341R660j184j9033J1146R013J8072L6158
13758G0232J4437k0284k3050n732J5615K240r878k70l9063k341L4456j092l2298
13745B972K2286O44r318N6731L2269k620o5923o0129J0350j682Q127J4920P704
13732A6331J2086j302J9098K4018k1983j4564M273K1650J4315n0204j9836K5148
13720B9030K3677l4595j9776j5340J5484K0881M8554n082k7580j3999k0024l2533
$$ plain form
13708 -31303 -23211 39341 52927 97040 133860 125014 95859 103402 103699 64112 817 -19787 -11861
13695 -11861 -4359 -22866 -22068 -3304 -16451 10496 40076 34957 34389 61796 74289 68435 68991
13682 68991 30322 9703 -30289 -48062 -50803 -27723 -40177 -61731 -32769 38077 74016 60120
13670 60120 7760 -1841 -10363 -48690 -75478 -28618 -11045 -24611 4179 17192 -3108 -30213
13658 -30213 -8169 10744 -19164 -52448 -45665 -55988 -42995 23173 34848 32483 67014 63397
13646 63397 15416 -15363 20693 5026 -615 24539 35249 35911 51931 48177 27388 27672 58761
13633 58761 100070 71930 30985 52990 12678 -30571 7264 30530 1932 41540 67685 48480
13621 48480 17455 22468 22901 -195 11043 32937 22491 12392 -4123 -6536 -21878 -12087 10437
$$ packed form
13708c1303Q092O2552J3586M4113L6820q846k9155P543K97l9587o3295k0604P926
13695a1861P502j8507P98J8764j3147K6947K9580n119n68K7407J2493n854N56
13682F8991l8669k0619l9992j7773k741K3080j2454k1554K8962P0846L5939j3896
13670F0120n2360r601q522l8327k6788M6860J7573j3566K8790J3013k0300k7105
13658c0213K2044J8913k9908l3284O783j0323J2993O6168J1675k365L4531l617
13646F3397m7981l0779L6056j5667n641K5154J0710O62J6020l754k0789K84L1089
13633E8761M1309k8140m0945K2005m0312m3249L7835K3266k8598L9608K6145j9205
13621D8480l1025N013M33k3096J1238K1894j0446j0099j6515k413j5342R791K2524
$$ plain form
13608 10437 -6480 7460 43383 44024 32551 -4328 25788 44208 48176 52044 41324 15761
13596 15761 27058 23317 20011 8462 45602 40696 29473 40254 34458 8996 18796 7229 1603
13583 1603 20885 28581 24560 22246 5232 16404 34344 15873 9546 47880 95654 84365 49199
13570 49199 40314 2916 -7504 -14607 -32928 -43085 -64368 -82801 -56212 -34730 -38009 5175
13558 5175 76391 69277 29870 6660 29895 42433 44193 20678 -6837 -17075 -36331 -56024
13546 -56024 -46843 -15702 -8635 -25780 -15615 -1979 -23346 -23633 3509 332 -15265 5079 18846
13533 18846 -18194 -34690 -2750 -621 2039 -19482 -24932 12447 50014 47636 67092 75977 44354
13520 44354 13691 37735 62901 45430 24152 25792 45076 75849 61895 41456 55431 56139
$$ packed form
13608A0437j6917J3940L5923O41j1473l6879L0116J8420L968L868j0720k5563
13596A5761J1297l741l306j1549L7140m906j1223J0781n796k5462R800j1567n626
13583A603J9282P696m021k314j7014J1172J7940j8471o327L8334M7774j1289l5166
13570D9199q885l7398j0420p103j8321j0157k1283j8433K6589K1482l279M3184
13558E175P1216p114l9407k3210K3235J2538J760k3515k7515j0238j9256j9693
13546e6024R181L1141P067j7145J0165J3636k1367k87K7142l177j5597K0344J3767
13533A8846l7040j6496L1940K129K660k1521n450L7379L7567k378J9456Q885l1623
13520D4354l0663K4044K5166j7471k1278J640J9284L0773j3954k0439J3975P08
$$ plain form
13508 56139 55318 20932 16420 -4733 -12848 -3099 -2682 -31929 -19334 16838 -5155 9577 59331
13495 59331 68415 52848 46228 14271 -898 9932 42339 13055 -5396 22281 -34494 -45618
13483 -45618 -24532 33893 62873 59446 66513 63612 40693 34969 39632 49623 59128 18571 16831
13470 16831 54116 90410 75922 42818 41111 39638 49143 50522 66440 66316 59586 46506 37590
13457 37590 43530 56467 62395 73160 82332 56073 26918 35676 23601 -24552 -6459 -6211 -3703
13444 -3703 -14697 16139 24632 28512 3430 -3618 9009 1992 17216 -5474 -45031 -18178 5196
13431 5196 50048 45654 25823 12348 -20163 -31594 2117 29985 57388 33270 36638 30293
13419 30293 4370 -20786 -414 39416 34307 40274 45233 28947 36228 46778 75848 105743
$$ packed form
13508E6139q21l4386m512k1153q115R749M17k9247J2595L6172k1993J4732M9754
13495E9331R084j5567o620l1957j5169J0830L2407k9284j8451K7677n6775j1124
13483d5618K1086N8425K8980l427P067k901k2919n724M663R991R505m0557j740
13470A6831L7285L6294j4488l3104j707j473R505J379J5918j24o730j3080q916
13457C7590N940J2937N928J0765R172k6259k9155Q758j2075m8153J8093K48K508
13444c703j0994L0836Q493L880k5082p048J2627p017J5224k2690l9557K6853K3374
13431E196M4852m394j9831j3475l2511j1431L3711K7868K7403k4118L368o345
13419C0293k5923k5156K0372L9830n109N967M959j6286P281J0550K9070K9895
$$ plain form
13407 105743 99456 160219 179180 214019 267112 275890 285407 285299 280559 307411 305517 317349 288533
13394 288533 297309 322994 255043 230658 184878 154898 157735 157489 165754 159100 180013 205547 237712
13381 237712 292587 329323 335654 328043 326943 320727 320103 312900 277623 247904 241209 253948 254920
13368 254920 252209 229820 161440 139163 154536 183304 140317 104294 89096 112000 124741 107357
13356 107357 112346 118261 125912 117116 76080 39656 49886 60448 43707 39564 17652 43310
13344 43310 76535 52983 96211 117331 103050 117900 116757 135366 123990 85607 93548 115456
13332 115456 88438 92786 95479 71226 87476 118037 134345 126180 123016 126069 120328 89036 91163
13319 91163 70033 54233 95807 146866 200096 239670 278288 301968 309332 299831 351015 369048
$$ packed form
13407A05743o287O0763J8961L4839N3093Q778R517j08m740K6852j894J1832k8816
13394B88533Q776K5685o7951k4385m5780k9980K837k46Q265o654K0913K5534L2165
13381B37712N4875L6736O331p611j100o216o24p203l5277k9719o695J2739R72
13368B54920k711k2389o8380k2277J5373K8768m2987l6023j5198K2904J2741j7384
13356A07357M989N915P651q796m1036l6424J0230J0562j6741m143k1912K5658
13344D3310L3225k3552M3228K1120j4281J4850j143J8609j1376l8383P941K1908
13332A15456k7018M348K693k4253J6250L0561J6308q165l164L053n741l1292K127
13319I1163k1130j5800M1574N1059N3230L9574L8618K3680P364r501N1184J8033
$$ plain form
13307 369048 408503 403324 401674 381297 330670 325254 325162 298473 262857 260662 255159 236487 251501
13294 251501 295614 305652 287636 275523 304626 376684 396923 377374 399349 419122 418524 408389
13282 408389 388653 359533 368470 329233 292464 242350 216684 225089 233753 197149 197873 170970
13270 170970 163819 138836 107398 106098 101736 77079 90842 135737 136972 128719 119098 150389 133935
13257 133935 113158 99888 89410 115596 122245 135228 130892 99920 92836 79596 92172 117065
13245 117065 131968 156731 155900 138363 140778 117771 86034 93138 117462 138584 131682 133713 137588
13232 137588 121303 109147 149381 183155 214847 241177 273970 314894 363324 390612 465402
13221 465402 590794 785760 1036141 1219422 1289909 1340394 1402331 1459711 1500727 1497200 1393698
$$ packed form
13307C69048L9455n179j650k0377n0627n416r2k6689l5616k195n503j8672J5014
13294B51501M4113J0038j8016j2113K9103P2058K0239j9549K1975J9773n98j0135
13282D08389j9736k9120Q937l9237l6769n0114k5666Q405Q664l6604P24k6903
13270A70970p151k4983l1438j300m362k4657J3763M4895J235q253r621L1291j6454
13257A33935k0777j3270j0478K6186O649J2983m336l0972p084j3240J2576K4893
13245A17065J4903K4763q31j7537K415k3007l1737P104K4324K1122o902K031L875
13232A37588j6285j2156M0234L3774L1692K6330L2793M0924M8430K7288P4790
13221D65402J25392J94966K50381J83281P0487N0485O1937N7380M1016l527j03502
$$ plain form
13210 1393698 1272682 1174828 1032898 907216 805093 729017 680588 651130 631416 602668
13200 602668 560505 461519 367230 339002 330929 322917 272658 239832 226734 225050 221573 201150
13188 201150 198345 199719 194048 233299 217772 166703 165822 139839 110750 96331 125735 173701
13176 173701 146138 114809 124287 123019 151123 163204 153816 144067 172620 134833 97853 97345 111408
13163 111408 136036 143484 170608 122484 72146 58738 86945 129164 171824 163187 148041 140511
13151 140511 103763 95030 96673 114915 112465 97758 88791 75910 98593 116758 130667 142248
13139 142248 86226 59863 60981 74052 82232 93438 119232 165426 120417 81221 67318 52974
13127 52974 85528 128591 127491 80656 97064 97099 114188 124603 111205 104573 100088 75300 100642
$$ packed form
13210A393698j21016r7854j41930j25682j02123p6076m8429k9458j9714k8748
13200F02668m2163r8986r4289k8228q073q012n0259l2826j3098j684l477k0423
13188B01150k805J374n671L9251j5527n1069q81k5983k9089j4419K9404M7966
13176A73701k7563l1329R478j268K8104J2081r388r749K8553l7787l6980n08J4063
13163A11408K4628P448K7124m8124n0338j3408K8207M2219M2660q637j5146p530
13151A40511l6748q733J643J8242k450j4707q967j2881K2683J8165J3909J1581
13139A42248n6022k6363J118J3071Q180J1206K5794M6194m5009l9196j3903j4344
13127E2974L2554M3063j100m6835J6408L5J7089J0415j3398o632m485k4788K5342
$$ plain form
13114 100642 123025 86271 53906 18607 22937 9797 22548 41488 54106 52629 71242 113184
13102 113184 145621 114060 91794 98655 88320 117833 125058 101283 60235 64369 103762 92551
13090 92551 120741 118531 89175 136935 128583 113303 117598 123456 113093 70362 73407 60804 83495
13077 83495 117237 105933 101148 70330 51734 54297 62333 57222 53088 67422 77186 64276 60539
13064 60539 94147 121842 99798 76708 80136 105025 92315 88500 104354 99098 96861 103245 112474
13051 112474 142080 161732 192857 213127 260610 305166 290191 289080 308734 298944 312932 267186
13039 267186 235144 253591 247840 240744 225623 197692 166800 143423 138753 126262 168912 161877
13027 161877 130351 106932 92512 142943 157891 167902 177554 191228 171279 169220 143397 145006
$$ packed form
13114A00642K2383l6754l2365l5299M330j3140J2751J8940J2618j477J8613M1942
13102A13184L2437l1561k2266O861j0335K9513P225k3775m1048M134L9393j1211
13090I2551K8190k210k9356M7760q352j5280M295N858j0363m2731L045j2603K2691
13077H3495L3742j1304m785l0818j8596K563Q036n111m134J4334R764j2910l737
13064F0539L3608K7695k2044k3090L428K4889j2710l815J5854n256k237O384R229
13051A12474K9606J9652L1125K0270M7483M4556j4975j111J9654r790J3988m5746
13039B67186l2042J8447n751p096j5121k7931l0892k3377m670j2491M2650p035
13027A61877l1526k3419j4420N0431J4948J0011R652J3674j9949k059k5823J609
$$ plain form
13015 145006 160061 126849 116328 113873 103288 94991 112265 93745 61375 39270 51208 71983
13003 71983 38259 33842 32902 23762 9579 31587 89994 73247 54894 15464 17141 -24333 -41656
12990 -41656 -46414 -26474 17083 56970 28967 14333 85313 141118 166568 178081 180042 235150
12978 235150 253876 273607 315909 340790 386157 365450 333175 340233 338114 348008 330936 312027
12966 312027 295976 310011 349166 341755 352563 316575 265762 226874 204987 201811 244526 211572
12954 211572 162312 154728 128076 119551 128803 168497 211256 210062 211122 227104 242132 266771
12942 266771 293970 282733 249045 236755 267849 282402 267382 291687 349991 387898 388013 385685
12930 385685 410920 419589 399656 391302 398346 391565 402157 382205 357451 374290 445742 459876
$$ packed form
13015A45006J5055l3212j0521k455j0585q297J7274j8520l2370k2105J1938K0775
13003G1983l3724m417r40r140j4183K2008N8407j6747j8353l9430J677m1474j7323
12990d1656m758J9940M3557L9887k8003j4634P0980N5805K5450J1513J961N5108
12978B35150J8726J9731M2302K4881M5367k0707l2275P058k119R894j7072j8909
12966C12027j6051J4035L9155p411J0808l5988n0813l8888k1887l176M2715l2954
12954B11572m9260p584k6652q525R252L9694M2759j194J060J5982J5028K4639
12942B66771K7199j1237l3688j2290L1094J4553j5020K4305N8304L7907J15k328
12930C85685K5235Q669j9933q354P044o781J0592j9952k4754J6839P1452J4134
$$ plain form
12918 459876 510067 530123 563254 575934 578907 590691 569425 586832 551967 526304 523877 542046
12906 542046 535506 528483 557134 578805 598213 622230 622964 612811 646503 651791 672004 698933
12894 698933 732440 738462 739213 728297 697375 732270 768191 795248 792625 790854 809697 819969
12882 819969 815388 825718 857316 840212 836362 825730 830012 838537 872269 875337 862288 866345 926493
12869 926493 947882 953405 1015614 1024465 1022177 1065250 1104903 1121339 1146977 1156669 1184434 1255189
12857 1255189 1270280 1260900 1246803 1283158 1337395 1359137 1402781 1427650 1441815 1492684 1541988
12846 1541988 1514612 1500484 1484964 1516683 1573002 1618897 1685844 1754827 1791426 1853021 1911701
12835 1911701 2018416 2107147 2203989 2273904 2353766 2493364 2598670 2744258 2908684 3078533
$$ packed form
12918D59876N0191K0056L3131J2680K973J1784k1266J7407l4865k5663k427J8169
12906E42046o540p023K8651K1671J9408K4017P34j0153L3692N288K0213K6929
12894F98933L3507O022P51j0916l0922L4895L5921K7057k623j771J8843J0272
12882H19969m581J0330L1598j7104l850j0632M282Q525L3732L068j3049M057O0148
12869I26493K1389N523O2209Q851k288M3073L9653J6436K5638R692K7765P0755
12857A255189J5091r380j4097L6355N4237K1742M3644K4869J4165N0869M9304
12846A541988k7376j4128j5520L1719N6319M5895O6947O8983L6599O1595N8680
12835A911701J06715Q8731R6842O9915P9862J39598J05306J45588J64426J69849
$$ plain form
12825 3078533 3286226 3478848 3667812 3885259 4106105 4373157 4691237 5076071 5477293
12816 5477293 5854503 6282193 6826930 7475890 8242582 9170385 10304727 11651333 13145488
12807 13145488 14774638 16571510 18560850 20828189 23488594 26753607 30946648 36585122
12799 36585122 44486339 56250735 74425155 102226839 140974327 184728962 220612697
12792 220612697 239567331 246074629 253548293 268336693 282056818 280835253 259934325
12785 259934325 227836374 195704375 169043272 148117421 131171848 116870503 104635629
12778 104635629 94208430 85267284 77518646 70740107 64792659 59532123 54838392 50680411
12770 50680411 47005379 43653281 40591723 37884121 35489873 33413695 31555050 29903411
$$ packed form
12825C078533K07693J92622J88964K17447K20846K67052L18080L84834M01222
12816E477293L77210M27690N44737O48960P66692R27803J134342J346606J494155
12807A3145488J629150J796872J989340K267339K660405L265013M193041N638474
12799C6585122P901217J1764396J8174420K7801684L8747488M3754635L5883735
12792B20612697J8954634O507298P473664J4788400J3720125j221565k0900928
12785B59934325l2097951l2131999k6661103k0925851j6945573j4301345j2234874
12778A04635629j0427199q941146p748638o778539n947448n260536m693731m157981
12770E0680411l675032l352098l061558k707602k394248k076178j858645j651639
$$ plain form
12762 29903411 28412847 27072444 25863274 24749137 23750651 22783479 21927383 21127153 20371675
12753 20371675 19690913 19071962 18460661 17871122 17279562 16779354 16302190 15837261 15356009
12744 15356009 14912437 14478873 14043834 13616220 13214430 12794943 12417293 12054607 11743239
12735 11743239 11398614 11066391 10688246 10367395 10059221 9805426 9514444 9246013 8969672
12726 8969672 8694203 8490446 8271785 8033131 7836583 7650294 7482384 7253546 7008914
12717 7008914 6812839 6674813 6495360 6311840 6175165 6040592 5873291 5716701 5586946
12708 5586946 5461592 5355970 5205363 5072248 4936861 4838698 4709621 4543082 4420519 4346708
12698 4346708 4254360 4142905 4041446 3988832 3891033 3811032 3748568 3672690 3568695 3507431 3413250
$$ packed form
12762B9903411j490564j340403j209170j114137r98486r67172q56096q00230p55478
12753B0371675o80762o18951o11301n89539n91560n00208m77164m64929m81252
12744A5356009m43572m33564m35039m27614m01790m19487l77650l62686l11368
12735A1743239l44625l32223l78145l20851l08174k53795k90982k68431k76341
12726H969672k75469k03757k18661k38654j96548j86289j67910k28838k44632
12717G008914j96075j38026j79453j83520j36675j34573j67301j56590j29755
12708E586946j25354j05622j50607j33115j35387r8163j29077j66539j22563p3811
12698D346708r2348j11455j01459n2614r7799q0001o2464p5878j03995o1264r4181
$$ plain form
12687 3413250 3303134 3199459 3119790 3079141 2990409 2902848 2826050 2756663 2681444 2589094 2501570
12676 2501570 2459497 2434050 2376922 2294521 2221955 2167715 2151663 2132488 2108437 2086319 2052657
12665 2052657 2019344 1974308 1913092 1866966 1853759 1863305 1776218 1738095 1705643 1632150 1572810
12654 1572810 1578792 1558300 1489943 1433201 1345039 1316874 1285607 1266816 1260981 1220918 1216093 1192598
12642 1192598 1164060 1139969 1132478 1124487 1130036 1142246 1124016 1115849 1119770 1105559 1078176 1048049
12630 1048049 1059295 1056899 1024596 968602 945791 932605 914457 887708 868859 811562 817219 785092
12618 785092 753004 746615 722379 683636 614908 579037 556601 549876 522757 472515 446032 406852
12606 406852 350496 295967 291204 322691 342581 328277 310222 281786 296684 343064 406613 450372
$$ packed form
12687C413250j10116j03675p9669m0649q8732q7561p6798o9387p5219r2350q7524
12676B501570m2073k5447n7128q2401p2566n4240j6052j9175k4051k2118l3662
12665B052657l3313m5036o1216m6126j3207R546q7087l8123l2452p3493n9340
12654A572810N982k0492o8357n6742q8162k8165l1267j8791n835m0063m825k3495
12642A192598k8538k4091p491p991N549J2210j8230q167L921j4211k7383l0127
12630A048049J1246k396l2303n5994k2811j3186j8148k6749j8849n7297N657l2127
12618G85092l2088o389k4236l8743o8728l5871k2436o725k7119n0242k6483l9180
12606D06852n6356n4529m763L1487J9890j4304j8055k8436J4898M6380O3549M3759
$$ plain form
12594 450372 427311 402591 409759 452593 434672 431213 440555 451473 451931 454238 443604 427330 423346
12581 423346 461539 484995 483417 487638 452861 430993 414089 388625 396069 407728 413213 376593
12569 376593 369238 413849 413800 455327 525381 579377 626702 665356 729520 737138 751018 734336
12557 734336 691495 627120 594247 576814 561893 529025 501944 496655 501317 520174 544275 592524
12545 592524 601249 645663 661181 673030 654266 709149 774984 768286 714263 640072 596263 542109
12533 542109 507107 467410 442827 402451 391206 426173 438425 421634 395088 367368 361071 369777
12521 369777 363463 352602 324305 330449 311902 313169 318900 323843 327040 330595 326370 320817 327065
12508 327065 379666 455231 533991 580089 617630 615873 555885 538110 505141 478962 436289 418737
$$ packed form
12594D50372k3061k4720P168M2834j7921l459R342J0918M58K307j0634j6274l984
12581D23346L8193K3456j578M221l4777k1868j6904k5464P444J1659N485l6620
12569C76593p355M4611m9M1527P0054N3996M7325L8654O4164P618J3880j6682
12557G34336m2841o4375l2873j7433j4921l2868k7081n289M662J8857K4101M8249
12545E92524Q725M4414J5518J1849j8764N4883O5835o698n4023p4191m3809n4154
12533E42109l5002l9697k4583m0376j1245L4967J2252j6791k6546k7720o297Q706
12521C69777o314j0861k8297O144j8547J267N731M943L197L555m225n553O248
12508C27065N2601P5565P8760M6098L7541j757n9988j7775l2969k6179m2673j7552
$$ plain form
12496 418737 349974 284824 248719 227964 217533 233678 250935 229362 198394 179407 174961 171423
12484 171423 187927 230895 235283 156859 111471 115183 156796 170711 212837 250740 294139 341645
12472 341645 376591 440850 480094 463208 463113 475398 441760 413012 362819 325365 266172 190155
12460 190155 171478 154710 164618 179994 222938 201818 184503 166428 156304 163125 152506 112195
12448 112195 91709 71743 81835 73758 97108 89358 103976 79552 7282 53082 94462 76610
12436 76610 80637 87180 83278 94696 78799 62733 67486 140127 159011 170862 185996 148280
12424 148280 99094 76656 90429 138093 136331 169034 212196 222271 269463 310345 381486 432670
12412 432670 452774 469002 415736 372599 354537 307146 285111 297845 253717 211496 208027 229425
$$ packed form
12496D18737o8763o5150l6105k0755j0431J6145J7257k1573l0968j8987m446l538
12484A71423J6504M2968M388p8424m5388L712M1613J3915M2126L7903M3399M7506
12472C41645L4946O4259L9244j6886r5J2285l3638k8748n0193l7454n9193p6017
12460A90155j8677j6768R908J5376M2944k1120j7315j8075j0124O821j0619m0311
12448A12195k0486j9966J0092q077K3350p750J4618k4424p2270M5800M1380j7852
12436G6610M027O543l902J1418j5897j6066M753P2641J8884J1851J5134l7716
12424A48280m9186k2438J3773M7664j762L2703M3162J0075M7192M0882P1141N1184
12412D32670K0104J6228n3266m3137j8062m7391k2035J2734m4128m2221l469K1398
$$ plain form
12400 229425 184543 144698 123459 112660 135552 162966 157986 154654 171544 204064 220768 217326
12388 217326 221756 240393 253943 218595 242545 290206 338832 330075 316716 304238 341034 373542
12376 373542 412571 465030 589419 746640 983591 1252677 1554010 1880476 2178513 2431659
12366 2431659 2721846 2973156 3209788 3400611 3490735 3371792 3157572 2919346 2752992 2644955
12356 2644955 2496575 2255886 1980453 1752707 1560927 1391086 1266164 1149404 1082299 1016598
12346 1016598 965714 885778 804353 764275 755870 658885 566966 522353 504211 502850 454414 428510
12334 428510 377419 338856 325996 349390 356006 344260 339408 333952 313229 299273 291319 241522
12322 241522 223992 208187 178967 161419 185919 204513 184404 166512 159553 161574 160720 201821
$$ packed form
12400B29425m4882l9845k1239j0799K2892K7414m980l332J6890L2520J6704l442
12388B17326M430J8637J3550l5348K3950M7661M8626q757j3359j2478L6796L2508
12376C73542L9029N2459J24389J57221K36951K69086L01333L26466K98037K53146
12366B431659K90187K51310K36632J90823R0124j18943k14220k38226j66354j08037
12356B644955j48380k40689k75433k27746j91780j69841j24922j16760o7105o5701
12346A016598n0884p9936q1425m0078q405r6985r1919m4613j8142j361m8436k5904
12334D28510n1091l8563j2860K3394O616j1746m852n456k0723j3956p954m9797
12322B41522j7530j5805k9220j7548K4500J8594k0109j7892o959K021q54M1101
$$ plain form
12310 201821 192206 193935 193624 193488 175815 177288 181712 207370 218812 222391 208091 185186 166969
12297 166969 154129 144767 146907 128459 114331 118528 100034 71163 38961 60180 89844 84694
12285 84694 100797 129217 120168 107168 113175 98622 83233 102456 102763 86018 106224 105339 98213
12272 98213 94345 94012 115008 98771 46054 71132 80978 122973 107734 82721 71513 88140
12260 88140 109064 104987 68364 21960 31477 35785 5967 3381 17431 47101 60859 37669
12248 37669 40812 34696 26485 29628 25434 23860 -4226 -29641 -4606 17999 9176 -4164 15357
12235 15357 16540 19444 55821 59789 32374 29333 43891 66841 69760 49289 17975 32687 32045
12222 32045 33834 24910 -1643 -8045 20000 16379 11787 27027 47856 38211 44495 28892 70042
$$ packed form
12310B01821r615J729l11j36j7673J473M424K5658J1442L579j4300k2905j8217
12297A66969j2840r362K140j8448j4128M197j8494k8871l2202K1219K9664n150
12285H4694J6103K8420r049j3000O007j4553j5389J9223L07j6745K0206q85p126
12272I8213l868l33K0996j6237n2717K5078R846M1995j5239k5013j1208J6627
12260H8140K0924m077l6623m6404R517M308k9818k586J4050K9670J3758k3190
12248C7669L143o116q211L143m194j574k8086k5415K5035K2605q823j3340J9521
12235A5357J183K904L6377L968k7415l041J4558K2950K919k0471l1314J4712o42
12222C2045J789q924k6553o402K8045l621m592J5240K0829r645O284j5603M1150
$$ plain form
12209 70042 83469 60207 37599 10094 8964 22507 28488 33793 60517 22507 13800 -4148
12197 -4148 -15347 1236 2766 14524 -624 -25122 -15030 16558 -225 13888 41790 46274
12185 46274 62758 107211 105978 91666 79622 59522 13391 -22076 -11970 -47949 -27859 -49888
12173 -49888 -6005 12874 11161 2673 24434 35231 43871 61511 86776 64992 82619 92331
12161 92331 90303 45129 41492 26466 20430 8505 7279 35534 73255 41300 37267 14814 26690
12148 26690 85449 78905 31717 22331 20024 -15183 2894 -3762 -11366 -5967 11227 67387 73681
12135 73681 57130 48704 25849 16017 8451 8923 -5228 -9787 -3921 1559 33730 46740 37407
12122 37407 41719 56249 92534 71518 43529 30682 5086 -10583 -6645 16832 9021 20556
$$ packed form
12209G0042J3427k3262k2608k7505j130J3543N981N305K6724l8010q707j7948
12197d148j1199J6583J530J1758j5148k4498J0092L1588j6783J4113K7902M484
12185D6274J6484M4453j233j4312j2044k0100m6131l5467J0106l5979K0090k2029
12173d9888M3883J8879j713q488K1761J0797Q640J7640K5265k1784J7627R712
12161I2331k028m5174l637j5026o036j1925j226K8255L7721l1955m033k2453J1876
12148B6690N8759o544m7188r386k307l5207J8077o656p604N399J7194N6160O294
12135G3681j6551q426k2855r832p566M72j4151m559N866N480L2171J3010r333
12122C7407M312J4530L6285k1016k7989j2847k5596j5669L938K3477p811J1535
$$ plain form
12110 20556 2109 -21542 -3303 48502 35762 -8888 2425 19599 34799 15646 -2294 6098
12098 6098 12509 5668 -11943 37059 32915 -1091 11100 -1831 23436 6635 -3462 -45220
12086 -45220 -69396 -35825 -1590 10279 -9265 -31521 -6017 24804 26713 23923 12907 5882
12074 5882 -15954 -39837 -24888 -10070 12640 -13080 714 3016 -14184 -14054 -21013 -11317 -10877
12061 -10877 17007 22538 12141 31627 61777 41304 31367 38395 53690 37310 32602 57045
12049 57045 112872 102984 51341 60329 59696 42000 10749 -8193 -633 23752 22863 6929 -7875
12036 -7875 -14138 27711 46427 30317 17808 -6098 40821 97700 112371 57702 36146 30264
12024 30264 29681 -9867 392 1812 22261 27813 841 -8012 -15436 2901 57502 100858 140719
$$ packed form
12110B0556j8447k3651J8239N1805j2740m4650J1313J7174J5200j9153j7940Q392
12098F098O411o841j7611M9002m144l4006J2191j2931K5267j6801j0097m1758
12086d5220k4176L3571L4235J1869j9544k2256K5504L0821J909k790j1016p025
12074E882k1836k3883J4949J4818K2710k5720J3794K302j7200J30o959R696M40
12061a0877K7884N531j0397J9486L0150k0473r937P028J5295j6380m708K4443
12049E7045N5827r888n1643Q988o33j7696l1251j8942P560K4385q89j5934j4804
12036g875o263M1849J8716j6110j2509k3906M6919N6879J4671n4669k1556n882
12024C0264n83l9548J0259J420K0449N552k6972q853p424J8337N4601M3356L9861
$$ plain form
12011 140719 151236 149875 207828 270664 307119 426392 617223 939910 1370247 1633701 1585289
12000 1585289 1324702 1052285 864199 758470 673008 585129 531004 526099 496545 412474 356041
11989 356041 314873 298784 230577 185252 179106 157861 144659 159845 146641 150467 190785 191736
11977 191736 163240 157298 132600 118447 80639 67553 92213 103490 108978 88443 54738 11393
11965 11393 43623 39831 25734 63695 95428 94919 123325 144310 96693 83545 74186 62794
11953 62794 47503 -19124 -29029 16522 79688 76893 79326 87760 90737 82884 54923 30165 64004
11940 64004 92669 96966 97657 56810 47619 26296 13803 17602 1265 -2451 44706 64226 53452
11927 53452 55601 36885 42879 66966 57146 12167 -25230 -7495 19244 3203 21544 29464
$$ packed form
12011A40719J0517j361N7953O2836L6455J19273J90831L22687M30337K63454m8412
12000A585289k60587k72417j88086j05729q5462q7879n4125m905k9554q4071n6433
11989C56041m1168j6089o8207m5325o146k1245j3202J5186j3204L826M0318R51
11977A91736k8496n942k4698j4153l7808j3086K4660J1277N488k0535l3705m3345
11965A1393L2230l792j4097L7961L1733n09K8406K0985m7617j3148r359j1392
11953F2794j5291o6627r905M5551O3166k795K433Q434K977p853k7961k4758L3839
11940F4004K8665M297O91m0847r191k1323j2493L799j6337l716M7157J9520j0774
11927E3452K149j8716N994K4087r820m4979l7397J7735K6739j6041J8341P920
$$ plain form
11915 29464 2221 -488 -18801 -627 46224 92907 94484 67472 28923 11566 7206 29812
11903 29812 40308 19169 31786 40956 55825 63343 68421 50816 20444 530 -5694 14202
11891 14202 -11784 -3170 18460 10048 20519 27737 -15464 4658 31179 23025 10803 542
11879 542 65989 73794 26248 45033 36324 16343 -3194 -17634 -7323 22516 23435 -16828 -48288
11866 -48288 -17422 -12878 -574 15562 -12065 21440 38957 45346 49426 37730 15147 -1928
11854 -1928 -3997 -21968 2799 4891 -18099 -17336 -4191 -2461 -8733 1861 7833 2203 -21941
11841 -21941 11007 13976 32763 27725 -4977 -49066 -71113 -42595 8909 28278 25962 13616
11829 13616 33398 25195 28540 19637 13920 30600 36635 28650 36531 -1352 -53553 -62671 -71115
$$ packed form
11915B9464k7243k709j8313J8174M6851M6683J577k7012l8549j7357m360K2606
11903B9812J0496k1139J2617R170J4869P518N078j7605l0372j9914o224J9896
11891A4202k5986Q614K1630q412J0471P218m3201K0122K6521q154j2222j0261
11879E42O5447P805m7546J8785q709j9981j9537j4440J0311K9839R19m0263l1460
11866d8288L0866M544J2304J6136k7627L3505J7517O389M080j1696k2583j7075
11854a928k069j7971K4767K092k2990P63J3145J730o272J0594N972n630k4144
11841b1941L2948K969J8787n038l2702m4089k2047K8518N1504J9369k316j2346
11829A3616J9782q203L345q903n717J6680O035p985P881l7883n2201r118q444
$$ plain form
11816 -71115 -45319 -36790 -38308 11533 44897 47433 29575 8819 -7509 -249 41515 65531
11804 65531 67827 43057 13335 13211 11170 19663 7888 30608 38252 7967 -212 19476 26294
11791 26294 40718 64961 46201 41193 5864 -16463 -12774 -21480 -4149 18169 11065 18503 45828
11778 45828 45125 -10633 -24603 -25390 -15776 -5799 -26922 -72521 -52915 -1399 45323 52249 44975
11765 44975 27037 11032 55186 98491 105291 86021 88135 65033 74132 77465 23984 -10265
11753 -10265 3980 45305 67175 53597 38952 59441 37006 47176 81330 125758 93745 54780
11741 54780 37062 14218 53776 43906 36971 29761 22780 23141 39749 61400 85226 86156 107572
11728 107572 114326 92391 114597 148265 136853 118466 121524 130308 106611 99620 136029 170204
$$ packed form
11816g1115K5796Q529j518M9841L3364K536j7858k0756j6328P260M1764K4016
11804F5531K296k4770k9722j24k041Q493j1775K2720P644l0285q179J9688O818
11791B6294J4424K4243j8760n008l5329k2327L689q706J7331K2318p104P438K7325
11778D5828p03n5758j3970p87R614R977k1123m5599J9606N1516M6722O926p274
11765D4975j7938j6005M4154M3305O800j9270K114k3102R099L333n3481l4249
11753a0265J4245M1325K1870j3578j4645K0489k2435J0170L4154M4428l2013l8965
11741E4780j7718k2844L9558r870o935p210o981L61J6608K1651K3826R30K1416
11728A07572O754k1935K2206L3668j1412j8387L058Q784k3697o991L6409L4175
$$ plain form
11716 170204 148708 127330 118510 126392 156816 206512 165371 130906 169345 182137 203697 255739
11704 255739 277444 302463 358264 432490 474471 522781 559271 656555 772282 869623 971921
11693 971921 1102728 1354095 1642340 2095938 2711537 3463733 4336922 5087798 5568083 5668555
11683 5668555 5396851 4916969 4364877 3826326 3379325 3003323 2650643 2377417 2188748
11674 2188748 2000050 1767467 1604594 1470342 1315420 1236744 1131251 1033499 937219 842288
11664 842288 787175 779680 699926 616338 563647 537591 549746 536799 495576 481276 484757 460127
11652 460127 419426 402154 385766 371636 383282 406451 403700 368863 345872 376284 372989 339056
11640 339056 325944 303571 300971 301016 296970 287064 288976 273444 241829 229657 262026 243572 250736
$$ packed form
11716A70204k1496k1378q820P882L0424M9696m1141l4465L8439J2792K1560N2042
11704B55739K1705K5019N5801P4226M1981M8310L6490R7284J15727R7341J02298
11693I71921J30807K51367K88245M53598O15599P52196Q73189P50876M80285J00472
11683E668555k71704m79882n52092n38551m47001l76002l52680k73226j88669
11674B188748j88698k32583j62873j34252j54922p8676j05493r7752r6280r4931
11664H42288n5113p495p9754q3588n2691k6056J2155j2947m1223j4300L481k4630
11652D60127m0701j7272j6388j4130J1646K3169k751l4837k2991L0412l295l3933
11640C39056j3112k2373k600M5m046r906J912j5532l1615j2172L2369j8454P164
$$ plain form
11627 250736 263507 216720 186144 188811 203578 224723 228436 197602 188734 192032 220868 228439
11615 228439 196604 164194 182074 166090 157795 156030 111340 93547 107823 126033 105005 95840
11603 95840 102955 84600 76544 95838 79959 103012 96318 81908 77326 67143 85848 56935
11591 56935 65305 86940 66722 80327 85859 77402 55672 71662 44656 75950 75001 34890 57403
11578 57403 28528 36280 70920 37718 50821 80477 90969 91983 75858 40573 52717 41046
11566 41046 45254 51603 26685 29767 34329 12248 -11447 44590 85634 94286 82890 73766 49975
11553 49975 41870 47397 34665 22692 2184 -4819 36755 68145 77791 12501 -18731 -18965 -36
11540 -36 -28535 -23245 5922 45406 32837 -4200 -13610 -2493 43830 34080 -839 -37151 -11334
$$ packed form
11627B50736J2771m6787l0576K667J4767K1145L713l0834q868L298K8836P571
11615B28439l1835l2410J7880j5984q295j765m4690j7793J4276J8210k1028r165
11603I5840P115j8355q056J9294j5879K3053o694j4410m582j0183J8705k8913
11591E6935Q370K1635k0218J3605N532q457k1730J5990k7006L1294r49m0111K2513
11578E7403k8875P752L4640l3202J3103K9656J0492J014j6125l5285J2144j1671
11566D1046M208O349k4918L082M562k2081k3695N6037M1044Q652j1396r124k3791
11553D9975q105N527j2732j1973k0508p003M1574L1390R646o5290l1232k34J8929
11540c6k8499N290K9167L9484j2569l7037r410J1117M6323r750l4919l6312K5817
$$ plain form
11527 -11334 -2988 5327 -33829 -59417 -11606 43906 102954 110151 84789 71984 55977 52175
11515 52175 57593 77709 95010 62652 59324 77925 49392 41471 11790 26720 78583 84721
11503 84721 40662 34259 48314 46270 46147 47374 35050 29909 29545 28213 21268 32278 33996 42227
11489 42227 52779 40574 34798 37469 42468 34735 25672 17086 2224 13264 18007 34384 26741
11476 26741 5436 8457 58257 42843 -12383 -14887 17358 24389 41204 51752 40240 28124
11464 28124 49242 69439 74638 51486 13484 -601 19996 41420 61148 67338 42383 19556
11452 19556 7047 15308 46533 48562 65521 104893 182970 225024 203067 176581 164290 141997
11440 141997 113354 57015 44725 -5104 -23468 29372 45613 69613 70702 85714 75660 7775
$$ packed form
11527a1334Q346Q315l9156k5588M7811N5512N9048P197k5362j2805j6007l802
11515E2175N418K0116J7301l2358l328J8601k8533p921k9681J4930N1863O138
11503H4721m4059o403J4055k044j23J227j2324n141l64j332o945J1010J718Q231
11489D2227J0552j2205n776K671M999p733r063q586j4862J1040M743J6377p643
11476B6741k1305L021M9800j5414n5226k504L2245P031J6815J0548j1512j2116
11464B8124K1118K0197N199k3152l8002j4085K0597K1424J9728O190k4955k2827
11452A9556j2509Q261L1225K029J6959L9372P8077M2054k1957k6486j2291k2293
11440A41997k8643n6339j2290m9829j8364N2840J6241K4000J089J5012j0054o7885
$$ plain form
11428 7775 3746 33978 31679 67206 71667 20773 23070 60804 81593 83535 78969 103100 92175
11415 92175 82710 104615 154090 172984 124911 112936 101244 121980 109563 101739 103259 121061
11403 121061 105628 96337 67659 80249 45678 38574 34520 9693 -7381 7434 -12157 14638
11391 14638 67110 60675 47910 46072 69272 74585 42724 16663 29953 64817 68913 51203
11379 51203 91641 84786 85501 79637 53691 55135 69704 51285 28450 38755 54921 51787 48697
11366 48697 65611 68041 42755 29198 18412 41741 51657 26007 8996 17397 11325 21335
11354 21335 21417 13681 52972 86459 61045 55952 83983 118189 118628 100765 90132 104911 118076
11341 118076 139513 122029 134786 163678 145677 107394 50464 37815 35266 59541 65276 59177
$$ packed form
11428G775m029L0232k299L5527M461n0894K297L7734K0789J942m566K4131j0925
11415I2175r465K1905M9475J8894m8073j1975j1692K0736j2417p824J520J7802
11403A21061j5433r291k8678J2590l4571p104m054k4827j7074J4815j9591K6795
11391A4638N2472o435j2765j838K3200N313l1861k6061J3290L4864M096j7710
11379E1203M0438o855P15n864k5946J444J4569j8419k2835J0305J6166l134l090
11366D8697J6914K430k5286j3557j0786K3329R916k5650j7011Q401o072J0010
11354B1335Q2p736L9291L3487k5414n093K8031L4206M39j7863j0633J4779J3165
11341A18076K1437j7484J2757K8892j8001l8283n6930j2649k549K4275N735o099
$$ plain form
11329 59177 61775 83861 32125 10798 24548 23849 8030 49302 76576 72093 109178 95077
11317 95077 74269 61237 66584 52789 43962 76289 108822 127514 102379 113184 118066 141217
11305 141217 111477 120662 96002 86749 52516 55862 62074 67412 53868 56985 63959 58442 88194
11292 88194 83621 79362 61759 52139 31727 26102 27033 15649 37818 89067 97826 84249 91327
11279 91327 113320 88575 53552 66854 69168 102440 116714 122033 131680 184227 179772 203200
11267 203200 212491 280722 343542 386390 371096 358582 318164 267789 233977 240504 213433 196621
11255 196621 186565 155252 124017 98570 63915 52844 47565 78356 97453 87269 100621 141625
11243 141625 123270 128246 150970 165640 151421 166993 208213 172049 136778 190900 191827 150612
$$ packed form
11329E9177K598K2086n1736k1327J3750o99j5819M1272K7274m483L7085j4101
11317I5077k0808j3032N347j3795q827L2327L2533J8692k5135J0805M882K3151
11305A41217k9740R185k4660r253l4233L346O212N338j3544L117O974n517K9752
11292H8194m573m259j7603r620k0412n625R31j1384K2169N1249Q759j3577P078
11279I1327K1993k4745l5023J3302K314L3272J4274N319R647N2547m455K3428
11267B03200R291O8231O2820M2848j5294j2514m0418n0375l3812O527k7071j6812
11255A96621j0056l1313l1235k5447l4655j1071n279L0791J9097j0184J3352M1004
11243A41625j8355M976K2724J4670j4219J5572M1220l6164l5271N4122R27m1215
$$ plain form
11231 150612 107110 91867 95132 113549 141329 129480 128640 86817 28643 20207 49053 101639
11219 101639 109958 127368 126379 133476 102742 62813 63984 54496 24569 -729 11905 32851 71166
11206 71166 76993 35900 53186 67070 50714 78118 95905 54657 84521 130247 142384 120239
11194 120239 126053 96028 105938 88535 99719 88519 104652 123201 72970 59038 57706 80004
11182 80004 50076 26678 61581 108972 114889 97655 35253 41602 92552 70266 30332 46554
11170 46554 74249 60572 69582 74542 107587 93074 53339 68323 53825 41958 49065 68002
11158 68002 107585 156433 222282 264356 269444 278988 285123 254999 207323 184418 176663 149737
11146 149737 139680 145778 113755 97552 118093 99378 100771 104456 69591 32696 52370 90942
$$ packed form
11231A50612m3502j5243L265J8417K7780j1849q40m1823n8174q436K8846N2586
11219A01639Q319J7410r89P097l0734l9929J171r488k9927k5298J2634K0946L8315
11206G1166N827m1093J7286J3884j6356K7404J7787m1248K9864M5726J2137k2145
11194A20239N814l0025R910j7403J1184j1200J6133J8549n0231j3932j332K2298
11182H0004k9928k3398L4903M7391N917j7234o2402O349N0950k2286l9934J6222
11170D6554K7695j3677R010M960L3045j4513l9735J4984j4498j1867P107J8937
11158F8002L9583M8848O5849M2074N088R544O135l0124m7676k2905p755k6926
11146A49737j0057O098l2023j6203K0541j8715J393L685l4865l6895J9674L8572
$$ plain form
11134 90942 91743 115971 128874 119068 99954 105388 100212 98874 102885 66428 44478 27873 15252
11121 15252 34259 50935 90648 106026 95248 87538 80703 99700 132290 141240 111338 79167
11109 79167 55705 79364 113933 129847 148596 154630 121551 63043 45719 63621 76570 93706
11097 93706 106440 122414 81543 46221 30072 55711 64778 58863 76405 105447 100158 66285
11085 66285 101634 109974 44271 36100 56279 51771 36009 59551 86555 73592 92509 105957
11073 105957 84018 64313 54525 30958 38635 65639 69421 52806 69718 66054 64550 78204
11061 78204 98928 131780 120590 114241 121293 112270 112336 87496 84244 72427 44703 48328 64345
11048 64345 80772 85479 56879 55619 67009 83654 89901 66454 61370 53299 48652 51124 87844
$$ packed form
11134I0942Q01K4228J2903r806j9114N434n176j338M011l6457k1950j6605j2621
11121A5252J9007J6676L9713J5378j0778p710o835J8997L2590Q950k9902l2171
11109G9167k3462K3659L4569J5914J8749O034l3079n8508j7324J7902J2949J7136
11097I3706J2734J5974m0871l5322j6149K5639R067n915J7542K9042n289l3873
11085F6285L5349Q340o5703q171K0179m508j5762K3542K7004j2963J8917J3448
11073A05957k1939j9705r788k3567P677K7004L782j6615J6912l664j504J3654
11061G8204K0724L2852j1190o349P052r023O6k4840l252j1817k7724L625J6017
11048F4345J6427M707k8600j260J1390J6645O247k3447n084q071m647K472L6720
$$ plain form
11035 87844 112400 138784 118914 117946 124591 134387 175987 211265 211766 167051 165487 157534 115225
11022 115225 119746 125706 115436 112311 108498 77749 59339 36445 49419 82202 94291 67674
11010 67674 78462 96782 108608 82766 77846 92626 112192 161457 201828 265630 277729 236667
10998 236667 201199 208493 254334 312685 341905 328561 313947 318328 294472 381304 549933 703629
10986 703629 888769 1215344 1690011 2286141 2837513 3121658 3035871 2663126 2211412 1895485
10976 1895485 1621225 1421937 1260219 1082424 949891 856069 757492 692753 639942 601127
10966 601127 602802 598022 562649 520899 474944 435388 455031 425437 382684 348735 332983 341668
10954 341668 312961 293839 288638 327012 333917 297333 278515 264683 262120 244883 236558 225530
$$ packed form
11035H7844K4556K6384j9870r68O645R796M1600L5278N01m4715j564p953m2309
11022A15225M521N960j0270l125l813l0749j8410k2894J2974L2783J2089k6617
11010F7674J0788J8320J1826k5842m920J4780J9566M9265M0371O3802J2099m1062
10998B36667l5468P294M5841N8351K9220j3344j4614M381k3856Q6832J68629J53696
10986G03629J85140L26575M74667N96130N51372K84145q5787l72745m51714l15927
10976A895485k74260j99288j61718j77795j32533r3822r8577o4739n2811l8815
10966F01127J675m780l5373m1750m5955l9556J9643k9594m2753l3949j5752Q685
10954C41668k8707j9122n201L8374O905l6584j8818j3832k563j7237q325j1028
$$ plain form
10942 225530 202703 192111 176484 193106 229612 264861 248324 226527 186404 177561 206831 209267
10930 209267 202248 223922 229559 242122 221736 160587 118641 143016 151000 145758 160594 159815 137188
10917 137188 108095 87656 98845 137383 121328 106601 139550 132152 158385 155617 155278 152607
10905 152607 133528 107735 100349 94621 99180 72954 102588 129477 129207 125934 100979 83622 79961
10892 79961 92203 138546 148308 136264 127027 141367 167214 145829 97804 102877 122113 123574
10880 123574 113793 126540 93244 64017 77445 67345 79325 81818 52553 98254 169882 181139
10868 181139 173120 168135 149988 160266 165149 139834 112674 142989 178117 187890 203208 179717
10856 179717 186453 193703 212180 195804 162649 141538 133868 133111 129035 145077 168507 172110 203523
$$ packed form
10942B25530k2827j0592j5627J6622L6506L5249j6537k1797m0123q843K9270K436
10930B09267p019K1674N637J2563k0386o1149m1946K4375P984n242J4836p79k2627
10917A37188k9093k0439J1189L8538j6055j4727L2949p398K6233k768l39k671
10905A52607j9079k5793p386n728M559k6226K9634K6889k70l273k4955j7357l661
10892G9961J2242M6343R762j2044r237J4340K5847k1385m8025N073J9236J461
10880A23574r781J2747l3296k9227J3428j0100J1980K493k9265M5701P1628J1257
10868A81139q019m985j8147J0278M883k5315k7160L0315L5128R773J5318k3491
10856A79717O736P250J8477j6376l3155k1111p670p57m076J6042K3430L603L1413
$$ plain form
10843 203523 193435 205561 228394 251281 235228 261506 346671 391273 432462 441902 417714 382155
10831 382155 307417 291130 314059 320004 305239 311345 338868 332302 313171 281078 275034 308264
10819 308264 349504 370880 414253 439883 469558 504917 503209 489467 462173 407954 364125 342741
10807 342741 332830 303358 256487 242189 235827 223473 229524 202086 181171 211722 241214 249896
10795 249896 252915 226157 176556 154196 137034 184990 203462 199153 164981 144087 142537 181983
10783 181983 178262 197637 232576 237368 194998 162657 133070 143833 123943 113234 83064 30994
10771 30994 -10976 1659 2023 23787 30318 34480 53238 59703 62081 75832 47297 25576 15444
10758 15444 43707 32726 41259 64889 127292 215496 368830 578970 717246 768545 748461
$$ packed form
10843B03523j0088J2126K2833K2887j6053K6278Q5165M4602M1189R440k4188l5559
10831C82155p4738j6287K2929N945j4765O106K7523o566j9131l2093o044L3230
10819C08264M1240K1376M3373K5630K9675L5359j708j3742k7294n4219m3829k1384
10807C42741r911k9472m6871j4298o362j2354O051k7438k0915L0551K9492Q682
10795B49896L019k6758m9601k2360j7162M7956J8472m309l4172k0894j550L9446
10783A81983l721J9375L4939M792m2370l2341k9587J0763j9890j0709l0170n2070
10771C0994m1970J2635L64K1764O531M162J8758O465K378J3751k8535k1721j0132
10758A5444K8263j0981Q533K3630O2403Q8204J53334K10140J38276N1299k0084
$$ plain form
10747 748461 709737 641143 542692 471456 464427 462896 445957 435890 437387 427568 441582 414243
10735 414243 370596 369242 396106 380106 345440 326787 313785 337521 319524 324957 356087 419871
10723 419871 457992 452011 422610 414420 426223 383806 365913 419481 480829 488574 492124 512237
10711 512237 504995 484066 463255 456601 454361 473838 498504 510492 532859 582384 584794 570239
10699 570239 541783 509090 524107 557192 595349 611271 635196 670003 693771 745060 869002
10688 869002 1010533 1075896 1085775 1038382 990532 946670 899522 867484 846845 835708 852051
10677 852051 873280 888710 924916 968726 981232 1001929 1022621 1024151 1030738 1047336 1037540 1047256
10665 1047256 1030634 1020201 1060893 1062824 1083121 1124601 1176933 1208507 1201753 1185863 1195910 1224605
$$ packed form
10747G48461l8724o8594r8451p1236p029j531j6939j0067J497r819J4014k7339
10735D14243m3647j354K6864j6000l4666j8653j3002K3736j7997N433L1130O3784
10723D19871L8121n981k9401q190J1803m2417j7893N3568O1348P745L550K0113
10711E12237p242k0929k0811o654k240J9477K4666J1988K2367M9525K410j4555
10699E70239k8456l2693J5017L3085L8157J5922K3925L4807K3768N1289J23942
10688H69002J41531O5363R879m7393m7850m3862m7148l2038k0639j1137J6343
10677H52051K1229J5430L6206M3810J2506K0697K0692J530O587J6598r796R716
10665A047256j6622j0433M0692J931K0297M1480N2332L1574o754j5890J0047K8695
$$ plain form
10653 1224605 1236650 1293145 1333917 1354512 1401520 1436578 1426525 1423637 1409363 1399197 1427127
10642 1427127 1474710 1486023 1494395 1526794 1562109 1572681 1585802 1626766 1668221 1697925 1754024
10631 1754024 1782781 1795420 1842295 1882723 1877501 1914124 1959510 2020289 2082165 2135639 2158656
10620 2158656 2220141 2291209 2358067 2406826 2406707 2409112 2450225 2509599 2601860 2787943 3048592
10609 3048592 3284945 3566872 3836015 4148242 4514523 4883478 5261977 5593884 5860720
10600 5860720 6085339 6207243 6283782 6409349 6522436 6668864 6881999 7148471 7409963 7693168
10590 7693168 8017977 8453813 9001904 9553428 10295653 11139833 12157250 13430678 14913259
10581 14913259 16511232 18048594 19534874 21079864 22978957 25376627 28431706 32259448
$$ packed form
10653A224605J2045N6495M0772K0595M7008L5058j0053k888j4274j0166K7930
10642A427127M7583J1313Q372L2399L5315J0572J3121M0964M1455K9704N6099
10631A754024K8757J2639M6875M0428n222L6623M5386O0779O1876N3474K3017
10620B158656O1485P1068O6858M8759j19K405M1113N9374R2261J86083K60649
10609C048592K36353K81927K69143L12227L66281L68955L78499L31907K66836
10600E860720K24619J21904P6539J25567J13087J46428K13135K66472K61492K83205
10590G693168L24809M35836N48091N51524P42225Q44180J017417J273428J482581
10581A4913259J597973J537362J486280J544990J899093K397670L055079L827742
$$ plain form
10573 32259448 37018509 43073838 51021025 62025619 77914500 101825801 139005798
10566 139005798 198078482 289516883 411031969 527378090 587097957 567535004 495459629
10559 495459629 414166863 346517837 295423874 255009107 220484676 191082193 166829059
10552 166829059 146986708 130565892 116834509 105394550 95853197 87961857 81477635
10545 81477635 75990066 71035216 66317123 61819123 57660809 53938859 50600643 47548696
10537 47548696 44856857 42571266 40584084 38834932 37228006 35723131 34315716 33010819
10529 33010819 31798074 30654959 29529537 28490769 27539455 26586697 25701775 24903542 24154959
10520 24154959 23385611 22624809 21925391 21291696 20681827 20082573 19486650 18943001 18468319
$$ packed form
10573C2259448M759061O055329P947187J1004594J5888881K3911301L7179997
10566A39005798N9072684R1438401J21515086J16346121N9719867j9562953p2075375
10559D95459629q1292766o7649026n1093963m0414767l4524431k9402483k4253134
10552A66829059j9842351j6420816j3731383j1439959r541353p891340o484222
10545H1477635n487569m954850m718093m498000m158314l721950l338216l051947
10537D7548696k691839k285591j987182j749152j606926j504875j407415j304897
10529C3010819j212745j143115j125422j038768r51314r52758q84922p98233p48583
10520B4154959p69348p60802o99418o33695o09869n99254n95923n43649m74682
$$ plain form
10511 18468319 18033464 17569683 17089786 16621329 16176745 15717198 15269983 14871565 14467298
10502 14467298 14070441 13671820 13257887 12891051 12547811 12198324 11869475 11647478 11378680
10493 11378680 11063770 10767983 10451236 10151935 9897612 9698903 9523219 9377515 9188793
10484 9188793 9005636 8837405 8648499 8435272 8248754 8025072 7795246 7595100 7353895
10475 7353895 7162093 6981038 6772564 6608969 6472889 6348203 6229136 6097983 5968596
10466 5968596 5810351 5677189 5537593 5420786 5286657 5195993 5064086 4919113 4784152 4686805
10456 4686805 4581215 4472465 4328284 4250520 4140365 4045945 3950730 3898522 3862115 3805673
10446 3805673 3720173 3656969 3597272 3542965 3496373 3399268 3373865 3382349 3391587 3408497 3443069 3406384
$$ packed form
10511A8468319m34855m63781m79897m68457m44584m59547m47215l98418m04267
10502A4467298l96857l98621m13933l66836l43240l49487l28849k21997k68798
10493A1378680l14910k95787l16747k99301k54323j98709j75684j45704j88722
10484I188793j83157j68231j88906k13227j86518k23682k29826k00146k41205
10475G353895j91802j81055k08474j63595j36080j24686j19067j31153j29387
10466E968596j58245j33162j39596j16807j34129r0664j31907j44973j34961r7347
10456D686805j05590j08750j44181p7764j10155r4420r5215n2208l6407n6442
10446C805673q5500o3204n9697n4307m6592r7105k5403Q484R238J6910L4572l6685
$$ plain form
10434 3406384 3352738 3351061 3349159 3343468 3404598 3501312 3604949 3702347 3811951 3957344 4171551
10423 4171551 4429995 4815097 5380467 6242751 7455841 9088460 11243848 13782967 16379377
10414 16379377 18506498 19537329 19318208 18108389 16387102 14592323 12987662 11561415
10406 11561415 10330644 9260736 8349397 7557050 6925662 6388309 6018922 5668797 5343549
10397 5343549 5059677 4802488 4502801 4245754 4002986 3751047 3567140 3430119 3269189
10388 3269189 3117261 2923871 2798197 2713012 2622264 2530030 2448742 2325318 2165971 2035683
10378 2035683 1863973 1717095 1568150 1403244 1322802 1386814 1472407 1530381 1572076 1556853
10368 1556853 1586989 1581281 1580134 1576861 1571580 1507297 1428614 1412286 1436201 1406042 1403699 1405426
$$ packed form
10434C406384n3646j677j902n691O1130R6714J03637R7398J09604J45393K14207
10423D171551K58444L85102N65370Q62284J213090J632619K155388K539119K596410
10414A6379377K127121J030831k19121j209819j721287j794779j604661j426247
10406A1561415j230771j069908r11339p92347o31388n37353l69387l50125l25248
10397E343549k83872k57189k99687k57047k42768k51939j83907j37021j60930
10388C269189j51928j93390j25674q5185r0748r2234q1288j23424j59347j30288
10378B035683j71710j46878j48945j64906q0442O4012Q5593N7974M1695j5223
10368A556853L0136n708j147l273n281o4283p8683j6328K3915l0159k343J727
$$ plain form
10356 1405426 1383692 1360002 1351234 1339691 1288434 1291280 1287219 1226344 1196912 1206609 1180886 1131118
10344 1131118 1117345 1091635 1043351 1036713 1025371 1013863 967292 939993 911687 887703 896758 912352
10332 912352 903839 876707 873273 899476 886669 914293 966074 919910 853663 803973 821701 845304
10320 845304 816831 782747 824447 821766 771503 762351 784782 814959 819620 822663 837029 841521
10308 841521 872218 931843 960224 1013963 1126989 1195540 1239795 1299782 1474824 1738377 2150085
10297 2150085 2790801 3796653 5282524 7151150 8900263 9887311 9804387 8864130 7625086
10288 7625086 6465125 5555355 4821652 4193626 3676081 3267136 2922529 2646793 2385844
10279 2385844 2172123 1988038 1865291 1796599 1705946 1617950 1529209 1424874 1365428 1288915
$$ packed form
10356A405426k1734k3690q768j1543n1257K846m061o0875k9432R697k5723m9768
10344A131118j3773k5710m8284o638j1342j1508m6571k7299k8306k3984R055J5594
10332I12352q513k7132l434K6203j2807K7624N1781m6164o6247m9690J7728K3603
10320H45304k8473l4084M1700k681n0263r152K2431L0177M661L043J4366M492
10308H41521L0697N9625K8381N3739J13026O8551M4255N9987J75042K63553M11708
10297B150085O40716J005852J485871J868626J749113R87048q2924r40257j239044
10288G625086j159961r09770p33703o28026n17545m08945l44607k75736k60949
10279B385844k13721j84085j22747o8692r0653q7996q8741j04335n9446p6513
$$ plain form
10269 1288915 1182439 1133385 1100504 1053147 1009844 963076 919927 887562 914564 921936 896207
10258 896207 851681 800661 799730 772982 744509 752810 795853 836511 827210 802760 782957 767302
10246 767302 752732 727365 716105 711530 667446 660926 676446 695122 806754 941887 1075135
10235 1075135 1231270 1353634 1332932 1267731 1185309 1118414 1008205 878309 850362 826587
10225 826587 768007 719378 658910 626897 583790 590260 609350 632411 616585 572077 562987 553980
10213 553980 501067 476363 446758 425139 395525 360986 353826 367098 379709 373633 333088 306196
10201 306196 303569 312994 273151 256382 256653 277412 271765 251403 249831 229079 243275 289823 305772
10188 305772 293336 271673 261246 300336 299152 319956 358852 313256 273676 298553 316079 315513
$$ packed form
10269A288915j06476m9054l2881m7357m3303m6768m3149l2365K7002P372k5729
10258H96207m4526n1020r31k6748k8473Q301M3043M0658r301k4450j9803j5655
10246G67302j4570k5367j1260m575m4084o520J5520J8676J11632J35133J33248
10235A075135J56135J22364k0702o5201q2422o6895j10209j29896k7947k3775
10225H26587n8580m8629o0468l2013m3107O470J9090K3061j5826m4508r090r007
10213E53980n2913k4704k9605k1619k9614l4539p160J3272J2611o076m0545k6892
10201C06196k627R425l9843j6769K71K0759n647k0362j572k0752J4196M6548J5949
10188C05772j2436k1663j0427L9090j184K0804L8896m5596l9580K4877J7526n66
$$ plain form
10176 315513 306389 285217 250203 219525 197394 218100 273022 256861 208346 222171 257898 252591
10164 252591 255469 251813 319238 342650 319435 313746 312404 299974 300913 307571 294816 279260 300898
10151 300898 334650 342300 325980 337206 366981 396051 464350 565118 678880 839635 1092801
10140 1092801 1484404 2058939 2675240 3153436 3269520 2991940 2580611 2151977 1773909
10131 1773909 1507176 1324587 1182187 1098949 1029929 947677 853888 781148 690223 652874 645225
10120 645225 610222 568123 587128 561856 511462 470870 464876 428114 410260 392966 401805 366220
10108 366220 346725 372101 393504 389813 358824 343476 331698 315570 282001 262197 255837 274055
10096 274055 295758 316695 323645 311694 278484 212112 184915 188392 226338 216000 228921 261122
$$ packed form
10176C15513r124k1172l5014l0678k2131K0706N4922j6161m8515J3825L5727n307
10164B52591K878l656O7425K3412k3215n689j342j2430R39O658j2755j5556K1638
10151C00898L3752P650j6320J1226K9775K9070O8299J00768J13762J60755K53166
10140A092801L91603N74535O16301M78196J16084k77580m11329m28634l78068
10131A773909k66733j82589j42400q3238o9020q2252r3789p2740r0925l7349p649
10120F45225l5003m2099J9005k5272n0394m0592n994l6762j7854j7294Q839l5585
10108C66220j9495K5376K1403l691l0989j5348j1778j6128l3569j9804o360J8218
10096B74055K1703K0937O950j1951l3210o6372k7197L477L7946j0338J2921L2201
$$ plain form
10084 261122 285677 264038 217017 233351 253398 267224 267084 280018 288207 287510 255058 239180
10072 239180 225738 210900 170258 158894 173340 183605 183969 178648 142584 126978 133922 138512
10060 138512 131462 128201 161103 199926 193208 196855 165334 160751 146018 131075 110911 121128
10048 121128 124918 110255 118168 162871 185069 162023 161506 209146 213267 219554 248827 249722 245333
10035 245333 232402 227021 204703 176360 184394 185665 161919 127200 83845 98779 129761 190603
10023 190603 197586 229334 219798 180305 166060 157283 180008 179338 163448 191055 231887 230830 214358
10010 214358 219974 215313 208254 190350 203121 217633 205172 211867 234962 249351 214374 166913
9998 166913 138486 165721 186511 219925 253437 257586 254962 247924 228816 229038 257325 281847 287283
$$ packed form
10084B61122K4555k1639m7021J6334K0047J3826j40J2934Q189o97l2452j5878
10072B39180j3442j4838m0642j1364J4446J0265L64n321l6064j5606O944M590
10060A38512p050l261L2902L8823o718L647l1521m583j4733j4943k0164J0217
10048A21128L790j4663P913M4703K2198k3046n17M7640M121O287K9273Q95m389
10035B45333j2931n381k2318k8343Q034J271k3746l4719m3355J4934L0982O0842
10023A90603O983L1748r536l9493j4245q777K2725o70j5890K7607M0832j057j6472
10010B14358N616m661p059j7904J2771J4512j2461O695K3095J4389l4977m7461
9998A66913k8427K7235K0790L3414L3512M149k624p038j9108K22K8287K4522N436
$$ plain form
9985 287283 289713 259543 212307 169032 171469 197468 206933 192187 203514 183085 138810 159140
9973 159140 199060 193025 200215 212742 240016 239922 234519 197012 170158 186172 218522 211806 162152
9960 162152 155816 136789 125547 131033 126054 115373 158145 214007 179472 161536 178403 184154
9948 184154 165966 178818 184567 199722 188808 179461 153827 138618 181838 208499 211563 203948
9936 203948 143886 145528 157243 130458 137820 158293 119443 119648 141531 124857 151102 161810
9924 161810 159704 152200 170982 199685 193780 159067 142544 168393 154987 154956 199494 245509 251136
9911 251136 246694 196937 193977 187050 189493 203273 194251 180160 198861 206975 235042 227670 162149
9898 162149 145933 188752 242657 254999 247502 238535 221146 221510 234573 240501 246006 250176 274007
$$ packed form
9985B87283K430l0170m7236m3275K437K5999R465j4746J1327k0429m4275K0330
9973A59140L9920o035P190J2527K7274r4n403l7507k6854J6014L2350o716m9654
9960A62152o336j9027j1242N486m979j0681M2772N5862l4535j7936J6867N751
9948A84154j8188J2852N749J5155j0914r347k5634j5209M3220K6661L064p615
9936B03948o0062J642J1715k6785P362K0473l8850K05K1883j6674K6245J0708
9924A61810k106p504J8782K8703n905l4713j6523K5849j3406l1M4538M6015N627
9911B51136m442m9757k960o927K443J3780r022j4091J8701Q114K8067p372o5521
9898A62149j6216M2819N3905J2342p497q967j7389L64J3063N928N505M170K3831
$$ plain form
9885 274007 295268 258306 264587 264098 219940 175318 202374 237703 253137 285430 240972 205492
9873 205492 192215 226919 239731 250589 251848 255416 267508 262110 255710 261189 273537 275141 251808
9860 251808 250057 244030 221884 202596 215390 221039 253534 237496 249183 256368 261406 247626 300189
9847 300189 335206 324339 300857 298906 271599 254839 239742 240503 234733 244958 290981 319674
9835 319674 357227 404836 447011 434729 427797 363809 281093 273845 301401 312394 271953 250362
9823 250362 284044 279077 273879 307568 276674 268586 287911 319113 334820 323153 336693 355144
9811 355144 316749 308615 326259 334988 332869 303643 270471 264188 236440 274243 275368 252771 236488
9798 236488 251191 283560 270741 278472 286955 304166 317496 300579 319924 323061 338850 338930 324648
$$ packed form
9885B74007K1261l6962O281m89m4158m4622K7056L5329J5434L2293m4458l5480
9873B05492j3277L4704J2812J0858J259L568J2092n398o400N479J2348J604k3333
9860B51808j751o027k2146j9288J2794N649L2495j6038J1687P185N038j3780N2563
9847C00189L5017j0867k3482j951k7307j6760j5097P61n770J0225M6023K8693
9835C19674L7553M7609M2175j2282o932o3988q2716p248K7556J0993m0441k1591
9823B50362L3682m967n198L3689l0894q088J9325L1202J5707j1667J3540J8451
9811C55144l8395q134J7644Q729k119k9226l3172o283k7748L7803J125k2597j6283
9798B36488J4703L2369j2819P731Q483J7211J3330j6917J9345L137J5789Q0j4282
$$ plain form
9785 324648 324541 316161 317924 351469 334430 313062 322409 347155 351460 374182 385477 359135 344973
9772 344973 353390 360351 350245 344079 389028 414944 375108 335128 331438 310886 301669 345263 311057
9759 311057 275523 296264 278503 281980 325229 341809 355823 330889 323516 331351 354570 376934
9747 376934 357788 330217 325150 310761 343486 353314 328465 312650 333630 358372 340073 327682
9735 327682 332627 339237 341807 320819 350352 375852 381649 342743 352954 370492 375857 395864 390410
9722 390410 388335 399421 409066 410078 420683 465600 477936 437840 405934 374418 368409 367686 387846
9709 387846 430902 388168 382833 383992 390182 367915 350403 350674 357616 392462 429635 434753 417229
9696 417229 427998 405968 411880 422823 378747 377542 380013 397285 422331 458544 495925 500783
$$ packed form
9785C24648j07q380J763L3545j7039k1368R347K4746M305K2722J1295k6342j4162
9772C44973Q417O961j0106o166M4949K5916l9836l9980l690k0552r217M3594l4206
9759C11057l5534K0741j7761L477M3249J6580J4014k4934p373P835K3219K2364
9747C76934j9146k7571n067j4389L2725R828k4849j5815K0980K4742j8299j2391
9735C27682M945O610K570k0988K9533K5500N797l8906J0211J7538N365K0007n454
9722C90410k075J1086R645J012J0605M4917J2336m0096l1906l1516o009p23K0160
9709C87846M3056m2734n335J159O190k2267j7512K71O942L4846L7173N118j7524
9696D17229J0769k2030N912J0943m4076j205K471J7272K5046L6213L7381M858
$$ plain form
9684 500783 502075 477515 459477 426052 390270 404053 437740 459273 418410 375262 367262 399223
9672 399223 408329 419992 410461 428240 475403 489617 457460 455312 444206 410015 415348 449617
9660 449617 490458 486568 456088 459130 479779 465615 475390 485082 513479 546256 576373 588997
9648 588997 574592 610644 636780 614700 582955 554635 548559 533502 552521 569127 575168 577935
9636 577935 580351 565465 557939 577875 600167 615076 593000 612925 625315 618766 626431 625865 627232
9623 627232 647218 681243 690149 666606 641095 654320 681774 728937 695760 668579 643646 639747
9611 639747 676265 698620 714310 717119 704657 729814 682441 645576 650146 695027 701937 717983
9599 717983 721406 748538 716964 743952 779218 790543 836556 843767 796134 786319 796984 770002
$$ packed form
9684E00783J292k4560j8038l3425l5782J3783L3687K1533m0863m3148q000L1961
9672C99223R106J1663r531J7779M7163J4214l2157k148j1106l4191N333L4269
9660D49617M0841l890l0480L042K0649j4164R775R692K8397L2777L0117J2624
9648E88997j4405L6052K6136k2080l1745k8320o076j5057J9019J6606O041K767
9636E77935K416j4886p526J9936K2292J4909k2076J9925J2390o549P665n66J367
9623F27232J9986L4025Q906k3543k5511J3225K7454M7163l3177k7181k4933l899
9611F39747L6518K2355J5690K809j2462K5157m7373l6865M570M4881O910J6046
9599G17983L423K7132l1574K6988L5266J1325M6013P211m7633r815J0665k6982
$$ plain form
9587 770002 741246 752645 744490 794505 816987 874240 881560 904483 937679 926258 923309 894316
9575 894316 871814 884373 893358 882459 863539 841331 870150 910289 939768 937904 961872 1018976
9563 1018976 987598 939716 943730 959988 1010466 1016579 999691 1005987 1025620 1034916 989259 954354
9551 954354 999977 1041059 1078126 1100556 1088571 1116270 1125544 1122209 1112683 1071536 1100543 1127614
9539 1127614 1113689 1115955 1154152 1200421 1209414 1210514 1210328 1217639 1270422 1309605 1291421 1274506 1274292
9526 1274292 1308810 1311939 1357592 1350192 1374551 1393257 1409543 1444531 1483062 1522727 1533975 1526698
9514 1526698 1547216 1604946 1644200 1649933 1652451 1651466 1671281 1731311 1735687 1721801 1766566 1800158
9502 1800158 1793837 1762324 1761321 1799731 1844884 1878132 1924015 1971652 2007402 1999892 1968543 1966674
$$ packed form
9587G70002k8756J1399q155N0015K2482N7253P320K2923L3196j1421k949k8993
9575H94316k2502J2559Q985j0899j8920k2208K8819M0139K9479j864K3968N7104
9563A018976l1378m7882M014J6258N0478O113j6888O296J9633R296m5657l4905
9551I54354M5623M1082L7067K2430j1985K7699R274l335r526m1147K9007K7071
9539A127614j3925K266L8197M6269Q993J100j86P311N2783L9183j8184j6915k14
9526A274292L4518L129M5653p400K4359J8706J6286L4988L8531L9665J1248p277
9514A526698K0518N7730L9254N733K518r85J9815O0030M376j3886M4765L3592
9502A800158o321l1513j003L8410M5153L3248M5883M7637L5750p510l1349j869
$$ plain form
9490 1966674 1999562 2038331 2081528 2156785 2161282 2151112 2190658 2226148 2248807 2291668 2323724 2314693
9478 2314693 2373925 2462332 2491237 2519833 2573117 2597978 2560968 2601975 2696152 2746714 2759437
9467 2759437 2784515 2839302 2892279 2928092 2928333 2965348 3035210 3089933 3126432 3174094 3253237 3296096
9455 3296096 3335337 3402900 3438607 3517186 3531889 3553714 3672549 3795530 3848422 3879337 3940926
9444 3940926 4036076 4123914 4212609 4308315 4344469 4384502 4444990 4525037 4587694 4702574 4783485
9433 4783485 4895776 4978933 5080679 5177434 5248980 5323839 5424212 5548816 5650646 5752082
9423 5752082 5876618 6031027 6190889 6303483 6458745 6608659 6704161 6823932 6985240 7158182
9413 7158182 7316957 7455910 7592711 7773731 7968800 8193443 8383788 8584776 8827356 9068326
$$ packed form
9490A966674L2888L8769M3197P5257M497j0170L9546L5490K2659M2861L2056r031
9478B314693N9232Q8407K8905K8596N3284K4861l7010M1007R4177N0562J2723
9467B759437K5078N4787N2977L5813K41L7015O9862N4723L6499M7662P9143M2859
9455C296096L9241O7563L5707P8579J4703K1825J18835J22981N2892L0915O1589
9444C940926R5150Q7838Q8695R5706L6154M0033O0488Q0047O2657J14880Q0911
9433D783485J12291Q3157J01746R6755P1546P4859J00373J24604J01830J01436
9423E752082J24536J54409J59862J12594J55262J49914R5502J19771J61308J72942
9413G158182J58775J38953J36801J81020J95069K24643J90345K00988K42580K40970
$$ plain form
9403 9068326 9267046 9461676 9742748 9995688 10221563 10464132 10715932 10966150 11262494 11532727
9393 11532727 11789687 12113287 12411975 12722461 13084148 13451489 13776476 14107158 14462420
9384 14462420 14825078 15189223 15580537 15979411 16361437 16797246 17240662 17630252 18064793
9375 18064793 18531528 19015446 19433961 19830285 20262653 20698454 21140661 21561978 22011163
9366 22011163 22431135 22845128 23274919 23701321 24103437 24427543 24777282 25081699 25379266
9357 25379266 25671658 25924353 26158894 26369631 26535803 26675500 26784228 26890452 26901582 26890940
9347 26890940 26897037 26865277 26767456 26688585 26610777 26449501 26232017 25984317 25743797 25497116
9337 25497116 25261363 24998738 24718180 24420752 24055618 23690628 23330683 23019302 22645494
$$ packed form
9403I068326J98720J94630K81072K52940K25875K42569K51800K50218K96344K70233
9393A1532727K56960L23600K98688L10486L61687L67341L24987L30682L55262
9384A4462420L62658L64145L91314L98874L82026M35809M43416L89590M34541
9375A8064793M66735M83918M18515L96324M32368M35801M42207M21317M49185
9366B2011163M19972M13993M29791M26402M02116L24106L49739L04417K97567
9357B5379266K92392K52695K34541K10737J66172J39697J08728J06224J1130j0642
9347B6890940O097l1760r7821p8871p7808j61276k17484k47700k40520k46681
9337B5497116k35753k62625k80558k97428l65134l64990l59945l11381l73808
$$ plain form
9328 22645494 22238492 21879004 21485892 21103937 20764627 20369137 19976174 19599154 19230328
9319 19230328 18893820 18514515 18132865 17777521 17455619 17142886 16805152 16460932 16137853
9310 16137853 15807659 15520646 15239424 14915236 14616855 14306927 14002056 13723238 13472766
9301 13472766 13194343 12921513 12666828 12383204 12117193 11907652 11672062 11458945 11273410
9292 11273410 11055309 10801602 10581236 10411439 10235923 10038663 9856738 9655395 9468080
9283 9468080 9260469 9053460 8899670 8800083 8639435 8476679 8338845 8202398 8060041 7884485
9273 7884485 7735412 7590203 7454342 7345730 7203832 7028862 6884576 6800918 6705109 6605232
9263 6605232 6482845 6359368 6244833 6120520 5998631 5897230 5795125 5695298 5593896 5513541
$$ packed form
9328B2645494m07002l59488l93112l81955l39310l95490l92963l77020l68826
9319A9230328l36508l79305l81650l55344l21902l12733l37734l44220l23079
9310A6137853l30194k87013k81222l24188k98381l09928l04871k78818k50472
9301A3472766k78423k72830k54685k83624k66011k09541k35590k13117j85535
9292A1273410k18101k53707k20366j69797j75516j97260j81925k01343j87315
9283I468080k07611k07009j53790r9587j60648j62756j37834j36447j42357j75556
9273G884485j49073j45209j35861j08612j41898j74970j44286q3658r5809r9877
9263F605232j22387j23477j14535j24313j21889j01401j02105r9827j01402q0355
$$ plain form
9253 5513541 5479011 5398739 5292691 5189175 5063901 4974337 4871308 4820059 4745571 4690817 4620213
9242 4620213 4556996 4495829 4448149 4346144 4247069 4211844 4207718 4138155 4050495 3961932 3906214
9231 3906214 3845328 3785122 3724382 3680262 3630767 3530825 3475247 3470099 3454958 3396739 3332791 3306491
9219 3306491 3231297 3157293 3112660 3103959 3058360 3010199 2959335 2931607 2880648 2849790 2819401 2800707
9207 2800707 2744515 2664967 2650549 2628737 2581569 2531761 2520823 2517408 2518472 2485414 2441128 2420058
9195 2420058 2377016 2308844 2275597 2279204 2269751 2252587 2224670 2180719 2166929 2136664 2105842 2075747
9183 2075747 1983449 1930158 1927502 1946389 1893415 1895696 1893411 1869831 1826296 1819667 1793880 1746143
9171 1746143 1753451 1727178 1662812 1668308 1661128 1617036 1591820 1565324 1550915 1554555 1542253 1543022 1518938
$$ packed form
9253E513541l4530q0272j06048j03516j25274q9564j03029n1249p4488n4754p0604
9242D620213o3217o1167m7680j02005r9075l5225m126o9563q7660q8563n5718
9231C906214o0886o0206o0740m4120m9495r9942n5578n148j5141n8219o3948k6300
9219C306491p5194p4004m4633q701m5599m8161n0864k7728n0959l0858l0389j8694
9207B800707n6192p9548j4418k1812m7168m9808j0938l415J064l3058m4286k1070
9195B420058m3042o8172l3247L607r453j7164k7917m3951j3790l0265l0822l0095
9183B075747r2298n3291k656J8887n2974K281k285k3580m3535o629k5787m7737
9171A746143P308k6273o4366N496p180m4092k5216k6496j4409L640j2302P69k4084
$$ plain form
9158 1518938 1485195 1464421 1426605 1390555 1387229 1415571 1416628 1440194 1456632 1435067 1422359 1412966
9146 1412966 1372160 1335839 1335012 1280093 1224725 1259984 1275836 1222946 1183491 1171001 1186448 1185498
9134 1185498 1171082 1114300 1117425 1119214 1083921 1085384 1077099 1075493 1112228 1124442 1082753 1061380
9122 1061380 1037709 1040013 1029227 1001244 983387 979455 995176 968108 949029 947560 938756 907238
9110 907238 902519 926296 905333 907137 927816 902725 889560 850614 836202 824530 859290 871421
9098 871421 850649 853251 870246 871690 866153 829229 793480 772520 745088 755789 746191 764992
9086 764992 815092 828607 810389 793348 793655 797680 775820 739897 751171 723364 730522 735722 739271
9073 739271 761031 774105 769596 743885 728343 730459 699141 676917 665646 647290 665326 662200
$$ packed form
9158A518938l3743k0774l7816l6050l326K8342J057K3566J6438k1565j2708r393
9146A412966m0806l6321q27n4919n5368L5259J5852n2890l9455j2490J5447r50
9134A185498j4416n6782L125J789l5293J463q285j606L6735J2214m1689k1373
9122A061380k3671K304j0786k7983j7857l932J5721k7068j9079j469q804l1518
9110I07238m719K3777k0963J804K0679k5091j3165l8946j4412j1672L4760J2131
9098H71421k0772K602J6995J444n537l6924l5749k0960k7432J0701r598J8801
9086G64992N0100J3515j8218j7041L07M025k1860l5923J1274k7807P158N200L549
9073G39271K1760J3074m509k5711j5542K116l1318k2224j1271j8356J8036l126
$$ plain form
9061 662200 644578 655221 641064 575701 572536 630131 648976 631969 639060 635280 597659 593731
9049 593731 616588 605312 580437 596048 591886 571412 575285 584154 566139 572992 566391 579786 594037
9036 594037 602704 575375 567167 551383 535923 540160 548969 508258 486560 490703 535311 531059 537924
9023 537924 516916 496002 449667 447053 443751 448603 458123 493995 487455 488957 488532 521695 544522
9010 544522 514875 462286 444271 467720 475969 457325 454403 452969 424253 403226 411148 421629
8998 421629 415666 446199 482453 468771 461782 416374 442734 489639 488243 451178 443567 451292 456010
8985 456010 449013 411298 386071 365205 333433 352777 400325 390642 360342 331749 365747 361151
8973 361151 355102 398790 384250 370061 363079 366376 333649 330938 377164 398647 388875 368384 337513
$$ packed form
9061F62200j7622J0643j4157o5363l165N7595J8845j7007P091l780l7621l928
9049E93731K2857j1276k4875J5611m162k0474L873Q869j8015O853o601J3395J4251
9036E94037Q667k7329q208j5784j5460M237Q809m0711k1698M143M4608m252O865
9023E37924k1008k0914m6335k614l302M852R520L5872o540J502m25L3163K2827
9010E44522k9647n2589j8015K3449Q249j8644k922j434k8716k1027P922J0481
8998D21629n963L0533L6254j3682o989m5408K6360M6905j396l7065p611P725M718
8985D56010o997l7715k5227k0866l1772J9344M7548r683l0300k8593L3998m596
8973C61151o049M3688j4540j4189o982L297l2727k711M6226K1483r772k0491l0871
$$ plain form
8960 337513 292673 294158 296750 308254 303367 268805 266772 308087 337871 325118 297432 284630
8948 284630 288924 306529 295968 292984 311699 307627 326744 359373 380467 391249 367133 352872
8936 352872 312311 278525 254855 269337 290727 307590 320384 303047 307289 319109 335111 305141
8924 305141 299999 290568 304781 291515 314530 338456 289418 263734 233429 228453 212790 217486
8912 217486 257888 295596 323608 323536 327149 347493 319634 293612 299167 293791 279987 269694 264299
8899 264299 229619 240679 233162 252398 240758 232951 248574 253463 221420 197512 192873 214685
8887 214685 228701 232476 232222 208798 186012 181878 199047 230310 254378 294894 297900 278484 263202
8874 263202 272247 224050 228335 252476 281565 321251 281294 251134 258094 304304 314832 287277
$$ packed form
8960C37513m4840J485K592J1504m887l4562k033M1315K9784j2753k7686j2802
8948B84630M294J7605j0561k984J8715m072J9117L2629K1094J0782k4116j4261
8936C52872m0561l3786k3670J4482K1390J6863J2794j7337M242J1820J6002k9970
8924C05141n142r431J4213j3266K3015K3926m9038k5684l0305m976j5663M696
8912B17486M0402L7708K8012p2L613K0344k7859k6022N555n376j3804j0293n395
8899B64299l4680J1060p517J9236j1640p807J5623M889l2043k3908m639K1812
8887B14685J4016L775k54k3424k2786m134J7169L1263K4068M0516L006j9416j5282
8874B63202R045m8197M285K4141K9089L9686l9957l0160O960M6210J0528k7555
$$ plain form
8862 287277 266381 275308 288704 296407 285312 275129 309894 358763 355113 333280 312128 309986
8850 309986 296464 265657 233045 228866 292185 304851 276975 249326 246458 253743 253933 230601 224848
8837 224848 214514 211752 197305 183745 200088 211341 230851 216784 226303 218913 213742 189539
8825 189539 187277 215130 256730 275446 221468 225341 226318 226874 236491 262736 219399 234254 273588
8812 273588 243231 251198 218528 190035 227731 222321 186157 174397 188348 215899 215812 199006 170304
8799 170304 174721 195687 192143 199386 206503 191313 153277 140351 179303 208970 203493 226055 230132
8786 230132 194950 184335 147855 157669 151727 167925 148420 103062 112692 176251 187559 195482
8774 195482 228044 221091 184559 151888 176166 202318 168834 146605 171509 204094 217410 199740
$$ packed form
8862B87277k0896Q927J3396P703j1095j0183L4765M8869l650k1833k1152k142
8850C09986j3522l0807l2612m179O3319J2666k7876k7649k868P285J90k3332n753
8837B24848j0334k762j4447j3560J6343J1253J9510j4067R519p390n171k4203
8825A89539k262K7853M1600J8716n3978L873R77N56R617K6245m3337J4855L9334
8812B73588l0357P967l2670k8493L7696n410l6164j1760J3951K7551q7j6806k8702
8799A70304M417K0966l544P243P117j5190l8036j2926L8952K9667n477K2562M077
8786B30132l5182j0615l6480R814n942J6198j9505m5358R630O3559J1308P923
8774A95482L2562o953l6532l2671K4278K6152l3484k2229K4904L2585J3316j7670
$$ plain form
8762 199740 180793 172337 206251 219565 223371 228876 246455 256608 278898 258490 206737 149937
8750 149937 173922 192521 244006 245766 223564 220220 207910 211891 201261 192886 180324 179477 173398
8737 173398 176016 152377 138542 161738 177838 193124 207058 211540 163959 132362 141015 152038
8725 152038 174602 180221 171847 164700 155288 142777 169359 167563 205572 191050 190629 185481 202687
8712 202687 204517 207892 200533 180710 162604 129811 128434 155249 207354 216050 232408 215481 192603
8699 192603 201140 205901 219910 227082 243563 219000 218740 221907 211748 228092 235449 213325 197963
8686 197963 196025 211373 197499 204365 239934 213861 167525 162765 174593 162863 162517 173479 197302
8673 197302 194402 192496 187891 192740 207438 188544 180549 159071 129725 92303 86716 112710 121345
$$ packed form
8762A99740j8947q456L3914J3314L806N505J7579J0153K2290k0408n1753n6800
8750A49937K3985J8599N1485J760k2202l344j2310L981j0630q375j2562q47o079
8737A73398K618k3639j3835K3196J6100J5286J3934M482m7581l1597Q653J1023
8725A52038K2564N619q374p147r412j2511K6582j796L8009j4522m21n148J7206
8712B02687J830L375p359j9823j8106l2793j377K6815N2105Q696J6358j6927k2878
8699A92603Q537M761J4009P172J6481k4563k60L167j0159J6344P357k2124j5362
8686A97963j938J5348j3874O866L5569k6073m6336m760J1828j1730l46J0962K3823
8673A97302k900j906m605M849J4698j8894p995k1478k9346l7422n587K5994Q635
$$ plain form
8660 121345 144920 183726 193739 186051 187617 172518 160710 164325 172780 193137 182551 168201
8648 168201 209776 245908 209472 158807 158149 159252 158543 183752 203500 194772 219215 200827 179459
8635 179459 183158 183297 219361 224300 253102 269494 254015 288136 245484 199484 200101 172061 163580
8622 163580 149295 191482 190559 193285 199656 203453 203019 203267 198691 182851 200137 233197 208647 190971
8608 190971 217327 243397 247021 239759 229113 237296 254692 284718 311276 299027 267276 268487
8596 268487 298379 327177 336671 362865 404756 413461 378649 366096 387587 433347 441068 438404
8584 438404 471482 516432 507667 448241 441619 460568 440942 422685 411579 442470 452049 416594
8572 416594 377225 359352 388624 375363 321331 304461 318721 283437 246392 236815 268076 314574
$$ packed form
8660A21345K3575L8806J0013p688J566j5099j1808L615Q455K0357j0586j4350
8648A68201M1575L6132l6436n0665o58J103p09K5209J9748q728K4443j8388k1368
8635A79459L699J39L6064M939K8802J6392j5479L4121m2652m6000O17k8040q481
8622A63580j4285M2187r23K726O371L797m34K48m576j5840J7286L3060k4550j7676
8608A90971K6356K6070L624p262j0646Q183J7396L0026K6558j2249l1751J211
8596B68487K9892K8798R494K6194M1891Q705l4812j2553K1491M5760P721k664
8584D38404L3078M4950q765n9426o622J8949j9626j8257j1106L0891R579l5455
8572D16594l9369j7873K9272j3261n4032j6870J4260l5284l7045r577L1261M6498
$$ plain form
8560 314574 284360 239314 212622 236628 230002 203374 178380 196431 208786 185711 200537 229791
8548 229791 230456 244550 239391 197582 184249 201549 224594 209747 216340 198483 192906 221919 199470
8535 199470 168080 169591 164472 156348 157507 123065 106891 122002 143942 107727 119807 133748
8523 133748 138294 181501 166670 157466 173561 175059 159388 169602 178305 154965 148976 180462 152499
8510 152499 127041 133472 95673 120596 111404 88504 114931 169081 190620 177970 150065 131828
8498 131828 158239 152532 140331 130585 95913 99964 92309 85957 101859 86081 119543 127334 136671
8485 136671 106745 95647 97946 122081 145409 128035 151452 184095 169127 166021 139411 141686
8473 141686 102474 89237 70604 114082 152890 144848 112880 89790 101634 110175 92283 115279
$$ packed form
8560C14574l0214m5046k6692K4006o626k6628k4994J8051J2355k3075J4826K9254
8548B29791O65J4094n159m1809j3333J7300K3045j4847O593j7857n577K9013k2449
8535A99470l1390J511n119q124J159l4442j6174J5111K1940l6215J2080J3941
8523A33748M546M3207j4831r204J6095J498j5671J0214Q703k3340n989L1486k7963
8510A52499k5458O431l7799K4923r192k2900K6427N4150K1539j2650k7905j8237
8498A31828K6411n707j2201r746l4672M051p655o352J5902j5778L3462P791R337
8485A36671k9926j1098K299K4135K3328j7374K3417L2643j4968l106k6610K275
8473A41686l9212j3237j8633M3478L8808q042l1968k3090J1844Q541j7892K2996
$$ plain form
8461 115279 145309 158918 159634 148169 140480 120597 90907 85893 89060 110780 116817 107510 101287
8448 101287 124078 134447 138593 82979 40634 60928 84944 72384 73891 84015 83082 89000 109611
8435 109611 102092 130913 139837 131851 84359 65309 95097 85449 67853 74116 65674 117613 146627
8422 146627 172616 177840 155427 143690 129368 87181 62390 82561 138027 149703 137950 130163
8410 130163 106164 93759 123026 134872 107832 107943 103544 141372 157868 124772 108275 117724
8398 117724 112052 93385 62587 31712 48717 65949 84772 55275 37546 43767 29219 21527
8386 21527 39035 54846 65684 92074 97384 107837 111653 114046 137793 105388 137355 152485
8374 152485 104638 56446 87673 125208 122662 138352 160972 133886 103909 116289 95900 112248
$$ packed form
8461A15279L0030J3609P16j1465p689j9883k9690n014L167K1720O037r307o223
8448A01287K2791J0369M146n5614m2345K0294K4016j2560J507J0124r33N918K0611
8435A09611p519K8821Q924p986m7492j9050K9788r648j7596O263q442N1939K9014
8422A46627K5989N224k2413j1737j4322m2187k4791K0171N5466J1676j1753p787
8410A30163k3999j2405K9267J1846k7040J11m399L7828J6496l3096j6497R449
8398A17724n672j8667l0798l0875J7005J7232J8823k9497j7729O221j4548p692
8386B1527J7508J5811J0838K6390N310J0453L816K393K3747l2405L1967J5130
8374A52485m7847m8192L1227L7535k546J5690K2620k7086k9977J2380k0389J6348
$$ plain form
8362 112248 113662 112595 117044 161265 201979 264638 299715 363195 528255 729523 930613 1110266
8350 1110266 1146941 1018539 854487 725957 646520 563642 502007 450478 394790 362317 312563
8339 312563 301495 318696 332236 307989 309332 350426 345765 315561 273277 275056 271602 196410
8327 196410 168754 172962 163430 130576 117393 142935 114526 99334 138126 201082 278763 296927
8315 296927 318917 392493 477606 612293 809899 1031517 1134849 1068693 901902 766427
8305 766427 653228 555454 451458 394969 418969 430593 369655 309266 300762 281420 261960
8294 261960 291071 284728 300842 250340 219583 211661 193494 181347 156892 156005 143672 115408
8282 115408 112419 117728 103138 119531 122090 127426 149991 170603 166638 135617 148142 137164 98308
$$ packed form
8362A12248J414j067M449M4221M0714O2659L5077O3480J65060K01268K01090J79653
8350A110266L6675j28402j64052j28530p9437q2878o1635n1529n5688l2473m9754
8339C12563j1068J7201J3540k4247J343M1094m661l0204m2284J779l454p5192
8327A96410k7656M208r532l2854j3183K5542k8409j5192L8792O2956P7681J8164
8315B96927K1990P3576Q5113J34687J97606K21618J03332o6156j66791j35475
8305G66427j13199r7774j03996n6489K4000J1624o0938o0389q504j9342j9460
8294B61960K9111o343J6114n0502l0757p922j8167j2147k4455q87j2333k8264
8282A15408k989N309j4590J6393K559N336K2565K0612l965l1021J2525j0978l8856
$$ plain form
8269 98308 118007 93855 100662 109310 83063 82942 98562 89319 94969 113172 133189 153494 165577
8256 165577 149149 123810 107042 110540 125241 156391 139884 120112 116287 99023 76199 28809
8244 28809 49865 33361 47048 33796 36666 38181 49378 42317 67437 75492 55517 30846 32902
8231 32902 38246 37924 62394 57435 59337 60077 82442 116447 87680 35361 30109 62822 72463 74373
8217 74373 57306 40242 53345 93150 120624 83328 87665 79558 65725 75693 62650 83256
8205 83256 51646 15348 22772 49931 73862 48366 -10489 -62531 -28203 26384 41205 53896
8193 53896 67931 46555 48870 15310 25761 38342 33278 43142 40575 31892 16474 20236 39086
8180 39086 75570 78544 77696 77756 75670 44833 64045 90659 91433 54307 32427 -2177 -181 8154
$$ packed form
8269I8308J9699k4152O807Q648k6247j21J5620r243N650J8203K0017K0305J2083
8256A65577j6428k5339j6768L498J4701L1150j6507j9772l825j7264k2824m7390
8244B8809K1056j6504J3687j3252K870J515J1197p061K5120Q055j9975k4671K056
8231C2902N344l22K4470m959J902P40K2365L4005k8767n2319n252L2713R641J910
8217G4373j7067j7064J3103L9805K7474l7296M337q107j3833R968j3043K0606
8205H3256l1610l6298P424K7159K3931k5496n8855n2042L4328N4587J4821J2691
8193E3896J4035k1376K315l3560J0451J2581n064R864k567q683j5418L762J8850
8180C9086L6484K974q48O0k086l0837J9212K6614P74l7126k1880l4604J996Q335
$$ plain form
8166 8154 19124 12337 18507 24990 20901 41512 50361 24549 -7321 -30331 -31551 -5498 -20347
8153 -20347 -39636 -31435 -8223 1652 18514 23560 59637 87941 69360 90719 78274 54369
8141 54369 17488 31867 65193 104477 85890 47588 42598 89315 100841 70281 19293 7281
8129 7281 13120 -4395 6173 33744 60685 68995 18131 25473 53365 84693 59496 34945 21079
8116 21079 25655 29665 28186 -1042 32820 70062 61515 43671 22434 17820 43437 43894 46601
8103 46601 61972 94572 103403 88954 64325 28473 44420 55785 71917 55087 34328 34937
8091 34937 17990 -26341 -30650 -23919 2981 32476 64599 85303 73064 27169 28088 69152 80743
8078 80743 63502 66916 41644 67763 70116 59335 24341 36704 26308 36381 71682 75346
$$ packed form
8166H154J0970o787O170O483m089K0611Q849k5812l1870k3010j220K6053j4849
8153b0347j9289Q201K3212R875J6862N046L6077K8304j8581K1359j2445k3905
8141E4369l6881J4379L3326L9284j8587l8302m990M6717J1526l0560n0988j2012
8129G281N839j7515J0568K7571K6941Q310n0864P342K7892L1328k5197k4551j3866
8116B1079M576M010j479k9228L3862L7242q547j7844k1237m614K5617M57K707
8103D6601J5371L2600Q831j4449k4629l5852J5947J1365J6132j6830k0759O09
8091C4937j6947m4331m309O731K6900K9495L2123K0704j2239m5895R19M1064J1591
8078H0743j7241L414k5272K6119K353j0781l4994J2363j0396J0073L5301L664
$$ plain form
8066 75346 48405 25375 43991 81751 58778 17750 -22280 -42637 -6754 20258 8590 -9863
8054 -9863 18724 24149 26343 26146 54217 67625 114566 118524 100119 47488 31378 15276 3639
8041 3639 28442 25264 24984 76433 99072 71939 52406 60849 67678 71675 95702 73416 34714
8028 34714 29029 33874 47232 53610 65615 89607 96843 114141 114146 113313 108396 88799 70028 72063
8014 72063 97172 127374 156270 128596 115363 98456 96917 68846 37235 56155 79926 89432
8002 89432 89980 52002 47902 31050 57000 93919 137223 134598 100638 87739 114645 124403 149852
7989 149852 172267 209573 225294 199546 175214 157581 156492 157927 142493 181622 203495 177809
7977 177809 154933 132321 159191 177531 125841 99232 116006 118918 113311 106446 71276 103883
$$ packed form
8066G5346k6941k3030J8616L7760k2973m1028m0030k0357L5883K7012j1668j8453
8054i863K8587N425K194j97K8071J3408M6941L958j8405n2631j6110j6102j1637
8041C639K4803l178k80N1449K2639k7133j9533Q443O829L997K4027k2286l8702
8028C4714n685M845J3358O378J2005K3992P236J7298Nq33m917j9597j8771K035
8014G2063K5109L0202K8896k7674j3233j6907j539k8071l1611J8920K3771R506
8002H9432N48l7978m100j6852K5950L6919M3304k625l3960j2899K6906R758K5449
7989A49852K2415L7306J5721k5748k4332j7633j089J435j5434L9129K1873k5686
7977A77809k2876k2612K6870J8340n1690k6609J6774K912n607o865l5170L2607
$$ plain form
7965 103883 104625 99162 105794 90264 126244 142692 119227 112253 113364 95306 94949 98591 111227
7952 111227 92146 108029 118727 85339 85667 130456 163969 150849 160491 181081 149376 138473
7940 138473 148546 175235 191867 187739 184917 149574 168817 188991 168716 157199 165544 136748
7928 136748 101977 102227 139425 132688 100392 72436 47753 50717 62494 90786 86342 118668 124681
7915 124681 98309 109729 65855 39869 34903 56510 83609 76751 37325 96300 107378 98892
7903 98892 91811 83206 108275 122237 143358 148987 153215 149793 151423 108953 111410 112240 121391 144971
7889 144971 155056 125896 107646 96901 51071 38326 57230 75216 91637 94912 78933 72416
7877 72416 62067 72976 52581 65149 46068 33726 26955 71085 43245 33770 73098 92432
$$ packed form
7965A03883P42n463O632j5530L5980J6448k3465o974J111j8058l57L642J2636
7952A11227j9081J5883J0698l3388L28M4789L3513j3120R642K0590l1705j0903
7940A38473J0073K6689J6632m128k822l5343J9243K0174k0275j1517Q345k8796
7928A36748l4771K50L7198o737l2296k7956k4683K964J1777K8292m444L2326O013
7915A24681k6372J1420m3874k5986m966K1607K7099o858l9426N8975J1078q486
7903I8892p081q605K5069J3962K1121N629M228l422J630m2470K457Q30R151K3580
7889A44971J0085k9160j8250j0745m5830j2745J8904J7986J6421L275j5979o517
7877G2416j0349J0909k0395J2568j9081j2342o771M4130k7840r475L9328J9334
$$ plain form
7865 92432 80748 72065 28485 -9514 -66219 -39763 11787 32496 22479 10487 34550 16975
7853 16975 14497 19244 28700 52837 52426 62641 82564 51456 8903 -49091 -13534 1242 -20843
7840 -20843 -3496 57916 71450 49266 37847 -4956 -14534 32707 60889 59840 74335 46105
7828 46105 -11286 -33909 -6360 -12695 -16855 -32357 -16905 44866 53551 51066 20156 -3354 26343
7815 26343 17122 10691 49848 51314 43314 23838 18645 34462 46836 59520 46492 8218 10639
7802 10639 8592 34541 39479 17310 -13739 -33864 -32708 -44594 -7305 -7666 -3464 -1897 24049
7789 24049 12555 2151 -16843 -37292 -60229 -31484 -7664 2897 18190 13542 13758 -14042
7777 -14042 -6496 -10639 -14487 -663 18249 21819 23238 36586 13099 5530 5767 -10911 -9237 18739
$$ packed form
7865I2432j1684q683m3580l7999n6705K6456N1550K0709j0017j1992K4063j7575
7853A6975k478M747R456K4137m11J0215J9923l1108m2553n7994L5557J4776k2085
7840b0843J7347O1412J3534k2184j1419m2803r578M7241K8182j049J4495k8230
7828D6105n7391k2623K7549o335m160j5502J5452O1771Q685k485l0910k3510K9697
7815B6343r221o431L9157J466q000j9476n193J5817J2374J2684j3028l8274K421
7802A0639k047K5949M938k2169l1049k0125J156j1886L7289l61M202J567K5946
7789B4049j1494j0404j8994k0449k2937K8745K3820J0561J5293m648K16k7800
7777a4042P546m143l848J3824J8912L570J419J3348k3487p569K37j6678J674K7976
$$ plain form
7763 18739 12342 37202 50588 57318 24103 28663 55978 51983 19574 -24307 -26820 -54755 -23371
7750 -23371 -21308 -15529 -16638 13692 26362 -18902 -21422 -8631 -27809 -51532 -37622 -23175 -41123
7737 -41123 -70670 -44775 -7293 6218 19576 42275 23140 45592 40269 27880 40859 40519
7725 40519 43190 20774 65828 60096 6665 -65534 -46731 -52581 -3165 54861 60877 31819 52142
7712 52142 63862 43086 45308 44488 27306 23290 13102 21317 33048 16490 5656 7685 -21641
7699 -21641 -26147 -35368 -59752 -30630 -19675 -6029 25472 8876 -31186 -36327 -36473 -10506 176
7686 176 -20064 -11297 31072 36248 29892 -1430 -3663 16665 6713 -21526 5167 32429 18054
7673 18054 -25552 3622 4308 2973 10041 57679 73076 74431 72954 54215 33741 47208 71573
$$ packed form
7763A8739o397K4860J3386O730l3215M560K7315l995l2409m3881k513k7935L1384
7750b3371K063N779j109L0330J2670m5264k520J2791j9178k3723J3910J4447j7948
7737d1123k9547K5895L7482J3511J3358K2699j9135K2452n323j2389J2979l40
7725D0519K671k2416M5054n732n3431p2199J8803n850M9416N8026O016k9058K0323
7712E2142J1720k0776K222q20j7182m016j0188Q215J1731j6558j0834K029k9326
7699b1641m506r221k4384K9122J0955J3646L1501j6596m0062n141j46K5967J0682
7686A76k0240Q767M2369N176o356l1322k233K0328r952k8239K6693K7262j4375
7673A8054m3606K9174O86j335P068M7638J5397J355j477j8739k0474J3467K4365
$$ plain form
7660 71573 59568 36077 1083 9659 1665 -27054 -2202 9716 -18393 -1793 -4998 -24707
7648 -24707 -7460 22444 53187 77164 23722 -7146 20225 11402 19198 12631 -12544 -45652
7636 -45652 -75731 -65837 -51851 -29333 2936 -13941 -19091 -10372 -54471 -33649 -14862 24290
7624 24290 56667 76590 86796 84401 45769 2606 -2746 15463 24116 -14923 -37354 -39656 -10564
7611 -10564 9817 9905 -2285 -46226 -47801 -51931 -9187 -15597 4028 11283 4040 23756 15759 10293
7597 10293 26874 10027 2655 9160 8217 36055 46874 54801 30804 43645 30172 19354 51215
7584 51215 85624 90112 62701 26754 -4512 40644 49767 3095 17667 32467 21601 7618
7572 7618 10955 -17941 -22310 12467 10649 -10001 -3635 -2892 -36956 24684 89622 108559 101580
$$ packed form
7660G1573j2005k3491l4994Q576p994k8719K4852J1918k8109J6600l205j9709
7648b4707J7247K9904L0743K3977n3442l0868K7371q823P796o567k5175l3108
7636d5652l0079R894J3986K2518L2269j6877n150Q719m4099K0822J8787L9152
7624B4290L2377J9923J0206k395l8632m3163n352J8209Q653l9039k2431k302K9092
7611a0564K0381Q8j2190m3941j575m130M2744o410J9625P255p243J9716p997n466
7597A0293J6581j6847p372O505r43K7838J0819P927k3997J2841j3473j0818L1861
7584E1215L4409M488k7411l5947l1266M5156R123m6672J4572J4800j0866j3983
7572G618L337k8896m369L4777j818k0650O366P43l4064O1640O4938J8937o979
$$ plain form
7559 101580 69476 73194 75982 111900 113856 63011 -7591 -17587 -12719 -34058 -40348 -35585 5480
7546 5480 24568 39661 58721 83899 65561 21236 2161 -42425 -37789 -1180 45638 52481
7534 52481 5294 -8554 -11366 -20596 -10218 -10682 -37444 -78940 -47794 -15894 -3780 556 6416
7521 6416 29958 45613 77707 99289 45695 -19072 16922 23835 31514 39902 45237 49340 34565
7508 34565 6095 4380 4096 -25321 -31824 -13447 -4759 -10695 -14328 -22575 -46002 -30808 -45032
7495 -45032 -27766 -26528 -28921 -18531 8007 14607 -13583 -24636 20441 38309 47594 68096 38467
7482 38467 19724 5675 22834 6819 -2221 15838 49159 65640 60231 26769 -17550 -12962
7470 -12962 7487 2936 13567 -10665 -11978 6327 61236 44721 18860 -10326 -11661 -23972
$$ packed form
7559A01580l2104L718K788L5918J956n0845p0602r996M868k1339o290M763M1065
7546E480J9088J5093J9060K5178j8338m4325j9075m4586M636L6609M6818O843
7534E2481m7187j3848k812r230J0378m64k6762m1496L1146L1900J2114M336N860
7521F416K3542J5655L2094K1582n3594o4767L5994O913P679Q388N335M103j4775
7508C4565k8470j715k84k9417o503J8377Q688n936l633q247k3427J5194j4224
7495d5032J7266J238k393J0390K6538O600k8190j1053M5077J7868R285K0502k9629
7482C8467j8743j4049J7159j6015r040J8059L3321J6481n409l3462m4319M588
7470a2962K0449m551J0631k4232j313J8305N4909j6515k5861k9186j335j2311
$$ plain form
7458 -23972 -3990 18228 -23648 -32965 -17827 -31347 -56253 -69377 -81151 -77351 -2585 12417
7446 12417 -24483 -39854 -21451 410 50188 51955 32315 -24062 -31430 -4254 -15547 -59196
7434 -59196 -54575 -33364 -27386 -23114 -10203 -26436 -30150 15959 105 26519 60634 40815 6617
7421 6617 5788 -22155 -7794 -13360 -3123 -9064 -49284 -53009 -39147 16211 59274 32388 -8870
7408 -8870 -38139 -49454 -29779 11702 43015 39016 15525 -31444 -38530 -4464 4393 26860 85781
7395 85781 108682 90811 66151 10012 -34328 -32000 -21026 -40185 -47538 -16971 -12830 -51991
7383 -51991 -21302 -3169 6293 -13519 -35601 -8126 25336 38334 22175 -32466 -51709 -41129
7371 -41129 6634 34169 10034 -9168 -34644 -26210 -33746 -48949 -29454 -9936 3691 135
$$ packed form
7458b3972J9982K2218m1876r317J5138j3520k4906j3124j1774L800P4766J5002
7446A2417l6900j5371J8403K1861M9778J767j9640n6377p368K7176j1293m3649
7434e9196M621K1211N978M272J2911j6233l714M6109j5854K6414L4115j9819l4198
7421F617q29k7943J4361n566J0237n941m0220l725J3862N5358M3063k6886m1258
7408h870k9269j1315J9675M1481L1313l999k3491m6969p086L4066Q857K2467N8921
7395H5781K2901j7871k4660n6139m4340K328J0974j9159p353L0567M141l9161
7383e1991L0689J8133R462j9812k2082K7475L3462J2998j6159n4641j9243J0580
7371d1129M7763K7535k4135j9202k5476Q434p536j5203J9495J9518J3627l556
$$ plain form
7359 135 -8330 -35691 -38083 -9552 -7056 -4081 10110 -4125 -9315 -25595 -4721 -6528 -4609 11438
7345 11438 -14063 -68461 -61664 -36523 -20760 -2108 21536 37582 -5036 -8046 -10607 28702
7333 28702 31183 -10446 -44864 -25089 -10704 -45440 -63717 -97802 -103843 -60474 -39402 -27422
7321 -27422 -24288 -52780 -81162 -65115 -75031 -53472 -48947 -99614 -92882 -83773 -43597 -26204 -17506
7308 -17506 -7147 -33083 -28191 -20161 -15012 -23973 -468 15509 -1731 8611 20293 22380 17878
7295 17878 -15905 6078 -8035 -23841 -13388 23879 13695 7827 -22405 10744 -9239 -41832
7283 -41832 -65820 -52743 -23661 -48866 -67393 -54280 -63880 -26846 25495 27880 5985 429
7271 429 22073 33196 45539 26488 27604 47617 25285 -17557 -51144 -16004 -40465 -53019
$$ packed form
7359A35q465k7361k392K8531K496K975J4191j4235n190j6280K0874j807J919J6047
7345A1438k5501n4398O797K5141J5763J8652K3644J6046m2618l010k561L9309
7333B8702K481m1629l4418J9775J4385l4736j8277l4085o041M3369K1072J1980
7321b7422L134k8492k8382J6047r916K1559M525n0667O732R109M0176J7393Q698
7308a7506J0359k5936M892Q030N149q961K3505J5977j7240J0342J1682K087m502
7295A7878l3783K1983j4113j5806J0453L7267j0184n868l0232L3149j9983l2593
7283d1832k3988J3077K9082k5205j8527J3113r600L7034N2341K385k1895n556
7271D29K1644J1123J2343j9051J116K0013k2332m2842l3587L5140k4461j2554
$$ plain form
7259 -53019 -18120 -51489 -61270 -24207 10353 40351 21882 3398 -2043 -21806 -8656 9451
7247 9451 7833 -39665 -35220 14193 26666 34732 52063 42518 18650 12100 31209 -1204 -31186
7234 -31186 -54515 -68493 -30849 -8889 -16114 -44342 -35478 15711 8353 -11718 -1869 9534 -21209
7221 -21209 -31168 -15122 -26615 -15669 -1957 12177 -14620 -19818 5051 24074 10636 9187
7209 9187 24315 29943 22664 230 10503 24055 1948 3791 15258 -16528 -26150 -51654 -28509
7196 -28509 29044 55274 42402 47077 37034 -14182 1646 27907 19312 23000 15243 -18915 -57765
7183 -57765 -62792 -50382 -45724 -30918 -19737 -49518 -60464 -24560 -9300 -13775 -36999 -68634
7171 -68634 -61405 -18226 5054 29520 33841 27168 11313 -9220 -30724 -7361 23897 29622 30961
$$ packed form
7259e3019L4899l3369r781L7063L4560K9998j8469j8484n441j9763J3150J8107
7247I451j618m7498M445M9413J2473Q066J7331r545k3868o550J9109l2413k9982
7234c1186k3329j3978L7644K1960p225k8228Q864N1189p358k0071R849J1403l0743
7221b1209r959J6046j1493J0946J3712J4134k6797n198K4869J9023j3438j449
7209I187J5128N628p279k2434J0273J3552k2107J843J1467l1786r622k5504K3145
7196b8509N7553K6230j2872M675j0043n1216J5828K6261q595L688p757l4158l8850
7183e7765n027J2410M658J4806J1181k9781j0946L5904J5260m475k3224l1635
7171f8634P229M3179K3280K4466M321o673j5855k0533k1504K3363L1258N725J339
$$ plain form
7158 30961 -69 -3429 42426 40089 -1949 -627 -8433 -28670 -9157 -12259 -20001 4670 10057
7145 10057 -46240 -40869 -44110 -46018 -25704 -28733 -15126 31084 42790 52034 74803 48970 18061
7132 18061 -9325 -38881 -28132 2113 3903 -25115 -17917 -2284 5891 13053 21556 -9394 -15726
7119 -15726 -19656 7170 15033 -27422 -35477 -6772 4590 42549 40762 21566 6579 -25770 -2502
7106 -2502 -19682 -42228 -40016 -10679 2459 18767 26655 3395 -16856 -165 -632 -46326 -62478
7093 -62478 -37107 -12880 -42560 -57123 -38965 -48489 -25086 -13790 -62208 -81168 -75651 -77803
7081 -77803 -49713 -33562 -47277 -58200 -46967 -15575 -135 11944 -5068 -33668 -36086 -31275
7069 -31275 -11853 29184 44165 54295 28438 12707 30744 18333 -1118 -627 12429 -545
$$ packed form
7158C0961l1030l360M5855k337m2038J322p806k0237J9513l102p742K4671N387
7145A0057n6297N371l241j908K0314l029J3607M6210J1706R244K2769k5833l0909
7132A8061k7386k9556J0749L0245J790k9018P198J5633Q175P162Q503l0950o332
7119a5726l930K6826P863m2455q055K8705J1362L7959j787j9196j4987l2349K3268
7106b502j7180k2546K212K9337J3138J6308P888k3260k0251J6691m67m5694j6152
7093f2478K5371K4227k9680j4563J8158r524K3403J1296m8418j8960N517k152
7081g7803K8090J6151j3715j0923J1233L1392J5440J2079j7012k8600k418M811
7069c1275J9422M1037J4981J0130k5857j5731J8037j2411j9451M91J3056j2974
$$ plain form
7057 -545 -36221 -23257 -10809 -14262 -10098 -10169 8420 26913 20913 28055 12070 6451 -12049 -26618
7043 -26618 -9554 -12334 -16381 -6583 -25958 -55515 -28030 -13235 -31212 -27709 -36697 -30061 -39837
7030 -39837 -24290 -762 -23192 -18608 22892 79649 87790 51728 31021 42178 20571 9645
7018 9645 44626 51193 39528 32058 31340 32553 25857 15002 16964 34745 18358 -6414 7823
7005 7823 62870 90835 74782 48776 58489 54165 33059 1338 4627 14068 23373 9290 -5482
6992 -5482 -9916 -22085 -24883 -13146 -23714 -47493 -18571 -10334 -5433 24913 26350 45381 74149
6979 74149 108084 91843 13400 18253 34210 35201 -17259 -41660 -29949 -23128 2709 14817 9616
6966 9616 1519 -15841 2320 14629 44083 47321 41685 16849 -26236 3649 23865 1603 -44985
$$ packed form
7057e45l5676J2964J2448l453M164p1J8589J8493o000P142j5985n619j8500j4569
7043b6618J7064k780m047R798j9375k9557K7485J4795j7977L503q988O636r776
7030c9837J5547K3528k2430M584M1500N6757Q141l6062k0707J1157k1607j0926
7018I645L4981O567j1665p470p18J213o696j0855J962J7781j6387k4772J4237
7005G823N5047K7965j6053k6006R713m324k1106l1721L289R441R305j4083j4772
6992e482m434j2169k798J1737j0568k3779K8922Q237M901L0346J437J9031K8768
6979G4149L3935j6241p8443M853J5957R91n2460k4401J1711O821K5837J2108n201
6966I616q097j7360J8161J2309K9454L238n636k4836m3085K9885K0216k2262m6588
$$ plain form
6953 -44985 -53062 -42372 -33212 -3571 -4029 -1418 -39350 -50098 -46805 -31190 -9935 -2967 14590
6940 14590 20384 25030 31988 23815 -185 5677 314 -8868 -51770 -75242 -51602 -27384 -4963
6927 -4963 6012 34094 -888 21551 33310 74473 80434 58514 42298 23958 2281 -9566
6915 -9566 -54342 -51936 -30280 -47977 -38731 6477 24158 11019 55438 64780 42216 16410 -25869
6902 -25869 -6977 7793 -27908 -38798 -14019 12933 12706 -2376 -18793 -30531 -26521 1563
6890 1563 35579 26333 -8251 -24589 -18766 -3774 6477 -2742 -13088 1552 24017 -6929 -25563
6877 -25563 -30510 -16740 -48816 -65715 -74945 -78970 -45842 -18929 -16478 -57433 -76504 -60705 -11205
6864 -11205 20131 -5373 -15449 -28081 -52971 -43620 -45691 -65512 -35390 -24270 -16318 -45505
$$ packed form
6953d4985q077J0690R160K9641m58K611l7932j0748L293J5615K1255O968J7557
6940A4590N794M646O958q173k4000N862n363r182m2902k3472K3640K4218K2421
6927d963J0975K8082l4982K2439J1759M1163N961k1920j6216j8340k1677j1847
6915i566m4776K406K1656j7697R246M5208J7681j3139M4419R342k2564k5806m2279
6902b5869J8892J4770l5701j0890K4779K6952k27j5082j6417j1738M010K8084
6890A563L4016r246l4584j6338N823J4992J0251r219j0346J4640K2465l0946j8634
6877b5563m947J3770l2076j6899r230m025L3128K6913K451m0955j9071J5799M9500
6864a1205L1336k5504j0076j2632k4890R351k071j9821L0122J1120P952k9187
$$ plain form
6852 -45505 -69854 -35870 -33042 -29705 -10087 -31679 -44778 2523 26986 7569 -14458 -17737
6840 -17737 -21867 -32012 -30058 -37369 -50863 -3271 33223 30322 37445 33001 -3281 -23044 -35908
6827 -35908 -73302 -55030 -89547 -99170 -57677 -22704 6464 68395 62900 39631 69329 25054
6815 25054 -24665 -50708 -58826 -72932 -3540 39446 40697 -29122 -61022 -9814 17170 -27461
6803 -27461 -68560 -55969 -13651 -4592 -40170 -70559 -78017 -87562 -61981 -18104 -17010 24995 52062
6790 52062 48222 -4653 -20736 -38015 -20165 -17761 26958 33316 15935 -24874 -36890 -23752
6778 -23752 -16607 -50742 -67059 -10247 21333 -11660 -61542 -58993 -1622 58322 84096 53922
6766 53922 15158 39671 46267 6847 1713 -11621 -16593 -1737 -31583 -20659 -21368 11868 25889
$$ packed form
6852d5505k4349L3984K828L337J9618k1592j3099M7301K4463j9417k2027l279
6840a7737m130j0145J954p311j3494M7592L6494k901P123m444l6282j9763j2864
6827c5908l7394J8272l4517r623M1493L4973K9168O1931n495k3269K9698m4275
6815B5054m9719k6043q118j4106O9392M2986J251o9819l1900N1208K6984m4631
6803b7461m1099J2591M2318R059l5578l0389p458r545K5581M3877J094M2005K7067
6790E2062l840n2875j6083j7279J7850K404M4719O358j7381m0809j2016J3138
6778b3752P145l4135j6317N6812L1580l2993m9882K549N7371N9944K5774l0174
6766E3922l8764K4513O596l9420n134j3334m972J4856k9846J0924p09L3236J4021
$$ plain form
6753 25889 25052 16608 9840 -4666 -39891 -47587 -48426 -39390 -3590 -5903 -571 3849 12494 31206
6739 31206 25486 2499 14913 20896 7337 37500 7003 -42845 2735 19138 5861 8259
6727 8259 -4289 -11994 -565 6066 21903 406 9849 21821 20843 28603 68412 99045 125164
6714 125164 125789 115496 107302 74787 57134 60856 72323 40224 56276 76192 65604 36066
6702 36066 62434 61874 44938 51293 59269 29228 -12703 -12621 -8350 6532 4997 2371 23024 19008
6688 19008 -8359 -23310 -3905 -33734 -40356 -47468 -30612 -5714 -19109 -31553 -19772 -32387
6676 -32387 -18009 -6610 -34404 -54557 -40927 -47853 -28664 -11650 -36063 -12064 12574 -11188
6664 -11188 4280 34550 50532 61951 37601 -28515 -51062 -2647 -16434 6293 12606 -7442
$$ packed form
6753B5889q37q444o768j4506l5225p696q39R036L5800k313N332M420Q645J8712
6739C1206n720k2987J2414N983j3559L0163l0497m9848M5580J6403j3277K398
6727H259j2548p705J1429O631J5837k1497R443J1972r78P760L9809L0633K6119
6714A25164O25j0293q194l2515j7653L722J1467l2099J6052J9916j0588k9538
6702C6066K6368n60j6936O355P976l0041m1931Q2M271J4882j535k626K0653m016
6688A9008k7367j4951J9405k9829o622p112J6856K4898j3395j2444J1781j2615
6676c2387J4378J1399k7794k0153J3630o926J9189J7014k4413K3999K4638k3762
6664a1188J5468L0270J5982J1419k4350o6116k2547M8415j3787K2727O313k0048
$$ plain form
6652 -7442 9998 41657 78247 52402 6917 322 -43890 -73535 -58960 -53785 -60898 -38239 5094
6639 5094 1027 -7472 -11909 -18825 25911 25695 -5431 -289 -12328 -4613 -36441 1113 11079 -17479
6625 -17479 -19002 -4655 25523 42433 19120 -15912 -26511 -39331 -52931 -16343 -9593 -19050
6613 -19050 16771 42185 15213 6372 -39851 -64423 -60461 -64623 -46227 -49354 -34964 -29039 -14337
6600 -14337 27134 71583 64876 19921 36631 73452 62760 -2281 -18383 14302 5522 20461
6588 20461 32884 22312 2405 -29822 -37793 17676 35906 14094 -19285 17268 20168 -30711
6576 -30711 -96247 -108524 -81204 -30695 -54337 -81051 -82807 -84434 -57205 -63940 -60274 -65185 -45103
6563 -45103 -20587 -8040 -51790 -101816 -47267 -5434 5107 -2372 16642 54623 24367 8349
$$ packed form
6652g442J7440L1659L6590k5845m5485o595m4212k9645J4575N175p113K2659M3333
6639E094m067q499m437o916M4736k16l1126N142j2039P715l1828L7554R966k8558
6625a7479j523J4347L0178J6910k3313l5032j0599j2820j3600L6588O750r457
6613a9050L5821K5414k6972q841m6223k4572L962m162J8396l127J4390N925J4702
6600a4337M1471M4449o707m4955J6710L6821j0692o5041j6102L2685q780J4939
6588B0461J2423j0572j9907l2227p971N5469J8230k1812l3379L6553K900n0879
6576c0711o5536j2277K7320N0509k3642k6714j756j627K7229o735L666m911K0082
6563d5103K4516J2547m3750n0026N4549M1833J0541p479J9014L7981l0256j6018
$$ plain form
6551 8349 -12300 -17262 315 958 -20469 -19164 -2738 18910 -2286 -14682 -46310 -52230 -59856
6538 -59856 -70842 -65379 -43414 -36914 -48299 -50632 -27082 -24318 -36942 -21564 -3770 -4888 -15459
6525 -15459 4536 -1057 810 1025 -12228 -34623 -49665 -54222 -61075 -29536 -47142 -91370 -95145
6512 -95145 -110442 -75736 -3537 41522 52511 38067 10374 -32328 -48301 -59327 -36222 -56122
6500 -56122 -81004 -38540 12938 4992 -4119 28484 42205 53934 49595 54408 71484 69736 30014
6487 30014 26454 26320 21189 23036 4657 -32228 -12447 -18555 -5048 47595 58272 32407 -17334
6474 -17334 -50650 -55084 -58715 -32598 14231 5261 -62741 -77642 -33710 -10580 -21776 13548
6462 13548 31436 5997 770 38309 56789 65954 61456 35691 43602 7006 -8671 -62317 -73656
$$ packed form
6551H349k0649m962J7577O43k1427J305J6426K1648k1196j2396l1628n920p626
6538e9856j0986N463K1965O500j1385k333K3550K764j2624J5378J7794j118j0571
6525a5459J9995n593J867K15j3253k2395j5042m557o853L1539j7606m4228l775
6512i5145j5297L4706P2199M5059J0989j4444k7693m2702j5973j1026K3105j9900
6500e6122k4882M2464N1478p946r111L2603J3721J1729m339M813J7076j748l9722
6487C0014l560j34n131J847j8379l6885J9781o108J3507N2643J0677k5865m9741
6474a7334l3316m434l631K6117M6829q970o8002j4901M3932K3130j1196L5324
6462A3548J7888k5439n227L7539J8480R165m498k5765P911l6596j5677n3646j1339
$$ plain form
6449 -73656 -56221 8024 44396 17445 -8843 -21719 -23942 -6375 -26499 -44121 -61769 -22314
6437 -22314 -40964 -73274 -75644 -51386 -43411 -17602 4962 15954 -17905 -6089 6012 15820
6425 15820 27936 40980 51402 41611 27811 7361 1513 1670 7536 17942 48604 42346 9864
6412 9864 -17941 -62806 -66503 -30533 9521 12245 -59142 -81632 -36871 2075 -5065 -13791 -7496
6399 -7496 3553 22679 14083 2875 18036 42081 39271 38906 59049 33742 -3551 2826 18551
6386 18551 -541 -25525 -67835 -72907 -37507 -31127 -10282 11959 44363 37335 4713 4186 26562
6373 26562 17821 4473 -1491 -22151 -68846 -58845 -39427 -32465 -42223 -63377 -57513 -45316 -18218
6360 -18218 3446 -16588 -54577 -70781 -23024 20852 7133 -14081 20253 52014 45219 2103
$$ packed form
6449g3656J7435O4245L6372k6951k6288j2876k223J7567k0124j7622j7648L9455
6437b2314j8650l2310k370K4258P975K5809K2564J0992l3859J1816J2101R808
6425A5820J2116J3044J0422r791j3800k0450n848J57N866J0406L0662o258l2482
6412I864k7805m4865l697L5970M0054K724p1387k2490M4761L8946p140q726O295
6399g496J1049J9126q596j1208J5161K4045k810l65K0143k5307l7293O377J5725
6386A8551j9092k4984m2310n072L5400O380K0845K2241L2404p028l2622n27K2376
6373B6562q741j3348n964k0660m6695J0001J9418O962r758k1154N864J2197K7098
6360a8218K1664k0034l7989j6204M7757M3876j3719k1214L4334L1761o795m3116
$$ plain form
6348 2103 -47587 -55941 -4216 18090 32595 24531 7834 11459 39104 22526 36802 28386 -414
6335 -414 -13733 -11196 -14448 -5266 -2314 -11091 -34742 -25315 -36632 -55474 -20256 -19041 -46026 -15183
6321 -15183 -2175 -10135 -19096 -59970 -76315 -53458 -43397 -92943 -74954 -38412 -21677 -20806 -61919
6308 -61919 -49583 -6158 -8620 34077 43966 13866 -32626 -54124 -41105 -20398 -11097 -19884 6157
6295 6157 -27451 -31167 -28385 -47504 -44630 -2128 32812 39869 49319 25143 43919 29272 -23688
6282 -23688 -48959 -21225 -17165 -53030 -45562 -35604 15220 44443 37360 24823 13999 8649 20823
6269 20823 37265 18438 -31051 -55113 -51097 -39362 -21025 -7699 2823 22755 19647 -952
6257 -952 -2752 25510 28318 -6182 -10116 -9819 -32849 -49292 -46165 -9231 2188 23937 38332
$$ packed form
6348B103m9690q354N1725K2306J4505q064j6697L625K7645j6578J4276q416k8800
6335d14j3319K537l252R182K952q777k3651R427j1317j8842L5218J215k6985L0843
6321a5183J3008p960q961m0874j6345K2857J0061m9546J7989L6542J6735Q71m1113
6308f1919J2336M3425k462M2697R889l0100m6492k1498J3019K0707R301q787K6041
6295F157l3608l716K782j9119K874M2502L4940P057R450k4176J8776j4647n2960
6282b3688k5271K7734M060l5865P468R958N0824K9223p083j2537j0824n350J2174
6269B0823J6442j8827m9489k4062M016J1735J8337J3326J0522J9932l108k0599
6257i52j800K8262K808l4500l934K97k3030j6443L127L6934J1419K1749J4395
$$ plain form
6244 38332 27385 35770 9344 26440 36254 33292 25710 16100 7266 -25726 -22278 -24584 -33307 -39150
6230 -39150 -48513 -51152 -57195 -38604 -8786 -22902 -48439 -84978 -49772 -12855 -4874 -1144 -14799
6217 -14799 -34739 -59251 -44690 -33916 -77631 -87221 -62088 -52978 -20950 -27195 -26739 -25586 -17045
6204 -17045 -23167 9432 16397 813 6474 43251 56228 52688 46594 51081 24970 18082 27788
6191 27788 -11160 -10002 763 11976 6558 -20748 26237 28208 26036 32069 19725 -22690 -37597
6178 -37597 -9791 -1807 -1982 -30930 -53850 -54290 -31121 -14396 28610 7131 14594 26408 22486
6165 22486 27045 14366 -45500 -37544 -18040 -20943 -15112 -7297 -35193 -31223 -30620 -38088 -26261 -45373
6151 -45373 -30130 10082 17092 46546 106574 101673 88583 70036 41801 14736 6371 22679
$$ packed form
6244C8332j0947Q385k6426J7096R814k962p582r610q834l2992L448k306q723n843
6230c9150r363k639o043J8591K9818j4116k5537l6539L5206L6917P981L730j3655
6217a4799j9940k4512J4561J0774m3715r590K5133R110L2028o245M56J153Q541
6204a7045o122L2599O965j5584N661L6777J2977l540o094M487k6111o888R706
6191B7788l8948J158J0765J1213n418k7306M6985J971k172O033j2344m2415j4907
6178c7597K7806P984j75k8948k2920m40K3169J6725M3006k1479P463J1814l922
6165B2486M559j2679n9866P956J9504k903N831P815k7896L970O03p468J1827j9112
6151d5373J5243M0212P010K9454O0028m901j3090j8547k8235k7065q365J6308
$$ plain form
6139 22679 17201 35321 42231 14997 3283 -16888 5546 -31517 -32712 17508 21628 -22568 -17147
6126 -17147 20788 30007 56831 37637 27733 37067 39705 42003 45849 74191 51816 18676 7123
6113 7123 10439 11070 26281 -1867 -65223 -45884 -13213 -1959 -32606 -33377 5288 21183 -7238
6100 -7238 -33949 -9715 -6998 -30920 -16126 -12777 -35801 -34410 -20327 -9363 -70018 -105620 -99098
6087 -99098 -26560 3035 11623 15122 -18713 -7075 8210 12465 4251 -21240 -42446 -20719 -17764
6074 -17764 -21362 13714 35163 19469 -7319 -3259 3839 -4609 -15467 2278 25421 7707 -10908
6061 -10908 -6189 29944 34514 -1999 -4191 -17162 -39385 -48118 -36368 -27444 -32633 -11914 -14686
6048 -14686 -11096 -9468 -31581 -56276 -63405 -62980 -20395 -326 4897 -26165 -14341 -20948 -57411
$$ packed form
6139B2679n478J8120O910k7234j1714k0171K2434l7063j195N0220M120m4196N421
6126a7147L7935R219K6824j9194r904R334K638K298L846K8342k2375l3140j1553
6113G123L316O31J5211k8148o3356J9339L2671J1254l0647p71L8665J5895k8421
6100g238k6711K4234K717k3922J4794L349k3024J391J4083J0964o0655l5602O522
6087i9098P2538K9595Q588L499l3835J1638J5285M255q214k5491k1206K1727K955
6074a7764l598L5076K1449j5694k6788M060P098q448j0858J7745K3143j7714j8615
6061a0908M719L6133M570l6513k192j2971k2223q733J1750Q924n189K0719k772
6048a4686L590J628k2113k4695p129M25M2585K0069N223l1062J1824o607l6463
$$ plain form
6035 -57411 -44964 24 16560 39613 9674 21474 7144 13626 38690 28018 14632 -12826
6023 -12826 -24900 -47104 -56019 -44253 -26581 -19237 -12590 -31550 -19791 10295 29782 31608 -3148
6010 -3148 6236 -13615 -58914 -41022 -12866 27701 33804 17565 24821 7812 6119 7757 -6664
5997 -6664 1691 32241 39158 22561 -1698 8376 -12813 -18747 2295 -4744 -20169 -69622 -72871
5984 -72871 -36206 4397 3660 -13380 -19612 -12151 -13220 -10221 -12341 -21921 7874 21781 9057
5971 9057 33025 38304 11133 -37250 -53557 -16814 -22197 -47647 -80399 -54529 -15262 -16689 -28695
5958 -28695 -19046 -8327 -15954 -16191 10167 10315 7163 -24059 -62748 -65650 -58423 -83077 -45849 11587
5944 11587 -10713 -38187 -19507 9119 10044 13530 1282 8405 21081 41370 20444 24686 31099
$$ packed form
6035e7411J2447M4988J6536K3053k9939J1800j4330O482K5064j0672j3386k7458
6023a2826j2074k2204q915J1766J7672P344O647j8960J1759L0086J9487J826l4756
6010c148R384j9851m5299J7892K8156M0567O103j6239P256j7009j693J638j4421
5997f664Q355L0550O917j6597k4259J0074k1189n934K1042p039j5425m9453l249
5984g2871L6665M0603p37j7040o232P461j069K999k120r580K9795J3907j2724
5971I057K3968N279k7171m8383j6307L6743n383k5450l2752K5870L9267j427j2006
5958b8695R649J0719p627k37K6358J48l152l1222l8689k902P227k4654L7228N7436
5944A1587k2300k7474J8680K8626R25L486j2248P123J2676K0289k0926M242O413
$$ plain form
5931 31099 20718 13818 -12129 10065 21225 33779 22055 -23067 -47585 -53894 -26163 -10609
5919 -10609 37701 61547 60682 37015 14220 -39789 -75843 -80025 -61839 -61376 -40559 -72046 -104478
5906 -104478 -130620 -89997 -86289 -88483 -47599 -4194 17490 40623 7731 -46293 -39260 -27865
5894 -27865 4671 64297 81690 48608 -1657 -4606 3374 21424 33364 33081 38230 -6403 -42605
5881 -42605 -26310 -76 5026 7976 -9616 14137 21999 -4423 -31858 -57199 -62641 -62792 -42866
5868 -42866 -64279 -45907 -18324 -9457 2162 2298 -12510 -5499 23150 53050 54497 38176 29888
5855 29888 26242 52293 58534 51455 12955 -5325 -26624 -28939 -21806 2868 7065 -4950 410
5842 410 15377 32442 37049 20466 9315 3765 -17668 -22696 -16912 -47259 -41433 -13037 -11804
$$ packed form
5931C1099j0381o900k5947K2194J1160J2554j1724m5122k4518o309K7731J5554
5919a0609M8310K3846q65k3667k2795n4009l6054m182J8186M63K0817l1487l2432
5906a04478k6142M0623L708k194M0884M3405K1684K3133l2892n4024P033J1395
5894b7865L2536N9626J7393l3082n0265k949P980J8050J1940k83N149m4633l6202
5881d2605J6295K6234N102K950j7592K3753P862k6422k7435k5341n442j51J9926
5868d2866k1413J8372K7583Q867J1619J36j4808P011K8649K9900J447j6321q288
5855B9888l646K6051O241p079l8500j8280k1299k315P133K4674M197j2015N360
5842D10J4967J7065M607j6583j1151n550k1433n028N784l0347N826K8396J233
$$ plain form
5829 -11804 -13830 -5247 -33946 -56526 -56751 -15414 21366 25009 24097 67744 77453 58268 -9397
5816 -9397 -48615 -38195 -8834 11417 25648 34569 44834 14782 -1536 -7452 -7246 -2343 15361
5803 15361 -24717 -43510 -26369 2078 22260 14974 -3924 -2278 -20414 -4148 3325 -9638
5791 -9638 17747 972 439 -5704 -25489 -26034 -21722 -33859 1277 -9739 -48595 -47125 -49383 -38225
5777 -38225 -20046 831 3145 -3410 -12479 -27501 -9246 25225 47483 19633 1205 -4073 -12689
5764 -12689 -20519 -49285 -37413 -31163 -18094 -14098 -21275 57 -4979 -48592 -41543 -29497 -38116
5751 -38116 -36386 -20145 -12777 25833 23210 25497 2277 -31221 -43233 -43237 -52965 -75311 -94459 -49445
5737 -49445 -14930 -22113 -47289 -46418 7960 19940 9533 9913 -15985 -36260 -21953 -21718 -40785
$$ packed form
5829a1804k026Q583k8699k2580k25M1337L6780L643r12M3647R709j9185o7665
5816i397l9218J0420K9361K0251J4231Q921J0265l0052j6318n916K06M903J7704
5803A5361m0078j8793J7141K8447K0182p286j8898J646j8136J6266P473j2963
5791i638K7385j6775n33o143j9785n45M312j2137L5136j1016l8856J470k258J1158
5777c8225J8179K0877K314o555r069j5022J8255L4471K2258k7850j8428n278q616
5764a2689p830k8766J1872O250J3069L996p177K1332n036m3613P049J2046q619
5751c8116J730J6241P368L8610k623K287k3220l3498j2012mr728k2346j9148M5014
5737d9445L4515p183k5176Q71N4378J1980j0407L80k5898k0275J4307K35j9067
$$ plain form
5724 -40785 -52057 -45798 -41417 -23435 20840 36247 29541 46674 31416 64715 55715 41993 36870
5711 36870 42218 57852 55733 -1301 -35814 -57100 -20781 -23807 -18743 -32205 -31335 -31864 -40555 -40112
5697 -40112 -21091 -43621 -69053 -37999 -52436 -28498 -14794 -11131 23383 44064 49371 -18919
5685 -18919 -61476 -46710 -27104 8600 -27921 5984 20212 29590 30580 4334 -17531 -16554 -21458
5672 -21458 -172 -24616 -12899 23357 1458 -24772 20963 25049 -7647 -41303 -23391 14336
5660 14336 29638 5113 8428 31795 -300 -59263 -64758 -90990 -102312 -72259 -72329 -56473 -29230
5647 -29230 -21168 -19327 -61032 -45519 -53191 -82044 -79668 -64095 -6572 -10105 -13858 -19043 -15542
5634 -15542 44421 80815 59516 47840 34603 3094 -6837 -11238 -9612 9216 -21925 -45613
$$ packed form
5724d0785j1272O259M381J7982M4275J5407o706J7133j5258L3299r000j3722n123
5711C6870N348J5634k119n7034l4513k1286L6319l026N064j3462Q70n29q691M43
5697d0112J9021k2530k5432L1054j4437K3938J3704L663L4514K0681N307o8290
5685a8919m2557J4766J9606L5704l6521L3905J4228R378R90k6246k1865R77m904
5672b1458K1286k4444J1717L6256k1899k6230M5735M086l2696l3656J7912L7727
5660A4336J5302k4525L315K3367l2095n8963n495k6232j1322L0053p0J5856K7243
5647b9230Q062J841m1705J5513p672k8853K376J5573N7523l533l753n185L501
5634a5542N9963L6394k1299j1676j3237l1509r931m401J626J8828l1141k3688
$$ plain form
5622 -45613 -36575 -48351 -9716 749 22253 8995 -22733 -27244 -14811 -39693 -62067 -89212
5610 -89212 -142121 -119498 -67305 -92982 -102509 -63282 -29197 -48558 -88582 -74402 -29773 -33807
5598 -33807 -38297 -40970 -36176 -67275 -38226 -23860 -36301 -54814 -47810 -61955 -78509 -76769 -49085
5585 -49085 -46567 -9887 1837 -28105 -24865 -44044 -75343 -73262 -36861 -24814 -23756 3601 -13165
5572 -13165 -50852 -81347 -58777 -10219 -6875 -124 11010 -7036 -25850 -21214 -30349 -30767 -25117
5559 -25117 -3225 41132 42005 -11095 -30288 -19630 -23688 -27645 -10946 6448 14811 17271 26578
5546 26578 55599 72648 30932 11133 27103 17292 -1028 31904 38151 13356 3596 1761 11822
5533 11822 -3558 -26734 -79739 -91770 -78703 -48004 -22155 -15912 -27171 -6117 4720 19321
$$ packed form
5622d5613R038j1776L8635J0465K1504j3258l1728m511J2433k4882k2374k7145
5610h9212n2909K2623N2193k5677r527L9227L4085j9361m0024J4180M4629m034
5598c3807m490k673M794l1099K9049J4366j2441j8513P004j4145j6554J740K7684
5585d9085K518L6680J1724k9942L240j9179l1299K081L6401J2047J058K7357j6766
5572a3165l7687l0495K2570M8558L344O751J1134j8046j8814M636r135m18N650
5559b5117K1892M4357Q73n3100j9193J0658m058l957J6699J7394Q363K460R307
5546B6578K9021J7049m1716j9799J5970r811j8320L2932O247k4795r760j835J0061
5533A1822j5380k3176n3005j2031J3067L0699K5849O243j1259K1054J0837J4601
$$ plain form
5521 19321 16259 -13772 -34644 -87165 -76346 -68274 -63438 -43806 16337 28416 6582 8920 -13730
5508 -13730 -24706 -45212 -25685 -2538 -6293 -11822 28373 34457 12327 -11874 -20930 -69530 -52390
5495 -52390 -40238 -44711 -29162 -10598 7259 -25314 -33659 -5824 11589 -8169 -27822 -46189
5483 -46189 -45331 -31492 -52952 -64035 -30351 -13065 2072 47555 61288 44474 31680 24342
5471 24342 41416 -9847 1059 49574 47193 52684 59657 67844 58672 57753 61495 58500 22931 17070
5457 17070 -4853 -7496 -2197 162 16079 33076 34005 52220 33436 -7558 20744 7266 -31282
5444 -31282 -31027 -16372 -2514 39091 51041 6574 5978 35728 23621 5151 -30384 -67727 -45375
5431 -45375 -13442 8945 28858 18405 -10828 10370 -10168 -8865 6159 18869 30246 27172
$$ packed form
5521A9321l062l0031k0872n2521J0819Q072M836J9632O0143J2079k1834K338k2650
5508a3730j0976k0506J9527K3147l755n529M0195O084k2130k4201r056m8600J7140
5495e2390J2152m473J5549J8564J7857l2573q345K7835J7413j9758j9653j8367
5483d6189Q58J3839k1460j1083L3684J7286J5137M5483J3733j6814j2794p338
5471B4342J7074n1263J0906M8515k381N491O973Q187r172r19L742k995l5569n861
5457A7070k1923k643N299K359J5917J6997R29J8215j8784m0994K8302j3478l8548
5444c1282K55J4655J3858M1605J1950m4467n96K9750j2107j8470l5535l7343K2352
5431d5375L1933K2387J9913j0453k9233K1198k0538J303J5024J2710J1377l074
$$ plain form
5419 27172 5189 -9107 -15279 -32271 -31567 -22704 -25566 -8069 -17462 -20047 -35971 -35407 -26657 -36306
5405 -36306 -13879 11266 -19166 -16373 -13745 1885 3220 13398 22272 -17296 -52884 -67583 -97451
5392 -97451 -111198 -119888 -73951 -35365 -13946 -16067 -15762 -6896 -4571 -25358 -32687 -28576 -62063
5379 -62063 -83020 -75293 -67226 -32971 -12015 -10859 -9581 -30483 -38217 -27342 -29501 3347 8677
5366 8677 -55016 -75723 -59622 -71869 -69033 -28755 -28880 -7283 18903 39749 58727 71706 45117
5353 45117 38215 33121 43724 39056 12203 40882 59402 22312 -32227 -39367 -20696 -38121 -51588
5340 -51588 -37885 -13413 -7075 -12569 -65355 -34897 -13645 -29910 -17134 -14733 -21975 -19177 25059
5327 25059 31574 -3444 -11504 22888 59532 54759 16058 -17423 9308 11659 -26779 -39305 -37954
$$ packed form
5419B7172k1983j4296o172j6992P04Q863k862J7497r393k585j5924N64Q750r649
5405c6306K2427K5145l0432K793K628J5630J335J0178Q874l9568l5588j4699k9868
5392i7451j3747q690M5937L8586K1419k121L05Q866K325k0787p329M111l3487
5379f2063k0957P727Q067L4255K0956J156J278k0902p734J0875k159L2848N330
5366H677o3693k0707J6101j2247K836M0278j25K1597K6186K0846J8978J2979k6589
5353D5117o902n094J0603m668k6853K8679J8520l7090n4539p140J8671j7425j3467
5340e1588J3703K4472O338n494n2786L0458K1252j6265J2776K401p242K798M4236
5327B5059O515l5018q060L4392L6644m773l8701l3481K6731K351l8438j2526J351
$$ plain form
5314 -37954 -15173 2643 -7939 -4502 -7253 35114 55855 62685 48179 364 -64116 -47664
5302 -47664 6659 43379 67082 69298 36975 1509 -17380 -35255 -14065 -11813 -8240 -17984 -46260
5289 -46260 -30047 -5618 -36581 -68839 -58086 -55597 -13322 18573 14805 40559 28684 20598
5277 20598 25038 20288 -13973 -34108 -40463 -30567 -37062 -26757 -25416 13843 36757 52015 18898
5264 18898 12443 -392 -37007 -48333 -37787 -5031 -2666 -15885 32178 39034 -28301 -14683
5252 -14683 20374 21087 15909 -21696 -19591 -33410 -11877 -32881 -44764 -38422 -24710 -9721 -10328
5239 -10328 -21463 -13223 23207 24744 31840 3462 3387 -596 -15459 -25208 -36837 -53444 -50774 -38289
5225 -38289 -28762 -46878 -39064 -25681 -20506 -28570 -33168 -13993 19329 8307 17152 9156 -26697
$$ packed form
5314c7954K2781J7816j0582L437k751M2367K0741O830j4506m7815o4480J6452
5302d7664N4323L6720K3703K216l2323l5466j8889j7875K1190K252L573r744k8276
5289d6260J6213K4429l0963l2258J0753K489M2275L1895l768K5754j1875q086
5277B0598M440m750l4261k0135o355R896o495J0305J341L9259K2914J5258l3117
5264A8898o455j2835l6615j1326J0546L2756K365j3219M8063O856o7335J3618
5252a4683L5057P13n178l7605K105j3819K1533k1004j1883O342J3712J4989o07
5239a0328j1135Q240L6430J537P096k8378p5l983j4863r749j1629j6607K670J2485
5225c8289R527j8116P814J3383N175q064m598J9175L3322j1022Q845p996l5853
$$ plain form
5212 -26697 -52665 -32449 -32860 -21127 -3426 -3289 -2402 12711 -10456 5732 66897 54954 70743
5199 70743 28220 -17477 29714 56972 44579 66749 54595 29684 20742 3662 3568 23005 15503
5186 15503 -21006 -76332 -82159 -21034 12733 -1356 -8910 -13082 -19368 -36245 -54120 -13531 30997
5173 30997 37313 46330 25844 9681 -41550 -40940 -6324 5099 24383 58037 62344 80001 50118
5160 50118 33621 8395 18864 29773 7052 37089 57369 27682 8497 1344 -9928 -4081
5148 -4081 9925 27695 17137 -20595 -9271 -26238 -44708 -17717 -34584 -38888 -34688 -16239
5136 -16239 -10678 -25545 -38083 -25572 -9032 27942 67645 22969 7683 13478 22437 28844 51511
5123 51511 18517 -26267 -26211 6022 39194 39838 7183 -27098 -17318 -15522 24027 42726 22358
$$ packed form
5212b6697k5968K0216m11J1733J7701J37Q87J5113k3167J6188O1165j1943J5789
5199G0743m2523m5697M7191K7258j2393K2170j2154k4911q942j7080r4J9437p502
5186A5503l6509n5326n827O1125L3767j4089p554m172o286j6877j7875M0589M4528
5173C0997O316R017k0486j6163n1231O10L4616J1423J9284L3654M307J7657k9883
5160E0118j6497k5226J0469J0909k2721L0037K0280k9687j9185p153j1272N847
5148d081J4006J7770j0558l7732J1324j6967j8470K6991j6867m304M200J8449
5136a6239N561j4867j2538J2511J6540L6974L9703m4676j5286N795Q959O407K2667
5123E1511l2994m4784N6L2233L3172O44l2655l4281R780J796L9549J8699k0368
$$ plain form
5110 22358 9751 -38560 -57783 -18376 -27685 -28291 -35794 -40594 -37669 -33469 -46509 -51574 -44488 -12985
5096 -12985 18251 -7919 -59704 -16020 24773 30496 19413 24024 -25118 -39070 -50559 -26262
5084 -26262 17091 63122 92136 70179 33058 7016 -21111 5568 -19036 -46238 -51845 -46614
5072 -46614 -47431 -60759 -76892 -71000 -14424 -32 -23639 -20486 -9377 -12037 -13789 23484 57044
5059 57044 42846 15384 26030 65827 92185 65699 42790 50112 16500 -7182 -8079 -16424 -50149
5046 -50149 -31584 -2913 -8613 -28693 -49558 -54791 -22427 -15946 -10939 -27653 18456 52089 68155
5033 68155 56343 45739 27357 -15454 -18857 -11222 14882 41934 55534 40468 -20137 -44150
5021 -44150 -25411 -20237 -4484 -21078 -9071 2444 -25948 -24553 -54522 -66618 -65088 -47838
$$ packed form
5110B2358j2607m8311j9223L9407r309o06p503m800K925M200j3040n065P086L1503
5096a2985L1236k6170n1785M3684M0793N723j1083M611m9142j3952j1489K4297
5084b6262M3353M6031K9014k1957l7121k6042k8127K6679k4604k7202n607N231
5072d6614q17j3328j6133N892N6576J4392k3607L153J1109k660j752L7273L3560
5059E7044j4198k7462J0646L9797K6358k6486k2909P322l3612k3682q97q345l3725
5046e0149J8565K8671n700k0080k0865n233L2364O481N007j6714M6109L3633J6066
5033F8155j1812j0604j8382m2811l403P635K6104K7052J3600j5066o0605k4013
5021d4150J8739N174J5753j6594J2007J1515k8392J395k9969j2096J530J7250
$$ plain form
5009 -47838 -26486 -38177 -33418 -44013 -21490 -11093 -61747 -61059 -32787 -50033 -29022 -9525
4997 -9525 12713 14789 14883 3211 -439 -42668 -67829 -47763 -30240 -11871 -9061 -31207 -20895
4984 -20895 -8665 -26845 -43092 -30945 -41932 -35095 -12457 26873 4771 -16509 6797 -2033
4972 -2033 -46002 -60285 -51885 -26387 -29061 -9833 17152 22408 36428 4660 -18321 -17801 -30692
4959 -30692 -26011 19186 34010 16990 -3087 -5482 -21383 50653 44556 934 -3290 -109 2715
4946 2715 31576 12188 -39639 -78048 -88266 -41362 -35461 -73332 -89027 -83386 -43205 -22403
4934 -22403 -36554 -26136 -32520 6712 14272 -12339 -63089 -102676 -90442 -63841 -53910 -24777
4922 -24777 -6383 -5577 6239 -3386 -2576 22849 11654 -12185 -23659 -41928 -56636 -41712 -63491
$$ packed form
5009d7838K1352j1691M759j0595K2523J0397n0654O88K8272j7246K1011J9497
4997i525K2238K076R4j1672l650m2229k5161K0066J7523J8369K810k2146J0312
4984b0895J2230j8180j6247J2147j0987O837K2638L9330k2102k1280K3306q830
4972b033m3969j4283Q400K5498k674J9228K6985N256J4020l1768k2981N20j2891
4959c0692M681M5197J4824j7020k0077k395j5901P2036o097m3622m224L181K824
4946B715K8861j9388n1827l8409j0218M6904N901l7871j5695N641M0181K0802
4934b2403j4151J0418o384L9232P560k6611n0750l9587J2234K6601R931K9133
4922b4777J8394Q06J1816r625Q10K5425j1195k3839j1474j8269j4708J4924k1779
$$ plain form
4909 -63491 -103927 -75326 -57285 -52725 -77505 -83168 -88065 -130998 -89554 -51838 -57620 -80312 -77549
4896 -77549 -33625 -570 -9479 -21353 -38448 -46036 -68971 -29742 -37978 -39173 -38226 -24480 -37936
4883 -37936 -29581 -8034 -31836 17135 62858 39703 21447 26646 7368 2409 -7353 -51717 -39686
4870 -39686 752 11806 -3623 31566 49629 45928 693 -35740 725 23123 14473 -38014
4858 -38014 10930 22879 -39249 -17907 22088 6368 -17394 -21560 -12791 41344 18860 -9056
4846 -9056 -48494 -33558 -27174 19232 74748 61671 14735 6193 22657 37835 26142 34915 31113
4833 31113 40528 40475 462 -14648 24383 37241 19747 7754 -23843 -42731 5867 14925 34608
4820 34608 10954 -29021 -29016 -46967 -67219 -90617 -76185 -45898 585 -6299 1417 -1897 6058
$$ packed form
4909f3491m0436K8601J8041M560k4780n663m897m2933M1444L7716n782k2692K763
4896g7549M3924L3055q909j1874j7095p588k2935L9229q236j195R47J3746j3456
4883c7936Q355K1547k3802M8971M5723k3155j8256N199j9278m959r762m4364J2031
4870c9686M0438J1054j5429L5189J8063l701m5235l6433L6465K2398q650n2487
4858c8014M8944J1949o2128K1342L9995j5720k3762m166Q769N4135k2484k7916
4846i056l9438J4936O384M6406N5516j3077m6936q542J6464J5178j1693Q773l802
4833C1113R415n3m0013j5110L9031J2858j7494j1993l1597j8888M8598R058J9683
4820C4608k3654l9975Nj7951k0252k3398J4432L0287M6483o884P716l314P955
$$ plain form
4807 6058 4282 -15483 -26175 -38682 -21883 -2314 6328 -12203 -47495 -49172 -24276 -3500 1
4794 1 -20819 -5458 960 17915 28625 32950 10920 -9999 -15922 -36316 -44251 -26381 -43063
4781 -43063 -11775 2668 28163 46705 33687 4161 105 -11329 13226 12261 25188 69977
4769 69977 41359 6974 -21082 -18921 1932 5305 -21433 -63383 -78318 -59685 -36125 1054
4757 1054 -754 -10244 -32610 -39605 -8990 -88 -21991 -23911 -53149 -87711 -106631 -65119 -41697
4744 -41697 -42830 -36627 -10963 -16170 19753 19896 -8553 -15478 -33296 -6963 18892 -325 6019
$$ packed form
4807F058j776j9765j0692j2507J6799J9569Q642j8531l5292j677K4896K0776L501
4794Ak0820J5361O418J6955J0710M325k2030k0919n923k0394p935J7870j6682
4781d3063L1288J4443K5495J8542j3018k9526m056j1434K4555r65J2927M4789
4769F9977k8618l4385k8056K161K0853L373k6738m1950j4935J8633K3560L7179
4757A054j808r490k2366o995L0615Q902k1903j920k9238l4562j8920M1512K3422
4744d1697j133O203K5664n207L5923J43k8449o925j7818K6333K5855j9217O344
$$ [...]
##END NTUPLES=NMR SPECTRUM
##END=
