##TITLE=Analysis number 320687
Compound Code cc 48303
Book Reference 196/167
Project Code adrs
Chemist Name jimp
##JCAMPDX= 6.0         $$ Bruker NMR JCAMP-DX V2.0
##DATA TYPE= NMR SPECTRUM
##DATA CLASS= NTUPLES
##ORIGIN= Bruker BioSpin GmbH
##OWNER= nmr
$$ XWIN-NMR		Version 3.5
$$ Wed Jul  5 13:57:48 2006 GMT Daylight Time (UT+1h)  MAYBRIDGE\nmr@NMR_250MHZ
##.OBSERVE FREQUENCY= 250.131544655141
##.OBSERVE NUCLEUS= ^1H
##.ACQUISITION MODE= SIMULTANEOUS (DQD)
##.ACQUISITION SCHEME= undefined
##.AVERAGES= 16
##.DIGITISER RES= 18
##SPECTROMETER/DATA SYSTEM= dpx250
##.PULSE SEQUENCE= zg30
##.SOLVENT NAME= CDCl3
##.SHIFT REFERENCE= (INTERNAL, CDCl3, 0, 16.522)
##AUDIT TRAIL= $$ (NUMBER, WHEN, WHO, WHERE, WHAT)
$$ ##TITLE= Audit trail, XWIN-NMR		Version 3.5
$$ ##JCAMPDX= 5.01
$$ ##ORIGIN= Bruker BioSpin GmbH
$$ ##OWNER= nmr
$$ C:\u/data/dgb/nmr/ADRS/2350/pdata/1/auditp.txt
$$ ##AUDIT TRAIL=  $$ (NUMBER, WHEN, WHO, WHERE, WHAT)
(   1,<2006-07-05 13:57:18.35 +100>,<MAYBRIDGE\nmr>,<NMR_250MHZ>,
      <created by zg, POWCHK disabled, PULCHK disabled
       configuration hash MD5:
       E2 DF 36 D8 04 B2 41 60 5A D7 A3 38 5A 4B D0 FE
       data hash MD5: 64K
       28 A9 3B DC C5 5B 2E A5 37 D2 66 83 70 98 C6 BF>)
(   2,<2006-07-05 13:57:31.91 +100>,<MAYBRIDGE\nmr>,<NMR_250MHZ>,
      <Start of raw data processing
       ef LB = 0.3 FT_mod = 6 PKNL = 1 SI = 32K 
       data hash MD5: 32K
       C9 25 4A E0 A8 04 D7 9C 08 5B E4 CB 11 5D B3 4D>)
(   3,<2006-07-05 13:57:34.28 +100>,<MAYBRIDGE\nmr>,<NMR_250MHZ>,
      <apk 
       data hash MD5: 32K
       E5 D2 67 01 17 78 D5 53 1B DA 2C 50 38 DE D0 A0>)
(   4,<2006-07-05 13:57:39.33 +100>,<MAYBRIDGE\nmr>,<NMR_250MHZ>,
      <abs ABSG = 5 
       data hash MD5: 32K
       76 6E 56 4F E4 37 6D 6D 01 70 87 60 1A EC B0 4F>)
$$ ##END=
$$ 
$$ hash MD5
$$ 43 00 C1 46 49 0E 32 5B 49 BD 27 8E 33 DE 82 F7
##$RELAX= 
##$RELAX= 
##$RELAX= 
##$RELAX= 
##$RELAX= 
##$RELAX= 
##$RELAX= 
$$ Bruker specific parameters
$$ --------------------------
##$DU= <C:\u>
##$EXPNO= 2350
##$NAME= <ADRS>
##$PROCNO= 1
##$TYPE= <nmr>
##$USER= <dgb>
##$AMP= (0..31)
100 100 100 100 100 100 100 100 100 100 100 100 100 100 100 100 100 100 
100 100 100 100 100 100 100 100 100 100 100 100 100 100 
##$AQSEQ= 0
##$AQ_mod= 3
##$AUNM= <au_zg>
##$AUTOPOS= <37 >
##$BF1= 250.13
##$BF2= 250.13
##$BF3= 250.13
##$BF4= 250.13
##$BF5= 500.13
##$BF6= 500.13
##$BF7= 500.13
##$BF8= 500.13
##$BYTORDA= 1
##$CFDGTYP= 0
##$CFRGTYP= 5
##$CHEMSTR= <none>
##$CNST= (0..31)
1 1 145 1 1 1 1 1 1 1 1 1 1 1 1 1 1 1 1 1 1 1 1 1 1 1 1 1 1 1 1 1 
##$CPDPRG= <>
##$CPDPRG1= <>
##$CPDPRG2= <>
##$CPDPRG3= <>
##$CPDPRG4= <mlev>
##$CPDPRG5= <mlev>
##$CPDPRG6= <mlev>
##$CPDPRG7= <mlev>
##$CPDPRG8= <mlev>
##$CPDPRGB= <>
##$CPDPRGT= <>
##$D= (0..31)
0 1 0 0 0 0 0 0 0 0.06 0 0 0 0 0 0 0.0002 0 0 0 0 0 0 0 0 0 0 0 0 0 0 
0 
##$DATE= 1152104237
##$DBL= (0..7)
120 120 120 120 120 120 120 120 
##$DBP= (0..7)
150 150 150 150 150 150 150 150 
##$DBP07= 0
##$DBPNAM0= <>
##$DBPNAM1= <>
$$ [...]
##$SUBNAM7= <"">
##$SUBNAM8= <"">
##$SUBNAM9= <"">
##$SW= 20.6930455092707
##$SWIBOX= (0..15)
0 0 3 0 0 0 0 0 0 0 0 0 0 0 0 0 
##$SW_h= 5175.983436853
##$TD= 65536
##$TD0= 1
##$TE= 295.16
##$TE2= 300
##$TE3= 300
##$TEG= 300
##$TL= (0..7)
0 120 120 120 120 120 120 120 
##$TP= (0..7)
150 150 150 150 150 150 150 150 
##$TP07= 0
##$TPNAME0= <>
##$TPNAME1= <>
##$TPNAME2= <>
##$TPNAME3= <>
##$TPNAME4= <>
##$TPNAME5= <>
##$TPNAME6= <>
##$TPNAME7= <>
##$TPOAL= (0..7)
0.5 0.5 0.5 0.5 0.5 0.5 0.5 0.5 
##$TPOFFS= (0..7)
0 0 0 0 0 0 0 0 
##$TUNHIN= 0
##$TUNHOUT= 0
##$TUNXOUT= 0
##$USERA1= <user>
##$USERA2= <user>
##$USERA3= <user>
##$USERA4= <user>
##$USERA5= <user>
##$V9= 5
##$VALIST= <valist>
##$VCLIST= <CCCCCCCCCCCCCCC>
##$VD= 0
##$VDLIST= <DDDDDDDDDDDDDDD>
##$VPLIST= <PPPPPPPPPPPPPPP>
##$VTLIST= <TTTTTTTTTTTTTTT>
##$WBST= 1024
##$WBSW= 4
##$XGAIN= (0..3)
0 0 0 0 
##$XL= 0
##$YL= 0
##$YMAX_a= 488963
##$YMIN_a= -651171
##$ZGOPTNS= <>
##$ZL1= 120
##$ZL2= 120
##$ZL3= 120
##$ZL4= 120
##$ABSF1= 16.522
##$ABSF2= -4.171173
##$ABSG= 5
##$ABSL= 3
##$ALPHA= 0
##$AQORDER= 0
##$ASSFAC= 0
##$ASSFACI= 0
##$ASSFACX= 0
##$ASSWID= 0
##$AUNMP= <proc_1d>
##$AZFE= 0.1
##$AZFW= 0.1
##$BCFW= 0
##$BC_mod= 0
##$BYTORDP= 0
##$COROFFS= 0
##$CY= 12.5
##$DATMOD= 1
##$DC= 0
##$DFILT= <>
##$DTYPP= 0
##$F1P= 14.0000005364418
##$F2P= -0.99999901652339
##$FCOR= 0.5
##$FTSIZE= 32768
##$FT_mod= 6
##$GAMMA= 0
##$GB= 0
##$INTBC= 1
##$INTSCL= 1
##$ISEN= 128
##$LB= 0.3
##$LEV0= 0
##$LPBIN= 0
##$MAXI= 10000
##$MC2= 0
##$MEAN= 0
##$ME_mod= 0
##$MI= 0
##$NCOEF= 0
##$NC_proc= -2
##$NLEV= 6
##$NOISF1= 0
##$NOISF2= 0
##$NSP= 0
##$NTH_PI= 0
##$NZP= 0
##$OFFSET= 16.522
##$PC= 1
##$PHC0= 160.8089
##$PHC1= 7.962377
##$PH_mod= 1
##$PKNL= yes
##$PPARMOD= 0
##$PSCAL= 4
##$PSIGN= 0
##$REVERSE= no
##$SF= 250.13
##$SI= 32768
##$SIGF1= 0
##$SIGF2= 0
##$SINO= 400
##$SIOLD= 32768
##$SREGLST= <1H.CDCl3>
##$SSB= 0
##$STSI= 32768
##$STSR= 0
##$SW_p= 5175.98343685301
##$SYMM= 0
##$S_DEV= 0
##$TDeff= 65536
##$TDoff= 0
##$TI= <Analysis number 999999
Compound Code 99
Book Reference 9
Project Code 9>
##$TILT= no
##$TM1= 0
##$TM2= 0
##$TOPLEV= 0
##$USERP1= <user>
##$USERP2= <user>
##$USERP3= <user>
##$USERP4= <user>
##$USERP5= <user>
##$WDW= 1
##$XDIM= 32768
##$YMAX_p= 406256766
##$YMIN_p= -55194
$$ End of Bruker specific parameters
$$ ---------------------------------
##NTUPLES= NMR SPECTRUM
##VAR_NAME=  FREQUENCY,     SPECTRUM/REAL,   SPECTRUM/IMAG
##SYMBOL=    X,             R,               I
##VAR_TYPE=  INDEPENDENT,   DEPENDENT,       DEPENDENT
##VAR_FORM=  AFFN,          ASDF,            ASDF
##VAR_DIM=   32768,         32768,           32768
##UNITS=     HZ,            ARBITRARY UNITS, ARBITRARY UNITS
##FACTOR=    0.157963299565203, 1,           1
##FIRST=     4132.6476996994, 0,             0
##LAST=      -1043.33573715361, 0,           0
##MIN=       -1043.33573715361, -55194,      0
##MAX=       4132.6476996994, 406256766,     0
$$ Real data points
##PAGE= N=1
##DATA TABLE= (X++(R..R)), XYDATA
$$ [...]
23973 -527 5050 8943 -1199 -3246 -4305 -3617 -15391 -14164 8461 21571 18423 3423 -1334 -1048
23959 -1048 -1972 17108 18508 14739 2672 3772 539 7724 155 -6717 -13611 -6880 -5609 -9722
23945 -9722 -7316 -11116 -14003 -12002 -14994 -14121 -1213 6019 4618 5164 2274 3136 2647 5517 -1076
23930 -1076 -2075 3243 16962 2592 -11475 -7734 3260 10680 10102 -2900 -16541 -21112 -12340 -21587
23916 -21587 -38292 -44907 -26921 -18073 -3440 1980 -5887 849 300 -16528 -35201 -29943 -35320
23903 -35320 -36449 -24400 -557 4487 9889 18520 10243 3594 6535 20806 6570 -4090 -11595
23890 -11595 -11487 -16199 -14504 -13523 -16865 -27627 -13324 -15800 -12374 -8011 -4140 8431 909 -4701
23876 -4701 -4908 -5850 -2840 -6032 4258 3728 -15949 -35150 -32252 -22909 -9386 1251 19041 14936
23862 14936 2536 -2328 -3623 6172 2976 -1231 -11197 -11353 -8962 -14324 -13272 -14645 1937 8408
23848 8408 -873 -3739 8233 15972 8930 -719 -11891 -5508 5795 1501 -18185 -9434 -10664 -10839
23834 -10839 -8367 -9770 -8182 -12969 -27322 -23444 -13042 -592 1981 3309 -1980 -2556 -880 -690
23820 -690 -2839 4032 -1083 4203 15204 13992 18422 12723 10882 2984 3677 2817 7928 3804 -7018
23805 -7018 -9725 -5877 -1428 1410 -13756 -5011 7620 10626 5274 -5268 -17969 -11449 -14908 -23016
23791 -23016 -18305 -449 7085 14391 14630 -323 -23398 -21122 -23209 -21101 5493 5344 1696 4239
23777 4239 8869 5842 -1652 -7341 -6474 -10568 -14753 -14783 4428 31214 31958 30468 30436 20782 12665 14351
23761 14351 -2466 -14682 -7976 -2102 -4038 9070 -613 12115 9345 6763 -2696 -2715 4299 -6401
23747 -6401 -2405 12303 21023 13090 -3120 -12459 -8185 35 720 -11000 -347 4246 2502 -1423
23733 -1423 -11706 -14182 -24465 -31084 -11266 -1625 8532 11460 2402 3249 3736 1156 -10926 -3206
23719 -3206 15138 2970 -3951 1934 10330 4530 -8349 834 3242 -2670 9818 19683 14722 10517
23705 10517 6135 884 -1430 2698 -2768 1178 7705 -5631 -3643 6177 727 -15076 -7242 7831
23691 7831 2033 470 -7758 -2221 1639 -5173 8854 2142 -2267 -17533 -19509 -10602 -15983 -7365
23677 -7365 -10724 -16731 -20287 -18545 -23718 -11202 -8578 -13222 -11439 -16560 -20133 -30714 -19521 -17310
23663 -17310 -13381 4389 1065 -2190 -1041 9163 13689 11561 407 8080 11806 13498 13791 8818
23649 8818 5345 12991 15701 17868 14601 5778 7541 8311 2105 9 10986 9572 5811 -9730
23635 -9730 -15974 -26125 -22456 -14549 -3909 -1604 -1141 -9481 -9989 9380 5529 949 -3663 -14915
23621 -14915 -26472 -27782 -19967 -14885 -4072 -801 -4287 -3431 -7977 -10291 -5754 6471 3565 6803
23607 6803 152 -3336 -10535 -8515 9753 19855 6694 844 4133 -3647 -2229 -9033 -11838 -5878
23593 -5878 -1349 -3550 4006 -2675 -16321 -12093 -2893 -10492 -21321 -15135 -7202 -4723 -17499 -28820
23579 -28820 -30683 -25578 -12380 -4931 -16551 -12000 -14783 -11089 -10478 -7608 -4701 -15373 -2408 18554
23565 18554 20953 24189 21931 10116 -9634 -23892 -11467 11399 18371 7424 -1041 -8268 -10704
23552 -10704 -8361 -11112 -5676 8633 6796 -4124 -3439 -12442 -7010 5866 9809 3626 -3607 -2471
23538 -2471 -4369 -15460 -5189 8462 -955 -4207 -12282 -18951 -12337 -7489 -943 -2335 4560 507
23524 507 -12459 1153 6496 -6655 -6738 -2125 -1823 -13480 -756 5913 -3007 -7853 -7132 -1961 983
23509 983 7678 5751 5374 6343 6167 10031 13098 11264 4780 -2305 2315 -2832 -7236 -3872 -13938
23494 -13938 -15182 -14775 -3191 -15161 -17589 -19048 -12554 -10421 -8844 -13800 -22316 -19976 -11433 6688
23480 6688 6617 -12783 -15007 -10154 -16247 -24893 -18377 -7938 -8760 -17915 -13645 764 13853 14592 11113
23465 11113 16051 32513 18298 4383 4215 11746 9995 11144 18478 16273 25678 35158 23027 8318
23451 8318 12083 19424 14587 4232 6026 2692 -18286 -15617 -12137 -4231 -7317 -7306 3917 9540
23437 9540 4987 -3968 -26081 -19603 -16426 -19258 -12613 -3752 -11462 -27915 -41012 -43369 -26890 -11179
23423 -11179 -5671 1956 19468 16809 5844 904 -1524 -3436 3516 3452 1069 4765 12985 7661
23409 7661 1142 15032 16692 6974 -7755 -13483 -3814 6369 8460 10118 19374 6866 -13186
23396 -13186 -14576 995 19852 18674 12575 17566 20515 15132 7062 1915 4341 1932 4245 22462
23382 22462 30494 17709 6823 -8171 -5540 -3711 899 -6438 -8473 -6207 -7429 -28776 -35914
23369 -35914 -24119 -9311 -12998 -16580 -6505 4558 6180 1046 -10146 -20394 -19624 -1409 13783
23356 13783 13013 13638 7170 6740 1514 11925 5990 2100 10084 14905 12437 135 -10896 -13204
23342 -13204 -8989 895 4762 1030 -10516 -17015 -14625 -6789 -8756 -619 -13637 -22150 -22386 -17160
23328 -17160 -8926 3923 16781 14037 -5879 8671 5141 -8957 -876 -1111 -4984 5946 -3597
23315 -3597 -3782 -2133 -4631 577 -458 11731 21026 7004 -13969 -21734 -19139 -14048 348 18773
23301 18773 -5319 -25969 -24489 -14708 -27930 -42004 -34946 -22253 -18613 -13825 -9309 -308 -10438
23288 -10438 -20391 -31913 -18366 -4766 -6585 -12293 -12825 -5399 -13553 -1525 13329 1156 1537
23275 1537 3518 1462 -11316 -8899 -3640 -479 7484 478 -9647 -9363 -6691 -8817 -1034 8579
23261 8579 15956 31739 20664 1894 3183 10226 12526 -3072 -13613 -5205 -4771 -15727 -5468
23248 -5468 -707 -2259 1684 5760 3976 182 -469 -8819 -3627 -5613 -21167 -27670 -13516 1777
23234 1777 808 -7462 -21772 -20928 -9809 -4705 -6857 -14548 -15193 -14754 -5605 6433 -871 -1632 9745
23219 9745 983 6998 12390 13293 16912 8974 5879 4239 -1900 -9742 -8774 10082 9258 681 -2824
23204 -2824 -1469 -21361 -12992 5931 184 -4398 5827 12153 2197 -11221 -7569 -1281 -20468
23191 -20468 -26691 -35786 -39132 -27371 -20336 -1384 7866 269 8372 18936 17918 9809 2671 4843
23177 4843 6064 -105 -7993 -18390 -14932 -6778 -3765 -9666 -15826 -5133 -7143 -27512 -20877 -16619
23163 -16619 -11886 -10883 -13573 -17084 -18137 -21207 -3948 5718 -1645 4669 -1457 -12521 -23351 -30481
23149 -30481 -19720 -16733 -17218 -29382 -26907 -14208 -13559 -7195 10112 10941 -5260 3371 9823 11346
23135 11346 11795 -4363 -1994 9209 18736 9661 6056 7086 6385 11016 11411 -64 2618 3246 -5977
23120 -5977 -8519 -6142 -990 -1120 -7087 -13827 -12331 -13225 -4237 -8311 -11032 7594 19011 10398 -2395
23105 -2395 1689 -389 -15603 -12576 -6688 -7737 -11047 -14021 -4334 198 -18941 -31160 -23063 -5717
23091 -5717 8500 15513 17736 17105 10340 4330 1261 2637 -1010 -1416 5663 13718 18644 18112 5474
23076 5474 -6526 -11774 13884 25693 31506 20407 8575 10341 1496 5973 15088 17062 14814
23063 14814 6043 -6023 -20253 -7495 1580 -6706 -13662 -16238 -9125 -1602 9212 5108 696
23050 696 -7034 185 5631 3448 -9472 -36926 -27711 -5034 -4545 5128 5119 8923 5458 4798 11203
23035 11203 11370 -6577 -16844 -13461 -11077 -1778 -362 2492 -39 -7355 -13748 -16291 -14335 -1945
23021 -1945 6661 5299 -1378 -10681 -10307 -2237 -1093 -7230 -11795 6930 13931 -1621 -19411 -31559
23007 -31559 -27192 -31165 -24932 -13049 8033 9187 2054 -4352 -7532 -7156 -5090 943 -4858 -6340
22993 -6340 -613 -2166 -3537 4222 -4698 -4256 10847 14346 23814 18253 2075 -5047 7740 -1001
22979 -1001 -4694 -1334 -916 -776 -19096 -27522 -23956 -13694 -19907 -19790 -17098 -5652 2277 8458 6644
22964 6644 488 9198 7222 -14657 -23682 -7963 -8397 -11656 -5941 -4345 -933 -1806 -10546 -12863 -7439
22949 -7439 -10828 -7589 10498 26087 21822 -2290 -16671 -10666 -13761 -15052 -8764 -7431 -7929 -5791
22935 -5791 -20689 -37314 -30783 -19962 -15907 -6420 -2859 4290 -1135 -4752 -15415 -17481 -13362 -14064
22921 -14064 -13634 -16013 -8905 -7610 -2792 -10088 -13126 2411 -1356 -3231 -4421 4180 13780 232
22907 232 -545 -7430 -17608 -14630 -5342 7736 4846 -5920 -1336 7325 2609 -2473 -722 3966
22893 3966 7265 4875 -4559 3814 22320 16413 3781 6849 5134 3893 4336 10715 -1679 -4195
22879 -4195 -395 3236 1166 327 4576 10481 11559 2848 -7113 -9367 -7188 -12543 -5214 190 -2927
22864 -2927 4609 1597 -8636 -19961 -18308 -15257 -6416 -10810 -18988 -27469 -25808 -26106 -21839 -5027
22850 -5027 -475 -4162 -3234 -2286 -6624 -3464 -4330 6505 6203 -3385 3930 1677 -5993 -7794 -6505
22835 -6505 -8029 6734 9931 10123 4924 45 1639 -7713 -8884 1647 3562 16356 29536 30399
22821 30399 20239 13058 7532 2113 11007 9989 9359 23076 35842 36748 31699 17872 1112 -8187
22807 -8187 5534 -1279 -7544 -2749 11107 21685 26342 14413 -788 -3126 -6833 -12500 -5985
22794 -5985 -7480 -10343 -11314 -13632 -19973 -18726 -18157 -21187 -19441 -22845 -38656 -34579 -26052 -20734 -14130
22779 -14130 -17476 -16484 2267 7967 3985 6561 -2210 -8683 -22149 -21162 -17311 4171 -1409 -3620
22765 -3620 -144 -1798 8175 17449 2235 -17454 -13654 1454 -5558 -13787 -11391 -11945 -17327 -21862
22751 -21862 -17843 -19665 -25516 -15657 -10308 -5133 -7798 -7877 -4100 -486 -3260 -15302 -10573 -4443 -18182
22736 -18182 -17805 -6199 5868 7978 -8916 -19155 -24108 -34899 -34194 -8130 -7229 -16532 -757
22723 -757 5148 -8821 -6139 -13241 -6661 -17320 -30462 -31714 -27089 -25333 -16608 -2471 -13818 -21636
22709 -21636 -19940 -7593 -7671 -10564 -11763 -17186 -25508 -37075 -34667 -18223 -11378 -3791 5078 9098
22695 9098 -3011 -10563 -8796 -3993 2368 10487 7630 -285 7108 3610 5377 5688 -5516 -11074
22681 -11074 -8032 3583 -10644 -13067 -21034 -23037 -11933 11316 826 -11231 -5442 5617 11631
22668 11631 4032 -4728 -14617 -8648 1680 12540 16111 14590 14733 13675 9967 13671 12668 17463
22654 17463 26842 26232 9167 2429 -9056 5177 7424 5529 -4727 -17581 -29331 -29749 -22148
22641 -22148 -4668 1031 4180 -14 5098 8011 -3155 3056 776 5056 4973 -5423 8298 15399
22627 15399 14253 17093 25123 24574 16107 2562 -6245 -7157 -8098 -9643 -16793 -8435 -8940 -5983 -8750
22612 -8750 -15467 -10158 -10110 -4108 7574 392 3251 7606 -3968 -3464 -8004 -20886 -18362 -11468 -424
22597 -424 -9898 -6723 -7901 -9318 -11251 5276 17519 12798 -15316 -17155 -21898 -29503 -15553 -5739
22583 -5739 -9243 -12411 -10595 -12785 -2217 2871 -7602 -2775 -1167 -4032 -495 -5956 -16791 -25860
22569 -25860 -42540 -29508 -18524 -27402 -42822 -39594 -27685 -19834 -12636 -1068 -3897 -5259 -5684
22556 -5684 -8624 -8226 -10410 -19657 -24737 -7161 1692 -4234 4429 13440 9243 8033 -2304 -4085
22542 -4085 -7841 -11250 -5789 2427 5555 17430 24744 19307 24211 14069 22599 23859 7809 13245
22528 13245 5502 -5370 -12062 -27922 -28831 -12294 9716 22619 14099 -4802 -25424 -38198 -40004
22515 -40004 -30789 -24591 -15131 -9817 -17067 -21038 -16218 -27532 -24244 -16534 -7677 8859 10129 12650
22501 12650 3080 -18121 -18223 -21688 -26185 -20996 -22903 -5484 7804 10406 5235 7426 537 -5114
22487 -5114 9840 14612 -3295 -13444 -12953 -6529 5893 2888 7229 5742 -3342 -76 -1365 -12398
22473 -12398 -19852 -12279 -7029 -13941 -8634 -10479 -20698 -16230 -6916 -7337 -732 15922 17305 16370
22459 16370 8180 1400 4693 6259 -1145 4232 -2551 -13926 -8146 -3168 -13025 -13977 -8056 6191
22445 6191 -1094 -15891 -25308 -21137 -18794 -20186 -12408 -8688 -4613 -5288 -3088 1707 -7508 -11576 -8175
22430 -8175 6440 4496 796 772 2711 6603 11533 -6915 -19661 -11502 -10821 -16060 -17677 -12492 -17981
22415 -17981 -17423 -9428 -11152 -14366 -11648 -2261 2110 -443 1234 -12985 -20900 -9567 -4319 4839
22401 4839 8431 11828 355 -10736 -8127 -15004 -25271 -8803 866 7447 2054 1700 -10680 -10242
22387 -10242 -10430 -17392 -14359 -10575 -3390 21874 19497 12425 9082 -549 -7286 -8838 1370 11451
22373 11451 19171 18791 9061 7251 13042 16948 16337 7627 1511 10187 6049 -6754 -11041 -1331 14958
22358 14958 13757 9157 -212 -4319 315 -15112 -27134 -27491 -8934 1237 -10789 -5420 9182
22345 9182 5955 1368 5409 -5194 -5880 12870 18543 4226 -12175 -11408 -14608 -9400 -7581 -2664
22331 -2664 9778 3266 -7969 -16264 -24165 -22881 -23821 -25057 -12410 -7817 -7313 -601 -2404 -2003 -4201
22316 -4201 -4805 3521 7321 13637 11900 6531 7834 18645 15208 9458 13507 14352 12154 4783 5804
22301 5804 8888 -3905 -20647 -7416 12011 12105 10162 17979 6793 -1041 6698 -109 -13383 -21006
22287 -21006 -24465 -31435 -32750 -25512 -19169 -5078 1602 5968 3834 3113 -14183 -20498 -15354 -12008
22273 -12008 -5653 18944 23071 23394 16088 6667 -2024 6110 6529 -8555 -18559 -24904 -19420 -5347
22259 -5347 -5110 -5082 12946 2293 -9828 -10744 -17190 -11147 2810 -1124 1485 7210 5663 6854 5627
22244 5627 6480 12771 20241 3199 -21663 -11284 -2320 -861 1236 6867 892 2236 -7212 -10790
22230 -10790 -7071 -743 1921 -14150 -27775 -26939 -19365 -11905 -8445 -9725 -7975 -7712 -1483 -2740
22216 -2740 -550 13498 9604 -2937 -11577 -10751 -9601 -8316 -15546 -20041 -5277 -3943 8520 5520
22202 5520 8659 2892 -10767 -5968 2983 -461 409 1262 14676 25862 20965 3174 4419 17364
22188 17364 18342 17112 -2362 -4998 -18375 -28613 -26971 -15434 6548 7907 1959 12819 15654
22175 15654 793 -5901 -13268 -11170 -9020 -12314 -21974 -24656 -35239 -38109 -27397 -20398 -24916 -21369
22161 -21369 -12713 -5844 -20746 -27173 -9991 -15239 -24012 -24457 -20142 -14714 -4046 -11483 -12128 -5330
22147 -5330 1178 1006 -188 341 -1202 754 4959 6896 6426 6230 608 1928 10230 -1745 -5593
22132 -5593 -5645 -4202 -317 -2258 -1635 3748 -11406 -19487 -25723 -20162 6236 19418 23063 11064
22118 11064 -8615 -5794 -2772 -2054 -887 4668 4497 -2184 -9247 606 4811 4848 -4866 -2541 3654
22103 3654 18783 27452 19460 9527 445 1862 10944 13360 1585 -13502 -15645 851 3135 5563
22089 5563 -4951 -21898 -24275 -10738 -569 3791 8644 9475 4341 4022 1843 -12047 -15122 -8721
22075 -8721 -2434 8750 13371 14128 -752 -3023 -7088 -11590 -6986 4527 12860 -4445 -10178 -3250
22061 -3250 -4500 -8312 454 -8156 -2242 -7977 -11728 -10188 -17505 -8011 -7847 -14308 -13924 -5429 -4893
22046 -4893 554 10146 12589 2369 7806 10236 15248 24100 18105 11538 7609 9331 4016 -3429
22032 -3429 -5012 5340 11913 8174 15757 13097 10988 14312 8938 3002 4194 17518 21818 18093
22018 18093 19821 16576 1308 -12276 -24436 -14483 -439 5054 -1950 4003 6341 14265 26977
22005 26977 6709 -1145 -2235 375 3423 8914 23176 26388 23772 23839 14709 -3045 -17146 -4732
21991 -4732 7789 10550 -854 -12578 2856 10887 7596 11176 5068 -618 3079 441 -1234 288
21977 288 -5326 -14540 -14857 -11461 -5306 8090 17451 15005 15204 14282 17760 4439 -21199 -30818 -22200
21962 -22200 -24664 -26839 -15131 -6357 -12196 -19412 -16673 -11784 -4459 -6681 5744 7395 1036 4644
21948 4644 -232 -10522 -5689 -3127 -8625 -11286 -9076 334 -2230 -8281 -7066 -9786 -10545 -16954 -712
21933 -712 8568 7648 15504 10899 -15768 -20878 -14338 -2046 -6901 -3897 7111 4109 9574 23991
21919 23991 34549 8547 -13482 -8563 -15728 -22101 -17362 -1794 4087 5973 7426 1594 5664
21906 5664 2962 -7665 -14119 -14080 -11529 -9516 -8057 -15882 -10580 -2250 -2670 5248 10792 559 55
21891 55 3806 13909 12162 12551 16415 7477 -5844 -13994 -19767 -14772 -12842 -165 -6566 -2648 1414
21876 1414 6554 5437 -6701 -20185 -15012 -11029 -1159 -6141 -9519 -2891 -270 -61 -8299 -21828
21862 -21828 -26048 -9311 -12220 -14187 -12450 -19968 -5578 7064 11670 2705 -4806 -6222 778 -4745
21848 -4745 -10879 -5533 -2624 -11042 -14144 4069 -4062 -14502 -23256 -22790 -16749 -6332 -1390 6899
21834 6899 22108 27555 15677 12827 14293 11591 4329 -109 10013 2267 -9556 -526 9567
21821 9567 2691 -12993 -22400 -4954 9664 14366 17292 13392 16792 11751 3265 5105 15164 10531
21807 10531 7088 -744 -14988 -11096 -3759 -795 -1600 -9423 -12199 -12481 -16771 -4598 -678 -12777
21793 -12777 1246 8678 19217 7813 -6884 -5749 -12372 -14807 -22757 -18436 -11756 -8026 -15186
21780 -15186 -18198 -11310 1453 -5955 8917 29803 24719 25726 35168 32690 24190 14030 7354
21767 7354 12221 14069 4476 -331 3846 5636 1955 6994 5166 556 9730 18390 21185 22065 10439
21752 10439 3582 -1859 -5628 -523 3095 6933 6722 15585 4304 -9034 -12284 -16789 -11968 5953
21738 5953 -381 -11158 -8944 -7525 11025 7284 -6733 -11930 -23212 -14035 -15524 -11836 -2261 -847
21724 -847 13327 24449 20314 25672 14003 -2523 6604 8853 8585 15639 -1684 -16869 -4108
21711 -4108 942 5535 9469 -2058 -4656 -3928 -1801 6873 9846 -3779 -3368 7229 6132 7443
21697 7443 4255 -5452 -12989 -16671 -11689 -17485 -26947 -12602 -6891 1087 -1970 475 6933 11872
21683 11872 14649 9486 -1220 -1856 5482 -7089 -26706 -22350 -17782 -5168 -5710 -11532 5431 14110
21669 14110 11680 8182 7633 -85 -731 4657 5433 7129 3152 7991 16422 22401 31847 18066 7741
21654 7741 4818 14515 10205 -6478 -7342 3601 4236 372 9679 12825 7731 -250 2072 15168
21640 15168 25250 21139 16898 17335 15997 14729 16080 24413 17810 11722 7635 9973 2175 -328
21626 -328 11301 6107 577 21006 18519 7992 5256 8578 14241 5049 719 -4951 4332 21008
21612 21008 12456 6674 17259 13605 8738 -3565 -10769 -15122 -17262 1766 9729 1362 -3464 -6683
21598 -6683 -2047 -11318 -18578 -9025 -12754 -33264 -29104 4254 13375 -1489 -1948 -7508 -1619 -8996
21584 -8996 -7819 -9863 -9464 -3480 2381 886 -13746 -10603 846 -1243 755 -10603 -10066 -13637
21570 -13637 -11371 -2787 -8924 -17015 -27165 -13649 2659 5629 -2276 -8795 -3443 -17929 -29654
21557 -29654 -23341 -14445 -5340 -13517 -10502 -5631 9319 2110 -2621 -12175 -20825 -4391 -2294 -11144
21543 -11144 944 14651 28878 24907 14779 23689 19814 2964 -1200 -15129 -18413 -11419 -9235
21530 -9235 -5838 10549 12742 4878 -9937 -22455 -30151 -19951 -9886 5829 19943 15984 21407
21517 21407 22717 1801 2957 6678 4769 11073 388 -4315 11440 9965 -2498 -4583 -21098
21504 -21098 -23880 -22125 -12832 -16702 -10312 -11821 -16003 -5178 694 8450 10924 762 -8834 -18026
21490 -18026 -18731 -12413 -16108 -14731 -15629 2902 20091 18163 23590 14412 7043 18531 15508 10174
21476 10174 2953 -11438 -16389 -15483 -4813 -9533 -2273 -3438 666 8484 14635 7039 -4726 -5943
21462 -5943 4998 3205 -6396 -12748 -18938 -32724 -31519 -24576 -14472 1987 5732 -2490 -2749 -6838
21448 -6838 -221 5712 10272 10498 5417 15079 14351 3535 -5405 -13844 -21263 -20770 -20025 -15554 -18945
21433 -18945 -8193 -4847 -8264 6207 3291 -6002 2143 745 6250 16317 11074 2434 -12018
21420 -12018 -3507 5187 -552 -115 915 6889 9077 14710 3437 -6482 -18014 -16520 -11521 -14136
21406 -14136 -9724 3422 632 4522 3576 -8242 -22829 -18413 -7244 3620 13926 8496 8436 1730
21392 1730 -5405 -10627 -2931 -1025 -4757 -12861 -19670 -15355 -10413 -19040 -17585 -11183 10058 11531
21378 11531 -8104 466 3700 -873 -6974 -12256 -14396 -13598 -22342 -29640 -20022 -20928 -10178 4040
21364 4040 5938 -1229 -24783 -22937 -28381 -18973 -19145 -19110 -16781 -2401 7026 4288 9104 15777 12300
21349 12300 19460 19536 13995 -5519 -5420 463 -13789 -15194 -3933 -1482 2435 7480 -5850 -18588
21335 -18588 -16840 -9444 -1293 -1423 -7920 -4249 -1455 -3566 4357 1734 1363 -1658 4677 3103 -8330
21320 -8330 -8330 -698 1475 9187 -4791 -7829 -9883 -6925 2257 -8835 -16847 -7424 654 8206 2758
21305 2758 16525 12417 2674 -4094 4286 2059 2731 2284 8770 13180 4855 8913 18652 13116 20329
21290 20329 13480 -2146 -52 2478 5408 14036 16864 6074 -3859 -1918 2500 -5067 -6788 -1413
21276 -1413 -1402 14514 26054 13856 3234 11596 24703 14564 18611 12781 9085 3847 -4803 -14684
21262 -14684 -10427 2278 14370 15677 28662 33263 23638 24299 28174 21907 25639 16794 23881 12214
21248 12214 7798 3866 -7482 -14967 -10152 1531 5433 12085 11950 10178 9495 8268 1351 -12543
21234 -12543 -3502 1555 -3414 -11824 -2813 -8513 -8252 3250 -1531 -6173 2505 -10471 -6872 -2339
21220 -2339 816 6785 -146 1549 4418 -17389 -26552 -18496 -17306 -13307 655 10801 7883 -5534
21206 -5534 -9567 -11306 -16032 -8124 2523 13944 7234 108 3996 4047 13662 9729 9526 3899 -15001
21191 -15001 -16324 -6898 -11612 -17946 -11681 -7170 -15334 -16159 -5980 -1151 -9575 -11416 -5356 12959
21177 12959 18108 32941 42330 48211 27189 10709 3101 9056 14240 17133 15220 4603 -1636
21164 -1636 -6604 -5974 940 6372 3953 8201 16083 22367 24034 31683 22642 15522 9519 -6681 -2643
21149 -2643 5140 9203 16022 3327 -1263 -3377 6473 10203 17247 19077 10512 7444 -6919 -5070
21135 -5070 -7249 -10268 -15507 -12716 -1999 -6885 -18984 -9193 -7729 4731 15767 20174 22350 425
21121 425 -8812 1109 10716 27181 39735 33596 29427 3014 1463 -6038 -16346 -14164 -11482 -7320
21107 -7320 -12054 -11964 -1100 4628 -1503 6744 9844 -31 -5228 -10067 2752 258 -7529 -14509 -12710
21092 -12710 -9317 -11864 -21666 -14517 -12801 -22838 -14133 8649 12013 10326 4426 4176 7761 8207
21078 8207 5924 13 -6617 -1629 5274 8304 -7880 -12016 -10202 -16479 -18529 -27801 -29377 -6081
21064 -6081 15083 6846 -10527 -11122 -9004 -8736 1614 -5137 -374 9953 14182 -7919 -18362 2467
21050 2467 17120 7844 1592 1838 -2880 -2236 -3675 -1729 8724 14655 9429 17990 29308 25120
21036 25120 9523 -3586 -16515 -17700 -15688 -4811 -3014 -8602 -19677 -10577 1187 1034 17318
21023 17318 23783 4514 -3258 -1737 -2163 3632 17225 21960 20994 18408 12416 -283 5828 2189
21009 2189 7586 6615 -1256 -11434 -20450 -18571 -4575 6309 -5679 1387 8417 17887 11129 110
20995 110 -7939 -2902 -2968 -7025 1521 14742 30981 31539 25171 23472 23238 10812 1093 74 -4904
20980 -4904 -13007 -8792 -7173 8483 15944 14535 7879 3425 -3858 -11030 -9516 -14838 -10716 -6404
20966 -6404 -3730 12499 16818 12500 7226 766 -3395 -2082 -13978 -14448 -8534 -12909 -19760 -14466
20952 -14466 -17798 -19625 -13338 7321 20403 13677 -9627 -28519 -32005 -20803 -28159 -35617 -24377
20939 -24377 -7071 -13676 -10927 -91 -3129 -4599 -2780 4276 10029 11022 11372 13945 1068 -16547
20925 -16547 -14147 -9124 -59 6901 -3716 -14847 -2548 4044 8252 7784 15040 12885 8653 -11550
20911 -11550 -20476 -13471 -1562 4735 -284 -12232 -9097 -4843 5634 1577 -6024 387 472 4693
20897 4693 -6654 -1732 -8884 -12747 -7036 -6634 -6860 -6666 -6822 -5087 -19131 -11146 -4596 7957 -5523
20882 -5523 -9208 -11348 -17158 -14267 -9600 -12745 -6910 1593 3596 -9538 -9857 -7129 -16195 -14021 -3942
20867 -3942 6711 13274 8916 -318 -4159 -932 -17177 -20266 -20009 -10387 -3103 -4658 -14441 -4849
20853 -4849 1851 -1661 5550 2405 -8771 -15360 -11894 -8569 -5174 -3878 -9005 -19058 -20039 -8092
20839 -8092 -2919 -859 4526 10709 25774 11703 -2835 -8273 7572 6612 -1419 -14286 -176
20826 -176 -130 -3967 1584 1066 -6684 -22846 -25504 -12038 -2927 -1001 -6461 -1934 -9230 -26978 -25654
20811 -25654 -14560 -12174 -1967 -8719 -9824 -14585 -15970 -2066 2669 8904 11070 10532 7678 4692
20797 4692 8257 12708 6349 25655 26039 12811 15807 34058 29539 23804 -1847 -11190 -5363 -3533
20783 -3533 -1191 -5822 -11724 -6430 183 9691 4305 4352 3937 3851 2152 3476 13512 21856 22897 60
20767 60 -11869 -4662 -5620 -10981 -19702 -16205 8081 134 -11917 -6804 -7638 -16288 -16060 -14905 -3386
20752 -3386 -230 4651 6336 729 -9718 -17879 -16816 -9958 -16670 -12859 9235 14049 7953 -5109
20738 -5109 -29372 -31783 -29391 -17247 -72 5135 1501 -1962 3482 2616 -2555 -5486 -3377 4149
20724 4149 2040 5872 4926 16600 15802 -2568 -6041 -13549 -13179 -6960 -8020 -1965 3469 -11977 -19366
20709 -19366 -9014 -13633 -14331 -21338 -21200 -8877 8859 13303 3056 -3060 10 -10203 -24740
20696 -24740 -23234 -22080 -7280 4233 4264 -7141 -16241 -37207 -48472 -31882 -9352 177 2169
20683 2169 -2174 -768 -11961 -19216 -19426 -7693 -1940 -15110 -12309 -4382 9132 16256 26840 26883
20669 26883 18676 21174 26338 26485 23852 27497 20530 23599 21746 7032 3635 -8501 -14654 -13487
20655 -13487 -7913 -9376 4863 7893 -2297 -1085 -178 5742 17807 33681 37142 31173 14893
20642 14893 6344 10178 13397 8176 -3489 3135 23179 25355 19717 20807 14227 -4889 -19071
20629 -19071 -10674 -5122 -9095 -2709 -959 673 -5605 -9348 -12351 -15826 6626 20566 15773 5448
20615 5448 7664 4649 9206 515 -10746 -27751 -20179 -714 10142 9728 -2451 -5105 -9351 -9150
20601 -9150 -7625 -7070 -20394 -20241 -5657 -6486 -6447 1816 1778 -15163 -16372 -1263 12131 11568 -5717
20586 -5717 -14119 -7514 -14222 -11815 -16830 -5422 223 6121 2598 4209 2583 4488 4812 7818 12792
20571 12792 17456 20824 14291 19081 10511 -1989 -9687 -21341 -15982 -13436 -12357 -10075 -11193 -20250
20557 -20250 -18139 -12048 -13631 638 -6707 -13365 -22319 -21019 -6661 -4781 -7334 -2110 -3928 -12954
20543 -12954 -4628 19220 28866 24931 37479 38290 16321 -2766 -7384 4552 5689 1825 -1283
20530 -1283 3667 6620 6003 7819 23687 10129 -12046 -13713 -6095 11055 22834 20663 10631
20517 10631 2427 2298 1001 7148 5097 3983 -2758 4257 16369 764 -1539 -2621 1090 8350
20503 8350 16409 21514 26383 14348 -7941 -13013 -10967 1225 8867 24167 27865 24436 20411 13277
20489 13277 16144 932 -2197 -1824 -7350 5642 3662 -1731 877 10981 12192 7106 7999 4456
20475 4456 -2191 -12540 -768 11658 18890 21626 22768 17547 18662 6589 6694 13111 -611 109
20461 109 6981 3946 225 -7463 -13543 -25546 -24035 -6957 223 5863 -5057 17237 39637 44703
20447 44703 47489 38236 21941 15814 20093 7760 -13354 -19083 -17168 -23766 -13031 7059 -655
20434 -655 -6947 5401 11263 4701 -513 7312 14413 16339 16952 24103 19822 18104 17159 7273 3944
20419 3944 6331 18629 14759 3415 4653 -4189 -5811 4846 14465 11734 7222 -2610 -4544 -6156
20405 -6156 -10307 -19008 -13812 -13989 -10329 2233 5214 -7358 -9130 -3871 -6896 -5581 -804 4207
20391 4207 8184 8932 11250 3752 7295 -2598 -17106 -21822 -19636 -19920 -7583 2597 12734 21563
20377 21563 25440 17017 514 8072 7616 12424 2513 1919 6937 6408 -2813 -17613 -23102 -24281 -14511
20362 -14511 -4770 -14550 -26960 -17140 -2445 -6183 -6903 14084 20544 16767 10164 8132 8927 11757
20348 11757 14667 13020 19100 21088 13512 8004 -10682 -11782 -6571 -6690 -1379 -2887 -6673 -14291
20334 -14291 -10402 -4299 -10005 -22509 -22566 -23729 -16064 -1507 354 -3140 3227 28691 54594 51221
20320 51221 22549 16348 3571 894 4342 605 -6063 -4943 -10357 -6746 20417 20383 4689 -5359
20306 -5359 -8492 -66 9727 -5608 4398 11697 9121 16169 3453 -2508 213 2914 8255 4881
20292 4881 6177 13263 21029 8927 17209 19873 8559 -3321 808 3008 -2495 -17946 -29491
20279 -29491 -26529 -14935 -5202 -723 7150 2720 -4213 7899 13583 5432 5138 18388 11714 -2147
20265 -2147 1592 11477 11977 19959 18625 20387 28471 21002 13167 5190 5095 13264 11640 4899 19243
20250 19243 11329 9760 16287 9223 5566 19210 27309 19027 11874 14556 23678 35296 30978 24119
20236 24119 21358 18049 12286 14118 18247 10501 8814 15622 1409 -282 -936 3949 4135 6515 3928
20221 3928 -5801 -7307 -15303 3269 3538 4486 12063 6181 -1715 2979 -96 -12453 492 5808
20207 5808 6601 -5868 -12684 -10690 -13765 -3776 -124 -8110 -2350 6273 8814 19645 23427 24414 4985
20192 4985 -9174 -1877 2653 7420 9944 13096 7691 -3288 2725 -206 -5379 2002 17950 20914
20178 20914 26654 21077 14910 4807 124 -15601 -16917 -9578 5194 15242 14042 15531 20384
20165 20384 23652 23480 19063 2371 -3763 -10678 -2303 13004 20517 28052 25147 24346 15471 25077
20151 25077 24773 17801 20481 15967 3077 -6027 -12958 -6582 -4862 8084 5779 -4164 -13613 -18789
20137 -18789 -23245 -16032 -6102 -6550 -12612 -18086 -6141 -9899 -4523 10295 17031 18398 18800 12322
20123 12322 10013 15190 13247 6174 12626 21312 17227 5608 6638 9157 14723 9615 -875 3887
20109 3887 15495 583 -9949 -19039 -15021 -15280 -13077 -6914 -3498 -7598 -6505 6667 9377 3655
20095 3655 1000 4179 1985 12183 20528 4121 -7178 12460 21533 12610 7481 9228 16737 19714
20081 19714 663 -14071 -24204 -23550 -9853 1888 3602 6661 -5317 8251 3071 2910 11068
20068 11068 16624 23950 24322 15025 7677 10576 16931 21574 23183 813 -15844 -15888 -8369 -6197 -2083
20053 -2083 -698 3540 6739 4729 3276 8018 8567 3493 6762 10518 9915 15964 26212 11482 9843
20038 9843 9072 -3709 -15922 -1339 1068 -3118 -8928 -16401 -14292 -7635 -1581 5936 8607 14352
20024 14352 17662 -255 1244 -7852 -19810 -20252 -25708 -22145 -6513 15318 20012 9789 13988
20011 13988 13775 14910 9187 -7755 -18460 -7773 -1230 3226 4506 12434 19278 15005 1852 1465
19997 1465 8271 20659 15687 18762 13465 8536 15782 14990 13273 26922 25821 22960 24299 13609
19983 13609 -6944 -11169 -2738 2336 4702 438 6360 6903 -1521 -3401 3833 13140 10294 -4650
19969 -4650 -13241 -14996 -5960 2178 8988 10731 24553 25036 13703 2204 18600 29005 34416 25908
19955 25908 25664 14341 -2493 -14027 -14341 -7205 -1418 -2294 -12880 -7562 4419 10872 16334 17980
19941 17980 12065 166 -5368 6754 16919 12472 7118 -2495 -1504 -2566 -9921 -1602 17155 20081
19927 20081 1643 -2106 10726 10372 17068 23311 24207 26965 18235 10809 10767 5396 3360 1095 6271
19912 6271 12755 19093 14216 15717 20616 9688 13856 13802 10030 21527 27424 35097 43629 46376 30177
19897 30177 23659 24497 18478 5197 -2422 4375 7496 14553 14978 12433 3811 8808 10149 5643 6308
19882 6308 5779 5604 3152 2119 7742 5860 10801 20239 27882 24601 18362 18605 25502 34987 19548
19867 19548 9230 4427 1323 -14271 -12127 11147 26789 10298 -1576 1906 7102 5948 4030
19854 4030 9147 -2744 -16478 -4970 4763 45 -4058 -8055 -7137 -10685 -11630 -1695 5650 9216
19840 9216 1953 -2786 -3913 2586 -628 -5613 2680 10142 -4172 -543 19072 23400 19787 27199
19826 27199 39369 24981 9674 20781 35615 26163 32773 32874 7605 5219 9379 -4201 -14448
19813 -14448 -1937 10970 11485 12292 10967 7580 8541 12775 6869 16330 29676 34052 17814 15461
19799 15461 22334 10846 -2565 -15453 -9557 -8686 -3871 -3710 7260 -2486 -13769 -11157 -15720 -6727
19785 -6727 -8810 -13903 -16763 -12236 -1008 3052 15597 22742 13780 15823 16241 6234 9101 12900
19771 12900 7630 -4857 -10618 -8063 -16545 -21463 -18562 285 4984 -4671 -13099 -9386 -7055 -3050
19757 -3050 -3731 -2919 -6520 -2308 -4593 -98 2602 -444 -7553 -5402 2451 9008 5208 9301 22313
19742 22313 20109 20057 13173 247 -11422 -2129 -883 -7785 -13576 -4700 -7594 -6418 -8805 -10228
19728 -10228 1385 6618 -4810 -12074 -2368 3601 8759 -12631 -11321 -2453 -8744 -16279 -11429 -7118
19714 -7118 -4119 817 -8147 2400 5147 5894 -4632 -15077 -18238 -10877 -9342 -1784 7600 20135
19700 20135 20939 17658 12704 16082 13634 18197 19216 12353 7153 10297 21411 21131 13992 6419 11171
19685 11171 2612 13229 16610 521 -7686 2223 20638 30260 12842 9306 13517 13039 18109 15798
19671 15798 5572 5005 3990 12206 -5074 -16998 -17200 -1268 17591 13182 6550 11660 6494 238
19657 238 4949 16953 26258 10249 -988 -701 5632 3130 9838 7110 -593 3741 3437 -6369 -2269
19642 -2269 -5027 -16013 -23906 -9544 6996 2933 -2792 -1189 6597 4974 8934 22001 23401 15204
19628 15204 -2811 -12071 -9007 -5722 -8378 -12978 -2029 17729 15136 15861 27061 24395 14381
19615 14381 6036 -325 1324 12309 21726 6399 -13570 -13009 5426 23622 31316 25622 12911
19602 12911 468 -786 2348 10228 21482 12441 6281 4441 584 -11124 -13858 4364 14106
19589 14106 8997 10727 5223 -4488 -3318 14225 31396 34500 22947 14946 7394 11088 13303 11483
19575 11483 7455 5211 7519 2201 -3303 10490 29165 30635 22391 17217 11139 13223 28546 22256
19561 22256 11426 20129 34325 26315 11389 9046 18981 29116 26227 25302 16958 -8233 -13923
19548 -13923 6383 11453 5034 5010 8265 13329 14727 17256 23822 23766 5861 65 777 3168 11621
19533 11621 1898 -8002 2500 9023 25296 34876 37544 30251 16293 9026 9120 11034 26269 6692
19519 6692 89 14741 17625 23689 11572 548 15871 745 -609 18332 15028 -4526 -12996
19506 -12996 414 6640 332 12771 24441 4161 -5625 -8184 -10946 -12885 -8378 5355 18444
19493 18444 37440 33924 19279 6909 -1022 -2119 2692 8799 5844 4868 12767 14635 19416 17697
19479 17697 25900 32593 22192 26198 18281 -2461 -8160 -797 4327 2195 2191 7785 22501 13024
19465 13024 10472 12024 27929 31525 27280 16179 13545 9224 -309 -8981 -18901 -14977 7751 13107
19451 13107 22138 16401 19136 34122 33002 34366 20319 9038 7886 5738 3452 21973 34158
19438 34158 27383 17321 8226 16852 10153 5965 11764 10764 17982 23633 16755 12883 3461 -2148
19424 -2148 11060 23330 22814 7681 12219 20013 25259 13009 7548 13516 11646 12948 2314 1012
19410 1012 3171 12909 33975 38035 28468 23993 22705 16758 9482 11205 13502 15408 26480 19216
19396 19216 15488 14245 21031 27805 29495 26329 27067 22385 15714 11653 2770 5088 7191 8566 13068
19381 13068 17716 24648 27397 29096 30738 33244 26246 16834 19251 18010 31391 31581 31682 27851 29439
19366 29439 34060 27007 37864 41990 30990 6995 -12160 -3409 11046 23984 32685 28976 27278
19353 27278 26455 10856 8273 15141 18649 19370 21513 26771 22133 15528 20188 18988 16101 13301 22202
19338 22202 38773 23378 13601 11774 26644 32869 25301 29585 32628 24039 25910 19637 21149 36170
19324 36170 28853 22597 20148 17948 26925 36071 41224 29001 10255 2803 3267 14203 24646 17637
19310 17637 15657 10432 9065 8408 11251 9185 18469 18011 21088 24851 23778 13300 15807 27529
19296 27529 27161 24073 30996 38285 40588 52170 52562 51815 64875 80626 91865 82399 64163 60919
19282 60919 68990 63908 48901 38229 37047 6309 11181 28654 31555 21429 10713 11734 13259
19269 13259 14610 5917 12037 11476 6888 23383 17135 11332 14511 18800 22253 29076 25385 13752
19255 13752 13623 15369 5480 7309 15643 21822 14472 8088 15501 18677 19588 17961 15528 11488 17303
19240 17303 23844 35726 32220 26108 32055 25136 23732 25777 19584 21431 24569 27446 26950 25577
19226 25577 30897 27679 19935 19142 27135 41914 36049 32062 29609 28992 37536 59363 68073 65728
19212 65728 55873 39411 50777 59371 53497 39633 36845 36772 26146 25512 22863 30791 31403 46602
19198 46602 64524 51443 38966 40182 32625 18520 13553 15522 20209 26920 34163 35405 39427
19185 39427 38707 25637 30281 32753 49331 61323 59486 52950 43752 24816 11654 15718 33555
19172 33555 44313 47425 47868 25485 10733 30054 29579 37030 49401 55429 49293 35848 34184
19159 34184 46930 50904 59048 67769 63474 71070 73442 64563 62156 79234 95460 105632 126787
19146 126787 161327 209760 243034 273385 305369 344200 368331 358898 337488 305844 271539 253108
19134 253108 221128 205219 215495 238636 275435 321050 357782 378772 387017 385649 386234 371565
19122 371565 321124 281261 247618 215977 180584 154796 136883 128636 125630 121164 112084 116067
19110 116067 109025 104356 93420 94832 105820 108242 105399 103006 90963 68167 67164 75735 78935
19097 78935 62432 63926 65776 60780 54678 55883 52918 74984 78324 73332 47106 47516 51400 67961
19083 67961 66057 61288 58760 49826 43142 41553 54711 47752 43325 62508 67532 76736 78904 71257
19069 71257 61825 44311 50134 45644 53324 65336 58668 52170 53844 52370 47157 35636 35565 38463
19055 38463 38014 44143 45202 38625 34993 45568 53033 41813 42293 40181 39710 40483 54018 55257 51107
19040 51107 48096 49953 51482 39209 32070 26625 35526 31528 37622 34506 33479 45157 41591 40311
19026 40311 38440 36107 46272 47695 35085 15753 5724 1834 11214 3088 2960 10721 11541 14025
19012 14025 27818 36547 34060 31659 15763 11624 17652 31365 37850 43950 38740 42350 50530 54179
18998 54179 37823 40241 38532 40112 33108 38725 47081 52982 64690 43605 28631 32613 32342 43433
18984 43433 46533 32537 41073 41326 28548 28292 24113 20024 30337 42924 39886 43618 43884 31269
18970 31269 24586 32347 36641 37932 32087 29815 28812 17094 22793 28349 26830 23288 39808 55861
18956 55861 66320 59974 50494 52882 39694 37412 40310 42393 24039 15981 27809 35126 45406
18943 45406 50769 45992 41347 38536 41462 31746 24424 22009 29449 46853 48753 39413 40389 49523
18929 49523 53822 40667 40064 47782 42113 42328 37932 45598 51482 49488 44125 42050 47150 43286 40599
18914 40599 28484 21561 34005 37273 30257 20312 11164 16265 36198 50611 50147 57041 58550 51223
18900 51223 43807 47791 50328 40796 38525 32871 32112 32922 29827 39439 42836 38550 42840 53357 54205
18885 54205 59249 52327 50176 48107 43945 57373 52840 43807 50581 47097 51000 48803 41656 32251
18871 32251 34613 43247 69086 59641 31722 28891 43899 44117 32216 39999 60555 65039 61257
18858 61257 54147 53960 55757 49433 51257 50869 48073 42192 39910 51645 48276 46385 44034 44656 42707
18843 42707 42055 39850 34639 30137 24110 27208 31160 26881 29094 41252 44188 41227 23395 18606
18829 18606 38215 42548 51999 58488 61805 59112 57099 41141 25076 23989 43509 53229 50807
18816 50807 53612 69940 81628 74783 68104 63522 55972 67663 57415 54599 46338 44292 61512
18803 61512 77957 84861 80232 82131 77188 85152 90360 100666 104872 91214 92096 92980 114855 135357
18789 135357 135530 140192 136361 140054 142307 135440 148435 145966 126335 125288 142157 150881 142768 126343
18775 126343 120298 130167 160916 189058 194808 193645 195146 215115 236911 239399 206748 181722 169219
18762 169219 150059 128532 119887 128235 128360 123470 134271 146077 144091 130692 129629 140913 135795
18749 135795 132373 131532 126808 117816 121501 132834 124159 116140 123558 135249 124307 126115 125904 122420
18735 122420 117785 114781 111236 104401 99132 101649 103514 95828 98675 94289 87223 88248 107014 112600
18721 112600 103008 86744 86382 100326 113051 105385 98579 100552 98201 89924 95215 94823 97863 111025
18707 111025 131133 124643 113430 120291 134757 135653 134672 128214 129457 132008 134997 131983 136287 131368
18693 131368 115072 108908 120766 112795 109972 122004 124295 124107 122988 113390 117892 130044 131811
18680 131811 123846 106297 109985 118069 117268 125188 132850 143546 148425 142909 144409 156510 161702 162206
18666 162206 163738 170869 182899 188536 173522 167254 169339 188601 209071 209702 205735 212425 218269
18653 218269 216977 220257 222450 228259 231048 240912 240897 254467 266683 266134 259601 262744 255101 261156
18639 261156 262995 253655 265457 285888 279903 265524 249786 243520 250362 254439 252956 247021 252299
18626 252299 273092 289012 295319 300269 289569 288799 284272 276949 284873 295607 304609 318610 337484
18613 337484 342518 350645 341461 332258 337399 352093 354101 354430 356808 355586 345874 347722 364188 387136
18599 387136 411202 415957 433561 451259 459973 460975 477960 492813 496418 515571 532652 538910
18587 538910 562437 588615 596935 601839 621773 636721 663083 705585 732100 762777 822284 878970
18575 878970 944184 1019483 1094571 1190219 1293649 1398049 1498869 1602636 1686877 1768772 1835192
18564 1835192 1899951 1970618 2041963 2110623 2214213 2374838 2562459 2796070 3071057 3368193
18554 3368193 3709266 4104607 4563544 5084831 5702567 6493063 7519975 8927818 10934266
18545 10934266 13842416 18003571 23707824 30901073 39128847 47471537 55003414 60602909
18537 60602909 63409443 62934794 59171368 53035079 45775300 38893050 33769750 31082560
18529 31082560 31115269 33805130 38820320 45554055 52992472 60059893 65635200 68599529
18521 68599529 68351025 64613426 57908622 49447416 40512147 32558774 26276374 21722489
18513 21722489 18569492 16388918 14851371 13707700 12805395 12042645 11390122 10796064 10235842
18504 10235842 9696438 9174245 8693068 8230695 7810202 7441665 7111926 6850095 6638570
18495 6638570 6451472 6288244 6124459 5941685 5740764 5508447 5255513 4983220 4710489
18486 4710489 4460912 4234821 4039041 3865373 3721036 3611787 3490767 3377133 3271412
18477 3271412 3170670 3059675 2967979 2879634 2808066 2724883 2644275 2566083 2480863 2413897 2337521
18466 2337521 2255245 2174166 2090314 2007473 1925498 1847778 1785359 1734554 1692923 1625712 1567954
18455 1567954 1531486 1484471 1428245 1374415 1324980 1259901 1215733 1172501 1150014 1126532 1090858
18444 1090858 1065851 1039777 1009116 990270 967863 948867 916372 884613 871245 841741 808404
18433 808404 793078 769497 741857 719347 693544 659978 643005 627329 598895 553322 524958
18422 524958 495897 483158 466884 462859 455003 435286 419638 394329 372096 349111 328708 307024
18410 307024 283956 269406 256516 223865 210062 180061 168383 171678 160753 158493 168875 170722
18398 170722 167790 160816 146584 137018 135212 125972 124429 127451 112714 104540 105311 98751 100604 105625
18384 105625 106084 104352 83898 69634 70496 65451 74306 82376 73341 64533 74141 80040 78575 82458
18370 82458 80863 82290 79349 80008 90887 101403 92043 73922 86260 96289 88442 100358 117530
18357 117530 130385 128147 123924 126794 130482 127147 137306 142202 139872 147075 144733 132376 116348
18344 116348 116272 137695 151964 157706 175330 193302 197393 198082 191318 170344 160756 162470 149407
18331 149407 123809 125266 124297 110908 85722 81050 81264 79098 74888 76584 85342 90937 94195 88261
18317 88261 81276 76735 67185 59883 58345 60721 53538 50157 48763 49599 53098 53918 53284 46216 63050
18302 63050 73199 80059 77451 68410 49128 47270 39686 41077 35011 36823 40798 40647 44936 48448
18288 48448 43462 35904 35471 33267 37506 45073 51472 46372 41646 38283 38708 34176 39220 49803 51545
18273 51545 60861 58913 48058 55549 60207 52883 46648 57293 44405 47892 50886 54268 50495 55463
18259 55463 41686 35838 35218 41556 47018 39231 45282 45697 40090 42587 43500 39095 36746 43371 48805
18244 48805 31558 21162 14836 25881 39363 47746 46438 44527 36579 31360 31393 24856 30405 36772
18230 36772 23827 25815 25388 25007 25058 37034 43260 61283 65271 65775 73969 75206 63191 50321
18216 50321 46388 53841 65150 60849 61801 54133 57165 48921 49151 43277 51945 49669 48305 47258 50256
18201 50256 41751 35097 46904 51523 40933 42387 40621 29878 37661 28079 22870 20964 27114 29100
18187 29100 36843 52608 54280 60137 62945 60463 54591 59495 61528 59626 55060 70220 81579 82850
18173 82850 86441 94852 107007 115050 115759 126872 135825 132868 144074 158019 161792 180852 205585
18160 205585 233343 260379 284674 330814 379547 447966 544579 690624 882629 1121623 1413888
18149 1413888 1684409 1938241 2147056 2236710 2222020 2104447 1917672 1702691 1494231 1338608
18139 1338608 1285069 1336192 1479756 1697471 1937200 2173246 2369688 2481504 2506033 2412675
18129 2412675 2226728 1984448 1723456 1482795 1285109 1158226 1097314 1083519 1112526 1186949
18119 1186949 1315585 1493834 1757275 2168817 2824348 3945359 5801703 8510636 11080022
18110 11080022 12510828 13417043 14100657 14052657 12145411 8593112 5753972 4143238 3221227
18101 3221227 2653603 2282951 2059313 1903372 1768907 1661411 1570748 1517948 1486544 1487274
18091 1487274 1496683 1490233 1473093 1438985 1373646 1286413 1185088 1076866 1003268 956372 924296
18080 924296 898622 893822 902385 906226 913945 907748 893548 874598 858049 819479 744571 662366
18068 662366 598844 541881 511939 480740 465397 460512 444834 428143 406039 402781 413730 401900
18056 401900 375252 347019 330972 325343 333427 322002 308223 289984 270322 252178 258221 253768
18044 253768 241529 230126 202706 201717 213867 216698 213098 205219 191709 191128 199448 195174 168340
18031 168340 153929 151264 147591 141591 144004 133589 130898 130809 127785 112619 107912 107511 101885 101688
18017 101688 106303 100740 85050 82475 89280 88293 80584 76982 77229 72665 96387 114292 109526 92276
18003 92276 78142 70706 65668 66738 64923 52662 49594 51299 41292 30301 37926 43298 31584
17990 31584 41527 51574 49676 51160 55649 46320 35678 39432 40558 44613 38021 24818 21706 38217
17976 38217 31864 15808 14349 6583 28666 35922 26748 28145 27465 32635 34451 33099 30699 30854
17962 30854 23436 4074 12510 13047 13640 14014 13549 19702 22569 20192 30074 33746 29469 23224 15310
17947 15310 16096 19669 29313 34025 32433 50702 54232 55172 56947 63127 74750 76306 70958 75631
17933 75631 87073 113185 175972 234970 265319 296881 336198 357118 361065 345544 309446 269932
17921 269932 245746 233028 221521 204893 217517 250344 288597 319111 351989 379586 404098
17910 404098 405339 392084 371277 336030 282064 223206 178058 134204 117802 125046 111924 109614
17898 109614 109173 114557 112391 123117 118348 106112 99924 98205 89327 82187 78750 68815 58412 46921
17884 46921 46012 41200 50774 58080 62574 68463 72912 62025 49010 43782 42674 43411 45530 54365
17870 54365 70624 70996 62467 58499 46095 33217 32451 20310 13916 23242 37382 38217 33377 26247
17856 26247 34052 46273 42344 31321 24647 22877 40235 37804 35581 37784 34515 35836 35111 38120
17842 38120 26114 21270 15450 32031 45419 31950 17621 7954 15548 22821 31746 45401 55380
17829 55380 59947 50517 46835 50036 50757 50499 51416 48531 46736 42366 38689 28713 34951 39969 35113
17814 35113 38858 36880 35733 19285 10917 19731 29099 39814 34448 25058 32616 22975 18816 20830
17800 20830 13269 18906 28564 21175 20358 24954 20934 30488 35452 36050 41307 37598 23025 6386
17786 6386 3873 1260 12309 18386 19539 20681 24782 26737 43538 46988 41074 33690 36855 42571
17772 42571 33736 33836 32481 35788 42886 38159 35335 22415 18270 11556 9960 10888 20881 47565
17758 47565 64698 65025 61864 57430 52817 62005 74684 71431 74958 84274 92037 93569 90396 87163
17744 87163 79758 74595 71989 83937 91251 105805 106335 91925 81704 82867 97519 100702 104342
17731 104342 105535 89723 82571 85021 87217 80564 75953 66591 61895 72955 87195 84606 80412
17718 80412 82281 75954 72332 88530 92052 67919 51977 44749 58673 71019 81561 74371 58008
17705 58008 60709 67742 68804 68648 70347 63346 70456 82742 75617 60925 50827 52526 67026 75985
17691 75985 65226 49834 49462 62756 83900 91220 69337 52673 63635 74062 85518 84233
17679 84233 65327 55565 62361 63611 66473 55003 62484 56028 57546 54549 57065 69596 76589 67902
17665 67902 56645 60880 66000 67364 59804 59470 68275 73056 84872 95418 75037 80035 79400 73726
17651 73726 80278 70501 65264 66224 67748 79280 86320 92801 103623 98752 100840 116206 115370 97368
17637 97368 91923 109981 106231 100645 103267 109069 106262 116245 143204 150930 144366 141585 144263 153222
17623 153222 174182 188129 182841 189496 206348 212447 209821 203206 203558 204987 202565 197359 202991 205817
17609 205817 210148 216804 229761 227122 209689 197706 217922 224988 215421 217724 233399 244084 242955
17596 242955 232778 233541 245782 240179 247926 253080 257373 246673 242503 235227 229637 232489 238728 240640
17582 240640 238515 238352 246170 258999 271167 267542 273442 283874 292661 295973 295200 308462 305701 305690
17568 305690 297234 305597 331936 332755 347290 354947 381248 404654 410444 423237 430296 435568 447596
17555 447596 448543 448459 475921 488134 501488 513650 515070 524407 538018 570942 612639 626874 640977
17542 640977 668548 703455 739526 772120 811829 866856 912398 951059 970875 1009801 1056080
17531 1056080 1129592 1229005 1316758 1444001 1604627 1761374 1932381 2116752 2284360 2431032
17521 2431032 2580357 2754982 2928611 3116385 3355179 3657543 4077136 4633545 5319880
17512 5319880 6163491 7221172 8574734 10341950 12781480 16322454 21532718 29014994
17504 29014994 38712903 49046823 57729578 63856714 67568239 68174220 64068686 55187692
17496 55187692 44698741 36238938 31021284 28647915 28651130 30989958 35929813 43454092
17488 43454092 52397736 60477884 66138251 69368220 69925095 66419382 57969723 46597509
17480 46597509 36094512 28397003 23215930 19732630 17340091 15659533 14405502 13386967
17472 13386967 12499115 11705860 10983423 10307710 9701059 9193504 8754282 8362864 7987396
17463 7987396 7612465 7253984 6935546 6651811 6403916 6169636 5952699 5733539 5479782
17454 5479782 5224623 4972200 4737827 4512207 4315397 4163051 4023898 3889662 3763163
17445 3763163 3647817 3531370 3428634 3353610 3268580 3171217 3065391 2961245 2860063 2761819
17435 2761819 2674271 2607716 2539916 2450617 2363075 2279153 2188051 2107457 2031062 1938347 1868166
17424 1868166 1803289 1741466 1691609 1625724 1562339 1525623 1478033 1433049 1391470 1352688 1318071
17413 1318071 1264392 1217629 1170054 1117428 1094213 1071472 1042829 1011930 975813 940697 922310
17402 922310 897974 874109 859026 837138 803929 780781 763480 746169 711325 672362 644784
17391 644784 626361 617270 591045 557941 520472 494636 453593 432023 418124 409476 400697 406598
17379 406598 409157 386190 368099 345837 331762 331054 302320 264529 233332 207458 185817 170893
17367 170893 175574 161209 153751 153626 146022 151914 152649 155112 149572 133923 110922 103863 94620 98535
17353 98535 99762 87883 69513 64188 75321 76661 74810 92939 90322 82117 76312 51887 31993
17340 31993 23954 34664 45936 56706 58579 49908 48746 57088 46032 50085 54427 56342 61375
17327 61375 60464 67988 69903 68172 68350 80087 76531 80996 90549 80127 80332 87096 84897 77164 79777
17312 79777 71837 72192 72614 69610 75745 87572 94151 91726 79492 90180 80061 62415 61377 62317
17298 62317 62481 69068 68797 71301 72810 73195 65647 65142 58729 55097 57562 53804 42089 36773 26995
17283 26995 22276 17753 20904 29768 31282 32124 42471 46015 33427 21749 24615 32136 35494 33600
17269 33600 17823 10343 23322 26942 28778 36294 36177 28469 26726 37179 33352 19279 16366 20888
17255 20888 20400 27115 37263 37656 22423 14013 16273 17678 6916 -1406 6235 -1415 6314 19134
17241 19134 23819 22393 17127 9869 -1519 -10596 -8889 -8624 -3961 -12453 -26682 -25173 -22189 -19002
17227 -19002 -16473 -17434 -9755 -10741 -12401 -3398 -2376 -4531 -4840 -26150 -10454 -1051 350 10377
17213 10377 -7316 -19954 -20180 -7503 5202 10442 5680 4085 -2553 -19692 -27483 -13083 -16136
17200 -16136 -18846 -24138 -7630 -1763 -924 -7819 -11801 -11456 -713 956 -876 -9471 -17031 -17058 -13912
17185 -13912 -18006 -18507 -10379 405 10605 7819 -6534 -6988 -539 5208 -1813 4136 8159 4567
17171 4567 10264 8940 -509 -12287 -14507 -12778 -12908 -24283 -16685 -16584 -17975 -489 11358 14378
17157 14378 5341 -9603 -11143 -8928 -9842 -10535 -13356 -30203 -30244 -18536 -19520 -19367 -8574 -6225 3451
17142 3451 -6372 -25157 -22916 -23990 -32603 -36988 -24595 -5444 -6138 -25900 -41294 -33982 -33301 -31273
17128 -31273 -16833 370 -6193 -17841 -34727 -29390 -25695 -19008 -11651 -9280 -12536 -4940 -5985
17115 -5985 1610 2959 -7666 -18534 -22416 -40009 -44988 -49693 -47842 -32013 -21626 -22872 -22873 -19133
17101 -19133 -19410 -23796 -17308 -21105 -14963 -12222 -9049 2235 -6241 -2931 2188 1577 -8230 -16915 -26675
17086 -26675 -38891 -35214 -34487 -35725 -27439 -17894 -903 -9881 -16342 -9384 -9916 -17260 -14318 -5506
17072 -5506 3738 -7898 -1086 -4554 -6560 -7789 -3412 -4781 -5202 7489 3774 2095 5174 -1055
17058 -1055 3773 7669 680 2710 3538 -2284 10243 21004 12162 3946 1268 -4779 3228 19031
17044 19031 26696 21501 35041 42504 39076 29433 23638 25119 28007 20150 15279 19964 22497 24141
17030 24141 18194 8333 -1079 7593 2992 374 11318 8203 17687 20687 11267 -4827 -10502 -8031
17016 -8031 -3028 -3831 -12339 -11395 1925 12574 20825 10824 -2112 -2799 13126 14829 5482 -21589
17002 -21589 -35500 -31670 -27607 -24895 -10760 -9162 -12755 -11954 -6022 -5080 -7366 -9875 -17384 -22433
16988 -22433 -25580 -21895 -11806 -12915 -17451 -21536 -16995 -18097 -22796 -16988 -22748 -24254 -22563 -21014
16974 -21014 -9621 -4653 -9226 -10247 -14611 -12872 -9313 -8745 -3655 -9613 -27319 -15240 -306 -4411
16960 -4411 -8942 5260 14845 9930 -6193 -29140 -20078 -15676 -16904 -9865 2609 6248 -1832 2761
16946 2761 12420 31779 43046 42988 28459 8973 2428 472 1628 11 -11601 -16237 -11502 -2613
16932 -2613 -7866 -17606 -19994 -7035 1340 -3275 -16137 -9747 5895 13349 14470 12667 2570 -4114
16918 -4114 15319 24236 34113 36215 42950 47826 70044 120642 176652 227305 266247 295629 331779
16905 331779 341188 359263 355424 302341 247963 203266 177952 162995 150574 170303 189236 230931
16893 230931 285056 334306 360534 372908 374728 346879 293418 235187 192582 152495 110045 93943
16881 93943 85728 72530 82346 87470 79117 69019 65486 55713 44666 54109 53241 52548 52369 38586
16867 38586 47363 68686 61643 53432 47872 25059 16000 23791 25377 11989 12329 15667 2033 -512
16853 -512 -450 4219 -6638 -6381 -10585 -11710 -20423 -7132 4624 -1028 5083 12851 7527 -3999 -2753
16838 -2753 9651 5539 -8873 -7928 -6299 -10066 -6387 -2246 -8822 -6610 -1839 15748 20633 8946
16824 8946 -3000 -8762 -1987 -2443 4822 4124 5165 33 -2590 -5872 -9202 -2012 2848 -1421 2114
16809 2114 -856 -1870 -5801 -12294 -21782 -6824 12669 -4836 -10269 -1236 -9690 -15804 -13366 -14421
16795 -14421 -22408 -24902 -42743 -40552 -27852 -27143 -35757 -30348 -36508 -36067 -24898 -19079 -18291 -20323
16781 -20323 -20275 -12222 1789 14767 3028 -2634 -6345 7743 5989 -454 -10646 -29377 -17540
16768 -17540 -11653 -7879 -9585 -392 11891 11355 -3130 -23917 -26120 -26882 -22158 -20968 -8218 -6022
16754 -6022 -6043 -5512 15274 44610 50395 54240 47984 50373 45718 43467 46676 44674 32348 19888
16740 19888 12493 17252 39425 64425 80344 83118 87798 81343 76951 62834 46291 37300 27703
16727 27703 22929 16307 2431 -9101 -10269 -1336 -6532 -10370 -2697 -161 392 6687 11844 25066
16713 25066 7746 -12618 -8977 -6420 -8865 1270 -3023 -11572 -15472 -13912 -9861 -21058 -31041
16700 -31041 -34346 -32125 -34250 -19472 -13286 -12491 -2879 -933 -23289 -33500 -19538 -9528 -7461
16687 -7461 -5572 5463 13840 10001 1437 -6076 -24106 -34145 -31066 -29242 -26114 -31845 -32726 -27423
16673 -27423 -26273 -22863 -25722 -30853 -31102 -34341 -39892 -28567 -16757 -10252 9600 11041 21129 28448
16659 28448 32384 42121 59588 89398 99126 108462 131509 151681 157181 146960 115851 80875 50804
16646 50804 30166 20857 24652 29121 20696 10238 -3681 -7570 1667 6124 -3879 -7769 1654
16633 1654 10069 13583 5303 -187 -249 -10970 -9762 1445 -1872 -13909 -8760 1593 -9112 6456
16619 6456 16655 9471 -1131 -4474 5516 5233 4489 12724 7753 864 14973 16344 11641 2548
16605 2548 859 -4809 -17550 -15799 -1496 -6629 -12402 -13440 -5293 -9982 -6795 -2833 11046 9671
16591 9671 23203 16735 14581 21145 9805 -1792 8092 23973 24840 26987 24621 8304 -14608
16578 -14608 -16374 -9040 -8712 -17647 -11301 10529 13170 12808 16044 13865 17778 24280 7098 6111 13238
16563 13238 17809 19205 5193 -1848 -6823 -3761 -8312 -19104 -7780 -5662 -14403 -14316 -10401 4640
16549 4640 18010 21391 22579 9050 -1689 -9283 -3638 981 -19286 -22292 -19835 -15587 -12502 -11287
16535 -11287 -10868 -7629 -4257 7719 12627 16255 10365 -1009 -7328 -14426 -11829 -10866 -3195 -9991
16521 -9991 -6481 -13930 -24290 -6112 -5236 -12263 -9749 -7699 -4407 -5802 -15016 -18050 -17289 -11082 -6289
16506 -6289 -3047 3046 7806 6700 -1743 -5708 -14006 -12005 -6576 -2068 -2342 3585 -7209 -6370 1331
16491 1331 10110 16733 15639 19721 11710 -2764 -6594 -14004 -5676 -7541 -7324 -8467 10757 25984
16477 25984 17199 15793 11863 18806 26763 15229 8510 1602 -1817 2144 13788 26881 23890 22373
16463 22373 15408 -2909 -7940 -1487 -12220 -9858 -12025 -13215 -6857 -9551 -14670 -11921 -4669 -519
16449 -519 -16991 -18045 -10143 -14352 -14439 4635 1746 -4942 -14277 -12215 -20427 -13038 -3768 6021 -248
16434 -248 -310 460 9475 15861 18202 14011 9700 7821 -7473 -14306 -6611 3724 -1439 -12506 1326
16419 1326 1170 -4193 -11957 -12845 -11636 -7088 -14465 -12567 44 2913 6006 20098 25675 21946 17441
16404 17441 19239 25019 26149 13230 2665 -6610 -4360 4190 14082 11211 6247 15797 9355 7651
16390 7651 51 -3723 -5191 5207 13994 7139 10807 23645 17929 5208 -2014 -6665 294 -4871
16376 -4871 4867 7209 13837 20402 34110 42051 28543 21551 23630 21489 26727 45154 45806 52994
16362 52994 64685 58287 44898 49407 60685 79637 88492 87843 92715 95102 110539 121699 137193
16349 137193 157588 180988 212121 257038 317939 399448 524178 690290 945506 1285788 1657274
16338 1657274 1931841 2117717 2261562 2306262 2182936 1863668 1485687 1204203 1063789 1021858
16328 1021858 1064117 1213459 1454700 1768088 2043990 2234114 2354241 2396748 2310989 2019158
16318 2019158 1591694 1212860 950606 781008 654179 572613 520758 485986 452244 408923
16308 408923 376444 367832 356634 333143 322260 313577 311740 306941 293377 262444 242384 236530
16296 236530 222100 201689 190917 183002 184360 167218 149181 140919 140938 141913 137791 135027 122578
16283 122578 118386 106046 111624 102214 101678 109154 102130 98414 87945 77979 69993 67336 65523 73105
16269 73105 73489 75585 64458 57953 57378 56339 61032 40988 24799 26463 30706 30055 26804 33795
16255 33795 47190 37532 15547 22240 25024 32290 26902 11207 18178 17443 12663 14249 31288 38165
16241 38165 27507 28876 41907 45855 26163 17231 17936 25102 14423 15057 16402 17424 27252 31432
16227 31432 38265 27108 -2184 3367 17883 30210 15534 8161 5967 -858 -8606 -15802 -4753
16214 -4753 3575 11099 12718 13666 3709 -327 1540 -1439 1368 786 16409 20584 4541 -1110 973
16199 973 -10266 -17737 -15861 2131 4951 3500 4005 10505 7387 -6513 -25467 -25508 -16670 -6627
16185 -6627 -3712 -6181 -18299 -14037 -11575 -2070 -1131 -801 -4015 -3169 2829 2044 7168 4831 5352 -9367
16169 -9367 -14605 -14330 -6287 9474 2503 -11187 -14955 -17393 -15599 -5305 -4646 -16387 -12763 -5749
16155 -5749 -9325 -14367 3093 2861 -4891 -10336 -11218 -20970 -19901 -21956 -20268 -14746 -12796 -9790 -5295
16140 -5295 -9393 -28186 -25655 -21796 -28093 -29587 -20966 -14183 -16049 -18161 -12573 -9008 -9191 -6774 -10367
16125 -10367 -8399 -14109 -27017 -20082 -4926 -16 -17784 -20300 -27365 -15162 -19584 -22233 -12896
16112 -12896 -13224 -13683 -3413 946 6636 13338 6926 -7700 -4487 -1442 10852 5482 -6562 -1688
16098 -1688 -1928 -11995 -6602 -13861 -2353 12667 2217 623 -5609 -9183 -12015 -9546 -3048 -5754
16084 -5754 -10799 3296 15591 18960 4119 562 100 -2255 -2880 -5488 -9952 -18446 -10398 -5880
16070 -5880 -2197 3226 3337 17721 27476 24350 18200 93 673 -4539 -15216 -16733 -28342 -27011
16056 -27011 -25284 -23884 -29454 -22737 -7630 2980 7166 3776 -11792 -12417 1546 2416 -14808 -18939
16042 -18939 -10166 -11029 -16513 -11363 -7191 3856 12703 19747 8705 -22553 -20733 -13232 -13583 -7957
16028 -7957 4889 1532 -2251 -15373 -11527 -10338 -5036 4279 4923 11218 4775 -10031 -21354 -18988
16014 -18988 -14383 -15884 -3482 6536 -2896 16109 17730 -5309 -9031 -6219 -6351 -10463 -17994 -21658
16000 -21658 -18003 -13209 -2041 6692 7143 24298 19150 5761 16904 25396 4953 -930 -1806 3372
15986 3372 9692 13739 7687 671 5965 129 -10066 -19356 -19043 -15625 -23608 -22818 -7462 -7544 -26210
15971 -26210 -28277 -22879 -9545 1024 4373 1322 -342 3524 16439 27483 15236 6458 5416
15958 5416 -283 675 -2724 1304 2074 -6423 -17713 -18061 -10974 -3660 543 4076 -8739 -14223 -9015
15943 -9015 -12535 -17737 -20587 -18970 -2575 -317 -13428 -10370 22 -2084 -8497 -5051 -3373 -3989
15929 -3989 -3156 5508 -7407 -11077 -3017 5224 7607 10100 9940 21929 19463 2009 -19647 -33832
15915 -33832 -29414 -12629 450 -964 4923 5379 4724 6827 2870 312 -1020 -12625 -18869 -14613
15901 -14613 -18418 -12717 -9447 -20122 -16887 -14046 -20709 -23366 -24181 -13345 -4881 1855 9448 2378
15887 2378 6004 4323 -5965 429 4152 3787 3661 -17000 -18655 -18177 -13531 -7174 -756 -664 3633
15872 3633 -11399 -6838 2408 6650 1277 2729 -14882 -20011 -19109 -10397 -15010 -22804 -14601 -3146
15858 -3146 -3682 -12262 -15699 -11758 -7909 -11551 -9329 -9777 -15693 -21575 -18803 -5756 -2200 3493 4608
15843 4608 23447 17920 -5460 -15305 -13028 -4261 -1431 -4829 -152 2510 708 -15131 -16028 -14615
15829 -14615 -16469 -13832 -14643 -2525 1863 9917 5345 948 -2270 -21788 -32175 -21387 -23284 -8648
15815 -8648 -888 1072 -5589 -20097 -12718 1926 7274 4434 2623 258 1493 -14523 -17207 -1704
15801 -1704 -10413 -13984 -3292 -756 -3500 11273 29573 17709 1891 -8946 -5216 -8799 -19082
15788 -19082 -26969 -27616 -17141 -2624 -1886 -2608 7455 14453 6722 -22605 -42460 -27723 -14644
15775 -14644 -10352 -9745 -10979 -7724 9635 14363 7611 10754 -138 5101 -7575 -20647 -9530
15762 -9530 -8389 -10569 -1513 1176 13972 7623 2929 16 -4240 -4898 -687 7825 22225 13096
15748 13096 7902 13853 9028 3536 -7399 -14688 1486 19042 23098 4809 7037 13621 4285
15735 4285 -4886 -476 21882 17089 15288 18005 10589 1558 -9697 -16886 -5683 -13482 1980 12106
15721 12106 4099 5512 -2549 -8608 -7902 -14105 -8688 -1778 -2051 -2075 -8012 -2466 10103 15438 6135
15706 6135 -5555 2343 -842 -6070 -9551 -4908 4818 7755 14668 15216 5293 -5520 -13529 -5555
15692 -5555 9133 13015 7254 1427 -11436 -16701 -931 5169 6289 5621 13082 10299 3228 7177
15678 7177 7541 3407 -1607 4536 19640 21060 11423 2826 -1590 -4034 -8069 -2240 7391 15545 8294
15663 8294 -5590 -579 -2719 -15862 -23178 -9421 -5775 3708 9122 8556 3169 -1282 -8123 -9002
15649 -9002 -5213 -18141 -13387 -3009 10413 11340 15315 20999 7766 -2344 -7810 -10925 -11143 -19396
15635 -19396 -27931 -21180 -14349 -6699 -3390 2785 6127 6015 7923 8339 13426 10201 2457 -3059 -12923
15620 -12923 -12897 -7940 -5490 -8729 -7150 -17325 -20180 -12295 -6818 6933 350 -8185 -17296 -20465
15606 -20465 -13625 6929 14843 15575 12787 3422 -3943 -4762 4987 2947 -12619 -789 8277 9740
15592 9740 4452 -2155 -3653 -3821 -3069 -7599 -6943 11962 25742 10286 -2680 -3524 -6009 -3599 8049
15577 8049 9241 3554 -1340 -2918 -4632 -8693 -12246 939 2626 11310 12544 12153 23482 24878
15563 24878 8761 -1283 -8383 2162 1273 -12983 -8377 -10414 -13271 -2278 -5805 -641 6409
15550 6409 -7410 -22704 -21337 -4379 11925 13688 -5 -4857 -7422 -5104 216 3431 10936
15537 10936 -4409 -8418 -14020 -24029 -33681 -22448 -6048 11385 -4760 -15707 -20616 -29108 -23662
15524 -23662 -25733 -31512 -17503 -3635 9396 -530 2464 8208 -1525 -11712 -22420 -19494 -15591
15511 -15591 -22697 -21758 -16826 -17495 -15282 -20749 -29438 -20258 -10300 -20550 -27381 -18688 -2975 -1377
15497 -1377 -1009 -6278 -1615 11930 12102 7659 -630 -5393 -9230 -13515 -363 1937 -5965 -9750 6695
15482 6695 12765 4520 464 2938 -1712 -14754 -36378 -34194 -19628 -2165 1053 355 -11824 -6406
15468 -6406 -1254 -4357 -13954 -13732 -9396 -7491 -11773 -12793 -7135 -17608 -19361 -16716 -8512 -6128 -8314
15453 -8314 2190 12370 15748 14569 9100 14429 12772 5718 10142 1965 -15182 -14301 -3497 -11781
15439 -11781 -14407 -11161 -1091 -11012 -14565 -15341 -2813 3243 -7153 -11134 9233 11516 6783 1180
15425 1180 -5057 -14741 -10174 -8299 -6840 -4305 -5338 -11400 -9396 -10730 -6484 -9027 -16838 -17937 -15149
15410 -15149 -17649 -18791 -9193 2808 8565 6841 4740 13427 6422 3412 3393 -1512 -15620 -15170 -7864
15395 -7864 3262 14997 5854 6593 3692 -10967 -21120 -30866 -32172 -27019 -31806 -19052 -2815
15382 -2815 -874 -8461 -10888 -8683 2135 9775 9672 -1365 -5564 -4356 5337 17224 -489 -11720
15368 -11720 -5375 -1837 -8868 -1861 1184 -12244 -2581 15139 11544 4629 10722 12719 20119 13181
15354 13181 -5240 -11200 -9090 2818 12680 11826 13361 13787 1276 -11499 -6817 17270 14089 4991
15340 4991 2772 11609 3148 -17254 -21610 -23341 -24990 -1677 5277 6427 13079 17392 -4188 -5735
15326 -5735 -4031 -10481 -26381 -40260 -30562 -22945 -18708 -9678 -7071 3699 11588 11184 -4081 -13490
15312 -13490 -6117 5085 8896 3153 -3337 -14102 -10074 -12216 -11682 -12199 -5575 8051 10382 -3123
15298 -3123 -18966 -632 7797 12113 10631 10633 14371 12885 1150 4570 16443 23752 28439 17581
15284 17581 4671 -5498 -701 1142 7415 15979 21656 10694 -1372 6650 17745 24623 14535
15271 14535 11531 7337 -2972 2406 5036 2168 -5475 -3267 -5509 -5129 -975 -1900 -10620 -11725 -11326
15256 -11326 -15643 -7926 -11880 -15011 -7194 1058 -11947 -21788 -27202 -26771 -25286 -6909 2138 -951
15242 -951 3424 -3293 -3183 2446 345 -66 -1633 -8803 -6488 -17250 -33714 -30215 -35136 -26183 -3532
15227 -3532 -1350 -8826 -12900 -22613 -22543 -18192 -20686 -23706 -16167 -13456 -7354 4171 19280 14843 -4039
15212 -4039 -3255 -5905 -3297 -2371 -5734 -3990 -5771 503 8192 6628 -1847 3457 1168 1112 5729 112
15196 112 -2501 4156 3888 -6488 -12237 1093 5447 -3964 2634 3328 150 8884 9939 -3896 -15280
15181 -15280 -5508 1403 15694 15036 3623 -7698 -90 -10036 -10798 -1926 -1311 -1581 5760 -5987
15167 -5987 -19901 -10974 5145 14902 5512 -7128 -3069 3728 3212 -4572 -28 13613 8268 -5198
15153 -5198 -2866 2229 -5605 -1224 603 -11554 -11699 -7478 -10892 -23278 -11940 3760 -1683 573
15139 573 2223 -9883 -12474 6086 28325 31208 21091 1293 10191 6310 10136 20974 21177 15131
15125 15131 15333 22495 18608 8839 -6370 -10211 5357 5147 17671 19479 5531 -12269 -15984 -10019
15111 -10019 850 433 -2737 -15611 -25782 -36501 -22912 -25452 -15232 -7851 -5281 6301 12781
15098 12781 16765 15562 12859 6814 -11564 -13663 -9185 -6626 -10528 -9140 539 2719 11615 12207
15084 12207 451 3609 -5129 -13282 -7958 -12136 -11818 -11895 -6622 -9437 -10164 -8900 -9474 2730 -5130
15069 -5130 -3757 10657 12697 1572 -4621 -9047 -9937 -14477 -22258 -12397 6025 13913 -789 -1097
15055 -1097 8037 12025 16140 18903 20133 3444 -14054 -13621 -5998 -3142 -5240 -8437 -2744 -7227
15041 -7227 -12429 -10516 -12189 -17703 -9056 -5232 -25991 -31935 -26508 -24338 -17196 -18052 -21419 -11097
15027 -11097 -2891 -5558 -19936 -22475 -28277 -28299 -26489 -1014 11757 -3095 -11226 -6433 -5743 -3276
15013 -3276 1052 -2002 3575 7416 12432 21475 33593 29853 17397 17245 14469 16383 14612 9185
14999 9185 -6483 -16605 -25136 -15839 -2381 -3356 -9480 -16708 -11435 -403 5942 5720 -4330 -2561
14985 -2561 -1493 -4701 -15317 -18040 -14734 -17451 -15321 -9065 -2155 3585 21490 20301 10386 -2306
14971 -2306 -9954 -5270 13922 16117 12402 5226 -4718 -6520 -5502 -8348 -21016 -28107 -33953 -31455
14957 -31455 -17597 -7287 414 5785 8213 9011 2636 10006 11620 5933 13147 21427 21503 16950 3564
14942 3564 -1982 -7617 -2978 8982 11173 6284 -8187 -1395 131 13207 3989 9609 11239 2417
14928 2417 4387 13501 -911 -18359 -14419 -788 -2132 -8327 -10899 709 3739 5966 4955 4132
14914 4132 -7970 -4994 -7090 -1603 5254 10752 19644 12416 -1174 6711 4781 8558 19485 17511
14900 17511 19050 9271 11975 10979 8041 1979 -7976 -11069 -14284 -11550 -16716 -12023 7123 15522
14886 15522 9403 3377 11375 1191 -2786 7074 13041 7554 15727 20042 13176 12265 -6852 -5821
14872 -5821 3952 -5462 -6708 -1010 -1615 -8237 -20702 -26210 -18488 -14239 -24454 -26077 -20676 -22716
14858 -22716 -23129 -12596 -12827 -10279 2686 3274 12867 14782 13722 15696 8892 9731 -1990 -8008 -13449
14843 -13449 -9979 -459 -7802 -9940 -2388 9133 10550 21481 27524 12969 5594 3628 1795 -4172
14829 -4172 13547 24248 8982 5057 5920 3322 -19184 -24876 -24801 -8799 11077 -2233 -27311
14816 -27311 -32752 -22451 -9409 -10212 -7236 -1739 4605 9242 1926 -7960 -17063 -4741 -10088 -19062
14802 -19062 -6393 -5531 -8449 -9730 -10954 -377 -5666 -21702 -21124 -10552 -9891 -10416 -1135 3440
14788 3440 12919 8202 10694 25373 33894 22492 13910 10545 -1125 -18373 -11771 -13912 -11046 -3866
14774 -3866 -6897 -4833 -6830 -16179 -17946 -16035 -9944 -4229 184 -1207 13988 19995 20009 11403 2995
14759 2995 9344 3916 -4032 -10456 -15733 -13294 -12767 -16329 -17788 -10697 4155 15037 16158 20538
14745 20538 29705 22653 18365 3295 -3450 2764 -886 -2546 1550 384 -6592 -11093 -25640 -33145
14731 -33145 -23514 -18902 -22190 -17926 -6375 8610 13898 16126 10772 15779 25407 26237 30047 14285
14717 14285 -5734 -17609 -18908 -5200 10792 12733 -10669 -28690 -30639 -31629 -12476 -4537 1695
14704 1695 5084 3565 6081 6982 3676 -5334 -6576 -7478 -4192 -35 7299 24006 26001 12014 3904
14689 3904 3322 23124 42206 38355 27760 16361 3564 -3864 -10253 -29876 -24452 -8010 -10125
14676 -10125 -10780 -9287 -386 3112 5838 3143 14759 18402 18130 12381 -13038 -16608 9509 9564 -3946
14661 -3946 -3878 -6882 -7587 5942 10830 6891 7537 7453 4737 2831 7011 -5363 -11604 -13197 -17450 -3102
14645 -3102 -853 1583 3891 4288 10430 17365 23032 16005 10274 -4726 -19421 -4090 14280 18091
14631 18091 23141 20474 16096 21003 6782 -687 6252 8889 18711 9380 7674 9183 8153 4612
14617 4612 18101 2142 -1664 -4214 -9571 -13148 -352 13003 6299 1962 13158 12339 10130 6146
14603 6146 16450 24543 16513 15971 12343 1132 1413 5479 9686 9322 -9055 -12765 -6066 -10179 -11459
14588 -11459 9813 18247 20486 20768 24492 10701 5375 11721 6835 6273 -9294 -21200 -12409 -5263
14574 -5263 17605 22813 16325 14203 12902 -3112 -17975 -19754 -11660 -6510 -20053 -16391 -18895 -26134
14560 -26134 -21811 -18818 -14775 -12095 -9050 -22465 -31737 -15281 10919 8112 -1774 811 -5290 60
14546 60 8498 7509 16907 19945 14451 14866 21627 13310 16628 16925 854 -1947 387 -11325 -17686
14531 -17686 -8230 -16591 -19845 -10410 1416 -280 548 -13741 -9857 -445 -3751 -8624 -4122 1095
14517 1095 -3866 5744 9678 4452 12755 8382 4162 2131 6199 10712 3560 -10279 2397 13556
14503 13556 4774 4604 -4859 2545 12249 -1325 -7338 6349 21112 15228 8983 5687 -92 1608
14489 1608 6258 15816 14406 5721 13200 10252 12212 14739 15331 13316 15744 10688 3021 6226 8163
14474 8163 2826 -5967 -995 10591 17508 23282 22639 32687 31688 6512 -7594 -6527 2446 3041
14460 3041 -320 -7140 1445 7880 6580 -579 9651 30421 41389 34677 12007 -1015 -3730
14447 -3730 -11523 -3886 10470 28298 33436 24406 9135 13905 11012 8901 11095 21539 19537 4916
14433 4916 -5838 -1898 -4044 -13115 -7036 -6778 -20144 -19200 -6645 -4815 2846 2554 5892 12535 10795
14418 10795 4888 19810 21578 15346 4644 -16593 -6091 8970 6383 -2584 5831 7557 28139
14405 28139 40077 37506 29668 24484 10334 1427 -12550 -12456 9740 22459 11342 7443 12581
14392 12581 15816 15623 -880 -7093 1859 4028 -8105 -9390 -9102 -6137 15487 8938 -5054 -1689
14378 -1689 20905 28929 12693 8668 19438 23511 19734 14862 9184 3744 3426 -7247 1277 805
14364 805 698 -819 -6808 1123 11111 15228 29662 34433 25193 29017 29322 14475 24314 33727 23561
14349 23561 23801 21995 17182 28598 27226 17172 12194 420 -79 10979 19520 14675 12516 8121
14335 8121 773 -5860 3184 17828 24528 29768 40613 44895 36434 32016 30899 29342 19126 22942
14321 22942 29964 18267 12709 15 6601 25103 17048 21249 20238 16081 2492 -6935 -253
14308 -253 14622 19578 10014 20157 29715 23514 20035 28172 31683 29365 17000 1748 -9827 -15794
14294 -15794 -16487 -1620 3999 8378 16563 20335 18252 14131 14548 18867 9145 2424 2208 3973 7292
14279 7292 11376 11814 7140 22498 19591 19289 19531 31948 28779 15327 24366 20765 10628 6071
14265 6071 28479 28139 13163 21633 26279 21524 19147 8503 8625 5652 6281 14961 8024 6323 492
14250 492 -1645 12704 13582 14219 18149 14247 10654 11653 6857 12780 11953 2656 1980 -4446 -11454 -8524
14234 -8524 -6807 5843 -1563 -1943 -4494 -11297 -4954 10255 4553 5261 12366 21389 21698 30872 47643
14219 47643 44295 41424 22982 15788 20068 15455 12490 22280 24654 15086 12165 13342 32835 42655
14205 42655 38943 27450 35782 25014 15077 16494 29140 27148 12456 8343 6266 12978 11752
14192 11752 17413 6243 7836 16546 9782 9542 17105 17283 13616 -1666 4200 118 -5209 -708
14178 -708 14633 17027 17106 19656 17596 21133 6219 -1254 14784 21865 24517 18568 17826 20593 28703
14163 28703 25011 23067 25924 31928 40120 38891 28977 21381 8932 3987 13540 15774 24490 28294
14149 28294 23436 12887 2641 -13468 -18685 -21127 -18546 -11474 -6393 3662 8853 12640 -448
14136 -448 -5762 -2770 17010 24010 27921 29227 15043 -15976 -17621 8995 14249 -1704 -7864 5202
14122 5202 17775 25237 19075 18177 17501 28790 28675 28563 37020 38336 32869 35179 33040 16148 4913
14107 4913 -339 16329 37072 40841 30233 29382 29365 35155 28564 24873 24212 14608 16552 21892 17816
14092 17816 17665 29137 33380 39344 45356 24585 13920 10815 3051 -6684 989 8995 7385 -3153
14078 -3153 10725 26113 17605 10192 4830 14131 19760 8688 -57 1146 -2268 2436 4857 11432
14064 11432 12495 184 -923 15834 22053 28182 25573 19491 23523 11547 7219 1432 2558 1296
14050 1296 9007 9382 6063 13060 19904 16756 17842 13826 20761 27718 20297 345 -9881 -1985
14036 -1985 13357 15495 13179 14754 17673 9713 4880 14188 25733 25553 22718 16012 9413 7978
14022 7978 18143 29309 24139 20340 27782 26643 14276 12560 -8932 -17825 -7133 4563 6168
14009 6168 16765 19115 15683 13020 12910 12429 2729 8556 17546 33918 33656 22018 12715 6786 13371
13994 13371 25202 20722 12207 18100 30230 40908 36737 36568 15600 -9268 -1062 1242 8667
13981 8667 1855 3070 -1555 17206 28878 34440 42496 33395 31987 27986 37387 28024 11413 19097
13967 19097 31951 10056 1580 -207 5330 12078 24351 21341 20232 13796 14589 8268 15016 23586
13953 23586 16800 15793 23868 30605 36049 35342 27625 31074 19677 20193 23908 17248 8254 17406 19855
13938 19855 15142 15040 15934 22447 34053 35609 33035 30223 18099 6651 -3200 -3033 5300 28269
13924 28269 35371 27077 24027 23827 20908 30053 25465 13717 10857 16439 24722 26945 27173 37185
13910 37185 33681 34806 30972 25312 13309 19012 30021 26508 28036 41990 44261 42887 42829 27897
13896 27897 23629 43250 41470 38410 39727 33878 35655 35000 40767 36592 30388 23257 12557 17505
13882 17505 28415 27423 21079 11442 624 10236 21361 27695 26024 26338 23544 13877 15360 6343
13868 6343 23555 45998 48266 46555 48481 34047 35789 47507 36804 32831 30772 24144 26285
13855 26285 25815 24765 31278 33428 32504 29034 38720 50730 52639 52336 57702 50759 42372 52687 49527
13840 49527 30496 14815 12329 18456 24574 21874 11619 3334 17265 19390 24359 32426 39006
13827 39006 39958 24331 37054 34149 21170 16245 39236 54777 47892 44386 47404 41656 35931
13814 35931 34141 40984 32143 31519 35816 40538 35673 27865 31326 40283 45789 42011 36810 44229 47202
13799 47202 21713 8853 15573 14537 13481 13682 12562 25471 44082 64043 69388 51797 25084
13786 25084 21357 36412 47260 48966 62109 63490 76669 57298 37593 28355 34933 57823 47596
13773 47596 28311 17457 20941 27204 47745 55903 51956 52043 57693 45565 45171 43374 31073 35878
13759 35878 39230 40820 62373 64726 55143 46719 43998 40904 50349 62935 63009 48638 38235 35019
13745 35019 40310 46003 43882 52701 64434 65991 63962 52868 48066 54023 61432 51306 40699
13732 40699 48176 43528 37465 38380 59053 63995 51149 47342 54204 43844 30686 18902 27967
13719 27967 37312 38081 35087 41205 40428 31680 44661 54542 58019 57242 46735 38836 46144 57589
13705 57589 57173 47175 51161 56803 56981 57236 63052 76510 71999 53438 45617 67928 79366 71717
13691 71717 65259 57057 48364 57731 60981 44000 33767 36896 59408 65417 54489 45363 51145
13678 51145 44582 58776 72704 76774 62172 37076 40058 41979 41835 46852 50173 45279 47705 43921
13664 43921 54045 55770 59595 57220 53198 52057 42876 39222 38793 38120 43420 49951 37379 32523
13650 32523 30730 17317 21305 25294 30506 30564 41694 48417 54663 51023 38209 33590 34725 42415
13636 42415 53973 53266 40774 45785 65803 82708 78366 67197 48411 33207 47531 70660
13624 70660 63597 53734 54026 39543 40634 44327 46625 40262 45686 44523 30879 20151 32100 37190
13610 37190 47772 48381 41651 40642 38175 36112 34393 36410 51787 49615 38335 34921 42137 48269
13596 48269 59180 67533 77705 75219 72185 73466 63277 64266 57420 53038 58255 55238 61991 73559
13582 73559 72315 71061 74300 74181 65491 72643 63407 49930 52630 53589 44563 24110 17802 33730
13568 33730 42651 46217 46460 58416 72093 64756 46826 45795 42077 51219 58544 48229 46546 62982
13554 62982 67432 51289 57529 65241 65221 54007 54537 46759 52264 77843 88186 92523 93172 90109
13540 90109 78092 74415 85371 80545 74558 65860 59830 61257 67509 64546 70772 68810 65984 50015
13526 50015 46509 47982 57185 60819 65082 81280 91008 77550 63467 60945 64718 58366 75916
13513 75916 91671 91794 93023 88143 81965 75696 72877 76068 91448 108183 113659 112052 120810 125704
13499 125704 145696 144371 135612 136353 163318 197436 233423 282725 320806 377634 466934 602874
13487 602874 807807 1098945 1414532 1729333 1993321 2176570 2249495 2171064 1926622 1584296
13477 1584296 1211265 905697 703565 588711 513954 458802 429067 406209 386932 375168
13467 375168 352419 326568 314791 317405 306185 296640 293360 282280 269723 260531 241713 232102
13455 232102 234000 237371 230118 230978 235437 229273 204128 191679 178902 164198 159080 159934 165370 169195
13441 169195 160729 153433 152834 154177 153287 161126 172171 179644 174588 173489 173202 152885 155088 173208
13427 173208 173384 165621 174193 172814 187152 184702 175675 166574 169313 159629 151000 161002 177659 180077
13413 180077 184053 190413 189384 196110 194464 189072 189962 197891 183107 181083 181819 174927 179267 185484
13399 185484 177318 174088 172164 179031 192349 188456 161453 153347 162289 172826 166578 164986 174392
13386 174392 178833 166427 171422 186120 193078 204109 203668 195204 189660 177333 163020 151992 158192
13373 158192 171157 185819 172136 154827 151223 148660 144981 152669 166675 168971 156840 151540 170427
13360 170427 191956 192604 174186 151718 141616 148623 149929 151829 140851 131786 148126 139547 129534
13347 129534 126115 108482 112291 111074 102438 91100 98107 95443 106095 110866 130148 140574 144255
13334 144255 147061 146782 147004 150972 150304 140674 128128 141788 158097 159645 158100 151787 154399 140240
13320 140240 134937 144255 145490 137442 134208 121931 120137 129512 141236 151970 149702 150631 160729
13307 160729 173894 185379 186079 192906 194002 181984 176287 172791 171923 178773 188825 213670 233989
13294 233989 261775 296029 300990 311644 321199 333112 338764 351154 361651 369384 376499 374517 370958
13281 370958 352844 328441 306377 287778 264900 249075 234638 235574 233980 249372 246453 243251
13269 243251 251189 246641 246953 234483 221287 213024 195843 186909 186948 194609 201839 214570 209494 199006
13255 199006 189765 187793 200752 202912 210140 213073 214007 220303 215949 214010 212019 203665 198488 198386
13241 198386 210421 218544 199720 197573 201724 194385 190544 188483 189076 167146 153913 141898 136733
13228 136733 126414 107023 90110 93702 107702 129592 131069 127851 117142 113218 120799 114767 113761
13215 113761 134086 157017 181550 190373 194525 186657 198319 214374 211660 227169 232493 241258 243073
13202 243073 244781 236039 217796 215324 216241 207397 236379 246284 249644 252597 254594 254845 249254 236493
13188 236493 240206 229367 225418 234914 259892 272264 260391 249796 264294 286130 301168 320132
13176 320132 328349 340526 340225 338299 345665 358243 385786 428782 507586 596182 684948 735573
13164 735573 729440 707922 711677 753683 775034 767544 741881 700096 660315 628820 625271 643263
13152 643263 658968 668236 662059 657826 649035 648789 654092 639434 627926 618614 633774 656478 677890
13139 677890 699549 726952 749667 757078 765357 790798 787622 780932 774876 756590 742648 718424
13127 718424 697580 693346 693199 688793 672614 660529 649594 643961 647008 654324 675633 704853 734671
13114 734671 779356 814345 859886 909621 939120 954924 955207 957277 947256 939640 945096 952867 997317
13101 997317 1042323 1076441 1104507 1123442 1150075 1175218 1196110 1233272 1268406 1321909 1365182
13090 1365182 1404272 1464176 1512741 1555938 1608818 1639829 1664938 1711601 1772194 1834953 1901991
13079 1901991 1973419 2082243 2212161 2350007 2491745 2625570 2759838 2895047 3021965 3119607
13069 3119607 3229112 3354606 3501428 3682152 3932979 4251565 4646716 5127245 5691216
13060 5691216 6312304 6981512 7715035 8544134 9468151 10482115 11610665 12936103 14519464
13051 14519464 16475444 18912140 21976572 25905182 30982288 37628188 46590782 59250051
13043 59250051 78013781 106688445 149594837 206708457 269062412 326240128 370890402
13036 370890402 398496481 406256766 386615622 338586627 272648536 204500727 151236247
13029 151236247 116593734 94784187 80439782 70374834 62852172 56893118 52006399
13022 52006399 47963336 44653797 41929387 39647119 37719266 36023589 34436233 32858685
13014 32858685 31223378 29557556 27934393 26445242 25102605 23882346 22747073 21665293
13006 21665293 20606568 19574040 18594481 17673257 16813019 16024030 15296206 14651994 14090118
12997 14090118 13584259 13130340 12747811 12420759 12125426 11847204 11576067 11321332 11066042
12988 11066042 10807706 10551002 10308686 10092651 9874237 9618204 9339889 9023958 8697426
12979 8697426 8363572 8027420 7694948 7386218 7086407 6796819 6538951 6308904 6101088
12970 6101088 5909096 5707112 5524145 5349424 5161563 4985571 4809927 4643514 4476386
12961 4476386 4330076 4207534 4100000 4000919 3921641 3840397 3741082 3636976 3525235 3417968
12951 3417968 3304051 3181879 3069174 2956712 2857886 2766516 2673577 2595440 2506964 2431763
12941 2431763 2376054 2315863 2265270 2223921 2190001 2159751 2135676 2101019 2047543 1989816 1934973
12930 1934973 1870785 1791393 1699632 1603334 1509647 1428884 1344832 1251907 1136049 1032799 952865
12919 952865 893756 848053 812276 799089 799937 800676 788555 774890 734002 692142 627348 562055
12907 562055 516029 471264 437894 418347 390682 369112 358270 354496 349440 347508 346598 336409
12895 336409 335876 342690 363967 384095 398329 397194 380429 358811 360675 358300 357656 350962 344893
12882 344893 348569 354565 362564 375127 392873 435382 494551 557181 618218 682247 744475 790207
12870 790207 819603 813052 779159 714777 637169 576980 528043 477746 437160 420274 410284 404003
12858 404003 414863 436696 456196 467705 478533 483324 455033 425706 412616 422109 425639 417326
12846 417326 426983 447648 459236 453429 421742 391383 355698 337005 328315 321227 304006 276488
12834 276488 276857 272504 254838 242107 239520 234474 228529 227720 253134 262036 257580 243106 240657 247773
12820 247773 255923 250212 266595 285502 314201 327900 326362 320041 330070 338018 333963 325404 313485
12807 313485 290427 255677 238573 230971 216401 220673 231740 226017 214453 216240 214011 203803
12795 203803 216973 219406 196160 181690 164696 140300 139181 141586 131184 127947 117470 124806
12783 124806 120586 120230 114852 100124 85952 73092 76281 78325 80765 81863 87284 99615 103941
12770 103941 96771 94088 76917 53771 44335 53976 59968 48223 46098 49060 57635 68395 79368
12757 79368 87280 83744 86397 70506 57403 47244 32070 34896 37252 47525 61464 68724 71143
12744 71143 76631 79032 78873 75774 89202 82420 91638 105444 114112 139511 153240 157112 150450 131726
12730 131726 130238 135366 133391 139023 142207 123916 121170 139350 152057 153952 158324 170342 193491
12717 193491 194884 214186 239489 272317 306370 336331 360195 379877 424319 480412 547007 654868
12705 654868 776745 909367 1104359 1346151 1668277 2140657 2893677 4066563 5795677
12696 5795677 7905050 9968817 11928035 13431357 14191737 14023314 12762077 10796070
12688 10796070 8414511 6111281 4520556 3543867 2942768 2549830 2258550 2027638 1855543
12679 1855543 1701054 1560575 1462500 1401770 1347671 1287320 1249946 1219849 1170255 1106528 1054757
12668 1054757 995378 935002 867409 812794 765187 727296 684399 647372 631346 612387 592483
12657 592483 569179 546685 509983 500508 487905 471599 453798 428641 419331 389944 375116 377580
12645 377580 371053 363353 354873 353928 349690 334863 323115 314523 310870 309076 295764 273652 257058
12632 257058 246967 246035 243812 230570 224468 224328 208424 199705 192099 180885 170871 168100 155033
12619 155033 150883 153049 149170 133913 111863 112874 107736 105178 121552 113808 110383 117415 114872
12606 114872 114225 109310 93659 101989 121748 144639 170356 186034 183773 193855 209696 229901
12594 229901 249078 273072 327876 402661 486884 654867 893583 1206920 1537393 1839147
12584 1839147 2088553 2224897 2232819 2084532 1787909 1419192 1065562 793518 626131 524078
12574 524078 458862 415527 366177 320522 307093 281643 258032 261240 260818 250020 241399 212719
12562 212719 199272 194019 184901 160470 149534 148708 146742 132680 121971 115478 115334 112683 107291
12549 107291 94205 90147 86585 75204 79421 83303 74435 59546 43420 43477 52544 60554 64677 58820
12535 58820 61659 57606 48303 51077 57650 58604 44326 35984 37744 50479 57940 61496 63063 35958
12521 35958 9341 8177 21676 25867 27146 38357 45642 44190 43797 38342 36716 36600 33650 39343
12507 39343 34738 20076 21865 25422 18139 17562 27763 26576 28903 29323 36126 33381 24933 27574
12493 27574 41233 42829 31912 24552 24171 19306 21361 21024 2491 -17263 -10895 -18245 -12535 8165
12479 8165 23459 19040 -2149 -12078 1781 9068 12130 9909 10435 8559 5872 10166 18859 23071
12465 23071 19962 6445 -2870 -1204 -11175 -6837 2803 5303 7421 14765 8514 6747 14278 16050
12451 16050 10367 15229 10718 -2334 -15589 -14331 -11107 -7006 7329 24547 25857 22847 9503
12438 9503 3119 10149 16696 9070 14118 19959 3011 -6779 -15148 -11078 -9139 4872 15550 10440
12424 10440 24864 31059 25936 10685 5493 11423 -7036 -10324 -12888 -10802 -10226 -25783 -31626 -16001
12410 -16001 -20361 -16070 -15607 -8688 -9395 -16927 -18726 -14664 -21142 -9652 -12195 -24109 -22738 -19057
12396 -19057 -16867 -12061 -12829 -18085 -17606 -19131 -23440 -30879 -25963 -22357 -23357 -22888 -29368 -36337 -34497
12381 -34497 -45017 -49071 -36926 -34060 -28354 -26195 -28773 -43383 -48732 -38050 -35405 -39302 -37320
12368 -37320 -24881 -29402 -29320 -22187 -7790 -1528 -6809 -3829 2068 3402 3734 5235 18288 15145
12354 15145 9870 3723 -9311 -24793 -28982 -18856 -19968 -22922 -21215 -21038 -30358 -33003 -24718 -23107
12340 -23107 -27650 -25744 -17626 -3227 -5465 -9644 -21814 -12622 -8526 -10981 -18669 -18692 -27979 -30350
12326 -30350 -35534 -27703 -8488 196 -10301 -13263 -1694 10009 6102 -7893 -14122 -17225 -13859
12313 -13859 -8214 -3512 7861 5473 -9765 -23575 -13642 -13327 -15186 -10994 -7716 -19494 -30217
12300 -30217 -28777 -10583 8034 19127 11431 -9017 -23276 -11039 -22608 -25733 -16571 -17300 4441
12287 4441 -8492 -30255 -35654 -24256 -9957 -12361 -20157 -21627 -15461 -5745 -9575 -5555 14501
12274 14501 14879 -4972 -28970 -25382 -12808 -6404 -12812 -6712 6492 -7148 -6484 -19089 -32179
12261 -32179 -30544 -21346 -16023 -14071 -22733 -31269 -33540 -31291 -32057 -19027 -10010 3044 17215 36486
12247 36486 41760 49022 60763 64662 65306 52290 41213 31099 8918 7046 -5004 -11769 -12094
12234 -12094 -20210 -27304 -22480 898 9817 20391 21426 19287 13985 -3104 -13615 -18297 -9279
12221 -9279 -3561 -354 8982 18360 11143 7349 15490 9914 -959 2661 -2416 -3910 6327 7668
12207 7668 3078 23 -4663 -2852 -7312 -10801 -9252 -13436 -7871 9240 -3578 -254 -4039 -867
12193 -867 4950 11048 -2408 -15947 -24257 -34519 -22669 -5486 -2563 -7261 -17940 -15330 -9594
12180 -9594 -14899 -14041 580 11291 59 -10439 -2256 -18794 -21150 -11818 -19190 -13476 -11185 -21443
12166 -21443 -13871 -11407 -9786 -4261 -5306 -4265 -14311 -22969 -11326 -20986 -25867 -23360 -25100 -14952
12152 -14952 2915 2315 1094 -4342 -4631 -8201 -18692 -20351 -7241 -3370 -2163 4317 16605 2706
12138 2706 843 -5354 -11282 -15448 -19814 -31344 -26973 -15459 -20488 -29293 -17010 -15317 -2021 6066
12124 6066 2771 -8217 -12518 -10624 701 16295 15357 19225 23552 19647 5750 1311 2029 -3423
12110 -3423 -12156 4303 7332 -4986 -9673 -6738 -7004 -8435 -8469 -26410 -18911 -6856 -14832 -26598
12096 -26598 -22639 -13602 -12641 -9772 -6851 -5648 -13969 -12987 -11975 -17302 -25710 -29295 -15502 -8447 -16541
12081 -16541 -2626 1466 -6095 -14407 -25865 -14718 -5037 -1905 -13391 -17212 -3229 6757 1509
12068 1509 -2171 -10980 -13471 -7022 -11355 -13286 3808 2420 -11566 -1337 5503 3812 -4100 -6941
12054 -6941 -11088 -17390 -27677 -24273 -18481 -19001 -11173 204 3585 -12726 -19474 -17922 -3237 -1537
12040 -1537 -7268 -10379 -15265 -7735 -4671 1588 5320 -8870 -20945 -16782 -6260 -14069 -21169 -1163
12026 -1163 7827 786 -12977 -21421 -17396 -7151 -9369 -5384 -8480 -5401 -8991 -7560 2748 4543
12012 4543 10925 2304 -15870 -20877 -24989 -16483 -8368 962 13988 12606 -6222 -25987 -32611 -24961
11998 -24961 -17579 -17350 -16127 -7272 -16022 -35484 -38273 -27722 -23836 -20934 -7863 1576 -6751 4686
11984 4686 2887 -1954 -1034 5304 3819 5679 257 -13906 -17930 -26185 -24633 -27210 -24628 -21015 -14197
11969 -14197 3411 21166 13154 5331 6893 -5868 -9309 -290 -10465 -21675 -19026 -28642 -19628
11956 -19628 -19653 -23892 -19539 -27031 -35430 -31034 -28770 -25232 -14099 -10552 -5540 -22236 -25284 -25114 -27372
11941 -27372 -23828 -23664 -22060 -26225 -26198 -20443 -37470 -29549 -20078 -17452 -18536 -15879 -8457 -15688 -13880
11926 -13880 -14247 -32834 -32279 -32218 -21089 591 -1934 662 -2596 -7464 -17622 -20572 -12759 -13130 -20746
11911 -20746 -10357 303 9267 8909 7283 12652 4919 -5375 -2547 -11259 -12474 -6022 15370 22596
11897 22596 8922 -1033 4111 8156 9671 6643 5946 -305 -8912 -7269 1334 10944 22932 11804
11883 11804 4227 1354 1560 -6515 -18614 -13402 -17650 -16138 -14891 -15147 -19016 -22202 -21954 -14836 -13665
11868 -13665 -23581 -22475 -15072 -24764 -32283 -26696 -22058 -26537 -21232 -7561 -5777 -13164 -25543 -24024
11854 -24024 -24192 -12648 -23195 -27594 -26064 -35583 -28981 -22004 -17334 -25652 -36723 -33017 -24357 -11807
11840 -11807 -9643 -14834 -12913 -7373 -6579 -9953 -12606 -13494 -1616 4896 5551 20047 21158 -2739
11826 -2739 -23962 -20317 -3301 4847 10779 2027 -2374 -1643 -19298 -15091 -13248 -21622 -27794 -27590
11812 -27590 -15603 -14863 -30636 -31979 -26999 -10306 2208 9333 16396 15883 8740 -6344 -14867 -2644
11798 -2644 1813 -6958 4485 17015 17750 19920 20928 26238 15599 2777 -2987 -1040 3178 14353
11784 14353 4406 -17115 -19382 -17158 -15897 -22869 -29697 -21918 -19342 -14568 -7873 -9838 -3777 -3751 -1510
11769 -1510 -10287 -20048 -21143 -12161 -2081 -8333 -24053 -30207 -31587 -23744 -24222 -19877 -8668 -7992
11755 -7992 -5451 2839 -1029 -18617 -25853 -21216 -23350 -16467 -6405 4278 17237 -3991 -17790
11742 -17790 -14283 -16830 -27981 -19671 -18799 -18713 -21652 -25574 -18936 -4629 -8071 -11778 -17674 -30755
11728 -30755 -22443 -13847 -6086 -11941 -16453 -16624 -30223 -23557 -8510 -13699 -14203 -21356 -18806 -2023
11714 -2023 6274 -6943 -11870 1583 7113 -6239 -16659 -35817 -35307 -34308 -23095 -15405 -5342
11701 -5342 -6962 -18841 -28456 -31166 -31258 -35663 -35932 -29729 -35814 -19666 -1562 6349 -6868 -23075
11687 -23075 -28538 -29729 -30054 -25727 -17639 -17268 -16975 -18144 -11261 -10943 -16218 -16187 -13595 -11966 -3015 -13421
11671 -13421 -11728 -13256 -12959 -18291 -10805 -10472 -20102 -23405 -28652 -37298 -38311 -33966 -40060 -41091 -42960
11656 -42960 -37283 -34448 -9995 595 -3901 -9570 -12989 -8971 -19015 -32388 -43008 -54538 -55194
11643 -55194 -41351 -23148 -25193 -17892 -18550 -22232 -26264 -19014 -17823 -25092 -24475 -16528 -16478 -6709 -15092
11628 -15092 -17542 -13535 -8517 -7257 -9006 -15221 -16434 -26687 -24176 -17904 -4379 5595 10853 15155
11614 15155 -552 -16472 -21584 -17890 -12991 -970 1354 -12567 -12553 -13128 -11892 -5323 -3465 7482
11600 7482 -2743 -2710 -2423 -10031 -10361 -5317 -4462 -11406 -20011 -14585 -12557 8421 4672 -10622 -8984
11585 -8984 -2039 -5481 1136 2000 10311 9675 6369 -7772 -15853 -9056 4385 -2535 -12767 -11959 -1577
11570 -1577 6957 -1179 -2790 -14294 -26308 -34857 -42102 -34972 -30871 -14347 -9024 -11572 -11875 -21154
11556 -21154 -24043 -29490 -18233 -20195 -19469 -32880 -28091 -18748 -15515 -1348 4847 -6242 -11425 -15728
11542 -15728 -9727 -6204 -14301 -16358 -16487 -21114 -17121 -14292 -30186 -24778 -30289 -48337 -52122 -23577
11528 -23577 -13723 -5347 6916 9436 -2895 -11917 -10607 -13328 -14986 -11279 11530 13157 7648 -7331
11514 -7331 -14222 -5130 -3408 2924 999 -18477 -31923 -31591 -18051 -9512 -5223 -7048 -16718 -17882
11500 -17882 -26334 -27619 -6788 3187 -2453 195 3267 -3961 -17497 -14956 -19216 -30050 -40805
11487 -40805 -44449 -30248 -23065 -12902 -8916 -4055 10649 5458 9412 12282 -9322 -27197 -15473
11474 -15473 1656 15557 20931 11973 17284 22721 9235 714 -11370 -22339 -21724 -29208 -34087
11461 -34087 -22037 -27185 -31078 -23857 -15051 -11665 -21179 -25066 -15441 -13023 -28551 -24574 -28196 -17171
11447 -17171 0 -5749 -12432 -18052 -27375 -29983 -22034 -30558 -30451 -7338 -1208 -5581 -8910 -6405
11433 -6405 -10828 -13697 -13282 -10714 -4162 -14736 -25091 -26506 -32137 -26340 -10131 -15149 -9809 -3295
11419 -3295 -6188 -15414 -10846 -19322 -21130 -22053 -11351 -7385 -15902 -20190 -11308 1587 3876 11876
11405 11876 4372 4617 13960 6040 4301 10890 1368 -4504 3659 -1941 -14094 467 10750 19496
11391 19496 154 -27767 -34629 -24296 -18348 -28280 -14884 -5296 1672 13139 18456 14076 6002
11378 6002 -2010 6277 12937 4209 -11208 -17297 -21323 -13173 -2403 -868 -18261 -25855 -33223 -16058
11364 -16058 -11656 -1576 -3722 -6912 -8238 -11873 -15217 -6948 -7898 -8150 6713 2363 -4923 3717
11350 3717 12790 18 -12903 -16475 -8616 3715 7542 15887 7371 -5518 -9871 -10384 -314 5111
11336 5111 3528 12843 19772 7903 -17157 -16472 458 5882 9321 17715 25087 8245 -6076 -8991
11322 -8991 3033 13066 10664 6401 22062 9335 -6953 -12337 -30444 -25380 -13567 -1115 -12064
11309 -12064 -20798 -19888 -2712 -1818 -11922 -12562 7137 23284 25180 25561 26619 19622 14516 29683
11295 29683 35601 34673 28212 14242 2627 -3607 -5087 1110 1896 -2276 -5615 -2767 -4509 -2383
11281 -2383 4217 4993 1622 -274 -10607 -10707 -7187 -9191 -18098 -24517 -25320 -12825 -5719 10198 4360
11266 4360 -2583 -7846 -6089 -3612 -9993 -18988 -21941 -7694 -1573 4130 5063 -3813 -16615 -26535
11252 -26535 -18841 -6235 4863 13731 11335 10224 4021 5118 5263 8007 5559 5496 -2373 -8654 6268
11237 6268 12810 8555 11690 26415 26274 22284 15525 8110 8094 -4627 -8406 1261 15599 15833 363
11222 363 -11405 -25096 -28659 -11134 4285 2075 6319 10740 653 -14997 -12472 -13967 -8617
11209 -8617 5535 -611 -11287 -15738 -6397 -1008 -10081 -28039 -33439 -28472 -15367 -3497 -6529
11196 -6529 -23878 -33039 -24429 -16965 -12328 -13564 -1329 6625 4530 4591 -4349 -278 5655 7884 13202
11181 13202 14964 3122 -2695 -4859 6653 11283 7730 -435 -8379 -13609 -9465 -10116 -9661 1865
11167 1865 -2449 8462 21188 32671 42002 36712 36553 31191 27648 28824 22495 12657 -4667 -19804
11153 -19804 -7721 -2000 1731 -8107 -15420 -7808 -6142 4683 23874 11218 2927 6874 6764 -4137
11139 -4137 -8194 -7442 3162 -28 -8182 2516 8387 -205 109 7871 17064 13865 14020 30451 30424
11124 30424 28168 13215 19435 22447 15196 11010 2003 -2294 5709 9923 13794 18657 17641 13689
11110 13689 14241 13236 23603 27009 9253 -320 5834 -2051 -2826 1500 -5594 -8893 -11665 -13052
11096 -13052 -8652 -13140 -4993 728 -7305 429 -314 10205 5837 -6467 -16457 -9717 -9403 -18296
11082 -18296 -27402 -31528 -16455 -4426 4216 7254 14682 12484 6672 1377 -7594 -11746 -11291 -7367
11068 -7367 -677 7848 5755 -3320 -16950 -10249 3836 6820 184 -4068 5505 14479 2200 9523
11054 9523 7338 -4744 -10150 -74 7706 1690 3979 4435 -4420 -16982 -21596 -10871 -13326 -6188
11040 -6188 16821 11886 -1040 -6798 -24397 -14677 1868 12913 18826 6959 5302 4634 -1711
11027 -1711 5698 608 -6787 -9610 -4627 -7856 -9890 -4157 -4290 -6578 11056 13980 -5415 -16847
11013 -16847 -11405 -8879 563 9566 -5414 -6389 581 13069 9944 -869 -930 1280 1993 4671 -6527
10998 -6527 -14139 -13258 -18858 -8809 -8153 -10085 10595 15394 -192 -18587 -19092 -27538 -25180 -3310
10984 -3310 3024 -4395 -10211 -9784 815 -7212 -19962 -13398 5078 18924 14814 15407 21412 26061
10970 26061 8472 -1776 -6910 -1815 4590 11350 4433 5587 30220 21076 3912 -7056 -8942
10957 -8942 -4386 471 4217 72 -9582 -8805 -11355 -5652 6213 -5979 -4084 8799 18991 7959
10943 7959 -1538 -18525 -14492 -5673 -551 -4530 -5369 1279 -751 -1782 -10343 -14640 -10139 -5116 -500
10928 -500 3364 11120 18717 13473 -9814 -25088 -16887 -11533 -13190 -14367 -4518 4204 -10386 -11032
10914 -11032 836 -3040 7847 3090 -6334 -8923 2849 10605 21635 5093 10299 13021 18857
10901 18857 11422 3333 -101 3215 12857 7506 -4319 -1747 323 -13904 -31171 -26802 -8292
10888 -8292 -3647 -5680 -5987 3338 9266 978 -9723 -6875 7168 25723 25127 12628 7732 7378
10874 7378 -5193 -17151 -21100 2150 15081 -56 -14517 -19203 -18201 -11028 -1982 -14220 -36209
10861 -36209 -44200 -29626 -11842 -14526 -12204 -10883 -4815 -1933 -5603 -14952 -23490 -9285 -5376 2524
10847 2524 6999 6978 -6341 -13092 -10883 -515 5731 4800 -2521 3226 2776 -1794 -68 4292 -8029
10832 -8029 -13721 -5671 -14203 -11729 -20575 -19956 -12285 -5922 -1678 -665 15523 7428 5810 -5117
10818 -5117 -14937 -4684 1081 -2284 -4581 -1378 7769 4771 -18000 -26448 -20162 -13361 -9025 -5958
10804 -5958 -10964 -2492 113 -2594 3881 -8301 -5906 -8260 381 12762 3882 6573 8266 6421
10790 6421 672 5750 14290 19496 11160 -603 -14052 -14523 -17560 -14262 -9466 -6345 -581 10555
10776 10555 20511 9234 -1326 -1293 -5085 -8830 4659 19484 26772 9262 -6378 -10794 -10379 -11639
10762 -11639 -10060 13451 31780 32281 26752 18871 16921 32824 28930 11296 2570 -3350 9414
10749 9414 3819 9450 22865 30694 25381 29250 33177 30701 27193 21329 6073 -17208 -19505 -11949
10735 -11949 -4665 1057 5348 15997 16847 7848 -5867 -11549 -12784 1215 3288 9546 11605 -887
10721 -887 4949 10515 13388 6660 8074 1918 -9036 -6883 -12475 -902 11907 29568 29946 29031
10707 29031 25614 6789 9735 16943 17460 16780 13816 6746 -6115 3688 29890 33653 21925 11938
10693 11938 5013 2844 -8583 -4822 -2901 12673 6729 -1058 1132 9333 15601 50 -6743 9339
10679 9339 16917 10973 7254 11043 -558 -1963 -5719 -25775 -19339 -5102 -8570 -14503 -11489 216
10665 216 12650 6759 -331 -3376 -9540 -2564 -4716 1253 7644 15399 8359 9359 4104 -3836 -6785
10650 -6785 -9163 -13135 -21247 -17019 -14774 -24327 -9062 6054 -2181 -7266 -2248 -1151 -6346 1058
10636 1058 9724 6607 4290 10904 15140 15722 27520 23623 18847 13688 2783 12835 20006 8066
10622 8066 12809 29324 33062 31584 26457 16449 2023 1078 673 -1720 11042 14311 5888 14415
10608 14415 12126 19203 27334 15414 7832 -10643 -10114 3113 13545 10132 9110 -155 2991 5543
10594 5543 -2840 1494 4669 874 -7949 -7308 -12321 -20799 -9321 6034 9792 -497 -6393 -519
10580 -519 18137 28698 25359 13823 1485 -2748 2743 10964 10501 16199 29279 27545 23201 13641
10566 13641 4689 3006 5078 5840 10538 3341 7752 4835 2177 4072 -220 -6089 7631 21383
10552 21383 27095 24655 17481 7661 12638 21143 23333 20691 20330 21970 20904 17114 22654 22995 19290
10537 19290 18869 16130 2105 -17385 -11186 -4470 8672 16312 14450 3874 16100 21352 14922
10524 14922 24228 18448 8428 14484 20181 25089 30495 34051 37579 18053 11483 8530 4698 -3199
10510 -3199 -232 1888 3065 16821 10777 6090 6809 18658 16804 4011 690 9578 10084 14488
10496 14488 8792 3796 8824 13402 11872 6077 -1000 10746 14752 5895 -10840 -24682 -23595 -14771
10482 -14771 -12123 -2350 8313 9940 8652 16682 12493 9202 12659 16084 29939 34914 32480 33797
10468 33797 40152 38760 32871 36818 26131 28079 23235 25697 37338 37274 27360 11400 7066 16612
10454 16612 21089 17028 15994 16453 27220 20652 15840 5196 14562 25270 17637 19465 2273 -7032
10440 -7032 -5256 -6911 -14307 -8901 3306 11302 25181 35558 32974 34296 36196 39195 32985 40131
10426 40131 22212 15496 10984 21282 28859 26594 24702 25217 30713 37916 25009 10178 13467 22588
10412 22588 26005 22140 21399 9303 -2080 -345 14415 22719 18514 22350 14347 3150 10716 19497
10398 19497 26143 30330 23053 28289 42639 44644 45987 47485 37936 35618 26342 28668 25201 21393
10384 21393 23573 20120 10650 14608 15282 36195 38706 32192 42665 52771 55549 36870 18972
10371 18972 10561 11281 18846 29108 35950 26200 19207 15028 17123 17363 23690 20298 11469 35313
10357 35313 54054 43975 29244 30391 46282 43967 50889 54773 52103 48983 51064 50364 38874
10344 38874 38204 31771 19110 22816 39444 49112 43999 50137 57787 45778 32053 38421 33853 38421
10330 38421 46473 52934 46316 40862 48296 43483 43936 46668 46682 30496 24502 27701 31178 31511 33776
10315 33776 41386 38912 30201 24629 26524 31226 36571 50383 55054 50383 44621 38804 42411 50811
10301 50811 45525 26887 32435 38806 24742 11133 7770 20743 23659 26150 40255 39040 36194
10288 36194 27408 31094 31824 29679 27296 35581 36998 40877 44419 45681 43907 41758 41872 40242 44168
10273 44168 43966 53871 58974 60921 62046 63070 63661 56604 57061 52092 39522 30664 31941 36335 21739
10258 21739 11250 23864 28287 15290 17913 9644 22842 31764 32883 35638 32658 30871 32301
10245 32301 19895 4011 4737 9811 22241 22253 30491 35562 49386 45216 43478 36024 36098 30224 32550
10230 32550 42260 52645 48802 42595 55341 59825 65671 70831 72252 62813 68043 68635 75020 70065
10216 70065 57701 58282 50716 49235 55407 56849 58438 55084 57619 60393 63062 72324 77588 77692 78456
10201 78456 69568 78476 71088 62495 61908 66032 61707 57368 58434 50369 44405 47083 55920 65542 71730
10186 71730 73535 68845 68755 52255 66920 74209 84120 92356 75287 80476 88176 77635 79578 78879
10172 78879 80075 85402 97503 96354 95243 90719 72881 70759 78796 85185 83709 81167 78048 62884
10158 62884 67613 72795 76485 80892 82914 95606 105090 92005 91797 96282 93634 87718 87966 94605
10144 94605 95985 95206 90627 77607 79424 80619 84298 87760 79634 86620 87076 85770 85476 85007 92134
10129 92134 98474 105853 107940 107009 100101 96730 89878 89932 93697 101502 102614 99427 94011 89265 91565
10114 91565 86704 97538 106806 121353 123208 100019 94334 114294 130839 132328 137629 129507 117823
10101 117823 105867 109848 125983 128318 126159 115847 112608 94269 98848 95097 100839 113242 117939
10088 117939 122304 132092 128147 117251 105608 119913 135734 133397 133479 142756 148460 155965 156063 150629
10074 150629 157350 165031 157535 146017 144234 144463 147696 149111 160540 160987 169969 171494 158643 167256
10060 167256 170700 166590 161788 147694 144391 147453 151927 168879 178311 175981 163871 150658 146846
10047 146846 156764 168637 177199 177532 162697 176383 195611 200399 220983 243114 258196 298250
10035 298250 372274 471446 563208 632619 664998 685573 651713 526039 394080 329588 289577
10024 289577 267436 250154 239808 240289 231420 221656 210103 197668 193688 204117 212316 229548 248746
10011 248746 253095 238840 225249 212182 207119 209531 216830 217352 211577 212655 213953 224701 226296
9998 226296 217643 213998 219186 218593 202218 199955 207124 219631 219253 200681 192433 203928 200024 212044
9984 212044 214076 217357 225117 224590 229883 242218 236440 236697 242146 242207 236596 225699 227195 216841 214944
9969 214944 208909 210640 211091 205561 200767 204409 206728 206501 220113 222535 226619 221528 215452 225718
9955 225718 237693 235244 240882 255162 255017 257186 271439 271975 258343 256966 268846 267674 264066 251857
9941 251857 248571 256458 251922 251176 239079 228389 238411 226566 212431 226524 246719 247897 238848
9928 238848 242730 248609 242045 232324 233148 240145 239153 249318 276120 283930 286697 290026 290718 288152 268884
9913 268884 257502 254919 255790 257983 248406 244953 241053 237994 231660 228584 248821 243637 248030 246387
9899 246387 246069 242027 245706 254791 247861 240037 234532 225445 218633 212373 212692 208756 216443 236198 247915
9884 247915 241162 243175 241754 258582 276632 278773 276355 273783 266653 261070 263966 265972 265350 265176
9870 265176 258626 254740 250225 245995 248109 240930 237743 233796 233100 233874 231135 222887 217260 204541 199821
9855 199821 203956 217270 230347 216780 213159 222927 229117 220987 230684 229118 219256 211882 204217 193629
9841 193629 197514 221957 232809 223620 216085 209605 209899 209786 212494 211853 205995 209844 217233 223728 217236
9826 217236 204877 210828 219256 214051 202722 198917 211168 204998 206841 204216 190579 189060 188669 196107
9812 196107 206329 210978 220594 209132 201594 199003 193700 201561 214879 206355 200133 196404 186950 174792
9798 174792 177932 187658 181332 171024 166910 169191 171387 183529 165833 162668 154266 150699 161086
9785 161086 160981 154121 155470 151069 155218 158918 158109 158645 148624 134673 146847 145711 137154 135768
9771 135768 149931 158611 177505 185174 169322 163890 155076 136043 137475 143572 144903 141403 136789
9758 136789 135758 130136 136601 140573 136145 139576 146265 140745 145988 144374 149386 138223 134959 115385
9744 115385 119940 120789 125601 129288 117159 103997 110798 99453 88983 88600 104994 109372 105402 103973
9730 103973 111017 110424 114512 117960 129070 127523 126200 125576 122480 125448 127510 113146 109075 115337
9716 115337 123252 112293 97342 111443 132760 129911 121099 115576 111885 112562 104374 104550 108277 114092
9702 114092 114164 98709 98120 105870 112766 109523 111032 111764 98242 98964 86176 84941 93834 97725 99529
9687 99529 100081 99734 101933 98475 81918 88456 82519 82271 89467 89948 91214 95482 97820 111268 99066
9672 99066 80974 78157 80243 81714 71743 74797 68130 60739 67164 84543 79682 77980 69679 59146
9658 59146 65027 70528 68855 74698 73701 66471 68463 80596 88205 86115 67183 82433 95776 88315
9644 88315 81267 88380 82245 72137 51795 48155 53152 51372 55748 73604 77621 65365 52807
9631 52807 56496 66622 61313 61460 71958 63271 60445 54807 67718 68060 64765 50337 27344 34645
9617 34645 47970 69523 73147 66454 63797 73586 69945 66044 69536 71589 74674 64774 59217 76854
9603 76854 88665 92571 87233 84645 68998 65955 60088 48652 53889 62876 57803 64601 57783 41873
9589 41873 44158 45875 60211 62698 50657 49300 40449 38190 44325 49231 53222 44604 39715 47235
9575 47235 53957 68093 69870 71678 65478 48211 45948 39328 42520 52829 51003 55152 65216 54090
9561 54090 50053 41667 31522 40769 42614 56294 54192 43373 48170 64082 54460 43768 32268
9548 32268 31679 33822 46032 47211 40481 44446 46602 31720 31032 21223 11582 29832 34594 42324
9534 42324 48494 44837 40982 41266 54062 62623 46908 39677 37829 50473 58997 44246 40979 42140
9520 42140 36323 34761 42108 53534 53994 61872 70634 58299 43446 45098 34084 25119 28183 33738
9506 33738 33466 29699 40546 41508 29991 28162 45584 47569 42879 29222 20533 20813 24615 24049 26203
9491 26203 31128 32416 37259 45799 45870 42544 47868 55745 48164 48756 38541 27646 24506 26739 29983
9476 29983 23659 1498 3745 13921 17367 21426 32523 43369 38002 31963 27128 20110 32071
9463 32071 51507 51339 28108 17109 16710 17933 20382 23286 26874 46646 45377 45100 42902 40493
9449 40493 43712 55464 51972 50205 37573 22735 24817 27026 20483 15785 17335 26716 23438 11278
9435 11278 5985 621 -1955 940 8201 28951 29948 30644 40364 49615 39368 29307 21784 12902
9421 12902 25484 41152 38945 42901 50356 39882 25630 25687 23493 12898 29316 36788 29597 18498
9407 18498 20199 30727 41563 48729 34345 23096 16129 11870 19483 30411 17874 4172 -2460
9394 -2460 6908 24191 36802 22820 24846 38589 31162 28756 24748 7027 -8305 -13551 -3793
9381 -3793 7204 140 1417 -4328 3794 16365 4603 9342 15157 17841 17566 30425 23447 13992
9367 13992 14680 27273 29167 21574 25043 37909 40210 29258 23865 25783 31177 32549 25583 25610 36074
9352 36074 37498 19633 11672 9674 7932 -2424 -6180 1562 11174 10563 16457 15006 17435 22359
9338 22359 32074 25253 15721 29460 41363 33421 23867 14161 25198 26196 19963 15954 12885 7553
9324 7553 10570 16595 22685 11392 2804 15547 30974 35630 32736 23414 21933 24592 21170 20586
9310 20586 19832 18492 8812 13188 13201 17806 19031 33609 38754 44795 45276 33724 21872 30650 31233
9295 31233 19879 11356 5777 -536 11441 7644 6162 21889 12672 5518 -6905 -7584 -1439 19436
9281 19436 21107 16529 31182 39048 30503 32149 23393 17563 24630 43083 31635 16102 6882 2959
9267 2959 1935 11843 27728 22161 6177 -1028 -8968 -5118 10059 19548 30234 28512 23556 26651
9253 26651 39708 33408 24329 8829 7902 6594 2671 6160 9584 21057 18160 2414 9030 7254
9239 7254 9288 11547 18320 18250 14663 16975 12758 17445 12566 225 -8865 -5555 -336 -997 -1005 -2194
9223 -2194 6717 -5744 -5963 -5367 1670 -4689 -10511 -10936 -295 13855 22616 22974 10611 8741 10514
9208 10514 12636 17924 12913 14337 15542 17858 23313 19325 15932 1690 -7615 -11489 -7144 5564
9194 5564 31477 37703 25244 20053 27743 24967 37198 41951 49430 37354 28359 32620 29556 13731
9180 13731 578 -14190 -5077 -17204 -17444 -387 13367 22224 21972 7959 9384 14190 27504
9167 27504 32871 21760 11531 12966 17819 20480 18728 10578 3176 1805 11150 24317 26507 28518
9153 28518 33261 24367 12693 5512 8659 17100 15283 -2482 -9178 -9766 -8712 -169 15275 7472
9139 7472 -1262 -1208 6658 -2767 4558 3975 2236 475 -11215 -10289 -8733 4766 4791 -1103 6196 16494
9123 16494 11381 14578 19248 15111 8081 16288 23058 24274 17519 12267 9549 9497 6443 4477 9336
9108 9336 381 -4536 -7526 -2416 -475 6780 6856 4185 -2212 -4580 -12961 -8184 1079 14801 16529
9093 16529 5346 9756 15859 16437 5094 1763 2054 764 -9047 1479 -8933 -1681 3326 7425
9079 7425 21208 31612 37406 28032 20985 12228 1270 -7395 5729 5264 10493 6706 12017 11593
9065 11593 10117 19460 15772 637 -3851 10376 28349 25907 23893 16919 15984 10990 3231 -7549
9051 -7549 -12616 -16741 -11529 -10916 -14984 -6808 -1971 452 -3122 -1073 12119 21433 15285 22656 24431
9036 24431 11726 332 7086 17535 16545 8113 -382 -313 6793 -1865 -6265 5925 10721 7504
9022 7504 4496 6830 -3443 -2481 2623 3826 2272 11972 19544 17416 12798 14502 17578 22560 28546
9007 28546 25308 16661 9136 22043 25015 19172 4798 6608 13980 16272 24125 30398 21596 6339
8993 6339 8039 19478 12425 9801 17140 5882 12767 16740 8354 787 5240 8783 12434 18245
8979 18245 4128 8666 9502 -1479 -2690 15592 3393 -1688 11618 15976 13872 7358 4804 2388
8965 2388 -7631 -1269 4354 2429 11702 22883 23355 12952 4042 -6177 -3028 6025 5184 2056
8951 2056 -4341 1153 6603 10579 17053 12252 17603 17255 19160 14772 14867 17305 22722 26144 31154 38759
8935 38759 19873 10436 18279 26818 20897 7581 -7970 -18135 -7868 12131 9541 3596 -9974
8922 -9974 -15254 -1295 15634 5800 -8693 -17451 -3753 6085 26226 32742 17312 -42 -4669
8909 -4669 -1156 10932 16341 7516 13594 18253 27646 31289 12628 -4153 3471 5155 -946 939
8895 939 -8727 -620 9832 16592 17166 2125 -10228 -22445 -20979 -12988 -8431 923 9382 20885
8881 20885 29382 27627 14968 10837 17185 7243 3533 4947 8121 5009 -152 -11394 -9883 -2797
8867 -2797 -3251 -2821 1135 7245 10706 4557 8943 22671 32328 39416 24049 7820 4800 14470 26643
8852 26643 27533 20551 4797 1985 7022 11563 2214 9588 12482 13113 5833 4182 8401 18243 27147
8837 27147 22002 13287 9974 9609 -583 -14156 -5799 2618 7561 7587 6931 12941 19763 7915 -731
8822 -731 5830 3825 269 -9122 -6563 921 -828 -3078 -3793 -3511 11803 8447 693 13017 13788
8807 13788 3387 4991 13462 5432 7429 20363 23335 13970 5794 15265 6854 -2891 -6725 -3592
8793 -3592 -9117 -4259 4096 7955 8241 3610 -569 7537 11677 26083 37217 30940 26043 24016 13948
8778 13948 11364 1081 5187 4908 10527 17901 7842 5458 9302 1221 -2353 510 -5152 -18871
8764 -18871 -17344 -9323 -7466 -3014 1631 -3053 -5137 4907 6706 -2027 -4850 1120 10762 9676
8750 9676 3069 19558 20524 18478 2856 -7728 -20453 -20626 -11607 -7776 -29523 -28960 -3037 -3277
8736 -3277 4495 7967 -1661 7760 -1231 -22752 -16513 -11588 -8842 -11693 -10695 7015 6694 7510 6600
8721 6600 -2574 -11298 -6869 -6792 -10458 -5777 -9355 -12782 -15613 -15249 -14930 -8788 4311 6274 4238 5066
8705 5066 3790 9110 1229 -582 -6815 -6550 -10862 -14961 -4163 12294 18430 17095 13032 17610 9670
8690 9670 16578 19471 8106 -3379 -265 -4279 -2658 17684 16956 3137 -3332 -1860 -13110 -24940
8676 -24940 -13183 -7431 -3628 -3870 -3480 -20 -295 2298 3308 1391 10208 17068 21409 21248 23580
8661 23580 16103 22227 35536 35040 27204 22371 26934 26933 11092 -115 6923 10990 13051 -2281 -6678
8646 -6678 -9959 -6420 -15693 -27332 -16992 863 6038 15630 6948 -2492 -6055 -7973 1577 5658
8632 5658 -3654 -7892 2576 -1756 -11022 -21292 -13270 4527 9131 4800 8271 15123 14486 14296 14273
8617 14273 4900 1936 10818 16353 15507 -3151 -9134 4740 17599 31058 33334 29231 22763 29324
8603 29324 29649 19871 5409 -2274 1197 14212 13268 7262 6434 11563 7434 15275 18293 28962 27124
8588 27124 29605 25057 25524 20813 17876 8219 5898 9789 25460 37625 36202 28551 32656 26584
8574 26584 16676 16170 13797 11652 14073 22874 18801 15835 26374 22153 645 -9997 -3547 -347
8560 -347 4155 22167 23195 7889 4755 1724 -2541 5172 7339 3288 11085 13548 18354 26549 29914
8545 29914 30233 33456 42167 31769 25085 24351 6435 1154 -10911 -18589 -19223 -8227 -9292 -16266
8531 -16266 -20254 -9943 -9351 -21479 -22922 -8863 -15819 -15669 -6470 4271 9346 23112 29683 25003
8517 25003 21103 12287 1702 -4244 1440 12700 14029 14936 15406 7305 10733 17059 10616 4245 3614
8502 3614 22348 29744 20693 30495 35313 37654 31870 26777 19909 -2667 -12908 -22729 -31392 -14620
8488 -14620 2699 -3712 -4893 1199 18383 8001 -1591 -7018 -6421 -9418 -18616 -15665 -28748 -15081
8474 -15081 -14904 -260 4846 6769 -1411 -12238 -7730 7321 16398 19802 12463 -17884 -32170 -11475
8460 -11475 -1685 3077 7749 3739 -6371 -6315 3154 4807 10078 6969 3406 6849 2755 628 -4373
8445 -4373 -12885 -23728 -17796 2261 235 -8611 3607 11010 16467 9549 -2362 5856 5729 12233
8431 12233 11253 5969 9659 -11118 -26944 -23917 -28685 -22850 -22735 -10676 -1471 -8428 704 19056
8417 19056 22564 24099 21966 14581 -12117 -10124 4546 4035 10004 11663 11416 -5025 -1098 10277
8403 10277 10859 12088 13272 13815 784 -3873 -4131 -2459 -12653 -18705 -10478 -3248 375 11921 9857
8388 9857 378 1150 1544 -616 -9746 -5024 -2071 654 -7889 -15449 -282 721 3357 11858 24763
8373 24763 25363 25588 23810 18387 11702 11635 8436 8100 -2191 -10030 1772 2195 1599 -6564 -16991 -16335
8357 -16335 -14548 -4203 1430 -1356 -6331 4792 8299 7335 -11052 -16922 -63 11992 4780 1289
8343 1289 1090 -720 308 4862 5307 7463 15112 5717 -7427 -18078 -19020 -4213 -1316 9511 14989
8328 14989 -5671 -22744 -24606 -25245 -28448 -24330 -27615 -16785 -9613 9143 21681 7023 -1475
8315 -1475 -9584 -11150 -2480 8017 9415 -6244 -7035 -9152 -6034 -1431 10792 15482 -205 -2566
8301 -2566 -1750 -7050 -17989 -22832 -14758 -7852 -14912 -9038 -6378 -835 7496 13237 21122 13643 -1555
8286 -1555 11627 17412 3629 3249 -1717 7056 18185 19219 2361 -10227 -5182 7119 -4090
8273 -4090 -19070 -10503 -1194 -3170 5586 14678 2057 -7721 -11831 -14611 -12439 1905 10456 -939
8259 -939 -7156 -1978 -12888 -12066 -15250 -10798 -4576 -10641 -358 4809 14779 13651 11621 9070 8965
8244 8965 4357 2467 1227 3580 6421 -9314 -18778 -8454 8650 2490 -5540 -5933 -11076 -6898
8230 -6898 4343 7006 -2091 -13425 -13294 -4726 1676 -11424 -23178 -21795 -13175 -3653 -2251 2373
8216 2373 -6699 -9459 -7222 -7968 -11553 -16107 -20959 -9199 3814 3324 14255 11359 10719 2234 -1547
8201 -1547 -11528 -9579 -1475 863 6998 7550 13436 16845 19006 23133 11507 3001 262 -7350 -22184
8186 -22184 -7306 141 169 10926 10625 10500 20668 10017 5766 5997 8118 4728 5259 -12047 -16354
8171 -16354 -6159 -5159 -3459 2491 5466 -2674 -10379 -4621 -7316 -3992 1153 2735 -756 3102
8157 3102 -8125 -6059 -7727 -11904 -14160 -17004 -15765 -12868 -30270 -23247 -28806 -20297 -23614 -21476
8143 -21476 -20350 -18686 -26837 -29668 -22860 -19439 -22956 -23502 -8878 -5224 -4650 4722 20683 28267 27980
8128 27980 14106 -6660 -20961 -20277 -16366 -12235 -4218 -1981 912 -465 6241 14242 20780 22180
8114 22180 2274 504 -9350 -13725 -9999 -8829 1107 16245 15909 -4100 -11319 -13711 -10149 3531
8100 3531 5609 8594 16594 15497 19744 12605 3135 1686 -6469 -12020 -5719 -2381 -8675 -6174 3368
8085 3368 9875 4338 3854 12002 14315 9844 12060 8764 -2580 215 -8581 -6465 1302 9323 10911
8070 10911 3596 -6610 -6381 -2695 5324 12305 17493 13799 8268 17538 10517 3706 3228 14931 13465
8055 13465 15736 15437 1113 5714 20308 12708 -9926 8752 15676 5669 18193 9717 -572
8042 -572 -3278 7463 20354 14019 22444 30120 18798 17698 24795 34506 37233 40578 33361 17393
8028 17393 6969 6089 -3889 -18890 1702 -1343 1742 12152 -6755 -14080 -9956 -9351 -6405 -7222
8014 -7222 3638 13251 11739 2746 1950 3665 -2110 1644 11567 17622 20217 11703 14748 18313 10163
7999 10163 -2885 -5313 -2325 269 4748 7479 233 -6579 -14155 -15476 4911 7315 12475 20342
7985 20342 15883 12218 15064 29323 43954 36115 26107 25800 18657 14722 1090 4591 17401 19985
7971 19985 15159 10323 6095 14070 19680 22673 20506 19500 15799 21187 14047 12798 7094 3909 3871
7956 3871 4155 1874 19166 21290 21696 9214 1154 705 19975 25794 21121 9885 -370 -5878
7942 -5878 -8188 -8163 -14686 -14328 2397 5898 -3740 -177 8920 15512 20419 28888 25145 14847 10711
7927 10711 4240 1358 18159 21210 13936 16784 22466 27022 21873 10850 8625 18919 9095 13275
7913 13275 11283 20673 30202 12858 5716 17919 35112 29729 9255 4475 7337 14217 8997 4152
7899 4152 -4837 -9146 -616 895 11656 21667 11309 -8298 -8527 -6633 -16327 -21258 -1369 8660
7885 8660 -4099 6549 16767 13877 19935 33819 18822 9928 7875 5878 2515 3233 -3527 -7893
7871 -7893 -4872 10783 1542 -10674 -16207 -19786 -19595 -3328 2368 17993 28878 23768 19026 30175
7857 30175 32164 27027 23867 14241 6399 1377 18041 30300 29882 17864 1236 -869 -11612 -19381
7843 -19381 -20498 -13865 -2384 9213 871 3204 18807 30994 24972 11526 25609 16481 14085
7830 14085 7664 -2151 -4038 -2873 -15310 -28261 -27870 -19855 -7917 -232 6205 -6100 -10576 -9599
7816 -9599 -14318 -30823 -34219 -5283 7828 8569 -3776 -5631 10681 2145 -18770 -23755 -13227
7803 -13227 -4615 -2 -1954 4525 12554 8178 6188 -2952 -3374 -6225 -5690 -11574 -3895 -6961 -15326
7788 -15326 -8751 4271 15381 17629 15296 5012 9310 15387 12304 8314 9515 8043 424 -3962
7774 -3962 1202 -7291 -8586 -3282 1209 -4545 3109 -3744 -9063 -5416 -3946 2864 6052 11888 16101
7759 16101 6896 -14986 -17433 -15388 -12218 -13 1678 -16111 -17485 -16027 -17823 -30995 -27648 -16691
7745 -16691 -23106 -26278 -19811 -18663 -17503 -7054 3647 2804 -5887 -5961 5670 1363 1919 7666 20555
7730 20555 13395 1814 5647 -1100 -1905 3968 6631 4771 7047 10796 17909 16250 13696 14699 7645
7715 7645 200 5055 -11950 -9660 -16602 -12660 -9763 -9423 5616 -1098 -17446 -21962 -19693 -13373
7701 -13373 -311 1853 1002 16837 11096 2724 16409 19852 2733 -4505 1008 -6826 -2564 2720
7687 2720 -7173 -1812 -405 10862 4008 -2513 -1950 1976 -2409 -3348 -12116 -26630 -30074 -20668 -2807
7672 -2807 3993 1944 -19404 -28387 -28414 -17374 -5036 -7215 -8050 -909 -493 -4147 -3779 -8323 -6942
7657 -6942 -6544 -2271 15078 11694 7606 3504 -7685 -3708 -7726 -11166 -20643 -23500 -8509 -6946
7643 -6946 -1908 8249 20147 15653 5472 -5096 -8265 -1553 2516 -7830 -8268 -4604 8692 16939
7629 16939 7613 -8759 -10055 -3222 5733 9099 12677 12583 11885 8070 11358 -9717 -7948 14938 34726
7614 34726 29391 22538 24192 25326 17842 15499 11381 -2022 1024 -6214 -4152 10352 7950 -6574
7600 -6574 -7657 -6456 -5716 265 3069 5627 -667 -4548 -3312 6188 9541 -1292 -2200 5963 670
7585 670 298 -4912 -17669 -28948 -15153 914 2978 14304 13268 -5331 -12201 -2031 21232
7572 21232 24999 19495 12854 10217 -2637 -15218 -28534 -18880 -10665 -5016 2959 -7262 -9368 -5551
7558 -5551 -2264 4903 15524 8967 13143 9205 11930 5889 8836 12068 9447 4364 1230 11594
7544 11594 -5187 -14259 -1061 449 1218 10216 10617 4048 -279 -2403 5079 15233 10929 5378
7530 5378 183 -5576 -18689 -25799 -33725 -21964 -7390 -505 7445 6961 7849 8128 -3849 10671
7516 10671 13948 12676 9793 -11494 -215 -617 -20021 -24350 -15529 -34014 -47587 -41571 -26994
7503 -26994 -20354 -9518 -12553 -20122 -25787 -29230 -18840 -7223 3539 -2944 -11177 -9655 -4292 -5553
7489 -5553 -15248 -10077 -8510 -5428 -9804 -4729 -7762 -16164 -13457 -3063 -4637 -10718 -5168 -5450 -1084
7474 -1084 1207 1384 -5852 -14418 -2408 -11135 -25624 -28746 -29117 -11786 4678 12550 8685 2806
7460 2806 -6373 -8292 -5329 -15838 -16918 -6794 -4243 -725 8741 -9709 -11787 -12898 -19997 -19755
7446 -19755 -12622 234 -1529 -13146 -14735 -2002 3578 -4296 3602 14871 5584 -11664 -12380 -16317
7432 -16317 -15920 -13325 -534 6704 12250 5874 3409 7499 7891 11327 4446 8146 12438 7811 -4178
7417 -4178 -20340 -17716 -18185 -8445 -10419 -7597 -7451 -17371 -20839 -6687 -551 -11131 -15148 -13061 -6900
7402 -6900 -1081 10501 12620 -9687 -20823 -30052 -28802 -27717 -28299 -20006 -9498 -3990 1715 -5336
7388 -5336 -14902 -6599 15146 21956 8828 -6102 -5498 -13574 -5884 -6874 -10502 -8939 -5838 4719
7374 4719 10842 6183 -9369 -18401 -21911 -28796 -2072 12682 -3319 -14098 -13225 -3427 -14123 -22831
7360 -22831 -18450 -24339 -28071 -12426 -11692 -1585 1765 4971 -4001 -12787 -12355 -15241 -21766 -16200 -17400
7345 -17400 -18543 -16959 -6307 -3834 -4890 1986 6083 -5969 -11199 -15488 -10766 -4008 851 8967
7331 8967 17635 24214 16085 -2103 -14364 -14559 -12195 -16999 -21452 -15970 -313 16935 11589 -2267
7317 -2267 2831 12991 9426 -1246 -6044 -9384 -4260 -10569 -17911 -13278 -28146 -49660 -36126 -14803
7303 -14803 -6027 -9513 3599 -7637 -14153 -9085 -3890 -2331 7310 1468 -7271 1572 -7066 -15414
7289 -15414 -14103 -4184 555 4056 6124 4874 -1574 3983 -4499 -18437 -20895 -14203 -4121 -4260
7275 -4260 -6010 -3231 6537 11472 6032 1410 -12236 -9212 12488 19103 21739 14438 11668 21459
7261 21459 25436 24406 11928 9994 21948 17762 18110 17300 22361 16458 4822 8696 619 9202
7247 9202 4317 -3231 -5694 -3617 -6682 3235 -3344 -19522 -26031 -14907 -11757 -10109 -18777 -32395
7233 -32395 -24830 -29767 -36658 -29565 -34055 -23443 -5177 -1639 3343 -7345 -4671 3623 -3336 -9119
7219 -9119 -20323 -19481 -15796 -8883 263 12281 14913 13474 16627 19665 15799 11224 3672 -59 -15679
7204 -15679 -20444 -12953 -9541 -6734 -15104 -25652 -19938 -8750 -1312 -4537 -6849 -4236 -9628 -3384
7190 -3384 -3634 -7857 -2944 452 -12908 -9249 -5984 6785 12310 16194 8257 -24415 -24472 -10675 1010
7175 1010 10813 7986 13875 11242 7844 6948 11463 5917 11850 12466 4205 -7749 -2039 14126 11921
7160 11921 3089 -54 -18366 -20949 -20205 -9010 4221 21170 20056 7976 5561 -5624 -6356 -1687
7146 -1687 -8455 4918 2930 495 11480 7644 -9296 -13770 -17601 -5294 5931 9463 9709 3576
7132 3576 -3545 -5972 -2862 -8917 4622 16774 11561 432 -10815 -6357 5206 4311 -1056 -2156
7118 -2156 73 -610 7699 15273 14480 15010 28495 28733 31721 25906 9916 -1305 -7158 -15218 -13165
7103 -13165 -7695 -11837 -12826 -12433 -9564 -8037 -13342 -17666 -22307 -28463 -32096 -21067 -18297 -17762 -8984
7088 -8984 -9176 -1726 10902 22401 18956 16995 24688 14216 16976 18029 18902 5869 4660 5514 2275
7073 2275 -392 -136 3862 8240 16483 27225 20693 22522 22413 17488 12559 8275 -4915 -4948 7421
7058 7421 14331 15993 17174 12868 11857 10798 6587 10910 2590 -9622 -5241 5897 10885 20828
7044 20828 18447 20287 17474 19204 8263 -10177 -17017 -14464 -7050 -3417 -4861 676 4880 5075
7030 5075 6974 -2058 9667 3227 1596 4902 -6311 -18968 -17725 -11034 -12021 -13994 -8645 -7073
7016 -7073 -2838 3930 7396 3182 3024 14514 12102 23924 25769 17624 1622 -6873 -6792 -12146 -3239
7001 -3239 -2782 -18029 -17393 -18173 -16995 4491 21905 25796 20541 15324 4142 5876 1797 -3820 -98
6986 -98 11224 10673 142 -194 -1588 -11115 -4898 -9992 -9115 -5973 -5589 -2058 2154 3075 -12939 -14825
6970 -14825 -16880 -16783 -22318 -6248 3687 11239 8710 4438 -4880 2964 -2002 -14656 -17270 -19822 -13802
6955 -13802 -22943 -18541 -12707 -21980 -19276 -22823 -16383 -9077 -4014 10214 23912 15088 28402 14892
6941 14892 1043 -2869 9119 -791 2387 6908 7330 -912 10884 22302 18892 3519 572 -2389
6927 -2389 7823 16807 18338 14525 11432 10414 4516 1131 6733 17245 7207 -11425 -11971 -10213
6913 -10213 -10745 -6266 -3452 -1653 -42 -11532 -1780 5135 9750 9567 6075 -840 10447 24924
6899 24924 31931 22222 25915 17157 13776 21112 6937 4052 -474 -23511 -22902 -15760 -11439 -7265
6885 -7265 -8288 -11158 -16180 -19593 -24454 -45007 -43788 -15966 6105 8903 -2081 -11922 -6320 960
6871 960 870 4199 9327 9911 18396 15404 21759 15663 1311 -11297 -16379 -12160 -22158 -31850 -19380
6856 -19380 -9645 -1391 -6123 2818 12075 10700 5212 14716 14491 14557 11843 -2982 -7567 -28735 -32786
6841 -32786 -16987 -15029 -20717 -16794 -15261 -16966 -17361 -18050 -9847 -7006 -16186 -20097 -17643 -26383 -21261
6826 -21261 -12985 -2955 -7277 -374 5732 5971 12494 9289 2456 1005 -3059 -2514 -4221 -26191 -28357
6811 -28357 -11243 -2355 10527 6044 17724 23107 4034 -3950 -6169 -23641 -27870 -9439 -5076
6798 -5076 3192 -853 -7934 -16211 -13888 -3065 4909 7917 6400 5582 3227 -4202 -2044 11044 10541
6783 10541 3067 1501 -6950 -498 -6450 -12625 -15541 -14330 -5028 -539 7362 3740 6822 6436 193
6768 193 -3994 -16558 -22295 -22097 -16245 4264 9956 5256 -5161 -10096 -11794 -17415 -22832 -16130 -4273
6753 -4273 -6352 -6477 -2031 -4872 -3137 -4785 -5186 -8778 -4706 -6063 -15049 -12439 -5619 2515 3927
6738 3927 2040 -6337 -7676 -9994 -10421 -6184 -7526 -7960 -10221 2154 7899 8672 10502 9393 7101
6723 7101 -5892 -10493 -11194 -2349 10667 14420 -2629 -12596 -15118 -16897 -13944 -17663 -26588 -16688
6709 -16688 -10094 -25793 -32197 -23673 -16183 -16375 -10797 -8952 -4672 3632 6299 -7069 -4840 -17704
6695 -17704 -22851 -13084 -5554 -15957 -29651 -21760 -11841 -14915 -19650 -14281 -10990 -4845 8447 3110
6681 3110 -6200 2009 10801 -3259 -7856 -7652 -6931 551 5284 8004 2946 -8786 -21586 -11203
6667 -11203 3435 17420 10347 10267 10461 -1004 -4225 3470 8423 7995 19408 19374 15596 15019 10820
6652 10820 14889 18657 23145 21270 10064 2625 1449 -12641 -21526 -16945 -11416 9502 10093 17985
6638 17985 18194 11375 17504 6031 -5526 4837 2880 4978 8324 -4899 3769 17345 23856 8718
6624 8718 -11027 -18365 -15259 9125 19469 19863 14336 10542 6565 6658 12117 11130 13037 16061 11917
6609 11917 17073 15615 10506 3664 6020 19866 6898 -12087 -8097 3486 7087 6559 11292 10167
6595 10167 -4737 -15478 -14724 -11156 -14971 -16427 -21058 -24444 -21434 -19984 -11576 -17836 -10674 -3442
6581 -3442 691 -7016 -9098 -14076 -3113 -622 10620 17955 12896 8689 -8542 -18097 -6986 -6368
6567 -6368 -7934 -8542 -1719 -51 -6410 981 2119 -11096 -8288 -5899 -6072 -13980 -17611 -27781 -32064
6552 -32064 -31560 -15855 -8393 -18718 -23833 -12972 -9595 -9085 1877 9529 1813 -13887 -22293 -18547
6538 -18547 -15496 -17054 -11035 515 4467 9755 5885 9285 12775 18655 10454 8947 4452 -101
6524 -101 9586 11889 -1680 -2896 5994 1985 12626 13390 17982 24379 11454 2188 7361 9432 2028
6509 2028 -6099 6006 19619 16616 9933 14431 2214 -755 9707 12217 -3909 -9253 -5381 -15569
6495 -15569 -23252 -9951 -10719 581 7989 2513 1511 2067 6139 711 -2376 6788 7508 4759 12047
6480 12047 21248 4003 6592 19729 -2567 -12723 -8864 -14841 -17717 -7892 -1794 3048 74 -14025
6466 -14025 -15434 -10627 9843 11270 4690 3506 8100 1660 3474 7206 -2088 -8516 -3900 55
6452 55 -2751 -18388 -11238 -10311 2185 8230 -415 4913 1210 -11669 -8988 12981 1476 -14945
6438 -14945 -15972 -8411 -5812 9446 12903 8407 -7952 -14336 -18826 -11561 -12636 -3670 -4344 -1501
6424 -1501 11968 6705 5562 2357 -1535 19274 19428 194 1354 11387 9169 6271 13248 2753
6410 2753 -3668 -8803 -26176 -27792 -20256 -24120 -27944 -40005 -39440 -29646 -16403 -15956 -25156 -17295 -7335
6395 -7335 -16567 -2560 10390 7360 12987 8530 9972 15811 8644 1992 4019 14080 8636 -4383
6381 -4383 -9811 -8069 -9428 -8479 -4904 -9581 -11216 -6337 -4351 -2475 7782 12282 2551 8828 19950
6366 19950 6109 -13074 -11071 6011 11839 -10853 -25036 -29059 -28572 -28660 -25561 -22700 -3154 7084
6352 7084 4975 10539 12339 -6276 -7180 1000 914 5982 5632 1888 20304 6794 -5687 5673 15863
6337 15863 13205 1854 -1845 7058 9678 529 -5426 5460 12943 20662 5643 11236 5549 -1791
6323 -1791 353 -11183 -17777 -23759 -23843 -15864 -22912 -27533 -25935 -960 12643 20780 10307 50
6309 50 3703 9503 -4370 -17481 -2050 5890 16989 6816 -3727 -7766 -10624 -9670 6187 16200
6295 16200 27216 34401 29517 20181 7370 10127 -1449 -11997 -13463 -3445 9295 1895 -4181
6282 -4181 -14280 -17405 -5341 -1022 -693 -1401 -2096 -2031 3895 4086 -3089 -16778 -20235 -14065 -6187 5448
6266 5448 -958 -14612 -22552 -28529 -16394 -8167 -4506 -2121 -23135 -21367 -17062 -19090 -9015 -7747
6252 -7747 -15402 -21171 -10009 -3526 -785 7286 10589 5173 -4547 -12341 -26491 -9598 -11 5648
6238 5648 -2873 -18398 -29088 -34558 -24556 -6988 1725 -16779 -18112 -10240 -3541 -8627 -14832 -9968
6224 -9968 -6167 -6571 10683 18417 19210 22233 33224 38209 28813 1896 -13339 -7356 -4350 -16609
6210 -16609 -13459 -6693 -5867 -1196 9279 4208 4618 3534 -5699 -11427 -13058 -17499 -12036 -6205 2915
6195 2915 8193 23240 28759 11717 7009 4936 992 2042 6288 4454 7333 11303 22952 10816
6181 10816 6259 1621 -5277 4204 13854 -3168 -18406 -12494 2306 7119 10083 9728 5444 -1394
6167 -1394 5709 16332 14608 10243 -6797 -8141 -8993 -3377 211 -2279 8325 16063 10832 21170
6153 21170 24820 31242 26008 9909 -573 -16125 -8848 -1810 9079 1086 1431 -4655 -5756 4005
6139 4005 912 289 -5364 -3232 15107 16990 15630 21647 19298 3009 -13095 -14612 -9762 -2090
6125 -2090 1249 875 1123 6075 12311 5801 -1527 -15965 -17184 -14094 -10123 4350 14931 14432 7417
6110 7417 10681 18591 21792 7370 -7951 -2406 6155 -715 -3395 983 -1718 3860 9525 -3333
6096 -3333 1249 1631 19441 30641 16287 8514 6995 24306 30020 18840 7936 10539 5944 8004
6082 8004 9053 9995 3344 1537 -7513 -3612 -2288 -1725 3399 8512 7835 2468 268 -4232 -1994 -5764
6066 -5764 -7617 -12910 -25080 -30411 -26382 -10556 9270 9314 -1369 -3611 -6224 -9641 -10061 -15815 -17109
6051 -17109 -13847 3098 11075 -4145 -20934 -34889 -27229 -12075 -2102 4004 -6198 -10525 -5148
6038 -5148 452 12209 14185 8807 -6641 -12965 -6876 3422 -3053 -17122 -30547 -25686 -20152 -13608
6024 -13608 -6229 369 -2324 -4486 -8234 -10829 -18714 -20660 -22817 -18906 -6446 9398 13283 5629
6010 5629 -5979 -5540 -447 -11523 -13899 1070 3122 -4961 -6037 -15804 -8605 8004 8016 10125 5296
5995 5296 -9419 -13067 -25809 -17106 -8607 -6149 -5591 -12315 -5174 -8840 -6551 1423 3436 14263
5981 14263 11516 -334 -3583 11529 8421 5904 -8293 -15709 -12422 1228 10623 5065 -3920 -9442
5967 -9442 -12400 -9913 -15650 -13045 -3327 -6070 -16618 -19865 -20739 -10915 -5856 -5302 -8843 -9231 -11967
5952 -11967 -4554 -3673 -12007 -6560 3721 -14122 -25464 -21553 -9501 -4949 -2459 -10916 -12400 -7683
5938 -7683 -3645 1950 -364 -2414 -4379 -16812 -25143 -24687 -9008 -11273 -14754 -11016 4457 -6116
5924 -6116 3771 9601 7776 3368 -4978 -8050 -9264 -23710 -24570 -16325 -18514 -7418 -6830 -15006 -21446
5909 -21446 -20965 -34633 -29636 -10373 -6023 2062 11071 22507 26837 37103 23978 14226 22151 16288
5895 16288 15641 15035 7917 10892 8159 -5314 -4100 1473 346 -679 7297 15904 1906 -7049 -10233
5880 -10233 -17567 -15624 -10420 3291 6252 9665 5986 -330 1567 -1950 -3922 -5792 -15868 -8571
5866 -8571 -4978 -6103 4380 2116 -6540 -11375 -11363 -12781 -1451 840 -4960 -6730 -7607 -4611 -1506
5851 -1506 -9664 -5216 -11011 -2537 8802 16600 5010 11649 20446 12609 12 -3213 -9945 -12263
5837 -12263 -21578 -13089 -24493 -18877 199 5517 10472 10365 9822 9772 9613 12963 2270 -5319 -562
5822 -562 6331 14078 9262 8500 7275 5348 145 -2892 -3512 410 5338 -1212 7822 16361 2122
5807 2122 -5577 -7253 -8476 -11515 -10509 -24278 -27395 -16391 -8475 -3999 7140 18980 5273 4016
5793 4016 3194 -2316 -9222 -15418 -17869 -15299 -9626 5831 -1003 -4972 4069 15615 22803 5258
5779 5258 -5888 -9908 -1477 6464 5827 2980 -3995 -15630 -2501 -12576 -23135 -9027 -7987 -15693
5765 -15693 -17236 6761 11299 540 1205 -4399 -674 -16825 -27209 -22143 -11954 -8675 2782
5752 2782 12526 5464 -25442 -32063 -21423 -4996 12132 19659 11632 647 -2968 3751 7785 -7741
5738 -7741 -12709 -16137 -5352 5627 2042 -2888 -4856 3648 556 6264 -2710 -6387 -3176 -6813
5724 -6813 -18294 -24341 -29444 -18077 -6233 -2727 -1563 -7807 -8893 -3864 -788 12451 16259 10161
5710 10161 14619 8199 -3740 -7959 -9293 1012 -8122 3332 14539 8809 -2292 -18769 -11010
5697 -11010 -12092 -3052 1793 5259 -171 -6799 -10655 -15606 -7519 4082 17766 32440 20054 947
5683 947 -20208 -26677 -16037 8637 19204 25315 27050 19748 7086 6111 -6761 -7354 -5275 -4421
5669 -4421 1308 3951 -3080 -10759 -23684 -20480 -17183 -14301 -7382 10239 15446 8795 -2927 -7957
5655 -7957 -13263 -19317 -16549 -8016 -17595 -17466 -2009 5552 3739 -4002 -9178 -16717 -9461 1535 3410
5640 3410 -554 10757 16635 8158 -8110 -16684 -18159 -19833 -19592 -28330 -32265 -32005 -29975 -11752 -9648
5625 -9648 -12376 -13051 -4178 17440 15435 4841 2054 -2286 10177 8116 1305 5495 9130 -2602
5611 -2602 -2785 -4602 7167 10674 -295 -19903 -17826 -21668 -13794 -4452 -4146 -4535 -18297 -26516 -19211
5596 -19211 -8388 -1292 1065 20533 19909 6344 8230 19887 16478 11870 4355 4162 2764 1552
5582 1552 7610 2546 -525 -2430 -3548 -5069 4596 1855 317 -10418 -9045 4627 17773 14094
5568 14094 6932 6082 7575 5317 -7814 1692 -14283 -21259 -12187 -11164 -4912 5271 9784 15222
5554 15222 17831 7173 4852 -6394 -11313 2986 4622 1524 -9765 -24305 -19810 -6410 -17937
5541 -17937 -21586 -19720 -9882 5731 17648 11758 17080 17730 10826 -4434 -11970 -6111 -9307 -7401
5527 -7401 -9771 780 5351 8967 2391 17681 29290 28865 30911 33147 19801 6152 -5164 -8292
5513 -8292 -9722 487 2050 5902 8964 10372 -1512 -11009 -5070 9932 9801 -1989 -10359 -17898
5499 -17898 -7927 9347 17727 13603 8165 -3774 -7021 -8900 4094 1046 3921 8380 7498 13181
5485 13181 16527 6776 -8250 -3881 -4038 -891 902 -5354 1381 10045 11277 5200 5667 589 -8749
5470 -8749 -6425 -3681 -4747 -5306 -15386 -13338 -7237 -4516 -6403 6581 23286 21690 11824 688
5456 688 -3222 -408 3173 2624 8548 4803 -9153 -15228 -6303 -2002 -1093 7468 5769 8670 13039
5441 13039 700 -17376 -12088 3675 7514 1054 -2896 -10532 1206 7202 949 -7414 -8339 -1781
5427 -1781 11078 20796 15607 193 4527 3838 9787 11562 20640 28852 21824 9311 13969 6463
5413 6463 7486 21258 21975 16933 -8480 -21177 -23543 -15320 -1536 4594 -1408 -344 -7146 -997
5399 -997 7567 408 1452 9716 3643 -2901 -473 -8141 -14526 -9306 -3239 -14136 -23784 -22935 -8064
5384 -8064 26 -6291 -15644 -17672 -6512 11035 10257 11016 5639 3589 6905 -2695 -13289 -6514 5646
5369 5646 10137 11235 17034 5298 -5213 -5213 -7174 -11352 14 10771 7286 3499 1856 -5523 -917
5354 -917 447 -2389 1275 -3457 -12667 -2710 12868 19912 16804 8445 1684 5337 8095 660 13087
5339 13087 9885 10621 17315 10374 3967 -5791 -14188 -13259 -1268 -8532 -3760 2251 7426 9976 -9635
5324 -9635 -21522 -15431 -12802 -13175 -1540 4940 5530 -4284 -5536 -4279 -942 -10628 -5811 -6187 10087
5309 10087 26760 17885 9174 12047 852 -3249 906 -1778 -3395 -8071 -14332 -18936 -18066 -25254
5295 -25254 -25340 -11414 4082 -4834 -1911 3920 -3519 -11195 -2142 -104 7541 998 -1910 1465 3623
5280 3623 18072 26028 9407 1709 15021 20919 13939 10932 3174 -8155 -12394 560 15766
5267 15766 21241 15326 19976 18075 3976 -12234 -12183 -1003 -66 8153 20605 15039 22308 34089
5253 34089 39259 28556 25793 29393 14613 15597 24507 19194 1633 -5026 -254 4177 -277 -4207
5239 -4207 -3817 -1749 4297 719 -2686 -2611 -7954 -25643 -27106 -21352 -11217 2251 2124 -13948 -14486
5224 -14486 -7056 56 2915 -6831 -12615 1817 -9953 -18509 -13760 -17577 -2476 10944 10295 944
5210 944 2296 6813 7216 21807 28501 19706 23935 33544 29347 25578 20713 13284 4477 -8482 -8685
5195 -8685 -1878 -2198 -14576 -23789 -20158 -22704 -9542 5426 1271 -14952 -22164 -26500 -21455 -14352
5181 -14352 615 11048 3848 -3729 -13842 -20169 -18814 -6661 6221 -5971 -13060 -11039 -3183
5168 -3183 -3576 10451 13664 13735 10630 -2485 -6046 -12271 -15973 -18768 -20187 -13130 -544 4155 10431
5153 10431 4552 4427 16725 18789 18831 21756 12062 15878 15306 4733 14268 16725 9761 2044 -5705
5138 -5705 -14239 -15282 -18197 -25763 -33336 -26106 -18099 -8598 -11115 -24709 -20264 -4310 -1007 -237 3120
5123 3120 10555 14921 10551 -5717 -14114 -24050 -14812 873 -296 -7925 -4997 -14549 -26890 -18449
5109 -18449 -13575 -16141 -15997 -10224 -1456 8315 4468 3583 -1198 5243 1531 -623 -604 2486 8515 16820
5093 16820 21525 19002 12340 15448 13067 94 -8717 -6527 7092 24327 23025 16436 3923 -16151
5079 -16151 -20325 -15727 -3149 4106 -10775 -18708 -14059 -19275 -17816 -1416 10529 1517 8995 6350
5065 6350 -234 -10443 -10175 -13704 -4916 9197 11563 8410 1165 9449 17682 24700 46657 48510
5051 48510 34646 21618 15775 11515 4715 -9746 -15830 -91 24350 26389 19939 -6383 -4216
5038 -4216 1346 -694 673 7951 5398 7535 -3601 -5967 -10117 -12878 -2233 -7366 -5541 4093
5024 4093 7460 8165 -3261 -11917 -4486 -7122 -13094 -9160 -9650 -17720 -10713 6854 1917 808 -1073
5009 -1073 -16274 -17668 -15188 -10029 6667 16017 17325 13106 10542 -4077 2016 4736 19138 24450
4995 24450 19838 25837 25969 14056 10768 -1698 -11926 -18611 -22266 -30201 -24020 -15078 -10225 -4253
4981 -4253 -1011 -7558 -22381 -22901 -25771 -15906 -19624 -33319 -22800 -17048 -6959 12625 2957 -16003
4967 -16003 -5030 7667 19777 7671 3863 4746 21115 21027 11998 771 -9740 -12128 -14894 -15999
4953 -15999 -17131 -11558 -14352 -20965 -13533 -21214 2129 1818 -7689 -3122 -8010 -16081 -5885 7834
4939 7834 -3399 1378 1890 10126 2867 8390 15216 -7821 -10635 11400 5726 3024 -7383 4738
4925 4738 2297 -19132 -22071 -18087 -16895 -11564 -8221 -15482 -19898 -5654 2793 26905 36552 21643
4911 21643 -5015 -6403 -7307 488 1336 -7435 -5855 7283 4247 -9631 -8472 -368 3375 7146
4897 7146 -4716 -8082 -11810 -9520 -10243 -5503 -6192 2649 19089 14553 3174 -9700 -23650 -24440
4883 -24440 -11011 -1474 -6519 -6381 -2082 13759 14289 7397 4687 4903 904 6199 3735 -19460 -14813
4868 -14813 -22140 -13128 -2228 -1436 2819 15743 23612 29170 27826 29374 36182 31871 13994 1884
4854 1884 -834 -1633 -5898 2112 5059 -4555 -8372 -8024 -12817 -12483 -19398 -17970 -26800 -26097 -11317 -4195
4838 -4195 -10908 376 10253 8145 10096 14122 19766 6821 10685 13886 19352 13888 1909 -247
4824 -247 3033 2629 -1154 2578 -5400 -17553 -21705 -23632 -7425 -9442 -19140 -19796 -4321 -5239 -8129
4809 -8129 -17315 -16046 -10469 -2478 1746 6011 -673 -4248 -4339 1691 -1370 573 -1972 3909 4375 7216
4793 7216 5079 2764 -6665 -2193 6772 9018 12394 25489 21474 8841 8421 14686 8162 210 7687
4778 7687 8256 8367 13772 15721 15285 5107 8113 1360 -5218 3588 346 2888 9685 -1605 -10642
4763 -10642 -4609 5343 -3783 432 17990 30728 26383 17412 11909 14693 11921 18125 3896 1640
4749 1640 3220 3207 5555 8007 2042 7334 9023 -1460 -1915 8546 7711 4432 1007 -1305 -880 -1209
4733 -1209 -5844 -14326 -8111 8591 738 -9391 -17580 -7091 -1241 3031 -1454 -4660 -11839 -11757 -18328
4718 -18328 -18335 -14009 -6008 4067 15278 12603 16380 20431 11240 19312 21783 9781 4747 14864
4704 14864 8433 14254 11942 6880 559 -4028 -947 -9999 -12416 -189 7237 4080 8684 4198
4690 4198 280 539 3752 9643 2365 -2032 -15268 -11761 454 -2798 -9697 -7396 -3185 -14042
4676 -14042 -6296 6105 1913 -2290 -9296 -10422 -7861 -818 4170 6890 5894 -4058 -15795 2591
4662 2591 13160 14600 23771 21051 14328 12727 4458 7601 28747 33422 30733 14728 5832 -1035
4648 -1035 -6289 -18533 -21509 -13157 -5187 -8037 -2567 1956 8055 6643 -569 -7502 -24176 -24276 -12292
4633 -12292 -11411 -8899 -4504 3621 -2208 3713 19319 11087 3432 9761 12972 13488 12852 14353 20613
4618 20613 19572 2164 -8742 -10405 -2216 6766 9516 15637 19242 8954 639 -766 6794 18023
4604 18023 14294 15071 9180 -3939 -17487 -13175 -5491 6808 4284 -3803 -3433 -10041 -6837 -4603
4590 -4603 -5229 -9865 -9373 -6484 -4944 1945 -1972 -4669 -1005 -6960 1236 -412 -2602 -9857 -16998
4575 -16998 -17948 -20148 -14967 -13997 -4615 4297 -890 -5251 -3714 -3155 -6363 -6009 -18136 -18714 -13583 -12898
4559 -12898 -6515 3935 -636 7089 -1754 -15974 9038 17191 11963 15483 26656 22618 7785
4546 7785 2073 -1177 -17168 -25817 -32076 -29179 -12994 5425 18656 20471 18476 6955 -3628
4533 -3628 -20252 -15348 -4268 -1769 -917 1589 3629 6872 -606 2485 -12615 -8627 -4549 -10984
4519 -10984 314 8696 8398 4152 -12579 -26296 -17756 -6571 5196 -7000 -16296 -400 2696
4506 2696 -4276 -4361 5 -5820 -6951 -164 -2695 -7295 4161 3085 -13185 -7078 1399 -2331 10465
4491 10465 3877 3382 19165 7323 -9118 5318 10571 4471 13888 16660 17258 19027 7375 12460
4477 12460 18837 21534 11857 -4542 2442 8008 -7466 -16083 -27304 -7874 13069 10386 1040
4464 1040 3564 -2080 -4746 8802 8229 -6896 -18498 -19792 -8828 -6186 -11904 -7347 -5903 -13793
4450 -13793 -19733 -21780 -17104 -7645 -21685 -24882 -13648 5046 10500 7097 12491 11630 4195 -2692
4436 -2692 -4123 -2707 -10982 -16987 -8996 -10033 4342 2628 7872 6907 5960 4563 -5468 -1197 6924
4421 6924 16198 19190 23084 16259 -1314 -8102 -14468 -4978 -12668 -14731 -7298 -4292 -14522 -23959
4407 -23959 -22271 -16878 -7490 -13924 -30012 -25766 -4320 -11686 -17200 -19630 -10814 -1669 -8061 -18569
4393 -18569 -11917 -5673 -5162 -12507 -17125 -16294 -10962 -16028 -5326 -7041 -25491 -40373 -41755 -25098
4379 -25098 -18838 -14605 -10923 -9862 -19030 -14971 -9255 2387 4945 1363 3481 -6578 -14004 -8604
4365 -8604 -5735 -2352 8629 10783 -3511 -13800 -17293 -9873 -11503 -11598 -10141 -2053 6423 -10679
4351 -10679 417 19724 24207 18538 23128 24705 7597 -2558 -2068 1847 -12850 -20333 -6962
4338 -6962 10029 2243 -8396 1973 4662 5870 26828 30247 34984 29002 13471 2611 1806 10443
4324 10443 6335 6691 7295 2514 8633 10940 14602 -2935 -7341 -6715 -13819 -18149 -18673 -17457 -30578
4309 -30578 -28624 -7162 8847 7631 474 -12039 -17123 -17279 -13332 -272 8119 4507 -5926 -3859
4295 -3859 -6804 -19374 -31182 -20372 -8308 244 15508 18530 19328 7564 6918 10162 11731 5409
4281 5409 6498 3348 -171 -5162 -808 10224 15901 34695 22542 9872 -733 -8065 -7875 -1355
4267 -1355 -3558 -15090 -5410 3466 7442 10338 2857 -8108 1419 14408 17634 17970 23836 25561
4253 25561 11422 6886 10581 16458 10718 -2232 -10960 -15000 -16970 -20660 -19404 -14763 -12937 -9177
4239 -9177 -12401 -18149 -7070 51 8765 19330 1084 -5802 -3593 -9929 -339 -11837 -14868 -23590
4225 -23590 -26889 -23388 -27862 -33039 -18597 -2024 -7350 -14713 -13628 -17201 -16516 -8897 -6856 -19550
4211 -19550 -25065 -26127 -9444 -8493 -6337 -11690 -14334 -10353 -7619 -627 11975 15582 12652 11770 8762
4196 8762 7503 3041 -614 -2914 -22744 -29921 -16945 -1089 10757 7250 16219 25563 20398 19496
4182 19496 19887 8552 7457 7124 2929 -1288 6579 12229 15094 3763 3877 6531 6849 8286 7923
4167 7923 -4556 -11860 -13394 -27032 -22770 -3921 5777 1785 -9114 -13875 -13203 -967 -1070 10019
4153 10019 -9469 -14213 -7686 -9363 -7600 -5558 4814 3078 4898 6405 10335 10393 2219 -2870 -1462
4138 -1462 5249 9056 239 -3894 -7628 -18657 -19770 -15743 -22093 -12621 1075 -3332 -12521 -27578
4124 -27578 -30583 -33245 -24683 -18154 -16889 -8234 -22404 -26001 -15152 -1528 5221 -295 -8915 -15958
4110 -15958 -19088 -15106 -16254 -25753 -31957 -14848 -8148 719 12087 2736 -448 4234 5404 5423 9717
4095 9717 19504 15858 6161 1585 -10354 -19844 -16724 -10543 -5525 2663 -7316 -12857 -4806 -6287 1279
4080 1279 3112 14371 6824 -4305 -9848 -378 -4313 485 18763 24583 27589 25547 24805 27812
4066 27812 10731 10277 10067 7618 -1437 -7410 -662 2819 4533 3739 -2922 -6233 3788 9396 10208
4051 10208 -3656 -8787 -7294 -9089 -5146 -10652 -25783 -25121 -27902 -29276 -31750 -27108 -28269 -29355
4037 -29355 -20294 -8105 14452 15350 12192 -7136 -8149 -10050 -11824 -8988 2759 13343 8884 4163
4023 4163 8037 10555 7583 11943 8130 -2884 -2642 8425 14792 11642 5667 2055 -4739 9 2811
4008 2811 464 6749 11442 703 -8770 -10454 -171 9574 8506 -4046 -8906 5792 9418 3247
3994 3247 5323 7810 13660 9194 710 -1375 8867 27007 19385 31927 23946 10918 3530 -4784
3980 -4784 -7216 -6018 6132 11782 -6788 -17860 -11081 -12454 -3939 -2352 -641 7433 11335 18267
3966 18267 20803 21378 9174 -10649 -15403 -21268 -12552 -13301 -21300 -10386 12830 17454 4174 -1284
3952 -1284 -6873 -5017 -19008 -4665 -1465 -9540 -14656 -19960 -10375 -4592 -43 4998 3278 -2397
3938 -2397 -2349 -280 -216 -12729 -11046 -2249 -1160 -3278 -8480 -1913 -8445 -10778 -3646 2535 -68 -4599
3922 -4599 -9841 -4884 5082 10595 -168 -2976 9116 22379 -2302 -16489 -25478 -25487 -8401 -1587
3908 -1587 -12672 -13109 -8761 9872 24174 27221 9648 2030 5142 5406 -35 -14921 -22800 -6548
3894 -6548 6156 14976 22200 3716 -3160 -1302 5863 17553 9692 1267 17933 5510 -10662
3881 -10662 -9217 -21543 -14807 9743 16236 7407 -3641 -15312 -4970 -10357 -9262 -9847 5591
3868 5591 10980 8980 8727 -3769 -4855 8606 12429 9740 8040 3954 -2147 -3521 6330 16333
3854 16333 18462 7537 9267 19815 11537 3688 7698 28280 24453 9035 11546 6342 -2898 -4158
3840 -4158 3183 -1766 -5426 1248 13404 11930 8269 8444 19243 20848 18576 15503 8684 7873 12930
3825 12930 11938 6246 336 -7355 -18145 -8122 -5786 -15955 -6060 2205 -2935 5136 3836 -371
3811 -371 1077 7114 17733 14364 21819 10552 -442 4307 16755 18110 4735 -4405 -11802 -4404
3797 -4404 9905 16125 -1950 -1354 16309 22227 11701 7241 2152 2077 -3157 -10911 744 2819
3783 2819 2940 13998 15568 18204 21715 17729 18624 9832 -237 4986 13086 14007 23288 23395 25581
3768 25581 20342 5125 -9270 -30527 -24707 -9440 8718 11875 9404 7228 13077 12841 19414 15785
3754 15785 -2264 10877 20856 19523 13984 11886 10609 2139 148 3396 10785 9758 4952 4045
3740 4045 3384 -7289 -13990 -10532 9028 22978 11859 14040 -15 -5288 5590 1267 8149 12580
3726 12580 8494 15834 18496 4480 -8126 -10452 -6608 3659 283 5506 1523 8308 5899 6378
3712 6378 11943 2319 -6912 3355 27459 27570 17754 12938 15409 15298 19749 16684 4340 -7524
3698 -7524 -2648 3303 -6251 -10559 -12817 -15405 -7814 5710 -6275 -11639 5104 3904 -10178 -17368
3684 -17368 -17149 -14084 -4832 3476 7256 4771 -8272 -12632 -21574 -23929 -13503 -13152 -6586 2868 -1383
3669 -1383 2138 -531 -9789 -4113 8434 614 -7819 -5756 -4248 -6808 -7568 -16868 -24196 -16754 -7756
3654 -7756 -15662 -18769 -23993 -23749 -20178 -11226 -4662 9207 8109 1920 8047 18187 19304 14852 13490
3639 13490 15038 18140 6542 -5868 -24860 -23904 -14096 -7926 4008 11126 6034 -4125 -15506
3626 -15506 -22430 -29451 -17551 -10935 3401 9426 7534 6166 -98 7868 12029 3131 3900 -767
3612 -767 -279 491 -7286 -2841 13611 18768 3457 -5634 -7433 -17089 -17513 -21268 -23829 -8618 10490
3597 10490 14784 -1519 -9326 -9513 4438 9094 8055 9770 2386 -14934 -11817 -9144 -6057 -7050
3583 -7050 -16328 -22453 -16719 -5024 -1102 -8564 -1390 4228 13323 13814 17271 8764 4172 -6095 -11381
3568 -11381 -18506 -24666 -6760 7364 19642 22109 27279 22056 7787 3389 -14002 -17391 -5853
3555 -5853 -279 5146 18949 19004 1731 -8447 7160 15548 7498 4395 -2099 1532 449 -16680
3541 -16680 -15808 989 9902 25692 36588 25196 25028 20359 16750 13133 19217 15590 19556 2779
3527 2779 3365 15747 6228 -11326 -9355 -56 -1619 -6717 -8294 -2168 1653 -913 -6336 -4345 -3292
3512 -3292 2642 -1093 -2176 -4972 -2888 -3674 6189 13229 10402 2106 -4692 -20412 -17651 -4683 -4551
3497 -4551 -521 8258 5010 3930 107 -6341 -3214 -10508 -8667 -3616 -12062 -18137 -12869 -15720 -8914
3482 -8914 -6248 -14289 -12633 -4680 6442 -6665 -16598 -21049 -15200 -7340 -14889 -5029 -5901 -6874 1558
3467 1558 3695 -1671 -4919 1282 -3232 -8322 -12668 -13910 -3152 12885 16363 10101 8543 7536
3453 7536 8104 15471 19419 11398 14205 23626 23968 13832 -7532 -16559 -3198 12844 11961 -3603
3439 -3603 -15542 -11956 3296 14264 21204 17170 -492 -1937 -3030 -11708 -16927 -6442 4891
3426 4891 13468 6482 3106 -1031 -4671 -13057 -29561 -29064 -11656 -6359 -14986 -12276 -481 9907
3412 9907 9808 7550 -6426 -5363 -7034 -7784 -2258 12611 2398 -2395 -5625 -1570 -1543 2406 15304
3397 15304 28121 17928 2527 -5877 -21668 -16075 -2500 -16209 -21048 -27055 -39844 -34117 -22715
3384 -22715 -20975 -24667 -10548 -11596 -23220 -26980 -18878 -3608 1821 -6546 -15963 -15751 -14600 -3698
3370 -3698 14924 18863 11821 -9139 -7371 -8536 -10585 -2752 -1761 -6162 -17573 -30259 -17431 5531
3356 5531 10777 -1108 -11568 -14394 -22764 -15646 -79 5229 277 14298 23170 25312 15960 4110
3342 4110 -391 -3561 -4883 -2981 -675 3125 2698 5935 17430 19740 6718 -6852 1529 24265
3328 24265 20000 19529 3786 -7024 1921 19226 -1015 -2407 -4939 -8576 -11355 -16317 -19234 -16470
3314 -16470 -16479 -20089 -15894 -21719 -20352 -14298 -16847 -19072 -9287 -10103 -4860 2174 1066 3114 1185 -3300
3298 -3300 -5877 -10330 10190 24095 32109 25671 18404 21035 24233 17070 7896 -5384 -11924 -6194
3284 -6194 -6912 -11772 -18244 -14298 -4678 -7235 -22794 -17654 -13254 -14505 -5933 7336 2150 -1710 -3628
3269 -3628 -832 11058 14172 21138 20206 21125 2289 -7508 -10869 -1623 17543 22360 9779 14141
3255 14141 13120 1713 5743 22430 20623 8752 1133 1072 -1346 -2952 -15116 -23979 -29901 -10944
3241 -10944 -9738 -9289 -10810 -5085 3846 9905 6781 6648 11570 12833 3632 -4110 -19388 -22984 -22594
3226 -22594 -19144 -17817 -8837 -8919 -3708 6785 -6176 -7920 -6442 754 17425 18275 8930 1024 2287
3211 2287 1435 9580 11490 -2794 2716 14065 20673 23799 13969 8194 10658 18710 11812 1890 9962
3196 9962 6006 9700 3584 8661 9228 396 -8530 -22129 -23992 -20809 -16783 -1227 4702 -3508 -20664
3181 -20664 -13174 -2626 1301 4266 8866 -1756 -5481 -4639 -1977 -4973 -4941 6741 12188 16762 24032
3166 24032 22495 7475 -5123 -12187 -31834 -36124 -27552 -13243 -8176 -14316 -12780 -7251 -1942 3411
3152 3411 7722 13687 20812 22105 15727 8151 13165 13074 -973 -7663 -5118 8308 1407 -1473 9076
3137 9076 9477 2517 1898 -431 -12924 -20293 -3762 -2462 4293 5530 631 -6367 -2973 5937 -2269
3122 -2269 -15383 -6212 5229 -4619 -4654 -6544 -10075 -6102 -1652 -195 -555 -517 6979 147 -5827 1747
3106 1747 10115 1734 1778 7345 10763 4635 -19855 -21970 -20217 -13548 -4549 3416 12988 12782 13466 25819
3090 25819 11034 -2391 -11995 -20130 -25046 -22599 -18063 -16016 -9252 -13457 -4906 -4199 2567 55
3076 55 8977 -214 -12729 -12523 -20562 -16899 -10003 -14932 -27524 -36724 -26772 -12225 -6055 -5987 1024
3061 1024 7903 9209 6764 12511 6796 2154 3790 -12929 -19539 -7686 11592 17245 19012 17294
3047 17294 9664 -184 -1721 -8630 925 17696 12547 1366 11040 18381 18477 15162 20028 13663 3916
3032 3916 4494 2274 -372 -6633 -1305 6184 12291 17266 9521 2019 175 -2834 -8399 -9285 3005
3017 3005 -29 2784 11948 20622 15209 -9350 -13329 -4631 -5467 -3286 3734 20534 20288 4312 -7357
3002 -7357 -7422 -2984 459 211 2030 -8771 -7719 3616 12856 14091 23042 16978 11587 14975 12279
2987 12279 5511 3317 7684 20184 31889 11133 -9217 -7622 3056 8355 7120 2282 1620 -9357
2973 -9357 -15363 -12175 -6098 -5115 -15335 -19893 -21756 -10839 -7064 -12864 -8749 190 14243 7754
2959 7754 6393 -8076 -7237 5342 3545 -6086 -14646 -2719 2452 1426 7728 9125 802 6977
2945 6977 11351 1281 3693 6793 5117 3891 -4787 11772 5095 -4561 7386 10749 -997 -8600
2931 -8600 -113 -2617 2631 11192 5808 7699 -11085 -15818 -11409 -6046 -8973 -17483 -13176 -9964 -7484
2916 -7484 -125 5664 1846 -4876 -3322 -862 3967 14341 8331 3452 2888 5463 -3389 -2182 -3070
2901 -3070 -9981 -21698 -24059 -13548 -965 -400 541 -4984 -15060 -20466 -32503 -2749 14884 10199
2887 10199 -1636 -21054 -5847 -3924 -5128 2066 -250 326 -611 -12625 -5043 -1631 5801 7519
2873 7519 10606 25655 27091 27997 26079 17097 13085 12859 20281 26219 30641 15415 11690 13843 6395
2858 6395 2586 -3274 1737 1170 -1318 -5244 -2116 -283 1938 6652 5924 3822 17795 23623 5762
2843 5762 -7300 -9815 -2604 6512 4802 252 1442 14010 11554 8361 3539 -7281 -2733 -5867
2829 -5867 -5669 -878 -670 7986 3584 -522 4766 -7728 -3763 1671 -12450 -14515 14965 24644 -5352
2814 -5352 -31318 -16382 -606 9936 5444 395 -46 -6081 4796 15103 19279 17174 15308 13881
2800 13881 12828 2184 -1538 -2078 784 8471 10100 13284 8271 334 -2741 -1821 -5285 -8196 206
2785 206 4154 -3936 -19240 -13109 -1600 6250 4808 -4519 -7363 -2342 3044 8935 17177 10153 9363
2770 9363 7284 14022 15742 15383 5987 1067 6927 15682 10163 -5591 -2701 842 5290 6878 2331
2755 2331 -7770 -7011 -171 -5019 -4066 -8824 -4989 9069 11079 -10 2667 6449 8801 -3278
2741 -3278 -4191 -607 -4323 4647 15497 9329 -6259 -5835 9829 16738 17734 5084 -3740 1859 10362
2726 10362 16896 22134 10401 -5881 -5851 -8682 -2326 381 332 18 14926 16276 29659 37123 30740
2711 30740 7631 1585 -11645 -1940 15161 22757 9644 7074 20682 25404 23711 16274 12347
2698 12347 6687 10587 3209 -8335 -7309 989 15418 3293 -10159 -19456 -12041 -7566 3519
2685 3519 8904 6451 -2846 -1437 8620 2376 -7233 -8650 -4737 -6769 -17282 -20064 -20035 -9143 -18027
2670 -18027 -25586 -31435 -26110 -11453 7518 946 1745 6258 552 -3804 1818 1539 8646 19405
2656 19405 27209 12950 8948 15740 25919 17131 22104 27117 24618 16712 16275 22837 23918 7964
2642 7964 7351 8365 -6503 -10753 -7115 -2625 -2190 -7443 -2102 1016 -2620 8446 27799 20097 8571
2627 8571 10093 -1429 -6947 -1231 9996 6321 2443 1417 13596 15809 11195 15316 26723 24714
2613 24714 24730 10162 11621 9359 4924 6367 15421 11469 16686 19414 7775 5934 30036 31895
2599 31895 25406 21505 8930 4217 -4002 -7630 -12190 -5530 -596 -3817 -8398 3788 14585 11807
2585 11807 -1651 3208 16334 21843 21716 28502 18042 6523 5963 287 -5436 -13779 -8958 -17109
2571 -17109 -11452 -11734 -7568 -10297 -7189 -10795 -10170 3903 -7777 -22195 -14115 -8274 -2677 7261
2557 7261 16167 5045 -12893 -17169 -8038 -9020 -8152 -540 6821 902 -10018 -16328 -10119 3456
2543 3456 10598 5227 -1126 -2815 -645 878 -21615 -25096 -8668 6219 -1791 -13968 -4357 6676
2529 6676 -100 -16225 -29686 -33884 -17490 -6206 -6792 -11664 -6715 653 -6492 -4494 -3972 -1140
2515 -1140 909 7915 7753 -530 -9460 14789 14278 -186 -2068 -569 -16428 -21552 -25702 -30605 -28703
2500 -28703 -25951 -9092 -10763 9051 7031 5723 2756 -3250 4196 -2894 2122 12426 20324 34043
2486 34043 39056 29258 19438 15034 2410 -8435 -16293 -19905 -15205 -25771 -16588 -16472 -28714 -26390
2472 -26390 -3565 9790 16067 13153 -4193 -6193 12062 16054 -4725 -8986 -6666 -3543 11549
2459 11549 15802 1965 -12270 -20647 -20355 -18326 -21165 -9968 -8986 -20975 -21376 -12455 -6329 -8017
2445 -8017 -5016 2290 6283 8168 8377 -6515 -12047 -17901 -28632 -27103 -27146 -28169 -12599 -10172 -11927
2430 -11927 -22495 -14188 477 2335 3787 5330 -11936 -14190 -12251 -3480 -5021 10001 15879 20577
2416 20577 13258 13002 9048 10832 5727 1552 -5978 -9869 -16305 -9741 -12105 -19421 -5232 11568
2402 11568 18458 26446 21608 7214 3822 3915 7589 9448 24140 25187 17364 7478 -1466 11959
2388 11959 12537 3230 4627 7517 -3143 2473 -15000 -21753 -9241 3479 5499 12477 7858 1465
2374 1465 -2534 5073 8695 5598 271 -336 -8633 -19413 -23593 -14916 -2054 -2671 300 628 -1228
2359 -1228 -3573 -2771 -5990 -2667 -21615 -23363 -18543 -17718 -6781 704 7637 -2732 -8625 -14359 -105
2344 -105 -6567 -7332 5831 -5802 12347 11945 5735 7230 13324 13057 15044 20430 20393 8781 8023 11699
2328 11699 7340 -2199 -6206 -8090 -2100 -13471 -22688 -16939 -16610 -14400 -7635 10362 21737 5283
2314 5283 4929 9632 10809 14222 21618 4017 -968 4276 -8357 -13368 -4460 4119 13455 27828
2300 27828 22451 24717 13261 11718 14503 13993 3596 3335 6246 640 -5097 -20566 -22495 -3100
2286 -3100 5200 5902 -5460 -5984 -14817 -15882 -10039 -8612 -1406 3378 1336 -5948 -15440 -2091 11471
2271 11471 22520 18912 12327 12817 -726 -5292 -14501 -21536 -19364 1957 11046 1283 -4120 -12596
2257 -12596 -23459 -25884 -4565 -5602 -5371 1047 4465 4135 5827 -2404 -15049 -13492 -9932 -13900
2243 -13900 -16741 -19625 -11453 -2266 -9784 -16812 -9064 -3881 -6880 -11522 -8081 -15112 -8764 9161
2229 9161 -532 -5510 -2225 -8064 -20786 -14265 -7951 -40 1356 -4119 1555 2482 6752 8359 8338
2214 8338 -11684 -36321 -46468 -32404 -29618 -22289 -16804 -28651 -24210 -13561 -9903 -21416 -26089
2201 -26089 -24754 -17667 -10932 -278 10891 6967 2625 6558 -996 -10181 -15600 -17869 -12200 9973
2187 9973 13203 720 -11634 -10386 -3601 581 -696 -74 -10097 -2952 5758 13190 5182 6766
2173 6766 7654 7987 18490 15747 6814 8160 8144 17974 27079 18856 3961 -1522 10783 24477 16948
2158 16948 9550 -11947 -6756 -2648 -3399 -7785 -3074 1591 6502 7464 205 493 12204 16540 19811
2143 19811 14116 10535 5416 -4059 1929 10122 -2697 -8312 -9932 -9156 -6158 -11792 -9889 -9109 -5158
2128 -5158 -2128 5425 17666 10804 5739 1062 1532 12694 12251 7801 -5649 -15634 -19328 -17099 -1183
2113 -1183 -8631 -8430 6719 27432 34169 11235 7304 10168 17327 10776 10790 12686 16828 30836 38924
2098 38924 36262 15921 -5080 -8340 -7054 -6935 1931 -3049 -10739 -1214 -4735 -19744 -11525 4292
2084 4292 9372 1675 -5856 -16784 -13827 -13936 -15922 -10380 -11259 -10690 1199 18419 15720 2763 -13566
2069 -13566 -17678 -25117 -19763 -9557 -11854 -8673 -8541 -13713 -8110 1240 22996 37652 41744 23532
2055 23532 10522 14228 26897 30561 25611 6481 -15764 -19072 3281 12985 11368 -2503 -1085
2042 -1085 6050 7126 5186 -3856 -10942 -16109 -34284 -40733 -28036 -23710 -26198 -23053 -22234 -6914
2028 -6914 13513 18915 14016 9560 22195 30761 28069 30241 31773 26839 12163 13237 14583 11923
2014 11923 14368 26111 15715 8716 15172 20783 12115 6685 -15097 -22494 -18055 -21256 -18501 -21187
2000 -21187 -27341 -21227 -14948 -7462 -681 -9589 -2478 -13707 -24943 -7750 -9184 -10903 -15394 -10556
1986 -10556 -7315 5668 16717 14720 8696 9844 15700 4555 -8409 5927 19109 27458 30104
1973 30104 24174 2391 -448 16535 16877 549 -14180 -24134 -13001 -7106 1135 8884 1419 -3580
1959 -3580 -199 -8859 -7325 -10323 -13330 -4399 8618 -1193 -13005 -18379 -22821 -11478 -4157 -12355
1945 -12355 -7243 236 -8597 -705 14291 7790 11541 10783 -863 -14488 -11107 -13202 -673 18249
1931 18249 21873 3592 -10245 -6667 -7015 -8813 -1889 2262 6424 3861 -3370 -9747 6827 18129
1917 18129 19771 15185 9389 4598 -5732 -12335 -8102 -5371 4285 -1754 -4291 -5546 4467 2388
1903 2388 -4688 -10779 -15542 -5961 5201 3992 -17350 -17666 2364 3480 -7841 -16964 -18078 -17903
1889 -17903 -18816 -11427 -3834 1509 6411 1075 -6757 294 -8104 -9491 -5846 -18672 -24131 -9246
1875 -9246 9451 8180 -6306 -379 -1960 -13529 -7961 -3387 -387 2369 3439 347 -607 571
1861 571 -4914 -2887 7988 7701 84 -9020 -3241 10624 18056 9322 2069 7467 18471 13295 3956
1846 3956 -2373 4666 10647 12058 13067 3950 -5276 -12106 -6286 -8212 -6580 -54 3256 21496 9027
1831 9027 722 1164 -6312 -19411 -24666 -18114 -13473 -13069 -23304 -12085 14144 11213 11750 22293
1817 22293 31700 17205 -5285 -11608 -10420 -5240 1159 94 -12736 -8986 -4670 -4416 -17293 -12763
1803 -12763 -3754 3593 -1070 4801 23608 18097 -456 4486 18637 30105 23882 20472 24511 25177
1789 25177 10932 179 10573 11846 8708 5635 -2826 -262 -850 10665 22639 23684 22721 14173
1775 14173 17764 14266 5141 -8811 -18904 -22115 -8683 -1960 -22 -1507 -5552 -738 8274 11189
$$ [...]
##END NTUPLES=NMR SPECTRUM
##END=
