##TITLE=Analysis number 321377
Compound Code cc 49601
Book Reference 449/132
Project Code adrs
Chemist Name davee
##JCAMPDX= 6.0         $$ Bruker NMR JCAMP-DX V2.0
##DATA TYPE= NMR SPECTRUM
##DATA CLASS= NTUPLES
##ORIGIN= Bruker BioSpin GmbH
##OWNER= nmr
$$ XWIN-NMR		Version 3.5
$$ Tue Aug  8 11:36:09 2006 GMT Daylight Time (UT+1h)  MAYBRIDGE\nmr@NMR_250MHZ
##.OBSERVE FREQUENCY= 250.131544655141
##.OBSERVE NUCLEUS= ^1H
##.ACQUISITION MODE= SIMULTANEOUS (DQD)
##.ACQUISITION SCHEME= undefined
##.AVERAGES= 16
##.DIGITISER RES= 18
##SPECTROMETER/DATA SYSTEM= dpx250
##.PULSE SEQUENCE= zg30
##.SOLVENT NAME= DMSO
##.SHIFT REFERENCE= (INTERNAL, DMSO, 0, 16.522)
##AUDIT TRAIL= $$ (NUMBER, WHEN, WHO, WHERE, WHAT)
$$ ##TITLE= Audit trail, XWIN-NMR		Version 3.5
$$ ##JCAMPDX= 5.01
$$ ##ORIGIN= Bruker BioSpin GmbH
$$ ##OWNER= nmr
$$ C:\u/data/dgb/nmr/ADRS/420/pdata/1/auditp.txt
$$ ##AUDIT TRAIL=  $$ (NUMBER, WHEN, WHO, WHERE, WHAT)
(   1,<2006-08-08 11:35:50.78 +100>,<MAYBRIDGE\nmr>,<NMR_250MHZ>,
      <created by zg, POWCHK disabled, PULCHK disabled
       configuration hash MD5:
       E2 DF 36 D8 04 B2 41 60 5A D7 A3 38 5A 4B D0 FE
       data hash MD5: 64K
       0B 0F 36 8F 15 C3 62 CE 28 32 D8 CD 48 47 21 C1>)
(   2,<2006-08-08 11:36:02.28 +100>,<MAYBRIDGE\nmr>,<NMR_250MHZ>,
      <Start of raw data processing
       ef LB = 0.3 FT_mod = 6 PKNL = 1 SI = 32K 
       data hash MD5: 32K
       0C 37 9E 4C 65 99 E9 78 E0 D5 6E AA FF 0A 2C 8E>)
(   3,<2006-08-08 11:36:03.94 +100>,<MAYBRIDGE\nmr>,<NMR_250MHZ>,
      <apk 
       data hash MD5: 32K
       8B 80 40 0B A7 08 90 E7 8E FF B9 25 90 70 A7 28>)
(   4,<2006-08-08 11:36:04.77 +100>,<MAYBRIDGE\nmr>,<NMR_250MHZ>,
      <abs ABSG = 5 
       data hash MD5: 32K
       00 ED 95 1F D0 6D 02 DB 98 EA F0 34 C9 A5 AF 46>)
$$ ##END=
$$ 
$$ hash MD5
$$ C6 E6 8C DD 79 92 2D 66 7D C2 73 12 30 40 13 F4
##$RELAX= 
##$RELAX= 
##$RELAX= 
##$RELAX= 
##$RELAX= 
##$RELAX= 
##$RELAX= 
$$ Bruker specific parameters
$$ --------------------------
##$DU= <C:\u>
##$EXPNO= 420
##$NAME= <ADRS>
##$PROCNO= 1
##$TYPE= <nmr>
##$USER= <dgb>
##$AMP= (0..31)
100 100 100 100 100 100 100 100 100 100 100 100 100 100 100 100 100 100 
100 100 100 100 100 100 100 100 100 100 100 100 100 100 
##$AQSEQ= 0
##$AQ_mod= 3
##$AUNM= <au_zg>
##$AUTOPOS= <21 >
##$BF1= 250.13
##$BF2= 250.13
##$BF3= 250.13
##$BF4= 250.13
##$BF5= 500.13
##$BF6= 500.13
##$BF7= 500.13
##$BF8= 500.13
##$BYTORDA= 1
##$CFDGTYP= 0
##$CFRGTYP= 5
##$CHEMSTR= <none>
##$CNST= (0..31)
1 1 145 1 1 1 1 1 1 1 1 1 1 1 1 1 1 1 1 1 1 1 1 1 1 1 1 1 1 1 1 1 
##$CPDPRG= <>
##$CPDPRG1= <>
##$CPDPRG2= <>
##$CPDPRG3= <>
##$CPDPRG4= <mlev>
##$CPDPRG5= <mlev>
##$CPDPRG6= <mlev>
##$CPDPRG7= <mlev>
##$CPDPRG8= <mlev>
##$CPDPRGB= <>
##$CPDPRGT= <>
##$D= (0..31)
0 1 0 0 0 0 0 0 0 0.06 0 0 0 0 0 0 0.0002 0 0 0 0 0 0 0 0 0 0 0 0 0 0 
0 
##$DATE= 1155033349
##$DBL= (0..7)
120 120 120 120 120 120 120 120 
##$DBP= (0..7)
150 150 150 150 150 150 150 150 
##$DBP07= 0
##$DBPNAM0= <>
##$DBPNAM1= <>
$$ [...]
##$SUBNAM7= <"">
##$SUBNAM8= <"">
##$SUBNAM9= <"">
##$SW= 20.6930455092707
##$SWIBOX= (0..15)
0 0 3 0 0 0 0 0 0 0 0 0 0 0 0 0 
##$SW_h= 5175.983436853
##$TD= 65536
##$TD0= 1
##$TE= 295.16
##$TE2= 300
##$TE3= 300
##$TEG= 300
##$TL= (0..7)
0 120 120 120 120 120 120 120 
##$TP= (0..7)
150 150 150 150 150 150 150 150 
##$TP07= 0
##$TPNAME0= <>
##$TPNAME1= <>
##$TPNAME2= <>
##$TPNAME3= <>
##$TPNAME4= <>
##$TPNAME5= <>
##$TPNAME6= <>
##$TPNAME7= <>
##$TPOAL= (0..7)
0.5 0.5 0.5 0.5 0.5 0.5 0.5 0.5 
##$TPOFFS= (0..7)
0 0 0 0 0 0 0 0 
##$TUNHIN= 0
##$TUNHOUT= 0
##$TUNXOUT= 0
##$USERA1= <user>
##$USERA2= <user>
##$USERA3= <user>
##$USERA4= <user>
##$USERA5= <user>
##$V9= 5
##$VALIST= <valist>
##$VCLIST= <CCCCCCCCCCCCCCC>
##$VD= 0
##$VDLIST= <DDDDDDDDDDDDDDD>
##$VPLIST= <PPPPPPPPPPPPPPP>
##$VTLIST= <TTTTTTTTTTTTTTT>
##$WBST= 1024
##$WBSW= 4
##$XGAIN= (0..3)
0 0 0 0 
##$XL= 0
##$YL= 0
##$YMAX_a= 377826
##$YMIN_a= -412993
##$ZGOPTNS= <>
##$ZL1= 120
##$ZL2= 120
##$ZL3= 120
##$ZL4= 120
##$ABSF1= 16.522
##$ABSF2= -4.171173
##$ABSG= 5
##$ABSL= 3
##$ALPHA= 0
##$AQORDER= 0
##$ASSFAC= 0
##$ASSFACI= 0
##$ASSFACX= 0
##$ASSWID= 0
##$AUNMP= <proc_1d>
##$AZFE= 0.1
##$AZFW= 0.1
##$BCFW= 0
##$BC_mod= 0
##$BYTORDP= 0
##$COROFFS= 0
##$CY= 12.5
##$DATMOD= 1
##$DC= 0
##$DFILT= <>
##$DTYPP= 0
##$F1P= 14.0000005364418
##$F2P= -0.99999901652339
##$FCOR= 0.5
##$FTSIZE= 32768
##$FT_mod= 6
##$GAMMA= 0
##$GB= 0
##$INTBC= 1
##$INTSCL= 1
##$ISEN= 128
##$LB= 0.3
##$LEV0= 0
##$LPBIN= 0
##$MAXI= 10000
##$MC2= 0
##$MEAN= 0
##$ME_mod= 0
##$MI= 0
##$NCOEF= 0
##$NC_proc= -3
##$NLEV= 6
##$NOISF1= 0
##$NOISF2= 0
##$NSP= 0
##$NTH_PI= 0
##$NZP= 0
##$OFFSET= 16.522
##$PC= 1
##$PHC0= 144.2058
##$PHC1= 6.479734
##$PH_mod= 1
##$PKNL= yes
##$PPARMOD= 0
##$PSCAL= 4
##$PSIGN= 0
##$REVERSE= no
##$SF= 250.13
##$SI= 32768
##$SIGF1= 0
##$SIGF2= 0
##$SINO= 400
##$SIOLD= 32768
##$SREGLST= <1H.DMSO>
##$SSB= 0
##$STSI= 32768
##$STSR= 0
##$SW_p= 5175.98343685301
##$SYMM= 0
##$S_DEV= 0
##$TDeff= 65536
##$TDoff= 0
##$TI= <Analysis number 999999
Compound Code 99
Book Reference 9
Project Code 9>
##$TILT= no
##$TM1= 0
##$TM2= 0
##$TOPLEV= 0
##$USERP1= <user>
##$USERP2= <user>
##$USERP3= <user>
##$USERP4= <user>
##$USERP5= <user>
##$WDW= 1
##$XDIM= 32768
##$YMAX_p= 281150981
##$YMIN_p= -208518
$$ End of Bruker specific parameters
$$ ---------------------------------
##NTUPLES= NMR SPECTRUM
##VAR_NAME=  FREQUENCY,     SPECTRUM/REAL,   SPECTRUM/IMAG
##SYMBOL=    X,             R,               I
##VAR_TYPE=  INDEPENDENT,   DEPENDENT,       DEPENDENT
##VAR_FORM=  AFFN,          ASDF,            ASDF
##VAR_DIM=   32768,         32768,           32768
##UNITS=     HZ,            ARBITRARY UNITS, ARBITRARY UNITS
##FACTOR=    0.157963299565203, 1,           1
##FIRST=     4132.6476996994, 0,             0
##LAST=      -1043.33573715361, 0,           0
##MIN=       -1043.33573715361, -208518,     0
##MAX=       4132.6476996994, 281150981,     0
$$ Real data points
##PAGE= N=1
##DATA TABLE= (X++(R..R)), XYDATA
$$ [...]
16281d0628Q162j2581m931Q805j5057J3849K6199L9113k7914k3124J222J964k7921
16268e2842L610M6158q202l954K6537K3045l8630k2900k5573k8864j9196J3529
16256h7282J8385M5889l804q363J877L8343M677j9715K1762J2233M360M347j7387
16243A5322l7955m1731K5138L3031J387L043J24j5498q747L9444L2495k2886j3756
16230I411l7062K3063L0275M9648k5568k0173k7744n1380j3262J3312R466J1543
16218b8471j0265m0439M5172L1233M1731K1418R25m3764j8736l46M057K2557J1615
16205C6687J7063k655K9296k1975k3235j9609N196j5364k620o018j227m0893K4119
16192b1235R257l8071k9491K7485o685J8889P2294K8998l313P264m3693l7233
$$ plain form
16281 -40628 -32466 -45047 -49978 -41173 -56230 -42381 -16182 22931 -4983 -28107 -26885 -24921 -52842
16268 -52842 -49232 -3074 -11276 -15230 11307 34352 -4278 -27178 -52751 -81615 -100811 -87282
16256 -87282 -68897 -23008 -26812 -35175 -33298 5045 9722 -9993 11769 24002 28362 32709 15322
16243 15322 -22633 -64364 -39226 -6195 -4808 -1765 -1641 -17139 -25886 13558 46053 23167 9411
16230 9411 -27651 -4588 25687 75335 49767 29594 1850 -49530 -62792 -49480 -40014 -28471
16218 -28471 -38736 -79175 -34003 -2770 38961 60379 61304 17540 -1196 -1542 2515 25072 36687
16205 36687 53750 51095 80391 58416 35181 15572 20768 5404 2784 -3234 -4461 -45354 -21235
16192 -21235 -11978 -50049 -79540 -52055 -58740 -39851 32443 61441 58128 65392 21699 -15534
16180a5534L213M1636J2581n0383m6485l3627J0163j8939k7705K3899N9281N2314
16168A0414j8606L188J214P040j7917k4420p059K5436J2911k728l2187J0635l5374
16155f7453J2060L2045L2928j2259N496N5375j0552k2743l653L5824j6004M827
16143D5891J5932j9887M359P856k7862R27l078n993k6400N688p344J2060K0884
16130B3033p098l9235N046j7768j5362j5856k5739J9419M1698M5089l1758J3983
16118d548J513l412J6345j760k744k8206k2578l817K5662M0798n452J7847j4537
16105A5111l5196m20M195L7987l7666j4064O657M7413J8114l2303j2931j5614
16093a8717n167k2695k1811J0545M364J2960k766L1340J6161j7488O066J4119
$$ plain form
16180 -15534 -12321 29315 41896 -8487 -54972 -88599 -78436 -97375 -125080 -101181 -41900 10414
16168 10414 -8192 -5004 -3790 3250 -14667 -39087 -46146 -20710 -7799 -10527 -42714 -32079 -67453
16155 -67453 -55393 -23348 9580 -2679 2817 58192 47640 24897 21244 57068 41064 45891
16143 45891 61823 41936 46295 54151 26289 27216 24138 18145 -8255 -2567 -9911 2149 23033
16130 23033 15935 -23300 -18254 -36022 -51384 -67240 -92979 -73560 -31862 13227 -18531 -4548
16118 -4548 -3035 -6447 9898 8138 5394 -22812 -45390 -49207 -23545 17253 11801 29648 15111
16105 15111 -20085 -20505 -16310 21677 -15989 -30053 -23396 24017 42131 9828 -3103 -18717
16093 -18717 -23884 -46579 -68390 -57845 -53481 -40521 -43287 -11947 4214 -13274 -7208 6911
16081F911M7249n105j4840o985k2986o778j4075K0173R632o619K1365j5592p393
16068D957K935k5001j939R565m482j0761J9694J5141j5925j1095K0380L2585P381
16055D3435j5181k4240p287K1100M0004j443n721q108P808l0051l1029M643K2339
16042A6269J0950L394j0559K8661l7067k4578m5801J097Q089N420K3342N2418
16030C1635j6536j5994l035K046L3745M572l3747l3062N23L1465m220j8600k9101
16017e0309M7871N328K2992j4909l3356K3973N521j3981j0931j1506l968J1912
16005b1363J1351j6647k892R594K4541J0479j3275p265O121L3778j1586q405K420
15992A6851K1059k7340p293N5736L293l1580k4020m953j1244j0221o635L725R107
$$ plain form
16081 6911 54160 49055 34215 27230 4244 -2534 -16609 3564 13196 6577 27942 12350 4957
16068 4957 7892 -17109 -19048 -9483 -13965 -24726 -5032 10109 -5816 -16911 3469 36054 43435
16055 43435 28254 4014 -3273 17827 57831 56388 50667 42559 50367 20316 -10713 -6070 16269
16042 16269 27219 30613 20054 48715 11648 -12930 -58731 -57634 -49545 -44125 -20783 31635
16030 31635 15099 -895 -3930 -1884 31861 36433 2686 -30376 -29853 1612 -2608 -21208 -50309
16017 -50309 -2438 2890 25882 10973 -22383 1590 7111 -6870 -17801 -29307 -33275 -21363
16005 -21363 -10012 -26659 -29551 -19957 4584 15063 1788 -5477 644 34422 22836 14431 16851
15992 16851 37910 10570 3277 59013 62306 30726 6706 1753 -9491 -19712 -26347 -22622 -13515
15979a3515K4974j0403m4190m5700q930J4345M6405M2503J5012r28M4271p1217
15967g373m0842P0633p428j2011j0069m8180O964Q370j470l7720M07M1161L9781
15954B223L8517l4368K8710q721k9969j3664k2600l4929K2004J8174K4569n324
15942a5378K6821k2059j0903Q333k2783k7085O740M6451K8605k5237P469O1007
15930F1981p275m6441J0246J2060J7737j0536P465r182l9590J5067M873J9846
15918C6251Q193j609l868o9273l1037K6012j018j3385J3062l708L7070M5527k0941
15905B1276j7163K3425J1721k338J8430Q884q147k1887l096j2745j2402J3564
15893A9522j8727L3840P746M5451k8734m6865N640J6231n058j2268k36l2933J736
$$ plain form
15979 -13515 11459 1056 -43134 -88834 -97764 -83419 -37014 5489 20501 19573 63844 -7373
15967 -7373 -48215 22418 14990 2979 -7090 -55270 -48306 -39936 -41406 -79126 -78719 -37558 2223
15954 2223 40740 6372 35082 26361 -3608 -17272 -39872 -74801 -52797 -34623 -10054 -15378
15942 -15378 11443 -10616 -21519 -13186 -35969 -63054 -56314 -9863 18742 -6495 974 61981
15930 61981 54706 8265 18511 30571 48308 37772 45237 36055 -3535 11532 16405 36251
15918 36251 44444 42835 38967 -30306 -61343 -35331 -36349 -49734 -36672 -40380 -3310 42217 21276
15905 21276 4113 27538 39259 36921 55351 64235 56088 34201 31105 18360 5958 19522
15893 19522 795 34635 42381 87832 59098 12233 17873 34104 29046 16778 16542 -16391 -14655
15880a4655J0585J6081o849j0370j3168L9119J6826n0117l0314J9738M4684j3813
15868G747K007j1592m831L5486j7230j5754K3204M407J0704M575k1345o135J6826
15855B8069L152j5422o790L2584J3837k133p000j44N475J4863j3138l4605m4150
15842b5402j8710l1678k3758K9038O1312q48n574k2625j1067K7819J8878K4242
15830B1627K4805O858M897j9144j6885K281o4746j5796L4248L1093N694Q58J4402
15817C0192j1206k0989o603k889M360k1562M145j532Q087j0164n132o370J7049
15804b2614M3232r702k1054J3472j0819r113J9984l0913k9770J436j0265r114
15792g5240L8129K164J0555r039M7250P6358O724o2052k6052l9992k650j0283
$$ plain form
15880 -14655 -4070 12011 5162 -5208 -18376 20743 37569 -12548 -42862 -23124 21560 7747
15868 7747 9754 -1838 -6669 28817 11587 -4167 19037 23444 34148 38723 17378 11243 28069
15855 28069 31221 15799 9009 41593 55430 53297 46297 46153 51628 66491 53353 18748 -25402
15842 -25402 -44112 -75790 -99548 -70510 -9198 -10046 -15620 -38245 -49312 -21493 -2615 21627
15830 21627 46432 53290 58187 39043 22158 24439 -40307 -56103 -21855 9238 14932 15790 30192
15817 30192 18986 -2003 -8606 -11495 -7135 -28697 -24552 -26084 -17997 -28161 -33293 -39663 -22614
15804 -22614 20618 10916 -10138 3334 -7485 -16598 3386 -27527 -57297 -55861 -66126 -75240
15792 -75240 -37111 -34947 -24392 -33431 13819 90177 96901 34849 8797 -31195 -33845 -44128
15780d4128P488J4008P434K8598L7563k5990n6763j3654j9441m31L7005Q592O508
15767a3211q321o843J0222j3292K0614J6484J7768L754l7281l3179P905J059J8850
15754a5471K5801J8024J2967J491j0292j0451k7537K7357J2108k5013j390J4934
15742B2528j5492J0105J9468N66q0092n9134L4206L7789k1071K7619O5418j0118
15730C1792m0922j6319P657J9852n0299j2096Q377J9655p78k7410m7796k9215
15718a37502K3281K5565K7142K1699K9178K1354K4911m3335N579N1614J4033l6437
15706B7082m3552K6836Q009K3030J8287j3442m6711p400j1516J010j3086Q421
15694b3032M2294J2559k4112j3788J5445j0167l7052o847j798P659K7774j9636
$$ plain form
15780 -44128 -36640 -22632 -15198 13400 50963 24973 -31790 -45444 -64885 -65316 -28311 -19719 -13211
15767 -13211 -21532 -28375 -18153 -31445 -10831 5653 23421 27175 -10106 -43285 -35380 -34321 -15471
15754 -15471 10330 28354 41321 42812 32520 22069 -5468 21889 33997 8984 7594 22528
15742 22528 7036 17141 36609 37175 -42917 -102051 -67845 -30056 -51127 -23508 41910 31792
15730 31792 -9130 -25449 -17792 2060 -48239 -60335 -51958 -32303 -33081 -60491 -108287 -137502
15718 -137502 -114221 -88656 -61514 -39815 -10637 10717 35628 -7707 -2128 49486 63519 27082
15706 27082 -16470 10366 18375 41405 59692 46250 -461 -7861 -19377 -18367 -31453 -23032
15694 -23032 19262 31821 7709 -6079 9366 -801 -37853 -44700 -46498 -38839 -11065 -30701
15682c0701o8870k7556L0118L6224K4414J1705j0802L4193J2734l88p933j1798
15670h660k8296p21L1730K5330N5005Q829n4496n5002q770n166n010J5957J6615
15657a2655L3408j0595K6484M257k0533k8583L0130o255K853k4657r695N23M886
15644a0432K7933M5362j7182j3167q36J6035r568j474o135k6351o21J7847J2315
15631C3726j0874m326J1891l1843M773m2691l2302J6945j0196M7756j2083l936
15619c3160j6246Q5j7335J7360J0227j4720R537K5796J0058k915l6934m2530L8071
15606e2706K6416k4735j9888k0841j0264J5567J5492K4152J2618P437J6030l2376
15594d3098j1708J2159L4155j0416j3901L1049K212J2483K7449n060n2762l0014
$$ plain form
15682 -30701 -99571 -127127 -97009 -60785 -36371 -24666 -35468 -1275 11459 11071 3138 -8660
15670 -8660 -36956 -37677 -5947 19383 74388 83217 28721 -26281 -35051 -40217 -45227 -29270 -12655
15657 -12655 20753 10158 36642 40899 20366 -8217 21913 15658 18511 -6146 -15841 -15318 -10432
15644 -10432 17501 62863 45681 32514 31678 47713 38145 36671 30536 4185 3564 21411 33726
15631 33726 22852 18526 30417 -1426 3347 -39344 -71646 -54701 -64897 -17141 -29224 -33160
15619 -33160 -49406 -49321 -66656 -49296 -39069 -53789 -44252 -18456 -8398 -11313 -48247 -90777 -52706
15606 -52706 -26290 -51025 -70913 -91754 -102018 -86451 -70959 -46807 -34189 -26752 -10722 -43098
15594 -43098 -54806 -42647 -8492 -18908 -32809 -1760 452 12935 40384 35324 -17438 -47452
15582d7452r292m9416M9592N6519K1077K4976m1995j5790L0809r960j1380j354
15570c666K701J1768l3012r835M0399J3204L2268K7506L9840k8682k6284Q405
15558G4612n7161j9848p717j408j6468R737m5401r071j7974q440O823L8728L7592
15545a5996L7100K0746r431J0703m2440j351q104K4199J9309J7418J9779l052
15533F8880n2551l297k1641N9878J1664l5422m596k35k4528J6346M4753j6589
15521D2662n8691m4476j4013J8013R133M0361N6415p235k4732k4131n432J0876
15509a250J5032K2579l9131k1498k2293R477K5570K2249n841M750K11J5229L5546
15496F0630L353M512l2335l2873R984O270p081r022J0262P571K6559J4971K2669
$$ plain form
15582 -47452 -56744 -106160 -56568 -49 21028 46004 4009 -11781 19028 9068 -2312 -3666
15570 -3666 -965 10803 -22209 -32044 8355 21559 53827 81333 121173 92491 66207 74612
15558 74612 17451 -2397 -10114 -11522 -27990 -18253 -63654 -72725 -90699 -99139 -92316 -53588 -15996
15545 -15996 21104 41850 32419 43122 682 -669 -8773 15426 34735 52153 71932 68880
15533 68880 16329 13032 -8609 51269 62933 27511 22915 22680 -1848 14498 59251 42662
15521 42662 -16029 -60505 -74518 -56505 -47372 -7011 49404 42169 17437 -6694 -12126 -1250
15509 -1250 13782 36361 -2770 -24268 -46561 -37084 -11514 10735 4894 9644 9855 25084 60630
15496 60630 63983 68495 36160 3287 13271 19541 12460 3438 13700 21271 47830 62801 85470
15483H5470m8613n9292k1990K5958J3803l4019j3279j604r233M993J5419k913
15471d5300j3152L1947k792O844K1388m495J0368k1642n588M1706o44m5846Q518
15458a8688n365J1296k206K0034l182k9999k580N247O362Q522R35J5110p460q131
15444a0105J1820Q251j3785l8131J302j9203j2372M1171K9003J0145r743L3338
15432C1691n0191J2524o290J1706n141l3463J6081J0734J884J4320L908j1472
15420c709j1330k8501P497P842P804M813J4529J8499K000j175j1106j7277n057
15407a5171P928j4997k086K707j0702o469J7736P494L2628K2333l5499L959m045
15394E816k7901L388l2745k0195N7896J3302J9256j6429m6157k8955L0272J3738
$$ plain form
15483 85470 36857 -22435 -44425 -18467 -4664 -38683 -51962 -53566 -62799 -57806 -42387 -45300
15471 -45300 -58452 -26505 -29297 -22453 -1065 -5560 4808 -16834 -22422 19284 18640 -27206 -18688
15458 -18688 -24053 -12757 -14963 5071 1889 -28110 -30690 -25443 -19081 -10559 -9624 5486 -1974 -10105
15444 -10105 1715 9966 -3819 -41950 -40648 -59851 -72223 -31052 -2049 8096 -1647 31691
15432 31691 -18500 -5976 -12266 -560 -5701 -39164 -23083 -12349 -10465 3855 7763 -3709
15420 -3709 -15039 -43540 -36043 -28201 -20397 -15584 -1055 17444 19444 18269 7163 -10114 -15171
15407 -15171 -7243 -22240 -24326 -21619 -32321 -38790 -21054 -13560 19068 41401 5902 9861 5816
15394 5816 -22085 -18697 -51442 -71637 -13741 -439 18817 2388 -43769 -72724 -42452 -28714
15382b8714j2661p171j5440K5600J1880k0167J9291L8689K0433j946J0795J1761
15370E2350k1950J0496l8086n4883J6757L3636p049m60l7056p285L7893K7923
15358A2286K1126k916j84k4936l7649q831P908j6984J611K9276n567m8449J6159
15345e7150L3654m4774l1679n362M054K2314J7410J2100J2840j2484j7733J6851
15333d9959J0008J7449M1526K2176k9174m663k9146k7216J806J9052l320L269
15321b8192j2006N0829J6566K7037l7245l3667p453j1224J7068q673j1556K1829
15309a6687J876L0959K9112J7633J270j5555j1466k6155j288l2513m004L8111
15297A1293L0173K1489j4687j7247n732m995m800K41J1844k0604k9275R961J4559
$$ plain form
15382 -28714 -41375 -48546 -63986 -38386 -26506 -46673 -27382 11307 31740 29794 40589 52350
15370 52350 30400 40896 2810 -52073 -35316 -1680 -8729 -9189 -46245 -53530 -15637 12286
15358 12286 33412 30496 30312 5376 -32273 -41104 -33196 -50180 -48569 -19293 -24860 -73309 -57150
15345 -57150 -23496 -68270 -99949 -105311 -101257 -78943 -61533 -49433 -36593 -49077 -66810 -49959
15333 -49959 -39951 -22502 19024 41200 12026 7363 -21783 -48999 -47193 -28141 -31461 -28192
15321 -28192 -40198 10631 27197 54234 16989 -16678 -24131 -35355 -18287 -26960 -38516 -16687
15309 -16687 -14811 16148 45260 62893 64163 48608 37142 10987 9699 -22814 -26818 11293
15297 11293 41466 62955 48268 31021 25289 20294 15494 15735 27579 6975 -22300 -12339 2220
15284B220M654Q62j0048N340J5911j2536j9676m724j6386j2556K7282K7786J2801
15271B0930K0711m885j3655p361k3877p148o785k4202L0083O954J3627r127o319
15258a1054p275J9308K3794L2183K9774J390l0405j1544m9305l2739P265L4551
15246E943m430q133K390j0496q95j0547R781k8673J6552K7529K1828j7591J6514
15233A9772R535k172q725J5007K6525Q589k9926k023j3459k4994l270j9595J3867
15220a0869M565j4886q202j5954j5379l64O9522j290J0583j449J7511K2360q146
15207D8002o5370m3747r709L1819J7691j3808j7761j2628J6812R302Q087K4210
15195g100K1157k5945p364J6174J2048J364L4888K7437m6014j5582O440J8759
$$ plain form
15284 2220 6874 7736 -2312 3028 18939 6403 -13273 -17997 -34383 -46939 -19657 8129 20930
15271 20930 41641 36756 23101 15740 -8137 -15285 -22070 -46272 -16189 -9235 4392 -4735 -11054
15258 -11054 -18329 979 24773 56956 86730 88120 57715 46171 -3134 -35873 -28608 5943
15246 5943 1513 -6620 -4230 -14726 -15621 -26168 -16387 -45060 -28508 -979 20849 3258 19772
15233 19772 29307 27135 18410 33417 59942 68531 38605 36582 23123 -1871 -5141 -24736 -10869
15220 -10869 -6304 -21190 -29392 -45346 -60725 -61089 8433 7143 17726 16277 33788 56148 48002
15207 48002 -17368 -61115 -70824 -39005 -21314 -35122 -52883 -65511 -48699 -39397 -31310 -7100
15195 -7100 14057 -11888 -19252 -3078 8970 10334 45222 72659 26645 11063 17503 36262
15183C6262j5197m02J580j320L0069p469j0076l8079j5222L0688J5217N895J1741
15170D3687J0389p1992p294L4199M9689l914k951o5698m9999k6613M0096L3459
15158a6942l95L1262j0768p018N1486M8357p206m3021j8795M520k6804J8351L5154
15145E8181K3663o0357k4297J2435O072K3963j4520l1797J922K9293L5544k1435
15133C8667l6419j8962L0567L7959j3694k9110j2752j8977M8874p629J9471j4438
15121B3557K5838o45l4293J660L1480J4718k1805j2947l1688l9521J3597M131
15109b5918K6451L7223k8491J5629Q69l0812m1316k4024L6946M2796K8537n353
15097C2537K0477J0992l1667o320J2757O547m7139r369j0841K6140L9040j0956
$$ plain form
15183 36262 21065 20663 22243 20923 50992 43523 33447 -4632 -19854 10834 26051 31946 43687
15170 43687 54076 -17916 -25210 8989 58678 54764 51813 -13885 -63884 -90497 -50401 -16942
15158 -16942 -17337 13925 3157 -3861 47625 95982 88776 45755 26960 31480 4676 23027 58181
15145 58181 81844 21487 -2810 9625 15697 39660 25140 -6657 -4735 24558 60102 38667
15133 38667 2248 -16714 13853 51812 38118 9008 -3744 -22721 26153 18524 37995 23557
15121 23557 49395 48750 14457 16117 47597 62315 40510 27563 -4125 -43646 -30049 -25918
15109 -25918 533 37756 9265 24894 25763 -5049 -46365 -70389 -33443 9353 37890 32537
15097 32537 53014 64006 32339 26019 38776 45323 -1816 -11185 -22026 4114 43154 32198
15085C2198j6700q708O27J6457l3030j4409K2145k9792j6002M8720K1211O888
15073B9605j6506k9219J2265J0833k8353k9334m395L9395L8915o175l6626o093
15061b5688j5711j708L7341k0301L3853J8521N690J8100k6135l8347o87J4517
15049e55l475l777J1215Q900J5064O553n437k0728J4405r372k7382j6121P444
15036b3266J2611K294n50K9330l6884Q270L08l1995K0641L4795J3956j0551k2932
15023c973j5358K4006L5400J2647p856O200k1216Q372l4190l5377l008k4107L5294
15010b3166m853k5632L5074K1851J6286P467k1323k6512K3314M2227K55j722R991
14997E3257J716k3244m8172q1489k2086M5974M7055M8311O396j320j2529O605
$$ plain form
15085 32198 15498 6790 7417 23874 -9156 -23565 -1420 -31212 -47214 1506 22717 29605
15073 29605 13099 -16120 -3855 6978 -21375 -50709 -55104 -15709 23206 17031 -19595 -25688
15061 -25688 -41399 -43107 -5766 -26067 7786 26307 31997 50097 23962 -14385 -15072 -555
15049 -555 -4030 -7807 3408 12308 27372 33925 28488 7760 22165 12793 -14589 -30710 -23266
15036 -23266 -10655 -8361 -8911 20419 -16465 -8195 -7887 -39882 -19241 15554 29510 18959 -3973
15023 -3973 -19331 4675 40075 52722 44866 51066 29850 38222 4032 -31345 -34353 -58460 -23166
15010 -23166 -28019 -53651 -18577 3274 19560 27027 5704 -20808 2506 44733 44988 43266 53257
14997 53257 54973 31729 -16443 -97932 -120018 -74044 -26989 21322 27718 26398 13869 20474
14985B0474j9240K6725k5754k8773K5046O595J2451K1062j3397L80K1932K4189
14973G1690l0146l4427k71j217Q952Q458k734J7297L0423j2606j6216J5084L235
14960E7522j2803j8060m24j3942k5356N957o726J0759n935j6793n073k1543L6137
14947a6280L2265L3609Q426j4669n6998j3736L7578k8386P105O224q277m629j0453
14934b8221l787L4727K4216Q027L8478j2729o4034n6253K0119K6294m462Q793
14922h832P68J8890j0031k9276r908N6145K5310l2621j1131j3495r374j0508J2202
14909b1861k8279K1311J6450K2127q700j1138K8983N673j5828m1477J1775j968
14897b2932j5969k315K2824J6336m1030m6014K1418N9061L6436j839j9586k5090
$$ plain form
14985 20474 1234 27959 2205 -26568 -1522 5073 17524 38586 25189 25569 47501 71690
14973 71690 41544 7117 6846 5629 14581 23039 20305 37602 68025 55419 39203 54287 57522
14960 57522 44719 26659 26235 12293 -13063 -7106 -13832 -3073 -9008 -25801 -30874 -52417 -16280
14947 -16280 15985 49594 58020 43351 -13647 -27383 10195 -18191 -11086 -4862 -13139 -17768 -28221
14934 -28221 -32008 2719 26935 34962 73440 60711 -3323 -59576 -39457 -13163 -17625 -8832
14922 -8832 -8064 10826 795 -28481 -38389 17756 43066 10445 -686 -14181 -23555 -34063 -21861
14909 -21861 -50140 -28829 -12379 9748 1048 -10090 18893 24566 8738 -32739 -20964 -22932
14897 -22932 -38901 -41216 -18392 -2056 -43086 -89100 -67682 -8621 27815 25976 6390 -18700
14885a8700p300J2769K0147r441k4913L7420J8003M0099j6676k8238p59j7242
14873E169n3588J1471K4631r891k927L47J9920L179j8251L1414j560K3127k7744
14860E297l3875K053L2994j601R068K0149M0161J0709l1963m8111k8853j1126
14848c5098k1336K6282J4800N018J4252k6956j2233l554M5690P2861k6160o6038
14836a2472j6353K8126J8415L6817r231m2296j3884k3842L4786m421L0369K944
14824B8958j4075j5046j0222j7511j0900L5025K1435j1444m3549m3138j574J365
14812h0676J6575J5251P015K527q33K1174J4907L633k3043L097k5108J3771K0789
14799a0921M2325K4558k6398Q285J2734n7519j5141J3459k0993M9390N038l7155
$$ plain form
14885 -18700 -26000 -13231 6916 -2525 -27438 9982 27985 68084 51408 23170 22411 5169
14873 5169 -48419 -36948 -12317 -22208 -25135 -24788 -4868 -1689 -19940 11474 9914 33041 5297
14860 5297 -28578 -26525 6469 4868 13936 34085 74246 84955 52992 4881 -23972 -35098
14848 -35098 -56434 -30152 -15352 -10334 3918 -23038 -35271 -38825 6865 79726 53566 -12472
14836 -12472 -28825 -699 17716 54533 45302 3006 -10878 -34720 66 -4355 26014 28958
14824 28958 14883 -163 -10385 -27896 -38796 -3771 17664 6220 -37329 -80467 -82041 -80676
14812 -80676 -64101 -48850 -41835 -39308 -40141 -18967 -4060 -427 -23470 -20373 -45481 -31710 -10921
14799 -10921 31404 55962 29564 37849 50583 -6936 -22077 -8618 -29611 19779 24817 -12338
14787a2338j1235K8259k5507m2479L0738M5320P723o4319k7228J0618J014L1980
14775b7454q428l535J5996j9777j8720k575L2116J0796j6501o730O4626M3669
14763F3483j6669m1050j4832k0693p367j3799L5443L3856k9876m101j2032k3688
14751e1325j585K307j8367K5148O121K5615O38R814L2654J1276L9090r922k9243
14738D2221j9515j0702m0787o558K7052J3974k411k059m360M437k2137k5263L439
14725d2669M0566J6755j7111K4725k5683k7072M2099M604K886K7840R659n8408
14713a809k6794k8319k6148l8586L9793P1655L9093M277l041k0231j189P43M291
14700A3735j4804j4457k8502m826J5706L7914J0371k9246j4894j044K3711L3148
$$ plain form
14787 -12338 -23573 4686 -20821 -63300 -32562 12758 20481 -43838 -71066 -60448 -59434 -27454
14775 -27454 -35882 -39417 -23421 -43198 -61918 -64493 -32377 -21581 -38082 -44812 19814 63483
14763 63483 46814 5764 -9068 -29761 -37128 -50927 -15484 18372 -11504 -15605 -27637 -51325
14751 -51325 -52910 -50603 -68970 -43822 -37701 -12086 -11448 -1634 31020 42296 81386 71464 42221
14738 42221 22706 12004 -28783 -35341 -8289 5685 3274 1215 -3145 1292 -20845 -46108 -42669
14725 -42669 -2103 14652 -2459 22266 -3417 -30489 11610 16214 19100 46940 56599 -1809
14713 -1809 -28603 -56922 -83070 -121656 -81863 -10208 28885 33162 30121 9890 8701 9444 13735
14700 13735 -1069 -15526 -44028 -48854 -33148 4766 15137 -14109 -29003 -30047 -6336 26812
14688B6812J0246M241R452j614k3755l9607k922r155P302K8693P878P465m9029
14675b3993l8258K9053K2634j9084M9316O1563k1177n5093M702k900k0825K3035
14663H973J2612q50k0947k911k9710q206q058k170M6004M255M21J5996N878J057
14649B2344O502J4835l9062m886K9042K4559m2746l245L2832J9564m6855r3775
14637h0891n0570M6940O1137R224R360P530k4604M5K5051j6235r549L0895K6740
14624C5073k9110J1393k2816o016q567k6923p529j556J361p589L6201M4324j5543
14611B703Q0k6986n565J3258j3954k3068Q269o445R851q213k2248O5842M1931
14598C5455K7034l2973J4400N78l4360j9993j6393p289j2679R261L1669l2688
$$ plain form
14688 26812 37058 41299 50751 49137 25382 -14225 -17147 -26302 -19000 9693 17571 25036 -23993
14675 -23993 -62251 -33198 -10564 -29648 19668 81231 60054 4961 9663 6763 -14062 8973
14663 8973 21585 20735 -212 -3123 -32833 -41039 -49097 -51267 -5263 -1008 -587 15409 21287 22344
14649 22344 28846 43681 4619 -267 28775 53334 10588 7343 40175 59739 12884 -80891
14637 -80891 -131461 -84521 -23384 -14160 -4800 2730 -21874 -21829 3222 -13013 -22562 8333 35073
14624 35073 5963 17356 -5460 -11476 -20043 -46966 -54495 -56051 -54690 -62279 -26078 18246 2703
14611 2703 2783 -24203 -29768 -16510 -30464 -53532 -45263 -51708 -41857 -50070 -72318 -6476 35455
14598 35455 62489 29516 43916 44494 10134 -9859 -26252 -33541 -46220 -36959 -5290 -37978
14586c7978O956P7126L9219k9193j551j0205o3657k3926J6435j1568j5667L9046
14574a4963m776k5875N08J4361L686l7965K4704j4086n889J8097P477L648m597
14561c5670N998L1320q67k2226J919o891J8475L999p1296l670P4339K6993k5901
14548c478J4650o168o594K0994j6985L762L269j1831n7988R379O0949L8631m534
14535D4056k6029j3614L4926j9195j533M789J0670j9264L1557m0874l725l84j2626
14522a1246M647L0804L684n793m6906j0282M712r011k4248j9329J3031K3403K9990
14509a6544J5634K1j1442P10j2399j2693L4964L6467k928k1848R496K382k0648
14496A172M270J1289K3277K0055k0965k5998p314L6406k3692r015o0525j9926
$$ plain form
14586 -37978 -31022 46104 85323 56130 54579 44374 -19283 -43209 -26774 -38342 -54009 -14963
14574 -14963 -19739 -45614 -45106 -30745 -27059 -65024 -40320 -54406 -60295 -42198 -34721 -31073 -35670
14561 -35670 -29672 1648 781 -21445 -19526 -26417 -7942 -3943 -75239 -78909 -4570 22423 -3478
14548 -3478 11172 5004 -1590 19404 2419 6181 9450 -2381 -60369 -50990 9959 48590 44056
14535 44056 18027 4413 39339 20144 18611 23400 34070 14806 46363 5489 1764 1380 -11246
14522 -11246 -6599 24205 27889 22096 -24810 -35092 -30380 -39391 -63639 -82968 -69937 -46534 -16544
14509 -16544 -910 -889 -12331 -11621 -24020 -36713 -1749 34718 31790 9942 19438 21820 1172
14496 1172 5442 16731 40008 60063 39098 13100 5786 42192 18500 9485 -51040 -70966
14484g0966L1291j630K1333L1123J167L898L3495P13k5218k7950l8939j6820j386
14471e9889L1467j1502j290n44k9821p317j9261J0917M9580J602k0996l5931N855
14458h7130K1097K510P619k4394k3197K8353N3491J7276L5674N095m4830l3346
14446d1782O850P250K4051K1349J9585l463n7661r100J2885J1133K7448j8575
14434c0k8895O832p293K5012J3302J5102k5867k9953K461j6086k0539N754J4653
14421d5547K6973M5996J0065l4105l1731m0744J0153J02008J7620q3239J2759
14410i792p312k5437n286L7311M1423J3085L096r461q296j8002l7515j3296k7971
14397f7453L1422K7057k4326k9897q652J4804n650j6799M031M3033J0068j4281
$$ plain form
14484 -70966 -39675 -41305 -19972 11151 12318 16216 49711 50424 25206 -2744 -41683 -58503 -59889
14471 -59889 -28422 -39924 -41214 -41758 -71579 -78896 -98157 -87240 -37660 -36058 -57054 -92985 -87130
14458 -87130 -66033 -63523 -55904 -80298 -103495 -75142 -21651 -4375 31299 36394 -8436 -41782
14446 -41782 -34932 -27682 -3631 17718 37303 33840 -23821 -32921 -20036 -8903 18545 -30
14434 -30 -28925 -22093 -29386 -4374 8928 24030 -1837 -31790 -29329 -45415 -65954 -60200 -45547
14421 -45547 -18574 27422 37487 3382 -28349 -69093 -58940 43068 60688 -22551 -9792
14410 -9792 -17104 -42541 -47827 -10516 30907 43992 47088 37627 29331 11329 -26186 -39482 -67453
14397 -67453 -36031 -8974 -33300 -63197 -71849 -57045 -62695 -79494 -75463 -32430 -22362 -36643
14385c6643P334L992K0410k1834k7026J3517J7737K6008K3835n677q765n3582
14373d0694m1060O90R560P917N1865L0031K990K4098J2606n1639j1100L410n2936
14360e4262J9670L4415N0132j8466p458J5138R069m349n131j2513m420r605l4553
14347b2333k9886j612k3519j5076M724K4494N481k7043K7071K3376J1287M0347
14335A7311J2119K1550j481m2556m40J4006M50K4411Q810l1055m7437k2666J882
14322d5096L0493J5930k216k3555m3855K9922J519k1476K2886j5293o761J3397
14310d4105L5083n233J8812N2693n646k3581k7502m0770J2289K5533J488j9259
14298b0198P456k0683r583j7193L0720K4692J9040K3654M630n1598M464J2748
$$ plain form
14385 -36643 -29309 -25317 -4907 -26741 -53767 -40250 -22513 3495 27330 21653 12888 -40694
14373 -40694 -81754 -81064 -71504 -63587 -11722 18309 21299 45397 58003 6364 -4736 -1326 -54262
14360 -54262 -34592 -177 49955 31489 24031 39169 48238 43889 38758 26245 21825 12220 -22333
14347 -22333 -52219 -53831 -77350 -92426 -87702 -63208 -57727 -84770 -57699 -34323 -23036 17311
14335 17311 29430 50980 49499 6943 6503 20509 20959 45370 54180 23125 -24312 -46978 -45096
14322 -45096 -14603 1327 -889 -24444 -68299 -38377 -36858 -58334 -35448 -50741 -57502 -44105
14310 -44105 -9022 -14255 4557 57250 51604 28023 521 -40249 -27960 -2427 -939 -20198
14298 -20198 -12742 -33425 -43008 -60201 -29481 -4789 14251 37905 42535 -9063 -4599 8149
14286H149J2800n504P92j2459j9512R955L9909k1176n1114K319J3191K1160M6213
14273D4723l2764l3021J9684M7681J1845J0226j3934k6014m4R424k1419p0810
14261e4423k6432L742M106J6102M5885j4965K1421J5525L039N620J5416J185N22
14248C6743j454j8224j2299J1372j2671J9684J0581j5602j0761j3673j128k8282
14236c5714J6406L5834j0997L5035Q339J5995j5763K77k9478J1915K414l704J0257
14223D0816l6045l4130j9270L928M1724K4306m2159m6627P224q179L8143M3979
14211A3710L0350j7340l9255n7617r528N2305J4810J2780k7721k4173k5589K2196
14199e5072K5306K7486K4581m1606n3580N371L4580L5827J9432Q867p2061j7753
$$ plain form
14286 8149 20949 15445 16237 3778 -15734 -5779 34130 12954 -38160 -35841 -22650 -1490 44723
14273 44723 11959 -21062 -1378 46303 58148 68374 54440 28426 28382 37806 16387 -54423
14261 -54423 -80855 -77113 -73007 -56905 -11020 -25985 -4564 10961 14000 19620 35036 36221 36743
14248 36743 35289 17065 4766 16138 3467 23151 33732 18130 7369 -6304 -7432 -35714
14236 -35714 -19308 16526 5529 40564 48903 64898 49135 49412 19934 31849 34263 30559 40816
14223 40816 4771 -29359 -48629 -44701 -2977 21329 -20830 -67457 -60233 -68412 -30269 13710
14211 13710 44060 26720 -12535 -70152 -79680 -27375 -12565 215 -27506 -51679 -77268 -55072
14199 -55072 -29766 -2280 22301 -19305 -72885 -67514 -32934 2893 22325 31192 -40869 -58622
14187e8622k2456K2400L1169J805J9010J6613J737K2255l1735l4951K7165L2887
14175B7277k3725p109K53k4684j0427P487m0989m2593q49M1376L7753M0534l156
14162A148N088O741j8116K6081K6857m1185N46j3800k6488m7732Q617P0800j4962
14149a6405k6253J2610N660j4755k4389n141K9823j9513L015L6719j7432J9431
14137a6630N0620K1216k9422k8429k0092L0736n387j3422K1992j4843l0246l1046
14125f4953L5931M1872N103j9553k6049J3445L1894k4897k3174l030j1580k9768
14113g4759K4427J084M72J2591n86m0868k4730j1778K9533N7843Q203l8183p063
14100f3814J9636M913K1096n41L0303J1320r888k2852N8848J2354k2752k9019
$$ plain form
14187 -58622 -81078 -58678 -27509 -25704 -6694 9919 11656 33911 2176 -32775 -5610 27277
14175 27277 3552 -3557 -3304 -27988 -38415 -30928 -71917 -114510 -115359 -73983 -36230 4304 1148
14162 1148 6236 12977 -5139 20942 47799 6614 7160 -6640 -33128 -80860 -72243 -1443 -16405
14149 -16405 -42658 -30048 -24388 -39143 -63532 -68673 -38850 -58363 -55348 -18629 -36061 -16630
14137 -16630 33990 55206 25784 -2645 -22737 7999 2612 -10810 11182 -3661 -33907 -64953
14125 -64953 -29022 12850 17953 -1600 -27649 -14204 17690 -7207 -30381 -33411 -44991 -74759
14113 -74759 -50332 -49248 -48776 -36185 -36771 -77639 -102369 -114147 -84614 -26771 -18568 -56751 -63814
14100 -63814 -44178 -39265 -18169 -18710 11593 22913 13025 -9827 49021 61375 38623 9604
14088I604j1634p426k788j3949o183l0934N224L3868J7642J811m108k1387K316
14075b7944J1472K6517p132K4957M0564R262m6961m7886N021Q504K0878K6492
14063D3744r289j4086J0141j9400j0867j4489L120J9870M4082K5779j2040k1354
14051D5211m0063k4961K7611L1228L2634l6734m246N956j5245j478k9298o874
14039a6259k3988L776K2695j0944j9861n455J2656L5151j490k4438L4667R549
14027A6059j3088j0504J6325L8489q257k7869m3424m1944j6258M7779N3103j0831
14015d20m821L6247P473K863Q567j1054p439j506k0355k23m4485j8864q548k5472
14001h8037M3985J7607j7306k9888M6594K2941Q5k23K9335n3520m4606P0235L7504
$$ plain form
14088 9604 -2030 -9456 -12244 -26193 -32376 -63310 -58086 -24218 -6576 -4765 -8873 -30260 -27944
14075 -27944 -16472 10045 2913 27870 68434 77696 30735 -17151 -12130 -3626 17252 43744
14063 43744 34455 20369 30510 11110 243 -14246 -11126 8744 52826 78605 66565 45211
14051 45211 5148 -19813 7798 39026 71660 34926 30680 36636 21391 19913 -9385 -16259
14039 -16259 -40247 -36471 -13776 -24720 -44581 -50036 -37380 -2229 -3719 -28157 6510 16059
14027 16059 2971 -7533 8792 47281 39024 11155 -32269 -74213 -90471 -42692 10411 -420
14015 -420 -5241 31006 38479 41342 49909 38855 31416 29910 9555 9332 -35153 -54017 -62565 -88037
14001 -88037 -44052 -26445 -43751 -73639 -27045 -4104 -4019 -4242 25093 -28427 -73033 -2798 34706
13988C4706k3883k6346J9132m1112r713J1444j7630J8429J665L6679J9317J6738
13976C9426k7756j5383l4517n987M5479K0056J4807k728P068m3294k1346L5652
13964A1477K7547k9461k7149p927L613L8805k6470k570M5269l277j230l9529n776
13951a6678J2756m0068N229L9210K0688p495j1807Pk4179n537K7077k7450j89
13938b8436K7421J9489k6963k3379K4146J3059n076J2402m483j4590k4572n892
13926c6874L5473J3665j2087J7099l0912l1291M9838M6209j3933l4900j6958o714
13914b1385M338l226R776J0558m6162O140L0151L7154M3486M416J4564j0944m6308
13901C2558o5857R315J0544M2965L514k1935k4743l2865k255L5408L4857L78k2355
$$ plain form
13988 34706 10823 -15523 3609 -37503 -47216 -35772 -53402 -34973 -33308 3371 22688 39426
13976 39426 11670 -3713 -38230 -44217 1262 21318 36125 33397 40465 -2829 -24175 11477
13964 11477 39024 9563 -17586 -25513 -21900 16905 -9565 -12135 33134 29857 28627 -10902 -16678
13951 -16678 -3922 -43990 -38761 449 21137 13642 1835 1842 -22337 -27874 -797 -28247 -28436
13938 -28436 -1015 18474 -8489 -31868 -7722 5337 261 12663 8180 -6410 -30982 -36874
13926 -36874 -1401 12264 177 17276 -13636 -44927 4911 51120 37187 2287 -14671 -21385
13914 -21385 -17047 -20273 -10497 61 -46101 -39961 -9810 27344 70830 75246 89810 78866 32558
13901 32558 -33299 -23984 -13440 29525 33039 11104 -13639 -46504 -48759 -13351 21506 21884 -471
13888d71J6672K8984o0863k5799j8672J1557P9784m036j5077n8524R419L8380
13876A354k0094J7932Q703K067K19k194m505K9833K9745k1120k9641l3031M267
13863a6465k1261K1626M23o653N336J1368k9600J0123N471L0131k8777j5146K4165
13850i259j1995k930K7554M94l4769J2553K446J2915J6598j4710m2769m568K9247
13837a9193K0156J7645j293n602J4754J3487J1773l0275l1957j1265J086k2396
13825d3080L3340L5580J2221l195l405k4961j9345k4862M5486O80r789J24J4384
13812A3178j0348j2768k8324K3110K8735q403r130o383N05k6259o413m797J9390
13799b7907n839K840J4528L1695L7853j3446p17N462k2209J02M9472K1085N364
$$ plain form
13888 -471 16201 45185 -15678 -41477 -60149 -48592 31192 27156 12079 -46445 -37026 1354
13876 1354 -18740 -808 7895 9962 10181 7987 3482 33315 63060 41940 12299 -20732 -16465
13863 -16465 -37726 -16100 -15677 -22330 -16994 -5626 -35226 -25103 -19632 10499 -18278 -33424 -9259
13850 -9259 -21254 -24184 3370 3864 -30905 -18352 -15906 -2991 13607 -1103 -43872 -48440 -19193
13837 -19193 963 18608 17315 11713 26467 39954 51727 21452 -10505 -21770 -20684 -43080
13825 -43080 -9740 25840 38061 34866 31461 6500 -12845 -37707 7779 8459 -1330 -1206 13178
13812 13178 2830 -9938 -38262 -15152 13583 5180 -3950 -10333 -9828 -36087 -42500 -47297 -27907
13799 -27907 -33746 -30906 -16378 15317 53170 39724 39007 44469 22260 22362 71834 92919 98283
13786I8283r436j9324l6299L278k5078l363l209M2843l227m1920p575K7383K8937
13773E1293o9R869l6398j3790L2009r630K2965J3084m7544j3440K4970N6955o981
13760H3293j2433k2761m2583j6157j2163M274k828j6554K4862M943m4626L9980
13748a2753L4415K854J5472K0779Q781j5281q2768q0913J3322N0468J9770M2382
13736A6528m9727k1861K0357L1348K3767J5208O515J4849n927J5062O4069m4882
13724H5306m9144n6741P470L237n750J7165j9671J1919j6047j0135k7526r373
13712f9290M1231M3034K1408l536l3252k6410P3178m1867J4800L7907m8159M098
13700A3142n495J9685l998j4080Q007n612k2270j7114r629K792O8595l1787k6763
$$ plain form
13786 98283 88847 69523 33224 36502 11424 8061 4852 47695 44468 2548 -5027 22356 51293
13773 51293 51224 61093 24695 10905 42914 33284 56249 69333 21789 8349 33319 90274 83293
13760 83293 70860 48099 5516 -10641 -22804 -18530 -21358 -37912 -13050 -8107 -52733 -12753
13748 -12753 21662 24516 39988 60767 69548 54267 -28501 -109414 -96092 -45624 -25854 16528
13736 16528 -33199 -55060 -34703 -3355 20412 35620 42135 56984 51057 66119 130188 85306
13724 85306 36162 -20579 -13109 -9872 -15622 1543 -18128 -6209 -22256 -32391 -59917 -69290
13712 -69290 -28059 14975 36383 32847 -405 -26815 46363 4496 19296 57203 9044 13142
13700 13142 7647 27332 23334 9254 17261 11649 -10621 -27735 -37364 -34572 34023 2236 -24527
13687b4527L2729L5618K0640R560K0298j5576n2788k8033K5581L0596J4385j5821
13675E2662n5475n6729L5300J8412j6219n953K2057L5502K020j2072j6N777n798
13662A9468j7153j0851J7101J0975j8065J4295M3184J5315k7036r099N829J6384
13650F0347j1269J4260J0953j0473l9566j9412k0173J5370L0311J9740j8318l0330
13638A440j3438p897J5566q21J5312m84q211L1418q688l6180M423M7732j0945
13625B9227j4956j6075J1853p531n9829K763K1553M8051M2298q375k6295q071
13613A4613l3064L807K4595o5045K106J3784J4305N598j5662J0704K8539p147
13601b867K4379j8032k8374J6820O887J5617q960K4653k9557L156q124n557K291
$$ plain form
13687 -24527 8202 43820 64460 74020 94318 78742 25954 -2079 23502 54098 68483 52662
13675 52662 -2813 -59542 -24242 -5830 -22049 -28002 -5945 29557 31577 19505 19489 25266 19468
13662 19468 2315 -8536 8565 19540 1475 15770 58954 74269 47233 38134 43963 60347
13650 60347 49078 63338 74291 63818 24252 4840 -15333 37 30348 50088 31770 1440
13638 1440 -11998 -19895 -4329 -5150 10162 9678 1467 32885 24197 -11983 -7560 40172 29227
13625 29227 14271 -1804 10049 2518 -57311 -54548 -32995 15056 57354 48979 22684 14613
13613 14613 -18451 -14644 9951 -55094 -52988 -39204 -24899 -19301 -34963 -24259 4280 -2867
13601 -2867 21512 3480 -24894 -8074 -1187 14430 5470 30123 566 3722 -4402 -9959 -7668
13588g668r779m4359M798L9363J7368q512Q8J2336k6638l5381L1988P66M50M4427
13574A9247j1277m5624j477o866L2268M4068k3627k8605j7253O715l511j9389
13562e5331L798J8157K576k1525J0089K1744J0409J4397n233l0658j5025L3425
13550a3177k3087k2113J4998L2912K2489j326J5909K2164j3522k1926k2769k8465
13538c7913R618j3372L801M0788K0017L3320j0924o593k8367k128k7836j2966
13526c2555J6230J0629J7338j3086L7360K0927l1340k0889L5590J6750l6150k3128
13514b324L7299J0686J4278j9572l6782j3322K3891Q481k6325r662k891J0794
13502e449R757J1447Q790o6432j5049M5568Q670k8540p803J5145n277J8760K0130
$$ plain form
13588 -7668 -17447 -61806 -57008 -17645 -277 -8789 -8701 3635 -23003 -58384 -26396 -25630 -25180 19247
13574 19247 7970 -37654 -39131 -45997 -13729 30339 6712 -21893 -39146 -32431 -35942 -55331
13562 -55331 -51533 -33376 -30800 -52325 -42236 -20492 -10083 4314 -919 -31577 -46602 -13177
13550 -13177 -36264 -58377 -43379 -10467 12022 10696 26605 48769 35247 13321 -9448 -37913
13538 -37913 -28295 -41667 -37866 2922 22939 56259 45335 38742 10375 8247 -19589 -32555
13526 -32555 -16325 -5696 11642 -1444 35916 56843 25503 4614 40204 56954 20804 -2324
13514 -2324 34975 45661 59939 40367 3585 -9737 14154 22635 -3690 -13352 -16243 -5449
13502 -5449 4308 15755 24545 -41887 -56936 -11368 -2698 -31238 -39041 -23896 -29173 -10413 9717
13489I717L1332n8116l6224k2986K3439K0719J1876q378j8855O0627J5577l345
13477B5383k3484q977K364j0369k3558J3661j6533M5196K1760k9574N688k0055
13465a8498K5821m864k2489J7299j6194j3367k3338l441K8016J3458K6031L243
13453A1677j4956l2260k5199J7797M4593r628n1812l0499k927J6688O9174L4381
13441B7029k6669k7495p753J923J0435k7692j6785K2586J2958L0794j4675j9546
13429c4890J0321j1694j0429J9148M840j956J635J7069j9369r462M286m962K0238
13416a5225N9422R793p976j3672j4419Q029L3517o911j8971l4063j2386J9877
13404G015M1535j3569k9576p6064k2937L3374J7321L0446j5119Q778L2171K7547
$$ plain form
13489 9717 41049 -17067 -53291 -76277 -52838 -32119 -20243 -28621 -47476 13151 28728 25383
13477 25383 1899 -7078 -4714 -15083 -38641 -24980 -41513 3683 25443 -4131 1557 -18498
13465 -18498 7323 2459 -20030 -2731 -18925 -32292 -55630 -59071 -31055 -17597 8434 11677
13453 11677 -3279 -35539 -60738 -42941 1652 -7976 -59788 -90287 -93214 -76526 -7352 27029
13441 27029 360 -27135 -34888 -32965 -22530 -50222 -67007 -44421 -31463 -669 -15344 -34890
13429 -34890 -24569 -36263 -46692 -27544 -22704 -24660 -23025 -5956 -25325 -34787 -30501 -35463 -15225
13416 -15225 44197 53990 46014 32342 17923 25952 59469 52558 33587 -476 -12862 7015
13404 7015 48550 34981 5405 -70659 -93596 -60222 -42901 -12455 -27574 -18796 13375 40922
13392D0922j1927j1483j2493m1144k3720k1704J5329P0137j3708k8921R362o10
13380b9960j8113K0251K6347J624k0506P2890L0755m934k0301k6853K7686m63
13368E8423r027m1129k3125P013Q177K1415m1518l2404J1926M4093m05k1971k0837
13355c9369r270M501q343N4220Q515l148J217M3625j3338k6356K1010L537l479
13342C3322k1376k0723q592N394l4169M04J4045Q591j1203j6592N3282M9009k461
13329D8931j4260j7090m1052l8415j1414j142j1574k249J2061O674O8265J8130
13317A6865j8602l7124j4504N5419R551q716j765j6242j506N202L6043K4630j2241
13304C7010l5519Q456J1058J3895J8594l5905M857L3824L881j2520n1254L6334
$$ plain form
13392 40922 28995 17512 5019 -36125 -59845 -81549 -66220 3917 -9791 -38712 -29350 -29960
13380 -29960 -48073 -27822 -1475 149 -20357 52533 83288 78354 58053 31200 58886 58423
13368 58423 49396 8267 -14858 -7845 332 21747 -19771 -52175 -40249 3844 3439 -18532 -39369
13355 -39369 -48639 -44138 -52481 1739 10254 7106 8323 51948 38610 12254 33264 36801 33322
13342 33322 11946 -8777 -17369 -11975 -46144 -45740 -31695 -23104 -34307 -50899 2383 51392 48931
13329 48931 34671 17581 -23471 -61886 -73300 -74442 -86016 -88265 -76204 -69530 -1265 16865
13317 16865 -1737 -38861 -53365 2054 11605 2889 1124 -15118 -16624 -11422 24621 49251 37010
13304 37010 1491 9947 21005 34900 53494 17589 22446 56270 60151 47631 -3623 32711
13292C2711j167j4914J7767K0137m0012n2332n2932J7724N7886K3323O462K3978
13280C8631l4322j5798O986k8973k0032J1682m4337l1333m607n165L5342J2897
13268g9029K4680m6281r817M7582K8483m560P439L9944K2781m3952O10j0714k3993
13255d6827J5362J8323L204l3514l299N3455N822j1208l3996l1302K8208K2386
13243a3386J2560j2181n6575O334j6376j0641L5583L300J4724L0360N029K8735
13231B7466p889k8012L1270k4228j5489K2385j5184k5838j8039Q906L6794K4826
13219A6968R533q888K9201K008N663l8751n159k502R609k176m0590J5376L8644
13206B8936m7498k2858K0861q086L600j6501P916M953j285L2914k7569l4360l5437
$$ plain form
13292 32711 31544 16630 34397 54534 14522 -37810 -90742 -73018 -15132 8191 14653 38631
13280 38631 4309 -11489 -4503 -33476 -53508 -41826 -86163 -117496 -122103 -127268 -91926 -79029
13268 -79029 -54349 -100630 -110447 -62865 -34382 -38942 -31503 8441 31222 -12730 -12120 -22834 -46827
13255 -46827 -31465 -13142 -9938 -43452 -46751 6704 12526 1318 -32678 -63980 -35772 -13386
13243 -13386 -826 -13007 -69582 -63248 -79624 -90265 -54682 -51382 -36658 -6298 -1269 27466
13231 27466 19577 -8435 22835 -1393 -16882 5503 -9681 -35519 -53558 -44652 -7858 16968
13219 16968 26501 17613 46814 48822 54485 15734 10575 8073 17682 15506 -25084 -9708 28936
13206 28936 -18562 -41420 -20559 -28645 -25045 -41546 -33630 -28677 -29962 2952 -24617 -58977 -94414
13193i4414O473L7238p704k5924L6958M2206N922j684J4553k4216N7234J948q5135
13180c6545l3768k949n845l615Q205L5017O6502L1438j8877l8695J3353k1478
13168g257l9664o478k235L1311L1519j3414k1209J2089J6767J9390j9265m0750
13156c9196k2333J5067J907N490k4137j9110J3355j4604Q506j1296K3773L7835
13144b4743M1430L2109K961p3327k7705N594M3040O576l576K509M9261M393m0353
13131A8169j4394J3205J3476j0232k1716J1905l7478j4124m2286l204K4447m519
13119f6751k0523J6313L6308J3604K8643n536l3541j4929J4965K5064L546L8902
13107C6065K6458k0075p1874m495M4994k0415o964K6268j3151r508j6790P481
$$ plain form
13193 -94414 -87941 -50703 -58407 -84331 -47373 -5167 755 -929 13624 -10592 46642 48590 -36545
13180 -36545 -70313 -73262 -79107 -82722 -74517 -39500 27002 58440 39563 868 14221 -7257
13168 -7257 -46921 -53399 -55634 -24323 7196 -6218 -27427 -15338 1429 20819 1554 -39196
13156 -39196 -61529 -46462 -44555 -39065 -63202 -82312 -68957 -83561 -75055 -86351 -62578 -24743
13144 -24743 16687 48796 51757 -21570 -49275 -43681 -641 5935 2359 4868 54129 58522 18169
13131 18169 3775 16980 30456 20224 -1492 10413 -27065 -41189 -83475 -86679 -62232 -66751
13119 -66751 -87274 -70961 -34653 -21049 7594 2058 -31483 -46412 -31447 -6383 -2837 36065
13107 36065 62523 42448 -29426 -33921 11073 -9342 -16306 9962 -3189 -12697 -29487 -22006
13095b2006K8591p500J101l7150Q841L0948M7833K3351k7814N061k0215j7809
13083A3232m1526k945n619R808m073K4233O727L049j2028L4506j353j0102K9055
13070D2964j5814q006P555O6979M0972k7785l1373m8680j1062J9588J7866j9020
13058C4184j0311j1478o1816O431M947J5817K7467r704m7393J5482k74Q769L8969
13045A1090k2144m1151O076L9779L7257l6047n2284K664L505j639M0395K6443
13033A3944j2279R020j3772q700k9632l5101J2797J0782Q155l5300j3313J2586
13021h0813L4772P0973N0086j2399l9749O996J8135j0793j5821r882j1420L945
13009D030K3956M6030j3679o2998j8801L0226L3854l5800p700K1557Q297j9816
$$ plain form
13095 -22006 6585 -915 186 -36964 -28123 2825 50658 74009 46195 51256 31041 13232
13083 13232 -28294 -31239 -36858 -27050 -31123 -6890 -163 2886 -9142 25364 24011 13909 42964
13070 42964 27150 19144 26699 93678 134650 106865 75492 26812 15750 35338 53204 34184
13058 34184 23873 12395 -49421 -42990 -38043 -22226 5241 -4463 -51856 -36374 -36648 -27879 11090
13045 11090 -11054 -52205 -46129 -6350 30907 -5140 -57424 -54760 -51255 -52894 -12499 13944
13033 13944 1665 10685 -3087 -11787 -41419 -76520 -63723 -52941 -44786 -80086 -93399 -80813
13021 -80813 -46041 24932 75018 62619 22870 29866 48001 37208 21387 11505 85 4030
13009 4030 27986 74016 60337 -2661 -21462 8764 42618 6818 -882 20675 28972 9156
12997I156q093j683k6923r060r367L653N7690J0815Q05l8352j9312J377k5656
12984e4950j9105L4058Q733K4722J9245l983J6850k1729j599K6138J1941n8544
12972a8223l1649k4459j4175L2208N147j2126k2462M82L5472k746J042p370Q271
12959e0588J7130O434n124l2344j3108M6495K4677J3541k7158n3047N09N953K8934
12946c7696M2407K2905J5647m8597p661J9647j098l320R25k5528m0257q913K9533
12933d2006L6610q657J9065N3003J4446k9881n2628j2510K069J4810L7836j401
12921C0756k2798q894J3783l395l673J3825k7219p8302l0595j0116K5825P3038
12909b7765J6318j2399M129L7691N7260l3621m0732K7388O908j5386l6559k9192
$$ plain form
12997 9156 1063 -620 -27543 -36603 -45970 -42317 15373 26188 26993 -11359 -30671 -29294 -54950
12984 -54950 -74055 -39997 -31264 -6542 12703 8720 25570 3841 2242 28380 40321 -18223
12972 -18223 -49872 -74331 -88506 -56298 -51151 -63277 -85739 -85257 -49785 -52531 -51489 -58859 -50588
12959 -50588 -33458 -27024 -32148 -64492 -77600 -31105 -6428 7113 -20045 -73092 -72583 -66630 -37696
12946 -37696 4711 27616 43263 -5334 -12995 6652 5554 2234 3159 -22369 -62626 -71539 -42006
12933 -42006 -5396 -14053 5012 58015 72461 42580 -10048 -22558 -20489 -5679 32157 30756
12921 30756 7958 -936 12847 9452 5779 19604 -7615 -85917 -116512 -126628 -100803 -27765
12909 -27765 -11447 -23846 -19717 17974 75234 41613 881 28269 35177 19791 -16768 -45960
12897d5960O095J8408J0379j323R289j044k6702M464N9682L5926j760m0830k9599
12884b975l7284k0266M5468M0264J0141J5413P463K841k8852j4628k6960R986
12872F11k8768l5434J545M9700M548L6042N2662k0592k6736k419R118r956m800
12859B5521j9891L6884O869l5134n9117l462J9090p219J0544k3949Q358K3753
12847a7753N0429k3859m1029n252L7301n8j2573j4987O407J5952J9522l0018J9898
12834C980N4585R934m7497J4626j2316J760l2861j6437J2498J0075l6345j6201
12822e4199J9312l516L502o343o078j2375M261N6003J9770K0995j6096m574M358
12809B5020J85Q559k3625k9067k8433L8806P2993k945j1274o226l7148r004j0608
$$ plain form
12897 -45960 -39865 -21457 -11078 -12401 -3112 -4156 -30858 -26394 33288 69214 67454 26624 -2975
12884 -2975 -40259 -60525 -15057 25207 35348 50761 58224 61065 32213 17585 -9375 611
12872 611 -28157 -63591 -62046 -12346 -7798 28244 80906 60314 33578 31159 40277 30321 25521
12859 25521 5630 42514 49383 14249 -44868 -48330 -29240 -36459 -25915 -49864 -41506 -17753
12847 -17753 32676 8817 -32212 -37464 -163 -221 -12794 -27781 -21374 -5422 14100 -15918 3980
12834 3980 58565 68499 21002 35628 23312 25072 -7789 -24226 -11728 -1653 -37998 -54199
12822 -54199 -34887 -38403 -34901 -41244 -47322 -59697 -55436 567 20337 41332 25236 20662 25020
12809 25020 25205 33764 10139 -18928 -47361 -8555 64438 61493 50219 43993 6845 -2159 -12767
12796a2767k7611M6435M8221j6559m1401l2865j6916M997J3755J7477k3747k0128
12784f1109K4377M9816L5055O851k9641m1885N442L8800k2676N77M813J3301J283
12771B5004P307k3459l776L9321L351m2664K8106K3218j7094m5504j4147j8821
12759c9158N765N951j8798l102J7448K3412j7035K6793p239L265L071k1857K4092
12746B608K0687L5171K3727l5547n8918M305L616j7749k919J1250J2897R461o716
12733A873K4441J1441J5785k2464l4237J0168L256j9919J2397R874K5150j3837
12721B3928K557j6461K2036j5728l186K1133m8191m2966L0974K5589j1051n388
12709a6754L0965n857m5579J3294K6255M418Q919n600j4020j3866j7883m4045
$$ plain form
12796 -12767 -40378 6057 54278 37719 -3682 -36547 -53463 -48466 -34711 -17234 -40981 -61109
12784 -61109 -36732 13084 48139 54990 25349 -16536 -11094 27706 5030 5607 10420 23721 25004
12771 25004 32311 8852 5076 44397 47748 5084 33190 56408 39314 -6190 -20337 -39158
12759 -39158 -33393 -27442 -46240 -49342 -31894 -8482 -25517 1276 -5963 -2698 373 -21484 2608
12746 2608 23295 58466 82193 46646 -12272 -7967 -4351 -22100 -25019 -13769 -872 8589 1873
12733 1873 26314 37755 53540 31076 -3161 7007 10263 -9656 2741 12615 37765 23928
12721 23928 26485 10024 32060 16332 13146 34279 -13912 -56878 -25904 -315 -11366 -16754
12709 -16754 14211 8354 -37225 -23931 2324 6742 15661 10061 -3959 -17825 -35708 -79753
12697g9753m9689j686K5638M4361M8457J116m649m606J4048L7084K043k5310O997
12684A4051l8485J28K1830K9101J7824j4210j1057p3374n0711L2044K0322N2575
12672C8J6382m2134j4521J8680o070j37R941L3975L0751l8835m9749J5494k8234
12659e4419J9979j3174R814L0500N053j6453j7018K6351L7977K6175J9029l4737
12647C9077n6570j4284j8597M395j1486K018J3516M3522M5917J3617k4996l1119
12635E010M265l0690j2585o236J0957j2327j2549L314Q999j6635m0507L1997O8181
12622A194K636q265k5831L7051J9809K7681j3381m3678l1611J2683L7704j61J7237
12609C3068L5311J8699k7035L883L9903l4755p2492L3872l5357k6862j2126M6119
$$ plain form
12697 -79753 -129442 -131128 -105490 -61129 -12672 -11556 -16205 -20811 -6763 30321 32364 7054 14051
12684 14051 -24434 -24306 -2476 26625 44449 30239 19182 -54192 -104903 -72859 -52537 38
12672 38 16420 -25714 -40235 -21555 -27625 -27762 -17821 16154 46905 8070 -41679 -26185 -54419
12659 -54419 -34440 -47614 -37800 -7300 -2247 -18700 -35718 -9367 28610 54785 73814 39077
12647 39077 -17493 -31777 -50374 -45979 -57465 -55447 -41931 1591 47508 61125 36129 5010
12635 5010 9275 -21415 -34000 -40236 -29279 -41606 -54155 -50841 -41842 -58477 -98984 -66987 1194
12622 1194 3830 -4435 -30266 6785 26594 54275 40894 -2784 -34395 -21712 15992 15831 33068
12609 33068 68379 87078 60043 63926 103829 69074 -3418 30454 -4903 -31765 -43891 2228
12597B228J5642l5823K38K2326j0105K6989L657l6942K1281J2842r60j8035l3529
12584c0191o839j5515N3574J1381J2721J193M9538j3908n6748K7976m1200N041
12572b977M7287L309j0469L162J094N948n1739j8312K004M4200P520o868k2604
12559A555O605j5561l4079n7619j8201J7074M4077K4848J2678j0534P557j9242
12547d0842k078L0101P703j6800o242n790k7232K4872L4591O976m285l593k5861
12534b8480o410R397L0616p499K2035L1483J9501l5102k181k4555J3536j1491
12522A0850j713k3135K4882L0139k9009k3857K9904o798j3630j0914J9302P6704
12510H2725Q709m4472m1926m9840k6510K5557R1675L0014k5236n0701j2992r804
$$ plain form
12597 2228 17870 -17953 -17715 4611 -5494 21495 25152 -11790 9491 22333 21373 3338 -30191
12584 -30191 -37030 -52545 1029 12410 25131 26324 75862 61954 5206 33182 -8018 -2977
12572 -2977 44310 47619 37150 40312 41406 47354 -4385 -22697 -20693 23507 31027 24159 1555
12559 1555 8160 -7401 -41480 -99099 -117300 -100226 -56149 -31301 -18623 -29157 -21600 -40842
12547 -40842 -42920 -12819 -5116 -21916 -28158 -33948 -61180 -36308 -1717 5259 974 -2619 -28480
12534 -28480 -34890 -25493 5123 -2376 19659 51142 70643 35541 33360 8805 22341 10850
12522 10850 9137 -13998 10884 41023 12014 -11843 18061 11263 -2367 -13281 6021 82725
12510 82725 91434 46962 5036 -44804 -71314 -45757 45918 75932 50696 -5 -12997 -22801
12498b2801K7138J5490P552M697J4910j7669l5458j906L3692n2116l8963p368
12486g2802L2748J3449k6238o065K2408k3753R287L512j8230K0691j2266K3710
12474c3549J1311Q27K5683K6207J4553K953J1200m7885j1100K1818k3412k1356
12462b2750K3065N0486m724m0159j876K0139M0989J7873k4021j3815k3997J9250
12450D0460J8914K7303J770m3961N032L1019K8439J1472l3048O560k5488k6715
12438D1757L0622N077n2633k5118m836j2413L667J3121K458K8850K8288j4320
12426D4520k9056K6367K2535o0359L1031M2865k8774j4646J8385J2353J6218N3035
12414A34474J8801l4243p011j3734l2115k8279N353J8387j5171K719j5051Q524
$$ plain form
12498 -22801 4337 19827 27379 32076 46986 29317 -6141 -8047 25645 -26471 -65434 -72802
12486 -72802 -40054 -26605 -52843 -58908 -36500 -60253 -50966 -47454 -65684 -44993 -57259 -33549
12474 -33549 -22238 -21411 4272 30479 45032 47985 59185 11300 200 22018 -1394 -22750
12462 -22750 315 50801 46077 5918 4042 24181 65170 83043 59022 45207 21210 40460
12450 40460 59374 86677 88447 44486 49518 80537 108976 120448 87400 93960 68472 41757
12438 41757 72379 77456 24823 -295 -5131 -17544 -13877 -756 1702 30552 58840 44520
12426 44520 15464 41831 64366 4007 35038 77903 49129 34483 52868 65221 81439 134474
12414 134474 153275 119032 112021 98287 66172 37893 43246 61633 46462 49181 34130 42654
12402D2654L8256J7612j1897o7356k2656L4064K477n6437N779J4639j1721L4075
12390A9489L4920L7679R42j4535k1103p500o284J6932p301l2184j5936M2232J0581
12377E7932J446k8466k5180n1598m4568J2614Q4554L6574l7722j5762j1301L0408
12365H931J992o7K3394K6480J3191k0904j8665n6702k8236m886R1171M7677l0576
12352E2800k0855j1723O661L55L3489K0336j6923J2991k9999k7747k678k9465
12340a2758K0790O0913J3197q168k7513j485k1367R310L0493L3408k2092l958
12328G0770k0607j2336n55N978k0246j4125k0807L1701L6419J4023j6756n652
12316D7807K2850l025j7709J6080N0280o351n2016l3823M7824j1073J2401J9810
$$ plain form
12402 42654 80910 98522 86625 19269 -3387 30677 33154 -23283 -17504 -2865 -14586 19489
12390 19489 54409 92088 93030 78495 57392 49892 43608 60540 53239 21055 5119 47351 57932
12377 57932 59378 30912 5732 -45866 -90434 -77820 6734 43308 5586 -10176 -21477 8931
12365 8931 10923 10856 34250 60730 73921 53017 34352 -22350 -50586 -55472 35699 83376 52800
12352 52800 31945 20222 26883 27238 60727 81063 64140 77131 47132 19385 16707 -12758
12340 -12758 8032 68945 82142 73974 46461 44976 23609 32919 63412 96820 74728 70770
12328 70770 50163 37827 37272 43250 23004 8879 -11928 19773 56192 70215 53459 47807
12316 47807 70657 67632 49923 66003 116283 109932 57916 24093 71917 60844 73245 93055
12304I3055J4538l8931k0478j1298j4582J0109l384K6203K0214J2420K3206j5422
12292I5650j424o5297j0466K3984J5211K3126j7133j9172R330K830l272k0693
12280C2674j3550R291L5203P790k9731L0447L751J7582R694l0647O418J598k3260
12267E7260k8154k7043J6286M2615j7214L8311L6018N862J1239j1275j9573l8769
12255F5563n6352L4654J2480m2559K8555M3332P704L8152L0346r373l6187J0918
12243A27233j1977K6020n8221j3027L9747K970L9351k909k1452L2538M5882l2368
12231A73787o4550l3593L9801R655j2218N990l1435k3336J2612L6557M1030j9220
12219A35080Q344J2529q61l9710l4651J9875j1457j3099O2970J2290k5371L5131
$$ plain form
12304 93055 107593 68662 48184 36886 22304 32413 29029 55232 75446 87866 111072 95650
12292 95650 94226 28929 18463 42447 57658 80784 63651 44479 53809 56639 53367 32674
12280 32674 19124 28415 63618 71408 41677 72124 75875 93457 103151 72504 78922 80520 57260
12267 57260 29106 2063 18349 60964 43750 82061 118079 123941 135180 123905 104332 65563
12255 65563 9211 43865 56345 13786 42341 85673 93377 131529 161875 152502 116315 127233
12243 127233 115256 141276 83055 70028 109775 112745 152096 149187 127735 160273 206155 173787
12231 173787 109237 75644 115445 125100 112882 118872 87437 64101 76713 113270 154300 135080
12219 135080 143424 155953 155092 115382 80731 100606 89149 76050 139020 151310 125939 161070
12207A61070K6677k8961k1253J0021j1579J7578N643l5741n752K7244l5578l4074
12195G5295K2956K4069L0615L0311N244q666j1818k3189j2210q02N869j3282K351
12182A26743k371J1706J3119L9074J5625j4130J0599k031k3491L966K4419n86
12170B02642k8939Q911j9496J8653J6470K3586M836M447m7470K4276J6074N978
12158B29968l2805j4891J1476j6871L1693L4046k903l6117L8263k1843l3294J1744
12146A98466L5120K2221K870m827J6335k7226k3486L0609n9200J8087L4557K1606
12134B65132K0847k6422l7980K6033p57K7275R580k4963o863l0080q564J9723
12122B32961J3342K2238L2200K6493L016j8215k1729K1889j0361J1558j5780m052
$$ plain form
12207 161070 187747 158786 137533 147554 135975 153553 159196 123455 117703 144947 109369 75295
12195 75295 98251 122320 152935 183246 188490 179824 168006 144817 132607 131805 137674 124392 126743
12182 126743 124372 136078 149197 188271 203896 189766 200365 198334 174843 178809 203228 202642
12170 202642 173703 182614 163118 181771 198241 221827 226663 231110 183640 207916 223990 229968
12158 229968 197163 182272 193748 176877 208570 242616 239713 203596 241859 220016 186722 198466
12146 198466 233586 255807 258677 253850 270185 242959 219473 250082 190882 208969 243526 265132
12134 265132 285979 259557 221577 247610 246853 274128 283708 258745 251882 221802 213238 232961
12122 232961 246303 268541 300741 327234 330250 312035 290306 312195 301834 313392 297612 293560
12110B93560r582p048R976K5405o92L5789N550R249M074N231J8110j295q561K7849
12096D07615J620l310l129j2257J8786O863J6452l932m833J2648K7795K2317P286
12083D93921m8277O115j2155j0031m550l809L6559L3151K842j5805j8842J3633
12071D72752K5312J8589K947J9969L637J6512K1295K1057k5163q792J6618J2443
12059E97176J2987o567k313k0849L5198K4558m1179l8895J4287K4231M8074M2325
12047F89033O9725k0777n144m880L2101L8138N556l8321n1517L1427J3634K1421
12035G80396J6374N3720M5185J1007r990K3409N4615M0441K913k9130J9238R272
12023A017450P93K3175J5330M9605L5905L034m0035K2573P3465J2357K3813N07
$$ plain form
12110 293560 283978 276930 286906 312311 311619 347408 352958 362207 366281 371512 389622 388327 379766 407615
12096 407615 409235 405925 402796 390539 409325 416188 432640 428708 423875 436523 464318 486635 493921
12083 493921 445644 451759 439604 429573 425023 421214 457773 490924 493766 477961 459119 472752
12071 472752 498064 516653 519600 539569 543206 559718 581013 602070 576907 568115 584733 597176
12059 597176 610163 603596 601283 580434 615632 640190 599011 560116 574403 598634 646708 689033
12047 689033 758758 737981 732837 727957 760058 798196 803752 765431 713914 745341 758975 780396
12035 780396 796770 850490 895675 906682 896692 920101 974716 1015157 1018070 988940 1008178 1017450
12023 1017450 1018243 1041418 1056748 1106353 1142258 1145292 1105257 1127830 1201295 1213652 1237465 1237972
12011A237972N5599L2004L3642K7588K9128N3378M2437M3622p888j8795N4284
12000A582971P3230J9524M0406N3281L6604K9779N6387K2603M9899L4762J8877
11989B018323O7295P8601M3044K6015Q2783O8754P8828N1819N5240P1591Q4987
11978B727280P7091J09949P0050Q8727O7543L6474O7638J07795J14676J24549
11968C591772J26101J22124J29039J15926J59357J34604J00186J50173J59477
11959D788759J47463J21356J67107J73078J99005K15114J81004K46121K26873
11950F465880K00622K44128K20021K47460K91798L03075K55768K62575K53071
11941H744398K38285K87745L41807L08385L43724L22916K92647K78891K99619
$$ plain form
12011 1237972 1293571 1325575 1359217 1386805 1415933 1469311 1511748 1555370 1547482 1528687 1582971
12000 1582971 1656201 1675725 1716131 1769412 1806016 1835795 1892182 1914785 1964684 1999446 2018323
11989 2018323 2085618 2164219 2207263 2233278 2316061 2384815 2463643 2515462 2570702 2642293 2727280
11978 2727280 2804371 2914320 2984370 3073097 3140640 3177114 3244752 3352547 3467223 3591772
11968 3591772 3717873 3839997 3969036 4084962 4244319 4378923 4479109 4629282 4788759
11959 4788759 4936222 5057578 5224685 5397763 5596768 5811882 5992886 6239007 6465880
11950 6465880 6666502 6910630 7130651 7378111 7669909 7972984 8228752 8491327 8744398
11941 8744398 8982683 9270428 9612235 9920620 10264344 10587260 10879907 11158798 11458417
11932A1458417K79205K91840L22776K85029K30690K81327K24859J63739J56082
11923A3693964J55405J20341J27211O5273l332J8016n2514n9230r2452j21288
11913A3851394j26285j32293j41397j85941k20633k22576k39756k65942k22741
11904A2093830k25978k46432k58676k70842l03735k54214k60685k69656l09357
11895I694255k48832k76630k18794j87372k79165l07979k49342k23323j74274
11886G528544j80786k05416j95773j74031j32226j56625j59021j86700k05583
11877E932383j77978j21679j45734j73081j57365q7081q7667j54696j45447q8363
11867D593292j15224j19691n7921p1762j37790j20206r1131j14152p1464o0071
$$ plain form
11932 11458417 11737622 12029462 12352238 12637267 12867957 13149284 13374143 13537882 13693964
11923 13693964 13849369 13969710 14096921 14162194 14158862 14176878 14124364 14065134 13972682 13851394
11913 13851394 13725109 13592816 13451419 13265478 13044845 12822269 12582513 12316571 12093830
11904 12093830 11867852 11621420 11362744 11091902 10788167 10533953 10273268 10003612 9694255
11895 9694255 9445423 9168793 8949999 8762627 8483462 8175483 7926141 7702818 7528544
11886 7528544 7347758 7142342 6946569 6772538 6640312 6483687 6324666 6137966 5932383
11877 5932383 5754405 5632726 5486992 5313911 5156546 5069465 4981798 4827102 4681655 4593292
11867 4593292 4478068 4358377 4300456 4228694 4090904 3970698 3879567 3765415 3693951 3633880
11857C633880q6358j15277j06156o3290p5986j15131n5098k015p4730p4703m3191
11846B821945o8399n8375l2375n2803n5680q7999j23760l9991m8012j6483J4099
11835B252167n1643m1318m5005o0807k9997l2468m7720o6891n1538m6261n1944
11824A726575j1947m4761l5517l308k0310n347m9161k7555m0196j7162O805m9483
11812A428633m4785k8647k4451P007p501r60l2173k409j1006k2365n5712m7392
11800A158239n0304j0883J819o328o4797l1160J7910k1707l4141l5620J8994K1242
11788I63264k5500n2234l9862k9209k6891Q607K5239K6945n0393k4568j7913L2488
11776G89973n089L480K576k3002j7538P814l0782l4146J5469k7760R77l2124m3039
$$ plain form
11857 3633880 3547522 3432245 3326089 3262799 3186813 3071682 3016584 3014569 2939839 2865136 2821945
11846 2821945 2753546 2695171 2662796 2609993 2554313 2466314 2342554 2302563 2254551 2238068 2252167
11835 2252167 2200524 2159206 2114201 2053394 2023397 1990929 1943209 1876318 1824780 1778519 1726575
11824 1726575 1714628 1669867 1634350 1631042 1610732 1605385 1556224 1528669 1488473 1471311 1478116 1428633
11812 1428633 1383848 1355201 1330750 1337757 1330256 1329296 1297123 1294714 1283708 1261343 1205631 1158239
11800 1158239 1107935 1097052 1098871 1092543 1027746 996586 1014496 992789 958648 923028 942022 963264
11788 963264 937764 885530 845668 816459 789568 798175 823414 850359 799966 775398 757485 789973
11776 789973 784884 788364 790940 767938 750400 758214 727432 693286 708755 680995 681972 649848 606809
11763F06809j9369j4394J0470N4155k2083l9210K5950k2045j7568j8944J0548
11752E54319K8989r900m2885J3114M9649O397k1409k3968j2822q823N418M5119
11740E83198k0921k3588q822j8706k5368l93K3473K9797l1838m9730J4948Q15
11728D72865m9028k9909o1506l4570P514M0975M1641L4979J9656q109l4288O901
11716D07121J3653L25n6744j5080J7788L0527j361n0000j1549J0049n533K3341
11704C62537m628l6623j0359j5438l2132Q988j1690j3896J4685N5132K3979j4833
11692C25722k422l0881l3897k7254J9885M4538J4973k8469J051K3259P854J4955
11680C29314r730l6995l6121m567j0429k1339J2415J0655L5558j5234k5218j1793
$$ plain form
11763 606809 587440 573046 583516 637671 615588 576378 602328 580283 562715 543771 554319
11752 554319 583308 573408 530523 543637 593286 599683 578274 554306 541484 532661 538079 583198
11740 583198 562277 538689 529867 511161 485793 485400 508873 538670 506832 457102 472050 472865
11728 472865 423837 393928 332422 297852 305366 346341 387982 422961 442617 434508 400220 407121
11716 407121 420774 421099 364355 349275 367063 397590 396229 346229 334680 344729 339196 362537
11704 362537 357909 321286 310927 295489 263357 272345 260655 246759 261444 316576 340555 325722
11692 325722 323300 292419 258522 231268 251153 295691 310664 282195 283246 306505 314359 329314
11680 329314 319584 282589 246468 241901 231472 210133 222548 233203 268761 253527 228309 216516
11668B16516R511O760j9024O435q879J6092J1037j6633L945J8926j4037M429j9051
11655B16027J8712Q435j1685l4022k5508j2408L5122M4789J4587n8436k8632J6668
11643A83649M2075M655k2885q497J310k2304l1231K705J6550l2697j3688j0184
11631A09458k7587K399J2636K8181L9036j2058j359N496K9055L084k9449o7494
11619I1398l8638M2706K1410J1692j467r559L9807k5512O774J324K1687M832j2112
11606A54342o290J8628l6891j8348J5067k0035q381q462j2652L9364J9105J3543
11594A48990M95K0179q180k2184P973r988J287J6330k4007j9670l0369k2186m59
11581E8211K6431K1824L3547j764k5463m784L6116p838l3011o2772J2617L2573
$$ plain form
11668 216516 226027 232787 213763 220198 211319 227411 238448 221815 225760 244686 230649 235078 216027
11655 216027 234739 243174 231489 197467 171959 159551 194673 239462 254049 195613 166981 183649
11643 183649 225724 230379 207494 198997 200307 178003 146772 149477 166027 133330 119642 109458
11631 109458 81871 84270 96906 125087 164123 152065 150706 156202 185257 188341 158892 91398
11619 91398 52760 95466 116876 128568 127101 117542 157349 131837 138611 139935 161622 166454 154342
11606 154342 148052 166680 129789 111441 126508 106473 98092 89630 76978 116342 135447 148990
11594 148990 149485 169664 161484 139300 147273 137285 138572 154902 130895 111225 80856 58670 58211
11581 58211 84642 106466 140013 138249 112786 108002 144118 136280 103269 40497 53114 85687
11569H5687l7217n5604L8343K7938j0295j592j5026j4987R638J5458Q649J3732
11557F4724k9040N630k150J0443J9853J64J2543J6181k8890l5820K2443K4076
11545H0157K5444p112l229J4388K8064l1984j1068l662j3759j1530k6050p050
11533C2609M4024K9378j1119j8603m038j74K976j0084k3989L2880l8512l5731
11521c83j720M2367L9851j6932L4037J3050l9078l5433l3037j7998L3356K7414
11509D5494J2189k3666J1086J0009j0975L532L6667k1179l8837j6620J0467J6522
11497C4689K2143M043j4026k3417n750K2122K3623O602J4208l2217k8150J7058
11485D0928K6279K0353n599n5565j8134O540L8077L4563m5312J2558L1235K952
$$ plain form
11569 85687 48470 -7134 31209 59147 48852 47260 32234 17247 26885 42343 50992 64724
11557 64724 35684 41314 39164 49607 69460 69624 82167 98348 69458 33638 56081 80157
11545 80157 105601 98489 95260 109648 137712 105728 94660 90998 77239 65709 39659 32609
11533 32609 76633 106011 94892 76289 72251 72077 75053 64969 40980 73860 35348 -383
11521 -383 -2103 40264 80115 63183 97220 110270 71192 35759 2722 -15276 18080 45494
11509 45494 57683 34017 45103 55112 44137 47669 84336 63157 24320 7700 18167 34689
11497 34689 56832 60875 46849 23432 17682 39804 63427 70029 84237 52020 23870 40928
11485 40928 67207 87560 81961 26396 8262 14802 52879 87442 42130 54688 85923 88875
11473H8875j7172N243K454n2720k5385R013K2664j7738m849N990k16o716n949
11460C494M80l0193M042K1243M0062K38k9672K2462M2720k2152K978k0945j3048
11447B1709N5733J5034o0245l7134M742p889K0011M7745j1584r978J7008m068
11435E1084J2627R934p186n7733m0990M9424J3949R730l446p816J455n738O307
11422C1601K6108K1695K4539O043p1696k5066j3950L6639J9191L2400J2218O751
11410A06473m395J1047p3116m0230n385l361M4121k412j7622k941N913k1270j8819
11397b1997M1320K9309k4351P41J3518o954n3172K6538J5129N5019j2838K1857
11385H4119K8653j7708l1907j9868m189o634p39k539Q047J2276j0458J3950r356
$$ plain form
11473 88875 71703 76946 79400 26680 1295 10308 32972 15234 10385 16375 16159 9443 3494
11460 3494 3974 -26219 -22177 -934 39128 39366 9694 32156 74876 52724 55702 34757 21709
11447 21709 77442 92476 32231 -4903 -161 -8050 11961 59706 48122 38144 55152 51084
11435 51084 63711 73645 66459 8726 -32264 17160 31109 40839 37393 29577 31032 25294 31601
11422 31601 57709 79404 103943 109986 38290 13224 -726 35913 55104 87504 99722 106473
11410 106473 102078 113125 40009 -221 -5606 -8967 35154 32742 15120 12179 18092 -3178 -21997
11397 -21997 19323 48632 24281 25022 38540 31586 -21586 4952 20081 75100 62262 84119
11385 84119 112772 95064 63157 43289 39100 32466 31727 29188 37235 49511 39053 53003 43647
11372D3647p893L541k3376O651J5177P573K7618K2801j6029k1581l0262J5515
11360D3382o151K3197K1323k1951m0893K0461L6894j7242n9615J9071J5640M753
11348C8869J1073P268L518j5300j7238P876L0657P457l7093m7007j1101k4092
11336d5113K7245M2952L7466o202m070K389o468J2608k7973o283m5504J357K0792
11323C196j2607j0090K1371m340Q587q825n4579J1501L8150k5426M7461Q3319
11311I7718n2766n5069p88l3744M9808K3630J2151j2470l1868j4692J8293K013
11299B216J7936j795k6503J5151L9522K4872N089r332O772N985j8277p205k0707
11286C3724P382j3245l2237J1278J8850K7023J9114j8368l6936N822J1500O374
$$ plain form
11372 43647 35754 39295 15919 22570 37747 45320 72938 95739 79710 58129 27867 43382
11360 43382 37231 60428 81751 59800 18907 39368 76262 59020 -595 18476 34116 38869
11348 38869 49942 57210 60728 45428 28190 36066 66723 74180 37087 -9920 -21021 -45113
11336 -45113 -17868 25084 62550 56348 52278 54667 48199 60807 32834 26551 -18953 -17596 3196
11323 3196 -9411 -19501 1870 -2470 6117 -2708 -57287 -45786 -7636 -33062 14399 97718
11311 97718 44952 -10117 -10905 -44649 5159 28789 40940 28470 -3398 -18090 203 2216
11299 2216 20152 18357 -8146 7005 46527 71399 76488 67156 73928 79913 61636 54431 33724
11286 33724 41106 27861 -4376 6902 25752 52775 71889 53521 16585 22407 33907 40281
11274D0281n3156j2876P929K4409k4124r831L0048j393m319k9378K4659K3029
11262A5278Q342p797L7171N2965l556n1583K674j6722k6988L4218J2902Q214J4490
11249G9608m5439l493j3516L200k455O859O41k2569P851j980j2464l0553J5723
11236a8587j883J8475l1685j1529J2479J3273J5760Q273j3499j0502j8933J9600
11224a8758j3850m718M3703j2695K7306J4511k1856J7305l3466J7234K3259m9115
11212a1140M589j2004J8608k376j0739k5304j1498l104j6913R499K6349L5942
11200A909K508m238Q094k3687j772N385M8517J2604m1721l0429j6246L6472N1139
11187D8535n3077l4178L2036M5583K9810J2791o0157o201L2531k5708l0476l638
$$ plain form
11274 40281 -12875 -25751 -17822 6587 -17537 -27368 2680 1287 -3032 -32410 -7751 15278
11262 15278 23620 15823 52994 105959 102403 50820 53494 36772 9784 44002 56904 65118 79608
11249 79608 34169 30676 17160 20360 17905 24764 25405 2836 10687 8707 -3757 -34310 -18587
11236 -18587 -20470 -1995 -33680 -45209 -32730 -19457 -3697 4576 -8923 -19425 -38358 -18758
11224 -18758 -32608 -37326 6377 -6318 20988 35499 13643 30948 -2518 14716 37975 -11140
11212 -11140 -6551 -18555 53 -2323 -13062 -38366 -49864 -52968 -69881 -60382 -34033 1909
11200 1909 4417 179 8273 -15414 -17186 -11801 36716 49320 7599 -22830 -39076 -2604 48535
11187 48535 -4542 -38720 -6684 38899 68709 81500 21343 15142 47673 21965 -8511 -12149
11175a2149M7052j295o0958j4906L3691J1524L6028K1607k6617j4567j7192M219
11163F437j3847J6966n517K1075P417j3061J7824J1997j2862L003J9951r353l5014
11150A5016m444M454K5683k1900l3538R538L738j9254j1422K5731J0229l6898
11138c3067M925O770M1803J8526j2684J7675J4576k4942j7894j8018j2884k8894
11126d4108K0481J3601O719Q396j4745j6383j6144M2582L2788j0919l4349l711
11114a5792M7888Q656l173j27K7847l8543k881k0072k0255L830k96J9214k1449
11101a5153n2166K6728L0034k3172J066k020J8718k5603K112j6201k2285j4852
11089i2794K8642M0982J4945M9607j4094l4635K8945K9963K164K8689L208k8090
$$ plain form
11175 -12149 34903 33608 -27350 -42256 -8565 2959 38987 60594 33977 19410 2218 6437
11163 6437 -7410 9556 4039 25114 32531 19470 37294 49291 36429 39432 59383 50030 15016
11150 15016 10572 15026 40709 18809 -14729 -5191 -1453 -20707 -32129 -6398 3831 -33067
11138 -33067 -28142 -21372 20431 38957 26273 43948 58524 33582 15688 -2330 -15214 -44108
11126 -44108 -23627 -10026 -3307 5089 -9656 -26039 -42183 399 33187 22268 -12081 -15792
11114 -15792 32096 40752 37579 37452 65299 26756 23875 3803 -16452 -12622 -12918 6296 -15153
11101 -15153 -67319 -40591 -10557 -33729 -32663 -34683 -15965 -41568 -39456 -55657 -77942 -92794
11089 -92794 -64152 -23170 -8225 41382 27288 -7347 21598 51561 53725 82414 85622 57532
11077E7532l8318m4114o48O3225j484l2267n5059k784K2503O2554P068l9304k2432
11064b3528K8346j4423J4894K0983j2092j1937k3926j2414k0586O02L3830O9049
11052D8798J0069j4904l8868k0234j8712n283M4889J9674P451O644k1086k2048
11040c610J9618N5476M546J1434j719l73l1300N051O1958j091j3554K1025K0102
11027A47563L6234N0185K9722k4498j3590j6086J44j1213p741N7455N4147K3910
11015C26232l8621J4410j7915K0742M1426k3703n3025J135l0013o899K2784J8488
11003B75041l965r105K0611K325n3630p8114m296K6207j7138p050K8126m2178
10991A36834m6187Q377J4826o325Q553j7055j5476j3116M198J4489q409l3048
$$ plain form
11077 57532 19214 -24900 -25548 37677 36193 3926 -51133 -53917 -31414 31140 38208 -1096 -23528
11064 -23528 4818 -9605 5289 26272 14180 2243 -21683 -34097 -54683 -54081 -20251 48798
11052 48798 58867 43963 5095 -15139 -33851 -39134 5755 25429 32880 39524 18438 -3610
11040 -3610 16008 71484 76030 87464 85745 85372 54072 59123 121081 119990 106436 127461 147563
11027 147563 183797 233982 263704 239206 225616 209530 209674 198461 190720 248175 302322 326232
11015 326232 287611 302021 284106 304848 346274 322571 269546 270681 240668 233769 256553 275041
11003 275041 271076 261971 282582 284907 231277 153163 148867 175074 157936 150886 179012 136834
10991 136834 90647 99024 113850 107525 116078 99023 83547 70431 74629 89118 80709 47661
10979D7661j2113j949N711Q015M508k860K3045N0712j9023l6040j0777k530Q952
10966F3312m4997P73K786K8563K9583M146Q664k6053k4337K7191O113j5943k9124
10953C0677j2321j0624p786K4112k024Q43j8872n284J3748J7606J2261l3581l4346
10940b5591j9545J1902M6170j1262l6446q145K694k4336j9916K7040K4332j1467
10928d4570n2374O605N6108M0707J8333l4455l3431L3814N2779j2973m0706j0362
10916b0525j0859K5645j5858M437K3424M1645k1338m0838J629p521m589M505M5593
10903B5350N987j5907l9446m1524K630M0996j7580l4734K6888j2681M592j9070
10891g4499j9312L1578N2073l577m103K5707L3555K1748l493L1464K9675k9245
$$ plain form
10979 47661 35548 33599 39310 47325 51833 48973 72018 122730 103707 67667 56890 54360 63312
10966 63312 18315 19088 21874 50437 80020 84166 92830 66777 42440 69631 75744 59801 30677
10953 30677 18356 7732 -54 24058 22034 22877 4005 -1279 12469 30075 42336 8755 -25591
10940 -25591 -45136 -33234 12936 1674 -34772 -42917 -40223 -64559 -84475 -57435 -33103 -44570
10928 -44570 -96944 -90339 -34231 6476 24809 -9646 -43077 -9263 43516 30543 -10163 -20525
10916 -20525 -31384 -5739 -21597 -17160 6264 47909 26571 -14267 -12638 -20159 -24748 -20243 25350
10903 25350 31337 15430 -24016 -65540 -62910 -21914 -39494 -74228 -47340 -60021 -55429 -74499
10891 -74499 -93811 -62233 -10160 -13737 -17840 7867 41422 63170 59677 91141 120816 91571
10879I1571j5396K6390N3822N5491J24183J84311K13200K11681J49795Q7866Q5543
10868A268457J06631Q1867m5549k07498l09546k48394j49754r1864p7727p5842
10858B50781l0627j2615J6294m3117j7672k1204J0316R914O126N761L648k7740
10846A49865l8235p340l1733L854P710J5118K9498J0994r749j5673m5438o477
10834F2394m224L1724K1076k0034j1186j812K7063J6585P76n0688o201M605r351
10821F0727K2336j9k1227k9600l0128m617L3673K2023k806q185J3372o621m044
10808D4884J8630L660q567l290k1976J9686j3008J0274l394l233k0809k5500Q851
10795F208J4842o035l2446k8843m966K7370J8397m944j4517J3654P0162L821n3157
$$ plain form
10879 91571 76175 102565 156387 211878 336061 520372 733572 945253 1095048 1182914 1268457
10868 1268457 1375088 1456955 1411406 1203908 894362 645968 496214 404350 326623 250781
10858 250781 220154 207539 223833 180716 163044 141840 152156 162070 168196 173957 177605 149865
10846 149865 111630 104290 72557 76411 84121 99239 128737 139731 129982 114309 68871 62394
10834 62394 58170 89894 110970 90936 79750 77938 105001 121586 122362 71674 65473 70078 60727
10821 60727 83063 83044 61817 32217 2089 -2528 31145 53168 50362 42177 55549 48928 44884
10808 44884 63514 67174 58607 55317 33341 53027 40019 50293 46899 43666 22857 -2643 6208
10795 6208 21050 15015 -17431 -46274 -51240 -23870 -5473 -10417 -24934 -11280 58882 62703 9546
10782I546m882K677m5795j9514R102n295J724l8305k6011k9885j4708K4610j0170
10769a46906l5792j3294J54j2680N3514L0524m135N4666J9554L8812K9571n1143
10757c7155P636N735j7137k7310K8462O570L397M3815K1858k7886J0007J7190
10745C5182k2543k6358p259l168M502k2518k2373J4898O122q203L4498K7421L4675
10732D4876k0540k9932N4828J7965l1509J8068J7708k1039K5003k447l2019K8357
10720F9319N4433K1448L8279N4820L8922k7001o4031p919K1978k5888l2424K2349
10708A64285J9081l7369J8419J5430m9565j2930L1969j2647l982j7740l4277K8570
10696A09244M6804Q778L9731K832L0599r950o6489K3287M3558L9119k3644l7660
$$ plain form
10782 9546 4664 7341 -38454 -57968 -48866 -54161 -52437 -90742 -116753 -146638 -161346 -136736 -146906
10769 -146906 -182698 -195992 -195838 -208518 -155004 -124480 -128615 -73949 -54395 -15583 13988 -37155
10757 -37155 -29519 -23784 -40921 -68231 -39769 -33199 -29802 14013 35871 7985 17992 35182
10745 35182 12639 -13719 -20978 -24146 -19644 -42162 -64535 -49637 -43515 -51718 -17220 10201 44876
10732 44876 24336 -5596 49232 67197 35688 53756 71464 50425 75428 72981 40962 69319
10720 69319 123752 145200 183479 238299 277221 250220 186189 178270 200248 174360 141936 164285
10708 164285 183366 145997 164416 179846 130281 117351 149320 136673 132691 114951 80674 109244
10696 109244 156048 164826 204557 207389 237988 228038 161549 184836 228394 267513 243869 206209
10684B06209l1224j7428k7392L9851M6676p410r074J58m753J720K1579N989j8045
10671B06856O371j3436j0777N1030r631n7831m2423m3458N3716J8223k7592q954
10659A22094L5072J7589r218k3294j8606L6616K1303M8122L4240k1784J8054q632
10647B51556J9003K3863q118j2416O0269N7021l3429q096M4106l243o709L5083
10635D18890P5138O5971M3146N7431M6714J01713J26923J05972J30539J37454
10625A309891J73405J79965J55627J95160K34477J67061K09338L03507N00669
10616C429100O83793Q78150J161338J469218J844088K079261K072429J897923
10608A5515300J708998J515056J356751J159728Q45415O13810Q77346J638943
$$ plain form
10684 206209 174985 157557 130165 170016 216692 209282 200208 200366 195613 197333 218912 224901 206856
10671 206856 213227 199791 189014 240044 230413 172582 130159 86701 140417 158640 131048 122094
10659 122094 157166 174755 165537 142243 123637 160253 181556 229678 263918 242134 260188 251556
10647 251556 270559 294422 286304 273888 334157 391178 357749 349653 393759 390516 383807 418890
10635 418890 494028 559999 603145 660576 707290 809003 935926 1041898 1172437 1309891
10625 1309891 1483296 1663261 1818888 2014048 2248525 2415586 2624924 2928431 3429100
10616 3429100 4112893 4991043 6152381 7621599 9465687 11544948 13617377 15515300
10608 15515300 17224298 18739354 20096105 21255833 22101248 22715058 23592404 25231347
10600B5231347K648501L317273L230028K756284K436057K214762J823774J106816
10592D4764842n5072r09287n94332Q28574K494881L455171L374017K638702K136115
10583E8133611J702043Q63835n64058k560194m119786m004764k502318p49969
10575D6198400L24120M88111K31595Q3960j18054o30678j673542l049915l989349
10566C7864648l823785k766092j724638r85929p13702o53939o62488p93230j121349
10557B4619496j626425k112237k476628k407481k022939j592957j187781r51629
10549A0241419p80029o16247n23258m61225l65421l12098l60845l39118k62636
10540F220542k41626j93715k28225k09201j97423j69180j85974j63851j36763
$$ plain form
10600 25231347 27879848 31197121 34427149 37183433 39619490 41834252 43658026 44764842
10592 44764842 44709770 43800483 43206151 44034725 46529606 49984777 53358794 55997496 58133611
10583 58133611 59835654 60699489 60135431 57575237 53455451 49450687 46948369 46198400
10575 46198400 46522520 47010631 47242226 47326186 47208132 46577454 44903912 41853997 37864648
10566 37864648 34040863 31274771 29550133 28564204 27850502 27196563 26534075 25740845 24619496
10557 24619496 22993071 20880834 18404206 15996725 13973786 12380829 11193048 10241419
10549 10241419 9461390 8845143 8321885 7860660 7495239 7183141 6822296 6483178 6220542
10540 6220542 5978916 5785201 5556976 5347775 5150352 4981172 4795198 4631347 4494584
10531D494584j16346r7819p9432r4806j22326j02075r6612q3432q6837p0365p9517
10520C465017r0699j00733l8683l8433l7454l4245j8951m0418q0416m8005j6890
10509B920090j5727n3941o4568k6223K4543O7633M9104N690L8047N1927O5878
10498C062453M2134O8549L1092J1768L1895J13081J05730J39278J82721J99179
10488C987880K86753L55705M98655N46185M59079M07882N19932O21669O57076
10479H340816O40749N28831N87672Q34756J242069J683750K099822K692946L440352
10470B2091763M597344O365181R009201J3381160K0734221L2049396M4715195
10463A52943461M6110931K6908895J1895471J5035676J7420853J0835694l405989
$$ plain form
10531 4494584 4378238 4280419 4200987 4106181 3983855 3881780 3785168 3701736 3614899 3544534 3465017
10520 3465017 3374318 3273585 3234902 3196469 3159015 3124770 3105819 3065401 2984985 2936980 2920090
10509 2920090 2904363 2850422 2785854 2759631 2784174 2851807 2900911 2906601 2944648 2996575 3062453
10498 3062453 3104587 3173136 3204228 3215996 3247891 3360972 3466702 3605980 3788701 3987880
10488 3987880 4274633 4630338 5128993 5675178 6134257 6542139 7062071 7683740 8340816
10479 8340816 8981565 9510396 10098068 10932824 12174893 13858643 15958465 18651411 22091763
10470 22091763 26689107 33054288 42063489 55444649 76178870 108228266 152943461
10463 152943461 199054392 225963287 237858758 252894434 270315287 281150981 277744992
10456B77744992l8400756o1004260m9156776l1581529j9961658j3158418r235961
10449E5245634o894011n310695m204974l517682k944103k501575k139375j818801
10441B5914418j450194j164949r86671r23317r16886q40971p55972p34726p06130
10432A7434602p90665q89247p89520p32421o39898n47111n45919m93158m58302
10423A1548361m85858m91773m08502l91378l90643l37968l03546k80246k83223
10414H175224k25417k40684k68486k45735k50125k54711k19862j84297j48258
10405F137649j92865j79509j71350j10217j17756j08108j19790j12648j67544
10396D857862j54261j44031j10005j21276j34397j31742j05437j34678j27166
$$ plain form
10456 277744992 239344236 178339976 129183200 97601671 77640013 64481595 55245634
10449 55245634 48351623 43040928 38835954 35318272 32374169 29872594 27733219 25914418
10441 25914418 24464224 23299275 22312604 21389287 20472401 19631430 18875458 18140732 17434602
10432 17434602 16643937 15754690 14965170 14232749 13592851 13045740 12499821 12006663 11548361
10423 11548361 11062503 10570730 10162228 9770850 9380207 9042239 8738693 8458447 8175224
10414 8175224 7949807 7709123 7440637 7194902 6944777 6690066 6470204 6285907 6137649
10405 6137649 5944784 5765275 5593925 5483708 5365952 5257844 5138054 5025406 4857862
10396 4857862 4703601 4559570 4449565 4328289 4193892 4062150 3956713 3822035 3694869
10387C694869j08909p7344o8770j00487j11113n8583p1071j28056r4569m4232
10377B831735p1543j02614o0586o7896q7569j01949r6779p1889j2542J2029l2936
10366B137461p3911m9714m1210n6307m1718r857k7636m5533k8485k5371j8606
10355A719113n2430l9487l7383j5058k8611j9633n9419j9588p842j7869l8630
10344A383163m5054j0594k7615m3762l4536m4523l7218j2500K4964J6899j1530
10333A157694j9668p60L9531K7314K3931o0794o3794n6586m6957k9700j7256n5242
10321H97713n307J4048j1017m0226l6744l2735k9575k1162j720m471l0423o6462
10309F31919m5471J552J4312l0705k9338k9506P983K7618p60j2629J4671K9215
$$ plain form
10387 3694869 3585960 3508616 3439846 3339359 3228246 3169663 3098592 2970536 2875967 2831735
10377 2831735 2760192 2657578 2596992 2529096 2441527 2339578 2242799 2170910 2158368 2170397 2137461
10366 2137461 2063550 2013836 1972626 1916319 1874601 1864744 1837108 1791575 1763090 1737719 1719113
10355 1719113 1666683 1627196 1589813 1574755 1546144 1526511 1467092 1447504 1439662 1421793 1383163
10344 1383163 1338109 1327515 1299900 1256138 1221602 1177079 1139861 1127361 1152325 1169224 1157694
10333 1157694 1138026 1137266 1176797 1204111 1228042 1167248 1103454 1046868 999911 970211 952955 897713
10321 897713 892406 906454 895437 855211 818467 785732 756157 734995 733275 728804 698381 631919
10309 631919 586448 588000 602312 571607 542269 512763 520746 548364 547604 534975 549646 578861
10297E78861j021j0511k3575m2290m335p427r340M023J4854j4152J2976k4370
10285D73693J8596k5550o458J2414j8025j8714l3673L3174K0847j266J4491l2807
10273D36722J2565k852j1097M917k3390L3331J2235j8918j5499K5260K0714j2413
10261D61575k245j7113R566l8141o1514j6383n698L6556o122k3075k7165l7691
10249B72550l6753J5392K0398n570j8419k0280M4763J8700M7116M7441O570n4685
10237C37223l5521k3074Q515j1294l4801N5930O254j5736R232o715J4298J7245
10225C21556m5062K0549k4358n0770n862L5427M205P865L2687m1785l7703q984
10213B07765k1540Q644M3733p740K8189J6574r040k5236j6590J2757j0162o9686
$$ plain form
10297 578861 577840 567329 543754 501464 497129 489702 480362 484385 499239 485087 498063 473693
10285 473693 492289 466739 460281 472695 454670 435956 402283 435457 456304 455038 469529 436722
10273 436722 449287 446435 435338 440255 416865 450196 462431 443513 428014 453274 473988 461575
10261 461575 459330 442217 451783 413642 352128 335745 330047 366603 360481 337406 310241 272550
10249 272550 235797 251189 271587 266017 247598 227318 272081 290781 337897 385338 391908 337223
10237 337223 301702 278628 287143 275849 241048 296978 303232 287496 296728 290013 304311 321556
10225 321556 276494 297043 272685 221915 216053 251480 255685 263550 296237 254452 216749 207765
10213 207765 186225 194869 238602 230862 259051 275625 266585 241349 224759 237516 227354 157668
10201A57668P086J9958J3731j4218j4791j6982j5487K27L547m7892K9624M9332
10189A71803o349L4922m120j4971M7507L7071n0696p2111R848J3737Q073J2859
10177A87573j0120Q961K4047M7847M6927l1107m2364J962o940J712J8340j0556
10165B36282m3708L2392N3783O2042n9283k9541P326K4754J0218M0787J5380J7081
10153C67513L1821o22K6192K9409L7689L0636O3381j2090j2552j7180k7094k0441
10141D96662l2020n925k5007K0468k8695m6520j5136l0296J8657N352k7789J6437
10129C46188P211o0511l5455k1821l0126j0824K0341M749J0201K2180P42K91K0490
10116B73656n4781k5682j1524j3373k6287J159J3812K8094l3394l1316M7245n521
$$ plain form
10201 157668 164754 184712 198443 184225 169434 152452 136965 137192 140739 92847 122471 171803
10189 171803 165454 200376 196256 181285 228792 265863 215167 143056 152904 166641 174714 187573
10177 187573 177453 186414 210461 258308 305235 274128 231764 233726 226786 228498 246838 236282
10165 236282 192574 224966 278749 340791 281508 251967 259293 284047 294265 335052 350432 367513
10153 367513 399334 398712 424904 454313 492002 522638 586019 573929 561377 544197 517103 496662
10141 496662 464642 458717 433710 454178 425483 378963 363827 333531 352188 357540 329751 346188
10129 346188 353399 292888 257433 235612 205486 194662 215003 219752 229953 252133 252875 253166 273656
10116 273656 218875 193193 181669 168296 142009 143168 156980 185074 151680 120364 167609 162088
10104A62088j2560j2463k1979l5344K7154L5349j6525k0234J2310p522J1276j5525
10092A06025r48k8287N887J6656L1994j0117k8565J4723O899l8481r321j1354
10080E5111j2775q988K5037L7168M4063K2168j4352K172k6976l6679J4684N2086
10068A52719P199k9617L3269N6543k7833o2431K0194L8587l856Q400Q091K6416
10056B27681L4872R527J3521O4986J01682J15289K01115K26808K19041Q6577N6083
10045A357182J08927R7672K2358p9428j99825k26861k22343k15554j50411j13008
10035C78709k4344k5287n2168l5460l1509k0476K3759M5640R275r160m8142l1800
10023A79037O394M057J8261j1219m1284N39M34K575L2657K1706l563j2461l9056
$$ plain form
10104 162088 149528 137065 115086 79742 106896 142245 125720 105486 117796 110274 121550 106025
10092 106025 105077 76790 82677 99333 131327 121210 92645 107368 114267 75786 66465 55111
10080 55111 42336 33348 58385 95553 139616 161784 147432 149604 122628 85949 100633 152719
10068 152719 159918 130301 163570 220113 192280 129849 150043 188630 184774 193174 201265 227681
10056 227681 262553 272080 285601 350587 452269 567558 768673 995481 1214522 1301099 1357182
10045 1357182 1466109 1563781 1586139 1506711 1306886 1080025 857682 642128 491717 378709
10035 378709 354365 329078 276910 241450 209941 189465 213224 258864 268139 258979 210837 179037
10023 179037 185431 189488 207749 196530 155246 155785 156219 158794 191451 213157 209594 197133 158077
10010A58077o1843m0590L4568J5667L3027L461n023j9003q487J1667O736M11j0384
9997A18284J063Q785L7258l6095l6958K8735J3928O954K9738n343j8091l5155
9985A13103k5583M6528N391k1707m279m4295j6106J2229L8930M3198J4637Q352
9973A70398j6947j2536l608J173l6793k5689k6934j072k3877J2654J0566n815
9961D1520Q24l6881J1854p90o250j4975O395L079L4397K497J8485j708o03k6750
9947C1094j985L0844M6380J3519J9686o099o0074k7953k7298k909K5019p576K8938
9934F1586M3196K6761j2805P669k075J282L6514j2208k4412l4085p5329r626J5620
9921B2088J717K5066K6201L3922J863K7986k5991n1350l0860K8908L5204M702
$$ plain form
10010 158077 96234 55644 90212 105879 138906 142367 137344 118341 109854 121521 128257 128668 118284
9997 118284 119347 128132 165390 129295 92337 121072 135000 141954 171692 166349 148258 113103
9985 113103 87520 134048 139439 117732 113453 69158 53052 65281 104211 147409 162046 170398
9973 170398 153451 140915 137307 138480 101687 75998 49064 47992 24115 36769 47335 41520
9961 41520 42344 5463 17317 16527 10277 -4698 1697 4776 39173 41670 60155 58447 57844 31094
9947 31094 29109 59953 106333 119852 139538 133439 73365 45412 18114 15205 40224 32648 61586
9934 61586 104782 131543 118738 126407 124332 125614 162128 149920 125508 91423 16094 6468 22088
9921 22088 23805 48871 75072 108994 110857 138843 112852 61502 30642 59550 94754 99456
9909I9456o6572p6275L6070Q2578J8207K665O278l3704J3172J5656j1297j3719
9897G2515L3095k628k1236J712k0019l814j0480k6171l997m3725j5433J0191M4813
9884A4823K0792J8115J7704k0947l0803J6189k0665k4136K08Q748J152L8957R193
9871D9330k9689L3265k4261m7013J0875j1558L9013L6901k8586j27j956L9397
9859F5591l1573L6K2597J8919l0141k10M4709J4378N480Q700j877k5975m4062
9846D6572k2493k0739k4214j2547L2396J7486J3553L9699N37m4821k6705j2686
9834a3962J4176J2162L1336L2137j1980O15P803R011J9119J3225o701K4098J3107
9821A44146n3328j4611L1139k4233j1464J4258l1972l2747m0155R854j3351J0560
$$ plain form
9909 99456 32884 -43391 -7321 75257 93464 96129 102407 68703 81875 97531 86234 72515
9897 72515 105610 102982 81746 83458 63439 59625 49145 22974 18977 -24748 -40181 -29990 14823
9884 14823 35615 53730 71434 50487 19684 35873 15208 -8928 -8720 28 1180 40137 49330
9871 49330 19641 52906 28645 -18368 -7493 -19051 19962 56863 28277 28150 26194 65591
9859 65591 34018 34054 56651 75570 45429 45219 89928 104306 109786 118486 116609 90634 46572
9846 46572 24079 3340 -20874 -33421 -1025 16461 30014 69713 70250 25429 -1276 -13962
9834 -13962 214 12376 43712 75849 63869 64484 72287 81298 100417 113642 106941 131039 144146
9821 144146 90818 76207 107346 83113 71649 85907 53935 21188 -18967 -9113 -22464 -11904
9809a1904K8981m243N25o129n902N523k1938q665L0614L2917P269l8030L310O0964
9795G3292J5873p202j5405m475k0424O383J9883J4679L0567L3240k8798n294n37
9782A11782o5530l6834L3746J6514l3313K3984J1122K683K65m1051m4809K3039
9770A598J0709N58N726K4864L0245l417n0759j8144j874m736N0664J3637l1979
9757B7092l0069p092k2898p427J9546M1743l2024j803M1497k7770J5214M7533
9745F3542L7227R493Ql2226j9534n756L8715n153k6455o998k3757J9218j3879
9732C4445j4349O2032k760l7697j3565K343j4023o873J8757k1980n0531o0827
9720a05028N4392N6838o438j2590K3883r984N228L661j9543L5775Q133J6080K1505
$$ plain form
9809 -11904 17077 12834 13359 7230 1328 6851 -15087 -23752 6862 39779 47048 9018 12328 73292
9795 73292 89165 81963 66558 62083 41659 48042 67925 82604 113171 146411 117613 112319 111782
9782 111782 46252 9418 43164 59678 26365 50349 61471 64154 64419 23368 -21441 1598
9770 1598 12307 12865 18591 43455 73700 70283 19524 1380 -494 -5230 45434 59071 27092
9757 27092 -2977 -10069 -32967 -40394 -20848 20895 -11129 -12932 28565 795 16009 63542
9745 63542 100769 110262 110270 78044 58510 52754 91469 86316 59861 52863 29106 48324 34445
9732 34445 20096 82128 79368 41671 28106 30449 16426 9553 28310 6330 -44201 -105028
9720 -105028 -50636 6202 -236 -12826 11057 1073 6301 9962 -9581 26194 34327 50407 71912
9707G1912O941J7923N176n7456L0600K0629o049k8530J9609m415o789l1807p703
9694C0041j476Q740L4792k100k0460K3361J9066k5531q269L882L8296l7931k2686
9681C9725n313m1119k8323j8269q252M6975J0208M4339J5304M99J4611J0776m7379
9668C3782l299K4286L4573k2181l9320j3434L9892L623k887n894L100J7998j4262
9655E5977j8780n696K5860j349j4926K4810R32q329l0525J5205J1818K2823J7500
9642I5320R474k5269m3347n2692J3662J0868j54j4660m403j9397Q840K2489M482
9629E213K0103J8409P460l2226M902K0873j1129k8768q020K3966J6874K5942P108
9616G0707k5812l0388J6887O421r632k3260o0133J8361M8528M26Q458m487j599
$$ plain form
9707 71912 78853 96776 101952 44496 75096 95725 89676 61146 80755 76340 69551 37744 30041
9694 30041 28565 37305 72097 69997 49537 72898 91964 66433 58164 62046 100342 62411 39725
9681 39725 34412 -6707 -35030 -53299 -61551 -14576 -4368 39971 55275 55774 70385 81161 33782
9668 33782 30483 54769 89342 67161 27841 14407 54299 57922 55035 49141 52241 70239 55977
9655 55977 37197 31501 57361 56012 41086 65896 66828 58499 27974 43179 54997 77820 95320
9642 95320 104794 79525 36178 -16514 -2852 8016 7862 -6798 -11201 -30598 -21758 731 5213
9629 5213 25316 43725 51185 18959 23861 44734 33605 4837 -3183 20783 37657 63599 70707
9616 70707 44895 14507 31394 37815 28183 4923 -55210 -36849 11679 12105 20563 16076 14477
9603A4477m348J3041q70K9588N517l944L1587M32m1602m2988J369M3729L2595
9590G8583J5464j3605o735l4772k1784k2147m647k83k4907N66K0884J1021K4341
9577B1979K2674J7390j3613m0889l2785m949J5044j0392L2229Q385n974J3295
9565B2394K106j6062n0341N979K5216J9905M6000K7882k1077k8457l7246j776
9553e477l3454k9272J0971L7566m904K7686L6654K2023m9345m5439K9828K639
9541e24k0726l9740K3681J7674Q877J1943m1313j3720K6694M5068K1339R806l5529
9528A3530j6988K6856k5469J7558M1751j3661k1422J2713M2459l1206p4471k4910
9516e3260M463Q0760L6079K3337J3887J1726k2951m7167k9961j0083L6209J8095
$$ plain form
9603 14477 10129 23170 22300 51888 57405 53461 85048 85480 43878 890 2259 45988 78583
9590 78583 94047 80442 73707 38935 17151 -4996 -9643 -9926 -34833 -34267 -13383 -2362 21979
9577 21979 44653 62043 48430 7541 -25244 -30193 -15149 -25541 6688 15073 9099 22394
9565 22394 24500 8438 -41903 -35924 -10708 9197 55197 83079 62002 33545 -3701 -5477
9553 -5477 -38931 -68203 -57232 -19666 -24570 3116 39770 61793 12448 -32991 -3163 -524
9541 -524 -21250 -60990 -37309 -19635 -10758 1185 -40128 -53848 -27154 17914 39253 49059 13530
9528 13530 -3458 23398 -2071 15487 57238 43577 22155 34868 77327 46121 -28350 -53260
9516 -53260 -48797 31963 68042 91379 105266 116992 94041 46874 16913 6830 43039 61134
9504F1134p280j9181Q926k1843l0854L6627M0922L9428j056j7842l1866n2988
9492D127j5053m206j5234J4922K6194J3764J3805k2226k795K4989j2799k8131
9480b643J982K305j2956j8449p569J3133L3785j1802o157K0582M715j4321L6771
9467C9376L1436L820m3274l009j2090k3477j8687J9008J9130L969J8531K0554
9455E5287l3588k2681k3019j9263L5215l604K7999M4851K757N351J2537m875j4160
9442F2807K7381j1898j9132j6147J4320o952m0022k0932K9768J5971r387K4596
9430E0373m5861k2553J1054L8947j1423K5503K2260j7809l6467k6530m3650L49
9418e5807M3651J7075k1830j48m2864L0727L6747l2085J9985R414m407l9868J8110
$$ plain form
9504 61134 53854 34673 43599 21756 -9098 27529 68451 107879 106823 88981 57115 4127
9492 4127 -10926 -15132 -30366 -15444 10750 24514 38319 16093 13298 38287 25488 -2643
9480 -2643 -661 1644 -11312 -29761 -37330 -24197 9588 -2214 -8371 12211 16926 2605 39376
9467 39376 70812 74632 31358 28349 16259 -7218 -25905 -6897 12233 16202 34733 55287
9455 55287 21699 -982 -24001 -43264 -8049 -11653 16346 61197 63954 69305 81842 76967 62807
9442 62807 90188 78290 59158 43011 57331 50379 10357 -10575 19193 35164 25777 50373
9430 50373 4512 -18041 -6987 31960 20537 46040 68300 50491 14024 -12506 -56156 -55807
9418 -55807 -12156 4919 -16911 -17059 -59923 -29196 7551 -24534 -4549 4865 458 -39410 -21300
9405b1300L372J8822L7020R822k7899k8384o561O170m49L4096L2712J5119m898
9392F7642j548k5889l3111j0736j5078j7070P959N3768P23j556k3219j3961K545
9379i531J1501j4306J1709K2871J5021L0439l1369n5000j8751k982j0337K617
9367d8118L4213k3076j4423M1607R873k1113K0849P307M372j5131M9005K1203
9355F6568m0788m0910k0632K0988j8175J6393J2737R370o145K5155N1446j5154
9343F0853o868l9210k2468J7565O771N174k0139K5686q101j4112J6900j4142m25
9330G484J5938l396j6658l7249M33P371N877Q300j4594K4538N721J6690J275R952
9316C1682J4208n909j0124j1519o045j4703K1167J1355K2791j2258o3266J230
$$ plain form
9405 -21300 -17928 894 37914 47736 19837 -8547 -15108 -8938 -9387 24709 57421 72540 67642
9392 67642 66094 40205 7094 -3642 -18720 -35790 -27831 25937 26660 25104 1885 -12076 -9531
9379 -9531 1970 -12336 -627 22244 37265 67704 36335 -18665 -37416 -40398 -50735 -48118
9367 -48118 -13905 -36981 -51404 -9797 76 -21037 -188 7119 11491 -3640 45365 66568
9355 66568 25780 -15130 -35762 -14774 -32949 -16556 -3819 5551 -594 24561 76007 60853
9343 60853 53985 14775 -7693 9872 16643 21817 1678 27364 19263 5151 22051 7909 7484
9330 7484 23422 20026 3368 -33881 -33448 -26077 -20200 -11900 -26494 -1956 3765 20455 21730 31682
9316 31682 45890 39981 29857 18338 12293 -2410 18757 30112 52903 40645 -22621 -21391
9304b1391r952L910P9K0169J7032K6445q504j0020o667O3512M5847q37l5335l5280
9290D9008N474l745M421j4623l3452M324J5228j4366p471q264k093O492K5119
9277B6052J7591m1409l9496l016K9348J4183j776M4730j5400j1702k219k5665
9265h779k9803k2978J9428J2895M370j3772k428l142n732K9281J6509J9514K1916
9252C7279j0016l3699j2092M2090J2842q355J0888P825P721j3624L4759j5410
9240F0208k6066J9307K6406j0057j486J0652Q735m270l9059K0234k0582L783k2010
9227B5795m8229n633K7959K2353R628j0351K2966J2193J7373j5947m1957J9351
9215C5501j8131M337j470p316j0494M4962J2865L509k3121k5954j392k6536K5899
$$ plain form
9304 -21391 -31343 -27433 -27354 -7185 9847 36292 27788 17768 11101 74613 120460 119623 84288 49008
9290 49008 54482 50737 55158 40535 7083 11407 26635 12269 4798 -3466 -5559 933 26052
9277 26052 43643 2234 -37262 -40278 -10930 3253 1477 46207 30807 19105 16886 -8779
9265 -8779 -38582 -61560 -42132 -29237 -24867 -38639 -41067 -44209 -49941 -20660 -4151 15363 37279
9252 37279 27263 -6436 -18528 23562 36404 28049 38937 46762 54483 40859 75618 60208
9240 60208 34142 53449 79855 69798 68312 78964 87699 83429 44370 64604 44022 47805 25795
9227 25795 -22434 -28067 -108 22245 31873 21522 44488 56681 74054 58107 16150 35501
9215 35501 17370 21707 20237 12921 2427 47389 60254 63763 40642 14688 13296 -13240 12659
9202A2659M0532j1191l6898m0288l5105K0599O1528K6541L1428k0456L008k6115
9190B6242j8089k6018o94K0113L1691j5984l8020l7430J1680l1455J7077L2801
9178b8086N918J9015q780Q175r867M4938p867J256J1756k727k312j2210P679l7827
9164a0939m1897O422R274k6835l8634R302L8696N3236J2892P725n219J4780P644
9151C6447j8349M0870n826K7301N0140k1146k5388m3624r16l1618k8994J0952
9139a0151j6232j5176Q330J4474k8974J3630N6713j5746k7131j8081m324J9388
9127b3280L3838J7471j3795k4103O157K6156J5556J2277L0430k6760m1343M529
9115A7133j2560M0202O476j4567L6402j5421P368m0518j4641K4573K3154J946
$$ plain form
9202 12659 53191 42000 5102 -35186 -70291 -49692 11836 38377 69805 49349 52357 26242
9190 26242 8153 -17865 -18559 1554 33245 17261 -20759 -58189 -46509 -77964 -60887 -28086
9178 -28086 -22168 -3153 -11933 -3758 -13625 31313 23446 24702 36458 33731 31419 19209 26888 -10939
9164 -10939 -52836 -46414 -37140 -63975 -102609 -93307 -54611 -1375 11517 19242 14023 28803 36447
9151 36447 18098 58968 53142 80443 130583 109437 84049 40425 39509 7891 -21103 -10151
9139 -10151 -26383 -41559 -33229 -18755 -47729 -34099 22614 6868 -20263 -38344 -42668 -23280
9127 -23280 10558 28029 14234 -9869 -3712 22444 38000 50277 80707 53947 12604 17133
9115 17133 4573 44775 51251 36684 73086 57665 65033 24515 9874 34447 57601 59547
9103E9547L0977l187m0339m5525l0192k6369J5501L6560L82j9783l9813J7854
9091d4387k0497K3603L896K0849L9479K2667j233q710K7932l02J0188k6094J475
9078D8866n2182k984O1892R525j1206K05J6061n760J3182Q31L130n704l3943O974
9064D8887P330j6013j4578n7358K0498L4156K415l2795r644L2865O7490P939p4643
9051A6549J5159K102j577l392L335k2737l8272n2979K1971L4454J8268N737j3946
9038a5328R276K2021J2182j0609j6547j6165L9565l2039j2180J3461k9801K0178
9026a5986L0082K0568j8526J3903M446O90l9966m3961N0294M0883o106L568m8268
9013h379L958J7286k4429r370N2980k4527j4155M025L5412k234Q614J528k0353
$$ plain form
9103 59547 90524 87337 46998 1473 -28719 -55088 -39587 -3027 -2645 -22428 -62241 -44387
9091 -44387 -64884 -41281 -37385 -16536 22943 45610 44377 35667 63599 63297 73485 47391 48866
9078 48866 -3316 -6300 55592 65117 53911 54116 70177 64417 77599 78430 81560 75856 41913 48887
9064 48887 56217 40204 25626 -31732 -11234 22922 25337 -7458 -17102 15763 83253 91192 16549
9051 16549 31708 33810 32233 28841 32176 9439 -28833 -81812 -59841 -25387 -7119 -1382 -15328
9038 -15328 -6052 15969 28151 17542 995 -15170 24395 -7644 -19824 -6363 -36164 -15986
9026 -15986 14096 34664 16138 30041 34487 35177 -4789 -48750 1544 42427 36321 39889 -8379
9013 -8379 -4421 12865 -11564 -20934 32046 7519 -6636 -2611 32801 30567 39181 40709 20356
9000B0356m0121k4783j8506o848j2436J5349M5189K6851j2905k7442J3258O103
8988a5935L834j3178j9201Q679K0425l0110k8799J9093J8648K2198L1328j8131
8976a149l0740l2212k7275K5729L3613J3447K7407j3208l4650q001J571O2537
8964A7069L1023m0405J4772k3627J5567j2599l3175K1732L2923R426J2502j407
8952D3801O863K553M2789M908m6860N731N614m1339k2221M6280K2069l9974j1240
8939A8974j0542K7129N553J0180N718r040K2910P836J795k4794j4936j4158l7348
8926a0723j8700O7657M1171k0223l1532P758p714Q88k9496j1078q3293j8580L0955
8913h2910J750L7309K6876L7735P640j0165m4045K451j529L8245L6101m9105l1098
$$ plain form
9000 20356 -19765 -44548 -63054 -69902 -82338 -66989 -21800 5051 -7854 -35296 -22038 -15935
8988 -15935 -12101 -25279 -44480 -35801 -15376 -45486 -74285 -55192 -36544 -14346 16982 -1149
8976 -1149 -31889 -64101 -91376 -65647 -32034 -18587 8820 -4388 -39038 -47039 -45468 17069
8964 17069 48092 7687 22459 -1168 14399 1800 -31375 -9643 23280 32706 45208 43801
8952 43801 50664 53217 96006 100914 54054 59785 65399 24060 1839 48119 70188 30214 18974
8939 18974 8432 35561 41114 51294 57012 47972 70882 78718 80513 55719 40783 26625 -10723
8926 -10723 -29423 38234 79405 59182 27650 35408 27694 28582 -914 -11992 -95285 -113865 -82910
8913 -82910 -81160 -43851 -16975 20760 28400 18235 -25810 -23359 -24888 13357 49458 353 -30745
8900c0745p640J664K1111P785k7250M55l36j129N946J2495M6767J1372K4200K1672
8886H6367k9201k9901o7381k1843N5534L0223j3386R28J2968K2174m0911o630
8874a059K2966M044L0218m537l3492l3560o019K5287L4160J7272n6521R93J5814
8861A5566L6585J3855m0361j8556o19j6394k910l057o060j5910o313M1907L2334
8848C0067P980J1386J0268K5998l1505l1065l12L2754o129O195K3644l4859l5673
8835H749M107K3635l8209j165K1371k0528l1915J6020k1936J4036J9482J0243
8823C890N0651J3982k6062m594p190j8216m859j5024l4289j5835j1517M2413L7010
8810A0360l847r268k7903l5042J0740K2336L1964k8149K617k002N040P83J3873
$$ plain form
8900 -30745 -38385 -36721 -15610 -7825 -35075 -34620 -34956 -36085 -30139 -17644 29123 40495 64695 86367
8886 86367 57166 27265 -40116 -61959 -6425 23798 10412 11340 24308 46482 5571 -1059
8874 -1059 21907 25951 56169 51632 18140 -15420 -21439 3848 38008 55280 -1241 -248 15566
8861 15566 52151 66006 25645 7089 6470 -9924 -12834 -15891 -21951 -37861 -44174 -2267 30067
8848 30067 38047 49433 59701 85699 54194 23129 22817 55571 49442 55637 79281 44422 8749
8835 8749 12856 36491 -1718 -2883 18488 -2040 -33955 -17935 -39871 -25835 -6353 3890
8823 3890 54541 68523 42461 37867 30677 12461 7602 -7422 -41711 -57546 -69063 -26650 10360
8810 10360 6513 -2755 -30658 -65700 -54960 -32624 -660 -28809 -26192 -28194 -23154 -22371 -8498
8797h498k904m613j6424l7222M597K5884L2289M048K3038M1360p91n2685k3083
8784a5004J1950j4890p364k1573Q078M1435J5490L4004l3471k87k172j342n2201
8771c7347j3057M9081N1666j5502P886j6679J744K7288J8933k1270R466J9057
8759H1266J5126n4814n1276l2912J207M7136J5875j6337j7307k9965j3238L4757
8747b0482K3869p695j0690J3948j3878M589j2886L3020k141q184l079L3010n4526
8734b5125j6184N696r213K877K2992L6534K7353j2434p4907o152L7351K9756L2612
8721E1156n8810P786K8525j4889j0474L1612P58o081j7279k2700l0979j196L4587
8708g984k0650j8525M9600l356k4596n0771l5444K0580Q640N8016m18j7240K0831
$$ plain form
8797 -8498 -11402 -16015 -32439 -69661 -65064 -39180 -6891 -2843 20195 61555 60764 8079 -15004
8784 -15004 -3054 -17944 -25308 -46881 -38803 2632 18122 52126 18655 18368 16196 14854 -37347
8771 -37347 -50404 -1323 50343 34841 42727 26048 27792 55080 74013 52743 62209 81266
8759 81266 96392 41578 -9698 -42610 -41403 5733 21608 5271 -12036 -42001 -55239 -20482
8747 -20482 3387 -4308 -14998 -1050 -14928 -10339 -23225 9795 7654 -530 -3609 29401 -25125
8734 -25125 -41309 -35613 -44826 -41949 -18957 17577 44930 32496 -42411 -48563 -11212 18544 51156
8721 51156 -7654 132 28657 13768 3294 34906 35664 29583 12304 -10396 -41375 -42571 -7984
8708 -7984 -28634 -47159 2441 -915 -25511 -76282 -111726 -91146 -82506 -24490 -24908 -42148 -21317
8695b1317J5604j4271l8603p43J8519J4851J5470j3255m6363r342N7950J6580
8683d920K2239P917J298j3926r30K1917K9655k5222j0655k0478k6969j8435L770
8670c4739L9431j4116j6632l3941O063k463J2681O6574P269P107l5688n6050j1927
8657f6431k798j2142K2620M2149m329k048j3962L4302J5797J4601L322l428K9705
8644E7358j5681j7906j2623J908J3247l9283J2459P9138N8875r616o4350l1328
8632C2198l4835l9486J1986K47m1302L8460M1251K0713n422M379J8342j3616j7040
8619A5875k7477k3459K3123J6322k003r118j4936j1181k5252Q027J0747M1640
8607B308j4034O703O0440P532n250l7056j5358K8092M1887k3189l3334K4017J6543
$$ plain form
8695 -21317 -5713 -19984 -58587 -59330 -40811 -25960 -10490 -23745 -70108 -79450 -21500 -4920
8683 -4920 17319 25236 26534 12608 11678 33595 63250 38028 27373 6895 -20074 -38509 -34739
8670 -34739 4692 -9424 -26056 -59997 -53934 -56397 -43716 22858 30127 37234 1546 -54504 -66431
8657 -66431 -69229 -81371 -58751 -16602 -20931 -22979 -36941 -2639 13158 27759 31081 27653 57358
8644 57358 41677 23771 11148 13056 26303 -12980 -521 78617 137492 127876 63526 32198
8632 32198 -2637 -42123 -30137 -29890 -71192 -32732 8519 29232 23810 28189 46531 32915 15875
8619 15875 -11602 -35061 -11938 4384 2381 -6737 -21673 -32854 -58106 -50079 -39332 2308
8607 2308 -11726 -5023 55417 62949 57699 20643 5285 33377 75264 52075 18741 42758 59301
8594E9301J7423J236j8450J66L3802K3750r16k9135l3627j6408N0357j4034p8771
8581e306k3214J2526M6312k57j5525J0137M2556K4309K3952O823K434l737o787
8568A14223j2154k7529q805j2701k797L3893j4554l4308k6723r733L6397j3008
8556B2201J2608N555K5188L2402n6486l4452L1021J8237J526l7610l3111r676
8544b2597K9146J0802m3975n635n2865K2997N2746N4020K7395l9721p900k116
8532B2297j6060k2731K1610L4610J9287j8896J9806n786p27Q569L2336k2213k3179
8519D8923K3602q143j2291M62p1337o5093J4942N0041K1096l97m815K3162j0970
8506I182j2883k0826J8849J3063L5654R463j1653n9431l0838K1010j6552j8094
$$ plain form
8594 59301 76724 77960 59510 59676 93478 117228 116312 87177 53550 37142 87499 73465 -5306
8581 -5306 -28520 -15994 30318 30061 14536 24673 67229 91538 115490 122313 124747 121010 114223
8568 114223 102069 74540 65735 53034 50237 84130 69576 35268 8545 -1188 35209 22201
8556 22201 34809 40364 65552 97954 41468 7016 38037 56274 57800 20190 -12921 -22597
8544 -22597 6549 17351 -26624 -32259 -85124 -62127 -9381 44639 72034 32313 24413 22297
8532 22297 6237 -16494 5116 39726 59013 40117 59923 54137 53410 61979 94315 72102 48923
8519 48923 72525 64382 52091 52553 -18784 -83877 -68935 -18894 2202 1805 -3010 20152 9182
8506 9182 -3701 -24527 -5678 7385 43039 52502 40849 -18582 -49420 -28410 -44962 -63056
8494f3056k5001J3165j8353L5261J0066k3412L5288K4998L3109k2313l3255K1817
8482a1686K241K4442K6862Q434m978j5004O497J8991k7128n0900j8433L1454J3296
8469D088J1670M5702l738j5802J4k6414j8607m320n383Q510l2390j4192J5352
8456c5510L1813L9012J7856n3555J4118O859J2711q157N274O731j3234m4631K0847
8443A34l5777J4368j2458l468L7271L0230p125k1160k4440J4163O4089K5457Q301
8430H9585N896J6479k7231m4367l9189n59O702j0652p368P292J6127L0660m113
8417C9262j6028J8055M3677r343k2529l7485J2157J4749N756j5526l4323L8434
8405C6856K2613j3240p7829Q930K1370j0442p691M3055j0676l0321k862m0984
$$ plain form
8494 -63056 -88057 -74892 -93245 -57984 -47918 -71330 -36042 -11044 22065 -248 -33503 -11686
8482 -11686 -9445 14997 41859 50293 45315 30311 36808 55799 28671 -22229 -40662 -9208 4088
8469 4088 15758 61460 57722 41920 41934 15520 -3087 -7407 -12790 -4280 -36670 -50862 -35510
8456 -35510 -3697 35315 53171 -384 13734 20593 33304 25147 30421 37152 23918 -20713 134
8443 134 -35643 -21275 -33733 -37201 70 30300 23175 2015 -22425 -8262 55827 81284 89585
8430 89585 95481 111960 84729 40362 1173 614 7316 -3336 -10704 -3412 12715 43375 39262
8417 39262 23234 41289 84966 75623 53094 15609 27766 42515 48271 32745 -1578 36856
8405 36856 59469 46229 -31600 -22670 -1300 -11742 -19433 23622 12946 -17375 -20237 -61221
8393f1221M67M7291j549O446j2407k7743l9464N178K5452L7420N882o473L05K1481
8379A065j2632K0254J6328j9201J8695L4299o218m4662m5756p544m256J1031J68
8366c8429K4300L5615j6400j3037o449K8742N6638k2820j7553k9264k8439K2436
8354d660J9588l033j647j0836j6946Q114J1538j6169j097M1867J4938j5573l7025
8341a0941J8795M0322L6974l7437m4764J30j8159l5606J1023J4208J1760M6303
8329C2608j7680L1557J8687j9761j5230k3257l925J0080M0314J7418j0795j7360
8317D2656p692j1553L2772K4009j2177m1014j1449j7416m972k7114q54Q254j6993
8304d3543M8660M8798r4j3596j8185l9560p284l8323L8285L6970k74K7826J5255
$$ plain form
8393 -61221 -60754 -13463 -15012 -8566 -20973 -48716 -88180 -83002 -57550 -20130 -14248 -20721 -20416 1065
8379 1065 -11567 8687 25015 5814 24509 58808 52590 7928 -37828 -45372 -49628 -38597 -38429
8366 -38429 -14129 21486 5086 -7951 -14400 14342 70980 48160 30607 1343 -27096 -4660
8354 -4660 14928 11895 10248 -588 -17534 -9420 2118 -14051 -15148 26719 41657 26084 -10941
8341 -10941 7854 48176 85150 47713 2949 3079 -15080 -50686 -39663 -25455 -13695 32608
8329 32608 14928 46485 65172 45411 30181 6924 2999 13079 53393 70811 60016 42656
8317 42656 34964 23411 56183 80192 68015 27001 15552 -1864 -6836 -33950 -34804 -26550 -43543
8304 -43543 5117 53915 53821 40225 22040 -17520 -24804 -63127 -24842 12128 11854 39680 54935
8291E4935m5079m0950K5652M8417P470q239r268j4710N978k9916J8396K9168K20
8278D2074j8974k2075l0468N167m25L8703r251m0197J2950L2249j662r045J1328
8265A0374r783J4497J1531k909K6084k4779m2551K5768K9816J2807j5905J0329
8253D5279j5028n1879j1459o496j7725O930k956L8246N2152P081l379L141m0221
8240C686m3473j565j141K4133j4891l361P224J7285P507j9726J7160K8599m417
8227A7020J102j5572k1941J489K996n0108m4001K0994O0038J2402K537J7028j1436
8214g452j015k7552L699L8961J1617o3866J0380M1429R680j9135L053k8798j1990
8201d0989M4600J4875J9171K1368K8902j6155m3247l7754k3041R622N960k6020
$$ plain form
8291 54935 9856 -31094 -5442 42975 50445 42206 32938 18228 24206 -5710 12686 41854 42074
8278 42074 23100 1025 -29443 -24276 -24701 14002 4751 -35446 -22496 9753 8091 -954 10374
8265 10374 591 15088 26619 23710 49794 25015 -17536 8232 38048 50855 34950 45279
8253 45279 30251 -21628 -33087 -39583 -57308 -50378 -53334 -15088 37064 44145 40766 43907 3686
8240 3686 -39787 -41352 -42493 -18360 -33251 -36612 -29388 -12103 -4596 -24322 -7162 21437 17020
8227 17020 18122 2550 -19391 -17902 -14906 -65014 -109015 -88021 -27983 -15581 -13044 3984 -7452
8214 -7452 -8467 -36019 -32320 6641 18258 -45608 -35228 6201 15881 -3254 -201 -28999 -40989
8201 -40989 3611 18486 37657 59025 87927 71772 28525 -9229 -32270 -22648 -16688 -42708
8189d2708K8770N6794R474j6386k3884p3792K4840L0695l9985K6824K6251j9891
8177a2998k4424o829n542j3511J4882j5322K5925L3901M2980j0647k2665l549
8165B201P737K293l82l7402m7817m4043l264M2160L8633L0822K1728J9503j1771
8152B0398l9844P49K0131k3765M1686L6850k6963j3466j1555Q590n3910l5302
8140g6401K34L7091M6700k83K342j5194J3257O366Q530o398j6165j750J5240N182
8126A8751k224L693p460K3417k1298l3418l18O7073J2180j4370r268k6322O157
8113A6593j8022m4578J3979K1991J9209M463K2908J3664j0237N646L0849m4751
8101C1714k7888N857j0296J5l1943K4497L097J4713N0891q22l8523k2508p900
$$ plain form
8189 -42708 -13938 42856 52330 35944 12060 -61732 -36892 -6197 -46182 -19358 6893 -12998
8177 -12998 -37422 -44251 -49793 -63304 -48422 -63744 -37819 -3918 39062 28415 5750 2201
8165 2201 9938 12231 11849 -25553 -73370 -117413 -120677 -78517 -39884 -9062 12666 32169 20398
8152 20398 -19446 -18697 1434 -22331 19355 56205 29242 15776 4221 12811 -41099 -76401
8140 -76401 -76167 -39076 7624 7341 9683 -5511 7746 14112 22642 16244 79 -1671 13569 18751
8126 18751 16527 20220 12760 36177 14879 -18539 -18857 48216 60396 46026 36758 10436 16593
8113 16593 -1429 -46007 -32028 -10037 9172 13635 36543 50207 39970 45616 76465 31714
8101 31714 3826 9683 -613 -598 -32541 -8044 -4947 9766 60657 59835 21312 -1196 -9096
8088i096q237K8528K1324n578l969m4691k0481K4746L5742L6013J8102o337r097
8075E6969K7628j5637k8628n4676j1416q987L4673J132k8421o3226j4454L7253
8063f7790J8883j4175K1297N718K550O196j2962j2809L3584N202K4456j4027j3378
8050a7255N719k9044J2077K0553K0149k0430k9859L636Q222q379o514K7521K6599
8037A2995k8213n2770J2658j0754k9183K8690K5129j19L9233M2947P580m865R107
8024E2435M6608l1682J2494k4377j4380N455m4580l3517j2606K0027j2851Q878
8012b8096K9460k3963k2793J738P683L3250J6557L3353j5359j7240J4282J2631
8000D1503j9658q318L5055J116J5404j2708n3682k9118l8007K4085M3721J0239
$$ plain form
8088 -9096 -17333 11195 32519 26941 22972 -21719 -42200 -17454 18288 54301 72403 66066 56969
8075 56969 84597 68960 40332 -14344 -25760 -34747 -74 1058 -27363 -90589 -105043 -67790
8063 -67790 -48907 -63082 -41785 -36067 -33517 -27321 -40283 -53092 -19508 -14306 10150 -3877 -17255
8050 -17255 -11536 -40580 -28503 -7950 12199 -8231 -38090 -34454 -26232 -34611 -41125 -13604 12995
8037 12995 -15218 -67988 -55330 -66084 -95267 -66577 -41448 -41567 -2334 40613 48193 43328 52435
8024 52435 99043 67361 79855 55478 41098 46553 1973 -31544 -44150 -24123 -36974 -28096
8012 -28096 1364 -22599 -45392 -43654 -35971 -2721 13836 47189 31830 14590 28872 41503
8000 41503 21845 13527 48582 49698 65102 52394 -1288 -30406 -68413 -44328 -607 9632
7988I632j5242N844l1563n826L0159l966L2665L413J854l4947l1916l9957J5720
7975f4130K0101J1229K4606J5928r125P295O484j7356q857n102o050M0684K2894
7962C8601p278P560j7188l0990j1372Q584K7950L274k1153k1165j2301K2151J6107
7949B780L351l6258l5357K359m2330m895Q1196L2595K4387o61k7177p7689j238
7936g8937L4663M567M5740J2135k1182M228K1580J4780k134j0831J455R123j7674
7923A7513k948l4840j1195o030o466p688L6634q879n2438M4484N9476Q574m252
7910C1945m6973k0673l7702K5498N0927J2908k9789M761K4586j936j2963M3592
7898D4181m651o3206q371J1040K9849L9971l8639o922l9225l1289J1229L9299
$$ plain form
7988 9632 -5610 234 -31329 -37155 -6996 -10962 21703 25116 26970 -7977 -39893 -79850 -64130
7975 -64130 -44029 -32800 -8194 7734 -1391 5904 12388 -4968 -13825 -18927 -24977 15707 38601
7962 38601 31323 38883 21695 -9295 -20667 -12083 15867 19141 -2012 -23177 -35478 -13327 2780
7949 2780 6131 -30127 -65484 -63125 -105455 -110350 -29154 3441 27828 27167 -10 -77699 -78937
7936 -78937 -44274 -39707 6033 18168 -3014 1214 22794 37574 35440 24609 26064 35187 17513
7923 17513 14565 -20275 -31470 -37500 -43966 -51654 -15020 -23899 -76337 -31853 27623 36197 31945
7910 31945 -15028 -35701 -73403 -47905 3022 15930 -13859 -9098 15488 13552 589 44181
7898 44181 39530 -23676 -32047 -21007 8842 48813 10174 3252 -35973 -67262 -56033 -16734
7886a6734l777m2418J9243L2505J5573L7262l4387j1963j5646j0049J5589L6283
7874B1481J8631o235K1021M8546M461n592m6828k4354m0069j5380J7588l1023
7862c7753K5711M1024J652j1116k1796n205M9480M8010L4186l8893r0855n9814
7850f5369m561n379K5843L7440R734J7288J3625J4883j3921K0427K2779k5856
7838D6933K650k3678m3211K0067M396m9061J3108J6930l0319l48K8160J8956j8503
7825a3920L091o311L521N9959K3826l0735r834k8059P106n191o2495O00L7512
7812b0930N6919k8789l2783l0516j0709J1542M7305J5536o688L0815L920q216
7800B7406k8681j6773l829l3572k5810L2558M4784o202K1718P469j2396J2345
$$ plain form
7886 -16734 -20511 -62929 -43686 -11181 4392 41654 7267 -4696 -20342 -30391 -14802 21481
7874 21481 40112 33877 54898 103444 107905 102313 55485 31131 -8938 -24318 -6730 -37753
7862 -37753 -12042 28982 30634 19518 -2278 -7483 41997 90007 124193 85300 -5555 -65369
7850 -65369 -69930 -75309 -49466 -12026 -2292 14996 28621 43504 29583 50010 72789 46933
7838 46933 49583 25905 -17306 2761 7157 -41904 -28796 -11866 -42185 -42533 -14373 4583 -13920
7825 -13920 -10829 -17140 -13619 46340 70166 39431 29597 1538 8644 3453 -59042 -58442 -20930
7812 -20930 35989 7200 -25583 -56099 -66808 -55266 -7961 7575 887 31702 35622 27406
7800 27406 -1275 -18048 -21877 -55449 -81259 -48701 -3917 -10119 11599 19068 6672 19017
7788A9017L7366k826l0681m7076J036N0930M2356k583m9914Q247r132j781N0069
7775F5028J9503j1000k9231j1561K2538n6781m3649J2024P778K435k661k3568
7763d9145K526P133J7275K0197L66k0450l92j079j9795j6353m718M6987L7707
7750B0259M102p50L9932J8590n0793l5368Q956J6156M4550K153l6104m245K0650
7737D8088j9008l6675m2899J6234k806j3948J747M6083K1824J5334J0127R313
7725E3414l3250j3780m1237l9160K1403L2454K4175l2696m1055L2865l344m883
7713d5094l27J8526K4389l061M6025J3058n0354o638k3772m5908J1767L7762m023
7700b7650j3784J6085J0393J7311k744k5893l8238j9281j4204q120L7685M6253
$$ plain form
7788 19017 56383 53557 22876 -24200 -23164 27766 70122 67539 17625 25872 16740 14959 65028
7775 65028 84531 73531 44300 32739 55277 -1504 -45153 -33129 -25351 -22916 -25577 -49145
7763 -49145 -46619 -39486 -22211 -2014 -1648 -22098 -22490 -23569 -43364 -59717 -64435 -17448 20259
7750 20259 24361 23611 63543 82133 31340 -4028 4928 21084 65634 67787 31683 27438 48088
7737 48088 29080 -7595 -50494 -34260 -37066 -51014 -49267 -3184 18640 33974 44101 53414
7725 53414 20164 6384 -34853 -74013 -52610 -20156 4019 -28677 -69732 -36867 -40211 -45094
7713 -45094 -45421 -26895 -2506 -5567 40458 53516 3162 -3476 -27248 -73156 -61389 -23627 -27650
7700 -27650 -41434 -25349 -14956 2355 -389 -26282 -64520 -83801 -98005 -106125 -68440 -22187
7688b2187L3220J1321p971r15l1500M396L5136q841L2794m167n5198k3493j2661
7675e0066N5987k3157j8896J2259k0239j2503M992m5070j4681M6076R097L5610
7663b0591j0778k0030K8388K0553k2168r87o665J3666M4755k3846j8025j1935
7651b7663K913L1959J3187l811l291k7113R043J5822K7535J4529J4742K7430J854
7638I7136k3567n2002l95K9235m0435r898J5306K1321r093J787k659m4606k6206
7625d4076Q1276J1964l9954r782j6818K0431M5800J602j7637n4432l0515J2868
7613c9273J5476J4779j4098L245L4455L3641k5933m2162m0684J2217L7836M5434
7601C4933k4118l1663j3783l9437N107N5569J1474K2374k9573J4320K4539j8568
$$ plain form
7688 -22187 11033 22354 14383 13468 -18032 -13636 21500 12659 45453 41286 -13912 -37405 -50066
7675 -50066 5921 -17236 -36132 -23873 -44112 -56615 -51623 -96693 -111374 -65298 -56201 -20591
7663 -20591 -31369 -51399 -23011 -2458 -24626 -25613 -32278 -18612 26143 2297 -15728 -27663
7651 -27663 -24750 7209 20396 16585 13294 -13819 -4776 11046 38581 53110 67852 95282 97136
7638 97136 73569 21567 21172 50407 9972 74 15380 36701 27608 29395 26736 -17870 -44076
7625 -44076 37200 49164 9210 -572 -17390 3041 48841 50443 32806 -21626 -52141 -39273
7613 -39273 -23797 -9018 -23116 -19871 14584 48225 22292 -19870 -60554 -48337 -10501 34933
7601 34933 10815 -20848 -34631 -74068 -68961 -13392 -1918 20456 -9117 5203 29742 11174
7589A1174l3531j5312M3783K2679j1859j6401k2055l2437J9773J6979J1902J3844
7577H539k1444j3985k9901L176K1837L0267L7042L1259K8986K8968k148n3871
7565F8725o7171k8617K8166L428m2743J4794J7300P976M0957l4697m4166j9407
7553e5455M8480M9953l1888K7454J381k8552m3655k9316M835k7407R62L8044J8942
7540b6222J0158k1684K4572L3847j4045l100J3423m230K0586J7008k2480l3566
7528e733M287J6574J5335l466J0986k2012J2887Q159p086l5609k0382l6840j8175
7515h1075O438M6979L1457j5570K7665k1802n2976k2584K2718M390n4388j6138
7503a24886J0677L7179J9826P269L2582J4988J738q563j496n412J8915K870k9758
$$ plain form
7589 11174 -22357 -37669 6114 28793 16934 533 -21522 -53959 -34186 -17207 -5305 8539
7577 8539 -12905 -26890 -56791 -53615 -31778 -1511 35531 66790 95776 124744 122596 68725
7565 68725 1554 -27063 1103 4531 -38212 -23418 -6118 1858 42815 8118 -36048 -55455
7553 -55455 -6975 42978 11090 38544 39925 11373 -32282 -61598 -56763 -84170 -83208 -45164 -26222
7540 -26222 -16064 -37748 -13176 20671 6626 3526 16949 12719 33305 50313 27833 -5733
7528 -5733 -1446 15128 30463 26997 37983 15971 28858 37017 29931 -5678 -26060 -62900 -81075
7515 -81075 -74637 -27658 3799 -11771 15894 -5908 -58884 -81468 -58750 -54360 -108748 -124886
7503 -124886 -114209 -77030 -57204 -49935 -17353 -2365 -627 -9190 -10686 -16098 2817 5687 -24071
7490b4071L662k0325k9340o453N7359L8467L498J8449j4136R319N870J5894l8283
7477A9910m2901O042k9509k9242J1731N691l6175o343K4035J6127J2169K6851
7465b1614r010k942K2151K2156p489m3827J2122K6542K0877j2779n799k2342k5904
7452d7858j817q030L0995K9554k4452J4472K3933q83q224k3304j2048k3428J4354
7439c6736K5538j6831L8305P843k2446K9926l2295m4064M910J4767L1347j1561
7427a1297M691l4261j9610L2010J0647L5873L6313J8849j4147J0091j4591j9538
7415C5030l1494l6011j890J696M163R294p823n1467k0466L1485O2521J6728l4467
7402b2701l1631M3091L5885k6639j2676L0523K9286j6330O035j5915k0551j6176
$$ plain form
7490 -24071 -20409 -40734 -70074 -76527 -19168 19299 22797 41246 27110 36429 42299 58193 19910
7477 19910 -22991 -16949 -46458 -75700 -63969 -58278 -94453 -100796 -76761 -60634 -48465 -21614
7465 -21614 -30624 -33566 -11415 10741 3252 -40575 -28453 -1911 18966 6187 388 -21954 -47858
7452 -47858 -49675 -57705 -26710 2844 -21608 -7136 16797 15914 7690 -15614 -27662 -51090 -36736
7439 -36736 -11198 -28029 10276 18119 -4327 25599 -6696 -50760 -45850 -31083 264 -11297
7427 -11297 -6606 -40867 -60477 -28467 -17820 18053 54366 73215 59068 69159 54568 35030
7415 35030 3536 -32475 -34365 -32669 -28506 -19212 -27035 -78502 -98968 -67483 -4962 11766 -22701
7402 -22701 -54332 -11241 24644 -1995 -14671 15852 45138 28808 34843 18928 -1623 -17799
7390a7799Q868N3281n493m4656J0593L0358P213l4583K3909J4417k4689k3350
7378a931K456k1274k3431N4479M8119q05k2502k8531J0599k3305J4066r984j2973
7365a5017J3713K3763l8917m2297R509K8452j478p292l3272j4032o661n519K7038
7352f2010j239l1862K2580N2937K0458J3808j4450j4530J0142l3592j2429K7713
7340b2474R039l3521N031K3815L4484j751j4449k6352k0555M3286K1195q394K7222
7327C6576j5447M962J8948j881j5045l6256l2087J6832K4602K9254l054j0513
7315A6891j1237Q747J4010L2547P463q293l9267j343j0513j8372k9012K3110j3170
7302b8439K2904R704j1727k730K5904k3393J25j9514k8910m971P1824K4730P599
$$ plain form
7390 -17799 -8931 44350 38857 -5799 4794 35152 42365 7782 31691 46108 21419 -1931
7378 -1931 525 -20749 -44180 10299 58418 57613 35111 6580 17179 -6126 7940 -2044 -15017
7365 -15017 -1304 22459 -16458 -58755 -49246 -20794 -22272 -29564 -62836 -76868 -83529 -89048 -62010
7352 -62010 -63249 -95111 -72531 -19594 864 14672 222 -14308 -4166 -37758 -50187 -22474
7340 -22474 -13435 -46956 -41925 -18110 16374 14623 174 -26178 -46733 -3447 17748 9354 36576
7327 36576 21129 26091 45039 43158 28113 -8143 -40230 -23398 1204 30458 27404 16891
7315 16891 5654 14401 28411 60958 68421 60128 20861 19518 9005 -9367 -38379 -15269 -28439
7302 -28439 -5535 4169 -7558 -10288 15616 -7777 -7652 -27166 -56076 -61047 10777 35507 43106
7289D3106l1625k7346k162j616j1101j4236l1642J5015O577M0273M1109j2668
7277A3684j3260P516K0158l8833p053K3203L0290L1174k3251N5568K7915j6520
7265A10591j9363k300l1518p2682j3386J5456q380K967N968J6148p014m560J155
7252f918J2421L623k4888J136J969N4097M198Q622j6747K7175J3878k8410l1386
7239A8770k3489p521j9996k2162M1244L1988M2973J8704l7192J916j7284R346
7227C7297j4910l2773l9080l827o252N0018N2974J3801l5444l5739l235m826m0627
7214f2623m5104M6559M5472L9407J010L5435J1606l2013M716J6344j1149l4653
7202A5007n0458n650n817j6477l5936N259N489M1182j0633R840J6775J3479J9576
$$ plain form
7289 43106 11481 -15865 -18027 -19643 -30744 -44980 -76622 -61607 -55030 -14757 26352 13684
7277 13684 424 7940 28098 -10735 -17788 5415 35705 66879 43628 99196 127111 110591
7265 110591 91228 88928 57410 -15272 -28658 -13202 -21582 -18615 -12647 3501 -3513 -8073 -6918
7252 -6918 5503 9126 -15762 -14626 -12657 41440 45638 54260 37513 64688 78566 50156 18770
7239 18770 -4719 -12240 -32236 -54398 -13154 18834 61807 80511 43319 45235 27951 37297
7227 37297 22387 -10386 -49466 -53293 -59545 -9527 43447 57248 21804 -13935 -17170 -21996 -62623
7214 -62623 -107727 -61168 -15696 23711 24721 60156 71762 39749 44465 60809 49660 15007
7202 15007 -35451 -41101 -46918 -63395 -99331 -94072 -88583 -47401 -58034 -48194 -31419 -17940 1636
7189A636l0191n7599M010R863K0441N6169j7485p193O164Q128J3422o490l4677
7176c3802n0280k1615O6548N3755K3913L2708p642K7191r65m1893j4108L0628
7164F4438N9855j5940o0868l840K7786l0346k4368l2365k8595Q725K9037j0835
7152a7316o082J1929J6884k5283l0999r361L466J3596K4429j1365o127M252O928
7139b5049M041J2759r312l7461j3622K6698L0076N033L677J627J2255O054j650
7126A5126j0683j5636J9788j917j7441j3627J8812P445l877j9768M2817M2204
7114F3243J5842o403o0974k3584n360l9307O520N6782J3773P796K904k7594k447
7101A191M262K3890K1203k774j0908k3459o177J0556j8478n4070k0556m855K8380
$$ plain form
7189 1636 -28555 -86154 -82144 -72281 -51840 4329 -13156 -20349 -14185 -6057 7365 875 -33802
7176 -33802 -84082 -105697 -39149 14606 38519 71227 63585 90776 89811 47918 33810 64438
7164 64438 124293 108353 47485 43645 71431 41085 16717 -15648 -44243 -35518 -6481 -17316
7152 -17316 -23398 -11469 5415 -19868 -50867 -60228 -56762 -43166 -18737 -30102 -36229 -31977 -25049
7139 -25049 -21008 -8249 -17561 -55022 -68644 -41946 -11870 -6837 -3160 -1533 10722 16776 15126
7126 15126 4443 -11193 8595 6678 -10763 -24390 -5578 1867 -2010 -21778 21039 63243
7114 63243 79085 72682 11708 -11876 -17236 -56543 -50023 6759 20532 28328 31232 3638 1191
7101 1191 5453 29343 50546 47772 36864 13405 7228 17784 -694 -54764 -75320 -80175 -51795
7088e1795L6666L328J4259J3748J1593l844K883k5486l3491l7228k5455M1075
7076e3747L6254O042o135J7685q365l5274k3277N5849M3636O491k6502l5614j6065
7063c9022K5686O3039L7231k65k2840m7317l0873j030P305M914r42j726J3135
7050G295k2163j3709K5093K0630J5604j7681q648l2451J2543O761K1345l473k7673
7037a6527K0773L455k6420p448K8174J0367J0279K3085j3967n8383N592k310R876
7024a3454j7051j6017M9184r511J5842J4239J7583l3100k8227n2132k1827L4121
7012f0350M8716J7394L1005M0858p55k8499k6123k6058k5262k1526p382P629J8420
6999c1933J7797J1910L129K1656L0891l5467m5470k0334L3326M366L6308k960
$$ plain form
7088 -51795 -15129 -11801 2458 16206 27799 23955 26838 1352 -32139 -69367 -94822 -53747
7076 -53747 -17493 -11451 -17586 99 -8266 -43540 -66817 -10968 32668 39159 12657 -22957 -39022
7063 -39022 -13336 49703 86934 86669 63829 16512 -14361 -15391 -8086 -3172 -4114 -5840 7295
7050 7295 -14868 -28577 -3484 17146 32750 15069 6421 -26030 -13487 -6726 14619 11146 -16527
7037 -16527 4246 7701 -18719 -26167 2007 12374 22653 45738 31771 -26612 -21020 -23330 -13454
7024 -13454 -30505 -46522 2662 -6849 8993 23232 40815 7715 -20512 -72644 -94471 -60350
7012 -60350 -11634 5760 36765 77623 76868 48369 22246 -3812 -29074 -50600 -57982 -50353 -31933
6999 -31933 -14136 -2226 903 22559 53450 17983 -27487 -47821 -14495 -10129 26179 23219
6987B3219j0716l504m2814J9499k1148l7349J0675N7358M6995K9722m1959l6712
6975f734K0283K1228j518j2485o1049J7579P1235L330m2519P47J4339j7809l237
6962C390l1602m154j23l4670K3603Q666P545L8284j9502k8950o538j0209J3749
6949d0511n991L5873Q000K763K120L5030J9122L907k8090k7564J4561J5940k4754
6936A0406l1419N620k442j7103K5620L10p639l3325K0383J1580P770K610R293
6923A664K6974m762N607k2333l5461N445J5351k5915P874p488N6180K4634m948
6910D2822k7836m2119k0736M6768q383k487J1488J8167n6432l1325r288j9299
6898i8660N3812L6120L2849L5913q805j7215n3115M163J0487m5348P098N4582
$$ plain form
6987 23219 12503 8999 -33815 -14316 -35464 -72813 -62138 -4780 42215 71937 29978 -6734
6975 -6734 13549 34777 33259 20774 -40275 -22696 48539 51869 9350 10097 24436 6627 3390
6962 3390 -28212 -32366 -32489 -67159 -43556 -34890 -27345 10939 -8563 -37513 -44051 -54260 -40511
6949 -40511 -46502 -10629 -2629 134 2254 37284 56406 60313 32223 4659 19220 35160 10406
6936 10406 -21013 -15393 -17835 -34938 -9318 -9008 -16647 -49972 -29589 -18009 -10239 -7629 1664
6923 1664 28638 23876 29483 7150 -28311 -22866 -7515 -33430 -25556 -33044 23136 47770 42822
6910 42822 14986 -27133 -47869 -1101 -9484 -11971 -483 17684 -38748 -70073 -79361 -98660
6898 -98660 -44848 -8728 24121 60034 51229 34014 -19101 -14938 -4451 -49799 -42701 11881
6886A1881M5297n3295k7855K1530M064j2454l433J0188j5748L1599K8240K8074
6874F8088p135M491l4710j5314r805M627j0451k192m939j1193J178P582j4888
6861b4661k5435j0181R435L3296J6345j5322L4121k5382o0575p832K289P532L4044
6848c2326o466L9279O9977J878l0110o0161K452n892L9528L6486K1934K5332o5238
6835C6673p9646l8076J3117M0371k9490J6550J1568k5054J4120M909j9326L2392
6823b1892j0368l6386J0040O291J4525L7368p186j1074m234L9j0924l900j5086
6810e2787O223j3026L7691j968K7782Q901p162l6905p360J4354k5601L1295M8026
6797B9463j4599k1296L0226P78M093K6958l1983N228K4452n574j2990J7416J7960
$$ plain form
6886 11881 57178 3883 -23972 -2442 1622 -10832 -14265 -4077 -19825 11774 40014 68088
6874 68088 60953 65444 30734 15420 5615 10242 -209 -2401 -7340 -18533 -17355 -9773 -24661
6861 -24661 -50096 -60277 -50842 -17546 -1201 -16523 17598 -7784 -68359 -76191 -73902 -66370 -32326
6848 -32326 -38792 487 70464 72342 42232 -17929 -15477 -21369 18159 54645 76579 101911 36673
6835 36673 -42973 -81049 -67932 -27561 -57051 -40501 -28933 -53987 -39867 -34958 -54284 -21892
6823 -21892 -32260 -68646 -58606 -52315 -37790 -422 -7608 -18682 -22916 -22877 -33801 -37701 -52787
6810 -52787 -46564 -59590 -21899 -23867 3915 12816 5654 -31251 -38611 -24257 -49858 -18563 29463
6797 29463 14864 -6432 23794 24572 28665 55623 23640 28868 53320 47746 34756 52172 70132
6784G0132k2227k12O111k7895k2095k268M728J3256K8528j6573J840l1278k4304
6771b2257k1669M2032P952M442K8051j2266l3015J0361K1408k8152k8621k525
6759c4259L0435K9403l2844k502J4034O29J8524P82L0479J3411p196r669l8815
6746A2412j8527J6164P134J1720k5124k0541R286j3007r457p888l8591K00Q703
6733f7516K9575Q867K4152J2494l332k9207j0181M457K7562M506j9672J7754j0652
6720a1193k3486J5318M666j3136k2545N615M0983J1184J2529M041k1468J7393
6708A9901K3350m0437J350K3870l85j3701J8342k255k1827m1096J5487K3500K1965
6695B8064j5599J2479l3062k4711R825L0145k609K7013p588L650M9383K5558k093
$$ plain form
6784 70132 47905 47693 53804 25909 3814 1546 6274 19530 48058 31485 33325 2047 -22257
6771 -22257 -43926 -1894 6058 10500 38551 26285 -6730 3631 25039 -3113 -31734 -34259
6759 -34259 -3824 25579 -7265 -9767 4267 4896 23420 24202 54681 68092 60896 51227 12412
6746 12412 -6115 10049 17183 28903 3779 -16762 -7476 -20483 -29940 -37828 -76419 -76219 -67516
6733 -67516 -37941 -29074 -4922 7572 4240 -24967 -35148 -30691 -3129 1377 -18295 -541 -11193
6720 -11193 -34679 -19361 -14695 -27831 -50376 -44761 -3778 7406 19935 23976 2508 19901
6708 19901 43251 2814 4164 28034 27649 13948 32290 30035 8208 -32888 -17401 6099 28064
6695 28064 12465 24944 -8118 -32829 -23004 7141 4532 31545 23957 27607 76990 102548 100455
6682A00455k7775n2096p5790J3896M7603k421k1023K8048L583k5744r250J8660
6670a854J5752k1020N887k6424j779Q414L0074N361l8188j6364J7910M1237k4264
6657e258J9384j7229j3064M9352L1824n917N203o816n4129k3942j781L7121O719
6644B1467Q343j8485j9199nk2974k3836M9382j9509K546k8646j8554K190K570
6631f4710k067m5072K4206L0823L4993j4497L2195n228k7459k6342J4270K8959
6619a9929P572k5723L233J9031J0780L8608K2299p0949k2328M1567j0790m598
6607a1227j9381j9024k1798K6347m3377j5128K73K7774K84M2314K0129j4489K60
6594b7043K7740K0698j9007j841K9827k6415l2492N252J7107r904j9223M6762
$$ plain form
6682 100455 72680 20584 -55206 -41310 6293 3872 -17151 10897 14480 -11264 -20514 -1854
6670 -1854 13898 -7122 -1235 -27659 -29438 -21024 9050 14411 -23777 -40141 -22231 19006 -5258
6657 -5258 14126 -3103 -16167 33185 65009 59092 64295 57479 3350 -20592 -22373 14748 21467
6644 21467 29810 11325 -7874 -7879 -30853 -54689 -5307 -24816 -22270 -50916 -69470 -67280 -64710
6631 -64710 -66777 -111849 -87643 -56820 -21827 -36324 -4129 -9357 -36816 -63158 -48888 -19929
6619 -19929 -12357 -38080 -34847 -15816 -5036 33572 55871 -15078 -37406 4161 -6629 -11227
6607 -11227 -30608 -49632 -71430 -45083 -88460 -103588 -103315 -75541 -75257 -32943 -12814 -27303 -27043
6594 -27043 697 21395 2388 547 30374 3959 -28533 -23281 -6174 -16078 -35301 11461
6582A1461J5906k5494k3915p570L4284p348k4625k1737L3009O3390J4087p6943
6570a5495j4111j4110J5129M289k8062j9494J1937L9114M9521M0445l2138k0575
6558A6450j7010O579J7124k2093l0129j0850j6305K0405Q557n076J7335K2291
6546G278L2697l6299j3335m7851j4647l5793K0651K1063L8007J5561k9525j583
6534d3776M0378L3923L4084j7587n122l6568K6449k1795m1623R866J5455k4889
6522c1205k3168J0005J6766R381P309K6062k8522p956J1973l0501o666M610m5724
6509h7636K6068O4555L947p513j3253j5965M9317L1020q619j8998l2836k1471
6497c1384p786n330L0582N735n6713M289M9570J6744n744J8530J933j978l0200
$$ plain form
6582 11461 27367 1873 -22042 -29612 4672 -2676 -27301 -49038 -16029 47361 61448 -15495
6570 -15495 -29606 -43716 -28587 -24298 -52360 -71854 -59917 -20803 28718 69163 37025 16450
6558 16450 -560 6019 23143 1050 -29079 -39929 -56234 -35829 -27272 -32348 -15013 7278
6546 7278 39975 3676 -9659 -57510 -72157 -107950 -87299 -66236 -28229 -12668 -42193 -43776
6534 -43776 -3398 30525 64609 47022 41900 5332 31781 9986 -31637 -21771 -6316 -31205
6522 -31205 -54373 -44368 -27602 -18221 -10912 15150 -13372 -21328 -9355 -39856 -46522 -41912 -87636
6509 -87636 -61568 2987 6934 -579 -13832 -29797 19520 50540 41921 22923 -9913 -31384
6497 -31384 -39170 -44500 -13918 -8183 -64896 -60607 -11037 5707 -37 18493 20426 18448 -11752
6484a1752K6266l873j7056K2463J5660N22q991o591r885k1754j2805J9897m4249
6471e2148j5415j0386n62j4808j389L1479N3322N341M603n683J8182l770q388
6458C78R791j2043K5997K096l6403k5565k2382j1854r965M4487M5502J211L6267
6445D7517q815m3971j3199j9791n0417j7593j025N6730M2658K4129M8318N094
6433F9635k5190o0349l9590k9027M429j4481L692K5398j7768L1177N0125N459
6421C510P58P343j0229R032M043J5234l800k0616j1186p697k9805R48L6201K0776
6407A4512J1496L3044l0248k3251J0665K4874k3782o3461j6412K880j2496M6190
6395b5989O737M178q773k235p236n123M121J800M9238p739n4232J8032J9906K6615
$$ plain form
6484 -11752 14514 10641 -6415 16048 31708 32230 23239 16648 6763 -14991 -27796 -7899 -52148
6471 -52148 -67563 -77949 -78511 -93319 -94708 -63229 -9907 -4566 37 -5646 12536 8766 378
6458 378 10169 -1874 24123 26219 -10184 -35749 -58131 -69985 -79950 -35463 10039 11250 47517
6445 47517 38702 -5269 -18468 -38259 -88676 -106269 -107294 -50564 -7906 16223 64541 69635
6433 69635 44445 -15904 -55494 -84521 -80092 -94573 -90881 -65483 -83251 -52074 -1949 3510
6421 3510 4268 11611 1382 10414 14457 29691 25891 5275 -5911 -13608 -43413 -42465 -6264 14512
6407 14512 26008 59052 28804 5553 16218 41092 17310 -46151 -62563 -59683 -72179 -25989
6395 -25989 -19252 -15074 -23847 -26082 -33318 -38441 -34320 -32520 16718 8979 -45253 -27221 -7315 19300
6381A9300j5212M210k90M099l4632R643K4721J7184j7982j6217j4804R840Q270
6368a870L5925p220L017Q336l8179n6474L2714K1753j744k8344j5691r055P2004
6355A5172M2766m4168k8684j1600j0987k669K5840o317J9084J3913k7255j5752
6343c0657o990J5492M342k4924k7711K4404l560n597M5651M943l5355J5864P434
6330a6664L564N8128P4247j0426l1373l7122n0346J4563q133j4778K0798M1763
6318D4221Q80k4988j1411j6496j1044q33k6316j9171k7895L7570K5838p971j548
6305c9164L3623L1006J3766Q828R28n3665j2528k5524j8267j8897M9247L4706
6293D059J1361k9095k4079m855L1135M1384p248m7148k7551o302k211l4711q315
$$ plain form
6381 19300 4088 8298 8008 12107 -22525 -12882 11839 29023 11041 -5176 -19980 -10140 -1870
6368 -1870 34055 26835 29852 38188 9 -56465 -23751 -1998 -3742 -32086 -47777 -56832 15172
6355 15172 57938 13770 -14914 -26514 -37501 -40170 -14330 -20647 -1563 12350 -14905 -30657
6343 -30657 -37647 -22155 -17813 -42737 -70448 -46044 -49604 -55201 -9550 -4607 -39962 -24098 -16664
6330 -16664 -13100 45028 119275 108849 77476 40354 -9992 4571 -3562 -18340 2458 44221
6318 44221 45101 20113 8702 -7794 -18838 -19671 -45987 -65158 -93053 -55483 -29645 -37616 -39164
6305 -39164 -5541 25465 39231 48059 48987 -4678 -17206 -42730 -60997 -79894 -30647 4059
6293 4059 15420 -13675 -37754 -42609 -11474 29910 22662 -24486 -52037 -58339 -60550 -95261 -103576
6280a03576L1252J2073K3299K9184K1584l0597k9171k097j0162K3995M0770N4769
6268F1323P882k8221m1298o1920k2577J7201L2925Q889j275n464J2977J3034J1434
6255D910R269k8285m3528K0973L7664j9293l1687K4155j8189q085J2218L064k907
6242c9721j1281K7573L4804r53O163k1790o601J1223r250j9332j9531k3396k904
6229g4996O0958L3920K7909j6249j4546Q893k964J0096j8049l4590J3780L372
6217b466M469r456j954k5447K815M0864j8074l6143l6548n688J1615J6521N4063
6204e429K6515k5579J4414O570j186j8894k0520l5157j7778L3470j3059j1241
6192f7874l4758L4999J8754k1328K6387N0966k997k3878J5424J2736m760Q690
$$ plain form
6280 -103576 -72324 -60251 -36952 -7768 13816 -16781 -45952 -48049 -58211 -34216 6554 61323
6268 61323 69205 40984 -314 -62234 -84811 -67610 -34685 -25796 -27071 -32535 -19558 -6524 4910
6255 4910 14179 -14106 -57634 -36661 1003 -18290 -49977 -25822 -44011 -52096 -39878 -36814 -39721
6242 -39721 -51002 -23429 11375 10422 16585 -5205 -11806 -583 -9833 -29165 -48696 -72092 -74996
6229 -74996 -14038 19882 47791 31542 16996 25889 22925 33021 14972 -19618 -5838 -2466
6217 -2466 2003 -7453 -9407 -34854 -32039 8825 -9249 -45392 -81940 -87628 -76013 -59492 -5429
6204 -5429 21086 -4493 9921 16491 15305 -3589 -24109 -59266 -77044 -43574 -56633 -67874
6192 -67874 -102632 -67633 -48879 -70207 -43820 7146 4149 -19729 -4305 8431 3671 12361
6180A2361j1856j1539L4212l1067M511J3088L2313K841j0912l6010r155m0002
6168e1215M1867K5327j1464l1157l721K4965j3045k776R506l408k9406l368L1577
6155a6318O7897J5949J8604m4329k0185n2489K088K0304K3339M4996l3541l3417
6143g102J192O585R360k3850N529L1169l4747l8379J4192O233J575K191P648K3469
6129E065M7698l2274J7300K1622K0846j3263l5719j4658j045k0572l7830j5675
6117e8505K8400K9385j7754M7312M8198m5313M205j211P305o229J7855j3938J5446
6104E5156O4543j8913l2872k5744j7144j734j9364K220j2588l8087j3244k8673
6092h6444K172n582K5225M6510L9000K3862k6357m173K2815J432j7706n1306j1825
$$ plain form
6180 12361 505 -11034 23178 -7889 -3378 9710 42023 44864 33952 -2058 -11213 -51215
6168 -51215 -9348 15979 4515 -26642 -30363 -5398 -18443 -21219 -11713 -15121 -44527 -47895 -16318
6155 -16318 51579 67528 86132 41803 21618 -30871 -28783 -8479 14860 59856 26315 -7102
6143 -7102 -5910 675 10035 -13815 -8286 22883 -11864 -50243 -36051 -29818 -28243 -26052 -18404 5065
6129 5065 52763 20489 37789 59411 80257 66994 31275 16617 15572 -5000 -42830 -58505
6117 -58505 -30105 -720 -18474 28838 77036 31723 35928 34717 42022 35793 53648 39710 55156
6104 55156 119699 100786 67914 42170 25026 23292 3928 6148 -6440 -44527 -57771 -86444
6092 -86444 -84272 -89854 -64629 -18119 20881 44743 18386 14213 37028 38460 20754 -30552 -42377
6079d2377J0706j8388J4592M2798j3273j2031M6644K6157L5044k2290m0043k0771
6067F768n505P051L7641J0724k4245l1703j8544L461m2617j5523L8911L6980j0152
6054f753J7510R3j2124k3717M5977K2615R338Q271l5877k1362O046K8618k845
6041C5790p556J4444K065m8844p698L877M770p845R815p610l627k6528j2193l4812
6027h5952j2481K9137J1681L0195k2050j8852k1218K3544j6643J5223k00k2379
6015h9995p504R332K8453L6356l6898j150K1652j8950j284R221k0815L291K5007
6002d3284j1128J9060k211k2591J6109n082l433K16Q929j8544n150L4442m923
5989c7590k0097j2795k552K2284O5183J1046m9668l1516K8932L6215P700Q734
$$ plain form
6079 -42377 -31671 -50059 -35467 7331 -5942 -17973 28671 54828 89872 67582 27539 6768
6067 6768 1263 8314 45955 56679 32434 731 -17813 -14352 -56969 -72492 -33581 3399 -6753
6054 -6753 10757 10850 -1274 -24991 20986 43601 52939 61210 25333 3971 10017 38635 35790
6041 35790 28234 42678 44743 -4101 -11799 -7922 -3152 -10997 -1182 -8792 -12419 -38947 -51140 -85952
6027 -85952 -98433 -69296 -57615 -27420 -49470 -68322 -89540 -65996 -82639 -67416 -67616 -89995
6015 -89995 -97499 -88167 -59714 -23358 -60256 -61406 -39754 -58704 -59988 -50767 -71582 -68291 -43284
6002 -43284 -54412 -35352 -37563 -60154 -44045 -49127 -52560 -52344 -43415 -61959 -67109 -32667 -37590
5989 -37590 -57687 -70482 -73034 -50750 14433 25479 -24189 -55705 -26773 9442 17142 25876
5977B5876j0632J3423K2947j6412l8773j337k068q942o78j9781J4893L2268J9234
5964C0018J2309R102k5324n0559R053K2206l74N139l3407l270q953p467l0557
5951g2084l006j4536O075l1416j1774O2622L1659j0285N425O1009L0625j4869
5939C9445k7110J0109j393N428k495K0965j3279O431J9632K0073j2970o2257j5692
5926a3113K6955J1162l5001k629M4179k2055q940R324L7124J3972k3121m3743
5914e886J5830j2625k8K2250K209m7899o389l40M9471L7803j7578r938j4188m660
5900H032J431q469l525K3281m321k4020o4870Q834M1969J6713J6500J1539j9672
5887C422n4637N906l2999L065N219O552L9490L4110J4964j7368l8986q334m4378
$$ plain form
5977 25876 15244 28667 51614 35202 -3571 -4908 -6976 -15918 -16596 -36377 -21484 10784 30018
5964 30018 42327 51429 26105 -24454 -15401 6805 6431 11570 -21837 -25107 -34060 -41527 -72084
5951 -72084 -75090 -89626 -83551 -114967 -126741 -64119 -32460 -42745 -37320 23689 54314 39445
5939 39445 12335 22444 21051 26479 23984 44949 31670 38101 57733 77806 64836 2579 -13113
5926 -13113 13842 25004 -9997 -12626 31553 9498 558 9882 47006 60978 37857 -5886
5914 -5886 9944 -2681 -2709 19541 21750 -26149 -32538 -32878 16593 54396 36818 26880 12692 8032
5900 8032 9463 994 -2531 20750 16429 -7591 -72461 -63627 -21658 -4945 11555 23094 3422
5887 3422 -51215 -45309 -78308 -75243 -70024 -63472 -23982 10128 25092 7724 -31262 -39596 -83974
5874h3974l5906K0377L0932L1659J4090O981J5520J95k390J7481J7023l996J4642
5861D2634k3537l2763j9095J0962j2533k4392K2989l132r379j8815K8753K0780
5849a7528k8968l2739L0443L2353k0870m3041J2241M6533P896L402N480o617m0230
5836e1645l0009K5480O6936M0148m5222k730j0474j294j4747j1362m7709J4921
5824f7707L9575j7516p137j8570n518N9218J7149Q377m3527k6891L8375P466k634
5811a9340k928l4352R930j3033K9696M0043j5157l512o487M0292K1102j1106j937
5798C3211K5944m957j8161k4679r67L2410J0255j8232K437m5422j8585N624M547
5785a6575K2068n218J4187J53R270j6408k8495q519O925J3963k2038L139j7031
$$ plain form
5874 -83974 -119880 -99503 -68571 -36912 -22822 -15841 -321 -126 -2516 14965 31988 27992 42634
5861 42634 19097 -13666 -32761 -21799 -34332 -58724 -35735 -38867 -48246 -67061 -38308 -17528
5849 -17528 -46496 -79235 -48792 -16439 -37309 -80350 -68109 -21576 -13680 -10278 -4798 -11415 -51645
5836 -51645 -81654 -56174 10762 50910 5688 2958 -7516 -8810 -23557 -34919 -82628 -67707
5824 -67707 -28132 -45648 -52785 -71355 -76873 -17655 -506 7871 -35656 -62547 -24172 -16706 -19340
5811 -19340 -22268 -56620 -46690 -59723 -30027 10016 -5141 -8653 -15140 25152 46254 35148 33211
5798 33211 59155 54198 36037 11358 10391 42801 53056 34824 37261 -8161 -26746 -21122 -16575
5785 -16575 5493 275 14462 14615 23885 7477 -21018 -29537 -22612 -8649 -30687 -27548 -44579
5772d4579L3146K4738J8072P259m0985j775J2221K736J2218K8764K0814j2571
5760F0058l7108m0593j1791p510J3806J7355j1346R11l3111J4691J6398L7823
5748A9583l535K652j5086j1027m9188J0614J1539J9067k1409J731N7127n946l9989
5735b3867k6495J9788J3090N451J383L9548J7838l597l2042l8819J6679J2490
5723A447j4272l2118l3219N6116M8842J501l8432j825R248l2907K9219J0137o211
5710b474j3497Q47J1476l6023m131N5677K4740L118j4204n845l2765K311j8187
5697b8957l7434K0921P447K1304N1378Q922m6641r460l3956j2672J8340k0403
5685f1211j1029P6669J7534m425l8174N62L7454K6j5207L7516p277o3880l7833
$$ plain form
5772 -44579 -11433 13305 31377 38636 -2349 -4124 8097 10833 23051 51815 72629 60058
5760 60058 22950 -17643 -29434 -36944 -23138 -5783 -17129 -16218 -49329 -34638 -18240 19583
5748 19583 16048 18700 3614 -7413 -56601 -45987 -34448 -15381 -36790 -35059 22068 16122 -23867
5735 -23867 -50362 -30574 -17484 -12033 -10650 28898 46736 43139 11097 -27722 -11043 1447
5723 1447 -12825 -44943 -78162 -22046 26796 28297 -10135 -11960 -2712 -35619 -6400 3737 -2474
5710 -2474 -15971 -15124 -3648 -39671 -43802 11875 36615 39733 25529 19684 -13081 -10770 -28957
5697 -28957 -66391 -45470 -38023 -16719 34659 43581 -3060 -12520 -46476 -59148 -40808 -61211
5685 -61211 -72240 4429 21963 17538 -20636 -20074 17380 17406 2199 39715 32438 -31442 -69275
5672f9275j0097M6132L2412j3622k575j6218j3632K4598J1526Q923k560j2892
5660a7280J9751J1104P97J8250l1648Q38j478j2801j1153K3373J7462j5734n3952
5647e2471k7407M1406N9943K1196k0931l1096k3557J1615K2588K0640l3844R81
5635a0937r953K6188L5581k0199o2777k0844L6000N7973M7053l8818n1651j3228
5623b5612J9620j4190l7413K0656o247k4190j1959M6837N6782K8213j1220l0946
5611A0331k9733l2253k219L4556L7905m868q4354O55K2552j4353Q158q474j2639
5598g4736K1033J984L0601K7183j2277N475k7433J167N328K2424J4548J1964J6059
5585D3320j2663J5867m7459m2794R353P148K6669K7648k0136j7441J2911j938
$$ plain form
5672 -69275 -79372 -33240 -828 -14450 -17025 -33243 -46875 -22277 -10751 -1828 -4388 -17280
5660 -17280 2471 13575 14372 32622 974 1812 334 -12467 -23620 -247 17215 1481 -52471
5647 -52471 -79878 -38472 21471 42667 21736 -9360 -32917 -21302 1286 21926 -11918 -10937
5635 -10937 -20890 5298 40879 20680 -42097 -62941 -26941 31032 78085 39267 -12384 -25612
5623 -25612 -5992 -20182 -57595 -36939 -43186 -67376 -79335 -32498 24284 52497 41277 10331
5611 10331 -19402 -51655 -53874 -19318 18587 13719 -70635 -69980 -47428 -61781 -53623 -62097 -74736
5598 -74736 -53703 -51719 -21118 6065 -6212 -737 -28170 -27003 -21675 749 15297 27261 43320
5585 43320 30657 46524 -935 -43729 -34376 -27228 -559 27089 6953 -10488 2423 485
5573D85J4910M0009O410l5389k4565O389K2981l0766J5942J6420k8187j6142k5172
5560c6675j3021r796n84K4693K8859m793j3105K8396K5882L264p659N3446J4580
5547I3487l0267q954k6448j0315q381j0465m337J8919m110l2439j4621O936j7627
5534d8622L2067L6332L2607L6685R31j7316n4728j4855K8738L0095l5050n1270
5522b4386l463J8010K6593k7467j2099K6453J836l58N564J4161K6438Q643J5408
5509G5333l2815l0761l9069j6837K8649j6547j441n463j9537L1978K9156K1410
5497B4056l4404P612J3637j1302p953J7130J0536k1241j3321m8771m3749L3219
5485g4551J8694j5890K4056P0733K7036J036l1052k3582K625M178n0342j2882
$$ plain form
5573 485 15395 55404 61814 26425 1860 8249 31230 464 16406 32826 4639 -11503 -36675
5560 -36675 -49696 -59492 -60076 -35383 -6524 -11317 -24422 3974 29856 33120 25461 78907 93487
5547 93487 63220 54266 27818 17503 9122 -1343 -5680 13239 9129 -23310 -37931 -30995 -48622
5534 -48622 -16555 19777 52384 89069 90000 72684 17956 3101 31839 61934 26884 -24386
5522 -24386 -27849 -9839 16754 -10713 -22812 3641 5477 5119 10683 24844 51282 59925 75333
5509 75333 42518 11757 -27312 -44149 -15500 -32047 -33488 -38951 -58488 -26510 2646 24056
5497 24056 -10348 -2736 10901 -401 -8354 8776 19312 -1929 -15250 -64021 -107770 -74551
5485 -74551 -55857 -71747 -47691 23042 50078 51114 20062 -3520 -895 3283 -47059 -59941
5473e9941K3151J682j6997l0628k6724L6410M7292m896P746N6051J3139k6714
5461A9571J7293q672l6355Q055j497m12M47k1184k4262M4895L8714j4290m7152
5448b4849k8474J8452m01J6140J1355k1270k5668J6580Q46k1286j2343k3290j6837
5435a11045K7323L1885O906N87L488K54o721j7207J5385n70l0828q591J4187Q336
5421f6611L4648l3653j2359j8063K1580N7604n958m769J5183M609r684l3245k9258
5408g9976J3635L2011J2044K1261K9570Q807p897p1243k8487O12J4231j0807k029
5395f8268K3973o124K8618N1816K7995k7660k3599k1455J9513L9746l453l9859
5383A243Q68J4535m403J5584K2216j378j8742j7904n7324K3646M8245k6928n7156
$$ plain form
5473 -59941 -36790 -35108 -52105 -82733 -109457 -73047 -25755 -30651 -22905 33146 46285 19571
5461 19571 36864 28192 -8163 -108 -1605 -2017 -1570 -22754 -47016 -2121 36593 22303 -24849
5448 -24849 -53323 -34871 -35272 -19132 -7777 -29047 -54715 -38135 -37289 -58575 -70918 -94208 -111045
5435 -111045 -83722 -51837 -44931 -44344 -40856 -40602 -47323 -64530 -49145 -49715 -80543 -89134 -74947 -66611
5421 -66611 -31963 -65616 -77975 -96038 -74458 -16854 -22812 -27581 -12398 -7789 -17473 -50718 -79976
5408 -79976 -66341 -34330 -22286 -1025 28545 37352 29455 -41788 -70275 -69663 -55432 -66239 -68268
5395 -68268 -44295 -50419 -21801 30015 58010 30350 6751 -14704 4809 44555 41102 1243
5383 1243 2111 16646 12243 27827 50043 48665 29923 12019 -45305 -21659 26586 -342 -57498
5370e7498K3317K8934k1427k8504j9329M553J8455r987l4576j6697K0464L2557
5358e9738R841j2497L6147M6477N661L8772J4094j8824l3184J4183m3355j1987
5346a4410L7142j0112j3968k0010k7161p240P964k3680p307N0842J0830j9611
5334c6721M0380K1329l7061J2976N1811Q72j7598J3625J2292q85n8254k5272j1009
5321c3515m4597K0055P130n595L7840L2292K8264k5278m6296k4715O4259J3079
5309B2923n96k0456p762J5516R413K1873L4880K9062o1825m3607N708m2255j8143
5296e5269k7253k2392J8753J0729o818j2120K256K3009Q3230J9565k983o432m9125
5283b4850m1148M8877q788k8037J5570r294j9027M9888j3403o5853k4745Q511
$$ plain form
5370 -57498 -34181 -5247 -26674 -55178 -74507 -69954 -51499 -61486 -96062 -112759 -92295 -59738
5358 -59738 -49897 -62394 -26247 20230 25891 64663 78757 59933 26749 40932 -2423 -14410
5346 -14410 22732 12620 -1348 -21358 -48519 -55759 -47795 -71475 -78782 -27940 -17110 -36721
5334 -36721 3659 24988 -12073 903 52714 53586 35988 49613 61905 61020 2766 -22506 -33515
5321 -33515 -78112 -58057 -50927 -56522 -18682 13610 41874 16596 -29700 -54415 9844 22923
5309 22923 22327 1871 -5891 9625 19038 40911 75791 104853 43028 -579 5129 -37126 -55269
5296 -55269 -82522 -104914 -86161 -75432 -82250 -94370 -92114 -69105 14125 33690 30707 24275 -24850
5283 -24850 -65998 -17121 -25909 -53946 -38376 -47670 -66697 -16809 -30212 -96065 -120810 -112299
5271a12299N8015J8045k3884k1487l892K5362L0643k9213l792m3566j2683Q581
5259a10170M871J3018L1641O4581O027o420K7452n925k7358L1389O332n1340j3076
5246b8978M3577R789j2256J4809m7183l8264R391M6409K4243J6349K1348k958
5234E6276q675k3971P668L94k551M807J6078J769k6747o6619J8869M8171L038
5221B8507K6439J0201n732j0108k7078j4134J4606m807J9774J4112L2863j638
5209H3005l7835k391k9883k3068L7752J6006j4381k7366p572J4442M2242m86j9422
5196C1043o858j8214r199L9384k0079l0218K9158j1373K1924r17m421k8775k402
5183a0947n289j7634p563K379K9939j8049J384j903J5443M4701n011m5573k1446
$$ plain form
5271 -112299 -54284 -36239 -60123 -81610 -85502 -60140 -29497 -58710 -62502 -106068 -118751 -110170
5259 -110170 -105299 -92281 -60640 3941 9968 3548 31000 25075 -2283 29106 35438 -15902 -28978
5246 -28978 14599 24388 12132 26941 -20242 -58506 -49115 -2706 21537 37886 59234 56276
5234 56276 47601 23630 31298 31692 29141 33948 50026 51795 25048 -41571 -22702 25469 28507
5221 28507 54946 65147 59415 49307 22229 8095 22701 17894 37668 51780 84643 83005
5209 83005 45170 42779 12896 -10172 27580 43586 29205 1839 -5733 8709 50951 50465 31043
5196 31043 24185 5971 -3228 36156 16077 -14141 15017 3644 25568 24651 20230 -8545 -10947
5183 -10947 -16236 -33870 -41433 -39054 -9115 -27164 -25780 -27683 -12240 32461 27450 -18123 -39569
5170c9569K8809O225k9818l960Q064J2600j3962l192j7629K7050L2519P928R38
5157A6003q230O753j3703J008l8281J0384L9667L481q593j4025k0433l9664L023
5144f2610n104o050L4434L7360J5512J7576Q3j5760p071k3678J5752l786K1945
5131A8603J4534j55j5689l4535q733J1128J5954l9708J859l571K2842k9307J0357
5118c6421L9024k8897m7620L244L8778M141l1816L2190J6185K916j0130j7711
5106c6117K368L2910J8789n001l6194k3431j3667J7225L0038J4125L7564J6419
5094E5028k1328j4267m293J985l3535J3624L8191M613k2328L1829l1575p896P598
5081A7646m0905l8116o512j667j8398L6768M0543K4318J4243j8196Q028J7412
$$ plain form
5170 -39569 -10760 -4535 -34353 -38313 -30249 -17649 -31611 -34803 -52432 -25382 7137 15065 16003
5157 16003 7773 14526 823 1831 -36450 -26066 13601 17082 8489 -5536 -25969 -65633 -62610
5144 -62610 -67714 -73764 -39330 -1970 13542 31118 31201 15441 8370 -15308 444 -3342 18603
5131 18603 33137 32982 17293 -17242 -25975 -14847 1107 -38601 -36742 -40313 -17471 -46778 -36421
5118 -36421 2603 -26294 -73914 -70670 -31892 -27751 -59567 -27377 -11192 -8276 -18406 -36117
5106 -36117 -33749 -839 17950 12949 -23245 -46676 -60343 -43118 -13080 1045 38609 55028
5094 55028 33700 19433 15140 17125 -16410 -2786 35405 40018 17690 49519 17944 10048 17646
5081 17646 -23259 -61375 -67887 -69554 -87952 -51184 -10641 13677 27920 9724 17752 35164
5069C5164j6977M234k6325J579p866L3277L9059m6060k3766n935K5973K4444n2216
5056a5415M236L0517L8704l1446m4522l5811n181N4781O8577O842l2937j0928
5044B7417r067k2617L3355K5383N092j9853l0257l0052J6952n2766n265K2670
5032c9008K3038L2978J7218J0421m2909j9651N532O646L0687j1174j3021J0396
5020A1153j924Q213L519K8017l0158k205j6905j6441K7729m889l728j448K2696
5007B3629L0596l2335m6140k1308K5329J3824K826J614j5756l2456L6864P412
4995e901J8896k4331l6264j5949J7378J4428L729M769k2742j3013j1709J9549
4983e1160Q809P19j7534O548N0296L6822J3980L3505K8276l3043m7025o9820m320
$$ plain form
5069 35164 18187 22421 -3904 -2325 -10191 23086 62145 16085 -7681 -13616 12357 36801 -15415
5056 -15415 -11179 19338 58042 26596 -17926 -53737 -58918 -4137 64440 71282 38345 27417
5044 27417 18350 -4267 29088 54471 59563 39710 9453 -20599 -3647 -56413 -61678 -39008
5032 -39008 -15970 17008 34226 44647 1738 -17913 -12381 -5735 24952 13778 757 11153
5020 11153 9229 17442 20961 48978 18820 16615 -290 -16731 10998 6109 2381 933 23629
5007 23629 54225 21890 -24250 -45558 -20229 -6405 -3579 -1965 -17721 -50177 -13313 -5901
4995 -5901 12995 -11336 -47600 -63549 -46171 -31743 -28014 -23245 -45987 -59000 -70709 -51160
4983 -51160 -42351 -41632 -59166 -52618 -2322 34500 48480 81985 110261 77218 30193 -39627 -43947
4970d3947L7767J3703j9491r684k0582p698M8186J9728P555K5698l4354k8564
4958a1683K0979q626K6879j1646J2003M4152k0737m6982k2406m405J5724L7379
4946C0631K1022k5289m025l0342L765j4152M182P259l5357l9920m793J3465M523
4933f9031M3329K3270k8794L4111J1068l1628J1801M8931J5401J5778M55K3057
4921I7748l8557l2007j4694l0472J75N784K5096r7J472k2100j3356j2777L1147
4908b638r370j8685j4569l946L0916n549k8967L0344K7361P943M121k0894j8036
4895b1969n5432m750j0737j5783M6864L6052L752q500m4338l2704J9444L2061
4883e6040J0769j3826o472K3770L6003k8983l4274J5428p378j0171L239J5161
$$ plain form
4970 -43947 -6180 7523 -11968 -21652 -42234 -49932 -1746 17982 25537 51235 16881 -11683
4958 -11683 9296 670 27549 15903 27906 72058 51321 4339 -18067 -22472 -6748 30631
4946 30631 51653 26364 22339 -8003 -4238 -18390 -14208 -6949 -42306 -82226 -87019 -73554 -69031
4933 -69031 -25702 -2432 -31226 2885 13953 -17675 -5874 43057 58458 74236 74691 97748
4921 97748 59191 27184 12490 -17982 -17807 -12023 13073 12976 14448 -7652 -21008 -33785 -2638
4908 -2638 -12008 -30693 -45262 -49208 -18292 -23841 -52808 -22464 4897 12840 16961 -3933 -21969
4895 -21969 -77401 -82151 -92888 -108671 -61807 -25755 -22003 -30503 -74841 -107545 -88101 -56040
4883 -56040 -45271 -59097 -65569 -41799 -5796 -34779 -69053 -53625 -61003 -71174 -67935 -52774
4871e2774K2421l0022o254j1590l6959j7745K5839L0244N1192J6863K0383N06
4859A2104K1412j1506j4928k7279o864L7279K2039o1734l7929L5549J8874l4180
4847d7163K8521L5918j0000K7016O3596j2398j009j4998k6695m308K0329J7424
4835G6233L474l915K201j6398l5109L106l0215k3836R480k6890m0882L9708O629
4822c6414k8187J9023M1532L4613j8918O05J9678l4103j013J6676L0785j4336
4810B9941k4541m323o493r224L3630O3410k4804k7844J0904L0613L27l2202r768
4797B9626n5193k8520N546L4720p27J2140j0274K370L2471n698J4601j7654L1882
4784D5290J8153r919r032M9866M6171r1311n5354j2766n487k7424j529J6741O0166
$$ plain form
4871 -52774 -30353 -60375 -66629 -78219 -115178 -132923 -107084 -76840 -25648 -8785 11598 12104
4859 12104 33516 22010 7082 -20197 -27061 10218 32257 -29477 -67406 -31857 -12983 -47163
4847 -47163 -18642 17276 7276 34292 97888 85490 84481 69483 42788 38480 58809 76233
4835 76233 79707 75792 77993 61595 26486 29592 -623 -24459 -14979 -41869 -82751 -43043 -36414
4822 -36414 -64601 -45578 -4046 30567 11649 12254 31932 -2171 -3184 13492 44277 29941
4810 29941 5400 1077 -5416 -14640 18990 82400 57596 29752 40656 71269 71596 39394 29626
4797 29626 -25567 -54087 -48541 -13821 -14548 -2408 -12682 -10312 22159 16461 31062 13408 45290
4784 45290 63443 53524 44492 94358 140529 49218 -6136 -18902 -24389 -51813 -53342 -36601 23565
4771B3565r999k455K0494J0918q939m1330j5171o824k7219j4653J9529P0537O644
4758B5097m2256j621m699L0376O242l3270m252Q217R628k3683K2697L9787n459
4745B6804j348k862L9348j6549M142J3681j051j6000m5714l8428l1811K927L7145
4732b9716N6352r302j5769j3738L3313l871J4665p343l6262o925J4496Q48N658
4719B406J4435L4383L846j5535j534k9068l9278R328M2208J086m5277k8514L005
4706d8509j4070J5986J4758J7583p107N213M3381K4027n2521O351L1906L086k5546
4693A4538m0182J6338k2721k9899j8919N030N3500M141j103J0434L08r366J5776
4680b125L0268J5492J4163k6301o3273J6331L0050k221j5019K5007j7224p473
$$ plain form
4771 23565 13566 11111 31605 42523 33584 -7746 -22917 -29741 -56960 -71613 -52084 18453 25097
4758 25097 -17159 -18780 -23479 6897 13139 -20131 -24383 -16166 -6538 -30221 -7524 32263 26804
4745 26804 25456 22594 61942 45393 49535 63216 62165 46165 451 -37977 -69788 -66861 -29716
4732 -29716 26636 17334 1565 -12173 21140 17269 31934 24591 -11671 -18596 -4100 -3252 2406
4719 2406 16841 51224 55070 39535 38001 8933 -30345 -21017 21191 22277 -23000 -51514 -48509
4706 -48509 -62579 -46593 -31835 -14252 -21359 -16146 27235 51262 -1259 5092 36998 40084 14538
4693 14538 -25644 -9306 -32027 -61926 -80845 -75815 -22315 -18174 -19277 -8843 -8535 -17901 -2125
4680 -2125 28143 43635 57798 31497 -31776 -15445 14605 12384 -2635 22372 5148 -2325
4668b325k4940l0449k7292K7729N3034K4092j3344l4452k8994M4139J2347L524
4656C069m6086K7604n479m225K0839l0444R349O934J5841q486j9694P214K9597
4643F033J8510j7944m4321r074L5996R496j5274k1201j1679K3784j0944o079P886
4630c4811m810K1272M3179j256r122n0629J9231O2615K4591m9644P864j828m9591
4617b2939K3283j9025m8577K8907Q7304K4659l6656J6159K3961l5095k6555j5860
4605d34k4760n5876J0122M502j7412L0674M0805N4745j705j4050o946J5737o380
4592B9022J758J379k7461o678j1068j0907M3997J6066l6214j0848K039M5068K168
4579C8321r727l458K5492N3631l5001p8249j7602K059J8105J9134j0080r057J0510
$$ plain form
4668 -2325 -27265 -57714 -85006 -57277 -4243 19849 6505 -27947 -56941 -12802 -455 3069
4656 3069 -43017 -15413 -20892 -25117 -4278 -34722 -25373 -18439 -2598 -11084 -30778 -23564 6033
4643 6033 24543 6599 -37722 -46796 -10800 -1304 -16578 -37779 -49458 -25674 -36618 -42697 -34811
4630 -34811 -39621 -18349 24830 23574 14452 -36177 -16946 45669 70260 20616 28480 26652 -22939
4617 -22939 344 -18681 -67258 -38351 48953 73612 36956 53115 77076 41981 15426 -434
4605 -434 -25194 -81070 -70948 -66446 -83858 -53184 -12379 42366 40661 26611 19665 35402 29022
4592 29022 30780 32159 4698 -1980 -13048 -23955 20042 36108 -106 -10954 -8915 36153 38321
4579 38321 28594 25136 50628 104259 69258 -8991 -26593 -24534 -6429 12705 2625 -6432 4078
4566D078P423R631j6312N331j0785j9429L0084K984k275K9993j0274k9962L764
4553D251l729O991k3017M509K9811K2135j3540j7423l744J2598l0001Q384m578
4540g353J6593j1242M761j9311m5995j1447O7142N2507k124l0592k5713m0887
4528e3661Q640J3025k6551l7646j5696J5393N478L3320O481k8566L17L2792p991
4515e4665K3852O3547j1677m21K1110j7917j9164O862j6958J8452O7707p0598
4503A0130m6334J5119m30L824K6356P188J293J3761k1755m8491j786M8232M057
4490A1164j7464m749k9842K5521j2175J3123L6021m244k2377J9379k0796K0129
4478A3690q14k589K19j8568o7371M8673K3943J7628K3072k7440m4480J1180N2341
$$ plain form
4566 4078 11501 21132 4820 10151 -634 -20063 10021 13005 10730 40723 30449 487 4251
4553 4251 522 7513 -15504 -10995 18816 40951 27411 9988 6244 18842 -11159 -2775 -7353
4540 -7353 9240 -2002 2759 -16552 -62547 -73994 -6852 45655 43531 12939 -12774 -53661
4528 -53661 -45021 -31996 -58547 -96193 -111889 -96496 -91018 -57698 -51217 -79783 -79466 -46674 -54665
4515 -54665 -30813 32734 21057 20636 41746 23829 4665 11527 -5431 13021 80728 10130
4503 10130 -36204 -21085 -21515 -17691 8665 15853 17146 30907 9152 -39339 -41125 7107 11164
4490 11164 -6300 -11049 -40891 -15370 -27545 -14422 21599 17355 -5022 14357 -6439 13690
4478 13690 12876 10287 10506 -8062 -75433 -26760 -2817 14811 37883 10443 -34037 -22857 29484
4465B9484K6653K1299j8211l5074n4097m4139j9235M263n348P959p989J5997L0102
4452d8336O1080k25O73j4136L4676n435o9716k7796L7072L7607J6276m1680l4907
$$ plain form
4465 29484 56137 77436 59225 24151 -29946 -74085 -93320 -89057 -94405 -86446 -94435 -78438 -48336
4452 -48336 12744 12519 13192 -944 33732 28297 -41419 -69215 -32143 5464 21740 -19940 -54847
$$ [...]
##END NTUPLES=NMR SPECTRUM
##END=
