##TITLE=Analysis number 322228
Compound Code cc 49602
Book Reference 449/150
Project Code adrs
Chemist Name davee
##JCAMPDX= 6.0         $$ Bruker NMR JCAMP-DX V2.0
##DATA TYPE= NMR SPECTRUM
##DATA CLASS= NTUPLES
##ORIGIN= Bruker BioSpin GmbH
##OWNER= nmr
$$ XWIN-NMR		Version 3.5
$$ Mon Sep 18 11:58:54 2006 GMT Daylight Time (UT+1h)  MAYBRIDGE\nmr@NMR_250MHZ
##.OBSERVE FREQUENCY= 250.131544655141
##.OBSERVE NUCLEUS= ^1H
##.ACQUISITION MODE= SIMULTANEOUS (DQD)
##.ACQUISITION SCHEME= undefined
##.AVERAGES= 16
##.DIGITISER RES= 18
##SPECTROMETER/DATA SYSTEM= dpx250
##.PULSE SEQUENCE= zg30
##.SOLVENT NAME= CDCl3
##.SHIFT REFERENCE= (INTERNAL, CDCl3, 0, 16.522)
##AUDIT TRAIL= $$ (NUMBER, WHEN, WHO, WHERE, WHAT)
$$ ##TITLE= Audit trail, XWIN-NMR		Version 3.5
$$ ##JCAMPDX= 5.01
$$ ##ORIGIN= Bruker BioSpin GmbH
$$ ##OWNER= nmr
$$ C:\u/data/dgb/nmr/ADRS/940/pdata/1/auditp.txt
$$ ##AUDIT TRAIL=  $$ (NUMBER, WHEN, WHO, WHERE, WHAT)
(   1,<2006-09-18 11:58:30.37 +100>,<MAYBRIDGE\nmr>,<NMR_250MHZ>,
      <created by zg, POWCHK disabled, PULCHK disabled
       configuration hash MD5:
       E2 DF 36 D8 04 B2 41 60 5A D7 A3 38 5A 4B D0 FE
       data hash MD5: 64K
       38 F1 F4 52 A5 A0 60 52 93 0E 21 2E 3E 9F C3 1B>)
(   2,<2006-09-18 11:58:44.40 +100>,<MAYBRIDGE\nmr>,<NMR_250MHZ>,
      <Start of raw data processing
       ef LB = 0.3 FT_mod = 6 PKNL = 1 SI = 32K 
       data hash MD5: 32K
       92 74 17 05 0C F0 AC 4D 16 06 E5 84 C2 3E 33 00>)
(   3,<2006-09-18 11:58:46.20 +100>,<MAYBRIDGE\nmr>,<NMR_250MHZ>,
      <apk 
       data hash MD5: 32K
       58 AD F9 5B 30 08 08 A6 3E 62 15 09 CB 3A 55 2C>)
(   4,<2006-09-18 11:58:47.00 +100>,<MAYBRIDGE\nmr>,<NMR_250MHZ>,
      <abs ABSG = 5 
       data hash MD5: 32K
       DB C7 A2 DF C4 15 45 8A F3 02 D8 80 2F 9F D6 27>)
$$ ##END=
$$ 
$$ hash MD5
$$ 2E D9 34 2D 72 BE CC 25 04 47 77 99 0E 9D C4 5F
##$RELAX= 
##$RELAX= 
##$RELAX= 
##$RELAX= 
##$RELAX= 
##$RELAX= 
##$RELAX= 
$$ Bruker specific parameters
$$ --------------------------
##$DU= <C:\u>
##$EXPNO= 940
##$NAME= <ADRS>
##$PROCNO= 1
##$TYPE= <nmr>
##$USER= <dgb>
##$AMP= (0..31)
100 100 100 100 100 100 100 100 100 100 100 100 100 100 100 100 100 100 
100 100 100 100 100 100 100 100 100 100 100 100 100 100 
##$AQSEQ= 0
##$AQ_mod= 3
##$AUNM= <au_zg>
##$AUTOPOS= <33 >
##$BF1= 250.13
##$BF2= 250.13
##$BF3= 250.13
##$BF4= 250.13
##$BF5= 500.13
##$BF6= 500.13
##$BF7= 500.13
##$BF8= 500.13
##$BYTORDA= 1
##$CFDGTYP= 0
##$CFRGTYP= 5
##$CHEMSTR= <none>
##$CNST= (0..31)
1 1 145 1 1 1 1 1 1 1 1 1 1 1 1 1 1 1 1 1 1 1 1 1 1 1 1 1 1 1 1 1 
##$CPDPRG= <>
##$CPDPRG1= <>
##$CPDPRG2= <>
##$CPDPRG3= <>
##$CPDPRG4= <mlev>
##$CPDPRG5= <mlev>
##$CPDPRG6= <mlev>
##$CPDPRG7= <mlev>
##$CPDPRG8= <mlev>
##$CPDPRGB= <>
##$CPDPRGT= <>
##$D= (0..31)
0 1 0 0 0 0 0 0 0 0.06 0 0 0 0 0 0 0.0002 0 0 0 0 0 0 0 0 0 0 0 0 0 0 
0 
##$DATE= 1158577109
##$DBL= (0..7)
120 120 120 120 120 120 120 120 
##$DBP= (0..7)
150 150 150 150 150 150 150 150 
##$DBP07= 0
##$DBPNAM0= <>
##$DBPNAM1= <>
$$ [...]
##$SUBNAM7= <"">
##$SUBNAM8= <"">
##$SUBNAM9= <"">
##$SW= 20.6930455092707
##$SWIBOX= (0..15)
0 0 3 0 0 0 0 0 0 0 0 0 0 0 0 0 
##$SW_h= 5175.983436853
##$TD= 65536
##$TD0= 1
##$TE= 295.16
##$TE2= 300
##$TE3= 300
##$TEG= 300
##$TL= (0..7)
0 120 120 120 120 120 120 120 
##$TP= (0..7)
150 150 150 150 150 150 150 150 
##$TP07= 0
##$TPNAME0= <>
##$TPNAME1= <>
##$TPNAME2= <>
##$TPNAME3= <>
##$TPNAME4= <>
##$TPNAME5= <>
##$TPNAME6= <>
##$TPNAME7= <>
##$TPOAL= (0..7)
0.5 0.5 0.5 0.5 0.5 0.5 0.5 0.5 
##$TPOFFS= (0..7)
0 0 0 0 0 0 0 0 
##$TUNHIN= 0
##$TUNHOUT= 0
##$TUNXOUT= 0
##$USERA1= <user>
##$USERA2= <user>
##$USERA3= <user>
##$USERA4= <user>
##$USERA5= <user>
##$V9= 5
##$VALIST= <valist>
##$VCLIST= <CCCCCCCCCCCCCCC>
##$VD= 0
##$VDLIST= <DDDDDDDDDDDDDDD>
##$VPLIST= <PPPPPPPPPPPPPPP>
##$VTLIST= <TTTTTTTTTTTTTTT>
##$WBST= 1024
##$WBSW= 4
##$XGAIN= (0..3)
0 0 0 0 
##$XL= 0
##$YL= 0
##$YMAX_a= 438911
##$YMIN_a= -545965
##$ZGOPTNS= <>
##$ZL1= 120
##$ZL2= 120
##$ZL3= 120
##$ZL4= 120
##$ABSF1= 16.522
##$ABSF2= -4.171173
##$ABSG= 5
##$ABSL= 3
##$ALPHA= 0
##$AQORDER= 0
##$ASSFAC= 0
##$ASSFACI= 0
##$ASSFACX= 0
##$ASSWID= 0
##$AUNMP= <proc_1d>
##$AZFE= 0.1
##$AZFW= 0.1
##$BCFW= 0
##$BC_mod= 0
##$BYTORDP= 0
##$COROFFS= 0
##$CY= 12.5
##$DATMOD= 1
##$DC= 0
##$DFILT= <>
##$DTYPP= 0
##$F1P= 14.0000005364418
##$F2P= -0.99999901652339
##$FCOR= 0.5
##$FTSIZE= 32768
##$FT_mod= 6
##$GAMMA= 0
##$GB= 0
##$INTBC= 1
##$INTSCL= 1
##$ISEN= 128
##$LB= 0.3
##$LEV0= 0
##$LPBIN= 0
##$MAXI= 10000
##$MC2= 0
##$MEAN= 0
##$ME_mod= 0
##$MI= 0
##$NCOEF= 0
##$NC_proc= -3
##$NLEV= 6
##$NOISF1= 0
##$NOISF2= 0
##$NSP= 0
##$NTH_PI= 0
##$NZP= 0
##$OFFSET= 16.522
##$PC= 1
##$PHC0= 144.9651
##$PHC1= 5.201808
##$PH_mod= 1
##$PKNL= yes
##$PPARMOD= 0
##$PSCAL= 4
##$PSIGN= 0
##$REVERSE= no
##$SF= 250.13
##$SI= 32768
##$SIGF1= 0
##$SIGF2= 0
##$SINO= 400
##$SIOLD= 32768
##$SREGLST= <1H.CDCl3>
##$SSB= 0
##$STSI= 32768
##$STSR= 0
##$SW_p= 5175.98343685301
##$SYMM= 0
##$S_DEV= 0
##$TDeff= 65536
##$TDoff= 0
##$TI= <Analysis number 999999
Compound Code 99
Book Reference 9
Project Code 9>
##$TILT= no
##$TM1= 0
##$TM2= 0
##$TOPLEV= 0
##$USERP1= <user>
##$USERP2= <user>
##$USERP3= <user>
##$USERP4= <user>
##$USERP5= <user>
##$WDW= 1
##$XDIM= 32768
##$YMAX_p= 508430846
##$YMIN_p= -67042
$$ End of Bruker specific parameters
$$ ---------------------------------
##NTUPLES= NMR SPECTRUM
##VAR_NAME=  FREQUENCY,     SPECTRUM/REAL,   SPECTRUM/IMAG
##SYMBOL=    X,             R,               I
##VAR_TYPE=  INDEPENDENT,   DEPENDENT,       DEPENDENT
##VAR_FORM=  AFFN,          ASDF,            ASDF
##VAR_DIM=   32768,         32768,           32768
##UNITS=     HZ,            ARBITRARY UNITS, ARBITRARY UNITS
##FACTOR=    0.157963299565203, 1,           1
##FIRST=     4132.6476996994, 0,             0
##LAST=      -1043.33573715361, 0,           0
##MIN=       -1043.33573715361, -67042,      0
##MAX=       4132.6476996994, 508430846,     0
$$ Real data points
##PAGE= N=1
##DATA TABLE= (X++(R..R)), XYDATA
$$ [...]
16795B1836L066j1916k1518r184q150O505j9932m270j698q905J0893M898J4524
16782b3851l88j1297O10L1315J8463j0673j3367k83q626k751q808J0435K1758
16769B537j3925j1582J5753K61k209P991M145k391j0656O878m017O907L542k5494
16755b2260O850K020n78j0144J3183O703Q450J8308j3783j3498K786M407J1530
16742A3974j6478k4274K1391L655k9829N16K2970L561k03j2165P410l112J1782
16729h02m716P551j7476l0222M16N400J3770N699J0246o895J0401j3544k223J3627
16715h768J5850j6300j1009Q092L205P315L973j767o74Q599o378k0539j2031Q709
16701b1723K0476M524J7656j3946q845j5181k3533K75N344J3915R181n773N639
$$ y = [21836, 24902, 12986, -8532, -17716, -25866, -19361, -39293, -43563, -45261, -54166, -43273, -38375, -23851, -24239, -35536, -34926, -3611, 14852, 4179, -9188, -9471, -18097, -20848, -29656, -19221, 2537, -11388, -22970, -7217, -6956, -9165, -1174, 2971, 580, -10076, -3198, -7215, -308, 3234, -22260, -15410, -13390, -13968, -24112, -10929, -4226, 4224, 22532, 8749, -4749, -1963, 2444, 13974, -2504, -26778, -5387, -1732, -31561, -31045, -8075, -4514, -4717, -16882, -9472, -12584, -802, -5518, 2033, -15443, -45665, -45249, -39849, -26079, -20380, -10134, -17029, -6628, -20172, -22395, -8768, 7082, -9218, -20227, -12135, -8930, -1615, 2358, 591, -83, 8516, 2138, -18401, -30432, -21723, -1247, 3277, 20933, 6987, -1858, -17039, -40572, -40297, -34953, -21038, -11857, -17630, -11991]
16688a1991j2635j0153J4636n491P83l59K296J1342J2856K43j6934Q095J1671
16675D359j1532r269q572j9429K281O842J1644n899o425P883J192P971O300K4308
16661A1654K5790j0790l0822j9134Q038Q825r160K7J3573K5115k2852j909O458
16648D813O999k142j2803k6932k6220o655L9741L7012j1975k2383j1604J975O860
16635b3314N320J1365P861O829q826n509J905k930N130q785k017J19K016j2249
16621b3085L535J3185l752O333J3974J3922j5105o906J125J5985j336j6199n675
16608c999R726Q901L664J8398k1726j4677p099O178O8J1874M808l2950P852J5764
16594F782K544q240q557M833J4601J1037o04o253P776J8568j794r786J94r942
$$ y = [-11991, -24626, -34779, -20143, -25634, -24851, -25210, -22914, -11572, 1284, 1527, -15407, -7312, 4359, -7173, -16442, -25014, -44443, -42162, -35320, -23676, -29575, -36000, -28117, -26925, -18954, -12654, 11654, 37444, 26654, -4168, -23302, -15264, -6439, -15599, -15572, -1999, 23116, 264, -1645, 4813, 11812, 9670, -3133, -30065, -56285, -62940, -23199, 13813, 1838, -20545, -32149, -30174, -23314, -17994, -6629, 1232, 8061, -765, -6274, -4369, -7299, -2169, -10954, -12971, -12852, -10836, -23085, -19550, -6365, -10117, -3784, 10190, 24112, 9007, 2101, 3226, 19211, 17875, 1676, -3999, 5727, 14628, 18292, 36690, 14964, 287, -6812, -634, -566, 11308, 16116, -16834, -8982, 6782, 9326, 1086, -7471, -2638, 11963, 23000, 22396, 16143, 23919, 42487, 40693, 30907, 31101, 21159]
16580B1159n472j7399k4472l2548J8592L0893K5404R056r095q409k3985j1289
16568b7565P164J1987n998j065j5345p616l134j0671K1917J5966p935K291M193
16555a5811j309M599R857J1902J3112j0834k8250L685K1276K930n417j1277n383
16542a0920p581k87J3612m146j1238J7919Q057j4214j4285j206L538n008J1144
16529a4615L015k610j2907r147N64J8993J5628k763q075K214J170L279L993j4114
16515a5375j2595M852J5963J2017o46n563p409Q428L854m259j9556j5272Q602
16502b6959O595m597n966Q414M620J6181m12m121J9002L038j5494k3342j9938
16489d2979M343J0320N264J2547L453j29k537M928j3902O691l512j0655N953n908
$$ y = [21159, 15687, -1712, -26184, -58732, -40140, -9247, 16157, 25213, 16118, 7709, -16276, -27565, -20401, -8414, -14412, -15477, -30822, -38438, -41572, -52243, -30326, -14360, -22295, -20004, -15811, -17120, -12521, -2664, 9238, 22350, 11516, -16734, -13049, 8227, 11157, 5740, -5537, -10920, -18501, -18788, -5176, -9322, -20560, -2641, 5416, -8798, -23083, -24289, -20751, -25759, -14615, -11600, -14210, -27117, -36264, -35700, -16707, -1079, -3842, -11917, -9703, -8533, -5254, -1261, -15375, -27970, -23118, -7155, 4862, 4216, -1347, -8756, -328, 3526, -733, -20289, -35561, -26959, -20364, -24961, -30927, -22513, -17893, -1712, -2124, -6245, 12757, 15795, 301, -23041, -42979, -38636, -28316, -23052, -10505, -7052, -7181, -9718, -4790, -18692, -12001, -15513, -26168, -20215, -26123]
16475b6123j0662L32N225Q140K087q08j0147l858K1379J0268j7172O944J9132
16462D737n770j9765p200j3671j3456q127J3238J2765N344R801J9882o972j3417
16449b2611N697m213J0093l637p443J8852J5279O054m481o594m630L081j4016
16436h569j4277O083N263j3377j7573r336J5202J8862n853j494r98K714K7160
16423C807J8448j0618k5429j7192P881j529J0466o871j7710p472R961o084r279
16410e1621K1395K3570q888p141J486o85O905J068L657j1360J5562Q308J0940
16397A3196p592k1194k166K499O043J8005j3103k0061r339p468M838J815P28o578
16383d0377K1036J0078J2669R925J3735R713j3288l6606q579J7841J1307j6665
$$ y = [-26123, -36785, -36453, -31228, -23088, -21001, -21809, -31956, -35814, -14435, -4167, -21339, -14395, 4737, -1033, -20798, -27998, -41669, -55125, -63252, -50014, -37249, -31905, -22104, -2222, -9194, -22611, -16914, -21127, -11034, -14671, -22114, -3262, 12017, 18071, 13590, 6996, 2366, 5447, -8569, -22846, -16763, -11500, -24877, -42450, -51786, -36584, -17722, -23575, -25069, -26067, -23353, 3807, 22255, 11637, -13792, -30984, -23103, -24632, -14166, -21037, -38747, -46219, -36258, -42342, -51621, -30226, -6656, -15544, -22685, -21199, -21884, -14979, -13911, -10254, -21614, -6052, 2256, 13196, 5604, -15590, -17756, -15257, -9214, 8791, -4312, -24373, -33712, -41180, -36342, -34527, -33799, -40377, -19341, -9263, 3406, 13331, 27066, 36779, 23491, -13115, -21694, -3853, 7454, -9211]
16371i211j6207j7962m263J5066q457n588O923K58P660O735O10K2839J3960J440
16357A3803j556k4440j8835N091j963J7358J6022j4777q899n472J8664R492j3667
16344i179L46J84r617J8024J793j265l247J0479R809j764m167o684j9215m523
16330a9026K104J2255J7255J0845P407j3726k6850o520P658P923l100o775q417
16317a8967N276J6528J044o98Q140r713k2537j4245n495m79k565J3402p532K2748
16303a5093m535R009l23p929l059J924J7734L798l47p796q055L454J1074j0626
16289a0770o912J8933k405j3438k1855K138J4378O704J6892r989n648K697j2666
16276b1941l889J1582n205j0419K047J6816K1828Q060j8151m2684m54J9855J704
$$ y = [-9211, -25418, -43380, -47643, -32577, -41034, -46622, -39699, -39441, -31781, -25046, -24436, -1597, 12363, 13803, 12247, -12193, -31028, -25937, -27900, -10542, 5480, -9297, -18196, -23668, -5004, 4488, -9179, -8833, -8649, -18266, -242, 1551, 286, -2961, 7518, 17327, 15563, 11396, 4712, -14503, -19026, -16922, -4667, 12588, 23433, 30840, 17114, -9736, -16256, -8598, -675, -3775, -10550, -18967, -13691, 2837, 3881, 3183, 11323, 1610, -20927, -35172, -40667, -41146, -43711, -30309, -37841, -15093, -19628, -10619, -10942, -18871, -21930, -20006, -2272, 1526, 1179, -6617, -14672, -11218, -144, -10770, -17682, 1251, -1154, -14592, -36447, -34309, -19931, -13227, 3665, -6324, -11972, -9275, -21941, -25830, -14248, -19453, -29872, -27825, -11009, 10819, 18879, 728, -41956, -42410, -22555, -20851]
16263b0851N396J0042P043K949L955K954r580r35J0380j0084J150J4385P975N734
16249C0513j1838Q97n937n694M458K940j2538j1667l633J2186j8278j0565J0239
16236a8917K1464P282J2145O325j0982j3927J2571k2117k8589j2432K622P743
16224c6812J2241K685J9984Q441R798q492j189o555j3299n844p907j58N438K0807
16210h62m789j3564J553j665K2739R516j2034l648Q653l579p956j3942L135O582
16196i861J7205P24o786J592j23j1666K447j51j2965j9437r276J165K5110J9944
16182b078q040l1139M428K1233k839m740O264P684K2711J5244j2296m36l343j9752
16168g099P323k753M22P124j1485j4043j8756k802K0038R758L734k500Q187j66
$$ y = [-20851, -15455, -5413, 1630, 4579, 8534, 11488, 1908, 973, 11353, 1269, 2419, 16804, 24779, 30513, 18675, 19572, 13635, 7941, 12399, 15339, 2801, -8866, -12499, -313, -18591, -29156, -18917, 2547, 9829, 21974, 28299, 17317, 3390, 15961, -6156, -34745, -47177, -44555, -36812, -24571, -21886, -1902, 6539, 16337, 7845, 6656, 101, -13198, -19042, -26949, -27107, -21669, -862, -5651, -19215, -17662, -19327, 3412, 12928, 894, -2754, 5899, 2320, -5636, -19578, -16443, -9861, 7344, 8068, 1282, 2874, 2751, -8915, -6468, -6619, -19584, -39021, -48297, -47132, -22022, -2078, -10118, -41257, -36829, -15596, -18435, -23175, -16911, -9227, 13484, 28728, 16432, 15996, 12653, -7099, 224, -2529, -2107, 5017, -6468, -20511, -39267, -42069, -22031, -12273, -8539, -11039, -2852, -3018]
16154c018l007j7133j0344N161R12J172O796o071J5961J0429m484k0666m22j624
16140b6338r324J3473J1936M399R163j1639r045J8715J452p163L1m303J2544p0
16126C831j8361m936J5598n001r222K09L136r379O147m872M938r368n024K2337
16112i967J1092m588k5215o744P643J4140j0373j8226M326p901N105m182Q866
16099c6024J203Q308K0924J2828j5060k3306M852K766m844j6486J3860J9608J349
16086a0022l983j523m358m698j2560K3590J4053k2313q817J036J5603J326p288
16073a9954M064J4013l748m300j6503J4805J9202P933K454k1943j0617k116n555
16060b2265Q787J0631p605m241O64O50P929J2443R243r862j9317p479l340K012
$$ y = [-3018, -6025, -23158, -33502, -28341, -27429, -26257, -19461, -25532, -9571, 858, -3626, -24292, -24714, -26338, -35662, -22189, -10253, -5854, 3309, -8330, -17375, 1340, 2792, -4371, -4340, -8643, 3901, 3831, -14530, -19466, -3868, -8869, -18091, -17882, -14746, -24125, -17978, -22850, -17912, -27280, -32304, -9967, 1125, -3463, -28678, -35422, -27779, -13639, -24012, -42238, -37912, -45813, -40708, -44890, -36024, -34821, -26513, -5589, 7239, -7821, -31127, -26275, -23509, -28353, -44839, -30979, -11371, -10022, -14005, -15528, -19886, -24584, -37144, -13554, 499, -21814, -30631, -29595, -13992, -12666, -19954, -15890, -1877, -5625, -9925, -26428, -11623, 7579, 15512, 17966, -3977, -14594, -16710, -22265, -13478, -2847, -10452, -14693, -14029, -13379, -5450, 6993, 16236, 6374, -12943, -20422, -23762, -21750]
16046b1750J0762R502J355q250n930J1179q52p621J0940J185N241n437K225R179
16032A1728j7567j2395J0893L328n599P636J1061J2299r594M31Q752Mo989j5637
16018a649m537J3046m141j0942j2782n592q775p305J1006l196P931J6185q398
16005a9149J161J8235R217M669k5194j9500K28K660J4676k112k0946k197O002
15992c2250J5437Q857P954K384j5740k6653J6841j458Q159J9074j1349k01j736
15979a0681p797J0285R649J2865j2937n582l852R462j87n603j4353q204k1161
15966d8096q924J6367M170J7825K6694o787r391O28J1717q144j8968p354O352
15953b3911M920J8118N90L87J437M219j17P849J4823j3894p447r285r95P298M681
$$ y = [-21750, -10988, -1486, -131, -8381, -14311, -3132, -3984, -11605, -665, 520, 5761, 324, 2549, 11728, -5839, -18234, -7341, -4013, -9612, -1976, 9085, 21384, 11790, 12221, 20973, 20977, 13988, -1649, -6186, 6860, 2719, -8223, -21005, -26597, -35372, -42677, -31671, -34867, -26936, -10751, -19149, -17988, 247, 9464, 14133, -11061, -30561, -30333, -27673, -12997, -15109, -36055, -38252, -32250, -16813, -7956, -2, 2382, -13358, -40011, -23170, -24628, -16469, 2605, -8744, -8945, -10681, -18478, -8193, 1456, 14321, 1384, -4198, -8050, 1412, 1225, -4378, -18731, -26935, -48096, -57020, -40653, -36483, -18658, 8036, 1249, -8142, -7514, 4203, -3941, -22909, -30263, -23911, -18991, -873, -283, 104, 1541, 5760, 5643, 13492, 28315, 14421, 6974, -2311, -3306, 3992, 8673]
15938H673L501j9730m902J506m41N769N353M299j7405o334Q460N615J6844p443
15924C765m611P08k620K209j3858R835J678j9247j0073Q740N243P688m142j5644
15910c0329j8151Q834J8835J4181p631j2363k65j895M695O913J3242j126j3089
15897a8149L936Q0J0896Q408r611o139r724k00J4172K644m912j1309K209J3832
15883c867m596q138j0296j0944P764J40P836n976J535k66o463K1795L730j0706
15869a8452p949K2750k87J651R729K5502J2144j2731n981j2049j6596J0291m063
15856C959O526R17p64l223Q819Q001n23j3919k42j508p53r786r83O259o265n382
15840h867J3290M045M740l414Q043M062r574j1073j252m637j8601j2379o70K158
$$ y = [8673, 12174, -7556, -12458, -10952, -11393, -5624, -271, 4028, -13377, -19711, -11251, -5636, 11208, 3765, -846, -138, -2758, -549, -14407, -4572, -2894, -22141, -32214, -23474, -18231, -10543, -14685, -30329, -48480, -39646, -20811, -6630, -14261, -26624, -26889, -28784, -24089, -17176, -3934, -5060, -18149, -14213, -14133, -3237, 5171, -4440, -10579, -20303, -20503, -6331, -3687, -8599, -19908, -17699, -3867, -8463, -16601, -26897, -37841, -30077, -29937, -22101, -28077, -26542, -26808, -33271, -11476, -7746, -18452, -26401, -3651, -3938, -2287, 7442, 32944, 45088, 32357, 26376, 14327, -2269, 8022, 3959, 10485, 11402, 10638, 7415, 16234, 24235, 23712, 9793, 9551, 8043, 7290, -2496, -3479, 2780, -3485, -8867, 4423, 8468, 13208, 9794, 17837, 21899, 12325, 1252, 0, -4637, -23238, -35617, -36287, -34129]
15826c4129k0760J5575K6216L496O226j8750j1637N975L811J1617P167L184R427
15813G418j0430N829N391n291j443j2076m305K726L1501k353r640N562o827o909
15799h47J031j611Q136J8101r960r002k307r958j209J5733j4259k1550J8261J0259
15785H18m514Q648p851k1321O541J0587P7k934j242M92n655M60J4804j609j3430
15770a6129K4185Q145o34J192j0283r682r702m952q580o96J0430P043O172L763
15756B72J494M224M663j23j6341j31J886l406m677M653r093K567L426p184j1166
15741b8936N907k151Q785l866m623J0600Q94J0980Q242P773L22m552l118l554
15727B703l038j5503j580J2781J2045j068q507K408r542K0061Q972n056l545q81
$$ y = [-34129, -54889, -39314, -13098, -9602, -3376, -22126, -33763, -27788, -23977, -12360, -5193, -2009, 7418, -3012, 2817, 8208, 2917, 1474, -10602, -14907, -12181, 19320, 16967, 7327, 12889, 6062, -847, 184, -1427, 6709, 24810, 14850, 5848, 3541, -6417, -7626, 8107, -6152, -27702, -9441, 818, -3696, 4952, -2899, -24220, -17679, -7092, -7015, -9949, -11191, -10699, -16354, -15894, -1090, -2699, -16129, 8056, 16201, 15567, 16759, 6476, -3206, -12908, -17860, -26440, -27136, -16706, -9663, -3491, 272, 1766, 5990, 10653, 10530, -5811, -5942, -4056, -7462, -12139, -7486, -16579, -14012, -10586, -17770, -28936, -23029, -25180, -16395, -20261, -24884, -14284, -13390, -2410, 5832, 13605, 13927, 9375, 6257, 2703, -335, -15838, -17418, -4637, 7408, 6340, -2167, 241, -9301, 10760, 19732, 14676, 11131, 10250]
15713A0250J5978r045j5169j8019l976j275R479J148k112J6095R086J0955P192
15700C0587p336r621k270R161m767k4008n082M128R921R504k6646m0185J4703
15687d1911J5233j015k752l477M507R976O733M735M781j7042j0479J8892m506
15674a6325j7242j031K0671J3538K7195k034l2074k4907o600K5314j81j9875o871
15661d0422R274K1453R347r429J5247J664J079J0224n99P4n189m481r805K516
15647I53O093j8408j4549J6178J5064m918k90J9977L773M021j7354n461r440o322
15633a0683q169r20R875j5518J744J3129M642l589j5561j0333L143m579P079J984
15619b7756r065k0161k135K304L158J3886Q369L226J9119o311J225J4767o820
$$ y = [10250, 26228, 17183, 2014, -16005, -19981, -21256, -11777, -10629, -12741, 3354, 12440, 23395, 30587, 23251, 13630, 11360, 20521, 15754, -8254, -13336, -9208, 713, 10217, -16429, -56614, -41911, -26678, -27693, -30445, -33922, -29415, -19439, -12706, -7971, -3190, -20232, -30711, -11819, -16325, -33567, -34598, -13927, -389, 26806, 24772, -7302, -32209, -38809, -13495, -13676, -33551, -40422, -31148, -9695, -348, -9777, 5470, 7134, 8213, 18437, 17838, 17912, 12723, 8242, -1563, 953, 7046, -11362, -25911, -9733, 5331, 413, 123, 20100, 23873, 27894, 10540, 5079, -4361, -10683, -18852, -19772, -9897, -25415, -23671, -10542, -5900, -9489, -25050, -35383, -32240, -36819, -29740, -27756, -36821, -56982, -59117, -56813, -53655, -39769, -31400, -28174, -9055, -15366, -14141, 626, -6194]
15606f194O600j1998L427J2420R408j4144n166j0445k833N544J63r314q293n991
15592c6816L364l690L346P437j681n560J0077R030j0137r870J5681J2358R372
15579B911n268K300j2525J494o323j3670K575N287k532m604n337K229L287j984
15565c2160P650J0644R579k2714m681N230J2591J4914M342N54L085j6477l69m371
15551a2183P260Q710R862j1215o442m570M928r385j8718J0780J1537j0720J7419
15538b737N444k5819j933K2583m978j4893l840l923J0264J8304J1028K366M987
15525A6853R0r816L554P345m452l3940k232P336k722K3036K0074j884k2762r760
15511i280J259N268Q198l628l779j7117R737P631R1L654N200o122O617K270j3918
$$ y = [-6194, 406, -11592, -8165, 4255, 13663, -481, -5647, -16092, -18925, -13381, -13218, -22532, -30825, -36816, -33452, -37142, -33796, -26359, -28040, -33600, -23523, -14493, -24630, -34500, -18819, -6461, 2911, -2357, -57, -12582, -11088, -17411, -31081, -28506, -23219, -25751, -30355, -35692, -33463, -30176, -32160, -24510, -13866, -4287, -27001, -31682, -26452, -13861, 1053, 5395, 5949, 9034, -7443, -7812, -12183, -4923, 3787, 13649, 2434, -4008, -8578, -3650, -13035, -31753, -20973, -9436, -20156, -2737, 2707, -23112, -25045, -2462, -7440, -22333, -26173, -30096, -19832, -1528, 9500, 11866, 16853, 16943, 7127, 10681, 18026, 13574, -20366, -22598, -15262, -17984, 5052, 25126, 23242, 480, -9280, -8021, -2753, 5445, 1817, -1962, -19079, -9342, -1711, -1620, 2034, 7234, 1112, 7729, 9999, -3919]
15496c919k5991j8481Q805K6229n444R687J0530j3757m338L84K932m583M305j0003
15482b3644k6725M645L0078J8961k234n27P361j850o029n555K1905J0495j1861
15469A5020n190n475j7662k2717M588J460j1157n239R756K4535Q279r717M859
15456h660J8489J567r987k0127N473l031r027J2825J1464Q917k594K062o956J538
15442A953L624O56m122r473n159Q807l070j0563n210o286m827K5354J9042j1586
15428h60k5307j926j5465M956O955J7422K776p076n972O39P39k501J4697J6145
15414E222J9850j0282j6516n052l517q85O101J8811Q118j0256j4775k0066M780
15401a8467R86J0985J4206j850K3j5995k570O316j465J4016M569o967L781r092
$$ y = [-3919, -29910, -48391, -39586, -13357, -18801, -9114, 1416, -12341, -16679, -16295, -13363, -17946, -13641, -23644, -50369, -45724, -15646, 3315, 1081, 554, 7915, 6065, 36, -5519, 16386, 26881, 15020, 9830, 4355, -13307, -36024, -31436, -29976, -41133, -46372, -36616, -12081, -3802, -13519, -8660, 9829, 11396, 1409, -18718, -13245, -16276, -25303, -12478, -1014, 7903, 5309, 7371, 415, 1953, 5577, 6233, 2111, -7362, -12521, -3714, -6784, -17347, -22557, -28843, -33670, -8316, 10726, -860, -26167, -28093, -43558, -38602, -31647, -14225, -11449, -18525, -24497, -23858, -23119, -25620, -10923, 5222, 25072, 14790, -1726, -6778, -10295, -11180, -5079, 13732, 21850, 11594, -3181, -23247, -18467, -17481, -6496, 7710, 5860, 5883, -10112, -12682, -6366, -7831, 6185, 10754, 3787, 7568, -1524]
15387a524p054k815n957J0135K97k3606j550R941J0809P097L3963P725k8088m992
15373D381m236j3957j2519P676Q055P382Q389J1183K745j2784j9436m352J1636
15360e837j4179l089K5031k325k0392L244L16M570R267O555n001n739J3897J4983
15346B1301o454m365j6696o502J8010J032N574m699k6663p844K5603j1350q798
15333b1851p676k074J1836Q728j8555k755K9897J2538k196J9346p948k1706O51
15320a765k631l767J0710R32m091J3102m829J0834n185l068L163j087K4001k7431
15306H888k6708K665J4222J4474P82k996k833j8722J95P505O032n487k4308m190
15292c0481N495J175Q50J6755j3175j4957J658K1835L840J0782p206J0141L797
$$ y = [-1524, -8578, -11393, -17350, -7215, -6918, -30524, -32074, -22133, -11324, -4227, 29736, 37461, 9373, 4381, 145, -13812, -26331, -18655, -10600, -3218, 5171, 16354, 19099, 6315, -13121, -17473, -5837, -20016, -23105, 1926, -399, -20791, -17547, -17231, -12661, -3394, 3161, -1840, -7579, 6318, 21301, 14847, 10482, -6214, -12716, 5294, 6326, 11900, 7201, -19462, -27306, -1703, -13053, -21851, -29527, -31601, -19765, -11037, -29592, -32347, -2450, 10088, 7892, 27238, 19290, -2416, -1765, -4396, -8163, 2547, 3479, -612, 12490, 7661, 18495, 13310, 10242, 13405, 12318, 36319, 8888, -17820, -15155, -933, 13541, 14323, 11327, 8494, -10228, -10033, -2528, 3504, -1983, -26291, -30481, -24986, -23811, -22961, -6206, -19381, -34338, -32680, -10845, -7005, 3777, -3429, 6712, 10509]
15279A0509j6009J2740N629k049o316j2551p812P453o24J1153K3258j920p119
15266A6342Q507q238j5577j8890j0558Q713J8305J033J1860K336J3767n511j6262
15253E827l423N914r060J7427k901j4243l530N569k074J4094K821n921L514j385
15239A2629k114m924r516o209J6418Q557K135j871p078j0276j1103j7414J0874
15226a9892J5366K0126J5856n367j4285j2849j2625l123p507j3049k0360q189
15214f5898K7530J9300Q321M183j0394R779J2160R398q678q883o418k3088p377
15201d0065J8835J0416o423J6423M876j5065k737J2141R304J8384j631n839n426
15188A3193j0583j0479N486R024N102M176r615J049j8075j1186J0287Q869N588
$$ y = [10509, -5500, 7240, 12869, 10820, 4504, -8047, -15859, -8406, -9030, 2123, 25381, 23461, 16342, 24849, 16611, 1034, -17856, -28414, -19701, -1396, -363, 11497, 13833, 27600, 22089, 5827, 2404, 8318, -742, 16685, 13784, -459, -3989, 1580, -494, 13600, 16421, 10500, 14014, 12629, 10515, 5591, -3925, -10134, 6284, 14841, 16976, 15105, 8027, -2249, -13352, -30766, -19892, -4526, 15600, 31456, 26089, 11804, -1045, -13670, -16793, -24300, -37349, -57709, -65898, -38368, -19068, -10747, -6564, -16958, -7179, 4981, 14379, 5701, -3182, -9600, -32688, -40065, -21230, -10814, -17237, -814, 4062, -11003, -13740, -1599, 7705, 26089, 24458, 18619, 13193, 2610, -7869, -2383, 6641, 11743, 15919, 6304, 7353, -10722, -21908, -11621, -2752, 2836]
15175B836l592j1550j0225K760N258J5853P797j674p690j3602J7520J1482m717
15162A0456q285K662k145n601p914K2964K8702O97k6317j6328J0020r90l093q309
15148c481K75K1360k26l3839j4451K6n608m058m138R173K1186P809j898p143j748
15133a6761P572K2231O585r565k2903k0594P730O61J5872J1139J0722r689q108
15120e108M538N148J3319r122j3043R439J7638R45k2574r676q899j6487j4796
15107d8678R241K8999J4146n943J0864Q473j2442k878l578k028j0669p019L239
15094a8273J1177l671M693K032K133o217j4867j9899K245J2245K545L686J7627
15081d544K892j550K5795J0806j8777l523n612Q232o701m145J2191J3181q97j6077
$$ y = [2836, -756, -12306, -22531, -19771, -14513, 1340, 9137, 7463, -227, -13829, 3691, 15173, 10456, 2171, 4833, 2688, -2913, -10827, 12137, 40839, 41536, 15219, -1109, 8911, 7921, 4828, -3481, -3206, 18154, 17928, -15911, -30362, -30336, -35944, -40002, -44140, -34967, -13781, -5972, -7870, -15013, -16761, -9189, 13042, 19627, 10062, -12841, -33435, -25705, -25044, -9172, 1967, 12689, 3000, -5108, -570, 4578, 17897, 8775, -4268, 5171, 22809, 23754, 1180, -8496, -17395, -33882, -48678, -39437, -10438, 3708, -2235, 8629, 17102, 4660, 1782, -1796, -3824, -14493, -21512, -18273, -7096, -10767, -6074, -4042, -1909, -8126, -22993, -42892, -40647, -28402, -25857, -22171, -4544, -1652, -3202, 22593, 33399, 14622, 11099, 5487, 13719, 7018, 2873, 15064, 28245, 27348, 11271]
15067A1271l9276j9782M414Q944J1791J0039r805j118L0910Q845R846n233N094
15054B5940L800k136k1401k5476j3563j2685k205Q365K5938J432K613o744j4535
15041c0657N013K8969n896k5879M618m420N479K0879k069j216r001r571K938m51
15027b1264K7658n043n955o104p429k863n608P273L230m492J3577l04o370M628
15013i066K086l432J5987K7443m0138k7113K0445J7011J4389k008n477k014j8623
15000a0510k9887n660l875K5150K9525J0383j3339q779j3414J353K6443j0322
14988b932r629J531j0730J4016K0071j71K598j0006j196O013Q390j5598k1947
14975a9590R543J3487j642N24J0406j3073m138k464m41k558J6554k591j0969J0064
$$ y = [11271, -28005, -47787, -43373, -34429, -22638, -12599, -22404, -23522, 7388, 16233, 26079, 20846, 25940, 29740, 27604, 6203, -19273, -32836, -45521, -47726, -39361, -13423, -11991, -9378, -16122, -30657, -25644, 3325, -2571, -28450, -23832, -28252, -22773, -1894, -3963, -5179, -14180, -23751, -20813, -21264, 6394, 1351, -4604, -10708, -18137, -21000, -26608, -19335, -16105, -20597, -7020, -7324, -13694, -9066, -6980, -10412, 5575, 33018, -7120, -34233, -13788, 3223, 17612, 15604, 10127, 8113, -10510, -40397, -46057, -49932, -24782, 4743, 15126, 1787, -6992, -20406, -19053, 7390, -2932, -12561, -11030, -21760, -7744, 12327, 12156, 14754, 4748, 3552, 9565, 17955, 2357, -19590, -10047, 3440, 1798, 2322, 12728, -345, -4483, -6947, -7388, -9946, 6608, 4017, -6952, 3112]
14961C112j1098N512M697o531N760J1038j2724l0604M810M824J2495N209J971
14948a529k060J0297j3753j139j905j4878q612k286j7759L32J5176K2866p606
14935b2856j0708J1231j168q147J1234N730J1556K989R98J5769Q124k48k257n611
14921A6636k334N941m080r212J959n997k636N437N981j2832m321J979j0968j639
14907a6086n165J1463k311r410j900J3482M874m097q204j1660N244J4116J6125
14894F471J93j7212m594L244N174j0828q015l737Q331o278M064p830J3070P268
14880a0679o554k217k3298M892J4862J7582J7653p978j6458O234N434k302R931
14867G102j150j0470n155J7506j5605j0853K6880K0775p945k1847j0927j4030
$$ y = [3112, -7986, -2474, 2223, -4308, 1452, 12490, -234, -30838, -26028, -21204, -8709, -3500, -1529, -3589, 6708, -7045, -8184, -10089, -24967, -33579, -35865, -53624, -53292, -38116, -15250, -22856, -33564, -22333, -23501, -31648, -20414, -14684, -3128, -139, 859, 16628, 24752, 24504, 22247, 16636, 14302, 20243, 16163, 6951, 8910, 2913, 277, 5714, 11695, -1137, -5458, -3479, -14447, -16086, -21251, -9788, -12099, -21509, -23409, -9927, -5053, -9150, -17354, -29014, -23770, -9654, 6471, 6664, -10548, -15142, -11898, -6724, -17552, -25567, -29304, -20973, -27251, -23187, -31017, -17947, -10679, -17233, -19450, -42748, -37856, -22994, -5412, 12241, 4263, -12195, -5961, -527, -2829, 7102, 5952, -4518, -9673, 7833, -7772, -18625, 8255, 29030, 21085, -762, -11689, -25719]
14855b5719j6328J42J3498n984l891N782o280J7437J2033J310L313p003M474M053
14841c163J0201j624j6672l94N988M264j8516L408j305m199j9948j8260K2695
14828c7525K2306p046J1725J0075N748O893Q113r801k327j634l384Q132j005K732
14814A3002N291k0616L213J1933k11N626j9095j1823l9J1274K0120K039j8147
14801B567k4098n287O93o507K4223J4196o018o853J988K2792l037j1937j2291
14788i569O071Q853K725q359j5267n498J8956o966k294O627J6635K329R262r946
14774A3559q486L413J0431L175J386l1795r950P462N185j1527j9335L908J0774
14761b1800K2714k933r361j2572Q993l005p922O31k698p470J8188J3662J6103
$$ y = [-25719, -42047, -41905, -28407, -34391, -38282, -32500, -38780, -21343, -9310, -8000, -4687, -11690, -7216, -3163, 7038, 5414, -11258, -11652, -5664, -1400, -19916, -16508, -17813, -22012, -41960, -60220, -37525, -15219, -22265, -10540, -465, 5283, 12176, 20289, 10488, 8161, 6527, 3143, 11275, 10270, 13002, 18293, -2323, 890, 12823, 12612, 18238, -857, -12680, -12719, -1445, 18675, 20714, 2567, -21531, -26818, -26125, -32632, -8409, 5787, -231, -7084, -5096, 17696, 14659, 2722, -9569, -3498, 5355, 8080, -279, -15546, -21044, -2088, -9054, -11348, -4721, 11914, 14243, 23505, 13559, 5073, 8486, 18917, 22092, 23478, -8317, -18267, -10805, -5620, -17147, -36482, -32574, -21800, 914, -2019, -11380, -23952, -14959, -17964, -25886, -25255, -27953, -35423, -17235, -3573, 12530]
14748A2530Q186J2674k1639l4473m408J8696J1776J457k558j7013l526P634j6052
14735b6716k2471J9356K3825j3620j4141J4510O705o178o42R461P404m279K335
14722d451j2662N740R175J3440K3568K238o107m272m1O197k0833k3138j7190J94
14708b8142J2856J6075J7245L556J917l5270q002J6278m761m921j6650L331Q194
14695a8294R978n448J9538n217j2664k195q819j5318J0057J2780j5153N0R216
14682b1489R710j864n296K3908N664L718J452j8847j2582O830r675J4558K585
14669a328J126j5208J0592Q995N526k797J324N049O446O246p667j039K218j700
14655A7783j1297j7137M89k382o665n100P466P529J5116J4798J474j4313N731
$$ y = [12530, 20716, 33390, 11751, -22722, -27130, -8434, 3342, 4799, 2241, -14772, -18298, -10664, -26716, -49187, -29831, -6006, -19626, -33767, -19257, -12552, -18730, -19372, -9911, -2507, -6786, -4451, -17113, -11373, -2198, 11242, 34810, 37048, 30941, 26669, 26628, 32825, 11992, -11146, -28336, -28142, -15286, 789, 18034, 21590, 23507, -11763, -19765, -3487, -8248, -13169, -29819, -26488, -18294, -8316, -13764, 5774, 557, -12107, -14302, -23121, -38439, -28382, -15602, -30755, -30705, -21489, -11779, -13643, -18939, 4969, 10633, 14351, 15803, -3044, -15626, -8796, -18471, -3913, -1328, -202, -15410, -4818, 4177, 9703, 6906, 8230, 13279, 19725, 25971, 18304, 17265, 19483, 17783, 6486, -10651, -10162, -12544, -19209, -24309, -16843, -9314, 5802, 20600, 22074, 7761, 13492]
14642A3492j1956q866O690M433j2874l856k451l187l335M275R497J2497j5183
14629a0824P611Q468l273J9397m493k4833k6351L613L210K371J9926p157J6282
14616C947K371j5633j5931K640J3107J3789L620l620M399O986j3619j1055J292
14603g707N80L74O451j3565j8136J3630L3182J1400q221j9069k4240J4683P502
14590c136j844j7039k080J0430K3001k443k0441K888J0872R652n852j673n415
14577c080L610r320j0944m425J5142P669M854j837j4902K177J9352R324p608N097
14563A5109P330m218J014p00k0987r073j190m022L18p851J2309K0777q147n380
14549d711M552L636p201k1392J0101J9518Q111O62P103J0553q677m799q034L480
$$ y = [13492, 1536, -7330, -640, 3793, -9081, -12937, -15388, -18575, -21910, -17635, -8138, 4359, -10824, -3213, 5255, 1982, 21379, 16886, -7947, -34298, -30685, -27475, -25104, -5178, -12335, 3947, 6318, -9315, -25246, -22606, -9499, 4290, 7910, 4290, 8689, 15675, 2056, -8999, -7707, -7127, -6753, -302, -13867, -32003, -18373, 14809, 26209, 17988, -1081, -25321, -10638, -3136, -4980, -22019, -24099, -13669, 9332, 6889, -13552, -10664, 208, 9860, 4008, 2335, -3080, 530, -8790, -19734, -24159, -9017, -1348, 3506, 1669, -13233, -11056, 8296, 17620, 10012, 15109, 22439, 18221, 19235, 18535, -2452, -11525, -12715, -16737, -16419, -24270, -11961, 8816, 669, -4711, -159, 3477, -3724, -25116, -15015, 4503, 12614, 13276, 20379, 30932, 22255, 17456, 9422, 12902]
14535A2902M263j4194j9463J0690K280j4951k049J2207M912j543j5337k0788J1774
14522b9297J460j6353j098J6423J970J259j10j1745K780J7163K913P606k849J0440
14508E62K1739Q99j2171j4247J1218K0699j4375j130q920m460R84J788J4749N562
14494B2897j0306P26M42l064J4055q3j4080N519R843N314n851j4740q284J6448
14480A8836j235j8201l577j3697j222n301m34J496K501j1951j4177K6194J6473
14467d295j4500q274O247J8054Q861J1341J3500j6474k3345M036p083o18J4774
14454B224J8258R207q439k916K2321o700j5859r558Q004k17L190j192J1871L034
14440C3228q244o445K251j3633l732J396j3034j0552P72J5009J5949J7646m608
$$ y = [12902, 17165, 2971, -16492, -5802, -3522, -18473, -20522, -8315, -3403, -4946, -20283, -41071, -29297, -27837, -44190, -45288, -28865, -26895, -25636, -25746, -37491, -34711, -17548, -14635, -7029, -9878, 562, 22301, 23200, 11029, -3218, 8000, 28699, 14324, 13194, 4274, -186, 798, 2586, 17335, 22897, 12591, 13317, 13759, 10695, 24750, 24667, 10587, 16106, 25949, 31263, 25412, 10672, 2388, 18836, 17601, -600, -4177, -17874, -19096, -24397, -24831, -23335, -20834, -32785, -46962, -20768, -4295, -18795, -27069, -20822, -2768, 6093, 17434, 30934, 14460, -8885, -4849, -11932, -12550, 2224, 20482, 29689, 21250, 18334, 40655, 33955, 18096, 8538, 16542, 16325, 19515, 18323, 30194, 33228, 24984, 18539, 20790, 7157, 3425, 4821, -8213, -18765, -17993, -2984, 12965, 30611, 26003]
14427B6003m186m691j0028n271j4203k341J0935j2239n693p238M820P640o015
14414b2507j5679j3617l53L4465K1262l788j7232Q149J4307P065j2150r639J3789
14401D072q243r82n47R220L984J0378j8188j7860n160J4293J2429J437j0395o63
14387f225l812Q783r194j6872J0469j44m107K0953J1442K147M363N469p921j4378
14373I73O759q250j325P638J1655j3804k2673j2661N447J8634J6144J756J0312
14360B0605l271j613j897j0416k549p731K355l90k3059K354M873J259J7246J0617
14346H383J804J8306j1558P833k2283q710Q985J938j731J3890N244j5122j612
14333E367o335r3R603k3628k421L738J1642Q813o564m523Q726K696n203j3974
$$ y = [26003, 21817, 17126, 7098, 1827, -12376, -14717, -3782, -16021, -21714, -28952, -24132, -16492, -22507, -38186, -51803, -52156, -17691, 3571, -217, -17449, -9300, 5007, 12072, -78, -9717, 4072, -4171, -5153, -5700, 3520, 7504, 17882, -306, -18166, -23326, -9033, 3396, 4833, -5562, -6225, -10037, -1254, -10448, -27320, -16851, -16995, -21102, -149, 11293, 13440, 17803, 23272, 15351, 973, 7732, -518, -1843, 5795, 17450, 3646, -19027, -31688, -26241, -7607, 8537, 10293, 20605, 17334, 15721, 13824, 3408, 859, -6872, -4517, -4907, -27966, -25612, -20739, -19480, -2234, 8383, 10187, 28493, 16935, 24768, 2485, -6225, 2760, 4698, 2967, 16857, 22101, 6979, 5367, -968, -1061, 8542, -15086, -17507, -13769, -2127, 6686, 122, -4401, 4325, 7021, 1818, -12156]
14319a2156N534m324M724j017J7451J8673n406J536k0822j961L186j650j4724
14306a0956j3983j0546K7689j371o921P547J3217p368k1410j116R968Q805J2165
14293E720J861j4765J4877R084J0527j3461j6344J2272J2707r25k903J8023p835
14280B8838Q03O57J2885j4819k2146L046L682j0703M598m36L309n785j899J1278
14266A3308J0972m490l6011j657J4616K5029j0871j328n106o591j7Q075R231j4017
14252A143j0230M1J6942K7347l608l682k8164k1525M869J7419j960j70j3114l555
14238a8247k309N647J2312j361M43J2809K1604J473j0830j830j0875N125O39R91
14224A5591j2822j1773J0872M47N391J7031m410n15m246j3751l645j6223o824
$$ y = [-12156, -6622, -10946, -6222, -7239, 10212, 28885, 23479, 25015, 4193, 2232, 5418, 3768, -10956, -24939, -35485, -7796, -9167, -16088, -8541, 4676, -2692, -24102, -25218, -15250, -6445, 5720, 7581, -7184, 7693, 16777, 27304, 13843, -2501, 9771, 22478, 21553, 18650, 36673, 28838, 29641, 30298, 43183, 28364, 6218, 9264, 12946, 2243, 6841, 6405, 9714, 3929, 2030, 13308, 24280, 19790, -16221, -17878, -3262, 21767, 10896, 9568, 4462, -2129, -2146, 5929, 15160, 1143, -9087, -9046, 7896, 35243, 31635, 27953, -211, -21736, -16867, 552, -1408, -1578, -14692, -18247, -20556, -14909, -2597, -3958, -3515, 9294, 30898, 32371, 21541, 19711, 8836, 13961, 14600, 15591, 2769, -9004, 1868, 2315, 7706, 24737, 20327, 19812, 15566, 1815, -1830, -18053, -24877]
14211b4877Q927L0395K0586j2528n480j7420j8374M43N824j2333J1074P128K217
14198d418j7789N044n09L876J3995K543j0215m812j414L635r353J47n053J6670
14184g653J4527O514J2428P24j2554j0830k4870O776Q037P75M936q878J5505J5620
14170B1057J7079j3286k4176j6904J1883N664j0707m914j6477J5927K5348J8069
14158B8563O91n229j3013O490M703j0387j5228Q019N424k1266k4229Q817J3292
14145a3353L0885r47k094p782j6660l291J6895r110j8674M962L791l901j0986
14132c0265J1198J9830q93r477N860K8012l56j2974O9j0463j4J4832l673O461
14118A8147j658j0485j7648J3899P722k837k0524P918K476J339L086M474n031
$$ y = [-24877, -15950, 14445, 35031, 22503, 17023, -397, -18771, -18328, -12504, -24837, -13763, -6635, -4418, -22207, -17163, -17672, -13796, 199, 2742, -7473, -12285, -13699, -10064, -19417, -19270, -24323, -7653, 6874, 13388, 25816, 26540, 13986, 3156, -21714, -14938, -6901, -6126, -1190, -10068, 5437, 21057, 38136, 24850, 674, -16230, -4347, 1317, -9390, -14304, -30781, -14854, 10494, 28563, 29254, 24025, 11012, 17502, 22205, 11818, -3410, 4609, 10033, -11233, -35462, -26645, -13353, 17532, 16585, 14491, 6709, -9951, -13242, 3653, -5457, -24131, -19169, -15378, -19279, -30265, -19067, 763, -130, -9607, -3747, 24265, 23909, 10935, 11004, 541, 527, 15359, 11686, 18147, 16489, 6004, -11644, 2255, 9977, 7140, -13384, -5466, -2990, -1651, 1435, 5909, 878]
14105H78q555j31O305n151j1550j525q678J6178j143N1q359O965J6519O365N423
14090A3592P712j157l932j2736j7660O420Q521l504j4722k206J7071J6146J4131
14077B7676O228O966l1062j7110N333K585K2235j4463l4410R320J5423m269k5354
14064c0902K0142K1295j1986R755O004j6130l793j5687j5907Q061J472J067K725
14051b3884N370R546Q877P93j483M399J5016P927K51o326j5595j3237l848o304
14037a8498L255J3070J2738J3031l993l895r578J3335J4462k7970O97J7859o177
14024A8336k6149l414k045Q948j3016Q012L110q484p444m128O56J1173J297n422
14010a8570j0823N42n667p086J4545J0243M94k368j1477j4991J1211J9274k3733
$$ y = [878, -7677, -7808, -1503, -6654, -18204, -19729, -28407, -12229, -13372, -13321, -21680, -14715, 1804, 8169, 13592, 21304, 20147, 16215, 3479, -14181, -7761, 760, -2744, -17466, -19672, -2601, 13545, 27676, 33904, 40870, 9808, -7302, -1969, 616, 22851, 8388, -26022, -16702, -1279, -5548, -30902, -10760, 10535, -1451, 8304, 14308, -1822, -5615, -21302, -37209, -29148, -27676, -26609, -23884, -18514, -8968, -91, 702, -781, 3618, 18634, 26561, 26812, 20486, 4891, -8346, -12194, -18498, -15243, -2173, 10565, 23596, 19603, 15708, 6130, 19465, 33927, 5957, 6654, 24513, 18336, -7813, -11227, -13272, -4324, -17340, -9328, -6218, -14702, -22146, -26274, -25618, -14445, -13148, -18570, -29393, -28851, -34518, -41604, -27059, -16816, -16322, -18690, -30167, -45158, -33947, -14673, -38406]
13997c8406J3022K0198M243K90J4356K776K894J9538j91j9281p658l632P496Q219
13983B3864P116r368p234M056K813J1403n47n898j7315K069m101p937N476j4228
13969i831j3769j4637j0331l088J8092K1636M652r774R738O342M864j9055j3237
13956b8398N042J2051j4182O41K3593J2390r818q181M333O341K511k519P800J89
13942A1793p074j0412m66L125K146j1031j3169M846J5032L383n798M602k222k622
13928g867N621k4735j2758L3273J7496n147K699j2124l937J066k2228q686J8785
13915a8542K2554P452o4p157m491j2193J0572r771j8460J120P909K0982J1008
13902A0919j0716l438J336J3512J690j026j2666O258P232J5509j1767O239J2188
$$ y = [-38406, -25384, -5186, -943, -653, 13703, 16479, 19373, 38911, 38720, 19439, 11781, 8149, 15645, 23864, 30980, 21612, 14378, 18434, 21247, 32650, 32103, 26205, 8890, 10959, 6858, -1079, 4397, -9831, -23600, -38237, -48568, -51656, -33564, -11928, -7276, -17050, -7312, -970, 3894, -15161, -28398, -23356, -11305, -25487, -24846, -1253, 11137, 1319, -6862, -2529, 3812, 6323, 3804, 11604, 11793, 4719, -5693, -6159, -3034, -888, -11919, -25088, -20242, -5210, -1827, -7625, -3023, -5245, -7867, -2246, -26981, -39739, -6466, 11030, 5883, 8582, -3542, -7479, -6413, -28641, -37327, -18542, 4012, 11464, 11400, 4243, -248, -12441, -1869, -11640, -30100, -28980, -21071, -89, 10919, 203, -3235, -1899, 11613, 13303, 12277, -389, 5869, 13101, 28610, 16843, 23082, 35270]
13889C5270J2895l904o627j0152m075q256k0532J26j1082j0486J8110J8849K609
13876A2745J0361J1360J0832K825k1863L746J7763J991j1595n022J5076j9339
13864B8880k2750m39q355J0848K909j6300j0738J0811J6797o592K395J8666j0846
13851A5286l044M692J0501J6077m971j9055J0266J9098k3132J2169L131m296j2958
13838B3764k1604J3431M85N89R59J1629m326P126M695k43j0140n936K1165l923
13824C7671j7764l7090p993J0666L2538J3258r490J2017j119j0811j5544q690
13812b351k1822n194O814K7656L437n150J854K4708k4573j6758J8077R14r973
13799b361o003K583j460j3082q233K727J3255n440j2084N351P729J2980k445j3859
$$ y = [35270, 48165, 44261, 37634, 27482, 23407, 15151, -5381, -5255, -16337, -26823, -8713, 10136, 12745, 23106, 34466, 45298, 48123, 26260, 30006, 47769, 49760, 38165, 33143, 48219, 28880, 6130, 5691, -2664, 8184, 11093, -5207, -15945, -5134, 11663, 5071, 7466, 26132, 15286, 12242, 16934, 27435, 43512, 38541, 19486, 29752, 48850, 25718, 37887, 41018, 36722, 23764, 2160, 15591, 16076, 16665, 17624, 29253, 24927, 32053, 36748, 36505, 26365, 20429, 41594, 37671, 19907, -17183, -25176, -14510, 18028, 31286, 21796, 33813, 32694, 21883, 6339, -2351, -24173, -29367, -22553, 5103, 8540, 3390, 5244, 29952, 5379, -11379, 6698, 7612, -2361, -8364, -5781, -7241, -20323, -28556, -25829, -12574, -18014, -30098, -24747, -17018, -4038, -6483, -20342]
13785b0342m96J3976L645j4960J7840M481j6243j172J747l967J4891l453n205
13772i258J6098o200j1772j0178j1939k798J7533L380L311J5273J1271q235l737
13759B749j6154J474J2361P852j885j8006q926Q717J7455K255Q575K3162m508
13746C5121O461j3449k2594r336R162J8975j0261k5353o746J5153K0370K169j558
13733A8114R426k1083r086J5116K2037j191j9082j8815o812k446k093N887J1156
13720A128K573j9926j034R27P533P998j1395m636k978K818P228R780l172K246
13706i10K0705P59j8326m918K0645p664r619l255m522J7547R360j5394K6232o691
13692B3949l0071j055M170j2775m919j2536p26K8331R468M711r773j69Q317j3300
$$ y = [-20342, -20838, -6862, -3217, -18177, -337, 4144, -12099, -13271, -11524, -15491, -600, -4053, -9258, 6840, 640, -11132, -21310, -33249, -36047, -18514, -15134, -11823, 3450, 14721, 6486, 2749, -13405, -11931, 430, 8282, 6397, -11609, -20535, -11818, 5637, 7892, 16467, 39629, 35121, 41582, 28133, 5539, -3797, 5365, 24340, 14079, -11274, -18020, -2867, 17503, 19672, 18114, 27540, 6457, -2629, 12487, 34524, 33333, 14251, -4564, -11376, -13822, -15915, -10028, 1128, 3701, -16225, -17259, -16332, -8799, -801, -12196, -16832, -19810, -16992, -9764, 16, -3156, -910, 19795, 20554, 2228, -2690, 17955, 10291, 672, -2583, -7105, 10442, 19802, 4408, 30640, 23949, -6122, -7177, -3007, -15782, -20701, -33237, -33963, -5632, 3836, 8547, -1226, -1395, 6922, -6378]
13678f378k3957J2021M1044j5525j9584P978O905M959J0739j3441Q725J497j4138
13665H45k9170m787J9004K5696P671n489m842k1516n096K2473o514j5382m131
13652b1238J555L6419K9278J2795o80p399k2112k6341j4102P120L298P253p036
13639a190Q330o048j6888j867K1660K6744P814o620k382j4656j0427k395j6098
13626a4023j1776j1398j7433R570R354J7465J2838J3178R301p404p752K242k249
13613A913j8653j6024R940J4885Q789L114j1370P644M237j6674K108R155J9801
13600A8865J2047j1999j3961k1602l04q207O173O114J6978j0078Q551Jn962J497
13586a887m810q295J0369J8480m538j3457P308m14j7816p696J2946M569o73R988
$$ y = [-6378, -30335, -18314, 22730, 7205, -12379, -4401, 2504, 7463, 18202, 4761, 13486, 14983, 845, -28325, -33112, -14108, 11588, 19259, 13770, 8928, -12588, -17684, 4789, -1725, -17107, -21238, -19683, 16736, 46014, 58809, 58129, 50730, 28618, 2277, -11825, -4705, -1407, 5846, -1190, 7140, 1092, -15796, -17663, 3997, 30741, 38555, 31935, 29553, 14897, 4470, 2075, -14023, -25799, -37197, -54630, -45060, -35706, -18241, -5403, 7775, 17076, 9672, 1920, 4162, 1913, -16740, -32764, -22824, -7939, 850, 3964, -7406, 238, 4475, -12199, -10091, -936, 18865, 30912, 18913, 4952, -16650, -16954, -25161, -18988, -12874, 4104, -5974, 2577, 2578, -3384, -1887, -6697, -14992, -4623, 13857, 9319, -4138, 3170, 2756, -15060, -22756, -9810, -5241, -5914, 4074]
13572D074p353N8J1588J5426K1712l013j3277j9078n200J3025l948r085O762K523
13558A4214o252j0471k261r714l024K7350J6249p1r639r207P214L45k037O325
13544A9021j1993J4636P383O18k06j1813R668j5821j6959o132Q278n751M955O70
13530c446j5756O616l12L129M780m078l852N093J011k570k341m985J4952j39O247
13515D349q657j5938j8039J2368j126j0126K1893M2073j0184k1565j6469M635
13503a6786j13n612n360J3672P116K04L500q862j2291O024J1286O751Q246j3805
13489f030j1244k59m58o714J7751N733j424N596L8002J0284j2683K632o453k1851
13475A2882M156K698j0291L604J4149J017k6778p838R3J1233J5177j5464p511
$$ y = [4074, -3279, -3221, 8367, 23793, 45505, 42492, 29215, 10137, 4937, 17962, 14014, 4929, 11691, 14214, 7962, -2509, -4770, -14484, -17508, 9842, 26091, 26020, 16381, 7174, 14388, 14733, 12696, 19021, 7028, 21664, 29047, 29665, 29459, 17646, 27314, 11493, -5466, -11598, -3320, -9071, -4116, -3446, -19202, -12586, -12898, -9769, -4989, -9067, -12919, -7826, -6815, -9385, -11726, -16711, -1759, -1898, 4349, -4308, -20246, -38285, -25917, -27043, -37169, -15276, 26797, 16613, -4952, -21421, -16786, -16899, -22511, -27871, -14199, -7083, -6879, -3379, -12241, -24532, -18508, -7222, -471, 7775, -6030, -17274, -17533, -17991, -24705, -6954, -1221, -2645, 2951, 40953, 51237, 38554, 41186, 34733, 12882, 17038, 19736, 9445, 13049, 27198, 28215, 1437, -6401, -6308, 4925, 20102, 4638, -2873]
13462b873L084J3080q175J086Q332l893o783J9103m143Q495j134j8347k1193L198
13448a0163O55P088J3293j176j4492j2901J3180Q334L831O678p419j2392Q401
13435B917M485J4832J6784q586j9133j568k3626J2079J6519r833j3947J4618m868
13422F73o778J799k6109J086J7324n075o824M011J0463R758O42j0213j1010O013
13408a4240J6165m313l888K2093K3440k971k084j9726k5186K823J4150N892o818
13395E337L357M783J4823Q968o976k3714m305m152J4787O526j1797j7739j6656
13382b6758J7258K4840n60n567j8639K551J3144J3589k372O744k611j7309k0060
13369a5750j5719J1353M92k7396J347k692K0264J9291J7667J6064o948L721J6825
$$ y = [-2873, 211, 13291, 5116, 6202, 14534, 10641, 3858, 22961, 18818, 27313, 26179, 7832, -13361, -10163, -9508, -2420, 10873, 9697, -4795, -17696, -4516, 3818, 7649, 14327, 6908, -5484, 2917, 7402, 22234, 39018, 30432, 11299, 9731, -13895, -1816, 14703, 4870, -9077, 5541, 673, -6105, -4306, -30415, -29329, -12005, -17080, -23904, -19893, -9430, 328, 970, -9243, -20253, -14240, 1925, -2388, -6276, 15817, 39257, 36286, 34202, 14476, -10710, -7887, 6263, 12155, 5337, 8694, 13477, 28300, 37268, 30292, 6578, 2273, -1879, 12908, 19434, 7637, -10102, -26758, -9500, 15340, 14780, 9213, -9426, -6875, 6269, 19858, 17486, 24230, 21619, 4310, -15750, -31469, -20116, -19624, -47020, -45673, -48365, -28101, -8810, 8857, 24921, 17973, 21694, 38519]
13356C8519K960j8508k5950l235R643J1740J0700k1082n364P717k65j080O460
13343A2255m775r336J0615N628J0343r388N961R804L463j499n857k031n822m35
13329A8926l294l0518j4840J1580J9247j0882j0950j2145j6793K1778L1718m228
13317d01J0450q086k74K2876l281k0238l893J670j0000k896q890R795Q995m472
13303h645J4058P248l500k0703O033J6272J300L552j6552k152j5414J9370J9125
13290A9992k4809R329K455j7579K647P792J2678R317n975j9219j623L646l323
13277d672n794j390M623P1Q201L477M177J4470q151n957J2976p739j0112M001
13263H181r925L87M23n877p313O612J8661N999O526m329j178j3627j8795Q185
$$ y = [38519, 41479, 22971, -2979, -6214, 3429, 15169, 25869, 4787, -577, 7140, 6875, 5795, 12255, 7480, -1856, 8759, 14387, 24730, 15342, 21303, 31107, 34570, 33071, 27214, 25183, 19361, 18926, 15632, -14886, -29726, -18146, 1101, -9781, -20731, -32876, -49669, -27891, 3827, -401, 10049, 1963, 1689, 24565, 21284, 1046, -2847, -1177, -11177, -14073, -22963, -13168, -4173, -8645, 5413, 12661, 9161, -11542, -5509, 10763, 12063, 15615, -937, -3089, -18503, 867, 19992, -4817, 4512, 6967, -10612, -7965, -173, 12505, 21822, 15847, -3372, -4995, -1349, -4672, -10466, -11856, -7233, -7162, 1039, 4516, 8693, 23163, 15012, 9055, 22031, 14292, 4180, 8181, -1744, -1357, -934, -6811, -14124, -7512, 11149, 17148, 23674, 19345, 18167, 4540, -14255, -6070]
13249f070m83K0329j06j3805P411n359O186K074L339j60n96j6178j8815j2118
13235c4351J19J2663J2025j2555M238L1736o123l054N924J2808k925P341j1925
13222A5921j467k1258m439R165q358j0349K5817O878N929N342J1051M539N364
13209D4135r210j4094J984J7745k6557k23P425n235N089n563j3986J2387Q263
13196B2160n94o809K625k883K06j5602N321N596m19j7226j1806J6667m301k1689
13182b8754M55Q574K0239n92j8141%J8550J5059L180j1618M151j654n006l668
13168G75n539j331j0806P113J7470P982r361j8452J6013K0835K338j6332O558
13155A7263N573P841J4316k1805n082K1917M406j0214j6276m503J1057K993J180
$$ y = [-6070, -6553, 13776, 13670, -135, 7276, 1917, 8103, 10177, 13516, 13356, 12760, -3418, -22233, -34351, -34232, -21569, -9544, -22099, -17861, 13875, 7752, 4698, 10622, 23430, 20505, 27846, 15921, 14454, -6804, -11243, -2078, -10436, -20785, 5032, 11910, 17839, 23181, 34232, 38771, 44135, 34925, 20831, 22815, 40560, 14003, 13780, 21205, 15970, 21059, 15496, 1510, 13897, 22160, 21566, 14757, 17382, 14499, 14705, -897, 4424, 10020, 9601, -7625, -19431, -2764, -7065, -28754, -28299, -19725, 514, -78, -18219, -18219, 331, 15390, 18570, 6952, 11103, 9449, 4443, 775, -4764, -6095, -16901, -9788, 7682, 15664, 6303, -12149, 3864, 24699, 27037, 10705, 17263, 22836, 30677, 44993, 23188, 18106, 40023, 44429, 34215, 17939, 13436, 24493, 27486, 28666]
13142B8666N44P584J2317j813p929m253J1557j9073j4624R098J1758j799j4427
13129A7606O162l84N122O941k7300n935O000n784Q554J0618j817p777n140j8753
13115a1887L006O099R208q613j1170q379O942l895j340k1935O143K7550O0J8517
13101A0306p780N894j714L471m380j8596K3226R031j0735j767r64J7082q091j2714
13087B269K06j373q331J4789r67j4533P333Q455M37n882j697L989n813R896K838
13072A1616r782j0320K4510O493J6491q11r83j633L204r685r605Q325J1688j1754
13058B7754j2749j8030p448L978o124j3640J3269l841k897J7444J2299J1343J9717
13045D1075j3015k3543l783Q552k1250q545J81j33j444m338Q099J4176K0437L110
$$ y = [28666, 29210, 36794, 49111, 47298, 39369, 35116, 46673, 27600, 12976, 22074, 33832, 32033, 17606, 23768, 23384, 28506, 35447, 8147, 2212, 8212, 2428, 10982, 21600, 19783, 12006, 6866, -11887, -8881, -2782, 6426, -2187, -13357, -21736, -14794, -18689, -20029, -41964, -35821, -8271, -8211, 10306, 2526, 8420, 6706, 10177, 5797, -12799, 10427, 19458, 8723, 6956, 5992, 23074, 14983, 2269, 2475, 1102, -7229, 7560, 6593, -7940, -607, 7848, 8285, 2403, 706, 4695, -1118, 8778, 11616, 1834, -8486, 16024, 22517, 39008, 38197, 37214, 35581, 38785, 29100, 19495, 27820, 39508, 27754, 15005, -3025, -10473, -6495, -12619, -26259, -12990, -16831, -19728, -2284, 10015, 21358, 41075, 28060, 4517, 734, 9286, -11964, -20509, -20328, -20461, -21905, -26243, -18144, -3968, 16469, 19579]
13031A9579j9369p046J9551J226k2547j483O338Q063o348N003n181j1855O485
13018g584J0506J0595l713J008j4007j1029K5485N631j3272j9551j5098J0265
13006b0764J863j061m117J2020J1091J2347l920q023J7707K5715o956j8731j1732
12993E439K641j305J1123K3144R003O070n38K604p786j3063o026j7098q950J040
12979F298Q553J149O41j4310j8232O924J5052q175m31r254k769J3414L0135J649
12965C0644Q224j4688j6749M934J8134l014k0439O804L95J0505p84j7319k442
12952D205n138j0957o921N417K597j132R19K3780m47j5783j1150J2361m831m793
12938a1873J0975R626n882J0646k892J542J7480j6946j6203j980l265j141K8878
$$ y = [19579, 210, -6836, 12715, 13941, -8606, -10089, -3751, 4312, -2036, 2967, -2214, -14069, -7584, 2922, 13517, 9804, 10812, -3195, -14224, 11261, 16892, 3620, -15931, -31029, -20764, -18901, -19962, -24079, -12059, -968, 11379, 7459, -564, 17143, 42858, 35902, 17171, 5439, 8080, 6775, 17898, 41042, 50045, 56115, 55577, 58181, 50395, 37332, 31306, 14208, 5258, 6298, 14851, 16000, 16641, 2331, -15901, -8977, 6075, -2100, -2531, -11785, -14554, -1140, 28995, 30644, 38868, 24180, 7431, 12365, 30499, 27485, 7046, 13850, 14245, 24750, 23966, 6647, 4205, -933, -11890, -18811, -13394, -10797, -11929, -11010, 12770, 12323, -3460, -14610, -2249, -7080, -11873, -898, 8728, 2846, 13492, 10600, 12142, 29622, 12676, -3527, -5507, -8772, -9913, 18965]
12925A8965K7434O765q883m773n288L885K3550R531k4680k4754j423k657j2645
12912E027j807J5810L078M122j505l236L628J9555P043m312k0765p480j7286j9858
12898a7986n347M930K634L77M089j775P311J3258N041n972J675j4301q519R428
12884e157m015j039K870O988L571j0365M440P354R500p224L480J0689P376J100
12870B9568O311q94r678k3759k4114M257Q800j1955L203L728Q696N872N290J9954
12856B5279K959j5912J1385n517j5322J5022Q202J340j0810o110l465l769n980
12843b698Q43n740p655p351K3518J8794K0662J1509m207k460K8966l147j1281
12830E9753p718m51k0075q104L237j208l2648l3472j2925J6443J3617J3807N293
$$ y = [18965, 46399, 53164, 44281, 39508, 34220, 38105, 61655, 71186, 46506, 21752, 20329, 17672, 5027, 3220, 19030, 22108, 26230, 24725, 21489, 25117, 44672, 51715, 47403, 26638, 19158, 1872, -17986, -23333, -18403, -15769, -15392, -11303, -13078, -5767, 7491, 12532, 6560, 8235, -6066, -14585, -5157, -9172, -10211, -7341, -353, 3218, -7147, -2707, 4647, 14147, 6923, 10403, 21092, 28468, 29568, 35879, 34985, 25307, 1548, -22566, -18309, -9509, -21464, -18261, -14533, -5837, 35, 5325, 25279, 28238, 12326, 23711, 18194, 2872, 17894, 26096, 27436, 16626, 10516, 7051, 3282, -2698, -1855, -7595, -15250, -22601, 917, 19711, 40373, 51882, 47675, 45215, 74181, 71034, 59753, 52035, 51584, 31509, 23405, 26642, 25434, -7214, -40686, -53611, -37168, -23551, -9744, -4451]
12817d451m746O317q318j536n458n95P171r155l234O555j167k274O872K0775J4537
12802B1293J0436O897m944j0360J0645Q528k2832k660N676q933P129J0464l856
12789B7483p806p6j0896k0417K0370p282k1787l56r405r743J0333P40J5725P985
12775e132P114P786j9891Q61l32j0002J5813K4490m897l231j2396J8039j284j6826
12761A12n689O776K1723j2075j1671J2471J5561Q87k631r527k5918J8739J5956
12748B4714J1895o542j6706n234q228l622J3194J8086k308k2861j2412p029k543
12735a9596l319N138N104Q749J5087R680J6238K462j6273j2451J1935q072j046
12722A3636Q724O330O670k754j3824o100p749l934q971J6502R538R450J9692J893
$$ y = [-4451, -9197, -2880, -11198, -12734, -18192, -18787, -11616, -20771, -24005, -17450, -18617, -20891, -14019, 6756, 21293, 31729, 38626, 33682, 23322, 33967, 42495, 19663, 17003, 22679, 13746, 20875, 31339, 27483, 19677, 19601, 8705, -11712, 8658, 1376, -20411, -20767, -30172, -39915, -29582, -28842, -13117, -5132, 1982, 9768, -10123, -9262, -9594, -19596, -3783, 20707, 15810, 12579, 183, 18222, 16938, 112, -5577, 1199, 22922, 10847, -824, 11647, 27208, 28095, 25464, 15937, -9981, 8758, 24714, 36609, 30067, 13361, 8127, -101, -3723, 9471, 27557, 25249, 2388, -10024, -17053, -19596, -22915, -17777, -12673, -3924, 11163, 20843, 37081, 39543, 23270, 10819, 22754, 14682, 13636, 22360, 28690, 35360, 32606, 18782, 12682, 4933, 999, -7972, 8530, 18068, 27518, 47210, 49103]
12708D9103p311p626k0293j1877J275m718Q910O102j0019k9456m568L4625J5073
12695A9220K266j0539k2791N37J8165J1912L963K417j3335j7883J2048K5885o598
12682B5267j6573n575j2220N219K4088o773j4712o330J5665j969j471N509K3151
12669C3276Q292j5257j7781j1710K169K596o431Q868J4874R675N130q661o797
12656A8243l748L405l52o825J088J2662R593p430R54q559K688K827O366Q072R98
12641C9982k279k2234o667P791J5694m243r736j7794P243K3167j2439j8017r382
12628h914J9915n066j1169r290M472Q763j1671l693J756L979J9759j3548J4342
12615I635J6018N520k3856p601J5578K446j0171j667J198J1116J1022j2104r29
$$ y = [49103, 41792, 34166, 13873, 1996, 3271, -1447, 7463, 13565, 3546, -25910, -30478, 4147, 19220, 21486, 10947, -11844, -11307, 6858, 18770, 22733, 25150, 11815, -6068, 5980, 31865, 25267, 8694, 3119, -9101, -3882, 20206, 13433, -1279, -7609, 8056, 6087, 4616, 10125, 33276, 41568, 26311, 8530, -3180, -1011, 1585, -4846, 4022, 18896, 28571, 33701, 25040, 18243, 14495, 17900, 17548, 10723, 11811, 24473, 34066, 26636, 27590, 19031, 21719, 24546, 30912, 38984, 39982, 37703, 15469, 8802, 16593, 32287, 28044, 18308, 514, 7757, 30924, 18485, 468, -8914, 11001, 5935, -5234, -14524, -10052, -1289, -12960, -16653, -14897, -10918, 8841, -4707, 9635, 25653, 31173, 7317, -284, 15294, 17740, 7569, 5902, 7100, 18216, 29238, 17134, 16205]
12602A6205J657L668p186j5089J287q273M372N450O957j9004j5411K318P493L0392
12588A4836J6843P483j5861k3250o281r464L986K0805L0203O910J069l3319k071
12575A1889O040j5516l799J2848K290m574N040K095K430j6952r500O705K4981
12562B3977J1323o23k8916K2K4636r594j1093r90o650j1656N012o210K993K7029
12548A9260O857j6198j6535J714p253J464J9005K1126O171m01L70r354q838o42
12534A6746J1220P02k4618j0035K443r364R866m52n346j9109j614p16J7066J2735
12520d76n234k0593j6218O238j3871N458l101K1443P500J5791L91N545j1492j1077
12506a9696J4346J0955J2933Q57k2625N857P923j3673P730J684m488j4722o304
$$ y = [16205, 17862, 21530, 14344, -745, 542, -7731, -3359, 2091, 9048, -9956, -25367, -23049, -15556, 14836, 31679, 39162, 23301, 51, -6230, -15694, -11708, 9097, 39300, 46210, 47279, 13960, 11889, 17929, 2413, -1386, 11462, 13752, 9178, 14218, 16313, 18743, 1791, -7709, -1004, 23977, 35300, 34677, 5761, 5783, 30419, 20825, 9732, 8742, 2092, -9564, -4552, -10762, -7769, 19260, 26117, 9919, -6616, -4902, -12155, -10691, 8314, 29440, 35611, 35210, 35580, 26226, 17388, 16746, 27966, 28668, 4050, -5985, -3542, -12906, -3040, -3492, -8838, -27947, -29561, -30277, -13211, -476, -5710, -26303, -42521, -36283, -50154, -44696, -47797, -26354, -18854, -3063, -2672, 2873, -8619, -19696, -5350, 5605, 18538, 19395, -3230, 2627, 10550, -3123, 4607, 6291, 1803, -12919, -19223]
12493a9223m959j0354R438K7666P637j991Q503k876l15q462P750P870P22J966
12479B3372J1264l77l537r432j3672j3951o5M209J8968J148p746l854k1455k296
12465a7424J1110J1619j5328n24L405J1668J350q668j1200J519K0076J4901J5251
12452C7755k2531j1094P380J2209j008q617q489k833j4559J0680K088J2254R795
12439B3030J3280K3252M914j2496L512k929j4809j1713j6047P949m765J4183j0598
12426A6763j9220M648o51j893k672Q198J5552k466J3118N477j877j9859j3122
12413A996M039R912j4232r599M807J2142m781k402J0873j163r981k2276q891o188
12399c5744J0673K5670K2468K691k0793k2238Q236J5434P379j4518N627Q527N371
$$ y = [-19223, -24182, -34536, -25098, 2568, 10205, 8214, 16717, 13841, 13526, 5064, 12814, 20684, 21406, 23372, 34636, 34259, 30722, 21290, 7618, -6333, -6398, -2189, 16779, 17927, 10181, 6327, -15128, -17424, -6314, 5305, -10023, -10547, -7142, 4526, 5876, -2792, -13992, -12473, 7603, 22504, 37755, 15224, 4130, 11510, 23719, 22711, 14094, 5605, 2772, -11787, -1107, 981, 13235, 23030, 36310, 59562, 64476, 51980, 55492, 52563, 37754, 26041, 9994, 17943, 13178, 27361, 16763, -2457, 2191, 1540, -353, -3025, 5173, 20725, 18259, 31377, 36854, 34977, 15118, 1996, 6035, 15947, 1715, -7884, -3077, 9065, 4284, 1882, 12755, 11592, 1611, -20665, -29556, -35744, -25071, 599, 23067, 25758, 4965, -17273, -9037, 6397, 13776, -742, 4885, 13412, 18783]
12386A8783J0275j1609p3m944L0393j1276m666O666m256k1622k3686J0266J5984
12373A0235L505k114M614P380j4107j6996R910J2550J007L968l139J258K305l427
12359A6949L331J766j0482k6658J0453J6383o158K617j266L606J3148J5702J0489
12346D9880j1209j1067R92j3873l5846j0082K7158L5324L742J7322o429j4173
12334C1739j8074j4139J0078J0805j6825j2120J0247K038n817O11m287j4708k91
12321b0743J0552r724J4599j553O505j099N325J0378L060l344M29L432p085L8
12307A0770j5675q760N148K3506Q570j0245j9394O41O565j0600k217J917p760
12294a7534n766K159J8803K0035K819j1014J6288m615j1989J2115K634n332N469
$$ y = [18783, 29058, 17449, 17376, 12432, 42825, 31549, 26883, 33549, 29293, 7671, -16015, -5749, 10235, 13740, 11626, 16240, 23620, 9513, -7483, 2427, 14977, 15984, 19952, 16813, 18071, 20376, 16949, 20280, 22046, 11564, -15094, -4641, 11742, 5584, 8201, 6935, 10541, 23689, 39391, 49880, 38671, 27604, 28596, 14723, -21123, -31205, -4047, 31277, 35019, 52341, 45912, 31739, 13665, -474, 9604, 20409, 3584, -8536, 1711, 3749, -2068, -1457, -5744, -20452, -20743, -10191, -19915, -5316, -6869, -364, -1463, 3862, 14240, 17300, 13956, 14385, 17817, 10732, 10770, -4905, -13665, -8517, 14989, 23559, 13314, -6080, -5439, 1126, -9474, -11691, -9774, -17534, -23300, -21141, -2338, 17697, 20516, 9502, 25790, 21175, 9186, 21301, 23935, 18603, 24072]
12281B4072J1605K5970L765k1158p669J2935M370j8382j5777N586r685j973J6807
12268C0466r457q9K482P390J4092R22l569j7527j7170k847q099j5171M92P348
12254a0737J0447J968j1906O124N767j185j2048M548K1778r121o130J6388k5j2661
12240C207L5822J3253r034m255M96J952k390j6653k3538o844J4803J8724j8825
12227F718j1279j765n621l780K4713O257N56p597L004j6301L089J3193j4731J6726
12213A3182M135k775M061R078O423K390j8540j1568L206K1908O861j289j9491
12200A7581q950J5646K315m214q982O267K4885J9054R523K459j4685l0677n066
12187B5156j4092q026J7979J0999j417r250k3873k203N459N850j5916R660J0034
$$ y = [24072, 35677, 61647, 65412, 44254, 36585, 49520, 53890, 35508, 19731, 25317, 15632, 13659, 30466, 21009, 20920, 23402, 30792, 44884, 45806, 42237, 24710, 7540, 4693, -3406, -18577, -18085, -10737, -290, 1678, -10228, -4104, 1663, 478, -11570, -7022, 14756, 5635, -495, 15893, 15868, 3207, 39029, 52282, 43248, 38993, 39489, 41441, 39051, 22398, -1140, -7984, 6819, 25543, 6718, -4561, -6326, -11947, -15727, 8986, 15243, 15799, 8202, 11206, -5095, -2006, 11187, -3544, 13182, 17317, 14542, 18603, 27681, 34104, 36494, 17954, 6386, 9592, 31500, 38361, 37072, 17581, 8631, 24277, 26592, 22378, 13396, 19663, 44548, 63602, 73125, 75584, 60899, 30222, 25156, 11064, 3038, 21017, 32016, 30599, 21349, -2524, -4727, 732, 6582, -9334, 326, 10360]
12174A0360j17P059k3075j582J3297k571R988k267J8092K796k0412j7055J8945
12161A3458J8054J1128k8859K598M44K518L2579q629k4750J5372J3178k4304k9487
12148f700j0640K4594K7056j0983j8790j2949K4321Q464p847P974O154j2594k968
12135A5092p206j298p00k413J0754O323K0161q045j7869L254l423l2j1197R970
12121A3371J1136K018P503n385k1610m274J4211O667K775l014q377p014q22Q551
12107A5736q838j0633o799R095K7019j9286R039J69L040k364p587N593p175j0162
12093c153J406K4340M683l242p579m66L172p719p187P93N364j6851N385P524j7188
12078a0718m304K383P437K3070m874q111l61k0966m924J1249J0411K1757J2673
$$ y = [10360, 10243, 17302, -5773, -7355, 5942, 3371, 13359, 11092, 29184, 31980, 11568, -5487, 13458, 31512, 42640, 13781, 16379, 16823, 19341, 51920, 43291, 18541, 33913, 47091, 22787, -6700, -17340, 7254, 34310, 23327, 4537, -8412, 15909, 24373, 16526, 24500, 30654, 18060, 15092, 7886, 6588, 5888, 3475, 14229, 20552, 40713, 32668, 14799, 18053, 14630, 14598, 3401, 13371, 24507, 26525, 34028, 28643, 7033, 2759, 16970, 23637, 26412, 23398, 15021, 8007, 7185, 15736, 6898, -3735, -10534, -1439, 25580, 6294, 15333, 15502, 18542, 16178, 8591, 14184, 7009, -3153, -1747, 22593, 27276, 24034, 16455, 15989, 19161, 11442, 4255, 5048, 10412, -6439, -1054, 6470, -10718, -15022, -12639, -5202, 17868, 12994, 4883, 4522, -16444, -21368, -10119, 292, 22049, 34722]
12065C4722k1699l5635k2152P584K4314L6510J9865j265J5201p69k2754r499k492
12052B1931j1894m703K695J1468O39p386J2767J68p269m896J2066o718j0425j1364
12038b921J2061Q686j8388q118J0581J1820K568r402R750J3742M984j8253Q80
12025A7990J5963L06k754N070J7350K301k8526l265K3655j3312k1606J1360j535
12012B2997Q151j2542p78J408R18q576j2727j4493K3271J4738J2660n470l1063
11999a506j0969J9210J4904j588O400Q40j2228r244J0063k219o120l308p268J3621
11985A0588J8775J8868j6984o967j8466j6269N511K7386K0828j4386m250m472
11973B0162O200Q943j4208j3299J5797O722k41Q652L511q588k8309M803J107j5726
$$ y = [34722, 13023, -22612, -44764, -37180, -12866, 23644, 43509, 42244, 57445, 56676, 33922, 24423, 21931, 10037, 5334, 8029, 19497, 20136, 12750, 25517, 25685, 18416, 13520, 25586, 18868, 8443, -2921, 9140, 17826, -562, -8680, 1901, 13721, 16289, 6887, 16637, 30379, 35363, 17110, 17990, 33953, 34259, 31505, 36575, 53925, 56226, 27700, 24435, 48090, 34778, 13172, 24532, 22997, 31148, 18606, 17828, 19236, 20154, 11578, -1149, -15642, 7629, 22367, 35027, 29557, -1506, -12475, 6735, 21639, 20051, 26451, 27291, 15063, 5819, 15882, 13663, 7543, 4235, -3033, 10588, 29363, 48231, 31247, 24280, 5814, -10455, -4944, 22442, 43270, 28884, 24634, 20162, 26362, 35305, 21097, 7798, 23595, 30317, 30076, 38728, 42239, 33651, 5342, 10145, 11252, -4474]
11959d474m715J8324J7524J455Q723o811n456K0515N009j9880j1241k3523M170
11946c80K6996R141m18m250N805J3754m791j9227k625q372r090n732J9047L632
11932B3490M576M596K635J2907k112j1205j2854l486p268M441L238j9759r589
11919a0390N379K0674J9745J3325Q344j3960j0795o485o828j3838R754J0506j267
11906B4164q081k497J3496p222j413n346J348M224q696O769M845K447o922N998
11892B3114m43N490k961r403J409J3977l381Q753Q48j3131j2710L153N861p767
11878A2809O565k254l610r647J2685J158K11p073p603J3249j3220j0248j2803
11865a9781Q971J5914j327j7063J247K2897L3091J9251j8170Q243J0365J800k7476
$$ y = [-4474, -9189, 9135, 26659, 28114, 36837, 30026, 24570, 45085, 50094, 30214, 18973, -4550, -380, 26616, 35757, 35339, 31089, 36894, 50648, 45857, 26630, 24005, 15633, 6543, 811, 19858, 23490, 28066, 32662, 35297, 48204, 46092, 34887, 22033, 18547, 11279, 15720, 18958, -801, -10390, -5011, 15663, 35408, 48733, 57077, 43117, 32322, 25837, 19009, 5171, 14925, 25431, 24164, 16083, 13586, 27082, 19860, 18447, 13101, 14449, 18673, 9977, 16746, 21591, 24038, 17116, 23114, 22671, 28161, 25200, 15797, 17206, 31183, 27802, 36555, 37403, 24272, 11562, 14715, 20576, 12809, 19374, 17120, 13510, 3863, 16548, 17706, 17917, 10844, 3241, 16490, 3270, -6978, -19781, -10810, 5104, 3777, -13286, -12039, 10858, 43949, 63200, 45030, 53273, 63638, 65438, 37962]
11852C7962j7943J5947j1752n569j0270n958J0361R439P901R781k0053p160n35
11839A2151m582J8039q055J031k46k54j950m151J3856J3379j6731j7596R324K0090
11825C4305J714j1524p0P318k667j0723K758l203J341l291j6249l925K582K4573
11811B2939Q815j2647k008K5703J666o128j3105p065q26P610J5887Q612l32j4905
11797C4216l054J391k419J5117k243j7781j5542j894K0901k43p658p462l876j587
11783G866j0520O261J5882q23o142k0367J7461J9442k4067k7830r243K9039P559
11770D518J681l02K3813M137o372j1016n520k580J1552N948j7422j0696r604m487
11756a6350J0638M04M377q96m414R755J2225o817l744L946L670K3765j415j6995
$$ y = [37962, 20019, 35966, 24214, 18645, 8375, 2417, 12778, 22217, 30118, 39899, 19846, 12686, 12151, 7569, 25608, 17553, 18584, 18338, 18084, 16134, 11983, 25839, 39218, 22487, 4891, 14215, 34305, 36019, 24495, 24425, 31743, 29076, 18353, 21111, 17908, 19249, 15958, -291, -4216, -1634, 22939, 31754, 19107, 17099, 42802, 44468, 38340, 25235, 18170, 17344, 24954, 40841, 49453, 49121, 34216, 31162, 32553, 30134, 45251, 43008, 25227, 9685, 7791, 28692, 28449, 20791, 13329, 9453, 7866, -2654, 3607, 19489, 18666, 12524, -7843, 9618, 29060, 4993, -22837, -32080, -3041, 4518, 6199, 5897, 29710, 33847, 27475, 16459, 10939, 8359, 19911, 25859, 8437, -2259, -11863, -16350, -5712, -5308, -931, -1827, -6241, 3514, 15739, 8922, 5178, 9124, 12794, 36559, 35144, 18149]
11742A8149O230K4153N339q252j7034j2407J631r637J9620J0290K3436m955j6672
11729C9891j5076R10n681J4099P399J4333Q388k5955j3809j4377l253J6333J4703
11716C7905p012j33j3617R824K1695J7726l703K707M838P771j394l1176l2529
11703A2902K8273J2350L27J1766j5617j9372n630N24R806q966M198J568j8541
11690A3588M920J2094Q581J8007o923k5420j3397L2125K2493o571j8498k70j3284
11677B7445M554p633k554P329m05R471r733p392M536j3730J2249K8548M465j0805
11663D6345m595N276m958r1Q812J2293P046l941j0976o464j9071J6589r458n89
11649C6218K9216P977j985j0937l46K433o049j5492l6749P363P228O527L747q98
$$ y = [18149, 24379, 48532, 53871, 45619, 28585, 16178, 17809, 8172, 27792, 38082, 61518, 56563, 39891, 24815, 25725, 20044, 34143, 41542, 55875, 64263, 38308, 24499, 10122, 6869, 23202, 37905, 30893, 30760, 17143, 26967, 48662, 66388, 62685, 65392, 70230, 78001, 76607, 45431, 12902, 41175, 53525, 53852, 65618, 50001, 30629, 24999, 25523, 35329, 26363, 30561, 32129, 13588, 18508, 30602, 39183, 57190, 50267, 24847, 11450, 43575, 66068, 59497, 40999, 40729, 27445, 31999, 24366, 21812, 29141, 28736, 38207, 28474, 21082, 25618, 11888, 24137, 52685, 57150, 46345, 41750, 47026, 42068, 41977, 50789, 63082, 70128, 66187, 55211, 48747, 29676, 46265, 36807, 36218, 65434, 73411, 71426, 60489, 60143, 62576, 56527, 41035, 4286, 11649, 18877, 25404, 29151, 28253]
11635B8253m457L262P189m45j1426P759m446m374R561O829l259L549j0954K563
11621B9604N099m182j546J1017K2922R395j4908m927r843K5513K0310J6394Q735
11608A13583J5958J5589M473K7940L1217K9038K0397L0189j4952o196o119q936
11596B52181j7008j1919j8558j5454J0993J656j1742N604J1190j4450k0589j0214
11584A61690j288k7895j7166j9596L805J7696p475N050L387j476j9432l177p532
11571H6591j8151j3427K62J2511l809R378j6366N899J0727M258j5524L289O808
11558G2446L291M420J4978J7005k160M078p336r401K249P883j7144p208K2222
11545A05323l191j7351j7161P427J4236J0877N248M096K95Q7O700j3512j3525
$$ y = [28253, 23796, 27058, 34247, 33802, 22376, 30135, 25689, 21315, 30876, 37705, 34446, 37995, 27041, 29604, 34703, 30521, 28975, 39992, 62914, 72309, 57401, 52474, 42631, 68144, 88454, 104848, 113583, 129541, 145130, 149603, 177543, 208760, 237798, 258195, 288384, 273432, 267236, 261117, 252181, 235173, 223254, 204696, 189242, 200235, 201891, 190149, 195753, 206943, 192493, 171904, 161690, 160402, 132507, 115341, 95745, 99550, 117246, 109771, 114821, 118208, 116732, 97300, 94123, 86591, 68440, 55013, 55275, 67786, 63977, 73355, 56989, 62888, 73615, 77873, 62349, 65638, 72446, 75737, 80157, 95135, 112140, 109980, 114058, 106722, 97321, 99570, 107453, 90309, 83101, 105323, 102132, 84781, 67620, 75047, 89283, 100160, 105408, 109504, 109799, 109886, 116586, 103074, 89549]
11532H9549l376Q54j987L102k831j4046j0380j1326q703n915N827O269J1576K7980
11518H6593M242J843j7509j3511q853J0140j3231l786m155p217j1446J8706O608
11505D8424L013r593n507L645J0302Q206R652j6131j2277K329P148J4703P692
11492G1606n409Q2j6333k1042j0727j343k240K0300J5671N429m248j2112J0610
11479E0244L600r395J622Q944n971k8448L537J9197m890k1657l759M658J6911
11466C4593J6601R732p987q787L935n647j0275J0393J3835p282k224Q915j812
11453E3990R853J1578l095O727j1315P123K9443J5319L2399L2006K1126K3k9249
11440A75928k6871k4198j8654k072j8932k5511j1297k333J3295J1538O106l976
$$ y = [89549, 86173, 87027, 85040, 88142, 85311, 71265, 60885, 49559, 40856, 34941, 40768, 47037, 58613, 86593, 90835, 92678, 75169, 61658, 52805, 62945, 49714, 45928, 41773, 34556, 23110, 41816, 48424, 51437, 41844, 36337, 39982, 50284, 58490, 68142, 52011, 39734, 42063, 49211, 63914, 71606, 66197, 66279, 49946, 28904, 18177, 16834, 14594, 34894, 50565, 55994, 51746, 39634, 50244, 53844, 44449, 46071, 55015, 49044, 20596, 24133, 43330, 38440, 16783, 13024, 17682, 34593, 51194, 60926, 52939, 44152, 48087, 42440, 32165, 42558, 56393, 49111, 46887, 55802, 53990, 63843, 75421, 72326, 79053, 67738, 74861, 104304, 119623, 152022, 184028, 205154, 205177, 175928, 149057, 124859, 106205, 104133, 85201, 59690, 48393, 46060, 59355, 70893, 76999, 73023]
11428G3023j884k973j9386j0302Q176K2934K2941j4249m618J536J3600j2643q066
11415F8089r375Q794O072j4557o926R458L63J2515J0196k1877j8978l1591q744
11402C439J7596P75j4926N01P521n669R487P931q62J1403K0374P866r600o4j1311
11387D4461p474K465q401J4630P159j9692l2213m428O930J4736J5167J5397j244
11374D7493J4717o88k2916r324P232J1057n846l447L951r127j777J5458p397o974
11360C2412j0000r849L4337K7576O92r796L233K407M636j1834o244M364L4984
11347I6918k6595j3742J1360j2932j6237Q794P812j2902j0641J9109q095M256
11335D7105L6120J4156j8785r307q90j1993R010K052j5237K690K3246o668o157
$$ y = [73023, 71139, 68166, 48780, 38478, 46654, 69588, 92529, 78280, 73662, 75198, 88798, 76155, 68089, 58714, 67508, 73580, 59023, 52097, 61555, 61918, 74433, 84629, 62752, 43774, 12183, 3439, 21035, 21810, 6884, 7385, 14906, 9237, 18724, 26655, 25793, 37196, 57570, 65436, 55836, 55772, 44461, 36987, 39452, 31051, 45681, 52840, 33148, 935, -3493, 3437, 18173, 33340, 48737, 47493, 62210, 61522, 38606, 29282, 36514, 47571, 41725, 38278, 42229, 33102, 31325, 46783, 39386, 32412, 22412, 12563, 46900, 74476, 75168, 65372, 68605, 71012, 75648, 63814, 57570, 61934, 96918, 70323, 56581, 67941, 55009, 38772, 47566, 55378, 42476, 31835, 50944, 42849, 47105, 83225, 97381, 78596, 69289, 68399, 56406, 65416, 67468, 52231, 54921, 78167, 71499, 65342]
11322F5342R079j3516q905p982R859m049m171M396M731M430o472j6930n791k12
11308B9809J9077J8727K319j5190M471L548m263k5649p665K5835J1298o900m553
11295E0864L268J3458K45j025O488J1554P550m949n874o124R430l51R19j668k4293
11280E9492j1643Q88J2909L3j143o195K499K969k1j662j032l901m942o946J4941
11265E6246K4459J714L121j1738j5785j0590O158J0908m223K2056N54j4074j2917
11252E5889M266N463P930j5967j4274j4566j198J4593J8157K0878J8242Q647N907
11239A13967j4950k0190k1687j4003j5075J1720L178l136M159L469J0095k799
11227E4748J857M33J8562K823j2329O812p667P454J4907r210j1782J3998Q819
$$ y = [65342, 74421, 60905, 52000, 44018, 53877, 49828, 45657, 50053, 54784, 59214, 52742, 35812, 30021, 29809, 48886, 67613, 69932, 54742, 59213, 62761, 58498, 32849, 25184, 51019, 62317, 55417, 50864, 54132, 67590, 67835, 66810, 73298, 84852, 92402, 87453, 81579, 75455, 84885, 84534, 85453, 83785, 59492, 47849, 48737, 61646, 61679, 60536, 54341, 56840, 59809, 59788, 58126, 57094, 53193, 48251, 41305, 56246, 80705, 82419, 85540, 73802, 58017, 47427, 53585, 64493, 60270, 82326, 82880, 68806, 55889, 60155, 65618, 73548, 57581, 43307, 28741, 27543, 42136, 60293, 81171, 99413, 108060, 113967, 99017, 78827, 57140, 43137, 28062, 39782, 42960, 39824, 43983, 47452, 57547, 54748, 56605, 57038, 75600, 78423, 66094, 72906, 65239, 72693, 87600, 78390, 66608, 80606, 89425]
11214H9425L569k8438j0703J2635K152k381K0093J333p945j0263r062K04k603
11201E8016J4529J6033p748J641o505J4420J6478L318j6524k9951p1k1271l74
11188D1991o358K5022K647j193P545K1095L604j3765K353J2900m690j4812L055
11175G9394K1420K4663l190K704o379p936o314K0597K6586j02m9931l2495k1848
11162D7169J562K6995J2659n330j6623K933J0716J3643J1834j1572r204J3420
11150I8202o636j3538P846N340J4495J2131j960j1547P629J733m791j7990j2314
11137G8600k509m519Q417O391n215q798k5111j4634N583K8118J1091o804J382
11124G1992K929K799j088j7713L899J6600j3179J4138L953q093j2963J3826Q238
$$ y = [89425, 92994, 64556, 53853, 66488, 68640, 66259, 86352, 87685, 79740, 69477, 60415, 60619, 58016, 72545, 88578, 80830, 82471, 75966, 90386, 106864, 110182, 93658, 63707, 63636, 42365, 41991, 35633, 60655, 63302, 62109, 69654, 90749, 94353, 80588, 82941, 95841, 91151, 76339, 79394, 100814, 125477, 122287, 124991, 118612, 110676, 104362, 124959, 151545, 151443, 101512, 69017, 47169, 48731, 75726, 88385, 83055, 66432, 69365, 80081, 93724, 105558, 93986, 84782, 98202, 91566, 78028, 85874, 91214, 105709, 117840, 115880, 104333, 111962, 113695, 108904, 90914, 78600, 76091, 71572, 79989, 86380, 81165, 72367, 47256, 32622, 38205, 66323, 77414, 70610, 71992, 74921, 77720, 76632, 58919, 62818, 79418, 66239, 80377, 84330, 76237, 63274, 77100, 85338]
11111H5338o87l801j347o881M990n010n541q124K2814J4773K336p606Q239M618
11097A04111p499O131M286j9896j6333j121O483l902j71J1136J458j2741J242
11084G3184j368J125J6395k059J2768L565J406l553n308j385J3219J3680j1640
11071A10029l967R91q558k5919j5720K1751N474K485R497Q249j0604p881J1146
11058I6973p465o495J9027M439K66q41K0184K889r249j3749N031j0785j0273R837
11044I9789K0293p85l010r546n273k545K1534m225j0832p504L030N817r526R270
11030A06487J4728q241o608J2592N01k659K6834l946p918L9335N0491K8526L4616
11017B84738O745R267J6638O199P345k7057m7669n7254m3634j6299j7018j6667
$$ y = [85338, 84651, 80850, 79503, 72622, 77612, 72602, 67061, 58937, 81751, 96524, 98860, 91254, 99493, 104111, 96612, 102743, 107029, 87133, 70800, 69679, 76162, 72260, 72089, 83225, 84683, 71942, 73184, 71816, 72941, 89336, 87277, 100045, 103610, 105016, 101463, 96155, 94770, 107989, 121669, 110029, 106062, 107053, 98495, 72576, 56856, 78607, 84081, 86566, 96063, 104312, 93708, 85827, 96973, 89508, 83013, 102040, 106479, 106745, 105904, 126088, 128977, 119728, 105979, 111010, 100225, 89952, 99789, 120082, 119297, 116287, 106741, 101468, 98923, 120457, 116232, 105400, 97896, 100926, 106743, 97217, 106487, 121215, 112974, 106366, 118958, 119459, 116800, 143634, 139688, 131770, 171105, 221596, 250122, 284738, 291483, 300750, 317388, 323587, 330932, 303875, 256206, 198952, 155318, 139019, 122001, 105334]
11005A05334L930J7527J7720J313q558n240p599K472M450j375Q205K817n084n783
10991A30129J3679L882k4147r810M931L1728Q283J5376M299J2850O971o366J1614
10978B03419K0967J7707M681p429J8648M9560P2779N4545P6575J25730K19982
10967H57164L26461L81563L58258K55932J61834J40429K01655J95930k2254l83455
10957B473517n53115m73740l20240k22898j36972p9027q1874p9352l7835k1293
10947D67171j6428k0053l0669k4039j8962j4728k1953p953L67k8016j8395K314
10935B68656o730k4856k8978n217K872K337k6333j5226O838R90R215Q939J2989
10922B05496o597p626O92J7728J0287p229j2707k1095p09J579j561m124J7682
$$ y = [105334, 109264, 126791, 144511, 145824, 137266, 132026, 124427, 126899, 131349, 129974, 138179, 140996, 135912, 130129, 143808, 147690, 123543, 113733, 118664, 150392, 158675, 174051, 178350, 191200, 198171, 191805, 203419, 224386, 242093, 246774, 239345, 257993, 307553, 380332, 434877, 511452, 637182, 857164, 1183625, 1565188, 1923446, 2179378, 2341212, 2481641, 2683296, 2879226, 2856972, 2473517, 1920402, 1446662, 1126422, 903524, 766552, 687525, 605651, 526299, 488464, 467171, 450743, 430690, 400021, 375982, 357020, 342292, 320339, 312386, 312753, 284737, 266342, 268656, 261926, 237070, 208092, 202875, 205747, 208084, 181751, 166525, 173363, 174353, 183568, 192507, 205496, 198899, 191273, 191965, 209693, 219980, 212751, 200044, 178949, 178240, 179819, 178258, 174134, 191816]
10909A91816P74J9826R899k0183q000j962N209N488k7703N093K0210K0210L045
10896B23722o756o880j82O313P413M419j2004o833k2997p217J0534J176j6587
10883A74121j0770J0303j5431J451N430J4079K143P808J3584O939p01o058N467
10870B08365o561n031M610L04N122k7268k6659r598m487k5193k7120j7355p667
10857F1462N025J6504o115j966N280R961J841j1527P591J5185N488m273J347J9622
10843A25425K0695J1608M852j5646j8168j2077p36J381K0427p55J0122j546k945
10830A42637K814Q121m686j6567j3222O018Q624J7005O395J6629m31R713K0271
10817B03321J7150J6917K8711K5831L039j4125j845K0871O0758N0014J9653L3457
$$ y = [191816, 192590, 212416, 222315, 202132, 194132, 192170, 197379, 202867, 175164, 180257, 200467, 220677, 223722, 216966, 210086, 209904, 216217, 223630, 228049, 216045, 209212, 186215, 178998, 189532, 190708, 174121, 163351, 173654, 158223, 159674, 165104, 179183, 181326, 189134, 202718, 209657, 208956, 202898, 208365, 201804, 196773, 201383, 201687, 206809, 179541, 152882, 143284, 138797, 113604, 86484, 69129, 61462, 66487, 82991, 76876, 74910, 80190, 90151, 91992, 80465, 88056, 103241, 108729, 104456, 105803, 125425, 146120, 157728, 162580, 146934, 128766, 116689, 115953, 117334, 137761, 137006, 147128, 145582, 142637, 145451, 153572, 148886, 132319, 119097, 125115, 133739, 150744, 157139, 173768, 173337, 183050, 203321, 220471, 237388, 266099, 291930, 294969, 280844, 278999, 299870, 360628, 410642, 430295, 463752]
10805D63752N8685n796k4064k7574n4085o9600k3793M1786K370k4859k7144o410
10793C03268N858o823k7945j4115O759J1810N491Q242J5744l57k0069p651r360
10780B70852r783p375j3261j8251j3792j4600j190K521R681k058L14K1232N588
10767B29878L924j790J3615R957N96O023L2415R850j5518J8223J9986l677k1777
10754C01705R20O662K9719K8089J7483J465K229J4607J5243J7044M1943K3963
10742E01072k088n628j464k4195k2191J1970J5368R322n95j5756j1476K1798J644
10729D77781j1485l3688J3017K993r731k2914M425R196J791N658K734j0886O357
10716D35248J8786J2280J7192n235m047j8469k9736k1850j0373k303j2364j0216
$$ y = [463752, 522437, 516641, 492577, 465003, 410918, 341318, 317525, 359311, 361681, 336822, 309678, 303268, 309126, 302303, 274358, 260243, 267002, 278812, 284303, 292545, 308289, 307932, 287863, 280212, 270852, 261069, 253694, 240433, 222182, 208390, 193790, 192600, 195121, 204802, 202744, 203058, 224290, 229878, 233802, 232012, 245627, 255584, 256180, 262203, 294618, 304468, 288950, 307173, 327159, 323482, 301705, 302625, 309287, 339006, 367095, 384578, 386043, 388272, 402879, 418122, 435166, 477109, 501072, 498984, 493356, 491892, 467697, 445506, 457476, 472844, 482166, 481571, 465815, 454339, 476137, 477781, 466296, 432608, 445625, 448618, 438887, 415973, 420398, 429594, 431385, 437043, 439777, 428891, 435248, 454034, 466314, 483506, 478271, 474224, 455755, 426019, 404169, 393796, 391493, 379129, 368913]
10704C68913o196p64J8299J2403K736L406q012L095R648K577j866k3141k9988
10691C51110P821J0068K3241J8963N4312R8461J80032K02614J14710j0714o3951
10680I86667P4419J94244J55894J37268j2752k10279k51711j77482l5796J5549
10670H76021J4702j794J8120L2539L4852j882L751j085k588j8334k9940k3346
10658I01016J6373R172j8566n2790k8879M668k201M537J3270R932L0123L7286
10646I23941L0517L1642N4010O8300L1689M3540L7685L1710L9503L8615J1378
10635A342530J6697K0134L933P361M671r315Q354J0620J1064J3780K2912M5887
10623A498628N3657K9654M9896L3272J1435K1899L6658L4578N1284N5879K9089
$$ y = [368913, 362717, 361953, 380252, 392655, 395391, 398797, 390785, 393880, 403528, 406105, 404239, 381098, 351110, 358931, 368999, 392240, 411203, 465515, 563976, 744008, 946622, 1061332, 1050618, 986667, 1061086, 1255330, 1411224, 1548492, 1535740, 1325461, 1073750, 896268, 860472, 876021, 890723, 888929, 907049, 939588, 974440, 972558, 976309, 975224, 972636, 954302, 924362, 901016, 917389, 926561, 907995, 855205, 826326, 830994, 828793, 833330, 846600, 856532, 886655, 923941, 954458, 986100, 1040110, 1108410, 1140099, 1183639, 1221324, 1253034, 1292537, 1331152, 1342530, 1359227, 1379361, 1383294, 1390655, 1395326, 1386011, 1394365, 1404985, 1416049, 1429829, 1452741, 1498628, 1552285, 1581939, 1631835, 1665107, 1676542, 1698441, 1735099, 1769677, 1820961, 1876840, 1905929]
10612A905929K6500N2884O1068N3725Q1401P0169Q3121P6834R3011J15568J15272
10601B735482R1631Q2937P5971O9944N5461Q4574J34743J40393J71629K06567
10591C849332K53382K48575K45325K45157K76410L31333L35272L34946L53734
10582F473466L79603M68826N87616P03702P98598Q22033P67297Q49976J062528
10573A2913645J237950J319549J161197J049867J334918J863439K476922L210367
10565B6567854M082225N115438O507102Q548540J1946164J7673907K7392850M2507455
10557A50341535O0183156P0284308O3505469L8476898K4435585L1075743L5766554
10550D74069248L4361598p464371p7204692j04369293q4199556n6759766l7541706
$$ y = [1905929, 1932429, 1985313, 2046381, 2100106, 2181507, 2251676, 2334797, 2411631, 2504642, 2620210, 2735482, 2827113, 2910050, 2986021, 3055965, 3111426, 3196000, 3330743, 3471136, 3642765, 3849332, 4102714, 4351289, 4596614, 4841771, 5118181, 5449514, 5784786, 6119732, 6473466, 6853069, 7321895, 7909511, 8613213, 9411811, 10233844, 11001141, 11851117, 12913645, 14151595, 15471144, 16632341, 17682208, 19017126, 20880565, 23357487, 26567854, 30650079, 35765517, 42272619, 50821159, 62767323, 80441230, 107834080, 150341535, 210524691, 280808999, 344314468, 382791366, 407226951, 438302694, 474069248, 508430846, 500966475, 423761783, 319392490, 235192934, 178433168, 140891462]
10543A40891462k5337131j7932565j3289089j0038304p659403n890666m620297
10536E6124007l751277l099735k522841k053668j655786j437220j451310j585462
10528C8566708j562513j428594j302889j387163j753717j973139j890677j657715
10520B5610301j465722j331220j226627j071064r39690q16806p02292o12422n97160
10511A6847298o05529o16084o07817n42720m79629m92385n16311n23704n26997
10502A1936122m66777l95136l68361l74042l50393k84570k37402j78507j41354
10493I139580j60340j94746k10622k37821k24753k43598k35528k40035k41795
10484G150342k23155k09613k08071j98040j98918j88068j64532j61797j56337
$$ y = [140891462, 115554331, 97621766, 84332677, 74294373, 66634970, 60744304, 56124007, 52372730, 49272995, 46750154, 44696486, 43040700, 41603480, 40152170, 38566708, 37004195, 35575601, 34272712, 32885549, 31131832, 29158693, 27268016, 25610301, 24144579, 22813359, 21586732, 20515668, 19575978, 18759172, 18056880, 17444458, 16847298, 16241769, 15625685, 15017868, 14475148, 13995519, 13503134, 12986823, 12463119, 11936122, 11469345, 11074209, 10705848, 10331806, 9981413, 9696843, 9459441, 9280934, 9139580, 8979240, 8784494, 8573872, 8336051, 8111298, 7867700, 7632172, 7392137, 7150342, 6927187, 6717574, 6509503, 6311463, 6112545, 5924477, 5759945, 5598148, 5441811]
10475E441811j37159j16803j23669j05726p4984m0187k0298m5321r9312j09264
10465D569088j05364r0519q6131q3403r4446j08730j16706j00241r8174q4405
10455C600969q4359j01214q6002q5337m9546n1730p8925r3988r3443q7703p3439
10444B715283l9471o7911o0857k3163j3405k7357p331m167m8657m9866o3404r3342
10432B216352r3206j28244j05787n5509o4503j19162j30596q1144K0395K6884
10422A485480p2264j51305j38125m8418n9460m1314j3888k5973m4482l7532n4480
10411G98239m7803j2124p102j6207l505j6956j5260k2851p815m04K9699L3083
10399G10994l020j7773J078q440q785j2587j2027r970K3853M8924P1181Q5624
$$ y = [5441811, 5304652, 5187849, 5064180, 4958454, 4883470, 4843283, 4822985, 4777664, 4678352, 4569088, 4463724, 4373205, 4287074, 4203671, 4109225, 4000495, 3883789, 3783548, 3685374, 3600969, 3516610, 3415396, 3329394, 3244057, 3194511, 3142781, 3063856, 2969868, 2876425, 2788722, 2715283, 2675812, 2607901, 2547044, 2523881, 2510476, 2483119, 2475788, 2471621, 2422964, 2373098, 2309694, 2216352, 2123146, 1994902, 1889115, 1833606, 1769103, 1649941, 1519345, 1438201, 1458596, 1485480, 1413216, 1261911, 1123786, 1075368, 1015908, 974594, 960706, 934733, 890251, 852719, 798239, 750436, 738312, 731210, 715003, 711498, 694542, 679282, 656431, 648616, 648212, 677911, 710994, 707974, 690201, 691279, 682839, 674054, 661467, 649440, 639470, 663323, 712247, 783428, 869052]
10387H69052J32893J91767K58392L42802L79023L07395J92188J55069J70220J57102
10377C155903R1235k25902n14935n52558m12670k62439j86866j37918j01803p4432
10367G77615m9004l9222m9535p8479l4201j6329j384l005k4457k2885k041j7032
10355D40041m210J4063J2175j835K8180K022l5041j5530N14j4130r748J0316k478
10342D24339J2674L0532j93K0189K5933J9812L1433J2989J6796L660K0973J2497
10330F31634J7974L8538N5056N7784Q6857R4840J32115J47752J24249J20013J15155
10319A621967R8713Q7674O3061k1546j01175j06726j03763j40806j32064j45458
10309A119877j31804j04690q9625q0009p5233m9806m3448k5886k584k4921k7245
$$ y = [869052, 1001945, 1193712, 1452104, 1794906, 2173929, 2481324, 2673512, 2828581, 2998801, 3155903, 3247138, 3021236, 2506301, 1953743, 1541073, 1278634, 1091768, 953850, 852047, 777615, 728611, 689389, 639854, 561375, 527174, 510845, 509461, 506456, 481999, 459114, 457073, 440041, 435831, 449894, 462069, 460234, 488414, 490436, 455395, 439865, 440379, 426249, 416501, 426817, 424339, 437013, 467545, 467352, 487541, 513474, 533286, 564719, 577708, 594504, 598164, 619137, 631634, 649608, 688146, 743202, 800986, 887843, 982683, 1114798, 1262550, 1386799, 1506812, 1621967, 1720680, 1808354, 1871415, 1849869, 1748694, 1641968, 1538205, 1397399, 1265335, 1119877, 988073, 883383, 793758, 713749, 638516, 588710, 545262, 519376, 516792, 491871, 464626]
10298D64626k1112J2178j3021m3032j548J328l7106j5967q927l934j1795p491
10286C14199o075j0810k5759n386j0620j549K125j2134k136o11l90J2371m665
10273B48560m873l0507k2237P96K398j530q804n793k069k3342j8845K1666J0572
10260A65992M369N116J7089K2950P173L882m602M399j4423m079L279Q744N204
10247B25093j2723j9249j0258P818J2826j4948M819o289j0607j8861j6902k5085
10235A15634k0744j6165j1411p311O23J914j159J4084M061J8887N022Q728J5943
10222A28106P796j8259o366O484R0j4068K964n183j3448j2314q866j105Q065J829
10208G5725J8105J6409L468n87K7364J8777j2388J1871O419J5128M4729M8339
$$ y = [464626, 443514, 455692, 442671, 399639, 398091, 399419, 362313, 346346, 337419, 333485, 321690, 314199, 308124, 297314, 271555, 266169, 255549, 254000, 256125, 243991, 241855, 241244, 240854, 253225, 248560, 243687, 213180, 190943, 191739, 194137, 192607, 183803, 178010, 175941, 152599, 133754, 155420, 165992, 170361, 175477, 192566, 215516, 222689, 226571, 221969, 226368, 211945, 207866, 211145, 219889, 225093, 212370, 193121, 182863, 190681, 203507, 188559, 193378, 187089, 176482, 157621, 140719, 115634, 94890, 78725, 67314, 60003, 60626, 62540, 61381, 75465, 79526, 98413, 103435, 112163, 128106, 135902, 117643, 111277, 117761, 117851, 103783, 106747, 101564, 88116, 75802, 66936, 65831, 73896, 75725, 93830, 110239, 113707, 113120, 140484, 159261, 146873, 158744, 165163, 180291, 225020, 273359]
10196B73359M9693M0295N4277L0689L2740Q3243P3971N1569L3611l3695n2528
10185F37224k1856p710o56l8784q7889q2106n3392k9714k0606j2593j5838j0636
10173B55444j9459n756k2042K700o700P093O183o883K0633N527l703j1311q425
10160B13301l075l406P745Q836L1256J5360j1954l7536M18K2722L8543L0282K3862
10147C36354L8727M4703N4528J11307J76449K67416L69620L96863L18430J79195
10137B293592J36457J75318K01823J45881j95243n28339n46852m04747k81245
10128I96645j83243j12016q9081o7166m6109l8031k5003l0088J710j0947j1062
10117C85609J270l160j0582j2645l3107j9247k0144k5638l512r640j3528K108
$$ y = [273359, 323052, 363347, 417624, 448313, 481053, 564296, 638267, 689836, 723447, 689752, 637224, 615368, 607658, 607002, 568218, 480329, 398223, 344831, 315117, 294511, 281918, 266080, 255444, 235985, 230229, 208187, 210887, 204187, 211280, 217463, 210580, 231213, 236740, 233037, 221726, 213301, 210226, 206820, 214565, 223401, 254657, 270017, 258063, 220527, 220945, 243667, 282210, 312492, 336354, 375081, 419784, 474312, 585619, 762068, 1029484, 1399104, 1795967, 2114397, 2293592, 2430049, 2605367, 2807190, 2953071, 2757828, 2229489, 1682637, 1277890, 996645, 813402, 701386, 612305, 545139, 499030, 460999, 435996, 405908, 407618, 396671, 385609, 386879, 383719, 373137, 360492, 327385, 308138, 287994, 262356, 258844, 249204, 235676, 237784]
10105B37784r252M091l00p013N700k716o136R272L1148l479q679J1962O063m294
10091B64151m270j3104m0756j7426o061j905p211O708J6097n0p39m187o464q962
10077A75821k1598K3308R368R434L4319J0494j3089k1500j3954j6844q923j2921
10065A53915Q886J4733j4334k2167p16j7010o56M390Q867O161r796j6134m420
10052A11719J7800K3484M420N555J0470o673j3849J2408k421p924K906O16P708
10039A66219J659J6070K1166Q301L7432J4943n379o925J0049P305q82l3703l2354
10026B03901j7346j095k168j7022Q715J139p494j121O293j43K49J5797J3850k115
10012B01440j4213o774P567m127j6016k1410q839J5722J5442J782N69O887P300
$$ y = [237784, 228532, 232623, 232323, 225310, 231010, 228294, 222158, 231430, 262578, 259099, 250420, 262382, 268445, 264151, 259881, 246777, 206021, 188595, 182534, 180629, 173418, 180126, 196223, 196173, 195434, 191247, 184783, 175821, 154223, 177531, 186899, 196333, 230652, 241146, 228057, 206557, 192603, 175759, 166836, 153915, 162801, 177534, 163200, 141033, 140317, 123307, 122651, 127041, 135908, 142069, 132273, 116139, 111719, 129519, 153003, 157423, 162978, 173448, 166775, 152926, 165334, 162913, 154989, 157895, 158511, 166219, 167878, 183948, 205114, 213415, 250847, 265790, 260411, 253486, 263535, 270840, 269958, 236255, 203901, 186555, 185460, 183292, 166270, 174985, 176124, 168630, 167509, 173802, 173659, 173908, 189705, 203555, 201440, 187227, 180453, 188020, 183893, 167877, 146467, 137628, 153350, 168792, 170574, 171143, 178030, 185330]
9999A85330j5215j1089j9999J2077J2986L735J8502N363j9886n709p82j2076J0026
9986A63263m627P436J586R652J0139O480r316J6407J4859q864j8164l2009J5006
9973A71848J6529J2941O682o281j7055n239K1548m468k3203n858J1592J5835j061
9960A93810J6066M15l5785q887M352J0320j461P037p037m805J0528k89J367n946
9946A79685J250r60m813L908R686M840J8775J3066j811o830Q402n627m656N211
9932B20126L629o993k321M375k7131N186N694m367q616N343m005j1134P275J1691
9918A98752J1546m699k260p226l656Q731O88m743k557P974k403q572k247J461
9904A90789J9503J9398p429j7007M760Q749K849J2908P370J3570J18N77o028Q482
$$ y = [185330, 170115, 159026, 139027, 151104, 164090, 167825, 186327, 191690, 171804, 166095, 165313, 153237, 163263, 158636, 166072, 167658, 177310, 187449, 193929, 184613, 201020, 215879, 207015, 188851, 156842, 171848, 188377, 201318, 208000, 201719, 184664, 179425, 200973, 196505, 173302, 167444, 179036, 194871, 193810, 209876, 210291, 174506, 165619, 169971, 180291, 178830, 185867, 178830, 174025, 184553, 184264, 185631, 179685, 180935, 179975, 175162, 179070, 188756, 193596, 212371, 225437, 223626, 216796, 225198, 219571, 214915, 220126, 223755, 216762, 214441, 218816, 191685, 196871, 202565, 198198, 189582, 194925, 190920, 179786, 187061, 198752, 210298, 205599, 203339, 196113, 192457, 201188, 201876, 197133, 194576, 202550, 200147, 191575, 189328, 190789, 210292, 229690, 222261, 205254, 210014, 218763, 221612, 234520, 241890, 255460, 255578, 256155, 250127, 258609]
9890B58609J5802p955k1393k6655k412l497j8759q432l42J3081N711P569J6864
9877B28191J2355l82k6420L731M253L416n470j3077p213J8634q04K929N52J8955
9863B39650M5j6172n502o876k0402l377j2731j3145R766J8661Q949o06j0917j73
9849A87170L639k498l556q289n824o083J0515J1579J7673R265OM592j4800r825
9835A93564J0661J1749L258L78j402J0030r215j1607p114P296K378L006r49J5885
9821B27918m334q515m295K799K437j3131r900Q082P114k632j3061k012N033j2134
9807A83369J3476p365j4638K650K7836n334j7058j6249R561Q499j5993j9007K2408
9794A72155O084j8370o788J9130P599p21p924n87j9669j4596j2878K953K0111
$$ y = [258609, 274411, 266456, 245063, 218408, 215996, 212499, 193740, 185308, 184966, 198047, 203758, 211327, 228191, 240546, 240164, 213744, 217475, 221728, 225144, 219674, 206597, 199384, 218018, 217214, 220143, 220695, 239650, 239695, 223523, 218021, 211145, 190743, 187366, 174635, 161490, 171256, 189917, 198866, 198260, 187343, 187170, 190809, 188311, 184755, 176466, 170642, 164559, 175074, 186653, 204326, 213591, 213597, 218189, 203389, 193564, 204225, 215974, 219232, 219610, 218208, 228238, 219023, 207416, 200302, 207598, 209976, 212982, 212033, 227918, 223584, 215069, 210774, 213573, 216010, 202879, 192979, 201061, 208175, 205543, 192482, 190470, 195503, 183369, 196845, 189480, 174842, 177492, 205328, 199994, 182936, 166687, 176248, 184747, 168754, 149747, 172155, 178239, 159869, 153081, 172211, 179810, 179089, 171165, 170578, 150909, 136313, 123435, 126388, 146499]
9781A46499J0892l903q620n920L8509K1141j8137j7068j0482j2508J5703j276
9769A54830q341q779J8467Q681P272j5703J75J578j1533j1069O091K2580J3552
9756A77801Q684j6806j7320j794J1815k607j4027q017N346J9315L267j1647J0791
9743A64801P359j4768M96N828M853j8053P341K624O446m269n649J960k1050k51
9729A37668P156m079l320P48k772O090J409j3198j742J2177k0624r159l321J3231
9715A20264L1440m692j3624j1730R172J0687L816j5595j7633n681j984L29K1173
9702A25942N647j894L101j5947k6193k0350J0889J3273j0863M056J9259J4120
9690A21040J0199N01J2329r467k4456p743j1600J6075J672j1253R656J3614n896
$$ y = [146499, 157391, 153488, 144868, 138948, 177457, 198598, 180461, 163393, 152911, 140403, 156106, 154830, 146489, 137710, 156177, 164858, 172130, 156427, 156602, 158180, 146647, 135578, 141669, 164249, 177801, 186485, 169679, 152359, 150565, 162380, 159773, 145746, 137729, 143075, 162390, 165657, 154010, 164801, 172160, 157392, 157888, 163716, 168569, 150516, 157857, 160481, 166927, 162658, 157009, 158969, 137919, 137668, 144824, 140745, 137425, 138173, 135401, 141491, 142900, 129702, 127960, 140137, 119513, 110354, 107033, 120264, 151704, 147012, 133388, 121658, 130830, 141517, 145333, 129738, 112105, 106424, 104440, 104769, 125942, 131589, 129695, 132796, 116849, 90656, 70306, 81195, 94468, 83605, 87661, 106920, 121040, 131239, 131740, 144069, 134602, 110146, 102403, 90803, 106878, 108550, 97297, 106953, 120567, 114671]
9677A14671q159J5079J5731m907J2074j1486j5870j8934M77j104L439R787R371
9664A20169j1327j1851j4195j6112r51J9008l434m152N590P198k138m585J1235
9651I4455R244O934J2521O30j7841j4949M922m330P056j4447k330J2804M230J1555
9637A10454j5064p120o325j0168P44J6849J1906K168j143r600R795O982k5653
9624H3825k25q672p413o788L1137J5337M376n586j5694J1615O491r11q998r37
9610I7557o793O238k1319l5125L584O043J8012N82k6202K644L5032J6595j8551
9597G8297r668Q290j824J771j9542j4823M429J7819R820J2941q417j4750l562
9584F0781J1544m794j4500l0451n590K6442M248P266J4038J224P960m715j0359
$$ y = [114671, 106512, 121591, 137322, 132415, 144489, 133003, 117133, 98199, 98676, 97572, 101011, 110798, 120169, 108842, 96991, 82796, 66684, 65733, 84741, 81307, 77155, 82745, 89943, 87805, 83220, 94455, 103699, 110633, 123154, 123784, 105943, 90994, 95916, 91586, 98642, 84195, 81865, 94669, 98899, 110454, 95390, 88270, 81945, 71777, 72521, 89370, 101276, 103444, 102301, 92701, 102496, 109478, 83825, 83600, 74928, 67515, 60727, 91864, 107201, 111577, 105991, 90297, 101912, 108403, 107492, 98494, 97557, 90764, 97002, 75683, 40558, 44142, 50185, 68197, 68779, 42577, 45221, 80253, 96848, 78297, 68629, 76919, 75095, 76866, 57324, 42501, 46930, 64749, 74569, 87510, 79093, 64343, 60781, 72325, 67531, 53031, 22580, 16990, 43432, 47680, 54946, 68984, 70208, 78168, 73453, 63094]
9571F3094J9198J268j1078p014o243J351N670L709J761m212L050O295N512j9400
9557F2961j2751j529m05J5277J9487r899m162J2305N029K1251M429j3050q250
9544I0693j0835k6753j4418l464j2604j0117l531j041r344K867J3530J3708J58
9531B8849k0238j4615N645R600J6796K0840J3502J118L178j812k1468r960J1407
9518D2842K540O849J4599j3167n965L419n157j770n525k497k7470j970q303Q175
9504F600K1414J2983l027K572M596J2978L602j1974Q229J849j9041k0066O595
9491B7310K6500R039j8086J278J0554n138K100r102K279J3054k1149j5604J8920
9478D1955J5308r007j6910j3211L691N942Q179j2618L264M083p271q318K1856
$$ y = [63094, 82292, 83560, 72482, 65468, 59225, 60576, 66246, 69955, 71716, 67504, 70554, 76849, 82361, 62961, 50210, 48681, 48276, 63553, 83040, 73141, 68979, 81284, 86313, 107564, 111993, 98943, 90693, 79858, 53105, 38687, 35223, 22619, 12502, 8971, 7930, -1414, 1453, 14983, 28691, 28849, 8611, -6004, -359, 9241, 26037, 46877, 60379, 61497, 64675, 62863, 41395, 31435, 42842, 45382, 52231, 66830, 53663, 47698, 51117, 45960, 44190, 38665, 36168, 8698, 6728, -1575, 6600, 28014, 40997, 37970, 40542, 45138, 58116, 61718, 49744, 57973, 59822, 40781, 20715, 27310, 53810, 62849, 44763, 46041, 56595, 51457, 53557, 44455, 46734, 59788, 38639, 23035, 41955, 57263, 48256, 31346, 18135, 21826, 27768, 35947, 23329, 26593, 30676, 23405, 15087, 36943]
9465C6943K91r545l275O282N601J462j279m965p682j2581Q206J6667j5173O986
9451B7938L178n377J872k292O230K0387r664l148j4056m804M060J6988M703l927
9437D2088r662J2818N521r581J9484N210k2756n323m214M718O971l324M232L298
9423D9480J866J0067j7136j3565K111J0684j0394o359J5962K3361K1230J444l3379
9410E5372k792J5897j921j6015k737q315p298m293J2723j4349l779K9820K2883
9397G5196l455j4956j7157k7385O158Q615M644m952j1349j3061R295K2401R462
9384D3456J226L301k7084j5158q033k4315K2699M1149K2367j8318l0794j2862
9372b366M373N317k2157J681J0997J3986K8042k524j0152R464N285k452M552M563
$$ y = [36943, 37234, 27689, 24414, 30696, 36297, 37759, 36480, 31515, 23833, 11252, 19458, 36125, 20952, 27938, 31116, 25739, 27611, 25319, 31549, 51936, 42272, 39124, 25068, 20264, 24324, 41312, 46015, 42088, 32426, 45244, 50765, 41184, 60668, 65878, 43122, 37799, 33585, 38303, 45274, 41950, 46182, 49480, 51346, 61413, 44277, 30712, 32823, 43507, 33113, 26754, 42716, 66077, 87307, 88751, 55372, 52580, 68477, 66556, 50541, 47804, 39489, 32191, 27898, 40621, 26272, 22493, 52313, 75196, 71741, 56785, 39628, 12243, 18401, 27016, 31660, 26708, 15359, 2298, 11593, 33994, 43456, 44682, 47983, 20899, 5741, -2292, -26607, -3908, 37241, 59608, 41290, 10496, -2366, 2007, 7324, -14833, -13152, -2155, 11831, 39873, 37349, 27197, 36661, 41946, 39494, 44046, 48609]
9358D8609n425j3846k530k86J3367l577j5928j2205Q985J6412J1181k9318p828
9345G611l40K482P24J6059j780M881L966K7192J586j20p675r790j5726M892M227
9330C8189k999m743j0926k273k140M663M02P505R553J256j4184J598K268j4627
9316A3542r138N938L412p069P95J2235M139J30Q91P607O966k6365j5730J2325
9302I678L0845m039j9858n83j5063J0236R412P586m319j5208j506J9767M924l862
9288B8010K772O17r927P076j1964k7093J3435J100l119j1225Q299J0393j9415
9275a1041p557K5524J9933k0120k6001n88P091J5830J8683J4392N717k758Q516
9262D7621J744o564j6204j3927L017L706K549J9055n050l0578l09L642J1538R111
$$ y = [48609, 43184, 29338, 26808, 26522, 39889, 36312, 20384, 8179, 17164, 33576, 44757, 15439, 7611, 7271, 9753, 10477, 26536, 24756, 29637, 33603, 60795, 62381, 62261, 54586, 44796, 29070, 33962, 38189, 35190, 30447, 19521, 17248, 15108, 19771, 20173, 27678, 37231, 38487, 24303, 25901, 28169, 13542, 4404, 10342, 13754, 6685, 7480, 19715, 23854, 23984, 24875, 32482, 39448, 13083, -2647, 9678, 40523, 36484, 16626, 16043, 980, 11216, 20628, 28214, 23895, 8687, 7181, 26948, 31872, 28010, 30782, 31399, 21472, 28548, 16584, -10509, 2926, 4026, 907, -10318, -2019, 8374, -11041, -18598, 6926, 26859, 6739, -19262, -19850, -12759, 3071, 21754, 36146, 41863, 39105, 47621, 49365, 42801, 26597, 12670, 15687, 19393, 21942, 40997, 35947, 5369, 5060, 8702, 20240, 29351]
9248B9351l570J4759O370k3213k9982J1816K1433J1708P247N419o894o606M894
9235D2732p149m828K883P721O828m536q604p955o457j065p505J557j7279k327
9221e984j6541R886J2556l718j8575R064J4432j4480K2979O719j1499j126O515
9208A0228J0275p872j2193m524N182q127N519Q162K141R817J7039J0798J2309
9195E8754k0417k2576n242J2469N358J1238o735o91j1312k3691J8606J7040J487
9182C4288k144j0760J1759q573l808j994J7277K0885m112l3802j7569M182L375
9169I004N131J3098l102j1641K001J98J8988k682p936k0261j2305L619p597o933
9155b0418Q247J5500P291r10o601K862J341P655L743O772Q428K5584j70r816n003
$$ y = [29351, 25781, 40540, 46910, 23697, -6285, 5531, 26964, 38672, 45919, 51338, 44444, 37838, 42732, 35583, 30755, 33638, 41359, 48187, 43651, 35047, 27092, 20635, 19570, 12065, 13622, -3657, -5984, -22525, -12639, -83, -3801, -22376, -13312, 1120, -13360, 9619, 16338, 4839, 3713, 10228, 20503, 12631, 438, -4086, 1096, -7031, -1512, 6650, 8791, 18608, 35647, 46445, 58754, 38337, 15761, 10519, 22988, 28346, 39584, 32849, 32158, 20846, -2845, 15761, 32801, 34288, 32144, 21384, 33143, 24570, 20762, 18768, 36045, 56930, 52818, 19016, 1447, 5629, 9004, 14135, 27233, 24131, 12490, 14491, 14689, 33677, 30995, 23059, 2798, -9507, -5888, -13485, -20418, -12171, 3329, 10620, 9710, 3109, 5971, 7312, 14967, 18710, 25482, 33910, 59494, 59324, 49508, 44505]
9140D4505q249m931k0708K224M643j1449j2572J7221J0701P401p88J968p191q640
9126A4135l772K243j2138p791L049K3132N662l608J6297q218k1989q851Q558J586
9112H295K0473K710j0694P51q254J6096J64j1959r359r138R931K8430P647j5839
9098B9254O661R628o539j8218j0299J8461L329n681j0093K4642q366Q549j625
9085C9703j624N063j5695R755J6023o452k3052M110J044n882M055p007n59r512
9071I970k159J7037O538R701k432j4591k1920j3743O488n966O648M18k0068r738
9057c3817O588P908M584K900M052J5430k206k1480R386R358j647j3726k010K024
9043a2656M401M632R144N647o641j3460r805P378M633Q898L367K4162o27n120
$$ y = [44505, 36256, 31325, 10617, 12841, 17484, 6035, -6537, 10684, 21385, 28786, 27998, 29966, 22775, 14135, 10363, 12606, 468, -7323, -4274, 18858, 24520, 20912, 37209, 28991, 7002, -1849, 6709, 8295, 28768, 31478, 20784, 21535, 13281, 29377, 29541, 17582, 8223, -915, 9016, 37446, 45093, 29254, 35915, 45543, 39004, 20786, 10487, 28948, 32277, 26596, 16503, 41145, 32779, 41328, 39703, 38079, 43142, 27447, 37202, 53225, 46773, 23721, 27831, 28875, 22993, 27048, 20041, 19482, 9970, 7811, 24848, 31386, 41087, 38655, 24064, 2144, -11599, -5111, -11077, -4429, -4011, -24079, -33817, -27229, -19321, -14737, -11837, -7785, 7645, 5439, -16041, -6655, 2703, 1056, -12670, -14680, -12656, -8255, -3623, 5521, 11168, 4527, -8933, -18738, -11360, -6727, 2171, 5538, 29700, 29073, 23953]
9029B3953p844j5416k4317J2443K3290J3162r27n160l293r881j0401l144P2N328
9015b135O531J5832J4833Q197o882k1299r384n848r12q092K784N313K0794P237
9001B6969o511m257m804m957j5434k284J1798K7650q011k0219n291K1997M524
8988B1170j6658j822p08j1546j1196P540O657K0403N408q117j1336j1739L80J4664
8974C100J3043J6538R170p661n641l82M375n766n22L295j3283K548l787l754N593
8959A6866k579Q999J676k659J197Q953J2794j511p534K262q991n778J0094l185
8945C0604j3747m707p444K309j2120j3696J333J5077J9155k8812j2731J6413n286
8932a3652j6292L1604K6012K892k6302J0285K2000K2589P839j8411j5425m956
$$ y = [23953, 16109, 693, -23624, -11181, 12109, 25271, 24344, 19184, 15891, 6010, -4391, -7535, -7463, -2135, 4396, 20228, 35061, 43258, 36376, 15077, 5693, -155, -1067, -9159, -6375, -1062, 19732, 26969, 20458, 16201, 11397, 6440, -8994, -11278, 520, 28170, 20159, -60, -5351, 16646, 21170, 4512, 2690, 1982, -9564, -20760, -13220, -6563, 13840, 19248, 11131, -205, -11944, -11564, 3100, 16143, 32681, 41851, 34190, 28549, 28167, 32542, 26776, 26254, 29549, 16266, 18814, 15027, 11273, 16866, 14287, 23286, 24962, 22303, 23500, 32453, 45247, 43736, 36202, 38464, 29473, 23695, 33789, 30604, 16857, 12150, 4706, 7015, -5105, -18801, -17468, -2391, 16764, -12048, -24779, -8366, -13652, -29944, 1660, 27672, 30564, 4262, 14547, 36547, 59136, 66975, 48564, 33139, 28183]
8920B8183r575j7936Q18O8q872K021J4444J7565J0613J637j6696k150m130k0556
8906d566J5759M336k0494m59K0185M408J6q257m898J5587R961o157J133n856j6710
8891C988L420m238q424K522K274J0328J2716N770l854j7067M892L032l947L037
8877A4449J6827j0604m18j0670l007m025K159J1753r25j0920J8043J1258n962
8864B7958k2449q046k0864K229M321P952j3046l231J9872J5951P149J5823J538
8851C5157j4638j3054k244l4566Q92J8597j1872j508K4630J2781P203P44k5837
8838c715p564J0495j1209P789P813n584k858R112K412J4428J3884r150j3324K313
8824A4842L379J181R928k6604k420K3826J0518k3736m735L430M580r474J0875
$$ y = [28183, 18608, 672, 1490, 1558, -7314, -5293, 9151, 26716, 37329, 38966, 22270, 20120, 15990, -4566, 11193, 15529, -4965, -5424, 14761, 19169, 19185, 10928, 6030, 21617, 31578, 25421, 26554, 20698, 3988, 7408, 3170, -5254, -2732, -458, 9870, 22586, 28356, 24502, 7435, 12327, 15359, 11412, 14449, 31276, 20672, 20254, 9584, 6577, 2552, 4711, 16464, 15539, 4619, 22662, 33920, 27958, 5509, -2537, -23401, -21172, -16851, -8899, -21945, -25176, -5304, 10647, 17796, 33619, 35157, 20519, 7465, 5221, -29345, -28453, -9856, -21728, -23236, 1394, 14175, 21378, 22122, -3715, -11279, -784, -11993, -4204, 3609, -1975, -4833, 4279, 6691, 21119, 35003, 25853, 12529, 14842, 18221, 19402, 29330, 2726, 306, 24132, 34650, 10914, 6179, 9609, 14189, 4715, 15590]
8811A5590l671J2476k715q68K917m066J863l585j5496L511l676j072J0983J2485
8797B4676j5148R781J2279k615k6878j2188J9641N370k1489J1703L7663J0699
8785E3494n930j2892k2857J561o555l547j022k147q93k195o727J6966J0874M840
8771B2970o856r745q272l943K984l516M993Q497K09L594o386K667R830j2261k3085
8756a8320l699K227P240o993J2004J3861k165O964J7990j4936J69j1475q370p605
8742a3108k682R879o067q806J1316J8827J9632J7242j0006j8353r906J1976J3268
8729C3212J1828k2496p802m405j5225m67m459j110J8703l512j9355O133L006M000
8715a949n428j2118O300Q189K382k305j888O936J0762m764R088K900p426P579
$$ y = [15590, 11919, 24395, 21680, 20812, 23729, 19663, 21526, 17941, 2445, 5956, 2280, 1208, 12191, 24676, 9528, 19309, 31588, 28973, 2095, -10093, 9548, 14918, -6571, 5132, 42795, 53494, 47564, 34672, 11815, 13376, 6821, 3274, 2252, 105, -788, -2983, -9710, 7256, 18130, 22970, 16114, 6369, -1903, -5846, -2862, -6378, -1385, 7112, 7321, 10915, 4529, 7196, 17026, 4765, -18320, -22019, -19792, -12552, -19545, -7541, 6320, 4155, 11119, 29109, 14173, 14342, 2867, -5503, -13108, -15790, -5911, -11978, -20784, -9468, 9359, 28991, 46233, 36227, 17874, 7968, 19944, 33212, 45040, 22544, 14742, 10337, -4888, -5355, -9814, -10924, 7779, 4267, -15088, -8955, -5949, -1949, -7377, -19495, -13195, -5006, -2624, -4929, -6817, 119, 10881, 6117, 15205, 18105, 10679, 18258]
8701A8258l425r801P971K1676K695k1077L767l000j3842j557J1148P175m252j4762
8687I74J3021j3886Q051O910O235J8270j303r292O316J0275k2278j2402j366J8617
8673B8142J4280j0891j798p899k793j439Q570O904J0164j1406p650n369j5559
8660C256Q440J3768J4448q102O695K779K313j8873q376J0181j176n539K09J4475
8646C4498O547r486P745Q535k1226j299J2793j1928q240J2141m818O018r55o823
8632B3502N343L025K671M87j0270k215M920J0009j856k688J4915J0970m250n125
8618D9438l29Q34M349p340r898J8589J2343p339j0579j146R075k82j688j6569
8604C9458j0788o852p57K1984K0587k638j1143j0458N964J1117m534J854K3427
$$ y = [18258, 14833, 5032, 13003, 34679, 37374, 16297, 20064, 17064, 3222, 1665, 12813, 19988, 15736, 974, 13995, 109, 8160, 15070, 21305, 39575, 38272, 28980, 35296, 45571, 23293, 10891, 9525, 28142, 42422, 31531, 29733, 21834, 19041, 17602, 26172, 33076, 43240, 31834, 24184, 18815, 3256, 11696, 25464, 39912, 31810, 38505, 41284, 43597, 24724, 16348, 26529, 25353, 19814, 20023, 34498, 41045, 31559, 39304, 47839, 26613, 25314, 38107, 26179, 17939, 30080, 25262, 31280, 30325, 23502, 28845, 31870, 34541, 35028, 24758, 22543, 27463, 37472, 35616, 32928, 47843, 58813, 54563, 49438, 49109, 49943, 54292, 46952, 37054, 55643, 67986, 60647, 50068, 48922, 57997, 57715, 56027, 39458, 28670, 21818, 21061, 43045, 63632, 60994, 49851, 39393, 45357, 56474, 51940, 53794, 77221]
8591G7221P423l483j9245R54J5284J7690J1247n374Q348O869J5739m5K25l783
8577A29070m053j1048k1482M41j6338R883O087L228j2531j4984j8035p479J8393
8564F1152m573m5313K31K5348o580k2120J5008Q897p686q104N178J5162L705j2179
8550B8126p673J9055J2104n091j850Q721j0107O916J751j6005j0270j2968l853
8537H856Q104j3817j3100R782R904q287P357J2792J5810p684j7672K786l015j6198
8523d382k2979K0899M8856j0523j361J0575j0523Q51Q200j3750m149R311R036
8510D0061p773j7701O073J150J775N66m339N993n720L720O643m626j3221j0259
8496B342P915L786J8478J2570J2878p762k3396k0275j613j0953m084j7743L674
$$ y = [77221, 84644, 81161, 61916, 62870, 78154, 95844, 107091, 101717, 110065, 116934, 132673, 132628, 132853, 129070, 125017, 113969, 92487, 92928, 76590, 86473, 92560, 95788, 83257, 68273, 50238, 42759, 61152, 56579, 11266, 11497, 36845, 30265, 8145, 23153, 32050, 24364, 16260, 21438, 36600, 40305, 28126, 20453, 39508, 51612, 46521, 44671, 53392, 43285, 50201, 51952, 35947, 25677, 12709, 8856, 16960, 3143, -9957, -175, 9729, 1442, 8799, 21591, 37401, 29717, 12045, 14831, 11816, -4382, -27361, -6462, 42394, 31871, 30510, 41085, 30562, 31413, 39613, 25863, 21714, 31025, 40061, 32288, 14587, 20660, 21810, 23585, 24151, 19812, 25805, 20085, 23805, 30448, 25822, 12601, 2342, 10257, 14043, 32521, 45091, 57969, 50207, 26811, 6536, 4923, -6030, -10114, -27857, -24183]
8483b4183P992l573L8284R006l969j690m404k0170j781K2104K1093Q10l055q89
8469C5575l710k0511j0308n760j6573l251K2273P42l325k868N510j5528N252L4828
8455B2346M665j4688k0553j7295N719O594p030k028o323q96L4256J3718m93k2
8441A7970j6423j0968j8128K093l633k7524n883J3660o358j708K7219R987M7K6406
8427F757J7874j4932j1027j100M962J4329m441j2817Q047q529j1794P658J3218
8414H205J2546L222j4762j698l781L086J2670j4809j7077p539J8140J7887J0153
8401B6243o186j6565j8526L175K023Q638o79j6867m113J2029J6976r368R084L069
8387H933p642m430j707Q616J0022k2705k789j2512j065l572J6141j5732o81p932
$$ y = [-24183, -16191, -19764, 18520, 27526, 23557, 21867, 17463, -2707, -4488, 17616, 38709, 39519, 36464, 35575, 31865, 11354, 1046, -4714, -21287, -24538, -2265, -1523, -4848, -7716, -2206, -17734, -12482, 22346, 27011, 12323, -8230, -25525, -19806, -13212, -20242, -22270, -28593, -29489, 4767, 18485, 17992, 17970, 1547, -9421, -27549, -25456, -29089, -56613, -62496, -48836, -55194, -56902, -29683, -19696, -19649, 6757, 24631, 9699, -1328, -2428, 2534, 16863, 12422, -395, 7652, -877, -12671, -5013, 8205, 20751, 23973, 9211, 7513, 3732, 6818, 19488, 4679, -12398, -19937, -1797, 16090, 26243, 20057, 3492, -15034, -11859, -9836, -1198, -1877, -18744, -22857, -10828, 6148, -3220, 5864, 8933, 1291, -3139, -4846, 3770, 13792, -8913, -11702, -24214, -25279, -28851, -12710, -28442, -29123, -37055]
8373c7055J0894O486Q084K4976o055k267r338j3823J498J5872J2140J0436J2182
8360C4030m225P589j2346j3210j793J3786n693j7068l450O145M161j5233j1742
8347a9049Q756J5380k994j0087j767n779J2703J2924k156o822m742k7161j405
8334c2199N895O85J8773J8423R467j4409k1956M140O597j0836j1800n152j0430
8321d2802J937J1891q61K1535r432q753J1239p010J293K219l383J0775M296o494
8307a3550P591O451l188P401J0008k9716j507J0891m817J2744m373k6315M256
8294b4124J2370J2840p154k1476Q399r963j14l646q805J1147J2278J2865l540
8281h923o656r438O812J5759o168q517R178J3628p927j1358q177M416K090K566
$$ y = [-37055, -26161, -19675, -11591, 13385, 7330, 5063, -4275, -18098, -16600, -728, 11412, 21848, 34030, 29805, 37394, 25048, 11838, 10045, 23831, 18138, 1070, -2380, 3765, 7926, -7307, -19049, -10293, 5087, 2093, -7994, -9761, -15540, -2837, 10087, 7931, 1109, -3633, -30794, -32199, -26304, -25619, -6846, 11577, 21044, 6635, -15321, -11181, -4584, -15420, -27220, -32372, -42802, -40865, -28974, -29835, -8300, -17732, -26485, -15246, -22256, -20963, -18744, -22127, -11352, -7056, -13550, -5959, 492, -2696, 4705, 14713, -15003, -16510, -5619, -10436, 2308, -2065, -28380, -24124, -11754, 1086, -6068, -27544, -19145, -29108, -29222, -32868, -41673, -30526, -18248, -5383, -8923, -15579, -25017, -18205, -2446, -8614, -17131, -7953, 5675, -2252, -13610, -21787, -17371, -15281, -12715]
8267a2715M473o517j0079K4666K3498J7481q404j5755N644L205O619r286r850
8254A2980r619J956j292o574J252N13O753J697J7902K1853j8221l2954j1004N590
8240i168J645m27J6483n760m577j5096J2389K1989J1518j8127r089J2999l83j3284
8226A112j6554j712J6863J5430K2828J731j6906o851k716O943J3507o925j3096
8213A3654j0303R680j3431j7203n945P408J0887K0157j1415m674j9742m758K2215
8200c470J0283j249L809J7086L793j8703m672J6918j7882p249K709M116p298j0865
8186a2674M430k188J9265J560l68l997o611L437q25r253L396m227j1221j226j012
8171b1514J11R908M497Q402j685k287J4001O975J653k088O853J3873j2085k6814
$$ y = [-12715, -8242, -14759, -24838, -172, 23326, 40807, 32403, 16648, 22292, 25497, 32116, 22830, 12980, 3361, 5317, 4025, -2549, -1297, -784, 5969, 7666, 25568, 47421, 29200, -3754, -14758, -9168, -7523, -7950, 8533, 2773, -1804, -16900, -4511, 17478, 28996, 10869, 1780, 14779, 14396, 1112, -15442, -17154, -291, 15139, 37967, 39698, 22792, 15941, 13225, 20168, 33675, 26750, 13654, 3351, 13031, -400, -17603, -23548, -16140, -5253, 14904, 3489, -1185, -20927, -25685, -3470, 6813, 5564, 9373, 26459, 30252, 11549, 6877, 23795, 5913, -1336, 1373, 5489, -1809, -12674, -8244, -10432, 8833, 10393, 10025, 6028, -583, 2854, 2029, -7224, -3828, -8055, -19276, -20502, -21514, -21403, -11495, -6998, 1404, -281, -2568, 11433, 18408, 20061, 17973, 24826, 38699, 26614, -200]
8157b00n432L7658J7512j1675k988q214J3288r867q662j703L831j7034j2640M173
8143a953q962j8460J167J6607J2094k2246j0098M466J0347k1612J0357K4520j324
8130e097j9483N756R40L339O850q241N18R396J0245q5J1736q913O147l214j1080
8115a186o799J1050J6078M59j4517j5280L805N452J9227R757r716M398N409j293
8101B6844K222l166k2984j6778J0911J1812J0916q822j6806k2711l185J8031M822
8088h894J6140Q337L149j4252j1193J992K0661K1778m882o215P869m962r409N557
8074B5676R49k926K066j3685N959k244j495j0680o300O876J2538P115m482l242
8060A6125J0778M151k3597k1206N522J8853J2908L881r796J1852n900j6346J8613
$$ y = [-200, -5632, 32026, 49538, 37863, 34875, 26661, 39949, 30082, 21420, 19717, 23548, 6514, -6126, -1953, -10915, -29375, -28208, -11601, 493, -21753, -31851, -27385, -17038, -38650, -28293, -3773, -5097, -24580, -18824, -17884, -14545, -7695, -15936, -15418, -6022, 4223, 4138, 15874, 6961, 13108, 9894, -1186, -7985, 3065, 19143, 19602, 5085, -10195, -6390, -938, 18289, 28046, 18330, 22728, 28137, 26844, 29066, 25900, 2916, -13862, -2951, 8861, 19777, 10955, -5851, -28562, -31747, -13716, -8894, 7246, 15583, 18732, 4480, -6713, -4721, 15940, 37718, 32836, 26621, 34490, 29528, 20119, 25676, 26625, 23699, 25765, 12080, 18039, 15795, 14300, 3620, -2680, 4196, 16734, 23849, 19367, 16125, 26903, 31054, 7457, -13749, -8227, 10626, 23534, 27415, 17619, 29471, 23571, 7225, 25838]
8047B5838L4r322J2813Q970N02J4285r385L035Q056P960l886m663p222j3784J9428
8032E2659P366j4675l0097l588q469M622K0802O846j8463J6220K8188J897M386
8019F7694l157p803k379q495j020N408q446q364J6644K1586J5093J491j444j1979
8005G4829p991O685L158K147n568j4320M123j6203j216j8096J402k402R631j1099
7991B5080j8015J0764l146p544M1762R967r713K527j3546J2361n424j3528J054
7978C2599N022o453Q783Q905j0127r852J1835P503J9963j2454n102L509J123R660
7964F4914r976n77K178l521o769N603r50n66o627j1123P395r298j3447P890J5772
7949D0898j337k5140q642R006K3324Q775m016p620j2367r56k228J1431K100k2518
$$ y = [25838, 25872, 16550, 29363, 38333, 38835, 53120, 43735, 46770, 54826, 62786, 58900, 54237, 47015, 33231, 52659, 60025, 45350, 15253, 11665, 3196, 7818, 28620, 35466, 17003, 33223, 61411, 63308, 67694, 64537, 56734, 54355, 45860, 44840, 50248, 41802, 33438, 50082, 71668, 86761, 88252, 86808, 74829, 66838, 73523, 76681, 78828, 73260, 58940, 63063, 46860, 45644, 27548, 28950, 26548, 36179, 25080, 7065, 17829, 14683, 7139, 48901, 58868, 49155, 51682, 38136, 50497, 45073, 31545, 32599, 37621, 31168, 39951, 48856, 38729, 28877, 40712, 48215, 68178, 55724, 50622, 54131, 55254, 64914, 54938, 54361, 56539, 53018, 46249, 51852, 50902, 50336, 43709, 32586, 39981, 30683, 17236, 25126, 40898, 39561, 14421, 5779, 14785, 38109, 46884, 42868, 35248, 22881, 21925, 19697, 31128, 33228, 10710]
7935A0710j262K5550N408J053k383J1673k121N34l713j2839p412r647k0771k6112
7921c1332L682J4877J758J059L923r126J9518J8713j1315l866K1893J6007m730
7908D1061q911O216q56k722j1637j0040Q925O842m056m426O197l277m652j3363
7894E301m629j2444R424K368p601J4785P355p359K428J0417j7906K568R545J2527
7880B6779L469j1620j0667j0860L280O362k1177Q789J6431k148n060J814j8785
7867a3393k018J1515J7802L037j3329K522Q741P505n777j0499p226r802O918p834
7853a1838Q86J088j064o409m697L583o813N021J7975K3134L940Q096O909k2063
7839A7748k0273p35R889k347j110n60j0898Q170l398q610J7293J2653o52k3230
$$ y = [10710, 9448, 34998, 40406, 41459, 39076, 50749, 48628, 49162, 45449, 32610, 25198, 15551, -5220, -31332, -27650, -12773, -11015, -9956, -6033, -15159, 4359, 23072, 11757, 7891, 29784, 45791, 41061, 32150, 38366, 37510, 34788, 23151, 13111, 22036, 28878, 24822, 20396, 26593, 23316, 18664, 5301, 672, -11772, -2348, 20, -7581, 7204, 14559, 7200, 9628, 20045, 2139, 4707, 14252, 26779, 30248, 18628, 7961, -2899, 381, 6743, -14434, -5645, 10786, 8638, 3578, 5392, -13393, -15411, -3896, 13906, 16943, 3614, 6136, 14877, 22382, 16605, 6106, -1120, -10922, -4004, -11838, -10952, -9864, -10928, -17337, -22034, -18451, -25264, -20243, -2268, 20866, 24806, 32902, 39811, 17748, -2525, -3260, 6629, 4282, 3172, 2612, -8286, -116, -3514, -12124, 5169, 17822, 17170, -6060]
7825f060l639J2108L902n025M164j1000k2336n654M755N040m093O955M789J8624
7811B530m119q278O940J6374J2852M613k9554j0352K9505J0614j9198r487p050
7798d610q081r846P338j298J1833K337k2012r057LO995K550n485K353M930Q805
7783a3245J0440n849J7990J774j1607j2898j4008o477Q768K4195K0340p650k015
7770I758O165M927k278j1624m178m404m153Q084j15q559r479J9936K940j4759
7756g739P063M671j0743l585p622k0137k147R474J8426K829k601j249O031N798
7742a531O515O008N229M103p435o007q773j8253j8158R247J0618K838L885k916
7728a4630J35j3819j2919J1927J014Q524J168r058M433n638j1132J7173K2937
$$ y = [-6060, -9699, 2409, 6311, 1286, 5450, -5550, -27886, -33540, -28785, -23745, -27838, -20883, -16094, 2530, -1589, -9867, -2927, 13447, 26299, 30912, 1358, -8994, 20511, 31125, 11927, 2440, -4610, -12691, -22537, -15199, -16497, -4664, -2327, -24339, -33396, -33393, -26398, -23848, -29333, -26980, -22050, -13245, -2805, -8654, 9336, 11110, -497, -13395, -27403, -33880, -25112, -917, 19423, 11773, 9758, 15923, 20850, 18572, 6948, 2770, -1634, -5787, 2297, 2182, -6377, -15856, 4080, 7020, -7739, -676, 3995, -6748, -10333, -17955, -38092, -40239, -30765, -12339, -9510, -12111, -13360, -7329, -1531, 4984, 10992, 16221, 20324, 12889, 6882, -1891, -20144, -38302, -29055, -18437, -15599, -11714, -14630, -14495, -28314, -41233, -29306, -28292, -19768, -18600, -27658, -23225, -28863, -39995, -22822, 115]
7715A15J2291J6704j6556k650N583p270q678p881K912J6089m219j2134p345q026
7701b1065n020j5068K1205J8854J0679p800k6745P322J8818p600j8269J234J2086
7688a1369J5395K8678J8982j5436j8360k8963q502K8244j6776P740o031J1193
7676D795p653k6088j7315Q761J2920K3318J0674k077O232L351j4540p179k276
7663g077J1547j560j1249j0941Q482J9108k5283o742K3819J0722j1639q843o77
7650a0333j1438j3944J3607J8326j884j707j4144n857K3263N248l615k0334R56
7637b1856K3814J3200k638R113K7769j3463k2200l984M702n921j8369n071k491
7624a7395m521k354o147J012k6105o385K3700J2657j3765n502j0655L529O068
$$ y = [115, 12406, 29110, 12554, 9904, 15487, 8217, -461, -8342, -5430, 10659, 6440, -5694, -13039, -21065, -26085, -41153, -19948, -1094, 9585, 1785, -24960, -17638, 1180, -6420, -24689, -23455, -11369, 4026, 32704, 51686, 36250, 17890, -11073, -19575, 8669, -8107, -367, -6398, 4795, -2858, -28946, -46261, -37500, -24580, -1262, 9412, 7335, 13567, 16918, 2378, -4801, -7077, 4470, 2910, -8339, -19280, -10798, 8310, -16973, -23715, 104, 10826, -813, -9656, -10333, -21771, -35715, -22108, -3782, -5666, -7373, -21517, -27374, -4111, 1137, -2478, -22812, -21856, 1958, 15158, 12520, 21633, 49402, 35939, 13739, 9755, 14457, 8536, -9833, -14904, -17395, -21916, -24270, -30417, -29405, -55510, -61895, -38195, -25538, -39303, -44805, -55460, -51931, -45863]
7611d5863M212J4919M288R567n760l477K1454K874j0597j5466K6451J1286k6417
7598a2529j2676J2984J574J8446K5102j816M633j864k2769O206j9148j2632J6323
7585A834N394r901q984j191O576j7361J5203j8182l448J6680Q455j2632j248J487
7571a7318k362J3587K644n662j3198J816M469N697o484j5401p675o114k619J3953
7557c4667L3401J5665k2287O12j999j0031P341L791J4261N268N992N883m034j5248
7543C948k5592P460J5299k784j040j976j7749K855j1787P74J1509R722k5452n061
7529c9874J8608L0242l728j6654K268k651L886o15k681J0365O458j2255o847J2227
7515a251J366J400j60P327j5319j464M910J877P780j7639N049J3358M612k1636
$$ y = [-45863, -41651, -26732, -22444, -12877, -18637, -22114, -660, 2214, -8383, -23849, 2602, 13888, -12529, -25205, -12221, -10647, 7799, 32901, 31085, 35718, 33854, 11085, 17291, -1857, -14489, 1834, 7228, -2673, -11657, -12848, -6272, -23633, -8430, -26612, -30060, -13380, -4925, -17557, -18805, -17318, -19680, -6093, -3449, -9111, -22309, -20493, -16024, -10327, -16811, -32212, -39887, -46001, -48620, -34667, -1266, 14399, -7888, -7276, -9275, -19306, -11965, -8174, 6087, 11355, 17347, 23230, 19196, 3948, -21644, -14184, 1115, -1669, -2709, -4685, -22434, -19579, -31366, -30592, -19083, -9361, -34813, -39874, -21266, 8976, 5248, -11406, -9138, -11789, -7903, -8518, -11199, -834, 5624, -6631, -13478, -1251, 115, 1515, 1355, 8682, -6637, -8101, -3191, -1314, 6466, -11173, -6124, 7234, 11846, -9790]
7501i790j614Q603J781J2925K153n796M692K9554J993k0308l9875P939L858j2856
7487a6741l2989J9337J6876Q244l477M497m112j5924K0242K3365P673j906Q632
7474C3717M610j3052k3965k4747M885m230j564R347P374J4761j0325j1299M89
7461a3999J9734m180j2346N385R489m573k3500j8150M801L0624P100p935n149
7448a2699J0932j0586L390O744j410J5211j414p193M718O674K1582J7068k4002
7435B9015k3877j1305p376o158J3550O12o550J3900O955j0773j139n622K96L905
7421d567n459j0154p40n429k75L638o151K1699L431N791J227O435q003L538l241
7406A740j1070n408J5465j1777J537J3673O364o444j6027j1074L713O755J4349
$$ y = [-9790, -11404, -2801, -1020, 11905, 14058, 8262, 12954, 42508, 44501, 24193, -15682, -7743, -3885, -16741, -49730, -30393, -13517, -5273, -8750, -4253, -8365, -24289, -4047, 19318, 26991, 25085, 33717, 38327, 25275, 1310, -23437, -18552, -22782, -24346, -14999, -7625, 7136, -3189, -14488, -13999, 5735, 1555, -10791, -5406, 4083, -490, -23990, -42140, -37339, -6715, 385, -7550, -12699, -1767, -12353, -8963, -2219, -3629, 11582, 10168, 2975, 7693, 14367, 35949, 53017, 29015, 5138, -6167, -13543, -19701, -6151, -5539, -12089, 1811, 8766, -2007, -3146, -8768, -8472, -4567, -10026, -20180, -20920, -26349, -26624, -22986, -29137, -7438, -4007, 1784, 3011, 9446, 1443, 4981, 1740, -9330, -14738, 727, -11050, -9513, 4160, 10524, 4080, -11947, -23021, -19308, -12553, 1796]
7393A796j5075k845J9229o086k1796l2376R937l763J2015K8415O249n56N701o189
7379e344q85J222K0921j4314r661N032r668o550J4152J1704j5168k760J6247J4530
7365A9458k3522j9987k328l656J712o573Q727J5039R624m96N62k0243r548Q897
7351b2334M573O417j4536r766O631q169K03J0027J0876k732j1678o009P835J4865
7337a3797L035m0384n255J4638K0131L1702n381J503J982L286n481k1634k4385
7324d0040J5105J8467L428k433j1901j365J5051L720j6875j3132o629J3648J5723
7311g233j9025j7697l58Q466K985J736L605J6319K566J2727o198O145L731j6273
7297h504o922K835J7545O261q956p112P318n45k0439J303R454r452Q115j0590
$$ y = [1796, -13279, -16124, 3105, -2981, -24777, -57153, -47216, -50979, -38964, -10549, -4300, -4856, 845, -5344, -6229, -5007, 15914, 1600, -8061, -3029, -12697, -19247, -5095, 6609, -8559, -11319, 4928, 19458, -4064, -24051, -26379, -30035, -28323, -34896, -26169, -11130, -1506, -2002, -1440, -21683, -31231, -22334, -17761, -11344, -25880, -35646, -29015, -37184, -36981, -26954, -16078, -18810, -30488, -36497, -28662, -13797, -10762, -51146, -56401, -41763, -21632, 10070, 4689, 6192, 8174, 11460, 5979, -15655, -40040, -24935, -6468, -3040, -5473, -17374, -18739, -3688, 32, -16843, -29975, -36604, -22956, -7233, -26258, -43955, -44313, -35847, -32862, -31126, -27521, -11202, -8636, 4091, -2107, 4038, 7769, -8504, -15426, -12591, 4954, 11215, 2259, -4853, 2465, 1920, -18519, -17216, -7762, -17214, -9099, -19689]
7283a9689J1246K2698L927M77k1671l581k768L23N97j837J7051K364j1768J5456
7269A2825j083J0079m553j016K994j5934m975p208J2913J5156q901K384r730p839
7255d888m38j2220n13O301K879J4435J2536k4657p867k315n69Q056L537q158P455
7240f426j3181j6474n974M516q138Q424P728K0667q380o829O056K3166O749j578
7226A0326J908N689r504j4029j4425k309n48k689o169q738J3079K2241J7169q657
7212C344k867k1543n5l541M037J6215R332k866l734J1699r367M003N534j7956
7198g765k1609j9151J6105L8212J3145j2134k1014j469Q689J723j8211N482K9499
7185A1502R588j5038j4619q623N362J7003L1329m414l2414J0366q90o944j0258
$$ y = [-19689, -8443, 14255, 18182, 18659, -3012, -6593, -9361, -9038, -8441, -10278, 6773, 9137, -2631, 12825, 11742, 21821, 17268, 16252, 19246, 3312, -1663, -8871, 4042, 19198, 10297, 12681, 2951, -4888, -5326, -17546, -18059, -11758, -8879, 5556, 18092, -6565, -14432, -16747, -17316, -9260, -5723, -13881, -6426, -19607, -36081, -42055, -37539, -45677, -37253, -29525, -8858, -17238, -24067, -18011, 5155, 11904, 10326, 12234, 17923, 8419, -5610, -20035, -22344, -22892, -25581, -31750, -40488, -27409, -5168, 12001, 3344, 477, -21066, -21121, -24662, -20625, -4410, 4922, 2056, -1678, 10021, 654, 4657, 10191, -7765, -29374, -48525, -32420, 5792, 18937, 6803, -14211, -15680, -6991, -5268, -23479, -17997, 11502, 21090, 6052, -8567, -17190, -11828, 5175, 36504, 32090, -324, 10042, 9152, 2208, -8050]
7172h050n23K0658L289j1831j796N219r556j0052n95Q346R50n979L634P11J331
7157d244Q781j9344o293L152K518J766K750J7584J6692m204P23N806k2120n947
7143b380N318j0830M800o03J5476r550J0066R023k8311j8656q129L0005R1L49
7129c331k293K0N439K215J1199J0894P839k971j1294n507j5085N63J486o397Q630
7114A407J3177j0201j3664j6606J286J5388K356M694j2056q218P223K4846J4883
7101B4515M716J534o725K100p880j5472M121J7414p704j892j1127J7423M290l5224
7087i911j4812N125J0687q459r834J0266J9880K1463p825j3612j759j3473j7740
7074c0004j2266P460q46m592J3648J7797j4928j0695Q135K8755q672M417O400
$$ y = [-8050, -8573, 12085, 15374, 3543, 1747, 6966, -2590, -12642, -13237, -4891, -3941, -9920, -6286, -5575, -4244, 4537, -14807, -21100, -17948, -15430, -13664, -10914, 6670, 23362, 19158, 19881, 25687, 3567, -2380, 2938, -7892, -3092, -3695, 11781, 2231, 12297, 21320, -6991, -25647, -33776, -3771, -3680, -3331, -5624, -5604, -165, 2050, 13249, 24143, 31982, 29011, 17717, 12210, -2875, -2312, -826, -7223, 1407, 14584, 4383, -9281, -25887, -24601, -9213, -6857, -2163, -14219, -22437, -15214, 9632, 24515, 29231, 30765, 24040, 26140, 18260, 2788, 6909, 24323, 16619, 14727, 3600, 21023, 25313, -9911, -24723, -19598, -8911, -17370, -27204, -16938, 2942, 24405, 16580, 2968, 1209, -12264, -30004, -42270, -34810, -35656, -40248, -26600, -8803, -23731, -34426, -26291, 2464, -6208, -1791, 4609]
7061D609o482j7171J0114J4260P563j3031j3097j651l023K1262N847j2884N695
7048B011r53O686O623N032O553k2517J395J1923k4027j4573J0194j467p02L06
7034a3516p248j1234K1145J4053N085q380n065K301j1318R20N441k1477O13P543
7020b1137j4016J9014k519N815P815M028M521j1346j5232R394R017n783N391r452
7006a4490j3589q149m009l226J4984k12P740J1225j146k294J2316J1397M593n635
6992I505j1519k953K248R271p31j6726N611J2268K0344R195j7906k2820n526J3440
6978C701J3228j7015j0993J16J1832q990k4476j280j603K544J8739r483j237P296
6964a7621N323M517o763n38J894Q023J0192j4512O082L393J0098P191k3884k0980
$$ y = [4609, -1873, -19044, -8930, 5330, 12893, -138, -13235, -14886, -17909, 3353, 9200, -3684, 2011, 1058, 7744, 14367, 19399, 25952, 3435, 4830, 16753, -7274, -21847, -11653, -13120, -13822, -13516, -20764, -31998, -10853, 3200, 8285, -95, -5160, -2859, -14177, -13257, -7816, -29293, -28680, -21137, -35153, -16139, -18658, -12843, -5028, -1000, 3521, -7825, -23057, -13663, -4646, -10429, -5038, -14490, -28079, -36228, -40237, -43463, -28479, -28691, -20951, -9726, -10872, -13166, -850, 10547, 15140, 9505, -2014, -4967, -2719, 6552, 5821, -10905, -5294, 6974, 27318, 36513, 18607, -4213, -9739, 3701, 16929, -86, -11079, -10963, 869, -8121, -32597, -33877, -35480, -32936, -14197, -23680, -24917, -17621, -12298, -7781, -14544, -15082, -13188, -5165, 5027, -9485, -3403, -10, 10088, 17279, -6605, -27585]
6950b7585j599J6512J4354K419j2661J337k864R507J1860J3689k1528k3354r852
6937b9765J3810q121K531J238O761j752m385J428k2244M378L3424N855K39o468
6923c071p009L321o722J6297J4752j516n987k995k344j3526j4015p129J4458K576
6909a2910j583l972L0885L082J1801J33q487n548l967q896j3431j3607K4098K36
6895b166m592j0803j3438J94k380J8493Q570o492J80k38j1713m292L0084p116
6881e709j1269o600L439J4531k654k3404N941k274K34J7824j471J4226p59R046
6867A1101K214j5581o869k651q898j2843J7009N364r911k7570J3032J6951j887
6854b0539J569p395M172R811J4730K369j6242n107j7804l791J3424N528L132R405
$$ y = [-27585, -29184, -12672, 1682, 4101, -8560, -7223, -10087, -580, 11280, 24969, 3441, -19913, -29765, -15955, -24076, -21545, -20307, -13546, -15298, -19683, -18255, -40499, -36121, -2697, 3158, 3397, -3071, -10080, -6759, -13481, 2816, 17568, 16052, 10065, 7070, 4726, -8800, -22815, -29944, -15486, -12910, -14493, -18465, 12420, 15502, 27303, 27436, 18949, 13401, 9434, 538, -12893, -26500, -2402, -2166, -6758, -17561, -30999, -30805, -33185, -14692, -6122, -12614, -12434, -12672, -24385, -28677, 1407, -5709, -16978, -23578, -20139, -5608, -8262, -31666, -25725, -27999, -27765, -9941, -11412, 2814, 2055, 11101, 13315, -2266, -9135, -11786, -20684, -33527, -16518, -11154, -21065, -48635, -35603, -18652, -20539, -18970, -26365, -22193, -12382, 2348, 4717, -11525, -16632, -34436, -38227, -24803, -19275, -16143, -6738]
6840f738N02j674N179p715J115Q495R226j6682j4936J114j505K7507N636k707
6826F817R358j731j5634j4663L295R050j52J2241K8696j47k2209j1691Q326J6792
6812B8348p925k0624j7129N579k126k138N378R426O697J289j151p862J4527p797
6798D492M340J613L209J070L576q122Q270r818k3805n320J1160o643l486K353
6784a7111k093P47p05J6510J7209J4677J631l6706n771J3730J0807M249Q273j3665
6770A1782p520J0249N988l132k8339n729J6135K486K848K618k7554K089N924J1713
6756d42q502n492N593N531Q429j086J3761K850J1521k198j1016J519n089l55K6898
6741D1922l67l2264j9137j88K4028J0137m766P688m540j0362j8691J5100R837
$$ y = [-6738, -6236, -7910, -2731, -10446, -9331, -836, 8390, -8292, -23228, -22114, -23619, 3888, 9524, 6817, 16175, 14444, -1190, -15853, -12558, -3508, -3660, 8581, 37277, 37130, 14921, 3230, 11556, 28348, 20423, -201, -17330, -11751, -13877, -16015, -10637, -1211, 5486, 6775, 5624, -2238, 12289, 4492, 8832, 10445, 13654, 14724, 18300, 10178, 18448, 8630, -15175, -20495, -9335, -15978, -19464, -17111, -19204, -18457, -19162, -2652, 14557, 29234, 30865, -5841, -11612, 2118, 12925, 17174, 25447, 11782, 4262, 14511, 20499, 17367, -10972, -16701, -566, 1920, 4768, 7386, -20168, -18079, -12155, -442, -8944, -14436, -8843, -3312, 5117, 4031, 17792, 20642, 32163, 29965, 18949, 20468, 15379, 15024, 41922, 41555, 9291, -9846, -10034, 13994, 24131, 19365, 27053, 22513, 12151, -6540, 8560, 18397]
6728A8397p53O21j7916j3995j4780o302P058J6285Q025J2083J6634M2799J8485
6715H6641J2236j5227k2661j5277j4980j2751j1979r323k36o693L1193L151m156
6702A9938j8878R96J470p136N561K6569J821p326k2803m480O166j4658k479R925
6688e314m243j4042J6448J7561m523j978n596P221j979p698k1031j5598n998P18
6674d6052J7472J6007P991j103Q98j5230j105J6943N837R715P835M589L702j6744
6660A0755k7374J0726M011q991j0721j2605m239P663n262K037Q060R669Q399j4762
6646b2634o80J2069K2393K39k9000r988K9973L6739j1483k5202j0220k147P218
6633b723L843J1451o092k6753M512K0171N420k0705q999K0660P908p883R84j2539
$$ y = [18397, 17644, 18265, 349, -13646, -28426, -34728, -27670, -11385, -3360, 8723, 25357, 68156, 86641, 98877, 83650, 60989, 45712, 30732, 17981, 6002, -3321, -3557, -10250, 20943, 24094, 19938, 1060, 2056, 3526, -3610, 1951, 28520, 30341, 23015, 212, -4268, 1898, -12760, -15239, -5314, -9557, -23599, -7151, 10410, 5887, 3909, -1687, 5534, 3555, -4143, -25174, -40772, -46770, -46052, -28580, -12573, -4582, -5685, -4787, -20017, -21122, -4179, 1658, 11373, 19208, 23797, 27499, 10755, -16619, -5893, -1882, -10873, -21594, -34199, -38438, -30775, -36037, -34000, -25940, -16271, -7872, -22634, -23314, -11245, 11148, 11387, -17613, -27601, 2372, 39111, 27628, 2426, -7794, -9941, -2723, 1120, 12571, 6479, -20274, -15762, 4409, 9829, -10876, -19875, 785, 8693, 810, 1794, -10745]
6619a0745j943J025k648k1275k0171k559n747J7945K2080L164K3582J985J6039
6606B0732K988Q05j4654r641l373q563M212J916K1044N120K857J439m274l230
6592A7378m921j2784L482N560j6570j3479K2860P279J7058j4782j6127j0243n722
6579b1011L453R434P237N722J753k101q871j3418j933J1324J1023m833M479J4018
6565A6276o867j0277n034P147k829L61m132p134j5279R538K3420O462k8854N338
6551a1864J9003M608j54J194j1314q946j309m24q767j452J3524N270m498M505
6537f24K6578O252k0976j2743o700p775K002J9573Q199J0837q789j0552k7J0594
6523A5849N01m898Q018P640N557j6404k9213j7794K2056J3192j2502j4866L235
$$ y = [-10745, -12688, -11663, -14311, -35586, -55757, -58316, -64063, -46118, -24038, -20874, 2708, 4693, 20732, 23720, 24525, 9871, 230, -3143, -11706, -7494, -5578, 15466, 20586, 23443, 24882, 20608, 17378, 12457, -327, 3155, 8715, -7855, -21334, 1526, 8805, 25863, 11081, -5046, -15289, -21011, -17558, -8124, -887, 4835, 6588, 4487, -4384, -17802, -19735, -8411, 2612, -2221, 2258, 16276, 9409, -868, -5902, 1245, -1584, -1223, -5355, -12489, -27768, -18230, 5190, 11652, -17202, -11864, 7139, 11747, 11593, 12787, 1473, -7473, -8782, -9206, -17973, -19425, -5901, -631, -5129, -624, 25954, 32206, 11230, -1513, -8213, -15988, -13986, 5587, 13786, 24623, 15834, 5282, 5255, 15849, 16350, 11452, 19470, 27110, 32667, 16263, -12950, -30744, -8688, 4504, -7998, -22864, -19629]
6510a9629K4801J003j9728o645K0199O124R511j854j1922o765N19J0219n923q446
6496h536j3006j9899M294J5218p160M933J8827j6942j0338P015J0242j2007O011
6483b1348j6212j1366J8210r850j992M606K2542J938k1532k2352K2089K4939P646
6470b682m10j9505Q694R055m260p634P854J98l924L599M490j4640N752K2984j1814
6455b243k2592J8524L2294p971k0995n010J0874J076L42l424M557j1779L33J7682
6441A1668j0621O387J5488r783j1627j5291j2760l296P565J6789M942o902j2032
6428a9473j4286J0939K7123o31k1361j525K6400M517k5784l745O870r24J1785
6415i5J6275m478J771p501p339j0148j0871M794J4830N76K4380p449k9759j5101
$$ y = [-19629, 5172, 6175, -13553, -20198, 1, 6125, 15636, 13782, 1860, -4905, -4386, 5833, -90, -8536, -21542, -41441, -37147, -21929, -29089, -24156, -5329, -22271, -32609, -25594, -15352, -27359, -21348, -37560, -48926, -30716, -40566, -42558, -37952, -15410, -13472, -35004, -57356, -35267, -10328, -2682, -3092, -22597, -13903, -4848, -9108, -16742, -8888, -8690, -12614, -9015, -4525, -19165, -13413, 9571, -2243, -24835, -6311, 25983, 18012, -2983, -7993, 2881, 3957, 4299, 875, 5432, -6347, -6014, 11668, 1047, 7434, 22922, 13139, 1512, -13779, -26539, -29835, -22270, -5481, -539, -7441, -19473, -33759, -22820, 4303, 3672, -17689, -19214, 7186, 11703, -14081, -17826, -10956, -11880, -95, 16180, 11702, 13473, 5972, -1367, -11515, -22386, -17592, -2762, -2186, 22194, 14745, -15014, -30115]
6401c0115K83J273O21J8074J8066o428o846n028Q535N933m825M431J8416j499
6387B0891r193j2151j8058L217p878j716N947J317J4300J550j6640M826k2769
6374c6357m453k508J0107J2168Q122m425q642O379L443q682p308j4987J2807J0785
6360b3551j3402K34O290J057p140M943M151r923M787O296m8N842J9075j3783k1507
6345c6679R015J2544l715n721N955J3010j5965k988N535K640P769J1428K679r586
6331d079o041J0121j8863l1194Q356K4985K3443j561j3953n742p711J1792K1020
6318A0573M746k252M22j0380J675J3721j0994j4689N865n709m218K1087M194j0189
6304C852o505J527K35m568R981k760o177j1880j2170j8179k222r10K1703J4918
$$ y = [-30115, -29832, -28559, -27938, -9864, 8202, 1774, -5072, -10100, -1565, 4368, -457, 3974, 22390, 20891, 11698, -453, -18511, -15294, -23172, -24888, -18941, -17624, -3324, -1774, -18414, -13588, -36357, -40810, -43318, -33211, -21043, -12921, -17346, -25988, -19609, -16166, -24848, -32156, -47143, -34336, -23551, -36953, -36719, -30429, -29372, -36512, -31569, -27418, -37341, -32554, -26258, -26306, -20464, -1389, -15172, -36679, -27664, -15120, -18835, -24556, -18601, -5591, -21556, -24544, -19009, -16369, -8600, 2828, 5507, -4079, -10120, 1, -18862, -50056, -41700, -16715, 6728, 5167, -8786, -14528, -22239, -10447, 10573, 15319, 13067, 13489, 3109, 4784, 18505, 7511, -7178, -1313, -7022, -11240, 9847, 14041, 3852, -2653, -1126, -891, -5459, 4522, 1762, -4415, -16295, -28465, -46644, -48866, -49776, -28073, -13155]
6290a3155N26l861K971M100Q883M763j3576L026N030Q840j3813j0907n5M441K426
6275a0361L275O133r090j9383K3644M1634k4161j3824Q713P703o433n090k941
6262a81l628r153Q924p35J2768K680j1053L324K2616L956j2798j4035k0627J1185
6248f757J4290N864n011m626r416J3736O723O456N4j1174O668J7967m208j6120
6234A4446j5685O077J3879j0274j3828L548k268j6420k5785J924J5112J466N266
6221b2542J1683K665j3523R955J3395J1641j5394p558K0218Q242q415j203J6710
6208B5874L68l183L500k4039Q168J4227p836l3096L022Q127l767n515r739O169
6194a7720J1784q102P309j483q113j5110J2677R958J5334p537K206k964J1743
$$ y = [-13155, -12629, -16490, -13519, -9419, -536, 4227, -9349, -6323, -1293, 7547, -6266, -17173, -17228, -12787, -10361, -7086, -953, -10043, -29426, -5782, 35852, 11691, -2133, 6580, 14283, 7850, 2760, -181, -3809, -12962, -4038, -4773, 7995, 10675, -378, 2946, 25562, 29518, 16720, 2685, -17942, -6757, 7533, 13397, 8386, 3760, -5656, 8080, 14803, 21259, 21313, 10139, 16807, 34774, 30566, 14446, -1239, 4838, 18717, 8443, -5385, -1837, -4105, -20525, -46310, -44386, -29274, -27808, -22542, -10859, -8194, -21717, -11762, 1633, 13274, -2120, -9678, 10540, 18782, 10367, 9164, 25874, 26242, 23059, 26559, 2520, 10688, 24915, 17079, -16017, -12995, -4868, -8635, -14150, -23889, -17720, -5936, -14038, -6729, -8212, -16325, -31435, -18758, -8800, 6534, -1003, 1203, -1761, 9982]
6181I982r503L720k095o564j90M126j3971L173k89J2528j5000o924K4682P9r943
6166f189J0351q82J2001q95k783j4090j2290p984q995j368J9720p5j156J345p394
6151b0684j7299J5951K060j73k524J3365J0022O79R863q774p814J3959j1562k288
6137e219J852K4701Q129o313n110k9249j8332K193N583P753Q584l881r15k136
6123a2360j3172j0566L103Q362R309L296r262P023J50j5825k681R182O42K152
6109b0647K0444J5680l461k0244k3430j6276j0933K6234J4273Q549O779j3696
6097a6728l275l105J1936J0165j8568J0184r103N617q37J198k63n796j0914j1318
6083d0807o697J3441J148p851q24R99p245J5024K0248J1640K147k430n801m282
$$ y = [9982, 479, 4199, 2104, -4460, -4650, -524, -14495, -11322, -11611, 917, -14083, -21007, 3675, 3754, -6189, 4162, 3280, 15281, 14386, 11603, -2487, -14777, -22761, -31756, -33124, -13404, -13479, -14635, -13290, -20684, -37983, -22032, -19972, -20145, -22669, -9304, 718, 1397, 11260, 2486, -5328, 8631, -2931, -5219, -3367, 21334, 29463, 23150, 18040, -11209, -29541, -27348, -21765, -14012, -5428, -9309, -10224, -12360, -25532, -36098, -32995, -24633, -15324, -12028, -21290, -14267, -14117, -29942, -32623, -23441, -22799, -20647, -203, 15477, 12016, -8228, -31658, -47934, -58867, -32633, -18360, -9811, -3032, -16728, -20003, -23108, -11172, -1007, -19575, -9391, -18494, -12877, -13714, -12516, -12779, -18575, -29489, -40807, -47504, -34063, -32915, -40766, -41590, -40591, -47836, -32812, -12564, -924, 1223, -1207, -7008, -11290]
6069a1290J4861J915l723J4034J06k779n986j7764O751J1141K283k115J3940J0282
6055C1656o436M391k89k5319j4494m268j3313L584K2977R96r881k650L996J3185
6041D135L659k2685j367J0141J1955J5672L590Q028J2400k0126L822M777j6826
6028A7175r796j8412k6830m202J3649K4040L3956j9372p889P588k4738j4071O14
6015b8288P613J8804o275N421M251k515n822n414J1727L892k0568j8137L171K8924
6001c216J5508k5193k7789k0910K6137K6074j643q930N567J9549n169q883J531
5988g367r29L90j2231j7545l114O399K0902K2944J1932J3979k6309j1773L724
5975A002q08q440P92q701K917k292J1255k294q805j181P306K2932J2120N946l93
$$ y = [-11290, 3571, 5486, 1763, 15797, 15903, 13124, 7138, -10626, -3875, 7266, 9549, 7434, 21374, 31656, 25220, 29611, 29322, 4003, -10491, -14759, -28072, -24488, -1511, -515, -10396, -13046, -9050, 4135, 7794, -14891, -16258, -6117, 5838, 21510, 25100, 33128, 45528, 25402, 29224, 34001, 17175, 7379, -11033, -37863, -42065, -28416, -4376, 29580, 10208, 2319, 9907, -14831, -28902, -28288, -20675, -1871, -8146, -2725, 1526, -989, -6811, -12225, -498, 3394, -17174, -35311, -32140, -3216, 12292, -12901, -40690, -61600, -35463, -9389, -11032, -19962, -14395, 5154, -15, -8898, -7367, -8296, -7906, -20137, -37682, -40796, -34397, -13495, 9449, 21381, 35360, 9051, -2722, 1002, 194, -8246, -7454, -16155, -13238, -15530, -4275, -6569, -15374, -16555, -9249, 13683, 25803, 31749, 31356]
5960C1356k0226k558o676j3458q948o461N035Q771m281M837P696p93J590P502
5946C386J1631m431r312m926o159R978L731K2856Q265p995j3191K209N799N015
5932B6856p737j6879P039j1849o862R08Q517O342J211r64j5629j6556O894K4269
5918E560M918J681p300r784n88J1151N461J1575k74K368J1614K420q886j8992
5904A0924r396k483q76J3224K204j1765k377O712q771m862q901j2369j064N055
5890b4745m966P664J3442n172m205Q174J1379j0224n523J6164j4918m105K2009
5877D974P874j5587n94j1341l743M625J0538M220N665n291Q99o811K287k837n320
5862a0442K0597k67j0325p768j3638o425k44L975N093J9447j536j6591k0184R958
$$ y = [31356, 11130, 8572, 1896, -11562, -20510, -26971, -21936, -13165, -17446, -12609, -4913, -5706, -4116, 3386, 15017, 10586, 1274, -3652, -9811, 167, 3898, 26754, 35019, 27024, 13833, 16042, 21841, 26856, 19119, 2240, 9279, -2570, -9432, -8524, -7, 6335, 7546, 6582, -9047, -25603, -18709, 5560, 10478, 12159, 4859, -4925, -5513, 5638, 11099, 22674, 22400, 24768, 36382, 38802, 29916, 10924, 1528, -955, -1831, 11393, 13597, 1832, -545, 6167, -2604, -7466, -16367, -28736, -29800, -24745, -29711, -22047, -8605, -13777, -17982, -9808, 1571, -8653, -14176, 1988, -12930, -17035, 4974, 12848, -2739, -3333, -14674, -18417, -13792, -3254, 966, 6631, 1340, 2239, -4572, -2285, -5122, -10442, 10155, 9888, -437, -8205, -21843, -28268, -28512, -24537, -19444, 3, -1533, -18124, -38308, -28350]
5848b8350J349J7245K709N620n28P642N700L08l982j7106J5365J2847J1071j1530
5834A8360o659j0686k5296j4171j1664n20K8731J7128j635n21j4298j7580J489
5821c7322J0954J205k949o091R941K7686m266n739J4980k341k0461L164K5809
5808A4570R173j319j2689k2025J0190L1481j2649k7794N386O691R54k687J2542
5795A1824n176m418j8213J2653J2553J004k694o554K0279J2752k5522l396l085
5782B007r222q984j7682J3974J0223r848o553M163k148L1623k304l825L84J3856
5768A5664o480o951J0126j5199k4724l267R934J656k159M462L422j2238j0072
5755c5826J8192K3027l650J2242K423j0583j890j0376j20N734O708j641p1j2495
$$ y = [-28350, -27001, -9756, -7047, -1427, -1955, 5687, 11387, 11695, 7713, -9393, 5972, 18819, 29890, 18360, 11701, 1015, -24281, -38452, -50116, -50636, -21905, -4777, -6412, -6933, -21231, -38811, -37322, -26368, -25163, -28112, -34203, -24262, 3424, -842, -6581, 8399, 6058, -14403, -11239, 14570, 23743, 22424, 9735, -12290, -2100, 29381, 16732, -11062, -5676, 1015, 1969, -718, 11824, 6648, 2230, -15983, -3330, 9223, 10227, 7533, 979, 21258, 34010, 8488, 5092, 2007, -7215, -16199, -33881, -19907, -9684, -19532, -26085, -21922, -24070, 7553, 5249, 1424, 1808, 15664, 9184, 2233, 12359, -2840, -27564, -30831, -20897, -19241, -21400, -16938, -13516, -25754, -35826, -17634, 5393, 1743, 13985, 16408, 5825, 3935, -6441, -6561, -827, 5881, 4240, 4169, -8326]
5741h326k1967l102J2965Q319m076r908m725P349N031o543l595R318q325p840
5727c5425r0M535K936O310o067p652j8812J0505J5545R042J1436J32j3462l046
5713b4113J6525J9714M417O117k7696r426Q005J7464N946o833K996j522L808j9430
5699d028k0809K2393J2555k191o549k032J4830J2290j4456p237P666j663k2581
5686a1812j074k234L716O743K0860N289R899j0639r506j6759p586l855j4158M539
5672b6577L940J743P106J7039r159N146L294J0957j2023m502J3896L715j1835
5659B740k0255Q413k435O515N68J207K816j1646k4064J193J3315P678O663M174
5645c118n110P279j8408N613J6002p040M814j192o552q523J7468Q389j2196o368
$$ y = [-8326, -30293, -33395, -20430, -12111, -16187, -26095, -30820, -23471, -18440, -24983, -28578, -19260, -27585, -35425, -35515, -30980, -28044, -21734, -27801, -35453, -54265, -43760, -28215, -19173, -7737, -7605, -21067, -24113, -7588, 12126, 16543, 22660, -5036, -14462, -6457, 11007, 16953, 10120, 13116, 11594, 15402, -4028, -24837, -2444, 10111, 7920, 1371, -661, 14169, 26459, 12003, 4766, 12432, 10769, -11812, -12886, -15120, -11404, -4661, 16199, 21488, 31387, 20748, 11242, -5517, -13103, -16958, -31116, -26577, -22637, -20894, -13788, 3251, -5908, -762, 2532, 13489, 1466, -3036, 10860, 14575, 2740, -17515, -9102, -11537, -5022, -4454, -3247, -431, -12077, -36141, -34948, -21633, -13955, -7292, -3118, -8228, -949, -19357, -13744, 2258, -4782, 32, -1160, -7712, -16235, 1233, 9622, -2574, -8942]
5631h942n830l962J7820p106j2449N846l671j3543R781L2142M455p571j8891j331
5617a3252j841P53L974K1288J024o273l119p708K5m97p781P156K801R635n421
5602G64k298K42J1960P511p222j3816O359J0727j2460j629L229J4413l603J280
5588A5457k060p638q082j4059j0379Q040J497R426J1527n758m581O134Q641j2909
5574d744K830m310r463q000O061L7809J5541j2634p130J529j7145L749P756R996
5560B1845j6998j288J221n509j1950j57j1284n867N482p662n894K2327L08N523
5546i903J411j800J0726j0046O694M777j4065j7272N30J4731o969m505J9423K4034
5532A7766j2271P756j7042j3681J1763J5530k1083k855M305J0966K422l1105p153
$$ y = [-8942, -14772, -18734, -914, -8020, -20469, -14623, -18294, -31837, -22056, 10086, 14541, 6970, -11921, -13252, -15093, -14340, -10366, 10922, 11946, 5673, 2554, -5154, -5129, -5626, -13407, -6251, -3450, 6185, 764, -1534, -1292, 10668, 18179, 10957, -2859, 3500, 14227, 1767, 138, 3367, 17780, 14177, 15457, 13397, 5759, -2323, -16382, -26761, -18721, -17224, -7798, 3729, -2029, -6610, -476, 8165, -4744, -1914, -6224, -15687, -23687, -17626, 20183, 35724, 23090, 15960, 17489, 344, 4093, 11849, 21845, 4847, 3559, 4780, -729, -12679, -12836, -24120, -29987, -24505, -32167, -38061, -15734, -15426, -9903, -8492, -10292, 434, -9612, -2918, 1859, -12206, -29478, -28948, -14217, -21186, -25691, -6268, 17766, 5495, 13251, -3791, -17472, -5709, 9821, -11262, -14117, -9812, 1154, 3576, -27529, -34682]
5519c4682J8039R709J376J7189N070L860N287k19k9054j3201N534J2326m167N148
5505B215j332j6657k6205J581O978Q226k413k853J5387k094m453J4110L99k06
5491g317J7683J4902j3267j8338k0165L097k613J231J152O034K598M202R168K434
5477H01r475R394K800l936j1753K778Q95J027O16j6878l061J2367J5859Q47o335
5462d054o094K661J7136j305k0740k1655k067O111J0234N092j9267J1881J3249
5449h818o592o592o418J0124R824j7420j008m177J4291k261j6088j0754Q503k706
5435d0092J5015K9538j0275k8383M603J3600m423K296L183R273L803j6206j958
5422b0026J0152q852J9829M90M954j675p575j3108J122M809J3469N705k893J3114
$$ y = [-34682, -16643, -6934, -5558, 11631, 16701, 20561, 25848, 25629, -3425, -16626, -11092, 1234, -2933, 2215, 883, -15774, -41979, -40398, -33420, -25194, -27607, -30460, -15073, -17167, -21620, -7510, -7111, -7317, 10366, 25268, 12001, -6337, -26502, -23405, -26018, -24787, -23635, -17601, -15003, -10801, -1633, 801, -8674, 720, 3520, -416, -12169, -9391, -8496, -7469, -6853, -23731, -26792, -14425, 1434, 2281, -4054, -10148, -7487, 9649, 8344, -12396, -34051, -36118, -30007, -19773, -14681, -33948, -22067, -8818, -15410, -22002, -28420, -18296, -8472, -25892, -26900, -31077, -16786, -19047, -35135, -45889, -37386, -40092, -25077, 4461, -5814, -34197, -29594, -15994, -20417, -18121, -14938, -5665, -1862, -18068, -20026, -9874, -18726, 1103, 1593, 6547, 4872, -2703, -15811, -14689, -9880, 3589, 9294, 6401, 19515]
5408A9515N385j4956p101K037L953K2789K124j5361m270o845j8059O526n085M874
5394d474J3288m277k9984N920N424o99J9944R728O369j6151k7088m250J991M972
5380a9287K1255o407q351M754j4339J3526J0015p572j2842o010J167J8224p138
5367a3005k4305j3064N832J8764J6180K3637J285L211j0907j4359P055J8829Q625
5354B7778J340j1082p861N667O680r639j4712j1081l302K1989J4389P7j2706j4515
5340f978L866O567K284J536j6531O585J0163L049J0446l458J489K359L239k899
5326B1717n40j001o667j1483o894j2481N829N547m039J3760K033k0401l780J0325
5312h075K1867p807o946J6975n168J272M831j8583r197J4853J0788l918j2855
$$ y = [19515, 24900, 9944, 2843, 4880, 8833, 31622, 33746, 18385, 14115, 7270, -10789, -4263, -9348, -4474, 8814, 4537, -25447, -19527, -14103, -14802, 5142, 14870, 21239, 5088, -22000, -26250, -24259, -19287, 1968, -4439, -12790, -8036, -22375, -8849, 1166, -6406, -19248, -25258, -24091, -5867, -13005, -37310, -50374, -44542, -25778, -9598, 14039, 15324, 18535, 7628, -6731, 324, 19153, 27778, 29118, 18036, 10175, 15842, 22522, 12883, -1829, -12910, -16212, 5777, 20166, 20243, 7537, -6978, -3112, 3455, 5739, 7275, -9256, -2671, 7492, 10541, 20987, 17529, 19018, 21377, 24616, 21717, 21177, 20176, 13509, 2026, -4868, -17349, -11520, -5973, -10012, 3748, 5781, -14620, -18400, -8075, 13792, 5985, -961, 16014, 10846, 12118, 16949, -1634, -10831, 4022, 14810, 10892, -1963]
5299a963l680j4579n147J1796J2563R295j7660J573Q631o096J575Q648M750L089
5285A2795j6494p952j2336j88R086K0041K069p430J67O896N464Q123K096n246
5271A7091j4158j4211j0402J0791P796O972j5378k0655L876J6846j2221J3743
5259i910K3670J3554P0k3290j1518j2266j3331M216J7510K4847p288j5222j96
5246i154k616M769J4791J3496P598j3438j7993m255m626k2429n583J0670Q41J3527
5232a4402R63p755k571r017N785J673R117K3985k05N898P058k8765k1041J321
5218b7956K8659L803o974j1244J990q410j1273j813R476J7309J4036j744n429
5205D30k4545j1625J374J407R058J3885r368k747N202j852L0588J2714j6956j3371
$$ y = [-1963, -5643, -20222, -25369, -13573, -1010, 8285, -9375, -7802, 829, -5267, -3692, 4956, 9706, 12795, -3699, -11651, -23987, -24175, -15089, 4952, 7021, -409, -242, 6654, 12118, 20241, 22337, 17091, 2933, -11278, -21680, -10889, -3093, 3879, -11499, -32154, -28278, -11432, -23653, -9910, 13760, 27314, 27384, 4094, -7424, -19690, -33021, -28805, -11295, 13552, 6264, -8958, -9154, -11770, -7001, 7790, 21286, 28884, 15446, -2547, -6802, -11428, -33857, -39440, -28770, -27929, -14402, -13439, -21194, -23765, -32782, -26997, -25324, -16207, 7778, 7573, 13471, 20529, -8236, -29277, -27956, 703, 4506, -2468, -13712, -11722, -20132, -31405, -33218, -23742, -6433, 7603, 5859, 430, -24115, -35740, -34366, -32959, -23901, -10016, -19384, -22131, -16929, -18781, 11807, 24521, 7565, -5806]
5191e806j3299J057J106r3J2763j1391K866K4829m721r810O80R274j293K0968
5177B7130j3006j774q799k259J9361L202l199l73O14m117J6476Q091j3081J30
5163B8396Q342o319j7641n460j67O144j1262k244k877L46j688J3587N582k6834
5149a2095P385J3190m977k2912m903n685M025m416R02J1127j219J0066K5845P344
5135B3677k0858q05j0592K859J3835J065N868M81k0048j762r189n710p742R395
5121a9526l178l028m263k940J976N610K5563J1781l3967j1160j2618Q654r301
5108d6397K641J7880L2856K0826m276k940N17n895n09o16p341p554n373L133l245
5093f293j193P932q650L885J5399Q276k0290j8091k0425r963L5317K4493j1728
$$ y = [-5806, -19105, -18048, -16942, -17035, -4272, -15663, -12797, 12032, 7311, -2499, -1819, 7455, 6162, 27130, 14124, 12350, 3551, 1292, 20653, 23855, 20656, 20283, 20897, 16780, 33256, 41347, 28266, 28396, 36738, 30419, 12778, 7318, 7151, 13295, 2033, -211, -3088, -2742, -4430, 9157, 14739, -12095, -4710, 8480, 3503, -19409, -24312, -29997, -25972, -30388, -29486, -18359, -19578, -9512, 16333, 23677, 2819, 2014, -8578, -5719, 8116, 9181, 15049, 15530, -4518, -6280, -15469, -21179, -28921, -19526, -22704, -25732, -29995, -32935, -30959, -25349, 214, 11995, -21972, -33132, -45750, -37096, -46397, -43756, -25876, 6980, 27806, 23530, 20590, 21107, 15212, 14703, 14087, 6746, -808, -6181, -3048, -6293, -7486, 446, -8204, -4319, 11080, 19356, -934, -19025, -39450, -49413, -14096, 10397, -1331]
5080a331o12K7284L769k4367j0659R862J0232O112k516n912J656P716m709j970
5066A4555j5561P458K174J4971j2133j5436O998R22l969k2202p374M951R216o030
5052b1460p910J4794J7093J836j971l0645j1914M1091K1230j56r231p998J6468
5039B1227J3075K563k4073k144o155J3623J6805L670P821j3028j1335p537j7538
5026c026j4002J238j3765j485J7023J7590l730j3963l335J6563K894r166L802
5013c362K055J5774q294k954j3244k9820N473Q505q006p052L6504J6979K617m336
4999A0839M117m381m459K920l0758l014J7270J5599l855o173j0559K191O447o90
4985d506j3765j66P390j553O499J7346K559j7664J212J2670o876P232J1634q707
$$ y = [-1331, -1943, 25341, 29110, 4743, -5916, 3946, 14178, 20290, 17774, 11862, 13518, 21234, 16525, 14555, -1006, 6452, 8626, 23597, 11464, -3972, 3026, 3948, -21, -22223, -29597, -24646, -15430, -21460, -29370, -14576, 2517, 4353, 2382, -28263, -40177, 914, 22144, 21988, 12757, 4759, 21227, 34302, 36865, 12792, 10648, 4493, 18116, 34921, 38591, 46412, 33384, 22049, 14512, -3026, -17028, -15790, -29555, -31040, -14017, 3573, -157, -14120, -17455, -892, 2002, -7164, -3362, -1307, 14467, 6173, 3219, -10025, -39845, -34372, -25867, -33873, -40925, -4421, 12558, 15175, 10839, 14956, 10575, 6116, 9036, -21722, -24736, -7466, 8133, 4278, -1895, -12454, -10263, -3816, -4506, -18271, -18437, -11047, -12600, -6101, 11245, 13804, -3860, -2648, 10022, 3146, 10378, 22012, 13305]
4971A3305K533l679J1M200K935p537m376J4900n225k0847L305P995m556j2372
4957i408J9125J3177j4199j8522q674j0136N424p761j1610L166K2511K9880r134
4944C839L564r192l441j459Q366L109q80l993n156k602P927j2554j2717k2092
4930d7281j647J2226J8505J6795J1423j254k4091k1830K0111K8209J434m938O99
4917H361Q106j293q222j1319l508R000o61q483M782m663q543Q6O296P821Q692
4902F452N595l75J106m995j3646o327m334j7498N576Q706J7733N372j7115q990
4888b2740n626J3633J8602K8248q695p317p411M475J2999j974k3034j1420k904
4875a3164o364n883K956N48O967J2140P307m434J524J591J0212Q79q710J554L804
$$ y = [13305, 15838, 12159, 12170, 16370, 19305, 11768, 7392, 22292, 17067, -3780, -475, 7520, 2964, -9408, 9717, 22894, 8695, -9827, -18501, -28637, -23213, -30974, -42584, -39418, -16907, 12973, 3839, 7403, -1789, -5230, -6689, 1677, 4786, 3906, -87, -5243, -7845, 82, -12472, -25189, -47281, -48928, -36702, -18197, -1402, 10021, 8767, -15324, -37154, -17043, 11166, 12600, 7662, 8361, 16467, 15174, 6952, -4367, -7875, 1125, 464, -8019, -3237, -7900, -16443, -16357, -10061, -2240, 6452, 12047, 11672, 12778, 7783, -5863, -12190, -16524, -34022, -28446, -19740, -2007, 3365, -13750, -22740, -28366, -14733, 3869, 32117, 23422, 16105, 8694, 13169, 26168, 24194, 1160, -10260, -13164, -19528, -25411, -22455, -21907, -14940, -2800, 4507, 73, 1597, 3188, 13400, 14279, 5569, 7123, 10927]
4860A0927k672J670R160q09o033j5414O17L338p048O126n907M611m277q781p214
4845b1706N249Q162l628j5526K753J895L064J1462K1413R27k6664k000M947o998
4831a6650j4751J0887K7045m312J2793k784j8683k1955J469N493J6562J7696J576
4818A4386k7395j2173K042J2441l964j2015j3205L154J7823P925J2441K7459o355
4805B2564j4034j1181n869j0240j334Q606L3129M777q568J672R562m055J6520
4792D1549j0695j1672j5896j1466M132P19p1J3376j463j428K573j1568l952P258
4778A396n249M503j4032M316L887K3563l501j3196m866j1750k894J3367P462j0163
4764g157p476j4459j0706R014Q869J1955K4244J0742j9359r209J6781P968j5212
$$ y = [10927, 8255, 9925, 19085, 18276, 12243, -3171, -2554, 784, -6264, -138, -6045, -1434, -5711, -14492, -21706, -16457, -8295, -11923, -27449, -24696, -22801, -19737, -8275, 13138, 14065, -12599, -14599, -9652, -16650, -31401, -20514, 6531, 2219, 15012, 12228, -6455, -28410, -26941, -21448, -4886, 12810, 14386, -13009, -25182, -23140, -10699, -14663, -26678, -39883, -36729, -18906, -10981, 1460, 28919, 22564, 8530, -2651, -8520, -18760, -20094, -11488, 21641, 26418, 17850, 19522, 29084, 25029, 41549, 30854, 19182, 3286, -8180, -4048, -3329, -3400, 9976, 8513, 7085, 9658, -1910, -5862, 1396, -3853, 650, -13382, -9066, -5179, 18384, 14883, 1687, -3179, -14929, -17823, -4456, 3006, -7157, -14633, -29092, -39798, -30784, -21915, -9960, 14284, 25026, 5667, -3542, 13239, 21207, 5995]
4751E995p749j05M343J683l258J0920J2862J027k1250k4127j1064J1075K924J721
4737a5003j0874o051J7697M549q537j7j0532Q068J1170O060j468l014N99O23r659
4722a6389k914R512j1177N139Q988j3416P177q580p178J7194J4249K1741l587
4709B0759j1751P1j3853m11J3337l00m721j5512j4367M059K5083J5432J0576J2324
4695D0726k3721m190J1488n284J5463J8478j3878k3533q064p729Q910j6314K609
4682e039P010J722j2629N382P451m115o565K6656K4694j4700j2167k235r392J6187
4668B2260j952j0926j7417N703P282L036j1791j9978M79J4587N694n661J6642
4655G958P232M284K479l3226k319J067O400M531q790k4389J4426K3746o699J9636
$$ y = [5995, -1754, -1859, 2484, 4167, 909, 11829, 24691, 25718, 4468, -19659, -30723, -19648, -16724, -15003, -25877, -31928, -14231, -9682, -18219, -18236, -28768, -20700, -9530, -3470, -4938, -7952, -7353, -6730, -16389, -19303, -9791, -20968, -15829, -6841, -20257, -13080, -21660, -28838, -11644, 2605, 24346, 20759, 9008, 9079, -4774, -5185, 8152, 7852, 3131, -12381, -26748, -22689, 2394, 17826, 28402, 40726, 17005, 12815, 24303, 19019, 34482, 52960, 39082, 15549, 7485, -244, 8666, -7648, -5039, 1971, 3693, -8936, -3554, 3897, -218, -6783, 19873, 44567, 29867, 17700, 15465, 6073, 22260, 20308, 9382, -8035, -2332, 4950, 7986, -3805, -23783, -23304, -8717, -3023, -8684, 7958, 15190, 19474, 21953, -11273, -13592, -12525, -6125, -1594, -10384, -34773, -20347, 3399, -3300, 16336]
4641A6336R401j2422j949j0610l0629j6055K1144P672j1288K257J4589K78N209
4628f067J9623O596O51r338P552q212o381j9540r547K1592J8151l010p555l133
4614A382O925M64j1187o372Q738P315k633j072J1642J3235k4304j3765J7877l291
4600D954k8954k2142Q628K0216j2115l525P390J719K4147n501l557j6384j910
4587b7034j6700K5945K2773l614j0299Q819J3631N767J403P794N020k5213n489
4574B803J2792j5997j0322k202m380P373J3930r74J1869q734m990p520l195m515
4560a4062J3900o426j3673j7129P945K8291K194O065o2j1793k926K5782j7589
4547E17k5733M814K1939O602J089N202k6084n504J8937j2675p388J4175R552m805
$$ y = [16336, 25737, 13315, 11366, 756, -29873, -45928, -24784, -17112, -28400, -26143, -11554, -11276, -6067, 13556, 20152, 20803, 11465, 19017, 10805, 4424, -15116, -24663, -3071, 15080, 12070, 4515, 1382, 8307, 8771, -2416, -8788, -50, 7265, 4632, 3560, 15202, 28437, 4133, -9632, 8245, 4954, -24000, -46142, -37514, -17298, -29413, -32938, -25548, -23829, 318, -5183, -8740, -25124, -27034, -43734, -17789, 4984, 1370, -8929, -110, 13521, 19288, 20691, 28485, 33505, 8292, 2803, 15595, -402, -10724, -12926, -17306, -9933, 3997, 3023, 14892, 6158, 1168, -6352, -9547, -14062, -162, -6588, -20261, -37390, -29445, -1154, 1040, 7105, 7043, -4750, -7676, 18106, 517, -25216, -20402, 1537, 8139, 9228, 14430, -11654, -17158, 1779, -10896, -18284, -4109, 5443, 638]
4533F38n493R739P613j0128j4565R924L933J3699k2759j1040J7256K0560r484
4520I893o530r62J0312r990O268o443m683J1114j6304l055L685L945O196j4507
4506a1061L02J0107O855J5676j2197l5595L051P542O646j164l205k0038J7021
4493a6060R826Q070m086k607J5963K0562j2472k4576j434R015j206j1875l062
4480a3942k4R836K4034J90j0271n848P098J4796p515j3762k000m783J670j991
4466b512k0119R994O425J0854R052J0681o613m727p894n399j063j0719N27M699
4452f814K796m013j902L623K560J828p183N517M018n243N511O909k69O632K405
4437A6375K046J440M655j4995j2758j861J1167J7676j0811k5379j7123R642J2980
$$ y = [638, -4855, 4884, 12497, 2369, -12196, -2272, 1661, 15360, -7399, -18439, -1183, 19377, 9893, 3363, 2401, 12713, 2723, 8991, 2548, -2135, 8979, -7325, -10380, -6695, -2750, 3446, -11061, -10759, -652, 6203, 21879, 9682, -25913, -22862, -15320, -8674, -9838, -13043, -33081, -16060, -6234, 1836, -2250, -4857, 11106, 31668, 19196, -5380, -6814, 2201, 995, -10880, -13942, -13966, -4130, 19904, 20094, 9823, 3975, 11073, 25869, 18354, 4592, 2592, -2191, -521, -2512, -22631, -12637, -6212, 4642, 13694, 24375, 17762, 13035, 5141, -258, -1321, -12040, -11513, -6814, -4018, -8031, -9933, -6310, -3750, -1922, -9105, -3588, 430, -4813, 698, 7607, 7338, 13970, 16375, 18421, 19861, 24516, 9521, -3237, -5098, 6069, 23745, 12934, -12445, -29568, -19926, -6946]
4424f946J082j891J3914K0755j0246m742P868J3191J4562r17j9301j5706j4301
4411b678j656L295o475J2966J661j2250l226J7596q20q240q500K905N664Q738
4397H980n764J9533K017m615J2957m233j2822j692J511k1771p577o736j133O74
4383b0671K372n600J5238J7708j1143k2352k4866J6377K5863J4124l896l049J4104
4370A4209J3965K9806k155l0534o825J135l184j2042j4038r342J6564J518j082
4357b005j1294O312n942n958J7968j1414j1937P865k580O345K6549j4755k4392
4344b5238k547J7910m0j4264M28r942o052m251Q078J5266J5100J0573J4393O353
4330B5767l060j0171k2095r200P05o398j7868o405Q49J2244J2237M210J2941K243
$$ y = [-6946, -5864, -7755, 6159, 26914, 16668, 11926, 19794, 32985, 47547, 46630, 27329, 11623, -2678, -4334, -1039, -7514, 5452, 7113, -5137, -8363, 9233, 8413, 173, -8327, -5422, 242, 8980, 3216, 22749, 24766, 20151, 33108, 28875, 16053, 14361, 15872, -5899, -13476, -20212, -21345, -20671, -18299, -23899, -8661, 9047, -2096, -24448, -49314, -32937, -7074, 7050, 3154, 105, 14209, 28174, 57980, 55825, 25291, 18466, 19601, 16417, 4375, -9663, -19005, -2441, -923, -2005, -13299, -6987, -12929, -18887, -919, -12333, -24270, -16405, -18985, -12640, 13909, -846, -25238, -27785, -9875, -9915, -24179, -23751, -33693, -39745, -43996, -35918, -20652, -5552, 5021, 19414, 25767, 22707, 12536, -9559, -18759, -18054, -24452, -42320, -48725, -47876, -35632, -23395, -19185, -6244, -4001]
4316d001j0526r285J5814J0155M379J46r901r738N907j675P530l028Q32j1584
4302a4975j6452K451J9193J1711j4481l167j4432M683P719J9253k290p199J2885
4289D899J2900m302K348J0074K437K412l154k1283l472M316L941O337N807O918
4275C0178n445m765j1428j8559j2845M077P311J5308J2056J9925j6540r024Q1
4262A0330j0276L090n349j6448Q262m956J8875P461l0098p3J2331p706n329J0405
4248i481N036j2150o328J1084L219j4521n262q784k553J5561L4471J3839L095
4235B7226q029j5774m785j4523p87m597j2089o630J5170J8639J0590r837o610
$$ y = [-4001, -14527, -23812, -7998, 2157, 6536, 6682, -3219, -12957, -7050, -8725, -1195, -4223, -3391, -14975, -31427, -28976, -9783, 1928, -12553, -15720, -30152, -25469, -17750, 1503, -787, -7986, 4899, 17799, 13497, 15845, 25919, 28356, 30768, 27614, 6331, 2859, 7175, 11116, 17453, 23260, 30178, 24733, 19968, 8540, -10019, -22864, -18787, -11476, 3832, 15888, 35813, 19273, 10249, 10330, 54, 3144, -2205, -18653, -10391, -15347, 3528, 10989, -19109, -19182, -6851, -14557, -19886, -9481, -4445, -16595, -22923, -11839, -8620, -23141, -28403, -37187, -39740, -24179, 10292, 24131, 27226, 19197, 3423, -1362, -15885, -16672, -21269, -33358, -39988, -24818, -6179, 4411, -5426, -12036]
$$ [...]
##END NTUPLES=NMR SPECTRUM
##END=
