##TITLE=Analysis number 321689
Compound Code cc 49946
Book Reference 488/78
Project Code adrs
Chemist Name miguelg
##JCAMPDX= 6.0         $$ Bruker NMR JCAMP-DX V2.0
##DATA TYPE= NMR SPECTRUM
##DATA CLASS= NTUPLES
##ORIGIN= Bruker BioSpin GmbH
##OWNER= nmr
$$ XWIN-NMR		Version 3.5
$$ Tue Aug 22 14:09:00 2006 GMT Daylight Time (UT+1h)  MAYBRIDGE\nmr@NMR_250MHZ
##.OBSERVE FREQUENCY= 250.131544655141
##.OBSERVE NUCLEUS= ^1H
##.ACQUISITION MODE= SIMULTANEOUS (DQD)
##.ACQUISITION SCHEME= undefined
##.AVERAGES= 16
##.DIGITISER RES= 18
##SPECTROMETER/DATA SYSTEM= dpx250
##.PULSE SEQUENCE= zg30
##.SOLVENT NAME= CDCl3
##.SHIFT REFERENCE= (INTERNAL, CDCl3, 0, 16.522)
##AUDIT TRAIL= $$ (NUMBER, WHEN, WHO, WHERE, WHAT)
$$ ##TITLE= Audit trail, XWIN-NMR		Version 3.5
$$ ##JCAMPDX= 5.01
$$ ##ORIGIN= Bruker BioSpin GmbH
$$ ##OWNER= nmr
$$ C:\u/data/dgb/nmr/ADRS/1400/pdata/1/auditp.txt
$$ ##AUDIT TRAIL=  $$ (NUMBER, WHEN, WHO, WHERE, WHAT)
(   1,<2006-08-22 14:08:39.60 +100>,<MAYBRIDGE\nmr>,<NMR_250MHZ>,
      <created by zg, POWCHK disabled, PULCHK disabled
       configuration hash MD5:
       E2 DF 36 D8 04 B2 41 60 5A D7 A3 38 5A 4B D0 FE
       data hash MD5: 64K
       E5 9C A6 74 79 C2 8C 3B 05 CB 22 D3 82 7B 35 07>)
(   2,<2006-08-22 14:08:51.27 +100>,<MAYBRIDGE\nmr>,<NMR_250MHZ>,
      <Start of raw data processing
       ef LB = 0.3 FT_mod = 6 PKNL = 1 SI = 32K 
       data hash MD5: 32K
       9B AF 6C 24 CF F7 F8 E8 AA E8 AD 1A BD C8 F8 32>)
(   3,<2006-08-22 14:08:52.93 +100>,<MAYBRIDGE\nmr>,<NMR_250MHZ>,
      <apk 
       data hash MD5: 32K
       F2 F6 58 36 8A C8 BB 2A 04 6C 67 2B DD 7D D8 A5>)
(   4,<2006-08-22 14:08:53.82 +100>,<MAYBRIDGE\nmr>,<NMR_250MHZ>,
      <abs ABSG = 5 
       data hash MD5: 32K
       7C 62 29 FD 53 5C 14 AE 32 51 C3 B0 DC DB 4D 20>)
$$ ##END=
$$ 
$$ hash MD5
$$ 10 48 A9 23 60 28 AA 4A EA 22 B9 6D F2 3A 78 5F
##$RELAX= 
##$RELAX= 
##$RELAX= 
##$RELAX= 
##$RELAX= 
##$RELAX= 
##$RELAX= 
$$ Bruker specific parameters
$$ --------------------------
##$DU= <C:\u>
##$EXPNO= 1400
##$NAME= <ADRS>
##$PROCNO= 1
##$TYPE= <nmr>
##$USER= <dgb>
##$AMP= (0..31)
100 100 100 100 100 100 100 100 100 100 100 100 100 100 100 100 100 100 
100 100 100 100 100 100 100 100 100 100 100 100 100 100 
##$AQSEQ= 0
##$AQ_mod= 3
##$AUNM= <au_zg>
##$AUTOPOS= <41 >
##$BF1= 250.13
##$BF2= 250.13
##$BF3= 250.13
##$BF4= 250.13
##$BF5= 500.13
##$BF6= 500.13
##$BF7= 500.13
##$BF8= 500.13
##$BYTORDA= 1
##$CFDGTYP= 0
##$CFRGTYP= 5
##$CHEMSTR= <none>
##$CNST= (0..31)
1 1 145 1 1 1 1 1 1 1 1 1 1 1 1 1 1 1 1 1 1 1 1 1 1 1 1 1 1 1 1 1 
##$CPDPRG= <>
##$CPDPRG1= <>
##$CPDPRG2= <>
##$CPDPRG3= <>
##$CPDPRG4= <mlev>
##$CPDPRG5= <mlev>
##$CPDPRG6= <mlev>
##$CPDPRG7= <mlev>
##$CPDPRG8= <mlev>
##$CPDPRGB= <>
##$CPDPRGT= <>
##$D= (0..31)
0 1 0 0 0 0 0 0 0 0.06 0 0 0 0 0 0 0.0002 0 0 0 0 0 0 0 0 0 0 0 0 0 0 
0 
##$DATE= 1156252118
##$DBL= (0..7)
120 120 120 120 120 120 120 120 
##$DBP= (0..7)
150 150 150 150 150 150 150 150 
##$DBP07= 0
##$DBPNAM0= <>
##$DBPNAM1= <>
$$ [...]
##$SUBNAM7= <"">
##$SUBNAM8= <"">
##$SUBNAM9= <"">
##$SW= 20.6930455092707
##$SWIBOX= (0..15)
0 0 3 0 0 0 0 0 0 0 0 0 0 0 0 0 
##$SW_h= 5175.983436853
##$TD= 65536
##$TD0= 1
##$TE= 295.16
##$TE2= 300
##$TE3= 300
##$TEG= 300
##$TL= (0..7)
0 120 120 120 120 120 120 120 
##$TP= (0..7)
150 150 150 150 150 150 150 150 
##$TP07= 0
##$TPNAME0= <>
##$TPNAME1= <>
##$TPNAME2= <>
##$TPNAME3= <>
##$TPNAME4= <>
##$TPNAME5= <>
##$TPNAME6= <>
##$TPNAME7= <>
##$TPOAL= (0..7)
0.5 0.5 0.5 0.5 0.5 0.5 0.5 0.5 
##$TPOFFS= (0..7)
0 0 0 0 0 0 0 0 
##$TUNHIN= 0
##$TUNHOUT= 0
##$TUNXOUT= 0
##$USERA1= <user>
##$USERA2= <user>
##$USERA3= <user>
##$USERA4= <user>
##$USERA5= <user>
##$V9= 5
##$VALIST= <valist>
##$VCLIST= <CCCCCCCCCCCCCCC>
##$VD= 0
##$VDLIST= <DDDDDDDDDDDDDDD>
##$VPLIST= <PPPPPPPPPPPPPPP>
##$VTLIST= <TTTTTTTTTTTTTTT>
##$WBST= 1024
##$WBSW= 4
##$XGAIN= (0..3)
0 0 0 0 
##$XL= 0
##$YL= 0
##$YMAX_a= 502339
##$YMIN_a= -351108
##$ZGOPTNS= <>
##$ZL1= 120
##$ZL2= 120
##$ZL3= 120
##$ZL4= 120
##$ABSF1= 16.522
##$ABSF2= -4.171173
##$ABSG= 5
##$ABSL= 3
##$ALPHA= 0
##$AQORDER= 0
##$ASSFAC= 0
##$ASSFACI= 0
##$ASSFACX= 0
##$ASSWID= 0
##$AUNMP= <proc_1d>
##$AZFE= 0.1
##$AZFW= 0.1
##$BCFW= 0
##$BC_mod= 0
##$BYTORDP= 0
##$COROFFS= 0
##$CY= 12.5
##$DATMOD= 1
##$DC= 0
##$DFILT= <>
##$DTYPP= 0
##$F1P= 14.0000005364418
##$F2P= -0.99999901652339
##$FCOR= 0.5
##$FTSIZE= 32768
##$FT_mod= 6
##$GAMMA= 0
##$GB= 0
##$INTBC= 1
##$INTSCL= 1
##$ISEN= 128
##$LB= 0.3
##$LEV0= 0
##$LPBIN= 0
##$MAXI= 10000
##$MC2= 0
##$MEAN= 0
##$ME_mod= 0
##$MI= 0
##$NCOEF= 0
##$NC_proc= -4
##$NLEV= 6
##$NOISF1= 0
##$NOISF2= 0
##$NSP= 0
##$NTH_PI= 0
##$NZP= 0
##$OFFSET= 16.522
##$PC= 1
##$PHC0= -4.107198
##$PHC1= 6.660583
##$PH_mod= 1
##$PKNL= yes
##$PPARMOD= 0
##$PSCAL= 4
##$PSIGN= 0
##$REVERSE= no
##$SF= 250.13
##$SI= 32768
##$SIGF1= 0
##$SIGF2= 0
##$SINO= 400
##$SIOLD= 32768
##$SREGLST= <1H.CDCl3>
##$SSB= 0
##$STSI= 32768
##$STSR= 0
##$SW_p= 5175.98343685301
##$SYMM= 0
##$S_DEV= 0
##$TDeff= 65536
##$TDoff= 0
##$TI= <Analysis number 999999
Compound Code 99
Book Reference 9
Project Code 9>
##$TILT= no
##$TM1= 0
##$TM2= 0
##$TOPLEV= 0
##$USERP1= <user>
##$USERP2= <user>
##$USERP3= <user>
##$USERP4= <user>
##$USERP5= <user>
##$WDW= 1
##$XDIM= 32768
##$YMAX_p= 437030762
##$YMIN_p= -678973
$$ End of Bruker specific parameters
$$ ---------------------------------
##NTUPLES= NMR SPECTRUM
##VAR_NAME=  FREQUENCY,     SPECTRUM/REAL,   SPECTRUM/IMAG
##SYMBOL=    X,             R,               I
##VAR_TYPE=  INDEPENDENT,   DEPENDENT,       DEPENDENT
##VAR_FORM=  AFFN,          ASDF,            ASDF
##VAR_DIM=   32768,         32768,           32768
##UNITS=     HZ,            ARBITRARY UNITS, ARBITRARY UNITS
##FACTOR=    0.157963299565203, 1,           1
##FIRST=     4132.6476996994, 0,             0
##LAST=      -1043.33573715361, 0,           0
##MIN=       -1043.33573715361, -678973,     0
##MAX=       4132.6476996994, 437030762,     0
$$ Real data points
##PAGE= N=1
##DATA TABLE= (X++(R..R)), XYDATA
$$ [...]
16651g033J1820N591r314O650R708j0985L764q76P15o862M707q735j0186q989
16637b0025P935N244K409j905k094J6146R97j958l409L127j784J3118J9648m169
16623C3280j3597j2302q904Q847P437P359J4330k2472j6460o910Q071n428J181
16610e568q240l748J1041J0746L298N482J4332J27m270q061j1845m008k701R875
16596F460p489l478K644M240K120J4258J3023r256j2752j4656N986p035j0959
16583a6894M223R381P410Q151M091r815k0410j2174j015M022J6020J0435n127
16570a702J99M49j215j5492K311J2395m381N126N606n515k627O026o086M001O
16555h99l228J736O298M120j8107l546J2475o729j0891j4741M176L186J0558J5811
$$ y = [-7033, 4787, 10378, 1064, 7714, 17422, 6437, 10201, 9325, 10040, 3178, 7885, -850, -11036, -20025, -12090, -6846, -4437, -6342, -8436, 7710, 8707, 6749, 3340, 6467, 4683, 17801, 37449, 33280, 19683, 7381, -1523, 7324, 14761, 22120, 36450, 13978, -2482, -9392, -1321, -6749, -5568, -13808, -17556, -6515, 4231, 7529, 13011, 27343, 27470, 23200, 15139, 3294, -714, -3415, 6460, -1029, -4507, -1863, 2377, 4497, 18755, 31778, 22522, 9770, -4886, 1100, -5935, -16894, -12671, -3290, 4120, 12271, 16362, 6547, -13863, -26037, -27052, -23030, -7010, 3425, -1702, -1503, -1054, -2269, -17761, -15450, -3055, -7436, -2310, 3296, -2219, -4846, 1180, -4906, -905, -899, -4127, -2391, 3907, 8027, -10080, -13626, -1151, -7880, -18771, -33512, -29336, -26150, -15592, 219]
16541B19l048n712J0212r924q90k032j2111q289J5545J7802K297k342K75o803
16527d801k226j0015L486J5443M206m556j512p712n835L187L352q50m755Q86R279
16512b423J777P80M170K861O628L018r354L129L253k344n51r710O263J4687m866
16497A7318O35R3j2473J26K074r757k536J80L141J200O766Q370q581j657n953
16482a054m617n32J2623P837k3438J686J054j0816M795Q845n811N634K106l772
16468e460j0684m250O255P317l404p623j2623n122P566n013K627J6839N535P30
16454g310k05O838l756j3475N014Q600L117J448J0792J0297R8j3332j6099K577
16440e396k53K771r14l272j126P512k244k817l927J1316R863k595m919j8435r865
$$ y = [219, -2829, -8541, 1671, -8253, -9143, -11175, -23286, -31575, -16030, 1772, 4069, 1727, 2002, -4801, -7027, -17042, -13556, 1887, 6093, 1537, 25, -7687, -13522, -10335, -6983, -7833, -12588, -11702, -2423, -646, 134, 4304, 7165, 13793, 16811, 7457, 10586, 13839, 11495, 10944, 1234, 7497, 22184, 17318, 17953, 18046, 5573, 5699, 7773, -1984, -4520, -4340, -1199, 1, 6767, 15137, 6556, 4899, -1054, -5671, -6203, 6420, 14257, -9181, -7495, -6441, -17257, -12462, -3617, -9428, -3794, -1688, -5460, -16144, -20394, -14139, -6822, -10226, -17849, -30472, -35594, -28028, -33041, -30414, -13575, -8040, -7310, -7515, -677, -4433, -17908, -12894, -4294, -1177, 271, 11063, 21360, 21458, 8126, -7973, -5396, -5649, -2878, -3792, -7064, -8190, -678, -2922, -5739, -9666, 1650, 11513, 8918, 3999, -14436, -24301]
16425b4301n439M065m692L708R612J1446j3827k5105M622J3887N32J4331R085
16412b076K448K582N857q8j3124N330R001l249m957j095M162l840n051p609M07
16397a1302Q695L685R136J809L68l096J697P057K346J058o922M163J678j3532
16383F840j5770k178o757m390J7895J3308k957j3567j164J1217J3089K245l147
16370A4664J485L659l8q490p512N101J2992j3649q40j177r277R954J4900l355
16356A8417j5716M518l474K662L288R01j0345K103j4825j0730P309O253N560L757
16342c22J4147k0708o229P941l663l155j1896j0563J1854Q557J4141J1009O673
16329A7786p562m550l374R493R176J76m883p388j399r717k20J2961K477j4827
$$ y = [-24301, -29740, -25675, -30367, -26659, -17047, -5601, -19428, -44533, -39911, -26024, -25492, -11161, -2076, 372, 2954, 8811, 8723, -4401, 929, 9930, 6681, 1724, 629, 4791, 951, -4100, -11709, -11302, -2607, 1078, 10214, 12023, 12391, 9295, 10992, 18049, 20395, 21453, 14531, 18694, 20372, 6840, -8930, -11108, -17865, -22255, -4360, 8948, 5991, -7576, -8740, 2477, 15566, 17811, 14664, 16149, 19808, 19770, 11280, 3768, 8869, 21861, 8212, 7372, 6195, -3082, 6872, 21772, 18417, 2701, 7219, 3745, 6407, 9695, 10596, 251, 2354, -12471, -23201, -15892, -9639, -4079, -322, 13825, -6883, -13112, -5171, -8834, -11989, -23885, -34448, -22594, -14037, 104, 11113, 17786, 10224, 5674, 2300, 11793, 20969, 21145, 16262, 8874, 7475, -2242, -2462, 10499, 12976, -1851]
16315a851m511j029n744K046k861p43O288R19J3452Q48k1725Q119J7338n466j3052
16300g972j1988n462K449J7903J691l67m326N700J788O718K678o487j1680K19
16286i136J918n61k380J1263P689o83j9877p306O88J203O921p855k983J3205n791
16271a3685O189Q941k754j1003M40O185p25N489j034J435L280n346J5104P176
16257A9692j4963n676n581N658o569N077n16n933k768Q259j240l399J0997J94
16243C232q921L193M799J8009j1872j3840P647j3155O102J4372N346K368p560
16230I720o864L979m445n539p524j322l743o315l218n069Q973J9803J5473P97
16216A4706n64P391p449q493K466J311j1387J2453P539o469N192l451j5311m412
$$ y = [-1851, -6362, -7391, -13135, -11089, -13950, -14693, -8405, -7486, 5966, 6814, -14911, -6792, 10546, 5080, -7972, -19960, -25422, -22973, -5070, -3379, -3746, -8072, -2372, -584, 6134, 8812, 2325, -9355, -9136, -7218, -7779, -10159, 1104, 8793, 8110, -11767, -19073, -18385, -17182, -10261, -18116, -21099, -7894, -13685, -7496, 1445, -1309, -12312, -11872, -5687, -6412, -923, -1957, -522, 2758, -2588, 12516, 19692, 4729, -947, -6528, -870, -7439, -2362, -2878, -8811, -11579, -3320, -4560, -7959, 3038, 3232, -5689, -2496, 2303, 20312, 8440, -5400, 2247, -10908, -4806, 9566, 14912, 17280, 9720, 2856, 6835, 2390, -3149, -10673, -11995, -15738, -22053, -25271, -30340, -21367, -1564, 13909, 14706, 14142, 21533, 14084, 5591, 8057, 9368, -2019, 10434, 17973, 11504, 16696, 13245, -2066, -6478]
16202f478j0271q694J5282n46J0943j334j539l333o402l709L790m533J1086J2700
16188F962l831q75q27O012L09k0274n702m589j157K2891J0751j2115n255N937
16174a763p35j5926J96K6026K1685m384j7549j0422n38K489L64K750Q444m625
16160F012j650j2299n797O807J5317J3483k762q198p112j08q04k183j315p991
16146h600K0212K142M670J516r220R936Q420j3970o668J185n652r00l53j599L415
16131D534M499P662J2414L060l839l683k570j6306j4219l714o804m39O750k209
16117a4864m788n994L078J1772M378n37r015j2472N143O640j2034N288m531j589
16103b9525J5880O109p42m225M161J89j388O263q94j615m534l641j270J672n381
$$ y = [-6478, -16749, -25443, -10161, -10707, 236, -1098, -2637, -5970, -12372, -16081, -12291, -16824, -5738, 6962, 3131, 2256, 1429, 7441, 7750, -12524, -18226, -22815, -23972, -1081, 9670, -2445, -7700, -1763, -2498, -18424, -18228, 7798, 29483, 25099, 7550, -2872, -3410, -921, -557, 2193, 10637, 6012, 4362, -7937, -13734, -6927, 8390, 21873, 19111, 10913, 3801, 3693, 2889, 706, -609, -8600, 11612, 13754, 18424, 19940, 10720, 20656, 29076, 15106, 8438, 9623, 3971, 3071, 2718, 1119, 4534, 9033, 16695, 29109, 32169, 28330, 24647, 22077, 5771, -8448, -12162, -18966, -19405, -12655, -14864, -19652, -25646, -22568, -10796, -6418, -6955, -15970, -28442, -23299, -16659, -28693, -23405, -27936, -29525, -13645, -7536, -8278, -12503, -8342, -8153, -9541, -3278, -4172, -5787, -10321, -13962, -15232, -13560, -18941]
16088a8941K186J82N127J1637J252L454k368j4714j0293J0171J1619j362Q538
16075F488J4933l368p772j0532n237N165K635K52q59o242O635r04m106n455n309
16060a3676j050N770j2069l332O790j566J5979J1091l929j2278n576K908J8164
16047G226N712l520L814m102P069Q922o674N772m405m636o061Q996N850j8480
16033E483j0474o078j4200o724J4589J4065O680J603p585M557q002l713J445K6164
16019A7810l864j4577j4610J7579P843l488n889l481q470j875m335o040O249Q143
16005i005o722q62O632Q314j5494p027L730J6361L340p344O340J4445J2362j0894
15991A4176j6665r118L439R292J670K429j785j768p566J089l274j125J3887O355
$$ y = [-18941, -16755, -16573, -11446, 191, 1443, 4897, 2529, -12185, -22478, -12307, -688, -2050, 6488, 21421, 18053, 10281, -251, -5488, -323, 2312, 2564, 1705, -4537, 2098, 1194, -2912, -8367, -13676, -14726, -8956, -21025, -24357, -17567, -19133, -3154, 7937, 4008, -8270, -13846, -10938, 7226, 12938, 9418, 13232, 9130, 16199, 25121, 18447, 24219, 19814, 15178, 9117, 18113, 23963, 5483, -4991, -11069, -25269, -31993, -17404, -3339, 3341, 4944, -2641, 1916, -6086, -9799, -8354, 17810, 13946, -631, -15241, 2338, 10181, 6693, 804, -2677, -11147, -13022, -17357, -23397, -17148, -9005, -15727, -16589, -9957, -1643, -17137, -24164, -20434, -4073, -733, -8077, -1737, 12708, 25070, 14176, -2489, -11607, -8168, 1124, 2794, 5223, 3438, 1670, -5896, -4807, -8081, -9206, 4681, 11036]
15977A1036K862j5672o554N405j4750j5361J843J2767L153o338j447n143j2883
15964d1082K956P052q146j1925J3967J3587l931j0874J2752J2430o782j1616q76
15951c2488J7918Q094j0046n513R874M655J825N626P35k966K233n555r791k379
15937a7778J1865m257j1333K759K2418N416o863q435N288m227p870p986k750J848
15923b1905J1823M195N919j681m910P16N06p462J95N587j4262m828K377J6974
15909f756N379l189l174L63n136k708O555j3295N116J1517R249j0919M296M039
15895A337p589j3523p830r455q09J607J0773j614j723N283J2360K811J5734k607
15881D755P21L995r025q603j3342k533O069R200J567k638k475J713j689o556Q391
$$ y = [11036, 13898, -1774, -8328, -2923, -17673, -33034, -31191, -18424, -15271, -21609, -23056, -28199, -41082, -38126, -31074, -39220, -51145, -37178, -23591, -27522, -38396, -25644, -13214, -19996, -31612, -32488, -14570, -6476, -16522, -22035, -12161, -7506, -5681, -55, 680, -2286, -53, -5608, -15399, -17778, -5913, -10170, -21503, -18744, 3674, 9090, 2227, -6208, -920, -5147, -13017, -21003, -23753, -21905, -10082, -5887, 32, -1649, -6559, -5843, -5337, -12799, -12604, -7017, -21279, -26107, -23730, -6756, -1377, -4566, -7740, -7377, -12513, -15221, -8666, -21961, -16845, -5328, 3921, -6998, -2702, 1337, -6252, -19775, -27605, -37060, -37869, -36262, -25489, -27103, -28826, -23543, -11183, -8372, 7362, 4755, 5476, 9471, 446, -8157, -21499, -24032, -17963, -8763, -7196, -9834, -12309, -10596, -12285, -18841, -10450]
15866a0450J2891m359k2124m355J3P339L742J1987J2617j882r455j0472P24K81
15852a3503J0621J0937l567R752J0472J529j1303m638J0511m471j3761p924l198
15839h543p629k589J9246J7615j7147j5160P249O469R026r699r946l930o255k28
15825b1521l533k291L899k381J0811J2321p469l444p769r16N985R309n105j3249
15811b5353p942K755O667J6095p366j1243J1538j1085j612l373j544q995M013
15798c7445O056O342J6495M828q05R088N573p979j6216q811Q504Q332J2783l192
15784C553J925J47J802q78n795o392j2895n189N836M898R481J1634j419m075M866
15769G499M768j1203k4204j255J2803m386q976N787J5259J246Q722j608R054P526
$$ y = [-10450, 2441, -1918, -24042, -28397, -28384, -21045, -17303, -5316, 7301, 5419, -4036, -14508, -13784, -13503, -2882, 8055, 4488, 14240, 24712, 26241, 14938, 10300, 20811, 16340, 2579, -5345, -8543, -16172, -18761, 485, 18100, 953, -14207, -6958, -489, 8537, -1162, -11108, -15038, -21293, -21521, -25054, -27345, -23446, -25827, -15016, -2695, -10164, -13608, -21377, -22293, -16308, -6999, -12104, -25353, -33295, -30540, -23873, -7778, -15144, -26387, -14849, -25934, -27546, -30919, -32463, -41458, -37445, -31389, -25047, -8552, -3724, -4529, 4559, 10132, 2153, -14063, -22874, -14370, -6038, 6745, 3553, 5478, 5625, 7427, 6549, 754, -5638, -18533, -23722, -17886, -12988, -3507, 8127, 6708, 2633, 7499, 12267, 1064, -23140, -24395, -11592, -15978, -24954, -19167, -3908, -2662, 6060, 4452, 13506, 21032]
15755B1032j244p122l809J84q691m444K552l004j395k26J1875J314q959r073m032
15740a5042l991Q275K921J5245J2778q949l633j2236N886K718O8p356p234j2034
15726b2584K337J1716J1619M695n880l698l652M811J2717P786k1069M61p398m277
15712a2416P539l697j3163R459J5002L655P843O42q42J762J1663P540n558m585
15698B4844o070l587j2528j2517j932R94j2267n05M599Q529N529n889J791O961
15684b048Q453o249k709r272L336p839p430L461K649l522j773q247n588R958J0314
15669a6506l626J2168L865l749k131N29m392J117Q695L165k139q750N240J3276
15655F762M304K25N870n804l681j201j419q574P693M812K952j3552j9284Q098
$$ y = [21032, 19788, 12666, 8857, 9041, 350, -4094, -1542, -4546, -5941, -6167, 5708, 7022, -1937, -11010, -15042, -19033, -10758, -7837, 7408, 20186, 11237, 7604, -4632, 1254, 3972, 4040, -3316, -10550, -22584, -20247, -8531, 3088, 7783, 1903, -1795, -5447, -636, 12081, 19867, -1202, -741, -8139, -12416, -4877, -8574, -21737, -12278, 2724, 6379, 14222, 14864, 14022, 15784, 27447, 34987, 29429, 24844, 18774, 15187, 2659, -9858, -11790, -10796, -23063, -23568, -18969, -10440, -4911, -10800, -9009, -2048, 6405, 156, -2553, -11825, -8489, -16328, -23758, -20297, -17648, -21170, -22943, -31190, -36778, -26820, -16506, -20132, -7964, -4099, -7848, -9979, -9450, -13842, -12725, -4030, -865, -3004, -11754, -6514, 6762, 11066, 11291, 17161, 11357, 7676, 6475, 5056, -3518, 4175, 8987, 11939, -1613, -20897, -12799]
15641a2799J4060l064o693m724o157J991j124Q494k481j2032Q733j6301r917J0238
15627c1776J5402N90N755Q75M72q035J367L840Q665L346m644O066k707j5981q72
15612a7637N606o485l588J4637K521k29J7409j202k2945j2474J7872J6821Q06
15599A1112J016k279m509j3025j9149Q668N097l00J1203J4431n517r067k59o073
15585h651N882O850N909q051p843J334o85j384r12p779r614m831J2304J0869q49
15570g451M199M601j54P64K063O042k904j1436p912l439o161L428L858p996Q94
15555b1604J958j1298k458L662m020q200O521J5681O909L886M980J446j1066J5929
15541B326R030j2426L209k306p509j1261j1449K1695J4846L374j7553j305K262
$$ y = [-12799, 1261, -1803, -8496, -13220, -19377, -17386, -18510, -10016, -12497, -24529, -15796, -32097, -42014, -31776, -16374, -15784, -10029, -9154, -8682, -16717, -15350, -11510, -2845, 501, -4143, 1923, -784, -16765, -17637, -12031, -18516, -22104, -7467, -4946, -5175, 12234, 11032, -11913, -24387, -6515, 10306, 11112, 12128, 9849, 5340, -7685, -26834, -18166, -13069, -13369, -2166, 12265, 6748, -2319, -2578, -8651, -2769, 4081, 9990, 1939, -5904, -4570, -5255, -6639, -7551, -15330, -24944, -29775, -17471, -6602, -7451, -3252, 1349, 1195, 1959, 4022, 10064, 7160, -4276, -12188, -15627, -21788, -18360, -14502, -22498, -21604, -19646, -30944, -33402, -29740, -33760, -41960, -35439, -19758, -12849, -8963, -3983, -2537, -13603, 2326, 11356, -1070, 2139, -167, -7676, -18937, -30386, -8691, 6155, 9529, -8024, -9329, -7067]
15528g067j787P294R643J758j4325j5304j3723m950P461r80L245J1588J9238P990
15514A0081J1307K781m257r763k795l829j2922o854q030Q090N492Q584q971m702
15500a5788M287J2797P607M272j5481M425O397O521l840l949m421l90q010l307
15486h880k437L472j630N424r014R951J184j4749L28J2397K3168K131j1030j9172
15472h857m292l819N451R29o109j076P451O285k805O169O124J2106J851j4662
15458D746k690N953j113N206J2985l735q044o157o349j5975l967R142O586n81
15444c993J514N519L687p094j20K335p41j546J468O239R15o380o446p889M819
15429g713P122j460P843o282p740P428p487k337J7285n95L359j3450j4447r375
$$ y = [-7067, -8854, -1560, 8083, 9841, -4484, -19788, -33511, -38461, -31000, -31980, -28735, -17147, 2091, 10081, 21388, 24169, 19912, 10149, 7354, 3525, -9397, -16251, -24281, -16191, -10699, -2115, -11086, -15788, -11501, 1296, 8903, 13175, -2306, 2119, 8516, 15037, 11197, 7248, 2827, 2437, -5573, -8880, -11317, -7845, -9475, -4051, -13065, -3114, -1930, -16679, -16351, -3954, 19214, 21345, 10315, -8857, -13149, -16968, -11517, -10588, -16697, -17773, -10322, -4037, -6842, -673, 5451, 17557, 19408, 4746, 2056, 8009, 6896, 12102, 25087, 21352, 13308, 7151, 802, -15173, -19140, -9998, -3412, -3993, -2479, 3040, 6727, -367, -487, 1848, 1107, -439, 1029, 7268, 8183, 1803, -4643, -12532, -7713, -591, -2051, 5792, -490, -8230, -802, -8289, -10626, 6659, 6064, 9423, -4027, -18474, -27849]
15415b7849k205J5157N645J640O298M902n104m59N640M289m352J647j2842n430
15401a3023K321j1655q332p878J8081K0190l95m041J2834j1610p219n73J4909
15388C609p86o403J319L974j2643o669j662J507N097K631n519q689K26J0114P120
15373f774M948k550j1425j611K922J82l141Q866O961l77O13q434J0315r829j0907
15358b0241j2023p102J7134J6992J623j1008j1362J2765J7126l11m186k32M311
15345C486q298o835r311k670k097L578M08L928N687P943l986j8897o017K456J1110
15330a9515J5191J5465j0025k6226j0364N535J5127M001J724p406k268Q119R093
15317a549j9521q971L822J5279R140K67m460m78J363j2905M364P028L320j790
$$ y = [-27849, -30054, -14897, -9252, -7612, -1314, 3588, -1516, -1975, 3665, 7954, 3602, 5249, -7593, -13023, -10702, -22357, -30689, -38567, -20486, -296, -691, -4732, 8102, -3508, -10727, -11300, 3609, 2823, -3580, -2261, 1713, -10930, -17599, -19261, -17754, -12657, -10026, -15545, -24234, -24008, -13894, -6774, -1826, -4376, -15801, -17412, -14490, -14308, -17449, -8583, -1622, -1999, -1386, -9820, 495, -9334, -20241, -32264, -39366, -22232, -5240, -3617, -14625, -25987, -13222, 3904, 3593, -593, -825, 3486, -4812, -11647, -20958, -23628, -25725, -22147, -21739, -17811, -12124, -4181, -8167, -27064, -33081, -30625, -19515, -4324, 11141, 1116, -25110, -35474, -29939, -14812, -10811, -9087, -16493, -18761, -10642, -1549, -21070, -30041, -26219, -10940, -1800, -1533, -5993, -6471, -5108, -18013, -13649, -6621, -3301, -5091]
15303e091N54r110P964J1430K567O006l674K416j1942k5456l961Q317K567r35
15289a8348j67m420j2477k744J0267J0689J7473k689k005Q304o192j070K720j7043
15275a7702j6698K392O98m358j769J3523L56r529m994L652J7233P901R471P878
15261H054l812l923n124j3260o065R485J8627J4515p848l507j8704J398M584O382
15247H02q638r068L575J359J039r196m670l526m955J6788O114k1581J99J8607
15233a3151R924l807m283n908K201R177o623Q029Q148l443p806M405J2044j1046
15219b139j6928L706O845O763K611l647l247P665j456n639R545Q579O421o084
15205A2995q143j8982k797K591J0232J5665j106L52p268j5042K95J343n786l707
$$ y = [-5091, -4537, -13647, -5683, 5747, 8314, 14320, 10646, 13062, 1120, -24336, -28297, -19980, -17413, -18348, -18515, -22935, -35412, -38156, -27889, -17200, 273, -2416, -4421, 3883, -2309, -3379, -659, -17702, -34400, -32008, -31310, -35668, -37437, -23914, -23558, -33087, -38081, -34429, -17196, -9295, 176, 8054, 4242, 319, -4805, -18065, -24130, -14645, 3982, 18497, 10649, 7142, -11562, -10164, -5580, 802, -7836, -16904, -13329, -11970, -10931, -20127, -24797, -28323, -33278, -16490, -10376, -31957, -31758, -13151, -3227, -7034, -11317, -17225, -15024, -5847, -12470, -4441, 3707, 264, -7542, -3137, 8907, -2139, -19067, -15361, -8516, -1753, 858, -2789, -6036, 1629, 173, -5466, 4079, 12658, 19079, 12995, 4852, -14130, -16927, -14336, -4104, 11561, 10455, 10807, 3539, -11503, -11208, -9865, -15651, -19358]
15191a9358J3692J2278k686j4889M771M84p478p503p103j6041n160l284O919P754
15177c7604N744r100n185l552J34P594L242p041P750P895n357N078N792l573r391
15162c7574M353J0047J1673K289k027O514N650J883j5369q63J971N030L188p735
15148a0970q251m08n920j1169P691j176J5293J4627m580K920O296J560q549l945
15134f581l654N124r05q424J941L660N780Q013o70q172j334P042J2851q631r536
15119c496K33j619M148L16j0345m25M548P407Q821q252j0610l157M021o675Q825
15104f260J0776N489j0934l198j2620n714k455J665J8258N625q700k1221M402
15091b4887K0740M344p751M436j64M80J116O580j5184K429l52K134P328Pp041
$$ y = [-19358, -5666, 6612, 3926, -10963, -6192, -5708, -13186, -20689, -27792, -43833, -48993, -52277, -45358, -37604, -31860, -40960, -46145, -49697, -49563, -41969, -38727, -45768, -38018, -30123, -35480, -30402, -24610, -28183, -37574, -33221, -23174, -11501, -9212, -11239, -4725, 925, 2808, -12561, -13424, -11453, -6423, -3235, -10970, -19221, -19629, -25549, -36718, -29027, -30203, -14910, -283, -4863, -1943, 4353, 5913, -2636, -6581, -10235, -5111, -6016, -14440, -12499, -8839, -3059, 4954, 4284, -3888, -5222, 1820, 14671, 6040, -3496, -3263, -4882, -734, -418, -10763, -11188, -6640, 767, 9588, 1336, -9274, -12431, -8410, -15085, -6260, 4516, 10005, -929, -4127, -16747, -22461, -24916, -23251, -4993, 632, -8068, -29289, -24887, -4147, 197, -7554, -3118, -3282, -2802, -1686, 4894, -10290, -7861, -8213, -6079, 1249, 1256, -5785]
15076e785j2481m506O967k016m609p754n315N790P568O419n832M323Q036K572
15062f623L69m721j0342n32j262q008N544R390M221K165n605n614L584J0460L057
15047c917p97j3080J3J847L336J2722o18R0k091j0075j1505q196L217R313O939
15032a2802K947q10m011m747J790K780L479K0022J5657O809j8848k6763p313N066
15018a6744R941k224m980K642m487r970J7790J0314j691j3222l070M450P212Q713
15004D674j3101N78J4824M9K101p29Q287L767p442j0285L295N297r989o916j941
14989g531K6654N90j713N978R192K776j4930j587J6074K1872K3345K5401N1129
14976A57250Q7164J61982K54568M17207L44764Q009k88502k86661j76157j08029
$$ y = [-5785, -18266, -22772, -15805, -17821, -22430, -30184, -35499, -29709, -22141, -15722, -21554, -17231, -9195, -6623, -6254, -10975, -21317, -21849, -23111, -31119, -25575, -16185, -11964, -9799, -15404, -21018, -17434, -6974, -3917, -4714, -17794, -17781, -15934, -12598, 124, -494, -404, -2495, -12570, -24075, -32271, -29054, -19741, -12802, -9855, -10665, -14676, -19423, -17633, -14853, -11374, 8648, 24305, 31114, 12266, -14497, -21810, -16744, -6803, -9027, -14007, -11365, -15852, -25822, -8032, 2282, 591, -12631, -15701, -11251, -4039, 4674, -8427, -7849, 6975, 7024, 9125, 8396, 16683, 20450, 13008, 2723, 6018, 11315, 1326, -5590, -7531, 19123, 19713, 18000, 23978, 33170, 35946, 21016, 19429, 35503, 57375, 80720, 106121, 157250, 244414, 406396, 660964, 1078171, 1422935, 1430944, 1142442, 855781, 679624, 571595]
14966E71595q5161p0087p0660n6527k8796l6717k7913j1249k7744j7575j0975
14955A28191o172k789m198q201j3885q390n687j4997n446k168P3O065p998j1416
14941D2982o181k087J61p718o742Q876Q060N680q35N182k556j0405n938l077q408
14926A6994R814K327j5430j0882L610J8319Q607l219n716k199k188O969l335q619
14912A5052j606n241o674K136k963P321L671j0192R714L301o638K358K0054J112
14898C1405j6866P99J518j2301r728o636K396j650Q226J0434j0484j6592j134
14885b0613N01L05L227L818q281m07J0115O566l849J3428N803l634Q580p535l181
14870D843Q363K26j0949J53j740p961R261o229o41J0951O718k146j7034j772Q611
$$ y = [571595, 486434, 416347, 345687, 289160, 260364, 223647, 195734, 184485, 156741, 139166, 128191, 122019, 119230, 115032, 106831, 92946, 84556, 78869, 63872, 58426, 56258, 56331, 62396, 54398, 42982, 36801, 34714, 34875, 27157, 20415, 29291, 37351, 43031, 42196, 47378, 44822, 34417, 28479, 25402, 16994, 26808, 29135, 13705, 2823, 6433, 24752, 33359, 30140, 24424, 22225, 20037, 27006, 23671, 15052, 13446, 8205, 1531, 3667, 704, 8025, 11696, 1504, 11218, 14519, 7881, 10239, 30293, 31405, 14539, 15338, 16856, 4555, -5173, -11809, -9413, -11063, -2837, 7597, -2887, -19479, -20613, -20112, -19807, -16580, -12762, -21043, -21450, -11335, -4769, -8618, 4810, 10613, 6979, 15559, 8024, 4843, 13206, 13432, 2483, 2636, 896, -7065, 2196, -4033, -4674, 6277, 12995, 10849, -6185, -7957, 654]
14855F54j841J276R307J400n307j878j0069K164J7026r652l665J4470P142K196
14841B3223n007m962n802n884k2293j421J0443o060k709M926M731j587N777J1418
14827D793O453k864l644k3961j1353M764R313J0397O707P725J244j6919l579n460
14813a6384l936R256M32O502O474o454J922L712M46J8127K871Q609L155J0692
14799D5424K070j0693k2466j5809M24J755o921o187o045J1943n713l289q405O994
14785a6918O331m14N885K608J0074J1009J181N528n473o890p726p751l305k785
14771h646P382J3225M037j6884q507k087n928k5480l180J8324O742M887O399N469
14757d247O532p32p420K767p124q523l796Q3J8565m805j0112J7150J3915n485
$$ y = [654, -1187, 89, 9396, 10796, 5489, 3611, -6458, -4294, 12732, 3080, -585, 13885, 21027, 23223, 18216, 13254, 7452, 1568, -20725, -22146, -11703, -17763, -20472, -15546, -10815, -12402, -6625, 4793, 11246, 8382, 4738, -19223, -30576, -25812, -16499, -6102, 605, 8330, 9574, -7345, -10924, -16384, -20320, -11064, -10632, -4130, 2344, -4110, -2188, 1524, 1970, 20097, 22968, 31577, 34732, 45424, 47494, 36801, 14335, -1474, -1050, 705, -6216, -12403, -18448, -6505, -12218, -15507, -23912, -16918, -10587, -11001, -5116, -2508, 7566, 18575, 19756, 25284, 19811, 12921, 5195, -2556, -5861, -8646, -1264, 11961, 15998, -886, -9393, -11480, -17408, -42888, -46068, -27744, -21002, -16115, -9716, -4247, 2285, 1553, -5867, -3100, -10224, -18747, -22543, -22460, -3895, -8700, -18812, -1662, 12253, 6768]
14743F768j4739K134J291J493j960n472j0910J376O762O227J540j4217N041K2
14729a4644L312O174L338j046q594M616K470q725j999n07K462J1841k978M39R148
14714E307o946m141Q219K03j5998Q301J5283p897j586l632k088q538l001k944
14700a9458K532Q748q021K687M067K264j369m749j172p01J5889K30o144J893l992
14685g296j2131l444R532P57j362q38N281M154j915j707q247M832R166Q30m099
14670f487q876l543M095J2731k33m41O683m609j2346O702l293l608Q048Q048k069
14655H02q763m203J410J793K303m547m190Q885P779j3532o926M191L83k2j6511
14640c1148m847J6567Q663j743r549o981l380P759L327K999Q112P865R64j5314
$$ y = [6768, -7971, -5837, -4546, -3053, -5013, -10485, -21395, -20019, -13257, -7030, -5490, -19707, -14666, -14644, -11332, -5158, -1820, -2866, -11460, -6844, -4374, -13099, -15098, -15605, -13143, -1302, -4280, -3841, 5307, -1639, -5780, 2439, 2642, -13356, -5055, 10228, 2331, 745, -2887, -4975, -13513, -16514, -19458, -16926, -8178, -16199, -13512, -9445, -7181, -8550, -13299, -14471, -15172, 717, 947, -5197, -3304, -7296, -19427, -22871, -13339, -12582, -13944, -14782, -9501, -5347, -7262, -8969, -17216, -12384, -3218, -2388, -6487, -15363, -18906, -14811, -2080, -2313, -2754, 3929, -680, -13026, -6324, -9617, -13225, -5177, 2871, 802, -7961, -12164, -10754, -8961, -6658, -11205, -15395, -6510, 1269, -12263, -19189, -14998, -14615, -14637, -31148, -35995, -19428, -10765, -12508, -22057, -29038, -32418, -24659, -21332, -18333, -10221, -2356, -1392, -16706]
14626a6706l677q8j626N122p38k28N240N149k737n388J678k699n490r658l548
14611c5394P994M560J8841m877j2645j1077P120K7006J156L692j6863j695L106
14598i076K345Oj2633l808m329j794J3589p525p156N366J0428J1063Q42J174k666
14583d174k422k463J3100Q43j3545o69M570J95J420k093l814j760J2555K466o758
14568b549j0463j370n232k912m372J2214M421N837r466K4009J4187m052p807n954
14554F491k149o552J161J344o200N827l914q737j5048L736M676N241J1560L402
14540H38j8658j2069O976m654R56J2285L501j835P628N641P928j0813p595R605
14526b66m500q847K743N31l136O117M806N922j1346j6428M246J0920Q913j203
$$ y = [-16706, -20383, -20471, -22097, -16975, -17713, -17941, -12701, -7552, -10289, -15677, -13999, -16698, -22188, -31846, -35394, -27400, -22840, -3999, -8876, -21521, -32598, -25478, 1528, 2684, 6376, -10487, -12182, -9076, -6731, -6725, -19358, -23166, -27495, -29289, -15700, -23225, -30381, -25015, -14587, -3524, -2682, -1508, -4174, -6596, -9059, 4041, 4884, -8661, -9330, -4760, -4565, -3145, -5238, -9052, -10812, 1743, 4209, -2549, -13012, -14382, -19614, -22526, -26898, -14684, -10263, -4426, -13892, 10117, 24304, 20252, 12445, 6491, 4342, -2210, -1049, 295, -5905, -78, -3992, -12729, -27777, -24041, -19365, -14124, -2564, 838, -17820, -29889, -22913, -27567, -26611, -14326, -10825, -12660, -5032, 609, 8537, -2276, -9871, -266, -4766, -13613, -10870, -10339, -13475, -7358, -2552, 3370, -7976, -24404, -20158, -9238, -325, -1528]
14512a528o513K980N377J453q173j265N960L888L764j586n721j947o02N46o171
14497i538n121k155j1955R443P104m546j203j3514o113J4941Q287P98J1219N359
14483C006J747j052R585p248j2619j338R736l6r090p76k842p719Q768J7147n859
14468A410o480O918n748m061l196j2659L286N502K0251N738r852j4374n868N999
14454a3134K193M113L545O246k206M761Q87j2968j6780j756J5486Q31K073O646
14440f3J816j2334p499J0571J9219k915j3322j5645o077J2582j91j2628J4113
14427a2373R565m933K097q969Q598J7503p181k0015n22N988P987Q032K194j4953
14413f982q691J773K105q311j6331J1620J2867J4312K454j4042p553j648Q996
$$ y = [-1528, -8041, -5061, 316, 1769, -6404, -7669, -1709, 2179, 5943, 4357, -1364, -3311, -3913, -3367, -9538, -14659, -16814, -28769, -19326, -12222, -16768, -17971, -31485, -37598, -22657, -14370, -13572, -2353, 3006, 4753, 3701, 13286, 6038, -6581, -7919, 1817, 1781, -7309, -8085, -10927, -18646, -9878, 7269, 1410, -5070, 1848, -3900, -7961, -11157, -23816, -20530, -15028, 5223, 10961, 1109, -13265, -19133, -13134, -10941, -6828, -3283, 2963, 757, 5518, 6405, -6563, -23343, -25099, -9613, -8782, -6709, -63, 1753, -10581, -18080, -7509, 11710, 8795, -4527, -20172, -26249, -13667, -13858, -26486, -12373, -2808, -7741, -5644, -14613, -6015, 11488, 4307, -15708, -16230, -10242, -2255, 5777, 7971, -6982, -15673, -13900, -11795, -20106, -36437, -24817, -11950, 2362, 4816, -9226, -16779, -18427, -9431]
14400i431J1116k547K062R940o408j2230k715P458l791j0322J238l21o002j2322
14386c4275k605Q774N784l404p68J001n408J3212O778L403j0303n544J975R77
14372b0403j5388O993l457P213j760O534K4685R178j3133q468K87p806N334O745
14358c446O979q241J610o555L10P686j0068q962O040M264L121j0760J5R122N398
14343c487p312Q840N173J243j1681K57k206P18k793J511o56n474n7j95J4180O987
14327E048j4988q071k091J6463J4034K545n263n013O807r2r883r215r058K638
14313a6139J3082M270k369r945q360O599L634j988n572R294R33o775L92q787Q81
14298b0850l942j5519O729M938J574P122N37J3813o426j4993Q674J4514j847k615
$$ y = [-9431, 1685, -862, 1200, 11140, 4732, -7498, -10213, -2755, -6546, -16868, -15630, -15951, -21953, -34275, -36880, -28106, -22322, -25726, -26494, -25493, -30901, -17689, -10911, -7508, -17811, -23355, -21380, -20403, -35791, -28798, -32255, -25042, -26802, -20268, 4417, 13595, 462, -8006, -7719, -15525, -10191, -3446, 3533, -4708, -3098, -9653, -9343, -1657, -11725, -20687, -14647, -10383, -7262, -18022, -18007, -8885, -3487, -10799, -1959, 3214, 4457, -7224, -6967, -9173, -8455, -11248, -9737, -10393, -15867, -15924, -16119, -1939, 5048, -9940, -18011, -20102, -3639, 10395, 12940, 7677, 2664, 9471, 9379, -504, -9719, -18777, -16139, -3057, 1213, -1156, -11101, -19461, -12862, -9228, -11216, -16788, -7494, -6561, -13336, -12944, -21731, -20850, -24792, -40311, -33582, -28644, -27070, -19948, -19411, -5598, -12024, -27017, -18343, -3829, -5676, -8291]
14284h291n565o872q429n645K0655J2737O562J893r196j1479j4414R891r333l592
14270c1078J5218J2655j2281q747J2984k615m24N233q201M050J4052q864q64P308
14256a574o620J131P326P375M481q18j532m287l266j2970r785l982O961J1240
14242f320M22l735p681J1533K0284J0205O011J618l077p57j0621q526p681n855
14228d180m698k953j2697p86N48J0041J3644j025k469j0479j343r213K74K3422
14214a914J1165K454n821J074K979r771r948J3840K813j039n517j638P764j5250
14200h809n971J102Q107j873m078J5774r243j3728K73O906j5432j9720O815J452
14186c8425J3891P04L171Q848K763p702J291O213J376K314k522r107J7147Q685
$$ y = [-8291, -13856, -20728, -29157, -34802, -14147, -1410, 5152, 7045, -2151, -13630, -28044, -18153, -27486, -31078, -15860, -3205, -15486, -24233, -11249, -13864, -14288, -9055, -17256, -13206, 846, -8018, -8882, -1574, -8194, -7063, 263, 7638, 12119, 11301, 9769, 5482, 2216, -10754, -20539, -24521, -17560, -6320, -5898, -9633, -17314, -5781, 14503, 24708, 30719, 32337, 29260, 28503, 17882, 9356, 1675, -4180, -8878, -11831, -24528, -25314, -24766, -14725, -1081, -2106, -4575, -15054, -16397, -25610, -25336, -1914, 9251, 11705, 5884, 6958, 9937, 166, -9782, 4058, 6871, 5832, 315, -1323, 6441, -8809, -14780, -13678, -5571, -7444, -11522, 4252, -4991, -18719, -18446, -11540, -26972, -46692, -39877, -38425, -24534, -23830, -20659, -11811, -9048, -16750, -15459, -9246, -7870, -5556, -8078, -17185, -38, 8647]
14172H647k4238J023L319p55k930l467L324R228j3540j3973O000N825L367J1854
14158f316M296k058j2771N766n837j0581O291N414L341N872Q393o294M131N181
14144D828m755j1379m292L098M381j2231n916R561P34M897J324l325r462K734
14130a9803J3614o760k1141r529k138j041j651n783J0486J0272Q297J405l062
14117b6834P802m044p572N527J4214L335l618l801J470p867j35K430J6072m51
14103c472n711J3696P851j489j563p496l388L933k291K888r595l739L394k55N339
14088a898j977j2842O717J1987p85P035p79m59M142l05n21m113Q647N582M574
14073B5005j3844r285P33K0085J3596R838J2051L0313L6221K6198M8019Q6695
$$ y = [8647, -15591, -14568, -11249, -12004, -14934, -18401, -15077, -5849, -19389, -33362, -27362, -21537, -18170, -6316, -2020, -4078, -16849, -11083, -16920, -27501, -21210, -15796, -12455, -6583, 1810, -4484, -353, 4828, 73, -11306, -15598, -12500, -8119, -20350, -26266, -16705, -15971, -11074, -9750, -13075, -22537, -19803, -6189, -12949, -34090, -43619, -45757, -46798, -48449, -54232, -43746, -33474, -25177, -23772, -26834, -19032, -23076, -30648, -25121, -10907, -7572, -11190, -14991, -13521, -21388, -21523, -19093, -3021, -3472, -9183, 4513, 12364, 10875, 9312, 1816, -1572, 2361, 70, 2958, -6637, -10376, -6982, -7237, -1898, -3875, -16717, -10000, 1987, 1202, 8237, 7458, 6999, 11141, 10836, 10315, 6202, 14849, 20431, 25005, 11161, 1876, 2609, 22694, 36290, 46128, 58179, 88492, 124713, 150911, 198930, 285625]
14061B85625P7333O8333N9542N4216L3015O914j051k8435m9558n5296n3100m9620
14049C47918m4579m1624m0945l2906j4339j5718j8087m532j1948j1792q671k3051
14037G9726m507j63o332n66L115K493j4967j2353j126P82m61M056K890m344L337
14022E1580n402K704q182k612P550K951j0230l427r507j8996k186P099j60l875
14008G307M22N229l484p32J1961K882q73q439j7744k1133J587J365n575J3175
13994a4052R220L158P222O281l973j068j4045R769L718o111j5284J250J4276J741
13980B102M36j573k786o131J2812J842n509P164K0979O505j5555j0240o078k0595
13966a6627J0235N027q757n59N128j3239k734R980m729o829K941k703K085J1072
$$ y = [285625, 362958, 431291, 490833, 545049, 578064, 584978, 583927, 555492, 505934, 450638, 397538, 347918, 303339, 261715, 220770, 187864, 173525, 157807, 139720, 135188, 123240, 111448, 102777, 79726, 75219, 75056, 68724, 68158, 71273, 73766, 58799, 46446, 45320, 46102, 45641, 49697, 52587, 48243, 51580, 46178, 48882, 40700, 38088, 45638, 48589, 38359, 34932, 25425, 6429, 4243, 11342, 11182, 7307, 7729, 12958, 9474, 8742, 20703, 23585, 22712, 14273, -3471, -24604, -23017, -21652, -27227, -14052, -4832, -1674, 5548, 11829, 7856, 6788, -7257, 2512, 6230, 119, -15165, -13915, 361, 2102, 2538, 965, -1821, -7952, 4860, 6702, 1193, 8357, 29336, 35841, 20286, 10046, 3968, -16627, -6392, -1365, -10122, -10681, -5553, -18792, -21526, -11546, -16275, -23104, -20163, -22866, -20781, -9709]
13952i709J230l619L348q585R99O583k319j2344N844J5092P055O94k263l770r342
13937a1106R909K6447J0187j9704j1481r54K408J1368k503j9118m627J0238J6772
13924A7836q302j1126j4942J136O059N889J150j542P393R856M86p740Q736p970
13910F919K997J2714j8057r072l943J211J0144O7j4334J2439L644M643K74k0761
13896a1115j3535R158K3792N85O533m09o053K0915J3764r940j3807o906M156j595
13882A5543j0292n26J012p952j2558J4600J2609k913j5234l534o124o320L185
13869a8504l064R362J0696K849p954O034R502m965o632N539K3687n274j2590j0461
13855a775O147L344j649j168n492o822n456J2427L175p819M346J947M701n115
$$ y = [-9709, -8479, -12098, -8750, -17335, -16336, -9753, -12072, -24416, -18572, -3480, 3575, 4269, 2006, -1764, -11106, -1197, 25250, 35437, 15733, 4252, 3298, 5706, 17074, 14571, -4547, -9174, 1064, 17836, 9534, -1592, -16534, -15398, -9339, -3450, -2300, -3842, 3551, 13407, 13893, 6153, 14889, 6919, 9916, 22630, 4573, -4499, -8442, -7231, 2913, 2980, -11354, 1085, 4729, 9372, 9646, -11115, -24650, -15492, 8300, 8885, 15418, 15009, 8956, 29871, 43635, 33695, 19888, 12982, 17138, 15543, 5251, 4725, 5737, -2215, -14773, -173, 12436, 9523, -5711, -9245, -15369, -21689, -18504, -21568, -12206, -1510, 1339, -6615, -581, 8921, 3956, -2676, 2863, 26550, 21276, 8686, -1775, 4372, 7716, 6067, 4899, -593, -7415, -12871, -444, 2731, -5088, -742, 1205, 5906, 791]
13841G91Q249m870K437p601J2953k945n228j305R791K190n357L463K144M14j2146
13826B980q243J6147J9574j3091k0638j1144N838K3905M864j1710J674k2105Q278
13813c671K9226j310L506j0588q658L851j0085n643J4621l66l484J827P915j889
13799A5252L840j188K114O94K082R511l800k2125n078N911K530l306O000K871
13785A5308L280R724k858j1933q750j5124R150J2458R679k193L180k033j6334
13772C554o739r747J470J1423J3838J927m755p465k063P467K2355Q166j5004q716
13758A5711L278J513m210R696j5595m089R43K121j1640k312l697k472k399M581
13744h571J2905M050l574P653J498p369n325O119J2149q823p736j1987Q307J880
$$ y = [791, 9040, 4170, 6607, -994, 11959, 9014, 3786, 2481, 12272, 14462, 9105, 12568, 14712, 15126, 2980, -5263, 10884, 30458, 17367, -3271, -14415, -8577, 15328, 20192, 8482, 10156, -11949, -3671, 25555, 24245, 27751, 17163, 8505, 12356, 2271, -3372, 11249, 10883, 7399, 9226, 17141, 15252, 19092, 17904, 20018, 20712, 22794, 32305, 28505, 6380, 1302, 7213, 9743, 6437, 12437, 15308, 18588, 28312, 25454, 13521, 4771, -10353, -1203, 11255, 20934, 18741, 21921, 19888, 3554, -3185, -12932, -11462, -39, 13799, 15726, 10971, 3506, 1443, 8910, 31265, 39431, 24427, 15711, 18989, 20502, 16292, 25988, 10393, 6304, 7247, 9368, -2272, -4584, -8281, -10753, -13152, -8571, 4334, 8384, 4810, 12463, 13961, 6592, 1267, 7386, 19535, 10712, 2976, -9011, -704, 1176]
13730A176J0240N995n078j322n71J1784L934j2202j0359k177Q332M963o432j3612
13716e329O869J3452p255o344o337j2076n59N117R977J0566N988L134n826l362
13702H015N192O022o172r797o520j848k580K322J2760R04M167n28Q601n173j1822
13687C543j0995k69J32l076j074M247J1431j469j1406o801l714J4105J7524L367
13673A5545j2112j5782J912J0090p108l379o645q631N710K1360j835R510p767
13660H68O358p563n343m0r32P02k081P160Q155J263j157K085P007M643o13K675
13644B3187k183n760j599K641m226j4948j4683K103P562N211M522Q70l022J3602
13630A3277p552j6170j8021p113O038P204J605J3875K5981J682j6469q964n982
$$ y = [1176, 11416, 17411, 12333, 11011, 10440, 22224, 26158, 13956, 3597, 1420, 9752, 14715, 8283, -5329, 1540, 14992, 7737, 1393, -4944, -17020, -17579, -12462, -2485, 8081, 14069, 17203, 11377, 8015, 13207, 19229, 13057, 3260, -3260, -5108, -7688, -5366, 7394, 8298, 12465, 11937, 20538, 15365, 3543, -7452, -7721, -7589, -10665, -11739, -7492, 3939, 2470, -8936, -15737, -19451, -5346, 12178, 15545, 3433, -12349, -10437, -347, -7455, -10834, -17479, -26110, -20400, 960, -875, 8635, 868, 7226, -337, -5680, -5720, -6652, -5950, -8031, -871, 7284, 8547, 7390, 9475, 16482, 21125, 20512, 23187, 21004, 15244, 13645, 16286, 12060, -2888, -17571, -15468, -7906, -2695, 1827, 2697, -325, 13277, 5725, -10445, -28466, -35579, -29541, -22337, -20732, -6857, 19124, 20806, 4337, -4627, -10609]
13617a0609R936m907l82J2178N458J910l644m352Q987l193j1612q647N967N734
13603B824m344J6576J9410l045k0934j0952q843j172j0010N849J0479q053O426
13590e789r489l763l708o255O558J5175P754o87m870J4560J3634r122K69Q115
13576B2382j0208Q45K58j588j0632k336J2662k710k2493J548K5414L530n790J0773
13562B1655l203R575L347j2406q051o234Q810j473j3951m71l797k703j910j862
13548a2674R546M65o872o29N254N010P647k209l350K228j182l358n463L355P740
13533E508k338k347K417K678l115j7771n271J4831P396q74L088m06p060j0621
13519a3885n257j5855p86Q403j816n226l483K878Q723M76k0343r944P747J0954
$$ y = [-10609, -673, -5580, -5962, 6216, 11674, 13584, 9940, 5588, 14575, 11382, -230, -8877, -2910, 2824, -1520, 15056, 34466, 31421, 10487, -465, -9308, -10480, -20490, -14641, -4162, -12215, -5789, -15278, -19041, -22749, -29004, -22446, -7271, 483, -204, -5074, 9486, 23120, 13998, 14267, 22382, 12174, 13019, 13277, 11689, 1057, -1279, 11383, 8673, -13820, -12272, 13142, 16672, 10882, 21655, 18452, 28027, 31374, 18968, 10917, 4683, 13493, 12020, -1931, -2402, -6199, -8902, -10812, -12674, -3128, -2663, -9535, -10164, -4910, 100, 7747, 5538, 2188, 4416, 3234, -124, -5587, -2232, 5508, 3170, 823, 3240, 5918, 2803, -14968, -20239, -5408, 1988, 1114, 4202, 3796, -3264, -13885, -19142, -34997, -35783, -27380, -29196, -34422, -37905, -35027, -26304, -25828, -46171, -56115, -48368, -37414]
13505c7414Q223L698N956l368L88K2662j148r829q103P842J2577J1573J2849m823
13491B1083j1445j1809j7583J491M137K400J820k082N750J4584M135J4028N185
13478C1694q686j4368n874Q303j0669k3995j462m731J55k956J616K649O946J306
13464b0072M69P395Q115k424j424M418J0204n534j4230R400K2771j836j643p323
13450H286K579o617J1454k512j3576m476k84M085J3616k513j2766r956j735l909
13436a8324k10J1667J0697K602o844k129r051o096J594j75j373Q96j22K398o131
13421b0601k549p13l374P131m596j2670j0258R342J0812m980k882J0794m363k777
13407c1684O707P082l93K671n67R487M995J7765M965o647j7088l559K199j006
$$ y = [-37414, -29191, -25493, -19537, -22905, -22517, 145, -1003, -10832, -18935, -11093, 1484, 13057, 25906, 21083, 9638, -2171, -19754, -18263, -14126, -11726, -9906, -11988, -6238, 8346, 12481, 26509, 31694, 23008, 8640, 2766, 11069, 400, -23595, -25057, -29788, -29633, -32589, -30973, -28324, -21378, -20072, -19603, -12208, -4093, -6517, -7941, -3523, 6681, 1147, -13083, -3683, 19088, 17252, 15609, 8286, 10865, 4248, 15702, 13190, -386, -4862, -5146, -1061, 12555, 10042, -2724, -12680, -14415, -18324, -18534, -6867, 3830, 6432, -412, -2541, -11592, -17688, -16094, -16269, -17642, -16746, -16868, -14470, -20601, -23150, -23863, -27237, -20106, -24702, -37372, -47630, -38288, -27476, -32456, -35338, -24544, -28907, -31684, -24977, -17895, -18288, -15617, -16184, -6697, -1702, 16063, 21028, 14381, -2707, -6266, -4067, -5073]
13393e073O268L162P997R760J2045k2239M714M306p164j3754j1773k644R687R5
13379d613N957J5060k56j0658q751m38K463L057n917j924J812k269J545k727m626
13364a2285K89j0305J6402R300j075K079P564o10j555j657j987l366j1654J371
13350g489k889L26J4904m696n955j058O307L262r891N110J1766m7j857l772K289
13335F310J415l654p642m203j1468j151J4613K824j4294o898l951R724J4920J113
13321b342l446k516J0773N106Q349J2980o846p192L118k406n293o925M612k166
13307E806k68L923m785p738M733j5J2785l560P025n038N0L510J89j7487j72K956
13291A914Q305Q912l193j6965j4499J1995R455J90O529q925Q04n646L215Q342
$$ y = [-5073, 1195, 4357, 12354, 22114, 34159, 11920, 16634, 20940, 13776, 22, -11751, -14395, -4708, -4613, 1344, 16404, 16148, 5490, -3261, -3699, -1236, 1821, -4096, -6020, -4208, -6477, -4932, -7659, -12285, -11996, -22301, -5899, 3401, 2326, 4405, 11969, 11359, 9804, 8147, 6160, 2794, -8860, -7489, -10378, -10052, 4852, 156, -5799, -6857, -550, 2712, -7179, -2069, 9697, 9650, 7793, 4021, 6310, 7725, 4071, -3571, -7774, -19242, -20393, -5780, -2956, -17250, -24148, -28099, -18375, -3455, -2342, -5788, -8304, 2469, 7575, 15924, 28904, 22058, 14866, 17984, 15578, 10285, 3360, 7972, 5806, 5538, 9461, 4676, -3062, 1671, 1656, 14441, 10881, 17906, 12868, 12918, 16428, 16617, -870, -1042, 1914, 10219, 19131, 15938, -1027, -15526, -3531, 5924, 6114, 12643, 3718, 4522, -1124, 2091, 10433]
13277A0433j7697J116K2245O719m966l900j0545j0603m086J0871J9970m806Q3
13264A4834J86n513Q311J5408k2538L185l956N417l96J33j9104l244j042j496
13250i815m166O8j659m967m037Q077K747m413l599o508k255J1184l82J1554J5448
13235G277j4856r1j143l470j2816l659M363J0351N925j023N966M124J113r211
13221g150n837j73k694M633j975m662N858J395L674J2570O545P249J611j1104
13207I940o904L873N40j2821o838o395L260O179O098k091q848j503Q132J7203
13193I825j6795p921J6861J1617O809p986r103N867L678J620j785K36O065r14
13179A8074o225L780L609o51j2427n584K010N517o533o044p221J0160P704l934
$$ y = [10433, -7264, -6148, 16097, 22816, 17850, 13950, 3405, -7198, -11284, -413, 19557, 14751, 14834, 15020, 9507, 17818, 33226, 10688, 13873, 9917, 15334, 14938, 15071, -4033, -7277, -8319, -9815, -13981, -13913, -15572, -20539, -24576, -16499, -13752, -18165, -21764, -28272, -30527, -19343, -19725, -8171, 7277, -7579, -7670, -8813, -12283, -25099, -28758, -24395, -14044, -8119, -9142, -3176, 948, 2061, -7150, -12987, -13160, -15854, -11221, -13196, -17858, -12000, -10605, -6931, 5639, 12184, 19433, 21044, 9940, 3036, 6909, 7449, -5372, -12210, -18605, -15345, -9166, -3068, -5159, -14007, -15510, -7378, 9825, -6970, -14891, 1970, 13587, 20396, 12410, 3307, 9174, 12852, 14472, 12687, 12923, 18988, 18074, 11849, 15629, 19238, 18587, 6160, 576, 2586, 8103, 1570, -4474, -11695, -1535, 6169, 2235]
13165B235K093K903q761m775Q122l491J413Q591J8512r238j7816O294r306k73
13151c497J2261J5494l413p008n46n952o803M454L221j1064M645n577J411K081
13137b93J2718J92K194l852k492M017J142k109N129K3869k070k2976n540j868
13123H061O41K891M907J4065j954j1305N516M546O1q078MK795J3769J3834n709
13108D4044j1288j2328l911r15l964M227j103n840M651m26N291K700M054r487
13094A5705k2301M752J1254N318J269l205O774J021r702K559R98l334Q264M899
13080B4271m842r647J318J1155J2461M26o375M244Q040J248r207L29N583k065
13066C6939k708N041J4571K5799O773J958j7199J0155J4916K0250J4189j690J2422
$$ y = [2235, 4328, 7231, -1530, -6305, 1817, -1674, -261, 8330, 26842, 17604, -212, 6082, -3224, -3497, 8764, 24258, 20845, 13837, 13291, 7339, 536, 4990, 8211, -2853, 1792, -3785, -2374, -293, 12425, 12617, 14811, 10959, 8467, 12484, 13626, 11517, 16646, 40515, 38445, 15469, 9929, 8061, 8702, 11593, 16500, 30565, 28611, 17306, 22822, 27368, 27429, 19351, 19355, 22150, 35919, 49753, 44044, 32756, 20428, 16517, 15602, 11638, 15865, 14762, 8922, 13573, 13147, 18438, 21138, 25192, 15705, -6596, -1844, 9410, 14728, 15997, 12792, 19566, 20587, 10885, 13444, 14442, 11108, 19372, 24271, 19429, 9782, 11100, 22255, 34716, 35142, 28767, 33011, 41051, 42299, 33092, 33421, 39004, 36939, 34231, 39272, 53843, 79642, 86415, 88373, 71174, 81329, 96245, 116495, 130684, 128994, 141416]
13053A41416K0707K2020L6985M8952O1523N9514R5071J28809J26876J33897J27511
13042A003281R1983N1549K5192j9406p0414j02149q4702q9662r3240p0387p3348
13031E68697o1847n9706m9649l2316j9478k5735k5139k5314j2431k1291k3318
13020B12473j5187j6185j1688j5891j1854n897k288n360j0526m018j3375o932
13008I3272n723O598M279j134j731m689P136M998j5792L441L501j1057j6298j654
12994F5147J4707J5529k584j2201j3659m524R54j0632O451N174O671J2421J354
12981H4808m445j3872j2421l420j27m354j8374l534K962J0413N208J1236J291
12968E5371O350O731K998j3159m775O326K831K977n66k689o925j2383M227L126
$$ y = [141416, 162123, 184143, 221128, 270080, 331603, 391117, 486188, 614997, 741873, 875770, 1003281, 1095264, 1146813, 1172005, 1152599, 1082185, 980036, 895334, 805672, 712432, 642045, 568697, 506850, 447144, 397495, 365179, 345701, 319966, 294827, 269513, 257082, 235791, 212473, 197286, 181101, 169413, 153522, 141668, 135771, 133483, 128123, 117597, 113579, 100204, 93272, 87549, 94147, 98426, 97292, 95561, 90872, 98008, 103006, 87214, 90655, 94156, 83099, 66801, 65147, 79854, 95383, 92799, 80598, 66939, 62415, 63369, 52737, 59188, 64362, 71033, 83454, 84808, 80363, 66491, 54070, 50650, 50523, 46169, 27795, 24261, 27223, 37636, 42844, 54080, 55371, 61721, 68452, 71450, 58291, 53516, 59842, 62673, 65650, 65084, 62395, 55470, 43087, 47314, 50440]
12954E0440Q775l156n321j1751m618O594m445K531J0327J1047R365K752m297l82
12940F7861Q222k78K639P16q979Q46R09P025K074Q892j8544k3790k569O033j658
12925D9399j100N269o279Q524K915j136j3874P390J8914P782j0614r555j0100
12912D7535L262J2127N901m825n297j3489K261J3376J0615l766j56k570j2012
12899E2962O785o620l577K0294J008R959j5228r971k51l899Q717J4144r88O836
12885H0171J6985K073k802r00j59J748p043q107K024l151Q235K4912J1830J7530
12871A43346K1148J4395P841J505l264n965j9967j7370l337K142j6702j2244l364
12858A08164M82q271j4017n892l065J5176N728M142q233J2445J0043j1579m532
$$ y = [50440, 59215, 56059, 50738, 38987, 34369, 40963, 36518, 39049, 49376, 60423, 69788, 72540, 68243, 67861, 76083, 75805, 78444, 79160, 70181, 71027, 71936, 78961, 81035, 89927, 71383, 47593, 45024, 51057, 49399, 48299, 53568, 47289, 55813, 58728, 57592, 43718, 51108, 70022, 77804, 67190, 57635, 47535, 50797, 62924, 68825, 64000, 58703, 45214, 47475, 60851, 71466, 67700, 67544, 64974, 52962, 59747, 53127, 49550, 69844, 70852, 80811, 65583, 55612, 55361, 51462, 60179, 74323, 73335, 80171, 97156, 99229, 96427, 95527, 95368, 97116, 90073, 81966, 83990, 80839, 89074, 113986, 125816, 143346, 164494, 178889, 186730, 188235, 184971, 179006, 159039, 141669, 138332, 140474, 123772, 111528, 108164, 108646, 100375, 86358, 80466, 77401, 92577, 98305, 102447, 94214, 106659, 116702, 105123, 100591]
12845A00591k025O157m692p269j1792o588K13l995l418q771J289J9551P381R380
12831I6012O713p065r017j2642o195J2157J6674L704j1811Q964N556j855o021
12818I5174l34o847J6262M851k459j1510j6729l2176l9848o4946q0801o6206n7535
12805b63104l4799k0246r968P713K4099L0473L0611K5228L6495L0218J8752J2970
12793a11558K4006L0128K0025O197o091N328J7726J396J5706L990M95N437J732
12780A4517p389j0131p646K689M779J1476K5686J1331p816p510M686j678J381
12767C4375K821M046n531J783K0276M616J2218J9579J319k232K35J5906J1907
12754A21318J9049J0610K701M256K970K1988J9806R742K1897J5998L2686L2915
$$ y = [100591, 98566, 104723, 100031, 92762, 80970, 74382, 74595, 70600, 67182, 58411, 59700, 79251, 86632, 96012, 102725, 95660, 86643, 74001, 67806, 79963, 96637, 100341, 88530, 97494, 103050, 101195, 95174, 94840, 87993, 104255, 109106, 106647, 95137, 78408, 46232, 6384, -58562, -139363, -205569, -263104, -297903, -318149, -328117, -320404, -296305, -265832, -235221, -209993, -173498, -143280, -124528, -111558, -87552, -57424, -37399, -31202, -37293, -31965, -14239, -12843, 2863, 6853, 7348, 12785, 14517, 7128, -3003, -10649, -7960, -3181, 8295, 33981, 45312, 37496, 29986, 34672, 32994, 34375, 37196, 41242, 35711, 37494, 57770, 62386, 74604, 94183, 95502, 93270, 93505, 109411, 121318, 140367, 150977, 153678, 157934, 160904, 182892, 202698, 212440, 234337, 250335, 283021, 315936]
12742C15936K5487J0221J8398K0255J2585j367M823J8901J5040L465M043J3242
12730D61029p338J3151J8677Q326j2158k096J7324K2342K8247J4166K7056M3769
12718F32495L7849N3441N6359P7383O5701P8823J01369J16805J59188J87797J80438
12707A747648J92165K04753J81930J39208Q8678J8526l7896q6314j02577j19236
12697B226885j60612j40602j19302r6762r5932p3097n3326m9380m0031l4303l3324
12686A330214k1722o002k8428j8414l899n81j0885r64M751J2546P162k73q711
12673A254794L535J9828L3435M3886L1779L4577M4313M6436L6628M5756P0104
12662A665071O0795P1216N3105N8554Q0455P4464R0878R0842R6465R0105J09502
$$ y = [315936, 341423, 351644, 370042, 390297, 402882, 401515, 406338, 425239, 440279, 443744, 447787, 461029, 453691, 466842, 485519, 493845, 481687, 479591, 496915, 519257, 547504, 561670, 588726, 632495, 670344, 723785, 780144, 857527, 923228, 1002051, 1103420, 1220225, 1379413, 1567210, 1747648, 1939813, 2144566, 2326496, 2465704, 2554382, 2572908, 2535012, 2448698, 2346121, 2226885, 2066273, 1925671, 1806369, 1709607, 1613675, 1540578, 1487252, 1437872, 1397841, 1363538, 1330214, 1308492, 1302490, 1274062, 1255648, 1251749, 1251168, 1240283, 1239319, 1244070, 1256616, 1263778, 1263505, 1254794, 1258329, 1278157, 1311592, 1355478, 1387257, 1421834, 1466147, 1512583, 1549211, 1594967, 1665071, 1725866, 1797082, 1850187, 1908741, 1989196, 2063660, 2154538, 2245380, 2341845, 2431950, 2541452]
12651B541452J43791J56746J57314J84026K17404K33200K47759K94619L41056
12642D517367L75505M17389M81873N69570O96401Q49389J032731J220174J439589
12633A1599988J631572J830077K032308K275598K603993L116930L920682N197587
12625C4208735P141493R978068J3779278J8239848K2518294K5609558K6493411
12618A57968685K4571629J9850511J2985218M848029l482580j0911940j6504484
12611A89325068j9563754j9962753j8388014j5825483j3160771j0895674r093461
12604H2435158p672168o576953n755255n133013m631025m199862l794456l406697
12596D1265729l064128k735814k450778k160003j932275j714767j555462j391006
$$ y = [2541452, 2685243, 2841989, 2999303, 3183329, 3400733, 3633933, 3881692, 4176311, 4517367, 4892872, 5310261, 5792134, 6361704, 7058105, 7907494, 8940225, 10160399, 11599988, 13231560, 15061637, 17093945, 19369543, 21973536, 25090466, 29011148, 34208735, 41350228, 51328296, 65107574, 83347422, 105865716, 131475274, 157968685, 182540314, 202390825, 215376043, 220224072, 216741492, 205829552, 189325068, 169761314, 149798561, 131410547, 115585064, 102424293, 91528619, 82435158, 74762990, 68186037, 62430782, 57297769, 52666744, 48466882, 44672426, 41265729, 38201601, 35465787, 33015009, 30855006, 28922731, 27207964, 25652502, 24261496]
12588B4261496j266390j162895j066568r88130r19600q55662p93291p43217p00838
12579A5764905o43221o05093n67860n23297m98393m55886m44300m15132l80776
12570A1230947l53420l41129l23243k96342k72759k60932k39193k24170k07517
12561H712242k21621k00653j89819j92497j73172j75844j52791j58440j42183
12552G105222j43052j35973j15421j17634j06417r8169q4339q8749r2235r5834
12542F027399q4690p9515q0226r6754j15146j32090j46703j47930j41796j46873
12532D855676j48925j37798j30870j27680j22253j13005r5979j04029j05783r2123
12522C677231p5359o3448n1973k4900j5820J3331J7809P569L516l221l0668p0681
$$ y = [24261496, 22995106, 21832211, 20765643, 19777513, 18857913, 18002251, 17208960, 16465743, 15764905, 15121684, 14516591, 13948731, 13425434, 12927041, 12471155, 12026855, 11611723, 11230947, 10877527, 10536398, 10213155, 9916813, 9644054, 9383122, 9143929, 8919759, 8712242, 8490621, 8289968, 8100149, 7907652, 7734480, 7558636, 7405845, 7247405, 7105222, 6962170, 6826197, 6710776, 6593142, 6486725, 6388556, 6304217, 6215468, 6123233, 6027399, 5942709, 5863194, 5782968, 5686214, 5571068, 5438978, 5292275, 5144345, 5002549, 4855676, 4706751, 4568953, 4438083, 4310403, 4188150, 4075145, 3979166, 3875137, 3769354, 3677231, 3601872, 3538424, 3486451, 3461551, 3445731, 3459062, 3476871, 3484440, 3487956, 3484735, 3454067, 3383386]
12510C383386r4797j04772j10118j31843j35913j13244j06837j05176r2135p6666
12500B311885o4723p0235p5909o7417o7219n4601m7763l4954m1508j8215j0162
12489A759179l1575k5186k1182l1951m0698l5822j2848j8634l6351p349j8062
12478A479521l3965m0270l1707j4079l6317k5913l1025m2426m0679l8291l4033
12467A110816l3897l3708m5847l0211k2376n0008m7197k3733k9155l1206n643
12456G57835k0666l9461j7375j3747j4513k4412p691n54J413j6515j8081k3546
12444E62687l928n706J027J7793O379j3515q93J1053J8718J3496K2484K9378M8480
12431G07453M4004L7180N5054K5375P162j7380m6023m3770m2364l8192l2862l3057
$$ y = [3383386, 3288589, 3183817, 3073699, 2941856, 2805943, 2692699, 2585862, 2480686, 2388551, 2311885, 2247162, 2176927, 2101018, 2033601, 1966382, 1911781, 1864018, 1829064, 1787556, 1769341, 1759179, 1727604, 1702418, 1681236, 1649285, 1608587, 1572765, 1559917, 1541283, 1504932, 1497583, 1479521, 1445556, 1405286, 1373579, 1359500, 1323183, 1297270, 1266245, 1223819, 1183140, 1144849, 1110816, 1076919, 1043211, 997364, 967153, 944777, 894769, 847572, 823839, 794684, 763478, 757835, 737169, 697708, 680333, 666586, 652073, 627661, 619970, 619416, 620829, 604314, 586233, 562687, 558759, 553053, 554080, 571873, 578252, 564737, 563844, 574897, 593615, 607111, 629595, 658973, 707453, 751457, 788637, 843691, 869066, 876228, 858848, 812825, 769055, 726691, 688499, 655637, 622580]
12419F22580l2096k8700q66N351P886K2633J4083J9743K3078N5485N2931O6326
12407H28434R7524J27715J39044J55795J46492J49223J27323R7414M6612J4016
12397A929592l6447p8571r9650j19455j20057j19764j11794j01694r1837o1886
12387I88437o6716o4359m1463m7901l1572j7281l4864m2170l6965j8048l249m782
12375E79067j6943j1818j9376r087j1928j5211j8389j2439n531o901k0665q366
12363D22413m721j9712k7110j274n422j0700p467j8197r879k481p507m397n754
12350B97792J484r788n280j2104j6171K552O039N838L38p66o849j3498m96l249
12336B45842N89m138r602q366Q943j640J625k778K312J1856J4769Q690j239O788
$$ y = [622580, 590484, 561784, 560918, 566269, 574155, 596788, 610871, 630614, 653692, 709177, 762108, 828434, 925958, 1053673, 1192717, 1348512, 1495004, 1644227, 1771550, 1868964, 1915576, 1929592, 1893145, 1814574, 1714924, 1595469, 1475412, 1355648, 1243854, 1142160, 1050323, 988437, 921721, 857362, 815899, 767998, 736426, 719145, 684281, 642111, 605146, 587098, 583849, 579067, 562124, 550306, 530930, 521843, 509915, 494704, 476315, 463876, 458345, 451444, 430779, 422413, 417692, 397980, 370870, 369596, 364174, 353474, 346007, 327810, 317931, 315450, 307943, 303546, 297792, 299276, 289488, 284208, 272104, 255933, 258485, 264524, 270362, 270700, 269934, 263085, 249587, 249091, 245842, 246431, 242293, 232691, 224325, 233268, 231628, 233253, 230475, 232787, 244643, 259412, 268102, 266863, 273651]
12322B73651J1488j1712k1012r968j5307n470m372j3815q58O926k3064j7053p637
12309A61797p054K435M00j2613j3003m382j6241m79M024j8358j5088Q82p016M133
12295G9437m716j007O703l463L244k534l113k874r409k502K56J0819Q67j809J247
12280G1146l469p171j704L541J589K0121m676N008J1141j17j2342P481K733j0731
12266H2550J31O20Q71J1808K424l815j1987o893o22Q626m799o927J1135k425j8003
12251F2694o051k172j2702m729Q85R947R866O082q090R990Q732M605j0056p584
12237F1417K1945K689k152J2036m673R383l26q682K237O786q116j0406R860k517
12223H9481K771J246P47j1070o557l30j0156L091J958N161L351r150q298J7410
$$ y = [273651, 285139, 273427, 252415, 242447, 227140, 221670, 217298, 203483, 202625, 209551, 186487, 169434, 161797, 154743, 157178, 157578, 144965, 131962, 127580, 111339, 110860, 114884, 96526, 81438, 82320, 75304, 79437, 74721, 73714, 80417, 76954, 80198, 77664, 74551, 71677, 62268, 59766, 60022, 70841, 71708, 69899, 71146, 67677, 60506, 58802, 62343, 63932, 84053, 79377, 84385, 95526, 95409, 83067, 90548, 93281, 82550, 82681, 83301, 84172, 95980, 98404, 94589, 82602, 75709, 75087, 83713, 78914, 71987, 83122, 80697, 62694, 56643, 54471, 41769, 37040, 37925, 47872, 57738, 63820, 55730, 65720, 74452, 79057, 69001, 61417, 83362, 86051, 83899, 95935, 91262, 100645, 100319, 91637, 93874, 100660, 92544, 82138, 91998, 89481, 92252, 93498, 94245, 83175, 76618, 76288, 66132, 69223, 71181, 76342, 79693, 70543, 62245, 79655]
12209G9655J2631j296L042M668K353j856Q227N926J5255J9848N554J2422J1995
12196A78424J0825J8610M9169N1572N6258P8504R3422J09217J48005J37309J19476
12185A050791Q6081M1764j1359k3572n4894r9775j12711j09914r3196o1540n0932
12174E60743m8596m9638l5266m1875k7536k3395k3742j9112j9452j3816J269p690
12162B51894j9505r826j6237j6273j8329p571N238Q686J2677J2732m778j2964
12150A85744K448j7521k387L768K705J7484J0336R372J3712K4481J2597J0824
12138B73563L6303N3440N7449R8708J39943J69709K09869K36868K49202K45017
12128A770071K08309J45233N9916k7681j00924j49407j83122k11570j97561j56614
$$ y = [79655, 92286, 90990, 94032, 98700, 101053, 99197, 107424, 113350, 128605, 148453, 154007, 166429, 178424, 189249, 207859, 257028, 308600, 364858, 443362, 536784, 646001, 794006, 931315, 1050791, 1136872, 1178636, 1167277, 1143705, 1088811, 989036, 876325, 766411, 673215, 611675, 560743, 512147, 462509, 427243, 385368, 357832, 334437, 310695, 291583, 272131, 258315, 259584, 251894, 232389, 222563, 206326, 190053, 171724, 164153, 169391, 178077, 190754, 203486, 198708, 185744, 188192, 170671, 168284, 172052, 174757, 192241, 202577, 211949, 225661, 250142, 262739, 273563, 309866, 363306, 420755, 519463, 659406, 829115, 1038984, 1275852, 1525054, 1770071, 1978380, 2123613, 2183529, 2155848, 2054924, 1905517, 1722395, 1510825, 1313264, 1156650]
12118A156650j24547j11615q4556q3025p1569o4988o7027o5818l6069j6900k1320
12107D09216k2295l7231j4485j9911j3336k4751l0329k4217K935j3274n479o390
12095B00453l078R46k0501j5287l676K395p65K383R32j5445j5329k0068n534o44
12081A06782j164p053L587p816R902J1227l396j1980l12J1214k4333j657k810
12068H2191K579p546j1417k449n60L106l085q20p573M532J0626J0157Q154J037
12054H8932j5585m986n989k153R409p63j1957K786Q145o406k0893r408K485M438
12040C8055N36O405J0667r213q642j4914P461N455p163j1973R04J7527L171k106
12026C6170P592p211n684j0946j3126P590K1455P875j017O569L655m04k0850j4747
$$ y = [1156650, 1032103, 920488, 835932, 752907, 681338, 616350, 549323, 483505, 447436, 430536, 409216, 386921, 349690, 335205, 315294, 301958, 277207, 246878, 222661, 225596, 212322, 206843, 200453, 197375, 198321, 177820, 162533, 158857, 161252, 160487, 162870, 163802, 148357, 133028, 112960, 107426, 106782, 105618, 98565, 102152, 94336, 104238, 115465, 112069, 100089, 99777, 110991, 86658, 85001, 82191, 84770, 77224, 65807, 63358, 62798, 65904, 62819, 61999, 54426, 58958, 69584, 79741, 87895, 88932, 73347, 68361, 62372, 60219, 69628, 68865, 56908, 59694, 67839, 61433, 40540, 31132, 33617, 38055, 38591, 44996, 55663, 46450, 37808, 22894, 30355, 35810, 28647, 16674, 17578, 35105, 38276, 36170, 43762, 36551, 30867, 19921, 6795, 14385, 35840, 43715, 42698, 49267, 52922, 52518, 31668, 16921]
12012A6921J0135J7081K814K491n676O362l075m661O662p034j2654l934o169R07
11998B0170j925J3778m48M284J5766j260j6538j8144K81P55N117Q199j914o278
11984B1843P170K4722J1834k4131j3674k139j1609q425j0243J2283Q107N443l352
11971A7829R866r34L911N376n446l626j1079K315p218j2309k097N642j293Q991
11957I928r902l666R044O763K95j547j2073q584N211P33L797Q485N706J480q241
11942G429j4914P71L955M295q850j0641m092j0453R005K0731P93m519K20m189
11928a0459q07j1744J691P157K026J7260Q395n195j1661M404r278J611R798J32
11914C330n427j1400j6014k004K398J4850K8050r298p633L381J3047n635j0102
$$ y = [16921, 27056, 44137, 46951, 49442, 43766, 50128, 47053, 42392, 49054, 42020, 29366, 25432, 19263, 20170, 18245, 32023, 31575, 35859, 51625, 50365, 33827, 15683, 15964, 16719, 21836, 30035, 28121, 21843, 29013, 53735, 65569, 41438, 27764, 25625, 14016, 5591, -4652, 7631, 15738, 21181, 17829, 27695, 26761, 30672, 36048, 30602, 26976, 15897, 18212, 10994, -1315, -3412, 2230, 937, 9928, 26, -3640, 5404, 12167, 12462, 10915, -1158, -9742, -4531, -3798, -1, 8484, 14190, 15670, 7429, -7485, -6714, -2759, 1536, -7314, -17955, -22047, -32500, -23495, -2764, -1971, -6490, -6270, -10459, -11266, -23010, -21319, -14162, -12136, 5124, 13519, 8324, -3337, 1067, -8211, -6600, 3198, 3330, -2097, -13497, -29511, -31515, -29117, -14267, 13783, 4485, -3148, 233, 13280, 7645, -2457]
11901b457j1881j85K035l176O4K455N240m301p03J1586N633k100p455n885p053
11886a8183j461K374M77J5461J1462j936l11j417p686o618L383K372M438L321
11872E676R16o971Q929J1621J650P06j1284p928J787Q39L758j2609p5j824o002
11857a0811j4609J335L392J7901L571J1123q412j4597N533K439k33p119j643J1671
11843d59R154m006m80p02q004r7j354j2098M996L573L07N84Q632k855q106j709
11827a2624O06L024J0400M400j2490K656J6381P593p32j517j1049N508j4317l522
11813e683l981N418j730R253j969p978M915k323j904o54L38O708j563j0185m383
11798a5721j749J1087M743j0355q441k458l934O897Q254J0770P248J1851l733
$$ y = [-2457, -14338, -14523, -12488, -15664, -15600, -13145, -7905, -12206, -12909, -1323, 4310, 2210, -5245, -11130, -18183, -19644, -17270, -16793, -1332, 10130, 8194, 7883, 6466, -1220, -7838, -4455, -2083, 2355, 5676, 6592, -379, 8550, 20171, 21821, 22527, 11243, 3315, 5102, 5941, 9699, -2910, -2985, -4809, -10811, -25420, -24085, -20693, -2792, 779, 11902, 3490, -11107, -5574, -3135, -3368, -10487, -12130, -459, 8695, 4689, 4209, 3507, -4497, -4594, -5948, -18046, -13050, -9477, -9170, -8586, 46, -2809, -10915, -12624, -12018, -8994, 1406, 5806, -6684, -4028, 12353, 19946, 19214, 17697, 6648, 12156, -2161, -5683, -9664, -4246, -5976, 3277, 1308, -6670, -1755, -4078, -5982, -6636, -6298, 410, -1153, -11338, -15721, -17470, -6383, -1640, -11995, -20436, -22894, -26828, -19931, -11677, -907, 6341, 18192, 14459]
11785A4459j4835j2828k029l927M571K712k660mP220m23J385N409O474q764j6524
11770a9764j938p927N106J5653J100q20M710m18Q807Q014N021j3052J889k53M224
11755A0352R049j5896j872J021j0226L289n675M919k849K689R857P5O60k370p334
11740d311j6909j347j299J933J1377J5394J2440P325M594n024r429J042n490q634
11726A662j5645k812J1715l483K305r44o344j1066J0345J0891L711R307q633k172
11712a163O833j6923K467M107n97O236N135L137R379j866k907O51p910N193k107
11697I665K185J5074p47n537j20j2870p047J0366r224j3119l178K382J0573N175
11683C578N404j2981j8751L803J3036M159j1916j0181l037J049J8446J648q3k49
$$ y = [14459, -376, -13204, -15233, -19160, -14589, -11877, -14537, -14541, -7321, -7744, -6359, -950, 5524, -3240, -19764, -21702, -29629, -24523, -8870, -7770, -8590, -3880, -4298, 4509, 12523, 17544, 4492, 6381, 6128, 10352, 19401, 3505, 1633, 2654, -7572, -4283, -9958, -5039, -7888, -5199, 4658, 4733, 5393, 3023, -4311, -21220, -22567, -23866, -21933, -10556, 4838, 17278, 24603, 29197, 24173, 14744, 15786, 10296, 1662, -13983, -16795, -5080, -8563, -6258, -7202, -13546, -24612, -14267, -3376, 335, 9642, 1009, -1163, 5670, -11253, -8786, -4679, -5276, 960, 6095, 9232, 18611, 16745, 13838, 14489, 6579, 11772, 9665, 11850, 26924, 26177, 20640, 20520, 7650, 603, 10969, 1745, -11374, -14552, -12170, -1597, 3578, 8982, -3999, -22750, -18947, -5911, -1752, -13668, -23849, -26886, -25837, -7391, -5743, -5826, -6075]
11669f075n887K268L6R006J0577o70k302q814j0690n567J2738j714M387N664j2337
11654i380k1615q674J2473R725L44J0471N195J0454P399L676p703k314j175j2087
11640c211R481R981p640L152j0137o256n491N35Q734J2552J7153Q221n428j1834
11626A9812p761n486j3135l208J6830O309o02r477n181m318J0330J394o548K432
11612A391M361P35j8328k765J0083M135O080j6831l763m9J903J3771O808j6369
11598h838m893J090K757J107n925K165R232Q112N05p167p286j6501k687L596R701
11583a5032J920J5212M596o845j0987l248Q899P873j145q366j713J7512J0320
11570A8996j1012J3048p242j9023j530q24p751J3513O107r063N417M24k972m382
$$ y = [-6075, -11962, -9694, -9658, -652, 9925, 9255, 6953, -1861, -12551, -18118, -5380, -7094, -2707, 2957, -9380, -30995, -39669, -27196, -17471, -17127, -6656, -1461, 8993, 16392, 20068, 12365, 10051, 8876, -3211, 6270, 16251, 8611, 11763, 1626, -4630, -10121, -9586, -852, 11700, 28853, 37074, 31646, 19812, 12051, 6565, -6570, -9778, 7052, 13361, 12759, 3282, -1899, -6217, 4113, 5507, -1041, 1391, 5752, 6487, -11841, -14606, -4523, -388, 5692, -11139, -14902, -14951, -13048, 723, 7531, -8838, -13731, -12641, -9884, -8777, -14702, -12537, -3305, 4807, 5312, -1855, -9141, -25642, -28329, -24733, -15032, -13112, 2100, 6696, -149, -11136, -14384, -5485, 2388, 1243, -7123, -8836, 8676, 18996, 7984, 21032, 13790, -5233, -6763, -7587, -15338, -1825, 4282, -4781, 636, 1060, -1912, -6294]
11556f294M738L088k983P652j0906n549L847M003l835M951J0958p606J011N102
11542H177O277j793N230J01j2339k3354n774j07k998Q134J0231q644m894K2097
11528C44N42j7596n011J979P631j617j2477R465q039L105J0032q529J1310J3344
11514D483q108j4819p628O828J6544J0747P550j8148M557J766O789n740O661J9522
11500C1004k049q634M786p174l169o443L833R76q71l845q467N18m321k703O371
11485a88R641N810o239j1619j2710J2307Q319k154o440n124r004P786K4899J7956
11471C3240J0213p644j3383K403P298p295j0288P363O724p341p076J594q214L120
11457A0714L096J2069L183J2218K5716R580R816O543K1243J0530J1563K1618L7368
$$ y = [-6294, -1556, 1532, -1451, 6201, -4705, -10254, -6407, -2404, -6239, -1288, 9670, 2064, 3075, 8177, 14454, 12661, 17891, 17992, 5653, -17701, -23475, -23582, -26580, -18446, -8215, -16859, -21753, 344, 886, -16710, -21721, -19742, -12111, -13728, -26205, -16740, -24779, -21674, -11642, -20171, -8861, 4483, -3625, -18444, -26072, -19244, -2700, 8047, 15597, -2551, 2006, 3772, 10561, 4821, 11482, 31004, 28955, 20321, 25107, 17933, 14764, 8321, 12154, 13130, 12259, 8414, -53, 465, -3856, -6559, -188, 9453, 15263, 9024, -2595, -15305, -2998, 5321, 3167, -3273, -8397, -17401, -9615, 15284, 33240, 43453, 35809, 22426, 24829, 32127, 24832, 14544, 21907, 28631, 21290, 14214, 15808, 7594, 10714, 13810, 25879, 29062, 41280, 66996, 76576, 86392, 92935, 114178, 124708, 136271, 157889, 195257]
11444A95257M2950N8205O2101J04101J41712J60423J50545P3478K915n8593r2619
11433H40475j09155j01104r1252n7638m3364m0327l8742m7805k2493j3872j9023
11422B55700k1535j5333j7071k1521n985n716j1966j7914j0648j425l098q457
11410A15031m835j4599r250p044m637O85R782k821r580j2832j1083J297M747l068
11396E1793o592r678j3101j468O263r207j821J0496l329j0133j2155k233Q407
11383G242l158j6080L143J167J2153R31l861k384l312N809J0500j79Q991R676
11369C0638j5894o530L973J8511k230j1170n3j316M11j0514l076J281N817K766
11355A2614l163r89J960P545j466r97N803j0495N111N192R457m3K58N350n280
$$ y = [195257, 238207, 296412, 358513, 462614, 604326, 764749, 915294, 988772, 991687, 933094, 840475, 731320, 630216, 538964, 481326, 437962, 397635, 358893, 311088, 288595, 274723, 255700, 234165, 218832, 201761, 180240, 174255, 168539, 156573, 138659, 128011, 126586, 123488, 115031, 110196, 95597, 86347, 79303, 74666, 75351, 85133, 82312, 72732, 59900, 48817, 50114, 54861, 51793, 45201, 35523, 22422, 20954, 27217, 18010, 16189, 26685, 23356, 13223, 1068, -1165, 7242, 4084, -11996, -8853, -7686, 4467, 5398, 1537, -847, -4159, 1650, 12150, 11971, 20962, 30638, 14744, 8214, 12187, 30698, 28468, 17298, 17245, 15929, 16340, 5826, 2750, 4031, 9848, 12614, 9451, 8462, 10422, 17967, 16501, 15504, 21307, 10812, 15923, 21115, 30572, 30529, 30787, 36137, 30857]
11340C0857M855q615r818j3603O537J2584L615j0200j9018j391M906L021Q190
11327A1920j195q923j364j3906o466J2783P603p169m31M886Q266K169Q279J3663
11313C0115j860o290K811o093P942N724o794N670J787j583n870J346L552o246
11299B4211j4052M148J362k112O045j2181j7080j3052O486K0354J5393q702m78
11286A0342J2622n13R921M063o091k1695j0764J7344q659K16O549Q389J582o330
11272A6976P093O676n111K647O815R95L900j8379j4899N568J957J5599Q11n507
11258B5141O275J1355Q400K2839J7905J1030L583p516l1353j7838j107j7684j2780
11245A8250O24J5182P312N90r960k428K693J0489j0407q528j3505n463m738j5023
$$ y = [30857, 35712, 27097, 17279, 3676, 10213, 22797, 26412, 16212, -2806, -4197, 709, 3730, 11920, 10725, 1802, 438, -13468, -19934, -7151, 452, -6717, -7148, -2262, 6004, 8173, 16452, 30115, 28255, 21965, 24776, 18683, 26625, 32349, 25555, 31225, 33012, 31429, 25559, 26905, 30457, 24211, 10159, 14307, 15669, 13557, 19602, 7421, -9659, -22711, -16225, 4129, 19522, 10820, 10342, 22964, 22451, 32372, 36435, 30344, 8649, -2115, 15229, 6570, 6786, 13335, 21724, 23306, 16976, 24069, 30745, 25634, 28281, 35096, 36091, 39991, 21612, 6713, 12281, 14238, 29837, 30648, 25141, 31416, 42771, 51171, 74010, 91915, 102945, 106528, 99012, 67659, 49821, 48714, 31030, 18250, 18874, 34056, 41368, 41958, 31998, 29570, 32263, 42752, 32345, 23817, 10312, 4849, 111, -14912]
11231a4912P411J4330j652r054N355J0524J5037L078r105l318k025j6580J385
11218D74J0050J105J5026J4358J235M012m184M253o529l864O989k875n772O256
11204D0534L707j7506l232K7367Q116p267N581m406j4240J2865m931O301k610
11191E0279r136j0309J0315m499N83L050M23j0068j797o19j0291O657O676J0427
11177D1691J7750M970o564P790N138j4714n019P36J137p522r289M216J7467l986
11163E3801j0237N745K514n883K4875J1010r658K129K597K9j8463n43R797l322
11149F4391j1175O661O80p388K559n029L357J6808Q557j0691O705N667q783j186
11135G1133N056L054j3114j1056j596j267n286p924j282J3914Q123L81O440J0602
$$ y = [-14912, -7501, 6829, 5177, -3877, 1478, 12002, 27039, 30117, 21012, 17694, 15669, -911, 474, 10524, 11629, 26655, 41013, 42248, 46260, 42076, 46329, 39800, 35936, 42925, 40050, 34278, 40534, 44241, 26735, 23503, 50870, 58986, 51719, 57300, 52894, 38654, 51519, 46588, 52889, 50279, 41143, 30834, 41149, 36650, 37233, 40283, 40706, 30638, 28841, 28222, 17931, 24588, 31264, 41691, 59441, 64411, 57847, 65637, 70775, 56061, 51042, 51778, 52915, 45393, 36104, 40320, 57787, 53801, 43564, 49309, 51823, 45940, 70815, 81825, 72167, 74296, 76893, 76922, 58459, 57916, 67713, 64391, 53216, 59877, 60557, 53169, 55728, 50699, 54056, 70864, 79421, 68730, 75435, 81102, 72319, 71133, 76189, 79243, 66129, 55073, 53477, 52210, 46924, 39000, 37718, 51632, 59755, 60136, 66576, 77178]
11121G7178K116r57J883j5286j6479k459J1290q79J8627J3645o496l963k3042
11108E5178k4311R80J8186J2504n05L976J218j7062k2648J0930O956N886j483
11095D9805r260m100k747o754N573J1060K896k102K234q21R761L335k473q339
11081D8068j2927j7198n423L467o973j804l478l67J360K172L153J1576Q208o450
11067B3384k709N216J0414L707j511l309j3896M089K2626J573o192r895l271q377
11053B1849J808l943k762M152P888l661j676o416N055O628N629M178L603J1269
11039E3601j80k914r196q061o314j3644M504O351K872R03O512R490j5303k161
11025B6460j403p537L362J1727N026n06q410P372J3632R248j238j0535j5932r92
$$ y = [77178, 79294, 78337, 80220, 64934, 48455, 45996, 57286, 56407, 75034, 88679, 82183, 78220, 55178, 30867, 31847, 50033, 62537, 62032, 66008, 67226, 50164, 27516, 38446, 45402, 51288, 49805, 40545, 36445, 33698, 26944, 32517, 43577, 46473, 44371, 46605, 45784, 55545, 58880, 56407, 48068, 35141, 17943, 12520, 15987, 9014, 7210, 3732, 3365, 4725, 6897, 10050, 21626, 29834, 23384, 20675, 25891, 36305, 40012, 38501, 35192, 21296, 25385, 48011, 49584, 43392, 33497, 30226, 21849, 23657, 19714, 16952, 21104, 28992, 25331, 23655, 17239, 22294, 28922, 34551, 38729, 42332, 53601, 53421, 50507, 41311, 33250, 26936, 13292, 17796, 24147, 27019, 27922, 34434, 43924, 28621, 26460, 25057, 17520, 20882, 32609, 37635, 37129, 28719, 36091, 49723, 58971, 57733, 47198, 31266, 30274]
11011C0274m69j180j835J1896l982J274J7685K0194M176j2474k4500j2839J601
10998B9821J2525O061P46J1195o793o445m224j1377j5092J4400L550k380o888
10985B5099J726J2658p564M43P419j4568m138J0707J991m781K875O570R95j1285
10971B8147j941P785O156k23L059j049j046m243K729K0831Q429P932R960q164
10957G8362m806o114j1002J2312J1711K519M5j5962K159K426N319O655K543J379
10943H7546r64o898P779J2209R699p830j878j5458j4283k9O293J3680M876p832
10929H6910j073Q651J3772J3528M610L207N811P497j928J6210K7058K3982K4153
10916B32388J0716J692L293R57O690J1248K0705K0949Q779K7793M7039L9131M3979
$$ y = [30274, 29805, 28625, 26790, 38686, 34704, 35978, 53663, 73857, 78033, 65559, 41059, 28220, 29821, 42346, 48407, 49153, 60348, 53555, 47110, 42886, 31509, 16417, 30817, 34367, 31987, 25099, 26825, 39483, 31919, 32362, 39781, 25213, 21075, 31782, 33773, 28992, 31867, 38437, 39432, 28147, 26206, 33991, 40147, 39924, 42983, 41934, 40888, 36645, 39374, 60205, 68634, 76566, 86526, 78362, 73556, 67442, 56440, 68752, 80463, 82982, 83027, 67065, 69224, 71650, 76969, 83624, 86167, 87546, 86582, 79684, 87463, 99672, 109371, 101541, 99663, 84205, 69922, 69893, 76186, 89866, 94742, 86910, 85837, 94488, 108260, 121788, 126398, 129605, 135416, 142913, 140985, 157195, 184253, 208235, 232388, 243104, 244796, 248089, 249046, 255736, 266984, 287689, 308638, 317417, 345210, 392249, 431380, 475359]
10903D75359O4432Q5388R6359Q4777R3208J37444K05506L13032M87010P55556
10893B798071J218460J954019K727733K550542Q71389j146623j987803j685946
10885G299842j156725q34556o63976n18807l38980j97903j15340k2292Q3121J92423
10875C726807J79845K3669k05082l47840l78127l30197k79515k44505k03476j64163
10865A777416j36495j22024j09480j05771r5240p6253p1989o5467m3792l1593
10855I19312l7916m2081m7502l0156l8681l6511l0601j9783o699k3680l0558k7490
10843E47654j5572k624j5775j1822j5907k1969j3532j6708j8604j3302o022L611
10831C99428j8025q686p400m444m657n644M191O106O833J0631L628J5010J7416
$$ y = [475359, 539791, 625179, 721538, 806315, 899523, 1036967, 1242473, 1555505, 2042515, 2798071, 4016531, 5970550, 8698283, 11248825, 12120214, 10973591, 8985788, 7299842, 6143117, 5308561, 4644585, 4125778, 3786798, 3588895, 3473555, 3451263, 3534384, 3726807, 3906652, 3930321, 3725239, 3377399, 2999272, 2669075, 2389560, 2145055, 1941579, 1777416, 1640921, 1518897, 1409417, 1303646, 1208406, 1132153, 1060164, 994697, 950905, 919312, 881396, 839315, 791813, 761657, 722976, 686465, 655864, 636081, 629382, 605702, 575144, 547654, 532082, 529458, 513683, 501861, 485954, 463985, 450453, 433745, 415141, 401839, 395817, 399428, 381403, 372717, 365317, 360873, 356216, 350572, 354763, 360869, 367702, 378333, 381961, 396971, 414387]
10818D14387J4244M89j7409k1307j4462j7370j1955j6085j8889j1142j5144j0979
10806B74378K073J045q652m943j3607j5195n33k4837j2746N120J1970M573j8532
10793B00114M062P684r585j658m641j0570j6966m218p929m194J7540P091j389
10780A75341M199j382n054r60P945K541O286R954q836k5003n626J175J1261m288
10766A67553j0127K012l482j3139p025q385o681M385O972L687n218O747J0253
10753A47552N623O798j0693j746J6958J0857J0093p205j9171j4133j287j0232
10741A33414Q25O869J1169O140j2656j9801m626J3661J059j0608j3314M940N497
10728A22569Q314R978O625J2531M472j614J2807L630L751o078n84R02J169J8067
$$ y = [414387, 428631, 429120, 411711, 390404, 375942, 358572, 346617, 330532, 311643, 300501, 285357, 274378, 276451, 277496, 268844, 263901, 250294, 235099, 234566, 209729, 196983, 202103, 214073, 218646, 200114, 204176, 211860, 202275, 200617, 195976, 185406, 168440, 164222, 156293, 152099, 169639, 176730, 175341, 179540, 178158, 173104, 172144, 180089, 182630, 188916, 198870, 190034, 165031, 159405, 160580, 171841, 167553, 157426, 159438, 155956, 142817, 135792, 127407, 120726, 125111, 132083, 135770, 130552, 137299, 147552, 153175, 159973, 149280, 147534, 164492, 175349, 185442, 178237, 159066, 144933, 143646, 133414, 134239, 141108, 152277, 158417, 145761, 125960, 121334, 134995, 136054, 125446, 112132, 117072, 122569, 130883, 140861, 147486, 160017, 164489, 162875, 175682, 179312, 183063, 176985, 176401, 177303, 178472, 196539]
10714A96539L2647K5759J4449J8236L1049L0264J5142k3985k2150k3144l1269
10703B63537k2223L368k183j0226j7706l0199j2981q499q214j947j2982r055o41
10690A30049J5335J5575J3813O473P968K230j0538r829k6182k0152o571j4024
10678A04147j3115p734k73J527J3848M312K963J0686op732L82J1632J537j095
10664A21079j2053q369P101J3056O970J1640J2664J4764J5326K6580N589j6994
10652A97353k0588k0789k4282o1716j16457j79032k01734j74547p7181L0023P5607
10641e73343Q4640P2258N9725N3899M8716N7694M1601K3478J1855n671J5410K4474
10629h5264K9143M1688L4168J5861p84j0610j7700o974J6533k887Q558M953J7987
$$ y = [196539, 229186, 254945, 269394, 287630, 318679, 348943, 364085, 340100, 317950, 294806, 263537, 241314, 244682, 242499, 232273, 214567, 184368, 171387, 162888, 154674, 152727, 139745, 130690, 130049, 145384, 160959, 174772, 181245, 189213, 191443, 180905, 171076, 144894, 124742, 118171, 104147, 91032, 83298, 83025, 84552, 98400, 102712, 105675, 116361, 116355, 108623, 109005, 120637, 122174, 121079, 109026, 100657, 107758, 120814, 127784, 139424, 152088, 166852, 182178, 208758, 214347, 197353, 176765, 155976, 131694, 69978, -46479, -225511, -427245, -601792, -678973, -648950, -573343, -488703, -416445, -356720, -302821, -254105, -196411, -154810, -131332, -119477, -125148, -109738, -85264, -56121, -14433, 19735, 35596, 34812, 24202, 6502, -472, 16061, 13174, 21732, 26685, 44672]
10616D4672J3325M215M771M703O261r77p664l570k2207k4270j3407J2172K4905
10603D2929K6346R453J4213K6412K0172J9413K710q2q505M167L699J4041J5800
10590A90768K4157J5475J2935J9768L5258M8079L3372L4694M8156N4012M4243
10579E60917O297k2516k6341q770J5750K4903J2104R27L493j1533r583M10J0230
10566E56288J5565L732j1303k3963k109J3847L6312L6132M3429M0591M2275K7874
10554G78670K1760O557j7362j7310M9K382J7292k47l693R219j972j1760j1921
10541G71664j324J7996L5587L5259J7813K9563M1125L1586L7610N4449N2723N8804
10529A182855L1105M5002N6757P9169J11204J45958J91768K47863L21032L82688
$$ y = [44672, 57997, 62212, 66983, 71686, 77947, 76970, 69306, 65736, 43529, 19259, 5852, 18024, 42929, 69275, 78728, 92941, 119353, 139525, 158938, 161648, 161566, 153061, 157228, 160927, 174968, 190768, 214925, 230400, 243335, 263103, 298361, 346440, 379812, 414506, 462662, 516674, 560917, 567214, 544698, 518357, 509587, 525337, 550240, 562344, 563271, 566764, 555231, 545648, 546058, 556288, 571853, 575585, 564282, 540319, 538210, 552057, 588369, 624501, 667930, 708521, 750796, 778670, 800430, 806987, 789625, 772315, 772364, 774746, 792038, 791791, 788098, 797317, 795345, 783585, 771664, 770340, 788336, 823923, 859182, 876995, 906558, 947683, 979269, 1016879, 1071328, 1124051, 1182855, 1213960, 1258962, 1315719, 1394888, 1506092, 1652050, 1843818, 2091681, 2412713, 2795401]
10519B795401M00751K94236Q8133q6861j50817j32101o2310j5314N4249J60509
10509C345876K77619L68970M80973N85730O01612N04301K86096L594k07609k74500
10499E972662k79065k35531j83995j41622o9385m6360j9378K7801O8150R9690
10489E192967J20837J35492J76565K43449L05714L53022L75329M19049M83125
10480G805549N86375O91592Q30294R82141J187072J398730J543360J554109J572032
10471A8151254J725250K045324K532408L245129M148782N331841O972890R329186
10463E3482064J2817276J8010158K5852656L7643763N4401863P3552190Q2637320
10456C58397290O3129383J5504089l2670581n5198361n2980699m2538451l3929056
$$ y = [2795401, 3196152, 3490388, 3578521, 3491660, 3340843, 3208742, 3146432, 3131118, 3185367, 3345876, 3623495, 3992465, 4473438, 5059168, 5660780, 6165081, 6451177, 6454771, 6247162, 5972662, 5693597, 5458066, 5274071, 5132449, 5063064, 5016704, 4997326, 5025127, 5093277, 5192967, 5313804, 5449296, 5625861, 5869310, 6175024, 6528046, 6903375, 7322424, 7805549, 8391924, 9083516, 9913810, 10895951, 12083023, 13481753, 15025113, 16579222, 18151254, 19876504, 21921828, 24454236, 27699365, 31848147, 37179988, 44152878, 53482064, 66299340, 84309498, 110162154, 147805917, 202207780, 275759970, 358397290, 421526673, 437030762, 404360181, 349161820, 296181121, 253642670, 219713614]
10449B19713614k8178214k3235218j8729884j5451800j3497402j2112974j0735049
10442I7773073r279204p842856o560259n487208m731134m238737l934417l670835
10434E2028423l374621l073192k762657k486645k244599k012110j812128j630550
10426C2631921j464300j382135j351303j305461j210677j101543j016850r29095
10418B2870557q72972q44628q35831p86716p27584o60773n83353n51851n29249
10409A6477600m81291m77275m69266m23208l90827l58401l36378l27104l07328
10400A2906522l02610k81549k87631k90191k78916k51274k43301k40914k30927
10391A0499209k21962k06280j88612j62618j64112j54004j42551j11112r0187
$$ y = [219713614, 191535400, 168300182, 149570298, 134118498, 120621096, 108508122, 97773073, 88493869, 80651013, 74090754, 68603546, 63872412, 59633675, 55699258, 52028423, 48653802, 45580610, 42817953, 40331308, 38086709, 36074599, 34262471, 32631921, 31167621, 29785486, 28434183, 27128722, 25918045, 24816502, 23799652, 22870557, 21997585, 21152957, 20317126, 19530410, 18802826, 18142053, 17558700, 17006849, 16477600, 15996309, 15519034, 15049768, 14626560, 14235733, 13877332, 13540954, 13213850, 12906522, 12603912, 12322363, 12034732, 11744541, 11465625, 11214351, 10971050, 10730136, 10499209, 10277247, 10070967, 9882355, 9719737, 9555625, 9401621, 9259070, 9147958, 9057771]
10382I057771q7737p3150n3505r2186j57822k14636k47600k75663k63318k32813
10372G359341k25056k16474k10227k05887k06166j92919j62935j69154j64410
10363E606113j66860j57068j35795j46802j44610j40571j46273j13575q5339q0208
10353D289012r1268q1579j02868j13044j03709p7862q4021q2683q2870q8657q4830
10342C295621q5468p9515r6588r8258p9708n3137o3762n6981n3858m0049k8863
10331B559434p265J1748N134l1541q1944q5383n9696l3155j4991j6677j5774k2045
10319B207845l5643j6747j6496l4595m9765o0310m9887n1976n3280n2281n2723
10308A734142l7078k0783k2277m3507o4808o2311n1345o2658m6864k9023j3237
$$ y = [9057771, 8970034, 8896884, 8843379, 8751193, 8593371, 8378735, 8131135, 7855472, 7592154, 7359341, 7134285, 6917811, 6707584, 6501697, 6295531, 6102612, 5939677, 5770523, 5606113, 5439253, 5282185, 5146390, 4999588, 4854978, 4714407, 4568134, 4454559, 4369220, 4289012, 4197744, 4116165, 4013297, 3900253, 3796544, 3718682, 3634661, 3551978, 3469108, 3380451, 3295621, 3210153, 3130638, 3034050, 2935792, 2856084, 2802947, 2739185, 2682204, 2628346, 2588297, 2559434, 2552169, 2563917, 2569051, 2537510, 2455566, 2370183, 2310487, 2277332, 2262341, 2245664, 2229890, 2207845, 2172202, 2155455, 2138959, 2104364, 2054599, 1994289, 1944402, 1892426, 1839146, 1786865, 1734142, 1697064, 1676281, 1654004, 1610497, 1545689, 1483378, 1432033, 1369375, 1322511, 1293488, 1280251]
10297A280251l2344l4839m5194m2759j3464j47J9077K0502Q166m909m9689m9219
10285A055432n3051l6280j9234l3709k8240k276o40r348j1877q77j116K0591K6167
10272I05542N7906Q4663J10769J36328J32931Q5100j1957j29623j73699j48821
10262A049139j16324q3537o1517m9706l1156q138o838j6348k9640j3023q603k1351
10250F02958j0000j1195P124K1261j537n321j1206j0217q397M756K1692J4397
10238F14315j3360Q697K6376J9568K4311R94K431j1966K326P915L7Q361K5859
10225G15864M1044K0839K4207K3822L2661M8893O7741P8927J05188J45871K06253
10214A511310L30418M75233P32756J078592J487529J670671J326316M17054n68424
$$ y = [1280251, 1247907, 1213068, 1167874, 1125115, 1111651, 1111504, 1130581, 1151083, 1159249, 1154340, 1104651, 1055432, 1002381, 966101, 946867, 913158, 884918, 882642, 882002, 872654, 860777, 859900, 858784, 879375, 905542, 963448, 1048111, 1158880, 1295208, 1428139, 1513239, 1501282, 1371659, 1197960, 1049139, 932815, 849278, 787761, 738055, 706899, 698761, 691923, 675575, 645935, 632912, 624309, 602958, 592958, 581763, 588887, 610148, 608611, 603290, 592084, 581867, 573470, 578226, 599918, 614315, 600955, 609652, 636028, 655596, 679907, 680901, 683332, 671366, 673692, 681607, 681644, 690005, 715864, 756908, 777747, 801954, 825776, 858437, 907330, 975071, 1053998, 1159186, 1305057, 1511310, 1841728, 2316961, 3049717, 4128309, 5615838, 7286509, 8612825, 9029879, 8461455]
10205H461455j107091j138472r30689p15723n59116m47901l68590l00293k57606
10196B635974k25795k24875j84132j43246j25591q9504j00873j02777q5166o3227
10186A290788n7976n3472n4417n1382m1461m1603n2625l9581k2192k965j8578
10175H54536l5098j9262j6972k6023l8864l1883k0446k1002k0662j9211j6755
10164E88358k5225k2003p785j5215j1763n000O654K23j8794l354m51Q218K4300
10151E18163K0300K5423J2986J3586K2643K5113K5310N4146Q2115J10319J53024
10140A063128K21074K86496L56641M35138M48670L46439J80953m1747k11805k96507
10130B788480l10066k83271k44195k02565j60973j33139j21281j14673q9190q1905
$$ y = [8461455, 7354364, 6215892, 5285203, 4569480, 4010364, 3562463, 3193873, 2893580, 2635974, 2410179, 2185304, 2001172, 1857926, 1732335, 1642831, 1541958, 1439181, 1354015, 1290788, 1232812, 1179340, 1124923, 1073541, 1032080, 990477, 937852, 898271, 876079, 873114, 854536, 819438, 800176, 783204, 757181, 718317, 686434, 665988, 644986, 624324, 605113, 588358, 563133, 541130, 533345, 518130, 506367, 501367, 508021, 508244, 489450, 486096, 485645, 493863, 518163, 538463, 563886, 576872, 590458, 613101, 638214, 663524, 717670, 799785, 910104, 1063128, 1284202, 1570698, 1927339, 2362477, 2811147, 3157586, 3338539, 3296792, 3084987, 2788480, 2478414, 2195143, 1950948, 1748383, 1587410, 1454271, 1332990, 1218317, 1129127, 1047222]
10120A047222p3623p0505o0525m5535m1824l2931l1295l1085k1136p147O254n360
10108F32510J0077l710j5438k7080m4157l2914k2881k8211j2843k2293j7309K355
10096D18106N474p321k7521j3304k1766j2707r305j2246k993m52j4201k1369J586
10083B81981N642J1494m231l524J0318J2056j0616j643K080j412j6291j4565n570
10070B65719N34j6407j2902k550J054n694l368L943o505J639j279j3922k057O168
10056B14373K604M883j510N906Q053j0573Q983K6116J6556J4522J1634J3491K1696
10043C36734J5973J5315L1241J4737L4630N3864R4409J43369K03292K90042L81069
10032A614675M31123L14785N4296j88167k79947k66904k20475j80001j56802j25640
$$ y = [1047222, 973599, 903094, 842569, 797034, 755210, 722279, 690984, 659899, 638763, 631616, 637870, 632510, 642587, 638877, 623439, 596359, 552202, 519288, 496407, 468196, 455353, 433060, 415751, 418106, 423580, 416259, 388738, 375434, 353668, 340961, 331656, 319410, 316417, 315965, 301764, 280395, 281981, 287623, 299117, 294886, 291362, 301680, 313736, 303120, 301477, 303557, 302145, 285854, 271289, 265719, 266253, 249846, 236944, 234394, 235448, 229754, 226386, 230329, 223824, 225463, 224184, 210262, 208205, 214373, 216977, 221860, 220350, 226256, 234309, 223736, 232719, 258835, 275391, 289913, 301547, 315038, 336734, 352707, 368022, 399263, 414000, 448630, 502494, 596903, 740272, 943564, 1233606, 1614675, 2045798, 2360583, 2414879, 2226712, 1946765, 1679861, 1459386, 1279385, 1122583, 996943]
10022I96943r6800p8117p6993n8966o2935o0761m4095m8960l7454k2527n795j2040
10010C91500k8011j9805k4871j3787p170k5001p736n224p217j1299Q4k026k159
9997B37278j2697j6608m371N374q718l758l830p532K968J679k4742o926L334K782
9983A64233m054j153m366K383n853j2905K877m072j0366k293r595l760N056K030
9969A18162o074n795L217m395r270K130n098o00J4210J4263J495m966j965R63
9955A16277l326j1665l431N103l510J1976L731k001k177J0170j917P442J814o979
9941A21507n380m736l714o392k0893k2082j2006n423J3820O993P588m342k711
9928F2229N922J3231J6363r485j0356Q225L24o550oP828O533o584l06p425J742
$$ y = [996943, 900143, 822026, 745033, 686067, 623132, 562371, 518276, 469316, 431862, 409335, 403540, 391500, 363489, 343684, 318813, 305026, 297856, 272855, 265119, 259895, 252678, 241379, 241463, 239437, 237278, 224581, 207973, 203602, 208976, 200258, 196500, 192670, 185138, 188106, 189785, 165043, 158117, 161451, 164233, 160179, 159026, 154660, 157043, 151190, 138285, 141162, 137090, 126724, 124431, 114836, 111076, 116132, 118162, 112088, 106293, 109510, 105115, 95845, 97975, 92877, 92277, 106487, 120750, 122245, 117279, 115314, 116277, 112951, 101286, 97855, 102958, 99448, 111424, 115155, 113154, 110977, 121147, 119230, 126672, 128486, 121507, 116127, 111391, 107677, 101285, 80392, 58310, 46304, 40881, 54701, 61694, 69282, 64940, 62229, 68151, 81382, 97745, 88260, 77904, 86129, 86453, 79903, 79897, 87725, 94258, 87674, 87368, 79943, 81685]
9913H1685J2933K7648K4460K117j8134k2370j1103r705m368m206O279R0r560p128
9899F8638P217J0523O914n559j7399R51k804n677M499j4820j271j627L385l07
9885E2663J991O758P948K740k522k904O845M157K203q134j5291o022j094K906
9871E2244J376p209M576J6269R443q754m744R315J0837N352j2928Q240l792j7420
9857F2805l435j765j4254N69J5414J2609O943L497J959n830j545L129k1305r778
9843D9013K953J6056O0p616m127q981r804Q249M896j672n462r829M696p955M476
9828C4953N101J3248R469j2866L296o365j217N199j3967O206J6554o662l356Q051
9814E7644k1313j2469M154P233J0733R033K412M52Jj939l43N066m999p528J068
$$ y = [81685, 94618, 122266, 146726, 148843, 130709, 108339, 97236, 87531, 83163, 78957, 85236, 85326, 75766, 68638, 75855, 86378, 93292, 87733, 70334, 71285, 68481, 62804, 67303, 52483, 51212, 49585, 52970, 52663, 54654, 61412, 69360, 72100, 69578, 66674, 73519, 77676, 79879, 71745, 56454, 50432, 49338, 52244, 53620, 46411, 50987, 67256, 76699, 67945, 63201, 72516, 83353, 88705, 75777, 84017, 80225, 62805, 59370, 57605, 43351, 43920, 59334, 71943, 78886, 82383, 84342, 78512, 76967, 80096, 58791, 49013, 51966, 68022, 68082, 60466, 56339, 47358, 37554, 45803, 50699, 49027, 43565, 33736, 38432, 30477, 34953, 40054, 53302, 62771, 49905, 53201, 46836, 45619, 50818, 36851, 43057, 59611, 52949, 49593, 57644, 36331, 23862, 28016, 35249, 45982, 55015, 57427, 57879, 57880, 55941, 55598, 60664, 55665, 48137, 49205]
9799D9205Q846J362o941m321m649N66J153K259p401m627M645J0598R743O890o39
9784F6689j1264j53J34K0716N979o598p551j0827M138q096j8354j688J6013L611
9770E2749O977L34q250k516j835n383R25l090o600Q60k053o195q121K93R499M111
9754C1705L330M182N153P401O843p502q576j3618M898O440P656L865N41j4608
9740C7710p457R179n873o06J5040K039L524j166J852r435o376O566K530J488j059
9725D7956p268j435n977k6119Q113J1870J2855K921P390P278j0018l075j3211
9712C1280J0445O056O609J5359j681K799o963j4131j0539M393J5955p295j123
9699E1164r870m132Q54n857p141P856J7743o335p151N694J284O496L730J587k973
$$ y = [49205, 58051, 59413, 52472, 48151, 43502, 44068, 45221, 47480, 40079, 35452, 40097, 50695, 60438, 67328, 66689, 55425, 55272, 55406, 76122, 82101, 75503, 67952, 57125, 61263, 53167, 34813, 33125, 49138, 52749, 59726, 60060, 51810, 49294, 47459, 42076, 43001, 39911, 33311, 34171, 32118, 25923, 17802, 18095, 27594, 31705, 35035, 39217, 44370, 51771, 58614, 51112, 42536, 28918, 33816, 40256, 47912, 51777, 52318, 37710, 30253, 39432, 33559, 32953, 47993, 50032, 53556, 52390, 54242, 44807, 38431, 44997, 47527, 49015, 47956, 40688, 39253, 33276, 7157, 15270, 27140, 39995, 42916, 50306, 57584, 47566, 44491, 31280, 41725, 47781, 54390, 69749, 68068, 70867, 63904, 49773, 39234, 43627, 59582, 52287, 51164, 41294, 37162, 38016, 32159, 25018, 32874, 50617, 44282, 37131, 42825, 44109, 50605, 54335, 55922, 52949]
9684E2949Q12J3288n667q201j2586l843p350J1060O703k149r843k439J983J2426
9670D7143K136O421j2063p602j867j6422n92J1492o12n042L300J9153L071k989
9656D5527p815n867P670J3916k769M687j388K598o732n483n211j1092K734J7109
9642D7884p199q035J023q345m150j076O959M715k248O120k248R611n890k353K437
9627C7205O195K168L030K258J9689J860j4004j230k845L559Q994J315l813J261
9613F5642p432r305L859N684j3702P261L590l561j1466j446q50K691J7048J4288
9599G2301m357j4502k479L912j4224m342J3475m056L52k531J665M107Q05l138
9585D6988N124P413j721l101p46L991j338r882n016M996l415R80m071J1829l158
$$ y = [52949, 53761, 67049, 61382, 53181, 40595, 36752, 29402, 40462, 47165, 45016, 35173, 32734, 34717, 47143, 49279, 55700, 43637, 36035, 34168, 17746, 17154, 28646, 28034, 22992, 26292, 45445, 48516, 45527, 37712, 31845, 39515, 53431, 50662, 55349, 53961, 56559, 49827, 44344, 39133, 28041, 30775, 47884, 40685, 32650, 33673, 25328, 21178, 20102, 27061, 31776, 29528, 35648, 33400, 43011, 37121, 34768, 37205, 43400, 45568, 48598, 50856, 70545, 72405, 58401, 57171, 54326, 57885, 66879, 68194, 64381, 65642, 58210, 48905, 52764, 58448, 44746, 52007, 55597, 52036, 40570, 39124, 38274, 40965, 58013, 72301, 67944, 53442, 50963, 54875, 40651, 36309, 49784, 45728, 46080, 43549, 45214, 49321, 50126, 46988, 52112, 59525, 57804, 54703, 53957, 57948, 56610, 46728, 41712, 46708, 43293, 44273, 40202, 52031, 48873]
9570D8873j9604r286J4187J0422J2289o092r344K430L315l719O405P820J3183
9557G0879q242j4853q897R365J561r352J254Q874N985L044J1853J314j2347M904
9543F5342P359j978N958o958j0357k012L146k689L943l363N440K758j3583k476
9529E0530N275P447kK244J944l972m251m71P009Q131J0977K522M389j185k0518
9514G0069j5663j033L215o013P05J2016j598o874J3689j906P508o936Q024O728
9500H1931R493l557j312m252J3584P95n904j7612J1o145J893K2574K901j8064
9486G6336j3021p377R560J6630J5806K776o365m770j0071r386M496k633J365j996
9472G1350k32Q516K924N646P448M27j0627j723N056n98K476l961P686J2438K91
$$ y = [48873, 29269, 19983, 34170, 44592, 56881, 50789, 41445, 43875, 47190, 43471, 49876, 57696, 70879, 62637, 47784, 38887, 48252, 49813, 40461, 41715, 50589, 56574, 59618, 71471, 72785, 60438, 65342, 72701, 70723, 76681, 69723, 59366, 57354, 60500, 57811, 61754, 58391, 63831, 66589, 53006, 50530, 55805, 63252, 63250, 65494, 67438, 63466, 59215, 58744, 65753, 73884, 84861, 87383, 91772, 90587, 70069, 54406, 53373, 56588, 50575, 51280, 63296, 61698, 54824, 68513, 66607, 74115, 67179, 75203, 81931, 91424, 87867, 86555, 82303, 95887, 96682, 90778, 73166, 73177, 67032, 68925, 91499, 94400, 76336, 63315, 55938, 65498, 82128, 97934, 100710, 94345, 89575, 79504, 70118, 74614, 71981, 73346, 71350, 71118, 79634, 82558, 88204, 95652, 96079, 85452, 83729, 88785, 88187, 90663, 86702, 94388, 106826, 107117]
9457A07117J391j2546q14N194R200P915o157m895l82P600N064M090L565M99n605
9442A21236J3076J5375M495O32j6969p440J067j942M553P727l5q589J736Q967
9428A43889J464p638Q033n645j1599r478r071n317J357J4390Q392R97N077R374
9414A44225j807l426m539K757J2890j0355k4756j1522J2777J1117q419n971p32
9401A12239J3202m362q686M11K645m502L716M525J0569P825L311p759k900J069
9387A31303q56P535J309j3811L082R21j800M430j4145j0151O831j0557j7188p104
9373G9799k7550l7324j7354R109O604j325Q77J2006K0633J0830M833L092m735
9360E9495R300o82j314N667M102J8805J7288J54O097J4725Q253l657j795l797
$$ y = [107117, 108508, 95962, 95148, 100342, 109542, 117457, 111300, 106405, 106023, 113623, 118687, 122777, 126342, 126841, 121236, 134312, 149687, 154182, 154814, 137845, 130405, 131472, 129530, 134083, 141810, 141775, 133186, 134922, 143889, 145353, 137715, 145748, 140103, 128504, 119026, 109955, 104638, 105995, 120385, 128777, 129774, 134851, 144225, 142418, 138992, 134453, 137210, 150100, 139745, 114989, 103467, 116244, 127361, 118942, 112971, 112239, 125441, 121079, 112393, 112804, 115449, 110947, 114663, 119188, 129757, 137582, 140893, 133134, 130234, 131303, 130447, 137982, 139291, 125480, 128562, 129483, 127683, 132113, 117968, 107817, 114648, 104091, 86903, 79799, 52249, 14925, -2429, 6680, 13284, 11959, 12836, 24842, 45475, 56305, 61138, 64230, 59495, 68795, 68113, 66799, 72466, 76568, 95373, 112661, 112815, 118912, 133637, 141890, 138233, 136438, 132641]
9346A32641l593n410L583J3913J8847J1603n459Q936J9146r63k0802n790K1543
9333A88195J5030n988q265l052J3311n825K848J0453R461K2866J1053K0980M546
9320B75613O646l539P163J3979j420J2516R983J5063k330k322M983J7113J7338
9307C70786J2137J0924P574Q36J1139J6481Q885N96J8342P232l583P97N498L197
9293D70841Q899K2670K3828O218o00q97O444J2106K5698K6886o937n234j491O907
9279E95338J1539J6374J4798J4395N305J7645Q294p052J908J3246J7870K2242
9267G31902J6399J1280J9988Q347K0292K5473J5613J1841K5162M2148K4977K8887
9255I82309J7950J3107K6895K5718L7156L0140J7302K4703L3984L1979L2046M2654
$$ y = [132641, 129048, 123638, 127221, 141134, 159981, 171584, 166125, 175061, 194207, 193244, 172442, 166652, 188195, 203225, 197237, 188972, 185920, 199231, 193406, 196254, 206707, 216168, 239034, 250087, 271067, 275613, 282259, 278720, 285883, 299862, 298442, 310958, 320941, 336004, 333674, 331352, 336335, 353448, 370786, 382923, 393847, 401421, 402257, 413396, 429877, 438762, 439358, 457700, 464932, 461349, 462146, 467644, 470841, 479740, 502410, 526238, 532456, 531856, 530959, 537403, 549509, 575207, 602093, 595156, 589922, 588431, 595338, 606877, 623251, 638049, 652444, 657749, 675394, 683688, 676636, 678544, 691790, 709660, 731902, 748301, 759581, 779569, 787916, 808208, 833681, 849294, 861135, 886297, 928445, 953422, 982309, 1000259, 1013366, 1040261, 1065979, 1103135, 1133275, 1150577, 1175280, 1209264, 1241243, 1273289, 1315943]
9243A315943M1061L8470N9872N2358L7275N4558N7061N6164N9706O4445N8199
9232A895112O3068Q6461R1978R2470R8470Q5240R2730J11188J18823J20745J21369
9221B977654J32655J49886J52894J58272J80064J95041K12152K50713K57003K53242
9211D919576K80168L16224L64759L86049M21677M84265N15233N86720O66779P50329
9201I691779Q33410R34449J074026J217500J379007J585879J830085K101652K443018
9192B3090805K837836L271977L797924M380006M967118N548514O021575O257026
9184F0172781O071089N410211M239386K631176Q03258r41079k364337l391304
9176G2631181l990595m264234m317811m185955l985532l743401l482638l215878
$$ y = [1315943, 1357004, 1395474, 1455346, 1507704, 1544979, 1599537, 1656598, 1712762, 1772468, 1836913, 1895112, 1958180, 2044641, 2136619, 2229089, 2327559, 2412799, 2505529, 2616717, 2735540, 2856285, 2977654, 3110309, 3260195, 3413089, 3571361, 3751425, 3946466, 4158618, 4409331, 4666334, 4919576, 5199744, 5515968, 5880727, 6266776, 6688453, 7172718, 7687951, 8274671, 8941450, 9691779, 10525189, 11459638, 12533664, 13751164, 15130171, 16716050, 18546135, 20647787, 23090805, 25928641, 29200618, 32998542, 37378548, 42345666, 47894180, 53915755, 60172781, 66243870, 71654081, 75893467, 78524643, 79327901, 78386822, 76022485, 72631181, 68640586, 64376352, 60058541, 55872586, 51887054, 48143653, 44661015, 41445137]
9168D1445137k945093k715618k468048k239784k040723j851495j677512j534945
9160B3971919j405135j268838j169558j077981r87161r11359q40762p75289p14590
9151A4821246o83438o31527n80053n35432n08361m85054m53543m26090m01094
9142A0116654l72903l45292l20904l16773l06370k82947k57520k47822k43600
9133G422523k24882k10048k10369j92809j73735j67992j50052j53555j48840j46354
9123E643887j31164j31651j22216j23858j25110j18129r9446r0825j05816r2345
9113D503327j06337r9323p7721n9613q1558o8590p3008p2749p9956p5735o6261
9102C642476p5810q3192q0259q0034q9546p6501q1062q2088q3010r5139o9054
$$ y = [41445137, 38500044, 35784426, 33316378, 31076594, 29035871, 27184376, 25506864, 23971919, 22566784, 21297946, 20128388, 19050407, 18063246, 17151887, 16311125, 15535836, 14821246, 14137808, 13506281, 12926228, 12390796, 11882435, 11397381, 10943838, 10517748, 10116654, 9743751, 9398459, 9077555, 8760782, 8454412, 8171465, 7913945, 7666123, 7422523, 7197641, 6987593, 6777224, 6584415, 6410680, 6242688, 6092636, 5939081, 5790241, 5643887, 5512723, 5381072, 5258856, 5134998, 5009888, 4891759, 4792313, 4701488, 4595672, 4503327, 4396990, 4297667, 4219946, 4160333, 4078775, 4010185, 3937177, 3864428, 3784472, 3708737, 3642476, 3566666, 3483474, 3403215, 3323181, 3233635, 3157134, 3076072, 2993984, 2910974, 2815835, 2746781]
9091B746781o1313p1205n9487m7659n3026o6369o5896o3591m1642k8926m9126
9080B138541n6030n5374n3378k3886k5201m5143m7991m7432l6970k9881m0629
9069A676626l0513l8510k9620l6127m5915l8730k7907k6899l1690l2606k2455
9058A315654k832k5772k8916j9233j5641j6155k1967k8693k5786j8329j5949k1695
9046A074686j5920p106j1839j0219j9663j5774j6609k2700j6849j5190k5185j9346
9034H78286q513j2263j0790k5996k9880k8143j0868j9793j5577r717k5646k5698
9022F55402j7048o156j9734k3696j4815l008j0848k0218j0382R332P862q197k4492
9009E14002j0104O8k175j370j9025j3071j4248p751Q423J3956J7676J4507m045
$$ y = [2746781, 2685468, 2614263, 2554776, 2507117, 2454091, 2387722, 2321826, 2258235, 2216593, 2187667, 2138541, 2082511, 2027137, 1973759, 1949873, 1924672, 1879529, 1831538, 1784106, 1747136, 1717255, 1676626, 1646113, 1607603, 1577983, 1541856, 1495941, 1457211, 1429304, 1402405, 1370715, 1338109, 1315654, 1312822, 1287050, 1258134, 1238901, 1223260, 1207105, 1185138, 1156445, 1130659, 1112330, 1096381, 1074686, 1058766, 1051660, 1039821, 1029602, 1009939, 994165, 977556, 954856, 938007, 922817, 897632, 878286, 869773, 857510, 846720, 820724, 790844, 762701, 751833, 732040, 716463, 706746, 681100, 655402, 638354, 632198, 612464, 588768, 573953, 570945, 560097, 539879, 529497, 538829, 546691, 538494, 514002, 503898, 503966, 501791, 500421, 481396, 468325, 454077, 446326, 454749, 468705, 486381, 500888, 496843]
8996D96843r123J2248J2338J3136r871q967l095k563n491k0150k9711j8307j0974
8983D16313k784j984o034k1019j6123n538K312p321k707M3j0016j0488l151j3217
8969C18286l290p900r348N835O397j7124m569o0M956L838j614k780p606n48P71
8954B85244o149j0896P350M102N827K06j0150J354k035j6074j3933j606K947Q281
8940B54468J870n608q434M500O426J371j0915l298p800k545p72K176l414l618
8926B24407J0695p815k3311p692R833p12p174o679r280M803L856L487r552j3648
8912A71218m30M811j258q960o388J433j2745j272N432J982M603K770J1436j0213
8898A62419p616r504j0521P885p157p086n500k967q00R177l197l271k0069m024
$$ y = [496843, 487720, 499968, 512306, 525442, 515571, 506604, 503509, 500946, 495455, 475305, 445594, 427287, 416313, 413529, 411545, 405511, 384492, 368369, 362831, 365143, 357822, 355115, 355158, 345142, 334654, 331503, 318286, 314996, 307096, 297748, 303583, 309980, 292856, 288287, 288227, 293183, 297021, 295407, 292627, 285021, 284473, 285244, 279095, 268199, 275549, 279651, 285478, 285684, 275534, 276888, 274853, 258779, 244846, 243240, 246187, 254468, 256338, 250730, 242296, 246796, 253222, 254593, 243678, 240380, 232580, 230035, 229263, 231439, 228025, 224407, 235102, 227287, 203976, 196284, 206117, 205405, 198231, 191552, 182272, 187075, 190931, 194418, 184866, 171218, 170788, 175599, 174341, 165381, 158993, 160426, 147681, 146409, 151841, 153823, 158426, 161196, 172632, 162419, 154803, 145299, 134778, 142663, 135506, 128420, 122920, 119953, 119153, 128330, 125133, 121862, 101793, 97769]
8884I7769J6884J7467M913j1905n779R358r89M580q342j0211l098Q406K583k476
8870A19160p056M768N36j28j1887L49J2036J1362l988j3155O729J440j7303j5584
8856H7279j4314Q12L584J458L101L381j0798J628R729j3555j6127r522P599O278
8842F0533J5963J0673J7843o865j7j0583k323k509j1533j552L328j154M178J3309
8828H9291k436q048m911n26J526l001J7776k468P328p331j4713j8546j248J2358
8814F5051J1484j368M320n175j3576q206J6095M117o465k891j2940M783J1356
8801F6585R558j0718k168J6128J0927M055N176o953k0987K99m587M013j0548k956
8787E7824L220p9O539j609Q924J913l850N00o245n849j7412k132K8690J565j7650
$$ y = [97769, 114653, 132120, 137033, 125128, 119349, 128707, 127718, 132298, 123956, 113745, 110647, 119053, 121636, 119160, 112104, 116872, 117408, 117280, 105393, 105742, 117778, 129140, 125152, 111997, 118726, 120166, 102863, 87279, 72965, 73777, 77361, 78819, 81920, 85301, 74503, 76131, 85860, 72305, 56178, 46656, 54255, 60533, 76496, 87169, 105012, 98147, 98130, 87547, 85224, 82715, 71182, 69630, 72958, 71804, 75982, 89291, 86855, 78807, 73896, 73370, 74896, 71895, 89671, 87203, 94531, 87200, 72487, 53941, 52693, 65051, 76535, 75167, 79487, 74312, 60736, 52530, 68625, 72742, 66277, 63386, 50446, 55229, 66585, 76143, 65425, 63257, 79385, 90312, 94367, 99543, 92590, 71603, 71902, 67315, 71328, 60780, 57824, 61044, 60965, 67504, 65895, 74819, 76732, 72882, 73382, 67137, 61288, 43876, 41744, 70434, 71999, 54349]
8772E4349l621R126M808K594n292L894J0237m112r299N888O074l261P612q240
8758G0757r201Q706K0604j979k4502n618P327J2169j9108k771J4939J137r751
8745F2709r617M160q739j6234m21K1214M626Q30L823o568q262J748J1267o443
8731E4093j286Q709K1529K66k080l958n268P51j4599q507N993j255q368O324Q078
8716F0422K945o099n148m77j0459P293P950L313k638k820L86k326P007J810J0886
8701G2045J1719K5958J8777Q073K0622p459j4699j1542j5548n255q540j3764o257
8688G4130N629l718p940l339P137Q971Q022K227p556K687o232m364q392j5864
8674E1398p31K0804J5762l104j1223l758O486l194k988J31j425J4550o295l758
$$ y = [54349, 50728, 59854, 64662, 67256, 61964, 65858, 76095, 71983, 62684, 68572, 74646, 71385, 78997, 70757, 61556, 70262, 90866, 88887, 64385, 58767, 66094, 78263, 59155, 56384, 71323, 72460, 62709, 53092, 57252, 48513, 32279, 31858, 53072, 57698, 58528, 62351, 55783, 47521, 49269, 60536, 54093, 52807, 61516, 83045, 83311, 81231, 77273, 72005, 72756, 58157, 49650, 55643, 54388, 46020, 52344, 60422, 63367, 57268, 52120, 51643, 41184, 48477, 56427, 59740, 57102, 54282, 54668, 52342, 59349, 61159, 72045, 83764, 109722, 128499, 136572, 157194, 149735, 135036, 123494, 107946, 102691, 94151, 80387, 74130, 79759, 76041, 68101, 64762, 71899, 80870, 88892, 91119, 83563, 86250, 80018, 75654, 67262, 51398, 50667, 71471, 87233, 84129, 72906, 69148, 75634, 72440, 69452, 69583, 68158, 82708, 76413, 72655]
8660G2655Q739q761k923L027O150o299j1754J634K518N875L456j0339o294L579
8646F1263k912n325K389k417K614J2304n053n138J2052M478r734j4156J184l227
8632D8322J0196K3868K4690J3692k653J7813n723Q188P261J295Q435J927m53o617
8618A50241J828j158j2880q171M10p677q531N199O724K344j7985j7502J535R104
8604A03481m464n977j4287j440k109K613Q854L213k0317P99L008k030J3470j2687
8590G2127J814L526m179p312j453l344J781r997n247m377K46m278n718k640M469
8575C5418N471m050k231K453n616O41P734R153J8355M156K450k098j0968j0014
8561E0854j543M106n581L399Q065o072n216m940K172L837N973k460o394p796m590
$$ y = [72655, 81394, 72633, 69710, 72737, 78887, 72588, 60834, 62468, 64986, 70861, 74317, 63978, 57684, 61263, 58351, 53026, 55415, 52998, 55612, 67916, 62863, 57725, 69777, 74255, 64521, 50365, 51549, 48322, 58518, 82386, 107076, 120768, 118115, 135928, 130205, 138393, 145654, 146949, 155384, 157311, 156858, 150241, 152069, 150911, 138031, 129860, 130270, 122593, 114062, 119261, 125985, 128329, 110344, 92842, 94377, 103481, 99017, 93040, 78753, 77313, 75204, 77817, 86671, 89884, 69567, 70366, 73374, 71344, 84814, 72127, 73941, 77467, 73288, 65976, 64523, 61179, 62960, 52963, 47716, 43339, 43585, 39307, 33589, 30949, 35418, 40889, 36839, 34608, 37061, 31445, 32086, 39820, 48973, 67328, 71484, 73934, 71836, 60868, 50854, 49311, 53417, 47836, 51235, 59300, 53228, 48012, 43072, 45244, 49081, 55054, 52594, 46200, 38404, 33814]
8546C3814l643P040J884L291m503l223L733j184K522N706L977j1096j3095J06
8532B5329m499j1441O13O258j347k350L708M895J5501k066j2612R09Q893k47P448
8517C8992R597L119O355k910j5507K06J1421q531J270j3296L687k32j0262j743
8503B2166J1847k690r192n552M691J0477P484L836O01j0315m795r272n504O402
8489B0184k877p579P635J8867K054p060j794J0075N546k158n059l909j0033p121
8475A6771l239o268L592J4303K703M26n867o430j886J1958q003k040J0351K045
8461B8416j0650o289j01P097O69j1026r051P737r266p129J9105K1460k693j4035
8447A4244r799R293r59Q053J1438J0408j0804j3290j107j816k805P146j674j4098
$$ y = [33814, 30171, 37211, 39095, 42386, 37883, 34660, 38393, 37209, 39731, 45437, 49414, 38318, 25223, 25329, 20830, 9389, 10002, 16260, 14913, 12563, 16271, 21166, 36667, 34601, 21989, 22898, 31791, 31544, 38992, 48589, 51708, 58063, 55153, 39646, 39852, 51273, 42742, 44012, 30716, 34403, 34171, 23909, 22166, 34013, 31323, 22131, 16579, 21270, 31747, 39231, 43067, 43668, 33353, 28558, 19286, 13782, 20184, 17307, 9728, 17363, 36230, 38284, 31224, 29430, 39505, 45051, 42893, 37834, 33925, 23892, 16771, 13532, 7264, 10856, 25159, 27862, 28288, 22421, 15991, 14105, 26063, 18060, 16020, 26371, 28416, 17766, 11477, 11376, 18473, 19142, 8116, -935, 6802, -2464, -9593, 9512, 30972, 28279, 14244, 4445, 13738, 12779, 20832, 32270, 42678, 31874, 18584, 17477, 15661, 12856, 20002, 18328, 4230]
8433D230q52L155j1153N855J1664l601N597L415O709J4951L245n877l122N724
8419C9940P608N511m406j7907p057K424m426n089K2227L007j0745p664R677j2468
8405B0632j0218P076l020R710K241k129Q118m279J432L089Om813j7936K308L540
8390A5757m270p96J095J0489n454n617J2945M777j1010m748K72p685N00R6k145
8375D206J332J3033Q426l706m289m250j2536p196L06j323J3198j949l407L345
8361E190O053j0779l768J681J0771L07k360O296N132K845j086n747q065n237l181
8346a948m283j3147l084R225K84p443Q530J9543J145j2735P467J0167n097k102
8332F522J6621J9Q171m294K353L276o876j0239J229K353P50j8509n989L968Q885
$$ y = [4230, 3378, 6533, -4620, 1235, 12899, 9298, 14895, 18310, 25019, 39970, 43215, 37338, 34216, 39940, 47548, 53059, 48653, 30746, 23689, 26113, 21687, 16598, 38825, 41832, 31087, 23423, 33100, 20632, 10414, 17490, 14470, 24180, 26421, 24292, 32410, 28131, 29563, 32652, 32658, 27845, 9909, 12217, 15757, 11487, 10691, 11786, 22275, 16821, 11204, 24149, 28926, 17916, 13168, 13440, 5755, 6255, 6351, 4206, 5538, 18571, 26997, 23291, 19002, 14752, 2216, -4980, -4674, -5997, 7201, 5252, 1845, 5190, 11243, 464, -3304, -1623, 9148, 9455, 7095, 13391, 18523, 21368, 20282, 14535, 6470, 1233, -1948, -6231, -19378, -22462, -13237, -12953, -20396, -11866, 7677, 8822, -3913, 3554, 13721, 8624, 6522, 23143, 23162, 31333, 27039, 29392, 32668, 25792, 15553, 16782, 19135, 19885, 1376, -4613, -645, 8240]
8317H240P48K814J0438K850j392n288L33o964o844L671k402k0847j6010Q525Q658
8302a3470P040K2330K9932L6353K4458M455P102J0925L33j6954k0223k6271k7580
8289C8430k1713j4271j3171p921M601J7883m671M686J1883J257M655L226M09K513
8275B7796k980n365j2J7321O698l402j9046K062R745N909P105O062N156j0269
8261D6780P065r165l747M928r838K354j1227r713N372j3946j2356j5792r104J5909
8247a2480J1899j750J236L630J5407q222m697j601m788P889J4120j46q843n556
8233F098o782n691q00R57J7379R728r632n416R205J3816J4303J510N768K482j4909
8218C8016q997p921J2816K368J373P490m871q959m305J595j957j608k901J488
$$ y = [8240, 8988, 11802, 22240, 25090, 23698, 18410, 18743, 11779, 4935, 8606, 6204, -14643, -30653, -22128, -13470, -6430, 15900, 45832, 82185, 106643, 111098, 118200, 129125, 129458, 112504, 92281, 66010, 38430, 16717, 2446, -10725, -18646, -14045, 3838, -833, 3853, 15736, 16993, 21648, 24874, 25283, 27796, 24816, 19451, 19439, 36760, 43458, 40056, 21010, 23072, 32817, 38726, 45831, 51893, 57049, 46780, 53845, 44680, 40933, 45861, 36023, 38377, 27150, 17437, 22809, 8863, -3493, -19285, -28389, -12480, -581, -2331, -1095, 2535, 17942, 9720, 5023, 3422, -1366, 6523, 20643, 20497, 11654, 6098, -684, -6375, -7175, -6218, 11161, 20889, 11257, 5841, 15046, 28862, 43165, 44675, 50443, 52925, 38016, 29019, 21098, 33914, 36282, 37655, 45145, 40274, 31315, 27010, 28605, 26648, 25040, 22139, 23627]
8204B3627j1249j4305j0667p552J4733K4694j0478j0326O424J8546m877j3633
8192D937K197J580J5279J583j1172k0507m405l590m463Q732K315j351O690R849
8178G674J8772J8337l597j6643n222K470r463K47N946l589o257J569k249L299
8164A1294j0319j0833O908l966n434K945L938M438l352q2L995K2N801J6396J0284
8149C2035l983j1287n666j4223K237k329m876L943Q94j688q768O660L065N123
8135A137R218N071K932J901p797j725j573n832o779k398j73m670O381J112J421
8120a774j285n786o680J4078j790k75N017k636Q419n761j0364M994O982m285J381
8105B35q340j9317P210J7993o260m062k058O37K7252J9302n151p697j1573P139
$$ y = [23627, 12378, -1927, -12594, -20146, -5413, 19281, 8803, -1523, 4901, 23447, 18570, 4937, 7134, 8714, 23993, 25576, 14404, -6103, -10508, -14098, -18561, -9829, -7514, -8865, -2175, 7674, 26446, 44783, 41186, 24543, 19321, 21791, 12328, 12575, 18521, 14932, 8675, 10244, 7995, 11294, 975, -9858, -2950, -6916, -12350, -9405, -5467, -1029, -4381, -4463, -468, -446, 5355, 21751, 32035, 28052, 16765, 11099, -3124, -887, -3216, -8092, -4149, -3255, -4943, -13711, -7051, -3986, 1137, 10355, 15426, 18358, 20259, 12462, 10737, 9164, 3332, -3447, -5845, -6018, -10688, -4307, -3195, -1774, -3059, -8845, -15525, -1447, -3237, -3512, 1505, -1131, 7288, 1527, -8837, -3843, 3139, -1146, 235, -8105, -27422, -20212, -2219, -8479, -12541, -14599, -13962, 13290, 32592, 27441, 19744, 8171, 15310]
8091A5310L561M77M722K139r281p595p742R36M661N904R359j2641j3465K2313
8077A8658O363r206K687j0623N437R053P92j0015j2269o493M923J1747N028m137
8063A1945j558q31o055J1976J4921q048j926j4756p23Q515o704P983O611k946
8049A8404L356J2938N62O077M008r37k1856o864K507N116j908J879j9n024M087
8034B2326l371r698R851j669O029J0524J8120P709J9083j3480j3484n061l721
8021D3158k23L728j5805l998J2010M366N755l129j3897n810Q408L789L475K392
8007D4219k8j6522L488P9j122J7685J0111j2307j1621P703j2284r741R646P764
7993C7070j762P60J689j1864q215Q441J1141l768p112K2484j83K150L444m067
$$ y = [15310, 18871, 19348, 24070, 26209, 16928, 9333, 1591, 2527, 7188, 13092, 22451, 9810, -3655, 18658, 25021, 15815, 18502, 7879, 13316, 22369, 23161, 13146, 877, -5616, -693, 11054, 16082, 11945, 10387, 9556, 3501, 15477, 30398, 22350, 20424, 5668, 4945, 13460, 6756, 14739, 21350, 18404, 21760, 34698, 35260, 41337, 45345, 44408, 22552, 15688, 18195, 23311, 21403, 23282, 23263, 18239, 22326, 18955, 9257, 19108, 17439, 23468, 33992, 52112, 59821, 78904, 65424, 51940, 46879, 43158, 42935, 46663, 30858, 26860, 38870, 43236, 48991, 45862, 31965, 26155, 34563, 38352, 41827, 44219, 44191, 27669, 31157, 31236, 30114, 47799, 57910, 45603, 33982, 41685, 29401, 19660, 29306, 37070, 35308, 36068, 37757, 25893, 17678, 26119, 37260, 33492, 26380, 48864, 48681, 50831, 54275, 50208]
7979E0208j2735m778J4168O323p403O611n328l49Q32l453j154M086o252M006j2668
7964C2114j9300L723k877J6429Q340m178J3466k191p516m159J253J807m592M455
7950C6774N690J303k397k0950j655Q132J5231K0374k859j2175j2342p027k638
7937B5461P462n515J227m930k282J1222k551j1394J2409m236l007j392j6400M049
7923A0123L793K280R609n386K009J8070l193q012M068o546o517K165m650P243
7909B5056K027p76M869R39p414J65O35N183j399q305r567o763j057j139L944Q60
7893G258R589R22N175p83m526N746J1316l066n891N300j0462k81n146j3039L25
7878B437q20q259J5620j226l156L708j79k386N306N022l659J898L420j0258j405
$$ y = [50208, 37473, 32695, 46863, 53186, 45783, 52394, 47066, 46717, 47549, 44096, 42942, 47028, 40776, 44782, 32114, 12814, 16537, 13660, 30089, 38429, 34251, 47717, 45526, 38010, 33851, 35104, 36911, 32319, 36774, 42464, 43767, 41370, 20420, 18765, 26897, 42128, 62502, 59643, 47468, 35126, 28099, 25461, 32923, 27408, 28635, 23705, 21423, 32645, 30094, 18700, 31109, 26873, 23866, 22474, 6074, 10123, 13916, 16196, 25805, 20419, 22428, 40498, 37305, 29293, 33361, 26815, 20298, 22463, 17813, 25056, 27083, 26307, 31176, 32115, 24701, 24866, 25501, 30684, 29285, 20980, 11413, 4650, 3593, 2454, 6398, 7258, 16847, 17769, 22944, 22161, 17635, 23381, 34697, 31631, 25740, 31040, 20578, 20297, 15151, 2112, 2437, 1617, -6642, 8978, 7752, 4596, 8304, 8125, 5739, 11045, 16067, 12408, 14306, 17726, 7468, 6063]
7863F063j3580l271M114J017p860j633K2503J0961p709p934J200J7078o984r953
7849D012m95k269l171L784J0825j018j4752J543p007q684K582J0886P802q513
7835d475k756m309l823Q251M457j5029m025J2725J4901J7784J1841p974j2608
7822A4960k1198J173P099m113M059P298M639m679N146n00k487j0103n935J6409
7808A1768j1404r652J4100l279M003n498r729J2165p995L422K4283M915m329j258
7794B1512j2464j0941r05J4268L856L448N44p8M533J292k571r673n958Q35o649
7779A049r623R622P657K715K424R912r029j0317l077p601q905K456p252N058R317
7764e594P086M343K81L204N771j643q256j2424n604O593Q912j3264L110l89k471
$$ y = [6063, -7517, -10788, -6674, -5657, -13517, -15150, 7353, 18314, 10605, 2671, 3871, 20949, 13965, 4012, 3517, 1248, -1923, 1861, 12686, 11668, -3084, -1541, -8548, -17232, -14650, -3764, 4038, -4475, -7231, -11540, -15363, -7112, -2655, -17684, -21709, -8984, 5917, 23701, 35542, 27568, 14960, -6238, -5065, 2034, -2079, 1980, 9278, 13917, 9238, 14384, 13884, 11397, 1294, -4641, 11768, 364, -9288, 4812, 1533, 5536, 38, -9691, 2474, -5521, -2099, 22184, 27099, 22770, 21512, 9048, -1893, -2798, 11470, 15326, 18774, 19318, 19240, 23773, 25065, 22494, 12821, 6863, 7698, 1049, -8574, 1048, 8705, 11420, 13844, 23756, 14727, 4410, 1333, -6268, -15173, -12717, -19969, -14911, -5594, 1492, 5835, 6116, 9320, 15091, 13448, 5192, -7232, -12836, -6243, 2669, -10595, -7485, -7874, -10345]
7749a0345P513L076K775P51j0996N392L07L425p975Q932P583O691J1238p124p410
7734A3833J326K560r871q185J137j383m997k1330j0717Q770R782K6185J1767j5404
7720C473j1370M164L914o179l484J4968J5008J4293K122j9432p207K508l63q826
7706C589m709Q828M099J0285Q390k017r898j4361n510k30J978J7229N910o390
7692A7193j4780m361J7174L572j1559p956l397l376n21J630K1708J2732k374j4839
7678A0846j8049l007Q698N134m487L028o863l526L206J8795O879L874j8232k4430
7664a8134k134P517J0243L725m654N902Q336q235q491k031j219R6l256J254J1630
7649E49j841j1251j582p369q046N341M19m789J5235K4572p20j6067j0407L845
$$ y = [-10345, -2832, 244, 3019, 3770, -7226, -1834, -1527, 1898, -6077, 2855, 10438, 17129, 28367, 21243, 13833, 15159, 17719, 7848, -337, 800, -583, -5580, -26910, -37627, -28857, -19075, 7110, 18877, 3473, -7897, -3733, 181, -5998, -9482, 5486, 20494, 34787, 36909, 17477, 10270, 12778, 12415, 3589, -1120, 7708, 11807, 22092, 30482, 28465, 18567, 4206, -1304, -1534, 444, 17673, 23583, 17193, 2413, -1948, 15226, 18798, 7239, -717, -4114, -7490, -8011, -6381, 15327, 28059, 25685, 10846, -7203, -10210, -1512, 3622, -865, 2163, -4700, -8226, -5020, 13775, 20654, 24528, 6296, -18134, -20268, -12751, -2508, 1217, -3437, 2465, 10801, 2566, -5925, -7956, -9175, -9079, -12335, -11081, 549, -1292, -12543, -14125, -21494, -29540, -24199, -23780, -28569, -13334, 11238, 10518, -5549, -15956, -12111]
7635a2111L899J3869K89l171Q87j0229J2249j648k954J371M097m717N708q562
7621a023n345R574P609l620n919Q18O245o56K687k661j2027J748k839M727J84
7606d98j3732j2769R107J258J5263r52j4715j9840l069P225N212J6415n872m580
7592b1547m570Q506J0363P281p574k518j944M073l515m969j654L281M402k851
7578a3236M18J1607J551J781j2985q928L238J4913P91n928j4970N124J344O822
7564h458M210M432Q919m631Q26j5157r033o362O290J495L369K387P474j4255L756
7549a4738O692K340p591K321J4698J3318K750O2K873j1462K518L419n058Q420
7535B0562j1395j7960p208q355Q794n209l103M941M25J0786l250j5914J774P353
$$ y = [-12111, -8212, 5657, 5946, 2775, 3662, -6567, 5682, 4034, 1080, 2451, 6548, 1831, 7539, -1023, -6368, 3206, 10815, 7195, 1276, 2094, 8339, 7683, 10370, 7709, -4318, -2570, -5409, -682, -498, -14230, -26999, -17892, -16634, -1371, -2323, -17038, -36878, -39947, -32722, -27510, -11095, -16967, -21547, -26117, -17611, -7248, 33, -7541, -10059, -12003, -7930, -11445, -16414, -18068, -14787, -10385, -13236, -12818, -1211, 340, 2121, -10864, -19792, -16554, -1641, -850, -6778, -21748, -16624, -15280, -8458, -4248, 184, 9103, 4472, 5298, -9859, -18892, -25254, -18964, -17469, -14100, -11713, -4239, -18494, -14738, -8046, -5706, -13297, -10976, 3722, 17040, 19790, 19852, 22725, 11263, 13781, 17200, 12142, 20562, 9167, -8793, -16001, -24356, -15562, -20771, -23874, -18933, -18508, -7722, -10972, -26886, -25112, -17759]
7521a7759M074K163r595O621J4246Q682p336R596j013l273k354j728K092R473
7507A3889o883k91K54j5191l696M634J39j270o43O391L331R866j6495k867O273
7492b559j3191m634J2861j647k603K707p753k751j0461J8230J2210n054k357N797
7478a205J77O75n163r573l880J3339o20l066R806r02j2725n31J6139J2174j0804
7463C841o812r620J2212K675j2437q363O943n151K0826J537q076o816m303l33
7449a3877l886o63J2221J6679j52n014J050R347j4991j0903l125j2414K065J978
7435b1685Q13R014J5470J0573o958p840K86k617O754O06K299Q183k970Q112r015
7420A1025P75Q854j470n388q23k470J908j5415j3655K929M611R605J2166l523
$$ y = [-17759, -13685, -11522, -21117, -14496, -250, 8432, 1096, 10692, 9679, 6406, 4052, 2324, 4416, 13889, 7006, 6715, 6969, -8222, -11918, -7284, -7145, -8415, -9058, -2667, 664, 10530, -5965, -8832, -2559, -15750, -20384, -7523, -9170, -11773, -9066, -16819, -19570, -30031, -11801, 409, -4645, -7002, -1205, -1028, -353, -5516, -15089, -18969, -5630, -6250, -9316, 490, -412, -13137, -13668, 2471, 14645, 3841, -2971, -12591, -379, 2296, -10141, -18504, -11561, -16712, 4114, 5651, -2425, -9241, -13544, -13877, -17763, -18426, -6205, 10474, 10322, 5308, 6358, 15705, 714, -10189, -13314, -25728, -23663, -21685, -20872, -11858, 3612, 14185, 7227, -613, -327, -2944, 3810, 4416, 6715, 14898, 11928, 20040, 11025, 11800, 20654, 19184, 13796, 12973, 10503, 12411, -3004, -16659, -13730, -9119, 486, 12652, 9129]
7406I129q878j0296p481k719n306Q139J5738R591n031p325J738r001q655j15n323
7391b5795l555J8979M878n74p410j4524j0782Q501K200O247J0478L07j212l223
7377a5485r865Q033N369j049n019J0452J0789j2816j1832M080j1347M472M326
7364a9892M997O078J3492J172o535j9048j2222J2207q242k942K698L610L402J2303
7350h922L062R241O923j0263k121k150m986p074j418j4044l121J5012J0897J953
7336g011J793J552Q8J1353p162k0354n158J4818R077k33l334j2181M130K415O034
7321d173K555p389M87l733j398O250j931N810J12j387o362o608J4587j602n407
7306a0189N849R630l479j8562q894o657P142J3617J8883Q975r455j8178o238j602
$$ y = [9129, 251, -10045, -17526, -20245, -25551, -17412, -1674, 7917, 2886, -4439, -2701, -11702, -20357, -20472, -25795, -29350, -10371, -5493, -6067, -13477, -28001, -38783, -30282, -28082, -21835, -11357, -11050, -12262, -15485, -25350, -17317, -11948, -12997, -18016, -7564, 3225, -9591, -21423, -17343, -28690, -24218, -19892, -14895, -8817, 4675, 5847, -688, -19736, -31958, -19751, -27993, -30935, -28237, -24627, -21225, -8922, -5860, 3381, 10304, 41, -2080, -4230, -9216, -16290, -17708, -31752, -34873, -19861, -8964, -7011, -5218, -3666, -3578, 7775, 613, -19741, -24899, -10081, -1004, -1237, -4571, -16752, -12622, -10207, -4173, -1618, -9007, -8520, -12253, -13651, -7401, -9332, -3522, -3410, -4797, -11159, -17767, -3180, -4782, -10189, -4340, 5290, 1811, -16751, -25645, -32302, -25160, -11543, 7340, 16315, 6860, -11318, -17556, -19158]
7292a9158L775M390n02R097J8261j0864q468k291m46N694o467k42o04R722J6730
7277A8627K46p287j6333o724P203J3954L52j0597J833L137j4228q5J0206J3072
7263A3376R0r927p234j2704o795J936J8853J2563J0243P821m096j9496p420O644
7249C854n141n520J689O150L795q039P653R780j5634r45n145o083m314Q501K516
7234f883l588J3472Q572j0107k5410o173J695q935J1530Q123j5308o26J5398J1031
7220g209J0539O983n386q436j6972p230K3027J4206q551L17N537j1804K778j765
7206c966j6051K698J1109N219o869k27n541n322k401n463N810q31N416J1216N403
7191B00j802j0258j1503q219o540J3929J8935N536J048O201R98n438n096l303
$$ y = [-19158, -15383, -10993, -11495, -2398, 15863, 4999, -3469, -5760, -6206, -512, -6979, -7221, -7825, 1897, 18627, 18873, 11586, -4747, -11471, -4268, 9686, 10038, -559, 1274, 4411, -9817, -9902, 304, 13376, 13466, 3539, -3695, -16399, -23194, -21258, -2405, 10158, 20401, 28222, 24126, 4630, -2790, 3854, -1287, -6807, -5118, 1032, 4827, -3212, 4441, 14221, -1413, -2358, -7503, -13586, -17900, -9399, -6883, -10471, 3001, 11573, 1466, -23944, -30117, -28422, -37357, -25827, -17704, -33012, -33638, -18240, -7209, 3330, 10313, 4927, -3509, -20481, -27711, -4684, 9522, 971, 1288, 6825, -4979, -2201, -3966, -20017, -17319, -6210, -991, -7860, -8087, -13628, -18950, -21351, -26814, -21004, -21835, -16419, -5203, 200, -1602, -11860, -23363, -31582, -38122, -24193, -5258, 278, 1326, 7527, 8525, 3087, -2009, -5312]
7177e312k599K137j982q998k915O591m858r106M643Q676R053n268p992j558l371
7162b2859j4064J415Q081N939m986o378K135J1632J2515J3639m23k460j665j2663
7148a0142q788J8051Q7P842N308j446l661O02m651q51k76k020j2344m496O121
7133a0664N47p569L188J4023M732L164l973j1485n287m755n728J1694P247k505
7119g371O169N766L242n482k058j0685N890k953j3510k440N87M694P691K870J4435
7104F845l029j0126k828j131J4241J0686l566j695m444n080q785r365Q937R115
7090b25P478R57k0180m896q687o823J1614J0727J4049j6452M686k400o083L62
7076a5873K405J1650o512j339J0413J047Q026j0975p235N165J723J530k2870n964
$$ y = [-5312, -7911, -5774, -7756, -16754, -19669, -13078, -17936, -27042, -22399, -13723, -4670, -9938, -17930, -19488, -22859, -36923, -35508, -27427, -21488, -26474, -32852, -30717, -19085, -6570, 7069, 6646, 4186, 2521, -10142, -18930, -879, -792, 7050, 12358, 10912, 7251, 7853, 3202, 2351, 2075, 55, -12289, -16785, -10664, -10117, -17686, -14498, -475, 4257, 7421, 3448, -8037, -13324, -18079, -23807, -12113, -4866, -7371, -1202, 4564, 7806, 2324, 266, -10419, -4529, -7482, -20992, -23432, -22845, -18151, -10460, -7590, 6845, 3816, -6310, -9138, -10269, 3972, 14658, 11092, 9397, 4953, -127, -8912, -18277, -9340, -225, 7253, 8210, -11970, -16866, -25553, -32376, -20762, -10035, 4014, -12438, -7752, -10152, -16235, -15873, -13468, -1818, -8330, -9669, 744, 1791, 9817, -1158, -8393, -3228, -1505, 25, -22845, -28809]
7062b8809R669J984R371l027J883k360j8372J3236J7161j07q104j5450Q34J6026
7048f065p816N01j68j724M67m888p701J531l01O574l552m473l320M196l608n236
7032c5583O286J3389J7410K113R147M272j4693m052j371O549j500J550l739J648
7018A426l131M690j385k73o241M827J6621J3364j2039j4933j3386r444o116J050
7004b4970L439O414k888m768J5539Q382n117j6794J046N45m480j4308J0888R815
6990a7257j573k804J1682O563m876o514L711O796m45o100q872N533k947m10P139
6975a0374l375R031L200l528k585m570O162m541j0402K360J5456m297o30J2713
6961D620M66j0263j5286J0578o053j70J0168J921p39J141o928Q378J5947j547
$$ y = [-28809, -19140, -17156, -7785, -10812, -8929, -11289, -29661, -16425, 736, 629, -7475, -22925, -22091, -6065, -13881, -13380, -13548, -15272, -14805, -19693, -27394, -25863, -26164, -19590, -23142, -27615, -30935, -26739, -30347, -35583, -29297, -15908, 1502, 3615, 12762, 17034, 2341, -1711, -3082, 3467, 1967, 3517, -222, 1426, -1705, 2985, 1600, 1327, -4914, -87, 16534, 29898, 17859, 2926, -10460, -19904, -26020, -24970, -21531, -15117, -18005, -22773, -7234, 1148, -3969, -20763, -19717, -19172, -23652, -37960, -27072, -17257, -18830, -21634, -9952, -3389, -8265, -14779, -11068, -4272, -4717, -10817, -19689, -14156, -17103, -17513, -10374, -13749, -4718, -1518, -5046, -7631, -12201, -6039, -10580, -20982, -18622, -3166, -7463, -8093, 4620, 5086, -5177, -20463, -9885, -15938, -16108, -5940, -4019, -4758, -3617, -10545, -2167, 13780, 12233]
6947A2233j2174r589P518R279J428j1117k082k221O30P0K831j0486j3450k887
6933c0017J740N981Q463j968k150l572n640Q319P586J2024O515q468m182O518
6919A149M200Q764J547k2591o573J503O550L233l036o940l241J0456J4471j3490
6905c998j3681P243R910O444k522q982q72N095j363j1477j404q708j0708p260
6891d2283J3175P960R822P326q951l3k530L376K007k522n941q180K314P647p916
6876b4729p433M997J8929R835N568J561j171L239q003k064q194K843O57m603j744
6861a0312j2401K567p58M226Q682N716k32l004k406q372r260p163R185J7587L633
6846b312L903j592k092o819j7164m199j4220L425K1870K6367O824j7370q643R810
$$ y = [12233, 59, -9530, -2012, 7267, 8695, -2422, -4504, -6725, -6095, -6025, -3194, -13680, -27130, -30017, -28277, -22296, -13833, -15801, -17951, -21523, -27163, -18844, -11258, 766, 7281, -1187, -5369, 1149, 5349, 14113, 15660, -6931, -13504, -12001, -5451, -2218, -5254, -12194, -15435, -4979, 9492, -3998, -17679, -10436, -526, 5918, 3396, -5586, -6458, -1363, -2726, -14203, -15607, -24315, -35023, -42283, -29108, -21148, -11326, -4000, -12951, -12984, -15514, -12138, -10131, -12653, -18594, -26774, -24460, -16813, -24729, -32162, -27165, -8236, 1599, 7167, 8728, 7557, 10796, 2793, 729, -7465, -4622, -3965, -8568, -10312, -22713, -20146, -20904, -16678, -7996, -2280, -2512, -5516, -7922, -16294, -25554, -32717, -23532, -5945, -2312, 1591, -1, -2093, -8912, -26076, -30275, -44495, -41070, -19200, 7167, 13991, -3379, -12022, -2212]
6832b212J1244J1186J1219j708j8701p985n739k300K281Q606K899j2286j7319
6819b0815M564O764r828J771R186l348p416N815M616m798j4072J6520K5228p704
6805F483p067J2102L038j072r831k390m125j01o114q240j6859L960J5873J1866
6791b477Q47m538j8180K950J5376L219q09M021m890K881R436K620k0049j3221
6777b2814n671L819O60R440J6245J4891M112r108j8542l366m868J6437J0553o209
6763E579k578J5217Q946J0565J6597L8901L4444K525j6401k0493j7179k1647M827
6750E9303R745k5611j7846q49n670l709j1018p342L948K517N822Qn128m432o62
6735i24J4598N498J5695O314j1925j083j3943j3982O536j858n266r78J3987O875
$$ y = [-2212, 9032, 20218, 31437, 29729, 11028, 3043, -2696, -4996, -2715, 5891, 8790, -3496, -20815, -16251, -9487, -19315, -17544, -8358, -11706, -19122, -13307, -8691, -13489, -27561, -11041, 14187, 6483, -584, 11518, 14556, 13484, 3653, 1263, -2862, -2963, -9077, -17317, -34176, -30216, -14343, -2477, -1630, -6168, -24348, -21398, -6022, -2803, -3612, 409, -4481, -1600, 7836, 10456, -9593, -22814, -28485, -24666, -24006, -14566, 1679, 16570, 20682, 11574, -6968, -10334, -15202, 1235, 11788, 5579, 3001, 18218, 27164, 37729, 54326, 93227, 127671, 130196, 113795, 93302, 76123, 54476, 59303, 69048, 43437, 25591, 24742, 19072, 15363, 4345, -2997, 951, 3468, 9290, 9298, 4170, -262, -924, 13674, 19172, 34867, 41181, 29256, 28173, 14230, 248, 6784, 4926, -340, -1318, 12669, 19544]
6721A9544j1731n892r793J3736L664N470j0060Q766m48j1165l741j0951M804L773
6707d024J254M403m120o743q977P949M765k371L853J2899j991l102j2407o521
6693a5133N546K065K716o68n443q484j4329J798R326N311O30L031R138J0034Q485
6678A4023k4817o066J4203n565j431J1049O296n587k524P65n670r144q038R92
6664b1514M928j824J619J0371r736N94Q387n335l258K95n96l809m800q87J7456
6649h109O088k343k0N287m909m302Q885Q036n244j4822k065J3627n86P79J834
6634B136J1808K125j0895m247J868J949l778j813K312N75Q324O966N307p130m193
6619A1314m759j1619o690o595k233J0602l064q206m765q43R20K803J876n737M656
$$ y = [19544, 7813, 1921, -7872, 5864, 9528, 14998, 4938, 13704, 13256, 2091, -1650, -12601, -7797, -4024, -2770, 1633, -2487, -9230, -18207, -10258, -5493, -7864, -4011, 8888, 6897, 3795, -8612, -15133, -9587, -7522, -4806, -5474, -10917, -19401, -33730, -31932, -22606, -17295, -16665, -13634, -4496, 5538, 14023, -10794, -16860, -2657, -8222, -9653, 1396, 7692, 2105, -419, 346, -5324, -14468, -22506, -21514, -16586, -18410, -16791, -6420, -16156, -15562, -7175, -12510, -15768, -15473, -16069, -19878, -24678, -25565, -8109, -2021, -4364, -4384, 903, -4006, -8308, 577, 8613, 3369, -11453, -13518, 109, -477, 302, 2136, 13944, 16069, 5174, 927, 2795, 4744, 966, -847, 1465, 2040, 10364, 17330, 22637, 15507, 11314, 6555, -5064, -11754, -18349, -20582, -9980, -13044, -21250, -26015, -26858, -25938, -23135, -21259, -26996, -22340]
6604b2340J6101k300J55L652m38j4399l089p556J2250K4207K79K996N141o975
6590G684j6047j3916o003m163N432J5202m772j714P053M975r285j0135N285J2065
6576h339L522j4099J500o604l212M025J1499N544p907L85J4805M925o391O010
6562E663P560j1072p077j049K019O10n032K672j756L14Q969O68j9193r385J3392
6547a2697J0980k854M232K480j6643j1697J6121p682q769J3340J0728j4950L163
6534a4248J967l280p91l333Q571N399L706J105m28o239l774j329n794J068j093
6519a8493m013J594p810o564R488J2420J392j991k224k67N231Q371P19j1838m679
6504a8664J2804R626P888O743m816r630n825n768R532L319j2901j1022K582k671
$$ y = [-22340, -6239, -8539, -8384, -4732, -5170, -19569, -22658, -30214, -17964, 6243, 6522, 9518, 14659, 7684, -8363, -22279, -28282, -32445, -27013, -11811, -16583, -18297, -11244, -6269, -15554, -25689, -20404, -8339, -4817, -18916, -17416, -24020, -27232, -23207, -11708, -6164, -14071, -13686, 1119, 6044, -347, 5663, 13223, 2151, -4926, -5975, -3956, -3346, -8378, -5706, -7462, -7148, 1821, 2489, -16704, -26089, -12697, -1717, -4571, -339, 2141, -14502, -26199, -10078, -17760, -26529, -13189, -2461, -17411, -14248, -12281, -15561, -16352, -19685, -11114, -5715, -2009, -904, -1332, -7571, -11345, -12674, -18468, -17400, -18493, -22506, -20912, -28722, -35286, -25798, -13378, -11986, -13977, -16201, -16468, -11237, -2866, -2147, -13985, -18664, -5860, 3766, 11654, 18397, 13581, 3951, -1874, -7642, 1890, 5209, -7692, -18714, -16132, -18803]
6490a8803Q663J2740J194k951J11m657k160M852R051r410j0506J5475j2672r892
6476a8965N157r001M375O096j309K011J3029m572K980J2544m529p7l165N420k844
6461G150j5424k406N79n995M571J3103p397Q290J2519o208o024N554J0585j41
6447A8756j0769J088n65j7218j5461K884J3833r223j3637L11O528O022j394q374
6433b7219J705L477L407J6461P062M452L740q018o623n863n562J042j765L128
6419a0576m998l679o87J1375J1618L65n623l897J4045M393k2054j671R697N812
6405D120j1275k608K928P666M123j617l252K062k44l592k976j053l529j2668j908
6390b3823M515P576P004O323O884j0507J127J4865r589r056P198m891M495p47
$$ y = [-18803, -10140, 2600, 3794, 843, 954, -3703, -5863, -1011, 8040, -1370, -11876, 3599, -9073, -18965, -13808, -22809, -18434, -12338, -13647, -11636, 1393, -3179, -199, 12345, 7816, 7739, 4574, 9994, 7150, -8274, -10680, -10101, -16096, -11525, 1578, -5819, 2471, 14990, 8782, 2758, 8312, 18897, 18756, 7987, 9075, 8510, -8708, -24169, -21285, -7452, -16675, -30312, -30001, -23473, -17451, -18845, -27219, -25514, -22037, -18630, -2169, 4893, 9345, 13085, 5067, -1556, -7419, -12981, -11939, -13704, -10576, -15574, -19253, -19940, -8565, 3053, 3418, -2205, -6102, 7943, 12336, -9718, -11389, -1692, 4120, -7155, -9763, -6835, 831, 4954, 3337, 85, 2147, 1903, -1689, -4665, -5718, -9247, -21915, -23823, -19308, -11732, -4728, 1595, 8479, -2028, -901, 13964, 4375, -4681, 2517, -2374, 2121, 1374]
6376A374r953m009p089Q736r53J2397o849J617P447Q084j2663j3990m99j542K130
6361a5762m111J1560M196L15K757J650n61l47j0908k333J7028R621j1562l913
6347b370j1876n860J0214M159p786j586j2552K2455K4216j273j728j4491l765
6334b243J151n279m024N183Q629N488o157j6351q57J4903J405M66N399J7715j3517
6319A1911l10Q250l42j2035j3474O080N645J813j095k924l847n509l641k146R418
6304b206J2412J29r838j0863n157j730P265J6020k917n199R46J8086l589o701
6290F658K441j0800O136P887k316j9646j7108l752N014l092J1707K479L670o739
6276a7461j822M54L612J4603j897n220J1065N192J0390m904J12n646q227j1991
$$ y = [1374, -8579, -12588, -19677, -10941, -11894, 503, -6346, -4729, 2718, 10802, -1861, -15851, -16350, -17892, -15762, -19873, -8313, -4117, -3802, -1045, 605, 44, -303, -11211, -13544, 3484, 13105, 1543, -2370, -14246, -20106, -9892, -5733, -13519, -15105, -27657, -5202, 19014, 17741, 16013, 1522, -2243, -1092, -6371, -10395, -5212, 3417, 8905, 2748, -13603, -14460, 443, 1848, 2314, 7713, 25428, 11911, 11601, 19851, 19509, 7474, -6000, 80, 5725, 7538, 6443, 3519, -328, -5837, -9478, -11624, -2206, 10206, 10335, 497, -10366, -15523, -17253, -9988, 6032, 3115, -2084, -1138, 16948, 13359, 6658, 9099, -1701, 4435, 12322, 10006, -9640, -26748, -30500, -25486, -28578, -16871, -14392, -10722, -17461, -19283, -18829, -15217, -614, -2511, -7731, 3334, 8526, 18916, 14012, 14124, 8478, 251, -11740]
6262a1740n81J2716q438j720N588J182P854k835k167K02J6478l078k1323n295
6248a3157O507L567J4036j252j748K766j1713q905q121M403p789l718P996J1360
6234e768q40Q802o832q506n364M769J558q363k190J34M857J1008p928j6242L333
6219b7572J5631O200k533n572k109M531K624J83p962q03P996K6576q129k3777
6205a4716k4906M212K2453J0382n680J1029K1655r53o380K957R137j91r339j3559
6191F101j2887o092J4361K0510R37m188N451R861k211k9792j3056O790P863N189
6177H837N771o258k4880q847J2162K5314K524K54q895j0756j422l861j0200j956
6163b2213r404P63O983J3887k20K616J3151l239m841o115J6494R585m243m416
$$ y = [-11740, -12321, 395, -8043, -9763, -4175, -2993, 4861, 2026, -141, 61, 16539, 13461, -7862, -13157, -6650, -3083, 10953, 9701, 7953, 10719, -994, -9899, -18020, -13617, -21406, -25124, -17128, -5768, -6608, 2194, -4638, -13144, -18508, -13739, -12181, -20544, -22734, -22600, -17743, -6735, -14663, -30905, -27572, -11941, -5741, -8274, -13846, -15955, -11424, -8800, -8617, -16579, -17382, -9386, 17190, 9061, -14716, -39622, -35410, -12957, -2575, -8255, 2774, 24429, 23476, 17096, 20053, 29190, 28999, 19660, 6101, -6786, -12878, 1483, 21993, 22930, 18742, 24193, 34054, 31843, 2051, -11005, -4215, 3648, 8837, 14608, 8350, -16530, -25377, -13215, 12099, 14623, 14877, 5982, -4774, -6196, -10057, -20257, -22213, -31617, -30854, -23871, -9984, -10204, -7588, 5563, 2324, -2517, -8632, 7862, 17447, 13204, 8788]
6149H788o30M295n890k847M245j0103n336J878M827o950k2586k0054j4155J847
6135f2671l55O815L945J4780N510K0370J5750M614j6608j4156N620R91O597J6413
6121G615n15K836n010K516N462j2271P829K258k9597r673M262n395P333O526J5499
6106c25J847k1041p237o384Q74J3470P911Q984m233r619J411M196L990J1434P652
6091A2930j4234j3924m299L885N430O24J1438J3446J263n301j0209j6638m909
6078b0498J3786N210L793q610L654L413J535J908j2442p95p047L13O05j2363Q163
6063a9375Q729O964J4006r658j6355r12K849J595J3452l425P39k92Q050N756o886
6048E237j4720m776j366j552n841J818P680J1015Q991j589O241R575l543j2194
$$ y = [8788, 8158, 12453, 6563, 3716, 7961, -2142, -7478, -5600, -773, -7723, -30309, -50363, -64518, -62671, -63026, -56211, -52266, -37486, -31976, -11606, 4144, 8758, -7850, -22006, -16386, -15395, -8798, 7615, 7100, 9936, 4926, 7442, 12904, 633, 8462, 10720, -18877, -28550, -24288, -29683, -22350, -15824, -325, 1522, -19519, -26756, -33140, -32266, -18796, -10885, -1901, -6134, -15753, -14342, -10146, -6156, 5278, 12930, -1304, -15228, -19527, -15642, -10212, -9588, 1850, 15296, 16559, 11258, 1049, -15589, -20498, -6712, -1502, 2291, -6319, -2665, 748, 2283, 4191, -8251, -9046, -16093, -15780, -15175, -27538, -19375, -10646, -3682, 10324, 666, -15689, -16601, -13752, -12157, 1295, -2130, -1391, -1683, 6367, 12123, 5237, -9483, -14259, -15625, -17177, -23018, -21200, -13520, -2505, 6486, 4897, 11138, 20713, 17170, 4976]
6034D976r593q41M480P530k388j3140p494q069j5695J0222J0557o623L607p263
6020b9734L341J0374O716J241m302O2o031j1163L959P033O434j169J0316L54m244
6005f813n417J8630R191o068n530j5594k727l678j888K653K613K530l775J1745
5991d128J1855n552k5971j0654M958K916P103J0016K965K646O389J37j050n989
5977d359j8589p278n916J012Q352J0206J4172O060j1594j6941J0689M434K758
5964f994m257J061m001J2019j572O062k584k0675r187j4238J1082J6016L641j902
5950a5529J4761k277m331j992j008L22J1046J7574R766k1632q375J3630P304k954
5936A6305m526j4179p122J731K901o485m7p688P819J2484L0j913k692J278j0679
$$ y = [4976, -4617, -5458, -978, 6552, 4164, -8976, -16470, -24539, -40234, -30012, -19455, -26078, -22471, -29734, -26393, -16019, -9303, -8062, -12364, -12302, -18333, -29496, -25537, -18504, -12070, -13239, -2923, -2569, -6813, -12230, 6400, 15591, 9523, 3993, -11601, -14328, -18006, -19894, -17241, -14628, -12098, -15873, -4128, 7727, 2175, -23796, -34450, -29492, -26576, -19473, -9457, -6492, -3846, 2543, 2680, 1630, -4359, -22948, -30226, -36142, -35130, -26778, -16572, -2400, 3660, -7934, -24875, -14186, -9752, -6994, -11251, -10190, -14191, -2172, -3744, 2318, -266, -20941, -30128, -44366, -33284, -17268, -13627, -15529, -768, -3045, -7376, -9368, -10376, -10054, 992, 18566, 28332, 6700, -1675, 11955, 19259, 16305, 11779, -2400, -9522, -7791, -4890, -11375, -11422, -19110, -11291, 1193, 1223, -690, -3382, -2104, -12783]
5921a2783L843J4388O2j1578J316P209n63k627k271k179j6422O15m139l809J5834
5906a3104J1484J1912j1228j2125j304K019p568l00O129J2151j3240j742l208
5893b0124q217j895P913J0992M630R017l803n06j214j0960j543O18j65J0814P418
5878B975j9354k0506o3M715J6537K2770Q556l525q28R9j6617J0187n751j0546
5864a1351M874j248l625j859q46L718Q062M369j6912p138M922k54R892M928K561
5849I3O055n252p342m008J2923k637n342l940p374Q71l247o857k344M544N244
5834a8613J2672l510L732O850J950O630P256q424p425p249N022n406j0765J618
5820a5662J6439N122q39l712q53R779J790m81k1912q719J2083m92N651n191j187
$$ y = [-12783, -8940, 5448, 5510, -6068, -4752, 2457, 1894, -733, -3004, -5183, -21605, -20990, -25129, -28938, -13104, -1620, 10292, -936, -13061, -14365, -12346, -19914, -20214, -14085, -1934, -15174, -16916, -20124, -28341, -30236, -22323, -11331, -6701, 2316, -1487, -1993, -3207, -14167, -15710, -15092, -15257, -4443, 2975, -16379, -36885, -36948, -32233, -15696, 7074, 15630, 12105, 11277, 11376, -5241, 4946, -805, -11351, -6477, -7725, -11350, -13209, -14055, -10337, -2275, 2094, -14818, -21956, -17034, -17288, -7396, -2468, 93, 6148, 896, -6446, -10454, 2469, -168, -5510, -9450, -16824, -15953, -19200, -26057, -28401, -23857, -18613, -5941, -9451, -5719, 1131, 3081, 9711, 16967, 8543, 1118, -6131, -1109, -6515, -17280, -15662, 777, 5899, 5060, 1348, 495, 10274, 12064, 11583, -10329, -19048, -6965, -7457, -1806, -6997, -8184]
5805h184N823R112m564K908q73R18n567j1655J4136K859o257J970l684p229q08
5790a1095J826L709o588N369Q84m121P489k937o031m29l743M789r616J2141J2728
5775D375r32J146k080q986P650k060p212J202J1980n207m076j1439m729k445J6881
5760e932P169q837N946l321P820Q60j4858n886m899k750J6315K823j0621J21j1156
5745b7206L135N062K410R67J907n648l480l78J567K4694L201n250l115K802n833
5730e165J30j2833J330J1526q431R116J0201J00m431p137p706r672L750j0420
5716b9642j889K484R188R386J5611l306n735q971K536M740O135q26r010p29M81
5701i547P995n611q201j2969n346J3053L186L879J20l251o697M767j1743j3925
$$ y = [-8184, -2361, 6751, 2187, 5095, 4222, 5140, -427, -12082, 2054, 4913, -1344, 626, -3058, -10287, -11095, -9269, -5560, -12148, -6779, -5895, -10016, -2527, -5464, -11495, -11924, -15667, -10878, -20494, -8353, 4375, 3443, 4589, 2509, -6477, 1173, -887, -8099, -6897, 5083, -124, -4200, -15639, -20368, -22813, -5932, 1237, -7600, -1654, -4975, 2845, 3705, -11153, -17039, -21938, -24688, -8373, -5550, -16171, -16050, -27206, -24071, -19009, -16599, -15632, -13725, -19373, -22853, -23231, -21664, 3030, 6231, 981, -2134, 668, -5165, -5035, -17868, -16538, -5012, -13443, -4327, 5874, 5974, 1543, -5594, -13300, -22972, -19222, -29642, -31531, -29047, -19859, -10473, 5138, 1832, -3903, -12874, -10338, -5598, 537, -289, -9299, -10028, -9547, -1552, -7163, -15364, -28333, -33679, -20626, -17440, -13561, -13441, -16692, -23389, -18622, -30365, -44290]
5687d4290M902J7196J9323J293p595K515M112p779p008k251j3053j912P020K218
5673b5309J1056J8789J5445l904q512l214l327o259J454o766M67j304J935l521
5659a2970L148M448o302k404N056R912q519j9134r346j2513N850Q765Q534M834
5645b0641J092M795l075J0780o902q44N079j5411K1436J8949j960r70j745M076
5631A4659M617j6989j0230r239O27r955J319J3738K914r471J539P558J0414J7677
5617A9178P137r312j3446m993m978K477J99N323l161n646n859p29k456j898j157
5602a9321O928j787p837j2291k566J6342J0858L234J971lj5927J085J3378J1238
5588E302K903m200r046j2523J953j390P86P751J1673M064k200L04N561M895m494
$$ y = [-44290, -39388, -22192, -2869, -1576, -9171, -6656, -2544, -10323, -17331, -19582, -32635, -34547, -27527, -25309, -14253, 4536, 19981, 16077, 7565, 4351, 1024, -5235, -3781, -10547, -10080, -11384, -9449, -12970, -9822, -5374, -11676, -14080, -9024, 888, -7631, -26765, -36111, -48624, -42774, -34009, -25475, -20641, -19549, -14754, -17829, -7049, -13951, -14795, -9716, -25127, -3691, 15258, 13298, 12328, 10583, 14659, 19276, 2287, -7943, -17182, -16555, -26510, -25191, -11453, -8539, -18010, -16471, -8913, 1501, 19178, 26315, 17003, 3557, -1436, -6414, -3937, -3738, 1585, -1576, -7222, -13081, -13810, -16266, -18164, -19321, -12393, -14180, -22017, -34308, -36874, -20532, -9674, -6440, -4469, -4472, -20399, -19314, -5936, 5302, 8205, 4005, -5041, -17564, -15611, -17001, -16215, -8464, 3209, 7273, 5073, 5377, 10938, 15833, 11339]
5573A1339k1070N634p313L360J835R211q374r874N844l892l99j268O927q602j047
5558a7689J4955R933n527j4519k419l710k0112O271J7445J049J0336M098p51o74
5544a314m57R866J0494J09q249L486J578k0560j6244J068Q346O468M580O028r828
5529d629j0920n67l351J3626p45n098M34l846n165j492N426J0656J8500J611O20
5514A5060L028N737l029p141n479m367l380J715j1803p230n217Q138K979r319
5500b0308j1891k215J1985J591k337j829J0499P785o50q659N360l142L68O630
5486f813Q099O65L426l548Q37m518k750Q396N775M474O857P494k219r125p22j0296
5470F032n905m171J1271Q76o513J0478M35o252j8011j4149N637J7310M087K1362
$$ y = [11339, -9731, -4097, -11410, -8050, -6215, 2996, -5378, -15252, -9408, -13300, -13699, -14967, -8040, -16642, -17689, -2734, 7199, 1672, -12847, -15266, -18976, -39088, -32817, -15372, -14323, -3987, 111, -640, -1314, -1771, 8095, 18589, 18698, 10449, 13935, 15513, -5047, -21291, -20223, -11877, -5409, -829, 5199, -4629, -15549, -16116, -19467, -5841, -6586, -11684, -11250, -15096, -20261, -21753, -16327, -5671, 12829, 14440, 15060, 18088, 23825, 20796, 13655, 8176, 3809, 429, 2144, -9659, -16889, -22106, -13968, -10989, -20308, -32199, -34414, -22429, -20838, -23175, -25004, -14505, -6720, -7370, -16029, -10669, -13811, -13443, -6813, 1286, 1951, 5377, 1829, 2666, -1852, -4602, 3794, 9569, 14043, 20900, 28394, 26175, 17050, 16328, 6032, 127, -4044, 7227, 8103, 1590, 12068, 12503, 6251, -11760, -25909, -20272, -2962, 1125, 22487]
5456B2487p306j3999l220m556j128M913N879p781R084J3087K829j3600j3111n67
5442f989J0080j070N830j6669j288K1804J8628q941N641j2955l053j7311L25J850
5428d118J0231N972J1510J225k275P176r721j3789r563P737J421m350M4J0385
5414A1885J6570Q505o382j3998j2945j051j3196L841J1884p773k632n404l618
5401a4314Q791O290J87p169m378l905R269J4531Q408l233m814k8480j3349P153
5387b5013J2899O460K008J3372k839r003k008J7379m905j0018j4002n539K0514
5374f95J857j0913n190l865o738J7612R1q272J779M98j239J805M029P200N783
5359C742n237j3122k631P845j0723o747J3336J6699p678j3671l685l495J3932
$$ y = [22487, 15181, 1182, -2038, -6594, -7722, -2809, 3070, -4711, 4373, 17460, 20289, 6689, -6422, -6989, 3091, 2021, 7851, -8818, -10106, 11698, 30326, 21385, 27026, 14071, 11018, -6293, -5968, -4118, 6113, 12085, 23595, 24820, 22545, 29721, 20000, 6211, -3352, 4385, 5806, 1456, 1500, 11885, 28455, 36960, 30578, 16580, 3635, 2584, -10612, -6771, 5113, -2660, -5292, -10696, -14314, -5523, 767, 954, -6215, -10593, -14498, -5229, 9302, 17710, 14477, 9663, -18817, -32166, -25013, -12114, -5654, -3646, 9726, 6887, -2116, -4124, 13255, 8350, -1668, -15670, -21209, -695, 1162, -9751, -14941, -18806, -25544, -7932, -7841, -16113, -14334, -13836, -15075, -13270, -9241, -2041, 3742, -1495, -14617, -17248, -9403, -20126, -26873, -13537, 3162, -4516, -18187, -21872, -25367, -11435]
5346a1435j665L481o43K3339O432n831j3431l412K348r007j453p296m023J5315
5332g281R494M064n04N255j906j0934k3482N697P999J2959R285j6325j0691N757
5318a0613Q9l394K1308J3496Q336J557r049o96m034j5199k737o617j2106n169
5304b4828l092J548R837R840J2806L689M136k218j063q034j209R38m180n268j613
5289h711q639j77J4729Q795l750K41J652R312n925p143q027L613l768p500J9788
5274D490J5315L062j8333j0304M883J7541J3696p781Q74k2005k3137j303J3363
5261i639J746Q565K561K164J899J2181m92n094j7232j852l22j2165l44N440J2519
5246f5Q099K303n115j5893q094J3148J5718q343Q673M743q096J640j5176k903
$$ y = [-11435, -13100, -9619, -10262, 13077, 19509, 13678, 247, -3165, -817, -9824, -11277, -18573, -22596, -7281, 2213, 6277, 5773, 11028, 9122, -1812, -25294, -19597, -11598, 1361, 10646, -5679, -16370, -10613, -10524, -13918, 7390, 20886, 29222, 30779, 21730, 21034, 17000, 1801, -936, -7553, -19659, -24828, -27920, -26372, -16535, -6695, 6111, 9800, 13936, 11718, 10655, 2621, 1412, 2350, -1830, -7098, -8711, -17350, -17527, -2798, 5997, 2247, 2488, 4140, 13452, 7527, 384, -7643, -4030, -7798, -15298, 4490, 19805, 22867, 4534, -5770, -887, 16654, 30350, 22569, 23443, 1438, -21699, -23002, -9639, -7893, 672, 3233, 5397, 7296, 19477, 18985, 13891, -3341, -5193, -5515, -17680, -18024, -12584, -65, 8034, 10337, 5222, -10671, -18765, -5617, 10101, 1758, 10431, 15174, 7078, 8718, -6458, -9361]
5232i361J7683J6707n179l162q842q746l870n322K940n118r356J2177J5000m370
5218A181j058J0631Q816P890r124J099M472j0440k1070r363P747L106p508p267
5204b0888L311J2346P949k367m419n688O7l720J1950R792q477n171L956o07O107
5189D141L877l541J253J2885M489K167q033j6825k148N285q355m313J2670L338
5175F890l069J359J527K020j9114p33J1337Q382j9619k70J0951K852r741o553
5161a3781N794r890n20N33k233L430k124k620J1112J7957Q31k044p288n668j1797
5146a8308L220P737P160J0511O914M152j928q694J616k005J1247j681m998m813
5132A0130l411k314k594l461j940N790O149p14L513L377r523k0044P931N701k969
$$ y = [-9361, 8322, 25029, 19850, 16688, 7846, -900, -4770, -10092, -7152, -12270, -21626, -9449, 5551, 1181, 123, 10754, 19570, 27460, 18336, 19435, 23907, 13467, -7603, -16966, -9219, -6113, -13621, -20888, -17577, -5231, 2718, 351, -4068, -9756, -9689, -13409, -1459, 8333, -144, -5315, -1359, -1966, 4141, 8018, 4477, 5730, 18615, 23104, 25271, 17238, 413, -1735, 3550, -4805, -9118, 3552, 6890, 3821, 5180, 6707, 8727, -10387, -11120, 217, 8599, -11020, -11290, -339, 2513, -7228, -13781, -7987, -17877, -18397, -17864, -20097, -16667, -18791, -21411, -10299, 7658, 8489, 6445, -843, -6511, -18308, -15088, -7351, -191, 10320, 17234, 21386, 19458, 10764, 12380, 10375, 21622, 19941, 14943, 10130, 6719, 4405, 1811, -1650, -3590, 2200, 8349, 7635, 11148, 14525, 5002, -15042, -7111, -1410, -4379]
5117d379J548j0915l527k03J6977J2844j2825N574n802q102M222o678m968J77
5103a6057q899M384O81K263R240j094M577l551R82P540j1407m116P941j366M355
5088d527O078o203R254Q295n550j1417j1216o35P021O410r251k820R111K513O399
5073C462q726j8583J559K812N44J1928R608N368M995P885m057K8M012q864m65
5058A1506o725k3265N462J2200j5871r916N961J3702J2750k205j729o054n05J217
5044c472n469q416r406k571j2052R526O223J1150k07j3609p428J0995O365P689
5030a0682J468j2414Q983k890n135N349J3282K874j924p32J097M934J1277l702
5016A1785j946o574N811J5636N126n552j581K46J889k802j5841n973j049m978
$$ y = [-4379, -2831, -13746, -17273, -17476, -499, 12345, -480, 5094, -708, -8810, -4588, -11266, -16234, -16057, -24956, -20572, -19891, -17628, -8388, -9482, -4905, -8456, -7474, 66, -11341, -15457, -7516, -8882, -4527, 1551, -4652, 4602, 12897, 7347, -4070, -15286, -15921, -8900, -2490, -11741, -14561, -5450, -2937, 3462, -5264, -23847, -22288, -19476, -18932, -7004, 2604, 7972, 12967, 20852, 16795, 16823, 20835, 11971, 11506, 4781, -18484, -13022, -822, -16693, -26609, -20648, -6946, 5804, 3599, 1870, -4184, -4689, -3472, -8941, -17357, -26763, -29334, -41386, -31860, -25637, -14487, -14694, -28303, -35731, -24736, -18371, -10682, -9214, -21628, -12645, -15535, -20670, -15321, -2039, 835, -1089, -1821, -724, 4210, 15487, 11785, 9839, 3265, 9076, 24712, 29838, 24286, 22705, 22951, 24840, 22038, 6197, 224, -825, -5803]
5002e803k152J0891J2485m643r007q503L007n857n955P926j998J1678J3637P579
4988B3285K355q87k1574r908M634j1379q175O283J2389K344L9K503J3768j5088
4974E89q501r674k579o82n741j527R027J3395L450M017N030k12m98M762q180o234
4958c558J1324k184j292J3460J1939l55O70q291p253p358r057Q557N699P12j2374
4943F39L355j269j3655J5480n113j4693m178J1916K077j6754j6582L230R199J6613
4929i735j0725K575J6018O227O208J7758J330r739p755Q22j261o041o307n009
4915e634l38J4M15k737l496P493L750k303J5588j1281M955N236p027j935j7218
4900a4518l185N800P707J0023l331o717o372j1267J7285n119L420k490p671n41
$$ y = [-5803, -7955, 2936, 15421, 10778, 1771, -6732, -3725, -9582, -15537, -7611, -9609, 2069, 15706, 23285, 25640, 24753, 3179, -6729, -2095, -13474, -21649, -15366, -2977, -633, -594, 1909, 15677, 589, -7912, -17586, -20165, -20847, -26588, -28115, -19088, -5693, -2243, 1774, 6804, 6592, 6094, 10856, 2676, -3558, 7766, 5582, 4290, 17750, 29689, 29334, 30004, 21713, 14460, 7102, -1955, 6602, 12301, 13013, 639, 3994, 2725, -10930, 4550, -563, -15256, -19434, -7518, -5441, -22195, -38777, -35547, -26348, -9735, -20460, -17885, -1867, 4360, 10568, 28326, 29656, 19917, 12162, 12984, 11723, 5682, -625, -5634, -5972, -5958, -5543, -8280, -11776, -4283, -533, -2836, 12752, 1471, 6426, 11662, 4635, 2700, -14518, -17703, -11903, -4196, 5827, 2496, -4221, -10593, -21860, -4575, -9694, -6274, -8764, -16435, -16976]
4886a6976N246L615j1201J701J2974J2168L115k079N642k65l319o387m208P949
4872G975L606Q411l697j956n7P043j094L834o803l534j9665J235N67o963n500
4857a6598m239n1R6k544J2283R448O239N564m750J296Q017j3561j3730R720O02
4842b208l382l129M406J1981p679j7521J129J1557n317m892L65J510j671o98l615
4827a9164N105M198J1462M644l212j4900o788J4J688M125P692L903Q37j1593l529
4812a5518l921m580k47K48L197j402j681L021J1906J5722n284J424k894j333L253
4797A911j1294J632j80P578K898q582m30o85N333J8803l465q275j58N630J38n331
4781E523p993O857j639m881m744o93k099p249J066O353J4115L814k83k12Q103
$$ y = [-16976, -11730, -8115, -19316, -17615, -4641, 7527, 10642, 8563, 14205, 13940, 10621, 4234, 26, 7975, 11581, 19992, 16295, 14339, 14282, 21325, 20231, 24065, 17262, 13728, -5937, -4702, -4135, -11098, -16598, -20837, -20888, -20792, -23336, -11053, -1605, 4634, 10198, 5448, 6744, 14761, 1200, -12530, -2810, -2208, -5590, -8719, -4313, 7668, -11, -17532, -16403, -4846, -10163, -15055, -14690, -13180, -14851, -15549, -19164, -14059, -9861, 1601, 6245, 3033, -11867, -18655, -18641, -16953, -12828, -5136, -1233, -396, -11989, -15518, -19439, -24019, -24266, -24018, -20821, -22223, -23904, -20883, -8977, 6745, 1461, 2885, -9, -1342, 1911, -9383, -7751, -7931, -353, 2545, -6037, -6467, -7152, -1819, 16984, 13519, 5244, 5086, 10716, 10854, 5523, -2470, 4387, 2748, -2133, -6877, -7570, -9669, -16918, -15852, -9499, 4616, 8430, 8147, 7935, 16038]
4766A6038J0445r126q037l767J896q435j226L011K963L344J255R977N184m425
4752A9097P71k809O652R328j0332j0936p508n845m506R955n124q759k173P486
4738d703N067m715m507n973J333J325j676n793N502N899J1756P43j0069J021K0957
4723A6167R389K834N146j3021j4785m810j418l463P704k411k951j352l504J5768
4709I293O296j595j2891K137L853l675j576N57L601m936j1371J588p064P828J2561
4694D606j930J128J681j8163r747r411l979J575O424R492R986J374l48j1669l994
4679b2975J4409N090k807J729o437j711J5135j4100j3860J972M82l860l266Q215
4665b1984p138L354J1196P329R64N566n377j087n385j2884M200M186O040O000
$$ y = [16038, 26483, 17357, 9320, 5553, 7449, -986, -2212, 799, 3762, 7106, 8361, 18338, 23522, 19097, 19868, 17059, 23711, 33039, 22707, 11771, 4263, -1582, -6088, 3867, -1257, -10016, -12189, -4703, 364, -4351, -8858, -14831, -13498, -12173, -13849, -19642, -14140, -8241, 3515, 4258, -5811, -4790, 16167, 25556, 28390, 33536, 20515, 5730, 920, -498, -3961, 3743, 1332, -1619, -2971, -6475, 9293, 15589, 13994, 1103, 3240, 7093, 3418, 1842, 2399, 6000, 1064, -10307, -8719, -15783, -7955, 4606, 2676, 3804, 5485, -12678, -22425, -31836, -35815, -34240, -27816, -18324, -8338, -6964, -7312, -18981, -22975, -8566, -3476, -6283, -4554, -10991, -12702, 2433, -11667, -25527, -23555, -23073, -26933, -30199, -21984, -29122, -25768, -14572, -7243, -6279, -713, -6090, -7177, -12562, -25446, -21246, -17060, -11020, -5020]
4651e020J694m660j777J309J312j736m456J7427Q136p809j657l101k769M23l324
4636f008p009k180Q555R708q102M530J1235m011j0001j0250m192J1790Q742o142
4622c335m916j312K388L723N133l872K192j875N884O103p519j5274m841J3592
4608c929J05j221j315l1O538J1782p709j3152j354Q67Q482P120p809j415R154
4593F113k696R86r446Q88M07J0949L230L964r262j0413L21k930K067R47q679L951
4577i603Q988P802Q51M631L759M061r864n281l22j0418N950O559j1460k1121K185
4562b3283Q07J5030K0817J508r417q911J864o255N68J368j2906J5723J684k508
4548c911J1006J3082O90q900j0984L121j4832j426N81l053R159J8821q976j9329
$$ y = [-5020, -3326, -7986, -9763, -8454, -7142, -8878, -13334, 4093, 12229, 4420, 2763, -338, -3107, -2684, -6008, -13017, -15197, -6642, 3066, -5036, -506, 10729, 6718, -3283, -13533, -17725, -5935, 2807, -3335, -8251, -9563, -7175, -3452, 1681, -2191, 1, -1874, 4010, 10113, 2594, -12680, -17521, -3929, -3824, -5045, -6360, -6391, 147, 11929, 4220, -8932, -10286, -9419, -937, 6183, -1626, -3041, 6113, 3417, 4403, -5043, -4155, -3748, 7201, 10431, 14395, 5133, -5280, -4959, -7889, -5822, -4875, -13554, -9603, -615, 7187, 8038, 12669, 16428, 20489, 10625, 5344, 5022, -5396, 554, 7113, -4347, -25468, -23283, -22476, -7446, 13371, 14879, 5462, -3449, -1585, -7840, -7272, -5904, -18810, -3087, -1403, -3911, 7095, 20177, 20867, 11967, 983, 4104, -10728, -12154, -11573, -14626, -5467, 13354, 4378, -14951]
4534a4951m262N359P184Q94K369r532O134J2268j1833N318J0467l201k075J0441
4520A4580k866K962L645q927j237r914p00j423j08J2574m559j8976j7006P812
4506b4143J9640Q548R651J242n992k229p24j3223R036L344K778J0453j2596q085
4492b300n888J2155J1400q303m468O059k412n164N306K654j7843J183P206q183
4478h598q56J103j410J0363K22p684k822J210J0602J2122J713q834j3278M09k1
4463e759J1927M840j9972n389R223J723J0416K112o347q922P646K262j829k477
4449e46N515M343Q053K540k4595J129J9432N047p080o921O425L616j8554j1983
4435a3579J1441r610j2608o144Q897M811k198l863M190J5841Q153j3918j780R933
$$ y = [-14951, -19213, -13854, -6670, -5776, -3407, -12939, -6805, 5463, -6370, -1052, 9415, 6214, 4139, 14580, 11714, 14676, 18321, 9394, 8157, -1757, -2457, -3880, -3988, 8586, 4027, -14949, -31955, -24143, -4503, 4045, 13696, 14938, 8946, 6717, 5993, -7230, 1806, 5150, 7928, 18381, 5785, -2300, -8188, 3967, 15367, 7064, 2596, 8655, 6243, 1079, 6385, 9039, -8804, -7621, -415, -8598, -9454, -8351, -9761, 602, 824, -6860, -9682, -8472, 2130, 14252, 15965, 7131, -6147, -5738, -5759, 6168, 11008, -8964, -14353, -5130, -3407, 7009, 9121, 2774, -6148, 1498, 3760, 1931, -546, 4969, 9312, 17365, 19905, -4690, -3561, 15871, 20918, 13838, 6917, 13342, 16958, -1596, -13579, -2138, -11748, -24356, -30500, -21603, -16792, -18990, -22853, -18663, -2822, 5331, -8587, -10367, -434]
4421d34R388J2369p594j2634Q209J0318n063o191j1198l953J048J2490l53j673
4407D729m696N917M493k238p05q986l339j0120j0951n260K0628L991k7627k4455
4393e8619J5709J6391L896N364P014J628J054P935p395K410r247r707J3982N106
4379d479Q700r018j5619l144K519R245l144l627O760R349K908j2615Q411q265
4365a2019K559j3238O234J7091M599p349M010j008r788m194Q526M246j1083p329
4351a8743o671J288J0090J6383P132J045n290r207J5653J0637q121j1744k070
4338C82J828j311q382j056J2506N339p155n784P097J901j0689M908P28K903l135
4323H0n927N155J407j876r26j2382K93L984N560p990l230J4666J51k767k259Q852
$$ y = [-434, 8954, 21323, 13729, 1095, 9304, 19622, 14559, 8368, -2830, -6783, -5735, 6755, 6402, 4729, 33, 5950, 10443, 8205, 7500, -1486, -4825, -14945, -25896, -31156, -10528, -6537, -34164, -58619, -42910, -26519, -22623, -17259, -10245, -8617, -7563, 372, -7023, -4613, -13860, -23567, -9585, -4479, 4221, -4797, -20416, -23560, -21041, -11796, -14940, -18567, -11807, -2458, 450, -12165, -3754, -12019, -9460, -22698, -16464, 627, 5226, -2123, 1887, 879, -8909, -13103, -4577, -331, -11414, -18743, -25414, -24126, -14036, 2347, 9479, 10524, 5234, -3973, 11680, 22317, 14196, 2452, 382, 2210, 899, -7483, -8539, 3967, 9306, 2151, -3633, 3464, 5365, -5324, -416, 312, 3215, 80, -5847, -692, 715, -1161, -2087, -14469, -14176, -10192, -4632, -12622, -15852, -1186, -1035, -3802, -6061, 2791]
4307B791J830J987L016k711r294K756l642o334k533m216J5345K467P58j5644k694
4292a6118M213Q08M254L37n611n132N190N143J898j656l035m197j0031o930P927
4277b2940J1116K072n916o68P60j1650O212Q381m621M475m14j0652Q964J7602
4263B721J3159q57m280r061n894l353N609r191o888Q28j578l589J0703J610L254
4248f807q575L717Q125R938r70N54P596J4581q131j0659m582R405k321n257J031
4233G645R733L091l786n466J346J3677O70j0392j1881j0955q495K673J3112j3416
4219a2444L714R271J976O954M187j49k948j0378j0512J2257Q627j2326o961J4989
4205F257J0229M653j1773r318O374J3103M611n165n604o264R19J6853P00j4763
$$ y = [2791, 4621, 6608, 9624, 6913, -2381, 375, -3267, -9601, -12134, -16350, -1005, 1462, 2220, -13424, -16118, -11905, -11097, -6843, -6506, -12117, -17249, -12059, -6916, -5018, -6674, -9709, -13906, -23937, -30867, -22940, -11824, -9752, -15668, -16336, -15576, -27226, -21014, -12633, -17254, -12779, -13193, -23845, -14881, 2721, 15880, 15023, 10743, 1682, -4212, -7565, -1956, -11147, -18035, -17207, -18785, -22374, -11671, -10061, -6807, -15382, -11665, -3540, 6398, 5428, 5982, 13578, 28159, 20028, 9369, 4787, 14192, 11871, 6614, 7645, 17378, 20469, 16683, 11217, 12563, 26240, 26910, 16518, 4637, -6318, -14813, -12140, 972, -12444, -8730, 541, 2517, 9471, 13658, 13509, 10561, 183, -10329, 1928, 10555, -1771, -8732, 6257, 16486, 21139, 9366, 48, 6422, 19525, 24136, 18971, 13367, 7103, 8022, 24875, 25575, 10812]
4191A0812l492J510Q81O77R935p932M129L872r83m761m154N700N82q914o245K76
4175A893L252N090o404O685N344K670M99n734j7076l49n238Q264R752J0197O791
4160B5636j1371q353o349M513R3N580j1626j000j483K891K004J2193P542J80J685
4145B2135m380j0065k2934L329L608j6721l950K429J0247R774P560J406q193j904
4131g659l411j98J1852M612l618q932M940N277l180J133r294Q02r605m756N835
4116a6202K0464Q670j0631o924l818J2027P235m846J6246L017M351L212j3288
4103A9513l467j2241j182Q707J762r608M075l326K299o904J641R958N001j4605
4089A623k3364N759Q572O535J2986q902p674o38J788M650j67L602j707N49j1425
$$ y = [10812, 7320, 8830, 9711, 10388, 20323, 12391, 16520, 20392, 19409, 14648, 10494, 16194, 16776, 7862, 1617, 1893, 5145, 10235, 3831, 10516, 15860, 18530, 19029, 13295, -3781, -4130, -9368, -1104, 8648, 18845, 25636, 14265, 5912, -437, 4076, 4169, 9749, -1877, -2877, -4360, -1469, 535, 12728, 20270, 20450, 22135, 17755, 7690, -15244, -11915, -8307, -25028, -28978, -26549, -16302, -6528, 1032, 2438, -5755, -7659, -11070, -11268, 584, 5196, 1578, -7354, -2414, 2863, -317, 816, -8478, -7676, -17281, -22037, -16202, 4262, 12932, 2301, -4623, -8441, 3586, 10821, 5975, 22221, 25238, 29589, 32801, 19513, 16046, 3805, 2623, 11330, 13092, 3484, 7559, 4233, 6532, -372, 1269, 11227, 16228, 1623, -21741, -15982, -7410, -875, 12111, 3209, -4465, -5103, -3315, 1335, 1168, 4770, 3063, 3612, -7813]
$$ [...]
##END NTUPLES=NMR SPECTRUM
##END=
