##TITLE=Analysis number 322412
Compound Code cc 50304
Book Reference 508/2
Project Code adrs
Chemist Name antons
##JCAMPDX= 6.0         $$ Bruker NMR JCAMP-DX V2.0
##DATA TYPE= NMR SPECTRUM
##DATA CLASS= NTUPLES
##ORIGIN= Bruker BioSpin GmbH
##OWNER= nmr
$$ XWIN-NMR		Version 3.5
$$ Mon Sep 25 13:30:47 2006 GMT Daylight Time (UT+1h)  MAYBRIDGE\nmr@NMR_250MHZ
##.OBSERVE FREQUENCY= 250.131544655141
##.OBSERVE NUCLEUS= ^1H
##.ACQUISITION MODE= SIMULTANEOUS (DQD)
##.ACQUISITION SCHEME= undefined
##.AVERAGES= 16
##.DIGITISER RES= 18
##SPECTROMETER/DATA SYSTEM= dpx250
##.PULSE SEQUENCE= zg30
##.SOLVENT NAME= CDCl3
##.SHIFT REFERENCE= (INTERNAL, CDCl3, 0, 16.522)
##AUDIT TRAIL= $$ (NUMBER, WHEN, WHO, WHERE, WHAT)
$$ ##TITLE= Audit trail, XWIN-NMR		Version 3.5
$$ ##JCAMPDX= 5.01
$$ ##ORIGIN= Bruker BioSpin GmbH
$$ ##OWNER= nmr
$$ C:\u/data/dgb/nmr/ADRS/1310/pdata/1/auditp.txt
$$ ##AUDIT TRAIL=  $$ (NUMBER, WHEN, WHO, WHERE, WHAT)
(   1,<2006-09-25 13:30:23.01 +100>,<MAYBRIDGE\nmr>,<NMR_250MHZ>,
      <created by zg, POWCHK disabled, PULCHK disabled
       configuration hash MD5:
       E2 DF 36 D8 04 B2 41 60 5A D7 A3 38 5A 4B D0 FE
       data hash MD5: 64K
       49 32 63 1D 0C EB 29 7A CA B0 E0 26 0D 39 BB 84>)
(   2,<2006-09-25 13:30:38.79 +100>,<MAYBRIDGE\nmr>,<NMR_250MHZ>,
      <Start of raw data processing
       ef LB = 0.3 FT_mod = 6 PKNL = 1 SI = 32K 
       data hash MD5: 32K
       C3 A4 98 73 B9 15 F9 3A 8F D8 C3 82 F7 1F C2 8D>)
(   3,<2006-09-25 13:30:40.37 +100>,<MAYBRIDGE\nmr>,<NMR_250MHZ>,
      <apk 
       data hash MD5: 32K
       3D E9 CB BC 03 E4 BD 18 33 5F 63 B4 72 CC 09 DF>)
(   4,<2006-09-25 13:30:41.10 +100>,<MAYBRIDGE\nmr>,<NMR_250MHZ>,
      <abs ABSG = 5 
       data hash MD5: 32K
       9F C4 4B 1E 83 7C C3 EF A2 84 57 A4 99 E9 04 4F>)
$$ ##END=
$$ 
$$ hash MD5
$$ 94 1F 3A AC 7F 6A 4A F2 21 47 37 8C 62 AA 04 78
##$RELAX= 
##$RELAX= 
##$RELAX= 
##$RELAX= 
##$RELAX= 
##$RELAX= 
##$RELAX= 
$$ Bruker specific parameters
$$ --------------------------
##$DU= <C:\u>
##$EXPNO= 1310
##$NAME= <ADRS>
##$PROCNO= 1
##$TYPE= <nmr>
##$USER= <dgb>
##$AMP= (0..31)
100 100 100 100 100 100 100 100 100 100 100 100 100 100 100 100 100 100 
100 100 100 100 100 100 100 100 100 100 100 100 100 100 
##$AQSEQ= 0
##$AQ_mod= 3
##$AUNM= <au_zg>
##$AUTOPOS= <33 >
##$BF1= 250.13
##$BF2= 250.13
##$BF3= 250.13
##$BF4= 250.13
##$BF5= 500.13
##$BF6= 500.13
##$BF7= 500.13
##$BF8= 500.13
##$BYTORDA= 1
##$CFDGTYP= 0
##$CFRGTYP= 5
##$CHEMSTR= <none>
##$CNST= (0..31)
1 1 145 1 1 1 1 1 1 1 1 1 1 1 1 1 1 1 1 1 1 1 1 1 1 1 1 1 1 1 1 1 
##$CPDPRG= <>
##$CPDPRG1= <>
##$CPDPRG2= <>
##$CPDPRG3= <>
##$CPDPRG4= <mlev>
##$CPDPRG5= <mlev>
##$CPDPRG6= <mlev>
##$CPDPRG7= <mlev>
##$CPDPRG8= <mlev>
##$CPDPRGB= <>
##$CPDPRGT= <>
##$D= (0..31)
0 1 0 0 0 0 0 0 0 0.06 0 0 0 0 0 0 0.0002 0 0 0 0 0 0 0 0 0 0 0 0 0 0 
0 
##$DATE= 1159187421
##$DBL= (0..7)
120 120 120 120 120 120 120 120 
##$DBP= (0..7)
150 150 150 150 150 150 150 150 
##$DBP07= 0
##$DBPNAM0= <>
##$DBPNAM1= <>
$$ [...]
##$SUBNAM7= <"">
##$SUBNAM8= <"">
##$SUBNAM9= <"">
##$SW= 20.6930455092707
##$SWIBOX= (0..15)
0 0 3 0 0 0 0 0 0 0 0 0 0 0 0 0 
##$SW_h= 5175.983436853
##$TD= 65536
##$TD0= 1
##$TE= 295.16
##$TE2= 300
##$TE3= 300
##$TEG= 300
##$TL= (0..7)
0 120 120 120 120 120 120 120 
##$TP= (0..7)
150 150 150 150 150 150 150 150 
##$TP07= 0
##$TPNAME0= <>
##$TPNAME1= <>
##$TPNAME2= <>
##$TPNAME3= <>
##$TPNAME4= <>
##$TPNAME5= <>
##$TPNAME6= <>
##$TPNAME7= <>
##$TPOAL= (0..7)
0.5 0.5 0.5 0.5 0.5 0.5 0.5 0.5 
##$TPOFFS= (0..7)
0 0 0 0 0 0 0 0 
##$TUNHIN= 0
##$TUNHOUT= 0
##$TUNXOUT= 0
##$USERA1= <user>
##$USERA2= <user>
##$USERA3= <user>
##$USERA4= <user>
##$USERA5= <user>
##$V9= 5
##$VALIST= <valist>
##$VCLIST= <CCCCCCCCCCCCCCC>
##$VD= 0
##$VDLIST= <DDDDDDDDDDDDDDD>
##$VPLIST= <PPPPPPPPPPPPPPP>
##$VTLIST= <TTTTTTTTTTTTTTT>
##$WBST= 1024
##$WBSW= 4
##$XGAIN= (0..3)
0 0 0 0 
##$XL= 0
##$YL= 0
##$YMAX_a= 440911
##$YMIN_a= -455004
##$ZGOPTNS= <>
##$ZL1= 120
##$ZL2= 120
##$ZL3= 120
##$ZL4= 120
##$ABSF1= 16.522
##$ABSF2= -4.171173
##$ABSG= 5
##$ABSL= 3
##$ALPHA= 0
##$AQORDER= 0
##$ASSFAC= 0
##$ASSFACI= 0
##$ASSFACX= 0
##$ASSWID= 0
##$AUNMP= <proc_1d>
##$AZFE= 0.1
##$AZFW= 0.1
##$BCFW= 0
##$BC_mod= 0
##$BYTORDP= 0
##$COROFFS= 0
##$CY= 12.5
##$DATMOD= 1
##$DC= 0
##$DFILT= <>
##$DTYPP= 0
##$F1P= 14.0000005364418
##$F2P= -0.99999901652339
##$FCOR= 0.5
##$FTSIZE= 32768
##$FT_mod= 6
##$GAMMA= 0
##$GB= 0
##$INTBC= 1
##$INTSCL= 1
##$ISEN= 128
##$LB= 0.3
##$LEV0= 0
##$LPBIN= 0
##$MAXI= 10000
##$MC2= 0
##$MEAN= 0
##$ME_mod= 0
##$MI= 0
##$NCOEF= 0
##$NC_proc= -5
##$NLEV= 6
##$NOISF1= 0
##$NOISF2= 0
##$NSP= 0
##$NTH_PI= 0
##$NZP= 0
##$OFFSET= 16.522
##$PC= 1
##$PHC0= 148.0381
##$PHC1= 4.29127
##$PH_mod= 1
##$PKNL= yes
##$PPARMOD= 0
##$PSCAL= 4
##$PSIGN= 0
##$REVERSE= no
##$SF= 250.13
##$SI= 32768
##$SIGF1= 0
##$SIGF2= 0
##$SINO= 400
##$SIOLD= 32768
##$SREGLST= <1H.CDCl3>
##$SSB= 0
##$STSI= 32768
##$STSR= 0
##$SW_p= 5175.98343685301
##$SYMM= 0
##$S_DEV= 0
##$TDeff= 65536
##$TDoff= 0
##$TI= <Analysis number 999999
Compound Code 99
Book Reference 9
Project Code 9>
##$TILT= no
##$TM1= 0
##$TM2= 0
##$TOPLEV= 0
##$USERP1= <user>
##$USERP2= <user>
##$USERP3= <user>
##$USERP4= <user>
##$USERP5= <user>
##$WDW= 1
##$XDIM= 32768
##$YMAX_p= 414796227
##$YMIN_p= -295846
$$ End of Bruker specific parameters
$$ ---------------------------------
##NTUPLES= NMR SPECTRUM
##VAR_NAME=  FREQUENCY,     SPECTRUM/REAL,   SPECTRUM/IMAG
##SYMBOL=    X,             R,               I
##VAR_TYPE=  INDEPENDENT,   DEPENDENT,       DEPENDENT
##VAR_FORM=  AFFN,          ASDF,            ASDF
##VAR_DIM=   32768,         32768,           32768
##UNITS=     HZ,            ARBITRARY UNITS, ARBITRARY UNITS
##FACTOR=    0.157963299565203, 1,           1
##FIRST=     4132.6476996994, 0,             0
##LAST=      -1043.33573715361, 0,           0
##MIN=       -1043.33573715361, -295846,     0
##MAX=       4132.6476996994, 414796227,     0
$$ Real data points
##PAGE= N=1
##DATA TABLE= (X++(R..R)), XYDATA
$$ [...]
$$ plain form
14629 -75031 -75425 -33931 -28119 -2473 28996 -3786 -33612 33883 79941 21509 -5680 -47347
14617 -47347 -23957 -51634 -113395 -93144 -76280 -44784 -33786 -16870 -784 -143750 -194399
14606 -194399 -168755 -206957 -282934 -290176 -263836 -231301 -199639 -147519 -141699 -87262 -73817 -72824
14594 -72824 -99958 -79253 -69875 -84469 -52558 76209 92061 19807 25591 88628 77429 88639
14582 88639 131272 21436 -77488 -47495 -69122 -93736 -85604 -69464 -48888 -62479 -75270 -101758
14570 -101758 -112244 -63942 -94432 -140350 -145846 -77015 -66015 -38205 -65186 -54485 -16846 44641
14558 44641 102452 75849 33368 48690 76637 -84 28433 49689 11166 -31782 -134467
14547 -134467 -126746 -53565 -69581 -72580 -57638 -84369 -102818 -66929 -64747 -85795 -57222 -4986
$$ packed form
14629g5031l94M1494N812K5646L1469l2782k9826O7495M6058n8432k7189m1667
14617d7347K3390k7677o1761K0251J6864L1496J0998J6916J6086j42966n0649
14606a94399K5644l8202p5977p242K6340L2535L1662N2120N820N4437J3445R93
14594g2824k7134K0705R378j4594L1911J28767J5852p2254N784O3037j1199J1210
14582H8639M2633j09836r8924K9993k1627k4614Q132J6140K0576j3591j2791k6488
14570a01758j0486M8302l0490m5918n496O8831J1000K7810k6981J0701L7639O1487
14558D4641N7811k6603m2481J5322K7947p6721K8517K1256l8523m2948j02685
14547a34467P721P3181j6016k999J4942k6731j8449L5889K182k1048K8573N2236
$$ plain form
14535 -4986 -40267 -48767 -51599 -84471 -28333 101264 139180 96970 -62251 -118301 -118894 -151785
14523 -151785 -78462 -812 85081 155094 140914 88596 57540 -32741 -96128 -111618 -6902
14512 -6902 72479 44519 -21215 -82690 -17311 17065 23391 28824 -16157 -62378 -85422 -73419
14500 -73419 -19132 -20013 -12965 103347 177903 195067 210371 268015 267836 232075 175069 163998
14488 163998 53786 13443 42040 108618 127000 53555 20861 -73193 -93709 52975 106221
14477 106221 112901 78587 55612 79304 127685 142259 144923 177864 173896 112212 124873 121853
14465 121853 149789 154505 116568 123054 153608 191624 183694 152692 111211 10156 -22083 7674
14453 7674 -3562 10686 -47816 -101023 -43607 59788 59207 74089 137528 164654 116663 96332
$$ packed form
14535d986l5281q500k832l2872N6138J29597L7916m2210j59221n6050n93l2891
14523a51785P3323P7650Q5893P0013j4180n2318l1056r0281o3387j5490J04716
14512f902P9381k7960o5734o1475O5379L4376O326N433m4981m6221k3044J2003
14500g3419N4287q81P048J16312P4556J7164J5304N7644j79l5761n7006j1071
14488A63998j10212m0343K8597O6578J8382p3445l2694r4054k0516J46684N3246
14477A06221O680l4314k2975K3692M8381J4574K664L2941l968o1684J2661l020
14465A21853K7936M716l7937O486L0554L8016p930l1002m1481j01055l2239K9757
14453G674j1236J4248n8502n3207N7416J03395n81J4882O3439K7126m7991k0331
$$ plain form
14441 96332 72218 9820 -24758 11905 49947 38374 3904 12686 -8019 45105 86777 79197
14429 79197 77256 62343 77249 106452 144476 144975 63573 11389 -49580 10362 73755 65730
14417 65730 58733 17658 39335 69673 920 -53097 -8285 4203 -37086 -81031 -80325 12255
14405 12255 60437 56624 41988 34983 -14028 -18941 38576 22473 -54643 -109084 -100244 -64909
14393 -64909 -24706 -64978 -123299 -110196 -65530 -58003 -64600 -34290 -10852 36539 53635 22666
14381 22666 -107490 -80813 -3031 -45693 -132645 -140532 -53389 -2687 -55119 -60921 -48920 -68636
14369 -68636 -40429 -23900 36230 67534 3432 -82550 -86687 -100921 -100720 -79976 -135372 -185904
14357 -185904 -166163 -129384 -88684 -19501 -709 65758 88555 41000 -2815 -4990 -39410 -71510
$$ packed form
14441I6332k4114o2398l4578L6663L8042j1573l4470Q782k0705N3124M1672p580
14429G9197j941j4913J4906K9203L8024M99q1402n2184o0969N9942O3393q025
14417F5730o997m1075K1677L0338o8753n4017M4812J2488m1289m3945P06R2580
14405A2255M8182l813j4636p005m9011m913N7517j6103p7116n4441Q840L5335
14393f4909M0203m0272n8321J3103M4666P527o597L0310K3438M7391J7096l0969
14381B2666j30156K6677P7782m2662q6952p887Q7143N0702n2432n802J2001j9716
14369f8636K8207J6529O0130L1304o4102q5982m137j4234K01K0744n5396n0532
14357a85904J9741L6779M0700O9183J8792O6467K2797m7555m3815k175l4420l2100
$$ plain form
14345 -71510 -108894 -56358 -10474 58297 104765 91119 27102 -108977 -61358 -17753 12139
14334 12139 -18739 -96005 -72098 -42269 -52983 -147900 -77362 -61662 -48114 -99350 -144399 -138730
14322 -138730 -129894 -101838 -80108 -53325 24814 40829 -24859 -73942 -92580 -76092 -140476 -194951
14310 -194951 -228122 -201674 -235303 -199728 -78568 26366 29153 -13701 -43868 -75 -61422
14299 -61422 -156512 -219202 -214623 -143979 -136599 -114851 -141919 -114190 -14545 -75506 -153544 -150364
14287 -150364 -70841 -33688 -43194 -64455 -93293 -102545 -70739 -128556 -126625 -54620 -60604 -19169
14275 -19169 -30163 -120226 -130680 -58094 -114653 -171678 -70037 -29636 -78940 -117942 -111901 -141224
14263 -141224 -168281 -168988 -125192 -68373 -35362 -40495 -9406 -52358 -97199 -89044 -56314 -46450
$$ packed form
14345g1510l7384N2536M5884O8771M6468j3646o4017j36079M7619M3605K9892
14334A2139l0878p7266K3907K9829j0714r4917P0538J5700J3548n1236m5049N669
14322a38730Q836K8056K1730K6783P8139J6015o5688m9083j8638J6488o4384n4475
14310a94951l3171K6448l3629L5575J21160J04934K787m2854l0167M3793o1347
14299f1422r5090o2690M579P0644P380K1748k7068K7729R9645o0961p8038L180
14287a50364P9523L7153r506k1261k8838r252L1806n7817J931P2005n984M1435
14275a9169j0994r0063j0454P2586n6559n7025J01641M0401m9304l9002O041k9323
14263a41224k7057p07M3796N6819L3011n133L1089m2952m4841Q155L2730R864
$$ plain form
14251 -46450 -87366 -53236 -23907 -65935 -92453 -131569 -209349 -108957 -38751 -35780 -111373 -93678
14239 -93678 -35870 -14516 26085 2026 -11857 -47427 -106035 -58537 -117064 -108418 -86948 -66785
14227 -66785 -78649 -107506 -129068 -86526 -108919 -130208 -70382 -68534 -115252 -68503 -11201 -4256
14215 -4256 -15013 -64979 -67779 -87577 -26586 -91974 -139828 -112226 -178112 -213337 -140490 -132971
14203 -132971 -223137 -174115 -55438 -22972 -74081 -74151 -33789 -45715 -40219 -59499 -49476 -112489
14191 -112489 -33322 36570 55941 40005 -14671 -121507 -158898 -167492 -53603 -59307 22704
14180 22704 -4710 -48804 -80198 -70782 -150905 -125536 -109930 -78605 -60719 -107303 -101921 -116318
14168 -116318 -195103 -260076 -194303 -140156 -106653 -71185 -65446 -100696 -50032 -25832 -62698 -120805
$$ packed form
14251d6450m0916L4130K9329m2028k6518l9116p7780J00392P0206K971p5593J7695
14239i3678N7808K1354M0601k4059j3883l5570n8608M7498n8527Q646K1470K0163
14227f6785j1864k8857k1562M2542k2393k1289N9826J848m6718M6749N7302O945
14215d256j0757m9966k800j9798O0991o5388m7854K7602o5886l5225P2847P519
14203a32971r0166M9022J18677L2466n1109p0M0362j1926N496j9280J0023o3013
14191a12489P9167O9892J9371j5936n4676j06836l7391q594J13889n704Q2011
14180B2704k7414m4094l1394R416q0123K5369J5606L1325J7886m6584N382j4397
14168a16318p8785o4973O5773N4147L3503L5468N739l5250N0664K4200l6866n8107
$$ plain form
14156 -120805 -102787 -148496 -178464 -230846 -188930 -141700 -113683 -143815 -98704 -149642 -187577
14145 -187577 -184745 -96600 -55080 -92685 -81345 -101274 -80806 -36979 -100046 -60217 -3710 16665
14133 16665 51929 53811 20502 41800 -37888 -126548 -187211 -198310 -172082 -134512 -131440 -89298
14121 -89298 -67585 -85700 -116808 -80841 -53866 -36714 -28163 -72218 -141021 -90708 -105910 -131950
14109 -131950 -102112 -28757 4892 -41472 -64530 -72946 -171081 -135375 -7301 19654 31587
14098 31587 -66057 -124899 -153431 -180894 -143409 -126756 -135391 -40305 25697 15704 -20696 -58392
14086 -58392 -94283 -168268 -200818 -177647 -141437 -73472 -59705 -124460 -155119 -214098 -173501 -181685
14074 -181685 -103964 -33103 3276 -43227 -78845 -75210 -37380 -5781 -19609 -67326 -41033 -39809
$$ packed form
14156a20805J8018m5709k9968n2382M1916M7230K8017l0132M5111n0938l7935
14145a87577K832Q8145M1520l7605J1340j9929K0468M3827o3067L9829N6507K0375
14133A6665L5264J882l3309K1298p9688q8660o0663j1099K6228L7570L072M2142
14121h9298K1713j8115l1108L5967K6975J7152Q551m4055o8803N0313j5202k6040
14109a31950K9838P3355L3649m6364k3058q416r8135L5706J28074K6955J1933
14098C1587r7644n8842k8532k7463L7485J6653q635R5086O6002r993l6400l7696
14086e8392l5891p3985l2550K3171L6210O7965J3767o4755l0659n8979M0597q184
14074a81685P7721P0861L6379m6503l5618L635L7830L1599j3828m7717K6293J224
$$ plain form
14062 -39809 1326 -2097 -29029 -43505 -31191 -2188 -17597 14760 -28205 -45602 -69633 -122668
14050 -122668 -140691 -126639 -24392 -66194 -114185 -40303 -66718 -42009 -28966 -2664 -32046
14039 -32046 -51841 18274 -33873 -112247 -156772 -149297 -108340 -49208 -46456 -57069 -72689 -101751
14027 -101751 -90046 -76486 -132936 -118675 -92915 -52240 -143927 -84396 -29502 -22907 -1523 -36357
14015 -36357 -79831 -139697 -134353 -86857 -90816 -112254 -108039 -122074 -91807 -104819 -96906 -66841
14003 -66841 -125574 -129406 -64395 -42332 -87168 -140943 -154869 -103505 -63882 -90369 -84263 -129399
13991 -129399 -121787 -105434 -53467 -39203 -61436 -108815 -78974 -54056 -75308 -50920 -74730 -42729
13979 -42729 -34215 -70789 -88599 -13237 38139 -30443 -51893 -93267 -221935 -210035 -138529 -92674
$$ packed form
14062c9809M1135l423k6932j4476J2314K9003j5409L2357m2965j7397k4031n3035
14050a22668j8023J4052J02247m1802m7991P3882k6415K4709J3043K6302k9382
14039c2046j9795P0115n2147p8374m4525P475M0957N9132K752j0613j5620k9062
14027a01751J1705J3560n6450J4261K5760M0675r1687N9531N4894O595K1384l4834
14015c6357m3474n9866N344M7496l959k1438M215j4035L0267j3012P913L0065
14003f6841n8733l832O5011K2063m4836n3775j3926N1364L9623k6487O106m5136
13991a29399P612J6353N1967J4264k2233m7379K9841K4918k1252K4388k3810L2001
13979d2729Q514l6574j7810P5362N1376o8582k1450m1374j28668J1900P1506M5855
$$ plain form
13967 -92674 -80297 -72396 -62147 4863 51358 14533 46156 -5579 -36484 -28102 -42919 -55909
13955 -55909 -55682 -57652 -60922 -50269 -70322 42316 146105 134416 150723 120878 85887 16010
13943 16010 1979 61625 126579 195710 211282 229052 231782 277428 323654 377843 421136 535030
13931 535030 645145 732281 806715 902072 995732 1075843 1062475 910893 701395 545459 485220
13920 485220 401848 402041 450428 416503 383813 274192 221517 224553 251724 292518 296446 265376
13908 265376 336141 382442 299992 278360 314566 322304 227058 233837 182289 206609 147728 66638
13896 66638 24072 46432 41623 80683 165917 144788 165903 165492 144016 161770 134994 158873
13884 158873 195614 315286 396545 441713 468399 474473 442122 390523 322509 246238 246816 333749
$$ packed form
13967i2674J2377P901J0249O7010M6495l6825L1623n1735l0905Q382j4817j2990
13955e5909K27j970l270J0653k0053J12638J03789j1689J6307k9845l4991o9877
13943A6010j4031N9646O4954O9131J5572J7770K730M5646M6226N4189M3293J13894
13931E35030J10115Q7136P4434R5357R3660Q0111j3368j51582k09498j55936o0239
13920D85220q3372J93M8387l3925l2690j09621n2675L036K7171M0794L928l1070
13908B65376P0765M6301q2450k1632L6206P738r5246O779n1548K4320n8881q1090
13896F6638m2566K2360m809L9060Q5234k1129K1115m11k1476J7754k6776K3879
13884A58873L6741J19672Q1259M5168K6686O074l2351n1599o8014p6271N78Q6933
$$ plain form
13872 333749 357852 376087 391895 513745 606731 602111 628123 525740 467796 407107 316162
13861 316162 233301 237747 223666 201124 185076 158737 154972 75099 23226 77988 120191 86760
13849 86760 105620 185562 189081 139764 171595 213379 139927 104748 101643 136427 84314 93761
13837 93761 122228 138310 75899 76530 52039 53916 42290 37805 -2154 28629 105073 251763
13825 251763 337180 435563 473885 519900 526126 536898 529709 413637 254514 111534 130596
13814 130596 99761 57157 54160 33141 50646 2953 -31168 87706 136029 75279 26869
13803 26869 -6554 17361 -24753 35635 75935 -25739 -29407 47573 87469 94180 55657 59412
13791 59412 87980 89874 83859 77162 81929 81645 76508 122322 52602 9572 -20699 -31925 15595
$$ packed form
13872C33749K4103J8235J5808J21850R2986m620K6012j02383n7944o0689r0945
13861C16162q2861M446j4081k2542j6048k6339l765p9873n1873N4762M2203l3431
13849H6760J8860P9942L519m9317L1831M1784p3452l5179l105L4784n2113R447
13837I3761K8467J6082o2411O31k4491J877j1626m485l9959L0783P6444J46690
13825B51763Q5417R8383L8322M6015O226J0772p189j16072j59123j42980J9062
13814A30596l0835m2604k997k1019J7505m7693l4121J18874M8323o0750m8410
13803B6869l3423K3915m2114O0388M0300j01674l668P6980L9896O711l8523L755
13791E9412K8568J894o015o697M767k84n137M5814o9720m3030l0271j1226M7520
$$ plain form
13778 15595 -27352 -83835 -63729 -37239 -39560 -17483 -8411 -47262 -117406 -64323 -12127 8625
13766 8625 14793 -34260 15681 67498 84870 1491 -85942 -50322 -25574 -23881 -27007 -77826
13754 -77826 -26839 -77244 -118443 -104557 -128168 -191865 -186762 -74014 -28955 -87835 -65905 20024
13742 20024 96908 16672 -49804 -34195 -25021 -3750 21483 78079 134140 124507 36650 -17162
13730 -17162 39706 26046 -17871 -82727 -82896 -68152 -39797 -46922 -73847 -62073 -55020 -80186
13718 -80186 -4404 -4768 -29365 34428 -50221 -90491 -112146 -138785 -180430 -152738 -68581 24649
13706 24649 40478 -30211 -49263 -75354 -139611 -156663 -43521 9309 22792 62 -43864
13695 -43864 -78106 -9808 78182 110120 22240 -81492 -61725 -16980 -24647 -38349 -9797 37958
$$ packed form
13778A5595m2947n6483K0106K6490k321K2077R072l8851p0144N3083N2196K0752
13766H625O168m9053M9941N1817J7372q3379q7433L5620K4748J693l126n0819
13754g7826N0987n0405m1199J3886k3611o3697N103J12748M5059n8880K1930Q5929
13742B0024P6884q0236o6476J5609R174K1271K5233N6596N6061r633q7857n3812
13730a7162N6868j3660m3917o4856j69J4744K8355p125k6925J1774P053k5166
13718h0186P5782l64k4597O3793q4649m0270k1655k6639m1645K7692Q4157R3230
13706B4649J5829p0689j9052k6091o4257j7052J13142N2830J3483k2730m3926
13695d3864l4242O8298Q7990L1938q7880j03732J9767M4745p667j3702K8552M7755
$$ plain form
13683 37958 37105 -18254 -41564 -49069 34244 55966 -24272 -56555 -93585 -190532 -248669 -270419
13671 -270419 -242754 -226497 -104464 -76879 -42498 -31299 -10064 46229 91948 141194 51258
13660 51258 -2184 6655 38768 105198 77810 -36606 -32737 35490 70886 41393 1615 -84316
13648 -84316 -80678 -41699 3884 46522 54658 63141 43955 -24737 -166277 -106072 -63965 -123942
13636 -123942 -110315 -103661 -24444 -21777 -87526 -99158 -32996 -68901 -101905 -118996 -83479 -93233
13624 -93233 -119122 -183764 -270795 -271891 -215330 -141640 -66563 -55650 -38618 -30552 -93164 -123745
13612 -123745 32034 53245 37987 38048 5226 29281 64681 86906 4468 3557 -11243 -49543
13600 -49543 -49337 -67999 -104200 -119672 -143301 -164888 -91865 -110630 -97840 -143566 -222893 -177978
$$ packed form
13683C7958q53n5359k3310p505Q3313K1722q0238l2283l7030r6947n8137k1750
13671b70419K7665J6257J22033K7585L4381J1199K1235N6293M5719M9246q9936
13660E1258n3442Q839L2113O6430k7388j14416L869O8227L5396k9493l9778q5931
13648h4316L638L8979M5583M2638Q136Q483j9186o8692j41540O0205M2107n9977
13636a23942J3627O654P9217K667o5749j1632O6162l5905l3004j7091L5517r754
13624i3233k5889o4642q7031j096N6561P3690P5077J0913J7032Q066o2612l0581
13612a23745J55779K1211j5258O1l2822K4055L5400K2225q2438r11j4800l8300
13600d9543K06j8662l6201j5472k3629k1587P3023j8765J2790m5726p9327M4915
$$ plain form
13588 -177978 -179126 -178767 -88068 -11258 -91771 -117616 -131952 -18070 8933 -3325 -9370 -41478
13576 -41478 10418 49025 16019 -68611 -142766 -124823 -75102 -81350 -41809 -68283 -94722 -86309
13564 -86309 -103414 -109898 -83444 -11674 8844 -75 -58381 -89729 -37864 27613 1509 5787
13552 5787 5552 11920 -62427 -96734 -6079 -49231 -14438 57877 35420 -23100 -11104 58431
13540 58431 165355 134299 41390 49611 71156 41092 -13773 -40843 -89872 -82363 -39442 -17755
13528 -17755 -78105 -139341 -79331 52221 92058 19915 -28145 -83557 -115094 -221006 -145919
13517 -145919 -42229 -22306 -42216 -97239 -153545 -182173 -129698 -107751 -102559 -77002 -118560
13506 -118560 -143268 -146221 -166342 -228438 -214920 -171557 -89733 -115701 -131533 -63075 -26547 -38059
$$ packed form
13588a77978j148L59R0699P6810q0513k5845j4336J13882K7003j2258o045l2108
13576d1478N1896L8607l3006q4630p4155J7943M9721o248L9541k6474k6439Q413
13564h6309j7105o484K6454P1770K0518q919n8306l1348N1865O5477k6104M278
13552E787k35O368p4347l4307R0655m3152L4793P2315k2457n8520J1996O9535
13540E8431J06924l1056r2909Q221K1545l0064n4865k7070m9029P509M2921K1687
13528a7755o0350o1236O0010J31552L9837p2143m8060n5412l1537j05912P5087
13517a45919J03690J9923j9910n5023n6306k8628N2475K1947N192K5557m1558
13506a18560k4708k953k0121o2096J3518M3363Q1824k5968j5832O8458L6528j1512
$$ plain form
13494 -38059 -41319 -49279 -77150 -21629 -22778 27250 76726 70617 -51871 -88009 -45090 -109646
13482 -109646 -79639 -16043 18488 56866 34105 -4617 57778 125627 129709 56780 -64218
13471 -64218 -45148 67964 14112 -57889 -49536 -77726 -78850 -90307 -39865 -28406 24715 31789
13459 31789 50970 -64673 -122317 -73752 19933 38682 29992 -20400 -72763 -100601 -101530 -74168
13447 -74168 -30806 23224 61453 105743 100908 45528 133895 146635 69311 -5524 -34307 15624
13435 15624 20474 29948 -15888 -24408 -47125 -47217 2457 73000 52263 -46392 -30672 758 -35744
13422 -35744 -107289 -68547 -50570 -6941 -53176 -48104 -21692 -14470 25873 34032 -5405 -76541
13410 -76541 -152435 -122468 -95508 -103837 -104444 -101566 -126116 -78916 -35851 29276 7965 -51303
$$ packed form
13494c8059l260p960k7871N5521j149N0028M9476o109j22488l6138M2919o4556
13482a09646L0007O3596L4531L8378k2761l8722O2395O7849M082p2929j20998
13471f4218J9070J13112n3852p2001Q353k8190j124j1457N0442J1459N3121P074
13459C1789J9181j15643n7644M8565R3685J8749q690n0392n2363k7838r29K7362
13447g4168M3362N4030L8229M4290m835n5380Q8367J2740p7324p4835k8783M9931
13435A5624M850R474m5836q520k2717r2M9674P0543k0737r8655J5720L1430l6502
13422c5744p1545L8742J7977M3629m6235N072K6412P222M0343Q159l9437p1136
13410g6541p5894K9967K6960q329o07K878k4550M7200M3065O5127k1311n9268
$$ plain form
13398 -51303 -131443 -136076 -108683 -128611 -88782 -71030 -106381 -112106 -123577 -105846 -144590 -85188
13386 -85188 -93463 -128074 -39941 -20193 -75476 -21006 -15009 -56708 -86104 -97390 -122086 -60407
13374 -60407 27521 47318 -18180 -15437 18521 12331 -9933 20538 13262 -87302 -91631 -57418
13362 -57418 -59007 -55013 -53875 -95504 -47569 -12940 5421 -28407 -35037 -50997 -121881 -152938
13350 -152938 -137392 -118926 -100502 -100226 -34802 -4526 -70647 -75033 -87288 -54227 -40294 -23672
13338 -23672 -19730 -45302 -96414 -89575 -51223 -71516 -122534 -122422 -140207 -187005 -187981 -150311 -145486
13325 -145486 -21515 10635 11516 -2093 -20028 -30612 -73481 -29413 -78321 -98543 33304
13314 33304 37880 24500 46939 56885 121802 48485 1887 7945 41530 69202 68532 113071 109771
$$ packed form
13398e1303q0140m633K7393j9928L9829J7752l5351n725j1471J7731l8744N9402
13386h5188q275l4611Q8133J9748n5283N4470N997m1699k9396j1286k4696O1679
13374f0407Q7928J9797o5498K743L3958o190k2264L0471p276j00564m329L4213
13362e7418j589L994J138m1629M7935L4629J8361l3828o630j5960p0884l1057
13350a52938J5546J8466J8424K76O5424L0276o6121m386j2255L3061J3933J6622
13338b3672L942k5572n1112O839L8352k0293n1018J12j7785m6798r76L7670M825
13325a45486J23971L2150Q81j3609j7935j0584m2869M4068m8908k0222J31847
13314C3304M576j3380K2439R946O4917p3317m6598O058L3585K7672o70M4539l300
$$ plain form
13301 109771 85036 102638 90254 38611 -33056 -149867 -115662 -63109 -14732 -151821 -173834
13290 -173834 -77525 25310 47876 -32416 -102544 -134265 -115361 -53838 -1160 -71738 -92983
13279 -92983 -59894 77201 109374 55141 384 -61241 -52064 6092 37812 65348 56599 15144
13267 15144 24385 47908 63288 73619 81528 30551 -87040 -50402 -39906 -61392 -24148 23938
13255 23938 41631 8119 -80319 -174143 -145118 -143329 -156065 -81054 -54254 -74611 -119022 -153333
13243 -153333 -179201 -113105 -103829 -69151 -108244 -188713 -170194 -23536 -18126 -42478 -30105 -53714
13231 -53714 -90656 -85885 -42703 53746 118440 58042 15152 -77437 -124181 -142769 -211365 -168581
13219 -168581 -81423 -55037 -68833 -108809 -17816 -394 17201 49941 36512 25715 -1989
$$ packed form
13301A09771k4735J7602j2384n1643p1667j16811L4205N2553M8377j37089k2013
13290a73834R6309J02835K2566q0292p0128l1721J8904O1523N2678p0578k1245
13279i2983L3089J37095L2173n4233n4757o1625R177N8156L1720K7536q749m1455
13267A5144R241K3523J5380J0331P909n0977j17591L6638J0496k1486L7244M8086
13255B3938J7693l3512q8438r3824K9025J789j2736P5011K6800k0357m4411l4311
13243a53333k5868O6096R276L4678l9093q0469J8519J46658N410k4352J2373k3609
13231e3714l6942M771M3182R6449O4694o0398m2890r2589m6744j8588o8596M2784
13219a68581Q7158K6386j3796l9976R0993J7422J7595L2740j3429j0797k7704
$$ plain form
13208 -1989 -15110 -44049 -50110 -63386 -100083 -169476 -159083 -115748 -24804 -13652 -17237 -8145
13196 -8145 -73492 -77704 -78288 5642 102735 62365 -37967 -61588 -31870 -15779 25141 76753
13184 76753 142105 123157 32865 -56140 -56905 -68424 -101683 -96115 -65569 -62250 -65336 -94383 -78538
13171 -78538 -80818 -52878 37661 -49255 -117416 -42700 13283 17525 -123 -26757 -10415 -18770
13159 -18770 -19262 -24243 -51042 -85897 -66134 -99456 -53004 51653 100242 109089 128479 111615
13147 111615 137298 44206 -44752 -33133 -33959 -24233 -65314 -73941 6506 31819 41284 42739 -26705
13134 -26705 -131009 -183470 -147100 -137206 -63480 -155723 -161136 -73192 -48161 -68257 -68170 -85498
13122 -85498 -127908 -34656 57862 23504 34571 46153 84494 31590 -42175 -20836 8856 63802
$$ packed form
13208a989j3121k8939o061j3276l6697o9393J0393M3335R0944J1152l585R092
13196h145o5347m212n84Q3930R7093m0370j00332k3621K9718J6091M0920N1612
13184G6753O5352j8948r0292q9005p65j1519l3259N568L0546L319l086k9047J5845
13171g8538k280K7940R0539q6916o8161P4716N5983M242j7648k6634J6342q355
13159a8770m92m981k6799l4855J9763l3322M6452J04657M8589Q847J9390j6864
13147A11615K5683r3092q8958J1619q26R726m1081q627Q0447K5313R465J455o9444
13134b6705j04304n2461L6370R894P3726r2243n413Q7944K5031k0096Q7j7328
13122h5498m2410R3252R2518l4358J1067J1582L8341n2904p3765K1339K9692N4946
$$ plain form
13110 63802 -5833 -80882 -135464 -104616 -69360 -49083 -36278 -43627 -83723 -74746 -115958 -132989
13098 -132989 -93534 -49949 -31157 -54613 -103274 -97966 -82410 -81871 -49669 -44521 38584 53180
13086 53180 14045 -32807 8959 78125 97542 46946 -7694 32240 74084 129250 174830 110959
13074 110959 110986 69727 50389 -17964 -27786 38884 92607 132902 199443 162975 154008 129358
13062 129358 81247 77585 5707 -36139 51748 75849 114138 80557 45846 10940 35017 92802
13050 92802 68937 24728 70092 70298 32301 36690 99478 121863 107096 85513 115158 101916
13038 101916 32493 -13536 -7040 48351 18913 -67230 -134875 -104862 -55794 23288 155563
13027 155563 184116 229515 226991 236797 323279 424421 436764 490192 585994 617692 535539 467813
$$ packed form
13110F3802o9635p5049n4582L0848L5256K0277J2805p349m0096Q977m1212j7031
13098a32989L9455M3585J8792k3456m8661N308J5556N39L2202N148Q3105J4596
13086E3180l9135m6852M1766O9166J9417n0596n4640L9934M1844N5166M5580o3871
13074A10959K7m1259j9338o8353r822O6670N3723M0295O6541l6468q967k4650
13062A29358m8111l662p1878m1846Q7887K4101L8289l3581l4711l4906K4077N7785
13050I2802k3865m4209M5364K06l7997M389O2788K2385j4767k1583K9645j3242
13038A01916o9423m6029O496N5391k9438q6143o7645L0013M9068P9082J32275
13027A55563K8553M5399k524R806Q6482J01142J2343N3428R5802L1698q2153o7726
$$ plain form
13015 467813 436094 323189 234710 187572 151826 141973 81204 104152 144784 236493 257038
13004 257038 156372 139926 150432 182152 230326 297646 272499 184034 165526 153171 121525
12993 121525 159900 234668 279605 309516 322064 284906 212080 293449 374572 311747 436487
12982 436487 551113 589413 578101 515064 457035 395338 242314 95779 38385 51265 88052
12971 88052 137225 157350 169494 269841 376101 372827 382944 397588 460929 528737 487697
12960 487697 554513 631623 682983 777995 678178 506930 414187 472169 398346 246091 164944
12949 164944 134602 141607 136586 88967 121272 249753 306383 318323 284628 304094 265908 212669
12937 212669 226925 207617 240055 240794 242536 240283 285774 389477 300555 174338 180315 253959
$$ packed form
13015D67813l1719j12905q8479m7138l5746r853o0769K2948M0632R1709K0545
13004B57038j00666j6446J0506L1720M8174O7320k5147q8465j8508j2355l1646
12993A21525L8375P4768M4937K9911J2548l7158p2826Q1369Q1123o2825J24740
12982D36487J14626L8300j1312o3037n8029o1697j53024j46535n7394J2880L6787
12971H8052M9173K0125J2144J00347J06260l274J0117J4644O3341O7808m1040
12960D87697O6816P7110N1360R5012r9817j71248r2743N7982p3823j52255q1147
12949A64944l0342P005n021m7619L2305J28481N6630J1940l3695J9466l8186n3239
12937B12669J4256j9308L2438P39J742k253M5491J03703q8922j26217N977P3644
$$ plain form
12925 253959 351927 392337 465004 619243 681888 660137 559549 451780 405282 353711 302313
12914 302313 252113 224402 220902 242109 209933 195620 187811 206120 233037 168699 153326 183717
12902 183717 126646 145911 155555 174897 210275 92689 80462 115411 141295 135439 65751 36772
12890 36772 66835 59650 86138 104315 87520 61591 94226 148288 118787 131532 143141 154932
12878 154932 165452 122599 207261 119997 38636 44013 108651 82340 46988 24241 -55889 -8935
12866 -8935 -20025 -24931 -42669 -20661 -82669 -125345 -61568 -2548 59674 46318 80899 104964
12854 104964 170741 117505 41397 -51262 -58243 -41957 26027 131099 174024 115554 52591
12843 52591 37366 88977 204361 246251 161633 89158 60229 84487 139288 109325 100634 186929
$$ packed form
12925B53959R7968M0410P2667J54239O2645k1751j00588j07769m6498n1571n1398
12914C02313n0200k7711l500K1207l2176j4313p809J8309K6917o4338j5373L0391
12902A83717n7071J9265R644J9342L5378j17586j2227L4949K5884n856o9688k8979
12890C6772L0063p185K6488J8177j6795k5929L2635N4062k9501J2745J1609J1791
12878A54932J0520m2853Q4662q7264q1361N377O4638k6311l5352k2747q0130M6954
12866h935j1090m906j7738K2008o2008m2676O3777N9020O2222j3356L4581K4065
12854A04964O5777n3236p6108r2659o981J6286O7984J05072M2925n8470o2963
12843E2591j5225N1611J15384M1890q4618p2475k8929K4258N4801k9963q691Q6295
$$ plain form
12831 186929 185786 183952 174149 170348 131635 125660 179965 188390 138991 138851 115594 68371 83570
12818 83570 131520 144906 112724 101603 119282 139208 81708 75918 142053 147626 66977 132500
12806 132500 266522 298100 284420 269140 231364 167347 178747 140296 144665 149864 156239 238800
12794 238800 368959 381867 411886 481034 521289 547053 620739 722169 781495 791930 841386
12783 841386 882205 1017976 1102350 1082866 969747 934680 921167 939562 916979 828443 818218
12772 818218 789229 766725 737776 772163 718023 681080 725819 784859 853140 949632 998062
12761 998062 977292 983117 1052726 1111817 1181982 1252666 1179247 1265768 1387140 1384993 1375929 1443511
12749 1443511 1506329 1534801 1546881 1528746 1527542 1526076 1506376 1536140 1568093 1590025 1557133 1504074
$$ packed form
12831A86929j143j834r803l801l8713n975N4305Q425m9399j40k3257m7223J5199
12818H3570M7950J3386l2182j1121J7679J9926n7500n790O6135N573q0649O5523
12806A32500J34022L1578j3680j5280l7776o4017J1400l8451M369N199O375Q2561
12794B38800J30159J2908L0019O9148M0255K5764P3686J01430N9326J0435M9456
12783H41386M0819J35771Q4374j9484j13119l5067j3513J8395k2583q8536j0225
12772H18218k8989k2504k8949L4387n4140l6943M4739N9040O8281R6492M8430
12761I98062k0770N825O9609N9091P0165P0684p3419Q6521J21372k147r064O7582
12749A443511O2818K8472J2080j8135j204j466j9700K9764L1953K1932l2892n3059
$$ plain form
12737 1504074 1439615 1417647 1406853 1348713 1328637 1411912 1430619 1367521 1333304 1278104 1250413
12726 1250413 1295581 1351345 1340846 1391966 1422488 1451680 1467736 1456220 1362855 1308831 1285494
12715 1285494 1306164 1231123 1129802 1098229 1021422 986014 952191 899903 843241 797518 714534
12704 714534 734297 730366 668947 660019 664499 691381 685332 641621 601513 657811 632146 562238
12692 562238 526803 435676 440601 476572 485573 457312 464828 465934 431704 433442 409458 385815
12680 385815 384934 359882 284117 336730 433597 439609 405834 356712 300389 262485 228873 236595
12668 236595 288237 293769 289218 286853 285493 243524 210377 321265 317526 316299 337855 328977 282250
12655 282250 220854 231222 290259 301144 326074 297056 245016 278066 327388 303625 233818
$$ packed form
12737A504074o4459k1968j0794n8140k0076Q3275J8707o3098l4217n5200k7691
12726A250413M5168N5764j0499N1120L0522K9192J6056j1516r3365n4024k3337
12715A285494K0670p5041j01321l1573p6807l5408l3823n2288n6662m5723q2984
12704G14534J9763l931o1419q928M480K6882o049m3711m0108N6298k5665o9908
12692E62238l5435r1127M925L5971R001k8261P516J106l4230J738k3984k3643
12680C85815q81k5052p5765N2613R6867O012l3775m9122n6323l7904l3612P722
12668B36595N1642N532m551k365j360m1969l3147J10888l739j227K1556q878m6727
12655B82250o1396J0368N9037J0885K4930k9018n2040L3050M9322k3763o9807
$$ plain form
12644 233818 170565 143856 148978 148454 112453 152852 191194 167664 131648 148157 136756 134224
12632 134224 118006 64736 140709 123703 119370 112153 101127 153298 223282 195934 160780 143522
12620 143522 98268 -7718 -42126 13904 21550 80269 115458 72052 18538 42913 75587
12609 75587 52599 242 2078 28817 70814 96692 132841 137893 89140 76188 98872 31340
12597 31340 72677 127472 167401 158130 158305 116234 129817 126190 76467 19105 29211 119385
12585 119385 169300 184596 211078 287673 332308 320896 326924 378817 351877 286033 383437 503748
12573 503748 643115 725913 742635 688094 676995 607399 688305 707408 590495 504503 488796
12562 488796 482241 366547 302127 279893 290642 342789 422351 369442 382747 419356 415799 431637
$$ packed form
12644B33818o3253k6709N122n24l6001M0399L8342k3530l6016J6509j1401k532
12632A34224j6218n3270P5973j7006m333p217j1026N2171O9984k7348l5154j7258
12620A43522m5254j05986l4408N6030P646N8719L5189m3406n3514K4375L2674
12609G5587k2988n2357J836K6739M1997K5878L6149N052m8753j2952K2684o7532
12597C1340M1337N4795L9929r271J75m2071J3583l627m9723n7362J0106R0174
12585A19385M9915J5296K6482P6595M4635j1412O028N1893k6940o5844R7404J20311
12573E03748J39367Q2798J6722n4541j1099o9596Q0906J9103j16913q5992j5707
12562D88796o555j15694o4420k2234J0749N2147P9562n2909J3305L6609l557J5838
$$ plain form
12550 431637 502673 560342 577807 530158 546121 654890 693203 741623 748128 725087 815555
12539 815555 752807 749467 701274 745003 839262 936347 950175 919763 945808 940698 880316 807255
12527 807255 746061 786226 862144 833819 807826 816816 721894 614223 581847 564219 618441
12516 618441 595601 700355 653001 642674 701017 696409 636040 601589 611682 653740 699358
12505 699358 684883 704375 850357 996546 1070838 1086376 1100189 1182042 1200024 1094627 1073150
12494 1073150 1029813 998539 1006673 1000979 1031643 1075229 1078996 1015440 1007061 1081603 1139442 1159164
12482 1159164 1116575 1074912 1120053 1137550 1205949 1253960 1218558 1188211 1189741 1152511 1171357
12471 1171357 1233791 1203799 1231410 1273917 1300072 1284700 1270121 1286556 1303314 1301269 1345276
$$ packed form
12550D31637P1036N7669J7465m7649J5963J08769L8313M8420O505k3041R0468
12539H15555o2748l340m8193M3729R4259R7085J3828l0412K6045n110o0382p3061
12527H07255o1194M0165P5918k8325k5993Q990r4922j07671l2376j7628N4222
12516F18441k2840J04754m7354j0327N8343m608o0369l4451J0093M2058M5618
12505F99358j4475J9492J45982J46189P4292J5538J3813Q1853J7982j05397k1477
12494A073150m3337l1274Q134n694L0664M3586L767o3556q379P4542N7839J9722
12482A159164m2589m1663M5141J7497O8399M8011l5402l0347J530l7230J8846
12471A171357O2434k9992K7611M2507K6155j5372j4579J6435J6758k045M4007
$$ plain form
12460 1345276 1421952 1437111 1538662 1645627 1745339 1846384 1929315 2054153 2030515 1924525
12450 1924525 1915828 1962130 1937937 1870987 1805947 1837311 1932554 2062077 2126475 2158377 2222228
12439 2222228 2263409 2330630 2454742 2527633 2544767 2576162 2663606 2744009 2769944 2771821 2854303
12428 2854303 2840374 2828187 2786050 2816587 2973687 3055221 3163062 3204208 3275850 3314755 3278622
12417 3278622 3297789 3286566 3371353 3526380 3657158 3674903 3725899 3824705 3895668 3890652 3929452
12406 3929452 4016158 4180293 4442657 4582043 4710296 4791381 4984313 5218759 5387799 5626306
12396 5626306 5773458 5910233 6077324 6262291 6452868 6671255 6930997 7245139 7608558
12387 7608558 7981904 8332345 8713456 9099522 9477028 9861411 10361247 10999754 11798239
$$ packed form
12460A345276P6676J5159J01551J06965R9712J01045Q2931J24838k3638j05990
12450A924525q697M6302k4193o6950o5040L1364R5243J29523O4398L1902O3851
12439B222228M1181O7221J24112P2891J7134L1395Q7444Q0403K5935J877Q2482
12428B854303j3929j2187m2137L0537J57100Q1534J07841M1146P1642L8905l6133
12417C278622J9167j1223Q4787J55027J30778J7745N0996R8806P0963n016L8800
12406C929452Q6706J64135K62364J39386J28253Q1085J92932K34446J69040K38507
12396E626306J47152J36775J67091J84967J90577K18387K59742L14142L63419
12387G608558L73346L50441L81111L86066L77506L84383M99836O38507P98485
$$ plain form
12378 11798239 12745654 13806204 14962290 16193398 17597633 19162489 20696198 22353185
12370 22353185 24163354 26173803 28539600 31172947 34099723 37513064 41496763 46281414
12362 46281414 51990587 58896130 67151780 77123356 89203785 103085809 117611966 131045626
12354 131045626 142064525 150143989 154971874 156186654 153932440 149472804 144551951 140385327
12346 140385327 137385450 135520133 134462175 133969537 134117398 134923407 136465254 138923686
12338 138923686 142557855 147034248 152084475 157768815 163906431 170366706 177180434 184363382
12330 184363382 191576845 198647053 205299767 211215137 216619179 222012051 227506878 233244987
12322 233244987 239332128 245918081 252768070 259202829 264567571 268505407 271191672 272762914
$$ packed form
12378A1798239R47415J060550J156086J231108J404235J564856J533709J656987
12370B2353185J810169K010449K365797K633347K926776L413341L983699M784651
12362D6281414N709173O905543Q255650R971576J2080429J3882024J4526157J3433660
12354A31045626J1018899Q079464M827885J214780k254214m459636m920853m166624
12346A40385327k999877j865317j057958m92638J47861Q06009J541847K458432
12338A38923686L634169M476393N050227N684340O137616O460275O813728P182948
12330A84363382P213463P070208O652714N915370N404042N392872N494827N738109
12322B33244987O087141O585953O849989O434759N364742L937836K686265J571242
$$ plain form
12314 272762914 272854084 270957375 266505470 259946969 252551071 245285941 239448530 235728125
12306 235728125 234232511 234577200 236078182 237855359 239234563 239771700 239282153 237833842
12298 237833842 235780613 233634090 231428008 229378254 227545797 225630385 223420202 220842204
12290 220842204 217774740 214161560 209615503 204075276 197755522 191303764 185126040 178809293
12282 178809293 171516519 162966467 154005010 145528322 138022005 131594133 126150694 121393905
12274 121393905 117385638 113802906 110437165 107286887 104192220 101258386 98433573 95530772
12266 95530772 92436954 89196563 85967989 82733071 79538657 76580892 73873047 71261648
12258 71261648 68555328 65998599 63623731 61493879 59456330 57437782 55493052 53639323
$$ packed form
12314B72762914R1170j896709m451905o558501p395898p265130n837411l720405
12306B35728125j495614L44689J500982J777177J379204N37137m89547j448311
12298B37833842k053229k146523k206082k049754j832457j915412k210183k577998
12290B20842204l067464l613180m546057n540227o319754o451758o177724o316747
12282A78809293p292774q550052q961457q476688p506317o427872n443439m756789
12274A21393905m008267l582732l365741l150278l094667k933834k824813k902801
12266I5530772l093818l240391l228574l234918l194414k957765k707845k611399
12258G1261648k706320k556729k374868k129852k037549k018548j944730j853729
$$ plain form
12250 53639323 51898412 50177813 48654404 47194773 45850958 44618610 43417913 42339259
12242 42339259 41295577 40298661 39303278 38321505 37302412 36351094 35443916 34598179 33761909
12233 33761909 32846840 32097773 31446733 30697700 29956819 29206389 28433804 27711791 27067808
12224 27067808 26394308 25749906 25142142 24626690 24152306 23640893 23194532 22828746 22503332
12215 22503332 22058543 21549358 21177111 20770591 20435077 20165907 19882966 19575398 19282581
12206 19282581 18974727 18655644 18344886 18063943 17746739 17490758 17230771 16937902 16677729
12197 16677729 16466008 16338773 16157403 15883386 15630204 15326096 15044124 14794237 14538416
12188 14538416 14283435 13971452 13702900 13481590 13271069 13095059 12909708 12675035 12462273
$$ packed form
12250E3639323j740911j720599j523409j459631j343815j232348j200697j078654
12242D2339259j043682r96916r95383r81773j019093r51318r07178q45737q36270
12233C3761909r15069p49067o51040p49033p40881p50430p72585p22013o43983
12224B7067808o73500o44402o07764n15452m74384n11413m46361l65786l25414
12215B2503332m44789n09185l72247m06520l35514k69170k82941l07568k92817
12206A9282581l07854l19083l10758k80943l17204k55981k59987k92869k60173
12197A6677729k11721j27235j81370k74017k53182l04108k81972k49887k55821
12188A4538416k54981l11983k68552k21310k10521j76010j85351k34673k12762
$$ plain form
12179 12462273 12190693 11980057 11841875 11688656 11577000 11451430 11246688 11071591 10902224
12170 10902224 10789104 10707554 10558286 10448007 10316093 10131927 10047993 9921999 9723230 9583319
12160 9583319 9358303 9098392 8908566 8746850 8558633 8481970 8349717 8203883 8048009 7902505
12150 7902505 7736217 7598582 7608676 7636174 7467404 7298742 7193776 7104732 7036877 6891616
12140 6891616 6759524 6617866 6462268 6229465 6043407 5970469 5858352 5733505 5607901 5518813
12130 5518813 5445906 5441162 5314593 5233490 5202628 5082014 4955917 4884148 4840417 4735875 4722080
12119 4722080 4673056 4546446 4500738 4506275 4481036 4350361 4279895 4229441 4220545 4082305 3988101
12108 3988101 3971056 3990217 3909253 3787989 3693953 3651444 3559841 3456708 3460657 3383286 3325365
$$ packed form
12179A2462273k71580k10636j38182j53219j11656j25570k04742j75097j69367
12170A0902224j13120q1550j49268j10279j31914j84166q3934j25994j98769j39911
12160I583319k25016k59911j89826j61716j88217p6663j32253j45834j55874j45504
12150G902505j66288j37635J0094K7498j68770j68662j04966q9044o7855j45261
12140F891616j32092j41658j55598k32803j86058p2938j12117j24847j25604q9088
12130E518813p2907m744j26569q1103l0862j20614j26097p1769m3731j04542j3795
12119D722080m9024j26610m5708N537k5239j30675p0466n0454q896j38240r4204
12108C988101j7045J9161q0964j21264r4036m2509r1603j03133L949p7371n7921
$$ plain form
12097 3325365 3244374 3117976 3066911 3000112 2936134 2920817 2882111 2802078 2803265 2814770 2764134
12086 2764134 2652916 2543381 2530759 2566338 2546889 2513766 2466267 2467978 2479068 2493367 2451183
12075 2451183 2482761 2461683 2384303 2323032 2317915 2276336 2201397 2166650 2129154 1930688 1906737
12064 1906737 2043523 2089206 1978519 1932078 1967641 1941713 1800588 1751418 1776035 1819187 1708495
12053 1708495 1648052 1526317 1456305 1507323 1512113 1465519 1409938 1390027 1500497 1525759 1443635
12042 1443635 1420688 1462784 1508734 1473163 1453256 1450002 1375936 1323640 1314678 1325001 1302037 1233291
12030 1233291 1183326 1182501 1117880 1148571 1160507 1108047 1120363 1116594 1132751 1211257 1200429 1221469
12018 1221469 1217403 1078873 1058237 1066010 1081578 1052613 1048840 1037346 1038717 1011727 919636 901381
$$ packed form
12097C325365q0991j26398n1065o6799o3978j5317l8706q0033J187J1505n0636
12086B764134j11218j09535j2622L5579j9449l3123m7499J711J1090J4299m2184
12075B451183L1578k1078p7380o1271n117m1579p4939l4747l7496j98466k3951
12064A906737J36786M5683j10687m6441L5563k5928j41125m9170K4617M3152j10692
12053A708495o0443j21735p0012N1018M790m6594n5581j9911J10470K5262q2124
12042A443635k2947M2096M5950l5571j9907l254p4066n2296q962J0323k2964o8746
12030A233291m9965q25o4621L0691J1936n2460J2316l769J6157P8506j0828K1040
12018A221469m066j38530k0636P773J5568k8965l773j1494J371k6990r2091j8255
$$ plain form
12006 901381 979464 969606 1006810 1059310 1013522 895944 851652 889325 934073 959725 902422
11995 902422 872638 809337 762595 808113 807073 717224 721159 742315 710400 708450 702119 664161
11983 664161 735389 788729 779920 781377 821912 810850 806701 769357 758806 799114 781062 825921
11971 825921 870696 866718 828814 806382 798142 818330 890552 914724 958943 914009 898365 924736
11959 924736 956899 1054520 1114106 1253288 1272822 1269111 1321287 1312896 1250168 1189899 1107277 1098269
11947 1098269 1105454 1082149 1027935 977929 973716 975577 973492 1006619 967899 1003640 1082877 1137854
11935 1137854 1170935 1228920 1297946 1317169 1318741 1367856 1431792 1435483 1442940 1504718 1518273 1431428
11923 1431428 1463412 1529621 1641762 1626144 1746528 1818976 1839605 1875521 1912492 1913668 1912061
$$ packed form
12006I01381P8083r858L7204N2500m5788j17578m4292L7673M4748K5652n7303
11995I02422k9784o3301m6742M5518j040q9849L935K1156l1915j950o331l7958
11983F64161P1228N3340q809J457M0535j1062m149l7344j0551M0308j8052M4859
11971H25921M4775l978l7904k2432q240K0188P2222K4172M4219m4934j5644K6371
11959I24736L2163R7621N9586J39182J9534l711N2176q391o2728o0269q2622r008
11947A098269P185k3305n4214n0006m213J861k085L3127l8720L5741P9237N4977
11935A137854L3081N7985O9026J9223J572M9115O3936L691P457O1778J3555q6845
11923A431428L1984O6209J12141j5618J20384P2448K0629L5916L6971J176j607
$$ plain form
11912 1912061 1873996 1865947 1854629 1791420 1712672 1664852 1644531 1684223 1734632 1725576 1718093 1731679
11900 1731679 1735593 1793781 1924930 1900739 1905513 2026025 2151713 2149569 2179919 2232106 2239956
11889 2239956 2252169 2298179 2290919 2311889 2421219 2484946 2493968 2448660 2355570 2284801 2272344
11878 2272344 2211666 2164771 2145971 2147920 2100656 2093149 2094506 2070021 2047964 1943635 1934964 1992868
11866 1992868 2057545 2062024 2074095 2043013 2096346 2177401 2144541 2000801 1863513 1842249 1797784
11855 1797784 1650799 1555342 1669137 1581164 1513155 1499134 1474839 1472511 1452326 1358515 1311001
11844 1311001 1245555 1209330 1216190 1229380 1217720 1198022 1187359 1213347 1266992 1263582 1229545 1171070
11832 1171070 1148697 1134612 1074057 1125480 1175757 1167605 1148787 1096878 1051310 1068861 1042542
$$ packed form
11912A912061l8065q049j1318o3209p8748m7820k0321L9692N0409r056p483J3586
11900A731679L914N8188J31149k4191M774J20512J25688k144L0350N2187P850
11889B239956J2213M6010p260K0970J09330O3727R022m5308r3090p0769j2457
11878B272344o0678m6895j8800J949m7264p507J357k4485k2057j04329q671N7904
11866A992868O4677M479J2071l1082N3333Q1055l2860j43740j37288k1264m4465
11855A797784j46985r5457J13795q7973o8009j4021k4295k328k0185r3811m7514
11844A311001o5446l6225O860J3190j1660j9698j0663K5988N3645l410l4037n8475
11832A171070k2373j4085o0555N1423N0277q152j8818n1909m5568J7551k6319
$$ plain form
11821 1042542 973850 961384 971908 950253 936886 853362 852666 850793 772796 683451 604526 573182
11809 573182 627717 715753 654968 586473 575991 594549 630062 686689 724711 699519 692987 761862
11797 761862 793079 783053 738290 650544 739927 785923 811154 779363 717687 714423 609847
11786 609847 563122 542951 606074 590966 570348 612884 608506 521752 452529 377403 347217 431882
11774 431882 437675 415944 419608 410240 425926 388888 371335 375291 351213 397285 449854 397454
11762 397454 393900 473939 473040 470965 411410 305385 330115 358773 302101 281580 329826 287488
11750 287488 214861 217248 248936 312608 302038 302010 322998 331400 312918 389497 467563 401297
11738 401297 297886 247013 219400 249098 272316 248815 284206 286979 276286 240552 250898
$$ packed form
11821A042542o8692j2466J0524k1655j3367q3524o96j873p7997q9345p8925l1344
11809E73182N4535Q8036o0785o8495j0482J8558L5513N6627L8022k5192o532O8875
11797G61862L1217j0026m4763q7746Q9383M5996K5231l1791o1676l264j04576
11786F09847m6725k0171O3123j5108k0618M2536m378q6754o9223p5126l0186Q4665
11774D31882N793k1731L664r368J5686l7038j7553L956k4078M6072N2569n2400
11762C97454l554Q0039q99k075n9555j06025K4730K8658n6672k0521M8246m2338
11750B87488p2627K387L1688O3672j0570k8K0988Q402j8482P6579P8066o6266
11738D01297j03411n0873k7613K9698K3218k3501L5391K773j0693l5734J0346
$$ plain form
11727 250898 245635 215688 222442 192847 186324 207949 149753 217618 279795 260416 287490 284039
11715 284039 236554 246173 211987 207734 166147 99757 93773 31656 88180 126866 174057 190379
11703 190379 105343 131987 128072 180375 224731 202114 188950 230960 285151 325787 292645 170671
11691 170671 54105 87501 163540 143550 127797 98703 53609 112004 164791 189273 133990
11680 133990 95393 124205 187466 113523 112955 103775 140632 92513 90769 129847 197657 254467
11668 254467 225504 172759 139139 132592 129377 99157 119559 83203 30463 73319 100875 162407
11656 162407 172437 122449 110495 22909 44910 254671 359578 364034 286096 204319 154862
11645 154862 96037 143246 141720 150970 175983 160819 151034 121183 116212 234639 199162 150809
$$ packed form
11727B50898n263k9947O754k9595o523K1625n8196O7865O2177j9379K7074l451
11715B84039m7485R619l4186m253m1587o6390n984o2117N6524L8686M7191J6322
11703A90379q5036K6644l915N2303M4356k2617j3164M2010N4191M0636l3142j21974
11691A70671j16566L3396P6039j9990j5753k9094m5094N8395N2787K4482n5283
11680A33990l8597K8812O3261p3943n68r180L6857m8119j744L9078O7810N6810
11668B54467k8963n2745l3620o547l215l0220K0402l6356n2740M2856K7556O1532
11656A62407J0030m9988j1954q7586K2001K09761J04907M456p7938q1777m9457
11645A54862n8825M7209j526R250K5013j5164r785k9851m971J18427l5477m8353
$$ plain form
11633 150809 103972 64551 117939 101410 57905 18019 -19956 23544 82924 39085 39452 136560
11621 136560 189143 203496 155908 142378 159915 120920 70176 102879 138994 125982 90378
11610 90378 28085 41850 18336 -45023 7564 58543 106501 76383 46502 22630 31779 27484
11598 27484 74195 32286 49939 127092 132548 145196 94292 79726 33584 44864 73515 125989
11586 125989 121651 56504 3687 7588 -7341 45642 112309 152700 117789 141084 85623 61797
11574 61797 89219 82025 67862 69659 97652 73914 45024 74896 22577 32860 62849 59096
11562 59096 23129 78552 104534 135321 150318 195361 205069 190014 137270 91606 82902 112328
11550 112328 68002 36829 39855 61088 84967 90532 53659 48421 99165 102766 6504 -23333
$$ packed form
11633A50809m6837l9421N3388j6529m3505l9886l7975M3500N9380m3839L67R7108
11621A36560N2583J4353m7588j3530J7537l8995n0744L2703L6115j3012l5604
11610I0378o2293J3765k3514o3359N2587N0979M7958l0118k9881k3872R149m295
11598B7484M6711m1909J7653P7153N456J2648n0904j4566m6142J1280K8651N2474
11586A25989m338o5147n2817L901j4929N2983O6667M0391l4911K3295n5461k3826
11574F1797K7422p194j4163J797K7993k3738k8890K9872n2319J0283K9989l753
11562E9096l5967N5423K5982L0787J4997M5043R708j5055n2744m5664q704K9426
11550A12328m4326l1173L026K1233K3879N565l6873n238N0744L601r6262k9837
$$ plain form
11538 -23333 21491 79439 148694 165703 136473 138446 175094 214941 119357 70265 50006 78508
11526 78508 119213 114242 123757 114002 48719 32192 66606 67834 81220 108169 88571 123682
11514 123682 132693 218992 226683 224173 148704 134221 157696 187364 180216 175991 237561 196240
11502 196240 183978 226793 235711 205088 187663 180211 142462 149727 147521 179968 149280 140031
11490 140031 155927 136582 131401 114697 122341 139564 166590 222092 197267 152605 149047 105349
11478 105349 152050 225090 228247 268523 232810 247115 286294 339119 326553 182270 131532
11467 131532 197437 255595 239569 210562 198793 197618 263440 364095 372681 384583 351958 329431
11455 329431 332606 375262 349602 345716 366032 432904 445883 454454 380013 255426 212126 172324
$$ packed form
11538b3333M4824N7948O9255J7009k9230J973L6648L9847r5584m9092k0259K8502
11526G8508M0705m971R515r755o5283j6527L4414J228J3386K6949j9598L5111
11514A23682R011Q6299P691k510p5469j4483K3475K9668p148m225O1570m1321
11502A96240j2262M2815Q918l0623j7425p452l7749P265k206L2447l0688r249
11490A40031J5896j9345n181j6704P644J7223K7026N5502k4825m4662l558m3698
11478A05349M6701P3040L157M0276l5713J4305L9179N2825j2566j44283n0738
11467A31532O5905N8158j6026k9007j1769j175O5822J00655Q586J1902l2625k2527
11455C29431L175M2656k5660l886K0316O6872J2979Q571p4441j24587m3300l9802
$$ plain form
11443 172324 168603 193088 117340 99810 76468 80477 67468 -31573 -17081 62852 120579 168681
11431 168681 185023 150359 139506 171308 175050 225869 205191 168571 273341 379469 379592 292113
11419 292113 322352 367956 323697 354559 326319 319633 368903 352587 320548 289916 319440 375924
11407 375924 320446 328581 377957 286239 197608 245415 287596 241345 124794 110095 215285
11396 215285 291078 360277 365451 288860 304250 319908 270450 270219 252857 230565 147884 193758
11384 193758 284030 261688 250337 159304 64448 61105 126779 155023 185306 217397 231542 174583
11372 174583 249422 252024 195041 201018 219778 226986 196358 194840 320726 390906 322639 289519
11360 289519 264207 234472 182274 159999 216840 261411 284162 222528 170386 138862 61979
$$ packed form
11443A72324l721K4485p5748j7530k3342M009j3009r9041J4492P9933N7727M8102
11431A68681J6342l4664j0853L1802L742N0819k0678l6620J04770J06128J23q7479
11419B92113L0239M5604m4259L0862k8240o686M9270j6316l2039l0632K9524N6484
11407C75924n5478Q135M9376r1718q8631M7807M2181m6251j16551j4699J05190
11396B15285P5793O9199N174p6591J5390J5658m9458k31j7362k2292q2681M5874
11384A93758R0272k2342j1351r1033r4856l343O5674K8244L0283L2091J4145n6959
11372A74583P4839K602n6983N977J8760P208l0628j518J25886P0180o8267l3120
11360B89519k5312k9735n2198k2275N6841M4571K2751o1634n2142l1524p6883
$$ plain form
11349 61979 58655 31275 -1890 30061 64122 74595 76128 103823 6097 -112799 -122099 -15699
11337 -15699 12325 15358 9000 22115 75963 106473 82412 87848 50182 67975 36273 76837
11325 76837 134064 121465 147071 146602 65564 30166 25277 20562 -31537 73398 166570 124027
11313 124027 23392 -56509 -12904 22222 23176 32212 114547 164370 158780 169828 102723 66837
11301 66837 49878 114822 130494 72785 34367 -37529 -34481 -56600 -31625 38448 90832 147838
11289 147838 139705 83769 3308 -32582 17868 83056 103427 124257 134157 137256 108711 58718
11277 58718 57768 88288 125163 68889 73101 104453 86103 70835 45867 17865 -14867 42659
11265 42659 79636 122540 100489 71856 84894 122644 83907 9436 -29261 -36968 -99915 -175279
$$ packed form
11349F1979l324k7380l3165L1951L4061J0473J533K7695r7726j18896r300J06400
11337a5699K8024L033o358J3115N3848L0510k4061N436l7666J7793l1702M0564
11325G6837N7227j2599K5606m69q1038l5398m889m715n2099J04935R3172m2543
11313A24027j00635p9901M3605L5126R54R036Q2335M9823n590J1048o7105l5886
11301F6837j6959O4944J5672n7709l8418p1896L048k2119K4975P0073N2384N7006
11289A47838q133n5936q0461l5890N0450O5188K0371K0830R900L099k8545m9993
11277E8718r50L0520L6875n6274M212L1352j8350j5268k4968k8002l2732N7526
11265D2659L6977M2904k2051k8633J3038L7750l8737p4471l8697p707o2947p5364
$$ plain form
11253 -175279 -154837 -56792 45968 108854 87752 -16411 -1474 -5394 60787 80565 57571
11242 57571 126092 173047 134846 76460 -25247 24121 46695 53386 10740 27451 -7241 -2367
11230 -2367 -114 23492 66854 50032 22035 23972 62881 135269 147994 181017 123921 68208
11218 68208 64748 113634 54397 -86382 -43436 -17584 51931 86498 108371 117612 86307 -14060
11206 -14060 -95078 -89549 14297 61114 63173 16031 19847 42905 64747 15638 -14938 -5169
11194 -5169 48840 39072 41562 51103 70471 56821 25187 -38071 -22093 16589 78976 184739
11182 184739 193999 154648 160018 187889 184145 107436 4650 -28391 16213 75207 149275 153589
11170 153589 159157 105235 133294 77993 62747 37544 22641 29759 14178 1346 -40971 -119656
$$ packed form
11253a75279K0442R8045J02760O2886k1102j04163J4937l920O6181J9778k2994
11242E7571O8521M6955l8201n8386j01707M9368K2574O691m2646J6711l4692M874
11230b367K253K3606M3362j6822k7997J937L8909P2388J2725L3023n7096n5713
11218F8208l460M8886n9237j40779M2946K5852O9515L4567K1873R241l1305j00367
11206a4060q1018N529J03846M6817K059m7142L816K3058K1842m9109l0576R769
11194e169N4009r768K490R541J9368j3650l1634o3258J5978L8682O2387J05763
11182A84739R260l9351N370K7871l744p6709j02786l3041M4604N8994P4068M314
11170A53589N568n3922K8059n5301j5246k5203j4903P118j5581j2832m2317p8685
$$ plain form
11158 -119656 -107092 -118796 -58214 -59212 -6326 43790 111375 135110 49808 42289 119996 53469
11146 53469 822 46271 -10051 10955 56515 24599 25330 3080 41575 93225 116868 48840
11134 48840 10807 21330 41311 -6383 -38053 -1214 -32072 -33303 -58911 -16264 -24048 -13867
11122 -13867 24925 103909 137345 126487 57262 90376 19436 -43059 -62732 -9256 34530 43149
11110 43149 33596 51211 108958 72346 47664 70285 70401 80073 89727 107420 135897 133229 139589
11097 139589 128264 160617 141484 37364 5837 56692 37937 48387 109855 123261 113073
11086 113073 48160 -24191 -676 13407 18687 -61883 -74659 -32971 50980 15050 -2204 7497
11074 7497 -74240 -153439 -142788 -94912 -25942 115584 141440 186931 214793 248285 290237 377356
$$ packed form
11158a19656J2564j1704O0582r98N2886N0116O7585K3735q5302p519P7707o6527
11146E3469n2647M5449n6322K1006M5560l1916P31k2250L8495N1650K3643o8028
11134D8840l8033J0523J9981m7694l1670L6839l0858j231k5608M2647p784J0181
11122a3867L8792P8984L3436j0858o9225L3114p0940o2495j9673N3476M3786Q619
11110D3149r553J7615N7747l6612k4682K2621J16R672R654J7693K8477k668O360
11097A39589j1325L2353j9133j04120l1527N0855j8755J0450O1468J3406j0188
11086A13073o4913p2351K3515J4083N280q0570j2776M1688Q3951l5930j7254R701
11074G497q1737p9199J0651M7876O8970J41526K5856M5491K7862L3492M1952Q7119
$$ plain form
11062 377356 440561 440644 428355 455983 377706 197123 118240 144256 165641 162726 118849 112658
11050 112658 115682 68207 97796 131635 181360 152617 28118 -11859 71435 84811 26683
11039 26683 32326 106369 83476 35850 -20155 20128 108301 103109 63355 85865 86195 89602 28356
11026 28356 3046 -25076 31991 28973 31417 82371 46125 49454 82501 63695 85686 114247
11014 114247 125840 190373 202598 232707 301931 357308 386930 431999 437172 465207 360902
11003 360902 216316 151466 155871 121209 24117 65586 166152 191392 133134 50094 53212
10992 53212 120257 184664 156017 97579 141545 211212 213602 233398 259431 273649 279856 271153
10980 271153 314016 203317 59534 92007 53783 -1754 57382 107228 182967 149322 78695
$$ packed form
11062C77356O3205Q3j2289K7628p8277j80583p8883K6016K1385k915m3877o191
11050A12658L024m7475K9589L3839M9725k8743j24499l9977Q3294J3376n8128
11039B6683N643P4043k2893m7626n6005M0283Q8173n192l9754K2510L30L407o1246
11026B8356k5310k8122N7067l018K444N0954l6246L329L3047j8806K1991K8561
11014A14247J1593O4533J2225L0109O9224N5377K9622M5069N173K8035j04305
11003C60902j44586o4850M405l4662r7092M1469J00566K5240n8258q3040L118
10992E3212O7045O4407k8647n8438M3966O9667K390J9796K6033J4218O207q703
10980B71153M2863j10699j43783L2473l8224n5537N9136M9846P5739l3645p0627
$$ plain form
10969 78695 112172 140314 134200 221158 284356 257149 263299 184626 100523 103744 163692 193008
10957 193008 240051 267569 340101 405392 524418 565563 705734 828013 892290 835076 740475
10946 740475 582921 496925 417122 352706 295009 232144 263341 210267 190342 220221 205378
10935 205378 172374 237428 269023 310433 315223 250559 224763 212568 282451 252237 238939 260565
10923 260565 309286 316313 324421 306661 325328 286547 262899 215158 159555 128676 213603 230616
10911 230616 242788 249837 245066 230181 249419 248959 292789 282553 270051 335904 475757 494869
10899 494869 553556 592104 687825 805721 833716 809915 756744 734390 669101 538375 452115
10888 452115 376410 305274 288489 274976 276397 285361 243925 222391 246731 236248 184288 255915
$$ packed form
10969G8695L3477K8142o114Q6958O3198k7207O150p8673q4103L221N9948K9316
10957A93008M7043K7518P2532O5291J19026M1145J40171J22279O4277n7214r4601
10946G40475j57554q5996p9803o4416n7697o2865L1197n3074j9925K9879j4843
10935B05378l3004O5054L1595M1410M790o4664k5796j2195O9883l0214j3298K1626
10923B60565M8721P027Q108j7760J8667l8781k3648m7741n5603l0879Q4927J7013
10911B30616J2172P049m771j4885J9238m60M3830j0236j2502O5853J39853J9112
10899D94869N8687L8548R5721J17896K7995k3801n3171k2354o5289j30726q6260
10888D52115p5705p1136j6785j3513J421Q964m1436k1534K4340j0483n1960P1627
$$ plain form
10876 255915 270209 272323 283644 353059 319392 234533 223318 205099 146665 154528 144634 114534
10864 114534 82527 38168 62787 86457 41921 123692 111765 160293 205209 280814 222806
10853 222806 147969 145919 136419 146913 160532 128970 187308 203734 261295 309461 270957 185173
10841 185173 201875 135402 105470 173585 186612 121698 43619 56029 101286 157513 144144
10830 144144 104373 131221 108306 136397 127653 84282 107425 134668 152879 112504 98460 163021
10818 163021 142901 173865 180971 68111 9648 -31554 -31667 -18255 -39273 -40971 9668 72514
10806 72514 126565 114293 124664 147913 150283 120768 110058 145716 150612 140254 223552 248309
10794 248309 189962 149556 138511 174176 237296 223088 194600 157501 176892 176881 149648 143633
$$ packed form
10876B55915J4294K114J1321O9415l3667q4859j1215j8219n8434P863r894l0100
10864A14534l2007m4359K4619K3670m4536Q1771j1927M8528M4916P5605n8008
10853B22806p4837k050r500J0494J3619l1562N8338J6426N7561M8166l8504q5784
10841A85173J6702o6473k9932O8115J3027o4914p8079J2410M5257N6227j3369
10830A44144l9771K6848k2915K8091q744m3371K3143K7243J8211m0375j4044O4561
10818A63021k0120L0964P106j12860n8463m1202j13J3412k1018j698N0639O2846
10806G2514N4051j2272J0371K3249K370k9515j0710L5658M896j0358Q3298K4757
10794B48309n8347m0406j1045L5665O3120j4208k8488l7099J9391j1k7233o015
$$ plain form
10782 143633 123544 38503 -26458 -4727 -11040 -35953 33001 120507 86319 -24407 14572
10771 14572 3852 -12965 11223 28213 56199 31627 67817 94368 107114 26804 -15396 -61264
10759 -61264 -83678 -94166 -76332 -7114 31450 -10284 -66395 -67670 -58280 -85075 -82072 -55148
10747 -55148 -4927 46618 -57112 -111914 -44321 -16745 68671 56961 21 -10752 84240
10736 84240 164954 99508 -6978 13031 55455 103438 68935 77068 106417 113076 239979 313375
10724 313375 268519 268032 212210 133388 99355 147933 155860 214551 192068 160388 103114 118919
10712 118919 163546 133882 132746 147588 124505 66107 18002 107338 197307 181744 102604 135914
10700 135914 235796 225868 133189 95894 147599 221074 150132 92733 75682 75826 78438 144635
$$ packed form
10782A43633k0089q5041o4961K1731o313k4913O8954Q7506l4188j10726L8979
10771A4572j0720j6817K4188J6990K7986k4572L6190K6551J2746q0310m2200m5868
10759f1264k2414j0488J7834O9218L8564m1734n6111j275R390k6795L003K6924
10747e5148N0221N1545j03730n4802O7593K7576Q5416j1710n6940j0773R4992
10736H4240Q0714o5446j06486K0009M2424M7983l4503Q133K9349O659J26903P3396
10724C13375m4856m87n5822p8822l4033M8578P927N8691k2483l1680n7274J5805
10712A18919M4627k9664j136J4842k3083n8398m8105Q9336Q9969j5563p9140L3310
10700A35914R9882r928r2679l7295N1705P3475p0942n7399j7051J44K612O6197
$$ plain form
10688 144635 182508 188226 259089 307064 224342 192188 180357 140020 117308 75193 34136 34491
10676 34491 103880 145531 130688 118430 148863 244987 207557 133862 188594 172116 124699 71001
10664 71001 66894 100183 128457 116584 103011 175172 171688 88791 46598 74032 172654 230535
10652 230535 155165 96864 71923 64699 61022 73760 51600 61839 157209 201180 222222 221804
10640 221804 184809 167094 153417 156290 163275 171867 116023 146047 192304 196091 184613 205740
10628 205740 315717 410643 617709 835337 908950 934671 913203 847345 711494 555281
10618 555281 470156 407990 386723 309663 297606 293167 249172 207147 143911 188561 238565 266557
10606 266557 272522 251488 291943 302607 318760 363018 338078 344052 294274 227900 255335 287317
$$ packed form
10688A44635L7873N718P0863M7975q2722l2154j1831m0337k2712m2115m1057L55
10676C4491O9389M1651j4843j2258L0433R6124l7430p3695N4732j6478m7417n3698
10664G1001m107L3289K8274j1873j3573P2161l484q2897m2193K7434R8622N7881
10652B30535p5370n8301k4941p224l677J2738k2160J0239R5370M3971K1042m18
10640B21804l6995j7715j3677K873O985Q592n5844L0024M6257L787j1478K1127
10628B05740J09977R4926K07066K17628P3613K5721k1468o5858j35851j56213
10618E55281q5125o2166k1267p7060j2057m439m3995m2025o3236M4650N0004K7992
10606B66557N965k1034M0455J0664J6153M4258k4940N974m9778o6374K7435L1982
$$ plain form
10594 287317 276505 226129 243666 283152 415699 553085 608204 689051 774889 873970 974081
10583 974081 1020518 1067283 1056667 979044 1010447 1090769 1131699 1119376 1078702 988787 921436
10572 921436 852444 733588 621617 573517 534655 401592 336117 311861 372991 421089 468591
10561 468591 435888 465429 454076 426405 430007 367482 357398 411272 465461 477054 450511 419133
10549 419133 359050 373041 439996 452638 428727 367990 310832 264641 185704 220385 324629
10538 324629 297557 277047 280718 236363 260962 350952 330409 332787 376205 473391 550879 550784
10526 550784 510485 588244 688011 731612 783207 842483 811815 690876 585859 520949 440363
10515 440363 340346 345273 381770 356576 338429 268620 278980 321950 369442 410838 421273
$$ packed form
10594B87317j0812n0376J7537L9486J32547J37386N5119Q0847Q5838R9081J00111
10583I74081M6437M6765j0616p7623L1403Q0322M0930j2323m0674q9915o7351
10572I21436o8992j18856j11971m8100l8862j33063o5475k4256O1130M8098M7502
10561D68591l2703K9541j1353k7671L602o2525j0084N3874N4189J1593k6543l1378
10549D19133o0083J3991O6955J2642k3911o0737n7158m6191p8937L4681J04244
10538C24629k7072k0510L671m4355K4599Q9990k0543K378M3418R7186P7488r5
10526E50784m0299P7759R9767M3601N1595N9276l0668j20939j05017o4910q0586
10515D40363j00017M927L6497k5194j8147o9809J0360M2970M7492M1396J0435
$$ plain form
10504 421273 416816 385689 309715 295862 244416 259509 316552 261894 189241 230484 203840 193940
10492 193940 155349 203109 286087 267608 273419 281430 332923 332301 220539 280202 340905 320479
10480 320479 300578 442349 526422 574726 611526 550010 535137 458874 429502 362054 323232
10469 323232 362516 327005 279029 356316 344714 207107 75146 111984 158377 81115 36147
10458 36147 117502 184347 182000 225412 279952 251945 259186 248493 230430 171809 84341 68632
10446 68632 95097 118388 108602 225894 274680 180335 217891 216289 168330 168733 117239 164315
10434 164315 131347 165142 233514 240916 208262 287399 361524 339714 283998 279255 296492 259583
10422 259583 208445 214938 311538 304211 313295 285923 319041 284503 184906 194190 175327 137259
$$ packed form
10504D21273m457l1127p5974j3853n1446J5093N7043n4658p2653M1243k6644r900
10492A93940l8591M7760Q2978j8479N811Q011N1493o22j11762N9663O0703k0426
10480C20479j9901J41771Q4073M8304L6800o1516j4873p6263k9372o7448l8822
10469C23232L9284l5511m7976P7287j1602j37607j31961L6838M6393p7262m4968
10458C6147Q1355O6845k347M3412N4540k8007P241j0693j8063n8621q7468j5709
10446F8632K6465K3291r786J17292M8786r4345L7556j602m7959M03n1494M7076
10434A64315l2968L3795O8372P402l2654P9137P4125k1810n5716m743J7237l6909
10422B59583n1138O493R6600p327R084k7372L3118l4538r9597R284j8863l8068
$$ plain form
10410 137259 139469 211045 195325 115872 56480 40193 83164 54753 53004 109330 124031 135384
10398 135384 155721 226782 257878 222151 139296 26883 -619 96772 99037 99917 98963 127121
10386 127121 167339 127922 53249 30229 50386 47908 107749 151635 147328 91706 81183 107817
10374 107817 58467 1191 14867 -48842 -20687 57672 67292 52124 64407 94812 126435 137994
10362 137994 150890 92696 78755 127740 101862 69098 52749 57669 108207 145611 82072 16268
10350 16268 84662 139048 138774 139410 135975 127543 26275 63133 63415 7238 -37828 -38972 11505
10337 11505 64003 90710 92295 67041 37109 -33605 -66380 -76490 -61803 -105973 -148491 -61065
10325 -61065 24965 54911 49681 73757 141600 232916 216484 143457 77894 27383 56953 49458
$$ packed form
10410A37259K210P1576j5720p9453n9392j6287M2971k8411j749N6326J4701J1353
10398A35384K0337P1061L1096l5727q2855j12413k7502R7391K265Q80r54K8158
10386A27121M0218l9417p4673k3020K0157k478N9841M3886m307n5622j0523K6634
10374A07817m9350n7276J3676o3709K8155P8359R620j5168J2283L0405L1623J1559
10362A37994J2896n8194j3941M8985k5878l2764j6349M920N0538L7404o3539o5804
10350A6268O8394N4386k74O36l435q432j01268L6858K82n6177m5066j144N0477
10337A1505N2498K6707J585k5254k9932p0714l2775j0110J4687m4170m2518Q7426
10325f1065Q6030K9946n230K4076O7843R1316j6432p3027o5563n0511K9570p495
$$ plain form
10313 49458 54322 55169 81772 91741 74391 47400 38089 92169 105232 -2897 -43842 4724
10301 4724 48365 150114 124588 62433 36778 -330 19850 105021 97717 20720 -13674 34628
10289 34628 100792 80594 13413 -23216 -24068 11710 10587 -33476 -107785 -110347 -42024 -16859
10277 -16859 23864 129620 171728 237419 262070 237876 160286 80810 53038 128121 95698
10266 95698 12895 27022 12063 17434 60403 68718 -31770 -58797 -23179 22767 56707 27024
10254 27024 93391 171827 183982 232257 226710 113485 74782 46383 25323 -14868 -28487 -58497
10242 -58497 1858 39858 24056 -10471 55381 133490 204414 206962 223769 179024 54719 20437
10230 20437 35599 122408 214344 337768 391501 487233 532651 561440 569804 623072 558857 513384
$$ packed form
10313D9458M864Q47K6603R969j7350k6991r311N4080J3063j08129m0945M8566
10301D724M3641J01749k5526o2155k5655l7108K0180Q5171p304p6997l4394M8302
10289C4628O6164k0198o7181l6629q52L5778j123m4063p4309k562O8323K5165
10277a6859M0723J05756M2108O5691K4651k4194p7590p9476k7772P5083l2423
10266I5698q2803J4127j4959N371M2969Q315j00488k7027L5618M5946L3940k9683
10254B7024O6367P8436J2155M8275n547j13225l8703k8399k1060m0191j3619l0010
10242e8497O0355L8000j5802l4527O5852P8109P0924K548J6807m4745j24305l4282
10230B0437J5162Q6809R1936J23424N3733R5732M5418K8789Q364N3268o4215m5473
$$ plain form
10218 513384 457219 340063 235515 156737 128994 168734 231765 260381 231246 194095 230132
10207 230132 249269 141271 145249 134650 109608 110093 97053 150438 117008 179561 214635 112584
10195 112584 104149 225113 308876 185628 185878 83859 53915 70159 99512 113192 255481
10184 255481 309362 372563 403954 455676 513287 691677 726543 686337 558381 487516 477269
10173 477269 398532 385568 326062 303725 341437 338247 254723 194155 165572 191492 240492 224933
10161 224933 246071 262632 189979 131067 243471 294331 270858 229652 361358 446248 455072
10150 455072 445478 460672 486700 621144 647503 604055 565875 496116 459523 450203 426011 355679
10138 355679 310232 255164 222603 213125 206708 200112 173011 146844 265686 273744 240051 257597
$$ packed form
10218E13384n6165j17156j04548p8778k7743L9740O3031K8616k9135l7151L6037
10207B30132J9137j07998L978j0599k5042M85j3040N3385l3430O2553L5074j02051
10195A12584q435J20964Q3763j23248K50j02019k9944J6244K9353J3680J42289
10184B55481N3881O3201L1391N1722N7611J78390L4866m0206j27956p0865j0247
10173D77269p8737j2964n9506k2337L7712l190q3524o0568k8583K5920M9000j5559
10161B24933K1138J6561p2653n8912J12404N0860k3473m1206J31706Q4890Q824
10150D55072r594J5194K6028J34444K6359m3448l8180o9759l6593r320k4192p0332
10138C55679m5447n5068l2561r478o417o596k7101k6167J18842Q058l3693J7546
$$ plain form
10126 257597 379500 440886 360120 293058 204567 228727 296353 285163 233809 209799 264185
10115 264185 265361 313310 347643 425971 617322 739742 725930 623562 634413 603220 440067
10104 440067 285935 204496 212724 271275 321285 319686 261328 241718 220055 89393 122346
10093 122346 170276 252530 297913 315492 302010 329791 335388 336757 280285 239050 296951 302913
10081 302913 300385 357568 353720 310148 271746 318870 328974 300593 367733 372709 440863 561227
10069 561227 650458 772392 906574 876305 805692 761001 588059 437535 473564 495653 413091
10058 413091 330198 294541 435401 528532 473849 372570 333445 420629 475046 520143 491873
10047 491873 478747 535475 530547 525197 596801 612777 639947 675223 604758 606764 624124 622292
$$ packed form
10126B57597J21903O1386q0766o7062q8491K4160O7626j1190n1354k4010N4386
10115B64185J176M7949L4333P8328J91351J22420j3812j02368J0851l1193j63153
10104D40067j54132q1439Q228N8551N0010j599n8358j9610k1663j30662L2953
10093A22346M7930Q2254M5383J7579j3482K7781N597J369n6472m1235N7901N962
10081C02913k528N7183l848m3572l8402M7124J0104k8381O7140M976O8154J20364
10069E61227Q9231J21934J34182l0269p0613m4691j72942j50524L6029K2089q2562
10058D13091q2893l5657J40860R3131n4683j01279l9125Q7184N4417M5097k8270
10047D91873j3126N6728m928n350P1604J5976K7170L5276p0465K006J7360j832
$$ plain form
10035 622292 564598 509890 478405 467771 479925 553525 620055 575980 508073 469830 425252
10024 425252 441076 490609 520709 478014 488363 454488 508664 544604 582714 603317 697517
10013 697517 719168 660447 639487 612366 585295 570727 599805 597476 574052 535972 440259 391244
10001 391244 462390 500456 406619 409087 429902 426867 412474 367116 350546 419190 435104 434752
9989 434752 454080 431579 453717 495603 525700 556444 568097 612288 593658 543516 447320 405188
9977 405188 402455 388594 386358 408988 416086 325256 320259 374476 296022 229200 211053 279396
9965 279396 371441 444535 364059 291937 295242 305610 245051 229643 269400 261017 307209 360751
9953 360751 372029 379853 382374 338949 310663 218563 179795 216091 292142 272173 331894 272455
$$ packed form
10035F22292n7694n4708l1485j0634J2154P3600O6530m4075o7907l8243m4578
10024D25252J5824M9533L0100m2695J0349l3875N4176L5940L8110K0603R4200
10013F97517K1651n8721k0960k7121k7071j4568K9078k329k3424l8080r5713m9015
10001C91244P1146L8066r3837K468K0815l035j4393m5358j6570O8644J5914l52
9989D34752J9328k2501K2138M1886L0097L0744J1653M4191j8630n0142r6196m2132
9977D05188k733j3861k236K2630P098r0830m997N4217p8454o6822j8147O8343
9965B79396R2045P3094q0476p2122L305J0368o0559j5408L9757q383M6192N3542
9953C60751J1278P824K521m3425k8286r2100l8768L6296P6051j9969N9721n9439
$$ plain form
9941 272455 238175 263013 300578 313641 222776 201261 200716 171955 143190 157004 154560 190552
9929 190552 220977 266270 240352 284264 242245 203538 156132 186587 264144 218269 190183 191250
9917 191250 256355 304558 373711 379791 292957 229978 246756 304510 306631 305302 355804 321166
9905 321166 244997 250227 218455 171233 214616 220931 242808 255382 250828 258072 271369 221750
9893 221750 225559 213239 169453 200127 256513 247819 237524 239941 134253 177134 258878 295280
9881 295280 242924 244445 206225 218805 255982 285108 308603 329967 319789 247413 234037 142569
9869 142569 111403 53428 133603 236567 226404 195105 259261 266103 196565 153044 175638 149652
9857 149652 173256 165656 194927 281305 319969 308483 324378 250306 208268 241110 218915 205295
$$ packed form
9941B72455l4280K4838L7565J3063r0865k1515n45k8761k8765J3814k444L5992
9929A90552L0425M5293k5918M3912m2019l8707m7406L0455P7557m5875k8086J067
9917A91250O5105M8203O9153O080q6834o2979J6778N7754K121j329N0502l4638
9905C21166p6169N230l1772m7222M3383O315K1877J2574m554P244J3297m9619
9893B21750L809j2320m3786L0674N6386q694j0295K417j05688M2881Q1744L6402
9881B95280n2356J521l8220J2580L7177K9126K3495K1364j0178p2376j3376r1468
9869A42569l1166n7975Q0175J02964j0163l1299O4156O842o9538m3521K2594k5986
9857A49652K3604p600K9271Q6378L8664j1486J5895p4072m2038L2842k2195j3620
$$ plain form
9845 205295 158279 109690 109576 145199 267498 319359 321537 262777 252048 269693 311889 364054
9833 364054 334273 386818 388192 351005 344907 266654 240020 279265 299253 337531 343147 295126
9821 295126 291926 295245 251813 286542 334266 428672 426683 354571 286436 323868 369439 425794
9809 425794 378273 406250 405136 453045 481328 449171 421259 442898 432565 433512 481517 435905
9797 435905 478037 454580 440634 501259 504133 492433 584794 672087 612726 567787 500942 526137
9785 526137 630769 654800 618962 583655 487811 532961 618751 578070 584379 587596 591677 609033
9773 609033 618751 552783 502793 567836 586764 620620 665940 608484 522145 453367 559641 654175
9761 654175 625340 582264 494788 456698 530914 610218 627472 618778 664577 643023 637909 641768
$$ packed form
9845B05295m7016m8589j14L5623J22299N1861K178n8760j0729J7645M2196N2165
9833C64054k9781N2545J374l7187o098p8253k6634L9245J9988L8278N616m8021
9821B95126l200L319m3432L4729M7724R4406j989p2112o8135L7432M5571N6355
9809D25794m7521K7977j114M7909K8283l2157k7912K1639j0333R47M8005m5612
9797D35905M2132k3457j3946O0625K874j1700R2361Q7293n9361m4939o6845K5195
9785E26137J04632K4031l5838l5307r5844M5150Q5790m0681O309L217M081J7356
9773F09033R718o5968m9990O5043J8928L3856M5320n7456q6339o8778J06274R4534
9761F54175k8835m3076q7476l8090P4216P9304J7254q694M5799k1554n114L859
$$ plain form
9749 641768 608975 563967 570020 604414 681509 711846 745590 752072 756306 724373 641485 643654
9737 643654 663186 630321 651839 672805 644921 548255 640171 730344 748154 776039 709027 627583
9725 627583 678510 672003 604194 592048 532538 519540 560565 604473 643231 635579 664614 781248
9713 781248 832506 846341 805475 835943 826077 766752 804814 751892 759530 860355 883045 814027
9701 814027 787048 812135 886338 921731 906709 901956 824203 752845 706192 790105 837395 825629
9689 825629 872398 895704 914868 961036 1001927 939203 898631 895240 960943 1004817 943193 968278
9677 968278 995322 1040478 1147377 1192119 1159726 1173665 1217625 1306308 1240008 1271627 1315638
9666 1315638 1369645 1362358 1475536 1501797 1470541 1413955 1409923 1387165 1369012 1420073 1436374 1384437
$$ packed form
9749F41768l2793m5008O053L4394P7095L0337L3744O482M234l1933q2888K169
9737F43654J9532l2865K1518K0966k7884r6666R1916R0173J7810K7885o7012q1444
9725F27583N0927o507o7809j2146n9510j2998M1025M3908L8758p652K9035J16634
9713G81248N1258J3835m0866L0468r866n9325L8062n2922P638J00825K2690o9018
9701H14027k6979K5087P4203L5393j5022m753p7753p1358m6653Q3913M7290j1766
9689H25629M6769K3306J9164M6168M0891o2724m0572l391O5703M3874o1624K5085
9677I68278K7044M5156J06899M4742l2393J3939M3960Q8683o6300L1619M4011
9666A315638N4007p287J13178K6261l1256n6586m032k2758j8153N1061J6301n1937
$$ plain form
9654 1384437 1386029 1445529 1508492 1475209 1478158 1439380 1390895 1414849 1514010 1571095 1675579 1709097
9642 1709097 1652083 1581853 1638193 1667898 1702573 1704962 1778231 1748005 1676811 1753502 1823751 1800164
9630 1800164 1775156 1897454 1940380 1958661 1955666 1962156 1953203 1955594 2009454 2050472 2027079 1953380
9618 1953380 1888843 1877579 1837384 1751013 1736666 1740090 1782091 1808539 1865989 1873093 1790273 1739913
9606 1739913 1722170 1767026 1766421 1757516 1640026 1590560 1550733 1641949 1697450 1708113 1694462 1760282
9594 1760282 1766968 1722001 1685862 1669616 1673804 1717485 1679621 1683705 1685861 1618809 1636566 1624369
9582 1624369 1550658 1566174 1488121 1460806 1501949 1519041 1552307 1515651 1417447 1404685 1368162
9571 1368162 1391971 1332746 1306140 1342753 1362731 1395367 1347590 1303583 1236746 1204587 1166404
$$ packed form
9654A384437J592N9500O2963l3283K949l8778m8485K3954R9161N7085J04484L3518
9642A709097n7014p0230N6340K9705L4675K389P3269l0226p1194P6691P0249k3587
9630A800164k5008J22298M2926J8281k995O490q953K391N3860M1018k3393p3699
9618A953380o4537j1264m0195q6371j4347L424M2001K6448N7450P104q2820n0360
9606A739913j7743M4856o05q905j17490m9466l9827R1216N5501J0663j3651O5820
9594A760282O686m4967l6139j6246M188M3681l7864M084K156o7052J7757j2197
9582A624369p3711J5516p8053k7315M1143J7092L3266l6656r8204j2762l6523
9571A368162K3809n9225k6606L6613J9978L2636m7777m4007o6837l2159l8183
$$ plain form
9560 1166404 1140811 1140383 1099688 1099480 1077693 1085438 1103974 1053340 1029082 1018606 950270 904019
9548 904019 948066 1017879 975327 927759 881431 855125 876427 858927 814608 718642 756684 735631
9536 735631 731626 698779 656778 653832 703797 788935 810097 824224 734102 658835 649198 602804
9524 602804 598432 646160 605577 623520 612142 617035 634390 713101 687385 655360 616056 677948
9512 677948 654654 637643 688191 709852 736250 709838 681738 627017 667815 677857 633210 682262
9500 682262 766230 654829 644420 674556 695337 757045 754827 749193 705535 652222 643690 641689
9488 641689 720497 787324 816886 802557 738457 743014 836747 883979 896770 963910 986652 936900
9476 936900 872867 803066 849405 924954 911731 908140 924403 955648 947465 875032 857589 895785
$$ packed form
9560A166404k5593m28m0695k08k1787P745J8536n0634k4258j0476o8336m6251
9548I04019M4047O9813m2552m7568m6328k6306K1302j7500m4319r5966L8042k1053
9536G35631m005l2847m2001k946M9965Q5138K1162J4127r0122p5267r637m6394
9524F02804m372M7728m0583J7943j1378M893J7355P8711k5716l2025l9304O1892
9512F77948k3294j7011N0548K1661K6398k6412k8100n4721M0798J0042m4647M9052
9500F82262Q3968j11401j0409L0136K0781O1708k218n634m3658n3313q532k001
9488F41689P8808O6827K9562j4329o4100M557R3733M7232J2791O7140K2742m9752
9476I36900o4033o9801M6339P5549j3223l591J6263L1245q183p2433j7443L8196
$$ plain form
9464 895785 917871 926841 869677 828765 932015 1062910 1118533 1112909 1089731 1123585 1099029 1058557
9452 1058557 1052945 1020579 996858 955704 950885 914641 845328 889201 948410 1057623 1121262 1123008
9440 1123008 1066411 980944 929456 954421 953636 978839 1046115 1086242 1142989 1163418 1203322 1128567
9428 1128567 1162664 1221491 1222187 1188686 1242130 1276147 1301020 1331622 1389726 1346781 1302466 1299464
9416 1299464 1343327 1387112 1431969 1485087 1474736 1467889 1505089 1587633 1588869 1674361 1675520 1702213
9404 1702213 1646400 1569294 1649231 1634412 1626987 1656187 1716095 1841288 1984815 1867890 1861329
9393 1861329 1909274 1936725 1919649 1948360 2032750 2155785 2251234 2318509 2412763 2466326 2531960
9382 2531960 2546683 2647105 2746360 2789216 2821994 2862156 2958424 3065307 3121458 3178027 3271295
$$ packed form
9464H95785K2086Q970n7164m0912J03250J30895N5623n624k3178L3854k4556m0472
9452A058557n612l2366k3721m1154m819l6244o9313M3873N9209J09213O3639J746
9440A123008n6597q5467n1488K4965p85K5203O7276M0127N6747K0429L9904p4755
9428A128567L4097N8827O96l3501N3444L4017K4873L0602N8104m2945m4315l002
9416A299464M3863M3785M4857N3118j0351o847L7200Q2544J236Q5492J159K6693
9404A702213n5813p7106P9937j4819p425K9200N9908J25193J43527j16925o561
9393A861329M7945K7451j7076K8711Q4390J23035R5449O7275R4254N3563O5634
9382B531960J4723J00422R9255M2856L2778M0162R6268J06883N6151N6569R3268
$$ plain form
9371 3271295 3432082 3533363 3643270 3781517 4017996 4203636 4371343 4556262 4656612 4824218
9361 4824218 4987750 5037504 5117797 5258254 5342016 5413922 5424926 5407832 5467816 5561626 5747797
9350 5747797 5906007 6060325 6237429 6389340 6677265 6890355 7058077 7368387 7666616 8009575
9340 8009575 8401119 8861997 9244185 9724504 10315113 10982595 11643187 12181304 12373875 12297949
9330 12297949 12249087 12352185 12498056 12675492 12988969 13272124 13602959 13952993 14263499 14530747
9320 14530747 14602232 14597272 14698363 14822356 14933238 15165248 15518386 15904753 16309325 16795572
9310 16795572 17312617 17852298 18395771 18964739 19618144 20248124 20857325 21479255 22171585
9301 22171585 22770881 23347834 23946096 24670023 25481964 26348100 27250037 28070640 28944128
$$ packed form
9371C271295J60787J01281J09907J38247K36479J85640J67707J84919J00350J67606
9361D824218J63532M9754Q0293J40457Q3762P1906J1004j7094N9984R3810J86171
9350E747797J58210J54318J77104J51911K87925K13090J67722L10310K98229L42959
9340H009575L91544M60878L82188M80319N90609O67482O60592N38117J92571p5926
9330A2297949m8862J03098J45871J77436L13477K83155L30835L50034L10506K67248
9320A4530747P1485m960J01091J23993J10882K32010L53138L86367M04572M86247
9310A6795572N17045N39681N43473N68968O53405O29980O09201O21930O92330
9301B2171585N99296N76953N98262P23927Q11941Q66136R01937Q20603Q73488
$$ plain form
9292 28944128 30019003 31156338 32263088 33180718 33963948 34778583 35767831 37004300 38670250
9283 38670250 40574745 42481874 44202010 45751483 47009054 47984482 48978327 50317755
9275 50317755 52038926 53914525 55837631 57760279 59970595 62832863 66382461 70763784
9267 70763784 75900156 81546188 87691735 94748003 103435520 114339502 127816472 143954497
9259 143954497 162647132 183477924 206092573 230516172 255528503 278005469 295548420
9252 295548420 308940214 320305075 330713626 340045114 348662757 357420696 366543300 375178197
9244 375178197 382098559 386119556 386673095 384670816 382259296 381763869 384780851 390942471
9236 390942471 398227286 404444167 408734919 411361014 413206229 414449855 414796227 414040571
$$ packed form
9292B8944128J074875J137335J106750R17630P83230Q14635R89248J236469J665950
9283C8670250J904495J907129J720136J549473J257571R75428R93845J339428
9275E0317755J721171J875599J923106J922648K210316K862268L549598M381323
9267G0763784N136372N646032O145547P056268Q687517J0903982J3476970J6138025
9259A43954497J8692635K0830792K2614649K4423599K5012331K2476966J7542951
9252B95548420J3391794J1364861J0408551R331488Q617643Q757939R122604Q634897
9244C75178197O920362M020997N53539k002279k411520m95427L016982O161620
9236C90942471P284815O216881M290752K626095J845215J243626L46372p55656
$$ plain form
9228 414040571 412094587 409276606 405802655 401444333 395989110 388945096 379902187 368905316
9220 368905316 356990540 345573362 335451872 326887713 319348731 312193151 304933755 298000553
9212 298000553 292258505 287809860 284251102 281334583 278931292 276990496 275375691 274198425
9204 274198425 273076515 271499688 268671900 263943461 257161871 248674214 239400186 229918521
9196 229918521 220635796 211981522 204158889 197245963 191174644 185847292 181314090 177688596
9188 177688596 175119797 173406393 172535576 172229995 172109187 171615670 170673243 169130188 166970206
9179 166970206 163941915 159742528 154730867 149255972 143640538 138160803 132928401 128024467
9171 128024467 123334010 118803988 114509094 110796651 107657986 104945082 102518861 100162239
$$ packed form
9228D14040571j945984k817981l473951m358322n455223p044014r042909j0996871
9220C68905316j1914776j1417178j0121490q564159p538982p155580p259396o933202
9212B98000553n742048m448645l558758k916519k403291j940796j614805j177266
9204B74198425j121910j576827k827788m728439o781590q487657r274028r481665
9196B29918521r282725q654274p822633o912926o071319n327352m533202l625494
9188A77688596k568799j713404q70817l05581j20808m93517r42427j543055k159982
9179A66970206l028291m199387n011661n474895n615434n479735n232402m903934
9171A28024467m690457m530022m294894l712443l138665k712904k426221k356622
$$ plain form
9163 100162239 98039860 96082723 94055441 91979484 89806524 87500364 85146588 82852458
9155 82852458 80641966 78582077 76612448 74774358 73327214 72075794 70826489 69548985
9147 69548985 68304970 67055182 65834023 64579575 63243878 61667752 59882498 57929877
9139 57929877 55745431 53663786 51878083 50442827 49294217 48271239 47283658 46290381
9131 46290381 45271976 44180821 43104695 42086318 41122052 40275849 39477145 38642361 37742466
9122 37742466 36885474 36016599 35160805 34399565 33686358 32862764 32097851 31356998 30636860
9113 30636860 30043649 29464230 28841747 28127141 27442966 26776579 26170746 25656333 25095582
9104 25095582 24482277 23882757 23311480 22742081 22180268 21653029 21197042 20780951 20369088
$$ packed form
9163A00162239k122379j957137k027282k075957k172960k306160k353776k294130
9155H2852458k210492k059889j969629j838090j447144j251420j249305j277504
9147F9548985j244015j249788j221159j254448j335697j576126j785254j952621
9139E7929877k184446k081645j785703j435256j148610j022978r87581r93277
9131D6290381j018405j091155j076126j018377r64266q46203p98704q34784q99895
9122C7742466q56992q68875q55794p61240p13207q23594p64913p40853p20138
9113C0636860n93211n79419o22483p14606o84175o66387o05833n14413n60751
9104B5095582o13305n99520n71277n69399n61813n27239m55987m16091m11863
$$ plain form
9095 20369088 19908011 19527266 19217847 18881739 18576821 18249584 17904073 17527153 17193720
9086 17193720 16807446 16459301 16163345 15891811 15602812 15363856 15064419 14844543 14707044
9077 14707044 14460868 14164140 13927007 13813046 13638992 13420119 13172358 13005408 12897696
9068 12897696 12695293 12382943 12140113 12012834 11872251 11706465 11445378 11238819 11080709
9059 11080709 10890384 10742645 10633784 10494405 10350734 10152862 10053018 9946893 9770426 9628287
9049 9628287 9519294 9360488 9193404 9084423 9006601 8867930 8686496 8583640 8513751 8469459
9039 8469459 8310555 8193369 8192854 8224813 8118868 8031373 7927825 7825776 7681501 7552093
9029 7552093 7458483 7343254 7162115 6982655 6792465 6675241 6526959 6441844 6329346 6232092
$$ packed form
9095B0369088m61077l80745l09419l36108l04918l27237l45511l76920l33433
9086A7193720l86274l48145k95956k71534k88999k38956k99437k19876j37499
9077A4707044k46176k96728k37133j13961j74054k18873k47761j66950j07712
9068A2897696k02403l12350k42830j27279j40583j65786k61087k06559j58110
9059A1080709j90325j47739j08861j39379j43671j97872r9844j06125j76467j42139
9049I628287j08993j58806j67084j08981p7822j38671j81434j02856o9889m4292
9039H469459j58904j17186n15L1959j05945q7495j03548j02049j44275j29408
9029G552093r3610j15229j81139j79460j90190j17224j48282q5115j12498r7254
$$ plain form
9019 6232092 6193502 6114736 5977834 5831617 5714802 5689408 5619374 5586399 5453542 5378956 5312509
9008 5312509 5239391 5184128 5091849 4997947 4967382 4909134 4854626 4805370 4746115 4619968 4517431
8997 4517431 4462282 4399904 4284926 4220580 4122604 4072225 4000757 3957246 3910435 3841635 3710275
8986 3710275 3620550 3585510 3548877 3487052 3406160 3303814 3273063 3253593 3171821 3128197 3081530
8975 3081530 3051903 2985269 2835291 2761581 2794279 2769155 2746755 2709537 2645317 2641898 2631638
8964 2631638 2630705 2586309 2536655 2539552 2448409 2379133 2397970 2477537 2418135 2385832 2360102 2307872
8952 2307872 2369740 2346412 2309765 2295080 2181429 2071642 2034016 2020064 2031449 2029412 2067656
8941 2067656 2120735 2095707 2000946 2008898 1957774 1885561 1921259 1953161 1948985 1850811 1851406 1912364
$$ packed form
9019F232092l8590p8766j36902j46217j16815k5394p0034l2975j32857p4586o6447
9008E312509p3118n5263r2279r3902l0565n8248n4508m9256n9255j26147j02537
8997D517431n5149o2378j14978o4346r7976n0379p1468m3511m6811o8800j31360
8986C710275q9725l5040l6633o1825q0892j02346l0751j9470q1772m3624m6667
8975C081530k9627o6634j49978p3710L2698k5124k2400l7218o4220l419j0260
8964B631638r33m4396m9654K897r1143o9276J8837P9567n9402l2303k5730n2230
8952B307872O1868k3328l6647j4685j13651j09787l7626j3952J1385k037L8244
8941B067656N3079k5028r4761P952n1124p2213L5698L1902m176r8174N95O0958
$$ plain form
8929 1912364 1893766 1853233 1826589 1890618 1881021 1850968 1792466 1806715 1880195 1844722 1724886
8918 1724886 1664873 1606731 1526323 1483939 1457214 1457645 1479351 1524664 1503819 1461949 1438600 1457002
8906 1457002 1460003 1415273 1397656 1349765 1308841 1315930 1299879 1279611 1323625 1311842 1316562 1364353
8894 1364353 1403085 1445369 1435833 1454209 1482209 1517267 1496423 1458714 1503504 1451535 1364924 1505733
8882 1505733 1521828 1473434 1489392 1513903 1524285 1483767 1505550 1473499 1490921 1453659 1338306
8871 1338306 1301245 1370990 1476934 1527615 1513519 1460618 1449401 1461142 1427442 1362486 1294669
8860 1294669 1287857 1369439 1390935 1436716 1458374 1500982 1604636 1691311 1676500 1724004 1789416
8849 1789416 1849162 1851332 1791573 1715167 1688127 1643124 1616153 1590421 1544335 1542937 1576945 1561062
$$ packed form
8929A912364j8598m0533k6644O4029r597l0053n8502J4249P3480l5473j19836
8918A724886o0013n8142q0408m2384k6725M31K1706M5313k0845m1870k3349J8402
8906A457002L001m4730j7617m7891m0924P089j6051k0268M4014j1783M720M7791
8894A364353L8732M2284r536J8376K8000L5058k0844l7709M4790n1969q6611J40809
8882A505733J6095m8394J5958K4511J0382m0518K1783l2051J7422l7262j15353
8871A338306l7061O9745J05944N0681j4096n2901j1217J1741l3700o4956o7817
8860A294669o812Q1582K1496M5781K1658M2608J03654Q6675j4811M7504O5412
8849A789416N9746K170n9759p6406k7040m5003k6971k5732m6086j398L4008j5883
$$ plain form
8837 1561062 1599714 1642308 1611430 1600270 1586181 1632310 1631880 1527920 1532986 1545322 1520939 1551482
8825 1551482 1510747 1443731 1516010 1471960 1485524 1481783 1558356 1573613 1518899 1514969 1523819 1529278
8813 1529278 1587196 1684533 1664893 1747359 1864410 1941690 2034307 1972336 1921098 1846720 1818442
8802 1818442 1813877 1780619 1771615 1724374 1632020 1508320 1491051 1433590 1466008 1477710 1449850 1450531
8790 1450531 1398200 1398385 1421520 1409233 1422615 1429643 1365981 1359165 1375076 1353427 1366307 1437851
8778 1437851 1420449 1412547 1341017 1316732 1330834 1346805 1318960 1223049 1237401 1256381 1272644 1329913
8766 1329913 1303863 1230591 1158002 1102579 1086535 1032962 1002464 995485 915861 905412 870518 890167
8754 890167 883990 849444 816072 770141 780268 790394 802443 750082 618262 683772 714392 777462
$$ packed form
8837A561062L8652M2594l0878j1160j4089M6129m30j03960N066J2336k4383L0543
8825A551482m0735o7016P2279m4050J3564l741P6573J5257n4714l930Q850N459
8813A529278N7918R7337j9640Q2466J17051P7280R2617o1971n1238p4378k8278
8802A818442m565l3258r004m7241r2354j23700j7269n7461L2418J1702k7860O81
8790A450531n2331J85K3135j2287J3382P028o3662o816J5911k1649J2880P1544
8778A437851j7402p902p1530k4285J4102J5971k7845r5911J4352J8980J6263N7269
8766A329913k6050p3272p2589n5423j6044n3573l0498o979p9624j0449l4894J9649
8754H90167o177l4546l3372m5931J0127J0126J2049n2361j31820O5510L0620O3070
$$ plain form
8742 777462 839077 861045 836275 802003 755709 722395 669602 668291 686636 666999 680315 591548
8730 591548 606171 585639 503856 507178 552201 550842 536172 574019 589967 568692 582409 503274
8718 503274 488238 536031 547837 479852 461943 431327 453598 517345 592177 605347 504006
8707 504006 463078 429080 452506 505778 466161 354478 401279 428527 426382 456064 495215 511084
8695 511084 535790 530025 489916 522835 529868 473447 408059 341774 313424 346530 356946 348916
8683 348916 292154 297458 371889 388660 376472 364165 379347 338425 281737 289476 264558 275237
8671 275237 290904 311585 362367 392935 395426 332148 342457 338175 284154 360100 452584 432117
8659 432117 410516 493576 558453 546693 510586 441404 355867 322108 323326 311748 322498 327619
$$ packed form
8742G77462O1615K1968k4770l4272m6294l3314n2793j311J8345j9637J3316q8767
8730E91548J4623k0532q1783L322M5023j359j4670L7847J5948k1275J3717p9135
8718E03274j5036M7793J1806o7985j7909l0616K2271O3747P4832J3170j01341
8707E04006m0928l3998K3426N3272l9617j11683M6801K7248k145K9682L9151J5869
8695E11084K4706n765m0109L2919P033n6421o5388o6285k8350L3106J0416q030
8683C48916n6762N304P4431J6771j2188j2307J5182m0922n6688P739k4918J0679
8671B75237J5667K0681N0782L0568K491o3278J0309m282n4021P5946R2484k0467
8659D32117k1601Q3060O4877j1760l6107o9182q5537l3759J218j1578J0750N121
$$ plain form
8647 327619 309764 342711 377376 355644 376786 372688 267494 292245 359870 350764 246967 163549
8635 163549 188445 242403 306851 322033 324759 373334 430383 372144 352755 365915 314829 311172
8623 311172 305417 291956 266206 300310 394721 456651 418971 283438 269003 314839 266705 262587
8611 262587 221246 324125 392219 402488 391554 291623 231591 228121 188351 200745 309320
8600 309320 395884 438786 451303 503953 557256 550259 515920 561114 585873 579107 622394 639363
8588 639363 638535 671845 690805 657095 679814 706531 672539 714521 702134 703652 721607 751080
8576 751080 719865 553881 491414 431021 425549 445142 426005 395562 429966 485026 420086 359559
8564 359559 457751 419124 369818 424994 502030 468636 447488 418605 376090 445117 481383 464145
$$ packed form
8647C27619j7855L2947L4665k1732K1142m098j05194K4751O7625r106j03797q3418
8635A63549K4896N3958O4448J5182K726M8575N7049n8239j9389J3160n1086l657
8623C11172n755j3461k5750L4104R4411O1930l7680j35533j4435M5836m8134m118
8611B62587m1341J02879O8094J0269j0934r9931o0032l470l9770J2394J08575
8600C09320Q6564M2902J2517N2650N3303o997l4339M5194K4759o766M3287J6969
8588F39363q28L3310J8960l3710K2719K6717l3992M1982j2387J518J7955K9473
8576G51080l1215j65984o2467o0393n472J9593j9137l0443L4404N5060o4940o0527
8564C59559R8192l8627m9306N5176P7036l3394k1148k8883m2515O9027L6266j7238
$$ plain form
8552 464145 432628 379781 346658 351249 335295 324632 328468 356034 386293 407339 427368 399722
8540 399722 340534 334802 337353 256329 267075 240359 268557 265870 217938 265599 262688 274410
8528 274410 299398 284414 193613 244446 310712 243837 214191 214353 114306 126802 181843 261616
8516 261616 273559 292740 282340 282809 234706 133372 138997 127986 147579 198342 192450 183786
8504 183786 215406 212464 196961 177535 201583 253983 338761 338596 254511 205356 245752 292869
8492 292869 296960 235532 194341 159088 113383 43575 75815 135980 162737 189734 208602 207796
8480 207796 225123 247928 286423 223939 145105 172134 114730 49176 94987 153574 220265 285114
8468 285114 290222 244426 237472 202974 149730 54697 7852 19829 52071 75210 105411 44694
$$ packed form
8552D64145l1517n2847l3123M591j5954j0663L836K7566L0259K1046K0029k7646
8540C99722n9188n732K551q1024J0746k6716K8198k687m7932M7661k911J1722
8528B74410K4988j4984r0801N0833O6266o6875k9646J62j00047J2496N5041P9773
8516B61616J1943J9181j0400M69m8103j01334N625j1011J9593N0763n892q664
8504A83786L1620k942j5503j9426K4048N2400Q4778j65q4085m9155M0396M7117
8492B92869M091o1428m1191l5253m5705o9808L2240O0165K6757K6997J8868q06
8480B07796J7327K2805L8495o2484p8834K7029n7404o5554M5811N8587O6691O4849
8468B85114N108m5796o954l4498n3244r5033m6845J1977L2242K3139L0201o0717
$$ plain form
8456 44694 54331 139970 106545 32425 60493 124566 176414 201563 169212 165854 107998 105256
8444 105256 170431 211841 209407 247350 214382 99261 127619 128532 126945 108614 97697 85562
8432 85562 88639 73993 123343 156569 221008 226856 173333 147669 110540 77388 13900 24651
8420 24651 -19723 27943 63932 44223 52345 52956 43667 48870 95955 100739 111083 174487 237380
8407 237380 253837 221674 134701 114207 113120 112027 162557 67665 80284 162436 151620 91749
8395 91749 86896 45500 51191 117329 190160 211795 196686 181587 222219 196001 171128 102355
8383 102355 50418 68971 109111 150223 178465 183540 162522 211720 224704 197137 93368 52717
8371 52717 88937 162748 150009 183846 157811 121357 109008 83468 60488 112941 118677 83142
$$ packed form
8456D4694R637Q5639l3425p4120K8068O4073N1848K5149l2351l358n7856k742
8444A05256O5175M1410k434L7943l2968j15121K8358R13j587j8331j0917j2135
8432H5562L077j4646M9350L3226O4439N848n3523k5664l7129l3152o3488J0751
8420B4651m4374M7666L5989j9709Q122O11r289N203M7085M784J0344O3404O2893
8407B37380J6457l2163q6973k0494j087j093N0530r4892J2619Q2152j0816n9871
8395I1749m853m1396N691O6138P2831K1635j5109j5099M0632k6218k4873o8773
8383A02355n1937J8553M0140M1112K8242N075k1018M9198J2984k7567j03769m0651
8371E2717L6220P3811j2739L3837k6035l6454j2349k5540k2980N2453N736l5535
$$ plain form
8359 83142 55363 73118 189775 218947 215586 123123 42480 1539 -30810 6862 63154 16754
8347 16754 47104 104610 164001 184064 206446 227596 231004 260807 218264 255468 260495 174364
8335 174364 119512 99779 38538 54068 50990 10188 31440 25770 51003 69682 87762 -18153
8323 -18153 -70661 -39727 -68585 -103580 -51668 -18869 -12434 -36747 -17863 40507 112851 105906
8311 105906 -5330 -48859 3552 100883 55672 4679 87403 35806 -92729 -60847 19928
8300 19928 -27338 -59830 3688 88340 99210 77394 110652 124565 111225 97421 58212 23516
8288 23516 37517 47383 90509 103329 85022 37050 15209 90583 103490 54098 40220 52359
8276 52359 30603 57058 65398 -4033 -21626 42219 75891 94880 111722 55825 67092 75128
$$ packed form
8359H3142k7779J7755J16657K9172l361r2463q0643m0941l2349L7672N6292m6400
8347A6754L0350N7506N9391K0063K2382K1150L408K9803m2543L7204N027q6131
8335A74364n4852j9733o1241J5530l078m0802K1252n670K5233J8679J8080j05915
8323a8153n2508L0934k8858l4995N1912L2799O435k4313J8884N8370P2344o945
8311A05906j11236m3529N2411R7331m5211n0993Q2724n1597j28535L1882Q0775
8300A9928m7266l2492O3518Q4652J0870k1816L3258J3913j3340j3804l9209l4696
8288B3516J4001R866M3126J2820j8307m7972k1841P5374J2907m9392j3878J2139
8276E2359k1756K6455Q340o9431j7593O3845L3672J8989J6842n5897J1267Q036
$$ plain form
8264 75128 20528 2491 10919 9749 -4118 39060 61904 50158 159617 123196 91809 132724
8252 132724 123209 159851 130481 64847 74201 172366 219986 153898 81194 113845 112270 95578
8240 95578 178476 186850 130401 58074 -19563 -21625 -55458 -60963 -23615 44529 102619 159813
8228 159813 116895 22967 35489 25626 39831 125575 104543 83826 76636 145198 182201 134815
8216 134815 75285 44718 19984 -6466 -8693 10671 -57978 -69250 -67803 21761 105064 57242
8204 57242 11733 59885 80371 122909 148693 114384 79133 104773 123386 160718 114401 61584
8192 61584 116640 175194 123676 144225 111955 89912 127177 123615 84527 55732 87803 102547
8180 102547 91677 81622 85431 63362 17690 97728 128169 67300 68907 142663 200987 218809
$$ packed form
8264G5128n4600j8037Q428j170j3867M3178K2844j1746J09459l6421l1387M0915
8252A32724r515L6642k9370o5634R354R8165M7620o6088p2704L2651j575j6692
8240I5578Q2898Q374n6449p2327p7637k062l3833n505L7348O8144N8090N7194
8228A59813m2918r3928J2522r863J4205Q5744k1032k0717p190O8562L7003m7386
8216A34815n9530l0567k4734k6450k227J9364o8649j1272J447Q9564Q3303m7822
8204E7242m5509M8152K0486M2538K5784l4309l5251K5640J8613L7332m6317n2817
8192F1584N5056N8554n1518K0549l2270k2043L7265l562l9088k8795L2071J4744
8180A02547j0870j0055L809k2069m5672Q0038L0441o0869J607P3756N8324J7822
$$ plain form
8168 218809 110413 79594 100323 31899 48834 56684 31782 7737 -30390 -116195 -79672 74783
8156 74783 114104 74320 79604 65119 14313 10477 21693 15502 30872 41726 109523 97533
8144 97533 105346 129916 113344 64811 7872 -28412 18271 2411 -8168 -72238 -77665 -58450
8132 -58450 -38459 -30021 36344 47189 95460 112869 -30656 -129951 -87059 -8504 -15809 -13633
8120 -13633 2699 2577 18824 -18277 32310 130510 148388 137624 128889 152478 102575 37549
8108 37549 13801 42470 24711 33945 126906 169400 116949 38114 65997 116310 149174 170672
8096 170672 206911 210993 195342 157648 40576 75800 110426 92577 58713 27375 59695 110715
8084 110715 140989 81820 12010 8942 53743 43056 80653 156433 163655 106877 32148 55123
$$ packed form
8168B18809j08396l0819K0729o8424J6935P850k4902k4045l8127q5805L6523J54455
8156G4783L9321l9784N284j4485n0806l836J1216o191J5370J0854O7797j1990
8144I7533P813K4570j6572m8533n6939l6284M6683j5860j0579o4070n427J9215
8132e8450J9991Q438O6365J0845M8271J7409j43525r9295M2892P8555p305K176
8120a3633J6332j22J6247l7101N0587R8200J7878j0764q735K3589m9903o5026
8108C7549k3748K8669j7759R234R2961M2494n2451p8835K7883N0313L2864K1498
8096A70672L6239M082j5651l7694j17072L5224L4626j7849l3864l1338L2320N1020
8084A10715L0274n9169o9810l068M4801j0687L7597P5780P222n6778p4729K2975
$$ plain form
8072 55123 102800 100349 87709 77564 98990 202361 235937 206167 176510 108516 28795 45789
8060 45789 72333 126012 167253 117073 129100 229503 190965 108254 153602 208456 208033 147164
8048 147164 50241 52770 117631 96000 86484 121922 145164 156929 100648 96788 182882 238745
8036 238745 254524 298998 260472 225116 126671 129989 116306 89426 106864 81088 25276 34971
8024 34971 103201 199394 106244 48503 16137 68472 171392 175411 168619 166939 123886 136361
8012 136361 143012 190960 166088 164315 177747 131415 91439 116594 78569 50186 44776 152419
8000 152419 195498 128774 128210 189881 153342 194105 194984 110376 87114 56534 112821 181850
7988 181850 176382 161199 76326 47969 85784 142960 127580 109995 110795 115690 135772 204452
$$ packed form
8072E5123M7677k451j2640j0145K1426J03371L3576k9770k9657o7994p9721J6994
8060D5789K6544N3679M1241n0180J2027J00403l8538q2711M5348N4854m23o0869
8048A47164r6923K529O4861k1631r516L5438K3242J1765n6281l860Q6094N5863
8036B38745J5779M4474l8526l5356r8445L318j3683k6880J7438k5776n5812R695
8024C4971O8230R6193r3150n7741l2366N2335J02920M019o792j680m3053J2475
8012A36361O651M7948k4872j773J3432m6332l9976K5155l8025k8383n410J07643
8000A52419M3079o6724n64O1671l6539M0763Q79q4608k3262l0580N6287O9029
7988A81850n468j5183q4873k8357L7815N7176j5380j7585Q00M895K0082O8680
$$ plain form
7976 204452 202763 237095 149823 94393 186121 167810 134906 107133 95046 91005 157774 154473
7964 154473 172584 131525 96615 80680 84577 167403 194195 209790 240987 167543 127333 172849
7952 172849 222071 173744 149145 156322 181807 153654 102696 168384 148551 147011 237391 304706
7940 304706 209468 116461 153983 266577 322680 312839 254960 201769 197025 172815 139613 174021
7928 174021 236465 296162 245675 197901 196541 246613 218774 222043 239958 176490 157876 219325
7916 219325 205795 117124 90433 99299 150776 209355 208243 192719 243860 191496 187880 277868
7904 277868 300490 199230 164187 131875 161777 246456 277087 224788 238142 207940 197682
7893 197682 183956 165646 153594 209915 235132 187854 165767 100877 112467 142918 166500 88530
$$ packed form
7976B04452j689L4332q7272n5430R1728j8311l2904k7773j2087m041O6769l301
7964A54473J8111m1059l4910j5935L897Q2826K6792J5595L1197p3444m0210M5516
7952A72849M9222m8327k4599P177K5485k8153n0958O5688j9833j540R0380O7315
7940C04706r5238r3007L7522J12594N6103r841n7879n3191m744k4210l3202L4408
7928A74021O2444N9697n0487m7774j360N0072k7839L269J7915o3468j8614O1449
7916B19325j3530q8671k6691Q866N1477N8579j112j5524N1141n2364l616Q9988
7904B77868K2622j01260l5043l2312K9902Q4679L0631n2299J3354l0202j0258
7893A97682j3726j8310j2052N6321K5217m7278k2087o4890J1590L0451K3582p7970
$$ plain form
7881 88530 37297 50541 83612 175420 142724 115194 88776 119272 169293 149814 184908 164112
7869 164112 102524 77466 65594 89568 69447 66695 78563 105961 144242 33302 -39875 -37726
7857 -37726 -21799 4256 -2295 -43192 10078 82229 75466 30402 46299 107503 160231 88384
7845 88384 61001 111444 100618 123727 137292 131191 71280 -41248 -16037 66543 54478 42075
7833 42075 46089 32138 12173 16118 18044 86845 152381 108148 83922 79159 54643 55891 23517
7820 23517 -18335 51397 57859 116078 161360 200903 224210 172915 103437 77468 147321 94467
7808 94467 71473 90281 60243 54984 37350 56705 69731 118011 214869 189212 151949 110334
7796 110334 85533 52210 1243 -37333 -33627 -14986 -3210 18328 65693 59245 43753 74344
$$ packed form
7881H8530n1233J3244L3071R1808l2696k7530k6418L0496N0021j9479L5094k0796
7869A64112o1588k5058j1872K3974k0121k752J1868K7398L8281j10940p3177K149
7857c7726J5927K6055o551m0897N3270P2151o763m5064J5897O1204N2728p1847
7845H8384k7383N0443j0826K3109J3565o101n9911j12528K5211Q2580j2065j2403
7833D2075M014j3951j9965L945J926O8801O5536m4233k4226m763k4516J248l2374
7820B3517m1852O9732O462N8219M5282L9543K3307n1295o9478k5969O9853n2854
7808I4467k2994J8808l0038n259j7634J9355J3026M8280R6858k5657l7263m1615
7796A10334k4801l3323n0967l8576L706J8641J1776K1538M7365o448j5492L0591
$$ plain form
7784 74344 117207 54865 -33985 -26924 -47036 7945 18836 -14712 -13783 61456 98185 65947
7772 65947 91316 77594 84954 52626 63952 16493 -22517 -40095 -26710 -8556 -6876 10290
7760 10290 26431 39748 34727 38466 86283 48021 40304 83288 111530 143444 109278 -944
7748 -944 -52643 -74099 -11674 -9389 -52795 -54501 -9936 37510 24348 -32079 -13026 106339
7736 106339 123784 120192 85030 99350 98426 21026 -2008 -14867 -63513 -125122 -60729 46777
7724 46777 59413 69549 61119 41788 77628 72747 -53622 -92012 -150969 -96109 -89066 12082
7712 12082 -71385 -108996 -106576 -88692 36748 -24071 -32429 -15137 -60043 -42821 -42155 -117142
7700 -117142 -68913 23449 106548 135396 16399 -102266 -152487 -142156 -84304 -47319 12958
$$ packed form
7784G4344M2863o2342q8850P061k0112N4981J0891l3548R29P5239L6729l2238
7772F5947K5369j3722P360l2328J1326m7459l9010j7578J3385J8154J680J7166
7760A0290J6141J3317n021L739M7817l8262p717M2984K8242L1914l4166j10222
7748i44n1699k1456O2425K285m3406j706M4565M7446j3162n6427J9053J19365
7736A06339J7445l592l5162J4320r24p7400k3034j2859m8646o1609O4393J07506
7724D6777J2636J0136q430j9331L5840m881j26369l8390n8957N4860P043J01148
7712A2082q3467l7611K420J7884J25440o0819q358J7292m4906J7222O66p4987
7700a17142M8229R2362Q3099K8848j18997j18665n0221J0331N7852L6985O0277
$$ plain form
7689 12958 57715 108378 133337 105425 64529 -33341 4072 31271 52694 115093 132349 67981
7677 67981 31433 -18393 -85867 -89324 -95818 -64211 24031 65910 64317 8679 -84104 -54545
7665 -54545 62186 70752 31905 -11227 -3458 78389 118290 104242 16767 -61251 -66276 -5642
7653 -5642 44610 70324 79597 51228 74487 52244 43209 15958 -40928 -65540 -68154 -100917 -27531
7640 -27531 12033 29765 42416 37275 31692 17847 -25104 -65794 -119190 -93372 -24862 -91158
7628 -91158 -88750 -59282 -6503 -7405 49943 109552 83622 -26701 -41254 26865 -6069 -49179
7616 -49179 -7893 -8800 -2978 -46904 -80537 -18883 28198 -27962 -88196 -58053 -26553 15038
7604 15038 34595 -41218 -82976 -112928 -112347 54222 103046 110155 30570 -12036 -6590 -17188
$$ packed form
7689A2958M4757N0663K4959k7912m0896r7870L7413K7199K1423O2399J7256o4368
7677F7981l6548m9826o7474l457o494L1607Q8242M1879j593n5638r2783K9559
7665e4545J16731Q566l8847m3132P769Q1847L9901j4048q7475p8018n025O0634
7653e642N0252K5714R273k8369K3259k2243r035k7251n6886k4612k614l2763P3386
7640b7531L9564J7732J2651n141n583j3845m2951m0690n3396K5818O8510o6296
7628i1158K408K9468N2779r02N7348N9609k5930j10323j4553O8119l2934m3110
7616d9179M1286r07N822m3926l3633O1654M7081n6160o0234L0143L1500M1591
7604A5038J9557p5813m1758k9952N81J66569M8824P109p9585m2606N446j0598
$$ plain form
7592 -17188 28931 14517 50078 163699 205788 220006 127831 22821 -11278 -15008 -18092 -27879
7580 -27879 -12835 80436 88702 119703 129650 95344 80264 52065 42704 25584 3875 -78585
7568 -78585 -121977 -89355 -25011 -17537 -26605 1592 35755 59305 57288 59783 29091 52810 57994
7555 57994 78402 69991 57134 -6408 -81662 -149620 -79910 -45879 -14641 13731 10844 -10931
7543 -10931 7764 -24685 -59944 -64416 -26874 -24564 4032 35316 -4059 -37422 60325 119643
7531 119643 148632 74015 -10009 -10980 -33616 -29901 -7433 -33785 -65801 -98335 -104069 -92217
7519 -92217 -118017 -85140 -101904 -103500 8124 -2057 3460 -7157 18345 24704 69391 97466
7507 97466 82486 83053 40946 1219 -32753 39315 124387 82647 -5699 -79885 -121427 -66635
$$ packed form
7592a7188M6119j4414L5561J13621M2089J4218r2175j05010l4099l730l084r787
7580b7879J5044R3271Q266L1001R947l4306j5080k8199r361j7120k1709q2460
7568g8585m3392L2622O4344P474r068K8197L4163K3550k017K495l0692K3719N184
7555E7994K0408q411j2857o3542p5254o7958O9710L4031L1238K8372k887k1775
7543a0931J8695l2449l5259m472L7542K310K8596L1284l9375l3363R7747N9318
7531A19643K8989p4617q4024r71k2636L715K2468k6352l2016l2534n734J1852
7519i2217k5800L2877j6764j596J11624j0181N517j0617K5502O359M4687K8075
7507I7466j4980N67m2107l9727l3972P2068Q5072m1740q8346p4186m1542N4792
$$ plain form
7495 -66635 6702 28920 47080 10515 31581 34430 -85956 -74421 -46930 -28737 -106950 -93100
7483 -93100 42737 87700 26076 -48262 -50761 -43724 -91773 -83504 -54179 -37302 -13496 -52310
7471 -52310 -31583 -40500 -46661 -9239 40316 -7019 12736 -31413 -47396 21308 22125 -44955 -55520
7458 -55520 -4622 26019 -86254 -36252 -14228 -41602 -30328 48616 63546 32151 24576 -9020
7446 -9020 -15157 1521 38808 -39154 -36091 -25553 20115 66943 48044 115690 5117 -45192
7434 -45192 -43141 -79049 -35376 -116210 -55598 -11750 74033 155233 108344 27709 22278 25259
7422 25259 30089 40824 -837 -14298 -48930 -156597 -115116 -118558 -129857 -209064 -216282 -169969
7410 -169969 -68183 -64064 -50661 -6060 24030 73271 29024 -27759 -39232 -112168 -184565 -138148
$$ packed form
7495f6635P3337K2218J8160l6565K1066K849j20386J1535K7491J8193p8213J3850
7483i3100J35837M4963o1624p4338k499P037m8049Q269K9325J6877K3806l8814
7471e2310K0727q917o161L7422M9555m7335J9755m4149j5983O8704Q17o7080j0565
7458e5520N0898L0641j12273N0002K2024k7374J1274P8944J4930l1395p575l3596
7446i020o137J6678L7287p7962L063J0538M5668M6828j8899O7646j10573n0309
7434d5192K051l5908M3673q0834O0612M3848Q5783Q1200m6889q0635n431K981
7422B5259M830J0735m1661j3461l4632j07667M1481l442j1299p9207p218M6313
7410a69969J01786M119J3403M4601L0090M9241m4247n6783j1473p2936p2397M6417
$$ plain form
7398 -138148 -74720 -73867 -74036 -53254 -33573 -67948 -94913 -88310 -35430 -68037 -58171 -13280 37502
7385 37502 56286 3031 1130 14227 24935 14488 23610 37721 81538 45921 -28941 -10384
7373 -10384 -111028 -134304 -39279 -51318 -91028 974 78091 21666 9710 80548 70394 111329
7361 111329 126353 11818 -29510 28149 106554 16641 17015 52080 54665 -22191 -65357 -107241
7349 -107241 -155065 -108919 -103486 -25899 -3171 -67958 -75307 -135104 -149160 -84564 -59362 -16524
7337 -16524 -76462 -71700 3886 36875 -28431 -65872 14595 78725 152288 136349 80601 53716
7325 53716 43490 109058 159978 108758 95104 94150 41122 -48770 -41188 -24958 -36900 -20431
7313 -20431 24328 -58326 -95423 -118737 -134595 -96730 -67378 -43250 -97186 -131619 -152204 -128487
$$ packed form
7398a38148O3428Q53j69K0782J9681l4375k6965O603N2880l2607R866M4891N0782
7385C7502J8784n3255j901J3097J0708j0447R122J4111M3817l5617p4862J8557
7373a0384j00644k3276R5025j2039l9710R2002P7117n6425j1956P0838j0154M0935
7361A11329J5024j14535m1328N7659P8405q9913L74L5065K585p6856m3166m1884
7349a07241m7824M6146N433P7587K2728o4787p349n9797j4056O4596K5202M2838
7337a6524n9938M762P5586L2989o5306l7441Q0467O4130P3563j5939n5748k6885
7325E3716j0226O5568N0920n1220j3654r54n3028q9892P582J6230j1942J6469
7313b0431M4759q2654l7097k3314j5858L7865K9352K4128n3936l4433k0585K3717
$$ plain form
7301 -128487 -135058 -70839 -10090 -81918 -119954 -90221 -73611 -66433 -27593 -11406 -4637 82043
7289 82043 72418 85352 83772 133003 107924 87132 9427 -2928 21847 9807 26516 4678
7277 4678 11776 -34783 -47727 -70115 -11017 31009 29836 23678 45259 61573 -11623 -9665 -36238
7264 -36238 17605 78572 103693 68460 41169 84121 21294 -55498 -87804 -113491 -119802 -105079
7252 -105079 -109583 -142057 -160283 -132415 -96876 -130228 -102014 -31561 -16443 -52988 -90892 -137606
7240 -137606 -96824 25238 40927 106081 105265 62969 18333 -97088 -101752 -73631 -86738 -98519
7228 -98519 -109598 -123948 -124441 -119126 -77784 -84927 -105867 -91263 -64391 -45528 -11930 -26892 -39622
7215 -39622 18191 8401 32063 55211 -36490 -139050 -43731 -54271 -67468 -82774 -70241 -17633
$$ packed form
7301a28487o571O4219O0749p1828l8036K9733J6610P178L8840J6187O769Q6680
7289H2043r625J2934j580M9231k5079k0792p7705j2355K4775j2040J6709k1838
7277D678P098m6559j2944k2388N9098M2026j173o158K1581J6314p3196J958k6573
7264c6238N3843O0967K5121l5233k7291M2952o2827p6792l2306k5687o311J4723
7252a05079m504l2474j8226K7868L5539l3352K8214P0453J5118l6545l7904m6714
7240a37606M0782J22062J5689O5154q16m2296m4636j15421m664K8121j3107j1781
7228i8519j1079j4350m93N315M1342p143k0940J4604K6872J8863L3598j4962j2730
7215c9622N7813r790K3662K3148r1701j02560R5319j0540j3197j5306J2533N2608
$$ plain form
7203 -17633 25899 11063 -8492 35547 25986 -52019 -157558 -217205 -294562 -185329 -35982
7192 -35982 -93900 -8890 67498 60368 50526 -48238 -44432 -82863 -135475 -97646 15378 89508
7180 89508 95418 134430 87889 60628 87613 109274 100417 92230 41736 -100594 -42973 56553
7168 56553 78853 87702 58603 -7010 -16932 -55355 -47279 -43971 -60060 -106946 -117506 -58957 -13796
7155 -13796 -53001 -51545 -21433 -49671 -19322 -6533 29651 -43145 -17248 33647 -31594 -30060
7143 -30060 121017 96022 105438 92833 89702 98363 117630 91410 3604 -75258 -115482 -84396
7131 -84396 -56819 -42190 -103217 -141713 -107784 -82416 -15778 42643 78780 93237 37338 -5782
7119 -5782 20453 51976 55039 49334 47330 70356 53852 -44567 -34860 -48015 -92135 -105415 -84195
$$ packed form
7203a7633M3532j4836j9555M4039r561p8005j05539n9647p7357J09233J49347
7192c5982n7918Q5010P6388p130r842r8764L806l8431n2612L7829J13024P4130
7180H9508N910L9012m6541k7261K6985K1661q857q187n0494j42330N7621R9526
7168E6553K2300Q849k9099o5613r922l8423Q076L308j6089m6886j0560N8549M5161
7155a3796l9205J456L0112k8238L0349J2789L6184p2796K5897N0895o5241J534
7143c0060J51077k4995R416j2605l131Q661J9267k6220q7806p8862m0224L1086
7131h4396K7577J4629o1027l8496L3929K5368O6638N8421L6137J4457n5899m3120
7119e782K6235L1523L063n705k004K3026j6504r8419R707j3155m4120j3280K1220
$$ plain form
7106 -84195 -79582 -95126 -99940 -41475 4696 -25532 -74290 -129476 -53512 6957 -4026 46727
7094 46727 146120 202492 160360 106092 47639 3996 -27992 -81143 -32669 -15663 11653 21517
7082 21517 -70517 -132207 -102689 16591 72424 -11566 -59440 -155012 -209592 -115169 -64939 -77940
7070 -77940 -60479 -52547 -27196 13283 80654 62445 -19318 -74543 -61121 -67068 21514 22735
7058 22735 2780 37216 51361 50822 44116 51768 38831 25836 34425 25630 -73391 -100308 5904
7045 5904 78906 85762 55303 -19029 -81152 -13894 -36869 -72818 -110501 -82620 -49748 -6195
7033 -6195 -22267 16825 99681 68863 29119 38842 89657 71139 14613 5832 -2623 -2030 -29069
7020 -29069 -96742 -89310 -56608 30677 53679 69642 108436 102935 44778 116605 55153 -4182
$$ packed form
7106h4195M613j5544m814N8465M6171l0228m8758n5186P5964O0469j0983N0753
7094D6727R9393N6372m2132n4268n8453m3643l1988n3151M8474J7006K7316R864
7082B1517r2034o1690K9518J19280N5833q3990m7874r5572n4580R4423N0230j3001
7070g7940J7461P932K5351M0479O7371j8209q1763n5225J3422n947Q8582J221
7058B2735j9955L4436J4145n39o706P652j2937j2995Q589q795r9021k6917J06212
7045E904P3002O856l0459p4332o2123O7258k2975l5949l7683K7881L2872M3553
7033f195j6072L9092Q2856l0818l9744R723N0815j8518n6526q781q455N93k7039
7020b9069o7673P432L2702Q7285K3002J5963L8794n501n8157P1827o1452n9335
$$ plain form
7008 -4182 71 -27107 -75368 -113339 -38218 14558 -23584 -113707 -158978 -89403 -70398 -140035
6996 -140035 -89854 -71654 -84333 -84832 -54767 -57415 -97338 -114689 -44416 -76587 -90681 -56675
6984 -56675 -86598 -115824 -10278 76515 129938 119710 57902 40656 3636 -37104 -11893 -66379
6972 -66379 -66769 -115583 -174125 -87637 -61674 -93572 -115504 -139618 -145441 -72306 -23043 23088
6960 23088 32101 -6315 -17042 40086 36479 37652 69862 148209 156592 43146 -39982 -35647 -29946
6947 -29946 -15935 8105 44483 71008 36530 10782 -36677 -66035 -53797 -53870 -92374 -42769
6935 -42769 -47463 -38505 -21535 42922 39500 -24766 -13968 33617 101821 110437 102621 64275 36762
6922 36762 -7972 -28415 -14568 -26358 4712 15819 54338 80463 12387 -43013 -87715 -73817
$$ packed form
7008d182M253k7178m8261l7971P5121N2776l8142r0123m5271O9575J9005o9637
6996a40035N0181J8200j2679m99L0065k648l9923j7351P0273l2171j4094L4006
6984e6675k9923k9226J05546Q6793N3423j0228o1808j7246l7020m0740K5211n4486
6972f6379l90m8814n8542Q6488K5963l1898k1932k4114n823P3135M9263M6131
6960B3088R013l8416j0727N7128l607J173L2210P8347Q383j13446q3128M335N701
6947b9946J4011K4040L6378K6525l4478k5748m7459k9358J2238p3l8504M9605
6935d2769m694Q958J6970O4457l422o4266J0798M7585O8204Q616p816l8346k7513
6922C6762m4734k0443J3847j1790L1070J1107L8519K6125o8076n5400m4702J3898
$$ plain form
6910 -73817 -45733 -3275 10021 3224 61104 72404 54698 39319 -22252 -51807 -47559 -21593
6898 -21593 25250 -29436 -37079 -62538 -134353 -102417 -23287 -21116 -34809 14111 81034 47137
6886 47137 -50986 -53860 -33203 12945 35186 74477 53343 21928 86233 107066 8926 -35216
6874 -35216 -52213 -122501 -93551 -96320 -99507 -62545 -76934 -79342 -35899 -3259 15763 -36793
6862 -36793 -43131 6686 5389 -29325 1659 58823 40351 -58847 -21929 33435 96512 33645
6850 33645 889 -29659 -53337 -37215 -10077 -5743 1245 -12312 5601 -46182 -74170 -38693
6838 -38693 -39710 -89548 -111614 -68806 -119607 -172686 -73697 45092 29843 18251 -30577 -93158
6826 -93158 -103506 -15380 -17178 28052 81480 103997 77342 30648 33535 34914 -27656 -30691 -3001
$$ packed form
6910g3817K8084M2458J3296o797N7880J1300j7706j5379o1571k9555M248K5966
6898b1593M6843n4686p643k5459p1815L1936P9130K171j3693M8920O6923l3897
6886D7137r8123k874K0657M6148K2241L9291k1134l1415O4305K0833r8140m4142
6874c5216j6997p0288K8950k769l187L6962j4389k408M3443L2640J9022n2556
6862c6793o338M9817j297l4714L0984N7164j8472r9198L6918N5364O3077o2867
6850C3645l2756l0548k3678J6122K7138M334O988j3557J7913n1783k7988L5477
6838c8693j017m9838k2066M2808n0801n3079R8989J18789j5249j1592m8828o2581
6826i3158j0348Q8126j798M5230N3428K2517k6655m6694K887J379o2570l035K7690
$$ plain form
6813 -3001 18621 56815 110411 82970 36266 88318 36025 -28366 -1242 -6875 -65917 -90664
6801 -90664 -93435 -54619 29779 63943 51406 34609 41197 63832 95369 164855 141814 146192
6789 146192 128634 128184 40275 -40658 -25119 19205 20389 -17956 -20029 -22547 -38111 593 -23244
6776 -23244 -43761 -10673 6003 57998 48394 52031 61536 -1263 33394 57304 -10636 -120585
6764 -120585 -159480 -92264 -30210 13560 30122 34005 46818 2996 -80676 -101376 -145201 -121077
6752 -121077 15061 128295 140082 38373 47158 25215 -50864 -68012 -51976 -36791 4848
6741 4848 -33146 -104662 -119721 -87300 -42149 29054 39817 817 -7457 -16332 -24105 12673 43812
6728 43812 90108 73977 25104 -38509 -28672 96877 89366 36123 12621 21601 47117 15799
$$ packed form
6813c001K1622L8194N3596k7441m6704N2052n2293o4391K7124n633n9042k4747
6801i0664k771L8816Q4398L4164j2537j6797O588K2635L1537O9486k3041M378
6789A46192j7558m50q7909q0933J5539M4324J184l8345k073k518j5564L8704k3837
6776b3244k0517L3088J6676N1995r604L637R505o2799L4657K3910o7940j09949
6764a20585l8895O7216O2054M3770J6562L883J2813m3822q3672k0700m3825K4124
6752a21077J36138J13234J1787j01709Q785k1943p6079j7148J6036J5185M1639
6741D848l7994p1516j5059L2421M5151P1203J0763l9000q274q875p773L6778L1139
6728D3812M6296j6131m8873o3613R837J25549p511n3243k3502Q980K5516l1318
$$ plain form
6716 15799 147678 188434 155951 111553 191472 262898 292648 337115 348851 269841 259273 162012
6704 162012 74230 35810 54018 128070 139050 103223 68881 77947 122261 135866 60530 47899
6692 47899 164766 137256 61349 5998 47425 102356 110633 125133 93994 85801 76550 26621
6680 26621 19523 64882 120602 179148 106422 -21853 -61636 -46679 -86316 -100675 -66843 -49292
6668 -49292 42552 47979 -26304 -50363 -64331 -74325 -26989 -50320 -101542 -94079 -61924 -62289 -66892
6655 -66892 5097 -1068 -84613 -102475 -58303 -5961 123241 161416 88921 16214 78885 110511
6643 110511 34106 27821 79577 32090 24213 74974 56858 27619 32470 -9019 47866 68292
6631 68292 46501 -28121 16897 -27481 -83285 -34877 -68087 -86503 -123018 -70770 -18026 11131
$$ packed form
6716A5799J31879M0756l2483m4398P9919P1426K9750M4467J1736p9010j0568r7261
6704A62012q7782l8420J8208P4052J0980l5827l4342R066M4314J3605p5336j2631
6692D7899J16867k7510p5907n5351M1427N4931Q277J4500l1139q193r251m9929
6680B6621p098M5359N5720N8546p2726j28275l9783J4957l9637j4359L3832J7551
6668d9292R1844N427p4283k4059j3968r994M7336k3331n1222P463L2155l65m603
6655f6892P1989o165q3545j7862M4172N2342J29202L8175p2495p2707O2671L1626
6643A10511p6405o285N1756m7487p877N0761j8116k9239M851m1489N6885K0426
6631F8292k1791p4622M5018m4378n5804M8408l3210j8416l6515N2248N2744K9157
$$ plain form
6619 11131 -37846 -53625 -92317 -112586 -70996 -11899 -72358 -128655 -78720 -63401 -72185 -136162
6607 -136162 -169360 -142840 -35869 39583 -3567 -36372 4498 30514 41317 48545 -25335 -170167
6595 -170167 -147688 -64010 -72333 -97117 -84423 -71702 -966 18959 -38934 -113728 -75123 4357
6583 4357 26172 -18832 -60917 -146203 -197258 -160900 -100243 129 24000 -33881 -122485 -88556
6571 -88556 -10535 -19678 -84250 -83845 -91892 -88864 -24073 25922 -75173 -186046 -184969 -185683 -159974
6558 -159974 -122759 -75905 -72741 -53012 -21757 37085 95594 100029 49043 61874 45111 49969
6546 49969 40488 -10438 -32408 -4357 15255 -4432 36845 35755 -22410 -65457 -38458 -4825
6534 -4825 -7787 -51585 -21004 22031 15377 -11102 24914 -34575 -16243 14718 -35750 -70965
$$ packed form
6619A1131m8977j5779l8692k0269M1590N9097o0459n6297M9935J5319q784o3977
6607a36162l3198K6520J06971P5452m3150l2805M0870K6016J0803P228p3880j44832
6595a70167K2479Q3678q323k4784J2694J2721P0736J9925n7893p4794L8605P9480
6583D357K1815m5004m2085q5286n1055L6358O0657J00372K3871n7881q8604L3929
6571h8556P8021r143o4572M05q047L028O4791M9995j01095j10873J077p14K5709
6558a59974L7215M6854L164J9729L1255N8842N8509M435n0986J2831j6763M858
6546D9969r481n0926k1970K8051J9612j9687M1277j090n8165m3047K6999L3633
6534d825k962m3798L0581M3035o654k6479L6016n9489J8332L0961n0468l5215
$$ plain form
6522 -70965 -57649 -23514 -17401 42169 -34274 -49475 247 800 59606 11643 43384 41854 28926
6509 28926 -1158 -41845 -105423 -50461 43033 41827 6321 19814 -146 -63618 -55046 -107891
6497 -107891 -120344 -128120 -81769 -53386 -22550 -43199 -14123 -10027 -12717 30389 57679 -18422
6485 -18422 -37547 -49855 -69237 -94847 -108882 -107839 -140010 -118297 -78761 -139077 -120155 -96822
6473 -96822 -115232 -11191 -19051 -43610 -51762 -65704 -58627 -38966 -73803 -91490 -36710 -16734
6461 -16734 -22602 -36117 -70238 -75860 -64027 -58751 12179 13804 41505 42266 -399 20896 -502
6448 -502 29242 -6375 -99423 -114561 -29279 -18244 -76222 -96113 -28392 73396 84749 32491
6436 32491 31867 37475 -1633 -16506 5954 -15635 -52571 -23085 55666 70094 64526 19070 -22920
$$ packed form
6522g0965J3316L4135O113N9570p6443j5201M9722N53N8806m7963L1741j530j2928
6509B8926l0084m0687o3578N4962R3494j206l5506J3493j9960o3472Q572n2845
6497a07891j2453p776M6351K8383L0836k0649K9076M096k690M3106K7290p6101
6485a8422j9125j2308j9382k5610j4035J043l2171K1713L9536o0316J8922K3333
6473i6822j8410J04041p860k4559q152j3942P077J9661l4837j7687N4780J9976
6461a6734n868j3515l4121n622J1833N276P0930J625K7701P61m2665K1295k1398
6448e02K9744l5617r3048j5138Q5282J1035n7978j9891O7721J01788J1353n2258
6436C2491o24N608l9108j4873K2460k1589l6936K9486P8751J4428n568m5456m1990
$$ plain form
6423 -22920 -3989 68239 119446 106798 60056 54718 84877 86979 37443 -14257 -42951 -77223
6411 -77223 -113945 -81279 -80218 -25311 -54218 -83196 -70683 -16946 9908 14033 -8494 -42862
6399 -42862 19313 1812 -31921 -48057 1723 11411 -34937 -53352 -75936 -133275 -104153 -70873
6387 -70873 -40102 -60131 -96454 -78186 -47244 -58803 -24318 39195 -66726 -138642 -78489 -14501
6375 -14501 -42423 -37265 13891 84125 64040 71271 55971 27428 9238 -985 25801 50071
6363 50071 52775 133876 113026 12807 -42801 -46070 -40377 -28555 -128037 -189420 -140936 -53735
6351 -53735 3799 -31757 -12920 45325 26569 -415 -75424 -125450 -141867 -139714 -144424 -116692
6339 -116692 -122895 -111921 -105742 -105997 -136830 -128154 -62146 -57706 -108332 -139549 -100239 20537 -4963
$$ packed form
6423b2920J8931P2228N1207j2648m6742n338L0159K102m9536n1700k8694l4272
6411g7223l6722L2666J061N4907k8907k8978J2513N3737K6854M125k2527l4368
6399d2862O2175j7501l3733j6136M9780R688m6348j8415k2584n7339K9122L3280
6387g0873L0771k0029l6323J8268L0942j1559L4485O3513j05921p1916O0153O3988
6375a4501k7922N158N1156P0234k0085P231j5300k8543j8190j0223K6786K4270
6363E0071K704Q1101k0850j00219n5608l269N693J1822r9482o1383M8484Q7201
6351e3735N7534l5556J8837N8245j8756k6984p5009n0026j6417K153m710K7732
6339a16692o203J0974O179k55l0833Q676O6008M440n0626l1217L9310J20776k5500
$$ plain form
6326 -4963 8846 54831 87475 6571 -28294 98833 154421 77129 46013 2131 23541 -49085
6314 -49085 -159310 -214943 -156327 -115389 -110847 -22551 -6001 35619 35285 -29552 17959 94061
6302 94061 47449 -5951 -101320 -126887 -148178 -88071 -82886 -161284 -157842 -170673 -119617 -68575
6290 -68575 824 34911 47728 7927 -14529 -2678 11004 -16160 -22157 -11044 -39623 -22458
6278 -22458 55191 149218 161968 90855 57045 65043 56785 5766 -28624 9467 45764 170
6266 170 -94940 -97987 35425 104744 119500 63069 7223 -54071 -30357 72852 69065 11233
6254 11233 -32662 -59390 -113447 -102142 22368 26605 1315 104628 85284 -18571 -37403
6243 -37403 19443 57763 2303 -27532 -8018 37811 33864 40772 120647 87267 101965 97713
$$ packed form
6326d963J3809M5985L2644q0904l4865J27127N5588p7292l1116m3882K1410p2626
6314d9085j10225n5633N8616M0938M542Q8296J6550M1620l34o4837M7511P6102
6302I4061m6612n3400r5369k5567k1291O0107N185p8398L442j2831N1056N1042
6290f8575O9399L4087J2817l9801k2456J1851J3682k7164n997J1113k8579J7165
6278b2458P7649R4027J2750p1113l3810P998q258n1019l4390L8091L6297m5594
6266A70r5110l047J33412O9319J4756n6431n5846o1294K3714J03209l787n7832
6254A1233m3895k6728n4057J1305J24510M237k5290J03313j9344j03855j8832
6243c7403N6846L8320n5460k9835J9514M5829l947O908P9875l3380J4698m252
$$ plain form
6231 97713 46103 72219 98424 138624 151727 140289 170498 108088 49679 -13120 -41618 -29392
6219 -29392 11267 -40334 -70492 -20520 1361 -129260 -137336 -73337 26571 71323 50133 -21720
6207 -21720 -68418 -101620 -53934 -34574 -55604 -89557 -76392 -4950 -50781 -13215 1913 -74799
6195 -74799 -74070 -45951 -62404 -8144 -5945 -25197 -80205 -68674 8220 11387 -23674 -17874 62983
6182 62983 95834 74231 26401 22366 97940 135990 121472 83228 29062 72472 184077 161442
6170 161442 46144 20412 75564 156738 161492 159194 162893 137281 88612 87661 48178 99337
6158 99337 57636 51296 29020 10146 2878 15603 -31570 -34072 -27353 47124 47693 9630 -1255
6145 -1255 -59382 -29433 8088 -33506 -151219 -174236 -150324 -84213 -136959 -218678 -231371 -142541
$$ packed form
6231I7713n1610K6116K6205M0200J3103j1438L0209o2410n8409o2799k8498J2226
6219b9392M0659n1601l0158M9972K1881j30621q076O3999R9908M4752k1190p1853
6207b1720m6698l3202M7686J9360k1030l3953J3165P1442m5831L7566J5128p6712
6195g4799P29K8119j6453N4260K199j9252n5008J1531P6894L167l5061N800Q0857
6182F2983L2851k1603m7830m035P5574L8050j4518l8244n4166M3410J11605k2635
6170A61442j15298k5732N5152Q1174M754k298L699k5612m8669r51l9483N1159
6158I9337m1701o340k2276j8874p268J2725m7173k502O719P4477N69l8063j0885
6145a255n8127K9949L7521m1594j17713k3017K3912O6111n2746q1719j2693Q8830
$$ plain form
6133 -142541 -52229 1985 -34525 -66923 -93021 -42363 21646 -4774 -36077 -102257 -144914 -136260
6121 -136260 -83206 -56047 -69261 -86798 -77247 -20686 -58364 -129469 -143033 -116020 -7157 19274
6109 19274 19524 81156 77051 8210 38962 -6777 1569 3627 -50537 -31875 -43746 -120812 -72527
6096 -72527 -65445 -78140 -56945 54592 101868 40694 4502 -12163 -10260 -63793 -133453 -122369
6084 -122369 -202092 -153549 -53301 -38506 9009 19857 55311 4496 40605 69694 41136
6073 41136 26178 -19380 -62728 -75847 27616 76286 109563 18735 -13066 -81160 -24195 -11738
6061 -11738 -45153 -43165 -18703 24008 -29806 -80725 -74013 -67323 -65239 -35466 -1605 8220 21368
6048 21368 -3787 11196 -23923 -100107 -153268 -182204 -120154 -72223 -71223 -65906 -57035 -83392
$$ packed form
6133a42541R0312N4214l6510l2398k6098N0658O4009k6420l1303o6180m2657Q654
6121a36260N3054K7159j3214j7537R551N6561l7678p1105j3564K7013J08863K6431
6109A9274K50O1632m105o8841L0752m5739Q346K058n4164J8662j1871p7066M8285
6096g2527P082j2695K1195J11537M7276o1174l6192j6665J903n3533o9660J1084
6084a22369p9723M8543J00248J4795M7515J0848L5454n0815L6109K9089k8558
6073D1136j4958m5558m3348j3119J03463M8670L3277r0828l1801o8094N6965J2457
6061a1738l3415J988K4462M2711n3814n0919O712O690K084K9773L3861R825J3148
6048B1368k5155J4983l5119p6184n3161k8936O2050M7931J000N317Q871k6357
$$ plain form
6036 -83392 -64317 -22020 -18820 -38752 -83046 -80612 -108266 -89711 -43587 -70050 -77587 -18279
6024 -18279 9205 31250 40177 10435 -35103 -71432 -91910 -132339 -111552 -55098 19645 -16672
6012 -16672 -73791 -56151 -24660 -14108 15529 -8726 -28034 -38104 -11726 19729 9120 59869
6000 59869 90490 100347 61835 -2664 -17237 82574 66932 96246 85317 19225 -29714 -18767
5988 -18767 -55011 -103209 -59343 -32108 74855 60068 29108 1887 -32226 -52619 -8900 -18392
5976 -18392 24560 -24590 -21283 -83572 -59534 -26872 -65508 -39072 -27511 -44408 -72770 -137168
5964 -137168 -125435 -34547 -57823 -156876 -170978 -167375 -118440 -128245 -145268 -167389 -180010 -174537
5952 -174537 -93659 -66067 -92905 -5735 56274 58479 -11967 44796 51726 38495 56970 173561
$$ packed form
6036h3392J9075M2297L200j9932m4294K434k7654J8555M6124k6463p537N9308
6024a8279K7484K2045Q927k9742m5538l6329k0478m0429K0787N6454P4743l6317
6012a6672n7119J7640L1491J0552K9637k4255j9308j0070K6378L1455j0609N0749
6000E9869L0621R857l8512o4499j4573R9811j5642K9314j0929o6092m8939J0947
5988a8767l6244m8198M3866K7235J06963j4787l0960k7221l4113k0393M3719r492
5976a8392M2952m9150L307o2289K4038L2662l8636K6436J1561j6897k8362o4398
5964a37168J1733R0888k3276r9053j4102L603M8935r805j7023k2121j2621N473
5952a74537Q0878K7592k6838Q7170O2009K205p0446N6763O930j3231J8475J16591
$$ plain form
5940 173561 126629 -34773 -83912 -82751 -36727 -7333 50833 49648 48423 47235 45310 5730
5928 5730 45514 31552 -9565 36246 9744 -100056 -107341 -53133 11355 -12185 -18443 52097
5916 52097 43041 65667 176758 188602 196356 110457 -13963 -24952 -72005 -108766 -6082 -18544
5904 -18544 -4551 -37968 -89228 -127514 -144661 -105726 -13432 -1785 -59638 -111571 -176571 -241014
5892 -241014 -165876 -79860 -39192 -26228 -5003 21786 -89147 -97315 -50277 36129 4672 50678
5880 50678 154724 89802 69293 83279 3055 -72487 -89116 -70698 -85332 -112771 -116198 -112072
5868 -112072 -140707 -166554 -118781 -144037 -62775 -13910 -5952 -170 35003 77621 51446 -26375
5856 -26375 42886 43871 64973 29238 -23699 -52429 15316 -16554 10391 45771 79782 -5566
$$ packed form
5940A73561m6932j61402m9139J161M6024K9394N8166j185j225j188j925l9580
5928E730L9784j3962m1117M5811k6502j09800p285N4208O4488k3540o258P0540
5916E2097r056K2626J11091J1844P754q5899j24420j0989m7053l6761J02684j2462
5904a8544J3993l3417n1260l8286j7147L8935R2294J1647n7853n1933o5000o4443
5892b41014P5138Q6016M0668J2964K1225K6789j10933q168M7038Q6406l1457M6006
5880E0678J04046o4922k0509J3986q0224p5542j6629J8418j4634k7439l427M126
5868a12072k8635k5847M7773k5256Q1262M8865P958N782L5173M2618k6175p7821
5856b6375O9261R85K1102l5735n2937k8730O7745l1870K6945L5380L4011q5348
$$ plain form
5844 -5566 -37277 -69508 -94801 -70637 -50487 -34069 27101 35881 12295 48912 37930 -4712
5832 -4712 -64047 -99221 -98980 -153251 -182861 -159303 -140211 -54378 -6700 32322 1931 12685
5820 12685 -36587 -97876 -109526 -103206 -18015 -613 -636 71551 183 -80941 -128163 -72969 -65628
5807 -65628 -138163 -124321 -89392 -151328 -154556 -116424 -106240 -43767 56558 132397 78991 27614
5795 27614 30069 23052 75165 105621 137180 123264 21311 -13754 6103 -106701 -136189 -96014
5783 -96014 -108999 -72516 -43022 -79306 -52029 -19751 -55610 -124835 -173323 -114097 -133858 -96619
5771 -96619 -61020 -22013 -68158 -109841 -54874 -10355 -8049 -100684 -117213 -121723 -116991 -79372
5759 -79372 -41206 16662 -31977 -118339 -142650 -50717 -30252 -9508 -10072 -61650 -100547 -57146
$$ packed form
5844e566l1711l2231k5293K4164K0150J6418O1170Q780k3586L6617j0982m2642
5832d712n9335l5174K41n4271k9610K3558J9092Q5833M7678L9022l0391J0754
5820A2685m9272o1289j1650O320Q5191J7402k3P2187p1368q1124m7222N5194P341
5807f5628p2535J3842L4929o1936l228L8132J0184O2473J00325P5839n3406n1377
5795B7614K455p017N2113L0456L1559j3916j01953l5065J9857j12804k9488M0175
5783i6014j2985L6483K9494l6284K7277L2278l5859o9225m8488N9226j9761L7239
5771i6619L5599L9007m6145m1683N4967M4519K306r2635j6529m510M732L7619
5759g9372L8166N7868m8639q6362k4311R1933K0465K0744n64n1578l8897M3401
$$ plain form
5747 -57146 18914 20661 43449 23532 4636 46123 68653 8515 -81438 -41356 -52342 -2374
5735 -2374 89929 85741 431 -43580 -58277 -19851 -48383 -98614 -42380 73309 37053 -38607
5723 -38607 4352 -14257 -21999 20700 87956 28365 17897 -10060 -82326 -129965 -108306 -115107
5711 -115107 -95112 -42795 1328 -9718 -6044 3558 -3365 51945 43452 87336 154114 85969
5699 85969 21490 8172 41516 31505 -11309 18432 59618 19177 8158 -7809 -9719 -5673
5687 -5673 -55325 -59886 657 -57793 -89618 -66684 -41549 20229 20276 -75543 -79319 -85871 -113525
5674 -113525 -41400 -30382 -15306 13363 -28225 -38260 -20813 34584 -2295 10966 43496 -4450
5662 -4450 -13455 -99422 -103917 -62986 -44345 -3255 30953 58405 71931 63944 -63025 -193594
$$ packed form
5747e7146P6060J747K2788j9917j8896M1487K2530o0138q9953M0082j0986M9968
5735b374R2303m188q5310m4011j4697L8426k8532n0231N6234J15689l6256p5660
5723c8607M2959j8609p742M2699O7256n9591j0468k7957p2266m7639K1659o801
5711a15107J9995N2317M4123j1046L674R602o923N5310q493M3884O6778o8145
5699H5969o4479j3318L3344j0011m2814K9741M1186m0441j1019j5967j910M046
5687e673m9652m561O0543n8450l1825K2934K5135O1778M7r5819l776o552k7654
5674a13525P2125J1018J5076K8669m1588j0035J7447N5397l6879J3261L2530m7946
5662d450r005q5967m495M0931J8641M1090L4208K7452J3526p987j26969j30569
$$ plain form
5650 -193594 -162578 -75431 -50023 25315 -2390 -64422 -50037 -44389 -63020 -56172 -76230 -99136
5638 -99136 -119754 -105078 -82596 -66835 34870 99244 138626 16427 -16632 -24287 -30865 1843
5626 1843 -61128 -25217 -51264 -54365 54059 105368 118376 19432 -14651 19169 37849 38964
5614 38964 -18527 -17300 -6678 56973 18822 -6243 23330 19253 48543 48324 -7168 -28479 -50839
5601 -50839 -27454 8479 49580 29627 -61503 -66496 -17957 -37625 -26144 -58764 -98794 -133760
5589 -133760 -87813 -43022 -41039 -67983 -28696 29743 57224 7118 50701 70837 53770 46176
5577 46176 -54232 -141666 -155900 -175863 -131305 -120102 -100322 -101538 -164959 -168461 -204104 -252603
5565 -252603 -260390 -147828 -188367 -178685 -99417 43933 78426 22127 23442 -20699 -4379 1241
$$ packed form
5650a93594L1016Q7147K5408P5338k7705o2032J4385N648j8631O848k0058k2906
5638i9136k0618J4676K2482J5761J01705O4374L9382j22199l3059p655o578L2708
5626A843o2971L5911k6047l101J08424N1309J3008r8944l4083L3820J8680J115
5614C8964n7491J227J0622O3651l8151k5065K9573m077K9290k19n5492k1311k2360
5601e0839K3385L5933M1101j9953r1130m993M8539j9668J1481l2620m0030l4966
5589a33760M5947M4791J983k6944L9287N8439K7481n0106M3583K0136j7067p594
5577D6176j00408q7434j4234j9963M4558J1203J9780j216o3421l502l5643m8499
5565b52603p787J12562m0539R682P9268J43350L4493n6299J315m4141J6320N620
$$ plain form
5553 1241 14949 23729 47111 -7250 -12319 19819 -45252 -65304 -36780 -28508 14929 -59364 -115550
5540 -115550 -44824 -22098 -48333 -41847 28728 36333 9986 -95749 -144167 -89661 -9033 -48705
5528 -48705 -54364 -31030 -10123 5149 44885 40232 35271 19635 -71671 -104694 -17539 83951
5516 83951 47117 -49848 -123551 -107543 -85293 -50089 -27351 -73738 -26612 1579 -15554 -63416
5504 -63416 -105850 -148959 -170735 -159659 -101196 -55403 -23175 -50841 -22759 54772 -3426 -33331
5492 -33331 23607 79865 31339 -62925 -100711 -94342 -96440 -70121 -55268 -2953 -14478 18318
5480 18318 -20322 -158549 -131733 -93746 -89850 -74543 -77857 5032 95876 65901 -12417 2596
5468 2596 -30445 -46605 -12087 34542 28902 8039 -46089 -12962 -32372 -60480 -89356 -51732
$$ packed form
5553A241J3708Q780K3382n4361n069L2138o5071k0052K8524Q272M3437p4293n6186
5540a15550P0726K2726k6235O486P0575P605k6347j05735m8418N4506Q0628l9672
5528d8705n659K3334K0907J5272L9736m653m961j5636r1306l3023Q7155J01490
5516H3951l6834r6965p3703J6008K2250L5204K2738m6387M7126K8191j7133m7862
5504f3416m2434m3109k1776J1076N8463M5793L2228k7666K8082P7531n8198k9905
5492c3331N6938N6258m8526r4264l7786O369k098K6319J4853N2315j1525L2796
5480A8318l8640j38227K6816L7987L896J5307l314Q2889R0844k9975p8318J5013
5468B596l3041j6160L4518M6629n640k0863n4128L3127j9410k8108k8876L7624
$$ plain form
5456 -51732 -581 -31291 -125018 -110614 -39976 -66130 -111881 -142803 -113937 -32411 10423 78849
5444 78849 174634 135559 94131 -4651 -31277 44695 62243 -24488 -68815 27797 67278 112492
5432 112492 49397 41606 32652 23228 60429 43550 -38729 -97811 -6506 83815 48336 54246
5420 54246 64496 59496 49798 12185 -6570 15990 -106622 -102516 -73410 -96499 -101317 -31821
5408 -31821 -48394 -77605 -84509 -77611 -80089 -113626 -153548 -85420 -59423 -72724 -79606 -116110 -110699
5395 -110699 6784 62959 55119 42078 76811 123498 77158 46447 -34345 -114621 -73967 -14244
5383 -14244 -7312 -10997 -12948 38831 64333 -13474 -13350 -32138 -71096 -98803 -29079 31852 46539
5370 46539 62985 81322 93138 72376 64877 139847 216256 201968 50073 -51058 -75347 -110848
$$ packed form
5456e1732N1151l0710r3727J4404P0638k6154m5751l0922K8866Q1526M2834O8426
5444G8849R5785l9075m1428r8782k6626P5972J7548q6731m4327R6612L9481M5214
5432A12492o3095p791q954r424L7201j6879q2279n9082R1305R0321l5479N910
5420E4246J0250n000r698l7613j8755K2560j22612M106K9106k3089m818O9496
5408c1821j6573k9211o904O898k478l3537l9922O8128K5997j3301o882l6504N411
5395a10699J17483N6175p840j3041L4733M6687m6340l0711q0792q0276M0654N9723
5383a4244O932l685j951N1779K5502p7807J24j8788l8958k7707O9724O0931J4687
5370D6539J6446J8337J1816k0762p499P4970P6409j4288j51895j01131k4289l5501
$$ plain form
5358 -110848 -102454 -28510 -29371 -72439 -55994 -34774 -28225 67624 60527 -42908 -48778 57733
5346 57733 58562 65213 90743 79975 63651 -31907 -40988 -42928 -24199 14738 107252 124163 126268
5333 126268 60033 35409 -42987 -50012 -33189 -75108 -87617 -70407 -57984 -56923 -42654 4364
5321 4364 17134 -15037 -24644 28508 62031 39519 -19180 4287 38764 -28362 -100997 -122974
5309 -122974 -73842 -73407 -2833 25971 -5256 -5749 -20567 -34946 -34423 -31088 -68549 3851 -59104
5296 -59104 -38297 87757 23985 -24466 37334 94939 74882 53770 -85923 -69655 -16646
5285 -16646 -71319 -92215 -53323 -61084 -91452 -73692 -46650 -26677 -31220 -53864 6628 68045
5273 68045 108432 48703 522 -51746 -29467 -28222 -33856 -87143 -50897 35267 14197 26700
$$ packed form
5358a10848Q394P3944q61m3068J6445K1220O549R5849p097j03435n870J06511
5346E7733Q29O651K5530j0768j6324r5558r081j940J8729L8937R2514J6911K105
5333A26268o6235k4624p8396p025J6823m1919j2509J7210J2423J061J4269M7018
5321D364J2770l2171r607N3152L3523k2512n8699K3467L4477o7126p2635k1977
5309a22974M9132M35P0574K8804l1227m93j4818j4379N23L335l7461P2400o2955
5296e9104K0807J26054o3772m8451O1800N7605k0057k1112j39693J6268N3009
5285a6646n4673k0896L8892p761l0368J7760K7042J9973m543k2644O0492O1417
5273F8045M0387n9729m8181n2268K2279J245n634n3287L6246Q6164k1070J2503
$$ plain form
5261 26700 78877 81077 76775 23963 -39553 34951 14030 -41867 -69374 -139894 -139192 -120686 -45465
5248 -45465 -91508 -100397 -1984 50848 -46852 -49989 -94307 -54425 -39846 -54408 -115892 -168690
5236 -168690 -146460 -123997 -130119 -157084 -92467 46303 98843 62044 30499 40178 104062 26176
5224 26176 -24898 -32996 -106105 -98554 -34414 99902 102044 60313 74658 145413 166147 105753
5212 105753 44107 -45371 -2266 36680 -23635 -53455 -9897 39471 -448 -16801 -100840 -95558
5200 -95558 -120822 -110173 -123931 -24295 80038 89849 -17551 -35325 -44167 -86507 -76553 -12597
5188 -12597 23529 18101 -35458 -28173 24451 34594 72036 80369 48447 60703 -44486 -88163
5176 -88163 -42743 -20986 -44496 -10448 25769 80699 57637 38104 44207 66231 121498 72222
$$ packed form
5261B6700N2177K200m302n2812o3516P4504k0921n5897k7507p0520P02J8506P5221
5248d5465m6043q889R8413N2832r7700l137m4318L9882J4579j4562o1484n2798
5236a68690K2230K2463o122k6965O4617J38770N2540l6799l1545R679O3884p7886
5224B6176n1074q098p3109P551O4140J34316K142m1731J4345P0755K0734o0394
5212A05753o1646q9478M3105L8946o0315k9820M3558M9368l9919j6353q4039N282
5200i5558k5264J0649j3758R9636J04333R811j07400j7774q842m2340R954O3956
5188a2597L6126n428n3559P285N2624J0143L7442Q333l1922J2256j05189m3677
5176h8163M5420K1757k3510L4048L6217N4930k3062j9533O103K2024N5267m9276
$$ plain form
5164 72222 30407 42844 14821 25103 34163 83104 94020 69439 69627 11830 -15973 55872
5152 55872 24294 -44370 -62613 -84683 -112819 -111354 -23103 4530 -48902 -59550 -6357 6082
5140 6082 -2172 -61819 -62472 -33971 8673 31653 9982 82356 71817 37199 -6759 -10860 -21507
5127 -21507 -58 -7945 -4270 -53768 20511 91187 10728 -55142 -84432 -31425 -22974 -138956
5115 -138956 -106726 -86071 -88482 -23328 -1194 -66164 -37082 -34542 53231 59193 53720 39597
5103 39597 29277 68548 79113 42669 -21780 -41193 -75999 -86913 -28194 62471 38720 17403
5091 17403 -44263 -79077 -120966 -142194 -156308 -154024 -109242 -74919 -40514 -53324 8268 -40037
5079 -40037 -109296 -59771 -2589 -30323 -60035 -131164 -99926 -82636 -148576 -189524 -209519 -126263
$$ packed form
5164G2222m1815J2437k8023J0282R060M8941J0916k4581J88n7797k7803P1845
5152E5872l1578o8664j8243k2070k8136J465Q8251K7633n3432j0648N3193J2439
5140F082q254n9647o53K8501M2644K2980k1671P2374j0539l4618m3958m101j0647
5127b1507K1449p887L675m9498P4279P0676q0459o5870k9290N3007Q451j15982
5115a38956L2230K0655k411O5154K2134o4970K9082K540Q7773N962n473j4123
5103C9597j0320L9271J0565l6444o4449j9413l4806j0914N8719R0665k3751k1317
5091A7403o1666l4814m1889k1228j4114K284M4782L4323L4405j2810O1592m8305
5079d0037o9259M9525N7182k7734k9712p1129L1238J7290o5940m0948j9995Q3256
$$ plain form
5067 -126263 -158052 -186543 -174258 -154163 -146589 -154901 -126051 5278 17829 -24956 -91838 -57038
5055 -57038 -857 31596 71132 62955 -16519 309 -34515 -41901 3283 -10460 -91927 -78120
5043 -78120 -38507 -97704 -73282 -34962 -64798 -80221 -71100 -59514 -40963 -47014 19349 69101
5031 69101 93881 74454 16028 -63882 -100457 -114959 -90878 -71766 -75569 -148471 -78357 -31010
5019 -31010 -100011 -75169 -52306 -19545 1346 9320 29828 -17995 -65520 -131141 -117503 -68642
5007 -68642 14815 38543 38389 -3334 -29040 -69343 -137521 -57223 -32823 15169 44384 -6949
4995 -6949 -43474 72180 174410 162025 95073 57852 86308 109905 135723 91661 79365 82816
4983 82816 30496 56705 93285 102036 105653 33966 -25499 -42918 17891 137038 193417 135731
$$ packed form
5067a26263l1789k8491J2285K0095P574q312K8850J31329J2551m2785o6882L4800
5055e7038N6181L2453L9536q177p9474J6828l4824p386M5184j3743q1467J3807
5043g8120L9613n9197K4422L8320k9836j5423R121J1586J8551o051O6363M9752
5031F9101K4780j9427n8426p9910l6575j4502K4081J9112l803p2902P0114M7347
5019c1010o9001K4842K2863L2761K0891P974K0508m7823m7525o5621J3638M8861
5007f8642Q3457K3728j54m1723k5706m0303o8178Q0298K4400M7992K9215n1333
4995f949l6525J15654J02230j2385o6952l7221K8456K3597K5818m4062j2296L451
4983H2816n2320K6209L6580Q751L617p1687n9465j7419O0809J19147N6379n7686
$$ plain form
4971 135731 73953 126012 118408 134048 98582 -7557 -27762 -51299 -120106 -113587 -116060 -93075
4959 -93075 -50520 -61616 -63186 -64558 -89054 -114444 -105732 -34784 -16844 -25489 15062 44504 -30898
4946 -30898 36478 88422 102260 103060 94665 75971 60390 94749 66092 68127 78742 38417 20284
4933 20284 -17980 -57202 -65641 -131644 -139589 -149729 -121092 -24535 13093 61748 93142 84856
4921 84856 41501 -2253 15251 10235 -277 22389 80511 62804 71634 29763 -63044 -111294
4909 -111294 -62209 -56412 -45501 -9045 1853 7932 -19513 -77301 -106439 -86307 -69842 -7023
4897 -7023 -15200 -27987 23753 4529 -121425 -123292 23765 103746 79166 -19569 -7899 -43505
4885 -43505 -64455 -75396 -89493 -65872 -63438 -99611 -87771 -32399 57955 80614 7923 -5700
$$ packed form
4971A35731o1778N2059p604J5640l5466j06139k0205k3537o8807O519k473K2985
4959i3075M2555j1096j570j372k4496k5390Q712P0948J7940q645M0551K9442p5402
4946c0898O7376N1944J3838Q00q395j8694j5581L4359k8657K035J0615m0325j8133
4933B0284l8264l9222q439o6003p945j0140K8637R6557L7628M8655L1394q286
4921H4856m3355m3754J7504n016j0512K2666N8122j7707Q830m1871r2807m8250
4909a11294M9085N797J0911L6456J0898O079k7445n7788k9138K0132J6465O2819
4897g023q177j2787N1740j9224j25954j867J47057P9981k4580r8735J1670l5606
4885d3505k0950j0941j4097K3621K434l6173J1840N5372R0354K2659p2691j3623
$$ plain form
4873 -5700 54929 77241 22876 -10176 -21313 -53463 -34732 -27204 -88581 -82422 -52362 -68014
4861 -68014 -121402 -87667 -57262 -57417 -153172 -224904 -257950 -143544 -537 92754 35788 -3523
4849 -3523 6366 -35946 -82327 -20238 9411 19070 75203 42353 -79044 -99195 -47320 -98138
4837 -98138 -205781 -233972 -137275 -44198 37630 -6162 -14668 52329 86512 -17189 -29139 -4237
4825 -4237 5084 42402 97052 70551 38944 29691 32306 -33772 -126980 -45348 11718 16496 -27706
4812 -27706 -36812 -27992 21650 68415 87626 101724 50624 -33421 -49462 -7411 56319 117741
4800 117741 170741 167820 73924 -5047 39177 60167 37034 14251 17038 7638 -98249 -163993
4788 -163993 -131105 13421 65305 63468 19330 67139 90685 115488 52857 -61026 -78807
$$ packed form
4873e700O0629K2312n4365l3052j1137l2150J8731P528o1377O159L0060j5652
4861f8014n3388L3735L0405j55r5755p1732l3046J14406J43007R3291n6966l9311
4849c523R889m2312m6381O2089K9649R659N6133l2850j21397k0151N1875n0818
4837i8138j07643k8191R6697R3077Q1828m3792q506O6997L4183j03701j1950K4902
4825d237R321L7318N4650k6501l1607r253K615o6078r3208Q1632N7066M778m4202
4812b7706r106Q820M9642M6765J9211J4098n1100q4045j6041M2051O3730O1422
4800A17741N3000k921r3896p8971M4224K0990k3133k2783K787r400j05887o5744
4788a63993L2888J44526N1884j837m4138M7809K3546K4803o2631j13883j7781
$$ plain form
4777 -78807 -46159 -45982 -1489 22137 40825 -10622 -52297 858 55609 58590 -3652 -23382
4765 -23382 -28553 -44884 -23165 -23432 47724 53872 48705 103696 106884 53142 -12321 34925 61151
4752 61151 99941 112975 63600 173 42277 -15293 -44623 -73361 -66650 -110 55816 91273
4740 91273 89584 91454 110721 134441 91095 56453 11134 -85346 -175813 -140047 34774 52388
4728 52388 81391 66363 30122 54850 91598 81041 -13048 -22628 1306 -29355 -32824 -54163
4716 -54163 -52363 -30828 27425 86711 82913 10743 -66365 -95511 -67254 18452 4180 24324
4704 24324 3646 -16678 -43832 -40759 -4199 55760 24648 -48265 -92464 -63472 -36760 -104353
4692 -104353 -123114 -79006 -25371 -70744 -45781 13631 90995 87654 7927 64999 83804 36325
$$ packed form
4777g8807L2648J77M4493K3626J8688n1447m1675N3155N4751K981o2242j9730
4765b3382n171j6331K1719k67P1156O148n167N4991L188n3742o5463M7246K6226
4752F1151L8790J3034m9375o3427M2104n7570k9330k8738O711O6540N5926L5457
4740I1273j689J870J9267K3720m3346l4642m5319r6480r0467L5766J74821J7614
4728E2388K9003j5028l6241K4728L6748j0557r4089r580K3934l0661l469k1339
4716e4163J800K1535N8253N9286l798p2170p7108k9146K8257Q5706j4272K0144
4704B4324k0678k0324k7154L073L6560N9959l1112p2913m4199K8992K6712o7593
4692a04353j8761M4108N3635m5373K4963N9412P7364l341p9727N7072J8805m7479
$$ plain form
4680 36325 98576 158054 101643 78602 3618 -11251 49432 42097 -8677 -9560 -49226 -80958
4668 -80958 -103776 -100061 -55355 -53521 10606 2101 -58858 -73836 -94694 -99821 -92480 -44899 -17615
4655 -17615 -83559 -85541 -149875 -89190 -27390 -35413 15452 60327 -12538 70384 107868 30514
4643 30514 13589 44739 25375 -32048 -48392 -62404 -33627 -93859 -154902 -149966 -102545 11794
4631 11794 20516 9727 36349 -50649 -112640 -53946 22285 101852 140734 101485 17423 -27036
4619 -27036 -14848 -34631 -34651 -275 10711 42723 14990 -22454 20795 25301 724 -48917 -187037
4606 -187037 -201675 -64011 -9895 -86546 -142069 -110830 -162897 -167212 -124750 -167070 -136720 -54422
4594 -54422 52555 93074 45208 -24529 -123239 -88464 -62056 -104348 -108749 -126536 -37566 -28741
$$ packed form
4680C6325O2251N9478n6411k3041p4984j4869O0683p335n0774q83l9666l1732
4668h0958k2818L715M4706J834O4127q505o0959j4978k0858n127P341M7581K7284
4655a7615o5944j982o4334O0685O1800q023N0865M4875p2865Q2922L7484p7354
4643C0514j6925L1150j9364n7423j6344j4012K8777o0232o1043M936M7421J14339
4631A1794Q722j0789K6622q6998o1991N8694P6231P9567L8882l9249q4062m4459
4619b7036J2188j9783k0L4376J0986L2012k7733l7444M3249M506k4577m9641j38120
4606a87037j4638J37664N4116p6651n5523L1239n2067m315M2462m2320L0350Q2298
4594e4422J06977M0519m7866o9737r8710L4775K6408m2292m401j7787Q8970Q825
$$ plain form
4582 -28741 -5839 -78659 -66012 -37142 28327 102306 113486 120163 60322 -10757 21411 125900
4570 125900 94337 15684 42175 24943 26421 25207 10160 -27126 26038 28672 29643 65380 12109
4557 12109 -2072 -61171 -123732 -97023 -52729 -29370 -70168 -87989 -7294 63023 117019 102439
4545 102439 56280 78140 91940 44841 81433 109694 106635 53921 96434 64116 17660 -17529
4533 -17529 -67749 -1300 -23559 -78395 -101180 -35264 -10167 -41171 -74573 -31219 -24133 -37634
4521 -37634 -31456 20123 2385 4993 -14839 -12544 26158 32776 35380 51034 119683 122938 87163
4508 87163 34900 55715 117744 67436 74354 59432 -69941 -150686 -136546 -102778 -87026 -80518
4496 -80518 -112577 -87382 -62517 -23047 -35085 -46391 -27002 24150 71448 43727 96275 124953
$$ packed form
4582b8741K2902p2820J2647K8870O5469P3979J1180O677n9841p1079L2168J04489
4570A25900l1563p8653K6491j7232J478j214j5047l7286N3164K634R71L5737n3271
4557A2109j4181n9099o2561K6709M4294K3359m0798j7821Q0695P0317N3996j4580
4545A02439m6159K1860J3800m7099L6592K8261l059n2714M2513l2318m6456l5189
4533a7529n0220O6449k2259n4836k2785O5916K5097l1004l3402M3354P086j3501
4521c7634O178N1579j7738K608j9832K295L8702O618K604J5654O8649L255l5775
4508H7163n2263K0815O2029n0308O918j4922j29373q0745J4140L3768J5752O508
4496h0518l2059K5195K4865L9470j2038j1306J9389N1152M7298k7721N2548K8678
$$ plain form
4484 124953 70448 -53415 -98192 -128123 -130366 -63832 -52086 -44236 -21237 68593 70467 -66725
4472 -66725 -105394 -101797 -86513 -91299 -77578 589 69646 -6125 -12323 -20616 -69752 -89415 -54733
4459 -54733 -109849 -151181 -213663 -209327 -153999 -47465 61768 89559 35637 -57232 -46685 18081
4447 18081 -507 -29069 -6927 -12599 -85906 -107200 -41420 62924 71426 15660 -8590 2301
4435 2301 34765 70267 -23821 -49991 -26593 -73840 -92385 -60211 -3519 20405 -47548 -40993
4423 -40993 -52931 -106954 -69938 -12638 33417 -7832 -93281 -125969 -129406 -85894 15458 91299
4411 91299 67025 41796 64684 119284 172991 134601 40941 880 8616 7472 -31959 -21224
4399 -21224 -63984 -42933 12429 -5815 -38773 -32744 -23939 -73650 -124721 -134929 -109829 -71396
$$ packed form
4484A24953n4505j23863m4777k9931k243O6534J1746P850K2999Q9830J874j37192
4472f6725l8669L597J5284m786J3721P8167O9057p5771o198q293m9136j9663L4682
4459e4733n5116m1332o2482M336N5328J06534J09233K7791n3922r2869J0547O4766
4447A8081j8588k8562K2142n672p3307k1294O5780J04344Q502n5766k4250J0891
4435B301L2464L5502r4088k6170K3398m7247j8545L2174N6692K3924o7953O555
4423d0993j1938n4023L7016N7300M6055m1249q5449l2688l437M3512J01352P5841
4411I1299k4274k5229K2888N4600N3707l8390r3660m0061P736j144l9431J0735
4399b1224m2760K1051N5362j8244l2958O029Q805m9711n1071j0208K5100L8433
$$ plain form
4387 -71396 -28061 -23105 -18245 36923 92578 56088 -104004 -140568 -96894 -143512 -158966 -90958
4375 -90958 -97010 -49800 -84449 5651 69523 149278 151420 77505 -39988 -66364 -7761 -44177
4363 -44177 -108245 -103044 -53938 -91375 -114305 -83201 -70127 -28668 -6371 -87882 -122483 -109124
4351 -109124 -160033 -176864 -85905 20081 78815 55146 79350 85831 13381 -11695 -21474 -43868
4339 -43868 -52191 -23173 -87459 -27278 28042 22716 -35890 15035 34128 80087 117076 48114
4327 48114 -59886 -57851 -72032 -128341 -126696 -124807 -32190 -99282 -98543 -53919 -16632 51718 57787
4314 57787 -39676 -44851 -32290 -24808 -46333 -67815 -38521 -41292 -79181 -119955 -122359 4876
4302 4876 49103 66946 70499 8145 -10753 33933 44675 -16535 -33542 -33329 -40153 -40830 6648
$$ packed form
4387g1396M3335M956M860N5168N5655l6490j60092l6564M3674m6618j5454O8008
4375i0958o052M7210l4649R0100O3872P9755K142p3915j17493k6376N8603l6416
4363d4177o4068N201M9106l7437k2930L1104J3074M1459K2297q1511l4601J3359
4351a09124n0909j6831R0959J05986N8734k3669K4204O481p2450k5076r779k2394
4339d3868q323K9018o4286O0181N5320n326n8606N0925J9093M5959L6989o8962
4327D8114j08000K035j4181n6309J645J889R2617o7092P39M4624L7287O8350O069
4314E7787r7463n175J2561P482k1525k1482K9294k771l7889m0774k404J27235
4302D876M4227J7843L553o2354j8898M4686J0742o1210j7007K13o824o77M7478
$$ plain form
4289 6648 -32797 -90279 -94198 -48265 -53346 -92389 -96957 -110473 -77312 -97089 -64516 -70543 -12940
4276 -12940 45018 -496 -20339 -1661 59999 91887 144667 79439 -23819 -104409 -87742 -81768
4264 -81768 -93070 -77061 -61128 13330 52778 60281 81676 110235 74432 48607 -760 -37488
4252 -37488 -39889 -71380 -66528 -73779 -46680 -15454 48697 134300 139935 123261 103044 -2458
4240 -2458 -48123 -9420 10406 36209 -868 -44755 2905 32823 -43304 -18187 -47097 -34716
4228 -34716 39316 77096 106658 79014 95646 26043 -107955 -127924 -29865 11665 -41367 -98182
4216 -98182 -75331 -17148 76777 35202 -41668 -49277 -84996 32810 61232 61196 18153 65796
4204 65796 75127 -10126 -58233 -40169 28836 -9194 -5849 -51419 11411 42839 51081 67600
$$ packed form
4289F648l9445n7482l919M5933n081l9043m568j3516L3161j9777L2573o027N7603
4276a2940N7958m5514j9843J8678O1660L1888N2780o5228j03258q0590J6667N974
4264h1768j1302J6009J5933P4458L9448P503K1395K8559l5803k5825m9367l6728
4252c7488k401l1491M852p251K7099L1226O4151Q5603N635j6674k0217j05502
4240b458m5665L8703J9826K5803l7077m3887M7660K9918p6127K5117k8910J2381
4228c4716P4032L7780K9562k7644J6632o9603j33998j9969R8059M1530n3032n6815
4216i8182K2851N8183R3925m1575p6870p609l5719J17806K8422l6m3043M7643
4204F5796R331q5253m8107J8064O9005l8030L345m5570O2830L1428Q242J6519
$$ plain form
4192 67600 39740 -44266 -37918 8194 47408 7255 12577 48567 38581 27314 -4359 -39265
4180 -39265 -93029 -51074 36433 -2562 51432 52863 -9196 -21178 36013 13752 -82778 -146580
4168 -146580 -109344 -41419 -71085 -69352 -86371 -63031 -111652 -89790 -36907 2475 59078 51204
4156 51204 33472 -75275 -147461 -79740 -39068 43244 -4674 -24855 12101 -20448 -26359 -85343
4144 -85343 -90208 -57045 -43437 1176 -20024 -71673 -111225 -99148 -56440 31827 27949 -30186
4132 -30186 -1012 87592 107713 113771 112060 94214 63395 19478 27606 12616 7072 36268 60037
4119 60037 81905 67968 95165 67977 73432 98910 52402 -24764 8816 16996 -26540 -27455 -3978
4106 -3978 -63994 -64876 24203 69103 -6165 -57362 -79480 -182498 -209537 -128130 -93665 -133638
$$ packed form
4192F7600k7860q4006O348M6112L9214m0153N322L5990r986j1267l1673l4906
4180c9265n3764M1955Q7507l8995N3994J431o2059j1982N7191k2261r6530o3802
4168a46580L7236O7925k9666J733j7019K3340m8621K1862N2883L9382N6603p874
4156E1204j7732j08747p2186O7721M0672Q2312m7918k0181L6956l2549n911n8984
4144h5343m865L3163J3608M4613k1200n1649l9552J2077M2708Q8267l878n8135
4132c0186K9174Q8604K0121O058j711j7846l0819m3917Q128j4990n544K9196K3769
4119F0037K1868j3937K7197k7188N455K5478m6508p7166L3580Q180m3536r15K3477
4106c978o0016q82Q9079M4900p5268n1197k2118j03018k7039Q1407L4465l9973
$$ plain form
4094 -133638 -68099 19040 14220 -84043 -110484 -56590 -121521 -152484 -91386 -59905 -75082 -78057
4082 -78057 -31508 -15055 -47243 -55723 -92950 -64284 -91321 -111563 -58612 -105282 -20174 68042
4070 68042 19707 -1318 -28432 -42071 -58078 -34493 32591 89376 136848 139044 48514 36147
4058 36147 46937 -49350 -60524 -9551 -60259 -87509 -33207 -55696 -121692 -98687 -36269 -27227
4046 -27227 9176 47705 -20406 -41600 -70546 -333 66638 112804 25262 -68132 -57556 -29117
4034 -29117 -11577 -24182 -32349 -53939 -63369 -78308 -128285 -73790 -63413 -76419 -50194 -13819
4022 -13819 -46995 -55670 -61070 -14808 36009 99750 136590 100229 99499 125926 145844 79659 15150
4009 15150 12330 54521 52177 -4798 36509 120778 174991 95950 -65884 -116622 -94399 -26988
$$ packed form
4094a33638O5539Q7139m820r8263k6441N3894o4931l0963O1098L1481j5177k975
4082g8057M6549J6453l2188q480l7227K8666k7037k0242N2951m6670Q5108Q8216
4070F8042m8335k1025k7114j3639j6007K3585O7084N6785M7472K196r0530j2367
4058C6147J0790r6287j1174N0973n0708k7250N4302k2489o5996K3005O2418R042
4046b7227L6403L8529o8111k1194k8946P0213O6971M6166q7542r3394J0576K8439
4034b9117J7540j2605q167k1590r430j4939m9977N4495J0377j3006K6225L6375
4022a3819l3176q675n400M6262N0817O3741L6840l6361p30K6427J9918o6185o4509
4009A5150k820M2191k344n6975M1307Q4269N4213p9041j61834n0738K2223O7411
$$ plain form
3997 -26988 -69069 -88068 -29431 -53487 -38962 -87106 -72835 -23251 -31283 -135229 -191297 -154786
3985 -154786 -79558 -36595 -12745 -107117 -184550 -141612 -144818 -174463 -135348 -8396 -801 -74136
3973 -74136 -125456 -155773 -113514 -76755 -71808 -88444 -36466 -35106 -62926 -39298 -47356 -67923
3961 -67923 -52630 -83993 -97994 -57806 31947 -29342 -64585 -19947 14711 -10823 11865 63298
3949 63298 133074 54979 -12717 -10631 20715 9194 -9020 5789 51873 96709 75368 -29718
3937 -29718 -61421 -51299 27082 62562 21286 6429 -36701 50 50041 -19978 -17742 -16873
3925 -16873 -12810 -36619 -41983 -52900 -62886 -79334 -78145 -79257 -87782 -158933 -167360 -108078 -117788
3912 -117788 -98339 -104860 -74163 -30588 -68707 -92185 -61053 -59748 -95068 -185999 -180128 -115794
$$ packed form
3997b6988m2081j8999N8637k4056J4525m8144J4271M9584q032j03946n6068L6511
3985a54786P5228M2963K3850r4372p7433M2938l206k9645L9115J26952P595p3335
3973g4136n1320l0317M2259L6759M947j6636N1978J360k7820K3628q058k0567
3961f7923J5293l1363j4001M0188Q9753o1289l5243M4638L4658k5534K2688N1433
3949F3298O9776p8095o7696K086L1346j1521j8214J4809M6084M4836k1341j05086
3937b9718l1703J0122P8381L5480m1276j4857m3130L6751M9991p0019K236Q69
3925a6873M063k3809n364j0917r986j6448J189j112q525p1151q427N9282r710
3912a17788J9449o521L0697M3575l8119k3478L1132J305l5320r0931N871O4334
$$ plain form
3900 -115794 -56082 -53175 -81294 -139092 -230079 -165849 -104682 -100675 -60578 -23447 -35522 -62257
3888 -62257 -48257 -78381 -95967 -63771 -55518 -41384 -63891 -46059 -45655 -41929 6333 -5421 -88720
3875 -88720 -66521 -8727 -37515 -82286 -54494 -72786 -137645 -105811 -88403 -34545 -108384 -176385
3863 -176385 -221880 -206958 -151250 -128838 -61087 -17947 -52946 -90621 -14719 -21679 17403 26630
3851 26630 6131 22744 -9185 -14074 -8007 -49562 -6286 -16130 -29437 25367 67874 -38437
3839 -38437 -81439 -59413 -40116 -5271 -25888 -69308 -2347 -2700 -36506 -76569 -105570 -69267
3827 -69267 -65892 -60223 51735 51321 -14447 -73510 -123641 -153454 -122792 -80372 -60205 -112125
3815 -112125 -159615 -97518 -56602 -20306 18240 9516 -9963 -31497 -46873 -7221 9777 43920
$$ packed form
3900a15794N9712K907k8119n7798r0987O4230O1167M007M0097L7131j2075k6735
3888f2257J4000l0124j7586L2196Q253J4134k2507J7832M04L726M8262j1754q3299
3875h8720K2199N7794k8788m4771K7792j8292o4859L1834J7408N3858p3839o8001
3863a76385m5495J4922N5708K2412O7751M3140l4999l7675P5902o960L9082R227
3851B6630k0499J6613l1929m889O067m1555M3276r844j3307N4804M2507j06311
3839c8437m3002K2026J9297L4845k0617m3420O6961l53l3806m0063k9001L6303
3827f9267L375N669J11958m14o5768n9063n0131k9813L0662M2420K0167n1920
3815a12125m7490O2097M0916L6296L8546q724j9479k1534j5376L9652J6998L4143
$$ plain form
3803 43920 76452 731 -96219 -48632 4818 7796 26707 65332 52514 37288 -7736 -39329
3791 -39329 7726 47871 72565 22810 72703 68601 56892 28631 -25358 -55496 20306 108466
3779 108466 58095 -50294 -91133 -39737 -76875 -108911 3098 21492 46787 -1338 -82184
3768 -82184 -69240 -49821 -12512 -6930 -45175 -19490 36510 -8601 -125180 -179023 -189603 -120461
3756 -120461 -69027 -90399 -118388 -112407 -74707 -3615 3250 -79676 -70572 -68182 -34782 -4924
3744 -4924 -5063 -17340 -63965 -39178 19228 11954 117838 125869 64763 124124 93583 -19735
3732 -19735 -142177 -198004 -194071 -145704 -2457 -4192 -95725 -122194 -62654 -16059 601 48909
3720 48909 -25471 -11232 68074 187066 187782 124638 154005 159830 132163 124638 144525 89632
$$ packed form
3803D3920L2532p5721r6950M7587N3450K978J8911L8625j2818j5226m5024l1593
3791c9329M7055M0145K4694m9755M9893m102j1709k8261n3989l0138P5802Q8160
3779A08466n0371j08389m0839N1396l7138l2036J12009J8394K5295m8125q0846
3768h2184J2944J9419L7309N582l8245K5685N6000m5111j16579n3843j0580O9142
3756a20461N1434k1372k7989N981L7700P1092O865q2926R104K390L3400K9858
3744d924j39j2277m6625K4787N8406p274J05884Q031o1106N9361l0541j13318
3732a9735j22442n5827L933M8367J43247j735r1533k6469N9540M6595J6660M8308
3720D8909p4380J4239P9306J18992P16o3144K9367N825k7667p525J9887n4893
$$ plain form
3708 89632 65592 8011 -73024 -112681 -88329 230 27090 4644 -57692 -32965 12808 32549
3696 32549 13772 30353 -8223 6232 -10592 -4270 -20233 -47679 50025 1253 -3572 -3139 -39201
3683 -39201 -61590 -48644 -6172 13493 -33430 -22007 9839 -5796 28796 2091 44389 30180
3671 30180 31693 -20866 -40021 -43141 -33909 -45152 -42124 -29290 -25432 32437 -1284 -59490 -74125
3658 -74125 -73931 -46686 -8852 1420 53724 79995 2225 -87318 -85934 -76529 6872 27782 36158
3645 36158 25256 27381 12613 35493 83453 90743 39158 -29631 -43289 -92691 -121129 -46730
3633 -46730 -70602 -64263 -40301 -26205 -38413 -16785 60102 72675 6370 -21459 -114032 -181248
3621 -181248 -149680 -63031 24441 86421 84646 12648 -8562 37305 23656 18886 1450 -20832
$$ packed form
3708H9632k4040n7581q1035l9657K4352Q8559K6860k2446o2336K4727M5773J9741
3696C2549j8777J6581l8576J4455j6824O322j5963k7446R7704m8772m825M33l6062
3683c9201k2389J2946M2472J9665m6923J1423L1846j5635L4592k6705M2298j4209
3671C0180J513n2559j9155l120R232j1243L028J2834L858N7869l3721n8206j4635
3658g4125J94K7245L7834J0272N2304K6271p7770q9543J384R405Q3401K0910Q376
3645C6158j0902K125j4768K2880M7960P290n1585o8789j3658m9402k8438P4399
3633d6730k3872O339K3962J4096j2208K1628P6887J2573o6305k7829r2573o7216
3621a81248L1568Q6649Q7472O1980j775p1998k1210M5867j3649m770j7436k2282
$$ plain form
3609 -20832 44994 26696 -55075 -47821 -12894 -53095 -67046 -43931 24127 -15865 -59740 -89926
$$ packed form
3609b0832O5826j8298q1771P254L4927m0201j3951K3115O8058l9992m3875l0186
$$ [...]
##END NTUPLES=NMR SPECTRUM
##END=
