##TITLE=Analysis number 322252
Compound Code cc 50309
Book Reference 438/198
Project Code adrs
Chemist Name antons
##JCAMPDX= 6.0         $$ Bruker NMR JCAMP-DX V2.0
##DATA TYPE= NMR SPECTRUM
##DATA CLASS= NTUPLES
##ORIGIN= Bruker BioSpin GmbH
##OWNER= nmr
$$ XWIN-NMR		Version 3.5
$$ Tue Sep 19 08:55:56 2006 GMT Daylight Time (UT+1h)  MAYBRIDGE\nmr@NMR_250MHZ
##.OBSERVE FREQUENCY= 250.131544655141
##.OBSERVE NUCLEUS= ^1H
##.ACQUISITION MODE= SIMULTANEOUS (DQD)
##.ACQUISITION SCHEME= undefined
##.AVERAGES= 16
##.DIGITISER RES= 18
##SPECTROMETER/DATA SYSTEM= dpx250
##.PULSE SEQUENCE= zg30
##.SOLVENT NAME= CDCl3
##.SHIFT REFERENCE= (INTERNAL, CDCl3, 0, 16.522)
##AUDIT TRAIL= $$ (NUMBER, WHEN, WHO, WHERE, WHAT)
$$ ##TITLE= Audit trail, XWIN-NMR		Version 3.5
$$ ##JCAMPDX= 5.01
$$ ##ORIGIN= Bruker BioSpin GmbH
$$ ##OWNER= nmr
$$ C:\u/data/dgb/nmr/ADRS/1000/pdata/1/auditp.txt
$$ ##AUDIT TRAIL=  $$ (NUMBER, WHEN, WHO, WHERE, WHAT)
(   1,<2006-09-19 08:55:32.33 +100>,<MAYBRIDGE\nmr>,<NMR_250MHZ>,
      <created by zg, POWCHK disabled, PULCHK disabled
       configuration hash MD5:
       E2 DF 36 D8 04 B2 41 60 5A D7 A3 38 5A 4B D0 FE
       data hash MD5: 64K
       C2 C8 17 AE 46 7F F2 C9 B9 61 A3 A2 2E 71 AC 05>)
(   2,<2006-09-19 08:55:46.60 +100>,<MAYBRIDGE\nmr>,<NMR_250MHZ>,
      <Start of raw data processing
       ef LB = 0.3 FT_mod = 6 PKNL = 1 SI = 32K 
       data hash MD5: 32K
       45 24 7E 3B 4C CC 6D 8B 32 C1 9C 01 ED 64 5F 46>)
(   3,<2006-09-19 08:55:48.28 +100>,<MAYBRIDGE\nmr>,<NMR_250MHZ>,
      <apk 
       data hash MD5: 32K
       57 1A BB 5A E1 A4 53 42 87 67 00 0F 2C 01 1D 87>)
(   4,<2006-09-19 08:55:49.02 +100>,<MAYBRIDGE\nmr>,<NMR_250MHZ>,
      <abs ABSG = 5 
       data hash MD5: 32K
       5B E2 14 55 76 1B 4F 50 03 9A 53 D8 32 A0 DD 29>)
$$ ##END=
$$ 
$$ hash MD5
$$ 27 2D D3 A0 7F 94 5D 83 8E 1D 91 7E E0 F4 1E FA
##$RELAX= 
##$RELAX= 
##$RELAX= 
##$RELAX= 
##$RELAX= 
##$RELAX= 
##$RELAX= 
$$ Bruker specific parameters
$$ --------------------------
##$DU= <C:\u>
##$EXPNO= 1000
##$NAME= <ADRS>
##$PROCNO= 1
##$TYPE= <nmr>
##$USER= <dgb>
##$AMP= (0..31)
100 100 100 100 100 100 100 100 100 100 100 100 100 100 100 100 100 100 
100 100 100 100 100 100 100 100 100 100 100 100 100 100 
##$AQSEQ= 0
##$AQ_mod= 3
##$AUNM= <au_zg>
##$AUTOPOS= <33 >
##$BF1= 250.13
##$BF2= 250.13
##$BF3= 250.13
##$BF4= 250.13
##$BF5= 500.13
##$BF6= 500.13
##$BF7= 500.13
##$BF8= 500.13
##$BYTORDA= 1
##$CFDGTYP= 0
##$CFRGTYP= 5
##$CHEMSTR= <none>
##$CNST= (0..31)
1 1 145 1 1 1 1 1 1 1 1 1 1 1 1 1 1 1 1 1 1 1 1 1 1 1 1 1 1 1 1 1 
##$CPDPRG= <>
##$CPDPRG1= <>
##$CPDPRG2= <>
##$CPDPRG3= <>
##$CPDPRG4= <mlev>
##$CPDPRG5= <mlev>
##$CPDPRG6= <mlev>
##$CPDPRG7= <mlev>
##$CPDPRG8= <mlev>
##$CPDPRGB= <>
##$CPDPRGT= <>
##$D= (0..31)
0 1 0 0 0 0 0 0 0 0.06 0 0 0 0 0 0 0.0002 0 0 0 0 0 0 0 0 0 0 0 0 0 0 
0 
##$DATE= 1158652531
##$DBL= (0..7)
120 120 120 120 120 120 120 120 
##$DBP= (0..7)
150 150 150 150 150 150 150 150 
##$DBP07= 0
##$DBPNAM0= <>
##$DBPNAM1= <>
$$ [...]
##$SUBNAM7= <"">
##$SUBNAM8= <"">
##$SUBNAM9= <"">
##$SW= 20.6930455092707
##$SWIBOX= (0..15)
0 0 3 0 0 0 0 0 0 0 0 0 0 0 0 0 
##$SW_h= 5175.983436853
##$TD= 65536
##$TD0= 1
##$TE= 295.16
##$TE2= 300
##$TE3= 300
##$TEG= 300
##$TL= (0..7)
0 120 120 120 120 120 120 120 
##$TP= (0..7)
150 150 150 150 150 150 150 150 
##$TP07= 0
##$TPNAME0= <>
##$TPNAME1= <>
##$TPNAME2= <>
##$TPNAME3= <>
##$TPNAME4= <>
##$TPNAME5= <>
##$TPNAME6= <>
##$TPNAME7= <>
##$TPOAL= (0..7)
0.5 0.5 0.5 0.5 0.5 0.5 0.5 0.5 
##$TPOFFS= (0..7)
0 0 0 0 0 0 0 0 
##$TUNHIN= 0
##$TUNHOUT= 0
##$TUNXOUT= 0
##$USERA1= <user>
##$USERA2= <user>
##$USERA3= <user>
##$USERA4= <user>
##$USERA5= <user>
##$V9= 5
##$VALIST= <valist>
##$VCLIST= <CCCCCCCCCCCCCCC>
##$VD= 0
##$VDLIST= <DDDDDDDDDDDDDDD>
##$VPLIST= <PPPPPPPPPPPPPPP>
##$VTLIST= <TTTTTTTTTTTTTTT>
##$WBST= 1024
##$WBSW= 4
##$XGAIN= (0..3)
0 0 0 0 
##$XL= 0
##$YL= 0
##$YMAX_a= 448712
##$YMIN_a= -521851
##$ZGOPTNS= <>
##$ZL1= 120
##$ZL2= 120
##$ZL3= 120
##$ZL4= 120
##$ABSF1= 16.522
##$ABSF2= -4.171173
##$ABSG= 5
##$ABSL= 3
##$ALPHA= 0
##$AQORDER= 0
##$ASSFAC= 0
##$ASSFACI= 0
##$ASSFACX= 0
##$ASSWID= 0
##$AUNMP= <proc_1d>
##$AZFE= 0.1
##$AZFW= 0.1
##$BCFW= 0
##$BC_mod= 0
##$BYTORDP= 0
##$COROFFS= 0
##$CY= 12.5
##$DATMOD= 1
##$DC= 0
##$DFILT= <>
##$DTYPP= 0
##$F1P= 14.0000005364418
##$F2P= -0.99999901652339
##$FCOR= 0.5
##$FTSIZE= 32768
##$FT_mod= 6
##$GAMMA= 0
##$GB= 0
##$INTBC= 1
##$INTSCL= 1
##$ISEN= 128
##$LB= 0.3
##$LEV0= 0
##$LPBIN= 0
##$MAXI= 10000
##$MC2= 0
##$MEAN= 0
##$ME_mod= 0
##$MI= 0
##$NCOEF= 0
##$NC_proc= -5
##$NLEV= 6
##$NOISF1= 0
##$NOISF2= 0
##$NSP= 0
##$NTH_PI= 0
##$NZP= 0
##$OFFSET= 16.522
##$PC= 1
##$PHC0= 145.9874
##$PHC1= 6.983932
##$PH_mod= 1
##$PKNL= yes
##$PPARMOD= 0
##$PSCAL= 4
##$PSIGN= 0
##$REVERSE= no
##$SF= 250.13
##$SI= 32768
##$SIGF1= 0
##$SIGF2= 0
##$SINO= 400
##$SIOLD= 32768
##$SREGLST= <1H.CDCl3>
##$SSB= 0
##$STSI= 32768
##$STSR= 0
##$SW_p= 5175.98343685301
##$SYMM= 0
##$S_DEV= 0
##$TDeff= 65536
##$TDoff= 0
##$TI= <Analysis number 999999
Compound Code 99
Book Reference 9
Project Code 9>
##$TILT= no
##$TM1= 0
##$TM2= 0
##$TOPLEV= 0
##$USERP1= <user>
##$USERP2= <user>
##$USERP3= <user>
##$USERP4= <user>
##$USERP5= <user>
##$WDW= 1
##$XDIM= 32768
##$YMAX_p= 584678088
##$YMIN_p= -246414
$$ End of Bruker specific parameters
$$ ---------------------------------
##NTUPLES= NMR SPECTRUM
##VAR_NAME=  FREQUENCY,     SPECTRUM/REAL,   SPECTRUM/IMAG
##SYMBOL=    X,             R,               I
##VAR_TYPE=  INDEPENDENT,   DEPENDENT,       DEPENDENT
##VAR_FORM=  AFFN,          ASDF,            ASDF
##VAR_DIM=   32768,         32768,           32768
##UNITS=     HZ,            ARBITRARY UNITS, ARBITRARY UNITS
##FACTOR=    0.157963299565203, 1,           1
##FIRST=     4132.6476996994, 0,             0
##LAST=      -1043.33573715361, 0,           0
##MIN=       -1043.33573715361, -246414,     0
##MAX=       4132.6476996994, 584678088,     0
$$ Real data points
##PAGE= N=1
##DATA TABLE= (X++(R..R)), XYDATA
$$ [...]
$$ plain form
14357 133608 122684 170838 241692 257949 288761 333687 373349 434936 465754 507362 511717 548059
14345 548059 646709 722715 745788 799732 871310 931312 969199 1038730 1207620 1417593 1584848
14334 1584848 1749584 1955125 2121472 2312097 2407987 2429854 2425551 2375092 2316225 2168057
14324 2168057 2014749 1833491 1599063 1418685 1248845 1056218 957963 891682 806626 780454
14314 780454 739361 665017 629033 620383 592501 578496 511469 504920 578342 690072 753182 790161
14302 790161 975357 1105212 1294691 1471490 1618197 1723764 1712721 1642240 1574758 1495994
14292 1495994 1345879 1182303 1052838 917565 859947 835975 840502 811021 811260 830140 848056
14281 848056 952482 1062717 1162026 1285389 1511487 1699299 1831153 1941429 2033743 2005750
$$ packed form
14357A33608j0924M8154P0854J6257L0812M4926L9662O1587L0818M1608M355L6342
14345E48059R8650P6006K3073N3944P1578O0002L7887O9531J68890K09973J67255
14334A584848J64736K05541J66347J90625R5890K1867m303n0459n8867j48168
14324B168057j53308j81258k34428j80378j69840j92627r8255o6281q5056k6172
14314G80454m1093p4344l5984q650k7882j4005o7027o549P3422J11730O3110L6979
14302G90161J85196J29855J89479J76799J46707J05567j1043p0481o7482p8764
14292A495994j50115j63576j29465j35273n7618k3972M527k9481K39J8880J7916
14281H48056J04426J10235R9309J23363K26098J87812J31854J10276R2314k7993
$$ plain form
14271 2005750 1867606 1649351 1537115 1445553 1301988 1260394 1264125 1283538 1304046 1329755 1359301
14260 1359301 1404955 1517159 1613404 1699633 1834975 1922290 1977850 1997837 2029166 1988181 1868023
14249 1868023 1727588 1583777 1447187 1309728 1186012 1094438 1045695 1030791 1000954 1030790
14239 1030790 1112935 1124374 1136998 1233959 1327129 1394770 1506962 1609636 1795881 1989606
14229 1989606 2095058 2141121 2036318 1785370 1537565 1359192 1222175 1078212 987846 875075
14219 875075 772002 708005 690745 648760 644439 617053 626392 626788 638616 635808 625714 628613
14207 628613 660254 679645 625611 638630 660265 637924 601421 575119 562208 491864 530392
14196 530392 524896 452702 415350 367241 307451 304338 306045 354730 367427 359205 301378 318632
$$ packed form
14271B005750j38144k18255j12236r1562j43565m1594L731J9413K0508K5709K9546
14260A359301M5654J12204R6245Q6229J35342Q7315N5560J9987L1329m0985j20158
14249A868023j40435j43811j36590j37459j23716r1574m8743j4904k9837K9836
14239A030790Q2145J1439J2624R6961R3170O7641J12192J02674J86245J93725
14229A989606J05452M6063j04803k50948k47805j78373j37017j43963r0366j12771
14219H75075j03073o3997j7260m1985m321k7386R339L96J1828k808j0094K899
14207F28613L1641J9391n4034J3019K1635k2341l6503k6302j2911p0344L8528
14196E30392n496p2194l7352m8109n9790l113J707M8685J2697q222n7827J7254
$$ plain form
14184 318632 314224 378550 442375 463949 445295 425917 429517 419818 401902 371594 386150 379359
14172 379359 371581 380066 393477 412275 417217 387040 337563 367582 404863 392128 376765 323470
14160 323470 347865 399355 442107 426148 429097 450673 489455 508333 620357 704227 707426 615301
14148 615301 594949 512300 507228 538663 580176 610972 574924 493405 492776 523114 543364 516352
14136 516352 512084 533955 504493 443812 388596 352794 424870 485911 447005 395781 366565 386331
14124 386331 433965 398846 388103 401192 415649 428205 318212 288195 313732 269468 245800
14113 245800 249100 216630 211692 173447 183205 204436 222804 241127 236285 267210 284165 300237
14101 300237 248872 247017 222834 210218 205534 222493 268381 318706 316069 348315 396237 341061
$$ packed form
14184C18632m408O4326O3825K1574j8654j9378L600r699j7916l0308J4556o791
14172C79359p778Q485J3411J8798M942l0177m9477L0019L7281j2735j5363n3295
14160C23470K4395N1490M2752j5959K949K1576L8782J8878J12024Q3870L199r2125
14148F15301k0352q2649n072L1435M1513L0796l6048q1519o29L0338K0250k7012
14136E16352m268K1871k9462o0681n5216l5802P2076O1041l8906n1224k9216J9766
14124C86331M7634l5119j0743J3089J4457J2556j09993l0017K5537m4264k3668
14113B45800L300l2470m938l8245R758K1231J8368J8323m842L0925J6955J6072
14101C00237n1365j855k4183j2616m684J6959M5888N0325k637L2246M7922n5176
$$ plain form
14089 341061 279114 279431 252633 241827 218656 234525 260892 263358 278073 299507 404571 400888
14077 400888 352017 376738 419994 497993 521989 527180 542824 611757 693462 707649 678990 701474
14065 701474 762255 781474 762909 701264 652427 678883 704187 699824 677053 602234 572433 533164
14053 533164 525248 541439 474351 468639 518638 550031 551167 560542 540151 473193 421645 409356
14041 409356 440021 406638 392459 414579 420856 423969 408859 368820 414005 374579 420943 472136
14029 472136 578811 606442 552550 497917 462126 475880 482161 492867 538257 609614 667974
14018 667974 688392 716240 772429 882482 1013618 1080479 1146794 1249424 1292633 1260798 1227162
14007 1227162 1217562 1233546 1285528 1313268 1294685 1214211 1115411 1058540 1092839 1090019 1083491 1108372
$$ packed form
14089C41061o1947L17k6798j0806k3171J5869K6367K466J4715K1434J05064l683
14077D00888m8871K4721M3256P7999K3996N191J5644O8933Q1705J4187k8659K2484
14065G01474O0781J9219j8565o1645m8837K6456K5304m363k2771p4819k9801l9269
14053E33164p916J6191o7088n712M9999L1393J136R375k0391o6958n1548j2289
14041D09356L0665l3383j4179K2120O277L113j5110m0039M5185l9426M6364N1193
14029D72136J06675K7631n3892n4633l5791J3754O281J0706M5390P1357N8360
14018F67974K0418K7848N6189J10053J31136O6861O6315J02630M3209l1835l3636
14007A227162r600J5984N1982K7740j8583q0474r8800n6871L4299k820o528K4881
$$ plain form
13995 1108372 1149522 1188718 1213928 1243265 1258002 1210858 1188280 1185174 1184799 1216946 1223104 1182566
13983 1182566 1169708 1180023 1167598 1159773 1191585 1241516 1261804 1296424 1328383 1338454 1356781
13972 1356781 1356799 1352514 1358916 1425634 1516051 1595373 1658793 1777973 1940372 2051802 2119881 2175738
13960 2175738 2237328 2263452 2264094 2298072 2301531 2300936 2258294 2242357 2261582 2243098 2176198 2140212
13948 2140212 2103024 2025710 2064923 2110377 2169290 2249906 2294162 2357544 2425437 2512401 2637803
13937 2637803 2694651 2819535 2894864 2936497 3047790 3166985 3273424 3377820 3430856 3557857
13927 3557857 3724164 3942943 4121603 4336488 4577462 4766056 5019298 5286952 5597861
13918 5597861 5921377 6313518 6803548 7306729 7850399 8440130 9107077 9799672 10543787
$$ packed form
13995A108372M1150L9196K5210K9337J4737m7144k2578l106l75L2147O158m0538
13983A182566j2858J0315j2425p825L1812M9931K0288L4620L1959J0071J8327
13972A356781J8m285O402O6718R0417P9322O3420J19180J62399J11430O8079N5857
13960B175738O1590K6124O42L3978L459n95m2642j5937J9225j8484o6900l5986
13948B140212l7188p7314L9213M5454N8913Q0616M4256O3382O7893Q6964J25402
13937B637803N6848J24884P5329M1633J11293J19195J06439J04396N3036J27001
13927C557857J66307K18779J78660K14885K40974J88594K53242K67654L10909
13918E597861L23516L92141M90030N03181N43670N89731O66947O92595P44115
$$ plain form
13909 10543787 11392438 12360357 13462239 14711881 16128455 17781230 19759721 22141888
13901 22141888 25021214 28305012 32247412 37039934 42844792 49958030 58806218 70221193
13893 70221193 85128825 104538043 129016439 158622706 193070708 232125586 274696468
13886 274696468 317451139 355488905 385916912 409084325 425763263 433745913 429216620
13879 429216620 411649206 384979758 354206574 321415052 286042964 248981207 213564756
13872 213564756 183111926 158672918 139527688 124503709 112383452 102252191 93671272
13865 93671272 86285082 79877290 74229481 69249959 64823897 60894885 57439394 54452434
13857 54452434 51749295 49282653 47037179 45087633 43354939 41762743 40297692 38923610
$$ packed form
13909A0543787Q48651R67919J101882J249642J416574J652775J978491K382167
13901B2141888K879326L283798L942400M792522N804858P113238Q848188J1414975
13893G0221193J4907632J9409218K4478396K9606267L4448002L9054878M2570882
13886B74696468M2754671L8037766L0428007K3167413J6678938P982650m529293
13879D29216620j7567414k6669448l0773184l2791522l5372088l7061757l5416451
13872B13564756l0452830k4439008j9145230j5023979j2120257j0131261q580919
13865I3671272p386190o407792n647809m979522m426062l929012l455491k986960
13857E4452434k703139k466642k245474j949546j732694j592196j465051j374082
$$ plain form
13849 38923610 37692323 36498433 35393009 34271067 33229473 32275089 31355872 30447271
13841 30447271 29562763 28676071 27856044 27068770 26294394 25547833 24770042 24011392 23284445
13832 23284445 22656939 22071024 21506046 20957039 20400535 19780709 19238664 18700720 18190718
13823 18190718 17715457 17302786 16845268 16422916 15996251 15599488 15173339 14743531 14366657
13814 14366657 14027877 13626524 13214260 12857945 12600874 12307415 11925095 11598252 11329411
13805 11329411 11087041 10880176 10621373 10407879 10190418 9992156 9799223 9588780 9372361
13796 9372361 9194233 8964914 8814619 8630289 8437374 8243245 7992604 7768153 7567685
13787 7567685 7428002 7234385 7096791 7009772 6857136 6730262 6663138 6566861 6426469 6289246
$$ packed form
13849C8923610j231287j193890j105424j121942j041594r54384r19217r08601
13841C0447271q84508q86692q20027p87274p74376p46561p77791p58650p26947
13832B3284445o27506n85915n64978n49007n56504o19826n42045n37944n10002
13823A8190718m75261m12671m57518m22352m26665l96763m26149m29808l76874
13814A4366657l38780m01353m12264l56315k57071k93459l82320l26843k68841
13805A1329411k42370k06865k58803k13494k17461j98262j92933k10443k16419
13796I372361j78128k29319j50295j84330j92915j94129k50641k24451k00468
13787G567685j39683j93617j37594q7019j52636j26874o7124r6277j40392j37223
$$ plain form
13777 6289246 6127911 6015026 5876417 5678156 5492644 5402199 5296674 5194448 5087282 4984288
13767 4984288 4931159 4844005 4733456 4636586 4560993 4524853 4436253 4350538 4293807 4262354 4144915
13756 4144915 4017212 3924484 3828047 3801749 3783316 3761765 3710789 3708729 3641872 3506020 3468180
13745 3468180 3445527 3406663 3342467 3258316 3151171 3099810 3041243 2972828 2903772 2867968 2842277
13734 2842277 2801253 2760252 2733476 2674249 2607068 2546087 2500927 2421770 2399932 2365144 2359720
13723 2359720 2283681 2229627 2207096 2196029 2179352 2126001 2041787 1955708 1912507 1854721 1821993
13712 1821993 1802275 1810284 1791959 1773559 1727647 1707754 1691384 1685105 1670826 1643965 1587274 1534944
13700 1534944 1513836 1491579 1422171 1354792 1360511 1340106 1313598 1303576 1256622 1242662 1246211 1235489
$$ packed form
13777F289246j61335j12885j38609j98261j85512r0445j05525j02226j07166j02994
13767D984288n3129q7154j10549r6870p5593l6140q8600q5715n6731l1453j17439
13756D144915j27703r2728r6437k6298j8433k1551n0976k060o6857j35852l7840
13745C468180k2653l8864o4196q4151j07145n1361n8567o8415o9056l5804k5691
13734B842277m1024m1001k6776n9227o7181o0981m5160p9157k1838l4788n424
13723B359720p6039n4054k2531j1067j6677n3351q4214q6079m3201n7786l2728
13712A821993j9718Q009j8325j8400m5912j9893j6370o279j4279k6861n6691n2330
13700A534944k1108k2257o9408o7379N719k0405k6508j0022m6954j3960L549j0722
$$ plain form
13688 1235489 1271691 1295832 1299149 1294417 1264719 1236153 1185775 1196799 1177863 1124465 1115441 1104339
13676 1104339 1139472 1117607 1084455 1098742 1027409 971620 970001 983091 947790 961923 993408
13665 993408 991454 954851 894553 900806 952257 954013 899017 896928 932255 928469 977616 897252
13653 897252 814564 815497 819412 810651 774889 735833 713900 749324 746993 704045 685575 633703
13641 633703 634843 624205 555568 516395 557477 575962 568916 581763 563992 630952 705573 735301
13629 735301 714959 676320 635395 606318 570964 573827 619255 597968 599003 632609 572894 501385
13617 501385 503038 519955 486828 475539 427278 408293 456758 431573 425561 421573 469555 511210
13605 511210 476244 413255 385355 385586 341643 335106 363601 337211 282165 260190 251251 232317
$$ packed form
13688A235489L6202K4141L317m732k9698k8566n0378J1024j8936n3398r024j1102
13676A104339L5133k1865l3152J4287p1333n5789j619J3090l5301J4133L1485
13665I93408j954l6603o0298O253N1451J756n4996k089L5327l786M9147q0364
13653H97252q2688R33L915q761l5762l9056k1933L5424k331m2948j8470n1872
13641F33703J140j0638o8637l9173M1082J8485p046J2847j7771O6960P4621K9728
13629G35301k0342l8639m0925k9077l5354K863M5428k1287J035L3606n9715p1509
13617E01385J653J6917l3127j1289m8261j8985M8465k5185o012l988M7982M1655
13605E11210l4966o2989k7900K31m3943o537K8495k6390n5046k1975q939j8934
$$ plain form
13593 232317 242264 297388 312336 286491 251621 220318 257789 304739 294838 267854 266574 267991
13581 267991 294755 382342 363521 333674 296757 306940 334983 306012 258453 247578 194022
13570 194022 204298 188063 175651 197936 208902 224306 222443 219433 206954 190168 149690 160687
13558 160687 178121 155762 107845 94041 93686 152842 148952 102162 33100 13583 54664 76876
13546 76876 92853 125421 140783 155845 123568 101646 66577 3090 -23154 -27192 2764 23815
13534 23815 49441 141369 142618 91714 47901 55457 21114 13165 76011 120953 152563 158205
13522 158205 177447 175998 156066 105904 134427 131294 133212 159637 152148 143571 138231 136024 60076
13509 60076 48868 81411 74545 69831 31837 993 -34917 -51817 -15912 25002 47803 51443
$$ packed form
13593B32317R947N5124J4948k5845l4870l1303L7471M6950r901k6984j280J417
13581B67991K6764Q7587j8821k9847l6917J0183K8043k8971m7559j0875n3556
13570A94022J0276j6235j2412K2285J0966J5404j863l010j2479j6786m0478J0997
13558A60687J7434k2359m7917j3804l55N9156l890m6790o9062j9517M1081K2212
13546G6876J5977L2568J5362J5062l2277k1922l5069o3487k6244m038K9956K1051
13534B3815K5626R1928J249n0904m3813P556l4343p949O2846M4942L1610N642
13522A58205J9242j449j9932n0162K8523l133J918K6425p489q577n340k207p5948
13509F0076j1208L2543o866m714l7994l0844l5910j6900L5905M0914K2801L640
$$ plain form
13497 51443 62909 116079 132396 102728 105240 83010 96026 91046 81044 122945 79208 41195
13485 41195 49510 81221 72786 60609 64716 121266 179450 197789 201971 213785 207968 200869 161433
13472 161433 146214 144910 165319 157652 113696 65626 57624 64931 73667 86046 102750 69362
13460 69362 54651 9525 17555 45644 61500 116081 106881 152181 186117 164780 147100 143321
13448 143321 192707 274807 286871 238793 221687 268523 289146 280113 357422 513007 676247
13437 676247 785528 864225 966518 1137816 1404039 1702648 1940702 2087288 2191466 2278869
13427 2278869 2330996 2334258 2251846 2105506 1917653 1775663 1630811 1418176 1185685 1052030
13417 1052030 953895 846620 754728 739331 702393 626336 544925 470453 478214 456723 465019
$$ packed form
13497E1443J1466N3170J6317k9668K512k2230J3016m980j0002M1901m3737l8013
13485D1195Q315L1711q435j2177M107N6550N8184J8339M182J1814n817p099l9436
13472A61433j5219j304K0409p667m3956m8070q002P307Q736J2379J6704l3388
13460F9362j4711m5126Q030K8089J5856N4581r200M5300L3936k1337j7680l779
13448A43321M9386Q2100J2064m8078j7106M6836K0623r033P7309J55585J63240
13437F76247J09281P8697J02293J71298K66223K98609K38054J46586J04178Q7403
13427B278869N2127L262q2412j46340j87853j41990j44852k12635k32491j33655
13417A052030r8135j07275r1892j5397l6938p6057q1411p4472P761k1491Q296
$$ plain form
13406 465019 451773 486921 457146 418853 393860 329900 250563 211021 258476 302799 322095
13395 322095 275965 271844 265994 247896 227084 231578 215289 242541 267431 271561 244877 197934
13383 197934 201545 222729 201080 193575 197258 214403 205050 115930 44823 106664 144193 102948
13371 102948 116655 81648 93919 95295 106935 81426 50067 92758 122619 116004 96031 99075
13359 99075 109603 94365 83008 35157 21500 51177 64139 55874 54633 47403 30957 69332
13347 69332 55488 29018 58896 39655 45410 36920 30506 -18866 -5532 47372 75523 84485
13335 84485 99036 45450 -5422 -1064 -41904 -95095 -103376 -33004 -282 35950 107052 65078
13323 65078 -1472 5524 22872 -232 -42083 -14159 -46298 -64547 -55658 -51592 -40784 7690
$$ packed form
13406D65019j3246L5148k9775l8293k4993o3960p9337l9542M7455M4323J9296
13395C22095m6130m121n850j8098k0812M494j6289K7252K4890M130k6684m6943
13383A97934L611K1184k1649p505L683J7145r353q9120p1107O1841L7529m1245
13371A02948J3707l5007J2271J376J1640k5509l1359M2691K9861o615j9973L044
13359I9075J0528j5238j1357m7851j3657K9677J2962q265j241p230j6446L8375
13347F9332j3844k6470K9878j9241N755q490o414m9372J3334N2904K8151Q962
13335H4485J4551n3586n0872M358m0840n3191q281P0372L2722L6232P1102m1974
13323F5078o6550O996J7348k3104m1851K7924l2139j8249Q889M066J0808M8474
$$ plain form
13311 7690 1655 18886 -8645 -54705 -107797 -93858 -111633 -46433 -5276 -55811 -50424 -19239
13299 -19239 -40717 -41114 -45211 -115756 -98970 -69295 -75084 -75890 -111951 -95504 -92140 -32284 -1605
13286 -1605 -14926 29742 7072 -22670 2188 70337 70649 36562 -33735 -86495 -44988 -25634
13274 -25634 -17973 -21327 -51900 -37173 -11474 15366 6811 25390 50478 54269 35384 -3283
13262 -3283 -36038 3412 1057 -7203 -20020 53815 44355 -28652 -95928 -62907 8816 -45116
13250 -45116 -67538 -23964 -28057 13699 2176 -2199 -1871 25801 8655 -21315 -12085 29580 91764
13237 91764 76435 34102 68724 51641 -6946 -5530 45426 41173 52713 64516 40246 28728
13225 28728 44494 36026 -6347 -53340 -9347 9134 -11087 -30097 15653 42131 102315 117882
$$ packed form
13311G690o035J7231k7531m6060n3092J3939j7775O5200M1157n0535N387L1185
13299a9239k1478l97m097p0545J6786K9675n789q06l6061J6447L364N9856L0679
13286a605j3321M4668k2670k9742K4858O8149L12l4087p0297n2760M1507J9354
13274b5634P661l354l0573J4727K5699K6840q555J8579K5088L791j8885l8667
13262c283l2755L9450k355q260j2817P3835r460p3007o7276L3021P1723n3932
13250d5116k2422M3574m093M1756j1523m375L28K7672j7146k9970R230M1665O2184
13237I1764j5329m2333L4622j7083n8587J416N0956m253J1540J1803k4270j1518
13225B8728J5766q468m2373m6993M3993J8481k0221j9010M5750K6478O0184J5567
$$ plain form
13213 117882 124716 101524 -6483 14307 96072 102174 101175 46946 30719 58011 81585 75697
13201 75697 53250 85700 76923 -13319 -98279 -118244 -82158 -52292 -65987 -68041 -61281 -20201
13189 -20201 18291 17778 2911 -7767 58867 114443 116736 54141 -37217 -47806 -12431 -21447
13177 -21447 13177 63602 10705 -4521 -14 48342 78296 29206 76031 46790 17748 -4962
13165 -4962 -62440 -26351 16183 -5268 -52703 -12235 12953 -52041 -40221 -12083 -8211 -20905
13153 -20905 -43253 -33886 -32776 -14849 56701 77112 55888 -13645 -56013 -41422 -47062 -41688
13141 -41688 22142 6171 -55297 -59830 -41164 -17434 -35895 -23496 -8461 16847 14240 -38652
13129 -38652 -83453 -92275 -45739 -34580 -15569 19976 31717 29581 10161 -4047 35156 -15998
$$ packed form
13213A17882O834k3192j08007K0790Q1765O102r99n4229j6227K7292K3574n888
13201G5697k2447L2450q777r0242q4960j9965L6086K9866j3695k054O760M1080
13189b0201L8492n13j4867j0678O6634N5576K293o2595r1358j0589L5375r016
13177b1447L4624N0425n2897j5226M507M8356K9954m9090M6825k9241k9042k2710
13165d962n7478L6089M2534k1451m7435M0468K5188o4994J1820K8138L872j2694
13153b0905k2348R367J110J7927P1550K0411k1224o9533m2368J4591n640N374
13141d1688O3830j5971o1468m533J8666K3730j8461J2399J5035K5308k607n2892
13129c8652m4801q822M6536J1159J9011L5545J1741k136j9420j4208L9203n1154
$$ plain form
13117 -15998 -35478 -54141 -56614 -87672 -77039 -11867 14900 37120 43534 61529 69716 36403
13105 36403 -69784 -110009 -83710 -55672 -77228 -21476 -5802 -29740 -2536 4825 2389 31785
13093 31785 89512 56745 11656 -19771 -2863 22530 -3012 20657 76694 117367 93539 -56461
13081 -56461 -104327 -76772 -72329 -67466 -49373 -59446 21666 86583 49554 -10138 -76827 -41911
13069 -41911 815 -37989 -32315 -11354 -13285 -2168 -2005 777 -42519 -82194 -61172 -78632 -60855
13056 -60855 -55587 -56480 -70474 -105186 -68947 -25251 -39133 -27719 -34544 -11323 13425 201
13044 201 -25885 -33075 -3678 36269 -427 -26394 4808 694 -9249 -2191 -7171 -53971 4515
13031 4515 32126 17685 17207 7706 29664 31084 26671 89026 58873 -11750 -17577 34181 122410
$$ packed form
13117a5998j9480j8663k473l1058J0633O5172K6767K2220O414J7995Q187l3313
13105C6403j06187m0225K6299K8038k1556N5752J5674k3938K7204P361k436K9396
13093C1785N7727l2767m5089l1427J6908K5393k5542K3669N6037M0673k3828j50000
13081e6461m7866K7555M443M863J8093j0073Q1112O4917l7029n9692o6689L4916
13069d1911M2726l8804N674K0961j931J1117J63K782m3296l9675K1022j7460J7777
13056f0855N268q93j3994l4712L6239M3696j3882J1414o825K3221K4748j3224
13044B01k6086p190K9397L9947l6696k5967L1202m114r943P058m980m6800N8486
13031D515K7611j4441m78r501K1958J420m413O2355l0153p0623n827N1758Q8229
$$ plain form
13018 122410 88024 12094 22153 34127 35262 64505 63598 80322 140522 94549 -2206 16561
13006 16561 -29223 -93360 -57069 -12110 3095 37749 91948 99622 123207 101817 93859 66554
12994 66554 44675 123542 104144 82578 74682 101091 103963 107964 147705 76086 24700 82939
12982 82939 111090 115901 60759 66631 102720 133747 114085 37291 33138 48755 32107 35039
12970 35039 81409 85065 68630 99832 79982 52437 89629 38418 47573 22766 72057 157570
12958 157570 183455 169288 112655 66346 62650 59794 50100 94870 75953 88490 67218 19501
12946 19501 -13940 8097 81729 88045 69173 34531 19568 5468 17074 -21665 -827 38325
12934 38325 53858 120376 105071 57480 46333 9592 -19521 -45289 -31654 -48702 -55055 -29492
$$ packed form
13018A22410l4386p5930J0059J1974J135K9243r07J6724O0200m5973r6755J8767
13006A6561m5784o4137L6291M4959J5205L4654N4199P674K3585k1390p958k7305
12994F6554k1879P8867j9398k1566p896K6409K872M001L9741p1619n1386N8239
12982H2939K8151M811n5142N872L6089L1027j9662p6794m153J5617j6648K932
12970C5039M6370L656j6435L1202j9850k7545L7192n1211R155k4807M9291Q5513
12958A57570K5885j4167n6633m6309l696k856r694M4770j8917J2537k1272m7717
12946A9501l3441K2037P3632O316j8872l4642j4963j4100J1606l8739K0838L9152
12934C8325J5533O6518j5305m7591j1147l6741k9113k5768J3635j7048o353K5563
$$ plain form
12922 -29492 -20884 -10689 -13362 14326 36766 88550 121739 104938 101894 75121 76155 66110
12910 66110 61531 48524 43576 -12777 -18351 -37539 -49508 11596 79427 56119 -8424 -17502
12898 -17502 11642 5485 13435 61044 74673 52786 43656 26514 -18721 -53 79519 58879
12886 58879 53034 27086 4377 21889 53215 102447 118768 110253 96508 97190 121051 101951
12874 101951 146898 211890 206469 211623 179701 114204 108739 147994 151700 106171 95857 86300
12862 86300 57766 54907 103794 157897 199277 205264 175842 198893 160789 101672 80559 14853
12850 14853 63237 74984 77285 111685 143341 146358 153693 142764 175395 161834 146626 124539
12838 124539 113913 161288 200743 222318 245297 202560 226282 211652 164459 131517 96711
$$ packed form
12922b9492Q608J0195k673K7688K2440N1784L3189j6801l044k6773J034j0045
12910F6110m579j3007m948n6353n574j9188j1969O1104O7831k3308o4543r078
12898a7502K9144o157P950M7609J3629k1887r130j7142m5235J8668P9572k0640
12886E8879n845k5948k2709J7512L1326M9232J6321q515j3745O82K3861j9100
12874A01951M4947O4992n421N154l1922o5497n465L9255L706m5529j0314r557
12862H6300k8534k859M8887N4103M1380N987k9422K3051l8104n9117k1113o5706
12850A4853M8384J1747K301L4400L1656L017P335j0929L2631j3561j5208k2087
12838A24539j0626M7375L9455K1575K2979m2737K3722j4630m7193l2942l4806
$$ plain form
12827 96711 110362 79044 88118 75844 65388 104490 107323 137940 159309 143959 148842 126706
12815 126706 116025 76195 52676 102766 150971 234809 265945 303207 289528 286153 298969 221869
12803 221869 243131 294233 256932 229289 218175 228086 251502 191562 181554 138772 142203 151370
12791 151370 112400 165258 220317 269681 310962 327701 313545 293330 338617 353386 370942
12780 370942 363904 345757 296892 294728 291244 259760 242351 182401 180105 172341 166342 130385 119336
12767 119336 139939 185876 156467 183118 192349 212250 298488 333639 318284 271277 247021 287610
12755 287610 298849 308755 335817 376992 365315 284966 238236 253660 241042 250765 208128 171676
12743 171676 237970 245295 266959 252026 293013 330970 351409 398064 396741 429067 503502 503168
$$ packed form
12827I6711J3651l1318R074j2274j0456L9102K833L0617K1369j5350M883k2136
12815A26706j0681l9830k3519N0090M8205Q3838L1136L7262j3679l375J2816p7100
12803B21869K1262N1102l7301k7643j1114R911K3416n9940j0008m2782L431R167
12791A51370l8970N2858N5059M9364M1281J6739j4156k0215M5287J4769J7556
12780C70942p038j8147m8865k164l484l1484j7409n9950k296p764n999l5957j1049
12767A19336K0603M5937k9409K6651R231J9901Q6238L5151j5355m7007k4256M0589
12755B87610J1239R906K7062M1175j1677q0349m6730J5424j2618R723m2637l6452
12743A71676O6294P325K1664j4933M0987L7957K0439M6655j323L2326P4435l34
$$ plain form
12731 503168 453002 424276 407679 403761 456541 475964 413917 402126 396813 369700 302144 291817
12719 291817 338746 369375 357316 280709 215648 245109 312396 352886 402587 445641 403592
12708 403592 388405 365259 422280 474400 456940 457227 525984 489045 454379 387497 342942 341419
12696 341419 294949 296997 344800 358624 434064 378006 271957 247685 316500 329316 301563
12685 301563 297549 305467 309226 305551 288844 293379 305414 264271 271628 284784 306967 308024 331267
12672 331267 382049 467601 590234 681177 697869 640547 570401 503168 569503 583779 496227
12661 496227 403159 370624 356022 335063 335682 315276 334089 304960 310634 344136 303146 265221
12649 265221 258333 313331 326879 346726 400432 339871 310235 330135 323324 367151 436284 476491
$$ packed form
12731E03168n0166k8726j6597l918N2780J9423o2047j1791n313k7113o7556j0327
12719B91817M6929L0629j2059p6607o5061K9461O7287M0490M9701M3054m2049
12708D03592j5187k3146N7021N2120j7460K87O8757l6939l4666o6882m4555j523
12696C41419m6470K048M7803J3824P5440n6058j06049k4272O8815J2816k7753
12685C01563m014P918L759l675j6707M535J2035m1143P357J3156K2183J057K3243
12672C31267N0782Q5552J22633R0943J6692n7322p0146o7233O6335J4276q7552
12661D96227r3068l2535j4602k0959O19k0406J8813k9129N674L3502m0990l7925
12649B65221o888N4998J3548J9847N3706o0561k9636J9900o811M3827O9133M0207
$$ plain form
12637 476491 482868 482367 472875 492441 570199 619052 593822 599053 653940 673352 684471 715011
12625 715011 778510 792362 825996 811822 893961 1029265 1073250 1108612 1097026 1099253 1115371
12614 1115371 1161846 1247196 1251469 1174350 1136886 1140125 1117921 1141923 1091723 1055452 1048746 1077476
12602 1077476 1076938 1095419 1190387 1200760 1206707 1234515 1240630 1252535 1226376 1248253 1365664 1484489
12590 1484489 1590280 1635559 1582862 1590904 1600845 1671451 1722033 1723184 1776382 1774542 1784038 1775455
12578 1775455 1803276 1795395 1769296 1719749 1698324 1722946 1727319 1692652 1699038 1741500 1800936 1893522
12566 1893522 1984827 2141870 2250862 2319000 2403384 2457455 2482618 2521805 2502533 2569545 2660530
12555 2660530 2733699 2754022 2814116 2725002 2531286 2379055 2247108 2212616 2191082 2040613
$$ packed form
12637D76491O377n01r492J9566P7758M8853k5230N231N4887J9412J1119L0540
12625G15011O3499J3852L3634j4174Q2139J35304M3985L5362j1586K227J6118
12614A115371M6475Q5350M273p7119l7464L239k2204K4002n0200l6271o706K8730
12602A077476n38J8481R4968J0373N947K7808O115J1905k6159K1877J17411J18825
12590A484489J05791M5279n2697Q042R941P0606N0582J151N3198j840R496q583
12578A775455K7821p881k6099m9547k1425K4622M373l4667O386M2462N9436R2586
12566A893522R1305J57043J08992O8138Q4384N4071K5163L9187j9272O7012R0985
12555B660530P3169K0323O0094q9114j93716j52231j31947l4492k1534j50469
$$ plain form
12545 2040613 1814367 1713414 1665049 1637556 1669842 1687395 1713967 1748392 1819922 1805082 1750868
12534 1750868 1652146 1600465 1628945 1663268 1665299 1679372 1693017 1730136 1803192 1804256 1770660 1770155
12522 1770155 1822207 1934634 2032011 2108041 2242912 2429056 2724241 3073742 3382404 3596237
12512 3596237 3898335 4279428 4451539 4064603 3530637 3153151 2938752 2733338 2562828
12503 2562828 2418972 2277127 2183446 2096423 2087648 2086393 2055122 1996026 1991628 1935368 1846401
12492 1846401 1753566 1750909 1833884 1827913 1744457 1713327 1701996 1669114 1629352 1598821 1508647 1423699
12480 1423699 1336083 1379450 1451204 1542434 1669598 1727577 1785389 1876791 1932618 1899431 1929607
12469 1929607 1997947 2003733 1841485 1567464 1328389 1238268 1184593 1111079 1073377 1041619 1027828
$$ packed form
12545B040613k26246j00953m8365k7493L2286J7553K6572L4425P1530j4840n4214
12534A750868r8722n1681K8480L4323K031J4073J3645L7119P3056J064l3596n05
12522A770155N2052J12427R7377P6030J34871J86144K95185L49501L08662K13833
12512C596237L02098L81093J72111l86936n33966l77486k14399k05414j70510
12503B562828j43856j41845r3681q7023q775j255l1271n9096m398n6260q8967
12492A846401r2835k657Q2975n971q3456l1130j1331l2882l9762l0531r0174q4948
12480A423699q7616M3367P1754R1230J27164N7979N7812R1402N5827l3187L0176
12469A929607O8340N786j62248k74021k39075r0121n3675p3514l7702l1758j3791
$$ plain form
12458 1027828 998991 954847 925870 920829 957820 925255 895691 883048 862616 896566 952260
12447 952260 966103 911842 909420 1015195 1124774 1112689 1059095 1031382 956502 917125 970105
12436 970105 1017897 1001755 1035754 1146940 1304682 1440414 1625541 1826397 2008237 2172436
12426 2172436 2235780 2118442 1974067 1848387 1703966 1562375 1569617 1632273 1600883 1588351
12416 1588351 1611813 1665638 1680244 1696608 1747440 1824626 1845704 1942260 1977334 2057694 2164457
12405 2164457 2198874 2150517 2155968 2172157 2184647 2213780 2214735 2303801 2490782 2722646 2996415
12394 2996415 3297420 3593166 3897264 4155410 4347393 4411373 4286125 3961209 3546682 3165548
12384 3165548 2941098 2803729 2712336 2600550 2502275 2497579 2466005 2457611 2445398 2435183 2418751
$$ packed form
12458A027828k8837m4144k8977n041L6991l2565k9564j2643k0432L3950N5694
12447I52260J3843n4261k422J05775J09579j2085n3594k7713p4880l9377N2980
12436I70105M7792j6142L3999J11186J57742J35732J85127K00856J81840J64199
12426B172436O3344j17338j44375j25680j44421j41591P242O2656l1390j2532
12416A588351K3462N3825J4606J6364N0832P7186K1078R6556L5074Q0360J06763
12405B164457L4417m8357N451J6189J2490K9133R55Q9066J86981K31864K73769
12394B996415L01005K95746L04098K58146J91983O3980j25248l24916m14527l81134
12384C165548k24450j37369r1393j11786r8275m696l1574q394j2213j0215j6432
$$ plain form
12373 2418751 2382501 2294991 2195154 2135520 2062893 2036206 2055555 2028470 1994992 1956246 1918931
12362 1918931 1889749 1898180 1910768 1959907 2065225 2211376 2385421 2570410 2714763 2836149
12352 2836149 2798432 2645083 2370498 2105699 1930607 1825946 1719572 1645717 1610352 1586534
12342 1586534 1524222 1521599 1475626 1458008 1452091 1500058 1502383 1475424 1530849 1536569 1489552 1431619
12330 1431619 1443659 1448600 1424453 1376417 1423977 1485808 1506569 1487984 1533009 1521085 1489507
12319 1489507 1511825 1549000 1581206 1600500 1662538 1718712 1754589 1759360 1791689 1781854 1801921 1827502
12307 1827502 1884422 1883208 1809206 1788356 1832103 1841082 1783848 1768892 1800024 1901438 1957680
12296 1957680 2019589 1968610 1944364 2034769 2083632 2125950 2199234 2226796 2251362 2327677 2423050
$$ packed form
12373B418751l6250q7510r9837n9634p2627k6687J9349k7085l3478l8746l7315
12362A918931k9182Q431J2588M9139J05318J46151J74045J84989J44353J21386
12352B836149l7717j53349k74585k64799j75092j04661j06374p3855l5365k3818
12342A586534o2312k623m5973j7618n917M7967K325k6959N5425N720m7017n7933
12330A431619J2040M941k4147m8036M7560O1831K0761j8585M5025j1924l1578
12319A489507K2318L7175L2206J9294O2038N6174L5877M771L2329r835K0067K5581
12307A827502N6920j214p4002k0850M3747Q979n7234j4956L1132J01414N6242
12296A957680O1909n0979k4246R0405M8863M2318P3284K7562K4566P6315R5373
$$ plain form
12285 2423050 2486012 2527385 2628893 2780528 2918493 3064661 3216350 3329174 3482909 3566407
12275 3566407 3678125 3737219 3767039 3815528 3800644 3760760 3732072 3734385 3735311 3745653 3775444 3776513
12263 3776513 3749840 3741853 3768548 3850448 3849294 3875690 3960932 4056820 4154886 4296208 4422457
12252 4422457 4547103 4672160 4878980 5093367 5317766 5527697 5710307 5873065 6024708
12243 6024708 6230358 6395872 6528632 6711846 6933620 7138290 7309429 7453768 7566640
12234 7566640 7717507 7866110 8005767 8168134 8418870 8780309 9124751 9509769 9953473
12225 9953473 10413147 10889800 11423935 12111643 12868171 13702146 14591479 15515899 16491928
12216 16491928 17567850 18777813 20089179 21440453 22923492 24610619 26441636 28366951
$$ packed form
12285B423050O2962M1373J01508J51635J37965J46168J51689J12824J53735Q3498
12275C566407J11718N9094K9820M8489j4884l9884k8688K313R26J0342K9791J069
12263C776513k6673p987K6695Q1900j154K6396Q5242R5888R8066J41322J26249
12252D422457J24646J25057K06820K14387K24399K09931J82610J62758J51643
12243F024708K05650J65514J32760J83214K21774K04670J71139J44339J12872
12234G566640J50867J48603J39657J62367K50736L61439L44442L85018M43704
12225I953473M59674M76653N34135O87708P56528Q33975Q89333R24420R76029
12216A6491928J075922J209963J311366J351274J483039J687127J831017J925315
$$ plain form
12208 28366951 30317526 32312339 34452217 36793218 39275818 42085553 45379628 49236898
12200 49236898 53784598 59171431 65683868 73367771 82468801 92841418 104319453 116275844
12192 116275844 127808220 137882512 145941189 151948898 156121391 158582336 159461012 159014074
12184 159014074 157815426 156469622 155510525 155128366 155531993 156718428 158698794 161406433
12176 161406433 164908733 169287528 174262320 179552774 184919758 190171197 195275648 200418119
12168 200418119 205483964 210549353 215629672 220967710 226834496 233288222 240551950 248956337
12160 248956337 258342090 268159270 277718978 286434972 293464755 297573181 298184318 296026516
12152 296026516 292232022 287596678 282571712 277404301 272036302 266328457 260263125 254172614
$$ packed form
12208B8366951J950575J994813K139878K341001K482600K809735L294075L857270
12200D9236898M547700N386833O512437P683903R101030J0372617J1478035J1956391
12192A16275844J1532376J0074292Q058677O007709M172493K460945Q78676m46938
12184A59014074j198648j345804r59097l82159M03627J186435J980366K707639
12176A61406433L502300M378795M974792N290454N366984N251439N104451N142471
12168B00418119N065845N065389N080319N338038N866786O453726P263728Q404387
12160B48956337R385753R817180R559708Q715994P029783M108426O11137k157802
12152B96026516l794494m635344n024966n167411n367999n707845o065332o090511
$$ plain form
12144 254172614 248308910 242929653 237952220 233387544 229455490 226331897 224079593 222545197
12136 222545197 221250974 219882580 218337301 216356064 213707473 210364463 206402705 201997502
12128 201997502 197518205 193174911 188793726 184120030 178970024 173337969 167463240 161452161
12120 161452161 155006507 147701675 139613449 131430150 123815434 117208329 111540855 106622304
12112 106622304 102135867 97979496 93973575 90180616 86589002 83196087 79856955 76571553
12104 76571553 73404055 70386758 67500272 64822625 62419412 60216916 58173740 56339692
12096 56339692 54632440 53081716 51740304 50413773 49242485 48102058 46949991 45950082
12088 45950082 44953720 43952217 42939669 41864673 40876887 39846683 38788747 37799423
$$ packed form
12144B54172614n863704n379257m977433m564676l932054l123593k252304j534396
12136B22545197j294223j368394j545279j981237k648591l343010l961758m405203
12128B01997502m479297m343294m381185m673696n150006n632055n874729o011079
12120A61452161o445654p304832q088226q183299p614716o607105n667474m918551
12112A06622304m486437m156371m005921l792959l591614l392915l339132l285402
12104G6571553l167498l017297k886486k677647k403213k202496k043176j834048
12096E6339692j707252j550724j341412j326531j171288j140427j152067r99909
12088D5950082r96362j001503j012548j074996r87786j030204j057936r89324
$$ plain form
12080 37799423 36835819 35880654 34961829 34010266 33064811 32210063 31406765 30594542 29761247
12071 29761247 29050227 28384615 27686770 26978241 26352264 25789906 25219409 24681742 24125567
12062 24125567 23715268 23348583 22993456 22606249 22169520 21730031 21369011 20997992 20573715
12053 20573715 20141580 19679297 19171473 18684209 18185899 17722612 17243774 16710411 16200096
12044 16200096 15766240 15356409 14950062 14572376 14163596 13745888 13394224 13051328 12749550
12035 12749550 12427158 12078114 11721349 11471112 11269675 11022704 10699957 10464563 10251294
12026 10251294 10086348 9915754 9727255 9468653 9241526 9047742 8874139 8680027 8514855
12017 8514855 8336060 8147294 8023447 7921170 7807328 7653158 7505431 7387669 7220573
$$ packed form
12080C7799423r63604r55165r18825r51563r45455q54748q03298q12223q33295
12071B9761247p11020o65612o97845p08529o25977n62358n70497n37667n56175
12062B4125567m10299l66685l55127l87207m36729m39489l61020l71019m24277
12053B0573715m32135m62283n07824m87264m98310m63287m78838n33363n10315
12044A6200096m33856m09831m06347l77686m08780m17708l51664l42896l01778
12035A2749550l22392l49044l56765k50237k01437k46971l22747k35394k13269
12026A0251294j64946j70594j88499k58602k27127j93784j73603j94112j65172
12017H514855j78795j88766j23847j02277j13842j54170j47727j17762j67096
$$ plain form
12008 7220573 7087225 6946084 6829812 6703563 6579495 6445718 6361425 6272163 6189776 6125653
11998 6125653 6081324 5996693 5921638 5852637 5816669 5751060 5651820 5580061 5487038 5448112 5386641
11987 5386641 5281669 5199046 5114363 5061430 5001452 4928646 4890032 4808494 4744261 4671557 4616003
11976 4616003 4551520 4534290 4488110 4415508 4416568 4440470 4463874 4494795 4472979 4410725 4384332
11965 4384332 4402547 4395835 4375387 4374831 4378931 4401189 4364577 4303362 4224677 4145526 4110614 4086344
11953 4086344 4011651 3925272 3838598 3757497 3657296 3657369 3654556 3611797 3615053 3630774 3622164 3671690
11941 3671690 3671444 3690806 3664469 3649032 3626449 3584679 3550823 3557527 3619362 3604203 3653333 3619517
11929 3619517 3582266 3530998 3506888 3512284 3554486 3592748 3547218 3426271 3343425 3291925 3182037
$$ packed form
12008G220573j33348j41141j16272j26249j24068j33777q4293q9262q2387o4123
11998F125653m4329q4631p5055o9001l5968o5609r9240p1759r3023l8926o1471
11987E386641j04972q2623q4683n2933n9978p2806l8614q1538o4233p2704n5554
11976D616003o4483j7230m6180p2602J060K3902K3404L0921k1816o2254k6393
11965D384332J8215o712k0448n56M100K2258l6612o1215p8685p9151l4912k4270
11953D086344p4693q6379q6674q1101j00201P3k813m2759L256J5721q610M9526
11941C671690k46J9362k6337j5437k2583m1770l3856O704O1835j5159M9130l3816
11929C619517l7251n1268k4110N396M2202L8262m5530j20947q2846n1500j09888
$$ plain form
11918 3182037 3120174 3077442 3037981 2986350 2906086 2850521 2772723 2711240 2692276 2700666 2668620
11907 2668620 2644993 2580759 2588344 2606562 2591413 2628596 2642500 2597971 2592971 2572435 2521844 2573157
11895 2573157 2551230 2500514 2467088 2382320 2283657 2185603 2169616 2163743 2103013 2082378 2143601
11884 2143601 2216381 2186179 2182021 2278085 2323443 2409493 2413695 2390474 2346936 2329362 2256730 2227449
11872 2227449 2164108 2058245 1975845 1923326 1871020 1799712 1759262 1805221 1843363 1820714 1795546
11861 1795546 1773402 1731832 1726580 1800968 1813771 1779582 1773770 1798052 1843410 1878361 1885133 1932647
11849 1932647 1910044 1929410 1954431 1997818 1973075 1944555 1913506 1910816 1941951 1989308 1982762 1948339
11837 1948339 1942528 1939719 1920166 1903195 1814896 1703102 1710555 1706527 1712725 1673237 1611800 1529830
$$ packed form
11918C182037o1863m2732l9461n1631q0264n5565p7798o1483j8964Q390l2046
11907B668620k3627o4234P585J8218j5149L7183J3904m4529n000k0536n0591N1313
11895B573157k1927n0716l3426q4768r8663r8054j5987n873o0730k0635O1223
11884B143601P2780l0202m158R6064M5358Q6050M202k3221m3538j7574p2632k9281
11872B227449o3341j05863q2400n2519n2306p1308m0450M5959L8142k2649k5168
11861A795546k2144m1570n252P4388J2803l4189n812K4282M5358L4951O772M7514
11849A932647k2603J9366K5021M3387k4743k8520l1049k690L1135M7357o546l4423
11837A948339n811k809j9553j6971q8299j11794P453m028O198l9488o1437q1970
$$ plain form
11825 1529830 1498348 1481929 1480760 1494075 1443200 1429020 1428577 1397631 1372921 1400954 1424943 1438322
11813 1438322 1461442 1493218 1476765 1484823 1447725 1477338 1480968 1408360 1329982 1219967 1189055
11802 1189055 1136814 1107983 1095507 1089094 1040898 973088 938478 906485 952005 900802 812698
11791 812698 826165 837777 772251 714590 705391 695205 707707 689215 678528 685312 686617 662595
11779 662595 634381 568935 627366 696756 714815 676237 601485 589442 658237 715974 724238 771489
11767 771489 765580 732345 742970 776185 746325 718056 813258 879070 886902 931661 951234 966942
11755 966942 976802 972393 1068942 1050877 1053291 1092737 1139176 1111843 1110654 1162699 1196677 1231947
11743 1231947 1236199 1202449 1177890 1242063 1351706 1394479 1436586 1421627 1383754 1420362 1489166
$$ packed form
11825A529830l1482j6419j169J3315n0875j4180m43l0946k4710K8033K3989J3379
11813A438322K3120L1776j6453Q058l7098K9613L630p2608p8378j10015l0912
11802A189055n2241k8831j2476o413m8196o7810l4610l1993M5520n1203q8104
11791H12698J3467J1612o5526n7661r199j0186J2502j8492j0687O784J305k4022
11779F62595k8214o5446N8431O9390J8059l8578p4752j2043O8795N7737Q264M7251
11767G71489n909l3235J0625L3215k9860k8269R5202O5812P832M4759J9573J5708
11755I66942R860m409R6549j8065K414L9446M6439k7333j189N2045L3978L5270
11743A231947M252l3750k4559O4173J09643M2773M2107j4959l7873L6608O8804
$$ plain form
11732 1489166 1596925 1662551 1650136 1655486 1631139 1682667 1756863 1760451 1781022 1776405 1758084 1755577
11720 1755577 1756772 1704174 1699049 1731566 1761754 1757044 1698720 1647697 1648211 1617012 1533116 1519968
11708 1519968 1464324 1420038 1426440 1453739 1466321 1404317 1331739 1327752 1355135 1345786 1306386 1312241
11696 1312241 1283875 1257969 1252157 1228218 1253241 1296504 1237531 1191587 1200393 1163378 1097858 1069603
11684 1069603 1006341 916983 845915 838612 830210 750521 675304 617492 631344 634872 578601 575613
11672 575613 579726 576811 530927 522299 554576 570727 520751 471552 435799 420706 469946 491720
11660 491720 460475 445132 456387 453274 456320 442651 417226 392228 372798 324793 362886 379506
11648 379506 318826 297409 379453 430543 395184 328298 294836 290242 273498 277197 299020 310431
$$ packed form
11732A489166J07759O5626j2415N350k4347N1528P4196L588K0571m617j8321k507
11720A755577J195n2598n125L2517L0188m710n8324n1023N14l1199q3896j3148
11708A519968n5644m4286O402K7299J2582o2004p2578l987K7383r349l9400N855
11696A312241k8366k5906n812k3939K5023M3263n8973m5944Q806l7015o5520k8255
11684A069603o3262q9358p1068p303q402p9689p5217n7812J3852L528n6271k988
11672E75613M113k915m5884q628L2277J6151m9976m9199l5753j5093M9240K1774
11660D91720l1245j5343J1255l113L046j3669k5425k4998j9430m8005L8093J6620
11648C79506o0680k1417Q2044N1090l5359o6886l3462m594j6744L699K1823J1411
$$ plain form
11636 310431 249910 248518 196856 199207 210705 165942 152485 247008 275786 259640 300734 286337
11624 286337 295850 250133 231676 234177 243009 225830 185730 135630 117552 145343 180306 233445
11612 233445 228766 220971 283089 241757 211406 176166 150881 145573 139247 194708 228541 172450
11600 172450 130375 81934 31376 21752 72179 177762 278006 303227 257721 191548 202476
11589 202476 184862 196908 216104 185139 144861 139581 160099 173104 144889 152255 117567 135351
11577 135351 187812 196522 183760 150740 166607 230568 235119 242551 253250 228914 206057 152089
11565 152089 111091 79954 144007 186534 195586 123942 89219 107576 128282 118249 74421 34712
11553 34712 41802 83102 51675 35539 38287 63266 81523 135519 92889 65247 136040 139606
$$ packed form
11636C10431o0521j392n1662K351J1498m4763j3457R4523K8778j6146M1094j4397
11624B86337R513m5717j8457K501Q832j7179m0100n0100j8078K7791L4963N3139
11612B33445m679p795O2118m1332l0351l5240k5285n308o326N5461L3833n6091
11600A72450m2075m8441n0558r624N0427J05583J00244K5221m5506o6173J0928
11589B02476j7614J2046J9196l0965m0278n280K0518J3005k8215P366l4688J7784
11577A35351N2461Q710j2762l3020J5867O3961M551P432J0699k4336k2857n3968
11565A52089m0998l1137O4053M2527R052p1644l4723J8357K0706j0033m3828l9709
11553C4712P090M1300l1427j6136K748K4979J8257N3996m2630k7642P0793L566
$$ plain form
11541 139606 105088 80002 135885 139811 162646 207301 205731 240530 220550 172619 155652 195426
11529 195426 203919 195667 147270 132683 130675 145799 139719 139314 126081 149202 128831 75347 109217
11516 109217 214076 213534 168459 149899 151983 150400 134059 113452 74238 95860 128569 149459
11504 149459 198685 222436 187323 160754 117767 110095 144292 140312 105884 60761 49860 69652
11492 69652 115367 98696 83772 129555 174383 179331 104269 94342 141941 126951 102761 110732
11480 110732 146765 96132 85014 85574 49594 36372 97487 159506 168565 174693 161913 111980
11468 111980 130252 138439 134665 154939 123714 115014 124245 142320 176120 151105 127923 145136
11456 145136 159264 169385 158821 197120 203996 225599 244253 226177 128729 127038 212664 223917
$$ packed form
11541A39606l4518k5086N5883L926K2835M4655j570L4799j9980m7931j6967L9774
11529A95426Q493q252m8397j4587k008J5124o080m05j3233K3121k0371n3484L3870
11516A09217J04859n42m5075j8560K084j583j6341k0607l9214K1622L2709K0890
11504A49459M9226K3751l5113k6569m2987p672L4197l980l4428m5123j0901J9792
11492F9652M5715j6671j4924M5783M4828M948p5062r927M7599j4990k4190P971
11480A10732L6033n0633j1118N60l5980j3222O1115O2019R059O128j2780m9933
11468A11980J8272Q187l774K0274l1225q700R231J8075L3800k5015k3182J7213
11456A45136J4128J0121j0564L8299O876K1603J8654j8076r7448j691Q5626J1253
$$ plain form
11444 223917 203144 203456 169776 185606 254709 236782 212344 220985 178114 160889 185561 160056
11432 160056 168066 188270 235274 221668 197466 205131 175300 151360 141409 149373 225573 296862
11420 296862 267059 217336 195143 204411 264447 280794 255832 274225 278588 235633 186929 207822
11408 207822 227774 280108 315328 297400 230995 234854 227280 264982 283656 370845 335095 286321
11396 286321 239013 228544 233051 250945 208040 220375 272140 312348 347941 311795 271692 320885
11384 320885 303933 284020 369307 406712 390029 346395 330622 279207 295397 309722 298249
11373 298249 332726 297558 331219 354894 346734 361339 385626 388624 336554 332180 367737 351479
11361 351479 385901 427299 439695 488107 457017 401059 344563 328980 341170 397067 411281
$$ packed form
11444B23917k0773L12l3680J5830O9103j7927k4438Q641m2871j7225K4672k5505
11432A60056Q010K0204M7004j3606k4202P665k9831k3940r951P964P6200P1289
11420B96862k9803m9723k2193R268O0036J6347k4962J8393M363m2955m8704K0893
11408B07822J9952N2334L5220j7928o6405L859p574L7702J8674Q7189l5750m8774
11396B86321m7308j0469M507J7894m2905J2335N1765M0208L5593l6146m0103M9193
11384C20885j6952j9913Q5287L7405j6683m3634j5773n1415J6190J4325j1473
11373B98249L4477l5168L3661K3675q160J4605K4287K998n2070m374L5557j6258
11361C51479L4422M1398J2396M8412l1090n5958n6496j5583J2190N5897J4214
$$ plain form
11350 411281 416758 394641 390868 351261 338586 335649 310718 338922 388839 397317 384690 423561
11338 423561 443885 441594 452224 463063 463208 456938 454328 437496 417594 404668 423291 426622 407596
11325 407596 430695 464343 525368 490951 430651 433898 495205 532757 567963 574232 556545 534025
11313 534025 533741 532648 552499 552315 554446 542893 591972 671737 664985 677700 668029 687905 657087
11300 657087 664509 652685 622068 585944 541297 531784 596552 663474 652804 668728 640932 648160
11288 648160 668383 628585 604721 643371 685036 662346 669780 649305 632550 700289 792735 798710
11276 798710 754231 762587 766231 792642 785127 830377 806146 801954 811022 817409 802119 862831 900641
11263 900641 856750 826021 811804 764023 752812 737506 756028 803350 858782 873701 905312
$$ packed form
11350D11281N477k2117l773l9607j2675k937k4931K8204M9917Q478j2627L8871
11338D23561K0324k291J0630J0839J45o270k610j6832j9902j2926J8623L331j9026
11325D07596K3099L3648O1025l4417o0300L247O1307L7552L5206O269j7687k2520
11313E34025k84j093J9851j84K131j1553M9079P9765o752J2715r671J9876l0818
11300F57087P422j1824l0617l6124m4647r513O4768O6922j0670J5924k7796P228
11288F48160K0223l9798k3864L8650M1665k2690P434k0475j6755O7739R2446N975
11276G98710m4479Q356L644K6411p515M5250k4231m192R068O387j5290O0712L7810
11263I00641m3891l0729j4217m7781j1211j5306J8522M7322N5432J4919L1611
$$ plain form
11252 905312 912465 902552 862398 846011 902063 958795 976487 962561 947910 976522 1039797 1085296
11240 1085296 1050385 1048880 1045080 1057231 1051771 1004304 1050248 1100327 1162052 1164413 1190253 1205846
11228 1205846 1209666 1229752 1217734 1265116 1332730 1393465 1374603 1349880 1307793 1312615 1362226 1371972
11216 1371972 1394921 1427839 1407073 1426122 1448277 1432136 1494207 1601243 1618214 1621492 1633840
11205 1633840 1636410 1692726 1671792 1702950 1711315 1760750 1787888 1833494 1869079 1917985 1967987 1967829
11193 1967829 2026588 2052166 2071469 2097928 2104200 2154537 2224374 2271720 2266479 2226131 2248564 2328384
11181 2328384 2395294 2483764 2572085 2572234 2620442 2609691 2602766 2589981 2623517 2667109 2779401 2830006
11169 2830006 2911397 2990555 3064395 3091965 3084973 3160703 3262566 3313085 3424040 3554755 3559337
$$ packed form
11252I05312P153r913m0154j6387N6052N6732J7692j3926j4651K8612O3275M5499
11240A085296l4911j505l800J2151n460m7467M5944N0079O1725K361K5840J5593
11228A205846L820K0086j2018M7382O7614O0735j8862k4723m2087M822M9611R746
11216A371972K2949L2918k0766J9049K2155j6141O2071J07036J6971L278J2348
11205A633840K570N6316k0934L1158Q365M9435K7138M5606L5585M8906N0002j58
11193A967829N8759K5578J9303K6459O272N0337O9837M7346n241m0348K2433P9820
11181B328384O6910Q8470Q8321J49M8208j0751o925j2785L3536M3592J12292N0605
11169B830006Q1391P9158P3840K7570o992P5730J01863N0519J10955J30715M582
$$ plain form
11158 3559337 3605993 3697025 3746453 3800482 3937615 4031808 4100038 4184142 4236650 4254136 4306716
11147 4306716 4428483 4555840 4684100 4786833 4872738 4961475 5061215 5126362 5187350 5312178
11137 5312178 5429076 5551188 5709802 5854232 5961735 6096624 6238841 6397615 6600830
11128 6600830 6760289 6978211 7206341 7413079 7602908 7777026 7966324 8150850 8366438
11119 8366438 8662500 8900674 9143737 9441600 9753818 10108573 10406665 10738638 11021799
11110 11021799 11305990 11654116 12053221 12502116 12894554 13289985 13744690 14172991 14715692
11101 14715692 15260940 15863400 16432368 17014168 17656050 18297278 18963361 19727914 20514579
11092 20514579 21252498 22075339 22952015 23836077 24727841 25668469 26696502 27735549 28789666
$$ packed form
11158C559337M6656R1032M9428N4029J37133R4193O8230Q4104N2508J7486N2580
11147D306716J21767J27357J28260J02733Q5905Q8737R9740O5147O0988J24828
11137E312178J16898J22112J58614J44430J07503J34889J42217J58774K03215
11128F600830J59459K17922K28130K06738J89829J74118J89298J84526K15588
11119H366438K96062K38174K43063K97863L12218L54755K98092L31973K83161
11110A1021799K84191L48126L99105M48895L92438L95431M54705M28301N42701
11101A4715692N45248O02460N68968N81800O41882O41228O66083P64553P86665
11092B0514579P37919Q22841Q76676Q84062Q91764R40628J028033J039047J054117
$$ plain form
11083 28789666 29863604 30969753 32190383 33440543 34692263 35965585 37342697 38709982
11075 38709982 39992216 41269705 42593391 43918768 45288352 46597547 47846717 48979329
11067 48979329 50023830 51034687 51976951 52815198 53615221 54263452 54705305 55055036 55311327
11058 55311327 55397098 55337138 55158876 54910952 54590074 54141316 53513649 52753340 51955919 51150825
11048 51150825 50291224 49325143 48316196 47267385 46233222 45176199 44114258 43066793
11040 43066793 42006568 40922443 39874566 38868052 37873353 36899273 35936983 34980090 34034023
11031 34034023 33156023 32338272 31484143 30626632 29817848 29004286 28224598 27485276 26805254
11022 26805254 26144765 25478181 24850190 24228451 23643496 23115658 22553493 21963974 21438729
$$ packed form
11083B8789666J073938J106149J220630J250160J251720J273322J377112J367285
11075C8709982J282234J277489J323686J325377J369584J309195J249170J132612
11067D8979329J044501J010857R42264Q38247Q00023O48231M41853L49731K56291
11058E5311327Q5771n9960j78262k47924l20878m48758o27667p60309p97421q05094
11048E1150825q59601r66081j008947j048811j034163j057023j061941j047465
11040D3066793j060225j084125j047877j006514r94699r74080r62290r56893r46067
11031C4034023q78000q17751q54129q57511q08784q13562p79688p39322o80022
11022B6805254o60489o66584o27991o21739n84955n27838n62165n89519n25245
$$ plain form
11013 21438729 20985161 20533748 20042049 19544279 19063567 18624628 18145623 17769643 17399429
11004 17399429 17050655 16708297 16334005 15974171 15658464 15327293 14996686 14650825 14305554
10995 14305554 14000870 13768525 13538540 13264809 13035860 12787128 12567348 12367389 12106848
10986 12106848 11850653 11628138 11434934 11212121 10989196 10846243 10648435 10426976 10237713
10977 10237713 10047107 9827573 9648259 9480787 9329149 9274873 9182614 8961497 8818924 8714000
10967 8714000 8640762 8485237 8303135 8122072 7954214 7835608 7698429 7548062 7406741 7253526
10957 7253526 7134775 7015879 6908633 6864304 6781177 6694518 6541633 6417896 6322963 6207911
10947 6207911 6165730 6127635 6136763 6003645 5876453 5838220 5794683 5769904 5740275 5685856 5647082
$$ packed form
11013B1438729m53568m51413m91699m97770m80712m38939m79005l75980l70214
11004A7399429l48774l42358l74292l59834l15707l31171l30607l45861l45271
10995A4305554l04684k32345k29985k73731k28949k48732k19780j99959k60541
10986A2106848k56195k22515j93204k22813k22925j42953j97808k21459j89263
10977A0237713j90606k19534j79314j67472j51638n4276r2259k21117j42573j04924
10967H714000p3238j55525j82102j81063j67858j18606j37179j50367j41321j53215
10957G253526j18751j18896j07246m4329q3127q6659j52885j23737r4933j15052
10947F207911m2181l8095R128j33118j27192l8233m3537k4779k9629n4419l8774
$$ plain form
10936 5647082 5535177 5470011 5473886 5394263 5322233 5233743 5183424 5103888 4972127 4898264 4862800
10925 4862800 4800621 4753757 4625899 4549339 4484111 4427791 4359766 4274217 4213310 4222964 4220753
10914 4220753 4173441 4078122 4002934 3945803 3892355 3859786 3790950 3704689 3724959 3691704 3666835
10903 3666835 3621570 3596169 3566100 3535422 3481258 3463335 3408027 3380382 3293821 3151949 3151152
10892 3151152 3178299 3150126 3033055 2966889 2939745 2881179 2850148 2839020 2791839 2714953 2678364
10881 2678364 2665680 2613835 2563694 2533749 2453916 2392386 2385660 2415729 2372708 2349371 2329095
10870 2329095 2321185 2306724 2258257 2274949 2312981 2324416 2288017 2212127 2151455 2125944 2134049 2121473
10858 2121473 2099899 2065866 2057541 1993448 1988824 1982513 1933315 1960773 1993231 1961633 1947027 1954013
$$ packed form
10936E647082j11905o5166L875p9623p2030q8490n0319p9536j31761p3863l5464
10925D862800o2179m6864j27858p6560o5228n6320o8025q5549o0907R654k211
10914D220753m7312r5319p5188n7131n3448l2569o8836q6261K0270l3255k4869
10903C666835m5265k5401l0069l0678n4164j7923n5308k7645q6561j41872p97
10892C151152K7147k8173j17071o6166k7144n8566l1031j1128m7181p6886l6589
10881B678364j2684n1845n0141k9945p9833o1530o726L0069m3021k3337k0276
10870B329095p910j4461m8467J6692L8032J1435l6399p5890o0672k5511Q105j2576
10858B121473k1574l4033q325o4093m624o311m9198K7458L2458l1598j4606O986
$$ plain form
10846 1954013 1929912 1850772 1816506 1771524 1796028 1787229 1807999 1828179 1822689 1792733 1825749 1820399
10834 1820399 1805758 1781049 1753788 1707587 1683501 1655450 1596525 1577681 1574390 1553130 1618403
10823 1618403 1699539 1721882 1696578 1658784 1664184 1681584 1656592 1628317 1579250 1561233 1530044
10812 1530044 1536816 1467031 1453103 1489433 1475712 1464256 1439342 1454625 1444670 1477040 1471568 1443006
10800 1443006 1418951 1416133 1401784 1391302 1321583 1245581 1238550 1235976 1218454 1239437 1287057 1262088
10788 1262088 1228302 1193318 1152765 1146573 1159197 1144650 1126509 1113336 1091084 1072360 1151657
10777 1151657 1172102 1156604 1170135 1171374 1179551 1180811 1194620 1189492 1244844 1259025 1266649 1244464
10765 1244464 1211985 1208232 1201318 1172523 1151355 1167263 1145831 1069001 1068571 1120019 1096853 1139730
$$ packed form
10846A954013k4101p9140l4266m4982K4504q799K0770K0180n490k9956L3016n350
10834A820399j4641k4709k7261m6201k4086k8051n8925j8844l291k1260O5273
10823A618403Q1136K2343k5304l7794N400J7400k4992k8275m9067j8017l1189
10812A530044O772o9785j3928L6330j3721j1456k4914J5283r955L2370n472k8562
10800A443006k4055k818j4349j0482o9719p6002p031k574j7522K0983M7620k4969
10788A262088l3786l4984m0553o192J2624j4547j8141j3173k2252j8724P9297
10777A151657K0445j5498J3531J239Q177J260J3809n128N5352J4181P624k2185
10765A244464l2479l753o914k8795k1168J5908k1432p6830m30N1448k3166M2877
$$ plain form
10753 1139730 1145049 1123625 1139920 1195919 1165990 1142486 1180126 1138159 1081601 1052674 1110123
10742 1110123 1211140 1227703 1207870 1207094 1251561 1342667 1374877 1402765 1471985 1490226 1453058
10731 1453058 1397863 1323551 1266388 1243152 1201915 1170719 1155062 1120530 1119442 1124956 1172520 1245485
10719 1245485 1234183 1210995 1233144 1271631 1327091 1365120 1328072 1348732 1380053 1434782 1446352
10708 1446352 1398169 1341506 1277384 1168709 1086539 1004972 989052 930793 890058 874985 846363
10697 846363 825263 805361 818204 829964 815978 796733 798513 768813 812790 833240 870164 835819
10685 835819 828916 813200 816659 758805 733586 710851 679448 724230 753973 745582 772149 767199
10673 767199 746422 770227 792617 764012 736348 757138 749637 684564 616961 608017 605752 591974
$$ packed form
10753A139730N319k1424J6295N5999k9929k3504L7640m1967n6558k8927N7449
10742A110123J01017J6563j9833p76M4467R1106L2210K7888O9220J8241l7168
10731A453058n5195p4312n7163k3236m1237l1196j5657l4532j088N514M7564P2965
10719A245485j1302k3188K2149L8487N5460L8029l7048K0660L1321N4729J1570
10708A446352m8183n6663o4122j08675q2170q1567j5920n8259m0735j5073k8622
10697H46363k1100j9902J2843J1760j3986j9245J780k9700M3977K0450L6924l4345
10685H35819o903j5716L459n7854k5219k2735l1403M4782K9743q391K6567m950
10673G67199k0777K3805K2390k8605k7664K0790p501o5073o7603q944k265j3778
$$ plain form
10661 591974 635400 632452 675486 711900 711245 729598 731888 753231 772396 835788 887809 866793
10649 866793 857551 861663 860571 786807 711855 705135 691275 656133 653716 580919 548350 591935
10637 591935 642884 616668 637199 654605 688176 748759 760486 698836 620289 616813 616243 567877
10625 567877 554137 577092 606800 638873 645220 668844 657966 637200 663486 611787 617580 648670
10613 648670 676225 660061 665138 658314 716977 820019 902523 901010 869841 854260 813804 808867
10601 808867 808268 794693 806435 846244 837983 863257 889798 915008 919601 943080 908569 861251
10589 861251 849730 869988 870540 902295 957310 966714 929741 891058 869306 869964 941935 1058463
10577 1058463 1160726 1229034 1278102 1257689 1262975 1267967 1191026 1130961 1119026 1137567 1206472
$$ packed form
10661E91974M3426k948M3034L6414o55J8353K290K1343J9165O3392N2021k1016
10649H66793r242M112j092p3764p4952o720j3860l5142k417p2797l2569M3585
10637E91935N0949k6216K0531J7406L3571O0583J1727o1650p8547l476n70m8366
10625E67877j3740K2955K9708L2073O347K3624j0878k0766K6286n1699N793L1090
10613F48670K7555j6164N077o824N8663J03042Q2504j513l1169j5581m0456m937
10601H08867n99j3575J1742L9809q261K5274K6541K5210M593K3479l4511m7318
10589H61251j1521K0258N52L1755N5015R404l6973l8683k1752O58P1971J16528
10577A058463J02263O8308M9068k0413N286M992p6941o0065j1935J8541O8905
$$ plain form
10566 1206472 1216078 1210425 1174261 1209798 1225699 1201823 1182619 1161274 1214948 1215923 1178468 1214985
10554 1214985 1217395 1194855 1182911 1169566 1217142 1267682 1318063 1418849 1537718 1597602 1690799
10543 1690799 1743956 1721789 1741225 1825236 1946459 2105153 2296464 2434662 2618669 2783054
10533 2783054 2835056 2765720 2652985 2518484 2385696 2232058 2002471 1832833 1780760 1739636
10523 1739636 1713056 1691048 1653682 1673469 1619417 1509511 1433046 1385484 1369225 1305130 1259318
10512 1259318 1244989 1245515 1220193 1293818 1395769 1397410 1357841 1408131 1436477 1447407 1436179 1391079
10500 1391079 1421501 1433078 1467571 1551306 1556124 1559422 1505875 1525975 1520085 1522072 1511235 1494972
10488 1494972 1473920 1464371 1437503 1397189 1382706 1403843 1421976 1462382 1571315 1667571 1836617
$$ packed form
10566A206472R606n653l6164L5537J5901k3876j9204k1345N3674R75l7455L6517
10554A214985K410k2540j1944j3345M7576N0540N0381J00786J18869N9884R3197
10543A690799N3157k2167J9436Q4011J21223J58694J91311J38198J84007J64385
10533B783054N2002o9336j12735j34501j32788j53638k29587j69638n2073m1124
10523A739636k6580k2008l7366J9787n4052j09906p6465m7562j6259o4095m5812
10512A259318j4329N26k5322P3625J01951J641l9569N0290K8346J0930j1228m5100
10500A391079L0422J1577L4493Q3735M818L298n3547K0100n890J987j0837j6263
10488A494972k1052r549k6868m0314j4483K1137J8133M0406J08933R6256J69046
$$ plain form
10477 1836617 2125732 2402709 2710558 2978327 3392673 3805225 4092545 4258116 4294886 4299998
10467 4299998 4179699 3971724 3714172 3465620 3227276 2974674 2714450 2488457 2304576
10458 2304576 2076841 1917073 1843069 1787914 1725740 1671895 1670925 1573118 1554593 1565647 1537569
10447 1537569 1516848 1470919 1494916 1512124 1566767 1605913 1659745 1716388 1747123 1716197 1697058
10436 1697058 1722594 1759406 1897655 2136154 2324601 2525433 2740910 3026624 3244830 3363693
10426 3363693 3384225 3355975 3245382 3105312 3027371 3115089 3350459 3591385 3799585 3998507
10416 3998507 4025492 3879002 3668156 3320980 2894141 2534560 2286694 2056693 1882394 1797880
10406 1797880 1694113 1566701 1547761 1580671 1584256 1580690 1594794 1608990 1631529 1630750 1549716 1543498
$$ packed form
10477A836617K89115K76977L07849K67769M14346M12552K87320J65571L6770N112
10467D299998j20299k07975k57552k48552k38344k52602k60224k25993j83881
10458B304576k27735j59768p4004n5155o2174n3845r70r7807j8525J1054k8078
10447A537569k0721m5929K3997J7208N4643L9146N3832N6643L0735l0926j9139
10436A697058K5536L6812J38249K38499J88447K00832K15477K85714K18206J18863
10426C363693K0532k8250j10593j40070p7941Q7718K35370K40926K08200J98922
10416C998507K6985j46490k10846l47176m26839l59581k47866k30001j74299q4514
10406A797880j03767j27412j8940L2910L585l566J4104J4196K2539p79q1034o218
$$ plain form
10394 1543498 1487514 1404327 1323861 1252177 1188559 1167943 1150596 1105249 1123385 1166838 1128192
10383 1128192 1074236 1148913 1140705 1076367 1032619 1015612 950388 952895 1003191 1040956 1037236 1023547
10371 1023547 1010946 968343 948119 958411 921692 868799 821758 865581 871239 939829 987586
10360 987586 997890 1034108 1065911 1102388 1168609 1317060 1433848 1576707 1774731 1985765
10350 1985765 2126204 2271721 2394094 2431625 2362904 2214756 1997856 1854233 1700731 1601315
10340 1601315 1478103 1369714 1343964 1344601 1293737 1212987 1156161 1158783 1171301 1198398 1187970
10329 1187970 1140616 1073407 1038545 997400 998102 1005249 1015460 1072313 1090255 1087082 1052899 1024675
10317 1024675 1093282 1200070 1287133 1417014 1552175 1614608 1677905 1687711 1566959 1461383
$$ packed form
10394A543498n5984q3187q0466p1684o3618k0616j7347m5347J8136M3453l8646
10383A128192n3956P4677q208o4338m3748j7007o5224K507N0296L7765l720j3689
10371A023547j2601m2603k0224J0292l6719n2893m7041M3823N658O8590M7757
10360I87586J0304L6218L1803L6477O6221J48451J16788J42859J98024K11034
10350A985765J40439J45517J22373L7531o8721j48148k16900j43623j53502r9416
10340A601315j23212j08389k5750O37n0864q0750n6826K622J2518K7097j0428
10329A187970m7354o7209l4862m1145P02P147J0211N6853J7942l173l4183k8224
10317A024675O8607J06788Q7063J29881J35161O2433O3297R806j20752j05576
$$ plain form
10307 1461383 1299266 1102433 1009251 970209 942859 915015 904313 830505 777597 784103 743143
10296 743143 722436 715475 697987 734530 738287 670286 657516 653355 584846 583911 574768 561032 574447
10283 574447 582855 561472 583236 574956 566274 604028 636294 633620 654492 612317 629104 664812
10271 664812 696593 649036 641449 602748 580669 581292 609435 658505 646885 628230 666647 675931
10259 675931 667652 657394 656752 677924 656463 618857 623284 659079 633827 563640 572420 612003
10247 612003 631313 699325 781719 825199 850387 908628 850038 844045 856735 806788 728466 636078
10235 636078 654883 686777 635564 600065 588163 598350 612938 607279 578904 558731 542158 567254
10223 567254 556815 557391 566362 563038 596569 583039 571999 560841 607806 614919 569489 557574
$$ packed form
10307A461383j62117j96833r3182l9042k7350k7844j0702p3808n2908O506m0960
10296G43143k0707o961j7488L6543L757o8001j2770m161o8509r35r143j3736J3415
10283E74447Q408k1383K1764q280q682L7754L2266k674K0872m2175J6787L5708
10271F64812L1781m7557p587l8701k2079O23K8143M9070j1620j8655L8417R284
10259F75931q279j0258o42K1172k1461l7606M427L5795k5252p0187Q780L9583
10247F12003J9310O8012Q2394M3480K5188N8241n8590n993J2690m9947p8322r2388
10235F36078J8805L1894n1213l5499j1902J0187J4588n659k8375k0173j6573K5096
10223E67254j0439N76Q971l324L3531j3530j1040j1158M6965P113m5430j1915
$$ plain form
10211 557574 585273 574843 603084 653642 639855 623241 580050 505472 422315 456351 524090
10200 524090 533174 524213 557963 547875 502223 482538 493280 518549 541969 561438 607705 557407
10188 557407 489989 490939 489294 484218 505558 492818 506846 543015 563997 562360 566157 560373 549934
10175 549934 573705 537258 490760 468209 504402 528606 502832 479019 493698 546875 564417
10164 564417 533215 502391 517121 529833 533747 519873 509765 524587 550870 597496 684023 683919
10152 683919 745096 833926 926594 959695 944685 994312 1060192 1101115 1084305 1024120 940209
10141 940209 871867 869401 815102 782104 771411 753649 688628 662314 599588 500481 531933 635900
10129 635900 661479 634554 653580 630660 596755 567540 586623 608010 639057 663622 672903 650197
$$ packed form
10211E57574K7699j0430K8241N0558j3787j6614m3191p4578q3157L4036O7739
10200E24090R084q961L3750j0088m5652j9685J0742K5269K3420J9469M6267n0298
10188E57407o7418R50j645n076K1340j2740J4028L6169K0982j637L797n784j0439
10175E49934K3771l6447m6498k2551L6193K4204k5774k3813J4679N3177J7542
10164E64417l1202l0824J4730J2712L914j3874j0108J4822K6283M6626Q6527j04
10152F83919O1177Q8830R2668L3101j5010M9627O5880M0923j6810o0185q3911
10141I40209o8342k466n4299l2998j0693j7762o5021k6314o2726r9107L1452J03967
10129F35900K5579k6925J9026k2920l3905k9215J9083K1387L1047K4565R281k2706
$$ plain form
10117 650197 674336 649184 636799 586642 542954 578939 593220 565738 577376 617332 582804
10106 582804 531379 534740 558840 541913 535927 545015 519320 470782 449673 435829 477633 530101
10094 530101 526576 516037 501069 502492 562925 601562 534512 514565 562307 528777 513817 454391
10082 454391 444131 498737 494169 466048 492415 571237 614520 551908 529589 539321 534661 565666
10070 565666 577173 536348 536911 594503 509392 453090 500406 581095 555810 598195 610448 594028
10058 594028 590462 605110 614708 549277 542340 524779 509983 538837 599984 636299 580091 547304
10046 547304 582748 615482 690078 741977 667518 661814 726246 760086 800840 871251 1013070
10035 1013070 1174198 1427945 2041407 3070638 4237007 5060692 5743366 7004829 8477476
$$ packed form
10117F50197K4139k5152j2385n0157m3688L5985J4281k7482J1638L9956l4528
10106E82804n1425L361K4100j6927n986R088k5695m8538k1109j3844M1804N2468
10094E30101l525j0539j4968J423O0433L8637o7050j9947M7742l3530j4960n9426
10082D54391j0260N4606m568k8121K6367P8822M3283o2612k2319R732m660L1005
10070E65666J1507m0825N63N7592q5111n6302M7316Q0689k5285M2385J2253j6420
10058E94028l566J4648R598o5431o937j7561j4796K8854O1147L6315n6208l2787
10046E47304L5444L2734P4596N1899p4459n704O4432L3840M0754P0411J41819
10035A013070J61128K53747O13462J029231J166369Q23685O82674J261463J472647
$$ plain form
10026 8477476 7914075 5209580 3510949 2685063 2222827 1912049 1686279 1540367 1435040
10017 1435040 1380765 1323154 1205693 1180932 1177376 1130832 1095612 1063180 1032314 971823 944936
10006 944936 943508 934496 825458 772520 769605 780494 819764 830993 821276 804183 811063 820155
9994 820155 821227 808334 786302 781253 733473 787688 828494 783448 763739 761013 770145 725774
9982 725774 715144 728266 770907 749567 745755 721632 726088 749664 751328 740205 769614 765626
9970 765626 702601 732412 805535 821849 771030 761443 735164 721451 703849 685476 668734 632393
9958 632393 635416 662327 656117 672427 690046 723252 751096 779084 766521 768310 715345 702419
9946 702419 679606 647463 685405 763685 776199 758786 762265 758587 803198 820830 840353 811883
$$ packed form
10026H477476n63401k704495j698631q25886m62236l10778k25770j45912j05327
10017A435040n4275n7611j17461k4761l556m6544l5220l2432l0866o0491k6887
10006I44936j428r012j09038n2938k915J0889L9270J1229r717j7093O880R092
9994H20155J072j2893k2032n049m7780N4215M0806m5046j9709k726R132m4371
9982G25774j0630J3122M2641k1340l812k4123M456K3576J664j1123K9409l988
9970G65626o3025K9811P3123J6314n0819r587k6279j3713j7602j8373j6742l6341
9958F32393L023K6911o210J6310J7619L3206K7844K7988j2563J789n2965j2926
9946G02419k2813l2143L7942P8280J2514j7413L479l678M4611J7632J9523k8470
$$ plain form
9934 811883 774917 761050 731714 743586 791993 797198 791098 791398 767867 798533 816613 811042 767187
9921 767187 721097 715403 713712 732717 769250 796833 848825 836115 823576 823907 780321 789111 809884
9908 809884 777713 766699 754679 827131 842702 811032 745258 784244 785283 819340 830984 849622
9896 849622 874710 891907 865877 825285 821782 838757 811259 883431 893918 927731 953273 935112
9884 935112 974125 1000256 962230 925362 939940 930882 911529 931287 932504 931114 933459 919948
9872 919948 941027 959663 948463 920022 928453 900088 916344 911151 941130 924153 909144 963746
9860 963746 1030938 972692 976217 952869 935623 930528 994530 1023128 1008719 1014482 1020441 1061113
9848 1061113 1068508 1068606 1041857 969490 958519 1013821 1041263 1052573 1079215 1108532 1113379 1119043 1138822
$$ packed form
9934H11883l6966j3867k9336J1872M8407N205o100L00k3531L0666J8080n571m3855
9921G67187m6090n694j691J9005L6533K7583N1992j2710j2539L31m3586Q790K0773
9908H09884l2171j1014j2020P2452J5571l1670o5774L8986J039L4057J1644J8638
9896H49622K5088J7197k6030m0592l503J6975k7498P2172J0487L3813K5542j8161
9884I35112L9013K6131l8026l6868J4578r058j9353J9758J217j390K345j3511
9872I19948K1079J8636j1200k8441Q431k8365J6256n193K9979j6977j5009N4602
9860I63746O7192n8246L525k3348j7246n095O4002K8598j4409N763N959M0672
9848A061113P395R8k6749p2367j0971N5302K7442J1310K6642K9317M847N664J9779
$$ plain form
9835 1138822 1110459 1079191 1130143 1123638 1075771 1052288 1041354 1010630 1039785 1072570 1100203 1083115
9823 1083115 1065513 1088987 1115439 1188384 1244198 1259145 1325382 1318302 1291411 1234548 1162203 1200453
9811 1200453 1239308 1247722 1279249 1290471 1259689 1227220 1224132 1237588 1268579 1282411 1300008 1322905
9799 1322905 1324379 1319962 1338092 1334208 1379873 1440332 1448338 1448968 1480500 1488534 1487609 1468106 1401761
9786 1401761 1353845 1352619 1319778 1289771 1286986 1334174 1372406 1389616 1380805 1422494 1439914 1432996
9774 1432996 1394623 1398750 1421285 1428205 1392098 1344025 1321194 1338897 1417419 1446670 1424825 1396980
9762 1396980 1442469 1489601 1450494 1403101 1379925 1349407 1315008 1358955 1385387 1337640 1318944
9751 1318944 1306175 1336218 1359646 1386592 1443878 1407297 1372523 1331564 1304901 1309829 1395407 1438158
$$ packed form
9835A138822k8363l1268N0952o505m7867k3483j0934l0724K9155L2785K7633j7088
9823A083115j7602K3474K6452P2945N5814J4947O6237p080k6891n6863p2345L8250
9811A200453L8855Q414L1527J1222l0782l2469l088J3456L0991J3832J7597K2897
9799A322905J474m417J8130l884M5665O0459Q006O30L1532Q034r25j9503o6345
9786A401761m7916j226l2841l0007k785M7188L8232J7210q811M1689J7420o918
9774A432996l8373M127K2535O920l6107m8073k2831J7703P8522K9251k1845k7845
9762A396980M5489M7132l9107m7393k3176l0518l4399M3947K6432m7747j8696
9751A318944j2769L0043K3428K6946N7286l6581l4774m0959k6663M928Q5578M2751
$$ plain form
9739 1438158 1456587 1431435 1427131 1449619 1434034 1439377 1379409 1320194 1387042 1407098 1422693 1470004
9727 1470004 1515385 1529198 1499767 1525341 1593391 1558974 1515379 1526672 1544780 1545025 1500719 1482376
9715 1482376 1491585 1478289 1466361 1463228 1435304 1458346 1484271 1434434 1437784 1432750 1483509 1552186
9703 1552186 1577574 1563766 1503404 1519506 1555246 1574489 1619973 1644957 1619050 1555537 1514638
9692 1514638 1553535 1528871 1494881 1501638 1476574 1458123 1471156 1530731 1530900 1505721 1428516 1369099
9680 1369099 1380762 1415861 1419514 1374667 1324866 1293091 1345013 1366614 1395967 1404717 1408466 1396904
9668 1396904 1439918 1493791 1487479 1441587 1430546 1399094 1384736 1397184 1445699 1426037 1438871 1473047
9656 1473047 1484327 1507055 1495476 1502854 1471988 1426049 1458551 1501493 1494881 1457603 1466060 1470177
$$ packed form
9739A438158J8429k5152m304K2488j5585N343n9968n9215O6848K0056J5595M7311
9727A470004M5381J3813k9431K5574O8050l4417m3595J1293J8108K45m4306j8343
9715A482376R209j3296j1928l133k7924K3042K5925m9837L350n034N0759O8677
9703A552186K5388j3808o0362J6102L5740J9243M5484K4984k5907o3513m0899
9692A514638L8897k4664l3990O757k5064j8451J3033N9575J69k5179p7205n9417
9680A369099J1663L5099L653m4847m9801l1775N1922K1601K9353Q750L749j1562
9668A396904M3014N3873o312m5892j1041l1452j4358J2448M8515j9662J2834L4176
9656A473047J1280K2728j1579P378l0866m5939L2502M2942o612l7278Q457M117
$$ plain form
9644 1470177 1487211 1511175 1535622 1623607 1641724 1694743 1690067 1656811 1734386 1733390 1745162 1809835
9632 1809835 1815830 1835155 1837547 1823736 1781730 1788420 1772117 1798200 1771718 1780368 1793665 1816147
9620 1816147 1839920 1790617 1766002 1752574 1745709 1791516 1869230 1950303 1960773 1999494 1994713 2046358
9608 2046358 2134494 2164102 2152694 2225457 2238941 2258252 2260501 2276315 2318235 2347180 2364402 2365060
9596 2365060 2364559 2373723 2434212 2491786 2541110 2621638 2633555 2606712 2660995 2653329 2635204 2648944
9584 2648944 2665903 2584674 2496136 2502815 2576839 2625187 2625728 2655494 2659387 2688016 2715943 2791052
9572 2791052 2831147 2893021 2939192 2978904 3077259 3219518 3441557 3638358 3812695 3992656
9562 3992656 4159856 4240821 4096862 3892685 3778201 3706475 3657583 3529415 3451615 3374371
$$ packed form
9644A470177J7034K3964K4447Q7985J8117N3019m676l3256P7575r96J1772O4673
9632A809835N995J9325K392j3811m2006O690j6303K6083k6482Q650J3297K2482
9620A816147K3773m9303k4615j3428o865M5807P7714Q1073J0470L8721m781N1645
9608B046358Q8136K9608j1408P2763J3484J9311K249J5814M1920K8945J7222O58
9596B365060n01R164O0489N7574M9324Q0528J1917k6843N4283p666j8125J3740
9584B648944J6959q1229q8538O679P4024M8348N41K9766L893K8629K7927P5109
9572B791052M0095O1874M6171L9712R8355J42259K22039J96801J74337J79961
9562C992656J67200Q0965j43959k04177j14484p1726m8892j28168p7800p7244
$$ plain form
9552 3374371 3287623 3233228 3219283 3256677 3283522 3390181 3523867 3566522 3660520 3718316 3707379
9541 3707379 3731971 3676503 3597983 3558422 3557315 3542800 3506650 3417200 3317015 3260501 3230396
9530 3230396 3231848 3215818 3188890 3286503 3482977 3809727 4189410 4602409 4979236 5385490
9520 5385490 5726262 5861175 5469839 4807637 4222987 3789067 3516899 3383912 3349605 3321132
9510 3321132 3257327 3238001 3244713 3311689 3326570 3283891 3286009 3303473 3339290 3425600 3436965 3412623
9498 3412623 3471260 3489323 3449089 3321785 3212212 3114934 2963389 2775352 2590660 2463023
9488 2463023 2434214 2410765 2386430 2415162 2511610 2625406 2734163 2796223 2850507 2889101 2931988
9477 2931988 2926124 2757385 2473483 2250582 2102925 1963270 1866429 1801635 1759369 1702778 1621490
$$ packed form
9552C374371q6748n4395j3945L7394K6845J06659J33686M2655R3998N7796j0937
9541C707379K4592n5468p8520l9561j107j4515l6150q9450j00185n6514l0105
9530C230396J452j6030k6928R7613J96474L26750L79683M12999L76827M06254
9520E385490L40772J34913l91336o62202n84650m33920k72168j32987l4307k8473
9510C321132o3805j9326O712O6976J4881m2679K118J7464L5817Q6310J1365k4342
9498C412623N8637J8063m0234j27304j09573r7278j51545j88037j84692j27637
9488B463023k8809k3449k4335K8732R6448J13796J08757O2060N4284L8594M2887
9477B931988n864j68739k83902k22901j47657j39655r6841o4794m2266n6591q1288
$$ plain form
9466 1621490 1623106 1597640 1581109 1553423 1477774 1426603 1466688 1529934 1477475 1419150 1406018 1416465
9454 1416465 1448349 1435037 1401130 1412732 1395629 1366018 1391518 1407498 1452816 1542605 1572629
9443 1572629 1596885 1609206 1619536 1666381 1726931 1715170 1667641 1684179 1681522 1607142 1564012 1554068
9431 1554068 1525166 1457513 1430004 1459531 1491217 1480970 1479927 1512288 1556170 1592063 1632880 1655063
9419 1655063 1628661 1607092 1604396 1655200 1647204 1615879 1656212 1658277 1609501 1491065 1474663 1490417
9407 1490417 1447513 1424848 1402128 1369841 1403510 1381931 1384814 1368521 1349987 1364032 1387168 1328135
9395 1328135 1267613 1247048 1260118 1319252 1309991 1285148 1268587 1275661 1229267 1238116 1261960 1256732
9383 1256732 1237071 1208646 1210507 1221866 1209530 1202339 1187110 1139880 1121515 1120537 1153439 1178035
$$ packed form
9466A621490J616k5466j6531k7686p5649n1171M0085O3246n2459n8325j3132J0447
9454A416465L1884j3312l3907J1602j7103k9611K5500J5980M5318Q9789L0024
9443A572629K4256J2321J0330M6845O0550j1761m7529J6538k657p4380m3130r944
9431A554068k8902o7653k7509K9527L1686j0247j043L2361M3882L5893M0817K2183
9419A655063k6402k1569k696N0804p996l1325M0333K065m8776j18436j6402J5754
9407A490417m2904k2665k2720l2287L3669k1579K883j6293j8534J4045K3136n9033
9395A328135o0522k0565J3070N9134r261k4843j6561P074m6394Q849K3844n228
9383A256732j9661k8425J861J1359j2336p191j5229m7230j8365r78L2902K4596
$$ plain form
9371 1178035 1156129 1155554 1232417 1257111 1292817 1354082 1398162 1444982 1446117 1452484 1498358 1474487
9359 1474487 1470184 1478424 1488553 1493907 1489365 1515650 1530845 1516636 1502046 1407711 1372839 1423234
9347 1423234 1471975 1506614 1508694 1448906 1384535 1380322 1376528 1411453 1471084 1488548 1438334 1479343
9335 1479343 1463645 1496387 1514522 1576303 1660393 1728243 1715190 1708826 1759757 1846211 1974206
9324 1974206 1972976 1951546 2003272 2129982 2127747 2092082 2143221 2149239 2169628 2256347 2323815 2400121
9312 2400121 2528650 2580016 2654297 2720336 2826671 2954817 3072012 3206123 3351906 3522892
9302 3522892 3659149 3807254 3880513 3930819 3962310 3970039 3999153 4006371 3913359 3948191 3983247
9291 3983247 3968281 3970374 3967070 3942661 3916957 3913296 3942285 3941659 3934175 3906397 3871030 3880372 3976508
$$ packed form
9371A178035k1906n75P6863K4694L5706O1265M4080M6820J135O367M5874k3871
9359A474487m303Q240J0129N354m542K6285J5195j4209j4590r4335l4872N0395
9347A423234M8741L4639K080n9788o4371m213l794L4925N9631J7464n0214M1009
9335A479343j5698L2742J8135O1781Q4090O7850j3053o364N0931Q6454J27995
9324A974206j230k1430N1726J26710k235l5665N1139O018K0389Q6719O7468P6306
9312B400121J28529N1366P4281O6039J06335J28146J17195J34111J45783J70986
9302C522892J36257J48105P3259N0306L1491P729K9114P218r3012L4832L5056
9291C983247j4966K093l304k4409k5704l661K8989o26p484k7778l5367R342R6136
$$ plain form
9278 3976508 4086241 4160613 4308729 4373856 4452552 4528095 4653165 4791304 4929116 5077735
9268 5077735 5178721 5405055 5709975 6070943 6467416 6940778 7415065 7891499 8280763 8565270
9258 8565270 8730284 8728720 8721964 8748364 8840302 9004353 9196282 9406024 9597883 9749750 10030167
9247 10030167 10371440 10725711 11086078 11486955 11940376 12486233 12990845 13496325 14159250
9238 14159250 14936629 15785637 16665048 17515331 18482985 19521661 20652345 21960111 23371810
9229 23371810 24978248 26822343 28872471 31055226 33303029 35530903 37802246 39937676
9221 39937676 41738036 43344175 44911074 46605745 48368176 50123171 51926147 53981147
9213 53981147 56406066 59309367 62748393 66780177 71606261 77315202 84155744 92443160
$$ packed form
9278C976508J09733P4372J48116O5127P8696P5543J25070J38139J37812J48619
9268E077735J00986K26334L04920L60968L96473M73362M74287M76434L89264K84507
9258H565270J65014j564o756K6400R1938J64051J91929K09742J91859J51867K80417
9247A0030167L41273L54271L60367M00877M53421N45857N04612N05480O62925
9238A4159250P77379Q49008Q79411Q50283R67654J038676J130684J307766J411699
9229B3371810J606438J844095K050128K182755K247803K227874K271343K135430
9221C9937676J800360J606139J566899J694671J762431J754995J802976K055000
9213E3981147K424919K903301L439026M031784M826084N708941O840542Q287416
$$ plain form
9205 92443160 102410565 114358640 128453756 144695396 162873367 182598694 202739674
9198 202739674 222478881 241588514 259838145 276542731 290990827 303314627 314478601
9191 314478601 325982354 339116523 354272545 370520379 386526227 401463042 415167342
9184 415167342 427715013 439671302 451635188 464377923 478702448 495287446 514291462
9177 514291462 534972439 555328398 571922962 581899277 584678088 580248713 568354657
9170 568354657 550150247 528680103 507002494 486674560 467782681 450220898 433953760
9163 433953760 418302791 402153686 384969823 367802538 352041845 338266269 326651052
9156 326651052 317358754 309962048 303912843 298573884 293005601 286347773 278307445 269174367
$$ packed form
9205I2443160R967405J1948075J4095116J6241640J8177971J9725327K0140980
9198B02739674J9739207J9109633J8249631J6704586J4448096J2323800J1163974
9191C14478601J1503753J3134169J5156022J6247834J6005848J4936815J3704300
9184D15167342J2547671J1956289J1963886J2742735J4324525J6584998J9004016
9177E14291462K0680977K0355959J6594564R976315K778811m429375j1894056
9170E68354657j8204410k1470144k1677609k0327934j8891879j7561783j6267138
9163D33953760j5650969j6149105j7183863j7167285j5760693j3775576j1615217
9156C26651052r292298p396706o049205n338959n568283o657828q040328r133078
$$ plain form
9148 269174367 259391408 249038792 237967542 226503161 215223362 204571791 194977153
9141 194977153 186897756 180455756 175598966 172218468 169887503 168026407 166258753 164197874
9133 164197874 161509755 157911146 153406668 148240778 142833643 137502015 132366331 127438740
9125 127438740 122598890 117863995 113112866 108425443 103902701 99582668 95485187 91683399
9117 91683399 88202817 85075982 82261946 79817422 77716813 75749412 73980203 72359287
9109 72359287 70854464 69471915 68217072 66852235 65336873 63686175 61978858 60313964
9101 60313964 58684129 57060370 55426314 53933259 52551414 51250634 50016261 48824165
9093 48824165 47797973 46869169 45894870 44843923 43794665 42733514 41678835 40716472 39866632
$$ packed form
9148B69174367r782959j0352616j1071250j1464381j1279799j0651571r594638
9141A94977153q079397o442000m856790l380498k330965j861096j767654k060879
9133A64197874k688119l598609m504478n165890n407135n331628n135684m927591
9125A27438740m839850m734895m751129m687423m522742m320033m097481l801788
9117I1683399l480582l126835k814036k444524k100609j967401j769209j620916
9109G2359287j504823j382549j254843j364837j515362j650698j707317j664894
9101F0313964j629835j623759j634056j493055j381845j300780j234373j192096
9093D8824165j026192r28804r74299j050947j049258j061151j054679r62363q49840
$$ plain form
9084 39866632 39085293 38338558 37598618 36820079 36042027 35302727 34607019 33933064 33299412
9075 33299412 32700058 32047645 31447112 30832350 30253452 29737863 29202986 28664555 28164288
9066 28164288 27670037 27212513 26749193 26327509 25913205 25451406 24951975 24516027 24091760
9057 24091760 23721757 23356861 22991861 22616943 22288863 21969746 21579729 21137882 20716215
9048 20716215 20399329 20102366 19820055 19575745 19361687 19137779 19012299 18906082 18832363 18709194
9038 18709194 18549585 18329218 18116121 17843918 17508764 17155597 16836526 16543574 16219220
9029 16219220 15937787 15626887 15289063 15046725 14816942 14583142 14360072 14148178 13948682
9020 13948682 13717753 13545219 13356504 13233855 13133371 13006515 12856940 12766718 12638538 12539877
$$ packed form
9084C9866632p81339p46735p39940p78539p78052p39300o95708o73955o33652
9075C3299412n99354o52413o00533o14762n78898n15589n34877n38431n00267
9066B8164288m94251m57524m63320m21684m14304m61799m99431m35948m24267
9057B4091760l70003l64896l65000l74918l28080l19117l90017m41847m21667
9048B0716215l16886k96963k82311k44310k14058k23908j25480j06217p3719j23169
9038A8709194j59609k20367k13097k72203l35154l53167l19071k92952l24354
9029A6219220k81433l10900l37824k42338k29783k33800k23070k11894j99496
9020A3948682k30929j72534j88715j22649j00484j26856j49575r0222j28180r8661
$$ plain form
9010 12539877 12444761 12352143 12327977 12245832 12204902 12145103 12025799 11980188 11886034 11792107 11684015
8999 11684015 11598883 11495529 11355637 11140523 10927826 10710647 10469203 10245291 10045745 9902343
8989 9902343 9783780 9616542 9463426 9276578 9107431 8932892 8813139 8687973 8519320 8359097
8979 8359097 8213439 8134515 8058438 7965481 7943932 7874842 7798476 7774104 7708336 7604231 7458381
8968 7458381 7393865 7306302 7187371 7144240 7113194 7014476 6882572 6741439 6597820 6505018 6438599
8957 6438599 6348648 6235729 6134953 6018653 5885274 5780579 5685558 5621115 5602160 5476887
8947 5476887 5375720 5280122 5233412 5134906 4974920 4888411 4816990 4739426 4659674 4564045 4465057
8936 4465057 4404260 4394376 4349879 4330643 4311603 4209343 4169098 4132608 4111030 4070465 3995256
$$ packed form
9010A2539877r5116r2618k4166q2145m0930n9799j19304m5611r4154r3927j08092
8999A1684015q5132j03354j39892k15114k12697k17179k41444k23912j99546j43402
8989I902343j18563j67238j53116j86848j69147j74539j19753j25166j68653j60223
8979H359097j45658p8924p6077r2957k1549o9090p6366k4372o5768j04105j45850
8968G458381o4516q7563j18931m3131l1046r8718j31904j41133j43619r2802o6419
8957F438599q9951j12919j00776j16300j33379j04695r5021o4443j8955j25273
8947E476887j01167r5598m6710r8506j59986q6509p1421p7564p9752r5629r8988
8936D465057o0797r884m4497j9236j9040j02260m0245l6490k1578m0565p5209
$$ plain form
8925 3995256 3948509 3905281 3860848 3791003 3735229 3624154 3551388 3486031 3454318 3445056 3418368
8914 3418368 3354231 3269785 3191993 3085797 2998676 2905978 2835361 2788010 2778104 2707527 2654309
8903 2654309 2677148 2614703 2568483 2542197 2492864 2472301 2426695 2361698 2301758 2258227 2272421
8892 2272421 2196102 2066572 2040459 2059272 2025622 1930401 1866605 1897924 1946637 1940283 1916457
8881 1916457 1856837 1807555 1802433 1813716 1798405 1818526 1788771 1698520 1708872 1669955 1631475 1645939
8869 1645939 1654366 1647151 1617597 1580250 1615931 1546188 1498503 1551264 1505525 1409112 1389249 1424670
8857 1424670 1476539 1498827 1501371 1470935 1459936 1442190 1448636 1442710 1425745 1421168 1407753 1387121
8845 1387121 1318031 1285668 1227395 1220599 1269010 1263858 1267936 1262732 1274542 1358037 1358950 1346077 1339316
$$ packed form
8925C995256m6747m3228m4433o9845n5774j11075p2766o5357l1713r262k6688
8914C418368o4137q4446p7792j06196q7121r2698p0617m7351r906p0577n3218
8903B654309K2839o2445m6220k6286m9333k0563m5606o4997n9940m3531J4194
8892B272421p6319j29530k6113J8813l3650r5221o3796L1319M8713o354k3826
8881A916457n9620m9282n122J1283j5311K0121k9755r0251J0352l8917l8480J4464
8869A645939Q427p215k9554l7347L5681o9743m7685N2761m5739r6413j9863L5421
8857A424670N1869K2288K544l0436j0999j7746O446n926j6965m577j3415k0632
8845A387121o9090l2363n8273o796M8411n152M078n204J1810Q3495R13j2873o761
$$ plain form
8832 1339316 1386342 1420729 1456792 1486708 1550309 1458526 1367677 1284123 1260833 1272221 1250003
8821 1250003 1243125 1229402 1249574 1305656 1373332 1432444 1454138 1534440 1578880 1574895 1510183 1500029
8809 1500029 1535485 1519904 1512263 1521923 1558050 1590762 1645188 1686901 1773019 1822673 1773084 1757599
8797 1757599 1805685 1860621 1863604 1853643 1842699 1814123 1784632 1708091 1688680 1686636 1690768 1658942
8785 1658942 1637209 1682787 1727619 1739546 1784472 1809488 1831937 1857232 1911932 1942304 1927609
8774 1927609 1874339 1910328 1958859 1982013 1992388 2031953 2033975 1984750 1993674 2070672 2042263 1979036
8762 1979036 1934382 1953417 1972557 1996433 2023798 2035696 2042720 2014088 1949454 1866568 1819099 1840329
8750 1840329 1791034 1738809 1729966 1751893 1763475 1683595 1629893 1667630 1639556 1654270 1671148 1654335
$$ packed form
8832A339316M7026L4387L6063K9916O3601r1783r0849q3554k3290J1388k2218
8821A250003o878j3723K0172N6082O7676N9112K1694Q0302M4440l985o4712j0154
8809A500029L5456j5581p641R660L6127L2712N4426M1713Q6118M9654m9589j5485
8797A757599M8086N4936K983r961j0944k8576k9491p6541j9411k044M132l1826
8785A658942k1733M5578M4832J1927M4926K5016K2449K5295N4700L0372j4695
8774A927609n3270L5989M8531K3154J0375L9565K022m9225Q924P6998k8409o3227
8762A979036m4654J9035J9140K3876K7365J1898P024k8632o4634q2886m7469K1230
8750A840329m9295n2225q843K1927J1582p9880n3702L7737k8074J4714J6878j6813
$$ plain form
8738 1654335 1603722 1581790 1634726 1614813 1612039 1598334 1621599 1564973 1479623 1460182 1434247 1458567
8726 1458567 1500316 1474313 1403558 1348687 1284278 1219601 1159675 1121389 1103558 1090988 1069179
8715 1069179 1040048 1023888 1054264 1046742 966378 954733 968736 1002996 982279 1005223 1005322 1008670
8703 1008670 1020088 1026617 1033140 994067 1016640 1059607 1023872 988044 883174 817697 814369 810731
8691 810731 798892 785022 795971 781213 792970 795146 825193 803925 757099 757531 771947 755964
8679 755964 723545 687525 708318 691164 661456 601718 635020 635121 566889 521825 459559 463508
8667 463508 507962 488743 469355 438290 408319 408720 409984 391977 443953 429822 438823 441939 499711
8654 499711 552358 539311 510093 485264 501051 518655 539103 490019 400792 287726 258889
$$ packed form
8738A654335n0613k1932N2936j9913k774j3705K3265n6626q5350j9441k5935K4320
8726A458567M1749k6003p0755n4871o4409o4677n9926l8286j7831j2570k1809
8715A069179k9131j6160L0376p522q0364j1645J4003L4260k0717K2944R9L348
8703A008670J1418O529O523l9073K2573M2967l5735l5828j04870o5477l328l638
8691H10731j1839j3870J0949j4758J1757K176L0047k1268m6826M32J4416j5983
8679G55964l2419l6020K0793j7154k9708n9738L3302J01o8232m5064o2266L949
8667D63508M4454j9219j9388l1065k9971M01J264j8007N1976j4131R001L116N7772
8654D99711N2647j3047k9218k4829J5787J7604K0448m9084q9227j13066k8837
$$ plain form
8643 258889 321640 357612 384430 398832 413576 422445 403905 403307 414667 373075 360676 375841
8631 375841 378450 341134 292084 303158 397082 382791 336719 308268 308228 327300 366975 348896
8619 348896 352075 370494 355369 355356 338281 323760 308710 305584 336117 402472 445982 488207 449159
8606 449159 411666 437147 442072 458288 416399 322172 333220 325406 339817 424297 506951 544749
8594 544749 513890 520668 505345 477190 466128 488856 536531 553877 592691 593943 605017 605348
8582 605348 576771 580883 548155 483506 486480 519987 490160 465812 443038 383195 345286 340112
8570 340112 359512 382757 373058 397302 377333 342139 395066 408431 340172 309536 294470 300901
8558 300901 322611 325057 324728 329929 355887 372052 341589 312623 318103 300872 306046 274631 290547
$$ packed form
8643B58889O2751L5972K6818J4402J4744Q869j8540n98J1360m1592j2399J5165
8631C75841K609l7316m9050J1074R3924j4291m6072k8451m0J9072L9675j8079
8619C48896L179J8419j5125j3j7075j4521j5050l126L0533O6355M3510M2225l9048
8606D49159l7493K5481M925J6216m1889r4227J1048p814J4411Q4480Q2654L7798
8594E44749l0859O778j5323k8155j1062K2728M7675J7346L8814J252J1074L31
8582F05348k8577M112l2728o4649K974L3507k9827k4348k2774n9843l7909n174
8570C40112J9400K3245r699K4244j9969l5194N2927J3365o8259l0636j5066O431
8558C00901K1710K446l29N201K5958J6165l0463k8966N480j7231N174l1415J5916
$$ plain form
8545 290547 303986 341580 335464 399061 391133 304631 245416 268536 303523 308655 335231 345659
8533 345659 293801 262319 248878 230853 213507 201726 241997 276347 270600 293232 292331 297506
8521 297506 301853 392014 459438 481037 524873 555737 625635 694339 680384 607229 505182 480187
8509 480187 472238 403957 419391 445728 323205 270828 243873 288718 315680 376551 444128 454816
8497 454816 348781 249197 263601 304736 352994 343988 313277 286850 329096 377008 371507 430165
8485 430165 421880 423188 410854 444621 540329 563012 624632 673226 691177 720228 731904 683018
8473 683018 535371 454238 421083 360336 345538 298969 297376 288748 346974 375573 358703 356580
8461 356580 324178 295411 243693 265199 244310 219770 244876 254628 254258 249402 237040 240351 193936
$$ packed form
8545B90547J3439L7594o116O3597p928q6502n9215K3120L4987N132K6576J0428
8533C45659n1858l1482j3441j8025j7346j1781M0271L4350n747K2632r01N175
8521B97506M347R0161O7424K1599M3836L0864O9898O8704j3955p3155j02047k4995
8509D80187p949o8281J5434K6337j22523n2377k6955M4845K6962O0871O7577J0688
8497D54816j06035r9584J4404M1135M8258r006l0711k6427M2246M7912n501N8658
8485D30165q285J308j2334L3767R5708K2683O1620M8594J7951K9051J1676m8886
8473F83018j47647q1133l3155o0747j4798m6569j593q628N8226K8599j6870k123
8461C56580l2402k8767n1718K1506k0889k4540K5106R752l70m856j2362L311m6415
$$ plain form
8448 193936 171216 190039 260033 256920 245401 208605 206875 229799 209592 220285 219631 282776
8436 282776 285862 195179 202522 214243 206619 203003 208569 211935 226659 231020 262330 288792 346514
8423 346514 313447 268199 241528 244616 204072 241278 276567 252569 204449 188108 209503 150843
8411 150843 120207 130698 173674 200463 201826 167645 162462 169814 135995 210024 265952 243618
8399 243618 252175 297236 309656 307764 295461 284437 328284 356755 333117 309264 349778 333309
8387 333309 349441 408823 442806 420894 413079 418454 433096 491163 448702 366837 356160 350694
8375 350694 259168 240112 244070 226420 151573 122379 146633 202095 205693 163818 111874 117302
8363 117302 120346 119327 111449 111037 100864 137229 143878 184901 166461 171117 207081 194928 183681
$$ packed form
8448A93936k2720J8823O9994l113j1519l6796j730K2924k0207J0693o54O3145
8436B82776L086r0683P343J1721p624l616N566L366J4724M361L1310K6462N7722
8423C46514l3067m5248k6671L088m0544L7206L5289k3998m8120j6341K1395n8660
8411A50843l0636J0491M2976K6789J363l4181n183P352l3819P4029N5928k2334
8399B43618Q557M5061J2420j892j2303j1024M3847K8471k3638k3853M0514j6469
8387C33309J6132N9382L3983k1912p815N375J4642N8067m2461q1865j0677n466
8375C50694r1526j9056L958j7650p4847k9194K4254N5462L598m1875n1944N428
8363A17302L044j019p878m12j0173L6365O649M1023j8440M656L5964j2153j1247
$$ plain form
8350 183681 186385 166002 175652 210012 251602 234321 245174 227178 199868 216803 201732 186679
8338 186679 218226 219443 263097 326314 302111 207422 193858 202842 256543 281179 298342 312995
8326 312995 338910 332741 355828 386752 360721 323182 309016 301556 295364 260514 235378 187066
8314 187066 205374 281497 337243 317659 314486 279738 275337 278816 273231 221343 191361 195316 192273
8301 192273 178445 184192 178642 123524 84987 94556 125403 125046 141750 158686 118040 128200 159347
8288 159347 194513 159580 146785 87786 135838 176858 150442 95382 70846 91486 147845 155726
8276 155726 176457 179831 155512 141161 111675 126496 174284 153825 127146 147854 187590 229283
8264 229283 231198 215169 221615 270532 262202 245080 211343 170561 178077 145428 105989 123358
$$ packed form
8350A83681K704k0383R650L4360M1590j7281J0853j7996k7310J6935j5071j5053
8338A86679L1547J217M3654O3217k4203r4689j3564Q984N3701K4636J7163J4653
8326C12995K5915o169K3087L0924k6031l7539j4166p460o192l4850k5136m8312
8314A87066J8308P6123N5746j9584l173l4748m401L479n585n1888k9982L955l043
8301A92273j3828N747n550n5118l8537R569L0847l57J6704J6936m0646J0160L1147
8288A59347L5166l4933j2795n8999M8052M1020k6416n5060k4536K0640N6359P881
8276A55726K0731L374k4319j4351k9486J4821M7788k0459k6679K0708L9736M1693
8264B29283J915j6029O446M8917q330j7122l3737m0782P516l2649l9439J7369
$$ plain form
8252 123358 157003 220412 251410 246217 256396 238360 192034 163834 146186 100996 96860 159724
8240 159724 200502 109810 88195 119895 143744 106213 95922 155840 157478 114201 107889 74774
8228 74774 129439 184825 203094 149505 117718 89159 61163 87347 94301 62518 64289 99328
8216 99328 91433 39690 40661 56654 24549 65696 91062 101947 66441 99722 119614 136162
8204 136162 125211 149353 136981 113352 27283 12223 81742 66567 31062 104630 83132 15192
8192 15192 8534 78664 94635 47715 26499 27976 30046 45094 86078 99497 82100 51091
8180 51091 69720 84975 57311 55106 43744 48202 73355 165396 206379 205349 167765 113451
8168 113451 45420 81599 158212 156022 121280 126971 106283 122622 168658 170680 135693 113541
$$ packed form
8252A23358L3645O3409L0998n193J0179j8036m6326k8200j7648m5190m136O2864
8240A59724M0778r0692k1615L1700K3849l7531j0291N9918J638m3277o312l3115
8228G4774N4665N5386J8269n3589l1787k8559k7996K6184O954l1783J771L5039
8216I9328p895n1743R71J5993l2105M1147K5366J0885l5506L3281J9892J6548
8204A36162j0951K4142j2372k3629q6069j5060O9519j5175l5505P3568k1498o7940
8192A5192o658P0130J5971m6920k1216J477K070J5048M0984J3419j7397l1009
8180E1091J8629J5255k7664k205j1362M458K5153R2041M0983j030l7584n4314
8168A13451o8031L6179P6613k190l4742N691k0688J6339M6036K022l4987k2152
$$ plain form
8156 113541 71659 57162 95958 109212 88270 52839 7993 58007 151585 184191 146006 145013
8144 145013 143502 159129 128579 87110 78716 66283 112683 98421 119164 106953 72686 49456
8132 49456 28592 17232 22570 52418 77600 193222 234696 118631 26678 53237 119455 116261
8120 116261 51764 78668 91006 86577 170638 229188 226976 219727 210382 240937 282592 299793
8108 299793 281316 191312 185470 262431 262299 224723 220388 202790 195407 221209 205470 182306 196292
8095 196292 169999 121375 88786 105108 106069 54714 60430 84905 110375 148412 164064 157494
8083 157494 110942 95331 99676 103651 142579 157141 155179 186697 208045 240773 247369 213529
8071 213529 285818 310144 321613 447855 582454 663588 730658 689026 699766 674061 628303
$$ packed form
8156A13541m1882j4497L8796J3254k0942l5431m4846N0014R3578L2606l8185r93
8144A45013j511J5627l0550m1469q394j2433M6400j4262K0743j2211l4267k3230
8132D9456k0864j1360N338K9848K5182J15622M1474j16065r1953K6559O6218l194
8120A16261o4497K6904J2338m429Q4061N8550k212p249r345L0555M1655J7201
8108B99793j8477r0004n842P6961j32l7576m335j7598p383K5802j5739k3164J3986
8095A96292k6293m8624l2589J6322R61n1355N716K4475K5470L8037J5652o570
8083A57494m6552j5611M345L975L8928J4562j962L1518K1348L2728O596l3840
8071B13529P2289K4326J1469J26242J34599Q1134O7070m1632J0740k5705m5758
$$ plain form
8060 628303 521450 435032 388026 420523 386622 339059 302570 288173 278063 250460 192508
8049 192508 200978 210401 197155 203540 144582 135887 148632 121499 138880 155843 174499 236844
8037 236844 266178 287027 243017 272716 259271 200649 239798 254119 260293 287704 377349 338392
8025 338392 279362 294319 398275 442295 398333 454534 574106 564567 501321 427185 346160
8014 346160 268715 239416 274598 242171 230445 252790 254237 199484 196117 203943 194780 205708
8002 205708 186958 154551 121821 113594 85687 89542 103709 112594 98438 112648 136067 203478
7990 203478 287866 308230 279863 254531 215288 154400 133155 159843 110255 180265 218604 236667
7978 236667 211169 218960 204156 164083 134710 131995 147011 169247 181719 203974 226065 200522
$$ packed form
8060F28303j06853q6418m7006L2497l3901m7563l6489j4397j0110k7603n7952
8049A92508Q470R423j3246O385n8958q695J2745k7133J7381J6963J8656O2345
8037B36844K9334K0849m4010K9699j3445n8622L9149J4321O174K7411Q9645l8957
8025C38392n9030J4957J03956M4020m3962N6201J19572r539o3246p4136q1025
8014C46160p7445k9299L5182l2427j1726K2345J447n4753l367P826r163J0928
8002B05708j8750l2407l2730q227k7907L855J4167Q885j4156J4210K3419O7411
7990B03478Q4388K0364k8367k5332l9243o0888k1245K6688m9588P0010L8339J8063
7978B36667k5498P791j4804m0073k9373k715J5016K2236J2472K2255K2091k5543
$$ plain form
7966 200522 239939 206151 137779 133869 133980 171994 244764 259403 199944 161044 150731 151334 202099
7953 202099 196755 139238 142917 204104 228816 235759 205603 169596 200505 186608 145417 139219
7941 139219 170747 148988 171553 151339 170066 183793 209232 199260 209771 208173 171182 180554
7929 180554 166870 191937 214868 231892 217526 192134 156451 152920 137211 161556 197220 242697
7917 242697 240025 249838 252023 226085 214314 259105 292864 253905 242809 231340 174362 80831
7905 80831 106128 110494 177534 234144 257522 211997 215029 208156 170928 173964 186572 167309 102809
7892 102809 79928 81595 49273 59076 89484 97524 99910 134893 157506 105799 39938 62995
7880 62995 168189 202137 221593 200565 188914 203297 137414 120392 109187 80297 55246 65870
$$ packed form
7966B00522L9417l3788o8372l910J11L8014P2770J4639n9459l8900j0313O03N0765
7953B02099n344n7517L679O1187K4712O943l0156l6007L0909j3897m1191o198
7941A39219L1528k1759K2565k0214J8727J3727K5439r972J0511j598l6991R372
7929A80554j3684K5067K2931J7024j4366k5392l5683l531j5709K4345L5664M5477
7917B42697k672R813K185k5938j1771M4791L3759l8959j1096j1469n6978r3531
7905H0831K5297M366O7040N6610K3378m5525L032o873l7228L036J2608j9263o4500
7892A02809k2881J667l2322R803L0408Q040K386L4983K2613n1707o5861K3057
7880F2995J05194L3948J9456k1028j1651J4383o5883j7022j1205k8890k5051J0624
$$ plain form
7868 65870 76298 106295 120557 121805 91219 83022 31423 46271 79026 114147 137117 112741
7856 112741 49210 47779 86785 122909 145607 155744 181760 189621 186247 191064 201601 261746
7844 261746 262055 190812 125036 80295 105975 131006 109968 71155 29080 64836 23828 14672
7832 14672 23651 64820 72221 130842 143416 93685 34802 -5485 -41667 -60788 -53656 -33969
7820 -33969 21436 72255 77561 -905 -2917 68323 147225 104499 96460 57960 28251 40684
7808 40684 77984 91785 76179 32744 -11297 -9319 63031 63543 35293 4885 30067 72849
7796 72849 118949 133735 132311 124570 87245 27560 32940 66789 69790 -5373 22298 -15256 -55879
7783 -55879 -56193 -33659 -11745 48407 28918 -9285 21749 12663 -30382 -10243 5467 12540 30948
$$ packed form
7868F5870J0428K9997J4262J248l0586q197n1599J4848L2755L5121K2970k4376
7856A12741o3531j431L9006L6124K2698J0137K6016P861l374M817J0537O0145
7844B61746L09p1243o5776m4741K5680K5031k1038l8813m2075L5756m1008r156
7832A4672Q979M1169P401N8621J2574m9731n8883m0287l6182j9121P132J9687
7820c3969N5405N0819N306p8466k012P1240P8902m2726q039l8500k9709J2433
7808D0684L7300J3801j5606m3435m4041J978P2350N12k8250l0408K5182M2782
7796G2849M6100J4786j424p741l7325n9685N380L3849L001p5163K7671l7554m0623
7783e5879l14K2534K1914O0152j9489l8203L1034r086m3045K0139J5710P073J8408
$$ plain form
7770 30948 -6394 -38084 -20353 -44005 -71596 -44722 9813 -10024 28345 25703 66154 133679
7758 133679 109973 58857 29003 17288 50035 47947 20397 20215 18568 20450 65178 117693 77970
7745 77970 54855 86983 74832 29547 1156 31544 80705 87617 26477 21094 50979 115788
7733 115788 119061 41573 -46665 -43656 -22131 -31969 12929 12601 -14941 -62336 -68627 -37843 -13641
7720 -13641 -32740 -56097 -61452 -47765 -5877 28612 38978 -677 12979 40187 25645 13875
7708 13875 -38221 -79158 -33122 59405 86862 47988 67236 95527 61228 32590 56306 50618
7696 50618 49660 50717 17738 -19855 -34953 24586 26920 -5165 34666 46488 10732 6027 26516
7683 26516 33004 45946 73200 110391 74720 15029 46702 24674 -64975 -116514 -114073 -95552
$$ packed form
7770C0948l7342l1690J7731k3652k7591K6874N4535j9837L8369k642M0451O7525
7758A33679k3706n1116k9854j1715L2747k088k7550j82j647J882M4728N2515l9723
7745G7970k3115L2128j2151m5285k8391L0388M9161O912o1140n383K9885O4809
7733A15788L273p7488q8238L009K1525r838M4898l28k7542m7395o291L0784K4202
7720a3641j9099k3357n355J3687M1888L4489J0366l9655J3656K7208j4542j1770
7708A3875n2096m0937M6036R2527K7457l8874J9248K8291l4299k8638K3716n688
7696E0618r58J057l2979l7593j5098N9539K334l2085L9831J1822l5756m705K0489
7683B6516O488J2942K7254L7191l5671n9691L1673k2028q9649n1539K441J8521
$$ plain form
7671 -95552 -43517 -93698 -97605 -31322 -14491 -14624 -31912 -74304 -58839 2846 50568 47820 60322
7658 60322 84961 73540 42274 24431 4035 -25554 -23906 -49624 -38072 -32551 -7089 43863
7646 43863 45662 64812 55564 -2063 -20705 8929 68650 79288 93730 78804 103699 118675
7634 118675 -16034 -38488 1320 7572 -5264 -19705 16051 30501 56687 -3304 -3619 37861
7622 37861 39815 58589 47220 -3166 4677 63271 79988 71160 18705 42028 38705 11631 -29809
7609 -29809 -40904 23382 26770 8137 8703 11124 1504 -35099 -56979 -73629 -110240 -140483 -121984
7596 -121984 -96870 -71286 -30420 -64520 -100639 -79093 -81421 -75476 -58418 -35618 -8508 34169
7584 34169 46530 47127 75287 34686 17374 -14110 -33634 -4885 25323 40961 43682 -10996
$$ packed form
7671i5552N2035n0181l907O6283J6831j33j7288m2392J5465O1685M7722k748J2502
7658F0322K4639j1421l1266j7843k0396k9589J648k5718J1552N521K5462N0952
7646D3863J799J9150r248n7627j8642K9634N9721J0638J4442j4926K4895J4976
7634A18675j34709k2454L9808O252j2836j4441L5756J4450K6186n9991l15M1480
7622C7861J954J8774j1369n0386P843N8594J6717q828n2455K3323l323k7074m1440
7609b9809j1095O4286L388j8633N66K421r620l6603k1880j6650l6611l0243J8499
7596a21984K5114K5584M0866l4100l6119K1546k328N945J7058K2800K7110M2677
7584C4169J2361N97K8160m0601j7312l1484j9524K8749L0208J5638K721n4678
$$ plain form
7572 -10996 23833 51044 30502 21207 450 -20775 13290 57282 46078 17475 -16638 -4029
7560 -4029 56346 58317 -3553 -20779 -16191 39310 93029 89391 24023 -33710 33994 102135 62772
7547 62772 329 -4646 -21613 -24797 29719 13543 10320 -18553 -39960 -25232 -38228 -296
7535 -296 28988 18068 33782 33896 1119 313 -32143 -43325 -7918 22489 81746 75890 20056
7522 20056 -28317 -40909 -77927 -21026 -3412 29747 6927 2288 -6656 14123 5909 -28384
7510 -28384 29847 86141 124278 165627 125153 106364 90938 84888 34000 12514 10521 -16822
7498 -16822 26940 -125 -36698 -52618 -76434 -44930 -10182 -51960 -69773 -67299 -38564 40843
7486 40843 75034 2948 -46179 -73665 -69764 -62627 -83667 -99894 -75422 -45107 -13626 -3659
$$ packed form
7572a0996L4829K7211k0542r295k0757k1225L4065M3992j1204k8603l4113J2609
7560d029O0375J971o1870j7226M588N5501N3719l638o5368n7733O7704O8141l9363
7547F2772o2443m975j6967l184N4516j6176l223k8873k1407J4728j2996L7932
7535b96K9284j0920J5714J14l2777q06l2456j1182L5407L0407N9257n856n5834
7522B0056m8373j2592l7018N6901J7614L3159k2820m639q944K0779q214l4293
7510b8384N8231N6294L8137M1349m0474j8789j5426o050n0888k1486j993k7343
7498a6822M3762k7065l6573j5920k3816L1504L4748m1778j7813K474K8735P9407
7486D0843L4191p2086m9127k7486L901P137k1040j6227K4472L0315L1481R967
$$ plain form
7474 -3659 -23915 -30610 -81457 -75669 -34177 -66191 -94254 -44674 1342 29949 51680 5117
7462 5117 -48765 -72147 -3965 51668 51950 49387 26496 19083 -43001 -69659 -30304 5558 50931
7449 50931 92270 87234 98883 118057 62079 -913 35323 66226 127387 126129 37143 18359
7437 18359 83557 93742 87368 122237 122287 68304 94355 39615 -13375 -34852 -28660 21171 632
7424 632 20238 68319 50974 55327 51204 40308 24158 3739 44062 14324 14679 38818 -11676
7411 -11676 -12279 17105 91768 114356 78189 69689 50475 17928 -13129 -25614 -36008 -18053
7399 -18053 -12225 -6979 -17033 -64515 -103371 -92995 -105603 -51625 -28158 -45075 -113447 -125761
7387 -125761 -120159 -120281 -31393 66658 78474 11189 -19230 -2340 28456 21744 33818 45400
$$ packed form
7474c659k0256o695n0847N788M1492l2014k8063M9580M6016K8607K1731m6563
7462E117n3882k3382O8182N5633K82k563k2891p413o2084k6658L9355L5862M5373
7449E0931M1339n036J1649J9174n5978o2992L6236L0903O1161j258q8986j8784
7437A8359O5198J0185o374L4869N0n3983K6051n4740n2990k1477O192M9831k0539
7424F32J9606M8081j7345M353m123j0896j6150k0419M0323k9738L55K4139n0494
7411a1676o03K9384P4663K2588l6167q500j9214l2547l1057j2485j0394J7955
7399a8053N828N246j0054m7482l8856J0376j2608N3978K3467j6917o8372j2314
7387a25761N602j22Q8888R8051J1816o7285l0419J6890L0796o712J2074J1582
$$ plain form
7375 45400 -20901 -49348 8867 6115 1272 33359 41763 44827 72268 27908 -52529 -66352 -62923
7362 -62923 -55608 -36550 -650 18032 -15105 -112796 -116832 -103712 -86833 -74542 -33346 -64411
7350 -64411 -108863 -132877 -115699 -177128 -153032 -95325 -60768 -27118 -25195 -44411 -48200 -81949
7338 -81949 -75582 -85819 -33841 12671 -6542 163 -19267 -34633 -55002 -16420 14484 -34780
7326 -34780 -51165 -73892 -33121 8299 -29898 -120414 -100099 -48670 -2062 -12794 -29603 -74039
7314 -74039 -62134 26123 20093 -21868 -42817 -38727 -26159 -34385 -61780 -75543 -41214 -17351
7302 -17351 -20297 -72713 -85720 -89237 -43022 -10559 31146 46296 -3763 -10577 7841 33927
7290 33927 86238 148091 102486 28012 -19453 -50775 -12844 26165 40784 17547 14194 39100
$$ packed form
7375D5400o6301k8447N8215k752m843L2087Q404L064K7441m4360q0437j3823L429
7362f2923P315J9058L5900J8682l3137r7691m036J3120J6879J2291M1196l1065
7350f4411m4452k4014J7178o1429K4096N7707L4557L3650J923j9216l789l3749
7338h1949O367j0237N1978M6512j9213O705j9430j5366k0369L8582L0904m9264
7326c4780j6385k2727M0771M1420l8197r0516K0315N1429M6608j0732j6809m4436
7314g4039J1905Q8257o030m1961k0949M090J2568q226k7395j3763L4329K3863
7302a7351k946n2416j3007l517M6215L2463M1705J5150n0059o814J8418K6086
7290C3927N2311O1853m5605p4474m7465l1322L7931L9009J4619k3237l353K4906
$$ plain form
7278 39100 44339 -28334 -12318 14250 7223 17976 2634 -8123 -25551 -19781 14964 22237 23793
7265 23793 41720 72841 78166 67263 56876 46297 53572 72877 59159 46019 49449 72489
7253 72489 59552 26230 18195 21027 48667 75362 69420 62812 29215 -9934 -63480 -101718 -67234
7240 -67234 -18736 17336 88087 61940 26006 -336 18978 -8860 45150 58527 21317 33458
7228 33458 8917 47217 56115 93498 98812 129590 139454 67424 52526 60420 34974 20347 67102
7215 67102 57953 -43602 -97992 -85573 -29745 -42570 -55289 -17625 91282 89015 10616 -19159
7203 -19159 -13762 21206 50177 27267 22912 19810 6251 -6100 34690 62834 34659 -53216
7191 -53216 -68863 -4111 -25408 -39728 -22933 18937 15110 4564 50593 51468 29407 53893
$$ packed form
7278C9100N239p2673J6016K6568p027J0753j5342j0757j7428N770L4745P273J556
7265B3793J7927L1121N325j0903j0387j0579P275J9305j3718j3140L430K3040
7253G2489j2937l3322q035K832K7640K6695n942o608l3597l9149n3546l8238L4484
7240f7234M8498L6072P0751k6147l5934k6342J9314k7838N4010J3377l7210J2141
7228C3458k4541L8300Q898L7383N314L0778R864p2030j4898P894k5446j4627M6755
7215F7102r149j01555n4390J2419N5828j2825j2719L7664J08907k267p8399k9775
7203a9159N397L4968K8971k2910m355l102j3559j2351M0790K8144k8175q7875
7191e3216j5647O4752k1297j4320J6795M1870l827j0546M6029Q75k2061K4486
$$ plain form
7179 53893 28684 2456 -26895 -27720 -56142 -50170 -53339 -38052 -61135 -113948 -139319 -95367 -46561
7166 -46561 26937 -10367 -14399 -36559 -33089 -41632 -31650 -22441 -58279 -57222 -31623 -36116 -62511
7153 -62511 -74433 -55906 -71812 -91637 -74474 -85294 -82519 -79800 -10443 41057 16742 -4985
7141 -4985 -63004 -89801 -42213 -69540 -3817 90102 125358 93516 86583 73532 67494 28413
7129 28413 16932 57388 79658 23576 8705 -20602 -32352 7127 67617 78474 5419 -15117
7117 -15117 -26436 -1203 -13560 13556 60746 29144 -72286 -104273 -53372 -116788 -167216 -126998
7105 -126998 -53483 27710 66634 5503 -15243 -37982 -60168 -56005 -11807 26880 59610 104343
7093 104343 49224 -11980 -74026 -19447 -5521 -37373 -47315 -54573 -18413 -25875 -42384 -45797
$$ packed form
7179E3893k5209k6228k9351q25k8422N972l169J5287k3083n2813k5371M3952M8806
7166d6561P3498l7304m032k2160L470q543R982R209l5838J057K5599m493k6395
7153f2511j1922J8527j5906j9825J7163j0820K775K719O9357N1500k4315k1727
7141d985n8019k6797M7588k7327O5723R3919L5256l1842o933j3051o038l9081
7129B8413j1481M0456K2270n6082j4871k9307j1750L9479O0490J0857p3055k0536
7117a5117j1319K5233j2357K7116M7190l1602j01430l1987N0901o3416n0428M0218
7105a26998P3515Q1193L8924o1131k0746k2739k2186M163M4198L8687L2730M4733
7093A04343n5119o1204o2046N4579J3926l1852r942p258L6160p462j6509l413
$$ plain form
7081 -45797 -71546 -31095 -29919 13581 22294 -37086 -71710 -89307 -67745 -4741 10787 -4611
7069 -4611 18648 -20896 -17364 9328 19465 -12526 33697 54933 23457 19506 6831 -35001
7057 -35001 -89245 -107626 -125879 -125312 -61432 -47513 -46210 -26952 -46403 -62248 -26645 29852
7045 29852 47703 78574 86753 -16501 -129851 -142467 -76501 -70192 -36338 1672 27602 7327
7033 7327 -16564 -15852 -34426 -13089 11717 -1671 -5066 54470 73874 16422 -45592 -15960 19207
7020 19207 18286 17182 55351 60541 63593 44491 42686 -7497 32459 99001 84946 -4096 -21232
7007 -21232 -44733 -44897 -11953 -13350 -67843 -48376 1238 22194 16750 19350 3095 40379 40570
6994 40570 -11856 -43358 -96736 -76030 -7553 7417 -43299 -27234 -34458 -67491 -83601 -16768
$$ packed form
7081d5797k5749M0451J176M3500Q713n9380l4624j7597K1562O3004J5528j5398
7069d611K3259l9544L532K6692J0137l1991M6223K1236l1476l951j2675m1832
7057c5001n4244j8381j8253N67O3880J3919J303J9258j9451j5845L5603N6497
7045B9852J7851L0871Q179j03254j13350j2616O5966O309L3854L8010K5930k0275
7033G327k3891P12j8574K1337K4806j3388l395N9536J9404n7452o2014K9632L5167
7020A9207r21j104L8169N190L052j9102j805n0183L9956O6542j4055q9042j7136
7007b1232k3501j64L2944j397n4493J9467M9614K0956n444K600j6255L7284J91
6994D0570n2426l1502n3378K0706O8477J4970n0716J6065p224l3033j6110O6833
$$ plain form
6982 -16768 14440 -13742 -26321 -40235 -41330 -16418 19936 -17106 -54543 -100790 -105246 -95472
6970 -95472 -106387 -56763 23417 13810 -4390 34119 67194 51609 67303 51704 5561 11654
6958 11654 -12342 -12445 434 -51043 -67653 -61523 -73268 -54201 3663 14510 -1428 -20660
6946 -20660 -5989 19678 22405 34649 34928 -1034 -50241 -38947 -44764 -62987 -87213 -44398 24065
6933 24065 -6270 -30216 -1629 -16197 -57434 -51822 -17924 66918 107071 58134 -8643 -24971
6921 -24971 -19 -5334 48920 66654 -13290 -30110 -10259 -24406 -75942 -46651 -29869 -82376
6909 -82376 -69075 -47452 -16058 -21119 -79044 -76370 -110322 -129452 -120908 -47439 34100 47442
6897 47442 -1803 -31993 16221 30108 -11704 -18334 7590 -373 9446 25439 4302 -4051 -20730
$$ packed form
6982a6768L1208k8182j2579j3914j095K4912L6354l7042l7437m6247m456R774
6970i5472j0915M9624Q0180r607j8200L8509L3075j5585J5694j5599m6143O093
6958A1654k3996j03J2879n1477j6610O130j1745J9067N7864J0847j5938j9232
6946b0660J4671K5667K727J2244K79l5962m9207J1294n817j8223k4226M2815O8463
6933B4065l0335k3946K8587j4568m1237N612L3898Q4842M0153m8937o6777j6328
6921b4971K4952n315N4254J7734p9944j6820J9851j4147n1536K9291J6782n2507
6909h2376J3301K1623L1394n061n7925K674l3952j9130Q544P3469Q1539J3342
6897D7442m9245l0190M8214J3887m1812o630K5924p963R819J5993k1137q353j6679
$$ plain form
6884 -20730 -53316 -48132 -31804 -36521 -13826 33304 36924 6677 9316 7910 16323 41521 8343
6871 8343 27705 49323 -28499 -29 -17916 -26486 14986 10215 -27396 -61080 -43932 -13997
6859 -13997 -10717 -31131 -48270 -44263 6472 32655 -16194 -69476 -72724 -60224 -26657 165
6847 165 -16999 -3530 86333 111216 65906 31512 54067 38695 -26431 -79096 -77484 -16034
6835 -16034 -4415 20073 61725 74593 69988 51258 -4691 -36701 -31894 3729 -15968 -11285
6823 -11285 20336 41459 1455 12016 6194 28785 77643 83696 24933 18802 10641 -1446 -12563
6810 -12563 -10339 -8122 -958 1360 -33308 -32432 38493 55986 111448 102755 69138 53904 72804
6797 72804 77447 52854 9771 -18755 17797 71149 69069 6314 -49385 -42496 -59978 -22833
$$ packed form
6884b0730l2586N184J6328m717K2695M7130L620l0247K639j406Q413K5198l3178
6871H343J9362K1618p7822K8470j7887q570M1472m771l7611l3684J7148K9935
6859a3997L280k0414j7139M007N0735K6183m8849n3282l248J2500L3567K6822
6847A65j7164J3469Q9863K4883m5310l4394K2555j5372o5126n2665J612O1450
6835a6034J1619K4488M1652J2868m605j8730n5949l2010M807L5623j9697M683
6823a1285L1621K1123m0004J0561n822K2591M8858O053n8763o131q161j2087j1117
6810a2563K224K217P164K318l4668Q76P0925J7493N5462q693l3617j5234J8900
6797G2804M643k4593m3083k8526L6552N3352k080o2755n5699O889j7482L7145
$$ plain form
6785 -22833 6222 -14604 -10163 -29175 -56051 1708 6301 29181 30187 22520 -18705 -95807 -89420
6772 -89420 -72269 -82189 -33403 14181 48940 103159 68153 5500 23849 53617 8225 -17461
6760 -17461 -17493 44470 -8045 -36464 11691 -27662 -25173 -44988 -12959 1513 -21530 -17832 36008
6747 36008 -10724 -86220 -78017 -47860 -3787 12251 14796 -3010 19786 18408 8928 2283 -9162
6734 -9162 18823 741 11783 1241 -15996 -43252 -39518 -35292 -42075 -26096 -12360 18777 -6936
6721 -6936 -18848 3564 63525 64146 21475 15440 92664 107652 135582 65023 90855 171535 214319
6708 214319 167451 136324 33155 -27926 36666 51479 9137 19945 47026 28073 5749
6697 5749 -8632 25595 11992 -28564 -55293 -6147 65900 97684 13503 -45693 -40947 -14164
$$ packed form
6785b2833K9055k0826M441j9012k6876N7759M593K2880J006p667m1225p7102O387
6772h9420J7151r920M8786M7584L4759N4219l5006o2653J8349K9768m5392k5686
6760a7461l2O1963n2515k8419M8155l9353K489j9815L2029J4472k3043L698N3840
6747C6008m6732p5496Q203L0157M4073J6038K545j7806K2796j378r480o645j1445
6734i162K7985j8082J1042j0542j7237k7256L734M226o783J5979J3736L1137k5713
6721f936j1912K2412N9961O21m2671o035P7224J4988K7930p0559K5832Q0680M2784
6708B14319m6868l1127j03169o1081O4592J4813m2342J0808K7081j8953k2324
6697E749j4381L4227j3603m0556k6729M9146P2047L1784q4181n9196M746K6783
$$ plain form
6685 -14164 -17681 -21539 28251 -10604 -28483 -38107 -79779 -29066 12623 1016 229 31316 18011
6672 18011 -19534 27214 17906 33880 48088 24967 1004 -8681 22497 31055 14148 3594
6660 3594 -58501 -48597 7249 9371 -25674 -64170 -37499 -30526 7785 960 7543 6312 1748
6647 1748 -8418 -56463 -127690 -112126 -55312 -16485 11912 2963 14691 43626 113041 123206
6635 123206 62983 -1577 50933 45522 -8253 -6010 -33093 -24883 74824 24536 -13406 -71083
6623 -71083 -116275 -88104 -85042 -79059 -58969 -108937 -88539 -65714 -28455 32193 1346 -8344
6611 -8344 2192 38492 -3730 -33965 -66568 -32752 -1519 5967 41571 58099 57118 44966 -39153
6598 -39153 -92615 -70512 -5733 -1385 -50550 -72156 -86823 -120376 -136869 -115015 -58010 2847
$$ packed form
6685a4164l517l858M9790l8855j7879r624m1672N0713M1689j1607p87L1087j3305
6672A8011l7545M6748r308J5974J4208k3121k3963r685L1178Q558j6907j0554
6660C594o2095R904N5846K122l5045l8496K6671O973L8311o825O583j231m564
6647A748j0166m8045p1227J5564N6814L8827K8397q949J1728K8935O9415J0165
6635A23206o0223o4560N2510n411n3775K243k7083Q210R9707n0288l7942n7677
6623g1083m5192K8171L062N983K0090m9968K0398K2825L7259O0648l0847r690
6611h344J0536L6300m2222l0235l2603L3816L1233P486L5604J6528r81j2152q4119
6598c9153n3462K2103O4779M348m9165k1606j4667l3553j6493K1854N7005O0857
$$ plain form
6586 2847 -21193 -29203 12976 29418 15822 14754 47907 87744 74166 36059 -2244 6424 28337
6573 28337 78784 95258 48144 34498 29330 25726 -33598 -95638 -90088 -47771 -15859 -9315 -28164
6560 -28164 -18512 6450 30519 -4596 -73585 -68438 6080 24226 5987 9974 41309 -44269
6548 -44269 -125456 -74804 -73074 -94678 -84178 -41533 -17828 162 36440 -15232 -14199 -6472
6536 -6472 -50579 -68185 -85479 -44289 -57763 -94695 -108111 -81225 -21750 -21177 -27342 -2696 27246
6523 27246 -24196 -46823 -25514 -20401 -34403 -40805 -48786 -82521 -79405 -8776 49842 42170 60633
6510 60633 27025 -104307 -146418 -97362 -67759 -107299 -71194 -16287 -15634 8871 -15900 -52470
6498 -52470 -37876 -22732 22390 75785 69864 4745 -10720 16486 38699 -11297 -6523 -8779
$$ packed form
6586B847k4040q010M2179J6442j3596j068L3153L9837j3578l8107l8303Q668K1913
6573B8337N0447J6474m7114j3646n168l604n9324o2040N550M2317L1912O544j8849
6560b8164R652K4962K4069l5115o8989N147P4518J8146j8239L987L1335q5578
6548d4269q1187N0652J730k1604J0500M2645K3705J7990L6278n1672J033P727
6536f472m4107j7606j7294M1190j3474l6932j3416K6886N9475N73o165K4646K9942
6523B7246n1442k2627K1309N113j4002o402p981l3735L116P0629N8618p672J8463
6510F0633l3608j31332m2111M9056K9603l9540L6105N4907O53K4505k4771l6570
6498e2470J4594J5144M5122N3395n921o5119j5465K7206K2213m9996M774k256
$$ plain form
6486 -8779 24894 54747 79253 43528 -8825 -11956 -51782 -48666 -85259 -101051 -104401 -75912 -45589
6473 -45589 3667 9834 -22856 -65057 -71166 -111970 -103188 -50244 -21656 -18210 -21519 -34078 -62673
6460 -62673 -42073 -30657 -856 -6702 4669 12097 7296 -26365 -32473 12189 33128 30708 9779
6447 9779 8094 28158 -3378 -66958 -22890 7844 -14404 -43311 -129376 -161204 -93718 -26622
6435 -26622 34769 -1620 -31946 -3779 84141 101128 15754 -3299 18038 -638 -8269 -14473
6423 -14473 -35595 -55951 -102041 -106871 -96747 -86444 -101861 -103066 -33269 -13792 -41641 -29427
6411 -29427 36860 50034 71286 13186 -31607 -21345 42918 100852 50269 -28202 -40551 -32212
6399 -32212 29321 48075 61517 51294 55246 76605 93331 76582 18673 19959 9807 62123
$$ packed form
6486h779L3673K9853K4506l5725n2353l131l9826L116l6593j5792l350K8489L0323
6473d5589M9256O167l2690m2201o109m0804Q782N2944K8588L446l309j2559k8595
6460f2673K0600J1416K9801n846J1371P428m801l3661o108M4662K0939k420k0929
6447I779j685K0064l1536o3580M4068L0734k2248k8907q6065l1828O7486O7096
6435b6622O1391l6389l0326K8167Q7920J6987q5374j9053K1337j8676p631o204
6423a4473k1122k0356m6090m830J0124J0303j5417j205O9797J9477k7849J2214
6411b9427O6287J3174K1252n8100m4793J0262O4263N7934n0583p8471j2349Q339
6399c2212O1533J8754J3442j0223L952K1359J6726j6749n7909J286j0152N2316
$$ plain form
6387 62123 104230 82491 62635 91915 82723 18268 2749 2871 71792 22755 -53280 -34247
6375 -34247 30872 31875 -1934 -66480 -123830 -129475 -49691 19595 2988 -19782 -23464 -43560
6363 -43560 7442 14704 -60748 -64976 -11897 20623 25371 29212 51557 63786 47910 61212 31336
6350 31336 37549 74712 56334 86608 100730 77399 43063 5318 5964 47932 52525 34452 54320
6337 54320 86394 101947 74575 52951 55540 68918 76514 77914 109525 60556 58661 35926 23691
6324 23691 -34047 -13838 -27118 -61465 -53479 -42608 2995 -21410 -11773 35950 33822 -3003
6312 -3003 28210 46163 51718 11503 -15272 16288 -8764 -55825 -78430 -1849 47638 29280
6300 29280 -220 -44170 -49698 -2535 33965 20381 -9906 -44878 -53125 -82662 -92011 -115806
$$ packed form
6387F2123M2107k1739j9856K9280r192o4455j5519J22O8921m9037p6035J9033
6375c4247O5119J003l3809o4546n7350n645P9784O9286j6607k2770l682k0096
6363d3560N1002P262p5452m228N3079L2520M748L841K2345J2229j5876J3302k9876
6350C1336O213L7163j8378L0274J4122k3331l4336l7745O46M1968M593j8073J9868
6337E4320L2074J5553k7372k1624K589J3378P596J400L1611m8969j895k2735j2235
6324B3691n7738K0209j3280l4347P986J0871M5603k4405R637M7723k128l6825
6312c003L1213J7953N555m0215k6775L1560k5052m7061k2605P6581M9487j8358
6300B9280k9500m3950n528M7163L6500j3584l0287l4972q247k9537r349k3795
$$ plain form
6288 -115806 -169444 -162763 -100723 -41521 -43399 -98420 -81714 -83867 -99390 -67608 -60268 -81629
6276 -81629 -46877 -8250 -53583 -59628 1385 -35205 -31640 -21648 -4868 52362 28513 14729
6264 14729 27499 16267 27091 77763 94999 89937 41278 25391 15908 76525 138933 127608
6252 127608 48102 -24745 -44875 -86467 -75382 -23532 12497 58742 14931 -51841 -63711 -12884
6240 -12884 41279 73750 45490 24580 11586 8032 10076 41652 95363 76414 67197 29599
6228 29599 26815 -2921 8990 32802 16627 32402 9649 -37466 -57133 -33158 -35003 -39371
6216 -39371 7272 28536 39666 -12049 -12336 5887 41883 29462 30745 35740 29895 -15065 -35857
6203 -35857 -23045 -4987 -6494 -27486 24703 51580 58719 100778 42523 -7201 2554 60532
$$ packed form
6288a15806n3638O681O2040N9202j878n5021J6706k153j5523L1782P340k1361
6276h1629L4752L8627m5333o045O1013l6590L565R992J6780N7230k3849j3784
6264A4729J2770j1232J0824N0672J7236n062m8659j5887r483O0617O2408j1325
6252A27608p9506p2847k0130m1592J1085N1850L6029M6245m3811o6772j1870N0827
6240a2884N4163L2471k8260k0910j2994l554K044L1576N3711j8949r217l7598
6228B9599k784k9736J1911K3812j6175J5775k2753m7115j9667K3975j845m368
6216c9371M6643K1264J1130n1715k87J8223L5996j2421J283M995n845m4960k0792
6203c5857J2812J8058j507k0992N2189K6877P139M2059n8255m9724R755N7978
$$ plain form
6191 60532 62157 65206 27607 -24503 -58358 -52980 -26478 -52536 -39525 -8589 -28814 -36058 12099
6178 12099 24090 45904 49910 2627 13324 27603 -18522 -21454 -18144 27795 38078 74882
6166 74882 76197 14129 -32451 -21752 -40232 1170 35781 -15820 -29733 -9973 -37138 -14665
6154 -14665 81916 106933 133036 135516 141633 136505 125021 136215 95093 52209 10947 -14576
6142 -14576 -8459 -15473 -36446 -21728 -4083 -31748 -55217 -47969 -88329 -61709 22923 4811
6130 4811 -34970 5180 29441 -119 -64472 -63253 -47036 -24824 -163 11156 -10367 -52185
6118 -52185 -84240 -61778 -61616 -1500 31068 17348 36318 -2491 -82959 2993 23331 39366
6106 39366 44584 -24771 -117026 -147525 -83992 -20254 10293 1631 5419 9050 27983 51455 90794
$$ packed form
6191F0532J625L049l7599n2110l3855N378K6502k6058J3011L0936k0225p244M8157
6178A2099J1991K1814M006m7283J0697J4279m6125k932L310M5939J0283L6804
6166G4882J315o2068m6580J0699j8480M1402L4611n1601j3913J9760k7165K2473
6154a4665R6581K5017K6103K480O117n128j1484J1194m1122m2884m1262k5523
6142a4576O117p014k0973J4718J7645k7665k3469P248m0360K6620Q4632j8112
6130D811l9781M0150K4261k9560o4353J219J6217K2212K4661J1319k1523m1818
6118e2185l2055K2462J62O0116L2568j3720J8970l8809q0468Q5952K0338J6035
6106C9366N218o9355r2255l0499O3533O3738L0547q662L788L631J8933K3472L9339
$$ plain form
6093 90794 86371 -16410 -52945 -57323 -46187 -40773 -15894 3858 -11825 -37694 -29284 -13052
6081 -13052 -16059 -39524 -58297 -46408 -19495 -49071 -55858 -87812 -149228 -181010 -162631 -145312
6069 -145312 -78158 -40097 -4829 -18378 -16423 -55713 -64498 -88013 -44776 -50276 -36328 25903
6057 25903 16779 -8485 35492 56752 -1725 -13681 -23211 -46511 -72029 -69259 -34210 16783
6045 16783 33338 3421 -27602 -41961 28977 66454 107776 135654 69845 19476 -12581 -90179
6033 -90179 -64485 -19454 -61115 -20354 43900 16782 -9820 -30663 -67017 -87120 -91525 -28646
6021 -28646 46960 85766 74130 62609 41501 34591 18891 43085 45350 61089 83298 63705
6009 63705 62533 49555 39205 -11084 -25675 -49195 -72222 -100877 -86463 -28518 5464 -14608
$$ packed form
6093I0794m423j02781l6535m378J1136N414K4879J9752j5683k5869Q410J6232
6081a3052l007k3465j8773J1889K6913k9576o787l1954o1416l1782J8379J7319
6069a45312O7154L8061L5268j3549J955l9290q785k3515M3237n500J3948O2231
6057B5903r124k5264M3977K1260n8477j1956r530k3300k5518K770L5049N0993
6045A6783J6555k9917l1023j4359P0938L7477M1322K7878o5809n0369l2057p7598
6033i0179K5694M5031m1661M0761O4254k7118k6602k0843l6354k0103m405O2879
6021b8646P5606L8806j1636j1521k1108o910j5700K4194K265J5739K2209j9593
6009F3705j172j2978j0350n0289j4591k3520k3027k8655J4414N7945L3982k0072
$$ plain form
5997 -14608 8916 1684 -33233 -8292 -2779 -27574 -62747 -37070 -19215 -29674 -6169 2400
5985 2400 -28458 -53182 -58407 -18057 15434 28988 19380 17416 -11197 -891 -11125 -57866 -40285
5972 -40285 -42936 -35591 -26782 -17145 -19395 -41439 -54244 -30137 -40396 -7154 -15270 15664 13546
5959 13546 43518 4242 -9935 -15323 -21826 -57888 -52008 -51162 -7650 -27380 -81683 -89605 15898
5946 15898 38266 -15642 -83516 -94611 -93127 -76529 -72808 -76057 -84500 -34209 20320 62534 92649
5933 92649 66131 24278 3153 18710 -10853 -42533 -111446 -145804 -181590 -175209 -151459 -83894
5921 -83894 23647 38402 41470 51593 42789 15092 53821 79725 80981 38840 -48699 -58000
5909 -58000 -36037 -32569 -18424 -16113 -23784 -36525 -30898 -53036 -121877 -98626 -35541 -23861 -10728
$$ packed form
5997a4608K3524p232l4917K4941N513k4795l5173K5677J7855j0459K3505Q569
5985B400l0858k4724n225M0350L3491J3554r608j964k8613J0306j0234m6741J7581
5972d0285k651P345Q809R637k250k2044j2805K4107j0259L3242q116L0934k118
5959A3546K9972l9276j4177n388o503l6062N880Q46M3512j9730n4303p922J05503
5946A5898K2368n3908o7874j1095J484J6598L721l249q443N0291N4529M2214L0115
5933I2649k6518m1853k1125J5557k9563l1680o8913l4358l5786O381K3750O7565
5921h3894J07541J4755L068J0123q804k7697L8729K5904J256m2141q7539r301
5909e8000K1963L468J4145K311p671j2741N627k2138o8841K3251O3085J1680J3133
$$ plain form
5896 -10728 -22167 -56804 -32031 5562 8219 48846 33530 -5012 -472 -64522 -49708 6476
5884 6476 -63086 -33965 23607 -3882 31241 15755 -17226 -42204 -81381 -68955 -19899 38055
5872 38055 50965 51337 4278 9929 1567 18731 38989 5532 -5830 24631 52501 19390 -51964
5859 -51964 -69245 -43304 -35981 -1943 -44136 -34552 -16991 -25167 -60956 -31071 -19992 -51583
5847 -51583 -60786 14728 10432 -9179 -20 23450 44248 52509 32285 -3837 -41877 -24015 1623
5834 1623 10352 -37408 -69061 -82363 -86259 -27608 -38097 -92366 -51237 -46596 -44711 16042 36474
5821 36474 12669 -2228 -61554 -32198 33925 30069 47039 67968 -6073 10344 22652 11632
5809 11632 55725 24688 -55143 -63037 -21422 47753 59803 69658 70066 7424 17335 16044 -53734
$$ packed form
5896a0728j1439l4637K4773L7593K657M0627j5316l8542M540o4050J4814N6184
5884F476o9562K9121N7572k7489L5123j5486l2981k4978l9177J2426M9056N7954
5872C8055J2910L72m7059N651q362J7164K0258l3457j1362L0461K7870l3111p1354
5859e1964j7281K5941P323L4038m2193R584J7561q176l5789K9885J1079l1591
5847e1583r203P5514m296j9611R159K3470K0798Q261k0224l6122l8040J7862K5638
5834A623Q729m7760l1653j3302l896N8651j0489n4269M1129M641J885O0753K0432
5821C6474k3805j4897n9326K9356O6123l856J6970K0929p4041J6417J2308j1020
5809A1632M4093l1037p9831p894M1615O9175J2050R855M08o2642R911j291o9778
$$ plain form
5796 -53734 -60581 -15545 15610 -1826 -9161 44499 106133 68297 20203 9379 58131 18950
5784 18950 -61351 -68576 -41520 -12498 -52832 -90817 -61816 -63816 -93807 -109842 -126230 -88141
5772 -88141 -76456 -65679 -5766 44779 10504 -55543 -71957 -52926 17100 -7926 -46793 -97954
5760 -97954 -141881 -78511 1061 -19766 -13053 -73805 -66351 -42939 -36189 -35940 -5605 5132 -20801
5747 -20801 7987 77271 14133 -73427 -81476 -66502 -22986 -20398 23056 29137 -24832 -84196
5735 -84196 -65993 -38213 -47134 -84768 -92857 -80742 -108583 -105994 -81456 -62768 -42276 5146
5723 5146 11127 -23064 -81490 -65313 -31466 -3104 22146 52726 5438 -2747 -18186 -52387
5711 -52387 -53095 -24168 -52072 -58423 -77508 -48192 11175 4176 -16470 -47421 -37478 -43757 -54841
$$ packed form
5796e3734o847M5036L1155j7436p335N3660O1634l7836m8094j0824M8752l9181
5784A8950q0301p225K7056K9022m0334l7985K9001k000k9991j6035j6388L8089
5772h8141J1685J0777N9913N0545l4275o6047j6414J9031P0026k5026l8867n1161
5760i7954m3927O3370P9572k0827O713o0752P454K3412O750K49L0335J0737k5933
5747b0801K8788O9284o3138q7560q049J4974M3516K588M3454O081n3969n9364
5735h4196J8203K7780q921l7634q089J2115k7841K589K4538J8688K0492M7422
5723E146N981l4191n8426J6177L3847K8362K5250L0580m7288q185j5439l4201
5711e2387p08K8927k7904o351j9085K9316N9367o999k0646l0951R943o279j1084
$$ plain form
5698 -54841 -15860 29993 65911 108487 73150 12673 -62909 -44983 -42093 -3527 21623 64784
5686 64784 6259 -65604 -59038 -72480 -12413 28733 16594 30353 38307 58694 76003 74820
5674 74820 60660 55617 76174 38617 -31851 -47421 -32755 35644 83295 63864 56542 21128
5662 21128 -1422 -18236 -63839 -82148 -32075 -6534 -17439 -42466 -54144 -40563 -50375 19867
5650 19867 36093 11704 -15896 23668 64993 16720 -1417 7050 25506 84281 75794 65833
5638 65833 36163 32180 42875 22466 -47757 -51753 -40038 -35267 -35338 -64984 -90371 -91939 -76561
5625 -76561 -48623 -13467 -19343 2296 19911 63628 53552 5423 -24141 -39373 -101197 -142107
5613 -142107 -134599 -75299 34786 46481 11209 -45426 -46825 -6808 -4503 -7361 -11262 -36472
$$ packed form
5698e4841L8981M5853L5918M2576l5337o0477p5582J7926K890L8566K5150M3161
5686F4784n8525p1863O566j3442O0067M1146j2139J3759P954K0387J7309j183
5674G4820j4160n043K0557l7557p0468j5570J4666O8399M7651j9431p322l5414
5662B1128k2550j6814m5603j8309N0073K5541j0905k5027j1678J3581r812P0242
5650A9867J6226k4389k7600L9564M1325m8273j8137Q467J8456N8775q487r961
5638F5833k9670l983J0695k0409p0223l996J1715M771p1k9646k5387j568J5378
5625g6561K7938L5156n876K1639J7615M3717j0076m8129k9564j5232o1824m0910
5613a42107P508N9300J10085J1695l5272n6635j399M0017K305k858l901k5210
$$ plain form
5601 -36472 -37633 -38014 2276 18728 28568 21124 -11896 -20151 -67836 -66292 -53632 -42363 -44192
5588 -44192 -39689 21666 8038 -14090 1585 51571 85225 100897 12399 -58956 -69751 -17752
5576 -17752 40709 59031 55848 54656 30621 13700 12292 123 3483 -51036 -62610 -41706 -35138
5563 -35138 -19417 -11393 -6935 9039 47011 48065 57539 -497 -51325 -70227 -47811 -26741 1610
5550 1610 -23117 -19756 -8118 -11158 -19089 -14101 -25918 -46336 -24473 33654 57979 -11229 -28396
5537 -28396 -38267 -13799 -21327 -14504 24676 -9883 -70923 -5211 18622 3702 6922 -9843 -3716
5524 -3716 19833 37246 10209 -43475 -85897 -92964 -104748 -111526 -79759 -68068 -89669 -66719
5512 -66719 -67484 -65700 -54129 -53050 -50493 -109831 -86696 -43709 -24105 -54742 -29109 -25038 -59995
$$ packed form
5601c6472j161l81M0290J6452R840p444l3020q255m7685J544J2660J1269j829
5588d4192M503O1355j3628k2128J5675M9986L3654J5672q8498p1355j0795N1999
5576a7752N8461J8322l183j192k4035j6921j408j2169L360n4519j1574K0904O568
5563c5138J5721Q024M458J5974L7972J054R474n8036n0828j8902K2416K1070K8351
5550A610k4727L361J1638l040p931M988j1817k0418K1863N8127K4325o9208j7167
5537b8396r871K4468p528O823L9180l4559o1040O5712K3833j4920L220j6765O127
5524c716K3549J7413k7037n3684m2422p067j1784o778L1767J1691k1601K2950
5512f6719p65J784J1571J079K557n9338K3135M2987J9604l0637K5633M071l4957
$$ plain form
5499 -59995 -40364 33996 43461 52549 -21211 -41677 -45 -49636 -89617 25721 21510 15093
5487 15093 -21878 -76387 -68886 -29576 -10170 15716 10851 -66968 -75373 -12521 43880 81502
5475 81502 -20331 -40465 -33960 -63355 20633 91619 119053 130887 69805 49529 26638 -52169
5463 -52169 -55814 -496 -7252 -10587 20631 -11283 -16512 -5071 795 5813 12914 -21019 -18077
5450 -18077 -11647 -427 1786 -10475 7949 -1017 13611 26092 20268 38475 13577 -50324 -42484
5437 -42484 -26103 -45439 -80964 -77213 -109952 -85025 -46547 -31752 -30674 -37088 6870 36374
5425 36374 11 -68000 -84822 -21908 47069 73987 18183 489 -29514 -74945 -63394 -94074
5413 -94074 -79634 -89361 -60583 -54139 -54479 1877 -46523 -113277 -88588 -36215 -20975 -11344 5264
$$ packed form
5499e9995J9631P4360R465R088p3760k0466M1632m9591l9981J15338m211o417
5487A5093l6971n4509P501L9310J9406K5886m865p7819q405O2852N6401L7622
5475H1502j01833k0134O505k9395Q3988P0986K7434J1834o1082k0276k2891p8807
5463e2169l645N5318o756l335L1218l1914n229J1441N866N018P101l3933K942
5450a8077O430J1220K213j2261J8424q966J4628J2481n824J8207k4898o3901P840
5437d2484J6381j9336l5525L751l2739K4927L8478J4795J078o414M3958K9504
5425C6374l6363o8011j6822O2914O8977K6918n5804j7694l0003m5431J1551l0680
5413i4074J4440r727K8778O444l40N6356m8400o6754K4689N2373J5240R631J6608
$$ plain form
5400 5264 2729 -10464 -96882 -81141 -72812 -91673 -94424 -102676 -60932 -36888 -79665 -37236 24048
5387 24048 65895 26884 7120 6171 -4996 -24154 -25100 -18213 -24562 -41607 -33771 -43852 -26380
5374 -26380 43300 74160 46180 -14787 -32139 -55339 -31680 35591 54263 63397 118096 137468
5362 137468 90656 101610 139307 78924 18399 6251 100154 149999 137845 121128 77103 24824
5350 24824 2179 1878 -32596 -53550 -21322 8240 -11182 -2033 16562 9529 -23810 -37271 9520
5337 9520 110566 105451 98107 71592 20865 33607 -21561 -35741 -75709 -39835 3714 -10111
5325 -10111 20852 17547 36042 32568 -5359 -2359 27682 -1694 -34004 -29452 1806 -29163 -55050
5312 -55050 -53405 -59950 -47125 -6390 -24787 3026 770 -20688 -16270 -10587 24775 68173 38315
$$ packed form
5400E264k535j3193q6418J5741Q329j8861k751q252M1744K4044m2777M2429O1284
5387B4048M1847l9011j9764r49j1167j9158r46O887o349j7045P836j0081J7472
5374b6380O9680L0860k7980o0967j7352k3200K3659O7271J8672R134N4699J9372
5362A37468m6812J0954L7697o0383o0525j2148R3903M9845j2154j6717m4025n2279
5350B4824k2645l01l4474k0954L2228K9562j9422R149J8595p033l3339j3461M6791
5337I520J01046n115p344k6515n0727J2742n5168j4180l9968L5874M3549j3825
5325a0111L0963l305J8495l474l7927L000L0041k9376l2310M552L1258l0969k5887
5312e5050J645o545J2825M0735j8397K7813k256k1458M418N683L5362M3398k9858
$$ plain form
5299 38315 35504 48242 19572 24910 5097 -22584 24178 24637 -5394 -37704 -55941 -48005 -2324
5286 -2324 115 13203 -10693 9902 371 696 18638 -5754 -5344 -14964 14469 59302 62556 -9987
5272 -9987 -17291 24842 -16625 10183 24257 -70744 -79488 -80300 -61302 -30886 -51149 -27977 1461
5259 1461 -18651 -69175 -64646 12481 24668 41237 40847 13405 -7511 -7844 2675 31033 69023
5246 69023 67250 98341 100857 31879 -82477 -117232 -49612 50521 17891 6571 8424 37596
5234 37596 46599 31316 -803 -5185 7596 -10784 -14807 12581 17181 -13682 -50851 -51938 -57911
5221 -57911 -72205 -103564 -69565 -43218 -49763 -80506 -105930 -112141 -63517 10748 59606 55339
5209 55339 1839 -37317 -62610 -49690 -66553 -64318 -31074 -13366 -14194 -16761 854 -18948 -38098
$$ packed form
5299C8315k811J2738k8670N338j9813k7681M6762M59l0031l2310j8237P936M5681
5286b324K439J3088k3896K0595r531L25J7942k4392M10r620K9433M4833L254p2543
5272i987p304M2133m1467K6808J4074r5001q744q12J8998L0416k0263K3172K9438
5259A461k0112n0524M529P7127J2187J6569l90k7442k0916l33J0519K8358L7990
5246F9023j773L1091K516o8978j14356l4755O7620J00133l2630j1320J853K9172
5234C7596R003j5283l2119m382J2781j8380m023K7388M600l0863l7169j087n973
5221e7911j4294l1359L3999K6347o545l0743k5424o211M8624P4265M8858m267
5209E5339n3500l9156k5293J2920j6863K235L3244J7708q28k567J7615j9802j9150
$$ plain form
5196 -38098 -47042 -43368 48553 60269 43194 36739 -4373 -34296 2548 -18714 -14712 -35976 16766
5183 16766 78901 78101 45801 52865 -57613 -87023 -37294 -3479 54186 81726 92712 28002
5171 28002 16507 2348 29374 -1335 -32381 -55647 -29350 -35093 -16754 -34214 -49615 -34627
5159 -34627 -25149 -17650 -43645 -58677 -14462 6503 14903 38001 65732 101114 59331 8288
5147 8288 13146 17358 -66575 -83205 -10523 -22873 -42612 -49088 -46666 -80136 -106474 -67914 -83830
5134 -83830 -69705 -34495 -67478 -61820 -17291 -20378 -62868 -65034 -63323 -25082 -11658 -521 11644
5121 11644 32950 49268 69771 70965 70709 10390 -27848 -6820 18185 1100 -65005 -49333
5109 -49333 -48018 -29871 -3641 -4571 31375 84649 107062 67099 10217 -17908 -17806 14518 18000
$$ packed form
5196c8098q944L674R1921J1716j7075o455m1112k9923L6844k1262M002k1264N2742
5183A6766O2135q00l2300P064j10478k9410M9729L3815N7665K7540J0986o4710
5171B8002j1495j4159K7026l0709l1046k3266K6297n743J8339j7460j5401J4988
5159c4627R478P499k5995j5032M4215K0965Q400K3098K7731L5382m1783n1043
5147H288M858M212q3933j6630P2682j2350j9739o476K422l3470k6338L8560j5916
5134h3830J4125L5210l2983N658M4529l087m2490k166J711L8241J3424J1137J2165
5121A1644K1306J6318K0503J194k56o0319l8238K1028K5005j7085o6105J5672
5109d9333J315J8147K6230r30L5946N3274K2413l9963n6882k8125J02L2324L482
$$ plain form
5096 18000 -17011 -33935 -20649 -38551 -27151 -38885 -27599 -3326 31025 49664 41808 45996
5084 45996 47707 47232 32352 1825 -58695 -56711 -43093 -72224 -35212 1086 -16959 13155 15612
5071 15612 70621 4909 -56256 -39767 -5385 12440 25975 -4936 -37575 -104621 -93269 -7301
5059 -7301 27628 12742 -2484 -11592 -19313 -34986 -97645 -77525 -52321 -37587 -6138 -13164 -19430
5046 -19430 -12423 -7293 66405 75920 89523 77575 87441 76210 105357 76468 68128 71860 10279
5033 10279 -50366 -66202 -18113 73369 70075 110439 106909 25314 58802 81691 127829 98118
5021 98118 84589 34542 -33501 -104944 -52492 9669 29907 54674 66954 -8425 -42191 19373
5009 19373 50869 58723 8673 -63085 -97630 9165 48984 25946 -11663 -17663 -17018 11612
$$ packed form
5096A8000l5011j6924J3286j7902J1400j1734J1286K4273L4351J8639p856M188
5084D5996J711m75j4880l0527o0520J984J3618k9131L7012L6298j8045L0114K457
5071A5612N5009o5712o1165J6489L4382J7825J3535l0911l2639o7046J1352Q5968
5059g301L4929j4886j5226r108p721j5673o2659K0120K5204J4734L1449p026o266
5046a9430P007N130P3698R515J3603j1948R866j1231K9147k8889q340L732o1581
5033A0279o0645j5836M8089R1482l294M0364l530q1595L3488K2889M6138k9711
5021I8118j3529n0047o8043p1443N2452O2161K0238K4767J2280p5379l3766O1564
5009A9373L1496P854n0050p1758l4545J06795L9819k3038l7609o000O45K8630
$$ plain form
4997 11612 54994 11196 -20983 -34844 -33158 -50590 -60817 -74332 -43397 -37510 -40572 -62219
4985 -62219 -61619 -58227 -39353 -41470 -4910 15407 9431 23581 -7074 -30512 -1803 18069 12590
4972 12590 55671 58147 66452 58725 35837 10704 -36796 24098 55062 14226 -1945 36335
4960 36335 -1806 -29525 21112 24437 62719 57005 41623 -25731 -45259 -40194 -22526 -4593
4948 -4593 15118 27845 92394 93931 37878 2285 -28467 -86630 -57641 7793 7669 2887 1771
4935 1771 -27435 34029 34113 -8899 4997 -8244 -5532 35682 9088 -25413 -36865 -47783 -68420
4922 -68420 -48116 -31285 -32841 -17126 35514 55620 47384 3865 2607 34721 65691 104390
4910 104390 87592 40566 -12307 5057 -3197 -37743 -71208 -92285 -112051 -118113 -103160 -70481
$$ packed form
4997A1612M3382m3798l2179j3861J686j7432j0227j3515L0935N887l062k1647
4985f2219O00L392J8874k117L6560K0317n976J4150l0655k3438K8709J9872n479
4972A2590M3081K476Q305p727k2888k5133m7500O0894L0964m0836j6171L8280
4960C6335l8141k7719N0637L325L8282n714j5382o7354j9528N065J7668J7933
4948d593J9711J2727O4549J537n6053l5593l0752n8163K8989O5434j24m782j116
4935A771k9206O1464Q4m3012J3896j3241K712M1214k6594l4501j1452j0918k0637
4922f8420K0304J6831j556J5715N2640K0106q236m3519j258L2114L0970L8699
4910A04390j6798m7026n2873J7364q254l4546l3465k1077j9766o062J4953L2679
$$ plain form
4898 -70481 -29478 -30947 -50980 -49546 -56991 -72308 -106079 -113588 -77894 -44816 -87362 -137604 -167244
4885 -167244 -126470 -69371 -16952 -6337 -15099 50263 70256 14139 -66715 -42376 -48594 -27294
4873 -27294 4166 32130 70458 83533 49338 73032 85115 97186 91544 61063 8699 -24302
4861 -24302 -417 -20664 -100141 -88033 -92982 -87085 -66228 -38982 -25458 -38699 -44116 -39184 -8630
4848 -8630 -46604 -55759 -38608 -40649 57028 38993 31323 -20486 -16343 93 37375 12978 20806
4835 20806 56992 78828 1611 -64733 -92082 -63510 -42302 -19412 -13680 -39836 -44223 -66474
4823 -66474 -75269 -13227 40210 -6615 -24382 8843 23570 50490 12352 -30971 4139 -7732
4811 -7732 -21162 -11358 -32979 31134 69986 45847 13987 -9865 -39633 -39283 -21666 -25515 -61233
$$ packed form
4898g0481M1003j469k0033J434p445j5317l3771p509L5694L3078m2546n0242k9640
4885a67244M0774N7099N2419J0615q762O5362J9993n6117q0854K4339o218K1300
4873b7294L1460K7964L8328J3075l4195K3694J2083J2071n642l0481n2364l3001
4861b4302K3885k0247p9477J2108m949N897K0857K7246J3524j3241n417M932L0554
4848h630l7974r155J7151k041R7677j8035p670n1809M143J6436L7282k4397P828
4835B0806L6186K1836p7217o6344k7349K8572K1208K2890N732k6156m387k2251
4823f6474q795O2042N3437m6825j7767L3225J4727K6920l8138m3323L5110j1871
4811g732j3430R804k1621O4113L8852k4139l1860k3852k9768L50J7617l849l5718
$$ plain form
4798 -61233 -108503 -117571 -80342 -5939 33435 31286 26997 17332 -22165 -41806 -74374 -93113 -39733
4785 -39733 -21811 -32388 -37989 -115440 -136688 -103253 -47192 -67568 -67515 -43397 -30633 1461 21524
4772 21524 61609 73214 29310 -50427 -78016 -52286 5988 -36107 -74770 -42208 -28146 -44566
4760 -44566 -35156 -7674 30661 47863 9060 -3087 -7068 -35046 34467 76291 27517 3093
4748 3093 -18063 31468 35793 61645 61103 -12865 -44778 19626 3654 -82791 -77169 -20329 32946
4735 32946 18152 -29175 23613 64356 29187 -2777 -22769 -34792 -22327 6343 37033 21153
4723 21153 -10881 -40224 -682 -7557 2906 18998 83305 43821 7133 8437 43118 14087
4711 14087 -96676 -99794 -71493 -49182 6569 -3371 -4497 -57451 -80971 -45950 -23607 6184
$$ packed form
4798f1233m7270r068L7229P4403L9374k149m289r665l9497j9641l2568j8739N3380
4785c9733J7922j0577n601p7451k1248L3435N6061k0376N3K4118J2764L2094K0063
4772B1524M0085J1605m3904p9737k7589K5730N8274m2095l8663L2562J4062j6420
4760d4566R410K7482L8335J7202l8803j2147l981k7978O9513M1824m8774k4424
4748C093k1156M9531M325K5852n42p3968l1913O4404j5972q6445N622N6840N3275
4735C2946j4794m7327N2788M0743l5169l1964j9992j2023J2465K8670L0690j5880
4723B1153l2034k9343L9542o875J0463J6092O4307l9484l6688J304L4681k9031
4711A4087j10763l118K8301K2311N5751r940j126n2954k3520L5021K2343K9791
$$ plain form
4699 6184 4367 22843 7175 50632 54231 52605 68830 103656 104990 95430 118227 102233 19773
4686 19773 -53209 -33855 -12178 16995 10901 -40799 -58945 -41774 -41138 -22888 -8259 -9461 -32857
4673 -32857 -62621 -68233 -17479 -20029 -4147 -26759 -65275 -62912 -50924 -26148 -8721 -18230 -66487
4660 -66487 -42205 17610 40486 8604 -18491 -51175 -45147 -22703 -59816 -76557 -50961 -52192
4648 -52192 -35514 50116 81586 73945 58634 66766 26773 -50192 -24650 -498 -5623 -3770 -21118
4635 -21118 -21298 676 -44247 -51382 -112487 -74793 -84154 -117869 -142475 -88353 -58758 -18536 -18097
4622 -18097 -4287 13392 1589 4148 61942 18322 -32585 -19682 35228 34130 -53207 -67972
4610 -67972 -44004 -24967 -57285 -55660 -67418 -42535 -11454 30514 23400 -45478 -24598 -27545
$$ packed form
4699F184j817J8476j5668M3457L599j626J6225L4826J334r560K2797j5994q2460
4686A9773p2982J9354K1677K9173o094n1700j8146J7171O36J8250J4629j202k3396
4673c2857k9764n612N0754k550J5882k2612l8516K363J1988K4776J7427r509m8257
4660f6487K4282N9815K2876l1882k7095l2684O028K2444l7113j6741K5596j231
4648e2192J6678Q5630L1470p641j5311Q132l9993p6965K5542K4152n125J853j7348
4635b1118j80K1974m4923p135o1105L7694r361l3715k4606N4122K9595M0222M39
4622a8097J3810J7679j1803K559N7794m3620n0907J2903N4910j098q7337j4765
4610f7972K3968J9037l2318J625j1758K4883L1081M1968p114o8878K0880k947
$$ plain form
4598 -27545 -32540 7943 45243 57469 24288 -4648 16202 4459 -34259 -70765 -92185 -80768
4586 -80768 -52379 34481 47196 -19670 -94389 -72293 -36679 -33573 -35890 -59163 -67680 -4531
4574 -4531 10759 5317 21531 11709 -6609 -49409 -104972 -174809 -203647 -143043 -70919 -32715
4562 -32715 -11440 55649 -2796 -60810 -80150 -87510 -53210 -29319 -11458 -14564 45339 17599
4550 17599 -596 -63734 -67462 -54895 19992 39493 66719 135156 118188 89201 62599 51568
4538 51568 -17790 -59983 -51327 -45475 -60014 -92294 -102081 -13164 -63127 -109233 -79046 6593
4526 6593 24660 1472 8407 43019 61325 48361 41166 29909 61497 18348 -13227 -2932
4514 -2932 -17046 31151 -29037 -50096 -93900 -94149 -9657 23125 40820 37772 11550 -7450 -42239
$$ packed form
4598b7545m995M0483L7300J2226l3181k8936K0850j1743l8718l6506k1420J1417
4586h0768K8389Q6860J2715o6866p4719K2096L5614L106k317k3273q517O3149
4574d531J5290n442J6214r822j8318m2800n5563o9837k8838O0604P2124L8204
4562c2715K1275O7089n8445n8014j9340p360L4300K3891J7861l106N9903k7740
4550A7599j8195o3138l728J2567P4887J9501K7226O8437j6968k8987k6602j1031
4538E1568o9358m2193Q656N852j4539l2280r787Q8917m9963m6106L0187Q5639
4526F593J8067k3188O935L4612J8306j2964p195j1257L1588m3149l1575J0295
4514b932j4114M8197o0188k1059m3804k49Q4492L2782J7695l048k6222j9000l4789
$$ plain form
4501 -42239 -105315 -44436 1959 4980 -31073 -74610 -52436 -52861 -57120 -16367 3794 -5493 -3364
4488 -3364 -38868 -20301 -4841 16988 42253 61472 56269 64241 29676 19897 28566 3308 -87
4475 -87 -3279 -1588 -21547 -7066 11203 42382 25257 14563 61413 34406 38872 65842 -21177
4462 -21177 -28758 4531 23549 -18770 -32950 -6262 4132 40695 56485 70831 83641 114471
4450 114471 70554 34889 34088 -2219 -483 -7004 8918 30356 -392 12248 39765 73556
4438 73556 60479 47313 59168 43879 -4946 -63540 -34105 -41966 -89074 -77999 33402 76838
4426 76838 49262 -8453 -28694 19748 88266 99332 84502 41127 -27281 -67916 -85682 -30379
4414 -30379 3743 -17387 -52739 -63561 -70679 -30291 -17929 71468 123524 102030 58792 25771
$$ packed form
4501d2239o3076O0879M6395L021l6053m3537K2174m25m259M0753K0161r287K129
4488c364l5504J8567J5460K1829K5265J9219n203P972l4565r779Q669k5258l395
4475h7l192J691j9959J4481J8269L1179j7125j0694M6850k7007M466K6970q7019
4462b1177p581L3289J9018m2319j4180K6688J0394L6563J5790J4346J2810L0830
4450A14471m3917l5665q01l6307J736o521J5922K1438l0748J2640K7517L3791
4438G3556j3077j3166J1855j5289m8825n8594K9435p861m7108J1075J11401M3436
4426G6838k7576n7715k0241M8442O8518J1066j4830m3375o8408m0635j7766N5303
4414c0379L4122k1130l5352j0822p118M0388J2362Q9397N2056k1494m3238l3021
$$ plain form
4402 25771 -2997 -35360 -23770 -30711 -107539 -130844 -107530 -84673 -104139 -56756 8413 12378
4390 12378 39253 19466 2327 -17094 -43098 -53242 3792 54770 47129 55973 24342 4189
4378 4189 14636 48339 105401 116438 106583 75740 2395 3769 -1209 -38164 -84432 -74055 -76320
4365 -76320 -67181 -16542 -8148 -12489 -41557 -66910 -32057 -46337 -49283 -43038 -48093 -2500 12856
4352 12856 -33745 -42260 -19226 -19090 -43485 -51358 7117 -31873 -50969 -30478 -9496 -17310 -23448
4339 -23448 -47883 -44109 5095 20197 -18545 -42643 -59477 -51178 -36274 14416 -10057 -54330
4327 -54330 -115225 -105110 -20263 36572 30092 20623 8447 3166 39985 13899 20036 51340 44564
4314 44564 -25628 -55268 -24982 -20602 -42814 -90353 -121332 -124622 -99235 -2993 10917 -18147
$$ packed form
4402B5771k8768l2363J1590o941p6828k3305K3314K2857j9466M7383O5169L965
4390A2378K6875j9787j7139j9421k6004j0144N7034N0978p641Q844l1631k0153
4378D189J0447L3703N7062J1037r855l0843p3345J374m978l6955m6268J0377k265
4365g6320R139N0639Q394m341k9068k5353L4853j4280k946O245n055M5593J5356
4352A2856m6601q515K3034J36k4395p873N8475l8990j9096K0491K0982p814o138
4339b3448k4435L774M9204J5102l8742k4098j6834Q299J4904N0690k4473m4273
4327e4330o0895J0115Q4847N6835o480r469j2176n281L6819k6086O137L1304o776
4314D4564p0192k9640L0286M380k2212m7539l0979l290K5387R6242J3910k9064
$$ plain form
4302 -18147 -27226 -10410 -11181 12571 9337 3860 -61505 -10526 42611 36906 22764 36393 27218
4289 27218 41096 60630 29885 -30482 -4943 27092 25542 98308 105794 60342 8089 33150
4277 33150 61447 59089 80950 54440 -1741 -41444 -26595 -24263 -31550 -45620 23862 56780
4265 56780 43733 17829 581 -21470 -9286 -17379 -44921 -106209 -95371 -1019 31484 25736
4253 25736 -7287 -17419 15799 24692 13100 -5556 40847 -7999 17082 62036 86106 94746
4241 94746 20282 -8144 84036 82956 148568 167618 118317 106340 81439 59131 -2784 -20338
4229 -20338 5862 -49444 -128723 -124903 -50652 -79699 -105741 -128372 -131102 -109423 -60050 -26494
4217 -26494 -6399 -4415 -22750 -15634 65657 101612 53388 18638 -1093 10956 21729 33795
$$ packed form
4302a8147r079J6816p71K3752l234n477o5365N0979N3137n705j4142J3629r175
4289B7218J3878J9534l0745o0367K5539L2035j550P2766P486m5452n2253K5061
4277C3150K8297k358K1861k6510n6181l9703J4849K332p287j4070O9482L2918
4265E6780j3047k5904j7248k2051J2184q093k7542o1288J0838R4352L2503n748
4253B5736l3023j0132L3218Q893j1592j8656M6403m8846K5081M4954K4070Q640
4241I4746p4464k8426R2180j080O5612J9050m9301j1977k4901k2308o1915j7554
4229b0338K6200n5306p9279L820P4251k9047k6042k2631k730K1679M9373L3556
4217b6494K0095J984j8335P116Q1291L5955m8224l4750j9731J2049J0773J2066
$$ plain form
4205 33795 -2598 4629 -4794 -12042 33333 59600 33705 22748 69743 111501 80161 27950
4193 27950 25236 31121 9218 4640 -6706 -47519 -53295 -62511 -36544 -41010 -42010 -25533 -33163
4180 -33163 -12510 -7711 -3923 11353 -30577 -53669 -43093 -32126 -47711 -71663 -22223 2845
4168 2845 44017 43617 -44635 -104837 -80496 -35802 -227 -49347 -108544 -126669 -69244 -33959
4156 -33959 -34098 21496 38531 34958 3345 -43865 -14446 3127 30249 48586 -28579 -62283
4144 -62283 -53813 -30647 -44509 -67612 -19935 -48066 -68852 -10107 3357 -54681 -98911 -132354
4132 -132354 -118435 -76464 -52491 -49801 -68672 -90973 -41252 -898 -33927 2453 -37464 -35077
4120 -35077 -34193 -51240 -27824 -3807 -23777 -37561 44209 8567 -19106 -6949 -28011 -44460
$$ packed form
4205C3795l6393P227r423p248M5375K6267k5895j0957M6995M1758l1340n2211
4193B7950k714N885k1903m578j1346m0813n776r216K5967m466j000J6477p630
4180c3163K0653M799L788J5276m1930k3092J0576J0967j5585k3952M9440K5068
4168B845M1172m00q8252o0202K4341M4694L5575m9120n9197j8125N7425L5285
4156c3959j39N5594J7035l573l1613m7210K9419J7573K7122J8337p7165l3704
4144f2283Q470K3166j3862k3103M7677k8131k0786N8745J3464n8038m4230l3443
4132a32354J3919M1971K3973K690j8871k2301M9721M0354l3029L6380l9917K387
4120c5077Q84j7047K3416K4017j9970j3784Q1770l5642k7673J2157k1062j6449
$$ plain form
4108 -44460 -25966 39708 -3945 -68937 -65785 -76191 -139872 -94609 -63006 -88481 -81602 -89678
4096 -89678 -63808 -106720 -76797 -47786 -36753 -4982 5225 53801 79728 107570 110672 102693
4084 102693 19378 -30858 -28946 -20324 15610 36778 32834 63133 12819 -34932 -73572 28922
4072 28922 123402 108006 51823 44304 74568 56517 -17158 11789 64495 125037 121562 65133
4060 65133 61061 79504 43637 -17212 -87199 -47182 2643 -1374 -11917 -12866 -10011 -18517 -49530
4047 -49530 -64915 -59757 -27439 -38512 -23368 -10186 11275 -1662 -16692 -3275 5181 5506 34334
4034 34334 65723 51200 69431 39264 -14252 3345 21692 -28139 -61335 -18701 -25857 -68554
4022 -68554 -31056 -34307 -17638 -45323 -48794 -41640 -8960 6442 29863 -22235 -70636 -78169 -30868
$$ packed form
4108d4460J8494O5674m3653o4992L152j0406o3681M5263L1603k5475O879q076
4096h9678K5870m2912K9923K9011J1033L1771J0207M8576K5927K7842L102p979
4084A02693q3315n0236J912Q622L5934K1168l944L0299n0314m7751l8640J02494
4072B8922R4480j5396n6183p519L0264j8051p3675K8947N2706O0542l475n6429
4060F5133m072J8443l5867o0849o9987M0017M9825m017j0543r49K855q506l1013
4047d9530j5385N158L2318j1073J5144J3182K1461j2937j5030J3417Q456L25K8828
4034C4334L1389j4523J8231l0167n3516J7597J8347m9831l3196M2634p156m2697
4022f8554L7498l251J6669k7685l471P154L2680J5402K3421n2098m8401p533M7301
$$ plain form
4009 -30868 -13685 -16160 4619 -6517 -5261 -5663 -90926 -170035 -113500 -51001 -44545 -41720 -32566
3996 -32566 -73987 -66626 -95729 -61382 -28982 -50775 -96427 -91887 -57135 -46864 -18441 18142
3984 18142 42039 23288 -19092 -36126 -26504 -5409 13116 -48172 -77413 -35585 36520 95999
3972 95999 110930 79676 97935 153273 136084 21105 -70299 -42503 -17510 -18889 -25055 -43474
3960 -43474 -55891 -43024 -26117 -13992 -4635 21700 -14494 -40894 -45569 -80587 -31409 25300
3948 25300 37812 29408 18064 20439 -4901 -15698 -15775 -17425 -28462 -26433 -361 63918 82635
3935 82635 55251 12916 36595 42933 4796 -39488 -75475 -25594 7053 -29233 913 21146
3923 21146 52405 27208 -7668 -30652 -38791 -44346 2416 1690 -20112 -7579 34577 18603 -22379
$$ packed form
4009c0868J7183k475K0779j1136J256m02q5263p9109N6535O2499O456K825R154
3996c2566m1421P361k9103L4347L2400k1793m5652M540L4752J0271K8423L6583
3984A8142K3897j8751m2380j7034R622K1095J8525o1288k9241M1828P2105N9479
3972I5999J4931l1254J8259N5338j7189j14979r1404K7796K4993j379o166j8419
3960d3474j2417J2867J6907J2125R357K6335l6194k6400m675l5018M9178N6709
3948B5300J2512q404j1344K375k5340j0797p7j650j1037K029K6072O4279J8717
3935H2635k7384m2335K3679O338l8137m4284l5987M9881L2647l6286L0146K0233
3923B1146L1259k5197l4876k2984q139n555M6762p26k1802J2533M2156j5974m0982
$$ plain form
3910 -22379 -11792 -10529 -17871 -3858 -8324 5776 9218 47547 68829 62483 51330 -18902 -37833
3897 -37833 -64059 -16952 6285 42410 89862 114116 62505 -2491 -60086 -84282 -10919 22925
3885 22925 20069 -2671 14918 -2590 -3414 20308 33193 -4390 -36011 -95265 -134928 -82904
3873 -82904 -23971 -47528 -47081 -25186 -21553 -48025 -49501 -15769 -32611 -46426 -26727 -3903 30182
3860 30182 19377 69009 104455 82880 68671 113798 115722 43582 29165 18101 -3136 170
3848 170 -21943 -49637 -43880 -19156 42529 66471 81029 49145 -32987 2720 -7140 -43069 -51684
3835 -51684 -93939 -73276 -39084 3222 -14757 -56530 -20349 -45283 -79798 -34376 -5432 23125
3823 23125 51094 24620 9566 -15883 -33212 -35546 -50049 -48687 3110 -26617 12961 3826
$$ packed form
3910b2379J0587J263p342J4013m466J4100L442L8329K1282o346j1153p0232j8931
3897c7833k6226M7107K3237L6125M7452K4254n1611o4996n7595k4196P3363L3844
3885B2925k856k2740J7589j7508q24K3722J2885l7583l1621n9254l9663N2024
3873h2904N8933k3557M47K1895L633k6472j476L3732j6842j3815J9699K2824L4085
3860C0182j0805M9632L5446k1575j4209M5127J924p2140j4417j1064k1237L306
3848A70k2113k7694N757K4724O1685K3942J4558l1884q2132L5707r860l5929q615
3835e1684m2255K0663L4192M2306j7979m1773L6181k4934l4515M5422K8944K8557
3823B3125K7969k6474j5054k5449j7329k334j4503J362N1797k9727L9578r135
$$ plain form
3811 3826 -2541 -4159 10968 -20521 6976 38561 39809 72214 52342 -7410 6060 50273 66496
3798 66496 70738 35589 18792 -11278 -2465 -2886 -64667 -90779 -64385 -31477 -25918 -6984 33675
3785 33675 -252 -20387 -15653 6590 35201 11274 -39107 -83688 -34718 -351 -6329 -1787
3773 -1787 8680 -16073 -29685 -27431 17385 65547 28655 31388 29490 7368 -27071 -76581 -63092
3760 -63092 -66950 -40517 -20098 34014 77531 78369 60957 21145 5080 42805 66276 62280 79277
3747 79277 88397 59927 48980 -5624 6496 -6715 17348 15836 2840 -6053 6663 34770
3735 34770 25514 29788 -10355 34993 43480 67281 55099 34570 62636 42332 -1320 -42834
3723 -42834 -76794 -64272 -22748 -8096 8083 9489 5210 -25723 -28981 -29402 -53847 -83946 -88425
$$ packed form
3811C826o367j618J5127l1489K7497L1585J248L2405j9872n9752J3470M4213J6223
3798F6496M242l5149j6797l0070Q813m21o1781k6112K6394L2908N559J8934M0659
3785C3675l3927k0135M734K2243K8611k3927n0381m4581M8970L4367n978M542
3773a787J0467k4753j3612K254M4816M8162l6892K733j898k2122l4439m9510J3489
3760f3092l858K6433K0419N4112M3517Q38j7412l9812j6065L7725K3471l996J6997
3747G9277R120k8470j0947n4604J2120j3211K4063j512j2996q893J2716K8107
3735C4770r256M274m0143M5348Q487K3801j2182k0529K8066k0304m3652m1514
3723d2834l3960J2522M1524J4652J6179J406m279l0933l258m21k4445l0099m479
$$ plain form
3710 -88425 -63913 -31714 -49382 -3738 37787 30883 44846 -15716 -67041 -57965 -79053 -109472
3698 -109472 -64785 -45295 -57203 -64066 -70901 -46435 -54929 -29159 -41352 -20185 36531 42236
3686 42236 62220 68024 64736 37729 68264 47385 -7271 8029 -35872 -67209 -77516 -47192
3674 -47192 -52148 -94415 -57436 -21259 34841 14534 -13509 -70138 -50666 6227 11818 -27728
3662 -27728 -9724 -18902 12976 51725 142404 120553 84506 24690 -16864 -42940 -72497 -81745
3650 -81745 -72075 -25052 -24179 -47433 -25202 39020 114171 110385 -19876 -40017 -16471 -37919
3638 -37919 -47566 -71655 -23787 -29365 -38379 -8166 12613 29236 31891 4644 17696 41462 16903
3625 16903 26133 20051 -72705 -40121 -4889 -24557 -38106 -12275 -15806 -54299 -46620 -43484 -57567
$$ packed form
3710h8425K4512L2199j7668M5644M1525o904J3963o0562n1325R076k1088l0419
3698a09472M4687J9490j1908o863o835K4466q494K5770j2193K1167N6716N705
3686D2236J9984N804l288k7007L0535k0879n4656J5300m3901l1337j0307L0324
3674d7192m956m2267L6979L6177N6100k0307k8043n6629J9472N6893N591l9546
3662b7728J8004r178L1878L8749R0679k1851l6047n9816m1554k6076k9557r248
3650h1745R670M7023Q73k3254K2231O4222P5151l786j30261k0141K3546k1448
3638c7919r647k4089M7868n578r014L0213K0779J6623K655k7247J3052K3766k4559
3625A6903R230o082r2756L2584L5232j9668j3549K5831l531l8493P679L136j4083
$$ plain form
3612 -57567 -10923 30239 43875 33799 -14064 -22936 38383 68228 -11340 -30661 35691 110502
3600 110502 136125 136821 39467 -55153 -50325 53691 55206 2443 -50916 -102121 -68141 -62057
3588 -62057 -48837 -22506 -40255 -51421 -106646 -82914 -59466 -37271 -23186 -29052 11484 43762
3576 43762 73557 75979 31915 29857 4958 9246 35884 32372 57225 68494 50377 23999 23013
3563 23013 -36152 -63901 -46781 1544 14059 -17477 -21188 -36070 -84499 -48141 31510 55802
3551 55802 6815 -9540 17594 29604 -2464 -36128 -42347 -66440 -135167 -125720 -83555 -55552
3539 -55552 -91879 -49621 -22949 -44834 -56687 -22320 -22763 -15409 5430 51901 -14510 -88115
3527 -88115 -85143 -55177 -3452 41535 18144 -11779 -8328 -454 6935 18590 -7650 -21388 -19867
$$ packed form
3612e7567M6644M1162J3636j0076m7863q872O1319K9845p9568j9321O6352P4811
3600A10502K5623O96r7354r4620M828J04016J515n2763n3359n1205L3980O084
3588f2057J3220K6331j7749j1166n5225K3732K3448K2195J4085n866M0536L2278
3576D3762K9795K422m4064k058k4899M288K6638l512K4853J1269j8117k6378r86
3563B3013n9165k7749J7120M8325J2515l1536l711j4882m8429L6358P9651K4292
3551E5802m8987j6355K7134J2010l2068l3664o219k4093o8727R447M2165K8003
3539e5552l6327M2258K6672k1885j1853L4367m43P354K0839M6471o6411p3605
3527h8115K972K9966N1725M4987k3391k9923L451P874P389J1655k6240j3738J521
$$ plain form
3514 -19867 -22675 -19056 -25649 -30865 -47365 -17069 4485 8736 -1926 -9100 -59466 -52618 -19022
3501 -19022 15281 -2793 -33920 -23512 -10170 -13675 -15446 -95974 -88131 -40221 37280 53450
3489 53450 12716 -32436 10020 -2586 -15069 -27129 1663 -15606 -8940 -10800 -50938 -24656
3477 -24656 1743 -4786 22118 -3692 -59952 -87490 -116375 -78369 -67695 -64650 -33062 -31421
$$ packed form
3514a9867k808L619o593n216j6500L0296K1554M251j0662p174n0366O848L3596
3501a9022L4303j8074l1127J0408J3342l505j771q0528P843M7910P7501J6170
3489E3450m0734m5152M2456j2606j2483j2060K8792j7269O666j860m0138K6282
3477b4656K6399o529K6904k5810n6260k7538k8885L8006J0674L045L1588J641
$$ [...]
##END NTUPLES=NMR SPECTRUM
##END=
