##TITLE=Analysis number 329218
Compound Code cc 31223
Project Code adrs
Chemist Name fudan
##JCAMPDX= 6.0         $$ Bruker NMR JCAMP-DX V2.0
##DATA TYPE= NMR SPECTRUM
##DATA CLASS= NTUPLES
##ORIGIN= Bruker BioSpin GmbH
##OWNER= nmr
$$ XWIN-NMR		Version 3.5
$$ Mon Aug 13 10:24:38 2007 GMT Daylight Time (UT+1h)  MAYBRIDGE\nmr@NMR_250MHZ
##.OBSERVE FREQUENCY= 250.131544655141
##.OBSERVE NUCLEUS= ^1H
##.ACQUISITION MODE= SIMULTANEOUS (DQD)
##.ACQUISITION SCHEME= undefined
##.AVERAGES= 16
##.DIGITISER RES= 18
##SPECTROMETER/DATA SYSTEM= dpx250
##.PULSE SEQUENCE= zg30
##.SOLVENT NAME= CDCl3
##.SHIFT REFERENCE= (INTERNAL, CDCl3, 0, 16.4504)
##AUDIT TRAIL= $$ (NUMBER, WHEN, WHO, WHERE, WHAT)
$$ ##TITLE= Audit trail, XWIN-NMR		Version 3.5
$$ ##JCAMPDX= 5.01
$$ ##ORIGIN= Bruker BioSpin GmbH
$$ ##OWNER= nmr
$$ C:\u/data/dgb/nmr/ADRS/450/pdata/1/auditp.txt
$$ ##AUDIT TRAIL=  $$ (NUMBER, WHEN, WHO, WHERE, WHAT)
(   1,<2007-08-13 10:24:15.48 +100>,<MAYBRIDGE\nmr>,<NMR_250MHZ>,
      <created by zg, POWCHK disabled, PULCHK disabled
       configuration hash MD5:
       76 6E 9A 78 1E 09 19 81 EC 84 63 8F B0 6A 59 2D
       data hash MD5: 64K
       32 A8 A5 82 7F B8 6E 27 71 AE 0C 85 8E C2 A4 21>)
(   2,<2007-08-13 10:24:29.48 +100>,<MAYBRIDGE\nmr>,<NMR_250MHZ>,
      <Start of raw data processing
       ef LB = 0.3 FT_mod = 6 PKNL = 1 SI = 32K 
       data hash MD5: 32K
       57 8A 6E BD 64 50 17 9A BB 76 92 9F 46 67 3E D5>)
(   3,<2007-08-13 10:24:31.11 +100>,<MAYBRIDGE\nmr>,<NMR_250MHZ>,
      <apk 
       data hash MD5: 32K
       A0 B0 5B 8C CF 54 6B 4B 3C 78 0D E6 05 8C 09 26>)
(   4,<2007-08-13 10:24:31.81 +100>,<MAYBRIDGE\nmr>,<NMR_250MHZ>,
      <abs ABSG = 5 
       data hash MD5: 32K
       9B DF B3 80 03 9E 4D 49 88 F1 3E 4F 68 09 D8 8E>)
$$ ##END=
$$ 
$$ hash MD5
$$ 5E E4 56 19 81 44 53 CC 3F 57 26 67 E2 F7 B5 06
##$RELAX= 
##$RELAX= 
##$RELAX= 
##$RELAX= 
##$RELAX= 
##$RELAX= 
##$RELAX= 
$$ Bruker specific parameters
$$ --------------------------
##$DU= <C:\u>
##$EXPNO= 450
##$NAME= <ADRS>
##$PROCNO= 1
##$TYPE= <nmr>
##$USER= <dgb>
##$AMP= (0..31)
100 100 100 100 100 100 100 100 100 100 100 100 100 100 100 100 100 100 
100 100 100 100 100 100 100 100 100 100 100 100 100 100 
##$AQSEQ= 0
##$AQ_mod= 3
##$AUNM= <au_zg>
##$AUTOPOS= <7 >
##$BF1= 250.13
##$BF2= 250.13
##$BF3= 250.13
##$BF4= 250.13
##$BF5= 500.13
##$BF6= 500.13
##$BF7= 500.13
##$BF8= 500.13
##$BYTORDA= 1
##$CFDGTYP= 0
##$CFRGTYP= 5
##$CHEMSTR= <none>
##$CNST= (0..31)
1 1 145 1 1 1 1 1 1 1 1 1 1 1 1 1 1 1 1 1 1 1 1 1 1 1 1 1 1 1 1 1 
##$CPDPRG= <>
##$CPDPRG1= <>
##$CPDPRG2= <>
##$CPDPRG3= <>
##$CPDPRG4= <mlev>
##$CPDPRG5= <mlev>
##$CPDPRG6= <mlev>
##$CPDPRG7= <mlev>
##$CPDPRG8= <mlev>
##$CPDPRGB= <>
##$CPDPRGT= <>
##$D= (0..31)
0 1 0 0 0 0 0 0 0 0.06 0 0 0 0 0 0 0.0002 0 0 0 0 0 0 0 0 0 0 0 0 0 0 
0 
##$DATE= 1186997053
##$DBL= (0..7)
120 120 120 120 120 120 120 120 
##$DBP= (0..7)
150 150 150 150 150 150 150 150 
##$DBP07= 0
##$DBPNAM0= <>
##$DBPNAM1= <>
##$DBPNAM2= <>
##$DBPNAM3= <>
$$ [...]
##$SUBNAM7= <"">
##$SUBNAM8= <"">
##$SUBNAM9= <"">
##$SW= 20.6930455092707
##$SWIBOX= (0..15)
0 0 3 0 0 0 0 0 0 0 0 0 0 0 0 0 
##$SW_h= 5175.983436853
##$TD= 65536
##$TD0= 1
##$TE= 296.16
##$TE2= 300
##$TE3= 300
##$TEG= 300
##$TL= (0..7)
0 120 120 120 120 120 120 120 
##$TP= (0..7)
150 150 150 150 150 150 150 150 
##$TP07= 0
##$TPNAME0= <>
##$TPNAME1= <>
##$TPNAME2= <>
##$TPNAME3= <>
##$TPNAME4= <>
##$TPNAME5= <>
##$TPNAME6= <>
##$TPNAME7= <>
##$TPOAL= (0..7)
0.5 0.5 0.5 0.5 0.5 0.5 0.5 0.5 
##$TPOFFS= (0..7)
0 0 0 0 0 0 0 0 
##$TUNHIN= 0
##$TUNHOUT= 0
##$TUNXOUT= 0
##$USERA1= <user>
##$USERA2= <user>
##$USERA3= <user>
##$USERA4= <user>
##$USERA5= <user>
##$V9= 5
##$VALIST= <valist>
##$VCLIST= <CCCCCCCCCCCCCCC>
##$VD= 0
##$VDLIST= <DDDDDDDDDDDDDDD>
##$VPLIST= <PPPPPPPPPPPPPPP>
##$VTLIST= <TTTTTTTTTTTTTTT>
##$WBST= 1024
##$WBSW= 4
##$XGAIN= (0..3)
0 0 0 0 
##$XL= 0
##$YL= 0
##$YMAX_a= 403525
##$YMIN_a= -414567
##$ZGOPTNS= <>
##$ZL1= 120
##$ZL2= 120
##$ZL3= 120
##$ZL4= 120
##$ABSF1= 16.45043
##$ABSF2= -4.242743
##$ABSG= 5
##$ABSL= 3
##$ALPHA= 0
##$AQORDER= 0
##$ASSFAC= 0
##$ASSFACI= 0
##$ASSFACX= 0
##$ASSWID= 0
##$AUNMP= <proc_1d>
##$AZFE= 0.1
##$AZFW= 0.1
##$BCFW= 0
##$BC_mod= 0
##$BYTORDP= 0
##$COROFFS= 0
##$CY= 12.5
##$DATMOD= 1
##$DC= 0
##$DFILT= <>
##$DTYPP= 0
##$F1P= 14.0000005364418
##$F2P= -0.99999901652339
##$FCOR= 0.5
##$FTSIZE= 32768
##$FT_mod= 6
##$GAMMA= 0
##$GB= 0
##$INTBC= 1
##$INTSCL= 1
##$ISEN= 128
##$LB= 0.3
##$LEV0= 0
##$LPBIN= 0
##$MAXI= 10000
##$MC2= 0
##$MEAN= 0
##$ME_mod= 0
##$MI= 0
##$NCOEF= 0
##$NC_proc= -3
##$NLEV= 6
##$NOISF1= 0
##$NOISF2= 0
##$NSP= 0
##$NTH_PI= 0
##$NZP= 0
##$OFFSET= 16.45043
##$PC= 1
##$PHC0= -44.40036
##$PHC1= 6.224472
##$PH_mod= 1
##$PKNL= yes
##$PPARMOD= 0
##$PSCAL= 4
##$PSIGN= 0
##$REVERSE= no
##$SF= 250.130017901487
##$SI= 32768
##$SIGF1= 0
##$SIGF2= 0
##$SINO= 400
##$SIOLD= 32768
##$SREGLST= <1H.CDCl3>
##$SSB= 0
##$STSI= 32768
##$STSR= 0
##$SW_p= 5175.98343685301
##$SYMM= 0
##$S_DEV= 0
##$TDeff= 65536
##$TDoff= 0
##$TI= <Analysis number 999999
Compound Code 99
Book Reference 9
Project Code 9>
##$TILT= no
##$TM1= 0
##$TM2= 0
##$TOPLEV= 0
##$USERP1= <user>
##$USERP2= <user>
##$USERP3= <user>
##$USERP4= <user>
##$USERP5= <user>
##$WDW= 1
##$XDIM= 32768
##$YMAX_p= 397016716
##$YMIN_p= -98650
$$ End of Bruker specific parameters
$$ ---------------------------------
##NTUPLES= NMR SPECTRUM
##VAR_NAME=  FREQUENCY,     SPECTRUM/REAL,   SPECTRUM/IMAG
##SYMBOL=    X,             R,               I
##VAR_TYPE=  INDEPENDENT,   DEPENDENT,       DEPENDENT
##VAR_FORM=  AFFN,          ASDF,            ASDF
##VAR_DIM=   32768,         32768,           32768
##UNITS=     HZ,            ARBITRARY UNITS, ARBITRARY UNITS
##FACTOR=    0.157963299565203, 1,           1
##FIRST=     4114.74632947175, 0,            0
##LAST=      -1061.23710738126, 0,           0
##MIN=       -1061.23710738126, -98650,      0
##MAX=       4114.74632947175, 397016716,    0
$$ Real data points
##PAGE= N=1
##DATA TABLE= (X++(R..R)), XYDATA
$$ [...]
14787B013N491j1499N20q69J6452j0582j1288R967P917k1418k4423J0551K117
$$ 2013 7504 -3995 -3475 -4344 12108 1526 -9762 205 8122 -13296 -37719 -27168 -25051
14774b5051j6594J6269K0599q815m326J9694J2882K5812j9012l0655L456R045
$$ -25051 -41645 -25376 -4777 -13592 -17918 1776 14658 40470 21458 -9197 -5741 3304
14762C304q384j1822j6494J5734k414Q00L061J8883M251k235q75j9212k910R220
$$ 3304 -5080 -16902 -33396 -17662 -20076 -19276 -16215 2668 6919 4684 3809 -15403 -18313 -9093
14748i093j3419l906K6595j9750j9440J2254J9528J5332k0483R33r865n81J8589
$$ -9093 -22512 -26418 177 -19573 -39013 -26759 -7231 8101 -12382 -11449 -21314 -21895 -3306
14735c306J1446l1537Q731M0812J7606k9481m6328n604Q852M650J7673K306R824
$$ -3306 8140 -23397 -14666 26146 43752 14271 -32057 -37661 -28809 -24159 -6486 -4180 5644
14722E644j0077l050L952L346K3609J8716P777l4869j1482K895o413J709J3447
$$ 5644 -4433 -7483 -3531 -185 23424 42140 49917 15048 3566 6461 48 1757 15204
14709A5204J4090j70p911j9325k009N250p628j8988n170Q191J714J2704K9341
$$ 15204 29294 29124 21213 1888 -121 5129 -2499 -21487 -26657 -18466 -16752 -4048 25293
14696B5293O068J6726j5945j7605K2078K7095j581J2021j1441l395k1734k2394
$$ 25293 31361 48087 32142 14537 36615 63710 62129 74150 62709 59314 37580 15186
14684A5186K2505j6723j8968j2673N500J7060J5522O033j2995J1334P864j4232
$$ 15186 37691 20968 2000 -10673 -5173 11887 27409 33442 20447 31781 39645 25413
14672B5413J4083k1828k8898J0845P650j8362k9678j5188L0403k69m29K2321J87
$$ 25413 39496 17668 -11230 -385 7265 -11097 -40775 -55963 -25560 -25829 -26258 -3937 -3750
14659c750J501P621K0253k523K077M697K3737J1677j2340k7606l9412j2396J2926
$$ -3750 -2249 5372 25625 23102 25179 29876 53613 65290 52950 25344 -14068 -26464 -13538
14646a3538J1830J5088J3477M538j8979k1984O578J3098k978K2946r657l6028
$$ -13538 -1708 13380 26857 31395 12416 -9568 -2990 10108 7130 30076 20419 -15609
14634a5609q646J0583K099Q08J7964N150p596K732O17j3758j5874R090r10o011
$$ -15609 -24255 -13672 -11573 -10765 7199 12349 4753 7485 8102 -5656 -21530 -12440 -13350 -19361
14620a9361J4590J2709k101J5523L5859q157m0128J3715M803o491j6553K1201
$$ -19361 -4771 7938 5837 21360 57219 49062 8934 22649 27452 20961 4408 25609
14608B5609m351j5955l2044P312P006Q271J669q570K6217M81N953o693n305k823
$$ 25609 21258 5303 -26741 -19429 -12423 -4152 -2483 -11053 15164 15645 21598 14905 9600 6777
14594F777Q781o952l931R494K2718j0256J3622L5182M2323Q5239R4674J2738o8757
$$ 6777 15558 8606 4675 14169 36887 26631 40253 75435 117758 202997 297671 310409 241652
14581B41652q0260n6311j3356n429k1690j4697k939j7881j3570q728k5703j2050
$$ 241652 161392 105081 91725 86296 64606 49909 46970 29089 15519 6791 -18912 -30962
14569c0962K5791L413j0955P829K3900J1701J2580r585O44K8313p957k5505k6825
$$ -30962 -5171 -1758 -12713 -4884 19016 30717 43297 33712 34356 62669 54712 29207 2382
14556B382j3983N361M423j284P133p538k9964Q353M650K0248L2919J4248j1573
$$ 2382 -11601 -6240 -1817 -3101 4032 -3506 -33470 -25117 -20467 -219 32700 46948 35375
14543C5375J2870j066m678j8425o556k7982n874j9419p685M2151n199k3450r132
$$ 35375 48245 47179 42501 24076 17520 -10462 -16336 -35755 -43440 -1289 -6488 -29938 -39070
14530c9070L4221M1137J4052j1209p637P443l430K111J2701o962q568N984m342
$$ -39070 -4849 36288 50340 39131 31494 38937 35507 37618 50319 43357 34789 40773 36431
14517C6431j0996o748J9893n880l3891k1200J341j7997o60K1652L207K1304M666
$$ 36431 25435 18687 38580 32700 -1191 -22391 -21050 -39047 -39707 -18055 -14848 6456 11122
14504A1122k3329K948J3953K1895J7524J0032k7834J2447P795l0071k4910j3229
$$ 11122 -12207 -9259 4694 26589 44113 54145 26311 38758 46553 16482 -8428 -21657
14492b1657m228J3858J147j461R886o406k5002j0685L3870J3720J2621q03K171
$$ -21657 -25885 -12027 -10880 -12341 -2455 -8861 -33863 -44548 -10678 3042 15663 14860 17031
14479A7031n109k1791J6836J5190j35o149k0715j1170L0572R893p453k870j8830
$$ 17031 11922 -9869 6967 22157 22022 15873 -4842 -16012 14560 24453 17000 14130 -4700
14466d700k6952j010R148R615J523o251j375J8883k138K0347m990k2282k041K077
$$ -4700 -31652 -32662 -23514 -13899 -12376 -18627 -20002 -1119 -3257 17090 12100 -10182 -12223 -10146
14452a0146J6422J3907R747l5068M615J4738k9312k4867J3652J9052J2019J9634
$$ -10146 6276 20183 29930 -5138 -523 14215 -15097 -39964 -26312 -7260 4759 24393
14440B4393m288K843j6767l362o835j7522J21j9925j0827J3975M9608K2423k5080
$$ 24393 20105 22948 6181 2819 -4016 -21538 -21417 -41342 -52169 -38194 11414 33837 8757
14427H757j3545K4581K272J210k1801m182j2722P675J9829n704k0356j0637L4770
$$ 8757 -4788 19793 22065 23275 1474 -2708 -15430 -7755 12074 6370 -13986 -24623 10147
14414A0147N433O551l143r927P079k6941J922K0245K3268m719l1742l881J2251
$$ 10147 15580 22131 18988 9061 16140 -10801 -8879 11366 34634 29915 -1827 -5708 6543
14401F543J3488K024j6684J6135Q746k0985J068J3535j9891q496L369k1600n541
$$ 6543 20031 22055 5371 21506 30252 9267 10335 23870 3979 -4517 -1148 -22748 -28289
14388b8289O515M69K5150R074P159M408k6413J8163j5039l4718J2836N831r141
$$ -28289 -21774 -21305 3845 12919 20078 24486 -1927 16236 1197 -33521 -20685 -14854 -23995
14375b3995j056L3854J0303K036j4997J3808L0996l320N332l0425k7117r186L969
$$ -23995 -25051 8803 19106 21142 6145 19953 50949 47629 52961 22536 -4581 -13767 -9798
14362i798j0127J836K4610M2267l0742k2778o18J237n237K2480N539K472p096
$$ -9798 -19925 -18089 6521 48788 18046 -4732 -5350 -4113 -9350 13130 18669 21141 14045
14349A4045l708O94n059k2675N1005L6947j1094r955m453O528J8304j9593j6629
$$ 14045 10337 11031 5972 -16703 34302 71249 60155 50200 45747 52275 70579 50986 34357
14336C4357j5958l158j4488J0165J6475J9060N975k6831j5835j1264j2894J1923
$$ 34357 18399 15241 753 10918 27393 46453 52428 25597 9762 -1502 -14396 -2473
14324b473J7745n252k0535n325J7858n368j2420J9792m506J2305J191j554K8046
$$ -2473 15272 10020 -10515 -15840 2018 -3350 -15770 4022 -484 11821 13012 11458 39504
14311C9504j743j9900j3633j0190M5286L7217P365j9702k8783l0912J3193l006
$$ 39504 37761 17861 4228 -5962 39324 76541 83906 64204 35421 4509 17702 14696
14299A4696k8478K3577J4552J494j1295j5876j6537Q908J6184j3181j024P285
$$ 14696 -13782 9795 24347 25841 14546 -1330 -17867 -8959 7225 -5956 -6980 305
14287C05N755p574Q170J4291K452J76J378P971J2416k2684j625q760k243m402
$$ 305 6060 -1514 6656 20947 23399 23575 24953 32924 45340 22656 21031 12271 10028 5626
14273E626J1907J5803l229R934O39j6907j4733N305J2244K6537Q837M651O52K0012
$$ 5626 17533 33336 30107 40041 40680 23773 9040 14345 26589 53126 61963 66614 67266 87278
14259H7278l5206n4413k5486Q653K1949J2280j5818k1302k4399L186L6502L7320
$$ 87278 52072 -2341 -27827 -19174 2775 15055 -763 -22065 -46464 -43278 -6776 30544
14247C0544O261j1262N194J9562q382n7753j5434R539k342j7220M0077K7287O758
$$ 30544 36805 25543 30737 50299 41917 -15836 -31270 -21731 -24073 -41293 -1216 26071 32829
14234C2829K946j5832J2607J346J6105J4073j8701l3308l3832L87K5773J0896
$$ 32829 35775 19943 32550 33896 50001 64074 45373 12065 -21767 -21380 4393 15289
14222A5289J1286j487L701n028J4023J681N273P256l5082j062q645j5391m33N660
$$ 15289 26575 25088 28789 23761 37784 39465 44738 51994 16912 15850 7205 -8186 -8619 -2959
14208b959J3004J3604J0555L334L1533M256n666p838j2567J30P537k3699J1869
$$ -2959 10045 23649 34204 37538 69071 73327 67661 59823 47256 47386 54923 31224 43093
14195D3093J0766p810j2995K8936K8831J583j642R353K9203m903j2712O115N0155
$$ 43093 53859 46049 33054 61990 90821 92404 90762 100115 129318 124415 111703 117818 167973
14182A67973N2135O8250M048n6802n0593n0003l2172m2564j8822q052O736M65
$$ 167973 220108 288358 292406 235604 185011 135008 102836 60272 41450 33398 40134 40599
14170D0599K892r518J4075N641p838j1093j9041j4015K4715J9819J8886n136m5515
$$ 40599 43491 33973 48048 53689 45851 34758 15717 1702 26417 46236 65122 59986 14471
14157A4471k3007j1423j139L572o932L1371L5604J6919j8624J8256J3714J3644
$$ 14471 -8536 -19959 -21098 -17526 -24458 6913 42517 59436 40812 59068 72782 86426
14145H6426J8691K207j3770K3689K7261N8699J04875J57717K06148J99111J7724
$$ 86426 105117 107324 93554 117243 144504 203203 308078 465795 671943 871054 888778
14134H88778k02292k18369j42438o9657o1185j0872l1437k9320j2839k2253j3199
$$ 888778 686486 468117 325679 256022 194837 183965 152528 123208 110369 88116 74917
14123G4917P970J9277l512k9939k6271K2531K4160j7293K1060p960k2094n318
$$ 74917 82887 102164 98652 68713 42442 64973 89133 71840 92900 84940 62846 57528
14111E7528J4306p7k0816j4767K917l3K6109K3889J8896J8233O054j277j3567
$$ 57528 71834 71757 50941 36174 39091 39058 65167 89056 107952 126185 132239 130962 117395
14098A17395q04K4707K2475M7934O2919J38824K26181K14716O6657j75100k41987
$$ 117395 116591 141298 163773 211707 274626 413450 639631 854347 921004 745904 503917
14087E03917j48184j18893n5477l7559K444k2412K704p346j0479q000j6682J3262
$$ 503917 355733 236840 181363 143804 146248 123836 126540 119194 108715 100715 84033 97295
14075I7295r232k5118K100j8337j7165M810K6426q993j4548j368L0707K3413j1129
$$ 97295 88063 62945 65045 46708 29543 34353 60779 51786 37238 35870 66577 89990 78861
14062G8861p915j4424k1550j6096L439j0321L810M131M589J3500P550J7852J3338
$$ 78861 70946 56522 34972 18876 22315 11994 15804 19935 24524 38024 45574 63426 76764
14049G6764P28O2183J10041R4011K702q0519r5281k1606k544j5093k2409J0860
$$ 76764 77492 139675 249716 343727 346429 265910 170629 149023 146479 131386 108977 119837
14037A19837J583k0340l7053j750K2168j3699k8221k2580l117J3314J8704J6251
$$ 119837 121420 101080 64027 62277 84445 70746 42525 19945 16828 30142 48846 65097
14025F5097O258k8698K104J6407j0417p824K0848J4818K022J391L049k1078j2768
$$ 65097 71355 42657 44761 61168 50751 42927 63775 78593 80615 82006 85055 63977 51209
14012E1209L904L1737O037p334k1760k752J8882M7094K4235p409l1922k149k600
$$ 51209 55113 86850 92887 85553 63793 61041 79923 127017 151252 143843 111921 109772 107172
13999A07172l3912j7797L661L357P970J9179Q425K4891N6951M2755L1791Q8377
$$ 107172 73260 55463 59124 62481 70451 89630 98055 122946 179897 222652 254443 342820
13987C42820J15753J92018K78100K62166K06430M8973q6175k19600k88392k25099
$$ 342820 458573 650591 928691 1190857 1397287 1446260 1360085 1140485 852093 626994
13977F26994j67714j16840q1059n2038k9896j1673m509k1293J228M8396J2351
$$ 626994 459280 342440 261381 209343 179447 167774 163265 141972 143200 191596 203947
13966B03947n866j5690r545j2110j4861k3627j8687K661K9311M064J3829P925
$$ 203947 198081 182391 172846 160736 145875 122248 103561 106222 135533 139597 153426 161351
13954A61351K2359K2855O5478Q1077J22655K11392L59656M61387M69237L23623
$$ 161351 183710 206565 272043 353120 475775 687167 1046823 1508210 1977447 2301070
13944B301070P707k93717m33236m23109l14048k22713j63089j11289o1451l3099
$$ 2301070 2308777 2015060 1581824 1158715 844667 621954 458865 347576 286125 253026
13934B53026j2481l1008l5207K2474M193o0775l6882K4298N0088M5283K9420Q041
$$ 253026 240545 209537 174330 196804 200997 140222 103340 127638 177726 223009 252429 260470
13922B60470m9213m3855j9901k2523l4711J3092J2043l3076n232j9864k547J2688
$$ 260470 211257 167402 147501 124978 90267 103359 115402 82326 77094 57230 54683 67371
13910F7371R253J0233j4584l7708j4136J9968Q650q874R640J2186n631o975K35
$$ 67371 76624 86857 72273 34565 20429 40397 49047 40173 49813 61999 56368 49393 49628
13897D9628j7638J7171K2158p817k2384o579l752J6695L354K0038K9998m206J2266
$$ 49628 31990 49161 71319 63502 41118 34539 30787 47482 50836 70874 100872 96666 108932
13884A08932N942r62j65p341J9864K6215J7788k1050j3712j9305m0551n367K0322
$$ 108932 114874 113912 113747 106406 126270 152485 170273 149223 135511 116206 75655 70288 90610
13871I0610l319j7289k3089j1699p165J321j4784K0685J533j1749N235m916l651
$$ 90610 87291 70002 46913 35214 28049 29370 14586 35271 36804 25055 30290 25374 21723
13858B1723J4903P602n838j7030O363J8495J2076M923m993j2327j9692N010J9040
$$ 21723 36626 44228 38390 21360 27723 46218 58294 63217 58224 45897 26205 31215 50255
13845E0255q499K1290J6562K4681n126k0006J5417n140J6800L0643L4674j6144
$$ 50255 41756 63046 79608 104289 99163 79157 94574 89434 106234 136877 171551 155407
13833A55407l8626M764j6658o216k6097l3651R26L4827j0775l9947k5378N815
$$ 155407 116781 121545 104887 98671 72574 38923 39849 74676 63901 23954 -1424 4391
13821D391K3155J9451J1807r604j7968K5104J2224J3730l114j4241O592K5328
$$ 4391 27546 46997 58804 49200 31232 56336 68560 82290 79176 64935 71527 96855
13809I6855P998q805J0825j4997J3794k988L676N715K0062M2257L5065L8233N1590
$$ 96855 104853 96048 106873 91876 105670 102682 106358 112073 132135 174392 209457 247690 299280
13796B99280K9395k6478n4914l8803n035k953J8932M785k8360o247o729k8713
$$ 299280 328675 302197 247283 208480 203445 200492 219424 224209 195849 189602 182873 154160
13784A54160J1653Q094k9900j464J6004q912j4395o774j4983N588K2559K6394
$$ 154160 165813 173907 144007 142543 158547 149635 135240 128466 113483 119071 141630 168024
13772A68024N733j9319j6472j8283K3087K9976P169N797M9689M996J5195R314
$$ 168024 173757 154438 137966 119683 142770 172746 179915 185712 235401 240397 255592 264906
13760B64906k555J8340K0618N192J7515M7965K8697N5234Q5246O7478J2219j3425
$$ 264906 262351 280691 301309 306501 324016 371981 400678 455912 541158 608636 620855 607430
13748F07430J1201k4419l6381o30L8522L5655L0405j073j4210J4302n685N3874
$$ 607430 618631 594212 557831 557201 595723 631378 661783 660710 646500 660802 655117 708991
13736G08991P0912N6668M5169R7941J34276J64640K29096K27411K35155L51935
$$ 708991 779903 836571 881740 979681 1113957 1278597 1507693 1735104 1970259 2322194
13726B322194M72988N97112P00827Q81611J215458J906076L170563N374417Q864640
$$ 2322194 2795182 3392294 4093121 4974732 6190190 8096266 11266829 16641246 25505886
13717B5505886J2948219J3302659L164614j0668421j3719333r802220o103330
$$ 25505886 38454105 51756764 54921378 44252957 30533624 20731404 14628074
13710A4628074l795915k383300j584706j067664p28399n71908m80747l91087l45327
$$ 14628074 10832159 8448859 6864153 5796489 5068090 4496182 4015435 3624348 3279021
13701C279021k63422j95800j31443p1660l9219j1007R406L9694J11349J37411
$$ 3279021 3015599 2819799 2688356 2616696 2577477 2566470 2575876 2615570 2726919 2864330
13691B864330J53956K23989K90548L25369K77327L98431M89599N05728O70033
$$ 2864330 3018286 3242275 3532823 3858192 4135519 4533950 5023549 5529277 6199310
13682F199310R56264J320416J663564J888242K453562L485566N261966Q632415
$$ 6199310 7155574 8475990 10139554 12027796 14481358 17966924 23228890 31861305
13674C1861305J4609550K4626290L8427308M6614888K3536846l0060998m9431343
$$ 31861305 46470855 71097145 109524453 156139341 179676187 149615189 100183846
13667A00183846l4901629k0698844j2430201p718845m950991l316972k308801
$$ 100183846 65282217 44583373 32153172 24434327 19483336 16166364 13857563
13660A3857563j724799j538620j504486j305264r91686o98634n39476m54645l88717
$$ 13857563 12132764 10594144 9089658 7784394 6792708 6094074 5554598 5099953 4711236
13651D711236k85341k05935j58653q6678q8552m6484o569Q6231J63041K38851
$$ 4711236 4425895 4219960 4061307 3974629 3886077 3839593 3833024 3919255 4082296 4321147
13641D321147L25647M57468O04289P25827J006704J374664J711773J921975K369497
$$ 4321147 4646794 5104262 5708551 6434378 7441082 8815746 10527519 12449494 14818991
13632A4818991L275149M905908P990481J3454172K2813636L6441937M7295351
$$ 14818991 18094140 23000048 30990529 44444701 67258337 103700274 150995625
13625A50995625L1806441k1736653n1273574l9032256k3227739j3845084q621842
$$ 150995625 182802066 161065413 109791839 70759583 47531844 33686760 25064918
13618B5064918n534885l597620k470843j921287j675028j572850j362882j056665
$$ 25064918 19530033 15932413 13461570 11540283 9865255 8292405 6929523 5872858
13610E872858p68017n26005l61832l39940l20496k76708k29633j74083j63860
$$ 5872858 5104841 4578836 4217004 3877064 3556568 3279860 3050227 2876144 2712284
13601B712284j47535j02401p6942k2550K3653L7049J02790J88242K44743L09728
$$ 2712284 2564749 2462348 2385406 2362856 2386509 2423558 2526348 2714590 2959333 3269061
13591C269061M36251N82492O52774P89337J077493J600169K589808M263608P110301
$$ 3269061 3705312 4287804 4940578 5729915 6807408 8407577 10997385 15260993 22371294
13582B2371294J1283930J4679276J0470070m482365j4924318j3190489q444420
$$ 22371294 33655224 48334500 58804570 54322205 39397887 26207398 17762978
13575A7762978n163026l235729k081677j370469r62010p04786o11492n67829n44990
$$ 17762978 12599952 9364223 7282546 5912077 4950067 4245281 3633789 3065960 2520970
13566B520970m01416k50551j80111j69354j60759j37405j05282j00474o5892o8262
$$ 2520970 2119554 1869003 1688892 1519538 1358779 1221374 1116092 1015618 949726 881464
13556H81464r7714j04376m2195l0566m5693m5318j3049q218J0029M735j9080p559
$$ 881464 783750 679374 637179 606613 560920 515602 502553 494335 504364 509099 490019 482460
13544D82460J5361N943q705l7847j9324o317j2508l6725o407L528k8482l7762
$$ 482460 497821 503764 495059 457212 437888 431571 419063 382338 375931 379459 350977 313215
13532C13215j6625p853n901K737J7570p784o543J3862l4q054l637J0529l5906
$$ 313215 296590 288737 282836 285573 303143 295359 288816 302678 302644 294590 290953 301482 265576
13519B65576r67L0318J3174Q34M330q739k1826j4358l1452m5181k460j8901J132
$$ 265576 264609 294927 308101 308935 313265 304526 282700 268342 236890 191709 189249 170348 171480
13506A71480N421k2487J217K8298K9593L6288L0679n50L3625j2186j7218l6323
$$ 171480 176901 154414 155631 183929 213522 249810 280489 279939 313564 301378 284160 247837
13494B47837l9676l6176j5974J6040j3635q643N903j572J4650j1147Q26R679J4006
$$ 247837 208161 171985 156011 172051 158416 149773 155676 154104 168754 157607 158433 168112 182118
13481A82118O54N121j9160J2583L9797K2899K4682L2467j6579j1073k9384l6193
$$ 182118 182772 187893 168733 181316 221113 244012 268694 301161 284582 273509 244125 207932
13469B07932k6488o164k8877j1888j2480r507m588K3008N6909K2495r26K8715
$$ 207932 181444 175280 146403 134515 122035 112528 107940 130948 187857 210352 209426 238141
13457B38141L6433j1007n9894r111K5231M513k881l4059j7966J8419j1837k8621
$$ 238141 274574 263567 203673 194562 219793 224306 221425 187366 169400 187819 175982 147361
13445A47361k0976K142K9211J7355j6947J6281K2975R759j1042m2076j5810K3013
$$ 147361 126385 128527 157738 175093 158146 174427 197402 207161 196119 154043 138233 161246
13433A61246N0544N8495P3035P1201N9906j7110q6986o4154n3851l8104m5475
$$ 161246 211790 270285 343320 414521 474427 457317 370331 306177 252326 214222 168747
13422A68747l1782j6430J5038Q639M500k079J6491M3016M7340P4154O4735Q736
$$ 168747 136965 120535 135573 144212 148712 146633 163124 206140 253480 327634 392369 401105
13410D01105o4687n1153l4537k2242k9888M231L1652L9479M4711M1571J0150K1090
$$ 401105 336418 285265 250728 228486 198598 202829 234481 273960 318671 360242 370392 391482
13398C91482L9963M4843Q777m9426o3355l3534l4927l6188l3706j3110L8036L0736
$$ 391482 431445 476288 485065 435639 372284 338750 303823 267635 233929 220819 258855 289591
13386B89591K1320L8534P4149K0143o6799o8062o5354n4497l0480j175J7647j0625
$$ 289591 310911 349445 423594 443737 376938 308876 243522 189025 158545 157370 175017 164392
13374A64392k293L148L715K5651L0565O7127Q9075P9600j326r1000o5369m5335
$$ 164392 162099 165247 168962 194613 225178 292305 381380 460980 459654 368654 303285 257950
13362B57950j7940R151L5551N8242J13355J86673J87521J57447R4694R3150J04224
$$ 257950 240010 249161 284712 342954 456309 642982 830503 987950 1082644 1175794 1280018
13351A280018M4903q9073k16677k31941k14520j62733n8933l0146l6051k8478
$$ 1280018 1324921 1235848 1019171 787230 572710 409977 351044 320898 284847 256369
13341B56369j1982k344n066p265k1807N189m902j1216j1185j5815j3464k8105
$$ 256369 244387 242043 236977 229712 207905 213094 208192 196976 185791 169976 156512 128407
13329A28407j7352Q159K6380K6937L7370j2393J0482J2508J4843J0683o0581l7074
$$ 128407 111055 119214 145594 172531 209901 197508 207990 220498 235341 246024 185443 148369
13317A48369K7109K2562M8856Q0447J24101J53008K03965J89532R9619Q5963P1920
$$ 148369 175478 198040 246896 327343 451444 604452 808417 997949 1097568 1183531 1255451
13306A255451N4729l8717k12089k50502k23482j66970r6608n6452n0668l2302
$$ 1255451 1310180 1271463 1059374 808872 585390 418420 321812 265360 214692 182390
13296A82390k2852k3482q335j546j1527m9662l3301K5662K6705l9299J351N190
$$ 182390 159538 136056 127721 126175 114648 64986 31685 57347 84052 44753 46104 51294
13284E1294n149L806O735J9685j1279j3328p940j0793j4915J3473J8960J5822
$$ 51294 46145 49951 56686 76371 65092 51764 43824 33031 18116 31589 50549 66371
13272F6371o462K5619K7474L3683L1616M8190N6921N4599L9171N3394J1023K9566
$$ 66371 59909 85528 113002 146685 178301 226491 283412 338011 377182 430576 441599 471165
13260D71165k8078o2081n8739n9555n2887m7529k9144j2107L998j4731k7425k5488
$$ 471165 443087 381006 322267 262712 209825 162296 133152 121045 125043 110312 82887 57399
13248E7399k025Q905J8666M1903K3950P8079O8103J7161m5006p1842o8461j4063
$$ 57399 55374 64279 82945 124848 148798 226877 294980 312141 267135 195293 126832 112769
13236A12769j8831p671q018j3013J1119J171j7551r69R360j3047O775J8277l485
$$ 112769 93938 86267 78249 65236 76355 77526 59975 59006 68366 55319 62094 80371 76886
13223G6886q148k0397j1263J6637M030n628K232J9606P537r384m144m713k4042
$$ 76886 68738 48341 37078 53715 57745 52117 54349 73955 81492 72108 67964 63251 39209
13210C9209Q247j978J1468q569O97J7562K9004n586K1322N9711O6444J18654K12235
$$ 39209 47456 45478 56946 48377 49074 66636 95640 90054 111376 171087 237531 356185 568420
13197E68420K33529J14583r7542k13174j88832r6262m3568n1582l4143j2727Q800
$$ 568420 801949 916532 818990 605816 416984 320722 277154 225572 191429 178702 187502
13186A87502k7810l2773j8748k7793J2002p4j8894k6097P265n596p290R316P303
$$ 187502 159692 126919 108171 80378 92380 92306 73412 47315 54580 48984 41694 51010 58313
13173E8313K400N424j9143l6522J2427J5645L602N868n583K1172O570O768J4498
$$ 58313 60713 66137 46994 10472 22899 38544 42146 48014 42431 63603 70173 76941 91439
13160I1439k206O403O494L5219O7331J01044J16200J56232K13769J56235p6253
$$ 91439 89233 95636 102130 137349 204680 305724 421924 578156 791925 948160 871907
13149H71907k19389k08109j41790q1227l7111l1503k7658l8319O094q206k6184
$$ 871907 652518 444409 302619 221392 184281 152778 125120 86801 92895 84689 58505
13138E8505j0617J7056j8814m277N287N88M777J434J5553k4009m869N48L904J1975
$$ 58505 47888 64944 46130 41853 47140 47728 52505 53939 69492 45483 40614 41162 45066 57041
13124E7041L225k5518J8141K2933P32j6905j2200L1911q941j081R89J868P693
$$ 57041 60266 34748 52889 75822 76554 59649 47449 79360 70419 69338 70327 72195 79888
13111G9888K2660K6984J9846O4768R6647R2051K9219p4434j07730r2323n5367
$$ 79888 102548 129532 149378 214146 310793 402844 432063 357629 249899 157576 102209
13100A02209k851m567k3645j3360L266q553k5171m164r884K767J0860P768J9973
$$ 102209 99358 94791 71146 57786 61052 52499 27328 23164 13280 16047 26907 34675 54648
13087E4648L4732j5779k378L3643J1821K976o960j3881j4769l0976k5137j0705
$$ 54648 89380 73601 71223 104866 116687 119663 112703 98822 84053 53077 27940 17235
13075A7235j3889J6008L5377j185L151J2042O354j2578l0863k5584m095K4225
$$ 17235 3346 19354 54731 53546 56697 68739 75093 62515 31652 6068 1973 26198
13063B6198M0690K2137M1358O436l6272k3169l4864j0895J1489Q003j316l499
$$ 26198 66888 89025 130383 136819 100547 77378 42514 31619 43108 51111 49795 46296
13051D6296o325k949K722j2451j7226L94M6557N2939k624N135K3793L3625N7301
$$ 46296 39971 37022 39744 27293 10067 10461 57018 109957 107333 112468 136261 169886 227187
13038B27187R0390P8695k5635j10598r7489n0111k2707j6903j4710k257m3382
$$ 227187 317577 396272 370637 260039 162550 112439 89732 72829 58119 55862 12480
13027A2480j7880K5562K2874j2255r637K5097L7998L3152M8763R563o289j3390
$$ 12480 -5400 20162 43036 30781 21144 46241 84239 117391 166154 175717 169428 156038
13015A56038q710p440l4040n2591k3450L1430L8000j4361j4432l5714j2004R279
$$ 156038 147328 139888 105848 53257 29807 61237 99237 84876 70444 34730 22726 32005
13003C2005J3181P891q601J4152J4193K1857M4519K6861j5860L8945J03591J14765
$$ 32005 45186 53077 44476 58628 72821 94678 139197 166058 150198 189143 292734 407499
12991D07499J7734q7318j10868p9611m4844l4307q122j8407K141M0814J2519J1244
$$ 407499 425233 337915 227047 147436 102592 68285 60163 41756 43897 84711 97230 108474
12979A08474p001K273J6665K3734Q1123J28042Q4609j9410q5798j08196o9444
$$ 108474 101473 103746 120411 144145 225268 353310 437919 418509 332711 224515 155071
12968A55071o0635l4363J0644J5789J096l4540l8652M623R450J128o877K638k510
$$ 155071 94436 60073 70717 86506 87602 53062 14410 19033 28483 29611 22734 25372 22862
12955B2862j137N259Q707L686J3493L7059K1336K0208K7959j5312j6149l1111
$$ 22862 21725 26984 35691 39377 52870 89929 111265 131473 159432 144120 127971 96860
12943I6860l0312m3570k5074r102P599L1794K8065N697n035J373K5663K2979N2151
$$ 96860 66548 22978 -2096 -11198 -3599 28195 56260 61957 56922 58295 83958 106937 159088
12930A59088O7655J08924J11815R364j14169j04057q5019n5747j9781j0356O346
$$ 159088 226743 335667 447482 456846 342677 238620 153601 97854 78073 67717 74063
12919G4063q019k09j0382k7820Q198K8991L9828P8045O0864l4096l7886j5735
$$ 74063 66044 65835 55453 27633 35831 64822 104650 182695 243559 209463 171577 155842
12907A55842j7824J3552J8341m4665l4595k3401o978l0191R607K7242j1775j4899
$$ 155842 138018 151570 169911 125246 90651 67250 60272 30081 39688 66930 55155 40256
12895D0256l5655l6602K8295J2928K4632K8247L5524q242j2914l315J030M0302
$$ 40256 4601 -32001 -3706 9222 33854 62101 97625 89383 76469 73154 74184 114486
12883A14486J6568j4443J8287l4520m2644k1048k4188j1123L707M1408N636k2119
$$ 114486 131054 116611 134898 100378 57734 36686 12498 1375 5082 46490 52126 30007
12871C0007j6357J4583J4367p987Q331J6052Q021k3749K6317K5352L1797Q797
$$ 30007 13650 28233 42600 34613 42944 58996 67017 43268 69585 94937 126734 135531
12859A35531R35k4032n3169j9099m747j360j776k2941j268K958j5511o56O103
$$ 135531 136466 112434 59265 40166 35419 34059 32283 9342 8074 11032 -4479 -5135 968
12846I68J7923j1652m676n510K7899K4091j2134K386J0606P216j084j6438o827
$$ 968 18891 7239 2563 -2947 24952 49043 36909 39295 49901 57117 56033 39595 32768
12833C2768p556k274K3845J2237j9738j0250j2092k1196Q11j0861Q243l198l958
$$ 32768 25212 22938 46783 59020 39282 29032 16940 -4256 -3445 -14306 -6063 -9261 -13219
12820a3219J3875R335k6398o415K6955J6374n031n668J7230k4081L851j1503O004
$$ -13219 656 9991 -16407 -22822 4133 20507 15476 9808 27038 2957 6808 -4695 1309
12807A309j6359Q879J4152J7398R266Q100l8602k7520o278j5293j4821n169K2297
$$ 1309 -15050 -6171 7981 25379 34645 42745 4143 -23377 -29655 -44948 -59769 -64938 -42641
12794d2641K9986q624k575n400M710L603k225L498K1393L480o736J8540L1958
$$ -42641 -12655 -21279 -23854 -29254 -24544 -20941 -23166 -19668 1725 5205 -1531 17009 48967
12781D8967R299n701k0606m711k0593k1241j8385q61J581M736m002P516l516J3053
$$ 48967 58266 52565 31959 27248 6655 -14586 -32971 -33832 -32251 -27515 -31517 -24001 -27517 -14464
12767a4464J8581J2090j3495j716o634k0478J3276J7664q493j1699j3566K8205
$$ -14464 4117 16207 2712 996 -5638 -26116 -12840 4824 -3669 -15368 -28934 -729
12755g29n427K086K2607J3200n430J0251p592k1040r90J0140J9759Q641J5270
$$ -729 -6156 -4070 18537 31737 26307 36558 28966 7926 6936 17076 36835 45476 60746
12742F0746r246P061L2314Q4003J39448K29218K28634L1313j92021k30773j29496
$$ 60746 51500 58561 90875 174878 314326 543544 772178 803491 611470 380697 251201
12731B51201p8965l7002m1617k4004j0646k9624J1716J046N489J4069k636k3662
$$ 251201 172236 135234 93617 69613 58967 29343 41059 42105 47594 61663 59027 35365
12719C5365P178J103J5286J3570k959m490o668O824K4946O2993J20192K04062
$$ 35365 42543 43646 58932 72502 69543 65053 58385 65209 90155 153148 273340 477402
12707D77402K26959J09237j40153k46545j75863r7978p1543k7069k1063k547O043
$$ 477402 704361 813598 673445 426900 251037 153059 81516 54447 33384 30837 36880
12696C6880l490J7132k4898j4688j1262M369K882J5363J0272l0737k6327J6024
$$ 36880 33390 50522 25624 10936 -326 4043 6925 22288 32560 1823 -24504 -8480
12684h480M2525Q256j8339r52J3996l6097k5534N585L054J2262K348k712j3071
$$ -8480 34045 42301 23962 23010 37006 909 -24625 -19040 -15986 -3724 -1376 -4088 -17159
12671a7159J4964K0452N076p0j7664p451j0062L787J8569m713j5946k1824J3517
$$ -17159 -2195 18257 23333 23263 5599 -1852 -11914 -8127 10442 5729 -10217 -32041 -18524
12658a8524L679J6994k9007p167N2324N4948r060R909j4752j8710j9393Q698o977
$$ -18524 -14845 2149 -26858 -34025 18299 73247 64187 74096 59344 40634 21241 29939 22962
12645B2962j1977p26j9457k1302q538K846J0643K4711m159p784O685j5615k2929
$$ 22962 10985 10259 -9198 -30500 -39038 -36192 -25549 -838 -4997 -12781 -6096 -21711 -44640
12632d4640K0434P743Q195L863k898J7155m964R17J0053K1460l881m726j3655
$$ -44640 -24206 -16463 -8268 -4405 -7303 9852 4888 5805 15858 37318 33437 28711 15056
12619A5056k0021J7579k396k0990P519J4501J6402m988J3827M772j3500J4025
$$ 15056 -4965 12614 10218 -10772 -3253 11248 27650 22662 36489 41261 27761 41786
12607D1786J1789k2351l4349p757K3294j0528J2698J9065k82Q645J4785n689j0004
$$ 41786 53575 31224 -3125 -10882 12412 1884 14582 33647 33365 42010 56795 51106 41102
12594D1102k2692n4359k700L5358J3338j1981l32J5233k4196k0352l226J3386
$$ 41102 18410 -35949 -38649 -3291 10047 -1934 -2266 12967 -11229 -31581 -34807 -21421
12582b1421q94J2507j5083N307m431L8628K1749J2885j2474k1276j1923j1121
$$ -21421 -22315 -9808 -24891 -19584 -24015 14613 36362 49247 36773 15497 3574 -7547
12570g547j6694k524j4209K3553J4219r741p321R09N085L8892L471r64j6563l0180
$$ -7547 -24241 -26765 -40974 -17421 -3202 -12943 -20264 -19355 -14270 24622 28093 27129 10566 -19614
12556a9614j7104j2683J4972J4762K4638J9141L6169K138k9745K915J6428L5j4949
$$ -19614 -36718 -49401 -34429 -19667 4971 24112 60281 62419 32674 35589 52017 52052 37103
12543C7103m670J035l519j4620J4942K7162j6443l6974m3137L468K8935J193J36
$$ 37103 32433 33468 29949 15329 30271 57433 40990 4016 -39121 -35653 -6718 -5525 -5389
12530e389N4K377Q819L9457L192k2852l3737J5248K1938j0207j2131J7006k6576
$$ -5389 -5335 -2958 5861 45318 48510 25658 -8079 7169 29107 18900 6769 23775 -2801
12517b801k0924k487K3393J3851j6387K836J1665K1092j3543j0683N440j8652
$$ -2801 -23725 -26212 -2819 11032 -5355 -2519 9146 30238 16695 6012 11452 -7200
12505g200j4036l4507k6821Q649K6513P545L1970p921j6937J548K8662n942p787
$$ -7200 -21236 -55743 -82564 -73915 -47402 -39857 -7887 -15808 -32745 -31197 -2535 -8477 -16264
12492a6264J9377j4716k8841P560j4598P194J6067O787j4839l566L800q407p072
$$ -16264 3113 -11603 -40444 -32884 -47482 -40288 -24221 -17434 -32273 -35839 -32039 -40446 -47518
12479d7518J2879n668m260r625K2644J8659K3417k3k8213k4913O733K5858L379
$$ -47518 -34639 -40307 -44567 -54192 -31548 -12889 10528 10505 -17708 -42621 -35888 -10030 -6651
12466f651j2834J493J0439k0831O575K1728q587k3900K0152m354k1778J2893M9832
$$ -6651 -19485 -17992 -7553 -28384 -21809 -81 -8668 -32568 -12416 -16770 -38548 -25655 24177
12453B4177K3843P977k6762l7284R235M0983M352j3823j0206J1901J2069M622
$$ 24177 48020 55997 29235 -8049 1186 42169 46521 32698 22492 34393 46462 51084
12441E1084J1729o101l8554o376J4316K9752l69l4423k7469P5p850j3974O191
$$ 51084 62813 56712 18158 11782 26098 55850 55481 21058 -6411 -6336 -14186 -28160 -21969
12428b1969O431K0566r51P71M592K439k7039m1747K7879L5520J0877j2003J4701
$$ -21969 -15538 5028 4077 4848 9440 11879 -15160 -56907 -29028 6492 17369 5366 20067
12415B0067l2052k1733K238J2928K4286M426j2578K510q142j557L6795L1765R184
$$ 20067 -11985 -33718 -31480 -18552 5734 10160 -2418 92 -8050 -9607 27188 58953 68137
12402F8137r064l2786l6534j0496L4727J9148J1055j4051l6401J7515J4609q299
$$ 68137 59073 26287 -10247 -20743 13984 33132 44187 30136 -6265 11250 25859 17560
12390A7560K949k1950k4375R857k1340l803J8894k629J1190O421n672l447n54
$$ 17560 20509 -1441 -25816 -15959 -37299 -41102 -22208 -24837 -13647 -7226 -12898 -16345 -16899
12377a6899L5138L828q590J9248j1639J2495J6032l3702k6726K4010K9088k841
$$ -16899 18239 22067 13477 32725 21086 33581 49613 15911 -10815 13195 42283 39442
12365C9442J4076o011k4358J9340j3038l3566m798p53m556j0018J68n288K1567
$$ 39442 53518 47507 23149 42489 29451 -4115 -8913 -9666 -14222 -24240 -24072 -29360 -7793
12352g793K4454J8309Q036k2394k3437j005m541j8456J6651K8586O982k6381J5061
$$ -7793 16661 34970 43006 20612 -2825 -3830 -8371 -26827 -10176 18410 25392 -989 14072
12339A4072k301n078m095J9572j128r015L219k1872k2415k0814J3909K2402P787
$$ 14072 11771 6693 2598 22170 21042 12027 15246 -6626 -29041 -49855 -35946 -13544 -5757
12326e757K5202o551r051K647j7630N296J4469k0196k8405P215J3855J9800o106
$$ -5757 19445 12894 3843 6490 -11140 -5844 8625 -11571 -39976 -32761 -18906 894 -5212
12313e212J9188J9153j675j9657l3317k2319J7565J2128j3419q14J5313L2301
$$ -5212 13976 33129 31454 11797 -21520 -43839 -26274 -14146 -27565 -28379 -13066 19235
12301A9235L690k1306o212R908J3750k2866j4836R45p48Q159j628j2068j7079
$$ 19235 22925 1619 -4593 5315 19065 -3801 -18637 -17692 -18440 -10281 -11909 -23977 -41056
12288d1056l0285L2381K5376k655N715R929L3469P952m613q932l354l9541o465
$$ -41056 -71341 -38960 -13584 -16239 -10524 -595 32874 40826 36213 27281 23927 -15614 -22079
12275b2079J2589N0888K079k7587J1598j4336j2330K3977Q210o84j4066j8735
$$ -22079 -9490 41398 43477 15890 27488 13152 822 24799 33009 32325 18259 -476
12263d76P170n218l8198r762L1084J7340k9563r747J2873P448J1170J5027K2086
$$ -476 6694 1476 -36722 -46484 -15400 1940 -27623 -37370 -24497 -17049 -5879 9148 31234
12250C1234o299l5936k7206p470J5781R622J7909M1602K267k638o819q872J0317
$$ 31234 24935 -11001 -38207 -45677 -29896 -20274 -2365 39237 41504 38866 32047 23175 33492
12237C3492k8037k2235M380r81J4704K6844J9646j5229J218O036n149m4573j4186
$$ 33492 5455 -16780 -12400 -13381 1323 28167 47813 32584 33802 39838 34689 -9884 -24070
12224b4070P346K236J9723R565J2204p149l6867j3128j5964J7688K1341K3651
$$ -24070 -16724 -14488 5235 14800 27004 19855 -17012 -30140 -46104 -28416 -7075 16576
12212A6576N9k1814l6602q70R946L0883J1205n227J2759j3658J5880J1288r080
$$ 16576 16635 -5179 -41781 -42651 -32705 -1822 9383 4156 16915 3257 19137 30425 21345
12199B1345J7655k0179j7580j9422J1594O661J2728j9360m4187N124M3584j2754
$$ 21345 39000 18821 1241 -18181 -6587 74 12802 -6558 -50745 -45621 -2037 -14791
12187a4791L692q884J2600L7781J6809j2501j3020j1485K694K2076j3640l1876
$$ -14791 -11099 -19983 -7383 30398 47207 34706 21686 10201 12895 34971 21331 -10545
12175a0545k6919o385L341K1196J2446J3973R682j0841j5346l504L678J6649k0767
$$ -10545 -37464 -43849 -40508 -19312 -6866 7107 16789 5948 -9398 -12902 -9224 7425 -13342
12162a3342j0090j6846p183O953K3044J7649j1976n252m429j9306M026J966N364
$$ -13342 -23432 -40278 -47461 -40508 -17464 185 -11791 -17043 -21472 -40778 -36752 -34786 -29422
12149b9422j3211k436J1415R579J3729J6283j0312M488K2132J4484P280m0166
$$ -29422 -42633 -45069 -33654 -24075 -10346 5937 -4375 113 22245 36729 44009 3843
12137C843k4877M880J9294j1464j7516J4773J9878J0387j1976q716Q606r996k3006
$$ 3843 -21034 -16154 3140 -8324 -25840 -11067 8811 19198 7222 -1494 7112 -2884 -25890
12124b5890L853L386L4481j6519j1599Q333M810j8293l300k5575j8378L4979L7232
$$ -25890 -22037 -18651 15830 -689 -12288 -3955 855 -17438 -20738 -46313 -64691 -29712 7520
12111G520K6425R895j2337k6202J7949L486J4610k4656l7211n57K6586J8130k207
$$ 7520 33945 43840 31503 5301 23250 26736 41346 16690 -20521 -21078 5508 23638 21431
12098B1431J879L700j0246j2010l2323o412K757J5847J1114K869Q641j2005k76
$$ 21431 23310 27010 16764 4754 -27569 -33981 -31224 -15377 -4263 -1394 7247 -4758 -5034
12085e034N827j1384L0640K0266J0682l1761p264K9929j3201k1126J3049K1704
$$ -5034 793 -10591 20049 40315 50997 19236 11972 41901 28700 7574 20623 42327
12073D2327J3863l0948n880k1865J8976J5844r847j2202j1721k9551L981J1328
$$ 42327 56190 25242 19362 -2503 16473 32317 22470 10268 -1453 -31004 -27023 -15695
12061a5695o54r870j2051P757L1925j101k6907K257J7193k3876J9160J1598o73
$$ -15695 -16349 -26219 -38270 -30513 1412 311 -26596 -24339 -7146 -31022 -11862 -264 -937
12048i37j1886O499J6202J7633p518N07J1406k1293K0835L8437J2035K8579Q4313
$$ -937 -12823 -6324 9878 27511 19993 20500 31906 10613 31448 69885 81920 110499 194812
12035A94812J69080K08988L6799j88599j61574p1762k0528k0278p960J6327L7183
$$ 194812 363892 572880 609679 421080 259506 187744 167216 146938 138978 155305 192488
12024A92488Q8766K11366J33972j44287k30273j24964n1136m2511l5455o941p812
$$ 192488 281254 492620 626592 482305 252032 127068 75932 33421 -2034 -8975 -16787
12013a6787j7340l162K1356J3407J9831K572k1572k8757J7644J7478k711j2969
$$ -16787 -34127 -37289 -15933 -2526 17305 19877 -1695 -30452 -12808 4670 1959 -11010
12001a1010O920J0366J472J74Q258N495j7203k7901l4896K2643N1544J1594l2165
$$ -11010 -4090 6276 7748 7922 16180 21675 4472 -23429 -58325 -35682 15862 27456 -4709
11988d709j4143j490l658J5844L2364J4596k7591j9602q562q380J0898l629J7683
$$ -4709 -18852 -20342 -24000 -8156 24208 38804 11213 -8389 -16951 -25331 -14433 -18062 -379
11975c79N069q630O427L368J3987j2973o924O778j9082m325L215R540J9476p691
$$ -379 4690 -3940 2487 5855 19842 6869 -55 6723 -12359 -16684 -13469 -3929 15547 7856
11961G856j7042K615J1904p938j2162j6005J1093K913j0498J3255O499j1324m511
$$ 7856 -9186 -6571 5333 -2605 -14767 -30772 -19679 -16766 -27264 -14009 -7510 -18834 -23345
11948b3345l315L0364K40q401k074k2813q550o686k3800L1623R666N704L6653
$$ -23345 -26660 3704 3944 -4457 -6531 -29344 -37894 -44580 -68380 -36757 -27091 -21387 15266
11935A5266J4008K0120k9215k6555j6004Q525L4620k2066O396N65p019r118k5991
$$ 15266 29274 49394 20179 -6376 -22380 -13855 20765 -1301 5095 5660 -1359 -10477 -36468
11922c6468K303J2093n251J5223j6020m816J0342P972n351J9091M341J6705J2494
$$ -36468 -34165 -22072 -27323 -12100 -28120 -32936 -22594 -14622 -19973 -882 3459 20164 32658
11909C2658m256j4515M307l752Q314K3808j4297l5090l9373j5692K0115L1538
$$ 32658 28402 13887 18194 14442 22756 46564 32267 -2823 -42196 -57888 -37773 -6235
11897f235J6763r921k5253j6901K292R728K2508L4833N14n937l974k2299M927
$$ -6235 10528 607 -24646 -41547 -39255 -29527 -7019 27814 28328 22391 18417 -3882 1045
11884A045J4673N3002k9281l9039J1156J2552n5257k4260K5331J3789j2769k923
$$ 1045 15718 68720 39439 400 11556 24108 -31149 -55409 -30078 -16289 -29058 -31981
11872c1981j3714j23j7668l300L3953k751L4234L606J027l641N840j3200o730
$$ -31981 -45695 -45818 -63486 -66786 -32833 -35584 -1350 2256 3283 -358 5482 -7718 -14448
11859a4448j9889j0781j6573K3954J3768k6558L0250k5769k0023K3256L0735J5040
$$ -14448 -34337 -45118 -61691 -37737 -23969 -50527 -20277 -46046 -66069 -42813 -12078 2962
11847B962Q63j4388l658J8383L483j9783l007L862p064j6817M248M167j3840J4007
$$ 2962 3825 -10563 -14221 4162 7645 -12138 -15145 -11283 -18347 -35164 -30916 -26749 -40589 -26582
11833b6582N427l412K1204M312M932K07j106k8527J567J7511L8260P554j2738
$$ -26582 -21155 -24567 -3363 949 5881 6088 4982 -23545 -21978 -4467 33793 41347 28609
11820B8609j3252l053n188j7365o39k1489m974k6186J924L4122J6885j0349J1535
$$ 28609 15357 12304 7116 -10249 -10888 -32377 -37351 -63537 -61613 -27491 -10606 -20955 -9420
11807i420O924j3828m234j8555L160J8653m102J971n189J7616J1101k7431k1826
$$ -9420 -2496 -16324 -20558 -39113 -35953 -17300 -21402 -19431 -24620 -7004 4097 -23334 -45160
11794d5160n166L650L4581J1663J1462k443J0999J2563l156q542o202o570J3156
$$ -45160 -50326 -46676 -12095 -432 11030 8587 19586 32149 28993 20451 14249 7679 20835
11781B0835j479p595k7196j0914M736k928J7322J5974p585m958l0112l3737k3319
$$ 20835 19356 11761 -15435 -26349 -21613 -24541 -7219 8755 1170 -3788 -33900 -67637 -90956
11768i0956N2397L4206m161K293m566K4467j347j6183o841m015J3823J7998l624
$$ -90956 -38559 -4353 -8514 -6221 -10787 13680 12333 -3850 -10691 -14706 -883 17115 13491
11755A3491m007j9164J6273o680k9657k1109K9294Q386K0889K3936J6582m2499
$$ 13491 9484 -9680 6593 -87 -29744 -50853 -21559 -13173 7716 31652 48234 5735
11743E735n675K2332k4683m1706k860J0736J722P652m06O774P163j1640l0085
$$ 5735 60 22392 -2291 -43997 -46857 -36121 -34399 -26747 -27153 -20379 -13216 -24856 -54941
11730e4941J1874J2297O671J3824J3291k1482J031n276K5604k126L3129K7530
$$ -54941 -43067 -30770 -24099 -10275 3016 -18466 -17435 -22711 2893 767 33896 61426
11718F1426k9601k1495k6694p222j4970j0349Q385J3851p45r985R459M518q822
$$ 61426 31825 10330 -16364 -23586 -38556 -48905 -40520 -26669 -27414 -37399 -27940 -23422 -32244
11705c2244J7001L6325K0631K4675j3676j0807l0495k1112J184L840L033L0911
$$ -32244 -15243 21082 41713 66388 52712 41905 11410 -9702 -8518 -4678 -1645 29266
11693B9266J1227j3540n88j2563j6857l9329k489J8388N955L9005J7750k4475
$$ 29266 40493 26953 26365 13802 -3055 -42384 -44873 -26485 -20530 18475 36225 11750
11681A1750j9984l797k7785l1516j162k283j694R867K8896q755p464M4128J4724
$$ 11750 -8234 -12031 -39816 -71332 -72494 -74777 -76471 -66604 -37708 -46463 -53927 -9799 4925
11668D925N539p108l2655l717L0160J0781K532j9132J1737Q214n882k8506j1340
$$ 4925 10464 3356 -29299 -33016 -2856 7925 10457 -8675 3062 11276 5394 -23112 -34452
11655c4452J6712m006N531R614l463j7202k1352L3754j4430j1001j1261j4894
$$ -34452 -17740 -21746 -16215 -6601 -10064 -27266 -48618 -14864 -29294 -40295 -51556 -66450
11643f6450L8051O225k4622R735J7494M704M404K218O773j7519q23L585J0193
$$ -66450 -28399 -22174 -46796 -37061 -19567 -14863 -10459 -8241 -1468 -18987 -19810 -16225 -6032
11630f032l479m703j6832r104K606O919J7279J713k0875J7145K3117K419p309
$$ -6032 -9511 -14214 -31046 -40150 -37544 -30625 -13346 -11633 -32508 -15363 7754 10173 2864
11617B864j1620J2326r582k2180p950P780J0748K045K3151J6684j4592n1105p416
$$ 2864 -8756 3570 -6012 -28192 -36142 -28362 -17614 -15569 7582 24266 9674 -41431 -48847
11604d8847J2251J9617L7204j8421k1135j8649o941K2245P456J614k1292J0297
$$ -48847 -36596 -16979 20225 1804 -19331 -37980 -44921 -22676 -15220 -13606 -34898 -24601
11592b4601J2250j1889P680J1419k0148j4073K4430J2067m573j578k850J1469
$$ -24601 -12351 -24240 -16560 -5141 -25289 -39362 -14932 -2865 -7438 -9016 -11866 -397
11580c97Q936r048k4958k053K4613M44j6243L41j8323J0336L101J1068m200O774
$$ -397 8539 -509 -25467 -27520 -2907 -2463 -18706 -18365 -36688 -26352 -23251 -12183 -16383 -9609
11566i609J7014j1861o639K9395K4527R857k6107l1921l2850N00R313J3433J776
$$ -9609 7405 -4456 -11095 18300 42827 52684 26577 -5344 -38194 -37694 -28381 -14948 -13172
11553a3172k4076j3748J2042K0321J2314j0157j2150m129l032R08J8374L3206
$$ -13172 -37248 -50996 -38954 -18633 -6319 -16476 -28626 -32755 -35787 -34879 -16505 16701
11541A6701K2711j9788O114Q386m6990k2643R263k013O94J4527J6800J6388N072
$$ 16701 39412 19624 25738 34124 -12866 -35509 -26246 -28259 -27565 -13038 3762 20150 25222
11528B5222p327j2483q164p539j4865M886r358J7548j0874j8638k917k0727J5651
$$ 25222 17895 5412 -2752 -10291 -25156 -20270 -29628 -12080 -22954 -41592 -44509 -65236 -49585
11515d9585M23O047j1749k0513K2210J3647j4981K2942K2609j272K5414n093r628
$$ -49585 -49162 -43115 -54864 -75377 -53167 -39520 -54501 -31559 -8950 -10222 15192 10099 471
11502D71J9260j296k4420k136L0212J2684j8552k3081Q509K8273j081k9290k6615
$$ 471 19731 18435 -5985 -8121 22091 34775 16223 -6858 1651 29924 28843 -447 -27062
11489b7062r610J2547L2089J7851J8885j6148j8656q506j4369J7985J71J4529
$$ -27062 -36672 -24125 7964 25815 44700 28552 9896 1390 -12979 5006 5177 19706
11477A9706O409j7181M211k506O399K4882N591j5335J6696q758l2842j8600p360
$$ 19706 26115 8934 13145 10639 17038 41920 47511 32176 48872 40114 7272 -11328 -18688
11464a8688P63J9278k389q514j0160q465k718o705J9038J1196J2999j9613R687
$$ -18688 -17925 1353 -1036 -9550 -19710 -28175 -30893 -37598 -18560 -7364 5635 -13978 -4291
11451d291j0271j8366J1818r669J0624r579k670j2711K2484P359k291K843P397
$$ -4291 -14562 -32928 -21110 -30779 -20155 -29734 -32404 -45115 -22631 -15272 -17563 -14720 -7323
11438g323J5452j550j2443l2234N336J957J4438J1707r266r033n33n747p094J5579
$$ -7323 8129 6579 -5864 -38098 -32762 -30805 -16367 -4660 -13926 -22959 -23492 -29239 -36333 -20754
11424b0754J0961O67K0223q067J1410k9608j2774m110K300J6648J3099j644j5350
$$ -20754 -9793 -9126 11097 3030 14440 -15168 -27942 -32052 -29752 -13104 -5 -1649 -16999
11411a6999k8808q958L82m117K7341K4162R097k5838j9266L4374k213n921J5083
$$ -16999 -45807 -54765 -54383 -58500 -31159 -6997 2100 -23738 -43004 -8630 -10843 -16764 -1681
11398a681j7058l2161l508l194L404K8029L2130l179L3082q380k1075q019L2871
$$ -1681 -18739 -50900 -54408 -57602 -54198 -26169 5961 2782 35864 27484 6409 -1610 31261
11385C1261J595l9071l4769l542L3214K1784n469O465Q229j6379j8520j1870q455
$$ 31261 32856 -6215 -40984 -44526 -11312 10472 5003 11468 19697 3318 -15202 -27072 -35527
11372c5527L315r884j250J5865p635L2156K0966p883r004J4895K1136j0981l9851
$$ -35527 -32212 -42096 -43346 -27481 -35116 -2960 18006 10123 1119 16014 37150 26169 -13682
11359a3682n154J7711J3825K3627K154k3832k2841L3066K5357j6064r908j4389
$$ -13682 -18836 -1125 12700 36327 38481 14649 -8192 24874 50231 34167 24259 9870
11347I870l3678n237J4598P062L9J3400k1018o079k442j9392J6179l5Q889J8549
$$ 9870 -23808 -29045 -14447 -7385 -7346 6054 -14964 -21043 -23485 -42877 -26698 -26733 -17844 705
11333G05O610k365J833r558L5922J923k3638k5370j1889L000N172L4004n826j730
$$ 705 7315 4950 6783 -2775 33147 35070 11432 -13938 -25827 -22827 -17655 16349 10523 8793
11319H793L741k1980k2698L852J6572N482R899j1522l6191k5773J1686J8542K5563
$$ 8793 12534 -9446 -32144 -28292 -11720 -6238 3661 -7861 -44052 -69825 -58139 -39597 -14034
11306a4034J604P734l8199j8272O541K0148J700Q798L7307J8818J7701j138k0302
$$ -14034 -12430 -4696 -42895 -61167 -54626 -34478 -32778 -23980 13327 32145 49846 48708 28406
11293B8406k7177j4436p134J7245J616q444p214p775J1911J7126Q68J3787m424
$$ 28406 1229 -13207 -20341 -3096 -1480 -9924 -17138 -24913 -13002 4124 4992 18779 14355
11280A4355q561n095j4467m765J5229K7417Q397j3496K0946M480k1519q542r472
$$ 14355 5794 699 -13768 -18533 -3304 24113 32510 19014 39960 44440 22921 14379 4907
11267D907J0151r27J1684j888m90m2422k3194K3942L3374j6909q566M881j6648
$$ 4907 15058 14131 25815 23927 23437 -18985 -42179 -18237 15137 -1772 -10338 -5457 -22105
11254b2105j2788l63j5182K0500K433m893J3302j5794J1464R838K6224J7728k3718
$$ -22105 -34893 -35256 -50438 -29938 -27505 -32398 -19096 -34890 -23426 -13588 12636 30364 6646
11241F646J2640j061J0843k250l3865n045L4215J152l1474p176J4141J750q502
$$ 6646 19286 18225 29068 26818 -7047 -12092 22123 23275 -8199 -15375 -1234 516 -7986
11228g986J4781J3308o628k6434j5734j611p471L0062q614N645R6P926J2497k566
$$ -7986 6795 20103 13475 -12959 -28693 -30304 -37775 -7713 -16327 -10682 -10586 -2660 9837 7271
11214G271L095J237o385L0663L5501r987j1173j3989l1084J427J1426q661l485
$$ 7271 10366 11603 5218 35881 71382 61395 50222 36233 5149 6576 18002 9341 5856
11201E856l546R817k7460l5712K8119L4233p631K629r163j1971J991n325n493
$$ 5856 2310 12127 -15333 -51045 -22926 11307 3676 6305 -2858 -14829 -12838 -18163 -23656
11188b3656R267j387O170q071p934J6240Q394j5436j2724r812J6341J7110K3904
$$ -23656 -14389 -15776 -9606 -17677 -25611 -9371 -977 -16413 -29137 -38949 -22608 -5498 18406
11175A8406J7101n068k7435l7145j0512M301j0863K6288J9973R531Q418k3240
$$ 18406 35507 30439 3004 -34141 -44653 -40352 -51215 -24927 -4954 4577 12995 -10245
11163a0245k5392N424M04J959K1186K4375j3585j2571q683K8463j045l13o078
$$ -10245 -35637 -30213 -29809 -27850 -6664 17711 4126 -8445 -17128 11335 10290 9977 3899
11150C899j6565J9666j6002j4079k5344l571M1906L0868J2789j184k2490q858
$$ 3899 -12666 7000 -9002 -23081 -48425 -51996 -10090 20778 33567 32383 9893 1035
11138A035P84j253P069K678O532J4051P340k0430m1843k2523Q229P277J0889J9524
$$ 1035 1819 566 7635 10313 16845 30896 38236 17806 -24037 -46560 -38331 -31054 -20165 -641
11124f41L0j4044n4471p104K1896J5702L5800M728l4763j3334K1286J1125J4073
$$ -641 -611 -14655 -69126 -76230 -54334 -38632 -2832 1896 -32867 -46201 -24915 -13790 283
11111B83l5094p775L1995l126O764J2884j6780J8967O009j2008j6079j0207M378
$$ 283 -34811 -42586 -10591 -13717 -6953 5931 -10849 8118 14127 2119 -13960 -24167 -19789
11098a9789J0751o882j2312l84J8577K9826j864N691R427m400r03K384j3345l1481
$$ -19789 -9038 -15920 -28232 -28616 -10039 19787 17923 23614 33041 28641 27738 30122 16777 -14704
11084a4704r544J2049n157j2961L5319p978l0550p939K2467N268O913K8649j8350
$$ -14704 -24248 -12199 -17356 -30317 5002 -2976 -33526 -41465 -18998 -13730 -6817 21832 3482
11071C482M788k618J7288j0167k996j8605l2565K176Q498P723K3058L0828K0171
$$ 3482 8270 5652 22940 12773 9777 -8828 -41393 -39217 -30719 -22996 62 30890 51061
11058E1061l2554l4012K4538N284J0578K0148k803j8659j0905k3409j6312j4016
$$ 51061 18507 -15505 9033 14317 24895 45043 42240 23581 12676 -10733 -27045 -41061
11046d1061L4191K6968o77N459k4370j4807P234L7534K8911n006j3898m769k564
$$ -41061 -6870 20098 19421 24880 510 -14297 -7063 30471 59382 54376 40478 35709 33145
11033C3145k8604q473r3K9927K3334o87l7683O15L754K957j6884k1549k8775J2794
$$ 33145 4541 -3932 -4025 25902 49236 48549 10866 11481 15235 18192 1308 -20241 -49016 -36222
11019c6222J742j2960L402K8746N2296J4830J9552l6250j8877J1078K0784J2155
$$ -36222 -34480 -47440 -44038 -15292 37004 51834 71386 35136 16259 27337 48121 60276
11007F0276q645j1364J922J5289k1035k7862L465j0788j0385m1556R3L3702K2160
$$ 60276 51631 40267 42189 57478 36443 8581 12046 1258 -9127 -50683 -50590 -16888 5272
10994E272k996K29R904l103j1638l6856m912J148R151J5039J091p73L1102L4550
$$ 5272 2276 2505 12409 9306 -2332 -39188 -44100 -42952 -33801 -18762 -17671 -18444 12658 47208
10980D7208o957l1660n036K1529J8427j8581l0302j6436o799P95J4957l276n479
$$ 47208 40251 8591 3555 25084 43511 24930 -5372 -21808 -28607 -27812 -12855 -16131 -21610
10967b1610K152M2269J5370j6264k5610O7Q570O429o254q971R282J6310K462j7730
$$ -21610 -19458 22811 38181 21917 -3693 -3626 4944 11373 5119 -3852 5430 21740 24202 6472
10953F472j2827l1698k4222k308l722L947J1403l474j7849J6594j4584K9324L7288
$$ 6472 -6355 -38053 -62275 -64583 -68305 -64358 -52955 -56429 -74278 -57684 -72268 -42944 -5656
10940e656K176N265o311r255K0294K5050P544j1107k0935j4210m0918n074L6209
$$ -5656 -3480 1785 -4526 -13781 6513 31563 39107 28000 7065 -7145 -48063 -53137 -16928
10927a6928J8629K3573J3840l965j3375j7210l31J0080m338k7499k9316k8539
$$ -16928 1701 25274 39114 35149 21774 4564 4233 14313 9975 -17524 -46840 -75379
10915g5379R568J4478K3278l16J5356K476N082J0806L4r104K0748l121k2632j7984
$$ -75379 -65811 -51333 -28055 -28371 -13015 -10539 -5457 5349 5383 -3721 17027 13906 -8726 -26710
10901b6710N406J2192j0933N719J504m307O317K8559K606J3335l8872j7686L1392
$$ -26710 -21304 -9112 -20045 -14326 -12822 -17129 -10812 17747 20353 33688 -5184 -22870 8522
10888H522K6808L92j4431l915N391J1783K613J5026j5000k7265j8327k0599n300
$$ 8522 35330 35722 21291 17376 22767 34550 37163 52189 37189 9924 -8403 -29002 -34302
10875c4302L3435K5387l619j3231k5540j5890Q039R640L1557K5342k630j8532
$$ -34302 -867 24520 20901 7670 -17870 -33760 -25721 -16081 15476 40818 38188 19656
10863A9656j4994j2102k3944J3603J8561O606L1327j3696n470m216j4302k278
$$ 19656 4662 -7440 -31384 -17781 780 7386 38713 25017 19547 15331 1029 -1249
10851a249K9802K0840N411r04j8783j8609j5476k1220l442j1675J62L5157M354
$$ -1249 28553 49393 54804 53900 35117 16508 1032 -20188 -23630 -35305 -35143 14 4368
10838D368l1667k9122Q41L0606j2335J6659L2486l397L766P873j7556j4109q911
$$ 4368 -27299 -56421 -55580 -24974 -37309 -20650 11836 8439 12205 20078 2522 -11587 -20498
10825b0498j8636l920K6836L1379j4129j1471P208J186l606j4171n73K0309J9491
$$ -20498 -39134 -43054 -16218 15161 1032 -10439 -3231 -2045 -5651 -19822 -20395 -86 19405
10812A9405J3091l6573j7845R563K7962O959Q256k5018j3004Q116j6263j8443
$$ 19405 32496 -4077 -21922 -12359 15603 22562 30818 5800 -7204 912 -15351 -33794
10800c3794J699J4765o757j4176q021K5058J954J847J8170j6419l1690K0233K4684
$$ -33794 -32095 -17330 -24087 -38263 -46284 -21226 -19272 -17425 745 -15674 -47364 -27131 -2447
10787b447j3466r98L5019P901m9801j2180j308j8624L936L2038O310j2131r200
$$ -2447 -15913 -16911 18108 26009 -23792 -35972 -37280 -55904 -51968 -19930 -13620 -25751 -34951
10774c4951q505Q659R075N006j3899P164P155P681Q332M429o301j4745K3882J5233
$$ -34951 -43456 -34797 -25722 -20716 -34615 -27451 -20296 -12615 -4283 146 -6155 -20900 2982 18215
10760A8215q299k7660k3325K9103J6744M834j5501j745k4309l3451Q4J6718J9226
$$ 18215 9916 -17744 -41069 -11966 4778 9612 -5889 -7634 -31943 -65394 -65310 -48592 -29366
10747b9366j9033J3152M984O633k1240q257P650K7017L0201j5828j1344l051J3366
$$ -29366 -48399 -35247 -30263 -23630 -44870 -53127 -45477 -18460 11741 -4087 -15431 -18482 -5116
10734e116J3259K0888L9198k4344k5581k3025M264K317N671n367n257P083J6887
$$ -5116 8143 29031 68229 43885 18304 -4721 -457 1860 7531 2164 -3093 3990 20877
10721B0877P332j1097j266q196Q425l469j9432m036j8028p835j9055j0881J1274
$$ 20877 28209 17112 15846 7650 16075 12606 -6826 -10862 -28890 -36725 -55780 -66661 -55387
10708e5387J5744L138P691Q021J0486l985o517J7524J6447j0014j7970K8655K5064
$$ -55387 -39643 -36505 -28814 -20793 -10307 -14292 -20809 -3285 13162 3148 -14822 13833 38897
10695C8897n168J06l745j2830N841O758J5646j2426l9567m684j4624M655M154
$$ 38897 33729 33835 30090 17260 23101 29859 45505 33079 -6488 -11172 -25796 -21141 -16987
10682a6987J6613n851j1263l544J6831n650k2506P233P505m1L9424J0111p440
$$ -16987 -374 -6225 -17488 -21032 -4201 -9851 -32357 -25124 -17619 -17660 21764 31875 24435
10669B4435j3476j8655k215r933o172l297J8742K0436k0315p452M4271m801j5984
$$ 24435 10959 -7696 -9911 -19844 -26016 -29313 -10571 9865 -10450 -17902 26369 21568 5584
10656E584k582Q746P993L121k700k5153j4151j4738O266J2190J4670J6728J4353
$$ 5584 3002 11748 19741 22862 20162 -4991 -19142 -33880 -27614 -15424 -754 15974 30327
10643C0327L580N749k0943k1227j3676J6972R063j0794P221J0012J891j1923k4226
$$ 30327 33907 39656 18713 -2514 -16190 782 9845 -949 6272 16284 18175 6252 -17974
10630a7974J0859J4579R360l1943j711l3J2783n65k3724j3129K6861K2659L718
$$ -17974 -7115 7464 16824 -15119 -16830 -16863 -4080 -4645 -28369 -41498 -14637 8022 11740
10617A1740k1729r421k0110K3466L4728J7550K072j0454j4425j7903J3971k073
$$ 11740 -9989 -19410 -39520 -16054 18674 36224 38296 27842 13417 -4486 9485 7412
10605G412l343j1868o069J9834n374k4607J7312j2317P25j0237j5042o328O396
$$ 7412 4069 -7799 -13868 5966 592 -24015 -6703 -19020 -18295 -28532 -43574 -49902 -43506
10592d3506L8547J1960k8261Q281J6107r911L82j0889J5287P356k3583J8094r071
$$ -43506 -4959 7001 -21260 -12979 3128 -6783 -6401 -17290 -2003 5353 -18230 -136 -9207
10579i207n595J3032j3272k5263K4978M016k677m988R247J4448n943k8980K4078
$$ -9207 -14802 -1770 -15042 -40305 -15327 -11311 -13988 -18976 -9729 4719 -1224 -30204 -6126
10566f126q690J462L5412J6949q508J0473o285k7443O720R589K4234J704k1970
$$ -6126 -14816 -13354 22058 39007 30499 40972 34687 7244 13964 23553 47787 49491 27521
10553B7521j6939L711k6097j3978m107q199J8412N4747P548p111j7596J1362l7468
$$ 27521 10582 14293 -11804 -25782 -29889 -38088 -19676 35071 42619 35508 17912 29274 -8194
10540h194J2467k48P752k6089N09N757l369M820j2652M684K129j7910P627j5615
$$ -8194 4273 4025 11777 -14312 -13803 -8046 -11415 -6595 -19247 -14563 -12434 -30344 -22717 -38332
10526c8332M454K7854K3040J4608J861J930j6759J826k446n00p049J9353J4222
$$ -38332 -33878 -6024 17016 31624 33485 35415 18656 20482 18036 17536 10487 29840 44062
10513D4062k0169j3586k2100m639J3671l586k990o89m054L65L7362q71k8297o354
$$ 44062 23893 10307 -11793 -16432 -2761 -6347 -9337 -10026 -14080 -13715 23647 22776 -5521 -11875
10499a1875Q436J2729K0193j2358r997J2271J7421r426O267j2430k8656j3166
$$ -11875 -3439 9290 29483 17125 7128 19399 36820 27394 33661 21231 -7425 -20591
10487b0591J299j8656p008K2082J7073j0335n469K1087N133j939j750j9852j2573
$$ -20591 -19292 -37948 -44956 -22874 -5801 -16136 -21605 -518 4615 2676 926 -18926 -31499
10474c1499L999j152K59M2579J2039r040n129k8855k2299k559J1869J8498K280
$$ -31499 -27500 -28652 -28393 14186 26225 17185 12056 -16799 -39098 -41657 -29788 -11290 -9010
10461i010K81j5007j8608n434J6779L0705j4578j7028j9502o135J6924N429j382
$$ -9010 -8729 -23736 -42344 -47778 -30999 -294 -14872 -31900 -51402 -57537 -40613 -35184 -36566
10448c6566J1386O577J4805M033k8509J1148N621K521K5466K6847p774j6066R388
$$ -36566 -25180 -18603 -3798 235 -28274 -17126 -11505 -8984 16482 43329 35555 19489 28877
10435B8877J8352K0022q531j6380j4684j340j8443k0852K3648r859O259M100K632
$$ 28877 47229 67251 58720 42340 27656 26316 7873 -12979 10669 810 7069 11169 13801
10422A3801j7404q376q086j2384K07q003n346L3529K2494j2268j4855p554Q147
$$ 13801 -3603 -11979 -20065 -32449 -32242 -40245 -45591 -12062 10432 -1836 -16691 -24245 -16098
10409a6098j1148J3579L2133n634j5053J2395KO665J4985r976P181j7665j3347
$$ -16098 -27246 -13667 18466 12832 -2221 10174 10176 16841 31826 21850 29031 11366 -1981
10396a981J2667K3000J074j0028K699o014J4103p900k3763M275l221N747j2637
$$ -1981 10686 33686 34760 24732 27431 21417 35520 27620 3857 8132 4911 10658 -1979
10383a979j2642j3864j1731q351L4734L8223n331j5975m3627M182K3320N777J1909
$$ -1979 -14621 -28485 -40216 -48567 -13833 24390 19059 3084 -40543 -36361 -13041 -7264 4645
10370D645L321j3086k4773K2427l239J672N521n495K102J3991r573j9362j2786
$$ 4645 7966 -5120 -29893 -7466 -10705 -9033 -3512 -9007 -6905 7086 -2487 -21849 -34635
10357c4635L1051M4751K4142j5370o158j3791J440o528N14l6271J340K9766R922
$$ -34635 -3584 41167 65309 49939 43781 29990 31430 24902 25416 -10855 -9515 20251 30173
10344C0173J0277j1923n572p864J2418k0646J3849J6535l3213o102j9827j7437
$$ 30173 40450 28527 22955 15091 27509 6863 20712 37247 4034 -2068 -21895 -39332
10332c9332K3196N1426K0350n829Q764j698k6682k2669L285K6336j7368j9567
$$ -39332 -16136 35290 55640 49811 58575 56877 30195 7526 10811 37147 19779 212
10320B12j3897j0653K8425R248Q115j1906K338n217p831K041J3056R533j2016
$$ 212 -13685 -24338 4087 13335 21450 9544 11882 6665 -1166 875 13931 23464 11448
10307A1448j7134j0387o949J0876R993K0820l372k6342J1317K9546P862k1451
$$ 11448 -5686 -16073 -23022 -12146 -2153 18667 15295 -11047 270 29816 37678 16227
10295A6227M217o046p943j5139j8412k3674j850K4072Q307p52o762Q432L929Q010
$$ 16227 20444 14398 6455 -8684 -27096 -50770 -52620 -28548 -20241 -20993 -27755 -19323 -15394 -7384
10281g384j6979p083J3681J1316q859k97J660q046J0253j747j5590J1858L1153
$$ -7384 -24363 -31446 -17765 -6449 -15308 -15605 -13945 -21991 -11738 -13485 -29075 -17217 13936
10268A3936Q584N282j0522j0239K3647K6359n197n3637k940k1184J7407L8167
$$ 13936 22520 27802 17280 7041 30688 57047 51850 -1787 -4727 -25911 -8504 29663
10256B9663J64j7809K124J4044k2559r619L0663p34o554l018q392k4418k7m924
$$ 29663 29827 12018 14142 28186 5627 -3992 26671 25937 19383 16365 7973 -16445 -16472 -21396
10242b1396k3732p847L0208L4689j3679l910n246r320q672m46J3716J5597P168
$$ -21396 -45128 -52975 -22767 11922 -1757 -5667 -10913 -20233 -28905 -29351 -15635 -38 7130
10229G130j900q323j431P098o491j5898k7127P877K4390N9119m435Q795j4960
$$ 7130 5230 -3093 -4524 2574 -3917 -19815 -46942 -39065 -14675 44444 40009 48804 33844
10216C3844q688k2057O40k5744j935K9470K3053O559j5555j4942k3682K598J9896
$$ 33844 25156 3099 3739 -22005 -23940 5530 28583 35142 19587 4645 -19037 -16439 3457
10203C457p077j1623p256l311M158l844O984J4775p266K7117j6967k1119j4845
$$ 3457 -3620 -15243 -22499 -25810 -21652 -25496 -18512 -3737 -11003 16114 -853 -21972 -36817
10190c6817J2713M546M2000J8524j8117k0618j5237R246J7441k4149j7461K387
$$ -36817 -24104 -19558 22442 40966 22849 2231 -13006 -3760 13681 -10468 -27929 -25542
10178b5542N954q899r698O26K1514L645j154R630j0541k476K664j709l317J0881
$$ -25542 -19588 -28487 -38185 -37559 -16045 -12400 -13554 -3924 -14465 -16941 -14277 -15986 -19303 -8422
10164h422K4177k634l348p592r291L918l813l0257n131J5666K192J8628J5025
$$ -8422 15755 13121 9773 2181 -7110 -3192 -7005 -37262 -42393 -26727 -24535 -5907 9118
10151I118o264J4053P341j8209l6503n516K1720Q039M102o973q019O825O615p151
$$ 9118 2854 16907 24248 6039 -30464 -35980 -14260 -6221 -2119 -9092 -17111 -10286 -3671 -10822
10137a0822J277K6627M843R65j4324j5481K458J7416p891j5737K539m775J5589
$$ -10822 -9545 17082 21925 22890 8566 -6915 -4457 12959 5068 -10669 -8130 -12905 2684
10124B684N454j1454j3042L7885N499O727o78R509j6966j3766J7178j3848j9949
$$ 2684 8138 -3316 -16358 21527 27026 33753 33075 42584 25618 11852 29030 15182 -4767
10111d767N063K7411Q592L4294J6842k7525l4979J047j6303r218K6968K4664m759
$$ -4767 296 27707 36299 70593 87435 59910 24931 25978 9675 457 27425 52089 47330
10098D7330k1821m161j273j9678j718p840J9993j823o95o259k0230j1272K2825
$$ 47330 25509 21348 20075 397 -1321 -9161 10832 9009 8314 2055 -18175 -29447 -6622
10085f622L5133J4638k0555P310m699j2835N923J7309j3281p468j182K490J0517
$$ -6622 28511 43149 22594 29904 25205 12370 18293 35602 22321 14853 13671 16161 26678
10072B6678j0360k3168P580N457q144J2357J6084r649j3342k0017k3230K7854
$$ 26678 16318 -6850 730 6187 -1957 10400 26484 16835 3493 -16524 -39754 -11900
10060a1900L7124K691j279l2250j257l6539k632L5027J4643K1670J1600j9410
$$ -11900 25224 27915 26636 -5614 -6871 -43410 -46042 -11015 3628 25298 36898 17488
10048A7488K1846r185k4360J2314K5190M0645N1820Q7755L7218o5961j00488m6508
$$ 17488 39334 30149 5789 18103 43293 83938 135758 223513 260731 194770 94282 47774
10036D7774l09j2331K347K2989J1283r647k6017M544O0j3665J0266j3790l306
$$ 47774 47465 35134 37481 60470 71753 62106 36089 40633 40693 27028 37294 23504 20198
10023B0198m068Q723J714J0720k2714n280J3880o850j6570K060Q79L80J7481K0262
$$ 20198 16130 24853 26567 37287 14573 9293 23173 16323 -247 1813 2692 3072 20553 40815
10009D0815k6391k1365J3648N573m1211j9058J9266L053J6040K243m010j7018
$$ 40815 14424 -6941 6707 12280 -28931 -47989 -28723 -25670 -9630 -7387 -11397 -28415
9997b8415K5782J143o253J0996q457Q628J864R990j229l087R325m911k3414j0288
$$ -28415 -2633 -1490 -7743 3253 -5204 3424 5288 15278 14049 10962 20287 15376 -8038 -18326
9983a8326j0300r001Q99N729M7164L1506j1543l159p696l1860J3679J4771q870
$$ -18326 -28626 -37627 -36728 -30999 16165 47671 36128 32969 25273 -6587 7092 21863 12993
9970A2993j4955k1675N025K8275j0853O307r797Q050k40j455j6852p080K7123
$$ 12993 -1962 -23637 -18612 9663 -1190 5117 -4680 3370 3130 1675 -15177 -22257 4866
9957D866K2498J432k2695k1867j5562J1440J1323j1463j2183j5253J1267L7969
$$ 4866 27364 28796 6101 -15766 -31328 -19888 -8565 -20028 -32211 -47464 -36197 1772
9945A772J686J3958K384m138j1935j980k0693J2905J7201j6372j41J0785K1798
$$ 1772 3458 17416 19800 15662 3727 1747 -18946 -6041 11160 -5212 -5353 5432 27230
9932B7230K451j6400l159J6531J5298j8745j0139j0828j2418K634J1568m771J7930
$$ 27230 29681 13281 10122 26653 41951 23206 13067 2239 -10179 -7545 4023 -748 17182
9919A7182K5318j7844j4361j0120L361Q033k9350M826j920K6219J4272j0775m554
$$ 17182 42500 24656 10295 175 3536 11569 -17781 -12955 -14875 11344 25616 14841 10287
9906A0287j198O013P030j5491p059r29j0880J5081M115J4561J6596J7029j3224
$$ 10287 9089 15102 22132 6641 -418 -1347 -12227 2854 6969 21530 38126 55155 41931
9893D1931j6164k3664j0303R617K0388l204l348r879K1056K2417j4595Q026l0797
$$ 41931 25767 2103 -8200 1417 21805 18601 15253 5374 26430 48847 34252 42278 11481
9880A1481j7454m278k018k1776j3564K7193J692K0269K8705j1616l4525J7300
$$ 11481 -5973 -10251 -12269 -34045 -47609 -20416 -18724 1545 30250 18634 -15891 1409
9868A409K3924j8661j3640J4066K3321o074j0254K2357J6957l0368j5403q697
$$ 1409 25333 6672 -6968 7098 30419 24345 14091 36448 53405 23037 7634 -1063
9856a063l2262K3951K4172P807K0961p956k7768K0749K1613O550j0693j7450R463
$$ -1063 -33325 -9374 14798 22605 43566 35610 7842 28591 50204 56754 46061 28611 38074
9843C8074J722l1329O920J5336l8876n2669K534K4151L3369n549j3566J079j2413
$$ 38074 39796 8467 15387 30723 -8153 -60822 -58288 -34137 -768 -6317 -19883 -18804 -31217
9830c1217q970K443j4995m368L0759J0375p61j3303K3692K560K516J0155K4001
$$ -31217 -40187 -37744 -52739 -57107 -26348 -15973 -16734 -30037 -6345 -3785 -1269 8886 32887
9817C2887k568K481j9037k3929m748j686J2677J123j3192K3879K4348J5072j7346
$$ 32887 30319 32800 13763 -10166 -14914 -16600 -3923 -2800 -15992 7887 32235 47307 29961
9804B9961k9663M014J3970j5847q038K9374l170R304Q374j4904p541M34j980l9304
$$ 29961 298 4312 18282 2435 -5603 23771 20601 29905 38279 23375 15834 16268 14288 -25016
9790b5016O093R473K1258k892M047J8737j9106m62j0284L48j9297L339Q299p089
$$ -25016 -18923 -9450 11808 8916 12963 31700 12594 12132 1848 2196 -17101 -13762 -5463 -12552
9776a2552J4258K328p810o144j9224j5975J9717K8147J5999J1959p919k056M25
$$ -12552 1706 4034 -3776 -9920 -29144 -45119 -25402 2745 18744 30703 22784 20728 21153
9763B1153j6366o595M2424m421l0963J4655J1779k8902l158L8091j0776m0951
$$ 21153 4787 -1808 40616 36195 5232 19887 31666 2764 -394 37697 26921 -14030
9751a4030J0652L0297J9074r067k3580k1248p970J9470m366J0809o012J525m330
$$ -14030 -3378 26919 45993 36926 13346 -7902 -15872 3598 -768 10041 4029 5554 1224
9738A224J2646L8065L7454k060j4183K442J172k5007j9883N99l7329j1711M0344
$$ 1224 13870 51935 89389 87329 73146 75588 76760 51753 31870 32469 -4860 -16571 23773
9725B3773K0273j9522k440j1669k9247j8408J7361J3595l22N636k752J9463J7551
$$ 23773 44046 24524 22084 10415 -18832 -37240 -19879 -6284 -6606 -970 -3722 15741 33292
9712C3292K6106m012k5162k6918l4M654p643j4486p065n234J665L7719J8360k995
$$ 33292 59398 55386 30224 3306 3272 7926 283 -14203 -21268 -26502 -24837 12882 31242 28247
9698B8247j9808Q890J2372l10j0635k0470n87p012J191K773q460k9322m587L3421
$$ 28247 8439 17329 29701 29391 18756 -1714 -2301 -9313 -8122 -5349 -13809 -43131 -47718 -14297
9684a4297J0107J3647N416L819l2621k70O999j9874N921J2382M647j651k0667
$$ -14297 -4190 9457 14873 18692 -13929 -14199 -7200 -27074 -21153 -8771 -4124 -5775 -26442
9671b6442J3478J4429j4692j1224P885N681L607J293K1728j6231q927Q778j3997
$$ -26442 -12964 1465 -13227 -24451 -16566 -10885 -7278 -5985 15743 -488 -9415 -637 -14634
9658a4634j0023l0878J5101K0471o862K0630L0111N34r400R828j787o973j81J405
$$ -14634 -24657 -55535 -40434 -19963 -26825 -6195 23916 24450 15050 24878 23091 16118 15937 17342
9644A7342L419k766J2275j181L369J6565K707O217r687R737J0725m445j1701k1835
$$ 17342 20761 17995 30270 29089 32458 49023 51730 57947 48260 57997 68722 64277 52576 30741
9630C0741J0352P56n321j8070N975r433k0566m810j7450n865j488J3209J6040
$$ 30741 41093 41849 36528 18458 24433 15000 -5566 -10376 -27826 -33691 -35179 -21970 -5930
9617e930P422J5124k5186m945K6987Q582N825J9746J5138k4848k4312j9740j047
$$ -5930 1492 16616 -8570 -13515 13472 22054 27879 47625 62763 37915 13603 -6137 -7184
9604g184Q791M444J0452J149j1440k802q341j3745r720j1938n207K4705K5770
$$ -7184 1607 6051 16503 17652 6212 3410 -4931 -18676 -28396 -40334 -45541 -20836 4934
9591D934M544j7268L82l0504M034P662N24q364K448j0103J2335K6346j084J5624
$$ 4934 9478 -7790 -7408 -37912 -33878 -26216 -25692 -34056 -31608 -41711 -29376 -3030 -4114 11510
9577A1510Q204j741J112J1027J1105J8296r186j6114l9005o658P341n474k3499
$$ 11510 19714 17973 19085 30112 41217 59513 50327 34213 -4792 -11450 -4109 -9583 -33082
9564c3082K122K4173J5738K8130r156j9346j3052J2431L5118K2481m27K6259k6225
$$ -33082 -30960 -6787 8951 37081 27925 8579 -4473 7958 43076 65557 65130 91389 65164
9551F5164k4928p455R746o885P053J745k7666k8641L682L5751K877L181K8314
$$ 65164 40236 32781 42527 35642 42695 44440 16774 -11867 -8185 27566 30443 33624 61938
9538F1938N081p901m6755J268P048J1635L912k1927j1554k2958p882M269J0958
$$ 61938 67019 59118 12363 13631 20679 32314 36226 14299 2745 -20213 -28095 -23826 -12868
9525a2868J1858J9833J3882p127J0338l922j4149l2765K0031K2979k2625j964
$$ -12868 -1010 18823 32705 25578 35916 31994 17845 -14920 5111 28090 5465 3501
9513C501J4451r564k9373K0417j7454k904q938j4102J3401J6511M801R573l492
$$ 3501 17952 8388 -20985 -568 -18022 -20926 -29864 -43966 -30565 -14054 -9253 320 -3172
9500c172J9878L1108J2579j8386r292N888p64l203k4625K441K5229N783n615m017
$$ -3172 16706 47814 60393 42007 32715 38603 37839 34636 10011 12452 37681 43464 37849 33832
9486C3832j7815k1378O807L0609Q282j7135P863O302j4152J621l707K0856J0924
$$ 33832 16017 -5361 1446 32055 40337 23202 31065 37367 23215 24836 21129 41985 52909
9473E2909k4967j0945K5847j8203l828J9532l4574k7540J6775k6704n250K1421
$$ 52909 27942 16997 42844 24641 20813 40345 5771 -21769 -4994 -31698 -36948 -15527
9461a5527J6515K4079K3454l479k7938m9337l104l353J7618J5648j1999J239J880
$$ -15527 988 25067 48521 45042 17104 -32233 -35337 -38690 -21072 -5424 -17423 -16184 -14304
9448a4304N1307R521j0749j8041j8026j162j2451J4384K1140R633J8035Q267M
$$ -14304 37003 46524 35775 17734 -292 -1454 -13905 479 21619 31252 49287 57554 57558
9435E7558j9348l1411j7130O586K3459j9094l1488N33j989J0432N855q09L130
$$ 57558 38210 6799 -10331 -3745 19714 620 -30868 -30335 -32324 -21892 -16037 -16846 -13716
9422a3716J1388K667jK7276Q695j0146j4356L59j6903K3380L3702J1612k5177
$$ -13716 -2328 339 338 27614 36309 26163 11807 12166 -4737 18643 52345 63957 38780
9409C8780j395j911o917J2102M226J4073l1588j7024k7222k0042J8396K9697L1135
$$ 38780 37385 35474 28557 40659 44885 58958 27370 10346 -16876 -36918 -18522 11175 42310
9396D2310n264N046Q188k01Q586j1742l5784j8125l727K0213K3590J7138l2475
$$ 42310 37046 42092 50280 50079 58665 46923 11139 -6986 -10713 9500 33090 50228 17753
9383A7753j1459K6429K8400O137j8167k480j4664K4069K0703J6107j0881j1947
$$ 17753 6294 32723 61123 67260 49093 46613 31949 56018 76721 92828 81947 70000
9371G0000p996q203K6884K1584k6018p519K5021j2717l4885k0432p437J3315J1848
$$ 70000 62004 53801 80685 102269 76251 68732 93753 81036 46151 25719 18282 31597 43445
9358D3445M665J7911k477M675l321k0833N443J9223j0516j851J1688j3360j1913
$$ 43445 48110 66021 63544 68219 64898 44065 49508 68731 58215 56364 68052 54692 42779
9345D2779j0652J1678N468J029K6966r699n947p22J8503J1431n668M415j3371
$$ 42779 32127 43805 49273 50302 77268 67569 61622 60900 79403 90834 85166 89581 76210
9332G6210k7417k0157j254J5323j7374K8043M6536p037l175K4279m398Q418K5978
$$ 76210 48793 28636 27382 42705 25331 53374 99910 92873 89698 113977 109579 117997 143975
9319A43975K9160M8805O3210O7161J38430K49054K21425k3204k08289k04706j42335
$$ 143975 173135 221940 285150 352311 490741 739795 961220 938016 729727 525021 382686
9308C82686r3553l8144m4138n1774r229j993j917j1635J3401P774j5133J5812
$$ 382686 289133 250989 206851 155077 145848 143855 141938 130303 143704 151478 136345 152157
9296A52157k8603j9780j9691j0286M350J4979P527k794J7287k119J2643J8513
$$ 152157 123554 103774 84083 73797 78147 93126 100653 97859 115146 113027 125670 144183
9284A44183L3317J3776k3327k26K63m370J8972J3011k2210L1353P7456P6942R6836
$$ 144183 177500 191276 167949 167723 167986 163616 182588 195599 173389 204742 282198 359140 455976
9271D55976J69348L21277M71013N05941P7902m66946m88567l17298j86463j11844
$$ 455976 625324 946601 1417614 1923555 2001457 1534511 1045944 728646 542183 430339
9261D30339q3671k6731r383r255j4198l1578k1281j9018j1543j991k4279j1070
$$ 430339 346668 319937 310554 301299 287101 255523 234242 215224 203681 201690 177411 166341
9249A66341L047m175k351J5956J9040j6494k1203L0254L2862n016j6207k1909
$$ 166341 169388 165213 162862 178818 197858 181364 160161 190415 223277 218261 202054 180145
9237A80145o865L6373P524j8255j046J0548K9632L2362J7359M5141N7203P3347
$$ 180145 173280 209653 217177 198922 197876 208424 238056 270418 287777 332918 390121 463468
9225D63468J34270K11795K52423R1725j44176k58406j72228r3653p5302m0420
$$ 463468 597738 809533 1061956 1153681 1009505 751099 578871 485218 409916 369496
9215C69496o117j311m0779l6392M247K297k494l784q618q471K0135m868j7730
$$ 369496 363379 362068 321289 284897 289144 291441 288947 285163 276545 268074 288209 283341 265611
9202B65611J1778L6575J8295M403r296J8825m540J1412m840L2193p66J6395K0814
$$ 265611 277389 313964 332259 336662 327366 346191 341651 353063 348223 380416 379650 396045 416859
9189D16859K6985J0313M168j2160J361N165K1422J5082L2620K0671M501M9162
$$ 416859 443844 454157 458325 446165 447526 452691 474113 489195 521815 542486 546987 596149
9177E96149L4280J1881M932N7631K2256K0756L3739M7087M5487M7337M3513P7424
$$ 596149 630429 642310 647242 704873 727129 747885 781624 828711 874198 921535 965048 1042472
9165A042472M5214L5652n505O328k391K9254M5892M4361P3297O3029K583J6150
$$ 1042472 1087686 1123338 1117833 1124161 1121770 1151024 1196916 1241277 1314574 1377603 1380186 1396336
9153A396336M5005M9457Q8120R0397O9639P4274P0608P7617R3267Q1193P3480
$$ 1396336 1441341 1490798 1578918 1669315 1738954 1813228 1883836 1961453 2054720 2135913 2209393
9142B209393P3264M0485L0320M4906O8689O6285L7626L6159J4994J6414J0774
$$ 2209393 2282657 2323142 2353462 2398368 2467057 2533342 2570968 2607127 2622121 2638535 2649309
9131B649309j1463k072N596j0172n2824n7388o3205k9355J0210J5495j2870m1339
$$ 2649309 2637846 2635774 2641370 2631198 2578374 2520986 2457781 2428426 2438636 2454131 2441261 2399922
9119B399922j15407j57330j14435j07342r5440n2434q7037q4929r0649n4886m8428
$$ 2399922 2284515 2127185 2012750 1905408 1809968 1757534 1670497 1585568 1494919 1440033 1391605
9108A391605n6122m2414k6643m1216m3254k4057o7419n0664m2051n5081l1639
$$ 1391605 1335483 1293069 1266426 1225210 1181956 1157899 1090480 1039816 997765 942684 911045
9097I11045j2389l3549m7190k1067l4198n1235k7850n1704j5272O667k3426l9028
$$ 911045 898656 865107 817917 796850 762652 711417 683567 631863 616591 623258 599832 560804
9085E60804l0312J1036L3023J1697j351l185k3499K7449J1346K5374j095k4624
$$ 560804 530492 541528 574551 586248 584897 581712 558213 585662 597008 622382 621287 596663
9073E96663m4811m5241n9944n7536k0711J4248J910m6479m5752k7924J7101L8734
$$ 596663 551852 506611 446667 389131 368420 382668 384578 338099 292347 264423 281524 320258
9061C20258n894k8603q456j4112K603j764P156l5528Q406K0919N279k2413K3782
$$ 320258 314364 285761 277305 263193 265796 264032 271188 235660 244066 264985 270264 247851 271633
9048B71633O004k2896L0950J5272j84k9594K413L0249P6118P9012K0424n6612
$$ 271633 277637 254741 285691 300963 300779 271185 273598 303847 379965 458977 479401 422789
9036D22789o3695k5303k6485o913K1972L7430k3082j8194j0751l0389j0038j0515
$$ 422789 359094 333791 307306 300393 322365 359795 336713 318519 307768 277379 267341 256826
9024B56826k397J3866k086O65j5743l2663r732J0623N869q656J6273o490k9251
$$ 256826 254429 268295 266209 266874 251131 218468 208736 219359 225228 216572 232845 226355 197104
9011A97104O610J637P911L3480N185k0810o629O827J7510J6276J1111J7643P268
$$ 197104 203714 205351 213262 246742 251927 231117 224488 231315 248825 265101 276212 293855 301123
8998C01123j4256M2765N1493J01982J80196Q0676q8741j28133p3384o285J6692
$$ 301123 286867 329632 381125 483107 663303 743979 655238 527105 453721 447436 464128
8987D64128L750j6217j4893K632l0767k6601K097j7912n688p074j7838N67K270
$$ 464128 467878 451661 436768 439400 408633 382032 384129 366217 360529 353455 335617 336184 338454
8974C38454l624l002j1568O739K1395J7834J7828j6056L862k5460R085J4573Q275
$$ 338454 334830 331828 320260 326999 348394 366228 384056 368000 371862 346402 355487 370060 378335
8961C78335K5419L7931M1617N3673K8468r352J5107K7373P522K7888R4297J01364
$$ 378335 403754 441685 483302 536975 565443 556091 571198 598571 606093 633981 728278 829642
8949H29642J17271Q7275L1649p900M1432O4065R6121O9431L5846N6958P1931L7526
$$ 829642 946913 1034188 1065837 1057937 1099369 1163434 1259555 1328986 1364832 1421790 1493721 1531247
8937A531247M7986P9032R4056J01069J27070J65556K50250K90022L69529N21018
$$ 1531247 1579233 1658265 1752321 1853390 1980460 2146016 2396266 2686288 3055817 3576835
8927C576835O42712P27920P61400O99000Q77240J312509J778193K454576L663429
$$ 3576835 4219547 4947467 5708867 6407867 7285107 8597616 10375809 12830385 16493814
8918A6493814N705776R285301J5922518K7550719M3660752N1566267J9426626
$$ 16493814 22199590 31484891 47407409 74958128 118618880 170185147 189611773
8911A89611773l7609110n1147632l4965919k0812271j2642061p996318n328562
$$ 189611773 152002663 100855031 65889112 45076841 32434780 24438462 19109900
8904A9109900l694699k661022j856108j271601r23033o68357m55329l34769m14875
$$ 19109900 15415201 12754179 10898071 9626470 8703437 8035080 7579751 7244982 6830107
8895F830107m53227l53553l05173k52926j54514o9713K6478J12697J79399K49318
$$ 6830107 6376880 6023327 5718154 5465228 5310714 5241001 5267479 5380176 5559575 5808893
8885E808893L72412N75813Q92418J187054J373161J376599J139421J449070K278590
$$ 5808893 6181305 6757118 7649536 8836590 10209751 11586350 12725771 14174841 16453431
8876A6453431L132333M363952O432653R818618J5899237K7573480M9656657Q4989003
$$ 16453431 19585764 23949716 30382369 40200987 56100224 83673704 133330361 218319364
8868B18319364J15743011O2954341p5163693j12482747p5807542m4222370k6414269
$$ 218319364 334062375 397016716 321853023 209370276 133562734 89340364 62926095
8861F2926095j6545706j0814190p501249n449939l909903k697238j892047j411952
$$ 62926095 46380389 35566199 28064950 22615011 18705108 16007870 14115823 12703871
8853A2703871r62626o61095r14918j167461j045763p99851o19057m59725l37832
$$ 12703871 11741245 11080150 10165232 8997771 7952008 7152157 6533100 6073375 5735543
8844E735543k52545j98030j52024q2131L2512J89888L29215M37805N30056O08106
$$ 5735543 5482998 5284968 5132944 5050813 5083325 5273213 5602428 6040233 6570289 7178395
8834G178395O41694P65428J090313J567059K169437L131542M708678P497849J2540377
$$ 7178395 7820089 8585517 9675830 11242889 13412326 16543868 21252546 28750395 41290772
8825D1290772K1657153L5969045M9199310L5520894j9292846n1380539m0505569
$$ 41290772 62947925 98916970 148116280 183637174 164344328 112963789 72458220
8818G2458220k4311948j4464492r021764n898739m047064k909718k122360j491835
$$ 72458220 48146272 33681780 24660016 18761277 14714213 11804495 9682135 8190300
8810H190300j075654q12414n66809m26613m49063n49115n70624m90172l68601
$$ 8190300 7114646 6302232 5735423 5308810 4859747 4310632 3740008 3249836 2881235
8801B881235k71545k43804k28158j98141j88431j63416j39497j01939r4395o9721
$$ 2881235 2609690 2365886 2137728 1939587 1751156 1587740 1448243 1346304 1251909 1182188
8791A182188n1368m4120J2362J4046J783k4066j9274m9661p7095l0904m2882l4367
$$ 1182188 1130820 1086700 1099062 1113108 1114891 1090825 1071551 1021890 944795 913891 871009 836642
8779H36642K629J2144J0325o0169n8986m7911K24M872l3910j7261K1424R415J7152
$$ 836642 839271 851415 861740 801571 742585 694674 694898 699770 665860 648599 670023 679438 696590
8766F96590p157j6273J8086M8834P1143J03151J36237J45797K5120j38765j99726
$$ 696590 689433 673160 691246 740080 811223 914374 1050611 1196408 1221528 1082763 883037
8755H83037j64888j02805o9143n1354l6076m6406n6834k908K8196L271J8413N1239
$$ 883037 718149 615344 546201 494847 458771 412365 355531 352623 380819 384090 402503 453742
8743D53742K5934q868J6230L7512K2084j2628l5323k9585n2428o062j8548j1389
$$ 453742 479676 470808 487038 524550 546634 534006 498683 469098 416670 410608 392060 380671
8731C80671o79j5316j09J2644J4921J5987r761j0294Q449L0997L9517L7809M5629
$$ 380671 379992 364676 364567 377211 392132 408119 398358 388064 396513 427510 467027 504836 550465
8718E50465Q3698J37188K01505L33959M35116J95194l04201m48732l08735j82662
$$ 550465 634163 771351 972856 1306815 1741931 1937125 1632924 1184192 875457 692795
8708F92795j17794j08801q4411l8828k1100K385l524K0287K8486j1551L1106J6121
$$ 692795 575001 466200 381789 342961 321861 324246 320722 341009 369495 357944 389050 405171
8696D05171Q116J0130L0679j9356k4943J2290Q373k4847k0185J0930L6597M8763
$$ 405171 413287 423417 454096 434740 409797 422087 430460 405613 385428 396358 432955 481718
8684D81718P4615J44735K64198M18321M95824K79692j33734m15896l64643k18718
$$ 481718 556333 701068 965266 1383587 1879411 2159103 2025369 1609473 1244830 1026112
8674A026112j45895q1923m5802L2596J38345J58528J17508j12158k30562k03726
$$ 1026112 880217 798294 752492 785088 923433 1081961 1199469 1087311 856749 653023
8664F53023j20088r3402n8747l7607m0605o65J9321K6704K5741N436k3710J285
$$ 653023 532935 439533 380786 343179 302574 301909 321230 347934 373675 379111 355401 356686
8652C56686o67J953K3672M0390m676P089P392p236J0746N934J6516O6460J29232
$$ 356686 356019 357972 381644 422034 417358 424447 431839 424603 435349 441283 457799 524259 653491
8639F53491J90414K85626N19414Q20886R86858N86545j16506q54763q80050n43959
$$ 653491 843905 1129531 1648945 2469831 3456689 4043234 3926728 3071965 2191915 1647956
8629A647956l63460k89425j87006j35669q7436l2862m588k8834j9324m7273j1649
$$ 1647956 1284496 995071 808065 672396 584960 552098 547510 518676 499352 452079 440430
8618D40430k8266l7986j6369M752m465R103L3517J2918L1462j4123P456K8347
$$ 440430 412164 374178 357809 362561 358096 367199 400716 413634 445096 430973 438429 466776
8606D66776J0111J2339J9988M3968L3293L008K8490Q6386Q5643N6115J07216R7460
$$ 466776 476887 489226 509214 553182 586475 589483 617973 704359 790002 846117 953333 1050793
8594A050793J21939K00796L22708M64840N85355N45848K41707j71130l49010k73755
$$ 1050793 1172732 1373528 1696236 2161076 2746431 3292279 3533986 3362856 3013846 2740091
8584B740091k51781l24518l32063l09138k79187k06720j53814j01248q2276j00272
$$ 2740091 2488310 2163792 1831729 1522591 1243404 1036684 882870 781622 699346 599074
8574E99074p2444m4167k4145j9654k1111l6734l4735l2735m7625j9784l348k7019
$$ 599074 526630 482463 458318 438664 417553 380819 346084 313349 265724 245940 242592 215573
8562B15573k2726J5195j9732m8066K1822j9435K2914K5590j6510j3434j7845L379
$$ 215573 192847 208042 188310 140244 162066 142631 165545 191135 174625 161191 143346 146725
8550A46725J3533J6303j6602l1101j7164P117J2639m046M184L4796J543k9012
$$ 146725 160258 176561 159959 128858 111694 118811 131450 127404 131588 166384 167927 138915
8538A38915j5579J1500r517K6340J1243l5660k1931N519k7681L184N4203r959
$$ 138915 123336 134836 125319 151659 162902 127242 105311 110830 83149 86333 140536 130577
8526A30577P829o979j189j5721j5391N025Q58K807j7914J9462M4495M0287j8617
$$ 130577 138406 131427 130238 114517 99126 104151 105009 107816 89902 109364 153859 194146 175529
8513A75529J0697K9611N5457J09688J56311K26937K47722O8224j88788k77674
$$ 175529 186226 215837 271294 380982 537293 764230 1011952 1080176 891388 613714
8503F13714k28236j06429o0249n3303l1614k6588m719O793M596J5215K3675l9935
$$ 613714 385478 279049 218800 165497 133883 107295 102576 109369 113965 129180 152855 112920
8491A12920j9681k1029Q918K2273Q614J37K6797o549k8935k4715j7496j0659J9570
$$ 112920 93239 72210 81128 103401 112015 112152 138949 132400 103465 78750 61254 50595 70165
8478G0165O629N129L1441J0642J7170n116j0134J8328K7580L6665K9932N1512
$$ 70165 76794 81923 113364 124006 141176 136060 125926 144254 171834 208499 238431 289943
8466B89943O7047J67659K84598M37040N58884K62634l72686n51695l97554k26194
$$ 289943 356990 524649 809247 1246287 1805171 2067805 1695119 1143424 745870 519676
8456E19676j38464q4163m4689m5429j8179k5196l8293N774J4004k825J903k2242
$$ 519676 381212 297049 252360 206931 188752 163556 125263 131037 145041 142216 144119 121877
8444A21877j5502j8843j7141K8186J1956k6210j603N842j8413K2150N261k9233
$$ 121877 106375 87532 70391 98577 110533 84323 82720 88562 70149 92299 97560 68327
8432F8327J4619J4340k3803q196K5385J7131L132J1488o587j5794M1180O3705
$$ 68327 82946 97286 73483 65287 90672 107803 110935 122423 115836 100042 141222 204927
8420B04927P2578J08571J80502K50539J62060j14305k39575j92704j33003r1487
$$ 204927 277505 386076 566578 817117 979177 864872 625297 432593 299590 208103
8410B08103o8043m6705m1216j8177q149L1679L4966M638J2511l44q431j354m9521
$$ 208103 140060 93355 52139 33962 25813 57492 92458 97096 109607 109263 100832 99478 49957
8397D9957M82K8725Q69m1148j7326R511J0457J2626J1865k2450j9796K9242O952
$$ 49957 50439 79164 80033 38885 21559 31070 41527 54153 66018 43568 23772 53014 59966
8384E9966o740j2649k0772J351J4788K8116k0019j2133n816m647j0865J143N731
$$ 59966 53226 40577 19805 21156 35944 64060 44041 31908 26092 21445 10580 11723 17454
8371A7454J1134J8202O238n517r499n01n840K9321J8106J2059M864k3982P070
$$ 17454 28588 46790 53028 47511 38012 37511 31671 60992 79098 91157 96021 72039 79109
8358G9109N88K552J708q948L853Q342K2423M827o956J1225k9718M362M7536P1462
$$ 79109 79697 82249 83957 75009 78862 87204 109627 114454 107498 118723 89005 93367 140903 212365
8344B12365J00803J73277K93615L32875M8818k85267k61752j93014j22640o6091
$$ 212365 313168 486445 780060 1112935 1161753 876486 614734 421720 299080 232989
8334B32989o1892l1181j1260k8491N751j2927k1137j3631k166m503j2049K9312
$$ 232989 171097 139916 128656 100165 105916 92989 71852 58221 56055 51552 39503 68815
8322F8815Q385Q82L562K482j7383j4048j8249j21Q623j1571j4940K4571K5241
$$ 68815 77200 78082 81644 84126 66743 52695 34446 34325 42948 31377 16437 41008 66249
8309F6249m312L4975N302K0572M8746J2357J2113L9458L6187J04303K01384L60815
$$ 66249 61937 96912 102214 122786 171532 183889 196002 235460 271647 375950 577334 938149
8297I38149N80444P50695K48202n97751p08187m21832k39590j53837j09834p6357
$$ 938149 1518593 2269288 2517490 1919739 1211552 789720 550130 396293 286459 210102
8287B10102o8377j6377J0060j7154j040k9275o869j9529p318j6886j0494m105
$$ 210102 141725 125348 135408 118254 117214 87939 81070 61541 54223 37337 26843 22738
8275B2738k0440n314O810K5849J2411J094O392q125J2528M273J365L5522J0670
$$ 22738 2298 -3016 3794 29643 42054 43148 49540 41415 53943 58216 59581 95103 105773
8262A05773k9119j5107k987K2983J2324M5433N4744M0986P8584J30655K29955
$$ 105773 76654 61547 58560 81543 93867 139300 194044 235030 313614 444269 674224
8251F74224L01149J71246j67560l29625k45202j40991o0196m7113l1970l8619
$$ 674224 975373 1146619 979059 649434 404232 263241 203045 155932 123962 85343
8241H5343j4464j5896M368K190J4020P694j7308n3822o992K1225J8651n252k7495
$$ 85343 70879 54983 59351 61541 75561 83255 65947 12125 5133 26358 45009 39757 12262
8228A2262j3180L3651L4880j9456l3858n0284r598K2882N2194J7526M023q547
$$ 12262 -918 32733 67613 48157 14299 -35985 -45583 -22701 29493 47019 51042 42495
8216D2495j7452N096J9664J512K812J5297n855j1595Q037J2215q556J2558q756
$$ 42495 25043 30139 49803 51315 54127 69424 63569 51974 60011 72226 63670 76228 67472
8203F7472j7237m995n793q51J7924J6604q612r680m745j6338J5740m156j6930
$$ 67472 50235 45240 39447 38596 56520 73124 64512 54832 50087 33749 49489 45333 28403
8190B8403j7430m169J1303J4777K0607o344j5344l0929l2500J8024J141j9300
$$ 28403 10973 6804 18107 32884 53491 47147 31803 874 -31626 -13602 -12461 -31761
8178c1761J0642K3687n289j182J9400k689J4701q560p059P320r344Q449K1648
$$ -31761 -21119 2568 -2721 -3903 15497 12808 27509 18949 11890 19210 9866 18315 39963
8165C9963l08L276j017O058j0860J760j4947j3673j5803l4480k1064J8680L7805
$$ 39963 39655 42931 41914 47972 37112 38872 23925 10252 -5551 -40031 -61095 -42415 -4610
8152d610j3847j8575J4551p159l7225N830J8379J7768K2734J0532j2633j6248
$$ -4610 -18457 -37032 -22481 -29640 -66865 -61035 -42656 -24888 -2154 8378 -4255 -20503
8140b0503M776L2393K8195p27l2067j8213l0370K004Q350J9832K8692K5888L7827
$$ -20503 -15727 16666 44861 44134 12067 -6146 -36516 -34512 -26162 -6330 22362 48250 86077
8127H6077J0827l5557j5371L375K1496R018m2875k1284J0933P500m651k3836j4989
$$ 86077 96904 61347 45976 49351 70847 79865 36990 15706 26639 34139 29488 5652 -9337
8114i337L7596J3932m080k2565j3095J9333J5744o994k1591m679m570l259k983
$$ -9337 28259 42191 38111 15546 2451 21784 37528 30534 8943 4264 -306 -3565 -6548
8101f548J439J717O965K1228N00r10J5321m578l0189J7083o991l2124l416M49
$$ -6548 -5109 -3392 3573 24801 25301 24391 39712 35134 4945 22028 15037 -17087 -20503 -20054
8087b0054j526K7723j8625J429K2976N034J234j2253j1728m939J6479L4046r842
$$ -20054 -21580 6143 -12482 -11053 11923 16957 18191 5938 -5790 -10729 5750 39796 29954
8074B9954j0804L6381j8397j1990j5510L977P169J1313n87j9073M601j0738j4130
$$ 29954 19150 55531 37134 25144 9634 13611 20780 32093 31506 12433 17034 6296 -7834
8061g834J1761J0887K1948j666k7867o687J6650J0563q766j7705m995K8270m463
$$ -7834 3927 14814 36762 35096 7229 542 17192 27755 18989 1284 -3711 24559 20096
8048B0096j0891J8067J5142M0396J4428l191j345l4302l9916j4001J2510K3052
$$ 20096 9205 27272 42414 82810 97238 94047 92702 58400 18484 4483 16993 40045
8036D0045J1302K857J3327J5607j4550j0194k354O016k570P461J481p358j2693
$$ 40045 51347 54204 67531 83138 68588 58394 56040 62056 59486 66947 68428 61070 48377
8023D8377O477P541q64j3930L3181N044o274j4197j7800j495j056l448n616J9672
$$ 48377 54854 62395 61531 47601 80782 85826 79552 65355 47555 46060 45004 41556 35940 55612
8009E5612J5079J9254J7150j9754J8477N832j1590k3023J4226K9143J6255J3542
$$ 55612 70691 89945 107095 87341 105818 111650 100060 77037 91263 120406 136661 150203
7997A50203J3076j445R306L1135J6j4733j4805j2152k7275j3601l5141j7537k941
$$ 150203 163279 161834 171140 202275 202291 187558 172753 160601 133326 119725 84584 67047 64106
7984F4106J5938O605j2849l0833m2252j8897Q029J8319R954O82J4353L0649o385
$$ 64106 80044 86649 73800 42967 715 -18182 -10153 8166 18120 18802 33155 63804 57419
7971E7419k0582o395J4919L5235Q154Q690n491q927j5498K016J7077Q643K6604
$$ 57419 36837 30442 45361 80596 88750 97440 91949 83022 67524 69540 86617 95260 121864
7958A21864J0789j5339n012M022j0045j0784r535o074k429q650K5651P577j3901
$$ 121864 132653 117314 112302 116324 106279 95495 85960 79886 77457 68807 94458 102035 88134
7945H8134L989K335p213n736k5879j6750J2456J1588j5507q149o5k6314J179L0628
$$ 88134 92123 94458 87245 81509 55630 38880 51336 62924 47417 39268 39203 12889 14068 44696
7931D4696J1329J7488j9679j3469J8721J8544K572J3238O8N309m919k0969k1708
$$ 44696 56025 73513 53834 40365 59086 77630 80202 93440 93508 98817 93898 72929 51221
7918E1221k809k5803j7742K0167J3145l991Q243k44k0607K1157J698N314n039
$$ 51221 48412 22609 4867 25034 38179 34188 42431 42187 21580 42737 44435 49749 44710
7905D4710K801j9013o117K8747Q4J3963j8048J4769j1676r876p321k5341K731
$$ 44710 47511 28498 22381 51128 51212 65175 47127 61896 50220 40344 33023 7682 10413
7892A0413n29r711N446o094J2614Q375p634P523J2545k1615l1092k752K7595J8094
$$ 10413 9884 173 5619 -475 12139 20514 12880 20403 32948 11333 -19759 -22511 5084 23178
7878B3178m67m102n298j2234L689j6708j4318J1463l067q014J4047J1860J3657
$$ 23178 22711 18609 13311 1077 4766 -11942 -26260 -14797 -17864 -25878 -11831 29 13686
7865A3686L3665L2219q920j8838l5704L738j4678j1844N111m556J1130l451j4214
$$ 13686 47351 79570 70650 51812 16108 19846 5168 -6676 -1565 -6121 5009 1558 -12656
7852a2656J5307p9k1564j6476L838m777J7498J4234M0156J072j3513j7391m56
$$ -12656 2651 2572 -18992 -35468 -31630 -36407 -18909 -4675 35481 36553 23040 5649 5193
7839E193j0467k767J5342K0326m071k4447r73R271k6051l0374r863L952R178K6096
$$ 5193 -5274 -8041 7301 27627 23556 -891 -1864 7407 -18644 -49018 -58881 -54929 -45751 -19655
7825a9655r222J7811L895P617J8323k416Q163j9143m760k0750k9479n392L2292
$$ -19655 -28877 -11066 -7171 446 18769 16353 24516 5373 613 -20137 -49616 -55008 -22716
7812b2716J1941J9894K1480j4377N915j0124l649K767K9344j7448l0907J843j6174
$$ -22716 -10775 9119 30599 16222 22137 12013 8364 11131 40475 23027 -7880 -6037 -22211
7799b2211J2545K4529M0988j686j2340m2895j3055K1237J0344r608K017K0551
$$ -22211 -9666 14863 55851 54165 41825 -1070 -14125 7112 17456 7848 9865 30416
7787C0416r012j0023P118k90K9732N761k2565l1492K087J6369k767J3552j6414
$$ 30416 21404 11381 18499 18209 47941 53702 31137 -355 1732 18101 15334 28886 12472
7774A2472k5824L726M92o702M160r58r548M494M4951J7198l4867k3033m43q896
$$ 12472 -13352 -9626 -9134 -15836 -11676 -12634 -22182 -17688 27263 44461 9594 -13439 -13882 -22778
7760b2778J9318K2259l2531j4688r218R918K894q246R068m0528L5460K7100n095
$$ -22778 -3460 18799 -13732 -28420 -37638 -27720 -24826 -33072 -24004 -64532 -29072 -1972 -7067
7747g067j3910J0752r27J3367j206l111J538j1524j388L0705J4076m0778l1266
$$ -7067 -20977 -10225 -11152 2215 1009 -2102 -564 -12088 -13476 17229 31305 -9473 -40739
7734d0739J1089L2002N523J308j7910K3120j175q923n240k2302J9799L172m322
$$ -40739 -29650 2352 7875 9183 -8727 14393 13218 4295 -945 -23247 -3448 -276 -4598
7721d598M211J1556j1744j6599o664j2975P383J2230K6298K1592l9605m1287J1998
$$ -4598 -387 11169 -575 -17174 -23838 -36813 -29430 -17200 9098 30690 -8915 -50202 -38204
7708c8204M5968J0033j9885K704J139r25j0036J4205K3616j7804j3687n785j8073
$$ -38204 7764 17797 -2088 616 1755 830 -9206 4999 28615 10811 -2876 -8661 -26734
7695b6734k2665L98J8583J3853m465L7661M2962j5566k0010q471K534j948N17
$$ -26734 -49399 -49001 -30418 -16565 -21030 16631 59593 44027 24017 15546 18080 16132 16649
7682A6649N560j1790o61K599J2933k450j8539K6398l835p172j2331l840l859J521
$$ 16649 22209 10419 9758 12357 25290 22840 4301 30699 26864 19692 7361 3521 -338 1183
7668A183j1520q828K6839L4614J9314n553l2035K997j447p227n426J0885k2271
$$ 1183 -10337 -19165 7674 42288 61602 56049 24014 27011 25564 18337 12911 23796 1525
7655A525j0192j003j2113J011o189k7416J3288J3941L055O250J4522j1148P853
$$ 1525 -8667 -9670 -21783 -20772 -26961 -54377 -41089 -27148 -24093 -17843 -3321 -14469 -6616
7642f616K4641J9232p389j2415j6094l923K8613j647q812j1431k5702J3261J4669
$$ -6616 18025 37257 29868 17453 1359 -2564 26049 24402 15590 4159 -21543 -8282 6387
7629F387N469r337q349q10K2306R75r141j278r910j1758M578j7905j227K4476
$$ 6387 11856 2519 -5830 -6640 15666 16641 7500 6222 -3688 -15446 -10868 -28773 -30000 -5524
7615e524L0115K8734l707m5451j8839P072M2803J5929k4220j8448N209k1785j6396
$$ -5524 24591 53325 49618 4167 -14672 -7600 35203 51132 26912 8464 13673 -8112 -24508
7602b4508J9001J1179l157j5100O404P821p507j0172K385J458j1996q584o970
$$ -24508 -5507 5672 2515 -12585 -6181 1640 -5867 -16039 -13654 -12196 -24192 -32776 -39746
7589c9746o605j1638j679J2746P456m784K1475k449J3804j3998J5953J2085n66
$$ -39746 -46351 -57989 -59668 -46922 -39466 -44250 -22775 -25224 -11420 -25418 -9465 2620 2054
7576B054K4164K6060L2802n691l8426m780q948m767k1063k1967l298J5782J1606
$$ 2054 26218 52278 85080 79389 40963 36183 27235 22468 1405 -20562 -23860 -8078 3528
7563C528j2409j8813L470K4904n740J521l03J6655O394l507j7070p744j6758K4550
$$ 3528 -8881 -27694 -24224 680 -5060 -3539 -3842 12813 19207 15700 -1370 -9114 -25872 -1322
7549a322K4229Q983j93L4944m991j1606o648j6376k2113J1741J2238j2956R444
$$ -1322 22907 31890 31697 66641 61650 50044 43396 27020 4907 16648 28886 15930 25374
7536B5374j0040k316j8714q502O883o339L5946J3783j1410q484k4772j80N283
$$ 25374 15334 13018 -5696 -14198 -7315 -13654 22292 36075 24665 16181 -8591 -8771 -3488
7523c488n28k1209J0961Q227J9713M769J8524j5229m2885N098J9405J2632m387
$$ -3488 -4016 -25225 -14264 -6037 13676 18445 36969 21740 -21145 -16047 3358 15990 11603
7510A1603j4849L028M822J0341j4877P407j5675R495K8920q752j8924j5158K606
$$ 11603 -3246 -218 4604 14945 68 7475 -8200 1295 30215 21463 2539 -12619 -10013
7497a0013R26P832m116N780l1581p277J1168q786J9454J5640J4485J776j4678
$$ -10013 -9087 -1255 -5371 409 -31172 -38449 -27281 -36067 -16613 -973 13512 15288 610
7484F10K455j455J1450J4237o778R651j871l5199j9594j5672O887J2906K5799
$$ 610 3065 1610 13060 27297 20519 30170 28299 -6900 -26494 -42166 -35279 -22373 3426
7471C426J6698k8865j190P228R807j4536J2247K0649j8875j3987q009J4886k2048
$$ 3426 20124 -8741 -9931 -2703 7104 -7432 4815 25464 6589 -7398 -15407 -521 -22569
7458b2569J5841J2813k193j7109Q402J9213J4544m030O54j2440j1813q337n555
$$ -22569 -6728 6085 3892 -13217 -4815 14398 28942 24912 25566 13126 1313 -7024 -12579
7445a2579O895K449O107j9387k806J0442K7287J6078J3836K8042o415k6716j3063
$$ -12579 -5684 -3235 2872 -16515 -19321 -8879 18408 34486 48322 76364 69949 43233 30170
7432C0170J5339k5675J5388j9427j5155j2002J2157J6222k54R634j286j0313j0642
$$ 30170 45509 19834 35222 15795 640 -11362 795 17017 16763 26397 25111 14798 4156
7419D156r443r476N143N8j325j6566m978q85j0250r480P328M1783K1722j1897
$$ 4156 -5287 -14763 -9620 -9562 -10887 -27453 -32431 -33316 -43566 -53046 -45718 -3935 17787 5890
7405E890q001j2671n586K8333J729j7233j0687j0008J446j0510O066o195K1739
$$ 5890 -2111 -14782 -20368 7965 9694 -7539 -18226 -28234 -26788 -37298 -31232 -37427 -15688
7392a5688J0397j771L715j3881j786R288j7233j9299Q68J4357P453L415k0236
$$ -15688 -5291 -7062 -3347 -17228 -19014 -9726 -26959 -46258 -45390 -31033 -23580 -20165 -40401
7379d0401p986l941J7702J9188J5538k7754j7448J263M577m888J1825J1012K641
$$ -40401 -48387 -52328 -34626 -15438 100 -27654 -45102 -43839 -39262 -44150 -32325 -21313 -18672
7366a8672J6240J4007k3990L015l15q752K2400M1230l8374l8923M2034O983j2112
$$ -18672 -2432 11575 -12415 -9400 -9715 -18467 3933 45163 6789 -32134 9900 16883 4771
7353D771o615L646r544L397p750Q822J532j0309J7402Q115j888K182m628k8890
$$ 4771 -1844 1802 -7742 -4345 -12095 -3273 -1741 -12050 5352 13467 11579 13761 9133 -19757
7339a9757O688Q21j3328j2231J7494J5279M250r24N336K920o346P773P678k1301
$$ -19757 -13069 -12248 -25576 -37807 -20313 -5034 -784 -1708 3628 6548 202 7975 15653 -5648
7325e648j7490M506p306j8160K8148L8156r542q487j2604j0708j300R885K3950
$$ -5648 -23138 -18632 -25938 -44098 -15950 22206 12664 4177 -8427 -19135 -20435 -10550 13400
7312A3400R84k9035r792o910R636R865R165J9703m681r125j0294J8773K6214k2271
$$ 13400 14384 -14651 -24443 -31353 -21717 -11852 -2687 17016 12335 3210 -7084 11689 37903 15632
7298A5632j0685q596J3332J4471k1719p478j984j2830P638J0404j6134j5080J1368
$$ 15632 4947 -3649 9683 24154 2435 -5043 -7027 -19857 -12219 -1815 -17949 -33029 -21661
7285b1661R849L044j8316j1823K025k876k7051J8255L2150K8608k852m3586k7773
$$ -21661 -11812 -8768 -27084 -38907 -36882 -39758 -66809 -48554 -16404 12204 9352 -34234 -62007
7272f2007P061r658j5205L0225L2678K155J115J1561l311J8468P601k5932j0701
$$ -62007 -54946 -64604 -79809 -49584 -16906 -14751 -13636 -2075 -5386 13082 20683 -5249 -15950
7259a5950k26k0507O950j0466j3634J5421Q594J2941k1603j7204o251K3901Q886
$$ -15950 -16176 -36683 -29733 -40199 -53833 -38412 -29818 -16877 -38480 -55684 -61935 -38034 -29148
7246b9148n463Q87Q003r101N636M461J7993J6489k5734q223L821O824r058l307
$$ -29148 -34611 -33724 -25721 -34822 -29186 -24725 -6732 9757 -15977 -24200 -20379 -13555 -22613 -25920
7232b5920O042j1131K3228J9829L843Q342j24j6800r804J9211K0597k2272j9998
$$ -25920 -19878 -31009 -7781 12048 15891 24233 24109 7309 -2495 16716 37313 15041 -4957
7219d957k4234j3113k5712L571L1130J2098r205J0811J3915k1166k900J0817J3791
$$ -4957 -29191 -42304 -68016 -64445 -33315 -21217 -30422 -19611 -5696 -26862 -29762 -18945 -5154
7206e154O584J3983m1946k9318k162j5449o069K9700J4520J9894J7186K8759J0734
$$ -5154 1430 15413 -26533 -55851 -58013 -73462 -79531 -49831 -35311 -15417 1769 30528 41262
7193D1262l273p243l3646m2169J3183m569K4085K6195j4289j526n927m84O195
$$ 41262 37989 30746 -2900 -45069 -31886 -36455 -12370 13825 -464 -1990 -7917 -8401 -2206
7180b206Q394O801j2001l849j181K0858O194l6563j0136J8729r703j714j3398
$$ -2206 6188 12989 988 -2861 -4042 16816 23010 -13553 -23689 -4960 -14663 -16377 -29775
7167b9775m268K9188P255Q837j0600J682J7191J7793q649j5344j0727k3895p173
$$ -29775 -34043 -4855 2400 11237 637 2319 19510 37303 28654 13310 2583 -21312 -28485
7154b8485K8180O510k757J6740k7731j9812j1456o55q500K9501K2835j8308J4616
$$ -28485 -305 6205 3448 20188 -7543 -27355 -38811 -39466 -47966 -18465 4370 -13938 678
7141F78J3578j4572r199j5169l8838P299K1262J6080M2085J9285j4417j8722J0837
$$ 678 14256 -316 -9515 -24684 -63522 -56223 -34961 -18881 23204 42489 28072 9350 20187
7128B0187j7222l2490k0686K2440M153P8L117J8598R798M658P107j2666J971j3340
$$ 20187 2965 -29525 -50211 -27771 -23618 -23540 -20423 -1825 7973 12631 19738 7072 9043 -4297
7114d297k754K561k585o899J1102K1508j1672j4274Q372j4836N756j632K423J462
$$ -4297 -7051 -4490 -7075 -13974 -2872 18636 6964 -7310 1062 -13774 -8018 -9650 -7227 -5765
7100e765K1263J53j1694j5133M294J4750r123O811j7256q132J9885m164N279L7077
$$ -5765 15498 15651 3957 -11176 -6882 7868 -1255 5556 -11700 -19832 53 -4111 1168 38245
7086C8245M331k2126L08J4645J4571j5098p420k1089j0192k3097J2861J1777K646
$$ 38245 42576 20450 20758 35403 49974 34876 27456 6367 -3825 -26922 -14061 -2284 362
7073C62P032Q240k9633j8986J7009O607p558L010k0150N620L1158q041K197j322
$$ 362 7394 15634 -13999 -32985 -15976 -9369 -16927 -13917 -34067 -28447 2711 -5330 -3133 -4455
7059d455l6809m870k551Q78J6325L9889J9741j3880l1258k5522j6791J2314M1984
$$ -4455 -41264 -46134 -48685 -47807 -31482 8407 28148 14268 -16990 -42512 -59303 -46989 -5005
7046e005J2740k8242k083K5642J1587q373j4701m1003j0618K1018M811M611J371
$$ -5005 7735 -20507 -22590 3052 14639 6266 -8435 -49438 -60056 -39038 -34227 -29616 -28245
7033b8245K4455k3189l4684r828J7615K3778j1801M2257M0300J0607j4714k8296
$$ -28245 -3790 -26979 -61663 -71491 -53876 -30098 -41899 358 40658 51265 36551 8255
7021H255J1534J733K659j7017m689k4991L273j2824L272J6100o574K6977j5008
$$ 8255 19789 21522 24181 7164 2475 -22516 -19243 -32067 -28795 -12695 -19269 7708 -7300
7008g300k4018k439P724L349J7021k3276K693L351o243J1732j1835l5687r43L3585
$$ -7300 -31318 -33757 -26033 -22684 -5663 -28939 -26246 -22895 -29138 -17406 -29241 -64928 -65871 -32286
6994c2286M884K1417Q751j565r051m3844J7158J1716k6072J37J4029J2183O600
$$ -32286 -27402 -5985 2766 1201 -7850 -51694 -34536 -22820 -48892 -48755 -34726 -22543 -15943
6981a5943j0543q25j0025J1402J4248N609J2260k443k3846j1360J4750L822K414
$$ -15943 -26486 -27311 -37336 -25934 -11686 -6077 6183 3740 -20106 -31466 -16716 -12894 -10480
6968a0480J4659K3963J5436J0692r583k0188k5676m413J1793j8605j2507L165
$$ -10480 4179 28142 43578 54270 44687 24499 -1177 -5590 6203 -12402 -24909 -21744
6956b1744N229j0405p566R479J8709J423q654j0948o530J1042K967M0289K555
$$ -21744 -16515 -26920 -34486 -25007 -6298 -4875 -13529 -24477 -31007 -19965 -16998 23291 25846
6943B5846J0733L035j6239l1832k2132J2854K5161r756K869K2158n957k7111j9762
$$ 25846 36579 39614 23375 -8457 -30589 -17735 7426 -2330 539 22697 16740 -10371 -30133
6930c0133N973K9083J0862j0854m1594O91J575n06L936K4789P783k075m357j6581
$$ -30133 -24160 4923 15785 4931 -36663 -35972 -34397 -34903 -30967 -6178 1605 -470 -4827 -21408
6916b1408k205N340k074j3253m50J9117J6007M291l2955k1945r95M5230M0727
$$ -21408 -23613 -18273 -20347 -33600 -34050 -14933 1074 5365 -27590 -49535 -50530 -5300 35427
6903C5427O078O611j7466K81J3476r813k6725j3032k903k138n066r574K971P731
$$ 35427 41505 48116 30650 30931 44407 34594 7869 -5163 -8066 -10204 -15270 -24844 -21873 -14142
6889a4142K537k769j4569N914K2433o342j9114K3796K8494O019k4905j798R478
$$ -14142 -11605 -14374 -28943 -23029 -596 -6938 -26052 -2256 26238 32257 7352 5554 15032
6876A5032j5189P420O959k8583p419j203J084j4908N154J838L678L3327K6347
$$ 15032 -157 7263 14222 -14361 -21780 -22983 -21899 -36807 -31653 -29815 -26137 7190 33537
6863C3537P520r249k854j0068k885j1777M070L417o865L3216K3425l6596j5649
$$ 33537 41057 31808 28954 18886 16001 4224 8294 11711 4846 38062 61487 24891 9242
6850I242j9204p102m193J5011K5057J1299l1422m286K2278K3758j0267j2308k5233
$$ 9242 -9962 -17064 -21257 -6246 18811 30110 -1312 -5598 16680 40438 30171 17863 -7370
6837g370k9383j9562K8102L2090J6645J053m155j796k3837j4243m004J8470J7158
$$ -7370 -36753 -56315 -28213 3877 20522 21575 17420 15624 -8213 -22456 -26460 -7990 9168
6824I168J2333r114K1324n395l3904k5898k7337K1393M801q865M8527O95o719
$$ 9168 21501 12387 33711 28316 -5588 -31486 -58823 -37430 -32629 -41494 7033 7728 1009
6811A009J0920p723J7045K7054l676k8276j7881l344m905Q145p979j0448J1921
$$ 1009 11929 4206 21251 48305 44629 16353 -1528 -4872 -9777 -1632 -9611 -20059 -8138
6798h138P63o080K0763j1719N67K336j3398k2712K896R210J3655K1383K0804k1163
$$ -8138 -7375 -13455 7308 -4411 -3844 -1508 -14906 -37618 -34722 -25512 -11857 9526 30330 9167
6784I167k7894l866p822O571K1168m312J1088P77K0852j2932k2328o215N309n8
$$ 9167 -18727 -22593 -30415 -23844 -2676 -6988 4100 4877 25729 12797 -9531 -15746 -10437 -10495
6770a0495k805j3057j7398j8172k8457L6878M7195L9947J4025j3542k4374m252
$$ -10495 -13300 -26357 -43755 -61927 -90384 -53506 -6311 33636 47661 34119 9745 5493
6758E493J3737J5178p173j5562m092j9417m473K242K1318m539K803J89K075K1125
$$ 5493 19230 34408 27235 11673 7581 -11836 -16309 -14067 7251 2712 5515 5704 7779 28904
6744B8904K3947o584k9021N592j2499J106J1056n421l4236j37P350L506J9120
$$ 28904 52851 46267 17246 22838 10339 11445 22501 17080 -17156 -17293 -9943 -6437 12683
6731A2683k3380m1373K1485K5249J55J1212J4374K1883O173Q452L6939O6033O7344
$$ 12683 -10697 -52070 -30585 -5336 -5181 6031 20405 42288 48461 56913 93852 159885 227229
6718B27229L592r5087m7759m4335l5764p100m826j0733k5460K6230j154m3591
$$ 227229 230821 135734 87975 43640 7876 776 -4050 -14783 -40243 -14013 -15167 -58758
6706e8758o845J8701L7446J5195k2375n693j644j2661l042K8377L271K0878j257
$$ -58758 -65603 -46902 -9456 5739 -16636 -22329 -23973 -36634 -39676 -11299 -8028 12850 11593
6693A1593m1230k9495j7677L4204K4784J5324J8329k5215j9300L1520J4402p105
$$ 11593 -29637 -59132 -76809 -42605 -17821 -2497 15832 -9383 -28683 2837 17239 10134
6681A0134o935O179j6173P775J790M107K5921L14j605M771j781l66j2106m0395
$$ 10134 3199 9378 -6795 980 2770 6877 32798 33112 31507 36278 34497 34131 22025 -18370
6667a8370j7571J1389L6775P053K902o511k0402j4149k3107l671J0291K7250K4227
$$ -18370 -35941 -24552 12223 19276 22178 15667 -4735 -18884 -41991 -45662 -35371 -8121 16106
6654A6106m828K4166Q302j3267n084J6928l084j2061J6111l7776j9855l3747j6231
$$ 16106 11278 35444 43746 30479 25395 42323 39239 27178 43289 5513 -14342 -48089 -64320
6641f4320Q985K3443K4737j3572j5948o738K9676K8100n275l144j0582K2488k368
$$ -64320 -55335 -31892 -7155 -20727 -36675 -43413 -13737 14363 9088 5944 -4638 17850 15482
6628A5482l570K176j5082k3042p210J0215n416K5921Q455P560k317m828K580J3549
$$ 15482 11912 14088 -994 -24036 -31246 -21031 -26447 -526 7929 15489 13172 8344 10924 24473
6614B4473l803m823j9649q115K390J27L532P195K2201k0833m8534o168J4607J9805
$$ 24473 20670 15847 -3802 -11917 -9527 -9400 -5868 1327 23528 2695 -45839 -52007 -37400 -17595
6600a7595R833J9369O571Q202J720k0681q375K1901K7943J4229k0850k7796l7031
$$ -17595 -7762 11607 18178 26380 28100 7419 -956 20945 48888 63117 42267 14471 -22560
6587b2560q231Q850r880K4534M2324r695l5789j9095J9648J6075k4114k9250J5018
$$ -22560 -30791 -21941 -31821 -7287 35037 25342 -10447 -29542 -9894 6181 -17933 -47183 -32165
6574c2165P600l456k5504K8369J6644r264J6539o269n92K0833j5717j8340J2811
$$ -32165 -24565 -28021 -53525 -25156 -8512 -17776 -1237 -7506 -8098 12735 -2982 -21322 -8511
6561h511P151J3175l5707j9568O435J2892K2953J5171k3892o241m06M062R816
$$ -8511 -1360 11815 -23892 -43460 -37025 -24133 -1180 13991 -9901 -16142 -16548 -12486 -2670
6548b670m737j1330J6317J0100J5133M630k6531j6300O439j2967k6406J6530L033
$$ -2670 -7407 -18737 -2420 7680 22813 27443 912 -15388 -8949 -21916 -48322 -31792 -28759
6535b8759J1337R11J1410J0387k303j2177N950J1282k2255l5796J0280K3021l898
$$ -28759 -17422 -16511 -5101 5286 2983 -9194 -3244 8038 -14217 -50013 -39733 -16712 -20610
6522b0610r970L916P500R66j2264j965j1490O788K9053L5722J8815j5450j7561
$$ -20610 -30580 -26664 -19164 -18198 -30462 -32427 -43917 -37129 -8076 27646 46461 31011 13450
6509A3450P075K6182k547l5225j6810j1799K398J3480J6171m105p32K0824k7973
$$ 13450 20525 46707 44160 8935 -7875 -19674 -17276 -3796 12375 8270 7538 28362 389
6496C89k038k9443l6254K1429M2016J2930k508j8392k0390k3525J2317L3001n337
$$ 389 -1649 -31092 -67346 -45917 -3901 9029 6521 -11871 -32261 -55786 -43469 -10468 -15805
6483a5805p126P900j1820j9241N366L4393P90J0404j74k3222j4087J4651J5137
$$ -15805 -22931 -15031 -26851 -46092 -40726 -6333 -5543 4861 4687 -18535 -32622 -17971 -2834
6470b834p782k959J5169O268m4280K7925K2544o53j2416p237J2307J8734N568
$$ -2834 -10616 -13575 1594 7862 -36418 -8493 14051 13398 982 -6255 6052 24786 30354
6457C0354l3176j211o480l0768J1022M51J6802K3432o424n2226m515L472K9758
$$ 30354 -2822 -4033 -10513 -41281 -30259 -29808 -13006 10426 4002 -48224 -52739 -49267 -19509
6444a9509L2409q479K3872N463j5686k6412K976p981n896O016J4278J0857j1682
$$ -19509 12900 4421 28293 33756 18070 -8342 -5366 -13347 -19243 -13227 1051 11908 226
6431B26q708j5061j5900J1137K3076Q077j8303o307J2342J4054j705K1187M77
$$ 226 -8482 -23543 -39443 -28306 -5230 2847 -15456 -21763 -9421 4633 2928 24115 24592
6418B4592R736k5571k3798n308l2755j2726L1875K3477N403q934N520j7721l1930
$$ 24592 34328 8757 -15041 -20349 -53104 -65830 -33955 -10478 -5075 -14009 -8489 -26210 -58140
6405e8140K0651K5003K2103K5863K0656l7021j2668k091k1846N107r923l768P447
$$ -58140 -37489 -12486 9617 35480 56136 19115 6447 4356 -17490 -12383 -22306 -26074 -18627
6392a8627J4906R556l93M929p245k4817j3795M455J7697J9235l511O274j2356
$$ -18627 -3721 5835 5442 10371 3126 -21691 -35486 -31031 -13334 5901 2390 8664 -3692
6379c692p138l271L036J1868M773k6970l7347J4681n181O905K3234L2790L5969
$$ -3692 -10830 -14101 -11065 803 5576 -21394 -58741 -44060 -49241 -42336 -19102 13688 49657
6366D9657n943m0562k5851K832J3016L519j3115O872k0311j9246J3007j279n146
$$ 49657 43714 3152 -22699 -19867 -6851 -3332 -16447 -9575 -29886 -49132 -36125 -37404 -42550
6353d2550K3005K4766j4197K115K1052O812j9198j4567k135O332j5236k1894J1971
$$ -42550 -19545 5221 -8976 -6861 14191 21003 1805 -12762 -14897 -8565 -23801 -45695 -33724
6340c3724K0331L1168j2991j1488j345K8138m104K363O886J2651m299k2986l0088
$$ -33724 -13393 17775 4784 -6704 -8049 20089 15985 18348 25234 37885 33586 10600 -19488
6327a9488O406j1682O550j533k8626q522J8364Q969K2443J2672j7470K7342J2314
$$ -19488 -13082 -24764 -18214 -19747 -48373 -56895 -38531 -29562 -7119 5553 -11917 15425 27739
6314B7739j9235J028l016j4814m821L058j7415K3068p946k0907r107J7079Q014
$$ 27739 8504 9532 6516 -8298 -13119 -10061 -27476 -4408 -12354 -33261 -42368 -25289 -17275
6301a7275n903m2J9077K2778r780l4854j5972J1805o618m180n634j3016K2699
$$ -17275 -23178 -23220 -4143 18635 8855 -25999 -41971 -30166 -36784 -40964 -46598 -59614 -36915
6288c6915L8833O647L307K167j4509m398J5190K0345L682j5947P771n414j0035
$$ -36915 1918 8565 11872 14039 -470 -4868 10322 30667 34349 18402 26173 20759 10724
6275A0724j643R565k6675o668q909N988n18J3929K613k371k2899k5946J7460l118
$$ 10724 9081 18646 -8029 -14697 -23606 -17618 -18136 -4207 -1594 -3965 -26864 -52810 -35350 -38468
6261c8468K1384j253J3819j0864K1340K0647K9497j4531k5693k3867l2970j6010
$$ -38468 -17084 -18337 -4518 -15382 5958 26605 56102 41571 15878 -7989 -40959 -56969
6249e6969J4457O8371J8581j5153L144K870j8351k2670Q03K6414N70m595j0537
$$ -56969 -42512 25859 44440 29287 32431 35301 16950 -5720 -4917 21497 22067 17472 6935
6236F935k2095L447j0996m586R810K8539K2914n367k3932k8515N577j1403P932
$$ 6935 -15160 -11713 -22709 -27295 -17485 11054 33968 28601 4669 -23846 -18269 -29672 -21740
6223b1740L854k572Q178N786J994j0210j1325J72l6818j7475J6473J9011L0769
$$ -21740 -17886 -20458 -12280 -6494 -4500 -14710 -26035 -25863 -62681 -80156 -63683 -44672 -13903
6210a3903K6468n326M850R935k829l5049j2792j0072M1582j0463q538J3230r491
$$ -13903 12565 7239 12089 22024 19195 -15854 -28646 -38718 2864 -7599 -16137 -2907 -12398
6197a2398l4796k6947j313K6643K1182P730J7J733J8929j3599J7914K9181J7895
$$ -12398 -47194 -74141 -75454 -48811 -27629 -19899 -19882 -18149 780 -12819 5095 34276 52171
6184E2171J629K740J737j8738n4751m891P453L1666K7544j9360j0273j4734m243
$$ 52171 53800 56540 58277 39539 -15212 -20103 -12650 19016 46560 27200 16927 2193 -2050
6171b050k580l3165k1087J8547O030K5739m866k2153n424K0294O619j6653J7108
$$ -2050 -4630 -37795 -58882 -40335 -34305 -8566 -13432 -35585 -41009 -20715 -14096 -30749 -13641
6158a3641J2283j0321J086J0355k945m667P89K7788J4994n519q986P97o727j1430
$$ -13641 -1358 -11679 -10593 -238 -3183 -7850 -7061 20727 35721 30202 21216 22013 15286 3856
6144C856k792p772p661J9113r468q354k1721k1202J3840J7544N758L1799L904
$$ 3856 1064 -6708 -14369 4744 -4724 -13078 -34799 -56001 -42161 -24617 -18859 12940 16844
6131A6844O74P198j2705R128o096J8115K89j2296l774j0482l3656j431r040p110
$$ 16844 17518 24716 12011 21139 15043 33158 33447 21151 17377 6895 -26761 -28192 -37232 -44342
6117d4342Q62J9076J9406n551j032J1971j9531j1014j3755K6677l96M857J0627
$$ -44342 -43480 -24404 -4998 -10549 -11581 390 -19141 -30155 -43910 -17233 -17629 -12772 -2145
6104b145p33j3209m712q30o359K980J6527J7081k886o539R55j9191m383j6992
$$ -2145 -2878 -16087 -20799 -21629 -27988 -25008 -8481 8600 5714 -825 130 -19061 -23444 -40436
6090d0436K074J3020K0977P067l554k5268l9871M3916J6018O086J1520J0623M406
$$ -40436 -38362 -25342 -4365 2702 -852 -26120 -65991 -22075 -6057 29 11549 22172 26578
6077B6578j3718j2874k7210K0732J9844j274P951j5799N751J3705K0685m689l1669
$$ 26578 12860 -14 -27224 -6492 13352 12078 20029 4230 9981 23686 44371 39682 8013
6064H013m1561J8980J431p962R191j4606N044j0507k0618k7366j4426K7046K5989
$$ 8013 -33548 -14568 -13137 -21099 -11908 -26514 -21470 -31977 -52595 -79961 -94387 -67341 -41352
6051d1352k2007q201J101M7925J0655m367n2j3536J4392M3447n73j0392k0576
$$ -41352 -63359 -71560 -70459 -22534 -11879 -16246 -16298 -29834 -15442 28005 27432 17040 -3536
6038c536j7752J8437J4617j3287j2694L470p454L41J5170J8799k0270j4992l658
$$ -3536 -21288 -2851 11766 -1521 -14215 -10745 -18199 -17858 -2688 16111 -4159 -19151 -22809
6025b2809K5431n890l954q667N639J9974l850K1370J963m590o753M141q141j4637
$$ -22809 2622 -3268 -7222 -15889 -10250 9724 5874 27244 29207 24617 17864 22005 13864 -773
6011g73q894K0056P186q532J1631j0849k0547J0454Q066m635q28J6581J2181k4791
$$ -773 -9667 10389 17575 9043 20674 9825 -10722 -268 7798 3163 2335 18916 31097 6306
5997F306j9249K259K1454J2419K6076m319n382l1749j223j9409j7537p091K3774
$$ 6306 -12943 -10684 10770 23189 49265 44946 39564 7815 6592 -12817 -30354 -37445 -13671
5984a3671J4206M000J788r106j0719o706j8223L730q230K1179R241J5210j3825
$$ -13671 535 4535 6323 -2783 -13502 -20208 -38431 -34701 -42931 -21752 -12511 2699 -11126
5971a1126N488q36r697Q962K0032J7866j7710j4607j8674J1505k1815j3994J0037
$$ -11126 -5638 -6474 -16171 -7209 12823 30689 12979 -1628 -20302 -8797 -30612 -44606 -34569
5958c4569J6712K3862L8153k4221j7457k6108j8914r5J6071J960J8042J0844l7074
$$ -34569 -17857 6005 44158 19937 2480 -23628 -42542 -42637 -26566 -24606 -6564 4280 -32794
5945c2794q843m373L204K5491M4916J3586O050j421r008j3578j96R715N779N684
$$ -32794 -41637 -46010 -42806 -17315 27601 41187 47237 45816 36808 23230 23034 32749 38528 44212
5931D4212l5320n090o864J6080L4500J617j7859L833N509J6379N855k8324j5795
$$ 44212 8892 3802 -3062 13018 47518 49135 31276 35109 40618 56997 62852 34528 18733
5918A8733m451r038n995J7708N972j0549k7383J1089L1960P508p892m1675m8705
$$ 18733 14282 5244 -751 16957 22929 12380 -15003 -3914 28046 35554 27662 -14013 -62718
5905f2718K0480J3308j0606P533R682r694j2568K9208J873m154P638O343l852
$$ -62718 -42238 -28930 -39536 -32003 -22321 -32015 -44583 -15375 -13502 -17656 -10018 -3675 -7527
5892g527m490K122j0218M471N787J4322P199j8430j7395K3168J4813r5J7673J0176
$$ -7527 -12017 -9895 -20113 -15642 -9855 4467 11666 -6764 -24159 -991 13822 13727 31400 41576
5878D1576k3182J268l319J4073M607p700l294k6080r115J8238K9279P829j2853
$$ 41576 18394 19662 16343 30416 35023 27323 24029 -2051 -11166 7072 36351 44180 31327
5865C1327l1020N644P946J3666k9802O658n643j1549Q330J7454j0526k4392L1232
$$ 31327 307 5951 13897 27563 -2239 4419 -1224 -12773 -4443 13011 2485 -21907 9325
5852I325J815p898j1336J0497K7507K1856K5138M44k5425k7257r541k7966J6099
$$ 9325 11140 3242 -8094 2403 29910 51766 76904 77348 51923 24666 15125 -12841 3258
5839C258J3320j9710O36j5670J1816o051P97M122j9427J5804K5339j0794k3809
$$ 3258 16578 -3132 -2496 -18166 -6350 -12401 -11604 -7482 -26909 -11105 14234 3440 -20369
5826b0369m107L281J294J4995L812J0812J4883N926j1547j5302J0447N638k7392
$$ -20369 -24476 -21195 -19901 -4906 -1094 9718 24601 30527 18980 3678 14125 19763 -7629
5813g629O442J1278l2234j2838k072l402P275n747p47J5449K2736J8092K4133
$$ -7629 -1187 10091 -22143 -34981 -37053 -40455 -33180 -38927 -39674 -24225 -1489 16603 40736
5800D0736j5640l519M553r293o689K975O68J5724m126L451q657j4404J4571N199
$$ 40736 25096 21577 26130 16837 10148 13123 13791 29515 25389 28840 20183 5779 20350 25549
5786B5549n876k3592k024M303J3693j3457m102J5014K4480j7038q823k2527r651
$$ 25549 19673 -3919 -5943 -1640 12053 -1404 -5506 9508 33988 16950 8127 -14400 -24051
5773b4051o996j7888K7475J2607k8772J2073N525o674K4704Q770l714j2595k8483
$$ -24051 -31047 -48935 -21460 -8853 -37625 -25552 -20027 -26701 -1997 6773 3059 -9536 -38019
5760c8019r999J4298k768M776L4528R234l3205K867J6120J6265j0561k1571k793
$$ -38019 -48018 -33720 -36488 -31712 2816 12050 -21155 -18288 -2168 14097 3536 -18035 -20828
5747b0828K386j3873K4571j3667j9304J3298K5561Q564J4936l2252j9513O245
$$ -20828 -18442 -32315 -7744 -21411 -40715 -27417 -1856 6708 21644 -10608 -30121 -23876
5735b3876j882M562J4364P92K8088J8368p847j8153k44L098l0437K0470K4618
$$ -23876 -25758 -21196 -6832 -6040 22048 40416 32569 14416 14172 17270 -13167 7303 31921
5722C1921l225Q030k8305l359l0685j1851j668k4377J0775O5883P063r268r653
$$ 31921 28696 36726 8421 5062 -25623 -37474 -39142 -63519 -52744 13139 20202 10934 1281
5709A281r833k0222J7598J6614J4846j8931n2420j8957N835L3893M3024K7009
$$ 1281 -8552 -28774 -11176 5438 20284 1353 -51067 -70024 -64189 -30296 12728 39737
5697C9737k1340k1470q16L842p026P480j9780k4299K0762N835M043K065N10j3045
$$ 39737 18397 -3073 -3889 -47 -7073 407 -19373 -43672 -22910 -17075 -13032 -10967 -10457 -23502
5683b3502J5957K0563j6932L654J9882Q422k2735R770L80K1756p502k4116p930
$$ -23502 -7545 13018 -3914 -260 19622 28044 5309 15079 15459 37215 29713 5597 -2333
5670b333K2413o238p254j4395j4903q904J7127J3610r257k4780K4298P002k0335
$$ -2333 20080 13842 6588 -7807 -22710 -31614 -14487 -877 -10134 -34914 -10616 -3614 -23949
5657b3949q807M0498N606j3001K139k876M133k4359J3724J8102J5251K720k3454
$$ -23949 -32756 7742 13348 347 2486 -390 3743 -20616 -6892 11210 26461 29181 5727
5644E727K7861K5547N433k5475k6378R109j2954J0572J4323j2489r140k4496j647
$$ 5727 33588 59135 64568 39093 12715 21824 8870 19442 33765 21276 12136 -12360 -14007
5631a4007J6101n354q87j2538n639J4240J460N929J7228k098K284K2706k2207
$$ -14007 2094 -3260 -4147 -16685 -22324 -8084 -6624 -695 16533 14435 16719 39425 17218
5618A7218l0194p846j5207j2516K8049K4451K468R340k358j4023K257q069k4938
$$ 17218 -12976 -20822 -36029 -48545 -20496 3955 6423 15763 13405 -618 1639 -6430 -31368
5605c1368K392J4132j2416M288o525N979Q48M2455K0492p818Q369o279k0659J3962
$$ -31368 -28976 -14844 -27260 -22972 -29497 -23518 -22670 19785 40277 32459 40828 34549 13890 27852
5591B7852K1190O74j8512k9082j3071j6180l285L403K940m909M492l483J90n952
$$ 27852 49042 49716 31204 2122 -10949 -27129 -30414 -27011 -24071 -28980 -24488 -27971 -27781 -33733
5577c3733J4277L789J0783r524J4643J4409J4808j6943j3852J612j4017K3551
$$ -33733 -19456 -15667 -4884 -14408 235 14644 29452 12509 -1343 269 -13748 9803
5565I803L319j122J6738J321j5605j1597l079P167q27m475j089P109P99Q249J3251
$$ 9803 13122 12000 28738 30059 14454 2857 -222 6945 6118 1643 554 7663 8462 16711 29962
5550B9962O005j6319n819j3695J1034q221o844R655K9371j6610k5910k978R858
$$ 29962 35967 19648 13829 134 11168 2947 -3897 5758 35129 18519 -7391 -10369 -511
5537e11r473j4369j4538J4231L2058J881q25k0849j2318J480n973j2169r234J5896
$$ -511 -9984 -24353 -38891 -24660 7398 9279 8454 -12395 -24713 -23233 -29206 -41375 -50609 -34713
5523c4713L2985L1226k1681j9697l9425j2584J5846p185n072l751L6048L2628
$$ -34713 -1728 29498 7817 -11880 -51305 -63889 -48043 -55228 -60300 -64051 -28003 4625
5511D625k0801o644P04O757p437K971n804l960L3873k315j2054L92J1286j381
$$ 4625 -16176 -22820 -22116 -15359 -22796 -19825 -25629 -29589 4284 1969 -10085 -9693 1593 212
5497B12j665k1574j8887M131j5218K1157K6837K2015J8967L0410k7274l5899l6111
$$ 212 -1453 -23027 -41914 -37783 -53001 -31844 -5007 17008 35975 66385 39111 3212 -32899
5484c2899m758K3972L0828R6K034J1484q343k4429k81j5572l095p644k7099k756
$$ -32899 -37657 -13685 17143 17239 19273 30757 22414 -2015 -2296 -17868 -20963 -28607 -55706 -58462
5470e8462J5056j163K5237J5846j9761R907J028j7533J4023L538J1182J0005q323
$$ -58462 -43406 -44569 -19332 -3486 -23247 -13340 -12312 -29845 -15822 -12284 -1102 8903 580
5457E80k1724m903K3239L1072P533l134q944j1873j0993k147r625j0283M39O376
$$ 580 -21144 -26047 -2808 28264 35797 32663 23719 11846 853 -1294 -10919 -21202 -20763 -14387
5443a4387J748j7767J5361L0262o829l8329j896L942P405K5320K3815j4465k8427
$$ -14387 -12639 -30406 -15045 15217 8388 -29941 -31837 -27895 -20490 4830 28645 14180 -14247
5430a4247j5221o907o062r89J1188K5428j2734j7620k575R938K5436n326J5713
$$ -14247 -29468 -36375 -42437 -43426 -32238 -6810 -19544 -37164 -39739 -29801 -4365 -9691 6022
5417F022J7370J510l0119j0205R801M738Q178J8726j847m400l15j8510K3369m784
$$ 6022 23392 24902 -5217 -15422 -5621 -883 7295 26021 24174 19774 19459 949 24318 19534
5403A9534K582O486k7811l9754J0251j738p226M2144L4637k9963k9877j3762J3182
$$ 19534 22116 28602 791 -38963 -28712 -30450 -37676 4468 39105 9142 -20735 -34497 -21315
5390b1315M8310N59r289l9154J7012P226R071k1973m798L29J388N0137K2502l7207
$$ -21315 26995 27554 18265 -20889 -3877 3349 12420 -9553 -14351 -14022 -12634 37503 60005 22798
5376B2798j6844k8137j8306n037K5962K8711k4232j1778K0110J4515j9582J0394
$$ 22798 5954 -22183 -40489 -45526 -19564 9147 -15085 -26863 -6753 7762 -11820 -1426
5364a426J7145l2074k0958O713M5559L3134J4232p271m2879l4371j017N846M565
$$ -1426 15719 -16355 -37313 -30600 14959 48093 62325 55054 12175 -22196 -23213 -17367 -12802
5351a2802N09o857M747M358J6909j1909j5199K2450P653k1804k298J8681J2949
$$ -12802 -12293 -19150 -14403 -10045 6864 -5045 -20244 2206 9859 -11945 -14243 4438 17387
5338A7387o556o782q756m484J7034J351M8o043l3319q37L306q638K6359L0934
$$ 17387 10831 4049 -4707 -9191 7843 9194 9242 3199 -30120 -30957 -27651 -36289 -9930 21004
5324B1004j0406J2563K2510K2434j1957j3370N25p406k9577L059J6729L557j562
$$ 21004 10598 23161 45671 68105 56148 42778 43303 35897 6320 9379 26108 29665 28103
5311B8103L04l1092n047P295Q30P287k1847l7724k1657J0178J3421L7631K7696
$$ 28103 28407 -2685 -7732 -437 393 7680 -14167 -51891 -73548 -63370 -49949 -12318 15378
5298A5378Q777N255j8860q810K6115J4991j6000k6565M5927J879K159k0489l918
$$ 15378 24155 29410 10550 1740 27855 42846 26846 281 46208 48087 50246 29757 25839
5285B5839o046k910O277k1997K9634K7125k7435k3208l7155k7984n264L456K7486
$$ 25839 19793 16883 23160 1163 30797 57922 30487 7279 -29876 -57860 -63124 -59668 -32182
5272c2182N208J5109J7796q943K734J8113r937K31o95j0161K466K97J9409j0259
$$ -32182 -26974 -11865 5931 -3012 -278 17835 7898 8129 7434 -2727 -261 36 19445 9186
5258I186o672l1837j4367L3195J3996p310p429O603L825m873k4811j6602J5377
$$ 9186 2514 -29323 -43690 -10495 3501 -3809 -11238 -4635 -810 -5683 -30494 -47096 -31719
5245c1719J2926K0921K2305J2881k6249l1022j0655N547K4107j6158k474J7329
$$ -31719 -18793 2128 24433 37314 11065 -19957 -30612 -25065 -958 -17116 -19590 -2261
5233b261J5374j8161l0475K596o76J0724L233m1144k7720J9678K686K2179Q550
$$ -2261 13113 -5048 -35523 -32927 -33603 -22879 -19646 -60790 -88510 -68832 -66146 -43967 -35417
5220c5417J3943R660k639j1084j6015j5363L1056L9004K2941J593n771J7271J118
$$ -35417 -21474 -11814 -14453 -25537 -41552 -56915 -25859 13145 36086 37679 31908 49179 50297
5207E0297m2254j8367j9986L3449K4725k2978k0043R875j8002J0652L8222J0899
$$ 50297 8043 -10324 -30310 3139 27864 4886 -15157 -5282 -23284 -12632 25590 36489
5195C6489j8884k1668j8218K2132J9109M066K820j6182l5535k3278K2289J2127
$$ 36489 17605 -4063 -22281 -149 18960 23026 25846 9664 -25871 -49149 -26860 -14733
5183a4733P880j0122j0942r893Q247j6508L956P997O86o630O924J7360J0481p633
$$ -14733 -6853 -16975 -27917 -37810 -29563 -46071 -42115 -34118 -33432 -40062 -33138 -15778 -5297 -12930
5169a2930k806J7702K1138q149j5911j7049L358J1347r045j5529j8825K2175p134
$$ -12930 -15736 1966 23104 14955 -956 -18005 -14647 -3300 -12345 -27874 -46699 -24524 -31658
5156c1658J1075L93R336Q879J1128K3088J429k1084O2n979O315j989j8226K5045
$$ -31658 -20583 -20190 -10854 -1975 9153 32241 33670 12586 12648 6669 12984 10995 -7231 17814
5142A7814J8834J8885j3509l9158J52J6773j0610j6045j2800J1489M194o228j1526
$$ 17814 36648 55533 42024 2866 3018 19791 9181 -6864 -19664 -8175 -3981 -10209 -21735
5129b1735L640J3449p387O315o011j9788K9676k3245l6266n652M8727K8640M780
$$ -21735 -18095 -4646 -12033 -5718 -11729 -31517 -1841 -25086 -61352 -67004 -18277 10363 15143
5116A5143j1938J101K3705r80k2280j6848j0355N129l492k4364J787K3345j696
$$ 15143 3205 4306 28011 27031 4751 -12097 -22452 -17323 -20815 -45179 -43392 -20047 -21743
5103b1743p144M863q80n629l92O386L3199K0055Q343k2338M708j6287j7241n64
$$ -21743 -28887 -24024 -24904 -30533 -30925 -24539 8660 28715 37058 14720 19428 3141 -14100 -14664
5089a4664j2113r807K333J1876J7574L9347K1416p312j8270p088R350l2023j9325
$$ -14664 -26777 -36584 -34251 -22375 -4801 34546 55962 48650 30380 23292 32642 619 -18706
5076a8706j4426j507K1543J3490j2520l1933o644L2592K3024J7000K0787o335
$$ -18706 -33132 -34639 -13096 394 -12126 -44059 -50703 -18111 4913 21913 42700 36365
5064C6365j2796m4061k3423O175K1946K93k7397j924J5273J5186J1217L6781j0323
$$ 36365 23569 -20492 -43915 -37740 -15794 -15501 -42898 -44822 -29549 -14363 -3146 33635 23312
5051B3312p886J5845r308m5003j1735O785o996J1232k1554K051K1137K3813K5496
$$ 23312 15426 31271 21963 -23040 -34775 -27990 -34986 -23754 -45308 -43257 -22120 1693 27189
5038B7189o288l5341l4634J1504M163J0404L1289K1412J4284j6905j572j447j42
$$ 27189 20901 -14440 -49074 -37570 -33407 -23003 8286 29698 43982 27077 25505 24058 23916
5025B3916L1509k2461k7600p378K4936R786n630J2975j2393m11K201p739j8380
$$ 23916 55425 32964 5364 -2014 22922 32708 27078 40053 27660 27249 29450 21711 3331
5012C331j0756j9111K9731L1107q610k9918m791r183J5851j4451K72K3610J39
$$ 3331 -7425 -26536 3195 34302 25692 -4226 -9017 -18200 -2349 -16800 -16528 7082 7221
4999G221o420J7640q025j2480j3762Q137K907j4461M581J0812m196J2152k701
$$ 7221 801 18441 10416 -2064 -15826 -7689 -4782 -19243 -14662 -3850 -8046 4106 1405
4986A405R237L5285K3371k1023j3837l036q204m421k7137O077L4921K573j4620
$$ 1405 10642 45927 69298 48275 34438 31402 23198 18777 -8360 -2283 32638 35211 20591
4973B0591r375q09j1959q333j4173L6176j6363n362K5194J6111M123l6541n81
$$ 20591 11216 10407 -1552 -9885 -24058 12118 -4245 -9607 15587 31698 35821 -720 -1301
4960a301L00k1002J6079k438l909j651J0822j1538J8922J3060R724P551P190l3723
$$ -1301 -1001 -22003 -5924 -8362 -12271 -13922 -3100 -14638 4284 17344 27068 34619 41809 8086
4946H086o579j5755j7974K937K4756j0302k0471N242J3173L0987K224J8949q265
$$ 8086 1507 -14248 -32222 -29285 -4529 -14831 -35302 -30060 -16887 14100 16324 35273 27008
4933B7008m8909J5398J8007Q565M1331n468k3466j4404r974J24J7803O169R56
$$ 27008 -21901 -6503 11504 20069 61400 55932 32466 18062 8088 8212 26015 32184 33140
4920C3140M18j2706k9863p504K324J4262j3385j7214Q288N520m917O696J0414
$$ 33140 33558 20852 -9011 -16515 -14191 71 -13314 -30528 -22240 -16720 -21637 -14941 -4527
4907d527N557k500K6478K1931L076k8840k5130o113Mj8338q284J7823Q705K391
$$ -4527 1030 -1470 25008 46939 50015 21175 -3955 -10068 -10064 -28402 -36686 -18863 -10158 -7767
4893g767J613l6113J5877L1547M3804K4044j6238j6889j0066r962L597l299l290
$$ -7767 -6154 -42267 -26390 5157 48961 73005 56767 39878 29812 19850 23447 20148 16858
4880A6858k2559J6261J8652K444j1475j1130L950O08l0176N899J5099N437k2507
$$ 16858 -5701 10560 29212 31656 20181 9051 13001 13609 -16567 -10668 4431 9868 -12639
4867a2639N843j758r435j4980P625P121K214O114k0287k0992J3948J581R536N745
$$ -12639 -6796 -8554 -17989 -32969 -25344 -18223 -16009 -9895 -30182 -51174 -37226 -35645 -26109 -20364
4853b0364j6603j9890L1455J4330R991j5483k9854Q229M86J6147L8436K7492J283
$$ -20364 -36967 -56857 -25402 -11072 -1081 -16564 -46418 -38189 -37703 -21556 16880 44372 45655
4840D5655l7359k2213j1428J7935J0901j380k7308J1329j9364O924L1523q767
$$ 45655 8296 -13917 -25345 -7410 3491 2111 -25197 -13868 -33232 -26308 5215 -3552
4828c552n39K8933L0450l4252r580j5725j7582M471K6009j1649J2326N175k1527
$$ -3552 -4091 24842 55292 21040 11460 -4265 -21847 -17376 8633 -3016 9310 14485 -7042
4815g042j0446K1532J8866r3j7377j2051M489j2414J2584K4914o14j6331r936
$$ -7042 -17488 4044 22910 22817 5440 -6611 -2122 -14536 -1952 22962 22348 6017 -3919
4802c919J708P728J1388j3633j8002J1413M26m3886q993K4660L2432j0059J6315
$$ -3919 -2211 5517 16905 3272 -14730 -3317 -2891 -46777 -55770 -31110 1322 -8737 7578
4789G578N765j3837j8366M875N771R784K2405J504k6339k875q099K0412J5031
$$ 7578 13343 -494 -18860 -13985 -8214 1570 23975 25479 -860 -3735 -11834 8578 23609
4776B3609k05J144k8703j7096r894j2771k4393R662J7755O682o803K0193K1296
$$ 23609 23404 24548 -4155 -21251 -31145 -43916 -68309 -58647 -40892 -34210 -41013 -20820 476
4763D76j5979k161K0314J0998L7837R877l7611j9336n59j6117j5416j4277j4338
$$ 476 -15503 -17664 2650 13648 51485 61362 23751 4415 3856 -12261 -27677 -41954 -56292
4750e6292J361J8649K8973K0285J4423R744O670J205k7099R09j1184J0348O101
$$ -56292 -54931 -36282 -7309 12976 27399 37143 43813 45018 17919 18828 7644 17992 24093
4737B4093j2364p17M29O876k6493l4524P922K3083J5323p088M077K0000K7418
$$ 24093 11729 11012 11441 18317 -8176 -42700 -34778 -11695 3628 -3460 617 20617 48035
4724D8035m5313m1372j1075j2352r309M6069K4941n485j3942r45j3559K5711K0131
$$ 48035 2722 -38650 -49725 -62077 -71386 -25317 -376 -5861 -19803 -20748 -34307 -8596 11535
4711A1535M679J6726k7384j2167n072K756r684j9522K2353L5040J0829j8048j2027
$$ 11535 16214 32940 5556 -6611 -11683 -8927 -18611 -38133 -15780 19260 30089 12041 14
4698A4p635J3198L5733r579l1080j6874L012L1978P49N215j4566l0444j6531j406
$$ 14 -7621 5577 41310 31731 651 -16223 -13211 18767 19516 24731 10165 -20279 -36810 -38216
4684c8216L7500P023k3599k1761K9632J277J8540k0379j4647o550n343Q814j5921
$$ -38216 -716 6307 -17292 -39053 -9421 -8144 10396 -9983 -24630 -31180 -36523 -27709 -43630
4671d3630K630K5320J3315q34L1592O129j4989k5267J2406j803k6625k3890J8365
$$ -43630 -41000 -15680 -2365 -3199 28393 34522 19533 -5734 6672 4869 -21756 -45646 -27281
4658b7281M5429J0967n7393j2859J2056j3328J4740K0384j7463R653N521J3881
$$ -27281 18148 29115 -28278 -41137 -29081 -42409 -27669 -7285 -24748 -15095 -9574 4307
4646D307l303k553Q569q324k368j8507P526j1236r176N360l472J985L0795O523
$$ 4307 1004 -1549 7020 -1304 -3672 -22179 -14653 -25889 -35065 -29705 -33177 -31192 -397 6126
4632F126m81Q614j0205J6287j5797j3259O092K8814o440k3950p031J1257K2587
$$ 6126 5645 14259 4054 20341 4544 -8715 -2623 26191 19751 -4199 -11230 27 22614
4619B2614n880L706R306N662m257m496J0394K2464j8421j7921m489l5837R409
$$ 22614 16734 20440 29746 35408 31151 26655 37049 59513 41092 23171 18682 -17155 -7746
4606g746K7146J4026L147q960R704K0125l7383k1024O138K3209p830m0628K04
$$ -7746 19400 33426 36573 27613 37317 57442 20059 -965 5173 28382 20552 -20076 -19872
4593a9872K4665j4286J2544J4466k3332n247K5907p394K833J5330M590k2675L262
$$ -19872 4793 -9493 3051 17517 -5815 -11062 14845 7451 10284 25614 30204 7529 10791
4580A0791J9355o518p564j9275j106k491j2930k545P479R154J6544J9539J5745
$$ 10791 30146 23628 16064 -3211 -4317 -6808 -19738 -22283 -14804 -5650 10894 30433 46178
4567D6178j3314j7273j5414k5283n650O232O281k767P645l825N973K1464K171
$$ 46178 32864 15591 177 -25106 -30756 -24524 -18243 -21010 -13365 -17190 -11217 10247 12418
4554A2418Q997k0197j436P704j4988p549l365J3766R538J8016J1556k3205k1141
$$ 12418 21415 1218 -218 7486 -7502 -15051 -18416 -4650 4888 22904 34460 11255 -9886
4541i886O885L9771K5007k7015k101j5891j9031K893J9709K7731k5537k7109N469
$$ -9886 -3001 36770 61777 34762 32661 16770 -2261 632 20341 48072 22535 -4574 895
4528H95O646O86K0273j5283k5504L3761q22k3791j1436J7655q966l0109L9406
$$ 895 7541 8227 28500 13217 -12287 21474 20652 -3139 -14575 3080 -5886 -35995 3411
4515C411O4482J0875k4364k3159j7695r684p983k073j8291J0556j154L494q669
$$ 3411 67893 78768 54404 31245 13550 3866 -4117 -6190 -24481 -13925 -15079 -11585 -20254
4502b0254j683K8193l049k6122o619K4666J4731l198K1423J7626l445k1280j0763
$$ -20254 -21937 6256 3207 -22915 -29534 -4868 9863 6665 28088 45714 42269 20989 10226
4489A0226r443j7166J2226K3533K2222j2317j1546K1130j4725j2809n415K5063
$$ 10226 783 -16383 -4157 19376 41598 29281 17735 38865 24140 11331 5916 30979
4477C0979l331j3533J0134k5231l426K8344p728r470K1964k253j2662m254J7357
$$ 30979 27648 14115 24249 -982 -4408 23936 16208 6738 28702 26449 13787 9533 26890
4464B6890N395p081j8986k449m897j3347k547L3058K4463j2211n6174M04K5369
$$ 26890 32285 25204 6218 3769 -1128 -14475 -17022 16036 40499 28288 -27886 -27482 -2113
4451b113k911k1464R336K0273J6677L384M81n628k746j6962l5361o091K826L0887
$$ -2113 -5024 -26488 -17152 3121 19798 23182 23663 18035 15289 -1673 -37034 -43125 -40299 -9412
4437i412R424K2282J4538m53r157r107j2243j699J1371k3818o174O684o15r568
$$ -9412 12 22294 36832 36379 27222 18115 5872 4173 15544 -8274 -14448 -7764 -8379 -17947
4423a7947k3682n647J7750K0273r404o282P023J4425J4133J366q898Q171p898
$$ -17947 -41629 -47276 -29526 -9253 -18657 -24939 -17916 -3491 10642 12008 3110 11281 3383
4410C383j6869m338p579p108M486J4214P976L123O628L8153K4267j8563m731k4119
$$ 3383 -13486 -17824 -25403 -32511 -28025 -13811 -5835 -2712 3916 42069 66336 47773 43042 18923
4396A8923l7217L506m961p492K6991J0201r379K2126N299j0686Q018K610j2772
$$ 18923 -18294 -14788 -19749 -27241 -250 9951 572 22698 27997 17311 25329 27939 15167
4383A5167k1255j1245j7272J2137J8621p322k0051J117n643L5688p211J9J3057
$$ 15167 -6088 -17333 -34605 -22468 -3847 -11169 -31220 -30103 -35746 -58 -7269 -7250 5807
4370E807R858j7454J6543J673J2355J3264M929J390j6453m7376l5291O549J6419
$$ 5807 15665 -1789 14754 16427 28782 42046 46975 48365 31912 -15464 -50755 -44206 -27787
4357b7787K5905J3171n555M190Q441m685j853L462j5180j7099L934p705J1284
$$ -27787 -1882 11289 5734 9924 18365 13680 11827 15289 109 -16990 -13056 -20761 -9477
4344i477J6732K0446J6716o911k0384j4543j3007m432M369o92m127N404n108J1378
$$ -9477 7255 27701 44417 37506 17122 2579 -10428 -14860 -10491 -11183 -15310 -9906 -15014 -3636
4330c636J3479k367m6244K4329K963k8668q816J0603K5993J0825J1574K157r220
$$ -3636 9843 7476 -38768 -14439 -11476 -40144 -48960 -38357 -12364 -1539 10035 12192 2972
4317B972j6691j8371M305L7661K704q244o076R706l053j1814J6198L4694R702
$$ 2972 -13719 -32090 -27785 9876 12580 4336 -1740 7966 4913 -6901 9297 43991 53693
4304E3693j2702j8769l5054k4368K0736J5715O941j5959j3820J9220R742p148
$$ 53693 40991 22222 -12832 -37200 -16464 -749 6192 -9767 -23587 -4367 5375 -1773
4292a773R987m805J4084K4615K676J1610J073j3254k1055o058J2226P186k0699
$$ -1773 8214 3409 17493 42108 44784 56394 57467 44213 23158 17100 29326 36512 15813
4279A5813k7583j3032O9k627J2815j3652R290J7730m860J187l742q266j531L248
$$ 15813 -11770 -24802 -24733 -27360 -14545 -28197 -18907 -1177 -6037 -4850 -8592 -16858 -18389 -15141
4265a5141N997l081K9368Q528k6196R100J6820n098j3934j834P457J2106N152
$$ -15141 -9144 -12225 17143 25671 -525 8575 25395 20297 6363 4529 11986 24092 29244
4252B9244j5455L476k1946j5838R635j820k0224P421p523p273R7J8285K1711J6333
$$ 29244 13789 17265 -4681 -20519 -10884 -12704 -32928 -25507 -33030 -40303 -40206 -21921 -210 16123
4238A6123k1438j1855J5326R59j5901L646j0010K0781L4634j9001j9390K480P062
$$ 16123 -5315 -17170 -1844 -885 -16786 -13140 -23150 -2369 32265 13264 -6126 -3646 3416
4225C416N538j4469j1921J8572j7559K0942K4713k177J7486J4965J775k659j3981
$$ 3416 8954 -5515 -17436 1136 -16423 4519 29232 27055 44541 59506 61281 58622 44641
4212D4641k5087N125J4569m311k1464j400j2413k1608j0141K011K8985K1958n722
$$ 44641 19554 24679 39248 34937 13473 12073 -340 -21948 -32089 -30078 -1093 20865 15143
4199A5143l1321o913K04K3010J4267J5917J3165k5101k4979q558J211J4349L170
$$ 15143 -16178 -23091 -22887 123 14390 30307 43472 18371 -6608 -15166 -13955 394 3564
4186C564o283k0584Q797J4127j755j2607N572K129j5402k398j6352M104L2901
$$ 3564 -2719 -23303 -14506 -379 -2134 -14741 -9169 -7040 -22442 -24840 -41192 -37088 -4187
4173d187O13k2116j2013Q79J4020L1550j942R609L255k0104M529L8755M798k2073
$$ -4187 -3574 -25690 -37703 -36824 -22804 8746 6804 16413 19668 -436 4093 42848 47646 25573
4159B5573j7479j6270j0653m998L3837K0421m844j7529K299k525n898m41j8873
$$ 25573 8094 -8176 -18829 -23827 10010 30431 25587 8058 10357 7832 1934 1493 -17380
4146a7380N230L6274L862q382j7489M721n747J4718Q023j5117o523l66R158K661
$$ -17380 -12150 24124 27986 19604 2115 6836 1089 15807 23830 8713 2190 1824 10982 13643
4132A3643K745j0192K46L742j3484P690M536p823k7462j4219Q008k118R999J4923
$$ 13643 16388 6196 6442 10184 -3300 4390 8926 1103 -26359 -40578 -32570 -34688 -24689 -9766
4118i766N977M1372L6595j5436o474p768j5308j3382J8252K8151j8630k2394q965
$$ -9766 -3789 37583 74178 58742 52268 44500 29192 15810 34062 62213 43583 21189 12224
4105A2224K0266Q912l565l9059m072K6688J0192m233k1699P113J0594k4589L205
$$ 12224 32490 41402 37837 -1222 -5294 21394 31586 27353 5654 12767 23361 -1228 1977
4092A977K546R586j3055J7908Q028r357q760q607q271K3272L248J800j0995J2072
$$ 1977 4523 14109 1054 18962 26990 17633 8873 266 -8005 15267 18515 20315 9320 21392
4078B1392L234j3179K1207M3236k2467l5960q910J915J2695K346L1146j0240k2264
$$ 21392 24626 11447 32654 75890 53423 17463 8553 10468 23163 25509 56655 46415 24151
4065B4151P575K3946l3107m4099k7758r225J7116n950R130J9218R975j6987l821
$$ 24151 31726 55672 22565 -21534 -49292 -58517 -41401 -47351 -38221 -19003 -9028 -26015 -29836
4052b9836K9310K163J7799k8725j2058K6248K2352N90j5803M209j2418j4162J1391
$$ -29836 -526 1637 19436 -9289 -21347 4901 27253 27843 12040 16249 3831 -10331 1060
4039A060J3057P698k8044k0114m670J7270N995k5952p007K868J3891J3532q347
$$ 1060 14117 21815 -6229 -26343 -31013 -13743 -7748 -33700 -40707 -37839 -23948 -10416 -18763
4026a8763l3778J7700M2591J9347J7921j5457L128k0886k4865n402J0473O790
$$ -18763 -52541 -34841 7750 27097 45018 29561 32689 11803 -13062 -18464 -7991 -1201
4014a201o295l807P000J9599J1201o340n874l2437j5678J645J6820m977P695N174
$$ -1201 -7496 -11303 -4303 15296 26497 20157 14283 -18154 -33832 -32187 -15367 -20344 -12649 -7475
4000g475k108l343K0220k7843L539M996l3680j7394J7967L8784M996k4887n707
$$ -7475 -9583 -12926 7294 -20549 -17010 -12014 -45694 -63088 -45121 -6337 -1341 -26228 -31935
3987c1935K4041K5910J7988k7657m1468J4181J5585J6151q240J7203p55j6402
$$ -31935 -7894 18016 36004 8347 -33121 -18940 -3355 12796 4556 21759 21004 4602
3975D602J0550j2173j6580J9429J4223r87k4154j924j0831k2379q877P89J4442
$$ 4602 15152 2979 -13601 5828 20051 19064 -5090 -7014 -17845 -40224 -49101 -48312 -33870
3962c3870K3107L1147n022j8549m886K265M763J7582M273K35N310O389j0126R847
$$ -33870 -10763 20384 15362 -3187 -8073 -5808 -1045 16537 20810 21045 26355 32744 22618 32465
3948C2465R937j9082l0420K4412R097n380j3637R807J9710J2664k0313j6797j4582
$$ 32465 42402 23320 -7100 17312 26409 21029 7392 17199 36909 49573 29260 12463 -2119
3935b119j069j2726r224K7005J7909P714J4678O561J906J882j0167q574k3911
$$ -2119 -3188 -15914 -25138 1867 19776 27490 42168 48729 50635 52517 42350 33776 9865
3922I865K5954K2562R910j4790j4862P938j7215k2448l4452k863m76K6633L0863
$$ 9865 35819 58381 68291 53501 38639 46577 29362 6914 -27538 -30401 -30877 -4244 26619
3909B6619J8398k356M287k6912l0938j3275J534J5433P185n005J1156n033j1126
$$ 26619 45017 42661 46948 20036 -10902 -24177 -22643 -7210 -25 -5030 6126 1093 -10033
3896a0033L716K6774j3563k4076j1141J8472J6759K192J4830k203n287J0537J7905
$$ -10033 -6317 20457 6894 -17182 -28323 -9851 6908 9100 23930 21727 16440 26977 44882
3883D4882l205j1241l1052p085l4086p605K6164J9925P884J899M663j0704k0987
$$ 44882 41677 30436 -616 -7701 -41787 -49392 -23228 -3303 4581 6480 11143 439 -20548
3870b0548K0929P520o45J4982J653r469p320o864j4178J5415J2119R10r217k171
$$ -20548 381 7901 7256 22238 23891 14422 7102 238 -13940 1475 13594 14504 5287 3116
3856C116L240J5794m042o269N12J021j0859k3356l909K7590J0025m768Q164n299
$$ 3116 6356 22150 18108 11839 12351 13372 2513 -20843 -24752 2838 12863 8095 16259 10960
3842A0960Q30n473p604l505j3116j4231L387L2590n859Q585J7548l331k101m124
$$ 10960 11790 6317 -1287 -4792 -17908 -32139 -28752 3838 -2021 6564 24112 20781 18680 14556
3828A4556r585m904K340L425j8891J3O207J0903k1066P304r09L486M252q309P502
$$ 14556 4971 67 2407 5832 -13059 -13046 -6839 4064 -17002 -9698 -10607 -7121 -2869 -11178 -3676
3813c676J4145J2067j0319j9588k2399K0730J234L771O610J0931r910m479J8070
$$ -3676 10469 22536 12217 -7371 -29770 -9040 -7806 -4035 2575 13506 3596 -883 17187
3800A7187Q367K602k7901l0087j2138j5163J2608m373J6684K9319L6297O927k1226
$$ 17187 25554 28156 255 -29832 -41970 -57133 -44525 -48898 -32214 -2895 33402 40329 19103
3787A9103j3827m227n065j2293K484J283p831L1411J3720j3375l7974L327J0595
$$ 19103 5276 1049 -4016 -16309 -13825 -12542 -20373 11038 24758 11383 -26591 -23264 -12669
3774a2669J5859o621O2j2416q054J7299J5244j254j1600r44J3394K8343r760j5792
$$ -12669 3190 -3431 -3369 -15785 -23839 -6540 8704 7450 -4150 -5094 8300 36643 26883 11091
3760A1091K743j2710K0358J0208O534k793j5708k4201j5840j0524k7648J1612
$$ 11091 13834 1124 21482 31690 38224 35431 19723 -4478 -20318 -30842 -58490 -46878
3748d6878O771k968J7695M9844R22j8414l152J0529j7287l954j2111J2763K325
$$ -46878 -40107 -43075 -25380 24464 25386 6972 3820 14349 -2938 -6892 -19003 -6240 -3915
3735c915l3747j0641j2235J6195K9998J7429N390P043m325j6363P436R406O79
$$ -3915 -37662 -48303 -60538 -44343 -14345 3084 8474 15517 11192 -5171 2265 11671 12350
3722A2350K08L284k3871j4486j35r810k5464L8082J2082n103L904K9149P597M454
$$ 12350 12558 15842 -8029 -22515 -22650 -32460 -57924 -19842 -7760 -12863 -8959 20190 27787 32241
3708C2241p019r672Q186l1293l6137J2301K449K0889P513J4735j5338q438j4884
$$ 32241 25222 15550 23736 -7557 -43694 -31393 -28944 -8055 -542 14193 -1145 -9583 -24467
3695b4467k817K0597j6121K0607J6322l084K860n851J5908K2116j9475r468J2600
$$ -24467 -27284 -6687 -22808 -2201 14121 11037 13897 8046 23954 46070 26595 17127 29727
3682B9727K3167m06k1579j8054p927L230q17k679K7239J0452k6109j8798Q340
$$ 29727 52894 52488 30909 12855 4928 8158 7341 4662 31901 42353 16244 -2554 5786
3669E786j1379k1989Q615K930j0456K1141M1762J5087q797j1603k2285j8497p440
$$ 5786 -5593 -27582 -18967 -16037 -26493 -5352 36410 51497 42700 31097 8812 -9685 -17125
3656a7125K917k841N668O502J0796O972j5147m872J4742J1216k0885q505k0280
$$ -17125 -14208 -17049 -11381 -4879 5917 12889 -2258 -7130 7612 18828 -2057 -10562 -30842
3643c0842k3068r29K8024K8536N824k758J5730j8306o975K1076J0352k0746l681
$$ -30842 -53910 -54839 -26815 1721 7545 4787 20517 2211 -4764 16312 26664 5918 2237
3630B237j1489K2636K6157k2535k9781k1360J887P080Q395Q113J7132M739r854
$$ 2237 -9252 13384 39541 17006 -12775 -34135 -32248 -25168 -16773 -8660 8472 13211 3357
3617C357J1669M604P30l719l728J254r43K017p095j8332o689k0667j0702L0390
$$ 3357 15026 19630 20360 16641 12913 14167 13224 15241 8146 -10186 -16875 -37542 -48244 -17854
3603a7854R482K8563m995L275k1613j7984j8271j3770N310M512k573N435o900
$$ -17854 -8372 20191 15196 18471 -3142 -21126 -39397 -53167 -47857 -43345 -45918 -40483 -47383
3590d7383J4633J7590J0025l646J9733j069m3J4933k6628r021J1844Q58j0426
$$ -47383 -32750 -15160 -5135 -8781 10952 9883 9840 24773 -1855 -10876 968 1826 -8600
3577h600l758K405O692N380L938j0387L187j3644k811p467M4581K7865k3029k7984
$$ -8600 -12358 -9953 -3261 2119 6057 -4330 -1143 -14787 -17598 -25065 19516 47381 24352 -3632
3563c632k1653J562L0223j3053k9658o613R39J5005j6943j2056J4585J8304p326
$$ -3632 -25285 -23723 6500 -6553 -36211 -42824 -41885 -26880 -43823 -55879 -41294 -22990 -30316
3550c0316O307k0136K29j5780J2388K8563n644M383m639M392r31q884L4740R094
$$ -30316 -24009 -44145 -43916 -59696 -47308 -18745 -24389 -20006 -24645 -20253 -21184 -30068 4672 13766
3536A3766p916R770J017j6243j8061j9822m393n449K7513N210K3487K2493m72
$$ 13766 5850 15620 16637 394 -17667 -37489 -41882 -47331 -19818 -14608 8879 31372 30900
3523C0900l3491k2918K2143N903N050l067j2241j7506P64j3492J1003K593Q080
$$ 30900 -2591 -25509 -3366 2537 7587 4520 -7721 -25227 -24463 -37955 -26952 -24359 -16279
3510a6279j561l269N114L663r88l0664O531J8733J5829K704J3758p125j4643J927
$$ -16279 -17840 -21109 -15995 -12332 -13320 -43984 -37453 -18720 -2891 -187 13571 6446 -8197 -6270
3496f270J6155N832K537k1331k3061J8578L2850J7030n416j5849J0141Q87k1223
$$ -6270 9885 15717 18254 -3077 -26138 -7560 25290 42320 36904 21055 31196 32083 10860
3483A0860R780j1900j5382K0082P795j264m042r713L3716j2860j4810o572J6138
$$ 10860 20640 8740 -6642 13440 21235 19971 15929 6216 39932 27072 12262 5690 21828
3470B1828J4224q027J066J5246j4556l7415k1266O587n83l044j1755m427P832
$$ 21828 36052 28025 29091 44337 29781 -7634 -28900 -22313 -22896 -25940 -37695 -42122 -34290
3457c4290O281Q248J799J0567m290P45j6997j2488K1190L2748P731k4752o915
$$ -34290 -28009 -19761 -17962 -7395 -11685 -10940 -27937 -40425 -19235 13513 21244 -3508 -10423
3444a0423L779J2403K3651J8393k9172m4854o828m940Q654J8146J9280j2218k0688
$$ -10423 -6644 5759 29410 47803 18631 -26223 -33051 -37991 -29337 -11191 8089 -4129 -24817
3431b4817j2947j82M5223j701K368O61O956k4370k4674J9618J3269k2775k454
$$ -24817 -37764 -37946 7277 5576 7944 8605 15561 -8809 -33483 -13865 -596 -23371 -25825
3418b5825J6752J1356J111k55n008J2879Q096k2450m994j1093m386J3431k289
$$ -25825 -9073 2283 3394 3139 -1869 11010 19106 -3344 -8338 -19431 -23817 -10386 -12675
3405a2675L003K2232J3759J6758O746l2727k5323R640J1569R335j0214m3099j4408
$$ -12675 -9672 12560 26319 43077 49823 17096 -8227 1413 12982 22317 12103 -30996 -45404
3392d5404K1548O560Q722j2906J8618N0k838L600L198j4854J2402p916j2663j7060
$$ -45404 -23856 -17296 -8574 -21480 -2862 -2812 -5650 -2050 1148 -13706 -1304 -9220 -21883 -38943
3378c8943J1096q491K5722K0339M32j886j2573J0652N160K1166r392M640r415
$$ -38943 -27847 -36338 -10616 9723 10155 8269 -4304 6348 11508 32674 23282 27922 18507
3365A8507l1555n42J0403j041K600j7449Q405q76N941R59Q489M391l9539l3299
$$ 18507 -13048 -13590 -3187 -4228 -1628 -19077 -10672 -11548 -5607 -4648 3841 8232 -31307 -64606
3351f4606R171N522L3351K4964m91m813k5088L142k093K0044k0624l4753q474
$$ -64606 -55435 -49913 -16562 8402 7911 3098 -21990 -18848 -20941 -897 -21521 -56274 -64748
3338f4748K4834K6944L5141J1046l8815J8530J2686l1249j7802N361j874j152
$$ -64748 -39914 -12970 22171 33217 -5598 12932 25618 -5631 -23433 -18072 -19946 -21098
3326b1098N470K023l7712J1998L0305K5420j3194l3224O314J1371N820p14n523
$$ -21098 -15628 -13605 -51317 -39319 -9014 16406 3212 -30012 -23698 -12327 -6507 -7221 -12744
3313a2744J7451K0390K0364J3647l1409k1244R850j6292j6445M145L97N104R539
$$ -12744 4707 25097 45461 59108 27699 6455 16305 13 -16432 -12287 -11890 -6786 2753
3300B753m759J5826J7658n8l7097l3929R911N0115r281k9830j5046J6223R763
$$ 2753 -2006 13820 31478 31420 -5677 -39606 -29695 20420 11139 -18691 -33737 -17514 -7751
3287g751J3649J7676K7491k9527j2255j3855j0048J7325l2922J1624L5654M97
$$ -7751 5898 23574 51065 21538 9283 -4572 -14620 2705 -30217 -18593 17061 17558
3275A7558j7134O871Q851O719N736m883o71k2294q632k13K2799J2182j7435k9862
$$ 17558 424 7295 16146 22865 28601 23718 23047 753 -7879 -8092 14707 26889 9454 -20408
3261b0408j5333K7086P954L8012K5209J7337k9800l7866O806N921k9714J7918
$$ -20408 -35741 -8655 -701 37311 62520 79857 50057 12191 18997 24918 -4796 13122
3249A3122m392j9161J9149n210L305k6052k8718k719M2350J1928N395J6625K4186
$$ 13122 8730 -10431 8718 3508 6813 -19239 -47957 -50676 -8326 3602 8997 25622 49808
3236D9808l190m87k555l7222k2315J0157J4765l0895O475P492K1231l472k7716
$$ 49808 46618 46131 43576 6354 -15961 -5804 8961 -21934 -15459 -7967 13264 9792 -17924
3223a7924j7685K825l446j0457j5766M3318L1521J1509o391o573q379O912j0196
$$ -17924 -35609 -32784 -36230 -46687 -62453 -19135 12386 23895 17504 10931 2552 9464 -732
3210g32K2400J6755o97k2133l196n994N821Q372o98J0579R952L796M282r916j5591
$$ -732 21668 38423 37726 15593 12397 6403 12224 20596 19898 30477 40429 44225 48507 38591 23000
3195B3000j0201O437J5008m568M239k7986l3422m416L5961N517j582p846L026
$$ 23000 12799 19236 34244 29676 33915 5929 -27493 -31909 4052 9569 7987 141 3167
3182C167M32K3371r89k0822r327J240k92p856j4140O643J3552j8884J0522J405
$$ 3167 3599 26970 25981 5159 -4168 -2928 -3220 -11076 -25216 -18573 -5021 -23905 -13383 -11978
3168a1978K2185J7444J803j0789O335j0710P283J5480k5111j0279k2154J3299
$$ -11978 10207 27651 29454 18665 25000 14290 21573 37053 11942 1663 -20491 -7192
3156g192N607J0644K5718n853j6128k0971k8573j2080K8853J7030J0119k349K993
$$ -7192 -1585 9059 34777 28924 12796 -8175 -36748 -48828 -19975 -2945 7174 4825 7818
3143G818j602j6359p851l3447Q988M9171k3409m624K2382L5132J0436j2641k6556
$$ 7818 6216 -10143 -17994 -51441 -42453 6718 -16691 -21315 1067 36199 46635 33994 7438
3130G438K2609J3252j8445l7439m484j3241J7127L0207K3418k754O713K5537j4480
$$ 7438 30047 43299 24854 -12585 -17069 -30310 -13183 17024 40442 37688 44401 69938 55458
3117E5458k2153R594o338l5777n2n222J0556j2449K539J0765P415k649J9167R123
$$ 55458 33305 42899 36561 784 732 -4490 6066 -6383 -3844 6921 14336 11687 30854 39977
3103C9977j7580k0158n899n924J9967M3278k7723j6135L30k9371j3385K904n265
$$ 39977 22397 2239 -3660 -9584 10383 53661 25938 9803 10133 -19238 -32623 -29719 -34984
3090c4984Q186j6255l8309r173J5519K1649M5048K2475N593q231k0570j8976K015
$$ -34984 -26798 -43053 -81362 -90535 -75016 -53367 -8319 14156 19749 11518 -9052 -28028 -26013
3077b6013m976L952J2145j2131J1616j880l440k901J9661K6740J4295p371r813
$$ -26013 -30989 -27037 -14892 -27023 -15407 -17287 -20727 -23628 -3967 22773 37068 29697 19884
3064A9884K1627J2286n768k9463r408o611j2583K902L2247R251O209P319N330
$$ 19884 41511 53797 48029 18566 9158 2547 -10036 -7134 25113 34364 40573 47892 53222
3051E3222l0680k3341m739L335j9584J5458J5850n983J3228J908j4116m974J1941
$$ 53222 22542 -799 -5538 -2203 -21787 -6329 9521 3538 16766 18674 4558 -416 11525
3038A1525j8763k9803K1462J6098q268J6059O933n556l008m473J336q47m06K053
$$ 11525 -7238 -37041 -15579 519 -7749 8310 15243 9687 6679 2206 3542 2695 2289 4342
3024D342k614p245J1150J204j7706l22J2424K1536M6366J3919p364k3758k0861
$$ 4342 1728 -5517 5633 6837 -10869 -11191 1233 22769 69135 83054 75690 51932 31071
3011C1071j4743j8470R276n94J617o69J0359M261j0823k4633K213P807L1652j394
$$ 31071 16328 -2142 7134 6540 8157 7488 17847 22108 11285 -13348 -11135 -3328 28324 26930
2997B6930k0413n538J4257L462j0851J652Q964J963j2523j2921J7262j6204K017
$$ 26930 6517 979 15236 18698 7847 9499 18463 20426 7903 -5018 12244 -3960 -1943
2984a943l4850J9211J5382K2931n446j7374j0917j3678j9779L342P311p398r081
$$ -1943 -36793 -17582 -2200 20731 15285 -2089 -13006 -26684 -46463 -43121 -35810 -43208 -52289
2971e2289J1486J1518L2721J7707R422j8449O080O102j7710k235J2554k2843M555
$$ -52289 -40803 -29285 3436 21143 30565 12116 18196 24298 6588 4353 16907 -5936 -1381
2958a381k2349j9378j4420j0343J4945M9339M514j8739J0452L1731J9790M49j4586
$$ -1381 -23730 -43108 -57528 -67871 -52926 -3587 927 -17812 -7360 24371 44161 44610 30024
2945C0024p370j292j1199l620N031o113N146o419R149m425L298J4946J2293J7168
$$ 30024 22654 21362 10163 6543 11574 5461 10607 4188 13337 8912 12210 27156 39449 56617
2931E6617K888k888m877N775J5998j6934l1340k7561k730J2299M531O758o057
$$ 56617 59505 56617 51740 57515 73513 56579 25239 -2322 -5052 7247 11778 18536 12479
2918A2479j3545j4709j3647j7298J8219K3704L9499J4013J0604l1321k6182j8341
$$ 12479 -1066 -15775 -29422 -46720 -28501 -4797 34702 48715 59319 27998 1816 -16525
2906a6525k5265K4177M7959j3273j2912l843o414J9918K2896k9931k3922j9328
$$ -16525 -41790 -17613 30346 17073 4161 318 -6096 13822 36718 6787 -17135 -36463
2894c6463n20J1194J4525p101o293K773j319N218J3408j5946M069P709m365Q893
$$ -36463 -36983 -25789 -11264 -18365 -24658 -21885 -23204 -17986 -4578 -20524 -16455 -8746 -13111 -4218
2880d218j9169J8263K146O411K0332j7848r217K5411J6855o589k2661q780QJ040
$$ -4218 -23387 -5124 -2978 3433 23765 5917 -3300 22111 38966 32377 9716 936 944 1984
2866A984l270k6649L517J8199J1093l482k095k3091j6894O939L7548Q2N0r636
$$ 1984 -1286 -27935 -24418 -6219 4874 1392 -703 -23794 -40688 -33749 3799 3881 3931 -5705
2852e705J1450J7347Q812k3533k2385j273L2145O596l1408L692m756k552j5509
$$ -5705 5745 23092 31904 8371 -14014 -15287 16858 23454 -7954 -4262 -9018 -11570 -27079
2839b7079N7q980N494J1188M449L1354m066Q426M400K914j517l9723N013J6598
$$ -27079 -27022 -36002 -30508 -19320 -14871 16483 12417 20843 25243 28157 26640 -13083 -8070 8528
2825H528J5370j4256l0070J1021m290J665m676j1253J4208K5962j2533k91J3085
$$ 8528 23898 9642 -20428 -9407 -13697 -12032 -16708 -27961 -13753 12209 -324 -615 12470
2812A2470Q846q259N79Q486j1659j344l5658r593K5408J5443j1262J7117r875
$$ 12470 21316 13057 13636 22122 10463 9119 -26539 -36132 -10724 4719 -6543 10574 699
2799F99k8927O921J1853k7869J6530K4939l214k3128K8519N299p592k6392n561
$$ 699 -28228 -21307 -9454 -37323 -20793 4146 932 -22196 6323 11622 4030 -22362 -27923
2786b7923K7169K4447N983k3383j0814O322o010k47K5323k4506k3910K5735J711
$$ -27923 -754 23693 29676 6293 -4521 1801 -4209 -4456 20867 -3639 -27549 -1814 -103
2773a03l2936j3515j5631o865J3528L3320n151Q58o6J2956j002K666r463j4757
$$ -103 -33039 -46554 -62185 -69050 -55522 -22202 -27353 -26495 -26561 -13605 -14607 -11941 -21404 -36161
2759c6161K489k3131k5601R383L782P284J2991r018J3363J4912L50J9115Q230
$$ -36161 -33672 -56803 -82404 -73021 -69239 -61955 -48964 -57982 -44619 -29707 -29357 -10242 -2012
2746b012j0215K3568Q517l2988r297J7422M727M299k296L106k4531n918J8029
$$ -2012 -12227 11341 19858 -13130 -22427 -5005 -278 4021 1725 4831 -19700 -25618 -7589
2733g589K3450K3299q618l4143j1175q709r10K0420O037Q006L931K3655L543r531
$$ -7589 15861 39160 30542 -3601 -14776 -23485 -24395 -3975 2062 10068 13999 37654 41197 31666
2719C1666K310n275m783m175p372j836J195l162k1567Q402K8313k1715k5676O446
$$ 31666 33976 28701 23918 19743 12371 10535 11730 8568 -12999 -4597 23716 2001 -23675 -17229
2705a7229J6547J0307r802J6641J3321k3778j5648J0007J6740L263J0648K3401
$$ -17229 -682 9625 -177 16464 29785 6007 -9641 366 17106 20369 31017 54418
2693E4418j4463l7695O662K0202l097p576r734j9172R740N945K6193M568j8348
$$ 54418 39955 2260 8922 29124 26027 18451 8717 -10455 -715 5230 31423 35991 17643
$$ [...]
##END NTUPLES=NMR SPECTRUM
##END=
