##TITLE=Analysis number 328500
Compound Code cc 53009
Book Reference 407/151
Project Code adrs
Chemist Name andyw
##JCAMPDX= 6.0         $$ Bruker NMR JCAMP-DX V2.0
##DATA TYPE= NMR SPECTRUM
##DATA CLASS= NTUPLES
##ORIGIN= Bruker BioSpin GmbH
##OWNER= nmr
$$ XWIN-NMR		Version 3.5
$$ Mon Jun 11 12:44:01 2007 GMT Daylight Time (UT+1h)  MAYBRIDGE\nmr@NMR_250MHZ
##.OBSERVE FREQUENCY= 250.131544655141
##.OBSERVE NUCLEUS= ^1H
##.ACQUISITION MODE= SIMULTANEOUS (DQD)
##.ACQUISITION SCHEME= undefined
##.AVERAGES= 16
##.DIGITISER RES= 18
##SPECTROMETER/DATA SYSTEM= dpx250
##.PULSE SEQUENCE= zg30
##.SOLVENT NAME= CDCl3
##.SHIFT REFERENCE= (INTERNAL, CDCl3, 0, 16.522)
##AUDIT TRAIL= $$ (NUMBER, WHEN, WHO, WHERE, WHAT)
$$ ##TITLE= Audit trail, XWIN-NMR		Version 3.5
$$ ##JCAMPDX= 5.01
$$ ##ORIGIN= Bruker BioSpin GmbH
$$ ##OWNER= nmr
$$ C:\u/data/dgb/nmr/ADRS/640/pdata/1/auditp.txt
$$ ##AUDIT TRAIL=  $$ (NUMBER, WHEN, WHO, WHERE, WHAT)
(   1,<2007-06-11 12:43:36.42 +100>,<MAYBRIDGE\nmr>,<NMR_250MHZ>,
      <created by zg, POWCHK disabled, PULCHK disabled
       configuration hash MD5:
       76 6E 9A 78 1E 09 19 81 EC 84 63 8F B0 6A 59 2D
       data hash MD5: 64K
       45 CD 35 65 AE 52 A3 08 EE 31 4B 79 63 18 D9 3F>)
(   2,<2007-06-11 12:43:50.79 +100>,<MAYBRIDGE\nmr>,<NMR_250MHZ>,
      <Start of raw data processing
       ef LB = 0.3 FT_mod = 6 PKNL = 1 SI = 32K 
       data hash MD5: 32K
       33 E1 99 7C FD 8A 0E F8 07 B0 2B 9E 01 96 05 B6>)
(   3,<2007-06-11 12:43:52.79 +100>,<MAYBRIDGE\nmr>,<NMR_250MHZ>,
      <apk 
       data hash MD5: 32K
       38 3E 55 C8 80 80 66 20 FC B6 62 69 C6 54 3E C2>)
(   4,<2007-06-11 12:43:53.63 +100>,<MAYBRIDGE\nmr>,<NMR_250MHZ>,
      <abs ABSG = 5 
       data hash MD5: 32K
       E1 6B 18 A1 43 15 4D A7 EF 01 53 AE FA DE BD 0C>)
$$ ##END=
$$ 
$$ hash MD5
$$ 82 08 7E 34 E3 53 15 62 C4 99 85 10 C7 0B EF 81
##$RELAX= 
##$RELAX= 
##$RELAX= 
##$RELAX= 
##$RELAX= 
##$RELAX= 
##$RELAX= 
$$ Bruker specific parameters
$$ --------------------------
##$DU= <C:\u>
##$EXPNO= 640
##$NAME= <ADRS>
##$PROCNO= 1
##$TYPE= <nmr>
##$USER= <dgb>
##$AMP= (0..31)
100 100 100 100 100 100 100 100 100 100 100 100 100 100 100 100 100 100 
100 100 100 100 100 100 100 100 100 100 100 100 100 100 
##$AQSEQ= 0
##$AQ_mod= 3
##$AUNM= <au_zg>
##$AUTOPOS= <10 >
##$BF1= 250.13
##$BF2= 250.13
##$BF3= 250.13
##$BF4= 250.13
##$BF5= 500.13
##$BF6= 500.13
##$BF7= 500.13
##$BF8= 500.13
##$BYTORDA= 1
##$CFDGTYP= 0
##$CFRGTYP= 5
##$CHEMSTR= <none>
##$CNST= (0..31)
1 1 145 1 1 1 1 1 1 1 1 1 1 1 1 1 1 1 1 1 1 1 1 1 1 1 1 1 1 1 1 1 
##$CPDPRG= <>
##$CPDPRG1= <>
##$CPDPRG2= <>
##$CPDPRG3= <>
##$CPDPRG4= <mlev>
##$CPDPRG5= <mlev>
##$CPDPRG6= <mlev>
##$CPDPRG7= <mlev>
##$CPDPRG8= <mlev>
##$CPDPRGB= <>
##$CPDPRGT= <>
##$D= (0..31)
0 1 0 0 0 0 0 0 0 0.06 0 0 0 0 0 0 0.0002 0 0 0 0 0 0 0 0 0 0 0 0 0 0 
0 
##$DATE= 1181562214
##$DBL= (0..7)
120 120 120 120 120 120 120 120 
##$DBP= (0..7)
150 150 150 150 150 150 150 150 
##$DBP07= 0
##$DBPNAM0= <>
##$DBPNAM1= <>
$$ [...]
##$SUBNAM7= <"">
##$SUBNAM8= <"">
##$SUBNAM9= <"">
##$SW= 20.6930455092707
##$SWIBOX= (0..15)
0 0 3 0 0 0 0 0 0 0 0 0 0 0 0 0 
##$SW_h= 5175.983436853
##$TD= 65536
##$TD0= 1
##$TE= 297.16
##$TE2= 300
##$TE3= 300
##$TEG= 300
##$TL= (0..7)
0 120 120 120 120 120 120 120 
##$TP= (0..7)
150 150 150 150 150 150 150 150 
##$TP07= 0
##$TPNAME0= <>
##$TPNAME1= <>
##$TPNAME2= <>
##$TPNAME3= <>
##$TPNAME4= <>
##$TPNAME5= <>
##$TPNAME6= <>
##$TPNAME7= <>
##$TPOAL= (0..7)
0.5 0.5 0.5 0.5 0.5 0.5 0.5 0.5 
##$TPOFFS= (0..7)
0 0 0 0 0 0 0 0 
##$TUNHIN= 0
##$TUNHOUT= 0
##$TUNXOUT= 0
##$USERA1= <user>
##$USERA2= <user>
##$USERA3= <user>
##$USERA4= <user>
##$USERA5= <user>
##$V9= 5
##$VALIST= <valist>
##$VCLIST= <CCCCCCCCCCCCCCC>
##$VD= 0
##$VDLIST= <DDDDDDDDDDDDDDD>
##$VPLIST= <PPPPPPPPPPPPPPP>
##$VTLIST= <TTTTTTTTTTTTTTT>
##$WBST= 1024
##$WBSW= 4
##$XGAIN= (0..3)
0 0 0 0 
##$XL= 0
##$YL= 0
##$YMAX_a= 305207
##$YMIN_a= -230400
##$ZGOPTNS= <>
##$ZL1= 120
##$ZL2= 120
##$ZL3= 120
##$ZL4= 120
##$ABSF1= 16.522
##$ABSF2= -4.171173
##$ABSG= 5
##$ABSL= 3
##$ALPHA= 0
##$AQORDER= 0
##$ASSFAC= 0
##$ASSFACI= 0
##$ASSFACX= 0
##$ASSWID= 0
##$AUNMP= <proc_1d>
##$AZFE= 0.1
##$AZFW= 0.1
##$BCFW= 0
##$BC_mod= 0
##$BYTORDP= 0
##$COROFFS= 0
##$CY= 12.5
##$DATMOD= 1
##$DC= 0
##$DFILT= <>
##$DTYPP= 0
##$F1P= 14.0000005364418
##$F2P= -0.99999901652339
##$FCOR= 0.5
##$FTSIZE= 32768
##$FT_mod= 6
##$GAMMA= 0
##$GB= 0
##$INTBC= 1
##$INTSCL= 1
##$ISEN= 128
##$LB= 0.3
##$LEV0= 0
##$LPBIN= 0
##$MAXI= 10000
##$MC2= 0
##$MEAN= 0
##$ME_mod= 0
##$MI= 0
##$NCOEF= 0
##$NC_proc= -5
##$NLEV= 6
##$NOISF1= 0
##$NOISF2= 0
##$NSP= 0
##$NTH_PI= 0
##$NZP= 0
##$OFFSET= 16.522
##$PC= 1
##$PHC0= -49.53637
##$PHC1= 6.254921
##$PH_mod= 1
##$PKNL= yes
##$PPARMOD= 0
##$PSCAL= 4
##$PSIGN= 0
##$REVERSE= no
##$SF= 250.13
##$SI= 32768
##$SIGF1= 0
##$SIGF2= 0
##$SINO= 400
##$SIOLD= 32768
##$SREGLST= <1H.CDCl3>
##$SSB= 0
##$STSI= 32768
##$STSR= 0
##$SW_p= 5175.98343685301
##$SYMM= 0
##$S_DEV= 0
##$TDeff= 65536
##$TDoff= 0
##$TI= <Analysis number 999999
Compound Code 99
Book Reference 9
Project Code 9>
##$TILT= no
##$TM1= 0
##$TM2= 0
##$TOPLEV= 0
##$USERP1= <user>
##$USERP2= <user>
##$USERP3= <user>
##$USERP4= <user>
##$USERP5= <user>
##$WDW= 1
##$XDIM= 32768
##$YMAX_p= 384986240
##$YMIN_p= -670393
$$ End of Bruker specific parameters
$$ ---------------------------------
##NTUPLES= NMR SPECTRUM
##VAR_NAME=  FREQUENCY,     SPECTRUM/REAL,   SPECTRUM/IMAG
##SYMBOL=    X,             R,               I
##VAR_TYPE=  INDEPENDENT,   DEPENDENT,       DEPENDENT
##VAR_FORM=  AFFN,          ASDF,            ASDF
##VAR_DIM=   32768,         32768,           32768
##UNITS=     HZ,            ARBITRARY UNITS, ARBITRARY UNITS
##FACTOR=    0.157963299565203, 1,           1
##FIRST=     4132.6476996994, 0,             0
##LAST=      -1043.33573715361, 0,           0
##MIN=       -1043.33573715361, -670393,     0
##MAX=       4132.6476996994, 384986240,     0
$$ Real data points
##PAGE= N=1
##DATA TABLE= (X++(R..R)), XYDATA
$$ [...]
23211h237M3138M8973R6032r3263l19938R114K34910J04168j23133p3978J59577
23200G7363K7034j60365r0117j49521J3808P5317J9372J44199L02665J58459k30558
23189A87656j51358r3353O4066M5015K19971j17637k10728n017O7297q1505k4297
23178i9890l6316O9795K6874Q771k9081M4914K0602k5787J13294J14691j50466
23167E7401q4922j432k7970K5791N5428J65819R2409M9386k4889L7125j46778
23156A97368r124K1075p1662j91096m5489J07036o6013O91O4835J49345L9081
23145A96047l9218j85788l8649J54305o7160M3905m2977L5160N0917p6273K6324
23134E6593k8417l4540N2042N1591j4442k91600j17339k4771j21214L8126m0746
$$ plain form
23211 -8237 34901 83874 179906 86643 -233295 -224181 10729 114897 -8236 -82214 77363
23200 77363 104397 -55968 -146085 -295606 -281798 -206481 -187109 -42910 259755 418214 187656
23189 187656 36298 -57055 7011 52026 271997 154360 -56368 -61385 5912 -75593 -99890
23178 -99890 -136206 -66411 -39537 -30766 -59847 -14933 5669 -20118 93176 207867 57401
23167 57401 -27521 -28953 -56923 -31132 24296 190115 282524 331910 307021 344146 197368
23156 197368 188244 209319 137657 -53439 -98928 8108 -57905 -57214 7621 156966 196047
23145 196047 156829 -28959 -67608 86697 19537 63442 20465 55625 106542 30269 56593
23134 56593 28176 -6364 45678 97269 82827 -208773 -326112 -350883 -472097 -433971 -474717
23123d74717k6398k5708N2756l9169N5577J24060J05259Q5719r6072J4007K5322
23112a99364p6789P1474N3077k2464p083J8429N280M2240Q9311N1342j80686q5640
23100b40873P7546J01575m0776J19367j7703l22836j9721n2466J2878K7155K06728
23089a49126J54072J09064j93940r1815J12161J55797l5543k47006n7705J35694
23079a08347M4465L4378k3345r5882K5796P696Q058J17535K3393J66J8299J36865
23067A89077O4967l8983o2847m2645L5176j62370j37198r598J23208J20827k4373
23056E5241q2561M2574p5167o6586R9917K0009j73327q8004J16994M9435o3525
23045a65000J53579K63998J20846q8170j18335n3723r2208j76435J18799J68628
$$ plain form
23123 -474717 -501115 -526823 -474067 -513236 -457659 -333599 -228340 -142621 -238693 -224686 -199364
23112 -199364 -276153 -204679 -151602 -174066 -181149 -162720 -157440 -115200 -25889 25453 -155233 -240873
23100 -240873 -163327 -61752 -102528 16839 -864 -323700 -343421 -395887 -383009 -355854 -149126
23089 -149126 4946 114010 -79930 -171745 -59584 96213 60670 -186336 -244041 -108347
23079 -108347 -63882 -29504 -52849 -148731 -122935 -115239 -107181 10354 33747 33913 52212 189077
23067 189077 254044 215061 152214 109569 144745 -17625 -154823 -164421 -41213 79614 55241
23056 55241 -27320 15254 -59913 -126499 -26582 -6573 -179900 -267904 -150910 -101475 -165000
23045 -165000 -11421 252577 373423 285253 166918 113195 20987 -155448 -36649 131979
23035A31979j14940R1921j2024o0448P2403K8240r2338j88072M7082M4784p1434
23024a22847j24959R8475J41274k3943p0593M5537M4918Q2658k2749j55395p1821
23013a79445Q3119p8079r9240N7170L02547q2692l0762J0611O362J63848J37827
23002B91266m2711k10513r0289K1871j8776j11275P9197J88143j48862n1871P9080
22991a4740J19711L2815r9990P2968J6509M8956j38384j87512j18419J4495J36845
22980a16746M7762N5777n065J0667n1721p0857J31547k8948l7768j30992j456
22969a97800j1431P6774Q8026L0471J9319l6380q3163M588k5722M8349j3993O504
22957i4458o6401K0769Q115L8322p2435J0254l4557r1032o4833P2989K39371R644
$$ plain form
23035 131979 17039 108960 96936 36488 108891 137131 44793 -143279 -96197 -51413 -122847
23024 -122847 -247806 -149331 -8057 -32000 -102593 -57056 -12138 70520 47771 -107624 -179445
23013 -179445 -96326 -174405 -273645 -216475 86072 3380 -27382 -16771 -10409 153439 291266
23002 291266 248555 38042 -52247 -30376 -49152 -160427 -81230 106913 -41949 -93820 -14740
22991 -14740 104971 137786 37796 110764 127273 176229 37845 -149667 -268086 -253591 -116746
22980 -116746 -68984 -13207 -18272 -7605 -59326 -130183 1364 -27584 -65352 -196344 -197800
22969 -197800 -209231 -132457 -44431 -13960 5359 -31021 -114184 -109596 -135318 -86969 -100962 -94458
22957 -94458 -160859 -140090 -131975 -93653 -166088 -155834 -190391 -281423 -346256 -273267 -33896 -24252
22945b4252j0167j2255L7346J07664P5352j39003q3365j5843j3994O9370q51J01288
22933I1290J4308O740j47007Q171J14368n4504N8486o7704p7212P6169q2031k7221
22921h6147p5823K2671K8649l9994L0439J18547m7876p9112q5207L5288Q0567
22910i7998P7333J30781N5993j20762l1213m8383R3497j83028P047N0739R8050
22899C2056K00067l2526j54410j30648k3530J51203O6954k3738N4134J19586K27295
22888D86443l971k01418j17460K266k7853m9358p7538K5935L5655j12811p1437
22877a11547K817L3139K0756n8381J5174j5393Q1747R2175P9752O7894j94538
22866A3595k48744q590P1825l3429Q2826J89793P0880j06967n1024o0709j25920
$$ plain form
22945 -24252 -34419 -46674 -9328 98336 173688 34685 -48680 -64523 -78517 -9147 -9998 91290
22933 91290 105598 112338 -34669 -26498 87870 33366 91852 24148 -53064 23105 -58926 -86147
22921 -86147 -161970 -139299 -110650 -150644 -120205 -1658 -49534 -128646 -213853 -178565 -97998
22910 -97998 -20665 110116 166109 45347 14134 -34249 59248 -123780 -116733 -65994 32056
22899 32056 232123 199597 45187 -85461 -108991 42212 109166 85428 139562 259148 486443
22888 486443 482472 281054 163594 165860 138007 88649 11111 37046 72701 -40110 -111547
22877 -111547 -108730 -75591 -54835 -113216 -98042 -113435 -31688 60487 140239 208133 13595
22866 13595 -235149 -243739 -171914 -205343 -122517 67276 138156 31189 -19835 -80544 -206464
22855b06464O1631M3564R3673J47557m5906n8008n7589m4393j49K5966j3357L7992
22843a5483N0890J12519R200J13620M7546k04870j20839J46736n6428j91420l1451
22832a39980J36214Q8372j2339L9340m8122o161j23902o4826J34351l2347n5972
22821h5372j6419J60178l30q6073j00862r728K26883j03596K9979o9217J06852
22810E2295o3958j31952J00954J6781k36046j82724J15145J35229J81836O0015
22800D7575J11301P7936j74353J4659L9904j27610j54816P77p7657r9519j07123
22789d48926J08619J35425R4587J5673j1859J17046k4710p3098P9845M6680j23868
22778h4586M8212j0568n6274j5825j73737P4986J83600J24674J98486M9358j68071
$$ plain form
22855 -206464 -144833 -101269 -7596 139961 94055 36047 -21542 -65935 -66084 -40118 -53475 -15483
22843 -15483 35407 147926 157126 270746 318292 113422 -7417 139319 82891 -108529 -139980
22832 -139980 -3766 84606 72267 111607 63485 57324 -66578 -131404 2947 -29400 -85372
22821 -85372 -101791 58387 58057 -28016 -128878 -138606 88277 -15319 14660 -54557 52295
22810 52295 -11663 -143615 -42661 -25880 -261926 -444650 -329505 -194276 -12440 47575
22800 47575 158876 236812 62459 77118 117022 -10588 -165404 -164627 -242284 -341803 -448926
22789 -448926 -340307 -204882 -110295 -94622 -106481 10565 -14145 -87243 -7398 39282 -84586
22778 -84586 -36374 -46942 -103216 -119041 -292778 -217792 -34192 90482 288968 338326 170255
22767A70255j44368j2241p6971K7426K24874Q1202n0150M1095k28765k5214K1925
22756B9068k11153k55369K5203K30169K07889J15494N4507j4209j49745k13786
22746a81932j3758N7015J60362j7200J5897J60945L4350j6346J89807l8899q1060
22735B69181j75399N6857N8289p6653k9598o9932K486j50434q4225j61529Q0350
22724b80607J85079o3936k15344P211Q5718l996J3549k5368K9842j13749R9256
22713b82345p7912M096O8438J67132M8355k2691p1899j09169P0466l6515J42271
22702i9773K7506J02695J6167J16424Q0770j25892r9468n1752J9216R2110j7491
22691F0512j21396k0060j64678r1239J25961L06692o4972j77612Q8282J28957
$$ plain form
22767 170255 25887 13646 -63325 -35899 188975 270177 220027 261122 32357 7143 29068
22756 29068 -182085 -437454 -412251 -182082 25807 141301 195808 181599 31854 -181932
22746 -181932 -195690 -138675 21687 4487 20384 181329 215679 199333 389140 350241 269181
22735 269181 93782 150639 208928 132275 102677 32745 35231 -115203 -199428 -360957 -280607
22724 -280607 -95528 -159464 -374808 -367597 -281879 -285875 -272326 -297694 -267852 -381601 -282345
22713 -282345 -360257 -356161 -287723 -120591 -72236 -94927 -166826 -275995 -205529 -242044 -99773
22702 -99773 -72267 30428 46595 163019 243789 117897 18429 -33323 -14107 78003 60512
22691 60512 -60884 -80944 -245622 -336861 -210900 95792 30820 -146792 -58510 70447
22681G0447J2327j5711j87113O0477l0078P0277j912J66765K2564j2973j67082
22670a2012j9296M5938O0343l2775m0997J7654K6190K08061M2300p7660k52566
22659c4820j12030J06764n5176P2707J52298l5397J2349j67245K6218n6818O0006
22648c1144J19805P607k6021K4396J72746J86756r0634p3500P1565L2599j55819
22637B38356k34890M5921R3250j26844o2090P4003j77817L4986J14375R0659N5543
22626A45452j08989j32693J22442Q6540o6823Q8353J12064J76300j0589m4335
22616C67722o1519J10047o9701j18026q1752j48016J78485K351k92967k44614
22606c57990J58857L54929k3864j8453j55301j30155L1339P1802J25455j08896
$$ plain form
22681 70447 82774 67063 -120050 -59573 -89651 -19374 -21286 145479 168043 155070 -12012
22670 -12012 -31308 14630 74973 42198 1201 18855 45045 253106 295406 217746 -34820
22659 -34820 -146850 -40086 -95262 -22555 129743 94346 106695 -60550 -34332 -91150 -31144
22648 -31144 88661 96268 70247 94643 267389 454145 363511 290011 361576 394175 238356
22637 238356 3466 49387 142637 15793 -46297 27706 -150111 -115125 -750 89909 145452
22626 145452 36463 -96230 26212 112752 45929 134282 246346 422646 412057 367722
22616 367722 306203 416250 346549 228523 146771 -1245 177240 179591 -113376 -357990
22606 -357990 -199133 155796 131932 113479 -41822 -171977 -140638 -68836 56619 -52277
22596e2277k97513m7833K49034J69255l3764q5864J14583n6424k5867k368J4563
22585e4475R0930K8139j20767m6373j33076o0289J51468K34180J33193j2909n9765
22574A50256j1825j04787j30449P4832j03809P724J88895L4810K0001r0533m48
22563C4667J8481N990r6855j02127j6857J22635J13253m5224O302n5715L4499
22552A9049j796r8350n8631Q8494Q6877J1011J39436J58015n7558k3683Q1561
22541C44425m3181j48770J18512J73978P8932j37962j86445j21654j0792j11577
22531d4534j06780K9590l487P4176N6289p5957p704J19383j8506q793p6145L5104
22519b7364J47857j35869n6137N5173J04660L2383j82464J64102J18196k17891
$$ plain form
22596 -52277 -349790 -397623 -148589 20666 -13098 -98962 15621 -40803 -66670 -69038 -54475
22585 -54475 36455 64594 -56173 -102546 -235622 -295911 -144443 89737 222930 210021 150256
22574 150256 138431 33644 -96805 -21973 -125782 -118058 70837 105647 125648 35115 34667
22563 34667 53148 59138 -37717 -139844 -156701 -34066 79187 33963 40265 -15450 19049
22552 19049 17253 -81097 -139728 -51234 35643 46654 186090 344105 286547 262864 344425
22541 344425 301244 152474 270986 444964 523896 385934 199489 77835 67043 -44534
22531 -44534 -151314 -121724 -125211 -51035 5254 -70703 -78407 40976 22470 13677 -62468 -27364
22519 -27364 120493 -15376 -71513 -16340 88320 120703 -61761 102341 220537 2646
22509B646k03329l786K2777M8869p024j20788k7438R8013O1477J08402M8121j21183
22497i3243j37971n5507J26908J59374O3475O5481Q3276j02266P5888P457R0237
22486B83109J3578j20949J9282Q5374K52158N2033l0903j88541j46206j28862
22476I0073j41576p4768N6874Q0010j05089o1533K6723R8718J19913M8849L3135
22465A71329q4528q0910o0159j17443o7506j01471Q6800N6704J11738J14637J85797
22454B14988K41931m1978n7314j92923m5521j01482k53889J01606J81358O7112
22444A13888P8456Q8038j07559p4055K7779R0989j15797p9105j52206L919K99767
22433A74114O3267J8684J13018L7433j78817j24366k5863K2752K61815P1208k01665
$$ plain form
22509 2646 -200683 -204469 -181692 -132823 -139847 -260635 -288073 -190060 -128583 -20181 27940 -93243
22497 -93243 -231214 -286721 -159813 -439 63036 128517 211793 109527 185415 192872 283109
22486 283109 296687 175738 195020 280394 532552 584585 553682 365141 218935 90073
22476 90073 -51503 -126271 -69397 10613 -94476 -156009 -129286 -30568 89345 138194 171329
22465 171329 86801 5891 -54268 -171711 -239217 -340688 -253888 -197184 -85446 29191 214988
22454 214988 456919 414941 357627 164704 119183 17701 -236188 -134582 46776 113888
22444 113888 192344 280382 172823 98768 126547 217536 101739 22634 -129572 -125653 174114
22433 174114 237381 256065 369083 406516 227699 103333 77470 100222 362037 433245 231580
22422B31580j97276k7926m9676j7704N7564R0476K14746j8416J3680k22568n2175
22411B2305J5632M890J42061O3203j26928r9674p7748J4465O5726m3164J9206
22400b6q5228p8998k9860O2914O7841l2749j40518L5064J16165J52163Q4505j97541
22388d6268p0570m7026J4881L8995P5373l1358P1625L4203k36882q7171J6361
22377b67837J90906L7370l4676J53078Q300l1048k51906p6599N0651J34404O1674
22366b5683k6722J38646j41104M7192j09027l8220K66990Q9125j97961M6146J819
22355E1201j115J6711N790P684j15457k0021Q8606K5274p5623L9340J01467J27322
22343B51179j05267k38494j41462m0395M9152J35731N8186M2468n2244N116P2021
$$ plain form
22422 231580 34304 6378 -43298 -61002 -3438 87038 301784 283368 297048 74480 22305
22411 22305 37937 42827 184888 248091 121163 21489 -56259 -41794 23932 -19232 -26
22400 -26 -85254 -164252 -194112 -131198 -63357 -96106 -236624 -201560 -85395 66768 151273 -46268
22388 -46268 -116838 -163864 -148983 -109988 -34615 -65973 5652 39855 -197027 -284198 -267837
22377 -267837 -76931 -39561 -74237 78841 87141 56093 -195813 -272412 -221761 -87357 -25683
22366 -25683 -52405 86241 -54863 -7671 -116698 -154918 112072 201197 3236 49382 51201
22355 51201 50086 66797 72587 80271 -35186 -55207 33399 58673 -16950 22390 123857 251179
22343 251179 145912 -92582 -234044 -274439 -225287 -89556 -31370 11098 -41146 -36030 35991
22332C5991L5914q5875j61059M7375L7942J23462L1911j69198q3700J04885p633
22321h9985j5031L2134j9021p4852L6599J41078N2262l8778M8425o558Q0173r7871
22309D8575j41347J5424n3420m8428M9095J2791N4842o5265j28364N6461M0563
22298a59073J32648N4667q6808q8786N754O2328J24301J449P3287n9911j39668
22287g9812L9249M707k18856o2657O3906L64788R2586q0456j13330j69263J26641
22276c2497J80944j7084j7515L5929p7802j01793j67410P1797J7177J2322n0166
22265a46098N6116j3327J10377P8123n149l4715m5994J46081J23450O2746K8629
22254C60239j45280j41317J4022M5885J9529R2844k0953l70981q5050J57379J21545
$$ plain form
22332 35991 71905 -13970 -175029 -127654 -89712 33750 65661 -103537 -187237 -82352 -89985
22321 -89985 -105016 -72882 -91903 -166755 -130156 10922 63184 24406 72831 66273 146446 48575
22309 48575 -92772 -77348 -130768 -179196 -130101 -117310 -62468 -127733 -256097 -199636 -159073
22298 -159073 -26425 28242 -58566 -147352 -141598 -79270 45031 46480 119767 59856 -79812
22287 -79812 -40563 -35856 -254712 -317369 -253463 111325 203911 123455 10125 -159138 -32497
22276 -32497 148447 131363 113848 149777 71975 -29818 -197228 -125431 -108254 -95932 -146098
22265 -146098 -89982 -103309 7068 85191 80042 45327 -667 145414 268864 331610 360239
22254 360239 214959 73642 87664 133549 153078 245922 224969 -146012 -231062 -73683 47862
22243D7862p3718j3048p7905J7537k0298l4501N0764r4860J3171j1134M4587J43510
22231h033p9100Q6039O9303M1065j56424j80935J24087L3884l5931o7591j24444
22220b98080p8663K20301J98689Q8351r5512n4981J25029r2630j66502r1139o0672
22209c05809j46274q4178k5596N7227K13196M01465J19199K5454j33077J8964
22199A40571L5680K8079J44209k43000j57726k7319n0391P6959J68091n0972J9154
22188H3335j6221m3308n7836n3274o081J26186M0745j290M098j17294m5387j91193
22176b77520q686o4867J05940J6442p1605J25502j5933N017l2250J2804M5610
22165a59546o1354j02733J12578m935L91J45876K05059p2326j09123r8194L945
$$ plain form
22243 47862 -25856 -38904 -116809 -99272 -119570 -154071 -103307 -198167 -184996 -196130 -151543 -8033
22231 -8033 -87133 -1094 68209 109274 -47150 -228085 -103998 -70114 -106045 -173636 -298080
22220 -298080 -376743 -156442 42247 130598 35086 -19895 105134 12504 -153998 -245137 -305809
22209 -305809 -452083 -536261 -561857 -504630 -291434 110031 229230 254684 121607 140571
22199 140571 176251 204330 348539 105539 -52187 -79506 -129897 -52938 115153 64181 83335
22188 83335 67114 23806 -34030 -87304 -93385 32801 73546 72256 76354 -40940 -86327 -277520
22176 -277520 -286206 -351073 -245133 -228691 -300296 -174794 -190727 -185710 -217960 -205156 -159546
22165 -159546 -220900 -323633 -211055 -215990 -215599 -69723 135336 63010 -46113 -144307 -140362
22154a40362n9658j95803J80892K02771K8714K1074j5666L3764r7667J5185q8985
22143a15741Q040P6092R7450m7577m4320j32076r5290l7398J32826J06696m0357
22132i1655k7354J45302J93307l5649j10334j79387R0228J7514J58358J7703m3643
22121A34390p9795p1819r5108r534P4015M8440K6163M2595O4873J32853M1066
22110C08139j95501j88369l9425n7780R9327P129J04605J24717n0311j33814j25206
22099a46489M7552J59963J66972j21648j35809m2620J18771p5562j14802O6174
22089g7498m6565p7629k6970k191P0634l791J4532K8312O1147n3110L9314m4894
22077a18709K18999L25398J11641j93108j67414k8621p6850Q5876r0330n5607
$$ plain form
22154 -140362 -200020 -395823 -214931 -12160 16554 37628 21962 55726 -41941 -26756 -115741
22143 -115741 -107701 -31609 65841 18264 -26056 -158132 -253422 -290820 -157994 -51298 -91655
22132 -91655 -119009 26293 219600 183951 73617 -105770 -15542 1972 160330 178033 134390
22121 134390 54595 -17224 -112332 -121866 -47851 589 26752 69347 134220 267073 308139
22110 308139 112638 -75731 -115156 -172936 -73609 -66480 38125 162842 112531 -21283 -146489
22099 -146489 -98937 61026 227998 106350 -29459 -72079 46692 -28870 -143672 -77498
22089 -77498 -124063 -201692 -228662 -230853 -160219 -164010 -149478 -121166 -60019 -113129 -73815 -118709
22077 -118709 100290 425688 537329 344221 176807 148186 71336 157212 66882 11275
22067A1275q3527r2819L977M2668K05354R5173j3808q8053R7552j0074o4101M152
22055A07769L9313r6395p4420M8759o8415l1831k4579p487m3937J43714n8801
22044f6310j98393J61289K7455J55604K5830l060O674N0737Q2472j78608p6584
22033a2894m7329J38133P0200r8349J3355j19249J32915R656k11127o8818j10515
22022c04022j33654O3734L36359J84735o3762p5718P0916N7450J15261J11177
22012C62476m9537k83010j85298J07284J95754p7937p6006o2627O3513L995N4842
22001E3449P8l5823j24346j04902J16728J23216j9644p8183L1560L9223n651M2997
21989C8702k1488J0256J22089J12336L5936j89645j07660M1957j29617n9906m3573
$$ plain form
22067 11275 -72252 -165071 -161094 -118426 86928 182101 168293 80240 177792 167718 103617 107769
22055 107769 147082 50687 -23733 25026 -43389 -75220 -99799 -107286 -151223 -7509 -66310
22044 -66310 -264703 -103414 -75959 79645 105475 102415 109089 159826 242298 63690 -12894
22033 -12894 -60223 77910 148110 49761 63116 -56133 76782 86438 -124689 -193507 -304022
22022 -304022 -437676 -373942 -37583 147152 83390 7672 78588 136038 251299 362476
22012 362476 312939 29929 -155369 -48085 147669 69732 -6274 -68901 -5388 -1393 53449
22001 53449 53527 17704 -106642 -211544 -94816 28400 8756 -69427 -37867 1356 -4295 38702
21989 38702 17214 27470 149559 261895 297831 108186 526 42483 -87134 -147040 -190613
21978a90613O703J20079m5181j15621m6182K50403n0335k18222P7970K56465J0941
21967E6407j93597R526N6729L10831j9631j31751l555K2401j11908j48384j79233
21956c32165J25460J87927Q8669j42498p0385M3899j81426m3092R9948J10243
21946a13420q7L1989O702K2728j7021J48435N4255q4875k18606j13436k7519m2468
21934c53323J31872N4245J2283j41483l9947o4027j37188j32825J30161R110J04728
21923d26394K21640R780k0414J95661N7297j44957N2103P4685O9487p9859J8265
21912B7294J5420j32852j50812L5728l6826L7158N2207p8156O3121M6510o7308
21901a88516j0894n161J32156R6613K9976k2300N8443j33336K4882Q2874M7386
$$ plain form
21978 -190613 -183910 -63831 -109012 -224633 -270815 -20412 -70747 -288969 -210999 45466 56407
21967 56407 -137190 -127664 -70935 239896 220265 88514 84959 107360 -4548 -152932 -332165
21956 -332165 -206705 -18778 69891 -72607 -142992 -99093 -280519 -323611 -223663 -113420
21946 -113420 -113507 -81518 -74816 -52088 -69109 79326 133581 48706 -169900 -283336 -310855 -353323
21934 -353323 -221451 -167206 -154923 -296406 -336353 -400380 -537568 -670393 -540232 -531122 -426394
21923 -426394 -204754 -194974 -215388 -19727 37570 -107387 -55284 19401 88888 9029 27294
21912 27294 42714 -90138 -240950 -205222 -242048 -204890 -152683 -230839 -167718 -121208 -188516
21901 -188516 -199410 -204571 -72415 24198 54174 31874 90317 -43019 -18137 64737 112123
21890A12123j24413n925p0348o1595M2771R7655j14828j01301J0654l7033J47551
21879a04689j9305n6422j5389L3893J60916l1972j598k2861n8096J12928J9598
21868A7003M3518K8819k1540q1053J22959J34893j62003j15587q166j49415l7665
21857b28237J51664j7738K5328L0524n2222o7506K1895J45618J00498j22602N2409
21846C9631k558j31690M5992J27240O9885M2575n0070k20851j76150k36818J03637
21835c89177J41306j9253K01312L1916k05596p1751j3231J39380J68526N2711
21825C6143j53372j88243j2438K10286J78757l9714m5346k8856q3399J07922J62650
21814A44390m1649j18572r6081j03108r8148L43571K38563J09387j24309p364
$$ plain form
21890 112123 -12290 -18215 -88563 -150158 -107387 -9732 -124560 -225861 -215207 -252240 -104689
21879 -104689 -123994 -180416 -195805 -161912 -996 -32968 -34566 -57427 -115523 -2595 17003
21868 17003 60521 89340 67800 -13253 109706 244599 82596 -32991 -41157 -190572 -228237
21857 -228237 -76573 -94311 -68983 -38459 -90681 -158187 -136292 9326 109824 -12778 39631
21846 39631 37073 -94617 -48625 78615 148500 191075 141005 -79846 -255996 -492814 -389177
21835 -389177 -247871 -267124 -65812 -33896 -239492 -311243 -324474 -185094 -16568 36143
21825 36143 -117229 -305472 -317910 -107624 71133 31419 -13927 -42783 -126182 -18260 144390
21814 144390 102741 -15831 -111912 -215020 -313168 30403 268966 378353 254044 246680
21804B46680p1668j04254j4294J7045p6228j979j8038J0681o6896K6109j9303
21793g2145O4480O7759o0512K3748l9007r8318L2434L299j20713Q0156J1393p049
21781a14475K9019J49399P7829J56016o0068k22366o9004M010M3820j00997N2903
21770e3914M8207n0482N5601M0049n380j04125o0826j6850L6258q9782J58220
21759d3024Q7352N5067J12820o7493n1728j81190r5738j7269O6356O6730J5387
21748e2730Q9163P4220k317p1286q4346K4569K4301q0490P0346Q9317O8677j58545
21736i121j86601j22066O1163Q6799K3697L1581j39197j10676l7382j1844K17239
21725a96408j1337j47094O2841K83287J43229j31919O303J286P4516K9282k8167
$$ plain form
21804 246680 175012 70758 56464 73509 -2719 -4698 -22736 -12055 -78951 -52842 -72145
21793 -72145 -7665 60094 -418 23330 -15677 -113995 -81561 -78262 -198975 -118819 -107426 -114475
21781 -114475 -85456 63943 141772 297788 237720 15354 -53650 -49640 -5820 -106817 -53914
21770 -53914 -5707 -56189 -588 39461 34081 -70044 -130870 -147720 -111462 -201244 -43024
21759 -43024 44328 99395 212215 144722 92994 -88196 -183934 -201203 -134847 -68117 -52730
21748 -52730 36433 110653 108336 37050 -47296 -22727 1574 -78916 -8570 80747 149424 -9121
21736 -9121 -195722 -317788 -256625 -169826 -146129 -114548 -253745 -364421 -401803 -413647 -196408
21725 -196408 -207745 -354839 -291998 -8711 134518 2599 8902 10188 84704 113986 85819
21714H5819k0357J06693j8982k4891M66Q1696l7249P2973p1687k48234r1064J65841
21702A024l4302k3759m7639l1646l4920P4965l1486J9898Q3009m220j24669Q157
21690a45588j17929N4130P6115J99145K30835q2469r8528K6044r2825K9930N5931
21679A34791N9647N3053p5532k42371j75330l2683P6987K94905P3377K7018M6241
21668B40103P4180j09232j85537P590J06708K1425P4270j33746n3598O7433j29750
21657b0154j11490Q5109J18189j28802L5745r885p94o9022P0220Q8376p1575Q505
21645e578k9309j07709n1607Q5822J13236n1418j07881n5413M6738J4204j8165
21634a67080n1272R6629K15265K14428l01390j45247L3490p2833n7976R4100N1512
$$ plain form
21714 85819 65462 172155 153173 128282 128748 210444 173195 246168 174481 -73753 -164817 1024
21702 1024 -33278 -57037 -104676 -136322 -171242 -96277 -127763 -107865 -24856 -29076 -153745 -145588
21690 -145588 -263517 -209387 -133272 65873 296708 214239 115711 141755 48930 78860 134791
21679 134791 194438 247491 171959 -70412 -245742 -278425 -201438 93467 166844 193862 240103
21668 240103 314283 205051 19514 27104 133812 155237 229507 95761 42163 109596 -20154
21657 -20154 -131644 -46535 71654 -57148 -21403 -31288 -32082 -101104 -30884 57492 -14083 -5578
21645 -5578 -34887 -142596 -194203 -108381 4855 -46563 -154444 -209857 -163119 -148915 -167080
21634 -167080 -218352 -121723 93542 307970 6580 -138667 -105177 -178010 -235986 -141886 -90374
21623i0374o1326j51212J48745J64374n0029l5095J8872l2611N7816L7325J83519
21612A90004l9744k6485n9943j40895j27109n096L36174J16442r1220j28224J37286
21601A61190K4896j32718j57717n6829l5707O8519J02477j05459L9620J00466
21591H738R457n1444j559P272J30116L3573m1308J13694N0481j41123k04568j05010
21579a91681l8281j2704L2024L3044j01938J15519J47661L7136O6308j82530j03211
21568a98653k2181K8134J0648Q316N8346O4300k6646K1502M6966l7177l6062j01754
21556a84261L0693J60876n7096J11331J13855j12367N1692k2171P0486q2203j15269
21545c4434Q6756J02984J272r6399k38301J05595J92071L778j29791r8296j1678
$$ plain form
21623 -90374 -151700 -302912 -154167 10207 -39822 -74917 -56045 -88656 -30840 6485 190004
21612 190004 150260 123775 63832 -77063 -204172 -209268 126906 243348 152128 23904 161190
21601 161190 186086 53368 -104349 -161178 -196885 -128366 -25889 -131348 -91728 8738
21591 8738 18195 -33249 -34808 -27536 102580 136153 94845 208539 259020 117897 -86671 -191681
21579 -191681 -229962 -242666 -210642 -177598 -279536 -164017 -16356 20780 87088 -95442 -198653
21568 -198653 -220834 -192700 -182052 -173736 -115390 -51090 -77736 -56234 -9268 -46445 -82507 -184261
21556 -184261 -153568 7308 -49788 61543 175398 63031 114723 92552 163038 80835 -34434
21545 -34434 52322 155306 156578 60179 -178122 -72527 119544 123322 -6469 -104765 -116443
21534a16443m8894J5926J20853J08456O1215n7477m399K696k4960R5229P6058
21523B28260j55959j02733O7168m8375r2309N7054P5439j33083j57171M9558J49998
21512f2153j1365j04587o3810n7018K6888R6259M6814j47018K2384j4542k05967
21501d74115O7637P2131J13402J9451L0864P9902o7467L8936J0210N3817P4452
21490A9220o1286l3640k358p2440N0099J64591R0154o0504O2242k09380k04739
21479b58041J0583J23594L326L3959K973O6226P3726n4511J49271P2744J08642
21468C32492o9279q9244n7402j39471p9818l5953k3500j20065Q8396q276L5914
21457a66206N8130j10542o0976J95104K2123J21375q2362j0627K12054N8771k62917
$$ plain form
21534 -116443 -165337 -149411 -28558 79898 141113 83636 79237 81933 56973 152202 228260
21523 228260 72301 -30432 36736 -11639 -103948 -46894 28545 -104538 -261709 -212151 -62153
21512 -62153 -73518 -178105 -241915 -298933 -272045 -175786 -128972 -275990 -253606 -268148 -474115
21501 -474115 -406478 -334347 -220945 -201494 -170630 -90728 -158195 -119259 -109049 -55232 19220
21490 19220 -42066 -75706 -78064 -150504 -100405 64186 154340 93836 156078 -53302 -258041
21479 -258041 -247458 -123864 -120538 -86579 -83606 -17380 56346 1835 151106 223850 332492
21468 332492 263213 173969 116567 -22904 -102722 -138675 -162175 -282240 -193844 -202120 -166206
21457 -166206 -108076 -218618 -279594 -84490 -62367 59008 -23354 -33981 178073 236844 -26073
21446b6073j91782j7487R2474n853j63688n2270J90094K20377K8348q9710m0795
21435e6365P1510J4980j73860k30342r5006J11602j58857l9734J15871J91118
21425b49083J61155J02809j14191j16272J43640j7000j23376N7104P6182J16914
21415C7882q7158k0685M3134p0733m803R8415j10509o0637r902R625P1091L0626
21403g3654J9955m9619P9819J90283p6794j37705K6648q3089j9859j7981K04537
21392F2541J89029j91326J6590M9605j09106J26746L0393k18028r077R6601n9408
21381a5440K9007J32417q102j6551l8818j24995j65777R8033Q2610o0333q0R8902
21369A0873K525q4744J51973J16958o4186j52801O7668J95510K94906J04333k11439
$$ plain form
21446 -26073 -217855 -235342 -142868 -148721 -312409 -364679 -174585 45792 74140 -15570 -56365
21435 -56365 15145 30125 -143735 -374077 -469083 -357481 -516338 -556072 -440201 -249083
21425 -249083 -87928 14881 -99310 -215582 -71942 -88942 -212318 -155214 -79032 37882
21415 37882 -49276 -69961 -26827 -97560 -102363 -3948 -114457 -175094 -184996 -175371 -104280 -73654
21403 -73654 -53699 -103318 -23499 166784 89990 -47715 -21067 -104156 -124015 -141996 62541
21392 62541 251570 60244 76834 126439 17333 144079 174472 -43556 -52633 43968 -15440
21381 -15440 13567 145984 137882 121331 82513 -42482 -208259 -110226 -27616 -87949 -88029 10873
21369 10873 13398 -71346 80627 197585 133399 -19402 48266 243776 538682 643015 431576
21358D31576n5873o1005K8971j10723J60N3278K886R5366J08583P7510o5863J7324
21346E22190j0877r7744L8096R4064p6823L6683J34256k2995k09557l6029J12341
21335D83605l0059j33554j37301r5928L6800m4278L996L6163L359m6723r6261
21324b0181N7346J36604J39048j4271m8651j88054m9154j22543k1976P3400L5751
21313b2681M4397j3675N597M5581q1594j10181M0741O6349o1310K130N580O3875
21301a5191P7853j06521j77610n0127M6420K06766m1058m4P8936J4564J79517
21290B13505k4333j77865k55472L3405r910R5522j45770j55283Q8247J18380J92595
21279b6979J43230J0516n7642r1367n7444j03962K940K896j11722p1444j1652
$$ plain form
21358 431576 375703 314698 343669 232946 233106 286384 289270 384636 493219 570729 504866 522190
21346 522190 511313 413569 451665 545729 468906 505589 639845 616850 407293 371264 483605
21335 483605 453546 319992 182691 86763 123563 79285 83281 119444 122803 76080 -20181
21324 -20181 37165 173769 312817 298546 249895 61841 12687 -109856 -131832 -58432 -22681
21313 -22681 21716 8041 13638 59219 -22375 -132556 -91815 -25466 -86776 -84646 -79066 -15191
21301 -15191 62662 -43859 -221469 -271596 -225176 -18410 -59468 -59512 19424 33988 213505
21290 213505 189172 11307 -244165 -210760 -220670 -125148 -270918 -426201 -337954 -219574 -26979
21279 -26979 116251 126767 69125 -22242 -79686 -183648 -180708 -177812 -289534 -360978 -372630
21268c72630J36190M6071K06121J55397J26863n0453r5626n1238o5979j06635
21258g1919n4387l6664L526Q4364q2657k04578J8162Q9688J67921K6080J14191
21247E3727K8780k0954q8392l6178R803O3928n437J68243N4518j33120j38431
21236d3513k23757q2126L6857j817J14991R3735p0675j15689l9159J03791J5065
21225b12297n5420J23449J6418N1023R0161Q1161R686O317K0619K8931r6902j40988
21213g7842N1211J40701k2108K2731j2481j16304j2060j04542K4229K72673n1620
21202A14588l1157r1408L2256R9618o3810n4870j19019p0217q9688J8232J65262
21191i0213J72589N1251J05578q6816l1396M2767j43567p8200p8589k5913Q4913
$$ plain form
21268 -372630 -236440 -190369 15752 171149 298012 247559 151933 100695 34716 -71919
21258 -71919 -126306 -162970 -159444 -75080 -157737 -362315 -344153 -254465 -86544 -60464 53727
21247 53727 82507 61553 -26839 -63017 -53214 10714 5277 173520 228038 94918 -43513
21236 -43513 -267270 -349396 -312539 -314356 -199365 -105630 -176305 -291994 -331153 -227362 -212297
21225 -212297 -267717 -144268 -127850 -76827 13334 94495 104181 110498 131117 160048 63146 -77842
21213 -77842 -26631 114070 91962 114693 102212 -14092 -26152 -130694 -106465 166208 114588
21202 114588 83431 -7977 24279 123897 60087 5217 -113802 -184019 -273707 -255475 -90213
21191 -90213 82376 133627 239205 152389 120993 163760 20193 -58007 -136596 -162509 -77596
21180g7596p4066Q3728O4502J57508L4664j01542o016J36833q5031o6790j5747
21169E0447j7607r4004q3148j7266l2424m188Q1342J04298J32831J9485q0001
21158E9765j20352M7301J6758L3058k0001J17080J8118o9185r9222m321J39292
21147A18291L9097j19065O8457J51700j00893o8388j03077j06956N4329o6731
21137a33236j36829L8101K8128M2288L4924J446m4679j06621L316J06213l8405
21126b05354k1155k9777P6892L7142k8998K20175K8193j32440p0992K563r5685
21115b19436m2090L6673j86789L2177P3350J26394K96923K20899l3632j30306
21105A74163j00363R483q1313j33500p8294L6340J14343M0423M3564J71697L8294
$$ plain form
21180 -77596 -151662 -67934 -3432 154076 188740 87198 81182 218015 132984 66194 50447
21169 50447 32840 -61164 -144312 -161578 -194002 -198190 -116848 -12550 120281 139766 59765
21158 59765 -60587 -13286 3472 36530 16529 133609 151727 82542 -16680 -21001 118291
21147 118291 157388 38323 106780 258480 157587 89199 -13878 -120834 -66505 -133236
21137 -133236 -270065 -231964 -203836 -161548 -126624 -125178 -169857 -276478 -273162 -166949 -205354
21126 -205354 -226509 -256286 -179394 -142252 -171250 48925 77118 -55322 -126314 -123751 -219436
21115 -219436 -261526 -224853 -411642 -379465 -306115 -179721 117202 338101 304469 174163
21105 174163 73800 83283 1970 -131530 -209824 -173484 -59141 -18718 24846 196543 234837
21094B34837J0474L6564j19399J4806j37946j9500n7211j47369J37759Q0657j22453
21083h8781N2009L7022o0990n8453K6769L8767q3037J54522M4334j22458k6163
21072h6459K06254M1686j30177k46728m4376J49680J7718q112R8867N3191Q2931
21061A34475j07080j30011L0323j5778k15613o3555M6007R7742L46506J30500
21051B53516j68989m5038o970j23806j5516J86257K18176m7166m1259m2726m6267
21040A20212K4633j35282k6999p5618p6602J13547O7348J78355j97652r5793K1660
21029h2191K9947Q7539q2967O1016K28094L2754k1705O2536L7004l3541P1892
21018C90378k2536r9533j82195p4131J3114k2245j32j01640k9845L3576K68880
$$ plain form
21094 234837 245311 281875 162476 177282 39336 19836 -37375 -184744 -46985 33672 -88781
21083 -88781 -36772 250 -60740 -119193 -92424 -53657 -136694 17828 62162 -60296 -86459
21072 -86459 119795 161481 31304 -215424 -259800 -110120 -92402 -100514 -1647 51544 134475
21061 134475 27395 -102616 -72293 -88071 -303684 -367239 -321232 -223490 123016 253516
21051 253516 84527 39489 32519 -91287 -106803 79454 297630 250464 209205 166479 120212
21040 120212 144845 9563 -17436 -93054 -169656 -56109 11239 189594 -8058 -103851 -82191
21029 -82191 -52244 35295 -47672 13344 241438 274192 252487 315023 352027 318486 390378
21018 390378 367842 268309 86114 11983 25097 2852 2720 -98920 -128765 -95189 173691
21007A73691K5286m8446k41666m7178J11686m754J57337O1639l1856q5375j33561
20996f3197O916K283K7539j13454O2857Q2426n4712J7681J45430Q0200J80968
20985C74937r6517k02269k7534m2770P6090M4350l02604l3918n1981m1473J55110
20974a48579K26690N5815L3172N5508o2587o5419o1982r3646q7020j0328l119
20963a61495J15561J5453k1182K40427r8920q6852J41008M9433j00874L6139J50899
20952B79597J7557j22518o928M9407m0333j38991J07071J48188J03468P7374p8636
20941C95256n1370p2712j93605k40307P7889J10155o6110j20901M2166J10944
20931h595k7220j91335k7592J5328J45591K68328J14463m3929j56747P9872j55224
$$ plain form
21007 173691 198977 150531 -91135 -138313 -26627 -31381 125956 187595 155739 70364 -63197
20996 -63197 -56281 -53998 -26459 -139913 -77056 5370 -49342 -31661 113769 193969 374937
20985 374937 278420 76151 48617 5847 81937 126287 -176317 -210235 -262216 -303689 -148579
20974 -148579 78111 133926 167098 222606 160019 94600 32618 -61028 -148048 -158376 -161495
20963 -161495 -45934 -30481 -51663 188764 89844 2992 144000 193433 92559 128698 279597
20952 279597 297154 174636 167708 217115 176782 37791 144862 293050 396518 473892 395256
20941 395256 343886 271174 77569 -162738 -84849 25306 -40804 -161705 -119539 -8595
20931 -8595 -35815 -227150 -254742 -239414 -93823 174505 288968 245039 88292 168164 12940
20920A2940M9486j51691R2222K65010J72581j38819k86308q8594P5730O5756j02092
20909c3779J2524K45435O3638J5783J3795O3087J0499N3589l7506j40749j3345
20898B52971J72692J9906j69695q4670q7481p17O0418J43294Q2827l8290m1567
20887C09688K8138K781m6769j02946k19619o4368K0915J61543O6376J07747l320
20876B60166j78722k84275J05971J28686J71932J88859O9735n2837j64469j57166
20866H7880R5868L3864l9958J4280p763j40158J28848J75328l7485J34111M9993
20855D94808j52885j68219R5357O5429L0517O9405P0313m4254J9392n8095j91360
20844B30408l1409K7833J55049J34344J20767K6178O9229q3005j22705o8047M104
$$ plain form
20920 12940 62426 -89265 2957 267967 440548 301729 15421 -73173 2557 68313 -33779
20909 -33779 -21255 224180 287818 303601 317396 380483 390982 444571 407065 266316 252971
20898 252971 425663 445569 275874 191204 103723 103006 163424 306718 389545 351255 309688
20887 309688 337826 340607 293838 190892 -28727 -93095 -72180 89363 155739 263486 260166
20876 260166 81444 -202831 -96860 31826 203758 392617 462352 409515 245046 87880
20866 87880 183748 217612 177654 191934 184171 44013 172861 348189 310704 444815 494808
20855 494808 341923 173704 269061 334490 365007 434412 504725 460471 479863 421768 230408
20844 230408 198999 226832 381881 516225 636992 663170 732399 649394 526689 458642 462746
20833D62746K1980K6666J0206K6964O7307J7919J24154j9866J5068J09141J638
20822H63923O6236L19129j31322q4892K09568J33031l9626l846K27163K15569
20812A774933p3966j04508J3609N3646K74345M25038K82540J55857J46989Q1522
20802C030005K07816K04082J71338K59307K99791K30627J31135N73268O07987
20793E715356P48767Q71956R32857J445924J896997K620447L556843M569197M597674
20784B6956018M070474M618641O857890R840086J1053377P554885K399263J686860
20776G5037494N386363J0149224J0240348K909338l411270l375265J56645L048565
20768A00141442K588775j45047j91258J883467K42723l359503l925768l36842
$$ plain form
20833 462746 484726 511392 521598 548562 615869 633788 757942 738076 753144 862285 863923
20822 863923 930159 1249288 1117966 1033074 1242642 1375673 1336047 1332201 1559364 1774933
20812 1774933 1700967 1596459 1610068 1663714 1938059 2363097 2645637 2801494 2948483 3030005
20802 3030005 3237821 3441903 3613241 3872548 4172339 4402966 4534101 5107369 5715356
20793 5715356 6464123 7336079 8268936 9714860 11611857 14232304 17789147 22358344 26956018
20784 26956018 31026492 35645133 42503023 52343109 63396486 70951371 73350634 75037494
20776 75037494 80423857 90573081 100813429 103722767 100311497 96936232 97092877 100141442
20768 100141442 102730217 102585170 102393912 104277379 104520102 101160599 97234831 96897989
20760I6897989M677991M923718k454037r764140j0224480n853738j991859k842734
20752G3368710p556499j0514679r721111p341982n348371m692168m523647m410424
20744A9259829l637795k840584k085116j579624j115660r15948p04510o35781
20736E744811m60459n29137l42310k52564j43207j50767k37819n14364k89410
20727B824774q6521q5420j48365j60629k20342j62369k05889j67878q3417P6308
20717A580252j40728k05377o3712p6762K8810q8194k02803M8076O060j16763j70049
20706E98810K0745R5022L4850j67551Q8705J92416L9544M5126q6935j61446j31800
20695E67486p5409q2194n6136j62659K7362p520j15261k4974N0720J97635P3323
$$ plain form
20760 96897989 101575980 106499698 104045661 94281521 84057041 78203303 76211444 73368710
20752 73368710 65812211 55297532 45576421 38234439 32886068 28193900 23670253 19259829
20744 19259829 15622034 12781450 10696334 9116710 8001050 7085102 6380592 5744811
20736 5744811 5284352 4755215 4412905 4160341 4017134 3866367 3628548 3114184 2824774
20727 2824774 2738253 2652833 2504468 2343839 2123497 1961128 1755239 1587361 1503944 1580252
20717 1580252 1439524 1234147 1170435 1093673 1122483 1034289 831486 879562 885622 768859 598810
20706 598810 619555 714577 749427 581876 670581 862997 902541 947667 860732 699286 567486
20695 567486 492077 409883 353747 191088 218450 210930 95669 70695 121415 319050 392373
20684C92373L5094j35108j36389J84000K40183j27329j63544k8133l0674Q9219
20674C19692J9219o7252k8863m2654J39029k3645j74459L8423L2336j50743J18454
20663A79537P2281P8292P5867j72202p7688q6513J2293j20235j5436L073k43295
20652b94026m3605K47491K01371J47601k1524p8549n7623q894j900R4772R0340
20641B75454q2659p6317p2995J88252M0628m8624J86978n1729k86361k21490m934
20630a53797K01986O8281m2312q8992k3920Q3741M3680O4561P7257k7735j867
20619B00883j56279j3631M5658j66643R450j27700J1963K94367o8525j71514K2230
20608a19741O289Q5008m792o3305l6883l4476J33644o44J89925M5336j6675r7335
$$ plain form
20684 392373 427467 292359 155970 339970 580153 452824 289280 261147 230473 319692
20674 319692 338911 271659 242796 200142 339171 315526 141067 179490 211826 61083 179537
20663 179537 251818 330110 405977 233775 156087 69574 81867 -38368 -53804 -50731 -294026
20652 -294026 -337631 -90140 111231 258832 237308 158759 101136 92242 90342 185114 275454
20641 275454 192795 116478 43483 231735 272363 223739 410717 358988 72627 -148863 -153797
20630 -153797 48189 116470 74158 -14834 -38754 44987 88667 153228 230485 202750 200883
20619 200883 44604 30973 76631 -90012 -80562 -208262 -196299 98068 29543 -141971 -119741
20608 -119741 -113452 -28444 -33236 -96541 -133424 -167900 -34256 -34900 155025 200361 183686 86351
20596H6351L7757M5502l8302l152J09091O1373j10593o1911Q7464m0022k3793
20585A49765O7693n9486j7245M9649k4715j74732j86771J01990J83699J13041
20575B02888J6885R409o1284j82674k28204p576J70289J94988J02850P5207M5521
20564C38299j83787j81534L5915k7380l5544P5071n649J22202L9460k13793l1664
20553f8404J45194n3763O8353K9323j90921p4355J74465r318j07975O2861K61395
20542B36855Q2915j61065j21145l4037R7441M6040j05653J10518J75319K5266
20532C52454j41699p7448o0644r1299n024j3612p5059L512J55885P8254j64435
20521c9115l3514M5601M3106R820j53703O4593L1688P7917l8963n4167J13913
$$ plain form
20596 86351 124108 169610 131308 128156 237247 298620 188027 126116 213580 173558 149765
20585 149765 217458 157972 140727 190376 165661 -9071 -195842 -93852 89847 202888
20575 202888 219773 229182 167898 -14776 -242980 -250556 -80267 114721 217571 292778 338299
20564 338299 154512 -27022 8893 -18487 -54031 21040 15391 137593 177053 -36740 -68404
20553 -68404 76790 23027 91380 120703 -70218 -144573 29892 20574 -87401 -24540 236855
20542 236855 319770 158705 37560 3523 100964 147004 41351 151869 327188 352454
20532 352454 210755 133307 72663 -18636 -23660 -37272 -112331 -108819 47066 125320 -39115
20521 -39115 -72629 -27028 16078 25898 -127805 -63212 -31524 46393 7430 -46737 67176
20510F7176R621r602p991n1231J1052P3818K16765j94608L9878N6154j32778p5961
20498B293j51415m8326J05775j1156m0651M527O5325K80289M6973j11564L2367
20487A74437R9479k30078r9193Q4287p8952j00411O8529O905K1484R2600J20002
20476A59089M0313r145q286k8200q2340n8214N2617J3072q8723p7461q4678J0609
20464a61347Q9349M9170O0562M5785k4410m3124l1930O3004K29027L210j05671
20453A73625k10901k40615j04545J03329K7067k1963K5688j5890M8117K5697m6167
20442b36558p1650n9304R3211K11243J1380m995J16732Q1922J3054j4899j32425
20431G711j73120j31668K5964L3853m3927J40699L1896M8842Q0492J05001K9617
$$ plain form
20510 67176 76797 67195 59204 7973 19025 92843 309608 115000 154878 211032 78254 2293
20498 2293 -149122 -197448 -91673 -102829 -143480 -138953 -73628 206661 253634 142070 174437
20487 174437 273916 43838 -55355 28932 -50020 -150431 -81902 -74997 -53513 39087 159089
20476 159089 199402 190257 181971 153771 71431 13217 65834 78906 -9817 -87278 -171956 -161347
20464 -161347 -71998 -22828 37734 83519 59109 15985 -15945 47059 276086 279296 173625
20453 173625 -37276 -277891 -382436 -279107 -252040 -274003 -248315 -264205 -216088 -190391 -236558
20442 -236558 -308208 -367512 -274301 -63058 -51678 -56673 60059 141981 155035 140136 7711
20431 7711 -165409 -297077 -271113 -237260 -281187 -140488 -108592 -59750 20742 125743 155360
20420A55360n2367j6740r6962o9313P9651l8485k03223P506P5560j47672M3369
20409b63316L15954J42812l23309j02795J7393J38108p030J80568J6073j671j17644
20398d857j12940K5295K4208j76411R7791J34858P8767L8338j37617n4439p7306
20387a64313M9171j83965K7755J21085R1426j34846J68412J75072j14158j30043
20377i4404j2514K516P84r1855O6822J41674l7615O2374K2130j53816k8963M5338
20365g7529p632j1018j10424o3963j7373J56001P9554k8160M0781L5731q8549
20354i2581p3055o1387J05864O4377J53176L3754R046o2397k12402o9128k8716
20343b33449J4871N2445K08300o2427j54507l6616J12586P4085k32419j13396
$$ plain form
20420 155360 102993 86253 -10709 -80022 -371 -38856 -242079 -234573 -159013 -306685 -263316
20409 -263316 52638 195450 -127859 -230654 -213261 -75153 -82183 98385 114458 112787 -4857
20398 -4857 -117797 -92502 -68294 -244705 -146914 -12056 66711 105049 -32568 -87007 -164313
20387 -164313 -115142 -299107 -271352 -150267 -58841 -193687 -25275 149797 35639 -94404
20377 -94404 -106918 -104402 -103618 -195473 -128651 13023 -24592 37782 59912 -93904 -122867 -77529
20365 -77529 -85161 -96179 -206603 -270566 -287939 -131938 -52384 -80544 -39763 -4032 -92581
20354 -92581 -165636 -227023 -121159 -56782 96394 130148 139194 76797 -135605 -204733 -233449
20343 -233449 -218578 -166133 42167 -20260 -174767 -211383 -98797 -24712 -257131 -370527
20333c70527M8357K66643J28828n3905j5863L5950K6768O2449j02022L1978L4643
20322I3299P3470j52172p3785K3896J41620j109q8713P1910J905j94398q2253
20311a86330o0601l5988J71330K53995q7353L1007N2590Q3029j14311r0452P7110
20300I4026j99140j71381k2489O9929Q4801J72625Q0459J33088M5670q350p5202
20289B04036J4894j3623j69592j58399N8894N9471j7719q928m9088k0123O7232
20278c2945R0652O7409K5120j34426q7923O1659p4615n7057J14260N7409q9729
20267f0186J0720k3106k368j27638J49738J66205j8887j21729L2623q5246m0338
20256a20212N3064M9153q811j20699N5316J30098R4265q6040n8653j88459j64047
$$ plain form
20333 -370527 -322170 -55527 73301 19396 3533 39483 66251 128700 26678 58656 93299
20322 93299 166769 14597 -59188 -35292 106328 105219 16506 88416 90321 -104077 -186330
20311 -186330 -246931 -282919 -111589 142406 55053 86060 138650 221679 107368 16916 94026
20300 94026 -105114 -276495 -298984 -229055 -144254 28371 108830 241918 287588 279238 204036
20289 204036 218930 205307 35715 -122684 -63790 -4319 -22038 -30966 -80054 -100177 -32945
20278 -32945 57707 125116 150236 15810 -72113 -10454 -85069 -142126 -27866 29543 -60186
20267 -60186 -49466 -72572 -74940 -202578 -52840 113365 94478 -27251 5372 -79874 -120212
20256 -120212 -67148 -17995 -26806 -147505 -92189 37909 132174 46134 -12519 -200978 -365025
20245c65025O5436J09690K98379m0457k38657J14855J25091K8657J4509j12838
20235c60K0143j10943j7104J20020K12927M312j64982K9413L8384j35142m8207
20224e1539m27L6975o9157o5622j42966J59441j53409N7021K1949M0427O5061
20213a02246j1732m2732n7770J32353j27799N5139R5Q9791Q9558J12974R7777
20202B35408J81672M3776j58661L341K37904N8475k51891k01564N5478L5535J77464
20191D16937K02929R6991J5170L6635k5470K5031Q6197O2830j50256o3501k32065
20180D71428j09621J31506J50381J64112o0230k502k70212k83865j63668j18500
20170i1171Q7329K0034p3769M1196J36588R1519o65j36866r883L232M5496p6243
$$ plain form
20245 -365025 -299589 -189899 108480 68023 -170634 -55779 69312 97969 112478 -360
20235 -360 19783 -91160 -108264 11756 224683 228995 64013 93426 131810 -3332 -51539
20224 -51539 -51966 -14991 -84148 -149770 -292736 -133295 -286704 -229683 -207734 -167307 -102246
20213 -102246 -113978 -156710 -214480 -82127 -209926 -154787 -154692 -64901 24657 137631 235408
20202 235408 417080 460856 302195 305536 543440 601915 350024 148460 203938 239473 416937
20191 416937 619866 716857 732027 768662 743192 768223 854420 917250 766994 703493 471428
20180 471428 361807 493313 643694 807806 747576 745074 474862 190997 27329 -91171
20170 -91171 -3842 16192 -57577 -16381 120207 211726 211061 74195 64312 67544 113040 36797
20158C6797l2574K5442Q6126K4110j11724J13966p4238N9304p6449l5474j7897
20147b611m5269k9500N7927K8557m422r2742j24045q5298k5447K40456o0535R4007
20135d8922J82939K7633k27969j18417m4988O6353J57510J05846j35148K2321
20125a2842k5683R024n2908K0677n4546p6826k7352J10322J91010n6544j87464
20114a63132n3686o1848K37987J43624j19063O6183n3713j28023r498L21771j7414
20103A63188N5096k0975j60373p0262l9393K5527L8564j53862J15813N3144n0395
20092d3928M0309R0492J23620k7450M5263O2964p1932l7861l3660j19157J63021
20081A91681k7540M5771j9428j01637j67948j62192n5261P230M4928K9139p2962
$$ plain form
20158 36797 4223 29665 115791 139901 28177 142143 67905 127209 50760 15286 -2611
20147 -2611 -47880 -77380 -19453 9104 4682 -88060 -212105 -297403 -322850 -82394 -142929 -48922
20135 -48922 134017 161650 -66319 -184736 -229724 -163371 -5861 99985 -35163 -12842
20125 -12842 -38525 -29501 -82409 -61732 -116278 -193104 -220456 -110134 80876 24332 -163132
20114 -163132 -216818 -278666 -40679 102945 -16118 50065 -3648 -131671 -141169 180602 163188
20103 163188 218284 197309 36936 -33326 -72719 -47192 -8628 -162490 -46677 6467 -43928
20092 -43928 -3619 86873 210493 183043 228306 291270 219338 181477 147817 28660 191681
20081 191681 164141 209912 190484 88847 -79101 -241293 -296554 -289324 -244396 -215257 -288219
20070b88219K05324J35955O2454j27305j67883N9643R3600j45293o5012J6825
20060b19911Q2269O927J00543J98164N4688n4017j54349p4084M6418J822n5539
20049f7069n2030J72789R4228J29300j18951r0273q1050O4072J71616m7974j38588
20038C6070J4952l7134M8699r1841n2805J08249M4474k05049J6146J48084o1471
20027c1626l3854j9667L210m8021O2768k4297N7005J0814j42158k4333J31310
20016e8849O8898l2557p9478K3555o2065j62120O4150J43765L7888l4779R5999
20005D407r1602N3530o2438K9305R2574p9664k19735O5798K15679K31863J20814
19994C60531k12108L1231j3233j93026m3195N4111K7746n3440m7125p8945J0494
$$ plain form
20070 -288219 -82895 53060 115514 -11791 -179674 -120031 -26431 -171724 -236736 -219911
20060 -219911 -137642 -130715 -30172 167992 222680 168663 14314 -59770 -13352 -11530 -67069
20049 -67069 -119099 53690 147918 277218 158267 67994 -13056 51016 222632 174658 36070
20038 36070 51022 13888 62587 -29254 -82059 26190 70664 -134385 -118239 29845 -31626
20027 -31626 -65480 -85147 -81937 -129958 -67190 -91487 -34482 -23668 -165826 -190159 -58849
20016 -58849 10049 -22508 -101986 -78431 -140496 -302616 -238466 -94701 -56813 -91592 4407
20005 4407 -87195 -33665 -96103 -66798 25776 -53888 -273623 -207825 7854 239717 360531
19994 360531 148423 179654 166421 -26605 -69800 -15689 12057 -41383 -88508 -167453 -156959
19983a56959J49833M8292M2315P7457j15904m6747o2068j05941J33866J08307
19973G2451j379p6046l3703q0710K0872j34529J46836K4136n8777J83835R2559
19962A55545j22825n6011K9707R451J76849n3593n0045n5000J8186J13985k6331
19951A39918k7232q8030o5950L2135J29485N3019l6165j27869J4130O3277j94748
19940a08030J22359k8678j15633J10846J06929j874k524l6233k6207J30775J4509
19929A66239R3893N5997K7715m4437j87658j30932J0832N2718R0091j50112j80293
19918a95947p4765P1359J14344l1781m1981J09292o2593l7166J38910J48111j40053
19907b270j15449o6775J11182M3424k9371M5881p7211R791j00060J8262k5871
$$ plain form
19983 -156959 -7126 41166 83481 160938 45034 -1713 -63781 -169722 -35856 72451
19973 72451 71072 -4974 -38677 -119387 -98515 -233044 -86208 -62072 -120849 62986 155545
19962 155545 32720 -23291 6416 15867 192716 139123 89078 34078 52264 166249 139918
19951 139918 112686 24656 -41294 -9159 120326 173345 137180 9311 23441 86718 -108030
19940 -108030 14329 -14349 -129982 -19136 87793 85919 83395 47162 20955 151730 166239
19929 166239 260132 316129 343844 299407 111749 -19183 -8351 44367 134458 -15654 -195947
19918 -195947 -270712 -199353 -85009 -116790 -158771 -49479 -112072 -149238 -10328 137783 -2270
19907 -2270 -117719 -184494 -73312 -29888 -59259 -13378 -90589 -80798 -180858 -162596 -188467
19896a88467L3233J38045M2376j76506K6038j11586Q0278R8960J54951J23065
19886B20387m1725k7821k1153Q544K8689P4907N700j16775J96634J94907L59945
19875H82239J88360j68150r4197p5186k32917k76208r8331l1714M1105J30419
19865B65420J58659J95890K01155J05905j23344j85178j31425M0354P573M5307
19855E80316k6637o7634p1528o8551j35890k6260R3351k3451L3744j00580j23402
19844F3478j35164m40Q4531J613Q4355r363j55659l1780K17485M6404Q4695R865
19832B60020J6615j92087k8468m324o5872M2080J85003K41118l4341O5564K81363
19821G66671J49971O6218J27293J61834K1596k19889J4188m667m7281j16964j74116
$$ plain form
19896 -188467 -155234 -17189 25187 -151319 -125281 -236867 -156589 -57629 97322 220387
19886 220387 178662 150841 129688 138232 166921 241828 247528 130753 327387 522294 882239
19875 882239 1070599 902449 808252 733066 500149 223941 125610 93896 135001 265420
19865 265420 424079 619969 821124 927029 803685 618507 487082 527436 535009 580316
19855 580316 553679 486045 414517 345966 210076 183816 277167 253716 287460 186880 63478
19844 63478 -71686 -72126 12405 14018 98373 89010 -66649 -98429 119056 165460 250155 260020
19832 260020 276635 84548 56080 51756 -14116 27964 212967 454085 419744 485308 766671
19821 766671 916642 982860 1110153 1271987 1293583 1073694 1087882 1083215 1035934 918970 744854
19810G44854Q8996j1580L9935O0185r1892Q5557j17481j45234n0162j16024q8711
19799C98443l8670k0800K434P4232q1585k4285m4899Q0515j95537O42Q49q3698
19787F7641P2555m1438k90273n5937J48439o2742n1975L8594m2157j6148r1050
19776c24491N5993M5478R9383J56329J60365o7150j06479K8841n2742q8552R864
19765h3161k7406R8497J03364J40643j04778n6779J74557J13535p3206j13576
19755A71690L934l7400r3755Q1448J71002p874K17761M2690p7172n8601p7003
19744C36720j06975o2741P4907p8426Q224P5115R253M767J3054n8999Q2371M4008
19732C41278j29867k18430m2617J08399K1531m2799K8071J42560k8936P354p7601
$$ plain form
19810 744854 833850 822270 862205 922390 830498 916055 798574 653340 603178 487154 398443
19799 398443 359773 338973 341407 415639 334054 309769 264870 345385 149848 150490 151339 67641
19787 67641 140196 98758 -191515 -247452 -99013 -161755 -213730 -175136 -217293 -233441 -324491
19776 -324491 -268498 -223020 -123637 32692 193057 125907 19428 48269 -4473 -93025 -83161
19765 -83161 -110567 -12070 91294 231937 127159 70380 244937 358472 285266 171690
19755 171690 175624 138224 44469 125917 296919 289045 506806 549496 472324 413723 336720
19744 336720 229745 167004 241911 163485 171709 246824 256077 260844 273898 214899 297270 341278
19732 341278 211411 -7019 -49636 58763 80294 37495 65566 208126 179190 186544 108943
19721A08943K31523Q2999k63562r9133j27921J8927J51742j23616r0402j40108
19711b50608j01872J00090K74607J98724P7572p4165j23311p081K4635j23711
19701e120J0827J88994K63265L3266j10476n2685K45150Q7023k36117k13871j05936
19690A04320k102L100o7793j1179O5260J16319J46412K2694k58210K7581J00220
19679B46622L0185n7863p2738j44841L5140P8312l8833p5797J48492J38292j04754
19668A82217j04235j4242j1666J5074m1516n8840j9535j1981K2760J78203N6714
19657A92953J83J53270j06239k52541P3523J53816L0889J09478J62677L5908j31780
19646D22137l7656K5245j05693n4846j9180N7652j01082L3706j00167m4975q5700
$$ plain form
19721 108943 340466 423465 159903 60770 -67151 -48224 103518 -20098 -110500 -250608
19711 -250608 -352480 -252390 22217 220941 298513 224348 101037 93956 118591 -5120
19701 -5120 5707 194701 457966 491232 380756 328071 573221 660244 424127 210256 104320
19690 104320 102218 105318 37525 26346 91606 207925 354337 377031 118821 146402 246622
19679 246622 276807 218944 146206 1365 36505 114817 75984 187 148679 286971 182217
19668 182217 77982 63740 52074 67148 25632 -33208 -52743 -64724 -41964 136239 192953
19657 192953 193136 346406 240167 -12374 61149 214965 245854 355332 518009 553917 422137
19646 422137 384481 409726 304033 249187 230007 287659 186577 220283 120116 75141 -10559
19635a0559m529P7862M8104q7881Q3573K8085n2101R5541J5373m4496K7558J9828
19623A96358O0581J93826o8580L070m4114r6077j5428j06635k28025J35154N1827
19612H1957k2556j01096k1370J43285m862P104L5530N5304K268J28972q4344k9308
19600A90884m5236J5003K16982J65256n6933k13718M3552p109k2569N3703J03684
19589D43499P5790J1595Q6766p3338M0182K40668k5570k80449o4023n1374n859
19578C97887J5560l0938O0158J86k17375k13685R8022K9304p542j1410j47913
19567b7746q1813J81714J30754k11913J2603K36061Q5773p7424q8850M4178N1424
19556B54761J28931Q0435J747q3738j8694n5837p7663j59330j2204J85840K40409
$$ plain form
19635 -10559 -15088 62774 110878 22997 106570 134655 82554 178095 193468 148972 176530 196358
19623 196358 256939 450765 382185 385255 341141 245064 229636 123001 -105024 30130 81957
19612 81957 59401 -41695 -63065 80220 75358 82462 117992 173296 175564 304536 220192 190884
19600 190884 145648 160651 377633 542889 485956 272238 315790 308681 286112 339815 443499
19589 443499 519289 530884 617650 544312 584494 825162 799592 519143 455120 403746 397887
19578 397887 413447 382509 442667 442853 225478 11793 109815 139119 131577 120167 -27746
19567 -27746 -109559 72155 202909 -9004 3599 239660 325433 248009 159159 203337 254761
19556 254761 383692 464127 465874 382136 363442 307605 229942 70612 58408 244248 484657
19545D84657O3488j14225j04271j1388N5230K05486J60162J46000q1021n9253
19535G44865o105R0118J80472J5536j47336j81321j34873q549K7486N9855q3284
19524E56864q0065k71731J5385K18445n4621q0485j05170n88M1948N1412q9445
19513B01949k26838p8758K88170J92176m3746q6350J03396K74208Q1449q8110
19503F17546m4064j70671k00300o8613r1090L5435J40596J77862J02797J9883
19493E19381j62517j6677K5405n1428p2308Q4372K769j25944M8631K8883p3858
19482B06709q3550J55095O9237j54809Q390J49950l8001m1400r1135j1447j9112
19471A49927J3654O0912J11770J6788k03926j45187R1345K01244O4072j11300
$$ plain form
19545 484657 548145 433920 329649 318261 373491 578977 739139 885139 804118 744865
19535 744865 738760 828878 1009350 1024886 877550 696229 561356 552807 580293 640148 556864
19524 556864 476799 205068 220453 438898 384277 303792 198622 198034 239982 291394 201949
19513 201949 -24889 -103647 184523 376699 332953 246603 349999 624207 705656 617546
19503 617546 573482 402811 202511 133898 42808 78243 218839 396701 499498 519381
19493 519381 356864 340187 365592 314164 241856 326228 328997 203053 251684 280567 206709
19482 206709 123159 278254 347491 192682 201072 351022 313021 271621 180486 169039 149927
19471 149927 163581 224493 336263 353051 149125 3938 95283 296527 360599 249299
19461B49299J12422p9773Q4723J7311k00441j26540K3001J36358L7835p2291o9976
19450A11928P3307J93013J62739q6953J5404m6701k1971J30973J71107J25543
19440H28389q2476j84877p9023k0200J3541Q4389L1895J59007Q2728R8312j32322
19429G99363j52362r9641p947q0892j9675N5062N7844p28M7105J18496J52815
19418H69440J67069J67661Q9479m9388M1261q6728j6009J43926M1946K04397K52068
19407A825122J39187j6049j62767j7473O2171R8176K26554J24262K2537l8114
19397B263606J8982K00946K40511K89259M81590M40337M45015L85953M44474L57438
19387E568111M11535M12122Q38641J208370J534516K318714L719473M854300N232274
$$ plain form
19461 249299 361721 281948 366671 383982 183541 57001 80002 216360 254195 181904 111928
19450 111928 185235 378248 540987 454034 469438 422737 400766 531739 702846 828389
19440 828389 745913 561036 482013 461813 475354 559743 591638 750645 833373 931685 799363
19429 799363 647001 547360 539413 458521 438846 493908 551752 551024 598129 716625 869440
19418 869440 1036509 1204170 1293649 1244261 1285522 1198794 1182785 1326711 1368657 1573054 1825122
19407 1825122 1964309 1948260 1785493 1768020 1830191 1928367 2154921 2279183 2301720 2263606
19397 2263606 2282588 2483534 2724045 3013304 3494894 3935231 4380246 4766199 5210673 5568111
19387 5568111 5979646 6391768 7230409 8438779 9973295 12292009 16011482 20865782 26098056
19378B6098056M737126L087326M78293j107907j039637N77057L717598Q636974
19370D5184886J5973043K6006307L6576180M2091852L9922840K5038357L741023
19363B34534488j2654299k3542244k9977591l1232737k8072608k1963325j3028326
19356G4063358l960571K639886N379645L674198k373332q788788j2309688j2851147
19348D5473561j0956178p818156n306421l337996k250142j347966q00792l68727
19340A3287183k55615m6099J08899L1462J53941L06931L80368P59453J254025
19331A5980548J738632L102901N233000P960935J0944880J3551610J3703406J0184773
19323H2400685L175599l269931o124721m274427J975263J0818469K1092938L0173004
$$ plain form
19378 26098056 30835182 33922508 34400801 33292894 32253257 32830314 36547912 45184886
19370 45184886 61157929 87164236 123740416 165832268 205755108 230793465 234534488
19363 234534488 221880189 198337945 168360354 137127617 109055009 87091684 74063358
19356 74063358 70102787 72742673 78122318 81796516 79423184 70634396 58324708 45473561
19348 45473561 34517383 26699227 21392806 18054810 15804668 14456702 13655910 13287183
19340 13287183 13031568 12985469 13094368 13125830 13279771 13586702 13967070 14726523 15980548
19331 15980548 17719180 20822081 26055081 34016016 44960896 58512506 72215912 82400685
19323 82400685 85576284 82306353 76181632 71907205 73882468 84700937 105793875 135966879
19315A35966879L6697866L8661393L3613915K2875286M552145k1086776m0455724
19308B10824984m7729352m4573676l4062456k2104075j2547001n526937j065083
19301D3216404J356571J881610K25849k083112m092142m258090k488484K3296
19293C3781902J278346J780069L896211O662745O243389J174232j464582J06211
19285E3458523J485492j752572n633027n597845l352365j403208m83494l07583
19277C6413921J71176K183975N260017N250405P28566j702737l80172P35157k322207
19268D6338101o066558o470804n219277m466053m563016m129542l243533k127039
19260A0052279j241462r44490o03443l66013k92904k05683m8905J80361L8099
$$ plain form
19315 135966879 172664745 211326138 244940053 267815339 272367484 251280708 210824984
19308 210824984 163095632 118521956 84459500 62355425 49808424 44281487 43216404
19301 43216404 44572975 46454585 46680434 44597322 40505180 36247090 33758606 33781902
19293 33781902 35060248 36840317 40736528 47399273 53642662 54816894 53352312 53458523
19285 53458523 54944015 53191443 47558416 41960571 38608206 37204998 36721504 36413921
19277 36413921 36585097 38769072 44029089 49279494 50008060 48305323 47925151 48660308 46338101
19268 46338101 40271543 33800739 28581462 24115409 19552393 15422851 12179318 10052279
19260 10052279 8810817 7866327 7262884 6896871 6603967 6398284 6349379 6529740 6567839
19251F567839r461J71447L79167N49494O99296J129159J648713K416890L856167
19242A7408711N483141O766002O600110O477822Q619661J2059133J0496071K845014
19234G6755665r48938J416840L480076k322001q386834q132325m666990j781005
19226E5414488l88218k09857O99424M310956Q781503Q347479J562739k125090
19218G6393424J54552J729946l866338j0219415j0827960q683143p811762p583295
19210B9286009o833291n464059l926946k637124j772186j144190q65372n84986
19202F057855m42975n36984l81847k97986k60573k69648l18694l78882j64184
19193C006082o0962k37524k28585k06313o6737m7898k18045k16689n0591j13090
$$ plain form
19251 6567839 6558378 6729825 7108992 7658486 8357782 9486941 11135654 13552544 17408711
19242 17408711 22891852 29657854 36257964 42735786 51355447 63414580 73910651 76755665
19234 76755665 75806727 77223567 80703643 78381642 69994808 61862483 57195493 55414488
19226 55414488 55026270 54816413 55515837 59826793 68608296 76955775 78518514 76393424
19218 76393424 76547976 78277922 74411584 64192169 53364209 44681066 36869304 29286009
19210 29286009 22452718 16988659 13061713 10424589 8652403 7508213 6642841 6057855
19202 6057855 5614880 5077896 4696049 4398063 4137490 3867842 3549148 3170266 3006082
19193 3006082 2945120 2707596 2479011 2272698 2205961 2158063 1940018 1723329 1672738 1559648
19183A559648j03499j39275r1551J3857k10084r3964J48210J23167j83284j12126
19173I11099j12398q6406o6105j57787O2933O2349J710N5288J3651o4462J98432
19162H18304k5709k10895n0736j8076J64128J04048K7301J06108j07659J18081
19152I24895M4206M7763j85698j68840J99319j06853j05982J11183J23451n9037
19142H24407M5636j19369k09319l3422J09537o5843q4730m6058J59073m8141l73118
19131A58653o59N1356K24917m3472J34909Q1450j56971O5939J66599p3455j12949
19120D96317j3405J5969j6796k93j0085J03705P4022P9861J54050J5088Q0842
19109I79275m1977l5840J1086J08985P675M2683j0596L9901L36n5058j9733N0275
$$ plain form
19183 1559648 1456149 1316874 1225323 1239180 1029096 935132 1083342 1206509 1023225 911099
19173 911099 798701 712295 646190 488403 551336 613685 615395 670683 684334 619872 818304
19162 818304 792595 581700 530964 512888 677016 781064 808365 914473 806814 924895
19152 924895 969101 1016864 831166 662326 861645 754792 648810 759993 883444 824407
19142 824407 870043 750674 541355 507933 617470 551627 466897 420839 579912 531771 158653
19131 158653 157994 209350 434267 390795 525704 607154 450183 516122 682721 609266 496317
19120 496317 482912 498881 482085 481792 471707 575412 649434 729295 883345 898433 979275
19109 979275 937298 901458 912544 1021529 1029204 1071887 1061291 1101192 1101528 1046470 1026737 1077012
19097A077012J65647J46904J82673J64780j2123J11897J15970R7085K43504K18333
19087B511682K02382J37671J39331M20981M65326L14279M86328N08672Q26070
19078F012722J055923J603526K099694K984102M378360O233584P587650P960382
19070C9915943Q524714J0952434J5002168J5628400J0079142N281371O890837
19063A12275009J1560151J0202941k395r433319j0272254n850826m689393j0172980
19055I3616934j5668291j5136261j1051040q405867q168311p710554o408611m638034
19047A6429965l391634k362130j627130j174775q77629n67865n60198n60354m49576
19038D858674j78874K6963P0590j2572j15843m0308J0712J13573K37220J04683
$$ plain form
19097 1077012 1242659 1389563 1572236 1737016 1724893 1836790 1952760 2049845 2293349 2511682
19087 2511682 2714064 2851735 2991066 3412047 3877373 4191652 4677980 5186652 6012722
19078 6012722 7068645 8672171 10771865 13755967 18134327 24367911 31955561 39915943
19070 39915943 48440657 59393091 74395259 90023659 100102801 105384172 112275009
19063 112275009 123835160 134038101 134035706 124602387 114330133 108479307 103789914 93616934
19055 93616934 77948643 62812382 51761342 43355475 35187164 27476610 21067999 16429965
19047 16429965 13038331 10676201 9049071 7874296 6996667 6428802 5868604 5308250 4858674
19038 4858674 4679800 4706763 4777353 4764781 4648938 4608630 4619342 4732915 4970135 5074818
19028E074818K8283K60555K91720O21151Q05414J151513J933574K569743L628951
19019A6365722M693418N190379N343546O647588R056727R497678O207931L340809
19011F6343798M167047O659023O185505N2998n982610o626674l871048k948200
19003F3979839o281232r784070r459078o937195n269011m883173m707364m196261
18995A2462455k950417k069136j296605q57162n90571n75111n30904l80418k25955
18986B986176k25565k36571j41499j00539k26288k75114o1034J75971K0940O1673
18976A978150M438K8961j27588k9526n5501j87166j10898j03407o3796n4514j26353
18965A152800k75578j19393J31457J82224j0279j20355j54359j26804n6609p5120
$$ plain form
19028 5074818 5103101 5363656 5655376 6276527 7081941 8233454 10167028 12736771 16365722
19019 16365722 21059140 26249519 31593065 38240653 47297380 56795058 63002989 66343798
19011 66343798 70510845 77169868 83355373 83408371 77425761 70799087 66928039 63979839
19003 63979839 57698607 47914537 38455459 31518264 26249253 21366080 16658716 12462455
18995 12462455 9512038 7442902 6146297 5289135 4698564 4123453 3592549 3212131 2986176
18986 2986176 2760611 2524040 2382541 2282002 2055714 1780600 1719566 1895537 1916477 1978150
18976 1978150 1982588 2011549 1883961 1854435 1798934 1611768 1500870 1397463 1333667 1279153 1152800
18965 1152800 877222 757829 889286 1071510 1061231 940876 786517 659713 603104 527984
18955E27984r8071R9656O7756J11516q1142R8144O1130j0382j28302j74980J7851
18944D91160L9428J01240j44003m1096J12841m3056P7295K7871J04043P6815k21829
18933E80709k19086j39788M3176p7199M5742j11799n951j38644J39025K17906
18923C34091k332l1188k66733K7108L10830J14012j04521j3244K3178j13843q7724
18912A89634J0706J67752P2746j22442m9961m8901N2402m6487j98426o022J20880
18901A41881J11247J48290o83q8909j83898j7038m4290k6926L13359J00896N0093
18890E04022J8114j08860P8898j61724j86631N3380r7464J52380N6940j5790J9451
18879C12716j8889j1314j03043m1188m9048J24534N6412q5662O8293L9079K7945
$$ plain form
18955 527984 429913 529569 597325 708841 627699 725843 786973 776591 648289 473309 491160
18944 491160 530588 631828 487825 446729 559570 516514 593809 621680 725723 802538 580709
18933 580709 361623 221835 265011 187812 233554 121755 115804 -22840 116185 334091
18923 334091 331759 300571 33838 60946 371776 485788 381267 368023 391201 277358 189634
18912 189634 200340 368092 440838 318396 268435 219534 271936 225449 27023 21001 141881
18901 141881 253128 401418 400735 311826 127928 110890 66600 39674 353033 453929 504022
18890 504022 522136 413276 492174 330450 143819 197199 99735 252115 309055 293265 312716
18879 312716 293827 282513 179470 138282 89234 213768 270180 184518 252811 291890 319835
18868C19835L5668J31594J2674N7775N7525M9469J18329O9584j41565j53105J25763
18857F83546Q4670p9287q0665M263J02686K22703k5198K6674j26602k82861k79712
18846B50217j17608O7140l264j43482R6135J73119j04401r7382J25865J66311
18836D12650L3344k3458k61838p8789r9198o1799J81609L775M5251N945P5040
18825B32532K1008J9065r5085L9280J26487K12047J39977L5663o443K2127J74816
18814I21474r0023o7366O6458p419M9323J06775j56001k62063O3524P1811K5j54820
18802E41698O8749r459N7280K74419J77390K8754p9418k05797k44830j85856j84589
18791B38341q6918J48151O2888n4867j13848o6819k16633m5731K32419J64856
$$ plain form
18868 319835 355503 487097 499771 557546 615071 664540 782869 852453 710888 557783 683546
18857 683546 768216 688929 608264 612527 715213 937916 912718 939392 812790 529929 250217
18846 250217 132609 199749 196485 53003 149138 322257 217856 120474 246339 412650
18836 412650 445994 422536 160698 81909 -17289 -79088 102521 106296 151547 157492 232532
18825 232532 253540 272605 177520 216800 343287 555334 695311 730974 724531 746658 921474
18814 921474 831451 764085 830543 823124 872447 979222 823221 561158 624682 696493 696518 541698
18802 541698 610447 600988 658268 932687 1110077 1138831 1059413 853616 608786 422930 238341
18791 238341 151423 299574 362462 307595 193747 126928 -89705 -135436 96983 261839
18781B61839P5829r5407J41567J68041m5113m4854r2508k14309j40256N8707J23751
18770A97287K11302K22881J86043M68631Q97569k8681n98052m37551k63884j52144
18760G03401j64723n5209q1995J3955J26803J24649J2603r0754O1988k9918k5958
18749E94842j46884k97757j25558N6459K12059J67107J0447K5808o1757O447m9549
18738C91664L4817J42060L5104P1839R0264k04549O5991o0108q9129j98991l4812
18727B44150Q0481O0609j39051j05561j04527j1852J23347J6984m005k7389j25579
18716G607r7097l3950J70658J99146K3004j95853K9026M5481M2727m9005Q6676
18705B28420K5792J75845J9727J0636k0223m9158M0420J0029n0394o339j48824
$$ plain form
18781 261839 337668 242261 383828 551869 506756 461902 369394 155085 14829 73536 197287
18770 197287 408589 631470 817513 1286144 2183713 2155032 1556980 1119429 855545 703401
18760 703401 538678 483469 401474 415429 542232 666881 679484 588730 650718 620800 594842
18749 594842 447958 150201 24643 81102 293161 460268 470715 496523 434766 441213 391664
18738 391664 426481 568541 603645 675484 765748 561199 627190 567082 477953 278962 244150
18727 244150 324631 385240 246189 140628 36101 24249 147596 164580 160575 133186 7607
18716 7607 -89490 -123440 47218 246364 269368 73515 102541 148022 190749 141744 228420
18705 228420 254212 430057 449784 460420 440197 391039 431459 441488 391094 384755 235931
18694B35931R5176J44604n5111J2954P2401R1208N9302j03687Q0733J60417j40282
18683F53646k0391K4233n8660j39940O8606O3153r7584j11447J4072r7451J50188
18672D48425J54413P4221J33109J65349L19037M53504P63922L64390J12j29808
18662B746674j44587k37694j79666k54697l01654l70186J799l2584n6185J60500
18652A331720N8078m7530j64945k31683k02501Q8934m84p2441j05191k1537N419
18641F37839P6117k4602l7519j16682k6747m6941p213J50167K6063j13377r6780
18630D20325R2474K67130J22064K52034K71401J46738k5005j49178m3234r5109
18620A259640l6012p5265J25041M99948N59234P23718Q44969M86351K79544j11644
$$ plain form
18694 235931 331107 475711 420600 433554 505955 597163 656465 552778 633511 793928 653646
18683 653646 633255 657488 598828 458888 527494 590647 493063 381616 395688 298237 448425
18672 448425 602838 677059 810168 975517 1294554 1748058 2511980 2876370 2876482 2746674
18662 2746674 2602087 2364393 2184727 1930030 1628376 1258190 1259989 1227405 1171220 1331720
18652 1331720 1389798 1342268 1177323 945640 743139 832073 831589 759148 653957 632420 637839
18641 637839 713956 689354 651835 535153 508406 461465 454252 604419 630482 517105 420325
18630 420325 512799 779929 901993 1154027 1425428 1572166 1547161 1397983 1354749 1259640
18620 1259640 1223628 1148363 1273404 1773352 2332586 3056304 3901273 4387624 4667168 4555524
18610D555524m06490o75808r42239m64225k36935l26446o0913L8511O6850O6423
18600A614252j03478j99902j21929j40253j10134n185L506m8789r2072p6729K7478
18589G46765P9952Q9831J64136K40867K78776j22178j55774k05043K5452J16144
18579A258928L3564p0438q820j30574K5861J64063M5332q5706J7424N7490O4655
18568A371779j20553J32722J35465M2048N9561Q5375J87636J06338J05456J27999
18558B233826J84421K25353K95522K73700K73619L27663K30879L99578O80604
18549E125165O23186P55296O09286Q57598J174142J297043K043751L289918L541478
18540A9316863K942556K648512L652038M701468L473495J085021J820555N083287
$$ plain form
18610 4555524 4149034 3473226 2530987 2066762 1829827 1503381 1442468 1480979 1547829 1614252
18600 1614252 1510774 1310872 1188943 1048690 938556 933371 936877 888088 796016 719287 746765
18589 746765 826717 916548 1080684 1321551 1600327 1478149 1322375 1117332 1142784 1258928
18579 1258928 1292492 1222054 1213234 1082660 1108521 1272584 1317916 1232210 1249634 1307124 1371779
18568 1371779 1251226 1383948 1519413 1561461 1621022 1706397 1894033 2000371 2105827 2233826
18558 2233826 2418247 2643600 2939122 3212822 3486441 3814104 4044983 4444561 5125165
18549 5125165 5748351 6503647 7112933 7970531 9144673 10441716 12485467 15775385 19316863
18540 19316863 22259419 24907931 28559969 33261437 36734932 37819953 39640508 44723795
18532D4723795R211381J4888876K1334771K1831417J6867108J9879066L1104986
18525A79841400L0892388N877868j1299351o762891m161359j5779477k5902641
18518A52705937k2668337j5357775j3257521j2880618r142765l177751o00887
18511G5620283m454932q367720p938311n684223n805759p037521p024031n677408
18503B3630378l881885k597545j553365j050785m97219o0389j25847k12654J21337
18494A3772026M32158P92293J409189K079345L281562N233505O691779O353212
18486D0045069M819180N711554Q350463P941776L064763J042047M536124R714224
18478H5225200J0427228R862441J5755725K3868020J9245309N437759L394953
$$ plain form
18532 44723795 53935176 68824052 90158823 111990240 128857348 148736414 179841400
18525 179841400 210733788 216611656 205312305 198549414 194388055 178608578 152705937
18518 152705937 130037600 114679825 101422304 88541686 79398921 76221170 75620283
18511 75620283 71165351 62797631 54859320 49175097 43369338 36331817 29307786 23630378
18503 23630378 19748493 17150948 15597583 14546798 14049579 13989190 13863343 13650689 13772026
18494 13772026 14204184 14996477 16405666 18485011 21766573 27000078 33691857 40045069
18486 40045069 44864249 50575803 58926266 66868042 69932805 70974852 75510976 85225200
18478 85225200 95652428 105514869 121270594 145138614 164383923 169821682 173216635
18471A73216635J3119046P920087j6923572k8365209k2063900j4902642j7662443
18464I4338002k0142025j6699067j1729309p510150l940632j411670j532047l241376
18456B8131726l643368k742102j973418k792703l000628k493274j653576j263331
18448H569326j153525p79283o16522m09889n02708m40572k14159l73180k66651
18439C812837k81784l18428k51802j47570j96009j80113j46632K46322L17625
18430B854446o340J30303L29042M06431L72187K88933O3234j94992k94733m38410
18420C510101k21315l74442m69836k05943j93110J8633j58529j20548J6889P2581
18410A874481l1895j92743j06793j45113j34999k15801N142r6393k11599J679
$$ plain form
18471 173216635 186335681 194255768 177332196 148966987 126903087 112000445 94338002
18464 94338002 74195977 57496910 45767601 38257451 34316819 32905149 31373102 28131726
18456 28131726 24488358 21746256 19772838 16980135 13979507 11486233 9832657 8569326
18448 8569326 7415801 6636518 6019996 5610107 5107399 4666827 4452668 4079488 3812837
18439 3812837 3531053 3212625 2960823 2813253 2617244 2437131 2290499 2536821 2854446
18430 2854446 2848106 2978409 3307451 3713882 4086069 4375002 4438236 4243244 3948511 3510101
18420 3510101 3288786 2914344 2444508 2238565 2045455 2064088 1905559 1785011 1801900 1874481
18410 1874481 1842586 1649843 1543050 1397937 1262938 1047137 1052279 955886 744287 745966
18400G45966J2421p4863p3726r3349j1031J40053q4613N5602P2483Q0929M859
18389G74731q2189K05370K27192k1016m2772r2554J07391j03665N2358J23812
18379A148658J63544J13492Q4390K98218L20801J06225n7458J70763J76506r7829
18369B427310l52825l69473j53720o5471k78705j72408K38383J49679j60202k38217
18359A024351p9336J18897J50184j89001l10735j48365j00419Q0097j15694M2210
18349D72189N2815o1809N4135k7408P5348p1533j69652o5623M3621N7747M2074
18338D01904j17724j59469J21783q6925J01394l1921k5574j05891j49332O196
18328d5559K80808J47659j21712n5875N9851J7653j1111N802J07361J3071l9127
$$ plain form
18400 745966 758387 683524 609798 516449 505418 645471 560858 616460 688943 769872 774731
18389 774731 692542 897912 1125104 1104088 1061316 968762 1076153 972488 1024846 1148658
18379 1148658 1312202 1425694 1510084 1808302 2129103 2235328 2177870 2348633 2525139 2427310
18369 2427310 2074485 1705012 1551292 1485821 1207116 1034708 1273091 1422770 1262568 1024351
18359 1024351 945015 1063912 1214096 1025095 714360 565995 465576 545673 429979 472189
18349 472189 525004 463195 517330 489922 565270 493737 324085 258462 302083 359830 401904
18338 401904 284180 124711 246494 159569 260963 229042 203468 97577 -51755 -45559
18328 -45559 235249 382908 261196 205321 265172 282825 271714 277516 384877 397948 358821
18317C58821j49125N7268j1342m9397r6840M1170M8576M1121n9264j22431r33
18306E7624Q35p5150k1244O0105K21344P2981j52177r3861J5467j8867m7519l0849
18294a1311j5565J3021K3503J1583P1759J69476j72995Q2083O0312M6680Q3441
18283C61987J15543j52632q1027r5130k4637q0381O8417O1739J05850N26M6000
18272C26255L0980k2989r5320q4619j22128j42921M7883O8559J49820R5840J5191
18261B66551J7997N6177j04926K249j07706Q4501Q5165L0357o0598J51064j12463
18250C08368j19043P4667R9007J15549P3367j22776j59853p4444K4112J47362
18240C66316q7131Q4098O3905J17137J76703m9021j85332K1924P0736j2542l10299
$$ plain form
18317 358821 209696 266964 255622 206225 109385 150555 199131 240252 180988 58557 57624
18306 57624 58459 -16691 -37935 22170 243514 316495 164318 70457 85924 67057 19538 -11311
18294 -11311 -26876 -13855 9648 21231 92990 262466 89471 171554 231866 278546 361987
18283 361987 477530 324898 243871 148741 124104 43723 112140 173879 279729 280255 326255
18272 326255 357235 334246 238926 154307 32179 -110742 -62859 5700 155520 251360 266551
18261 266551 284548 340725 235799 238048 130342 214843 300008 330365 269767 420831 308368
18250 308368 189325 263992 362999 478548 551915 429139 269286 194842 218954 366316
18240 366316 279185 363283 427188 544325 721028 672007 486675 508599 579335 566793 256494
18229B56494j91278j29090p9418j43620Q0269M8769m4031J01888J54237R5409
18219A49629K30938j02013r7563r2476J16601j5226J12307J89614l8272l0068
18209D23471j58069L7143l4575P5212P3416l1596J14488q9236j93766m3468l903
18198A69117l112Q8993l6538k39965M6034j3157k6292r327m6754k2558J8410J49360
18186G4211K6882J92638o8997j67249q4938J87049K8150N5039q4119r1967O8063
18175A34762r860j2597J42254J26705j02125j70228n6961L0677k1343J58736K4258
18164B44278q519K8157R9430J73965J23712j1333k00441k7612k8392J62585R1251
18153F47081q193j5571o7945N7138Q324K3592j2121j08075j47698r148K6614Q0253
$$ plain form
18229 256494 65216 -63874 -143292 -286912 -206643 -157874 -201905 -100017 54220 149629
18219 149629 380567 278554 180991 88515 205116 189890 302197 491811 453539 423471
18209 423471 265402 302545 267970 343182 416598 385002 499490 410254 216488 173020 169117
18198 169117 166005 254998 218460 -21505 24529 11372 -14920 -24247 -71001 -93559 -75149 74211
18186 74211 101093 293731 224734 57485 -27453 159596 187746 242785 158666 66699 134762
18175 134762 124902 112305 254559 381264 279139 108911 51950 82627 61284 220020 244278
18164 244278 235759 263916 363346 537311 661023 649690 449249 421637 393245 555830 647081
18153 647081 638888 623317 555372 612510 620834 644426 632305 524230 376532 367384 393998 474251
18141D74251L73804J08572o1213k3428k4335J55790J52274R8979J18402J04525
18131A477621L35737L19643M8756K56635K67477L24466L35445M76691O47150O53542
18121E143163O77668R48316J325928J814150K246663K886931M275450O452206
18113B5770475J0107515J7203703L0957465N7532526J04348730J30533794Q532032
18106C84986240j04638090j05140382p1205348l9656795k1774123j2345694p726963
18099B2498845n096369l422320k535432j979444j311393j093872q24819q19733
18091E415463p57445o43434m28456n43848l00300k37875j41963j84908k01734
18082A975500Q0831P0155l77162k00637j54187q1875k53229p4208n2422N5541
$$ plain form
18141 474251 848055 956627 895414 871986 847651 1003441 1155715 1254694 1373096 1477621
18131 1477621 1813358 2133001 2181757 2438392 2705869 3030335 3365780 3842471 4489621 5143163
18121 5143163 5820831 6769147 8095075 9909225 12155888 15042819 19318269 25770475
18113 25770475 35877990 53081693 84039158 141571684 245920414 376454208 384986240
18106 384986240 280348150 175207768 104002420 64345625 42571502 30225808 22498845
18099 22498845 17402476 13980156 11444724 9465280 8153887 7060015 6235196 5415463
18091 5415463 4658018 4014584 3586128 3042280 2741980 2504105 2362142 2177234 1975500
18082 1975500 2056331 2126486 1749324 1548687 1394500 1312625 1059396 985188 932766 988307
18072I88307R6051l0510p7021r2035J3896n8087j07286M7133m6190K4771r2257
18061F66772n7692o3707o7180j52204K1487J38390O5947J8666r0031j36464k05055
18050A38929n1721Q3598J06258K18760M1579j39884P5618n2784j0395J21852N4748
18039E86558r5521j33472r7693O4249O4659q9344p6944j24481n0615Q1540q0359
18028D8577R1614J09339n6821J49256K60198J8672o8222m9740J11431J98573O8705
18017H81582J31453m2799O4384J04775j07920j76877j03594j47185k26602M5952
18007D23169Q5655l7050m459P0502m3090q4832P638Q0580k0824j87116l0796J65171
17995D24548P3174q3574K2539O8209j00811o0114k44814p791J31470P6361R2647
$$ plain form
18072 988307 1084358 1053848 976827 884792 898688 840601 733315 780448 734258 759029 666772
18061 666772 609080 545373 478193 325989 347476 485866 551813 570479 480448 343984 138929
18050 138929 87208 170806 277064 495824 537403 397519 473137 420353 409958 531810 586558
18039 586558 491037 357565 259872 324121 388780 299436 222492 98011 47396 128936 48577
18028 48577 140191 249530 192709 341965 602163 620835 552613 502873 614304 812877 881582
18017 881582 1013035 970236 1034620 1139395 1031475 854598 751004 603819 377217 423169
18007 423169 508824 471774 467315 537817 494727 409895 417533 498113 477289 290173 259377 424548
17995 424548 497722 414148 436687 504896 404085 343971 99157 91366 222836 299197 391844
17984C91844O1403Q9119j11456J55503L6673r9652p3197j8210J36059Q3685l3551
17973F18220q2486J25648N6572l6103j42492o0874J87396p4966r0132j79356j95650
17962A25777j51862k0528Q7390K51020J11852K5694q0716k07472q0194J352J11895
17951A74208n7036J32943J85690j00983K7191j15492p9621J2647j06195q0585
17941g233Q6772K5538l1631m3716j12523N5853J3710J29357q8436J7445L5867
17930H1003j59068j10904k0250J06612M6175j07245M7570j78773R8447R4455n8277
17919a60255O2615L0982j63088j03657j21077L7789J84929J62700Q5834J84137
17909B00909q9867j57421j13026o2141q4006J13911P5114p8507j6140J08666L2965
$$ plain form
17984 391844 453247 542366 430910 586413 623086 523434 450237 432027 568086 651771 618220
17973 618220 535734 661382 717954 681851 539359 478485 665881 590915 500783 321427 125777
17962 125777 -26085 -46613 40777 291797 403649 429343 348627 141155 60961 62313 174208
17951 174208 117172 250115 435805 334822 362013 246521 166900 179547 73352 -7233
17941 -7233 79539 105077 73446 29730 -82793 -26940 -13230 116127 27691 45136 81003
17930 81003 -78065 -188969 -209219 -102607 -56432 -163677 -116107 -294880 -196433 -101978 -160255
17919 -160255 -97640 -66658 -229746 -333403 -454480 -416691 -231762 -69062 16772 200909
17909 200909 111042 -46379 -159405 -221546 -305552 -191641 -116527 -195034 -211174 -102508 -69543
17898f9543k4510j5592O814P8395P76O0987o4264P0130o4189j59772p6816r9751
17886c57335Q2228K23128j0604r143N3563p3680K20434R8853P1567r4229l40721
17875a35939p1480J47929R4974L1151L5921j01195j342l2741L2073J09610Q9109
17864A98070p4476q0749q1100O6514J35890k1085k02338m4691Q8993l3718L1971
17853a6719K5625l2736l9836q5757L5631J2690J07539q1966k9050j53971K980
17842b55570J87438k2962r3172K1285r2477J79100J32806J24841O0956p1874n8504
17831A11867m5523j58829M6829l5666J3459P4294j3932J66364o7374r101L6844
17820A19232M8992k5453r361J80424J28633j29402o7598n3714o5264k0630l5698
$$ plain form
17898 -69543 -94053 -109645 -102831 -24436 -23660 37327 -26937 43193 -20996 -180768 -257584 -357335
17886 -357335 -275107 -51979 -62583 -71726 -18163 -91843 128591 227444 299011 204782 -135939
17875 -135939 -207419 -59490 35484 66635 102556 1361 19 -32722 -649 108961 198070
17864 198070 123594 42845 -38255 28259 164149 143064 -59274 -103965 -14972 -48690 -16719
17853 -16719 8906 -23830 -63666 -149423 -113792 -101102 6437 -75529 -104579 -258550 -255570
17842 -255570 -68132 -91094 -184266 -162981 -255458 -76358 56448 181289 242245 170371 111867
17831 111867 66344 -92485 -45656 -81322 -67863 6431 -7501 158863 91489 82388 119232
17820 119232 168224 142771 133410 313834 442467 313065 245467 191753 126489 105859 70161
17809G0161j14987j54897J67078R0285k3340q879Q9642m7733j39694p5919J5152
17798a33131O4855O0035L3307r4098k23457p6181O3004N5236J69184J94118k07480
17787i4608j19583o2631O2425P9062K40438m2496p9119n6757L6960j19558J399
17776a54468O1393o4926j56538K9101Q2393Q9110Q2799N778m0353o1768o0869
17765a88348O8604P8068L9850J0837p7692m5934k11813K5999M4603J59534J78299
17754H2007J4341l2179j03736r8260N8370m1362j27346j17538K27308K67235Q7392
17743B16232O5208n3167l25165o3394n4227K7280J67638J64606o1085k02009j00720
17732b18803J39774L992J0633j96541q0939J58129m9574L0105l7523p6235r7923
$$ plain form
17809 70161 -44826 -199723 -32645 57640 34300 25421 115063 67330 -72364 -148283 -133131
17798 -133131 -68276 -8241 25066 -69032 -292489 -368670 -305666 -250430 -81246 112872 -94608
17787 -94608 -214191 -276822 -214397 -135335 105103 62607 -16512 -73269 -36309 -155867 -154468
17776 -154468 -93075 -158001 -314539 -285438 -203045 -113935 -31136 -25358 -65711 -127479 -188348
17765 -188348 -119744 -41676 -1826 9011 -68681 -114615 -326428 -300429 -255826 -96292 82007
17754 82007 96348 64169 -39567 -137827 -79457 -120819 -248165 -365703 -138395 128840 216232
17743 216232 281440 228273 -96892 -160286 -214513 -187233 -19595 145011 83926 -118083 -218803
17732 -218803 -79029 -75037 -64404 -260945 -341884 -183755 -233329 -203224 -240747 -316982 -414905
17721d14905N1613m8355L8896J84580J51137o9922L1155O4115j11826m3007J02399
17710f4120p3628j08985m3441o3861P7987n957M1343j48282J3402K10765J20460
17699d4317n7939K1092L1046J85645j82204j31124J18436K70164J0645M9757J56264
17688D27465p3125k34965j18667J63475o114P0737J3742n6894q7643o3479j21281
17677h6749j21065L9972J18989J13028k04k0533O3269K20070J06199j0566J01363
17666E23773j1333j59600j91908p9317j89864j09997l3749L6338P2144m0154K03938
17655B0271L9250r572K8163o3436M7834l5357j46242j17927q6189l1797J07689
17644b47313J32344K11173O56j22416J25251P2750j23045j0435l956J09653n5660
$$ plain form
17721 -414905 -363292 -411647 -372751 -188171 -37034 -106956 -75801 -11686 -123512 -166519 -64120
17710 -64120 -137748 -246733 -290174 -354035 -276048 -282005 -240662 -388944 -375542 -164777 -44317
17699 -44317 -102256 -81164 -50118 135527 -46677 -177801 -59365 210799 221444 271201 427465
17688 427465 354340 119375 708 164183 158069 228806 242548 185654 98011 34532 -86749
17677 -86749 -207814 -167842 -48853 64175 63971 43438 106707 326777 432976 422410 523773
17666 523773 512440 352840 160932 81615 -108249 -218246 -251995 -215657 -143513 -183667 20271
17655 20271 59521 49949 78112 14676 62510 27153 -119089 -237016 -323205 -355002 -247313
17644 -247313 -114969 96204 96860 -25556 99695 172445 49400 38965 35009 144662 89002
17633H9002j50865J06317P6905k7837m165O7356L7657l7375q4258j49197j90681
17622b67141J86767J67139P0296J01494l5883j1575J20395j28688j54452k40392
17612a92040n9065K9200J42178P2153N0504Q5981J20185o6673m987J37588k8988
17601B86036p5874q3696r5132K312K8432N277r0761j12393j23110Q0939R5772
17590h2198j74897p356J06820K22127J16543m5461j95885j17978O8276J01199
17580h810J36869J18952k26335j05325k872O9740K7326L2653M2939M766J15041
17569B04944M53j1187L7366o5709O5562j66828p3582l5210k1497P9930K4502K1102
17557E9846K02063j48089j33029J34856n2695k62351k31616K3641J54471K21438
$$ plain form
17633 89002 -61863 44454 121359 93522 89357 156713 194370 156995 72737 -76460 -267141
17622 -267141 -80374 86765 157061 258555 222672 211097 331492 202804 48352 -192040
17612 -192040 -251105 -221905 -79727 -7574 42930 128911 249096 182423 177436 315024 286036
17601 286036 210162 126466 31334 33646 62078 67355 -23406 -135799 -258909 -177970 -82198
17590 -82198 -257095 -264451 -157631 64496 181039 135578 -60307 -178285 -110009 -8810
17580 -8810 128059 247011 20676 -84649 -87521 -17781 9545 42198 85137 89903 204944
17569 204944 205397 194210 231576 165867 231429 64601 -8981 -44191 -65688 14242 38744 59846
17557 59846 261909 113820 -19209 115647 62952 -199399 -431015 -407374 -252903 -31465
17547c1465M937n3316l022p792j16472m1719J26m6431J29054K44311K9640j30630
17535b2779j60311l4337Q7306L5240j24737o0921R7191O6230n6200N113P0864
17524i7341O4405J04313n2435N2029m152q3655p59J23253J44263K6366j33765
17513A42522k7982o0931p6689l5910k19671l3012O3740O8821J36865J14128J49226
17502B21107j20738Q0832Q4262Q2076k10409k43736m1854l1817j15954m0460N8441
17491b78250L175R3852k2815J0087J80M2435l1557l4913J86841J77707N4960j46888
17479E4814K9750M3164R7498j6057j32157j30493r0196R5688J0534P8504R1873
17468A32922m2793L9861j41038k09653K4613J06680m886n3760j14342K3602q5996
$$ plain form
17547 -31465 -26528 -79844 -82866 -90658 -207130 -248849 -248723 -295154 -166100 78211 107851 -22779
17535 -22779 -183090 -217427 -130121 -94881 -219618 -280539 -183348 -117118 -173318 -168205 -97341
17524 -97341 -32936 71377 18942 70971 66819 -16836 -17595 105658 249921 276287 142522
17513 142522 114540 53609 -23080 -58990 -278661 -311673 -247933 -179112 -42247 71881 221107
17502 221107 100369 181201 265463 347539 137130 -106606 -148460 -180277 -296231 -336691 -278250
17491 -278250 -275075 -181223 -204038 -193951 -193771 -151336 -182893 -217806 -30965 146742 201702 54814
17479 54814 84564 127728 225226 209169 77012 -53481 -143677 -47989 -37455 41049 132922
17468 132922 90129 129990 -11048 -220701 -196088 -89408 -94294 -148054 -262396 -238794 -324790
17457c24790k5013M2355J8236O2839J59296K0490O5979J16490J43581Q843o6995
17446B21311J53890J41621J46315M45799P98517K09336n93548n51032l88548k75835
17436C07826J1516N415l0001j376n6125J59187r242n9940n7644o3074R9648p6442
17424B29748m1810j62513j15994K8841j8791M8141L2279j17909l8080m043l4611
17413a94742J13288K3040n7689J58600Q1183q3786j20239J14133K877j31314n8276
17402a52925M8595P1460j5437r4013L6644J69035k4575j87004L0996p5597N8096
17391a34725Q0736p0115o2256j15540O3447J98212n0368M9755Q559j09817j60363
17380c02475J17292J32652j7411l4684J1257R4368r4198n5199R2725J23990r6787
$$ plain form
17457 -324790 -349803 -307448 -289212 -226373 -67077 -46587 19392 135882 279463 288306 221311
17446 221311 375201 516822 663137 1108936 1907453 2116789 1523241 972209 583661 307826
17436 307826 319342 324757 294756 293380 237255 396442 387200 327260 269616 206542 306190 229748
17424 229748 187938 25425 -90569 -61728 -80519 -32378 -99 -118008 -156088 -160131 -194742
17413 -194742 -81454 -58414 -116103 42497 123680 39894 -80345 33788 36665 -94649 -152925
17402 -152925 -104330 -32870 -48307 -142320 -105676 63359 38784 -148220 -117224 -192821 -134725
17391 -134725 -53989 -124104 -186360 -301900 -238453 -40241 -90609 -40854 -32295 -142112 -302475
17380 -302475 -185183 -52531 -69942 -104626 -93369 999 -93199 -148398 -55673 68317 -28470
17369b8470P4969k2444J40425j135k97061p7680r896M5523J02443J0381L7637
17358b5308r0660P616R2161J29226l8438L3666L4792j01113j52771M7454Q5113
17347B1738j4288m3375K8697J52156J4412m5437m9691j43451m6433R4204m47p2277
17335a04192K10758R1003j11856j35119j44043j57683J96738J64642J03254q6096
17325B7406L745J13467j20396j55491R4992j24517j84919j07227J15922J7405
17315c19613P3243L6903K00881m4428k77711M102k6666q616P7036j30133j27810
17304e42812J91500J14352Q6662J03143M3623n5603m8518M5483M6174j0285j93724
17293b20005l8313K53983N4128r8933q6979P0568M54k7056N3424J7971J9839n8367
$$ plain form
17369 -28470 46499 24055 164480 163345 -133716 -211396 -221292 -175769 -73326 -62945 -25308
17358 -25308 -115968 -108352 -16191 113035 74597 108263 143055 41942 -110829 -63375 21738
17347 21738 7450 -35925 -7228 144928 159340 113903 64212 -79239 -125672 -31468 -31915 -104192
17335 -104192 106566 197569 85713 -49406 -193449 -351132 -154394 10248 113502 27406
17325 27406 31151 144618 24222 -131269 -36277 -160794 -345713 -452940 -337018 -319613
17315 -319613 -246370 -209467 -8586 -53014 -330725 -326623 -353289 -361905 -284869 -415002 -542812
17304 -542812 -351312 -236960 -150298 -47155 -3532 -59135 -107653 -62170 -15996 -26281 -220005
17293 -220005 -258318 -4335 49793 -49140 -136119 -65551 -65097 -92153 -38729 -20758 -919 -59286
17281e9286j57764k8220J1451R6155k2042J31350l9333j15108q7402L4691K60850
17270B5342J19087M8316J47700O6175n6163O8966j44533o2460K4957j43385k13469
17259a19467j16266O6541J16615j1442J4681N4181j32563J45428L2887n1316k2235
17248b2956l6151q9131l9796j12810m5446N9164J17618R0977j27708j32508P5467
17237b63280J2104M9841O4164J25396P972m9364J0330J07332o3070r6572j08424
17226b03571l5622k4704J15011N7205O2332J3870M7113M8590m1930J87575K7129
17215B52998j60816j42718N353p6500N5212L1828j31571o3892P5567N3133j3614
17204a15020L5914k7421Q2361N0024L8770j23745N2519J02743J99392K5140p8271
$$ plain form
17281 -59286 -217050 -245270 -233819 -137664 -159706 -28356 -67689 -182797 -270199 -235508 25342
17270 25342 144429 192745 340445 406620 350457 419423 274890 212430 237387 94002 -119467
17259 -119467 -235733 -169192 -52577 -64019 -49338 4843 -127720 17708 50595 -721 -22956
17248 -22956 -59107 -148238 -188034 -300844 -346290 -287126 -169508 -78531 -206239 -338747 -263280
17237 -263280 -251176 -201335 -137171 -11775 -3803 -53167 -42837 64495 1425 -95147 -203571
17226 -203571 -239193 -263897 -148886 -91681 -29349 -15479 31634 80224 38294 225869 252998
17215 252998 92182 -50536 -45183 -121683 -66471 -34643 -166214 -230106 -154539 -101406 -115020
17204 -115020 -79106 -106527 -24166 25858 64628 -59117 -6598 96145 295537 320677 242406
17193B42406j03129l2784J17205j51268j04146J28157m24P9230j91085j71372
17183a87210m8809P0273K6178P4484L901M2120q0187P9945k8328p6768M698K7139
17171i2564J03335Q948r8702J1063J10807J2663q4554N4755J09375q3254j09190
17160e7318j70j22746J13671K52477m0985k9798O7158n5091J09058j37589j93342
17149i4675o7898r0879Q6183k9306K05175Q3754q8666p6049k46551r8679K13366
17138b04225J50948R6559J43620q1099q0119l2730j53203j01113L8598J6323o7781
17127b74222J831O9593N7203J22831L6263N8183j13001L61l5367l9801l7546j5631
17115a69303j16443P3113P2855j52003R5979J08819k9614J7075J19353J8713m3077
$$ plain form
17193 242406 139277 106493 223698 72430 -31716 96441 96017 175247 -15838 -187210
17183 -187210 -236019 -165746 -139568 -65084 -61183 -19063 -99250 -19305 -47633 -124401 -119703 -92564
17171 -92564 10771 19719 -78983 -67920 42887 55550 -29004 25751 135126 51872 -57318
17160 -57318 -57488 -180234 -66563 185914 144929 115131 182289 127198 236256 98667 -94675
17149 -94675 -162573 -253452 -167269 -196575 8600 92354 3688 -72361 -318912 -417591 -204225
17138 -204225 -53277 43282 186902 105803 25684 -7046 -160249 -261362 -222764 -206441 -274222
17127 -274222 -272391 -202798 -145595 -22764 13499 71682 -41319 -40958 -76325 -116126 -153672 -169303
17115 -169303 -285746 -212633 -139778 -291781 -195802 -86983 -116597 -99522 19831 38544 -4533
17104d533l8352k5170n8799J51899J36675r6250L0932k9589j16457K37757p4537
17093A13576j95265q1181P2470K2918j6072K4934R5451o5497l8344P5254J08976
17082A17220k6426K2837J4970q1083j39398n4047N5527n4719J5587j02537k4792
17071b56861R4624k0354k1752J28922p805o5966J67116K29161m4630j97299O749
17060A1905P4066K856m7652m7482k07886J37368r689N0313K3175m0849l6068J02631
17048A2688J84712O8585j30009k6059N800L9130j28523j10675l3379j45013K148
17037b60595K98046R9905n6989m9024O5439o6134K2607p7921L8032N2708j4846
17026E1228N4330j20252k64224K4357J87759r3285j86234k9819K28016K47824
$$ plain form
17104 -4533 -42885 -68055 -126854 25045 161720 65470 96402 66813 -49644 188113 113576
17093 113576 -81689 -162870 -90400 -67482 -83554 -58620 36831 -28666 -67010 8244 117220
17082 117220 90794 113631 128601 47518 -91880 -145927 -90400 -145119 -129532 -232069 -256861
17071 -256861 -162237 -182591 -204343 -75421 -83226 -149192 17924 247085 202455 5156 11905
17060 11905 85971 88827 41175 -6307 -214193 -76825 -86514 -36201 -13026 -53875 -89943 12688
17048 12688 197400 265985 135976 109917 115717 154847 26324 -84351 -117730 -262743 -260595
17037 -260595 37451 137356 80367 31343 96782 30648 53255 -24666 13366 66074 51228
17026 51228 105558 -14694 -278918 -254561 -66802 -160087 -346321 -376140 -148124 99700
17016I9700n8956q95J68373R8059q0490m6862j74226n4919J68j61948O457K42331
17004C6792k6296K2343k1276Q155O4091J15305N3859k28068j02304J01803P7928
16993A02332M7724R2167L3696j77166k16297L6528J84549J43437R3546r3220j01906
16982A45390J44318j43585k42641j02723j12144J19921L2735l2707M4884J54297
16972G745L0822j34747p5192J34198P7847j06348m0507q7005j3292J13071o0863
16961a54271M6308P7352R8377j11397k5613P9691j0042q7762j06917J68607L4116
16950H449n0896J43172n4583j74996J534N0186J7826J73777M6504o8990j64839
16939g2856K4597J01425P6889n756j82796p0020J53413J70820j56022k551Q2697
$$ plain form
17016 99700 40744 39849 208222 306281 225791 178929 4703 -50216 -50048 -211996 -205539 36792
17004 36792 10496 32839 11563 19718 83809 199114 252973 24905 -77399 24404 102332
16993 102332 150056 242223 275919 98753 -117544 -81016 103533 246970 340516 247296 145390
16982 145390 289708 146123 -96518 -199241 -311385 -191464 -158729 -191436 -146552 7745
16972 7745 38567 -96180 -171372 -37174 40673 -65675 -106182 -193187 -206479 -93408 -154271
16961 -154271 -107963 -30611 67766 -43631 -69244 10447 405 -87357 -194274 -25667 8449
16950 8449 -42447 100725 46142 -128854 -127320 -77134 -59308 114469 160973 91983 -72856
16939 -72856 -48259 53166 130055 124299 -58497 -128517 24896 195716 39694 37143 119840
16928A19840q9586k13083L7478Q632m8247J87694R0206r4675l8221o9183q6212
16917a95357J68007R3776m8756m046N9015q0933J2854N996j6661M7966P0376K6644
16905A38881j23926K8694J3139j40285k28580p5497J07350J52250P5917j1516
16895f3573J01041r4056K0992k9695p0328P0753J3197N291l1835O0134J02594
16884H4515J33615q3003j94422N8634j98284J04606J03840m5247o4354K1318P4427
16873d355K5426M9765O8886j39299k76920o0359m7758J33006J37326J20363k1933
16862a5852J15287K04122j07831j66756K6405j6928r2850m8555j64193j64052
16852d31203K01280K78198p903J2425k65190k1716J64038O1859O1762J4369k4144
$$ plain form
16928 119840 30254 -182829 -145351 -136719 -184966 2728 92934 -1741 -39962 -109145 -195357
16917 -195357 -27350 66426 17670 13624 72639 -8294 4560 10556 -6105 41861 112237 138881
16905 138881 14955 43649 56788 -83497 -312077 -387574 -280224 -127974 -52057 -63573
16895 -63573 37468 -56588 -35596 -65291 -135619 -64866 -51669 -46378 -78213 -18079 84515
16884 84515 218130 135127 -59295 -661 -198945 -94339 9501 -35746 -100100 -78782 -4355
16873 -4355 21071 70836 139722 423 -276497 -336856 -384614 -251608 -114282 6081 -15852
16862 -15852 99435 303557 195726 28970 55375 38447 -54403 -102958 -267151 -431203
16852 -431203 -229923 48275 40372 52797 -212393 -234109 -70071 -8212 53550 67919 43775
16841D3775l8477L7662K0339j3163j5462M4407j69682n7111J47761J26448l2057
16830I4440j97051L1958M3928p0750o5293O4354r5326j44044j407J13015J90081
16819c6095j4106O4675M933o8411j1896m9826j59918j15557Q8558J69172O7711
16808f0760R9064N8587j08381n0940m5265m5431J4359q7349o4864J16343K33354
16797E8717J7354k2598o8112K2610O285j8788J18400o7733j77080P5925J94426
16786A39406l8805J5958K7678j25895j09385q6364k7372M7580J16631N942p4948
16775a09574m3794r7008J51271J58725J8483l6891n89J7183k3560j34086k15056
16764c14896N126K89182l4777j3145o9888j02268n6921J00562J63234j5754P1351
$$ plain form
16841 43775 5298 42960 63299 50136 34674 79081 -90601 -147712 49 126497 94440
16830 94440 -102611 -70653 -26725 -97475 -162768 -98414 -193740 -337784 -339191 -226176 -36095
16819 -36095 -50201 14474 19407 -49004 -60900 -110726 -270644 -386201 -297643 -128471 -60760
16808 -60760 38304 96891 -11490 -62430 -107695 -153126 -138767 -226116 -290980 -174637 58717
16797 58717 76071 53473 -14639 7971 14256 -4532 113868 46135 -130945 -55020 139406
16786 139406 100601 116559 144237 18342 -91043 -177407 -204779 -157199 -40568 -34626 -109574
16775 -109574 -153368 -250376 -99105 59620 78103 41212 40623 57806 34246 -99840 -314896
16764 -314896 -309770 -20588 -55365 -68510 -138398 -240666 -297587 -197025 -33791 -49545 21806
16753B1806m7904K751M2476K6927K3395j45590j6946p6725O7862o2090K3172Q5243
16741e5623J74716m9413k8798Q4484J18169l8078k87469p5757M6023J57351J28601
16730A74206M8477r8748k4129n8349m4848o1218n0986k80764o0550L29152J26049
16719a708j2785N2808N498M2300K6247r7778l1839j6840J16588r2441Q6290K5857
16707A02197j17270j14258n504N1713J41297N1066l4451j7401O6793j16969m5085
16696c7872K65671L4446j08699j82914j33385q8104J35890m0097l2213J19126
16686f8151J63817N7236j62284j11813r6022j3131M8448M692O4315K09391Q1077
16675A77575j72808j81248j12937m2001K4676J53524Q848k3952L779R0983K50871
$$ plain form
16753 21806 -26098 -23347 19129 46056 69451 -76139 -93085 -169810 -101948 -164038 -140866 -55623
16741 -55623 119093 69680 40882 125366 243535 205457 -82012 -157769 -111746 45605 174206
16730 174206 222683 123935 99806 41457 -3391 -64609 -115595 -396359 -456909 -127757 -1708
16719 -1708 -14493 38315 43813 86113 112360 14582 -17257 -34097 82491 -9950 76340 102197
16707 102197 -15073 -129331 -134835 -83122 58175 109241 74790 57389 124182 7213 -37872
16696 -37872 227799 262245 153546 -29368 -162753 -250857 -114967 -155064 -187277 -68151
16686 -68151 95666 152902 -9382 -121195 -217217 -230348 -181900 -177208 -112893 96498 177575
16675 177575 4767 -176481 -289418 -331419 -306743 -153219 -144371 -168323 -164544 -73561 177310
16664A77310J20344j45929j45949r6772J33879k4806M2228j5900M1817n3315L6835
16653F9742o4113j63999N0200J60082J14639J52193q629j54993j14358J42229
16643A82993P6791j3718j56343j36122j08253j57196J01527l6070j54565Q2731
16633c18225k3078l5948J13980m3918q905P2037P5593r1218p18L6910N4439P0221
16621i8830K1550J247L0597k27427L8964K58199j3574j00544o7368q6013m3424
16610b86623l5101J17640K08115K67752n3640j31662N945M4685p5097j34420m20
16599g2826l9225m2240j72541l0164J22211N756m9153M2060K2758R4860o0415
16588a78919L7326L28799J00280l7554q3509J0458N1796j04528k12197k03899
$$ plain form
16664 177310 297654 151725 5776 -90996 42883 18077 60305 44405 86222 32907 69742
16653 69742 5629 -158370 -108170 51912 166551 318744 310115 155122 40764 182993
16643 182993 259784 246066 89723 -46399 -154652 -311848 -210321 -246391 -400956 -318225
16633 -318225 -341303 -377251 -263271 -307189 -316094 -244057 -168464 -259682 -260400 -223490 -169051 -98830
16621 -98830 -77280 -76033 -45436 -272863 -233899 24300 10726 -89818 -157186 -243199 -286623
16610 -286623 -321724 -204084 4031 271783 218143 86481 92426 137111 62014 -72406 -72826
16599 -72826 -112051 -154291 -326832 -356996 -234785 -229029 -278182 -236122 -213364 -118504 -178919
16588 -178919 -141593 187206 287486 249932 166423 176881 228677 124149 -88048 -291947
16578b91947j8975K78993J78920l843j69552J46299l1786m0198R8954J11182L5430
16567B93477N976j20918m3371J02665k9177j99402j85016p0850P1537m2526K37256
16556A9651J45817j07669j18328r8017K12K8621j1209j6873j7270L6260K1613
16545a17192k6565L8690J14675J88440J73614j34331k05354o0540J17431q6798
16535B070J09513k2265j19183o7848m0497K25402J68235M9489j06993p7758J4127
16524A34292J15032k3442r7076q0587j26712q4177P3367J48835Q3702n3201m3167
16513D6866Q6117L3242n6286l7084j08706j84354j41740J35617J03118k04682
16503c27892L7502J90263K7132k56747N2776K87002J57267n6214m8946J57695
$$ plain form
16578 -291947 -310922 -31929 146991 143148 -26404 119895 88109 47911 146865 258047 293477
16567 293477 299453 178535 135164 237829 208652 9250 -175766 -246616 -175079 -217605 19651
16556 19651 165468 57799 -60529 -158546 -158334 -129713 -140922 -157795 -175065 -138805 -117192
16545 -117192 -143757 -105067 9608 198048 371662 237331 31977 -28563 88868 2070
16535 2070 111583 89318 -29865 -97713 -138210 87192 255427 304916 197923 120165 134292
16524 134292 249324 225882 128806 48219 -78493 -162670 -89303 59532 143234 90033 46866
16513 46866 132983 166225 109939 72855 -35851 -220205 -361945 -226328 -123210 -327892
16503 -327892 -290390 -100127 -72995 -329742 -276966 10036 167303 111089 62143 219838
16493B19838j56206n1727N9498l2928M2187j53629j44385M811O5827j653K4299
16482a24068j5939n6039P5247J35606K4191k0401O3620L8265k15897j79281m0971
16471c15667R034K64607P7430r1906j81092M9788K18923N4121m8164J7747l0935
16460B3886k13822N1231P4275j20970n5073J23537J08572m7838J01461P8489k0886
16449A02862m3277p4674N6588J76160n1438k97608n0994L2447L6017o024R9264
16438b0677M6589J44663J03998L4164j36052l8358J5510p8193M1932J78223r91
16427B90808K374J7042j58334m3891J05982J0177r7224L5195M7882k8073k15306
16416c3368m6315k3722m8842p3287j85587o8484M1735j08911O1272J59937j08703
$$ plain form
16493 219838 63632 11905 71403 38475 80662 -72967 -217352 -212541 -146714 -148367 -124068
16482 -124068 -140007 -196046 -120799 14807 38998 18597 82217 120482 -95415 -274696 -315667
16471 -315667 -306633 -42026 35404 -56502 -237594 -187806 31117 85238 37074 54821 23886
16460 23886 -189936 -138705 -64430 -185400 -240473 -116936 -8364 -56202 45259 123748 102862
16449 102862 59585 -15089 41499 217659 166221 -131387 -182381 -149934 -113917 -119941 -20677
16438 -20677 25912 170575 274573 308737 172685 134327 149837 71644 113576 291799 290808
16427 290808 293182 310224 151890 107999 213981 224158 126934 162129 210011 181938 -33368
16416 -33368 -79683 -103405 -152247 -225534 -411121 -479605 -437870 -546781 -485509 -325572 -434275
16405d34275k723J26997R9224J00747O0092M8363J21714j5520O003q8483j50686
16394a28547N0067R1813m1037M7420p3305M7437K228j20603j02892o896Q0672
16383a53643l7716j31160m1784P4583J15727l289K01666k9118j24349r6361K0668
16372b04776J84915j11994J60796j452J2762q9369k01513M4746K02903q2357o0164
16361a45503J3039k551J50982p4702k4460J05448q7644j38472j5161p7216p3606
16350c69846J01283J94175J20195j31272j2799R8528J20476j15763j0247L8376
16340C3106P6537J7401q2621O4187o0310j9397J3030L55O0971r2497j83106J01197
16328g1147L9813j2297j35397J06175M0123k6675Q8364J0553O0817m9450o6621
$$ plain form
16405 -434275 -436998 -310001 -210777 -110030 -49938 -1575 120139 104619 110622 22139 -128547
16394 -128547 -78480 13333 -27704 19716 -53589 -6152 -3924 -124527 -227419 -234315 -153643
16383 -153643 -191359 -322519 -364303 -289720 -173993 -177282 24384 -4734 -129083 -225444 -204776
16372 -204776 -19861 -131855 28941 27489 40251 -49118 -250631 -205885 -2982 -85339 -145503
16361 -145503 -132464 -135015 15967 -58735 -83195 22253 -65391 -203863 -219024 -296240 -369846
16350 -369846 -268563 -74388 45807 -85465 -98264 264 120740 4977 -5270 33106
16340 33106 109643 127044 44423 108610 48300 28903 41933 42288 103259 10762 -172344 -71147
16328 -71147 -31334 -43631 -179028 -72853 -32730 -59405 28959 39512 100329 50879 -15742
16317a5742k8014O7751j12954J8335m9572l569J5166K04230o3801K2786J41110
16306A95726q0823n0429o6296j58966l9793P2047J55189Q029Q6695J32519j46872
16295A07026J676j49112K8953K8004o6725M990P2119J6655K4927P5550q838J10233
16283B45458L2774j6906j44418k77608R7623p558R6070q9126k77333n4048K6119
16272c68953J06366J18889K13834n3154m0146L6548o5547M1415N2817j9345j7107
16261E617N127O1633O5492n9040k59190j38094N3092K0571N2601j08586l6217
16250c36994J52034J60320j30305l1422q7488o0185p5611J67315R2173O113J46083
16239B033J4488k8565R8737l4365j39323J35648o2411J00802R6524P9005J8888
$$ plain form
16317 -15742 -43756 23995 -88959 -70624 -120196 -123765 -108599 95631 31830 54616 195726
16306 195726 114903 64474 -1822 -160788 -200581 -128534 26655 34684 121379 253898 107026
16295 107026 108702 -40410 -11457 16547 -50178 -45188 26931 43586 68513 144063 135225 245458
16283 245458 278232 261326 116908 -160700 -63077 -70635 25435 -63691 -341024 -395072 -368953
16272 -368953 -262587 -143698 70136 16982 -23164 13384 -52163 -10748 42069 22724 5617
16261 5617 10744 72377 137869 78829 -180361 -318455 -265363 -244792 -192191 -300777 -336994
16250 -336994 -184960 -24640 -154945 -186367 -273855 -334040 -409651 -242336 -150163 -144050 2033
16239 2033 16521 -12044 86693 52328 -86995 48653 -13758 87044 183568 262573 281461
16228B81461L7483j92615j19164j06876J04046o8595m786j9663Q5985L4621K5302
16217E7199q5499j13120N9793P4028N2129R9609L431k56927J01215J90821j7779
16206A64900l011j80383p649p175p6544j92278l9344J65706p3843j1034Q8810
16195a71845N5755R0380j891J18332M4154o2717k00553K4080r2604n7922R8513
16184a56318K16874P9766m1299r5143j23868K4748J60070m9612J27268j05823
16174C6663k3657o2880L9832j0697j1720P8160M3331L2399p1442k8082K24671
16163B46578l1897j15151r4847Q3174j4535R633O0188J32865j08632J1467m683
16152A74160j89815l5820P2922L1287q0440O3055l3256p7477m3852j26367j43477
$$ plain form
16228 281461 318944 126329 7165 -99711 4335 -64260 -69046 -88709 -2724 31897 57199
16217 57199 -28300 -141420 -81627 -7599 44530 144139 147570 -109357 -8142 182679 164900
16206 164900 161889 -18494 -26143 -33318 -109862 -302140 -341484 -175778 -249621 -260655 -171845
16195 -171845 -116090 -25710 -27601 90731 134885 72168 -128385 -104305 -196909 -254831 -156318
16184 -156318 60556 140322 99023 3880 -119988 -95240 64830 15218 142486 36663
16174 36663 13006 -49874 -10042 -20739 -32459 45701 89032 121431 49989 21907 246578
16163 246578 214681 99530 4683 87857 73322 82955 143143 276008 167376 178843 174160
16152 174160 -15655 -51475 21447 52734 -27706 35349 2093 -75384 -119236 -245603 -389080
16141c89080o0306Q0049J45867M6885J09934R3283o0180n5021r3612P26L728o5162
16129b42889J12892N2458Q5087l5715P6858N0404J43414R2848O0023M01j89552
16118B06229m6774O7004k17654q2432R0521P2601J78188K1998q6174q5937n1325
16107F6245o7562k65273l1044R8074o6429L700J49422K03197N6J1023j76926k11769
16095b87286J77435ml6990Q7537J0785k814P6519j12418k525R1970l5746N3659
16083B0122O4374j2926p6950r7050N0438J02805k8929q395m9526M5121O358k3160
16071g718J27796j11845q0275j6961o6787j79729r1733O3775J15133O0735L0892
16060a56717P376P2151L5822j04656m4609j59981J39413K97200J14309K0231j84441
$$ plain form
16141 -389080 -449386 -369337 -223470 -176585 -66651 26632 -33548 -88569 -182181 -181455 -177727 -242889
16129 -242889 -129997 -77539 7548 -28167 48691 99095 242509 335357 395380 395781 206229
16118 206229 159455 226459 8805 -73627 16894 89495 267683 289681 203507 117570 66245
16107 66245 -1317 -266590 -297634 -199560 -265989 -262289 -112867 90330 90386 101409 -75517 -287286
16095 -287286 -109851 -109855 -146845 -59308 -48523 -51337 25182 -87236 -89761 2209 -33537 20122
16083 20122 84496 71570 -5380 -102430 -51992 50813 21884 13489 -36037 9084 15442 -7718
16071 -7718 120078 8233 -72042 -89003 -155790 -335519 -427252 -363477 -248344 -187609 -156717
16060 -156717 -149341 -77190 -41368 -146024 -190633 -350614 -211201 85999 200308 220539 36098
16049C6098k50744R986J03326J62894n3553k46821L3432K2365Q8070j0666J5237
16038i0376N8122N8515L4412Q7262k6077K6636J23315P3955j35785j27356J25106
16027B07729l3516l10L1128j33287q3218J02727K27957K00795j12078l10776k33569
16016a36418r8820n4237Q5119J28942K055j88885j42138J616O3922K83881J20867
16005F5904p6206n4168L2903M0017q3855k3550J75264J42922o9265N74K8223l2962
15993A45801q1535j04068l9548k912J9692J3390j02429m1272q4105O017l4308
15982c05277K15920k1116j25866j78513j8850N9063J9419q2555K18889J02672
15972a16214J70432j43587k23589m5007J02482K42809L79093L1817j89706n615
$$ plain form
16049 36098 -214646 -204660 -101334 61560 8007 -238814 -205382 -183017 -94947 -105613 -90376
16038 -90376 -32254 26261 60673 147935 121858 148494 271809 345764 209979 82623 207729
16027 207729 174213 173903 205031 71744 -11474 91253 319210 520005 407927 97151 -136418
16016 -136418 -235238 -289475 -204356 -75414 -73359 -262244 -404382 -402766 -338844 -54963 65904
16005 65904 -10302 -64470 -31567 8450 -75405 -98955 76309 219231 149966 150540 178763 145801
15993 145801 64266 -39802 -79350 -82262 -62570 -49180 -151609 -192881 -276986 -270969 -305277
15982 -305277 -89357 -110473 -236339 -414852 -433702 -374639 -355220 -437775 -218886 -116214
15972 -116214 54218 -89369 -312958 -357965 -255483 -12674 366419 398236 208530 202915
15962B02915J45532o4737r8799o7356j13116j63123O7779Q6947q4541J9669K4003
15951d4827O9060J49599n0785j08217q215J14009Q8067j4015j36287l8145J64404
15940A84648P4415o4728O4130K8333j58458p8580r988L131p6666j13112O4190
15929h2685j60533m5766k2909J63644N0732k19809P3488K15267K14319Q937n5453
15918A39232k7474R0247n3139j8022O362n0787j64058n8660J8682R9764Q9010
15907G1157k06681k265J43956j3684r3064K0785O0445j56752j14478k258J82935
15896a09904K87320N3766m6117m5190j34100j79746K172m8463J11281O7824k9443
15885g0600N1742J03428O6507r9435r3550q352K5618j26928o4727N1074P8423
$$ plain form
15962 202915 348447 283710 184911 117555 4439 -158684 -90905 -3958 -88499 -68830 -44827
15951 -44827 24233 173832 123047 14830 6615 120624 208691 194676 58389 20244 184648
15940 184648 259063 194335 258465 286798 128340 49760 39772 42903 -33763 -146875 -82685
15929 -82685 -243218 -288984 -311893 -148249 -97517 -317326 -243838 -28571 185748 194685 139232
15918 139232 111758 202005 148866 130844 137206 86419 -77639 -136299 -117617 -17853 71157
15907 71157 -135524 -137789 6167 -7517 -100581 -79796 -19351 -176103 -290581 -292839 -109904
15896 -109904 177416 231182 185065 139875 5775 -173971 -171799 -220262 -108981 -41157 -70600
15885 -70600 -18858 84570 151077 51642 -41908 -50260 -24642 -151570 -216297 -165223 -86800
15874h6800m254J45312k3971k2575o1988m5141q5435j2545p7927P068j58727J32386
15862b94597J64733r7527n9805Q9715J33374j8548m301J02019J13635Q8334o3854
15851A53178J628j03112l1591j3324k6400J7431j9190J8711r3772j11929k7861
15840b36231K6793N2253o8623p3101J48402J48095j30445j36909O6787J62131
15830d0848J12520l5166O1036K5587q3815K0279r1955j24272k6684J42013K6910
15819a4395k12841m4070K53709j19675N086J4773j7360J50607r2176j49187q7432
15808c12961K99958Q8704o6130J12818j52729j71486J7170R7580J1674L1555j12116
15797a55963k9886r3286j1363o1401Q4259o2357K6386K3797J13217J19825M182
$$ plain form
15874 -86800 -91054 54258 30287 7712 -54276 -99417 -184852 -197397 -275324 -268256 -426983 -294597
15862 -294597 -129864 -227391 -287196 -197481 -64107 -82655 -86956 15063 128698 217032 153178
15851 153178 154806 51694 20103 6779 -19621 -2190 -21380 -2669 -96441 -208370 -236231
15840 -236231 -209438 -157185 -225808 -298909 -150507 -2412 -132857 -269766 -202979 -40848
15830 -40848 71672 36506 97542 123129 39314 59593 -32362 -156634 -183318 -41305 -14395
15819 -14395 -227236 -271306 -17597 -137272 -132186 -117413 -134773 15834 -76342 -225529 -312961
15808 -312961 -13003 75701 9571 122389 -30340 -201826 -184656 -87076 -75402 -43847 -155963
15797 -155963 -185849 -279135 -290498 -351899 -267640 -329997 -303611 -279814 -166597 -46772 -42590
15786d2590j23032k60637K4379L210m9230L0534Q8600P9150J49721J7390j59607
15775b42112j5093q5849q8539J70127J25226L3179J39746K8284j43644j48139
15765b26814L757K2341J63482j41771j62571K34397J93853j0001J3430j37252
15755d7149j92265O2356M6096j32662J70550J24354o4674L5025J25327M9497M6917
15744B23372r1817j91978j6903O2234J41799N2647j31119j41764M7363K0369N8786
15733C2989R1474j14570k51969o1766J63516K1050o228p5444k0687K81040L04521
15722C63926j94614j16658N8585m9851j417M5315M2797K2079j47980j39987k5123
15711a42928L9171k0467J7928J18989J91095q7041j52538p4234J38252K00065
$$ plain form
15786 -42590 -165622 -426259 -401880 -398670 -447900 -417366 -328766 -249616 -99895 -82505 -242112
15775 -242112 -257205 -343054 -431593 -261466 -136240 -103061 36685 64969 -78675 -226814
15765 -226814 -223057 -200716 -37234 -179005 -341576 -107179 86674 76673 90103 -47149
15755 -47149 -239414 -177058 -130962 -263624 -93074 31280 -33394 1631 126958 176455 223372
15744 223372 131555 -60423 -77326 -15092 126707 179354 48235 -93529 -46166 -25797 32989
15733 32989 124463 9893 -242076 -303842 -140326 -119276 -125504 -200948 -221635 59405 363926
15722 363926 169312 52654 111239 61388 59971 105286 148083 170162 22182 -117805 -142928
15711 -142928 -103757 -124224 -106296 12693 203788 116747 -35791 -110025 28227 228292
15701B28292j15040J5570q3350j90527J61091l1300p9714J6046N9814m305Q9876
15690F6453R968k45654P0557K00249J3184j1743O2597J7100q7337k06766j31990
15679b43382J19988J09921k4715K1134k4416J17661l6752j45924l20J20587j02667
15668h8885n8582Q8184j29839j05530J14770J46208j4350K8982n4947j1501k93515
15657c79005R979P2688K2368J77756P3326l3350j92884n9729J20847J08905l4465
15646a13564q863o2126N6394j4164P2834J83581k8965n4294j8134o9205k1597
15635g8103j23888J07615Q5918Q2318j59045p9854J14776m4480l0782j20305j37002
15624c82832N7235q866j08515R8569J30396J40547k0932j43453R0209J52500o9332
$$ plain form
15701 228292 113252 128822 45472 -145055 16036 -15264 -94978 -78932 -19118 -23423 66453
15690 66453 76421 -169233 -98676 101573 114757 103014 165611 182711 95374 -111392 -243382
15679 -243382 -123394 -13473 -38188 -17054 -41470 76191 39439 -106485 -106805 13782 -88885
15668 -88885 -147467 -59283 -189122 -294652 -179882 -33674 -48024 -19042 -73989 -85490 -379005
15657 -379005 -369026 -296338 -273970 -96214 -22888 -56238 -249122 -308851 -188004 -79099 -113564
15646 -113564 -122427 -184553 -128159 -142323 -69489 114092 85127 30833 12699 -56506 -78103
15635 -78103 -201991 -94376 -8458 73860 -85185 -165039 -50263 -94743 -125525 -245830 -382832
15624 -382832 -325597 -334463 -442978 -344409 -214013 -73466 -94398 -237851 -147642 4858 -64474
15613f4474J9070L0245n4713K9179j2461k2587o775O6515J26382j50754N051J19697
15601H4375K6401m9878j5421O8607o5603q1892j85344J0044J83528K8117l7818
15590c4884J89785Q771l2846o1954J3976j15887j84853M4720J83625P4051L3823
15579A18327m7034j70490o5669O591J521J03672j00646m309r6862p2784O5872
15568b61811L7609o5804Q9423j95942J42532Q7366J2511R878J7652Q1428J49717
15557A04559Q8379j06701j17186Q2352Q3161j27034j00401q3988R0156N9870N6829
15546B9996j13027q1782J09492J81853M1779j43140j04919L8836K09553p0337
15536I8304j77036o1530K75722K19295j56662l8742O7909Q0161p108j27507r6256
$$ plain form
15613 -64474 -45404 -15159 -69872 -40693 -53154 -75741 -82516 -16001 110381 -40373 -35322 84375
15601 84375 110776 60898 45477 114084 48481 -33411 -218755 -208711 -25183 2934 -34884
15590 -34884 154901 163672 130826 68872 82848 -33039 -217892 -173172 10453 84504 118327
15579 118327 71293 -99197 -164866 -158275 -156754 -53082 -153728 -158037 -254899 -327683 -261811
15568 -261811 -224202 -290006 -200583 -396525 -253993 -166627 -154116 -144238 -126586 -45158 104559
15557 104559 192938 86237 -30949 51403 134564 7530 -92871 -176859 -86703 -26833 29996
15546 29996 -83031 -164813 -55321 126532 168311 25171 -79748 -40912 168641 98304
15536 98304 -78732 -140262 135460 354755 198093 159351 227260 307421 300313 172806 76550
15525G6550K5095R673N8198M8702k456l0012j60156k79730J3069K50869O5133
15514G4935K8382M4505m867L0831q4602j53178K02506L0018M8160j0842o1260
15503A44588o9082j12152j31928j58265Q2363K19482n7534k58771O612J16609
15493b18078N5187J27788N6557J6977R1042j07885k85j15204r2345J9704Q9759
15482g6783J13839J94112p9580o4493N2884k2990j47973j05638q767O1554j9187
15471a03022j64346N1658P0738j43014q6751R5680L725L8440J05044O305P0946
15460e4597O0970r5300j42079j28939J2081J64560K34114l7755L9653L4004k5062
15449F1650k3141K69836J29643k23820j14748n3669M5685m8419L3725M6797o1676
$$ plain form
15525 76550 101645 111318 169516 218218 215762 185750 25594 -254136 -241067 9802 74935
15514 74935 103317 147822 142955 173786 89184 -63994 138512 168530 216690 205848 144588
15503 144588 75506 -36646 -168574 -326839 -244476 -24994 -82528 -341299 -334687 -218078
15493 -218078 -162891 -35103 21454 38431 129473 21588 21303 -93901 -186246 -166542 -76783
15482 -76783 37056 231168 151588 87095 139979 116989 -30984 -136622 -145389 -83835 -103022
15471 -103022 -267368 -215710 -144972 -287986 -374737 -279057 -275332 -236892 -131848 -125543 -54597
15460 -54597 6373 -88927 -231006 -359945 -347864 -183304 50810 13055 52708 86712 61650
15449 61650 38509 308345 437988 214168 99420 45751 91436 43017 76742 123539 61863
15438F1863L9877L2301M4336K36380p1446j40472l3274j5784j11576O1005J1110
15427A14320m9626o4444j1442K20259j28014k89503O8420M6856p5023r0057R5248
15416a63006Q1318J06514Q6038n7110n0799Q3184q148o208N5155J2763p6777q2084
15404a9160J08175K3606l6853m2049N0426Q8799m2038K3101l8218l8818K8332
15393A05303P6954p0824J10007o1914q0562j0149K7482J29854j8026N4105n0737
15382B11493j26553l7550j9811j8743l4723n5859r7801m6695J78244K31993L6839
15371B20834j20876j58695j06418j6467l1619p8549N6098K88535N957l0383J02017
15360A30434j8375j58317j30066p9288l5014J73990J38947k2280l9529M1783m9435
$$ plain form
15438 61863 101740 134041 178377 414757 343311 202839 169565 153781 42205 103210 114320
15427 114320 64694 250 -11192 209067 81053 -208450 -140030 -93174 -168197 -258254 -163006
15416 -163006 -81688 24826 110864 53754 2955 86139 77991 71783 126938 139701 62924 -19160
15404 -19160 89015 112621 75768 33719 84145 172944 130906 154007 115789 76971 105303
15393 105303 182257 111433 221440 159526 78964 68815 96297 226151 208125 262230 211493
15382 211493 84940 47390 27579 8836 -25887 -81746 -179547 -226242 -47998 183995 220834
15371 220834 99958 -58737 -165155 -181622 -213241 -291790 -235692 52843 58800 28417 130434
15360 130434 112059 -46258 -176324 -255612 -290626 -116636 22311 31 -39498 2285 -47150
15349d7150j0143J51000j0477n3940j85863N9084q2146r52j27551J25376J43389
15338c9373N759o9859Q2787k232k1076J90211m329q9624m0467j18824K7751J51755
15326G2479L3017J51589n5968j76711p2396J18365J11874M9555p3253M1867l1151
15315A69267j68933M2098o2663j62801l2122M1500M9345j39197m3188P3361p0022
15304c03355n9559J96600J29431J15936R5918k8101j87976j05324P2075J86654
15294A12299K9328j14138j92698O7333J8309M6980O5273k3641J6613N4382j07420
15283b7380p0811m1026o3354O7340J1699j38152M8078K22397J0178j05174J68196
15272H1991Q7877l4162R1180n0349j11129m1108J37097o2988j10238O7179j6944
$$ plain form
15349 -47150 -57293 93707 83230 29290 -156573 -97489 -179635 -180587 -308138 -182762 -39373
15338 -39373 -33614 -103473 -20686 -22918 -43994 146217 141888 52264 11797 -107027 -79276 72479
15326 72479 105496 257085 201117 24406 -47990 70375 182249 231804 158551 200418 169267
15315 169267 334 42432 -20231 -183032 -215154 -173654 -124309 -263506 -306694 -233333 -303355
15304 -303355 -362914 -166314 -36883 79053 174971 146870 -41106 -146430 -74355 112299
15294 112299 141627 27489 -165209 -97876 -79567 -32587 32686 9045 25658 80040 -27380
15283 -27380 -98191 -139217 -202571 -135231 -123532 -261684 -213606 8791 18969 -86205 81991
15272 81991 169868 135706 226886 176537 65408 24300 161397 98409 -11829 55350 38406
15261C8406o5016P2953j9597J08218P4285k7930p9800r2921n4079o2672l9792
15250a47945k5050P6759R7325n8788j33695K561K37087L7214Q445R2627k0607
15239A65933j14446l3059n4532M6869j8747n7607m8469J04858J0876M1153j19048
15228g6219j08263o2470m2429r261M5610J74511J90920J29507q7450r0462j12015
15217d8021L3040O2518j21064k5962K62948N7743r711R4344l68j16849j77572
15206A1046M1772J04542p7240j92814j17452K35263L6158l5517j19183p4632l238
15195a91295j4548n54P8828Q2199P2114R5006J02700q2212K5384O2869K3444r6230
15183A57705p3356k2507p3298l6716L2724j2608O0818J33529R0465Q2715J6100
$$ plain form
15261 38406 -26610 46343 26746 134964 209249 181319 101519 8598 -45481 -108153 -147945
15250 -147945 -172995 -96236 1089 -57699 -191394 -188833 48254 85468 93913 186540 165933
15239 165933 51487 18428 -36104 10765 -7982 -65589 -114058 -9200 1676 42829 -76219
15228 -76219 -184482 -246952 -289381 -298642 -253032 -78521 112399 241906 154456 63994 -48021
15217 -48021 -14981 47537 -73527 -99489 163459 221202 211491 305835 305467 188618 11046
15206 11046 52818 157360 80120 -112694 -230146 5117 41275 5758 -113425 -188057 -191295
15195 -191295 -205843 -206397 -127569 -45370 26744 121750 224450 142238 167622 230491 253935 157705
15183 157705 84349 61842 -11456 -48172 -15448 -28056 32762 166291 256756 339471 355571
15172C55571j67517r9840n4718J40580j66785j22340K2617J12790J61497n2137
15162A29718j16782k1721k26370o7901N7931Q252J20393R1448K359k3705L2496
15151a3882N6744P2863k6729j03928m3891N5858j09026J4744Q398P8725O2685
15140E2561N9445o7489k8240j8947k8467l5274j34297J43957p8183j35646m6976
15129c17556O8955J06963Q8952K16082P9198k02161j11105M9705R8830P944N9907
15118A45714O6438N2453k54447J8432n7371Q893O4558m3561j07758m1107M6931
15107a00825O6062K9333J73532K4071J43812j09598m8158j2697j22079j3124P1745
15096A02074j05849j32753p819J63233l4505N6784J33892o9779O3486o22N0405
$$ plain form
15172 355571 188054 88214 33496 174076 7291 -115049 -92432 20358 181855 129718
15162 129718 12936 -8785 -235155 -303056 -245125 -236873 -116480 -25032 -22673 -46378 -13882
15151 -13882 42862 115725 88996 -14932 -58823 -2965 -111991 -97247 -88849 -10124 52561
15140 52561 112006 44517 16277 -2670 -31137 -66411 -200708 -56751 -134934 -270580 -317556
15129 -317556 -248601 -141638 -52686 163396 242594 40433 -70672 -20967 77863 85807 145714
15118 145714 212152 264605 10158 28590 -28781 -19888 44670 1109 -106649 -147756 -100825
15107 -100825 -34763 -5430 168102 192173 335985 226387 178229 165532 43453 30329 102074
15096 102074 -3775 -136528 -144347 18886 -15619 41165 175057 105278 168764 168142 218547
15085B18547j36837j8875n1292o819n6634k53682J5762N1667O1274J08488P982
15074f0419j9324j93669Q2772Q5101l8170N0698l4826J10779J0495Q1766J8206
15063I3409j10104j05156q232n0632K4024j1631p742p7429j8702Q2774O4563M6099
15051g8759k7664r742O8972O219k7428J25511j38262J2797K28249N9391P0660
15040B89944N5106j92058J6493J0090L9179J42643j54866j63152q7987Q6499J92269
15029B34160P9824K2108Q2711k51280j45263J45601J9380m4114m2172J0240r9940
15018A1255J74611J76631n0873l21966j15336J53658Q3121p7803J13775M7560
15008A94633j69946n6418j41078L2543J66585o0832J5397J14043o3474M448j25144
$$ plain form
15085 218547 81710 62835 11543 4724 -51910 -305592 -289830 -238163 -176889 -68401 -60419
15074 -60419 -79743 -273412 -190640 -105539 -143709 -93011 -127837 -17058 -6563 75203 93409
15063 93409 -16695 -121851 -130083 -180715 -156691 -168322 -176064 -253493 -272195 -189421 -124858 -78759
15051 -78759 -106423 -116165 -47193 -40974 -68402 57109 -81153 -68356 159893 219284 289944
15040 289944 345050 152992 169485 179575 218754 361397 206531 43379 -44608 41891 234160
15029 234160 313984 336092 418803 167523 22260 167861 187241 143127 100955 111195 11255
15018 11255 185866 362497 311624 -10342 -125678 27980 111101 33298 147073 194633
15008 194633 24687 -31731 -172809 -140266 26319 -34513 -19116 94927 31453 35901 -89243
14997h9243l2829P9998o2058N263P5187J7321n0786o2368J6498N3217j01549J0078
14985a41271M5845q9479q6969O2097J07978J40410J48558k9840J41919Q7411j38681
14974B47978k93174j83318M5402N9522J6249j86380j03186J96759K53482O1696
14964A15030m0722J04187Q7604L1313n8358r9904o1290l2136J11203P8301j06046
14953A29182o2342J8370j5364p7472j29474L9017O8006j9676J19836J46689K559
14942B19331j6389j03819o4592R7902r8156q4109R014L6073J76754j613q5450
14931H4946l1042m6743m1703M6079J04897J2783n2958k03528j82000M3184P2274
14920a93811K07216r18M0164j28500N9571L7566K4272O4087J09901M7385l4847
$$ plain form
14997 -89243 -122072 -42074 -104132 -98869 -23682 -6361 -57147 -119515 -103017 -49800 -151349 -141271
14985 -141271 -95426 -184905 -271874 -209777 -101799 38611 187169 157329 299248 386659 247978
14974 247978 -45196 -228514 -183112 -123590 -107341 -293721 -396907 -200148 53334 115030
14964 115030 74308 178495 266099 297412 239054 139150 77860 45724 156927 235228 129182
14953 129182 66840 85210 69846 -7626 -137100 -98083 -30077 -49753 70083 216772 219331
14942 219331 202942 99123 34531 132433 34277 -49832 -40818 -4745 172009 170396 84946
14931 84946 53904 7161 -34542 11537 116434 129217 76259 -127269 -309269 -266085 -193811
14920 -193811 13405 12487 52651 -75849 -16278 21288 45560 109647 219548 266933 232086
14909B32086o8730l2285j62o8743q764k4789J948j15585m3848l1695O547J13767
14897d0253P7999m7310n0590k49058J3883N8265n5603J04166J09212N0230L2056
14886B997l0957J9772K08772m8808j15481q7611j2724m2548j40492m753J15978
14875a35855R4276K3591k62011O0981J59184K1656j2307j77918k7665m6846M6103
14864b56811J02449k5877K45190J27787k5102M2020k36370J03485K9872o5808
14854D0835j14932P21j0579K6722N7347J6523L4925k6641N3176r8226j0683q4773
14842a15585p2139j14823J87095J34399r7480l7680k5285m6793J11577q3523l8910
14831a99147j8073K36302R4229m5933P9874O059j68393m6338l2909N0629L23384
$$ plain form
14909 232086 163356 131071 130909 62166 53402 28613 30561 -85024 -128872 -160567 -154020 -40253
14897 -40253 37746 -9564 -60154 -309212 -295329 -237064 -292667 -188501 -79289 -29059 2997
14886 2997 -27960 -8188 200584 151776 36295 -51316 -64040 -106588 -247080 -251833 -135855
14875 -135855 -41579 -17988 -279999 -219018 -59834 -38178 -50485 -228403 -256068 -302914 -256811
14864 -256811 -154362 -180239 64951 192738 167636 209656 -26714 76771 106643 40835
14854 40835 -74097 -73376 -83955 -57233 114 16637 51562 24921 78097 -20129 -30812 -115585
14842 -115585 -187724 -302547 -115452 18947 -78533 -116213 -141498 -188291 -76714 -160237 -199147
14831 -199147 -217220 19082 113311 67378 147252 153311 -15082 -61420 -94329 -43700 279684
14820B79684J14844q6398j9369j14124k05370j07185j1611J04955R6951p827J37035
14809A81585K13183J26594k2135j26106j16673j38376J26650p1471j04733p0388
14799a870J6494j44942p2865j1757N2522P3494J45317j37850q9105K32907K16844
14788B79189j8081j62635j63249j68388R7932P3006P8287N1341k2317Q8746k3577
14777A10254l6739Q6150M5237M9246K8123j60174m0101k0197n1099Q2794J59318
14766B52812J1670m9248M5393j0868j1913O4612j37171n1844j13412p4869N6952
14755a7886J01203Q8200J13281J43011K7325j16110j78933k4225m1339l5795l3907
14744B4825R4558K6894l7680M7609o2656p8759L5285m7093m9966J44236J65892
$$ plain form
14820 279684 394528 308130 288761 174637 -30733 -137918 -149529 -44574 52377 44550 181585
14809 181585 394768 521362 499227 373121 256448 118072 244722 173251 68518 -1870
14799 -1870 14624 -130318 -203183 -214940 -162418 -88924 56393 -81457 -170562 62345 279189
14788 279189 261108 98473 -64776 -233164 -135232 -62226 16061 67402 45085 133831 110254
14777 110254 73515 159665 204902 254148 282271 122097 81996 61799 10700 93494 252812
14766 252812 264482 215234 260627 249759 237846 302458 165287 113443 31 -74838 -17886
14755 -17886 83317 171517 284798 427809 455134 339024 160091 135866 94527 58732 24825
14744 24825 119383 146277 108597 156206 93550 14791 50076 2983 -46983 97253 263145
14733B63145N9555q0824l731l9257k2120r3903J5838j38152r9575k9439j03800
14722b72263J78634J08031J57017L5230P172K5371j055L0255L8230M2478M3521
14711C92621j46214K01003j46406j93710j6611O2336O6858k4686j09296o525N3495
14700A32865K43582L1466j03673k01501N4733l8301p0876m998N8789n9253R3742
14689A36575n5103m9423O1779J82261k3372J9448j08025J5209K9623P8720N2750
14678C40442o359l8188q8828O7248j07829m5547k8740J26451N8320J07802J27433
14667E12205J1600k5255O5402K19404Q2296K2106R4369K02892J30612l4129K8621
14656A310123j03325j80982j28681m015j14330j38466o6830j38067m2574M1588
$$ plain form
14733 263145 322700 241876 238145 198888 176768 82865 98703 -39449 -139024 -168463 -272263
14722 -272263 -93629 14402 171419 206649 213821 239192 238137 268392 306622 349100 392621
14711 392621 246407 447410 301004 107294 90683 153019 219877 195191 85895 79370 132865
14700 132865 376447 407913 304240 102739 157472 119171 48295 43297 102086 42833 136575
14689 136575 81472 32049 93828 276089 252717 272165 164140 179349 208972 287692 340442
14678 340442 334083 295895 207067 274315 166486 120939 92199 218650 276970 384772 512205
14667 512205 523805 498550 563952 783356 865652 887758 982127 1185019 1315631 1281502 1310123
14656 1310123 1206798 1025816 897135 893120 778790 640324 573494 435427 392853 434441
14646D34441M7619j6782L5136m5613j92076M2357J05299j3338m8709r473J1273
14635C50134m967J22374Q1601k25571j02409M4883K6139N0380K0839J95323J28913
14624F87639J37610K1228M3722k5699N0457n3784M1336L3637r9922j17802j27828
14613E90594m0788k28013k16917k16622R5752n224k8108K75520J55867p3583k03819
14602A04659j89564O8891J33667O5733O1310l5352l3323k4745r3506r6665J36479
14591I7584K23949J2463l3273j77737j30352J1339K82877M5527l05118j07221
14581g9962O3159Q6949Q3630L6935l409m3561q7976Q8006O3405J62557q9533q3275
14569A96925p0880j19898L3589J8671j28913N9766J59434r2211K8314J5665j3064
$$ plain form
14646 434441 482060 465278 500414 454801 262725 305082 410381 397043 348334 338861 350134
14635 350134 345167 467541 549142 323571 221162 266045 292184 342564 363403 558726 687639
14624 687639 825249 846477 890199 864500 914957 861173 902509 936146 836224 718422 590594
14613 590594 549806 321793 104876 -111746 -15994 -21218 -49326 226194 382061 308478 104659
14602 104659 -84905 -16014 117653 183386 244696 209344 176021 151276 57770 -38895 97584
14591 97584 321533 333996 300723 122986 -7366 3973 286850 332377 27259 -79962
14581 -79962 -16803 70146 153776 190711 187302 143741 55765 143771 207176 369733 280200 196925
14569 196925 126045 6147 39736 58407 -70506 -10740 148694 56483 84797 100462 87398
14558H7398m719k24831L7185M4828n6734j6828l0331R6536J37257R7827r3979
14547G3609k4243l8089j94591m6030K56474N5139R4703j2468M6824j18204k2112
14536G1012J16145j54222j36634j62067O7242J52775R9894k1085J19577K8186
14526A80823o1936j43318J0408J1657l827n1670P6858J7919k7587Q6281O6962
14515A62570j41827M1409J14936J54288O1465k0731r8086q442j77223m4151L0399
14504G4607J45925k4023j8315M0406j1674k13786N3648j2799j31566J5095O7411
14493a5071J14765L4524J5124j73614k63959m6415J09753M71J84013K31873r7475
14482I3989k7089m0865j09564J02764P7720Q9504J32795L1501j74842j39366R8497
$$ plain form
14558 87398 82679 -142152 -104967 -60139 -116873 -133701 -164032 -67496 69761 167588 73609
14547 73609 49366 11277 -183314 -229344 27130 82269 176972 164504 211328 93124 71012
14536 71012 187157 32935 -103699 -265766 -198524 -45749 54145 33060 152637 180823
14526 180823 118887 -24431 -14023 -2366 -6193 -57863 18995 36914 9327 95608 162570
14515 162570 20743 62152 177088 331376 392841 372110 274024 265582 88359 44208 74607
14504 74607 220532 196509 178194 218600 206926 -6860 46788 33989 -97577 -82482 -15071
14493 -15071 99694 134218 149342 -24272 -288231 -334646 -224893 -224422 -40409 191464 93989
14482 93989 66900 26035 -83529 19235 96955 186459 319254 350755 175913 36547 135044
14471A35044J66914N2140k5535j72440J5623J13823R582l2157k3934m0547R1422
14460B89935M4318o7969J4765j14525j76938j20197J33160K57941J10044j33151
14450B37383j62998L4003M2328l5360r7690k500J46932J09019r2483l7768l6185
14439A04681N6960p72K5739l078o2797N1875R3842J33641L3037J0729J12460r2144
14427D64173j03398j86132j079j8610m6474L3986K2497L0614j63932k11234n805
14416a85394K19852O0142K2223P585j58580j50482p924J28508K06815N3237R281
14405B05263j63804K6085J0904J60651O5184l1197N629j16010l22q125L4997j65024
14393B4231j55229J61159K01870O4903l126L6696n6477J02574K0442k19257l8100
$$ plain form
14471 135044 301958 354098 328563 156123 171746 285569 295151 262994 239060 198513 289935
14460 289935 334253 266284 281049 166524 -10414 -130611 2549 260490 370534 237383
14450 237383 74385 108388 150716 115356 17666 15166 162098 271117 178634 140866 104681
14439 104681 161641 160869 186608 183530 120733 172608 266450 400091 433128 443857 556317 464173
14427 464173 360775 174643 173564 154954 108480 142466 164963 195577 31645 -179589 -185394
14416 -185394 34458 94600 116823 124408 -34172 -184654 -192578 -64070 142745 195982 205263
14405 205263 41459 67544 78448 239099 304283 273086 278715 162705 162383 154258 189255 24231
14393 24231 -130998 30161 232031 296934 293808 330504 274027 376601 397043 177786 139686
14382A39686m6705r7286J41314J25031P5191k1628l35999j66802J80055Q980o66
14371A171M6228j4347K0705Q9991l0601P389j23021k3954O5556j60670P1453N5643
14359E543J14568J70376L2518q4528l2652P6339J0860J16913O7704j68364n0136
14348B59141K62084L2343j16502j6578N4083L9105p6459j13344O5841J41987M6653
14337E78354k08248j51704Q5441J66419P2820K0067j91542p7170P3138n0770j89421
14326A27384p5747J09936Q8774N2873J04383J17698j84788k03372N3329J13349
14316C03819O9401J62448J04331r1610k02225j58219n1072K48563J05561j26217
14306C64780l3975K92381J29378Q0305j3935j17936p5841j3723l0413j20015O6365
$$ plain form
14382 139686 92981 -4305 137009 262040 337231 315603 -20396 -187198 -7143 1837 1171
14371 1171 47399 33052 53757 143748 113147 120536 -2485 -26439 39117 -121553 -50100 5543
14359 5543 120111 290487 323005 238477 205825 282164 293024 409937 477641 309277 259141
14348 259141 521225 553568 437066 420488 474571 513676 437217 323873 389714 531701 578354
14337 578354 370106 218402 303843 470262 543082 563149 371607 294437 367575 316805 127384
14326 127384 51637 161573 250347 303220 407603 525301 340513 137141 190470 303819
14316 303819 373220 535668 639999 548389 346164 187945 136873 385436 490997 364780
14306 364780 330805 623186 752564 832869 818934 700998 625157 611434 581021 461006 527371
14295E27371M2021j61161n7991q43J26122o9035k154j07057k0078o2744L3284
14284B47735J44919j01938l284J07747Q3822j34190Q5905J09191L8060n6118M0630
14273E62479l0139m3700J52695J88084P2733N1692J26121r0016q9180m9722J62446
14262A013493K10282J17925L451N7322o6772J82620l0440k49010j78730J52351
14252A212492J78974N6913l9561m975K73705J30015K94623J05079n1224J83898
14242B339939J65715J54142K73482K40520K69545K02039K49996K25234M62750
14233D583362N59691O12557P36608Q63996R79909J156933J313693J577157K022119
14224A4406025K262171K779622L615752M587584O142348Q344860J1309576J5037600
$$ plain form
14295 527371 569392 408231 350240 349397 475519 406484 404330 297273 277195 214451 247735
14284 247735 392654 290716 287432 395179 479001 344811 430716 539907 577967 521849 562479
14273 562479 532340 488640 641335 829419 902152 953844 1079965 989949 900769 851047 1013493
14262 1013493 1223775 1341700 1345151 1402473 1335701 1518321 1487881 1238871 1060141 1212492
14252 1212492 1391466 1448379 1408818 1403843 1677548 1807563 2102186 2207265 2156041 2339939
14242 2339939 2505654 2659796 2933278 3173798 3443343 3645382 3895378 4120612 4583362
14233 4583362 5143053 5755610 6492218 7356214 8336123 9493056 10806749 12383906 14406025
14224 14406025 16668196 19447818 23063570 27651154 33793502 42138362 53447938 68485538
14216F8485538J8758524K1538485K3060151K3048564K2050500J9054910J3967289
14209B09963961P193294p98667q567119j4401784j8521896k0688270k1749263
14202A32430256k1200956j9120530j5974276j2311268r295954o782815n017586
14195D2726871l698548k722623k127903j429521o84847k29374K39212P78467J450805
14186C4302539K113385K531014L525026N001303O882773R379805J2793554J6319637
14178I2849036J9629276K1884411K2300584K1371503J8862236J4613494Q654860
14171B20165400P35717p387130j4057937j9009548k2013049k3445649k3265652
14164A11722152k1568591j8536672j4894705j1622590q455890o250463m635294
$$ plain form
14216 68485538 87244062 108782547 131842698 154891262 176941762 195996672 209963961
14209 209963961 217157255 216358588 207791469 193389685 174867789 154179519 132430256
14202 132430256 111229300 92108770 76134494 63823226 54527272 47744457 42726871
14195 42726871 39028323 36305700 34177797 32748276 32063429 31834055 32073267 32851734 34302539
14186 34302539 36415924 38946938 42471964 47473267 54356040 63735845 76529399 92849036
14178 92849036 112478312 134362723 156663307 178034810 196897046 211510540 220165400
14171 220165400 220901117 213513987 199456050 180446502 158433453 134987804 111722152
14164 111722152 90153561 71616889 56722184 45099594 36643704 30393241 25757947
14157B5757947l408552k766763k313947j821119j254263j152641j079835r81075
14149A0979752o08240p42388o98189n95672o73932n45645n63110o56880o36117
14140E259579n07970m14571m20715j35593j53191k68086k28005j16529j17458
14131B897461p0596j86339o6855j04770j24974r8310r8996j25475k49178r9981
14121A671987J47291K59497K15354J77486K48821K74070K80396L57260K87424
14112C919586J32656J84089m0335j29039k03097m70400m55534l86214k96225j98304
14102B057183l26939l66548j85595l7036j810m3209n48j47621q7601o7733p8656
14091G13887R2694L2353j46674k8713M2519J27112n9732j45363n4105P5566K40037
$$ plain form
14157 25757947 22349395 19582632 17268685 15447566 14193303 13040662 11960827 10979752
14149 10979752 10371512 9629124 8930935 8335263 7661331 7115686 6552576 5895696 5259579
14140 5259579 4751609 4337038 3916323 3780730 3627539 3359453 3131448 3014919 2897461
14131 2897461 2826865 2640526 2573671 2468901 2343927 2245617 2146621 2021146 1771968 1671987
14121 1671987 1819278 2078775 2294129 2471615 2720436 2994506 3274902 3632162 3919586
14112 3919586 4052242 4236331 4195996 4066957 3863860 3393460 2937926 2551712 2255487 2057183
14102 2057183 1730244 1363696 1178101 1141065 1139255 1096046 1095498 947877 860276 792543 713887
14091 713887 806581 838934 692260 663547 706066 833178 773446 628083 573978 649544 889581
14080H89581j34963j61389j18860J6528Q1324N148P731M8350n3221j37005j36706
14069C06518J1852K4980J05297l8877n8728j28832n8419K04416k2668L4498J07967
14058D88004J35566q1062j45653J89458O3107j03074j41719p0795M3011J47939
14048E24782j39266n8356N0549P452J86615l4248m7899N2370n7620k13301j68874
14037A02204p0927j28893N9441R9202J60885M2064r3247j18315J11506Q2933j2699
14026B34154q575J13323K9639M7290O2502Q314j89266q1786K4523O1239j26641
14015A74716j28875N311J37438O3363N1388l828o8047N8138J13965L2429r8531
14004C37467j58061j60794J7732K6409J6612K42488n867k936r0525N0390m688
$$ plain form
14080 889581 754618 593229 474369 490897 572221 577369 585100 633450 580229 443224 306518
14069 306518 318370 343350 448647 409770 351042 222210 163791 368207 345539 380037 488004
14058 488004 623570 542508 396855 586313 649420 546346 404627 333832 376843 524782
14048 524782 385516 327160 377709 385161 571776 537528 489629 541999 484379 271078 102204
14037 102204 31277 -97616 -38175 61027 221912 263976 170729 52414 163920 246853 234154
14026 234154 225579 338902 368541 415831 478333 486647 297381 215595 240118 301357 174716
14015 174716 45841 51152 188590 251953 303341 299513 231466 289604 403569 435998 337467
14004 337467 179406 18612 36344 62753 79365 321853 315986 313050 222525 272915 268227
13993B68227n9481n5610J27437N1021q3913j04472M7635K40101O8348m0068k9344
13982D29881k76390k04695m9781m1512N9200J71704Q88J65883J52159J3648j50475
13971B70510j45975M7251K969M5705q4419k87443m4740J25648O8392N3985K88691
13960C40574n3179j86682r4373J03648J31385j11347j54455o3110O7499k9818
13950d9858N9164J42681L2887J4787q9948l9541K12038q9249j29725J28336j01213
13939I0359r4452K73569K24439k95017j72940l3955N4866k10188J20757K45179
13929B02617J05171R8196p8415o1531q8586J24551J4994r3040m8206o0827n6921
13918E8003J02867j0491m968J00908p476j34434M301Q1765o4531p1489L362L2609
$$ plain form
13993 268227 208746 153136 280573 331594 247681 143209 190844 430945 499293 459225 429881
13982 429881 153491 -51204 -100985 -142497 -83297 88407 89295 255178 407337 420985 270510
13971 270510 124535 171786 174755 220460 136041 -151402 -196142 -70494 -2102 51883 340574
13960 340574 287395 100713 6340 109988 241373 130026 -24429 -87539 -20040 -49858
13950 -49858 9306 151987 184874 199661 109713 70172 282210 192961 63236 191572 90359
13939 90359 -4093 269476 493915 198898 25958 -7997 46869 -163319 -42562 202617
13929 202617 307788 405984 327569 266038 177452 302003 316997 223957 175751 114924 58003
13918 58003 160870 150379 145411 246319 238843 104409 108710 190475 125944 54455 57817 90426
13906I0426m1838k2162J00969N4374l8962j14910Q2997M782m1647r8865P3121
13895D8285O3391N2157j25270Q389J67960P5263M26j53472q7527j92451l3508
13884a76357q7549m6854K9288J3852R0529M9598J35234J3234j16488j45689j5286
13873b56488K5855L1974K51053M7889o2181j79980P7281J57356j8314m14781j77862
13862e18198J36924J51682K23398J64223j81799j55038J1450J77413J17337j39114
13852a1722p2073j03151r267k2165R8288J02631l8469J50169J99525n3107K8295
13841B68954k9875n7826Q083j32364o701J01154J06626j49277k08944o3256L9856
13830a23570k9091J54757M7253O4586j11574k015j0310L478j71300N9955N253
$$ plain form
13906 90426 48588 26426 127395 181769 142807 27897 110894 115676 74029 -24836 48285
13895 48285 111676 163833 38563 46952 214912 290175 290601 137129 49602 -142849 -176357
13884 -176357 -263906 -310760 -281472 -267620 -177091 -127493 7741 20975 -95513 -241202 -256488
13873 -256488 -230633 -198659 52394 100283 38102 -141878 -64597 92759 74445 -340336 -518198
13862 -518198 -381274 -229592 -6194 158029 -23770 -178808 -167358 10055 127392 -11722
13852 -11722 -83795 -186946 -196213 -218378 -120090 -17459 -55928 94241 293766 240659 268954
13841 268954 239079 181253 189336 56972 50271 151425 258051 108774 -100170 -163426 -123570
13830 -123570 -152661 2096 49349 113935 2361 346 -9964 -6486 -177786 -117831 -112578
13819a12578N5201J96479n2222j06250K652n5817J01762j458J01295p0879q4332
13808b6147M6145m8418p5164n9448K1312N3933M4565J72335j9426j03164j09017
13797a02494k5322O1864k6590N247J22937J09212r2612o1591n8823Q6509J01098
13786A19435r7471J30011j20314k32649r2707J95463J33140N8237J34401n4586
13776A72960k8476k8653p0820n7154p2133J1359J63107K22874j17213m2077L7
13765A53811j46225J01772K29276K35661J99390N7444j01767J41389J32495L6183
13755A039429Q2612Q8905j35110q9662L7694k5824r5124n0319j88015j017n6694
13744F06875j33009j22849l5977j7920q7144R439j17038J16997K77806J23480
$$ plain form
13819 -112578 -57377 139102 86880 -19370 -16718 -72535 29227 27769 129064 58185 -26147
13808 -26147 19998 -28420 -103584 -163032 -141720 -87787 -43222 129113 109687 6523 -102494
13797 -102494 -127816 -65952 -92542 -87295 35642 144854 52242 -9349 -68172 18337 119435
13786 119435 21964 151975 31661 -200988 -293695 -98232 34908 93145 227546 172960
13776 172960 144484 115831 45011 -12143 -84276 -72917 90190 313064 195851 153774 153811
13765 153811 7586 109358 338634 574295 773685 831129 729362 870751 1003246 1039429
13755 1039429 1122041 1210946 1075836 986174 1023868 998044 902920 852601 664586 663569 606875
13744 606875 473866 351017 315040 297120 209976 219415 102377 219374 497180 620660
13734F20660l188r5138r7994k35q3386m0702M5290n2531n3936J58610J03339N4707
13722E55496K09739P6467k4541j38996K10417K54450K19805j5340r7849o9377
13712A180271j48428j98680j20241j83443o0414q2278p6407J2554Q1706o7891
13702C36749m1003j0551o0275M8516j42870m1447m552M633j49783j89712K157
13691b48138J18910J62831Q8198Q1392J03503Q2524k988k06935j35894o7905J64879
13680A40377J13876m7868q490m7461o8755P0648L8960l5544M7100p9978p5165
13669D7700m7844L8434j07494r6840R5361r9464k1968K21886R60P546J85815N2891
13657B76983j30960k72848j03102J2406J40172n8982j7181J85878M5933k8538
$$ plain form
13734 620660 617472 522334 424340 424105 340719 300017 345307 292776 238840 397450 500789 555496
13722 555496 765235 841702 817161 678165 888582 1143032 1362837 1347497 1249648 1180271
13712 1180271 1031843 833163 712922 529479 469065 386787 310380 322934 404640 336749
13702 336749 295746 285195 224920 273436 130566 89119 84567 89200 -60583 -250295 -248138
13691 -248138 -129228 33603 121801 203193 306696 389220 386232 179297 43403 -24502 140377
13680 140377 254253 206385 197895 150434 81679 152327 191287 155743 202843 122865 47700
13669 47700 -144 38290 -69204 -166044 -70683 -170147 -192115 29771 30731 38277 224092 276983
13657 276983 146023 -126825 -229927 -217521 -77349 -136331 -153512 32366 78299 49761
13647D9761L2903O6397m4810j61801j8372R9713M8140N0583j07788j12450m5094
13636a42818o194k7480Q9529L382j35451L2869L10778q6034M1479P2696r607m6099
13624I7050l2108q3129j64665J8651K2058o3674P5781Q2717J63659r4600k75147
13613b53407j75977P7674K28614K53199L8513n9490m0839R9586q755r5043l1971
13602C2104r2577r3446J02618J81540j11769n4547o6250j30753J17244K05568
13592H9732J25062J19860K8003j13258j36710J00814j2947k24192m4402J09903
13582D1865P5023K5539j09837k35377o7367K65564R7832o5738m1587o0882N7081
13571a7884l9023J30548Q6067j11371q0821q6221m5838K2520N4831l0310K01297
$$ plain form
13647 49761 82664 149061 104251 -57550 -75922 23791 71931 122514 14726 -97724 -142818
13636 -142818 -149012 -176492 -86963 -83581 -219032 -186163 124615 38581 80060 152756 143149 97050
13624 97050 64942 -18187 -182852 -164201 -142143 -205817 -130036 -47319 116340 21740 -253407
13613 -253407 -429384 -351710 -123096 130103 168616 109126 68287 167873 159118 64075 32104
13602 32104 -60473 -153919 -51301 130239 18470 -36077 -102327 -233080 -115836 89732
13592 89732 214794 334654 362657 249399 112689 213503 200556 -23636 -68038 41865
13582 41865 116888 142427 32590 -202787 -270154 -4590 93242 27504 -14083 -74965 -17884
13571 -17884 -56907 73641 159708 48337 -32484 -118705 -164543 -142023 -87192 -117502 83795
13560H3795Q5420p7388k54740j03740J92771j02825j8449m7260P6890R2396r04
13549g4034l0520M4866J25311l4923K3689p2097n2057J43846K7359o9002j6568
13538A5870o0577K7607R5716R7384j78794j4488j685K5592N3600p2638N9986J35781
13526A83354j20193o3652j1765O1673J52262m5917j67193n4195o7887O214M6405
13515h0894l4608O4464Q2374q6170l8616K16609k6024p1292K6682J35184j22203
13504F5506p1869R6667O8130o5779p1155M968o7755k6200k32169M1575K12146
13493d5935J09193j89970j1570o716l3698j02406j28328j27762J03916L33423
13483i9853k047K72668M297p1172k24196J41085J00882R0858P6036q3541k9766
$$ plain form
13560 83795 169215 91827 -162913 -266653 -73882 -176707 -195156 -242416 -165526 -73130 -74034
13549 -74034 -104554 -59688 65623 30700 54389 -17708 -69765 74081 101440 32438 15870
13538 15870 -44707 -17100 78616 176000 -2794 -17282 -18967 6625 60225 -12413 47573 183354
13526 183354 63161 -491 -12256 49417 201679 155762 -11431 -65626 -133513 -127299 -80894
13515 -80894 -115502 -51038 31336 -54834 -93450 123159 97135 25843 52525 187709 65506
13504 65506 -6363 90304 158434 92655 21500 26468 -41287 -67487 -299656 -258081 -45935
13493 -45935 63258 -126712 -138282 -144998 -178696 -281102 -409430 -537192 -433276 -99853
13483 -99853 -101900 170768 175065 103893 -120303 20782 121664 212522 288558 205017 175251
13472A75251J17683j81288j23109j46197k7081L4996J20430m1675J42021J29335
13462B00366l5965J33184Q6366j25348P5949J4652l0064j17580j07742m9815j14805
13451g0802r9234J32525J21910Q9975K2751K3361N5170n5594n6019j03641K1724
13440H2126M3426j81980k7471M2766j15738l0581N0844J80425J17952o5010j40969
13429d4210L7364J38116k1468o1584k4416l6776R5266j22318j08094J9744J12036
13418a6340P0342j16590j32510j28359r93J45906J21218P1635J86208m1851j38633
13407B0033j44336j2528m7986q926M6452Q8507L9727L7937Q613j44234P9468Q1515
13395D4242k08125K7674M157N2459M6569Q3860Q1878K8927j73599j02759K6844
$$ plain form
13472 175251 292934 111646 -11463 -157660 -184741 -149745 -29315 -70990 71031 200366
13462 200366 164401 297585 383951 258603 334552 349204 319140 201560 93818 44003 -70802
13451 -70802 -170036 -37511 84399 174374 197125 220486 275656 220062 164043 60402 82126
13440 82126 125552 -56428 -83899 -41133 -156871 -187452 -136608 43817 161769 96759 -44210
13429 -44210 -6846 131270 109802 48218 23802 -12974 82292 -40026 -148120 -128376 -16340
13418 -16340 54002 -62588 -195098 -323457 -324450 -178544 -57326 14309 200517 158666 20033
13407 20033 -124303 -136831 -184817 -193743 -147291 -58784 -19057 18880 27493 -116741 -37273 44242
13395 44242 -163883 -136209 -132052 -79593 -33024 50836 132714 161641 -11958 -114717 -87873
13384h7873K15832K8432j30727k11726L5648O0348m5440O9217O8386K7713N4158
13373H3968R8759J35763p4426L702n1656j3471q1879o9133N375M8788j57100j08431
13361a79741J02164L9724R3390l4193j14422k7472J09655J0417l1779m7089j08972
13350a88318L0191p3205J13881J17183J33180r7102R7662j2828j10219r765m7881
13339d7221j04344J51957p2701r9568O3844K82627j55985k33266J32905J41264
13329E9512P6593K1231q9155k9469K723p2212j27517R0851K32581j12427p1785
13318a9074M2101p227O0879N343j18056l9084O7975q0832J47640J67763r9492
13307A27936j61811l5782J52584J06093j0909o1102R0757K6043j21233o437o3634
$$ plain form
13384 -87873 127959 156391 25664 -186062 -150414 -90066 -135506 -66289 2097 29810 83968
13373 83968 182727 318490 244064 247766 196110 182639 100760 31627 37002 85790 -71310 -179741
13361 -179741 -77577 -37853 55537 21344 -93078 -120550 -10895 -478 -32257 -79346 -188318
13350 -188318 -158127 -231332 -117451 -268 132912 35810 133472 120644 10425 660 -47221
13339 -47221 -151565 392 -72309 -171877 -108033 174594 18609 -214657 -81752 59512
13329 59512 136105 157336 68181 38712 41435 -30777 -158294 -67443 165138 52711 -19074
13318 -19074 23027 15800 76679 82022 -36034 -75118 -7143 -87975 59665 227428 127936
13307 127936 -33875 -69657 82927 189020 178111 117009 207766 233809 112576 106139 42505
13296D2505N0190N0694m8124n7716J24664j6722o8878J18937O662K1539m2230
13285A81521n8889R0720L9182J43992P9124k15716r9069l7363K2530L5429p1232
13274A10229j1407P778l7740n0312l22213n1756L03042K30958J3920j20413o7111
13263D975m3038r4008p1501O8399Q9632j8117J48494j8259j02211J3467N9086
13252C6919j15589r5643j9922j1447J9945J27387R693j11486J3554p4652n9565
13241b80806q954L1032N6395J34925J37267n9304j2170O6227j43243k48097J97962
13230a28766J00837Q8732p3779l2454P0497r811M0937K4863N2309k0479q5979
13219B6907J72536J93029M4728k40425k81129O8161M1097o031L0792J3575J38136
$$ plain form
13296 42505 92695 143389 95265 37549 162213 145491 76613 195550 202212 223751 181521
13285 181521 122632 213352 252534 396526 475650 259934 160865 123502 146032 181461 110229
13274 110229 98822 106600 68860 18548 -303665 -355421 -52379 178579 192499 72086 4975
13263 4975 -38063 -132071 -203572 -135173 -45541 -63658 84836 66577 -35634 -22167 36919
13252 36919 -78670 -174313 -194235 -205682 -185737 -58350 -48657 -160143 -146589 -221241 -280806
13241 -280806 -289760 -258728 -202333 -67408 69859 10555 -1615 64612 -78631 -326728 -128766
13230 -128766 -27929 60803 -12976 -45430 25067 15256 56193 81056 133365 112886 26907
13219 26907 199443 392472 437200 196775 -84354 -16193 24904 18873 49665 63240 201376
13208B01376J28341j64500o9601k0820k56436Q1566J54537P1836j7544r7100Q3338
13197I4993R4291l8053j07204k2091P4419J04538L4194j58169m8766M6880Q0830
13186A55862J19326j62904j80173n682J52500K1067n4970p047r0238k04847K509
13175b54597J45836J86141J7546O4795m9320j55447j5217J18665N0760j46396
13165c7234k3455J13746N2849n2214o6263M2391j30885k4416K15541J69079r955
13154B49184J9461L1325M27P7894j18276k18056n4326j14184n0212P2995O7415
13143c6353l2947R014m0799N9527Q9821l8333o8019Q4828l2613Q882M5986K00270
13131B49264l748k40089n9872J56141o2275P634J48801r0268l06218Q4200J18013
$$ plain form
13208 201376 329717 165217 95616 74796 -181640 -100074 54463 126299 108755 11655 94993
13197 94993 189284 151231 44027 21936 96355 200893 235087 76918 28152 75032 155862
13186 155862 275188 112284 -67889 -73571 78929 99996 45026 37979 -52259 -257106 -254597
13175 -254597 -108761 77380 94926 159721 110401 -45046 -60263 58402 109162 -37234
13165 -37234 -60689 53057 105906 53692 -12571 29820 -101065 -125481 90060 259139 249184
13154 249184 268645 299970 300397 378291 260015 41959 -12367 -126551 -176763 -103768 -36353
13143 -36353 -69300 -60286 -101085 -41558 48263 9930 -58089 26739 -5874 3008 48994 249264
13131 249264 245516 5427 -54445 101696 39421 47055 195856 105588 -200630 -116430 1583
13120A583K04976P611j56080m0146o6828k3481p8810J6868P2374o5151J21389
13109e695O0214N0483j72959j21270n1898j589K41085L8984j35888j55529J308
13098b52754J48930P0686j27576Q355J02138R3394Q1297M0282n7416r3210q7827
13087g3701J5690J16875J63518K7465J18228m0011k28796j54023j08195L6578
13077a26372M6922N0037j05236L7367j2649K2306J28653p478j33739m1704k6415
13066a68308j542q707n1736J5151L1621R1801j10265M1760N7029R7777j11090
13055a16509J08147J62553j1365J9182J8612k5153j78316J0977r7881J4345P9778
13044a5630R8620j8087o3662j65554m7543K9935R138L89n7793J9744R8745K4597
$$ plain form
13120 1583 206559 214170 58090 17944 -48884 -72365 -151175 -134307 -61933 -127084 -5695
13109 -5695 54519 105002 -67957 -189227 -241125 -242714 -1629 37355 -98533 -254062 -252754
13098 -252754 -103824 -33138 -160714 -152359 -50221 43173 124470 164752 107336 14126 -73701
13087 -73701 -58011 58864 222382 249847 368075 328064 99268 -54755 -162950 -126372
13077 -126372 -79450 -29413 -134649 -97282 -109931 -87625 41028 33550 -100189 -141893 -168308
13066 -168308 -169850 -178557 -230293 -215142 -183521 -91720 -201985 -160225 -103196 -5419 -116509
13055 -116509 -8362 154191 142826 162008 180620 155467 -22849 -11872 -109753 -95408 -15630
13044 -15630 82990 64903 1241 -164313 -211856 -181921 -172783 -172394 -230187 -210443 -111698 -87101
13032h7101J07847k7488Q909Q9754m8633K2966L3050N8766j4972m440L3457J56303
13020C28418j09217l10981m7062K46747J24872j84328l665J75827J28683j44571
13010B04723j95200j34350K1631J4142J01246J39409p4055j34904M6722j13146
13000a23782l0393K20822O515L3737Q4652r2802r6212j81977L3248R7995M6030
12989b167j55009O5407J47131J07317m5981j16636j73889N9008R1229k3963J7836
12978b9717r8452j15541p3585J8107J28889K4826l1563K5790K16096K0575L8306
12967A23731L8671j4619J9936r1267j66236P3865L7628R9355k6491o1231l3822
12956d80j16681j11697r338J51203L6788O0554j37628L6097N9241k37706m035
$$ plain form
13032 -87101 20746 -6742 2167 91921 43288 66254 99304 158070 143098 138658 172115 328418
13020 328418 219201 -91780 -138842 107905 232777 48449 44784 220611 349294 204723
13010 204723 9523 -124827 -103196 -89054 12192 151601 77546 -57358 -10636 -123782
13000 -123782 -154175 66647 73162 106899 191551 98749 2537 -179440 -146192 -48197 -2167
12989 -2167 -157176 -91769 55362 162679 116698 62 -173827 -114819 -23590 -47553 -29717
12978 -29717 -128169 -243710 -317295 -299188 -170299 -145473 -177036 -151246 64850 85425 123731
12967 123731 162402 147783 167719 76452 -89784 -15919 21709 121064 94573 33342 -480
12956 -480 -117161 -228858 -238196 -86993 -50205 10349 -127279 -91182 -31941 -269647 -273682
12945b73682K45838R0186l3494l9445j21737m5007n215O0553J04387j04487M7399
12934g4704P7431k6538M6050Q7336L7228J44834o8017p5771j49504p234k6395
12923c5284J036J07580J8286k3420j06703q3454L1998K04244J40970j147q9592
12912A64514r7811J681R2444K0559j9494N1872m4508j73459j61755J5042J95069
12901D4154j11396j70992J351Q5963Q8490P1855q4754m115J9067j02521m3702
12890b06600R5507J22656J61272R1033m3063j20641j52524j9473k5401O5397m9188
12879h1025J1104j9599j26674M449O4782q9006O6916L8631J95268L4558j19849
12868b0445p9624J19979J22207q575J21373r7378j92192j12516N361J10729J23687
$$ plain form
12945 -273682 -27844 62342 28848 -10597 -132334 -177341 -182556 -122003 -17616 -122103 -74704
12934 -74704 2727 -23811 22239 109575 146803 291637 223620 147849 -1655 -8889 -35284
12923 -35284 -34248 73332 91618 68198 -38505 -121959 -89961 114283 255253 254106 164514
12912 164514 66703 68384 160828 181387 161893 213765 169257 -4202 -165957 -150915 44154
12901 44154 -67242 -238234 -236883 -150920 -62430 9425 -75329 -79444 -60377 -162898 -206600
12890 -206600 -111093 11563 172835 263868 220805 100164 -52360 -71833 -97234 -31837 -81025
12879 -81025 -69921 -89520 -216194 -211745 -146963 -235969 -169053 -130422 64846 99404 -20445
12868 -20445 -100069 19910 142117 133542 254915 157537 -34655 -147171 -141810 -31081 92606
12857I2606k6894l5076j3619N0809k9378J09443j6415m6592k7366p6788K3626
12846D356j35451j06218P1485K55228N5421j26303k8214J71221m7318Q3836K5261
$$ plain form
12857 92606 65712 30636 17017 67826 38448 147891 131476 84884 57518 -19270 4356
12846 4356 -131095 -237313 -165828 89400 144821 18518 -9696 161525 114207 198043 223304
$$ [...]
##END NTUPLES=NMR SPECTRUM
##END=
