##TITLE=Analysis number 328743
Compound Code cc 53024
Book Reference 407/153
Project Code adrs
Chemist Name andyw
##JCAMPDX= 6.0         $$ Bruker NMR JCAMP-DX V2.0
##DATA TYPE= NMR SPECTRUM
##DATA CLASS= NTUPLES
##ORIGIN= Bruker BioSpin GmbH
##OWNER= nmr
$$ XWIN-NMR		Version 3.5
$$ Fri Jun 29 11:13:17 2007 GMT Daylight Time (UT+1h)  MAYBRIDGE\nmr@NMR_250MHZ
##.OBSERVE FREQUENCY= 250.131544655141
##.OBSERVE NUCLEUS= ^1H
##.ACQUISITION MODE= SIMULTANEOUS (DQD)
##.ACQUISITION SCHEME= undefined
##.AVERAGES= 16
##.DIGITISER RES= 18
##SPECTROMETER/DATA SYSTEM= dpx250
##.PULSE SEQUENCE= zg30
##.SOLVENT NAME= CDCl3
##.SHIFT REFERENCE= (INTERNAL, CDCl3, 0, 16.445)
##AUDIT TRAIL= $$ (NUMBER, WHEN, WHO, WHERE, WHAT)
$$ ##TITLE= Audit trail, XWIN-NMR		Version 3.5
$$ ##JCAMPDX= 5.01
$$ ##ORIGIN= Bruker BioSpin GmbH
$$ ##OWNER= nmr
$$ C:\u/data/dgb/nmr/ADRS/2220/pdata/1/auditp.txt
$$ ##AUDIT TRAIL=  $$ (NUMBER, WHEN, WHO, WHERE, WHAT)
(   1,<2007-06-29 11:12:56.68 +100>,<MAYBRIDGE\nmr>,<NMR_250MHZ>,
      <created by zg, POWCHK disabled, PULCHK disabled
       configuration hash MD5:
       76 6E 9A 78 1E 09 19 81 EC 84 63 8F B0 6A 59 2D
       data hash MD5: 64K
       96 FD 74 61 37 8D 2C 8F 53 EA 4C 27 3C 9D 52 21>)
(   2,<2007-06-29 11:13:09.51 +100>,<MAYBRIDGE\nmr>,<NMR_250MHZ>,
      <Start of raw data processing
       ef LB = 0.3 FT_mod = 6 PKNL = 1 SI = 32K 
       data hash MD5: 32K
       FE DE AA 2A F5 E2 4F 7E 8B D6 86 DE 67 7B 5C 43>)
(   3,<2007-06-29 11:13:11.46 +100>,<MAYBRIDGE\nmr>,<NMR_250MHZ>,
      <apk 
       data hash MD5: 32K
       12 11 85 DB 88 30 57 67 80 BD E8 75 D4 D1 4C BD>)
(   4,<2007-06-29 11:13:12.17 +100>,<MAYBRIDGE\nmr>,<NMR_250MHZ>,
      <abs ABSG = 5 
       data hash MD5: 32K
       13 5E 3E 9C 3A 09 9A 37 04 A4 4C 50 64 08 40 C1>)
$$ ##END=
$$ 
$$ hash MD5
$$ 24 08 81 22 DE EF 5D 77 38 82 CF 54 08 A4 12 EE
##$RELAX= 
##$RELAX= 
##$RELAX= 
##$RELAX= 
##$RELAX= 
##$RELAX= 
##$RELAX= 
$$ Bruker specific parameters
$$ --------------------------
##$DU= <C:\u>
##$EXPNO= 2220
##$NAME= <ADRS>
##$PROCNO= 1
##$TYPE= <nmr>
##$USER= <dgb>
##$AMP= (0..31)
100 100 100 100 100 100 100 100 100 100 100 100 100 100 100 100 100 100 
100 100 100 100 100 100 100 100 100 100 100 100 100 100 
##$AQSEQ= 0
##$AQ_mod= 3
##$AUNM= <au_zg>
##$AUTOPOS= <11 >
##$BF1= 250.13
##$BF2= 250.13
##$BF3= 250.13
##$BF4= 250.13
##$BF5= 500.13
##$BF6= 500.13
##$BF7= 500.13
##$BF8= 500.13
##$BYTORDA= 1
##$CFDGTYP= 0
##$CFRGTYP= 5
##$CHEMSTR= <none>
##$CNST= (0..31)
1 1 145 1 1 1 1 1 1 1 1 1 1 1 1 1 1 1 1 1 1 1 1 1 1 1 1 1 1 1 1 1 
##$CPDPRG= <>
##$CPDPRG1= <>
##$CPDPRG2= <>
##$CPDPRG3= <>
##$CPDPRG4= <mlev>
##$CPDPRG5= <mlev>
##$CPDPRG6= <mlev>
##$CPDPRG7= <mlev>
##$CPDPRG8= <mlev>
##$CPDPRGB= <>
##$CPDPRGT= <>
##$D= (0..31)
0 1 0 0 0 0 0 0 0 0.06 0 0 0 0 0 0 0.0002 0 0 0 0 0 0 0 0 0 0 0 0 0 0 
0 
##$DATE= 1183111974
##$DBL= (0..7)
120 120 120 120 120 120 120 120 
##$DBP= (0..7)
150 150 150 150 150 150 150 150 
##$DBP07= 0
##$DBPNAM0= <>
##$DBPNAM1= <>
$$ [...]
##$SUBNAM7= <"">
##$SUBNAM8= <"">
##$SUBNAM9= <"">
##$SW= 20.6930455092707
##$SWIBOX= (0..15)
0 0 3 0 0 0 0 0 0 0 0 0 0 0 0 0 
##$SW_h= 5175.983436853
##$TD= 65536
##$TD0= 1
##$TE= 296.16
##$TE2= 300
##$TE3= 300
##$TEG= 300
##$TL= (0..7)
0 120 120 120 120 120 120 120 
##$TP= (0..7)
150 150 150 150 150 150 150 150 
##$TP07= 0
##$TPNAME0= <>
##$TPNAME1= <>
##$TPNAME2= <>
##$TPNAME3= <>
##$TPNAME4= <>
##$TPNAME5= <>
##$TPNAME6= <>
##$TPNAME7= <>
##$TPOAL= (0..7)
0.5 0.5 0.5 0.5 0.5 0.5 0.5 0.5 
##$TPOFFS= (0..7)
0 0 0 0 0 0 0 0 
##$TUNHIN= 0
##$TUNHOUT= 0
##$TUNXOUT= 0
##$USERA1= <user>
##$USERA2= <user>
##$USERA3= <user>
##$USERA4= <user>
##$USERA5= <user>
##$V9= 5
##$VALIST= <valist>
##$VCLIST= <CCCCCCCCCCCCCCC>
##$VD= 0
##$VDLIST= <DDDDDDDDDDDDDDD>
##$VPLIST= <PPPPPPPPPPPPPPP>
##$VTLIST= <TTTTTTTTTTTTTTT>
##$WBST= 1024
##$WBSW= 4
##$XGAIN= (0..3)
0 0 0 0 
##$XL= 0
##$YL= 0
##$YMAX_a= 372884
##$YMIN_a= -269802
##$ZGOPTNS= <>
##$ZL1= 120
##$ZL2= 120
##$ZL3= 120
##$ZL4= 120
##$ABSF1= 16.44496
##$ABSF2= -4.248213
##$ABSG= 5
##$ABSL= 3
##$ALPHA= 0
##$AQORDER= 0
##$ASSFAC= 0
##$ASSFACI= 0
##$ASSFACX= 0
##$ASSWID= 0
##$AUNMP= <proc_1d>
##$AZFE= 0.1
##$AZFW= 0.1
##$BCFW= 0
##$BC_mod= 0
##$BYTORDP= 0
##$COROFFS= 0
##$CY= 12.5
##$DATMOD= 1
##$DC= 0
##$DFILT= <>
##$DTYPP= 0
##$F1P= 14.0000005364418
##$F2P= -0.99999901652339
##$FCOR= 0.5
##$FTSIZE= 32768
##$FT_mod= 6
##$GAMMA= 0
##$GB= 0
##$INTBC= 1
##$INTSCL= 1
##$ISEN= 128
##$LB= 0.3
##$LEV0= 0
##$LPBIN= 0
##$MAXI= 10000
##$MC2= 0
##$MEAN= 0
##$ME_mod= 0
##$MI= 0
##$NCOEF= 0
##$NC_proc= -4
##$NLEV= 6
##$NOISF1= 0
##$NOISF2= 0
##$NSP= 0
##$NTH_PI= 0
##$NZP= 0
##$OFFSET= 16.44496
##$PC= 1
##$PHC0= -53.25956
##$PHC1= 9.850145
##$PH_mod= 1
##$PKNL= yes
##$PPARMOD= 0
##$PSCAL= 4
##$PSIGN= 0
##$REVERSE= no
##$SF= 250.130019269433
##$SI= 32768
##$SIGF1= 0
##$SIGF2= 0
##$SINO= 400
##$SIOLD= 32768
##$SREGLST= <1H.CDCl3>
##$SSB= 0
##$STSI= 32768
##$STSR= 0
##$SW_p= 5175.98343685301
##$SYMM= 0
##$S_DEV= 0
##$TDeff= 65536
##$TDoff= 0
##$TI= <Analysis number 999999
Compound Code 99
Book Reference 9
Project Code 9>
##$TILT= no
##$TM1= 0
##$TM2= 0
##$TOPLEV= 0
##$USERP1= <user>
##$USERP2= <user>
##$USERP3= <user>
##$USERP4= <user>
##$USERP5= <user>
##$WDW= 1
##$XDIM= 32768
##$YMAX_p= 393019640
##$YMIN_p= -270444
$$ End of Bruker specific parameters
$$ ---------------------------------
##NTUPLES= NMR SPECTRUM
##VAR_NAME=  FREQUENCY,     SPECTRUM/REAL,   SPECTRUM/IMAG
##SYMBOL=    X,             R,               I
##VAR_TYPE=  INDEPENDENT,   DEPENDENT,       DEPENDENT
##VAR_FORM=  AFFN,          ASDF,            ASDF
##VAR_DIM=   32768,         32768,           32768
##UNITS=     HZ,            ARBITRARY UNITS, ARBITRARY UNITS
##FACTOR=    0.157963299565203, 1,           1
##FIRST=     4113.37807176405, 0,            0
##LAST=      -1062.60536508896, 0,           0
##MIN=       -1062.60536508896, -270444,     0
##MAX=       4113.37807176405, 393019640,    0
$$ Real data points
##PAGE= N=1
##DATA TABLE= (X++(R..R)), XYDATA
$$ [...]
$$ plain form
19482 453700 446473 534892 648280 679918 634484 663811 643157 627687 585124 522824 483658
19471 483658 532072 562501 603661 656944 654710 601827 565379 663300 751251 826377 866232 958554
19459 958554 977667 945859 992585 1022579 1056783 1113129 1064211 1048165 989921 940346 951294
19448 951294 909951 809791 727584 701299 733575 724177 676911 689916 700931 700778 737626 796264
19436 796264 834322 790800 816716 807373 817262 909490 988491 997082 1075233 1151520 1218238 1273894
19424 1273894 1305530 1381204 1418420 1459936 1505652 1567078 1581572 1591117 1646883 1749920 1833454
19413 1833454 1907012 2028363 2163545 2247040 2395427 2690215 2972895 3259916 3587549 3969733
19403 3969733 4316897 4584691 4873745 5196565 5613474 6098445 6708696 7666633 9125844
$$ packed form
19482D53700p227Q8419J13388L1638m5434K9327k0654j5470m2563o2300l9166
19471D83658M8414L0429M1160N3283k234n2883l6448R7921Q7951P5126L9855R2322
19459I58554J9113l1808M6726K9994L4204N6346m8918j6046n8244m9575J0948
19448I51294m1343j00160q2207k6285L2276r398m7266J3005J1015j53L6848N8638
19436G96264L8058m3522K5916r343R889R2228P9001Q591P8151P6287O6718N5656
19424A273894L1636P5674L7216M1516M5716O1426J4494R545N5766J03037Q3534
19413A833454P3558J21351J35182Q3495J48387K94788K82680K87021L27633L82184
19403C969733L47164K67794K89054L22820M16909M84971O10251R57937J459211
$$ plain form
19394 9125844 11396174 14458316 17880744 20976800 22930528 23337640 22678957 21959580 22264166
19385 22264166 24449359 29218491 37602402 51112784 71076307 96679364 123844048
19378 123844048 145112800 154437041 150795282 137797336 119477302 98873183 78734452
19371 78734452 61923659 50310154 44679436 44388365 47521841 51301278 52779251 50015748
19363 50015748 43327246 34736635 26547192 20153641 15635640 12690587 10890733 9834492
19355 9834492 9361403 9241137 9241486 9333347 9492869 9615145 9738953 9848286 10087316 10502901
19345 10502901 11144422 12312390 14149432 16999588 21311164 27578650 35750620 44914235
19337 44914235 52916285 57449614 57362689 53876888 50017850 48679773 52205690 61930070
$$ packed form
19394I125844K270330L062142L422428L096056J953728M07112o58683p19377L04586
19385B2264166K185193M769132Q383911J3510382J9963523K5603057K7164684
19378A23844048K1268752R324241l641759j2997946j8320034k0604119k0138731
19371G8734452j6810793j1613505n630718k91071L133476L779437J477973k763503
19363E0015748o688502q590611q189443o393551m518001k945053j799854j056241
19355I834492m73089j20266L49R1861J59522J22276J23808J09333K39030M15585
19345A0502901O41521J167968J837042K850156M311576O267486Q171970R163615
19337D4914235Q002050M533329q6925l485801l859038j338077L525917R724380
$$ plain form
19329 61930070 78234935 100044530 124734654 148751126 168288628 178728183 175287715
19322 175287715 156545535 126920131 94902716 67614961 48270424 36437876 30148325
19315 30148325 27561584 27555557 29298139 31696479 33551318 34204508 33603603 32239849 31051572
19306 31051572 31203326 33375617 36123447 37301392 36853662 36627815 37013478 36314648 33614878
19297 33614878 30085988 27550234 26302200 25786754 25475892 25629212 26928167 29657327
19289 29657327 32548226 33842684 33287060 32578523 32339843 31177833 28069542 23832008
19281 23832008 20026315 16800053 13990640 11362537 9168491 7560079 6525725 5932956
19273 5932956 5515074 5216323 5026927 4913077 4849399 4881377 4924979 4938257 5099726 5349030
$$ packed form
19329F1930070J6304865K1809595K4690124K4016472J9537502J0439555l440468
19322A75287715j8742180k9625404l2017415k7287755j9344537j1832548o289551
19315C0148325k586741o027J742582K398340J854839O53190o00905j363754j188277
19306C1051572J51754K172291K747830J177945m47730k25847L85663o98830k699770
19297C3614878l528890k535754j248034n15446l10862J53320J298955K729160
19289B9657327K890899J294458n55624p08537k38680j162010l108291m237534
19281B3832008l805693l226262k809413k628103k194046j608412j034354n92769
19273E932956m17882k98751j89396j13850o3678L1978M3602J3278J61469K49304
$$ plain form
19263 5349030 5754406 6350869 7150730 8212576 9895177 12384331 15895253 20163452 24576416
19254 24576416 28948412 34187451 40880408 46842911 49752394 50042669 50416410 51448991
19246 51448991 50652410 46840609 41826438 38445021 37086133 36687734 36587078 37119706 39430140
19237 39430140 44050153 48680244 50645240 49953699 49296507 49200267 47205989 41979072 35138231
19228 35138231 29024943 23931840 19269839 14902283 11286362 8667774 6884783 5639405
19220 5639405 4822891 4236864 3759526 3339378 3026859 2791005 2575653 2299771 2083054
19211 2083054 1938063 1763233 1565781 1417025 1233935 1149016 1099768 1047106 1001921 931735
19201 931735 900786 903154 816195 762231 836538 852043 822491 746745 693991 672401 635721 609623
$$ packed form
19263E349030M05376N96463P99861J061846J682601K489154L510922M268199M412964
19254B4576416M371996N239039O692957N962503K909483K90275L73741J032581
19246E1448991p96581l811801n014171l381417j358888l98399j00656N32628K310434
19237C9430140M620013M630091J964996o91541o57192r6240j994278n226917o840841
19228C5138231o113288n093103m662001m367556l615921k618588j782991j245378
19220E639405q16514n86027m77338m20148l12519k35854k15352k75882k16717
19211B083054j44991j74830j97452j48756j83090q4919m9248n2662m5185p0186
19201I31735l0949K368q6959n3964P4307J5505k9552p5746n2754k1590l6680k6098
$$ plain form
19189 609623 564358 552364 568296 559607 555547 534449 583282 608324 633339 565061 497975 454540
19177 454540 382165 397521 416305 476339 511514 482262 431552 431344 474599 508861 544828 493790
19165 493790 403193 367991 356501 369486 380334 321408 305579 358695 405697 463820 463075 383862
19153 383862 325198 325833 379153 411935 389091 385958 442355 538231 550394 518038 499276 461886
19141 461886 415437 405427 439540 447894 433051 390246 414132 483429 485547 501556 456227 447666
19129 447666 520779 555663 590676 480991 424010 411481 362474 365515 400809 403271 521011
19118 521011 604763 621490 680663 755382 773695 761471 772429 728732 652015 696884 728110
19107 728110 762540 766025 807603 852958 882800 876495 935894 976754 1067930 1121341 1169902 1206623
$$ packed form
19189F09623m5265j1994J5932q689m060k1098M8833K5042K5015o8278o7086m3435
19177D54540p2375J5356J8784O0034L5175k9252n0710k08M3255L4262L5967n1038
19165D93790r0597l5202j1490J2985J0848n8926j5829N3116M7002N8123p45p9213
19153C83862n8664O35N3320L2782k2844l133N6397R5876J2163l2356j8762l7390
19141D61886m6449j0010L4113Q354j4843m2805K3886O9297K118J6009m5329q561
19129D47666P3113L4884L5013j09685n6981j2529m9007L041L5294K462J17740
19118E21011Q3752J6727N9173P4719J8313j2224J0958m3697p6717M4869L1226
19107G28110L4430L485M1578M5355K9842o305N9399M0860R1176N3411M8561L6721
$$ plain form
19095 1206623 1314233 1459867 1614584 1783276 1961360 2148490 2352667 2565547 2820631
19086 2820631 3019319 3317393 3714511 4121595 4606153 5220118 5910725 6898995 8206556
19077 8206556 10001967 12510941 15968779 20460171 25625871 31154490 37591309 45863547
19069 45863547 55403963 63553223 68755555 72664489 77984768 84027706 86905193 84093326
19061 84093326 77780531 72078693 68082970 63042509 54987768 45187621 36556821 30055416
19053 30055416 24700701 19777394 15259208 11665073 9118037 7387111 6213366 5403586
19045 5403586 4788098 4327862 3955619 3652654 3425882 3293929 3243062 3234222 3243289 3171291
19035 3171291 3086812 3069981 3098125 3193525 3318321 3443938 3630259 4016902 4553014 5169299
$$ packed form
19095A206623J07610J45634J54717J68692J78084J87130K04177K12880K55084
19086B820631J98688K98074L97118M07084M84558O13965O90607R88270J307561
19077H206556J795411K508974L457838M491392N165700N528619O436819Q272238
19069D5863547R540416Q149260N202332L908934N320279O042938K877487k811867
19061H4093326o312795n701838l995723n040461q054741r800147q630800o501405
19053C0055416n354715m923307m518186l594135k547036j730926j173745q09780
19045E403586o15488m60236l72243l02965k26772j31953n0867q840R067p1998
19035C171291q4479j6831K8144R5400J24796J25617J86321L86643N36112O16285
$$ plain form
19025 5169299 5949209 6998214 8562191 10887665 13761501 16961119 20505044 24597151
19017 24597151 29878536 35862222 40847553 44030445 46457985 49893762 53715314 55305214
19009 55305214 53224036 49106055 45484209 42880746 39615636 34437695 28107341 22547283
19001 22547283 18454831 15176515 12028200 9193548 6912113 5282393 4247047 3551782
18993 3551782 2990509 2652371 2359554 2116249 1917929 1785142 1668738 1567281 1436542
18984 1436542 1296524 1136083 1001311 880501 768829 739289 710643 743761 716276 639898
18974 639898 634926 603363 592424 559186 546827 593878 624882 588425 496911 430237 420099 424888
18962 424888 457708 454847 436340 396732 365435 389918 336500 286309 324845 306094 242601 212378
$$ packed form
19025E169299P79910J049005J563977K325474K873836L199618L543925M092107
19017B4597151N281385N983686M985331L182892K427540L435777L821552J589900
19009E5305214k081178m117981l621846k603463l265110n177941o330354n560058
19001B2547283m092452l278316l148315k834652k281435j629720j035346o95265
18993C551782n61273l38138k92817k43305j98320j32787j16404j01457j30739
18984A436542j40018j60441j34772j20810j11672k9540k8646L3118k7485p6378
18974F39898m972l1563j0939l3238j2359M7051L1004l6457r1514o6674j0138M789
18962D24888L2820k861j8507l9608l1297K4483n3418n0191L8536j8751o3493l0223
$$ plain form
18950 212378 199948 217368 224988 201914 168329 204096 244126 220935 197121 206306 197882 209869
18938 209869 209830 172928 159391 135530 119935 106076 137942 140149 143076 101625 120484 149314
18926 149314 117478 89177 94964 70346 106737 152521 193619 260982 276412 293563 278959 237591
18914 237591 241157 238817 182194 112875 33496 136098 175689 174191 181244 205603 130034 96310
18902 96310 166715 208715 226310 205189 166505 79995 90130 75355 28307 28023 80646 54923
18890 54923 48845 106110 197124 197895 120499 153542 158666 236212 273034 237764 242355 207429 169082
18877 169082 292236 413111 541791 612398 667237 630718 547287 529570 539993 589061 606894
18866 606894 563849 571400 657501 774007 870023 915163 908671 817583 747911 685314 542011
$$ packed form
18950B12378j2430J7420P620k3074l3585L5767M0030k3191k3814R185q424J1987
18938B09869l9l6902j3537k3861j5595j3859L1866K207K927m1451J8859K8830
18926A49314l1836k8301N787k4618L6391M5784M1098O7363J5430J7151j4604m1368
18914B37591L566k340n6623o9319p9379J02602L9591j498P053K4359p5569l3724
18902I6310P0405M2000J7595k1121l8684q6510J0135j4775m7048k84N2623k5723
18890E4923o078N7265R1014P71p7396L3043N124P7546L6822l5270M591l4926l8347
18877A69082J23154J20875J28680P0607N4839l6519q3431j7717J0423M9068J7833
18866F06894m3045P551Q6101J16506R6016M5140o492r1088o9672o2597j43303
$$ plain form
18855 542011 357176 276406 243264 225267 168249 195524 267475 217124 137966 118610 141065
18844 141065 97748 36157 63408 92907 191016 238796 240973 258897 219653 132188 79575 54193
18832 54193 50233 170215 280427 402266 385076 382764 425357 529550 552767 585799 641867
18821 641867 704041 706401 715132 658798 597277 498058 437542 379100 315207 382304 481756 667071
18809 667071 912286 1092546 1157993 1109324 958407 839906 692468 504438 320275 264063
18799 264063 270882 243182 244070 294761 270916 242710 216735 206560 201105 270945 271802 221795 201441
18786 201441 169961 129242 95968 91932 125413 118191 156243 208053 183472 167187 212799 321042
18774 321042 453460 500473 500572 538869 546699 530046 664741 907918 1041798 1104627 934201
$$ packed form
18855E42011j84835q0770l3142j7997n7018K7275P1951n0351p9158j9356K2455
18844A41065m3317o1591K7251K9499R8109M7780K177J7924l9244q7465n2613k5382
18832E4193l960J19982J10212J21839j7190k312M2593J04193K3217L3032N6068
18821F41867O2174K360Q731n6334o1521r9219o0516n8442o3893O7097R9452J85315
18809F67071K45215J80260O5447m8669j50917j18501j47438j88030j84163n6212
18799B64063O819k7700Q88N0691k3845k8206k5975j0175n455O9840Q57n0007k0354
18786B01441l1480m0719l3274m036L3481p222L8052N1810k4581j6285M5612J08243
18774C21042J32418M7013R9L8297P830j6653J34695K43177J33880O2829j70426
$$ plain form
18763 934201 708546 637386 604094 520142 479833 478301 447545 482615 519468 522095 469191 434610
18751 434610 359320 368036 362748 339893 263352 162893 140188 189242 229423 202266 224362 287839
18739 287839 251911 243812 227525 137726 137268 179580 198516 281616 321690 263357 199216 199895
18727 199895 197875 276677 238565 194945 230945 242359 227785 303345 293587 294360 342868 373879
18715 373879 428323 456994 439593 458507 530663 463007 376987 313175 264009 306945 353718
18704 353718 366158 376138 393928 368584 385931 440743 406929 454040 467833 397317 380958 348565
18692 348565 275162 311025 332172 358327 348704 375951 405064 382675 324247 383358 389566 340193
18680 340193 288951 321575 394264 413759 407078 539952 543440 502138 514791 533109 543493 528089
$$ packed form
18763I34201k25655p1160l3292q3952m0309j532l0756L5070L6853K627n2904l4581
18751D34610p5290Q716n288k2855p6541j00459k2705M9054M0181k7157K2096O3477
18739B87839l5928q099j6287q9799m58M2312J8936Q3100M0074n8333o4141O79
18727A99895k020P8802l8112m3620L6000J1414j4574P5560r758P73M8508L1011
18715C73879N4444K8671j7401J8914P2156o7656q6020o3812m9166M2936M6773
18704C53718J2440R980J7790k5344J7347N4812l3814M7111J3793p0516j6359l2393
18692C48565p3403L5863K1147K6155r623K7247K9113k2389n8428N9111O208m9373
18680C40193n1242L2624P2689J9495o681J32874L488m1302J2653J8318J0384j5404
$$ plain form
18668 528089 584247 622657 742496 838986 914923 1026915 1191306 1237100 1258912 1239216 1230808
18657 1230808 1315511 1316703 1226383 1186432 1160228 1123061 1176060 1207545 1375926 1564137 1888228
18646 1888228 2412663 3077706 3810183 4260695 4413627 4266537 3925464 3562815 3180463
18637 3180463 2690391 2224801 1932899 1767078 1793540 1947172 2085713 2133241 2057686 1897001
18627 1897001 1691696 1551006 1407060 1242372 1188656 1254823 1371190 1425045 1379182 1367977
18617 1367977 1422801 1407886 1475334 1608980 1769211 1911822 2006334 2065841 2203825 2406402
18607 2406402 2708923 3027268 3335288 3717923 4094739 4302472 4320111 4362606 4478014 4727700
18597 4727700 5161876 5792068 6732483 7894342 9280209 11022164 12822102 14504257 16108735
$$ packed form
18668E28089N6158L8410J19839R6490P5937J11992J64391M5794K1812j9696q408
18657A230808Q4703J192r0320l9951k6204l7167N2999L1485J68381J88211L24091
18646A888228N24435O65043P32477M50512J52932j47090l41073l62649l82352
18637C180463m90072m65590k91902j65821K6462J53632J38541M7528p5555j60685
18627A897001k05305j40690j43946j64688n3716O6167J16367N3855m5863j1205
18617A367977N4824j4915O7448J33646J60231J42611R4512N9507J37984K02577
18607B406402L02521L18345L08020L82635L76816K07733J7639M2495J15408K49686
18597D727700M34176O30192R40415J161859J385867J741955J799938J682155J604478
$$ plain form
18588 16108735 17670074 19211967 20665457 22207614 23943579 25606536 26645841 27003226
18580 27003226 27469680 28826937 31788191 37555131 47814163 63564054 82972574 103926256
18572 103926256 126234196 146562431 157602722 157175965 149503516 136720906 118019784
18565 118019784 96807827 78633670 65262605 56409401 51639604 49982322 50225346 50799823
18557 50799823 49706352 45890374 40194551 33972244 27721076 21935772 17390958 14204696
18549 14204696 12101584 10840198 10139731 9703520 9573489 9539155 9533289 9567718 9605249 9827006
18539 9827006 10234406 10905400 11929370 13556157 16111886 19847559 24779175 30432571
18531 30432571 36205939 41840842 46382667 48625485 48887953 48863392 50260395 54207482
$$ packed form
18588A6108735J561339J541893J453490J542157J735965J662957J039305L57385
18580B7003226M66454J357257K961254N766940J0259032J5749891J9408520K0953682
18572A03926256K2307940K0328235J1040291m26757p672449j2782610j8701122
18565A18019784k1211957j8174157j3371065q853204m769797j657282K43024N74477
18557E0799823j093471l815978n695823o222307o251168n785304m544814l186262
18549A4204696k103112j261386p00467m36211j30031l4334n866L4429L7531K21757
18539I827006M07400O70994J023970J626787K555729L735673M931616N653396
18531C0432571N773368N634903M541825K242818K62468k4561J397003L947087
$$ plain form
18523 54207482 61178384 71605441 86332853 104009898 119423008 129586497 135906721
18516 135906721 136928549 128262498 110747007 90866757 72000210 54449688 39995558
18509 39995558 30172362 24621636 22004952 20943248 20641573 20492589 19804268 18241303
18501 18241303 16102829 13841272 11461403 9209795 7558334 6406463 5562134 4937135
18493 4937135 4504080 4255372 3935708 3670166 3529413 3318182 3002684 2755717 2603083
18484 2603083 2465692 2271413 2099874 1986205 1914983 1935433 2045211 2134603 2107369 2083838
18474 2083838 2095499 2081348 2046723 2076439 2149150 2299116 2621082 3147151 3824494 4741351
18464 4741351 5698610 6609579 7179274 7295414 7001539 6361581 5517176 4515016 3588920
$$ packed form
18523E4207482O970902J0427057J4727412J7677045J5413110J0163489O320224
18516A35906721J021828q666051j7515491j9880250j8866547j7550522j4454130
18509C9995558r823196n550726k616684j061704l01675j48984o88321j562965
18501A8241303k138474k261557k379869k251608j651461j151871q44329o24999
18493D937135m33055k48708l19664k65542j40753k11231l15498k46967j52634
18484B603083j37391j94279j71539j13669p1222K0450J09778Q9392k7234k3531
18474B083838J1661j4151l4625K9716P2711J49966L21966N26069O77343R16857
18464D741351R57259R10969N69695J16140k93875o39958q44405j002160r26096
$$ plain form
18455 3588920 2913388 2432806 2162235 2024048 2046546 2122227 2175303 2119895 1942220 1720959
18445 1720959 1464571 1270623 1119115 956153 815711 758363 768237 709706 599866 573911
18435 573911 634620 606818 600445 637975 573428 493756 533166 608753 713989 761884 886932
18424 886932 1079444 1311229 1519380 1551571 1571127 1542145 1555901 1631144 1767213 1924892
18414 1924892 2183992 2558402 2958403 3312525 3536916 3653731 3609676 3338197 2903375 2458414
18404 2458414 1992972 1484691 1094242 891063 778936 697466 577887 580275 623857 584229
18394 584229 600216 531007 405355 362962 277027 262749 188277 122703 146212 177941 121342
18383 121342 117671 169252 250314 158314 112820 146630 154832 173727 188712 195854 158461 122172
$$ packed form
18455C588920o75532m80582k70571j38187K2498P5681N3076n5408j77675k21261
18445A720959k56388j93948j51508j62962j40442n7348R874n8531j09840k5955
18435E73911O0709k7802o373L7530o4547p9672L9410P5587J05236M7895J25048
18424H86932J92512K31785K08151L2191J9556k8982J3756P5243J36069J57679
18414A924892K59100L74410M00001L54122K24391J16815m4055k71479m34822m44961
18404B458414m65442n08281l90449k03179j12127q1470j19579K388M3582l9628
18394E84229J5987o9209j25652m2393q5935j4278p4472o5574K3509L1729n6599
18383A21342l671N1581Q1062r2000m5494L3810Q202J8895J4985P142l7393l6289
$$ plain form
18371 122172 123237 187285 195310 202406 155248 174132 200994 165566 108960 13876 -1966 32391
18359 32391 27526 78745 156578 126265 111220 103146 131573 97987 130025 198421 142052 118527
18347 118527 65885 60068 119417 157465 179606 185749 161743 123087 189259 198730 164776 149615
18335 149615 173292 186881 184119 180288 205976 170818 98340 57844 60583 93270 147552 162326
18323 162326 137398 100858 31010 15609 -11624 20286 128274 167615 102136 79978 112412
18312 112412 85470 69825 70838 38367 -12330 41709 135360 172308 69859 1202 4323 20695
18300 20695 18846 32582 66179 61871 75675 43583 -25558 -50750 -29154 -41456 -114371 -141565
18288 -141565 -161011 -179314 -68214 62735 133351 159550 120207 132133 92681 85684 44088
$$ packed form
18371A22172J065O4048Q025P096m7158J8884K6862l5428n6606r5084j5842L4357
18359C2391m865N1219P7833l0313j5045q074K8427l3586L2038O8396n6369k3525
18347A18527n2642n817N9349L8048K2141O143k4006l8656O6172R471l3954j5161
18335A49615K3677J3589k762l831K5688l5158p2478m0496K739L2687N4282J4774
18323A62326k4928l6540o9848j5401k7233L1910J07988L9341o5479k2158L2434
18312A12412k6942j5645J013l2471n0697N4039R3651L6948j02449o8657L121J6372
18300B0695j849J3736L3597m308J3804l2092o9141k5192K1596j2302p2915k7194
18288a41565j9446j8303J11100J30949P0616K6199l9343J1926l9452o997m1596
$$ plain form
18277 44088 8501 48056 54428 20943 -8360 20436 23255 -33902 5504 -7481 -23084 18627
18265 18627 81306 131036 132196 115999 81850 78156 120258 121095 33236 -26793 -36837 9264
18253 9264 35420 31794 38754 100482 122876 58625 78225 62849 45984 21159 46317 27395
18241 27395 -11212 -40621 -61534 13160 14716 43802 93896 52584 6901 16054 -5211 52315
18229 52315 116213 79968 4003 27183 31240 38227 67439 33687 48949 102895 143144 108392
18217 108392 57132 75862 142911 144764 127717 142733 145620 83449 61690 68466 43984 -13949
18205 -13949 -44191 -36563 -23899 19433 59661 139403 140878 65499 -4372 -29223 74967 128859
18193 128859 66652 36260 55816 68700 62127 22890 79565 174085 253769 197593 143017 131337
$$ packed form
18277D4088l5587L9555O372l3485k9303K8796K819n7157L9406j2985j5603M1711
18265A8627O2679M9730J160j6197l4149l694M2102Q37q7859o0029j0044M6101
18253I264K6156l626O960O1728K2394o4251J9600j5376j6865k4825K5158j8922
18241B7395l8607k9409k0913P4694J556K9086N0094m1312m5683R153k1265N7526
18229E2315O3898l6245p5965K3180M057O987K9212l3752J5262N3946M0249l4752
18217A08392n1260J8730O7049J853j7047J5016K887o2171k1759O776k4482n7933
18205a3949l0242P628J2664M3332M0228P9742J475p5379o9871k4851J04190N3892
18193A28859o2207l0392J9556J2884o573l9237N6675R4520P9684n6176n4576j1680
$$ plain form
18181 131337 78948 104925 147444 141519 84278 14001 -19474 -55698 -26409 40354 109196 74690
18169 74690 133808 164554 165990 159728 155816 90407 94573 116032 122614 119524 138248 81943 56169
18156 56169 106821 158897 199493 190814 222409 254001 255761 259584 277129 274411 286850 334354
18144 334354 393172 376096 407680 440974 517075 558836 508120 505173 542178 570371 645778 722735
18132 722735 845318 888989 955464 1071941 1181732 1340681 1508966 1788500 2074586 2256042
18122 2256042 2559775 2970517 3412341 4044724 4922409 6057202 7741220 10136924 13429999
18113 13429999 18445498 26454580 40213836 64934842 105661184 143641776 149689428
18106 149689428 117451318 73776020 43088738 26118525 17120943 12093003 9062165
$$ packed form
18181A31337n2389K5977M2519n925n7241p0277l3475l6224K9289O6763O8842l4506
18169G4690N9118L0746J436o262l912o5409M166K1459O582l090J8724n6305k5774
18156E6169N0652N2076M0596q679L1595L1592J760L823J7545k718J2439M7504
18144C34354N8818j7076L1584L3294P6101M1761n0716k947L7005K8193P5407P6957
18132G22735J22583M3671O6475J16477J09791J58949J68285K79534K86086J81456
18122B256042L03733M10742M41824O32383Q77685J134793J684018K395704L293075
18113A3429999N015499Q009082J3759256K4721006M0726342L7980592O047652
18106A49689428l2238110m3675298l0687282j6970213q997582n027940l030838
$$ plain form
18099 9062165 7013328 5614500 4662364 3910255 3327334 2869937 2444197 2053672 1716680
18090 1716680 1481050 1356159 1248180 1197766 1110532 1012373 934113 880992 869674 810334 793031
18079 793031 660618 599173 574166 594378 664778 642034 578926 621832 670138 698187 755546
18068 755546 802821 794612 731297 695048 706640 757842 827986 849512 737768 685071 740615
18057 740615 784471 740943 728921 658832 580211 489514 447150 379482 292785 225226 214615
18046 214615 284841 342385 335180 362643 404360 444456 402116 295930 189257 139632 72072
18035 72072 69238 75232 125596 98439 87558 103141 116884 76858 72777 130171 253590 361762
18023 361762 379457 404543 434462 449521 490357 483981 480200 483485 492604 494923 530001 431088
$$ packed form
18099I062165k048837j398828r52136p52109n82921m57397m25740l90525l36992
18090A716680k35630j24891j07979n0414q7234r8159p8260n3121j1318n9340j7303
18079G93031j32413o1445k5007K0212P0400k2744o3108M2906M8306K8049N7359
18068G55546M7275q209o3315l6249J1592N1202P0144K1526j11744n2697N5544
18057G40615M3856m3528j2022p0089p8621r0697m2364o7668q6697o7559j0611
18046B14615P0226N7544p205K7463M1717M0096m2340j06186j06673m9625o7560
18035G2072k834N994N0364k7157j0881J5583J3743m0026m081N7394J23419J08172
18023C61762J7695K5086K9919J5059M0836o376l781L285R119K319L5078r8913
$$ plain form
18011 431088 284872 220090 144410 210523 332252 466386 506039 514217 538230 462126 435940
18000 435940 420871 368819 341575 316695 213464 108358 73243 35467 -61627 -93358 2053
17989 2053 42236 -191 16750 73248 125927 66717 19992 23775 32146 86871 36691 7999
17977 7999 3065 -29368 -72687 24894 80194 21360 -13069 1204 17094 31391 24047 59932
17965 59932 56539 35615 52453 41222 35527 11073 -13121 26516 22758 -31205 -33775 -1877
17953 -1877 -1597 -56212 -117688 -129694 -41596 -11939 -12071 -55463 -102014 -73018 21264 58285 30305
17940 30305 764 25403 59504 14997 5345 39702 105903 45386 -85671 -100396 -56600 -13169
17928 -13169 5586 -60415 -114547 -85224 -42644 -77467 -62882 -10447 32407 62395 49715 26533
$$ packed form
18011D31088j46216o4782p5680O6113J21729J34134L9653Q178K4013p6104k6186
18000D35940j5069n2052k7244k4880j03231j05106l5115l7776r7094l1731R5411
17989B053M0183m2427J6941N6498N2679n9210m6725L783Q371N4725n0180k8692
17977G999m934l2433m3319R7581N5300n8834l4429J4273J5890J4297p344L5885
17965E9932l393k0924J6838j1231n695k4454k4194L9637l758n3963k570L1898
17953a877K80n4615o1476j2006Q8098K9657j32m3392m6551K8996R4282L7021k7980
17940C0305k9541K4639L4101m4507r652L4357O6201o0517j31057j4725M3796M3431
17928a3169J8755o6001n4132K9323M2580l4823J4585N2435M2854K9988j2680k3182
$$ plain form
17916 26533 11634 -41618 -76885 -73761 -36755 -84015 -65872 -11195 20490 -36876 -7159 50072
17904 50072 47962 93669 98506 30801 -41863 -77301 -140109 -145699 -144773 -59939 -55163 -86653 -9191
17891 -9191 43931 -15366 -105419 -129073 -72982 -34583 -116687 -140316 -74273 -32842 -77518 -89596
17879 -89596 -58020 -69884 -127369 -212099 -270444 -257090 -197886 -129637 -44244 -27266 -16718 -4385
17867 -4385 -24163 -46111 -46735 -35107 -30235 -34224 -34564 -7611 -25182 -51388 -83171 -16241 31988
17854 31988 38717 -29248 -62336 -60458 -38494 -38969 -146430 -181306 -174475 -147081 -81000 -70126
17842 -70126 -57213 10140 68560 41389 -32096 -56336 -14977 30487 58063 52790 -3098 73475
17830 73475 119307 72357 62005 66687 122371 169610 96105 12576 38838 18079 -26141 11848
$$ packed form
17916B6533j4899n3252l5267L124L7006m7260J8143N4677L1685n7366K9717N7231
17904E0072k110M5707M837o7705p2664l5438o2808n590R26Q4834M776l1490P7462
17891i191N3122n9297r0053k3654N6091L8399q2104k3629O6043M1431m4676j2078
17879h9596L1576j1864n7485q4730n8345J3354N9204O8249Q5393J6978J0548J2333
17867d385j9778k1948o24J1628M872l989l40K6953j7571k6206l1783O6930M8229
17854C1988O729o7965l3088J878K1964m75j07461l4876O831K7394O6081J0874
17842g0126J2913O7353N8420k7171p3485k4240M1359M5464K7576n273n5888P6573
17830G3475M5832m6950j0352M682N5684M7239p3505q3529K6262k0759m4220L7989
$$ plain form
17818 11848 29089 -17466 -5551 -41261 -27252 29217 -19834 -84869 -37846 -47684 -65510 -80261
17806 -80261 -128889 -173100 -167800 -90765 -53196 -50535 -63873 -50558 -21496 -31050 -41101 -2007
17794 -2007 11944 60542 77089 62069 82013 32225 -12574 -52613 -60739 -37071 190 -1962
17782 -1962 -55475 -52762 -90858 -104139 -80107 -46173 -42028 -62871 -126162 -139693 -61616 -13240
17770 -13240 -22366 -32379 -39793 -41303 -7922 11669 3078 11046 11129 -66747 -142191 -142935 -171078 -254063
17756 -254063 -202542 -34097 7498 -85425 -104220 -53285 -7313 24976 -7052 -61194 -96459
17745 -96459 -99599 -100131 -61138 -28315 -58733 -88644 -98586 -71858 -46596 -73496 -50369 -20565
17733 -20565 -14358 -39905 -58519 -61355 -7280 61413 95115 157618 151282 158368 120079 78549
$$ packed form
17818A1848J7241m6555J1915l5710J4009N6469m9051o5035M7023r838j7826j4751
17806h0261m8628m4211N300P7035L7569K661j3338J3315K9062r554j0051L9094
17794b007J3951M8598J6547j5020J9944m9788m4799m0039q126K3668L7261k152
17782a962n3513K713l8096j3281K4032L3934M145k0843o3291j3531P8077M8376
17770a3240r126j0013p414j510L3381J9591q591P968Q3p7876p5444p44k8143q2985
17756b54063N1521J68445M1595r2923j8795N0935M5972L2289l2028n4142l5265
17745i6459l140n32L8993L2823l0418k9911r942K6728K5262k6900K3127K9804
17733b0565O207k5547j8614k836N4075O8693L3702O2503o336P086l8289m1530
$$ plain form
17721 78549 98885 -3401 -55649 -42568 -116340 -110563 -107246 -121609 -126030 -92253 -39739 -23722
17709 -23722 -55573 -69857 -161339 -162565 -125063 -92079 -14449 -47379 -107908 -120441 -135005 -74858
17697 -74858 -41108 -69576 -60692 -47472 -11606 -5267 37810 -12268 -3600 -7057 -32251 -43973
17685 -43973 -20357 -41321 -64472 -36049 16989 67954 120993 95990 61491 -39926 -25465
17674 -25465 -16870 -48457 -99340 -67249 11751 22588 -27736 -62181 -39610 -35000 -39526 -51395
17662 -51395 -15497 -16808 -348 -2689 -20970 -37987 -69738 -52655 -36340 -20902 -27258 -82293
17650 -82293 -120657 -74512 -78294 -112569 -60072 -73607 -112585 -119636 -144834 -157093 -159129 -132834
17638 -132834 -112688 -108357 -115660 -158402 -61366 -80811 -158579 -104218 -21264 -16603 -45349 -9120
$$ packed form
17721G8549K0336j02286n2248J3081p3772N777L317j4363m421L3777N2514J6017
17709b3722l1851j4284r1482j226L7502L2984P7630l2930o0529j2533j4564O0147
17697g4858L3750k8468Q884J3220L5866O339M3077n0078Q668l457k5194j1722
17685d3973K3616k0964k3151K8423N3038N0965N3039k5003l4499j01417J4461
17674b5465Q595l1587n0883L2091P9000J0837n0324l4445K2571M610m526j1869
17662e1395L5898j311J6460k341j8281j7017l1751J7083J6315J5438o356n5035
17650h2293l8364M6145l782l4275N2497j3535l8978p051k5198j2259k036K6295
17638a32834K0146M331p303m2742R7036j9445p7768N4361Q2954M661k8746L6229
$$ plain form
17626 -9120 4820 -33531 -15027 -43501 -71332 -133252 -135579 -173281 -175850 -180460 -156509 -43331
17614 -43331 -2490 -72324 -85789 -99954 -114871 -67883 -51993 5278 78203 89927 90620 47802
17602 47802 30204 -35837 -88269 -117062 -122766 -69916 -107093 -131654 -119679 -92287 -26506 -7669
17590 -7669 40608 -1967 -14921 4318 43797 -18478 -60780 -91032 -65210 -57952 -20352 -2156
17578 -2156 -29420 -47014 -16647 12862 17491 4148 36146 5295 -28980 -63650 -69450 1667
17566 1667 44635 32812 23581 -33944 -83813 -111229 -147375 -182418 -140142 -129257 -134121 -94203
17554 -94203 -51323 -33358 -16254 -24993 -81287 -63184 -4787 -13557 51131 73279 62139 93013
17542 93013 82284 54757 30090 3390 13711 3934 -35853 -49497 -34414 -18264 -90807 -141443
$$ packed form
17626i120J3940l8351J8504k8474k7831o1920k327l7702k569m610K3951J13178
17614d3331M0841o9834j3465j4165j4917M6988J5890N7271P2925J1724O93m2818
17602D7802j7598o6041n2432k8793n704N2850l7177k4561J1975K7392O5781J8837
17590g669M8277m2575j2954J9239L9479o2275m2302l0252K5822P258L7600J8196
17578b156k7264j7594L0367K9509M629j3343L1998l0851l4275l4670n800P1117
17566A667M2968j1823r231n7525m9869k7416l6146l5043M2276J0885m864L9918
17554i4203M2880J7965J7104q739n6294J8103N8397q770O4688K2148j1140L0874
17542I3013j0729k7527k4667k6700J0321r777l9787j3644J5083J6150p2543n0636
$$ plain form
17530 -141443 -84496 -20738 -1446 -51214 -74156 -36968 -32392 44850 98766 114681 70933 31152
17518 31152 4537 25124 42025 -25061 -23084 -29905 -48747 -28235 -24203 -24650 -25157 20686 24094
17505 24094 35618 4684 -9039 -133866 -104537 -41781 12014 49471 17453 -30154 -100051
17494 -100051 -153435 -172641 -144207 -125988 -52576 -63382 -7508 46271 36910 -1297 153 -87194
17482 -87194 -88620 -109419 -108570 -102975 -99217 -73681 -54515 -5489 30916 15289 -64407 -39703 -62521
17469 -62521 5794 58301 83273 125000 79267 89517 104339 74975 89473 86242 83963 56204
17457 56204 13216 -2840 -39826 -59408 -85046 -46165 -47389 -82519 -1248 -6448 12497 42985
17445 42985 41533 224641 502275 664088 688137 531232 289457 179330 118599 94627 109492
$$ packed form
17530a41443N6947O3758J9292m9768k2942L7188M576P7242N3916J5915m3748l9781
17518C1152k6615K0587J6901o7086J977o821j8842K0512M032m47n07M5843L408
17505B4094J1524l0934j3723j24827K9329O2756N3795L7457l2018m7607o9897
17494a00051n3384j9206K8434J8219P3412j0806N5874N3779r361l8207J450q7347
17482h7194j426k0799Q49N595L758K5536J9166M9026L6405j5627p9696K4704k2818
17469f2521O8315N2507K4972M1727m5733J0250J4822k9364J4498l231k279k7759
17457E6204m2988j6056l6986j9582k5638L8881j224l5130Q1271n200J8945L0488
17445D2985j452J83108K77634J61813K4049j56905k41775j10127o0731k3972J4865
$$ plain form
17434 109492 74689 57358 -124 41557 81929 27969 -45412 -55609 -57543 -56589 -20653 42825
17422 42825 17846 -27518 -21333 -26292 -7333 -48014 -110737 -86376 -42235 -48368 -40647 -34560 -17597
17409 -17597 -4736 -89417 -127830 -109171 -48120 36597 24191 -20437 -129235 -175901 -140779
17398 -140779 -93898 -73152 -74470 -37487 -71505 -72869 -67968 -33740 -21372 -32089 4418 19144
17386 19144 38103 68410 48692 20842 -11146 16071 -14582 1317 -30582 -40917 -6043 21341
17374 21341 -7360 -51723 -45287 -19579 -93109 -120659 -46875 -74479 -118814 -51622 -71887 -112868
17362 -112868 -88371 -50241 -57084 -128382 -52093 -19371 -32631 -37988 -45555 -24389 -49662 -88749
17350 -88749 -68000 23882 69184 38098 82823 142901 233693 353220 366740 404866 383792
$$ packed form
17434A09492l4803j7331n7482M1681M0372n3960p3381j0197j934R54L5936O3478
17422D2825k4979m5364O185m959J8959m0681o2723K4361M4141o133P721O087J6963
17409a7597J2861q4681l8413J8659O1051Q4717j2406m4628j08798m6666L5122
17398a40779M6881K0746j318L6983l4018j364M901L4228J2368j0717L6507J4726
17386A9144J8959L0307j9718k7850l1988K7217l0653J5899l1899j0335L4874K7384
17374B1341k8701m4363O436K5708p3530k7550P3784k7604m4335O7192k0265m0981
17362a12868K4497L8130o843p1298P6289L2722j3260n357p567K1166k5273l9087
17350h8749K0749R1882M5302l1086M4725O0078R0792J19527J3520L8126k1074
$$ plain form
17339 383792 327417 284679 214482 128490 94207 127515 77712 21130 -5331 12066 -19386
17328 -19386 -7873 -27165 15519 51676 27256 -24986 10971 64415 104755 95785 11725 -56739
17316 -56739 -24286 31462 -23995 -6400 9889 -70170 -66256 8512 15749 -64730 -84770 -18798
17304 -18798 -21280 54671 77219 83145 62605 79106 108484 83490 70021 164385 174461 51179
17292 51179 20301 -4416 -19353 -98902 -101898 -96706 -105085 -87785 -10427 52934 92858 140952
17280 140952 177023 104894 9110 -31635 -20562 14878 -1293 -43916 -33818 17128 17248 5691
17268 5691 -1314 -51740 26807 42827 -47816 -20571 85317 103834 45551 1632 -1742 -6514
17256 -6514 18785 -40045 -49138 -18069 18845 97938 78018 28167 -6848 1027 -5927 -70186
$$ packed form
17339C83792n6375m2738p0197q5992l4283L3308m9803n6582k6461J7397l1452
17328a9386J1513j9292M2684L6157k4420n2242L5957N3444M0340q970q4060o8464
17316e6739L2453N5748n5457J7595J6289q0059L914P4768P237q0479k0040O5972
17304a8798k482P5951K2548N926k0540J6501K9378k4994j3469R4364J0076j23282
17292E1179l0878k4717j4937p9549k996N192q379J7300P7358O3361L9924M8094
17280A40952L6071p2129r5784m0745J1073L5440j6171m2623J0098N0946J20j1557
17268E691p005n0426P8547J6020r0643K7245J05888J8517n8283m3919l374m772
17256f514K5299n8830r093L1069L6914P9093j9920m9851l5015P875o954o4259
$$ plain form
17244 -70186 -72082 -81266 -59524 -75131 -101526 -136268 -24416 -9917 -71500 -68367 -75878 -80726
17232 -80726 -15135 11980 -7220 -8661 -73985 -127779 -92903 -10541 -45520 -58988 -45783 -45316
17220 -45316 -49802 -38890 16613 40210 -27408 -13830 -244 6012 24888 36248 20963 -5462
17208 -5462 5596 23124 3364 -2672 -982 -7503 -33427 -48477 -81197 -110018 -163626 -236160
17196 -236160 -226059 -165121 -98662 -85733 -63444 -28309 4159 -69958 -123760 -65400 -63051 -75047
17184 -75047 -41158 -5532 9090 -46746 -78849 -90081 -64810 -37319 -75326 -132428 -147296 -148867
17172 -148867 -124970 -46366 -32892 -75186 -142646 -196739 -189231 -148739 -150477 -250863 -203373 -42608
17160 -42608 -3034 13609 26459 -19181 -66986 -80620 -92256 -111860 -96412 -60712 -19080 -29358
$$ packed form
17244g0186j896r184K1742j5607k6395l4742J11852J4499o1583L133p511m848
17232h0726O5591K7115j9200j441o5324n3794L4876Q2362l4979j3468J3205M67
17220d5316m486J0912N5503K3597o7618J3578J3586O256J8876J1360j5285k6425
17208e462J1058J7528j9760o036J690o521k5924j5050l2720k8821n3608p2534
17196b36160J0101O0938O6459J2929K2289L5135L2468p4117n3802N8360K349j1996
17184g5047L3889L5626J4622n5836l2103j1232K5271K7491l8007n7102j4868j571
17172a48867K3897P8604J3474m2294o7460n4093P508M0492j738j00386M7490J60765
17160d2608L9574J6643J2850m5640m7805j3634j1636j9604J5448L5700M1632j0278
$$ plain form
17148 -29358 -41388 -23615 -577 -13096 -14199 -38200 -79578 22058 82214 92486 57842 -39057
17136 -39057 -57387 8980 42737 35705 28645 36505 50270 72004 56744 27297 40801 6365
17124 6365 -13091 -36155 447 -9463 68206 -2132 -25270 32791 46535 20330 59255 35617
17112 35617 -7644 17006 6417 -25208 -38561 -37040 -64773 -85663 -36427 25970 -10388 -10039
17100 -10039 24337 74200 81525 122704 53474 -40621 -29650 10436 -19678 -76075 -64316 -25359
17088 -25359 45177 62177 58895 59123 41946 10804 22016 -48515 -46728 -19971 8677 18548 -13851
17075 -13851 -92563 -73263 -61154 -117349 -98774 -41678 14503 2839 -65115 -79597 -11423 -6707
17063 -6707 -39116 -91256 -52796 -112466 -146925 -68784 -56563 32173 147209 61247 -64049
$$ packed form
17148b9358j2030J7773K3038j2519j103k4001m1378J01636O0156J0272l4644r6899
17136c9057j8330O6367L3757p032p060P860J3765K1734j5260k9447J3504l4436
17124F365j9456k3064L6602r910P7669p0338k3138N8061J3744k6205L8925k3638
17112C5617m3261K4650j0589l1625j3353J521k7733k0890M9236O2397l6358L49
17100a0039L4376M9863P325M1179o9230r4095J0971M0086l0114n6397J1759L8957
17088b5359P0536J7000l282K28j7177l1142J1212p0531J787K6757K8648R871l2399
17075a3851p8712J9300J2109n6195J8575N7096N6181j1664o7954j4482O8174M716
17063f707l2409n2140L8460n9670l4459P8141J2221Q8736J15036q5962j25296
$$ plain form
17052 -64049 -70699 -70336 -77323 -32871 -70472 -69994 -43792 -95407 -138906 -126323 -100564 -125654 -68003
17039 -68003 -34607 -49049 16433 78231 6193 16919 -12778 28593 47728 53680 -23605 -54225
17027 -54225 -51790 -28101 -220 -13359 -101760 -157770 -158445 -49175 -15382 -62473 -27704 -12921
17015 -12921 -21745 -10226 21937 52616 25742 -39350 -85431 -112558 -156589 -73338 -45530 -41803
17003 -41803 -370 6727 -23385 -56514 56790 121978 87510 60528 28250 57336 114201 104576
16991 104576 18753 -28169 -42661 50262 69180 38605 -28513 -24361 -36770 -69044 -74542 16293
16979 16293 11965 12402 25631 -19615 9920 35157 -38340 -49265 -4633 12357 -18302 -71947
16967 -71947 -32266 -44889 3457 -7011 -41233 -46544 -109379 -20080 -19772 7881 16101 54659
$$ packed form
17052f4049o650L63o987M4452l7601M78K6202n1615m3499J2583K5759k5090N7651
17039f8003L3396j4442O5482O1798p2038J0726k9697M1371J9135N952p7285l0620
17027e4225K435K3689K7881j3139q8401n6010o75J09270L3793m7091L4769J4783
17015a2921q824J1519L2163L0679k6874o5092m6081k7127m4031Q3251K7808L727
17003d1803M1433P097l0112l3129J13304O5188l4468k6982l2278K9086N6865r625
16991A04576q5823m6922j4492R2923J8918l0575o7118M152j2409l2274n498R0835
16979A6293m328M37J3229m5246K9535K5237p3497j0925M4632J6990l0659n3645
16967g1947L9681j2623M8346j0468l4222n311o2835Q9299L08K7653Q220L8558
$$ plain form
16955 54659 62071 45543 -10641 -48500 -4392 12383 -15196 -72200 -149631 -151060 -100750 -11291
16943 -11291 -25837 -83004 -93707 -108076 -71234 -21276 -41634 -105882 -89690 16375 9283 6766
16931 6766 19348 9508 53182 25318 17590 2137 -53516 -32872 -2755 5351 -10500 -3771 -50627
16918 -50627 -50733 -29383 56236 60882 -17104 -15243 -43790 -60536 -9943 28347 -96479 -141875
16906 -141875 -167109 -119854 -94517 -109581 -95875 -83099 -120095 -136982 -58220 -43438 -15446
16895 -15446 772 -10461 -265 -7998 63682 71457 54486 3433 34672 -4811 -84444 -143788
16883 -143788 -102818 -18203 -29155 -47652 -12607 12632 11182 8216 15116 -1608 -68162 -63735
16871 -63735 -51238 -52846 -33768 30201 2363 -41768 -52453 -74337 -54522 -42702 -54878 -95781
$$ packed form
16955E4659P412j6528n6184l7859M4108J6775k7579n7004p7431j429N0310Q9459
16943a1291j4546n7167j0703j4369L6842M9958k0358o4248J6192J06065p092k517
16931F766J2582r840M3674k7864p728j5453n5653K0644L0117Q106j5851O729m6856
16918e0627j06K1350Q5619M646p7986J861k8547j6746N0593L8290j24826m5396
16906a41875k5234M7255K5337j5064J3706J2776l6996j6887P8762J4782K7992
16895a5446J6218j1233J0196p733P1680P775j6971n1053L1239l9483p9633n9344
16883a43788M0970Q4615j0952j8497L5045K5239j450k966O900j6724o6554M427
16871f3735J2497j608J9078O3969k7838m4131j0685k1884J9815J1820j2176m0903
$$ plain form
16859 -95781 -104597 -131085 -136661 -105201 -118665 -94432 -62342 -28655 -15214 -78108 -55792 -35332
16847 -35332 -45635 -5461 -43892 -51650 -140580 -146490 -93082 -62364 -21482 -22783 8152 -3014
16835 -3014 18871 28342 58579 41306 94963 98103 69226 90080 77501 92614 101604 84091
16823 84091 37328 -27578 -81747 -117783 -86215 7734 -3785 -32089 -32888 -100559 -124823 -118255
16811 -118255 -143695 -120038 -86969 -48789 -29555 -8215 -56916 -53620 -33748 -73338 -76306 4853
16799 4853 22079 35923 25486 -40653 -46490 -1227 14441 6258 -21833 -32584 -68051 -37785
16787 -37785 17730 -30281 -52618 -56023 -35258 142 -63348 -97049 -28464 8165 -5790 55409
16775 55409 57369 87867 110446 -2183 -23952 24757 43886 -1869 -43446 -56097 68517
$$ packed form
16859i5781q816k6488n576L1460j3464K4233L2090L3687J3441o2894K2316K0460
16847c5332j0303M0174l8431p758q8930n910N3408L0718M0882j301L0935j1166
16835c014K1885R471L0237j7273N3657L140k8877K0854j2579J5113Q990j7513
16823H4091m6763o4906n4169l6036L1568R3949j1519k8304p99o7671k4264O568
16811a18255k5440K3657L3069L8180J9234K1340m8701L296J9872l9590k968Q1159
16799D853J7226J3844j0437o6139n837M5263J5668q183k8091j0751l5467L0266
16787c7785N5515m8011k2337l405K0765L5400o3490l3701O8585L6629j3955O1199
16775E5409J960L0498K2579j12629k1769M8709J9129m5755m1577j2651J24614
$$ plain form
16764 68517 104899 45685 -24849 -83576 -73297 -59627 -43981 -51442 -53794 -42848 -100689 -108824
16752 -108824 -132992 -136036 -107528 -87788 -28125 -9932 14234 -436 -22287 -6710 8721 19766
16740 19766 33296 29794 5310 -37654 -72840 -20734 -7423 -57101 -28054 -1852 -7162 13958
16728 13958 -2741 -33125 43101 36389 -50977 -56071 -48543 -60469 -63566 11404 869 11574
16716 11574 43496 86710 39331 -17536 -38486 -77735 -46351 -28126 -38183 -39846 -61088 -25797
16704 -25797 7035 65664 46429 1572 -9210 -42595 -55519 1784 20034 20861 39851 -7773
16692 -7773 -33542 -43556 -67585 -14802 -22 42749 71772 103043 70946 62976 21438 -17813
16680 -17813 7631 33431 50237 20585 -47074 -31028 -37008 -22964 10958 37034 43405 -29029
$$ packed form
16764F8517L6382n9214p0534n8727J0279J3670J5646p461k352J0946n7841q135
16752a08824k4168l044K8508J9740N9663J8193K4166j4670k1851J5577J5431J1045
16740A9766J3530l502k4484m2964l5186N2106J3311m9678K9047K6202n310K1120
16728A3958j6699l0384P6226o712q7366n094P528j1926l097P4970j0535J0705
16716A1574L1922M3214m7379n6867k0950l9249L1384J8225j0057j663k1242L5291
16704b5797L2832N8629j9235m4857j0782l3385j2924N7303J8250Q27J8990m7624
16692g773k5769j0014k4029N2783J4780M2771K9023L1271l2097p970m1538l9251
16680a7813K5444K5800J6806k9652o7659J6046n980J4044L3922K6076O371p2434
$$ plain form
16668 -29029 -13508 -36746 -14875 -31928 -42107 -42436 -14309 35712 29186 -5352 -13201 -32010
16656 -32010 -92216 -111956 -106208 -97486 -96214 -57460 3537 8534 19281 3050 -38505 -39656 28262
16643 28262 -17339 -28260 -67721 -79658 -71449 -32905 -33560 -65132 -64073 -84221 -81487 -103756 -96436
16630 -96436 -27854 2866 -29712 -114348 -96293 24615 78927 60624 -28389 -95559 -23236
16619 -23236 -24500 -113132 -93006 -71459 8302 -4368 22260 -9715 -38951 -71984 -85171 -54748
16607 -54748 -31638 -2913 -61049 -43414 34853 73403 111368 67426 8766 -52719 -95642 -30029
16595 -30029 -2585 -15465 -71993 -66147 -18455 3011 -11908 -62386 -70295 -84176 -22168 49138
16583 49138 51767 15290 -44599 -25418 -65407 -78092 -48083 -35821 -14589 2557 14293 6767
$$ packed form
16668b9029J5521k3238K1871j7053j0179l29K8127N0021o526l4538p849j8809
16656c2010o0206j9740N748Q722J272L8754O0997M997J0747j6231m1555j151O7918
16643B8262m5601j0921l9461j1937Q209L8544o55l1572J059k0148K734k2269P320
16630i6436O8582L0720l2578q4636J8055J20908N4312j8303q9013o7170P2323
16619b3236j264q8632K0126K1547P9761j2670K6628l1975k9236l3033j3187L0423
16607e4748K3110K8725n8136J7635P8267L8550L7965m3942n8660o1485m2923O5613
16595c0029K7444j2880n6528N846M7692K1466j4919n0478p909j3881O2008P1306
16583D9138K629l6477n9889J9181l9989j2685L0009J2262K1232J7146J1736p526
$$ plain form
16571 6767 32279 40851 9496 1318 -14347 3903 17298 3110 -62701 -38686 -18808 -71980
16559 -71980 -65956 -51739 -36413 3955 -4854 -32544 -139116 -170347 -172455 -181956 -151189 -62640
16547 -62640 -119083 -76010 15175 -9332 -83195 -80513 -63255 -49358 -33819 -57510 -58366 -26667
16535 -26667 -28856 -63032 -133252 -122930 -129703 -122381 -14493 3986 30703 100758 87134 -39866
16523 -39866 -149202 -87555 -25511 3465 -56185 -34134 -51727 -73763 -77134 -42371 19981 27345
16511 27345 -60403 -112534 -35224 40728 20241 -58090 -61119 10929 16152 -97930 -137442 -119330
16499 -119330 -47435 -43222 -30450 1577 37486 53877 19717 -104665 -148786 -101668 -58485
16488 -58485 -30738 -23590 2407 54424 54334 46563 -5902 -75350 -110822 -122938 -77701 -89589 -77564
$$ packed form
16571F767K5512Q572l1355q178j5665J8250J3395j4188o5811K4015J9878n3172
16559g1980O024J4217J5326M0368q809k7690j06572l1231k108r501L0767Q8549
16547f2640n6443M3073R1185k4507p3863K682J7258J3897J5539k3691q56L1699
16535b6667k189l4176p0220J0322o773P322J07888J8479K6717P0055j3624j27000
16523c9866j09336O1647O2044K8976n9650K2051j7593k2036l371L4763O2352P364
16511B7345q7748n2131P7310P5952k0487p8331l029P2048N223j14082l9512J8112
16499a19330P1895M213J2772L2027L5909J6391l4160j24382m4121M7118M3183
16488e8485K7747P148K5997N2017r0p771n2465o9448l5472j2116M5237j1888J2025
$$ plain form
16475 -77564 -48176 -13855 -29234 -68100 -64186 -52479 -6205 -25998 13234 52825 -13546 -68500
16463 -68500 -130207 -136484 -113432 -128810 -100580 -52361 -46610 -104850 -120378 -87688 -90678 -30163
16451 -30163 -16783 -93549 -122395 -98384 -15869 -4591 -44954 -37926 -21534 -23347 -27511 19692
16439 19692 -17624 33146 8574 -23002 11733 45594 17135 -8100 -66810 -28145 39416 9766
16427 9766 9062 -79575 -125071 -66999 -10671 -11816 7118 68158 24044 -892 -66056 -68968 -52308
16414 -52308 -117554 -117356 -86174 -98725 -68340 -54149 -82696 -94679 -42022 -33893 -309 -17995
16402 -17995 -23573 20397 33416 -31687 50475 85727 50301 49841 59713 28271 13459 15908 21772
16389 21772 -17856 -41195 -71871 -54055 -51778 -50667 -57631 -69759 -57427 -126323 -126644 -82851 -102237
$$ packed form
16475g7564K9388L4321j5379l8866L914J1707M6274j9793L9232L9591o6371n4954
16463f8500o1707o277K3052j5378K8230M8219N751n8240j5528L2690k990O0515
16451c0163J3380p6766k8846K4011Q2515J1278m0363P028J6392j813m164M7203
16439A9692l7316N0770k4572l1576L4735L3861k8459k5235n8710L8665O7561k9650
16427I766p04q8637m5496N8072N6328j145J8934O1040m4114k4936o5164k912J6660
16414e2308o5246J98L1182j2551L0385J4191k8547j1983N2657Q129L3584j7686
16402a7995n578M3970J3019o5103Q2162L5252l5426m60R872l1442j4812K449N864
16389B1772l9628k3339l0676J7816K277J111o964j2128J2332o8896l21M3793j9386
$$ plain form
16376 -102237 -109510 -93732 -122473 -158146 -67349 13886 36616 7740 56382 74543 90530 48109
16364 48109 178 -41947 -19690 7407 -27087 -77117 -55572 -40979 -43171 -49289 -53327 -38753
16352 -38753 -93175 -197772 -198927 -170976 -132422 -217910 -151200 -93498 -130711 -122329 -21334 71225
16340 71225 10622 -37760 -47689 -53074 -49445 -39457 -25027 -60528 9775 37716 41235 15146 -10918
16327 -10918 -28055 -30975 -31704 -83474 -86725 -79920 -56177 -24989 23029 75859 66477 21082 35006
16314 35006 73994 102633 77497 24544 -1457 38920 32767 29693 14832 8762 -13706 17344
16302 17344 -28558 -7876 -13461 -75804 -69664 -18190 -23504 -45216 30961 34748 27799 13898 -26124
16289 -26124 22876 26159 5335 31294 -6920 -34726 -27725 -57845 -52214 -23694 -55360 -73914
$$ packed form
16376a02237p273J5778k8741l5673R0797Q1235K2730k8876M8642J8161J5987m2421
16364D8109m7931m2125K2257K7097l4494n0030K1545J4593k192o118m038J4574
16352c8753n4422j04597j155K7951L8554q5488O6710N7702l7213Q382J00995R2559
16340G1225o0603m8382r929n385L629R988J4430l5501P0303K7941L519k6089k6064
16327a0918j7137k920p29n1770l251O805K3743L1188M8018N2830r382m5395J3924
16314C5006L8988K8639k5136n2953k6001M0377o153l074j4861o070k2468L1050
16302A7344m5902K0682n585o2343O140N1474n314k1712P6177L787o949j3901m0022
16289b6124M9000L283k0824K5959l8214k7806P001l0120N631K8520l1666j8554
$$ plain form
16277 -73914 -72895 5803 -474 -61207 -92716 -71285 -28983 -41438 -86485 -36115 -21467 -28237
16265 -28237 -19481 -49897 30740 -1321 -27264 6324 29505 36197 92606 122180 107908 69624
16253 69624 -43444 -104252 -126181 -70415 -48684 -48017 -46012 -44345 -33720 -58901 -92142 -77666
16241 -77666 -70926 -72996 -68919 -74792 -103270 -26423 38970 37 -18972 15237 54659 114022
16229 114022 88263 79549 115623 -13888 -69271 7284 80619 43609 27518 84279 87968 83013
16217 83013 85756 22722 24887 32401 1586 -7610 33249 76527 99970 106632 36857 -20849 14787
16204 14787 -19449 34724 94853 -7788 -81463 -58745 -15460 44342 -31326 -66826 -65289 -78019
16192 -78019 -41737 -77754 -87530 -24382 -16179 -35398 -39103 -5796 7688 1113 9512 -7954 -15241
$$ packed form
16277g3914J019P8698o277o0733l1509K1431M2302j2455m5047N0370J4648o770
16265b8237Q756l0416Q0637l2061k5943L3588K3181O692N6409K9574j4272l8284
16253F9624j13068o0808k1929N5766K1731O67K005J667J0625k5181l3241J4476
16241g7666O740k070M077n873k8478P6847O5393l8933j9009L4209L9422N9363
16229A14022k5759q714L6074j29511n5383P6555P3335l7010j6091N6761L689m955
16217H3013K743o3034K165P514l0815r196M0859M3278K3443O662o9775n7706L5636
16204A4787l4236N4173O0129j02641p3675K2718M3285N9802p5668l5500J537j2730
16192g8019L6282l6017r776O3148Q203j9219l705L3307J3484o575Q399j7466p287
$$ plain form
16179 -15241 -40896 -57262 -84933 -47147 -64214 -127905 -188047 -100423 -64170 4897 44433 7414
16167 7414 5379 58319 58060 37168 69364 122056 76344 54774 44665 28796 27716 -60982 -106971
16154 -106971 -51958 -20047 -42744 -47262 -19359 -3731 -15089 19579 34371 43051 29290 21894
16142 21894 69185 49400 35908 21030 -33491 -29829 -11498 -26529 -15875 8618 22240 12345
16130 12345 15261 108391 158504 129282 86914 80226 82573 48601 43709 39997 19896 22795 -65728
16117 -65728 -69715 -34722 30718 24820 -139 8906 -12759 -4526 -17649 -75641 -82491 -80119 -92225
16104 -92225 -46529 -39927 -49562 -43543 -22788 16117 79453 95225 41296 -23699 -11176 105689
16092 105689 111565 85613 33413 -54009 -91826 -46238 51030 624 -7096 14692 -6041 -104264
$$ packed form
16179a5241k5655j6366k7671L7786j7067o3691o0142Q7624L6253O9067L9536l7019
16167G414k035N2940k59k0892L2196N2692m5712k1570j0109j5869j080q8698m5989
16154a06971N5013L1911k2697m518K7903J5628j1358L4668J4792Q680j3761p396
16142B1894M7291j9785j3492j4878n4521L662J8331j5031J0654K4493J3622r895
16130A2345K916R3130N0113k9222m2368o688K347l3972m892l712k0101K899q8523
16117f5728l987L4993O5440n898k4959R045k1665Q233j3123n7992o850K372j2106
16104i2225M5696O602r635O019K0755L8905O3336J5772n3929o4995J2523J16865
16092A05689N876k5952n2200q7422l7817M5588R7268n0406p720K1788k0733r8223
$$ plain form
16080 -104264 -39564 11056 38062 22252 -36476 -16096 7559 -1903 -14057 -54334 -114121 -55366
16068 -55366 -19440 -27826 -91444 -122110 -73261 -91365 -56342 -28769 -35889 -49711 -52571 -22933
16056 -22933 -40058 -65596 -79710 -46355 -3307 8800 -16060 -55069 -31986 13612 -10309 -15920
16044 -15920 -25387 -28284 -49519 -62809 -18965 -13026 -3415 -1456 1998 35625 50040 -4406 -30812
16031 -30812 -35851 -49982 -25043 11181 54839 56502 116166 161027 227074 181740 94615 68407
16019 68407 8074 -33838 -79713 -66432 -59300 -48364 -25527 -8981 19684 104336 86050 125709
16007 125709 39710 8867 22808 41754 -20231 -62366 -75423 -48789 26714 -5973 5149
15996 5149 42070 58828 81679 30823 -28474 -96415 -87908 -53498 -55810 -37998 13937 -12473
$$ packed form
16080a04264O4700N0620K7006j5810n8728K0380K3655r462j2154m0277n9787N8755
16068e5366L5926q386o3618l0666M8849j8104L5023K7573p120j3822k860K9638
16056b2933j7125k5538j4114L3355M3048J2107k4860l9009K3083M5598k3921n611
16044a5920r467k897k1235j3290M3844N939R611J959L454L3627J4415n4446k6406
16031c0812n039j4131K4939L6224M3658J663N9664M4861O6047m5334q7125k6208
16019F8407o0333m1912m5875J3281P132J0936K2837J6546K8665Q4652j8286L9659
16007A25709q5999l0843J3941J8946o1985m2135j3057K6634P5503l2687J1122
15996E149L6921J6758K2851n0856n9297o7941Q507L4410k312J7812N1935k6410
$$ plain form
15984 -12473 -50846 -36266 -47495 -73092 -71821 -102350 -126501 -61559 -55541 -45135 -57056 -72435
15972 -72435 41776 65261 83472 111753 79682 -20772 -67919 -108155 -93117 -55322 -43266
15961 -43266 -109260 -115310 -128572 -104753 -161902 -108697 -53774 -58363 -93558 -42521 94504 149223
15949 149223 141000 96836 29446 600 9367 39827 4906 4217 -37313 -78838 -155719 -141122
15937 -141122 -85141 -98628 -20618 -19220 -24476 -10825 -14699 -1377 3920 21229 -12419 -9563
15925 -9563 -5417 -6964 12302 99227 121306 86441 90964 50140 28974 -265 9861 5691 30824
15912 30824 18708 -9239 10398 51671 47575 57126 35138 -60732 -33989 -21182 -8896 47109
15900 47109 39091 -72763 -113200 -99347 -72109 -11683 10130 17792 24071 -7565 -6347 7223
$$ packed form
15984a2473l8373J4580j1229k5597J271l0529k4151O4942O018J0406j1921j5379
15972g2435J14211K3485J8211K8281l2071j00454m7147m0236J5038L7795J2056
15961d3266o5994o050j3262K3819n7149N3205N4923m589l5195N1037J37025N4719
15949A49223q223m4164o7390k8846Q767L0460l4921o89m1530m1525p6881J4597
15937a41122N5981j3487P8010J398n256J3651l874J3322N297J7309l3648K856
15925i563M146j547J9266Q6925K2079l4865M523m0824k1166k9239J0126m170K5133
15912C0824j2116k7947J9637M1273m096R551k1988r5870K6743J2807J2286N6005
15900D7109q018j11854m0437J3853K7238O0426K1813P662O279l1636J218J3570
$$ plain form
15888 7223 -29525 -50559 -16974 -5587 -32803 -36445 -72087 2975 35576 -23453 -61441 -50856
15876 -50856 -100133 -185639 -220843 -193375 -146638 -97905 11737 102996 92049 73578 51533
15865 51533 -43333 -45464 -19038 28259 177 -55307 -96569 -102674 -114662 -161584 -131651 -106437
15853 -106437 -123169 -82818 -22554 -43145 -55635 -16643 4477 -31068 -97269 -124786 -92466
15842 -92466 -17214 -20039 891 24863 -28775 -33739 2742 40841 16567 65913 55508 37422
15830 37422 37963 14820 -44732 -104468 -73493 -41837 -19610 31353 33657 1779 37701 44801
15818 44801 -10901 10223 33295 43414 73590 97541 116463 77566 15338 73524 115247 103980
15806 103980 52076 21655 -19480 -11054 20209 30934 46841 94526 111799 43291 16440 -14844
$$ packed form
15888G223l6748k1034L3585J1387k7216l642l5642P5062L2601n9029l7988J0585
15876e0856m9277q5506l5204K7468M6737M8733J09642R1259j0947j8471k2045
15865E1533r4866k131K6426M7297k8082n5484m1262o105j1988m6922K9933K5214
15853a06437j6732M0351O0264k0591j2490L8992K1120l5545o6201k7517L2320
15842i2466P5252k825K0930K3972n3638m964L6481L8099k4274M9346j0405j8086
15830C7422N41k3143n9552n9736L0975L1656K2227N0963K304l1878L5922P100
15818D4801n5702K1124K3072J0119L0176K3951J8922l8897o2228N8186M1723j1267
15806A03980n1904l0421m1135Q426L1263J0725J5907M7685J7273o8508k6851l1284
$$ plain form
15794 -14844 -7869 32010 -8397 -7507 13545 19709 39636 28785 -23741 -61159 -75329 -87236
15782 -87236 -41921 42428 30362 -25499 -26703 51868 49984 21662 -20485 -48479 13406 100152
15770 100152 112979 106143 35973 -21627 -46017 -108597 -24031 -21904 -30066 -14964 5651 -22028
15758 -22028 -1937 12150 -30422 6502 -48207 -107451 -154731 -113212 -103440 -99323 -87506 -89109
15746 -89109 -88013 -7385 10352 17480 40462 4036 -60478 -56366 -39151 41696 30670 -31045
15734 -31045 -45347 -80236 -84563 -44058 -20039 -45529 -74141 -67657 -53266 -30639 -21948 -26060
15722 -26060 -77158 -82925 -54801 -50328 21044 38712 110860 121943 90772 32750 63212 80805
15710 80805 -537 -95885 -94180 -61627 -25756 -10987 58571 15737 -38253 -64439 -120173 -93957
$$ packed form
15794a4844O975L9879m0407Q90K1052O164J9927j0851n2526l7418j4170j1907
15782h7236M5315Q4349j2066n5861j204P8571j884k8322m2147k7994O1885Q6746
15770A00152J2827o836p0170n7600k4390o2580Q4566K127q162J5102K0615k7679
15758b2028K0091J4087m2572L6924n4709n9244m7280M1519R772M117J1817j603
15746h9109J096Q0628J7737P128K2982l6426o4514M112J7215Q0847j1026o1715
15734c1045j4302l4889m327M0505K4019k5490k8612O484J4391K2627Q691m112
15722b6060n1098n767K8124M473P1372J7668P2148J1083l1171n8022L0462J7593
15710H0805q1342r5348J705L2553L5871J4769O9558m2834n3990k6186n5734K6216
$$ plain form
15698 -93957 30552 68147 29411 -19508 -11581 -360 -14914 -73323 -22823 -4319 -48555 9009
15686 9009 22484 -27214 -26380 -9349 -1419 14612 -19204 -70202 -75393 -50649 -51191 -47462 -63188
15673 -63188 -42494 17688 76 -47326 -60644 -89788 -88021 -44536 -40680 -59977 -40823 -103756
15661 -103756 -121367 -106273 -41128 7679 -2889 -15743 -31035 -68238 -53035 -79311 -113727
15650 -113727 -123061 -60755 -33696 -74746 -113430 -65541 -39642 19431 56653 32080 32006 -21209
15638 -21209 -69948 -94931 -109150 -23806 -5009 69500 111478 105396 73142 46609 24636 52460
15626 52460 63357 -19513 -93587 -110609 -56539 10431 49485 36872 8716 -44541 4560 2785
15614 2785 10736 4124 73769 59739 36949 25092 32667 -2611 3254 -27608 1067 4431 22493
$$ packed form
15698i3957J24509L7595l8736m8919P927J1221j4554n8409N0500J8504m4236N7564
15686I009J3475m9698Q34J7031P930J6031l3816n0998n191K4744n42L729j5726
15673f3188K0694O0182j7612m7402j3318k9144J767M3485L856j9297J9154o2933
15661a03756j7611J5094O5145M8807j0568j2854j5292l7203J5203k6276l4416
15650a13727r334O2306K7059m1050l8684M7889K5899N9073L7222k4573p4n3215
15638b1209m8739k4983j4219Q5344J8797P4509M1978o082l2254k6533k1973K7824
15626E2460J0897q2870p4074j7022N4070O6970L9054j2613k8156n3257M9101j775
15614B785P951o612O9645j4030k2790j1857P575l5278N865l0862K8675L364J8062
$$ plain form
15601 22493 80574 98111 92060 30522 -21651 -11268 -34112 -11115 18831 120761 86628 42672
15589 42672 23698 19615 54547 -3152 -76877 -119991 -105899 -81400 -34787 29855 87308 139179
15577 139179 78619 21724 -4064 15631 25791 60202 79989 111511 55012 5522 37225
15566 37225 -20029 -72536 -8940 53536 18352 -10854 5370 -37565 -67063 -59765 10381 66557
15554 66557 3394 31967 44717 -51434 -58703 -23583 -15681 6238 63618 30607 -12355 -42335
15542 -42335 -29750 17627 66164 85401 42003 -9919 -78030 -97124 -3286 36646 58547 71897
15530 71897 46703 -2042 -20935 -6851 10503 17480 53189 77136 28260 -24538 38353 87831
15518 87831 44045 -33859 -152773 -177746 -124218 -43770 -71620 -76951 5033 45037 -66967
$$ packed form
15601B2493N8081J7537o051o1538n2173J0383k2844K2997K9946J01930l4133m3956
15589D2672j8974m083L4932n7699p3725m3114J4092K4499M6613O4642N7453N1871
15577A39179o0560n6895k5788J9695J0160L4411J9787L1522n6499m9490L1703
15566C7225n7254n2507O3596O2476l5184k9206J6224m2935k9498P298P0146N6176
15554F6557o3163K8573J2750r6151p269L5120P902K1919N7380l3011m2962k9980
15542d2335J2585M7377M8537J9237m3398n1922o8111j9094R3838L9932K1901J3350
15530G1897k5194m8745j8893J4084J7354O977L5709K3947m8876n2798O2891M9478
15518H7831m3786p7904j18914k4973N3528Q0448k7850n331Q1984M0004j12004
$$ plain form
15507 -66967 -123072 -86843 -72527 -113165 -127915 -150069 -162877 -93443 -81224 -125863 -62537 26518
15495 26518 26040 -1445 -35188 -41431 -59526 -19004 -6564 -16742 -29939 -54257 -35180 -11769
15483 -11769 16585 14817 14706 67300 82358 48305 -29459 -49694 -51619 -59017 -106875 -117444 -153649
15470 -153649 -76750 1759 -69439 -80123 -105584 -92968 -87312 -98142 -82759 -47838 -86457 -96797
15458 -96797 -24267 -25513 -54494 -76665 -45950 -28877 -54272 -35842 5561 65107 29161 5288
15446 5288 -10796 12169 26417 3203 3355 5396 -39180 1107 -22766 -75977 -71911 -46684 -40373
15433 -40373 -7158 2039 -4454 10042 -12719 -74438 -72054 -59376 -50750 40101 137118 146005 83538
15420 83538 61912 32274 72301 81314 75814 90415 100604 149257 155900 154041 58722 52802 20623
$$ packed form
15507f6967n6105L6229J4316m0638j4750k2154j2808O9434J2219m4639O3326Q9055
15495B6518m78k7485l3743o243j8095M0522J2440j0178j3197k4318J9077K3411
15483a1769K8354j768j11N2594J5058l4053p7764k0235j925p398m7858j0569l6205
15470a53649P6899P8509p1198j0684k5461J2616N656j0830J5383L4921l8619j0340
15458i6797P2530j246k8981k2171L0715J7073k5395J8430M1403N9546l5946k3873
15446E288j6084K2965J4248k3214J52K041m4576M0287k3873n3211M066K5227O311
15433d0373L3215R197o493J4496k2761o1719K384J2678Q626R0851R7017Q887o2467
15420H3538k1626k9638M0027R013n500J4601J0189M8653O643j859r5319n920l2179
$$ plain form
15407 20623 64339 90001 100655 102513 12888 -42534 -868 -10696 -16140 -127987 -202474 -82202
15395 -82202 30905 -17103 -109919 -94297 -52233 -17314 -42834 6397 20555 -40740 -79445
15384 -79445 38501 116851 55932 -21789 32272 32143 -4559 -35838 26522 75350 76021 112882
15372 112882 153828 68248 4901 11889 26592 2487 -17505 15028 -6724 -26843 4172 35875
15360 35875 17848 5843 -60677 -99645 -102809 -53313 28573 59371 1404 6963 14277 -14209
15348 -14209 -695 -942 15042 78798 97555 100369 34594 55942 26283 9117 -45112 -23736
15336 -23736 -14965 22860 70159 76668 86885 46982 26489 83468 143419 135631 58135 39030
15324 39030 26962 -13498 -13159 379 30400 7257 -22934 -45416 -13354 42755 26158 -28196
$$ packed form
15407B0623M3716K5662J0654J858q9625n5422M1666r828n444j11847p4487J20272
15395h2202J13107m8008r2816J5622M2064L4919k5520M9231J4158o1295l8705
15384g9445J17946P8350o0919p7721N4061j29l6702l1279O2360M8828O71L6861
15372A12882M0946q5580o3347O988J4703k4105j9992L2533k1752k0119L1015L1703
15360C5875j8027j2005o6520l8968l164M9496Q1886L0798n7967N559P314k8486
15348a4209J3514k47J5984O3756J8757K814o5775K1348k9659j7166n4229K1376
15336b3736Q771L7825M7299O509J0217l9903k0493N6979N9951p788p7496j9105
15324C9030j2068m0460L39J3538L0021k3143l0191k2482L2062N6109j6597n4354
$$ plain form
15312 -28196 -46053 -87820 -83698 -7339 43441 26883 28086 35776 72989 62735 11259 -17939
15300 -17939 -22679 -25965 -12363 -27778 -19981 24868 -22267 20879 19362 14662 37344 -7597 -22161
15287 -22161 4252 -4458 -22643 54606 97415 70113 60556 123435 66826 11344 -559 56351
15275 56351 47281 107940 119080 20344 19021 28047 -24209 -13931 -82621 -95544 -23968 20883
15263 20883 60402 42232 49140 23472 -5619 11296 -57408 32324 77195 6106 22148 12688
15251 12688 65989 116685 101807 1895 38286 51537 -25011 -6394 -26677 -22107 -54446 -56402
15239 -56402 -22152 25983 42664 19168 -23372 -66821 -35321 -74277 -43497 4192 -35458 -40975
15227 -40975 -43926 -29014 -7671 -36611 -7995 21351 83574 87223 36872 41627 -9132 8959
$$ packed form
15312b8196j7857m1767M122P6359N0780j6558J203P690L7213j0254n1476k9198
15300a7939m740l286J3602j5415P797M4849m7135M3146j517m700K2682m4941j4564
15287b2161K6413q710j8185P7249M2809k7302r557O2879n6609n5482j1903N6910
15275E6351r070O0659J1140r8736j323R026n2256J0278o8690j2923P1576M4851
15263B0883L9519j8170O908k5668k9091J6915o8704Q9732M4871p1089J6042r460
15251A2688N3301N0696j4878r9912L6391J3251p6548J8617k0283M570l2339j956
15239e6402L4250M8135J6681k3496m2540m3449L1500l8956L0780M7689l9650n517
15227d0975k951J4912K1343k8940K8616K9346O2223L649n0351M755n0759J8091
$$ plain form
15215 8959 37955 23596 -55405 -103623 -97536 -150048 -150172 -161481 -132324 -74253 -104464 -131740
15203 -131740 -94764 -47039 -73758 -85058 -3474 39024 -12186 -26635 -69335 -91638 -181426
15192 -181426 -162615 -104426 -77101 -73056 -38135 -79809 -23417 101172 67039 72071 91923 72712
15180 72712 14543 -45233 -68363 -46410 -22023 30040 82338 96166 152275 89490 57995 -5942
15168 -5942 -51066 13779 74638 85092 98400 79948 85506 -10179 -24621 -17266 -16455 -25931 4587
15155 4587 10295 422 -14271 -29359 -9714 17186 -42583 -84368 -65904 -85117 -94234 -85300 -93624
15142 -93624 -64836 -80614 -97533 -88890 -73605 -52846 -45939 -64262 -62919 -14566 17754 38837
15130 38837 1727 -26948 -66403 -74057 -70353 -69831 -27552 -187 -3529 -50316 -52730 3020 51485
$$ packed form
15215H959K8996j4359p9001m8218O087n2512j24j1309K9157N8071l0211k7276
15203a31740L6976M7725k6719j1300Q1584M2498n1210j4449m2700k2303q9788
15192a81426J8811N8189K7325M045L4921m1674N6392J24589l4133N032J9852j9211
15180G2712n8169n9776k3130K1953K4387N2063N2298J3828N6109o2785l1495o3937
15168e942m5124O4845O0859J0454J3308j8452N558r5685j4442P355Q11r476L0518
15155D587N708r873j4693j5088J9645K6900n9769m1785J8464j9213r117Q934q324
15142i3624K8788j5778j6919Q643J5285K0759O907j8323J343M8353L2320K1083
15130C8837l7110k8675l9455p654L704N22M2279K7365l342m6787k414N5750M8465
$$ plain form
15117 51485 61787 50176 -28412 -75260 -44894 5880 53306 16126 8427 -82818 -69709 41938
15105 41938 40615 -24358 -24538 -48704 -51771 -32215 13876 33183 -8695 22480 52506 48546 74446
15092 74446 38206 17252 -16712 -58287 -97134 -57560 -52997 -87077 -33543 55193 93298 46810
15080 46810 -47624 -80650 -44548 -19170 -93448 -138410 -154795 -167242 -154211 -117081 -86344 -47800
15068 -47800 -54008 -33464 -51087 -34635 -28527 4141 55316 36158 36179 46900 20809 -31441 -31238
15055 -31238 -32461 -12271 36282 312 -31671 30480 15510 8886 6520 24776 31001 61550
15043 61550 63057 46353 38188 1419 -20272 -54494 -99439 -159398 -159405 -76686 12997 -33079 -62936
15030 -62936 -7862 -7079 -47047 -31616 -73145 -53384 -83897 -71130 -52493 -50255 -32522 1870
$$ packed form
15117E1485J0302j1611p8588m6848L0366N0774M7426l7180p699r1245J3109J11647
15105D1938j323o4973j80k4166l067J9556M6091J9307m1878L1175L0026l960K5900
15092G4446l6240k0954l3964m1575l8847L9574M563l4080N3534Q8736L8105m6488
15080D6810r4434l3026L6102K5378p4278m4962j6385j2447J3031L7130L0737L8544
15068d7800o208K0544j7623J6452O108L2668N1175j9158K1J0721k6091n2250K03
15055c1238j223K0190M8553l5970l1983O2151j4970o624k366J8256O225L0549
15043F1550J507j6704q165l6769k1691l4222m4945n9959pQ2719Q9683m6076k9857
15030f2936N5074P83l9968J5431m1529J9761l0513J2767J8637K238J7733L4392
$$ plain form
15018 1870 -22296 -5401 -8982 -46358 -67843 -53176 -37151 4187 -16787 -3948 93330 98385
15006 98385 139752 93047 52907 43899 77704 100410 125537 47410 2936 -9518 -13860 50107
14994 50107 116370 68005 21231 -14025 -23546 1623 39397 46236 73393 105254 6826 -80582
14982 -80582 -119810 -70547 56035 67168 334 -69911 -138852 -164762 -98974 -45164 -34731
14971 -34731 33217 73848 75862 32809 -20793 -20439 9387 36854 80542 18546 13801 17578 36749
14958 36749 44464 52863 38179 56748 149640 155799 124455 89189 23544 -22441 -61990 39289
14946 39289 77762 57342 3664 -56158 -71571 -60521 -6459 40678 -24375 -24980 60916 68828
14934 68828 66947 59699 81009 62295 -11679 -49851 -107688 -51869 -6787 20465 29556 10424
$$ packed form
15018A870k4166J6895l581l7376k1485J4667J6025M1338k0974J2839R7278N055
15006I8385M1367m6705m0140r008L3805K2706K5127p8127m4474j2454m342O3967
14994E0107O6263m8365m6774l5256r521K5169L7774O839K7157L1861r8428q7408
14982h0582l9228M9263J26582J1133o6834p0245o8941k5910O5788N3810J0433
14971c4731O7948M0631K014m3053n3602L54K9826K7467M3688o1996m745L777J9171
14958C6749P715Q399j4684J8569R2892O159l1344l5266o5645m5985l9549J01279
14946C9289L8473k0420n3678n9822j5413J1050N4062M7137o5053o05Q5896P912
14934F8828j881p248K1310j8714p3974l8172n7837N5819M5082K7252R091j9132
$$ plain form
14922 10424 9313 13420 -23222 -17882 -30686 -50336 -46066 -10846 44536 32737 35663 19066 58133
14909 58133 89884 21003 -66139 -83354 -103954 -26755 54257 125004 107981 8331 -4474 -5204
14897 -5204 16206 868 -9404 50967 78548 75424 82396 74392 9205 -6279 196 7592 29789
14884 29789 45562 29140 25921 94193 152758 121209 94211 126337 138111 97578 79990 93991
14872 93991 109555 79867 39479 25623 -279 -54853 64531 42064 -84236 -60051 17458
14861 17458 50985 -6528 -13890 -5381 -1183 51737 63506 -6622 -7196 21729 47938 93824 70786
14848 70786 6804 -528 10921 42141 35296 30938 78734 90661 101058 120432 176547 202033
14836 202033 275407 380909 360513 307840 303072 279298 254152 253630 231611 188843 167233 134763
$$ packed form
14922A0424j111M107l6642N340j2804j9650M270L5220N5382j1799K926j6597L9067
14909E8133L1751o8881q7142j7215k0600P7199Q1012P0747j7023r9650j2805p30
14897e204K1410j5338j0272O0371K7581l124O972q004o5187j5484O475P396K2197
14884B9789J5773j6422l219O8272N8565l1549k6998L2126J1774m0533j7588J4001
14872I3991J5564k9688m0388j3856k5902n4574J19384k2467j26300K4185P7509
14861A7458L3527n7513p362Q509M198N2920J1769p0128n74K8925K6209M5886k3038
14848G0786o3982p332J1449L1220o845m358M7796J1927J0397J9374N6115K5486
14836B02033P3374J05502k0396n2673m768k3774k5146n22k2019m2768k1610l2470
$$ plain form
14824 134763 128217 164943 222422 216835 67648 -11454 14805 60167 98032 71435 18405 21294
14812 21294 56635 37492 54414 43556 15324 7433 -56143 -113815 -51665 23774 -9683 -1403
14800 -1403 54635 49876 -12138 23462 51714 96901 127547 138021 134225 146179 239771 261718
14788 261718 214172 181906 132631 87523 81593 85399 49232 55279 80524 63042 40913 65243
14776 65243 49619 33324 107441 171642 192657 220729 266583 205317 191244 183268 206703 221931
14764 221931 176278 152050 118482 47784 34769 -17617 15417 3403 32085 77896 55174
14753 55174 63108 75452 62335 56566 59182 -8116 64307 81709 71035 60335 89763 62471
14741 62471 24644 54500 23017 -10012 15214 -16614 -57110 -96618 -58578 -10683 -24790 -49023
$$ packed form
14824A34763o546L6726N7479n587j49187p9102K6259M5362L7865k6597n3030K889
14812B1294L5341j9143J6922j0858k8232p891o3576n7672O2150P5439l3457Q280
14800a403N6038m759o2014L5600K8252M5187L0646J0474l796J1954R3592K1947
14788B61718m7546l2266m9275m5108n930L806l6167O047K5245j7482k2129K4330
14776F5243j5624j6295P4117O4201K1015K8072M5854o1266j4073p976K3435J5228
14764B21931m5653k4228l3568p0698j3015n2386L3034j2014K8682M5811k2722
14753E5174P934J2344j3117n769K616o7298P2423J7402j0674j0700K9428k7292
14741F2471l7827K9856l1483l3029K5226l1828m0496l9508L8040M7895j4107k4233
$$ plain form
14729 -49023 5379 15464 -19058 -7702 17430 12416 -44785 -53062 -29906 -4315 73294 101490
14717 101490 95746 101683 15772 -458 45156 -15685 -112832 -101705 -42769 1554 -19260 13911
14705 13911 26466 90879 125478 134582 124301 70600 41910 54770 76762 32009 11062 33373
14693 33373 -28085 -100290 -100134 -91588 -137551 -159376 -85859 -20151 12953 16004 35284 84170
14681 84170 84682 54780 3822 -47344 -41358 -15344 -24736 -62321 -31330 26394 13806 11497 -23525
14668 -23525 -9889 19719 -45115 -38683 -3117 -19736 -32218 -48866 -56875 -13634 -26774 -8472
14656 -8472 -57304 -49506 -20672 -73344 -87281 -33091 39677 8818 -2215 39134 80148 73361
14644 73361 47671 96173 37627 30302 70048 112761 106324 42860 56282 112594 175485 169674
$$ packed form
14729d9023N4402J0085l4522J1356K5132n014n7201q277K3156K5591P7609K8196
14717A01490n744N937q5911j6230M5614o0841r7147J1127N8936M4323k0814L3171
14705A3911J2555O4413L4599R104j0281n3701k8690J2860K1992m4753k0947K2311
14693C3373o1458p2205J56Q546m5963k1825P3517O5708L3104L051J9280M8886
14681H4170N12k9902n0958n1166N986K6014r392l7585L0991N7724j2588k309l5022
14668b3525J3636K9608o4834O432L5566j6619j2482j6648q009M3241j3140J8302
14656h472m8832P798K8834n2672j3937N4190P2768l0859j1033M1349M1014o787
14644G3361k5690M8502n8546p325L9746M2713o437o3464J3422N6312O2891n811
$$ plain form
14632 169674 126203 57938 34749 -27534 -103594 -71110 -102631 -47911 9477 91547 120554
14621 120554 67417 79215 133784 137455 118822 42100 12741 1870 -32290 -65060 -88258 -109072
14609 -109072 -171154 -115974 -76177 -22305 17777 19886 -57296 -72881 -42611 -26882 -23003 -83795
14597 -83795 -88836 -79502 -127530 -122256 -55308 -28161 -55786 -6171 30667 40049 -11748 -48394
14585 -48394 -25968 -27160 -40412 -68292 -73268 -75515 -53741 -43265 11404 18631 -11812 8396
14573 8396 27872 25793 52265 48234 -15136 -65739 8066 80960 57302 90285 140030 134209
14561 134209 97910 103771 93837 32511 6466 -5664 -23495 -25445 -707 6292 11175 23501
14549 23501 2171 -41304 -61443 -35234 1406 89007 97514 42718 18382 19896 -87497 -138321
$$ packed form
14632A69674m3471o8265k3189o2283p6060L2484l1521N4720N7388Q2070K9007
14621A20554n3137J1798N4569L671j8633p6722k9359j0871l4160l2770k3198k0814
14609a09072o2082N5180L9797N3872M0082K109p7182j5585L0270J5729L879o0792
14597h3795n041R334m8028N274O6948K7147k7625M9615L6838R382n1797l6646
14585d8394K2426j192j3252k7880m976k247K1774J0476N4669P227l0443K0208
14573H396J9476k079K6472m031o3370n0603P3805P2894k3658L2983M9745n821
14561A34209l6299N861r934o1326k6045j2130j7831j950K4738O999M883J2326
14549B3501k1330m3475k0139K6209L6640Q7601Q507n4796k4336J514j07393n0824
$$ plain form
14537 -138321 -111787 -10740 34396 -28142 -65015 -33705 -27460 50208 17693 -31801 -33254 1089
14525 1089 9477 101688 65255 16548 -25413 -33252 11623 -35909 -65708 -78652 -110746 -78061
14513 -78061 -112501 -120903 -72373 -49059 -6991 36197 15609 16016 43060 53447 36044 352
14501 352 -17004 -3303 24136 -10980 1796 51203 39721 49448 31988 -19177 -76493 -23474
14489 -23474 35734 23494 67659 47831 -8367 -10789 -32815 -53424 -13294 100251 74890 25737
14477 25737 95423 97311 104967 65251 61081 157320 224385 190044 180666 184540 205478 249132 341203
14464 341203 454923 593993 895923 1163628 1400372 1716313 1905869 1975977 1965871 1866130
14454 1866130 1625827 1388494 1134753 873628 605320 356498 310684 186003 95103 162804
$$ packed form
14537a38321K6534J01047M5136o2538l6873L1310O245P7668l2515m9494j453L4343
14525A089Q388R2211l6433m8707m1961p839M4875m7532k9799j2944l2094L2685
14513g8061l4440q402M8530K3314M2068M3188k0588M07K7044J0387j7403l5692
14501C52j7356J3701K7439l5116J2776M9407j1482R727j7460n1165n7316N3019
14489b3474N9208j2240M4165j9828n6198k422k2026k0609M0130J13545k5361m9153
14477B5737O9686J888P656l9716m170R6239O7065l4341r378L874K0938M3654R2071
14464C41203J13720J39070L01930K67705K36744L15941J89556P0108j0106r9741
14454A866130k40303k37333k53741k61125k68308k48822m5814j24681r0900O7701
$$ plain form
14444 162804 189866 189328 171315 157255 147937 156441 112413 54099 27290 89307 105724 80592
14432 80592 38450 30194 92665 163553 112043 54952 44904 30154 29094 41065 48761 24292
14420 24292 8726 35044 53786 70942 -51293 -144749 -166609 -76165 -25000 17455 64967
14409 64967 38411 45504 66511 54856 21846 -86204 -126883 -61902 -51193 -30578 25345 27109
14397 27109 1180 -3464 -15988 7368 -38069 17560 26474 -62329 24946 58918 51227 90460
14385 90460 31382 -438 -29274 -82411 -91843 -82661 -137305 -94882 -44189 -72332 -59189 -39954
14373 -39954 -51079 -38384 49866 166262 158874 42403 16714 49950 36887 35619 60148 24964
14361 24964 -28884 -45139 -15156 -12167 18463 -24382 -38423 52646 60624 -24676 -25203 6380
$$ packed form
14444A62804K7062n38j8013j4060r318Q504m4028n8314k6809O2017J6417k5132
14432H0592m2142q256O2471P0888n1510n7091j0048j4750j060J1971P696k4469
14420B4292j5566K6318J8742J7156j22235r3456k1860R0444N1165M2455M7512
14409F4967k6556P093K1007j1655l3010j08050m0679O4981J0709K0615N5923J764
14397B7109k5929m644j2524K3356m5437N5629Q914q8803Q7275L3972p691L9233
14385I0460n9078l1820k8836n3137r432R182n4644M2423N0693k8143J3143J9235
14373c9954j1125J2695Q8250J16396p388j16471k5689L3236j3063j268K4529l5184
14361B4964n3848j6255K9983K989L0630m2845j4041R1069P978q5300n27L1583
$$ plain form
14349 6380 13789 36359 64183 9655 -18082 10193 97974 13374 -36726 19594 33966 65808
14337 65808 73144 33632 -21385 -46276 -6972 64865 61810 16810 -3746 17781 56571 34139
14325 34139 -8312 -24975 -4089 50243 49623 97357 79343 74513 34196 5525 2998 8496 52399
14312 52399 38664 2657 7958 31147 1349 8350 1503 39894 14710 18610 68303 83937
14300 83937 75948 37302 90395 69468 83021 97748 14838 -90083 -89329 -51835 -51659 10202
14288 10202 -14770 -35203 -81160 -51074 19251 41108 -20194 24127 29258 -2434 -4355 -7300
14276 -7300 -1996 41802 6955 -17153 -82932 -72481 50329 98657 75068 2714 -51747 -76468
14264 -76468 -57654 -4085 -10313 -82130 -78459 2548 37376 52923 86625 55635 29300 -12041
$$ packed form
14349F380P409K2570K7824n4528k7737K8275Q7781q4600n0100N6320J4372L1842
14337F5808P336l9512n5017k4891L9304P1837l055m5000k0556K1527L8790k2432
14325C4139m2451j6663K0886N4332o20M7734j8014m830m0317k8671k527N498M3903
14312E2399j3735l6007N301K3189k9798P001o847L8391k5184L900M9693J5634
14300H3937p989l8646N3093k0927J3553J4727q2910j04921P54L7494J76O1861
14288A0202k4972k0433m5957L0086P0325K1857o1302M4321N131l1692j921k945
14276g300N304M3798l4847k4108o5779J0451J22810M8328k3589p2354n4461k4721
14264g6468J8814N3569o228p1817L671Q1007L4828J5547L3702l0990k6335m1341
$$ plain form
14252 -12041 -44692 7038 15023 1256 -40086 43045 114744 107680 94039 57055 41103 49023
14240 49023 43913 -25690 -29390 24388 31409 -54215 -51864 28216 45592 34552 17725 71593
14228 71593 37655 10656 8250 45042 95638 74035 37729 69107 73951 38811 61904 3099
14216 3099 6215 -36351 -86342 -80048 -41639 -45256 -33907 32772 -21453 22510 115783 172859
14204 172859 163158 105571 40528 40601 93737 91193 -25268 -15321 36271 8576 50458 39429
14192 39429 12571 60837 128286 168778 201085 213741 152085 137778 114119 103034 119795 182349
14180 182349 168438 153553 220523 275432 208127 56272 3455 59261 81220 16253 24384
14169 24384 81253 103768 145357 174051 172636 189456 200216 194772 205988 178611 169256 175588
$$ packed form
14252a2041l2651N1730P985j3767m1342Q3131P1699p064j3641l6984j5952P920
14240D9023n110o9603l700N3778P021q5624K351Q0080J7376j1040j6827N3868
14228G1593l3938k6999k406L6792N0596k1603l6306L1378M844l5140K3093n8805
14216C099L116m2566m9991O294L8409l617J1349O6679n4225M3963R3273N7076
14204A72859r701n7587o5043P3N3136k544j16461R947N1592k7695M1882j1029
14192C9429k6858M8266O7449M0492L2307J2656o1656j4307k3659j1085J6761O2554
14180A82349j3911j4885O6970N4909o7305j51855n2817N5806K1959o4967Q131
14169B4384N6869K2515M1589K8694j415J6820J0760n444J1216k7377r355O332
$$ plain form
14157 175588 178145 141457 107470 130896 198442 123321 44150 43272 140816 132819 163499 206564
14145 206564 200679 197947 111007 74131 115422 152705 109256 75861 93139 120637 72654 116823
14133 116823 119696 118926 137544 123615 74079 102641 150589 161175 131449 137975 37393 -17387
14121 -17387 26654 70198 78143 115909 101533 40172 21687 56910 121363 164358 169961 208792
14109 208792 220153 202363 189728 173519 165831 159363 192193 208165 226871 202189 214414 191361
14097 191361 188853 222459 224304 137164 196124 256005 264287 255227 334249 397184 389886 329717
14085 329717 335342 320937 284028 227581 155518 182571 124541 107666 154315 198199 254971 220983
14073 220983 168594 159612 152978 181957 274692 378505 429348 390397 322379 300085 305814 363668
$$ packed form
14157A75588K557l6688l3987K3426O7546p5121p9171q78R7544p997L0680M3065
14145B06564n885k732q6940l6876M1291L7283m3449l3395J7278K7498m7983M4169
14133A16823K873p70J8618j3929m9536K8562M7948J0586k9726O526j00582n4780
14121a7387M4041M3544P945L7766j4376o1361j8485L5223O4453M2995N603L8831
14109B08792J1361j7790j2635j6209p688o468L2830J5972J8706k4682J2225k3053
14097A91361k508L3606J845q7140N8960N9881Q282r060P9022O2935p298o0169
14085C29717N625j4405l6909n6447p2063K7053n8030j6875M6649M3884N6772l3988
14073B20983n2389q982o634K8979R2735J03813N0843l8951o8018k2294N729N7854
$$ plain form
14061 363668 348317 327954 336210 423903 461705 436152 390581 392372 398716 458609 494625 459554
14049 459554 465838 549977 555336 495492 513492 543560 605397 677449 747349 788172 803098 776412
14037 776412 812979 820121 850395 909873 968683 974131 1008191 1041994 1090741 1082998 1121922 1210213
14025 1210213 1306217 1386890 1472107 1607553 1700736 1784618 1919721 2072413 2164773 2266273
14015 2266273 2405807 2507543 2746072 3029991 3379149 3743842 4098750 4542588 5059664
14006 5059664 5684575 6416559 7401368 8618599 10172256 11950279 13892810 15977615 18243825
13997 18243825 20580155 23219552 26344440 30338740 36095474 44697410 57770480 77967541
13989 77967541 108203286 150022480 202100762 259835703 315933397 361936865 389519508
$$ packed form
14061C63668j5351k0363Q256Q7693L7802k5553m5571J791O344N9893L6016l5071
14049D59554O284Q4139N359n9844J8000L0068O1837P2052O9900M0823J4926k6686
14037G76412L6567P142L0274N9478N8810N448L4060L3803M8747p743L8924Q8291
14025A210213R6004Q0673Q5217J35446R3183Q3882J35103J52692R2360J01500
14015B266273J39534J01736K38529K83919L49158L64693L54908M43838N17076
14006E059664O24911P31984R84809J217231J553657J778023J942531K084805K266210
13997A8243825K336330K639397L124888L994300N756734Q601936J3073070K0197061
13989G7967541L0235745M1819194N2078282N7734941N6097694M6003468K7582643
$$ plain form
13982 389519508 393019640 371375495 329137842 274430604 215907769 161360119 116169506
13975 116169506 82641579 60268894 46240690 37489778 31894254 28204126 25605799
13968 25605799 23695359 22181974 21068708 20482685 20387936 20664200 21174655 21503262 21322791
13959 21322791 20330165 18539562 16247099 13711135 11295977 9218159 7480914 6189264
13951 6189264 5301839 4690065 4272531 3988154 3669322 3419783 3240281 3023049 2840828
13942 2840828 2685160 2580588 2399514 2288221 2130204 2021050 1923750 1797546 1778468 1761185
13932 1761185 1701007 1639558 1627632 1619504 1573472 1481718 1393138 1309568 1240234 1155495 1070173
13921 1070173 1107250 1044109 1024504 1014686 1012191 944281 936150 982963 987950 1045088 1001164 889385
$$ packed form
13982C89519508L500132k1644145m2237653n4707238n8522835n4547650m5190613
13975A16169506l3527927k2372685j4028204q750912n595524l690128k598327
13968B5605799j910440j513385j113266n86023r4749K76264N10455L28607j80471
13959B1322791r92626j790603k292463k535964k415158k077818j737245j291650
13951F189264q87425o11774m17534k84377l18832k49539j79502k17232j82221
13942B840828j55668j04572j81074j11293j58017j09154r7300j26204j9078j7283
13932A761185o0178o1449j1926q128m6032r1754q8580q3570o9334q4739q5322
13921A070173L7077o3141j9605r818k495o7910q131M6813M987N7138m3924j11779
$$ plain form
13909 889385 817051 793332 746155 725927 733704 697966 640118 710439 793257 732946 750200 800551
13897 800551 744070 661241 606845 566681 566894 559853 565941 551582 583208 547584 443138 399878
13885 399878 431184 473574 589116 689862 685578 688847 676854 632154 532172 455739 487522
13874 487522 463190 394450 377905 366076 414357 431070 408177 424338 447929 505972 537409
13863 537409 463200 422945 435891 414686 437664 454537 415647 332634 314380 358854 385309
13852 385309 307095 277498 256639 222300 160371 123207 134223 139085 114432 178895 229182 235586
13840 235586 183148 219679 297093 294310 299962 258013 209046 200637 172750 216256 167988 170949
13828 170949 156528 149930 189580 226528 208204 200351 156534 192812 205917 182083 172613 199288
$$ packed form
13909H89385p2334k3719m7177k0228P777l5738n7848P0321Q2818o0311J7254N0351
13897H00551n6481q2829n4396m0164K13p041O088j4359L1626l5624j04446m3260
13885C99878L1306M2390J15542J00746m284L269j1993m4700r9982p6433L1783
13874D87522k4332o8740j6545j1829M8281J6713k2893J6161K3591N8043L1437
13863E37409p4209m0255J2946k1205K2978J6873l8890q3013j8254M4474K6455
13852C85309p8214k9597k0859l4339o1929l7164J1016M862k4653O4463N0287O404
13840B35586n2438L6531P7414k783N652m1949m8967q409k7887M3506m8268K961
13828A70949j4421o598L9650L6948j8324p853m3817L6278J3105k3834r470K6675
$$ plain form
13816 199288 205083 211689 185650 203964 175867 149863 165939 174453 231398 316928 368404 353455
13804 353455 296318 252826 228240 225834 166330 139444 125068 142826 130479 83767 156893 248094
13792 248094 231618 244339 211316 228150 193301 236402 251416 204518 195585 199833 215547 199714
13780 199714 198795 187449 199115 214074 173221 225754 277392 250689 240372 312050 292896 283349
13768 283349 258416 241269 233727 143960 99793 85385 113681 166846 153512 92643 42683 43077
13756 43077 39411 79938 135395 180562 137457 153776 189045 159683 99007 27257 16837 25048
13744 25048 8701 38608 83902 12446 23085 37802 29985 14699 81271 119457 81722 84039
13732 84039 112830 96233 90077 70065 -6314 -16080 92725 212263 197412 217456 157573 71901
$$ packed form
13816A99288N795O606k6039J8314k8097k6004J6076Q514N6945Q5530N1476j4949
13804C53455n7137m3492k4586k406n9504k6886j4376J7758j2347m6712P3126R1201
13792B48094j6476J2721l3023J6834l4849M3101J5014m6898q933M248J5714j5833
13780A99714r19j1346J1666J4959m0853N2533N1638k6703j0317P1678j9154r547
13768B83349k4933j7147p542q9767m4167j4408K8296N3165j3334o0869m9960L94
13756D3077l666M0527N5457M5167m3105J6319L5269k9362o0676p1750j0420Q211
13744B5048j6347K9907M5294p1456J0639J4717p817j5286O6572L8186l7735K317
13732H4039K8791j6597o156k0012p6379r766J08805J19538j4851K0044n9883q5672
$$ plain form
13720 71901 58992 62113 101641 94327 118654 206568 142732 102409 62983 52891 65842 97406
13708 97406 154274 198838 172074 154199 157355 141588 122498 102475 94453 107480 95461 55186
13696 55186 69251 97004 72465 62256 105111 110862 93536 111812 115993 123095 157983 182600
13684 182600 201206 185669 139600 67145 67149 114997 89992 27842 60200 33450 59878 121024
13672 121024 114142 90775 107285 130312 101131 147031 135851 128444 85113 119909 113374 81956
13660 81956 10906 3209 -28021 817 123900 123691 78619 57333 76731 78935 7786 31610
13648 31610 64482 40283 63752 70448 8119 25570 72869 37248 6769 -380 34323 10236
13636 10236 -65859 -70528 -49252 32088 140376 135407 134935 139108 115380 130616 87049 72573
$$ packed form
13720G1901j2909L121L9528p314K4327Q7914o3836m0323l9426j0092J2951L1564
13708I7406N6868M4564k6764j7875L156j5767j9090k0023q022J3027j2019m0275
13696E5186J4065K7753k4539j0209M2855N751j7326J8276M181P102L4888K4617
13684A82600J8606j5537m6069p2455MM7848k5005o2150L2358k6750K6428O1146
13672A21024o882k3367J6510K3027k9181M5900j1180p407m3331L4796o535l1418
13660H1956p1050p697l1230K8838J23083k09m5072k1286J9398K204p1149K3824
13648C1610L2872k4199K3469O696o2329J7451M7299l5621l0479p149L4703k4087
13636A0236p6095m669K1276Q1340J08288m969m72M173k3728J5236m3567j4476
$$ plain form
13624 72573 79154 100371 155254 206587 160543 92124 116642 91601 84370 147992 149635 145299
13612 145299 105837 64532 36393 -48358 -63873 -47168 -13658 79097 124111 118866 73877 87840
13600 87840 138993 154491 72908 58479 45235 -16328 -16990 31085 69276 89070 110306 149417
13588 149417 72610 46518 46976 20687 60906 108634 43439 -11834 2532 -8224 -13983 -45683
13576 -45683 -49496 -1224 30800 21913 40807 93387 126303 137798 170758 130860 147504 102586
13564 102586 125792 158753 168836 123885 66794 46639 75796 44368 45715 -8531 48223 32789
13552 32789 21779 34131 8473 70502 78330 26524 -12992 -11315 8031 -4321 -21797 219
13540 219 27160 30317 34640 56763 45388 56007 42175 11590 9808 72852 113839 143299 144824
$$ packed form
13624G2573O581K1217N4883N1333m6044o8419K4518k5041p231O3622J643m336
13612A45299l9462m1305k8139q4751j5515J6705L3510R2755M5014n245m4989J3963
13600H7840N1153J5498q1583j4429j3244o1563o62M8075L8191J9794K1236L9111
13588A49417p6807k6092M58k6289M0219M7728o5195n5273J4366j0756n759l1700
13576d5683l813M8272L2024q887J8894N2580L2916J1495L2960l9898J6644m4918
13564A02586K3206L2961J0083m4951n7091k0155K9157l1428J347n4246N6754j5434
13552C2789j1010J2352k5658O2029P828n1806l9516J677J9346j2352j7476K2016
13540B19K6941L157M323K2123j1375J0619j3832l0585j782O3044M0987K9460J525
$$ plain form
13527 144824 147914 150301 204595 240791 223935 205316 195977 156647 118063 139032 138257 129199 156430
13514 156430 211057 237753 279327 322157 381380 459266 533838 708272 926261 1202598 1489910
13503 1489910 1802125 1995599 2041051 2069240 1946111 1720424 1385316 1089918 842742 669193
13493 669193 527550 406351 318089 271453 213744 140727 103857 82419 9460 5355 41100
13482 41100 42221 59889 54712 47834 65207 151143 113228 73419 88428 108236 110888 122249
13470 122249 102640 96197 79143 60792 43697 100501 104379 59473 65871 85759 134925 174523
13458 174523 126310 59717 -5898 -48604 -16940 -33165 74071 66427 -13978 7586 -16763
13447 -16763 10527 28115 26292 17327 60518 83053 40883 45814 106953 127672 108857 49509
$$ packed form
13527A44824L090K387N4294L6196j6856j8619r339l9330l8584K0969p75r058K7231
13514A56430N4627K6696M1574M2830N9223P7886P4572J74434K17989K76337K87312
13503A489910L12215J93474M5452K8189j23129k25687l35108k95398k47176j73549
13493F69193j41643j21199q8262m6636n7709p3017l6870k1438p2959m105L5745
13482D1100J121J7668n177o878J7373Q5936l7915l9809J5009J9808K652J1361
13470A22249j9609o443j7054j8351j7095N6804L878m4906O398J9888M9166L9598
13458A74523m8213o6593o5615m2706L1664j6225J07236p644q0405K1564k4349
13447a6763K7290J7588j823q965M3191K2535m2170M931O1139K0719j8815n9348
$$ plain form
13435 49509 6728 -21305 -7030 -4277 -70105 8823 117351 114929 83464 88934 96330 166598
13423 166598 115221 85297 29707 -59325 -98774 -113676 -58450 15763 103227 117703 67416
13412 67416 51196 72450 95478 106248 123529 126652 60542 8953 20997 93319 99122 41498
13400 41498 20548 83983 107526 50946 2699 16695 -2113 -18027 105327 125891 67029
13389 67029 37530 1399 10551 51572 30714 28330 90885 167327 100226 41440 32506 -1531
13377 -1531 -27575 -34824 -14101 -24461 -43818 3176 3455 15964 67045 111391 120810 33583 -40916
13364 -40916 2956 67243 143267 39209 -55320 -101955 -55967 42533 47829 67396 105437 128713
13352 128713 81416 60000 61906 49673 104269 69131 11282 -28336 27913 54343 46240 47097
$$ packed form
13435D9509m2781k8033J4275K753o5828P8928J08528k422l1465N470P396P0268
13423A66598n1377k9924n5590q9032l9449j4902N5226P4213Q7464J4476n0287
13412F7416j6220K1254K3028J0770J7281L123o6110n1589J2044P2322N803n7624
13400D1498k0950O3435K3543n6580m8247J3996j8808j5914J23354K0564n8862
13389F7029k9499l6131R152M1021k0858k384O2555P6442o7101n8786q934l4037
13377a531k6044p249K0723j0360j9357M6994K79J2509N1081M4346R419q7227p4499
13364d0916M3872O4287P6024j04058r4529m6635M5988R8500N296J9567L8041K3276
13352A28713m7297k1416J906j2233N4596l5138n7849l9618N6249K6430q103Q57
$$ plain form
13340 47097 71406 77558 58971 70382 25410 -68223 -89541 -58200 13506 15368 -2199 -33621
13328 -33621 -79705 -132924 -167313 -119022 -57108 -26058 -41540 -69233 -55147 11238 -749 55488
13316 55488 116107 173303 101979 23492 39371 45864 23258 2839 -30929 -9310 1566 -27656
13304 -27656 21368 48490 79661 61836 45326 78627 137859 154693 161760 135033 76032 74472
13292 74472 82172 13425 -2837 43603 -26836 -65795 -86520 -21105 1886 -24215 3517 -6263
13280 -6263 3437 -15164 -48599 -54309 -46838 -6603 27334 -22909 -35698 -34871 -33489 -83599 -78169
13267 -78169 -45533 -66076 -94526 -55326 20447 53869 -7948 -8267 -15923 44061 86787 85731
13255 85731 45004 -25825 -146866 -175045 -155075 -109354 -87455 -104267 -158551 -121414 -67656
$$ packed form
13340D7097K4309O152j8587J1411m4972r3633k1318L1341P1706J862j7567l1422
13328c3621m6084n3219l4389M8291O1914L1050j5482k7693J4086O6385j1987N6237
13316E5488O0619N7196p1324p8487J5879O493k2606k0419l3768K1619J0876k9222
13304b7656M9024K7122L1171j7825j6510L3301N9232J6834P067k6727n9001j560
13292G4472P700o8747j6262M6440p0439l8959k0725O5415K2991k6101K7732r780
13280f263R700j8601l3435n710P471M0235L3937n0243j2789Q27J382n0110N430
13267g8169L2636k0543k8450L9200P5773L3422o1817l19p656N9984M2726j056
13255H5731m0727p0829j21041k8179J9970M5721K1899j6812n4284L7137N3758
$$ plain form
13244 -67656 -19933 -38084 36065 37669 9238 11910 69589 94239 92916 40810 20196 25317
13232 25317 34827 -13267 -34523 -50018 -4778 74064 66684 52283 -1070 -33706 -6345 13693
13220 13693 46444 33378 -20715 -53159 -22553 -1865 20540 194 9531 120691 144822 81422
13208 81422 43918 32680 12458 43249 117027 78767 10708 5174 22107 31386 105874 53285
13196 53285 15152 81355 141007 150402 128362 92177 60703 2405 1666 17457 -9532 -84791
13184 -84791 -81048 -47485 37835 14588 -13512 20112 82449 181349 191154 155050 117912 78210
13172 78210 38074 82233 54173 26042 43228 71294 103841 127166 87238 75993 76943 99297
13160 99297 75300 12203 18366 55647 7522 -4577 43770 81116 61576 16304 11338 488
$$ packed form
13244f7656M7723j8151P4149J604k8431K672N7679K4650j323n2106k0614N121
13232B5317R510m8094k1256j5495M5240P8842p380j4401n3353l2636K7361K0038
13220A3693L2751j3066n4093l2444L0606K0688K2405k0346R337J11160K4131o3400
13208H1422l7504j1238k0222L0791P3778l8260o8059n534J6933R279P4488n2589
13196E3285l8133O6203N9652R395k2040l6185l1474n8298p39J5791k6989p5259
13184h4791L743L3563Q5320k3247k8100L3624O2337R8900R805l6104l7138l9702
13172G8210m0136M4159k8060k8131J7186K8066L2547K3325l9928j1245R50K2354
13160I9297k3997o3097O163L7281m8125j2099M8347L7346j9540m5272m966j0850
$$ plain form
13148 488 22089 57846 89394 61835 41302 23818 28039 -27828 -91427 -78752 -20018 -5821
13136 -5821 26855 112900 61742 20341 24280 24388 42336 22586 10124 7824 72696 153498 171859
13123 171859 100884 64714 87397 43158 -9787 -11327 56353 50931 23175 25334 -25163 -47170
13111 -47170 -28917 -56709 -139605 -77047 -8270 26442 37541 37960 57022 13235 -9549 57286
13099 57286 150213 108753 64033 37100 34565 3736 -18498 -34785 -92557 -107010 -31513 52265
13087 52265 54510 6039 74168 103340 167775 179585 129573 15827 -3278 69909 104253 21035
13075 21035 20933 -5977 2861 42656 60031 50713 47774 933 -9640 30543 85833 143545 93720
13062 93720 38451 56692 90903 103498 59458 -7883 -39986 -74850 -78145 -54669 -6911 71749
$$ packed form
13148D88K1601L5757L1548k7559k0533j7484M221n5867o3599J2675N8734J4197
13136e821L2676Q6045n1158m1401L939J08J7948j9750j2462k300O4872Q0802J8361
13123A71859p0975l6170K2683m4239n2945j540O7680n422k7756K159n0497k2007
13111d7170J8253k7792q2896O2558O8777L4712J1099M19J9062m3787k2784O6835
13099E7286R2927m1460m4720k6933k535l0829k2234j6287n7772j4453P5497Q3778
13087E2265K245m8471O8129K9172O4435J1810n0012j13746j9105P3187L4344q3218
13075B1035j02k6910Q838L9795J7375r318k939m6841j0573M0183N5290N7712m9825
13062I3720n5269J8241L4211J2595m4040o7341l2103l4864l295K3476M7758P8660
$$ plain form
13050 71749 32203 29926 57700 78514 7932 -59740 -46677 33919 34870 29450 25650 59674 35287
13037 35287 -18686 -49489 -34603 67744 65741 -3369 -71138 1561 58305 -53709 -104191
13026 -104191 -80385 -35081 70 29777 10922 -21271 -17778 -8946 -54102 -79016 -10528 38563
13014 38563 1449 24925 117723 120229 101066 48018 -37368 -49477 -21156 -6592 -37501 -123416
13002 -123416 -108494 -83082 -45061 -46663 -74490 -67999 -36717 -19860 22539 61921 39330 -12584
12990 -12584 24861 17579 -11932 34266 60972 49483 60950 23381 44262 95210 32854 1079
12978 1079 21163 -24295 -99883 -92204 44547 55043 25888 -9179 -14096 53397 26844 14112
12966 14112 27019 116780 149010 70231 60564 49661 20279 77571 121622 85336 63414 30099
$$ packed form
13050G1749l9546k277K7774K0814p0582o7672J3063Q0596R51n420l800L4024k4387
13037C5287n3973l0803J4886J02347k003o9110o7769P2699N6744j12014n0482
13026a04191K3806M5304L5151K9707j8855l2193L493Q832m5156k4914O8488M9091
13014C8563l7114K3476R2798K506j9163n3048q5386j2109K8321J4564l0909q5915
13002a23416J4922K5412L8021j602k7827O491L1282J6857M2399L9382k2591n1914
12990a2584L7445p282k9511M6198K6706j1489J1467l7569K0881N0948o2356l1775
12978A079K0084m5458p5588P679J36751J0496k9155l5067m917O7493k6553j2732
12966A4112J2907Q9761L2230p8779r667j0903k9382N7292M4051l6286k1922l3315
$$ plain form
12954 30099 -23610 -45319 -26418 18608 32434 69651 68379 41870 25208 23422 3515 62775
12942 62775 99629 95546 91098 61528 95938 122599 140099 65039 20277 8274 -11920 84880
12930 84880 97443 110138 92778 132596 156470 150173 102596 174995 187499 167535 154906 70869
12918 70869 51076 69188 159411 169539 134091 152688 225738 250917 270307 227795 182299 134173
12906 134173 87344 70453 21247 -10451 40299 76379 20999 -14129 -4572 1843 83421 88337
12894 88337 93331 21567 -13545 -18791 -52299 -52293 13565 50116 92640 122440 101123 111319 98329
12881 98329 79459 26128 21566 65114 100220 53277 21150 37828 17783 -27081 -10452 62174
12869 62174 111764 81846 76379 55151 16430 -8314 -30086 -26370 28647 1850 -67879 -49723
$$ packed form
12954C0099n3709k1709J8901M5026J3826L7217j272k6509j6662j786j9907N9260
12942F2775L6854m083m448k9570L4410K6661J7500p5060m4762j2003k0194R6800
12930H4880J2563J2695j7360L9818K3874o297m7577P2399J2504j9964j2629q4037
12918G0869j9793J8112R0223J0128l5448J8597P3050K5179J9390m2512m5496m8126
12906A34173m6829j6891m9206l1698N0750L6080n5380l5128R557O415Q1578M916
12894H8337M994p1764l5112n246l3508OO5858L6551M2524K9800k1317J0196j2990
12881I8329j8870n3331m562M3548L5106m6943l2127J6678k0045m4864J6629P2626
12869F2174M9590k9918n467k1228l8721k4744k1772L716N5017k6797o9729J8156
$$ plain form
12857 -49723 -45962 1185 -15355 -3331 9314 495 -25370 -76212 -146514 -115961 -93358 -99585
12845 -99585 -128660 -121940 -111099 -94559 -73455 -118388 -107697 -28932 -7200 15039 10045 -4978
12833 -4978 -24183 5463 16124 37034 73816 92433 52323 23134 11468 31823 87066 92448
12821 92448 79160 48708 -7903 -2208 3026 47928 73076 87640 49097 4314 -32162 -71390
12809 -71390 -156925 -218143 -193405 -138030 -144850 -156066 -134455 -85658 -27816 -37775 -63540 -74054
12797 -74054 -98397 -98348 -154794 -131398 -109636 -81783 -35970 -31956 -8106 2809 -17566 -16041 66386
12784 66386 85170 44939 3179 9293 -16496 -60682 -81155 -55965 -37074 13609 42798 77087
12772 77087 43031 377 37881 25343 -24409 -14414 39364 52370 -66198 -20005 16618 -15266
$$ packed form
12857d9723L761M7147j6540J2024J2645q819k5865n0842p0302L0553K2603o227
12845i9585k9075O720J0841J6540K1104m4933J0691P8765K1732K2239m994j5023
12833d978j9205K9646J0661K0910L6782J8617m0110k9189j1666K0355N5243N382
12821I2448j3288l0452n6611N695N234M4902K5148J4564l8543m4783l6476l9228
12809g1390q5535o1218K4738N5375o820j1216K1611M8797N7842r959k5765j0514
12797g4054k4343M9n6446K3396K1762K7853M5813M014K3850J0915k0375J525Q2427
12784F6386J8784m0231m1760O114k5789m4186k0473K5190J8891N0683K9189L4289
12772G7087l4056m2654L7504j2538m9752R995N3778J3006j18568M6193L6623l1884
$$ plain form
12760 -15266 -12610 -1876 26282 22951 -44347 -35010 -36706 -25539 12534 19009 -56120 -102920 -81600
12747 -81600 24596 46615 1703 25266 44225 48137 -61629 -61517 -79324 -76354 -42338 -30244
12735 -30244 -72926 -63992 -68892 -69074 -3822 22594 45806 21731 87933 58977 3516 -53299
12723 -53299 -79585 -55952 -3697 16873 38841 61449 73932 65632 101458 33040 1718 -60287
12711 -60287 -22936 74355 27621 -18887 -23476 -38276 -12052 -62793 -117092 -141197 -97338 -12999
12699 -12999 22361 15604 -54546 -106536 -86374 -47960 -22367 -3704 -36211 -29961 -18031 47293
12687 47293 59065 70150 49785 26934 58910 39708 57624 102632 156686 139541 51573 17314
12675 17314 -7549 -38311 -78685 -131296 -116177 19903 45232 26893 -31018 43363 54251
$$ packed form
12760a5266K656J0734K8158l331o7298R337j696J1167L8073O475p5129m6800K1320
12747h1600J06196K2019m4912K3563J8959L912j09766J12j7807K970L4016J2094
12735c0244m2682Q934m900j82O5252K6416K3212k4075O6202k8956n5461n6815
12723e3299k6286K3633N2255K0570K1968K2608J2483q300L5826o8418l1322o2005
12711f0287L7351R7291m6734m6508m589j4800K6224n0741n4299k4105M3859Q4339
12699a2999L5360o757p0150n1990K0162L8414K5593J8663l2507O250J1930O5324
12687D7293J1772J1085k0365k2851L1976j9202J7916M5008N4054j7145q7968l4259
12675A7314k4863l0762m0374n2611J5119J36080K5329j8339n7911P4381J0888
$$ plain form
12664 54251 45092 -10557 -47099 -5978 27100 39071 96752 48140 -19535 -22657 14093 -2708
12652 -2708 -14448 17043 52330 95428 208378 183248 118601 52333 48607 71781 56178 90156
12640 90156 92968 50091 -7309 28612 55954 112939 121598 83073 11838 -36899 -30986 -8739
12628 -8739 -11010 -60767 1473 48124 21847 10344 -29835 -66228 -53507 10360 37454 -82120
12616 -82120 -89968 -7972 17973 46256 17554 -52325 -30227 17280 2550 -76599 -110718 -16122
12604 -16122 23709 77207 103519 113736 145331 152030 137589 106883 79821 85673 55152 -14055
12592 -14055 3990 31018 35620 16606 4006 3848 -81535 -123847 -99376 -5746 -11759 -15908 -21466
12579 -21466 15337 53214 35738 81178 87748 49590 30850 77239 88362 77032 84643 7336
$$ packed form
12664E4251r159n5649l6542M1121L3078J1971N7681m8612o7675l122L6750j6801
12652b708j1740L1491L5287M3098J12950k5130o4647o6268l726K3174j5603L3978
12640I0156K812m2877n7400L5921K7342N6985Q659l8525p1235m8737N913K2247
12628h739k271m9757O2240M6651k6277j1503m0179l6393J2721O3867K7094j19574
12616h2120p848Q1996K5945K8283k8702o9879K2098M7507j4730p9149l4119R4596
12604a6122L9831N3498K6312J0217L1595O699j4441l0706k7062N852l0521o9207
12592a4055J8045K7028M602j9014j2600j58q5383m2312K4471R3630o013m149n558
12579b1466L6803L7877j7476M5440O570l8158j8740M6389J1123j1330P611p7307
$$ plain form
12567 7336 -26206 -23568 -19429 -9558 -24289 6267 -38160 4942 36665 -13725 -27388 20539
12555 20539 -53018 -42948 -69428 -106881 -50111 -21237 32798 43957 -16644 -55606 -20997 2826
12543 2826 17222 16531 60597 45084 -6261 -37216 -18560 66478 105706 70145 35135 6108
12531 6108 -44319 -73687 -12032 14796 38846 73067 92640 18503 -23546 6111 -14858 -86682
12519 -86682 -36492 -14878 -2870 12926 17518 -9498 -56130 16333 56005 50183 56105 -22825
12507 -22825 -65322 -86870 -81782 -43038 -9858 15819 39289 44675 35061 60772 17097 -41885
12495 -41885 -11350 18638 59587 74491 130270 142102 116321 89630 110997 126817 90643 3398
12483 3398 -35406 11511 94090 50701 -58694 -73219 -22450 -35249 -76176 -68929 -47181 18602
$$ packed form
12567G336l3542K638M139R871j4731L0556m4427M3102L1723n0390j3663M7927
12555B0539p3557J0070k6480l7453N6770K8874N4035J1159o0601l8962L4609K3823
12543B826J4396o91M4066j5513n1345l0955J8656Q5038L9228l5561l5010k9027
12531F108n0427k9368O1655K6828K4050L4221J9573p4137m2049K9657k0969p1824
12519h6682N0190K1614J2008J5796M592k7016m6632P2463L9672n822N922p8930
12507b2825m2497k1548N088L8744L3180K5677K3470N386r614K5711m3675n8982
12495d1885L0535K9988M0949J4904N5779J1832k5781k6691K1367J5820l6174q7245
12483C398l8804M6917Q2579m3389j09395j4525N0769j2799m0927P247K1748O5783
$$ plain form
12471 18602 32066 -51934 -64715 -45502 10041 16825 -14061 32289 41617 -52159 -50133 9973
12459 9973 -27988 -11065 -1113 -49043 -80959 -48695 -50978 -10536 27057 58163 -20301 -60543
12447 -60543 -9931 60730 61710 83414 107381 51294 -15511 -18359 -18960 -6829 37332 77224 147083
12434 147083 127714 37662 -33312 -43996 -11321 15418 -25009 -14585 47933 81750 61624
12423 61624 24570 -7767 -1018 30177 53714 71754 -1057 47466 32560 -60264 -75610 -62381
12411 -62381 -60016 -57733 -12512 -18711 8437 30300 -20978 -38642 27682 883 53765 7837
12399 7837 -18440 -14247 -5833 61646 80094 101710 59277 50787 3062 -50213 -48737 -21921 -16401
12386 -16401 12634 49317 73118 38193 13953 -4133 -69728 -45148 -32375 -23442 -45985 -16222
$$ packed form
12471A8602J3464q4000j2781J9213N5543O784l0886M6350R328r3776K026O0106
12459I973l7961J6923R952m7930l1916L2264k283M0442L7593L1106p8464m0242
12447f0543N0612P0661R80K1704K3967n6087o6805k848o01J2131M4161L9892O9859
12434A47083j9369r0052p0974j0684L2675K6739m0427J0424O2518L3817k0126
12423F1624l7054l2337O749L1195K3537J8040p2811M8523j4906r2824j5346J3229
12411f2381K365K283M5221o199K7148K1863n1278j7664O6324k6799N2882m5928
12399G837k6277M193Q414O7479J8448K1616m2433q490m7725n3275J476K6816N520
12386a6401K9035L6683K3801l4925k4240j8086o5595K4580J2773Q933k2543K9763
$$ plain form
12374 -16222 -3461 125690 145571 92777 27481 -12895 -13628 -11884 11433 8733 70886 85158
12362 85158 54608 49748 55987 48701 70289 90667 75122 35509 -20754 -47035 -27599 -15399
12350 -15399 65653 17181 -22082 -31598 -53195 -75277 -34939 -33614 6727 -8355 13138 68524
12338 68524 118379 62253 4632 -8453 16669 40232 81369 29375 -13110 5104 -16095 12334
12326 12334 36117 -44870 -37010 -30126 -82639 -121323 -81016 -50596 -21640 -19896 -4128 -17354
12314 -17354 -22323 8099 24335 46287 57699 107786 106837 45288 34554 25401 2451 -80032
12302 -80032 -41315 65740 29735 -23630 -47467 -54267 -62937 -20933 -19071 -94419 -114006 -127089
12290 -127089 -59515 88644 94189 125269 138093 77083 41095 25393 26285 7759 15018 -26944
$$ packed form
12374a6222J2761J29151J9881n2794o5296m0376p33J744K3317k700O2153J4272
12362H5158l0550m860O239p286K1588K0378j5545l9613n6263k6281J9436J2200
12350a5399Q1052m8472l9263r516k1597k2082M0338J325M0341j5082K1493N5386
12338F8524M9855n6126n7621j3085K5122K3563M1137n1994m2485J8214k1199K8429
12326A2334K3783q0987P860O884n2513l8684M0307L0420K8956J744J5768j3226
12314a7354m969L0422J6236K1952J1412N0087r49o1549j0734r153k2950q2483
12302h0032L8717J07055l6005n3365k3837o800q670M2004J862p5348j9587j3083
12290a27089O7574J48159N545L1080J2824o1010l5988j5702Q92j8526P259m1962
$$ plain form
12278 -26944 -29647 9422 15509 16809 16265 -49068 -57777 33122 154533 208969 174878 125093 105396
12265 105396 124947 85128 72983 107769 56874 50092 54039 55852 58864 50442 20990 -42312
12253 -42312 9980 92032 131722 58652 34921 75435 113676 70921 15553 53955 104236 124692
12241 124692 128456 115486 92236 106678 115620 48124 -10603 -17352 -525 -5579 28890 -9352
12229 -9352 11578 42685 64372 53486 56428 75174 99618 137010 90634 74153 89745 96151
12217 96151 62764 30757 43295 57172 29215 39502 52004 84143 17004 -80458 -80821 -72278
12205 -72278 -47779 -14426 4937 72066 135552 189548 124010 104225 85240 14207 -74494 -120980
12193 -120980 -36620 11106 31188 70685 16334 -63917 -154565 -142574 -77633 25513 118131
$$ packed form
12278b6944k703L9069O087J300n44o5333q709R0899J21411N4436l4091m9785j9697
12265A05396J9551l9819j2145L4786n0895o782L947J813L012q422k9452o3302
12253d2312N2292Q2052L9690p3070k3731M0514L8241m2755n5368L8402N0281K0456
12241A24692L764j2970k3250J4442Q942o7496n8727o749J6827n054L4469l8242
12229i352K0930L1107K1687j0886K942J8746K4444L7392m6376j6481J5592O406
12217I6151l3387l2007J2538J3877k7957J0287J2502L2139o7139r7462l63Q543
12205g2278K4499L3353J9363O7129O3486N3996o5538j9785j8985p1033q8701m6486
12193a20980Q4360M7726K0082L9497n4351q0251r0648J1991O4941J03146R2618
$$ plain form
12182 118131 117281 66709 45486 83890 71144 53257 62145 76388 126349 98829 47318 -18193
12170 -18193 -49345 -65215 -93321 -50977 -36325 -105922 -133435 -68396 1823 16192 66630 100845
12158 100845 60946 28440 35670 1394 -6302 -55601 -79615 -83415 9422 46122 -9839 -91965
12146 -91965 -103015 -100231 -74884 -20784 -2622 21560 33340 57435 56227 28569 27149 75289
12134 75289 66192 64965 73082 98629 184941 160543 89118 40532 47569 57703 106843 105145 43844
12121 43844 7488 -49455 -91220 -77974 -116071 -111135 -84536 -4527 69991 85308 55300 -50326
12109 -50326 -54300 -103787 -159160 -122841 -134082 -123292 -61105 -47235 -68553 -65346 -42034 29061
12097 29061 25244 -2137 26714 24282 59768 93662 51933 33331 69348 22075 -48203 -77670
$$ packed form
12182A18131q50n0572k1223L8404j2746j7887Q888J4243M9961k7520n1511o5511
12170a8193l1152j5870k8106M2344J4652o9597k7513O5039P0219J4369N0438L4215
12158A00845l9899l2506P230l4276p696m9299k4014l800R2837L6700n5961q2126
12146i1965j1050K784K5347N4100J8162K4182J1780K4095j208k7658j420M8140
12134G5289r097j227Q117K5547Q6312k4398p1425m8586P037J0134M9140j698o1301
12121D3844l6356n6943m1765J3246l8097M936K6599Q0009P4518J5317l0008j05626
12109e0326l974m9487n5373L6319j1241J0790O2187J3870k1318L207K3312P1095
12097B9061l817k7381K8851k432L5486L3894m1729j8602L6017m7273p0278k9467
$$ plain form
12085 -77670 -71133 -13682 -18818 -10728 16572 4541 -27696 -40519 -65950 -43697 -54883 -92169
12073 -92169 -105985 -60297 23174 17540 49236 41035 -36431 -115508 -92793 -44707 -33122 1681
12061 1681 125998 100471 13767 -14323 1049 44298 37964 121103 155572 89167 78428 38220
12049 38220 -33338 -64270 -77657 -12330 -34521 -28015 60941 66300 72393 45093 15730 -26393
12037 -26393 -47620 -35359 -4391 -5939 -20219 568 30014 17254 21777 86334 81116 51284
12025 51284 -1591 -17004 -36088 -52725 -30939 -35016 15594 2902 8169 -30318 -52514 -43585
12013 -43585 -77005 -106756 -118258 -159134 -167105 -80679 -4970 34840 48886 30908 5610 -18618
12001 -18618 13010 34234 42853 29935 57297 79309 -16613 -58426 10062 -17837 -4190 11285
$$ packed form
12085g7670O537N7451n136Q090K7300j2031l2237j2823k5431K2253j1186l7286
12073i2169j3816M5688Q3471n634L1696q201p7466p9077K2715M8086J1585L4803
12061A681J24317k5527q6704k8090J5372M3249o334Q3139L4469o6405j0739m0208
12049C8220p1558l0932j3387O5327k2191O506Q8956N359O093k7300k9363m2123
12037b6393k1227J2261L0968j548j4280K0787K9446j2760M523O4557n218k9832
12025E1284n2875j5413j9084j6637K1786m077N0610j2692N267l8487k2196Q929
12013d3585l3420k9751j1502m0876p971Q6426P5709L9810J4046j7978k5298k4228
12001a8618L1628K1224Q619j2918K7362K2012r5922m1813O8488k7899J3647J5475
$$ plain form
11989 11285 29484 -7678 27028 4190 -52339 -66337 -56301 -15425 12146 15466 11915 -43779
11977 -43779 -7837 16955 14724 11825 35713 20580 35461 32081 71344 65172 31213 5672
11965 5672 14588 -3460 -36534 -66126 -23192 22220 16618 -30654 -18936 -43708 -42634 -25765
11953 -25765 -35617 -28786 -10771 30859 44374 -31786 -63567 -37203 6996 35589 62253 57359
11941 57359 46540 -24818 -77200 -47453 4786 89954 81713 -54830 -102559 -97856 -76516 -84128
11929 -84128 -64668 -48823 -57549 -66588 -57258 11358 12340 17338 62231 20197 12034 -27001 -57023
11916 -57023 -133942 -148536 -111129 -93781 -69393 -42750 -48538 -89252 -79913 -69576 -4885 -6520
11904 -6520 -13123 -45463 -49787 9513 20632 -10835 -33899 -7195 88756 96203 72979 48001
$$ packed form
11989A1285J8199l7162L4706k2838n6529j3998J0036M0876K7571L320l551n5694
11977d3779L5942K4792k231k899K3888j5133J4881l380L9263o172l3959k5541
11965E672Q916j8048l3074k9592M2934M5412n602m7272J1718k4772J074J6869
11953b5765r852O831J8015M1630J3515p6160l1781K6364M4199K8593K6664m894
11941E7359j0819p1358n2382K9747N2239Q5168q241j36543m7729M703K1340p612
11929h4128J9460J5845q726r039R330O8616R82M998M4893m2034q163l9035l0022
11916e7023p6919j4594L7407J7348K4388K6643n788m0714R339J0337O4691j635
11904f520o603l2340m324N9300J1119l1467k3064K6704R5951P447k3224k4978
$$ plain form
11892 48001 2704 19731 33455 14544 12145 -3177 -47242 -9367 41338 -22742 -24830 30175
11880 30175 16823 45862 24948 2849 10284 15917 19014 -2250 15662 66318 45953 -22588
11868 -22588 -27788 -54048 -56424 -47968 -25674 8231 16610 22586 -8904 -37956 -22135 23484 15676
11855 15676 -33345 30766 106614 164557 105718 33835 5866 -13788 56566 51754 -39348 -94540
11843 -94540 -92780 -33662 7918 13573 4654 73925 43246 27378 20841 39139 -11564 3049
11831 3049 81384 88964 124055 130091 86330 71463 103032 111226 122347 108475 -8926 -21169
11819 -21169 -46733 -39530 -7638 41954 20080 -6495 14525 30782 29018 24425 -47779 -48445 -33403
11806 -33403 -46372 -36382 4488 -54221 -159937 -99162 -7357 -35996 -3660 -35489 -45043 -51377
$$ packed form
11892D8001m5297J7027J3724j8911k399j5322m4065L7875N0705o4080k088N5005
11880C0175j3352K9039k0914k2099P435N633L097k1264J7912N0656k0365o8541
11868b2588n200k6260k376Q456K2294L3905Q379N976l1490k9052J5821M5619p808
11855A5676m9021O4111P5848N7943n8839p1883k7969j9654P0354m812r1102n5192
11843i4540J760N9118M1580N655q919O9271l0679j5868o537J8298n0703J4613
11831C049P8335P580L5091O036m3761j4867L1569Q194J1121j3872j17401j2243
11819b1169k5564P203L1892M9592k1874k6575K1020J6257j764m593p2204o66J5042
11806c3403j2969R990M0870n8709j05716O0775R1805k8639L2336l1829r554o334
$$ plain form
11794 -51377 -29529 65260 95613 65173 52774 -6850 -43820 11540 -36208 -53292 -41460 -73893
11782 -73893 -64927 2974 12001 -25394 -69939 -57272 -20407 -45260 -46627 -38981 1512 64443
11770 64443 68570 3684 -44827 -64630 -4743 28709 21085 35799 44841 -18617 23279 60765
11758 60765 69276 55028 100091 109652 72604 -8312 -56784 -48694 6208 -12264 -60029 -61458
11746 -61458 30315 69318 -21904 -83013 -138953 -89376 18359 91135 36999 -26634 -11092
11735 -11092 4549 -13817 -44438 19065 23944 34760 43156 29617 -3796 -46859 -74499 -44005
11723 -44005 -72218 -62906 -93707 -59767 -78613 -94948 -74955 -84836 -116995 -93061 -28557 -37750
11711 -37750 -31712 -45256 -57729 -58469 -56004 -48009 -71058 -138266 -149363 -133670 -48278 36204 -24731
$$ packed form
11794e1377K1848R4789L0353l0440j2399n9624l6970N5360m7748j7084J1832l2433
11782g3893Q966O7901R027l7395m4545J2667L6865k4853j367P646M0493O2931
11770F4443M127o4886m8511j9803N9887L3452p624J4714R042o3458M1896L7486
11758F0765Q511j4248M5063R561l7048q0916m8472Q090N4902j8472m7765j429
11746f1458R1773L9003r1222o1109n5940M9577J07735P2776n4136o3633J5542
11735a1092J5641j8366l0621O3503M879J0816Q396j3539l3413m3063k7640L0494
11723d4005k8213R312l0801L3940j8846j6335J9993r881l2159K3934O4504r193
11711c7750O038j3544j2473p40K465P995k3049o7208j1097J5693Q5392Q4482o0935
$$ plain form
11698 -24731 -38377 38069 65147 15094 15404 -31919 -12019 -28486 -74088 -57478 -34890 -5034
11686 -5034 -43477 -40531 4775 28918 -4633 -19729 4376 75921 135629 136332 128621 25120
11674 25120 -7997 11779 41318 94966 116809 89988 96958 126464 93939 41216 26675 36776
11662 36776 -26443 -51396 -4713 12167 -9012 25317 54858 56648 31389 13896 -28402 -39319
11650 -39319 22556 88997 175385 283535 329888 358982 322293 259810 140870 39493 -5747
11639 -5747 -32335 -25680 9930 72946 126145 187267 259726 326505 411780 387436 268442 180801
11627 180801 140047 98014 29095 8672 2397 -83280 -132721 -99780 -86041 -26750 46484 115083
11615 115083 101881 27421 43166 97045 96987 61509 57953 47559 54814 138596 191106 224951
$$ packed form
11698b4731j3646P6446K7078n0053L10m7323J9900j6467m5602J6610K2588K9856
11686e034l8443K946M5306K4143l3551j5096K4105P1545N9708P03p711j03501
11674B5120l3117J9776K9539N3648K1843k6821O970K9506l2525n2723j4541J0101
11662C6776o3219k4953M6683J6880k1179L4329K9541J790k5259j7493m2298j0917
11650c9319O1875O6441Q6388J08150M6353K9094l6689o2483j18940j01377m5240
11639e747k6588O655L5610O3016N3199O1122P2459O6779Q5275k4344j18994q7641
11627A80801m0754m2033o8919k0423o275q5677m9441L2941J3739N9291P3234O8599
11615A15083j3202p4460J5745N3879n8l5478l556j0394P255Q3782N2510L3845
$$ plain form
11603 224951 249579 304230 348735 356776 322064 211749 109984 83193 99563 97512 133819
11592 133819 191226 138061 226278 326359 336331 275229 224815 163955 116233 58807 27619
11581 27619 30964 101640 121970 78126 94031 112356 124930 109732 60092 34406 54747 61774
11569 61774 28193 -23940 -14349 -15097 -12570 -25962 31931 18296 13134 -8891 3939 24212 27759
11556 27759 569 74152 60083 -2403 -10479 -24890 -72564 -93166 -116508 -53335 23763 -20657
11544 -20657 -51194 8116 22975 45178 72760 106415 141005 128780 116131 -4459 -83753
11533 -83753 -39002 32825 81010 55182 -15135 -76669 -38605 -13883 -27219 -52080 24 11445
11521 11445 14897 42832 11612 -13009 -74519 -11995 5439 -22091 7203 73470 19848 57720
$$ packed form
11603B24951K4628N4651M4505Q041l4712j10315j01765k6791J6370k051L6307
11592A33819N7407n3165Q8217J00081R972o1102n0414o0860m7722n7426l1188
11581B7619L345P0676K0330m3844J5905J8325J2574j5198m9640k5686K0341P027
11569F1774l3581n2133R591p48K527j3392N7893j3635n162k2025J2830K0273L547
11556B7759k7190P3583j4069o2486q076j4411m7674k0602k3342O3173P7098m4420
11544b0657l0537N9310J4859K2203K7582L3655L4590j2225j2649j20590p9294
11533h3753M4751P1827M8185k5828p0317o1534L8064K4722j3336k4861N2104J1421
11521A1445L452K7935l1220k4621o1510O2524J7434k7530K9294O6267n3622L7872
$$ plain form
11509 57720 98000 43893 -2818 16056 -66490 -108289 -128168 -190884 -155785 -107389 -69750 -68249
11497 -68249 -56216 2769 29411 -21636 -62979 8701 26907 52301 46632 35274 -12117 -77077
11485 -77077 -46061 -6690 54521 32000 43233 22309 14384 -41172 -83510 -47156 -9099 83235
11473 83235 77471 4064 43198 28023 22642 6126 -5698 -35460 -51955 -148093 -132589 -80072
11461 -80072 -82601 -110959 -85763 -54922 -75758 -98210 -33105 27611 7453 22400 9431 -43136
11449 -43136 -86743 -47857 -18016 -9173 28002 20425 12911 29125 14870 19496 85290 101201
11437 101201 27347 -72741 -92331 -54892 -15561 -49854 -71331 -27723 1175 25040 -8
11426 -8 -32818 50059 41913 -1962 -54709 -52135 -27295 -99241 -111019 -161529 -135574 -35579 17263
$$ packed form
11509E7720M0280n4107m6711J8874q2546m1799j9879o2716L5099M8396L7639J501
11497f8249J2033N8985K6642n1047m1343P1680J8206K5394n669j1358m7391o4960
11485g7077L1016L9371O1211k2521J1233k0924p925n5556m2338L6354L8057R2334
11473H3235n764p3407L9134j5175n381j6516j1824k9762j6495r6138J5504N2517
11461h0072k529k8358K5196L0841k0836k2452O5105O0716k0158J4947j2969n2567
11449d3136m3607L8886K9841Q843L7175p577p514J6214j4255M626O5794J5911
11437A01201p3854j00088j9590L7439L9331l4293k1477M3608K8898K3865k5048
11426hl2810Q2877q146m3875n2747K574K4840p1946j1778n0510K5955R9995N2842
$$ plain form
11413 17263 -20147 -49987 -38927 44118 30087 35463 80092 110661 73005 -62270 -88605 -100888
11401 -100888 -82917 -42463 17386 -2487 19443 29815 65331 106289 75545 82193 18968 -66854
11389 -66854 -50039 -30101 59489 64088 297 31437 38627 -346 -42611 -21480 16272 79168
11377 79168 106312 92124 9956 11890 -8430 6606 54016 38806 -21821 -85129 -35804 -6342
11365 -6342 -1005 32582 15554 8640 43171 59691 68679 55910 16938 1098 12615 47204
11353 47204 46853 -31878 -42100 9007 44035 12261 -5628 -13031 35165 71483 63300 20064
11341 20064 -41719 -33442 -42903 -49923 -14573 5550 -27125 3855 28625 -17381 1367 28744
11329 28744 81604 83221 60298 59371 55653 -14208 29653 26070 -33494 -7948 -24631 -119012 -94336
$$ packed form
11413A7263l7410k9840J1060Q3045j4031N376M4629L0569l7656j35275k6335j2283
11401a00888J7971M0454N9849j9873K1930J0372L5516M0958l0744O648o3225q5822
11389f6854J6815J9938Q9590M599o3791L1140P190l8973m2265K1131L7752O2896
11377G9168K7144j4188q2168J934k0320J5036M7410j5210o0627o3308M9325K9462
11365f342N337L3587j7028o914L4531J6520Q988j2769l8972j5840J1517L4589
11353D7204l51p8731j0222N1107L5028l1774j7889p403M8196L6318q183m3236
11341B0064o1783Q277r461p020L5350K0123l2675L0980K4770m6006J8748K7377
11329B8744N2860J617k2923r27l718o9861M3861l583n9564K5546j6683r4381K4676
$$ plain form
11316 -94336 -32277 10144 30325 -27608 -42728 -10583 -20697 50921 45394 87522 82139 64708
11304 64708 32934 -35906 -16872 40613 49966 19625 -1904 -8173 -16554 -43708 -101777 -120651
11292 -120651 -99510 -89169 -58579 -25008 13492 -20326 -35762 -48466 -62936 -64192 -31855 -108593
11280 -108593 -120200 -101669 -65450 -52599 -53754 20151 91785 104278 103385 6281 -64041 -12669
11268 -12669 15054 62128 28840 -21560 -17802 -51580 -61397 -105896 -118098 -140529 -126561 -45344
11256 -45344 1704 16206 40069 115764 88503 -11766 -56708 -106784 -75289 -49551 -38345
11245 -38345 -95324 -97005 -39557 38899 37969 -33945 -76600 -44000 4330 -46893 -63959 -55899
11233 -55899 -18431 -76369 -140949 -146259 -96771 -94284 -85428 -22795 26517 28366 25709 76257 108469
$$ packed form
11316i4336O2059M2421K0181n7933j5120L2145j0114P1618n527M2128n383j7431
11304F4708l1774o8840J9034N7485R353l0341k1529o269q381k7154n8069j8874
11292a20651K1141J0341L0590L3571L8500l3818j5436j2704j4470j256L2337p6738
11280a08593j1607J8531L6219J2851j155P3905P1634J2493q93r7104p0322N1372
11268a2669K7723M7074l3288n0400L758l3778r817m4499j2202k2431J3968Q1217
11256d5344M7048J4502K3863P5695k7261j00269m4942n0076L1495K5738J1206
11245c8345n6979j681N7448P8456r30p1914m2655L2600M8330n1223j7066Q060
11233e5899L7468n7938o4580n310M9488K487Q856O2633M9312J849k657N0548L2212
$$ plain form
11220 108469 45844 -21632 -19717 35848 -6700 -25770 -16019 -17477 -52152 -22549 4058 -20162
11208 -20162 -52071 -4446 -11815 -15354 -40670 14542 86188 90339 31064 52662 46790 30682
11196 30682 28996 52639 91802 15309 -50253 -55286 -20369 22211 69304 78867 60916 31011
11184 31011 50751 69688 -14393 -13345 1433 -7171 -48184 -67391 -76181 524 65100 87478
11172 87478 57141 16376 -6595 45036 38676 -25073 -31811 24674 50007 42171 48134 82270
11160 82270 -44108 -189806 -232515 -237609 -223661 -182252 -173609 -50780 -42036 -85108 -11733 52493
11148 52493 -31789 -49295 -66515 -24145 -41226 -44077 -17762 -26380 -31455 25365 4833 2889
11136 2889 -14413 -19843 -38691 6021 41653 2941 6428 -7306 -30002 -70020 -88280 -92668
$$ packed form
11220A08469o2625o7476J915N5565m2548j9070R751j458l4675K9603K6607k4220
11208b0162l1909M7625p369l539k5316N5212P1646M151n9275K1598n872j6108
11196C0682j686K3643L9163p6493o5562n033L4917M2580M7093R563j7951k9905
11184C1011J9740J8937q4081J048J4778q604m1013j9207q790P6705O4576K2378
11172H7478l0337m0765k2971N1631o360o3749o738N6485K5333p836N963L4136
11160H2270j26378j45698m2709n094J3948M1409Q643J22829Q744m3072P3375O4226
11148E2493q4282j7506j7220M2370j7081k851K6315q618n075N6820k0532j944
11136B889j7302n430j8848M4712L5632l8712L487j3734k2696m0018j8260m388
$$ plain form
11124 -92668 -17994 23528 14033 -30852 12029 59930 -16373 -52919 -31497 69407 80428 66201
11112 66201 -21070 -56786 -54700 5265 -36160 -46201 -27181 -33333 -33002 5670 12092 -25089 -37569
11099 -37569 -23743 8881 -20481 -22296 -38589 -37361 4661 -29061 -60537 -82145 -44588 -63720
11087 -63720 -75699 -22368 -16595 7006 65395 135455 94707 49435 2869 -74151 -120712 -126016
11075 -126016 -79300 3504 79574 30512 -17300 -13091 7534 46458 88301 84092 94598 98134
11063 98134 88020 79334 7649 5485 65412 23805 -67725 -123669 -125810 -128056 -79674 -101394
11051 -101394 -74062 -52831 -86474 -63142 -74808 -114692 -89305 -105208 -112761 -113360 -69650 -920
11039 -920 -48559 -104980 -86237 -88547 -88629 18202 62940 80737 20972 -31706 -8009 49005 72013
$$ packed form
11124i2668P4674M1522r495m4885M2881M7901p6303l6546K1422J00904J1021j4227
11112F6201q7271l5716K086N9965m1425j0041J9020o152L31L8672O422l7181j2480
11099c7569J3826L2624k9362j815j6293J228M2022l3722l1476k1608L7557j9132
11087f3720j1979N3331N773K3601N8389P0060m0748m5272m6566p7020m6561n304
11075a26016M6716Q2804P6070m9062m7812M209K0625L8924M1843m209J0506L536
11063I8134j0114q686p1685k164N9927m1607r1530n5944k141k246M8382k1720
11051a01394K7332K1231l3643K3332j1666l9884K5387j5903p553n99M3710O8730
11039i20m7639n6421J8743k310q2J06831M4738J7797n9765n2678K3697N7014K3008
$$ plain form
11026 72013 45728 20323 -6786 -11929 39679 24780 32273 67986 95372 103727 78284 75210
11014 75210 78557 26197 -28443 -75188 -41872 -5272 32444 26504 -17663 -19517 -35113 -60508
11002 -60508 -84271 -77502 -49877 -67064 -73229 -75769 -85792 -37672 -39144 -85030 -136960 -86577
10990 -86577 -13242 -3152 -42320 84766 89019 52642 47581 58913 23365 -81447 -91138 -119720
10978 -119720 -128921 -175624 -116545 -114417 -65894 24491 29916 -12751 -85589 -94698 -63353 -9170
10966 -9170 637 -19093 43771 51035 -105428 -165929 -82037 -67669 -66324 -45608 42811 88986
10954 88986 109027 117172 39122 2768 45953 40870 22962 103552 121346 42909 40418 31170
10942 31170 28035 -38035 -50364 -8856 44277 47730 19051 34126 59555 67958 48660 37859
$$ packed form
11026G2013k6285k5405k7109n143N1608j4899P493L5713K7386Q355k5443l074
11014G5210L347n2360n4640m6745L3316L6600L7716n940m4167j854j5596k5395
11002f0508k3763O769K7625j7187o165k540j0023M8120j472m5886n1930N0383
10990h6577P3335J0090l9168J27086M253l6377n061J1332l5548j04812r691k8582
10978a19720r201m6703N9079K128M8523R0385N425m2667p2838r109L1345N4183
10966i170R807j9730O2864P264j56463o0501Q3892J4368J345K0716Q8419M6175
10954H8986K0041Q145p8050l6354M3185n083j7908Q0590J7794p8437k491r248
10942C1170l135o6070j2329M1508N3133L453k8679J5075K5429Q403j9298j0801
$$ plain form
10930 37859 49388 -36643 -70209 -42798 -51939 -97738 -85526 -41101 -31990 -23328 -8085 -48624
10918 -48624 -102794 -136007 -142979 -61912 -20847 -39468 -3189 23778 37425 -24177 -12228 -435
10906 -435 -60496 -82372 -33370 -5299 348 -8165 39957 46772 35112 3112 -30949 -92486 -96659
10893 -96659 -134596 -102894 -20636 -31378 -81304 -10138 42623 76602 107783 87746 43275 14921
10881 14921 7590 85635 38862 -5932 -47371 -22350 -64117 -115228 -174363 -197379 -134495 -42573
10869 -42573 30936 28926 -51882 -125349 -113842 -126742 -110723 -59895 -38503 -73445 -9879 51117
10857 51117 52778 9228 -15994 -33318 -18794 11541 7992 -26725 -36437 -20353 -54852 -89490
10845 -89490 -117666 -64116 -75457 -86941 -103715 -71183 -67072 -58897 14427 78276 129856 117332
$$ packed form
10930C7859J1529q6031l3566K7411r141m5799J2212M4425R111Q662J5243m0539
10918d8624n4170l3213o972Q1067M1065j8621L6279K6967J3647o1602J1949J1793
10906d35o0061k1876M9002K8071N647q513M8122O815j1660l2000l4061o1537m173
10893i6659l7937L1702Q2258j0742m9926P1166N2761L3979L1181k0037m4471k8354
10881A4921p331P8045m6773m4794m1439K5021m1767n1111n9135k3016O2884R1922
10869d2573P3509k010q0808p3467J1507j2900J6019N0828K1392l4942O3566O0996
10857E1117J661m3550k5222j7324J4524L0335l549l4717r712J6084l4499l4638
10845h9490k8176N3550j1341j1484j6774L2532M111Q175P3324O3849N1580j2524
$$ plain form
10833 117332 51638 -12391 -14541 42949 147242 160935 66485 28722 35563 34565 35231 8540
10821 8540 -33213 -114950 -54781 -32410 -46356 -55365 -50330 -96698 -68952 -5980 -20859 13567
10809 13567 8036 -15579 -57447 -79866 -86913 -127525 -105427 -82174 -49633 -1365 33076 18841
10797 18841 27152 -21031 -110549 -133775 -64078 -54811 -30116 -15497 -99042 -72833 -92696 432
10785 432 46925 -28252 -36032 11787 87616 91703 15618 11412 48875 49056 -4674 -77007 -132607
10772 -132607 -98706 -27911 32712 86771 85711 14305 -84108 -65754 -22538 -115044 -93249 -93037
10760 -93037 -63651 20806 -2479 -38335 -56199 -18788 29752 33158 72308 24117 10428 29744
10748 29744 37971 26624 29204 24317 38827 38696 37904 11320 15854 38300 40049 23250 -9647
$$ packed form
10833A17332o5694o4029k150N7490J04293J3693r4450l7763O841r98O66k6691
10821H540m1753q1737O0169K2371j3946r009N035m6368K7746O2972j4879L4426
10809A3567n531k3615m1868k2419p047m0612K2098K3253L2541M8268L4441j4235
10797A8841Q311m8183q9518k3226O9697R267K4695J4619q3545K6209j9863R3128
10785D32M6493p5177p780M7819P5829M087p6085m206L7463J81n3730p2333n5600
10772a32607L3901P0795O0623N4059j060p1406r8413J8354M3216r2506K1795K12
10760i3037K9386Q4457k3285l5856j7864L7411M8540L406L9150m8191j3689J9316
10748B9744Q227j1347K580m887J4510j31p92k6584M534K2446J749j6799l2897
$$ plain form
10735 -9647 -34662 -53744 -64162 -28650 -10009 -23842 26894 45970 37622 -1148 -17340 -38610
10723 -38610 -23467 -24487 44624 29631 23099 49762 43327 57995 68574 95526 98555 86632
10711 86632 -99 6766 11518 -12027 -52312 -95996 -43769 -9000 -64073 -40659 -25843 -23286
10699 -23286 -60778 -74897 -99742 -156433 -115837 -45389 -21342 -69199 -64286 31123 -41923 -124091
10687 -124091 -135598 -120292 -101311 -104906 -86393 -61722 -31563 5619 8932 -91524 -118134 -90843
10675 -90843 -106684 -168013 -142421 -118323 -74840 -18205 -74894 -54474 -60213 -59784 -93846 -149409
10663 -149409 -107101 -94269 -78804 14601 30789 -25837 -54954 -53045 -58277 21848 83315 53284
10651 53284 137173 105197 -11372 -39564 -85617 -43828 54720 51140 43296 115035 160811 154865
$$ packed form
10735i647k5015j9082j0418L5512J8641j3833N0736J9076q348l8770j6192k1270
10723c8610J5143j020O9111j4993o532K6663o435J4668J0579K6952L029j1923
10711H6632q6731O865M752k3545m0285m3684N2227L4769n5073K3414J4816K557
10699b3286l7492j4119k4845n6691M0596P0448K4047m7857M913R5409p3046q2168
10687a24091j1507J5306J8981l595J8513K4671L0159L7182L313j00456k6610K7291
10675i0843j5841o1329K5592K4098M3483N6635n6689K0420n739M29l4062n5563
10663a49409M2308J2832J5465R3405J6188n6626k9117J909n232Q0125O1467l0031
10651E3284Q3889l1976j16569k8192m6053M1789R8548l580p844P1739M5776n946
$$ plain form
10639 154865 106398 60549 85964 29791 -33800 -128411 -83559 19601 130975 150574 88592
10628 88592 43729 17880 18236 47133 10937 -36472 -12570 -37226 -35415 31622 105542 103289
10616 103289 100453 93299 73067 34756 47048 16580 -45812 -52812 5579 45520 67318 32549
10604 32549 7444 3491 -5928 42128 14951 -3925 11488 5982 -7940 -18557 -28447 -26102 17473
10591 17473 24820 33156 -24751 -63889 -48066 -32896 -70742 -107770 -74257 -30672 -14170 18768
10579 18768 2566 60419 131190 142324 74038 14848 -45501 -49744 -5378 -89723 -169732 -207571
10567 -207571 -136884 -73733 -63223 -82821 -42667 1932 -8657 40032 39106 38314 57957 17638
10555 17638 -16178 -40442 -100312 -67466 -28424 35787 120076 99225 11961 27470 79564 79561
$$ packed form
10639A54865m8467m5849K5415n6173o3591r4611M4852J03160J11374J9599o1982
10628H8592m4863k5849L56K8897l6196m7409K3902k4656J811O7037P3920k253
10616A03289k836p154k0232l8311J2292l0468o2392p000N8391L9941K1798l4769
10604C2549k5105l953r419M8056k7177j8876J5413n506j3922j0617r890K345M3575
10591A7473P347Q336n7907l9138J5823J5170l7846l7028L3513M3585J6502L2938
10579A8768j6202N7853P0771J1134o8286n9190o0349m243M4366q4345q0009l7839
10567b07571P0687O3151J0510j9598M0154M4599j0589M8689r26p92J9643m0319
10555A7638l3816k4264n9870L2846L9042O4211Q4289k0851q7264J5509N2094l
$$ plain form
10543 79561 -8429 9470 32162 32613 -12047 -44303 -47732 24329 1823 -6468 -36599 -102429
10531 -102429 -97657 -89298 -45806 -45469 -49579 -23950 -3421 -25607 17754 59684 24742 25924 23297
10518 23297 71162 87885 105037 91557 53466 30841 -25196 -60563 -44418 4367 -45593 -78494
10506 -78494 -27085 20066 9050 38684 957 -59436 -25888 27209 59840 -5859 -42471 -62810
10494 -62810 17675 128876 102364 13581 -30271 -35182 -37584 -23326 -5512 11151 -11011 -43247
10482 -43247 -74995 -70178 -2034 45057 31586 2053 6271 38163 16002 23214 65927 42314
10470 42314 36423 -15798 -94822 -58724 -55094 -90575 -41080 -11733 970 -67451 -155155 -116508
10458 -116508 -41431 2638 -18085 -56956 39741 27703 -10317 -30045 -49176 -53037 -25443 -10828
$$ packed form
10543G9561q7990J7899K2692M51m4660l2256l429P2061k2506q291l0131o5830
10531a02429M772Q359M3492L37m110K5629K0529k2186M3361M1930l4942J182k627
10518B3297M7865J6723J7152j3480l8091k2625n6037l5367J6145M8785m9960l2901
10506g8494N1409M7151j1016K9634l7727o0393L3548N3097L2631o5699l6612k0339
10494f2810Q0485J11201k6512q8783m3852m911k402J4258J7814J6663k2162l2236
10482d3247l1748M817O8144M7091j3471k9533M218L1892k2161P212M2713k3613
10470D2314n891n2221p9024L6098L630l5481M9495K9347J2703o8421q7704L8647
10458a16508P5077M4069k0723l8871R6697j2038l8020j9728j9131l861K7594J4615
$$ plain form
10446 -10828 14970 76819 118347 112423 94504 60848 42230 -32168 -45010 20092 64628 9874
10434 9874 -59104 -40956 -52988 -69788 -105127 -57293 -43686 -36525 2059 89394 139283 40130
10422 40130 -17329 -24123 -34722 10267 -19278 -56643 -32481 -21921 -50664 -77462 -58887 -19674
10410 -19674 37064 45509 48575 94312 113539 -4550 -42438 -32755 11435 24735 33924 -6146
10398 -6146 -54043 -81316 -62098 1962 34389 85418 47667 -71833 -42336 -26623 -55789 -34530
10386 -34530 12541 49652 25322 30655 27772 110384 131997 125210 53747 15548 -35794 -25589
10374 -25589 -75330 -39799 55901 34114 23335 39391 -16826 -55080 -60367 52898 96529 71529
10362 71529 -1481 -45586 -83438 -98560 -70020 -16893 -7509 -17177 43329 40942 4059 -61506
$$ packed form
10446a0828K5798O1849M1528n924j7919l3656j8618p4398j2842O5102M4536n4754
10434I874o8978J8148j2032j6800l5339M7834J3607P161L8584Q7335M9889r9153
10422D0130n7459o794j0599M4989k9545l7365K4162J0560k8743k6798J8575L9213
10410a9674N6738Q445L066M5737J9227j18089l7888R683M4190J3300R189m0070
10398f146m7897k7273J9218O4060L2427N1029l7751j19500K9497J5713k9166K1259
10386c4530M7071L7111k4330N333k883Q2612K1613o787p1463l8199n1342J0205
10374b5589m9741L5531R5700k1787j0779J6056n6217l8254n287J13265M3631k5000
10362G1529p3010m4105l7852j5122K8540N3127R384r668O0506k387l6883o5565
$$ plain form
10350 -61506 -144005 -212803 -179325 -74232 -11098 22119 46641 29490 16813 51171 113557
10339 113557 124536 130035 115528 180263 173252 164464 122949 11107 -79623 -28192 -19816 -82550
10327 -82550 -120147 -84880 -51628 -3012 -13997 38178 -1706 -59985 -100620 -116166 -55790 -81861
10315 -81861 -91478 -68986 -28868 -69781 -100666 -69783 -77245 -47192 -34565 -23530 -37349 -12215
10303 -12215 -53866 -83221 -42077 21737 -37751 -149588 -204285 -117134 -41944 -40849 -15198 -5701
10291 -5701 -70458 -113031 -16678 43328 73421 75733 87040 106044 75553 68934 99312 44533
10279 44533 17361 21205 21705 7095 1502 -45746 -100748 -128442 -76735 -38268 -45057 -37087 -69835
10266 -69835 -128422 -140054 -103502 -29995 -14768 -59252 -59261 -75760 -98067 -105954 -147156 -140316 -48229
$$ packed form
10350f1506q2499o8798L3478J05093O3134L3217K4522j7151j2677L4358O2386
10339A13557J0979N499j4507O4735p011q788m1515j11842r0730N1431Q376o2734
10327h2550l7597L5267L3252M8616j0985N2175l9884n8279m0635j5546O0376k6071
10315h1861r617K2492M0118m0913l0885L0883p462L0053J2627J1035j3819K5134
10303a2215m1651k9355M1144O3814n9488j11837n4697Q7151P5190J095K5651R497
10291e701o4757m2573R6353O0006L0093K312J1307J9004l0491o619L0378n4779
10279D4533k7172L844N00j4610n593m7248n5002k7694N1707L8467o789P970l2748
10266f9835n8587j1632L6552P3507J5227m4484rj6499k2307p887m1202O840R2087
$$ plain form
10253 -48229 43099 42889 49353 -5570 -35440 -75093 -41928 -36108 4323 11066 -13599 -3426 37666
10240 37666 18408 -37437 -70177 -39842 -33330 -73397 -42357 -27294 37307 44705 38131 5148
10228 5148 -20103 26979 32625 -17834 2586 -12348 -49009 11491 -17359 -31133 -44619 -112185
10216 -112185 -82630 -99559 -111694 -83098 -18960 11561 -48512 -96692 -92794 -65069 -56456 -67024
10204 -67024 -9301 68716 -20587 -19295 -8731 -5516 -36881 -69174 -13240 -25007 -43121 -55479
10192 -55479 -16948 -3550 -60587 -51998 -12127 -18466 -34539 -63958 -41175 -27015 -48425 -44069
10180 -44069 58989 52639 39040 123124 154771 97490 41331 48753 -1532 -13378 2744 -34535
10168 -34535 -51532 -46017 -14100 27237 -5594 -65255 -51868 -87127 -161989 -148479 -79469 -13514
$$ packed form
10253d8229R1328k10O464n4923k9870l9653L3165N820M0431O743k4665J0173M1092
10240C7666j9258n5845l2740L0335O512m0067L1040J5063O4601P398o574l2983
10228E148k5251M7082N646n0459K0420j4934l6661O0500k8850j3774j3486o7566
10216a12185K9555j6929j2135K8596O4138L0521o0073m8180L898K7725Q613j0568
10204f7024N7723P8017q9303J292J0564L215l1365l2293N5934j1767j8114j2358
10192e5479L8531J3398n7037Q589L9871o339j6073k9419K2783J4160k1410M356
10180d4069J03058o350j3599Q4084L1647n7281n6159P422n0285j1846J6122l7279
10168c4535j6997N515L1917M1337l2831n9661J3387l5259p4862J3510O9010O5955
$$ plain form
10156 -13514 35783 40983 -69106 -66965 -81363 -64322 -42639 -7471 -1229 -11460 -7255 19688
10144 19688 25489 27604 17186 40950 21137 -11620 9773 -704 45161 111466 85444 43480
10132 43480 53654 50500 -2140 23090 9516 -13605 47327 82748 50848 38577 12266 -39730
10120 -39730 -85171 -94127 -75278 -64005 -61203 -61936 -16617 -7406 10471 9528 -69781 -128766 -135333
10107 -135333 -75610 -15655 -2854 -46641 43913 72597 39596 5160 -58878 -111263 -47232
10096 -47232 -51259 -46920 -55641 -64921 -19547 -54563 -14394 19771 44814 100480 113984 50391
10084 50391 -2810 17301 -61843 -111953 -67393 35958 101340 97122 45440 6454 23330 11320
10072 11320 -18413 -61764 -65261 -99782 -26179 -11812 -73527 -155327 -123585 -110718 -53779 -50139
$$ packed form
10156a3514M9297N200j10089K141j4398J7041K1683L5168O242j0231M205K6943
10144A9688N801K115j0418K3764j9813l2757K1393j0477M5865O6305k6022m1964
10132D3480J0174l154n2640K5230j3574k3121O0932L5421l1900j2271k6311n1996
10120c9730m5441q956J8849J1273K802p33M5319R211J7877r43p9309n8985o567
10107a35333N9723N9955J2801m3787R0554K8684l3001l4436o4038n2385O4031
10096d7232m027M339q721r280M5374l5016M0169L4165K5043N5666J3504o3593
10084E0391n3201K0111p9144n0110M4560J03351O5382m218n1682l8986J6876j2010
10072A1320k9733m3351l497l4521P3603J4367o1715q1800L1742J2867N6939L640
$$ plain form
10060 -50139 -100866 -194296 -182066 -91181 -46687 -69833 -37022 38401 -10227 -55702 -9733 -49111
10048 -49111 -46215 -30304 -41652 -32747 -31295 -70190 -50244 25155 22088 -7023 26382 35278 43225
10035 43225 -27757 -48619 -7300 -22644 -54289 -76342 -108013 -82750 -45409 -49360 -57425 -107611
10023 -107611 -54689 72126 85723 100741 146169 83227 16875 41043 64143 -9983 10499
10012 10499 28516 41177 -36378 -96452 -33925 84468 141961 77926 13567 73976 162710
10001 162710 182304 177357 121632 192295 250165 201338 177214 155364 116604 82468 38764 -47828
9989 -47828 -16101 -29158 -50245 -28919 -53907 -62983 31213 129024 161371 109049 113877 109866
9977 109866 101045 45726 -51423 -64967 -71789 -99680 -107373 -42542 -5658 17976 57543 36348
$$ packed form
10060e0139n0727r3430J2230R0885M4494k3146L2811P5423m8628m5475M5969l9378
10048d9111K896J5911j1348Q905J452l8895J9946P5399l067k9111L3405Q896P947
10035D3225p0982k0862M1319j5344l1645k2053l1671K5263L7341l951q065n0186
10023a07611N2922J26815J3597J5018M5428o2942o6352K4168K3100p4126K0482
10012A0499J8017J2661p7555o0074O2527J18393N7493o4035o4359O0409Q8734
10001A62710J9594m947n5725P0663N7870m8827k4124k1850l8760l4136m3704q6592
9989d7828L1727j3057k1087K1326k4988r076R4196R7811L2347n2322M828m011
9977A09866q821n5319r7149j3544o822k7891p693O4831L6884K3634L9567k1195
$$ plain form
9965 36348 -3593 -27055 36711 59041 63279 22262 -26226 -45024 -64006 11785 59146 32454
9953 32454 -9351 -3166 -28671 -31547 19048 44096 92738 67878 -11409 -63585 -85428 -170233
9941 -170233 -166913 -153734 -155560 -138832 -100671 -86744 -96994 -94965 -32378 -51205 -106347 -65488
9929 -65488 -48231 -18285 -77784 -107150 -73325 -80804 -52042 24445 70970 91963 103580 75524
9917 75524 42971 30526 -201 -110026 -92969 -64444 -117456 -110755 -17006 59338 54462 18575
9905 18575 -33704 29532 80748 72162 22080 60520 99861 159429 112038 2852 -18895 47648
9893 47648 5737 -43465 -9171 -19892 -120070 -175203 -155657 -96597 -114937 -40357 -19510 18172
9881 18172 59415 95317 5121 -37562 -15081 -83986 -101807 -79945 -49812 -70083 -71978 -22458
$$ packed form
9965C6348l9941k3462O3766K2330M238m1017m8488j8798j8982P5791M7361k6692
9953C2454m1805O185k5505k876N0595K5048M8642k4860p9287n2176k1843q4805
9941a70233L320J3179j826J6728L8161J3927j0250K029O2587j8827n5142M0859
9929f5488J7257K9946n9499k9366L3825p479K8762P6487M6525K0993J1617k8056
9917G5524l2553j2445l0727j09825J7057K8525n3012O701R3749P6344m876l5887
9905A8575n2279O3236N1216q586n0082L8440L9341N9568m7391j09186k1747O6543
9893D7648m1911m9202L4294j0721j00178n5133J9546N9060j8340P4580K0847L7682
9881A8172M1243L5902r0196m2683K2481o8905j7821K1862L0133k0271j895M9520
$$ plain form
9869 -22458 10972 19176 -5916 10889 44832 72788 70425 134501 235858 218087 183053 158096
9857 158096 185224 124174 77552 109860 98037 36439 10464 -5197 25114 36363 11362 32290
9845 32290 44805 20299 67245 94329 112995 135968 144956 155667 175217 104215 76081 105778
9833 105778 122205 105698 179642 227943 194602 223588 167287 109301 82695 18781 23213 -9693
9821 -9693 5383 44620 79336 104489 71315 90649 117390 67067 61383 83456 38587 33787
9809 33787 85993 85026 71405 47885 32118 55278 89395 62236 104565 102583 106619 48723 -27664
9796 -27664 -75161 -55701 -33593 25387 31699 42055 87448 105623 39928 -15994 -28670 -112111
9784 -112111 -166128 -138373 -104719 -72993 -72669 -79775 -40296 -12669 -8999 3783 52548 51386 -59077
$$ packed form
9869b2458L3430Q204k5092J6805L3943K7956k363O4076J01357j7771l5034k4957
9857A58096K7128o1050m6622L2308j1823o1598k5975j5661L0311J1249k5001K0928
9845C2290J2515k4506M6946K7084J8666K2973Q988J0711J9550p1002k8134K9697
9833A05778J6427j6507P3944M8301l3341K8986n6301n7986k6606o3914M432l2906
9821i693J5076L9237L4716K5153l3174J9334K6741n0323n684K2073m4869m800
9809C3787N2206r67j3621k3520j5767K3160L4117k7159M2329j982M036n7896p6387
9796b7664m7497J9460K2108N8980O312J0356M5393J8175o5695n5922j2676q3441
9784a12111n4017K7755L3654L1726L24p106L9479K7627L670J2782M8765j162j10463
$$ plain form
9771 -59077 -106280 -40389 -59 66189 54826 -25370 -39929 -81539 -189534 -123534 -60200 -48301
9759 -48301 -120711 -129791 -145860 -118901 -25930 16218 -3817 -22520 -44043 -6906 51818 72446
9747 72446 55427 58194 57468 6411 -931 52770 64228 50370 113052 102112 -15586 -110148
9735 -110148 -104685 -97950 -114814 -53976 -19784 24007 -3813 -11978 -12739 -4116 33394 37757 9800
9722 9800 -15320 23497 29946 41503 71154 91534 80549 53239 2853 22145 55653 84655
9710 84655 1233 -36454 -47622 48451 45672 64155 19245 1744 -31072 -41437 -24390 7632
9698 7632 -49160 -148658 -74868 9792 25128 -5232 -82791 -77465 -111218 -113830 -87915 -71722
9686 -71722 -34125 8930 19419 47603 77417 90803 90736 74037 116435 108724 76871 26815 -279
$$ packed form
9771e9077m7203O5891M0330O6248j1363q0196j4559m1610j07995O6000O3334J1899
9759d8301p2410r080j6069K6959R2971M2148k0035j8703k1523L7137N8724K0628
9747G2446j7019K767p26n1057p342N3701J1458j3858O2682j0940j17698r4562
9735a10148N463O735j6864O0838L4192M3791k7820q165p61Q623L7510M363k7957
9722I800k5120L8817O449J1557K9651K0380j0985k7310n0386J9292L3508K9002
9710H4655q3422l7687j1168R6073k779J8483m4910j7501l2816j0365J7047L2022
9698G632n6792r9498P3790Q4660J5336l0360p7559N326l3753k612K5915J6193
9686g1722L7597M3055J0489K8184K9814J3386o7j6699M2398p711l1853n0056k7094
$$ plain form
9673 -279 -21941 -7782 19625 62350 55311 120931 163266 202706 123030 54276 -91 -82361
9661 -82361 -93131 -92896 2130 37970 23230 14953 -25422 12009 73505 64463 24821 32531 55475
9648 55475 -45783 -100066 -116789 -131113 -105086 -43592 33586 60092 44053 93610 95235 -5498
9636 -5498 -49939 -79194 -72209 -62938 -45546 -29859 1667 -8323 -64436 -96803 -86727 -64654 -32965
9623 -32965 -32839 -63848 -71684 -71201 -107709 -79310 -29105 -5543 42628 71081 61516 71326 46711
9610 46711 26832 52999 46325 37111 12191 2297 -37235 24180 13196 -26232 -3913 610 -6407
9597 -6407 71951 42350 -31685 -27320 -45058 27965 65388 51130 -28739 29380 28001 -70461
9585 -70461 -76556 -24232 -9230 -26464 -58995 -103702 -38899 40941 35614 -11719 -55878 -42209
$$ packed form
9673b79k1662J4159K7407M2725p039O5620M2335L9440p9676o8754n4367q2270
9661h2361j0770K35R5026L5840j4740q277m0375L7431O1496r042l9642P710K2944
9648E5475j01258n4283j6723j4324K6027O1494P7178K6506j6039M9557J625j00733
9636e498m4441k9255O985R271J7392J5687L1526r990n6113l2367J0076K2073L1689
9623c2965J26l1009p836M83l6508K8399N0205K3562M8171K8453r565R810k4615
9610D6711j9879K6167o674r214k4920r894l9532O1415j0984l9428K2319M523p017
9597f407P8358k9601p4035M365j7738P3023L7423j4258p9869N8119j379r8462
9585g0461o095N2324J5002j7234l2531m4707O4803P9840n327m7333m4159J3669
$$ plain form
9573 -42209 -39366 30256 53703 81822 88351 40572 -73537 -89705 -124707 -123208 -90613 -23889
9561 -23889 2901 -39344 -40671 -17116 7645 20268 32207 63524 -28931 -111435 -107001 -70494
9549 -70494 -67377 -32485 -12759 31923 25301 -21159 -25697 -41592 -70622 -63626 -89400 -52354 -16627
9536 -16627 -64653 -46584 -18998 -33322 -70857 -75756 -63680 -68656 -116515 -84175 -85475 -149340
9524 -149340 -180786 -116642 -67054 -17978 11143 -3091 -24681 49373 78676 16416 25095 15042
9512 15042 -1580 -15649 58265 19402 -11733 59596 142251 149453 45379 -95833 -118646 -31200
9500 -31200 46552 17090 15237 30316 10945 -23515 -42675 -8335 14732 403 18216 51941
9488 51941 36863 -8618 -44206 -54411 -30541 -17590 -22507 -54393 -65376 11274 30876 34677
$$ packed form
9573d2209K843O9622K3447K8119O529m7779j14109j6168l5002J499L2595O6724
9561b3889K6790m2245j327K3555K4761J2623J1939L1317r2455q2504M434L6507
9549g0494L117L4892J9726M4682o622m6460m538j5895k9030O996k5774L7046L5727
9536a6627m8026J8069K7586j4324l7535m899J2076m976m7859L2340j300o3865
9524a49340l1446O4144M9588M9076K9121j4234k1590P4054K9303o2260Q679j0053
9512A5042j6622j4069P3914l8863l1135P1329Q2655P202j04074j41212k2813Q7446
9500c1200P7752k9462j853J5079j9371l4460j9160L4340K3067j4329J7813L3725
9488E1941j5078m5481l5588j0205K3870J2951m917l1886j0983P6650J9602L801
$$ plain form
9476 34677 46588 5357 -20300 -40295 -36196 5487 6051 42947 47507 -2088 -30729 2952 58072
9463 58072 96123 83659 6542 -51390 -45535 -38571 -75445 -101071 -85100 -92875 -42284 83597
9451 83597 104092 87127 97064 76357 70984 122513 123348 78693 43665 39269 35627 51163 48797
9438 48797 52286 53061 4927 -32927 -78039 -48141 6989 -24061 -63364 -123630 -157914 -63007
9426 -63007 4210 33348 16268 -13183 -72891 -81567 -49463 -18399 -22726 -13922 3478 -36737
9414 -36737 -47095 66672 24245 -41413 -8601 6857 37726 7959 -27926 -43370 -34738 19112
9402 19112 5234 13931 98911 86422 73454 54235 42922 39232 33476 37870 65887 24983 -4277
9389 -4277 -17085 8804 63818 41307 -15921 35811 53691 7614 -1820 31216 85848 108461
$$ packed form
9476C4677J1911m1231k5657j9995M099M1683N64L6896M560m9595k8641L3681N5120
9463E8072L8051j2464p7117n7932N855O964l6874k5626J5971p775N0591J25881
9451H3597K0495j6965R937k0707n373N1529Q35m4655l5028m396l642J5536k366
9438D8797L489P75m8134l7854m5112K9898N5130l1050l9303o0266l4284R4907
9426f3007O7217K9138j7080k9451n9708q676L2104L1064m327Q804J7400m0215
9414c6737j0358J13767m2427o5658L2812J5458L0869k9767l5885j5444Q632N3850
9402A9112j3878Q697Q4980j2489j2968j9219j1313l690n756M394K8017m0904k9260
9389d277j2808K5889N5014k2511n7228N1732J7880m6077r434L3036N4632K2613
$$ plain form
9377 108461 82700 19975 -44632 -77614 -64803 -31366 -32242 -36745 -20635 -50990 -19672 -62037
9365 -62037 -52748 -85043 -169085 -174031 -126196 -81445 -78183 -29270 60938 55808 32095 -31838 -51793
9352 -51793 -83435 -65881 -72618 -102187 -75153 -17116 13537 31824 21168 -1329 26548 -6792
9340 -6792 30667 16471 -15453 9966 39418 90300 59994 53447 -531 26073 -4264 -16357
9328 -16357 -56203 -97590 -50479 -28002 -22542 72761 113380 121016 25923 26605 -4486 -75391 -76976
9315 -76976 -92695 -41295 62959 108622 71494 30835 -3785 -56275 -114396 -122901 -57832 43915
9303 43915 28983 40800 66099 25518 45694 47028 -8973 -26778 -136787 -139598 -106557 -105403
9291 -105403 -139317 -90581 1041 -1404 -26445 -53516 -10646 -34770 -25315 10033 7526 39827
$$ packed form
9377A08461k5761o2725o4607l2982J2811L3437q76m503J6110l0355L1318m2365
9365f2037R289l2295q4042m946M7835M4751L262M8913R0208n130k3713o3933j9955
9352e1793l1642J7554o737k9569K7034N8037L0653J8287j0656k2497K7877l3340
9340f792L7459j4196l1924K5419K9452N0882l0306o547n3978K6604l0337j2093
9328a6357l9846m1387M7111K2477N460R5303M0619P636r5093O82l1091p0905j585
9315g6976j5719N1400J04254M5663l7128m0659l4620n2490n8121q505O5069J01747
9303D3915j4932J1817K5299m0581K0176J334n6001j7805j10009k811L3041J154
9291a05403l3914M8736R1622k445k5041k7071M2870k4124R455L5348k507L2301
$$ plain form
9279 39827 13246 44507 30823 -50768 -149814 -99605 -13527 42793 18854 38382 86285 87581
9267 87581 30590 34788 17875 5349 22560 -18586 42750 120840 155932 73461 2275 -13697
9255 -13697 20886 51539 16193 5061 16848 -36587 -36624 -48720 -53847 -95109 -73351 -79546 -121929
9242 -121929 -81324 -48726 -5979 36628 95042 139229 97329 85127 62205 8956 -26067 -48721
9230 -48721 -17444 -12763 -37115 -27973 -46931 5415 58167 93450 41953 18330 -1746 6753
9218 6753 53279 28189 26478 67410 24057 -1385 40539 56776 45669 19114 -9513 -56229
9206 -56229 -28430 -11114 34950 3330 36642 118867 197720 178395 137313 68103 31275 38883
9194 38883 84038 96854 30378 13026 37974 120273 147293 122157 99396 77896 36423 -40342
$$ packed form
9279C9827k6581L1261j3684q1591r9046N0209Q6078N6320k3939J9528M7903J296
9267H7581n6991M198j6913j2526J7211m1146O1336P8090L5092q2471p1186j5972
9255a3697L4583L0653l5346j1132J1787n3435l7j2096n127m1262K1758o195m2383
9242a21929M0605L2598M2747M2607N8414M4187m1900j2202k2922n3249l5023k2654
9230d8721L1277M681k4352R142j8958N2346N2752L5283n1497k3623k0076Q499
9218F753M6526k5090j711M0932m3353k5442M1924J6237j1107k6555k8627m6716
9206e6229K7799J7316M6064l1620L3312Q2225P8853j9325m1082o9210l6828P608
9194C8883M5155J2816o6476j7352K4948Q2299K7020k5136k2761k1500m1473p6765
$$ plain form
9182 -40342 -61975 -28047 44055 106362 72848 5270 16061 5302 37012 60418 19267 361
9170 361 -68525 -61574 -2132 -21844 -21559 107402 123598 144821 110963 130300 104631 29696 23332
9157 23332 37711 54637 73980 112713 187506 221971 145806 111870 72168 114709 180131 203592
9145 203592 191012 197819 226728 255311 208532 196480 188934 165025 251488 307647 307392 315400 369057
9132 369057 390920 429230 552416 609807 675090 760731 866628 936041 1046848 1285775 1458959
9121 1458959 1643688 1935853 2385703 3047451 3906504 5102838 6887115 9524473 13732670
9112 13732670 20399870 30182786 40567746 45129392 40369057 29971158 20168428 13437655
9104 13437655 9347528 6821479 5172029 4112129 3297817 2773397 2328771 1985848 1785522
$$ packed form
9182d0342k1633L3928P2102O2307l3514o7578J0791j0759L1710K3406m1151j8906
9170C61o8886O951N9442j9712K85J28961J6196K1223l3858J9337k5669p4935o364
9157B3332J4379J6926J9343L8733P4793L4465p6165l3936l9702M2541O5422K3461
9145B03592j2580O807K8909K8583m6779j2052p546k3909Q6463N6159k55Q008N3657
9132C69057K1863L8310J23186N7391O5283Q5641J05897O9413J10807K38927J73184
9121A458959J84729K92165M49850O61748Q59053J196334J784277K637358M208197
9112A3732670O667200R782916J0384960M561646m760335j0397899r802730o730773
9104A3437655m090127k526049j649450j059900q14312n24420m44626l42923k00326
$$ plain form
9095 1785522 1552781 1356983 1256378 1108191 1000542 863660 767090 768919 710915 690150
9085 690150 629565 565130 505288 418895 414427 433568 458936 416153 360769 326256 272959 280809
9073 280809 250011 213184 203863 221956 227480 218529 186752 162846 204430 292277 301523 243090
9061 243090 289532 291057 249254 208043 196948 213522 239124 236862 265130 277321 228423 164648
9049 164648 115064 94917 69254 83742 145083 233762 239837 151493 134676 124849 137748 181723
9037 181723 161685 98435 55548 45321 53505 78164 98555 115820 151873 167602 152364 116445
9025 116445 121470 67042 -26355 -24039 13211 8068 32581 111902 135064 124768 97489 49364
9013 49364 23214 24711 55047 17333 53778 161768 161590 60448 7865 -26363 -3334 4450
$$ packed form
9095A785522k32741j95798j00605j48187j07649j36882r6570J829n8004k0765
9085F90150o0585o4435n9842q6393m468J9141K5368m2783n5384l4513n3297P850
9073B80809l0798l6827r321J8093N524q951l1777k3906M1584Q7847R246n8433
9061B43090M6442J525m1803m1211j1095J6574K5602k262K8268J2191m8898o3775
9049A64648m9584k0147k5663J4488O1341Q8679O075q8344j6817r827J2899M3975
9037A81723k0038o3250m2887j0227Q184K4659K0391J7265L6053J5729j5238l5919
9025A16445N025n4428r3397K316L7250n143K4513P9321K3162j0296k7279m8125
9013D9364k6150J497L0336l7714L6445J07990j78j01142n2583l4228K3029P784
$$ plain form
9001 4450 45900 41345 20500 83046 81617 119892 122715 130851 62002 -40315 -50199 -54619 -4833
8988 -4833 17241 7343 -11906 32331 50349 -2313 -28345 -35262 -73094 -10907 4512 -1393 25043
8975 25043 24705 46626 42441 44205 54112 95288 61114 48927 73353 42541 31459 -16098 -128926
8962 -128926 -105236 -21766 25543 764 -7242 -14757 -21217 2132 29913 56739 62089 -8479
8950 -8479 -12664 1429 3417 2779 -38198 4863 42107 57977 72868 62476 66121 87042 59208
8937 59208 111096 62224 54769 37318 -4746 8303 20041 59060 84240 64534 2605 -36826
8925 -36826 40 19203 13768 21502 -33803 -66239 5921 52401 10612 -20480 -64254 -26277
8913 -26277 528 53278 45799 24787 81253 74885 17170 21302 17797 28030 27942 59339 77062
$$ packed form
9001D450M1450m555k0845O2546j429L8275K823Q136o8849j02317r884m420M9786
8988d833K2074r898j9249M4237J8018n2662k6032o917l7832O2187J5419n905K6436
8975B5043l38K1921m185J764R907M1176l4174j2187K4426l0812j1082m7557j12828
8962a28926K3690Q3470M7309k4779q006p515o460K3349K7781K6826N350p0568
8950h479m185J4093J988o38m0977M3061L7244J5870J4891j0392L645K0921k7834
8937E9208N1888m8872p455j7451m2064J3049J1738L9019K5180j9706o1929l9431
8925c6826L6866J9163n435P734n5305l2436P2160M6480m1789l1092m3774L7977
8913b6277K6805N2750p479k1012N6466o368n7715M132l505J0233q8L1397J7723
$$ plain form
8900 77062 62714 51574 -21354 21340 7599 14868 19363 10802 -37439 -32826 -19009 -5624 -9376
8887 -9376 -34921 1536 19382 57400 50976 58950 92824 176882 182247 142775 87850 40515 17019
8874 17019 12774 6567 30734 66951 35843 6061 8102 52260 -8192 9068 79161 110155
8862 110155 76672 11889 -5337 -27826 -34475 -31307 -33365 -3393 81183 138530 121099 50354
8850 50354 -12379 2782 -28469 -48892 -26800 67866 38578 -31005 -13344 -3444 -20571 -22681
8838 -22681 -60650 -9624 -15777 -66926 -88112 -68537 -86522 -128538 -85539 -44041 -2613 101822
8826 101822 103168 45427 -24075 -48015 21658 91595 38137 8517 21182 -21052 -100961 -66957
8814 -66957 -5466 -87036 -117441 -52423 31226 34035 788 -33509 -36862 -1014 102122 131157
$$ packed form
8900G7062j4348j1140p2928M2694j3741P269M495q561m8241M613J3817J3385l752
8887i376k5545L6457J7846L8018o424P974L3874Q4058N365l9472n4925m7335k3496
8874A7019m245o207K4167L6217l1108k9782K041M4158o0452J7260P0093L0994
8862A10155l3483o4783j7226k2489o649L168k058K9972Q4576N7347j7431p0745
8850E0354o2733J5161l1251k0423K2092R4666k9288o9583J7661R900j7127k110
8838b2681l7969N1026o153n1149k1186J9575j7985m2016M2999M1498M1428J04435
8826A01822J346n7741o9502k3940O9673O9937n3458k9620J2665m2234p9909L4004
8814f6957O1491q1570l0405O5018Q3649K809l3247l4297l353L5848J03136K9035
$$ plain form
8802 131157 54443 38469 -21594 -3537 48155 38356 -28680 -23350 2185 -39790 268 -19581
8790 -19581 -83023 -82217 -27449 20338 100073 129494 70366 25839 -14360 -32419 -102799 -117508
8778 -117508 -62863 -31544 -36011 6099 38339 24827 31406 69813 -12841 -29170 -43115 -69585
8766 -69585 -90217 -83124 -70970 -22440 -44803 -29325 19841 16671 -5167 -78189 -145507 -141980
8754 -141980 -62711 25752 78741 17509 -35405 -100986 -83532 -77848 2542 54406 73689 65428
8742 65428 5545 -62197 -64827 -85525 -88509 -38369 11063 28946 61523 113778 124704 111494
8730 111494 77230 55677 85173 98731 121919 60491 30454 6101 24250 64716 77745 79801
8718 79801 71511 98687 79981 139802 139861 71880 53499 41455 -1550 30121 111710 162053 104175
$$ packed form
8802A31157p6714j5974o0063J8057N1692r799o7036N330K5535m1975M0058j9849
8790a9581o3442Q06N4768M7787P9735K9421n9128m4527m0199j8059p0380j4709
8778a17508N4645L1319m467M2110L2240j3512O579L8407q2654j6329j3945k6470
8766f9585k0632P093J2154M8530k2363J5478M9166l170k1838p3022o7318L527
8754a41980P9269Q8463N2989o1232n2914o5581J7454N684Q0390N1864J9283q261
8742F5428n9883o7742k630k0698k984N0140M9432J7883L2577N2255J0926j3210
8730A11494l4264k1553K9496J3558K3188o1428l0037k4353J8149M0466J3029K056
8718G9801q290K7176j8706N9821N9o7981j8381j2044m3005L1671Q1589N0343n7878
$$ plain form
8705 104175 71670 72858 75220 104132 137056 122359 109781 56302 50081 5534 -3208 33471
8693 33471 -826 4759 -31914 -8189 35161 5778 43760 65394 101133 88319 48695 34801
8681 34801 90842 130840 183710 213318 222857 142815 140945 147614 67162 16137 98743 126945
8669 126945 89526 132386 148834 168876 129656 114634 129488 91826 67602 82972 102015 102670
8657 102670 187998 215569 107063 90147 68705 -404 -12078 62472 127361 129771 213654 223005
8645 223005 209027 166838 151119 149755 216477 264166 241624 181120 169857 134054 188782 189646
8633 189646 209267 267544 248275 254494 202591 225238 306620 378531 395422 390201 341843 312014
8621 312014 336505 342008 373491 414644 463101 479427 526946 536500 523855 542597 618882 613195
$$ packed form
8705A04175l2505J188K362K8912L2924j4697j2578n3479o221m4547q742L6679
8693C3471l4297N585l6673K3725M3350k9383L7982K1634L5739j2814l9624j3894
8681C4801N6041L9998N2870K9608R539q0042j870O669q0452n1025Q2606K8202
8669A26945l7419M2860J6448K0042l9220j5022J4854l7662k4224J5370J9043O55
8657A02670Q5328K7571j08506j6916k1442o9109j1674P4550O4889K410Q3883R351
8645B23005j3978m2189j5719j364O6722M7689k2542o0504j1263l5803N4728Q64
8633A89646J9621N8277j9269O219n1903K2647Q1382P1911J6891n221m8358k9829
8621C12014K4491N503L1483M1153M8457J6326M7519R554j2645J8742P6285n687
$$ plain form
8609 613195 532813 507599 538844 659465 804414 888871 906886 888255 999240 1026003 1030960
8598 1030960 1053161 995571 960646 933435 820766 687014 585798 508444 519364 446882 382481
8587 382481 363363 320477 303325 326759 268717 191804 146796 94498 49211 38572 133819 169341
8575 169341 176720 126817 70219 99214 108140 111301 89121 47274 30571 155373 170795 160769
8563 160769 196965 188437 142653 164599 183825 114605 24290 1025 -35755 -46609 -22420 -8276
8551 -8276 32013 30192 -17646 -79541 -62324 -17544 33876 43144 15412 2377 30155 68698
8539 68698 100736 65188 6670 -38947 -51849 -28296 -45830 -6707 41028 70524 6347 -40476
8527 -40476 21206 18442 4785 34226 44443 37869 59408 62738 22602 15915 7171 34911 86155
$$ packed form
8609F13195q0382k5214L1245J20621J44949Q4457J8015j8631J10985K6763M957
8598A030960K2201n7590l4925k7211j12669j33752j01216p7354J0920p2482o4401
8587C82481j9118m2886j7152K3434n8042p6913m5008n2298m5287j0639R5247L5522
8575A69341P379m9903n6598K8995Q926L161k2180m1847j6703J24802J5422j0026
8563A60769L6196q528m5784K1946J9226o9220r0315k3265l6780j0854K4189J4144
8551h276M0289j821m7838o1895J7217M4780N1420R268k7732j3035K7778L8543
8539F8698L2038l5548n8518m5617j2902K3553j7534L9123M7735K9496o4177m6823
8527d0476O1682k764j3657K9441J0217o574K1539L330m0136o687q744K7740N1244
$$ plain form
8514 86155 130711 55013 18611 38495 7095 -48801 -44951 -28906 -45947 4913 42003 41978 85849
8501 85849 118310 89419 121876 143281 174331 189882 117030 113530 116972 65972 -47778 -77626
8489 -77626 -72453 -17931 42691 82439 69304 21116 40227 49165 13629 30925 69547 49490
8477 49490 29794 7554 24397 96031 96488 30032 1636 66753 101130 82095 129887 122493
8465 122493 74112 69408 -2870 6057 79772 59305 9325 -33582 -31636 18052 49396 -22162
8453 -22162 -4897 23904 61436 30387 -41856 -35796 23107 -46243 24644 82063 85353 45525
8441 45525 13137 40542 21102 19991 28090 25640 723 24690 96926 109211 52648 -28790
8429 -28790 -66379 -48171 -4589 15490 58299 90684 117702 133984 79220 65661 -3734 -34372
$$ packed form
8514H6155M4556p5698l6402J9884l1400n5896L850J6045j7041N0860L7090k5M3871
8501H5849L2461k8891L2457K1405L1050J5551p2852l500L442n1000j13750k9848
8489g7626N173N4522O0622L9748j3135m8188J9111Q938l5536J7296L8622k0057
8477D9490j9696k2240J6843P1634M57o6456k8396O5117L4377j9035M7792p394
8465A22493m8381m704p2278Q927P3715k0467m9980m2907J946M9688L1344p1558
8453b2162J7265K8801L7532l1049p2243O060N8903o9350P0887N7419L290l9828
8441D5525l2388K7405j9440j111Q099k450k4917K3967P2236J2285n6563q1438
8429b8790l7589J8208M3582K0079M2809L2385K7018J6282n4764j3559o9395l0638
$$ plain form
8417 -34372 -13108 17398 27501 73620 68695 -28816 -29788 -15551 3100 39910 96438 28298
8405 28298 -15755 16612 87524 26803 4590 -15571 -34504 14903 77165 125772 92820 102300
8393 102300 112950 76469 35415 90071 124584 66579 9028 56811 46976 14364 -51571 -45287
8381 -45287 -38406 -30964 10590 51823 105861 67142 66511 72404 6730 -91595 -106526 -28276 39010
8368 39010 9255 -29809 -12643 -26335 -43882 -48439 27999 36316 56407 76239 70439 57239
8356 57239 -35458 -108080 -127445 -80633 -67183 4061 48864 3570 -34474 -12189 -5663 -24305
8344 -24305 -65219 -71071 -30248 -449 2316 -7345 16861 15927 54272 47967 59304 39353 22663
8331 22663 25981 10025 7857 -39182 -23213 9232 -10374 -604 -4169 -16764 -25100 20744 74588
$$ packed form
8417c4372K1264L0506J0103M6119m925r7511r72J4237J8651L6810N6528o8140
8405B8298m4053L2367P0912o0721k2213k0161j8933M9407O2262M8607l2952R480
8393A02300J0650l6481m1054N4656L4513n8005n7551M7783r835l2612o5935O284
8381d5287O881P442M1554M1233N4038l8719o31N893o5674r8325j4931P8250O7286
8368C9010k9755l9064J7166j3692j7547m557P6438Q317K0091J9832n800j3200
8356E7239r2697p2622j9365M6812J3450P1244M4803m5294l8044K2285O526j8642
8344b4305m0914n852M0823K9799K765r661K4206r34L8345o305J1337j9951j6690
8331B2663L318j5956k168m7039J5969L2445j9606R770l565j2595q336M5844N3844
$$ plain form
8318 74588 34969 -12467 -34133 -39023 14468 17320 13057 66278 122951 122372 135792 104538 39497
8305 39497 40873 10093 -29199 -27868 -10415 -1293 -46996 -65936 -28118 -906 58594 131950
8293 131950 66240 18032 25574 57342 81229 37402 -12254 -38698 -60957 -71026 -95434 -131425
8281 -131425 -60417 -19922 -31911 -44394 -1477 17711 79640 152219 127835 77316 64291 79307
8269 79307 122264 104350 113271 86811 9530 -12015 -23624 21052 -7411 83 -3526 -26781
8257 -26781 91988 143311 103444 71519 23236 -26216 -59721 -45290 -29371 -89971 -56928 2186
8245 2186 63357 58914 -3840 -30234 -20048 1431 -26665 -24322 -9049 -6926 40267 74986 119743
8232 119743 229807 203690 156178 113983 50572 14796 14827 26955 -39520 -5138 6896 29074
$$ packed form
8318G4588l9619m7436k1666m890N3491K852m263N3221N6673n79J3420l1254o5041
8305C9497J376l0780l9292J331J7453R122m5703j8940L7818K7212N9500P3356
8293A31950o5710m8208P542L1768K3887m3827m9656k6444k2259j0069k4408l5991
8281a31425P1008M0495j1989j2483M2917J9188O1929P2579k4384n0519j3025J5016
8269G9307M2957j7914Q921k6460p7281k1545j1609M4676k8463P494l609k3255
8257b6781J18769N1323l9867l1925m8283m9452l3505J4431J5919o0600L3043N9114
8245B186O1171m443o2754k6394J0186K1479k8096K343J5273K123M7193L4719M4757
8232A19743J10064k6117m7512m2195o3411l5776L1J2128o6475L4382J2034K2178
$$ plain form
8220 29074 64599 45699 52343 109589 152171 143579 73874 16468 -32480 -66368 -40201 -26620
$$ packed form
8220B9074L5525j8900O644N7246M2582q592o9705n7406m8948l3888K6167J3581
$$ [...]
##END NTUPLES=NMR SPECTRUM
##END=
