##TITLE=Analysis number 328552
Compound Code cc 53046
Book Reference 407/149
Project Code adrs
Chemist Name andyw
##JCAMPDX= 6.0         $$ Bruker NMR JCAMP-DX V2.0
##DATA TYPE= NMR SPECTRUM
##DATA CLASS= NTUPLES
##ORIGIN= Bruker BioSpin GmbH
##OWNER= nmr
$$ XWIN-NMR		Version 3.5
$$ Fri Jun 15 09:29:17 2007 GMT Daylight Time (UT+1h)  MAYBRIDGE\nmr@NMR_250MHZ
##.OBSERVE FREQUENCY= 250.131544655141
##.OBSERVE NUCLEUS= ^1H
##.ACQUISITION MODE= SIMULTANEOUS (DQD)
##.ACQUISITION SCHEME= undefined
##.AVERAGES= 16
##.DIGITISER RES= 18
##SPECTROMETER/DATA SYSTEM= dpx250
##.PULSE SEQUENCE= zg30
##.SOLVENT NAME= CDCl3
##.SHIFT REFERENCE= (INTERNAL, CDCl3, 0, 16.4484)
##AUDIT TRAIL= $$ (NUMBER, WHEN, WHO, WHERE, WHAT)
$$ ##TITLE= Audit trail, XWIN-NMR		Version 3.5
$$ ##JCAMPDX= 5.01
$$ ##ORIGIN= Bruker BioSpin GmbH
$$ ##OWNER= nmr
$$ C:\u/data/dgb/nmr/ADRS/940/pdata/1/auditp.txt
$$ ##AUDIT TRAIL=  $$ (NUMBER, WHEN, WHO, WHERE, WHAT)
(   1,<2007-06-15 09:28:54.50 +100>,<MAYBRIDGE\nmr>,<NMR_250MHZ>,
      <created by zg, POWCHK disabled, PULCHK disabled
       configuration hash MD5:
       76 6E 9A 78 1E 09 19 81 EC 84 63 8F B0 6A 59 2D
       data hash MD5: 64K
       7D 5C B9 70 D9 49 AF 72 F0 DD 80 30 55 6F D9 B3>)
(   2,<2007-06-15 09:29:07.85 +100>,<MAYBRIDGE\nmr>,<NMR_250MHZ>,
      <Start of raw data processing
       ef LB = 0.3 FT_mod = 6 PKNL = 1 SI = 32K 
       data hash MD5: 32K
       27 55 8C 24 D6 3A 3A B1 FA F1 19 0C 71 44 01 06>)
(   3,<2007-06-15 09:29:09.64 +100>,<MAYBRIDGE\nmr>,<NMR_250MHZ>,
      <apk 
       data hash MD5: 32K
       20 2D 11 30 D9 9D 1F 75 A1 BA C1 D7 CC B2 4D 0F>)
(   4,<2007-06-15 09:29:10.47 +100>,<MAYBRIDGE\nmr>,<NMR_250MHZ>,
      <abs ABSG = 5 
       data hash MD5: 32K
       8B 7E 82 73 D0 F9 1A 10 5A 03 DB 73 45 31 EA 7A>)
$$ ##END=
$$ 
$$ hash MD5
$$ 70 A4 C5 EE 70 18 8A E0 C4 7E FE E7 97 FB C0 09
##$RELAX= 
##$RELAX= 
##$RELAX= 
##$RELAX= 
##$RELAX= 
##$RELAX= 
##$RELAX= 
$$ Bruker specific parameters
$$ --------------------------
##$DU= <C:\u>
##$EXPNO= 940
##$NAME= <ADRS>
##$PROCNO= 1
##$TYPE= <nmr>
##$USER= <dgb>
##$AMP= (0..31)
100 100 100 100 100 100 100 100 100 100 100 100 100 100 100 100 100 100 
100 100 100 100 100 100 100 100 100 100 100 100 100 100 
##$AQSEQ= 0
##$AQ_mod= 3
##$AUNM= <au_zg>
##$AUTOPOS= <3 >
##$BF1= 250.13
##$BF2= 250.13
##$BF3= 250.13
##$BF4= 250.13
##$BF5= 500.13
##$BF6= 500.13
##$BF7= 500.13
##$BF8= 500.13
##$BYTORDA= 1
##$CFDGTYP= 0
##$CFRGTYP= 5
##$CHEMSTR= <none>
##$CNST= (0..31)
1 1 145 1 1 1 1 1 1 1 1 1 1 1 1 1 1 1 1 1 1 1 1 1 1 1 1 1 1 1 1 1 
##$CPDPRG= <>
##$CPDPRG1= <>
##$CPDPRG2= <>
##$CPDPRG3= <>
##$CPDPRG4= <mlev>
##$CPDPRG5= <mlev>
##$CPDPRG6= <mlev>
##$CPDPRG7= <mlev>
##$CPDPRG8= <mlev>
##$CPDPRGB= <>
##$CPDPRGT= <>
##$D= (0..31)
0 1 0 0 0 0 0 0 0 0.06 0 0 0 0 0 0 0.0002 0 0 0 0 0 0 0 0 0 0 0 0 0 0 
0 
##$DATE= 1181896133
##$DBL= (0..7)
120 120 120 120 120 120 120 120 
##$DBP= (0..7)
150 150 150 150 150 150 150 150 
##$DBP07= 0
##$DBPNAM0= <>
##$DBPNAM1= <>
$$ [...]
##$SUBNAM7= <"">
##$SUBNAM8= <"">
##$SUBNAM9= <"">
##$SW= 20.6930455092707
##$SWIBOX= (0..15)
0 0 3 0 0 0 0 0 0 0 0 0 0 0 0 0 
##$SW_h= 5175.983436853
##$TD= 65536
##$TD0= 1
##$TE= 297.16
##$TE2= 300
##$TE3= 300
##$TEG= 300
##$TL= (0..7)
0 120 120 120 120 120 120 120 
##$TP= (0..7)
150 150 150 150 150 150 150 150 
##$TP07= 0
##$TPNAME0= <>
##$TPNAME1= <>
##$TPNAME2= <>
##$TPNAME3= <>
##$TPNAME4= <>
##$TPNAME5= <>
##$TPNAME6= <>
##$TPNAME7= <>
##$TPOAL= (0..7)
0.5 0.5 0.5 0.5 0.5 0.5 0.5 0.5 
##$TPOFFS= (0..7)
0 0 0 0 0 0 0 0 
##$TUNHIN= 0
##$TUNHOUT= 0
##$TUNXOUT= 0
##$USERA1= <user>
##$USERA2= <user>
##$USERA3= <user>
##$USERA4= <user>
##$USERA5= <user>
##$V9= 5
##$VALIST= <valist>
##$VCLIST= <CCCCCCCCCCCCCCC>
##$VD= 0
##$VDLIST= <DDDDDDDDDDDDDDD>
##$VPLIST= <PPPPPPPPPPPPPPP>
##$VTLIST= <TTTTTTTTTTTTTTT>
##$WBST= 1024
##$WBSW= 4
##$XGAIN= (0..3)
0 0 0 0 
##$XL= 0
##$YL= 0
##$YMAX_a= 286784
##$YMIN_a= -204171
##$ZGOPTNS= <>
##$ZL1= 120
##$ZL2= 120
##$ZL3= 120
##$ZL4= 120
##$ABSF1= 16.44843
##$ABSF2= -4.244743
##$ABSG= 5
##$ABSL= 3
##$ALPHA= 0
##$AQORDER= 0
##$ASSFAC= 0
##$ASSFACI= 0
##$ASSFACX= 0
##$ASSWID= 0
##$AUNMP= <proc_1d>
##$AZFE= 0.1
##$AZFW= 0.1
##$BCFW= 0
##$BC_mod= 0
##$BYTORDP= 0
##$COROFFS= 0
##$CY= 12.5
##$DATMOD= 1
##$DC= 0
##$DFILT= <>
##$DTYPP= 0
##$F1P= 14.0000005364418
##$F2P= -0.99999901652339
##$FCOR= 0.5
##$FTSIZE= 32768
##$FT_mod= 6
##$GAMMA= 0
##$GB= 0
##$INTBC= 1
##$INTSCL= 1
##$ISEN= 128
##$LB= 0.3
##$LEV0= 0
##$LPBIN= 0
##$MAXI= 10000
##$MC2= 0
##$MEAN= 0
##$ME_mod= 0
##$MI= 0
##$NCOEF= 0
##$NC_proc= -4
##$NLEV= 6
##$NOISF1= 0
##$NOISF2= 0
##$NSP= 0
##$NTH_PI= 0
##$NZP= 0
##$OFFSET= 16.44843
##$PC= 1
##$PHC0= -52.76655
##$PHC1= 1.56328
##$PH_mod= 1
##$PKNL= yes
##$PPARMOD= 0
##$PSCAL= 4
##$PSIGN= 0
##$REVERSE= no
##$SF= 250.130018399735
##$SI= 32768
##$SIGF1= 0
##$SIGF2= 0
##$SINO= 400
##$SIOLD= 32768
##$SREGLST= <1H.CDCl3>
##$SSB= 0
##$STSI= 32768
##$STSR= 0
##$SW_p= 5175.98343685301
##$SYMM= 0
##$S_DEV= 0
##$TDeff= 65536
##$TDoff= 0
##$TI= <Analysis number 999999
Compound Code 99
Book Reference 9
Project Code 9>
##$TILT= no
##$TM1= 0
##$TM2= 0
##$TOPLEV= 0
##$USERP1= <user>
##$USERP2= <user>
##$USERP3= <user>
##$USERP4= <user>
##$USERP5= <user>
##$WDW= 1
##$XDIM= 32768
##$YMAX_p= 581592163
##$YMIN_p= -356874
$$ End of Bruker specific parameters
$$ ---------------------------------
##NTUPLES= NMR SPECTRUM
##VAR_NAME=  FREQUENCY,     SPECTRUM/REAL,   SPECTRUM/IMAG
##SYMBOL=    X,             R,               I
##VAR_TYPE=  INDEPENDENT,   DEPENDENT,       DEPENDENT
##VAR_FORM=  AFFN,          ASDF,            ASDF
##VAR_DIM=   32768,         32768,           32768
##UNITS=     HZ,            ARBITRARY UNITS, ARBITRARY UNITS
##FACTOR=    0.157963299565203, 1,           1
##FIRST=     4114.24587534724, 0,            0
##LAST=      -1061.73756150577, 0,           0
##MIN=       -1061.73756150577, -356874,     0
##MAX=       4114.24587534724, 581592163,    0
$$ Real data points
##PAGE= N=1
##DATA TABLE= (X++(R..R)), XYDATA
$$ [...]
$$ plain form
16257 922 -7866 -8410 -74973 -140749 -117029 -71542 -67173 -92674 -45099 -1876 4218 16690 55290
16244 55290 11233 5381 -12570 14836 26459 21581 35052 46416 65848 48809 7486 21925
16232 21925 36818 17589 -52869 -163096 -200894 -129858 -184214 -183371 -98940 -71546 -15902 -24170
16220 -24170 -46108 -70395 -77804 -34602 -31647 -34514 -3924 -68894 -76489 -34804 6208 -14406
16208 -14406 -32778 -51017 15807 43076 -1107 -41476 -79821 -82252 -49932 -52216 -56199 -21579
16196 -21579 -30119 -96224 -101177 -54151 -71714 -72203 -29716 -25415 -23563 -33738 -18664 31058 6416
16183 6416 31119 -17070 -63520 -79977 -81934 -73659 -77807 -88693 -129721 -99880 -91288 -64461 -69329
16170 -69329 -75252 -124442 -112528 -62387 -98487 -29920 2 -62868 -71419 -44842 -60408 -44320
$$ packed form
16257I22q788n44o6563o5776K3720M5487M369k5501M7575M3223O094J2472L8600
16244E5290m4057n852j7951K7406J1623m878J3471J1364J9432j7039m1323J4439
16232B1925J4893j9229p0458j10227l7798P1036n4356Q43Q4431K7394N5644q268
16220b4170k1938k4287p409M3202K955k867L0590o4970p595M1685M1012k0614
16208a4406j8372j8239O6824K7269m4183m0369l8345k431L2320k284l983L4620
16196b1579q540o6105m953M7026j7563m89M2487M301J852j0175J5074M9722k4642
16183F416K4703m8189m6450j6457j957Q275m148j0886m1028K9841Q592K6827m868
16170f9329n923m9190J1914N0141l6100O8567K9922o2870q551K6577j5566J6088
$$ plain form
16158 -44320 -98161 -177034 -200950 -172621 -138181 -110331 -110790 -77532 -26814 -33968 -62486 -49847
16146 -49847 -54967 -53796 -14005 29011 6116 -12973 28656 4457 -65047 -128643 -115438 -28969
16134 -28969 79516 75827 27743 -37028 -58082 -25787 -42626 -27033 -16587 18317 -39773 -31927
16122 -31927 -19988 -72855 -92908 -44570 5040 -1294 -19368 -10366 5822 35211 61434 12573
16110 12573 -50488 -97452 -120772 -66690 -22517 -25822 -90069 -69000 -78927 -74468 -89884 -29441
16098 -29441 27216 -26546 -23291 -29013 4063 32619 47928 79784 63428 33102 24328 -15833
16086 -15833 -69160 -100177 -100420 6753 113471 58655 -8190 -13411 -37232 19228 19878 29068
16074 29068 -5978 -50561 -91308 -92233 -94944 -40234 31905 61709 30976 -32569 -103680 -64817
$$ packed form
16158d4320n3841p8873k3916K8329L4440K7850m59L3258N0718p154k8518J2639
16146d9847n120J171L9791M3016k2895j9089M1629k4199o9504o3596J3205Q6469
16134b8969J08485l689m8084o4771k1054L2295j6839J5593J0446L4904n8090P846
16122c1927J1939n2867k0053M8338M9610o334j8074R002J6188K9389K6223m8861
16110A2573o3061m6964k3320N4082M4173l305o4247K1069r927M459j5416O0443
16098b9441N6657n3762L255n722L3076K8556J5309L1856j6356l0326q774m0161
16086a5833n3327l1017k43J07173J06718n4816o6845n221k3821N6460O50R190
16074B9068l5046m4583m0747r25k711N4710P2139K9804l0733o3545p1111L8863
$$ plain form
16062 -64817 5640 67909 123875 90851 26809 -18429 -26230 20073 28226 38048 87440 106102
16050 106102 50582 -2453 -14719 350 7242 -28714 -49220 8263 100593 53830 -30947 -17066
16038 -17066 -5031 -10571 34744 -6740 -18307 28694 55179 16931 -88889 -96768 -100975 -93513
16026 -93513 -106252 -78638 -86281 -98510 -46891 -38315 -1948 -37332 -62392 -73219 -21077 -25763
16014 -25763 -74320 54 77722 70507 58129 30085 11296 11500 -25991 -69934 -53812 -20534
16002 -20534 -15967 -4786 -55212 -66991 -83620 -106438 -58674 24214 51446 62969 23785 -14916
15990 -14916 -55912 -86887 -54050 -9857 13812 25628 -10639 -21032 22550 22721 10793 7423
15978 7423 -6625 -24468 8056 -13800 -61323 -39940 46037 101171 102443 90455 80793 86779
$$ packed form
16062f4817P0457O2269N5966l3024o4042m5238p801M6303Q153R822M9392J8662
16050A06102n5520n3035j2266J5069O892l5956k0506N7483R2330m6763q4777J3881
16038a7066J2035n540M5315m1484j1567M7001K6485l8248j05820p879m207P462
16026i3513j2739K7614p643j2229N1619Q576L6367l5384k5060j0827N2142m686
16014b5763m8557P4374P7668p215j2378k8044j8789K04l7491m3943J6122L3278
16002b0534M567J1181n0426j1779j6629k2818M7764Q2888K7232J1523l9184l8701
15990a4916m0996l0975L2837M4193K3669J1816l6267j0393M3582J71j1928l370
15978G423j4048j7843L2524k1856m7523K1383Q5977N5134J272j1988r662N986
$$ plain form
15966 86779 55901 49526 94028 90196 94399 119398 92266 98309 82067 59565 9777 8438 26325
15953 26325 65406 94616 25433 73173 53529 14116 11867 46035 57211 76112 80733 119759
15941 119759 107854 105037 93580 68317 88408 73430 -50841 -65117 -54394 -51055 -39645 -6172
15929 -6172 27068 38890 49615 13652 -343 32136 28840 58267 86078 87514 55828 31223
15917 31223 19602 20207 57071 50989 80811 77935 55323 81788 75269 -11332 16615 35472 18616
15904 18616 27220 40968 90516 92506 86229 92042 100981 89943 70200 32243 54127 39643 44930
15891 44930 29741 67023 43707 60307 5984 11480 36402 37788 50289 80028 78135 77262 51062
15878 51062 -3487 -15402 -26125 -26176 9119 29445 -35284 -55846 -8309 7348 -17886 -19552
$$ packed form
15966H6779l0878o375M4502l832M203K4999k7132O043j6242k2502m9788j339J7887
15953B6325L9081K9210o9183M7740j9644l9413k249L4168J1176J8901M621L9026
15941A19759j1905k817j1457k5263K0091j4978j24271j4276J0723L339J1410L3473
15929f172L3240J1822J0725l5963j3995L2479l296K9427K7811J436l1686k4605
15917C1223j1621O05L6864o082K9822k876k2612K6465o519q6601K7947J8857j6856
15904A8616Q604J3748M9548J990o277N813Q939j1038j9743l7957K1884j4484N287
15891D4930j5189L7282k3316J6600n4323N496K4922J386J2501K9739j893q73k6200
15878E1062n4549j1915j0723n1L5295K0326o4729k0562M7537J5657k5234j666
$$ plain form
15866 -19552 -9517 3533 -14287 -61712 -10056 -18917 -5420 51219 38354 49203 43631 23967
15854 23967 17921 20310 -3230 -58550 -83044 -117369 -112633 -81922 -63970 25701 19924 -9911
15842 -9911 -36400 41460 119480 41744 4396 -1746 27859 -10935 -6258 -12417 -15462 21574 48064
15829 48064 68480 12672 5645 19553 32030 19012 1022 -43963 -30258 -18686 -122 10293
15817 10293 19838 5196 -4505 -15549 6400 -8685 -16747 -19025 -39085 -67100 -15295 3750
15805 3750 -10885 -22642 -26059 29451 25003 1850 27441 35531 55674 71305 35072 -19998
15793 -19998 -49108 -72289 19433 97287 38342 11498 9287 -25154 -8290 -22825 -34497 -45504
15781 -45504 -57670 -87699 -68623 -66187 -45995 1714 39341 13485 33383 65259 57924 -23094
$$ packed form
15866a9552J0035J3050j7820m7425N1656q861J3497N6639j2865J0849n572j9664
15854B3967o046K389k3540n5320k4494l4325M736L0711J7952Q9671n777k9835
15842i911k6489P7860P8020p7736l7348o142K9605l8794M677o159l045L7036K6490
15829D8064K0416n5808p027J3908J2477j3018j7990m4985J3705J1572J8564J0415
15817A0293R545j4642r701j1044K1949j5085q062k278k0060k8015N1805J9045
15805C750j4635j1757l417N5510m448k3153K5591Q090K0143J5631l6233n5070
15793a9998k9110k3181R1722P7854n8945k6844k211l4441J6864j4535j1672j1007
15781d5504j2166l0029J9076K436K0192M7709L7627k5856J9898L1876p335q1018
$$ plain form
15769 -23094 -27286 -10722 -48820 -62007 -64878 -52192 -45260 -53573 -10842 47585 -8155 -54776
15757 -54776 -24973 -1341 28459 32603 18338 -8899 -41639 -59272 -25363 26597 52878 79471
15745 79471 44022 16296 3642 -33500 -112757 -106231 -57693 -35846 -35920 -9335 4580 -20127
15733 -20127 -63454 -61407 -17364 11598 32828 34262 31048 24954 32494 15325 -15302 -46457 -79912
15720 -79912 -104268 -46325 -29162 -29605 -7433 -11842 9475 41553 45060 17190 -13328 -21076 -2240
15707 -2240 -24593 -362 -9458 -23218 -71020 -42527 -19565 6588 -3870 8804 -16131 -41271
15695 -41271 -33587 -18337 -14084 -41138 -68600 -54197 16601 -18753 -9778 42329 -22583 -69386
15683 -69386 -79780 -62005 -75914 -89392 -82784 -87131 -58297 -35228 -14806 -3761 16493 22618
$$ packed form
15769b3094m192J6564l8098j3187k871J2686O932q313M2731N8427n5740m6621
15757e4776K9803K3632K9800M144j4265k7237l2740j7633L3909N1960K6281K6593
15745G9471l5449k7726j2654l7142p9257O526M8538K1847p4K6585J3915k4707
15733b0127m3327K047M4043K8962K1230J434l214o094P540j7169l0627l1155l3455
15720g9912k4356N7943J7163m43K2172m409K1317L2078L507k7870l0518p748J8836
15707b240k2353K4231r096j3760m7802K8493K2962K6153j0458J2674k4935k5140
15695d1271P684J5250M253k7054k7462J4403P0798l5354Q975N2107o4912m6803
15683f9386j0394J7775j3909j3478O608m347K8834K3069K0422J1045K0254O125
$$ plain form
15671 22618 15717 4133 -54193 -11560 41782 8748 -15339 24900 16429 -50830 -82926 -62474
15659 -62474 -45576 -25939 13413 32216 68988 50312 51396 48455 3419 -6721 -14969 -34622
15647 -34622 -11724 21249 46973 40920 58205 29233 -9055 -16891 -40973 -44737 -22688 -18148
15635 -18148 -28613 28630 62174 90023 57622 4051 -18830 21266 50644 -20578 5331 -30679
15623 -30679 -31137 -7107 -33095 9841 13490 -15444 -32953 -70273 -57283 -36718 -27179 66353
15611 66353 116948 82246 34729 59120 83422 16142 -33464 -5879 17454 19451 -14150 -49582
15599 -49582 -7585 -16847 -9796 53151 14950 16303 -1199 -44100 -100072 -46809 19093 18810 -21030
15586 -21030 -1370 23287 53967 55725 7695 23704 3888 12835 12490 39437 -7159 -59159
$$ packed form
15671B2618o901j1584n8326M2633N3342l3034k4087M0239q471o7259l2096K0452
15659f2474J6898J9637L9352J8803L6772j8676J084k941m5036j0140q248j9653
15647c4622K2898L2973K5724o053J7285k8972l8288p836k4082l764K2049M540
15635a8148j0465N7243L3544K7849l2401n3571k2881M0096K9378p1222K5909l6010
15623c0679m58K4030k5988M2936L649k8934j7509l7320J2990K0565R539R3532
15611F6353N0595l4702m7517K4391K4302o7280m9606K7585K3333J997l3601l5432
15599d9582M1997r262P051O2947l8201J353j7502m2901n5972N3263O5902k83l9840
15586b1030J9660K4657L0680J758m8030J6009j9816Q947l45K6947m6596n2000
$$ plain form
15574 -59159 -46016 -64149 -50947 -42407 -46868 -79313 -91030 -61454 -13365 11041 63522 134523
15562 134523 87643 29222 36645 90545 71643 42023 59735 44583 -14152 -72290 -60485 -16229
15550 -16229 17655 21643 54421 78444 -17735 -62309 -73327 -62814 -59667 -55417 -61839 -40342
15538 -40342 28465 2521 -86351 -103804 -66696 -24462 7252 66941 148496 166580 119148 80676
15526 80676 53275 41144 50383 -9141 -19654 22259 5901 -16378 769 -28777 -91349 -78289
15514 -78289 -57242 -62479 -95489 -92305 -31549 -4684 -27956 -77856 -49638 -39816 35708 63823
15502 63823 7876 -8571 27170 42032 21641 3146 -2645 14601 -26163 -76129 -136072 -106705
15490 -106705 -94995 -69538 -56648 -97902 -129142 -94109 -97065 -83517 -114847 -111896 -103513 -106840
$$ packed form
15574e9159J3143j8133J3202Q540m461l2445j1717K9576M8089K4406N2481P1001
15562A34523m6880n8421P423N3900j8902k9620J7712j5152n8735n8138J1805M4256
15550a6229L3884L988L2778K4023r6179m4574j1018J0513L147M250o422K1497
15538d0342O8807k5944q8872j7453L7108M2234L1714N9689Q1555J8084m7432l8472
15526H0676k7401j2131R239n9524j0513M1913j6358k2279J7147k9546o2572J3060
15514g8289K1047n237l3010L184O0756K6865k3272m9900K8218R822P5524K8115
15502F3823n5947j6447L5741J4862k0391j8495n791J7246m0764m9966n9943K9367
15490a06705J1710K5457J2890m1254l1240L5033k956J3548l1330K951Q383l327
$$ plain form
15478 -106840 -77453 -55556 -86064 -46655 -42866 -95457 -105641 -106041 -70093 -38382 31179 44546
15466 44546 88826 45925 9331 -55978 -53407 -19098 4951 35905 32359 4563 -25320 -57426
15454 -57426 -73964 -76412 -37233 39173 53652 68538 79955 98933 75917 -20700 -10484 -25095
15442 -25095 -69289 -34490 -56569 -99749 -22854 9937 -56513 -34359 -15245 -18792 -12222 7287
15430 7287 4014 45453 -21844 -90580 -45199 -6098 29302 38768 43096 18627 -59295 -53068 36652
15417 36652 68282 28247 2554 -8615 -31617 -60543 -61049 -155267 -186330 -125908 -76371 -29512
15405 -29512 -27447 -5701 -14280 -62161 -38887 -3777 -1443 6017 21529 -46598 -25592 59182
15393 59182 103710 91138 22319 -381 31271 44013 -3785 -3412 -31694 -47571 -41321 -2068
$$ packed form
15478a06840K9387K1897l0508L9409L789n2591j0184m00L5948L1711O9561J3367
15466D4546M4280m2901l6594o5309K571L4309K4049L0954l546k7796k9883l2106
15454e7426j6538k448L9179P6406J4479J4886J1417J8978k3016r6617J0216j4611
15442b5095m4194L4799k2079m3180P6895L2791o6450K2154J9114l547O570J9509
15430G287l273M1439o7297o8736M5381L9101L5400R466M328k4469p7922O227Q9720
15417C6652L1630m0035k5693j1169k3002k8926n06r4218l1063O0422M9537M6859
15405b9512K065K1746q579m7881K3274L5110K334P460J5512o8127K1006Q4774
15393E9182M4528j2572o8819k2700L1652J2742m7798L73k8282j5877O250L9253
$$ plain form
15381 -2068 32404 55934 58658 9841 8944 21637 22094 6965 46386 63488 82773 125760 130350
15368 130350 57117 5912 -14490 -12743 -21978 -28567 32753 115098 101068 48528 43274 103186
15356 103186 117347 63350 34178 48392 59555 63037 111146 149594 117500 80328 48138 65803
15344 65803 44944 -42782 -68142 -60680 -55706 -15515 -14001 16477 62014 117428 169494 150162
15332 150162 82372 10110 -26769 -17719 -3425 23137 54371 39801 3694 71034 101628 53771
15320 53771 18159 -6257 -33284 -7592 -24646 2108 28990 -43503 1647 71177 3436 -59042
15308 -59042 26157 -8600 -29449 -19248 -27244 39815 48809 -8811 -81572 -21152 26461 40338
15296 40338 54625 21018 73686 105753 108862 99301 52074 17809 5521 39491 89234 99903
$$ packed form
15381b068L4472K3530K724m8817q97J2693M57j5129L9421J7102J9285M2987M590
15368A30350p3233n1205k0402J747r235o589O1320Q2345j4030n2540n254N9912
15356A03186J4161n3997k9172J4214J1163L482M8109L8448l2094l7172l2190J7665
15344F5803k0859q7726k5360P462M974M0191J514L0478M5537N5414N2066j9332
15332A50162o7790p2262l6879R050J4294K6562L1234j4570l6107O7340L0594m7857
15320E3771l5612k4416k7027K5692j7054K6754K6882p2493M5150O9530o7741o2478
15308e9042Q5199l4757k0849J0201p996O7059Q994n7620p2761O0420M7613J3877
15296D0338J4287l3607N2668L2067L109r561m7227l4265j2288L3970M9743J0669
$$ plain form
15284 99903 128924 163214 235763 308413 368303 390098 422681 429946 425799 437197 383042 403498
15272 403498 363110 244188 147770 79439 52432 31452 30646 30060 99138 152618 153603 42851
15260 42851 49081 129611 200083 190091 147239 70118 24215 43097 11144 5816 -3627 -19951
15248 -19951 -52976 -32578 86660 101057 53518 28719 17667 43071 10722 -52024 -80627
15237 -80627 -8427 66149 106788 147638 69535 52955 120782 148138 87736 106738 40384 -34573
15225 -34573 3325 24768 -15297 -2450 -17117 -16700 -8750 -33480 -33258 -48003 -57499 -42384 2780
15212 2780 16258 62070 86378 87930 62297 30788 15385 23907 33691 14858 -32354 -60007
15200 -60007 -22858 10045 18467 -20883 -8327 17846 -5471 -48824 -45996 -20634 34554 63587
$$ packed form
15284I9903K9021L4290P2549P2650N9890K1795L2583P265m147J1398n4155K0456
15272D03498m0388j18922r6418o8331k7007k0980q06n86O9078N3480R85j10752
15260D2851O230Q0530P0472r992m2852p7121m5903J8882l1953n328r443j6324
15248a9951l3025K0398J19238J4397m7539k4799j1052K5404l2349o2746k8603
15237h0627P2200P4576M0639M0850p8103j6580O7827K7356o0402J9002o6354p4957
15225c4573L7898K1443m0065J2847j4667M17P950k4730K22j4745r496J5115M5164
15212B780J3478M5812K4308J552k5633l1509j5403Q522R784j8833m7212k7653
15200f0007L7149L2903Q422l9350J2556K6173k3317m3353K828K5362N5188K9033
$$ plain form
15188 63587 83432 81010 31061 -4018 29757 44799 114497 89839 46932 13920 7053 25940
15176 25940 74341 101856 117615 97705 50506 -2216 11212 80303 59256 31474 32960 73753
15164 73753 62815 44454 76847 142351 92596 14158 -451 21523 79659 93556 81252 33874
15152 33874 17604 22439 -7247 -56250 -96484 -70944 -27433 21065 30406 12321 -41036 -22277
15140 -22277 -10422 -14861 -78516 -111976 -129772 -99907 -71804 -35864 -36021 -7379 26018 22782
15128 22782 9507 -10470 -55421 -54035 -1420 20176 -1347 -31992 3252 4154 25195 89073
15116 89073 91794 91326 87225 -2464 3162 51063 51592 32637 13690 -7416 -27566 -18804 62088
15103 62088 70029 21994 -19990 1256 37029 20484 -20363 4863 40922 95592 76185 30007
$$ packed form
15188F3587J9845k422m9949l5079L3775J5042O9698k4658m2907l3012o867J8887
15176B5940M8401K7515J5759j9910m7199n2722J3428O9091k1047k7782J486M0793
15164G3753j0938j8361L2393O5504m9755p8438j4609K1974N8136J3897j2304m7378
15152C3874j6270M835k9686m9003m0234K5540M3511M8498R341j8085n3357J8759
15140b2277J1855m439o3655l3460j7796K9865K8103L5940j57K8642L3397l236
15128B2782j3275j9977m4951J386N2615K1596k1523l0645L5244R02K1041O3878
15116H9073K721m68m101q9689N626M7901N29j8955j8947k1106k0150Q762Q0892
15103F2088P941m8035m1984K1246L5773j6545m0847K5226L6059N4670j9407m6178
$$ plain form
15091 30007 -69400 -69135 -27611 3862 13330 -40588 -56001 -22494 -63311 -85933 -71000 -79715
15079 -79715 -94956 -41144 -9335 12219 126030 106363 18442 33554 39209 48058 28238 22884
15067 22884 25777 -9432 5521 8194 -12865 -59790 -26104 -13813 28736 54323 51811 4233
15055 4233 -16966 -63289 -91047 -87682 -22921 -44591 -77970 -52657 -43957 -19859 -13149 -1061
15043 -1061 -77461 -125256 -97319 -62170 -25843 33553 29547 9462 -12553 -39854 389 -32741
15031 -32741 -63165 -51517 -103426 -112819 -27377 -6499 24018 25675 -20251 -582 14762 -17704
15019 -17704 -51549 -49777 9037 30750 17971 -389 19021 7867 -21763 -53950 -79316 -62935
15007 -62935 -134729 -131147 -120078 -101575 -25842 15744 21937 13258 -28488 -37291 -68512 -47826
$$ packed form
15091C0007r9407K65M1524L1473R468n3918j5413L3507m0817k2622J4933q715
15079g9715j5241N3812L1809K1554J13811j9667q7921J5112N655Q849j9820n354
15067B2884K893l5209J4953K673k1059m6925L3686J2291M2549K5587k512m7578
15055D233k1199m6323k7758L365O4761k1670l3379K5313Q700K4098O710J2088
15043a061p6400m7795K7937L5149L6327N9396m006k0085k2015k7301M0243l3130
15031c2741l0424J1648n1909r393Q5442K0878L0517J657m5926J9669J5344l2466
15019a7704l3845J772N8814K1713j2779j8360J9410j1154k9630l2187k5366J6381
15007f2935p1794L582J1069J8503P5733M1586O193q679m1746q803l1221K0686
$$ plain form
14995 -47826 -35001 -54865 -59153 -36485 -39473 -46954 -51125 -96726 -78581 -63101 -58721 -3763 13402
14982 13402 -18252 -15962 -1391 34705 12048 7967 -5137 -21751 -99415 -89119 -12539 38731
14970 38731 34574 22000 23655 -4897 -42605 -76114 -52307 -26764 -8337 11813 16532 28771
14958 28771 -50571 -76922 -85094 -98302 -55224 23223 38679 36968 54606 40557 50961 61714
14946 61714 48759 32028 43056 90552 107764 127848 93993 66180 72106 56490 5823 -10524
14934 -10524 11334 21790 2030 11524 46788 36861 25917 -18351 -88569 -91741 -65888 -21491
14922 -21491 64104 5082 -19415 -1341 -42824 -97801 -48525 -12179 46986 19677 58552 38066
14910 38066 -24237 -12553 39263 77299 30126 20254 54863 99410 92936 -4060 -65005 -42929
$$ packed form
14995d7826J2825j9864m288K2668k988p481m171m5601J8145J5480M380N4958J7165
14982A3402l1654K290J4571L6096k2657m081j3104j6614p7664J0296P6580N1270
14970C8731m157j2574J655k8552l7708l3509K3807K5543J8427K0150M719J2239
14958B8771p9342k6351q172j3208M3078P8447J5456j711J7638j4049J0404J0753
14946F1714j2955j6731J1028M7496J7212K0084l3855k7813N926j5616n0667j6347
14934a0524K1858J0456j9760R494L5264r927j0944m4268p0218l172K5853M4397
14922b1491Q5595n9022k4497J8074m1483n4977M9276L6346N9165k7309L8875k0486
14910C8066o2303J1684N1816L8036m7173r872L4609M4547o474r6996o0945K2076
$$ plain form
14898 -42929 1086 9388 -3459 12730 4542 -22064 20173 6715 -23842 -33356 -56557 -24460
14886 -24460 -80976 -99906 -64584 -35604 -1065 -29453 -8061 -47131 -93545 -10795 36677 31668
14874 31668 76385 47737 -33510 -77506 -60692 6140 30950 91914 107375 101620 63717 65513
14862 65513 13945 -76680 -86346 -54002 34191 59034 20207 -27069 -56913 -129909 -119280 -63793
14850 -63793 -55385 -56016 -10394 -685 -31172 -80444 -82565 -46097 -89524 -100663 -96536 -122213 -108482
14837 -108482 -93169 -53132 23030 62834 37997 47328 -20046 -71797 -103936 -85484 3962 57985
14825 57985 70529 67189 71169 136662 97017 35105 33733 -21157 -18851 -20716 -66439 -43806 3715
14812 3715 -12271 -18606 -24142 -64734 -34671 -31973 24210 63854 104647 128146 125594 92315 30516
$$ packed form
14898d2929M4015Q302j2847J6189q188k6606M2237j3458l0557r514k3201L2097
14886b4460n6516j8930L5322K8980L4539k8388K1392l9070m6414Q2750M7472n009
14874C1668M4717k8648q1247m3996J6814O6832K4810O0964J5461n755l7903J796
14862F5513n1568r0625r666L2344Q8193K4843l8827m7276k9844p2996J0629N5487
14850f3793Q408o31M5622R709l0487m9272k121L6468m3427j1139M127k5677J3731
14837a08482J5313M0037P6162L9804k4837R331o7374n1751l2139J8452Q9446N4023
14825E7985J2544l340L980O5493l9645o1912j372n4890K306j865m5723K2633M7521
14812C715j5986o335n536m0592L0063K698N6183L9644M0793K3499k552l3279o1799
$$ plain form
14799 30516 -14122 -50493 20208 -18153 -22672 -60511 -72373 -27346 51052 70118 52298 49271
14787 49271 76677 45437 -20171 -40332 6175 20170 -14693 -10666 27136 -4085 -14305 19301
14775 19301 14622 19645 25344 -10506 -40534 -7388 -28469 -30628 -1879 28059 8363 119 27213
14762 27213 -664 -80858 5690 46222 39820 -12582 -61758 6412 4261 -88952 -99122 -32483
14750 -32483 -8799 56557 28855 -68922 -85455 -56202 -85369 -104224 -33428 10717 28731 29074
14738 29074 9542 -17897 -3411 41398 -35734 -47265 19830 -949 -13713 8716 -431 -43709
14726 -43709 -6690 85846 97242 100451 66756 55759 -5786 -22438 769 35928 28921 28416
14714 28416 -10153 -24387 -42583 -24571 14130 15911 -6021 -3325 -13537 18058 7241 -43462
$$ packed form
14799C0516m4638l6371P0701l8361m519l7839j1862M5027P8398J9066j7820l027
14787D9271K7406l1240o5608k0161M6507J3995l4863M027L7802l1221j0220L3606
14775A9301m679N023N699l5850l0028L3146k1081k159K8749K9938j9696q244K7094
14762B7213k7877q0194Q6548M0532o402n2402m9176O8170k151r3213j0170O6639
14750c2483K3684O5356k7702r7777j6533K9253k9167j8855P0796M4145J8014L43
14738B9074j9532k7439J4486M4809p7132j1531O7095k0779j2764K2429r147m3278
14726d3709L7019R2536J1396L209l3695j0997o1545j6652K3207L5159p007n05
14714B8416l8569j4234j8196J8012L8701J781k1932K696j0212L1595j0817n0703
$$ plain form
14702 -43462 -33432 -58879 -83962 -47545 -822 -39038 -19043 42869 78217 86320 64962 54457
14690 54457 55181 51339 60453 71589 62845 69878 66415 24361 -14736 -3199 -14999 -36332 -34036
14677 -34036 -16832 -17448 -19582 4668 -18516 -14849 -21054 -5724 2132 -18918 -50341 20386 75253
14664 75253 113766 127023 72599 105120 164460 181419 160723 151768 124519 118771 82163 71600
14652 71600 110723 129622 81762 62948 56073 22102 18465 27045 54168 28544 49775 68259
14640 68259 -30597 -55018 -83793 -52707 -55135 -57245 -80472 -90063 -44568 -26399 -2712 37461
14628 37461 44561 85000 135961 117104 95906 181087 218480 162534 200843 192944 186480 207889
14616 207889 162770 93097 37677 43122 26826 41495 32932 84462 63304 77291 109118 76305
$$ packed form
14702d3462J0030k5447k5083L6417M6723l8216J9995O1912L5348Q103k1358j0505
14690E4457P24l842R114J1136q744P033l463m2054l9097J1537j1800k1333K296
14677c4036J7204o16k134K4250k3184L667o205J5330P856k1050l1423P0727N4867
14664G5253L8513J3257n4424L2521N9340J6959k0696q955k7249n748l6608j0563
14652G1600L9123J8899m7860j8814o875l3971l637Q580K7123k5624K1231J8484
14640F8259r8856k4421k8775L1086k428k110k3227r591M5495J8169K3687M0173
14628C7461P100M0439N0961j8857k1198Q5181L7393n5946L8309p899o464K1409
14616B07889m5119o9673n5420N445j6296J4669q563N1530k1158J3987L1827l2813
$$ plain form
14604 76305 101023 62634 -4577 -45652 -5093 24676 66757 73714 45550 54659 77635 40114
14592 40114 101956 138072 85245 60500 103820 157834 121063 114993 134806 139047 118976 134196
14580 134196 138245 148204 99654 116077 63200 5508 30662 32786 43912 29038 42874 29614
14568 29614 59009 74349 8011 -30791 -29533 -53924 -76157 -105277 -73558 -78021 -58886 -21295
14556 -21295 -2795 -1794 24267 44599 51562 131782 124143 41830 46013 15225 -5023 7692
14544 7692 -20966 -35366 -76769 -20581 22749 16762 49128 32584 14365 -5889 -2875 49515
14532 49515 121116 148040 83773 -25589 -86236 -89657 -37936 -2605 11574 55465 34602 14023
14520 14023 -15329 -68485 -75579 -59450 -52245 -6598 -12996 27123 41882 7342 -44597 -57945
$$ packed form
14604G6305K4718l8389o7211m1075M0559K9769M2081O957k8164R109K2976l7521
14592D0114O1842L6116n2827k4745M3320N4014l6771o070J9813M241k0071J5220
14580A34196M049R959m8550J6423n2877n7692K5154K124J1126j4874J3836j3260
14568B9614K9395J5340o6338l8802J258k4391k2233k9120L1719m463J9135L7591
14556b1295J8500J001K6061K0332O963Q0220p639q2313M183l0788k0248J2715
14544G692k8658j4400m1403N6188M3330n987L2366j6544j8219k0254L014N2390
14532D9515P1601K6924o4267j09362o0647l421N1721L5331J4179M3891k0863k0579
14520A4023k9352n3156p094J6129P205M5647o398M0119J4759l4540n1939j3348
$$ plain form
14508 -57945 -13270 -22547 11141 -1956 -17488 -29746 -5015 -42130 -57015 -11415 -2180 -11968
14496 -11968 -22836 -343 31660 41969 79523 111821 64964 49810 50819 76017 38811 66846
14484 66846 27924 17015 24245 -20626 -59247 -41532 -30252 -24582 -95006 -95318 -52951 -62271 -20469
14471 -20469 10117 24419 -6408 4869 32575 59925 28505 33161 64076 96992 92781 64005
14459 64005 3356 -35181 -52367 -95713 -92138 -34453 6523 15081 -7565 -40700 2024 -10191
14447 -10191 9966 44412 39920 25311 21137 -5142 20296 20568 20148 25485 55869 20768 -11250
14434 -11250 -4971 6236 29514 -9229 29258 15327 12566 64461 89363 62418 -9279 -41788
14422 -41788 -51407 -74208 -51254 42130 58670 2311 -23493 -35218 -7276 33041 91949 53783
$$ packed form
14508e7945M4675r277L3688j3097j5532j2258K4731l7115j4885M5600R235r788
14496a1968j0868K2493L2003J0309L7554L2298m6857j5154J009K5198l7206K8035
14484F6846l8922j0909P230m4871l8621J7715J1280N670p0424l12M2367r320M1802
14471b0469L0586J4302l0827J1277K7706K7350l1420M656L0915L2916m211k8776
14459F4005o0649l8537j7186m3346L575N7685M0976Q558k2646l3135M2724j2215
14447a0191K0157L4446m492j4609m174k6279K5438K72m20N337L0384l5101l2018
14434a1250O279J1207K3278l8743L8487j3931k761N1895K4902k6945p1697l2509
14422d1788r619k2801K2954R3384J6540n6359k5804j1725K7942M0317N8908l8166
$$ plain form
14410 53783 -18511 -34603 -17255 -91 16399 50343 -33789 -26146 -5064 -27196 -37390 -43243
14398 -43243 -15981 11754 -18010 -13332 46691 73411 -11027 -84019 -47155 -28559 -48289 -72593
14386 -72593 -34032 -13430 -16045 -26535 -35879 -68298 -106038 -138877 -140256 -58459 -31148 -39422
14374 -39422 6467 82416 92172 24118 -791 -32676 -13033 -5346 -12416 -33277 -25743 -44745
14362 -44745 -20915 -22300 -33534 -8207 -12945 -22679 -63499 -35929 -16487 -40213 9567 62294
14350 62294 71365 49709 67532 102451 91853 66069 32724 -10763 -13205 10569 2728 39048
14338 39048 71604 40752 -40357 -50571 25826 68669 67157 64948 65930 -15455 -66041 -40330
14326 -40330 -27748 10887 11129 -16194 -55512 -40793 5772 27442 70062 37022 49400 62318
$$ packed form
14410E3783p2294j6092J7348J7164J6490L3944q4132P643K1082k2132j0194n853
14398d3243K7262K7735k9764M678O0023K6720q4438p2992L6864J8596j9730k4304
14386g2593L8561K0602k615j0490r344l2419l7740l2839j379Q1797K7311q274
14374c9422M5889P5949R756o8054k4909l1885J9643P687p070k0861P534j9002
14362d4745K3830j385j1234K5327m738r734m0820K7570J9442k3726M9780N2727
14350F2294R071k1656J7823L4919j0598k5784l3345m3487k442K3774p841L6320
14338C9048L2556l0852q1109j0214P6397M2843j512k209R82q1385n0586K5711
14326d0330J2582L8635K42k7323l9318J4719M6565K1670M2620l3040J2378J2918
$$ plain form
14314 62318 28316 15063 32195 10657 28226 23324 56710 86262 43823 50148 75852 132809
14302 132809 61414 31033 69253 66895 38397 54330 43001 15153 -38794 -20445 -28246 -43032
14290 -43032 -12307 -25734 -33586 -9520 -18834 -75207 -63561 -24012 22999 70900 107307 60368
14278 60368 -21921 -40411 -25889 -5411 -5878 -29773 -28417 -29561 -35217 806 14444 -36514 -40314
14265 -40314 -38895 -25362 -42033 -9561 53399 21206 -52541 -89490 -52291 -39070 -16693 -1254
14253 -1254 -35669 -42901 13522 -7088 11947 16453 54683 49032 88629 55826 11505 -21266
14241 -21266 -17348 -1905 19281 57756 35524 42767 28189 6332 7659 32985 54799 40254
14229 40254 79419 -4510 -55665 -47685 4437 50170 55843 95452 100370 -2149 -25184 45765
$$ packed form
14314F2318l4002j3253J7132k1538J7569m902L3386K9552m2439O325K5704N6957
14302A32809p1395l0381L8220k358k8498J5933j1329k7848n3947J8349p801j4786
14290d3032L0725j3427p852K4066r314n6373J1646L9549M7011M7901L6407m6939
14278F0368q2289j8490J4522K0478m67k3895J356j144n656L6023J3638n0958l800
14265d0314J419J3533j6671L2472O2960l2193p3747l6949L7199J3221K2377J5439
14253a254l4415p232N6423k0610J9035M506L8230n651L9597l2803m4321l2771
14241b1266L918J5443K1186L8475k2232P243j4578k1857J327K5326K1814j4545
14229D0254L9165q3929n1155P980N2122M5733N673L9609M918j02519k3035P0949
$$ plain form
14217 45765 18060 -2169 -20357 18754 20510 10575 -10786 -35837 -8191 -26621 -28659 -23427
14205 -23427 -2596 -29117 -18159 58201 77550 79689 81564 101305 73073 49681 -4038 39577
14193 39577 46991 26028 24583 54154 71084 81246 57714 88515 152227 166879 178216 201792
14181 201792 243855 300498 388536 498804 485804 506042 537768 532565 457122 362485 328722
14170 328722 257841 230621 155504 83985 52673 19919 22849 73580 66232 87551 17784 -29283
14158 -29283 -48673 -1036 71647 134284 122185 75598 27650 -32324 -76255 -20529 39908 35186
14146 35186 15269 37565 -2276 -26592 13066 -46658 -128299 -115638 -59609 30739 75985 53835
14134 53835 -9588 -58095 -21272 33191 69948 61690 36784 -9412 -39679 -59888 -41165 -25539
$$ packed form
14217D5765k7705k0229j8188L9111J756r935k1361k5051K7646j8430k038N232
14205b3427K0831k6521J0958P6360J9349K139J875J9741k8232k3392n3719M3615
14193C9577P414k0963j445K9571J6930J0162k3532L0801O3712J4652J1337K3576
14181B01792M2063N6643Q8038J10268j3000K0238L1726n203p5443r4637l3763
14170C28722p0881k7220p5117p1519l1312l2754K930N0731p348K1319o9767m7067
14158b9283j9390M7637P2683O2637j2099m6587m7948n9974m3931N5726O0437m722
14146C5186j9917K2296l9841k4316L9658n9724q1641J2661N6029R0348M5246k2150
14134E3835o3423m8507L6823N4463L6757q258k4906m6196l0267k0209J8723J5626
$$ plain form
14122 -25539 2302 17099 11469 1161 28958 18448 55277 53936 30449 20194 -45675 79545
14110 79545 147205 115626 98779 57923 15505 6837 13008 4932 4343 10153 -1542 -6120 -17523
14097 -17523 -25209 12672 20875 10126 77378 85149 65899 51147 27592 -8818 -4707 -14451 18096
14084 18096 27990 71884 94459 74401 33417 54240 39624 19169 6699 21519 85381 103396
14072 103396 92692 92968 129605 88967 49097 26253 9185 -37529 -15949 61992 73466 91123
14060 91123 56281 27526 1118 -16223 -81769 -71680 -20486 -19617 -8713 -18981 -3055 -2839
14048 -2839 33745 49815 55287 61314 59580 -4013 -78562 -75110 -81422 -123090 -19596 69456 93708
14035 93708 89789 43712 1480 -6109 48124 67775 129459 73118 10173 29370 -41809 -9094
$$ packed form
14122b5539K7841J4797n630j0308K7797j0510L6829j341k3487j0255o5869J25220
14110G9545O7660l1579j6847m0856m2418q668O171q076n89N810j1695m578j1403
14097a7523p686L7881Q203j0749O7252P771j9250j4752k3555l6410M111r744L2547
14084A8096R894M3894K2575k0058m0984K0823j4616k0455j2470J4820O3862J8015
14072A03396j0704K76L6637m0638l9870k2844j7068m6714K1580P7941J1474J7657
14060I1123l4842k8755k6408j7341o5546J0089N1194Q69J0904j0268J5926K16
14048b839L6584J6070N472O027j734o3593p4549L452o312m1668J03494Q9052K4252
14035I3708l919m6077m2232p589N4233J9651O1684n6341o2945J9197p1179L2715
$$ plain form
14023 -9094 -46572 -102310 -81608 -23296 -3292 39327 52414 43593 -10745 -78692 -81948 -43400
14011 -43400 25198 52495 54729 35852 10495 22410 65498 79784 43835 28948 19454 40162
13999 40162 9576 12139 68835 104949 26038 35193 82256 94191 103124 123279 117991 111039 52069
13986 52069 16703 15509 -18165 -29002 6746 -28680 -90753 -58330 -56742 -39962 -12360 -14567
13974 -14567 12977 26427 17998 -23939 1193 41747 42591 19683 -5820 -34295 -24949 -2233
13962 -2233 -35906 -51539 -26446 9523 21171 -7726 -19201 22282 -3188 -41861 -37610 -9398
13950 -9398 28271 -2515 -56210 -48861 25428 -22084 -29378 24775 32385 49117 33237 53368
13938 53368 95038 117730 71407 50808 24221 8463 -2063 30211 75050 53557 25582 34346
$$ packed form
14023i094l7478n5738K0702N8312K0004M2619J3087q821n4338o7947l256L8548
14011d3400O8598K7297K234j8877k5357J1915M3088J4286l5949j4887r494K0708
13999D0162l0586K563N6696L6114p8911R155M7063J1935Q933K0155n288o952n8970
13986E2069l5366j194l3674j0837L5748l5426o2073L2423J588J6780K7602k207
13974a4567K7544J3450q429m1937K5132M0554Q44k2908k5503k8475R346K2716
13962b233l3673j5633K5093L5969J1648k8897j1475M1483k5470l8673M251K8212
13950i398L7669l0786n3695P349P4289m7512p294N4153P610J6732j5880K0131
13938E3368M1670K2692m6323k0599k6587j5758j0526L2274M4839k1493k7975Q764
$$ plain form
13926 34346 71587 53268 32314 38253 15150 36152 72210 35687 -2888 23033 32052 63116
13914 63116 42017 -27233 -60872 -110210 -81278 -25400 8971 42534 32698 -17662 -31911 14286
13902 14286 42450 31368 30702 43765 35067 17208 47982 56889 69121 94065 87374 124880 104965
13889 104965 71883 65728 52149 56086 93021 127272 91262 73683 89817 58413 90333 97829
13877 97829 118898 42918 19738 -2389 10119 41713 18084 -43845 -62446 -19149 -2477 40918
13865 40918 49896 26396 72706 93845 19947 19768 52534 37581 40636 38151 19887 50870 18740
13852 18740 499 -9645 21727 11240 -35676 7147 63100 6552 -63519 -92482 -123029 -89480
13840 -89480 -10339 4480 12469 30051 -6188 4510 -8677 7235 25104 36600 1758 -34925
$$ packed form
13926C4346L7241j8319k0954N939k3103K1002L6058l6523l8575K5921R019L1064
13914F3116k1099o9250l3639m9338K8932N5878L4371L3563r836n0360j4249M6197
13902A4286K8164j1082o66J3063q698j7859L0774Q907J2232K4944o691L7506j9915
13889A04965l3082o155j3579L937L6935L4251l6010j7579J6134l1404L1920P496
13877I7829K1069p5980k3180k2127J2508L1594k3629o1929j8601M3297J6672M3395
13865D0918Q978k3500M6310K1139p3898j79L2766j4953L055k485j8264L0983l2130
13852A8740j8241j0144L1372j0487m6916M2823N5953n6548p0071k8963l0547L3549
13840h9480P9141J4819P989J7582l6239J0698j3187J5912J7869J1496l4842l6683
$$ plain form
13828 -34925 -6943 -20352 2781 69846 18704 -3188 11851 51432 122847 136090 65437 -1988
13816 -1988 161 -31504 -41776 -41430 -23790 -6694 32121 23837 16616 81591 65805 -873 23282
13803 23282 89805 85405 119916 200509 193166 118410 91163 47502 7404 16311 66359 33627
13791 33627 24567 46434 50838 22854 11984 -54634 -88275 -23922 1476 -47740 -87824 -71166
13779 -71166 -17165 26881 28145 -10904 -28513 -35541 8110 -1179 9509 10502 -22195 13093 15547
13766 15547 960 26380 42242 17533 3853 -8242 6112 10438 -46389 -25029 -47082 -102476
13754 -102476 -111923 -47057 27865 10354 -71 43375 84561 2611 -38016 -12186 23926 11526
13742 11526 -27461 -54939 -79861 -95119 -120188 -102023 -73328 -12217 73306 92380 82666 58907
$$ packed form
13828c4925K7982j3409K3133O7065n1142k1892J5039L9581P1415J3243p0653o7425
13816a988K149l1665j0272L46J7640J7096L8815q284p221O4975j5786o6678K4155
13803B3282O6523m400L4511Q0593p343p4756k7247m3661m0098Q907N0048l2732
13791C3627r060K1867M404k7984j0870o6618l3641O4353K5398m9216m0084J6658
13779g1166N4001M4046J264l9049j7609p028M3651r289J0688R93l2697L5288K454
13766A5547j4587K5420J5862k4709j3680j2095J4354M326n6827K1360k2053n5394
13754a02476r447O4866P4922j7511j0425M3446M1186q1950m0627K5830L6112j2400
13742A1526l8987k7478k4922j5258k5069J8165K8695O1111Q5523J9074r714k3759
$$ plain form
13730 58907 48700 13029 -24128 11108 -26484 -97676 -51249 37784 62591 56093 -41485 -58474
13718 -58474 -65690 -128735 -149553 -95032 -78340 -52779 -25003 -21972 -37405 -40582 -27320 -88482
13706 -88482 -132670 -128377 -88467 -42492 -47236 -57487 -42105 -47250 9888 -13240 -45396 49834
13694 49834 62300 1186 -86 -3438 -14623 -47878 -32789 -11635 -19925 -55487 -5876 49116
13682 49116 11759 -9838 -26352 -42708 -24087 24164 31645 -7007 8443 8972 -40995 -72168
13670 -72168 -11682 -68634 -63099 -30980 -60331 -52853 -31401 -83836 -82342 -85478 -52420 22295
13658 22295 -6305 -34988 -3461 36359 1297 1099 51935 71232 101630 84456 -13000 -22897
13646 -22897 -4591 22252 42487 45382 -10043 -76999 -110233 -43668 -24621 -21879 -44031 -45536
$$ packed form
13730E8907j0207l5671l7157L5236l7592p1192M6427Q9033K4807o498r7578j6989
13718e8474p216o3045k0818N4521J6692K5561K7776L031j5433l177J3262o1162
13706h8482m4188M293L9910M5975m744j0251J5382n145N7138k3128l2156R5230
13694D9834J2466o1114j272l352j1185l3255J5089K1154q290l5562M9611N4992
13682D9116l7357k1597j6514j6356J8621M8251P481l8652J5450N29m9967l1173
13670g2168O0486n6952N535L2119k9351P478K1452n2435J494l136L3058P4715
13658B2295k8600k8683L1527L9820l5062j98N0836J9297L0398j7174r7456r897
13646b2897J8306K6843K0235K895n5425o6956l3234O6565J9047K742k2152j505
$$ plain form
13634 -45536 -42720 -44999 -47269 -954 27528 24605 -22786 -5907 -72522 -89474 -68689 -19427
13622 -19427 -10239 14808 29050 -5637 -16890 -19881 -39186 21712 80214 63457 84736 60631
13610 60631 25114 31079 67301 98354 108122 122602 64200 20521 15639 21635 31161 26705 40104
13597 40104 31387 36665 2834 2855 37185 79633 109132 72454 59770 84484 58616 18645 -19651
13584 -19651 9110 49065 87325 100355 90901 74039 69539 105710 91099 84792 94819 132046
13572 132046 153665 96749 50082 60289 7350 -12214 -14615 -38848 -12422 14663 -11496 7465
13560 7465 12558 -6544 -2616 656 60741 105734 124100 118518 96058 89708 115953 90484 54629
13547 54629 52637 37229 89568 82811 111501 106943 79921 86325 44934 26716 -6730 4368
$$ packed form
13634d5536K816k279k270M6315K8482k923m7391J6879o6615j6952K0785M9262
13622a9427R188K5047J4242l4687j1253k991j9305O0898N8502j6757K1279k4105
13610F0631l5517N965L6222L1053R768J4480n8402m3679m882N996R526m456J3399
13597D0104q717N278l3831K1L4330M2448K9499l6678j2684K4714k5868l9971l8296
13584a9651K8761L9955L8260J3030r454j6862m500L6171j4611o307J0027L7227
13572A32046K1619n6916m6667J0207n2939j9564k401k4233K6426K7085k6159J8961
13560G465N093j9102L928L272O0085M4993J8366n582k2460o350K6245k5469l5855
13547E4629j992j5408N2339o757K8690m558k7022O404m1391j8218l3446J1098
$$ plain form
13535 4368 44662 21707 3356 72625 110477 40536 103110 95747 8020 -33806 -31879 -28999
13523 -28999 7942 35150 54017 88544 62495 26969 37614 18667 -18362 -62162 -86764 -122451
13511 -122451 -74547 29256 38655 8100 17203 -23112 -18638 -10603 11790 34541 75103 147017
13499 147017 224147 192856 147134 94904 -9936 -36450 -24614 -45106 -90421 -68916 -61943
13488 -61943 -28530 26061 1272 -34925 -42853 32582 27250 -20490 -60599 -65373 50094 87720
13476 87720 67384 20904 1612 36914 38007 -23861 2647 31482 32974 50925 66370 60899
13464 60899 -8166 -36680 -22071 -28420 894 37821 34657 97913 62488 19680 27717 -18379
13452 -18379 -39453 5087 8914 -26940 -30256 -56839 -14212 14117 36424 33408 53687 103189
$$ packed form
13535D368M0294k2955j8351O9269L7852o9941O2574p363q7727m1826J927K880
13523b8999L6941K7208J8867L4527k6049l5526J0645j8947l7029m3800k4602l5687
13511a22451M7904J03803R399l0555R103m0315M474Q035K2393K2751M0562P1914
13499A47017P7130l1291m5722n2230j04840k6514J1836k0492m5315K1505O973
13488f1943L3413N4591k4789l6197p928P5435n332m7740m0109m774J15467L7626
13476H7720k0336m6480j9292L5302J093o1868K6508K8835J492J7951J5445n471
13464F0899o9065k8514J4609o349K9314L6927l164O3256l5425m2808Q037m6096
13452a8379k1074M4540L827l5854l316k6583M2627K8329K2307l016K0279M9502
$$ plain form
13440 103189 128264 22269 -36064 -71280 -70759 -30333 13543 8570 -22043 -35616 -28186 -11622
13428 -11622 12093 37791 36014 35514 6287 29031 43364 13257 -21772 -42586 -36058 -10960
13416 -10960 -35434 -7433 56110 84697 51912 -11986 -48096 -73869 -64528 -87739 -88671 -61769
13404 -61769 -16034 -10900 -33729 -7838 5043 46422 29620 18628 -30483 -44972 -62593 -53288
13392 -53288 -48486 -86736 -107044 -43062 -10678 39050 24601 -13417 -32035 -30425 -29055 -10367
13380 -10367 -33443 -56776 -70678 21580 17365 -16992 -23088 -37193 -13096 -21179 -28774 -16005
13368 -16005 -37073 9741 47888 78402 110329 98465 84487 91642 75437 65955 43505 -6037
13356 -6037 -9064 19321 -4651 -6300 -6241 19239 77068 75395 25239 293 22313 5098 71061
$$ packed form
13440A03189K5075j05995n8333l5216N21M0426M3876m973l0613j3573P430J6564
13428a1622K3715K5698j777n00k9227K2744J4333l0107l5029k0814O528K5098
13416a0960k4474K8001O3543K8587l2785o3898l6110k5773R341k3211r32K6902
13404f1769M5735N134k2829K5891J2881M1379j6802j0992m9111j4489j7621R305
13392e3288M802l8250k0308O3982L2384M9728j4449l8018j8618J610J370J8688
13380a0367k3076k3333j3902R2258m215l4357o096j4105K4097q083p595J2769
13368a6005k1068M6814L8147L0514L1927j1864j3978P155j6205r482k2450m9542
13356f037l027K8385k3972j649N9K5480N7829j673n0156k4946K2020j7215O5963
$$ plain form
13343 71061 93104 67648 20470 10976 27119 58273 51519 51003 74098 21386 -30461 9735
13331 9735 -6938 -52226 -4532 6319 -3753 -11886 -35516 -13801 81642 81641 36492 50198 37867
13318 37867 60112 11999 -1340 45615 49060 11368 -10176 18581 26884 23790 -2625 26231
13306 26231 68000 73799 103934 41139 -17856 -11631 50961 49648 17263 60141 72482 123123
13294 123123 139283 85046 5510 -932 22949 1877 532 2227 25791 78123 26420 -14504
13282 -14504 -51062 -68501 -59183 -8615 6551 -11468 -9375 42704 61298 99976 126109 72170
13270 72170 625 -11662 17419 22020 18030 30600 94120 85510 59642 60343 77484 124392 70567
13257 70567 69506 19922 -50174 -101082 -66968 -60262 -19713 7565 34981 107075 141467 151522
$$ packed form
13343G1061K2043k5456m7178r494J6143L1154o754n16K3095n2712n1847M0196
13331I735j6673m5288M7694J0851j0072q133k3630K1715R5443jm5149J3706j2331
13318C7867K2245m8113j3339M6955L445l7692k1544K8757Q303l094k6415K8856
13306B6231M1769N799L0135o2795n8995O225O2592j313l2385M2878J2341N0641
13294A23123J6160n4237p9536o442K3881k1072j345J695K3564N2332n1703m0924
13282a4504l6558j7439R318N0568J5166j8019K093N2079J8594L8678K6133n3939
13270G2170p1545j2287K9081M601l990J2570O3520q610k5868P01J7141M6908n3825
13257G0567j061m9584p0096n0908L4114O706M0549K7278K7416P2094L4392J0055
$$ plain form
13245 151522 160697 144410 107494 114471 103434 130196 98016 176250 242820 184238 108309 53819
13233 53819 26399 44472 -24303 -21624 1511 22555 -11064 -34423 -25145 64895 67222 90630
13221 90630 105374 111640 102597 77528 46834 24479 -19599 24424 48495 36993 89093 153491
13209 153491 120174 156586 160782 199114 233789 254470 302011 322774 328533 274075 208156 205905
13197 205905 118287 92821 40676 -15716 25109 67499 80756 56545 96347 69143 88811
13186 88811 84424 72942 28382 11816 69725 111083 122386 89962 96812 87538 26879 1047
13174 1047 20114 67381 53738 51014 78400 87090 51787 32911 67603 102204 114406 159221
13162 159221 230279 340581 453323 543161 707843 812925 798979 634127 394248 233573
$$ packed form
13245A51522R175j6287l6916O977j1037K6762l2180P8234O6570n8582p5929n4490
13233E3819k7420J8073o8775K679K3135K1044l3619k3359R278R0040K327K3408
13221I0630J4744O266r043k5069l0694k2355m4078M4023K4071j1502N2100O4398
13209A53491l3317L6412M196L8332L4675K0681M7541K0763N759n4458o5919k251
13197B05905q7618k5466n2145n6392M0825M2390J3257k4211L9802k7204J9668
13186H8811m387j1482m4560j6566N7909M1358J1303l2424O850r274o0659k5832
13174A047J9067M7267j3643k724K7386Q690l5303j8876L4692L4601J2202M4815
13162A59221P1058J10302J12742Q9838J64682J05082j3946j64852k39879j60675
$$ plain form
13152 233573 150701 52052 10298 23278 64267 53742 7154 11701 22412 50425 102005 56674
13140 56674 19451 12300 -13788 -5276 50884 40148 60322 90543 115354 91975 82118 85591
13128 85591 52807 45970 59816 63232 77800 98904 116704 118844 114491 177638 252077 293839
13116 293839 294004 401740 657868 915544 1095039 1056596 865200 656157 549513 424460
13106 424460 360689 340099 414371 546591 661996 811515 955880 1114506 1197156 1210746
13096 1210746 1220101 1249209 1215156 1156037 1061664 957519 847660 752700 657401 710193 758544
13085 758544 783775 875247 1001373 1093986 1156616 1180268 1161098 1047975 889182 740466 687674
13074 687674 657688 473415 364073 372015 392418 406716 493287 482954 412726 378240 330738
$$ packed form
13152B33573q2872r8649m1754J2980M0989j0525m6588M547J0711K8013N1580m5331
13140E6674l7223p151k6088Q512N6160j0736K0174L0221K4811k3379r857L473
13128H5591l2784o837J3846L416J4568K1104J7800K140m353O3147P4439M1762
13116B93839J65J07736K56128K57676J79495l8443j91396k09043j06644j25053
13106D24460o3771k0590P4272J32220J15405J49519J44365J58626Q2650J3590
13096A210746R355K9108l4053n9119r4373j04145j09859r4960r5299N2792M8351
13085G58544K5231R1472J26126R2613O2630K3652j9170j13123j58793j48716n2792
13074F87674k9986j84273j09342P942K0403J4298Q6571j0333p0228l4486m7502
$$ plain form
13063 330738 235649 173076 114702 25547 67720 78715 62072 47053 22672 27380 38138 47970
13051 47970 42784 49894 25240 19891 57786 43026 53145 93905 95874 92171 121050 112486 122542
13038 122542 117107 86901 95619 69829 88525 98265 91895 13405 -6788 -9199 -41 2027 11496
13025 11496 25140 69373 109192 102781 28753 -22618 50755 68446 75110 103799 127231 145238
13013 145238 108545 60979 61207 5316 2090 5178 45282 76526 40131 60334 79957 87106
13001 87106 53981 92282 129935 114300 43834 27973 55392 21931 2981 11411 22389 37630
12989 37630 42397 33925 41811 90204 127227 148132 119799 65797 67231 115730 148876 103234
12977 103234 61044 21941 42746 52529 29962 64159 95466 88817 60533 97858 152117 155721
$$ packed form
13063C30738r5089o2573n8374q9155M2173J0995j6643j5019k4381M708J0758R832
13051D7970n186P110k4654n349L7895j4760J0119M0760J969l703K8879q564J0056
13038A22542n435l0206Q718k5790J8696R740o370p8490k0193k411R158K068R469
13025A1496J3644M4233L9819o411p4028n1371P3373J7691O664K8689K3432J8007
13013A45238l6693m7566K28n5891l226L088M0104L1244l6395K0203J9623P149
13001H7106l3125L8301L7653j5635p0466j5861K7419l3461j8950Q430J0978J5241
12989C7630M767q472P886M8393L7023K0905k8333n4002J434M8499L3146m5642
12977A03234m2190l9103K0805R783k2567L4197L1307o649k8284L7325N4259L604
$$ plain form
12965 155721 145760 95566 112771 113708 98992 60106 120443 132316 168718 222357 187364 108630
12953 108630 68238 43058 87352 68459 41692 34246 19450 -39240 -27931 20249 78799 140454
12941 140454 161234 115360 33602 24840 101226 137923 166966 155311 190755 200529 173469 216485
12929 216485 241800 240952 215887 230264 191797 162122 137654 175869 155113 99322 100891 145189
12917 145189 122943 89801 114863 122897 108094 84074 140791 175217 216143 219254 182244 182648
12905 182648 213145 239793 227056 188770 150647 125998 172063 139320 62376 55003 78859 55121
12893 55121 92282 201982 237942 182719 140206 163007 147948 137294 183268 161913 122321
12882 122321 156076 158730 225540 242942 196522 206252 224914 258985 296648 336767 362191 367907
$$ packed form
12965A55721r961n0194J7205R37j4716l8886O0337J1873L6402N3639l4993p8734
12953A08630m0392k5180M4294j8893k6767p446j4796n8690J1309M8180N8550O1655
12941A40454K0780m5874q1758q762P6386L6697K9043j1655L5444R774k7060M3016
12929B16485K5315q48k5065J4377l8467k9675k4468L8215k0756n5791J569M4298
12917A45189k2246l3142K5062Q034j4803k4020N6717L4426M0926L111l7010M04
12905A82648L0497K6648j2737l8286l8123k4649M6065l2743p6944p373K3856k3738
12893E5121L7161J09700L5960n5223m2513K2801j5059j0654M5974k1355l9592
12882A22321L3755K654O6810J7402m6420R730J8662L4071L7663M0119K5424N716
$$ plain form
12870 367907 348945 317548 303507 244492 184041 127209 79905 76560 70163 41688 16910 23088
12858 23088 5398 -16203 -7898 68134 134699 130669 142050 179762 199158 184829 179624 150940
12846 150940 100023 114022 174557 173544 64102 13312 72728 106389 80205 51428 100787
12835 100787 120475 124797 103229 109307 83092 77411 90946 86105 149390 110993 126713 112527
12823 112527 91426 140528 248211 266887 244182 251304 235826 220353 261320 350333 336786
12812 336786 293501 292165 283644 263727 334659 393146 434942 500703 553275 590953 643644 685641
12800 685641 652576 620629 622769 595100 544178 547903 519549 435747 427629 441379 455540 472843
12788 472843 503569 485584 468610 437189 437377 484028 492344 520902 525863 497780 414793 376119
$$ packed form
12870C67907j8962l1397j4041n9015o0451n6832m7304l345o397k8475k4778O178
12858B3088j7690k1601Q305P6032O6565m030J1381L7712J9396j4329n205k8684
12846A50940n0917J3999O0535j013j09442n0790N9416L3661k6184k8777M9359
12835A00787J9688M322k1568O078k6215n681J3535m841O3285l8397J5720j4186
12823A12527k1101M9102J07683J8676k2705P122j5478j5473M0967Q9013j3547
12812C36786m3285j336q521j9917P0932N8487M1796O5761N2572L7678N2691M1997
12800F85641l3065l1947K140k7669n0922L725k8354q3802q118J3750J4161J7303
12788D72843L0726j7985j6974l1421J88M6651Q316K8558M961k8083q2987l8674
$$ plain form
12776 376119 416052 381435 390321 444248 434777 388301 372285 422823 477858 469121 472203 457577
12764 457577 519446 590483 613284 555373 531193 501468 517096 479109 528010 552782 547771 524616
12752 524616 561839 606707 577350 573447 565336 566652 611403 629441 675429 688271 732631 750500
12740 750500 692806 700001 750381 899286 933728 933037 962871 912009 920445 971746 997749 982635
12728 982635 988259 1016355 1057627 1117413 1140340 1225929 1273698 1249106 1246775 1317300 1374123 1500001
12716 1500001 1628093 1662401 1678755 1824375 2027038 2158665 2296885 2452298 2655564 2874450
12706 2874450 3063504 3186277 3359173 3614753 3982695 4402543 4865198 5380249 6063631
12697 6063631 6858285 7831018 9003127 10436529 11941264 13536105 15347803 17440214
$$ packed form
12776C76119L9933l4617Q886N3927r471m6476j6016N0538N5035q737L082j4626
12764D57577O1869P1037K2801n7911k4180k9725J5628l7987M8901K4772n011k3155
12752E24616L7223M4868k9357l903q111J316M4751J8038M5988J2842M4360J7869
12740G50500n7694P195N0380J48905L4442o91K9834n0862Q436N1301K6003j5114
12728I82635N624K8096M1272N9786K2927Q5589M7769k4592k331P0525N6823J25878
12716A500001J28092L4308J6354J45620K02663J31627J38220J55413K03266K18886
12706B874450J89054J22773J72896K55580L67942M19848M62655N15051O83382
12697F063631P94654R72733J172109J433402J504735J594841J811698K092411
$$ plain form
12689 17440214 19824397 22729910 26625661 32221166 40476197 52534061 69199609 90511215
12681 90511215 115343724 141670849 167447104 190465312 208175929 217912875 217932137 208250422
12673 208250422 190680687 167810893 142171021 115995506 91257398 69889033 53146639
12666 53146639 40976064 32451683 26578628 22477165 19480803 17119458 15142938 13379815
12658 13379815 11776720 10260267 8921408 7754191 6724035 5842433 5190256 4614450
12650 4614450 4128245 3746298 3454110 3188126 3028877 2895394 2690311 2525456 2373516
12641 2373516 2250884 2129985 1981537 1930563 1904244 1851182 1762703 1599934 1503376 1507925 1494543
12630 1494543 1466148 1448071 1388339 1328853 1340273 1399342 1402243 1364212 1395657 1491842 1549926
$$ packed form
12689A7440214K384183K905513L895751N595505Q255031J2057864J6665548K1311606
12681I0511215K4832509K6327125K5776255K3018208J7710617R736946J9262r681715
12673B08250422j7569735k2869794k5639872k6175515k4738108k1368365j6742394
12666E3146639j2170575q524381n873055m101463k996362k361345j976520j763123
12658A3379815j603095j516453j338859j167217j030156q81602o52177n75806
12650D614450m86205l81947k92188k65984j59249j33483k05083j64855j51940
12641B373516j22632j20899j48448n0974k6319n3062q8479j62769r6558M549j3382
12630A494543k8395j8077n9732n9486J1420N9069K901l8031L1445R6185N8084
$$ plain form
12619 1549926 1662643 1851002 2022762 2256857 2541977 2744665 2805344 2738136 2526665 2306204
12609 2306204 2144907 1980213 1785475 1625978 1532640 1503799 1459010 1464840 1484554 1545781 1550248
12598 1550248 1501950 1515451 1510653 1487369 1405144 1345185 1214894 1119615 1054852 969869 822349
12587 822349 730150 693021 675277 695780 741712 653936 603084 584169 560246 530139 574942
12576 574942 651739 740963 739724 774857 834933 969108 1026587 1213023 1445265 1620739 1795069
12565 1795069 1921718 2009499 2065053 1967247 1825129 1669630 1574321 1499802 1484291 1448368 1410222
12554 1410222 1367405 1289083 1218642 1131532 1063204 1024233 966401 911331 826030 730238 722282
12543 722282 718836 606248 568316 542556 492006 439682 425560 390675 327713 254442 239896
$$ packed form
12619A549926J12717J88359J71760K34095K85120K02688O0679o7208k11471k20461
12609B306204j61297j64694j94738j59497r3338k8841m4789N830J9714O1227M467
12598A550248m8298J3501m798k3284q2225n9959j30291r5279o4763q4983j47520
12587H22349r2199l7129j7744K0503M5932q7776n0852j8915k3923l0107M4803
12576E74942P6797Q9224j239L5133O0076J34175N7479J86436K32242J75474J74330
12565A795069J26649Q7781N5554r7806j42118j55499r5309p4519j5511l5923l8146
12554A410222m2817p8322p0441q7110o8328l8971n7832n5070q5301r5792p956
12543G22282l446j12588l7932k5760n0550n2324j4122l4885o2962p3271j4546
$$ plain form
12532 239896 249141 290293 322611 337893 294664 268196 345856 394728 424589 454287 507611 528127
12520 528127 590112 656246 689610 696391 707149 760948 873362 1013121 1101339 1219755 1238020
12509 1238020 1333289 1371429 1305772 1168882 1006811 913610 780568 680197 596223 500836
12499 500836 498252 497523 412981 345967 372304 341757 372793 413462 362730 309281 317853 283603
12487 283603 235457 254933 245268 253367 241498 253251 291170 292788 303306 258491 257626 282949
12475 282949 234863 260868 323850 356235 324419 296283 290230 275162 284698 273440 258032 224796
12463 224796 196996 208589 230011 208644 194261 197373 187838 114600 43638 32311 24263 19102
12451 19102 7335 17687 7437 67452 12646 -21897 32076 27030 -16487 5373 44542 61706
$$ packed form
12532B39896R245M1152L2318J5282m3229k6468P7660M8872K9861K9698N3324K0516
12520E28127O1985O6134L3364O781J0758N3799J12414J39759Q8218J18416J8265
12509A238020R5269L8140o5657j36890j62071r3201j33042j00371q3974r5387
12499E00836k584p29q4542o7014K6337l0547L1036M0669n0732n3449Q572l4250
12487B83603m8146J9476r665Q099j1869J1753L7919J618J0518m4815q65K5323
12475B82949m8086K6005O2982L2385l1816k8136o053j5068R536j1258j5408l3236
12463B24796k7800J1593K1422k1367j4383L112r535p3238p0962j1327q048n161
12451A9102j1767J0352j0250O0015n4806l4543N3973n046m3517K1860L9169J7164
$$ plain form
12439 61706 64512 17110 17868 33877 38582 48461 47699 46467 124754 146155 117431 128812 184254
12426 184254 113631 47662 13569 -6410 8515 42570 40178 56409 53692 54145 35746 28675
12414 28675 -33960 -70973 -76156 -128550 -148315 -97497 -70742 -72004 -73350 -56317 -62290 31066
12402 31066 113579 87132 54443 66777 74958 -8088 -31436 -11802 17868 -10755 -24266 -2910
12390 -2910 66511 51643 27693 66985 72750 79887 70678 91438 175353 238260 342473 451972
12378 451972 458049 415013 399239 362647 322418 307678 291598 214823 133154 156471 226777 187231
12366 187231 187837 154864 107695 106166 94496 65169 52494 56658 139656 170034 208478 188265
12354 188265 163466 197323 200369 167725 197844 262935 330106 375916 414257 431155 335436 293184
$$ packed form
12439F1706K806m7402P58J6009M705R879p62j232P8287K1401k8724J1381N5442
12426A84254p0623o5969l4093j9979J4925L4055k392J6231k717M53j8399p071
12414B8675o2635l7013n183n2394j9765N0818K6755j262j346J7033n973R3356
12402C1066Q2513k6447l2689J2334Q181q3046k3348J9634K9670k8623j3511K1356
12390b910O9421j4868k3950L9292N765P137r209K0760Q3915O2907J04213J09499
12378D51972O077m3036j5774l6592m0229j4740j6080p6775q1669K3317P0306l9546
12366A87231O06l2973m7169j529j1670k9327j2675M164Q2998L0378L8444k0213
12354A88265k4799L3857L046l2644L0119O5091O7171M5810L8341J6898r5719m2252
$$ plain form
12342 293184 256670 185488 138115 165054 207119 152917 25955 -87449 -59750 -52359 -13195
12331 -13195 48970 95089 43895 12221 44186 99073 153158 121181 166209 221533 204886 223185
12319 223185 234182 237428 244632 224688 196239 185162 177370 152789 109197 52346 46669 71484
12307 71484 34948 -9028 -58270 -11664 20196 12132 -23627 -40416 -25023 -24174 -22195 -73521
12295 -73521 460 68927 87081 27980 6937 90359 72674 20184 1476 13050 41847 45830
12283 45830 18672 29808 17951 43376 31856 24976 48285 25004 71204 91536 51415 -207
12271 -207 -23779 -40947 -41151 -200 94495 99918 63384 33438 27485 70221 118130 170195 262708
12258 262708 334517 416436 508327 677460 808179 864225 925427 1029978 1073242 1059317 1023714
$$ packed form
12342B93184l6514p1182m7373K6939M2065n4202j26962j13404K7699P391L9164
12331a3195O2165M6119n1194l1674L1965N4887N4085l1977M5028N5324j6647J8299
12319B23185J0997L246P204j9944k8449j1077p792k4581m3592n6851n677K4815
12307G1484l6536m3976m9242M6606L1860q064l5759j6789J5393Q49J979n1326
12295g3521P3981O8467J8154n9101k1043Q3422j7685n2490j8708J1574K8797L983
12283D5830k7158J1136j1857K5425j1520o880K3309k3281M6200K0332m0121n1622
12271b07k3572j7168k04M0951R4695N423l6534k9946n953M2736M7909N2065R2513
12258B62708P1809Q1919R1891J69133J30719N6046O1202J04551M3264j3925l5603
$$ plain form
12247 1023714 948776 833538 743097 643456 546851 375755 283408 218398 159924 145974 193495
12236 193495 242187 167216 73134 37251 33464 10706 -11998 -980 35487 37813 -11713 -15518
12224 -15518 -21200 -17283 -22733 52544 -9743 -51069 -25128 -40707 -98486 -123597 -66687 65697
12212 65697 134561 123956 81622 11594 47011 51902 64670 113270 100480 98023 89419 25799
12200 25799 21032 62717 -3704 -1992 42705 13977 -9702 21041 9888 -13184 -55081 -73702
12188 -73702 -82054 -82542 -43360 8383 -32865 -54903 -50387 -4436 -21552 22555 -66262 -46945
12176 -46945 -33145 -34905 -45211 -16286 -10301 27002 51429 26225 -20013 -9764 19429 -18000
12164 -18000 -43414 998 39316 35929 -8119 -10331 -22590 -19976 3070 75357 98509 100618
$$ packed form
12247A023714p4938j15238r0441r9641r6605j71096r2347o5010n8474j3950M7521
12236A93495M8692p4971r4082l5883l787k2758k2704J1018L6467K326m9526l805
12224a5518n682L917n450P5277o2287m1326K5941j5579n7779k5111N6910J32384
12212F5697O8864j0605m2334p0028L5417M891J2768M8600j2790k457q604o3620
12200B5799m767M1685o6421J712M4697k8728k3679L0743j1153k3072m1897j8621
12188g3702q352m88L9182N1743m1248k2038M516M5951j7116M4107q8817J9317
12176d6945J3800j760j0306K8925N985L7303K4427k5204m6238J0249K9193l7429
12164a8000k5414M4412L8318l387m4048k212j2259K614K3046P2287K3152K109
$$ plain form
12152 100618 78916 60834 88872 79736 46961 8989 -18163 -28255 10511 45829 64867 58528
12140 58528 41131 31327 -25008 -78984 -101278 -78868 -70239 -78588 -69863 -118202 -89702 11584
12128 11584 57919 74156 58685 24442 -4116 57967 38104 32293 55475 23023 5307 -7348
12116 -7348 -17656 -46543 -60529 -19322 -55168 -44580 -26945 14248 -2585 -69021 -86537 -85330
12104 -85330 -72973 -70153 -63115 31158 94276 85122 33254 -7577 -31982 -30780 -15471 -62305
12092 -62305 -94843 -73100 -47895 -50274 -20891 17242 51769 39638 -18899 -20784 7310 -6266
12080 -6266 10855 27129 4554 1820 -3930 33152 39391 56428 31325 -13070 -33691 427
12068 427 42143 -34328 -5978 71518 49171 44786 6492 2511 435 -15586 -12525 -62351 -73847
$$ packed form
12152A00618k1702j8082K8038r136l2775l7972k7152j0092L8766L5318J9038o339
12140E8528j7397r804n6335n3976k2294K2410Q629q349Q725m8339K8500J01286
12128A1584M6335J6237j5471l4243k8558O2083j9863n811K3182l2452j7716j2655
12116g348j0308k8887j3986M1207l5846J0588J7635M1193j6833o6436j7516J207
12104h5330J2357K820P038R4273O3118r154n1868m0831k4405J202J5309m6834
12092f2305l2538K1743K5205k379K9383L8133L4527j2131n8537j885K8094j3576
12080f266J7121J6274k2575k734n750L7082O239J7037k5103m4395k0621L4118
12068D27M1716p6471K8350P7496k2347m385l8294l981k076j6021L061m9826j1496
$$ plain form
12055 -73847 12269 20918 -9031 -654 9155 25872 67120 69564 65315 63190 537 -45313 -98656
12042 -98656 -53141 -17221 33273 45213 24793 53163 127463 60016 -18599 -11046 -3072 -27186
12030 -27186 -22900 2413 -21154 -32657 -1237 -18760 492 30130 -42531 -85902 -82749 -65036
12018 -65036 -67827 -52933 -55929 2354 -31631 -92801 -111132 -170245 -175894 -67158 -27991 -38795
12006 -38795 -34786 -17001 6067 20995 -15680 12416 61831 51531 26432 1790 -28465 -9089
11994 -9089 28058 -13498 -85125 -77539 -64907 -53237 46700 116352 91894 44863 30954 27053
11982 27053 24234 12494 30158 5407 -16997 -6276 -64915 -140712 -130395 -99463 -39141 17598
11970 17598 -7175 6365 4921 17913 26686 -13195 -93131 -86728 -35897 10976 41675 54480
$$ packed form
12055g3847Q6116Q649k9949Q377R809J6717M1248K444m249k125o2653m5850n3343
12042i8656M5515L5920N0494J1940k0420K8370P4300o7447p8615P553P974k4114
12030b7186M286K5313k3567j1503L1420j7523J9252K9638p2661m3371L153J7713
12018f5036k791J4894k996N8283l3985o1170j8331n9113n649J08736L9167j0804
12006c8795M009J7785K3068J4928l6675K8096M9415j0300k5099k4642l0255J9376
11994i089L7147m1556p1627P586J2632J1670R9937O9652k4458m7031j3909l901
11982B7053k819j1740J7664k4751k2404J0721n8639p5797J0317L0932O0322N6739
11970A7598k4773J3540j444J2992Q773l9881p9936O403N0831M6873L0699J2805
$$ plain form
11958 54480 23888 13284 -17230 -19029 -19228 -11039 -19100 -36288 -27484 -39063 -125521 -108246 -49273
11945 -49273 -18263 -38893 -46631 -64220 -25039 8522 -10078 -36036 39503 69089 48667 -9745
11933 -9745 -60198 -115565 -111951 -141730 -71086 -23934 30096 70516 55586 85175 75520 16306
11921 16306 16389 40018 -13252 -26808 18991 21681 15111 40376 38460 25080 30275 50623 26173
11908 26173 39857 44699 6091 3730 40833 90655 111443 84389 12128 -66737 -38481 -459
11896 -459 16342 26856 -11371 9076 82198 98041 99129 75735 82151 56242 6325 -26422
11884 -26422 -31923 13268 19440 6895 -17146 -17062 45845 75458 44686 -12474 -35071 -6901 12889
11871 12889 -4293 -29246 20593 -29779 -21039 28483 44006 41169 -31286 -52933 -51435 -48779
$$ packed form
11958E4480l0592j0604l0514j799j99Q189q061j7188Q804j1579q6458J7275N8973
11945d9273L1010k0630p738j7589L9181L3561j8600k5958P5539K9586k0422n8412
11933i745n0453n5367L614k9779P0644M7152N4030M0420j4930K9589r655n9214
11921A6306Q3K3629n3270j3556M5799K690o570K5265j916j3380N195K0348k4450
11908B6173J3684M842l8608k361L7103M9822K0788k7054p2261p8865K8256L8022
11896d59J6801J0514l8227K0447P3122J5843J088k3394O416k5909m9917l2747
11884b6422n501M5191O172j2545k4041Q4O2907K9613l0772n7160k2597K8170J9790
11871A2889j7182k4953M9839n0372Q740M9522J5523k837p2455k1647J498K656
$$ plain form
11859 -48779 -57575 -77397 -29633 -9150 11749 -20143 -13410 -81629 -33024 24078 21657 -19067
11847 -19067 6839 74243 79178 82613 90958 79451 53607 9429 -3716 11212 -8976 761
11835 761 -4686 22300 20394 -12203 -19693 -6361 -28160 9995 -7135 20099 67015 52932 40527
11822 40527 -16397 -15808 -83898 -114844 -161169 -158632 -78012 -38759 -57492 -33325 34410 49135
11810 49135 44634 12620 -72450 -78297 -59178 -93924 -96314 -46608 6842 17834 -11996 -25691
11798 -25691 10151 -2036 -34973 -28702 37087 94560 95053 111380 103631 37264 -13991 -4728 40174
11785 40174 49249 30029 39838 22418 -11718 8407 648 17212 8027 55236 91115 90631 59104
11772 59104 47892 14632 -2134 50094 11501 888 48863 42362 6503 23741 13470 32776
$$ packed form
11859d8779q796j9822M7764K0483K0899l1892O733o8219M8605N7102k421m0724
11847a9067K5906O7404M935L435Q345j1507k5844m4178j3145J4928k0188R737
11835G61n447K6986j906l2597p490J3332k1799L8155j7130K7234M6916j4083j2405
11822D0527n6924N89o8090l0946m6325K537Q0620L9253j8733K4167O7735J4725
11810D9135m501l2014q5070n847J9119l4746k390M9706N3450J0992k9830j3695
11798b5691L5842j2187l2937O271O5789N7473M93J6327p749o6367n1255R263M4902
11785D0174R075j9220R809j7420l4136K0125p759J6564r185M7209L5879m84l1527
11772E9104j1212l3260j6766N2228l8593j0613M7975o501l5859J7238j0271J9306
$$ plain form
11760 32776 49914 55036 113908 94982 65868 3622 1490 36788 -1738 -34559 -33255 -28028
11748 -28028 -50041 -38203 -19009 22972 3340 -48679 -39041 6088 8294 19946 49262 44857
11736 44857 20763 31338 29104 -1537 -21498 -80296 -46084 -23981 -9009 -13287 3924 21326
11724 21326 52377 -9919 -75699 -72525 -24341 -26014 -21418 -13457 -19385 -25678 16248 62742 44206
11711 44206 -29019 -107803 -139393 -122126 -106659 -85254 -53955 -47101 -65417 -51347 -50062 -37631
11699 -37631 -39078 -45635 9267 43238 14395 1131 -12840 -18720 3492 -42354 -20622 -23782
11687 -23782 -41217 -45157 -24095 7923 -43092 -70077 -60607 -20805 2740 51454 13179 4056
11675 4056 -37733 -45654 -943 -15325 -10820 25758 56066 56339 3397 -9441 -64293 -25582 -38377
$$ packed form
11760C2776J7138N122N8872j8926k9114o2246k132L5298l8526l2821J304N227
11748b8028k2013J1838J9194M1981j9632n2019R638M5129K206J1652K9316m405
11736D4857k4094J0575k234l0641j9961n8798L4212K2103J4972m278J7211J7402
11724B1326L1051o2296o5780L174M8184j673M596P961n928o293M1926M6494j8536
11711D4206p3225p8784l1590J7267J5467K1405L1299O854j8316J4070J285J2431
11699c7631j447o557N4902L3971k8843j3264j3971n880K2212m5846K1732l160
11687b3782j7435l940K1062L2018n1015k6985R470L9802K3545M8714l8275r123
11675D056m1789p921M4711j4382M505L6578L0308K73n2942j2838n4852L8711j2795
$$ plain form
11662 -38377 -40981 -22998 28373 894 -46696 -20699 17846 18330 20063 5573 37107 17653
11650 17653 -10589 11950 75503 150448 197987 136431 87381 40703 11425 -11138 -19811 30435
11638 30435 51827 11484 -10184 -35245 -52072 -74373 -72455 -47095 -28248 26897 50509 -7154
11626 -7154 -7928 -16930 -18704 22206 35432 1867 -17816 -34739 -4271 14567 16458 41447 38532
11613 38532 -3314 -45011 -86853 -147613 -165621 -133499 -123516 -83998 -64103 -38925 -81993 -25347
11601 -25347 -23777 -37322 -10597 16835 25954 54665 40913 16771 31713 -2438 -38548 -66973
11589 -66973 -121829 -128942 -100586 -66881 -30618 11971 -18694 -28467 -50828 -95077 -118441 -119499
11577 -119499 -103496 -118128 -102572 -109899 -47400 -15684 -25506 3937 30621 26441 8410 -43045
$$ packed form
11662c8377k604J7983N1371k7479m7590K5997L8545M84J733j4490L1534j9454
11650A7653k8242K2539O3553P4945M7539o1556m9050m6678k9278k2563q673N0246
11638C0435K1392m0343k1668k5061j6827k2301J918K5360J8847N5145K3612n7663
11626g154p74r002j774M0910J3226l3565j9683j6923L0468J8838J891K4989k915
11613C8532m1846m1697m1842o0760j8008L2122R983L9518J9895K5178m3068N6646
11601b5347J570j3545K6725K7432R119K8711j3752k4142J4942l4151l6110k8425
11589f6973n4856p113K8356L3705L6263M2589l0665r773k2361m4249k3364j058
11577a19499J6003j4632J5556p327O2499L1716r822K9443K6684m180j8031n1455
$$ plain form
11565 -43045 -61222 -31117 -38708 2794 63670 118542 42677 45506 82632 72795 67396 72758 24185
11552 24185 32207 -10037 -30374 -63529 -37233 -5517 -54840 -71658 -43112 -19591 -25425 -43867
11540 -43867 -30643 13967 47098 12909 -27725 -36361 -26968 -25956 20488 87775 72495 2029
11528 2029 66478 127279 61756 68259 38714 7058 -17756 -49115 -48226 -83210 -52702 -60403 -29695
11515 -29695 22594 1647 14158 1748 -5518 -68718 -28534 -12355 -52770 -18964 -30350 -47929
11503 -47929 -121264 -117399 -8246 -2336 -73397 -13097 71156 80553 33813 -15654 -6024 81780
11491 81780 79197 74589 131901 118007 51354 -11600 -68180 -68434 903 8456 7623 44418 6986
11478 6986 -38732 4737 49784 -22380 -28613 -19347 -11619 15440 -36343 -62744 -23600 45855
$$ packed form
11565d3045j8177L0105p591M1502O0876N4872p5865K829L7126r837n399N362m8573
11552B4185Q022m2244k0337l3155K6296L1716m9323j6818K8546K3521n834j8442
11540d3867J3224M4610L3131l4189m0634q636R393J012M6444O7287j5280p0466
11528B029O4449O0801o5523O503k9545l1656k4814l1359Q89l4984L0508p701L0708
11515b9695N2289k0947J2511j2410p266o3200M0184J6179m0415L3806j1386j7579
11503d7929p3335L865J09153N910p1061O0300Q4253R397m6740m9467R630Q7804
11491H1780k583m608N7312j3894o6653o2954n6580k54O9337P553q33L6795l7432
11478F986m5718M3469M5047p2164o233R266P728K7059n1783k6401L9144O9455
$$ plain form
11466 45855 45590 62199 41833 -52527 -64523 -33713 -40397 -51899 -74175 -58454 -21706 -69482
11454 -69482 -114123 -62802 28628 98241 82255 45420 312 -25911 -20135 -7403 41275 35318
11442 35318 37693 55136 34611 31523 36614 75836 112528 75717 44429 36698 75509 50410
11430 50410 22188 29383 62561 72589 46152 56044 -3031 -26457 -27441 -23543 -24227 -58296 -64755
11417 -64755 -4539 1313 59094 82290 91661 73046 99408 110790 65291 17897 11950 39728
11405 39728 4694 -17625 -55973 -17146 -7880 -39344 -75771 -39803 -29805 -14217 -24324 -27711
11393 -27711 -38759 11899 17648 -2507 -12144 31070 77846 90813 66525 -2048 -31655 -13258
11381 -13258 -42057 -7813 -21601 -5079 13778 33674 67206 97107 74010 68546 14451 10338
$$ packed form
11466D5855k65J6609k0366r4360j1996L0810o684j1502k2276J5721L6748m7776
11454f9482m4641N1321R1430O9613j5986l6835m5108k6223N776J2732M8678n957
11442C5318K375J7443k0525l088N091L9222L6692l6811l1288p731L8811k5099
11430E0410k8222P195L3178J0028k6437R892n9075k3426r84L898o84l4069o459
11417f4755O0216N852N7781K3196R371j8615K6362J1382m5499m7394n947K7778
11405C9728l5034k2319l8348L8827R266l1464l6427L5968R998J5588j0107l387
11393b7711j1048N0658N749k0155r637M3214M6776J2967k4288o8573k9607J8397
11381a3258k8799L4244j3788J6522J8857J9896L3532K9901k3097n464n4095m113
$$ plain form
11369 10338 23827 7352 -15656 -25140 -20230 67591 94110 63185 75305 35716 17169 74915
11357 74915 43582 -16861 -412 2861 -39496 -73236 -42702 -39941 -69650 -25394 415 -10835
11345 -10835 -36104 -46351 3988 3568 24297 -6577 -82569 -100687 -76330 -31848 29891 18766
11333 18766 -10155 -23180 -21143 -47652 -15817 6143 2881 33596 22400 23315 56407 40906
11321 40906 -43782 -170 52190 28577 41939 88563 81374 26967 29584 35073 82804 138465
11309 138465 140829 76925 -19248 -78872 -39923 13994 61534 158562 127560 106485 172170 184556
11297 184556 167498 145936 125883 6921 -34075 -61971 -60576 -10440 72069 77689 90136 114388
11285 114388 46136 -1697 39845 28927 37429 82510 124855 83217 22573 -5650 -8396 -4780
$$ packed form
11369A0338J3489j6475k3008r484M910Q7821K6519l0925J2120l9589j8547N7746
11357G4915l1333o0443J6449L273m2357l3740L0534K761k9709M4256K5809j1250
11345a0835k5269j0247N0339m20K0729l0874p5992j8118K4357M4482O1739j1125
11333A8766k8921j3025K037k6509L1835K1960l262L0715j1196R15L3092j5501
11321D0906q4688M3612N2360k3613J3362M6624p189n4407K617N489M7731N5661
11309A38465K364o3904r6173n9624L8949N3917M7540R7028l1002k1075O5685J2386
11297A84556j7058k1562k0053j18962m0996k7896J395N0136Q2509N620J2447K4252
11285A14388o8252m7833M1542j0918Q502M5081M2345m1638o0644k8223k746L616
$$ plain form
11273 -4780 7982 11765 2992 -21573 -7388 16493 -18061 -2238 -1251 -6282 9679 -24627 -26967
11260 -26967 36472 85781 96875 63336 54927 85096 80674 32346 2987 16643 29306 19400
11248 19400 -48082 -96421 -97538 -82077 -66051 -62757 -73848 -54567 -56204 -84466 -39465 -60632
11236 -60632 -46090 -49291 -72650 -79926 -15310 -12176 -72042 -41431 -38101 -49344 19773 61329
11224 61329 85834 82209 73535 79842 55214 52224 31857 -10774 -890 25186 52484 46957 16074
11211 16074 53283 18779 -30325 -3931 60039 78339 111280 100791 66104 46075 13535 56137
11199 56137 85309 73423 99594 89148 66961 67640 75331 100271 136672 97006 33345 41483
11187 41483 11786 -11721 66861 75629 34197 -5799 -11432 -13551 -2806 20892 62061 87811
$$ packed form
11273d780J2762L783q773k4565J4185K3881l4554J5823R87n031J5961l4306k340
11260b6967O3439M9309J1094l3539q409L0169m422m8328k9359J3656J2663r906
11248A9400o7482m8339j117J5461J6026L294j1091J9281j637k8262M5001k1167
11236f0632J4542l201k3359p276O4616L134n9866L0611L330j1243O9117M1556
11224F1329K4505l625q674O307k4628k990k0367m2631R884K6076K7298n527l0883
11211A6074L7209l4504m9104K6394O3970J8300L2941j0489l4687k0029l2540M2602
11199E6137K9172j1886K6171j0446k2187O79P691K4940L6401l9666o3661Q138
11187D1483k9697k3507P8582Q768m1432l9996n633k119J0745K3698M1169K5750
$$ plain form
11175 87811 78676 94260 90332 23590 30831 94464 84544 41615 53845 64105 72055 74684 53768
11162 53768 33084 19684 -13973 24881 86643 67609 56147 9052 5390 -1647 10514 -47508
11150 -47508 -55209 -53666 -27281 -30177 -16276 -24158 -53804 -50539 -10791 12026 -5683 -54698 -70914
11137 -70914 -74093 -100606 -66642 15809 63957 89198 76168 -20969 -52660 -89582 -103996 -21754
11125 -21754 37112 13364 -12247 897 -13088 -82813 -144929 -59429 -6528 11505 28857 5784
11113 5784 -49605 -58331 -16953 48084 82804 50035 15966 46233 -26602 -47266 20358 69163
11101 69163 59060 113416 131079 48278 13821 68096 85482 113234 103924 122864 83144 27567
11089 27567 80125 137385 179393 159739 132291 75934 76230 24308 -48722 -25115 -20509 -24575
$$ packed form
11175H7811r135J5584l928o6742P241O3633r920m2929J2230J0260P950K629k0916
11162E3768k0684j3400l3657L8854O1762j9034j1462m7095l662p037J2161n8022
11150d7508p701J543K6385k896J3901p882k9646L265L9748K2817j7709m9015j6216
11137g0914l179k6513L3964Q2451M8148K5241j3030r7137l1691l6922j4414Q2242
11125b1754N8866k3748k5611J3144j3985o9725o2116Q5500N2901J8033J7352k3073
11113E784n5389q726M1378O5037L4720l2769l4069L0267p2835k0664O7624M8805
11101F9163j0103N4356J7663q2801l4457N4275J7386K7752r310J8940l9720n5577
11089B7567N2558N7260M2008j9654k7448n6357K96n1922p3030K3607M606m066
$$ plain form
11077 -24575 47994 161395 166027 134635 104542 54974 85641 171252 173516 189784 222887 270157
11065 270157 328712 341856 363547 367882 314993 295016 285914 315384 298834 245697 198678 189053
11053 189053 127151 67151 99940 127727 158402 216326 254537 226487 170667 143848 149817 216000
11041 216000 235665 335885 429160 488060 557935 658690 766268 801510 756014 671361 572648
11030 572648 503311 470722 430643 306334 211283 189946 213144 198691 157357 111011 135167
11019 135167 157699 144174 100034 58545 55462 124711 140418 175620 197833 196700 174138 152172
11007 152172 164217 187727 175445 166461 179425 202011 237399 326418 421577 527367 682536
10996 682536 720958 658095 575484 515846 402712 319655 292539 287351 309992 326881 316613
$$ packed form
11077b4575P2569J13401M632l1392l0093m9568L0667Q5611K264J6268L3103M7270
11065B70157N8555J3144K1691M335n2889j9977r102K9470j6550n3137m7019r625
11053A89053o1902o0000L2789K7787L0675N7924L8211k8050n5820k6819N969O6183
11041B16000J9665J00220R3275N8900O9875J00755J07578L5242m5496q4653r8713
11030E72648o9337l2589m0079j24309r5051k1337K3198j4453m1334m6346K4156
11019A35167K2532j3525m4140m1489l083O9249J5707L5202K2213j133k2562k1966
11007A52172J2045K3510j2282q984J2964K2586L5388Q9019R5159J05790J55169
10996F82536L8422o2863q2611n9638j13134q3057k7116n188K2641J6889j0268
$$ plain form
10985 316613 294606 282683 247679 232014 226073 189333 212738 253083 216518 256315 286210 337364
10973 337364 442843 582950 727900 1008891 1397617 1909545 2545502 3009747 2959491 2397055
10963 2397055 1795612 1300975 902704 669977 512789 477890 464150 383797 320179 203716
10953 203716 163723 177078 202773 213785 177304 145980 144566 130038 162775 158383 147094 113118
10941 113118 149006 146299 81906 68439 101807 151833 135690 99123 115280 172264 176183 138828
10929 138828 81329 45316 6954 -1421 27518 77041 51362 86200 144080 133892 73642 49767
10917 49767 -15769 -1391 20722 42278 84189 102287 50489 25090 -2766 -10828 33438 94965
10905 94965 177479 244429 317810 383581 458571 483028 427465 374584 332986 264864 242008 262252
$$ packed form
10985C16613k2007j1923l5004j5665n941l6740K3405M0345l6565L9797K9895N1154
10973C37364J05479J40107J44950K80991L88726N11928O35957M64245n0256n62436
10963B397055o01443m94637l98271k32727j57188l4899j3740q0353o3618j16463
10953B03716l9993J3355K5695J1012l6481l1324j414j4528L2737m392j1289l3976
10941A13118L5888k707o4393j3467L3368N0026j6143l6567J6157N6984L919l7355
10929A38828n7499l6013l8362q375K8939M9523k5679L4838N7880j0188o0250k3875
10917D9767o5536J4378K2113K1556M1911J8098n1798k5399k7856q062M4266O1527
10905I4965Q2514O6950P3381O5771P4990K4457n5563n2881m1598o8122k2856K0244
$$ plain form
10893 262252 288559 296108 282142 256558 211974 165409 115705 105446 122157 141534 179190 121147
10881 121147 93364 88308 62077 54906 61001 66204 130975 112313 98399 49484 34356 96109
10869 96109 100601 118640 69598 81679 90933 117045 145961 180947 142034 112819 73956 52211
10857 52211 53351 52244 58885 64538 58484 44263 23470 25717 24398 64608 119826 129801 163109
10844 163109 140134 164810 194726 214950 158040 59331 56559 76106 94411 54310 117400 141864
10832 141864 144313 134125 96873 47299 92278 160190 157557 153758 145056 154127 195976 185830
10820 185830 131812 134060 111433 64938 22793 45665 81011 102429 104859 80767 144092 237724
10808 237724 274561 265161 320820 338682 331515 341316 392975 427931 390898 344373 430350 453461
$$ packed form
10893B62252K6307P549j3966k5584m4584m6565m9704j0259J6711J9377L7656n8043
10881A21147k7783n056k6231p171O095N203O4771j8662j3914m8915j5128O1753
10869I6109M492J8039m9042J2081R254K6112K8916L4986l8913k9215l8863k1745
10857E2211J140j107O641N653o054j4221k0793K247j319M0210N5218R975L3308
10844A63109k2975K4676K9916K0224n6910r8709k772J9547J8305m0101O3090K4464
10832A41864K449j0188l7252m9574M4979O7912k633l799q702R071M1849j0146
10820A85830n4018K248k2627m6495m2145K2872L5346K1418K430k4092O3325R3632
10808B37724L6837r400N5659J7862p167R801N1659L4956l7033m6525Q5977K3111
$$ plain form
10796 453461 408451 290448 217702 217108 202812 216126 216000 171724 191425 177015 161551 171708
10784 171708 190455 275422 290785 245986 207364 227346 293984 260890 227797 249497 245464 275419
10772 275419 282318 250349 223999 169764 122221 116902 70958 79742 103213 184284 271315 286799
10760 286799 194084 178578 149110 151942 154077 169595 149055 96895 120453 155551 179784 193010
10748 193010 169666 102152 110304 121028 102867 151068 157282 170713 209409 338666 317569 250521
10736 250521 139427 99138 60260 52662 67949 14432 24241 159676 207639 236058 230697 180828
10724 180828 206887 219357 202663 183286 151243 128109 104589 117166 102493 161688 145771
10713 145771 112062 148843 182173 199052 171606 135978 170034 213479 212701 238680 273230 291931
$$ packed form
10796D53461m5010j18003p2746n94j4296J3314j26m4276J9701j4410j5464J0157
10784A71708J8747Q4967J5363m4799l8622J9982O6638l3094l3093K1700m033K9955
10772B75419O899l1969k6350n4235m7543n319m5944Q784K3471Q1071Q7031J5484
10760B86799r2715j5506k9468K832K135J5518k0540n2160K3558L5098K4233J3226
10748A93010k3344o7514Q152J0724j8161M8201O214J3431L8696J29257k1097o7048
10736B50521j11094m0289l8878p598J5287n3517R809J35435M7963K8419n361m9869
10724A80828K6059J2470j6694j9377l2043k3134k3520J2577j4673N9195j5917
10713A45771l3709L6781L3330J6879k7446l5628L4056M3445p78K5979L4550J8701
$$ plain form
10701 291931 209715 129221 86407 46474 35187 -1719 19949 115842 194459 246737 273879
10690 273879 295637 273535 184305 148697 186451 233948 205645 193739 209983 269504 332657
10679 332657 352796 357909 424920 563768 761256 1161575 1534102 1654050 1584722 1321265
10669 1321265 1066988 893570 720617 618671 640665 597445 536305 515478 474227 475708 523010
10658 523010 504780 529844 541893 558608 561719 632639 622368 615865 658041 708859 717121 703237
10646 703237 639102 641142 670910 616529 643078 660936 653000 633657 643064 680780 670416 699997
10634 699997 738271 723626 717116 704619 636103 645316 648759 673876 767921 874873 886143 951605
10622 951605 1028547 1079348 1100674 1085717 1105413 1093376 1071239 1109467 1095974 1118711 1105825
$$ packed form
10701B91931q2216q0494m2814l9933j1287l6906K1668R5893P8617N2278K7142
10690B73879K1758k2102q9230l5608L7754M7497k8303j1906J6244N9521O3153
10679C32657K0139N113O7011J38848J97488M00319L72527J19948o9328k63457
10669A321265k54277j73418j72953j01946K1994m3220o1140k0827m1251J481M7302
10658E23010j8230K5064J2049J6715L111P0920j0271o503M2176N0818Q262j3884
10646G03237o4135K040K9768n4381K6549J7858p936j9343R407L7716j0364K9581
10634F99997L8274j4645o510j2497o8516R213L443K5117R4045J06952J1270O5462
10622I51605P6942N0801K1326j4957J9696j2037k2137L8228j3493K2737j2886
$$ plain form
10611 1105825 1108221 1158813 1168141 1133218 1203008 1268523 1308984 1388758 1461567 1483956 1599552
10600 1599552 1661044 1720691 1721309 1677856 1705279 1723008 1742182 1791774 1854766 1867128 1956213 2142891
10588 2142891 2294312 2409198 2512884 2608446 2716690 2886156 3141374 3422118 3669948 3970487
10578 3970487 4211404 4535973 4764474 5038806 5329355 5717702 6202916 6701721 7290219
10569 7290219 8011262 9012649 10200139 11690721 13321773 14778558 15913873 17056308
10561 17056308 18624936 20790014 23605944 27254842 32136484 38810224 48275271 61922443
10553 61922443 82329630 113984971 164430629 244500661 361951591 497835633 581592163
10546 581592163 548132080 426191944 296901435 201704120 139510770 99548482 73532533
$$ packed form
10611A105825K396N0592R328l4923O9790O5515M0461P9774P2809K2389J15596
10600A599552O1492N9647O18m3453K7423J7729J9174M9592O2992J2362Q9085J86678
10588B142891J51421J14886J03686R5562J08244J69466K55218K80744K47830L00539
10578C970487K40917L24569K28501K74332K90549L88347M85214M98805N88498
10569G290219P21043J001387J187490J490582J631052J456785J135315J142435
10561A7056308J568628K165078K815930L648898M881642O673740R465047J3647172
10553F1922443K0407187L1655341N0445658Q0070032J17450930J35884042Q3756530
10546E81592163l3460083j21940136j29290509r5197315o2193350l9962288k6015949
$$ plain form
10539 73532533 56097374 43985252 35206332 28688792 23830172 20171537 17471905 15692377
10531 15692377 14504249 13637412 12715538 11440335 9931303 8509167 7389748 6504087
10523 6504087 5729608 5108919 4518662 4082878 3717394 3360376 3064084 2802467 2642953
10514 2642953 2511159 2422565 2374985 2250414 2129871 2039582 2005377 1919343 1810362 1753931
10504 1753931 1707215 1589724 1475925 1375639 1284182 1208621 1180322 1107290 1012346 916762 833816
10493 833816 829463 863267 840952 852641 910351 908256 980997 1064972 1240298 1460597 1672273
10482 1672273 1944028 2370652 3030127 3575399 3675122 3283210 2611596 2017284 1576090 1293585
10472 1293585 1055097 902430 773181 688033 582556 570155 635167 648880 608428 585809
$$ packed form
10539G3532533j7435159j2112122q778920o517540m858620l658635k699632j779528
10531A5692377j188128q66837r21874j275203j509032j422136j119419q85661
10523F504087p74479o20689n90257m35784l65484l57018k96292k61617j59514
10514B642953j31794q8594m7580j24571j20543r0289l4205q6034j08981n6431
10504A753931m6716j17491j13799j00286r1457p5561k8299p3032r4944r5584q2946
10493H33816m353L3804k2315J1689N7710k095P2741Q3975J75326K20299K11676
10482A672273K71755M26624O59475N45272R9723l91912o71614n94312m41194k82505
10472A293585k38488j52667j29249q5148j05477j2401O5012J3713m0452k2619
$$ plain form
10462 585809 524346 386597 342101 283651 249476 264998 269769 264477 215741 177526 195559 166182
10450 166182 143210 75810 48910 77199 123503 151293 149727 109915 84323 119139 94638 86513
10438 86513 52280 67830 139449 166724 159756 98753 63513 40564 -5342 -22448 -19413 -36200
10426 -36200 -60460 -59494 -69265 310 76313 93963 99667 45751 24379 58487 76617 143634
10414 143634 133054 77134 40879 27626 34160 26172 11118 54143 114255 137320 107478 73528
10402 73528 51175 76813 49815 69603 177934 236920 252791 217565 202558 172601 149515
10391 149515 143417 162751 185479 121866 95845 63920 97247 131027 113124 81971 56313 -6865
10379 -6865 44447 113541 109974 149129 170920 183209 235751 249225 234582 259880 362382 538619
$$ packed form
10462E85809o1463j37749m4496n8450l4175J5522M771n292m8736l8215J8033k9377
10450A66182k2972o7400k6900K8289M6304K7790j566l9812k5592L4816k4501q125
10438H6513l4233J5550P1619K7275o968o1003l5240k2949m5906j7106L035j6787
10426c6200k4260R66r771O9575P6003J7650N704n3916k1372L4108J8130O7017
10414A43634j0580n5920l6255j3253O534p988j5054M3025O0112K3065k9842l3950
10402G3528k2353K5638k6998J9788J08331N8986J5871l5226j5007k9957k3086
10391A49515o098J9334K2728o3613k6021l1925L3327L3780j7903l1153k5658o3178
10379f865N1312O9094l567L9155K1791J2289N2542J3474j4643K5298J02502J76237
$$ plain form
10367 538619 689881 831237 952040 1090182 1090565 996852 893075 790400 637605 509635
10357 509635 432595 394256 348132 314954 324629 277900 190375 170444 198707 143569 71121 20409
10345 20409 -21357 -16568 -11591 -17467 -72512 -109410 -49527 -17334 18799 5231 -50742 -86962
10333 -86962 4813 19853 45909 50413 39637 76281 95990 144684 101482 69390 39714 -5913
10321 -5913 8351 -22308 -14183 -16081 -58893 -75896 -89255 -51516 -50275 -69402 -65890 24911 27585
10308 27585 45917 43265 15168 55751 86019 94884 81737 30396 55275 107332 72480 75801
10296 75801 79291 97046 69128 70025 54444 9159 -23944 -56267 -76595 -80107 -80169 -32878 5226
10283 5226 -7522 -10418 -7529 -16025 2000 26235 30084 -19465 -8653 -7630 12171 -26523 -25525
$$ packed form
10367E38619J51262J41356J20803J38142L83r3713j03777j02675j52795j27970
10357E09635p7040l8339m6124l3178R675m6729q7525j9931K8263n5138p2448n0712
10345B0409m1766M789M977n876n5045l6898N9883L2193L6133j3568n5973l6220
10333h6962R1775J5040K6056M504j0776L6644J9709M8694m3202l2092k9676m5627
10321e913J4264l0659Q125j898m2812j7003j3359L7739J241j9127L512R0801K674
10308B7585J8332k652k8097M0583L0268Q865j3147n1341K4879N2057l4852L321
10296G5801L490J7755k7918Q97j5581m5285l3103l2323k0328l512o2M7291L8104
10283E226j2748k896K889q496J8025K4235L849m9549J0812J023J9801l8694R98
$$ plain form
10270 -25525 29826 -2340 -21375 -46414 -58510 -92461 -97716 -145816 -125160 -54345 17615 38941
10258 38941 28170 56255 83351 90740 59766 112222 164285 122041 156726 183151 177662 166638
10246 166638 197483 272003 279753 353272 377171 306403 200389 109990 36788 2931 -44793
10235 -44793 -15853 -14800 -75904 -24380 48707 76763 157965 156784 92498 92285 113789 129387
10223 129387 138365 191664 200663 152866 135520 87313 93245 81205 23097 18868 67040 96926
10211 96926 52486 24517 19016 86387 101498 21707 16124 29631 50837 74126 50482 -1131
10199 -1131 13452 35103 56718 23254 12148 31869 36058 30990 22894 -12692 -84991 -121511
10187 -121511 -44063 -38522 -79724 -26432 26261 20141 11909 -18121 -6604 9881 42504 72463
$$ packed form
10270b5525N5351l2166j9035k5039j2096l3951n255m8100K0656P0815P1960K1326
10258C8941j0771K8085K7096P389l0974N2456N2063m2244L4685K6425n489j1024
10246A66638L0845P4520P750P3519K3899p0768j06014r0399p3202l3857m7724
10235d4793K8940J053o1104N1524P3087K8056Q1202j181o4286k13K1504J5598
10223A29387Q978N3299Q999m7797j7346m8207N932j2040n8108m229M8172K9886
10211I6926m4440k7969n501O7371J5111p9791n583J3507K1206K3289k3644n1613
10199a131J4583K1651K1615l3464j1106J9721M189n068q096l5586p2299l6520
10187a21511P7448N541m1202N3292N2693o120q232l0030J1517J6485L2623K9959
$$ plain form
10175 72463 88924 89577 65049 49355 70807 103689 93485 132864 121843 116242 71569 62134
10163 62134 65283 98576 122479 27054 -63339 -23978 23281 28316 32383 -14592 -1674 47113
10151 47113 74632 63966 82000 87126 111423 84943 72075 2745 8162 12505 79097 174843
10139 174843 101267 75934 122485 161801 205144 267216 325175 329509 358542 428807 501866 619217
10127 619217 779885 1017681 1390188 2009069 2683210 3153486 3112890 2630011 2077068 1649753
10117 1649753 1357783 1243239 1163243 1128998 1100976 1203948 1360661 1539560 1768175 2111432
10107 2111432 2514083 3004061 3527218 4089942 4716006 5224710 5543836 5551432 5204017 4652740
10097 4652740 4071812 3457056 2901077 2418296 2060320 1693679 1380704 1255299 1151946
$$ packed form
10175G2463J6461O53k4528j5694K1452L2882j0204L9379j1021n601m4673r435
10163F2134L149L3293K3903r5425r0393L9361M7259N035M067m6975J2918M8787
10151D7113K7519j0666J8034N126K4297k6480j2868o9330N417M343O6592R5746
10139A74843p3576k5333M6551L9316M3343O2072N7959M334K9033P0265P3059J17351
10127F19217J60668K37796L72507O18881O74141M70276m0596m82879n52943m27315
10117A649753k91970j14544p9996l4245k8022J02972J56713J78899K28615L43257
10107B111432M02651M89978N23157N62724O26064N08704L19126P596l47415n51277
10097D652740n80928o14756n55979m82781l57976l66641l12975j25405j03353
$$ plain form
10088 1151946 1034395 978735 845724 735445 629399 517939 525684 507454 455479 442398
10078 442398 417077 363257 327639 360359 339388 272880 248958 226657 265987 334321 264960
10067 264960 177936 151199 101968 105240 153057 193585 219836 268691 261942 254266 287010 313675
10055 313675 355884 372325 317699 267882 298562 438516 601999 711824 784054 912779 979835
10044 979835 882436 886811 1006234 1203884 1500121 1935316 2443660 3011559 3667357 4076888
10034 4076888 4035831 3554512 2905743 2274564 1719215 1348306 1102216 882997 707757 665405
10024 665405 587370 461227 410470 383539 320856 252910 169851 170109 185348 219980 175005 141132
10012 141132 167243 151696 85502 62844 54588 38091 38344 40940 70773 86186 64708 61151
$$ packed form
10088A151946j17551n5660j33011j10279j06046j11460P745j8230n1975j3081
10078D42398k5321n3820l5618L2720k0971o6508k3922k2301L9330O8334o9361
10067B64960q7024k6737m9231L272M7817M0528K6251M8855o749p676L2744K6665
10055C13675M2209J6441n4626m9817L0680J39954J63483J09825P2230J28725O7056
10044I79835r7399M375J19423J97650K96237M35195N08344N67899O55798M09531
10034D076888m1057m81319o48769o31179n55349l70909k46090k19219j75240m2352
10024F65405p8035j26143n0757k6931o2683o7946q3059K58J5239L4632m4975l3873
10012A41132K6111j5547o6194k2658q256j6497K53K596K9833J5413k1478l557
$$ plain form
10000 61151 25887 19157 36034 69834 95005 58283 35887 -23222 -60159 -46446 -16117 -41249
9988 -41249 -1297 -29590 -52612 -29161 28305 73540 92968 80973 42105 15169 24620 31216
9976 31216 46213 56980 54363 15289 8987 -31395 -92208 -100321 -73221 -100429 -141233 -168399
9964 -168399 -136578 -69997 -44562 -93107 -84081 -102771 -62961 -55605 -69194 -79352 -75934 -71764
9952 -71764 -56362 -68589 -86253 -71021 -24107 43377 18573 -8080 13584 8587 -18918 -65431
9940 -65431 -92838 -69759 -92880 -146422 -132006 -113594 -105466 -88194 -41036 -4 -9723 9343
9928 9343 31558 54200 32529 -944 -62871 -106895 -114223 -119466 -63198 13691 835 -8787 51437
9915 51437 4481 7646 39922 59166 1574 20893 8415 -24979 28726 63016 28116 52664
$$ packed form
10000F1151l5264o730J6877L3800K5171l6722k2396n9109l6937J3713L0329k5132
9988d1249L9952k8293k3022K3451N7466M5235J9428j1995l8868k6936R451O596
9976C1216J4997J0767k617l9074o302m0382o0813q113K7100k7208m0804k7166
9964a68399L1821O6581K5435m8545R026j8690L9810P356j3589j0158L418M170
9952g1764J5402j2227j7664J5232M6914O7484k4804k6653K1664m997k7505m6513
9940f5431k7407K3079k3121n3542J4416J8412Q128J7272M7158M1032r719J9066
9928I343K2215K2642k1671l3473o1927m4024p328n243N6268P6889j2856r622O0224
9915E1437m6956L165L2276J9244n7592J9319j2478l3394N3705L4290l4900K4548
$$ plain form
9903 52664 108096 55290 12397 45779 56161 15075 -21840 -38551 -45304 -20275 46077 77339
9891 77339 24054 54292 78767 29531 9103 49148 -5400 -65938 -93099 842 48479 17733
9879 17733 25744 4951 -5578 -15989 17637 21490 31913 19119 58767 74500 69237 129280
9867 129280 145038 95558 108094 89023 60386 13091 47490 104321 183190 226307 222862 200442
9855 200442 272670 344022 366276 565099 843238 1311972 2192580 3303046 4094788 4022817
9845 4022817 3191433 2120980 1311431 870675 567288 451482 330281 292987 222664 124443
9835 124443 95323 132607 149318 100213 114578 119717 74146 45947 41468 36873 -5091 13044
9823 13044 -23929 -53969 -28666 -30581 -56818 -1041 -50688 -43649 -41436 -31180 -39706 -80514 -28616
$$ packed form
9903E2664N5432n2806m2893L3382J0382m1086l6915j6711o753K5029O6352L1262
9891G7339n3285L0238K4475m9236k0428M0045n4548o0538k7161R3941M7637l0746
9879A7733Q011k0793j0529j0411L3626L853J0423j2794L9648J5733n263O0043
9867A29280J5758m9480J2536j9071k8637m7295L4399N6831P8869M3117l445k2420
9855B00442P2228P1352K2254J98823K78139M68734Q80608J110466P91742p1971
9845D022817q31384j070453q09549m40756l03387j15806j21201l7294p0323r8221
9835A24443k9120L7284J6711m9105J4365N139m5571k8199m479m595m1964J8135
9823A3044l6973l0040K5303j915k6237N5777m9647P039K213J0256q526m0808N1898
$$ plain form
9810 -28616 66711 52223 3211 -7132 -55919 -60647 -19056 50176 60389 -17829 -26928 38078
9798 38078 30422 51391 28351 -36662 -23760 18213 -441 -5273 -20927 -103284 -126649 -133913
9786 -133913 -128985 -100648 -74777 -48231 -10912 10840 -43217 -15323 1668 19468 21854 -30980
9774 -30980 -72683 -80427 -68587 -69575 -115737 -122123 -81867 -69015 -75550 -98798 -99727 -104880 -88089
9761 -88089 -60432 -39275 -52819 -27417 -15690 -59730 -38131 54176 41277 -5591 -38438 -40112
9749 -40112 -7130 25343 102457 111860 60312 57952 115195 252172 312697 362897 422753 452079
9737 452079 534469 492335 441056 399503 311482 283353 185681 84871 91542 82479 65869 43150
9725 43150 -1158 67925 46087 -5373 33993 31104 10380 14628 55507 115008 10053 -33461
$$ packed form
9810b8616R5327j4488m9012j0343m8787m728M1591O9232J0213p8218r099O5006
9798C8078p656K0969k3040o5013J2902M1973j8654m832j5654q2357k3365p264
9786a33913M928K8337K5871K6546L7319K1752n4057K7894J6991J7800K386n2834
9774c0980m1703p744J1840r88m6162o386M0256J2852o535k3248r29n153J6791
9761h8089K7657K1157j3544K5402J1727m4040K1599R2307j2899m6868l2847j674
9749d0112L2982L2473P7114R403n1548k360N7243J36977O0525N0200N9856K9326
9737D52079Q2390m2134n1279m1553q8021k8129r7672j00810O671r063j6610k2719
9725D3150m4308O9083k1838n1460L9366k889k0724M248M0879N9501j04955m3514
$$ plain form
9713 -33461 1009 -6095 15172 19716 -24164 -29700 -11927 2603 50637 77746 76110 88128 44612
9700 44612 -23711 33487 73891 83979 81935 80672 130800 72732 92994 84913 44735 43945 77767
9687 77767 124701 108749 97011 100277 16132 19982 11694 16816 50962 94180 85082 62818 69377
9674 69377 72620 62163 92968 83964 15783 -4618 36886 63782 71057 87823 55833 51840 15797
9661 15797 48680 54200 34849 48242 41328 42931 49280 26995 29382 -5925 -47016 8627 57995
9648 57995 60821 26733 -36269 -27883 9986 -11 -42127 -44343 3563 35831 11262 5633 35409
9635 35409 -4238 -42949 -87036 -104845 -55955 9827 42543 62707 43241 19650 -15172 -5732
9623 -5732 19785 -9078 -34218 -56611 -43378 -76014 -70105 14899 67035 17195 25106 35701
$$ packed form
9713c3461L4470p104K1267M544m3880n536J7773J4530M8034K7109j636J2018m3516
9700D4612o8323N7198M0404J0088k044j263N0128n8068K0262q081m0178p90L3822
9687G7767M6934j5952j1738L266q4145L850q288N122L4146M3218r098k2264O559
9674F9377L243j0457L0805r004o8181k0401M1504K6896P275J6766l1990l993l6043
9661A5797L2883N520j9351J3393o914J603O349k2285K387l5307m1091N5643M9368
9648E7995K826l4088o3002Q386L7869r997m2116k216M7906L2268k4569n629K9776
9635C5409l9647l8711m4087j7809M8890O5782L2716K0164j9466k3591l4822R440
9623e732K5517k8863k5140k2393J3233l2636N909Q5004N2136m9840P911J0595
$$ plain form
9611 35701 18740 26279 19600 -34874 -45205 -15867 -19396 -1157 -26320 -61426 -64884 -21632 -17284
9598 -17284 29051 96172 87963 127132 202504 217063 109100 63552 38913 -96 995 -4249
9586 -4249 -27015 -37428 -21310 17008 -19583 -54486 -32842 -56128 -90707 -49554 20090 55474
9574 55474 58631 35898 20996 63339 60080 34480 69677 55709 36781 31500 40078 44028 17726
9561 17726 -37528 -46726 4087 37032 61586 95074 107754 77773 51591 44987 79079 68337
9549 68337 45650 52883 12618 -1927 -17022 35913 108171 128943 75070 21062 9509 18416
9537 18416 13434 42742 61174 87653 81805 113724 119186 150006 105679 43983 3995 21006
9525 21006 -16096 -16486 20990 8028 -6450 -24790 -64200 -74687 -82278 -73430 -15684 3900 -33846
$$ packed form
9611C5701j6961P539o679n4474j0331K9338l529J8239k5163l5106l458M3252M348
9598a7284M6335O7121q209L9169P5372J4559j07963m5548k4639l9009J091n244
9586d249k2766j0413J6118L8318l6591l4903K1644k3286l4579M1153O9644L5384
9574E5474L157k2733j4902M2343l259k5600L5197j3968j8928n281Q578L950k6302
9561A7726n5254r198N0813L2945K4554L3488J2680k9981k6182o604L4092j0742
9549F8337k2687P233m0265j4545j5095N2935P2258K0772n3873n4008j1553Q907
9537A8416m982K9308J8432K6479n848L1919N462L0820m4327o1696l9988J7011
9525B1006l7102l90L7476j2962j4478j8340l9410j0487p591Q848N7746J9584l7746
$$ plain form
9512 -33846 15948 8346 -8969 -6047 48901 81485 108688 92687 27189 50938 106687 105902 61425
9499 61425 78600 141960 114813 95415 78689 69466 38274 -9767 -39175 -37117 -32081 -17666
9487 -17666 27910 37635 34883 25827 47390 64733 53679 39851 60917 32239 25200 -26529 23388
9474 23388 27174 -1867 -56796 -29434 16967 15221 62644 41546 -18301 -15856 37029 22955
9462 22955 26539 -14823 -54102 -37008 -50041 -26316 13065 -40791 -70320 -76705 -88235 -1627
9450 -1627 -2326 -33611 -15230 -3466 18170 4852 22338 95546 115692 111013 20991 22793 -2464
9437 -2464 16447 50608 -20249 -57613 -6888 11750 2686 2815 12702 31701 12221 -13385 6639
9424 6639 -423 39100 48455 32593 13587 27803 23759 -15707 -39749 -21915 24296 56474 99289
$$ packed form
9512c3846M9794p602j7315K922N4948L2584K7203j6001o5498K3749N5749p85m4477
9499F1425J7175O3360k7147j9398j6726r223l1192m8041k9408K058N036J4415
9487a7666M5576R725k752r056K1563J7343j1054j3828K1066k8678p039n1729M9917
9474B3388L786k9041n4929K7362M6401j746M7423k1098n9847K445N2885j4074
9462B2955L584m1362l9279J7094j3033K3725L9381n3856k9529o385j1530Q6608
9450a627o99l1285J8381J1764K1636j3318J7486P3208K0146m679r0022J802k5257
9437b464J8911L4161p0857l7364N0725J8638r064J29R887J8999j9480k5606K0024
9424F639p062L9523R355j5862j9006J4216m044l9466k4042J7834M6211L2178M2815
$$ plain form
9411 99289 100725 113730 104849 91137 101773 148442 121717 90700 87454 77745 67212 75872 44591
9398 44591 53756 84115 83748 78539 105218 102476 59211 11464 60391 119392 159998 168389 186975
9385 186975 166244 161043 176474 147295 79024 42109 54546 49209 7816 -20731 -1844 78256
9373 78256 183792 198436 145809 122539 128233 87371 108984 86201 58378 49546 48973 41103 69718
9360 69718 101699 38581 52877 69911 78171 83212 67263 35391 90715 123078 71035 64205
9348 64205 88226 96497 138538 165326 146695 125424 114383 125848 55343 62880 69139 68778 19000
9335 19000 51687 87050 165145 183512 184508 173713 135081 103051 2622 -12639 45455 65772
9323 65772 94611 21480 6622 17780 -2553 25568 120915 184189 198219 126278 96730 81190
$$ packed form
9411I9289J436J3005q881j3712J0636M6669k6725l1017l246r709j0533Q660l1281
9398D4591R165L0359l67n209K6679k742m3265m7747M8927N9001M0606Q391J8586
9385A86975k0731n201J5431k9179o8271l6915J2437n337m1393k8547J8887Q0100
9373G8256J05536J4644n2627k3270N694m0862K1613k2783k7823q832n73p870K8615
9360F9718L1981o3118J4296J7034Q260N041j5949l1872N5324L2363n2043o830
9348F4205K4021Q271M2041K6788j8631k1271j1041J1465p0505P537O259l61m9778
9335A9000L2687L5363P8095J8367R96j0795l8632l2030j00429j5261N8094K0317
9323F5772K8839p3131j4858J1158k0333K8121R5347O3274J4030p1941k9548j5540
$$ plain form
9311 81190 38073 47143 88996 109798 149131 151323 126723 116232 75228 65652 112099 124786
9299 124786 87711 73938 89413 144462 187812 184495 186111 120653 88780 58662 -10926 -855
9287 -855 44787 31898 45892 100779 70942 122323 143088 135914 125372 136259 55498 39379
9275 39379 84738 100227 131510 171904 205970 228053 194802 128722 110253 83014 33452 67597
9263 67597 130748 153253 180669 173462 130796 103846 133238 150823 147294 177111 174574 174927 148307
9250 148307 157444 124957 73594 80011 115974 186662 191309 172396 179782 200883 139748 151031
9238 151031 142620 114799 96074 120774 124819 80049 87098 140215 153409 154261 111501 84734 43232
9225 43232 96344 152684 177090 157195 109540 81491 101636 118446 154674 160545 139864 153694
$$ packed form
9311H1190m3117R070M1853K0802L9333K192k4600j0491m1004r576M6447J2687
9299A24786l7075j3773J5475N5049M3350l317J616o5458l1873l0118o9588J0071
9287h55M5642j2889J3994N4887k9837N1381K0765p174j0542J0887q0761j6119
9275C9379M5359J5489L1283M0394L4066K2083l3251o6080j8469k7239m9562L4145
9263F7597O3151K2505K7416p207m2666k6950K9392J7585l529K9817k537L53k6620
9250A48307R137l2487n1363O417L5963P0688M647j8913P386K1101o1135J1283
9238A51031q411k7821j8725K4700M045m4770P049N3117J3194Q52m2760k6767m1502
9225D3232N3112N6340K4406j9895m7655k8049K0145J6810L6228N871k0681J3830
$$ plain form
9213 153694 154159 144754 151044 126630 112626 117590 142035 119755 154158 179404 153699 111523 157733
9200 157733 225343 223279 155543 105585 75598 67817 115245 121198 85965 60999 78379 41584
9188 41584 108146 188406 177399 108659 156943 114881 101135 87429 116560 131704 101265 107209
9176 107209 176407 192008 184228 187588 167182 256327 249454 243936 232457 188711 176309 132825
9164 132825 94679 109609 99318 126766 154245 134410 109109 141889 156787 114803 152243 222589
9152 222589 213364 184118 187018 210040 247791 224388 218592 231911 145899 151751 178876 218640
9140 218640 229787 277586 266436 253272 241051 262152 259734 187981 132817 189017 232274 210921
9128 210921 279706 332005 323016 313795 226256 146066 158138 184953 199427 163896 124173 177713
$$ packed form
9213A53694M65r405O290k4414j4004M964K4445k2280L4403K5246k5705m2176M6210
9200A57733O7610k064o7736m9958k9987p781M7428N953l5233k4966J7380l6795
9188D1584O6562Q0260j1007o8740M8284m2062j3746j3706K9131J5144l0439N944
9176A07209O9198J5601p780L360k0406Q9145o873n518j1479m3746j2402m3484
9164A32825l8146J4930j0291K7448K7479j9835k5301L2780J4898m1984L7440P0346
9152B22589r225k9246K900K3022L7751k3403n796J3319q6012N852K7125L9764
9140B18640J1147M7799j1150j3164j2221K1101k418p1753n5164N6200M3257k1353
9128B10921O8785N2299q989r221q7539q0190J2072K6815J4474l5531l9723N3540
$$ plain form
9116 177713 204742 292226 325322 327717 315850 315077 322905 345484 357535 320790 301297 320169
9104 320169 399102 426883 385127 352691 356534 316717 283116 244491 261713 282805 279195 273652
9092 273652 246156 258891 261421 287035 313576 291354 303426 368023 388596 384680 361080 347157
9080 347157 349316 364420 395882 457757 471240 428927 368886 362144 339754 316110 359841 396434
9068 396434 412773 404953 361777 337008 333402 347786 333672 338423 396168 416875 368212 368084 384679
9055 384679 360927 346289 362619 365338 388316 446571 472459 447222 422971 466898 507666 471914
9043 471914 450823 447700 409351 432630 416109 448370 532608 549696 524484 489549 532213 511081
9031 511081 460825 448625 459278 414990 435794 407213 425910 436837 450033 401801 355617 393191
$$ packed form
9116A77713K7029Q7484L3096K395j1867p73P828K2579J2051l6745j9493J8872
9104C20169P8933K7781m1756l2436L843l9817l3601l8625J7222K1092l610n543
9092B73652k7496J2735K530K5614K6541k2222J2072O4597K0573l916k3600j3923
9080C47157K159J5104L1462O1875J3483m2313o0041o742k2390k3644M3731L6593
9068C96434J6339p820m3176k4769l606J4384j4114M751N7745K0707m8663j28J6595
9055C84679k3752j4638J6330K719K2978N8255K5888k5237k4251M3927M0768l5752
9043D71914k1091l123l8349K3279j6521L2261Q4238J7088k5212l4935M2664k1132
9031E11081n0256j2200J0653m4288K0804k8581J8697J0927J3196m8232m6184L7574
$$ plain form
9019 393191 429396 463026 440043 422963 465695 457337 459993 445831 446924 476624 505255 522904
9007 522904 543961 580226 566803 522200 532792 544917 536074 523615 568880 612463 603943 674387
8995 674387 709776 734678 680894 638269 621619 629080 659542 648823 657771 632234 595518 587387
8983 587387 654962 687333 703436 681047 670440 718817 730186 729559 721095 720001 752299 712128
8971 712128 699941 755732 809481 829841 841588 875337 821248 882941 940695 963892 970876 929180
8959 929180 860418 924128 945209 938294 970945 1014049 1012856 1025291 995608 1035308 1032572 967104
8947 967104 939563 963888 1068066 1110989 1094217 1108692 1083359 1065472 1071134 1064772 1119269 1115269
8935 1115269 1086868 1134985 1202342 1235562 1296029 1288502 1245038 1264968 1307447 1333623 1368709 1375372
$$ packed form
9019C93191L6205L3630k2983j7080M2732q358K656j4162J093K9700K8631J7649
9007E22904K1057L6265j3423m4603J0592J2125q843j2459M5265M3583q520P0444
8995F74387L5389K4902n3784m2625j6650P461L0462j0719Q948k5537l6716q131
8983E87387O7575L2371J6103k2389j0607M8377J1369o27q464j094L2298m0171
8971G12128j2187N5791N3749K0360J1747L3749n4089O1693N7754K3197O984m1696
8959I29180o8762O3710K1081o915L2651M3104j193J2435k9683L9700k736o5468
8947I67104k7541K4325J04178M2923j6772J4475k5333j7887N662o362N4497m000
8935A115269k8401M8117O7357L3220O0467p527m3464J9930M2479K6176L5086O663
$$ plain form
8923 1375372 1369077 1359512 1316058 1369527 1416333 1385355 1444096 1495066 1469958 1525912 1535332 1630653
8911 1630653 1648900 1593348 1537786 1571700 1618945 1679634 1735695 1793740 1800560 1811437 1796181 1840037
8899 1840037 1865359 1874461 1930284 1963562 2010336 2101473 2144083 2171736 2183094 2197908 2238224 2237662
8887 2237662 2209011 2247799 2250591 2304060 2413588 2478870 2491178 2563746 2636736 2724429 2730078 2748002
8875 2748002 2835013 2852283 2897422 3046565 3142760 3188771 3224849 3299915 3358328 3437580 3518519
8864 3518519 3535959 3581311 3604638 3652444 3755302 3845625 3944048 4093831 4129497 4188692 4254655
8853 4254655 4352075 4508459 4646597 4756692 4816091 4883079 4969764 5070903 5161148 5291890
8843 5291890 5422658 5535629 5647271 5697203 5863133 6097763 6239447 6307345 6468271 6653429
$$ packed form
8923A375372o295r565m3454N3469M6806l0978N8741N0970k5108N5954R420R5321
8911A630653J8247n5552n5562L3914M7245O0689N6061N8045O820J0877j5256M3856
8899A840037K5322R102N5823L3278M6774R1137M2610K7653J1358J4814M0316n62
8887B237662k8651L8788K792N3469J09528O5282J2308P2568P2990Q7693N649J7924
8875B748002Q7011J7270M5139J49143R6195M6011L6078P5066N8413P9252Q0939
8864C518519J7440M5352K3327M7806J02858R0323R8423J49783L5666N9195O5963
8853D254655R7420J56384J38138J10095N9399O6988Q6685J01139R0245J30742
8843E291890J30768J12971J11642M9932J65930K34630J41684O7898J60926J85158
$$ plain form
8833 6653429 6834874 7028292 7212580 7387913 7586665 7793510 7975715 8094414 8235173 8450803
8823 8450803 8633208 8866598 9124665 9388649 9565586 9696908 9982815 10287360 10483908 10726248
8813 10726248 10981440 11172576 11412634 11678681 11988251 12255897 12441401 12687268 12965033
8804 12965033 13210774 13400777 13588969 13759650 14012140 14235969 14465887 14709986 14919963
8795 14919963 15099143 15183078 15308962 15487434 15569422 15578629 15665065 15789977 15862649 15884233 15904062
8784 15904062 15905785 15881462 15828576 15713700 15547337 15469805 15404914 15223266 15014324 14837166
8774 14837166 14675196 14486369 14221157 14055948 13884615 13733480 13494640 13198478 12921309
8765 12921309 12672345 12449536 12144799 11837877 11600396 11355455 11053061 10771287 10535922
$$ packed form
8833F653429J81445J93418J84288J75333J98752K06845J82205J18699J40759K15630
8823H450803J82405K33390K58067K63984J76937J31322K85907L04545J96548K42340
8813A0726248K55192J91136K40058K66047L09570K67646J85504K45867K77765
8804A2965033K45741J90003J88192J70681K52490K23829K29918K44099K09977
8795A4919963J79180Q3935J25884J78472Q1988R207Q6436J24912P2672K1584J9829
8784A5904062J723k4323n2886j14876j66363p7532o4891j81648k08942j77158
8774A4837166j61970j88827k65212j65209j71333j51135k38840k96162k77169
8765A2921309k48964k22809l04737l06922k37481k44941l02394k81774k35365
$$ plain form
8756 10535922 10364730 10228294 10001996 9721719 9451094 9192492 8881829 8678015 8506492
8747 8506492 8278886 8140796 7924693 7702766 7514693 7317325 7097150 6873304 6749964 6605386
8737 6605386 6470535 6289010 6106470 5954639 5822305 5708243 5570896 5413710 5288484 5185514
8727 5185514 5086994 4948620 4804184 4675944 4564685 4443384 4340161 4271349 4183902 4118251
8717 4118251 4022067 3894856 3797777 3734640 3648007 3563790 3459483 3356490 3275674 3242224 3176787
8706 3176787 3138552 3081507 3016793 2960928 2884770 2862702 2812230 2724583 2712355 2708803 2635537 2592464
8694 2592464 2569795 2497486 2404358 2405673 2369018 2299705 2256017 2255823 2156087 2096602 2062415 2024867
8682 2024867 2029188 1949556 1872690 1842601 1866918 1915804 1917403 1854287 1794117 1675596 1609682 1659324
$$ packed form
8756A0535922j71192j36436k26298k80277k70625k58602l10663k03814j71523
8747H506492k27606j38090k16103k21927j88073j97368k20175k23846j23340j44578
8737F605386j34851j81525j82540j51831j32334j14062j37347j57186j25226j02970
8727E185514r8520j38374j44436j28240j11259j21301j03223o8812q7447o5651
8717D118251r6184j27211r7079o3137q6633q4217j04307j02993q0816l3450o5437
8706C176787l8235n7045o4714n5865p6158k2068n0472q7647j2228l552p3266m3073
8694B592464k2669p2309r3128J315l6655o9313m3688j94r9736n9485l4187l7548
8682B024867M321p9632p6866l0089K4317M8886J599o3116o0170j18521o5914M9642
$$ plain form
8670 1659324 1649463 1584245 1579320 1615223 1614940 1651960 1584128 1515575 1480003 1404646 1415626 1435513
8658 1435513 1411354 1338272 1336247 1331500 1399346 1398962 1418359 1460156 1518381 1720136 2007459 2225704
8646 2225704 2145216 1828617 1541929 1381202 1245058 1126319 1064674 1106300 1098081 1084125 987434
8635 987434 929556 939645 940216 950984 994525 1004866 965096 960851 992640 991346 962990 930154
8623 930154 952941 941160 898311 913002 928220 918876 855963 788517 787929 833956 876066 896043
8611 896043 909308 890572 905177 894357 917384 1053472 1239450 1584831 2158811 2789585 2904302
8600 2904302 2315122 1683556 1342982 1137271 977561 880067 810516 765896 762272 771487 747102
8589 747102 654545 613236 617917 646584 629876 578538 570773 517772 499940 499455 470100 544191
$$ packed form
8670A659324r861o5218m925L5903k83L7020o7832o8553l5572p5357J0980J9887
8658A435513k4159p3082k025m747O7846l84J9397M1797N8225K01755K87323K18245
8646B225704q0488l16599k86688j60727j36144j18739o1645M1626q219j3956r6691
8635I87434n7878J0089N71J0768M3541J0341l9770m245L1789j294k8356l2836
8623I30154K2787j1781m2849J4691J5218r344o2913o7446n88M6027M2110J9977
8611H96043J3265j8736J4605j0820K3027J36088J85978L45381N73980O30774J14717
8600B904302n89180o31566l40574k05711j59710r7494o9551m4620l624R215k4385
8589G47102r2557m1309M681K8667j6708n1338p765n3001j7832m85k9355P4091
$$ plain form
8577 544191 521896 522014 554208 541848 522391 485104 475488 463846 513960 539400 507182 452235
8565 452235 386356 368841 395795 490296 615231 707607 811924 976468 1210087 1363056 1159472
8554 1159472 871536 734642 680845 621158 537059 491128 460531 415604 356807 334165 375373
8543 375373 360944 343322 342059 375534 438658 385215 348454 270190 257493 281973 297976 297957
8531 297957 313177 304980 282997 284927 267097 239470 207551 249655 279934 288622 336289 326148
8519 326148 304563 221301 220417 244292 257444 303258 326865 261354 207712 210112 221894 230752
8507 230752 250185 258722 214082 182003 184792 170383 203973 215962 211494 210783 126390 132415 166926
8494 166926 174650 167669 155215 217189 248422 230863 223296 226600 248729 218159 167550 128906
$$ packed form
8577E44191k2295J18L2194j2360j9457l7287r616j1642N0114K5440l2218n4947
8565D52235o5879j7515K6954R4501J24935R2376J04317J64544K33619J52969k03584
8554A159472k87936j36894n3797n9687q4099m5931l0597m4927n8797k2642M1208
8543C75373j4429j7622j263L3475O3124n3443l6761p8264j2697K4480J6003j9
8531B97957J5220q197k1983J930j7830k7627l1919M2104L0279Q688M7667j0141
8519C26148k1585q3262q84K3875J3152M5814K3607o5511n3642K400J1782Q858
8507B30752J9433Q537m4640l2079K789j4409L3590J1989m468p11q4393O025L4511
8494A66926P724o981j2454O1974L1233j7559p567L304K2129l0570n0609l8644
$$ plain form
8482 128906 159893 197605 234517 274838 251196 220166 231672 201871 150510 142170 153943 168972
8470 168972 166590 145241 141054 177310 159987 102694 94395 79286 46370 68961 88298 128437
8458 128437 211830 178526 109586 149425 225512 244726 217146 198989 122004 95991 169991 202515
8446 202515 242410 317916 306578 260709 265802 219690 167521 189338 180970 111606 155332 170608
8434 170608 163567 95498 140577 178960 147677 168213 160840 147102 162001 152603 150815 143158 143783
8421 143783 152106 189142 276463 256596 236864 209236 207852 174169 133155 129828 51750 82123
8409 82123 69562 25032 59189 100576 114283 138986 114571 60781 41993 64004 104012 144906
8397 144906 157879 161064 153670 119477 79138 36880 54750 90045 119336 142705 163515 141526
$$ packed form
8482A28906L0987L7712L6912M0321k3642l1030J1506k9801n1361q340J1773J5029
8470A68972k382k1349m187L6256j7323n7293q299j5109l2916K2591J9337M0139
8458A28437Q3393l3304o8940L9839P6087J9214k7580j8157p6985k6013P4000L2524
8446B02515L9895P5506j1338m5869N093m6112n2169K1817q368o9364M3726J5276
8434A70608p041o8069M5079L8383l1283K0536p373j3738J4899r398j788p657O25
8421A43783Q323L7036Q7321j9867j9732k7628j384l3683m1014l327p8078L0373
8409H2123j2561m4530L4157M1387J3707K4703k4415n3790j8788K2011M0008M0894
8397A44906J2973L185p394l4193m0339m2258J7870L5295K9291K3369K0810k1989
$$ plain form
8385 141526 145578 137091 140640 164762 153954 160639 146400 136972 153017 161064 194957 150574 68581
8372 68581 114007 189400 207310 212875 188245 144848 155850 159368 115782 60835 -2690 -54968
8360 -54968 -22687 19918 9209 3720 -38612 -97391 -79658 -37236 -23531 -38761 -10514 12080
8348 12080 94560 118718 103949 6988 -96130 -117338 -79299 -35323 -67008 -48655 37196 83778
8336 83778 66463 51833 70660 125890 76266 75041 94400 70169 34884 4535 -7506 37327
8324 37327 63137 53822 127400 137636 92311 86220 106605 84750 72327 55774 83266 118248
8312 118248 115189 80491 92829 72415 54692 61966 91385 58205 56621 69282 70540 72481 96091
8299 96091 132361 133815 126098 121653 93213 7076 2029 95838 164277 161553 185565 198832 210433
$$ packed form
8385A41526M052q487L549K4122j0808O685j4239r428J6045Q047L3893m4383q1993
8372F8581M5426P5393J7910N565k4630m3397J1002L518m3586n4947o3525n2278
8360e4968L2281M2605j0709n489m2332n8779J7733M2422J3705j5230K8247K2594
8348A2080Q2480K4158j4769r6961j03118k1208L8039M3976l1685J8353Q5851M6582
8336H3778j7315j4630J8827N5230m9624j225J9359k4231l5285l0349j2041M4833
8324C7327K5810r315P3578J0236m5325o091K0385k1855j2423j6553K7492L4982
8312A18248l059l4698J2338k0414j7723P274K9419l3180j584J2661J258J941K3610
8299I6091L6270J454p717m445k8440q6137n047R3809O8439k724K4012J3267J1601
$$ plain form
8286 210433 186211 136579 131082 85795 52434 30103 48497 93936 97964 114385 89419 125489
8274 125489 147002 91396 29972 3533 6891 8809 -14 -36694 12959 26937 92229 92693 8753
8261 8753 -3994 28223 69694 89645 68533 81540 108568 31870 -1606 39621 32957 20496
8249 20496 66326 110980 120773 177266 211395 116729 128194 137802 141162 127543 33269 -44995
8237 -44995 -44493 -8721 42041 31527 44414 61760 70878 61479 98241 104129 44018 43015 18509
8224 18509 -13382 -24539 -10093 -30052 -7379 50626 80080 97316 85585 54845 3649 36988
8212 36988 66792 29805 31877 31446 44027 65290 96057 104382 114873 140225 76874 19485 69726
8199 69726 138420 142120 46636 -25533 -48166 -54785 -35396 -69416 -91885 -58999 -10074 -5796
$$ packed form
8286B10433k4222m9632n497m5287l3361k2331J8394M5439M028J6421k4966L6070
8274A25489K1513n5606o1424k6439L358J918q823l6680M9653J3978O5292M64q3940
8261H753j2747L2217M1471J9951k1112J3007K7028p6698l3476M1227o664j2461
8249B0496M5830M4654R793N6493L4129r4666J1465R608L360j3619r4274p8264
8237d4995N02L5772N0762j0514J2887J7346R118r399L6762N888o0111j003k4506
8224A8509l1891j1157J4446j9959K2673N8005K9454J7236j1731l0740n1196L3339
8212C6988K9804l6987K072m31J2581K1263L0767Q325J0491K5352o3351n7389N0241
8199F9726O8694L700r5484p2169k2633o619J9389l4020k2469L2886M8925M278
$$ plain form
8187 -5796 -6227 -14654 -27311 -4790 -17828 -41103 -59726 -43235 -39275 14366 69702 58588 -50798
8174 -50798 -77476 -146065 -127073 -72430 -47761 -23946 -7166 -52258 -72091 -74317 -104225 -92084
8162 -92084 -102708 -74465 16860 3635 -9899 -20204 -50992 -39235 -44704 9896 -34690 -68880
8150 -68880 -32936 47147 25950 8365 56047 106091 39027 2988 -4048 -28750 13019 16396
8138 16396 49984 28022 -34847 -9904 16057 4418 40168 86348 39756 19701 -84823 -103619
8126 -103619 -96548 -96237 -129557 -73174 -58408 -88569 -85359 -29355 -30642 11359 -28977 -66688 -53065
8113 -53065 34208 78944 111891 78538 44415 22834 -35042 -38813 -50216 -112085 -113388 -109206
8101 -109206 -51308 34162 30676 -1279 -32815 -58131 -28687 6597 24201 9380 -18313 4418
$$ packed form
8187e796m31q427j2657K2521j3038k3275j8623J6491L960N3641N5336j1114j09386
8174e0798k6678o8589J8992N4643K4669K3815J6780m5092j9833k226k9908J2141
8162i2084j0624K8243R1325j3225j3534j0305l0788J1757n469N4600m4586l4190
8150f8880L5944Q0083k1197j7585M7682N0044o7064l6039p036k4702M1769L377
8138A6396L3588k1962o2869K4943K5961j1639L5750M6180m6592k0055j04524j8796
8126a03619P071L11l3320N6383J4766l0161L210N6004j287M2001m0336l7711J3623
8113e3065Q7273M4736L2947l3353l4123k1581n7876l771j1403o1869j303M182
8101a09206N7898Q5470l486l1955l1536k5316K9444L5284J7604j4821k7693K2731
$$ plain form
8089 4418 13392 -23371 -123952 -140750 -68324 -17782 -64974 -65865 -101800 -104775 -112704 -126662 -99840
8076 -99840 -22008 -4216 -20101 -6243 -26970 -48604 -75194 -95393 -121265 -104670 -65635 -41046
8064 -41046 -10280 -2313 6380 16525 12247 12536 13129 -37019 -57857 -27248 25377 -1029 15398
8051 15398 31019 12593 -3624 24538 53944 21203 -447 3593 62040 78102 46418 19893
8039 19893 21753 45373 64434 42280 14177 36464 29095 4575 -12918 75700 92899 81414
8027 81414 79741 77409 54751 19993 23105 75601 77889 -40066 -63520 -55661 -7565 42589 85887
8014 85887 4577 26907 41210 69415 94257 41154 35285 41162 4320 -31991 -31436 -45711 -16669
8001 -16669 40171 101020 54857 -10073 -28300 -41964 -44308 -37457 -15494 -21401 -22351 -50058 -35771
$$ packed form
8089D418Q974l6763j00581j6798P2426N0542m7192q91l5935k975p929j3958K6822
8076i9840P7832J7792j5885J3858k0727k1634k6590k0199k5872J6595L9035K4589
8064d1046L0766P967Q693J0145m278K89N93n0148k0838L0609N2625k6406J6427
8051A5398J5621j8426j6217K8162K9406l2741k1650M040N8447J6062l1684k6525
8039A9893J860K3620J9061k2154k8103K2287p369k4520j7493Q8618J7199j1485
8027H1414j673k332k2658l4758L112N2496K288j17955k3454P859M8096N0154M3298
8014H5887q1310K2330J4303K8205K4842n3103n869N877l6842l6311N55j4275K9042
8001a6669N6840O0849m6163o4930j8227j3664k344O851K1963n907r50k7707J4287
$$ plain form
7988 -35771 8297 9768 -1316 -28617 31658 31884 -22267 -19318 7989 25273 -9775 -19790 -16889
7975 -16889 7376 -21299 -26079 -30655 -45502 -75502 -8089 31684 58687 64362 93586 64092
7963 64092 55731 85538 143096 132217 148400 81338 27366 -16537 -28136 -42622 -58406 -74288
7951 -74288 -36949 -4878 -32885 -18526 -46741 -63439 -22093 -25795 -35579 -74103 -68638 -87024
7939 -87024 -57662 -85025 -50328 -15264 15199 -6193 -5201 11244 23136 -1714 24209 25309
7927 25309 26696 36035 30177 57556 72861 37413 19301 46648 83997 93693 66087 -9664 -49450
7914 -49450 -56427 -54137 -20092 24411 64039 59857 80285 93527 58000 1 -43637 8270
7902 8270 -237 -58158 -32175 -28458 -99462 -56462 -36739 1623 29845 38287 90040 56542 -35895
$$ packed form
7988c5771M4068J471j1084k7301O0275K26n4151K949K7307J7284l5048j0015K901
7975a6889K4265k8675m780m576j4847l0000O7413L9773K7003N675K9224k9494
7963F4092q361K9807N7558j0879J6183o7062n3972m3903j1599j4486j5784j5882
7951g4288L7339L2071k8007J4359k8215j6698M1346l702r784l8524N465j8386
7939h7024K9362k7363L4697L5064L0463k1392R92J6445J1892k4850K5923J100
7927B5309J387R339n858K7379J5305l5448j8112K7347L7349R696k7606p5751l9786
7914d9450o977K290L4045M4503L9628m182K0428J3242l5527n7999m3638N1907
7902H270q507n7921K5983L717p1004M3000J9723L8362K8222Q442N1753l3498r2437
$$ plain form
7889 -35895 -33733 59848 45720 25435 90724 92535 77933 54430 29922 25777 57421 36244
7877 36244 -5059 -70723 -90878 -65946 -61719 -64381 -15443 10725 52711 27954 36773 37801 56528
7864 56528 42457 5811 -6930 29604 54722 65451 75765 11339 -36844 -74293 -46726 14426
7852 14426 41707 61860 5754 -45064 -59741 -79225 -77852 -76078 5565 108884 63494 24142
7840 24142 16709 -27434 -56493 -97284 -132729 -103882 -29279 -34448 -7789 -21256 13151 -64246
7828 -64246 -39509 39547 59861 48041 49307 81257 72333 21627 -27350 -40873 -23966 -14346
7816 -14346 -4889 -14907 -7771 27282 51588 73523 -401 -35613 -19570 -35029 -2251 -19904
7804 -19904 -26825 -95558 -51991 12315 38091 35426 38633 6302 -49693 -67004 -39918 -48419 -37600
$$ packed form
7889c5895K162R3581j4128k0285O5289J811j4602k3503k4508m145L1644k1177
7877C6244m1303o5664k0155K4932M227k662M8938K6168M1986k4757Q819J028J8727
7864E6528j4071l6646j2741L6534K5118J0729J0314o4426m8183l7449K7567O1152
7852A4426K7281K0153n6106n0818j4677j9484J373J774Q1643J03319m5390l9352
7840B4142p433m4143k9059m0791l5445K8847P4603n169K6659j3467L4407p7397
7828f4246K4737P9056K0314j1820J266L1950q924n0706m8977j3523J6907R620
7816a4346R457j0018P136L5053K4306K1935p3924l5212J6043j5459L2778j7653
7804a9904o921o8733M3567O4306K5776k665L207l2331n5995j7311K7086q501J0819
$$ plain form
7791 -37600 -33292 -54524 -43095 -30225 -4681 -77950 -123183 -130075 -114017 -123454 -137481 -111411
7779 -111411 -102375 -83257 -107043 -127243 -150583 -133128 -105389 -67411 -23484 -35261 -21441 -55775
7767 -55775 -64337 -76201 -60129 -65143 -53395 -51181 -67966 -73575 -82941 -59440 -32213 -55794 -75156
7754 -75156 -15911 26589 28911 -5418 -7922 -20196 -59690 -25754 -39914 -104471 -120623 -109007
7742 -109007 -98743 -67565 -64807 -72937 -87874 -85016 -50763 38514 73779 61674 17955 -15946
7730 -15946 -58377 -89588 -44174 -10854 5154 1395 57779 9263 -23715 -7605 -8393 6980
7718 6980 -14812 -67764 -90816 -130922 -48063 9778 -8528 -45868 -43869 -55113 -89873 -94888
7706 -94888 -91680 -21246 -18267 -38474 -32465 -397 -6568 11817 53476 66899 29925 -20139 -18108
$$ packed form
7791c7600M308k1232J1429J2870K5544p3269m5233o892J6058r437j4027K6070
7779a11411R036J9118k3786k0200k3340J7455K7739L7978M3927j1777J3820l4334
7767e5775q562j1864J6072n014J1748K214j6785n609r366K3501K7227k3581j9362
7754g5156N9245M2500K322l4329k504j2274l9494L3936j4160o4557j6152J1616
7742a09007J0264L1178K758q130j4937K858L4253Q9277L5265j2105m3719l3901
7730a5946m2431l1211M5414L3320J6008l759N6384m8516l2978J6110p88J5373
7718F980k1792n2952k3052m0106Q2859N7841j8306l7340J999j1244l4760n015
7706i4888L208P0434K979k0207O009L2068o171J8385M1659J3423l6974n0064K031
$$ plain form
7693 -18108 -30963 -15459 9702 -14475 -8801 -119 -53960 -122022 -125070 -79977 -75848 -17480 11906
7680 11906 11103 -33378 -93369 -94503 -101360 -150206 -130025 -86838 -40238 26240 53183 35504 -27104
7667 -27104 -79204 18088 -1981 -1288 63609 15518 -34746 -47157 -90827 -88617 -46284 -17422
7655 -17422 -26129 21588 44630 -8469 -19664 -50272 -12084 28149 25273 11174 4813 56579
7643 56579 42214 -46067 -69413 -50505 -56577 -16474 2426 26276 61596 73130 13152 -92662
7631 -92662 -60907 -48019 -50337 -44632 -38588 -55754 -72444 -82671 -126279 -115738 -46478 -66194
7619 -66194 -111595 -92322 -62036 -54370 -24110 -30420 -11293 17019 -1466 -29998 -35566 11313
7607 11313 12511 13459 31581 50092 9023 -5797 825 19342 78881 3613 -56912 -38465 3044
$$ packed form
7693a8108j2855J5504K5161k4177N674Q682n3841o8062l048M5093M129N8368K9386
7680A1906q03m4481n9991j134o857m8846K0181M3187M6600O6478K6943j7679o2608
7667b7104n2100R7292k0069O93O4897m8091n0264j2411m3670K210M2333K8862
7655a7422q707M7717K3042n3099j1195l0608L8188M0233k876j4099o361N1766
7643E6579j4365q8281k3346J8908o072M0103J8900K3850L5320J1534n9978j05814
7631i2662L1755J2888k318N705O044j7166j6690j0227m3608J0541O9260j9716
7619f6194m5401J9273L0286P666L0260o310J9127K8312j8485k8532n568M6879
7607A1313J198R48J8122J8511m1069j4820O622J8517N9539p5268o0525J8447M1509
$$ plain form
7594 3044 25727 76129 19843 -47203 -105941 -114514 -132461 -90867 -17557 52160 71364 86223
7582 86223 17096 57771 85482 44465 -11515 -45451 -12133 -51074 -83124 -59910 -27997 -28132
7570 -28132 -22092 3821 37573 27303 -11198 -38971 -32544 -29755 -29534 -52673 -66382 -85528 -38451
7557 -38451 7760 9681 -17990 -18319 -18330 -9594 -18187 2906 52300 34980 24952 49289 7318
7544 7318 -37334 -40453 -35090 -3057 8388 10462 6654 -36095 -54778 -55226 -37985 -29095 -35616 -52249
7530 -52249 -59932 -81003 -23096 -44784 -121727 -112990 -73369 -45004 -44453 -44836 -101711 -131645 -107612
7517 -107612 -38707 -32528 17270 16354 -27459 -47794 -116405 -73361 -30626 -3741 66155 84688
7505 84688 29188 -32916 -32240 -21785 11874 51480 49683 78458 79625 44746 34091 22342 -16770
$$ packed form
7594C044K2683N0402n6286o7046n8738q573j7947M1594P3310O9717J9204J4859
7582H6223o9127M0675K7711m1017n5980l3936L3318l8941l2050K3214L1913j35
7570b8132O040K5913L3752j0270l8501k7773O427K789K21k3139j3709j9146M7077
7557c8451M6211J921k7671l29j1Q736q593K1093M9394j7320j0028K4337m1971
7544G318m4652l119N363L2033J1445K074l808m2749j8683m48J7241Q890o521j6633
7530e2249p683k1071N7907k1688p6943Q737L9621K8365N51l83n6875k9934K4033
7517a07612O8905O179M9798r16m3813k0335o8611M3044M2735K6885O9896J8533
7505H4688n5500o2104O76J0455L3659L9606j797K8775J167l4879j0655j1749l9112
$$ plain form
7492 -16770 9526 -10920 21519 61465 75915 -30317 -104591 -107039 -106484 -48454 -53337 828
7480 828 43833 364 -14434 -10814 41879 39374 19798 12708 -18333 -39042 -62517 -48211 45865
7467 45865 80000 26026 5 -35848 -69680 -110968 -124379 -37823 -42744 -103005 -112243 -69757
7455 -69757 -38898 27177 -4252 -34052 42174 65791 48233 -35258 -73564 -85384 -67642 -44944
7443 -44944 -58738 -102950 -76755 -25774 -75242 -98973 -91353 -74459 -44118 -22944 13234 58596
7431 58596 12466 25296 21421 -52587 -65027 -37863 -53048 -29367 98 53341 82135 54981
7419 54981 71967 22099 -20421 -25523 -5488 -45517 -42719 -14092 -14410 -54589 -101586 -72831 -42285
7406 -42285 -17620 -34240 -79580 -109418 -85798 -52439 -18216 -48769 -34987 -27222 -56933 -59292
$$ packed form
7492a6770K6296k0446L2439L9946J4450j06232p4274k448N55N8030m883N4165
7480H28M3005m3469j4798L620N2693k505j9576p090l1041k0709k3475J4306R4076
7467D5865L4135n3974k6021l5853l3832m1288j3411Q6556m921o0261r238M2486
7455f9757L0859O6075l1429k9800P6226K3617j7558q3491l8306j1820J7742K2698
7443d4944j3794m4212K6195N0981m9468k3731P620J6894L0341K1174L6178M5362
7431E8596m6130J2830l875p4008j2440K7164j5185K3681K9465N3243K8794k7154
7419E4981J6986m9868m2520n102K0035m0029K798K8627l18m0179m6997K8755L0546
7406d2285K4665j6620m5340k9838K3620L3359L4223l0553J3782P765k9711k359
$$ plain form
7394 -59292 2349 51524 52150 7545 -45129 -75054 -71124 -29661 -2131 53015 63053 51874
7382 51874 -8533 -58922 -71711 -99555 -24496 -1517 7238 -29509 -126395 -142888 -26867 47323
7370 47323 24412 32425 20607 38087 28389 52889 59272 -1313 -44115 -81670 -61627 13958
7358 13958 8805 9846 43207 -44377 -39741 -6733 33480 -14264 -40382 -59680 -40735 -22442
7346 -22442 -306 -18196 18011 3220 -16226 -10363 29112 44377 26555 26295 -6598 -50782
7334 -50782 -50871 -9501 11235 -16813 -12138 -24216 -35982 -61965 -5747 43496 46222 29185 24044
7321 24044 -37223 -65054 -97947 -78923 -64817 -84673 -88281 -68951 -77512 -63064 -44244 -54059
7309 -54059 -73599 -78809 -81358 -10243 67881 117469 83192 -13359 -7073 6044 -3257 -19277 -56972
$$ packed form
7394e9292O1641M9175O26m4605n2674k9925L930M1463K7530N5146J0038j1179
7382E1874o0407n0389j2789k7844P5059K2979Q755l6747r6886j6493J16021P4190
7370D7323k2911Q013j1818J7480r698K4500O383o0585m2802l7555K0043P5585
7358A3958n153J041L3361q7584M636L3008M0213m7744k6118j9298J8945J8293
7346b2442K2136j7890L6207j4791j9446N863L9475J5265j7822k60l2893m4184
7334e0782q9M1370K0736k8048M675j2078j1766k5983N6218M9243K726j7037n141
7321B4044o1267k7831l2893J9024J4106j9856l608J9330q561J4448J8820r815
7309e4059j9540n210k549P1115P8124M9588l4277r6551O286J3117r301j6020l7695
$$ plain form
7296 -56972 -53742 -49780 -68150 -44927 2344 15625 -4682 -46532 -30170 -40377 -57241 10635
7284 10635 64721 64511 68577 44786 6633 71015 113339 78007 33978 62799 60231 -7434 -46306
7271 -46306 -27733 -75824 -63092 -92731 -170525 -89842 -42942 -13141 -38226 -50197 -23068 -43447
7259 -43447 -52410 -102559 -83628 -58879 -9490 7166 -51180 -38592 -30719 -55669 -26231 -65013
7247 -65013 -117746 -165020 -139390 -98672 -131685 -96572 -44646 18196 -20652 -52979 -54561 -53620
7235 -53620 -73591 -103690 -121396 -166693 -111768 -82709 -131203 -110902 -108819 -31142 -1526 -17600
7223 -17600 -16973 -35952 -24816 -37443 -59429 -89096 -100907 -120420 -147617 -188269 -132185 -61444
7211 -61444 23205 -3570 -36557 -53519 -89353 -361 34859 -6390 -7596 -8171 22436 43378
$$ packed form
7296e6972L230L962j8370K3223M7271J3281k0307m1850J6362j0207j6864O7876
7284A0635N4086k10M066k3791l8153O4382M2324l5332m4029K8821k568o7665l8872
7271d6306J8573m8091J2732k9639p7794Q0683M6900K9801k5085j1971K7129k0379
7259d3447q963n0149J8931K4749M9389J6656n8346J2588P873k4950K9438l8782
7247f5013n2733m7274K5630M0718l3013L5113N1926O2842l8848l2327j582R41
7235e3620j9971l0099j7706m5297N4925K9059m8494K0301K083P7677K9616j6074
7223a7600O27j8979J1136j2627k1986k9667j1811j9513k7197m0652N6084P0741
7211f1444Q4649k6775l2987j6962l5834Q8992L5220m1249j206n75L0607K0942
$$ plain form
7199 43378 -9555 -11047 -13493 -29325 -2745 37243 93053 83799 54536 -33680 -86952 -89018 -53685
7186 -53685 -49464 28395 28885 33022 32779 -7635 -42429 -81951 -127531 -160007 -109468 -66800 -54477
7173 -54477 17131 46398 13716 -37226 -43617 -56413 -18122 -24544 -25629 22817 74325 109141
7161 109141 76687 45217 78017 80836 94011 62157 20638 31814 40579 -28605 -25658 -34164
7149 -34164 -17857 -9632 40453 73059 28133 -26072 -145390 -124932 -47755 -75723 -48553 -31234
7137 -31234 -45217 -24585 32356 9451 -3327 -42167 -57427 -112390 -64982 -3423 49644 58071
7125 58071 17776 -14130 23085 26457 -9286 -4441 -6414 -37250 -31365 -9160 -20247 20715 84
7112 84 -24822 11822 -2112 -13967 -29711 11788 21170 46080 71532 62293 -12812 -67286 -78943
$$ packed form
7199D3378n2933j492k446j5832K6580L9988N5810r254k9263q8216n3272k066L5333
7186e3685M221P7859M90M137k43m0414l4794l9522m5580l2476N0539M2668J2323
7173e4477P1608K9267l2682n0942o391j2796L8291o422j085M8446N1508L4816
7161A09141l2454l1470L2800K819J3175l1854m1519J1176Q765o9184K947q506
7149c4164J6307Q225N0085L2606m4926n4205j19318K0458P7177k7968K7170J7319
7137c1234j3983K0632N6941k2905j2778l8840j5260n4963M7408O1559N3067Q427
7125E8071m0295l1906L7215L372l5743M845j973l0836N885K2205j1087M0962k0631
7112H4k4906L6644j3934j1855j5744M1499R382K4910K5452r239p5105n4474j1657
$$ plain form
7099 -78943 -71022 -48802 -36315 -874 35736 44731 38866 11087 -42735 -47619 -41470 -33531 27017
7086 27017 -5129 -10240 -19545 -18527 -12998 20625 15432 -15210 -101543 -88829 -59400 -59483 -106004
7073 -106004 -71006 -37250 -74215 -62415 -35550 -48563 11130 5220 -16402 -23681 28653 43454
7061 43454 5670 -27800 -25531 -19163 -50396 -54295 -60829 83 2247 31272 46202 11766 -2039
7048 -2039 -16961 -13088 -41153 -52571 -23728 -48636 -45175 -42878 -41444 -72411 -46508 -24194 -9285
7035 -9285 -16389 -50401 -157294 -174972 -139386 -51105 -23184 -49528 -74361 -74133 -108915 -96861
7023 -96861 -82330 -93277 -86801 -46084 27510 -3633 -19078 11141 24716 36322 61785 88673
7011 88673 82869 46750 37536 -31575 -14953 55497 45474 24015 17720 25547 5209 -20456 -66415
$$ packed form
7099g8943P921K2220J2487L5441L6610Q995n865k7779n3822m884O149P939O0548
7086B7017l2146n111r305J018N529L3623n193l0642q6333J2714K9429q3m6521
7073a06004L4998L3756l6965J1800K6865j3013N9693n910k1622p279N2334J4801
7061D3454l7784l3470K269O368l1233l899o534O0912K164K9025J4930l4436j3805
7048b039j4922L873k8065j1418K8843k4908L461K297J434l0967K5903K2314J4909
7035i285p104l4012j06893j7678L5586Q8281K7921k6344k4833K28l4782J2054
7023i6861J4531j0947O476M0717P3594l1143j5445L0219J3575J1606K5463K6888
7011H8673n804l6119r214o9111J6622P0450j0023k1459o295P827k0338k5665m5959
$$ plain form
6998 -66415 -76221 -29672 -34163 -42012 -10079 9112 18052 23476 1944 8609 -30120 -96690 -133448
6985 -133448 -129783 -84344 -73399 -85393 -136370 -122989 -93524 -49981 -56019 -90288 -111581 -67619
6973 -67619 -30002 -1590 13007 28440 -12665 -91109 -95198 -65597 -1281 34914 12176 -21477
6961 -21477 -12707 23656 40956 8616 -45538 -68137 -48108 -44644 -48329 477 -63798 -104085
6949 -104085 -87478 -43726 19199 61865 8397 -20399 -49942 -19444 -35748 -63712 -66179 -91802
6937 -91802 -137189 -143581 -161980 -125852 -116135 -80599 -48587 -70305 -62113 -56762 -9570 52917 48721
6924 48721 -33370 -13826 -45457 -99637 -92650 -34663 -9827 11204 10822 -41653 -92978 -105327
6912 -105327 -46698 -5443 -17423 -77871 -45093 -21228 -53098 -20935 -53633 -61741 -24245 -27287
$$ packed form
6998f6415r806M6549m491p849L1933J9191Q940N424k1532O665l8729o6570l6758
6985a33448L665M5439J0945j1994n0977J3381K9465M3543o038l4269k1293M3962
6973f7619L7617K8412J4597J5433m1105p8444m089K9601O4316L6195k2738l3653
6961b1477Q770L6363J7300l2340n4154k2599K0029L464l685M8806o4275m0287
6949a04085J6607M3752O2925M2666n3468k8796k9543L0498j6304k7964k467k5623
6937i1802m5387o392j8399L6128R717L5536L2012k1718Q192N351M7192O2487m196
6924D8721q2091J9544l1631n4180O987N7987K4836K1031l82n2475n1325j2349
6912a05327N8629M1255j1980o0448L2778K3865l1870L2163l2698q108L7496l042
$$ plain form
6900 -27287 -76289 -102142 -70182 -54010 -62096 -82093 -49160 23090 9284 -48852 -81857 -75362
6888 -75362 -76228 -30001 173 -65296 -39531 -79157 -139692 -127076 -46715 -55761 -105775 -109470 -90497
6875 -90497 -81979 -14298 -23355 -40678 -15115 13113 19059 -28363 -42670 -32120 -7 13119
6863 13119 -47912 -16921 -44394 -60207 -47667 -108534 -180261 -144789 -123412 -48096 54034 75152
6851 75152 35324 -1975 6854 -7026 -5571 -27733 -8734 -31534 -104736 -123494 -146830 -166321
6839 -166321 -150836 -110590 -107110 -95959 -139163 -139107 -150765 -98910 -52199 -20608 -60513 -79749
6827 -79749 -97436 -67627 -59472 -93668 -78532 -133816 -132434 -123140 -188128 -199420 -181090 -125473
6815 -125473 -70435 15494 3062 -19757 -48053 -26717 -10185 -17549 -40535 -27613 -34999 -35288
$$ packed form
6900b7287m9002k5853L1960J6172q086j9997L2933P2250j3806n8136l3005O495
6888g5362q66M6227L0174o5469K5765l9626o0535J2616Q0361r046n0014l695J8973
6875i0497Q518O7681r057j7323K5563K8228N946m7422j4307J0550L2113J3126
6863A3119o1031L0991k7473j5813J2540o0867p1727L5472K1377P5316J02130K1118
6851G5152l9828l7299Q829j3880J455k2162J8999k2800p3202j8758k3336j9491
6839a66321J5485M0246L480J1151m3204N6j1658N1855M6711L1591l9905j9236
6827g9749j7687K9809Q155l4196J5136n5284J382R294o4988j1292J8330N5617
6815a25473N5038Q5929j2432k2819k8296K1336J6532p364k2986J2922p386k89
$$ plain form
6803 -35288 -42880 8609 -31559 -122453 -143200 -82157 -28568 -25409 16770 -66718 -102202 -32744
6791 -32744 -9261 -16159 -39009 6634 17179 16475 32872 152 22 19753 29982 -17716 -43050
6778 -43050 -64741 -8688 -12831 -5262 -19022 -18964 -40106 -18280 34201 49765 6942 -3353 4985
6765 4985 10007 -5985 13052 -27983 -3193 -10439 -33364 -57915 -23071 -23376 -23369 24220 35339 -2115
6751 -2115 -10511 -14718 -13273 -15783 -2073 34379 -27331 -32982 -58431 -34026 -67210 -75201 -65948
6738 -65948 -30182 -43526 -61645 -38997 -34421 3179 25160 -23448 -75609 -36004 5765 114985
6726 114985 210943 287797 421470 593022 687664 675123 402082 254409 205380 144111 84185
6715 84185 11598 206 -2748 -16933 -56994 -27409 23683 -24312 -111539 -75621 -53531 -42218
$$ packed form
6803c5288p592N1489m0168r0894k0747O1043N3589L159M2179q3488l5484O9458
6791c2744K3483o898k2850M5643J0545p04J6397l2720j30J9731J0229m7698k5334
6778d3050k1691N6053m143P569j3760N8k1142K1826N2481J5564m2823j0295Q338
6765D985N022j5992J9037m1035K4790p246k2925k4551L4844l05PM7589J1119l7454
6751b115q396m207J445k510J3710L6452o1710n651k5449K4405l3184p991R253
6738f5948L5766j3344j8119K2648M576L7600K1981m8608n2161L9605M1769J09220
6726A14985R5958P6854J33673J71552R4642j2541k73041j47673m9029o1269n9926
6715H4185p2587j1392k954j4185m0061K9585N1092m7995q7227L5918K2090J1313
$$ plain form
6703 -42218 -37561 -44685 -8871 -36865 -56500 -61764 -51681 -48895 -40716 -11145 -45518 -56426 -1652
6690 -1652 31573 -49309 -79831 -30456 6320 56196 76025 38993 -13628 -44587 -82069 -65172
6678 -65172 -57662 -75413 -65798 -42418 -25695 -44014 -56651 -55570 -57939 -76815 -10619 60022 38179
6665 38179 2468 -11058 -53679 -81568 -96758 -126555 -95748 -94118 -56480 -75280 -86638 -48601
6653 -48601 7995 8090 -42381 12741 21237 4189 19412 48022 69498 64107 63190 45070 16332
6640 16332 -24850 -51709 14645 27946 9400 19013 65926 17313 18172 -13138 -41211 -19136
6628 -19136 3294 20327 -7062 -50187 -26010 -30369 3757 3038 -46577 -40829 -40579 -46050 18919
6615 18919 26085 -54866 -114970 -115370 -96176 -49193 2615 -6061 -54383 -69038 -36759 -41604 -36417
$$ packed form
6703d2218M657p124L5814k7994j9635n264J0083K786Q179K9571l4373j0908N4774
6690a652L3225q0882l0522M9375L6776M9876J9829l7032n2621l0959l7482J6897
6678f5172P510j7751R615K3380J6723j8319j2637J081k369j8876O6196P0641k1843
6665C8179l5711j3526m2621k7889j5190k9797L0807J630L7638j8800j1358L8037
6653d8601N6596R5n0471N5122Q496j7048J5223K8610K1476n391r17j8120k8738
6640A6332m1182k6859O6354J3301j8546R613M6913m8613Q59l1310k8073K2075
6628a9136K2430J7033k7389m3125K4177m359L4126p19m9615N748K50n471O4969
6615A8919P166q0951o0104m00J9194M6983N1808q676m8322j4655L2279m845N187
$$ plain form
6602 -36417 -49771 -74385 -58603 -3965 35681 37744 53523 49569 16832 -39057 -24195 -14521
6590 -14521 -48995 -90102 -128771 -102434 -17322 -18030 -66394 -117177 -75104 -40768 -33428 -58409
6578 -58409 -80954 -119929 -62958 -24060 22468 27025 79430 105989 -1430 196 13435 190
6566 190 24461 25876 34546 33182 32272 55871 32187 30808 5223 -37977 -14735 16139 -14315
6553 -14315 -45802 2793 35553 -23463 -49280 -25157 55922 50155 -44080 -58529 -36478 -54073
6541 -54073 -48522 -17883 -16031 12075 25706 -16998 -13008 10949 -42690 -100124 -47832 255
6529 255 14920 25415 -14822 -87837 -128778 -102988 -77602 -44868 3608 15670 8942 -4135
6517 -4135 -51853 -72347 -67086 -30840 -4647 18097 48883 81016 131674 115117 77079 40810
$$ packed form
6602c6417j3354k4614J5782N4638L9646K063J5779l954l2737n5889J4862R674
6590a4521l4474m1107l8669K6337Q5112p08m8364n0783M2073L4336P340k4981
6578e8409k2545l8975N6971L8898M6528M557N2405K6559j07419J626J3239j3245
6566A90K4271J415Q670j364r10K3599k3684j379k5585m3200K3242L0874l0454
6553a4315l1487M8595L2760n9016k5817K4123Q1079n767r4235j4449K2051j7595
6541e4073N551L0639J852K8106J3631m2704L990K3957n3639n7434N2292M8087
6529B55J4665J0495m0237p3015m0941K5790K5386L2734M8476J2062o728j3077
6517d135m7718k0494N261L6246K6193K2744L0786L2133N0658j6557l8038l6269
$$ plain form
6505 40810 40791 23643 66731 18281 -13759 -7164 26223 36505 50053 30357 48719 39657 32540
6492 32540 -6001 863 -21902 -47173 -74749 -58309 -82296 -89591 -95210 -77700 -6682 -66406
6480 -66406 -80577 -51448 -70470 -32488 -6873 -1609 17539 8811 -34139 -70026 -43038 -66032
6468 -66032 -23993 64938 100747 31244 5720 -48798 -78066 -100588 -114424 -35067 28113 19638
6456 19638 20459 27935 -21858 -9659 -3762 -16510 -24350 -2452 46053 33320 30062 21812 5359
6443 5359 69269 74002 40501 -2372 -20085 -7750 -40638 -91957 -86648 -100237 -96602 -102462 -110722
6430 -110722 -139687 -135421 -120186 -84346 -81665 -86149 -120663 -141812 -133706 -125858 -209843 -197615 -69955
6417 -69955 9748 -6221 -3823 32551 -7378 20976 -3633 6522 19669 -27045 -79018 -85358
$$ packed form
6505D0810j9j7148M3088m8450l2040O595L3387J0282J3548j9696J8362r062p117
6492C2540l8541O864k2765k5271k7576J6440k3987p295n619J7510P1018n9724
6480f6406j4171K9129j9022L7982K5615N264J9148q728m2950l5887K6988k2994
6468f6032M2039Q8931L5809o9503k5524n4518k9268k2522j3836P9357O3180q475
6456A9638Q21P476m9793J2199N897j2748p840K1898M8505j2733l258q250j6453
6443E359O3910M733l3501m2873j7713J2335l2888n1319N309j3589L635n860q260
6430a10722k8965M266J5235L5840K681m484l4514k1149Q106P848q3985J2228J27660
6417f9955P9703j5969K398L6374l9929K8354k4609J0155J3147m6714n1973o340
$$ plain form
6405 -85358 -32644 -3432 5665 35768 50945 49618 48869 60630 23927 18269 38246 -11883 -49082
6392 -49082 -89522 -39867 11299 14595 -14022 -9272 31170 62123 50549 37617 48884 48881 -4619
6379 -4619 -16444 -37944 -42646 -15466 -46167 -74143 -86209 -81070 -18389 45950 6267 -1258 -13437
6366 -13437 -31487 -58881 -43900 15075 79344 66178 5931 -53581 -28253 -8714 -13204 -41420
6354 -41420 -83200 -39813 34742 47428 12803 60483 45775 46581 33079 1634 -37664 -15025
6342 -15025 18883 -33496 -54635 -20344 52474 22389 -15822 26116 36300 22668 -20994 -89997
6330 -89997 -97020 -76940 -30710 5571 66238 87831 31287 -28746 -39261 -18867 52915 94569
6318 94569 46962 56266 4713 -87891 -143554 -161748 -75886 -51992 -37343 -39789 -5769 59621
$$ packed form
6405h5358N2714K9212R097L0103J5177j327p49J1761l6703n658J9977n0129l7199
6392d9082m0440M9655N1166L296k8617M750M0442L0953j1574j2932J1267ln3500
6379d619j1825k1500m702K7180l0701k7976j2066N139O2681O4339l9683p525j2179
6366a3437j8050k7394J4981N8975O4269j3166o0247n9512K5328J9539m490k8216
6354d1420m1780M3387P4555J2686l4625M7680j4708Q06j3502l1445l9298K2639
6342a5025L3908n2379k1139L4291P2818l0085l8211M1938J0184j3632m3662o9003
6330h9997p023K0080M6230L6281O0667K1593n6544o0033j0515K0394P1782M1654
6318I4569m7607R304n1553r2604n5663j8194Q5862K3894J4649k446L4020O5390
$$ plain form
6306 59621 92215 79627 84935 84953 61338 34584 -16172 -32352 -132520 -158936 -110208 -116285 -146440
6293 -146440 -95538 -62039 -24695 10261 15512 9593 36430 -28652 -13956 -16479 -14515 -7207 -18689
6280 -18689 -31539 -16145 9603 -26232 -25625 16485 27084 12025 38577 41040 38961 7859 27961
6267 27961 9573 -38801 -55846 -88928 -84536 -79019 -76781 -58701 4374 39775 28404 -36820
6255 -36820 -55837 -42335 4499 18580 -33921 -83480 -65907 -68219 -30987 -42009 6406 22155
6243 22155 -18488 2703 -44889 -96156 -106866 -65952 31449 9702 -30366 -50624 -87078 -90339
6231 -90339 -73864 -101792 -89584 -29429 4496 -47988 -45104 -31897 -27245 26109 -6884 -57148
6219 -57148 -80890 -19040 4777 -31623 -7053 6848 205 22496 -4790 -29875 -3132 23300
$$ packed form
6306E9621L2594j2588N308J8k3615k6754n0756j6180j00168k6416M8728o077l0155
6293a46440N0902L3499L7344L4956N251n919K6837o5082J4696k523J964P308j1482
6280a8689j2850J5394K5748l5835O07M2110J0599j5059K6552K463k079l1102K0102
6267B7961j8388m8374j7045l3082M392N517K238J8080O3075L5401j1371o5224
6255c6820j9017J3502M6834J4081n2501m9559J7573k312L7232j1022M8415J5749
6243B2155m0643K1191m7592n1267j0710M0914R7401k1747m0068k0258l6454l261
6231i0339J6475k7928J2208O0155L3925n2484K884J3207M652N3354l2993n0264
6219e7148k3742O1850K3817l6400K4570J3901o643K2291k7286k5085K6743K6432
$$ plain form
6207 23300 47731 65827 44545 47747 65365 65677 88634 22330 -36823 -51950 -78076 -74073 -78723
6194 -78723 -4697 39458 16404 -4158 58122 10742 -61678 -95165 -79341 -25617 -58026 -108648
6182 -108648 -58936 -1019 24588 39436 3462 -16100 -36462 -22603 -9106 58376 109692 114348
6170 114348 36204 -25333 -38058 -38241 6058 26793 -9997 -34081 13618 61899 114597 80860
6158 80860 14007 1185 30212 53657 27417 33063 10013 5351 35502 17808 44541 43879 -38879
6145 -38879 -77107 -99107 -83698 -52844 -42000 -1616 -14509 -73922 -81453 -53297 -65943 -74191
6133 -74191 -44344 19037 62464 44518 56423 20271 -47540 -34609 -43836 -20402 18036 48820
6121 48820 35945 50365 57438 1645 -50166 3044 29255 100819 119918 98637 61131 22668
$$ packed form
6207B3300K4431J8096k1282L202J7618L12K2957o6304n9153j5127k6126M003m650
6194g8723P4026M4155k3054k0562O2280m7380p2420l3487J5824N3724l2409n0622
6182a08648M9712N7917K5607J4848l5974j9562k0362J3859J3497O7482N1316M656
6170A14348p8144o1537j2725j83M4299K0735l6790k4084M7699M8281N2698l3737
6158H0860o6853j2822K9027K3445k6240N646k3050m662L0151j7694K6733o62q2758
6145c8879l8228k2000J5409L0854J0844M0384j2893n9413p531K8156j2646q248
6133g4191K9847O3381M3427j7946J1905l6152o7811J2931r227K3434L8438L0784
6121D8820j2875J4420P073n5793n1811N3210K6211P1564J9099k1281l7506l8463
$$ plain form
6109 22668 -16720 -29791 -29840 -10857 35602 -7424 -54389 -28690 36067 34615 1306 26518 31036
6096 31036 73867 95357 121852 82484 94032 93537 55125 10526 4415 -51334 -52124 -8020 34202
6083 34202 76078 45026 4388 11253 52281 83803 78095 36271 20046 42715 75846 85464
6071 85464 32775 -11261 23982 45237 68379 81684 46988 48004 38530 16200 31614 96547
6059 96547 85192 69899 11158 -16206 -83396 -148445 -116972 -34436 -7650 -1891 -31980 -27122
6047 -27122 -49957 -95626 -92710 -37892 -28638 26171 125237 195761 141639 66634 27169 12341
6035 12341 12448 -32111 -81823 -20054 43038 30866 -4747 -45976 6668 36474 21254 54393
6023 54393 78073 59586 94923 53203 60962 3364 -53138 -30392 37375 21308 -31087 -46735
$$ packed form
6109B2668l9388j3071m9J8983M6459m3026m6965K5699O4757j452l3309K5212M518
6096C1036M2831K1490K6495l9368J1548m95l8412m4599o111n5749p90M4104M2222
6083C4202M1876l1052m0638O865M1028L1522n708m1824j6225K2669L3131R618
6071H5464n2689m4036L5243K1255K3142J3305l4696J016r474k2330J5414O4933
6059I6547j1355j5293n8741k7364o7190o5049L1473Q2536K6786N759l0089M858
6047b7122k2835m5669K916N4818R254N4809R9066P0524n4122p5005l9465j4828
6035A2341J07m4559m9712O1769O3092j2172l5613m1229N2644K9806j5220L3139
6023E4393K3680j8487L5337m1720P759n7598n6502K2746O7767j6067n2395j5648
$$ plain form
6011 -46735 -33909 18857 54852 25364 73643 84624 44305 24746 -49067 -134427 -118999 -78361
5999 -78361 -32534 43791 80836 36500 -49508 -33645 -4300 -48573 -32280 -60494 -53175 4671
5987 4671 55009 19896 -23761 -72984 -75374 -17760 -18240 -12044 -19895 -66183 -52198 -61152 -21068
5974 -21068 -24386 -63774 -37955 6767 1337 479 -1025 1173 2861 -29439 -51251 -50583 -36317 18922
5960 18922 -815 -6258 -78771 -117932 -65092 -51956 -10498 54233 48834 22079 8184 28015
5948 28015 24168 -27004 -44425 -26722 26647 3338 11010 32196 -26747 -45987 32196 5357
5936 5357 -7673 9028 25776 -33716 -76901 -60033 -24046 -66324 -106785 -108652 -64578 -2488
5924 -2488 61819 43861 44191 33584 -31577 -41592 14202 -13706 -30601 -59432 -87278 -75712
$$ packed form
6011d6735J2826N2766L5995k9488M8279J0981m0319j9559p3813q5360J5428M0638
5999g8361M5827P6325L7045m4336q6008J5863K9345m4273J6293k8214P319N7846
5987D671N0338l5113m3657m9223k390N7614m80O196p851m6288J3985q954M0084
5974b1068l318l9388K5819M4722n430q58j504K198J688l2300k1812O68J4266N5239
5960A8922j9737n443p2513l9161N2840J3136M1458O4731n399k6755j3895J9831
5948B8015l847n1172j7421J7703N3369k3309P672K1186n8943j9240P8183k6839
5936E357j3030J6701J6748n9492m3185J6868L5987m2278m0461j867M4074O2090
5924b488O4307j7958L30j0607o5161j0015N5794k7908j6895k8831k7846J1566
$$ plain form
5912 -75712 -4149 41108 61156 10831 -36733 -42279 -55848 -76166 -67571 -35599 -1081 -29605
5900 -29605 -69180 -70274 -86495 -75017 -40509 -39275 10371 27689 66177 103948 56539 21047
5888 21047 5624 22013 -9669 -37391 -18019 -38665 -70643 -55819 -11966 -8317 -70463 -129514
5876 -129514 -99902 -61925 -66839 -46650 -2363 3910 53169 48340 -28687 -58202 -39639 -47455
5864 -47455 -27706 9469 -32754 -95131 -107237 -88014 -30270 57978 25292 -5097 -7785 2879
5852 2879 -38384 -27554 -97897 -143617 -73251 -19562 10061 -2481 -59185 -38610 -9471 86619
5840 86619 108305 50818 -11371 -8475 -10428 -31728 -35030 -58913 -9862 38968 -45130 -87526
5828 -87526 -93010 -79809 -68775 -10766 -31871 -52662 -54174 -55555 -18899 -36311 -48478 -65797
$$ packed form
5912g5712P1563M5257K0048n0325m7564n546j3569k0318Q595L1972L4518k8524
5900b9605l9575j094j6221J1478L4508J234M9646J7318L8488L7771m7409l5492
5888B1047j5423J6389l1682k7722J9372k0646l1978J4824M3853L649o2146n9051
5876a29514K9612L7977m914K0189M4287O273M9259m829p7027k9515J8563p816
5864d7455J9749L7175m2223o2377j2106J9223N7744Q8248l2686l0389k688J0664
5852B879m1263J0830p0343m5720P0366N3689K9623j2542n6704K0575K9139R6090
5840H6619K1686n7487o2189K896j953k1300l302k3883M9051M8830q4098m2396
5828h7526n484J3201J1034N8009k1105k0791j512j381L6656j7412j2167j7319
$$ plain form
5816 -65797 -54276 -101297 -46580 14507 -1110 -37805 -109361 -92042 -63095 -34078 -10341 -64668
5804 -64668 -113542 -80883 -65423 -53698 -86263 -107872 -80173 -15571 -37174 -80812 -80904 -41864
5792 -41864 -17041 -5358 33142 8290 20113 30080 -59687 -84506 -57167 -57331 -95842 -46499
5780 -46499 -32453 30101 34422 -74 -13370 -9463 429 24090 62483 42804 2136 11892 -17014
5767 -17014 8033 -14148 -41598 -63537 -99198 -121636 -73067 -5718 30856 68106 60426 4776
5755 4776 -6915 -25638 10896 31463 7398 5346 2233 -54289 -87097 -80096 -23712 -32266 -14593
5742 -14593 -28646 -91822 -121448 -103281 -56528 -60235 -8160 -3744 25992 9084 9437 -14917 -13174
5729 -13174 9759 -14893 -60222 -91567 -43312 4390 -78 -13536 -46530 -59178 -75308 -87426
$$ packed form
5816f5797J1521m7021N4717O1087j5617l6695p1556J7319K8947K9017K3737n4327
5804f4668m8874L2659J5460J1725l2565k1609K7699O4602k1603m3638r2L9040
5792d1864K4823J1683L8500k4852J1823R967q9767k4819K7339j64l8511M9343
5780d6499J4046O2554M321l4496j3296L907R892K3661L8393j9679m0668R756k8906
5767a7014K5047k2181k7450k1939l5661k2438M8569O7349L6574L7250p680n5650
5755D776j1691j8723L6534K0567k4065k052l113n6522l2808P001N6384q554J7673
5742a4593j4053o3176k9626J8167M6753l707N2075M416K9736j6908L53k4354J743
5729a3174K2933k4652m5329l1345M8255M7702m468j3458l2994j2648j6130j2118
$$ plain form
5717 -87426 -39771 -34310 -36253 -48409 -46882 -79251 -68225 -13098 -43012 -76795 -95473 -108786
5705 -108786 -80702 -25395 -37092 -45513 -51410 22368 46313 100796 120451 85148 22688 -2548
5693 -2548 -20883 -62254 -84777 -45580 -1971 6265 -23077 -41377 -48391 -61341 -61646 -113501 -140412
5680 -140412 -69771 -410 21027 -5561 -33375 -56884 -24353 -13396 -23238 -8768 -20358 -11137
5668 -11137 -37517 -75959 -77111 -4244 8631 -105403 -138699 -109272 -66094 -14967 -21113 29062
5656 29062 24390 -42035 -14585 205 -57951 -23833 -16494 -42141 -39958 -28693 -42839 -82700
5644 -82700 -87609 -97426 -83882 10780 62398 62710 60080 7326 -33429 -102742 -84001 -86518 -87107
5631 -87107 -108860 -82608 -7930 20561 49361 86162 70610 40679 24880 43696 68862 78890
$$ packed form
5717h7426M7655N461j943j2156J527l2369J1026N5127k9914l3783j8678j3313
5705a08786K8084N5307j1697q421n897P3778K3945N4483J9655l5303o2460k5236
5693b548j8335m1371k2523L9197M3609Q236k9342j8300p014j2950l05n1855k6911
5680a40412P0641O9361K1437k6588k7814k3509L2531J0957r842J4470j1590R221
5668a1137k6380l8442j152P2867J2875j14034l3296K9427M3178N1127o146N0175
5656B9062m672o6425K7450J4790n8156L4118P339k5647K183J1265j4146l9861
5644h2700m909r817J3544R4662N1618L12k630n2754m0755o9313J8741k517n89
5631h7107k1753K6252P4678K8491K8800L6801j5552k9931j5799J8816K5166J0028
$$ plain form
5619 78890 65936 93818 31175 -56813 -47811 -71369 -49549 -28816 -59261 -19320 13078 41084
5607 41084 84517 89893 43234 92449 97956 112841 21324 -54266 -54782 -87664 -77130 -30235 -25822
5594 -25822 -90708 -40709 5311 35352 -770 -29350 -39707 -61479 -69819 -51541 -63697 -63457
5582 -63457 -39188 -18687 -19513 11836 53977 18392 34523 -28185 -29228 -15857 34931 45397
5570 45397 34261 -17103 -60376 -47757 -67902 -128300 -183225 -130503 -120485 -118445 -120128 -97461
5558 -97461 -35344 -31750 -42942 -72394 -53021 -28922 -32534 -38093 -45816 -16827 46050 42067 36419
5545 36419 27512 -21017 -4816 1297 25211 56923 93170 76860 24822 -4516 -31200 -62307
5533 -62307 -102759 -133816 -67053 57781 52569 56871 26723 61173 35824 61299 86004 30758
$$ packed form
5619G8890j2954K7882o2643q7988R002k3558K1820K0733l0445L9941L2398K8006
5607D1084M3433N376m6659M9215N507J4885r1517p5590n16l2882J0534M6895M413
5594b5822o4886M9999M6020L0041l6122k8580j0357k1772q340J8278j2156K40
5582f3457K4269K0501q26L1349M2141l5585J6131o2708j043J3371N0788J0466
5570D5397j1136n1364m3273J2619k0145o0398n4925N2722J0018K040j683K2667
5558i7461O2117L594j1192k9452J9373K4099l612n559p723K8989O2877l983n648
5545C6419q907m8529J6201O113K3914L1712L6247j6310n2038k9338k6684l1107
5533f2307m0452l1057O6763J24834n212M302l0148L4450k5349K5475K4705n5246
$$ plain form
5521 30758 -9992 3290 2244 -34555 -65832 -99313 -5649 8663 13317 -6868 -36323 -38739
5509 -38739 -34387 -11096 14001 11504 -73991 -91980 -91712 -32191 -34320 -13258 12773 22419 -11935
5496 -11935 -101556 -125254 -97711 -9563 -7955 -30618 -33661 -3577 1789 -18760 5765 -29121
5484 -29121 -3002 -24535 -12510 -36772 -49092 -92752 -65052 -15813 -64153 -77003 3480 68456
5472 68456 61780 27450 -4884 -79754 -61688 -29335 -26880 -16920 12799 -48256 -58158 -58052 -60055
5459 -60055 -24782 -20339 -62836 -71049 -68856 -65358 -64833 -30377 -60896 -38123 21729 16329 -20887
5446 -20887 -44654 -9715 -9812 18580 -7689 -74436 -94786 -66748 -12407 17215 6145 -18318
5434 -18318 -88085 -76001 -38641 11665 -18196 -42150 -23252 54548 49075 32917 -4014 -1218
$$ packed form
5521C0758m0750J3282j046l6799l1277l3481R3664J4312M654k0185k9455k416
5509c8739M352K3291K5097k497q5495j7989K68N9521k129K1062K6031R646l4354
5496a1935q9621k3698K7543Q8148J608k2663l043L0084N366k0549K4525l4886
5484b9121K6119k1533J2025k4262j2320m3660K7700M9239m8340j2850Q0483O4976
5472F8456o676l4330l2334p4870J8066L2353K455R960K9719o1055r902J06k003
5459f0055L5273M443m2497q213K193L498N25L4456l0519K2773N9852n400l7216
5446b0887k3767L4939r7K8392k6269o6747k0350K8038N4341K9622j1070k4463
5434a8318o9767J2084L7360N0306k9861k3954J8898P7800n473j6158l6931K796
$$ plain form
5422 -1218 -16286 -45736 -85245 -86278 -49699 -9474 -42393 -17866 -23386 5894 19102 2552
5410 2552 -21723 -73943 -71604 -69334 -89376 -1723 33216 12371 -23590 -2618 53302 81302
5398 81302 35198 11612 8033 24886 -39852 -69119 -36362 -13869 -36486 -33507 -45212 -15084
5386 -15084 -71063 -92647 -41244 21470 62159 55207 32540 13734 -48925 -32487 -64981 -83996
5374 -83996 -87395 -46897 -19343 10921 18121 46991 23649 41918 65719 95672 81815 44006
5362 44006 40991 60851 44058 61745 66593 39775 -3372 -56814 -32284 -24708 -35082 17658
5350 17658 8097 -19727 -21924 -43907 -7903 59706 8203 10673 45441 33986 76 -68557
5338 -68557 -105832 -108165 -113342 -74473 -25916 -41501 -46911 -17037 22482 24290 30513 54166 85336
$$ packed form
5422a218j5068k9450l9509j033L6579M0225l2919K4527n520K9280J3208j6550
5410B552k4275n2220K339K270k0042Q7653L4939k0845l5961K0972N5920K8000
5398H1302m6104k3586l579J6853o4738k9267L2757K2493k2617K979j1705L0128
5386a5084n5979k1584N1403O2714M0689o952k2667j8806o2659J6438l2494j9015
5374h3996l399M0498K7554L0264P200K8870k3342J8269K3801K9953j3857l7809
5362D4006l015J9860j6793J7687M848k6818m3147n3442K4530P576j0374N2740
5350A7658r561k7824k197k1983L6004O7609n1503K470L4768j1455l3910o8633
5338f8557l7275k333n177L8869M8557j5585n410K9874L9519J808O223K3653L1170
$$ plain form
5325 85336 56522 48910 41655 39665 74229 84697 21530 8271 9242 -23965 -68351 -82129 -23551
5312 -23551 9736 28107 31881 75179 88296 66855 80310 42384 16622 64923 51227 -3041
5300 -3041 -51954 -49872 -82958 -33868 13419 36979 9369 -21455 -51724 -37898 5730 -48119
5288 -48119 -63429 -27946 -27151 -23018 -45321 -61422 335 53103 44285 45385 62522 49862 672
5275 672 -36288 -49913 -23945 -13300 -72962 -125444 -89442 -53351 -2885 -24853 -78704 -66754
5263 -66754 -109891 -144724 -110641 -47919 21639 37694 -46679 -90716 -84539 -37003 52716 74074
5251 74074 71439 71667 99864 61385 14178 -26649 42690 87261 50427 29168 10875 64801
5239 64801 68628 33352 -24755 -70122 -88988 -40209 -47353 -97108 -60317 -23587 1882 35624
$$ packed form
5325H5336k8814p612p255j990L4564J0468o3167j3259R71l3207m4386j3778N8578
5312b3551L3287J8371L774M3298J3117k1441J3455l7926k5762M8301j3696n4268
5300c041m8913K082l3086M9090M7287K3560k7610l0824l0269J3826M3628n3849
5288d8119j5310L5483P95M133k2303j6101O1757N2768q818J100J7137j2660m9190
5275F72l6960j3625K5968J0645n9662n2482L6002L6091N0466k1968n3851J1950
5263f6754m3137l4833L4083O2722O9558J6055q4373m4037O177M7536Q9719K1358
5251G4074k635K28K8197l8479m7207m0827O9339M4571l6834k1259j8293N3926
5239F4801L827l5276n8107m5367j8866M8779p144m9755L6791L6730K5469L3742
$$ plain form
5227 35624 63400 7309 -6230 44517 61456 45266 8598 -16908 -66934 -117542 -117783 -156288
5215 -156288 -167557 -132771 -16585 4272 -16190 63236 72440 48180 51934 24970 -27748 -53202
5203 -53202 -2554 -46449 -52458 -74791 -71691 -64572 -22760 -11555 10766 63902 80369 48717
5191 48717 37498 48731 21991 -1780 -6344 -17587 4328 -19058 -23376 7266 41224 36813
5179 36813 51909 47070 20708 48854 3915 -40978 -37526 -15838 -27118 -40888 -42364 -25122
5167 -25122 -49486 -10014 31599 17180 23268 -18369 -30396 -19894 66172 69274 40410 20347
5155 20347 -13528 -21075 -37260 -51168 -59996 -10736 -8871 -1287 42970 63204 42567 -9106 -34120
5142 -34120 -21265 -56885 -93385 -42601 10028 -27989 -80618 -30302 67628 23485 -47729 -15753
$$ packed form
5227C5624K7776n6091j3539N0747J6939j6190l6668k5506n0026n0608k41l8505
5215a56288j1269L4786J16186K0857k0462P9426R204k4260L754k6964n2718k5454
5203e3202N0648m3895o009k2333L100P119M1812J1205K2321N3136J6467l1652
5191D8717j1219J1233k6740k3771m564j1243K1915k3386m318L0642L3958m411
5179C6813J5096m839k6362K8146m4939m4893L452K1688j1280j3770j476J7242
5167b5122k4364L9472M1613j4419O088m1637j2027J0502Q6066L102k8864k0063
5155B0347l3875p547j6185j3908q828M9260J865P584M4257K0234k0637n1673k5014
5142c4120J2855l5620l6500N0784N2629l8017n2629N0316R7930m4143p1214L1976
$$ plain form
5130 -15753 -750 -1459 10878 -44586 -64624 -26957 -28637 -63717 -91423 -121959 -81759 17455
5118 17455 20327 49499 46807 15554 38662 4830 -4374 -41437 -78197 -31525 10456 -14586
5106 -14586 -18804 3511 -41246 -31729 3279 -9592 28852 41226 53879 75057 120673 102443
5094 102443 90557 -14688 -98542 -48752 -5887 19562 47101 80957 58901 51866 59080 41655
5082 41655 -2160 -25020 -18962 -3033 -24552 -60798 -76126 -45792 -23057 -11147 24385 13198
5070 13198 12538 15821 -12456 -18318 -18624 26064 -25714 -94426 -37855 11051 3297 3237 14588 -17590
5056 -17590 -18047 11552 26838 13866 -5621 -954 -1118 -16705 -12061 42070 65232 41637 -30590
5043 -30590 -62157 -61733 -43473 -21882 -11050 18312 -2857 17973 35504 42102 30161 22419 50873
$$ packed form
5130a5753J5003p09J2337n5464k0038L7667j680l5080k7706l0536M0200R9214
5118A7455K872K9172k692l1253K3108l3832r204l7063l6760M6672M1981k5042
5106a4586m218K2315m4757R517L5008j2871L8444J2374J2653K1178M5616j8230
5094A02443j1886j05245q3854M9790M2865K5449K7539L3856k2056p035P214j7425
5082D1655m3815k2860O058J5929k1519l6246j5328L0334K2735J1910L5532j1187
5070A3198o60L283k8277n862l06M4688n1778o8712N6571M8906p754o0J1351l2178
5056a7590m57K9599J5286j2972j9487M667j64j5587M644N4131K3162k3595p2227
5043c0590l1567M24J8260K1591J0832K9362k1169K0830J7531O598j1941p742K8454
$$ plain form
5030 50873 33431 -23043 -23144 -17998 -15158 43301 51550 -21837 -19800 -9302 2653 -518 22285
5017 22285 47315 23749 -47915 -36986 17413 4778 -19604 3406 38363 27836 -7936 -26911
5005 -26911 12862 52155 60468 41171 67655 57191 51020 -10490 -51325 -65578 -74727 -21138
4993 -21138 26760 -2207 7396 17953 -29920 -394 7673 25338 -11715 -4384 -15902 -75916
4981 -75916 -104066 -103510 -69105 -46904 -46940 -6563 -2897 4009 13279 3072 -41995 -84514 -20036
4968 -20036 -7392 -19828 -30922 -83934 -110086 -67857 21317 38100 30576 19280 -15699 -11462
4956 -11462 -43005 -64663 -37070 -79221 -58627 -43509 -47308 -28949 -75117 -13364 -37989 -51263
4944 -51263 -63273 -106673 -121190 -64998 -7462 65081 146844 144533 88491 65800 -9439 -91721
$$ packed form
5030E0873j7442n6474j01N146K840N8459Q249p3387K037J0498J1955l171K2803
5017B2285K5030k3566p1664J0929N4399j2635k4382K3010L4957j0527l5772j8975
5005b6911L9773L9293Q313j9297K6484j0464o171o1510m0835j4253r149N3589
4993b1138M7898k8967R603J0557m7873K9526Q067J7665l7053P331j1518o0014
4981g5916k8150N56L4405K2201l6M0377L666O906R270j0207m5067m2519O4478
4968b0036J2644j2436j1094n3012k6152M2229Q9174J6783p524j1296l4979M237
4956a1462l1543k1658K7593m2151K0594J5118l799J8359m6168O1753k4625j3274
4944e1263j2010m3400j4517N6192N7536P2543Q1763k311n6042k2691p5239q2282
$$ plain form
4932 -91721 -102977 -85616 -51494 -68201 -74558 -31805 -35615 -38940 -23437 -6272 -20242 -55474
4920 -55474 3829 60141 89105 19194 -11403 -8785 8989 -26909 -45888 -40128 -18440 -14503
4908 -14503 -44650 -69357 -69570 -66570 -22327 19717 68057 -1533 -40631 -50367 -56528 -58631 -57216
4895 -57216 -36236 864 -22466 -45166 -97206 -89291 -65397 -60709 -1075 37785 10044 54864
4883 54864 75893 62239 49233 -8779 -1911 68041 49267 -6219 7263 -2393 -6602 54321
4871 54321 72465 48594 66542 64506 85317 61140 87977 125533 113265 68856 25370 41212
4859 41212 66180 55009 76164 32950 7834 7339 3859 19617 70931 92480 73491 39931
4847 39931 46264 -12987 -75485 -92028 -72781 -70327 -32872 21906 -5525 -34109 -24564 16408
$$ packed form
4932i1721j1256J7361L4122j6707o357M2753l810l325J5503J7165j3970l5232
4920e5474N9303N6312K8964o9911l0597K618J7774l5898j8979N760K1688L937
4908a4503l0147k4707k13L000M4243M2044M8340o9590l9098r736o161k103J415
4895e7216K0980L7100k3330k2700n2040P915K3894M688N9634L8860k7741M4820
4883E4864K1029j3654j3006n8012O868O9952j8774n5486J3482r656m209O0923
4871E4321J8144k3871J7948k036K0811k4177K6837L7556j2268m4409m3486J5842
4859D1212K4968j1171K1155m3214k5116m95l480J5758N1314K1549j8989l3560
4847C9931O333n9251o2498j6543J9247K454L7455N4778k7431k8584R545M0972
$$ plain form
4835 16408 1130 -44682 -28378 -3260 -18061 -31901 -26309 2607 15091 -41209 -114484 -134632
4823 -134632 -102733 -24165 17618 3521 -20064 -45812 -3976 -7847 -46945 -11182 -41363 -97512
4811 -97512 -57869 -20983 6666 -34358 -109075 -128534 -95659 -123629 -126246 -67879 -51934 -44803
4799 -44803 -62133 -101409 -132352 -101513 -98902 -114646 -115438 -106881 -77138 -32808 -13562 -50875 -87640
4786 -87640 -138396 -111366 -2863 -3820 -17666 21767 36300 62991 59914 16318 -19815 -12876
4774 -12876 -16742 27534 40868 31760 -19069 12183 21210 -14142 40013 56346 65573 8988 -19849
4761 -19849 -16520 15988 42936 53783 42119 39708 7002 2337 21852 19462 53480 89702 62592
$$ packed form
4835A6408j5278m5812J6304K5118j4801j3840N592K8916J2484n6300p3275k0148
4823a34632L1899P8568M1783j4097k3585k5748M1836l871l9098L5763l0181n6149
4811i7512L9643L6886K7649m1024p4717j9459L2875k7970k617N8367J5945P131
4799d4803j7330l9276l0943L0839K611j5744p92Q557K9743M4330J9246l7313l6765
4786h7640n0756K7030J08503r57j3846L9433J4533K6691l077m3596l6133O939
4774a2876l866M4276J3334r108n0829L1252R027l5352N4155J6333R227n6585k8837
4761a9849L329L2508K6948J0847j1664k411l2706m665J9515k390L4018L6222k7110
$$ [...]
##END NTUPLES=NMR SPECTRUM
##END=
