##TITLE=Analysis number 329278
Compound Code cc 58346
Book Reference 467/182
Project Code adrs
Chemist Name benw
##JCAMPDX= 6.0         $$ Bruker NMR JCAMP-DX V2.0
##DATA TYPE= NMR SPECTRUM
##DATA CLASS= NTUPLES
##ORIGIN= Bruker BioSpin GmbH
##OWNER= nmr
$$ XWIN-NMR		Version 3.5
$$ Thu Aug 16 09:31:38 2007 GMT Daylight Time (UT+1h)  MAYBRIDGE\nmr@NMR_250MHZ
##.OBSERVE FREQUENCY= 250.131544655141
##.OBSERVE NUCLEUS= ^1H
##.ACQUISITION MODE= SIMULTANEOUS (DQD)
##.ACQUISITION SCHEME= undefined
##.AVERAGES= 16
##.DIGITISER RES= 18
##SPECTROMETER/DATA SYSTEM= dpx250
##.PULSE SEQUENCE= zg30
##.SOLVENT NAME= CDCl3
##.SHIFT REFERENCE= (INTERNAL, CDCl3, 0, 16.522)
##AUDIT TRAIL= $$ (NUMBER, WHEN, WHO, WHERE, WHAT)
$$ ##TITLE= Audit trail, XWIN-NMR		Version 3.5
$$ ##JCAMPDX= 5.01
$$ ##ORIGIN= Bruker BioSpin GmbH
$$ ##OWNER= nmr
$$ C:\u/data/dgb/nmr/ADRS/730/pdata/1/auditp.txt
$$ ##AUDIT TRAIL=  $$ (NUMBER, WHEN, WHO, WHERE, WHAT)
(   1,<2007-08-16 09:31:15.86 +100>,<MAYBRIDGE\nmr>,<NMR_250MHZ>,
      <created by zg, POWCHK disabled, PULCHK disabled
       configuration hash MD5:
       76 6E 9A 78 1E 09 19 81 EC 84 63 8F B0 6A 59 2D
       data hash MD5: 64K
       34 2A EA A4 A9 16 B1 69 85 C9 50 BF 74 FC 6A 48>)
(   2,<2007-08-16 09:31:28.44 +100>,<MAYBRIDGE\nmr>,<NMR_250MHZ>,
      <Start of raw data processing
       ef LB = 0.3 FT_mod = 6 PKNL = 1 SI = 32K 
       data hash MD5: 32K
       A8 A3 8A 07 DF A8 B0 F6 23 6E BE 10 9D F8 43 D5>)
(   3,<2007-08-16 09:31:30.13 +100>,<MAYBRIDGE\nmr>,<NMR_250MHZ>,
      <apk 
       data hash MD5: 32K
       96 AA 2B 70 4A D8 D8 E9 F1 9E 10 B0 EE 96 B7 4F>)
(   4,<2007-08-16 09:31:30.90 +100>,<MAYBRIDGE\nmr>,<NMR_250MHZ>,
      <abs ABSG = 5 
       data hash MD5: 32K
       16 2A 61 50 36 2D C2 F3 FE D5 0E C3 71 03 6B 15>)
$$ ##END=
$$ 
$$ hash MD5
$$ BA 4A 6C 30 C3 70 96 9F D4 6A A1 9F CF CC C1 4E
##$RELAX= 
##$RELAX= 
##$RELAX= 
##$RELAX= 
##$RELAX= 
##$RELAX= 
##$RELAX= 
$$ Bruker specific parameters
$$ --------------------------
##$DU= <C:\u>
##$EXPNO= 730
##$NAME= <ADRS>
##$PROCNO= 1
##$TYPE= <nmr>
##$USER= <dgb>
##$AMP= (0..31)
100 100 100 100 100 100 100 100 100 100 100 100 100 100 100 100 100 100 
100 100 100 100 100 100 100 100 100 100 100 100 100 100 
##$AQSEQ= 0
##$AQ_mod= 3
##$AUNM= <au_zg>
##$AUTOPOS= <4 >
##$BF1= 250.13
##$BF2= 250.13
##$BF3= 250.13
##$BF4= 250.13
##$BF5= 500.13
##$BF6= 500.13
##$BF7= 500.13
##$BF8= 500.13
##$BYTORDA= 1
##$CFDGTYP= 0
##$CFRGTYP= 5
##$CHEMSTR= <none>
##$CNST= (0..31)
1 1 145 1 1 1 1 1 1 1 1 1 1 1 1 1 1 1 1 1 1 1 1 1 1 1 1 1 1 1 1 1 
##$CPDPRG= <>
##$CPDPRG1= <>
##$CPDPRG2= <>
##$CPDPRG3= <>
##$CPDPRG4= <mlev>
##$CPDPRG5= <mlev>
##$CPDPRG6= <mlev>
##$CPDPRG7= <mlev>
##$CPDPRG8= <mlev>
##$CPDPRGB= <>
##$CPDPRGT= <>
##$D= (0..31)
0 1 0 0 0 0 0 0 0 0.06 0 0 0 0 0 0 0.0002 0 0 0 0 0 0 0 0 0 0 0 0 0 0 
0 
##$DATE= 1187253074
##$DBL= (0..7)
120 120 120 120 120 120 120 120 
##$DBP= (0..7)
150 150 150 150 150 150 150 150 
##$DBP07= 0
##$DBPNAM0= <>
##$DBPNAM1= <>
$$ [...]
##$SUBNAM7= <"">
##$SUBNAM8= <"">
##$SUBNAM9= <"">
##$SW= 20.6930455092707
##$SWIBOX= (0..15)
0 0 3 0 0 0 0 0 0 0 0 0 0 0 0 0 
##$SW_h= 5175.983436853
##$TD= 65536
##$TD0= 1
##$TE= 296.16
##$TE2= 300
##$TE3= 300
##$TEG= 300
##$TL= (0..7)
0 120 120 120 120 120 120 120 
##$TP= (0..7)
150 150 150 150 150 150 150 150 
##$TP07= 0
##$TPNAME0= <>
##$TPNAME1= <>
##$TPNAME2= <>
##$TPNAME3= <>
##$TPNAME4= <>
##$TPNAME5= <>
##$TPNAME6= <>
##$TPNAME7= <>
##$TPOAL= (0..7)
0.5 0.5 0.5 0.5 0.5 0.5 0.5 0.5 
##$TPOFFS= (0..7)
0 0 0 0 0 0 0 0 
##$TUNHIN= 0
##$TUNHOUT= 0
##$TUNXOUT= 0
##$USERA1= <user>
##$USERA2= <user>
##$USERA3= <user>
##$USERA4= <user>
##$USERA5= <user>
##$V9= 5
##$VALIST= <valist>
##$VCLIST= <CCCCCCCCCCCCCCC>
##$VD= 0
##$VDLIST= <DDDDDDDDDDDDDDD>
##$VPLIST= <PPPPPPPPPPPPPPP>
##$VTLIST= <TTTTTTTTTTTTTTT>
##$WBST= 1024
##$WBSW= 4
##$XGAIN= (0..3)
0 0 0 0 
##$XL= 0
##$YL= 0
##$YMAX_a= 411549
##$YMIN_a= -408602
##$ZGOPTNS= <>
##$ZL1= 120
##$ZL2= 120
##$ZL3= 120
##$ZL4= 120
##$ABSF1= 16.522
##$ABSF2= -4.171173
##$ABSG= 5
##$ABSL= 3
##$ALPHA= 0
##$AQORDER= 0
##$ASSFAC= 0
##$ASSFACI= 0
##$ASSFACX= 0
##$ASSWID= 0
##$AUNMP= <proc_1d>
##$AZFE= 0.1
##$AZFW= 0.1
##$BCFW= 0
##$BC_mod= 0
##$BYTORDP= 0
##$COROFFS= 0
##$CY= 12.5
##$DATMOD= 1
##$DC= 0
##$DFILT= <>
##$DTYPP= 0
##$F1P= 14.0000005364418
##$F2P= -0.99999901652339
##$FCOR= 0.5
##$FTSIZE= 32768
##$FT_mod= 6
##$GAMMA= 0
##$GB= 0
##$INTBC= 1
##$INTSCL= 1
##$ISEN= 128
##$LB= 0.3
##$LEV0= 0
##$LPBIN= 0
##$MAXI= 10000
##$MC2= 0
##$MEAN= 0
##$ME_mod= 0
##$MI= 0
##$NCOEF= 0
##$NC_proc= -3
##$NLEV= 6
##$NOISF1= 0
##$NOISF2= 0
##$NSP= 0
##$NTH_PI= 0
##$NZP= 0
##$OFFSET= 16.522
##$PC= 1
##$PHC0= -44.73728
##$PHC1= 7.594312
##$PH_mod= 1
##$PKNL= yes
##$PPARMOD= 0
##$PSCAL= 4
##$PSIGN= 0
##$REVERSE= no
##$SF= 250.13
##$SI= 32768
##$SIGF1= 0
##$SIGF2= 0
##$SINO= 400
##$SIOLD= 32768
##$SREGLST= <1H.CDCl3>
##$SSB= 0
##$STSI= 32768
##$STSR= 0
##$SW_p= 5175.98343685301
##$SYMM= 0
##$S_DEV= 0
##$TDeff= 65536
##$TDoff= 0
##$TI= <Analysis number 999999
Compound Code 99
Book Reference 9
Project Code 9>
##$TILT= no
##$TM1= 0
##$TM2= 0
##$TOPLEV= 0
##$USERP1= <user>
##$USERP2= <user>
##$USERP3= <user>
##$USERP4= <user>
##$USERP5= <user>
##$WDW= 1
##$XDIM= 32768
##$YMAX_p= 418535453
##$YMIN_p= -118792
$$ End of Bruker specific parameters
$$ ---------------------------------
##NTUPLES= NMR SPECTRUM
##VAR_NAME=  FREQUENCY,     SPECTRUM/REAL,   SPECTRUM/IMAG
##SYMBOL=    X,             R,               I
##VAR_TYPE=  INDEPENDENT,   DEPENDENT,       DEPENDENT
##VAR_FORM=  AFFN,          ASDF,            ASDF
##VAR_DIM=   32768,         32768,           32768
##UNITS=     HZ,            ARBITRARY UNITS, ARBITRARY UNITS
##FACTOR=    0.157963299565203, 1,           1
##FIRST=     4132.6476996994, 0,             0
##LAST=      -1043.33573715361, 0,           0
##MIN=       -1043.33573715361, -118792,     0
##MAX=       4132.6476996994, 418535453,     0
$$ Real data points
##PAGE= N=1
##DATA TABLE= (X++(R..R)), XYDATA
$$ [...]
##PAGE= N=2
##DATA TABLE= (X++(I..I)), XYDATA
15270A753575P554J6219L64o544j66P852n059j4236l948o719m842L063J0897j3070
15256A744940q80J1641L152n34J1861J9513J2542J2228j0674j7518L780m567j218
15243A784266P125K6863J7738L127K938O194j7033L746L108J6103l572k1965M342
15230A832980k895N255J1316J2599J4260R92j1332o285J5762Q626P243J384k510
15217A887395J7945N81q634J0322M3N765Q5j431N73j3919J1396J0494K2791l837
15203A939569r399N905j216J6264K630K160k0116N100J3421O464J4357J1855J3355
15190B000349M919L544J0741N112L617N25J273P305K820O678J0960P37K007j659
15176B058928N64R869N581o503n785k662P827J4097K622q694N941J3635m263m580
$$ plain form
15270 1753575 1761129 1777348 1777712 1771168 1771002 1778854 1773795 1759559 1755611 1748892 1744050 1747113 1758010 1744940
15256 1744940 1744060 1755701 1758853 1758319 1770180 1789693 1802235 1814463 1803789 1786271 1790051 1785484 1784266
15243 1784266 1791391 1818254 1835992 1839119 1842057 1848251 1831218 1834964 1838072 1854175 1850603 1828638 1832980
15230 1832980 1830085 1835340 1846656 1859255 1873515 1874507 1863175 1856890 1872652 1881278 1888521 1889905 1887395
15217 1887395 1905340 1905921 1897287 1907609 1907652 1913417 1913502 1912071 1912644 1898725 1910121 1920615 1943406 1939569
15203 1939569 1930170 1936075 1934859 1951123 1953753 1955913 1935797 1940897 1954318 1960782 1975139 1986994 2000349
15190 2000349 2005268 2008812 2019553 2024665 2028282 2028807 2030080 2037385 2040205 2046883 2057843 2058580 2060587 2058928
15176 2058928 2059492 2069361 2074942 2068439 2062654 2059992 2067819 2081916 2084538 2075844 2081785 2095420 2091157 2086577
15162B086577P859P249n369m766L231L384J3753R501J4695J3413R728J491n489
15149B155257J3028J6840r1N664J3714O173O09M746K402K068N790J0324m001p728
15135B224795k992J6233J3109O355J4174J4681o601N979m59p037M06J2274J6139
15122B307056Q069M962M415N322k366J4486K7353n850l646n448Q278K2342Q360
15109B393333l246J816j517j677n29R549Q251k618J1090J1304J1104N590P938
15096B450388J7077O054j385l259M823l853J1609J5693N170k69M845J8846Q832
15083B534571K1570J7471J0499J0997M099J790l078M541n984q786J6119J5828
15071B619637J2713J8725J8345K3514J1532J9215N341J904K41L053J5848J2215
$$ plain form
15162 2086577 2094436 2101685 2096316 2091550 2094781 2098165 2111918 2121419 2136114 2149527 2159255 2160746 2155257
15149 2155257 2168285 2185125 2185034 2190698 2204412 2210585 2211194 2215940 2218342 2220410 2226200 2236524 2232523 2224795
15135 2224795 2221803 2238036 2251145 2257500 2271674 2286355 2279754 2285733 2285274 2278237 2278643 2290917 2307056
15122 2307056 2315125 2320087 2324502 2329824 2327458 2341944 2369297 2363447 2359801 2354353 2362631 2384973 2393333
15109 2393333 2390087 2391903 2390386 2388709 2388180 2397729 2405980 2403362 2414452 2425756 2436860 2442450 2450388
15096 2450388 2467465 2473519 2472134 2468875 2473698 2469845 2481454 2497147 2502317 2502048 2506893 2525739 2534571
15083 2534571 2556141 2573612 2584111 2595108 2599207 2600997 2597919 2602460 2596476 2587690 2603809 2619637
15071 2619637 2632350 2651075 2669420 2692934 2704466 2723681 2729022 2730926 2731167 2734220 2750068 2762283
15059B762283O442k215N716K3666J168K027R187Q022K946J2788J4994J4439K4791
15046B886254J8235N131O288K2554K705Q408K0969K0781K0684J8311L232J1202
15034C044754K3688J984P350J3376N254j115J4378K1049K1493K5800l973K215
15022C176253J8182K0117K6316J7457K2445J5655l34R629K6172L1392J8000K7380
15010C408664K3847K7594J8151J3485Q061Q740J8905K7107K0505K4625K6457J5719
14998C641860J6786J2604J6297K0765K2176L6730M3069J7128K0755L6211L2175
14987C916556L7552L8652K2081K3536M5052N9220L2865K2471Q392J5837J4537
14976D236751K3426L9397M5054M4219M0219L7367L9437N5316M8330L5498N1684
$$ plain form
15059 2762283 2768725 2766510 2772226 2795892 2797060 2799087 2808274 2816296 2819242 2832030 2847024 2861463 2886254
15046 2886254 2904489 2909620 2915908 2938462 2941167 2949575 2970544 2991325 3012009 3030320 3033552 3044754
15034 3044754 3068442 3070426 3077776 3091152 3096406 3095291 3109669 3130718 3152211 3178011 3174038 3176253
15022 3176253 3194435 3214552 3240868 3258325 3280770 3296425 3296091 3305720 3331892 3363284 3381284 3408664
15010 3408664 3432511 3460105 3478256 3491741 3499802 3508542 3527447 3554554 3575059 3599684 3626141 3641860
14998 3641860 3658646 3671250 3687547 3708312 3730488 3767218 3810287 3827415 3848170 3884381 3916556
14987 3916556 3954108 3992760 4014841 4038377 4083429 4142649 4175514 4197985 4206377 4222214 4236751
14976 4236751 4260177 4299574 4344628 4388847 4429066 4466433 4505870 4561186 4609516 4645014 4696698
14965D696698N9544O8314N4344N8449P1257P1764P6628O8540P1780O5789O7256
14954E430363Q7028R1219Q5407R1259J08923J15103J29909J48523J60539J77782
14944F626055J99729K14374K40271K68050K96113L17002K76999J59740m8418k90632
14934H259283n00859p23657r20187q66972o28387m41321k32253N3744K57012L57847
14924D614250L74283L80044L63674L79538M01145M15512M43402M64532N13121
14915H349501N60109O02375O15966N49566K98772j76233p06570j130326j604712
14906G358448k004351j877167j357418r05859m62340N9609M37016O14879O54463
14897B517280O45167O01475N89416O10245O20171O24576O59238P07556P51872
$$ plain form
14965 4696698 4756242 4824556 4878900 4937349 5008606 5080370 5156998 5225538 5297318 5363107 5430363
14954 5430363 5517391 5608610 5694017 5785276 5894199 6009302 6139211 6287734 6448273 6626055
14944 6626055 6825784 7040158 7280429 7548479 7844592 8161594 8438593 8598333 8549915 8259283
14934 8259283 7758424 7034767 6114580 5247608 4619221 4177900 3945647 3999391 4256403 4614250
14924 4614250 4988533 5368577 5732251 6111789 6512934 6928446 7371848 7836380 8349501
14915 8349501 8909610 9511985 10127951 10677517 10976289 10800056 10093486 8963160 7358448
14906 7358448 5354097 3476930 2119512 1213653 751313 810922 1247938 1862817 2517280
14897 2517280 3162447 3763922 4353338 4963583 5583754 6208330 6867568 7575124 8326996
14888H326996Q03056Q63903Q83604P89220N12384N4535n55315j345791k054909
14879H277683k439147k666886k585174j878575j065085m92290J13380O41537R07815
14870a186742R36004R06803Q87076Q82249Q70586Q84430R18735R58742J011736
14861G069619J080473J176531J243644J182157Q06402o5017j229652k159269l011891
14852F092997m039984m292377l302883k265260j460628m08447N94899J087115
14844g994568J168060J096650J034161R79992R38182Q91594Q91763Q91427Q97305
14835G94566R11175R68155R98868R67391P82181L56741k61268r20687j654787
14826B942335k420459k712206k526291k224967j649867q24265j65144L21134O83153
$$ plain form
14888 8326996 9130052 9993955 10877559 11666779 12179163 12233698 11678383 10332592 8277683
14879 8277683 5838536 3171650 586476 -1292099 -2357184 -2849474 -2736094 -2094557 -1186742
14870 -1186742 -250738 656065 1543141 2425390 3295976 4180406 5099141 6057883 7069619
14861 7069619 8150092 9326623 10570267 11752424 12558826 12493809 11264157 9104888 6092997
14852 6092997 2053013 -2239364 -5542247 -7807507 -9268135 -9676582 -9081683 -7994568
14844 -7994568 -6826508 -5729858 -4695697 -3715705 -2777523 -1885929 -994166 -102739 794566
14835 794566 1705741 2673896 3672764 4640155 5422336 5779077 5517809 4597122 2942335
14826 2942335 521876 -2190330 -4716621 -6941588 -8591455 -9415720 -9580864 -9259730 -8576577
14817h576577Q34510Q24024P98484P43038O88706O68123O57495O49008O51214
14808b061975O52479O72168P08111P40476P23533N84230K29055l36775q92845
14799A018457j321537j816204k198451j881289j268193q35655l89533J60480N17805
14790h014120O40202O12450N79241N16593M72019M47843M39020M21549M05833
14781c479370M10384M19865M03987L79174L09141J36373j43352m08295o14643
14772b586736q36039r76623q43937n82204l62934j36223R3657K34489K88868L01549
14762e406133K76988K32841K08979K10779J93631J81193J46040J28532J04954
14753c722196J09793J22985J11864J04103R5131Q7806P9382P5346N9274O5265
$$ plain form
14817 -8576577 -7742067 -6918043 -6119559 -5376521 -4687815 -4019692 -3362197 -2713189 -2061975
14808 -2061975 -1409496 -737328 -29217 711259 1434792 2019022 2248077 1911302 1018457
14799 1018457 -303080 -2119284 -4317735 -6199024 -7467217 -8302872 -8692405 -8531925 -8014120
14790 -8014120 -7373918 -6761468 -6182227 -5665634 -5193615 -4745772 -4306752 -3885203 -3479370
14781 -3479370 -3068986 -2649121 -2245134 -1865960 -1556819 -1420446 -1563798 -1972093 -2586736
14772 -2586736 -3422775 -4399398 -5243335 -5825539 -6188473 -6324696 -6231039 -5996550 -5707682 -5406133
14762 -5406133 -5129145 -4896304 -4687325 -4476546 -4282915 -4101722 -3955682 -3827150 -3722196
14753 -3722196 -3612403 -3489418 -3377554 -3273451 -3178320 -3090514 -3011132 -2935786 -2876512 -2811247
14743b811247Q1194P1607O7040M6330N5084O4692N5064O4647M7212M7272L2392
14732b178713K9941M9861N0109L5072M2564M1628R043K9679L7701L4027L5198
14721a783890M5244M6651M8606L8678K0319J1811K5102K5701K7891K4930K1975
14710a446982L2895L2608J1225P616K8198L2900K6108J6745J0255N897J3104L0171
14698a199260L2306J4662K7865K5493M750K2225K8534K2196J8062J5109N423O615
14686i76020J6659K8883K4917J9625J6150J7053J2318p496J2538L4218L2363J0448
14674g58344J454J0469J8261K2043J8417L949l314J0095K0339L1602L374K9K0892
14661f00734J6695j176J3974J1756L292J5532N129K852J1089J5289J0062K7196
$$ plain form
14743 -2811247 -2730053 -2658446 -2591406 -2545076 -2489992 -2425300 -2370236 -2305589 -2258377 -2211105 -2178713
14732 -2178713 -2148772 -2098911 -2048802 -2013730 -1971166 -1929538 -1920495 -1890816 -1853115 -1819088 -1783890
14721 -1783890 -1738646 -1691995 -1643389 -1604711 -1584392 -1572581 -1547479 -1521778 -1493887 -1468957 -1446982
14710 -1446982 -1414087 -1381479 -1370254 -1362638 -1334440 -1301540 -1275432 -1258687 -1248432 -1242535 -1229431 -1199260
14698 -1199260 -1166954 -1152292 -1124427 -1098934 -1094184 -1071959 -1043425 -1021229 -1003167 -988058 -982635 -976020
14686 -976020 -959361 -930478 -905561 -885936 -869786 -852733 -840415 -847911 -835373 -801155 -768792 -758344
14674 -758344 -756890 -746421 -728160 -706117 -687700 -683751 -687065 -676970 -656631 -625029 -621655 -621626 -600734
14661 -600734 -584039 -585215 -571241 -559485 -556193 -540661 -535532 -532680 -521591 -506302 -496240 -469044
14649d69044J4711l093R98K3214N704J3683K3264L628p419J1226K8278J4255k369
14636c42964M753m771n95J8862K0524L177R233R438J4093J3643J1837L164J947
14623b37659q191K71J7664K9304K6134R108O643j879L455J0724R47J6886K339
14610a24254q73L709R072J0409P158R660J4802J3972m195n688k449K2810K1475
14597b4392k411M772M684O08n164J7643L205n788M691K3507J4651R956J997N769
14583E3728Q077J8226N661j2526K353Q489J3056Q274M713M186Q228J0820N546
14570A38831O445P945M093m113J7182J1049J1300O491j657O385l818J569k873
14557A98829l21m944J0254N210P346J429J5560J8601p21K043Q776R525R287K476
$$ plain form
14649 -469044 -454333 -457426 -456428 -433214 -427510 -413827 -390563 -386935 -394354 -383128 -354850 -340595 -342964
14636 -342964 -338211 -342982 -343577 -324715 -304191 -301014 -291781 -282343 -268250 -254607 -242770 -239606 -237659
14623 -237659 -245850 -245579 -227915 -198611 -172477 -163369 -156726 -158605 -155150 -144426 -143479 -126593 -124254
14610 -124254 -125127 -121418 -112346 -101937 -94779 -85119 -70317 -56345 -60540 -66228 -68677 -45867 -24392
14597 -24392 -26803 -22031 -17347 -16739 -21903 -4260 -1055 -6843 -2152 21355 36006 45962 47959 53728
14583 53728 61805 80031 85692 73166 75519 84008 97064 105338 110051 114237 122465 133285 138831
14570 138831 145276 153221 157314 153201 170383 181432 192732 199223 197566 203951 200133 201702 198829
14557 198829 198508 193564 203818 209028 216374 217803 233363 251964 251243 253286 262062 271587 280874 283350
14543B83350K929O709M981n981J3o582N648N076o914O848N108L557J1160J2348
14529C28250n540R715J9342N315Q656J7582O316n465j642J0379R72m697M384k614
14515C90953J361J6451J698P08R850j3093J3797K239J438k076M743P755K2664
14502D58488J6414J546O685O195j2887o787p223L352K275R519J3012M766j4424
14489D80931J0286J8346L118J381O215l069l914J507K719Q207R95j4128p026K0592
14475E26160J2095N289K1704J1537J862k120L346J1966n508o748j0925Q482J2210
14462E89350Q168P996O691m085q499R025O633L179p968q895R059M314o717K450
14448F10701J0544J8307J0447Q906J9181L273r293O845Q427M640J1915q333j0931
$$ plain form
14543 283350 286279 292988 297969 291988 292001 285419 291067 296143 289229 296077 301185 304742 315902 328250
14529 328250 322710 332425 351767 357082 365738 383320 389636 384171 382529 392908 393880 389183 393567 390953
14515 390953 392314 408765 410463 411171 421021 407928 421725 423964 425402 423326 428069 435824 458488
14502 458488 474902 476448 483133 489328 476441 469654 462431 465783 468058 477577 490589 495355 480931
14489 480931 491217 509563 512681 514062 520277 517208 513294 514801 517520 525727 526722 512594 505568 526160
14475 526160 538255 543544 565248 576785 578647 576527 579873 591839 586331 579583 568658 577140 589350
14462 589350 597518 605514 612205 608120 599621 608646 615279 618458 610490 601595 610654 614968 608251 610701
14448 610701 621245 639552 649999 658905 678086 681359 672066 678911 687338 691978 703893 695560 684629
14435F84629N447J0362K539k3893j2943r029K059J1228O27K1794Q788K105J1707
14422G15420N433J2167N753o374J9915Q317J5373P862r21j8775l453K433O348
14409G69498Q101j684p315j0737k5932p030m942m068n6K0232L846k534J5607P621
14395G60607J570J8140J6992l564j255R730K1269J5170J8510J442n606j7083J509
14382H37431m733J0140r851j5857k1121j7261l470j273p24Q402O172l840k444
14369G81571J9102J1027J1089N003r82O714L401J6044K3382J8595o284o721j803
14356H80138k480n334p426k3494k0678p124m076J1126J1796J3758K028o163N684
14343H47755J0350J3771l833L877J0464J2588Q592l990p044P113J1249L66j6941
$$ plain form
14435 684629 690076 700438 702977 679084 666141 657112 659171 670399 671026 692820 701608 703713 715420
14422 715420 720853 733020 738773 732399 752314 760631 776004 783866 782945 764170 760717 763150 769498
14409 769498 777599 775915 768600 757863 731931 724901 719959 715891 715835 736067 739913 737379 752986 760607
14395 760607 762177 780317 797309 793745 792490 802220 823489 838659 857169 858611 853005 835922 837431
14382 837431 832698 842838 832987 817130 796009 778748 775278 774005 773281 781683 787855 784015 781571
14369 781571 800673 811700 822789 827792 826810 833524 836925 852969 876351 894946 888662 881941 880138
14356 880138 877658 872324 864898 841404 820726 813602 809526 820652 832448 846206 848234 842071 847755
14343 847755 858105 871876 868043 871920 882384 894972 903564 899574 892530 899643 910892 911258 894317
14330H94317J1135J3753Q97N15k4030j5017N384M189j3516o873Q925N276L172
14317H88127J4413J1178R432K2469P310j4770n092J4194M822P18j167P271L686
14304I62591n041k522p134Q87L886j2402n270J5081l581j0984k042O153P674K332
14290I49628q58L59O444O538R259K800p165J2715R878o809j3019m96J2310O399
14276I87983J3081M306Q86M845Q764k936K442p183l527R665p116K250J6363J4164
14262A043987M843M25J33K84J9135J0548r16j1608o003n339p55J2855j2228J987
14248A057348O022o668J0537J5539k513p708j286J8619N54j2456N443K548L537
14235A089516J6272J0769L247J086j530k077l92k553o301k322M908M893J7746
$$ plain form
14330 894317 905452 919205 920102 920617 896587 881570 886954 891143 877627 870754 879679 884955 888127
14317 888127 902540 913718 923150 945619 952929 938159 933067 947261 952083 952801 951634 958905 962591
14304 962591 957550 955028 947894 948781 952667 940265 934995 950076 946495 935511 933469 939622 947296 949628
14290 949628 948770 949129 955573 962111 971370 974170 967005 979720 989598 982789 969770 969274 981584 987983
14276 987983 1001064 1005370 1006256 1011101 1019865 1016929 1019371 1012188 1008661 1018326 1011210 1013460 1029823 1043987
14262 1043987 1048830 1049255 1049388 1049672 1068807 1079355 1078439 1066831 1060828 1055489 1054734 1067589 1055361 1057348
14248 1057348 1063370 1056702 1067239 1082778 1080265 1072557 1071271 1089890 1090444 1077988 1083431 1085979 1089516
14235 1089516 1105788 1116557 1119804 1120890 1119360 1117283 1116891 1114338 1108037 1105715 1110623 1115516 1133262
14222A133262R940n467N82P629o08P704q74n898m815J1088J0344n729o693N951
14208A156416q348j543J0558K021J565J2541l516j938l831J1441J0415j1595J1367
14195A185553o7j1719J771N161J1143J0573O876O367j2238o778p70R170j1265
14182A193777m002p811R976P507N148J7624N154r754k016J2631J6580k106j8909
14169A223799j2745J3510L621J5556Q69k605M605M287j157r17p163j4129r707
14156A217824R470J9110J7159Q528Q636q138l610J631j901J66m588L524p95o171
14142A260845n616R253J6915P107O637j0445m139K116l525N436j974P290J3777
14129A303677J9223J0327Pj6815j1149P974O397N836J239n117m991M292l566O029
$$ plain form
14222 1133262 1143202 1137735 1138317 1145946 1145338 1153042 1152168 1146270 1141455 1152543 1162887 1157158 1150465 1156416
14208 1156416 1148068 1146525 1157083 1159104 1160669 1173210 1169694 1167756 1163925 1175366 1185781 1174186 1185553
14195 1185553 1185486 1173767 1175538 1180699 1191842 1202415 1209291 1215658 1203420 1196642 1195872 1205042 1193777
14182 1193777 1189775 1181964 1191940 1199447 1204595 1222219 1227373 1217619 1215603 1228234 1244814 1242708 1223799
14169 1223799 1211054 1224564 1228185 1243741 1244610 1242005 1246610 1250897 1249740 1248823 1241660 1227531 1217824
14156 1217824 1227294 1246404 1263563 1272091 1280727 1272589 1268979 1270610 1268709 1268875 1264287 1267811 1267016 1260845
14142 1260845 1255229 1264482 1281397 1288504 1295141 1284696 1280557 1282673 1279148 1284584 1282610 1289900 1303677
14129 1303677 1322900 1333227 1333234 1316419 1305270 1313244 1319641 1325477 1326716 1321599 1316608 1320900 1317334 1323363
14115A323363J2032J1781M514p027j7034J267K4214J4878j0058J171J0951j4p571
14102A362467o46p964j6280J3765J0304P377l315R150j799j051m55K081p195K106
14088A368545J4721J3183p597P114M117J228j3074n847L940L631J7042J8319k312
14075A423010j3351k651l780J519Q112R638N123L763k686P661R79n717k0319K1502
14061A432803K1674K736l812l274l038N652P304o65Q969l138J843j1863L28J411
14047A456930N37N582M27L636J5919J0530N7Q736k796k509q125O940q952p806
14033A479106j419J0654l844K91K810j223K903m309J451M237J0459J7873J2653
14020A531642K499R826L224j3415j0562r276J2490J7740K583q998j4256J0685
$$ plain form
14115 1323363 1335395 1347176 1351690 1344663 1327629 1328896 1353110 1367988 1357930 1359101 1370052 1370038 1362467
14102 1362467 1361821 1353857 1337577 1351342 1361646 1369023 1365708 1374858 1373059 1372008 1371553 1373634 1366439 1368545
14088 1368545 1383266 1396449 1388852 1395966 1400083 1401311 1388237 1382390 1386330 1389961 1407003 1425322 1423010
14075 1423010 1409659 1407008 1403228 1404747 1412859 1422497 1427620 1431383 1428697 1436358 1437337 1431620 1411301 1432803
14061 1432803 1454477 1457213 1453401 1450127 1447089 1452741 1460045 1459380 1468349 1465211 1467054 1455191 1455519 1456930
14047 1456930 1457467 1463049 1463476 1467112 1483031 1493561 1493618 1502354 1499558 1497049 1488924 1495864 1486912 1479106
14033 1479106 1477687 1488341 1484497 1484788 1487598 1486375 1489278 1484969 1486420 1490657 1501116 1518989 1531642
14020 1531642 1534141 1543967 1547191 1533776 1523214 1513938 1526428 1544168 1546751 1537753 1523497 1534182
14008A534182P322k434p593n398J2400J3323J8634O528l079J661P23K679o149
13995A572799p190o16N979J5993R167R624r915k0615q596R617J2157l93L63o559
13981A581815J0734J4288P066l702J461P838j2133j1633K369K215J7812j5458
13969A602672r216m914P539J9235J3178K720J0567J4089n431j0645o018J2326
13957A646102J2887m801o336M460N62j499r34r649J2012K3149J441R236J2392
13944A699022j0270p515J736O529j3698j1484K0637J9110j2768M463Q89n298K249
13931A693602J4250J4115J5887l626M023K3794Q0j1067P46k247j291l551J1660
13918A756375R935p76j216j688J0941k956J6633J0877q716r961o26K1117N898
$$ plain form
14008 1534182 1541504 1539070 1531477 1526079 1538479 1551802 1570436 1576964 1573885 1575546 1576269 1578948 1572799
13995 1572799 1565609 1564993 1570972 1586965 1596132 1605756 1595841 1575226 1566630 1576247 1588404 1588011 1588374 1581815
13981 1581815 1592549 1606837 1613903 1610201 1611662 1619500 1607367 1595734 1598103 1600318 1618130 1602672
13969 1602672 1593456 1588542 1596081 1615316 1628494 1631214 1641781 1655870 1650439 1639794 1633776 1646102
13957 1646102 1658989 1654188 1647852 1652312 1652874 1651375 1650441 1640792 1652804 1675953 1677394 1686630 1699022
13944 1699022 1688752 1681237 1682973 1689502 1675804 1664320 1684957 1704067 1691299 1695762 1696651 1691353 1693602
13931 1693602 1707852 1721967 1737854 1734228 1738251 1762045 1762125 1751058 1751804 1749557 1748266 1744715 1756375
13918 1756375 1766310 1765534 1764318 1762630 1773571 1770615 1787248 1798125 1789409 1779448 1778822 1799939 1805837
13905A805837l214l589%M979J292j847J2327J2334p877N733R357K0241J4949o05
13891A869917k3525J5858J3904P598O882R679p448k821K3637J9477q97r953J8134
13878A940442K0695J2348K7312J7817M289M299K5179L5723K8740K8725L1529K3574
13866B200672L8258O1374Q0983P2367O2324K4071l2596o4591j00837j70694k19522
13855A951809k23848k16154k04419j38710p0060k3750K7950N4913N9909O7021
13845A284661O5850L8424L9674J8144R725K2741J6343J1701K9547L0186J9476
13834A586472M668P336O005J3502J0543J1893J1774O327R232J2395K2520J3097
13822A715764L83j398j392P141J5844J3135P396R728n82j4n920K712N757J7396
$$ plain form
13905 1805837 1802623 1799034 1799034 1804013 1805305 1803458 1815785 1828119 1820242 1825975 1835332 1855573 1870522 1869917
13891 1869917 1846392 1862250 1876154 1883752 1890634 1900313 1892865 1890044 1913681 1933158 1932261 1922308 1940442
13878 1940442 1961137 1973485 2000797 2018614 2022903 2027202 2052381 2088104 2116844 2145569 2177098 2200672
13866 2200672 2238930 2300304 2381287 2453654 2515978 2540049 2507453 2442862 2342025 2171331 1951809
13855 1951809 1727961 1511807 1307388 1168678 1098618 1074868 1102818 1157731 1217640 1284661
13845 1284661 1350511 1388935 1428609 1446753 1456478 1479219 1495562 1507263 1536810 1566996 1586472
13834 1586472 1591140 1598476 1604481 1617983 1628526 1640419 1652193 1658520 1667752 1680147 1702667 1715764
13822 1715764 1716147 1714749 1713357 1720498 1736342 1749477 1756873 1766601 1766019 1766005 1760085 1762797 1768554 1785950
13808A785950N640j54o803k316M259J2475Q117J0120K743K986p67J444J551k78
13794A824967J0508R367r203j1037m320o43J3604N388L662J9945J6693P610q075
13781A878466m676q120J3056J3834r421q53K863m16O523P397Q678K6068J4175
13768A947574j747r792r502K920Ml525k458N449P094Q622M409m958j0230m054
13754A929806j697J4474P739m861o640J1524J285p86P304J3551K490R101K453
13741A985743J056m212N897O693O551j966K394O611J5665Q409J4614r243j3900
13728B024312k425O032J4243Q509L490k381j3828O606Q779l803L665K720J1857
13715B067776P561m183k722k354j6998K028J4967K4399P777n710r264j1424n741
$$ plain form
13808 1785950 1791590 1791436 1784633 1782317 1786576 1799051 1807168 1817288 1820031 1823017 1822250 1823694 1825245 1824967
13794 1824967 1835475 1844842 1835639 1824602 1820282 1819639 1833243 1838631 1842293 1862238 1878931 1886541 1878466
13781 1878466 1873790 1865670 1878726 1892560 1883139 1882286 1885149 1884733 1891256 1898653 1907331 1933399 1947574
13768 1947574 1945827 1936035 1926533 1929453 1929457 1925932 1923474 1928923 1936017 1944639 1949048 1944090 1933860 1929806
13754 1929806 1928109 1942583 1950322 1945461 1938821 1950345 1951630 1950844 1958148 1971699 1974189 1983290 1985743
13741 1985743 1986799 1982587 1988484 1995177 2001728 1999762 2002156 2008767 2024432 2032841 2047455 2038212 2024312
13728 2024312 2021887 2027919 2042162 2050671 2054161 2051780 2037952 2044558 2053337 2049534 2053199 2055919 2067776
13715 2067776 2075337 2071154 2068432 2066078 2049080 2051108 2066075 2090474 2098251 2092541 2083277 2071853 2066112
13702B066112R490J6957O840J97Q27p981J3996P221P732p500l504L688k917L026
13688B114184J0942P581q253n183O527O311j2486k110K0965R266J594k96J1854
13675B160896J577r612l352P900M656Q196k051j5878J2650J4915L89q084M353
13662B176555k628n171J0033L284K2278K1120O388K658p467j0803P692O545J7661
13649B248145M778L956l334L060Q638l775l800K430R056R09j9461K403P742M390
13635B265137m111p05J5598M356J363K050L772J8101P848j9770p021J0203N340
13622B302161J0714P624l994J2828J0118j911j4353j1049P014R991J4147j709
13610B341581K21P065Q471P665Q432M697L146j2377L375j332J023J1348Q679j0029
$$ plain form
13702 2066112 2075602 2092559 2099399 2099596 2100423 2092442 2106438 2113659 2121391 2113891 2110387 2114075 2111158 2114184
13688 2114184 2125126 2132707 2124454 2119271 2125798 2132109 2119623 2117513 2138478 2147744 2149338 2149042 2160896
13675 2160896 2162473 2152861 2149509 2157409 2162065 2170261 2168210 2152332 2164982 2179897 2180286 2172202 2176555
13662 2176555 2173927 2168756 2178789 2182073 2204351 2225471 2231859 2234517 2227050 2216247 2223939 2230484 2248145
13649 2248145 2252923 2256879 2253545 2256605 2265243 2261468 2257668 2260098 2269154 2270063 2250602 2253005 2260747 2265137
13635 2265137 2261026 2260321 2275919 2280275 2281638 2283688 2287460 2305561 2313409 2293639 2286618 2296821 2302161
13622 2302161 2312875 2320499 2316505 2329333 2339451 2337540 2323187 2312138 2319152 2329143 2343290 2341581
13610 2341581 2341802 2348867 2357338 2365003 2373435 2378132 2381278 2368901 2372276 2370944 2371967 2383315 2391994 2381965
13596B381965j6766l580J0845K1665J1088O553P69r826m755J638R180P110n098
13583B410788j3617o882J6038J4531J9k727M007P794J0028J3621K589J0992J2021
13570B479202n438l026O29K553J3607M650P540p602p51J4178Q884M677n610M434
13556B517927q05L409j0599J3494O897J6758J3768j6067o047J523J4746P212M072
13543B566288q058K528J1014O791k374l971L792J5445J4055J0485o804n751J491
13530B604931K701J4510J3752K0896Q064O892L916J4894J210O46j1680k2151j7139
13517B641442o603N048k0560J09M737J6531J2268J4473l6q424L24J6752K0158
13504B696219R648O762n755j136Q583L39J91J0303J6107J3479R183N226L168q47
$$ plain form
13596 2381965 2365199 2361619 2372464 2394129 2405217 2411770 2412539 2402713 2397958 2399596 2408776 2415886 2410788
13583 2410788 2397171 2390289 2406327 2420858 2420877 2418150 2422157 2429951 2439979 2453600 2456189 2467181 2479202
13570 2479202 2473764 2470738 2471367 2473920 2487527 2492177 2499717 2492115 2491364 2505542 2514426 2519103 2513493 2517927
13556 2517927 2517122 2520531 2509932 2523426 2530323 2547081 2560849 2544782 2538735 2540258 2555004 2562216 2566288
13543 2566288 2558230 2560758 2571772 2578563 2576189 2572218 2576010 2591455 2605510 2615995 2609191 2603440 2604931
13530 2604931 2607632 2622142 2635894 2656790 2664854 2671746 2675662 2690556 2691766 2692412 2680732 2658581 2641442
13517 2641442 2634839 2639887 2619327 2619436 2624173 2640704 2652972 2667445 2667409 2658985 2659309 2676061 2696219
13504 2696219 2705867 2712629 2706874 2705738 2714321 2714660 2714851 2725154 2741261 2754740 2763923 2769149 2772317 2771470
13490B771470k654p570l100J6865J4781R731M805J5778P046J9423K3781K6624
13478B896980K3683K2564j4096q6129j30289q5585K823K6910L1460J7271J0632
13467B716224J7891K0801J7583N239J2681J9329J011N37o179O530J6666K2436
13455B850749J4288j343k870N17J6873K6319J0247M314l694k512j751O30J2189
13442B923956J5357J1852K6918J5282P000Q74O583L0393L1646J3297N455j3017
13430C075596q5121j13838m2126J521K9123K6295R826K0628K9088K2981R708k317
13418B981364J671q573j5563J5933K952k545O69P229k228K413j621J6408K1934
13405C020043J3702K482K5496J4315L713L521p020J2767J8971J0896J7700K4008
$$ plain form
13490 2771470 2768816 2761246 2758146 2775011 2789792 2799523 2804328 2820106 2827152 2846575 2870356 2896980
13478 2896980 2920663 2943227 2929131 2843002 2712713 2627128 2629951 2656861 2688321 2705592 2716224
13467 2716224 2734115 2754916 2772499 2777738 2790419 2809748 2810759 2811296 2805117 2811647 2828313 2850749
13455 2850749 2865037 2863694 2860824 2861341 2878214 2904533 2914780 2919094 2915400 2912888 2911137 2911767 2923956
13442 2923956 2939313 2951165 2978083 2993365 3000365 3001239 3007822 3038215 3069861 3083158 3088613 3075596
13430 3075596 2990475 2876637 2834511 2836032 2865155 2891450 2901276 2921904 2950992 2973973 2983681 2981364
13418 2981364 2983035 2974462 2958899 2974832 2977784 2975239 2975908 2983137 2980909 2983322 2981701 2998109 3020043
13405 3020043 3033745 3036227 3061723 3076038 3079751 3083272 3076252 3089019 3107990 3118886 3136586 3160594
13393C160594J2952K603Q747J2207j1188j7613r243k2012k2992m8698k1420l878
13381C040059N637R042R998P246J2591M272l067M917O043M948K1806J2038P791
13368C143321O031p73K2508L6147N517K039J6882j664J906K255M136L181L086
13355C244572J0625J4745Q822j5630j2445j519J2110J4692J1466k788N367J5731
13343C305748j957k963k828p165l992l732K900Q985J2798o237k692J4537J6726
13330C330128J3671K0946L1512P871o910J7666P019J6666K5278k34j3533L677
13318C453757O536j491P97R873o333j1269p317j145o93m381m306K597j5395l891
13304C417339o080J3034K3174l675l772J1976K2650J9607J0688O414J3521K2181
$$ plain form
13393 3160594 3173546 3176149 3184896 3197103 3185915 3168302 3159059 3137047 3114055 3065357 3043937 3040059
13381 3040059 3045696 3054738 3064736 3071982 3084573 3088845 3085778 3090695 3096738 3101686 3123492 3135530 3143321
13368 3143321 3149352 3148579 3171087 3207234 3212751 3214790 3231672 3230008 3231914 3234169 3238305 3241486 3244572
13355 3244572 3255197 3269942 3278764 3263134 3250689 3249170 3261280 3275972 3287438 3284650 3290017 3305748
13343 3305748 3303791 3300828 3298000 3290835 3286843 3283111 3286011 3294996 3307794 3301557 3298865 3313402 3330128
13330 3330128 3343799 3364745 3396257 3404128 3397218 3414884 3421903 3438569 3463847 3463613 3450080 3453757
13318 3453757 3460293 3458802 3459599 3469472 3463139 3451870 3444553 3443408 3442715 3438334 3434028 3436625 3421230 3417339
13304 3417339 3411259 3424293 3447467 3443792 3440020 3451996 3474646 3494253 3504941 3511355 3524876 3547057
13292C547057K1380J4722P993Q943J6389L452o424J3507N168j2703j4600j5625
13280C589259j5644M438J1202K359J427l559M018Q786J6955P922L016K563L442
13267C636184K9778K8120N961Q403L5264J0509L995J2275N418r742J36O704J4576
13254C787581J1298K55J9926J7029M139K777J8310J3874J400m643N880O508R326
13241C893660J8738J8955O727N031k043J6280J7404R257L082l272K6M795P275
13228C995915K3849K1826R092n214L297K3032J1977Q177O661J5590J8824M509
13216D137535P212M310Q649K366K873K3416M215Q7P793Q511J2792J7091J4149
13203D250999Q898J9309J8015J2000Q369J0107J5851J3768O62p64O938L4811J3985
$$ plain form
13292 3547057 3568437 3583159 3591152 3600095 3616484 3619936 3613512 3627019 3632187 3619484 3604884 3589259
13280 3589259 3573615 3578053 3589255 3591614 3593041 3589482 3593500 3602286 3619241 3627163 3630179 3632742 3636184
13267 3636184 3665962 3694082 3700043 3708446 3743710 3754219 3758214 3770489 3775907 3766165 3766301 3773005 3787581
13254 3787581 3798879 3799134 3819060 3836089 3840228 3843005 3861315 3875189 3876589 3871946 3877826 3884334 3893660
13241 3893660 3912398 3931353 3938080 3943111 3941068 3957348 3974752 3984009 3987091 3983819 3983845 3988640 3995915
13228 3995915 4019764 4041590 4050682 4045468 4048765 4071797 4083774 4091951 4098612 4114202 4133026 4137535
13216 4137535 4144747 4149057 4157706 4160072 4162945 4186361 4190576 4190663 4198456 4206967 4219759 4236850 4250999
13203 4250999 4259897 4279206 4297221 4309221 4317590 4327697 4343548 4357316 4357978 4357214 4364152 4398963 4412948
13190D412948J3074o036j691J6973N067M774K475K9783J8663O962k986L10J2349
13177D512665J6337J8105j0857J3787J5643J8870K3623K2714J5973J509K7233
13166D675602Q916J2718P481O935J9658K4838K321J0263J3324M642Q330J050J2120
13153D808198J1718J657L958J4944K4746K7667J6104J9270R962J7351J2040J5407
13141D983022M994Q590J5795K2257J1389J677J2527K5139O901J9026J7884K8238
13129E157439K0288K4395o16K5365J0962J2430J8155K0213J2889K947J8872P639
13117E330978Q826J8585K1010L1059K4640J4518J5345K1452J9580J1849k79K0106
13105E537669L0482K8556M591J0530K7923K8261J5730K4683K2384J5477L6450
$$ plain form
13190 4412948 4426022 4419986 4418295 4435268 4440335 4445109 4447584 4477367 4496030 4502992 4500006 4500316 4512665
13177 4512665 4529002 4547107 4536250 4550037 4565680 4584550 4608173 4630887 4646860 4648369 4675602
13166 4675602 4684518 4697236 4704717 4711652 4731310 4756148 4758469 4768732 4782056 4786698 4795028 4796078 4808198
13153 4808198 4819916 4821573 4825531 4840475 4865221 4892888 4908992 4928262 4938224 4955575 4967615 4983022
13141 4983022 4988016 4996606 5012401 5034658 5046047 5047724 5060251 5085390 5092291 5111317 5129201 5157439
13129 5157439 5177727 5202122 5201506 5226871 5237833 5250263 5268418 5288631 5301520 5304467 5323339 5330978
13117 5330978 5339804 5358389 5379399 5410458 5435098 5449616 5464961 5486413 5505993 5517842 5517563 5537669
13105 5537669 5568151 5596707 5601298 5611828 5639751 5668012 5683742 5708425 5730809 5746286 5782736
13094E782736M6509K2482J1037K2358L9497J7914K3605L5571J8395J9442J4618
13083F054164J2672K0223K2114J5011J6843K0829L3336J8812K1054K5142L2804
13072F293004K9968K9364L3682M2179K1259J8746M0524L9667L0994K3393L1624
13061F634404M5868K8554K6405K5525L3677M4478L8109K3820K0719L0684K8044
13050F980287J4896K7148M2628M9568M0147L3275L5610M9287M3909M2504M7129
13039G406388N3526N5948M2466K7990M6894O3498M2434L1974M8272O2818O6904
13028G949112N3350M9924M1805M7231O5550N9957M3986O2915O8859N7586O1122
13017H561397O0383O4599P0479O7424P5349N5269O3843R1329P4894P1077P8846
$$ plain form
13094 5782736 5829245 5851727 5862764 5885122 5924619 5942533 5966138 6001709 6020104 6039546 6054164
13083 6054164 6066836 6087059 6109173 6124184 6141027 6161856 6195192 6214004 6235058 6260200 6293004
13072 6293004 6322972 6352336 6386018 6428197 6449456 6468202 6508726 6548393 6579387 6602780 6634404
13061 6634404 6680272 6708826 6735231 6760756 6794433 6838911 6877020 6900840 6921559 6952243 6980287
13050 6980287 6995183 7022331 7064959 7114527 7154674 7187949 7223559 7272846 7316755 7359259 7406388
13039 7406388 7459914 7515862 7558328 7586318 7633212 7696710 7739144 7771118 7819390 7882208 7949112
13028 7949112 8002462 8052386 8094191 8141422 8206972 8266929 8310915 8373830 8442689 8500275 8561397
13017 8561397 8621780 8686379 8756858 8824282 8899631 8954900 9018743 9110072 9184966 9256043 9334889
13006I334889Q4525Q8321J03105J00536J06056J00777J03869J03507J12013J19352
12996A0356950J14656J24727J25098J43105J61764J50739J48378J67048J62455
12987A1654920J56069J80105J87196J70020J80778J83231K11570K32421K51726
12978A3408036K71078L05681L42242L63244M18543M55729M91453N40803N76570
12969A7173379O37307O91795P35054P66468O96492M31649j07062p35748j193267
12960A9096067j490715j799627k025794j948666j643830j243772r15028n94251
12952G434384j64265K64803O59425R26517J080053J145287J148248J137956J136034
12943A4768442J170916J214867J231131J215358J101282Q55873M26956j64070
$$ plain form
13006 9334889 9419414 9507735 9610840 9711376 9817432 9918209 10022078 10125585 10237598 10356950
12996 10356950 10471606 10596333 10721431 10864536 11026300 11177039 11325417 11492465 11654920
12987 11654920 11810989 11991094 12178290 12348310 12529088 12712319 12923889 13156310 13408036
12978 13408036 13679114 13984795 14327037 14690281 15108824 15564553 16056006 16596809 17173379
12969 17173379 17810686 18502481 19237535 20004003 20700495 21132144 21025082 20289334 19096067
12960 19096067 17605352 15805725 13779931 11831265 10187435 8943663 8028635 7434384
12952 7434384 7270119 7534922 8194347 9120864 10200917 11346204 12494452 13632408 14768442
12943 14768442 15939358 17154225 18385356 19600714 20701996 21557869 21984825 21820755
12935B1820755p48093j136760j484225k048862k504883k548681k479772k440612
12927F428867k313989j882371j271298q63306o65550m64833j99847J0657J30871
12918a090799L00132N85268R39158J192727J304126J317836J317260J302826J252078
12909H420612J165628J035892Q91922O22066K74527l9731k81540n70807p92031
12900A0726538r34564r80675r04459p82226o38457l33888N7268K96203L44307
12891F850047L10734J88154K969l00833p39288j103205j276618j422638j559043
12882I50279j499619j251620q73087m19123m7840K91059P01124J041847J262960
12873A55980J398213J518029J591696J621497J614727J562139J390703J054596
$$ plain form
12935 21820755 21072662 19935902 18451677 16402815 13897932 11349251 8869479 6428867
12927 6428867 4114878 2232507 961209 97903 -567647 -1032480 -1232327 -1221670 -1090799
12918 -1090799 -790667 -205399 733759 1926486 3230612 4548448 5865708 7168534 8420612
12909 8420612 9586240 10622132 11514054 12136120 12410647 12370916 12089376 11518569 10726538
12900 10726538 9791974 8811299 7906840 7124614 6486157 6152269 6209537 6505740 6850047
12891 6850047 7160781 7348935 7351904 7051071 6311783 5208578 3931960 2509322 950279
12882 950279 -549340 -1800960 -2674047 -3093170 -3141010 -2849951 -2148827 -1106980 155980
12873 155980 1554193 3072222 4663918 6285415 7900142 9462281 10852984 11907580
12865A1907580O29254K84685J06824l1201k47335n52417r42428j291404j885195
12856G978363k721896l252386l273052l116423l103597l043600k555758j844261
12848a4932610j394232r22351j83008N69234J099068J376731J470019J479782
12840a1437367J469585J426346J434342J467286J501501J452102J328925J086250
12832b71030P16685K26348l55226q61966j304589j724296k140308k471127k573001
12823a0758510k390837k007722j578383r62835j28376N89575R19900R64723R08705
12814a4443760Q40436P78785P03121O56066O13620N85758N57899N34645M56540
12805h716890L86392L42270K85063K04265J46055J06686P8447M8284N2293J02541
$$ plain form
12865 11907580 12536834 12821519 12928343 12897142 12649807 12097390 11154962 9863558 7978363
12856 7978363 5256467 2004081 -1268971 -4385394 -7488991 -10532591 -13088349 -14932610
12848 -14932610 -16326842 -17249193 -17432201 -16862967 -15763899 -14387168 -12917149 -11437367
12840 -11437367 -9967782 -8541436 -7107094 -5639808 -4138307 -2686205 -1357280 -271030
12832 -271030 445655 672003 316777 -545189 -1849778 -3574074 -5714382 -8185509 -10758510
12823 -10758510 -13149347 -15157069 -16735452 -17698287 -17826663 -17237088 -16317188 -15352465 -14443760
12814 -14443760 -13603324 -12824539 -12121418 -11465352 -10851732 -10265974 -9708075 -9173430 -8716890
12805 -8716890 -8330498 -7988228 -7703165 -7498900 -7352845 -7246159 -7167712 -7119428 -7067135 -6964594
12795f964594J45092J79902K09998K34162K19215K20626J92958J80075J76628
12786e205938J67835J58281J51099J31620J48435J49967J43129J24887J18325
12777c912360J25566J18675J06092R9598R7333J08292J11985R8899R6981J07770
12767b841169J12909R6563Q3789Q7948Q0906P9773N6392M3844M3456M3479N1251
12756b060859P1829O6326Q6376Q3158P8535O3169P6371O9018N5240O9777N5735
12745a285325M1992M4676L7323J8719K2483K5278K5824L6474N3296N1774N1997
12734h75489O5391O6472N8083M8907O4178N5067M2365N9499L2837L1497L1703
12723c19490K3419L2538M2019K5208K6464M7327M7655L5677M2281M1156L7464
$$ plain form
12795 -6964594 -6819502 -6639600 -6429602 -6195440 -5976225 -5755599 -5562641 -5382566 -5205938
12786 -5205938 -5038103 -4879822 -4728723 -4597103 -4448668 -4298701 -4155572 -4030685 -3912360
12777 -3912360 -3786794 -3668119 -3562027 -3462429 -3365096 -3256804 -3144819 -3045920 -2948939 -2841169
12767 -2841169 -2728260 -2631697 -2547908 -2459960 -2379054 -2299281 -2242889 -2199045 -2155589 -2112110 -2060859
12756 -2060859 -1989030 -1922704 -1836328 -1753170 -1674635 -1611466 -1535095 -1466077 -1410837 -1341060 -1285325
12745 -1285325 -1243333 -1198657 -1161334 -1142615 -1120132 -1094854 -1069030 -1032556 -979260 -927486 -875489
12734 -875489 -810098 -743626 -685543 -636636 -572458 -517391 -475026 -415527 -382690 -351193 -319490
12723 -319490 -296071 -263533 -221514 -196306 -169842 -122515 -74860 -39183 3098 44254 81718
12712H1718L8468K7278L0985N0846N5378N8455M7636M1414M1255M0830L5247L1298
12700E80808L0004L4214N1053N4910M0498K8513M1953M4908M4467K4578K6766
12689A002672M7648K5758J0779J1344J2536J3114L1138K6830M3000L7022L0036
12678A291877K9646L6467M3513L7134L1863L2204L3724K7434K8479K3975Q940
12667A625256N991J1972K7360K5290L0969J8460K7454M1057M8014M3852M3009
12656A948684L5783K5429K7560K8920L4169M0417M8697K6183L7823L3485K6143
12645B313293M4731M1145K0054J7076L0539L6664M7352L4903M5863K8952J9975
12634B680547K2265J599K5260R177M551M685K0357M3594L3324K6256L5840L7987
$$ plain form
12712 81718 120186 147464 178449 229295 284673 343128 390764 432178 473433 514263 549510 580808
12700 580808 610812 645026 696079 750989 791487 820000 861953 906861 951328 975906 1002672
12689 1002672 1050320 1076078 1086857 1098201 1110737 1123851 1154989 1181819 1224819 1261841 1291877
12678 1291877 1321523 1357990 1401503 1438637 1470500 1502704 1536428 1563862 1592341 1616316 1625256
12667 1625256 1631247 1643219 1670579 1695869 1726838 1745298 1772752 1813809 1861823 1905675 1948684
12656 1948684 1984467 2009896 2037456 2066376 2100545 2140962 2189659 2215842 2253665 2287150 2313293
12645 2313293 2358024 2399169 2419223 2436299 2466838 2503502 2550854 2585757 2631620 2660572 2680547
12634 2680547 2702812 2704411 2729671 2738848 2743399 2748084 2768441 2812035 2845359 2871615 2907455 2945442
12622B945442K8863M6570M4945L8472J7081L4523L5625M6350L9433K7351K8639
12611C333294J7901M646K5495M0793M8141L1796K6662L3355L7515L4873K1824
12600C656295K2871L0746M3611L9556L3733L8076K0130K4935L3477M6730M4309
12589D034469K6686L6068M1234L0558L6958O1837M1522K5488L6680L9453J9637
12578D430590J4294R693K5656L4553K8224J9548K8723L9329L2116J7760J4996
12567D695482K3740L5358L0388L8457L8117M7599N7414O1630N3440N2081M5262
12556E178968L8199L8996L3781M3589K6567L1073N3705N5897M6122N9445O2972
12545E669314M6645N4827O8552L2363L0344O2420L9293M2315N5283N0434M0858
$$ plain form
12622 2945442 2974305 3020875 3065820 3104292 3121373 3155896 3191521 3237871 3277304 3304655 3333294
12611 3333294 3351195 3355841 3381336 3422129 3470270 3502066 3528728 3562083 3599598 3634471 3656295
12600 3656295 3679166 3709912 3753523 3793079 3826812 3864888 3885018 3909953 3943430 3990160 4034469
12589 4034469 4061155 4097223 4138457 4169015 4205973 4267810 4309332 4334820 4371500 4410953 4430590
12578 4430590 4444884 4454577 4480233 4514786 4543010 4562558 4591281 4630610 4662726 4680486 4695482
12567 4695482 4719222 4754580 4784968 4823425 4861542 4909141 4966555 5028185 5081625 5133706 5178968
12556 5178968 5217167 5256163 5289944 5333533 5360100 5391173 5444878 5500775 5546897 5606342 5669314
12545 5669314 5715959 5770786 5839338 5871701 5902045 5964465 6003758 6046073 6101356 6151790 6192648
12534F192648N1126N2190M6692N5033M8520O0386P2631N5617M5016N8776O0776
12523F799411N6411P4435P3757N6889O1515O9617Q4242Q1371P4690O8423R2505
12512G593266Q2655O6941P1472P0518O1321M9726K8774R901J5884K9902L7170
12501H117530L1939M3109N2286O7378Q0449Q4995P9800P9745Q4498P4183Q3878
12490H879790Q8555P6892Q7944R6171J03667J15328R7449P8927P9097R9659J17801
12479I921280J02358J00262J08382J04304J05041J18616J07447J17768J25226
12470A0910684J14834J19763J19476J13605J31416J20840J23063J18195J18017
12461A1989893J34495J40968J51904J48321J56869J68962J77460J85830J76012
$$ plain form
12534 6192648 6243774 6295964 6342656 6397689 6446209 6506595 6579226 6634843 6679859 6738635 6799411
12523 6799411 6855822 6930257 7004014 7060903 7122418 7192035 7276277 7357648 7432338 7500761 7593266
12512 7593266 7675921 7742862 7814334 7884852 7946173 7995899 8024673 8034574 8050458 8080360 8117530
12501 8117530 8149469 8192578 8244864 8312242 8392691 8477686 8557486 8637231 8721729 8795912 8879790
12490 8879790 8968345 9045237 9133181 9229352 9333019 9448347 9545796 9624723 9703820 9803479 9921280
12479 9921280 10023638 10123900 10232282 10336586 10441627 10560243 10667690 10785458 10910684
12470 10910684 11025518 11145281 11264757 11378362 11509778 11630618 11753681 11871876 11989893
12461 11989893 12124388 12265356 12417260 12565581 12722450 12891412 13068872 13254702 13430714
12452A3430714J85289J85627J96779J95352K04518J95855J96484J98190K20003
12443A5208811K14109K11176K25043K53974K71543K50472K37885K68149K84102
12434A7425264K88918K95055K98885L09604L12848L25192L43561L69139L83595
12425B0352061L77052M09324M46821M57416M93085N17831N35417N62643N95268
12416B4746918O21811O49300O97164P43520P76836Q09058Q60738R12398R69896
12407C1787639J058956J131078J200827J304869J418258J560883J691425J805824
12399D2959759J905423K001643K095331K234921K433810K730097L126281L691011
12391F3178276M472064N438147O586262P826524Q803997Q762402O453299J285529
$$ plain form
12452 13430714 13616003 13801630 13998409 14193761 14398279 14594134 14790618 14988808 15208811
12443 15208811 15422920 15634096 15859139 16113113 16384656 16635128 16873013 17141162 17425264
12434 17425264 17714182 18009237 18308122 18617726 18930574 19255766 19599327 19968466 20352061
12425 20352061 20729113 21138437 21585258 22042674 22535759 23053590 23589007 24151650 24746918
12416 24746918 25368729 26018029 26715193 27458713 28235549 29044607 29905345 30817743 31787639
12407 31787639 32846595 33977673 35178500 36483369 37901627 39462510 41153935 42959759
12399 42959759 44865182 46866825 48962156 51197077 53630887 56360984 59487265 63178276
12391 63178276 67650340 73088487 79674749 87501273 96305270 105067672 111520971 112806500
12383A12806500n069123j1099346j7704052k3800119k7251391k8253872k7418074
12376b7789477k4153651j8932084j3359339o508906J404144O884728Q821090Q664370
12368f4969125P746472O723679N804649N063976M461017L930617L427691K875501
12360b4935523K261732J451845J54691j562493l106206l646250l070088j743010
12352c4195302l17536P51490J507448J932477K071329K014760J862838J727525
12344b2644971J610018J495028J355703J272592J217582J209038J214257J191986
12336a2078767J184513J174758J178852J186421J188711J227767J252381J287595
12328b397769J349220J395533J454624J573795J694287J730121J557421Q60946
$$ plain form
12383 112806500 107737377 96638031 78933979 55133860 27882469 -371403 -27789477
12376 -27789477 -51943128 -70875212 -84234551 -90743457 -89339313 -82454585 -73633495 -64969125
12368 -64969125 -57222653 -50498974 -44694325 -39630349 -35169332 -31238715 -27811024 -24935523
12360 -24935523 -22673791 -21221946 -21067255 -22629748 -25735954 -29382204 -32452292 -34195302
12352 -34195302 -34512838 -33761348 -32253900 -30321423 -28250094 -26235334 -24372496 -22644971
12344 -22644971 -21034953 -19539925 -18184222 -16911630 -15694048 -14485010 -13270753 -12078767
12336 -12078767 -10894254 -9719496 -8540644 -7354223 -6165512 -4937745 -3685364 -2397769
12328 -2397769 -1048549 346984 1801608 3375403 5069690 6799811 8357232 9218178
12320I218178n07751k470942m344275m961007l973692k397536r96628J61226J129905
12311i142522J901813K377648K602803K674122K691415K568946K254531J491293
12303I420049J1292k121082m621551o878589q157019p811855n848220l142338
12295b9149313o85573J035371J901137K209650K336005K392815K356315K216726
12287a5386867J849418J192626K86693p27260j842079k975660l644525l227712
12279b4475366j852489l16381P18390J197385J312100J240964J144276J053135
12271a9977986J006884R41740Q77151Q45251Q03575P71936P63770P46255P39428
12262a2481996P43023P36299P31619P25440P24184P52394P89541Q63056R08780
$$ plain form
12320 9218178 8710427 6239485 1895210 -3065797 -7039489 -9437025 -10433653 -10272427 -9142522
12311 -9142522 -7240709 -4863061 -2260258 413864 3105279 5674225 7928756 9420049
12303 9420049 9431341 7310259 2688708 -4189881 -12346900 -20158755 -26006975 -29149313
12295 -29149313 -29834886 -28799515 -26898378 -24688728 -22352723 -19959908 -17603593 -15386867
12287 -15386867 -13537449 -12344823 -12058130 -12785390 -14627469 -17603129 -21247654 -24475366
12279 -24475366 -26327855 -26644236 -25925846 -24728461 -23416361 -22175397 -21031121 -19977986
12271 -19977986 -18971102 -18029362 -17152211 -16306960 -15503385 -14731449 -13967679 -13221424 -12481996
12262 -12481996 -11738973 -11002674 -10271055 -9545615 -8821431 -8069037 -7279496 -6416440 -5507660
12253e507660R84986J093819J162278J175616J051865O45942j42388j190120k366404
12244c092066l424231l968722l645390k454166j016328j0292N34556Q83091J172513
12235a5021035J380675J479848J528808J565873J575677J502906J263801O30985
12227d092462o04251k403308m188515m967547m290244k826506j226110P9422Q01991
12218b3717530J055635J035312R27760Q00064O99444O07925N67941N24198M74714
12209a7024537M56050M40201M06811L76442L56210L40452L01791K68415K75399
12200a3802766K48253K27293K27776K23002K12051J99612J78249J78203J62955
12191a1945372J58625J54733J48186J55238J43158J36504J36608J38444J40033
$$ plain form
12253 -5507660 -4522674 -3428855 -2266577 -1090961 -39096 606846 464458 -725662 -3092066
12244 -3092066 -6516297 -10485019 -14130409 -16584575 -17600903 -17611195 -17076639 -16193548 -15021035
12235 -15021035 -13640360 -12160512 -10631704 -9065831 -7490154 -5987248 -4723447 -4092462
12227 -4092462 -4696713 -7100021 -11288536 -16256083 -20546327 -23372833 -24598943 -24519521 -23717530
12218 -23717530 -22661895 -21626583 -20698823 -19898759 -19199315 -18591390 -18023449 -17499251 -17024537
12209 -17024537 -16568487 -16128286 -15721475 -15345033 -14988823 -14648371 -14346580 -14078165 -13802766
12200 -13802766 -13554513 -13327220 -13099444 -12876442 -12664391 -12464779 -12286530 -12108327 -11945372
12191 -11945372 -11786747 -11632014 -11483828 -11328590 -11185432 -11048928 -10912320 -10773876 -10633843
12182a0633843J19956J09391J10374J14410J19346J09749R8457R7564J09179J04174
12172i541243R2521Q5108O9866O8558P4590P8742P8891P0946P7750P2178N6008
12161h716085O7903P7438N8375N1748P4819P3505O7298O2226O3432O4886O2296
12150g992159M9619N7329N2480N7162O1690O5275N5619N2221O1477N2143M9807
12139g377337M8710N0937N5951M5535N0184L2032M4452N2629M2608L8414L8125
12128f877760L2722K5348L0310N5699L8370L7264N7055M4894L7291L7881M1444
12117f439482L6882K8002L0208L2045K9278L3743L2919M4531L3004K9793M1208
12106f067869M4754L7465L3781K7331L3585L5896L5859L2526K8223K2671K9446
$$ plain form
12182 -10633843 -10513887 -10404496 -10294122 -10179712 -10060366 -9950617 -9852160 -9754596 -9645417 -9541243
12172 -9541243 -9448722 -9363614 -9293748 -9225190 -9150600 -9071858 -8992967 -8922021 -8844271 -8772093 -8716085
12161 -8716085 -8648182 -8570744 -8512369 -8460621 -8385802 -8312297 -8244999 -8182773 -8119341 -8054455 -7992159
12150 -7992159 -7942540 -7885211 -7832731 -7775569 -7713879 -7648604 -7592985 -7540764 -7479287 -7427144 -7377337
12139 -7377337 -7328627 -7277690 -7221739 -7176204 -7126020 -7093988 -7049536 -6996907 -6954299 -6915885 -6877760
12128 -6877760 -6845038 -6819690 -6789380 -6733681 -6695311 -6658047 -6600992 -6556098 -6518807 -6480926 -6439482
12117 -6439482 -6402600 -6374598 -6344390 -6312345 -6283067 -6249324 -6216405 -6171874 -6138870 -6109077 -6067869
12106 -6067869 -6023115 -5985650 -5951869 -5924538 -5890953 -5855057 -5819198 -5786672 -5758449 -5735778 -5706332
12095e706332L6859L2508K1543K1698M0441L1649L5963M1159K4965K9392L5427
12084e354728L0646K7951J3229J4479L4767L4077M0078Q112J2073K3673L0273
12073e085370J8487J3307J5641J6838L2607K8941K6157K0708J9529L8232K9755
12062d825168K2232J4445L0487K4243K6627K3833J8843J4455K8180L1428J4015
12051d576380J7673K4219J5413K8028K8788K1324J7119K3753L1698L4310K3920
12040d310135K5441J5647J1769K3225J3984Q538K3205L0044R254J3586K1527L4462
12028d079453K0860J9361J7224M006J1240J9027K5986K9791K3856K8582K5752
12017c853768O450L813J9773L6346J9460K8729P169L597K1010K1108L0003L6178
$$ plain form
12095 -5706332 -5669473 -5636965 -5615422 -5593724 -5553283 -5521634 -5485671 -5444512 -5419547 -5390155 -5354728
12084 -5354728 -5324082 -5296131 -5282902 -5268423 -5233656 -5199579 -5159501 -5151389 -5139316 -5115643 -5085370
12073 -5085370 -5066883 -5053576 -5037935 -5021097 -4988490 -4959549 -4933392 -4912684 -4893155 -4854923 -4825168
12062 -4825168 -4802936 -4788491 -4758004 -4733761 -4707134 -4683301 -4664458 -4650003 -4621823 -4590395 -4576380
12051 -4576380 -4558707 -4534488 -4519075 -4491047 -4462259 -4440935 -4423816 -4400063 -4368365 -4334055 -4310135
12040 -4310135 -4284694 -4269047 -4257278 -4234053 -4220069 -4211531 -4188326 -4158282 -4149028 -4135442 -4113915 -4079453
12028 -4079453 -4058593 -4039232 -4022008 -4018002 -4006762 -3987735 -3961749 -3931958 -3908102 -3879520 -3853768
12017 -3853768 -3847318 -3843505 -3823732 -3787386 -3767926 -3739197 -3732028 -3728431 -3707421 -3686313 -3656310 -3620132
12005c620132J7346J8739K6474P018J5892K7251J4203K6770L6020K7277K0827
11994c382315l017J6530K3872K2948J9944L6507L8986K8609J4827L3836L4810
11983c114463K1935M2740M7513L4778L1352L8535M1480M5342N1577N1597N7166
11972b650448P2043Q8136Q7806R2498J03064Q4941N4533J5621l6359j16577j58080
11961b362822k05002k40666k40867k05895j68578j41490j04433q9305q4021o3903
11951c906982n2388n7712m1648l394K8362N1671O7241O3658P3274Q0613P1640
11940c625665M5603M1904M8922M4198L8041L0423M3463L0950J7521L4204L8000
11929c212436L2111K7517J7020o957j4723K118R685N797J5472K0032K6231K2357
$$ plain form
12005 -3620132 -3602786 -3584047 -3557573 -3550555 -3534663 -3507412 -3493209 -3466439 -3430419 -3403142 -3382315
11994 -3382315 -3385332 -3368802 -3344930 -3321982 -3302038 -3265531 -3226545 -3197936 -3183109 -3149273 -3114463
11983 -3114463 -3092528 -3049788 -3002275 -2967497 -2936145 -2897610 -2856130 -2810788 -2759211 -2707614 -2650448
11972 -2650448 -2578405 -2490269 -2402463 -2309965 -2206901 -2121960 -2067427 -2051806 -2088165 -2204742 -2362822
11961 -2362822 -2567824 -2808490 -3049357 -3255252 -3423830 -3565320 -3669753 -3759058 -3843079 -3906982
11951 -3906982 -3959370 -4017082 -4058730 -4062124 -4033762 -3982091 -3914850 -3851192 -3777918 -3697305 -3625665
11940 -3625665 -3580062 -3538158 -3489236 -3445038 -3406997 -3376574 -3333111 -3302161 -3284640 -3250436 -3212436
11929 -3212436 -3180325 -3152808 -3135788 -3142745 -3157468 -3155350 -3145665 -3139868 -3124396 -3104364 -3078133 -3055776
11917c055776L2556K6989K1186J8894J9853K8336K2545J4158J9691K4012O321
11906b821235q353l7902j9645J0364J6042K2481J4561J3434J9570L0525K3611
11895b736547J9826L6221Q424N973K2075J4269K3029J9868J5798J2962J1867L7553
11883b508682J4565L217J1699K3302K6022L6720K4073J3712K8572K0160J9326
11872b287314J9762K2097K8286J9909J3202L1171R654K9714K5191K1862J9731
11861b046735j380j1850m8502p5084r0648j08724j04799q9491p9161o0534l0433
11850b747341j2240j1087j0992l901L1307L9756M2783L0676L9143L0442J9030
11839b552424L2643K6833K7364K6183K0758L495n03j939k1233k0393L696K7027
$$ plain form
11917 -3055776 -3023220 -2996231 -2975045 -2956151 -2936298 -2907962 -2885417 -2871259 -2851568 -2827556 -2821235
11906 -2821235 -2829588 -2867490 -2887135 -2876771 -2860729 -2838248 -2823687 -2810253 -2790683 -2760158 -2736547
11895 -2736547 -2716721 -2680500 -2672076 -2666103 -2644028 -2629759 -2606730 -2586862 -2571064 -2558102 -2546235 -2508682
11883 -2508682 -2494117 -2490900 -2479201 -2455899 -2429877 -2393157 -2369084 -2355372 -2326800 -2306640 -2287314
11872 -2287314 -2267552 -2245455 -2217169 -2197260 -2184058 -2152887 -2143233 -2113519 -2088328 -2066466 -2046735
11861 -2046735 -2048115 -2059965 -2108467 -2183551 -2274199 -2382923 -2487722 -2577213 -2656374 -2716908 -2747341
11850 -2747341 -2759581 -2770668 -2781660 -2785561 -2754254 -2714498 -2671715 -2641039 -2601896 -2571454 -2552424
11839 -2552424 -2519781 -2492948 -2465584 -2439401 -2418643 -2415148 -2415651 -2417590 -2438823 -2459216 -2455520 -2428493
11827b428493J6521K0439K9553K6638K2179J6788J6181K623K7226K8273k223M467
11815b219828K1503J4473O077P03K6699J3081n647R151J2330J2805J4553J8641
11803b075459J6694R534J0778J125P069J8377R965M949q647j8059k1422n893J852
11790b049137Q149K0845R482O918O463J3943K3020R506Q944R898P893K0962J7739
11777a885375K4497Q069j8039k2167k8105j3224m279L295J2118J1440M093P314
11765a900363J305L3880J6692K098Q536N652N723J5103J0008j359r154P714J0267
11752a793898J4943K4781K575l089J216J3196J7681J5297j219Q740J2413L399
11740a683965J070Q311P972Q159J9107J0840M720m87J6025J1746o591j210K770
$$ plain form
11827 -2428493 -2411972 -2391533 -2361980 -2335342 -2313163 -2296375 -2280194 -2277571 -2250345 -2222072 -2224295 -2219828
11815 -2219828 -2198325 -2183852 -2177775 -2177072 -2150373 -2137292 -2142939 -2133788 -2121458 -2108653 -2094100 -2075459
11803 -2075459 -2058765 -2049231 -2038453 -2037328 -2030259 -2011882 -2001917 -1996968 -2005615 -2023674 -2045096 -2050989 -2049137
11790 -2049137 -2040988 -2020143 -2010661 -2003743 -1997280 -1983337 -1960317 -1950811 -1941867 -1931969 -1924076 -1903114 -1885375
11777 -1885375 -1860878 -1852809 -1870848 -1893015 -1921120 -1934344 -1938623 -1935328 -1923210 -1911770 -1907677 -1900363
11765 -1900363 -1899058 -1865178 -1848486 -1846388 -1837852 -1832200 -1826477 -1811374 -1801366 -1802725 -1811879 -1804165 -1793898
11752 -1793898 -1778955 -1754174 -1751599 -1754688 -1753472 -1740276 -1722595 -1707298 -1708517 -1699777 -1687364 -1683965
11740 -1683965 -1682895 -1674584 -1666612 -1658453 -1639346 -1628506 -1623786 -1624273 -1608248 -1596502 -1603093 -1604303 -1601533
11727a601533k45l417O742K150q053j0755J1474Q836K0279L1472J6172O21q930
11714a535187P744K2064N641Q153l661n884R889J4177o721M223J8592P949J046
11701a451975n647P333J315J3914O708K447K721J9452N299n928J905J7122j736
11688a387070J5469J0663J5199L598o337J3404Q626j0995r851R604J1531L375
11676a322784L032M514N303O581J084J5700M394O641Q716L309r021J050Q511M715
11662a258255J0287k743R290J7845J2063R819j024m982M116K0881j219N088M00
11649a178434q446k518k25M356J3482Q282p770P65J8671K6979J034J0081J3600
11636a100143L864j1695n285N586M082J097N011J270J132J5381O226J1042J1091
$$ plain form
11727 -1601533 -1601778 -1605195 -1598453 -1596303 -1604356 -1615111 -1603637 -1594801 -1574522 -1543050 -1526878 -1526257 -1535187
11714 -1535187 -1527443 -1505379 -1499738 -1491585 -1495246 -1501130 -1491241 -1477064 -1483785 -1479562 -1460970 -1453021 -1451975
11701 -1451975 -1457622 -1450289 -1448974 -1435060 -1428352 -1425905 -1423184 -1403732 -1398433 -1404361 -1402456 -1385334 -1387070
11688 -1387070 -1371601 -1360938 -1345739 -1342141 -1348478 -1335074 -1326448 -1337443 -1347294 -1337690 -1326159 -1322784
11676 -1322784 -1319752 -1315238 -1309935 -1303354 -1302270 -1286570 -1282176 -1275535 -1266819 -1263510 -1272531 -1271481 -1262970 -1258255
11662 -1258255 -1247968 -1250711 -1241421 -1223576 -1211513 -1201694 -1202718 -1207700 -1203584 -1182703 -1183922 -1178834 -1178434
11649 -1178434 -1186880 -1189398 -1189623 -1185267 -1171785 -1163503 -1171273 -1170508 -1151837 -1124858 -1123824 -1113743 -1100143
11636 -1100143 -1096279 -1107974 -1113259 -1107673 -1103591 -1102494 -1097483 -1096213 -1095081 -1079700 -1073474 -1062432 -1051341
11623a051341J1450J648J9325l616P4k62Q641J0218k330j978j1247L880J917N041
11609a008580m391O478K1835K1160m237n836J4213m48m661l815J5621K759J9307
11596i30595J6327K167J970O175K692m576K009l19J4056l089J2677J176N214L690
11582h70426r038R832J2301M679L867j1221O329L919Q082P246J0196J8323J1751
11569g94160Q505R059J1741p525j724J0684r622j8373j0347k63P318N618L887
11556g85202J6119O693J0973J7806o426m205j730J5828L127O18M473J0685J5291
11543f95950M801Q035j4060N580J5632J6671j3021n38j0868j1927R743K1606N288
11530f59008M546P428J2896k629j5119n75j956J2168J2772M499J069L456K712
$$ plain form
11623 -1051341 -1039891 -1038243 -1018918 -1022534 -1022460 -1022722 -1014081 -1003863 -1006193 -1008171 -1019418 -1015538 -1013621 -1008580
11609 -1008580 -1012971 -1006493 -984658 -963498 -967735 -973571 -959358 -959806 -964467 -968282 -952661 -949902 -930595
11596 -930595 -914268 -912101 -910131 -903956 -901264 -905840 -903831 -904150 -890094 -893183 -880506 -879330 -874116 -870426
11582 -870426 -879464 -869632 -857331 -852652 -848785 -860006 -853677 -849758 -841676 -834430 -824234 -805911 -794160
11569 -794160 -785655 -776596 -764855 -772380 -774104 -763420 -773042 -791415 -801762 -802025 -794707 -789089 -785202
11556 -785202 -769083 -762390 -751417 -733611 -740037 -744242 -745972 -730144 -727017 -726399 -721926 -711241 -695950
11543 -695950 -691149 -683114 -697174 -691594 -675962 -659291 -672312 -672850 -683718 -695645 -685902 -664296 -659008
11530 -659008 -654462 -647034 -634138 -636767 -651886 -652461 -654417 -642249 -629477 -624978 -623909 -620453 -617741
11517f17741j703J3496J0425J2431m525j267J800J275L851J1073J908r87N589
11504e64375N358M08O115O994J468Q965J0045P900J0416p436q380J0703J1150
11491e00669L219O919Q303Q730J738K874O894P8M181O30J547O985j028l758J0699
11476d42658l406J9860K0435o568o361J0173J8186J224l250J0279j1543j0520
11464d04149m869J1031J1519o73P746M315QK507l458r264Q452J0363Q526P129
11450c50817J0603J4475q59n048p614J886P698J2596O239r092J0859O568n344
11437c07850O522Q260j432L017J7472K384l907N277r1P65R579m826J103J1153
11423b52574K630J4288J1307R006k68k205m204J0484O148O239N422Q619O208Q26
$$ plain form
11517 -617741 -619444 -605948 -595523 -583092 -587617 -588884 -587084 -585809 -581958 -570885 -568977 -569964 -564375
11504 -564375 -559017 -558609 -552494 -545500 -544032 -535067 -525022 -517122 -506706 -514142 -522522 -511819 -500669
11491 -500669 -497450 -490531 -482228 -473498 -471760 -468886 -461992 -461914 -457733 -457103 -455556 -448571 -449599 -453357 -442658
11476 -442658 -446064 -426204 -405769 -412337 -418698 -408525 -390339 -389115 -392365 -382086 -393629 -404149
11464 -404149 -409018 -397987 -386468 -387141 -379395 -375080 -375072 -372565 -376023 -385287 -376835 -366472 -357946 -350817
11450 -350817 -340214 -325739 -326598 -331646 -339260 -337374 -329676 -317080 -310841 -319933 -309074 -302506 -307850
11437 -307850 -301328 -293068 -294500 -291483 -274011 -271627 -275534 -270257 -270348 -269583 -260004 -264830 -263727 -252574
11423 -252574 -249944 -235656 -224349 -215343 -215611 -217816 -222020 -211536 -205388 -199149 -193727 -185108 -178900 -178074
11409a78074m140r390l16N748J0729m175N699N790J5319R381o231L514J1092m820
11395a39874J2082K2159m212K349Q863n002q978Q357M978P375q498KP96n984O02
11380a04985J4364N023P066m284J888J0291J4699N385J2318l607m980M338R281
11367c3203j297K553J0693l286k349J9208K0237n312p086j9q917j481J4736J8077
11353B2554N982r033O69O902R47m864J0023J1921J4799M096J1313N872J7413Q506
11339A07100o913l841n922o665J8699J0776K02q521n166J3295J3920k059P266
11326A32171P856j1580j3283Q961J9202K4062l550l30r53n028N067J858l683J0913
11312A71683O896l21O668n336O954m725P247R227M094Q896j1539p819J5963J1155
$$ plain form
11409 -178074 -182214 -191604 -191920 -186172 -175443 -179618 -173919 -168129 -152810 -143429 -149660 -146146 -135054 -139874
11395 -139874 -127792 -105633 -109845 -107496 -98633 -103635 -112613 -104256 -99278 -91903 -100401 -100399 -99603 -105587 -104985
11380 -104985 -90621 -85598 -78532 -82816 -80928 -70637 -55938 -50553 -38235 -41842 -46822 -42484 -33203
11367 -33203 -34500 -31947 -21254 -24540 -26889 -7681 12556 7244 158 139 -8778 -10259 4477 22554
11353 22554 28536 19503 20172 27074 28021 23157 33180 45101 59900 63996 75309 81181 98594 107100
11339 107100 100187 96346 90424 83759 102458 113234 113436 104915 99749 113044 126964 124905 132171
11326 132171 140027 128447 115164 124125 143327 167389 163839 163509 162556 157528 162595 164453 160770 171683
11312 171683 178579 178258 184926 179590 186544 181819 189066 198293 202387 211283 199744 191925 207888 219043
11298B19043J6557q113j183J626J2673N130Q996J6643M91L53m080l064J1278J1865
11284B88215k599o57J0307J1458L18L813K017k1216p294J229K5469K0866J4170
11271C46096j3756l349O327P378M041m871Q395J0961J6788q971O88M797j506K565
11257C75583O605K880J857L17Q488r46L206K834q618L424L841O667R198J3114
11243D28450O514J6671o650K860J220j6491l227J6720L831K2802m301j107K3001
11230D90293J5915N207J2987Q478P299M796q122o484M679O059l855o018m540k8354
11216D98340k8077J3017K2511n313J1657J5908O037O062Q788j628J0554O776q32
11203E63800j425J404J9039K684j954P087J7166J3614Q276J3839J454M37l520
$$ plain form
11298 219043 235600 227487 226304 227930 240603 245733 254729 271372 271863 272216 268136 265072 276350 288215
11284 288215 285616 284959 295266 306724 307042 310855 312872 291656 284362 285591 311060 331926 346096
11271 346096 332340 328991 335318 342696 346737 341866 350261 361222 378010 369039 369727 374524 373018 375583
11257 375583 382188 385068 386925 387242 395730 394784 397990 400824 392206 395630 399471 406138 415336 428450
11243 428450 434964 451635 444985 447845 449065 432574 429347 446067 449898 472700 468399 467292 490293
11230 490293 506208 511415 524402 532880 540179 544975 536853 530369 535048 541107 537252 531234 526694 498340
11216 498340 470263 483280 505791 500478 512135 528043 534080 540142 548930 547302 557856 564632 563800
11203 563800 562375 563779 582818 585502 583548 590635 607801 621415 629691 643530 644984 645421 641901
11190F41901j499O701J2674J7108K203j2751k8169j8356p156j6445J5282O526
11178F18019J3384J2419R829K4848J4166Q114o077j8798l045K1613J6625O680
11166G17777o012Q695O427j800P911J9740J7238j2591r578N870O648K931l169
11153G60087m402J861R903O724R361M827j2830k202J0015J5502J7669J3829q53
11140H29491O164J872j237J509Q150J9097o039N847L739m364N056K382N493K789
11126H79949j3081K040J7297J3846K838J2365Q351k579J9043J0353N037O388P213
11113I69060J1769J340P755m062l114O530J693n046j5288r309J7309K0845J4086
11100A013568J1090J277j1605N374J5021J2095P440Q826K339N695J1849N588R675
$$ plain form
11190 641901 640402 647103 659777 676885 679088 666337 638168 619812 612656 596211 611493 618019
11178 618019 631403 643822 653651 678499 692665 700779 694702 675904 672859 694472 711097 717777
11166 717777 711765 720460 726887 725087 732998 752738 769976 757385 747807 753677 760325 763256 760087
11153 760087 755685 757546 767449 774173 783534 788361 775531 773329 783344 798846 816515 830344 829491
11140 829491 835655 837527 836290 837799 845949 865046 859007 864854 868593 864229 869285 871667 877160 879949
11126 879949 866868 868908 886205 900051 902889 915254 923605 921026 940069 950422 955459 961847 969060
11113 969060 980829 982169 989924 985862 982748 989278 990971 985925 970637 961328 978637 999482 1013568
11100 1013568 1024658 1025935 1014330 1019704 1034725 1046820 1054260 1063086 1065425 1071120 1082969 1088557 1098232
11087A098232P650J0158P420j708j895n45m903o700Q100J3671J603J5066J1985
11074A158134J943o487j0369n980L626R192Q541O447J1040N785k365j031L0533
11061A209009k735P45K146L456P575N89j667J733J6721L357N901J9883P948J0700
11047A285361j789Q249J6301K0761J4940J372J7596K3989K8799J6486r91N278
11035A436352K912k6901m0952l0320m6958l6671k0456j0243l193K2526L8635J6819
11023A301550J3056R614J1845O237P661J7577K1876K2518K4989J062J6385P034
11011A461404O93J0543L0799L9998L4358O735j0495j2610j5466l4848m7502n4512
10999A409097m0480j0703k109N81J1959J8121K5655K7339n53O876L2588J3172
$$ plain form
11087 1098232 1105882 1116040 1123460 1121752 1119857 1119312 1114409 1107709 1115809 1129480 1131083 1146149 1158134
11074 1158134 1160077 1153590 1143221 1137241 1140867 1150059 1158600 1165047 1176087 1181872 1179507 1178476 1209009
11061 1209009 1206274 1207019 1209165 1212621 1220196 1220785 1219118 1220851 1237572 1240929 1246830 1266713 1274661 1285361
11047 1285361 1283572 1291821 1308122 1328883 1343823 1345195 1362791 1386780 1415579 1432065 1431074 1436352
11035 1436352 1439264 1412363 1371411 1341091 1294133 1257462 1237006 1226763 1223570 1246096 1284731 1301550
11023 1301550 1314606 1324220 1336065 1342302 1349963 1367540 1389416 1411934 1436923 1437985 1454370 1461404
11011 1461404 1462097 1472640 1503439 1543437 1577795 1584530 1574035 1561425 1545959 1511111 1463609 1409097
10999 1409097 1368617 1357914 1355805 1356386 1368345 1386466 1412121 1439460 1438907 1445783 1478371 1491543
10987A491543J5808J5694M134J5072M55n291R421P128P199R267J2049O717k582
10974A586614J5013J7330n728N504J1870N444J74k289K973J1479J6160L4741J4699
10961A713984m130K640P984k131K1666L64j4419n47K552L498Q287L250J1692K5404
10947A780094K279O375K492n180P461J5388J9050J663K2672J6659J836J1436K158
10934A884383R830J2392J2502k053L098J2599P289p933K788J4186M845J1640J1978
10921A977544J046P247R923K4795K7319J4410k822M039K3734J6178J5767J7456
10909B136636m012j01J8634R805Q218J7776J3402j44K6M627l905k673O707J6893
10895B221889J8454J6779K9005L8876M0624L8426L8188K6906J7022N376J0243
$$ plain form
10987 1491543 1507351 1523045 1527179 1542251 1542706 1537415 1546836 1553964 1561163 1570430 1582479 1589196 1586614
10974 1586614 1601627 1618957 1613229 1618733 1630603 1636047 1636221 1633932 1636905 1648384 1664544 1699285 1713984
10961 1713984 1709854 1712494 1720478 1718347 1740013 1740377 1725958 1725411 1727963 1731461 1739748 1742998 1754690 1780094
10947 1780094 1782373 1788748 1791240 1786060 1793521 1808909 1827959 1829622 1852294 1868953 1870789 1882225 1884383
10934 1884383 1894213 1906605 1919107 1917054 1920152 1932751 1940040 1932107 1934895 1949081 1953926 1965566 1977544
10921 1977544 1978590 1985837 1995760 2020555 2047874 2062284 2059462 2063501 2087235 2103413 2119180 2136636
10909 2136636 2132624 2132523 2151157 2160962 2169180 2186956 2200358 2200214 2200240 2204867 2200962 2198289 2204996 2221889
10895 2221889 2240343 2257122 2286127 2325003 2365627 2404053 2442241 2469147 2486169 2491545 2501788
10884B501788K9989M2342L6603L7603L8718K6307M8345N9794Q4141Q7928J01991
10873C095549J22911J10600K4510j78834n22569p53267n44805j59909M8175J24433
10863A366794J20580J05020R9760Q3288N9742N9832M4330L0900M0672L0200J7743
10852B058861K0631L6433K7769J0482J4656J7280L3672K8151K2038J2430K771
10841B285174K2337K6610K2290J1638J4160J8049J5142K1760K1204J462J1472
10830B471298N645Q389M956K0358P93K064K0094J4473K6206N912M624J9134O792
10817B610738J2672J1750R962J6586J3352O228J7031K8946J3207J1329J0134P850
10805B769785J1209J2664J7915J4108J338J3463M369J2599J7572J9298J3011O934
$$ plain form
10884 2501788 2531777 2574119 2610722 2648325 2687043 2713350 2761695 2821489 2905630 2993558 3095549
10873 3095549 3218460 3329060 3353570 3174736 2652167 1898900 1354095 1194186 1242361 1366794
10863 1366794 1487374 1592394 1692154 1775442 1835184 1895016 1939346 1970246 2010918 2041118 2058861
10852 2058861 2079492 2115925 2143694 2154176 2168832 2186112 2219784 2247935 2269973 2282403 2285174
10841 2285174 2307511 2334121 2356411 2368049 2382209 2400258 2415400 2437160 2458364 2459826 2471298
10830 2471298 2476943 2485332 2490288 2510646 2511439 2513503 2533597 2548070 2574276 2580188 2584812 2603946 2610738
10817 2610738 2623410 2635160 2645122 2661708 2675060 2681288 2698319 2727265 2740472 2751801 2761935 2769785
10805 2769785 2780994 2793658 2811573 2825681 2827019 2840482 2844851 2857450 2875022 2894320 2907331 2914265
10793B914265m310J1934K4027K4414o282K212J5156k440O27J5715J2852J4243
10781C022413J1063J8681M487J1351J1048J2350J8864K6088L1118J0032N536Q171
10769C191202Q152L282R997O505Q362L3421L0297J7885o892J0406K1603K5317
10757C359537J1966P134J3552M236J3086K6964J3429P959J6626J8558J0072J9537
10745C522656J2023j1939J163J5251L3046K5258J4880Q379Q260K5705K2865Q142
10733C685689R258M800J8160J8411J6204K4047J6996J4388L0083L4734J1182J0974
10721C894926K8559J8197J6187K7860K1861J5675K2583J9457J9880K2365J4040
10710D121590K7770K5189M5502L1519L1422Q103m1232q8841q5394l8203K2724
$$ plain form
10793 2914265 2909955 2921889 2945916 2970330 2964048 2966260 2981416 2978976 2979603 2995318 3008170 3022413
10781 3022413 3033476 3052157 3056644 3067995 3079043 3091393 3110257 3136345 3167463 3177495 3183031 3191202
10769 3191202 3199354 3202636 3212633 3219138 3227500 3260921 3291218 3309103 3302211 3312617 3334220 3359537
10757 3359537 3371503 3378637 3392189 3396425 3409511 3436475 3449904 3457863 3474489 3493047 3503119 3522656
10745 3522656 3534679 3522740 3523903 3539154 3572200 3597458 3612338 3620717 3628977 3654682 3677547 3685689
10733 3685689 3694947 3699747 3717907 3736318 3752522 3776569 3793565 3807953 3838036 3872770 3883952 3894926
10721 3894926 3923485 3941682 3957869 3985729 4007590 4023265 4045848 4065305 4085185 4107550 4121590
10710 4121590 4149360 4174549 4220051 4251570 4282992 4291095 4249863 4161022 4075628 4037425 4060149
10699D060149M1004M2062L5286K9437K4844L9874K7752K7957K9284J7868M564
10688D380081J5228J8337L4340M4250J5701J7248L1416K9109L0779J5120R977
10677D641586J3450K2693K7928J3025J3521K6736L1749L8986J9999L9357J2373
10666D901403J8026L4486L1086K3805J4906M7715L3809J2716J8015K2797M1333
10655E200097L7504K8138K3906K1383O966J2048L2131L5785L5679L1247J8707
10644E483591M631j972l480O547K0284K7795L5369L8794L6700L8483N3437N6259
10632E796438L3385K6930K8328L3100M5459M7177M0827K9734M2185N3004L7794
10621F214361L0616M0005N8906N5541M2823M5147M3604N4720L2459M0057M9171
$$ plain form
10699 4060149 4101153 4143215 4178501 4207938 4232782 4272656 4300408 4328365 4357649 4375517 4380081
10688 4380081 4395309 4413646 4447986 4492236 4507937 4525185 4556601 4585710 4616489 4631609 4641586
10677 4641586 4655036 4677729 4705657 4718682 4732203 4758939 4790688 4829674 4849673 4889030 4901403
10666 4901403 4919429 4953915 4985001 5008806 5023712 5071427 5105236 5117952 5135967 5158764 5200097
10655 5200097 5237601 5265739 5289645 5311028 5317994 5330042 5362173 5397958 5433637 5464884 5483591
10644 5483591 5488222 5486250 5482770 5489317 5509601 5537396 5572765 5611559 5648259 5686742 5740179 5796438
10632 5796438 5829823 5856753 5885081 5918181 5963640 6010817 6051644 6081378 6123563 6176567 6214361
10621 6214361 6244977 6284982 6343888 6399429 6442252 6487399 6531003 6585723 6618182 6658239 6707410
10610F707410M4506K7683L3729M9660L6342M0106N1021N6842O0541M8742M0695
10599G197277M5893L7820N5303P2746P4897M5502N6576P9967P4241O7440O8640
10588G876302O9126Q0242Q4828Q5807Q4643P9329J00496J19158J06485Q8273M8486
10577H823175p7748j99986j35625n93P6590R1128Q1780Q4472Q1309Q5976Q9037
10566H999515Q2767Q7120R0573P2136R6739J14555J15495J02499Q4308R4484P2991
10555A0013182P0596O9600Q8922J04323J15195J19144J15474J24086J20514J13491
10545A1054527J09745J17463J19762J27434J39479J27074J15440J22557J35511
10536A2168992J33063J31584J51264J50076J53024J64617J73145J65394J56447
$$ plain form
10610 6707410 6751916 6779599 6813328 6862988 6899330 6939436 6990457 7047299 7107840 7156582 7197277
10599 7197277 7243170 7280990 7336293 7409039 7483936 7529438 7586014 7665981 7740222 7807662 7876302
10588 7876302 7945428 8025670 8110498 8196305 8280948 8360277 8460773 8579931 8686416 8774689 8823175
10577 8823175 8745427 8545441 8409816 8409223 8485813 8576941 8658721 8743193 8824502 8910478 8999515
10566 8999515 9082282 9169402 9259975 9332111 9428850 9543405 9658900 9761399 9845707 9940191 10013182
10555 10013182 10083778 10153378 10242300 10346623 10461818 10580962 10696436 10820522 10941036 11054527
10545 11054527 11164272 11281735 11401497 11528931 11668410 11795484 11910924 12033481 12168992
10536 12168992 12302055 12433639 12584903 12734979 12888003 13052620 13225765 13391159 13547606
10527A3547606J79646J92785K00941K05463J89826J87367J90254K18098K37640
10518A5349626K12935K06255K18720K19949K34559K46983K62215K82270L04943
10509A7538455L26689L24863L07209L02086L01958K97627L23070L43853L48214
10500B0414024L48224L43605L33735L85251M66541N21181N57723N61215N57483
10491B4488982N80105O35546O95884P37381P53693P85397Q37033Q79578R13633
10482C1307232R92681J057108J110429J161987J244473J324063J396679J479970
10474D1074622J613102J794491K000052K204805K386975K504133K489849K518104
10466E8586133K999381L831640M665828N367453O086035P019799Q285758R901458
$$ plain form
10527 13547606 13727252 13920037 14120978 14326441 14516267 14703634 14893888 15111986 15349626
10518 15349626 15562561 15768816 15987536 16207485 16442044 16689027 16951242 17233512 17538455
10509 17538455 17865144 18190007 18497216 18799302 19101260 19398887 19721957 20065810 20414024
10500 20414024 20762248 21105853 21439588 21824839 22291380 22812561 23370284 23931499 24488982
10491 24488982 25069087 25704633 26400517 27137898 27891591 28676988 29514021 30393599 31307232
10482 31307232 32299913 33357021 34467450 35629437 36873910 38197973 39594652 41074622
10474 41074622 42687724 44482215 46482267 48687072 51074047 53578180 56068029 58586133
10466 58586133 61585514 65417154 70082982 75450435 81536470 88556269 96842027 106743485
10458A06743485J1909819J4550649J8170678K2363761K5147436K1083161p13597
10451B19255392n3824808j28643171j53028577q7577648j2380500J9753487K4643879
10444a71801946K1527830J7385756J4198454J1938303J0032877Q467662P284634
10437h0966430O292811N451429M730455M059283L379299K599803K021487J950528
10429e0481335K149219K249358K146927K025610J912376J766725J601611J457366
10421c5172143J304221J216757J139068J061321R84386R18359Q81608Q41979P70391
10412b6054053P33480O78696N94912N04764M08801L34140L34082L69631M22503
10403b1673044M67370M94831N11968M90083M60434M29105M08664L86718L98385
$$ plain form
10458 106743485 118653304 133203953 151374631 173738392 198885828 219968989 219255392
10451 219255392 165430584 36787413 -116241164 -203818812 -216199312 -196445825 -171801946
10444 -171801946 -150274116 -132888360 -118689906 -106751603 -96718726 -88251064 -80966430
10437 -80966430 -74673619 -69222190 -64491735 -60432452 -57053153 -54453350 -52431863 -50481335
10429 -50481335 -48332116 -46082758 -43935831 -41910221 -39997845 -38231120 -36629509 -35172143
10421 -35172143 -33867922 -32651165 -31512097 -30450776 -29466390 -28548031 -27666423 -26824444 -26054053
10412 -26054053 -25320573 -24641877 -24046965 -23542201 -23133400 -22799260 -22465178 -22095547 -21673044
10403 -21673044 -21205674 -20710843 -20198875 -19708792 -19248358 -18819253 -18410589 -18023871 -17625486
10394a7625486M13251L72480L16056K97152K72912K80426K70295K75620K80930
10385a4846364K76615K78413K74414K33196K15305K31684K19338J94793K02551
10376a2720055K08312J87579J57525J62493J74357J82282J93045J77089J71977
10367a1105396J64468J36798J24101J16007P4620O5010R2947J00873J05963J25163
10357i999446J27667J40738J57182J42042J24768J23302J21730J04601R0259R6488
10347h770669R3592R4596J18308J21861J14274J19410J15090R5094P0055O3928
10337g764461P3813R1668J01118Q4936R1758R5281Q0156P6826R8069J03295J12943
10326f754598J06707P6597M1705L2534L1544M1641O9094P0138P2497N4515N6561
$$ plain form
10394 -17625486 -17212235 -16839755 -16523699 -16226547 -15953635 -15673209 -15402914 -15127294 -14846364
10385 -14846364 -14569749 -14291336 -14016922 -13783726 -13568421 -13336737 -13117399 -12922606 -12720055
10376 -12720055 -12511743 -12324164 -12166639 -12004146 -11829789 -11647507 -11454462 -11277373 -11105396
10367 -11105396 -10940928 -10804130 -10680029 -10564022 -10489402 -10424392 -10331445 -10230572 -10124609 -9999446
10357 -9999446 -9871779 -9731041 -9573859 -9431817 -9307049 -9183747 -9062017 -8957416 -8867157 -8770669
10347 -8770669 -8677077 -8582481 -8464173 -8342312 -8228038 -8108628 -7993538 -7898444 -7828389 -7764461
10337 -7764461 -7690648 -7598980 -7497862 -7412926 -7321168 -7225887 -7145731 -7068905 -6970836 -6867541 -6754598
10326 -6754598 -6647891 -6571294 -6529589 -6497055 -6465511 -6423870 -6354776 -6284638 -6212141 -6157626 -6101065
10315f101065N2558M9640N1951N6894L6021J3007L9654M5685N7894O0011L4275
10304e603475M0122K2570M7426P4908P7858N7427O2390P4754M2774M1811M5439
10293e015996M3130M2170M5236N7755N5148M6208L4666M3168K0756L0366N7156
10282d540237M2310L2178L1277J8775L6343N6150M8738K6391K7032K1787P955
10271d191301P012L3558M3438N1332M8874M0625K6207J5823J1674L9173N3848
10260c819737M1577L7734O1414O1154M5075M0058N6184L7155L0953K2012L9693
10249c346728L2309L0076N8711N3946K0399K8052J9186J9365L5363K8097M0560
10238b980664K5080L9527L0576L7231L9080J9111K3239M0535L5139J2785L1614
$$ plain form
10315 -6101065 -6048507 -5998867 -5946916 -5890022 -5854001 -5840994 -5801340 -5755655 -5697761 -5637750 -5603475
10304 -5603475 -5563353 -5540783 -5493357 -5418449 -5340591 -5283164 -5220774 -5146020 -5103246 -5061435 -5015996
10293 -5015996 -4972866 -4930696 -4885460 -4827705 -4772557 -4726349 -4691683 -4648515 -4627759 -4597393 -4540237
10282 -4540237 -4497927 -4465749 -4434472 -4415697 -4379354 -4323204 -4274466 -4248075 -4221043 -4199256 -4191301
10271 -4191301 -4184289 -4150731 -4107293 -4055961 -4007087 -3966462 -3940255 -3924432 -3912758 -3873585 -3819737
10260 -3819737 -3778160 -3740426 -3679012 -3617858 -3572783 -3532725 -3476541 -3439386 -3408433 -3386421 -3346728
10249 -3346728 -3314419 -3284343 -3225632 -3171686 -3151287 -3123235 -3104049 -3084684 -3049321 -3021224 -2980664
10238 -2980664 -2955584 -2916057 -2885481 -2848250 -2809170 -2790059 -2766820 -2726285 -2691146 -2678361 -2646747
10227b646747K8805K9163J4544J7122K6472K7492J7821K1291K7481L5738K6368
10216b374450J4851K0978K9468L0485K9401M2225K1447K3580M0132K7648K0006
10205b074229K8933K6744J6319K0869K5359K6709K0229J6227J3256P669J4885
10194a857030J6037J9590K1430K7386M4460K8739J7929L3942L1038J9064K7567
10183a569848K3255J2238K5675J2364J5114K5753L2720K0809K0625K1335J9495
10172a340465L1528L0599K3580K4338K1792K8330K3349L0236J6241Q721J1084
10161a090667K4528K3302L1331M4163L3067M1179K6619K2349J7071L1919K7779
10150g67360K6592L2820M2686L6662L8122L7234K2804J7013K1552K3430J4579
$$ plain form
10227 -2646747 -2617942 -2588779 -2574235 -2557113 -2530641 -2503149 -2485328 -2464037 -2436556 -2400818 -2374450
10216 -2374450 -2359599 -2338621 -2309153 -2278668 -2249267 -2207042 -2185595 -2162015 -2121883 -2094235 -2074229
10205 -2074229 -2045296 -2018552 -2002233 -1981364 -1956005 -1929296 -1909067 -1892840 -1879584 -1871915 -1857030
10194 -1857030 -1840993 -1821403 -1799973 -1772587 -1728127 -1699388 -1681459 -1647517 -1616479 -1597415 -1569848
10183 -1569848 -1546593 -1534355 -1508680 -1496316 -1481202 -1455449 -1422729 -1401920 -1381295 -1359960 -1340465
10172 -1340465 -1308937 -1278338 -1254758 -1230420 -1208628 -1180298 -1156949 -1126713 -1110472 -1101751 -1090667
10161 -1090667 -1066139 -1042837 -1011506 -967343 -934276 -893097 -866478 -844129 -827058 -795139 -767360
10150 -767360 -740768 -707948 -665262 -628600 -590478 -553244 -530440 -513427 -491875 -468445 -453866
10139d53866J6804L0019K4619L3234M5231M8021L6061J9585L0737L5036L9975
10128i4544L6274M1434M1941N2679L5783N0632N0656M8759M9980N3223O2536O7937
10116D97290P5196P2964Q9390J03916J30902J48199J55729J96912K02198J87042
10106A859738J11823j45837o02076j021199j016374o08614j60409J14107J99601
10097a269240K13686J90027J53431J31483J16316J09220R1136P6711P2708N8415
10087e6107N0712N8668M3383M5836M9831M0648M4638N5106O3137M6870L1278M8756
10075E22756M1220M2530L8383M6471M8816L7393K6643M4154N7556N1779L8663
10064I96364M7552M4103M0966M2827L0594J7969K1542L0582L2052M3928M5844
$$ plain form
10139 -453866 -437062 -407043 -382424 -349190 -303959 -255938 -219877 -200292 -169555 -134519 -94544
10128 -94544 -58270 -16836 25105 77784 113567 164199 214855 263614 313594 366817 429353 497290
10116 497290 572486 645450 734840 838756 969658 1117857 1273586 1470498 1672696 1859738
10106 1859738 1971561 1825724 1223648 202449 -813925 -1422539 -1582948 -1468841 -1269240
10097 -1269240 -1055554 -865527 -712096 -580613 -464297 -355077 -263941 -187230 -114522 -56107
10087 -56107 -5395 53273 96656 142492 192323 232971 277609 332715 395852 442722 474000 522756
10075 522756 563976 606506 644889 691360 740176 777569 804212 848366 905922 957701 996364
10064 996364 1043916 1088019 1128985 1171812 1202406 1220375 1241917 1272499 1304551 1348479 1394323
10053A394323N8589O0447L9042M3747N3013O5838O0641N0942O8845O0496O6222
10042B022145P5776Q6363Q5326Q1319Q9048R7153J09723J17780J44828J61736
10032C071197J96139K24433K64497K95107K78509J80955o7525m89204p64083p31600
10022B458425p12766q05645p35644m67361j14108J18744K15744K54729K47870
10013D59988K15208K03837J73179J41656J22266J02316R4268R6208P7971P5516
10003A762413Q2974P4827Q5246P8729Q8161Q8420Q7347O9569N9814O4670O4431
9992B606601Q8964R1215Q2226Q2239P1684O5896O5594P1401O4257N9157P2342
9981C421576P8331P7250P8770P4155Q9509R1342O3098Q1499R1724Q1591Q5819
$$ plain form
10053 1394323 1452912 1513359 1552401 1596148 1649161 1714999 1775640 1826582 1895427 1955923 2022145
10042 2022145 2097921 2184284 2269610 2350929 2439977 2537130 2646853 2764633 2909461 3071197
10032 3071197 3267336 3491769 3756266 4051373 4329882 4510837 4443312 3954108 3190025 2458425
10022 2458425 1745659 940014 204370 -262991 -377099 -258355 -42611 212118 459988
10013 459988 675196 879033 1052212 1193868 1316134 1418450 1512718 1608926 1686897 1762413
10003 1762413 1845387 1920214 2005460 2084189 2172350 2260770 2348117 2417686 2477500 2542170 2606601
9992 2606601 2695565 2786780 2869006 2951245 3022929 3088825 3154419 3225820 3290077 3349234 3421576
9981 3421576 3499907 3577157 3655927 3730082 3819591 3910933 3974031 4055530 4147254 4228845 4314664
9970D314664R4263R6546J03674J05008R4658J00480J11453J10795R9822J19167
9960E350530J28968J19856J26061J22416J47497J48956J49687J56915J73445J85565
9950F809896K08345K01982K01525K11094K36701K79488L06800L24732L34425L47357
9940I462345L49468L18737K81115K10932P2468j14201k89377l57172k94099j87394
9930I452822l0859J20046J80789O4899k21934m95173o49677m89678p3952L36864
9920H194147N97418P29501P63544O64097M45649J80315o3292j81325j25726m2921
9910A1161407M108Q5517R1931r4827m37416p89151j028061j075994j018052r52192
9900E947270q78029p60200o04523l66383k0223L07317N64536O87528N27015R6776
$$ plain form
9970 4314664 4408927 4505473 4609147 4714155 4808813 4909293 5020746 5131541 5231363 5350530
9960 5350530 5479498 5599354 5725415 5847831 5995328 6144284 6293971 6450886 6624331 6809896
9950 6809896 7018241 7220223 7421748 7632842 7869543 8149031 8455831 8780563 9114988 9462345
9940 9462345 9811813 10130550 10411665 10622597 10695065 10580864 10291487 9934315 9640216 9452822
9930 9452822 9421963 9542009 9722798 9787697 9565763 9070590 8420913 7931235 7857283 8194147
9920 8194147 8791565 9521066 10284610 10948707 11394356 11574671 11511379 11330054 11204328 11161407
9910 11161407 11165515 11251032 11342963 11248136 10810720 10021569 8993508 7917514 6899462 5947270
9900 5947270 5069241 4309041 3704518 3338135 3317912 3625229 4189765 4877293 5404308 5501084
9890E501084l45110n38570m39928j77118J49051L62930M24918M33187L52424P9065
9880E801933l92175q80805j121052j135412j062875q53966m80501l5445J42064
9871a8234r057k53218l15704o7667K57413L62886K11780M6122J11188M49792Q68741
9860A644042J162025J220912J058267P34347L71503r117m08942p82268r64685
9851D026084q77591n72820j00215L00418L57217O5258l27395o49767q73440r33514
9841D14235p38120l45423M5291N16531J001590J277972J278552J028661N99321
9832E078610J60565p2522O6169L41791L03433j21751n57095n90257k69891n999
9822D333053j92191q10399j437872j703232j683663j558047j312288q06330j75159
$$ plain form
9890 5501084 5155974 4617404 4177476 4000358 4149409 4512339 4937257 5370444 5722868 5801933
9880 5801933 5409758 4528953 3407901 2272489 1209614 355648 -124853 -160298 -18234
9871 -18234 -27291 -280509 -596213 -663880 -406467 -43581 168199 214321 325509 775301 1644042
9860 1644042 2806067 4026979 5085246 5819593 6191096 6181979 5773037 4990769 4026084
9851 4026084 3148493 2575673 2475458 2775876 3133093 3198351 2870956 2221189 1347749 414235
9841 414235 -323885 -669308 -624017 -107486 894104 2172076 3450628 4479289 5078610
9832 5078610 5239175 5166653 5232822 5574613 5878046 5756295 5199200 4608943 4339052 4333053
9822 4333053 4140862 3330463 1892591 189359 -1494304 -3052351 -4364639 -5170969 -5346128
9813e346128K79908M93249N18497M14198J21357l40292p31005q76489n97358N3028
9803f011035P05762R76398Q07010M36833P0697l56048q07524j159268j432512
9794f769687j575674j627185j623565j481277j113421o04486j36505J24797J62365
9785a4644638N3960q6839k35371l74550l34469j0137M55596Q46842J018353J009085
9775a2302168Q19126M29680p8006n95192q29834o52779k99498O9459K26492J53530
9765a3059190k3437k30756m35753n77038n19818k68155P752K30619L63516M36705
9755a4075555M60212M61119M38705M26938L97458L40984L16123K76769K78069
9746a0679178K74698K48259K45872K36047J98413J87656J88343J79906J78789
$$ plain form
9813 -5346128 -5066220 -4572971 -4054474 -3640276 -3518919 -3859211 -4590216 -5466705 -6064063 -6011035
9803 -6011035 -5305273 -4328875 -3521865 -3085032 -3014335 -3370383 -4177907 -5337175 -6769687
9794 -6769687 -8345361 -9972546 -11596111 -13077388 -14190809 -14795295 -14931800 -14807003 -14644638
9785 -14644638 -14590678 -14677517 -14912888 -15287438 -15621907 -15632044 -15176448 -14329606 -13311253 -12302168
9775 -12302168 -11483042 -11053362 -11131368 -11726560 -12556394 -13209173 -13508671 -13439212 -13212720 -13059190
9765 -13059190 -13082627 -13313383 -13749136 -14326174 -14845992 -15114147 -15106395 -14875776 -14512260 -14075555
9755 -14075555 -13615343 -13154224 -12715519 -12288581 -11891123 -11550139 -11234016 -10957247 -10679178
9746 -10679178 -10404480 -10156221 -9910349 -9674302 -9475889 -9288233 -9099890 -8919984 -8741195
9737h741195J63202J71526J65042J41986J29217J17109J31135J43492J29215J27963
9727g321308J13319J13009R5157R7745J00476J12658J27284J01775J00064J00299
9717f259522J16577J19721J12717P5737O1513M1915J3973k1182j1971j7962J1379
9706e757105M8080P5157R0296R0753Q7729Q1787P9816O6447N6187N7753O4283
9695d958817O6819N7390N9958N2661M6070N2153N6289O6585P0834O2188L1042
9684d336828N6449M6196M2449N3269M8589M8544O4242N5901N8215O1724N2463
9673c748787N0846M9560M2256L9230L6804M4243M6835M5270M5299M2085N5405
9662c250954L7092M3834M1685L3014M3169M4830L0816L6377N5723M5317L3996
$$ plain form
9737 -8741195 -8577993 -8406467 -8241425 -8099439 -7970222 -7853113 -7721978 -7578486 -7449271 -7321308
9727 -7321308 -7207989 -7094980 -6999823 -6902078 -6801602 -6688944 -6561660 -6459885 -6359821 -6259522
9717 -6259522 -6142945 -6023224 -5910507 -5834770 -5773257 -5731342 -5717369 -5738551 -5750522 -5768484 -5757105
9706 -5757105 -5709025 -5633868 -5543572 -5452819 -5365090 -5283303 -5203487 -5137040 -5080853 -5023100 -4958817
9695 -4958817 -4891998 -4834608 -4774650 -4721989 -4675919 -4623766 -4567477 -4500892 -4430058 -4367870 -4336828
9684 -4336828 -4280379 -4234183 -4191734 -4138465 -4089876 -4041332 -3977090 -3921189 -3862974 -3801250 -3748787
9673 -3748787 -3697941 -3648381 -3606125 -3566895 -3530091 -3485848 -3439013 -3393743 -3348444 -3306359 -3250954
9662 -3250954 -3213862 -3170028 -3128343 -3095329 -3052160 -3007330 -2976514 -2940137 -2884414 -2839097 -2805101
9651b805101K7895N0405N8428M3245M1205M9155L2206J9696M4804M0701M5659
9640b351702N8814L4837L2551L4054K9951M6108M5573M2274L1198M1170M3674
9629a911498K7034L1784L1760L0577K9009N3401N0726L4514M1524N9056L8242
9618a483871K5192M1338N2693M5504L7734L3039M8449N0882K6015L8541K8178
9607a056306L8254L7971M5035L7865M2261M9684N2201M3409N4789L6223L0819
9596e87795K8517M6195M2752M4033N2295O2709N9068N1152N3386M7929M6394M7103
9584f262N7764N9032L7597K7117M3219N5889O1033N6891O2207N0476N8748N6302
9572F20013M3786M8001O8257P7658P9178O7735O8248P2646P4251P0202P5137P1975
$$ plain form
9651 -2805101 -2777206 -2726801 -2668373 -2625128 -2583923 -2534768 -2502562 -2482866 -2438062 -2397361 -2351702
9640 -2351702 -2292888 -2258051 -2225500 -2191446 -2161495 -2115387 -2069814 -2027540 -1996342 -1955172 -1911498
9629 -1911498 -1884464 -1852680 -1820920 -1790343 -1761334 -1707933 -1657207 -1622693 -1581169 -1522113 -1483871
9618 -1483871 -1458679 -1417341 -1364648 -1319144 -1281410 -1248371 -1199922 -1149040 -1123025 -1084484 -1056306
9607 -1056306 -1018052 -980081 -935046 -897181 -854920 -805236 -753035 -709626 -654837 -618614 -587795
9596 -587795 -559278 -513083 -470331 -426298 -374003 -311294 -252226 -201074 -147688 -99759 -53365 -6262
9584 -6262 51502 110534 148131 175248 218467 274356 335389 392280 454487 504963 563711 620013
9572 620013 663799 711800 780057 857715 936893 1004628 1072876 1145522 1219773 1289975 1365112 1437087
9560A437087O6059P1941O4243O6238P0456Q7798R5754P7114Q7417Q7958Q9214
9549B301279R6618R8511J06564J20918J29072J24332J21846J24256J33140J48299
9539C504835J53844J50594J67546J80241J73349J90919K04557K24841K30543K55683
9529E436952L00076L21349L24942L67374L98749M32370M75651N14542N22673N24663
9519I619341N37678M70754K66431k10103j075666k091545k822147k909308k277045
9510d91610j219374k51328L41511O11577O80813O94421P10643P24149P05129O76008
9500C181939O73967O68536O69684P07092P18537P18115O60958N13885K34336k63306
9490H483743q48660j371339j768792j943328j832513j364766p24794j97115J52493
$$ plain form
9560 1437087 1503146 1575087 1639330 1705568 1776024 1863822 1959576 2036690 2124107 2212065 2301279
9549 2301279 2397897 2496408 2602972 2723890 2852962 2977294 3099140 3223396 3356536 3504835
9539 3504835 3658679 3809273 3976819 4157060 4330409 4521328 4725885 4950726 5181269 5436952
9529 5436952 5737028 6058377 6383319 6750693 7149442 7581812 8057463 8572005 9094678 9619341
9519 9619341 10157019 10627773 10894204 10684101 9608435 7516890 4694743 1785435 -491610
9510 -491610 -1710984 -1962312 -1620801 -1009224 -328411 366010 1076653 1800802 2505931 3181939
9500 3181939 3855906 4524442 5194126 5901218 6619755 7337870 7998828 8512713 8747049 8483743
9490 8483743 7635083 6263744 4494952 2551624 719111 -645655 -1370449 -1567564 -1415071
9481a415071M28357N97583O80764P44028P67245P55286P30345P54423P65102P90715
9471E598777Q28252Q61704R17508R82554J021462J057767J097189J079100Q93356
9462A4337669M69844l11274j452958k691861l580749l835425l530743k823281
9454c418778j879810r43951j06202N07998R31056J193098J262596J306727J361745
9445B14479J396922J415527J453298J491089J499179J455420J337352J128109
9437A1391375P12252M2104q29399j837950k926049l909965m528806m592427m108818
9428a0587683l135558j864794o54905K97218R27422J249359J326856J271576J231881
9419i938628J211173J199043J202442J211543J191451J198188J187824J159682
$$ plain form
9481 -1415071 -986714 -389131 291633 1035661 1802906 2558192 3288537 4042960 4808062 5598777
9471 5598777 6427029 7288733 8206241 9188795 10210257 11268024 12365213 13444313 14337669
9462 14337669 14807513 14496239 13043281 10351420 6770671 2935246 -595497 -3418778
9454 -3418778 -5298588 -6242539 -6348741 -5840743 -4909687 -3716589 -2453993 -1147266 214479
9445 214479 1611401 3026928 4480226 5971315 7470494 8925914 10263266 11391375
9437 11391375 12103627 12145731 11316332 9478382 6552333 2642368 -1886438 -6478865 -10587683
9428 -10587683 -13723241 -15588035 -16242940 -15945722 -15018300 -13768941 -12442085 -11170509 -9938628
9419 -9938628 -8727455 -7528412 -6325970 -5114427 -3922976 -2724788 -1536964 -377282
9411c77282J122387J061540R33132O23689J23373n58997j342763k019903k393215
9402b828039k536499k534054k190001j466328o19452Q6653N82545R08561J054661
9393i541953J094136J131015J156384J180221J178694J173573J175250J181216
9385b71464J172564J192604J229424J194673R91414N37802k68273j355831k500522
9376A922391l419992l977139m077575l684138k861605j839173q38433p3733M51775
9367a8397622Q26236J040378J122783J178176J205534J191334J152334J121963
9359i558884J085915J046527J012036R50134Q28920O17799K50754k88644r59435
9350e014878j621368k124564k443656k521021k141342j389697n66318J28964N77499
$$ plain form
9411 -377282 745105 1806645 2739777 3363466 3486839 2927842 1585079 -434824 -2828039
9402 -2828039 -5364538 -7898592 -10088593 -11554921 -12174373 -12087720 -11505175 -10596614 -9541953
9393 -9541953 -8447817 -7316802 -6160418 -4980197 -3801503 -2627930 -1452680 -271464
9385 -271464 901100 2093704 3323128 4517801 5509215 6047017 5778744 4422913 1922391
9376 1922391 -1497601 -5474740 -9552315 -13236453 -16098058 -17937231 -18775664 -18849397 -18397622
9367 -18397622 -17571386 -16531008 -15408225 -14230049 -13024515 -11833181 -10680847 -9558884
9359 -9558884 -8472969 -7426442 -6414406 -5464272 -4635352 -4017553 -3766799 -4055443 -5014878
9350 -5014878 -6636246 -8760810 -11204466 -13725487 -15866829 -17256526 -17822844 -17693880 -17116381
9341a7116381P65896P87621P78600P17574O87501O58875O38711O12712N83328
9332a0885563N50496N18432N12848N08807N18030N41544N26483M76596M06442
9323f325885K59376K9628k40177o00630j013767j257750j265760j077467p64797
9314a2257229l94317l3508K52782M21905M84132M97479N08507M96733M60255M53576
9304i109685M73697M80324M72888M96348N11891M70184M18748L26253P1719m19518
9294e807151j065671j658620j873361j606727j089402m75881L1318L04364L87027
9285a2854104L71161L26248L12886L11558L07366K80651K56508K34611K17586
9276a0235529J94093J75326J45642J53360J38199J23177J21905J16694J03521
$$ plain form
9341 -17116381 -16350485 -15562864 -14784264 -14066690 -13379189 -12720314 -12081603 -11468891 -10885563
9332 -10885563 -10335067 -9816635 -9303787 -8794980 -8276950 -7735406 -7208923 -6732327 -6325885
9323 -6325885 -6066509 -6036881 -6277058 -6877688 -7891455 -9149205 -10414965 -11492432 -12257229
9314 -12257229 -12651546 -12685054 -12432272 -12010367 -11526235 -11028756 -10520249 -10023516 -9563261 -9109685
9304 -9109685 -8635988 -8155664 -7682776 -7186428 -6674537 -6204353 -5785605 -5459352 -5387633 -5807151
9294 -5807151 -6872822 -8531442 -10404803 -12011530 -13100932 -13576813 -13545495 -13241131 -12854104
9285 -12854104 -12482943 -12156695 -11843809 -11532251 -11224885 -10944234 -10687726 -10453115 -10235529
9276 -10235529 -10041436 -9866110 -9720468 -9567108 -9428909 -9305732 -9183827 -9067133 -8963612
9267h963612J18623R5027J00407J18031J01656Q1566Q1912P3015P2568P2603Q0654
9256g967550P9410O7555O6681N0228N6778O2532O4512O1755N0066M8698O0247
9245g299088N5794M4586L5225M7339N5968L7918M9657N9000M9249K5222L1279
9234f807851L1352M1260M0088L7564M7690M5249L3620L5854N0954L9977L1071
9223f373172L9898K4343L2477L2901L8696L1815K8654K7451K9832J2542K2869
9212f051694M5851M2787K0975J7453J7605K6475L0577K5224R676L3003L5904K4496
9200e721668L1105M3277L1765R352K3412L2661K5107K4345K4431J5915J1213J0909
9188e438176K2031K8076K0404K9663J8222K1057P346R138K5626K0223K2266L1954
$$ plain form
9267 -8963612 -8844989 -8749962 -8649555 -8531524 -8429868 -8348302 -8266390 -8193375 -8120807 -8048204 -7967550
9256 -7967550 -7888140 -7820585 -7753904 -7703676 -7646898 -7584366 -7519854 -7458099 -7408033 -7359335 -7299088
9245 -7299088 -7243294 -7198708 -7163483 -7116144 -7060176 -7022258 -6972601 -6913601 -6864352 -6839130 -6807851
9234 -6807851 -6776499 -6735239 -6695151 -6657587 -6609897 -6564648 -6531028 -6495174 -6444220 -6404243 -6373172
9223 -6373172 -6333274 -6308931 -6276454 -6243553 -6204857 -6173042 -6144388 -6116937 -6087105 -6074563 -6051694
9212 -6051694 -6005843 -5963056 -5942081 -5924628 -5907023 -5880548 -5849971 -5824747 -5815071 -5782068 -5746164 -5721668
9200 -5721668 -5690563 -5647286 -5615521 -5606169 -5582757 -5550096 -5524989 -5500644 -5476213 -5460298 -5449085 -5438176
9188 -5438176 -5416145 -5388069 -5367665 -5338002 -5319780 -5298723 -5291377 -5282239 -5256613 -5236390 -5214124 -5182170
9176e182170K9531J6741J5347J3321K1669J5637J2893L2554J6014J1747J6049
9165d980667J8639J6219K2921K0436J9875K3424j580J4910K3244K8577L978J6458
9153d773566K2366K5889J6254J5169J9070K0517J3321L178J5320O334K1740J0423
9141d583985R341J1480K4231K7357J5883J2287M746K437K869J2860K2577L1327
9129d406590K9153L820J5354J8845J765L066K0900J3620J1297P767K3232J6206
9117d241565J9834K1246J6915J6608K0061J4425J5734J5093P64K798K2991K9948
9105d045148J3015N91O771p915L076Q446k477J440l125K5638K0218Q448K2714
9092c948308J1719J0490J0686O113K8527J9804Q169J4146J1557P083J6672J9998
$$ plain form
9176 -5182170 -5152639 -5135898 -5120551 -5107230 -5085561 -5069924 -5057031 -5024477 -5008463 -4996716 -4980667
9165 -4980667 -4962028 -4945809 -4922888 -4902452 -4882577 -4859153 -4860733 -4845823 -4822579 -4794002 -4790024 -4773566
9153 -4773566 -4751200 -4725311 -4709057 -4693888 -4674818 -4654301 -4640980 -4637802 -4622482 -4616148 -4594408 -4583985
9141 -4583985 -4574644 -4563164 -4538933 -4511576 -4495693 -4483406 -4478660 -4476223 -4473354 -4460494 -4437917 -4406590
9129 -4406590 -4377437 -4373617 -4358263 -4339418 -4337653 -4334587 -4313687 -4300067 -4288770 -4281003 -4257771 -4241565
9117 -4241565 -4221731 -4200485 -4183570 -4166962 -4146901 -4132476 -4116742 -4101649 -4100885 -4098087 -4075096 -4045148
9105 -4045148 -4032133 -4031542 -4024771 -4032686 -4029610 -4021164 -4023641 -4022201 -4025326 -3999688 -3979470 -3971022 -3948308
9092 -3948308 -3936589 -3926099 -3915413 -3909300 -3880773 -3860969 -3852800 -3838654 -3827097 -3820014 -3803342 -3783344
9080c783344J0830K0858J9479J2855M023k272l135q294j6333J0582J1678M307
9068c718766J423K2168L6085K0045m42O088P857J7776J7251P930J1750J5749J1787
9055c543299K5335K0902J6309J4417P235j0225Q099J6420M310k773r94m30l98
9042c445092L282r04m251n094J5415J7252M211K0589K1406J5740Q380K3689K4164
9029c301213K9104K0215K8269J5204J0768J4946Q254j3680j8348j2118j7124k2582
9017c258305k2411l48K921L056j0742p575K4839J5650R950L2662J7553J4050K7493
9004c151207K9031K3899N203p284K7775K8648J4641N819J2313J1856J2593Q796
8992b977917n060o175j3098j2408k2789O584J6528K709l433J1911K0968J7054
$$ plain form
9080 -3783344 -3772514 -3751656 -3732177 -3719322 -3715299 -3717571 -3720706 -3729000 -3745333 -3734751 -3723073 -3718766
9068 -3718766 -3717343 -3695175 -3659090 -3639045 -3639487 -3633399 -3625542 -3607766 -3590515 -3582585 -3570835 -3555086 -3543299
9055 -3543299 -3517964 -3497062 -3480753 -3466336 -3459101 -3469326 -3461227 -3444807 -3440497 -3443270 -3444264 -3444694 -3445092
9042 -3445092 -3441810 -3442714 -3446965 -3452059 -3436644 -3419392 -3415181 -3394592 -3373186 -3357446 -3349066 -3325377 -3301213
9029 -3301213 -3272109 -3251894 -3223625 -3208421 -3197653 -3182707 -3174453 -3188133 -3206481 -3218599 -3235723 -3258305
9017 -3258305 -3280716 -3281064 -3278143 -3275087 -3285829 -3293404 -3268565 -3252915 -3242965 -3210303 -3192750 -3178700 -3151207
9004 -3151207 -3122176 -3098277 -3093074 -3100358 -3072583 -3043935 -3029294 -3023475 -3011162 -2999306 -2986713 -2977917
8992 -2977917 -2982977 -2989152 -3002250 -3014658 -3037447 -3030863 -3014335 -3011626 -3015059 -3003148 -2982180 -2965126
8980b965126R073P009O826J4084J6957R565J2628K4248J3221J6842K0930J3559
8968b800184J3907L891J370n377j2229k0688j1882q553j3111J84J4143K2431J4259
8955b801839m885J6399J2605Q672J5858J5717J2793R367J5972K0018J1923J5071
8943b652329P979N602K4260J2362l125m259j7300j2132p658n033N055N516P907
8930b633155J4615J3462J5301O817J7843J4984L437r611K5265L9667r527o16J927
8917b499591J2178Q978J2580J7838J3362K0195K6234J0664N09Q916J5286K719
8905b350132j1703M002J101J736J0150Q633j286J2913J4825J0370R306K5820K5926
8892b238339J3702L893L700J6346J6345R040J2634K2054P629p298p374r46o542
$$ plain form
8980 -2965126 -2956053 -2949044 -2942218 -2928134 -2911177 -2901612 -2888984 -2864736 -2851515 -2834673 -2813743 -2800184
8968 -2800184 -2786277 -2782386 -2781016 -2786393 -2798622 -2819310 -2831192 -2839745 -2852856 -2852672 -2838529 -2816098 -2801839
8955 -2801839 -2806724 -2790325 -2777720 -2769048 -2753190 -2737473 -2724680 -2715313 -2699341 -2679323 -2667400 -2652329
8943 -2652329 -2644350 -2638748 -2614488 -2602126 -2605251 -2609510 -2626810 -2638942 -2646600 -2651633 -2646578 -2641062 -2633155
8930 -2633155 -2618540 -2605078 -2589777 -2582960 -2565117 -2550133 -2546696 -2556307 -2531042 -2491375 -2500902 -2501518 -2499591
8917 -2499591 -2487413 -2478435 -2465855 -2448017 -2434655 -2414460 -2388226 -2377562 -2377053 -2368137 -2352851 -2350132
8905 -2350132 -2361835 -2357833 -2356732 -2354996 -2344846 -2336213 -2337499 -2324586 -2309761 -2299391 -2290085 -2264265 -2238339
8892 -2238339 -2224637 -2220744 -2217044 -2200698 -2184353 -2175313 -2162679 -2140625 -2132996 -2140294 -2147668 -2148614 -2155156
8879b155156o590M052l946K317J4658K0935J8541J9703J2728P066L640J3890J1038
8866b037124N190J4180K0324J1254R567M78J0389J1998R156J4997J5514K160P599
8853a904318K2985J1482p727j5640j8789p932J6728J9790J6622J2925J0946J5501
8841a827427J8947K3348K6563J6010L074K2434L5084L5837K0794J8590J3693k1363
8829a614416q5017j24388o0140J2061K6019K0515L4891L6357K2382J0859J0269
8818a710608J7951J6418Q700J7001K4125J3388J0604K0749K8636J9616K3735R90
8806a508695K120J7513K6208K2873J7593O468K2251K2987J1847K4580J6287J5053
8794a302915K2590K4128K6028M3090L0830M1734M8589N0801K4145q3169k29596
$$ plain form
8879 -2155156 -2161746 -2157694 -2161640 -2159323 -2144665 -2123730 -2105189 -2085486 -2072758 -2065692 -2062052 -2048162 -2037124
8866 -2037124 -2031934 -2017754 -1997430 -1986176 -1976609 -1976131 -1965742 -1953744 -1944588 -1929591 -1914077 -1911917 -1904318
8853 -1904318 -1881333 -1869851 -1877578 -1893218 -1912007 -1919939 -1903211 -1883421 -1866799 -1853874 -1842928 -1827427
8841 -1827427 -1808480 -1785132 -1758569 -1742559 -1739485 -1717051 -1681967 -1646130 -1625336 -1606746 -1593053 -1614416
8829 -1614416 -1699433 -1823821 -1883961 -1871900 -1845881 -1825366 -1790475 -1754118 -1731736 -1720877 -1710608
8818 -1710608 -1692657 -1676239 -1667539 -1650538 -1626413 -1613025 -1602421 -1581672 -1553036 -1533420 -1509685 -1508695
8806 -1508695 -1506575 -1489062 -1462854 -1439981 -1422388 -1415920 -1393669 -1370682 -1358835 -1334255 -1317968 -1302915
8794 -1302915 -1280325 -1256197 -1230169 -1187079 -1156249 -1114515 -1065926 -1015125 -990980 -1074149 -1303745
8783a303745k29053p6936K4545M7006N6536N0885M7670K3784L2433L8626K9631
8772a258618R718J3573K9367J6188J3344J5130J5700j287J2534K1778K5253K5971
8760a061349L9530J8366J2178K1897J7361J8552L386J4667J4866J4880K9424K8578
8748h27664K3229L7547K5962K2776L4361L3625J0076O135m2965j13702q7115j5571
8736h93306L0538M0904M3005K2875K1187L3423J3362L0285M8495K6351J3321L485
8724e66075J9770L2556K6102J3635J5979J2924K1344K5115K9129Q999J5417K0070
8712c25035Q911J604L3439L8776J6450J4584K4791K3790J1780J7156J5567K5969
8700i2218K0593K0064K7979K2173J4833O859J6467K2627J0006K0637M7150L4641
$$ plain form
8783 -1303745 -1532798 -1609734 -1585189 -1538183 -1481647 -1430762 -1383092 -1359308 -1326875 -1288249 -1258618
8772 -1258618 -1248900 -1235327 -1205960 -1189772 -1176428 -1161298 -1145598 -1146885 -1134351 -1112573 -1087320 -1061349
8760 -1061349 -1021819 -1003453 -991275 -969378 -952017 -933465 -930079 -915412 -900546 -885666 -856242 -827664
8748 -827664 -804435 -766888 -740926 -718150 -683789 -650164 -640088 -633953 -676918 -790620 -877735 -893306
8736 -893306 -862768 -821864 -778859 -755984 -734797 -701374 -688012 -657727 -609232 -582881 -569560 -566075
8724 -566075 -546305 -513749 -487647 -474012 -458033 -445109 -423765 -398650 -369521 -360522 -345105 -325035
8712 -325035 -316124 -314520 -281081 -242305 -225855 -211271 -186480 -162690 -150910 -133754 -118187 -92218
8700 -92218 -71625 -51561 -23582 -1409 13424 20283 36750 59377 69383 90020 137170 171811
8688A71811K1611J5954J132J2110K1209M3689L9208K7584J3231K0492R244J8407
8676D15682K9071L2241K2898J6590M0829L5840J8630J5442J8735J3163K9974J9582
8664G08677K1909K4332K4483L4674K3236J9553O619K4368L7060K2842R997J2261
8652I70011J1572P541L9020L7469K4918K5011J0576J3730J3694J1960J487N15
8640A167504K2414J7642J0424j967J917M753N625J6216J4930j1595P11r687j1549
8627A227338k2410k2387K576Q579j5225k1827m0101k3763k5639l4239m5943l8622
8615I48337n3772m6265n3694p1321o1606o6120n3543p2810p6299q5383q2908j00932
8603A23684j03611r8170j06029j28479j33398j18347j10480j29090j27804j30105
$$ plain form
8688 171811 193422 209376 210508 222618 243827 287516 326724 354308 367539 388031 397275 415682
8676 415682 444753 476994 499892 516482 557311 593151 611781 627223 645958 659121 689095 708677
8664 708677 730586 754918 779401 814075 837311 856864 863483 887851 924911 947753 957750 970011
8652 970011 981583 989124 1028144 1065613 1090531 1115542 1126118 1139848 1153542 1165502 1166989 1167504
8640 1167504 1189918 1207560 1217984 1216017 1217934 1222687 1228312 1244528 1259458 1247863 1248574 1238887 1227338
8627 1227338 1204928 1182541 1185117 1193696 1178471 1156644 1116543 1092780 1067141 1032902 986959 948337
8615 948337 894565 848300 794606 723285 661679 595559 542016 469206 392907 307524 224616 123684
8603 123684 20073 -78097 -184126 -312605 -446003 -564350 -674830 -803920 -931724 -1061829
8593a061829j55181j54123j41644j49968j58144j57261j62607j67232j63446j56343
8583b627778j61019j49612j55249j72643j48431j49346j58197j39403j31688j38572
8573d131938j41611j42930j25464j39225j29060j08480j05644j10568j00588q3537
8563e319045q0698j05287p9524q2325p4556o4443o4643n5000n1138n3256o8874
8552f098789m7683l4296k9799k2916k2779r701k0606l3579k9408j9475q138r416
8540f386585j4628k2213j1802M124J2829K951R63q07L308O516J6693J6329L6079
8527f336243J7045K298O044m402k38J2566R677L8K228r90J5156J8926K0988K6259
8513f210648L5445L2370K2078J3085J8428K8736K3260K3130M2871R145Q638K8661
$$ plain form
8593 -1061829 -1217010 -1371133 -1512777 -1662745 -1820889 -1978150 -2140757 -2307989 -2471435 -2627778
8583 -2627778 -2788797 -2938409 -3093658 -3266301 -3414732 -3564078 -3722275 -3861678 -3993366 -4131938
8573 -4131938 -4273549 -4416479 -4541943 -4681168 -4810228 -4918708 -5024352 -5134920 -5235508 -5319045
8563 -5319045 -5399743 -5505030 -5584554 -5666879 -5741435 -5805878 -5870521 -5925521 -5976659 -6029915 -6098789
8552 -6098789 -6146472 -6180768 -6210567 -6233483 -6256262 -6265963 -6286569 -6320148 -6349556 -6369031 -6377169 -6386585
8540 -6386585 -6401213 -6423426 -6435228 -6431104 -6418275 -6415324 -6414361 -6415168 -6411860 -6405344 -6388651 -6372322 -6336243
8527 -6336243 -6319198 -6316900 -6310856 -6315258 -6315496 -6302930 -6293253 -6293215 -6290987 -6291977 -6276821 -6257895 -6236907 -6210648
8513 -6210648 -6175203 -6142833 -6120755 -6107670 -6089242 -6060506 -6037246 -6014116 -5971245 -5962100 -5953462 -5924801
8501e924801K2236K1768J6641J9938K1731J6798L8996K4207R476J7706K7959K4423
8489e662922J8704J8137Q029K0590K5822K2735K7188K7221J7604J3981J3244J6777
8477e432890L7958K8139J7940J3007J1149J9281L2365J0111O471J3880L6027J4678
8465e191884J5710K5744K9193J6959J2894O059Q325J3467K9883K5618J5407J5969
8453d976656K0194L399J3138K0504J9037J8332L3306K5796Q999M192J4073J5969
8441d779717J3942K0922K4142J6213O019P170R872J9610K4692J4697l397J3436
8429d612399J8329J9702K2285K0063J7513J6108k685o438Q957K3777J6789J7767
8417d440232O858R550r72J8455P706J1106L0580K952m568J8773L1625J3461K2315
$$ plain form
8501 -5924801 -5902565 -5880797 -5864156 -5844218 -5822487 -5805689 -5766693 -5742486 -5733010 -5715304 -5687345 -5662922
8489 -5662922 -5644218 -5626081 -5618052 -5597462 -5571640 -5548905 -5521717 -5494496 -5476892 -5462911 -5449667 -5432890
8477 -5432890 -5394932 -5366793 -5348853 -5335846 -5324697 -5305416 -5273051 -5262940 -5256469 -5242589 -5206562 -5191884
8465 -5191884 -5176174 -5150430 -5121237 -5104278 -5091384 -5085325 -5077000 -5063533 -5033650 -5008032 -4992625 -4976656
8453 -4976656 -4956462 -4953063 -4939925 -4919421 -4900384 -4882052 -4848746 -4822950 -4813951 -4809759 -4795686 -4779717
8441 -4779717 -4765775 -4744853 -4720711 -4704498 -4698479 -4691309 -4681437 -4661827 -4637135 -4622438 -4625835 -4612399
8429 -4612399 -4594070 -4574368 -4552083 -4532020 -4514507 -4498399 -4501084 -4507522 -4498565 -4474788 -4457999 -4440232
8417 -4440232 -4433374 -4423824 -4424796 -4406341 -4398635 -4387529 -4356949 -4353997 -4358565 -4339792 -4308167 -4294706 -4272391
8404d272391J2750O127k904J8758K5318P532J0361J799K8338K3807R004Q302J4027
8391d109172K3407K2887J0860N400n070J1929K2991L460R456L2792J9077N992
8379c945991L060Q499J4686J7075K2789K1359J3670J2587J9383K0053K6662J6921
8367c749247Q588K1084J5009J8675K8381L6704K3016K8410L7799N2988P2207P7971
8355c328415O8632K8814m7477j84837l12015k86964j44434j0370M0263N6996O0045
8344d059762O2730N4174K8549J5367J8284K6436K6407K5603K2799K4271L6633
8333c718509K5136K4910K6635J6375K6429J6797K3772J5127J2674K9164M2212
8322c459278L9700L5732L9187L4933L7354M4632N9719N3185O6229Q5897J00089
$$ plain form
8404 -4272391 -4259641 -4253514 -4256418 -4237660 -4212342 -4204810 -4194449 -4192650 -4164312 -4140505 -4131501 -4123199 -4109172
8391 -4109172 -4085765 -4062878 -4052018 -4046618 -4051688 -4039759 -4016768 -4013308 -4003852 -3971060 -3951983 -3945991
8379 -3945991 -3942931 -3934432 -3919746 -3902671 -3879882 -3858523 -3844853 -3832266 -3812883 -3792830 -3766168 -3749247
8367 -3749247 -3740659 -3719575 -3704566 -3685891 -3657510 -3620806 -3597790 -3569380 -3531581 -3478593 -3406386 -3328415
8355 -3328415 -3259783 -3230969 -3278446 -3463283 -3775298 -4062262 -4206696 -4217066 -4176803 -4119807 -4059762
8344 -4059762 -3997032 -3942858 -3914309 -3898942 -3880658 -3854222 -3827815 -3802212 -3779413 -3755142 -3718509
8333 -3718509 -3693373 -3668463 -3641828 -3625453 -3599024 -3582227 -3558455 -3543328 -3530654 -3501490 -3459278
8322 -3459278 -3419578 -3383846 -3344659 -3309726 -3272372 -3227740 -3168021 -3114836 -3048607 -2962710 -2862621
8311b862621J05744J32598J20781p470l40544p03233o87641l56783n0899R5347
8301d554721R3566J11303J07216P9866P6406M3729M4438M1540M0488N2309L9033
8290c824827L4124K5415J8808K0770L1320J6191L0516K2896K2108J2199O967K3676
8278c559837K3101J0432L0698K4479K4128J6752M2429L1682J7003M5172N5970
8267c237991O0668M7715N1717N4222j2037j10085k21483k93418k27810q8788J1256
8256c966034N6303O4727O5612M5782K1401K4078J8157K8047L0984J7735J6871
8245c576337J5383J6465J7686L2360K6107K307j3826M232J8532K0543Q766J2430
8233c415352R148j840O51o228M180J3855J5444M736J1105k682J5502K0824R343
$$ plain form
8311 -2862621 -2756877 -2624279 -2503498 -2510968 -2851512 -3554745 -4242386 -4599169 -4650068 -4554721
8301 -4554721 -4461155 -4349852 -4242636 -4162770 -4086364 -4042635 -3998197 -3956657 -3916169 -3863860 -3824827
8290 -3824827 -3790703 -3765288 -3746480 -3725710 -3694390 -3678199 -3647683 -3624787 -3602679 -3590480 -3583513 -3559837
8278 -3559837 -3536736 -3526304 -3495606 -3471127 -3446999 -3430247 -3387818 -3356136 -3339133 -3293961 -3237991
8267 -3237991 -3177323 -3129608 -3077891 -3023669 -3035706 -3145791 -3367274 -3660692 -3888502 -3977290 -3966034
8256 -3966034 -3909731 -3845004 -3779392 -3733610 -3712209 -3688131 -3669974 -3641927 -3610943 -3593208 -3576337
8245 -3576337 -3560954 -3544489 -3526803 -3494443 -3468336 -3466029 -3479855 -3475623 -3457091 -3436548 -3427782 -3415352
8233 -3415352 -3406204 -3408044 -3407393 -3413621 -3409441 -3395586 -3380142 -3375406 -3364301 -3366983 -3351481 -3330657 -3321314
8220c321314K311O82o880J3988K0799J6686Q631J8221R984o060j70j162l5835
8207c280119j5553J5193K1934Q267P919K993K650M771n487P139L831L802J0127
8194c212533J2235J9117N227k2320k218J2208k709O86O074K3294K1003k1693J288
8181c160341J8982J3004P883O644N94j187J6422J0129J4687J1505n04j350J3527
8168c050005J864n583k6780k1283J2126J8856l579L23o808M295J9805N688j000
8155c052081P801N03O446R749K917j4907k076J0873P070R299J6011R723M780M488
8141b979404L821K440j998R976m118O254K762J5539J9444J0083j4039k008o461
8128b937709P993Q803p714j019J3536J2009m803p862k156N725L892R367J3235
$$ plain form
8220 -3321314 -3319003 -3318321 -3325201 -3311213 -3290414 -3273728 -3265097 -3246876 -3236892 -3242952 -3243122 -3244284 -3280119
8207 -3280119 -3295672 -3280479 -3258545 -3250278 -3242359 -3239366 -3236716 -3231945 -3237432 -3230293 -3226462 -3222660 -3212533
8194 -3212533 -3200298 -3181181 -3175954 -3198274 -3200492 -3188284 -3190993 -3190307 -3184233 -3160939 -3139936 -3161629 -3160341
8181 -3160341 -3141359 -3128355 -3120472 -3113828 -3113234 -3114421 -3097999 -3087870 -3073183 -3061678 -3062182 -3063532 -3050005
8168 -3050005 -3048141 -3053724 -3080504 -3101787 -3089661 -3070805 -3074384 -3074061 -3080869 -3076574 -3056769 -3051081 -3052081
8155 -3052081 -3044280 -3043777 -3037331 -3027582 -3024665 -3039572 -3041648 -3030775 -3023705 -3014406 -2998395 -2988672 -2983892 -2979404
8141 -2979404 -2975583 -2973143 -2975141 -2965165 -2969283 -2963029 -2960267 -2944728 -2925284 -2915201 -2929240 -2931248 -2937709
8128 -2937709 -2929716 -2920913 -2928627 -2929646 -2916110 -2904101 -2908904 -2916766 -2918922 -2913197 -2909305 -2899938 -2886703
8115b886703j6317k0828R699q632j0125L151P497j177j097K5368K2812K3028k712
8102b856036j760N66q390o544R866Q806m756J1438N095M885j928n157J4737j040
8088b830218m35J011r932J2527Q348J8022J4530J854m093q370p485J156J2752
8075b790333M303l04n055o972p604J108l722O159l6j57Q649J2784J2751J6966
8061b751463o340m357R288l189K0277L008j2821m085R476J5034j4604j7950K489
8048b755237J2956J0864O796j796o262M963Q247R389Q540J1484K714q890q111
8035b704343n724M465R579Q717Q152P208j146L521J136J5299Q732j830Q774m300
8021b641760P001J13l479m534K366n55n642K553n331j2179J585J2164J3869R605
$$ plain form
8115 -2886703 -2903020 -2923848 -2914149 -2922781 -2932906 -2929755 -2922258 -2923435 -2924532 -2899164 -2876352 -2853324 -2856036
8102 -2856036 -2857796 -2857230 -2865620 -2872164 -2862298 -2853492 -2858248 -2846810 -2841715 -2836830 -2838758 -2843915 -2829178 -2830218
8088 -2830218 -2830653 -2829642 -2839574 -2827047 -2818699 -2800677 -2786147 -2784293 -2788386 -2796756 -2804241 -2803085 -2790333
8075 -2790333 -2786030 -2786334 -2791389 -2798361 -2805965 -2804857 -2808579 -2802420 -2802456 -2802613 -2793964 -2781180 -2768429 -2751463
8061 -2751463 -2757803 -2762160 -2752872 -2756061 -2735784 -2732776 -2745597 -2749682 -2740206 -2725172 -2739776 -2757726 -2755237
8048 -2755237 -2742281 -2731417 -2724621 -2726417 -2732679 -2727716 -2719469 -2710080 -2701540 -2690056 -2687342 -2696232 -2704343
8035 -2704343 -2710067 -2705602 -2696023 -2687306 -2679154 -2671946 -2673092 -2669571 -2668435 -2653136 -2644404 -2646234 -2637460 -2641760
8021 -2641760 -2634759 -2634646 -2638125 -2642659 -2640293 -2640848 -2646490 -2643937 -2649268 -2661447 -2659862 -2647698 -2633829 -2624224
8007b624224j234M456Q306p07m594l708j759N261J8070r959n318n469N263N226
7993b610390J0215M541p88Q403j2730j7600L09J6853J9194k613L388J1969j426
7980b570675j242M079j5664m446Q716O342R618l013q0L128K147l818N048j3186
7966b573046m831j43L780q419P296P787N908J1121J4267n712J5661J5880J0512
7953b499939o947j1157m13L549N456J0912P747m23k061K134K572l567j2695j2381
7939b517213k20J6213J1804q78j3234r707KR164j470P585J0120Q325m671l026
7925b487206o169O319J0912L43j2365L95O087Q48r34P563r329n666k710J0806
7911b481106M558k161J360P084J5160O357j342o540o207p044L763J3268J3342
$$ plain form
8007 -2624224 -2625458 -2621002 -2612696 -2613403 -2617997 -2621705 -2623464 -2618203 -2600133 -2610092 -2615410 -2620879 -2615616 -2610390
7993 -2610390 -2600175 -2595634 -2596422 -2588019 -2600749 -2618349 -2618040 -2601187 -2581993 -2584606 -2581218 -2569249 -2570675
7980 -2570675 -2571917 -2567838 -2583502 -2587948 -2579232 -2572890 -2563272 -2566285 -2566365 -2563237 -2561090 -2564908 -2559860 -2573046
7966 -2573046 -2577877 -2578020 -2574240 -2582659 -2575363 -2567576 -2561668 -2550547 -2536280 -2541992 -2526331 -2510451 -2499939
7953 -2499939 -2506886 -2518043 -2518456 -2514907 -2509451 -2498539 -2490792 -2491215 -2493276 -2491142 -2488570 -2492137 -2504832 -2517213
7939 -2517213 -2517433 -2501220 -2489416 -2490294 -2503528 -2513235 -2513233 -2504069 -2505539 -2497954 -2487834 -2479509 -2484180 -2487206
7925 -2487206 -2493375 -2487056 -2476144 -2475801 -2488166 -2487771 -2481684 -2480836 -2481770 -2474207 -2483536 -2489202 -2491912 -2481106
7911 -2481106 -2476548 -2478709 -2477349 -2470265 -2455105 -2448748 -2450090 -2456630 -2462837 -2469881 -2466118 -2452850 -2439508
7898b439508M299P98K541p190R914P258o616Q102J027l838q649R56R350j134n021
7883b427711j024j998q810k132P511l624p474P222J4955O887P80Q89O397l204
7869b411336j791k394L899p657j535J1922K2737J3059l846j3793j1187o339Q133
7856b400128P098J3809O561n351P89n368k0163j8722n7J1909J2322J6550l786
7843b384537j798N365O612J2232J6960J803K56k667q022l09J0356N288k941P651
7829b333751m555p320K289M228j2202P563K736j903j4315L486K2446P719L556
7816b320023j40q03k0414J560R492J0434P59J1007L549Q382K614K459j0659j552
7802b303335M655o08m888r771n757p767l99J4923J0683J328q22q704J1689Q276
$$ plain form
7898 -2439508 -2435209 -2434411 -2431870 -2439060 -2429146 -2421888 -2428504 -2420402 -2419375 -2423213 -2431862 -2430906 -2421556 -2422690 -2427711
7883 -2427711 -2428735 -2430733 -2439543 -2441675 -2434164 -2437788 -2445262 -2438040 -2423085 -2416198 -2415418 -2414529 -2408132 -2411336
7869 -2411336 -2413127 -2415521 -2411622 -2419279 -2420814 -2408892 -2386155 -2373096 -2376942 -2390735 -2401922 -2408261 -2400128
7856 -2400128 -2393030 -2379221 -2372660 -2378011 -2377222 -2382590 -2402753 -2421475 -2421532 -2409623 -2397301 -2380751 -2384537
7843 -2384537 -2386335 -2380970 -2374358 -2362126 -2345166 -2343363 -2343107 -2345774 -2353796 -2354105 -2343749 -2338461 -2341402 -2333751
7829 -2333751 -2338306 -2345626 -2343337 -2339109 -2351311 -2343748 -2341012 -2342915 -2357230 -2353744 -2331298 -2323579 -2320023
7816 -2320023 -2320163 -2320966 -2341380 -2339820 -2330328 -2319894 -2319135 -2308128 -2304579 -2296197 -2293583 -2291124 -2301783 -2303335
7802 -2303335 -2298680 -2299288 -2304176 -2313947 -2319704 -2327471 -2327870 -2312947 -2302264 -2300936 -2301758 -2310462 -2298773 -2290497
7788b290497K860O845J080J909n178J2319L614m177j7741L430J4952J3020j0632
7775b268196j2143k320J3037J0173O349k855m224r305j421O907J4747o217N233
7762b250235N159L991o714q944O568J0161o476m567k115L427J5372O078o767q978
7748b244040P362K587J4086O311Q576O04j0952q483n601j531J3374J2754L138
7735b201815J2597K540j6504n013l703R337l152j0918J9737M915j2690k892P964
7722b199597N222j773Q800J22J3411O122p947j8451r9N606r25Q269j017K785M524
7707b174948j6776j601L104j770N111l339N76J2907R035R703q735k630Q264M924
7693b156175p847j0817o5L437J0067P781n615p191l169n921L810J0359m66L795
$$ plain form
7788 -2290497 -2287637 -2280792 -2279712 -2277803 -2282981 -2270662 -2267048 -2271225 -2288966 -2285536 -2270584 -2257564 -2268196
7775 -2268196 -2280339 -2282659 -2269622 -2259449 -2253100 -2255955 -2260179 -2269484 -2270905 -2263998 -2249251 -2255468 -2250235
7762 -2250235 -2245076 -2241085 -2247799 -2256743 -2250175 -2240014 -2246490 -2251057 -2253172 -2249745 -2234373 -2228295 -2235062 -2244040
7748 -2244040 -2236678 -2234091 -2220005 -2213694 -2205118 -2204514 -2215466 -2223949 -2229550 -2231081 -2217707 -2204953 -2201815
7735 -2201815 -2189218 -2186678 -2203182 -2208195 -2211898 -2202561 -2205713 -2216631 -2196894 -2191979 -2204669 -2207561 -2199597
7722 -2199597 -2194375 -2196148 -2187348 -2187226 -2173815 -2167693 -2175640 -2194091 -2194190 -2188584 -2189509 -2181240 -2182257 -2179472 -2174948
7707 -2174948 -2191724 -2193325 -2190221 -2191991 -2186880 -2190219 -2189643 -2176736 -2167701 -2157998 -2166733 -2169363 -2161099 -2156175
7693 -2156175 -2164022 -2174839 -2174904 -2171467 -2161400 -2153619 -2159234 -2166425 -2169594 -2175515 -2171705 -2161346 -2161812 -2158017
7679b158017R825l036R838q672m158J1680J4705l794m709J843J5875J1537o078
7666b113161k3277q050R089J3210l841j5955r94J4164j4172o550J0695l881j1314
7653b154037Q974K0618L030n336J474O804o645n242J4067K2847J756j2121Q44
7640b102967q244p118o882J19j380P472l292j690N594J5565l983o396L720N883
7626b103599P656M827k766j978j344Q747O382k606O473J0613n904Q719R434k778
7612b058124p171j5474o735l886J842M333k81n150R685N269R048K794J572k43
7598b062521J217p0r890J1439K3932J0179j0880n307j476q033j7285J974J9579
7585b047142j1953m952J9101M093j0332q169J0871k014L00P008m189L20J1134
$$ plain form
7679 -2158017 -2148192 -2151228 -2141390 -2150062 -2154220 -2142540 -2127835 -2131629 -2136338 -2134495 -2118620 -2107083 -2113161
7666 -2113161 -2136438 -2144488 -2135399 -2122189 -2126030 -2141985 -2142979 -2128815 -2142987 -2149537 -2138842 -2142723 -2154037
7653 -2154037 -2145063 -2124445 -2121415 -2126751 -2125277 -2118473 -2125118 -2130360 -2116293 -2093446 -2091690 -2103811 -2102967
7640 -2102967 -2111211 -2118329 -2125211 -2125092 -2126472 -2119000 -2122292 -2123982 -2118388 -2102823 -2106806 -2113202 -2109482 -2103599
7626 -2103599 -2095943 -2091116 -2093882 -2095860 -2097204 -2088457 -2082075 -2084681 -2078208 -2067595 -2073499 -2064780 -2055346 -2058124
7612 -2058124 -2065295 -2080769 -2087504 -2091390 -2089548 -2085215 -2085496 -2090646 -2080961 -2075692 -2066644 -2063850 -2062278 -2062521
7598 -2062521 -2061304 -2061374 -2071264 -2059825 -2035893 -2025714 -2036594 -2041901 -2043377 -2051410 -2068695 -2066721 -2047142
7585 -2047142 -2059095 -2064047 -2044946 -2040853 -2051185 -2059354 -2048483 -2050497 -2050197 -2043189 -2047378 -2047058 -2035924
7572b035924j0089j7381M972J6676R556m981N728m706l494J0673K1075M380j1812
7559b015327m240L418N359n704n906L431K039M940l093K534M549o983R718L056
7545b002209j0284R168q54K760J7634N319k1417m098M416Q740J3390L705R152
7532a964578l978j3047Q014p470r722j526M366J0256N861L658R955L253j6820
7519a971778k0757J684J0188n76j906j811M649R615L394j7163j4088J3078J1066
7506a974405R210J5353o449j0501k357N247k615K083M796l430j1587o872L114
7493a978413J0866O990J271J1189K373r062p229K713J0951p449J2681M797M131
7480a934191n294J980m636k337J1385l351k469K830o132k257J1800l983j1978
$$ plain form
7572 -2035924 -2046013 -2063394 -2058422 -2041746 -2032190 -2037171 -2031443 -2036149 -2039643 -2028970 -2007895 -2003515 -2015327
7559 -2015327 -2019567 -2016149 -2010790 -2016494 -2022400 -2018969 -2016930 -2011990 -2015083 -2012549 -2008000 -2014983 -2005265 -2002209
7545 -2002209 -2012493 -2003325 -2004179 -2001419 -1983785 -1978466 -1999883 -2003981 -1999565 -1990825 -1977435 -1973730 -1964578
7532 -1964578 -1968556 -1981603 -1973589 -1981059 -1990781 -1992307 -1987941 -1977685 -1971824 -1968166 -1958211 -1954958 -1971778
7519 -1971778 -1992535 -1990851 -1980663 -1981239 -1983145 -1984956 -1980307 -1970692 -1967298 -1984461 -1998549 -1985471 -1974405
7506 -1974405 -1965195 -1949842 -1956291 -1966792 -1969149 -1963902 -1966517 -1964434 -1959638 -1963068 -1974655 -1981527 -1978413
7493 -1978413 -1967547 -1960557 -1959286 -1948097 -1945724 -1954786 -1962015 -1959302 -1948351 -1955800 -1943119 -1938322 -1934191
7480 -1934191 -1939485 -1937505 -1942141 -1944478 -1933093 -1936444 -1938913 -1936083 -1942215 -1944472 -1932672 -1936655 -1948633
7467a948633n204J3054K1797J8562j3914q326n896r76R271j24j3837m093P657
7454a930662J0386Q370J65Q156l306j0694j3135r028R977L00J5606Q731R065R357
7440a886712o280p025j4658j042P624l131j811K497k828K432M88N220j0812J578
7426a914460Q613M408o270l546J7787L739j15k634r572N639L340n726L848M14
7412a894535K516R924R343R971j1726n322J584J0909l650o564k055R393n755l961
7398a879928J1252n353q499J362n506k683K819M746J867q117j940O986Q286M326
7384a870382J5335N159k27j1319J3028o633n924n550p636J0616R239l498l771
7371a861563q569n540n070o178J7346K41j084K013R89Q762q814J2041P613k566
$$ plain form
7467 -1948633 -1953837 -1940783 -1918986 -1900424 -1914338 -1922664 -1928560 -1929536 -1920265 -1920389 -1934226 -1938319 -1930662
7454 -1930662 -1920276 -1911906 -1911741 -1903585 -1906891 -1917585 -1930720 -1939748 -1929771 -1929471 -1913865 -1905134 -1896069 -1886712
7440 -1886712 -1892992 -1900017 -1914675 -1915717 -1908093 -1911224 -1913035 -1910538 -1913366 -1910934 -1910446 -1905226 -1916038 -1914460
7426 -1914460 -1905847 -1901439 -1907709 -1911255 -1893468 -1889729 -1889844 -1892478 -1902050 -1896411 -1893071 -1898797 -1894949 -1894535
7412 -1894535 -1892019 -1882095 -1872752 -1862781 -1874507 -1879829 -1878245 -1867336 -1870986 -1877550 -1879605 -1870212 -1875967 -1879928
7398 -1879928 -1868676 -1874029 -1882528 -1881166 -1886672 -1889355 -1886536 -1881790 -1879923 -1888040 -1889980 -1882994 -1874708 -1870382
7384 -1870382 -1855047 -1849888 -1850115 -1861434 -1848406 -1855039 -1860963 -1866513 -1874149 -1863533 -1854294 -1857792 -1861563
7371 -1861563 -1870132 -1875672 -1880742 -1886920 -1869574 -1869333 -1870417 -1868404 -1867415 -1858653 -1867467 -1855426 -1847813 -1850379
7357a850379n817j6668L42J1417J1662R97j864L006J0096j00o308k465O758J2513
7343a826810j4421l112M681k473j19R37L903M767K462p4R673O80l895m58L876
7328a820383m878N351L997k975j2835O190J960N352J1584j034R07o801l686J2771
7314a804480P212k066n461l87K343m675l877M018n246O244J2711j4669j7937o56
7300a826926R89n16L028p176J8264M129q109K832O253p12q69M36Q225J3895N252
7285a781005q795j0656q376N464N894j1805P519L545l640j1292j3357J4110J3302
7272a799092l33j440N967R416j2499j0642Q238J5330J3983P217K154K642M234
7259a754825q776k224O11J391K563j0676o721l203K324j0489j0724P949J2649
$$ plain form
7357 -1850379 -1856196 -1872864 -1872522 -1861105 -1849443 -1848446 -1850310 -1847304 -1837208 -1837308 -1843616 -1846081 -1839323 -1826810
7343 -1826810 -1841231 -1844343 -1839662 -1842135 -1842254 -1841317 -1837414 -1832647 -1830185 -1830259 -1820586 -1819906 -1823801 -1824259 -1820383
7328 -1820383 -1825261 -1819910 -1815913 -1818888 -1831723 -1825533 -1823573 -1818221 -1806637 -1807671 -1806764 -1813565 -1817251 -1804480
7314 -1804480 -1797268 -1799334 -1804795 -1805182 -1802839 -1807514 -1811391 -1807373 -1812619 -1806375 -1793664 -1808333 -1826270 -1826926
7300 -1826926 -1825937 -1826453 -1823425 -1830601 -1812337 -1808208 -1816317 -1813485 -1807232 -1807944 -1808813 -1808377 -1800152 -1786257 -1781005
7285 -1781005 -1789800 -1800456 -1808832 -1803368 -1797474 -1809279 -1801760 -1798215 -1801855 -1813147 -1826504 -1812394 -1799092
7272 -1799092 -1799425 -1800865 -1794898 -1785482 -1797981 -1808623 -1800385 -1785055 -1771072 -1763855 -1761701 -1759059 -1754825
7259 -1754825 -1763601 -1765825 -1765214 -1763823 -1761260 -1771936 -1778657 -1781860 -1779536 -1790025 -1800749 -1792800 -1780151
7246a780151J7848O969J2095n645o803L658L995p52j6524j3407M011J2018L060
7233a759628J14j1970J056J4391Q711L695L78Q250j3842j2692o938J1828J1477
7220a745170J887J1027J9149r67k3838J238J1245Q172K058m830j3468o256J1748
7207a728005l792q353m311j827M163Q184J5811j0436r798K762l764J192L62j32
7193a737944K755J64L264j4177J0082J7545l095J1017O763j1994n311J719N393
7180a713819k895K274R270O622l634q727O185n268j4383K809J756l375p75L289
7166a720671j342K785o666j725K5451L745j4788p373l784J1951q63n013J4462
7153a703831R684j4827J5021K0361j3162l1269j965M339R81O887L048N855k475
$$ plain form
7246 -1780151 -1762303 -1755334 -1743239 -1748884 -1755687 -1752029 -1748034 -1748786 -1765310 -1778717 -1774706 -1762688 -1759628
7233 -1759628 -1759514 -1771484 -1770428 -1756037 -1747326 -1743631 -1743253 -1735003 -1748845 -1761537 -1768475 -1756647 -1745170
7220 -1745170 -1743283 -1732256 -1713107 -1714074 -1737912 -1736674 -1725429 -1717257 -1715199 -1720029 -1733497 -1739753 -1728005
7207 -1728005 -1731797 -1740150 -1744461 -1746288 -1742125 -1733941 -1718130 -1728566 -1738364 -1735602 -1739366 -1738174 -1737812 -1737944
7193 -1737944 -1735189 -1735025 -1731761 -1745938 -1735856 -1718311 -1721406 -1710389 -1703626 -1715620 -1720931 -1719212 -1713819
7180 -1713819 -1716714 -1714440 -1705170 -1698548 -1702182 -1710909 -1704724 -1709992 -1724375 -1721566 -1719810 -1723185 -1723960 -1720671
7166 -1720671 -1722013 -1719228 -1725894 -1727619 -1702168 -1698423 -1713211 -1720584 -1724368 -1712417 -1713280 -1718293 -1703831
7153 -1703831 -1694147 -1708974 -1693953 -1673592 -1686754 -1718023 -1719988 -1715649 -1714668 -1707781 -1704733 -1698878 -1701353
7140a701353J0578n337J0755K120j3810k810p033k051J0658k272m428M568n71
7127a700986M975N354p77j8664N794N960J0394m67k956P595J0711l874l651R375
7113a671217R39j8169r059O205P388L163k26R622N880k233m326k601j907J0039
7099a666502j05N47O409Q032K031n108r096m540K969q550R59K0886O237j3887
7085a659718r690m501K015J4495R728p396j173N5m048k1523M008K3341M249p86
7071a650944r9K842L109m342J70R908n14M632p283m894O754l734j164K156J3385
7056a630018M554k2766l266P418J376j8547p140J4629J0790P458R29j1359O999
7043a638943J193j944O663M995m931j1750L914j087q345j623k473m837m403j898
$$ plain form
7140 -1701353 -1690775 -1696112 -1685357 -1683237 -1697047 -1699857 -1706890 -1708941 -1698283 -1700555 -1704983 -1700415 -1700986
7127 -1700986 -1696011 -1690657 -1691434 -1710098 -1704304 -1698344 -1687950 -1688417 -1691373 -1683778 -1673067 -1676941 -1680592 -1671217
7113 -1671217 -1670278 -1688447 -1697506 -1691301 -1683913 -1680750 -1680976 -1671354 -1665474 -1667707 -1672033 -1674634 -1676541 -1666502
7099 -1666502 -1666607 -1666060 -1659651 -1651619 -1649588 -1654696 -1663792 -1668332 -1665363 -1673913 -1672954 -1652068 -1645831 -1659718
7085 -1659718 -1669408 -1673909 -1671894 -1657399 -1647671 -1655067 -1656240 -1656185 -1660233 -1681756 -1677748 -1654407 -1650158 -1650944
7071 -1650944 -1651043 -1648201 -1645092 -1649434 -1649264 -1639356 -1639870 -1635238 -1642521 -1647415 -1640661 -1644395 -1645559 -1643403 -1630018
7056 -1630018 -1625464 -1648230 -1651496 -1644078 -1642702 -1661249 -1668389 -1653760 -1642970 -1635512 -1634583 -1645942 -1638943
7043 -1638943 -1637750 -1639694 -1633031 -1628036 -1632967 -1644717 -1640803 -1641890 -1650235 -1651858 -1654331 -1659168 -1663571 -1665469
7029a665469R268J3445R285J176j5822O981K82l067Q861k77N04J6152J4260k789
7015a607210r390j1986j185J620K044L0J9275q82j5644j4270K674L465J0511O284
7001a614664k638N541j241P909o67l202Q055K937k143l589n130M927j0590l915
6987a618410k299q204N318J6330O245j663j366Q272q266o081J7662j2259j5200
6974a619921J0043M969q217k31P890Q480p566q998j424J1765K4616Q733j0148
6961a580009L089j0834k0687L291R297l529P172M941J7997n055n017l164J1650
6948a570858J1702m399j529K481m741l431R289j1100q252J1312p014N05j0348
6935a586383j9581J2055M889l444J011J5713L593m684k889j451J1077M490p633
$$ plain form
7029 -1665469 -1656201 -1642756 -1633471 -1632295 -1648117 -1641136 -1640854 -1643921 -1635060 -1635337 -1634833 -1618681 -1604421 -1607210
7015 -1607210 -1616600 -1628586 -1629771 -1628151 -1626107 -1626077 -1606802 -1607684 -1623328 -1637598 -1634924 -1631459 -1620948 -1614664
7001 -1614664 -1617302 -1611761 -1613002 -1605093 -1605760 -1608962 -1600907 -1597970 -1600113 -1603702 -1608832 -1603905 -1614495 -1618410
6987 -1618410 -1620709 -1628913 -1623595 -1607265 -1601020 -1602683 -1604049 -1595777 -1604043 -1610124 -1592462 -1604721 -1619921
6974 -1619921 -1609878 -1604909 -1613126 -1613357 -1605467 -1596987 -1604553 -1613551 -1614975 -1603210 -1578594 -1569861 -1580009
6961 -1580009 -1576920 -1587754 -1608441 -1605150 -1595853 -1599382 -1592210 -1587269 -1569272 -1574327 -1579344 -1582508 -1570858
6948 -1570858 -1559156 -1563555 -1565084 -1562603 -1567344 -1570775 -1561486 -1572586 -1580838 -1569526 -1576540 -1576035 -1586383
6935 -1586383 -1605964 -1593909 -1589020 -1592464 -1591453 -1575740 -1572147 -1576831 -1579720 -1581171 -1570094 -1565604 -1573237
6922a573237o655n424p343O118j412N939Q888q57p406r507m863N123N194J026
6908a584416L781J0379j348N640M45M093P221n23m805R6m733j738j605P059M581
6893a555873m96J512J777L962L758o910k594q58J410L656r218L824P038N145Q569
6878a535298j5244j0351J4601n820o952P28j103k361J2050l245k378J0220J0620
6865a534533O423J393m857J789n325p264M235Q416l133l479r501p300J2531J2208
6851a528397j1189L559N614K782m450K290o896o314M980Q26J192M378J3443J3257
6837a504925n118k901r716l97N271K324k093j6478m998Q134n209m304R208O814
6823a524388j2611j1686j0681Q58J3278L457p38p701K57k595M160J9362J1807
$$ plain form
6922 -1573237 -1579892 -1585316 -1592659 -1586541 -1587953 -1582014 -1573126 -1573983 -1581389 -1590896 -1595759 -1590636 -1585442 -1584416
6908 -1584416 -1580635 -1570256 -1571604 -1565964 -1565519 -1561426 -1554205 -1554728 -1559533 -1559437 -1564170 -1565908 -1567513 -1560454 -1555873
6893 -1555873 -1556369 -1554857 -1553080 -1549118 -1545360 -1552270 -1554864 -1555722 -1554312 -1550656 -1559874 -1556050 -1549012 -1543867 -1535298
6878 -1535298 -1550542 -1560893 -1546292 -1552112 -1559064 -1558336 -1559439 -1561800 -1549750 -1552995 -1555373 -1545153 -1534533
6865 -1534533 -1528110 -1526717 -1531574 -1529785 -1535110 -1542374 -1538139 -1529723 -1532856 -1536335 -1545836 -1553136 -1540605 -1528397
6851 -1528397 -1539586 -1536027 -1530413 -1527631 -1532081 -1529791 -1536687 -1543001 -1538021 -1537195 -1536003 -1531625 -1518182 -1504925
6837 -1504925 -1510043 -1512944 -1522660 -1523057 -1517786 -1515462 -1517555 -1534033 -1539031 -1530897 -1536106 -1540410 -1531202 -1524388
6823 -1524388 -1536999 -1548685 -1559366 -1558508 -1545230 -1541773 -1542511 -1550212 -1549955 -1552550 -1548390 -1529028 -1517221
6810a517221j2797r097M924n969m218J4415J3089j259q192p329J91Q351Q898j2233
6796a528447j5177J2109J936J2875M178j4145j125J2790O493N682J1900N286p928
6783a493573m604q812m064P556P690N728Q271p214j0834j3903j2878M196J3101
6770a509340n841P45l018J1974J5857k220q534n444n762N439R532L843J993M500
6756a486276n119l249m994m875P626M230R989O010K81j089K84k3371j3179J6610
6742a497122Q761L8k594k461J497J2506M751j759j597m900r881Q978L1145Q153
6728a444485r47j5474j2156K712j2227r660m636j1509l1K904N578q44N263K0055
6714a475457q72J630P784J0672N201j6984P391Q183m870k3056J2013J6729p199
$$ plain form
6810 -1517221 -1530018 -1539115 -1534191 -1540160 -1544378 -1529963 -1516874 -1518133 -1526325 -1533654 -1533463 -1525112 -1516214 -1528447
6796 -1528447 -1543624 -1531515 -1529579 -1516704 -1512526 -1526671 -1527796 -1515006 -1508513 -1502831 -1490931 -1485645 -1493573
6783 -1493573 -1498177 -1506989 -1511053 -1503497 -1495807 -1490079 -1481808 -1489022 -1499856 -1513759 -1526637 -1522441 -1509340
6770 -1509340 -1515181 -1514436 -1517454 -1505480 -1489623 -1491843 -1500377 -1505821 -1511583 -1506144 -1496612 -1492769 -1490776 -1486276
6756 -1486276 -1491395 -1494644 -1499638 -1504513 -1496887 -1492657 -1482668 -1476658 -1476377 -1477466 -1477182 -1500553 -1513732 -1497122
6742 -1497122 -1488361 -1488323 -1490917 -1493378 -1491881 -1479375 -1474624 -1476383 -1477980 -1482880 -1492761 -1483783 -1452638 -1444485
6728 -1444485 -1445432 -1460906 -1473062 -1470350 -1482577 -1492237 -1496873 -1508382 -1508413 -1505509 -1499931 -1500775 -1495512 -1475457
6714 -1475457 -1476329 -1474699 -1466915 -1456243 -1451042 -1468026 -1460635 -1452452 -1457322 -1480378 -1468365 -1451636 -1458835
6701a458835r323j1600L663R102l652R476n979r158k968j169P874L113m686R149
6687a464993M243P61j6114L561j080k603n049j660M585P433N140j3472K657J2982
6673a463609J5299j1920k022L073m480R592O870J1965j575l157o670j1075n838
6660a463547o319k831j673n468M797K4172J5654j2564j0193q723Q710J0619o723
6647a454089j4534j9912J5239K0482p248j8682l553Q25Q242J4193M470l135p480
6634a465182q463J6198J4770N865l823j1198j3203J1492J1175J3945j9816l468
6622a451708P826R406j0591k0304j120M697N191J2620J6489j1399j3095P916r40
6609a445012m474J377P450K832J566P215J722P358n606m682j567N476m310q94
$$ plain form
6701 -1458835 -1468158 -1479758 -1476095 -1466993 -1470645 -1461169 -1467148 -1476306 -1479274 -1480443 -1472569 -1469456 -1474142 -1464993
6687 -1464993 -1460750 -1459989 -1476103 -1472542 -1473622 -1476225 -1481274 -1482934 -1478349 -1470916 -1465776 -1479248 -1476591 -1463609
6673 -1463609 -1448310 -1460230 -1462252 -1459179 -1463659 -1454067 -1447197 -1435232 -1436807 -1439964 -1446634 -1457709 -1463547
6660 -1463547 -1469866 -1472697 -1474370 -1479838 -1475041 -1450869 -1435215 -1447779 -1457972 -1466695 -1457985 -1447366 -1454089
6647 -1454089 -1468623 -1488535 -1473296 -1452814 -1460062 -1478744 -1482297 -1481472 -1473230 -1459037 -1454567 -1457702 -1465182
6634 -1465182 -1473645 -1457447 -1442677 -1436812 -1440635 -1451833 -1465036 -1453544 -1442369 -1428424 -1448240 -1451708
6622 -1451708 -1443882 -1434476 -1445067 -1465371 -1466491 -1461794 -1456603 -1443983 -1427494 -1438893 -1451988 -1444072 -1445012
6609 -1445012 -1449486 -1448109 -1440659 -1437827 -1436261 -1429046 -1427324 -1419966 -1425572 -1430254 -1431821 -1426345 -1430655 -1431549
6595a431549J537N708Q083o441p232P125J259m333K1280K729j3593r769q601o87
6581a434484J6478R555L957M353o666q612O00p191Q238O702J623O153k958j2222
6567a414474j0401l95R72R510J4921J36R33q82j8293R938J5109J167M428j438
6553a388769m366j5092o157O067j005N714p132j275j415m975J1131O632K587p672
6539a405727J453R42L079L233r361k930n683r733l851J0731r86l292O242J9926
6525a395957J8289J1633p478k2371j2596Q857Q739Q694o10n098O76j904J239r553
6511a397440M475M180p902k764P311J518k806m844j7539J349Q960J7433K469m344
6497a389944l819Q928Q29l724k965j0316Q761R504m725L552q497O927R000j766
$$ plain form
6595 -1431549 -1430012 -1424304 -1416221 -1422662 -1429894 -1422769 -1421510 -1425843 -1404563 -1401834 -1415427 -1425196 -1433797 -1434484
6581 -1434484 -1418006 -1408451 -1404494 -1400141 -1406807 -1415419 -1414819 -1422010 -1413772 -1407070 -1405447 -1399294 -1402252 -1414474
6567 -1414474 -1424875 -1425270 -1424298 -1414788 -1399867 -1399731 -1398798 -1399680 -1417973 -1408035 -1392926 -1391759 -1387331 -1388769
6553 -1388769 -1393135 -1408227 -1414384 -1408317 -1409322 -1403608 -1410740 -1412015 -1413430 -1418405 -1407274 -1400642 -1398055 -1405727
6539 -1405727 -1404274 -1403332 -1400253 -1397020 -1406381 -1409311 -1414994 -1424727 -1428578 -1417847 -1418833 -1422125 -1415883 -1395957
6525 -1395957 -1377668 -1366035 -1373513 -1395884 -1408480 -1399623 -1390884 -1382190 -1382800 -1387898 -1387222 -1389126 -1387887 -1397440
6511 -1397440 -1392965 -1388785 -1396687 -1399451 -1392140 -1390622 -1393428 -1398272 -1415811 -1414462 -1405502 -1388069 -1385600 -1389944
6497 -1389944 -1393763 -1384835 -1384006 -1387730 -1390695 -1401011 -1392250 -1382746 -1387471 -1383919 -1392416 -1385489 -1376489 -1378255
6483a378255j3676M76p714k690n265L038J0857o508L955M855J0910J4398k631
6470a368250n986J0749k141J029J3610j4261j0962q523j541j0465j699J2255J5867
6457a370318j877m78O870P503l512n51J7050o393l380o377j4722R360J664j8862
6443a384023o058J6361P00j461M115J4458J5930q707j2325p174j3912p424J7008
6430a372512J3741j4912j541N859Q956P07q165J920J4526J017r275N807L506K061
6416a348305l610p193J185K154j3355n606M516M349O27K562Q280l591P926K5788
6402a324273m848q820O740k0872j0258M339Q50M750n337o843Q175k864O400J9346
6388a333515N818n248j1998j9739j5734J5576J1976p9m097J294j719L35J618J5685
$$ plain form
6483 -1378255 -1391931 -1391455 -1399169 -1401859 -1407124 -1404086 -1393229 -1399737 -1395782 -1390927 -1380017 -1365619 -1368250
6470 -1368250 -1374236 -1363487 -1365628 -1364599 -1350989 -1365250 -1376212 -1384735 -1386276 -1396741 -1398440 -1386185 -1370318
6457 -1370318 -1372195 -1372673 -1365803 -1358300 -1361812 -1362363 -1345313 -1351706 -1355086 -1361463 -1376185 -1366825 -1365161 -1384023
6443 -1384023 -1390081 -1373720 -1373020 -1374481 -1370366 -1355908 -1339978 -1348685 -1361010 -1368184 -1382096 -1389520 -1372512
6430 -1372512 -1358771 -1373683 -1375224 -1369365 -1360409 -1359702 -1367867 -1365947 -1351421 -1350404 -1359679 -1353872 -1350366 -1348305
6416 -1348305 -1351915 -1359108 -1357923 -1355769 -1369124 -1374730 -1370214 -1365865 -1365238 -1362676 -1354396 -1357987 -1350061 -1324273
6402 -1324273 -1329121 -1337941 -1331201 -1352073 -1362331 -1357992 -1357142 -1352392 -1357729 -1364572 -1356397 -1359261 -1352861 -1333515
6388 -1333515 -1327697 -1332945 -1344943 -1364682 -1380416 -1364840 -1352864 -1352943 -1357040 -1355746 -1357465 -1357130 -1355512 -1339827
6374a339827J4406O37j8818k0030J2882J2589m987n874O729K254K248k564k480
6361a342835j891k326j824n241N944j193l75P604J263j2754J2202J2252k633q283
6347a340090K101O73O171l960L492j06q938j284R973Q526k356n729N509K877l593
6332a326734N66M206P752N653m161j5546J0193J915j931k384j411J086Q450j9785
6318a332131n549J0269q354q573O117O520O799O451p577m327p838L481J1941R162
6304a313609J970j3060p89P939L711P993K120m336L366K469q858k0053k0453K914
6290a348676J7372J7642j2128P707P419l488J661L923j5713P83J597k197m777
6277a328875J0524J4522O389o999j4964n251P235m404K539J158K4955Q238j5449
$$ plain form
6374 -1339827 -1325421 -1324784 -1343602 -1363632 -1350750 -1338161 -1343148 -1349022 -1342293 -1340039 -1337791 -1340355 -1342835
6361 -1342835 -1344726 -1347052 -1348876 -1354117 -1348173 -1349366 -1349741 -1342137 -1340874 -1353628 -1341426 -1329174 -1331807 -1340090
6347 -1340090 -1337989 -1337316 -1331145 -1335105 -1331613 -1331719 -1340657 -1341941 -1331968 -1323442 -1325798 -1331527 -1326018 -1323141 -1326734
6332 -1326734 -1326168 -1321962 -1314210 -1308557 -1312718 -1328264 -1318071 -1316156 -1318087 -1320471 -1321882 -1320796 -1312346 -1332131
6318 -1332131 -1337680 -1327411 -1335765 -1344338 -1338221 -1331701 -1324902 -1318451 -1326028 -1330355 -1338193 -1334712 -1322771 -1313609
6304 -1313609 -1311639 -1324699 -1325488 -1317549 -1313838 -1305845 -1303725 -1308061 -1304695 -1302226 -1311084 -1331137 -1351590 -1348676
6290 -1348676 -1331304 -1313662 -1325790 -1318083 -1310664 -1314152 -1312491 -1308568 -1324281 -1323498 -1321901 -1324098 -1328875
6277 -1328875 -1318351 -1303829 -1297440 -1304439 -1319403 -1324654 -1317419 -1321823 -1319284 -1318126 -1293171 -1284933 -1300382
6264a300382j8374R87j722J1414J5610J965q711m158j58J0552O529J242j8755
6251a303961n24n7j850M939J872j010K579P38l01j1644J3312M749j0869K362N581
6236a294084n018l403Q361k092J372L071k456n944J824K326J6079N411R40q011
6222a281624J6733l426k3054p655k60O30O11N138o41J9396j491L623L389j0602
6208a279233K271j0095k330R572M695o88N059M303K106K294j0342o292n049J512
6194a282217J161p74r324r26n408Q759J3580k100j2234j798J027j838J2423M225
6180a275444J0163J283l632J166K177l102o306N511p156j5651j9339p67O883J7226
6166a286988R159j0845L537K0426j2645q689N674L702p291j546j580r944m532
$$ plain form
6264 -1300382 -1318756 -1317769 -1319491 -1308077 -1292467 -1290502 -1299213 -1303371 -1303529 -1292977 -1286448 -1285206 -1303961
6251 -1303961 -1304485 -1304542 -1306392 -1301453 -1299581 -1300591 -1298012 -1297274 -1297575 -1309219 -1295907 -1291158 -1302027 -1299665 -1294084
6236 -1294084 -1299102 -1302505 -1294144 -1296236 -1294864 -1291793 -1294249 -1300193 -1298369 -1296043 -1279964 -1274553 -1273613 -1281624
6222 -1281624 -1264891 -1268317 -1291371 -1299026 -1299286 -1298656 -1298045 -1292907 -1293548 -1274152 -1275643 -1272020 -1268631 -1279233
6208 -1279233 -1276962 -1287057 -1289387 -1279815 -1275120 -1275808 -1270749 -1266446 -1264340 -1262046 -1272388 -1278680 -1283729 -1282217
6194 -1282217 -1281056 -1281830 -1291154 -1292080 -1297488 -1288729 -1275149 -1277249 -1289483 -1291281 -1290254 -1292092 -1279669 -1275444
6180 -1275444 -1265281 -1263998 -1267630 -1266464 -1264287 -1267389 -1273695 -1268184 -1275340 -1290991 -1310330 -1311097 -1304214 -1286988
6166 -1286988 -1277829 -1288674 -1285137 -1264711 -1277356 -1286045 -1280371 -1276669 -1283960 -1285506 -1287086 -1297030 -1301562
6153a301562j922J3080N247P539K1695q499j2658o14o65l97R464L326r189j661
6139a276816K1183Q479j2279r236k848N23J1493O229K405j0208r014j1277p269
6126a288635K995J347L434m315L566J8171R147l441j8135r552J1733L378j648
6113a271955M300j3715j12K656k72M439L989P746p238j0749m744J1461J4067q471
6099a268598q890N588K1270R338k393l650K108j1204j4039j1265m159R556O889
6086a269449Q02J0787L855m670R831j320k0522M202J2368R93m523K597j37j1577
6072a266763p79J1642N386J2404j387n181n380j677N528n908j547J1417K0040
6059a222205m290o954N546j6357j8833K718p043J544n4J0770Q828m307l691k0622
$$ plain form
6153 -1301562 -1303484 -1290404 -1285157 -1277618 -1255923 -1264422 -1277080 -1277694 -1278359 -1278756 -1269292 -1265966 -1275155 -1276816
6139 -1276816 -1255633 -1247154 -1259433 -1268669 -1271517 -1270994 -1259501 -1253272 -1250867 -1261075 -1270089 -1281366 -1288635
6126 -1288635 -1285640 -1284293 -1280859 -1285174 -1281608 -1263437 -1254290 -1257731 -1275866 -1285418 -1273685 -1270307 -1271955
6113 -1271955 -1267655 -1281370 -1281482 -1278826 -1279098 -1274659 -1270670 -1262924 -1270162 -1280911 -1285655 -1274194 -1260127 -1268598
6099 -1268598 -1277488 -1271900 -1250630 -1241292 -1243685 -1247335 -1245227 -1256431 -1270470 -1281735 -1285894 -1276338 -1269449
6086 -1269449 -1268647 -1257860 -1254005 -1258675 -1248844 -1250164 -1270686 -1266484 -1254116 -1253123 -1257646 -1255049 -1255186 -1266763
6072 -1266763 -1267542 -1255900 -1250514 -1238110 -1239497 -1244678 -1250058 -1251735 -1246207 -1252115 -1253662 -1242245 -1222205
6059 -1222205 -1226495 -1233449 -1227903 -1244260 -1263093 -1260375 -1267418 -1265874 -1265928 -1255158 -1246330 -1250637 -1254328 -1274950
6045a274950R306N163L362J541j750N377J0061j27M618J7983N258l160j4414o733
6031a238465j3575L543J2797L602j1054k691L721R119j473R965L969r320j1504
6018a241366O012N361O783k960N613K416l01j2485j370P221k74O16M810K239l696
6003a221381L906P07j431J6105M856j4775n483k899n851J2531M0o691q073P432
5989a221007Q850o453m032n026p527P689j379l777o592N056M508J2632R9p147
5975a224106J324k641J528P298L863M322o139j0847N31J0256J3549m057n389m154
5961a214662K621k529r038l221J225Q794o062o917k64M402J5047O757n368J847
5947a207368P92j471p719k301M216J0564L396m621k757L611P618k396j4488q700
$$ plain form
6045 -1274950 -1265644 -1260481 -1257119 -1255578 -1257328 -1251951 -1241890 -1242017 -1237399 -1219416 -1214158 -1217318 -1231732 -1238465
6031 -1238465 -1252040 -1248497 -1235700 -1232098 -1243152 -1245843 -1242122 -1233003 -1234476 -1224511 -1220542 -1229862 -1241366
6018 -1241366 -1235354 -1229993 -1223210 -1226170 -1220557 -1218141 -1218442 -1230927 -1232297 -1225076 -1225350 -1224734 -1219924 -1217685 -1221381
6003 -1221381 -1217475 -1216768 -1218199 -1202094 -1197238 -1212013 -1217496 -1220395 -1226246 -1213715 -1213675 -1220366 -1228439 -1221007
5989 -1221007 -1212157 -1218610 -1222642 -1227668 -1235195 -1227506 -1228885 -1232662 -1239254 -1234198 -1229690 -1217058 -1216959 -1224106
5975 -1224106 -1222782 -1225423 -1223895 -1216597 -1212734 -1208412 -1214551 -1225398 -1224867 -1214611 -1201062 -1205119 -1210508 -1214662
5961 -1214662 -1212041 -1214570 -1223608 -1226829 -1225604 -1216810 -1222872 -1229789 -1230053 -1225651 -1210604 -1203847 -1209215 -1207368
5947 -1207368 -1206576 -1208047 -1215766 -1218067 -1213851 -1203287 -1199891 -1204512 -1207269 -1203658 -1196040 -1198436 -1212924 -1221624
5933a221624j5866J210J6893m867O258N034l915J739J3943N290p250l864r882
5920a216901p454O031J3094J4592N044l54n114n223K811O208j2051J5016j2498
5907a196799r597o175N633N989k291L227J2468M312o710o063p611n340J0327M246
5893a194384N107p558j210M06J0433M682m782N308J844j0914n75J730n797j7809
5879a213519K187J5044R368J1546o425K763K466J1407k322L46Q167n928n144n220
5865a175264Q603J219K164r667N919k953j4944j0471J149Q967m331o0o811N747
5851a190733J3802L531p098M861P807k288j9080j4379l80M501J4645J2560M043
5838a168208j0903o07p498J3158J3232N966j3433j3013o862O104r77q039n485
$$ plain form
5933 -1221624 -1237490 -1236280 -1219387 -1224254 -1217996 -1212962 -1216877 -1215138 -1201195 -1195905 -1203155 -1207019 -1216901
5920 -1216901 -1224355 -1218324 -1205230 -1190638 -1185594 -1185948 -1191062 -1196285 -1193474 -1187266 -1199317 -1184301 -1196799
5907 -1196799 -1206396 -1212571 -1206938 -1200949 -1203240 -1200013 -1187545 -1183233 -1189943 -1196006 -1203617 -1208957 -1198630 -1194384
5893 -1194384 -1189277 -1196835 -1198045 -1197639 -1187206 -1182524 -1187306 -1181998 -1180154 -1191068 -1191643 -1189913 -1195710 -1213519
5879 -1213519 -1211332 -1196288 -1186920 -1175374 -1181799 -1179036 -1176570 -1165163 -1167485 -1167139 -1158972 -1164900 -1170044 -1175264
5865 -1175264 -1166661 -1165442 -1163278 -1172945 -1167026 -1169979 -1184923 -1195394 -1194245 -1185278 -1189609 -1189669 -1196480 -1190733
5851 -1190733 -1176931 -1173400 -1180498 -1175637 -1167830 -1170118 -1189198 -1203577 -1203957 -1199456 -1184811 -1172251 -1168208
5838 -1168208 -1179111 -1179718 -1187216 -1174058 -1160826 -1154860 -1168293 -1181306 -1188168 -1182064 -1183041 -1191080 -1196565
5825a196565K128j945R34j250J634m9R549R165m014K580j3602j9075J427J4097
5811a194986J2974O383j595m635n81M0M603r232p761K0808P765m12j483j1838
5797a179950j7557o431J2223J4801L566j879k497m222N177O00j952M851N054P894
5783a160322l265o937j843k398K104l928P350J0959J550M671p005j8024K35L36
5769a176517k575j682Q163l597q117J119K650p188o381L828m576J0819P949q125
5755a184230N141k690P867Q10J6538O300M080n939M911j528o956k170j0701l315
5741a171882j310M91P713P17l839j2850j441m182P826L549q01N659J0873J853
5727a157624p649P537L609n427Q09J2679Q563k602M86j1561J80P931m985r160
$$ plain form
5825 -1196565 -1194437 -1196382 -1195448 -1196698 -1195064 -1195113 -1185564 -1176399 -1180413 -1177833 -1191435 -1210510 -1209083 -1194986
5811 -1194986 -1182012 -1175629 -1177224 -1181859 -1182440 -1182400 -1177797 -1187029 -1194790 -1173982 -1166217 -1166629 -1168112 -1179950
5797 -1179950 -1197507 -1203938 -1191715 -1176914 -1173348 -1175227 -1177724 -1181946 -1176769 -1176169 -1178121 -1173270 -1168216 -1160322
5783 -1160322 -1163587 -1170524 -1172367 -1174765 -1172661 -1176589 -1169239 -1158280 -1156730 -1152059 -1159064 -1177088 -1176853 -1176517
5769 -1176517 -1179092 -1180774 -1172611 -1176208 -1184325 -1183206 -1180556 -1187744 -1194125 -1190297 -1194873 -1184054 -1176105 -1184230
5755 -1184230 -1179089 -1181779 -1173912 -1173102 -1156564 -1150264 -1146184 -1152123 -1147212 -1148740 -1155696 -1157866 -1168567 -1171882
5741 -1171882 -1173192 -1172701 -1164988 -1164271 -1168110 -1180960 -1182401 -1186583 -1178757 -1175208 -1176009 -1170350 -1159477 -1157624
5727 -1157624 -1165273 -1157736 -1154127 -1159554 -1158745 -1146066 -1137503 -1140105 -1139619 -1151180 -1151000 -1143069 -1148054 -1157214
5713a157214j2794N684O312J0514k243J0827J119j3354l264P233l311l013n050
5700a158554J1209L712n627j477l415k743J0464o049q508N691P999j800j28M924
5686a144302j1605M975O955l435M428K781l692J0188M827P301P790R93j1029p775
5672a131600n971Q787P942n358L177J65P658J8697j317j1562n865p247j7672j5979
5658a156145J025J612J0570O094k493J130J3559j1854o505K551L78l217k759l726
5644a149780J331n80j537k451R712N948L592J3937R742M276M220q717k5838j3520
5630a149665J4771R616n356K364p662j904N162O132O293k141n719k651j2093m307
5616a147160P705R137J115q042n107n214L727k709R633n637k878J949j2164Q245
$$ plain form
5713 -1157214 -1170008 -1164324 -1158012 -1147498 -1149741 -1138914 -1137795 -1151149 -1154413 -1147180 -1150491 -1153504 -1158554
5700 -1158554 -1147345 -1143633 -1149260 -1150737 -1154152 -1156895 -1146431 -1152480 -1160988 -1155297 -1147298 -1149098 -1149226 -1144302
5686 -1144302 -1155907 -1150932 -1143977 -1147412 -1142984 -1140203 -1143895 -1133707 -1128880 -1121579 -1113789 -1112796 -1123825 -1131600
5672 -1131600 -1137571 -1128784 -1120842 -1126200 -1123023 -1122858 -1115200 -1096503 -1097820 -1109382 -1115247 -1122494 -1140166 -1156145
5658 -1156145 -1155120 -1153508 -1142938 -1136844 -1139337 -1138207 -1124648 -1136502 -1143007 -1140456 -1140078 -1143295 -1146054 -1149780
5644 -1149780 -1148449 -1149029 -1150566 -1153017 -1143305 -1137357 -1133765 -1119828 -1110086 -1105810 -1101590 -1110307 -1136145 -1149665
5630 -1149665 -1134894 -1125278 -1130634 -1128270 -1135932 -1137836 -1132674 -1126542 -1120249 -1122390 -1128109 -1130760 -1142853 -1147160
5616 -1147160 -1139455 -1130318 -1129203 -1137245 -1142352 -1147566 -1143839 -1146548 -1136915 -1142552 -1145430 -1143481 -1155645 -1147400
5602a147400R732l081J58K918M767L000n62L703M534N997k205l359o44q196p17
5587a131355N450m954j4991p087J2134P263N402r215j647Q705L320l08J0388N156
5573a111739j004O415L710q407j4018N189l567n265M345R307L48P18n137J7990
5559a101115q423k192o50m354J006j820p467M765O600k35j093L135n889N423J053
5544a111256O260k1780m251J0404n58K562J3620R5L908L243o914j158J033N315
5530a099477P685J0958j4219j4220L487o71j4994p118O837J755j1699n556l318
5517a140550J4061J6153p71P866M43j0633k382L151m929m156p973m897r966P19
5503a143864K52P074J0923J3937l131j1610L086R971l443m233O247P688o245O385
$$ plain form
5602 -1147400 -1137668 -1140749 -1140591 -1137673 -1132906 -1129906 -1130468 -1126765 -1122231 -1116234 -1118439 -1121798 -1122442 -1130638 -1131355
5587 -1131355 -1125905 -1130859 -1145850 -1152937 -1140803 -1133540 -1128138 -1137353 -1139000 -1130295 -1126975 -1127283 -1116895 -1111739
5573 -1111739 -1112743 -1106328 -1102618 -1111025 -1125043 -1119854 -1123421 -1128686 -1124341 -1115034 -1114686 -1113968 -1119105 -1101115
5559 -1101115 -1109538 -1111730 -1112380 -1116734 -1115728 -1117548 -1125015 -1120250 -1113650 -1113885 -1114978 -1111843 -1117732 -1112309 -1111256
5544 -1111256 -1104996 -1126776 -1131027 -1120623 -1121181 -1118619 -1104999 -1104904 -1100996 -1097753 -1104667 -1105825 -1104792 -1099477
5530 -1099477 -1091792 -1080834 -1095053 -1109273 -1105786 -1106457 -1121451 -1128569 -1121732 -1119977 -1131676 -1137232 -1140550
5517 -1140550 -1126489 -1110336 -1111107 -1103241 -1102798 -1113431 -1115813 -1112662 -1117591 -1121747 -1129720 -1134617 -1144583 -1143864
5503 -1143864 -1143612 -1136538 -1125615 -1111678 -1114809 -1126419 -1123333 -1113362 -1116805 -1121038 -1114791 -1107103 -1113348 -1106963
5489a106963J0902k1229r294N894l606N004J3934o020q898P605J4382O419l260
5476a095130j2240K37J7485L478m196K33j2267m504N736N941K223n060K89J1151
5462a086624J0123K683K132n105O054m102k7780j530J3921J4452Q892o081p520
5449a080485k0167j5742nL334M513K0221J7815l850j785l714m581M523K944j297
5435a078276k3570j3494K0332J4508J5551j823l855l930q181J1128J1382L241
5423a056987j532K995j1928j0592j5378k247J6864R092K156N721n049k571n125
5410a074581p619L371O263m306p472n780J908M211j188n884J063j405m164j4125
5396a109708J281p217M768J5848J4030j5900j437m06J2598L968j2338l856K0728
$$ plain form
5489 -1106963 -1096061 -1117290 -1126584 -1120690 -1124296 -1119292 -1105358 -1111378 -1120276 -1112671 -1098289 -1091870 -1095130
5476 -1095130 -1107370 -1107133 -1089648 -1086170 -1090366 -1090133 -1102400 -1106904 -1101168 -1095227 -1093004 -1098064 -1097775 -1086624
5462 -1086624 -1076501 -1073818 -1071686 -1076791 -1070737 -1074839 -1102619 -1104149 -1090228 -1075776 -1066884 -1072965 -1080485
5449 -1080485 -1100652 -1116394 -1116399 -1113065 -1108552 -1088331 -1070516 -1074366 -1076151 -1079865 -1084446 -1079923 -1076979 -1078276
5435 -1078276 -1101846 -1115340 -1095008 -1080500 -1064949 -1066772 -1070627 -1074557 -1082738 -1071610 -1060228 -1056987
5423 -1056987 -1058519 -1055524 -1067452 -1078044 -1093422 -1095669 -1078805 -1069713 -1067557 -1061836 -1066885 -1069456 -1074581
5410 -1074581 -1082200 -1078829 -1072566 -1076872 -1084344 -1090124 -1088216 -1084005 -1085193 -1091077 -1090014 -1091419 -1095583 -1109708
5396 -1109708 -1108427 -1115644 -1110876 -1095028 -1080998 -1096898 -1098335 -1098741 -1086143 -1082175 -1094513 -1098369 -1077641
5383a077641K735K390r216j8298m633O979J0412L671j5538R761J3288M378j6403
5370a088115J672R222M368Q996L214j4418p810j1527m477M582j195J7843P312
5357a070333l743J461J448j2044R949J0091R25o663m384o525j3807K931J3634
5344a077060M033J0539Q543j437m55k676j7661L379R616R590j0066n897J0062
$$ plain form
5383 -1077641 -1074906 -1072516 -1081732 -1100030 -1104663 -1097684 -1087272 -1083601 -1099139 -1089378 -1076090 -1071712 -1088115
5370 -1088115 -1086443 -1077221 -1072853 -1063857 -1060643 -1075061 -1082871 -1094398 -1098875 -1094293 -1095488 -1077645 -1070333
5357 -1070333 -1074076 -1072615 -1071167 -1083211 -1073262 -1063171 -1062246 -1068909 -1073293 -1079818 -1093625 -1090694 -1077060
5344 -1077060 -1073027 -1062488 -1053945 -1055382 -1055837 -1058513 -1076174 -1072795 -1063179 -1053589 -1063655 -1069552 -1059490
$$ [...]
##END NTUPLES=NMR SPECTRUM
##END=
